##TITLE=Analysis number 329267
Compound Code cc 62206
Book Reference 518/163
Project Code adrs
Chemist Name colinb
##JCAMPDX= 6.0         $$ Bruker NMR JCAMP-DX V2.0
##DATA TYPE= NMR SPECTRUM
##DATA CLASS= NTUPLES
##ORIGIN= Bruker BioSpin GmbH
##OWNER= nmr
$$ XWIN-NMR		Version 3.5
$$ Wed Aug 15 10:00:55 2007 GMT Daylight Time (UT+1h)  MAYBRIDGE\nmr@NMR_250MHZ
##.OBSERVE FREQUENCY= 250.131544655141
##.OBSERVE NUCLEUS= ^1H
##.ACQUISITION MODE= SIMULTANEOUS (DQD)
##.ACQUISITION SCHEME= undefined
##.AVERAGES= 16
##.DIGITISER RES= 18
##SPECTROMETER/DATA SYSTEM= dpx250
##.PULSE SEQUENCE= zg30
##.SOLVENT NAME= CDCl3
##.SHIFT REFERENCE= (INTERNAL, CDCl3, 0, 16.4475)
##AUDIT TRAIL= $$ (NUMBER, WHEN, WHO, WHERE, WHAT)
$$ ##TITLE= Audit trail, XWIN-NMR		Version 3.5
$$ ##JCAMPDX= 5.01
$$ ##ORIGIN= Bruker BioSpin GmbH
$$ ##OWNER= nmr
$$ C:\u/data/dgb/nmr/ADRS/670/pdata/1/auditp.txt
$$ ##AUDIT TRAIL=  $$ (NUMBER, WHEN, WHO, WHERE, WHAT)
(   1,<2007-08-15 10:00:31.45 +100>,<MAYBRIDGE\nmr>,<NMR_250MHZ>,
      <created by zg, POWCHK disabled, PULCHK disabled
       configuration hash MD5:
       76 6E 9A 78 1E 09 19 81 EC 84 63 8F B0 6A 59 2D
       data hash MD5: 64K
       D8 02 CD 7F 9A 40 75 CC E5 76 04 86 CC 41 A3 9C>)
(   2,<2007-08-15 10:00:44.64 +100>,<MAYBRIDGE\nmr>,<NMR_250MHZ>,
      <Start of raw data processing
       ef LB = 0.3 FT_mod = 6 PKNL = 1 SI = 32K 
       data hash MD5: 32K
       BE 14 14 6D 33 D4 BC 89 B4 DA 93 12 82 C6 F7 52>)
(   3,<2007-08-15 10:00:46.29 +100>,<MAYBRIDGE\nmr>,<NMR_250MHZ>,
      <apk 
       data hash MD5: 32K
       3A 5D 2D DF 2D 20 29 53 55 EC 11 87 20 92 ED A2>)
(   4,<2007-08-15 10:00:47.00 +100>,<MAYBRIDGE\nmr>,<NMR_250MHZ>,
      <abs ABSG = 5 
       data hash MD5: 32K
       F8 0B 23 2A AF 13 04 84 06 B0 D8 5C 26 0D 5F 07>)
$$ ##END=
$$ 
$$ hash MD5
$$ F2 B2 27 71 EA 9D 4F AD 24 8A 74 A9 33 B6 76 21
##$RELAX= 
##$RELAX= 
##$RELAX= 
##$RELAX= 
##$RELAX= 
##$RELAX= 
##$RELAX= 
$$ Bruker specific parameters
$$ --------------------------
##$DU= <C:\u>
##$EXPNO= 670
##$NAME= <ADRS>
##$PROCNO= 1
##$TYPE= <nmr>
##$USER= <dgb>
##$AMP= (0..31)
100 100 100 100 100 100 100 100 100 100 100 100 100 100 100 100 100 100 
100 100 100 100 100 100 100 100 100 100 100 100 100 100 
##$AQSEQ= 0
##$AQ_mod= 3
##$AUNM= <au_zg>
##$AUTOPOS= <5 >
##$BF1= 250.13
##$BF2= 250.13
##$BF3= 250.13
##$BF4= 250.13
##$BF5= 500.13
##$BF6= 500.13
##$BF7= 500.13
##$BF8= 500.13
##$BYTORDA= 1
##$CFDGTYP= 0
##$CFRGTYP= 5
##$CHEMSTR= <none>
##$CNST= (0..31)
1 1 145 1 1 1 1 1 1 1 1 1 1 1 1 1 1 1 1 1 1 1 1 1 1 1 1 1 1 1 1 1 
##$CPDPRG= <>
##$CPDPRG1= <>
##$CPDPRG2= <>
##$CPDPRG3= <>
##$CPDPRG4= <mlev>
##$CPDPRG5= <mlev>
##$CPDPRG6= <mlev>
##$CPDPRG7= <mlev>
##$CPDPRG8= <mlev>
##$CPDPRGB= <>
##$CPDPRGT= <>
##$D= (0..31)
0 1 0 0 0 0 0 0 0 0.06 0 0 0 0 0 0 0.0002 0 0 0 0 0 0 0 0 0 0 0 0 0 0 
0 
##$DATE= 1187168430
##$DBL= (0..7)
120 120 120 120 120 120 120 120 
##$DBP= (0..7)
150 150 150 150 150 150 150 150 
##$DBP07= 0
##$DBPNAM0= <>
##$DBPNAM1= <>
$$ [...]
##$SUBNAM7= <"">
##$SUBNAM8= <"">
##$SUBNAM9= <"">
##$SW= 20.6930455092707
##$SWIBOX= (0..15)
0 0 3 0 0 0 0 0 0 0 0 0 0 0 0 0 
##$SW_h= 5175.983436853
##$TD= 65536
##$TD0= 1
##$TE= 297.16
##$TE2= 300
##$TE3= 300
##$TEG= 300
##$TL= (0..7)
0 120 120 120 120 120 120 120 
##$TP= (0..7)
150 150 150 150 150 150 150 150 
##$TP07= 0
##$TPNAME0= <>
##$TPNAME1= <>
##$TPNAME2= <>
##$TPNAME3= <>
##$TPNAME4= <>
##$TPNAME5= <>
##$TPNAME6= <>
##$TPNAME7= <>
##$TPOAL= (0..7)
0.5 0.5 0.5 0.5 0.5 0.5 0.5 0.5 
##$TPOFFS= (0..7)
0 0 0 0 0 0 0 0 
##$TUNHIN= 0
##$TUNHOUT= 0
##$TUNXOUT= 0
##$USERA1= <user>
##$USERA2= <user>
##$USERA3= <user>
##$USERA4= <user>
##$USERA5= <user>
##$V9= 5
##$VALIST= <valist>
##$VCLIST= <CCCCCCCCCCCCCCC>
##$VD= 0
##$VDLIST= <DDDDDDDDDDDDDDD>
##$VPLIST= <PPPPPPPPPPPPPPP>
##$VTLIST= <TTTTTTTTTTTTTTT>
##$WBST= 1024
##$WBSW= 4
##$XGAIN= (0..3)
0 0 0 0 
##$XL= 0
##$YL= 0
##$YMAX_a= 331261
##$YMIN_a= -375865
##$ZGOPTNS= <>
##$ZL1= 120
##$ZL2= 120
##$ZL3= 120
##$ZL4= 120
##$ABSF1= 16.44751
##$ABSF2= -4.245663
##$ABSG= 5
##$ABSL= 3
##$ALPHA= 0
##$AQORDER= 0
##$ASSFAC= 0
##$ASSFACI= 0
##$ASSFACX= 0
##$ASSWID= 0
##$AUNMP= <proc_1d>
##$AZFE= 0.1
##$AZFW= 0.1
##$BCFW= 0
##$BC_mod= 0
##$BYTORDP= 0
##$COROFFS= 0
##$CY= 12.5
##$DATMOD= 1
##$DC= 0
##$DFILT= <>
##$DTYPP= 0
##$F1P= 14.0000005364418
##$F2P= -0.99999901652339
##$FCOR= 0.5
##$FTSIZE= 32768
##$FT_mod= 6
##$GAMMA= 0
##$GB= 0
##$INTBC= 1
##$INTSCL= 1
##$ISEN= 128
##$LB= 0.3
##$LEV0= 0
##$LPBIN= 0
##$MAXI= 10000
##$MC2= 0
##$MEAN= 0
##$ME_mod= 0
##$MI= 0
##$NCOEF= 0
##$NC_proc= -5
##$NLEV= 6
##$NOISF1= 0
##$NOISF2= 0
##$NSP= 0
##$NTH_PI= 0
##$NZP= 0
##$OFFSET= 16.44751
##$PC= 1
##$PHC0= -46.39082
##$PHC1= 8.658371
##$PH_mod= 1
##$PKNL= yes
##$PPARMOD= 0
##$PSCAL= 4
##$PSIGN= 0
##$REVERSE= no
##$SF= 250.130018630811
##$SI= 32768
##$SIGF1= 0
##$SIGF2= 0
##$SINO= 400
##$SIOLD= 32768
##$SREGLST= <1H.CDCl3>
##$SSB= 0
##$STSI= 32768
##$STSR= 0
##$SW_p= 5175.98343685301
##$SYMM= 0
##$S_DEV= 0
##$TDeff= 65536
##$TDoff= 0
##$TI= <Analysis number 999999
Compound Code 99
Book Reference 9
Project Code 9>
##$TILT= no
##$TM1= 0
##$TM2= 0
##$TOPLEV= 0
##$USERP1= <user>
##$USERP2= <user>
##$USERP3= <user>
##$USERP4= <user>
##$USERP5= <user>
##$WDW= 1
##$XDIM= 32768
##$YMAX_p= 327286798
##$YMIN_p= -509688
$$ End of Bruker specific parameters
$$ ---------------------------------
##NTUPLES= NMR SPECTRUM
##VAR_NAME=  FREQUENCY,     SPECTRUM/REAL,   SPECTRUM/IMAG
##SYMBOL=    X,             R,               I
##VAR_TYPE=  INDEPENDENT,   DEPENDENT,       DEPENDENT
##VAR_FORM=  AFFN,          ASDF,            ASDF
##VAR_DIM=   32768,         32768,           32768
##UNITS=     HZ,            ARBITRARY UNITS, ARBITRARY UNITS
##FACTOR=    0.157963299565203, 1,           1
##FIRST=     4114.01592410623, 0,            0
##LAST=      -1061.96751274678, 0,           0
##MIN=       -1061.96751274678, -509688,     0
##MAX=       4114.01592410623, 327286798,    0
$$ Real data points
##PAGE= N=1
##DATA TABLE= (X++(R..R)), XYDATA
$$ [...]
22093 190083 183660 75256 -14824 -35449 15566 2977 113623 83853 -94278 -141424 -114512
22082 -114512 -80741 -31925 -23551 -161899 -183818 -76097 77844 92966 -22646 -16183 -35042
22071 -35042 -90933 -24739 38301 57103 -5576 -66944 -48978 -10722 18227 18458 75233 139226
22059 139226 68631 85137 116477 7966 -70066 -35829 -30405 -40409 -26376 36655 130057
22048 130057 232550 160324 42677 -63273 -73995 -72685 -81877 -30848 -8461 -33558 -162337
22037 -162337 -83881 -64628 -38433 -69626 -107446 -39739 -12321 -14686 -19817 -125738 -192700 -147461
22025 -147461 -106993 -66652 -41185 -64685 -33407 25284 -105031 -188925 -206448 -261001 -150658
22014 -150658 20573 67732 96466 22649 -36285 -3068 -84402 -173161 -263053 -152246 29684
22003 29684 91109 60610 -36550 -10379 20518 63551 114972 134982 234560 117950 -30782
21992 -30782 13661 1755 -43298 -13789 26431 147202 17618 -80355 -124391 -71557 50444
21981 50444 44810 45469 -53608 -72304 74064 116822 199282 243189 87108 -33979 -61245 62846
21969 62846 120011 94919 181319 70181 -6805 176 -9260 -45549 -29012 29154 37429 63585
21957 63585 -80056 -89956 -143529 -86344 16820 53052 110219 189648 152247 195260 157578
21946 157578 39705 9973 130769 191759 170444 35155 -86708 -138046 -90987 12587
21936 12587 44447 26978 150059 145815 22318 -62479 -81628 91968 63907 -45908 -16510
21925 -16510 -5844 15123 -70500 -174141 -123749 -3525 60382 93352 -34642 -108399 -85165
21914 -85165 -14997 2275 48132 8337 -13192 -9642 -20208 -6856 5734 -6364 35202 129714
21902 129714 44816 -26266 -40146 9801 -11138 -1279 -52129 -105683 62863 76121 -80622
21891 -80622 -146153 -174107 -110966 -154854 -84406 -78629 -84567 -115967 -174443 -119091 31518 108635
21879 108635 96132 104332 196932 198854 139855 125134 -46269 -174564 -201944 -184468 -252519
21868 -252519 -181842 -78056 -45245 44051 58091 88233 -100112 -264928 -273594 -251975 -139393
21857 -139393 -206537 -236655 -73634 -49451 -115702 -71135 -81492 -141460 -253594 -195997 -59985
21846 -59985 -39135 -41474 -16500 62199 40915 55106 16230 -127396 -24282 -19015 -109046 -96482
21834 -96482 -44201 -66194 -140089 -88657 -19744 -49540 -110113 -105402 -70247 -147414 -110172 -14548
21822 -14548 67595 51955 18581 132732 86699 27447 93375 -5081 -115185 21714 139700
21811 139700 114058 -90331 -185262 -205659 -225514 -197855 51792 89174 55660 91509 37959
21800 37959 -61617 -154629 -113351 -37763 -37445 -43773 -52412 -43157 -92622 -35592 126945 218582
21788 218582 184216 140920 159215 177479 163774 66754 28305 125270 115858 62063 56538 93384
21776 93384 74272 -44209 16605 95799 90599 25770 26432 -9185 12237 45901 -118372 -116819
21764 -116819 -71157 -44638 -4927 -27833 16812 7084 -104593 -10891 172349 189022 119270
21753 119270 145523 200279 169192 140574 117514 64568 -23195 -162186 -106624 -31509 2466
21742 2466 46985 46468 65232 161170 198877 128910 110645 158442 124619 -13722 -20262 -107595
21730 -107595 -161604 -165887 -239687 -126069 -84202 -157872 -102731 -62094 -75959 65391 -41509
21719 -41509 -193177 -233522 -140259 -30090 -46564 -178688 -141308 25674 42925 -6120 -92029
21708 -92029 -78732 -128688 -126667 -35620 -43893 -126421 -225597 -169253 -46539 40270 56803 2257
21696 2257 -216986 -189337 -188118 -321126 -297518 -335674 -273726 -239882 -208336 -96276 -37273
21685 -37273 -99325 -187059 -207223 -183771 -149988 -25785 -19162 30503 -63667 -67372 -5157 65189
21673 65189 -8655 -15645 49891 55156 47336 54548 91883 128164 49494 72570 1782 57948
21661 57948 61974 15419 -23931 -62072 -32229 45508 -40434 -97996 20202 37148 -12556 -10572
21649 -10572 -49538 -147652 -198327 -44612 111929 226903 115996 -36180 32679 82935 144331
21638 144331 133909 16900 -51627 61170 104473 20492 -4110 -29438 163643 255607 155584
21627 155584 169847 214963 154511 164710 -5240 -11021 43395 65988 61018 -24025 104966
21616 104966 101371 -470 -31449 -147745 -164187 -101670 -108752 -25208 186754 258294 158644
21605 158644 158817 25805 -97980 -107933 -123328 -20212 33550 -169 22183 206511 186422
21594 186422 26883 20873 -33538 -75851 -52201 -74341 -18556 127487 189902 212701 234127
21583 234127 175273 177308 65752 -64522 -77972 -100675 -42763 43729 -52556 -115454 -58841
21572 -58841 -37762 -24592 32643 31635 87383 75627 108364 110546 -1811 -69824 18082 523
21560 523 26425 16896 -43895 -118837 -91827 -151051 -246686 -218997 -144798 -152608 -90656 -6794
21548 -6794 105008 9957 -18741 24320 28387 10812 -18878 -36791 -82062 13406 98643 48022
21536 48022 -21374 10558 -85885 -9169 -47285 -57127 83333 101337 123738 60719 50950 148634
21524 148634 12859 -33897 -18987 32185 41754 8424 -45105 54479 152963 110825 55819
21513 55819 -8293 26380 84656 56566 4208 -106657 -72646 112374 193028 142111 78852
21502 78852 69625 25451 19912 99872 95495 65215 43491 -5610 17612 -69216 -54834 -51870
21490 -51870 -94998 -129882 -35255 -50063 -35680 32992 38919 -55529 -133445 -33266 82176
21479 82176 -27788 -71694 86678 228365 365073 273386 130055 -45872 -122587 -114645 -183723
21468 -183723 -198720 -112760 23641 112679 155402 218432 232853 236036 196477 162028 229428
21457 229428 171176 144172 56086 10576 -4144 3388 53602 58401 56084 180444 160937 128160
21445 128160 16520 -99962 -130080 -76486 -58760 -86682 -167144 -132347 -175666 -136007 36184
21434 36184 37585 -81179 -156570 -189852 -246750 -81813 -31192 -6249 72412 31584 -14711
21423 -14711 7701 39317 10066 88590 154461 89011 79985 60122 132826 148694 267225 86784
21411 86784 60566 145834 146501 140472 76467 74469 159307 214732 253889 204141 5065 -73919
21399 -73919 -22042 -90886 -105138 14817 31486 25181 11944 21469 -55151 -75921 -28774 28544
21387 28544 50616 235633 359573 352368 413099 258666 253585 363689 286565 146679 59339
21376 59339 62301 -64796 -168010 -118819 -36209 20267 -107555 -49229 -65078 -17158 76210
21365 76210 -27661 -183753 -223112 -138550 -32182 -58726 -72250 -23036 60046 3728 61805
21354 61805 55038 23923 -6 -91625 -114305 -78644 -84415 -25191 9449 123553 290269 289671
21342 289671 141896 133039 34783 55417 71469 49573 80324 111512 -26074 60224 224803
21331 224803 136644 -2665 59148 51083 -64095 -43860 -117828 -109763 -123269 -211312 -175037
21320 -175037 -124466 -100929 -91804 -135100 -49043 27512 24712 122105 8362 -128746 -131218 -28118
21308 -28118 16421 -119574 -106619 -139048 -185480 -238528 -111854 -21537 -33139 -59995 -47087
21297 -47087 -75777 -168181 -147971 -71471 -142899 -52576 11258 159275 184266 173287 43793
21286 43793 -51911 -48539 25461 67017 52208 -109414 -193604 -189589 -193695 -136197 -83633 -14687
21274 -14687 -69047 -125867 -163288 -74414 43684 88002 10911 -2273 -46673 -119198 -73591
21263 -73591 -37957 -83174 -75963 56566 113474 71551 -6302 -30863 -1665 66145 56819 103818
21251 103818 99953 19498 27333 6095 43669 101996 159788 8104 -109602 -115444 -30725 -57153
21239 -57153 -18284 -86116 -113110 -101915 -97588 -45433 -15934 -42624 24068 -30529 -80828 -74206
21227 -74206 -52935 -50814 1564 -50649 -4700 -2059 85691 -20988 -44249 -111113 -207336 -199341
21215 -199341 -154383 -115025 -66942 5348 27840 75788 20719 -165657 -251468 -169843 -85585
21204 -85585 -51851 4880 -91389 -23052 5071 -128974 -163903 -150026 -85302 -20507 -69939
21193 -69939 -160760 -175177 -68163 3419 25643 54550 -118274 -248276 -214430 -80776 -95591
21182 -95591 -118950 -126727 -80635 -22724 13737 90509 26483 -35385 74269 231389 165696
21171 165696 58608 62424 4827 -65530 22370 83377 79862 138466 193256 187724 187530 143117
21159 143117 44578 -6276 -4369 6524 -7981 -142194 -70232 -109414 -229742 -319131 -265466
21148 -265466 -85150 -44878 -113705 -5253 25745 117499 76535 15690 -85432 -102757 -16370
21137 -16370 96239 161231 117659 -65523 -129242 -41711 -67795 -130894 -21860 -41663 -68106
21126 -68106 39014 87303 58435 50599 -24922 -24465 50894 21215 16757 70219 -16886 -80437
21114 -80437 -78276 -94350 -77626 -67663 -42732 88134 66595 -25118 10090 58182 116983 149162
21102 149162 45825 61203 46580 -186855 -294606 -175963 -129141 -16350 -114618 -236482
21092 -236482 -128628 -43720 -95280 -87688 5051 175180 282389 218773 135141 111105 91513
21081 91513 -39507 35891 199531 99514 -25528 37972 10945 12099 53773 148707 151356
21070 151356 93099 43814 -22827 -18173 118416 36950 47257 91034 -37064 -69442 3245
21059 3245 102883 21810 54313 150549 214413 142519 45906 50866 15877 -65155 117 92655
21047 92655 27213 -105199 -113465 -54520 39529 63379 134715 153172 209218 272771 174952 62011
21035 62011 139193 268517 248411 146842 -23456 -19103 30995 89422 71382 50723 -23151
21024 -23151 10892 -34265 -38132 20249 27536 84704 45606 -1786 164601 160245 144785 221195
21012 221195 203646 110304 40633 -50815 -31422 -28812 -63715 3731 -72669 -126808 -49862 78427
21000 78427 86100 1944 -125507 -7538 -147627 -251003 -231775 -152374 -101050 -124763 -205383
20989 -205383 -171861 -74479 60816 137576 62488 89413 106997 40455 -128788 -124103 -103159
20978 -103159 -134711 -191227 -260638 -177125 -178487 -122032 -102818 -35672 -14879 -12041 -84351 -67877
20966 -67877 -52359 -9661 -97818 -152383 -96013 -108169 -121789 -135235 -89135 -40092 -38053 -50776
20954 -50776 -53869 26227 81038 156489 137588 96645 154088 113586 -5678 -39567 -39669 13812
20942 13812 47651 -50961 -28528 -20328 -45234 30089 -7904 -31233 31002 -2223 -64558 -35718
20930 -35718 -28281 71847 114685 95117 46968 -55767 -105579 -15397 161410 132295 61754
20919 61754 -3459 -146190 -150958 -55019 -15049 -38372 -34776 132736 187098 163381 119249 57286
20907 57286 43473 -4600 -34189 -7534 -98028 -175460 -60055 29853 6650 -27723 541
20896 541 61365 132564 208197 227589 260759 154561 32848 19911 59054 115402 73070 55139
20884 55139 99515 100973 63414 12301 -22312 -3902 -23908 -9043 17079 -7089 -29465 -120095
20872 -120095 -62196 -43793 -55052 13849 51338 -88679 -144530 -76480 76461 64968 98343
20861 98343 78546 93469 121564 141202 -36886 -126316 -122759 -76472 12571 44006 -120310
20850 -120310 -70906 -112746 -94506 -115466 -40059 91017 113703 -14545 -56468 -177229 -165528
20839 -165528 -34830 52950 43390 -135120 -194353 -188754 -189729 -224443 -276583 -144206 -77261 -65634
20827 -65634 25339 73383 278009 230748 34339 -90794 -86157 -181619 -202793 -156239 -86110
20816 -86110 -63472 8873 71763 -49703 -73330 39789 10022 -7050 -86648 -73020 -13610
20805 -13610 -39140 -44234 -18223 26817 -9572 -78379 -72527 -59214 -112572 -71023 -51081 42819
20793 42819 120765 103818 23664 -139954 -247737 -164713 -134184 -248091 -319632 -290984 -282129
20782 -282129 -94412 84976 35397 -18719 -62059 -41220 -26511 -38975 -117327 7907 156747
20771 156747 168598 37228 22827 85563 178542 202233 81300 72298 53134 -40420 -42434
20760 -42434 61721 61862 64629 -14081 -23622 -48625 -94903 -17098 -75010 -31084 -8410 -69556
20748 -69556 -120837 -119830 -39144 29345 -18933 -23784 33496 -44207 -195799 -134590 -58676 -31485
20736 -31485 50258 40467 43787 -49946 -134246 -181144 -116802 -115577 -38105 -21177 -125333 -126046
20724 -126046 -202568 -129143 -243206 -309390 -172703 -61729 -67949 -85204 -23650 -77495 -166946
20713 -166946 -180376 -248499 -312327 -191981 -132541 -113054 -64904 -4292 84943 5130 39934
20702 39934 -35672 7871 99295 173783 325026 326679 191521 69614 -57303 -115526 -181179
20691 -181179 -152066 -127854 -190921 -230652 -67092 -35392 -97496 -151552 -160545 -134799 -121927
20680 -121927 -56948 31264 16638 -13098 53586 121309 100703 94723 24172 27705 -92696 -237590
20668 -237590 -88037 4484 -58688 -138669 -157220 -99882 -122199 -95971 -63444 -23246 17040
20657 17040 47060 126655 39516 13059 34488 25206 5275 -9686 -38949 -61862 -153955 -82667
20645 -82667 -121658 -177275 -255776 -276659 -286456 -283662 -255158 -235848 -222324 -158621 -204205 -101111
20633 -101111 -6739 65992 48335 -79485 -137895 -232824 -153095 -167913 -140923 -130714 -123299
20622 -123299 7468 101719 77975 52398 49243 131826 92790 -2195 -217843 -213375 -143133
20611 -143133 -147903 -158509 -105623 -41261 26476 179973 305200 203318 123162 104185 130272
20600 130272 97030 151656 67411 -104260 -101401 -110562 -86711 955 62530 -35800 -67510 -20516
20588 -20516 -35024 -120942 -100577 -71705 -73727 -107496 -150165 -154750 -86924 -26927 -32553 38050
20576 38050 22581 19004 -39558 -62297 -7052 -125370 -217765 -76860 53577 -12371 -1335
20565 -1335 -17760 -65413 -69517 -94444 -51811 -59523 60176 106183 173059 168475 91706 114476
20553 114476 225839 231658 117402 -73051 -76077 -112823 -109510 -110256 -62773 -51957 2559 -3951
20541 -3951 -6969 11568 -18769 -86733 -105610 -130501 -247284 -207494 -245053 -201020 -137688 -174333
20529 -174333 -190423 -37814 -21217 -120875 -211337 -245059 -206742 -59588 -5946 28364 48418
20518 48418 129203 204141 214065 50779 -85070 -154513 -196598 -80964 -18148 -51736 -55738
20507 -55738 -35738 103960 40039 96368 199589 98858 -24536 -50340 -48307 -36240 15586
20496 15586 79073 111211 -71601 -21763 -6860 -14253 -3694 -98360 -3254 -18924 68204 37937
20484 37937 -99507 -179059 -134485 -85738 -137873 -43348 -29279 -14691 55811 26332 78219
20473 78219 101868 48688 105860 6433 -54220 27942 52305 134335 146598 27050 32647 139974
20461 139974 199120 175743 37860 -79894 8210 -50779 -86914 -14817 -3977 -13084 -120047
20450 -120047 -177365 -236742 -203648 -111952 -193361 -98324 -96514 -136616 -217595 -170870 -103419 -57357
20438 -57357 -30903 -49574 -45111 -81909 -16611 -51281 -94530 -104270 -39504 99386 73010 75851
20426 75851 -105332 -145633 -68970 -96471 -13356 -67258 -127999 -163668 -45937 -91937 -184657
20415 -184657 -113277 -108284 -49460 -98395 -198699 -147476 -132450 -189716 -223042 -225480 -136255 -155661
20403 -155661 -23487 -24356 -6763 70452 35856 -75975 -101029 -95047 -118433 -146503 -109278 -156006
20391 -156006 -72332 29680 31475 45353 57247 15513 84352 164435 37040 -88369 -82304
20380 -82304 35403 150632 142021 71110 -46496 -109 40615 64788 47082 77563 24793
20369 24793 -91191 -47078 -42039 -41009 75165 92765 198372 177294 58961 -35545 -80380
20358 -80380 -63251 -22126 -23711 35385 168169 200804 342 -9578 -31894 -63463 -29477 -21813
20346 -21813 17908 -82056 -196838 -284810 -349576 -290638 -217337 -148707 -163711 -47703 4083
20335 4083 -74998 -1876 -26484 -110570 -51244 92216 197859 153763 135739 48008 -97642
20324 -97642 -117393 19794 68952 -19955 10374 2356 -58851 -82412 -76152 -2056 -84144 -145873
20312 -145873 -243988 -285273 -234270 -214203 -287186 -97801 58869 43285 2627 1710 5748 -200134
20300 -200134 -213410 -135960 -135875 -124271 -77783 -85376 -27143 -47116 -141497 -31723 158943 163064
20288 163064 109395 -90618 -156816 -117876 12878 50982 54790 42138 50884 -117144 -139147
20277 -139147 -142862 -132618 -193658 -164988 -71934 -20937 -47073 -48738 -23290 -34990 -51623 -65493
20265 -65493 -88370 -50231 41870 3411 -64795 13638 -68234 -176149 -253635 -296221 -191490
20254 -191490 -40814 80488 135541 84407 143595 112987 26837 -47612 -83597 -91076 -126665
20243 -126665 -155619 -74858 -36635 -27304 -34461 -101295 -118903 -12064 127195 120955 -2809
20232 -2809 -29525 -126341 -151559 -174934 -96153 -153129 -150491 -102838 83581 60376 18935 -94986
20220 -94986 -122183 -127781 -135322 -99363 -39343 74273 166645 256393 308685 239032 226813 142912
20208 142912 -78603 -33439 -7586 -43663 23465 106910 13149 -33007 -21170 104753 71773
20197 71773 -43122 -118912 -132373 -131004 -185027 -150999 -261802 -240146 -24873 33794 -45964
20186 -45964 -54062 -99512 -192034 -150081 -68562 -100325 -70129 -160225 -106739 7805 -5501 23470
20174 23470 94794 93641 57275 -47051 -105659 -128159 -243776 -258627 -186740 -202305 -179816
20163 -179816 -20910 92183 150224 110369 9816 -63107 -26224 20000 -64234 -47755 -71211
20152 -71211 -118079 -181028 -203377 -156418 -134713 -222465 -278463 -179445 -46927 65227 -67403
20141 -67403 -131043 -207460 -223605 -117243 -78388 -75150 -31589 -59916 1156 -433 -4881 13359
20129 13359 -54501 -81826 618 -2586 -29140 8283 42576 97692 160582 129788 88132 -16361
20117 -16361 3369 84656 123219 59810 -77475 29725 9973 24660 -31694 33192 -62614
20106 -62614 -140462 -116512 32148 84460 180883 213219 161937 13578 -293 12522 -75552
20095 -75552 -93484 -132380 -34962 34074 -74157 -69648 -118494 -100512 32859 16809 -90489
20084 -90489 -98336 -147765 -212856 -180365 -79714 -34755 11997 39228 151624 184823 180075 126613
20072 126613 41824 -46661 -18956 15757 -58779 -94842 -83292 39767 78577 108030 -23452
20061 -23452 -61555 -70333 -234042 -182029 -82864 -53050 -21804 14982 -29405 -94529 -154964 -226160
20049 -226160 -197639 -166670 -120260 -169582 -230688 -176137 -127572 -101186 -1900 -68637 740
20038 740 44874 81722 126747 125852 139230 -8348 -188031 -177161 -117099 -128436 -189059 -279309
20026 -279309 -353590 -394573 -376532 -302518 -265150 -249546 -162778 -122899 -190621 -169049 -194898
20015 -194898 -193938 -36833 -17403 55782 207764 410929 436508 330993 93477 -49272 -211908
20004 -211908 -308434 -272174 -268598 -224150 -181003 -44906 101432 81642 22921 -17252 -96512
19993 -96512 -256718 -347758 -290191 -255963 -200625 -103243 -165960 -138034 -129183 -77796 16000 39152
19981 39152 77245 58163 5432 -55668 -61780 -89852 -77608 35914 59028 165546 173953 204123
19969 204123 170465 214315 204878 90728 40472 93316 73754 -15880 -133070 -169336 -120426
19958 -120426 -108610 -71010 -111035 -124091 -139246 -251604 -166875 -200800 -287758 -186919 -156776
19947 -156776 -45482 22528 -138200 -179483 -82783 27639 8097 55109 68865 -43333 12591
19936 12591 35444 33215 -47497 -106225 -5621 77491 93491 -5709 5927 29715 47031 37412
19924 37412 60845 150899 236736 274219 261763 70344 21371 8144 -69938 -35055 -1854
19913 -1854 -43491 -18223 23948 49114 -56001 -41960 -15414 34182 -13708 -23665 20142 -51996
19901 -51996 -133460 -145827 -83363 -5771 46295 56811 54112 -52999 -119496 -100460 -28001 -61058
19889 -61058 -115960 -91379 -71117 -66092 15980 -45163 -24330 9234 66087 -49558 -49911 53032
19877 53032 28446 110611 90637 -38250 -106297 -42889 64956 33922 -40138 -56734 -68347
19866 -68347 -132930 -241246 -247100 -239251 -141708 -136289 -104557 -72336 11520 3102 -26764 -69802
19854 -69802 -88351 -157663 -115597 -57174 -56657 -69950 -43930 9503 116648 230839 146479 -8297
19842 -8297 -169746 -284815 -371319 -238941 -157291 -91988 -33698 -23210 -88407 -140686 -100654
19831 -100654 -50448 65481 124611 39626 -99687 -115784 -128917 -118696 -11330 18168 -28092
19820 -28092 -41583 5576 64283 179680 213887 67083 36545 -29119 38695 119383 87120
19809 87120 -15445 68278 68071 104274 131822 81584 62125 19572 -1410 -62975 -52954 -15537
19797 -15537 -3729 -106545 -136869 -101256 -60207 -53645 -17558 32440 -134 -60849 -144595 -342699
19785 -342699 -316321 -255819 -229010 -171871 -212002 -289217 -194470 -150251 -159785 -46136 45665
19774 45665 117719 64404 85427 85615 68201 222692 237696 149854 78724 11377 26483 -61845
19762 -61845 -100414 -119098 -1168 104443 85852 52430 169309 90734 -20026 31806 61762
19751 61762 71808 8248 53703 86928 -4904 -39638 39252 121687 47072 -87028 -153314
19740 -153314 -179396 -105518 -8348 63230 161123 214107 191953 214865 240241 269849 202709
19729 202709 106298 71982 139817 37807 -99526 -30472 -7779 -108945 -73065 -95815 -65136
19718 -65136 -24044 -22818 -7689 20602 -36208 -70761 32387 -10708 40206 115980 228445
19707 228445 59912 -90009 -160095 -103010 4530 -2970 26584 44819 -8946 -160699 -128912
19696 -128912 -73259 -96347 18298 37138 -96588 -165143 -160034 -92073 -31915 -65313 -77018
19685 -77018 13989 85346 104984 94055 49019 77990 13432 -34516 -49847 -145366 -93657 94777
19673 94777 142113 94878 -31355 -92532 -93742 -169955 -156707 -175063 -245455 -231369 -176241 -68492
19661 -68492 -100999 -147419 -96200 -123686 -145682 -40129 103012 113731 52640 -25751 -5784
19650 -5784 -22719 -96200 -85522 -196017 -161746 -79548 -95187 -106507 -153871 -115644 10550
19639 10550 -48817 -82346 -26857 98 134119 229268 170705 61175 -80059 -86609 -34507
19628 -34507 15474 47141 142366 206846 113861 41287 13376 -15786 16799 41860 104696 44167
19616 44167 -27287 -79902 -153890 -80449 -14801 -21985 -42530 4662 -47406 -61004 -11252 67028
19604 67028 37798 13369 3007 -5138 -73007 -100816 -191321 -213895 -95136 -72135 -94131 -68631
19592 -68631 -83199 -97352 44414 118130 66975 147867 248405 155675 65109 33950 22919
19581 22919 -41344 39327 1517 -102003 -163769 -138321 -67206 -53496 -61409 -174602 -201556
19570 -201556 -173360 40437 138103 86743 -8423 17617 43882 28078 -86584 -124751 -186778
19559 -186778 -261724 -306744 -319242 -227379 -139955 -122339 -94939 -12287 25313 -93043 -113442
19548 -113442 -12511 -83854 -117065 -54404 3107 -84656 -35599 3349 52611 -20781 -94466
19537 -94466 -46093 -32763 -46309 -58201 -33689 22601 4835 -85235 -90311 26300 30961 61347
19525 61347 27768 -21581 3516 1956 28050 9234 -25722 56452 54357 48247 -6883 -20596
19513 -20596 -177325 -205599 -116576 -118072 -40329 2512 -45035 77302 196347 106083 25566
19502 25566 78631 110686 138337 48989 -29413 -132154 -124345 -162538 -107477 -169230 -173449 -109368
19490 -109368 -16322 -41744 60642 239822 84654 -77342 -104137 -91435 -67344 41041
19480 41041 33163 -79812 -162782 -153650 -75592 -34430 -68559 -250036 -207093 -16873 85915
19469 85915 192421 98302 -60515 -76914 -77530 -159223 -210777 -330337 -301998 -195234 -78418
19458 -78418 -110592 -164217 -168958 -141919 -79728 -53382 5264 34305 36775 -16349 -48001 -97203
19446 -97203 -170938 -124318 8168 -90536 -178472 -225545 -236902 -231992 -33334 20347 61645
19435 61645 48713 40341 -34616 -35026 -19823 -33914 -15964 -12545 -87993 -134504 -20853 73585
19423 73585 78789 75480 57568 36272 -102900 -15207 4816 -43662 -143353 -125455 -104139 35701
19411 35701 55920 28782 133460 51299 -35465 211 43986 -48061 -90701 -51075 -38603
19400 -38603 11070 -19426 45479 -20051 -87182 -56840 37649 114978 300693 277633 208657
19389 208657 247068 302399 181936 65490 8979 -57240 -56051 120491 192734 223582 192494
19378 192494 138302 -23456 -14963 103467 92419 26948 84168 51024 -1446 -22619 5300
19367 5300 99329 178546 136673 67738 -22407 -31889 -141395 -271252 -254246 -298137 -308676 -199924
19355 -199924 -61217 26693 101648 -28512 -68063 44592 136772 31141 -101236 -10218
19345 -10218 5051 -3279 -5029 -11752 -52627 25934 -3812 77771 109360 119845 69403 39154
19333 39154 71158 11828 6693 65637 -61315 -121529 -79338 -55138 -119045 -45128 6675 -17852
19321 -17852 -124202 -117974 -85897 24157 42330 69231 66265 61497 51791 178333 195614 88692
19309 88692 -102110 -227627 -293695 -243026 -170662 -128660 -133733 -7507 -24910 -56681 54087
19298 54087 66625 -70214 -119656 -52140 36039 49093 92651 187298 87981 -10489 19796
19287 19796 -98938 -253269 -127738 -73918 -10654 21707 -42200 -57409 -98412 -105031 -18666
19276 -18666 106109 95569 -13504 -31478 52716 27202 3942 4280 4606 46972 138316 58202
19264 58202 26499 -42035 -55661 -80071 -28596 94343 206654 154470 16486 -5688 -4274
19253 -4274 -42330 -54481 -68108 -91869 -99804 -79537 -95826 -148913 -31618 46466 -15459 -23092
19241 -23092 -67159 -45845 24889 113822 3761 56038 80743 15367 53719 21756 41063
19230 41063 114885 30726 -53652 -31085 24553 -38719 21234 47581 53877 -29646 -143350 -101441
19218 -101441 -193254 -99363 -56177 -21499 -131508 -230338 -142944 -10319 -23378 17550 8360
19207 8360 -71936 -61944 -118622 -192246 -199874 -176379 -98930 -83082 -76815 -58570 -102905 -171326
19195 -171326 -172524 -131501 -123560 -182730 -57217 93719 152410 34735 3334 -58993 -25139
19184 -25139 -73764 3090 113 39362 32651 7105 -156198 -157764 -80486 -113972 -103220 22477
19172 22477 16853 -55758 -58167 -23868 -70567 -103282 -206566 -231432 -197745 -289954 -260195 -280659
19160 -280659 -201065 -97925 -1058 89189 197421 110353 121577 86442 12338 65294 134469
19149 134469 69492 21717 -39614 -67111 44849 10991 35985 7848 -84048 -141564 -156422
19138 -156422 -150366 -182071 -181388 -155363 -198784 -92871 -139638 -171520 -95669 -20134 140666 217514
19126 217514 116926 -17929 -90662 -82158 -33125 66341 -4878 -97772 6613 51666 71707
19115 71707 46580 100443 178536 172298 161383 263545 234105 173645 98340 58716 86230 -66353
19103 -66353 -39981 40509 14291 57083 -38555 -74377 62904 113570 210470 209706 183143 125735
19091 125735 51468 -25027 -58915 -60683 -86628 -2218 57591 105470 107604 91339 5219 -909
19079 -909 41091 61973 -3925 -118635 -178036 -137084 -182054 -145010 -136791 -82013 -89936 -1912
19067 -1912 42435 38216 25809 18643 8151 -54155 33790 149517 127182 -40863 -33768 -5188
19055 -5188 8442 63799 -65789 -60060 -79555 -54693 3394 30107 -44760 -31458 -8752 -22452
19043 -22452 -91445 -114404 -101889 -103025 -133296 -96166 -34019 -3419 27507 91856 32228 73607
19031 73607 116789 94469 72504 -13920 -19649 -59895 -133336 -43686 -29868 -10065 -45129 -85095
19019 -85095 -59507 -10807 -7401 -39037 -80234 -58397 25236 49328 33578 92723 37533 -17799
19007 -17799 -62648 86515 161785 123419 87346 38365 63152 89933 92602 -20368 -52571
18996 -52571 -86060 13034 139460 124748 64491 -44901 -18845 104488 98080 -5487 40753
18985 40753 -92348 -22230 -25086 -138012 -100037 -31295 -101594 -177473 -150408 -128709 -83836
18974 -83836 -15507 -51879 -124684 -69457 -35726 -4259 7659 61679 102951 112440 64831 97692
18962 97692 105113 7878 -571 52934 84097 85664 49772 -14498 -84133 -55306 47724 -45051
18950 -45051 -112702 -160691 -150895 -88740 2239 26933 -934 -34274 -165625 -190980 -185086 -197827
18938 -197827 -106898 -38991 -66646 -100869 -113374 -47426 -56878 -114290 -128773 -199100 -214759 -179953
18926 -179953 -75789 -72565 -34862 -75942 -56581 -111176 -131880 -179783 -119651 -90844 -89951 -59872
18914 -59872 -160093 -233160 -176646 -119534 -143 54820 8219 -9354 -76523 12948 7099
18903 7099 -50725 -40334 -30280 -55321 -38802 43498 66352 56983 114457 93072 69113 11118
18891 11118 -33290 -66015 -56490 26921 90818 -3953 -125339 -171918 -150850 -93355 -42789 24044
18879 24044 -23403 -108831 -126781 -42847 -20049 -44184 -120674 -70253 -46330 -758 -1270 -60796
18867 -60796 -122756 -139180 -104196 -77994 -110860 -90578 -151585 -107170 18652 -21460 -90271
18856 -90271 -247347 -147053 -139893 -66118 -55950 -161611 -216864 -81901 20400 33580 -11720
18845 -11720 -91575 -104036 -176916 -153468 -196811 -189119 -91059 -35697 25268 48087 -100293 -133364
18833 -133364 -111643 -48716 25094 2522 -72262 -162180 -89229 -128255 -196152 -178868 -14062
18822 -14062 39787 58471 -147050 -233424 -92677 -25764 -6263 -12636 -7768 -145621 -153803 -51868
18810 -51868 18893 133426 190888 162267 -86361 -213959 -165040 8594 66143 -72325 -148311
18799 -148311 28938 55511 -43476 -144725 -304541 -292590 -230620 -195694 -239649 -116706 -59566
18788 -59566 -37293 2715 -29073 -56598 -61968 -45925 -1137 -71265 -171956 -222626 -80126
18777 -80126 -38027 -186153 -214204 -50125 -26202 -23744 45276 88779 139393 427753 859647
18766 859647 1439734 1536644 910373 353179 84391 67707 -34417 -111541 -228663 -187418
18756 -187418 -109999 -121934 -112708 -21699 57350 77618 25060 -41637 -109027 -67106 -30612 -133039
18744 -133039 -191419 -134610 -17072 -14418 -87670 -125733 -141232 -83557 -44636 4276 -44393
18733 -44393 -46529 -38950 -4904 13214 -73815 -179993 -80514 -42510 34302 124658 207749 296156
18721 296156 373725 588621 1048660 1141589 787452 480392 365524 492879 545801 676808
18711 676808 972638 1036846 731147 420046 165149 210947 232298 183216 129587 128358 193668
18700 193668 161521 142027 212655 242189 125688 142989 165310 277391 367136 359173 350694
18689 350694 475615 753671 1077982 1147543 928968 689547 502695 387185 401807 703613
18679 703613 1034882 1129486 834652 528064 253725 192206 236730 255628 146749 111731
18669 111731 15244 58627 140232 117945 47633 66869 51778 39836 32643 -109790 -158581
18658 -158581 -63588 35385 42152 73656 112887 86322 101811 55468 9485 -51885 -153596
18647 -153596 -195262 -183530 -134200 -160455 -145631 -153831 -139178 -88992 -88114 -102915 -194397 -190806
18635 -190806 -189823 -238964 -144368 -22563 1730 -161482 -279815 -279472 -284693 -121442 -45978 -164828
18623 -164828 -134365 -52366 -112613 -153309 -160907 -117126 -65543 -64104 -53805 4175 79264 24390
18611 24390 95466 -38649 -156587 -88783 -44616 -77936 -81483 24189 188281 234048 207168
18600 207168 149088 58755 34456 108836 75692 22260 16546 -3126 -62991 26774 3399 -72798
18588 -72798 -64953 141630 147315 13485 -5071 75187 112520 24223 -20370 137439 113358
18577 113358 142003 157318 140092 191214 116358 2294 -28200 -195860 -349807 -329236 -160599
18566 -160599 -35613 -42864 -194040 -149412 -82445 -134832 -198617 -211151 -62611 -93174 -93456
18555 -93456 -11539 -106148 -148141 -206957 -185771 -128635 -91382 148220 269661 176550 106936
18544 106936 94132 -29442 -95871 2678 70574 230859 236879 50052 -128361 -179160 -209745
18533 -209745 -210032 -69073 51313 161101 116356 148354 188108 151749 201586 136590 94340
18522 94340 29743 58175 -49191 -148175 -134438 -116632 -115846 -40495 -33920 -195125 -288088 -139668
18510 -139668 -16094 -38647 -127912 -171827 -157050 -143760 -67096 56629 80061 28164 -84374
18499 -84374 -64493 4061 -36948 -57287 -168489 -183900 -30779 595 -42574 -152111 -170148
18488 -170148 -185404 -189238 -103669 -23378 50205 103096 3904 -118077 -169772 -167580 -126727 -179213
18476 -179213 -198892 -207520 -254017 -293133 -311513 -113361 -7785 3417 -21135 36361 140158
18465 140158 172695 165871 184140 194104 154509 89512 89022 56259 -101841 -80827 -86149 -121126
18453 -121126 -145557 -43833 77656 109463 -21030 -151430 -102751 -78277 -125080 -75547 17996
18442 17996 115487 -14307 -94726 1123 114369 175828 147952 72906 49984 5060 27416
18431 27416 62411 80230 -24139 -116119 -66075 -43787 -66432 -72680 -7960 14171 88379 65707
18419 65707 63649 64795 51836 100388 90839 -78805 -112657 -52295 -83843 -106682 -25173 38792
18407 38792 67318 51190 -11412 45811 74514 84072 153495 182676 293481 384738 349614 237255
18395 237255 197475 241850 241934 315997 272537 308176 194816 18999 36191 -8127 9369 82641
18383 82641 86659 76595 -18390 -15284 -73960 -193421 -301103 -250638 -116735 -101349 -185967
18372 -185967 -153112 43323 211547 255542 285127 230240 184589 118566 94491 123904 92054
18361 92054 63964 80465 73551 173603 138060 44136 47785 103895 248886 374424 446548
18350 446548 315572 265009 230727 223251 138016 53797 107998 162255 212400 159271 88361
18339 88361 156310 -59272 -298854 -335187 -274775 -212364 -67506 -25514 -38827 23755 98354
18328 98354 123073 63519 -5376 23693 164420 194718 105166 5931 -47720 -64138 -8781
18317 -8781 -13495 78132 124223 120683 52006 -35502 -46523 -63243 -53508 -48647 1783 42013 170801
18304 170801 304102 289298 180798 205435 336322 557571 728482 1098040 1866325 2210549
18294 2210549 1792602 1492045 1555674 1367225 1005151 773692 782604 655913 669225 1008907
18284 1008907 1187051 952296 660081 558393 766843 954750 1297182 2016317 2519791
18275 2519791 1951720 1273238 920414 747233 746602 981905 1220136 1212568 1240603 1309575 1757486
18264 1757486 2525131 3101874 2893275 2436328 1841897 1241951 823108 627687 424647
18255 424647 125007 116052 200872 264319 407337 640122 877743 1066481 1398196 1946495
18245 1946495 2858683 3363544 2665578 1719288 1121659 721403 469687 381865 364838 285969
18235 285969 376125 449993 466956 414942 274479 233919 235915 349427 447928 415883 524671
18224 524671 755821 962883 881696 768115 598373 421853 380089 467444 581767 799484
18214 799484 1149639 1474116 1260568 835292 551725 390993 302967 325495 329897 324238 343563
18203 343563 320281 385297 435620 365562 357567 351746 461748 493767 528211 702164 876411
18192 876411 1170051 1648255 1787909 1422099 1178301 1019782 903327 729998 580940 493792
18182 493792 519532 513846 580886 545060 480691 432596 469479 574515 600809 714429 825073
18171 825073 895240 950234 1001896 1109159 1204878 1264794 1327488 1522330 1790756 1968688 2003351
18160 2003351 1809351 1704005 1674750 1762275 1914410 2088371 2359761 2540290 2441848 2457426
18150 2457426 2816217 3353289 3825093 3902599 4077088 4372160 5033251 6068413 7474769
18141 7474769 9382455 11724170 14271672 18072267 25070689 37403978 59755755 101594244
18133 101594244 162760866 183474044 134987121 88752811 67201087 61999495 69918132
18126 69918132 96723025 150178432 199996294 170068508 106413242 67002004 47065367
18119 47065367 36725935 31653686 29349818 28303575 28872697 31519412 37238749 48247776
18111 48247776 69263537 109967980 188549716 303811171 327286798 225649614 147527297
18104 147527297 119544762 126817943 168680701 225911011 217994300 153309870 105768951
18097 105768951 84994753 82118973 95656612 132896389 197053065 229823840 173665758
18090 173665758 106327064 67763569 47258822 35220167 27765122 22695858 18862370
18083 18862370 15615325 13091303 11393488 10404088 9924929 9986539 10088459 10175657 10321980
18074 10321980 10428996 10504614 10137027 8905303 7402668 6204379 5493384 5206622 5339162
18065 5339162 5869172 7021577 7422134 6260827 4870766 4040040 3496654 3194251 3087762
18056 3087762 3029902 3218371 3616367 3845942 3342387 2795898 2311529 2102728 2058440 2132769
18046 2132769 2479113 3167150 3641603 3093645 2529450 2274832 2110900 2119188 2329353 2351743
18036 2351743 2106814 1922625 1673738 1350718 1119608 1142988 1149306 1163290 1069796 1022293
18026 1022293 1089153 1059350 1025537 1041709 1003589 1061539 1072357 931232 780817 791388 901709
18015 901709 880390 856184 787118 762028 784329 707443 725525 919028 1098895 1139689 1071645
18004 1071645 1052742 1101535 1128962 1213959 1359711 1511206 1455554 1339102 1259285 1133244
17994 1133244 1023255 1018867 1114268 1186201 1131889 1010170 960213 980842 917201 1023074 1111918
17983 1111918 1002653 976931 952090 926794 935896 892510 709693 710406 790398 786833 775747 757448
17971 757448 759903 758529 756192 614802 579639 663165 763315 727289 653920 628303 660681 777197
17959 777197 799066 652837 612581 599821 629991 747209 736533 624977 750249 861206
17949 861206 1241389 1288509 1101401 942184 730564 645372 789859 895974 769083 732295
17939 732295 725443 766529 684368 634947 668012 692620 674896 577430 575768 571453 433909 337851
17927 337851 365890 549933 637788 566895 552829 421324 407340 321679 299345 303908 248099
17916 248099 203210 325766 357018 469827 606127 712001 1019609 1651410 2558019 2907255
17906 2907255 2139448 1370568 969265 837105 975817 1263518 1736803 2379443 2740660
17897 2740660 2124301 1267600 871144 812130 520710 405365 418573 413354 262705 206406
17887 206406 373138 376511 418864 576765 697772 660930 642887 736512 866538 1210586 1596933
17876 1596933 2247513 2590915 1961376 1350174 1088996 1050252 1080183 1134988 1416513 1919599
17866 1919599 2252151 1807714 1204357 841037 676937 546489 424096 343083 184279 110996
17856 110996 145377 194441 232304 212304 237643 277799 286955 307450 259423 308917 339194 256331
17844 256331 112909 65862 151719 235739 271549 317714 431811 476283 475073 302288 113456
17833 113456 115733 156715 147458 241787 341083 386563 374108 381790 343349 277240 321223 339625
17821 339625 296199 379423 507243 521325 487325 538217 584193 604217 725349 792029 895549
17810 895549 944343 1134152 1323953 1552371 1593155 1313895 1056224 921609 1008894 1180540
17800 1180540 1426862 1739955 1991636 1889586 1713367 1621355 1593595 1780954 2133634 2519042
17790 2519042 2824342 3043989 3459017 4184599 5131558 6124975 6933533 7714545 8330363
17781 8330363 9243417 11041915 14201907 19703440 29225456 46382272 77702455 120532362
17773 120532362 130043601 94221731 62924751 48827261 47299342 56630240 80254256
17766 80254256 123289922 157851776 131133807 83732650 54549221 39889031 33006665
17759 33006665 30557502 30567207 32624988 38018596 49022255 68939501 106388790 175448140
17751 175448140 265646138 278623993 199229521 131489717 98835256 90294124 102530345
17744 102530345 140835557 209317461 256972840 207036364 129236178 80615812 53816847
17737 53816847 38955852 30762329 25774541 21932771 19396408 18256864 17189134 15597788
17729 15597788 13628617 12068996 11293682 10819503 10957273 11525072 12008179 12484838 12850397
17720 12850397 13609755 15390707 18256819 22435019 28961852 40016772 59693617 96531769
17712 96531769 164917850 260677384 285258676 201553131 122411309 77301867 52050287
17705 52050287 37481248 28825474 23464168 19739773 17433185 16145188 15401398 14920020
17697 14920020 14822392 14938840 15953507 18120233 21436434 26658050 36444142 55100579
17689 55100579 89388249 136277924 145490950 105059098 71711126 57624251 57416237
17682 57416237 70901610 103241147 163990992 234158041 221451176 145027864 88629314
17675 88629314 57979925 41086207 31297852 25353662 21410604 18523026 16314898 14885973
17667 14885973 13893993 13542073 13809293 14785802 16928523 20837995 27123577 35425684 46270920
17658 46270920 65372407 101477867 141796751 129345484 82466387 50007048 32757389
17651 32757389 23422637 18487404 15608818 13610875 12302398 11274792 9716482 8171795
17643 8171795 7092913 6366570 5860439 5828526 6001930 6112505 5867303 5958009 6644410 7558619
17633 7558619 7465489 6133894 4886705 4109490 3512431 3311264 3490119 3608004 3298974
17624 3298974 2897556 2564581 2295466 2168773 2107692 2091127 2055748 1987041 1977011 1959084
17614 1959084 1908244 2056645 2184274 2306487 2112574 1623958 1500366 1430455 1471079 1454347
17604 1454347 1309776 1253450 1286064 1095574 1074197 1234921 1310478 1254922 1166842 1098127 1027666
17593 1027666 956971 1093757 1147599 1163606 1097959 1173140 1161025 1165386 1348035 1323625 1094590
17582 1094590 882789 839051 778977 852712 857024 725941 782907 762082 720870 633706 559457
17571 559457 584304 603544 642023 593893 706831 875132 828650 834951 841229 748021 702629
17560 702629 718632 773761 781887 669990 480818 406105 492059 428033 554696 648862 661071
17549 661071 667510 638277 519385 491650 536536 570672 553776 623731 676208 574352 552368
17538 552368 797485 1178892 1550281 1746512 1448369 1212625 1054193 1061426 1108854 1282532
17528 1282532 1606319 1946003 1690534 1177517 860909 672592 595391 630344 587455 443864
17518 443864 348881 388579 363461 348034 416725 570843 679978 636451 492570 523570 704506
17507 704506 783930 871200 1064966 1330344 1264138 1127204 830741 643007 578652 671215
17497 671215 894227 1088028 1218097 1057306 702449 463106 397662 360869 340235 227200
17487 227200 269572 430843 401710 352191 377528 332492 327867 295958 311411 197641 284882
17476 284882 389839 257684 207801 158499 140636 147939 171729 131273 96266 334598 347350
17465 347350 334877 289641 307577 226372 205579 154196 174709 327003 314149 306184 276193
17454 276193 359331 411149 484752 530305 386803 163276 56392 81551 175700 301529 420619
17443 420619 853765 1403618 1726492 1470882 957585 559787 412985 415427 429835 416849
17433 416849 415287 427426 445345 376661 314837 296325 296774 257435 299712 315600 222224 177931
17421 177931 209028 147707 103460 184939 178917 246293 315411 272697 201878 162996 152216 196535
17409 196535 229895 115068 132019 272968 287300 269973 165986 61311 142294 250584
17399 250584 227967 238224 171197 152495 241006 198853 99879 139225 170456 187844 200704
17388 200704 245372 256850 198018 164781 215142 185298 245882 212674 169041 167162 214275 370995
17376 370995 305219 142767 139565 355872 521615 489653 421451 348704 256902 182434 155527
17365 155527 263166 200358 147144 242315 272679 301710 281483 238966 119941 121108 203082
17354 203082 232674 250421 319885 271654 119897 78575 20235 63054 174052 231353 206962
17343 206962 306540 215147 150153 169739 183621 230327 172281 -24237 -75369 -29078 -26671
17332 -26671 -104423 -128730 100428 251628 208938 139167 59512 -21012 -50613 62386 168785
17321 168785 240847 213088 80293 34835 101764 49648 146834 199903 188127 165836 187188
17310 187188 141530 125644 169794 143563 183118 272770 328906 129310 51293 31774 174092
17299 174092 339147 380440 360272 148002 -61368 60078 181472 179046 246397 314992 240129
17288 240129 198345 153369 91863 55547 76928 231125 138971 103916 11596 -130873 -86674
17277 -86674 137680 344764 535661 583630 465896 356482 388502 297200 240426 219045 227166
17266 227166 179878 256653 252840 238202 264152 286145 238293 115452 49895 85357 141360
17255 141360 185806 167677 195558 289219 398491 313682 171662 365676 599285 651948 777168
17244 777168 941288 788308 708267 676433 760077 879079 1007073 1232482 1231352 812273
17234 812273 458656 239309 265846 345833 394147 469420 352662 257209 286734 342204 461631
17223 461631 726004 1173166 1386294 1191993 980765 927856 812659 817956 926952 1195741
17213 1195741 1103398 810362 572669 435487 335724 361205 328865 264649 267339 220560 226305
17202 226305 185469 178225 137738 86559 160175 281596 373137 382261 218397 178061 182004 141833
17190 141833 183821 223496 308964 417851 446322 265145 135459 209408 293134 393760 540447
17179 540447 780743 1075139 1446008 1500389 1156464 761684 528910 329282 189557 262894
17169 262894 282608 249033 249523 236931 187946 142673 185985 215391 251370 166261 164304 242102
17157 242102 345326 624154 986558 1212133 1253937 1074246 707244 479349 463543 546533
17147 546533 663591 905547 1163468 1247019 1056738 666600 361139 184843 91857 154316
17137 154316 181359 221725 213201 174711 242711 326773 396002 317545 304196 226024 251039 255808
17125 255808 283048 406503 592094 958515 1071968 843570 656098 470076 333794 269124
17115 269124 173334 -18119 -68181 -39873 47376 13373 117157 216079 298480 214879 110075
17104 110075 110179 149328 236331 187907 203882 144765 128751 98883 53420 24246 77590 137943
17092 137943 160213 285928 278109 276383 265878 129880 57814 19703 -4549 17516 104546
17081 104546 195999 151133 229633 219732 321182 329801 216521 93950 16234 1628 72094
17070 72094 46185 -6544 -19257 -63841 -102195 -47569 -67019 57622 -201 3395 -87490 -103811
17058 -103811 -23209 -53912 -82317 -56651 -94277 -79868 -160495 -201221 -20841 26621 42943
17047 42943 -85576 -142236 -29969 80608 -21121 -25735 -58216 -21923 -129214 -186724 -109536
17036 -109536 10464 1850 -110873 -65284 53533 44386 -8111 15455 -68900 -17994 5424
17025 5424 -148221 -105464 -30490 153221 267481 312648 289485 178567 154933 225939 198052
17014 198052 181330 143180 97707 8744 100046 161734 104491 97951 65580 21316 45529 -4176
17002 -4176 -129989 -118729 -69151 42632 64180 -29956 -63622 -76038 44803 123430 147277
16991 147277 81416 70881 23311 -48943 -49728 73257 150274 39077 54812 108072 206781
16980 206781 137862 16249 26348 107218 181494 209933 245174 241610 130247 83825 49521
16969 49521 75851 230162 193209 136953 165773 160497 114056 82073 155584 200196 207348 224187
16957 224187 98655 49604 108023 71524 95761 86909 -75416 -71209 46490 49486 1228
16946 1228 -6984 -40771 -144334 -122795 -23055 -4315 -16481 -35219 19587 55752 29461 -91822
16934 -91822 -72907 10413 -14625 -97888 -155724 -67955 -32420 97062 190499 146489 144084 239755
16922 239755 234041 86259 116115 183079 120447 -40889 -148324 -120156 102298 260256 192320
16911 192320 236425 197570 89339 25493 -12450 -51554 -53696 -81658 -259567 -186487 -52245
16900 -52245 -6011 -33673 -54140 118854 132537 42025 -74415 -53961 7302 60170 138354
16889 138354 182897 201018 156291 180517 132736 111711 114689 147158 176297 96451 91506 195095
16877 195095 207855 112952 47883 -27450 42810 105149 72200 65286 39718 84127 161629 23163
16865 23163 -20913 -35251 6098 84092 77037 133030 106996 56024 142957 94571 -12093 2070
16853 2070 49232 -39936 -177417 -202907 -146135 -169560 -147180 -958 -40848 -112565 -1678
16842 -1678 129051 102366 107104 83650 55607 -5589 -68231 38443 64664 87765 57645 -29631
16830 -29631 -28597 -94773 -179064 -150221 -121642 -113020 -63513 -79290 -180782 -124305 -42916 -70593
16818 -70593 -80123 -61705 -26921 59428 7503 -102620 -193464 -129783 -88479 -51969 70413
16807 70413 119541 132226 167630 95875 56608 -94384 -156779 -180479 -115970 -101047 -67394
16796 -67394 5382 161686 202531 89462 99796 188844 173776 73237 25275 33215 13535
16785 13535 18371 -26519 5715 7454 59611 154976 148250 252650 132968 45082 40447 154762
16773 154762 212330 172565 28448 -58948 -79348 -90394 -9514 127726 218321 102739 20426
16762 20426 18060 102176 129616 81413 124729 316221 282417 156653 77409 93569 56620
16751 56620 34372 115481 6781 10528 117578 92006 26818 31925 9929 35062 21726 -19276
16739 -19276 14507 129751 162813 104336 56060 38154 -72790 -48972 52248 65028 40550
16728 40550 22433 -17909 -40495 -3899 51478 89043 89747 1618 -147865 -138898 -35494 99444
16716 99444 157195 168088 224342 137650 141594 118027 60662 84330 99184 95950 67594 65825
16704 65825 127614 54333 -31780 -146136 -167537 -51208 -21260 48920 122254 176319 177813
16693 177813 145115 39936 68277 130216 224255 293574 186416 95177 98307 199778 148158
16682 148158 45226 -10663 27250 123588 96095 105152 147884 267818 265543 218996 298281
16671 298281 283804 320642 306005 212067 176735 84765 15384 107024 107616 52206 124603 99902
16659 99902 56598 10336 2172 -18257 37231 145009 67143 -12955 134418 188442 111924
16648 111924 134679 131031 112819 27585 -62920 -97799 -37912 53962 122235 295418 292308 165467
16636 165467 125762 137896 100286 75745 -8474 7623 -6268 -5297 -15950 -46006 56533 73406
16624 73406 104983 82967 -23897 -63535 -16811 57284 35449 9053 -90276 -124978 34571
16613 34571 100372 115830 76707 45429 -34908 90398 145975 85163 29943 -19127 -77764
16602 -77764 -52053 -116561 -115718 8720 -17004 -12393 38035 -17233 -87319 42649 76268 -1185
16590 -1185 -76362 8601 -82208 -67899 -67219 -31764 -31447 64986 78980 66096 63852 35793 53148
16577 53148 -42530 38565 68512 97346 114654 25265 62935 44857 97128 62812 73403 151793
16565 151793 109094 40962 -30979 -99532 -73687 -1496 -29235 19058 112783 102145 79817
16554 79817 62356 32494 37906 18657 -34848 17648 121641 -11778 -21547 54726 22252 -22355
16542 -22355 57556 74261 14023 73259 57902 30715 12545 81598 140697 189989 58772
16531 58772 -142742 -84897 -97633 -92505 8588 48130 166480 179602 134503 189793 144911
16520 144911 124899 242039 308998 262559 186966 146149 149926 220424 140242 -38548 -76458
16509 -76458 -151606 -191598 -75909 32025 -34311 11407 29974 62352 1775 54742 438
16498 438 -41138 -150660 -163249 -153318 -135353 -141691 -115128 -72879 -79003 -146822 -214802 -203235
16486 -203235 -58113 44225 -23905 -42821 -8541 23502 53326 28121 -5207 44033 187109
16475 187109 26620 -222636 -180994 -49624 143723 144159 98337 51303 -36826 23411 15783
16464 15783 -47540 98280 184588 231498 105687 20028 10887 29209 28982 21440 -38816 -68087
16452 -68087 39609 41584 -55314 -12663 -39521 -67368 101187 114529 -40373 -136333 -168172
16441 -168172 -190386 -93832 -24632 43597 -18395 -13572 -10529 -41425 -35729 28116 168724 190446
16429 190446 238414 201327 74327 78988 104318 80819 90430 145523 89674 -31752 19667
16418 19667 218448 252005 232841 321101 169142 -44585 10378 83859 107285 175614 193948
16407 193948 56252 -52451 -45948 46899 108860 124430 32480 4291 -30264 -89409 43769
16396 43769 96564 99543 104634 139831 153276 204413 115752 -18890 -42727 -38251 -22379 88661
16384 88661 160305 69664 -48620 47981 265827 363355 335937 259898 266561 230977 214626
16373 214626 228035 303672 285894 85655 -44042 69513 174138 16251 -86465 -117169
16363 -117169 -43845 -65903 -25110 -115209 -206195 -129598 -99522 -47862 -10283 28726 12620
16352 12620 -21556 4095 49585 -4329 -23474 -17980 -70749 -132552 4114 27218 56324 57705
16340 57705 73820 1372 71551 49300 -29289 37654 155730 159730 145154 87372 -49747
16329 -49747 -27797 -42877 -32182 -53577 -51880 -52054 -70186 -55772 -70760 320 8093 78305
16317 78305 163569 190394 224023 139833 145430 126149 105103 207701 240118 242071 372677 428229
16305 428229 377304 242641 99125 105558 225196 263682 268146 311983 319916 295074 330363
16294 330363 332833 349016 274985 166435 50634 141056 171076 151049 148895 106775 148697
16283 148697 173878 201163 171138 127692 139330 127884 83484 28343 26106 11801 59670 49749
16271 49749 59214 140979 201954 122629 112332 202258 177134 48228 82912 99840 77869 152498
16259 152498 251295 197745 121288 11073 -38552 28393 84591 164076 148314 48774 -13250
16248 -13250 -25765 62732 88620 38747 66830 110738 99427 -36085 -41152 96110 161610
16237 161610 8291 -106206 -240131 -52139 74482 46631 65965 97720 95429 108529 93394
16226 93394 75808 71691 154193 57966 -2582 51283 47695 14352 43896 143857 128543 -40181
16214 -40181 -119343 -133350 -106169 -27203 25014 8232 1726 -16568 57880 51514 27593 140086
16202 140086 191440 46815 -59403 33383 220751 349261 352232 378974 339975 168934 92764
16191 92764 22091 -92434 -149343 -49881 25273 74780 129555 35598 -130985 -84922 -48574
16180 -48574 -88016 5687 98839 130770 161098 74236 72998 86654 -8275 -28514 43027 41318
16168 41318 46850 -3698 -64355 9345 50524 63217 -57147 -183937 -123987 -132239 -129959 -193533
16156 -193533 -218599 -208357 -77366 -43493 -75560 22484 194512 225648 143493 -27760 -65842
16145 -65842 -151462 -261369 -236595 -155481 -56732 -38578 -95027 -75537 -30572 20359 -13938
16134 -13938 -37532 -2806 118949 66580 76283 71658 73340 75718 53082 139443 123921 12703
16122 12703 -118556 -43949 83624 73935 13080 -28138 -21152 7469 -18765 -24657 85224 145320
16110 145320 55468 21815 118815 177341 65760 -13081 -42183 -27913 -56777 14330 55281
16099 55281 85772 72408 78208 -11399 -135890 -176988 4616 151977 105805 110183 74865
16088 74865 -21807 -27745 2145 -19028 32616 100109 109929 213067 83251 -45903 -27278
16077 -27278 -72123 -78465 -99402 -170797 -116026 -78617 -48316 153768 204126 223731 -24000
16066 -24000 -130210 -122286 -176829 -183358 -153841 -22601 59356 124455 152197 44878 -122337
16055 -122337 -100872 -104478 -142044 -82465 -62425 -28340 43274 47721 53522 58084 15419 65567
16043 65567 135564 54794 -18769 -91 853 -132117 -49699 40235 61535 31434 -54786 -99033
16031 -99033 -77863 -40960 -17439 25509 -21283 8928 100856 40200 -43571 28423 56305 93893
16019 93893 148467 166570 98252 9120 1699 -19086 -28275 -18638 73434 43568 27260 -9173
16007 -9173 22604 117424 83402 129442 117117 50358 89750 27532 85954 20616 -26140 -45088
15995 -45088 83327 151600 166569 39668 93938 110046 127141 119978 112194 92291 142867 203584
15983 203584 138801 86407 203457 392506 352441 160557 108544 139447 75384 -77735 -122633
15972 -122633 -54592 9345 81140 108235 6037 -77913 -107715 -115193 -182623 -234209 -175072
15961 -175072 -130267 -106865 -64140 5847 -16532 -16505 69808 91419 88446 183296 180236 123384
15949 123384 122520 -30112 -29560 -44872 9458 10854 41646 34574 45220 -12467 -51229 -41368 49920
15936 49920 52052 139274 214512 187043 185650 112014 -14063 22471 86681 36219 28793 92152
15924 92152 162254 118310 52100 115573 48175 7364 -17418 -17995 -49531 -10421 1001 84447
15912 84447 6951 1977 57203 29734 29889 -9880 15965 64482 50393 24004 114790 41746
15900 41746 23476 26236 69762 74203 61797 75844 -25819 -106425 -27013 -27967 94300 105561
15888 105561 147507 157292 137372 33119 2597 45307 53934 49023 74443 -11105 -246745 -230862
15876 -230862 -165003 -173078 -64809 68136 178901 110130 67509 116680 99119 -11208 -2101
15865 -2101 -8694 -90509 -63511 -3815 -46106 -41689 -64461 20898 106998 70337 25716 147740
15853 147740 121832 130287 70 -26298 -66082 14861 68979 50687 113337 43689 7053
15842 7053 27350 -28349 -138825 -201298 -145214 -178268 -141496 -65743 6228 128316 19734
15831 19734 -103699 -103313 70657 27355 31253 192294 218934 253229 273486 230776 103511
15820 103511 -162542 -238437 -181378 -209980 -188152 -179256 -181109 -35483 75741 40781 -63950
15809 -63950 -161339 -137324 -54525 47173 -15586 -56307 -117999 -62000 -127092 -186219 -149484
15798 -149484 -60775 -116205 -65854 -90362 -116024 36119 151896 260933 221391 110969 151999
15787 151999 85784 91216 90740 -5094 68239 33930 -31372 -83879 -1078 37906 -55256 59931
15775 59931 180846 256485 271805 242521 92863 -71531 -127941 -175600 -79185 -49856 -38874
15764 -38874 -125383 -128905 -151937 -131385 -41502 -33484 -60800 -27718 10167 103388 73910 101119
15752 101119 7887 -224983 -279706 -222082 -130652 -58336 65557 35307 -56858 -90670 42288
15741 42288 187308 203352 60120 58506 160033 251459 319750 123241 -19158 -30579 -93920
15730 -93920 -185800 -186441 -292672 -356942 -264448 -218033 -40660 -83589 -104700 -44220 -106215 -96398
15718 -96398 -35220 54155 66096 58844 21726 -17016 4764 37774 2693 -14721 63464 148689
15706 148689 204358 185639 248552 364840 310047 118367 35468 153960 62053 -56977 33519
15695 33519 -19061 -57147 -22077 29550 116283 60285 18495 35897 -11820 -108124 -132721 -96623
15683 -96623 30333 11169 81114 24438 -158557 -126644 -182452 -218762 -187217 -82756 8524
15672 8524 26937 7103 -11243 57914 -53338 -132319 -41881 30042 -25247 -43472 3877 -126876
15660 -126876 -76683 -139733 -168947 -19036 48967 140424 182311 214959 207002 154322 228104
15649 228104 153913 45386 -14094 -49169 57780 132687 46299 -7291 25024 -62826 -86066
15638 -86066 -32486 -6899 83405 78072 77285 9955 -69401 -86492 -131428 -136204 -106511 -92133
15626 -92133 -28665 24261 -84860 -119860 -70531 20398 72717 117973 -13267 -46803 -5506
15615 -5506 21133 32971 38554 76379 124846 1518 23996 36486 19198 40181 -74973 -106727
15603 -106727 -95628 -46593 -41714 -17007 8200 63961 38945 48008 -42514 -101201 -38072 117510
15591 117510 169485 163745 93077 -11559 -14539 -58251 -46780 43323 60493 16182 3620 42712
15579 42712 98011 95068 169398 141296 44750 -3760 -4348 58096 137769 237287 236461 234408 180744
15566 180744 65250 24526 53522 -48059 -200867 -204481 -115122 -157225 -202267 -110400 1790
15555 1790 -14884 -9588 -26586 -79381 -123984 -64254 -84903 -166950 -129210 -136200 -127003 -192940
15543 -192940 -108185 5982 92681 179311 207631 131298 79228 63854 84625 40431 91875
15532 91875 79092 29106 83490 76240 91643 -7791 63995 93691 52816 20741 -1749 -68094
15520 -68094 -28662 -57726 -16634 97487 59397 59403 67692 99274 -5630 -7501 53123 -22066
15508 -22066 -125940 -127277 -126514 -147429 -253631 -287096 -219477 -177894 -102063 -119119 -112698 -113201
15496 -113201 -70523 -10457 -23765 -65964 -69121 -24764 16673 22976 -23913 -43028 -98551 9816
15484 9816 265849 194439 147344 93932 67866 82394 28878 3394 25070 62593 10990 -118497
15472 -118497 -77384 37421 93368 -13696 -23798 -14871 -15516 163989 86974 71137 92812
15461 92812 -9691 -22272 70451 106922 36960 -17783 4719 71844 133832 5648 -39523
15450 -39523 7148 59540 86079 75888 55395 -2111 61637 146518 142653 124855 188067 194687
15438 194687 115167 44390 -20003 905 -50949 -39776 -54644 -49486 -16933 -155311 -237690
15427 -237690 -203722 -77205 61404 68337 -1300 -74058 -85917 44355 57346 94660 9866
15416 9866 -60081 89500 82723 21986 9922 87681 165794 293880 398549 332090 221389
15405 221389 146590 132020 147700 59210 -10596 -27802 29081 21366 -38804 16013 4046 -15792
15393 -15792 -27767 38237 -32116 -161221 -165506 -98338 -166974 -103014 -45991 151610 111136
15382 111136 132245 98211 -79421 -25332 -25274 -106829 -140616 -189708 -92192 -37795 -76943 -67274
15370 -67274 -54289 -95508 -40529 -130314 -209356 -123792 -80821 -104827 -9982 139067 230336
15359 230336 194085 99047 101093 4055 -51726 -74258 -47675 35902 34866 27315 83513 36234
15347 36234 25996 76345 80665 30180 -33440 -103755 -141827 -206086 -252693 -233864 -229079 -141021
15335 -141021 -178805 -280413 -288018 -151400 -8079 5973 -11268 27220 -26889 -110308 -92770
15324 -92770 -20224 -441 -21657 -86553 -75500 -202475 -131706 -134200 -78095 -119199 -16234
15313 -16234 -840 -97169 -105129 -130731 -170157 -112271 -97172 -70139 -102148 -121834 -46834 -33086
15301 -33086 21319 39790 -11540 -4337 76036 1565 -38350 -55593 -8953 -9423 -11476 -56161
15289 -56161 -96896 -70279 46826 37668 -15228 -35869 -43501 -103787 -166646 -142580 -138669 -38253
15277 -38253 -1921 -38422 41147 53238 4336 37503 -86543 -157738 -78900 -9445 -83911
15266 -83911 -3317 77295 49849 -51725 -52413 74798 264558 197735 191926 238786 -11557
15255 -11557 -149493 -49805 -31419 24782 95902 118205 45843 86276 95081 154424 254888
15244 254888 212290 111535 122619 56239 -36610 64848 82552 81852 37639 -30455 -67266
15233 -67266 -74000 -66359 -72599 -137501 -197995 -131410 -95582 -144230 -130569 -95461 -75088 -33738
15221 -33738 -40345 -87883 -111375 -158952 -214639 -140892 -86205 -87870 -49784 -117187 -46015 -33816
15209 -33816 -31950 31832 86153 38020 -1144 -29039 -67817 34383 51965 4361 -75107 -50589
15197 -50589 35674 44513 -56276 -49551 -6448 -1379 -59072 -7656 42630 -7127 -89136 -8181
15185 -8181 -13600 -144948 -182926 -182224 -240350 -259607 -165232 -69514 -31797 -192352 -191844 -148858
15173 -148858 -41940 -32131 11700 78953 44158 14194 -74079 -28495 124854 135104 104340
15162 104340 57533 26381 -84898 -154677 -126643 -18947 30584 100727 54098 -17567 -37272
15151 -37272 -58177 36368 138421 56620 -11917 -68987 -146341 -61029 -47785 -43214 -62083 -56135
15139 -56135 31432 21453 40851 9954 -74234 -50696 14721 -37112 -77007 -27601 75084 119861
15127 119861 127071 69473 2115 38950 94130 -23638 -43597 -145569 -221118 -111370 -106540
15116 -106540 -66132 11005 -60217 -144671 -201476 -227995 -129327 -124599 -59913 56305 -10930
15105 -10930 -71209 -52344 -116657 -126126 16971 62122 -18365 35091 90215 5932 -111863
15094 -111863 -197513 -154451 -54924 -73480 -52110 -124749 -108149 55935 102010 92837 112175
15083 112175 3173 -94284 -139247 -49195 8336 -150941 2528 -13153 59544 40579 -168133
15072 -168133 -248166 -133809 -132823 -126824 -54367 -81669 -92519 -140522 -235041 -317079 -364964 -158377
15060 -158377 106199 126842 23009 55576 34000 174917 236474 239746 245750 170481 57177
15049 57177 18321 -126965 -200936 -75971 7648 -18975 -46506 -69606 -420 37339 -62045
15038 -62045 -23598 144565 197817 141986 96765 143004 140735 32918 17360 54452 -16275
15027 -16275 -103196 -144256 -44562 81084 -18255 -122229 -166223 -112192 12425 122190 111883
15016 111883 57356 44833 67165 9646 -27581 116584 264571 260609 210603 149361 169929
15005 169929 62775 113416 237392 329580 225289 188252 225240 168069 97432 45575 30948
14994 30948 49318 81120 118380 67991 10035 18159 96495 140229 200059 242195 185764 147557
14982 147557 280070 370550 320299 232458 158486 122883 126549 67374 -34243 -71299 174
14971 174 49057 35093 117227 168638 282783 318990 176825 101519 -2459 52675 96845
14960 96845 104865 55261 102026 102607 139634 164964 115507 97221 17845 -26308 8239 25282
14948 25282 -107909 -252182 -240520 -210619 -167678 -158344 -17089 5835 30917 125924 94964
14937 94964 14629 39249 12659 -102430 -71352 -21349 -50959 -102456 -90554 -13482 -129149
14926 -129149 -159896 3895 -53775 37861 188562 198064 133698 -629 27800 -69616 -143574
14915 -143574 -85914 75477 84936 73842 58988 -30550 -26484 -90191 13707 24201 27521 45419
14903 45419 4555 13026 -66101 -111594 -54466 20783 29629 -93457 -135903 -182008 -263608 -143907
14891 -143907 -66437 -43853 33076 -14684 -14666 -53235 -10149 67377 -22534 -56736 -12890 -115683
14879 -115683 41968 237889 190401 85087 -7170 -57197 -144609 -267531 -201536 -225199 -291333
14868 -291333 -220874 -186804 -60177 -103289 -126464 -213297 -224512 -107111 -34909 -133028 -122633
14857 -122633 -122182 -153086 33 106711 110524 117152 70978 -39235 -89115 -58637 -59582 40583
14845 40583 50834 -112493 -231049 -289065 -230352 -216817 -222597 -159308 -203549 -195007 -111568 -171953
14833 -171953 -222438 -237437 -329425 -298742 -153925 -106562 -3782 78189 62457 24755 100916
14822 100916 173631 166462 58856 32985 92536 67769 71120 57065 -18255 64343 71393 60111
14810 60111 63805 42875 145275 214625 158427 85011 105435 118738 132410 175649 164186 111486
14798 111486 167701 77314 128390 176736 116092 68549 -12218 68580 80950 -79448 -121793
14787 -121793 118094 117198 4913 -16903 -91078 -105825 -57518 -3069 -19191 -96712 -152628
14776 -152628 -117848 -119086 -12954 87020 66723 48489 74602 109013 50741 -54311 -41305
14765 -41305 101130 92544 70390 145234 143820 224323 98067 -53880 -5470 12262 144679
14754 144679 148775 73579 83283 218306 93673 -65755 20149 24988 -66796 61356 241621
14743 241621 269792 130366 95365 -18676 -196835 -121972 -90730 -121484 -5992 91131 98661
14732 98661 72194 35126 28707 48704 -529 3210 39192 63553 148571 69379 -318 -12457
14720 -12457 -56909 -109742 -58938 56870 51992 107327 55044 26789 36037 84314 27214 74648
14708 74648 75391 -35367 -100229 -150625 -101642 -75808 -139155 -176218 -97301 -101861 -139448 -51976
14696 -51976 -49609 -16548 -2253 30917 53250 -4520 -123672 -151230 -201453 -113405 -100308 -48401
14684 -48401 -14205 17438 22128 10625 84319 58890 -98907 -80756 -13803 3416 47049 -70281
14672 -70281 -8248 -67581 -111791 -155998 -86482 -11826 -45573 -41941 -953 35909 -96783 -100566
14660 -100566 -10965 110023 100387 8196 -93304 -87697 -192678 -274171 -244603 -199798 -98506
14649 -98506 -26311 -44527 30809 60255 -42904 -150277 2010 -51049 -139829 -165831 -108113
14638 -108113 12312 31657 14855 27104 63502 6673 96019 229885 238737 249208 220482
14627 220482 141618 -26050 -113981 -65352 25712 94538 183295 163300 140175 37380 -61626
14616 -61626 -113432 -30105 -7532 84238 191633 201808 204492 36225 -66521 -13765 119284
14605 119284 -38151 -62841 29682 -63810 -193239 -83246 88884 284518 313908 137345
14595 137345 -63164 -61659 -137203 -70040 -47155 2916 13690 -15963 -88240 -78654 50309
14584 50309 129234 87105 -38987 111593 91445 118847 208814 139904 170637 170893 133896 21407
14572 21407 26836 29018 84427 142136 80261 -70293 -21903 86275 18803 -50404 -117725 -155155
14560 -155155 -76243 32681 40654 86078 122242 51644 24081 21362 -40508 -25124 -32920 -78698
14548 -78698 -33558 53509 72513 101858 81981 -6831 968 163425 177787 100865 46497 66484
14536 66484 134503 50082 -12103 -27160 -79705 -99228 -197786 -174183 -200030 -59191 13601
14525 13601 6548 -60339 -34480 -68587 -85727 206 -26788 -135165 -168053 -143723 -183514 -192974
14513 -192974 2323 105838 140627 123279 24554 -14519 94896 37846 -12751 -132707 -164581
14502 -164581 -144921 -73861 -14747 24782 69085 40457 107457 51664 -34690 -53099 -33783
14491 -33783 23326 -2879 -224002 -256732 -241135 -245694 -161524 -50914 9651 -35181 9391
14480 9391 -7085 -30747 64605 208376 182670 66934 6717 138554 145343 19654 -49280
14469 -49280 -17079 69912 93283 119459 4147 -171055 -218127 -176259 -133110 -55370 -5098
14458 -5098 -7819 88499 142173 16873 11538 27920 8972 -13990 -12720 -4081 13532 6876 72810
14445 72810 30980 -114873 -131574 -205068 -135558 -78493 -168372 -224353 -287955 -100178 -42192
14434 -42192 -30308 62283 591 -51318 -56169 15521 7970 -93847 -13324 47400 -53376 -43929
14422 -43929 -33163 -122128 -122610 -62778 -56241 38433 18338 -2010 -99108 -154733 1010 66765
14410 66765 79383 9470 -39475 48909 204639 320210 249199 139554 121982 83058 122455
14399 122455 88584 12169 57870 152602 22761 -159565 -238976 -220814 -118720 26020 75405
14388 75405 8504 -120639 -259973 -308852 -218682 -217126 -181323 -60303 37570 61007 38405
14377 38405 -591 -115797 -225610 -358324 -269265 -235591 -228141 -246050 -106366 23097 73241
14366 73241 -129381 -198213 -118583 -56384 89876 48431 54863 84036 27755 -32097 -128294
14355 -128294 -200555 -215646 -229895 -145336 4046 -51936 -64842 -105042 -208490 -171954 -165907
14344 -165907 -187913 -150745 -114970 -29870 -169 23994 10750 30860 94608 67989 -75411
14333 -75411 3812 11568 -56954 -65076 -95561 -17415 -88894 -201348 -267562 -191646 -186889 -169103
14321 -169103 -169346 -137175 -100828 -63981 -22588 120501 134371 96100 -5882 -65646 -76291
14310 -76291 -103760 -88076 -41255 19302 64890 -41927 -116574 -94066 -116824 -20928 111113
14299 111113 73968 -59566 -81778 -86729 -83254 -48543 -76147 -124885 -111771 64905 167886
14288 167886 252851 97225 59164 81149 69012 83407 92293 1154 -14912 127291 95480
14277 95480 163072 120352 38119 -37063 -119694 -107109 -26038 49402 -32150 5548 47338 -44652
14265 -44652 -34245 -23567 -78174 -81792 -96279 -49769 -18206 28440 18539 -56282 -46719 -44851
14253 -44851 -90494 -16981 -71393 -86661 -101306 -96832 -182275 -101694 -101386 -127445 -133331 -49291
14241 -49291 32824 -26869 -39326 -56323 -55933 -93945 -58143 -171613 -30846 53024 85558 53046
14229 53046 64793 67411 75498 61203 -72718 -130310 -88791 -6243 26823 30736 -77288 -148210
14217 -148210 -94914 -53721 10983 101046 53458 43841 54851 -32483 -51435 -61642 -22620 133463
14205 133463 236740 226806 127390 4224 -125051 -152182 -122543 -111002 -72697 -55471 -29374
14194 -29374 9814 17307 165905 215882 225543 111659 -26251 -109359 -136902 -178861 -195242
14183 -195242 -108620 -14532 -21274 -37179 -31287 19920 -39809 -70739 -107374 -132602 -59750 -67935
14171 -67935 -196410 -145595 7518 57786 114744 67484 102004 43549 114784 153985 96544
14160 96544 71119 77581 34687 45884 -7282 -72793 -10076 69691 166670 151591 60621 46713
14148 46713 80287 59263 -33261 -67364 -173465 -220378 -156182 -144053 -87583 -2886 46868
14137 46868 -49289 -162065 -133292 -29085 20470 36322 471 -101876 -78376 22439 159923
14126 159923 155029 193436 158263 168259 90888 55274 100648 114881 145747 190447 266099 180174
14114 180174 30222 -65984 -72325 -76776 -15148 101370 261661 180591 181648 319244 348081
14103 348081 321884 241426 346624 325025 408580 476980 573290 547676 533955 534143 478208 455044
14091 455044 582923 705297 711356 687977 805186 985922 1077519 1276400 1476343 1540183
14081 1540183 1623218 1712712 1781389 1887165 1980519 2057285 2026351 2061612 2051181 2009041 1822021
14070 1822021 1584404 1389764 1268005 1157982 1097271 1077779 1049452 1062854 1019651 754332
14060 754332 638566 575703 472713 420459 300766 160543 123904 116602 118623 118456 167050
14049 167050 118816 97508 225054 303567 279344 256120 221608 66785 38366 -21420 -76898
14038 -76898 64565 183883 240488 164446 143323 63032 57421 61267 74238 39407 21617 -736
14026 -736 -6796 -62269 -185296 -205440 -124721 -54551 -113013 -78802 -93678 -87806 -164498 -124616
14014 -124616 -52027 -15493 98876 94993 122985 75835 6565 55234 77274 30367 -11882
14003 -11882 -124437 -85495 -29226 -25063 12490 81579 140371 179789 183748 143881 54699 -22137
13991 -22137 53051 75635 833 -8255 63574 105753 105769 -30157 -130203 -116688 -91902 -152492
13979 -152492 -61412 -34639 -29953 3107 -32161 -131598 -102464 16564 79779 54124 24260
13968 24260 -31726 -244749 -309532 -284596 -238567 -127123 -93516 -85446 -42596 -118266 -81495
13957 -81495 -39111 -77311 -72814 -42337 -37082 -65949 -105530 -41816 -45825 79927 190511 116205
13945 116205 143120 134152 245233 328660 189913 -56206 -170279 -190498 -154176 -21397 -86527
13934 -86527 -90231 -111800 -144750 -97314 -82816 -47343 36494 82968 204345 175706 68617
13923 68617 54482 -85555 -241212 -110044 33781 -7094 14682 26714 -56481 -126740 -240550
13912 -240550 -279706 -335570 -232379 -188391 -217054 -200250 -224956 -157720 -93297 -96115 -133939
13901 -133939 -166611 -89136 -70682 -2186 -14663 55176 126629 107179 10798 -104664 -62429
13890 -62429 -39529 8121 -47761 -43109 -16455 -1747 -76917 -13091 23121 -127036 -181575 -154803
13878 -154803 -178706 -64189 -17640 75901 111163 121127 22913 -82581 -227687 -211313 -212747
13867 -212747 -184451 -76105 -9317 -109365 -56471 -31470 -80060 -64197 -23872 -110544 -109997
13856 -109997 -136035 -79148 -69594 -189845 -123721 -53208 -170 -19065 19339 -59273 -20415
13845 -20415 45356 -4538 -76247 -147672 -127877 -104900 -82027 -83188 -101477 -56708 38124 106859
13833 106859 -32830 -173890 -72340 9115 -10478 -133746 -163563 -82182 -147396 -196708 -66045
13822 -66045 -113209 -227965 -178304 -58080 -5118 25468 55709 49041 61834 16978 -68694
13811 -68694 -153977 -203607 -168083 -236034 -239461 -124243 -44711 -43024 -175403 -65932 77477
13800 77477 94396 -28007 -86581 -117511 -73353 -126682 -43691 -3257 -55155 -49857 5668 208161
13788 208161 169350 -43307 -184007 -233847 -261307 -214393 -157621 -121076 -66484 -12657 39745
13777 39745 6748 16014 66512 4140 263 -45601 -87881 -142074 -82695 -105389 -121161 -132711
13765 -132711 -183496 -275329 -222608 -110345 -103807 -47681 16066 121470 221305 45775 -91736
13754 -91736 -69593 -93921 -11029 52171 109621 44077 -49009 -43316 -122301 -177916 -129637 -65817
13742 -65817 -88150 -136976 -288022 -343783 -238055 -109104 -99611 -178165 -328601 -324232 -217202
13731 -217202 -222671 -272390 -283134 -250442 -176453 -121978 -113157 -71815 -99045 -83428 -150024 -117390
13719 -117390 -45805 -110083 -154452 -183468 -129476 -63113 -164958 -184234 -45217 -20980 -116847
13708 -116847 -157875 -110920 -94465 -76579 -46032 -63998 -43935 -53115 -30630 -86472 -124492 -143041
13696 -143041 -20810 51673 -21091 -75883 -56387 -120565 -174581 -77627 -56492 -138127 -104311
13685 -104311 -108943 -89049 -11813 -23270 -158824 -189595 -101280 -124659 -3199 -24029 -120156
13674 -120156 -89992 -28891 -49925 -65680 -139686 -272591 -187903 -117379 -167470 -109070 -63777
13663 -63777 -78255 -184904 -229852 -163544 -79977 -93673 -113787 -137199 -79842 -100142 -144814
13652 -144814 -91533 -65161 -49220 46087 -3125 -201850 -218218 -169104 -202830 -199108 -249315
13641 -249315 -191060 -74406 -75623 -77607 -42260 -60699 -152595 -133811 -74042 -88826 -183489 -220014
13629 -220014 -198855 -21694 86949 20319 -74710 -146302 -151192 -176905 -257835 -153274 -64833
13618 -64833 -22261 -43841 -89353 -115677 -99889 -198167 -201892 -131073 -121869 -202094 -199292 -115317
13606 -115317 -105586 -183858 -346164 -379731 -268764 -146949 -6815 70115 53580 -14939 -66174
13595 -66174 23421 30169 -111862 -68936 -15923 -25535 -8677 47612 -32096 -36574 -52840 -50132
13583 -50132 -66136 -108801 -2867 95914 15117 -167312 -134431 3814 -42046 -128269 -136018
13572 -136018 -34215 -69802 -71298 -134630 -194671 -169025 -161302 -285894 -197869 -106442 -35992
13561 -35992 19053 44242 11745 -60582 -72016 -169598 -129978 -81355 -94217 -199243 -294687
13550 -294687 -332320 -265377 -230837 -146678 -42093 74759 -57284 -85514 -63267 -163148 -190393
13539 -190393 -197688 -270331 -166598 -124421 -119593 -39055 -90321 -213812 -253636 -188065 -240663
13528 -240663 -240649 -227143 -154055 -93041 -42541 -64156 -56563 -68704 -166857 -170113 -288644 -379881
13516 -379881 -245149 -230027 -219426 -194229 -316376 -307868 -180164 -186651 -70106 -114173 -156194
13505 -156194 -185452 -259410 -264742 -99976 83717 83258 -24155 -118815 -92310 27388 115730
13494 115730 2623 42361 19103 -2265 -83896 -122236 -99273 -107895 -124953 -219596 -295939
13483 -295939 -173930 -82253 -57502 -108648 -174187 -174853 -215710 -251716 -225993 -186696 -253482 -223776
13471 -223776 -141882 -184673 -287645 -227313 -125900 -200626 -163540 -131268 -187070 -304375 -324522
13460 -324522 -379132 -233148 -147061 -153782 -217244 -187127 -171344 -104731 -46348 -32683 1091
13449 1091 -27983 -88532 -106940 -58403 -6605 29162 76469 31926 85051 171506 35489 -109331
13437 -109331 -171986 -108154 -89958 -20304 15908 24740 49899 210119 181337 93404 56948
13426 56948 133137 219688 356304 274165 328641 368890 488675 419761 253299 194182 84896
13415 84896 -12293 -60839 20718 -7685 8275 -43457 124721 196679 112693 94493 193642
13404 193642 274980 277964 258092 144098 114709 79643 85045 178742 202791 115914 39047 118356
13392 118356 201898 178072 91701 66228 98557 116232 64735 32322 -8514 29487 172255
13381 172255 199660 131271 103422 211013 252781 213531 166105 214060 239614 274774 365760
13370 365760 451743 324587 323969 347382 333716 212093 263453 201939 162123 207144 279648
13359 279648 334661 190626 284636 240970 157493 175325 144504 102437 181531 160011 122372
13348 122372 78380 -1310 90464 216055 336251 263273 160197 164299 169882 219014 289254
13337 289254 252927 45051 -30618 30353 77404 14330 45389 135730 188518 227814 180348
13326 180348 131207 171121 279773 259360 136751 30297 -34188 3894 95184 162892 39263
13315 39263 -104459 -50879 -180764 -286069 -214640 -49534 82928 122600 12652 -30343
13305 -30343 -74748 44704 108251 113155 109830 134164 245493 394366 444702 440316 438435 527087
13293 527087 440137 418451 489664 572035 399887 341054 373687 434785 562758 586702 405161
13282 405161 329650 212295 232189 355286 383306 362433 504632 568610 563130 423204 258517
13271 258517 77231 46146 73343 112357 312234 424388 476230 488641 437837 400846 354731
13260 354731 444633 491216 521368 438822 279437 179635 209669 297520 332229 323210 374942
13249 374942 494832 467133 389380 302419 317539 328540 363527 303274 279529 281133 152194
13238 152194 104036 73922 21376 -50564 -123575 -47291 142334 218478 40273 -49358 13065
13227 13065 38782 181554 156445 -10863 -59293 -33367 -106747 -158135 -95279 -170234 -195498
13216 -195498 -160795 -229986 -219139 -164581 -234079 -212588 -156397 -56280 -59634 -110164 -80473
13205 -80473 -135554 -181204 -194030 -169370 -23374 -45791 -65676 -156608 -42432 54629 -36089
13194 -36089 -54502 57594 52551 -5216 52338 171569 237894 307721 506674 612472 576586
13183 576586 526986 385686 226697 160519 146939 237510 242191 233228 244652 225372 216142 352734
13171 352734 609336 762133 856736 773785 601726 449312 298847 163865 100435 95954
13161 95954 76770 79152 54143 119235 134237 61396 -24537 -54305 -77025 20097 113655 15896
13149 15896 -99352 -70356 -43347 -24813 -19209 69583 122054 -31791 -147499 -137681 -89923
13138 -89923 -74102 -162218 -217148 -121835 -194840 -273319 -295514 -298943 -290403 -229033 -79770 53560
13126 53560 35991 -22099 -70713 -324 55847 71608 76087 104535 191433 350676 503189
13115 503189 642514 689106 557636 533480 581924 542296 412639 355640 309037 393806 555857
13104 555857 542910 565021 647051 692403 760043 921532 880534 708788 550603 468842 379271
13093 379271 445236 348658 245782 270841 224873 269918 359890 435960 424653 296878 104207
13082 104207 -22123 -86860 37222 109941 15949 92359 127902 90494 57833 23773 3114
13071 3114 47921 32778 100085 172755 199892 81145 12884 -9342 -24901 -105971 -161233 -79728
13059 -79728 -22446 9343 23247 -47068 10252 39421 -91317 -105912 -155157 -135789 -117218
13048 -117218 -86627 -83759 55063 152502 64137 169680 284991 364937 383494 457018 419879
13037 419879 336665 176221 16644 121187 52628 -62772 -95665 -122311 -29316 29750 138892
13026 138892 188426 178048 116204 168308 291465 441984 352169 249803 256865 139348 70427
13015 70427 135646 63279 -172100 -97327 16646 27569 -42217 70456 145129 100095 105604
13004 105604 301477 454403 409091 332210 287731 313171 281216 303367 319482 232347 132382
12993 132382 109625 190810 218620 126607 53854 90447 23888 -177765 -88874 -20647 -35901
12982 -35901 10433 222328 337665 215954 134491 57343 146951 156537 46855 53888 30516
12971 30516 61145 59789 -30725 -105817 -95614 78968 65010 -83431 -89463 -76507 -146353 -210368
12959 -210368 -140200 -66836 -141972 -174795 -45569 7461 71556 172221 113096 24953 70576
12948 70576 110775 112345 116237 182463 321265 313634 218995 151496 264650 301801 321628 445923
12936 445923 650168 954931 1155496 1198474 1383405 1537070 1622920 1822195 2101751 2325953
12926 2325953 2533820 2852124 3227416 3494201 3920739 4523155 5437146 6713910 8480024
12917 8480024 10766546 13722150 17459305 22509798 29166569 36104429 41222641 43722907
12909 43722907 44761918 45011910 44145182 42382210 40469415 37975738 35058179 33125188
12901 33125188 32830372 33890614 35379415 37098274 39342392 42148330 45361449 49252864
12893 49252864 52600781 52874775 49728117 45256159 41460431 37712952 33618761 31026496
12885 31026496 31171902 34002942 39129234 45730887 52354409 57188599 58749312 57784396
12877 57784396 55942997 53251015 50091624 47380781 44428126 41077093 39202300 39792383
12869 39792383 42349800 45492690 48149961 49773134 51345670 54012326 57715758 60085158
12861 60085158 58269620 52622784 46237132 40964051 35711875 29642344 23853856 19645027
12853 19645027 16857863 15298113 14579749 14340680 14632130 15241357 15835422 16102025 16443381
12844 16443381 17468716 19608886 23109007 28409263 36492678 47864313 61703740 75223443
12836 75223443 87668955 102294611 117689142 126589946 126011005 120071859 114544831 111161532
12828 111161532 107452565 101822156 95754753 91018261 88916858 90615380 95992370 102951671
12820 102951671 110406135 119185941 127053610 131861564 135850530 137248323 130202843 114745427
12812 114745427 97517691 84459792 77120905 75661328 80013947 88232667 96596562 105191368
12804 105191368 116222198 127923087 133890042 130056120 120994862 112860521 106377671 100989747
12796 100989747 96582992 93445419 91741115 91573290 93750459 98605865 104144775 109550686
12788 109550686 114996671 118915265 119258820 116906891 112916020 104995280 90478330 72920085
12780 72920085 57655217 46139469 37373758 30549931 25266956 21212488 18267321 16084797
12772 16084797 14399385 13206591 12290658 11456356 10820163 10413953 10122691 9915254 9705171
12763 9705171 9630156 9566866 9713426 9936851 10295880 10771706 11433291 12564475 14085514
12754 14085514 15466755 16537578 17764374 19699083 22702160 27118471 33524820 42983806
12746 42983806 57470063 79712569 110224297 142693188 163155886 160085334 140790558
12739 140790558 121585333 106881891 93478454 81806564 74772162 73560995 77486870
12732 77486870 84542992 93933240 107322395 128058899 154445948 175927912 177025416
12725 177025416 151675845 115561544 85497831 63699910 48607109 38648082 32257074
12718 32257074 28179268 25571752 23475849 21205748 18688287 16407851 14677150 13369654
12710 13369654 12157620 11193814 10406143 9807583 9065624 8414232 8141170 7801907 7407513
12701 7407513 7163428 7136536 7090074 6953494 6847937 6830049 6941191 7223626 7401594 7608515
12691 7608515 7955048 8536826 9242996 10151181 11430896 12976638 14575634 16109435 17482944
12682 17482944 19111856 21768457 25420199 30564671 38342573 50312298 68457865 94311513
12674 94311513 125756278 153682088 167654580 165987761 156487827 147664063 142236105 139384205
12666 139384205 137654369 134502445 129479790 125890234 126069075 130826806 141671350 159550876
12658 159550876 179973332 191990887 187430359 168749318 145203044 125386546 113075475
12651 113075475 106737083 100210950 88497552 72996972 58130391 46138524 37093280
12644 37093280 30605552 26077275 22733437 20055676 17941967 16318121 14813989 13458918
12636 13458918 12292008 11196549 10212792 9375470 8841841 8422947 7880556 7510544 7325251
12627 7325251 7210562 7087726 7029767 7033350 6931654 6830201 6765756 6746392 6694597 6699836 6741300
12616 6741300 6785161 6853129 6949212 7009048 7062714 7259450 7522484 8115198 8782705 9581284
12606 9581284 10520925 11341142 12337704 13930597 16757282 21390172 28525185 38676007
12598 38676007 52477023 68448978 79655276 79491186 71339484 61265406 52949517 47121959
12590 47121959 42726357 39331761 37285857 37424635 40540902 45967304 52249595 59233863
12582 59233863 68713656 78277816 79574963 69898087 54968816 40960152 30472320 23412647
12574 23412647 18842271 15927264 13878913 12468390 11480475 10729131 10038334 9221166 8459074
12565 8459074 7706867 6965428 6408990 5992345 5512958 5118796 4789397 4505971 4230655
12556 4230655 3955998 3746367 3626274 3456684 3430343 3445149 3481628 3508694 3544130 3535238 3680131
12545 3680131 3918977 4263964 4517346 4651917 4635728 4461847 4187872 3901175 3795416 3626051
12535 3626051 3369822 3008400 2904627 2849257 2805782 2745032 2688039 2609597 2527176 2545720 2607162
12524 2607162 2663143 2827359 2946868 2941107 2857018 2764331 2710500 2604978 2496025 2418012 2316934
12513 2316934 2181379 2218190 2160912 2034606 1876928 1638637 1628507 1546891 1423890 1415257
12503 1415257 1331897 1224081 1166069 1185559 1181419 1221453 1263608 1166862 1189751 1169530 1100450
12492 1100450 1006942 996758 969886 968685 912540 987890 1024599 986199 921234 883929 857187
12481 857187 846506 778322 776684 810550 936087 845841 872034 941021 1009547 1050145 970795
12470 970795 838005 775913 940046 979813 897897 756647 757969 808498 755417 727025 721405
12459 721405 765889 777222 744375 696612 671331 699883 889796 975449 926414 889353 914775
12448 914775 844366 933359 979854 953847 902061 924663 874753 859249 798469 771738 830260
12437 830260 889544 808447 686339 833984 973993 958208 1023635 1018979 971830 970781 932592
12426 932592 867256 725067 721425 710836 753257 668605 628666 664260 659223 643165 706133 628856
12414 628856 714314 749952 828290 916622 900582 841144 880322 876521 753441 760904 803095 730470
12402 730470 667503 753747 870200 928139 935390 798063 802871 888723 785975 670756 610354
12391 610354 608890 625251 720806 714931 665821 645137 591345 531898 559855 640188 622204 672388
12379 672388 620761 536752 526692 652921 686830 706625 648544 575348 662580 773364 932566
12368 932566 1054767 1169686 1218976 1348103 1333323 1186844 1122535 1056254 1047377 1070837 1128229
12357 1128229 1112250 1043508 917118 963778 1029344 1054557 1133933 1178659 1204312 1189734 1140102
12346 1140102 1032233 1072226 1023350 1021400 1027444 975922 934343 976464 988523 942497 964692
12335 964692 1054912 1168237 1206262 1102304 1046250 1055862 1148383 1145720 988823 882546 866188
12324 866188 896177 898847 841136 864300 1014403 1121531 1110474 1058244 1037164 1121741 1043509
12313 1043509 859605 780205 646411 474625 508649 535390 568057 484412 520768 575048 629932
12302 629932 541603 471378 459496 396463 395009 471736 535371 627763 721700 824852 964222
12291 964222 1200338 1273386 1279681 1024539 804286 783826 828176 990123 1172095 1171720 1197123
12280 1197123 1157710 1239993 1285205 1461890 1713793 1969057 2017367 1890397 1722899 1608576
12270 1608576 1486147 1455912 1348593 1230457 1201791 1268484 1231819 1108246 1001441 986845
12260 986845 962400 1006354 961992 947018 921002 922273 891624 995326 1052252 1181220 1267878
12249 1267878 1294939 1258778 1271487 1305470 1294116 1218830 1197421 1077575 917023 879026 849069
12238 849069 955440 911872 693223 595868 730981 883842 723547 686498 658786 650422 719513
12227 719513 797367 845262 1003472 1147941 1385022 1519621 1557787 1581567 1450698 1450406 1606706
12216 1606706 1825092 1849141 1923455 2067915 2102923 2146171 2180762 2133358 2102602 2101095 2122467
12205 2122467 1968108 1966224 1857800 1685221 1637206 1588030 1508503 1436061 1453952 1548411 1701989
12194 1701989 1673707 1672610 1726835 1814815 1842311 1969389 1930744 1737688 1570781 1456533 1384236
12183 1384236 1274135 1262304 1240448 1233134 1236734 1222066 1183850 1083413 1068049 1108765 1093068
12172 1093068 990162 878509 901233 856499 937029 891162 853146 841062 885072 772149 685453
12161 685453 666351 604833 486736 472161 568992 578284 535345 566351 518974 478036 533055
12150 533055 525690 620297 726273 759536 816667 928978 970007 976491 892244 861400 901353
12139 901353 1023327 1145121 1100962 1076487 1114408 1096957 1070743 1079547 1148886 1206256 1216692
12128 1216692 1087027 698656 571558 643342 577947 625191 672349 671001 737732 701271 584951
12117 584951 528713 600050 710789 848424 948546 1028549 978112 965631 976393 875971 784795
12106 784795 744975 733873 661974 716515 690181 629162 659921 666255 617432 564881 388940
12095 388940 359905 288899 255765 360080 316808 303949 433136 510254 381305 340904 220311
12084 220311 94937 165986 264784 187227 91836 103450 207292 271366 332076 253825 173046
12073 173046 202016 27782 -10383 130574 153555 180066 268552 228557 137119 153625 238665
12062 238665 263080 263477 193104 212561 218135 180172 121194 144390 162284 169266 190237 160054
12050 160054 246160 254404 147356 130814 210930 325619 332810 420875 368008 220913 108014
12039 108014 67610 130422 190442 207926 181325 122380 127217 217091 253417 201745 93234
12028 93234 135340 224181 264963 277374 232324 230615 256280 180326 168290 261616 402324 382718
12016 382718 404005 381764 270883 208335 260527 204956 111956 119312 37345 67581 111883
12005 111883 26736 75362 46620 13370 127353 269171 212055 159718 269768 246803 255364
11994 255364 296198 233616 280995 280216 263692 219693 106898 37295 31307 167145 275801
11983 275801 244013 219898 155564 173071 237850 283502 310275 249444 228442 180734 124537
11972 124537 146251 233393 140053 63813 -25902 138635 149240 81276 1411 -79705 -93745
11961 -93745 -73903 22509 27209 51545 65853 76915 82581 100942 81262 80454 118835 116160 183208
11948 183208 145952 -18748 -126095 -112139 -45383 -58543 -32314 75935 112814 37046 59730
11937 59730 14811 34793 229841 266782 160127 79475 97789 182137 218514 168057 -10304
11926 -10304 -49099 6712 10052 -12629 72906 158043 -5188 -48603 -64441 -51585 -17465 55086
11914 55086 21218 46759 156647 186591 184106 248710 145395 154367 162948 144774 117600 119225
11902 119225 174787 291265 313240 164600 116094 101188 145672 170967 34357 42875 156777
11891 156777 219424 198005 204392 159205 155419 249436 215545 60825 42632 200996 185293
11880 185293 60587 81280 153560 172934 76743 137603 168695 133448 134819 179887 214493
11869 214493 188091 257550 237454 130417 114036 81223 182207 244743 171486 232762 282721
11858 282721 264662 229160 145268 131526 114144 111776 145925 132611 135630 82516 129118 152776
11846 152776 101638 29336 56185 130174 105591 17072 -64383 -97462 -98131 -123035 -149929 -78020
11834 -78020 -28659 37853 126055 201709 239793 115948 43285 -753 -86645 -103780 17181
11823 17181 220851 195639 4724 -132940 -76574 73974 207632 248323 201101 35443
11813 35443 -39278 121039 79157 20559 94217 69300 58085 50774 53202 86537 48548 -144435
11801 -144435 -86824 76886 47026 34709 231497 207565 181140 225765 283870 196108 80733
11790 80733 62544 51436 109611 246967 245636 175963 153084 158324 206139 252422 164780 38317
11778 38317 154160 307247 315699 267111 208960 190068 220796 196772 194583 164721 51836
11767 51836 75356 4121 -17842 37292 90955 66426 27779 -43631 -83625 -29470 12392 -57652
11755 -57652 -93744 -128048 -9680 75388 44218 -38270 -44687 -116950 -103694 27258 -2620
11744 -2620 35383 82771 18786 26443 -2057 -14579 -37510 -45234 6786 -34013 -40937 -58843
11732 -58843 80548 137176 135838 138972 123721 52211 26609 45630 88636 2052 -114960 -170650
11720 -170650 -176888 16151 92365 75689 -11482 32666 18131 51137 171039 237937 182694
11709 182694 143849 134277 137120 209383 259069 223325 118557 114690 167687 25335 81921 86333
11697 86333 -16487 -124926 -171825 -128352 41674 39808 -50411 -106933 -62213 -63470 -114145
11686 -114145 -238647 -210613 -57784 20989 47314 101112 -40228 -25994 70097 150677 121281
11675 121281 155217 65248 -1968 111948 78877 52099 125204 268515 253814 127745 148927
11664 148927 154852 19022 -47757 -2987 49477 11416 29872 62117 86546 52752 62157 95221
11652 95221 97020 132011 94177 98648 38370 133747 -21773 -88191 -15938 -16145 -182646 -166414
11640 -166414 -46665 -8396 93436 120729 42529 102666 38516 37218 36946 83821 194173
11629 194173 111164 8234 56271 34151 47445 115591 55535 76138 -11065 -86836 -75524
11618 -75524 25012 134962 79550 -26651 -89088 -119756 -81249 -42847 40040 44029 66265
11607 66265 39517 47176 194645 132327 1795 -24923 14972 21493 44129 -44643 -181580
11596 -181580 -168224 -46599 -114277 -135218 -38620 -86753 -105665 -18160 10868 -12178 -29396
11585 -29396 31285 27632 -86763 -119386 -96885 84029 153820 131311 66932 116557 37091
11574 37091 -430 33473 11059 95894 140506 51151 -80223 -77303 -70264 -29305 70483 56091
11562 56091 70242 55641 -3581 -46854 -33923 14231 -45054 -114382 -40292 21947 49194 53584
11550 53584 98932 134244 38763 71893 19944 -25582 -24341 -157406 -225979 -253314 -265337 -349286
11538 -349286 -153566 51453 88595 -12518 -67630 6981 -35892 -112107 -109305 -83345 -52901
11527 -52901 -117985 -165568 -92678 -1411 13410 65662 106357 215752 163617 72371 6704
11516 6704 148032 257309 245241 165015 85747 -2621 -103786 -179291 -177721 -95944 -77574
11505 -77574 -37821 -49358 1129 -8539 12051 19459 34868 74186 -69855 -64921 -32894 -24543
11493 -24543 -37525 -74541 -111077 -82034 -72717 -77654 -73008 3767 188561 187128 159280 -49226
11481 -49226 28248 69419 5709 55007 -28 -54504 -34615 -5446 151684 185601 138994
11470 138994 59875 35082 94195 117447 -32965 -27071 -5663 -72487 -37008 -116904 -27210
11459 -27210 99020 166784 106413 16166 7057 75680 62781 25680 22095 45715 85344 109033
11447 109033 195928 158032 48253 -32464 -33185 55932 74770 64066 -38087 -115054 -148954
11436 -148954 -117759 -32270 106815 61761 -30324 -40178 -32210 -21992 -181351 -286429 -182512
11425 -182512 -87710 7561 -1068 -47916 -90117 -8146 10235 -38445 -80787 -40882 -68555 -148852
11413 -148852 -153969 -63459 38009 -10746 -50357 -115632 -196339 -137008 -42497 18485 16212 -3101
11401 -3101 33175 43000 58720 92561 -18571 -144466 -112941 -155958 -130500 -71408 -32569 60010
11389 60010 51410 -57445 -140710 -14837 104679 -43597 -146618 -96308 -157651 -155139 -77810
11378 -77810 11720 19617 -51328 -119330 24626 136492 115485 153506 144146 153637 76480 54747
11366 54747 139993 109224 87663 106724 34234 -89241 -129861 -141152 -146577 -175934 -160298 70185
11354 70185 111554 115322 159484 75585 -11439 -40589 -169819 -223080 -134441 -30918 100479
11343 100479 216907 231192 234909 174482 56210 9205 -35640 -38740 1443 -62471 -89333
11332 -89333 -93952 -73301 -183941 -204970 -96943 -23906 86083 148637 205141 307921 233353
11321 233353 44749 17320 53567 82444 85273 -17791 -76800 -55337 -140862 -187462 -89610
11310 -89610 8380 19591 -16094 -157689 -268554 -226988 -270454 -218507 -126850 -54114 -118173
11299 -118173 -229976 -296910 -118632 42574 32243 -107611 -151649 -98993 26099 -57387
11289 -57387 -118501 -116074 -97180 -117341 -44262 50052 -74007 -6168 18879 -64915 97212
11278 97212 111102 165334 175623 325251 243003 159376 169667 92394 28623 -901 4894 -391
11266 -391 18028 -79477 -158925 -10020 -84686 -105540 -38405 -80557 -55912 -31779 -47682 -141912
11254 -141912 -274061 -174428 -46352 -9627 -4350 -127966 -153654 -44206 6716 19064 35392
11243 35392 102320 138378 105986 41036 8171 18690 977 -29359 -78118 -69167 -128732 -15027
11231 -15027 -34661 -130754 -98733 9164 39227 15253 -59249 -92169 -137162 -72075 12790
11220 12790 41511 55257 58510 -71196 -213224 -153160 -143987 -137070 -111633 -38913 78223 34510
11208 34510 -144320 -117044 -76500 -27154 16691 9989 16598 -3040 -49355 -123445 -13296 -5613
11196 -5613 -148799 -69735 77838 21033 8246 47675 -23988 -37948 44755 123829 59382
11185 59382 -11812 -134122 25049 139642 32277 18186 101214 109789 113117 49711 -348
11174 -348 -17580 48085 75121 115155 152199 103339 37941 131060 92413 151861 164903 17084
11162 17084 9627 141290 203165 239889 64786 -58711 -121591 -992 22365 76534 -41382
11151 -41382 -52963 24249 -129396 -326152 -272200 -109317 -170556 -230257 -268507 -201976 -68393
11140 -68393 -7285 -44917 -23523 -12725 34571 24378 38998 115107 126854 134729 -2265 -13974
11128 -13974 81573 130699 8325 -177421 -201708 -179865 -226188 -221791 -236903 -172279 -84856
11117 -84856 -66435 -50249 11817 117538 131533 39668 -25175 -104779 -170829 -283877 -318442
11106 -318442 -79690 64399 -8669 -101074 -182344 -196324 -175432 -121300 -122912 -130717 -115291
11095 -115291 -86286 -11715 6502 -26701 -46235 -77982 1955 61603 29730 115149 155388
11084 155388 26998 -98584 -6121 64785 -3009 29341 97098 70729 -156537 -137892 -42493
11073 -42493 15684 101070 8351 -173684 -166224 -145792 -75900 -18252 -82107 -112569 5868
11062 5868 62101 -13566 35332 22434 35634 80119 49195 -44785 -113562 -57195 -34682 54308
11050 54308 25421 -76572 -34215 2899 -113110 -148257 -77606 -81908 59269 21473 -85292
11039 -85292 -137029 -96260 -103469 -61612 5766 8888 26615 -37083 -87889 -129556 -89426 -142007
11027 -142007 -178901 -106215 -196301 -82630 66725 21296 -24710 -113151 -174836 -173223 -134563
11016 -134563 -112236 -133991 -88011 -110693 -113385 -4488 -72400 -145372 4122 -13358 -134684
11005 -134684 -160697 -176093 -152854 -145023 -79086 -54101 -5662 -10645 -121135 -155460 -94448 41833
10993 41833 3491 -185774 -121211 -24166 -16454 -63603 -45477 -59973 -120423 -154558 -194794 -194018
10981 -194018 -299314 -260382 -188690 -195653 -162978 -252549 -293758 -196698 -141232 -130811 -114758
10970 -114758 -68368 -114889 -174791 -155862 -104439 -33360 65289 63410 -30351 -73827 -238051
10959 -238051 -370601 -427326 -270556 -126734 -104554 -47349 -101898 -202150 -190778 -162700 -83631
10948 -83631 -84359 -151858 -300189 -301712 -264399 -149073 32241 118933 107497 89363 44195 20248
10936 20248 -12794 12182 65484 199596 225486 235371 89159 -61876 -45819 -56076 -125497
10925 -125497 -79484 -79682 -129518 -111172 -23084 35483 107298 203027 213972 202881 241233 168837
10913 168837 -48451 -73299 60646 48659 -38203 14675 28509 23259 -76968 -125555 -12581
10902 -12581 50576 -15854 -154266 -214915 -181651 -135025 -169060 -239568 -144795 -41424 78695
10891 78695 26408 14131 45048 25903 3079 -1679 -49186 -89315 -66241 -143235 -270394 -258303
10879 -258303 -139898 -147721 -297307 -262094 -234798 -218335 -213629 -176106 -59598 -70077 -62010
10868 -62010 -85236 -126783 -153700 -172259 -167418 -169220 -222784 -391854 -351098 -101989 -2373 -82300
10856 -82300 -250633 -306710 -294835 -134431 3760 -57665 -102157 -47861 -123800 -115694 -174524
10845 -174524 -158770 -63717 24331 -82421 -172780 -111543 -108217 -176143 -243994 -269154 -309130
10834 -309130 -246048 -147291 -143538 -103987 -157582 -97434 -1075 -16327 51147 66935 58658 16082
10822 16082 -20094 13746 2558 -52813 -152756 -228614 -171593 -201972 -228925 -124370 -24856
10811 -24856 118477 80957 -86207 -225635 -229442 -126740 -21048 -25833 -122508 -121895 35940
10800 35940 90452 -50813 -167581 -71747 20547 -32691 -86789 5834 66468 -38375 -27069
10789 -27069 -3767 -7363 -45322 -52431 -76889 -187872 -204071 -112296 -94391 -97436 -196426 -206937
10777 -206937 -141518 -129281 -109155 -72129 -11968 -45174 65940 78188 -40160 -74373 -98427
10766 -98427 -42867 46117 26547 -2419 4138 -78384 -101441 -121489 -102317 -169759 -178968 -202210
10754 -202210 -184639 -135945 -22822 36708 48052 -72572 -136203 -148350 -133356 -106219 58536
10743 58536 139787 115447 35473 5705 36622 21003 -76261 -136305 -227695 -209568 -239138 -173010
10731 -173010 -183753 -197422 -103725 13279 62496 -92839 -144358 -197482 -164603 -63493 -81063
10720 -81063 -24466 -80693 -199338 -85958 -98479 -159961 -52330 95335 55544 -17108 -15769
10709 -15769 -33158 -29436 -108353 -164506 -133835 -98318 -6132 -7737 19453 -15184 -69519 19598
10697 19598 108274 46976 67754 80584 -18942 -86935 -251223 -192622 -101506 -50590 -43064 37362
10685 37362 -3209 -73385 -129756 -181243 -187005 -72504 11606 34008 104432 51666 103830 238716
10673 238716 132365 106513 169937 54058 -44346 34129 3852 -105926 -240895 -204181 -129173
10662 -129173 -2480 97177 85272 78039 87721 81459 75928 205725 283924 324881 295182 200692
10650 200692 128302 135539 42203 -17214 56038 73872 147963 203323 112904 28649 34115 -66924
10638 -66924 -144174 -171149 -45563 103127 199249 206148 143036 125226 149050 234259 251302
10627 251302 280473 354232 393799 366008 323111 343476 250804 308992 184682 142124 128309
10616 128309 89025 136793 157108 143268 194283 220795 108656 63464 200562 160866 1500
10605 1500 103292 207970 98313 54325 238248 355456 287710 318364 484339 567228 513460
10594 513460 384507 322623 422320 357753 310996 274916 220682 175781 50451 -72076 -53105
10583 -53105 37724 139949 102950 16875 -76556 525 46548 108473 197448 93992 -79551
10572 -79551 -108458 -139144 -75093 25762 45382 10452 12950 -8201 29164 137138 158539
10561 158539 214246 280034 268876 166019 150622 262052 320078 328513 363934 322038 186170
10550 186170 129192 115465 190620 280676 234018 217539 227498 256114 353521 535440 800170
10539 800170 959341 950564 841232 743085 595360 397850 434846 349641 293907 356690 300199
10528 300199 208329 282120 486336 566888 634806 629126 476560 265204 180650 31855 -48393
10517 -48393 53652 84414 190613 169360 164948 292792 380174 459787 655222 754111 802053
10506 802053 715691 594716 498405 370114 323307 354108 282277 169074 23102 -65112 -38904
10495 -38904 62594 40692 -59480 74718 237574 239735 126617 50705 110553 183282 244382
10484 244382 193745 196653 339583 294722 334778 315167 228953 225414 248482 255892 294682 454411
10472 454411 604003 657088 753567 802960 795996 745094 623756 529611 403552 272460 195123
10461 195123 84888 89543 74239 19298 132562 203333 227094 333778 192290 118641 111511
10450 111511 161821 172851 197920 268988 393152 406759 447427 402688 386860 479662 609142
10439 609142 707754 696597 752018 677582 678132 606679 533629 378899 341161 364188 385383 384297
10427 384297 285648 139965 154654 200073 309709 285827 181747 256373 309585 398679 345890
10416 345890 114781 47195 -40343 -92303 -52313 -39492 -21700 74192 74703 -16479 23467 -7607
10404 -7607 45227 -15998 -35892 74926 145954 154193 168355 114078 348 39324 11787 41560
10392 41560 141099 177890 122089 145943 250010 96928 72591 44350 16131 2538 26796
10381 26796 -230 -102147 -182445 -204387 -111794 -97713 -142010 -114041 -99286 -13376 -33894
10370 -33894 -110776 -190518 -130002 -104688 -153181 -58146 -34205 29350 63277 119254 166872 224098
10358 224098 129170 110928 150767 130209 51836 156660 198015 259208 337612 424339 634788
10347 634788 727984 879076 1153877 1105056 1142249 1145378 1145401 990973 795083 747299 539271
10336 539271 377929 190472 49922 -10275 -23090 47906 80139 -15772 -74915 -140360 -116383
10325 -116383 -55481 46335 74017 59248 135776 135117 107599 81746 112649 89675 -23862
10314 -23862 -16185 -10868 -61844 -123380 -187606 -95413 -69286 -79062 91202 156513 231089 247187
10302 247187 237176 149007 39978 -5443 114709 156289 270772 391979 393880 482485 547346
10291 547346 707144 1002147 1255441 1280678 1288620 1226211 1102327 916760 739893 715712
10281 715712 658946 555807 451148 403545 424951 627261 879686 1233119 1458486 1550704
10271 1550704 1591704 1477495 1386460 1235877 1006939 855825 813069 909456 925217 930818 1006635
10260 1006635 954056 996681 1049273 1070594 1121721 1058435 899953 886822 1001073 1041613 909367
10249 909367 841932 804651 795021 803204 743231 734265 931862 1105892 1391889 1817638 2234433
10238 2234433 2538730 2774214 3019457 3442487 3765858 4172892 4731709 5303583 6138499
10229 6138499 7333287 8655679 10058592 11981905 14680493 18087669 22599855 28680017
10221 28680017 36684816 46142602 56324181 65275514 69508504 66785961 58754293 48981696
10213 48981696 40112832 33215699 27953438 23798815 20228716 17224064 14979257 13360865
10205 13360865 12555148 12161232 12104782 12367209 13080190 14207863 15527621 16739734 17684034
10196 17684034 18812874 20187026 21957850 24062921 26638488 30178716 35277605 41752887
10188 41752887 49039054 55842786 60078343 59793112 54695260 47349759 40282726 34606668
10180 34606668 30333506 26901307 23854702 20812823 17910892 15245175 13151124 11720295
10172 11720295 10644995 9917315 9644376 9560356 9461591 9384840 9286380 9056988 8848859 8896400
10162 8896400 9365959 10174830 11474229 13303984 15554814 17940027 20166806 22318783
10154 22318783 24287429 26379535 29364986 34031887 41017503 49358897 56527641 59795078
10146 59795078 58867459 56134381 53209028 50736637 49362903 49458693 50673179 52459680
10138 52459680 55111484 59180107 65285306 73874331 84610337 95623149 104705184 109133391
10130 109133391 107032165 100115858 91865767 85048447 80243547 76074935 71820814 68391464
10122 68391464 66063338 64545449 63774693 64538667 66956867 69817367 71199463 69839628
10114 69839628 65815204 60884454 56760480 54035225 53235172 54530209 57073604 59930751
10106 59930751 63095387 67590824 74212480 82326059 91006181 98860493 103211060 100600157
10098 100600157 90600947 77725940 66386759 58409271 53260964 49682082 46207209 42226275
10090 42226275 37831887 33346293 29190547 25574243 22715543 20872321 19855895 19516837
10082 19516837 19515986 19763464 19626648 19317963 18908678 18455883 18360033 18878409 20049300 22111447
10072 22111447 25242103 29380107 34313866 39774374 45136848 50617173 57312138 66305434
10064 66305434 78246193 91600157 102625456 106336362 101712838 92535387 82010614
10057 82010614 71942423 63235438 56537125 51403651 47005502 43255055 40082757 37402966
10049 37402966 34644422 31493351 28445880 26137048 24660588 24101105 24313837 25085657
10041 25085657 26254159 28013456 30840984 35204112 40899596 47923481 56449788 66950592
10033 66950592 79970903 95020910 108715388 114944732 110723358 98456334 83346275
10026 83346275 69282105 57519071 48100398 40815835 34883593 29921436 25902245 22698337
10018 22698337 19964753 17495140 15538206 14134159 13149682 12463307 11826834 11289210 10675526
10009 10675526 10038888 9291015 8392944 7491145 6892434 6358872 5998280 5652750 5464901
10000 5464901 5318084 5131961 4996119 4923901 4737445 4569046 4417242 4333485 4305883 4194831
9990 4194831 4244950 4166684 3945335 3752168 3488198 3221365 2981050 2857815 2821761 2669560
9980 2669560 2591314 2535358 2445375 2408463 2449933 2404679 2410969 2551010 2654279 2674152 2750473
9969 2750473 2728623 2708019 2567080 2358006 2217631 2137316 2091925 2020302 1930032 1711235 1599296
9958 1599296 1708670 1552610 1563240 1646770 1514332 1430267 1408066 1444024 1429667 1467863 1515001
9947 1515001 1587155 1637540 1637740 1598119 1670864 1698582 1747383 2006572 2394476 2632106 2583421
9936 2583421 2412542 2288336 2256297 2304498 2224287 2090498 1966759 1846351 1942437 1907220
9926 1907220 1666763 1577319 1574594 1659380 1720741 1728514 1707666 1741086 1770978 1773993 1875259 1907061
9914 1907061 2035501 2192014 2417156 2684770 2883689 3295785 3732860 4045127 4473939 5162508
9904 5162508 6033158 6931517 8293400 10255970 12860858 16455780 21109860 26805190 33050872
9895 33050872 39300215 44718142 48852585 49987129 47300156 43562939 42216954 44452915
9887 44452915 49529422 55193590 60032725 66392646 77964708 95589915 118042103 141949620
9879 141949620 162015934 174647735 180522745 178062533 165657977 148105756 132882286
9872 132882286 125754393 127816988 134572944 140158821 141683936 141718390 146905734 161832101
9864 161832101 183135223 198358070 201146632 195800559 181807371 158657823 133955116
9857 133955116 113449810 97536611 84966865 75435985 70075330 68491083 67923950 67270856
9849 67270856 68404512 70651063 70391487 67760239 64030357 57278872 47590088 38150920
9841 38150920 31010315 25813414 21703954 18367496 15746938 13660765 11996103 10705038
9833 10705038 9874514 9235466 8555304 7998483 7536349 7076566 6717264 6409432 6185946
9824 6185946 6065818 5974832 5926979 5870214 5861510 5914005 6081513 6559865 7092941 7869377 8908574
9813 8908574 10080480 11584883 13723045 16977781 21675416 27758054 33735957 37524553
9805 37524553 39434036 40701919 40175486 38130096 37173923 37369535 37191185 37384350 39863878
9796 39863878 44980477 51860813 60902473 73445472 88533035 101751235 109123060 112740738
9788 112740738 112814156 105346529 93926811 86186167 83368468 82202037 79505543 74829877
9780 74829877 70469459 69412500 73370448 81417447 90370650 96485150 97894665 95735986
9772 95735986 90548900 81186835 68973780 57259746 47874981 41504811 37548542 34388096
9764 34388096 30893517 27806538 26260646 26518153 27802080 28763420 28115008 26056299 23192130
9755 23192130 20203363 17093938 14237671 11876533 10106385 8778007 7722665 6816967
9747 6816967 6115875 5535558 5131398 4871841 4685345 4337744 4056824 3929663 3879812 3752971
9737 3752971 3826234 3888736 3936657 3968865 3800973 3564998 3367979 3120046 2992927 3008860
9727 3008860 3082589 3137885 3155638 3231179 3424372 3683568 4004067 4349123 4693256 4824661
9717 4824661 4726021 4617786 4302724 3892148 3615755 3581386 3618821 3615471 3713278 3803867 3878705
9706 3878705 4039154 4137428 4125510 4134656 3980983 3629127 3261395 2845878 2631988 2513668
9696 2513668 2447991 2414698 2299626 2235760 2315811 2343094 2513135 2709046 2775511 2676925 2538276
9685 2538276 2228201 2095567 1873734 1668411 1507245 1371948 1357488 1539862 1552831 1451010
9675 1451010 1326013 1248882 1209530 1235442 1231315 1178028 1218027 1208605 1136748 1179190 1209376 1269301
9663 1269301 1195292 1114961 1211123 1268434 1302616 1381861 1439030 1403686 1205810 1151262 1192508
9652 1192508 1408673 1852235 2131548 2287024 2231126 2268012 2339060 2173535 1915809 1823288
9642 1823288 1774367 1713040 1589461 1503143 1603037 1770813 1903643 1932649 2023023 2170716 2433711
9631 2433711 2520236 2586702 2415127 2160610 1951779 1905456 1886422 1889780 1975420 2010508 2160163
9620 2160163 2280154 2498868 2733458 2789602 2732557 2502048 2231732 2119455 1999164 1815595
9610 1815595 1523201 1330990 1293870 1198061 1124115 1028601 938659 829322 908369 1027623 1052490
9599 1052490 950282 908838 887946 719586 728575 786415 714097 726067 737569 691776 657994
9588 657994 603310 509645 597413 662917 663840 625750 531050 587284 584493 587684 604028 599733 582409
9575 582409 530852 539759 531127 568356 620744 780302 855788 760730 631447 704562 669095 531314
9563 531314 646249 757243 703762 603307 459892 432230 471982 527478 575820 475639 359210
9552 359210 397577 451791 516881 528058 675169 711720 516257 536887 627954 699675 726502
9541 726502 679103 621308 702325 695493 645310 565784 522733 572515 519376 367799 407636 451106
9529 451106 486729 472004 380782 394264 537180 606232 649295 531283 418932 417923 531714
9518 531714 714044 793936 762702 661391 617213 546586 523462 450092 411364 370387 332894
9507 332894 338879 374444 418222 461280 502689 417197 436795 520784 513890 563252 627582 587280
9495 587280 617544 471095 375303 249779 271994 393485 353484 336622 372179 348556 238544
9484 238544 213872 404761 619506 749640 713141 702621 790459 929785 923562 908339 775650
9473 775650 587514 548909 603483 603594 667061 678997 654907 633867 739178 862387 1041010
9462 1041010 1242602 1416949 1623607 1561820 1396407 1304031 1235023 1066233 845086 775706
9452 775706 753748 769167 839366 1026200 1146851 1329609 1434200 1392050 1419756 1327705 1251516
9441 1251516 1175926 928229 839056 808864 665145 688024 685280 590821 478885 386233 451206
9430 451206 567333 753309 748370 762165 691423 575637 393918 437771 450701 409742 359596
9419 359596 372716 419956 398100 420590 309314 235829 225744 409276 433096 400949 450797
9408 450797 401703 424287 389335 325207 414512 390831 340294 330113 317324 375035 376767 289001
9396 289001 243518 309498 284533 321839 494908 477820 513020 442617 328244 346531 526605
9385 526605 570279 528270 501387 472575 451240 565576 579330 599081 663717 749851 899037
9374 899037 1087768 1089554 903583 866759 822361 747032 565748 507154 433373 450803 459153
9363 459153 511691 623359 753431 797249 774333 776639 874966 859991 825119 719857 653549
9352 653549 675590 528014 412582 470986 401960 331202 360463 362133 360327 387209 394524 319056
9340 319056 356439 400117 500741 463093 358850 368165 535978 560804 479938 408754 356241
9329 356241 452786 473743 517271 464731 432847 408090 353114 410004 384232 371001 303733 304964
9317 304964 261880 263549 257024 242202 197723 114294 95078 165414 270383 421645 387400 337612
9305 337612 335157 397861 396782 402194 459960 433818 376681 316767 277496 345796 315219 461265
9293 461265 494399 508199 471777 520176 691473 691391 537183 471529 404900 351357 346474 333974
9281 333974 318357 245200 216213 239320 324580 179942 113610 212823 152498 182670 281471
9270 281471 382657 326784 232982 374639 416055 359585 287941 337680 302537 213119 277708
9259 277708 381119 432388 409046 316128 366631 320202 346486 293977 273439 171341 77569
9248 77569 99430 199582 208177 152207 75291 81736 177506 224863 260219 337731 440160 420963
9236 420963 283609 251135 225057 212168 180293 134632 274836 328478 285823 353144 322284
9225 322284 241197 263141 176665 59078 79240 205908 265955 221159 127612 115072 117494
9214 117494 215595 288059 357736 431199 391465 254823 164636 170298 270990 243519 253494 239958
9202 239958 153768 122436 130011 51414 24130 82871 301050 433191 439001 234723 171497
9191 171497 250019 244667 314247 271110 253849 253998 341022 339355 365304 309506 230932 205417
9179 205417 161541 116786 157843 115109 96871 179617 230529 310092 303095 298767 319260 232377
9167 232377 126990 211885 130034 150229 147889 117704 173385 315035 294271 240196 254138
9156 254138 198406 188070 335966 396896 285229 223215 200957 142778 246670 331840 280449
9145 280449 203396 280499 365451 379246 272633 276546 222881 304770 475690 475293 442878 535753
9133 535753 625914 584434 443955 524416 702031 754155 671887 614423 626248 510542 496694
9122 496694 555056 723322 858027 789809 919297 1113133 1173188 1348228 1595080 1742822
9112 1742822 1887571 2060484 2452825 3003022 3664569 4330847 5242313 6607010 8468216
9103 8468216 11508423 16509325 24509187 38278044 61765686 96301798 121443251 106608042
9095 106608042 72605098 47004279 31621628 22340981 16620902 12923027 10267702 8198695
9087 8198695 6694495 5716659 4941618 4479812 4144640 3767085 3400730 2985926 2611006
9078 2611006 2420720 2271615 2085765 1967895 1708306 1695436 1624655 1544765 1365973 1166472
9068 1166472 1135406 1133196 1021756 998306 992956 955666 847422 715112 668791 731970 764892
9057 764892 696183 725169 772397 597707 533730 648571 700982 670111 671583 675751 613468 704540
9045 704540 704983 591234 455187 458864 564850 455322 307813 366365 433193 459049 495876
9034 495876 440838 448249 443661 455735 582351 586064 588648 556294 569353 573641 540015 489203
9022 489203 444499 359725 363154 324828 444528 577198 546595 495488 494141 509941 337410
9011 337410 367749 365338 308221 233383 282852 327192 253725 211218 247424 398844 585761
9000 585761 550758 381408 313007 270386 314961 445786 416448 264943 265846 231207 232674 324883
8988 324883 399836 438839 337840 284876 389866 461164 368211 383120 336761 388308 417412
8977 417412 387213 279651 149882 109515 281645 469452 560621 613186 580674 481794 430767
8966 430767 319116 325906 378340 337657 322656 326544 314783 272236 177998 204937 131851 71868
8954 71868 53267 116588 162986 273114 279619 235412 336182 357674 394966 382990 244905
8943 244905 397944 488078 371958 310693 351624 337428 295657 321058 432783 446498 246029
8932 246029 19803 41713 226361 305683 255805 319568 349338 286661 234136 197616 286404
8921 286404 281217 108176 132065 193714 40280 89364 215107 204546 123140 149098 203033
8910 203033 152033 69592 50922 79387 96823 821 -28480 73156 159697 69737 115043
8899 115043 189288 184069 280826 356445 401825 267275 52177 37285 221836 283556 208626
8888 208626 202517 241313 392278 446715 339701 317850 186070 122767 186816 112970 221324
8877 221324 304549 312898 279721 236796 220376 160978 147254 144854 139261 89736 -17686 20988
8865 20988 117484 190989 283601 265948 232756 195187 112426 42735 105467 137911 104830 57951
8853 57951 -51678 20930 74600 12819 66447 153380 259392 220134 198611 191862 181665 216819
8841 216819 196434 238351 277762 263556 299809 306024 369164 313736 141242 44093 95020 81859
8829 81859 57122 38779 156122 171245 170425 137191 209346 212161 150735 114309 77908 78560 190113
8816 190113 192740 226172 174687 283561 188602 157395 153632 252971 315466 331223 324272 231757
8804 231757 148655 141766 111417 3327 25578 158597 396595 488977 435195 351350 267290
8793 267290 191165 209964 233355 137014 101193 125443 125183 101575 -17775 -56619 18478 28578
8781 28578 55439 36141 29826 90693 -24526 54963 91695 59851 -4469 -36729 -133272 -104433
8769 -104433 -7161 70949 156005 134388 143959 153970 126006 195579 197349 4194 -39934 -19082
8757 -19082 13201 110089 133895 243878 367975 360527 176001 68558 125313 128676 140856
8746 140856 225882 215217 46689 65285 61509 -42109 -38197 27437 42366 67032 -14899 -11218
8734 -11218 -39151 -53059 -103464 -71841 86656 138786 36573 45304 -20273 -159443 -145918
8723 -145918 32312 139076 125983 89163 41854 185559 425502 509026 276786 142491
8713 142491 233733 255222 215853 257566 223995 146796 94989 42559 106021 221526 228991 108550
8701 108550 89855 -4265 20149 83214 166126 190999 135106 164920 165974 141897 164224 79005
8689 79005 36978 161798 313671 330236 122364 57480 168022 158471 -31630 -65529 -90940
8678 -90940 -86750 -18242 125679 291261 337573 237692 107235 53553 61880 123705 113189 94651
8666 94651 109355 178743 237680 281202 254131 167517 120868 126006 231162 249248 266311 300625
8654 300625 346281 297779 321909 345009 324147 318045 287281 282051 194352 179861 170673 163534
8642 163534 155864 279546 294690 253202 324784 297915 246108 241647 263540 379501 398572 253578
8630 253578 202273 234624 287043 265623 199528 141156 242656 308727 373497 383321 303260 237384
8618 237384 224516 257556 336660 459013 306701 124807 103429 143524 306830 435172 438439
8607 438439 361733 282009 187039 215606 300878 321417 236578 167367 200651 309921 357798
8596 357798 360408 378253 318760 345748 449860 412419 231463 157265 175186 249004 333928
8585 333928 406443 501372 471072 452512 372103 287538 229609 116251 120207 164032 177122 160340
8573 160340 172803 362065 402521 308754 209680 124121 132031 247732 320881 369849 267387
8562 267387 62077 9941 108672 244369 294041 188612 151402 174887 149092 251734 293349
8551 293349 222198 280046 236419 157709 196469 99596 100742 277168 201376 238297 161289 83075
8539 83075 106274 137940 176995 136605 92894 91220 160756 167372 194143 84871 43882 177593
8527 177593 133869 42023 18157 13531 151427 167079 53228 -5165 -134490 -73082 -15168
8516 -15168 40103 42949 115549 124342 41262 16456 6531 102570 224782 161163 205462 373815
8504 373815 270275 74574 13977 4067 53148 108131 73140 44601 -6681 -82223 -91458 -3002
8492 -3002 -28425 86606 84641 32387 41852 108667 242062 265918 261588 109878 31566 16952
8480 16952 79376 190387 270552 259102 236898 77328 61692 108813 119367 10449 -8201
8469 -8201 2062 42395 5933 130891 131729 126703 71731 90715 -32844 -149276 -138356 -62647
8457 -62647 -61490 -7533 -71821 -77162 114969 111591 173962 224701 198208 238376 228628 291333
8445 291333 352319 320082 190872 159685 107076 68255 144208 192406 144877 117848 64234
8434 64234 60304 87056 128821 231767 172614 46338 24512 133746 105648 109416 199042 285089
8422 285089 250081 223410 123707 46537 -67645 -95993 -11067 99591 136272 13718 -34329
8411 -34329 161544 229089 275911 142395 115012 263431 257767 258746 340273 215963 82046
8400 82046 66032 106071 220529 224174 204136 152631 41660 -77264 -113641 -167515 -126836
8389 -126836 -24757 33705 66229 28352 106212 213015 199887 109935 184558 163468 59630
8378 59630 -89075 -61651 -38450 -8590 -108025 -118512 -98367 -40814 -5980 -64196 43826
8367 43826 59794 39690 117669 148946 55983 -185997 -167509 -83393 -35562 75301 100122
8356 100122 23667 -49545 26496 111820 118159 140816 115464 103889 70413 129643 152230 185064
8344 185064 233090 211816 207497 130532 4780 -72256 -99278 -30501 -17701 -42538 79150
8333 79150 179285 50967 55147 78794 77111 48307 -17402 -46939 -81949 5848 39536 24886
8321 24886 29162 58988 90294 58491 79826 126179 49745 -83784 -7678 152532 202140 205849
8309 205849 143471 70518 188570 265289 292440 258179 273724 227764 44073 -7813 78775
8298 78775 -16563 -34803 -12435 -84689 -86681 -125428 -127556 -50604 -30170 19857 27872 48204
8286 48204 74366 115740 58554 103470 164147 139609 87690 190726 330565 242851 92178
8275 92178 107455 87746 -11783 -10199 606 25639 31185 120416 207298 187822 156921 267886
8263 267886 322429 177673 72928 24023 55578 73086 12027 -12838 -40680 -22016 68350
8252 68350 126311 23207 -96024 -48458 54142 -2120 -23274 -26221 -34314 -86775 -28842 60331
8240 60331 45143 47723 168236 193877 137585 172560 243277 91771 89276 85243 20228 -18057
8228 -18057 -31531 -52984 82766 235919 158748 18426 53546 111512 146383 70357 84408
8217 84408 58716 81896 201287 117761 99780 145292 169239 197668 188002 60520 96679 111941
8205 111941 52742 -147706 -158704 -56044 37094 68912 51138 21414 25572 39294 116453
8194 116453 138633 174973 169547 192286 187657 159672 219142 170752 149030 165888 -44178 -198400
8182 -198400 -151984 -38539 31917 49498 -69438 33289 231948 198322 152354 206964 201738
8171 201738 150396 104613 93071 110380 3019 -57139 -16038 -40400 -78905 -20518 205
8160 205 36164 35444 134600 120204 154462 167457 161499 66635 2489 -42809 32523 99349 114075
8147 114075 118297 81171 93027 58492 18476 -84113 -17718 153341 216686 172197 138207
8136 138207 196708 109817 50389 -41849 -135654 -54730 80903 127427 130417 130432 154305 110724
8124 110724 154446 212009 232237 254924 348963 375933 283562 238911 144895 20314 -110761
8113 -110761 -48443 40861 171925 293993 269017 235754 245730 107768 113071 121867 42907 -6998
8101 -6998 -72829 -49434 80751 121193 -29716 -10862 35490 102308 110779 -1476 31955 65906
8089 65906 40439 40797 595 11141 165701 103786 47303 46680 81372 27179 85087 43454
8077 43454 6658 89372 163407 155370 222646 207701 174286 237191 155382 179496 146884 73496
8065 73496 -20654 -45506 -130042 -128386 -24597 100642 112981 74129 56374 153134 230122 228964
8053 228964 252831 157159 44774 12787 134517 174645 221468 189801 173508 138551 138025 173210
8041 173210 311770 329303 108709 6657 3105 25092 32928 157453 235808 135700 90127
8030 90127 64254 -19794 -30246 74226 166088 78993 64452 143369 110793 245353 346415
8019 346415 387799 246307 169869 261535 239037 168539 22619 36850 21975 89351 61253
8008 61253 139608 154375 67001 -24593 -106049 -111874 -77102 45541 140475 38609 8499 10043
7996 10043 46309 156202 184697 120786 55965 7692 -105983 -171805 -98157 -34750 -132063
7985 -132063 -151627 -83339 -59018 -38864 53364 151561 190165 58343 10636 -7443 220036
7974 220036 366185 392479 277551 173588 62256 -12683 34107 58550 -12103 -36530 -25130
7963 -25130 40901 18913 178670 244991 182433 64327 46623 106836 73049 -66031 5624
7952 5624 86814 138974 168391 218670 140871 87212 84902 113947 47066 54106 171672 221280
7940 221280 193935 121620 29561 49848 -75678 -90485 -40608 -7298 51032 53218 -30331 47546
7928 47546 2746 -24765 -117312 -128604 -49032 28445 207637 250955 222445 15521 -97506
7917 -97506 -120519 -119483 -81855 32927 55243 82284 92668 57301 40388 75255 7168 12409
7905 12409 49399 34818 25626 16472 -102720 -94163 -73274 12285 87353 198049 258352 269898
7893 269898 175977 158996 136742 116648 105723 72683 91137 79161 -30410 -44065 -23995
7882 -23995 26403 67503 41328 116369 118992 86484 52235 14894 10902 -26765 -18573 10427
7870 10427 59168 173841 112204 58629 129231 61085 18711 -37566 -66244 -128345 -114439 56751
7858 56751 171648 185556 141871 119483 30658 -13826 15225 -16077 82745 105538 17355 51541
7846 51541 65101 123139 144398 124207 -33065 -87408 -120663 -99075 -94541 -75139 -72138 -64369
7834 -64369 -156675 -297399 -264120 -120949 15166 -17514 4390 62550 124875 76532 845
7823 845 -56868 -131792 -106964 -98926 -133040 -225041 -214464 -71727 27716 -8670 43264 167715
7811 167715 238373 207281 108032 7583 25770 91853 35605 -29910 24795 80161 79802 44322
7799 44322 27838 17889 119593 201535 129556 169 22249 -90430 -126868 -54203 24952
7788 24952 27319 147295 177076 168620 82845 14400 112216 79147 13016 -38530 21864 32832
7776 32832 117376 134049 108364 264793 330251 215305 140404 80846 74557 -60071 -124650
7765 -124650 -143084 -26054 89122 -24764 -90837 6168 67060 126548 83244 115328 105648
7754 105648 67469 35898 69372 77719 -57922 -78782 24831 104140 135040 231329 252515
7743 252515 219168 145553 89550 40039 7545 -17138 -49121 47189 103169 163653 149981 233322
7731 233322 174195 151767 45885 -2160 27822 14934 39612 578 -15981 29420 203657
7720 203657 221848 151092 125452 68392 -35087 21837 34605 -70657 -89730 -16851 18019
7709 18019 174971 138671 50557 -154325 -140224 6355 438 1020 54586 162792 21543
7698 21543 -69739 -53467 41433 65158 106813 119680 42720 -69210 -73937 -6511 33818 98262
7686 98262 92474 -13576 83252 82721 -34571 -43440 -135271 -185386 -246419 -113150 -28157 -70796
7674 -70796 -127260 -119343 -110042 12480 -31382 -15944 128624 149686 167684 167207 63172 6591
7662 6591 -52168 -212305 -132375 46554 132348 152875 150991 184438 128752 102039 100950 30505
7650 30505 87612 170439 27513 -19454 158419 251006 182696 75481 42702 83245 -155
7639 -155 -96054 -64972 47204 56560 89560 77601 146461 65299 104689 -53157 -89547 -7625
7627 -7625 106671 54773 9561 29466 66442 76004 18399 10415 3194 -38188 -10534 -70131
7615 -70131 -49688 -38915 1783 -80402 -53538 -65227 -127194 -127571 14787 86537 58169 -58849
7603 -58849 -115607 24396 61073 145208 146765 132832 100644 93035 190338 199966 191332 107422
7591 107422 -8402 -16032 -24135 -102262 -138215 -31217 -60594 -64559 -14189 69155 122235 59188
7579 59188 -49467 -72150 -95678 -42093 130951 194757 138673 93176 -7006 11814 -30889
7568 -30889 7615 -40071 -45330 55848 142636 105845 16542 -193809 -82278 22205 21957 46143
7556 46143 -142988 -128083 52587 89793 -71974 -95413 -59353 -130668 -146122 -19304 102105
7545 102105 49002 55076 55427 -19581 -71086 -53737 29093 151455 195207 141924 45492 -88248
7533 -88248 -11814 35145 28728 32807 16468 162088 181370 216281 168894 20590 -3285 92739
7521 92739 68252 39097 67232 131444 72245 41759 87074 170417 275448 171036 49985
7510 49985 18993 78813 45600 113361 84825 127055 90056 -1854 13668 48873 69980 223134
7498 223134 240110 325269 299146 176813 55548 -4002 -76435 14772 41154 82342 7093
7487 7093 8145 57217 22443 -3205 -13641 -58061 -86262 -54726 -23819 -14329 75208 211634
7475 211634 167896 -20385 -26978 -18124 133492 109289 6891 71169 -12160 162837 227174
7464 227174 134181 66995 -26648 -59895 -58665 -32388 -42660 -47823 79753 127072 -67572 -23741
7452 -23741 45908 -27408 -193357 -193848 -39377 80632 47234 44177 66926 55315 5968 -63556
7440 -63556 -151225 -39096 52138 104124 74755 -29859 -89475 24410 5830 -954 53927
7429 53927 -42612 -35821 -29269 -32114 -39189 -28764 -94 7317 -58042 -29530 46372 7922 -24807
7416 -24807 -54487 -23846 98784 110542 46447 55544 56488 -19251 -58542 -42523 -89985 -113010
7404 -113010 -107331 -215926 -282536 -273132 -193910 -151092 -173151 -218454 -98425 -65715 -68253 -19977
7392 -19977 -17030 35718 48473 -6691 6165 -47409 -147049 -67593 42479 -4020 19184 -74952
7380 -74952 -35569 94227 24097 -49275 -94569 -3887 50632 76517 153476 93835 51612 7312
7368 7312 3935 -3330 -15251 26703 108931 105794 121473 74711 -29745 -2750 -22377 -17076 -14249
7355 -14249 -65334 -75538 -46522 -61630 -171053 -202904 -104975 -39842 -16930 53781 130380 112721
7343 112721 -5397 11861 62841 106888 107679 105714 78401 45249 29508 133527 163905 82561
7331 82561 60863 -20588 41233 144874 206309 244896 180811 63312 -58004 -134924 -15601
7320 -15601 53621 19406 -84816 -158813 -206730 -211669 -217190 -141197 -67354 -57232 -55445 119390
7308 119390 46192 -16136 -168642 -240676 -157947 -37523 -12097 -84214 -165641 -117368 -85119
7297 -85119 -34370 47724 42905 160921 182790 165004 137989 137983 76039 -39782 -44593 -33224 -162295
7284 -162295 -165354 -244760 -200079 -110877 -194731 -205154 -133570 -74243 3639 64651 97675 126156
7272 126156 73937 94072 116404 60769 64748 61871 91379 99980 129845 113907 51602 -94202
7260 -94202 -72676 120593 81910 22960 167934 165967 144933 173449 174229 193854 102612 140630
7248 140630 57206 -12459 65809 17417 57938 169688 242228 403878 287283 195275 174789
7237 174789 -22499 -161991 -126985 -10782 46998 116305 26744 19895 43581 99011 48558
7226 48558 41716 64857 132385 135527 95233 31157 -34370 -137651 -165850 -31183 -24626 58768
7214 58768 127331 220715 166859 149144 137015 73398 129169 172989 172251 -30812 -96680 -100401
7202 -100401 -15272 23206 47312 -9363 -19852 -8245 1153 49934 129712 85006 27365 68297
7190 68297 -24660 -31417 -35184 24080 39382 -28425 19021 42538 123508 256117 208282 236675
7178 236675 142559 21259 17892 98075 180924 67531 -111679 -119216 -40334 23283 8358
7167 8358 96478 198488 106041 14857 -9088 53590 120607 198636 113231 -93065 -114316 -39953
7155 -39953 -20260 -51020 -42059 18406 88007 49900 104019 46327 -61789 -113938 -51639 -65591
7143 -65591 -26247 88941 75942 85715 122082 95094 51935 12729 144090 145382 47965 49584
7131 49584 34294 -21251 -52333 41892 62524 -1960 -62041 -58542 -37306 -12397 -55671 -58025
7119 -58025 63593 89163 -42648 -131193 -111782 -29094 -6931 19818 136506 199659 179307
7108 179307 242260 153552 151650 148541 63839 15962 -32931 -87446 -29452 -70035 -122004 -126954
7096 -126954 -31875 67544 187614 136791 126099 -4059 95911 219471 184652 98678 38718
7085 38718 3195 -30171 -35263 64297 33868 -16739 93188 134567 16425 28437 59371 50756
7073 50756 121158 31309 -95091 -62329 -42994 -68848 -59761 -95868 -161256 -119851 -77564 -37416
7061 -37416 88913 138000 98189 82307 86162 -26204 -89475 -91726 -123745 16666 92791 65998
7049 65998 60290 28298 -10164 -48104 -72426 55022 71865 51171 66786 -12558 17615 -19726
7037 -19726 -55487 -167751 -201173 -210632 -197236 -186835 -152233 -60200 -44020 8459 -3572 -41754
7025 -41754 85872 108231 112395 86797 28842 46507 29420 29102 117308 122266 155116 93944
7013 93944 122007 168626 250648 372437 292705 204617 161364 192024 105395 58813 33852 -22274
7001 -22274 -46563 -172586 -224868 -227418 -173648 -208067 -323387 -299039 -180839 -111283 4675
6990 4675 34265 -72663 -90097 -118517 -140997 40389 84732 -17168 -80954 -39992 -38600 -36994
6978 -36994 -72373 -142577 -147392 -141941 -141879 -47906 24873 62320 100281 30123 5303 33755 92215
6965 92215 85637 59145 54955 -20427 -186239 -222970 -1934 133729 172744 126291 34010 -51821
6953 -51821 -115097 -119690 -36595 -2828 67420 81374 -29771 -210692 -108460 -120176 -227395
6942 -227395 -45312 -18162 -47850 -41593 302 109596 42449 47684 30034 18862 29424 133549
6930 133549 166792 139107 53504 152741 142102 89857 158491 182031 170416 173780 136651 72026
6918 72026 73732 -40955 -52497 -58504 -46184 -20484 -24254 -21752 -73699 -72310 47229 36996
6906 36996 9264 22663 -111786 -234931 -268506 -220183 -39738 42166 131616 161556 155020
6895 155020 236359 242164 65167 43172 33367 92086 157342 10231 -104112 -83136 -114414
6884 -114414 -39519 -34338 -25374 -33489 24401 135043 186082 161900 169333 150844 -1401 28521
6872 28521 -27500 -88974 -120516 -36336 46942 73438 30122 -42508 -1161 35739 65792 123514
6860 123514 196457 187922 71244 -60216 -142204 -146255 -211462 -221214 -193627 -240676 -187301 -134821
6848 -134821 -67443 -6053 -4932 -97368 -216586 -199822 -127408 47520 15832 -43145 -56305
6837 -56305 -72331 -110680 -19144 160262 251056 359872 274896 156157 119873 7936 -55745
6826 -55745 -26346 -47475 -99287 -52113 73761 123621 38066 -109781 -177715 -99250 -21817
6815 -21817 109987 248159 276647 142120 86748 73099 22544 107272 153173 119521 -63259
6804 -63259 -189426 -240830 -206850 -206592 -257177 -137301 -117295 -111020 20810 71202 -25819 -27040
6792 -27040 -27436 -68756 -191991 -226924 -259466 -272774 -210375 -113447 -58754 -37464 -4688 56829
6780 56829 104868 7083 -77468 -162030 -198105 -123155 13385 -4925 67626 108482 165428 53549
6768 53549 569 121317 85934 88225 82000 99218 72744 -57652 -60192 -63376 -19782 14356
6756 14356 35787 54267 92968 59625 52079 107301 89819 136315 214194 235411 229596 142161
6744 142161 82996 -3804 46033 73899 96085 89983 183956 324163 407423 341614 219884
6733 219884 320858 370404 342107 382474 502297 641217 844580 1027751 1255345 1608794
6723 1608794 1856690 1515495 922591 595146 551027 431050 285256 117654 69864 51762
6713 51762 84162 -11036 -69659 -109417 -96593 -19258 22363 -3373 -47661 -37045 -126565 -262199
6701 -262199 -183222 -84363 -44405 -8995 11825 -6799 19552 36959 27690 -26850 -49422 -34245
6689 -34245 21087 -53635 -26179 34387 -5146 -95223 -165704 -190567 -215475 -154596 -165401 -40441
6677 -40441 68380 69184 113501 93932 25812 43085 21379 62673 57697 61068 80773 8419
6665 8419 -49575 -33054 823 -38530 -23556 -76757 -105631 12937 7234 37411 45835 -85531
6653 -85531 -157245 -142275 -175021 -35834 -79773 -255554 -193567 -61370 73241 53338 -16797
6642 -16797 -126194 -142851 -105263 -211491 -131331 -62613 -49861 -31821 -19281 -39456 -48665 -103431
6630 -103431 -156065 -236565 -89743 56056 173808 208387 148634 38724 -59374 -31464 383
6619 383 -25943 -21045 -4481 -15643 -66825 -137271 -157254 -163608 -159690 -182089 -105873 73 6919
6606 6919 -55204 -234903 -163204 -120178 -59091 13783 25566 4539 16021 69800 186402 140524
6594 140524 -47146 -146768 -69133 -18974 1916 -30820 -3171 -127912 -134597 -138340 -62087 36077
6582 36077 -59935 -99246 -33622 37442 -12825 -73118 -225582 -203369 -110831 -51683 -13938 123475
6570 123475 111505 22067 38335 45603 21438 -108216 -112968 -38133 115376 88289 22837 -78367
6558 -78367 -140108 -42973 177991 38334 17705 -22917 -35680 -31090 -68276 -81586 -86530 -114464
6546 -114464 -85075 -74252 -111147 76824 205063 204720 -24095 -140617 -95573 -59322 -135544
6535 -135544 -177158 -137358 -55748 36154 -2648 -77794 -150231 -63407 -41655 20175 22106 37028
6523 37028 2359 64209 183196 142093 142799 45021 41426 180123 167817 180293 185582 124761
6511 124761 -41277 -23336 9976 10629 100811 93668 2642 -25432 -119338 -157360 -102022 -9413
6499 -9413 14862 -2548 -102198 -121411 -71028 -15 94776 112833 72830 50602 46319 -18921
6487 -18921 -21368 10713 -52903 -129641 -204587 -203655 -45753 -1376 -10263 -67542 -118942 -107248
6475 -107248 -22255 -51758 -173419 -87288 -151 434 -64939 -57817 -55948 -51133 -32347 -22608 102257
6462 102257 280494 287965 181371 143319 88403 56439 -64646 -84949 -81237 -174373 -198465
6451 -198465 -170322 -193140 -128604 -19720 7036 -60603 -80932 81084 213289 165679 -127637
6440 -127637 -57345 -27135 -80709 -54470 51616 86628 22202 -14677 96552 166680 201187
6429 201187 122193 27307 -139939 -154686 -71794 -69212 -22416 3413 -100871 -78126 -130697
6418 -130697 -23736 110430 31232 -30903 76368 34012 -59417 -132628 -175700 -105470 -133851
6407 -133851 -105328 -121706 -171674 -121600 -26815 -23749 13653 26644 -11749 13615 73739 140011
6395 140011 176411 128937 158973 114899 29762 -53779 -63087 -16721 -31866 -90190 -56335 -22378
6383 -22378 43100 72957 21443 -103248 -217081 -131545 -14278 45675 -42277 -84732 -19635
6372 -19635 -93980 92958 177570 -20241 -88607 77266 121558 49867 -18790 -69513 -17247
6361 -17247 -13991 -9105 76598 151455 99990 64455 68581 101561 164085 201109 138178 -43043
6349 -43043 -13803 152881 153661 260778 263930 64052 34666 102343 51038 -9932 10729 42374
6337 42374 38194 122996 171502 165062 119502 69015 39107 -8699 -54473 -134499 -177935 -138464
6325 -138464 -122995 -90121 -87620 -58004 -63681 -159166 -144157 -62381 -40226 -47140 -88427 -111435
6313 -111435 -39162 54882 22333 -26379 5122 15697 -91431 -94855 -87170 -109972 -229051 -238633
6301 -238633 -156237 -230447 -252475 -218310 -156365 -180016 -89884 12809 -16540 -81166 -1340
6290 -1340 149731 178710 45277 -41522 -71428 -124891 -149950 -67894 7908 -855 8005 70141
6278 70141 65827 95803 116616 60771 -79875 -82945 -12567 -27551 -61789 -5066 75039 -2587
6266 -2587 -101826 -171013 -274091 -172138 -86506 -25020 23289 102110 -8179 43607 94549
6255 94549 -29619 -64763 -131589 -90495 -42380 -207543 -218463 -117419 -83996 -46945 -28048
6244 -28048 -10323 -24600 -81981 -33968 75680 -16739 -52845 -101362 -38010 -117632 -128009 -37617
6232 -37617 -3205 -91128 -110694 -16877 137682 16795 22253 26391 35980 20623 -50579 6202
6220 6202 -61037 -8515 56108 32919 74158 36951 25351 36818 -47035 -200899 -112193 10304
6208 10304 36411 -23166 -36675 -78631 26155 101756 135484 44261 31376 -47899 -33861 65875
6196 65875 46816 15018 25672 121897 214975 245243 197009 128219 135700 148626 217315 189529
6184 189529 116822 80226 45624 -125168 -151279 -58642 118954 212898 173619 197244 241214
6173 241214 31650 -170851 -9346 73425 -21424 -47950 -50269 -40106 107808 80821 -17773
6162 -17773 -16640 3549 -12717 -55171 -71943 -41600 -73431 -101052 -178371 -57273 51444 77903
6150 77903 76162 74909 107465 -2938 -43810 -23315 20795 86210 60363 97538 112655 113548
6138 113548 14504 77140 47526 -42708 -3383 11313 26149 14204 -69640 -120832 -138258 -65377
6126 -65377 -81694 23351 56820 41312 -15478 -60762 10038 34108 46178 65128 -125285
6115 -125285 -236664 -267574 -237058 -239351 -160439 -64951 48958 94239 -17220 -17015 -33278 -77990
6103 -77990 -117516 -105268 -108577 -129059 -61528 5931 -88125 -72646 47087 138725 187364 163669
6091 163669 106563 123182 139640 189802 216015 122158 58610 22013 -2981 79478 50870 177250
6079 177250 225165 164450 63027 -102140 -48615 40448 102379 110609 32342 46764 72638
6068 72638 -34021 88627 118015 103180 29183 6089 -56058 -90130 -42954 -26036 76328
6057 76328 84563 73367 55156 -131447 -210782 -103878 -13903 23499 118117 63792 -16338 -31403
6045 -31403 87156 148952 209833 177781 109329 85101 72577 47506 38732 95430 27735 -60358
6033 -60358 -91500 -64960 -50883 -93925 -131506 -169030 -145890 -212676 -223672 -252747 -316941 -380450
6021 -380450 -509688 -357104 -106918 -29488 -21829 -116948 -122737 -113941 -59985 -81658 -190870
6010 -190870 -89721 96944 83031 -19501 -100468 -120586 -40339 124011 46243 -69208 -140242
5999 -140242 -204101 -176571 -101191 -127481 -32843 92783 113626 42664 -7064 -36333 -15167
5988 -15167 36524 -1893 13335 64857 242280 270057 67446 60280 127507 76345 31033 -84347
5976 -84347 -60778 -12705 21006 -55387 -112874 -119389 -151624 -162550 -132788 -103076 -208030 -186148
5964 -186148 -81910 -141197 -210991 -181285 -110119 -115566 -40268 -39617 -70046 -33344 1555 83736
5952 83736 99582 12521 1993 -37848 -208073 -213025 -230044 -259883 -222323 -156715 -139877 -103554
5940 -103554 -46134 10281 82933 48494 -818 22812 34886 -7852 -56904 -8694 27165 -148970
5928 -148970 -214480 -302531 -192424 -145423 -171871 -106999 -26632 -107662 -59324 72011 57664
5917 57664 -50060 -28204 22580 12652 -15502 -9590 -20657 -56137 -47981 20575 46359 83302
5905 83302 120059 107355 101334 109010 36599 -44504 -11375 -97929 -135188 -60942 -73449 -78037
5893 -78037 -76367 -54929 87364 157360 70629 -69205 -138513 -200003 -96542 -77715 21744
5882 21744 52520 -20114 -26360 -147106 -147769 -10495 -71396 -25438 41760 29824 -100371 -161961
5870 -161961 -36722 -99615 -298347 -132641 46225 2128 -48972 12361 42393 158551 160870
5859 160870 94655 60691 119895 80084 121265 116305 73901 6042 -15929 65062 -28380 -228119
5847 -228119 -195203 -105969 -54919 -52070 -87208 23295 139818 200394 205034 101738 101966 118897
5835 118897 36806 19164 -38068 80171 230295 203972 103032 57222 -4659 -10817 91863
5824 91863 111525 -7360 -70528 -49047 -155770 -343252 -383944 -405487 -327211 -289119 -205159
5813 -205159 -49537 83667 180165 135771 56128 -1683 -62632 -124880 -153246 -112547 -34884
5802 -34884 38941 49924 11502 49195 -49015 -132484 -123664 -45941 -8729 116268 36548 -35332
5790 -35332 -29917 -101540 -224108 -139043 -8366 -7769 -14255 -73503 -18028 147410 241674 145277
5778 145277 -875 -9247 -70529 -26246 92452 99188 -2017 -70063 -60730 -25779 90707
5767 90707 179692 61871 13274 -41533 -236153 -240707 -164241 -63014 -61431 -97043 1902 24989
5755 24989 -55523 -121790 -144446 -175713 -63300 -51199 -200304 -224480 -104477 -180484 -44770
5744 -44770 35008 46543 36521 72272 56409 -15116 -68344 -96293 -16093 -165634 -232754 -103502
5732 -103502 -11133 -55519 -75789 -43450 17449 44658 70393 103087 68240 131586 40363 11727
5720 11727 -11955 69688 75574 58194 -30731 -135141 -171088 -120686 31358 137378 83094
5709 83094 -44328 9111 -27418 -81625 -80679 23408 -91920 -113125 -33043 -101081 -100036 48328
5697 48328 26395 -31462 -75088 118398 177402 95935 45574 -98837 -88845 -21584 -16469 -288
5685 -288 51795 37214 90 86110 25908 51190 18352 8821 24905 18828 -27525 6627 22507
5672 22507 -12866 -52250 -66040 -87603 -64318 45345 23666 -87476 -88729 -99615 -95413 -115118
5660 -115118 -189850 -180577 -59594 -2519 -39933 -94545 -92439 -47513 -978 70924 6453 -58387
5648 -58387 -2188 -49613 -72793 -106857 -108941 -176076 -124219 76295 170107 154398 200247 235159
5636 235159 153593 49695 47874 63818 102042 29670 27768 14533 54162 141928 170452 187675
5624 187675 122655 -27257 -73525 -41671 61839 15883 -45379 -119479 -125429 -143208 -174779
5613 -174779 -94532 -64189 -90429 -29325 57674 32581 -22533 5569 -158260 -185048 -136256
5602 -136256 -68690 -91389 -208116 -220274 -157475 -136968 -170884 -74039 58 46174 132908
5591 132908 69779 -9118 3203 -82325 -64296 -184135 -205894 -177708 -256048 -283026 -236332
5580 -236332 -153394 -12535 66904 23454 10986 -90980 -106770 -10029 16406 42256 145516
5569 145516 72898 -68098 -150412 -179232 -172167 -183683 -123005 62402 131172 175914 148943
5558 148943 208782 260967 177931 134819 53323 -114316 -140359 -48688 16549 63989 112954
5547 112954 105622 356 46150 14892 126903 112542 -8001 -45930 6798 31496 64762
5536 64762 79244 124089 144893 176544 143866 198669 207250 209821 223449 111802 27260 -34513
5524 -34513 -20265 -58126 -250574 -241366 -88169 42779 95632 115313 81558 -23556 -109918
5513 -109918 -68236 38097 88481 139347 1069 -39771 48367 -98400 -238863 -178975 -49648
5502 -49648 111947 175983 94798 122423 135280 63357 -43039 -78073 -73877 -28556 -18351 -41352
5490 -41352 -64537 -67746 -98105 -33826 -17588 -49694 -107406 -218841 -171915 -58996 -66172 -132042
5478 -132042 -70580 -14819 11476 -120711 -75052 28931 45804 103493 52483 91936 174737
5467 174737 190834 -14585 -102546 -151208 -81841 -53947 -42362 -43177 37030 14440 -148108 -135116
5455 -135116 -114118 -23608 10527 -65379 -158547 -83495 -23820 101504 223760 193268 192172
5444 192172 139151 71360 159889 206190 196523 63470 -6317 -9265 -73797 28729 159875
5433 159875 151104 84228 35571 76919 16992 -52700 -80172 -35881 -30339 -163128 -112525 8571
5421 8571 -43052 -252939 -296788 -321833 -312439 -213793 -168950 -177473 -183461 -252577 -192908 -68359
5409 -68359 -13096 -88416 -84767 -128854 -90453 -136943 -142606 11200 -13493 -144361 -291047 -318201
5397 -318201 -277365 -184600 -165627 -114476 -205282 -171131 -172183 -148213 -83041 56581 209223
5386 209223 63335 -27295 -77544 -93892 -21418 39186 8468 -25618 -140420 -283983 -298756
5375 -298756 -164431 -59372 -8861 41619 12151 10779 -39115 -115399 -95848 20043 -19137
5364 -19137 -33388 -25476 80442 195405 205744 100117 62323 -5413 -62539 -98329 -44506
5353 -44506 -11254 -40576 -46098 -83485 -166585 -172197 -109008 -209701 -318708 -229129 -225738 -183590
5341 -183590 -147623 -181225 -250680 -274273 -201321 -176949 -222119 -257672 -166949 -138835 -96053 -208016
5329 -208016 -259871 -205172 -196709 -176715 -114672 -82002 -98431 -298854 -262566 -150271 -36816
5318 -36816 54082 -18969 -16849 117193 221654 149068 112410 172737 263374 232430 38466
5307 38466 -76499 -65387 -89202 -70698 -112238 -248032 -276562 -107995 -28665 -53777 -4205
5296 -4205 -148318 -37763 31354 -2934 -73322 -116700 -74773 -77466 -63432 32825 234119 284768
5284 284768 143725 117726 90232 31875 36775 -12215 -122904 -125256 -191165 -246511 -261401 -238994
5272 -238994 -328810 -244670 -187019 -185610 -191346 -197150 -96831 -42561 -71998 -26113 22266 30720
5260 30720 -18744 -96857 -204137 -233005 -270212 -224175 -171810 -137657 19784 56474 107209
5249 107209 -5030 -34293 -41989 -180920 -157023 -156891 -57827 14285 57768 -20202 -70953 71731
5237 71731 -1508 -105751 -134328 -52029 117543 141489 142373 60360 15885 2831 73990 41920
5225 41920 7190 -35410 -30654 50741 11651 -127981 -175594 -197291 -129322 -71017 -97194 -107463
5213 -107463 -26125 -43111 -91993 -13364 -34835 78279 124625 111068 36928 15386 34307
5202 34307 -61 -93141 -147548 -193807 -95841 -128901 -200404 -170534 -118389 -124516 -222524 -268699
5190 -268699 -149813 -84464 -75620 -63761 -152705 -185318 -174591 -152224 -37603 53991 100955
5179 100955 40378 -2191 -2277 69046 112916 24217 -131164 -151064 -118586 -82678 -158614 -229085
5167 -229085 -287586 -177764 -129035 -133165 -167533 -115234 -40765 -79623 -99177 -60002 -64939 -29328
5155 -29328 -32973 -141875 -64928 65608 66777 27124 32729 21963 -66723 -25648 1211 -88943
5143 -88943 -13635 48929 -48689 -73793 -92628 -90569 -148516 -200119 -123619 -95162 -153068 -39288
5131 -39288 66913 57207 -4039 -18372 58382 56102 86655 166876 -7772 -166572 -129923 -71555
5119 -71555 -32339 66122 47732 -38061 -132209 -85162 -98935 -228935 -186067 -98189 11882
5108 11882 97321 39025 14264 35908 -72008 -82070 -124154 -201683 -176876 -115567 -79249 -75377
5096 -75377 640 67348 4990 -23517 -70756 -35716 54080 102357 152108 169418 81659 19254
5084 19254 48804 12560 21300 46293 -126248 -273384 -245580 -126884 -36156 -73391 -72838 -93596
5072 -93596 -159380 -226791 -277340 -387171 -326496 -146338 -100004 -145962 -44885 7731 127182
5061 127182 140288 46659 -28586 -126532 -171627 -254990 -301353 -215510 -52991 697 17324
5050 17324 -61900 -42883 -42989 -125217 -191316 -229417 -207937 -214936 -189956 -200605 -247847 -218089
5038 -218089 -211247 -207211 -112584 -71154 -80651 -177303 -259010 -237236 -173755 -175813 -86698 -21685
5026 -21685 55005 91508 41343 -27697 -111685 -81367 12782 87984 133171 70439 -122711 -131761
5014 -131761 -30225 62308 85779 13587 -94027 -102579 -212542 -232276 -197220 -224854 -212710
5003 -212710 -181038 -94749 -27084 36829 -66361 -137590 -14157 143712 122907 102283 188691
4992 188691 245385 36654 -79392 -193586 -173056 -111472 -96278 -120527 -42298 75781 60185
4981 60185 12585 -70463 -102858 -100378 -138825 -228218 -144251 -84272 -62638 -95434 22546 126844
4969 126844 8393 -115558 -196141 -230209 -223282 -231714 -184894 -130533 -85206 1103 -81038 -149385
4957 -149385 -147542 26920 26867 -174772 -275869 -293286 -182605 -81214 -84461 -47200 46329 111994
4945 111994 182137 244632 232451 106280 23043 24543 -60924 -122080 -27079 82010 199279
4934 199279 203246 156598 129282 101824 20504 -27960 -36553 -62164 -237184 -282489 -314058 -352877
4922 -352877 -201437 -78953 160119 212312 191099 64055 -12975 -37291 -126 32192 -61003
4911 -61003 7143 64914 158316 132064 3432 -138746 -208597 -202832 -98100 -43857 -10810
4900 -10810 89394 188268 207950 132723 84540 71334 213716 243694 134523 -97290 -141990
4889 -141990 10999 -49892 -66196 -101607 -132063 -134739 -17073 61053 -18884 -1496 102756
4878 102756 95899 -105248 -44336 26891 -33886 -43800 -122998 -59143 27175 99849 122062 207199
4866 207199 209181 48563 24619 8045 -37334 -72187 -58617 -112370 -53950 -18558 -42431 15710
4854 15710 2779 -101915 -151335 -94443 17747 56479 -57314 -48624 -10248 17304 84393
4843 84393 -32253 -132732 -34093 -148651 -315776 -198121 -60528 9308 -41038 -46807 -106537
4832 -106537 -49814 53641 33772 110582 63135 33035 -26134 -48675 40882 87569 5443
4821 5443 -37515 -37027 -12273 -13178 -54874 -93944 -25879 -66249 -186706 -106875 18383 45878
4809 45878 152788 250790 229357 17356 -125422 -163810 -38980 -67837 -181756 -225740 -99619
4798 -99619 33947 249150 181634 72158 4689 -58264 -55099 -96196 -16028 60370 80702
4787 80702 59303 -85622 -89368 -64873 -61617 -71727 -50549 109721 71972 32357 211091 174051
4775 174051 11749 -163078 -276903 -188833 -138464 -17749 78357 75013 27876 -29279 -10686
4764 -10686 -111895 -162927 -195538 -198115 -213744 -223644 -242595 -233099 -99272 -67386 -83389 -57412
4752 -57412 -7451 -9561 10152 -13382 -81549 -225522 -344849 -322631 -202814 -100032 -33638
4741 -33638 -57612 -48576 41224 49746 7003 10847 26777 -53446 -101678 16389 69867 60724
4729 60724 21865 -53065 -66137 54300 -37483 -78622 12855 67856 -37055 -67467 -129513
4718 -129513 -146700 -127834 -152863 -75477 -50313 -40400 -33313 24253 237854 187536 51056 96602
4706 96602 138647 -77624 -182158 -100358 30801 131239 70567 -39686 -56246 -174255 -189921
4695 -189921 -172559 -116572 -77515 -25172 25576 85933 6429 9074 51628 56584 48447 -20636
4683 -20636 25238 131178 124011 158716 98571 142011 147369 192957 175094 177208 93088 88032
4671 88032 46552 12038 -6331 -44745 -85506 -91899 -105585 -23467 67823 56511 76469 -49404
4659 -49404 -68057 -106467 -87607 13820 199266 229306 149116 180884 195880 34735 -13375
4648 -13375 -101304 -102175 -100691 -134307 -82614 -123047 -72829 65561 5857 -91711 -116722 -142487
4636 -142487 -116003 -29048 -43924 -39886 -63166 -109081 -90778 -63895 -134586 -225831 -128526 -49569
4624 -49569 -46884 13830 5825 18334 10614 -68281 -36895 -55169 -87147 4758 -79064 -199190
4612 -199190 -254580 -244725 -288398 -329705 -254413 -175562 -144347 -93112 -134131 -38062 -111667 -263688
4600 -263688 -260843 -42397 7007 -14076 -73438 -174122 -152926 -76360 8953 -159656 -68819
4589 -68819 55843 85776 71973 132209 153304 198973 145791 93888 76678 97719 107190 136247
4577 136247 108804 86568 97812 85680 -46814 -21792 98253 128166 92696 10565 -11922
4566 -11922 -120551 -148111 -126867 -113950 -169874 -213982 -167995 -7969 158161 185985 99933
4555 99933 28599 -58094 -6326 70268 -34365 -56298 25296 114889 112415 58456 81649 150418
4543 150418 92453 -31102 -133587 -87422 2574 5934 -58676 -167583 -172536 -180386 -28860
4532 -28860 78357 116212 53826 3820 21788 87773 98888 -59819 -200830 -241323 -247402
4521 -247402 -214610 -183992 -197487 -112058 -128777 -110182 2377 78405 129938 129089 -20572 -235962
4509 -235962 -290431 -421323 -454253 -358143 -303269 -182074 -2351 50584 12345 -46538 -52669
4498 -52669 -113512 -148821 -208904 -233038 -267496 -332383 -275023 -112663 60026 43289 638
4487 638 -27522 -35996 -13435 -60326 -91087 -51070 -12690 14900 58406 19888 -1642 -3268 -87087
4474 -87087 -108182 -82458 -135258 -189459 -133353 -38112 95017 203984 123130 30363 -95264
4463 -95264 20865 117951 91784 -8046 -74807 -112420 -125201 -122427 -28785 -103009 -177285 -80389
4451 -80389 -14014 -122215 -203918 -226450 -215190 -93387 -66876 -40753 9451 71145 141663
4440 141663 52449 40783 23525 -16457 31039 100342 23441 -176786 -256503 -226734 -134206
4429 -134206 -118722 -88796 -40793 -79701 -36246 -49349 -68559 -18414 75965 67010 -26736 -103393
4417 -103393 -32917 10158 -30969 -42299 -5830 18732 37434 82541 143451 59300 -6536 -3149
4405 -3149 -3204 17157 -8543 -94937 -163002 41097 183575 148421 188360 198802 77710 -54131
4393 -54131 12538 158585 280711 152056 -5544 11717 118530 223494 259765 55313
4383 55313 -22818 25831 188052 204730 196018 121573 160337 29118 19214 166983 71105 -46924
4371 -46924 6652 6445 -43413 6741 -48038 -22208 -47749 -59011 59716 155365 138841 104800
4359 104800 43279 24579 82748 128388 77469 61129 126373 46067 96265 52170 25903 62302
4347 62302 68538 46145 -41634 -77910 9738 15663 22986 31719 -56268 -76947 16781 -39536 14625
4334 14625 59941 98783 43534 9736 -5005 -938 -46125 -59664 34136 38992 -75866 -156911
4322 -156911 -166320 -64910 -125514 -142955 -62918 -37325 -131048 -184661 -130265 -49354 -54332 -49914
4310 -49914 60803 43832 -13740 30109 86060 -2000 -81422 6650 102216 71675 34250 -122273
4298 -122273 -107051 -168862 -199876 -218220 -152364 9612 63150 -52962 -41102 119562 273909
4287 273909 185496 163920 123715 -91057 -150346 -76258 -52259 15399 77759 -4572 -83295
4276 -83295 -45077 20550 -47430 -17422 -30517 -172864 -254380 -257920 -210694 -105594 77144
4265 77144 72843 -16570 18733 64108 -40842 -11483 69578 39051 11195 88721 134673 71443
4253 71443 -27029 -61048 -50928 -89342 -128969 -120324 -161017 -128665 -145470 -161720 -125348 -152053
4241 -152053 -30377 -3951 -85736 -64454 39205 67491 55368 -59739 -144945 -121389 -216884
4230 -216884 -133012 -27193 69756 121752 9719 -72865 53735 164141 18484 -209903
4220 -209903 -214811 -230601 -152028 -231849 -113656 -18943 -43521 -74798 -135641 -210480 -354654
4209 -354654 -321636 -214795 -185269 -143405 37810 172501 60083 -150891 -212984 -132770 -170157
4198 -170157 -155803 -152890 -217127 -235801 -128048 -85447 -52608 -75782 -20753 127444 83768
4187 83768 33316 42242 183015 139790 90061 58515 -147523 -188974 -187965 -58286 10679 -16752
4175 -16752 55526 40860 46704 49687 30005 41115 28128 41772 36589 -22772 22842 76771
4163 76771 37204 26721 106548 212990 180397 43615 -32601 -72340 -123436 -112720 -19768
4152 -19768 -21226 -78215 -44143 -55139 -54965 -105856 -77257 -109880 -33630 -5066 201644 237153
4140 237153 201327 103021 52640 122029 143983 34414 -75072 -51482 37150 -21966 -38813
4129 -38813 -84945 -36017 11637 -53949 -139936 -209440 -183951 -110127 -201723 -261998 -209116 -265375
4117 -265375 -146654 -67544 -17985 11867 -4940 55902 149690 195586 52112 4504 28500
4106 28500 7142 3061 -30637 56243 75293 19985 21135 106915 163900 155782 74499 -10275
4094 -10275 -23658 38911 -77706 -185681 -79749 4602 -27743 56414 113597 47026 -108985
4083 -108985 -161016 -149503 -55468 12026 -149462 -206915 -206097 -267130 -193412 -161577 -87050 -90354
4071 -90354 -91617 -103431 -60139 12580 79312 7764 10301 110856 94099 35849 31074 3271
4059 3271 -93737 -74432 46690 66308 -13830 -61534 58128 124692 -38981 -136252 -119902
4048 -119902 20222 -11841 -81244 -100435 15035 77601 76127 40143 -13402 -30288 -56175
4037 -56175 -52250 -176724 -298654 -281800 -302130 -194721 -63509 -42867 -83805 -14845 -47107
4026 -47107 -22400 14861 -12608 17741 -11813 -20546 54265 100455 -22670 -168505 -214560 -205714
4014 -205714 -181117 -125240 -123274 -115297 -59467 -6999 -112139 -210694 -180913 -51773 5534 -30942
4002 -30942 -117377 -114996 -65513 -31284 -90723 -133472 -160684 -70381 -9564 88096 120364 26214
3990 26214 29053 5839 22857 34033 5540 60400 50103 18035 9030 37295 -11618 33135
3978 33135 56812 60871 77299 32906 -60719 -61398 -98663 -187242 -150703 -174949 -196561 -196434 -198076
3965 -198076 -257632 -276836 -245100 -118849 -88231 -77346 -115139 -25044 -129963 -284384 -273806
3954 -273806 -83235 51496 67083 35556 6611 -77374 -69982 -83833 -136873 -58487 11911
3943 11911 -20348 13524 116409 134404 78490 57887 70329 -16601 19334 -7521 88089 168689
3931 168689 190264 155615 72732 -23411 -159647 -299583 -299266 -149908 -125759 -11325 67536
3920 67536 38068 92978 75564 24905 59600 -49538 -140413 -120725 -113901 -132881 -126191 -108777
3908 -108777 14911 123206 131258 70067 -87182 -44436 -1473 -72309 -65108 -72374 -60331 -10069
3896 -10069 -8530 -65537 -84989 -101896 -190920 -131086 -110536 -167953 7014 55140 56486 89042
3884 89042 59035 -13089 -172205 -100208 9578 -3945 -35198 -73258 61091 138096 -16260
3873 -16260 -128443 -205993 -170061 -199272 -157238 -15108 32117 30034 43362 22612 -79923
3862 -79923 -199306 -256088 -106103 -64324 -81122 -99698 -50205 16137 -64857 -192907 -146744
3851 -146744 3106 -3216 76341 98191 120065 155474 181324 75329 -60354 45137 135185
3840 135185 42767 -55380 -104521 -4268 -5511 -37265 -95334 -117860 -64493 -23165 79027
3829 79027 170332 266903 167454 52398 7096 -18554 -115580 -186799 -72027 -10630 -81793
3818 -81793 -134614 -55515 -146284 -179644 -107334 25051 -31046 -129844 -117676 -46239 88128
3807 88128 152006 68943 -5410 18662 28077 -26136 -48422 -79259 -180190 -196268 -152596 -64429
3795 -64429 23634 19268 -53022 -67370 -38167 -187416 -271692 -252585 -99943 -50943 -55955 10110
3783 10110 15708 -93284 -212501 -148624 -5569 63982 84564 3152 -186211 -268443 -184585
3772 -184585 -117888 -71339 -132271 -208017 -115325 -27418 -131 -3834 38259 41305 4370 101921
3760 101921 235499 136304 26119 -56584 -160471 -193003 -155717 -111758 -70820 -107470 -80975
3749 -80975 -4443 36579 62383 52051 22016 -53705 -8104 -29612 9130 163127 255561 195653
3737 195653 28596 -12677 9164 -87318 -23220 -29508 -105149 -187142 -168648 -204895 -248780 -229268
3725 -229268 -223285 -149938 -159302 -153252 -139568 -41858 20167 -30260 -92749 -51334 -12353 -27819
3713 -27819 37586 -89342 -21463 33337 58872 91827 228465 208987 265384 225293 23650
3702 23650 -34941 -154946 -113479 -1495 33279 5792 91228 163336 33939 -21285 -6698
3691 -6698 -1990 -42488 -145176 -134877 -15683 -16114 -14528 -2954 -7422 103841 142404 118638
3679 118638 18673 55238 179549 155317 155200 78710 41838 -41924 -130444 -132217 -188546 -171154
3667 -171154 -170571 -179650 -122953 -44335 -106463 -50037 1104 -53574 11873 -31131 -130109 31507
3655 31507 177113 75774 -77190 -204505 -97570 106654 54163 -33314 35671 58893 94014
3644 94014 98174 47824 -36744 -36436 52155 -20999 -28923 -81024 -253047 -259865 -210627 -133753 -120060
3631 -120060 -156595 -98820 -42901 116207 114338 53278 157382 29241 -6955 27623 33999
3620 33999 96369 151364 84613 84566 59929 21781 32432 40180 87106 45954 101911 218301
3608 218301 232505 243477 211395 191678 95543 28725 -13406 -17996 -55943 -44875 -69232 -142943
3596 -142943 -277100 -207098 -130991 -62950 -42117 672 -33030 -35185 65114 59111 7094 22069
3584 22069 -32316 -96102 -152141 -282770 -130930 -52052 -4925 -56523 13685 22675 -15802 -77612
3572 -77612 -299002 -253138 -102139 -90801 -84332 -147120 -106757 -79015 -135872 -101404 -72501 -107858
3560 -107858 -96189 -58671 -8720 133503 118808 209346 183115 56561 70403 155779 176118
3549 176118 130322 76970 30808 -3902 22539 41561 -34463 -24123 -92018 -122400 -142759 -253297
3537 -253297 -219271 -186001 -35088 21865 88815 116461 67692 19701 -53279 -162031 -180123
3526 -180123 -53219 37693 82998 35798 -80528 -119413 -129560 12623 160874 185701 79037
3515 79037 108166 142899 195296 145955 23000 -73122 -48845 -131657 -160848 -146307 -97431 62985
3503 62985 161173 109400 27315 17187 -86756 -2336 41487 26136 31781 -42191 -434 -41937
3491 -41937 -169973 -137122 -94620 34709 107571 -7085 -143121 -230232 -136616 -107079 -103162
3480 -103162 4193 202491 235384 196314 231718 232810 111524 12583 73058 -35809 -33566
3469 -33566 -8266 -30294 -42905 10599 -51476 -154213 -183623 -238542 -243615 -177059 -219348 -261187
3457 -261187 -130951 10145 64501 114951 97527 90457 86982 35442 70709 153395 48104
3446 48104 96415 58774 -97568 -184225 -142875 -163409 -187513 -67608 -116983 -189759 -62845
3435 -62845 71040 -83108 -160082 -223805 -99207 -99985 -131031 -183064 -153906 -113807 -84098 -60269
3423 -60269 -60727 -60165 57198 16347 -78184 -1115 142473 67136 -175583 -293953 -221911 -247323
3411 -247323 -267963 -245862 -124440 -98063 -97587 -46350 48280 185591 31723 -52636 -43819 -66340
3399 -66340 46232 58824 -36309 6317 -31115 -132059 -146328 -144079 -40435 -37838 -24521 46403
3387 46403 157999 33839 -71566 -76894 -95191 -69599 -82697 66653 -37327 -28173 -3287
3376 -3287 -47248 -50564 -11060 18985 -100929 -83403 107247 154623 162731 263667 315460 196361
3364 196361 135090 117035 96498 90201 28887 41975 93782 92108 93607 171402 152089 69065
3352 69065 -31711 -104107 -134811 -181468 -228145 -54338 154943 170788 96946 90733 93977 -3859
3340 -3859 -19058 41634 -15674 -3788 65353 85897 111687 217565 214979 76328 -132684 -83843
3328 -83843 105162 136304 133088 231807 183265 139601 85633 103888 71321 17921 -14959 -1317
3316 -1317 122987 191000 219977 148886 -2404 -65863 -17252 53412 122160 129839 117655 115145
3304 115145 162515 115311 32714 53416 101298 139365 55377 61271 107973 70877 109812 99138
3292 99138 47516 21563 18543 -52284 52270 129293 60712 -35160 30311 87106 21606 -92516
3280 -92516 -81239 -67156 -34943 -17529 29139 65286 -36935 -111873 -48535 -33484 -15279 9943
3268 9943 -51990 -86596 -84380 -135055 -81476 -14267 45203 111234 142057 209046 244771 207742
$$ [...]
##END NTUPLES=NMR SPECTRUM
##END=
