##TITLE=Analysis number 328874
Compound Code cc 62213
Book Reference 518/147
Project Code adrs
Chemist Name colinb
##JCAMPDX= 6.0         $$ Bruker NMR JCAMP-DX V2.0
##DATA TYPE= NMR SPECTRUM
##DATA CLASS= NTUPLES
##ORIGIN= Bruker BioSpin GmbH
##OWNER= nmr
$$ XWIN-NMR		Version 3.5
$$ Thu Jul 12 08:12:44 2007 GMT Daylight Time (UT+1h)  MAYBRIDGE\nmr@NMR_250MHZ
##.OBSERVE FREQUENCY= 250.131544655141
##.OBSERVE NUCLEUS= ^1H
##.ACQUISITION MODE= SIMULTANEOUS (DQD)
##.ACQUISITION SCHEME= undefined
##.AVERAGES= 16
##.DIGITISER RES= 18
##SPECTROMETER/DATA SYSTEM= dpx250
##.PULSE SEQUENCE= zg30
##.SOLVENT NAME= CDCl3
##.SHIFT REFERENCE= (INTERNAL, CDCl3, 0, 16.522)
##AUDIT TRAIL= $$ (NUMBER, WHEN, WHO, WHERE, WHAT)
$$ ##TITLE= Audit trail, XWIN-NMR		Version 3.5
$$ ##JCAMPDX= 5.01
$$ ##ORIGIN= Bruker BioSpin GmbH
$$ ##OWNER= nmr
$$ C:\u/data/dgb/nmr/ADRS/820/pdata/1/auditp.txt
$$ ##AUDIT TRAIL=  $$ (NUMBER, WHEN, WHO, WHERE, WHAT)
(   1,<2007-07-12 08:12:16.12 +100>,<MAYBRIDGE\nmr>,<NMR_250MHZ>,
      <created by zg, POWCHK disabled, PULCHK disabled
       configuration hash MD5:
       76 6E 9A 78 1E 09 19 81 EC 84 63 8F B0 6A 59 2D
       data hash MD5: 64K
       CF 16 1B 7C 75 C4 D4 B9 08 6A 37 80 03 1C 55 5D>)
(   2,<2007-07-12 08:12:31.45 +100>,<MAYBRIDGE\nmr>,<NMR_250MHZ>,
      <Start of raw data processing
       ef LB = 0.3 FT_mod = 6 PKNL = 1 SI = 32K 
       data hash MD5: 32K
       4D 9B 5F 78 E1 0F 90 0E 66 A5 AD D7 98 7C D4 AE>)
(   3,<2007-07-12 08:12:33.11 +100>,<MAYBRIDGE\nmr>,<NMR_250MHZ>,
      <apk 
       data hash MD5: 32K
       20 7F 15 95 EE 81 AE 2C C5 4F 6F EF 3F 44 96 5E>)
(   4,<2007-07-12 08:12:33.86 +100>,<MAYBRIDGE\nmr>,<NMR_250MHZ>,
      <abs ABSG = 5 
       data hash MD5: 32K
       AF B4 55 1E 3E A5 10 B4 10 EE F4 EC 11 65 87 FA>)
$$ ##END=
$$ 
$$ hash MD5
$$ D9 E2 45 73 51 41 62 0D 45 59 D1 F9 B4 0C 50 06
##$RELAX= 
##$RELAX= 
##$RELAX= 
##$RELAX= 
##$RELAX= 
##$RELAX= 
##$RELAX= 
$$ Bruker specific parameters
$$ --------------------------
##$DU= <C:\u>
##$EXPNO= 820
##$NAME= <ADRS>
##$PROCNO= 1
##$TYPE= <nmr>
##$USER= <dgb>
##$AMP= (0..31)
100 100 100 100 100 100 100 100 100 100 100 100 100 100 100 100 100 100 
100 100 100 100 100 100 100 100 100 100 100 100 100 100 
##$AQSEQ= 0
##$AQ_mod= 3
##$AUNM= <au_zg>
##$AUTOPOS= <1 >
##$BF1= 250.13
##$BF2= 250.13
##$BF3= 250.13
##$BF4= 250.13
##$BF5= 500.13
##$BF6= 500.13
##$BF7= 500.13
##$BF8= 500.13
##$BYTORDA= 1
##$CFDGTYP= 0
##$CFRGTYP= 5
##$CHEMSTR= <none>
##$CNST= (0..31)
1 1 145 1 1 1 1 1 1 1 1 1 1 1 1 1 1 1 1 1 1 1 1 1 1 1 1 1 1 1 1 1 
##$CPDPRG= <>
##$CPDPRG1= <>
##$CPDPRG2= <>
##$CPDPRG3= <>
##$CPDPRG4= <mlev>
##$CPDPRG5= <mlev>
##$CPDPRG6= <mlev>
##$CPDPRG7= <mlev>
##$CPDPRG8= <mlev>
##$CPDPRGB= <>
##$CPDPRGT= <>
##$D= (0..31)
0 1 0 0 0 0 0 0 0 0.06 0 0 0 0 0 0 0.0002 0 0 0 0 0 0 0 0 0 0 0 0 0 0 
0 
##$DATE= 1184224334
##$DBL= (0..7)
120 120 120 120 120 120 120 120 
##$DBP= (0..7)
150 150 150 150 150 150 150 150 
##$DBP07= 0
##$DBPNAM0= <>
##$DBPNAM1= <>
$$ [...]
##$SUBNAM7= <"">
##$SUBNAM8= <"">
##$SUBNAM9= <"">
##$SW= 20.6930455092707
##$SWIBOX= (0..15)
0 0 3 0 0 0 0 0 0 0 0 0 0 0 0 0 
##$SW_h= 5175.983436853
##$TD= 65536
##$TD0= 1
##$TE= 296.16
##$TE2= 300
##$TE3= 300
##$TEG= 300
##$TL= (0..7)
0 120 120 120 120 120 120 120 
##$TP= (0..7)
150 150 150 150 150 150 150 150 
##$TP07= 0
##$TPNAME0= <>
##$TPNAME1= <>
##$TPNAME2= <>
##$TPNAME3= <>
##$TPNAME4= <>
##$TPNAME5= <>
##$TPNAME6= <>
##$TPNAME7= <>
##$TPOAL= (0..7)
0.5 0.5 0.5 0.5 0.5 0.5 0.5 0.5 
##$TPOFFS= (0..7)
0 0 0 0 0 0 0 0 
##$TUNHIN= 0
##$TUNHOUT= 0
##$TUNXOUT= 0
##$USERA1= <user>
##$USERA2= <user>
##$USERA3= <user>
##$USERA4= <user>
##$USERA5= <user>
##$V9= 5
##$VALIST= <valist>
##$VCLIST= <CCCCCCCCCCCCCCC>
##$VD= 0
##$VDLIST= <DDDDDDDDDDDDDDD>
##$VPLIST= <PPPPPPPPPPPPPPP>
##$VTLIST= <TTTTTTTTTTTTTTT>
##$WBST= 1024
##$WBSW= 4
##$XGAIN= (0..3)
0 0 0 0 
##$XL= 0
##$YL= 0
##$YMAX_a= 294283
##$YMIN_a= -420162
##$ZGOPTNS= <>
##$ZL1= 120
##$ZL2= 120
##$ZL3= 120
##$ZL4= 120
##$ABSF1= 16.522
##$ABSF2= -4.171173
##$ABSG= 5
##$ABSL= 3
##$ALPHA= 0
##$AQORDER= 0
##$ASSFAC= 0
##$ASSFACI= 0
##$ASSFACX= 0
##$ASSWID= 0
##$AUNMP= <proc_1d>
##$AZFE= 0.1
##$AZFW= 0.1
##$BCFW= 0
##$BC_mod= 0
##$BYTORDP= 0
##$COROFFS= 0
##$CY= 12.5
##$DATMOD= 1
##$DC= 0
##$DFILT= <>
##$DTYPP= 0
##$F1P= 14.0000005364418
##$F2P= -0.99999901652339
##$FCOR= 0.5
##$FTSIZE= 32768
##$FT_mod= 6
##$GAMMA= 0
##$GB= 0
##$INTBC= 1
##$INTSCL= 1
##$ISEN= 128
##$LB= 0.3
##$LEV0= 0
##$LPBIN= 0
##$MAXI= 10000
##$MC2= 0
##$MEAN= 0
##$ME_mod= 0
##$MI= 0
##$NCOEF= 0
##$NC_proc= -4
##$NLEV= 6
##$NOISF1= 0
##$NOISF2= 0
##$NSP= 0
##$NTH_PI= 0
##$NZP= 0
##$OFFSET= 16.522
##$PC= 1
##$PHC0= -49.90928
##$PHC1= 2.432776
##$PH_mod= 1
##$PKNL= yes
##$PPARMOD= 0
##$PSCAL= 4
##$PSIGN= 0
##$REVERSE= no
##$SF= 250.13
##$SI= 32768
##$SIGF1= 0
##$SIGF2= 0
##$SINO= 400
##$SIOLD= 32768
##$SREGLST= <1H.CDCl3>
##$SSB= 0
##$STSI= 32768
##$STSR= 0
##$SW_p= 5175.98343685301
##$SYMM= 0
##$S_DEV= 0
##$TDeff= 65536
##$TDoff= 0
##$TI= <Analysis number 999999
Compound Code 99
Book Reference 9
Project Code 9>
##$TILT= no
##$TM1= 0
##$TM2= 0
##$TOPLEV= 0
##$USERP1= <user>
##$USERP2= <user>
##$USERP3= <user>
##$USERP4= <user>
##$USERP5= <user>
##$WDW= 1
##$XDIM= 32768
##$YMAX_p= 327209875
##$YMIN_p= -342409
$$ End of Bruker specific parameters
$$ ---------------------------------
##NTUPLES= NMR SPECTRUM
##VAR_NAME=  FREQUENCY,     SPECTRUM/REAL,   SPECTRUM/IMAG
##SYMBOL=    X,             R,               I
##VAR_TYPE=  INDEPENDENT,   DEPENDENT,       DEPENDENT
##VAR_FORM=  AFFN,          ASDF,            ASDF
##VAR_DIM=   32768,         32768,           32768
##UNITS=     HZ,            ARBITRARY UNITS, ARBITRARY UNITS
##FACTOR=    0.157963299565203, 1,           1
##FIRST=     4132.6476996994, 0,             0
##LAST=      -1043.33573715361, 0,           0
##MIN=       -1043.33573715361, -342409,     0
##MAX=       4132.6476996994, 327209875,     0
$$ Real data points
##PAGE= N=1
##DATA TABLE= (X++(R..R)), XYDATA
$$ [...]
16612b1741L0296J7187j3153j6676l4992j273j6623j9333O4820M8538l5699o2396
16600f1045O144L1726K5269j2261J0399j6911k7329O173L3197J6426j5812k6845
16588c0869j6110J1715M2324n511K3459M5027J6386n5146k1672M4795L2339k6140
16576F0597l1856n96j3879k510j9364j1810K0354O421J075j5618m1032J0804L6361
16563a053J4525k3607l3464K9173J1061j480J4709O277J1028m404l2321k2802
16551c2358K3109J4845Q209l5428l1350l098j51L3797K7123j4527j8079m082n228
16538c7218m935J7377M630N280k4838K7063L9146j074o3012k7132l453K6422L1718
16525a0026j0172N562M6499J4954j8142m6469k8783K3004K8997q105j9729k9307
$$ plain form
16612 -21741 8555 25742 12589 -4087 -39079 -40352 -56975 -76308 -11488 37050 1351 -61045
16600 -61045 -54901 -23175 2094 -10167 232 -16679 -44008 -37835 -4638 11788 -4024 -30869
16588 -30869 -46979 -35264 7060 1549 25008 70035 86421 31275 9603 54398 86737 60597
16576 60597 28741 28145 14266 11756 -7608 -19418 936 7357 8432 -7186 -48218 -37414 -1053
16563 -1053 13472 -10135 -43599 -14426 -3365 -4845 9864 16141 27169 22765 -9556 -32358
16551 -32358 -9249 5596 13805 -21623 -52973 -56071 -56222 -22425 4698 -9829 -27908 -31990 -37218
16538 -37218 -42153 -24776 -20146 -14866 -39704 -12641 26505 25431 -37581 -64713 -68166 -41744 -10026
16525 -10026 -20198 -14636 31863 46817 28675 -17794 -46577 -23573 5424 -2681 -22410 -51717
16513e1717n66J6537k3129j0962l195M5272L2207k5421k2944J7958L066r977q713
16500d1584j7700q362K2108K39k4114J5933R104J8521J9410p120L5568M46K3091
16487D5540K1623k2470m1759k7162l5458j3331K4225M0439J2823j0226J3804j134
16475F914J4505k771m846l0520k8674k1280k5817L2349K7346K9518M879k3977
16463b2374J6412R795p256k3449r506M810K1216K69M0551M570j2802N495J3531
16450D1262j8829l8223q300J6735n4640j1367M4227K2116j3975M1016J7170J5831
16438E3023J052P447l2353m1665k6381O095K5882K661M1007J98l6096m9803l904
16425e2837j7124k1740r874R863R744J1995K250K2242M483p009K1506O426j4020
$$ plain form
16513 -51717 -52283 -35746 -58875 -69837 -73032 -27760 4447 -20974 -43918 -25960 -22894 -32871 -41584
16500 -41584 -59284 -67646 -45538 -45299 -69413 -53480 -44376 -25855 -6445 -13565 22003 22449 45540
16487 45540 67163 44693 2934 -24228 -59686 -73017 -48792 -8353 4470 -5756 8048 6914
16475 6914 21419 18648 13802 -16718 -45392 -66672 -92489 -60140 -32794 -3276 1603 -22374
16463 -22374 -5962 3833 -3423 -26872 -36378 -31568 -10352 -10083 30468 35038 22236 27731 41262
16450 41262 22433 -15790 -24090 -7355 -61995 -73362 -29135 -7019 -20994 20022 37192 53023
16438 53023 54075 61522 29169 -12496 -38877 -32782 -6900 -4239 36768 36966 870 -48933 -52837
16425 -52837 -69961 -91701 -101575 -91712 -81968 -69973 -67723 -45481 -40998 -48007 -26501 -20075 -34095
16412c4095M7813j153k7340L97p341J4679J6315J1494K9036j6597j1996P754k5054
16399C912j1143k1509j305k687o071J9384o131l2675M566k6528Q813p855P554
16386g1675k373K4152J8691L5264J8592j294j8080k6218j0044k504L9205J2652
16374A6368O316J7627j4875L0087j0841j1040r454K6709j2120k9761n3253l9127
16362h3364J8618j2228k0959J6643M7564k26J2896K3664L791o6048k1347M6432
16350c4564M1431j5169O85J449j4380j5609j361p051K0304R70Q821R663m3521
16337d8332n6405J7866L2498L7673J7160k2640J8968K019j3663k33K3265K0624
16325B8800k671l1563j4839L0695L4838L5854K1361n7542J0829l0542n2403k7051
$$ plain form
16412 -34095 13718 12565 -14775 -14378 -21719 -7040 9275 20769 49805 33208 21212 28966 3912
16399 3912 -7231 -28740 -30045 -32732 -38803 -19419 -25550 -58225 -53659 -80187 -71374 -79229 -71675
16386 -71675 -74048 -49896 -31205 4059 22651 21357 3277 -22941 -32985 -35489 3716 16368
16374 16368 22684 40311 25436 55523 44682 33642 24188 50897 38777 9016 -44237 -83364
16362 -83364 -64746 -76974 -97933 -81290 -33726 -33952 -21056 2608 6399 -59649 -80996 -34564
16350 -34564 6867 -8302 -7617 -6168 -20548 -36157 -37518 -44569 -24265 -23295 -14474 -4811 -48332
16337 -48332 -104737 -86871 -54373 -16700 460 -22180 -3212 -1193 -14856 -15089 8176 28800
16325 28800 26129 -5434 -20273 10422 45260 81114 102475 44933 55762 25220 -27183 -54234
16313e4234K1371K8599j3105j9746j7306l6631o1696l46O8568N8020P27k0618
16301d6397M3622J4580l3386J615N309o958J9494J0504j2495n9003p284M4163
16289b6236M0519K0766r418j5717k9362K3928K7555J8576k4673l3187P62O288
16277a99q839k5123K2493p200j694m5243l3882K8944L7141J5314J1367N1335m816
16264C9598Q318k535j8948J7998j9233j777l8712m5047k9920m499P909Q278N9333
16251a9237k4865m2665k2122M3977K4628M687j9716p991P404L5652K8954J199
16239I905k1816n761L7474Q878L2066q918k9802m4216J4961N748p753q401k621
16226b0256n23j9329r986K2080J575k133J6214J5164j5824j1246L673q955L208
$$ plain form
16313 -54234 -32863 -4264 -17369 -37115 -54421 -91052 -152748 -153094 -84526 -26506 -25779 -46397
16301 -46397 -2775 11805 -21581 -19966 -14657 -21615 -2121 8383 -4112 -63115 -70399 -26236
16289 -26236 14283 35049 25631 9914 -19448 4480 32035 50611 25938 -7249 -6487 -199
16277 -199 -9038 -34161 -11668 -18868 -20562 -65805 -99687 -70743 -33602 -18288 -6921 44414 39598
16264 39598 47916 45381 26433 44431 25198 23421 -15291 -60338 -90258 -94757 -86848 -78570 -19237
16251 -19237 -44102 -86767 -108889 -64912 -40284 -35597 -55313 -63304 -55900 -20248 8706 9905
16239 9905 -11911 -17672 19802 28680 60746 51828 22026 -22190 -7229 -1481 -9234 -17635 -20256
16226 -20256 -20779 -40108 -50094 -28014 -26439 -28572 -12358 2806 -13018 -24264 -20591 -29546 -26338
16213b6338J1781L4071M034Q901J3223k7805l7259K4382q643l9372j1K5766K220
16200a5050N582R381p850n864l426J3824J6795j3612Q46k5666l829K3455l160
16187h574m2232k121m01J8912L8563j0199k2287J7357l304j190N571J5166l4216
16174b8955j4018m576l8232j382M9083K7892J0667j8447j5200j2954K025N6983
16162A2886j8546k6261L011K7502l0744l687K7034l1973Q432K9903J0959n624
16150B892m1251j3909J9851m0884k8844K4650K0875L007K6116J7438J3558O745
16138A0244K1240o23P847j6017o862k5330q805P234J9890J5047K5859j3655K791
16125C8860o429o163q047j5261n2853J9434O637q640L2186L218j8598J5280L5325
$$ plain form
16213 -26338 -14557 19514 23548 32449 45672 17867 -19392 4990 -3653 -43025 -43036 -17270 -15050
16200 -15050 -9468 -87 -7937 -13801 -17227 -3403 13392 -220 626 -25040 -28869 -5414 -8574
16187 -8574 -50806 -52927 -53328 -34416 4147 -6052 -28339 -10982 -14286 -15476 -9905 5261 -28955
16174 -28955 -42973 -47549 -85781 -87163 -38080 -10188 479 -17968 -33168 -46122 -44097 12886
16162 12886 -5660 -31921 -28910 -1408 -32152 -35839 -8805 -40778 -32346 -2443 8516 2892
16150 2892 -38359 -52268 -32417 -73301 -102145 -77495 -56620 -53613 -27497 -10059 3499 10244
16138 10244 31484 30861 38708 22691 15829 -9501 -18306 -11072 8818 23865 49724 36069 38860
16125 38860 32431 26268 18221 2960 -49893 -30459 -23822 -32462 -276 2942 -15656 -376 34949
16112C4949n6121R597K7079m7949J507R547J6862L1002M955J5712j5706r272k2125
16099C7k5591k8712r140P008J0391J2736Q907L7490N529J6496J9631O205n8284
16086B703k3594J1940k0292k0043J6902k0486J6400M0878J034r620K007m0932
16074d3103M441k1696R544N8861K3213j828j8756K1070p181l863l7894l6036l8572
16061i1800k1222J9671K0505L6865K1078Q266j0747l019l2013L0281J6532j5831
16049b1434P55k4101m268k364k20K9715J1182k1586O509J0905J3453L1950J826
16036C2322J7887L037M382k2090j3732l1265N02R311Q588L913R571M683n4237
16023b7128l7302J5137K8042K7556j8843J0893M4070J3982n0951l8260M141k453
$$ plain form
16112 34949 -21172 -11575 15504 -32445 -30938 -21391 -4529 26473 31428 47140 31434 22162 37
16099 37 -25554 -54266 -63406 -56398 -46007 -33271 -24364 13126 18655 35151 54782 60987 2703
16086 2703 -20891 -8951 -29243 -49286 -32384 -52870 -36470 4408 5442 -4178 -2171 -43103
16074 -43103 -38662 -60358 -50814 8047 31260 29432 10676 31746 24565 20702 -17192 -53228 -91800
16061 -91800 -113022 -93351 -72846 -35981 -14903 -6637 -17384 -20403 -52416 -22135 -5603 -21434
16049 -21434 -20679 -44780 -49048 -51412 -51632 -21917 -10735 -32321 -25812 -14907 -1454 30496 32322
16036 32322 50209 53246 57628 35538 21806 -9459 -8957 354 8942 12855 22426 27109 -27128
16023 -27128 -64430 -49293 -21251 6305 -12538 -1645 42425 56407 5456 -32804 -28663 -31116
16011c1116J5619K2769J1756l4982l5090L9402M9617l691K8870L6023j7499k1271
15999F0407j9304k5417l1228J1895N554J1043l2617k1265K316J1243K0506j5043
15987b1910o205J1887L0771K6698j131l792k266k8852m5524Q423Q165q094l0717
15974f2547k783J9383R738j8666k5170L6559q437j6480j9351j832O3098L3808
15962G320o308J0751J32J6298l6066m2664k3130K770J7379L4392K1889J0672K6534
15949C9969R781J0705r169j9280N304j7985J6706j0611m2455k219K0534J3736
15937A5016m8486P046K4037K4625N007j3007m6796m2842J7550N1948K7674K7250
15925D9022k5939m3291j2816J6114K7803k451L5294m0228J0376J2798L855M695
$$ plain form
16011 -31116 -15497 7272 19028 -15954 -51044 -11642 37975 34284 63154 99177 81678 60407
15999 60407 41103 15686 -15542 -3647 1907 12950 -19667 -40932 -38616 -27373 -6867 -21910
15987 -21910 -28115 -16228 14543 41241 40110 36318 34052 5200 -40324 -31901 -23736 -31830 -62547
15974 -62547 -65330 -45947 -36209 -54875 -80045 -43486 -51923 -68403 -87754 -89586 -26488 7320
15962 7320 1012 11763 11895 28193 -7873 -50537 -73667 -70897 -53518 -19126 2763 13435 39969
15949 39969 49750 60455 51286 32006 37310 19325 36031 25420 -17035 -19254 1280 15016
15937 15016 -33470 -26424 -2387 22238 27245 14238 -32558 -75400 -57850 -5902 21772 49022
15925 49022 23083 -20208 -33024 -16910 10893 8442 43736 3508 13884 26682 30537 35232
15913C5232O832l0534K7510J6744l462K1089j1686l3922k8998o318m377L2354
15901B0464K6896k3746j1436J8975j865k5075j1812l8858M1245L1261K011l3202
15889e142k1724k2624K9439M5153o60K1404M346K823n264j5413l2175l3161P012
15876b5986j7519m492J2959o365N01j7338l7186K258M6357K491l3628k0436M1970
15863e6414j2522o898K3287M522l380m6232k74K5014M0928M7921K7939j6181l9933
15850a2223M605j669k0734j1422k1629J3189L4426J5315j320k4200j1133L6643
15838a52K8008K1688p653j9066j6906O260j4326J1849J3016J6154o670j2860M429
15825B3771k1710l7440n026M2498J5316m011q205k9769j1482L2263M276K532l3418
$$ plain form
15913 35232 42064 11530 39040 55784 52322 73411 61725 27803 -1195 -7513 -11890 20464
15901 20464 47360 23614 12178 31153 29288 4213 -7599 -46457 -5212 26049 28060 -5142
15889 -5142 -26866 -49490 -20051 25102 24442 45846 50192 53015 47751 32338 163 -32998 -25986
15876 -25986 -43505 -47997 -35038 -41403 -40902 -58240 -95426 -93168 -46811 -44320 -77948 -98384 -56414
15863 -56414 -68936 -75834 -52547 -48025 -51405 -97637 -97911 -72897 -31969 15952 43891 27710 -12223
15850 -12223 -7618 -9287 -30021 -41443 -63072 -49883 -15457 -142 -1462 -25662 -36795 -152
15838 -152 27856 49544 41891 22825 5919 12179 -2147 9702 22718 38872 32202 19342 23771
15825 23771 2061 -35379 -40405 2093 17409 13398 5193 -24576 -36058 -3795 481 3013 -30405
15812c0405J8729K5616K7312l927M420K063j3061n9708l3439M0221K5133k8867
15800b5913p81K373k9947p469J6793M5605K6614r825j8533K1915j3559M710K148
15787A4131j1480l0981J341J2894K5041j1908j6901K203K1069K0269l9924k716
15775a6962J1715L5111N944j1805l9308J5776K0251N4k3123o0240n428M7745K0917
15762F47k0526j7375J1566l2599j0432Q948K473K6954O807k2213J8536J5669K3350
15749A1805k0460K69n966m3811j6478Q805J5466J9748L1600K9816j3412m1118
15737b3736j154K5354J6201L5659N816k4316m431J2643j7464K869j4421j5613
15725b593m822N968q18j2599J964K3699J9157O08K71L1719L2078j3063m4404j3643
$$ plain form
15812 -30405 -11676 13940 41252 37325 41745 43808 30747 -28961 -62400 -22179 2954 -25913
15800 -25913 -26694 -24321 -54268 -61737 -44944 661 27275 17450 -1083 20832 7273 11983 14131
15787 14131 2651 -28330 -26989 -14095 10946 -962 -17863 -15660 5409 25678 -14246 -16962
15775 -16962 -5247 29864 35808 24003 -15305 471 20722 20776 -2347 -62587 -68015 -20270 647
15762 647 -19879 -37254 -25688 -58287 -68719 -59771 -57298 -30344 -23537 -45750 -27214 -11545 11805
15749 11805 -8655 -8386 -14352 -58163 -74641 -65836 -50370 -30622 978 30794 17382 -23736
15737 -23736 -24890 464 16665 52324 58140 33824 29393 42036 24572 27441 13020 -2593
15725 -2593 -7415 -1447 -2265 -14864 -12900 10799 29956 30564 30835 62554 94632 81569 37165 23522
15711B3522k8017k4443N69L9170k2301m2242L8014M7374J3631L65j1825K802k5774
15698A0845r706n522j1721p530J4627K1302Q163l2869P329J1256k8087j7548k0798
15685f0259O0506J0199p494R786P335l479k1782J8930j5370J13P585N139l47l130
15671G732K102o530j0305K9266Q249Q811l126l2561l1224j3509L4831L5934L543
15658C3213j7287l3375K135j052J2032J2044l073m434O195j0215l1222l5779O362
15645f4456j5654J1948L6042K7528K251j7358n803N4321L3726k0114k4233k8314
15633a0116J8243K3699N881j1199k1761r51P822n438L432M555m457k3814k6905
15620d1009L3718K1808j7549n914K3803N1084k3836j3050k076K1151k1006r130
$$ plain form
15711 23522 -4495 -28938 -28369 10801 -11500 -53742 -15728 31646 45277 45642 33817 36619 10845
15698 10845 1139 -4383 -16104 -23634 -9007 12295 20458 -12411 -5082 6174 -21913 -39461 -60259
15685 -60259 247 10446 2952 12738 20073 16594 -5188 13742 -1628 -1515 6070 11209 10862 7732
15671 7732 9834 3304 -7001 22265 30514 39325 36199 3638 -27586 -41095 -6264 29670 33213
15658 33213 15926 -17449 -15314 -16366 -4334 7710 4637 203 6398 -3817 -35039 -70818 -64456
15645 -64456 -80110 -68162 -32120 -4592 -2341 -19699 -25502 28819 62545 42431 18198 -10116
15633 -10116 8127 31826 37707 26508 4747 3796 11618 6180 9612 14167 9710 -14104 -41009
15620 -41009 -7291 14517 -3032 -8946 14857 65941 42105 29055 26979 48130 27124 17994
15608A7994J1256J6451o725m4908k4103K7701J8236j8999k2355l8278j0564O175
15596f8119M7434L146k7049j6915J3988L8520L1963R273J5155J9348j833n0635
15584A4276k5032K3387j8345k8677k0212j8296j6496R302L1328N8315L3065k8819
15572A3796n3899O666N2507J4088l9507K609L7920J3564N191J0913j6725L3400
15560H0523P074m0249m1999n1898j6030J8803K4157M96L4063L6844N493q737m1958
15547F582Q359K3324K3201k6032j5549O662k3031N218K4100l2222P42J4956j031
15534A5279K1883j1281M612p0649k8994J1679m4516k1721K9659N2923L0890q44
15522a1080k2264r209K7903J7683R44k4583L6671L0364k5347r330L7645o0834
$$ plain form
15608 17994 29250 45701 38976 -5932 -30035 -2334 15902 -3097 -25452 -63730 -74294 -68119
15596 -68119 -20685 -17539 -44588 -61503 -47515 -8995 22968 32241 47396 66744 64911 14276
15584 14276 -10756 12631 -5714 -34391 -54603 -72899 -89395 -80093 -48765 9550 42615 13796
15572 13796 -40103 -33437 19070 33158 -6349 -3740 34180 47744 52935 63848 47123 80523
15560 80523 87597 47348 5349 -46549 -62579 -43776 -19619 -19123 14940 51784 57277 48540 6582
15547 6582 14941 38265 61466 35434 19885 26547 3516 8734 32834 612 1354 16310 15279
15534 15279 37162 25881 30493 -40156 -69150 -57471 -101987 -123708 -94049 -41126 -10236 -11080
15522 -11080 -33344 -42553 -14650 3033 3977 -20606 16065 46429 21082 11752 49397 -11437
15510a1437j8880L3704K4048j0275K709j8862N76L7855L6573n2216k5595O673
15498D873M0515n095k5599k2638n941j4979K0054j590r429j1940R415R939K6347
15485A3932L707j9382j4969R592j8370q369L6389L4847k0128j236R253J4293J2363
15472E1922l6285j9400L138K6799J3606K3111m0883o6770L4113L44L003L1698
15460B4396O729q212k5634q308N9552L2030k7646m5087l9265k1309j0995K1677
15448d2072K2648L0687J5197J6115J5146k409n829l3382k317O1741j6313k9360
15436B9852L11l0153N80J5532K0290l1234j5224l111J9074o588J5775n896m3097
15423c3889J2504J094K1732L8942j9151m8590k2817M4069J5546j7643J7223K7860
$$ plain form
15510 -11437 -30317 3387 27435 17160 19869 1007 1583 39438 76011 23795 -1800 4873
15498 4873 45388 40293 14694 -7944 -13885 -28864 -8810 -10400 -19829 -31769 -22354 -12415 13932
15485 13932 17639 -1743 -16712 -7120 -25490 -33859 2530 37377 17249 16013 25266 39559 51922
15472 51922 15637 -3763 -625 26174 39780 62891 22008 -44762 -10649 -10305 -7302 24396
15460 24396 31125 22913 -2721 -11029 48523 80553 52907 7820 -31445 -52754 -63749 -42072
15448 -42072 -19424 11263 26460 42575 57721 55312 49483 16101 13784 75525 59212 29852
15436 29852 30163 10 590 16122 36412 5178 -10046 -13157 5917 -671 15104 9208 -33889
15423 -33889 -21385 -20291 1441 40383 21232 -27358 -50175 -6106 9440 -8203 9020 36880
15411C6880j4370j4391o394J9198m3424l1793M7877K4099n3887q945L0444q350
15399b3056J1547J5807j4633m9595q44K4669O103J9365L686R012n2328p590J7901
15386c9956L1114J0200J895j139J2250L2910j6901O474J1794n3891n7645k709
15374f5604L7566O792j0504n689K1712K4472j4248k5734j1635J7458M1359R347
15362B5292M181L0607k080j5207k7794J1312J6711Q366l5187M221J5074K8723
15350F4219J261o4066k6074K7667M079m5174k0030K6973K9487k6287J7334L7180
15338B6569J924l5556k3006J9166K5048k2629j9093J4437j2370J1010j7977l2950
15326f5427k245J6207j1198P918L4259j749k0606J5393K0787O768k7629l6202
$$ plain form
15411 36880 22510 8119 1725 20923 -22501 -54294 -6417 17682 -36205 -45150 -14706 -23056
15399 -23056 -11509 4298 -10335 -59930 -60774 -36105 -30002 -10637 -6951 2061 -50267 -57857 -39956
15386 -39956 -8842 1358 3253 2114 14364 47274 30373 36847 48641 -5250 -62895 -65604
15374 -65604 -28038 -21246 -31750 -37439 -15727 8745 -5503 -31237 -42872 -25414 15945 25292
15362 25292 29473 60080 58000 42793 14999 26311 43022 51388 16201 20422 35496 64219
15350 64219 65480 1414 -24660 3007 7086 -38088 -58118 -31145 -1658 -27945 -10611 26569
15338 26569 28493 -7063 -30069 -10903 14145 -8484 -27577 -13140 -25510 -14500 -32477 -65427
15326 -65427 -67672 -51465 -62663 -54745 -20486 -22235 -42841 -27448 -6661 107 -27522 -63724
15314f3724n5747m7075P6259O4450M5449n724J7189O081k9235r784L364k8475
15302b6972r212M2963O295L155k024k2958L183L1461j4191m040J4362K4778k2987
15289B3813j9855k1250L8882L3803j3049j2378m3866J155q744j7356K4504K9596
15277A5255j671j5422k3242J6261L6350K2715j5352J6874k0442l794J5747L0350
15265G3629j8768m0070J0474K617l0359l2904K1064M6770M9559K3378J4287j7994
15253A01683k2623k1532p4159k3646J4752O325l0013J3420k2090m3344L8485M7973
15241a4769K1223j7624j7589k0021m896n948n702O5945N3402k8762l1487R334
15229C106L2977K1393r135m1246l3261J0322M400M852J3578L3581j2295n635k3159
$$ plain form
15314 -63724 -119471 -166546 -90287 -25837 19612 13888 31077 37158 7923 -1861 1503 -26972
15302 -26972 -36184 6779 13074 16229 14205 -8753 -5570 25891 11700 7660 22022 46800 23813
15289 23813 3958 -17292 21590 55393 42344 29966 -13900 -12745 -21489 -38845 -14341 15255
15277 15255 13584 -1838 -25080 -8819 27531 50246 34894 51768 31326 27532 43279 73629
15265 73629 54861 14791 25265 27882 -2477 -35381 -14317 32453 82012 105390 119677 101683
15253 101683 79060 57528 -16631 -40277 -25525 -19200 -49213 -35793 -57883 -101227 -62742 -14769
15241 -14769 6454 -11170 -28759 -48780 -53676 -59624 -65326 619 54021 25259 -6228 3106
15229 3106 36083 57476 48341 7095 -26166 -15844 -11444 -6592 6986 40567 28272 22637 -522
15216e22k1288P739L25j9474J5408k7077k2496n859J4247M9591R156Q895J3717
15203B2362L5735J3388k3791q893J0453q766l0834k782M1710N895r071k877k1792
15190B0737j3940r274j1463j5165M0282K5197j7959k4513K638K0093K4961K2108
15178F3702K1296k4233l3244k6659j6318l2331k034Q467O848n156N586K9740k5309
15165b9645J2998j1535L1010J3871l0823p094K7530O527P210m983J7806k4153
15153H719o332l134k2314m7658n062J2244K7148M8221J2680o096M815m4850k6591
15140d8210K4701M796J3899J1349N785L704j6160j338m149j7233O387L1002l384
15127A1149j6471N692K7822k637l3339j7848K8122j7427k002J5654r723M294J7688
$$ plain form
15216 -522 -21810 -14071 -13746 -33220 -17812 -44889 -67385 -73244 -58997 -9406 -250 8645 22362
15203 22362 58097 71485 47694 38801 49254 40488 9654 6872 48582 54477 45406 42529 20737
15190 20737 6797 -2477 -13940 -29105 11177 36374 18415 -6098 -3460 16633 41594 63702
15178 63702 84998 60765 27521 862 -15456 -47787 -49821 -41354 -34506 -39662 -34076 -4336 -29645
15165 -29645 -16647 -28182 2828 16699 -14124 -21218 6312 12839 20049 15066 32872 8719
15153 8719 2387 -747 -23061 -70719 -75781 -63537 -36389 11832 24512 18416 23231 -21619 -48210
15140 -48210 -23509 -18713 -4814 6535 12320 16024 -136 -1474 -5623 -22856 -16469 14533 11149
15127 11149 -5322 370 28192 25555 -7784 -25632 2490 -14937 -16939 -1285 -11008 -6714 10974
15114A0974j0135l9324p032K6968R798K2571N781N1345n512k6239L302M019l3674
15101A2842l3391j0764M365m3705Q296J9488j1260m2337l1416K1014M7104N3381
15089f383R458r549q821L6009q245L2024n7496j5585j2392N3191k3131l0649J467
15076d0102L3880l9498j4309K8042L6319K291l4875k683J5696j0278j8358K5217
15064a8658j3164M519N115M113K6043p837k666j0519k8195K0984j164j4005k163
15051c7597J6111j4521J970J2362K5189L1726m9017m8767K5147M1474n846l4926
15039c6695m300L0760O090j7374Q549J0910l0568j1340K1787J4472k7714k8366
15027f3789L4223j321j3339K1301l2334K3824L5739k4071n224K7179k8228J7493
$$ plain form
15114 10974 839 -38485 -45517 -18549 -8751 13820 19601 70946 65434 39195 42497 46516 12842
15101 12842 -20549 -31313 -26948 -70653 -62357 -42869 -54129 -96466 -127882 -106868 -59764 -6383
15089 -6383 3075 -6474 -15295 20714 12469 44493 -13003 -28588 -40980 12211 -10920 -41569 -40102
15076 -40102 -6222 -45720 -60029 -31987 4332 6623 -28252 -30935 -15239 -25517 -43875 -18658
15064 -18658 -31822 -27303 -22188 -18075 7968 131 -2535 -13054 -41249 -20265 -21429 -35434 -37597
15051 -37597 -21486 -36007 -34037 -21675 3514 35240 -13777 -62544 -37397 4077 -1769 -36695
15039 -36695 -40995 -10235 -4145 -21519 -12970 -2060 -32628 -43968 -22181 -7709 -35423 -63789
15027 -63789 -29566 -30887 -44226 -22925 -55259 -31435 4304 -19767 -24991 2188 -26040 -8547
15015h547O2125K5792m4732k7556M903J882K871j2749k9358K6646K3762j4383
15003A0656k7080j7517p513N3407l903M886j0544J8611N1023k6370k7720l136
14991A4800N752o944J080L946j5227K7525k8133l9573J2713L4532J7372O055K8568
14978F2466J557k3045o182k2878J0408p676k9665m503k492O3113J9317j3272m1407
14965E741l8476l375M7374M4929q954m3966m5289k4111K2382K9291K4509n308
14953D747l2977J5902k049k0579J8341K1919p149P894q441J1838K6391l6037l6839
14940c7039L0748K0861l1399j1898K6968j5152m4328l80M967N073N720K699K3596
14927a9564o959k4290L2935K5465k4805J0796j204J8964J3452o169j0063L8981
$$ plain form
15015 -8547 53578 79370 34638 7082 11985 13867 16738 3989 -25369 1277 25039 10656
15003 10656 -16424 -33941 -41454 11953 8050 12936 2392 21003 72026 45656 17936 14800
14991 14800 20552 13608 14688 18634 3407 30932 2799 -36774 -24061 10471 27843 33898 62466
14978 62466 64023 40978 34796 11918 22326 14650 -15015 -19518 -22010 41103 60420 47148 5741
14965 5741 -32735 -36110 11264 56193 47239 3273 -42016 -66127 -43745 -14454 10055 4747
14953 4747 -28230 -12328 -14377 -34956 -16615 5304 -1845 6049 -2392 9446 35837 -200 -37039
14940 -37039 -6291 14570 -16829 -28727 -1759 -16911 -61239 -61619 -56652 -51579 -45859 -43160 -19564
14927 -19564 -26523 -50813 -17878 7587 -17218 -6422 -7626 11338 24790 18621 8558 47539
14915D7539L0904o874K7376j9903l7149n06j8154k3585j5419J2641N0397O735
14903E4002j0055l6310r404N5602J4380k8711o1612m6227J8345K6429l3278m375
14891f1214k174K310O737K4097q446L5425J7672j0584L9292L855j9284j3908l6099
14878b2321J742J2266J7022Q026K1713O880k8032k0342N352o016p204N260K8918
14865B3264L0637K6271l0306n6857M2322J9461m1798n2038O46N8731J7721j0601
14853B7453J3902L5197k307Q201j841l2983n2506k3747K6247K4951o338r945n109
14840A175k011L812k7972N999K7473L413N953j0080K4462L4435m0374r139M2149
14827E9295p51j9229o4799l9687J9053K3867K7572J7664j7256m0257o414j5723
$$ plain form
14915 47539 78443 71569 98945 79042 41893 41387 23233 -352 -15771 -3130 47267 54002
14903 54002 43947 7637 -1767 53835 68215 39504 -22108 -68335 -49990 -23561 -56839 -61214
14891 -61214 -63388 -61078 -54341 -30244 -38690 -3265 14407 3823 43115 46970 27686 13778 -22321
14878 -22321 -20579 -8313 8709 16735 38448 45328 17296 -3046 2306 -3710 -10914 -5654 23264
14865 23264 53901 80172 49866 -6991 35331 54792 12994 -39044 -38398 20333 38054 27453
14853 27453 41355 76552 74245 82446 80605 47622 -4884 -28631 -2384 22567 16229 6284 1175
14840 1175 -836 2976 -24996 -18997 8476 11889 17842 7762 32224 66659 26285 17146 59295
14827 59295 58544 39315 -25484 -65171 -46118 -22251 5321 22985 5729 -34528 -40942 -56665
14815e6665J8182J3259K4946P249P697J6526k427K519K6965M290k2153n4998l3807
14802d8417J6326J2821R806L3507M9459j4908j4427k1103j8645j1940k4269L4253
14790B463P872q004J1042J0871j5118l708J584k4497n802L8441J6117q534k3200
14777d73L1610K7896J4990p915k3028q537j0125K9013l6074j7131J5683p701J9862
14764B8070K6085r240j4979O505q754l2579j0594L8912J7430R264p97j1301j110
14751C6912O29l62k3790l4275l9124n863K0545L5224K0143j417r073L1698M0L7439
14737F8726Q768m1172j1186m0831j3133Q42J5431L5734L1326J199j5168j0361
14725C0175k0606J4842r863k4145l3654J8664J9574J1362J8400p762m4278o519
$$ plain form
14815 -56665 -38483 -25224 -278 6971 14668 31194 28767 31286 58251 62541 40388 -14610 -48417
14802 -48417 -32091 -19270 -9464 24043 73502 58594 44167 23064 4419 -7521 -31790 2463
14790 2463 10335 2331 13373 24244 9126 5418 7002 -17495 -23297 15144 31261 22727 -473
14777 -473 31137 59033 74023 66108 43080 34543 24418 53431 17357 226 15909 8208 28070
14764 28070 54155 44915 29936 36441 27687 -4892 -15486 23426 40856 50120 49323 38022 36912
14751 36912 37541 37179 13389 -20886 -60010 -65873 -45328 -10104 10039 8622 -451 31247 31287 68726
14737 68726 77494 36322 25136 -15695 -28828 -27986 -12555 23179 54505 55704 40536 30175
14725 30175 9569 24411 14548 -9597 -43251 -24587 -5013 6349 24749 16987 -27291 -33810
14713c3810L8872K0754o618j3934p367j5253Q889J7239P271L3373l199j8615j1219
14700A6383j2407k3716J2690K5336J791k1450k6520m920M2528O75P237j2043O013
14687A1597L875r808k2754l5669K3570L9281K8142Q090j3383J752j6043j0526
14675H124L1263r240j6314P016Q983k5382O057J0848l4796P058R727L4443K8559
14662F6346j4453o8418j2912N6879K5744m9247j7651L6703N267k70r467R520L0226
14649E8267j1817n474j4281l3443q822L1050J5508j4679J1371j3254o958J6101
14637B3569L1498L538j2508l1298J9427J5298m5747J8333J8807k119K2613l815
14625E7596p166J0664M827J4367Q478J3985l3635k5589R987m8358l9019M1378
$$ plain form
14713 -33810 5062 25816 19198 5264 -2103 -17356 -8467 8772 16043 49416 46217 27602 16383
14700 16383 3976 -19740 -7050 18286 20077 -1373 -27893 -32813 9715 10390 17627 5584 11597
14687 11597 15472 5664 -17090 -52759 -29189 10092 38234 46324 32941 34693 18650 8124
14675 8124 39387 30147 13833 20849 29832 4450 10507 21355 -13441 -6383 3344 37787 66346
14662 66346 51893 -16525 -29437 27442 53186 3939 -13712 22991 28258 27988 18521 28041 58267
14649 58267 46450 40976 26695 -6748 -15570 15480 30988 16309 27680 14426 7468 23569
14637 23569 55067 58605 46097 14799 34226 49524 3777 22110 40917 38798 61411 57596
14625 57596 50430 61094 65921 80288 88766 102751 69116 43527 53514 5156 -33863 7515
14613G515M7912J626J4262K0706j3627k9256J9447K8806j5427k1121K416K3644
14601H6903j2727j3535M7K4539j618j2099j2244N1083p075J1306j3823j9133k0801
14588F0823K641M9544M6848K9229L5643N6327l9859m2948j3332k958K4989K7733
14576B34680J6516j9687q704M274j8365P090K3676J035k0016k3460k2842l021
14564A71176K0078k8169O774p312l5349j3570J5951L4059j8444k5411m2039l8457
14552C9287K2719M5471L5823o4105j5817o355p669M5368J6669j1129m2436l7595
14540B0231L3185m590J8422M7154k7405q456r732L751j5355l4774k7795L929K8433
14527B6998k3711m3K7126J7873k4330l2753j1920L3597l729j7528K7595N1023
$$ plain form
14613 7515 55427 57053 71315 92021 78394 49138 68585 97391 81964 60843 63259 86903
14601 86903 74176 60641 60688 85227 83609 71510 59266 110349 103274 114580 100757 81624 60823
14588 60823 63464 113008 159856 189085 224728 281055 241196 198248 184916 181958 206947 234680
14576 234680 251196 231509 222805 227079 208714 215804 239480 240515 220499 197039 174197 171176
14564 171176 191254 163085 169859 162547 127198 113628 129579 163638 145194 119783 77744 39287
14552 39287 62006 107477 143300 79195 63378 57023 49354 94722 111391 100262 57826 20231
14540 20231 53416 48826 67248 114402 86997 78541 68809 72560 57205 22431 -5364 -1435 26998
14527 26998 3287 3244 30370 48243 23913 -8840 -20760 12837 9108 -8420 19175 70198
14515G0198R758j9381R937l63j6644r491M14L825J3785l2308m6560j295K6718
14502H593K7547n921n969K750O490M9599n452R050J1476l6312m1789k8835n755
14489a4528j37r814O366J8832J8639l7462r961K9344L5014K267p489j9182R730
14476B1619P815O237J0964k1604N7058L7200K1908l2448k4550k2578n7516R554
14464A3659J1004k9348K9382J9516k6813J560L764m01q022N742J2222K7246j3219
14451D6292o301K6646L0252k6626n9939j8760m3429o326L8361K4446K0650P829
14439C3095N93k134O193J4218j9087j1402M442p396k6688O180L0006R664l0401
14426G283k3457j1822J3205K4544j222J6351l202m695J2400J4052l8443J9360
$$ plain form
14515 70198 79956 60575 70512 70149 53505 44014 44428 48253 62038 29730 -16830 -18125 8593
14502 8593 36140 30219 24250 27000 33490 83089 77637 86687 98163 61851 20062 -8773 -14528
14489 -14528 -14665 -24479 -18113 719 19358 -18104 -28065 1279 36293 38560 31071 11889 21619
14476 21619 29434 35671 46635 25031 82089 119289 141197 108749 84199 61621 4105 13659
14464 13659 24663 -4685 24697 44213 17400 18960 22724 22323 14301 20043 32265 59511 46292
14451 46292 39991 66637 96889 70263 10324 -8436 -51865 -58191 -19830 4616 25266 33095
14439 33095 33688 31554 37747 51965 32878 21476 25918 18522 -8166 -1986 28020 37684 7283
14426 7283 -16174 -27996 -14791 9753 8531 24882 21680 16985 29385 43437 4994 24354
14414B4354M91p40j5263j5722j5793j551p762L2733k3166p593q017M4672N015
14401A1658k0229L0278O513K4572L5590J6456m246q372N126k1551o991n7381k3222
14388a1799k570M4100R15J279r978J8872m5840l6366L1016N9859J3441k8105j3263
14375B1561m4280J1829M3967l743l784J0707j293J2417J2181j2977r422O540p596
14362C6107j9969j5948K3924K9892n827n3553j5492K2492K4042L3382J1202l1422
14350C8830k0202j1442k8248M225p607k3395Q106K9922O1147O604k3102P225K9013
14337G1076K127k2625O501J2587j5336q318j4409o155k0947q054N6013N1079j1127
14324I2412k7900n2879r095q311M171J9109o536j4474L3355L4007l2944l5547
$$ plain form
14414 24354 24845 24105 8842 -6880 -22673 -24224 -31986 747 -22419 -30012 -38029 6643 11658
14401 11658 -8571 21707 28220 52792 88382 104838 100592 92220 97346 75795 68804 11423 -11799
14388 -11799 -14369 29731 30646 31925 21947 40819 -5021 -41387 -10371 49488 62929 34824 21561
14375 21561 -22719 -10890 33077 29334 25550 36257 34964 47381 59562 46585 37163 43703 36107
14362 36107 16138 190 24114 54006 48179 -5374 -20866 1626 25668 59050 70252 38830
14350 38830 18628 7186 -21062 -16837 -24444 -47839 -39733 -9811 51336 57940 34838 42063 71076
14337 71076 73203 50578 57079 69666 54330 46012 31603 25448 4501 -3553 52460 103539 92412
14324 92412 64512 11633 2538 -5773 -1602 17507 10971 -3503 29852 63859 30915 -4632
14312d632j2545L0501L226k1655j838j4788k831J2294J0203O857J657N767l0351
14299a8135l233M7187L2978j6419m447M894n92J6380j060m1879l3042K9077M0945
14286E2654l8586l843J9429k1363j8809N020M9239M5838j5978n8812l2408J7402
14274b17l363K2729O2340k8662p993r97j5339j4339J7785J2522J0997q311j6392
14261C0760m3791k3546J1170J1765J4600M616j8039P801o599K365l732R117K8340
14248B4827K0435k6319k1280k2312l756L6113M4743l996k5841l3185q3J0536M6148
14235D6030l4002l8965O274L4516j8374J813r465j4276N2021R6762J4258m2069
14223I4523Q299k5758p09M9001P273m9976O956K8865J8790j7021k8921k8824l3026
$$ plain form
14312 -4632 -17177 13324 16550 -5105 -6943 -21731 -24562 -12268 -2065 4792 6449 12216 -18135
14299 -18135 -21368 25819 58797 42378 37931 42825 42233 58613 57553 15674 -17368 11709 52654
14286 52654 14068 10225 29654 8291 -10518 -5498 43741 89579 73601 14789 -17619 -217
14274 -217 -3580 19149 81489 52827 44834 43837 28498 14159 31944 44466 55463 47152 30760
14261 30760 -13031 -36577 -25407 -13642 958 5574 -12465 -4664 -11263 -8898 -12630 -3513 24827
14248 24827 45262 18943 -2337 -24649 -28405 7708 52451 48455 22614 -10571 -10654 -118 46030
14235 46030 12028 -26937 -20663 13853 -4521 -2708 -12173 -26449 25572 122334 136592 94523
14223 94523 102822 77064 76355 125356 132629 82653 89609 118474 137264 120243 91322 62498 29472
14210B9472n1638L0712L119L6303O390k8703m034n269j7263j7452M3048o675j584
14197A6426k5866m7667o415M2889K0326K1399J5640L9855k4725l5152M508J2094
14185C3312j1699k7732R49l028N653M3218k0538k2729K0164K8572L280J6819O4
14172F6305K1390K5663r650k3038l7803Q296K3365O157k8255K1197j9541k2567
14160C1519k4491m85k8756K892J3921j4587J058M7066j0023k3481M229J6751K9122
14147D4735j5924l0864j5293J6448J0275J0345l736K441l2572j8651o489k984
14135d2269j7391r190K3034J1751j5576N3791N4991m479l5156l7505m8579n749
14123g2327j3482M9617J5830J9853L4725j0879j2366n587Q074k8774j587J2596
$$ plain form
14210 29472 -22166 8546 11665 47968 54358 25655 21621 16352 -911 -18363 24685 18010 16426
14197 16426 -9440 -57107 -63522 -20633 -307 21092 36732 76587 51862 16710 21218 33312
14185 33312 21613 -6119 -5170 -8198 -2545 40673 20135 -2594 17570 46142 49422 66241 66305
14172 66305 87695 113358 103708 80670 42867 51163 74528 80685 52430 73627 54086 31519
14160 31519 7028 6543 -22213 -19321 -5400 -19987 -18929 28137 18114 -5367 -1138 15613 44735
14147 44735 28811 -2053 -17346 -898 9377 19722 15986 18427 -14145 -32796 -39285 -42269
14135 -42269 -59660 -68850 -45816 -34065 -49641 4150 59141 54662 19506 -17999 -66578 -72327
14123 -72327 -85809 -36192 -20362 -509 34216 23337 10971 5384 13458 -15316 -16903 -4307
14111d307k3210K215J8563O838M965L0978L2657j280J9500L6209l3361k7251k590
14098E9926j9066K1461M281k4686l9250k1318J3630K7138K1541R473J705k3274
14086C1561j050J811k3179L2032K6314K5392j5749l5615J6211k0085K5262K0616
14074H3521r934l3415k1632k3415p746J5627J9497l502K157K0083k9308l1182
14062a9249K0112J4378l816l943j0285M4488L2647l7975j5024j0638k870L506
14050A1331L6746l9828k7081J5823n891r103J7793J0083k7623J8180J6582R668
14038B6680l092k6102l6042p1684k2566L0104M3303M5985l973k6222O980K6620
14026a0009K8537R039K8426j5466j3117J2617O281q687L037l9976O524N1080l606
$$ plain form
14111 -4307 -27517 -25302 -6739 99 5064 36042 68699 67419 86919 123128 89767 62516 59926
14098 59926 40860 62321 66602 41916 2666 -18652 -5022 22116 43657 53130 54835 31561
14086 31561 30511 32322 9143 41175 67489 92881 77132 41517 57728 37643 62905 83521
14074 83521 73587 40172 18540 -4875 -12621 3006 22503 19001 21158 41241 11933 -19249
14062 -19249 863 15241 11425 7482 -2803 41685 74332 36357 21333 10695 7825 11331
14050 11331 48077 8249 -18832 -3009 -8900 -18003 -210 9873 -17750 430 17012 26680
14038 26680 23588 -2514 -38556 -110240 -132806 -102702 -59399 -13414 -17387 -43609 -36629 -10009
14026 -10009 18528 27567 55993 40527 27410 40027 46308 37621 40658 682 7206 58286 54680
14013E4680J2715o717j7759j5252j885j1014J7720K3078l475l3581J154j0016
14001I648j1222M4573J2162m062J3490J874J7227M24J5771J4062m4426l3717K180
13988C7984L0266k4308k7898n8839m6640J2430L4805L0096L1588L3716j9564q073
13976B5563k5443r296M0733M8232j5115m6704m9039K2133N038K6055N2103K1182
13964I5442j8782l0335k5913j624J9522J6589K4121m842j495J487k2176m1023
13952A0971j4432R014o354R00j518L9757M4727j2700k5248j225J7254P438J3187
13939H1771q328j9514k7766J6493M0068N09k5733l0660l3378K35P659M5896K5283
13926G2535r88k0577l783J1313k8321N064L5232l1532k7115Q024J62K5328j9755
$$ plain form
14013 54680 67395 60678 42919 27667 25782 14768 32488 55566 52091 18510 19664 9648
14001 9648 -1574 42999 55161 51099 64589 66463 83690 84114 99885 113947 69521 35804 37984
13988 37984 68250 43942 16044 -42795 -89435 -77005 -42200 -12104 19484 53200 33636 25563
13976 25563 120 -9176 31557 79789 64674 17970 -31069 -8936 -3898 22157 74260 95442
13964 95442 76660 46325 20412 18788 38310 54899 79020 74178 72683 74170 51994 10971
13952 10971 -3461 5553 -801 99 -1419 38338 83065 70365 45117 43892 61146 68584 81771
13939 81771 73443 53929 26163 42656 82724 83233 57500 26840 -6538 -6303 1356 47252 72535
13926 72535 71547 50970 47187 58500 30179 35243 70475 38943 11828 19852 20014 45342 25587
13913B5587o518N886k9721o44J7542L914j6715k5520K1761L1410J3512o0442l2371
13900e2319K1010R452M8032o676K93J6399j2028k2566j2589k2124M4549J6764
13888B8197q748l9214M6588N8327K2197k6103j4282K8764o478J1270M183N945
13876A10646r108j9237j705j6160l2299l5798j6811Q450o635p989J4562J942K9690
13863A9548R691j4497k691J0850n131j33M1338J1544j1454j2527k6156J9221l697
13850C5906j8417J0661J1407K2317L3021l0962l5780k829K0830L2666m9279p600
13838B1941J520l0386q715L8597l051Q167K6165k8559l0920q210r668J0239K9920
13825A7040J7076k8327k3348m004K4570J8999J9720J1291j2446r665m707j1327
$$ plain form
13913 25587 19069 24955 -4766 -5410 12132 16046 -669 -26189 -4428 26982 40494 -19948 -52319
13900 -52319 -31309 -21857 26175 19499 19792 36191 24163 1597 -10992 -33116 11433 28197
13888 28197 19449 -19765 26823 85150 107347 81244 66962 95726 89248 100518 104701 110646
13876 110646 101538 82301 80596 64436 32137 -3661 -20472 -12022 -18657 -26646 -12084 -10142 19548
13863 19548 29239 14742 12051 22901 17770 17637 58975 70519 59065 46538 20382 39603 35906
13850 35906 17489 28150 39557 61874 94895 63933 28153 25324 46154 78820 29541 21941
13838 21941 23461 -6925 -15640 22957 19906 28073 54238 25679 -5241 -13451 -23119 -12880 17040
13825 17040 34116 5789 -17559 -21563 3007 22006 41726 53017 40571 30906 26199 14872
13813A4872k6968N203J0518j7631q41L0542J2017M2192J1518k5970m8821k6868
13801b0237K5152L0905k82K9144j8390k3481k0120r145K3741Q616k712n519k5246
13788g574L408j0192J4274J1201M5508J5040j883Q962r017k7300q227Q634j557
13775D1277k2099L2k1573M157j3728k6008O3280O3126k111k0136o677j2561L5594
13762H2573J6159n0815j8574p419l7711j3516r318K6811M4036J3470M7322K9422
13750A22440P704j2210k9588k0078j1251p606j9763j1469K1276L9256m6326m3916
13738a1531j0458K5561n795O255m234j0906j3951M374r788r313L2520L3272j7723
13725H283j5983k397L8245L5598m612N98J3372j8127j5343n791k1358K2730J6148
$$ plain form
13813 14872 -12096 -6893 3625 -14006 -14847 15695 27712 69904 81422 55452 6631 -20237
13801 -20237 4915 35820 35538 64682 46292 22811 2691 -6454 17287 25903 23191 17672 -7574
13788 -7574 -4166 -14358 -84 11117 56625 71665 69782 78744 69727 42427 34200 42834 41277
13775 41277 19178 19210 -2363 1794 -11934 -37942 25338 88464 86353 66217 59540 46979 82573
13762 82573 98732 47917 29343 21924 -15787 -29303 -38621 -11810 32226 45696 93018 122440
13750 122440 130144 117934 88346 68268 57017 49411 29648 18179 39455 78711 32385 -11531
13738 -11531 -21989 3572 -2223 4032 -202 -11108 -25059 -20685 -30473 -39786 -7266 26006 8283
13725 8283 -7700 -10097 28148 63746 59134 59732 73104 54977 39634 33843 12485 35215 51363
13712E1363M140l2996k5923P752N9K5998N945K684L151K7875K852l8570k1874
13699A2456L6691O0739o720J7521K0671K0929k7968k7322k3262J2750K5645j4726
13687A07404j5721p224J8719l0730o046N414m5646p928j6984R443k0307o582L4696
13674A8508K422n6998J8594M8726m927j0899J9089J406p852j7877J2349K4635
13662D7176K8369P882j1928k5804K2339l3241m9577j279L6447J9303j4807J3256
13650C8136K2571j9100j4520K6480L6651k2285m9883r298J4919j6861j4182N2626
13638D5254j6100m1755J1515K9197J8831J1818k7076K036K748r970j6425K1494
13626C1567m553o599N116K214p661J6498j033m200p516J5582J9779j1944K9137
$$ plain form
13712 51363 55503 22507 -3416 4336 4395 30393 36338 39022 42173 70048 72900 34330 12456
13699 12456 49147 109886 103166 120687 141358 162287 134319 106997 83735 96485 122130 107404
13687 107404 91683 84459 103178 72448 66402 71816 26170 18242 1258 10701 -9606 -16188 18508
13674 18508 20930 -36068 -17474 31252 26325 15426 34515 35921 28069 10192 22541 47176
13662 47176 75545 83427 71499 45695 68034 34793 -14784 -16063 20384 39687 24880 38136
13650 38136 60707 41607 27087 53567 90218 67933 18050 8752 23671 6810 -7372 45254
13638 45254 29154 -12601 -1086 28111 46942 58760 31684 33720 36468 26498 10073 31567
13626 31567 27014 20415 25531 27745 20084 36582 35549 31349 23833 39415 59194 47250 76387
13613G6387K4235l1743m4561r502m2335l6393L1355O6637J6373l861J6935q836
13601E4691J1208K450l8571j6656L0588K1165l1852p836o698l2450M510K2308
13589A2857M2378L296j8215k2843m0793M421O3225J7368l1507j8518q829Q171
13577A1011L3050J9860N021p508J996j8863k0427K17n856r440K6664j3980k1543
13564B02K7414p390J400J6402j6774K8249K1106o476j4503k8570j5456J1414K6635
13551D3653J3008J4409l3613j0099o560J9026m1165n1928L8664N195J7267L5495
13539D3352J7065Q444m0578J524k8374k2678J0214J2808L0185j3578j0539L580
13527A1425J8720l3044j731P951J2212j8748k2266N345M572l5100K7985K9239
$$ plain form
13613 76387 100622 68879 24318 14816 -27519 -63912 -32557 34080 50453 46592 63527 54691
13601 54691 65899 68349 29778 13122 43710 64875 33023 25187 18489 -13961 -9451 12857
13589 12857 55235 58531 40316 17473 -23320 -18899 44326 61694 30187 11669 2840 11011
13577 11011 44061 63921 68942 61434 63430 44567 24140 24357 18501 9061 35725 21745 202
13564 202 27616 20226 21626 38028 21254 49503 70609 64133 49630 21060 5604 17018 43653
13551 43653 56661 71070 37457 27358 20798 39824 -1341 -53269 -14605 -9410 7857 43352
13539 43352 60417 68861 28283 29807 1433 -21245 -11031 1777 31962 18384 7845 11425
13527 11425 30145 -2899 -4630 3321 15533 -3215 -25481 -20136 -15564 -50664 -22679 6560
13515F560k2586L4074J0541j1867k3792J7303N5184Q288o059j2599j7006k0550
13503A7491J3935M2282K6680j0725k1245o2916J3787J1475k0284M505J2148P444
13491C4577j9095o340J2956k788j9301J2924P139N1985J2350P119j3610k7845
13479E0071j5803k0738J5391j4270J6743O42k0837j3888r483r353j2426J0473
13467b3478J180K4005J691q704M5613L6700l331o296K7938K518l2776j623j2970
13454E0467j6988K5840Q56L2085R763j4541L023M1276L0344k6901m5286k2006
13442F7932R621J2233k1356k6697J5551L14M128k6924L644M8975J9826j2486J702
13429I6463L51k7869J0818l2786r043Q653o166r141j3733r949M0547o191M9580
$$ plain form
13515 6560 -16026 18048 28589 16722 -7070 10233 65417 73705 67646 55047 38041 17491
13503 17491 31426 73708 100388 89663 68418 5502 19289 30764 10480 14985 27133 34577
13491 34577 15482 9142 22098 19310 9 12933 20072 72057 84407 91526 77916 50071
13479 50071 34268 13530 28921 14651 31394 32036 11199 -2689 -12172 -21525 -33951 -23478
13467 -23478 -22298 1707 3398 -5306 40307 77007 73676 67380 95318 97836 65060 63437 50467
13454 50467 33479 59319 60175 92260 102023 87482 90505 131781 162125 135224 89938 67932
13442 67932 77553 89786 68430 41733 57284 57598 61726 34802 38446 87421 107247 94761 96463
13429 96463 96814 68945 79763 46977 37934 46587 40421 31280 17547 7598 48145 41954 91534
13416I1534L1090m1196k3789p295J9435K2287k2583k0454j0576l5562k0830k4631
13404d2570k3594K9439M8970K3195J1157J9570o686L256l0844j0635J1185L6671
13392F9114j5225M519J0271j7601n264L675R183r134m805j5073K082L1K896J594
13378C6263Q057M4297J4660j0232k0463o8684K5461L6923m142J1902L2571j3724
13366I2889j5895k7965j9492k270K9284j0939k327j3001k2333O535L074p227J0172
13353B0505J4710K8712K3377L3958m519l3128K2484M017Q712K1906j1976m9135
13341G9623k8102K3843n662j0056k5719j4141J1398J926k822M9478K8865k7961
13329H0670l0896j1488j6973K0928L0738L3051j4623r272K3233J1998j4330j3417
$$ plain form
13416 91534 122624 81428 57639 50344 69779 92066 69483 49029 38453 2891 -17939 -42570
13404 -42570 -66164 -36725 12245 35440 46597 66167 59481 62737 31893 21258 32443 69114
13392 69114 53889 58408 68679 51078 45814 49489 58672 49538 44733 29660 31742 31773 34669 36263
13378 36263 44320 88617 103277 93045 72582 3898 29359 66282 62140 74042 106613 92889
13366 92889 76994 49029 29537 27267 56551 45612 43285 30284 7951 14486 17560 10333 20505
13353 20505 35215 63927 87304 121262 116743 83615 106099 110116 118828 140734 128758 79623
13341 79623 51521 75364 69702 59646 33927 19786 31184 33110 30288 79766 108631 80670
13329 80670 49774 38286 21313 42241 72979 106030 91407 82135 105368 117366 103036 89619
13317H9619O970k1308l8366o899K6543O854R839J2722o685k5214M227j4770J9619
13304F3151o015k7316l6765L3177n133l575J6014J021K8953J9256j7599K274j587
13291F5856j7526j4383J7618M4320j1114j3620r967K2441j7415p240r48o1184
13279c162k5285O409J2881N7789O8341R741j1560l3020k1981N0770R192n6502
13267F3613l513K8080J9511j1411k7139m409K5563o695l288j0603r249K8913K3284
13254A12657L188k0256k2289L8202J4527r029J6365l508P635m4715k7414K039
13242F7402J6798J6209J1515l7976L0857j615o188L031l3209q156K2206j2852
13230F8022J238J169j4069Q519j3820P573j5949O001L9028Q807N90l6217l5023
$$ plain form
13317 89619 96589 75281 36915 30016 56559 63413 73252 85974 79289 54075 58302 43532 63151
13304 63151 57136 29820 -6945 26232 21099 17524 33538 34559 63512 82768 65169 67443 65856
13291 65856 48330 33947 51565 95885 84771 71151 61184 83625 66210 58970 58022 -3162
13279 -3162 -28447 -22038 -9157 48632 116973 126714 115154 82134 60153 110923 120115 63613
13267 63613 60100 88180 107691 96280 69141 64732 90295 83600 80312 69709 60460 89373 112657
13254 112657 115845 95589 73300 111502 126029 117000 133365 129857 137492 92777 65363 67402
13242 67402 84200 100409 111924 73948 104805 103190 97002 100033 66824 58668 80874 68022
13230 68022 69260 70429 56360 64879 51059 58632 42683 48684 87712 96519 97109 60892 25869
13217B5869k0101K5766J8988N943K0000P293k7113L5030Q141n1281R078L0145
13205H7758J1169j0624k74K7414K2744N974k6443m4676n152L8009M6048J6533
13193A68480O2139J5123l684m694L4287O291k9821j6837J220p993j6606J2524
13181B20429j0764j7764N053k3354l5309j12N1506M7702K2727J2769L2198J2371
13169C17452k224J1572R41R810J7011J0374N5300L8377P662k4125l7198n1947
13157C53005n5782p5149k9080J9050J9288l515q760k9936k4545j8360q83L6509
13145A81842L0858j5982K2058R212L6210j713k525l23J3552j861j6066R454n721
13132B58995J91k2932m5572l9509J0428J4723J0821j4950L6810K2157J8250L2345
$$ plain form
13217 25869 5768 31534 50522 56465 76465 83758 56645 91675 99816 48535 57613 87758
13205 87758 98927 88303 88029 115443 138187 144161 117718 73042 67890 105899 151947 168480
13193 168480 230619 245742 242058 237364 271651 277942 248121 231284 232504 224511 207905 220429
13181 220429 209665 191901 196954 173600 138291 138179 189685 237387 260114 272883 305081 317452
13169 317452 315228 326800 327741 337551 354562 364936 420236 458613 466275 442150 404952 353005
13157 353005 297223 222074 192994 212044 231332 227817 219057 189121 164576 146216 145333 181842
13145 181842 212700 196718 218776 227988 264198 262485 259960 259637 273189 271328 255262 264716 258995
13132 258995 259186 236254 190682 151173 161601 176324 187145 172195 209005 231162 249412 281757
13120B81757J6866K8690L6353O520l4852j5858L974M02M792k3306K0239K7169
13108C52746l8433J916M512p5997j4103l710P694J9822N2291k2118l2686L7334
13096B89268O7524j4914J5903M0992k395Q3902L7021R802l0115J3052M210m7466
13084D66784l6273N179r082m2901k3735m3439N292N1292O495K2282k9562m782
13072C67550N6420M4039k855m2853J6624P372j0884L4536R141M0615K6918j4465
13060E32158m6959m0477j6414k4041k8185m9740j7795K3340J8834j7057l2598
13049C01066P642N5021O320j8218r029L135J1221j0970l610j8236J2778j0462
13037C26658n888r013K3392j0030m963j7914K395l1375k7817r459K0823k1866
$$ plain form
13120 281757 298623 327313 363666 370186 335334 319476 323450 323852 328644 305338 325577 352746
13108 352746 314313 316229 320741 244744 230641 226931 234625 254447 306738 284620 251934 289268
13096 289268 356792 341878 357781 398773 396378 480280 517301 527103 496988 510040 514250 466784
13084 466784 430511 435690 426608 383707 359972 316533 321825 373117 379612 401894 372332 367550
13072 367550 423970 468009 465154 422301 438925 446297 435413 469949 479090 519705 546623 532158
13060 532158 485199 444722 428308 404267 376082 326342 308547 331887 350721 333664 301066
13049 301066 308708 363729 370049 351831 342802 345937 357158 346188 342578 324342 337120 326658
13037 326658 320770 311757 335149 325119 320156 302242 304637 273262 245445 235986 256809 234943
13025B34943n1612j9948k6287o466L914Q687J778L975n2636k0067Q301K9652M0656
13012A54890L3097j8934m423L2355L2086J3947l137k0928K9399K018L7090M5504
13000C32964L7557N3447K0898j2071k6546j615Q541k2516k1721j7694n634l21
12988C45289j2495l3350j6313K0424L6762J0673j0284m161l5340k8625J8891K8370
12976C19841N7845J888j5093j4544j7564k0333Q929L8185k6259O075k9484L237
12964C12723K3257J0778M2271L3058l5427l0728M7960L9858J2208K5230j3503
12953D67685n8903l5816k9100j7904m7703L3182M3554J2617m3314l4077l2438
12942B57783r193j4659J1682K1793J9648J24m4603m8919O94K3817l3870k084N942
$$ plain form
13025 234943 183331 163383 137096 130630 134544 143231 145009 148984 96348 76281 84582 114234 154890
13012 154890 187987 169053 164630 196985 229071 243018 239881 218953 248352 250370 287460 332964
13000 332964 370521 423968 444866 432795 406249 404634 413175 390659 368938 351244 345610 345289
12988 345289 332794 299444 283131 303555 340317 350990 340706 336545 301205 272580 291471 319841
12976 319841 377686 379574 364481 349937 332373 312040 320969 359154 332895 338970 309486 312723
12964 312723 335980 346758 389029 422087 386660 355932 403892 443750 455958 481188 467685
12953 467685 408782 372966 343866 325962 278259 311441 354995 367612 324298 290221 257783
12942 257783 248590 233931 245613 267406 287054 287178 242575 193656 194350 218167 184297 182213 188155
12929A88155L542P658r138o851M614k842M3123L1707J1855J5889K7554K8816L7031
12916C81113m4342k6624j1649K3321L845r591l8598k1803M1921O0198L1224m3028
12904C45987k9483R666n6702j7405j6807j4447L0041K1468J8673K3395J729o6156
12892B49959j2451N4287L0988j9339l1785M016m365K2658P441K0827N529K0466
12880C48231M4652o167R876M3934M6406l5295n3564k3376l0306J2200J8902M0657
12868D16150M1273o5248m8408k9610K027K4968r740j5713l4530K101K2264J8221
12856C23755J0506k6465j7805L1376P709Q061K6950N0105p679m3364l9093l6142
12844B87914N158k8190k9554l1207J7214N452J864j1345k663M956k228O911O9261
$$ plain form
12929 188155 191697 199355 190217 183366 187980 185138 228261 259968 271823 287712 315266 344082 381113
12916 381113 336771 310147 298498 321819 325664 316073 277475 255672 297593 357791 389015 345987
12904 345987 316504 326170 269468 252063 235256 220809 250850 272318 290991 314386 316115 249959
12892 249959 237508 291795 322783 303444 271659 275675 271310 293968 301409 322236 327765 348231
12880 348231 392883 386716 396592 440526 486932 451637 398073 374697 344391 356591 375493 416150
12868 416150 457423 392175 343767 314157 316184 341152 331412 315699 281169 283270 305534 323755
12856 323755 334261 307796 289991 321367 329076 337137 364087 414192 406513 363149 324056 287914
12844 287914 293072 264882 235328 204121 221335 226787 228651 217306 214643 219599 217371 224282 293543
12831B93543P7556p195l7363J7437M4814K8416J0992J1609N2740N7402N8164J12854
12819G20969J15610R7290J14724N7080Q287m9514l1444J8421P220K3232k7988
12808A053887j43756j19100j12714p6330p0497r62o635j5976l760j5774K1662
12797E10045J1857j2891K1039K5945M2862n956N851P4704O9871l321m3483m7286
12785F49237o0638j7144p571J2731J5980M1183L1582p36L7224R8445N6527J4094
12773H70914O2387K4785j6629l2218o6849o6248n2489L0260P1856M3126N1665
12762I20560O1238Q1452P8903J43999J50283J51449J03835J97455J93912J85864
12752B268950J70625K15394L21373L91600M67711N93078P70732Q96769J172822
$$ plain form
12831 293543 371099 363904 326541 343978 388792 417208 428200 439809 492549 549951 608115 720969
12819 720969 836579 933869 1048593 1105673 1113960 1064446 1033002 1051423 1058643 1081875 1053887
12808 1053887 910131 791031 678317 601987 531490 530528 523893 507917 504157 488383 510045
12797 510045 521902 509011 530050 555995 598857 592901 598752 673456 743327 740006 696523 649237
12785 649237 588599 571455 563884 576615 592595 633778 665360 664624 701848 800293 856820 870914
12773 870914 933301 958086 941457 909239 842390 776142 723653 753913 825769 868895 920560
12762 920560 981798 1063250 1142153 1286152 1436435 1587884 1691719 1889174 2083086 2268950
12752 2268950 2439575 2654969 2976342 3367942 3835653 4428731 5199463 6096232 7269054
12743G269054J514405J950965K391612K802332L194948L401064L320132K379255
12735B8223767Q86707j82624p72413j285540j859522k297359k387180k286341
12727A8039495j994173j422580p55110j10708M29897P75986J102367J589921K089296
12718A9744391K654926L256164L768294M150864M547056M954429N187161N065048
12710E3328333L824167J304490j548071l763192m745962n244872n606074n289119
12702C2259700m540825l908723l323430k575896j828308j036394k90579K37047
12694A4992592N64957R08927J380658J828856K159031K322687K264409J824737
12686B8246854J200792Q32269P33999K59305r05998k256549k868282k746040k639306
$$ plain form
12743 7269054 8783459 10734424 13126036 15928368 19123316 22524380 25844512 28223767
12735 28223767 29110474 28927850 28155437 26869897 25010375 22713016 20325836 18039495
12727 18039495 16045322 14622742 13867632 13756924 14186821 14962807 16065174 17655095 19744391
12718 19744391 22399317 25655481 29423775 33574639 38121695 43076124 48263285 53328333
12710 53328333 57152500 58456990 56908919 53145727 48399765 43154893 37548819 32259700
12702 32259700 27718875 23810152 20486722 17910826 16082518 15046124 14755545 14992592
12694 14992592 15557549 16466476 17847134 19675990 21835021 24157708 26422117 28246854
12686 28246854 29447646 30279915 31013914 31273219 30367221 28110672 25242390 22496350 19857044
12677A9857044k629685k143088j309090m75046J84819O26030R24655J195186J554971
12668A7785796K101402K813117L577486M055662L815324L183054K871214K466236
12660D2669291R17473j243800k456756k479774k368761k774993l192928l076671
12652B5993081k471078j687874q51551n6839O92784J377264K051451K939468L890338
12643C1877044M812929N692698O320585O778054P065583P025969N927014M123732
12635G9623608K307191k38610l860681p716255r777064r149898p336211n846500
12627C8005580m894207m131503l330674k556308j807332j051766l05266K65569
12619B0194093P65372J386174K099273K827859L300863L440525L173770K646051
$$ plain form
12677 19857044 17227359 15084271 13775181 13300135 13484954 14110984 15035639 16230825 17785796
12668 17785796 19887198 22700315 26277801 30333463 34148787 37331841 40203055 42669291
12660 42669291 43586764 42342964 39886208 37406434 35037673 32262680 29069752 25993081
12652 25993081 23522003 21834129 20982578 20925739 21618523 22995787 25047238 27986706 31877044
12643 31877044 36689973 42382671 48703256 55481310 62546893 69572862 75499876 79623608
12635 79623608 81930799 81692189 77831508 70115253 60338189 51188291 43852080 38005580
12627 38005580 33111373 28979870 25649196 23092888 21285556 20233790 19928524 20194093
12619 20194093 20959465 22345639 24444912 27272771 30573634 34014159 37187929 39833980
12611C9833980J789666O33679n89039j530064k528589m000000n424721n693328
12603B2491584m909747l811697k833929k022229j403782r96722p67278o37854
12595E108346n41840n33506m41268l17414k90097k63001j95003j68421j21959
12586B235837j11452r6530j24201j24985j18338r3032n3643l7842m2611o9984
12576A363219p0214l9654j2850l4478q1737l9623k9318J862n2337j17211r7714
12565G89945k8208l5044O90o9336n4625L6772J9614J0930l4979m2271n6469J2983
12553E50002K7261J133m439j3393l9265m4879l9122j9327j3730q288K9521K9397
12541D54871J3115K8166J0546k0788k6448J6547K3916J6520J2600J9068p356J3990
$$ plain form
12611 39833980 41623646 42257325 41668286 40138222 37609633 33609633 28184912 22491584
12603 22491584 17581837 13770140 10936211 8913982 7510200 6513478 5746200 5108346
12595 5108346 4566506 4033000 3591732 3274318 2984221 2721220 2526217 2357796 2235837
12586 2235837 2124385 2027855 1903654 1778669 1660331 1567299 1513656 1475814 1433203 1363219
12576 1363219 1293005 1253351 1240501 1206023 1124286 1084663 1055345 1057207 1004870 887659 789945
12565 789945 761737 726693 727383 658047 603422 640194 659808 670738 635759 593488 537019 550002
12553 550002 577263 578396 573957 560564 521299 476420 437298 417971 404241 395953 425474 454871
12541 454871 467986 496152 506698 485910 459462 476009 499925 516445 529045 548113 540757 554747
12529E54747k016j2004M891l3128j6338M482k3646M624L2522j0118k7283k8100
12517D48633k9032J6126L3470J8863M423J6535L0155J1098K5009L8566l6458l7607
12505E39781k9630k8216K224k3406l3415k9148q861J8874J193n1315k2167J4325
12493C50239R816J3154K2812j8288k73K4203J1112Q519J2753l0370m3965J978
12481C61690J972J3490l5829l6280K1435J0921k4195n2543l7298R283L764k5573
12469B10837k7432K636N0758L1003m5867J96l204J8498O0550M823k1891j2182
12457B68725o012J4386J4190K0779K6998M0455J2755L4868K3990M4958M1128J9412
12445E56632N7902R4209Q9519J10908K0729o3103r4739j17726k0922k4601l9251
$$ plain form
12529 554747 552731 540727 545618 512490 496152 500634 476988 481612 514134 504016 476733 448633
12517 448633 419601 435727 469197 488060 492483 509018 539173 550271 575280 613846 577388 539781
12505 539781 510151 481935 484159 460753 427338 398190 389329 408203 409396 358081 335914 350239
12493 350239 360055 373209 396021 377733 377460 401663 412775 421294 434047 403677 359712 361690
12481 361690 363662 377152 341323 305043 326478 337399 313204 260661 223363 232646 236410 210837
12469 210837 183405 186041 236799 267802 221935 222131 218927 237425 297975 302798 280907 268725
12457 268725 262713 277099 291289 312068 339066 379521 392276 427144 451134 496092 537220 556632
12445 556632 614534 708743 798262 909170 929899 866796 772057 654331 633409 608808 569557
12434E69557J6380o019M209L2878L51j6235N8557M9215L949l492k3089M2420P3971
12421H02652N1932L2828L5140k1053l5412k3290P318K7462P471N9541P9058N6577
12409A080224J10660J18841J43431J90204Q5277n0190j56903k39178j92511r1435
12399I98420n2072j9785j9679l4613p646J7416M9803K5303L5859j6081n5865r005
12387I12055j4828L28J9302J9557N3862M6282Q701L7859M8249L7201L1764R9231
12375A299563J02898P5967J29710J39954J40593K09778K37618K53773J85687J30003
12365B905544J53775K20404K96283M66883O13802P56146R13293J094103J265734
12356H685967J433349J736641K141633K758771L599514M518493N510258O401461
$$ plain form
12434 569557 585937 579918 584127 617005 617356 601121 659678 708893 712842 709350 686261 728681 802652
12421 802652 854584 887412 922552 901499 866087 842797 850115 877577 885048 944589 1023647 1080224
12409 1080224 1190884 1309725 1453156 1643360 1728637 1678447 1521544 1282366 1089855 998420
12399 998420 946348 926563 906884 872271 864625 882041 931844 957147 993006 976925 921060 912055
12387 912055 897227 897555 916857 936414 990276 1036558 1045259 1083118 1131367 1168568 1200332 1299563
12375 1299563 1402461 1478428 1608138 1748092 1888685 2098463 2336081 2589854 2775541 2905544
12365 2905544 3059319 3279723 3576006 4042889 4656691 5412837 6326130 7420233 8685967
12356 8685967 10119316 11855957 13997590 16756361 20355875 24874368 30384626 36786087
12348C6786087O891604O108757L386520p87360m412226o013457n784488m725131
12340C1450306l225156j681124k09027J158204K444875L534571M134683M515757
12332D2123089M867800M502891K143833k153689o643600q983967q319858o288685
12324B1247814m431525l100010k129718j509497j207183j055708j013991r25035
12316E875147q00117n81988m23329l73768k88963j84488j03108k6970J8817K2431
12306C133664K9432O2980J34717J12793O4690J27072K00264K81118K85375K96218
12296D728323M18007N17922P28001R01268J093826J323944J536785J785631K126821
12287A5160528K612655L365616M358728N426426O485321P649360Q591569Q005996
$$ plain form
12348 36786087 43677691 49786448 53172968 52385608 47973382 41959925 36175437 31450306
12340 31450306 28225150 26544026 26334999 27493203 29938078 33472649 37607332 42123089
12332 42123089 46990889 51493780 53637613 51483924 44840324 35856357 27536499 21247814
12324 21247814 16816289 13716279 11586561 10077064 8869881 7814173 6800182 5875147
12316 5875147 5075030 4493042 4069713 3695945 3406982 3222494 3119386 3092416 3111233 3133664
12306 3133664 3163096 3226076 3360793 3473586 3538276 3665348 3865612 4146730 4432105 4728323
12296 4728323 5146330 5664252 6392253 7293521 8387347 9711291 11248076 13033707 15160528
12287 15160528 17773183 21138799 25497527 30923953 37409274 45058634 53650203 61656199
12279F1656199M593768O92240p67457p42790o78756m82201j1278q558j076199
12270F3174968k375226k265509n77157J292845K689708L895870M517187K949859
12262G3302545r07049m297023n315162m735980l886402l392498l064069l419540
12254D4284822n073212o783834o777077n446080m000395k895540k066870j518694
12246I723120j177799j016452q51261p55654o66838n24083m34036l45051k69372
12237C682574k17610j59815j46497j25978j34361r3654j11187o8924K9185M4028
12227B697761L7515Q4497J57919J69788J66763L11211L62527M48222N37432O69299
12217E642934Q38216J005346J159316J348053J661508K095472K704933L472144
$$ plain form
12279 61656199 66249967 66942207 66174750 65431960 64753204 64271003 64259725 64251167 63174968
12270 63174968 60799742 58534233 57957076 59249921 61939629 65835499 70352686 73302545
12262 73302545 72395496 68098473 62783311 58047331 54160929 50768431 47704362 44284822
12254 44284822 39211610 32427776 25650699 20204619 16204224 13308684 11241814 9723120
12246 9723120 8545321 7528869 6677608 5921954 5255116 4731033 4296997 3951946 3682574
12237 3682574 3464964 3305149 3158652 3032674 2898313 2804659 2693472 2624548 2653733 2697761
12227 2697761 2735276 2819773 2977692 3147480 3314243 3625454 3987981 4436203 4973635 5642934
12217 5642934 6481150 7486496 8645812 9993865 11655373 13750845 16455778 19927922
12209A9927922M224852M867391N239537M667369K306882j152684m053312n164325
12201C0863632m536271l147521j983439j093994j57457Q41715J835245K737010
12193B5358920L380665L598065L205402K360365Q34374j787034m693838o363744
12185B5893175o194967m783098l296306k205924j454427j007612p60972o40095
12177E549774o01624n56786n40043m90394m47709l49939k82092j95518j50773
12168A934896j46804j52293q3591j02892o6197j00683j06048p1609p6328p1295
12158I57156o5767l9916J7924j0905m845q573L744R044J2859k83q941m0683q6996
12145G33818n439N864k1244m4677m4525J9527l080m5865r380K3638M6257L6300
$$ plain form
12209 19927922 24152774 29020165 34259702 38927071 41233953 40081269 36027957 30863632
12201 30863632 26327361 23179840 21196401 20102407 19944950 20786665 22621910 25358920
12193 25358920 28739585 32337650 35543052 37903417 38737791 36950757 32256919 25893175
12185 25893175 19698208 14915110 11618804 9412880 7958453 6950841 6189869 5549774
12177 5549774 4948150 4391364 3851321 3360927 2913218 2563279 2281187 2085669 1934896
12168 1934896 1788092 1635799 1552208 1449316 1383119 1282436 1176388 1104779 1028451 957156
12158 957156 891389 851473 869397 858492 853647 845074 848818 857862 870721 870438 861497 820814 733818
12145 733818 728379 734243 712999 668322 623797 643324 640244 594379 584999 608637 654894 691194
12133F91194L6698L7701j1751k8745k8610o7903q3321n4069l159k3333m2198k4841
12121C97663l4524K282K5249M9868N1298P3212K8244j4167J9865Q059j7984j7857
12109E71208n0785j3201m0409j16982j09811l8071n948L3424M3765j0483n3537
12098B09170k8871L0131K7717l2829p038L5928N3979R552l9517o4545p518l2621
12086A53538J175J1173N44N150q735K1006L920p119M291K7224j1307k0266p653
12073A72941l6578q226L5322L1351j3490j6929J4354K4670k231p984K4478o758
12061B10920l1234l2442j9480k2107O611k3891k4063j2931L8710J6635j9954m2140
12049D4634P516j0480l0997J2602r456J4107K9265K0883J3127n6158l817Q427
$$ plain form
12133 691194 727892 765593 753842 725097 696487 628584 545263 491194 488035 464702 422504 397663
12121 397663 363139 365421 390670 440538 491836 565048 593292 579125 598990 607049 589065 571208
12109 571208 520423 507222 466813 349831 240020 201949 196001 229425 273190 262707 209170
12098 209170 180299 210430 238147 205318 198280 234208 288187 297739 258222 193677 186159 153538
12086 153538 154713 165886 166430 171580 162845 183851 187771 180652 184943 212167 200860 180594 172941
12073 172941 136363 128137 163459 194810 181320 164391 178745 203415 201184 193200 217678 210920
12061 210920 179686 147244 127764 105657 112268 88377 64314 51383 90093 106728 86774 44634
12049 44634 52150 41670 10673 23275 13819 27926 57191 78074 91201 35043 31226 39653
12037C9653J3953q036K1190o978m720N45M958k717j9786J4347M2418l0214l8080
12024B6533J1339L1825J4767l0547m103l8165l799K932L1466K2444K384r170j9502
12011C8404r360m073J8754K012k5519l7528L060L7945J8289R632j4104j3364j3488
11998A0660m598J3909N2774J5808j303L588o840m496J1748l7739L951l679m0649
11985A3134l8442j0889M1572N6016r369m5833K2066L6446p783l302k1036k6758
11973E822l105l6779K0829M1458m42M378j535J8726j5760k9777J0778Q880K6418
11960D9891j2339o2869k9740J6258N5393J9238P07j0736L3470L640o66l0881m059
11947B7307P389l0401n722L5276k0932P368K1939j4909J2563J3762l2747m440
$$ plain form
12037 39653 53606 45570 66760 59782 55062 55607 60565 57848 38062 52409 94827 64613 26533
12024 26533 37872 69697 84464 53917 49814 11649 7850 10782 42248 64692 67076 57906 38404
12011 38404 29044 24971 43725 45737 20218 -17310 -14250 23695 41984 51616 37512 24148 10660
11998 10660 6062 19971 72745 88553 87250 90838 83998 79502 91250 53511 57462 53783 13134
11985 13134 -25308 -36197 5375 61391 52022 6189 28255 64701 56918 53616 32580 5822
11973 5822 2717 -34062 -13233 28225 27783 32161 30626 49352 33592 3815 14593 23473 49891
11960 49891 37552 -25317 -55057 -38799 16594 35832 36539 25803 59273 62913 62247 31366 27307
11947 27307 34696 4295 -1427 33849 12917 20285 42224 27315 39878 53640 20893 16453
11935A6453Q619j7921P4913K159m5368j1043L817k5609m0709K1989O891K3631
11923A7822L1550J9488K2877k9151o3993j4037M4252M2199M651N701k1884k5481
11911C3994p773j0715k0616L496J3208K2355L4557M6041J9612l3375k356J0837
11899A09265L6089M9280O793K8404J1315j8086L5496r837o2171p373J6737L113
11887A99025j3195k7698p72J4456L9977K7805L0438P751l9043j7464K7555l5643
11875B13192m3778k2781k0054j8358L228J2580j7007O847o630n801Q835k7729
11863H2544m184k1456j3659n719j2466J7114K844k9163Q456K0850N400k9481P464
11850B8544L5724J3146l2796J5346j5461o859M2037q096j1000L2567J0636k5222
$$ plain form
11935 16453 25072 7151 82064 84223 38855 27812 31629 6020 -34689 -12700 -5809 17822
11923 17822 49372 68860 91737 62586 -1407 -15444 28808 71007 75658 81359 59475 33994
11911 33994 26221 15506 -5110 -1614 11594 33949 68506 114547 134159 100784 98428 109265
11899 109265 145354 194634 201427 229831 241146 223060 258556 248719 186548 179175 195912 199025
11887 199025 185830 158132 157360 171816 211793 239598 270036 277787 238744 221280 248835 213192
11875 213192 169414 146633 126579 108221 111449 124029 107022 113869 107239 101438 110273 82544
11863 82544 78360 56904 43245 37526 25060 42174 45018 15855 24311 45161 50561 21080 28544
11850 28544 64268 77414 44618 59964 44503 37644 79681 71585 60585 93152 103788 78566
11838G8566N4933O9209J4637J0910J97J3933J4293N4728J9969J2911K6669J6704
11826C87659k2495m0159p115j707K8818M3679J6552k7550p819K3564J2423K531
11814D08381j1404M201O552k0000k2772K7232j5693n0420l3218l7086l8580o3212
11802A53981j6853k1623n3808p5249j4787M7063O4124N3512m5145k1420K931r068
11790F3658l0550K2523j1475L7864K0667j855k9074m0197j2421j5649R095L4494
11778D7080j0649r354J3652p165j4156j147K448j5347J816j2681J675L1502J3671
11765D1345j846j4767K0246j1367k26L8916P6884K7817J0253O4188Q04o1849l6136
11752A54262j9291k5009j783L349J2061Q437L910L1346M1956N9903M9664j2566
$$ plain form
11838 78566 133499 202708 217345 228255 228452 242385 256678 311406 331375 344286 370955 387659
11826 387659 365164 325005 317890 316183 345001 388680 405232 377682 369863 393427 405850 408381
11814 408381 396977 401178 407730 387730 364958 392190 376497 326077 292859 255773 217193 153981
11802 153981 137128 115505 61697 -13552 -28339 18724 82848 136360 91215 69795 72726 63658
11790 63658 33108 55631 44156 82020 102687 100832 71758 31561 19140 3491 12586 47080
11778 47080 36431 27077 40729 33564 19408 18261 20709 5362 7178 -5503 -3828 27674 41345
11765 41345 39499 24732 44978 33611 33385 72301 149185 177002 187255 251443 252247 190398 154262
11752 154262 134971 109962 108179 111528 123589 132026 135936 167282 209238 269141 318805 306239
11740C06239k4326j877k8883m8862m6821j8227j9970j2577k567m4315j4549P586
11728E0851J5020R63k0572k593L2410J6705m7436l3273j2652n296j1157l718L938
11715a6810j4764q491o217j1806J1538O081P153r111J7224L291J4238N7388j1840
11702C7874j0594q942L142k1797R281K9264L093q277j219l5315N076J1410J3444
11689B6440k3399k5410Q246j2963J4682R427J1407M881P701j4605J0955J9943
11677C7305o546p315J0901j5683o403j8161j3663j1061N1712J7980l2361N391
11665A2096j4809J0400K7332K3917K7054p601m9481j1472j3696j0302K2828k5510
11653i244K2828K9348j909p92O500J5586J6662j2157l0752J0147L5860J7510k0595
$$ plain form
11740 306239 281913 280036 251153 202291 155470 137243 117273 104696 102129 57814 43265 50851
11728 50851 65871 66834 46262 43669 76079 92784 45348 12075 -577 -5873 -17030 -20748 -16810
11715 -16810 -31574 -40065 -46282 -58088 -46550 -40469 -33316 -42427 -25203 -21912 -7674 49714 37874
11702 37874 27280 18338 21480 -317 8964 38228 41321 33044 31825 -3490 1586 12996 26440
11689 26440 3041 -22369 -14123 -27086 -12404 -2977 8430 13311 21012 6407 17362 37305
11677 37305 30759 23444 34345 18662 12259 -5902 -19565 -30626 21086 39066 6705 12096
11665 12096 -2713 7687 35019 58936 85990 78389 28908 17436 3740 -6562 16266 -9244
11653 -9244 13584 42932 41023 40231 46731 62317 78979 66822 36070 46217 82077 99587 78992
11640G8992k4663k403j2237j5818M865K5329K3258P799L5841l6738m0972k5671
11628A7582k1607j1658m315K244R318j2642l635m920k1590J5511M1515K1763R552
11615C7118L599k986J9234J8275J3936k3136m6328j0415J0796j424K3259K7662
11603F9590r536l8124k0638L3502l4906m0515L3825N6323n704k3563m469J212
11591A6997J7256L2304k9612n9200L246K5101K0574L7999J3864j094j114j4277
11579F2044j410R469M653j5465L355k78K3285j2452p721j3029K7073J6595l2875
11566F3244n2312K9368m77o312K951J8353N493K6562r081m2644K1280k5708j050
11553B9667O797J2798j7902J6362K2448J8634L5594J1451r755j4780k9251k0928
$$ plain form
11640 78992 54329 51926 39689 23871 28736 54065 77323 85122 120963 84225 43253 17582
11628 17582 -4025 -15683 -19998 -17754 -8436 -21078 -24713 -29633 -51223 -35712 5803 27566 37118
11615 37118 40717 37731 56965 75240 89176 66040 19712 9297 20093 18669 41928 69590
11603 69590 60054 21930 1292 34794 -112 -40627 -6802 49521 43817 20254 15785 16997
11591 16997 34253 66557 36945 -22255 -19009 6092 26666 64665 78529 77435 76321 62044
11579 62044 60634 70103 74756 59291 62646 62368 85653 73201 65480 52451 79524 96119 63244
11566 63244 10932 40300 39823 33511 36462 54815 60308 86870 77789 35145 56425 30717 29667
11553 29667 36464 49262 31360 47722 70170 88804 124398 135849 126094 111314 82063 61135
11541F1135K4600j5255k5708K2021J2637K5234K3221L8431K9510j451j9872M6533
11529B21036j8147l4219l5107p85Q88p12j8057k9347j3661J6684K3092K3444J7480
11516A52589j9645n9660m9628J4509K4133j4043L9722M7321J7563J610k5372m8457
11504H0642q274J6558K536K3021n124n118l1294K0024N3559L7300L346q482l8222
11491A40472p6812p591K1709j8591m9015J2755M6261J9899K8652L0665J4901l5200
11479A28105o553K495j9374k9867Q33J9828K4631M55j6146j1094J7721j4255k7930
11466F8849J0440M8791L2775o734K087o486R914J6851J1271q059J3971L9022O4000
11453B96692K779l548K1398J3159j0716n218o5018m0647Q654R942k9494k1525
$$ plain form
11541 61135 85735 70480 44772 66793 79430 104664 127885 166316 195826 194375 174503 221036
11529 221036 202889 168670 133563 132778 133666 132954 114897 85550 71889 88573 111665 135109 152589
11516 152589 132944 73284 23656 38165 62298 48255 87977 135298 152861 154471 129099 80642
11504 80642 72368 88926 91462 114483 109359 104241 72947 92971 146530 183830 187176 178694 140472
11491 140472 63660 56069 77778 59187 10172 22927 69188 89087 117739 148404 163305 128105
11479 128105 121552 124047 104673 74806 75639 95467 120098 120553 104407 93313 111034 96779 68849
11466 68849 79289 128080 160855 154121 156208 149722 159636 176487 187758 179699 193670 232692 296692
11453 296692 299471 295923 317321 330480 319764 314546 249528 208881 217535 227477 197983 176458
11441A76458J6034j3379l7690k1020M249O824K4544J4075k5322j3487J1197J5268
11429A57751K0193J8532o929l8123n236M3755R803K0728m286j1742j9562j6846
11417A68038L0774J3062L126j2K4717Q579L7337P6118N6233Q3027R2033Q3682
11405F76714R0714J14818J32601J40801J45577J48192J70255J16651R224r2331
11395A653216j80516k88288k60445k07445j23233j7613m6038r9845o0743k4605
11385C44445p645j4593l1796l3379k7733j3488j076J1195p160L8007m469j7011
11373B35297k0198j2517j5134L1387r182l9969m5615J949p518M0492r583k262
11361A47147M2572M54m9509j5361j2044J2935j0802o824M3656L7924K3847l9919
$$ plain form
11441 176458 192492 179113 141423 120403 124652 131476 156020 170095 144773 131286 142483 157751
11429 157751 177944 196476 189547 151424 146188 189943 199746 220474 216188 204446 184884 168038
11417 168038 198812 211874 215000 214988 239705 248284 285621 361739 417972 500999 593032 676714
11405 676714 767428 882246 1014847 1155648 1301225 1449417 1619672 1736323 1745547 1653216
11395 1653216 1472700 1184412 923967 716522 593289 575676 529638 429793 369050 344445
11385 344445 336800 322207 290411 257032 229299 215811 214735 225930 218770 256777 252308 235297
11373 235297 215099 202582 187448 218835 209653 169684 124069 126018 118500 158992 149409 147147
11361 147147 189719 190173 140664 125303 113259 126194 115392 108568 152224 190148 213995 174076
11349A74076o4054k3972J0366J1778L4874K6062Q411j4395K44J2323K2203N9130
11337B57046K4788J9900J3450m9295j6963q655K041M559m063l8333j0220K9299
11325B23554J6367j1485Q977N567L3278M0994K5072o059m018k8912j9335J1520
11313B95520o759k4126j0875K2802M781m666l3889n0459J6088J9870k0155m642
11301B03490j0220j2473j0912J7926R409K8239K0877j8374k5482k5185J7082p250
11289A87127j7953J9942j0l3644l0762M641J1714J0322M149Q691J0975M599R438
11276A89229j339J5142k7655l755L3009L535n5432p453N4423K2994k8138n4073
11264A40487J2924L3851K5613K8224J130k2296P245N614j3004J8805O397m9983
$$ plain form
11349 174076 110022 86050 96416 108194 143068 169130 177541 163146 163390 175713 197916 257046
11337 257046 281834 301734 315184 265889 248926 240271 242312 246871 242808 204475 194255 223554
11325 223554 239921 228436 237413 242980 276258 317252 342324 336265 332247 303335 284000 295520
11313 295520 288761 264635 253760 276562 281343 276677 242788 192329 208417 228287 208132 203490
11301 203490 193270 180797 169885 187811 197220 225459 246336 227962 202480 177295 194377 187127
11289 187127 169174 189116 189106 155462 124700 129341 141055 151377 155526 164217 175192 179791 189229
11276 189229 187890 203032 175377 171622 204631 208166 152734 145281 199704 222698 194560 140487
11264 140487 153411 187262 212875 241099 242229 219933 227178 232792 219788 238593 244990 195007
11252A95007q160N02J0098O885Q665m388K6498M1415l7915m3161K9394J7660j9321
11239B23179O549K674K7632J7319K1179o373q952k8927J6122N6995M8176N062
11227C80635P272l3445j5736M2996J6743L0141N253l5723k4930o386J1375j0182
11215C68013l627J4588L1627j6460k4807O683m851j3264l1746j6791k1919o305
11203B81141m7149m1478P080L8447O0360R76k8940n3976L0772K9276j6166l9740
11191B20603k011K1415J9450j348k6436o1343j1784K0362R041j6657k1014j78
11179A50100N2501L3442K0481k3042K836J3444P405N349N169R649K6812k9718
11167B74428m6631j7815m234J0469M782o8l938k7071N39j2662M949L4390O1406
$$ plain form
11252 195007 186847 187349 197447 204332 212997 208609 235107 276522 238607 195446 224840 242500 223179
11239 223179 229728 232402 260034 277353 298532 292159 283207 254280 270402 327397 375573 380635
11227 380635 387907 354462 338726 381722 398465 428606 433859 398136 373206 366820 378195 368013
11215 368013 364386 378974 410601 394141 369334 376017 371166 357902 326156 309365 287446 281141
11203 281141 233992 192514 199594 238041 298401 299377 270437 216461 247233 276509 260343 220603
11191 220603 218592 240007 259457 258109 231673 170330 158546 178908 187949 171292 150278 150100
11179 150100 202601 236043 256524 233482 236318 249762 257167 262516 267685 277334 304146 274428
11167 274428 227797 209982 205748 216217 220999 220931 216993 189922 190461 177799 182748 217138 278544
11154B78544R064l8397j33N1677L2024n4692k2951j4080j9990p880K5725K1367
11142B60278R946J0072j3125j8051K575L8651J2677J0972K334J4043K9490K21
11130C60083K1624M6879J2011m792l8733j6075N45L031n092n470J6341Q422r816
11117C88958m1520k2938N347K0241K4467o990L108l8519j8516n8744n8814o4654
11105A31426p1599p4763j09660q9278p1496n7039J745N5281K5872m485P148K265
11093b54583P5042J48495J61379Q4722R9218L9728J0157L9409J889L1184N9950
11082D96590J1070K541n147k0560K5605j123L726L9803R880P314J6198n79J8925
11069F04243L5900j7463R792K2298L2539P644r956k2262L1942K4883j0024M2528
$$ plain form
11154 278544 287608 249211 249078 300755 332779 278087 255136 241056 221066 213186 238911 260278
11142 260278 270224 280296 267171 249120 251695 290346 303023 313995 316329 330372 359862 360083
11130 360083 381707 428586 440597 435805 397072 380997 381542 384573 379481 374011 390352 398774 388958
11117 388958 347438 324500 329847 350088 374555 367565 370673 332154 313638 254894 196080 131426
11105 131426 59827 -14936 -124596 -213874 -285370 -342409 -340664 -285383 -259511 -263996 -256848 -254583
11093 -254583 -179541 -31046 130333 215055 314273 354001 364158 403567 405456 436640 496590
11082 496590 507660 510201 505054 484494 510099 508976 512702 552505 562385 569699 585897 585318 604243
11069 604243 640143 622680 632472 654770 687309 694953 684997 662735 694677 719560 709536 752064
11057G52064N1127L2246j0951L2073P2286P4789j338R788K7624K7681L5011P8044
11045A180444K3847K2490L5785K9546N357L137M311N029M321O1210N8577O5560
11033A499614J0246j3863r528J9655N8287P8964Q5514R9276L1049L2518P0176
11022A961908N9747Q7490J03910O6721R2420P6913R5851J14590P6356J31390J41091
11011C008387J65433J91808K34524K45778J93834K09394K03515K39551K49015
11002D941239L21359L55498L58483M47096N22151O39491P59611Q54893R94920
10993A0194741J122816J385025J624484J906359K293085K771036L305967L895247
10985B8498760M722322N666740O821034Q337353J0301576J2751382J5930704K0041837
$$ plain form
11057 752064 803191 835437 824486 856559 928845 1003634 1002296 1012084 1039708 1067389 1102400 1180444
11045 1180444 1204291 1226781 1262566 1292112 1297469 1300606 1304917 1309946 1314267 1375477 1434054 1499614
11033 1499614 1509860 1495997 1486469 1506124 1564411 1643375 1728889 1828165 1859214 1891732 1961908
11022 1961908 2021655 2109145 2213055 2279776 2372196 2449109 2544960 2659550 2735906 2867296 3008387
11011 3008387 3173820 3365628 3600152 3845930 4039764 4249158 4452673 4692224 4941239
11002 4941239 5262598 5618096 5976579 6423675 6945826 7585317 8344928 9199821 10194741
10993 10194741 11317557 12702582 14327066 16233425 18526510 21297546 24603513 28498760
10985 28498760 33221082 38887822 45708856 54046209 64347785 77099167 93029871 113071708
10977A13071708K4906558L0140567L5081156L8722769L8897671L1890193J4499253
10970C27209875j1274183l6174225n0097836n0463627m2216300l1802552k2814037
10963H2367115j6215865j1680026q741090o787077n469073m454394l714335l026598
10955B2278657k484928k031582j604497j218208r20435p58503p37592q47172j047066
10946A0628674j082856j070577r82066p99594o96296n69627m52151l91549l32509
10937D251449l18770l17588k65154k56137k06504j58017r7716j16344j31181j08221
10927B275817j24275j11261q1341p2246n5553j03907r1882p9660j00206m3891
10917A411595L237j2756q6774o5253p7117o1315l3477l4477n8129r6345n5412
$$ plain form
10977 113071708 137978266 168118833 203199989 241922758 280820429 312710622 327209875
10970 327209875 315935692 279761467 229663631 179200004 136983704 105181152 82367115
10963 82367115 66151250 54471224 45730134 38943057 33473984 29019590 25305255 22278657
10955 22278657 19793729 17762147 16157650 14939442 14019007 13260504 12522912 11675740 10628674
10946 10628674 9545818 8475241 7493175 6693581 5997285 5427658 4975507 4583958 4251449
10937 4251449 3932679 3615091 3349937 3093800 2887296 2729279 2631563 2515219 2384038 2275817
10927 2275817 2151542 2040281 1958940 1886694 1831141 1727234 1635352 1555692 1455486 1411595
10917 1411595 1414832 1402076 1315302 1250049 1172932 1111617 1078140 1043663 985534 889189 833777
10906H33777m1788l3287m0435n071K2585j4272l2335j6232m4935j321l4704j3398
10894E78584K3066L0124J0321J6755k6121K5455k0311l1840K3613L5387o73j2102
10882F52258m5205j8750o923m4668m7931m2353L2223K2011J5823n6187l8452O863
10870D28709k3286k8374q471J6030M352o983J8003K6081l444l1758J2038J0539
10858D13436j8404J9312M5674J4247L7467J12315Q0339P4665R4262R8439J28827
10847A100579O7734k9620j9882j1534m9816m3818M257p1429j37595j17474m7907
10836F43495r9565j07940p1067l7360q195l9516k5052l352m8290j1529J9751O178
10824B17558l778l1043K9291J7976P759k3135k095p668l1682j2706J0136N462
$$ plain form
10906 833777 791989 758702 718267 713196 735781 721509 689174 672942 628007 626686 591982 578584
10894 578584 601650 631774 642095 658850 632729 658184 637873 606033 629646 665033 664360 652258
10882 652258 607053 588303 581380 536712 488781 446428 478651 500662 516485 460298 421846 428709
10870 428709 405423 377049 368578 384608 388960 381977 399980 426061 422617 390859 402897 413436
10858 413436 395032 414344 460018 474265 511732 624047 704386 779051 873313 971752 1100579
10847 1100579 1168313 1138693 1118811 1107277 1057461 1013643 1017900 946471 808876 691402 643495
10836 643495 543930 435990 364923 327563 319368 279852 254800 251448 203158 191629 211380 217558
10824 217558 213780 182737 212028 230004 237763 214628 212533 204865 173183 160477 170613 176075
10812A76075P484L5950J3867L520j6104k4678k4117l1467m619J8026j432j0314
10800A42191k159L619J131j9100J3509K3300M2605j9256j8466o0426n235L8409
10788A40122R451j4212l369l2442r211l402J6077M430K5382L7419l0291l9104
10776A00850j4561J6260r185L804P13k3732Q99J9134K0472L016k7020m3174J3941
10763F1417N046k1316J2325k050L9363k3639K6152j0068p171K1552J4504q495
10751A07620m4006j2478J9030k2154k510j1159j0038o907K9576J3232Q042m6328
10739B1920k966K8695J8474O933l1573L301k4257o204L9540N9984J8234Q637l5669
10726A05049k7889n435O492m678o4176j1745J7109R633L0671j7673j1694K1815
$$ plain form
10812 176075 183559 219509 233376 236896 220792 196114 171997 140530 135911 153937 152505 142191
10800 142191 140032 143651 144782 125682 139191 162491 205096 185840 167374 106948 101713 140122
10788 140122 149573 135361 131992 99550 90339 86937 103014 107444 132826 170245 139954 100850
10776 100850 86289 102549 93364 97168 97881 74149 75048 94182 114654 117670 90650 47476 61417
10763 61417 66463 45147 57472 55422 94785 71146 97298 87230 80059 101611 116115 107620
10751 107620 63614 51136 70166 48012 45502 34343 24305 17398 46974 60206 68248 21920
10739 21920 18954 47649 66123 73056 41483 44784 20527 14323 53863 113847 132081 140718 105049
10726 105049 77160 71725 78217 73539 9363 -2382 14727 24360 55031 37358 25664 47479
10714D7479K8617r757j6080p866J3143n964r242j3737Q381L1690r686o7331k2155
10701c2508N1583K7240k0214l9L3338J7986j4773M312O606l0630m0194Q256L0109
10688D1072j1704K966K2634q82j423M0869J7324K352J088m3336l0452l0839q169
10675A500K1126n945j8704k0771k4250m1337Q567L0036M2446J6244o134J0565
10663A3343J9890P181O064L2102O184m8637k7945o839M5568J463P738m565n867
10650D5680M9039J9997m1794m3945O913l215l789J1955o52k9702p620p58K4667
10637B6776K5281q063M0054J8894K5624J6593j5746k4584K1094j2712k4768j5587
10625G2856n301n949J6666K8837j9014k9010Q79L1937J0472l0073J153k465J7407
$$ plain form
10714 47479 76096 66339 50259 42393 55536 49572 40330 26593 34974 66664 56978 -10353 -32508
10701 -32508 19075 46315 26101 26062 59400 77386 62613 66925 73531 42901 2707 10963 41072
10688 41072 29368 32334 54968 54086 52663 93532 110856 113208 114296 70960 40508 9669 1500
10675 1500 22626 16681 -2023 -22794 -47044 -88381 -79814 -49778 -7332 8912 2778 13343
10663 13343 33233 40414 46478 78580 84764 36127 8182 1343 46911 48374 56112 51547 45680
10650 45680 94719 114716 72922 28977 35890 32675 28886 40841 40189 10487 2867 2109 26776
10637 26776 52057 43994 84048 102942 128566 145159 129413 104829 125923 113211 88443 72856
10625 72856 67555 61606 78272 107109 88095 59085 59964 91901 102373 72300 73453 70988 88395
10612H8395K9234P024n321k1037j6735L2070j286j4765m8542j1939L1925k4310
10600D4713j2219M4338L7429L2423K1821m494k9135l4250N190K0741l1649j4791
10588H0117J0986K0049M2779K9648k2009k9637m6008K1580p305M402M2889j9558
10576A27933j3145p986k3201j8987q964M7783L7166k1840l7093k5264L1909K5271
10564A13582L6994j2273l7973J9877M3505k048n146K1188O974J2333J3245L8937
10552B49195J2555N518K0320P0848R8509J00455Q5712Q5791R4670J46437J56756
10541A126766K48104K19559J61136K2927j36284j94603k06678k37178j85462j76789
10531F41498j12406m5371m9934l7927q8021j830o800l8486j1404l2077k161J6581
$$ plain form
10612 88395 117629 124653 119332 98295 81560 113630 112344 97579 49037 37098 69023 44713
10600 44713 32494 76832 114261 146684 168505 164011 134876 100626 105816 126557 94908 80117
10588 80117 91103 111152 153931 183579 161570 131933 85925 107505 100200 104602 147491 127933
10576 127933 114788 106802 83601 64614 55650 103433 140599 118759 81666 56402 88311 113582
10564 113582 150576 138303 100330 120207 163712 161664 156518 177706 184680 197013 210258 249195
10552 249195 261750 267268 287588 358436 456945 557400 643112 728903 823573 970010 1126766
10541 1126766 1374870 1594429 1755565 1778492 1642208 1447605 1240927 1003749 818287 641498
10531 641498 529092 483721 433787 395860 307839 306009 299209 260723 249319 217242 215081 231662
10519B31662K3059p653M0086K8842k3427m0137j9010m752l0843l2948m2346l12
10507A22221M9790M3883j1420m4149j4248j3389k8619M869l3104N087L6988j4361
10495A03548K935R695j8079l2937L1391N2479M1623L1590J4067l729j3971Q891
10483B27503k2147k8990l529K8184K0520L108l4655j6226q870M3098O935k0887
10471A94044l7807k1103K1977M2415J0026Q947l1292o2760n0019l0494k4463O4615
10459H4086M1058m6179k3121O680J0517J2884K5256O089r684j2556m5070k9876
10447B0084M590J2813K1658l2267q987L7889N535q053M881O199L7166L0061R857
10434A41426J4917J5698o646p448j0712j508K7963J1359m5842l4803m4754K4681
$$ plain form
10519 231662 254721 247068 287154 315996 292569 252432 233422 228670 197827 164879 122533 122221
10507 122221 172011 215894 204474 160325 146077 132688 104069 108938 75834 80921 117909 103548
10495 103548 106483 116178 98099 65162 96553 149032 190655 222245 236312 232583 218612 227503
10483 227503 205356 176366 172837 201021 221541 224649 189994 173768 164898 207996 214931 194044
10471 194044 156237 135134 157111 199526 209552 218499 187207 124447 74428 43934 19471 84086
10459 84086 125144 78965 55844 62524 73041 85925 111181 117270 107586 95030 49960 20084
10447 20084 24674 37487 59145 26878 17891 55780 61315 53262 58143 64342 101508 131569 141426
10434 141426 156343 172041 165395 157947 147235 145727 173690 185049 139207 104404 59650 84331
10422H4331L9509l7738m5973k5366J0576N3658J7643J0704K660J3399J4358l8480
10410I9281J6047N2968R377l1883j3646L381l1157J4960M0870k5605l9913n1383
10398D3297j9847L6635O190j07K420J0071M6221J6111j4877o777j0126J7016K137
10385A28364j000J0081j0946l6688Q984r613J6600L7485k5033k2118o98J1280
10373A06698K4405L6125j4173m4893m3968J4094L0717O098o508K2084Q022K5037
10361A63738K4124K070K3483o8J8394k7587j5767j3829k6558J3822M3576j7165
10349A88233j6767J4211q57K8842K0263K1165J5366l2134j9455j0166L48K4820
10337B33869j4836L7921K8690J0658K817K1009N1029k0443J8803K8222j3622k536
$$ plain form
10422 84331 123840 86102 40129 14763 25339 78997 96640 107344 110004 123403 137761 99281
10410 99281 115328 168296 177673 145790 132144 135525 104368 119328 160198 134593 94680 43297
10398 43297 23450 60085 66275 66168 68588 78659 124880 140991 126114 119337 109211 126227 128364
10385 128364 127364 137445 126499 89811 98795 89182 105782 143267 118234 96116 95418 106698
10373 106698 131103 167228 153055 108162 64194 78288 109005 115103 108595 130679 138701 163738
10361 163738 187862 189932 213415 213347 231741 204154 188387 174558 148000 161822 205398 188233
10349 188233 171466 185677 184820 213662 233925 255090 270456 238322 218867 208701 209049 233869
10337 233869 219033 256954 285644 296302 299119 320128 371157 350714 369517 397739 384117 381581
10325C81581l7565m123k7624k161K0118j5194r596k1583j3754J8658l462N5199
10313C40494j613K5554J1303k4861k5281O549K6738k631J0260n534J869j0476
10301C52371k4266l6191k2263J5701N615k2413r81o606l6610n661J2116P623k7746
10288B10689l9311M68L3602k1045r217r638j3973j7748k1620L1784M0129M0869
10276B24989j8539j0734o006j476K3141J9524j706m675o8868m5798K5574Q19n969
10263A30276K3080L6708J9479J5547K4747M3789J2651M275J008J068j3447k7551
10251B71630j4397K4940J5757L9174K68M4393N9401J185K4233J8301k0097r652
10239D55136o654K542j8704J0723K1407J5298J010j7411j8832r32J0162J4999
$$ plain form
10325 381581 344016 339893 312269 310108 330226 315032 305436 283853 270099 288757 285295 340494
10313 340494 338881 364435 375738 350877 325596 332145 358883 356252 366512 360978 362847 352371
10301 352371 328105 291914 269651 285352 290967 268554 267573 260967 224357 218696 230812 238435 210689
10288 210689 171378 171846 205448 184403 175186 165548 151575 133827 112207 143991 184120 224989
10276 224989 206450 195716 189710 188234 211375 230899 229193 224518 155650 109852 135426 136245 130276
10263 130276 153356 190064 209543 225090 249837 293626 306277 310552 311560 312628 299181 271630
10251 271630 257233 282173 297930 337104 337372 381765 441166 442351 466584 484885 464788 455136
10239 455136 448482 451024 432320 443043 464450 479748 480758 463347 444515 443583 453745 468744
10227D68744r113m599N5182P70m007M1195J5716M5414J375j6169K4015o814m0759
10214E70950l1260J4395J3206N264J9777M6927R1562P8176J07723J42421K15879
10203A275020K82379L52809L43963J81659Q6243J74141J66439o8631l62138l77571
10193B054313k51763k69113l56465k67393j86039j18310p3622p0738o9734l8988
10183C52148j512j841n618n181L5319j6936n0456j8526J1861L794k007j4102l5280
10170B51663K932J5051j1763K0875J0028K5753K8474j7151j6306j4829m528O47
10158B90846j8520K086l4622q997q04K0725K9833J2209n107k2261J0527k6896
10146B49019l699N0576P975O118j7859L597k2705J434Q515j5091o7853l906L7334
$$ plain form
10227 468744 459631 455032 510214 510984 506977 548172 563888 609302 610677 594508 618523 611709 570950
10214 570950 539690 554085 567291 572555 592332 639259 730821 808997 916720 1059141 1275020
10203 1275020 1557399 1910208 2254171 2435830 2522073 2696214 2862653 2794022 2431884 2054313
10193 2054313 1802550 1533437 1176972 909579 723540 605230 531608 460870 391136 352148
10183 352148 350636 348795 343177 337996 373315 356379 305923 287397 299258 303052 301045 286943 251663
10170 251663 254595 269646 257883 278758 288786 314539 343013 325862 309556 294727 290199 290846
10158 290846 272326 274412 239790 230793 229989 250714 280547 292756 287649 265388 275915 249019
10146 249019 245320 295896 303871 309989 292130 295727 273022 274456 282971 267880 200027 196121 233455
10133B33455K6545m643j3803k9447K9167q084J7079J3089m941M318j2673p08J8380
10120B67734L2159J1514O357j7121k5845J4906j3066Q925o273n3864j3103O7499
10108B79822J0434m093J278j0035M0502K6962k1517k6805k672L2411j5569K2920
10096C33638K5455M529K6705k3815m2715l4933M217P6300M0454N829q423m0550
10084C66691k8857j1430k949J978K2168L1681K5743j0502J7037J1225n3135q410
10072C61240m163o405j0634k6540o974P959K3280j4569l8146j0207R039N874J0950
10059C00704J082r170J1890P585k4181K3762J1696K247j3748L415j0133k1879
10047B83270L5271p551j1510r854L4138L955k8192j439Q43J9883N216k551N519
$$ plain form
10133 233455 260000 255357 241554 212107 241274 233190 250269 263358 258417 262735 250062 249354 267734
10120 267734 299893 311407 317764 300643 274798 289704 276638 285563 279290 225426 212323 279822
10108 279822 290256 286163 287441 277406 317908 344870 323353 296548 293876 326287 310718 333638
10096 333638 359093 363622 390327 366512 323797 288864 293081 369381 409835 415664 407241 366691
10084 366691 337834 326404 323455 325433 347601 379282 405025 394523 411560 422785 369650 361240
10072 361240 357077 350672 340038 313498 306524 314483 337763 323194 285048 274841 283880 289754 300704
10059 300704 301786 292616 304506 312091 287910 311672 323368 325615 311867 315282 305149 283270
10047 283270 318541 310990 299480 289626 323764 327719 299527 298088 298931 318814 324030 321479 326998
10034C26998J3557J6847j2541J798k496K3474M3000p482l1639K904j137N0185
10022D23468J4004n618j5227K7713O522n5106k133L0963L1812j286M745M8461
10010E08318K0057j5428Q763P571L0507Q015l4749N299L4774M077R584L2662Q978
9997F28428J0868L0620O828j2821L6282p236L1889O499K2782K1471M4583O7816
9985H88009P1335K1521L1009R316l5793l8842p1385m7217L2428J5156L2363M8800
9973I56700K9806J7439K6567m563R159M1756Q1097J32225P2389Q2225J12930J35431
9961A693161J79843K09211K72279K61921L53817L88199M37732N03913O58655Q19765
9951E778496R87912J172666J305386J414676J496661J433420J206382Q74843N22787
$$ plain form
10034 326998 340555 357402 344861 346659 344163 367637 410637 403155 371516 374420 373283 423468
10022 423468 437472 431854 416627 444340 450862 395756 393623 424586 456398 455112 459857 508318
10010 508318 528375 512947 521710 529281 559788 567803 533054 538353 573127 577204 586788 619450 628428
9997 628428 639296 669916 676744 663923 700205 692969 724858 731357 754139 775610 820193 888009
9985 888009 959344 980865 1011874 1021190 985397 946555 875170 827953 860381 875537 907900 956700
9973 956700 986506 1003945 1030512 1025949 1035108 1076864 1157961 1290186 1362575 1444800 1557730 1693161
9961 1693161 1873004 2082215 2354494 2616415 2970232 3358431 3796163 4300076 4958731 5778496
9951 5778496 6766408 7939074 9244460 10659136 12155797 13589217 14795599 15670442 16193229
9942A6193229K67861L24637N55840Q11901J057533J368659J712017K071565K290777
9933B6654019K311825K055550J519320R11840L91385J1533k49063l38410j94226
9924C3073773K85600Q23234J013391R03416Q55117Q91975Q17538M55500j40021
9915C8979523n25458p05215p76184r04909r27128p13303k98969j28420k50230
9906C3749707n47656j025677j686217k206481k354904k187222j856637j465889
9898B0419024r83779n25626j85611o5811l332L94j49093n63788r91486j412951
9888A5537941j787738j989074j914492j596499j261751r93209p46128n18384l65212
9879D365454k75003j90424q4826J6233P9136J01476J30644K17487L42445M07710
$$ plain form
9942 16193229 16461090 16785727 17341567 18153468 19211001 20579660 22291677 24363242 26654019
9933 26654019 28965844 31021394 32540714 33452554 33843939 33855472 33606409 33267999 33073773
9924 33073773 33359373 34182607 35195998 36099414 36954531 37846506 38664044 39119544 38979523
9915 38979523 38454065 37748850 36972666 36067757 35140629 34427326 34128357 33999937 33749707
9906 33749707 33202051 32176374 30490157 28283676 25928772 23741550 21884913 20419024
9898 20419024 19435245 18909619 18724008 18658197 18654865 18655259 18506166 17942378 16950892 15537941
9888 15537941 13750203 11761129 9846637 8250138 6988387 5995178 5249050 4730666 4365454
9879 4365454 4090451 3900027 3815201 3831434 3910570 4012046 4142690 4360177 4702622 5110332
9869E110332M97776O10259Q34439J018708J240530J564699J962454K291282K582596
9860A7713075K878676K931007K634467K013629J241585N46985n1622k47321J40116
9851B9800597O60269J149106J670333K346980L053106L565618L692018L494252
9843D9432279L017736K186238J049217R4015l91650k93094N2571O34837J280667
9834E7062816J389819R68272M99448K77724M8562m77558j105439j469078j451614
9825E5742952j214948j177240j165821p26540m9905L21959R6743o70555j623657
9816D9532988k467763l186955l674838l792524l505527k943293k176624j421910
9808B6363554r50838o99534n72313n02085n46497q92696j463870k000192k390950
$$ plain form
9869 5110332 5608108 6218367 7052806 8071514 9312044 10876743 12839197 15130479 17713075
9860 17713075 20591751 23522758 26157225 28170854 29412439 29959424 29907802 29660481 29800597
9851 29800597 30460866 31609972 33280305 35627285 38680391 42246009 45938027 49432279
9843 49432279 52450015 54636253 55685470 55779485 55387835 55094741 55147312 55782149 57062816
9834 57062816 58452635 59420907 59920355 60198079 60246641 59769083 58663644 57194566 55742952
9825 55742952 54528004 53350764 52184943 51458403 51408498 51730457 51827200 51156645 49532988
9816 49532988 47065225 43878270 40203432 36410908 32905381 29962088 27785464 26363554
9808 26363554 25412716 24713182 24140869 23638784 23092287 22199591 20735721 18735529 16344579
9799A6344579k514434k364837k031583j666353j350896j026826p66286o34922
9791C988442n33778l85055l09638k66216k79070k08457j75463j31076j17472j00910
9781A481307p8307o0403o9858p3014l6210q1348j09557r4135o2937j5053J9568
9770H20053k7673N955k1294k287n3195k8856m4035k6226k8895r847k4192m168
9758E55340P584j499K6952M2197o602k8918l1078o810o063r452N157K5864J9665
9745E92337k2864l4547l0128L7012L2544K7890J2962J4743K0661J6168k1456m9153
9733E96169m8098j101P300l713r818J5943N23J1183J4432J3866L289L2183K6810
9720F58968l5653j4130J5685k4486j0834q056j8988N136J5198k3528l2615j0529
$$ plain form
9799 16344579 13830145 11465308 9433725 7767372 6416476 5389650 4623364 3988442
9791 3988442 3454664 3069609 2759971 2493755 2214685 2006228 1830765 1699689 1582217 1481307
9781 1481307 1403000 1342597 1272739 1199725 1163515 1082167 972610 878475 815538 800485 820053
9770 820053 792380 798335 777041 774754 721559 692703 648668 622442 593547 583700 559508 555340
9758 555340 562924 561425 588377 630574 623972 595054 563976 557166 551103 541651 546808 572672 592337
9745 592337 569473 534926 504798 541810 574354 602244 615206 629949 650610 666778 645322 596169
9733 596169 548071 546970 554270 550557 540739 556682 557205 568388 582820 596686 599975 632158 658968
9720 658968 623315 609185 624870 600384 589550 581494 562506 567642 582840 559312 526697 516168
9708E16168O362J383o462J8783M0912k324j4619j5235M257L4869m163l7927j4360
9695E27644L043l421l1710o1046N7973N7102J4504l9037j4179l4839p798j3105
9683D55131M7032O350K4287n876j6509J2183J4215k6267K7817L4488M9767k7502
9671E95116K719J4962j0709k1237k1476J2156K8610K3340M246r07l7461M241Q894
9658F02494K963M2540M5805L6917N605m641k7481k0614O922L064J5448J2771l3960
9645F87833P006L6872L1536k6705j9891N088N1246P4513K1632k9283K307K3812
9633H65966J3555j9399K9956P7898K9147k1446k5165j2720K5911N5236N3476M5622
9621A118037K4881K0128K5865L6324L2400O1109J16154J04830R9654J18042J50066
$$ plain form
9708 516168 522530 523913 517451 536234 577146 574822 560203 544968 549225 584094 579931 542004 527644
9695 527644 530687 527266 495556 434510 492483 549585 564089 525052 510873 476034 468236 455131
9683 455131 502163 508513 532800 526924 510415 522598 536813 510546 538363 572851 622618 595116
9671 595116 597835 612797 602088 580851 559375 571531 600141 623481 627727 626820 589359 593600 602494
9658 602494 605457 647997 693802 730719 736324 731683 704202 683588 690510 693574 709022 721793 687833
9645 687833 694839 731711 763247 736542 716651 721739 772985 847498 869130 839847 842154 865966
9633 865966 879521 860122 890078 967976 997123 975677 950512 937792 963703 1018939 1072415 1118037
9621 1118037 1142918 1163046 1188911 1225235 1257635 1318744 1434898 1539728 1639382 1757424 1907490
9610A907490J86689J55469J79456J96511J32588J77748J99426K02217K49489L68540
9600C955623M56795N49475P22282Q68054J114006J377291J726692K078391K490693
9591A5339302K996636L545438M154643M830172N343222N466962M898078L148842
9583D9723295N2649l421537n897837o651960o041904m789860l559249k679263
9575A6734334k074448j569255j071608o40112j71200K53460P26767J193774J671061
9566A5052773K092085K523667K868506L008399L202012L381779L582018L596349
9558C9307588L221326J946516k01785k675574m506266n052953m583767l652300
9550B3802785k831172k462710k410753k418300k129288j729277j225963q17017
$$ plain form
9610 1907490 2094179 2249648 2429104 2625615 2758203 2935951 3135377 3337594 3587083 3955623
9600 3955623 4412418 4961893 5684175 6552229 7666235 9043526 10770218 12848609 15339302
9591 15339302 18335938 21881376 26036019 30866191 36209413 41676375 46574453 49723295
9583 49723295 49775944 46354407 40456570 33804610 27762706 22972846 19413597 16734334
9575 16734334 14659886 13090631 12019023 11378911 11207711 11461171 12187938 13381712 15052773
9566 15052773 17144858 19668525 22537031 25545430 28747442 32129221 35711239 39307588
9558 39307588 42528914 44475430 44273645 41598071 37091805 32038852 27455085 23802785
9550 23802785 20971613 18508903 16098150 13679850 11550562 9821285 8595322 7778305
9542G778305n06666k85126j24198j7569Q5450J49124J80522J91812K01778K45671
9532G899103L08431N01539P25941J024613J361955J749943K113243K434883K822694
9523B0942345L195737L587840L775298L750129L606936L114476J866816j10697
9515D3728880k176885l395967l738712l566184l267301k694302k036538j474873
9507B1378118q69072j81041M49653J060758J655047K361492L030494L679863M302686
9498C6867998M761481M960426M761607M081248L081618J898113N84441q57946
9490F0138986k422437l854747m985074n617637n586235n150881m429197l566204
9482B4526574k665307j980263j404629q59462k44668L32172Q11838J258636J612386
$$ plain form
9542 7778305 7271639 6986513 6862315 6844746 6930196 7079320 7259842 7451654 7653432 7899103
9532 7899103 8207534 8709073 9435014 10459627 11821582 13571525 15684768 18119651 20942345
9523 20942345 24138082 27725922 31501220 35251349 38858285 41972761 43839577 43728880
9515 43728880 41551995 38156028 34417316 30851132 27583831 24889529 22852991 21378118
9507 21378118 20509046 20328005 20777658 21838416 23493463 25854955 28885449 32565312 36867998
9498 36867998 41629479 46589905 51351512 55432760 58514378 60412491 60996932 60138986
9490 60138986 57716549 53861802 48876728 43259091 37672856 32521975 28092778 24526574
9482 24526574 21861267 19881004 18476375 17616913 17372245 17704417 18516255 19774891 21387277
9473B1387277J843867J904312J787366J544331R39008r6647j498684k750484l338228
9464B1722118l247147k834660k386884j903375j482147j183711r59563p69520
9456F955111n89216m60752k80578j11508q6189r0994q0383j25460j16872m4238
9446D968921L8867J60351L19978N27348O55854Q06596J078283J338120J529980
9437A1424298J792190J931663J895630J824429J770072J846552K050055K053829
9429B6588718J482446K52165j312163k580051l113643k995735k492799k027478
9421A3801460j717145j450152j268984j013971p08621l58919m2135J92010M77816
9412G911359Q01926J042126J313187J609154J887267K169147K473865K710232
$$ plain form
9473 21387277 23231144 25135456 26922822 28467153 29406161 29309514 27810830 25060346 21722118
9464 21722118 18474971 15640311 13253427 11350052 9867905 8684194 7724631 6955111
9456 6955111 6365895 5905143 5624565 5513057 5426868 5335874 5255491 5130031 5013159 4968921
9446 4968921 5007788 5168139 5488117 6015465 6671319 7477915 8556198 9894318 11424298
9437 11424298 13216488 15148151 17043781 18868210 20638282 22484834 24534889 26588718
9429 26588718 28071164 28323329 27011166 24431115 21317472 18321737 15828938 13801460
9421 13801460 12084315 10634163 9365179 8351208 7642587 7283668 7241533 7433543 7911359
9412 7911359 8713285 9755411 11068598 12677752 14565019 16734166 19208031 21918263
9404B1918263K854865K653534J809605K13384j869251l580222m301045m026844
9396A5672289l287696k492262j890561j432429j100772q65120p45670n71506m46644
9387B839629l07523k48083j83154j56606r6379j17189q0942q7052o3611o4129
9377A434961q4644l8877k9066o3374l4863m3244k3520l1945k4266p7196o8531
9366I15435p9066o0032m6053j8334k6938n3904l6532j0675j6154K1497j9151o512
9354E63581j2691k876m071K8784k0675n2276M1295M3318M3630M758p021m6414
9342E79342n3695O082k3016o8329m8934k6159n0804L582M5141m0057m5334Q134
9330B85953N421P184M0150j384l2453k4634L7325q142m8163j9201k6210k5065
$$ plain form
9404 21918263 24773128 27426662 29236267 29449651 27580400 24000178 19699133 15672289
9396 15672289 12384593 9892331 8001770 6569341 5468569 4603449 3857779 3286273 2839629
9387 2839629 2532106 2284023 2100869 1944263 1847884 1730695 1649753 1562701 1499090 1434961
9377 1434961 1350317 1311440 1282374 1219000 1184137 1140893 1117373 1085428 1061162 983966 915435
9366 915435 836369 776337 730284 711950 685012 631108 594576 583901 567747 589244 570093 563581
9354 563581 550890 548014 543943 572727 552052 499776 541071 584389 628019 632777 625756 579342
9342 579342 525647 531729 508713 440384 391450 365291 314487 318069 363210 323153 277819 285953
9330 285953 291374 298558 338708 337324 304871 280237 317562 309420 261257 242056 215846 190781
9318A90781L1332J8467p84j6679k3857k504K3528M0675J9491m8787J5104L4580
9306B81347K5270j2214m195M2939n0912m3801K3644J9874P5k6091j8657J1822
9294B49101M8342M5993K0985K7923N5415O2637N7182J07880J09973O9222m3601
9283H11052m9462p3854j20654m1283j6003l3738J1448j435R95K189J8854P5898
9271E84007Q4345O8177L1921K5604p416k5943j4842j0921L88m3642k0003m6871
9259F24804J6198N729J5240J2875Q247P8116J09061J08286J73485J51020J55395
9248A458456J27845J5927j11168k90715k56304j41728r6850q4326k5993J5619
9238F10763J0510k9002j2988j7175j4155K0457P4010O7360J9093J3984j0914k1916
$$ plain form
9318 190781 222113 240580 239796 223117 199260 196756 220284 260959 280450 231663 246767 281347
9306 281347 306617 294403 290208 333147 282235 238434 262078 281952 282027 255936 237279 249101
9294 249101 297443 343436 364421 392344 447759 510396 567578 675458 785431 854653 811052
9283 811052 761590 687736 567082 525799 509796 476058 487506 486071 487066 489255 508109 584007
9271 584007 668352 736529 768450 794054 786638 760695 745853 734932 735320 691678 671675 624804
9259 624804 641002 646731 661971 674846 683093 761209 870270 978556 1152041 1303061 1458456
9248 1458456 1586301 1602228 1491060 1200345 944041 802313 705463 621137 595144 610763
9238 610763 621273 592271 579283 562108 547953 568410 642420 709780 728873 742857 731943 710027
9226G10027o8334p3751p9997p1264l2341l1479j9162M036j0835N6790M9089O0021
9214D92800P2669O7384M7037M8300k0857p7988r6952j20077j02193m1411p144
9203B61568K6489Q944m113o5540k5949K162J4765j8173J2297p248j7556l001j4764
9190A69881M3153N3309n933l3671L0009K5907L9117N4911O399P476M0672l208
9178D28022k6046O434m698m8079j8456l4411j7777K251J5245j5755p198l4583
9166B44949q173k0441J1904r432l139J2437K8721K9658K7485J1584j157J5160
9154C39556N0455N9699K1604L720j9454o7925m5381j0855l6511j5512n897o8428
9142B05071n5391L8354J0838K5401J9042k1343K7389p011l0155m1536m9136J7600
$$ plain form
9226 710027 641693 567942 487945 416681 384340 352861 333699 337735 326900 383690 432779 492800
9214 492800 565469 632853 679890 728190 707333 629345 532393 412316 310123 268712 261568
9203 261568 288057 297001 292888 227348 201399 203561 218326 200153 212450 205202 187646 184645 169881
9190 169881 213034 266343 260410 226739 256748 282655 321772 376683 383082 390558 431230 428022
9178 428022 401976 408410 403712 355633 337177 302766 284989 287240 302485 286730 279532 244949
9166 244949 236776 216335 228239 218807 215668 228105 256826 286484 313969 325553 324396 339556
9154 339556 390011 449710 471314 475034 455580 387655 342274 331419 294908 279396 273499 205071
9142 205071 149680 188034 198872 224273 243315 221972 249361 242350 212195 170659 121523 139123
9130A39123K3541J2096P962n811K0741J8949O0738J6674o070J4746L2910r372
9118C26227m7396J6075L083K9367N6231O3678L2780P351K4848l4554r6394l6065
9106C45231o3608k6723K2796J0943m8618o197N3817K9323K8769K2753M10O1017
9094D29913L9429M8051K2758q826J3897J2150j5942n4324P808K0979j5426k2945
9082D77522n2186n4919o539K448l6719k1143j3650l2558k9062O984L4314o784
9070B67708J0711J5114J5882M3739J8712J4920O7260P541o5782m7585j1693j3608
9058C22919p615j3601k3859R804k9802j9251j4571m2415J6591J7441P707j1111
9046B12237K5263j6983j0513j4181K4397O599J1757p426K8600J7349M119k456
$$ plain form
9130 139123 162664 174760 182722 176911 197652 216601 277339 294013 287943 302689 335599 326227
9118 326227 278831 294906 297989 327356 383587 447265 480045 487396 512244 477690 381296 345231
9106 345231 281623 254900 277696 288639 240021 233824 287641 316964 345733 368486 368896 429913
9094 429913 469342 517393 540151 531325 545222 557372 541430 487106 494914 515893 500467 477522
9082 477522 425336 370417 363878 366326 329607 308464 294814 262256 233194 240178 274492 267708
9070 267708 278419 293533 309415 353154 371866 386786 454046 461587 395805 348220 336527 322919
9058 322919 315304 301703 277844 287648 257846 238595 224024 181609 198200 215641 223348 212237
9046 212237 237500 220517 210004 195823 220220 226819 238576 231150 259750 277099 281218 278762
9034B78762o004K6576k7655n366M5938L4661m052J5419J9945J3376K4776L261
9022D19637k9460k3767K3035l7253l6911L6665o0842p1691k5601M2289p131J3670
9010B42640J2448K3329O7474k3529l0577n034J8335J2159k3410j0730M2128M5625
8998C70858O3908k0104l7806q053n1182m9168l131j0171J7960j1769l314j4126
8986B43902k868J2810j8242J6530J3684J8823r129j6367L16l0316j574p6O097
8973B33590M9212J7391O046K2116K4109J792l4548j1614L0410r650l5526j4932
8961B78396j9954l4066K0490J3418R97j8111j0785K6387J7494r125r614L9229
8949B94756j8709J9543J9113K1394l9583k9858M609J8319O796K2873O482M464
$$ plain form
9034 278762 272758 299334 271679 266313 312251 346912 342860 358279 378224 391600 416376 419637
9022 419637 390177 366410 389445 352192 315281 351946 291104 219413 193812 236101 228970 242640
9010 242640 255088 278417 345891 322362 291785 286751 305086 317245 293835 283105 325233 370858
8998 370858 434766 414662 376856 368803 317621 268453 265322 255151 273111 261342 258028 243902
8986 243902 241034 253844 235602 252132 265816 284639 275510 259143 259459 229143 227569 227493 233590
8973 233590 282802 300193 306239 328355 352464 354256 319708 308094 338504 328854 293328 278396
8961 278396 258442 224376 244866 258284 259281 241170 230385 256772 274266 265141 255527 294756
8949 294756 276047 295590 314703 336097 296514 266656 271265 289584 296380 319253 325735 330199
8937C30199l4676q060M9412M0720p944l3971j5138m9163K068J4328j0002J8354
8925B96127p635K7989q60o565m5696p366N1749L6514M6388J081L89J7977O436
8912D16528l6916J3229N4037K2409k6012p160k9044m325o308J2487K3608j4250
8900D18283J0347J6362R26P7379M9775l2474n6256j007N7480K8952J4869R6504
8888F81140P4491O7597N0592R7260J32316J08557J33152R0911J86235J89352K31024
8877B042627L94359L71949M34818O19560R12726J271495J678036K096619K448479
8868A2270668K865760L554030L287571n90814n130907n457324l608025k145106
8860E045853j307486q52461n56087l58055k53312j46654r1122j35958j24329j43294
$$ plain form
8937 330199 295523 287463 336875 377595 369651 335680 320542 271379 273447 287775 277773 296127
8925 296127 288492 316481 315621 309056 263360 255994 307743 344257 390645 391726 392115 410092 416528
8912 416528 379612 392841 446878 469287 443275 436115 407071 402746 396438 408925 432533 418283
8900 418283 428630 444992 445918 523297 573072 540598 484342 483335 540815 569767 584636 681140
8888 681140 755631 823228 873820 971080 1103396 1211953 1345105 1436016 1622251 1811603 2042627
8877 2042627 2436986 2808935 3243753 3863313 4776039 6047534 7725570 9822189 12270668
8868 12270668 15136428 18690458 21978029 21387215 16256308 10798984 7190959 5045853
8860 5045853 3738367 2885906 2329819 1971764 1718452 1571798 1480676 1344718 1220389 1077095
8850A077095j39393q1935j3462k2424r3217q1656j6581k6397l3094l9339p640
8839E21957j010j0396l6461j8494j8171j3796R294K1507j2773l2434k1279m7636
8827C40308L7346L8994j565m770j8388m284Q701j0601k392j3631K5192K6036k1795
8814C99151l418J2112j0289J4874L402l364n622Q806j1055m2788j4534K5981k245
8801C71011L1151j7265l4702K9386J7582j8876j456r387J4455k1855K5304L7258
8789D22606P221n197m048n996l441k3839k9970J1069M6021n854n4571M644J6120
8776C74765J6324K0579k373k3315k587K7576j2243m905M03j8j0409j3430k3121
8763C47246L7105J7066p041m222l370j6767m6624K796M0755Q875r48n1665p005
$$ plain form
8850 1077095 937702 855767 842305 819881 726664 645008 628427 602030 568936 529597 521957
8839 521957 520947 510551 474090 455596 437425 423629 432923 454430 441657 409223 387944 340308
8827 340308 377654 416648 415083 410313 391925 387641 396342 385741 383349 369718 394910 420946 399151
8814 399151 395733 407845 397556 412430 415832 412468 406846 415652 404597 361809 347275 373256 371011
8801 371011 402162 384897 350195 379581 397163 378287 376831 367444 381899 360044 385348 422606
8789 422606 429827 424630 420582 414586 411145 387306 357336 368405 414426 408572 354001 358645 374765
8776 374765 391089 411668 409295 385980 383393 410969 398726 393821 394224 394206 383797 370367 347246
8763 347246 384351 401417 394376 390154 386784 370017 323393 326189 366944 375819 374871 323206 316201
8750C16201J6399J9771q754Q368L4649Q678r353p335J8097L5228q839R269R20
8737D33299q181n494J2692J7693O165k425Q55k058k0510j3314J862J8280j8312
8724D20552k2381j6174J8796j308k815J8477J0697j8597j6957J9035M9538M0180
8712D99043o1441k8075K6510K5340L6300K7729K6557l2127j787j05j3732J0179
8700E14391L2181L7216M2179K6498J3297K1581K7615N8641J11165Q2451M1464
8689A008679J7428q5876j72074j06606o3903m0697j4171r45J4964o2629j9482
8678D74688J4761o988K437J0465L3765m672n5315J4841J5397k969L8366K8120
8666E62896K8005K2987J1325R955P702n217K4130R544j6636J997L036J9889N5471
$$ plain form
8750 316201 332600 352371 343617 351985 386634 395312 385959 378624 396721 431949 423110 432379 433299
8737 433299 425118 419624 432316 450009 456174 453749 454604 452546 432036 418722 420584 438864 420552
8724 420552 398171 381997 400793 399485 396670 415147 425844 407247 390290 409325 458863 499043
8712 499043 437602 409527 436037 461377 497677 525406 551963 519836 518049 517944 504212 514391
8700 514391 546572 583788 625967 652465 665762 687343 714958 773599 884764 967215 1008679
8689 1008679 1026107 940231 768157 661551 597648 556951 542780 541835 556799 494170 474688
8678 474688 489449 482461 484898 495363 529128 524456 469141 483982 499379 496410 534776 562896
8666 562896 590901 613888 625213 635168 642870 637653 661783 671327 654691 656688 659724 679613 735084
8653G35084L3193K6092N6944Q2828M9099J1222n7206p8188q9303p0593m1286k5542
8641F32344m5653r014J6528L5894j1728m7960j3847J1628L19J5848j3657o958
8629E63744k951O104m086p171J4881M5397L466m573j9400n501R624k2256k236
8616E75042J4460M3452J9978n184k2521n242M548j1454j0252J030j1979p101N393
8603E90170K2502N686R019M9278K6143J1900n177l1849j1919L3976j4629O019
8591F91119l4383l0403K3657J8502k2226m544M7038j4591k7202n802J0053K6131
8579F77349R921k7575j3660N0664m703J4492k1109n6394J072K0898J3855l792
8567F61018k9683r916O6756l8951j4771k1138N542M608K5317J063J0672K5722
$$ plain form
8653 735084 768277 794369 851313 934141 983240 994462 937256 859068 769765 699172 657886 632344
8641 632344 586691 577677 594205 630099 618371 570411 556564 568192 568511 584359 570702 563744
8629 563744 560793 566897 562811 555640 570521 615918 619384 614811 595411 589910 599534 577278 575042
8616 575042 589502 632954 652932 647748 625227 619985 624533 613079 602827 603857 591878 584777 590170
8603 590170 612672 618358 627377 676655 702798 714698 709521 677672 665753 699729 685100 691119
8591 691119 656736 626333 649990 668492 646266 641722 688760 674169 646967 641165 651218 677349
8579 677349 687270 659695 646035 696699 691996 706488 685379 628985 630057 650955 664810 661018
8567 661018 631335 621419 688175 649224 634453 613315 618857 623465 648782 649845 660517 686239
8555F86239M411j1331j5317j9080l765N3281J8275k9880l013N610J76J9355k175
8542G02786J0555k1481k0950r355K5709M9544J2573j9253l3205M7264M5749j3461
8530G76475K0104K7779l3840k1423j4403j909J344L1469K9434K2120N806l3243
8518H09713o4650j9343K8703P288R635N8497k8084k9550p016l199j6620J692k7814
8505G19252M0J3520q835l7042L7235L7389M4022L8118K0206J4987r453K5063j4156
8492H80346K0522j8953k4380K194L633J0599j7504k199J954k3960k3233j2805
8480G96214K6946J7149Q332j1966j2946N5767O815K1231o639M5593J4754j7727
8468I43523N2917L9410j4247l0864j9133k5931k855N964l149k2952L6928o222
$$ plain form
8555 686239 690650 679319 664002 644922 641157 694438 712713 682833 679820 685430 685606 704961 702786
8542 702786 713341 691860 670910 661555 687264 736808 749381 730128 696923 744187 789936 776475
8530 776475 796579 824358 790518 769095 754692 752783 754127 785596 815030 837150 842956 809713
8518 809713 745063 725720 754423 761711 771346 829843 801759 772209 765193 761994 745374 747066 719252
8505 719252 719292 732812 723977 686935 724170 761559 805581 843699 863905 878892 869439 894502 880346
8492 880346 900868 881915 857535 859729 863362 873961 856457 854258 856212 832252 809019 796214
8480 796214 823160 840309 848641 836675 823729 879496 886311 907542 900903 946496 961250 943523
8468 943523 996440 1035850 1021603 990739 971606 945675 942820 948784 945635 922683 959611 953389
8456I53389L3225M1330j1118j5079J154p342J6248q212o394N768o904k2401J529
8443I75193n504k6275J3932J6788L441R328n918R979J6252k8430L855Q613J907
8430I93161K6744K7753L8425j692K473L2109N201k5827j9643k0674M668l3J7249
8417A079914K3879N7894j4134l4690l5540m859K4265L9501L0678j457M326J0144
8405A179921n01k8907j0316O428R027k1702J03L8054K4850L934l8583J0140n436
8392A167012k2594K1641J9697l7703J4535N7997J9648l9832J0190L519r142J6710
8380A221678L9963L0411P961q885R470K5262N750j1761l9846K3786p79M3872Q847
8367A355729l1239k8163J8095K0030M39L1425L2061J6087j3448k3069R800q383
$$ plain form
8456 953389 986614 1027944 1016826 1001747 1002901 995559 1011807 1003595 997201 1002969 996065 973664 975193
8443 975193 969689 943414 957346 974134 977575 986903 980985 990964 1007216 978786 982641 991254 993161
8430 993161 1019905 1047658 1086083 1084391 1086864 1118973 1124174 1098347 1078704 1058030 1062698 1062665 1079914
8417 1079914 1103793 1161687 1147553 1112863 1077323 1072464 1096729 1136230 1166908 1165451 1169777 1179921
8405 1179921 1179420 1150513 1140197 1146625 1155652 1133950 1134053 1172107 1196957 1200891 1162308 1172448 1167012
8392 1167012 1144418 1166059 1185756 1148053 1162588 1220585 1240233 1200401 1210591 1214110 1204968 1221678
8380 1221678 1261641 1292052 1300013 1291128 1300598 1325860 1331610 1319849 1280003 1303789 1303010 1346882 1355729
8367 1355729 1324490 1296327 1314422 1334452 1334891 1366316 1398377 1414464 1401016 1377947 1387747 1379364
8355A379364l3891R302M731j6908k4739K2747P9445L2564l5628N713L7918J4106
8343A474724K8619P104J9689L4587j7977j5527n5676k5741J9534K3917K9284L9986
8331A562523J7911m926j5998K2647J7917j7270p311O306O2038m333L3275J9659
8319A692438L1440N638l6900n719L1486L3294K883J2541J1612K8850M9193n96
8307A856160k2336L3517j2014m6022J0116L0751L6152L3996m3003k8824L3518
8296A882011L8584R084j8698k039J7064L2117J3611M990K4496q257j3817K8335
8284B007481O7542L2811L8351j1527k8515M980K9810p307m2907K9862L3856K2684
8272B177121K8170p39J0552K7925J6970L0399J2378m467P941Q178L4207m064K1037
$$ plain form
8355 1379364 1345473 1354775 1359506 1342598 1317859 1340606 1420051 1452615 1416987 1422700 1460618 1474724
8343 1474724 1503343 1510447 1530136 1564723 1546746 1531219 1475543 1449802 1469336 1493253 1522537 1562523
8331 1562523 1580434 1575508 1559510 1582157 1600074 1582804 1575493 1581799 1643837 1639504 1672779 1692438
8319 1692438 1723878 1729516 1692616 1686897 1718383 1751677 1754560 1767101 1778713 1807563 1856756 1856160
8307 1856160 1833824 1867341 1855327 1809305 1819421 1850172 1886324 1920320 1877317 1848493 1882011
8296 1882011 1920595 1929679 1910981 1908942 1926006 1958123 1971734 1976724 2001220 1992963 1979146 2007481
8284 2007481 2075023 2107834 2146185 2134658 2106143 2111123 2140933 2133626 2090719 2120581 2154437 2177121
8272 2177121 2205291 2204552 2215104 2243029 2259999 2290398 2302776 2298309 2306250 2314428 2348635 2344571 2365608
8259B365608M5491N7382K6142R00J758O64j1173K5121N0646L0625j664j1352q203
8246B571945K8828q5M1927K5643K440J1660K7942L0729K3889K9358J5503M3614
8234B853393J0626L1777J5261L3418L7284P3498N1739l1358q5696J2680M3815
8223C046437L8335L7784K2478j1801R291J6680M9984M2543k6101q36N542M2437
8211C272773N3476J1654K1317N0301O2094P1613K9833K0937L7348R605o427K0870
8199C655394j3228M6518Q9836M6599K2786m066K7129J6045J8787Q8282N8671P6168
8187D128921M9029L1233K5257J5769J4500N7385N9711J1997J1958P1799O772M6770
8175D531101L4515K4183q85K4958J07365O6536M8486K5962O1709J5633J3267P1827
$$ plain form
8259 2365608 2411099 2468481 2494623 2495523 2497281 2497945 2486772 2511893 2562539 2593164 2591500 2580148 2571945
8246 2571945 2600773 2600688 2642615 2668258 2670698 2682358 2710300 2741029 2764918 2794276 2809779 2853393
8234 2853393 2864019 2895796 2911057 2944475 2981759 3055257 3106996 3075638 2989942 3002622 3046437
8223 3046437 3084772 3122556 3145034 3133233 3142524 3159204 3209188 3251731 3225630 3224794 3230336 3272773
8211 3272773 3326249 3337903 3359220 3409521 3471615 3543228 3573061 3593998 3631346 3640951 3634524 3655394
8199 3655394 3642166 3688684 3778520 3825119 3847905 3843839 3870968 3887013 3905800 3994082 4052753 4128921
8187 4128921 4177950 4209183 4234440 4250209 4264709 4322094 4381805 4393802 4405760 4477559 4484331 4531101
8175 4531101 4565616 4589799 4588914 4613872 4721237 4787773 4836259 4862221 4923930 4939563 4952830 5024657
8163E024657N0515L1299L2386M5166R5601M6402M0116P6396J17894N9060L3748
8152E653240K0370O1436O4387N2345L5082O4972R2747N5185O5873O1348O0293
8141F287278O6626O2321R0562R5498Q3409L6296P0078O7586P2664N8999O3870
8130G055187O6964Q0591P3173O3152R6256J05893O1395P5406O5326J11864Q9113
8119G944320R3533J23153J16471J12389O7994M5395O4211J41249J08022J11650
8109H928387Q5122O4400J29237J41258J18216P6577J8779N9965J53992J58224
8099I934157R7934Q2516J58580J70501J13134Q5730J03362J04647Q8011J03954
8089A1042526J27410J56540J24403J36603J50986R7699R6441J63818J79530J37660
$$ plain form
8163 5024657 5075172 5106471 5138857 5184023 5279624 5326026 5366142 5442538 5560432 5619492 5653240
8152 5653240 5673610 5735046 5799433 5851778 5886860 5951832 6044579 6099764 6165637 6226985 6287278
8141 6287278 6353904 6416225 6506787 6602285 6685694 6721990 6792068 6859654 6932318 6991317 7055187
8130 7055187 7122151 7202742 7275915 7339067 7435323 7541216 7602611 7678017 7743343 7855207 7944320
8119 7944320 8037853 8161006 8277477 8389866 8457860 8503255 8567466 8708715 8816737 8928387
8109 8928387 9013509 9077909 9207146 9348404 9466620 9543197 9561976 9621941 9775933 9934157
8099 9934157 10032091 10114607 10273187 10443688 10556822 10642552 10745914 10850561 10938572 11042526
8089 11042526 11169936 11326476 11450879 11587482 11738468 11836167 11932608 12096426 12275956 12413616
8079A2413616J32294J22184J55825J47116J28377J00515J12113J32799J46997
8070A3591836J59054J50041J39527J20318J67288J54339J77637J41760J06810
8061A4908610R7377J08471J74206J37782J01334J42899J43444J59813J35375J21800
8051A6231111R5394R7110J20100J23973J35754J45808J71367J04107N1855P9801
8041A7356380J04733N9181J16216R0136O0653P6403Q3344P2850J01209Q4312M9392
8030A8254809L6145K7641R7164N1904L3389L4292L7582O5166K6385M608j0589
8019A8658496k1381R16L8773o099j9116l9391l4028o5350k3451l1305l7221j09004
8007A8311839j30586n5241j06353p9890k2759r8178j34969r4689q7367r3238j19144
$$ plain form
8079 12413616 12545910 12668094 12823919 12971035 13099412 13199927 13312040 13444839 13591836
8070 13591836 13750890 13900931 14040458 14160776 14328064 14482403 14660040 14801800 14908610
8061 14908610 15005987 15114458 15288664 15426446 15527780 15670679 15814123 15973936 16109311 16231111
8051 16231111 16326505 16423615 16543715 16667688 16803442 16949250 17120617 17224724 17276579 17356380
8041 17356380 17461113 17520294 17636510 17726646 17787299 17863702 17947046 18019896 18121105 18205417 18254809
8030 18254809 18290954 18318595 18415759 18467663 18501052 18535344 18572926 18638092 18664477 18669085 18658496
8019 18658496 18637115 18638031 18676804 18670705 18651589 18612198 18578170 18512820 18489369 18458064 18420843 18311839
8007 18311839 18181253 18126012 18019659 17939769 17917010 17818832 17683863 17589174 17501807 17408569 17289425
7996A7289425r8820j09793j12808j05130j05692j17055j11434j57362j30666j34000
7986A6106665j37372j86608j57015j06867j19251j04826j34869j31110j33727
7977A4895020j32866j37520j47437j75047j86987j58079j50094j66305j34408
7968A3506277j05911j57057j80208k01861j43340j35461j14516j38905j28539
7959A2200479j94994j12422j43522j81256j63633j31496j06494j33964j34827
7950A0897871j18658j47600j20357j28565j34365j40060j44759j30929j15781
7941I716797j20125j15381j22719j21158r8992j14510j18636j12941j16230r0850
7931H585255q7918j74174j17922r1187r6716r7488n5124p6143j14146j15902q7453
$$ plain form
7996 17289425 17190605 17080812 16968004 16862874 16757182 16640127 16528693 16371331 16240665 16106665
7986 16106665 15969293 15782685 15625670 15518803 15399552 15294726 15159857 15028747 14895020
7977 14895020 14762154 14624634 14477197 14302150 14115163 13957084 13806990 13640685 13506277
7968 13506277 13400366 13243309 13063101 12861240 12717900 12582439 12467923 12329018 12200479
7959 12200479 12005485 11893063 11749541 11568285 11404652 11273156 11166662 11032698 10897871
7950 10897871 10779213 10631613 10511256 10382691 10248326 10108266 9963507 9832578 9716797
7941 9716797 9596672 9481291 9358572 9237414 9138422 9023912 8905276 8792335 8676105 8585255
7931 8585255 8497337 8323163 8205241 8114054 8017338 7919850 7864726 7788583 7674437 7558535 7471082
7920G471082j04718r6518r4863o3173p6569r9849r0698q4593r8424l5223n4064
7909F572390r4497j07632r9798r2711r9631o6157m5664j04871q8205n7170k3543
7898E692511m4589n3053n4524q1868r5646n4514j38132j02184k5755k7631k6514
7887D988101o6292k8719k5415p6049r0791n4459l7683q9020m5705j8335j9913
7876D435720k1417o9505o9036o9856o3151m5961q1045m2730m1074p6273m4927
7865C810745j670j2526o8334m4251k5883m4339o1035o8896j0804m7580m7503q389
7853C369535q596o6845l0951k0192N845J2627o891n4860p4158m3908l2679j1847
7841C037080j6480m3226p7901o2600l1426j6425j8850o1660p2314Q53j1969j1008
$$ plain form
7920 7471082 7366364 7269846 7174983 7111810 7035241 6935392 6844694 6760101 6661677 6626454 6572390
7909 6572390 6477893 6370261 6270463 6177752 6078121 6011964 5966300 5861429 5773224 5716054 5692511
7898 5692511 5647922 5594869 5540345 5458477 5362831 5308317 5170185 5068001 5042246 5014615 4988101
7887 4988101 4921809 4893090 4867675 4791626 4700835 4646376 4608693 4519673 4473968 4455633 4435720
7876 4435720 4414303 4344798 4275762 4205906 4142755 4096794 4015749 3973019 3931945 3855672 3810745
7865 3810745 3809075 3796549 3728215 3683964 3658081 3613742 3552707 3483811 3473007 3425427 3377924 3369535
7853 3369535 3360939 3294094 3263143 3242951 3248796 3261423 3254532 3199672 3125514 3081606 3048927 3037080
7841 3037080 3020600 2977374 2899473 2836873 2805447 2789022 2770172 2708512 2636198 2637051 2625082 2614074
7829B614074M1521k743k4618m0130l9815m2903k1561j3944j8635l3192k8824q465
7817B380765m1339n9629k0792k5319J3803q037k8508k8387k179k2274n8973l4373
7805B064758K0348K390j4622p3566o8911j5702M6960J3157l2828m920J1911k4767
7793A924208m8436k6127J4109M785k0559k1164l2081o682j0809l0833l1119j6773
7781A698519p014q383k7030m6877k1421j9802k1107J2204R181k141N57o953m4315
7768A515418m9981j6559K015L261k3529j232R958o859l1853o3525k3655K0308
7756A333767J4169j3265r788l4479j3899j618j0222m880K6657L9557j5811k4579
7744A285609k6662m1383l246j1081j7775J717O650Q170j7996r149j154j1989l9124
$$ plain form
7829 2614074 2655595 2652852 2628234 2588104 2548289 2505386 2483825 2469881 2451246 2418054 2389230 2380765
7817 2380765 2339426 2279797 2259005 2233686 2247489 2239452 2210944 2182557 2180378 2158104 2099131 2064758
7805 2064758 2085106 2087496 2072874 1999308 1930397 1914695 1961655 1974812 1941984 1937064 1948975 1924208
7793 1924208 1875772 1849645 1863754 1868539 1847980 1826816 1794735 1788053 1777244 1746411 1715292 1698519
7781 1698519 1691505 1683122 1656092 1609215 1587794 1567992 1546885 1559089 1568270 1566129 1566686 1559733 1515418
7768 1515418 1465437 1448878 1450893 1454154 1430625 1429393 1439351 1432492 1400639 1337114 1313459 1333767
7756 1333767 1347936 1334671 1324883 1290404 1276505 1274887 1264665 1259785 1286442 1325999 1310188 1285609
7744 1285609 1258947 1217564 1214318 1203237 1185462 1187179 1193829 1201999 1184003 1174854 1173700 1161711 1122587
7731A122587o316m522k3452m461l1339k9999J5685M8586L609o4647j6808J3402
7719A022325J7780q26j0330n1273n7641n1191N807J9744L7582J739k7294J2052
7707I18474n595l0821l6741J1340N941q314m2346L673L1759m353L5448J404J6265
7694H96134K843J1467J645m8790m228K403j7772l6445M632K8249J0924m1515l6216
7681G73331J7183j5670J9892j1069J1699N604k2917j2671l4615m9731n4019M163
7669F31180K8943K2297K4811L6922o108l7917K964r540j486Q264L0737j2486k1036
7656F97545l9664k6276M916J1410O576m2104j5754J0295Q958R959k2397o6835
7644E36629k8696m43J2485j1986J6042K8518k5939j3678M3992O904k4408O39j302
$$ plain form
7731 1122587 1116271 1111749 1088297 1083836 1052497 1022498 1038183 1086769 1090378 1025731 1008923 1022325
7719 1022325 1040105 1039279 1028949 977676 920035 868844 874651 894395 931977 933716 906422 918474
7707 918474 912879 882058 845317 856657 862598 854284 811938 815611 847370 843017 878465 879869 896134
7694 896134 898977 910444 912089 863299 859071 861474 843702 807257 811889 840138 851062 809547 773331
7681 773331 790514 774844 794736 783667 795366 800970 778053 765382 730767 681036 627017 631180
7669 631180 660123 682420 707231 744153 738045 700128 703092 693552 692066 700330 731067 718581 697545
7656 697545 657881 631605 636521 647931 654507 612403 596649 606944 615902 625861 603464 536629
7644 536629 507933 507490 519975 507989 524031 552549 526610 512932 556924 563828 539420 540059 538757
7631E38757L39j5499O99M4454J1915j4186r358K4724j4969l3062k2638m9752j5515
7618D45909L5724K6961K2507n71m1291J0448k0997J2181J3211J9636J658m5998
7606D79378k0781O194K6488j703r14l548Q194k4561p627j2222n434L320j8914
7593D27870Q832K4601Q735l2778r712j3729j9085j8098M5377J7744O928n7989
7581C88696m9846o632L433K8339J9754J2013r127k5886k5379L5778N1683J518
7569D24344l4994j4074k2170R390P364K1697o379j8973l4025K7443K6088l3820
7557C51891k0576O0098J9459p875j545O246j1566j4746q172l8576j5288L0305
7545C49655P189l3643k7265j7029k3456j2587M901J2124K4162Q518l9380J9885
$$ plain form
7631 538757 539096 523597 524296 568750 580665 566479 557121 581845 566876 533814 511176 461424 445909
7618 445909 481633 508594 531101 530530 489239 499687 478690 490871 504082 523718 525376 479378
7606 479378 458597 464791 491279 489576 488662 485114 493308 468747 461120 448898 443464 446784 427870
7593 427870 436702 461303 470038 437260 427548 413819 394734 376636 422013 439757 446685 388696
7581 388696 338850 332218 335651 363990 383744 395757 386630 360744 335365 371143 422826 424344
7569 424344 389350 375276 353106 362496 369860 391557 385178 366205 332180 359623 385711 351891
7557 351891 331315 391413 410872 402997 401452 407698 396132 381386 373214 334638 319350 349655
7545 349655 356844 323201 295936 278907 255451 242864 247765 259889 284051 292569 253189 273074
7533B73074J2641L102j8858J2366K535R546P319L6314K3863k0256k0423P917q471
7520C20669L520l6460j7389n609K7320K5184l1966m2918L937N6778Q678m13j098
7507C10233j3112K1316R993k8224m9965K891j5233K2981K7931K320m2234j6725
7495B32172k0890l0137L4000L2989k263k3215k0296k2954J3546J1531k2721J0167
7483A91929K2135P007j8020j2401L6815k104p454K4829Q178R994m516k3041j8272
7470B15079k4043j3286K2706p38l1106j1477M0609M4148J375l9408l06Q892K236
7457B14681K967N500Q293J0856L1761K7491K151k6976l456N661j3879o5116n2298
7444A47636r057J6218O585j8679J7596j0446k4718J6737L3657K3058j5585R719
$$ plain form
7533 273074 285715 288817 269959 282325 284860 294406 301725 338039 361902 341646 321223 329140 320669
7520 320669 324189 287729 270340 264731 292051 317235 285269 242351 246288 303066 311744 311331 310233
7507 310233 297121 318437 328430 300206 250241 253132 237899 260880 288811 291131 248897 232172
7495 232172 211282 181145 215145 248134 245871 222656 202360 179406 192952 204483 181762 191929
7483 191929 214064 221071 203051 190650 227465 225361 217907 242736 250914 260908 256392 233351 215079
7470 215079 191036 177750 200456 199718 168612 157135 197744 241892 243267 203859 203553 212445 214681
7457 214681 217648 223148 231441 242297 274058 301549 303700 276724 273268 278929 265050 199934 147636
7444 147636 138579 154797 161382 142703 160299 149853 125135 141872 175529 198587 183002 192721
7432A92721K5725k505m260J9003K5235L2049j3336l1626n9924m9882j3353l871
7420A15976O525j4306o707J4373K2236j8379P730J5999L5675L0655j0665k5543
7408A73569k1004L4541J5073j5445m193J5742j5609k329j0212k6485k4436K2046
7396A41258J3436R641Q100o342j3295m593L853L5187j8233k9027J7653j6448P458
7383A48648k2423p245j3984J9123M6095n014j743k6306j8484J8175l8772j4299
7371H3771n744J206L9486N0355J1426j7241J0319l019l0111q96q966k3287L4275
7358A41574j1536j7585j8426q336l3099N843O183J5295K9858J8572O3215o283
7346A85275j1688k2960j6578k6647j2824K3348j351j0114j557j049R653J9225
$$ plain form
7432 192721 218446 215941 211681 230684 255919 287968 274632 243006 183082 133200 119847 115976
7420 115976 122501 108195 101488 115861 138097 119718 127448 143447 179122 209777 199112 173569
7408 173569 152565 187106 202179 186734 182541 198283 182674 180345 170133 143648 119212 141258
7396 141258 154694 164335 172435 166093 152798 148205 152058 187245 169012 139985 157638 141190 148648
7383 148648 126225 118980 104996 124119 170214 165200 163457 137151 118667 136842 98070 83771
7371 83771 78027 79233 118719 169074 180500 163259 173578 170559 140448 139552 130586 107299 141574
7358 141574 130038 112453 94027 85691 52592 58435 64618 79913 109771 128343 191558 185275
7346 185275 173587 150627 134049 107402 94578 117926 116575 106461 104904 103855 113508 132733
7334A32733j5964j8636K3553L938m8089j1189k4534K7779J4586j3711K1495P9965
7322A71926J3843j1754k9455o9756j0509J4298J7576q392m2368L1779M7859l637
7310A21410j5022k5510j5490N2279J4185L5660j0879n7001k0204m557J5044j4958
7298G4957J3413k9381l5537K901O1757J2971l3651k051J411r466j1180J630K0860
7285F8634J9078n468K641L7755J1415l9121L291J1114k4056J1572j6804k8095
7273E1956J6542J0313J0401J2018l2091k6505J3523J5882Q998J6234K7096l7426
7261H6941j8840l3987m290L5164P685j7774j0335J4488L482K3644J3796j3163
7249H6811j8680L8951O750j9767p483o432j5689j1979k6204M103l946P00L6908
$$ plain form
7334 132733 116769 98133 121686 125624 77535 66346 41812 69591 84177 70466 91961 171926
7322 171926 185769 174015 144560 74804 64295 78593 96169 87777 45409 77188 125047 121410
7310 121410 106388 80878 65388 117667 131852 167512 156633 99632 79428 74871 89915 74957
7298 74957 88370 58989 23452 26353 88110 101081 67430 65379 66790 57324 46144 47774 68634
7285 68634 87712 82244 84885 122640 134055 94934 98225 109339 85283 96855 80051 51956
7273 51956 68498 78811 89212 101230 69139 42634 56157 72039 81037 97271 124367 86941
7261 86941 68101 34114 29824 64988 72673 54899 44564 59052 62534 86178 99974 86811
7249 86811 68131 107082 113832 94065 86582 80150 64461 52482 26278 30381 26435 27135 64043
7236F4043L827p592j1920K3381j715l0374k0517L9026p058k0103J0035L0016M0281
7223A11330k847j6033J9700r441o768k2976j528q569o7229K4074L2718j9869j4761
7210A7801j765n1404K1109M1534K2542M440J1737M988J4939j1370j5877O937N263
7197G0874l726J0275l1526m3883M367M9077L1289r092l2395j3973P593O834q522
7184C7192k7143O501J4316J9470O591K2457J6659K6046l8938j2552l4778O467
7172D2288N756j2715K4836k5228k0620q856p943J7250Q947m1432n705M81J4967
7159g974K2727m818J3465J8938K2218k1292N865j4245l9134p662K2146j4549k7125
7146c1440J0559K3063R68j1868M692L6658J656J3459K9470N754m3977m4873Q815
$$ plain form
7236 64043 67870 60278 48358 71739 70024 39650 19133 58159 51101 30998 41033 71049 111330
7223 111330 108483 92450 112150 102709 95941 72965 71437 62868 -4361 19713 52431 32562 17801
7210 17801 16036 -35368 -14259 27275 49817 54257 65994 70982 85921 74551 58674 65611 70874
7197 70874 67148 77423 45897 2014 6381 55458 86747 77655 45260 31287 38880 45714 37192
7184 37192 10049 16550 30866 50336 56927 79384 96043 122089 83151 70599 35821 42288
7172 42288 48044 35329 60165 34937 14317 5461 -2482 14768 23715 -17717 -23422 -22941 -7974
7159 -7974 14753 9935 23400 42338 64556 43264 49129 34884 -4250 -11912 10234 -4315 -31440
7146 -31440 -20881 2182 3150 -8718 -4026 32632 34288 47747 77217 82971 38994 -5879 2936
7133B936M2040N71P521m421L4224O455q584l0758k7979L72O57R162J1758p62O03
7118D3795k8413m312J7264l6052J6275L496J4190K2041J5541J9825K4797L0405
7106A38852n700l8944j4394j0897q864j3208O430j0273l3243j6171M2969J4903
7094E1460n132j24o454j2479K3826P087k6227k6391J3447J8274O130r539m97M082
7080C7463J625K3447j1191l3624j044J0333K4372j0406j7209j3260l0462k6391
7068d6347j655J6047K2476K687J0463J1409M8490K1490J0451j6639l2337l946
7056D2589J3761K5831n986m7926j0485L2604L138j2272j209k710J4318K8085j4440
7043F5298r411J1620J2407j6668l6385j4129K941k7628k5250J1124K115K3623
$$ plain form
7133 2936 44976 45547 53068 48647 82871 89326 80742 49984 22005 22377 23034 32196 43954 43192 43795
7118 43795 15382 11070 28334 -7718 8557 12053 26243 48284 63825 83650 108447 138852
7106 138852 133152 94208 79814 68917 60053 46845 53275 43002 9759 -6412 36557 51460
7094 51460 46328 46204 39750 27271 51097 58184 31957 5566 19013 37287 43417 33878 33381 37463
7080 37463 39088 62535 51344 17720 16676 27009 51381 40975 23766 10506 -19956 -46347
7068 -46347 -48002 -31955 -9479 -6792 3671 15080 63570 85060 95511 78872 46535 42589
7056 42589 56350 82181 76195 28269 17784 50388 53526 41254 40045 37335 51653 79738 65298
7043 65298 55887 67507 79914 63246 26861 12732 15673 -11955 -37205 -26081 -23966 -343
7031c43K5401j5275n611j7130k4214J35N571M1976N0516J1701k6162k5832k980
7018A7753Q914l0127k9589J0164Q79Q792k374l898M141m772k2076k2890J0646
7005e4437K8049M8715L1381J0183j7952m0706O250J923j1755J0163K2599L0500
6993F4913o48j5805k3173k4336k9776r142L821N635k0426n988N4548l437k7666
6980c1480k2542J1440J8754N5129L8384J5696o265l2710L776K544j1n770k9150
6967A7795j0543J1435p829j3501j3741j0738K5735K8194J4822k375j770k297O234
6954D1421P258l0276J8590n83k9333l6518k3485j7014K009N591M8718m048l2435
6941e0105k21J6768J8698p983k9023M0974J9736Q885P753N029l1332k7786O148
$$ plain form
7031 -343 25058 9783 4172 -12958 -37172 -37037 -31466 10510 61026 72727 46565 20733 17753
7018 17753 26667 -3460 -33049 -22885 -22006 -13214 -15588 -19486 -15345 -20117 -42193 -65083 -54437
7005 -54437 -26388 22327 53708 63891 45939 5233 11483 13406 1651 11814 34413 64913
6993 64913 64265 48460 25287 951 -28825 -37967 -34146 -28511 -48937 -54925 -377 -3814 -31480
6980 -31480 -54022 -42582 -23828 31301 69685 85381 79116 46406 50182 52726 52715 46945 17795
6967 17795 7252 18687 10858 -2643 -16384 -27122 -1387 26807 41629 39254 37484 35187 41421
6954 41421 48679 18403 36993 36410 7077 -29441 -52926 -69940 -67931 -62340 -13622 -17670 -50105
6941 -50105 -50326 -33558 -14860 -22843 -51866 -10892 8844 17729 25482 30511 -821 -28607 -22459
6928b2459L241l0888K3789J4627k0162K5472K3755j9661j8787k0175j9513P651
6916e3110J7512J9972J4597K7882l563k6928m426l402K2755n339k6372N196L0088
6903A4862K7994K6971K5242j5783l2736k8892l1594q049L0004J6365j1066J3518
6891B6836J5598J9044Q898p576l7116L5494L0257k3733N239m06o374m7744o0804
6878d2387R23J7622L0342j2314j9676J8163L7058l8200k4209l45o915O289L3474
6865a75K3207k1332N674L1512K3105l045p359J805M498J761j4760j7274k6114
6852A503m3823l154J970J3107K3264J2111L705n5754k1100L5249J9405l057K3723
6839G149K5731K61J0865o850K2459J1879J1383J5255m3039k9877r780J3284j5806
$$ plain form
6928 -22459 -19218 -50106 -26317 -11690 -31852 -6380 17375 -2286 -21073 -41248 -60761 -53110
6916 -53110 -35598 -15626 -1029 26853 23290 -3638 -8064 -11466 11289 5950 -20422 -15226 14862
6903 14862 42856 69827 95069 79286 46550 17658 -13936 -21985 8019 24384 13318 26836
6891 26836 42434 61478 70376 62800 25684 61178 91435 67702 72941 72535 66161 18417 -42387
6878 -42387 -41464 -23842 6500 -5814 -25490 -7327 29731 -8469 -32678 -33023 -39938 -33649 -175
6865 -175 23032 1700 7374 38886 61991 58946 51587 53392 57890 59651 44891 27617 1503
6852 1503 -42320 -45474 -43504 -30397 -7133 4978 8683 -47071 -68171 -32922 -13517 -16574 7149
6839 7149 32880 33141 44006 37156 59615 71494 82877 98132 55093 25216 15436 28720 12914
6826A2914j3624j0553k5348M948K0149m3488k9056L76j1348J0269M6458J7498
6814b0805K764M3977L3582j0287k7787L3770K0067n6655m795k3206j7231k7621
6802e4227k3450M9610K9253K2808j093J350L1749j8087p155K0379L4581j9203
6790F6515k1806k2519k0069k9262J806M474k1455j4130N1012Q497J29l3989j5958
6777d6755L4552J3313n2931l839J9449K2649Q346K6554K3262J657n1933l2087
6765c7763J003R463K5601N283j9317j2040L133K0519p19k2389K8657L265m8471
6752d3775K9733L9479K185n0946J5125J0903M0520K0641k0851n3819j1087J0560
6740a1332K7175K1721K796q992k717l331k1295J9097J6576l4531J5262O063J0394
$$ plain form
6826 12914 -710 -11263 -36611 -31663 -11514 -55002 -84058 -83682 -95030 -84761 -38303 -20805
6814 -20805 -18041 25936 59518 49231 21444 55214 75281 18626 13831 -9375 -26606 -54227
6802 -54227 -77677 -28067 1186 23994 22901 24251 56000 37913 30758 51137 85718 66515
6790 66515 44709 22190 2121 -27141 -25335 -20861 -42316 -56446 -5434 3063 3192 -30797 -46755
6777 -46755 -12203 1110 -51821 -55660 -36211 -13562 -5216 21338 44600 46257 -5676 -37763
6765 -37763 -36760 -27297 -1696 3587 -15730 -27770 -24637 -4118 -4837 -27226 1431 4696 -43775
6752 -43775 -14042 25437 27622 -23324 -8199 2704 43224 63865 43014 -10805 -21892 -11332
6740 -11332 15843 37564 40360 31368 28651 25320 4025 23122 39698 5167 20429 26492 36886
6727C6886J1194m8856k2263J0791k7297m246k8529R297k147K8928J6568k6744
6715d6418j2066J8049N8526J8982j3712q968k0239J1676J1615k1358L034L0572
6703B9693O768k7554P708m100m7329K7716K9807l9940k6681J1733p214j2462J7186
6690c4669o981k8412o848K1642J3331j13J0886m827j839O52J6530k6214K2825
6677b4037K1221q762K0250L8333Q85j383J20K8285m3013o528k6912j788J6858
6664A3529K906n1459j3245N3346L0572r404k2403k3547l8752j9306j3912M215
6652h7460L4762p048L4875K9797l215N622Q791L2452J0140l2967j3715k2996J9525
6639H563K6546J5669j1831k8303k4512N463M793J6275R4N154m8065J0145L0796
$$ plain form
6727 36886 48080 -776 -23039 -12248 -39545 -43791 -72320 -63023 -65170 -36242 -19674 -46418
6715 -46418 -58484 -40435 18091 37073 23361 14393 -5846 5830 17445 -3913 -879 29693
6703 29693 36461 8907 16615 12515 -34814 -7098 22709 -17231 -43912 -32179 -39393 -51855 -34669
6690 -34669 -41650 -70062 -76910 -55268 -41937 -42050 -31164 -35991 -37830 -37178 -20648 -46862 -24037
6677 -24037 -2816 -11578 8672 47005 47890 46507 46627 74912 31899 25371 -1541 -3329 13529
6664 13529 16435 -35024 -48269 5077 35649 26245 3842 -19705 -58457 -77763 -91675 -87460
6652 -87460 -52698 -59746 -24871 4926 1711 7333 16124 48576 58716 25749 12034 -10962 8563
6639 8563 35109 50778 38947 10644 -13868 -8405 -3612 12663 12757 17911 -30154 -20009 10787
6626A0787j6625r907k2403J2122L6030m226k6085r04J3235J7731r055l557K918
6613F1L734j8816k4122J3260l821k4942K6439M3676K702P27j389l2771J6210J4526
6599A5474j9450k7937O454J1441j0661l900j1876J9116J6202j0115m4164k629
6587f2045k6688L465P2815L2795l9344j1611k806J4473j3875l2405J6835j1231
6575e9622J3810M0069M0885J3836l5106m8171l8336M4171P80j3253R493p747K1626
6562a7565M1684j3212m5923K291J4683j3649R192p231J4529k8989j1906K8823
6550b7273K2806J787l4475m7658k5011J1501K6272J5343J3229J3133m9364j1598
6538i1308O3250K5500o489L296L521K3770k1615J7831O3742l1307o9232k3660
$$ plain form
6626 10787 -5838 -15745 -38148 -26026 10004 5778 -20307 -21211 -7976 9755 700 -2857 61
6613 61 3795 -15021 -39143 -25883 -29704 -54646 -28207 15469 18171 18898 17509 -15262 948 15474
6599 15474 -3976 -31913 -25459 -14018 -24679 -28579 -40455 -21339 -5137 -15252 -59416 -62045
6587 -62045 -88733 -85268 -12453 20342 -19002 -30613 -33419 -18946 -32821 -65226 -48391 -59622
6575 -59622 -45812 -5743 35142 48978 13872 -34299 -72635 -28464 -27684 -40937 -31444 -39191 -17565
6562 -17565 24119 10907 -35016 -32725 -18042 -31691 -22499 -29730 -15201 -44190 -56096 -27273
6550 -27273 -4467 -2680 -37155 -84813 -109824 -98323 -72051 -56708 -43479 -30346 -79710 -91308
6538 -91308 -28058 -2558 -9047 -5751 -2230 21540 -75 17756 81498 50191 -19041 -42701
6526d2701K9569P836k1221M0628j6150l9671k2715j2068J6623J8685J3789L1385
6514C989R396pJ0756N4k679J3381k5765J2176k1978R226K6079Q789n7724j8637
6500c2944n15k3893k3430j440K1908J9928J2750K0748J5741K2089K878O471k5965
6487A4326n332l7122j1838K4806l941l0746K8663K3124l0285j9181K9043M156
6475a4327q869J3502k819k3156J4802K2785N101R731l4812j1109j334K6840L9332
6462C5667J1940o1148n600N2429l8194j8846J2390O097J3499j7954L8889L9153
6450F8322m2803R77m5233n7854j5781m541Q227J775J4622N0963J289j6193M410
6437c1820O627j2941l8380n686L3097M2425k5384M102L7522M7766N968l4632q524
$$ plain form
6526 -42701 -13132 -5296 -26517 14111 -2039 -41710 -64425 -76493 -59870 -41185 -27396 3989
6514 3989 13385 13378 24134 24188 21509 34890 9125 21301 -677 8549 34628 43417 -14307 -32944
6500 -32944 -33459 -57352 -80782 -82222 -60314 -40386 -27636 -6888 8853 30942 33820 40291 14326
6487 14326 8994 -28128 -39966 -15160 -19101 -49847 -21184 1940 -28345 -47526 -18483 -14327
6475 -14327 -23196 -9694 -12513 -35669 -20867 1918 7019 16750 -18062 -29171 -30505 -3665 35667
6462 35667 47607 -13541 -19141 33288 -4906 -23752 -11362 -5265 8234 -9720 29169 68322
6450 68322 25519 26496 -18737 -76591 -92372 -96913 -88686 -86911 -72289 -21326 -20037 -36230 -31820
6437 -31820 -25193 -38134 -76514 -82200 -49103 -6678 -32062 -27960 9562 57328 63296 28664 20140
6424B0140K2235j8720k0571n2793k0071M4447J5057j0312k1455K287N5449J7257
6412C2950l9618q740R814M661N757N284l9893l0267O487K7763K095m870k784r348
6398d0709j7862R015L9198K376p336J030K6336K051j5595k3267K3168j5831l2367
6385d9793l9518J3939J4141j5514n154P915J4111N8104J0129J4850Q898j0167
6373B1941q928K0036k4541r910o46n4980p826n437L3226J5313k2523N406o327
6360d5196q809J7107p781m5843j8214P490L5036K7801J4218P156k9834j1542Q739
6347d9672L3874P103K7810R337j4352j5212L7852J0219K416p088j0139j3436K0875
6334C9587K4486O900l6854l3536k587p999l0294J3210N0682L1960j668l8277l0265
$$ plain form
6424 20140 42375 23655 3084 -49709 -69780 -25333 -10276 -20588 -42043 -39756 15693 32950
6412 32950 -6668 -15408 -5594 -933 4824 10108 -29785 -60052 -53565 -25802 -23707 -28577 -31361 -40709
6398 -40709 -58571 -49556 -10358 -7982 -15318 -14288 12048 14099 -1496 -24763 -1595 -17426 -49793
6385 -49793 -89311 -75372 -61231 -76745 -81899 -73984 -59873 -1769 8360 23210 32108 21941
6373 21941 13013 33049 8508 -1402 -2048 -57028 -64854 -70291 -37065 -21752 -44275 -38869 -45196
6360 -45196 -54005 -36898 -44679 -90522 -108736 -101246 -66210 -38409 -24191 -17035 -46869 -58411 -49672
6347 -49672 -15798 -8695 19115 28452 14100 -1112 36740 46959 49375 42287 32148 18712 39587
6334 39587 64073 70973 34119 583 -2004 -10003 -40297 -27087 23595 55555 53887 15610 -14655
6321a4655J6555n743J9321J7659j7239k9687j6884K881N39j5q851L48j6496K2823
6307b9444P018J4271L0498k6601k4979L2006K4076K2854l5943j9756O312j1239
6295a0927J9092K8917J2407l4051j1161O176L510k3740k9790K9920Q876J3190
6283A2419l0805n812K1293r0l8151o63K4824K0412j9571k1443K396k064m528R551
6269c2232k1450O988M0804J0927p744j4902R174P986N2464J6343l5138R756K0772
6256F3748k6704j685j60M666l599K3914j6066l2214m9981J1953l2407K8796J5437
6243a4302j4321k3810J9598N2484r031l7547q419j7318K4218m297j4866R618N674
6230c2319j954K4281k7676j0424L8296M7260j6393o504L5145k1241r6186j0732
$$ plain form
6321 -14655 1900 -3843 15478 33137 15898 -13789 -30673 -27792 -27253 -27268 -36119 -35771 -52267 -29444
6307 -29444 -22426 -8155 22343 -4258 -29237 2769 26845 49699 13756 -6000 312 -10927
6295 -10927 8165 37082 49489 15438 4277 10453 13963 -9777 -39567 -9647 -771 12419
6283 12419 -18386 -24198 -2905 -2995 -41146 -41809 -16985 3427 -16144 -37587 -35191 -37255 -41783 -32232
6269 -32232 -53682 -46694 -5890 5037 -2707 -17609 -8435 -449 52015 68358 33220 42976 63748
6256 63748 37044 35359 35199 39865 36266 60180 44114 11900 -38081 -26128 -58535 -29739 -14302
6243 -14302 -28623 -52433 -32835 19649 10618 -26929 -35348 -52666 -28448 -32745 -47611 -37993 -32319
6230 -32319 -34273 -9992 -37668 -48092 -9796 37464 21071 14567 49712 28471 -67715 -78447
6218g8447J5654K3882M461n731L6449J4683J4565Q857J987J470o671j1176K4273
6205D4256k3557j7524k6114k923J0369j4071l0231J9564J8592P524Q5k7167l9539
6192h0736L2270M0388l3974m011J1515L4612N50l1458J7212K0080j0597N851J3149
6179A4851m2218l5777Q154J8130K5728J2842o91l0226k4842m733l778K9421N1109
6166A7970p44P596l328j0169J53j3006q229J1905J2081P076m020K3295K8656l9941
6152B9295n1515K3196L3518k7049l1824k3378L0036N0053j1368n7656l5389K2115
6140d9966l385R476j5593j6787P2678J5839J5058K3310R877k7595j5262j3834
6128C816l502j4559M80j0452l5152K9899j4042l4759J2824J5221p98m573K0128
$$ plain form
6218 -78447 -62793 -38911 -34450 -40181 -3732 10951 25516 34373 36360 37830 31159 19983 44256
6205 44256 20699 3175 -22939 -25862 -15493 -29564 -59795 -40231 -21639 -14115 -14030 -41197 -80736
6192 -80736 -48466 -8078 -42052 -46063 -34548 64 614 -30844 -13632 6448 -4149 1702 14851
6179 14851 -27367 -63144 -54990 -36860 -11132 1710 1019 -29207 -54049 -58782 -62560 -33139 17970
6166 17970 17226 24822 21494 11325 11478 -1528 -9757 2148 14229 21305 17285 40580 69236 29295
6152 29295 -22220 976 34494 7445 -24379 -47757 -17721 32332 20964 -36692 -72081 -49966
6140 -49966 -53351 -43875 -59468 -76255 -3577 12262 27320 50630 60507 32912 17650 3816
6128 3816 314 -14245 -13765 -24217 -59369 -29470 -43512 -78271 -65447 -50226 -51024 -55597 -35469
6115c5469m641P730L7876R69l9299L0915k0079k9801r850J1540K9942N9373K1489
6102F0695n4329l7966k6457n062J3681r101R084J1113J7886k7718N591K3919l7037
6089e5701L7301J9640p341L5911L0716k5832l2535p651J2099o397K7641K4357
6077E2208j5809k8230q868l0779M670j9610o32K9650J8581m3667k546J0224O029
6064b8779P025k578J2859J2906l126J8307K9141l5896o9619J5355o713L3959R983
6051g176L008j2641j6210j2728k0275r13P9870O6263m5397l6030J128L788N452
6038H139j3805o1016j3487J3363l796K8011k221R934K6643K7575M1946l7991k5503
6025b208l6639j9765O217O8j2160O69o371j8034j1860M0969J548M800K6746M2808
$$ plain form
6115 -35469 -40110 -32380 5496 6465 -32834 -1919 -21998 -51799 -61649 -50109 -20167 39206 60695
6102 60695 6366 -31600 -58057 -63119 -49438 -58539 -49455 -38342 -20456 -48174 -42583 -18664 -55701
6089 -55701 -18400 1240 -6101 29810 60526 34694 2159 -5492 6607 210 27851 52208
6077 52208 36399 8169 -699 -31478 -26808 -46418 -47050 -17400 1181 -42486 -45032 -34808 -28779
6064 -28779 -21754 -24332 -11473 1433 -1693 16614 45755 9859 -59760 -44405 -51118 -17159 -7176
6051 -7176 -4168 -16809 -33019 -45747 -66022 -66935 12935 79198 33801 -2229 -1101 2687 8139
6038 8139 -5666 -66682 -80169 -66806 -70602 -42591 -44812 -34878 -8235 19340 61286 23295 -2208
6025 -2208 -38847 -58612 -52395 -52327 -64487 -63818 -70189 -88223 -100083 -59114 -57566 -52766 -26020 16788
6011A6788J0664k5276m059l167k0059n476j1398j8144L0855L2918m093l1568k9357
5998f1372K5442J2295n586J0064J712m7796M487K5210N5784J3188M447k5135m4667
5985c1927Q581k4600k2198J7386L0996O049r944j2794p679J029q56k1367m0596
5972a07920J2886J5887N8526R2512K801n3279R27j815m161j0204m0611k3622j7240
5959g5313L3089K5552n423l5752k576J1638J7152P26r56K6509m213j3961J0616
5946a2912J1653r77K0380k2293M31J406o11k0544j7500m043N9582o705m1828q617
5932d2578Q731N439O105R806J1047N219J1184K6597p043j0553q418J8997l1450
5919C083l1309R59L0915k9807m2541K8038k2279N188Q5680Q1l3677K104j0270
$$ plain form
6011 16788 27452 2176 -1883 -5050 -25109 -30585 -41983 -60127 -29272 3646 -447 -32015 -61372
5998 -61372 -35930 -23635 -29221 -19157 -17445 -65241 -60754 -35544 20240 33428 37875 12740 -31927
5985 -31927 -23346 -47946 -70144 -52758 -21762 -15713 -25657 -38451 -46130 -45101 -45957 -67324 -107920
5972 -107920 -95034 -79147 -20621 71891 74692 21413 22340 20525 16364 6160 -34451 -58073 -75313
5959 -75313 -42224 -16672 -22095 -57847 -60423 -48785 -31633 -30907 -31863 -5354 -9567 -23528 -12912
5946 -12912 -1259 -2236 18144 -4149 -3718 -2312 -2923 -23467 -40967 -45010 14572 7867 -33961 -42578
5932 -42578 -33847 -28408 -22303 -12497 -1450 3769 14953 41550 34507 23954 15536 34533 3083
5919 3083 -28226 -27267 3648 -26159 -68700 -40662 -62941 -57753 27927 28008 -5669 -3565 -13835
5906a3835j5606J705j083q955J5550J0177K2444k3448j3791P358k2843K8366j328
5893a5289J9163L7412R424l1262m0330k4441l3574J1455K3266M142P798K5685
5881f551j3056l4755m1921J7184O165n185J0560M9487L6053Q638l6756k6282l251
5868c9670r482J4411K9017n276l0802K847O7413j389m4598l5320j8889J0108k325
5855f3955J1660J5125L8660K3975k236l2959m23K011o866j2984K7118K0834j7857
5842B103j7480J1307J8270n693j5813j9154q100o800j2958k772J3363N675k6258
5829f4310K0332M4598p289k6106K8911k0637J0147l1329k4242M9885N2724j5701
5817A6983m1211K886M7013j7871m0558k9676M157P1537q806p37j2492p990l09
$$ plain form
5906 -13835 -29441 -27736 -28819 -37774 -22224 -12047 10397 -13051 -26842 -19484 -42327 -13961 -15289
5893 -15289 3874 41286 50710 19448 -20882 -45323 -78897 -67442 -44176 -40034 -32236 -6551
5881 -6551 -19607 -54362 -96283 -79099 -72934 -78119 -67559 -18072 17981 26619 -10137 -36419 -39670
5868 -39670 -49152 -34741 -5724 -11000 -41802 -38955 28458 27069 -17529 -52849 -71738 -61630 -63955
5855 -63955 -52295 -37170 1490 25465 23229 -9730 -10153 -8142 -15008 -27992 -874 19960 2103
5842 2103 -15377 -4070 14200 8507 -7306 -26460 -34560 -41360 -54318 -57090 -43727 -38052 -64310
5829 -64310 -43978 620 -6669 -32775 -3864 -24501 -14354 -45683 -69925 -20040 32684 16983
5817 16983 -24228 -21342 25671 7800 -32758 -62434 -58277 13260 4454 3717 -8775 -16765 -17074
5804a7074J691j8834N422L4853n075l1995k1955K2838k878j0846K8226R089K7711
5791B1173K3515r763l1540p332J3913N697K4880j9281k0216j1127l7487j2140
5779e9708N3054n067j2078j5286r369j6004J0864m51L0642K0523l141K355l7450
5766d1116k0452J1482j12J9451O200P230o169l530o840j2647O7319j4780j6373
5753a0337Q397l2924k214K8350p808j0341k3669N6441P4764J575l8971l4257R644
5740A8650j0612j8090r665J734L649q404n651M2166K72n8477k9543L7954L6145
5727A28M482l4464k190N3699J0056l7022j8525M185r01P602K6137M734J0982L8630
5713F7533j0480k2824l3917l0529J7354L6353l43p0063q037J9098n801M9167r104
$$ plain form
5804 -17074 -15383 -34217 -28795 6058 983 -31012 -52967 -30129 -33007 -43853 -15627 -6538 21173
5791 21173 44688 34925 3385 -3947 9966 15663 40543 21262 1046 -10081 -47568 -59708
5779 -59708 -6654 -11721 -23799 -39085 -48454 -64458 -53594 -54045 -23403 -2880 -6021 -3666 -41116
5766 -41116 -61568 -50086 -50198 -30747 -24547 -17317 -23486 -27016 -33856 -46503 20816 6036 -10337
5753 -10337 -1940 -34864 -37078 -8728 -16536 -26877 -50546 5895 80659 82234 43263 9006 18650
5740 18650 8038 -10052 -19717 -17983 -14334 -22738 -28389 13777 14049 -44428 -73971 -36017 128
5727 128 4610 -29854 -32044 21655 31711 -5311 -23836 -19651 -20552 -12950 13187 17921 28903 67533
5713 67533 57053 34229 312 -30217 -12863 23490 23147 -46916 -54953 -35855 -41656 7511 -1593
5700a593l6966k9315J7517J9562k5150J3775j1009J8102J0717K6692q562j1777
5688a8007J2558J5650k0916p936j0967J0946M2118l1284n8798l1169K2241L7047
5676c8517M534K0728K4017m3295k1669k46l2556J1473L8553K4317K045k0583k3324
5663e4523j0814L2743K2300O32l401K1032P20k6428O281p709K4835R766k6318
5650a0884o0393K4981L7276K048j8285K1128J2683l065k9798l0263K0484N093
5638b8995J574L5708K9215n572m475k3564j8439K2330L6489J6861j1687n0324
5626h79l669j1356K6841j8342j1084j1262k7866J7567M1871q734K6634k3655P828
5613C894K8206k4100l7806j2738M0562K1881l516l299P104J4001J4548k8343k986
$$ plain form
5700 -1593 -38559 -67874 -50357 -30795 -55945 -42170 -53179 -35077 -24360 2332 -6230 -18007
5688 -18007 -5449 10201 -10715 -18651 -29618 -18672 23446 -7838 -66636 -97805 -75564 -38517
5676 -38517 -33983 -13255 10762 -32533 -54202 -54448 -87004 -75531 -36978 -12661 -10616 -31199 -54523
5663 -54523 -65337 -32594 -10294 -9662 -13063 7969 8689 -17739 -11458 -19167 5668 15434 -10884
5650 -10884 -71277 -46296 -9020 -6972 -25257 -4129 8554 5489 -24309 -54572 -34088 -28995
5638 -28995 -27421 8287 37502 31930 27455 3891 -14548 7782 44271 61132 49445 -879
5626 -879 -4548 -15904 10937 -7405 -18489 -29751 -57617 -40050 1821 -6913 19721 -3934 3894
5613 3894 32100 8000 -29806 -42544 -1982 19899 16383 13084 20188 34189 48737 20394 17408
5600A7408M7280J2079j2695n6203k9582J1690j8339o508k5757j9770L3358J6172
5588c0867K379l1508k194O2848L8223k0275j5097q872J3795N1053J8959j7338
5576F1106K2489j6172m7069k852k9665k9384k0170J2019M5223K2121M518m2646
5564b0482k971L8778m146M825j0262n360p347p978L1366k2558m152J915J8843
5551A0471p655j8624J1411M6026K2490M10k5785J0499j6243k9574M319K917L482
5538A4144j336M250p472n258q41K2281j5488j5311k3819M2956J4085n1760m565
5525b8134M4492J0696m4636P063j504J8192j834P455n947J9018l732j1523l8275
5512b8669J6826j6077R212k4152j7382K9297L0661K4862M463l4646m8525N88k640
$$ plain form
5600 17408 64688 76767 64072 7869 -21713 -10023 -28362 -34870 -60627 -80397 -47039 -30867
5588 -30867 -28488 -59996 -62190 658 38881 18606 3509 -5363 8432 59485 78444 61106
5576 61106 83595 67423 20354 17502 -12163 -41547 -61717 -49698 -4475 17646 22164 -20482
5564 -20482 -23453 15325 11179 16004 5742 382 -6965 -14943 16423 -6135 -10287 -8372 10471
5551 10471 2816 -15808 -4397 41629 64119 64529 38744 49243 33000 3426 7745 10662 14144
5538 14144 12808 17058 9586 4328 3487 25768 10280 -5031 -28850 14106 28191 -23569 -28134
5525 -28134 16358 27054 -17582 -10519 -12023 6169 4335 11790 5843 24861 21129 9606 -28669
5512 -28669 -11843 -27920 -18708 -42860 -60242 -30945 -284 24578 29041 -5605 -54130 -53542 -56182
5499e6182q445L1923K84L584J7215J9465O651J838M911R814k0921k6874j3968
5486c0705j371P439K2197J1609l860j2395j8473N017J3412l0056r743m133L2208
5473a8854k36J3265p235k2933K5851j0396Q621P404m6706j3523J5446J4176K2819
5460a2301P4020J6380l3467k0252Q408k149j6755n3128l9752K2373j4750K1267
5448e0106M643M5889K3152j6645l9020j542N1836K8492r983j5926j9566L8567
5436C9791J1241j1034K784j3639J6340j7200k53J7146l1624j7278k0365M75n419
5423b9035O273J8919K9912J9369j5892l7473J406j453r326J1777K4280K3513k739
5410C9531J104J5579j6624k6228m0554L769J9728J5286Q261n2479m4058M5840
$$ plain form
5499 -56182 -64627 -32704 -32420 -28836 -11621 7844 14495 16333 21244 31058 10137 -16737 -30705
5486 -30705 -32076 -24637 -2440 9169 5309 -7086 -25559 -20542 -7130 -37186 -46929 -51062 -18854
5473 -18854 -19090 -5825 -13060 -35993 -10142 -20538 -11917 -4513 -51219 -64742 -49296 -35120 -12301
5460 -12301 61719 78099 44632 24380 32788 30639 13884 -39244 -78996 -56623 -71373 -50106
5448 -50106 -45463 426 23578 6933 -32087 -33629 18207 46699 36716 20790 1224 39791
5436 39791 51032 39998 42782 29143 45483 28283 28030 45176 13552 -3726 -24091 -23616 -29035
5423 -29035 -22762 -3843 26069 45438 29546 -7927 -6521 -7974 -17300 -5523 18757 42270 39531
5410 39531 40635 56214 39590 13362 -27192 -23423 -3695 11591 19852 -32627 -76685 -30845
5398c0845M4249L683K6812k952l5566m3025K242J7529M310j1354K0260J4641k6412
5385a6428r502p54n563J3257J3260j2921Q954k305j1796n631j0142k7783J1850
5372e5504r846J3069J7752L6645M186k6491K91N298k6558O405O848R324N703L1968
5358A9090J4053j4410J2145j6333l0479J3914j5444L0929L8384j1428l070K9696
$$ plain form
5398 -30845 13404 17087 43899 40947 5381 -37644 -35402 -17873 -13563 -24917 -4657 9984 -16428
5385 -16428 -25930 -26684 -32247 -18990 -5730 -18651 -9697 -12002 -23798 -29429 -39571 -67354 -55504
5372 -55504 -65350 -52281 -34529 2116 6302 -20189 -19898 -14600 -41158 -34753 -27905 -18581 -12878 19090
5358 19090 33143 18733 30878 14545 -15934 -2020 -17464 13465 51849 40421 37351 67047
$$ [...]
##END NTUPLES=NMR SPECTRUM
##END=
