##TITLE=Analysis number 329477
Compound Code cc 62244
Book Reference 518/177
Project Code adrs
Chemist Name colinb
##JCAMPDX= 6.0         $$ Bruker NMR JCAMP-DX V2.0
##DATA TYPE= NMR SPECTRUM
##DATA CLASS= NTUPLES
##ORIGIN= Bruker BioSpin GmbH
##OWNER= nmr
$$ XWIN-NMR		Version 3.5
$$ Wed Sep  5 13:15:14 2007 GMT Daylight Time (UT+1h)  MAYBRIDGE\nmr@NMR_250MHZ
##.OBSERVE FREQUENCY= 250.131544655141
##.OBSERVE NUCLEUS= ^1H
##.ACQUISITION MODE= SIMULTANEOUS (DQD)
##.ACQUISITION SCHEME= undefined
##.AVERAGES= 16
##.DIGITISER RES= 18
##SPECTROMETER/DATA SYSTEM= dpx250
##.PULSE SEQUENCE= zg30
##.SOLVENT NAME= CDCl3
##.SHIFT REFERENCE= (INTERNAL, CDCl3, 0, 16.522)
##AUDIT TRAIL= $$ (NUMBER, WHEN, WHO, WHERE, WHAT)
$$ ##TITLE= Audit trail, XWIN-NMR		Version 3.5
$$ ##JCAMPDX= 5.01
$$ ##ORIGIN= Bruker BioSpin GmbH
$$ ##OWNER= nmr
$$ C:\u/data/dgb/nmr/ADRS/290/pdata/1/auditp.txt
$$ ##AUDIT TRAIL=  $$ (NUMBER, WHEN, WHO, WHERE, WHAT)
(   1,<2007-09-05 13:14:52.22 +100>,<MAYBRIDGE\nmr>,<NMR_250MHZ>,
      <created by zg, POWCHK disabled, PULCHK disabled
       configuration hash MD5:
       76 6E 9A 78 1E 09 19 81 EC 84 63 8F B0 6A 59 2D
       data hash MD5: 64K
       7A C5 9C 69 56 3A 72 68 75 3E 86 A4 DB B2 1D 4E>)
(   2,<2007-09-05 13:15:05.05 +100>,<MAYBRIDGE\nmr>,<NMR_250MHZ>,
      <Start of raw data processing
       ef LB = 0.3 FT_mod = 6 PKNL = 1 SI = 32K 
       data hash MD5: 32K
       8B 17 F3 4C E5 CE E7 50 6F 89 14 9B B5 1F EB 0D>)
(   3,<2007-09-05 13:15:06.72 +100>,<MAYBRIDGE\nmr>,<NMR_250MHZ>,
      <apk 
       data hash MD5: 32K
       0A D8 47 15 E9 25 A6 C9 2C 53 4A 68 EF 08 8F C8>)
(   4,<2007-09-05 13:15:07.58 +100>,<MAYBRIDGE\nmr>,<NMR_250MHZ>,
      <abs ABSG = 5 
       data hash MD5: 32K
       D9 A3 AA EC 4C 27 EE 88 64 72 F4 7E 2C 86 3A E3>)
$$ ##END=
$$ 
$$ hash MD5
$$ 0E 35 6C E8 B7 B3 E9 7A 4A 66 1B 57 B6 87 34 B9
##$RELAX= 
##$RELAX= 
##$RELAX= 
##$RELAX= 
##$RELAX= 
##$RELAX= 
##$RELAX= 
$$ Bruker specific parameters
$$ --------------------------
##$DU= <C:\u>
##$EXPNO= 290
##$NAME= <ADRS>
##$PROCNO= 1
##$TYPE= <nmr>
##$USER= <dgb>
##$AMP= (0..31)
100 100 100 100 100 100 100 100 100 100 100 100 100 100 100 100 100 100 
100 100 100 100 100 100 100 100 100 100 100 100 100 100 
##$AQSEQ= 0
##$AQ_mod= 3
##$AUNM= <au_zg>
##$AUTOPOS= <35 >
##$BF1= 250.13
##$BF2= 250.13
##$BF3= 250.13
##$BF4= 250.13
##$BF5= 500.13
##$BF6= 500.13
##$BF7= 500.13
##$BF8= 500.13
##$BYTORDA= 1
##$CFDGTYP= 0
##$CFRGTYP= 5
##$CHEMSTR= <none>
##$CNST= (0..31)
1 1 145 1 1 1 1 1 1 1 1 1 1 1 1 1 1 1 1 1 1 1 1 1 1 1 1 1 1 1 1 1 
##$CPDPRG= <>
##$CPDPRG1= <>
##$CPDPRG2= <>
##$CPDPRG3= <>
##$CPDPRG4= <mlev>
##$CPDPRG5= <mlev>
##$CPDPRG6= <mlev>
##$CPDPRG7= <mlev>
##$CPDPRG8= <mlev>
##$CPDPRGB= <>
##$CPDPRGT= <>
##$D= (0..31)
0 1 0 0 0 0 0 0 0 0.06 0 0 0 0 0 0 0.0002 0 0 0 0 0 0 0 0 0 0 0 0 0 0 
0 
##$DATE= 1188994491
##$DBL= (0..7)
120 120 120 120 120 120 120 120 
##$DBP= (0..7)
150 150 150 150 150 150 150 150 
##$DBP07= 0
##$DBPNAM0= <>
##$DBPNAM1= <>
$$ [...]
##$SUBNAM7= <"">
##$SUBNAM8= <"">
##$SUBNAM9= <"">
##$SW= 20.6930455092707
##$SWIBOX= (0..15)
0 0 3 0 0 0 0 0 0 0 0 0 0 0 0 0 
##$SW_h= 5175.983436853
##$TD= 65536
##$TD0= 1
##$TE= 296.16
##$TE2= 300
##$TE3= 300
##$TEG= 300
##$TL= (0..7)
0 120 120 120 120 120 120 120 
##$TP= (0..7)
150 150 150 150 150 150 150 150 
##$TP07= 0
##$TPNAME0= <>
##$TPNAME1= <>
##$TPNAME2= <>
##$TPNAME3= <>
##$TPNAME4= <>
##$TPNAME5= <>
##$TPNAME6= <>
##$TPNAME7= <>
##$TPOAL= (0..7)
0.5 0.5 0.5 0.5 0.5 0.5 0.5 0.5 
##$TPOFFS= (0..7)
0 0 0 0 0 0 0 0 
##$TUNHIN= 0
##$TUNHOUT= 0
##$TUNXOUT= 0
##$USERA1= <user>
##$USERA2= <user>
##$USERA3= <user>
##$USERA4= <user>
##$USERA5= <user>
##$V9= 5
##$VALIST= <valist>
##$VCLIST= <CCCCCCCCCCCCCCC>
##$VD= 0
##$VDLIST= <DDDDDDDDDDDDDDD>
##$VPLIST= <PPPPPPPPPPPPPPP>
##$VTLIST= <TTTTTTTTTTTTTTT>
##$WBST= 1024
##$WBSW= 4
##$XGAIN= (0..3)
0 0 0 0 
##$XL= 0
##$YL= 0
##$YMAX_a= 458683
##$YMIN_a= -333682
##$ZGOPTNS= <>
##$ZL1= 120
##$ZL2= 120
##$ZL3= 120
##$ZL4= 120
##$ABSF1= 16.522
##$ABSF2= -4.171173
##$ABSG= 5
##$ABSL= 3
##$ALPHA= 0
##$AQORDER= 0
##$ASSFAC= 0
##$ASSFACI= 0
##$ASSFACX= 0
##$ASSWID= 0
##$AUNMP= <proc_1d>
##$AZFE= 0.1
##$AZFW= 0.1
##$BCFW= 0
##$BC_mod= 0
##$BYTORDP= 0
##$COROFFS= 0
##$CY= 12.5
##$DATMOD= 1
##$DC= 0
##$DFILT= <>
##$DTYPP= 0
##$F1P= 14.0000005364418
##$F2P= -0.99999901652339
##$FCOR= 0.5
##$FTSIZE= 32768
##$FT_mod= 6
##$GAMMA= 0
##$GB= 0
##$INTBC= 1
##$INTSCL= 1
##$ISEN= 128
##$LB= 0.3
##$LEV0= 0
##$LPBIN= 0
##$MAXI= 10000
##$MC2= 0
##$MEAN= 0
##$ME_mod= 0
##$MI= 0
##$NCOEF= 0
##$NC_proc= -4
##$NLEV= 6
##$NOISF1= 0
##$NOISF2= 0
##$NSP= 0
##$NTH_PI= 0
##$NZP= 0
##$OFFSET= 16.522
##$PC= 1
##$PHC0= -41.14081
##$PHC1= 4.828759
##$PH_mod= 1
##$PKNL= yes
##$PPARMOD= 0
##$PSCAL= 4
##$PSIGN= 0
##$REVERSE= no
##$SF= 250.13
##$SI= 32768
##$SIGF1= 0
##$SIGF2= 0
##$SINO= 400
##$SIOLD= 32768
##$SREGLST= <1H.CDCl3>
##$SSB= 0
##$STSI= 32768
##$STSR= 0
##$SW_p= 5175.98343685301
##$SYMM= 0
##$S_DEV= 0
##$TDeff= 65536
##$TDoff= 0
##$TI= <Analysis number 999999
Compound Code 99
Book Reference 9
Project Code 9>
##$TILT= no
##$TM1= 0
##$TM2= 0
##$TOPLEV= 0
##$USERP1= <user>
##$USERP2= <user>
##$USERP3= <user>
##$USERP4= <user>
##$USERP5= <user>
##$WDW= 1
##$XDIM= 32768
##$YMAX_p= 355333881
##$YMIN_p= -153519
$$ End of Bruker specific parameters
$$ ---------------------------------
##NTUPLES= NMR SPECTRUM
##VAR_NAME=  FREQUENCY,     SPECTRUM/REAL,   SPECTRUM/IMAG
##SYMBOL=    X,             R,               I
##VAR_TYPE=  INDEPENDENT,   DEPENDENT,       DEPENDENT
##VAR_FORM=  AFFN,          ASDF,            ASDF
##VAR_DIM=   32768,         32768,           32768
##UNITS=     HZ,            ARBITRARY UNITS, ARBITRARY UNITS
##FACTOR=    0.157963299565203, 1,           1
##FIRST=     4132.6476996994, 0,             0
##LAST=      -1043.33573715361, 0,           0
##MIN=       -1043.33573715361, -153519,     0
##MAX=       4132.6476996994, 355333881,     0
$$ Real data points
##PAGE= N=1
##DATA TABLE= (X++(R..R)), XYDATA
$$ [...]
16132c1741L871n24K1783N513K0603K0888n694l7190J6581k9473K1223K9793k5933
16119I700j6179p0090l5822K4279M1997L1732N703J3306j0985j0904L1633K3311
16107C7681j4343J475O315j6633j7564m0554O085N963p332K0897j512k5910J1681
16094c3751J2109J6904P913j0625Q279K8515L2249j7586K492n506m485l4372j667
16081D69J2324k5524j9134k4597k7415J8489J6199m526P543K8934L0735k7430
16069a3933L777K2877K953k345n6115j4322J6430J0459O2706L4099Q914k9495
16057D6005k5263j4396k4175J8414j3697l6792J1701Q12K712K8406j5840r279
16045c1392K9945j8915l0945l02M1926k0933P491j422k2385p660p003K0463J3659
$$ plain form
16132 -31741 -27870 -28394 -6611 -1098 19505 40393 34699 -2491 14090 -15383 5840 35633 9700
16119 9700 -6479 -76569 -112391 -88112 -46115 -14383 -8680 4626 -6359 -17263 14370 37681
16107 37681 23338 24813 31128 14495 -3069 -43623 -37538 -31575 -38907 -18010 -19522 -45432 -33751
16094 -33751 -21642 -4738 3175 -7450 829 29344 61593 44007 46499 40993 36508 2136 469
16081 469 12793 -12731 -31865 -56462 -83877 -65388 -49189 -53715 -46172 -17238 13497 -13933
16069 -13933 -10156 12721 15674 13329 -42786 -57108 -40678 -30219 32487 66586 75500 46005
16057 46005 20742 6346 -17829 585 -13112 -49904 -38203 -37391 -34679 -6273 -22113 -31392
16045 -31392 -1447 -20362 -51307 -51609 -9683 -30616 -23125 -24547 -46932 -54592 -61595 -41132 -27473
16032b7473k6182j1391j1913J2874L0107K2759n146J3800M8949j451j8842k6485
16020c94l2356j4950n0773j4307N3144M2200R559K179m8362o948K2571L5620L5953
16007C3136j1413l6372L0487N235J7313J2794k9527k5089J350l6089P158p085
15995c8102K912J109j7980j1340K6911J411r590J8260p724p134Q880m989k6323
15982f3699n083K3587O045J3469j8555j5165J3020J8345L6794J5425l155l6780
15970a5752n393M177k9458L410J507j6499J0485J4363k592O183J6676L0952k609
15957A5450r726l0995Q570J7266K492m1353k3783N82L6244N0570l267j5497K0271
15944B6824Q989k3489k1174J4089K318j7664j3295K7474l255j8042R003K9546
$$ plain form
16032 -27473 -53655 -65046 -76959 -64085 -33978 -11219 -16365 -2565 46384 44933 26091 -394
16020 -394 -32750 -47700 -98473 -112780 -59636 -17436 -7877 -5698 -54060 -61008 -38437 -2817 33136
16007 33136 21723 -14649 15838 21073 38386 51180 21653 -3436 -2086 -38175 -31017 -38102
15995 -38102 -35190 -34081 -52061 -63401 -36490 -35079 -44669 -26409 -34133 -41267 -32387 -37376 -63699
15982 -63699 -68782 -45195 -39150 -25681 -44236 -59401 -46381 -28036 8758 24183 21028 -15752
15970 -15752 -21145 -16968 -46426 -43016 -41509 -58008 -47523 -33160 -35752 -29569 -12893 18059 15450
15957 15450 5724 -25271 -16701 565 3057 -38296 -62079 -61497 -25253 25317 22050 6553 26824
15944 26824 35813 12324 -8850 5239 7557 -10107 -23402 4072 817 -17225 -8222 21324
15932B1324K3316l0197l8348k6742m3130l563L6256O7004m526k3073j0518J5302
15920a6895J7105J5031K7176k3082J3581j7594l5713o933O814J2512K578K1466
15908A6046J9198r235O456M9030l9236k6033K305k411j8871l8611Q8K1198K7219
15895G143k4150J6577K4687l4880k7355j9237k6600p85K7131j5861K4578j1603
15883f0355K0548K1754M2317J7652m54j4119r103Q328k054O616m1099k501k6014
15870c8484M1124L583J1770o374l4607p129K3543p411J7441J5586l0407k284R591
15857d058k6018L4059L7252l308j6023K757J2292j9544j2035J0505L1161m1329
15845E711l7981j0504M462m330l1527l934K3666J7849J8286M3185J639j0133j695
$$ plain form
15932 21324 44640 14443 -23905 -50647 -93777 -97340 -61084 5920 1394 -21679 -32197 -16895
15920 -16895 210 15241 42417 19335 32916 15322 -20391 -27324 -20510 -7998 -5420 16046
15908 16046 35244 26009 32465 81495 42259 16226 18531 16120 -2751 -41362 -41274 -20076 7143
15895 7143 -17007 -430 24257 -10623 -37978 -57215 -83815 -84600 -57469 -73330 -48752 -60355
15883 -60355 -39807 -18053 24264 41916 41462 27343 18240 26568 24514 31130 -9969 -12470 -38484
15870 -38484 2640 6223 17993 11619 -22988 -30117 -6574 -13985 3456 19042 -11365 -13649 -4058
15857 -4058 -30076 3983 41235 37927 21904 24661 36953 17409 5374 15879 47040 5711
15845 5711 -32270 -42774 -38312 -42642 -74169 -78103 -54437 -36588 -18302 24883 26522 16389 14694
15832A4694j0436j6061R403j12J0154Q294L1427j1062J0496M7369j1483l8821
15820D3862j599K8132J7056o2689l1723K8660M3268J5599l2922k9402J3562l8936
15808g132J3857p734j1701k9758J7100K3823J7212j3311J8862J8196J6897K1250
15796G7561Q591Q11j6236j5760o3578n0590m128l629j5394N1767K8743R029Q390
15783A5577m7548j61K2719J7854J1945J816j0702j2681P52J5552J6902r697l6592
15770a4264k2943L3118L1962j463R309j3575o1662O120J432k0306K1026M0788
15758I542K3801j7526k9280j7723J2112l7616K7404L788K9516J2348j4236k1889
15746a9759j1876L0828K223l8264k0329N9153K0158m512J0674k4383m1437Q17
$$ plain form
15832 14694 4258 -11803 -2400 -2512 7642 15936 47363 36301 46797 94166 82683 43862
15820 43862 42263 70395 87451 24762 -6961 21699 64967 80566 47644 18242 31804 -7132
15808 -7132 6725 -1009 -12710 -42468 -25368 -1545 15667 2356 21218 39414 56311 77561
15796 77561 86152 86963 70727 54967 -8611 -59201 -63329 -66958 -82352 -30585 -1842 7187 15577
15783 15577 -31971 -32132 -9413 8441 20386 22202 11500 -1181 -429 15123 32025 22328 -14264
15770 -14264 -37207 -4089 27873 26410 35719 22144 -39518 -33398 -31966 -52272 -31246 9542
15758 9542 33343 15817 -13463 -31186 -19074 -56690 -29286 -25498 4018 16366 2130 -19759
15746 -19759 -31635 -807 1416 -36848 -57177 1976 22134 17622 28296 3913 -37524 -36707
15734c6707p752j1865N309K656K3156M28k1156O975o324k8291j5970N9456K7691
15721b394N805k1212J2701j9556K2519j227l5321M678j0751j3936K5823K4234
15709h637o886l1018o229j036j5078m151o586J6619j0202J6363N0624J0061n281
15696a437K1354K0494j0110J400l237l9603k7530J1080J0880M4392K1190k1842
15684B7031o4027q214k429K1729P481q107k76J1425p270P681J3007J0037k944
15671E124J6077n942n558Q684j3442k6948K9358p83j5511k2829K3365j0434k852
15658b1691L1555j906n67J200n163k3708J4645J0936Q445p947K2224R390p738
15645B9675j9739r067K533K4876J5076P979J4574l0974k7161j36r519L924L4213
$$ plain form
15734 -36707 -44459 -56324 -51015 -48359 -25203 -24775 -45931 -38956 -45280 -73571 -89541 -30085 -2394
15721 -2394 3411 -17801 -5100 -24656 -2137 -3364 -38685 -34007 -44758 -58694 -32871 -8637
15709 -8637 -15523 -46541 -52770 -53806 -68884 -73035 -79621 -63002 -73204 -56841 -6217 3844 -1437
15696 -1437 19917 40411 30301 31701 28464 -11139 -38669 -27589 -16709 27683 48873 27031
15684 27031 -36996 -45210 -47639 -25910 -18429 -26536 -26812 -15387 -22657 -14976 -1969 8068 5124
15671 5124 21201 15259 9701 18385 4943 -22005 7353 6570 -8941 -31770 -8405 -18839 -21691
15658 -21691 9864 7958 7391 8591 3428 -20280 -5635 5301 13746 5799 28023 37413 29675
15645 29675 9936 869 3402 28278 43354 51333 65907 34933 7772 7636 -1883 2041 36254
15632C6254l7717l3876O4555l342k8963M8387k6213j3715J964j7529k6989j6775
15620e3959K1361N1774n446J626l8678j1906K274K0244J8834j768J0466J5026
15608B9848k4776O21j5317j0218J3745m4672p65j2060q977K8335L4289N785J1691
15595G529j4910O741n404k2858r803J3559J8485J0476P95m007j486Q120j7900
15582a0663j3927J7579M2578J3966O835o807o0526j8553J0266K3734J4768j2075
15570G175o5353l8641K4547J9501M2042K0528j5948n223K4653K4365l4630j7301
15558a4285K8822L4578K3897l1361k9748K8498j5181N865j9693j1992M0453j5160
15546B4693o3275N64N400m782j0502J2364M0533J4449l9966O874K1218k1257J7579
$$ plain form
15632 36254 -1463 -35339 29216 25874 -3089 45298 19085 5370 7334 -10195 -37184 -53959
15620 -53959 -32598 19176 13730 15356 -23322 -35228 -32954 -12710 6124 4356 14822 29848
15608 29848 5072 5693 -9624 -19842 -6097 -50769 -51534 -63594 -72571 -44236 -9947 -4162 7529
15595 7529 -7381 -640 -6044 -28902 -38705 -25146 -6661 3815 4610 603 -883 7237 -10663
15582 -10663 -24590 -7011 35567 49533 56368 49561 -10965 -29518 -19252 4482 19250 7175
15570 7175 -58178 -96819 -72272 -52771 -10729 9799 -6149 -11372 13281 37646 3016 -14285
15558 -14285 14537 49115 73012 41651 11903 40401 25220 31085 11392 -600 39853 24693
15546 24693 -38582 -38018 -32618 -37400 -47902 -35538 4995 19444 -20522 -13648 7570 -13687 3892
15533C892K2530m4745k1598r739n850N5124N7361k3729n0496p2393N491K5863
15521e8289n668K2917K7457J818R367j9675j9748l208J7758K272j9197m240K0768
15508b7668R661k3558j1602N3031q038j5848L7432K574n4545J4517J3670J113
15496i261m947p070J1923N777j4157L189J6209K1727j4217m736p594k1690q262
15483c3109J3924q401m2927M893J2162m557P267J0450m1993n1296l933M0802N3507
15470d3211j9377j5595M9457J6047n65L9028K1024N183m147K9980K8687l8179
15458F8332p512J9323M789k9672l8738k5192k1537Q497j5420K3058J8036M513
15446H477J8083l7862j2027P384l885J1259K7019j6353j8868L0822j0017J5014
$$ plain form
15533 3892 26422 -18323 -39921 -49660 -55510 -386 56975 33246 -17250 -89643 -84152 -58289
15521 -58289 -63957 -41040 -13583 -11765 -2398 -22073 -41821 -45029 -27271 -24999 -44196 -48436 -27668
15508 -27668 -18007 -41565 -53167 -136 -8174 -24022 13410 15984 -38561 -24044 -10374 -9261
15496 -9261 -14208 -21278 -9355 -3578 -17735 -14546 1663 23390 9173 4437 -3157 -24847 -33109
15483 -33109 -19185 -27586 -70513 -65620 -53458 -58015 -50748 -40298 -82291 -133587 -137520 -96718 -43211
15470 -43211 -62588 -78183 -28726 -12679 -13244 25784 46808 51991 47844 77824 106511 68332
15458 68332 60820 80143 84932 55260 16522 -8670 -30207 -21710 -37130 -14072 3964 8477
15446 8477 26560 -11302 -23329 -15945 -19830 -8571 18448 2095 -16773 14049 4032 19046
15434A9046L1821N0936j3188m1095m3329J3166K6828k430k2779k3741m7083m9927
15422a01775M2103L9960L6704L5551O196r652k9769J5329M3943n889m5414n7296
15410c0009k7097K4360l691m7665l6882L2936M9425J4819k3924P516J6535Q48
15398b2829l44j0668l476n147p683J7043J5723j2223J3543J982J1323k039l0720
15385c5515K7528J8280J0497K4048K3976n1934j0482j4758k8796K0365Q477J1686
15373C372l266m1116k4052K6411L3503R126n445j7726l4472R324P301j1805J0190
15360c8655M1434K2878K446K5516k667r0253l3446L3875p717m6863K3884M4721
15348b4847J6897k391K526K3430N29r392K2900J3276J4526O495k0988k6350J0758
$$ plain form
15434 19046 50867 101803 88615 47520 4191 17357 44185 41755 18976 -4765 -51848 -101775
15422 -101775 -59672 -19712 16992 52543 58739 49087 19318 34647 78590 72701 27287 -30009
15410 -30009 -57106 -32746 -36437 -84102 -120984 -88048 -38623 -23804 -47728 -40212 -23677 -22829
15398 -22829 -23173 -33841 -37317 -42464 -50147 -33104 -17381 -29604 -16061 -14079 -2756 -4795 -35515
15385 -35515 -7987 10293 20790 44838 68814 16880 6398 -8360 -37156 -16791 -8314 3372
15373 3372 106 -41010 -65062 -38651 -5148 3978 -1467 -19193 -53665 -44341 -37040 -48845 -38655
15360 -38655 2779 25657 28103 53619 50952 -39301 -72747 -38872 -46589 -93452 -69568 -24847
15348 -24847 -7950 -10341 -7815 15615 16144 6752 29652 42928 57454 63949 42961 16611 27369
15335B7369o917k7908q142P708o442p697J1537J8696j1992k6658J2063K6523l1129
15322b2989R574J4752n524J4526j459l6238k7240N354K721K8040R630k1150J331
15309b8672J7143Q351k0217j5292k4294J6327N3553k0398r015j1904J2596J7265
15297d557o231m791K777M828m215j6030j7717J5890J1457K7534O427l935j769
15284I668k9522J5408m131q94l378o313L3890J6281l2098k9356K6274j6443j5448
15271c6062J2306J9931P370n274K1045j293j5805j8324j0322j5591r179j1330
15259f2528k7782J8653L8454M0508K394j1655m145j2726q268N5618n956k8040
15247e473k3441M1161L0002N8950k9088m1255l2153o286K6205P080K6338n247
$$ plain form
15335 27369 20452 -7456 -15598 -7890 -14332 -22029 -10492 8204 -3788 -30446 -18383 8140 -22989
15322 -22989 -13415 1337 -4187 10339 8880 -27358 -54598 -49244 -46523 -18483 -8853 -30003 -28672
15309 -28672 -11529 -3178 -23395 -38687 -62981 -46654 6899 -13499 -22514 -34418 -21822 -4557
15297 -4557 -10788 -15579 -12802 -7974 -12189 -28219 -45936 -30046 -18589 8945 15372 11437 9668
15284 9668 -19854 -4446 -8577 -9471 -12849 -19162 14728 31009 -1089 -30445 -4171 -20614 -36062
15271 -36062 -23756 -3825 3545 -1729 19316 18023 2218 -16106 -26428 -42019 -51198 -62528
15259 -62528 -90310 -71657 -33203 7305 9699 -1956 -6101 -18827 -27095 28523 22567 -5473
15247 -5473 -28914 12247 42249 101199 72111 30856 -1297 -7583 18622 25702 52040 46793
15235D6793o9904j2468j6276k0902J3790M0950M1490r460L0014j574m2100k9457
15223b9104m35O262J883K1659L2134k9014j290K551P914K4205J0849J9205n873
15210F0946j7402J4090k3183k9874J3778J7223p349K3124k3797k4328L1887J0734
15198D5849L390j6858j7961j4056n931J6252L062R26J623j5286L767k2069K3951
15185F659J2531r168k8910n9348O866J2592j8992N664J3626J8488J8741j8956
15173d0207l1631P88p654J2772n717M0267M3003j6156J0245j7202j4146k752j3454
15160d1844K2261O590J5174j3912N021j289n389j2950J3345k4731m4501o273L9413
15147d9085P487J8458P652j4897j4530Q944L4919k0954l4501N801L5757L6059
$$ plain form
15235 46793 -23111 -35579 -51855 -72757 -58967 -18017 23473 14013 44027 42453 353 -29104
15223 -29104 -29539 -23277 -21394 265 32399 3385 2095 4646 12560 36765 47614 66819 60946
15210 60946 43544 57634 34451 4577 18355 35578 28229 51353 27556 3228 35115 45849
15198 45849 49239 32381 14420 364 -5567 10685 13747 14673 16296 1010 4777 -17292 6659
15185 6659 19190 10022 -18888 -78236 -71370 -58778 -77770 -72106 -58480 -39992 -21251 -40207
15173 -40207 -71838 -71050 -78704 -65932 -71649 -31382 11621 -4535 5710 -11492 -25638 -28390 -41844
15160 -41844 -19583 -12993 2181 -11731 -6710 -7999 -13388 -26338 -12993 -37724 -82225 -88498 -49085
15147 -49085 -41598 -23140 -15488 -30385 -44915 -35971 -1052 -22006 -56507 -50706 -14949 21110
15135B1110n333q941j3333j451K9695J4901m9877k0715L887J9094J9383k2882
15123a4462k9334K7309R751J696l6071K9471K8358k6503m120m952q98l0110J2104
15110c7761J7413q144j0414P509j0943o810K0138M559j8503L1331K5327J6078
15098B9780j1257j5302l2035j5449j3244J2820M4785J5566O017l08J1178o103
15086B6448L0560J8380K2944k5152l5746J6326m7423k8596k0631J6882R970K8444
15074A2406J0483p981l027J6945l7328j7138M4520J9401j5981j0827l5157R528
15062a4156o348j1183j044k1044N3100K1111k0279l840k8208L0156K829r047l2090
15049d0043J430K2848k908L4569p764J77j2990k1536N648L4776M6911p623m8080
$$ plain form
15135 21110 15777 6836 -6497 -7948 21747 36648 -13229 -33944 -30057 -10963 8420 -14462
15123 -14462 -43796 -16487 -6736 -5040 -41111 -11640 16718 -9785 -13905 -18857 -19755 -49865 -37761
15110 -37761 -20348 -28492 -38906 -31397 -42340 -49150 -29012 -24453 -42956 -11625 13702 29780
15098 29780 18523 3221 -28814 -44263 -57507 -44687 98 15664 21681 21373 32551 26448
15086 26448 57008 75388 98332 73180 37434 53760 6337 -22259 -42890 -26008 -16038 12406
15074 12406 22889 14908 11881 28826 -8502 -25640 18880 38281 22300 11473 -23684 -14156
15062 -14156 -20504 -31687 -32731 -53775 -675 20436 157 -3683 -31891 -1735 1094 -7953 -40043
15049 -40043 -38613 -15765 -18673 15896 8132 8309 -4681 -26217 -20569 14207 61118 53495 5415
15036E415m9984M904M3427K6170k3040l3102j0765M6086J0053m3654k3904L746
15024d4648J3305P43n287l9034k3082l038N3705M7044K2197o623j0374l8710J2375
15011b1427M8182j0758N331j0425j6945j1634j9283m656L5506P1816Q381J0169
14999H4257L3741K3769O682M5191Q686r4154o0350K439k0782k2891J314k440n444
14986A8l5816J255K2049L8753K3612k8909l014M1411K819k8831j4452k3050j3783
14973a7938j8388K6735l135j1758N3842j6923m6724o323j9191M168K0646r00P359
14960b8530M2733M9502j1474k5325k7588P183m566k0686K9945J0659j7768L547
14948G632Q867K8621Q992k0113l2955j3587J5324M5326m224k9497k6998j1154
$$ plain form
15036 5415 -44569 -39665 3762 29932 6892 -26210 -36975 9111 19164 -24490 -48394 -44648
15024 -44648 -31343 -30600 -35887 -74921 -98003 -101041 -47336 -292 21905 15282 4908 -33802 -21427
15011 -21427 26755 15997 21328 10903 -6042 -17676 -36959 -41615 -6109 65707 74088 84257
14999 84257 117998 141767 148449 193640 202326 108172 47822 50261 29479 6588 7902 5462 18
14986 18 -35798 -34543 -12494 26259 49871 20962 17948 59359 62178 33347 18895 -4155 -17938
14973 -17938 -36326 -9591 -12726 -24484 29358 12435 -34289 -40612 -59803 -55635 -34989 -35889 -28530
14960 -28530 14203 63705 52231 26906 -682 6501 1935 -18751 11194 21853 4085 7632
14948 7632 16499 45120 54112 33999 1044 -12543 2781 48107 43883 14386 -12612 -23766
14936b3766O499q895K0467L9876J9600k0820k3225j7513Q372J5555k3770K5707
14924A8087l2157j1834p711j4041K1471l4825J2613J7131K3227j5902R447K4638
14912A0144J0341j1185k338k0956o12K3705l9311n0873p763j930M3461N3024j4629
14899h922k7989l350j8638K6564K7745K9987K213r017j498o061r880j7097m732
14886b0675j395L4945L157l2903K2473L9586L6984j846m4534m944L3691k0962
14874D3577m7201p689K0412p211O274N019l3726k0040K3252K6555j5703N925j8274
14861a8830J7632J0710J3606k5877J5520K1571k997k5878m872k7094j8236J792
14849d2953K1368K1008n0741p371j907l492K5211J9744J6088J9864K0119j9231
$$ plain form
14936 -23766 -17267 -26162 -5695 34181 53781 32961 9736 -7777 595 16150 -7620 18087
14924 18087 -14070 -25904 -33615 -47656 -26185 -61010 -48397 -31266 -8039 -23941 -14494 10144
14912 10144 20485 9300 6962 -13994 -14606 9099 -30212 -81085 -88848 -90778 -47317 5707 -8922
14899 -8922 -36911 -40261 -58899 -32335 -4590 25397 27610 18593 17095 11034 1154 -15943 -20675
14886 -20675 -22070 12875 16032 -16871 5602 45188 82172 80326 35792 30848 64539 43577
14874 43577 -3624 -11313 9099 1888 8162 13181 -20545 -40585 -17333 9222 -6481 -556 -18830
14861 -18830 -1198 9512 23118 -2759 12761 34332 31335 5457 585 -26509 -44745 -42953
14849 -42953 -21585 -577 -51318 -58689 -60596 -64088 -38877 -19133 -3045 16819 36938 17707
14837A7707l9796p999m422K3211j1924l6789J0802K5610J079m724l5968j0472
14825g3685M0324l90R511P8324J112l8881O108K525m2995j3295L725p909j8226
14812e3752o008j6719M2340l6999J8272Q251K5794j236K1054q339j6471q883o013
14799c8709Q485r532J6248J3673k6425n582L5298R618l8893l343N5766L3532k1947
14786B8189l8412O468k3568K2104J2441K3760j4969k7185r598R010j2913k457
14774b7130j4674p156M6156M935m650J9397J9230o536Q420k7758r08J818J1662
14761B2806J1272j5056j5490l8721O848j5946n690P177K4770j3932n512K9700
14749g774L8772K2001l1761k710j9952k1686J3746l7522j4346L1710J5071K2069
$$ plain form
14837 17707 -22089 -30088 -34510 -11299 -23223 -60012 -49210 -23600 -22521 -27245 -63213 -73685
14825 -73685 -33361 -33751 -24240 54084 55196 16315 22423 24948 -18047 -31342 -27617 -35526 -53752
14812 -53752 -59760 -76479 -34139 -71138 -52866 -44615 -18821 -20057 997 -7342 -23813 -32696 -38709
14799 -38709 -30224 -39756 -23508 -9835 -36260 -41842 -6544 3074 -35819 -39162 16604 50136 28189
14786 28189 -10223 -3755 -27323 -5219 7222 30982 16013 -11172 -20770 -11760 -24673 -27130
14774 -27130 -41804 -48960 -2804 2131 -2519 16878 36108 29572 37992 10234 9326 11144 22806
14761 22806 34078 19022 3532 -35189 -28341 -44287 -49977 -42800 -18030 -31962 -37474 -7774
14749 -7774 30998 52999 21238 18528 -1424 -23110 -9364 -46886 -61232 -29522 -14451 7618
14737G618m7551J2852K1890J0244J9364r237N894K6804m0720j2921j3486J1231
14725h018M4720K2874J0101l1009o948k6596K418K8641M3386J3347r042l8933
14713D4941k6069k3591j9232J2835J4199m862k045j6114K0195J905L9322J6363
14701E7847P491L138j5523l0961p750k6472Q291J3845j1042k2391K7150l834j6324
14688a6535k0145j9273J6790P299J6225P800j5709J1234L6032J6072J9561K4917
14676H4268k9137m5876L0608q487j9881j5134r271j5943k6131K3798L1688J7694
14664A8196m1638k9136M792K1791R366J0428M7199K9345O204j8698j8055k3119
14652A6675j703o595J6285j9058k4918J868J5155l5993m541k3738k0607L3970
$$ plain form
14737 7618 -39933 -27081 -5191 5053 24417 15180 21074 47878 7158 -5763 -19249 -8018
14725 -8018 36702 59576 69677 38668 31720 5124 7542 36183 79569 92916 83874 44941
14713 44941 18872 -4719 -23951 -11116 3083 -1779 -3824 -19938 257 2162 41484 57847
14701 57847 65338 68476 52953 21992 14242 -12230 -3939 9906 -1136 -23527 3623 -211 -16535
14688 -16535 -36680 -55953 -39163 -31864 -15639 -7839 -23548 -12314 23718 39790 59351 84268
14676 84268 55131 9255 39863 31376 11495 -3639 -12910 -28853 -54984 -31186 502 18196
14664 18196 -23442 -52578 -47786 -25995 -16629 -6201 40998 70343 76547 57849 39794 16675
14652 16675 14972 8377 24662 5604 -19314 -17446 -2291 -38284 -42825 -66563 -87170 -53200
14640e3200J2353p319K7846N749k1304q257O503r864j7787J4402J4554J1181Q147
14627a6996j3309q288l1949j3948M758N772n978L3076J4145l996K6567j0546Q818
14614a1874J7299K3190j5716r365L439j5092k6254r602J1957l9534j3015N2909
14602c1658J6068k1664m241L4141J0248L7315K2891j2596l2511j170j1688N783
14590A0918k1144k1405m349p284j0140K6376m964R966L6378J9051K6537k576n200
14577E2164k7309l2489k6460q776Q313J7061J3776m414k0259k0706K6515M855
14565a7729j0760M8106Q356J0005k0260k9131J1891l3387k4531N93M8087N7337
14553D8577k2573R163J6655J8184n96m7984l417M1885M6808K652k7668m971l2220
$$ plain form
14640 -53200 -40847 -48166 -20320 -14571 -35875 -44132 -37629 -47493 -65280 -50878 -36324 -25143 -16996
14627 -16996 -30305 -38593 -70542 -84490 -79732 -73960 -79938 -46862 -32717 -36713 -10146 -20692 -11874
14614 -11874 5425 28615 12899 3534 6973 -8119 -34373 -43975 -32018 -71552 -84567 -31658
14602 -31658 -15590 -37254 -41495 -7354 2894 40209 63100 50504 17993 16823 5135 10918
14590 10918 -10226 -31631 -35980 -43264 -53404 -27028 -31992 -22026 14352 33403 59940 57364 52164
14577 52164 24855 -7634 -34094 -42870 -34557 -17496 -3720 -8134 -28393 -49099 -22584 -17729
14565 -17729 -28489 19617 27973 37978 17718 -11413 478 -32909 -57440 -56847 -8760 48577
14553 48577 26004 35167 51822 70006 69410 21426 18009 59894 106702 109354 81686 76715 44495
14540D4495n0928k8216m628J2296J7123p218M0134K1484K303j0841p628K537r536
14527B1377j1169j3380l103K7086p763j4626k3456J1488P141J1307k6412m052
14515b5562N2745R220n142L8103M823j8974j9998M836j0720K2963K5928r726j6915
14502E1581k3819j6630k0044k2994K3417L0073L7805L614r173k213l6486k3563
14490h432J1269J0592k7777j0301K995m607J2884K3077j067k2904Q721j6303l2130
14477e3983n7976Q043p68j485R004M2669M9076K604k8419j4046M4756N0702k091
14464D8086o3475j9142M347J057k2091J1554J164M2307K434m2785k2394K7881
14452c1057M8039K918J4523j0598k820n4562n5408l2660M5395O2728j5761j3461
$$ plain form
14540 44495 -6433 -34649 -39277 -26981 -9858 -17076 23058 44542 46845 36004 28376 30913 21377
14527 21377 10208 -3172 -6275 20811 13048 -1578 -25034 -13546 -6405 4902 -21510 -25562
14515 -25562 27183 36403 31261 69364 74187 55213 35215 40051 29331 52294 78222 68496 51581
14502 51581 27762 11132 -8912 -31906 -8489 21584 59389 63003 53830 51617 15131 -8432
14490 -8432 2837 13429 -14348 -24649 -21654 -26261 -13377 9700 8633 -14271 -5550 -21853 -53983
14477 -53983 -111959 -103916 -104684 -106169 -97165 -54496 -5420 -2816 -31235 -45281 -525 50177 48086
14464 48086 -15389 -34531 -30184 -29127 -51218 -39664 -38500 3807 6241 -36544 -58938 -31057
14452 -31057 16982 19900 34423 23825 21005 -33557 -88965 -121625 -76230 -13502 -29263 -42724
14440d2724J8654J3339k154l451j3620k7722J1424J3076K1090O0432j5452m3699
14428a0807L2087J5845l729m512j6634k2516j5070k3324l0105L7215J0849J3392
14416a7309N866m982k7181n321Q834K6646J4182K2260j6944p940K2164J818j2098
14403I995k2824M3509q461l6508k8123J1039R605j1721p712K3581j3190q713k4945
14390f4468l479Q9205N5184l1706m4493j7734r443M980o923j9528R661J5607j7621
14377d0758R409J2893L7256O0527n590p3447M95L7984m6760j9805j540J2701Q502
14364h133j5209N5K2679K1942J3584m4037k8922k947j3310J150L2588j653k9807
14351e2020p909Q613K1986Q858k880L0195O701Q990j113J946J8227L6973L068
$$ plain form
14440 -42724 -24070 -10731 -12885 -16336 -29956 -57678 -46254 -33178 -12088 48344 32892 -10807
14428 -10807 21280 37125 33396 28884 12250 -10266 -25336 -48660 -78765 -41550 -30701 -17309
14416 -17309 -11443 -16425 -43606 -48927 -40093 -13447 735 22995 6051 -1889 20275 22093 9995
14403 9995 -12829 30680 22219 -14289 -42412 -31373 -21768 -33489 -41201 -17620 -30810 -39523 -64468
14390 -64468 -67947 21258 76442 44736 243 -17491 -26934 -21954 -28877 -48405 -38744 -23137 -40758
14377 -40758 -31349 -18456 18800 79327 73737 290 785 38769 -7991 -27796 -29336 -16635 -8133
14364 -8133 -23342 -23287 -608 21334 34918 -9119 -38041 -40988 -54298 -53148 -20560 -22213 -52020
14351 -52020 -59929 -51316 -29330 -20472 -23352 6843 13544 22534 21421 23367 41594 78567 81635
14338H1635l4511j2909j0025K3193l4880j5850O141j6798J3980J0571K540j353
14326A1734J973k2423P86J258K885J4813N676k757j7589k2511K7934J3963J1120
14313B6862K240Q507K5056j9399k9134l901K8491k683n018l773N15K0154O302
14300E4219j9862r829q978P470q760l1489k2206L894P831j143J3963J8067j5209
14287a2032Q319J5012L5985Q130k408m713j3609j6513J4443J081L5966J7097m0317
14274D6441m916P780q37l756j2467o455k527q222m0567k5336J2405K4068J8422
14261D033j295n582j3189m942K7095Q135r622L183j2161p981J0986r397k516J8903
14247E650J0750k6406r890j0649k316k60J0118J0364R348m476k2582J1228m522
$$ plain form
14338 81635 47124 34215 24190 47383 12503 -3347 2794 -14004 -24 10547 13087 11734
14326 11734 13707 -8716 -7930 -6672 -3787 11026 16702 13945 -3644 -26155 1779 15742 26862
14313 26862 29102 37609 62665 43266 14132 10231 38722 36039 31021 27248 27763 47917 54219
14300 54219 34357 24528 15550 23020 14260 -17229 -39435 -35541 -27710 -28853 -14890 3177 -12032
14287 -12032 -3713 11299 47284 55414 53006 48293 34684 18171 32614 33695 69661 86758 46441
14274 46441 41525 49305 48468 44712 32245 25790 23263 15041 -25526 -50862 -38457 -14389 4033
14261 4033 2738 -2844 -16033 -20975 6120 14255 4633 7816 -4345 -12326 -1340 -10737 -13253 5650
14247 5650 16400 -10006 -19896 -30545 -32861 -33121 -23003 -12639 -3291 -7767 -30349 -19121 -23643
14234b3643N515J9646r981N36p6Q862j616P345j1004n627J3858K1036M881O840
14220C6572n722k9721K2034N0328K1078m2893m9771Q211k689j2413K0173J0396
14208B5583l4858m14K5346K6862K226K123n157J8333j7594K1062J090O631P058
14195G8291n9225n3047K5213l0090j6162L3407R14n310J7742K1323k4164j3494
14183b4602j005K7011r916j1239J8599J5507j528j384L1317k6046l0780J153k8182
14170d1095n262J4993j972N5197K1878k4652l0210r051P597K3813K3166j7145
14158A7257K1981M290m4341P649M2139O975k3689n0542K1060j9084J430Q061J3723
14145F909K4953L479J9936j3262j8228j5269k6240R055K389J474K9927q80J973
$$ plain form
14234 -23643 -18128 1518 -8463 -7927 -8003 859 -757 6588 -4416 -10043 3815 24851 29732 36572
14220 36572 30850 1129 23163 73491 94569 51676 1905 10116 7427 -4986 15187 25583
14208 25583 -9275 -9689 15657 42519 44745 46868 41711 60044 42450 63512 64602 71233 78291
14195 78291 19066 -33981 -8768 -38858 -55020 -21613 -20699 -26009 -8267 13056 -11108 -24602
14183 -24602 -25607 1404 -8512 -19751 -1152 14355 12827 11443 42760 16714 -14066 -12913 -41095
14170 -41095 -46357 -31364 -33336 21861 43739 19087 -11123 -20174 -12577 11236 34402 17257
14158 17257 39238 43528 -813 6836 48975 55950 32261 -18281 2779 -16305 -14875 -6814 6909
14145 6909 31862 35341 55277 42015 23787 8518 -17722 -8667 -6278 -4804 25123 24243 26216
14132B6216K6866K1290k2230k0397N222J9488l363k3356j4805j3615k6643j774
14120b7101k9839J8808q694M27o816J0915o349j4755L528j4941J0981M3793J2536
14107g507L359q942r459J002j5221p285J1563K2422j5936j9045j6912M1360P1974
14094E1373n0486m2014K0226o601m637K0066k798R810l1795P663R844J6338R604
14081F593J7135K4359L208j3319k2702r129K327O333P838l264K7608l4737m8870
14068c6620m0363o660N5712L0449M334M280l0716m7877N119Q651k4527j0761j357
14055i0336K32m1181K3942Q798j8157M8214N3912J9138K81r927J0674j8028M995
14042g443l5938R242k718k2013J3591L1481q561K0468J5631L2073l941k4121l2961
$$ plain form
14132 26216 53082 74372 52142 31745 36967 56455 53092 29736 14931 1316 -25327 -27101
14120 -27101 -56940 -38132 -46826 -46399 -53215 -42300 -48649 -63404 -59876 -74817 -63836 -20043 -7507
14107 -7507 -4148 -13090 -22549 -21547 -36768 -44053 -32490 -10068 -26004 -45049 -61961 -20601 51373
14094 51373 887 -41127 -20901 -27502 -32139 -12073 -14871 -5061 -36856 -29193 -19349 -3011 6593
14081 6593 23728 48087 51295 37976 15274 6145 8472 14805 22643 19379 46987 12250 -36620
14068 -36620 -76983 -83643 -27931 2518 6852 11132 -19584 -67461 -62342 -53691 -78218 -88979 -90336
14055 -90336 -90104 -131285 -107343 -98545 -116702 -68488 -14576 4562 4843 -5084 5590 -12438 -7443
14042 -7443 -43381 -34139 -36857 -58870 -45279 -13798 -22359 -1891 13740 45813 41872 17751 -15210
14029a5210p839K6349L1559k1507K159J7834J7502l310j2367J4718n7105j6910
14017b4127J5942n798r262L819M8941m1181j6007r744j8044l0880q595L4195J9669
14004d1072K0682L631p093K3017r940l0019O995K2403K7321n5017j9500K7096
13992c1496J9051j8110M559K2766O057N71L5938j4909k2825m5948m5614K3604
13980f6356N2333L4934N446j5972m698J5666o2543l5794k2720J9266K0370J1927
13968d8141J9484K6746Q524j8529j9948m15n407Q79J9715J0668N0967J4000n831
13955E2712R14j5301k0389J022K7259N607J960r287m5295j0062N048J4677o968
13942A897m1152j9023L7921J1691k9273L400L4037m1887K3457K5985o417J1950
$$ plain form
14029 -15210 -23049 3300 34859 13352 15511 33345 50847 47537 35170 49888 -7217 -24127
14017 -24127 -8185 -13983 -23245 -19426 29515 -11666 -27673 -37417 -55461 -86341 -94936 -60741 -41072
14004 -41072 -20390 -16759 -23852 -835 -10775 -40794 -33799 -11396 15925 -39092 -58592 -31496
13992 -31496 -12445 -30555 -25996 -3230 2827 3398 39336 24427 1602 -44346 -89960 -66356
13980 -66356 -14023 20911 26357 10385 5687 21353 -41190 -76984 -99704 -80438 -60068 -48141
13968 -48141 -28657 -1911 6613 -11916 -31864 -32279 -37686 -36807 -17092 -6424 44543 58543 52712
13955 52712 53626 38325 17936 18958 46217 51824 53784 44497 -798 -10860 -5812 8865 1897
13942 1897 -39255 -58278 -20357 -8666 -37939 -34539 -502 -42389 -18932 7053 636 12586
13930A2586O489J2513K046J4592j4651l817j9260j7750O962M5822N5735J0503
13918A11770j4914o0282j9898m314j5038p746J0605j6733j4475J9254J382J6074
13906E685l3909K4774M8052q01n9068j6547K5532J6454k3280j2472O334J479o262
13893b4029L6458j8623O725J8105J4720j8765R379k5020N814j8056M3563R459
13881C9730q155K0542l1249k4304J2585K199N416l1112j8388J9849K232l718M37
13868a3936R94M2221j8906J834m852J4182j6012l8776M1368K7041l0967J452r79
13855D664J0746J2089J0266m1297n0019j6864K0609K5566j2123l7965j1649J6717
13843f9260N7246M5536n312N2086J3590l5386n539J5801m9030k1370K6412j4152
$$ plain form
13930 12586 19075 31588 33634 48226 33575 29758 10498 -7252 -290 45532 101267 111770
13918 111770 96856 36574 16676 12362 -2676 -10422 183 -16550 -31025 -11771 -10389 5685
13906 5685 -28224 -3450 44602 43801 -15267 -31814 -6282 10172 -13108 -25580 -19246 -17767 -24029
13893 -24029 12429 -6194 531 18636 33356 14591 23970 -1050 4764 -13292 30271 39730
13881 39730 31575 52117 20868 -3436 9149 11348 16764 -14348 -32736 -12887 -10655 -14373 -13936
13868 -13936 -12942 29279 10373 12207 7355 21537 5525 -33251 8117 35158 4191 5643 4664
13855 4664 15410 27499 37765 -3532 -53551 -70415 -49806 -24240 -36363 -74328 -85977 -69260
13843 -69260 -12014 33522 28210 80296 93886 58500 52961 68762 19732 -1638 24774 10622
13831A0622l1076J6992l609R867J7593L8279n594k2043l2868J7952j470q93p773
13818E979K2675J5020n258L2795R191j1461r204j6601K244j0183m8846n307J5162
13805c794J0013n483k972K8125J0359j2253L418Q304R579N141n4825J4005M0138
13792D9755k78l8436M503k7515K1372K206q262k730J7981R314K5894k3482k6864
13779C458L485k1748j3459J1469K9510K2303j9099J4070L4885j2019j6719l065
13767C3071J6046l854Q446j2910o804k5049q016j1047K967l278K7187o948K298
13754A2109J4302j928k68K0663J2010m9711j4558p211M2179J1366j6001J6347
13742C9299J2877j5573K9624q144l9626M7797K4319l1279k3021j619j4310j0746
$$ plain form
13831 10622 -20454 -3462 -7071 2796 20389 58668 53074 31031 -1837 16115 14645 13752 5979
13818 5979 28654 43674 38416 71211 80402 68941 59737 43136 45380 35197 -13649 -18956 -3794
13805 -3794 6219 736 -2236 25889 36248 23995 27413 35717 45296 50437 -4388 9617 49755
13792 49755 49477 11041 15544 -11971 9401 11607 3345 615 18596 27910 53804 30322 3458
13779 3458 6943 -14805 -28264 -16795 12715 35018 15919 29989 64874 52855 36136 33071
13767 33071 49117 45263 53709 40799 33995 8946 930 -10117 -7150 -10428 16759 9811 12109
13754 12109 26411 24483 24215 44878 56888 7177 -7381 -14592 27587 38953 22952 39299
13742 39299 52176 36603 66227 58083 18457 66254 90573 59294 36273 34654 20344 9598
13730I598j7262L1700M8161m7612k3614k3620k0238p333l1172N0736J1168j9836
13718c9324J9590Q041n278J6305j2750Q183q260j0854q045O876m1358l5984j48
13705a03006L7695K7668K2775p810J438M3351L5351J6843m7407m2339K546Q757
13693d138L946M0463K5752k0938o5712l0633J1240J1729j4667J7881J1104L1143
13681A7170M2711K530n584j9393o6908N413J4580N8019k5358l9821k2966J7158
13669b2449J5192k5535k4088J0942N1182J8849j7099K765K4856j335k9451j7290
13657a3461K179j2222J781K2126J7214Q144k1179J5998j0782j0846J5434k9138
13645a4752l5305l4267L2697R073L9312P197J9205J6416N31k2610k4316L0750
$$ plain form
13730 9598 -7664 24036 72197 24585 971 -22649 -42887 -50220 -81392 -30656 -19488 -39324
13718 -39324 -19734 -11693 -16971 -666 -13416 -5233 -13493 -24347 -32392 -25516 -66874 -102858 -103006
13705 -103006 -65311 -37643 -14868 -22678 -21240 22111 57462 74305 26898 -15441 -12895 -4138
13693 -4138 -192 40271 66023 45085 -20627 -51260 -40020 -28291 -42958 -25077 -13973 17170
13681 17170 59881 62411 56827 37434 -29474 -24061 -9481 48538 23180 -16641 -39607 -22449
13669 -22449 -7257 -32792 -56880 -45938 5244 24093 6994 9759 34615 33280 3829 -13461
13657 -13461 -11282 -23504 -21723 403 17617 25761 4582 20580 9798 -1048 14386 -14752
13645 -14752 -50057 -84324 -51627 -42554 -3242 3955 23160 39576 40107 17497 -6819 23931
13633B3931J3750k6059j365J4370n772L9172K4900l6733j4497N913j8368k5399
13621f157p529J4374q217k496L7548J2299j6277Q143M3500J7768k3449m1469k2661
13608E377m4414O688K4082K4570J1349p110j7325O15L837l727q427M8n390J7538
13594G711K133j6812o462p182J0491J2836k836j8561K0464o235P02O1714O653
13581F4616j5779l152p865k0613j2988l8458K6555N839J9472M1867M893m7219
13569A7168n3151M623M4663K5753M8981K1482n0817l4009L9763q491k2599j3845
13557A9521K0491n699m8055j3653j8232J8457J3251P814L4962R114Q41K2801M377
13544F5990P608k6393m2971N708l811J3690K0710L032k5365k5043J2388k7923
$$ plain form
13633 23931 37681 11622 10257 24627 18855 58027 82927 46194 31697 37610 19242 -6157
13621 -6157 -13686 688 -7529 -10025 27523 39822 23545 31688 75188 92956 69507 28038 5377
13608 5377 -39037 -32349 -8267 16303 27652 20542 3217 3832 7669 3942 -4485 -4437 -9827 7711
13594 7711 9844 -6968 -13430 -20612 -10121 2715 -121 -18682 1782 -4453 -3751 57963 64616
13581 64616 48837 45685 37820 17207 4219 -34239 -7684 -1845 17627 59494 64387 17168
13569 17168 -35983 -31360 13303 39056 88037 109519 58702 24693 64456 55965 33366 19521
13557 19521 40012 34313 -13742 -27395 -45627 -27170 -13919 -6105 28857 37971 38812 61613 65990
13544 65990 73598 47205 4234 9942 6131 19821 40531 43563 18198 -6845 5543 -22380
13532b2380o12O1691L4865l6774l9354k4437K461K1690r162K0889j008j4634j1774
13519a8539j120K8814L5087k6498N370L1894j5434j9740J4936L2349J3427k1790
13507E8756P067r507L230k2655o986q897Q323K0034L5774l2257l3367J6733m649
13494C1599j2891L876O731K1468M4385r963k9764l4946K2182O907k0728M484J9298
13481E2638k8504j524J2162K8057K5853k0250k3337n182k7647O222J6409J0382
13469D5279m06j0114l3753k0983j946P342q334J8809J3273J0818M2599k2371l224
13456C6989N12o610j7156J511l2017l4242J1933J7857q829K0024J5032k3357K0447
13443B094O486l3497k58K0286O3551l91k8944M595m868j5834k1075j3478J1430
$$ plain form
13532 -22380 -22992 38699 73564 36790 -2564 -27001 -24540 -2850 -12012 8877 7869 -6765 -18539
13519 -18539 -19659 9155 44242 17744 23114 55008 39574 19834 34770 67119 80546 58756
13507 58756 65823 56316 59546 36891 29905 21008 29331 49365 85139 52882 19515 36248 31599
13494 31599 18708 22584 29315 50783 95168 85205 55441 20495 42677 49584 28856 33340 52638
13481 52638 24134 22610 34772 62829 88682 68432 45095 39913 12266 18488 34897 45279
13469 45279 44873 34759 1006 -19977 -21923 -14581 -22915 -4106 9167 19985 62584 40213 36989
13456 36989 37501 30891 13735 15246 -16771 -51013 -39080 -21223 -30052 -10028 5004 -18353 2094
13443 2094 8580 -24917 -25175 -4889 58662 58271 29327 33922 29054 13220 -7855 -21333 -9903
13430i903L699K7054n256N2824k8184m9629m2716K5036M7434K0056k2003m6891
13418b8479j4665k89M797J0449M2599K2313L3409j7597l9001l4423p602o834l550
13405c8873K623J8212L670J9580K1809k1899j3599q005j6922j3971K5718L6901
13393A5244J653Q511k9429K6713k6711k9821P001L0968L4193M8418j5241N502
13381G7001l6540l6249Q625r143P744K9754k3079l8562k1200L6718L5581L6421
13369F7071J8191m8829l4632p762j444Q644m671l7015K1204J7412j1142r077k4614
13356d6664N0684M7846J2148j1968m9552l0562J3574K0167k2296J305J9432M457
13344H571k6895l5777J0464L1169L4305k3902p116L5020N669l1309l2834r8M2797
$$ plain form
13430 -9903 -6204 20850 15594 68418 40234 -9395 -52111 -27075 20359 40415 18412 -28479
13418 -28479 -43144 -43433 -38636 -28187 14412 36725 70134 52537 13536 -20887 -28489 -35323 -38873
13405 -38873 -36250 -18038 -14368 5212 27021 5122 -8477 -16482 -33404 -47375 -21657 15244
13393 15244 16897 25408 -4021 22692 -4019 -33840 -26839 4129 38322 86740 71499 77001
13381 77001 40461 4212 12837 3694 11438 41192 18113 -20449 -41649 -4931 30650 67071
13369 67071 85262 36433 1801 -5961 -7405 1239 -3432 -40447 -19243 -1831 -12973 -22050 -46664
13356 -46664 4020 51866 64014 52046 2494 -28068 -14494 5673 -16623 -15318 4114 8571
13344 8571 -18324 -54101 -43637 -12468 21837 -2065 -9181 25839 31508 199 -32635 -32733 10064
13331A0064L3685J5141J3192K2907k1814k5524k0679m2407l796k992j0926J8341
13319a4808j023L1470j2263O086K8608r214j071l796j3969j0757O8004L9854J4353
13306A21474j0574k2421J0039n332l0216k2101n947K3145P550J2776m0532M641
13294D2502q503j1943K515l688K971L858K8181L2708P26k5573o2k5518n780J3935
13280D6329l3675M6608N0172K0986M21k3119n3941L4282Q191n369K3815l2713
13268H1987j6104N429J8099k829l1221J0597L8376K1352l963J3427M7689M7299
13256B30138O9296J4147L3239J6055L2335L5171M8831J14182J58005J59751J99836
13245A110986J55437J52102N5758m8869j66006k30718j90796j84354j26415j18295
$$ plain form
13331 10064 43749 58890 72082 94989 73175 47651 26972 -15435 -19231 -22223 -33149 -14808
13319 -14808 -15831 15639 3376 9462 38070 28856 27785 23989 10020 -737 67267 107121 121474
13306 121474 110900 88479 98518 93186 62970 40869 34922 58067 65617 78393 37861 42502
13294 42502 33999 22056 24571 20883 23854 27712 55893 88601 89327 63754 63692 38174 32394 46329
13280 46329 12654 59262 109434 130420 130841 107722 53781 88063 96254 90885 114700 81987
13268 81987 65883 71312 89411 86582 55361 65958 104334 125686 121723 135150 182839 230138
13256 230138 299434 313581 346820 362875 395210 430381 479212 593394 751399 911150 1110986
13245 1110986 1266423 1418525 1474283 1425414 1259408 1028690 837894 653540 527125 408830
13235D08830p9866m9415k6571k2345j5410l0372k7051j8969m48q946k9443j1329
13223H8665Lj356J6697J4359k2839j4850M414l7844k2716K7112K2034j1815L008
13210F4872J2476l4518L9269K3930J7127k7774J4747L8163Q967j8912J9072k0585
13198A36834P996J2253l7909l513l1537j0902j862K4287j1407o4374j5696K8081
13186C2251j412K6711j5909J9814k8274K4627K1696J680n175J8587n695l4515
13174E4386J293j8819n909K426j4849K619J6560r321R916J9586J3784M0005K7584
13161A39261L1639O8326J2286O730O9103P5668M7001L8406o2178o7543j20697
13150B38002p2966p9369R400J9339J5434j3497m9439k2743K5609O4982p299l1369
$$ plain form
13235 408830 328964 279549 252978 230633 215223 184851 157800 138831 138383 129437 99994 88665
13223 88665 88668 87312 104009 118368 95529 80679 85093 47249 24533 51645 73679 61864 64872
13210 64872 77348 42830 82099 106029 123156 95382 110129 148292 157259 138347 157419 136834
13198 136834 144830 157083 119174 115661 84124 73222 71360 95647 84240 19866 4170 32251
13186 32251 30839 57550 41641 61455 33181 57808 79504 81184 76009 94596 88901 54386
13174 54386 55679 36860 30951 33377 18528 21147 37707 28386 38302 57888 71672 111677 139261
13161 139261 170900 239226 251512 258242 327345 403013 450014 488420 426242 358699 238002
13150 238002 165036 85667 95067 114406 129840 116343 66904 44161 69770 134752 127453 96084
13138I6084j5895K42j6366P015R365K5228k3958L3734O5750m704k570R09J718
13125A76552O759j0244j5797j8837J6420K5189M84k9069j8156J7274M5726Q2689
13113B78990N8423Q9063Q4441K7981l0141j4834r5628p4430l0453K64m2302Q313
13101B59687K5630l5254m7997M1940K2826p310j9329K8005j4806l7694p4198k7395
13089A14105K293J1239q07L3o549q449n583j5049J9929P1068M9553q444j1769
13076B11570J5124K9494N3842j3223j5370l6371l523k622J6134R448O27L1218
13064B96348k108r961j113k7500n8175l5312J2778J0293j3267j5089J6551M5995
13052B19440M7191K4138n9658l0748J669J4480k0593J3392J8209l1943l1145p
$$ plain form
13138 96084 80189 80431 64065 71080 80445 105673 81715 115449 181199 176495 173925 174834 176552
13125 176552 183311 173067 157270 138433 154853 180042 180526 151457 133301 150575 196301 278990
13113 278990 337413 426476 510917 538898 508757 493923 398295 323865 293412 293676 251374 259687
13101 259687 285317 250063 202066 244006 266832 259522 240193 268198 253392 215698 141500 114105
13089 114105 116398 127637 126830 126863 120314 111865 106282 91233 111162 182230 231783 223339 211570
13076 211570 226694 256188 310030 296807 281437 245066 241543 238921 255055 264503 265130 296348
13064 296348 294240 284279 283166 255666 197491 162179 174957 185250 171983 156894 173445 219440
13052 219440 266631 290769 231111 200363 202032 216512 195919 209311 227520 195577 164432 164425
13040A64425k9155K5345k3115o537N6343P1444J4549K3303J8386J2605K7723L4862
13028C90178L0299J1685L3924P454K158j7538r863k723l8403L809j3508M499l9771
13015C62200j6363l6696o0273m5541J064J2993M587j9038J9538m112j996J6786
13003B33149J8136N506J1582m070J9356l6217j5957J1267m031L156l8919n2697
12991A50261m2335J8247l107m3991J1499K8250q570J299N7491l58k2914j0684
12979A35088J1408q619m041m822J7112R13N0382J2876j1666j5837K372k091j1168
12966A71907k604l420k0195J3264L7071N3403M277o0464n5936k7620j4397m957
12954I0329l1425j2745R983R290L7398N9953J2924j5015J3004k8628k9328J0209
$$ plain form
13040 164425 135270 160615 137500 130963 187306 258750 273299 296602 314988 327593 355316 390178
13028 390178 420477 432162 466086 473540 475698 458160 448297 445574 407171 410980 397472 401971 362200
13015 362200 345837 309141 248868 203327 204391 217384 221971 202933 222471 218359 216363 233149
13003 233149 251285 256791 268373 264303 283659 247442 231485 242752 238721 241877 202958 150261
12991 150261 107926 126173 123066 79075 90574 118824 110254 111553 169044 168686 145772 135088
12979 135088 146496 137877 133836 129014 146126 147039 197421 210297 198631 182794 185166 183075 171907
12966 171907 169303 165883 145688 158952 196023 249426 253703 193239 137303 109683 95286 90329
12954 90329 58904 46159 56142 65432 102830 162783 175707 160692 173696 145068 115740 125949
12942A25949L6780K8868j4338n881J9565L0917J5894q707L3378k5796K071k3261
12930B15439r384L891L3674J988j3008R694J1536l3712Q281L7157j0448O26j0479
12917B45255m1580p534M1655O7481M3717J4200Q391J1887j7371N3240L2502k5129
12905D26714k9597L1001N2350k1498n3781L2106n269j9707p4910l0181k371j4246
12893B90611j6620j5221N527l5737m3930Q797L9779J5557K5427k3863o1210l3696
12881A55421k1002N082L3334L1909J0584L9551R253l7311j722N5855O804j0769
12869B76989J2344K1001L4999q179k5568O962P721p108j04K3878J1138N702J5506
12856C75281J8751R370K5320l943K0266N2257L7578J7746J309j5671k1650L549
$$ plain form
12942 125949 162729 191597 177259 171378 190943 221860 237754 229047 262425 236629 238700 215439
12930 215439 206055 209946 243620 245608 232600 242294 253830 220118 228399 265556 255108 255734 245255
12917 245255 203675 196141 237796 305277 348994 363194 371585 383472 366101 419341 451843 426714
12905 426714 397117 428118 480468 458970 405189 437295 432026 412319 337409 307228 304857 290611
12893 290611 273991 258770 264297 228560 184630 193427 233206 248763 274190 250327 189117 155421
12881 155421 134419 139501 172835 204744 215328 254879 264132 226821 225099 280954 287758 276989
12869 276989 289333 310334 345333 337154 311586 318548 326269 319161 319057 342935 354073 359775 375281
12856 375281 394032 403402 428722 424779 445045 497302 534880 552626 553935 538264 516614 520163
12844E20163M4078J9598j17k9869L0637P2757J7990O2039L8257k9243j0436j8847
12832G17007r593K5181L8981P9103L7462N2227K9018K8741N3159R2685N1871L9181
12820A235023N2869P0802J13899Q8305O5931M9712N3738R3398J30009P3374O7928
12809B094988J27258J73062J45991J40322J36029J76097J89409J89665K49291
12800C622112K45890K89451K94700L02138L64472M17670N05635O13750P07131
12791G362949Q30643R72764J141811J439428J826875K310538K888519L604034
12783B2377561M434285N300518O229877P187084Q482678J0548207J3889344J8760203
12775I7209757K4844848L1785567L8521323M3401372M2765058K9996869R97157
$$ plain form
12844 520163 564241 583839 583722 553853 584490 657247 675237 737276 775533 746290 735854 717007
12832 717007 707414 732595 771576 850679 888141 940368 969386 998127 1051286 1143971 1195842 1235023
12820 1235023 1287892 1358694 1472593 1560898 1626829 1676541 1730279 1823677 1953686 2027060 2094988
12809 2094988 2222246 2395308 2541299 2681621 2817650 2993747 3183156 3372821 3622112
12800 3622112 3868002 4157453 4452153 4754291 5118763 5536433 6042068 6655818 7362949
12791 7362949 8193592 9166356 10308167 11747595 13574470 15885008 18773527 22377561
12783 22377561 26811846 32112364 38342241 45529325 54012003 64560210 78449554 97209757
12775 97209757 122054605 153840172 192361495 235762867 278527925 308524794 309521951
12768C09521951l4243763n6073410n6733076m4689880l0856264k0257427j3336359
12761E3331772r213441o899338n493698m562999l925664l456804k932604k443289
12753A4403935j952194j586665j284283j051812r00540p82827o53547n33870m79522
12744E178675m30364l55564l65877k86099k36017k40681j97053j86841j67412
12735B712767j02352j02637j07252p9915n0295m4116n5036q9841j03846p9741
12725A897736l5436o9393n0257p246k093j0576p4943o9588k1026k0486l1140m1966
12713A463586j8638N454k8214K3983N578J3829j9840j0259M9310K8394k0746k1983
12701A470454L8625L8970j0643M9364Q2610M2661K7691J9051K8387N6661Q2836
$$ plain form
12768 309521951 275278188 219204778 162471702 117781822 86925558 66668131 53331772
12761 53331772 44118331 37218993 31725295 27162296 23236632 19779828 16847224 14403935
12753 14403935 12451741 10865076 9580793 8528981 7628441 6845614 6192067 5658197 5178675
12744 5178675 4748311 4392747 4026870 3740771 3504754 3264073 3067020 2880179 2712767
12735 2712767 2610415 2507778 2400526 2320611 2270316 2226200 2171164 2081323 1977477 1897736
12725 1897736 1862300 1792907 1742650 1735404 1733311 1722735 1647792 1578204 1557178 1536692 1505552 1463586
12713 1463586 1444948 1450402 1422188 1446171 1451749 1465578 1445738 1435479 1484789 1513183 1492437 1470454
12701 1470454 1509079 1548049 1537406 1586770 1669380 1712041 1739732 1758783 1787170 1843831 1926667
12690A926667J12343J37876J12703J38040K05028J55544J97893K66546K54010
12681C506650L48275M12976N34152N84068P20447R19744J044606J197696J446327
12672A0714941J772323K071028K232817K229746J880918J212405N13791j99620
12664B2428349p76436j111318j394825j544116j595227j504934j215180p78840
12656A2507473k68307J44312N57811R79413J411509J887581K327710K817132L233402
12647B5598036L643574M066282M360761M295990L681378K018202n41527k687302
12639D4435394l717121m007008m182325m367499m293612l857049l125891k286311
12631A4598578j481163q84276l92703K0484L89950P67519J119177J406393J741237
$$ plain form
12690 1926667 2039010 2176886 2289589 2427629 2632657 2788201 2986094 3252640 3506650
12681 3506650 3854925 4267901 4802053 5386121 6106568 7026312 8070918 9268614 10714941
12672 10714941 12487264 14558292 16791109 19020855 20901773 22114178 22627969 22428349
12664 22428349 21651913 20540595 19145770 17601654 16006427 14501493 13286313 12507473
12656 12507473 12239166 12383478 12941289 13920702 15332211 17219792 19547502 22364634 25598036
12647 25598036 29241610 33307892 37668653 41964643 45646021 47664223 47122696 44435394
12639 44435394 40718273 36711265 32528940 28161441 23867829 20010780 16884889 14598578
12631 14598578 13117415 12233139 11840436 11860920 12250870 13018389 14137566 15543959 17285196
12622A7285196J898003J917536J775853J371232Q97095K63872n14698j355774
12614B3538315k023143k344782k387307k251287j888620j471978j024045o36244
12606I510909l32897J1087L55969O65399R83754J331434J717771K155629K672753
12597A9071808L133020L374360L357404K844668J895896O91303m15101j258226
12589C2695132j795453k105798k165859k173293j996871j747688j377858q49034
12581A8483278j62497M53114J169442J900016K660687L421914M175113M809712
12573C6910779N296131N488900N274810M634304L794432K744912J144247j525073
12565F3763442m525716o507927o962735o424931n482652m542552l629162k757041
$$ plain form
12622 17285196 19183199 21100735 22876588 24247820 25144915 25408787 24894089 23538315
12614 23538315 21515172 19170390 16783083 14531796 12643176 11171198 10147153 9510909
12606 9510909 9178012 9189099 9545068 10210467 11194221 12525655 14243426 16399055 19071808
12597 19071808 22204828 25579188 28936592 31781260 33677156 34368459 33953358 32695132
12589 32695132 30899679 28793881 26628022 24454729 22457858 20710170 19332312 18483278
12581 18483278 18320781 18773895 19943337 21843353 24504040 27925954 32101067 36910779
12573 36910779 42206910 47695810 52970620 57604924 61399356 64144268 65288515 63763442
12565 63763442 59237726 52729799 45767064 39342133 33859481 29316929 25687767 22930726
12557B2930726k066780j478498r05464l69607J84387P30996J231115J729156K103277
12548B4089308K321233K289987J833198J144971M07665k08269p02081j339558
12540B9836454k151456k976194l496858l492490l089012k517084k010670j568742
12532H533948j267010j034064q37022o85958n66851m18883l32531k60417j71273
12523B959939j91672j57904j27292j08046r7713r3323o2416o2488o830l0829o4056
12512A957370k7931l0743r9500j56900j54021j12272o0827p8800p3324o6493p6127
12501A020432l2638m1071O284K9333m8493l2281j1902P361j6441j7863r969K2613
12489H75365k0442j4051j9544L8862k0925k8893l5935l6728l1594m6627n2141
$$ plain form
12557 22930726 20863946 19385448 18479984 18110377 18294764 19025760 20256875 21986031 24089308
12548 24089308 26410541 28700528 30533726 31678697 32086362 31878093 31176012 29836454
12540 29836454 27684998 24708804 21211946 17719456 14630444 12113360 10102690 8533948
12532 8533948 7266938 6232874 5395852 4709894 4143043 3724160 3391629 3131212 2959939
12523 2959939 2768267 2610363 2483071 2375025 2277312 2183989 2121573 2059085 2052255 2021426 1957370
12512 1957370 1929439 1898696 1799196 1642296 1488275 1376003 1315176 1236376 1163052 1096559 1020432
12501 1020432 987794 946723 953007 982340 933847 901566 889664 897025 880584 862721 852752 875365
12489 875365 854923 840872 821328 860190 839265 810372 774437 737709 706115 659488 607347
12478F07347n3884j7247l572l3515J1570K1714j8683K873p9012m1419o060j5397
12466C74715l470p26J8005J9024R369P004J1524l5005k928j2529j5869j5549q50
12453C52715Q211j0497j20r963q900l2025N888J6215j2749L9256J1768k5641q911
12440C25247j8624p873N886M364l9273l9895k294p806K3580R37k5439M3656J0877
12427B73343l1875j6357J7018L729P496j4092J0227r531K8631J6327p569l9555
12415B37792L1863M0903m0024j1566J4915j4274J8854m113j0500K4844m523m2458
12403B41713j9926k5746J2779j1430k6632K1803J7447M395j3268j076K0730O301
12391B27090j7604K9170P263J9332N00j1803J3157R465l3396R072J2712L136J1173
$$ plain form
12478 607347 553463 536216 532644 499129 510699 532413 513730 516603 437591 396172 390112 374715
12466 374715 371245 370519 388524 407548 416917 423921 435445 400440 397512 384983 369114 353565 352715
12453 352715 360926 350429 350309 340346 331446 299421 305309 321524 308775 348031 359799 334158 325247
12440 325247 306623 298750 304636 309000 269727 229832 227538 219732 243312 244249 218810 262466 273343
12427 273343 241468 225111 242129 245858 253354 239262 249489 239958 268589 284916 277347 237792
12415 237792 269655 310558 270534 258968 273883 259609 278463 274350 263850 288694 284171 241713
12403 241713 221787 196041 208820 197390 170758 192561 210008 214403 201135 200059 220789 227090
12391 227090 209486 238656 245919 265251 265751 253948 267105 276570 243174 252246 264958 268094 279267
12378B79267J7353K6851K7488J2559m3598j9066M7040K7647J9900N89j7406l2973
12366C45651l9560L8627K0290j0142p4890j5381L5804N7633j7138m0947M2448
12355C42395L2258M4292M1679K5915J3995L0380L6196O6578O3555R1406J33401
12344I22050J54364J77868J87123J79877J83531K27521J81638J85499J41668R5300
12334B636439L3734k3071q4430k04064k27850j90919j97749j98268j43874j06322
12324A293626r8199q1090n2518n4417k1875L342J1754P4104J9927K8536L7181
12313A160371M6757N9814M9753P7965O1891P9704J03878J26685J18983J51792
12303B037593J94199K17574K87368L64874M33881N13889O33949P55830R65316
$$ plain form
12378 279267 296620 323471 350959 363518 319920 300854 347894 375541 395441 396030 378624 345651
12366 345651 306091 344718 365008 354866 279976 264595 300399 358032 340894 299947 342395
12355 342395 374653 418945 460624 486539 500534 530914 567110 633688 697243 788649 922050
12344 922050 1076414 1254282 1441405 1621282 1804813 2032334 2213972 2399471 2541139 2636439
12334 2636439 2670173 2647102 2562672 2358608 2130758 1939839 1742090 1543822 1399948 1293626
12324 1293626 1195427 1114337 1061819 1007402 985527 988869 1000623 1074727 1094654 1123190 1160371
12313 1160371 1207128 1266942 1316695 1394660 1456551 1536255 1640133 1766818 1885801 2037593
12303 2037593 2231792 2449366 2736734 3101608 3535489 4049378 4683327 5439157 6404473
12294F404473J165947J418845J660117J962607K256224K563548K850917L101761
12286B3384439L130002K874702K329439J239958l85919k093738l285156l642121
12278B3551606l507924l174154k671998k172662j753991j300348r61570o39236
12270G369723m36517k62546j44624j8814O4157J90892K23613K54349L29873M59520
12260H029626N26702O31831Q24111R89094J218617J549106J927586K341055K727808
12251B0765536L023842L174341L251755L215179K731650J785512O88859q9536
12243C8547138n08623o53956n06571l24464k13865l26833o89244j064160j317740
12234C2941682j562963j928946k312691k644923k725333k586805k387930k027375
$$ plain form
12294 6404473 7570420 8989265 10649382 12611989 14868213 17431761 20282678 23384439
12286 23384439 26514441 29389143 31718582 32958540 32572621 30478883 27193727 23551606
12278 23551606 20043682 16869528 14197530 12024868 10270877 8970529 8008959 7369723
12270 7369723 6933206 6670660 6526036 6507222 6571379 6762271 6985884 7240233 7570106 8029626
12260 8029626 8556328 9188159 10012270 11001364 12219981 13769087 15696673 18037728 20765536
12251 20765536 23789378 26963719 30215474 33430653 36162303 37947815 38636674 38547138
12243 38547138 38038515 37384559 36877988 36553524 36339659 36012826 35323582 34259422 32941682
12234 32941682 31378719 29449773 27137082 24492159 21766826 19180021 16792091 14764716
12226A4764716j559082j125883p87778m57583k09783K4429K34985M55569P57563
12217A2097153J079458J404682J761152K124104K481584K699295K725597K441650
12209B8814675J952709J336676O80217R1814j08714K53554Q48502J374408J569964
12200C6813805J419867Q82681j12837j351020k389690k988171l399746l624967
12192B5249922l651329l361002k759500k054803j410123r45326n53958k30531
12184A0283350R3700M45396Q04776J174442J559322J940366K231844K240646J949121
12175B2722963J358450Q82026L66099k58741r05404j246016j150598q72524n62679
12166B0333576k62919o124K97188N75692O26614M45507O3913m55761p94164j019182
$$ plain form
12226 14764716 13205634 12079751 11291973 10834390 10624607 10649036 10884021 11339590 12097153
12217 12097153 13176611 14581293 16342445 18466549 20948133 23647428 26373025 28814675
12209 28814675 30767384 32104060 32784277 32876091 32767377 33020931 33869433 35243841 36813805
12200 36813805 38233672 39116353 39003516 37652496 35262806 32274635 28874889 25249922
12192 25249922 21598593 18237591 15478091 13423288 12013165 11067839 10513881 10283350
12184 10283350 10377050 10822446 11627222 12801664 14360986 16301352 18533196 20773842 22722963
12175 22722963 24081413 24963439 25329538 25070797 24165393 22919377 21768779 20896255 20333576
12166 20333576 20070657 20064533 20361721 20937413 21564027 22009534 22073447 21617686 20823522 19804340
12156A9804340j150896j210922j292493j273087j211296j176115j066401r06379
12148A0516751q40773o99494m99396m05220l86310l91480l34875k16013j07024
12139F636166m1381M4037J11785K39130M20622N74115P14417R37819J223684J560155
12129A2420549K015850K347139K595097K641748K282161J415077O0842j527785
12121B4250678k726510l193719l042493k560212k030079j655583j386636j212466
12113F442980r97456q20594n97681m75786l88614l28216k25875j80684j36815
12104B291259j26159j18456j30384r7450r4228j07866q2893r7825j38049j02685
12094A195264m0430n0755q5534m3164n597k5533O75l99M9601K193M348M2480M9443
$$ plain form
12156 19804340 18653444 17442522 16150029 14876942 13665646 12489531 11423130 10516751
12148 10516751 9675978 8976484 8477088 8071868 7685558 7294078 6959203 6743190 6636166
12139 6636166 6594785 6638822 6750607 6989737 7410359 7984474 8698891 9636710 10860394 12420549
12129 12420549 14436399 16783538 19378635 22020383 24302544 25717621 25778463 24250678
12121 24250678 21524168 18330449 15287956 12727744 10697665 9042082 7655446 6442980
12113 6442980 5445524 4624930 4027249 3551463 3162849 2834633 2608758 2428074 2291259
12104 2291259 2165100 2046644 1916260 1818810 1724582 1616716 1533823 1435998 1297949 1195264
12094 1195264 1154834 1104079 1018545 975381 969784 944251 944926 944527 994128 996321 1000669 1043149 1092592
12081A092592M5445N8288P4232Q6411J09000J61607J51156J57704J71289R8297
12071B206021N2731K19o4403j29547j25227j46455j66527j93449j20833j15337
12061A197193j38125j38513j02880q9630n5369j7035o0416m7081n2007m8142j9456
12050D28539P373l214l0243J471J5958K2429L4804K317J1159k18p993m8439j2571
12037D21372l4342q7114o7788Q676P598J1027j1802J9407P048j4050k3603m6207
12025A90222o530j467J4462q493R449N451J9116k1093M546k8752k2194P040j5693
12012A46064j2951j6968K2943K5033J435Q417k7341k1595n1578J5053j4264l1654
12000D2594k6233J604K4460L4340k846k568L167O205R203k4361K9302K7414o87
$$ plain form
12081 1092592 1138037 1196325 1270557 1356968 1465968 1627575 1778731 1936435 2107724 2206021
12071 2206021 2258752 2258971 2194568 2065021 1939794 1793339 1626812 1433363 1312530 1197193
12061 1197193 1059068 920555 817675 728045 672676 655641 595225 548144 496137 447995 428539
12050 428539 435912 432698 402455 403926 419884 442313 477117 479434 490593 490375 482382 433943 421372
12037 421372 387030 299916 232128 240804 248402 259429 247627 267034 274082 260032 236429 190222
12025 190222 183692 182225 196687 188194 197643 203094 222210 201117 205663 176911 154717 161757 146064
12012 146064 133113 116145 139088 164121 165556 173973 146632 125037 73459 88512 74248 42594
12000 42594 16361 17965 42425 76765 73919 71351 74518 80723 89926 65565 94867 122281 121594
11987A21594M393m8419r540j167j709j0328r153M374l765j3473j2037R820k854
11974B7736J7718Oj2331K0634J953L0222o912K187o228K6460o140j5488K6047
11961A05864j6829l7795j7447J6639q313N796K0872M652m7631m8367k554j006
11949b6119L1323N3045L8134j048O229J1833j7567l4042j2902m109M5990k5400
11937F5367k4473P346m2780j5731Q5L6311L3347J0206l7244m2492L8919N2725
11925H1586K263J3257n360m0039J8402n686m2092k1764n713j2593N699M7404J0031
11912D5395o7285k432N1285L122o192J0910j2596K1833K0964J824M005k6307k3421
11899B1105R529L5040q785k2519o118r635J3530K6696J1090l2915N599K7959j5181
$$ plain form
11987 121594 125987 77568 68028 66861 65152 54824 45671 50045 46280 32807 20770 30590 27736
11974 27736 45454 45460 33129 53763 55716 85938 79026 81213 74985 101445 95305 79817 105864
11961 105864 89035 51240 33793 50432 42119 47915 68787 73439 25808 -22559 -25113 -26119
11949 -26119 5204 58249 96383 95335 101564 113397 95830 61788 48886 44777 90767 65367
11937 65367 40894 48240 5460 -10271 -10186 26125 59472 69678 32434 -10058 28861 81586
11925 81586 83849 97106 91746 51707 70109 64423 22331 567 -5146 -17739 -12040 35364 45395
11912 45395 -21890 -24322 26963 30085 23893 34803 22207 44040 65004 66828 70833 44526 21105
11899 21105 30634 65674 56889 34370 28252 18617 32147 58843 69933 37018 42617 70576 55395
11886E5395j5209J8056L3792o678k0982P454o472l800L2763K2616o469j4483P11
11873I6694J4096O573l3754l6106j6835K728k4372k534M1837K9425o248j1746
11861E9758j9640M0038L6845m2839k0002k650j9980r863j2468K3766R276L7704
11849G9945J3636k1188O673L6076j3527j6229R239l3153o803Q425J5546J4015
11837I2655L2713K7185K0907j5740m951N3672J404p588P46l475K4154l5875k2729
11824A63078j9886n100m544k985l5672k1936l317k1053r009K589J5613O644k7542
11811C6880l6484N164L989O2801M1479j7449K4457L7086j3609k5421N9496K3078
11799B01467J1519j4561j8472m7505q918j2913q124J953K9805Q003K0940j9129
$$ plain form
11886 55395 40186 58242 92034 85356 64374 71828 65356 61556 94319 116935 110466 95983 96694
11873 96694 110790 117363 83609 47503 30668 33396 9024 6490 48327 77752 71504 59758
11861 59758 40118 80156 117001 74162 54160 51510 31530 21667 9199 32965 42241 79945
11849 79945 93581 72393 79066 115142 101615 85386 94625 61472 54669 63094 78640 92655
11837 92655 125368 152553 173460 157720 152769 206441 207845 200257 201003 197528 221682 185807 163078
11824 163078 143192 138092 133548 130563 94891 72955 69638 48585 39576 42165 57778 64422 36880
11811 36880 396 5560 9549 72350 113829 96380 120837 157923 144314 118893 178389 201467
11799 201467 212986 198425 179953 132448 123530 110617 102493 104446 134251 142254 163194 144065
11787A44065k7986j0055K6933J9982N248J3906j8930l2167J1446J4413k4440K5262
11775A47677k3882l3824n1050k0356j1189K9531J7370k996K7029L4651L6499J6216
11763A65676l7787j6067k0811R259L2334Q560P0009L4263r4m4338j5674O57J0880
11750A96867k238j8172j3602K0207J2081p148n895m1615k1509k8135m2016j5063
11738C3762P037J5291j5592l07Q884K3497R974L1308l1448K0253L3985K2032K6513
11725A85189l3136k626p475n9708o3091O358p109j4062K1549M1596o784p89L2419
11712I2331L914k167O895J6996K3921J711q954K9260k4330o7241l1409K4180J8308
11699H3415K8087k2936k8570r392l8505k3950J7138l6755J6523N4958K2243k8004
$$ plain form
11787 144065 116079 106024 132957 152939 158187 172093 153163 120996 132442 146855 122415 147677
11775 147677 123795 89971 38921 18565 7376 36907 54277 51281 78310 112961 149460 165676
11763 165676 127889 111822 91011 100270 132604 141164 211173 245436 245342 201004 185330 185987 196867
11750 196867 194629 176457 162855 183062 195143 187995 182100 140485 118976 90841 48825 33762
11738 33762 40799 56090 40498 40191 49075 72572 82546 113854 82406 102659 136644 158676 185189
11725 185189 152053 149427 141952 82244 19153 25511 18402 4340 25889 67485 60701 59912 92331
11712 92331 96245 94078 100973 117969 141890 143601 134647 163907 139577 72336 40927 65107 83415
11699 83415 111502 88566 59996 50604 12099 -11851 5287 -31468 -14945 40013 62256 34252
11687C4252l836K6248j5j0134O074M1516N524R628J7007j7075j4535j6883K6023
11674A03794L1841p091K243l2177L892j2858j1273j2128j2207l2700m0844K7198
11662G690M3274k457k6844r953j5875K6177N7396m2797p776K4981k8301m8600
11650b3085o546J7795L9224j6641o441k645R153N1696K3516n039m2725m0437l5048
11637c7223l2566j6764j2799J1490m739N1247M0542L6192J6616j5482k1276k1625
11625f387K532N885k965L445M210J3477R91M333j0778j4206J6681L7019kk2270
11611C1965l0035K0078L090J8340j3137k2663R693K0361q834j9291J2291n7065
11599c5207j2977N814L0456r315j3179M5840L6268L6043o22k9359K2553j4684
$$ plain form
11687 34252 30416 56664 56649 46515 52589 94105 99629 109257 126264 109189 94654 77771 103794
11674 103794 135635 128544 130787 98610 102502 89644 78371 66243 54036 21336 -19508 7690
11662 7690 50964 48507 21663 11710 -4165 22012 79408 36611 28835 53816 25515 -23085
11650 -23085 -29631 -11836 27388 10747 4306 1661 10814 62510 86026 80987 38262 -2175 -37223
11637 -37223 -69789 -86553 -99352 -87862 -92601 -41354 -812 35380 51996 36514 15238 -6387
11625 -6387 -3855 2030 -935 2510 6720 20197 21188 25521 14743 537 17218 54237 54235 31965
11611 31965 1930 22008 25098 43438 30301 7638 17331 37692 28858 9567 21858 -35207
11599 -35207 -48184 -42370 -11914 -21229 -34408 11432 47700 83743 83121 53762 76315 61631
11587F1631l0384k5793L0093k0047k7573K5414J5085j8126j9371J7709J1427R184
11575B9249k4026j203J8820J0691M261j6001J168m774m757m188k1140M95l0941
11562d2346o334P694K7116j41M2247J4539m4762l3624Q895K0776j0521j2562q975
11549c7998P679M4841J7467k358p222R870q643j1077m301k7811k8947j9091P3635
11536F044M4433K9963k5907k2749k548L8703j869r334o0477l3836j2083j5899
11524f5559N596J1542J7950M760J1132L1002k0038k8738p035K2087L7260o54J386
11511B0691l6291k6565j1151J2398K9826J9019K9583K0866m4513j9554J2994k737
11499D566J4907Q747K8967J331k4110j4748n359l77l241J8152J377K415M404K0213
$$ plain form
11587 61631 31247 5454 35547 15500 -12073 13341 28426 10300 -9071 8638 20065 29249
11575 29249 5223 4020 22840 33531 37792 21791 22959 18185 13428 9240 -11900 -11405 -42346
11562 -42346 -48680 -40986 -13870 -14011 28236 42775 -1987 -35611 -26716 -5940 -16461 -29023 -37998
11549 -37998 -30319 14522 31989 29631 22409 32279 23636 12559 8258 -19553 -48500 -67591 6044
11536 6044 50477 80440 54533 31784 29236 67939 66070 56736 -3741 -37577 -49660 -65559
11524 -65559 -59963 -48421 -30471 -25711 -14579 16423 -3615 -32353 -39388 -17301 19959 19305 20691
11511 20691 -15600 -42165 -53316 -40918 -11092 7927 37510 58376 13863 -5691 7303 4566
11499 4566 19473 28220 57187 58518 34408 19660 14301 13924 10683 28835 30212 32627 37031 57244
11485E7244k9016j7075j820j5988n6226J4137q215k8507l177M9244N4558K9072
11473D4231K6198l604L971m5123l4675j6650K1527O008j9518k3317K0021M963
11461a5968K140q489o174K1734J3998Q432J6543j266P882p443m526l2383J1169
11448E649Q483k7725J8005O264l973J0279j613p729r412m430k9986l0844J2269
11435e4763L3578O057J0760J5718j5073Q405k3911k0032J3755p444L0966M3746
11423D1762L7239j8228m5279m166L3029j9285m799J5087o294J6199k4858k0789
11411c82j3461J5984q978n278J6704J2077J7402l8452k9409M841L8380O425k50
11398A5603K1649j3931q4R475k3853J164L1681K5389l6651j3282K6230l1309q272
$$ plain form
11485 57244 28228 11153 9333 -6655 -62881 -48744 -56959 -85466 -88643 -39399 15159 44231
11473 44231 70429 66825 70796 25673 -9002 -25652 -4125 1883 -17635 -40952 -20931 -15968
11461 -15968 -13828 -22317 -28491 -6757 7241 15673 32216 30950 38832 31389 26863 -5520 5649
11448 5649 14132 -13593 4412 10676 6703 16982 15369 7640 -1772 -6202 -36188 -67032 -54763
11435 -54763 -21185 -15128 -4368 11350 -3723 4682 -19229 -39261 -25506 -32950 -1984 41762
11423 41762 79001 60773 15494 11328 44357 25072 20273 35360 29066 45265 20407 -382
11411 -382 -13843 2141 -6837 -12115 4589 16666 34068 -4384 -33793 -28952 9428 15853 15603
11398 15603 37252 23321 23237 32712 8859 10023 41704 67093 30442 17160 43390 12081 3809
11385C809K9953p546j9172R756K629M76l954K1301p170n939N962k896R021r810
11371B6420k949M2540n57k2665j631n3247P260N3074m982o0666l810P5348J595
11358E5730j5564k8049j8374O210K2215K0262j1684n3400k2121j8834P472K5293
11346c0844K7261M3911M5074l7282p547k8163k1913l349q021m241K0842J9313
11334A5041L5983J5343j6141j2731k013j8952l2598j7827J9855N9416j8276l3099
11322e999j166L3112l917j6618K1350R437j6182N09j2607l2217J4753k0185J9230
11309a0500R821M3297k8324j8392K2986N8736j4870k0946j1935j6815k3760M188
11297f514K4623j1062l033M9787j3585m5342J524L4562J9519J6630J9096m1478
$$ plain form
11385 3809 33762 26216 7044 16800 19429 19905 15951 37252 30082 24143 30105 27209 36230 26420
11371 26420 23471 66011 65454 42789 41158 -12089 -4829 48245 43263 -17403 -21213 54135 55730
11358 55730 40166 12117 -6257 -47 22168 42430 30746 -22654 -44775 -63609 -56137 -30844
11346 -30844 -3583 40328 85402 48120 40573 12410 -9503 -12852 -20873 -25114 -4272 15041
11334 15041 51024 66367 50226 37495 35482 16530 -16068 -33895 -14040 45376 27100 -5999
11322 -5999 -7165 25947 22030 5412 26762 36199 20017 20526 7919 -24298 -9545 -29730 -10500
11309 -10500 -679 42618 14294 -4098 18888 77624 62754 41808 29873 13058 -10702 -6514
11297 -6514 18109 7047 4014 53801 40216 -5126 -3602 30960 50479 67109 86205 44727
11285D4727l3110K431m647j4530M500J6381l0571l3254j7243O575J5754N2401
11273I414K1235m396o843l4555o911R640k243L0140N719J0243k3021J311N916
11260A5649j0007L1488j0959P948M0510K2607j180o394j9957l0699J3832K2269
11248G5107l0575q821K0358L578j4844j550p465j3635L6142J8702j5479k0285
11236D1233k0330j9829l351n170J0382P333K3357J6714J1130K4505m7477m2717
11224d220J1750O953k0189J4397K7122j8842j5788N516K9983K4514l4230O690
11212C3656p600P349N203L567j7051n807j3871L64J8479J2318k5961j8376M2J4037
11198F349k0575J7858K0098K1107p195k4599j9494O137N994M539k7649j9775J7056
$$ plain form
11285 44727 11617 14048 9401 -5129 -629 15752 -14819 -48073 -65316 -58741 -42987 9414
11273 9414 30649 26253 19410 -15145 -22056 -12416 -14659 15481 21200 31443 8422 9733 15649
11260 15649 5642 37130 26171 34119 74629 97236 96056 89662 69705 39006 52838 75107
11248 75107 44532 35711 56069 59647 44803 43253 35788 22153 58295 76997 61518 41233
11236 41233 20903 1074 -2277 -7447 2935 10268 33625 50339 61469 85974 38497 -4220
11224 -4220 7530 14483 -5706 8691 35813 16971 1183 6699 36682 61196 26966 33656
11212 33656 26056 33405 38608 42175 25124 19317 5446 5810 24289 36607 10646 -7730 -7688 6349
11198 6349 -14226 3632 23730 44837 37642 13043 -6451 -314 5680 10219 -17430 -37205 -20149
11185b0149M5344K9681K4026p173n2293l2667J3695l3019J2983K6058J2646J7004
11173C6136k5711l4535J5342L213J3042M3315P9125m4788n5151o340k1315j7954
11161a5621j2574J6404P615q976k837K4017M27J5932o253k7879k2486L3305k0080
11148a9006j1166K8396O6768K2599m0460k9269L0864k2495m8756K8884K7337j2901
11136B0795Q495K9298k5243J379J4321j8297j6798J1254J2483n570Q353j7245
11124B3225l0364J3576K4681K7007k259l0534k537J6892j7143l5068K0541j1541
11112c524P173j1103P514K032J0398m914j9981K8120k7901j6017K1150J2528J2420
11099A7895J168k9097P114m191L3892j5159p284j4842l8215P394J356j8374L5488
$$ plain form
11185 -20149 25195 54876 78902 71729 19436 -13231 464 -32555 -19572 6486 19132 36136
11173 36136 10425 -24110 -8768 -5555 7487 50802 129927 85139 29988 23648 2333 -15621
11161 -15621 -28195 -11791 -4176 -13152 -15989 8028 8455 24387 18134 -9745 -32231 1074 -19006
11148 -19006 -30172 -1776 64992 87591 47131 17862 48726 26231 -22525 6359 33696 20795
11136 20795 29290 58588 33345 34724 49045 30748 13950 25204 37687 32117 40470 23225
11124 23225 -7139 6437 31118 58125 55866 25332 22795 39687 22544 -12524 8017 -3524
11112 -3524 3649 -7454 60 2092 12490 7576 -12405 15715 -12186 -28203 -7053 5475 17895
11099 17895 19063 -10034 -2920 -7111 26781 11622 4338 -10504 -48719 -41325 -39969 -58343 -22855
11086b2855Q0915n097L327J311O35k705q869K408j1813k2584k1859k5564k7177
11073e9927K7650K0429J0465J5688J0428p921J7210J2587l8116K5130p513R069
11061C5179J1008R116K8391P166k8770r105K5275j182o688J3242k9987k7655j8165
11048G825j3739J7092K6576K66R179k1875k1755l8841l7902n6842K0260L5145
11036g4611O3114O9395l1463k0554p338j6239L8956K2170j931o53j5139R993j1427
11023B4273l7325j2530J4396J3180j3482P710K7817J6352K3899N5883j7959o5497
11011C6717p0485r120L475o471j39J277K1224J960N8910N5531o39k7603L273K733
10997G0643j2320k6630O232P859m4094K8575K032j8106L3001j3822r961n115J6686
$$ plain form
11086 -22855 58060 52963 56290 57601 58236 55531 46662 49070 37257 14673 -7186 -32750 -59927
11073 -59927 -32277 -11848 -1383 14305 24733 16812 34022 46609 8493 33623 26110 35179
11061 35179 46187 55303 83694 90860 62090 52985 78260 77078 70390 83632 53645 25990 7825
11048 7825 -5914 11178 37754 38020 47199 25324 3569 -35272 -73174 -130016 -109756 -74611
11036 -74611 -11497 57898 26435 5881 -1457 -17696 21260 43430 41499 40846 25707 35700 24273
11023 24273 -13052 -25582 -11186 1994 -11488 -3778 24039 40391 64290 120173 102214 36717
11011 36717 -33768 -42888 -39413 -45884 -46023 -44746 -23522 -21562 37348 92879 92240 64637 67910 70643
10997 70643 58323 31693 37925 45784 1690 30265 32297 14191 47192 33370 23409 18294 34980
10984C4980K9224N127L5411k1657k3850J1914j8764k8819k010j5594k2632j6516
10972c3186J5771K9329J2943N2628L1776m2295j6795K8466J898m4366l2768R553
10960A2954L0494k7901q774n038J4077K413j9233K1058J0267J8182M885P109j7521
10947D2972k152N233j2969Pl962j7174j1856M1331j6583k6792j8281j9613J7332
10934b2507L5425j774n556L9142M337k2160j3044L7668L4969r834j1772m255J0164
10921G0803p369J6312K3525l53l8007k3730J1758q248n122j2921j260K647l296
10908B4739K7074l0600k9739m974k6717j75M5325L4757N636j9761L906L1787M1362
10895A02620M021p6884M157N3528L4892M3965k6808k2377o4011k5456k4090M0348
$$ plain form
10984 34980 64204 69331 104742 83085 59235 71149 52385 23566 21556 5962 -16670 -33186
10972 -33186 -17415 11914 24857 77485 109261 66966 50171 78637 80535 36169 3401 12954
10960 12954 43448 15547 6773 1735 15812 18225 -1008 20050 30317 48499 53384 60493 42972
10947 42972 40820 46053 33084 33091 29129 11955 99 41430 24847 -1945 -20226 -39839 -22507
10934 -22507 12918 11144 5588 44730 49067 26907 13863 51531 86500 76666 64894 60639 70803
10921 70803 63434 79746 103271 102918 64911 41181 52939 44691 39569 26648 25388 28035 24739
10908 24739 51813 21213 -8526 -13500 -40217 -40392 4933 39690 45326 25565 29471 61258 102620
10895 102620 106641 29757 33914 87442 122334 166299 139491 117114 53103 27647 3557 43905
10883D3905O0394K5913p3j4836J469j3133k9686k9740K0204K6962M0654L1098
10871A63131k2702J8565R1345N0483L5815Q9299J16012J29807J69246K21515K30517
10860A293033J90615J51366J07304Q7701L4012n062j33901k19504k05770j75961
10850A123833k11844k03325j36765j36579j12535m8040o8529m4131k39J9352j300
10839A79898q265k193K2090J303k7311j6714n0399m3206P769K7585n68M939k51
10826I4677K2728J2894j7446J6357j4392q624k1607Q994Q106o5101n8460J9529
10814b345J8433k3459j9925N16K2711K9325Q586k600K9540K4516j0366k9086P823
10801E3669J0681Q883j0458r318l454k099k4497J447L1570p705k1516J1420j3615
$$ plain form
10883 43905 104299 130212 130139 115303 116772 103639 73953 44213 64417 91379 132033 163131
10871 163131 140429 158994 250339 300822 336637 425936 541948 671755 841001 1062516 1293033
10860 1293033 1483648 1635014 1742318 1830019 1864031 1858969 1725068 1505564 1299794 1123833
10850 1123833 911989 708664 571899 435320 322785 274745 206216 162085 161846 181198 179898
10839 179898 171633 169440 191530 192833 165522 148808 98409 55203 62972 90557 89989 94928 94677
10826 94677 117405 130299 112853 129210 114818 106194 84587 93581 101687 36586 -21874 -2345
10814 -2345 16088 -7371 -27296 -26780 -4069 25256 33842 31242 60782 85298 74932 45846 53669
10801 53669 64350 73233 62775 53457 50003 47904 23407 24854 56424 48719 27203 38623 25008
10788B5008J0242M0490L8576o108k600p157l2040m362l064l0084j305M3323J3205
10775H4124k5327M681j6498m846k4350k7907r494K3942L0903K3246K4255K0521
10763A03250k2732k0721k5271o79Q27N0304K4183q503K697K1447Q78k5520K4240
10750A24400M6303j4930l0463k8342J6034j2904j947J1125j5539p868J0841k538
10738I4172m971J3327O395K8306K051k5875k3433J4529Q144m6182k8338L0940
10726F9065J3624n351j283L264j7299n620J6954N7227L3162M82j0486J5825M4936
10713B14500q634m607M0440j86k734L669N763k3324k4060j0024k2725K2308R386
10700A99772K034k6496j0226j6718n282J7193j1500l5094k8558j272J9387J5113
$$ plain form
10788 25008 35250 75740 114316 108208 105608 98451 66411 62049 58985 28901 27596 70919 84124
10775 84124 58797 63478 46980 42134 17784 -10123 -19617 4325 35228 58474 82729 103250
10763 103250 80518 59797 34526 33847 34674 84978 109161 100658 103355 124802 125680 100160 124400
10750 124400 170703 155773 125310 96968 113002 100098 98151 109276 93737 85869 96710 94172
10738 94172 89201 102528 108923 137229 139280 113405 89972 104501 112645 66463 38125 69065
10726 69065 82689 77338 76055 79319 62020 56400 73354 130581 163743 164225 153739 169564 214500
10713 214500 205866 201259 241699 241513 238779 242448 248211 224887 200827 190803 168078 190386 199772
10700 199772 201806 175310 165084 148366 143084 160277 148777 113683 85125 83853 103240 118353
10688A18353n318l4577P802K3112j4382N701K6455j2041j9128k290K4701k9678
10676H8710p885j8914J9638L779n940p343N85q316l5992l9292K4764j21J6802
10663C0475K131J6694K9925L0039N752j0044K5971L3828K6728j0700m0370m8435
10651I1994K7467M2208O973R82n066k6522n149k0564k02J3179j4221L957k2226
10638I2810n356J0562L4465m976l6299L0508K8227j914K2580q625o771J2753M4422
10625B12386L5903j3219M90j8053J6125L896J9168J4511J5136j9107M3807J9412
10613C30455l6667M047K9342K4799p15k6647j5419j2553k9536O962L1258K881
10601C08207Q770K1632M2471K3590J9246N8041J9044K0688J2717j1614J217J9113
$$ plain form
10688 118353 113035 78458 86260 109372 94990 100691 127146 115105 95977 93687 118388 88710
10676 88710 80825 61911 81549 85328 79388 72045 72630 64314 28322 -10970 13794 13673 30475
10663 30475 32606 49300 79225 109264 115016 104972 130943 164771 191499 180799 140429 91994
10651 91994 119461 161669 168642 169624 164558 138036 132887 112323 112121 125300 111079 115036 92810
10638 92810 87454 98016 132481 127505 91206 121714 149941 148027 170607 161982 155211 167964 212386
10625 212386 248289 235070 235560 217507 233632 237528 256696 271207 286343 267236 311043 330455
10613 330455 293788 297835 327177 351976 351261 324614 309195 296642 267106 274068 305326 308207
10601 308207 316977 338609 381080 404670 423916 481957 501001 521689 534406 522792 524009 543122
10589E43122K5478P103q053m1753l9736k6945k2218k1825n5153q1969l5194j8926
10577B23931L80l2409j0725k1462J9991K0454K6676P979l6523k4507j845l019
10565A68921n963J9805K6398J9590j3367o82m356K5121J235O532L6196K1675m899
10552B96206k6878P049L4670k3510P434K0069M4610M7764K1711L0065N0509K9772
10540E39471o1179o418j0855L8803M4739J6114K0665k6280J1077J158k4269L2743
10528E75769J3381j2530K7586O0480L2016J2572J0611N8284N4954J8123L2596
10517H83842M7803M6699J9108P3354O7527O4893Q2293J03423O7532K9786O1350
10506A547610L7407O9935Q5148R7090J12710J16997J48972J44518J79946J67225
$$ plain form
10589 543122 568600 575703 567650 525897 486161 459216 436998 415173 360020 278051 242857 223931
10577 223931 224311 191902 181177 159715 179706 200160 226836 234815 198292 173785 171940 168921
10565 168921 162958 182763 209161 228751 215384 214702 210346 235467 236702 243234 279430 301105 296206
10552 296206 269328 276377 311047 287537 294971 315040 359650 407414 429125 459190 509699 539471
10540 539471 478292 471874 461019 499822 544561 560675 581340 555060 566137 567295 543026 575769
10528 575769 589150 576620 604206 664686 696702 709274 719885 778169 833123 851246 883842
10517 883842 931645 978344 997452 1070806 1138333 1203226 1285519 1388942 1456474 1486260 1547610
10506 1547610 1585017 1654952 1740100 1837190 1949900 2066897 2215869 2360387 2540333 2707558
10496B707558J43945J42043J99556J86480J78658K30210K87998K90602L23238
10487D690288L51007L81612M48211N50489O53045P57365Q80349J103589J263080
10478A1079035J513469J797553K115609K476649K798095L001131L276498L898022
10470C1956061M979418O336191Q199480J0867305J4352934J8902801K4712908
10463A20307098L1657911L7561334L8949673L8082291L3124195K7519334J9806859
10456C47008695Q325186m591448k2257213l1575629l8810147l9522339l9552473
10449A79024632l8109639l4235263k8677214k0145304j2989000q421290n713867
10442C0733055l937702k901999k266021j943486j746436j640898j591098j480065
$$ plain form
10496 2707558 2851503 2993546 3193102 3379582 3558240 3788450 4076448 4367050 4690288
10487 4690288 5041295 5422907 5871118 6421607 7074652 7832017 8712366 9815955 11079035
10478 11079035 12592504 14390057 16505666 18982315 21780410 24781541 28058039 31956061
10470 31956061 36935479 43271670 51471150 62338455 76691389 95594190 120307098
10463 120307098 151965009 189526343 228476016 266558307 299682502 327201836 347008695
10456 347008695 355333881 350742433 328485220 296909591 258099444 218577105 179024632
10449 179024632 140914993 106679730 78002516 57857212 44868212 36446922 30733055
10442 30733055 26795353 23893354 21627333 19683847 17937411 16296513 14705415 13225350
10434A3225350j416810j409774j266766j103007r64652q08894o79122n11974m78854
10425D585497l87054l02950k73573k35909k44580k11967j12556j38096j79991
10416B498821j39969j01796j50078p9680n6196p1351p7367p1411n7842q6545j8737
10405A587849k6797o2787l6154k7365j9832l7764o0492l4412j2831j8421k6816
10394A224178p628k6443j0830m2085l7620K3206p834m0933j3734j0789l4119l5639
10382I79730l2939n3228m6084j2679k8080o6980j4580K5346m9837N946K988N312
10370G14915J6473j2579M055J873O703m3896j8983K1237K8330M1954l0609n9783
10358F69690m2549Q109j5392J7148N2733K9059l0506l5870J2891K8385M4405J4533
$$ plain form
10434 13225350 11808540 10398766 9132000 8028993 7064341 6255447 5576325 5064351 4585497
10425 4585497 4198443 3895493 3621920 3386011 3141431 2929464 2816908 2678812 2498821
10416 2498821 2358852 2257056 2106978 2027298 1971102 1899751 1822384 1750973 1693131 1606586 1587849
10405 1587849 1561052 1498265 1462111 1434746 1414914 1377150 1316658 1282246 1269415 1250994 1224178
10394 1224178 1216550 1190107 1179277 1137192 1099572 1122778 1114944 1074011 1060277 1049488 1015369 979730
10382 979730 946791 893563 847479 834800 806720 739740 725160 750506 700669 706615 709603 714915
10370 714915 731388 718809 722864 724737 731440 687544 668561 689798 718128 760082 729473 669690
10358 669690 627141 635250 619858 637006 689739 718798 688292 652422 665313 693698 738103 752636
10346G52636k3783q37n35l950j4255k7205j0279k6778j7039j9812R418l880n6967
10333E56734k5926j1308k2473k6214m6183n1098n9936k4503j1627k1650J2295
10322B68111N1356N723j2602l3507j6108m2139m3494n081M2241M7648J8533m9292
10310B31389M152j2550J046m0181n009J8062L0888J5065k0876k7353n5503N171
10298A44301K4236K1411j1568L5277J6240l1521j0415k3918L0280J6305k4659
10287A85969M672K2918L7064J8781k4977m8597j4018K6987L6011K5912j3371j1972
10275B45379M1920j7604j5605K2736J3415l5731j9493o588q094r676P479p433
10263B10705m6422k864l8837k7574L319M7640J4362L18j3371M7924l717l4778
$$ plain form
10346 752636 728853 728016 727481 723531 709276 682071 671792 645014 627975 608163 617581 613701 556734
10333 556734 530808 519500 497027 470813 424630 373532 313596 289093 277466 255816 268111
10322 268111 319467 325190 312588 279081 262973 220834 177340 172259 214500 262148 280681 231389
10310 231389 235541 222991 224037 183856 178847 196909 227797 242862 221986 194633 139130 144301
10298 144301 168537 189948 178380 213657 229897 198376 187961 164043 194323 210628 185969
10287 185969 190641 213559 250623 269404 244427 195830 181812 208799 244810 270722 257351 245379
10275 245379 287299 269695 254090 276826 290241 254510 235017 228429 220335 210659 218138 210705
10263 210705 164283 161419 122582 95008 98327 145967 160329 160647 147276 195200 191483 156705
10251A56705o570j6171j756L1J3929J1318p977J1946L050m822k571k756J9464
10238A73820j3380j0518R963K5989K0054J4315J8729k6134n031j0124j915l2376
10226A63392m0817J7292k189j0454k759j094O873m891L6200k1284j8637j2381
10214A09251j0871P628J4860L652J5778M2537J1550L470K2227L783m8978n956
10202A68931R54q619j0872K7115J6370O708m0828k2716j7569J3154K5880j8004
10190A40504j3661P578P856N4949J2542K2164l0777m5710p497R86R473N1534M415
10177B14356J0332L0587J5577K0343L6193L8679K9623J3390j6713k4816p628m5642
10165C14281m0704N0028N9849J3930l1835o9582K8897l0863l7561K2411K8684
$$ plain form
10251 156705 150135 133964 132208 132239 146168 157486 149509 161455 164505 159683 157112 154356 173820
10238 173820 160440 149922 159885 185874 205928 220243 238972 212838 207807 197683 195768 163392
10226 163392 122575 139867 137678 127224 124465 123371 130244 125353 161553 140269 121632 109251
10214 109251 98380 106008 120868 124520 140298 182835 194385 197855 220082 223865 174887 168931
10202 168931 169885 161266 150394 177509 193879 200587 159759 137043 119474 132628 158508 140504
10190 140504 126843 134421 142277 197226 209768 231932 201155 155445 147948 148934 158407 209941 214356
10177 214356 224688 255275 270852 291195 327388 366067 395690 409080 392367 367551 359923 314281
10165 314281 273577 323605 383454 397384 365549 295967 324864 294001 256440 278851 307535
10154C07535K6008M2481Q2851L8486m4996J1946L7465N369q920L9112O541N528
10142E49406j4493m8790n473j7441j7759O4393K2249M1839N403m3425k0609j2319
10130E02981L2195N7387L4919J2135m924j998M3867N2699M7516J7744j0256k4154
10118G60111j1115m5976m8158m8161o3944l222m0362o8018j4327j9215l0605l0754
10106C36254J3735J7132J7530K3967L0541L4431J6752N8346K9146j1447l7959
10095E28428L0508K5099k9517j5738l7188k0924j8050q4824p1822J2759q71k1608
10083B96252j2858j4625l0812m5924m677K2558k0809l8601j6502K7346L1604J8354
10071B11306N4118m9674n1050M5342L7064O2267K5437R923L1548M3933O9178J08198
$$ plain form
10154 307535 333543 376024 458875 497361 452365 464311 501776 507145 498225 537337 543878 549406
10142 549406 534913 486123 480650 463209 445450 509843 532092 573931 579334 535909 515300 502981
10130 502981 535176 592563 627482 639617 634693 632695 676562 729261 776777 794521 784265 760111
10118 760111 748996 703020 654862 606701 542757 539535 499173 431155 416828 397613 367008 336254
10106 336254 349989 367121 384651 408618 439159 473590 490342 548688 577834 566387 528428
10095 528428 558936 584035 554518 538780 501592 480668 462618 377794 305972 318731 317860 296252
10083 296252 283394 268769 237957 192033 187356 209914 189105 150504 134002 161348 192952 211306
10071 211306 265424 215750 164700 210042 247106 309373 334810 344733 376281 420214 489392 597590
10059E97590J38678J05129J83376K07901J91056K00807J53607J13592O6007J6294
10049A974037m3027j52488j90111k13871j68155j73852j98353j71997j34110j38271
10039C89802p0867k4674l2827J3986k4473j3950j3532j9819j7939p413Q690K4640
10027B11624n064l8148j6856L5879q401j5630q62R29J8668K3608l19K2552L4126
10014B62106J115k6028j8228L097M0538n042n8944J4017L6533l5698m3835J5959
10002A85590L9785K6050P146l8160j4544J831j4340J6142J5231k0228J5052K9610
9990B49165R698J2767k9034J4870R940M5135k9010k3717k213K1337J2963n4430
9978B37471m5200m1114o241N2768K7078J8391K0439K331j537L8797j1257m3390
$$ plain form
10059 597590 736268 841397 1024773 1232674 1423730 1624537 1778144 1891736 1957743 1974037
10049 1974037 1931010 1778522 1588411 1374540 1206385 1032533 834180 662183 528073 389802
10039 389802 318935 294261 261434 275420 250947 236997 223465 203646 185707 178294 186984 211624
10027 211624 206560 168412 151556 187435 179034 163404 162542 163471 182139 205747 205428 227980 262106
10014 262106 263221 237193 218965 222062 262600 257558 198614 212631 249164 213466 169631 185590
10002 185590 225375 251425 258571 220411 205867 207698 193358 209500 224731 204503 219555 249165
9990 249165 258863 271630 242596 257466 267406 312541 283531 259814 257601 278938 291901 237471
9978 237471 192271 151157 144916 197684 224762 243153 263592 265923 264386 303183 291926 248536
9966B48536J2718K228n890J3201J983m437P645l5789m8470N353k378M275L38K3037
9952B22350n275j488j8228J7094K1589l22P066l4024J1790j0014J711l3698p737
9939A70814L5562M287j5755l1757k8190Q750O1673M5674K9472p094K4037k2870
9927B74603o5931k3803P249M978J4288r37L2630L546k0090L80K6847o574K4565
9914B71751J1721J5129J9111j1612k3504n1139k0147M2538N815l3455L0223L8671
9902B95102P027J3427R752o872J5359j2462M1895N3244P986k572K4240L5869K4176
9889E06171K1970j0925j4592p018j662j6475N5204J8776m0304j3101K2328M6205
9877E66577K9241J8339M5750K9924M0093O3403O0944P0591M6592R8143J22958
$$ plain form
9966 248536 261254 263482 257592 270793 272776 268339 275984 240195 191725 197078 194700 198975 199313 222350
9952 222350 217075 215587 197359 214453 236042 235720 242786 208762 220552 210538 212249 178551 170814
9939 170814 206376 210663 194908 163151 134961 143711 205384 251058 280530 273436 297473 274603
9927 274603 208672 184869 192118 197096 211384 210447 243077 246623 226533 226913 253760 247186 271751
9914 271751 283472 298601 317712 306100 282596 231457 211310 253848 259663 226208 256431 295102
9902 295102 302129 315556 325308 318436 333795 321333 363228 416472 424458 421886 446126 481995 506171
9889 506171 528141 517216 502624 495606 493944 477469 532673 551449 511145 498044 520372 566577
9877 566577 595818 614157 659907 689831 729924 793327 854271 924862 971454 1069597 1192555
9866A192555N1697J04706J61603K01227K66128L07207L44783M50752N13894N14267
9856D108819M86064L53509J75897J8752j86113l36865m06647m08924k64338r7024
9846C443130J2894J39356K8391l25498n37839m54507k56021o9785M0772J10764
9836B131657J16057J96425K79183L08782L30624L06424L26808K93307J47767n7785
9826D379249k12060l78936m10465l34429l45614l20870k68677j59335j26905p4932
9816A747026o0432n2624k431n6925j8793J3686k61j0306M2797O0569N7030M3763
9804A763099P0152J12670P0417O8993J28378R5673R3733J12209R3631J74414J48922
9793B932291J71209J82792J79024K12086K31670K87723L43869M01145M23243M63210
$$ plain form
9866 1192555 1244252 1348958 1510561 1711788 1977916 2285123 2629906 3080658 3594552 4108819
9856 4108819 4594883 4948392 5124289 5143041 4956928 4620063 4213416 3804492 3540154 3443130
9846 3443130 3456024 3595380 3623771 3298273 2760434 2305927 2049906 1980121 2020893 2131657
9836 2131657 2247714 2444139 2723322 3032104 3362728 3669152 3995960 4289267 4437034 4379249
9826 4379249 4167189 3788253 3377788 3043359 2697745 2376875 2108198 1948863 1821958 1747026
9816 1747026 1686594 1633970 1631539 1574614 1555821 1569507 1569246 1558940 1601737 1662306 1719336 1763099
9804 1763099 1833251 1945921 2016338 2085331 2213709 2309382 2403115 2515324 2608955 2783369 2932291
9793 2932291 3103500 3286292 3465316 3677402 3909072 4196795 4540664 4941809 5365052 5828262
9783E828262N49827P12437Q09060R28808J133873J339156J590047J902202K321131
9774A7114803K819561L436833M075407M756095N383444N751642N728162N144563
9766E4210510L952267K272665N68054r41437j855268k165699j908543j319700
9758E2812849o47527k2494M58693Q31812J173688J541422J860423K046288J953740
9749F2008894J662824J308325J094023J208705J606097K078665K461014K527511
9741G5956058K218671J588021P44173j52543q35929j200335j218240r65850n35355
9732G5598671j33538K11545N73810R30781J315624J564061J639686J659499J824621
9723H5184760K387612L514301N039348O617941P655158P582773N866992K199475
$$ plain form
9783 5828262 6378089 7090526 7899586 8828394 9962267 11301423 12891470 14793672 17114803
9774 17114803 19934364 23371197 27446604 32202699 37586143 43337785 49065947 54210510
9766 54210510 58162777 60435442 61003496 60062059 58206791 56041092 54132549 52812849
9758 52812849 52165322 52142828 52601521 53433333 54607021 56148443 58008866 60055154 62008894
9749 62008894 63671718 64980043 66074066 67282771 68888868 70967533 73428547 75956058
9741 75956058 78174729 79762750 80506923 80354380 79518451 78318116 77099876 76134026 75598671
9732 75598671 75465133 75676678 76250488 77181269 78496893 80060954 81700640 83360139 85184760
9723 85184760 87572372 91086673 96126021 102743962 110399120 117981893 123848885 126048360
9715A26048360k796473p397649j0155329j0975555j0652147r872802q856425p597898
9707E7744082o107258m398913k714537j178250J70272J375788K457552L563870
9699E0912606M729518N756358O719633P436981P725674P421614O268867M383056
9691A01354307J766855j572045n395047q908192j1120943j1628301j0833762r343322
9683D4319550p609797o075632m747000l677213k828462k213013j739959j415215
9675A4013259j168110j002376q65233p00424o00409n22494m53010l22650j88060
9666H190493j49186j92112k12912k86252l39957l74943l75177m34514m10490l69736
9656E045214l53324k94228k60053j92496j68537j29779k0567Q7858J10899R2596
$$ plain form
9715 126048360 123251887 115854238 105698909 94723354 84071207 74198405 65341980 57744082
9707 57744082 51636824 47237911 44523374 43345124 43515396 44891184 47348736 50912606
9699 50912606 55642124 61398482 68118115 75555096 83280770 90702384 96971251 101354307
9691 101354307 103121162 101549117 96154070 87245878 76124935 64496634 53662872 44319550
9683 44319550 36709753 30634121 25887121 22209908 19381446 17168433 15428474 14013259
9675 14013259 12845149 11842773 10977540 10277116 9676707 9154213 8701203 8378553 8190493
9666 8190493 8041307 7849195 7636283 7350031 7010074 6635131 6259954 5825440 5414950 5045214
9656 5045214 4691890 4397662 4137609 3945113 3776576 3646797 3626230 3714088 3824987 3917583
9646C917583J28026J90317K00156J23276J01155N0820k5270j47115k34433l21354
9636C983161l20250k59230k23538k84632k74595k49950k38847j71817j42430j06161
9626A711711j31868q2782n8881n707M762l8478q648L6779M2845J4544j888n3899
9614A428490o2105j8525j07629j01789m5507n1801m4884l911o0232o1554R72j3175
9602H58350M800j1961k3292o2709n9768k8325m4940Q86J6674k6369k3144P257
9590F07459r814o089r621o348K9459K0320k3063l8127m6146k0273n975j2117k9983
9577D49682j7854Q43k7738m4697Q918m348k3565k3021M837J5303l0400K654L3120
9564C43734n325j018j1727M905l437J682n070L469K9796L0169l3497n010Q352
$$ plain form
9646 3917583 4045609 4235926 4436082 4559358 4660513 4711333 4686063 4538948 4304515 3983161
9636 3983161 3662911 3403681 3180143 2895511 2620916 2370966 2132119 1960302 1817872 1711711
9626 1711711 1579843 1497061 1438180 1432473 1437235 1398757 1390109 1426888 1469733 1484277 1482389 1428490
9614 1428490 1366385 1347860 1240231 1138442 1092935 1041134 996250 992339 932107 870553 871525 858350
9602 858350 863150 851189 827897 765188 705420 677095 632155 633041 649715 623346 600202 607459
9590 607459 597645 591556 581935 575587 605046 625366 602303 564176 518030 497757 491782 479665 449682
9577 449682 431828 432671 404933 360236 369154 364806 341241 318220 323057 338360 307960 310614 343734
9564 343734 338409 337391 325664 330569 327132 328814 323744 327213 357009 387178 353681 348671 357023
9551C57023j2829k8526j7292L8407l834o9152Q50K466M829l6478r590k7949O281
9538B04206L8490K8902J878j8903k7983n408J2763J6157J4341Q999k5373l366
9526B44703M183M0508L312m3640n9716k5799J2248j6383j0477k762J0449J6869
9514A73495o101M3818L8487K1596m478m2127m3305K2959J7406o201l650k8109
9502A83790n067L5133m4986l5682j9644R144K6599j9148j8025l5131K2444k793
9490I6634j8807Q315M7676M7955j0326k0147r256P418l773k586n418l2449M798
9477A10034M1564m733l0877m0121J8674j1311j5080n504J5804J262K2984J7651
9465A20347k7578j5811K5592r117l3311J4315L6126m6819n3224J3153L7386J7470
$$ plain form
9551 357023 344194 315668 298376 336783 332949 263797 264647 267113 271942 235464 225874 197925 204206
9538 204206 242696 271598 273476 254573 226590 221182 233945 250102 264443 273442 248069 244703
9526 244703 248886 289394 292706 249066 189350 163551 175799 159416 148939 146177 156626 173495
9514 173495 167394 211212 249699 271295 266817 224690 181385 204344 221750 215549 211899 183790
9502 183790 178723 213856 168870 133188 113544 122688 149287 130139 112114 76983 99427 96634
9490 96634 77827 86142 133818 181773 171447 151300 142044 149462 145689 143103 137685 105236 110034
9477 110034 151598 146865 115988 75867 94541 83230 68150 62646 78450 79712 102696 120347
9465 120347 92769 76958 102550 93433 60122 74437 110563 63744 10520 23673 61059 78529
9453G8529K8558r351k6807j4323K4051j847N513J3921N6109L9043k6281k2321
9441A44794j8034l6879p331j0065K3496J8610q742l1096j0270k512O101J9586
9429H7658k0178k1869O244J7329N0409L5189J2414j0818k4260k6957m0223j0569
9417E4369J3826j9721m656K1158k7983j7144J6690L1082J1151J2968k1408l229
9405F7103L489p58O058Q948J3313m905L6630L721j1264k2260k4312l0754k556
9392D2453k8560K815K4670j8766J1840L8461k2554Q422l969j6948j1908L119M3601
9379G2676L5939k2620m7540k1680n008J1169J9150K667k467K5500Q4895Q8929
9367B41610k534k8137k5323k8777K2940N4768N6398L7073L3231M3433j3768J6397
$$ plain form
9453 78529 107087 97736 70929 56606 80657 78810 84323 98244 154353 193396 167115 144794
9441 144794 126760 89881 82550 72485 95981 114591 105849 74753 64483 61971 68072 87658
9429 87658 67480 45611 51855 69184 119593 154782 167196 156378 132118 105161 64938 54369
9417 54369 68195 48474 43818 64976 36993 19849 36539 67621 78772 91740 70332 67103
9405 67103 70592 69834 75892 84840 98153 93248 129878 133599 122335 100075 75763 45009 42453
9392 42453 13893 16708 41378 22612 34452 72913 50359 58781 54812 37864 25956 29075 72676
9379 72676 108615 85995 38455 16775 11767 22936 42086 44753 42286 67786 152681 241610
9367 241610 239076 210939 185616 156839 179779 234547 290945 328018 361249 404682 390914 407311
9355D07311L2419J458l8882k0763k336o132k5929k1551M853J3465l2689L429N8802
9342C73455K7457J6730O390J9464J0831l715o892L0973M8705j2886j4760m48P407
9329E02711j3931k0270k0030l5249p119L616Q940J7276p152l8203J7404L7245
9317D45238N5799K1562j8668J1650Q149J4281L8758M1900P0899J9896j5440m9763
9305F44261k4712m1238q9331o4336j6234j2352k1168o7523j6305N6020j4623k7328
9293C05131k7424j7116P5896R0718M320m967M1740J9187M607R776J7655O700k3679
9280E02544k4341J9407R54j7709p7596r0264n4717n7681k1588l1206K285J1682
9268A61770M1253k6684m2190k3332Q515j456K3011k3621J5506l618k0947m6015
$$ plain form
9355 407311 439730 441188 402306 381543 379207 373075 347146 325595 330448 343913 311224 314653 373455
9342 373455 400912 417642 424032 443496 454327 450612 443720 474693 523398 510512 495752 495304 502711
9329 502711 488780 468510 448480 413231 406112 409728 418668 435944 428792 390589 407993 445238
9317 445238 501037 522599 503931 515581 523730 538011 576769 618669 689568 709464 694024 644261
9305 644261 619549 578311 488980 424644 408410 396058 374890 307367 291062 347082 332459 305131
9293 305131 277707 260591 336487 427205 431525 426558 468298 487485 492092 501868 519523 526223 502544
9280 502544 478203 497610 498564 480855 403259 312995 258278 200597 179009 147803 150088 161770
9268 161770 203023 176339 134149 110817 119332 117876 140887 117266 132772 129154 108207 62192
9256F2192k3446P425k0862j3965q288J8604J442M1830j3277m65K0796Q237j1235
9243F8988j582L2144j0737k5620j8967j2377P944J8616M3480K3831j5226M953
9231A15447k7658k0340p267j6827n009M7425J2921m709L2135P148l7712m5404
9219E0150l1672k104K5694L8314K5626k8745k749K0109L632j7593J680k567J4839
9206I4614K3472j5733o9303K2972J4435r528j0948J1828j2718J9616K9628L4518
9194A32853j2313K293K8380J7067k3089m9334L0300L9345O538j8250k1919M788
9182A36659N8944K0685N042MP0791M3919j2698m1130M622l925K477O2676P1151
9169D19217O9789L2774O1257P3513Q5259J20103J99336K60817K98437L70168N47868
$$ plain form
9256 62192 38746 46171 25309 11344 3056 21660 23102 64932 51655 51190 71986 80223 68988
9243 68988 67406 99550 88813 63193 44226 31849 39793 58409 101889 125720 110494 115447
9231 115447 87789 67449 60182 43355 38346 85771 98692 93983 126118 133266 95554 50150
9219 50150 18478 16374 42068 80382 106008 77263 74514 94623 98255 80662 82342 79775 94614
9206 94614 118086 102353 33050 56022 70457 60929 49981 61809 49091 68707 98335 132853
9194 132853 120540 122833 151213 168280 145191 95857 126157 165502 172040 153790 131871 136659
9182 136659 195603 216288 221330 221334 292125 336044 323346 282216 286838 282913 285390 348066 419217
9169 419217 489006 521780 583037 656550 741809 861912 1061248 1322065 1620502 1990670 2538538
9158B538538Q17151J195051J592879J896531J814149J331596J312853K180394
9150A4679142L693031N764605R021862O857860j0332649j3258905p070560l421958
9142E932428j827393j123235p24190n23294l25156k38484j93931j30301j07180
9133G39264o1990r6575n4260o297n6195n9656m4940J212l3282l6553l0803j4279
9121B45646m1524k5989K32m014j0979L7794j644n7666J1102M1996k581k3146l2436
9108A36791N44j0750q276J0841l2445K263L3970q509o6643j5729L1056K0399q217
9095H5295j3961j6114n410p518N4322N7749K1878j1140m7550m3281j1788R217
9083G1699j1206j8370K4942P718k2515k476k1856N610k4923J5789K0332M495k1250
$$ plain form
9158 2538538 3355689 4550740 6143619 8040150 9854299 11185895 12498748 14679142
9150 14679142 18372173 24136778 33158640 40016500 29683851 16424946 9354386 5932428
9142 5932428 4105035 2981800 2257610 1734316 1409160 1170676 976745 846444 739264
9133 739264 677274 580699 526439 520142 463947 404291 359351 360563 327281 290728 259925 245646
9121 245646 204122 178133 178365 174351 163372 201166 199522 141856 152958 194954 192373 169227 136791
9108 136791 137335 126585 118309 129150 96705 98968 132938 124429 57786 42057 73113 93512 85295
9095 85295 71334 55220 49810 42292 96614 154363 176241 165101 117551 74270 62482 71699
9083 71699 60493 42123 67065 74783 52268 49792 27936 33546 8623 24412 44744 49239 27989
9070B7989l3951J4474J0221K9883j6237k2797P092M563K2162l550j4783l3440
9058h374J0845K85j5777M2064J3497k3097j2691q502L816K2122J5042l106p1L2566
9044F8619L3124l1739m2447K2196J6418Q833j0322k2891Q78j7426k4597K0049
9032B0695K9078J4538j1213n734K2301K0639l3587k8988j5662M577L381l3630
9020a3605l9621L7473P264j9081R499L9947J2947J9556K9028K077r86j7648M4
9007F6894K6642k2286o4139m2810n237j4051J0532J8679P556J0867l05K24l0311
8994c7745J2076L8983q297q52j2534l50q310k3796M169J6634R21J7555J4001J5461
8980B7916l1931l7076k76J4853O759L4147M5822k826k1786L508j1940M863N3746
$$ plain form
9070 27989 -5962 8512 18733 48616 32379 9582 16674 21237 43399 39849 25066 -8374
9058 -8374 2471 2756 -13021 29043 42540 19443 6752 -1750 2066 24188 39230 36124 36053 68619
9044 68619 101743 70004 27557 49753 66171 75004 64682 41791 42669 25243 646 20695
9032 20695 49773 64311 53098 47364 69665 90304 56717 27729 12067 16644 20025 -13605
9020 -13605 -53226 -15753 -8489 -27570 -18071 21876 34823 54379 83407 85484 84498 66850 66894
9007 66894 93536 71250 7111 -35699 -40936 -54987 -44455 -25776 -18220 -7353 -7658 -7434 -37745
8994 -37745 -25669 13314 5017 4165 -8369 -8719 -17029 -40825 -36656 -20022 -19101 -1546 12455 27916
8980 27916 -4015 -41091 -41367 -26514 -19755 14392 60214 57388 35602 39110 27170 32033 85779
8967H5779K605j4488M870l423j5608k6138N629O565l0235k4446J7834l0267l5730
8954e7053K5727n009K1594J4517J2107j4681K2902M4797K9636l5202l1216J7640
8942D5759J483j7609K7804j5552k7809l9090K7054K8649J3820J8059L2393j033
8930I3928k5007r947l0582L79n0007m763J410L7304K2007R53J129j2218m5352
8917b0766k9441J4468J9493M3823O153j8854p604j7773P306J0783p049k9718n628
8904c4807M165K2899M978j3855J1741N4973l4815l889j7481k0344Q04K0352J2787
8891G508j836K858l033l2707L1214L5901J6219r324j2182k6553J5548N505J6919
8878D6037k778k9452l0225P963j2015L2267K7375l2686l0684J3162J0783J3134
$$ plain form
8967 85779 88384 73896 78766 75343 59735 33597 39226 45791 15556 -8890 8944 -21323 -57053
8954 -57053 -31326 -36335 -14741 -224 11883 -2798 20104 64901 94537 59335 28119 45759
8942 45759 47242 29633 57437 41885 14076 -25014 2040 30689 44509 62568 94961 93928
8930 93928 68921 58974 28392 28771 -21236 -25999 -24589 12715 34722 35675 36804 24586 -20766
8917 -20766 -50207 -35739 -16246 27577 33730 14876 7272 -10501 -3195 7588 539 -29179 -34807
8904 -34807 -30642 -7743 -2765 -16620 -4879 50094 15279 11390 -6091 -26435 -25631 -5279 7508
8891 7508 5672 8530 5497 -27210 4004 39905 56124 46800 34618 8065 23613 29118 46037
8878 46037 43259 13807 -16418 -8455 -20470 11797 39172 6486 -24198 -11036 -253 12881
8866A2881L4397L6899M0650J8036l6414l7741J752m0105o2360j3863P047M2210
8854C389M7034j8615l7558L0266J1814m1373k6593o794j4912j8397J2851Q397
8842e0491K3343P916j3458j9904r610J269K5614K8229L0991m660o326J3461L6205
8829F2579j9106n5199j8447j7997M8891O3057J9241l3422l0520q445p132m651
8817a151q304M2123r822j5917J6422K9515j6476k6216j0236K9782j6153n031R582
8804A8118J4689m256j1750l8423j6490J0837J5113P546K473R424J1620K641Q930
8791C0472j2646m02J0841l4275k191P727J1q455Q227Q08l0599l162K5069L275
8777e300j2548j0090L6745J9286o859P066k6207l4636K1071p375K6215L2580j972
$$ plain form
8866 12881 47278 84177 124827 142863 106449 68708 70460 30355 -32005 -45868 -38821 3389
8854 3389 50423 31808 -5750 24516 36330 -5043 -31636 -38430 -53342 -71739 -58888 -50491
8842 -50491 -27148 -19232 -32690 -52594 -62204 -60935 -35321 -7092 23899 19239 12913 26374 62579
8829 62579 43473 -11726 -30173 -48170 721 63778 83019 49597 19077 10632 3500 -1151
8817 -1151 -9455 32668 22846 6929 23351 52866 36390 10174 -62 29720 13567 8536 18118
8804 18118 32807 28551 16801 -21622 -38112 -27275 -12162 -4616 -2143 7281 18901 21542 30472
8791 30472 17826 17424 28265 -6010 -8201 -474 -463 -8918 -691 117 -30482 -33644 -8575 -5300
8777 -5300 -17848 -27938 8807 28093 21234 28300 2093 -32543 -11472 -18847 7368 39948 37976
8764C7976m0036k940K7204l8096k3646q633M0814J6175j0579p795M9016K5864
8752F5324j8736r675J0288L6329N060m7642r242k9734L290p405J1352n7366n617
8739e3774M0242O482L7167K5392j9778j241j6013o752n9916k4676J8696P2696
8727A8525M4337k7292l346K0478o529j5415l1008k826K5769j0216P271K4278K2868
8714F6894n010l2020j3230r497J2908q563L906J4970J9889o348R855L7077k5734
8701F5097p634P845j5789p348N559J0977Q696N540J3270k8205k7095J9369J0549
8688F0831j5670j5805L289j1398J9690n274R309J3726J5845l5639o929j4548j8183
8675g56J3752N2912K5098j4556J4658P090l089J7732j870j9098l2677k073K886
$$ plain form
8764 37976 -2060 -5000 22204 -15892 -39538 -48171 -7357 8818 -1761 -9556 39460 65324
8752 65324 46588 36913 47201 83530 88590 40948 31706 1972 5262 -2143 9209 -48157 -53774
8739 -53774 -13532 -7050 30117 55509 35731 34490 18477 11725 -48191 -72867 -54171 18525
8727 18525 62862 35570 32224 52702 46173 30758 -250 -3076 22693 12477 19748 44026 66894
8714 66894 61884 29864 16634 7137 20045 11482 15388 30358 50247 43899 53754 90831 65097
8701 65097 57463 65308 49519 42171 47730 58707 67403 72943 86213 58008 30913 50282 60831
8688 60831 45161 29356 32645 21247 40937 35663 44972 58698 74543 38904 31975 17427 -756
8675 -756 12996 65908 91006 76450 91108 98198 95109 112841 110971 91873 59196 57123 60009
8662F0009k8407O275q084Q814N722k407N2053L6984O544j9964P51m486q545M2304
8648A47563O3252Q8564N9358R1203N4599p1518j26573r6027n3001l8063r862l4267
8636G5228j2952P511q520L2395M232k3647j5222R111L0519K4340J5203J9367l5371
8623A22194P262K7181J6832J1L3549K1340R303K314m810k893K2651K0024M97j62
8609B75293J0018J9900j264n4928K8833J06393J45968J28126J62818J53225J30202
8598A104584j05578k92206k30303r6534p5264p4613J3603k5449m0193m748J640
8587A74939r783j8253m907j209l9419l4465pk7126M5275K8306R305n3567n3043
8574A6046L7594L2p743o152n020K8575M1156r00k9625p390q203k796N36M8009
$$ plain form
8662 60009 31602 37877 29793 38607 44329 41922 93975 130959 137503 117539 118290 113804 105259 147563
8648 147563 210815 299379 358737 449940 504539 433021 306448 210421 157420 119357 109495 75228
8636 75228 62276 69787 61267 93662 97894 74247 59025 68136 98655 122995 138198 157565 122194
8623 122194 129456 156637 173469 173480 207029 228369 237672 239986 235176 232283 254934 274958 275455 275293
8609 275293 285311 305211 303947 249019 277852 384245 530213 658339 821157 974382 1104584
8598 1104584 999006 706800 476497 379963 304699 230086 243689 218240 178047 173299 174939
8587 174939 165156 146903 141996 140787 101368 66903 66896 39770 85045 113351 122656 69089 16046
8574 16046 53640 53672 45929 39777 34757 63332 104488 103588 73963 66573 58370 55574 56110 104119
8560A04119K5243L049L2427R0322N1743N6708R7836J7900j07649j30626p5929
8549A65143l3077m2377l4735K7734J483q597o724j7400n4143l7538K0039J9377
8537h15K1672R022j5856K3337j9098k4538j3543l0000Q508L5923L3786k9739k6482
8524b7823M133Q765J3343K0379J109o497j4282J0241M8852J3580p175j676k6589
8511C6360m6935k3290K4820M238J6324L26m0779M008Q540K2028o40k0368L7040
8498B1672K5608k6416k5384L1299L1166M7292j6507l7736k3462R74J0678j2487
8486B6697j0982l2338K5933J7156M7731r35o0888k1849J4279m071J7234L2880
8474E0847j55k0839j8798j0627K2588J1500J6564l988K0620J0181m5529k7096
$$ plain form
8560 104119 129362 132411 164838 255160 306903 363611 461447 479347 371698 241072 165143
8549 165143 132066 89689 54954 82688 84171 75574 68850 51450 -2693 -40231 -20192 -815
8537 -815 20857 29879 14023 37360 18262 -6276 -19819 -49819 -41311 -5388 28398 -1341 -27823
8524 -27823 -23690 -14925 -1582 18797 19906 13409 -873 9368 58220 71800 64625 62949 36360
8511 36360 -10575 -33865 -9045 -4807 11517 11843 -28936 -24928 -16388 5640 5000 -15368 21672
8498 21672 47280 20864 -4520 26779 57945 105237 88730 50994 27532 28506 39184 26697
8486 26697 15715 -16623 9310 26466 74197 73262 12374 -9475 4804 733 17967 50847
8474 50847 50692 29853 11055 428 23016 34516 51080 47092 67712 77893 32364 5268
8462E268j6288o010k722K2773K7731m19K667k030p576j2649j3597l40K0200j699
8448A5309l216m8664m9645N205o961j0796N4163L9933N227l556j5019J1777K4190
8435A7947j7717k9263r741J7573N997L3265M273j0856L26L6049q864k0374K7791
8422D6406J8324l2452l721l484Q587m38l745P29L568K2671l7633l5682J3428N4451
8408E1009M624l3786l2484k8120l2647J9926r855P705M6222J1261k0611J3263
8396c493p55l1216j3786K1944L080J2381P0816J0364m9752m6554l8096P627r178
8383f6618n269N0268L7206J2399j5363j037M5214l282k5670o5184m2362L943L9884
8370c5871J2347j0246l4482k4029k5645j044K3074J9120J3837N9999K2140n225
$$ plain form
8462 5268 -11020 -17030 -19752 3021 30752 30333 33000 30970 23394 10745 -2852 -3192 17008 15309
8448 15309 12093 -36571 -86216 -81011 -87972 -98768 -44605 -4672 555 -3001 -18020 -6243 17947
8435 17947 230 -29033 -38774 -21201 -15204 18061 22334 11478 11804 47853 38989 18615 46406
8422 46406 64730 32278 28557 25073 33660 33222 29477 30206 33774 56445 18812 -16870 -3442 51009
8408 51009 55633 21847 -10637 -38757 -71404 -51478 -61333 -53628 -7406 3855 -16756 -3493
8396 -3493 -4248 -35464 -49250 -27306 -24226 -11845 58971 69335 19583 -26971 -65067 -57440 -66618
8383 -66618 -71887 -21619 15587 27986 12623 11586 56800 53518 27848 -37336 -79698 -75755 -35871
8370 -35871 -23524 -33770 -68252 -92281 -117926 -118970 -95896 -76776 -62939 -2940 19200 13975
8358A3975l628r265O877j5495p572J8808K3387n766k2510Q65Q666m797j9831r918
8344b6204o370o329L8361j4250k473N6752N1806l7713o2819k3156J8754L3813
8332B0172K6478j1506k7721P660N6353J4356k8357k6510j7775K0140j4730J9842
8320C8402p792j4418L2263J656n4384j2616M7837Q55j0711p532n268j304K7730
8307C4718K1736k537j5929q674k3092m0469J3484o122O505Q234M921N2774J1683
8294E7232n6186l5286M632Q888J2306N0N6528J4354n0684Q29R232O00n6583k6795
8280f0883J4643K0066K9397r718n506L2765n43j6419M843L1025J1475k1024J1310
8267D1431k9572j7616J6759M553L4313N898l5159k0449J1836j5531n838N656J3840
$$ plain form
8358 13975 10347 1082 7959 -7536 -15108 3700 27087 21321 -1189 -324 8342 3545 -16286 -26204
8344 -26204 -32574 -38903 -542 -14792 -17265 39487 91293 53580 -9239 -32395 -13641 20172
8332 20172 46650 35144 7423 15083 71436 85792 57435 30925 13150 33290 18560 38402
8320 38402 30610 16192 48455 50111 -4273 -16889 30948 31803 21092 13560 8292 6988 34718
8307 34718 56454 53917 37988 29314 6222 -34247 -20763 -26885 -20380 -12146 -7225 45549 57232
8294 57232 1046 -34240 -29608 -20720 -8414 -8364 48164 62518 11834 12663 21895 22495 -34088 -60883
8280 -60883 -46240 -26174 3223 -6495 -12001 20764 20221 3802 8645 39670 51145 30121 41431
8267 41431 11859 -5757 11002 15555 49868 55766 20607 158 11994 -3537 -9375 -3719 10121
8254A0121r808j0665q490k7307k481L068k8317J6546m92j4277P906K6382M8801
8241A0987K5302q697o158j1200k0526L3882K3202k0429k601L051k1637l3409J2762
8228a5471J2787k7995K7444M7637J1780l1395m9999m2631j1109J6576Q322K0495
8216c3559k0315n668M9647M3860O21k1494J559K4347K0644N776k0448k4793k9933
8203i756K059r609J1678L7776m713n6627j2729L6004J3929j8114m9610L5849M7644
8190B3781j1667m6438q349m358K8389O0945j2334L548J4041j8744j6167J6327
8178B8974L4070k2008j8253j3514j5162k6273K1803r948p605p055p882J6646j155
8165b7362L706L7213K0112k2377J0105K2210k2706j2518N1935K7874K3253j9769
$$ plain form
8254 10121 313 -10352 -18842 -46149 -48630 -45562 -73879 -57333 -57825 -72102 -64196 -37814 10987
8241 10987 36289 27592 21434 10234 -10292 23590 46792 26363 23762 26813 5176 -28233 -15471
8228 -15471 -2684 -30679 -3235 44402 56182 24787 -25212 -67843 -78952 -62376 -54054 -33559
8216 -33559 -53874 -59542 -9895 33965 34586 13092 14651 38998 59642 65418 44970 20177 -9756
8203 -9756 -7697 -17306 -5628 32148 27435 -29192 -41921 -5917 8012 -10102 -59712 -23863 23781
8190 23781 12114 -34324 -42673 -47031 -18642 42303 29969 33517 47558 28814 12647 28974
8178 28974 63044 41036 22783 9269 -5893 -32166 -10363 -20311 -27916 -34971 -42853 -26207 -27362
8165 -27362 -23656 13557 33669 11292 21397 43607 20901 8383 60318 88192 111445 91676
8153I1676l2079o469j4503j1259J9979j7369J4932L9430j8870N529j7698k7326
8141B5973k475J218P919p828j5456O059j4696J0825L1023k2589k940k536q997
8128E500N396j4844L988j3861p792k1955K2394K7090O668N202L4428L3788j9632
8115F6370J442k1771j7798K6129j8357j626J195l2404L7180o758r98n724k1467
8102E413j6730j1642j7379n295o081r893J6632K1256m077p906M092K5200L028
8089c382L0890M168J7054K0009k8448l9046k769K6310k023L1319Q430n0113q539
8076C860N919l1219J9148L690L3398o228k065j034j1146K9133l5398l7181L2210
8063C087M4618L0833n024O114M6836k2231j8234o059j2362n0187K0278n985L3897
$$ plain form
8153 91676 59597 53128 38625 27366 47345 29976 44908 84338 65468 70997 53299 25973
8141 25973 23498 24716 32635 24807 9351 15410 714 11539 42562 19973 17033 14497 5500
8128 5500 10896 -3948 40 -13821 -21613 -43568 -21174 5916 12584 17786 52214 86002 66370
8115 66370 67812 46041 28243 54372 36015 34389 35584 3180 40360 33602 32604 26880 5413
8102 5413 -11317 -22959 -40338 -45633 -51714 -61607 -44975 -23719 -27796 -35702 -31610 -6410 -3382
8089 -3382 27508 31676 48730 68739 40291 1245 -1524 24786 22763 54082 62512 12399 3860
8076 3860 9779 -21440 -2292 1398 34796 28568 26503 25469 14323 43456 8058 -29123 3087
8063 3087 47705 78538 73514 79628 126464 104233 85999 79940 67578 17391 37669 31684 65581
8050F5581J7227j3346j380j4716J905J4333J8071j864n083j2787Q05J2708L2291
8037A13745N572l8771P682M4259J3713j3817N386k5470o3869k064J3370N6400
8025A16136j0839K1132k262J005k9910J0542k3010j5992J0653L9399r429j5872
8013I1553r585m231J7669K7944N2591P4375J0012L6229O0835K2739q897o1066
8001C10168q6461m5369j8109N282L283L535r090j5847N7309K5991K108l7101n3655
7988A42044k0267L2707l6456l7767k4425L8245K7730j5935l0206J4998K8966l42
7976A19292M083k876p381k9395P591J7189J7674K8591j8201k4310J8511L7436
7964A68204K8544K2314r607J1202M4287J9327J0886k8085l8670m3964k9585J2577
$$ plain form
8050 65581 82808 69462 68082 53366 55271 69604 87675 85811 80728 67941 68746 81454 113745
8037 113745 119317 80546 88228 132487 146200 132383 137769 112299 48430 46366 59736 116136
8025 116136 105297 126429 124167 125172 95262 105804 82794 66802 77455 116854 107425 91553
8013 91553 81968 77737 95406 123350 175941 250316 260328 296557 357392 380131 371234 310168
8001 310168 223707 178338 160229 165511 168794 172329 163239 147392 204701 230692 232800 195699 142044
7988 142044 121777 154484 118028 80261 55836 94081 121811 105876 75670 90668 119634 119292
7976 119292 123375 120499 113118 83723 91314 108503 126177 154768 136567 112257 130768 168204
7964 168204 196748 219062 209455 220657 264944 284271 295157 267072 228402 184438 154853 167430
7952A67430J0916J9862M2684q411q0434l6336j4605Q379k4574R56k8972j3232
7940D3663J9160J742k4890k747q791M375m1400n3306L7188K4239L3416R491N369
7927D7509L0583K0334l5823j6969N4763M8l206K0565k976j6532j2130k8952l883
7914E3331l2496j2003J3842K6964k0414P1O913j8199p007Q330J8671l3649j4510
7901a0156k521q566j0855k3710J8890K630j8891K1353K9560R093R616k4730k8516
7888c6803J7761J6135l3435K0305L4369j5304l5478k8097J6721M4085k8781j2145
7876d0667j3k321l4948K0941M6389L9377Q54j0972p991r560K0982J1945m6655
7863a2639k0049K9979J0401r722l5991L1001J1571k1956J853L3976R16j5530O319
$$ plain form
7952 167430 178346 198208 240892 232481 152047 115711 101106 109485 84911 85867 56895 43663
7940 43663 62823 64565 39675 36928 28137 32512 -8888 -62194 -25006 -767 32649 42140 47509
7927 47509 78092 98426 62603 45634 100397 100445 97239 117804 114828 98296 86166 57214 53331
7914 53331 20835 8832 22674 49638 29224 29295 36208 18009 11002 19332 38003 4354 -10156
7901 -10156 -12677 -21243 -32098 -55808 -36918 -34288 -53179 -31826 -2266 6827 16443 -8287 -36803
7888 -36803 -19042 -2907 -36342 -16037 18332 3028 -32450 -60547 -43826 259 -28522 -40667
7876 -40667 -40680 -43001 -77949 -57008 -10619 28758 29612 18640 10649 1089 22071 34016 -12639
7863 -12639 -32688 -2709 7692 -2030 -38021 -7020 4551 -17405 -15552 18424 19340 3810 10129
7850A0129k969Q461K2864k895n0367k7306J8768L4673l4366k6113J7548O1098
7838B9525R475J2651j1037m1891l8096q515k1108Q432m277N8395M1482K0522j7549
7825C8009l8189J0836K7571l3511j9081l893j574M0009k381k6624j0808J7273
7813b363l2686k895j6535j4461Q286M1814o688K5429J1898k8444L459J742O190
7800e254m419K7807j714l4993o214O60J8936L5941l290m1828k1139o53K2495K1049
7786G384J7935m290j1090O35j6199k9627K2898K5489J2228m1489j4605k7027k1225
7773g8983K2974j1606m1194M341L5943L5132J8548P793k1985k0901j628m511J6170
7760c9907K5458j7576m300K7817R387j197L921j9100k4793P35j4253j4627J9041
$$ plain form
7850 10129 7160 15621 38485 35590 -14777 -42083 -23315 11358 -23008 -49121 -31573 29525
7838 29525 39000 51651 40614 -1277 -39373 -47888 -68996 -60564 -64841 -6446 35036 55558 38009
7825 38009 -180 10656 38227 4716 -14365 -18258 -19832 20177 17796 -8828 -19636 -2363
7813 -2363 -35049 -37944 -54479 -68940 -60654 -18840 -25528 -99 11799 -16645 -13186 -11444 -5254
7800 -5254 -9673 18134 16420 -18573 -24787 -24127 -5191 30750 27460 -14368 -35507 -36160 -13665 7384
7786 7384 25319 21029 9939 10574 -5625 -35252 -12354 13135 25363 -16126 -30731 -57758 -78983
7773 -78983 -56009 -67615 -108809 -104468 -68525 -33393 -14845 -7052 -29037 -49938 -51566 -56077 -39907
7760 -39907 -14449 -32025 -36325 -8508 879 -318 3603 -15497 -40290 -39555 -53808 -68435 -49394
7747d9394J1622M248k6969o283N6095J0316k8664p165J2079P597J1526j1756j684
7734a8432N7557J0299m6727n9608l7103L8770K8397k1002q760L6206M4802N165
7722B9564k3282Q246l0700l8286K8349K321R818j7318q907r638J2904N209L6492
7709D772K1052J2959j2752j8024J9211L7572l470l5242r369l588j9672M392P843
7696E684Q82j0089J402k9793l7831Q036R206O0800M6073m9558m3058J0430O947
7683b0869l1483k0526J7662L9280j1424k3085J1887J2882K996L377M124j7301
7671c2480J6089K631k9624k0906K6042j0989M172N310L0834k5285j5329j8951
7659f8486k514N3650L9950j1177m180l797l334j4304k6285K1039O5295j6834m6741
$$ plain form
7747 -49394 -37772 -33524 -60493 -66776 -10681 -365 -29029 -36194 -24115 -16518 -4992 -16748 -18432
7734 -18432 39125 49424 2697 -56911 -94014 -55244 -26847 -47849 -56609 -20403 24399 29564
7722 29564 6282 14528 -16172 -54458 -26109 -23788 -13970 -31288 -40195 -49833 -36929 -31720 4772
7709 4772 25824 38783 26031 8007 27218 64790 61320 26078 16709 13121 -6551 -2159 5684
7696 5684 6566 -3523 -2121 -31914 -69745 -61709 -52503 8297 54370 4812 -38246 -27816 -20869
7683 -20869 -52352 -72878 -55216 -15936 -27360 -50445 -38558 -25676 -22680 -19303 -15179 -32480
7671 -32480 -16391 -13760 -43384 -64290 -38248 -49237 -45065 -39755 -8921 -34206 -49535 -68486
7659 -68486 -71000 -17350 22600 11423 7243 3446 112 -14192 -40477 -19438 45857 29023 -17718
7646a7718k4413J1835J557k9433l708M2857L4404r219m9985l006j7451p184M65
7633g0999M3500M80o219R123Q405Q884j0623k5675J1480J2632k9012j7957k3350
7620h9331r200K9820M42p109J0912j9525J0305q335K4805j4447N815K2898L5725
7607g225O6570L1287q1190p6447P010Q693o984m753J2593L0988j6121m0415J2636
7594f3358N074k1491L3669K8203p959o813L828k7834J1788j2050k5105L2878M0921
7581h249m435k6666k1050J6142L3004L2678N3o1296k4236J0833K0310K1339J7373
7568E800l1166k4745K2305J2431R936N7870J2919k8674j2154J663k5538k0649
7556b0002j2111K7454j6927n5157J1361l044J9308K8241o620J5607j4160j4261
$$ plain form
7646 -17718 -42131 -30296 -28739 -58172 -61880 -19023 15381 6162 -43823 -46829 -64280 -71464 -70999
7633 -70999 -27499 -27019 -33238 -24115 -15710 -6826 -17449 -43124 -31644 -19012 -48024 -65981 -89331
7620 -89331 -98531 -68711 -68269 -75378 -64466 -83991 -73686 -82021 -57216 -71663 -65848 -42950 -7225
7607 -7225 59345 90632 9442 -67005 -59995 -51302 -58286 -63039 -50446 -19458 -35579 -75994 -63358
7594 -63358 -58284 -79775 -46106 -17903 -25862 -32675 -28847 -56681 -44893 -56943 -82048 -49170 -8249
7581 -8249 -12684 -39350 -60400 -44258 -11254 21424 21477 -39819 -64055 -53222 -32912 -11573 5800
7568 5800 -25366 -50111 -27806 -15375 -5439 52431 65350 36676 24522 26185 647 -20002
7556 -20002 -32113 -4659 -21586 -76743 -65382 -68426 -49118 -20877 -27497 -11890 -26050 -40311
7544d0311J9402j6138m6722K014P2136J9884m232k5891k8047K2738J9111N652
7532d04j1767k0977J6211j23J6351L236k1478P343J3222j60N310k2632l413j2960
7518c2241J3174K490r722p025k4827j280L5415J3113J0244J6690l4722K9738L1128
7505D2175k6748j6259n676L004j294j7588j2074j2112M217k6458J4210J2411M3207
7492A015J2213l2065j4157N255K6477q316m6202j302J656Q020K4291K2328k2422
7479b3209O65J0582K9408K2536k6750j1914p679j8172K2095J4144p868o346L2307
7466B9799o309P743o467J4501o4634n5585o55N2465l7502j3218K6228N2616K7927
7453B6909k7557l748K9553j7858j7729L7554Q658p78m8742m118L6672k1149N213
$$ plain form
7544 -40311 -20909 -37047 -83769 -81755 -9619 10265 6033 -19858 -47905 -25167 -6056 -404
7532 -404 -12171 -33148 -16937 -17060 -709 2527 -18951 -11608 1614 1454 6764 -15868 -19281 -32241
7518 -32241 -19067 -16577 -26299 -33324 -58151 -59431 -24016 -10903 -659 16031 -18691 11047 42175
7505 42175 15427 -832 -6508 -3504 -4798 -22386 -34460 -46572 -42355 -68813 -54603 -42192 1015
7492 1015 13228 -18837 -32994 -27739 -1262 -9578 -55780 -57082 -55426 -47406 -23115 -787 -23209
7479 -23209 -22544 -11962 17446 39982 13232 1318 -6361 -24533 -2438 11706 3838 -2508 29799
7466 29799 23490 31233 24766 39267 -25367 -80952 -81607 -29142 -66644 -79862 -53634 -1018 26909
7453 26909 -648 -4396 25157 7299 -10430 27124 35782 35004 -13738 -17856 18816 -2333 2880
7440B880K809p065j5465L3671M209k0487J3830j2359M075j4456k1766J5559j4865
7427b9430K3829j0333p604N302L7988j2253O085R21M158j3987l7982j0324J1875
7414c1755K0647r009j4054J930L763M3257J0154k8043j9022j2210N1251K5941
7402D2850J8780m339k2712J326J1379j5763k1133k9594J9899l9024k3088r22K8096
7389c4245j9498l13M5955K8546j0370L110J3683Q858L7728l0652j9030K2761L9836
7376H6369m6571m2024j1035m342J3956j0457n685k7328L3922k9382N18Q827j2315
7363d5547J2552j571j3155K4777L3619j533k8669Q821J3516j5753k0331K0295
7351a2979K1224K5756J5040l7784l7677j5312P654J0460j3011M4373k9983j0091
$$ plain form
7440 2880 5689 -1376 -16841 16830 21039 552 14382 2023 6098 -8358 -30124 -14565 -29430
7427 -29430 -5601 -15934 -23538 -18236 19752 7499 13584 14505 18663 4676 -33306 -43630 -31755
7414 -31755 -11108 -20117 -34171 -32241 -28478 14779 24933 -3110 -22132 -34342 16909 42850
7402 42850 61630 57291 34579 35905 47284 31521 10388 -19206 693 -38331 -61419 -62341 -34245
7389 -34245 -53743 -54056 -8101 20445 10075 13185 26868 35726 73454 42802 23772 46533 86369
7376 86369 39798 -2226 -13261 -17603 -3647 -14104 -19789 -47117 -13195 -42577 -42059 -33232 -45547
7363 -45547 -32995 -34566 -47721 -22944 10675 9142 -19527 -10706 2810 -12943 -33274 -12979
7351 -12979 8245 34001 49041 11257 -26420 -41732 -34078 -23618 -36629 7744 -22239 -32330
7339c2330J0172J6236M377K4768j6299K0199K1052R369l6217k9378Q922o397M3002
7326C7476L9158k1431l2973k3846J965k6228j7755K5136M2872L531j1758j0748
7314E399j2666m502m2218j4499k445N1237J3999M967R688m6093l0389j6223j1973
7301i5718R528J9348j7772N730N2789o183l6442k4993l2657j0599L5738N5938
7289d5293K9484l149Q802j7799k3953N273M3881O183K5841M6943r893j7248k447
7276D6625Q299j2014j3842j2793R010j5350k3501j4326j1928J7320K5501K7261
7264C0262k1756j884M5728j6628k6939j2676J8787R592M726J8386l8727m138m8866
7251d4133n465K3326L4640j8154r881O766M9064J2642r408n7920K4403J7491k6471
$$ plain form
7339 -32330 -22158 -5922 -1545 23223 6924 27123 48175 57544 21327 -8051 871 -5526 37476
7326 37476 76634 55203 22230 -1616 349 -25879 -43634 -18498 24374 27905 16147 5399
7314 5399 -7267 -11769 -53987 -68486 -70931 -19694 -5695 -728 8960 -37133 -67522 -83745 -95718
7301 -95718 -86190 -66842 -84614 -78884 -26095 -32278 -68720 -93713 -126370 -136969 -101231 -45293
7289 -45293 -15809 -18958 -10156 -27955 -51908 -46635 -2754 3429 29270 76213 66320 49072 46625
7276 46625 54924 42910 29068 16275 25285 9935 -13566 -27892 -39820 -22500 3001 30262
7264 30262 8506 6622 52350 35722 8783 -3893 14894 24486 29212 47598 8871 4733 -44133
7251 -44133 -49598 -26272 8368 -9786 -19667 -12901 36163 48805 39397 -18523 5880 23371 -3100
7238c100L4742J7894L122m6653m2699K1030M2530J0992N48m77j1968j7279q704
7225b2l1132R883O5057R391m5863P49Q532j2020l881N325m1781q822o059q833
7211e9476k150L6044J8275J1928l368j0369K3145L4632k7797J9122J865K999j2272
7198C2578l1639l6482K1234J9212k1621l7629J2503J8370J6229k490m0786k3935
7186g4456K8304K6147N767j8179k5106O064K3919M598O696L7496J2554k8391n2180
7173d6767m325M086M6481L1358m3055j8141L9612N866L97l5131j0731K996j2256
7160c9610l014Q918O0208J6062j0865J7888o520l4560j2057J8908P454j6727K1037
7147B7122J1058r644j5160k3021k740j0867J4954m93k869j3706l4992L5251O2247
$$ plain form
7238 -3100 31642 49536 52658 6005 -36694 -15664 26866 37858 38406 37929 25961 8682 -22
7225 -22 -31154 -21271 43786 53177 7314 8063 16595 4575 694 6019 -35762 -44584 -50643 -59476
7211 -59476 -61626 -25582 -7307 4621 1253 -9116 14029 48661 20864 39986 41851 44850 32578
7198 32578 939 -35543 -14309 4903 -16718 -54347 -41844 -23474 -7245 -9735 -50521 -74456
7186 -74456 -46152 -20005 -14238 -32417 -57523 -51459 -27540 -22942 -16246 21250 33804 5413 -46767
7173 -46767 -51092 -47006 -525 30833 -12222 -30363 9249 15115 15512 -19619 -30350 -27354 -39610
7160 -39610 -42624 -33706 26502 42564 31699 49587 43067 8507 -3550 15358 22812 6085 27122
7147 27122 38180 28536 13376 -9645 -12385 -23252 -8298 -8791 -11660 -25366 -60358 -25107 37140
7134C7140J3120l9817j3595j349l0634q215P890J5035J0682J2524q091m4912J1405
7121c8817K6777P318k8701K8902K3105k2118k5376q119o90J061j0712j4311J7587
7108d4094M7341K1868j1852K1087j756m2547q525j0819q888L6631K6756n311j1413
7095H478q701j1798k530j2882J390k074M566l0993L7118L5609l348J1043Q122
7082C4000j8559j477k4686j6390J2004n695j7778l2657L3269L9316J780P213n6414
7069d6074n2600K6099M7978P698m510k477o498J1533M6824o3476j2754N98m3781
7056i1440j0343J8821J8662J01242J9051k0019m0923j3716l7485j2576J9020k8347
7044g8053L2021m143k1051j2635M5975L7213j2879J291n464P711R187n321k3086
$$ plain form
7134 37140 50260 10443 -3152 -4501 -35135 -43350 -35460 -20425 -9743 2781 -5310 -50222 -38817
7121 -38817 -12040 -4722 -33423 -4521 18584 -3534 -28910 -37029 -37719 -36658 -47370 -61681 -44094
7108 -44094 3247 25115 13263 34350 32594 -9953 -18478 -29297 -38185 -1554 25202 19891 8478
7095 8478 -223 -12021 -14551 -27433 -26043 -28117 -23551 -54544 -17426 18183 14835 25878 34000
7082 34000 15441 13964 -10722 -27112 -15108 -20803 -38581 -71238 -37969 1347 3127 10340 -46074
7069 -46074 -98674 -72575 -24597 -16899 -21409 -23886 -30384 -18851 27973 -35503 -48257 -47659 -91440
7056 -91440 -101783 -82962 -64300 36942 55993 35974 -4949 -18665 -56150 -68726 -49706 -78053
7044 -78053 -46032 -50175 -71226 -83861 -37886 -673 -13552 -12261 -17725 -10014 -827 -6148 -29234
7031b9234O67m596Q480N5731k2879j204j3186j4342L2670K6956l7687J0472P030
7018A8878m5418J6629J13k4467J6825L5758K076j094m5888K7241j0858k3568J9621
7005a4152k385p816R342l124q444J312j9304N601m355k4923L9075j2686L474M3505
6991E120k8111l5741M3925L5043R527J4034j9105p6535J7513K8701K0272P862
6979B2505k3795k8210j7452K50l5055J3273q445J2151K6270p227J3176k4496J5029
6966d2026J2620m228Q277J5993K0374J530L0907K25k5069J2963Q941K2963m6613
6953A6857l3390k3654R092L718l7123K7430k687k1172N0010J0472k537k2243J0448
6940a4779K2654J7270l0703n3304M81N5439L3894o6723l0501K2076j2265k6424
$$ plain form
7031 -29234 -28567 -33163 -24683 31048 8169 6965 -6221 -20563 12107 39063 1376 11848 18878
7018 18878 -26540 -9911 -9798 -34265 -17440 18318 20394 19300 -26588 653 -10205 -33773 -14152
7005 -14152 -16537 -24353 -15011 -18135 -26579 -25267 -44571 -38970 -43325 -68248 -29173 -41859 -38385 5120
6991 5120 -22991 -58732 -14807 20236 29763 43797 24692 -51843 -34330 -5629 14643 22505
6979 22505 -1290 -29500 -46952 -46702 -81757 -68484 -76929 -64778 -38508 -45735 -32559 -57055 -42026
6966 -42026 -29406 -33634 -25357 -9364 11010 12540 43447 43672 18603 31566 40507 63470 16857
6953 16857 -16533 -40187 -31095 -27377 -64500 -37070 -39757 -60929 -10919 -447 -2984 -25227 -14779
6940 -14779 7875 25145 -5558 -58862 -58381 -2942 30952 -35771 -66272 -44196 -56461 -82885
6928h2885L6074K3418Q430R495l0701l8694J2732K4375j1957k2623k1652r743
6916a03731K4046L2747K0851O0580P890k5575M058O712j1329J6384j9928j8160
6904e455k7650m4482j9924L2613L1576J6299L0659p612J7475J4208N83N394q784
6891C4900j8518k7691j7709J652K7697M4801j0025J7276o262n6629L8189P129
6879C4810l0502j0457J625j2814q572J1867J6314j7222P496L213j6885k961M474
6866a9614J7647l3840j8852K3047L1531l5052k3781J5368n055j7048L9095L0036
6854C482r811J9029m688j0331k6461J0984K1170J1594q77k8268j5912R348l4309
6841e5050q162J2906L4387j3612m1269j1676J2420L6598L3216M2242K070K691
$$ plain form
6928 -82885 -46811 -23393 -14963 -5468 -36169 -74863 -62131 -37756 -49713 -72336 -93988 -103731
6916 -103731 -79685 -46938 -26087 34493 42383 16808 20866 27578 16249 32633 12705 -5455
6904 -5455 -33105 -77587 -97511 -64898 -33322 -17023 13636 6024 23499 37707 38290 43684 34900
6891 34900 16382 -11309 -29018 -27366 331 45132 35107 52383 46121 -10508 27681 34810
6879 34810 4308 -6149 -4524 -17338 -25910 -14043 2271 -14951 -7455 -4242 -21127 -24088 -19614
6866 -19614 -1967 -35807 -54659 -31612 -81 -35133 -58914 -43546 -48601 -65649 -26554 3482
6854 3482 -6329 12700 8012 -2319 -28780 -17796 3374 14968 14091 -14177 -30089 -20741 -55050
6841 -55050 -63212 -50306 -15919 -29531 -70800 -82476 -70056 -33458 -242 42000 44070 46761
6829D6761j0605J4189k4251k7036L6121r942l1858K580J1354o219j4236l0578
6817d3720J491J7205K4310o867k8307m321K6965O677K4334J7376J4661k1589l8036
6804i821k1843j92Q61J9594K9668M1820J2206n4241k8688J6528j6818K7140J8634
6791C4848m5386J4207m6269l3922M8629L8945M995k7411J3809R427Q804o42m718
6778A5316l0248p4212j0833K9784P7145K195j2221k3456l9045K0041O787j759
6766d0506M3463J2354j2411J0740P114j4942j8423k2808L1478M9582j3499m2887
6754a0745m718K3830l578L279j4683j1153j946j0194M1573N862k5844M871j5740
6741a9186r855K6427L8424j5170o645k5525J3802J7593R76p473k8j053j2490k6808
$$ plain form
6829 46761 36156 50345 26094 -942 35179 25237 -6621 -4041 7313 1094 -13142 -43720
6817 -43720 -42229 -25024 -714 -7581 -35888 -40209 -13244 -6567 17767 35143 49804 28215 -9821
6804 -9821 -31664 -31856 -30995 -11401 18267 60087 72293 18052 -10636 5892 -10926 16214 34848
6791 34848 -10538 3669 -42600 -76522 -27893 11052 16047 -11364 2445 11872 20676 20034 15316
6778 15316 -14932 -89144 -99977 -70193 6952 9147 -3074 -26530 -65575 -45534 -38747 -40506
6766 -40506 2957 15311 2900 13640 20754 5812 -12611 -35419 -3941 45641 32142 -10745
6754 -10745 -15463 8367 4789 8068 -6615 -17768 -19714 -29908 11665 17527 -8317 -3446 -19186
6741 -19186 -29041 -2614 35810 20640 13995 -11530 2272 19865 20841 13368 13340 12287 -203 -27011
6727b7011J8377O499j3069J9061J176k8613J261J5284m332p529P841N3624k6170
6714A6399r778m060K2347k824l8656O1829J3265k7962J2935n2100j8084J8062
6702h627K5879K2179o203k4972l583n548q285P992j1929o067k8689l1840K5784
6689e3909L0817K9535j673j5139K28j034j8285j499K780O377K8556N969L999K8232
6675D4954K6475k4615o75j9870K6027n580q300J9684O527j9838j2591j2117L413
6662B3494k4465k8966J8909J1921J4519J490l2103j7073J9770O1599O041k3290
6650C1846m1790k5363L563J5381j8536o802k538K1613p144K9275j6447J679M245
6637a1018j7120K5067K6183R093l6174M937k1686j2596L0294M5253Q533j932k4197
$$ plain form
6727 -27011 -8634 -2135 -15204 3857 5033 -23580 -22319 -7035 -11367 -18896 -11055 42569 16399
6714 16399 6621 2561 24908 22084 -16572 45257 58522 30560 43495 -8605 -26689 -8627
6702 -8627 17252 39431 33228 8256 4673 -875 -9160 -1168 -13097 -19164 -47853 -79693 -53909
6689 -53909 -23092 6443 4770 -10369 -10141 -11175 -29460 -30959 -28179 -21802 6754 12723 16722 44954
6675 44954 71429 46814 46139 26269 52296 46716 38416 58100 64627 44789 32198 20081 23494
6662 23494 -971 -29937 -11028 893 15412 16902 -15201 -32274 -12504 49095 55136 31846
6650 31846 -9944 -35307 -31744 -16363 -34899 -41701 -44239 -22626 -29770 -495 -16942 -15263 -11018
6637 -11018 -28138 -3071 23112 32205 -3969 968 -20718 -33314 -3020 42233 50766 48834 24637
6624B4637k0035r258j1769K8572R533k8911N526j3903m4767J2880P5947J5960
6612D4412J843R487j0417m9947o9504J4603K6228k3235Q061m70k3505J695M8935
6599b1814M1172J6191k6466k3859J2257j9043L839l0580k746J3629K0945N490
6587a0985J7057L769j3170P71o2923j3848J9430M7963q071m736L2634K6415m4652
6574a0346m2811M295M0175j1080k3440j9181j09L8475J7665N613r756n287P261
6561h526J5739q592n590L6431K9061m4518k9895L8200m858k8639k794O106K0579
6548A2704j3805j5331J5921n568m3506p343J8224k922k3905K4028K4160m985J1647
6535a0681j166j3017j1086K6068K2297N316n3587k3236N0279N697l9668r495j5309
$$ plain form
6624 24637 4602 -4656 -16425 12147 21680 -7231 -1705 -15608 -60375 -47495 28452 44412
6612 44412 46255 55742 45325 -4622 -74126 -59523 -33295 -56530 -48469 -48939 -72444 -70749 -21814
6599 -21814 19358 35549 9083 -14776 -2519 -21562 -17723 -48303 -51049 -37420 -16475 -10985
6587 -10985 6072 9841 -3329 -2558 -65481 -79329 -59899 -11936 -20007 -24743 7891 34306 -10346
6574 -10346 -53157 -48862 -8687 -19767 -43207 -62388 -62497 -24022 -6357 -744 -10500 -15787 -8526
6561 -8526 7213 -1379 -6969 29462 58523 14005 -15890 22310 17452 -11187 -13981 -7875 12704
6548 12704 -1101 -16432 -511 -6079 -49585 -56928 -38704 -41626 -65531 -41503 -17343 -22328 -10681
6535 -10681 -11847 -24864 -35950 -9882 12415 17731 -35856 -59092 -8813 -3116 -42784 -52279 -67588
6522f7588j0681L4349M1999q370n0620k3570j1045J0584M2581N7229j5318j9358
6510a9808L5080l32J0787k0354o183j5136j571k2435J2553L1663J6848K5282o400
6497C9994j9999k983l073M222J2386k5170l549j8027J7440j2281L4907K3483n688
6484D1662l1001r328k2885m987j1211K304J4695R185K3571l3601k4378o715k4959
6471g7648J2133J5337K8866j4247k6157n969L0114K3744J9383L185k2475j5552
6459b9286j5678l1824k2266M581K2885n929r96L2485L0813j3058k9080L3162q003
6446c2194J9982K9484m2786j0046J7456N2322j3333l3970O513K7283M804j5413
6434A0102m4609J8294J7922J065P319j2154n930J0408K5309M044o253k109l463
$$ plain form
6522 -67588 -78269 -43920 -1921 -10291 -60911 -84481 -95526 -84942 -42361 14868 -450 -19808
6510 -19808 15272 14940 25727 5373 -810 -15946 -17517 -39952 -27399 4264 21112 46394 39994
6497 39994 19995 17012 13939 18161 30547 5377 1828 -16199 1241 -11040 23867 47350 41662
6484 41662 10661 1333 -21552 -26539 -37750 -35446 -20751 -11566 12005 -21596 -45974 -52689 -77648
6471 -77648 -65515 -50178 -21312 -35559 -61716 -67685 -37571 -13827 5556 8741 -13734 -29286
6459 -29286 -44964 -76788 -99054 -94473 -71588 -77517 -78513 -46028 -15215 -28273 -57353 -24191 -32194
6446 -32194 -12212 17272 -25514 -35560 -18104 34218 20885 -13085 -6572 20711 25515 10102
6434 10102 -34507 -16213 1709 2774 10093 -2061 -7991 2417 27726 31770 25517 23408 19945
6421A9945n54j7222j2011L1454J9480J5138j5212j9035k6356m8223K7869r079
6409c3806o38l446J1318R806j1501j0403r235j4136o562M0809N450J5280j0398
6396a7462p521J0298K9711j5863j6067M444N2914R488m5603k2326L951k4146j8089
6383e6271Q996L6823K3141M260j5886Q167M1447k6527m0778k7146k6381M618K6059
6370c9478N7636K2992j5868k6944m8897M305J1151K1169L9451m48m52o591j4752
6357C274o920J694j6178L844M058L9516o908l5721J4916L2602m0640j4367J3640
6344g190l3037j1998K1055l567O576j202L0305L016p305m968Q544J0699p636m80
6330B812K7625m618o516m5613r703L4692L2794j7268l581k241j2811j4402L4429
$$ plain form
6421 19945 19391 2169 -9842 21612 41092 56230 41018 21983 -4373 -52596 -24727 -33806
6409 -33806 -34444 -37890 -26572 -16766 -28267 -38670 -47905 -62041 -68603 -27794 -22344 -7064 -17462
6396 -17462 -24983 -14685 15026 -837 -16904 -12460 40454 49942 4339 -17987 -14036 -38182 -56271
6383 -56271 -47275 -10452 12689 16949 1063 9230 50677 24150 -16628 -43774 -70155 -65537 -39478
6370 -39478 18158 41150 25282 -1662 -50559 -46254 -35103 -13934 25517 25069 24617 18026 3274
6357 3274 -3646 -1952 -18130 -14286 -10228 29288 22380 -13341 1575 34177 -6463 -20830 -7190
6344 -7190 -40227 -52225 -31170 -34737 -28161 -29363 942 3958 -3347 -8315 229 10928 3292 2812
6330 2812 30437 25819 19303 -26310 -36013 -1321 31473 14205 10624 8383 -4428 -18830 15599
6317A5599l4433j9921J1757l2395k2728J6749O5649K0158k3216J5563K3827j9951
6305A6658j5391j1282J8420o778J5299k7613R131L7178l4287l8904J7541j1224
6293c1252j5181M1150K1455l9187k2002J5085R360L1294O7N707K841n436j6164
6280b263N661L084J1580o210l3859J3326q6k233j9341j1925L7653K4081J0528
6267B9996n1864m7358n777L8004K7546r010K7128L1677k6332l9019k5141n987
6255e6137j6283r696L2511O880k7329j8878j1199K3314N6031K848p529j3819J6662
6242b2624J3781j8452q826j4074p220L9747O296j4799K4230K2534j608J7911q981
6229B7915l6305j7454n496q334r112O682L0579m356k419j2307j854j4050j2468
$$ plain form
6317 15599 -18834 -38755 -26998 -59393 -82121 -65372 277 20435 -2781 12782 36609 16658
6305 16658 1267 -10015 8405 1627 16926 -10687 -1556 35622 1335 -37569 -20028 -31252
6293 -31252 -46433 -5283 16172 -23015 -45017 -29932 -20572 10722 10789 16496 19337 13901 -2263
6280 -2263 3398 6482 18062 11852 -22007 -8681 -8767 -11000 -30341 -42266 -4613 19468 29996
6267 29996 -21868 -69226 -75003 -36999 -9453 -18463 8665 40342 14010 -25009 -50150 -56137
6255 -56137 -72420 -82116 -49605 -42725 -70054 -88932 -100131 -76817 -20786 -17938 -25467 -39286 -22624
6242 -22624 -8843 -27295 -36121 -50195 -57415 -17668 -11372 -26171 -1941 20593 18985 36896 27915
6229 27915 -8390 -25844 -31340 -39674 -48786 -42104 -11525 -15881 -18300 -30607 -32461 -46511 -58979
6216e8979N891K9923k635l238J9437K5547l4873j2654K4605j3038q749K300Q09
6203b5654O88J4395L596R893o892P83J0046j8368n7935J0198M7487l658j6642
6190c2063n624J2881M4764j3353k3665k4334l410L576j1987J1956R055J4716P530
6177i958j9489q452M1473P010n040p168P495N929O169K941j4539j0015J2093O5204
6163G3653J2258n5315j1629J3236r303k9830l5670O010p97j6366J2214L2353K3088
6150A3902J9719j7933l2884n4864j89O504k4376l3452K1936K2009K8274N5191
6138C837J5391m3070k8725K0267o105K3285K3487k9367j0043J5854k624m2334
6126f0147p409L3424K4144O803n668O0124J6185k1245l8387m3219k2679J7175
$$ plain form
6216 -58979 -53088 -23165 -25800 -29038 -9601 15946 -18927 -31581 -6976 -20014 -28763 -26463 -25654
6203 -25654 -24966 -10571 -6975 2918 -3974 -3191 6855 -11513 -69448 -59250 -11763 -15421 -32063
6190 -32063 -37687 -24806 19958 6605 -17060 -41394 -44804 -41228 -53215 -41259 -32204 -17488 -9958
6177 -9958 -29447 -37899 3574 10584 5544 -1624 5871 11800 17969 20910 6371 -3644 8449 73653
6163 73653 85911 30596 18967 32203 22900 -6930 -42600 -36590 -37387 -53753 -41539 -9186 13902
6150 13902 33621 15688 -17196 -72060 -72249 -65745 -90121 -123573 -101637 -79628 -51354 3837
6138 3837 19228 -23842 -52567 -32300 -38405 -15120 8367 -21000 -31043 -15189 -17813 -60147
6126 -60147 -67556 -34132 -9988 -3185 -8853 51271 67456 46211 7824 -35395 -58074 -40899
6114d0899N110J5569q42K2187R38k912Q128k4511M939K1000l231j1007N515P5
6100E9j4483J3715k7947J4517M662j9287j4425J5186K4333K0676j0432j5697Q275
6087h48k1397J2349R965k4686J4786J2722K5598J7152m7500n2678R040L9904J3775
6074H182K9292m8462N190M7582L610o770j3213o6768p106L3497L6211j3164o474
6061A607K6733p210k9650p162K7906K0666p901j9154K1132l4742j9139J0526J6946
6048E58L7014K5401K5704m0240n2560m375J547K1212N657J1669q043k4372l7924
6035c8752K6577J3099k066q648J6947j6600K884L4451O225n2800L6899M6998q219
6022E6995M058k9571m6889l145K0154o565J6674O798j3208j1248J5851J0814l7960
$$ plain form
6114 -40899 -35789 -20220 -21062 1125 2063 -849 7279 -17232 -12293 8707 5476 -5531 -16 59
6100 59 -14424 -709 -28656 -14139 -9477 -28764 -43189 -28003 -3670 17006 6574 -9123 -848
6087 -848 -22245 -9896 69 -24617 -9831 2891 28489 45641 -1859 -54537 -45497 -5593 8182
6074 8182 37474 -10988 -5798 41784 45394 38624 25411 -41357 -48463 -14966 21245 8081 1607
6061 1607 28340 21130 -8520 -15682 12224 32890 24989 5835 26967 -7775 -26914 -16388 558
6048 558 37572 62973 88677 48437 -4123 -8498 -6951 14261 19918 31587 23544 -828 -38752
6035 -38752 -12175 924 -1142 -9790 7157 -9443 -6559 27892 34117 -18683 18216 65214 56995
6022 56995 61053 31482 -15407 -18552 1602 -4963 11711 18509 5301 -5947 9904 20718 -17242
6009a7242m9198J284K4570M1417P608j7821m67L936l9259R149k5313q192M8963
5996b0565M1300J0166k2613l7173N442m9412L0970L2894L0261l2195r566J9487
5984a004p100M04j595k1447k0419K1850K6852K437n8425L4226M4559k1787j3727
5971a5176q705O597O112K3525M7895j688N089j9951l9950J1509J2893j2367k0894
5958e111L116O502l110j064L9311J84J4101l264j0850n7080J0077j681K8253m097
5944A5287o392Q547J5498j494J6840K476k109J7564r842m3704j5369J7719J8230
5931C3251J013L650l6266j0023O755k3576l738k0650k1447L4667N799k0248J8065
5918c2748L1818l5283j617K9168K7429L915L1981O587p490m8061m1909N454K678
$$ plain form
6009 -17242 -66440 -65156 -40586 831 8439 -9382 -9849 -5913 -45172 -36023 -61336 -69528 -20565
5996 -20565 20735 30901 8288 -28885 -23443 -72855 -41885 -8991 21270 -10925 -20491 -1004
5984 -1004 -8104 -7700 -9295 -30742 -51161 -29311 -2459 -22 -58447 -24221 20338 -1449 -15176
5971 -15176 -23881 -17284 -11172 12353 60248 58560 63649 43698 3748 15257 28150 15783 -5111
5958 -5111 -1995 4507 1397 333 39644 39828 53929 50665 39815 -17265 -7188 -8869 19384 15287
5944 15287 8895 17442 32940 31446 48286 50762 48653 66217 56375 12671 -2698 15021 33251
5931 33251 34264 37914 1648 -8375 -1620 -25196 -28934 -49584 -71031 -36364 -30565 -50813 -32748
5918 -32748 -930 -36213 -37830 -8662 18767 22682 54663 61250 53760 5699 -36210 -30756 -28078
5905b8078k4093j5293r181J4736K6259L1667M8939K861m0305l8589P209L398J0602
5892i868K9428k9405j3306Q64N25M91L856J1547O799k3311l4311J7538l9786J3744
5878f5195L8757J9577r704L0569N1686K0836o4040l2603J2272J8358J3804Q622
5866D2939m794q770J684k0878J3845J3191m0262j5835P765L7850J9058O181m0421
5853A1553m6700m7458j9586P800J5022O6091K9044m0825K5409Q11l8064M2132
5841E229K2417p1837j5891L0591L7257L657j0717q794o820j5259j512l3862j3949
5828g9490L9815o905J4676L0595J4837l713k281k0000K2929l127J389J255k3651
5815a3671R076L8005l3156k7424Q003N359M1420L3429j4833n5539K5024J8628
$$ plain form
5905 -28078 -52171 -67464 -76645 -61909 -35650 -3983 44956 47817 7512 -31077 -23868 -20470 -9868
5892 -9868 19560 -9845 -23151 -22287 -21762 -21271 -17415 -5868 931 -22380 -56691 -39153 -78939 -65195
5878 -65195 -26438 -6861 -16565 14004 65690 86526 22486 -10117 2155 20513 34317 42939
5866 42939 38145 29375 31059 10181 24026 37217 -3045 -18880 -11115 26735 45793 51974 11553
5853 11553 -35147 -82605 -102191 -94391 -79369 -13278 15766 -25059 350 1161 -36903 5229
5841 5229 27646 -44191 -60082 -29491 7766 11423 706 -8088 -14908 -30167 -31679 -65541 -79490
5828 -79490 -39675 -46580 -31904 -1309 13528 9815 7534 -12466 10463 7336 8725 9980 -13671
5815 -13671 -4595 33410 254 -27170 -19167 -13808 27612 61041 46208 -9331 15693 34321
5803C4321k0326n4027r287q68K573K8755K7796k507j280N1044L384m0201n1557
5790c2180j7092k1149K1644M3201K7309l6526k2644K8966q718l1132M127L4369
5778i825J6574o214O0670j2841l4687K5632l4730l9164j6184j5988J7655K0498
5766b8604K7694J9905k7879k7463L4384j2844n2873r896K3764K1619Q138k872
5754b6927M487J2932L8262J4032j5506n945m8300P937L3342j58O765j0744l0246
5741b0069K2330J6024j063J7825M155j0533l2401p033J3673N87L0748k0938m7486
5728c4181l9266M949J4372J7722k094J4341o583q139p24M1341L5760j714l1232
5715D552k4819Q982K3341j835K4300J9377j2962n5968k8600J8865K1422l1228
$$ plain form
5803 34321 13995 -40032 -49319 -50187 -47614 -18859 8937 6430 5150 56194 59578 19377 -32180
5790 -32180 -49272 -70421 -48777 -5576 21733 -14793 -37437 -8471 -17189 -48321 -44194 -9825
5778 -9825 6749 535 61205 48364 13677 39309 4579 -34585 -50769 -66757 -49102 -28604
5766 -28604 -910 18995 -8884 -36347 -1963 -14807 -67680 -77576 -53812 -32193 -24055 -26927
5754 -26927 -22440 -9508 28754 42786 27280 21335 -26965 -19028 14314 14156 20921 10177 -20069
5741 -20069 2261 18285 17222 35047 39202 28669 -3732 -10765 2908 3495 34243 13305 -34181
5728 -34181 -73447 -68498 -54126 -36404 -38498 -24157 -30740 -38879 -39603 1738 37498 35784 4552
5715 4552 -20267 -11285 12056 10221 34521 53898 40936 -15032 -43632 -24767 -3345 -34573
5703c4573j5879l7643N9690M8199J8212P746k7206k9091r317J2423J6221j2539
5691c757k543O422j9792P45j2249o853J3052L5509o96j0383q099r205K2565J8349
5677B3065N174l1943p381L6019J0401j4683n6942m2781j8851R716M4334K5502
5665a8370o892P20k802J3917L8371J9922j9188o381j6473j0052j4114J3153L1782
5652B3593M8145K0292l0952r952p32q831k0813j3028K0251l273q841J4146r437
5639B0568K106O325K4l8019j5775k6094p154J651J7248L3198K6377r615r402n843
5625d405j7114o906M987m2967M6922L3983r030k1793J4060J5151j9308j9199j4491
5612d0110l046K2259K1955k8512j8798r72L2254J3359m75M99J3957J8879j443
$$ plain form
5703 -34573 -50452 -88095 -28405 19794 38006 45752 18546 -10545 -19862 -7439 8782 -3757
5691 -3757 -6300 122 -19670 -18925 -31174 -38027 -24975 10534 9838 -545 -8644 -17849 4716 23065
5677 23065 28239 -3704 -11085 24934 35335 20652 -36290 -79071 -97922 -88206 -43872 -18370
5665 -18370 -25262 -24542 -27344 -13427 24944 44866 25678 19297 2824 -7228 -21342 -8189 23593
5652 23593 71738 92030 61078 51126 50394 41563 20750 7722 27973 24700 15859 30005 20568
5639 20568 22674 28999 29023 -8996 -24771 -50865 -58019 -56368 -39120 -5922 20455 10840 1438 -4405
5625 -4405 -21519 -28425 -23438 -66405 -19483 14500 5470 -16323 -2263 12888 -6420 -25619 -40110
5612 -40110 -43156 -20897 1058 -27454 -46252 -47224 -14970 -1611 -2086 -1587 12370 31249 29806
5599B9806j1958m7474k4738j8981k3778M7468M1076K1942O260q111L7988J4961
5587F4461m404l7712j8511J9999j5768J3919L08n5624r313K4943o087j7651P3773
5574C2333K8537n20l7615j8665J5659L0536r431L975k6661j6525l6610L673L041
5561b8273J2748O8582K9941J1798l526n256o3803n5744j2588J9977k9732j3411
5549f9287K0695J4371J6943j6474k4604n34J2369K3824J525j8282n317l638l015
5536e1424R761L9528K2993J2158j0705m37J3955k1598J5240J6371n368l2609j6612
5523h747J6698P3k4088l21J6309m5821o929L764L9501P1814j245l3458k0751j377
5509E422K157J4689Q038J0157J3629j8087l6587p126K8918J7448q408J0631L384
$$ plain form
5599 29806 17848 -29626 -54364 -73345 -97123 -49655 -8579 13363 19623 11512 49500 64461
5587 64461 60057 22345 3834 23833 8065 21984 22292 -33332 -42645 -17702 -23789 -41440 32333
5574 32333 60870 60350 22735 4070 19729 50265 40834 44809 18148 1623 -34987 -31314 -28273
5561 -28273 -15525 53057 82998 94796 91270 86014 22211 -33533 -46121 -26144 -55876 -69287
5549 -69287 -48592 -34221 -17278 -33752 -58356 -58890 -46521 -22697 -21172 -39454 -44771 -48409 -51424
5536 -51424 -41663 -2135 20858 33016 22311 21874 35829 14231 29471 45842 40474 7865 -8747
5523 -8747 7951 8024 -16064 -16385 -76 -45897 -52826 -49062 -9561 62253 61008 27550 6799 5422
5509 5422 7579 22268 30306 40463 54092 36005 -582 -7708 21210 38658 30250 40881 44265
5496D4265k6620j2540M0198j7193q37o699J4404r449j5222k2484J1598m482O290
5483A229j6351j4420l0877J252M853L7034M7517k2551o4884k1792L6661L0150
5471a2179L68m9977j3852M9453P214J727K8095j5250J3482L5987p10r444n8949
5458b4035J6218N28l4397L4701M7186j7274l3220J40n557k4440L155K054K7029
5445g912j7506O334J4906k2086Q002j5419k758j2796m714K5951L4591J3357j996
5432A7954Q788l741j3364J9105L2447O59j6583j7402k5746m4546m386K3860j161
5419b4116K7803J6639L068M30k2897J614J0838k0934M8834N9803k5675n2048J375
5406B4734j0951r244o091K1664k025j7681j8553r450j2933M7096K0236j1873k1455
$$ plain form
5496 44265 17645 5105 45303 28110 27273 20574 34978 25529 10307 -12177 -579 -5061 1229
5483 1229 -15122 -29542 -60419 -59167 -54314 -17280 30237 7686 -57198 -78990 -42329 -12179
5471 -12179 -11811 -61788 -75640 -26187 -18973 -17246 10849 -4401 9081 45068 44358 34914 -24035
5458 -24035 -7817 -7289 -41686 -6985 40201 22927 -10293 -10153 -15710 -40150 -36995 -34941 -7912
5445 -7912 -25418 -19084 -4178 -26264 -18262 -33681 -36439 -49235 -53949 -27998 6593 19950 17954
5432 17954 26742 23001 9637 28742 61189 61848 45265 27863 2117 -42429 -46815 -22955 -24116
5419 -24116 3687 20326 23394 23824 927 2541 13379 -7555 41279 101082 75407 23359 24734
5406 24734 13783 4539 -1552 20112 18087 406 -18147 -27597 -40530 6566 26802 14929 -6526
5393f526M9799N4825j0863l7183j9289j6338k7376R763n703K8582L537Q305J7898
5380D9431k2867j8069j968K4867J2233k4354J8296k6416m0693r907J40K8734L6086
5367B5513n257l8530j9202j3354k9126l586K6895k1940K1472q189K8451M2740
5355E887O939q510L0594K1946n8044l4723k0927o545K1606J9387j5305j1830O3086
5342A3561L5348r872j7382k2414n735J7278r641j4761J5140O96k392K9921j3494
5329A6253m3612j5644J10l634Q120K4005l7222n123L8384J7685j3319k8851k2253
5316f5101L3917m360K0129N1265r83J1347K9784l748l926K629n924k8129m8667
5303a1767l7964P202K3982J0963Q033L2839Q299K3318n0097m1910k4237j0757
$$ plain form
5393 -6526 43273 98098 87235 50052 30763 14425 -12951 -3188 -8891 19691 23228 31533 49431
5380 49431 26564 8495 6527 31394 43627 19273 37569 11153 -29540 -39447 -39307 -10573 25513
5367 25513 20256 -18274 -37476 -50830 -79956 -83542 -56647 -78587 -57115 -65304 -36853 5887
5355 5887 12826 4316 34910 56856 -1188 -35911 -56838 -63383 -41777 -22390 -37695 -49525 13561
5342 13561 48909 39037 21655 -759 -6494 10784 1143 -13618 1522 2218 -174 29747 16253
5329 16253 -27359 -43003 -42893 -46527 -38407 -14402 -51624 -56747 -18363 -678 -13997 -42848 -65101
5316 -65101 -31184 -35544 -15415 35850 34867 46214 75998 72250 68324 70953 65029 36900 -11767
5303 -11767 -49731 -42529 -18547 -7584 449 33288 41587 64905 14808 -27102 -51339 -62096
5291f2096J4035R755K922O069k2806J3092K8703J1985r80K0891L041k6143j205
5278b737p370k3738k0043J4501K1667L8707M784k6635J1990r29k0307L273Q363
5265A526J480J9767j4374l2035l3979p037N3444O0813l156m2156l445P880l4699
5252b5971J0707J8312m0588l6631J6549M4969K1510Q719n709l7285l9971L0095
5240c5294N075J4818M8362J858J5761J7716j1087j7959m1098l1734o230j5799
5228e5611k6450l083K3790L080K9897k2951K7051K2862j3982r154Q442L9831R866
5215C3588k7983k613k5137J2490l326k4014r809J5009J8334k482r508Q144R257
5202h050j0104j2524K7267K6904P676k5944J0683J2525o014l5022J2935J7949
$$ plain form
5291 -62096 -48061 -38306 -35384 -29315 -52121 -39029 -10326 1659 679 21570 24611 -1532 -2737
5278 -2737 -10107 -33845 -53888 -39387 -17720 20987 25771 -864 11126 10197 -10110 -6837 1526
5265 1526 3006 22773 8399 -23636 -57615 -64652 -11208 49605 46449 4293 848 8728 -25971
5252 -25971 -15264 3048 -37540 -74171 -57622 -12653 8857 17576 11867 -25418 -65389 -35294
5240 -35294 -30219 -15401 32961 34819 50580 68296 57209 39250 -1848 -33582 -39812 -55611
5228 -55611 -82061 -85144 -61354 -58274 -28377 -51328 -24277 -1415 -15397 -24551 -16109 23722 33588
5215 33588 5605 2992 -22145 -9655 -12981 -36995 -46804 -31795 -13461 -15943 -25451 -17307 -8050
5202 -8050 -18154 -30678 -3411 23493 31169 5225 15908 28433 22419 -12603 332 18281
5190A8281R67j853J3506n862n1179j4805K7178M6134R376Q701J5808J0947l403
5177G3796l6583m312q0674p3767n934r24K2138K423J2553L7040L89m6705o272
5164a06832N0932L7231J5649J0154k5638j8773q378J0635N568j3823O499K3670
5152a3106J7739K6949J8105o1857k3821M959N788O067J9543j0920k2110l480M0432
5139D288R262K317J2034j685q138j6876K9609j3365m339J0285M0556j4948m4323
5126D677k0164j0713O4019L5779l9387Q44R462p887L0089K5253m7258m780m5674
5113e740m8495J0328M0419j7955l0467j2015j0003L2568L7938l650M88J3984O424
5100A3824j2395L8184J6929j1327q397q88m9578r856j3371j4381L4290J0313k9261
$$ plain form
5190 18281 19248 17395 30901 25039 -26140 -40945 -13767 32367 41743 50444 66252 77199 73796
5177 73796 37213 32901 -47773 -121540 -127474 -128398 -106260 -103837 -91284 -54244 -53855 -100560 -106832
5164 -106832 -55900 -18669 -3020 7134 -18504 -37277 -45655 -35020 -29452 -43275 -36776 -13106
5152 -13106 4633 31582 49687 -12170 -35991 -31032 -25244 -19177 366 -10554 -32664 -36144 4288
5139 4288 13550 15867 27901 26216 18078 1202 30811 17446 13107 23392 63948 49000 4677
5126 4677 -15487 -26200 37819 73598 34211 35055 44517 36630 66719 91972 44714 39934 -5740
5113 -5740 -54235 -43907 -3488 -21443 -51910 -63925 -73928 -41360 -3422 -7072 -6584 7400 13824
5100 13824 1429 39613 56542 45215 36818 35930 -13648 -23504 -36875 -51256 -16966 -6653 -35914
5087c5914J1819M8885K6390n1416j5056m835K6384J7226K0112o020J0202O65k0593
5074B7849m665l1333J7188J3384K3417q567j4208l1198P017J2617m5137l9427
5062g3063p460J2820L5694J1717L5329K1670j3004K4692P777j1263p558j7031
5050B0320j1869P948n301L9951J0464k0901j0675k2195j5800J2355n592p307J2844
5037D242J2128k1215k2120q334K8479J0473R31o145J7762R366L8853l2219m6211
5024a4010q952J199J4465M584l4288j1340L0079N246l0820J128j5434K574K16
5011e5353M7179p211L6041K9797P406m3267m6716k7303K3826L2383P978k0897
4999a6137k2499K6599K4722j0322n042j6554J0633M623l0968j9975k7832J1039
$$ plain form
5087 -35914 -24095 24790 51180 -236 -15292 -20127 6257 23483 43595 37575 47777 48442 27849
5074 27849 23184 -8149 9039 22423 45840 37273 23065 -8133 -1116 11501 -33636 -73063
5062 -73063 -80523 -67703 -32009 -20292 15037 36707 23703 48395 56172 44909 37351 20320
5050 20320 8451 16399 11098 51049 61513 40612 29937 7742 -8058 4297 -1295 -8602 4242
5037 4242 16370 -4845 -26965 -35299 -6820 3653 4584 -1561 16201 25567 64420 32201 -14010
5024 -14010 -22962 -21763 -7298 -2714 -37002 -48342 -18263 -13017 -43837 -42709 -58143 -55569 -55353
5011 -55353 -8174 -15385 20656 50453 57859 14592 -32124 -59427 -35601 -3218 4760 -16137
4999 -16137 -38636 -12037 12685 2363 -2679 -19233 -8600 -3977 -34945 -54920 -82752 -71713
4987g1713K4564L8369J7955J6670K1617n120l3477l7454n4915k0183M3060n160
4975f5787o261K9895K4436l6310J1912P3035l490k6235l3689R425j172K8850N1574
4962E6183O1876l677o872l1691m2980j8240J2810L107K3588R358m4355n055J1864
4949B5916k2610K2925m0569j934j8932J4925J857j3607K284J806k353L4122L3623
4936C7453j0660m7368l3250J7468o733J6834J8369K8528o434R083o584j2581J5820
4923A9945J938j9585L794Q057K5786K4344j5966l2664o270m517L170q124J2315
4910A2223j4232j946O581J5800J7063j809l5576j6454J3995p114k4799J7990J3007
4897e271j2873J2379P627J8450r755l9004l2084L0001K9720O70P343k6585J3023
$$ plain form
4987 -71713 -47149 -8780 9175 25845 47462 42342 8865 -28589 -83504 -103687 -60627 -65787
4975 -65787 -72048 -42153 -17717 -54027 -42115 30920 27430 1195 -32494 -23069 -24241 4609 56183
4962 56183 118059 114382 107510 75819 32839 14599 27409 30516 54104 63462 19107 14052 25916
4949 25916 3306 26231 -14338 -16272 -35204 -20279 -18422 -32029 -29745 -27939 -30292 3830 37453
4936 37453 26793 -20575 -53825 -36357 -43090 -26256 -7887 20641 14207 23290 16706 4125 19945
4923 19945 21883 2298 6092 14149 39935 64279 48313 15649 9379 4862 8032 -92 12223
4910 12223 -2009 -3955 2626 18426 35489 33680 -1896 -18350 -4355 -11469 -36268 -18278 -5271
4897 -5271 -18144 -5765 1862 20312 10557 -28447 -60531 -30530 -810 -140 7203 -19382 -6359
4884f359M6M054l8140l0850L8113Q862R404L1878j199m8184q060J0259P413J024
4870b1739k0618P486K5382j0672j2352J9987k9107J0541p99j1381l41j8721L068
4857e9266j2137J5151L4474O2264K7249l9608J5436M8389J7875O319j8216l3699
4845F4231k9828j8296l3904Q793l732N363P062K5426p251j4509J1000k1004j4983
4832b1632L074j4930j570K391J014J3962k8880j9629K4015K5825J1286l341k0161
4819b8576j7810L9526K814r99L5822Q091J8043O450o9318l0011N0201L0929m296
4806D0866l4890N871K4284j2879m0619J3731L9164J7191N376k8980m3694j2743
4794b7322L4435L3528n8391l5096r46j153K6127J5541n484o852j8456J4004L1134
$$ plain form
4884 -6359 -6313 -2259 -40399 -71249 -33136 -24274 -14870 17008 15809 -32375 -40435 -30176 -22763 -21739
4870 -21739 -42357 -34871 -9489 -20161 -32513 -12526 -41633 -31092 -31891 -43272 -43613 -62334 -59266
4857 -59266 -71403 -56252 -21778 40486 67735 28127 43563 91952 109827 116146 97930 64231
4845 64231 34403 16107 -17797 -9004 -12736 -7373 -311 25115 17864 3355 14355 -6649 -21632
4832 -21632 -18558 -33488 -35058 -32667 -31653 -17691 -46571 -66200 -42185 -16360 -5074 -8415 -28576
4819 -28576 -46386 -6860 -4046 -5045 30777 38868 56911 63361 -5957 -35968 14233 45162 40866
4806 40866 5976 11847 36131 23252 -17367 -3636 35528 52719 58095 29115 -14579 -27322
4794 -27322 7113 40641 -17750 -52846 -53792 -54945 -28818 -13277 -18761 -25613 -44069 -30065 1069
4781A069O115j7517r199j2193l9762j658P761M0082L3829j6832k3487J9924K6776
4768A4908M897J3688k1808m8364J013L4575K0826L2025k3546k7135K5775Q388
4756C5242p45j1392K4158j8480l9398j2395K3528q103j321K0125l5088j5057R566
4743b9360K5466r379Rr119L5125J8557N611l0420n4362m9395M8620M5082K7889
4730B4324j9688r640J1235q385P322o394j6394j4726j2061P068J7437p017Q158
4717a8761L625j4498j6360K9567K8063O452n566J9577n34m3084m0154j038L2324
4704b0387L1906Q927J3788O371K6500L7208k5125n2683M6489j2534m2411j2737
4692E312k0474K9823M5298k1736j5090L86K4251m9154l5198o129J4961J6070L193
$$ plain form
4781 1069 7184 -10333 -19532 -31725 -71487 -73145 -65384 -25302 8527 -8305 -31792 -11868 14908
4768 14908 19805 33493 11685 -36679 -35666 -1091 19735 51760 28214 1079 26854 35242
4756 35242 34497 23105 47263 28783 -10615 -23010 518 -7585 -8906 11219 -23869 -38926 -29360
4743 -29360 -3894 -13273 -13264 -22383 12742 31299 36910 6490 -47872 -97267 -48647 -3565 24324
4730 24324 4636 -5004 6231 -2154 5168 -1226 -17620 -32346 -44407 -37339 -19902 -26919 -18761
4717 -18761 -15136 -29634 -45994 -16427 11636 18088 12522 32099 31565 -11519 -51673 -52711 -20387
4704 -20387 11519 20446 34234 40605 67105 104313 79188 26505 72994 60460 18049 5312
4692 5312 -15162 14661 59959 38223 23133 23519 47770 -1384 -36582 -42711 -27750 -11680 -8487
4679h487K4762j8223k2915k9881L0824l070j6714J4105m486j0267l0317J5200
4667e9469l301M9679L0600J7185q011o226j8412l8243l8452K6217J3920K727M7879
4654A6093m3345n4262L5277L1484J7947p875j9504r377K6070R630l4499l356J5542
4641b0175J3812j20k9263n596J6605j6553L2119K6104k1745j5546l202j6538j3795
4628e3893J2246l049q693j1876J4628M0358L5519j638j6907k9095k7038O280K1359
4615b1799K995j5802l1549k9528M4737K5553M1210k0683m0730J1066K4337k320
4603a2513m50l0055n0425J2488K6429M3702L3044J0655J267J944J7216j4359j7375
4590B1568j407k8444O446K8886k0629l1603J686M1159j904j3027j2182j1408k6727
$$ plain form
4679 -8487 16275 -1948 -24863 -54744 -23920 -26990 -43704 -29599 -34085 -44352 -74669 -59469
4667 -59469 -62770 -13091 17509 34694 26683 20457 2045 -36198 -74650 -48433 -34513 -31786 16093
4654 16093 -27252 -81514 -46237 -14753 3194 -4681 -24185 -33562 -7492 2138 -32361 -35717 -20175
4641 -20175 -6363 -6483 -35746 -41342 -24737 -41290 -9171 16933 -4812 -20358 -23560 -40098 -53893
4628 -53893 -41647 -44696 -53389 -65265 -50637 -10279 25240 23602 6695 -22400 -49438 -43158 -21799
4615 -21799 -18804 -34606 -66155 -95683 -50946 -25393 15817 -4866 -45596 -34530 -10193 -12513
4603 -12513 -12963 -43018 -93443 -80955 -54526 -10824 22220 32875 34142 36086 53302 38943 21568
4590 21568 20161 -8283 -1837 27049 6420 -25183 -23497 17662 15758 2731 -9451 -20859 -47586
4577d7586K5306k037j8762j0685k4715K9346J6034j524J4079J4090o854J1420
4565a888J1389m0921j9888K2598N6018l260j3807P982k2198m1749M456l518n819
4552e0605O417L271K3730J9335O692k201l4600j1185J5014K8746L1895j2209k2922
$$ plain form
4577 -47586 -22280 -24317 -43079 -53764 -78479 -49133 -33099 -34623 -20544 -6454 -13308 -1888
4565 -1888 9501 -31420 -51308 -28710 27308 24048 10241 18223 -3975 -45724 -41268 -44786 -50605
4552 -50605 -44188 -40917 -17187 2148 8840 6639 -27961 -39146 -24132 4614 36509 24300 1378
$$ [...]
##END NTUPLES=NMR SPECTRUM
##END=
