##TITLE=Analysis number 329447
Compound Code cc 62246
Book Reference 518/175
Project Code adrs
Chemist Name colinb
##JCAMPDX= 6.0         $$ Bruker NMR JCAMP-DX V2.0
##DATA TYPE= NMR SPECTRUM
##DATA CLASS= NTUPLES
##ORIGIN= Bruker BioSpin GmbH
##OWNER= nmr
$$ XWIN-NMR		Version 3.5
$$ Mon Sep  3 14:35:42 2007 GMT Daylight Time (UT+1h)  MAYBRIDGE\nmr@NMR_250MHZ
##.OBSERVE FREQUENCY= 250.131544655141
##.OBSERVE NUCLEUS= ^1H
##.ACQUISITION MODE= SIMULTANEOUS (DQD)
##.ACQUISITION SCHEME= undefined
##.AVERAGES= 16
##.DIGITISER RES= 18
##SPECTROMETER/DATA SYSTEM= dpx250
##.PULSE SEQUENCE= zg30
##.SOLVENT NAME= CDCl3
##.SHIFT REFERENCE= (INTERNAL, CDCl3, 0, 16.522)
##AUDIT TRAIL= $$ (NUMBER, WHEN, WHO, WHERE, WHAT)
$$ ##TITLE= Audit trail, XWIN-NMR		Version 3.5
$$ ##JCAMPDX= 5.01
$$ ##ORIGIN= Bruker BioSpin GmbH
$$ ##OWNER= nmr
$$ C:\u/data/dgb/nmr/ADRS/30/pdata/1/auditp.txt
$$ ##AUDIT TRAIL=  $$ (NUMBER, WHEN, WHO, WHERE, WHAT)
(   1,<2007-09-03 14:34:29.37 +100>,<MAYBRIDGE\nmr>,<NMR_250MHZ>,
      <created by zg, POWCHK disabled, PULCHK disabled
       configuration hash MD5:
       76 6E 9A 78 1E 09 19 81 EC 84 63 8F B0 6A 59 2D
       data hash MD5: 64K
       4B 2C 06 48 5D AE AA C1 DA 62 6F CB 1C 37 14 C6>)
(   2,<2007-09-03 14:35:01.92 +100>,<MAYBRIDGE\nmr>,<NMR_250MHZ>,
      <Start of raw data processing
       ef LB = 0.3 FT_mod = 6 PKNL = 1 SI = 32K 
       data hash MD5: 32K
       C7 D1 3D F9 09 4D 74 0C D5 FC A2 A1 3D 7A 31 2A>)
(   3,<2007-09-03 14:35:07.90 +100>,<MAYBRIDGE\nmr>,<NMR_250MHZ>,
      <apk 
       data hash MD5: 32K
       C5 83 D4 36 34 6F D5 17 4D 9A 0B 09 1B 90 14 80>)
(   4,<2007-09-03 14:35:13.39 +100>,<MAYBRIDGE\nmr>,<NMR_250MHZ>,
      <abs ABSG = 5 
       data hash MD5: 32K
       D0 F2 D1 A5 22 63 D2 0A 90 6D 65 9E DB CE 12 DD>)
$$ ##END=
$$ 
$$ hash MD5
$$ 29 3B 9F 98 F5 99 55 42 F0 85 1E 2C 23 3D CA B9
##$RELAX= 
##$RELAX= 
##$RELAX= 
##$RELAX= 
##$RELAX= 
##$RELAX= 
##$RELAX= 
$$ Bruker specific parameters
$$ --------------------------
##$DU= <C:\u>
##$EXPNO= 30
##$NAME= <ADRS>
##$PROCNO= 1
##$TYPE= <nmr>
##$USER= <dgb>
##$AMP= (0..31)
100 100 100 100 100 100 100 100 100 100 100 100 100 100 100 100 100 100 
100 100 100 100 100 100 100 100 100 100 100 100 100 100 
##$AQSEQ= 0
##$AQ_mod= 3
##$AUNM= <au_zg>
##$AUTOPOS= <29 >
##$BF1= 250.13
##$BF2= 250.13
##$BF3= 250.13
##$BF4= 250.13
##$BF5= 500.13
##$BF6= 500.13
##$BF7= 500.13
##$BF8= 500.13
##$BYTORDA= 1
##$CFDGTYP= 0
##$CFRGTYP= 5
##$CHEMSTR= <none>
##$CNST= (0..31)
1 1 145 1 1 1 1 1 1 1 1 1 1 1 1 1 1 1 1 1 1 1 1 1 1 1 1 1 1 1 1 1 
##$CPDPRG= <>
##$CPDPRG1= <>
##$CPDPRG2= <>
##$CPDPRG3= <>
##$CPDPRG4= <mlev>
##$CPDPRG5= <mlev>
##$CPDPRG6= <mlev>
##$CPDPRG7= <mlev>
##$CPDPRG8= <mlev>
##$CPDPRGB= <>
##$CPDPRGT= <>
##$D= (0..31)
0 1 0 0 0 0 0 0 0 0.06 0 0 0 0 0 0 0.0002 0 0 0 0 0 0 0 0 0 0 0 0 0 0 
0 
##$DATE= 1188826467
##$DBL= (0..7)
120 120 120 120 120 120 120 120 
##$DBP= (0..7)
150 150 150 150 150 150 150 150 
##$DBP07= 0
##$DBPNAM0= <>
##$DBPNAM1= <>
$$ [...]
##$SUBNAM7= <"">
##$SUBNAM8= <"">
##$SUBNAM9= <"">
##$SW= 20.6930455092707
##$SWIBOX= (0..15)
0 0 3 0 0 0 0 0 0 0 0 0 0 0 0 0 
##$SW_h= 5175.983436853
##$TD= 65536
##$TD0= 1
##$TE= 297.16
##$TE2= 300
##$TE3= 300
##$TEG= 300
##$TL= (0..7)
0 120 120 120 120 120 120 120 
##$TP= (0..7)
150 150 150 150 150 150 150 150 
##$TP07= 0
##$TPNAME0= <>
##$TPNAME1= <>
##$TPNAME2= <>
##$TPNAME3= <>
##$TPNAME4= <>
##$TPNAME5= <>
##$TPNAME6= <>
##$TPNAME7= <>
##$TPOAL= (0..7)
0.5 0.5 0.5 0.5 0.5 0.5 0.5 0.5 
##$TPOFFS= (0..7)
0 0 0 0 0 0 0 0 
##$TUNHIN= 0
##$TUNHOUT= 0
##$TUNXOUT= 0
##$USERA1= <user>
##$USERA2= <user>
##$USERA3= <user>
##$USERA4= <user>
##$USERA5= <user>
##$V9= 5
##$VALIST= <valist>
##$VCLIST= <CCCCCCCCCCCCCCC>
##$VD= 0
##$VDLIST= <DDDDDDDDDDDDDDD>
##$VPLIST= <PPPPPPPPPPPPPPP>
##$VTLIST= <TTTTTTTTTTTTTTT>
##$WBST= 1024
##$WBSW= 4
##$XGAIN= (0..3)
0 0 0 0 
##$XL= 0
##$YL= 0
##$YMAX_a= 507419
##$YMIN_a= -570175
##$ZGOPTNS= <>
##$ZL1= 120
##$ZL2= 120
##$ZL3= 120
##$ZL4= 120
##$ABSF1= 16.522
##$ABSF2= -4.171173
##$ABSG= 5
##$ABSL= 3
##$ALPHA= 0
##$AQORDER= 0
##$ASSFAC= 0
##$ASSFACI= 0
##$ASSFACX= 0
##$ASSWID= 0
##$AUNMP= <proc_1d>
##$AZFE= 0.1
##$AZFW= 0.1
##$BCFW= 0
##$BC_mod= 0
##$BYTORDP= 0
##$COROFFS= 0
##$CY= 12.5
##$DATMOD= 1
##$DC= 0
##$DFILT= <>
##$DTYPP= 0
##$F1P= 14.0000005364418
##$F2P= -0.99999901652339
##$FCOR= 0.5
##$FTSIZE= 32768
##$FT_mod= 6
##$GAMMA= 0
##$GB= 0
##$INTBC= 1
##$INTSCL= 1
##$ISEN= 128
##$LB= 0.3
##$LEV0= 0
##$LPBIN= 0
##$MAXI= 10000
##$MC2= 0
##$MEAN= 0
##$ME_mod= 0
##$MI= 0
##$NCOEF= 0
##$NC_proc= -3
##$NLEV= 6
##$NOISF1= 0
##$NOISF2= 0
##$NSP= 0
##$NTH_PI= 0
##$NZP= 0
##$OFFSET= 16.522
##$PC= 1
##$PHC0= -41.69616
##$PHC1= 2.190466
##$PH_mod= 1
##$PKNL= yes
##$PPARMOD= 0
##$PSCAL= 4
##$PSIGN= 0
##$REVERSE= no
##$SF= 250.13
##$SI= 32768
##$SIGF1= 0
##$SIGF2= 0
##$SINO= 400
##$SIOLD= 32768
##$SREGLST= <1H.CDCl3>
##$SSB= 0
##$STSI= 32768
##$STSR= 0
##$SW_p= 5175.98343685301
##$SYMM= 0
##$S_DEV= 0
##$TDeff= 65536
##$TDoff= 0
##$TI= <Analysis number 999999
Compound Code 99
Book Reference 9
Project Code 9>
##$TILT= no
##$TM1= 0
##$TM2= 0
##$TOPLEV= 0
##$USERP1= <user>
##$USERP2= <user>
##$USERP3= <user>
##$USERP4= <user>
##$USERP5= <user>
##$WDW= 1
##$XDIM= 32768
##$YMAX_p= 389837374
##$YMIN_p= -54331
$$ End of Bruker specific parameters
$$ ---------------------------------
##NTUPLES= NMR SPECTRUM
##VAR_NAME=  FREQUENCY,     SPECTRUM/REAL,   SPECTRUM/IMAG
##SYMBOL=    X,             R,               I
##VAR_TYPE=  INDEPENDENT,   DEPENDENT,       DEPENDENT
##VAR_FORM=  AFFN,          ASDF,            ASDF
##VAR_DIM=   32768,         32768,           32768
##UNITS=     HZ,            ARBITRARY UNITS, ARBITRARY UNITS
##FACTOR=    0.157963299565203, 1,           1
##FIRST=     4132.6476996994, 0,             0
##LAST=      -1043.33573715361, 0,           0
##MIN=       -1043.33573715361, -54331,      0
##MAX=       4132.6476996994, 389837374,     0
$$ Real data points
##PAGE= N=1
##DATA TABLE= (X++(R..R)), XYDATA
$$ [...]
16214E07J0838k3943j2532O062R918P719k259m758p999n072O858R869O706j109
$$ 507 11345 -12598 -25130 -19068 -9150 -1431 -3690 -8448 -16447 -21519 -14661 -4792 1914 805
16200H05J475j1180O42O266k486m434P273R277o701q260k004j181k289R9r951
$$ 805 2280 -8900 -8258 -1992 -4478 -8912 -1639 7638 937 -7323 -9327 -10508 -12797 -12698 -22649
16185b2649J3372J5189L82l213k2253j1391M448R651O356N618M464j2504j3282
$$ -22649 -9277 5912 6294 3081 -19172 -30563 -26115 -16464 -10108 -4490 -26 -12530 -25812
16172b5812l943NJ4758o683p202o417K625P479J4689p375n8K079n367P041P337
$$ -25812 -29755 -29750 -14992 -21675 -28877 -35294 -32669 -25190 -10501 -17876 -17934 -15855 -21222 -14181 -6844
16157f844K528l764K335M83K062j386l591n176o358O321L781J2096n79n605k33
$$ -6844 -4316 -8080 -5745 -5262 -3200 -4586 -8177 -13353 -19711 -13390 -9609 2487 1908 -3697 -3930
16142c930J218O063P134J675r334j3485n065J6958Q033r942N455J8321K088j1673
$$ -3930 -2712 3351 10485 12160 2826 -10659 -15724 1234 9267 -675 4780 23101 25189 13516
16128A3516j8510O843m68J2237J0227j1742n557O744Q90j2019r824j4807n10J0286
$$ 13516 -4994 1849 1381 13618 23845 12103 6546 13290 14180 2161 -7663 -22470 -22980 -12694
16114a2694P188J0223M836m139N856j0145j5745P92M846n513K174l415J2175J2532
$$ -12694 -5506 4717 9553 5414 11270 1125 -14620 -13828 -8982 -14495 -12321 -15736 -3561 8971
16100H971L478j051K344J17m111m666R84k864M671r540r959j922n444N707O896
$$ 8971 12449 11398 13742 13859 9748 5082 6066 3202 7873 -1667 -11626 -13548 -18992 -13285 -6389
16085f389J54q465R1k410N509R10L564J180j304k490R381p076L081N413k916M608
$$ -6389 -6235 -14700 -14609 -17019 -11510 -10600 -7036 -5856 -7160 -9650 -269 -7345 -4264 1149 -1767 2841
16069B841l517n338k213J430Q344p3k232o287k51K152o317L964J924J1910J666
$$ 2841 -676 -6014 -8227 -6797 1547 1474 -758 -7045 -7296 -5144 -11461 -7497 -5573 6337 8003
16054H003N372j598m953k933M980J4862p42j3951l817r296L883J2204R993o51
$$ 8003 13375 11777 6824 3891 8871 23733 22991 9040 5223 -4073 -190 12014 22007 21356
16040B1356o021o602o823N263n795L670j0113J858Q596j0808L64K33j4697Q368
$$ 21356 15335 8733 1910 7173 1378 5048 -5065 -3207 5389 -5419 -5055 -4822 -19519 -11151
16026a1151L248p271K667J2388m245n968j600l98j1692J3109M724j247J3858Q050
$$ -11151 -7903 -15174 -12507 -119 -4364 -10332 -11932 -12330 -24022 -10913 -6189 -7436 6422 14472
16012A4472j0281o302O943J2402n664j2491J130j2444k2089K9952K2630k465k3664
$$ 14472 4191 -2111 4832 17234 11570 -921 209 -12235 -34324 -4372 18258 15793 -7871
15999g871j4655k570l46K390m50K653P89N26j3089O374J6679O331M28M12r472
$$ -7871 -22526 -25096 -25442 -23052 -23502 -20849 -20060 -19534 -32623 -26249 -9570 -3239 -2811 -2399 -11871
15984a1871l313k008p543R407J7637j1073l936P149J6403o394k854n556n093J2775
$$ -11871 -15184 -17192 -24735 -15328 2309 -8764 -12700 -5551 10852 4458 1604 -3952 -9045 3730
15970C730J742k2226m144O319N574j2260m668K187m513M0J2876p15J545L190m414
$$ 3730 5472 -16754 -20898 -14579 -9005 -21265 -25933 -23746 -28259 -28219 -15343 -16058 -14513 -11323 -15737
15955a5737j964R169J19l980Q041l592o540K752J609p799J554O170K818m363M717
$$ -15737 -17701 -8532 -8413 -12393 -4352 -7944 -14484 -11732 -10123 -17922 -16368 -10198 -7380 -11743 -7026
15940g026O642K887L785o226j787o088Q341k672p462M567N349j1176l175K752
$$ -7026 -384 2503 6288 62 -1725 -7813 528 -2144 -9606 -5039 310 -10866 -14041 -11289
15926a1289J1874j4721j8136J3291l007P735P490N842k196K340j625j7721o036
$$ -11289 585 -14136 -32272 -18981 -21988 -14253 -6763 -921 -3117 -777 -2402 -20123 -26159
15913b6159k064J7311J5954J4433r149j0205m860r339j2965J0830J3995n403Q051
$$ -26159 -28223 -10912 5042 19475 10326 121 -4739 -14078 -27043 -16213 -2218 -7621 430
15900D30J5529k1060j8981J0864J5598k481J1832P767l994p791m774j2544o655
$$ 430 15959 -5101 -24082 -13218 2380 -101 11731 19498 15504 7713 2939 -9605 -16260
15887a6260J0056J3779j7249J181j315L113J2000J799q311r498R919Q68O50p405
$$ -16260 -6204 7575 -9674 -8493 -9808 -6695 5305 7104 -1207 -10705 -786 82 732 -6673
15873f673k277N465J238J857J0728r096j4717o309J3800J5995J669K16j0238j1009
$$ -6673 -8950 -3485 -2247 -390 10338 1242 -13475 -19784 -5984 10011 11680 11896 1658 -9351
15859i351j6395q427Q672M155M540J4071J1476j164j5145m340k427J719o435J777
$$ -9351 -25746 -34173 -25501 -21346 -16806 -2735 8741 7577 -7568 -11908 -14335 -12616 -19051 -17274
15845a7274J697J8967N466j1308j1611m973Q3Q92M51l211J2181O313j2211p338
$$ -17274 -15577 3390 8856 -2452 -14063 -19036 -18953 -18061 -17610 -20821 -8640 -2327 -14538 -21876
15831b1876J0077j2252M33R224J2232j2260m011K947m066p118J570P095J2807
$$ -21876 -11799 -24051 -23618 -14394 -2162 -14422 -18433 -15486 -19552 -26670 -25100 -18005 -5198
15818e198m20l69p558K56n216j1619Q180P735N759R405J4322Q642r392q559K833
$$ -5198 -5618 -5987 -13545 -13289 -18505 -30124 -21944 -14209 -8450 955 15277 23919 14527 5968 8801
15803H801p866K333J3271p421j1614r786n351n362O864N229J427M489N51J410
$$ 8801 935 3268 16539 9118 -2496 -12282 -17633 -22995 -16131 -10902 -9475 -4986 -4435 -3025
15789c025j3743j1141J030J252L481p040P591J3701N789p142j4096j4026J4428
$$ -3025 -16768 -27909 -26879 -25627 -22146 -29186 -21595 -7894 -2105 -9247 -23343 -37369 -22941
15776b2941J5912M501n456J6316N366n229o430J0818K087r685l925o559L392k268
$$ -22941 -7029 -2528 -7984 8332 13698 8469 2039 12857 14944 5259 1334 -5225 -1833 -4101
15762d101q605N462J2149j5585n536K8323M186n664J465N553M740j659P478R030
$$ -4101 -12706 -7244 4905 -10680 -16216 12107 16293 10629 12094 17647 22387 20728 28206 37236
15748C7236j0066k0200N32K647M272J9331k767L84j458j3020j1741p042r517J891
$$ 37236 27170 6970 7502 10149 14421 33752 30985 31369 29911 16891 5150 -1892 -11409 -9518
15734i518q9Q383P451M384j867l282j7890j2834P846K1299K127p971O086P057
$$ -9518 -9607 -1224 6227 10611 8744 5462 -12428 -25262 -17416 3883 6010 -1961 4125 11182
15720A1182o814j7751M228L331j789j2346q97Q356M684R08j1966L555m935R18
$$ 11182 4368 -13383 -9155 -5824 -7613 -19959 -20856 -12500 -7816 -6908 -18874 -15319 -20254 -19336
15706a9336R718L304L106J3658j1376l777P6j610l790P778M703j166j3146M742
$$ -19336 -9618 -6314 -3208 10450 -926 -4703 -4627 -6237 -10027 -2249 2454 1288 -11858 -7116
15692g116P339r37q685j2867R40N489K095m714o333Q071J244k940J7986j839q227
$$ -7116 223 -714 -9399 -22266 -21326 -15837 -13742 -18456 -24789 -16718 -15474 -18414 -428 -2267 -10494
15677a0494K777J1463K338O048p960l101j2717l262M340K830K328r973L453M281
$$ -10494 -7717 3746 6084 12132 4172 1071 -11646 -14908 -10568 -7738 -5410 -15383 -11930 -7649
15663g649P945J86k669p201j2520r700q292Q736L85k124Q267K3011N669P602j6225
$$ -7649 296 482 -2187 -9388 -21908 -31608 -39900 -31164 -30779 -32903 -24636 -1625 4044 11646 -4579
15648d579j9960N199K0888K4109O319j5484j2041n117O294J1775n166q376j3689
$$ -4579 -24539 -19340 1548 25657 31976 16492 4451 -666 5628 17403 12237 3861 -9828
15635i828j6855o776J6292O142q086j0016r343J0170L3176j878l931j2017o381
$$ -9828 -26683 -33459 -17167 -11025 -19111 -29127 -38470 -28300 4876 2998 -933 -12950 -19331
15622a9331M337j670j0004O991O531j8405p480J0268Q039J0477J4729L632j3843
$$ -19331 -14994 -16664 -26668 -19677 -13146 -31551 -39031 -28763 -20724 -10247 4482 8114 -5729
15609e729j1659J0605L887k816p63j0725R29Q20R717Q607J0175K944K830O453
$$ -5729 -17388 -6783 -2896 -5712 -6475 -17200 -16271 -15451 -5734 2873 13048 15992 18822 25275
15595B5275n359K016q581n581j8551j0427K413P998J4145o776k1052J5329J2992
$$ 25275 19916 21932 13351 7770 -10781 -21208 -18795 -10797 3348 -3428 -24480 -9151 3841
15582C841O075O054K67L57o402m387j2837j791O281o333q589J2539J1224l097
$$ 3841 9916 15970 16237 16594 10192 5805 -7032 -8823 -2542 -8875 -17464 -4925 6299 3202
15568C202N238J7419m007K048J247j4253q260p346o814J2160N062j579j2227p166
$$ 3202 8440 25859 21852 23900 25147 10894 2634 -4712 -11526 634 5696 4117 -8110 -15276
15554a5276p749O758K2585M581n851R923M96j0824j4393o732J0628l670j1427
$$ -15276 -23025 -16267 6318 10899 5048 14971 15467 4643 -9750 -16482 -5854 -9524 -20951
15541b0951J644j637J678n072m505M48J5824J3799J0200m470m486k882J554Q074
$$ -20951 -19307 -20944 -19266 -24338 -28843 -28395 -12571 1228 11428 6958 2472 -410 1144 9218
15527I218l921j8185k647O016O048P673l369j5423Q261k289n96K304M204l770
$$ 9218 5297 -12888 -15535 -9519 -3471 4202 833 -14590 -6329 -8618 -9214 -6910 -2706 -6476
15513f476J29o162p331P537J8877q588j6486K877J9712k710o628N773n492l333
$$ -6476 -6347 -12509 -19840 -12303 6574 -2014 -18500 -15623 4089 1379 -5249 524 -4968 -8301
15499h301J1981J022J038L063M386l349r668j5703L360P795P66J0710k215m184
$$ -8301 3680 4702 5740 8803 13189 9840 172 -15531 -12171 -4376 -3610 7100 4885 701
15485G01K21j5469J848l459K164J2308J552q216M931P597J2903Q058q820j2325
$$ 701 922 -14547 -12699 -16158 -13994 -1686 -134 -8350 -3419 4178 17081 25139 16319 3994
15471C994l030l177j3881j6014l328n750P25P57R850J9043l269r994k700K082
$$ 3994 964 -2213 -16094 -32108 -35436 -41186 -40461 -39704 -29854 -10811 -14080 -24074 -26774 -24692
15457b4692M099Q756Q518k60K071n88J2086q114q607R543J1533j4055k2307L529
$$ -24692 -20593 -11837 -3319 -3579 -1508 -2096 9990 1876 -6731 2812 14345 290 -22017 -18488
15443a8488N98Q459M71O726q53N867l602L537L766P313J303j0670m200Q66p493
$$ -18488 -17890 -9431 -8960 -2234 -3087 2780 -822 2715 6481 13794 15097 4427 227 1093 -6400
15428f400l230J2656K651k050o034m64M400J1018J433m185n886r628o919J0063
$$ -6400 -9630 3026 5677 3627 -2407 -2871 1529 12547 13980 9795 3909 -5719 -12638 -2575
15414b575J8972k1153r278l008l416J853R246J3635N243p47J3158j6653k4023
$$ -2575 16397 -4756 -14034 -17042 -20458 -18605 -9359 4276 9519 8772 21930 5277 -18746
15401a8746J920J0206K908Q108N942j0073q057j366J1741J5428M366j0388q076
$$ -18746 -16826 -6620 -3712 4396 10338 265 -7792 -9158 2583 18011 22377 11989 3913
15388C913q686j380J3728J8590J038j2133n076q479J3191Q061o67j622J8056J701
$$ 3913 -4773 -6153 7575 26165 27203 15070 9994 1515 14706 22767 22100 20478 38534 40235
15374D0235r148j5127r464m649J089p09k292J831j988r488M92m347m459l997J569
$$ 40235 31087 15960 6496 1847 2936 2227 -65 1766 -222 -9710 -9218 -13565 -18024 -22021 -20452
15359b0452N600O127n527l706P83N607M454J587j287K460O361K299q364j3192
$$ -20452 -14852 -8725 -14252 -17958 -17175 -11568 -7114 -5527 -6814 -4354 2007 4306 -4058 -17250
15345a7250r16J4776M667p373j7378J5218j70o361J7483K254M833r10l79p393
$$ -17250 -18166 -3390 1277 -6096 -23474 -8256 -8426 -14787 2696 4950 9783 8873 8494 1101
15331A101p505q023p972K2694J1468N568m810j1521o313R487K526n799P725L86
$$ 1101 -6404 -14427 -22399 295 11763 17331 12521 1000 -5313 4174 6700 901 8626 9012
15317I012n83L51K253q768J5485L493l880j7025m974K512L508k893N729J0291
$$ 9012 8429 8780 11033 2265 17750 21243 17363 338 -4636 -2124 1384 -1509 4220 14511
15303A4511J2443j6218j0148j0394J3776Q597j8288o273j1866L947P117j672q142
$$ 14511 26954 10736 588 -9806 3970 12567 -5721 -11994 -23860 -19913 -12796 -14468 -22610
15290b2610O406N325m304q969L689L13L26J641K0264l193j2410J1924j427j0079
$$ -22610 -16204 -10879 -15183 -24152 -20463 -20150 -19824 -18183 2081 -1112 -13522 -1598 -3025 -13104
15276a3104P233O67K361N608r992J0275N385K746Q27m447L429l358p077J1097
$$ -13104 -5871 -5204 -2843 2765 -7227 3048 8433 11179 12006 7559 10988 7630 553 11650
15262A1650q766k669m852R04j815K48Q886j841Q096M364p000q297p693L770K158
$$ 11650 2884 215 -4637 -3733 -5548 -5300 3586 1745 9841 14205 7205 -1092 -8785 -5015 -2857
15247b857N187P465j3906j7031j238J1661l726O790O640K407Q888j2282j0110
$$ -2857 2330 9795 -4111 -21142 -22380 -10719 -14445 -7655 -1015 1392 10280 -2002 -12112
15234a2112j0244J2291L500j1215M851l676J766N365m528j0495P468k212j057
$$ -12112 -22356 -10065 -6565 -17780 -12929 -16605 -14839 -9474 -14002 -24497 -17029 -19241 -20298
15221b0298R05K894N520o636l403Q66J8980M194R69r72k1797M83M982l637j544
$$ -20298 -19393 -16499 -10979 -17615 -21018 -20152 -1172 3022 3991 3019 -18778 -18295 -13313 -16950 -18494
15206a8494J95K104N802K6K691P288N963q355m511k793o535J79j319q63J3871
$$ -18494 -18299 -16195 -10393 -10367 -7676 -388 5575 -2780 -7291 -10084 -16619 -16440 -17759 -18622 -4751
15191d751O407R41j1713k977P287L713m494P6J607l449M390K135p035N756J1561
$$ -4751 1656 2597 -9116 -12093 -4806 -1093 -5587 -5511 -3904 -7353 -2963 -828 -7863 -2107 9454
15176I454p562j4708J0153J1409O653n988j0712l529q57K48j549j824Q240j623
$$ 9454 1892 -12816 -2663 8746 15399 9411 -1301 -4830 -5687 -5439 -6988 -8812 -572 -2195
15162b195j4705O79j184p691K367M793Q003q29l570l004R481L365P043o28o91
$$ -2195 -16900 -16221 -17405 -25096 -22729 -17936 -9933 -10762 -14332 -17336 -7855 -4490 2553 1925 1234
15147A234Q511K72j1973l28j9508q882m171Q315J2699J0749J6252n377m287j0980
$$ 1234 9745 10017 -1956 -2284 -21792 -30674 -34845 -26530 -13831 -3082 13170 7793 3506 -7474
15133g474R74R975P83j2583l799m856J4966P823j775K267J810K877j5242M72L773
$$ -7474 -6500 3475 4258 -8325 -12124 -16980 -2014 5809 4034 6301 8111 10988 -4254 -3782 -9
15118ij073p769p700N30K562J5201N824L420L018r230J154J2460L292n332k0700
$$ -9 -1082 -8851 -16551 -16021 -13459 1742 7566 10986 14004 4774 5928 18388 21680 16348 -4352
15103d352m573k486m828K910j1052M317m805Q406J1616n392N175J413L205J043
$$ -4352 -8925 -11411 -16239 -13329 -24381 -20064 -24869 -16463 -4847 -10239 -5064 -3651 -446 597
15089E97q942P646j229M044J0137j3669O22J704n852j07j0803n353J0622P016
$$ 597 -8345 -699 -1928 2116 12253 -1416 -794 910 -4942 -5049 -15852 -21205 -10583 -3567
15075c567k148J0953J6334k973L848L403k3242o581J69J118j0660j798N709k620
$$ -3567 -5715 5238 21572 18599 22447 25850 2608 -3973 -3804 -2686 -13346 -15144 -9435 -12055
15061a2055j927J5837Q944j0832o883l60r679M123p2J5227P330j3976p187J2827
$$ -12055 -13982 1855 10799 -33 -6916 -7276 -16955 -12832 -12904 2323 9653 -4323 -11510 1317
15047A317O966o991K965m018q33l307r99r309q529N019J2480R414o786k1143L881
$$ 1317 8283 1292 4257 239 -594 -3901 -4900 -14209 -22738 -17719 -5239 4175 -2611 -23754 -19873
15032a9873K0641R553l423n969j244J3538J1017j6481j2465r140J2360K977j0251
$$ -19873 768 10321 6898 929 -315 13223 24240 7759 -4706 -13846 -1486 1491 -8760
15019h760l110L750j2446Q933J5460n122j3970J4704J4163m894j6927j9380k956
$$ -8760 -11870 -8120 -20566 -11633 3827 -1295 -15265 -561 13602 8708 -8219 -27599 -30555
15006c0555P302M364p558N455M273q372o197J5435L24K035Q242P700o678k762
$$ -30555 -23253 -18889 -26447 -20992 -16719 -25091 -31288 -15853 -15529 -13494 -5252 2448 -4230 -6992
14992f992N779l069J1542p977k0535m98N029N157J3531N487J0836j752n647j7856
$$ -6992 -1213 -4282 7260 -717 -21252 -21750 -16721 -11564 1967 7454 18290 16538 10891 -6965
14978f965j0407J431n384J790R914J919K418R670N232P2j1453l397O206l365O698
$$ -6965 -17372 -15941 -21325 -19535 -9621 -7702 -5284 4386 9618 9690 -1763 -5160 1046 -2319 4379
14963D379J4387j0231k1424j9168J970j0681J3480k641J475J2613J1442l351r771
$$ 4379 18766 8535 -12889 -32057 -30087 -40768 -27288 -29929 -28454 -15841 -4399 -7750 -17521
14950a7521n100N211K81M688J233j1869J0711R197l39j174j430q442L19J0892
$$ -17521 -22621 -17410 -17129 -12441 -11208 -23077 -12366 -3169 -3508 -4682 -6112 -14554 -14235 -3343
14936c343J841p982o025K060J289O75N326P501j3737l440J1854K8754O683k530
$$ -3343 -1502 -9484 -15509 -13449 -12160 -11485 -6159 1342 -12395 -15835 -3981 24773 31456 28926
14922B8926j6360r481l023N269J3341R06j8471J1146J5128l588j6366P18m74J597
$$ 28926 12566 3085 62 5331 18672 19578 1107 12253 27381 23793 7427 8145 7671 9268
14908I268r966j0478K667Q048k882O054q886R06R441L84j0266j0288k809M243
$$ 9268 -698 -11176 -8509 -461 -3343 2711 -6175 -5269 4172 4556 -5710 -15998 -18807 -14564
14894a4564j115r423M600J2628M072L798J1262K895o750j0933j8779o224n813
$$ -14564 -15679 -25102 -20502 -7874 -3802 -4 11258 14153 7403 -3530 -22309 -28533 -34346
14881c4346J4219k456M766J4242P652m311N678J303L041j6114K589K090j2829
$$ -34346 -20127 -22583 -17817 -3575 4077 -234 5444 6747 9788 -6326 -3737 -1647 -14476
14868a4476P4p536k547K6J8504m042p944N566M952l128L420M54k140j23n182J468
$$ -14476 -14402 -21938 -24485 -24459 -5955 -9997 -17941 -12375 -7423 -10551 -7131 -6677 -8817 -8940 -14122 -12654
14852a2654k707j35J4703K0704o143o350J504j8984l390n56N912o781K317J2989
$$ -12654 -15361 -15496 -793 19911 13768 7418 8922 -10062 -13452 -14008 -8096 -14877 -12560 429
14838D29j907q136K38j0942m771K3092k250n416o52R359l282j541J2871K720j409
$$ 429 -1478 -9614 -9376 -20318 -25089 -1997 -4247 -9663 -10315 -956 -4238 -5779 7092 9812 8403
14823H403J178j2146J4673N197q516p185l92q321P609L200j697J179m086K733
$$ 8403 9581 -2565 12108 17305 8789 1604 1212 -7109 500 3700 2003 3182 -904 1829
14809A829j018M530p737L426J2904Q03n002j990J348K177Q652K569j0702l739
$$ 1829 811 5341 -2396 1030 13934 14737 9735 7745 9093 11270 19922 22491 11789 8050
14795H050K93j9651P554J5711n986q659N86o454n877l775J1646J412L413J87K441
$$ 8050 8343 -11308 -3754 11957 5971 -2688 -2102 -8556 -14433 -18208 -6562 -5150 -1737 -1550 891
14780H91J0675l745j0727Q560J2212j0407m536j7469q616J3632K548R629p475
$$ 891 11566 7821 -2906 5654 17866 7459 2923 -14546 -23162 -9530 -6982 2647 -4828
14767d828j7928j1266R303R218N514K0194m693j9823q043J1263J8505j4370m169
$$ -4828 -22756 -34022 -24719 -15501 -9987 10207 5514 -14309 -22352 -11089 7416 -6954 -11123
14754a1123M510J5036N019m490N369K61l742j2380l528r632r673j902P869L564
$$ -11123 -6613 8423 13442 8952 14321 14582 10840 -1540 -5068 -14700 -24373 -26275 -18406 -14842
14740a4842l905J5795J2528j3198m273J0246r719p517J1023n952J1924R358j1067
$$ -14842 -18747 -2952 9576 -3622 -7895 2351 -7368 -14885 -3862 -9814 2110 11468 401
14727D01r372j0550O798O363P512R507m322j083j1279j0103J1834K230m097n56
$$ 401 -8971 -19521 -12723 -6360 1152 10659 6337 5254 -6025 -16128 -4294 -2064 -6161 -6717
14713f717P561r209L350M105j0087k252J1730k12n206K466K65l349P55J3229R657
$$ -6717 844 -8365 -5015 -910 -10997 -13249 -1519 -1731 -6937 -4471 -4206 -7555 -6800 6429 16086
14698A6086o780m710j5165j981K069P891m106J7630O485r419r577p222J1660Q052
$$ 16086 9306 4596 -10569 -12550 -10481 -2590 -6696 10934 17419 8000 -1577 -8799 2861 10913
14684A0913j0916j4885R191N732O526K700N279p859J833n983r397M475J1902N307
$$ 10913 -3 -14888 -5697 35 6561 9261 14540 6681 8514 2531 -6866 -2391 9511 14818
14670A4818j2991p471p613o16Q38j1657k642J6121J422n416J802k302J9034N839
$$ 14818 1827 -5644 -13257 -13873 -13035 -24692 -27334 -11213 -9791 -15207 -13405 -15707 3327 9166
14656I166j6535j4691n033K582k436Q869M85J2484J7938M0L691j7259q550J856
$$ 9166 -7369 -22060 -27093 -24511 -26947 -18078 -17593 -5109 12829 12869 16560 -699 -9249 -7393
14642g393M238n320q665j8071O689K2302P464N537k313K25j5881m798N650m066
$$ -7393 -3155 -8475 -17140 -35211 -28522 -6220 1244 6781 4468 4693 -11188 -15986 -10336 -14402
14628a4402Q439j253j5649K967m5M300j993l428j3317j4530P488M348J0905R816
$$ -14402 -5963 -7216 -22865 -19898 -19943 -15643 -17636 -21064 -34381 -48911 -41423 -37075 -26170 -16354
14614a6354r160M742R901R675m420o73j2310j080J2041L377L843n557N000J8860
$$ -16354 -25514 -20772 -10871 -1196 -5616 -6289 -18599 -19679 -7638 -4261 -418 -5975 -975 17885
14600A7885k402o59o258j3538q048R612k360j5193Q466J3802m509p827q715o369
$$ 17885 15483 14824 8566 -4972 -13020 -3408 -5768 -20961 -12495 1307 -3202 -11029 -19744 -26113
14586b6113J4796N099J737N633N809n88l516N793N124j239r993j3456N625O863
$$ -26113 -11317 -6218 -4481 1152 6961 6373 2857 8650 13774 12535 2542 -10914 -5289 1574
14572A574J7936k603j0810n751l207j0894J98j083l189q980l191O126J6533l728
$$ 1574 19510 16907 6097 346 -2861 -13755 -13557 -14640 -17829 -26809 -30000 -23874 -7341 -11069
14558a1069K528J8924n539j221o518j1812j9908q238P708P097m374R258P895M254
$$ -11069 -8541 10383 4844 3623 -2895 -14707 -34615 -42853 -35145 -28048 -32422 -23164 -15269 -11015
14544a1015L070P563J3544Q145j3169l978K048l671p375Q138R202p811j5258Q15
$$ -11015 -7945 -382 13162 21307 8138 4160 6208 2537 -4838 3300 12502 4691 -10567 -9752
14530i752J6102J476j1993j3863K379P588J1513J5234P923j6934k2706O396K982
$$ -9752 6350 7826 -4167 -18030 -15651 -8063 3450 18684 26607 9673 -13033 -6637 -3655
14517c655k109k135J0023N498n226j2549n201k435J615q904J416J4772J1472m556
$$ -3655 -5764 -7899 2124 7622 2396 -10153 -15354 -17789 -16174 -25078 -23662 -8890 2582 -1974
14503a974j374p847o865o907J3356q96J06L104k713k626n666K544N867M016K0278
$$ -1974 -3348 -11195 -18060 -24967 -11611 -12507 -12401 -9297 -12010 -14636 -20302 -17758 -11891 -7875 12403
14488A2403K4826j1554k6734p556J0675J2568k277j5038j963J0753K158k25q169
$$ 12403 37229 25675 -1059 -8615 2060 14628 12351 -2687 -4650 6103 8261 8036 -133
14475a33P780Q111k2072j7219M991m526N154Q647J4127j579j0345J1218R489q580
$$ -133 7647 15758 -6314 -23533 -18542 -23068 -17914 -9267 4860 3281 -7064 4154 13643 5063
14461E063m884P716l741K60R710R51j6176R03k218m925j17J3721O835o552k148
$$ 5063 179 7895 4154 4414 14124 15075 -1101 -198 -2416 -7341 -7458 6263 13098 6546 4398
14446D398J2655J369o780j1851J3597P960p035k3561j0041q87R241m410M071m982
$$ 4398 17053 18422 11642 -209 13388 21348 14313 -9248 -19289 -20176 -10935 -15345 -11274 -16256
14432a6256R782O034k278J496O323O142m996j2629M987l746l712o06O654l025
$$ -16256 -6474 -440 -2718 -1222 5101 11243 6247 -6382 -1395 -5141 -8853 -9459 -2805 -5830
14418e830J282L08p877n125p81K045l220r009K656M013L239J7891L483j4447j2027
$$ -5830 -4548 -4240 -12117 -17242 -18023 -15978 -19198 -28207 -25551 -21538 -18299 -408 3075 -11372 -23399
14403b3399J537N363J3312O951j5318L365K580o141l546n113j623J197P70N561
$$ -23399 -21862 -16499 -3187 3764 -11554 -8189 -5609 -11750 -15296 -20409 -22032 -20835 -20065 -14504
14389a4504p30l373K21q146j0108r7j702Q151K3497J7404l15o735p802N211o920
$$ -14504 -15234 -18607 -18386 -26532 -36640 -36737 -38439 -30288 -6791 10613 10298 3563 -4239 972 -5948
14374e948j221J0596j0698O106j1N398j306r159R024L321j5386r158j024K2547
$$ -5948 -7169 3427 -7271 -1165 -1176 4222 2916 -6243 2781 6102 -9284 -18442 -19466 3081
14360C081J2901l4m863K914J7458p328k4003o991P919J38k017J980O120j1439
$$ 3081 15982 15948 11085 13999 31457 24129 126 -6865 1054 1192 -825 1155 7275 -4164
14346d164J258m345M743p22j14n745m74N434l490M96J1641j956R55M179j140M464
$$ -4164 -2906 -7251 -2508 -3230 -3344 -9089 -9563 -4129 -7619 -7123 4518 2562 3517 7696 6556 11020
14330A1020N194j198O573p895j3787p411J343j0164J459J3711K3007N170j1387
$$ 11020 16214 15016 21589 13694 -93 -7504 -6161 -16325 -14866 -1155 21852 27022 15635
14317A5635p912l410p1o399o752j669L135l027o696Q845R751j919L427O863o465
$$ 15635 7723 4313 4242 -2157 -8909 -10578 -7443 -10470 -17166 -8321 1430 -489 2938 9801 3336
14302C336r950m992Q627o325k63K006n965o542o490r88J0691N058o015O116J8206
$$ 3336 -6614 -11606 -2979 -9304 -9567 -7561 -13526 -20068 -26558 -27546 -16855 -11797 -17812 -11696 6510
14287F510q017o396p387p902M10L611Q168J3005L138j9110M623J1980L840L557
$$ 6510 -1507 -7903 -15290 -23192 -22782 -19171 -11003 2002 5140 -13970 -9347 2633 6473 10030
14273A0030N427N084m242j9840j0402J1738J6068m845m579r051K845m382N858
$$ 10030 15457 20541 16299 -3541 -13943 -2205 13863 9018 4439 -4612 -1767 -6149 -291
14260b91O588J472r981N947k168n259n298r266K354N689P730P748M876m081k519
$$ -291 6297 7769 -2212 3735 1567 -3692 -8990 -18256 -15902 -10213 -2483 5265 10141 6060 3541
14245C541n256q107l876O180K788Q516K053r843M294M93q616k1670N787J8371
$$ 3541 -1715 -9822 -13698 -7518 -4730 3786 5839 -4004 290 783 -7833 -29503 -23716 -5345
14231e345J4453K007O536p61n778j105j6798j757P83K036L495Q096R980p458j3462
$$ -5345 9108 11115 17651 16890 11112 10007 -6791 -8548 -7765 -5729 -2234 5862 15842 8384 -5078
14216e078j4402Q530k857k820J8727Q83j6945o29j464N46J0301M673j241P142
$$ -5078 -19480 -10950 -13807 -16627 2100 2983 -13962 -14591 -16055 -15509 -5208 -535 -1776 5366
14202E366K5423O133j6833j1706Q198K443j4704j5087j5379k171J8402J0356J212
$$ 5366 30789 36922 20089 8383 16581 19024 4320 -10767 -26146 -28317 -9915 441 1653
14189A653Q230O484n186n245l554L666K141P261L324j2426j2479p226P530l747
$$ 1653 9883 16367 11181 5936 2382 6048 8189 15450 18774 6348 -6131 -13357 -5827 -9574
14175i574j248L601j2077M423Q982R061o119P480M169k983o985J4086k303m669
$$ -9574 -10822 -7221 -19298 -14875 -5893 3168 -2951 4529 8698 5715 -1270 12816 10513 5844
14161E844L36R041q02o085K442r615n866n513l242k816J2379N275M133N008K967
$$ 5844 6180 15221 14419 8334 10776 1161 -4705 -10218 -13460 -16276 -3897 1378 5511 10519 13486
14146A3486q965m826l478r963L937J0291L856O178J4952j3247k607k508j077j8035
$$ 13486 4521 -305 -3783 -13746 -9809 482 4338 10516 25468 12221 9614 7106 6029 -12006
14132a2006m064L309K790J605R794P952o813q295Q985Q528J4536m50k296j6642
$$ -12006 -16070 -12761 -9971 -8366 1428 9380 2567 -5728 3257 11785 26321 25871 23575 6933
14118F933j3708J427J0419k47k874n321L463J9372q793M70j845j8092P457O374
$$ 6933 -6775 -5348 5071 4824 1950 -3371 92 19464 10671 11141 9296 -8796 -1339 5035
14104E035L405L171J6772J9424Q192M150m26k786r051Q105j18m433j0747k6835
$$ 5035 8440 11611 28383 47807 55999 60149 59723 56937 47886 55991 55873 51440 40693 13858
14090A3858j0716P377L898M77J6427J3541P380k660j9158j5877j6956j1038m024
$$ 13858 3142 10519 14417 14894 31321 44862 52242 49582 30424 14547 -2409 -13447 -17471
14077a7471J1288K5626J5647R25p137n336J050N387o283r226o402o463O304o057
$$ -17471 -6183 19443 35090 36015 28878 23542 24592 29979 23696 14470 8068 1605 7909 1852
14063A852l508K498p533O606k979j302J1836k206n137k931N892r410n996J5575
$$ 1852 -1656 842 -6691 -85 -3064 -4366 7470 5264 127 -2804 3088 -6322 -12318 3257
14049C257P127Q16N97m720P657L705J213q423l453J358N782l559k979p734J6284
$$ 3257 10384 11200 11797 7077 14734 18439 19652 11229 7776 9134 14916 11357 8378 644 16928
14034A6928O545N388n720O327k361j9462l235R358J0992k797q429r374n894Q93
$$ 16928 23473 28861 23141 29468 27107 7645 4410 13768 24760 21963 13534 4160 -1734 -841
14020h41J0789O304L44k200L961j1050n889k624L628Q117k274O178K796J7749
$$ -841 9948 16252 16596 14396 18357 7307 1418 -1206 2422 10539 8265 14443 17239 34988
14006C4988L628L265q528j7408k707R09M337O898o624l347K483m350O409n567
$$ 34988 38616 41881 33353 15945 13238 14147 18484 25382 18758 15411 17894 13544 19953 14386
13992A4386L94J90K440r036k755J2282Q013j2281p487Q220k3261j1393l269R500
$$ 14386 14780 14970 17410 8374 5619 17901 25914 13633 6146 14366 -8895 -20288 -23557 -14057
13978a4057J4683Q995R27O365n846q156j7468P005K1333J1498q942r339O059R53
$$ -14057 626 9621 10548 16913 11067 2911 -14557 -7552 13781 25279 16337 6998 13057 14010
13964A4010k972o781j0876O866N322J307q52J9638J0796j1168q044j3080o932
$$ 14010 11038 4257 -6619 247 5569 6876 6024 25662 36458 25290 17246 4166 -2766
13951b766M730J3431n296j2419L438m51j30n597j275L12m772J676O511L30J598
$$ -2766 1964 15395 10099 -2320 1118 667 537 -5060 -6335 -6023 -10795 -9119 -2608 -2278 -680
13936f80J6172J4214M845n6M142m704n727n255j1639p333O473O261r491k321J0758
$$ -680 15492 29706 34551 34495 38637 33933 28206 22951 11312 3979 10452 16713 7222 4901 15659
13921A5659j2319k486P521n063n589L122M624O309j732O5j0820j0460J6020L092
$$ 15659 3340 854 8375 3312 -2277 845 5469 11778 10046 10111 -709 -11169 4851 7943
13907G943J2341J3951o603M806r419r027P2l36q02m696N05j432o837j862J3303
$$ 7943 20284 34235 27632 32438 23019 13992 14064 13728 12926 8230 8735 7303 466 -1396 11907
13892A1907J916J8145j470j1192q018l214J2253Q234k853j564K903k254j2161
$$ 11907 13823 31968 30498 19306 11288 8074 20327 28561 25708 24144 27047 24793 12632
13879A2632q891n528P44J669J2815K083j0872j0576m353O677L659k128k143j878
$$ 12632 3741 -1787 -1043 626 13441 15524 4652 -5924 -10277 -3600 59 -2069 -4212 -6090
13865f090J711N619o592m041q641K0784J4962Q63j0476j949P939K155J102j157
$$ -6090 -4379 1240 -5352 -9393 -18034 2750 17712 18575 8099 6150 14089 16244 17346 16189
13851A6189j897j4418j3070j3879m886J8230O791N911L881J2758n2o986N125m881
$$ 16189 14292 -126 -13196 -27075 -31961 -13731 -6940 -1029 2852 15610 15558 8572 13697 8816
13837H816k251j2618q604l171K644j028l181m31R163L0J4376P978J42j5023m814
$$ 8816 6565 -6053 -14657 -17828 -15184 -16212 -19393 -19824 -10661 -10631 3745 11723 11865 -3158 -7972
13822g972P054J2104Q000m348j508K678O035m753l124M454p476o677J2963K938
$$ -7972 -918 11186 19186 14838 13330 16008 22043 17290 14166 18620 11144 4467 17430 20368
13808B0368l314m567O454l939j4466O59P835J6528Q918k0029q024L935l297O332
$$ 20368 17054 12487 18941 15002 536 1195 9030 25558 34476 14447 6423 10358 7061 13393
13794A3393p722j4574L291J6757q216J216J2314O835k674j3174N496j558o824
$$ 13393 5671 -8903 -5612 11145 2929 4145 16459 23294 20620 7446 12942 11384 4560
13781D560q072l529M112Q476J8163k376m243N61M269Q06O808j780l106k71l247
$$ 4560 -3512 -7041 -2929 5547 23710 21334 17091 17652 21921 22727 29535 27755 24649 24378 21131
13766B1131q579p759l375j6744J3137J1636Q090Q123j2468j0804M747K218j682
$$ 21131 12552 4793 1418 -15326 -2189 9447 17537 25660 13192 2388 7135 9353 7671
13753G671J120N225o340o281n264R090K958K73M120M740J790Q526j369n001k1335
$$ 7671 8791 14016 7676 1395 -3869 5221 8179 8452 12572 17312 19102 27628 26259 21258 -77
13738g7n529O160q19K092M146R8m881n078N698M886P209p538K308Q011m422n328
$$ -77 -5606 554 -265 1827 5973 6071 1190 -3888 1810 6696 13905 6367 8675 16686 12264 6936
13722F936n754J1950j778J676N012o568J1584r875M046O265n755j1108j4798R44
$$ 6936 1182 13132 11354 13030 18042 11474 23058 13183 17229 23494 17739 6631 -8167 -7223
13708g223J7278J0781J0389l625j5209j1354P824P463Q333J3057j1401j3582p388
$$ -7223 10055 20836 31225 27600 12391 1037 8861 16324 24657 37714 26313 12731 5343
13695E343m297k52J761O771N477K898j853P897o245l820N37M504L983k368k736
$$ 5343 1046 794 2555 9326 14803 17701 15848 23745 17500 13680 14217 18721 22704 20336 17600
13680A7600r805J33J240p7n763j697K862Q248j1875m934k039K996M478O818p07
$$ 17600 7795 7928 9168 9091 3328 1631 4493 12741 866 -4068 -6107 -3111 1367 8185 7478
13665G478r0P080j856q593J0o828m097N473L94M022K125p58P723j8l882L895j0977
$$ 7478 7388 14468 12612 4019 4029 -2799 -6896 -1423 -1029 2993 5118 4360 12083 12065 8183 12078 1101
13648A101m112m21M281k127j0621n135N574j835r03K247J1968J1912J0044q71
$$ 1101 -3011 -3432 849 -1278 -11899 -17034 -11460 -13295 -14198 -11951 17 11929 21973 21102
13634B1102m146j1669J1296Q457j220l967K13p943L296O951R430R709J213j0454
$$ 21102 16956 5287 16583 25040 23820 19853 20066 12123 15419 22370 31800 41509 42722 32268
13620C2268j8169N436J7698L298r693R004L57j4686n345L360J0974n06p131R610
$$ 32268 14099 19535 37233 40531 30838 39842 40199 25513 20168 23528 34502 33996 26865 36475
13606C6475K627j6758j2382J991JJ4597M7q260p747j1417o333P425M803J827J5183
$$ 36475 39102 22344 9962 11953 11954 26551 26598 18338 10591 -826 -7159 266 5069 6896 22079
13591B2079R980J208j1553o90P329o392j1182o431O065J7101k302j7766r337M120
$$ 22079 32059 33267 21714 21024 28353 21961 10779 4348 10413 27514 25212 7446 -1891 2229
13577B229J0226r76J1977l73j786R155O04K660K213k866Q68j2274j5261M324k862
$$ 2229 12455 11479 23456 23083 21297 30452 31056 33716 35929 33063 33931 21657 6396 10720 7858
13562G858k577J6771J0603o768j0017j0187O467O084K483n94R700K1816q209q556
$$ 7858 5281 22052 32655 25887 15870 5683 12150 18234 20717 20123 29823 51639 43430 34874
13548C4874j728n121j2171M191m465j4507j2636l79R782J2178J8956O385j3112
$$ 34874 33146 28025 15854 20045 15580 1073 -11563 -11942 -2160 10018 28974 35359 22247
13535B2247q529P24j445o699k418j479j1602J1310J392m669r367R282J4133J2915
$$ 22247 13718 14442 12997 6298 3880 2401 -9201 2109 3501 -1168 -10535 -1253 12880 25795
13521B5795m281K284l502j5708k620R565J001r467J273O522K1073J1260R944l763
$$ 25795 21514 23798 20296 4588 1968 11533 12534 3067 4340 10862 31935 43195 53139 49376
13507D9376r053R523r181r606L476l410n631J003k514Q241p690K540O974J0896
$$ 49376 40323 49846 40665 31059 34535 31125 25494 26497 23983 32224 24534 27074 34048 44944
13493D4944M728M522P581j921p078O884R145q543j3970k806L627J5764K79j2652
$$ 44944 49672 54194 61775 59854 52776 59660 68805 60262 46292 43486 47113 62877 63156 50504
13479E0504j2702l621p857p450L511P068P569j1474J839l694J808P232j2246j1647
$$ 50504 37802 34181 26324 18874 22385 29453 37022 25548 27387 23693 25501 32733 20487 8840
13465H840r459Q123O973N833q98n347j0351m508J3264K1276L080j0621j4727j784
$$ 8840 -619 7504 14477 20310 19412 14065 3714 -794 12470 33746 36826 26205 11478 9694
13451I694R121J3605k181j5357Q424J4071k048l224n204N489r448n679N275p294
$$ 9694 18815 32420 30239 14882 23306 37377 35329 32105 26901 32390 22942 17263 22538 15244
13437A5244L266J2482K6385O17j0625o780N209K519Q746O620r31j885J2078R224
$$ 15244 18510 30992 57377 57994 47369 40589 45798 48317 57063 63683 62752 60867 72945 82169
13423H2169J6647J9351O283J5939K2239j282J490n927j0696j9934k1501j2211
$$ 82169 98816 118167 124450 140389 162628 161346 162836 156909 146213 126279 104778 92567
13411I2567r62N341J1213K1452M5761L6576N1475N3424N1463M2757K3182J5081
$$ 92567 91605 96946 108159 129611 175372 211948 263423 316847 368310 411067 434249 449330
13399D49330k0163m7853p3366n4180n0615m3092j4537j8379K849K3441L1025L3238
$$ 449330 429167 381314 307948 253768 203153 160061 145524 127145 129994 153435 184460 217698
13387B17698L8585M1811N6921L9600J2023p563k5795k2336p0097p1227n4327l0136
$$ 217698 256283 298094 355015 394615 406638 399075 373280 350944 280847 209620 155293 125157
13375A25157k4723P017J0799q303r428o298P781J4275J2213j079Q702J4113o222
$$ 125157 100434 107451 118250 109947 100519 94221 102002 116277 128490 127411 136113 150226 144004
13362A44004k2257j8198k2943k2897k2274O05J2942j897j1443P44o441k4930j9945
$$ 144004 121747 103549 80606 57709 35435 36040 48982 47085 35642 36386 29945 5015 -14930
13349a4930J3207J5997Q578K571r799M378K980l349M950N435L759J238q775r943
$$ -14930 -1723 14274 22852 25423 15624 20002 22982 19633 24583 30018 33777 35015 26240 16297
13335A6297q295r287J3826J7147p176j1881j2121K738N158J8482K2487L955n8
$$ 16297 8002 -1285 12541 29688 22512 10631 -1490 1248 6406 24888 47375 51330 51272
13322E1272n090o775j3157o718l35M794q256P165K1981p891k1505j6658m962J4313
$$ 51272 46182 39407 26250 19532 19197 23991 15735 22900 44881 36990 15485 -1173 -6135 8178
13308H178Q092m831J7259k617o357l063j79j072k643P132l063J3096o708q069
$$ 8178 16270 11439 28698 26081 19724 16661 16482 15410 12767 19899 16836 29932 23224 15155
13294A5155p133J034J6260O837K015k395K150P996n713p970l342m999n242Q398
$$ 15155 8022 9056 25316 32153 34168 31773 33923 41919 36206 28236 24894 19895 14653 23051
13280B3051J957J1028J1746p242j1257l467Q688n541j7594l425K253M205K025
$$ 23051 25008 36036 47782 40540 29283 25816 34504 28963 11369 7944 10197 14402 16427
13267A6427K683M747r300j317N674J2993J1247j0702j231j125j4606p297m282
$$ 16427 19110 23857 14557 13240 18914 31907 43154 32452 31221 30096 15490 8193 3911
13254C911J1122L542m249l894J195O295O878M638M515Q614J122J0669j6927j1830
$$ 3911 15033 18575 14326 10432 11627 17922 24800 29438 33953 42567 43689 54358 37431 25601
13240B5601N955Q439o741K886m90q684j389q254m399J365L418P973L986m745p133
$$ 25601 31556 39995 33254 36140 35650 26966 25577 17323 12924 14289 17707 25680 29666 24921 17788
13225A7788n73M616R667K0416L220m358j3627K483l664J0493P507k069j1568n976
$$ 17788 17215 21831 31498 51914 55134 50776 37149 39632 35968 46461 53968 51899 40331 34355
13211C4355N46j2528L400J3366j7480m761R894R059K2858J2345j0162j4678N17
$$ 34355 34901 22373 25773 39139 21659 16898 26792 35851 58709 71054 60892 46214 46731
13198D6731q013j443J2203j992j873j1453r577m265J6668J9214o46k4711k1103
$$ 46731 38718 37275 49478 47486 45613 34160 24583 20318 36986 56200 55554 30843 9740
13185I740o014J8745J6516J1664p46q704k08N302K824k966l321k313J919k406
$$ 9740 3726 22471 38987 50651 49905 41201 40993 46295 49119 46153 42832 40519 42438 40032
13171D0032K259r575j3427q560O480N751L983N512K0165l009j1159l630j483J5491
$$ 40032 42291 32716 19289 10729 17209 22960 26943 32455 52620 49611 38452 34822 33339 48830
13157D8830J0029K97K095q023l479J1546J0445n441j705J1263K9825K4229J3009
$$ 48830 58859 59156 61251 53228 49749 61295 71740 66299 64594 75857 105682 129911 142920
13144A42920j0937p24M107J3798M007K157j0981k1355k3788m960l909j339L788
$$ 142920 131983 131259 135366 149164 153171 155328 144347 122992 99204 94244 90335 88996 92784
13131I2784n02K20j0725j22J1060J1745P86J5680K3848J4733R096J7057J9898
$$ 92784 92282 92502 81777 81655 92715 104460 105246 120926 144774 159507 168603 185660 205558
13118B05558J5377J9874K1645r01k216r833j5833j6980j5838k0966k5820j8078
$$ 205558 220935 240809 262454 261553 259337 249504 233671 216691 200853 179887 154067 135989
13106A35989j4340j0832m179k3986k0691j1263J3621K5304L079m969l597Q272
$$ 135989 121649 110817 106638 82652 61961 50698 64319 89623 92702 87733 84136 92408
13094I2408K900L438J8142N241L728N474P101N882l256k699M14L542l140J621
$$ 92408 95308 98746 116888 122129 125857 131331 138432 144314 141058 138359 138773 142315 139175 140796
13080A40796k0481k3533Q076K71o448K386K4115K5571K3705J5003J0520N974k742
$$ 140796 120315 96782 104858 105129 98681 101067 125182 150753 174458 189461 199981 205955 203213
13067B03213P774j3600q295J390p180p162n984k1376j4349j4950J0611J5630K98
$$ 203213 210987 197387 189092 190482 183302 176140 170156 148780 134431 119481 130092 145722 146020
13054A46020q991j398O663R375P684J85J3272M1781M2033J3446K5840J6645J1832
$$ 146020 137029 135631 142294 151669 159353 159538 172810 214591 256624 270070 295910 312555 324387
13041C24387J9110M929l7390k3497j9183l2073k1580j4909n597n746k0631r246
$$ 324387 343497 348426 311036 287539 268356 236283 214703 199794 194197 188451 167820 158574
13029A58574p781K63p000j0982r900j1728J1624K9942J7756J2330o215J4862J9582
$$ 158574 150793 151056 144056 133074 123174 111446 123070 153012 170768 183098 176883 191745 211327
13016B11327l127J688R607J1616j3980j5154j5513j7920k8635j7302k4005j5474
$$ 211327 208200 209888 219495 231111 217131 201977 186464 168544 139909 122607 98602 83128
13004H3128n345q21m348k752K091L658q792J5636L736p300O577j2244j0647M777
$$ 83128 77783 76962 72614 69862 71953 75611 66819 82455 86191 78891 85468 73224 62577 67354
12990F7354J0566M416K499Q14K093n994O300j22r48O643L463l885j4399p417M36
$$ 67354 77920 82336 84835 85649 87742 81748 88048 87926 86978 93621 97084 93199 78800 71383 71819
12975G1819J6106P275q001p119N549M644M521j2995k9N864l239p043l56J0319
$$ 71819 87925 95200 87199 80080 85629 90273 94794 81799 81770 87634 84395 77352 76996 87315
12961H7315j0768J2361J3470k294k375p133j254J0746Q699k984q423q760l761
$$ 87315 76547 88908 102378 100084 97709 90576 89322 100068 108767 105783 97360 88600 84839
12948H4839N548L646m709q821m100j9283l070k319Q54M673J3188J0621k062j7971
$$ 84839 90387 94033 89324 80503 76403 57120 54050 51731 52585 57258 70446 81067 79005 61034
12934F1034l280n037J0201K0430R515p497m960l599N539L151o401j787N477O174
$$ 61034 57754 52717 62918 83348 92863 85366 80406 76807 82346 85497 79096 77309 82786 88960
12920H8960N523j273O893N469o463p287L952N592j1415N746J1149N524M545j9829
$$ 88960 94483 93210 100103 105572 99109 91822 95774 101366 89951 95697 106846 112370 116915 97086
12906I7086k0583r981J29J3950Q742n564j0840j0986R968K114p365p999L713J072
$$ 97086 76503 66522 66651 80601 89343 83779 72939 61953 71921 74035 66670 58671 62384 63456
12892F3456K466J8330N273P585Q574J680Q413J1236P526j377m619K2703j87m175
$$ 63456 65922 84252 89525 97110 105684 107364 115777 127013 134539 133162 128543 151246 151059 146884
12878A46884o905k4802j2286p143Q706O209K738K592k005j572l339k652J0955
$$ 146884 139979 115177 102891 95748 104454 110663 113401 115993 113988 112416 109077 106425 117380
12865A17380J534j1928j1003K62N092r149j2992J5961J3796L414J3353J794n465
$$ 117380 118914 106986 95983 96245 101337 92188 79196 95157 108953 112367 125720 127514 122049
12852A22049Q07m113p113l73J0450J6612k359n872O685J915r60j900k911l775
$$ 122049 122856 118743 111630 111257 121707 138319 135960 130088 136773 138688 137728 135828 132917 129142
12838A29142L469J0041J3851J8648N939R813J1303K8071K2979K4374M7480N5118
$$ 129142 132611 142652 156503 175151 181090 190903 202206 230277 253256 277630 325110 380228
12826C80228M9162K8309l17o8123q3106o5570l3700j7039m830J7243P827q149
$$ 380228 429390 457699 457382 389259 306153 240583 206883 189844 185014 202257 210084 201935
12814B01935j2306J775J2053J3305J7279r090n875O953O254J2292K1467L1141
$$ 201935 189629 191404 203457 216762 234041 224951 219076 226029 232283 244575 266042 297183
12802B97183K5346J4051K4586L9012L8529L5170M0895M8867O3179P1541Q9958
$$ 297183 322529 336580 361166 400178 438707 473877 514772 563639 626818 698359 788317
12791G88317J04257O2923n8616j47816j45909r7046m8851q718m248j3295N363
$$ 788317 892574 955497 896881 749065 603156 506110 457259 448541 444293 430998 436361
12780D36361Q625j2537l6563k0283j0045l1477j8481j9606m195j2002m022n436
$$ 436361 444986 432449 395886 375603 365558 334081 315600 295994 291799 279797 275775 270339
12768B70339k0800M336J2765K1107J6628J8185K7325K9306L7493M4741M0983N3477
$$ 270339 249539 253875 266640 287747 304375 322560 349885 379191 416684 461425 502408 555885
12756E55885N0491L4897m0666p9163p4677n0742k0322j2464k370k492r645J0340
$$ 555885 606376 641273 600607 521444 446767 396025 375703 363239 360869 358377 348732 359072
12744C59072L7085Q794K619J1002K1263K8979K9296L9820M2739L0631L4690O390
$$ 359072 396157 404951 407570 418572 439835 468814 498110 537930 580669 611300 645990 652380
12732F52380k4176k8170j6155M479K5967L6213K8220L4633L0140L3176M7103M8969
$$ 652380 628204 600034 583879 588358 614325 650538 678758 713391 743531 776707 823810 872779
12720H72779M4627L5159L7652N7744O3838N6956N7622L4599N0719R2064R1720
$$ 872779 917406 952565 990217 1047961 1111799 1168755 1226377 1260976 1311695 1403759 1495479
12709A495479R0423J07422J23615J57630J97025K20695K70096L58973M68965N86764
$$ 1495479 1585902 1693324 1816939 1974569 2171594 2392289 2662385 3021358 3490323 4077087
12699D077087P57548R79077J244074J555034J855301K120288K281188K164019
$$ 4077087 4834635 5813712 7057786 8612820 10468121 12588409 14869597 17033616
12691A7033616J579833O19745k38459q08959j225388j580793j782777j768878
$$ 17033616 18613449 19233194 18994735 18185776 16960388 15379595 13596818 11827940
12683A1827940j603283j311040r21957n70192k66731j3595K06410M04549N93740
$$ 11827940 10224657 8913617 7991660 7421468 7154737 7141142 7347552 7752101 8345841
12674H345841Q54368J192276J609383K121233K685455L269396L772140M148123
$$ 8345841 9200209 10392485 12001868 14123101 16808556 20077952 23850092 27998215
12666B7998215M261684L866115K782372J071590q71847k601706l747663m177103
$$ 27998215 32259899 36126014 38908386 39979976 39108129 36506423 32758760 28581657
12658B8581657m094564l847645l512889k958039k258589j608358j073047o73597
$$ 28581657 24487093 20639448 17126559 14168520 11909931 10301573 9228526 8554929
12650H554929l54504j17564P5489L19281N93615R17135J199170J399896J480820
$$ 8554929 8200425 8082861 8158350 8477631 9071246 9988381 11187551 12587447 14068267
12641A4068267J479572J388789J250717J070042Q89759O50504J10587p46985j530551
$$ 14068267 15547839 16936628 18187345 19257387 20147146 20797650 20908237 20161252 18630701
12632A8630701j834560j784581j669748j386705r14527l48114J46191O01837J002035
$$ 18630701 16796141 15011560 13341812 11955107 11040580 10692466 10838657 11440494 12442529
12623A2442529J411003J845217K280992K591734K643480K388952K015180J469987
$$ 12442529 13853532 15698749 17979741 20571475 23214955 25603907 27619087 29089074
12615B9089074M79074q64760j835188k085637k001424k034626k137294k074562
$$ 29089074 29568148 28703388 26868200 24782563 22781139 20746513 18609219 16534657
12607A6534657j827247j441019r98289n26882l6860M00146P95792J194022J665382
$$ 16534657 14707410 13266391 12268102 11741220 11704360 12104506 12900298 14094320 15759702
12598A5759702K227391K920005L678595M493026N243118N719621N722311N305538
$$ 15759702 17987093 20907098 24585693 29078719 34321837 40041458 45763769 51069307
12590E1069307M560519L362645J165844j904235m791254o538047p145637o828784
$$ 51069307 55629826 58992471 60158315 58254080 53462826 46924779 39779142 32950358
12582C2950358n875367m715791l662743k779956k028597j374377q39391m35661
$$ 32950358 27074991 22359200 18696457 15916501 13887904 12513527 11674136 11238475
12574A1238475j20060J16175L77410P38542J190013J648394K074869K411718K618420
$$ 11238475 11118415 11234590 11612000 12350542 13540555 15188949 17263818 19675536 22293956
12565B2293956K565759K216250J598887P82030j14590j032375k054449l196066
$$ 22293956 24859715 27075965 28674852 29456882 29342292 28309917 26255468 23059402
12557B3059402l984757l940053l267779k487542j844087j354556j003717p54979
$$ 23059402 19074645 15134592 11866813 9379271 7535184 6180628 5176911 4421932
12549D421932n71972m70499m15595l39838k64207j98493j53938j32959j26101
$$ 4421932 3849960 3379461 2963866 2624028 2359821 2161328 2007390 1874431 1748330
12540A748330j19397j09053r2949p4637o4365m8203m0536m8276l9596j8933j8038
$$ 1748330 1628933 1519880 1426931 1352294 1287929 1239726 1199190 1150914 1111318 1092385 1074347
12529A074347l7233o8095p4896p3901p1395o3631n3420m2768l6717k0257j0866
$$ 1074347 1037114 969019 894123 820222 748827 685196 631776 589008 552291 532034 521168
12518E21168k5694m0757r622m802j4961j0068q134j2931N142j086j8650o537j2669
$$ 521168 495474 454717 445095 440293 425332 415264 407130 394199 399341 398255 379605 373068 360399
12505C60399r949j7007l339l010j2862k4942j2609M56m110j5675J041j354k681
$$ 360399 350450 333443 330104 327094 314232 289290 276681 277137 273027 257352 258393 257039 254358
12492B54358j241j138p724L363q339o925R03k076Q549N719m806j3478m293n11
$$ 254358 253117 251979 244255 247618 239279 232354 233257 231181 239730 245449 240643 227165 222872 222361
12478B22361Q038P104p667j612J3970J2487M719m487K269l981n952K995J8777
$$ 222361 230399 237503 229836 228224 242194 254681 259400 254913 257182 253201 247249 250244 269021
12465B69021J2027J4117K1116J4726L354Q222J8965M476M382j6026j0862J186
$$ 269021 281048 295165 316281 331007 334361 342583 361548 366024 370406 354380 343518 344704
12453C44704k8077k774m098j1353J401n695j2607j5671K665R012p887q780L314
$$ 344704 316627 313853 309755 298402 299803 294108 281501 265830 268495 277507 269620 260840 264154
12440B64154R722Q80k681j351k271J6724P366q639o362m548J136q539p489L380
$$ 264154 273876 274756 272075 270724 268453 285177 292543 283904 277542 272994 274130 265591 258102 261482
12426B61482l288j4121P53L011m583K0375K6530J9095m890J6783J5717K958P128
$$ 261482 258194 244073 244826 247837 243254 263629 290159 309254 304364 321147 336864 339822 346950
12413C46950J7865J6036k875o813l591o80J9103J7752K2653J0425J2337K3881
$$ 346950 364815 380851 377976 371163 367572 366892 385995 403747 426400 436825 449162 473043
12401D73043J5653J9534J7181J4621J0821j148R200J3431L2515M2336K7344L3751
$$ 473043 488696 508230 525411 540032 550853 549705 558905 572336 604851 647187 674531 708282
12389G08282M4477M6275L8573M4050M3770L6196L5742L9120L9456N4108N0370
$$ 708282 752759 799034 837607 881657 925427 961623 997365 1036485 1075941 1130049 1180419
12378A180419P6217R2057J16579J30259J63187J84128K22676K85066L53519M25363
$$ 1180419 1256636 1348693 1465272 1595531 1758718 1942846 2165522 2450588 2804107 3229470
12368C229470N11558O43527P65833R00386J055539J257444J571445K040434K658330
$$ 3229470 3741028 4384555 5150388 6050774 7106313 8363757 9935202 11975636 14633966
12359A4633966L350185L981142M374235M247176L255586J272088j214996l336232
$$ 14633966 17984151 21965293 26339528 30586704 33842290 35114378 33899382 30563150
12351C0563150m286508m106448l289316k254939j226602k91021N61845J337043
$$ 30563150 26276642 22170194 18880878 16625939 15399337 15108316 15670161 17007204
12343A7007204K085020K723547L228463L517507L461740K753703J009896j616363
$$ 17007204 19092224 21815771 25044234 28561741 32023481 34777184 35787080 34170717
12335C4170717m053466n193833m948040m032230l085431k355753j795081j370100
$$ 34170717 30117251 24923418 19975378 15943148 12857717 10501964 8706883 7336783
12327G336783j038640q01151o29197n03698m23890l67420k96492k16020j52224
$$ 7336783 6298143 5496992 4867795 4364097 3940207 3572787 3276295 3060275 2908051
12318B908051j10473m8843j2528J301L1401O6217Q4524J35070J79454K18239K69239
$$ 2908051 2797578 2748735 2736207 2737508 2768909 2835126 2919650 3054720 3234174 3452413 3721652
12307C721652L11559M01362N17822O49625P85168R48401J129361J362310J710482
$$ 3721652 4033211 4434573 4952395 5602020 6387188 7335589 8464950 9827260 11537742
12298A1537742K217435K848355L620568M328281M793241M672924L581373J481590
$$ 11537742 13755177 16603532 20224100 24552381 29345622 34018546 37599919 39081509
12290C9081509o87994j821954k120832k119415j705301p36139O17805J945825
$$ 39081509 38393515 36571561 34450729 32331314 30626013 29889874 30507679 32453504
12282C2453504K849214L157193K830821K051591J183580P62868Q29158P46932
$$ 32453504 35302718 38459911 41290732 43342323 44525903 45288771 46117929 46864861
12274D6864861k67307k287370m182799m885108m343547l023874j539632k95165
$$ 46864861 46597554 44310184 40127385 35242277 30898730 27874856 26335224 26040059
12266B6040059M47097N36845O0762o24068j366488k319255l297327l712731l349502
$$ 26040059 26487156 27024001 27084763 26460695 25094207 22774952 19477625 15764894 12415392
12257A2415392k567962j805447j273826r27352p19486n82743m82190m09392l67879
$$ 12415392 9847430 8041983 6768157 5840805 5121319 4538576 4056386 3646994 3279115
12248C279115l08886k44825j89310j66884j42682j08831p1100l9837k0023J6320
$$ 3279115 2970229 2725404 2536094 2369210 2226528 2117697 2046597 2006760 1986737 2003057
12238B003057M4825O2962R7550J11901J47969K10623K60251L23896L95954N00972
$$ 2003057 2047882 2110844 2208394 2320295 2468264 2678887 2939138 3263034 3658988 4159960
12228D159960O06776P49331R22193J168929J480811J848076K251181K653206K950269
$$ 4159960 4766736 5516067 6438260 7607189 9088000 10936076 13187257 15840463 18790732
12219A8790732K952491K462033J230360n40720k231001l152702l030202k335936
$$ 18790732 21743223 24205256 25435616 24894896 22663895 19511193 16480991 14145055
12211A4145055j633435j041101n00644P5099O80744J276551J809268K265330K544806
$$ 14145055 12511620 11470519 10969875 11044974 11725718 13002269 14811537 17076867 19621673
12202A9621673K454123J864567P49706q33478k513922l621168l795934l217901
$$ 19621673 22075796 23940363 24690069 23856591 21342669 17721501 13925567 10707666
12194A0707666k386033j665734j137050q19817o18761m88103m42841m19077l93426
$$ 10707666 8321633 6655899 5518849 4699032 4080271 3592168 3149327 2730250 2336824
12185B336824l50277k79285k14007j71222j34661r9845q2284o5371n5326n3336
$$ 2336824 1986547 1707262 1493255 1322033 1187372 1087527 1005243 939872 884546 831210
12175H31210n1127m6891l2138l2555l6774m5763m1860l1834k1961m553M555Q884
$$ 831210 780083 733192 701054 668499 631725 585962 544102 512268 490307 485754 490309 499193
12163D99193R235J5200P453K0489Q613M202J546J8087K3762K4328J4246J5419
$$ 499193 508428 523628 531081 551570 560183 564385 565931 584018 607780 632108 646354 661773
12151F61773R179k126j7590l3493l2932k9084k9950k2018k2628j5026j9859q148
$$ 661773 670952 668826 651236 617743 584811 555727 525777 503759 481131 466105 446246 438098
12139D38098K4776J9040J8250L9091M6046O2262N1451L6998o67j4707k4034m9470
$$ 438098 462874 481914 500164 539255 585301 647563 699014 736012 735345 720638 696604 647134
12127F47134n1292o0855n8689n3870m9210n2529m7834k8527r401k0432q162j834
$$ 647134 595842 534987 476298 422428 373218 320689 272855 244328 234927 214495 206333 204499
12115B04499j7590n087j6860q28k543J4782l823L484J4101m17K1948R141J0281
$$ 204499 186909 181822 164962 164134 161591 176373 172550 176034 190135 189718 211666 220807 231088
12102B31088K2112j221r053j2943l2067l1869j6687q269r034l284L919J1152m095
$$ 231088 253200 251979 242926 229983 197916 166047 149360 141091 132057 128773 132692 143844 139749
12089A39749p4j178p016J2868O569M468j5501j5906q610k256j4524n418J4752
$$ 139749 139675 138497 131481 144349 150918 155386 139885 123979 115369 113113 98589 93171 107923
12076A07923J5451M059Q324n090l923R765k622r070j2347o379l913j4001j1069
$$ 107923 123374 127433 135757 130667 126744 136509 133887 124817 112470 106091 102178 88177 77108
12063G7108L627N559L030j698p933j1276J1035N700O729j682j1849Pj2652m932
$$ 77108 80735 86294 89324 87626 79693 68417 79452 85152 91881 90199 78350 78357 65705 60773
12049F0773K803l116J35j842r026l169J9467n73n687l528n727j947k773O646N390
$$ 60773 63576 60460 60595 58753 49727 46558 66025 65452 59765 56237 50510 48563 45790 52436 57826
12034E7826n16j5725M109Q339r017L416o04j0924j3562m900J2235J6205p51k35
$$ 57826 57310 41585 45694 54033 45016 48432 47828 36904 23342 18442 30677 46882 46131 45896
12020D5896q746l837K319m672N076J4292p087o026q674m134J2898J4538M549P7
$$ 45896 37150 33313 35632 30960 36036 50328 43241 37215 28541 24407 37305 51843 56392 56469
12006E6469j0357M283m666K214l780k444J2450n651j7120J2503k745K549P854
$$ 56469 46112 50395 45729 47943 44163 41719 54169 48518 31398 43901 41156 43705 51559
11993E1559O99J93l736K410p771j251R31M65J8966L706k6467m354N269j0443k651
$$ 51559 52258 52451 48715 51125 43354 42103 43034 43499 62465 66171 39704 35350 40619 30176 27525
11978B7525R737J0104J8095L334m709n715R963R979O9j3549j3746j523O845j4950
$$ 27525 37262 47366 65461 68795 64086 58371 68334 78313 78382 64833 51087 49564 56409 41459
11964D1459j406O774m15n017o224j0980O55K178l573q090m68j845L128J2723Q966
$$ 41459 40053 46827 46412 41395 35171 24191 24846 27024 23451 15361 14893 13048 16176 28899 37865
11949C7865O245j808j1300o822j2742j0664K3814J7802j996L767N231j380J678
$$ 37865 44110 42302 31002 24180 11438 774 24588 42390 40394 44161 49392 48012 49690
11936D9690k679j3127M163N711M983O724J3235J3499J5215p433J9615L9016N0857
$$ 49690 47011 33884 38047 43758 48741 55465 68700 82199 97414 89981 109596 148612 199469
11923A99469O3665P8320P3444P6050j3191j21888j35473p3407l2268p975q446
$$ 199469 263134 341454 414898 490948 477757 355869 220396 146989 114721 106746 98300
11912I8300M217K855J2241J3477K856J5758J7775K7586J0948O079j3420j4410
$$ 98300 102517 105372 117613 131090 133946 149704 167479 195065 206013 212092 198672 184262
11900A84262k2439j2462o446j4234L628n601q74J5927J2715J2277J1959J0122
$$ 184262 161823 149361 142915 128681 132309 126708 125834 141761 154476 166753 178712 188834
11888A88834J0130O784l941j119j9440l5216j9465l2673o832J442R19M585j7786
$$ 188834 198964 205748 201807 200688 181248 146032 126567 93894 87062 88504 89423 94008 76222
11875G6222j6087j6419r27J3553K127R007j3601r316L410o707k866j1471P972
$$ 76222 60135 43716 42789 56342 58469 67476 53875 44559 47969 41262 38396 26925 34897
11862C4897J0225M32n490k032J2786r746O676J3478K205k010l020M740J2197J1853
$$ 34897 45122 45554 40064 38032 50818 41072 47748 61226 63431 61421 58401 63141 75338 87191
11848H7191p326Q029J7158J2959K3563L1999K3656K8173K873n060P67j5636k4818
$$ 87191 79865 87894 105052 118011 141574 173573 197229 225402 228275 223215 223982 208346 183528
11835A83528j566l078O96J4657J6459J831J3826K2299N956J0387J4360k903j0903
$$ 183528 181962 178884 179580 194237 210696 212527 226353 248652 254608 264995 279355 276452 265549
11822B65549k7536j7624k1521k3601j4802m570Q89N535N171P948j421p174m277
$$ 265549 238013 220389 198868 175267 160465 155895 156784 162319 167490 175438 174017 166843 162566
11809A62566k2922k0994j9883k9651k6524L078K474j5892O65J1820l589M087J200
$$ 162566 139644 118650 98767 69116 42592 45670 48144 32252 32917 44737 41148 45235 46435
11796D6435M267q999q067n824j288J0782L4n700P322J737n103M906N02l358l103
$$ 46435 50702 41703 33636 27812 26524 37306 37340 31640 38962 40699 35596 40502 41004 37646 34543
11781C4543N886J5334m689O537K2659j123j3196m871Q608O712J4637L0741K0824
$$ 34543 40429 55763 51074 57611 80270 79147 65951 61080 69688 76400 91037 121778 142602
11768A42602J4903J4538N492k5868k7645j6161m291K496o892p355K372L036P619
$$ 142602 157505 172043 177535 151667 124022 107861 103570 106066 99174 91819 94191 97227 104846
11755A04846p917q743R89J6443J7319J3275J4205j4401k1022k2412j6638k2556
$$ 104846 96929 88186 89175 105618 122937 136212 150417 136016 114994 92582 75944 53388
11743E3388j2201K525j0421o837K123Q127N34j4200j5031j3168M638P746N231
$$ 53388 41187 43712 33291 26454 28577 36704 37238 23038 8007 -5161 -523 7223 12454
11730A2454K012K2322Q529j9158r701m843k797O476Q644J266J150m456k630j48
$$ 12454 14466 36788 45317 26159 16458 11615 8818 15294 23938 25204 26354 21898 19268 19120
11716A9120L722o773Q32J2965K578j1000J265M017P425R619j2239j4868J660N749
$$ 19120 22842 16069 16901 29866 32444 21444 22709 26726 34151 43770 31531 16663 18323 24072
11702B4072J1124j500J062j452J198q486M569K747p489O485j262J114l716Q613
$$ 24072 35196 33696 34758 33306 34504 26018 30587 33334 25845 32330 31068 32182 28466 37079
11688C7079J267p139l66j0672q530r83K650K8146O896r205k234Q22J436j2735
$$ 37079 38346 31207 30841 20169 11639 10656 13306 41452 48348 39143 36909 37731 39167 26432
11674B6432O658J5688m072j8202o971J0995M988r951j1754m598O753M799j524
$$ 26432 33090 48778 44706 26504 19533 30528 35516 25565 13811 9213 15966 20765 19241
11661A9241j6360j1282m193Q700L082J1310j0618k130J5546J4919K547L649n04
$$ 19241 2881 -8401 -12594 -3894 -812 10498 -120 -2250 13296 28215 30762 34411 33907
11648C3907j1172n612n28N01j3420P400O492N422o103l144m793J04J190l496j56
$$ 33907 22735 17123 16595 17096 3676 11076 17568 22990 16887 13743 8950 9054 10244 6748 6592
11633F592N195n78n121J0039K0740O163j6667r77q178j3171m293L923P704J6575
$$ 6592 11787 11209 6088 16127 36867 43030 26363 25386 17208 4037 -256 3667 11371 27946
11619B7946Q945N236r983j1090J532J6550m103j3861p525N632Q544J834m359j8106
$$ 27946 36891 42127 32144 21054 22586 39136 35033 21172 13647 19279 27823 29657 25298 7192
11605G192q396O476K489J2671P478j1738j1429O430K085j6654M134J5585n42p623
$$ 7192 -1204 5272 7761 20432 27910 16172 4743 11173 13258 -3396 738 16323 15781 8158
11591H158O289P405l125j0269q621j906N038J8464J4695N39L428j480m102r462
$$ 8158 14447 21852 18727 8458 -163 -2069 2969 21433 36128 36667 40095 38615 34513 25051
11577B5051n906q045o463L576J7237J4569Q604L880j7820j7359m809M765J7871
$$ 25051 19145 11100 4637 8213 25450 40019 48623 52503 34683 17324 12515 17280 35151
11564C5151J2187P368m385J731k492P11n80n329j6037J432M584m331L560k635
$$ 35151 47338 54706 50321 52052 49560 50271 49691 44362 28325 29757 34341 30010 33570 30935
11550C0935k943o524O659R356P221j2272k293M277r063L080N800l902p939Q917
$$ 30935 27992 21468 28127 37483 44704 32432 30139 34416 25353 28433 34233 30331 22392 31309
11536C1309m069o690M431j993K41K189j0700l561k013P192l434L758J0728R827
$$ 31309 27240 20550 24981 22988 23229 25418 14718 11157 9144 16336 12902 16660 27388 37215
11522C7215O708k106j1687j0448R38k208J3684R403r461P618J8635q189j5385
$$ 37215 43923 41817 30130 19682 20620 18412 32096 41499 32038 39656 58291 50102 34717
11509C4717K661J617r885L240J4335J5089N798j4140j9344K589l147q286J0766
$$ 34717 37378 38995 29110 32350 46685 61774 67572 53432 34088 36677 33530 25244 36010
11496C6010O867j01M281K537q92N05p856q846j0236Q181L050m82l421l50l463
$$ 36010 42877 42776 47057 49594 48702 49207 41351 32505 22269 30450 33500 33018 29597 29247 25784
11481B5784J24R996J372o07r37n247p060J5603K0522o831p976q272J0321P615
$$ 25784 25908 35904 37276 36669 35732 30485 23425 39028 59550 52719 44743 36471 46792 54407
11467E4407l636K795k1749k2388j0542O463J0297J3516k073L720J665q118k330
$$ 54407 50771 53566 31817 9429 -1113 5350 15647 29163 27090 30810 32475 24357 22027
11454B2027N524M610R694Q868J568j689J2907P151q665m365O176J398j3955j9934
$$ 22027 27551 32161 41855 50723 52291 50602 63509 70660 61995 57630 63806 65204 51249 31315
11440C1315j652R690O182K059J346M176n031R02j982O588k702O545N248O363K563
$$ 31315 29663 39353 45535 47594 48940 53116 48085 48987 47005 53593 50891 57436 62684 69047 71610
11425G1610l91j5390o788J0346J3581J990J391j7882l56j0300j2065M817l498
$$ 71610 71219 55829 49041 59387 72968 74958 76349 58467 58111 47811 35746 40563 37065
11412C7065O143n715j2324K155k072R777L18M864O291Q534k96r581k695j5951
$$ 37065 43208 37493 25169 27324 25252 35029 35347 40211 46502 55036 54740 45159 42464 26513
11398B6513N847q80P63o263Q926J009Q041J39j0466N590K243m065L6Q899J3479
$$ 26513 32360 31480 32243 25980 34906 35915 43956 44095 33629 39219 41462 37397 37433 46332 59811
11383E9811J957n073j0814m583K210l215J3580J170o753J724j7817J0662J2698
$$ 59811 61768 56695 45881 41298 43508 40293 53873 55043 48290 50014 32197 42859 55557
11370E5557J146q049L523J1162J0918p216N71K35m761L866P381Kr567j0289m98
$$ 55557 56703 48654 52177 63339 74257 67041 67612 67847 63086 66952 74333 74335 64768 54479 53981
11355E3981l378p161J644R912p43K951J6856J857j5848J885l803Q552l92L285
$$ 53981 50603 43442 45086 54998 54255 57206 74062 75919 60071 61956 58153 66705 66313 69598
11341F9598L490j174L683j4086j3029n487R487J904m140k104o841l803N915J3279
$$ 69598 73088 71914 75597 61511 48482 42995 52482 54386 50246 48142 41301 37498 43413 56692
11327E6692J3370r533k785p43K81l861N092M892q019j983Q171J1048j3012j3377
$$ 56692 70062 60529 57744 57001 57282 53421 58513 63405 55386 53403 61574 72622 59610 46233
11313D6233L603J0217K467R713q75j7554k232j707K355k053M07N531J1178l730
$$ 46233 49836 60053 62520 72233 71358 53804 51572 49865 52220 50167 50574 56105 67283 63553
11299F3553k060K0923r830l614o47r94j5711j4010n960Q230M936L373L869K416
$$ 63553 61493 82416 72586 68972 68325 67331 51620 37610 31650 39880 44816 48189 52058 54474
11285E4474R36K303J0791J4944Q871J0483J343j6384r345J6742P217l604k431
$$ 54474 55410 57713 68504 83448 92319 102802 104145 87761 78416 95158 102375 98771 96340
11272I6340N349O770M068L140k088k0131n934J2185P253N502Q111J0550J4969
$$ 96340 101689 108459 112527 115667 113579 93448 87514 99699 106952 112454 120565 131115 146084
11259A46084K4535J5417K5624K3537J4208M1091M2784N0090P1865Q4305Q6982
$$ 146084 170619 186036 211660 235197 249405 290496 333280 383370 455235 539540 626522
11248F26522J11234J19469J11138P9335K7340m3815r1150j19098j20557j23647
$$ 626522 737756 857225 968363 1047698 1075038 1031223 940073 820975 700418 576771
11238E76771j10755q8900n2096l3834l7959k2933K66j0845k1710k3826j4775m633
$$ 576771 466016 377116 325020 291186 253227 230294 230560 219715 198005 174179 159404 154771
11226A54771l465R529j1383q413O097j1369j3230J182K634J1795L002j268j2751
$$ 154771 151306 160835 149452 141039 147136 135767 122537 123719 126353 138148 141150 139882 127131
11213A27131r937K592M823J404L637j6264k0355o393J6569q43j0361j3401k668
$$ 127131 117194 119786 124609 126013 129650 113386 93031 86638 103207 102364 92003 78602 75934
11200G5934L096M359J1190q122K389l411o483J9883P631o088j1396O280j046q145
$$ 75934 79030 83389 94579 86457 88846 85435 78952 98835 106466 100378 88982 95262 94216 86071
11186H6071j853j186J0817J978n801N613r149q170j5j238p723O518j0553P689
$$ 86071 84218 83032 93849 95827 90026 95639 86490 78320 78305 77067 69344 75862 65309 72998
11172G2998Q592l331L919L697J0709j2356n384P741M662j099o200o75N538k523
$$ 72998 81590 78259 82178 85875 96584 84228 78844 86585 91247 90148 83948 83273 88811 86288
11158H6288N804J4369j972K083M505n184j4886L262K541j492L428P407j0174O444
$$ 86288 92092 106461 104489 106572 111077 105893 91007 94269 96810 95318 98746 106153 95979 102423
11144A02423j1169p634J598o502P851n915K523L052n957j3242k9604k1165N357
$$ 102423 91254 83620 85218 78716 86567 80652 83175 86227 80270 67028 37424 16259 21616
11131B1616Q684L368l091J4784P682R740q540Q262J9926l251Q574j778j2442J26
$$ 21616 30300 33668 30577 45361 53043 62783 54243 62505 82431 79180 87754 85976 73534 73660
11117G3660O581j8J2728K5228Q334q963J4284j267p360Q736N032k1493j1669J2280
$$ 73660 80241 80223 92951 118179 126513 117550 131834 130567 123207 131943 136975 115482 103813 116093
11103A16093j212O726l632j0535O915N263Q510P089P606j1184Q760R722M037M083
$$ 116093 114881 121607 117975 107440 114355 119618 128128 135217 142823 131639 140399 150121 154158 158241
11089A58241M361n145P272J6057r705K983J6822m453J3507o641o425J1417M669
$$ 158241 162602 157457 164729 180786 171081 174064 190886 186433 199940 193299 186874 198291 202960
11076B02960k624m567p871j311L792J0658N041J9023p858j4219j6964r091n027
$$ 202960 200336 195769 187898 186587 190379 201037 206078 225101 217243 203024 186060 176969 171942
11063A71942L913O210r421n732n879J4973J5450l831m105j3503Q53j523j6534
$$ 171942 175855 182065 172644 166912 161033 176006 191456 187625 183520 170017 170870 169347 152813
11050A52813R19J3039o117n186N12P538J71J320p694r359M673p938M676M361k57
$$ 152813 153732 166771 160654 155468 155980 163518 163689 165009 157315 147956 152629 144691 149367 153728 153471
11035A53471n178j0588M567p468j3442o834J1595J6313J5172R012P493J6693J7953
$$ 153471 148293 137705 142272 134804 121362 114528 126123 142436 157608 166620 174113 190806 208759
11022B08759J790j873r30n540r314M9o825j7061R48J058o270J0991K3620J747
$$ 208759 210549 208676 207746 202206 192892 192941 186116 169055 170003 171061 164791 175782 199402 201149
11008B01149j0165Q73M579J0241P852o518q515j3299J2902Q845k706j5610m985
$$ 201149 190984 191857 196436 206677 214529 208011 199496 186197 199099 207944 205238 189628 184643
10995A84643j156L177J5732K888N596N602P169j664N541O943o260o192K706k298
$$ 184643 183487 186664 202396 205284 210880 216482 223651 221987 227528 234471 228211 222019 224725 222427
10981B22427j3530P012k93p888j6845P983o422l161J1297Q853n264j379j022p405
$$ 222427 208897 215909 215616 207728 190883 198866 192444 189283 200580 209433 204169 202790 201768 194363
10967A94363L499P741N78m72n022j2416P345r551K365j023J0184J6443J9574L7424
$$ 194363 197862 205603 206181 205709 200687 188271 195616 186065 188430 187407 197591 214034 233608 271032
10953B71032L0852L6400N5451N4700M1622K8481K4257K2284J4303l45o871j1448
$$ 271032 301884 338284 393735 448435 490057 518538 542795 565079 579382 579037 572166 560718
10941E60718j4116o171N391o59l436q844m452m959M34N41j063r787n637N144R233
$$ 560718 546602 540431 545822 545163 541727 532883 528431 523472 523906 524447 523384 513597 507960 513104 522337
10926E22337Q869M850M017J0123J8325J4229l63j2215q508q755j793l191J4900
$$ 522337 531206 536056 540073 550196 568521 582750 582387 570172 561664 552909 551116 547925 562825
10913E62825P544J398J8755J8298J6088K6521J6370J5626K0016K2834K4829J8292
$$ 562825 570369 571767 590522 608820 624908 651429 667799 683425 703441 726275 751104 769396
10901G69396J6584K0890K7104K5649L5008M2005K9597K5309M1587N2370J8517
$$ 769396 785980 806870 833974 859623 894631 936636 966233 991542 1033129 1085499 1104016
10890A104016P94P162K6439L2187J7719Q610K8569L7854L5176M6512N8464O3886
$$ 1104016 1104810 1111972 1138411 1170598 1188317 1196927 1225496 1263350 1298526 1345038 1403502 1467388
10878A467388N6024M7728N2547N9169N3452N3186O8426Q6301P0999O9400P2313
$$ 1467388 1523412 1571140 1623687 1682856 1736308 1789494 1857920 1944221 2015220 2084620 2156933
10867B156933Q5160J00009J29509J28534J22953J51997J84473J95571K10399K03662
$$ 2156933 2242093 2342102 2471611 2600145 2723098 2875095 3059568 3255139 3465538 3669200
10857C669200K26564K48660K60532K76815L24443L71898M22620M60205N10146
$$ 3669200 3895764 4144424 4404956 4681771 5006214 5378112 5800732 6260937 6771083
10848F771083O09690P19609Q20644R31927J100558J311469J546623J823585K172237
$$ 6771083 7380773 8100382 8921026 9852953 10953511 12264980 13811603 15635188 17807425
10839A7807425K582535L071584L683278M493787N493615O786163Q381770J0432258
$$ 17807425 20389960 23461544 27144822 31638609 37132224 43918387 52300157 62732415
10831F2732415J3012014J6126613J9465092K2360487K3712125K2071654J6048876
$$ 62732415 75744429 91871042 111336134 133696621 157408746 179480400 195529276
10824A95529276N170250q695165k1156148k8017430k8336791k4374602j9011694
$$ 195529276 200699526 192004361 170848213 142830783 114493992 90119390 71107696
10817G1107696j4126245j0331419p624128n808939m609428l814032l212556k738186
$$ 71107696 56981451 46650032 39025904 33216965 28607537 24793505 21580949 18842763
10809A8842763k319405k002881j723221j477942j233839j001495q33156o91355
$$ 18842763 16523358 14520477 12797256 11319314 10085475 9083980 8250824 7559469
10801G559469n66267m34151l15249k26940j31285o2112m6922o2681j19812k64963
$$ 7559469 6993202 6559051 6243802 6016862 5885577 5823465 5776543 5713862 5594050 5329087
10791E329087m05071m75020m83738m32316l51190k73381k30225j97515j55960
$$ 5329087 4924016 4448996 3965258 3532942 3181752 2908371 2678146 2480631 2324671
10782B324671j22262j17078j27174j28326j15702j09117r7630p6654q5376p8385
$$ 2324671 2202409 2085331 1958157 1829831 1714129 1605012 1507382 1430728 1345352 1266967
10772A266967n6427l6737m2312m7172m2664k9911l4575l5223k4125m2032m3081
$$ 1266967 1210540 1173803 1131491 1084319 1041655 1011744 977169 941946 917821 875789 832708
10761H32708k2353k5993j9809k5934j2989j3393n488Q57k2505l2615j1193n237
$$ 832708 810355 784362 764553 738619 725630 712237 706749 707606 685101 652486 641293 636056
10749F36056o984k1136j3277J2284K948j1243r770k3030j6636q25O083L856l001
$$ 636056 629072 607936 594659 606943 609891 598648 588878 565848 549212 548387 554470 558326 555325
10736E55325j7091p924j2802j2307k1641j7664j7976k0259q552n711M368J8512
$$ 555325 538234 530310 517508 505201 483560 465896 447920 427661 419109 413398 417766 436278
10724D36278J3209J2733l32k575n291L943L088K1266K8685M6632O5106O3664R7261
$$ 436278 449487 462220 461888 459313 454022 457965 461053 482319 511004 557636 622742 686406 783667
10711G83667J39098J74615K15810K77720K94987K75480J96802j8566k86003l63612
$$ 783667 922765 1097380 1313190 1590910 1885897 2161377 2358179 2339613 2053610 1689998
10701A689998l19874k15941j48538j00365n5976m5827l2757k8356m0863m4798
$$ 1689998 1370124 1154183 1005645 905280 849304 803477 770720 742364 701501 656703
10691F56703l4924k4202m0486m5253l8081k5337k4195m873p400p330j3428j3585
$$ 656703 621779 597577 557091 511838 473757 448420 424225 419352 411952 404622 391194 377609
10679C77609j3048k248m094j1018k3161j1681O36n547q408j3993o751N658O572
$$ 377609 364561 362313 358219 347201 324040 312359 312995 307448 299040 285047 278296 283954 290526
10666B90526q02j6541k270j786j0145j146J5706l575M183R891n081j6542j3834
$$ 290526 289724 273183 270913 269127 258982 257836 273542 269967 274150 284041 278960 262418 248584
10653B48584j738J500R3K5332Q097j2371p824j5592q387P33R291J5485K3533L524
$$ 248584 246846 248346 248439 273771 281868 269497 261673 246081 237694 238427 247718 263203 286736 290260
10639B90260j8179j881n022n802l506m856j7343J9838M0348J4929m277M385j672
$$ 290260 272081 270200 265178 259376 255870 251014 233671 253509 293857 308786 304509 308894 307222
10626C07222j3741P056J2627K4124K2328q969j9774j4491j8818P492Q987J4847
$$ 307222 293481 300537 313164 337288 359616 350647 330873 316382 297564 305056 314043 328890
10614C28890P254J5650J401n182j6371j1885O627L0527K4217M653j1901l2020
$$ 328890 336144 351794 353195 348013 331642 319757 326384 356911 381128 385781 373880 341860
10602C41860m0652j5885p630j5974J5831J3436L327j4958l7748l9803j5791l849
$$ 341860 301208 285323 277693 261719 277550 290986 294313 279355 241607 201804 186013 182164
10590A82164J7533K6995J6288j233j1636j5723j1305N324J5224J5397K0686J2763
$$ 182164 199697 226692 242980 241747 230111 214388 203083 208407 223631 239028 259714 272477
10578B72477P877J0599j8818j9395O429k149k09J2529K875K868o637J544Q573
$$ 272477 280354 290953 272135 252740 259169 257020 256811 269340 272215 275083 268446 269990 278563
10565B78563j234j432J2484N312Q043J0121m052j931j5852k2867j1497J6804J2394
$$ 278563 277329 275897 288381 293693 301736 311857 307805 305874 290022 267155 255658 272462 284856
10552B84856J2590O760R284j0509n141K0316J7268O572J2158m722J353k6211j2262
$$ 284856 297446 304206 313490 302981 297840 318156 335424 341996 354154 349432 350785 324574 312312
10539C12312j0815m171K2506K9309K4301K0851M383k249q974j2351r161j3559
$$ 312312 301497 297326 319832 349141 373442 394293 398676 396427 387453 375102 365941 352382
10527C52382q889j5832l3506q942K4639P573J3306J4395O376o706k1989r438k0369
$$ 352382 343493 327661 294155 285213 309852 317425 330731 345126 351502 344796 322807 313369 293000
10514B93000k9022j7122k1524q004K44l558R952j063N705J743p659j1076j4327
$$ 293000 263978 246856 225332 217328 217572 214014 223966 222903 228608 230351 222692 211616 197289
10501A97289l991L672L294j0294m582p407j5223j2734n545p093j2735K610K6519
$$ 197289 193298 196970 200264 189970 185388 177981 162758 150024 144479 137386 124651 127261 153780
10488A53780M2609M4557L6931K1195N301k3649j3530j1551k601J3738L2157K9445
$$ 153780 196389 240946 277877 299072 304373 280724 267194 255643 253042 266780 298937 328382
10476C28382M709j5502j9730k6616q581R620R118M717J3248K3211N960O194J3690
$$ 328382 333091 317589 297859 271243 262662 272282 281400 286117 299365 322576 328536 334730 348420
10463C48420K128j0334j206k399N954j0266j1152L675J428j366j113k214J2074
$$ 348420 350548 340214 339008 336609 342563 332297 321145 324820 326248 324882 323769 321555 333629
10450C33629L704P427m971r202r160J0101q876j6271p47O838j6190k580J820L627
$$ 333629 337333 344760 339789 330587 321427 331528 322652 306381 305634 312472 296282 293702 295522 299149
10436B99149J4853J1666J3092J4899J1246J0925J108R901J781m220Q07n147m637
$$ 299149 314002 325668 338760 353659 364905 375830 376938 386839 388620 384400 385207 380060 375423
10423C75423R67J0855J8279K6600N2754R2690R9396J20669J66428J88372J68145
$$ 375423 376390 387245 405524 432124 484878 577568 676964 797633 964061 1152433 1320578
10412A320578J01314R259l2350l4387m4820k2781K0133K6655O1665Q7852J07633
$$ 1320578 1421892 1431151 1398801 1364414 1319594 1296813 1316946 1343601 1405266 1493118 1600751
10401A600751J18720R0493N3025K3277l7210j03937j34601j54012j49874j13230
$$ 1600751 1719471 1809964 1862989 1886266 1849056 1745119 1610518 1456506 1306632 1193402
10391A193402p0074n9927m2422k8343j9959j6875j8594r794j967j1211o642j0931
$$ 1193402 1123328 1063401 1020979 992636 972677 955802 937208 927414 925447 914236 907594 896663
10379H96663k7940k3985q000M101L890n389O163K7515L3046M2315J5889O462J5581
$$ 896663 868723 844738 836738 840839 844729 839340 845503 873018 906064 948379 964268 970730 986311
10366I86311J1994K0839K4224L4586K8703J9931M3974L6789M6125M7255M1682
$$ 986311 998305 1019144 1043368 1077954 1106657 1126588 1170562 1207351 1253476 1300731 1342413
10355A342413L3769M3554M6090K3508J8764L4835K5673J2612K8034M8446M0908
$$ 1342413 1376182 1419736 1465826 1489334 1508098 1542933 1568606 1581218 1609252 1657698 1698606
10344A698606N2767O7158Q1378J05410R3563Q0657O9339O3161M6673N3382N4829
$$ 1698606 1751373 1818531 1899909 2005319 2098882 2179539 2248878 2312039 2358712 2412094 2466923
10333B466923R9192R5327R8826J20921J22659J36444J64451J86050J95297K17085
$$ 2466923 2566115 2661442 2760268 2881189 3003848 3140292 3304743 3490793 3686090 3903175
10323C903175K36054K53396K89079K98053K97092K91395L10287L45172M02660
$$ 3903175 4139229 4392625 4681704 4979757 5276849 5568244 5878531 6223703 6626363
10314F626363M82855N68169O44663P51711Q40975R43854J092340J283476J479451
$$ 6626363 7109218 7677387 8322050 9073761 9914736 10858590 11950930 13234406 14713857
10305A4713857J671550J881594K054827K274915K748844L537757M629618O115026
$$ 14713857 16385407 18267001 20321828 22596743 25345587 28883344 33512962 39627988
10297C9627988Q110760J0677785J3918569J8208418K4013778L1415646M0089642
$$ 39627988 47738748 58416533 72335102 90543520 114557298 145972944 186062586
10290A86062586M8466257N3734451N2887443M1281445P405192m5692013p8051765
$$ 186062586 234528843 288263294 341150737 382432182 389837374 344145361 266093596
10283B66093596p3179093n3780274l6639314k4895402j7251181j2214922q836990
$$ 266093596 192914503 139134229 102494915 77599513 60348332 48133410 39296420
10276C9296420o475215m829116l669157k864368k271489j832167j539558j369734
$$ 39296420 32821205 27992089 24322932 21458564 19187075 17354908 15815350 14445616
10268A4445616j346287j377950j306888j123264r29497p51254o11490m93850l86014
$$ 14445616 13099329 11721379 10414491 9291227 8361730 7610476 6998986 6505136 6119122
10259F119122k91378k00086q6824P332J39560K83639M31355M81487L99402N5305
$$ 6119122 5827744 5627658 5540834 5548166 5687726 5971365 6402720 6884207 7283609 7338914
10249G338914n49790j009538r98516p61862n46660l97270l07141k57709k12101
$$ 7338914 6789124 5779586 4781070 4019208 3472548 3075278 2768137 2510428 2298327
10240B298327j53575j36181j24677j17163r8614q6515o0584m6414m5050k4807
$$ 2298327 2144752 2008571 1883894 1766731 1668117 1581602 1521018 1474604 1429554 1404747
10230A404747k0184n6891o1454p3721o6977o6603o6488n5788n8719l7810k0503
$$ 1404747 1384563 1327672 1266218 1192497 1125520 1058917 992429 936641 877922 840112 819609
10219H19609j6624j7933k9930p330J5211R35j8888j3502p468p080j1344m241O513
$$ 819609 802985 785052 755122 747792 763003 763938 745050 731548 724080 717000 705656 701415 707928
10206G07928n73J0091o200j0576j804q447m787j074q736j8524j3442n717k1564
$$ 707928 707355 717446 711246 700670 698866 690419 685632 684558 675822 657298 643856 638139 616575
10193F16575l3012l9633k8812j0434l008N13k8994q565K338k3858k8082k0546
$$ 616575 583563 543930 515118 504684 501676 502189 473195 464630 466968 443110 415028 394482
10181C94482j1351j1302k8570l1407J590J5631l733J2881m538J3721M9070L2826
$$ 394482 383131 371829 343259 311852 313442 329073 325340 338221 333683 347404 396474 429300
10169D29300L6429L0631K4291Q00J0003L0278L9044M9032O4459O4514M8152M7564
$$ 429300 465729 496360 520651 521451 531454 561732 600776 649808 714267 778781 826933 874497
10157H74497M1150j1746m9699n6090o7131n3513n1716l1520m1557m2771j2946
$$ 874497 915647 903901 854202 798112 730981 677468 625752 594232 552675 509904 496958
10146D96958j1244p918j6484k1126j6651p01p723l124O066m37n209P476J1527
$$ 496958 485714 477796 461312 440186 423535 422834 415111 411987 418053 417616 412407 419883 431410
10133D31410k271j5818p730K326K1139K3702J4380K0514K4925J0979o747j4297
$$ 431410 429139 413321 405591 407917 429056 452758 467138 487652 512577 523556 516809 502512
10121E02512j9709k8176k7718l4455l0362r743k2237r495k561N973Q087l934K601
$$ 502512 482803 454627 426909 392454 362092 352349 330112 320617 318056 324029 332116 328182 330783
10108C30783M971J3379J2367J0092J8646J6722J9799K5188J3136K0921R722j0532
$$ 330783 335754 349133 361500 371592 390238 406960 426759 451947 465083 486004 495726 485194
10096D85194r320R911j768n594r745k3083m1170j3609J898K5027J8302L9658K8306
$$ 485194 475874 485785 484017 478423 468678 445595 404425 390816 392714 417741 436043 475701 504007
10083E04007J7433K710j4813k591j3080j5955q822j2738o538r426L027J0655J4477
$$ 504007 521440 524150 509337 506746 493666 477711 468889 456151 449613 440187 443214 453869 468346
10070D68346J2238J1543K5562K5135L1670M9543M2612K4291L2055K1500P521L812
$$ 468346 480584 492127 517689 542824 574494 624037 666649 690940 722995 744495 752016 755828
10058G55828j5911j8320p230O178J1922K9023L7768K5487L9904O1582N0597N7745
$$ 755828 739917 721597 714367 720545 732467 761490 799258 824745 864649 926231 976828 1034573
10046A034573O1724R6877J07590J31969J50716J86190K27958K70509L34526M12943
$$ 1034573 1096297 1193174 1300764 1432733 1583449 1769639 1997597 2268106 2602632 3015575
10036C015575N05297N95168O93437P94125Q80855R54579R73990R03820P51452
$$ 3015575 3520872 4116040 4809477 5603602 6484457 7439036 8413026 9316846 10068298
10027A0068298N33331L35443J89536J84130K98436M41547O31572Q22583R85915
$$ 10068298 10601629 10937072 11126608 11310738 11609174 12050721 12682293 13504876 14490791
10018A4490791J002215Q65506N67611K24488k8549j11303m4943P8125J66334J84614
$$ 14490791 15493006 16358512 16926123 17150611 17122062 17010759 16965816 17043941 17210275 17394889
10008A7394889J32137J20925K73280N77760R17775J262618J536839J542470J176841
$$ 17394889 17527026 17647951 17921231 18498991 19416766 20679384 22216223 23758693 24935534
9999B4935534M37622m71567j268349j655060j603855j276478q54961m74161j85247
$$ 24935534 25373156 24901589 23633240 21978180 20374325 19097847 18242886 17768725 17583478
9990A7583478J2427Q2375j0950j29410k27893k60691k82565l60757n28221o91700
$$ 17583478 17595905 17678280 17667330 17537920 17310027 17049336 16766771 16406014 15877793 15186093
9980A5186093p35601p18220o16032m41452k20999l5765J0485m1246j16721k92853
$$ 15186093 14450492 13732272 13116240 12674788 12453789 12418024 12428509 12387263 12270542 11977689
9970A1977689n31926q18893j084436j247126j253547j125748r14846o87114m76707
$$ 11977689 11445763 10626870 9542434 8295308 7041761 5916013 5001167 4314053 3837346
9961C837346l29922k01843j26414n0287L1438Q9650J18518J60682K24983K90062
$$ 3837346 3507424 3305581 3179167 3128880 3160318 3249968 3368486 3529168 3754151 4044213
9951D044213L80591N08359O42890Q32583J048409J327932J619737J887319K061610
$$ 4044213 4424804 4933163 5576053 6408636 7457045 8784977 10404714 12292033 14353643
9942A4353643K084757J884361J455270R03394M25797R1350m5437J3371K58101
$$ 14353643 16438400 18322761 19778031 20681425 21107222 21198572 21153135 21166506 21424607
9933B1424607N45961Q93754J252503J521147J574716J388757J031380N93248K13010
$$ 21424607 21970568 22864322 24116825 25637972 27212688 28601445 29632825 30226073 30439083
9924C0439083p295l7295L0807Q7698J19523K22987N02548R80736J533466J997165
$$ 30439083 30431788 30394493 30425300 30512998 30632521 30855508 31358056 32338792 33872258 35869423
9914C5869423K276216K278971J847981R12782m47460j859100k829544l008851
$$ 35869423 38145639 40424610 42272591 43185373 42737913 40878813 38049269 35040418
9906C5040418k563385j792820j000571l91013K5521K15738J40002j24945l35914
$$ 35040418 32477033 30684213 29683642 29292629 29318150 29533888 29673890 29548945 29213031
9897B9213031l96751m03511m75786o66966j004293j387764j655476j653485j396030
$$ 29213031 28816280 28412769 27936983 27270017 26265724 24877960 23222484 21568999 20172969
9888B0172969r97795o13773l44436k73463l54398n55115q88023j301478j643931
$$ 20172969 19175174 18561401 18216965 17943502 17589104 17033989 16145966 14844488 13200557
9879A3200557j793391j773930j614886j357832j097650q60037o47090m70161l21856
$$ 13200557 11407166 9633236 8018350 6660518 5562868 4702831 4055741 3585580 3263724
9870C263724k24498j30897n8639O435P2490J27142J60495J72722J02025j07218
$$ 3263724 3039226 2908329 2849690 2856125 2928615 3055757 3216252 3388974 3490999 3383781
9860C383781l35075l91123k82080j41196l6437L3079M9579j4668j55120k95462
$$ 3383781 3048706 2657583 2375503 2234307 2197870 2230949 2280528 2265860 2110740 1815278
9850A815278l26282k51518j84967j24584q5672o4667m8871m5122l5786l9052k8647
$$ 1815278 1488996 1237478 1052511 927927 842255 777588 728717 683595 647809 608757 580110
9839E80110j1789k3961j709j5509j7889k4794j9740o919j9714k1478r904j6683
$$ 580110 568321 544360 542651 527142 509253 484459 464719 457800 438086 416608 406704 390021
9827C90021J133J1450J6516K25m613j422j6158O776Q732j1019j2600q721l176
$$ 390021 391154 402604 419120 419345 414732 413310 397152 403928 412660 401641 389041 380320 377144
9814C77144J6273J3758K6512O968r007j230P717N619j840j8140p455J5590Q345
$$ 377144 393417 407175 433687 440655 431648 430418 438135 443754 441914 423774 416319 431909 440254
9801D40254J2682P290m566j380R051R850P427O183l902K217k311L687L939L287
$$ 440254 452936 460226 455660 454280 463331 473181 480608 486791 482889 485106 482795 486482 490421 493708
9787D93708J8774J1568Q227j6371j383K72O027m602J007K7486J627J2307J1913
$$ 493708 512482 524050 532277 515906 514523 514795 520822 516220 517227 544713 546340 558647 570560
9774E70560J262J2223J6631J1656P106m484J1509L2748K6295J6726Q587J6499
$$ 570560 571822 584045 600676 612332 619438 614954 626463 659211 685506 702232 710819 727318
9762G27318J9391K0807K5612K3947L4311N3346N1823N3554M4646P1434R5975R9413
$$ 727318 746709 767516 793128 817075 851386 904732 956555 1010109 1054755 1126189 1222164 1321577
9750A321577Q6487Q5657R0794Q7808R5050R6006J02817J17250J33179J73639K19206
$$ 1321577 1408064 1493721 1584515 1672323 1767373 1863379 1966196 2083446 2216625 2390264 2609470
9739B609470K77541L66497M38429N44479O79781Q61889J068073J329132J627063
$$ 2609470 2887011 3253508 3691937 4236416 4916197 5778086 6846159 8175291 9802354
9730I802354J984300K418246K920661L451276L878892L988733L593624K417681
$$ 9802354 11786654 14204900 17125561 20576837 24455729 28444462 32038086 34455767
9722C4455767M09892j979324l848795m600614m344060l562838k716392k013234
$$ 34455767 34865659 32886335 29037540 24436926 20092866 16530028 13813636 11800402
9714A1800402j468425j058438p06568l94299p7430K03125M97390P90775J110741
$$ 11800402 10331977 9273539 8566971 8172672 8095242 8298367 8795757 9586532 10697273
9705A0697273J423670J745078K083314K415783K711987K879069K844995K519031
$$ 10697273 12120943 13866021 15949335 18365118 21077105 23956174 26801169 29320200
9697B9320200J786154N72205r88263k475358l350153l462057l080008k602451
$$ 29320200 31106354 31678559 30690296 28214938 24864785 21402728 18322720 15720269
9689A5720269k224640j963680j707032j410497j132149q62335o06556m21633k54123
$$ 15720269 13495629 11531949 9824917 8414420 7282271 6419936 5813380 5391747 5137624
9680E137624j15838k0905M6245J00842J71213K44772L13446M07792N09995O75193
$$ 5137624 5021786 5000881 5047126 5147968 5319181 5563953 5877399 6285191 6795186 7470379
9670G470379Q74287J102608J423314J808216K201406K617118K965496L143421
$$ 7470379 8344666 9447274 10870588 12678804 14880210 17497328 20462824 23606245
9662B3606245L022238K535884J609412K96642j136862k332698l029101l202320
$$ 23606245 26628483 29164367 30773779 31070421 29933559 27600861 24571760 21369440
9654B1369440k980022k500437j953840j431765j011708o43195k59677J02476M58096
$$ 21369440 18389418 15888981 13935141 12503376 11491668 10848473 10588796 10691272 11149368
9645A1149368Q33907J253450J740011K290813K865430L438689M023191M519488
$$ 11149368 11983275 13236725 14976736 17267549 20132979 23571668 27594859 32114347
9637C2114347M773636M557928L679697K093042m7211k280135m121576n195534
$$ 32114347 36887983 41445911 45125608 47218650 47171439 44891304 40769728 35574194
9629C5574194n409825m961141m210892l426558k705374k117990j629195j193684
$$ 35574194 30164369 25203228 20992336 17565778 14860404 12742414 11113219 9919535
9621I919535q02416m59937j63167Q9301L54596O25955Q72817J125437J342586
$$ 9919535 9117119 8657182 8494015 8583316 8937912 9563867 10436684 11562121 12904707
9612A2904707J506960J589984J468206J085807M40242l76062j209945j839894
$$ 12904707 14411667 16001651 17469857 18555664 18995906 18619844 17409899 15570005
9604A5570005k143503k130082j876654j525912j172289q75798o57637m86120l54292
$$ 15570005 13426502 11296420 9419766 7893854 6721565 5845767 5188130 4702010 4347718
9595D347718k76241k10998j65857j42929j04821r4153n3655j879O0684J11644
$$ 4347718 4071477 3860479 3694622 3551693 3446872 3352719 3299064 3297185 3357869 3469513
9585C469513J85858L05002M57361O12056P88273R68406J141346J296191J409831
$$ 3469513 3655371 3960373 4417734 5029790 5818063 6786469 7927815 9224006 10633837
9576A0633837J481926J548943J557086J477300J197038O06323k60536j177950
$$ 10633837 12115763 13664706 15221792 16699092 17896130 18502453 18241917 17063967
9568A7063967j832949k045667j948323j714700j450223j161203r03762o74755
$$ 17063967 15231018 13185351 11237028 9522328 8072105 6910902 6007140 5332385
9560E332385m95243l14891j13322O8018K18215M11069O04745P88853J011423J248992
$$ 5332385 4837142 4522251 4408929 4476947 4695162 5106231 5710976 6499829 7511252 8760244
9550H760244J506535J769418J978354K005987J736631J076887j6728j317485k335396
$$ 8760244 10266779 12036197 14014551 16020538 17757169 18834056 18817328 17499843 15164447
9541A5164447k729145k528454k048600j575283j191491q79280o65103n26022m46168
$$ 15164447 12435302 9906848 7858248 6282965 5091474 4212194 3547091 3021069 2574901
9532B574901l64553k87819k06638j67787j35218j17785r4735p8936p6208n0349
$$ 2574901 2210348 1922529 1715891 1548104 1412886 1295101 1200366 1121430 1045222 994873
9522I94873k0490j6225l6892m4510n8627l3171n021k2170j3956k0114k1984k7307
$$ 994873 974383 958158 921266 876756 818129 784958 779937 757767 743811 723697 701713 674406
9510F74406k9679j9388n197o627j3693k5716j1149q498k1962l5122m4507l8153
$$ 674406 644727 625339 620142 613515 599822 574106 562957 554459 532497 497375 452868 414715
9498D14715k3786r193K282J8694L5749J5992o101J4180J1446M380L163j702j3459
$$ 414715 390929 381736 384018 402712 438461 454453 448352 462532 473978 478358 481521 479819 466360
9485D66360k6557l5000n2085l5366j1423j0999j0349n728j4687j8556m277k0521
$$ 466360 439803 404803 352718 317352 305929 294930 284581 278853 264166 245610 241333 220812
9473B20812j5944j5592j4973j6565q299L657j3406j0553j0757j6846p048R240
$$ 220812 204868 189276 174303 157738 149439 153096 139690 129137 118380 101534 94486 103726
9461A03726N196n6j1271q565J0014J316j1084j0550N113L084N481k229r275n780
$$ 103726 108922 108866 97595 89030 99044 100360 89276 78726 83839 86923 92404 90175 80900 75120
9447G5120J1290J3325M824N771j5599k0561N169K1654J3291k565p429j3955k522
$$ 75120 86410 99735 104559 110330 94731 74170 79339 100993 114284 111719 104290 90335 87813
9434H7813l448q83L935m747p822l928N908m756K654Q785j3119k44l831L714j994
$$ 87813 84365 83482 87417 82670 74848 70920 76828 72072 74726 83511 70392 70148 66317 70031 68037
9419F8037N856J0105q549K603M049K536l649j49o610j1579l619N739o780J550
$$ 68037 73893 83998 75449 78052 82101 84637 80988 80839 74229 62650 59031 64770 57990 59540
9405E9540o08r497n486o312o951m739p458l149K169L885J2524k835j0025J830
$$ 59540 58932 49435 43949 37637 30686 25947 18489 15340 17509 21394 33918 31083 21058 22888
9391B2888K390j0652o375R612K0468j362J207K235p21J0479m366m453J975L521
$$ 22888 25278 14626 8251 17863 38331 36969 38176 40411 39690 50169 45803 41350 43325 46846
9377D6846l449j1773M062K5697Q861n195r758N663q832j0799m469k739O193L323
$$ 46846 43397 31624 35686 61383 70244 65049 55291 60954 52122 41323 36854 34115 40308 43631
9363D3631O934n29j763M48m303p512j538j6387j0215J3837J6022R279o920J771
$$ 43631 50565 50036 48273 48721 44418 36906 35368 18981 8766 22603 38625 47904 40984 42755
9349D2755r324j1444N89r374K1337J7707J2179n960j0148J92l512L127j6119J91
$$ 42755 33431 21987 22576 13202 34539 52246 64425 58465 48317 48509 44997 48124 32005 32196
9335C2196O177J1332n46m136N86L527K2166J1637K989N238j960Q090Q22R216J5447
$$ 32196 38373 49705 49159 45023 45609 49136 71302 82939 85928 91166 89206 97296 98118 107334 122781
9320A22781K3357K6882J8217j729R337J4560q022l5219k1978k1453j3432j0935
$$ 122781 146138 173020 191237 189508 198845 213405 205383 170164 148186 126733 113301 102366
9308A02366r443r20l868K093j0485m332j932K811m258p88J1859J0080J6711l058
$$ 102366 92923 92003 88135 90228 79743 75411 73479 76290 72032 71244 83103 93183 109894 106836
9294A06836K4473J9738K8190L0055J544O387j0797j8203j9770k6112j9848r203
$$ 106836 131309 151047 179237 209292 210836 217223 206426 188223 168453 142341 122493 113290
9282A13290j1660r896r768q094p87k641j9879K10M382k50o31J2807q49j1061r287
$$ 113290 101630 91734 81966 73872 73085 70444 50565 50775 55157 54907 54276 67083 66234 55173 45886
9267D5886r179m563J3660O040K948K122K0928J4473J0861J0184P341J1574J1929
$$ 45886 36707 32144 45804 51844 54792 56914 77842 92315 103176 113360 120701 132275 144204
9254A44204K0367K4091J4808o463j9709k7018j9759j2218j4308j7176q597j2632
$$ 144204 164571 188662 203470 197007 177298 150280 130521 118303 103995 86819 78222 65590
9242F5590J0343J9175O202n86K013L970J4164J8215J6058J0507J6746L2186M2253
$$ 65590 75933 95108 101310 100724 102737 106707 120871 139086 155144 165651 182397 214583 256836
9229B56836J9394N887J3269j264k2547k7559m6786m0040l4966k2938j7638j3223
$$ 256836 276230 282117 295386 294122 271575 244016 197230 157190 122224 99286 81648 68425
9217F8425K818o451o191n965j4062J0910J723j3520J0056J7193N929K3891K3115
$$ 68425 71243 64792 58601 52636 38574 49484 51207 37687 47743 64936 70865 94756 117871
9204A17871P972J7134J8603j9400k0984O323q444l3463q899M894r875l970o24
$$ 117871 125843 142977 161580 142180 121196 127519 119075 85612 76713 81607 71732 67762 67138
9191F7138o578k609M363J31k240j0271j2928l686j1116M086Lm128o55q746J2107
$$ 67138 60560 57951 62314 62445 60205 49934 37006 33320 22204 26290 26293 22165 21510 12764 24871
9176B4871k081j903k492R380K4129j094q0J7429K5201J6170J6858J2558M878M105
$$ 24871 22790 20887 18395 27775 51904 50810 50730 68159 93360 109530 126388 138946 143824 147929
9162A47929o637k0826j3697r209j2604o209j2473j6954m979P460l388j1620J9257
$$ 147929 141292 120466 106769 97560 84956 78747 66274 49320 44341 51801 48413 36793 56050
9149E6050J3090j1862l07J8695N358m448J1712K748J0157n64n461j807j359O377
$$ 56050 69140 57278 56971 75666 81024 76576 88288 91036 101193 100629 95168 93361 92002 98379
9135I8379L619q374j4407n593q327k166k0219m252m259K163N623q465L705M901
$$ 98379 101998 93624 79217 73624 65297 63131 42912 38660 34401 36564 42187 33722 37427 42328
9121D2328k551M129L449L981n016j6153j0621R643P747o91Q160n4k0348j229J2047
$$ 42328 39777 43906 47355 51336 46320 30167 19546 29189 36936 36245 44405 44351 24003 22774 34821
9106C4821n19K405o236k906m83j649j0767p44K947J403J2781J1527j7986k061
$$ 34821 34302 36707 30471 27565 27082 25433 14666 13922 16869 18272 31053 42580 24594 22533
9092B2533J6648n460l632r362j0409K452l470K946p547j1090Q74Q637K306R02
$$ 22533 39181 33721 30089 20727 10318 12770 9300 12246 4699 -6391 -5517 3120 5426 6328
9078F328N168L150M357L290O073R417Q158P506j4861j6133R607J108o018r076
$$ 6328 11496 14646 19003 22293 28366 37783 45941 53447 38586 22453 32060 33168 27150 18074
9064A8074P157J123J103r663N008J512m76j014L011j4486r141R172J0397M823
$$ 18074 25231 26354 27457 17794 22802 24314 23838 22824 25835 11349 2208 11380 21777 26600
9050B6600l340q362P143J1891N941N46j3118m926J2262k716K136L73R514o91P110
$$ 26600 23260 14898 22041 33932 39873 40419 27301 22375 34637 31921 34057 34430 43944 43253 50363
9035E0363m88j052k182j4631j256L071J1130j3523p011J5803J347J304J8658J7210
$$ 50363 49875 48823 46641 32010 30754 33825 44955 31432 24421 40224 41571 42875 61533 78743
9021G8743j2021j6343l335j657j1232n01J0577N913n179k417p76N77p66q532P17
$$ 78743 66722 50379 47044 45387 34155 33654 44231 50144 44965 42548 41772 42349 41583 33051 33768
9006C3768M83k145r390K481P786k84L800q727j4374L754P211J5769K1552J1275
$$ 33768 34251 32106 22716 25197 32983 32699 36499 27772 13398 17152 24363 40132 61684 72959
8992G2959j601l0741j345P738l036Q919k119M208p34j4971r143o885O846J1830
$$ 72959 71358 40617 39272 47010 43974 52893 50774 54982 54248 39277 30134 23249 30095 41925
8978D1925N992m953o989P205LJ602m656L853N056j3682L168l397j5683J515J3163
$$ 41925 47917 42964 35975 43180 43183 44785 40129 43982 49038 35356 38524 35127 19444 20959 34122
8963C4122N119J1108J452q126L516Q123J474J596p649k1093m011O850M56O210
$$ 34122 39241 50349 51801 43675 47191 55314 56788 58384 50735 29642 25631 32481 32937 39147
8949C9147j592j3938J75K126L511k427K366J3884J1551k835j311n087m365o787
$$ 39147 37555 23617 23792 25918 29429 27002 29368 43252 54803 51968 50657 45570 41205 34418
8935C4418J063k794l991Q462O705o281n124M273J2142J1488O429J08o65m05k580
$$ 34418 35481 32687 28696 37158 43863 37582 32458 36731 48873 60361 66790 66898 66233 65828 63248
8920F3248N294m727q092j27j366r5L052O947K21Q704j977l977j0262K612P045
$$ 63248 68542 63815 55723 55596 54230 54135 57187 64134 64355 73059 71082 67105 56843 59455 66500
8905F6500k938j3030J4050R337j152r90K215k5182j0554m966k941p706n747J6259
$$ 66500 63562 50532 64582 73919 72767 71777 73992 48810 38256 33290 30349 22643 16896 33155
8891C3155J7357J47j2273N461J023Q748j3948J071L361J4124m922l3158M592J4778
$$ 33155 50512 50659 38386 43847 44870 53618 39670 40741 44102 58226 53304 20146 24738 39516
8877C9516N271j7781j4664N27Q071J1599O709N785J01L584M53l160O220l305N140
$$ 39516 44787 27006 12342 12869 20940 32539 39248 45033 45134 48718 49171 46011 52231 48926 54066
8862E4066J1114Q464P247m764j7761r12J871J7072Q013j1074j9827o606q312k680
$$ 54066 65180 73644 80891 76127 58366 57454 59325 76397 84410 73336 53509 46903 38591 35911
8848C5911O940P442p78n832M009K980R69j401P945M820Q562r362j5362M706K314
$$ 35911 42851 50293 49515 43683 47692 50672 51641 50240 58185 63005 71567 62205 46843 51549 53863
8833E3863R368N961J0160j5620K512M207n342p309k114j515p768j0511J1906J5752
$$ 53863 63231 69192 79352 63732 66244 70451 65109 57800 55686 54171 46403 35892 47798 63550
8819F3550N681k33j9138L51J042N739J0826Q511O838n679n333j4828q136j1193
$$ 63550 69231 68998 49860 50211 51253 56992 67818 76329 83167 77488 72155 57327 49191 37998
8805C7998J5311J5256j050j0958K201P32q718P860j795q425p330R013J6991l012
$$ 37998 53309 68565 67515 56557 58758 59490 50772 58632 56837 48412 41082 50095 67086 64074
8791F4074j5258j0562j2771K423J1080J0023J750R508N812O882o391n403j418
$$ 64074 48816 38254 25483 27906 38986 49009 50759 60267 66079 72961 66570 61167 59749
8778E9749N481J2040j761K156j4486m190k591N247N599n959j0511M812J5070n628
$$ 59749 65230 77270 75509 77665 63179 58989 56398 61645 67244 61285 50774 55586 70656 65028
8764F5028q977o021J096Q793K315O165K420L270P833o504j493R194m649L615k850
$$ 65028 56051 50030 51126 59919 62234 68399 70819 74089 81922 75418 73925 83119 78470 82085 79235
8749G9235J2260L341p294r664j9666Q458J037M065J911N13R417K52j42n590j2069
$$ 79235 91495 94836 87542 77878 58212 66670 67707 71772 73683 74196 83613 83865 83723 78133 66064
8734F6064j026K853j7592Q979L078N839R684m265O83o971L905l493P076J1886
$$ 66064 65038 67891 50299 59278 62356 68195 77879 73614 74297 67326 71231 67738 74814 86700
8720H6700P254j7345o681k286o799j237P053R042l44j7566j0365J1839O012J36
$$ 86700 93954 76609 69928 67642 60843 59606 66659 75701 75357 57791 47426 59265 65277 65413
8706F5413J2233R89k019l500p579J053m064R224J3549L232M120J3816J1738r482
$$ 65413 77646 78635 76616 73116 65537 66590 62526 71750 85299 88531 92651 106467 118205 108723
8692A08723j2512q440J873q351j2482O729J4967q94j144K189n255P494J4373P772
$$ 108723 96211 87771 89644 81293 68811 75540 90507 89613 88469 90658 85403 92897 107270 115042
8678A15042p42J3136Q369R286K7872J5344P03n31j7535k5957k2132o414q070l991
$$ 115042 114300 127436 135805 145091 172963 188307 189010 188479 170944 144987 122855 116441 108371 104380
8664A04380j1385m806l558J3805R151L565R307j2386j991m834J3432M926j5110
$$ 104380 92995 88189 84631 98436 107587 111152 120459 108073 106082 101248 114680 119606 104496
8651A04496O46Q068j777j615j089k273J4980M068r284J1119O192L96J0280J4954
$$ 104496 105142 113210 111433 109818 108729 106456 121436 125504 116220 127339 133531 133927 144207 159161
8637A59161J1012J0070P55J1350K5866j04o626j2608j7367q652n638o160j3943
$$ 159161 170173 180243 180998 192348 218214 218110 211484 198876 181509 172857 167219 161059 147116
8624A47116n961Q104O044N620q37P667n137N000N039j8213j1579R57L414M190
$$ 147116 141155 149259 155303 160923 160086 167753 162616 167616 172655 154442 142863 143820 147234 151424
8610A51424J579R437J0868J7334J0347K361P069N428M638m057P294K1544P606
$$ 151424 153003 162440 173308 190642 200989 203350 210419 215847 220485 216428 223722 245266 252872
8597B52872l255J9141K2015J3877K3089K2560J7061R352J9152K5183K0046J2729
$$ 252872 249617 268758 290773 304650 327739 350299 367360 376712 395864 421047 441093 453822
8585D53822K3192M000n648j1130k7452k8978l2893k3746k6947k8928j6701q610
$$ 453822 477014 481014 475366 464236 436784 407806 374913 351167 324220 295292 278591 269981
8573B69981k0187k5566j2067l408k701j0648q755m717L692p188r112j8326j1160
$$ 269981 249794 224228 212161 208753 206052 195404 186649 181932 185624 178436 169324 150998 139838
8560A39838M675M639k195k092P143j3361Q514J0401L37q684o051j4765n13M744
$$ 139838 144513 149152 146957 144865 152008 138647 147161 157562 157899 149215 143164 128399 127886 132630
8546A32630p107n162o102P483J4557p531q377m580j1015J145L359J5366K0259
$$ 132630 125523 120361 114259 121742 136299 128768 120391 115811 104796 105941 109300 124666 144925
8533A44925j95p680n063j0191Q651P362m787K408l749o296Q462p094J4771n025
$$ 144925 144730 137050 131987 121796 130447 137809 133022 135430 131681 125385 133847 126753 141524 136499
8519A36499n637q048L494N199L156p322K406o23j3997j3484N07J15J3829p209
$$ 136499 130862 122814 126308 131507 134663 127341 129747 129124 115127 101643 102150 102265 116094 108885
8505A08885j2995J3870J2056J064j1815r530J5484R372j5706m764K75J071J5188
$$ 108885 95890 109760 121816 122880 111065 101535 117019 126391 110685 105921 106196 107267 122455
8492A22455K989j7399k273Q975L478J4247j3349O273J2068l976r943o617J2082
$$ 122455 125444 108045 105772 114747 118225 132472 119123 125396 137464 133488 123545 116928 129010
8479A29010N924j931Q07m18j1909l445p33R7N015L091J72J621k245q10n947o615
$$ 129010 134934 133003 133810 133392 121483 118038 117305 117402 122417 125508 125680 127301 125056 124246 118299 111684
8463A11684j896k739J3372j594n117J1537n174o121J52j1276j175m086o661J57
$$ 111684 109788 107049 120421 118827 113710 125247 120073 113952 114104 102828 101653 97567 90906 91063
8449I1063J0584M157J0271J8381K818o989r552K639P202Q306K873q663l658J437
$$ 91063 101647 105804 116075 134456 137274 130285 120733 123372 130574 138880 141753 133090 129432 130869
8435A30869m533N96P103P240l680m047k112j5712n510j454P105P918k84p015q768
$$ 130869 126336 126932 134035 141275 137595 133548 131436 115724 110214 108760 115865 123783 123499 116484 107716
8420A07716O065J9069K819j3250J253j1745J6152M118O578l974q476J736m23o735
$$ 107716 113781 132850 135669 122419 123672 111927 128079 132197 138775 134801 126325 128061 127638 120903
8406A20903p544l335O113N337l940j4720k017R290J880n70N762j035N389r565
$$ 120903 113359 110024 116137 121474 117534 102814 100797 110087 111967 111397 117159 116124 121513 111948
8392A11948P62J5702R689O491n290j6164o691R256P2j1654n094J1279n584M773
$$ 111948 112710 128412 138101 144592 139302 123138 116447 125703 125775 114121 109027 120306 114722 119495
8378A19495N438n113r805l694N537J4123l236j6038M490P036N38o774m996M613
$$ 119495 124933 119820 110015 106321 111858 125981 122745 106707 111197 118233 118771 111997 107001 111614
8364A11614K749P203K418o489J321J1905J503r66J645M542N918m449q600L179
$$ 111614 114363 121566 123984 117495 118816 130721 132224 131258 132903 137445 143363 138914 130314 133493
8350A33493J2098q827j1142n03L850N018o016j2169P302O84O488o108o854J4411
$$ 133493 145591 136764 125622 125119 128969 133987 127971 115802 123104 123788 130276 124168 117314 131725
8336A31725K0408p222j1732l87m892k823Q706J0669J0792L070L66r832r128n481
$$ 131725 152133 144911 133179 132792 127900 125077 133783 144452 155244 158314 158680 148848 139720 134239
8322A34239m578q741m412l827j891m057J0578P754l9J2873Q022J213j625r748
$$ 134239 129661 120920 116508 112681 110790 106733 117311 125065 125026 137899 145921 147134 145509 135761
8308A35761m791j0704M853O911j75q06m871p56n83K0656J538r486P557O304K504
$$ 135761 130970 120266 125119 132030 131855 131049 126178 125422 124839 145495 147033 137547 145104 151408 153912
8293A53912N028k553l82M710j7624o307J0029J1376R141j2601p393J0633l817
$$ 153912 158940 156387 156005 160715 143091 136784 146813 158189 167330 154729 147336 157969 154152
8280A54152O39l818k365o975j1902J091M448q154j14Q068k059l309o74Q60P528
$$ 154152 154791 150973 148608 141633 129731 130822 135270 127116 127002 135070 133011 129702 129028 129888 137416
8265A37416P741K921L403P733L180p125k268k526N850J9777k428L764j5937j4976
$$ 137416 145157 148078 151481 159214 162394 155269 153001 150475 156325 176102 173674 177438 161501 146525
8251A46525j463J147j3015n233j457P070l061J1440K7403j915m393R073N583Q666
$$ 146525 145062 146209 133194 127961 126504 133574 130513 141953 169356 167441 163048 172121 177704 186370
8237A86370L088j26p195l350p826k460j859M497n90q173j0899M121N622O811K286
$$ 186370 189458 189332 182137 178787 170961 168501 166642 171139 170549 162376 151477 155598 161220 168031 170317
8222A70317j6437R498J4359q093r685L937Q930l659j3419M231N963n009j3335
$$ 170317 153880 163378 177737 169644 159959 163896 172826 169167 155748 159979 165942 160933 147598
8209A47598Q459L657j8475N160R521P662J8501Q890p028j3621j9550l284K1610
$$ 147598 156057 159714 141239 146399 155920 163582 182083 190973 183945 170324 150774 147490 169100
8196A69100R899r20m676J350o218n22K760R554K396L164L057k1973l585m543J0764
$$ 169100 178999 178079 173403 174753 168535 168013 170773 180327 182723 185887 188944 166971 163386 158843 169607
8181A69607J900J1881M946p355o135L670J435j407n540l655L337Q744N907k705
$$ 169607 171507 183388 188334 180979 174844 178514 179949 178542 173002 169347 172684 181428 187335 184630
8167A84630J974q681j59m195O107J881k5l017J5570N955K027M721K046j6608k4068
$$ 184630 186604 177923 177764 173569 179676 181557 181532 178515 194085 200040 202067 206788 208834 192226 168158
8152A68158L852J3862R513N376N766j407q684N612M507J0038j6828q828l333o81
$$ 168158 172010 185872 195385 200761 206527 205120 196436 202048 206555 216593 199765 190937 187604 186923
8138A86923P967K0103m229j715l185M685j2606J054R632J0088q646L269P602R095
$$ 186923 194890 214993 210764 209049 205864 210549 197943 198997 208629 218717 210071 213340 220942 230037
8124B30037q64j4023j053j0120n428j21p290j979J4232J5533k984M14l295l193
$$ 230037 229173 215150 214097 203977 198549 198428 191138 189159 203391 218924 215940 216354 213059 209866
8110B09866L103L541l782N878O051J2047J4538J42j7803j4873r919l54k382J4132
$$ 209866 212969 216510 212728 218606 224657 236704 251242 251384 233581 218708 208789 208435 206053 220185
8096B20185K2714J0806n193o593j05M237K1563J8629k2436j1020m465J1797J0482
$$ 220185 242899 253705 248512 241919 241814 246051 267614 286243 263807 252787 248322 260119 270601
8083B70601j3538l651K150N109k264M419M466j831L909r661j128j5072l050M480
$$ 270601 257063 253412 255562 260671 258407 262826 267292 265461 269370 259709 258581 243509 240459 244939
8069B44939M348o744J2023L724l953P159R092P335j0027j729R0q114J3277K2901
$$ 244939 249287 242543 254566 258290 254337 261496 270588 277923 267896 266167 266257 258143 271420 294321
8055B94321n235n761M923K437J3027q62l196Q03L816n877m097P542J098J458J2463
$$ 294321 289086 283325 288248 290685 303712 302850 299654 300457 304273 298396 294299 301841 302939 304397 316860
8040C16860j781P839J4750j0152j0899m384J3398J6368l983r067M301J9625L727
$$ 316860 315079 322918 337668 327516 316617 312233 325631 341999 338016 328949 333250 352875 356602
8027C56602m565L889o167j9110j6460L340N184R849J434J0518J0477m35J775Q609
$$ 356602 352037 355926 349759 330649 314189 317529 322713 332562 333996 344514 354991 354556 356331 364940
8013C64940P273l206o408j0196J129J788k704j419O313J21r51j946j0972P489
$$ 364940 372213 369007 362599 352403 353532 355320 352616 351197 357510 357631 356680 354734 343762 351251
7999C51251J4344J1850J2081j795m914J8522P397q738l32j92K1240K9637Q828
$$ 351251 365595 377445 389526 387731 382817 401339 408736 399998 399666 399474 420714 450351 459179
7986D59179J1365Q851j5696q342j8454j1427j1436p645o723j003n575l726m084
$$ 459179 470544 479395 463699 455357 436903 425476 414040 406395 399672 398669 393094 389368 385284
7973C85284L191n757K060J0287J2128O088M759N112l034p525m694k929J7272P098
$$ 385284 388475 382718 384778 395065 407193 413281 418040 423152 420118 412593 407899 404970 422242 429340
7959D29340J6462Q08M262J0713J504L58J2413M992P553L753l452O408R697P316
$$ 429340 445802 446610 450872 461585 463089 463447 475860 480852 488405 492158 488706 495114 504811 512127
7945E12127o843O865N390K53K260p278l083N787p362L17k756k0703j0043J175
$$ 512127 505284 512149 517539 517792 520052 512774 509691 515478 508116 508433 505677 484974 474931 476106
7931D76106j2873j5577j0014r355Q226N456j838j715l615K690P880K987k838N547
$$ 476106 463233 447656 437642 428287 436513 441969 440131 438416 434801 437491 445371 448358 445520 451067
7917D51067Q353J5432j722j3886J708J2359K187l705J9019M433o084r378J67N459
$$ 451067 459420 474852 473130 459244 460952 473311 475498 471793 490812 495245 489161 479783 479950 485409
7903D85409N425J217p179J7076R055j1137m106L501N072j3674r507m352n732j1928
$$ 485409 490834 492051 484872 501948 511003 499866 495760 499261 504333 490659 481152 476800 471068 459140
7889D59140P085L215p979M620N330M548M861R69J6704O350O006j0719o993n790
$$ 459140 466225 469440 461461 466081 471411 475959 480820 481789 498493 504843 510849 500130 493137 487347
7875D87347K412Q323P573n426m586J3242P541n608j323o943q185J009Q669j1350
$$ 487347 489759 498082 505655 500229 495643 508885 516426 510818 509495 502552 494367 495376 504045 492695
7861D92695J663J7006k63J425K173Q712r659M907J1954o275K128M492N559O80
$$ 492695 494358 511364 511101 512526 514699 523411 513752 518659 530613 524338 526466 530958 536517 537197
7847E37197R189Q445P41M370M4L414l196J1690J5719n837j1821k273N412o030
$$ 537197 546386 554831 555572 559942 559986 563400 560204 571894 587613 581776 569955 567682 573094 567064
7833E67064o372j387L1503J9278Q507l183o381j2832j8219L119J4718M916%o573
$$ 567064 560692 559305 590808 610086 618593 615410 609029 596197 577978 581097 595815 600731 600731 594158
7819E94158o552R888K2549N275j0390J3199J3834Q183Q052J1663m696k902P016
$$ 594158 587606 597494 620043 625318 614928 628127 641961 650144 658196 669859 665163 662261 669277
7806F69277M408l476o063J984P98R813M63l708n653P377K523J651N444J8948J5308
$$ 669277 673685 670209 664146 666130 666928 676741 677204 673496 667843 675220 677743 679394 684838 703786 719094
7791G19094k13n131L294P145l190K042Q004N160J2544N80L26k573J2683R729j638
$$ 719094 718881 713750 717044 724189 720999 723041 731045 736205 748749 749329 749655 747082 759765 769494 767856
7776G67856J0373J0034J2788J1240j1730m495L536Q105n011q538J3089J8900M443
$$ 767856 778229 788263 801051 812291 800561 796066 799602 807707 802696 794158 807247 826147 830590
7763H30590j1645r005J2047J174P269J1425K427J5831J3251M976J6837J6163Q1
$$ 830590 818945 809940 821987 823161 830430 841855 844282 860113 873364 878340 895177 911340 911421
7750I11421r136O778l89J1804Q060O312J0561o685l130O120O904J967J0822J5592
$$ 911421 902285 909063 908674 920478 928538 934850 945411 938726 935596 941716 948620 950587 961409 977001
7736I77001o098J029n50N321P363P764O560J0929J3125J1656Q550J1933K5310
$$ 977001 970903 971932 971382 976703 984066 991830 998390 1009319 1022444 1034100 1042650 1054583 1079893
7723A079893J4575J0481p783P21M690J5066Q180J2356J1325k413j59J3631j2623
$$ 1079893 1094468 1104949 1097166 1097887 1102577 1117643 1125823 1138179 1149504 1147091 1146932 1160563 1147940
7710A147940j062J5589J7651K3992J5704p57L445K596n850J4750J6141N019J3056
$$ 1147940 1146878 1162467 1180118 1204110 1219814 1219057 1222502 1225098 1219248 1233998 1250139 1255158 1268214
7697A268214k376l731Q410P669J3150J0880R469J7952K1852N390L286K116J4228
$$ 1268214 1265838 1262107 1270517 1278186 1291336 1302216 1311685 1329637 1351489 1356879 1360165 1362281 1376509
7684A376509J0327J0118P676K5822J0509j200Q478R058P709J0891J1223J5585
$$ 1376509 1386836 1396954 1404630 1430452 1440961 1439761 1448239 1457297 1465006 1475897 1487120 1502705
7672A502705J7148K1438J1920J6902M860N433K0107J6633K5617J5237P785N267
$$ 1502705 1519853 1541291 1553211 1570113 1574973 1580406 1600513 1617146 1642763 1658000 1665785 1671052
7660A671052J2230J0137Q162J2051Q438P83O789K4790J8528O821J3939K0095J7375
$$ 1671052 1683282 1693419 1701581 1713632 1722070 1722853 1729642 1754432 1772960 1779781 1793720 1813815 1831190
7647A831190J2610K7157K7624K0398N613l266R780J5954J1549J2048J6079Q632
$$ 1831190 1843800 1870957 1898581 1918979 1924592 1921326 1931106 1947060 1958609 1970657 1986736 1995368
7635A995368J5886K6108J7061K0207J5027K2031O188J1832K4122J4787L212K1439
$$ 1995368 2011254 2037362 2054423 2074630 2089657 2111688 2117876 2129708 2153830 2168617 2171829 2193268
7623B193268J4192K2186K7169K5143J5776J6329K4804L1856K0082K5340R369M617
$$ 2193268 2207460 2229646 2256815 2281958 2297734 2314063 2338867 2370723 2390805 2416145 2425514 2430131
7611B430131R815K8218K9768J9088K6457J5223K2044J6670M321Q501K3990L3573
$$ 2430131 2439946 2468164 2497932 2517020 2543477 2558700 2580744 2597414 2601735 2610236 2634226 2667799
7599B667799K6176K6324K5195J5652O220L7562K4108K4444J7276K5994K5847K4294
$$ 2667799 2693975 2720299 2745494 2761146 2767366 2804928 2829036 2853480 2870756 2896750 2922597 2946891
7587B946891J9518K4529K1468J9927J7468K2989K1252L0380K7956L4714K7323
$$ 2946891 2966409 2990938 3012406 3032333 3049801 3072790 3094042 3124422 3152378 3187092 3214415
7576C214415J9192J6956K5634K4362J9820K0501L1187K3201K8779K7096Q900K2439
$$ 3214415 3233607 3250563 3276197 3300559 3320379 3340880 3372067 3395268 3424047 3451143 3460043 3482482
7564C482482K9815M0971L5794J0605J0435J4886L4054J6994O245K3343K8572L4941
$$ 3482482 3512297 3553268 3589062 3599667 3610102 3624988 3659042 3676036 3682281 3705624 3734196 3769137
7552C769137L0392L8579J6925J1803K3463K0389L0010J4436L678J1985K6021J2911
$$ 3769137 3799529 3838108 3855033 3866836 3890299 3910688 3940698 3955134 3958812 3970797 3996818 4009729
7540D009729J9296M510K4921M1124K7631K1019J8726l608M945L4278Q648P183
$$ 4009729 4029025 4033535 4058456 4099580 4127211 4148230 4166956 4163348 4168293 4202571 4211219 4218402
7528D218402J2504K1630J2411K7892O014M830J9303J9134J4522J993O603P740
$$ 4218402 4230906 4252536 4264947 4292839 4298853 4303683 4322986 4342120 4356642 4358635 4365238 4372978
7516D372978O061M083J1279N661M906J1995R41l484J0621Q178J146r9P917m697
$$ 4372978 4379039 4383122 4394401 4400062 4404968 4416963 4417904 4414420 4425041 4433219 4434365 4434266 4442183 4437486
7502D437486m010J0541O313j6120n609j5477j354r77q439r251m119r45o307k0593
$$ 4437486 4433476 4444017 4450330 4434210 4428601 4413124 4411770 4410793 4402354 4393103 4388984 4388039 4381732 4361139
7488D361139k6268m453N098m085j8132j4533j5555Q780j3621j4579j3256j6284
$$ 4361139 4334871 4330418 4335516 4331431 4313299 4298766 4283211 4291991 4278370 4263791 4250535 4234251
7476D234251j5692l7773k1160k1161j6616j7299o310r269j2777j1677j9743k4346
$$ 4234251 4218559 4180786 4159626 4138465 4121849 4104550 4098240 4088971 4076194 4064517 4044774 4020428
7464D020428l0317l2470k9080l1179j9404j5995k5533k1801k1886l0254k7084
$$ 4020428 3990111 3957641 3928561 3897382 3877978 3861983 3836450 3814649 3792763 3762509 3735425
7453C735425k1662k3235k1585l2099k1764k4460l2625l0243j8484j4603q481l9741
$$ 3735425 3713763 3690528 3668943 3636844 3615080 3590620 3557995 3527752 3509268 3494665 3486184 3446443
7441C446443l5489k3299l4318m0779k9214k3161k1052k6299k2579l4895k8554
$$ 3446443 3410954 3387655 3353337 3312558 3283344 3260183 3239131 3212832 3190253 3155358 3126804
7430C126804j6780j6510j6928k9031k3918k6596l1153k0092k0099k2691l2881
$$ 3126804 3110024 3093514 3076586 3047555 3023637 2997041 2965888 2945796 2925697 2903006 2870125
7419B870125l6605j1179l2631j8250r511j6106l1592k5968l0070k5824k5030k1827
$$ 2870125 2833520 2822341 2789710 2771460 2761949 2745843 2714251 2688283 2658213 2632389 2607359 2585532
7407B585532l5218k7727k5588j2368k9241j3771j4997j3625k3365k6962l2953
$$ 2585532 2550314 2522587 2496999 2484631 2455390 2441619 2426622 2412997 2389632 2362670 2329717
7396B329717k0026j0304n975l1474k8044k5371k3449j5092k3272k4284j8616j8602
$$ 2329717 2309691 2299387 2293412 2261938 2233894 2208523 2185074 2169982 2146710 2122426 2103810 2085208
7384B085208j5719p365j2883k4173l5291l5709j6297j2732k405p871k8220l7024
$$ 2085208 2069489 2062124 2049241 2025068 1989777 1954068 1937771 1925039 1922634 1914763 1886543 1849519
7372A849519k2000j6648j668n513j7722k5612j8216q077k0473j0680j7653k5755
$$ 1849519 1827519 1810871 1809203 1803690 1785968 1760356 1742140 1734063 1713590 1702910 1685257 1659502
7360A659502l3876j8435j5895m150j0107m487j4420k3244j1319j8300J260k2059
$$ 1659502 1625626 1607191 1591296 1587146 1577039 1572552 1558132 1534888 1523569 1505269 1506529 1484470
7348A484470j0016l157j5616j5191j7070j2535j3330j9518j2957m459n589j4542
$$ 1484470 1474454 1471297 1455681 1440490 1423420 1410885 1397555 1378037 1365080 1360621 1355032 1340490
7336A340490j1940Q570r947l3293J641j3919m2805j8794J007p536q982k189j4480
$$ 1340490 1328550 1337120 1327173 1293880 1295521 1281602 1238797 1220003 1221010 1213474 1204492 1202303 1187823
7323A187823m937n197k1357j1863J414j320q199k450o688j2584p155j561j2530
$$ 1187823 1182886 1177689 1156332 1144469 1145883 1144563 1136364 1133914 1127226 1114642 1107487 1105926 1093396
7310A093396j3956j5766j8479k2585j5069j1982p145j3383o747J2431K949l729
$$ 1093396 1079440 1063674 1045195 1022610 1007541 995559 988414 975031 968284 980715 983664 979935
7298I79935j4533k5869k5995r048O791L056l377q718l207p623r931j363j0853
$$ 979935 965402 939533 913538 904490 911281 914337 910960 902242 899035 891412 881481 880118 869265
7285H69265r16p345m452l593j5783j4567j5626k819o730r246j4976M541K927k0496
$$ 869265 868349 861004 856552 852959 837176 822609 806983 804164 797434 788188 773212 777753 780680 760184
7271G60184l385K749j1163j1035m250N729p817P498Q196j6841k7213r290J0987
$$ 760184 756799 759548 748385 737350 733100 738829 731012 738510 746706 729865 702652 693362 704349
7258G04349j5213j3550O50q10j925m688k0917j9887j338m764Q357k360j2907r58
$$ 704349 689136 675586 676236 675426 673501 668813 647896 628009 626671 621907 630264 627904 614997 614039
7244F14039K597P187j0222j7930P35N202N936k268l391r082r53j3382M330r574
$$ 614039 616636 623823 613601 595671 596406 601608 607544 605276 601885 592803 591850 578468 582798 573224
7230E73224j1312j634q023j3665p988O84L009J850j2630j412m688p996J557m914
$$ 573224 561912 560278 552255 538590 530602 531286 534295 536145 523515 522103 517415 509419 510976 506062
7216E06062j7348j4381r241L989J8460J2636k670l058q036m549m168p695k408
$$ 506062 488714 474333 465092 469081 487541 500177 497507 494449 486413 481864 477696 470001 467593
7203D67593j3598r010p372O680J0994R506l093J866q283j3827j5236r224m944
$$ 467593 453995 444985 437613 444293 455287 464793 461700 463566 455283 441456 426220 416996 412052
7190D12052l503q219J61L03j0545l693O153J645j7431j1634L077k980N655j2325
$$ 412052 408549 400330 400491 400794 390249 386556 392709 394354 376923 365289 368366 365386 371041 358716
7176C58716j3936k671R570K943J9823m097j704M878k696j180R914j7714j5852
$$ 358716 344780 342109 351679 354622 374445 370348 368644 373522 370826 369646 379560 361846 345994
7163C45994q00J7240j693q167j4665j7025O182Q693o938k2067J753N976Q17j0391
$$ 345994 345194 362434 360741 352574 337909 320884 327066 335759 328821 306754 308507 314483 315300 304909
7149C04909m200J2851J1553k124r737j2200m302K040q280N399N394m722o632O408
$$ 304909 300709 313560 325113 322989 313252 301052 296750 298790 290510 295909 301303 296581 289949 296357
7135B96357P133q648r036O463O281j5182j3714j1340j0389K320J5838Q92R274
$$ 296357 303490 294842 285806 292269 298550 283368 269654 258314 247925 250245 266083 266975 276249
7122B76249m813r247L407N947k834Q751O386l007l358j0423O708j636m953j1199
$$ 276249 271436 262189 265596 271543 268709 277460 283846 280839 277481 267058 273766 272130 267177 255978
7108B55978j0980n89M711R40j618k196j4029o793j26R616M614k154M47j3496K604
$$ 255978 244998 244409 249120 250060 248442 246246 232217 225424 225298 234914 239528 237374 237821 224325 226929
7093B26929L191j876P734q545j500L825l135J808j1466n249q271J378K793Q700
$$ 226929 230120 228244 235978 227433 225933 229758 226623 228431 216965 211716 203445 204823 207616 216316
7079B16316J207o384K231q719j4718q817J1880J1672l847k354J707M79j0412r570
$$ 216316 217523 211139 213370 204651 189933 181116 192996 204668 200821 198467 200174 200653 190241 180671
7065A80671r198M788q251L157J1144R694P415L778n843j3355l23P507l944n999
$$ 180671 171473 176261 168010 171167 182311 192005 199420 203198 197355 184000 183677 191184 187240 181241
7051A81241p323j3197M186m094m353o848l70R613m756M189K259O074P419K650
$$ 181241 173918 160721 164907 160813 156460 149612 149242 158855 154099 158288 160547 166621 174040 176690
7037A76690k658n289o383N088O957j1836j7912M107k838K473J1602J405j261j371
$$ 176690 174032 168743 162360 167448 174405 162569 144657 148764 145926 148399 160001 161406 160145 158774
7023A58774n268l71L109J092n69q826q96l26j0674J4527J5605o245m175j0853
$$ 158774 153506 153135 156244 157336 156767 147941 147045 146719 136045 150572 166177 159932 155757 144904
7009A44904m013j0628q557L900N307K958l103n243j618j30r265p473Q884J2462
$$ 144904 140891 130263 121706 125606 130913 133871 130768 125525 123907 123777 114512 107039 115923 128385
6995A28385l734k398n455r338J4154M906j0494P403J587k22JO847J4743P176r234
$$ 128385 124651 122253 116798 107460 121614 126520 116026 123429 125016 124794 124795 131642 146385 153561 144327
6980A44327p644K531m510Q726j0632j4565p996J105k677q089R28L109J0586P503
$$ 144327 136683 139214 134704 143430 132798 118233 110237 111342 108665 100576 101504 104613 115199 122702
6966A22702j571o499N267j0169j4595j048J9824Q712o191j1817L407L869n243
$$ 122702 121131 114632 119899 109730 95135 94087 113911 122623 116432 104615 108022 111891 106648
6953A06648R230m00j1480k1162j2726J199J1474M163k89N269J1809j063q554n691
$$ 106648 115878 115478 103998 82836 70110 71309 82783 86946 86657 91926 103735 102672 94118 88427
6939H8427j3183p240J8034O755J497j720k226L618J3734O98l67n689j0489n571
$$ 88427 75244 68004 86038 92793 94290 92570 90344 93962 107696 108394 108027 102338 91849 86278
6925H6278J0063j00j300j1755j6400j2039K506j919Q955J4587L634M347O865j8811
$$ 86278 96341 96241 94941 83186 66786 54747 57253 55334 64289 78876 82510 86857 93722 74911
6911G4911j0282J896J0352J1027J2382j4972j5850o023r884Q839J1055O383M974
$$ 74911 64629 66525 76877 87904 100286 85314 69464 63441 53557 62396 73451 79834 84808
6898H4808J429j9090j3897m231O024Q049o391k0696J1308J0314J7121r83p098
$$ 84808 86237 67147 53250 49019 55043 63092 56701 36005 47313 57627 74748 73765 66667
6885F6667j0108n705r369L128J1790k96k704n247J1278K791q96j544m39J480L448
$$ 66667 56559 50854 41485 44613 56403 56107 53403 48156 59434 62225 61329 59785 59346 60826 64274
6870F4274L979J0718O240m613j852N70r122n004L541M677q602l209o06n645J0827
$$ 64274 68253 78971 85211 80598 78746 79316 70194 65190 68731 73408 64806 61597 60991 55346 66173
6855F6173J1252q864k1814K832R114m989K51l243j7104Q615P336J0318J0692n364
$$ 66173 77425 68561 46747 49579 58693 53704 53955 50712 33608 42223 49559 59877 70569 65205
6841F5205p839l123J2513M336p199o806l128R401O591N355l897j1252r842L695
$$ 65205 57366 54243 66756 71092 63893 57087 53959 63360 69951 75306 71409 60157 50315 54010
6827E4010J5701K937n231j1460K62l200K099R439J1427Q880j7144m203m659L924
$$ 54010 69711 72648 67417 55957 56219 53019 55118 64557 75984 84864 67720 63517 58858 62782
6813F2782j3513j5605O495O534o020N038P875O1J715p634L092K096j1100j935
$$ 62782 49269 33664 40159 46693 40673 45711 53586 53647 55362 47728 50820 52916 41816 39881
6799C9881j967P212J4674j555j6228q435M187P159N257K353n273j2630P821k401
$$ 39881 37914 45126 59800 58245 42017 33582 37769 44928 50185 52538 47265 34635 42456 40055
6785D0055P538L205k165K740L459o966j0607q525J886P01J660J720p164j022j206
$$ 40055 47593 50798 48633 51373 54832 47866 37259 28734 30620 31321 32981 34701 27537 26515 25309
6770B5309J277P538r26r534l396K2927J0971N558j0506j7624n134L825Q932L315
$$ 25309 26586 34124 33198 23664 20268 43195 54166 59724 49218 31594 26460 30285 39217 42532
6756D2532J446r253p30L6K321O806m088o503p08j3579j2806J309J1455L579J0587
$$ 42532 43978 34725 33995 34031 36352 43158 39070 32567 31859 18280 5474 6783 18238 21817 32404
6741C2404R558J1347m109j2010K632p317p929Q610Q957j1725r269q736n442J790
$$ 32404 41962 53309 49200 37190 39822 32505 24576 33186 42143 30418 21149 12413 6971 8761
6727H761M168R316J3512m329j9716Q028J3309J5807l324j6792o413L601o067J4837
$$ 8761 12929 22245 35757 31428 11712 19740 33049 48856 45532 28740 22327 25928 19861 34698
6713C4698J3759m887j6683j900q487O396J4510l112l171j22q737o989J2679J1664
$$ 34698 48457 43570 26887 24987 16500 22896 37406 34294 31123 31001 22264 15275 27954 39618
6699C9618m965j3479N713o247j2204l531L954J890O092L178j2904Q93J1614J0823
$$ 39618 34653 21174 26887 20640 8436 4905 8859 10749 16841 20019 7115 8008 19622 30445
6685C0445Q574O019j3408K41J214j4901l551O906Q294N075J673j6519O132l188
$$ 30445 39019 45038 31630 31871 33085 18184 14633 21539 29833 34908 36581 20062 26194 23006
6671B3006j0575q678R528J1385j119j628k98O804j861j818p146j717N792o766
$$ 23006 12431 3753 13281 24666 23547 21919 21621 28425 26564 24746 17600 15883 21675 14909
6657A4909p096J6749O075j5121O956J2509j4941K809J2193r861j0177n06j25Q883
$$ 14909 7813 24562 30637 15516 22472 34981 20040 22849 35042 25181 15004 14498 14373 23256
6643B3256n632o987L54J0704L528q789P352n578j1489Q197P302n836L088q40J133
$$ 23256 17624 10637 10991 21695 25223 16434 23786 18208 6719 14916 22218 16382 19470 18630 19763
6628A9763O455k394n65M631P213j4041q355L251K954j436j0325M821N73Q676J2053
$$ 19763 26218 23824 23259 27890 35103 21062 12707 15958 18912 17476 7151 11972 12545 21221 33274
6613C3274n927j3454n285p844j563J4319K1534M347O001n692j4714rj1024o559
$$ 33274 27347 13893 8608 764 -799 13520 35054 39401 45402 39710 24996 24987 13963 7404
6599G404R128k574k695l701L827k468L976J936o893K803J254m712Q42R574K1406
$$ 7404 16532 13958 11263 7562 11389 8921 12897 14833 7940 10743 11997 7285 8127 17701 39107
6584C9107K919j6657j2140J899K150j0877j3543R05J3277r0j1814o271P477k102
$$ 39107 42026 25369 13229 15128 17278 6401 -7142 -6237 7040 6950 -4864 -11135 -3658 -5760
6570e760l615O078M68K627J0325J991q379q405j727j881k6Q759p189l22R938J869
$$ -5760 -9375 -3297 -2829 -202 10123 12114 3735 -4670 -6397 -8278 -8304 455 -6734 -7056 2882 4751
6554D751m332o633M707J0696Q289l07l006l279j3892K777J2048m700J559N490
$$ 4751 419 -6214 -1507 9189 17478 17171 14165 10886 -3006 -229 11819 7119 8678 14168
6540A4168k376N467o849O148m576q312J5115m521k153l894R177K2718P926k0214
$$ 14168 11792 17259 10410 16558 11982 3670 18785 14264 12111 8217 17394 40112 48038 27824
6526B7824k586j4431q090J212k658p131r152R862O297r425N955p12m098L975K031
$$ 27824 25238 10807 2717 3929 1271 -5860 -15012 -5150 1147 -8278 -2323 -3035 -7133 -3158 -1127
6511a127N960l822k611J555O006J683j2717o431N323Q598K741K976r129q31Q758
$$ -1127 4833 1011 -1600 -45 5961 7644 -5073 -11504 -6181 2417 5158 8134 -995 -1826 6932
6496F932L54M561l2q96o549k093L564j050p295k347L548N08J403k114J93R024
$$ 6932 7286 11847 11815 10919 4370 2277 5841 4791 -2504 -4851 -1303 -795 608 -1506 -1313 7711
6480G711J4758l436m914j2974N601k200l965j3234l374M304J1152J823O116j89
$$ 7711 22469 19033 14119 1145 6746 4546 581 -12653 -16027 -11723 -571 1252 7368 7179
6466G179L101J7247L049j0590j494r216r952j4140L202P838K078P45l838M158
$$ 7179 10280 27527 30576 19986 18492 9276 -676 -14816 -11614 -3776 -1698 -953 -4791 -633
6452f33k954q823j1416M459M522L990j99P801r5M525J3317k191k0932J4382J7647
$$ -633 -3587 -12410 -23826 -19367 -14845 -10855 -11054 -3253 -3348 1177 14494 12303 -8629 5753 23400
6437B3400j873l990o806j7782L403m012N366Q784j282m067m453J034K146j682
$$ 23400 21527 17537 10731 -7051 -3648 -7660 -2294 6490 5208 1141 -3312 -2278 -132 -1814
6423a814L070j0009J828O016P686q762j338P925P949j3348j535n172K061l721
$$ -1814 1256 -8753 -6925 -909 6777 -1985 -3323 4602 12551 -797 -2332 -7504 -5443 -9164
6409i164r748L051M567P2j3522j340K3599j11j5621N898L2971J8057Q75p393m210
$$ -9164 -18912 -15861 -11294 -11222 -24744 -26084 -2485 -2596 -18217 -12319 20652 38709 39584 32191 27981
6394B7981J203j3313k905m859j0997K675p017r941J4353J1584P636j474K421L545
$$ 27981 29184 15871 12966 8107 -2890 -215 -7232 -17173 -2820 8764 16400 14926 17347 20892
6380B0892q162r402o667r994j3557O111q86j3389l155L560N919J6001Q973k532
$$ 20892 12730 3328 -3339 -13333 -26890 -20779 -21665 -35054 -38209 -34649 -28730 -12729 -3756 -6288
6366f288n088M771l497J1802Q6M390j974j4981m690J4340n020p001m766r905J333
$$ -6288 -11376 -6605 -10102 1700 1786 6176 4202 -10779 -15469 -1129 -6149 -13150 -17916 -27821 -26488
6351b6488K7294N679j0309o320n054j407M248Q800N222o151P227N658j599q3J297
$$ -26488 806 6485 -3824 -10144 -15198 -16605 -12357 -3557 1665 -4486 2741 8399 6800 6717 8014
6336H014o654m831j3458L086K988M625j002O39R440j0409P083J5307N722J3219
$$ 8014 1360 -3471 -16929 -13843 -10855 -6230 -7232 -6593 2847 -7562 -479 14828 20550 33769
6322C3769j0613j3875N00l730Q687j6930j4044j759l763l118m055M181Q171k907
$$ 33769 23156 9281 9781 6051 14738 -2192 -16236 -17995 -21758 -24876 -28931 -24750 -16579 -19486
6308a9486R503j3824j6534J0948J8375P193J1149M439l50o110l914M086o717p397
$$ -19486 -9983 -23807 -40341 -29393 -11018 -3825 7324 11763 11413 5303 1389 5475 -1242 -8639
6294h639q728L217J3327Q071m248p852j0774l809n899R48N022K0822N108j2697
$$ -8639 -17367 -14150 -823 7248 3000 -4852 -15626 -19435 -25334 -24386 -19364 1458 6566 -6131
6280f131k5064p514O135m425J609J4750M282o415J5889J0259r310n658l291J1632
$$ -6131 -31195 -38709 -32574 -36999 -35390 -20640 -16358 -22773 -6884 3375 -5935 -11593 -14884 -3252
6266c252J3838q098L887J5244j2846j734L851j0079q085K3279o294J672j4575
$$ -3252 10586 2488 6375 21619 8773 7039 10890 811 -7274 16005 9711 11383 -3192
6253c192j7102J261J1469M52q077O949J5097P527k0393j7883J914P972O657K994
$$ -3192 -20294 -19033 -7564 -7112 -15189 -8240 6857 14384 -6009 -23892 -21978 -14006 -7349 -4355
6239d355M602J0521j1725j1849N878N301K518m843n315J328M54N400J070k728
$$ -4355 247 10768 -957 -12806 -6928 -1627 891 -3952 -9267 -7939 -7485 -2085 -1015 -3743
6225c743m599j0801J1199P350m687n624P078J4100n441j457P409j3981q907k585
$$ -3743 -8342 -19143 -7944 -594 -5281 -10905 -3827 10273 4832 3375 10784 -3197 -12104 -14689
6211a4689L251J085j023j392n78N521N671j798o322K490J5395q40k6682j0430
$$ -14689 -11438 -10353 -11376 -12768 -13346 -7825 -2154 -3952 -10274 -7784 7611 6771 -19911 -30341
6197c0341J5119Q144N482L722J833q72m078n034k697j2904o461M029q30K528j738
$$ -30341 -15222 -7078 -1596 2126 3959 3087 -991 -6025 -8722 -21626 -28087 -24058 -24888 -22360 -24098
6182b4098m349K393o259K083Q714J3200L422j4099j0174o426o322p97P100J9457
$$ -24098 -28447 -26054 -32313 -30230 -21516 -8316 -4894 -18993 -29167 -35593 -41915 -42712 -35612 -16155
6168a6155P281j0297J51q56K787N619Q733l106J151L378m359M401Q822o985j351
$$ -16155 -8874 -19171 -19020 -19876 -17089 -11470 -2737 -5843 -4692 -1314 -5673 -1272 7550 565 -786
6153g86J042N127p516r494r232K980l806m530l301Q77Q090P649M895K462l29P329
$$ -786 256 5383 -2133 -11627 -20859 -17879 -21685 -26215 -29516 -28639 -20549 -12900 -8005 -5543 -5872 1457
6137A457R211j354Q455j0123r046J2286J7339p854j0197q464l314o493j0251K808
$$ 1457 10668 9314 17769 7646 -1400 10886 28225 20371 10174 1710 -1604 -8097 -18348 -15540
6123a5540J5298M039l184r765n995K405k931N667k805k42N805M866q333n585r481
$$ -15540 -242 3797 613 -9152 -15147 -12742 -15673 -10006 -12811 -13053 -7248 -2382 -10715 -16300 -25781
6108b5781q320J2726J3027o153p896J004J4763M956q549l167M993k088k0155j59
$$ -25781 -34101 -21375 -8348 -14501 -22397 -21393 -6630 -1674 -10223 -13390 -8397 -10485 -30640 -30799
6094c0799m038L951J2379M719p852j331J3633j143J187J4898J0798Q819o834j6498
$$ -30799 -34837 -30886 -18507 -13788 -21640 -22971 -9338 -10481 -9294 5604 16402 25221 18387 1889
6080A889Q805K825k673K566M512m609p049K138o582O551K38j0369o48P709j1135
$$ 1889 10694 13519 10846 13412 17924 13315 6266 8404 1822 8373 8611 -1758 -2406 5303 -5832
6065e832P235J2577NK848j0087j0555m769M94n127K376J167m63Q239k362J3056
$$ -5832 1403 13980 13985 16833 6746 -3809 -8578 -8084 -13211 -10835 -9668 -10131 -1892 -4254 8802
6050H802r81k2864j0919O459J5575k634J843J3566J0711o380j3551O898j7387
$$ 8802 7821 -15043 -25962 -19503 -3928 -6562 -4719 8847 19558 13178 -373 6525 -10862
6037a0862n140p71n479k515M089M469K3230J0230j0222o652k2770j3895r218m965
$$ -10862 -16002 -16773 -22252 -24767 -20678 -16209 7021 17251 7029 377 -22393 -36288 -45506 -50471
6023e0471R092j76P4K2915O903L03O690j481J257p404N335R136R55R094m598o422
$$ -50471 -41379 -41555 -41481 -18566 -11663 -11360 -4670 -6151 -4894 -12298 -6963 2173 3128 12222 7624 1202
6007A202j4762j0369k134J9002J3099p258o384k495m704J5226O039J171M00j8051
$$ 1202 -13560 -23929 -26063 -7061 6038 -1220 -7604 -10099 -14803 423 6462 7633 8033 -10018
5993a0018n263O099R466r063j3311k915j039j84J2658K1997p977j0180j314N959
$$ -10018 -15281 -9182 284 -8779 -22090 -25005 -26044 -26228 -13570 8427 450 -9730 -11044 -5085
5979e085n739j4569o796J1317L908m480M122K648j182O531j860k350k712Q472
$$ -5085 -10824 -25393 -32189 -20872 -16964 -21444 -17322 -14674 -15856 -9325 -11185 -13535 -16247 -7775
5965g775R264K637m200r731k993m687j0113r879P516K4523R988j88p170j3356
$$ -7775 1489 4126 -74 -9805 -12798 -17485 -27598 -37477 -29961 -5438 4550 4362 -2808 -16164
5951a6164k8m307M900K340J129J1707P875o456p418m02n638p452k909O129J197
$$ -16164 -16192 -20499 -15599 -13259 -12130 -423 7452 996 -6422 -6824 -12462 -19914 -22823 -16694 -15497
5936a5497J4125N065n822j033j923M407K2254R170k0816o440o363L224K261l207
$$ -15497 -1372 3693 -2129 -3162 -5085 -678 21576 30746 9930 3490 -2873 351 2612 -595
5922e95r318j6454R054J3115p296j559R921p197l464M119J3585J5671j020j5011
$$ -595 -9913 -26367 -17313 -4198 -11494 -13053 -3132 -10329 -13793 -9674 3911 19582 18562 3551
5908C551j6825l944j992j4790k076Q546P240n043r892k272O0L408K4062J479l960
$$ 3551 -13274 -17218 -19210 -34000 -36076 -27530 -20290 -25333 -35225 -37497 -37437 -34029 -9967 -8488 -12448
5893a2448L321J332O40j1929q997K447K31O162N497J201K532R569k302r391m643
$$ -12448 -9127 -7795 -7155 -19084 -28081 -25634 -25403 -19241 -13744 -12543 -10011 -442 -2744 -12135 -16778
5878a6778J036j0295q133N383J5890J6722j783n960K266N937m716K416M428J0005
$$ -16778 -15742 -26037 -34170 -28787 -12897 3825 2042 -3918 -1652 4285 -431 1985 6413 16418
5864A6418O323P288j1487j2978j6877p681Q340J966m399R714R912o645j1652j0052
$$ 16418 22741 30029 18542 5564 -11313 -18994 -10654 -8688 -13087 -3373 6539 -106 -11758 -21810
5850b1810J1102l212N91M93k275j3307N949k610k614P896M220p16Q586Q466p146
$$ -21810 -10708 -13920 -13329 -12836 -15111 -28418 -22469 -25079 -27693 -19797 -15577 -16293 -7707 759 -6387
5835f387J901P779k522j1924j873o680j348m656M771J0851P833l647J202J6959
$$ -6387 -4486 3293 771 -11153 -13026 -19706 -21054 -25710 -20939 -10088 -2255 -5902 -4700 12259
5821A2259k148j6229j2993L318n546J3054J2315j187O847L526k268o240j3664
$$ 12259 10111 -6118 -19111 -15793 -21339 -8285 4030 2843 9690 13216 10948 4708 -8956
5808h956o979l123L70L283O201J315j7359J146M757k369J214J1455M699J5279
$$ -8956 -15935 -19058 -18688 -15405 -9204 -7889 -25248 -24102 -19345 -21714 -20500 -9045 -4346 10933
5794A0933k231o419l438p065K772j0410j829J1823J0719P98j4206m585J435M317
$$ 10933 8702 2283 -1155 -8220 -5448 -15858 -17687 -5864 4855 5653 -8553 -13138 -11703 -7386
5780g386J3676j727j5797L205O272j4059j0393p87J3070R434J2128n847j2559
$$ -7386 6290 4563 -11234 -8029 -1757 -15816 -26209 -26996 -13926 -4492 7636 1789 -10770
5767a0770j1375K816M850j246K25Q123J910L661m802j3717q03P661J3258P367
$$ -10770 -22145 -19329 -14479 -15725 -15500 -7377 -5467 -1806 -6608 -20325 -21128 -13467 -209 7158
5753G158K619Q516p546K014r338j4343o412P378n749j9620N315Q017o73M324J3977
$$ 7158 9777 18293 10747 12761 3423 -10920 -17332 -9954 -15703 -35323 -30008 -21991 -22664 -18340 -4363
5738d363M32m773K308j2679L233Q259n285p835J2606P241j0613j7772k776l284
$$ -4363 -3931 -8704 -6396 -19075 -15842 -7583 -12868 -20703 -8097 -856 -11469 -29241 -32017 -35301
5724c5301n155J4406J7750j762m797m300L825J5194n471n607P646l605j2597J2963
$$ -35301 -40456 -26050 -8300 -10062 -14859 -19159 -15334 -140 -5611 -11218 -3572 -7177 -19774 -6811
5710f811P954j0807j1053q306j0066p487J4360J3985K005J1871P618j510j2921
$$ -6811 1143 -9664 -20717 -29023 -39089 -46576 -32216 -18231 -16226 -4355 3263 1753 -11168
5697a1168l663J9379P405q615k7084j759J94P005O07r967L96R316l244j2343J1434
$$ -11168 -14831 4548 11953 3338 -23746 -25505 -25311 -18306 -17699 -27666 -27270 -17954 -21198 -33541 -22107
5682b2107n324q150M274K293J823j481J3517R900M944m199J841n296p696J969
$$ -22107 -27431 -35581 -31307 -29014 -27191 -28672 -15155 -5255 -311 -4510 -2669 -7965 -15661 -13692
5668a3692l436l531Q94R237P968n139O445K474j0338M27J812L839k1m238j47r702
$$ -13692 -17128 -20659 -19765 -10528 -2560 -7699 -1254 1220 -9118 -8691 -6879 -3040 -3061 -7299 -7446 -17148
5652a7148o596j0628j874J2939R929J5987p742k1068j0450K1003J9691L960j5185
$$ -17148 -23744 -34372 -36246 -23307 -13378 2609 -5133 -26201 -36651 -15648 4043 8003 -7182
5639g182j3468M998j75m153nn330O75k082M186K145P628L013M171o88o647r326
$$ -7182 -20650 -15652 -15827 -19980 -19985 -25315 -24640 -26722 -22536 -20391 -12763 -9750 -5579 -6267 -12914 -22240
5623b2240K1594K754l434Q350J0238m13j2651j1240o51J1535J0072k0401m349
$$ -22240 -646 2108 -1326 7024 17262 16849 4198 -7042 -7693 3842 13914 -6487 -10836
5610a0836J620j3021j9574L575O940R252o05Q531K1028o14j9996j4792p337j630
$$ -10836 -9216 -22237 -41811 -38236 -31296 -22044 -22649 -14118 6910 6296 -13700 -28492 -35829 -37459
5596c7459J2634N278L654P328L30m753j314N087J1279l884j1391p244J530J669
$$ -37459 -24825 -19547 -15893 -8565 -8235 -12988 -14302 -9215 2064 -1820 -13211 -20455 -18925 -17256
5582a7256J69P389O05o888O523J1226M660L911l121r819k280M839j316L592j771
$$ -17256 -17087 -9698 -9093 -15981 -9458 1768 6428 10339 7218 -2601 -4881 -42 -1358 2234 463
5567D63R349K378j0919j5065o868L674J1155J490r118j974j445J1721K244j9572
$$ 463 9812 12190 1271 -13794 -20662 -16988 -5833 -4343 -13461 -15435 -16880 -5159 -2915 -22487
5553b2487k539O022Q167m028n946q861l803J3473M294M379J0490K6623j3052l1667
$$ -22487 -25026 -19004 -10837 -14865 -20811 -29672 -33475 -20002 -15708 -11329 -839 25784 12732 -18935
5539a8935j2584L836p377j1983l117K6943J8003J501n959J0871k685n39j2488
$$ -18935 -31519 -27683 -35060 -47043 -50160 -23217 -5214 -3713 -9672 1199 -1486 -2025 -14513
5526a4513j6787R437J802N508J2931j667p615j697m271N145M208K140r609J339
$$ -14513 -31300 -21863 -20061 -14553 -1622 -3289 -10904 -12601 -16872 -11727 -7519 -5379 -14988 -13649
5512a3649J4042K846j4380j1476N967R816L909K581M887r788n886j5473K427J3750
$$ -13649 393 3239 -11141 -22617 -16650 -6834 -2925 -344 4543 -5245 -11131 -26604 -24177 -10427
5498a0427J4653l405r18l22N157J308j0032J6108P566k505j696p52m4N66j0344
$$ -10427 4226 821 -97 -419 4738 6046 -3986 12122 19688 17183 15487 14735 14691 15257 4913
5483D913N314L396o146j280p17j6314p048m76p563O085J5333m536q100Q649q692
$$ 4913 10227 13623 7477 6197 5480 -10834 -17882 -18358 -25921 -19836 -4503 -9039 -17139 -8490 -17182
5468a7182p225p701J292M484n1N404J4129p460o517o661n985M403O247J1273O750
$$ -17182 -24407 -32108 -30816 -26332 -26383 -20979 -6850 -14310 -20827 -27488 -33473 -29070 -22823 -11550 -4800
5453d800J0174O773m134j3411j1526p944n266K247J4346J3574J14L126K021j262
$$ -4800 5374 12147 8013 -5398 -16924 -24868 -30134 -27887 -13541 33 147 3273 5294 4032
5439D032q164p409k611J4898J583l138j1514j5315M721J3275j444q408J714j1502
$$ 4032 -4132 -11541 -14152 746 2329 -809 -12323 -27638 -22917 -9642 -11086 -19494 -17780 -29282
5425b9282k938M365J016L016J4025O195l156K360p0j2227p641L701J2340J147
$$ -29282 -32220 -27855 -26839 -23823 -9798 -3603 -6759 -4399 -4469 -16696 -24337 -20636 -8296 -7149
5411g149q828q613J5483p6q583j3835r048J3329J4727N882q88n4o298p387j3430
$$ -7149 -15977 -24590 -9107 -9183 -17766 -31601 -40649 -27320 -12593 -6711 -7599 -7653 -13951 -21338 -34768
5396c4768q963M806J2553J1606J955J1390n820m551j3850l515p651L243O42P174
$$ -34768 -43731 -38925 -26372 -14766 -12811 -1421 -7241 -11792 -25642 -29157 -36808 -33565 -32923 -25749
5382b5749N334J03K565p430j3868OJ7329R02j631Q586K172l117r900R857k370
$$ -25749 -20415 -20312 -17747 -25177 -39045 -39039 -21710 -20808 -22439 -13853 -11681 -14798 -24698 -14841 -17211
5367a7211l205P150O591J5419J577o764j6620M015m464N073j818o158K531J1633
$$ -17211 -20416 -13266 -6675 8744 10321 3557 -13063 -9048 -13512 -8439 -10257 -16415 -13884 -2251
5353b251M135N852r08k3865q743J9237P012r585j1769k077M534n488J1049l294
$$ -2251 1884 7736 6828 -17037 -25780 -6543 469 -9116 -20885 -22962 -18428 -23916 -12867 -16161
5339a6161K47M118L229m212N644n714r203N724J796l905p748R48m683j4933O578
$$ -16161 -15914 -11796 -8567 -12779 -7135 -12849 -22052 -16328 -14532 -18437 -26185 -25237 -29920 -44853 -38275
5324c8275J0624K5035J8324L744q231j3418J521L453P38Q265J287j252l544j6428
$$ -38275 -27651 -2616 15708 19452 11221 -2197 -676 2777 3515 11780 13067 11815 8271 -8157
5310h157j3103r188K2979J1645n996q018j1125J4167N010J761N80k212L563l530
$$ -8157 -21260 -30448 -7469 4176 -1820 -9838 -20963 -6796 -1786 -25 555 -1657 1906 -1624
5296a624r373j324n459j783J3493K320P69r193o972j604Q894N048j2802j1064
$$ -1624 -10997 -12321 -17780 -19563 -6070 -3750 -2981 -12174 -19146 -20750 -11856 -6808 -19610 -30674
5282c0674N674k505J8208J0852j926o287J064k603l728j3022j942P739j142j5281
$$ -30674 -25000 -27505 -9297 1555 -371 -6658 -5594 -8197 -11925 -24947 -26889 -19150 -20292 -35573
5268c5573P48K1804N406o639l399J3422J3641N601j105L655r869N335Q485K339
$$ -35573 -34825 -13021 -7615 -14254 -17653 -4231 9410 15011 13906 17561 7692 13027 21512 23851
5254B3851O52p771q578r128K830J2190J0663j727p872O970k135m816l092l600
$$ 23851 24503 16732 8154 -974 1856 14046 24709 22982 15110 22080 19945 15129 12037 8437
5240H437o17n92p977r498O29j2236M370Q166R668J0368K766r572j2434L751k962
$$ 8437 7820 7228 -749 -10247 -9618 -21854 -17484 -9318 350 10718 13484 3912 -8522 -4771 -7733
5225g733m160j1975P001l749q708L466N782l516J0063J264p751K261J1410m782
$$ -7733 -11893 -23868 -16867 -20616 -29324 -25858 -20076 -23592 -13529 -12265 -20016 -17755 -6345 -11127
5211a1127q359J7929k613j3333J4705J913n984r650l98M1J852J732J6311P539
$$ -11127 -19486 -1557 -4170 -17503 -2798 -885 -6869 -16519 -16917 -16876 -15024 -13292 3019 10558
5197A0558K872R135k458n40r549j2767k995j462j0892R38M273q989l282J6510
$$ 10558 13430 22565 20107 19567 10018 -2749 -5744 -7206 -18098 -17160 -12887 -21876 -25158 -8648
5183h648J1622j4761r522K710N872J771q15o38Q188q530q185j371J0465J3647
$$ -8648 2974 -11787 -21309 -18599 -12727 -10956 -11771 -12409 -4221 -12751 -20936 -22307 -11842 1805
5169A805P789j0405j0703o08j591m364q733Q173M619j064r053J5534R60m549J629
$$ 1805 9594 -811 -11514 -12122 -13713 -18077 -26810 -18637 -14018 -15082 -24135 -8601 -7641 -12190 -10561
5154a0561n045R79R414n270k974J471j227N315Q004Q710j0731p801k769N303K279
$$ -10561 -15606 -14627 -5213 -10483 -13457 -11986 -13213 -7898 106 8816 -1915 -9716 -12485 -7182 -4903
5139d903M74l467n187k182K635J0471P739j365M533N41j0342j4826j6175n198
$$ -4903 -4429 -7896 -13083 -15265 -12630 -2159 5580 4215 8748 9289 -1053 -15879 -32054 -37252
5125c7252K328O160L613K829K0102l566L247r044p900N890N332k0103q650K3298
$$ -37252 -34924 -28764 -25151 -22322 -2220 -5786 -2539 -11583 -19483 -13593 -8261 -28364 -37014 -13716
5111a3716J4051n99M073O337m838k5960l837K083k835P927p863o987J4822J0331
$$ -13716 335 -264 3809 10146 5308 -20652 -24489 -22406 -25241 -17314 -25177 -32164 -17342 -7011
5097g011J1679l57o300L449j430j0298q309j2450j187P814N332Q251l650J290
$$ -7011 4668 4311 -1989 1460 30 -10268 -18577 -31027 -32214 -24400 -19068 -10817 -14467 -13177
5083a3177j376r12P990J6116j66J500P479r948k048N808N194o459j496j367r143
$$ -13177 -14553 -15465 -7475 8641 8475 9975 17454 7506 5458 11266 16460 10001 8505 7138 -2005
5068b005j1383N077J5615k819p207O963R513o37k3021o173K903j507R311M379
$$ -2005 -13388 -8311 7304 4485 -2722 4241 13754 13117 -9904 -16077 -13174 -14681 -5370 -991
5054i91p020l952p42j0367q573l759J898R892j819k0556n746J3757J8420J5629
$$ -991 -8011 -11963 -12705 -23072 -31645 -35404 -33506 -23614 -25433 -45989 -51735 -37978 -19558 -3929
5040c929Q847K084O32j2636o392J27k392M08M27j621n212j4341q690J8979J4526
$$ -3929 4918 7002 7634 -5002 -11394 -11267 -13659 -13251 -12824 -14445 -19657 -33998 -42688 -23709 -9183
5025i183j442l82R702p073r536o717k145P217M786L018j6955q396J629J7260j451
$$ -9183 -10625 -11007 -1305 -8378 -17914 -24631 -26776 -19559 -14773 -11755 -28710 -37106 -35477 -18217 -19668
5010a9668l208K942J149N856K348j333P85l392R088P561o079R197L80j1250o110
$$ -19668 -22876 -19934 -18785 -12929 -10581 -11914 -11129 -14521 -5433 2128 -3951 5246 5626 -5624 -11734
4995a1734J0592o55m03J2336L07j5496l156l051J4952J306j3128l099M805Q784
$$ -11734 -1142 -1797 -2200 10136 10443 -5053 -8209 -11260 3692 4998 -8130 -11229 -6424 2360
4981B360J2977k051j1617j4941k222l354k13j125J2374k15l726r765R289K042
$$ 2360 15337 13286 1669 -13272 -15494 -18848 -19061 -20186 -7812 -8027 -11753 -21518 -12229 -10187
4967a0187M0l973J0201N977r824j983M650P910L312r562L456K030m301j1779l871
$$ -10187 -10147 -14120 -3919 2058 -7766 -9749 -5099 2811 6123 -3439 17 2047 -2254 -14033 -17904
4952a7904l790J088R693k854j1J4369O391p348J809m799k564j0537N923R446j0840
$$ -17904 -21694 -20606 -10913 -13767 -13778 591 6982 -366 1443 -3356 -5920 -16457 -10534 -1088 -11928
4937a1928L075O510o625m317o933P965n336j1172Q230J3928K681r792o366j392
$$ -11928 -8853 -2343 -8968 -13285 -20218 -12253 -17589 -28761 -20531 -6603 -3922 -13714 -20080 -21472
4923b1472j399Q219J2884r82R688o781j4208j0015l385R001J4856r966j0991L93
$$ -21472 -22871 -14652 -1768 -2750 6938 157 -14051 -24066 -27451 -18450 -3594 -13560 -24551 -24158
4909b4158Q985J3506J3591j9548j6902k476J1449P423N279P747j998Q016l774
$$ -24158 -15173 -1667 11924 -7624 -24526 -27002 -15553 -8130 -2851 4896 2898 10914 7140
4896G140p449q395l816J265j718q565P699M427O455K66k277N288M242K658k26
$$ 7140 -309 -8704 -12520 -11255 -12973 -21538 -13839 -9412 -2957 -2691 -4968 320 4562 7220 6994
4881F994l694j3006P57Q376Q681K881q597L512n840j1385j1356k292K181N51l31
$$ 6994 3300 -9706 -8949 -573 8108 10989 2392 5904 64 -11321 -22677 -24969 -22788 -22237 -22568
4866b2568P32J9905K474n042l173K687Q660L593K188j3165j1684R966J2470R778
$$ -22568 -21836 -1931 543 -4499 -7672 -4985 3675 7268 9456 -3709 -15393 -5427 7043 16821
4852A6821M747j1587o831k89k683J1394M692j2502l122L028O574n858j701j0413
$$ 16821 21568 9981 3150 2861 178 11572 16264 3762 640 3668 10242 4384 2683 -7730
4838g730k266p203L072k27P558L469J06K58M955p050j0052m833J0665O692J844
$$ -7730 -9996 -17199 -14127 -14354 -6796 -3327 -3221 -2963 1992 -5058 -15110 -19943 -9278 -2586 -742
4823g42n153J0212j3353M148p223J2053r745j2325o728K1697J5520n955l367M407
$$ -742 -5895 4317 -9036 -4888 -12111 -58 -9803 -22128 -28856 -7159 8361 2406 -961 3446
4809C446p961K435j181J201j1018Q102J9266j144K459Q984j5294j5100M580J892
$$ 3446 -4515 -2080 -3261 -2060 -13078 -4976 14290 13146 15605 24589 9295 -5805 -1225 667
4795F67o78P791j3649O155K1406k578j1375J637j2523j7145m482J3377l72j0046
$$ 667 -11 7780 -5869 286 21692 19114 7739 9376 -3147 -20292 -24774 -11397 -11769 -21815
4781b1815j0609M162J2285N506J082o767j089J0857O649P912m293O300O23k213
$$ -21815 -32424 -28262 -15977 -10471 -9389 -16156 -17245 -6388 261 8173 3880 10180 10803 8590
4767H590j0420j986K714m368j7470q543J2395N149j60j804k737K526M068O278
$$ 8590 -1830 -3816 -1102 -5470 -22940 -31483 -19088 -13939 -14099 -15903 -18640 -16114 -12046 -5768
4753e768L842P063o940j4528m053M570J9823J1115N020N339M150j2924l577L6
$$ -5768 -1926 5137 -1803 -16331 -20384 -15814 4009 15124 20144 25483 29633 16709 13132 13168
4739A3168p436P393O68n793j3093r349M166k176R099Q506Q13o299J054K651L498
$$ 13168 5732 13125 13793 8000 -5093 -14442 -10276 -12452 -3353 5153 5966 -333 721 3372 6870
4724F870n823j5381m290M237K825N644M715K48Q896j404p279j4301p128m655m774
$$ 6870 1047 -14334 -18624 -14387 -11562 -5918 -1203 -955 7941 6537 -742 -15043 -22171 -26826 -31600
4709c1600J3207Q089q912J4386j2922M656P685l096o253O189Q247q411l054q13
$$ -31600 -18393 -10304 -19216 -4830 -17752 -13096 -5411 -8507 -14760 -8571 -324 -8735 -11789 -12602
4695a2602J3907J6868k6j4221j0535R942N166k648j2308j0596j4322N284O753
$$ -12602 1305 18173 18147 3926 -6609 3333 8499 5851 -6457 -17053 -31375 -26091 -19338
4682a9338j2656n167O609O642J7541K862p743O10o59r40K048p105J0472J6857
$$ -19338 -31994 -37161 -30552 -23910 -6369 -3507 -11250 -10640 -11299 -12239 -10191 -17296 -6824 10033
4668A0033j1177L283k983q914L468L099J0000Q506k302o176j1228l234J2357r694
$$ 10033 -1144 2139 -844 -9758 -6290 -3191 6809 15315 13013 6837 -4391 -7625 4732 -4962
4654d962l518J0245k554j6404n693J3426R384j2478p203R033J1673l797J413P809
$$ -4962 -8480 1765 -789 -17193 -22886 -9460 -76 -12554 -19757 -10724 949 -2848 -1435 6374
4640F374O685J2350q366j3523r244r180n620j636l539M348O856l467L284n624
$$ 6374 13059 25409 17043 3520 -5724 -14904 -20524 -22160 -25699 -21351 -14495 -17962 -14678 -20302
4626b0302R75l519n454m735O544K0373L947J223L786j1947Q1Q387j514m139n075
$$ -20302 -19327 -22846 -28300 -33035 -26491 -6118 -2171 -948 2838 -9109 -9028 -641 -2155 -6294 -11369
4611a1369j1493l482J4398M040p868k542N466k664J292n172o234L460O529j592
$$ -11369 -22862 -26344 -11946 -7906 -15774 -18316 -12850 -15514 -14222 -19394 -25628 -22168 -15639 -17231
4597a7231k978l501P887M333J1992J1114l878l594R63n897M722l736j7694J4506
$$ -17231 -20209 -23710 -15823 -11490 502 11616 7738 4144 5107 -790 3932 196 -17498 -2992
4583b992P252J622p2j5522J006J756O163K333j2337J0532n54j5883j0096K443
$$ -2992 4260 5882 5810 -9712 -8706 -6950 -787 1546 -10791 -259 -813 -16696 -26792 -24349
4569b4349N815o093n401M725J6436R469O983j8050J80J0069n555j36O717J110
$$ -24349 -18534 -24627 -30028 -25303 -8867 602 7585 -10465 -10285 -216 -5771 -5907 810 1920
4555A920j4884j717K029j2588m583K434m247M209N102o277N486J0170K210j6022
$$ 1920 -12964 -14681 -12652 -25240 -29823 -27389 -31636 -27427 -22325 -28602 -23116 -12946 -10736 -26758
4541b6758o515R652K081o755R365K677Q688M956m523j1310J666P921n614m533
$$ -26758 -33273 -23621 -21540 -28295 -18930 -16253 -7565 -2609 -7132 -18442 -16776 -8855 -14469 -19002
4527a9002m872l206J7927k964K113j0690J391k463o843O215J1842Q292n38m577
$$ -19002 -23874 -27080 -9153 -12117 -10004 -20694 -19303 -21766 -28609 -22394 -10552 -2260 -2798 -7375
4513g375j492K574M407P86J1147O056O463j250o632j5752n231k55k8K149r109
$$ -7375 -8867 -6293 -1886 -1100 10047 16103 22566 21316 14684 -1068 -6299 -6554 -6582 -4433 -13542
4498a3542j1649J5363P837j2642j544N201P4P822p279j5965Q071O79q656N063
$$ -13542 -25191 -9828 -1991 -14633 -16177 -10976 -10902 -3080 -10359 -26324 -18253 -17574 -26230 -21167
4484b1167P271Q273K340p528p000M095o156M165m851R643M158O86N908O195k41
$$ -21167 -13896 -5623 -3283 -10811 -17811 -13716 -19872 -15707 -20558 -10915 -6757 -6071 -163 6032 5791
4469E791q28l244q532J4507R762n670j2779j3186l895M290l568l659J5599O658
$$ 5791 4963 1719 -6813 7694 17456 11786 -993 -14179 -18074 -13784 -17352 -21011 -5412 1246
4455A246r369j5283P880J9487K275j2244n283n886n489m400R419m398J3520O662
$$ 1246 -8123 -23406 -15526 3961 6236 -6008 -11291 -17177 -22666 -27066 -17647 -22045 -8525 -1863
4441a863m720L961N276O037O749L247K985j7672q948k595l287M492J2163l49r851
$$ -1863 -6583 -2622 2654 8691 15440 18687 21672 4000 -4948 -7543 -10830 -6338 5825 5476 -4375
4426d375n855K200M688n455j2042j2186M940L872J7225k286n73P755P397j2412
$$ -4375 -10230 -8030 -3342 -8797 -20839 -33025 -28085 -24213 -6988 -9274 -9847 -2092 5305 -7107
4412g107K51P36r827r434M65j2319P729K4556J5761K556N89J3833M899l560j1767
$$ -7107 -6856 -6120 -15947 -25381 -24916 -37235 -29506 -4950 10811 13367 13956 27789 32688 29128 17361
4397A7361p077j0270J6803k632j1837j0323M266K297J3Q078j961j6052j1244J0613
$$ 17361 10284 14 16817 14185 2348 -7975 -3709 -1412 -1399 6679 4718 -11334 -22578 -11965
4383a1965J8012j6439j420j353J0184o108P448q45n086Q309j4106l353L646m094
$$ -11965 6047 -10392 -11812 -13165 -2981 -9089 -1641 -2486 -7572 737 -13369 -16722 -13076 -17170
4369a7170o208K81l530J0168J4240j543q994m867j592L406K002P75J0128J0943
$$ -17170 -23378 -23097 -26627 -16459 -2219 -3762 -12756 -17623 -19215 -15809 -13807 -13032 -2904 8039
4355H039k553k157o685N677R195p565j1467j1298O382Q336m73m675o771N322K060
$$ 8039 5486 3329 -3356 2321 11516 3951 -7516 -18814 -12432 -4096 -4569 -9244 -16015 -10693 -8633
4340h633p179n222l041J4395P513N543N824j256m870O325m073K729k063m784q550
$$ -8633 -15812 -21034 -24075 -9680 -2167 3376 9200 7944 3074 9399 5326 8055 5992 1208 -7342
4325g342j3556n206M570J4961J0341k494J5695n177o807L336j951q508L709J3853
$$ -7342 -20898 -26104 -21534 -6573 3768 1274 16969 11792 4985 8321 6370 -2138 1571 15424
4311A5424k880j704q873p337M9J4343%M38o693q495j456p335l47k930Q710J9220
$$ 15424 12544 10840 1967 -5370 -5321 9022 9022 9460 2767 -5728 -7184 -14519 -14866 -17796 -9086 10134
4295A0134k995n972K540q098J408Lm174J0257L174J44j034r567j120Q191J4893
$$ 10134 7139 1167 3707 -4391 -2983 -2980 -7154 3103 6277 6421 5387 -4180 -5300 2891 17784
4280A7784O60j9201n609M847J5306J293j632j0572j5255p492o750j811J3266R047
$$ 17784 18444 -757 -6366 -1519 13787 15080 13448 2876 -12379 -19871 -26621 -28432 -15166 -6119
4266f119M106J8188L936r989j0318j3897n625k831J500J4045R601J8611q307k5678
$$ -6119 -2013 16175 20111 10122 -196 -14093 -19718 -22549 -21049 -7004 2597 21208 12901 -12777
4252a2777j2848r1R504Q86J2353j5552O633Q37r283o822J995L886J78n447P252
$$ -12777 -25625 -25716 -16212 -15326 -2973 -18525 -11892 -11055 -20338 -27160 -25165 -21279 -21101 -26548 -19296
4237a9296J8360j324n976j908Q634j677j0844K436J1706N544N509R712k176j4838
$$ -19296 -936 -2260 -8236 -10144 -1510 -3187 -14031 -11595 111 5655 11164 20876 18700 3862
4223C862j3189J681K661j0739n30N213K051J3482R670n23m351q250k4419r429
$$ 3862 -9327 -7646 -4985 -15724 -16254 -11041 -8990 4492 14162 13639 9288 1038 -23381 -32810
4209c2810k712J1988J1025P116m443j4089j2717R83Q131J1947M68j7297m332J9725
$$ -32810 -35522 -23534 -12509 -5393 -9836 -23925 -36642 -35659 -27528 -15581 -15113 -32410 -36742 -17017
4195a7017P793j857K855J310k645J803l824K709N264P632n985p777J0665Q223
$$ -17017 -9224 -11081 -8226 -6916 -9561 -7758 -11582 -8873 -3609 4023 -1962 -9739 926 9149
4181I149r103j175J183j456P218n439N318O405l813j1508o046R058J1176N541
$$ 9149 46 -1129 54 -1402 5816 377 5695 12100 8287 -3221 -9267 -209 10967 16508
$$ [...]
##END NTUPLES=NMR SPECTRUM
##END=
