##TITLE=Analysis number 328931
Compound Code cc 62346
Book Reference 464/168/10
Project Code adrs
Chemist Name chrisr
##JCAMPDX= 6.0         $$ Bruker NMR JCAMP-DX V2.0
##DATA TYPE= NMR SPECTRUM
##DATA CLASS= NTUPLES
##ORIGIN= Bruker BioSpin GmbH
##OWNER= nmr
$$ XWIN-NMR		Version 3.5
$$ Tue Jul 17 11:51:32 2007 GMT Daylight Time (UT+1h)  MAYBRIDGE\nmr@NMR_250MHZ
##.OBSERVE FREQUENCY= 250.131544655141
##.OBSERVE NUCLEUS= ^1H
##.ACQUISITION MODE= SIMULTANEOUS (DQD)
##.ACQUISITION SCHEME= undefined
##.AVERAGES= 16
##.DIGITISER RES= 18
##SPECTROMETER/DATA SYSTEM= dpx250
##.PULSE SEQUENCE= zg30
##.SOLVENT NAME= CDCl3
##.SHIFT REFERENCE= (INTERNAL, CDCl3, 0, 16.522)
##AUDIT TRAIL= $$ (NUMBER, WHEN, WHO, WHERE, WHAT)
$$ ##TITLE= Audit trail, XWIN-NMR		Version 3.5
$$ ##JCAMPDX= 5.01
$$ ##ORIGIN= Bruker BioSpin GmbH
$$ ##OWNER= nmr
$$ C:\u/data/dgb/nmr/ADRS/1120/pdata/1/auditp.txt
$$ ##AUDIT TRAIL=  $$ (NUMBER, WHEN, WHO, WHERE, WHAT)
(   1,<2007-07-17 11:51:10.51 +100>,<MAYBRIDGE\nmr>,<NMR_250MHZ>,
      <created by zg, POWCHK disabled, PULCHK disabled
       configuration hash MD5:
       76 6E 9A 78 1E 09 19 81 EC 84 63 8F B0 6A 59 2D
       data hash MD5: 64K
       8B 69 8F 83 2A C8 A0 B9 2B 32 22 04 57 06 41 C3>)
(   2,<2007-07-17 11:51:22.15 +100>,<MAYBRIDGE\nmr>,<NMR_250MHZ>,
      <Start of raw data processing
       ef LB = 0.3 FT_mod = 6 PKNL = 1 SI = 32K 
       data hash MD5: 32K
       5D 2E 83 DA DB DA C4 BA CD F1 78 D3 0F 5B B2 2B>)
(   3,<2007-07-17 11:51:23.79 +100>,<MAYBRIDGE\nmr>,<NMR_250MHZ>,
      <apk 
       data hash MD5: 32K
       F4 96 C5 27 1D A7 19 67 56 7B AF B5 54 DD A9 37>)
(   4,<2007-07-17 11:51:24.51 +100>,<MAYBRIDGE\nmr>,<NMR_250MHZ>,
      <abs ABSG = 5 
       data hash MD5: 32K
       6C 11 F2 43 B3 3E 58 CB A6 BB A7 1C 53 0F 15 9B>)
$$ ##END=
$$ 
$$ hash MD5
$$ D5 DF F7 D1 08 36 DC 58 09 FB 5E FD FC 4A 8B 74
##$RELAX= 
##$RELAX= 
##$RELAX= 
##$RELAX= 
##$RELAX= 
##$RELAX= 
##$RELAX= 
$$ Bruker specific parameters
$$ --------------------------
##$DU= <C:\u>
##$EXPNO= 1120
##$NAME= <ADRS>
##$PROCNO= 1
##$TYPE= <nmr>
##$USER= <dgb>
##$AMP= (0..31)
100 100 100 100 100 100 100 100 100 100 100 100 100 100 100 100 100 100 
100 100 100 100 100 100 100 100 100 100 100 100 100 100 
##$AQSEQ= 0
##$AQ_mod= 3
##$AUNM= <au_zg>
##$AUTOPOS= <24 >
##$BF1= 250.13
##$BF2= 250.13
##$BF3= 250.13
##$BF4= 250.13
##$BF5= 500.13
##$BF6= 500.13
##$BF7= 500.13
##$BF8= 500.13
##$BYTORDA= 1
##$CFDGTYP= 0
##$CFRGTYP= 5
##$CHEMSTR= <none>
##$CNST= (0..31)
1 1 145 1 1 1 1 1 1 1 1 1 1 1 1 1 1 1 1 1 1 1 1 1 1 1 1 1 1 1 1 1 
##$CPDPRG= <>
##$CPDPRG1= <>
##$CPDPRG2= <>
##$CPDPRG3= <>
##$CPDPRG4= <mlev>
##$CPDPRG5= <mlev>
##$CPDPRG6= <mlev>
##$CPDPRG7= <mlev>
##$CPDPRG8= <mlev>
##$CPDPRGB= <>
##$CPDPRGT= <>
##$D= (0..31)
0 1 0 0 0 0 0 0 0 0.06 0 0 0 0 0 0 0.0002 0 0 0 0 0 0 0 0 0 0 0 0 0 0 
0 
##$DATE= 1184669469
##$DBL= (0..7)
120 120 120 120 120 120 120 120 
##$DBP= (0..7)
150 150 150 150 150 150 150 150 
##$DBP07= 0
##$DBPNAM0= <>
##$DBPNAM1= <>
$$ [...]
##$SUBNAM7= <"">
##$SUBNAM8= <"">
##$SUBNAM9= <"">
##$SW= 20.6930455092707
##$SWIBOX= (0..15)
0 0 3 0 0 0 0 0 0 0 0 0 0 0 0 0 
##$SW_h= 5175.983436853
##$TD= 65536
##$TD0= 1
##$TE= 296.16
##$TE2= 300
##$TE3= 300
##$TEG= 300
##$TL= (0..7)
0 120 120 120 120 120 120 120 
##$TP= (0..7)
150 150 150 150 150 150 150 150 
##$TP07= 0
##$TPNAME0= <>
##$TPNAME1= <>
##$TPNAME2= <>
##$TPNAME3= <>
##$TPNAME4= <>
##$TPNAME5= <>
##$TPNAME6= <>
##$TPNAME7= <>
##$TPOAL= (0..7)
0.5 0.5 0.5 0.5 0.5 0.5 0.5 0.5 
##$TPOFFS= (0..7)
0 0 0 0 0 0 0 0 
##$TUNHIN= 0
##$TUNHOUT= 0
##$TUNXOUT= 0
##$USERA1= <user>
##$USERA2= <user>
##$USERA3= <user>
##$USERA4= <user>
##$USERA5= <user>
##$V9= 5
##$VALIST= <valist>
##$VCLIST= <CCCCCCCCCCCCCCC>
##$VD= 0
##$VDLIST= <DDDDDDDDDDDDDDD>
##$VPLIST= <PPPPPPPPPPPPPPP>
##$VTLIST= <TTTTTTTTTTTTTTT>
##$WBST= 1024
##$WBSW= 4
##$XGAIN= (0..3)
0 0 0 0 
##$XL= 0
##$YL= 0
##$YMAX_a= 585778
##$YMIN_a= -573460
##$ZGOPTNS= <>
##$ZL1= 120
##$ZL2= 120
##$ZL3= 120
##$ZL4= 120
##$ABSF1= 16.522
##$ABSF2= -4.171173
##$ABSG= 5
##$ABSL= 3
##$ALPHA= 0
##$AQORDER= 0
##$ASSFAC= 0
##$ASSFACI= 0
##$ASSFACX= 0
##$ASSWID= 0
##$AUNMP= <proc_1d>
##$AZFE= 0.1
##$AZFW= 0.1
##$BCFW= 0
##$BC_mod= 0
##$BYTORDP= 0
##$COROFFS= 0
##$CY= 12.5
##$DATMOD= 1
##$DC= 0
##$DFILT= <>
##$DTYPP= 0
##$F1P= 14.0000005364418
##$F2P= -0.99999901652339
##$FCOR= 0.5
##$FTSIZE= 32768
##$FT_mod= 6
##$GAMMA= 0
##$GB= 0
##$INTBC= 1
##$INTSCL= 1
##$ISEN= 128
##$LB= 0.3
##$LEV0= 0
##$LPBIN= 0
##$MAXI= 10000
##$MC2= 0
##$MEAN= 0
##$ME_mod= 0
##$MI= 0
##$NCOEF= 0
##$NC_proc= -2
##$NLEV= 6
##$NOISF1= 0
##$NOISF2= 0
##$NSP= 0
##$NTH_PI= 0
##$NZP= 0
##$OFFSET= 16.522
##$PC= 1
##$PHC0= -51.04137
##$PHC1= 7.2275
##$PH_mod= 1
##$PKNL= yes
##$PPARMOD= 0
##$PSCAL= 4
##$PSIGN= 0
##$REVERSE= no
##$SF= 250.13
##$SI= 32768
##$SIGF1= 0
##$SIGF2= 0
##$SINO= 400
##$SIOLD= 32768
##$SREGLST= <1H.CDCl3>
##$SSB= 0
##$STSI= 32768
##$STSR= 0
##$SW_p= 5175.98343685301
##$SYMM= 0
##$S_DEV= 0
##$TDeff= 65536
##$TDoff= 0
##$TI= <Analysis number 999999
Compound Code 99
Book Reference 9
Project Code 9>
##$TILT= no
##$TM1= 0
##$TM2= 0
##$TOPLEV= 0
##$USERP1= <user>
##$USERP2= <user>
##$USERP3= <user>
##$USERP4= <user>
##$USERP5= <user>
##$WDW= 1
##$XDIM= 32768
##$YMAX_p= 447443840
##$YMIN_p= -161072
$$ End of Bruker specific parameters
$$ ---------------------------------
##NTUPLES= NMR SPECTRUM
##VAR_NAME=  FREQUENCY,     SPECTRUM/REAL,   SPECTRUM/IMAG
##SYMBOL=    X,             R,               I
##VAR_TYPE=  INDEPENDENT,   DEPENDENT,       DEPENDENT
##VAR_FORM=  AFFN,          ASDF,            ASDF
##VAR_DIM=   32768,         32768,           32768
##UNITS=     HZ,            ARBITRARY UNITS, ARBITRARY UNITS
##FACTOR=    0.157963299565203, 1,           1
##FIRST=     4132.6476996994, 0,             0
##LAST=      -1043.33573715361, 0,           0
##MIN=       -1043.33573715361, -161072,     0
##MAX=       4132.6476996994, 447443840,     0
$$ Real data points
##PAGE= N=1
##DATA TABLE= (X++(R..R)), XYDATA
$$ [...]
19378b426N859J484J497j4803o355L019J710o82J204J099J043R844P36L967Q10
$$ -2426 3433 4917 6414 -8389 -14744 -11725 -10015 -10697 -9493 -8394 -7351 2493 3229 7196 8006
19363H006l514o076l167J286p151J162P185J909L292J401k126m837L42l210j306
$$ 8006 4492 -1584 -4751 -3465 -10616 -9454 -2269 -360 2932 4333 2207 -2630 -2288 -5498 -6804
19348f804l04l31J483K265L764p394p039l504N406M405k24K94K560K592L521J380
$$ -6804 -7108 -7439 -5956 -3691 73 -7321 -14360 -17864 -12458 -8053 -8277 -7983 -5423 -2831 690 2070
19332B070k618n152J148K130L006K847l791l982L773n542K51K503k42m832K912
$$ 2070 -548 -5700 -4552 -2422 584 3431 -360 -4342 -569 -6111 -5860 -3357 -3599 -8431 -5519
19317e519M440J766r95k56q64M518K008j416J550J257O372o531k041N310M041
$$ -5519 -1079 687 -308 -564 -1428 3090 5098 3682 5232 6489 12861 6330 4289 9599 13640
19302A3640q56l931m249M3k32l834j056P429K166j302n926j658M48j902k714j042
$$ 13640 12784 8853 4604 4647 4415 581 -475 6954 9120 7818 1892 234 682 -1220 -3934 -4976
19286d976o754K578O369l351M860J537L238q92o762n418J927n20n802K311l00
$$ -4976 -11730 -9152 -2783 -6134 -1274 263 3501 2609 -4153 -9571 -7644 -8164 -13966 -11655 -11955
19271a1955N51q83M990P804Q462n478k139J688l24l855p287q32j692K117n176
$$ -11955 -11404 -12287 -7297 507 8969 3491 1352 3040 2716 -1139 -8426 -9258 -10950 -8833 -14009
19256a4009N378L368J225K941M790L840j594l451l079l165j166k311k356J0430
$$ -14009 -8631 -5263 -4038 -1097 3693 7533 5939 2488 -591 -3756 -4922 -7233 -9589 841
19242H41J498j289L51L0M566j194p71O856k436r430n169J588J652J381l329k133
$$ 841 2339 1050 1401 1431 5997 4803 4032 10888 8452 -978 -6147 -4559 -2907 -1526 -4855 -6988
19226f988M822N896L143l565o745J369R53J832J404j0099r83K753L282j608m886
$$ -6988 -2166 3730 6873 3308 -3437 -2068 -1115 717 2121 -7978 -8961 -6208 -2926 -4534 -9420
19211i420O353K694l201j637k140K154K651J0261N574l806K176N2n210k271o041
$$ -9420 -3067 -373 -3574 -5211 -7351 -5197 -2546 7715 13289 9483 11659 11711 6501 4230 -1811
19196a811m866l468L919R675m034p117O501K854o482k003n467l33N744N418J722
$$ -1811 -6677 -10145 -6226 3449 -585 -7702 -1201 1653 -4829 -6832 -12299 -12632 -6888 -1470 252
19181B52k829k695j305m244k297J446P48R525N810l747j855m498J097M040k326
$$ 252 -2577 -5272 -6577 -10821 -13118 -11672 -10924 -1399 4411 664 -1191 -5689 -4592 -552 -2878
19166b878n72L361r70m120l365j077k156L953l74J326k97M944J888J695j737q46
$$ -2878 -3450 -89 -1059 -5179 -8544 -9621 -11777 -7824 -8198 -6872 -7169 -2225 -337 1358 -379 -1225
19150a225N15o309m668N870L801l870J193J810J329l370K663n375J000N304R369
$$ -1225 -710 -7019 -11687 -5817 -2016 -5886 -4693 -2883 -1554 -4924 -2261 -7636 -6636 -1332 8037
19135H037l786p466q21n53R791Q890K512o293p035o277K912L396L688N162j0066
$$ 8037 4251 -3215 -4036 -4589 5202 14092 16604 10311 3276 -3001 -89 3307 6995 12157 2091
19120B091j2102j87M639N780j307R55j676Q70m280k371q044m969M441J0165J401
$$ 2091 -10011 -10198 -5559 221 -1086 -131 -1807 -937 -5217 -7588 -15632 -20601 -16160 -5995 -4594
19105d594k616N288K986j064J368L070L944r379l094Q93J0303N439J9m738n491
$$ -4594 -7210 -1922 1064 0 1368 4438 8382 -997 -4091 -3198 7105 12544 12563 7825 2334
19090B334k992l102J436L858o392l369L395P65l647N99L531K693N6m849J612l183
$$ 2334 -658 -3760 -2324 1534 -4858 -8227 -4832 -4067 -7714 -7115 -3584 -891 -835 -5684 -4072 -7255
19074g255l028N687K649l013K068l026j36N466j922j687l999l185P17O964O213
$$ -7255 -10283 -4596 -1947 -4960 -2892 -5918 -6054 -588 -2510 -4197 -8196 -11381 -10664 -3700 2513
19059B513n641m824m01M903M550n122m668m503O122P617K770K421l767j920l694
$$ 2513 -3128 -7952 -8353 -3450 1100 -4022 -8690 -13193 -7071 546 3316 5737 1970 50 -3644
19044c644K868K357j862P563L90n006K110m824k087K500J902j052k69J67K271
$$ -3644 -776 1581 -281 7282 7672 2666 4776 -48 -2135 365 2267 1215 946 1113 3384
19029C384j658j729j40P926l814l961K259l924J451L429n880M593J035r851k059
$$ 3384 1726 -3 -143 7783 3969 8 2267 -1657 -206 3223 -2657 1936 2971 -6880 -8939
19014h939j843j075Q923P606O24o140r139J0343K680k368L656M381K379k24m624
$$ -8939 -10782 -11857 -2934 4672 5296 -844 -9983 360 3040 672 4328 8709 11088 10864 6240
18999F240l410K175M303K111K585j2574q217L353l060k801L368Q525J782l811
$$ 6240 2830 5005 9308 11419 14004 1430 -6787 -3434 -6494 -9295 -5927 2598 4380 569
18985E69k528j283j77J807M749M462j181l11K442l651r79l301j521k082j516P64
$$ 569 -1959 -3242 -3419 -1612 3137 7599 6418 6107 8549 4898 3919 618 -903 -2985 -4501 -3737
18969c737K761K612K063l835O75N320l861m124K304o43N308J525o482J537R52
$$ -3737 -976 1636 3699 -136 539 5859 1998 -2126 178 -465 4843 6368 -114 1423 2375
18954B375J433o85L477k853K767l66l594n93j438j998K244O714J284j731K610
$$ 2375 3808 3123 6600 3747 6514 6148 2554 1961 523 -1475 769 7483 8767 7036 9646
18939I646k079p852j624J907J324K06P07q29k977J151N518L337r205k268J2907
$$ 9646 7567 -285 -1909 -2 1322 1528 2235 1406 -1571 -420 5098 8435 -770 -3038 9869
18924I869K053k546r8r53m22O107l398k46k282J512k03Q68o985j946Q56J866K487
$$ 9869 11922 9376 9278 8325 7903 14010 10612 10366 8084 9596 9393 10261 3276 1330 2186 4052 6539
18907F539J188r037l63J439j065J53R70L57m083N021J862R67K166K704P270M737
$$ 6539 7727 -1310 -1673 -234 -1299 -1146 -176 181 -3902 1119 2981 3948 6114 8818 16088 20825
18891B0825m050m117o280p901q50L762l825l520O806J0794q15J104j511N602L090
$$ 20825 16775 12658 6378 -1523 -2373 1389 -2436 -5956 850 11644 10829 11933 10422 16024 19114
18876A9114j360k176L839R848M388n620j017O522K77K408J0834Q385J5012L0714
$$ 19114 17754 15578 19417 29265 33653 28033 27016 33538 33815 36223 47057 55442 70454 101168
18862A01168L0330L1059L0981K3738J4292M671q695k4448k3321j8621j966Q256
$$ 101168 131498 162557 193538 217276 231568 236239 227544 203096 179775 161154 159188 167444
18850A67444J2629K1055K2692K1760N490l830k3150l2031l5054l0445k5836k6435
$$ 167444 180073 201128 223820 245580 251070 247240 224090 192059 157005 126560 100724 74289
18838G4289k3493j4659J231L934p014q907p167k719j0093j1697k227L106q48K987
$$ 74289 50796 36137 37368 41302 34288 25381 18214 15495 5402 -6295 -8522 -5416 -6264 -3277
18824c277J3227n36M494J543k551l036l32M094k056J49K930K884k221j065L054
$$ -3277 9950 9414 13908 15451 12900 9864 9532 13626 11570 11719 14649 17533 15312 14247 17301
18809A7301N10m645p514J019O040j108R009M400j950p717r309L645O440j501m736
$$ 17301 17811 13166 5652 6671 12711 11603 20612 25012 23062 15345 6036 9681 16121 14620 9884
18794I884l59J773J797p96k36J945l587M623L37m495k167N609o749m73M367k348
$$ 9884 9525 11298 13095 12299 12063 14008 10421 15044 15381 10886 8719 14328 7579 7106 11473 9125
18778I125K957K097n125n22P040L152m112P7K107J1481J6557K0674P751j5762
$$ 9125 12082 14179 9054 8532 15572 18724 14612 14689 16796 28277 44834 65508 73259 57497
18764E7497k6102j5411k388l182K715k980M422j462p994p353J245Q751n8k949
$$ 57497 31395 15984 13596 10414 13129 10149 14571 13109 5115 -2238 -993 7758 7700 4751
18750D751p933j075j809P8l456J598L25J836j724M435K066M471K956j931j300
$$ 4751 -3182 -4257 -6066 -5988 -9444 -7846 -7521 -5685 -7409 -2974 -908 3563 6519 4588 3288
18735C288K414j883j054k805K189J6066R76j2747m199J114L755J455M572K454
$$ 3288 5702 3819 2765 -40 2149 18215 19191 6444 2245 3359 7114 8569 13141 15595
18721A5595K137m170o89J532r6o14J145k177n979n8K22M934L967o929r36p61q015
$$ 15595 17732 13562 12873 14405 14309 13695 14840 12663 6684 6626 6848 11782 15749 8820 7884 7123 -892
18704h92Q753N154J787k590n010j138O360j367J363K73K589J308J083J410l166
$$ -892 7861 13015 14802 12212 7202 6064 12424 11057 12420 12693 15282 16590 17673 19083 15917
18689A5917k641k543j782r25K132k671n301k870K560k519J751K274k190n832K782
$$ 15917 13276 10733 8951 8026 10158 7487 2186 -684 1876 -643 1108 3382 1192 -4640 -1858
18674a858J885j657m30N535J05l870J275N144N059L635l013j575M47J585K440
$$ -1858 27 -1630 -2060 3475 3580 -290 985 6129 11188 14823 11810 10235 10682 12267 14707
18659A4707m18K505m54N12l049l714j082j851k238L215n949k404R403L822M192
$$ 14707 14289 16794 16340 16852 13803 10089 9007 7156 4918 8133 2184 -220 9183 13005 17197
18644A7197j725q107r883m625J0037Q826k463J676Q181l721q474N17M671p83l265
$$ 17197 15472 7365 -2518 -7143 2894 11720 9257 10933 19114 15393 6919 7436 12107 11324 8059
18629H059n485k129L381L288K310L09m909O313J721n175j46K061J972M767N476
$$ 8059 2574 445 3826 7114 9424 9733 4824 11137 12858 7683 7537 9598 11570 16337 21813
18614B1813J178p151q328P232L44p19m240j358l386Q146l139k963j125R39M325
$$ 21813 22991 15840 7512 14744 15088 14369 10129 8771 5385 13531 10392 7429 6304 7243 11568
18599A1568M303k417r146N536L773N74K664N291L123K464P520O540Q193J341o043
$$ 11568 15871 13454 4308 9844 13617 14191 16855 22146 25269 27733 35253 41793 49986 51327 45284
18584D5284j1184j2724p191m167M910p72L596Q31Q674J5632J6630L144j4084j8412
$$ 45284 34100 21376 14185 10018 14928 14156 17752 18583 27257 42889 59519 62663 48579 30167
18570C0167j2494j4951K409J0500L081N685O573k911q537m211l145M456k808k456
$$ 30167 17673 2722 5131 15631 18712 24397 30970 28059 19522 15311 12166 16622 13814 11358
18556A1358R843N000L393n960n696k972j356N943J981n385m68J0050l002l997
$$ 11358 21201 26201 29594 23634 17938 14966 13610 19553 21534 16149 15681 25731 22729 18732
18542A8732j592L667L559N723L134n22R7O651K268J311L795L070L305J109m63
$$ 18732 17140 20807 24366 30089 33223 32701 32798 39449 41717 43028 46823 49893 53198 54307 53844
18527E3844M714Q762m896m193L774K978j662k050n955k919m924n72N040O961q936
$$ 53844 58558 67320 62424 58231 62005 64983 63321 61271 55316 52397 47473 46901 51941 58902 49966
18512D9966j0516n688O160L621k048l871k356n045j304O294k770M86P864q68r040
$$ 49966 39450 33762 39922 43543 41495 37624 35268 30223 28919 35213 32443 32929 40793 39925 30885
18497C0885p277j684N482n48K81K45j621Q64l794M667N571M170r46J091j72J501
$$ 30885 23608 21924 27406 26858 27139 27384 25763 26627 22833 27500 33071 37241 36295 37386 37214 38715
18481C8715L02q65j096j863L55O83o49j842l7k699k381L495j3L101k472J248N763
$$ 38715 39017 38152 37056 35193 35548 36231 35582 33740 33703 31004 28623 32118 32105 35206 32734 33982 39745
18464C9745J763l979o743j868K391K545J325P358M787K238N106J440l427K048
$$ 39745 41508 37529 30786 28918 31309 33854 35179 42537 47324 49562 54668 56108 52681 54729
18450E4729N238K782L442O303L941K62M111M387L365Q924J2398J2127R411J0752
$$ 54729 59967 62749 66191 72494 76435 76697 80808 85195 88560 97484 109882 122009 131420 142172
18436A42172K2065K2581J4293R055M605n649R84m89L244l227j1987l94M118R584
$$ 142172 164237 186818 201111 210166 214771 209122 210106 209617 212861 209634 197647 197253 201371 210955
18422B10955M153k479m166p224q473r711j1417j3851j7718j5033j0581K191Q107
$$ 210955 215108 212629 208463 201239 192766 183055 171638 157787 140069 125036 114455 116646 124753
18409A24753Q113O871J1620L981k833J895J530j2154j1735p375J761J138k633
$$ 124753 132866 139737 151357 155338 152505 154400 155930 143776 132041 124666 126427 127565 124932
18396A24932L882Q778N557K289n710j3988j7564j1563r625o026j4064k157k455
$$ 124932 128814 137592 143149 145438 139728 125740 108176 96613 86988 80962 66898 64741 62286
18383F2286L138j885L02L8J148k601J3720J0951K270N396J095p123q142K945K345
$$ 62286 65424 63539 63841 63879 65027 62426 76146 87097 89367 94763 95858 88735 80593 83538 85883
18368H5883J464L006R306N390j614o8O886M474P36p84O224M460J1254M657n261
$$ 85883 87347 90353 99659 105049 103435 103367 110253 114727 115463 114679 120903 125363 136617 141274 136013
18353A36013k575j071M031O183r91n491P379Q967K762N572J1288J2027O000P598
$$ 136013 133438 132367 136398 142581 141590 136099 143478 152445 155207 160779 172067 184094 190094 197692
18339A97692O383L473K381o508r35O404J2678Q314J2425J2535J2737J8013J3605
$$ 197692 204075 207548 209929 203421 202486 208890 221568 229882 242307 254842 267579 285592 299197
18326B99197J6462J3216J2578K7784L3619L3160L9524L7619L4614M2784M7103
$$ 299197 315659 328875 341453 369237 402856 436016 475540 513159 547773 590557 637660
18315F37660M0136M4309M3536M8621N1172O1461N4479N0500M9922N8478O8382
$$ 637660 677796 722105 765641 814262 865434 926895 981374 1031874 1081796 1140274 1208656
18304A208656P2311P6371Q6637R6455J07848J31747J45355J69088K06180K43466
$$ 1208656 1280967 1357338 1443975 1540430 1648278 1780025 1925380 2094468 2300648 2544114
18294B544114K66073L00840L57542M24843N43679P38731J035713J475988K114985
$$ 2544114 2810187 3111027 3468569 3893412 4437091 5175822 6211535 7687523 9802508
18285I802508L006067M182514N506719O494641O600750N734517L714025N95741
$$ 9802508 12808575 16991089 22497808 28992449 35593199 41327716 45041741 45637482
18277D5637482k348198m148945m697626l922226k042727L92179K756614M367493
$$ 45637482 43289284 39140339 34442713 30520487 28477760 28869939 31626553 35994046
18269C5994046M769649L966567J778701j428094m258611o016863o676550o279437
$$ 35994046 40763695 44730262 46508963 45080869 40822258 34805395 28128845 21849408
18261B1849408n162094l881285k805257k008517j456264j064099p91480o09208
$$ 21849408 16687314 12806029 10000772 7992255 6535991 5471892 4680412 4071204
18253D071204m76146l69566l08905k68009k17138j92293j62151j29179j26374
$$ 4071204 3595058 3225492 2916587 2648578 2431440 2239147 2076996 1947817 1821443
18244A821443j23408j11529j01813q6321p7975o5739n8215m8620l9856l8651l3267
$$ 1821443 1698035 1586506 1484693 1398372 1320397 1254658 1196443 1147823 1107967 1069316 1036049
18233A036049l5665m6426o0761n8804n1073l7269k1244j4638j2529j6032n547
$$ 1036049 1000384 953958 893197 834393 783320 746051 724807 710169 697640 681608 676061
18222F76061o643k0594k8165l4417l4708l0275m0084l5203k3077j0056K052K718
$$ 676061 669418 648824 620659 586242 551534 521259 481175 445972 422895 412839 414891 417609
18210D17609Q125J5751O577N288K025n989j0264k2527l6820l7872k9163k8130
$$ 417609 425734 441485 448062 453350 455375 449386 439122 416595 379775 341903 312740 284610
18198B84610k5510j2586j718p225r970l608j3619n769l868R34j0747r482l881
$$ 284610 259100 246514 244796 237571 227601 223993 210374 204605 200737 201671 190924 181442 177561
18185A77561k955K702p796o973M301J551k653l992j0840n888m324J21l532k359
$$ 177561 174606 177308 169512 162539 166840 168391 165738 161746 150906 145018 140694 140815 137283 134924
18171A34924k943L724N808J844j280N71N360L54L350J8754K0300L1871M1777K9983
$$ 134924 131981 135705 141513 143357 142077 142648 148008 148362 151712 170466 190766 222637 264414 294397
18157B94397K1770K249k6572m0673l9995m0545k2890j6644j7371k368K213L21
$$ 294397 316167 318416 291844 251171 211176 170631 147741 131097 113726 111358 113571 113892
18145A13892q236k977O95P578q952q017p396n844K68K501N816J3492P050M695
$$ 113892 105656 102679 103374 110952 102000 93983 86587 80743 81011 83512 89328 102820 109870 114565
18131A14565N45P227Q517O045m395N188K1983K0989K5608L0434K6128L8870L7834
$$ 114565 115110 122337 130854 136899 132504 137692 159675 180664 206272 236706 262834 301704 339538
18118C39538L3988O5552J08403J82362K81620M50678P99775J390627K259315L709666
$$ 339538 373526 439078 547481 729843 1011463 1462141 2261916 3652543 5911858 9621524
18108I621524M146761m41986l709010l682373k351711j310828p31698m31962k75965
$$ 9621524 13768285 13326299 9617289 5934916 3583205 2272377 1540679 1108717 832752
18099H32752j74040j25788j03663p9122o6445m7771k7973k2896j3030k603p333
$$ 832752 658712 532924 429261 350139 283694 235923 207950 185054 172024 169421 162088
18088A62088r907j0585r680j7041j5085k371J317m955j0679j0352K02Q315o424
$$ 162088 152181 141596 131916 114875 99790 97419 98736 93781 83102 72750 72952 81267 74843
18075G4843j1167m725j546Q75k729m872n715p824K381M751n55m340L127o61l180
$$ 74843 63676 58951 57405 58280 55551 50679 44964 37140 39521 44272 43717 39377 42504 41843 38663
18060C8663j464m323L993L036r590r068O528K52l914O432Q546Q85q310O49J040
$$ 38663 37199 32876 36869 39905 30315 21247 27775 28027 24113 30545 39091 39976 31666 32315 33355
18045C3355j642m539K040k447j742m25L648o245p504n157N444L131J24m12k034
$$ 33355 31713 27174 29214 26767 25025 24600 28248 22003 14499 9342 14786 17917 18041 17629 15595
18030A5595M399J0919O70L91p204K910O093q404o265K839j555P010o123o717O137
$$ 15595 19994 30913 31583 31974 24770 27680 33773 25369 19104 21943 20388 27398 21275 14558 20695
18015B0695K672o332n023K803L187M304k269r67j444K380m094k183M285o44k622
$$ 20695 23367 17035 12012 14815 18002 22306 20037 19070 17626 20006 15912 13729 18014 17370 14748
18000A4748j1291j424O835P180J267k59K938o990m459M283j481m57l36M203l024
$$ 14748 3457 2033 8868 16048 17315 17056 19994 13004 8545 12828 11347 10890 10554 14757 11733
17985A1733m597j140n32l243k736M975Q374L121L413m68n314l236M482P77J818
$$ 11733 7136 5996 5464 2221 -515 4460 12834 15955 19368 18900 13586 10350 14832 15609 17427
17970A7427n219J397P043L589k806j323M964n34P86k33J502m831r721o345n286
$$ 17427 12208 13605 20648 24237 21431 20108 25072 24538 25324 25091 26593 21762 12041 5696 410
17955D10J839l58K334M892J658M252k224j440L85j774J060K478K926j357q69L379
$$ 410 2249 1891 4225 9117 10775 15027 12803 11363 11748 9974 11034 13512 16438 15081 14212 17591
17939A7591l30k174m020p510J216L137m000n162j51M300K99L276k783O03N057
$$ 17591 17261 15087 11067 3557 4773 7910 3910 -1252 -1403 2897 3196 6472 3689 4292 9349
17924I349l108M452K584p80o026k675K591j862n905j821j734j585N840l282m452
$$ 9349 6241 10693 13277 12497 6471 3796 6387 4525 -1380 -3201 -4935 -6520 -680 -3962 -8414
17909h414n81Q996L253l073q057k644O74K013k000j741M140M553M914K735m790
$$ -8414 -8995 1 3254 181 -7876 -10520 -9846 -7833 -9833 -11574 -7434 -2881 2033 4768 -22
17894b2j501L344j576k402O008PL075n56n284k99J0523J472o985n378j15o224
$$ -22 -1523 1821 245 -2157 3851 3858 6933 6377 1093 794 11317 12789 5804 426 311 -5913
17878e913l962R887M194J523m700j918j454l981j314M098J086j461L216o341l821
$$ -5913 -9875 12 4206 5729 1029 -889 -2343 -6324 -7638 -3540 -2454 -3915 -699 -7040 -10861
17863a0861L507k172p866R558P492j590j222l562k201J198j709K138M946M919
$$ -10861 -7354 -9526 -17392 -7834 -342 -1932 -3154 -6716 -8917 -7719 -9428 -7290 -2344 2575
17849B575M093Q053p421n585l461L983Q170m957k778m16L866K025K86n183r082
$$ 2575 6668 14721 7300 1715 -1746 2237 10407 5450 2672 2256 6122 8147 8433 3250 -5832
17834e832J366O265l131p213l791K653L700N180L342q75M714j007m177n197J375
$$ -5832 -4466 1799 -1332 -8545 -12336 -9683 -5983 -803 2539 1664 6378 5371 1194 -4003 -2628
17819b628m6q57M550N244o462m567M158l28j65R4Q085P944K375l889l023m636
$$ -2628 -2674 -3531 1019 6263 -199 -4766 -608 -936 -1101 -1007 7078 15022 17397 13508 10485 5849
17803E849n203k487J705k606q50l632J242O026O852j90J466K771m347o317k906
$$ 5849 646 -1841 -136 -2742 -3592 -7224 -5982 44 6896 6706 8172 10943 6596 279 -2627
17788b627P662M209m97k498q283J938Q67L781Q864j875L12o87n238k308o348n453
$$ -2627 5035 9244 8747 6249 -2034 -96 771 4552 13416 11541 11853 11166 5928 3620 -2728 -8181
17772h181L831l748l245J370K900k086N565R314k928o629M052k117L68j432L068
$$ -8181 -4350 -8098 -11343 -9973 -7073 -9159 -3594 5720 2792 -3837 215 -1902 -1534 -2966 102
17757A02R972L457j945l894j355N900L469J179L268K724n195p737q520o068l63
$$ 102 10074 13531 11586 7692 6337 12237 15706 16885 20153 22877 17682 9945 1425 -4643 -5006
17742e006L629N266O215j335N806l202j979P98k844R54K489O91o139n314M78N318
$$ -5006 -1377 3889 10104 8769 14575 11373 9394 10192 7348 8302 10791 11482 5343 29 507 5825
17726E825P79k658k536R856O892p619k602N938n915M61Q900j223j0569J078O528
$$ 5825 6604 3946 1410 11266 18158 10539 7937 13875 7960 8421 17321 16098 5529 6607 13135
17711A3135L648p469M313O474j940j175M638K429N422K748Q433R077M677N521
$$ 13135 16783 9314 13627 20101 18161 16986 21624 24053 29475 32223 40656 49733 54410 59931
17697E9931J5112K5653L5932L3541K9241K8721J3074j487j1007j0042k0130k3258
$$ 59931 75043 100696 136628 170169 199410 228131 241205 239718 228711 218669 198539 175281
17685A75281j5548P836J4705K2994K8273R902q88j1108k3747l3490k9250k7488
$$ 175281 159733 167569 182274 205268 233541 243443 242555 231447 207700 174210 144960 117472
17673A17472k2634j9321j5834j6896j2968k872m619k188R35J321l901R36j927
$$ 117472 94838 75517 59683 42787 29819 26947 22328 20140 21075 22396 18495 19431 17504
17660A7504j18k729l632j264J266M102M714k421o659m898M881R132j645k504l52
$$ 17504 17386 14657 11025 9761 11027 15129 19843 17422 10763 5865 10746 19878 18233 15729 15377
17645A5377J639M483k398o147P28K400L621L434N048K921M552J0562K5790L5815
$$ 15377 17016 21499 19101 12954 13682 16082 19703 23137 28185 31106 35658 46220 72010 107825
17631A07825M3322L7949L9835N0017O3504O4597J7258r573R354K0865j6103o0458
$$ 107825 151147 189096 228931 278948 342452 407049 424307 414734 424088 444953 428850 368392
17619C68392o3503n0905l6648m4431l9699l6414k8643j7141l234l757j653k688
$$ 368392 304889 253984 217336 172905 133206 96792 68149 51008 47774 44017 42364 39676
17607C9676p707o898q250m607n13J857J377K227j888p195K284p03M076j755n953
$$ 39676 31969 25071 16821 12214 11701 13558 14935 17162 15274 8079 10363 9660 13736 11981 6028
17592F028j208K294Q698n167p091J106o50o15k315q125r50N245M587M031k587
$$ 6028 4820 7114 15812 10645 3554 4660 4010 3395 1080 -7045 -7995 -2750 1837 5868 3281
17577C281O72P366k886k00l213q335n896m32K404k506j873n623M445O889K201
$$ 3281 3953 11319 8433 8233 5020 -3315 -9211 -9643 -7239 -9745 -11618 -17241 -12796 -5907 -3706
17562c706o520j321M422J439L358j208l801L41N586k229M189l886m092N022L070
$$ -3706 -10226 -11547 -7125 -5686 -2328 -3536 -7337 -6996 -1410 -3639 550 -3336 -7428 -2406 664
17547F64k257p281P11N237l963L249M243j744k591l110j331L86j995J916M462
$$ 664 -1593 -8874 -8163 -2926 -6889 -3640 603 -1141 -3732 -6842 -8173 -7787 -9782 -7866 -3404
17532c404M253k067k598N266l606l382R026Q2k862j579n039k263j259J843k99
$$ -3404 849 -1218 -3816 1450 -2156 -5538 3488 3570 708 -871 -5910 -8173 -9432 -7589 -7888
17517g888N110J885n758K20K574j74J681M061N431k348o047K481m122o50M927
$$ -7888 -2778 -893 -6651 -6431 -3857 -4031 -2350 1711 7142 4794 -1253 1228 -2894 -3544 1383
17502A383p041j0740M986M534q15r62p28j220k236n89j310N201J654o145R61J0144
$$ 1383 -5658 -16398 -11412 -6878 -7693 -8655 -9383 -10603 -12839 -13428 -14738 -9537 -7883 -14028 -13067 -2923
17486b923l57l912L664P669L199R2r276n739m066Q44N216M086J274O19l679k575
$$ -2923 -3280 -7192 -3528 4141 7340 7432 -1844 -7583 -11649 -10805 -5589 -1503 -229 390 -3289 -5864
17470e864K915L493l334m933l145j351M244P102M523k818Q11k157k354n319R42
$$ -5864 -2949 544 -2790 -7723 -10868 -12219 -7975 -873 3650 832 1643 -514 -2868 -8187 -7245
17455g245L536N114K117j401O667J282r243l260N684O524J910j231J1718K0103
$$ -7245 -3709 1405 3522 2121 8788 10070 827 -2433 3251 9775 11685 10454 22172 42275
17441D2275K0680n432j6303j5092p238m019o683n836J011P090K686m181q394k095
$$ 42275 62955 57523 41220 26128 18890 14871 8188 2352 3363 10453 13139 8958 564 -1531
17427a531m180O01n245l53O709N957k930q86M947J760m321K82O60k619K84L22
$$ -1531 -5711 -5110 -10355 -10708 -3999 1958 -972 -1858 3089 4849 528 810 1470 -1149 -865 -543
17411e43j145j728l004o01p066r997N203L297p42L393O75j999m566J526L155l559
$$ -543 -1688 -3416 -6420 -7021 -14087 -24084 -18881 -15584 -16326 -12933 -12258 -14257 -18823 -17297 -14142 -17701
17395a7701M266P112j470k893O256N86K43j993k149N100R856J629l405l777o378
$$ -17701 -13435 -6323 -7793 -10686 -4430 -3844 -3601 -5594 -7743 -2643 7213 8842 5437 1660 -4718
17380d718M71L497j184k988Q63j174l233J755L851Q09l444m509m243R20R759K102
$$ -4718 -4247 -750 -1934 -4922 -4059 -5233 -8466 -6711 -2860 -2051 -5495 -10004 -14247 -13327 -3568 -1466
17364a466K193n245k40J02k370L888M092o053k147M514J583L446k807j885l954
$$ -1466 727 -4518 -4758 -4656 -7026 -3138 954 -5099 -7246 -2732 -1149 2297 -510 -2395 -6349
17349f349k087J0510P912j560n809p038l370n679n12m071K903P552J0015K725
$$ -6349 -8436 2074 9986 8426 2617 -4421 -7791 -13470 -13982 -18053 -15150 -7598 2417 5142
17335E142k679p627K809L59o525J111k553L296K102o404m18J63l509j636o79M18
$$ 5142 2463 -5164 -2355 -1996 -8521 -7410 -9963 -6667 -4565 -10969 -11387 -11224 -14733 -16369 -17048 -16630
17319a6630L472Q6k914O05Q761K85o266O247N538l724M423k218K875L330J032
$$ -16630 -13158 -13072 -15986 -15381 -6620 -6335 -12601 -6354 -816 -4540 -117 -2335 540 3870 4902
17304D902r699L132K074m083m634L915j76m453k441N575N172N464K858R41m122
$$ 4902 -4797 -1665 409 -3674 -8308 -4393 -4569 -9022 -11463 -5888 -716 4748 7606 8547 4425
17289D425j0396l052K147L961k780L4J697J1089j665q441l96k299k668O079K039
$$ 4425 -5971 -9023 -6876 -2915 -5695 -5661 -3964 7125 5460 -2981 -3377 -5676 -8344 -2265 -226
17274b26Q25M908l499k409K971k34r77J329k743m69J354r732n740J980N487K670
$$ -226 599 5507 2008 -401 2570 2336 1359 2688 -55 -524 830 -8902 -14642 -12662 -7175 -4505
17258d505r240Q32O539P970O501l3k003m815l695m393R79k69N761J161N538m387
$$ -4505 -13745 -12913 -6374 1596 8097 8064 6061 1246 -2449 -6842 -5863 -6132 -371 790 6328 1941
17242A941o456k767P43K687L929K284k028j139N923M515R765O305K916l812n25
$$ 1941 -4515 -7282 -6539 -3852 77 2361 333 -806 5117 9632 19397 25702 28618 24806 24281
17227B4281k329N825M157K480P323P47p059o86O794M452M33k346K528k236l29
$$ 24281 21952 27777 31934 34414 41737 42484 35425 34739 41533 45985 46418 44072 46600 44364 44035
17212D4035j974p849q068J402M32j18n279n941j514j650o691l649K200N73K221
$$ 44035 42061 34212 26144 27546 27978 27860 22581 16640 15126 13476 6785 3136 5336 5909 8130
17197H130j239m769M746K113n045K231k533k016K156J051k767p456L572J0780
$$ 8130 6891 2122 6868 8981 3936 6167 3634 1618 3774 4825 2058 -5398 -1826 8954
17183H954K595k393o319p327j149m193M868k859J995K170k53M305J256M46K283
$$ 8954 11549 9156 2837 -4490 -5639 -9832 -4964 -7823 -5828 -3658 -3911 394 1650 2096 4379
17168D379k397j319m081o778k512P325O029M92p972n555n549Q88L421N083J1494
$$ 4379 1982 663 -3418 -10196 -12708 -5383 646 1138 -6834 -12389 -17938 -17050 -13629 -8546 2948
17153B948J0163m671j9788j3669l607J6525K1997J265j0056k749n302j042M125
$$ 2948 13111 8440 -11348 -25017 -28624 -12099 9898 11163 1107 -1642 -6944 -7986 -3861
17140c861L157j69j178O16J83j13j444p79k325r51p99K000N024M24o163N52L398
$$ -3861 -704 -873 -2051 -1435 -1252 -1365 -2809 -3588 -5913 -6864 -7663 -5663 -639 -215 -6378 -5826 -2428
17123b428M71l708o208k050O70L004N17j518K761l05l40K357l437j52L283l113
$$ -2428 -1957 -5665 -11873 -13923 -13253 -10249 -9732 -11250 -8489 -8794 -9134 -6777 -10214 -10366 -7083 -10196
17107a0196j149N187o92J236J040K436M80n088k011l171j533Q666K843l184q754
$$ -10196 -11345 -6158 -6850 -5614 -4574 -2138 -1658 -6746 -8757 -11928 -13461 -4795 -1952 -5136 -13890
17092a3890K539M830J051N966l07k205l811J783n335J469p36L605L950J539L903
$$ -13890 -11351 -6521 -5470 496 189 -2016 -5827 -4044 -9379 -7910 -8646 -5041 -1091 448 4351
17077D351m421o010k928R609M000n432n749n247o349P061M981L900J507J104j143
$$ 4351 -70 -6080 -9008 601 4601 -831 -6580 -11827 -18176 -11115 -6134 -2234 -727 377 -766
17062g66L648m003j402N221N215r92m170k542n700R16M32J916J027M551L001p538
$$ -766 2882 -1121 -2523 2698 7913 6921 2751 209 -5491 -4575 -4143 -2227 -1200 3351 6352 -1186
17046a186m354k091L235R804K908q956l10M876n27o885M315J0163K594o266n914
$$ -1186 -5540 -7631 -4396 5408 8316 -640 -950 3926 3399 -3486 829 10992 13586 7320 1406
17031A406k046k343L026l444N497k391r042l491P645Q690M344k234k276p759L92
$$ 1406 -640 -2983 43 -3401 2096 -295 -9337 -12828 -5183 3507 7851 5617 3341 -4418 -4026
17016d026j709l690k347L49R29j432K351M030O097K922J452q14o6M017L463L117
$$ -4026 -5735 -9425 -11772 -11423 -10494 -11926 -9575 -5545 552 3474 4926 4112 4046 8063 11526 14643
17000A4643j968l581q191p436Q38O2n06n753L574M972l819j539N47L909R59J875
$$ 14643 12675 9094 903 -6533 -5695 -5633 -6139 -11892 -8318 -3346 -7165 -8704 -8157 -4248 -3289 -1414
16984a414j73L161n51j064r30j1518Q87o808l215J306L528M289J541P273K068
$$ -1414 -1587 1574 1023 -41 -971 -12489 -11602 -18410 -21625 -20319 -16791 -12502 -10961 -3688 -1620
16969a620j347M987J037q547R08Nj366j39j533m204l240P436M206J781M240K246
$$ -1620 -2967 2020 3057 -5490 -4582 -4577 -5943 -6082 -7615 -11819 -15059 -7623 -3417 -1636 2604 4850
16953D850m118l163o757k603j130M252J442k937k712N869M477N98o155L2J362
$$ 4850 732 -2431 -9188 -11791 -12921 -8669 -7227 -10164 -12876 -7007 -2530 -1932 -8087 -8055 -6693
16938f693M560j526l736J148Q07L265P921J505j398r611n535N232P79R82J825
$$ -6693 -2133 -3659 -7395 -6247 -5440 -2175 5746 7251 5853 -3758 -9293 -4061 -3282 -2300 -475
16923d75o884o799n26O150L981K234Q32K250l084k327K490j995o585k564j619
$$ -475 -7359 -14158 -14684 -8534 -4553 -2319 -1487 763 -2321 -4648 -2158 -4153 -10738 -13302 -14921
16908a4921L205P182n98l652Q37M500k584n391L672O948Q634k660M31M923k2k958
$$ -14921 -11716 -4534 -5132 -8784 -7947 -3447 -6031 -11422 -7750 -802 7832 5172 5603 10526 10504 7546
16892G546q142K594K777m017K87o593n313o52P317L913K129R98L51J506m218j585
$$ 7546 -596 1998 4775 758 1045 -5548 -10861 -11513 -4196 -283 1846 2844 3195 4701 483 -1102
16876a102L806o755j009L359J608k037L760N702O220k063p882K000R941J0152
$$ -1102 2704 -4051 -5060 -1701 -93 -2130 1630 7332 13552 11489 3607 5607 15548 25700
16862B5700O006M746O716J2038J8400K5354L1662L7858L5294K9559K5019J7673
$$ 25700 31706 36452 43168 55206 73606 98960 130622 168480 203774 233333 258352 276025
16850B76025j6349j6122j4829k9867j5921k496J1646J4335J8524K0707J5832r341
$$ 276025 259676 243554 228725 198858 182937 180441 192087 206422 224946 245653 261485 252144
16838B52144k3925k1274k0425k2030l4838l0931k5164k5949j9018l210J84o064
$$ 252144 228219 206945 186520 164490 129652 98721 73557 47608 28590 25380 25564 19500
16826A9500m024O86K91K791L203O34O9n315m578l988o895L946M681M513m371l504
$$ 19500 15476 16162 16453 19244 22447 23081 23150 17835 13257 9269 2374 6320 11001 15514 11143 7639
16810G639q133k468J3600Q967l603o738o337m691m42l358L539Q31j682l140k168
$$ 7639 -494 -2962 10638 19605 16002 9264 2927 -1764 -2206 -5564 -2025 -1194 -2876 -6016 -8184
16795h184K093J0409J1207J99j935j1993l890M554Q403M693k105Q07n002o978
$$ -8184 -6091 4318 15525 15724 13789 1796 -2094 2460 10863 15556 13451 14258 9256 2278
16781B278l963P140N695R017q005p835K091J234l92J88l194M84p592o078L271
$$ 2278 -1685 5455 11150 20167 12162 4327 6418 7652 7260 7448 4254 4738 -2854 -8932 -5661
16766e661P594J238O836m843r556L236M224m665l807J514O19M751J200q461l9
$$ -5661 1933 3171 10007 5164 -4392 -1156 3068 -1597 -5404 -3890 -3271 1480 2680 -5781 -5820
16751e820m99J745N032p99K139O78J599P06J660Q59L828L437K407m149n217k485
$$ -5820 -6319 -4574 458 -341 1798 2476 4075 4781 6441 7300 11128 14565 16972 12823 7606 5121
16735E121j70P862n114n398n92j736p527j355L572Q387Q011L086q597n434k814
$$ 5121 4951 12813 7699 2301 1709 -27 -7554 -8909 -5337 3050 11061 14147 5550 116 -2698
16720b698m896J928L706r16n831L944M885R629J095j675j441L312L146l769q549
$$ -2698 -7594 -5666 -1960 -2876 -8707 -4763 122 9751 10846 9171 7730 11042 14188 10419 1870
16705A870j2397j226K704k272O781O438j510j236K289k65M446O976K155m490l139
$$ 1870 -10527 -11753 -9049 -11321 -4540 1898 388 -848 1441 1176 5622 12598 14753 10263 7124
16690G124j903l411R951n30k147L60p808o613o95m52M317j98L213M708J300J278
$$ 7124 5221 1810 11761 11231 9084 9444 1636 -4977 -5672 -6124 -1807 -2005 1208 5916 7216 8494
16674H494j298P621Q319l937j1535q384k170j411N506K212o854k312N576j635
$$ 8494 7196 14817 23136 19199 7664 -720 -2890 -4301 1205 3417 -3437 -5749 -173 -1808
16660a808L301N286J956k855J713L564L752L725M80M360k690q442o603m782L239
$$ -1808 1493 6779 8735 5880 7593 11157 14909 18634 19114 23474 20784 12342 5739 957 4196
16645D196p335l43k808m251K961Q606L042J36M649M684q29o618l939q3n385j114
$$ 4196 -3139 -3482 -6290 -10541 -7580 1026 4068 4204 8853 13537 12708 6090 2151 2068 -3317 -4431
16629d431N596N197J373j314K98L272j210P64j980l572J837o13l109o089j070
$$ -4431 1165 6362 7735 6421 6719 9991 8781 9545 7565 3993 5830 5217 2108 -3981 -5051
16614e051J2029J4380J107k469j562r446o906j0445k469j173K750J1273J4090
$$ -5051 6978 21358 22465 19996 18434 8988 2082 -8363 -10832 -12005 -9255 2018 16108
16601A6108M433Q271K502j0436j2373k093o220j0668K473L190N150K176J406P970
$$ 16108 20541 28812 31314 20878 8505 6412 192 -10476 -8003 -4813 337 2513 3919 11889
16587A1889Q011O582K980p630n837K892j442k926L2j125j535J514j920k507k401
$$ 11889 19900 26482 29462 21832 15995 18887 17445 14519 14551 13426 11891 13405 11485 8978 6577
16572F577p64j797O216n352k915O852P914k317q55m78N615P837j177k163J765
$$ 6577 5813 4016 10232 4880 1965 8817 16731 14414 13559 13081 18696 26533 25356 23193 24958
16557B4958Q34N690Q383K901p696r15O849N521P409p33l7J536k708o108j1557
$$ 24958 25792 31482 39865 42766 35070 34155 41004 46525 53934 53201 53164 54700 51992 45884 34327
16542C4327L285k975r507k301Q350K104l085j575j948n430l665O58l278L341J725
$$ 34327 37612 34637 25130 22829 31179 33283 30198 28623 26675 21245 17580 18238 14960 18301 20026
16527B0026j739k98O713L135j3019M47M875k232p4R121L613L33l394m215n31l254
$$ 20026 18287 17989 24702 27837 14818 15265 20140 17908 17834 26955 30568 30901 27507 23292 22761 19507
16511A9507Q55k22J535j418J596n821L96M685N675J624m206k41J786k691l117
$$ 19507 20362 20140 21675 20257 21853 16032 16428 21113 26788 28412 24206 23965 25751 23060 19943
16496A9943J621J297O45n50K559p91m455k26L774k158o759J824J0716P290P02
$$ 19943 21564 22861 23506 22956 25515 24724 20269 20043 23817 21659 14900 16724 27440 34730 35432
16481C5432l759k51k298l785n813J836O780Q527P488N118R215Q913J3088J6745
$$ 35432 31673 31422 29124 25339 19526 21362 28142 36669 44157 49275 58490 67403 80491 97236
16467I7236K0098L5297L3902J0714j3869k3978k0205j5957r166K573J2607J4275
$$ 97236 117334 152631 186533 197247 183378 159400 139195 123238 114072 116645 129252 143527
16455A43527K3128L8192N0131L1992P667k2953m6706m6707l2912k5813j9124p14
$$ 143527 166655 204847 254978 286970 294637 271684 224978 178271 145359 119546 100422 99708
16443I9708M405M784P433K7695K5035Q673r514k3436k1595o021M57j3027J508
$$ 99708 104113 108897 116330 144025 169060 177733 168219 144783 123188 117167 117624 104597 106105
16430A06105Q127Q236j279K436k765n135j6773j8695l416Q882J3567K432O049
$$ 106105 114232 122468 121189 123625 120860 115725 98952 80257 76841 85723 99290 101722 107771
16417A07771R49k033j2457j0006j1608j7229j2980k431L653j1620k187O288J391
$$ 107771 108720 106687 94230 84224 72616 55387 42407 39976 43629 32009 29822 36110 37501
16404C7501j821k890p851K530N00L752R490K400O82j581j721l533J831M221O86
$$ 37501 35680 32790 24939 27469 27969 31721 41211 43611 44293 42712 40991 37458 39289 43510 44196
16389D4196j229Q890P580N529l382k371J644l743o383j965J1008M64o03O021N770
$$ 44196 42967 51857 59437 64966 61584 59213 60857 57114 50731 48766 59774 60238 59635 65656 71426
16374G1426j274j279r94n8N204P437n42K772O290N733K95N563N876O18j214L780
$$ 71426 70152 68873 67879 67821 73025 80462 79920 82692 88982 94715 95010 100573 106449 107067 105853 109633
16358A09633M943M224L144Q040J2774J1490N273L368Q319M563Q145J0085P498
$$ 109633 114576 118800 121944 129984 142758 154248 159521 162889 171208 175771 183916 194001 201499
16345B01499Q545R660J1287J0658J0383J7484J8645K2070J7887J7777K7645L1246
$$ 201499 210044 219704 230991 241649 252032 269516 288161 310231 328118 345895 373540 404786
16333D04786M4552N5707O7589P8264O5914O8446Q0465P2227N5890O4507R1096
$$ 404786 449338 505045 572634 650898 716812 785258 865723 937950 993840 1058347 1149443
16322A149443J14688J32503J65026J99673K20032K19931K44587L06226L86677
$$ 1149443 1264131 1396634 1561660 1761333 1981365 2201296 2445883 2752109 3138786
16313C138786N07463P33085J136829J794768K785425M201378O038818P121789
$$ 3138786 3646249 4379334 5516163 7310931 10096356 14297734 20336552 27458341
16305B7458341O040604N195819O170956M557922j240979m410207l787208l418548
$$ 27458341 33498945 38694764 44865720 49423642 48182663 43772456 39985248 36566700
16297C6566700l669351k043117J200772L458488L251317L489715M806111K335690
$$ 36566700 32897349 30854232 32055004 35513492 38764809 42254524 47060635 49396325
16289D9396325l367488n693009n180005n747233o763238o222273m644527l121295
$$ 49396325 46028837 40335828 35155823 29408590 22645352 16423079 11778552 8657257
16281H657257k060810j388937r61926o74351m84345l56930k51968k01080j72946
$$ 8657257 6596447 5207510 4245584 3571233 3086888 2729958 2477990 2276910 2103964
16272B103964j52224j45229j40983j47176j24074j04395r2746q4585n6770m3916
$$ 2103964 1951740 1806511 1665528 1518352 1394278 1289883 1197137 1112552 1055782 1011866
16262A011866o8417o8765p0654o7997o8275o6309n6436m2765l0926k3399k0619
$$ 1011866 943449 874684 804030 736033 667758 601449 545013 502248 471322 447923 427304
16251D27304k3635j5707j4709j1143j8183k0269j9920j7168j6734n141p641j4031
$$ 427304 403669 387962 373253 362110 343927 323658 303738 286570 269836 264695 257054 243023
16239B43023j1321j1874j3973n349n95l985o858k58q96p525j2890j0955l618k123
$$ 243023 231702 219828 205855 200506 199911 195926 189068 188810 187914 180389 167499 156544 152926 150803
16225A50803o240j380l893M175J276p122j0946n809K497o788l838l101J952K916
$$ 150803 144563 143183 139290 143465 144741 137619 126673 120864 123361 116573 112735 109634 111586 114502
16211A14502q62k952k364j6236j3565j705n46O51J960R284M139P62m189o004l623
$$ 114502 113640 110688 108324 92088 78523 76818 76272 76923 78883 88167 92306 93068 88879 82875 79252
16196G9252m80j045J533o019J453M376j940j994J1167R82m055M962j594l535K996
$$ 79252 78772 77727 79260 73241 74694 79070 77130 75136 86303 87285 83230 88192 86598 83063 86059
16181H6059N368J065n666o057o922j2139m786M544m715j951J123k797m350R68
$$ 86059 91427 92492 86826 80769 73847 61708 56922 61466 56751 54800 55923 53126 48776 49744
16167D9744L06j735l498J127j0172o774l509j083j501j540K645O313M716m540
$$ 49744 50050 48315 44817 45944 35772 28998 25489 24406 22905 21365 24010 30323 35039 30499
16153C0499o717K40J743k332j2925O59O492Q773K425k27l461n770j164m836k257
$$ 30499 23782 24022 25765 23433 10508 11167 17659 26432 28857 28630 25169 19399 18235 13399 11142
16138A1142q443k377j546q761k887q67P386N523o222k856L370J869R894R413J767
$$ 11142 2699 322 -1224 -9985 -12872 -13739 -6353 -830 -7052 -9908 -6538 -4669 5225 14638 16405
16123A6405K715J760k654J152j301m615o323l612M886o92m316L028L493K807l484
$$ 16405 19120 20880 18226 19378 18077 13462 7139 3527 8413 7721 3405 6433 9926 12733 9249
16108I249l57K952k45L055j027j529n478n679N6j167k193j488K983l1j016J949
$$ 9249 8892 11844 11599 14654 13627 12098 6620 941 997 -170 -2363 -3851 -868 -899 -1915 34
16092C4l473k788J0151P04J6j506K69j023M001l65k46n39L500N93m250j614n662
$$ 34 -3439 -6227 3924 4628 4644 3138 3407 2384 6385 6020 5774 5235 8735 9328 5078 3464 -2198
16075b198k557M959K454p33k675J352J125m355O49M063K080N019L594k730j204
$$ -2198 -4755 204 2658 1925 -750 602 1727 -2628 -1979 2084 4164 9183 12777 10047 8843
16060H843L04l729O237M77j273P29n491r209l102L535J0727L463K408k328l447
$$ 8843 9147 5418 11655 12132 10859 11588 6097 -3112 -6214 -2679 8048 11511 13919 11591 8144
16045H144m62M555m098O278K244j132j0940j1028M687J8444R343o925j480n061
$$ 8144 7682 12237 8139 14417 16661 15529 4589 -6439 -1752 16692 26035 19110 17630 12569
16031A2569r618k854M273L630K723K384m084l859l961m695j690K532j254p773
$$ 12569 2951 97 4370 8000 10723 13107 9023 5164 1203 -3492 -5182 -2650 -3904 -11677
16017a1677K739L038j407j568M284M955N0n298m138j651O220k941j962J1332Q675
$$ -11677 -8938 -5900 -7307 -8875 -4591 364 414 -4884 -9022 -10673 -4453 -7394 -9356 1976 10651
16002A0651L895O97o58j525J420J126M227m188n621O833O92k166p54P576Q337
$$ 10651 14546 15243 14585 13060 14480 15606 19833 15645 10024 16857 17549 15383 14629 22205 30542
15987C0542J567k246r212m068K407m748j138j1165o184k63N949P213p60j0273
$$ 30542 32109 29863 20651 16583 18990 14242 13104 1939 -4245 -4508 1441 8654 7894 -2379
15973b379L52P37M036M644J009N84K312m889j0892K250M707n167j965m033K237
$$ -2379 -2027 -1290 2746 7390 8399 8983 11295 6406 -4486 -2236 2471 -2696 -4661 -8694 -6457
15958f457k82k790N84j714R820J430n956L003P754L813n368p505P53N510n199
$$ -6457 -6739 -9529 -8945 -10659 -839 591 -5365 -2362 5392 9205 3837 -3668 -2915 2595 -2604
15943b604l797K081P6p783L837R264K842j278j276m422n0k092L431K456n529k368
$$ -2604 -6401 -4320 -4244 -12027 -8190 1074 3916 2638 1362 -3060 -3110 -5202 -1771 685 -4844 -7212
15927g212j602l384k75Q623q89l47K972n098n269J707O195r33n68K106l056m68
$$ -7212 -8814 -12198 -12473 -3850 -4739 -5086 -2114 -7212 -12481 -10774 -4579 -5512 -6080 -3974 -7030 -7498
15911g498N268k63O73j251n940j188J602P357L843M91l23o426l640Q404M293j558
$$ -7498 -2230 -2493 -1820 -3071 -9011 -10199 -8597 -1240 2603 3094 2771 -3655 -7295 1109 5402 3844
15895C844K817K064O422J594r884K47R085k699m056l741K808j471n028K091N94
$$ 3844 6661 8725 15147 16741 6857 7104 16189 13490 9434 5693 8501 7030 2002 4093 4687
15880D687o190m285L301O836L660m246r189p520N319N383L74j531J344l081j480
$$ 4687 -1503 -5788 -2487 4349 8009 3763 -5426 -12946 -7627 -2244 -1870 -3401 -2057 -5138 -6618
15865f618m208q70N124K554L973N767L438j1778j546L147J690J622o469m881K083
$$ -6618 -10826 -11696 -6572 -4018 -45 5722 9160 -2618 -4164 -1017 673 2295 -4174 -9055 -6972
15850f972K375j48P25J128J250L740L840m307o189j841J368J52o52L30j044j635
$$ -6972 -4597 -4745 -4020 -2892 -1642 2098 5938 1631 -4558 -6399 -5031 -4879 -5531 -5201 -6245 -7880
15834g880k125N19K837l414k165j385q380J362O395N902J788R86P117k224L82
$$ -7880 -10005 -9486 -6649 -10063 -12228 -13613 -21993 -20631 -14236 -8334 -6546 -5560 1557 -667 -285
15819b85m260k06k284p759n288P245O035J2J222K026K392J958k157l754n574N164
$$ -285 -4545 -4751 -7035 -14794 -20082 -12837 -6802 -6790 -5568 -3542 -1150 808 -1349 -5103 -10677 -5513
15803e513K403l944M809L337m052M464O592j094l030J035K822N95k999l859m36
$$ -5513 -3110 -7054 -2245 1092 -2960 1504 8096 7002 3972 5007 7829 8424 5425 1566 1130
15788A130M00J11L027n84j1020L624Q003k419j519k376J682J444N962j51o559
$$ 1130 1530 1641 4668 4084 -6936 -3312 4691 2272 753 -1623 59 1503 7465 7314 755
15773G55O295L031p674k710n205m931L248K752q75q43j579Q868L860J1495O702
$$ 755 7050 10081 2407 -303 -5508 -10439 -7191 -4439 -5314 -6157 -7736 1132 4992 16487 23189
15758B3189P4p787J929N609M591J8681J7817K8102L9599L7438L4756L0597K5975
$$ 23189 23263 15476 17405 23014 27605 46286 64103 92205 131804 169242 203998 234595 260570
15745B60570L771k0325k7672k2411j0441k884m610J4091K2821K3079J7984R184
$$ 260570 264341 244016 216344 193933 183492 180608 175998 190089 212910 235989 253973 263157
15733B63157j3601k7414k5107k8410l6040l4852l5283k3779k575j279p502k512
$$ 263157 249556 222142 197035 168625 132585 97733 62450 38671 36096 34817 27315 24803
15721B4803q993m603o346O61L005k936k861l992k643j880O184J980P95j962P915
$$ 24803 15810 11207 4861 5522 8527 5591 2730 -1262 -3905 -5785 399 2379 3174 1212 9127
15706I127j095q259k767k675m223P281O158M359m139l937K727k471n791o520j175
$$ 9127 8032 -227 -2994 -5669 -9892 -2611 3547 7906 3767 -170 2557 86 -5705 -12225 -13400
15691a3400N608P818M724k529l939l922M357P17k41Q599Q38l151L054l937k061
$$ -13400 -7792 26 4750 2221 -1718 -5640 -1283 -566 -807 7792 8630 5479 8533 4596 2535
15676B535o079m24L330k007p46J1048m79k823J171M628q46j1716K234Q716m273
$$ 2535 -3544 -3968 -638 -2645 -3391 7657 7178 4355 5526 10154 9308 -2408 -174 8542 4269
15661D269n157j952k773K428J888m528N261Q090L83l742n319m566k402l59M60
$$ 4269 -888 -2840 -5613 -3185 -1297 -5825 -564 7526 7909 4167 -1152 -5718 -8120 -8479 -8019
15646h019J409J245Q002l95n139K588r397m945K829J1164M483j0906j0710K775
$$ -8019 -6610 -5365 2637 2242 -2897 -309 -9706 -14651 -11822 -658 3825 -7081 -17791 -15016
15632a5016J0574M091m77O950K365n889n565n131j836L065Q864J155R03K091r04
$$ -15016 -4442 -351 -828 6122 8487 2598 -2967 -8098 -9934 -6869 1995 3150 4053 6144 5240
15617E240k856n559J554M466n854l604O83j500n807L390L276J0623L851J22K23
$$ 5240 2384 -3175 -1621 2845 -3009 -6613 -5930 -7430 -13237 -9847 -6571 4052 7903 8025 8248
15602H248l629n018l778j988N726n391j252M950M756n080j686L734L650k329n871
$$ 8248 4619 -399 -4177 -6165 -439 -5830 -7082 -2132 2624 -2456 -4142 -408 3242 913 -4958
15587d958K615M905L794n257k617J190k968k663K31L985j844j985n020J008M128
$$ -4958 -2343 2562 6356 1099 -1518 -328 -3296 -5959 -5728 -1743 -3587 -5572 -10592 -9584 -5456
15572e456K509M550k022r006k331P498l25l00k389j201K725L14J26J802Q251n224
$$ -5456 -2947 1603 -419 -9425 -11756 -4258 -4583 -4883 -7272 -8473 -5748 -5434 -5308 -3506 4745 -479
15556d79k579L829m457K726N656L496l798o81k001k967K478q05n340j048N670
$$ -479 -3058 771 -3686 -960 4696 8192 4394 3713 1712 -1255 1223 418 -4922 -5970 -300
15541c00O4O88n138l644M308L1o84O315k557K858P691j174k952Q89n59o035o645
$$ -300 -236 452 -4686 -8330 -4022 -3991 -4675 1640 -917 1941 9632 8458 5506 6395 5836 -199 -6844
15524f844N771P667L65m43J263J297k122o69L480m56n125n76Q63k674j061j862
$$ -6844 -1073 6594 6959 6516 7779 9076 6954 6285 9765 9309 4184 3608 4471 1797 736 -1126
15508a126k319n365L671O272L90m211N585K578j663o299l271O250k109l84k854
$$ -1126 -3445 -8810 -5139 1133 1523 -2688 2897 5475 3812 -2487 -5758 492 -1617 -2001 -4855
15493d855J379K310N15J796m524L584K26k26M7L059P711l526o614l855j390L420
$$ -4855 -3476 -1166 -651 1145 -3379 205 431 205 252 3311 11022 7496 882 -2973 -4363 -943
15477i43K643k426l381m705rJ061J007J046j393k828j760n646L715Q355n49r68
$$ -943 1700 -726 -4107 -8812 -8821 -7760 -6753 -5707 -7100 -9928 -11688 -17334 -13619 -5264 -5813 -6781
15461f781L977Q140l107k171n812q899N65M860L422R55j101K455n24L377l030
$$ -6781 -2804 5336 2229 58 -5754 -14653 -14088 -9228 -5806 -4851 -5952 -3497 -4021 -644 -3674
15446c674j135n38m10l471k648k66J638l75j561P61J30K003L365M369J737k28
$$ -3674 -4809 -5347 -5757 -9228 -11876 -12142 -10504 -10879 -12440 -11679 -11549 -9546 -6181 -1812 -75 -303
15430c03k07k292m393J309L183Q58M288R93p610l337M970O880n286j6501o094
$$ -303 -510 -2802 -7195 -5886 -2703 -1845 2443 3436 -4174 -7511 -2541 4339 -947 -17448 -23542
15415b3542O515L536k794L929R919l36l666l047l376N649P133K045r38L44o323
$$ -23542 -17027 -13491 -16285 -12356 -2437 -2773 -6439 -9486 -12862 -7213 -80 1965 1027 1371 -4952
15400d952r660M151O040N33n005K49m768j399L868K480N79O40R69K26j766l794
$$ -4952 -14612 -10461 -4421 -3888 -8893 -8644 -13412 -14811 -10943 -8463 -7884 -7244 -6275 -6049 -7815 -11609
15384a1609k988o986m202N452J567m126p17R124K294J2386J498p476n196k84K0
$$ -11609 -14597 -21583 -25785 -20333 -18766 -22892 -23609 -14485 -12191 195 1693 -5783 -10979 -11263 -11243
15369a1243l102J104Q82J124j160n051K188N152J890m133l767k016j789O388m3
$$ -11243 -14345 -13241 -12359 -11235 -12395 -17446 -15258 -10106 -8216 -12349 -16116 -18132 -19921 -13533 -13576
15354a3576L798p963K46R46O401K975j36K441j1601K232M173M049n006m689M894
$$ -13576 -9778 -17741 -17495 -16549 -10148 -7173 -7309 -4868 -16469 -14237 -10064 -6015 -11021 -15710 -10816
15339a0816P18j0966k168N001O962O967N22p23j131l806J085j195l998j44J1431
$$ -10816 -10098 -21064 -23232 -18231 -11269 -4302 -3780 -4503 -5634 -9440 -8355 -9550 -13548 -13692 -2261
15324b261j904o486K693M654J0380M593p785j902o18m222l361K575m418n222p14
$$ -2261 -4165 -10651 -7958 -3304 7076 11669 3884 1982 1364 -2858 -6219 -3644 -8062 -13284 -13998
15309a3998K66K403L694J886n989l002P026J0590L196k700r308n144O290K347
$$ -13998 -13732 -11329 -7635 -5749 -11738 -14740 -7714 2876 6072 3372 -5936 -11080 -4790 -2443
15295b443R40m221o542M111L385k640p15j936j026N829Q734j458l462j213J038
$$ -2443 -1503 -5724 -12266 -8155 -4770 -7410 -8125 -10061 -11087 -5258 3476 2018 -1444 -2657 -1619
15280a619k179N262K608J214j755m613J903N057l071M623k040p983k07K259N98
$$ -1619 -3798 1464 4072 5286 3531 -1082 821 5878 2807 7430 5390 -2593 -2800 -541 57
15265E7K509L454m731m524J185K948m17K154ll512j4140o457J799O030L183L947
$$ 57 2566 6020 1289 -3235 -2050 898 481 2635 2632 -880 -15020 -21477 -19678 -13648 -10465 -6518
15249f518O951J940p351n88k741K660M405R69O9m171p3Q720m975L66j049p446
$$ -6518 433 2373 -4978 -5566 -8307 -5647 -1242 -273 -204 -4375 -4448 4272 -703 -337 -1386 -8832
15233h832l634k625M617Q92o214M165N55j381k532L196R52K256M536j786k473
$$ -8832 -12466 -15091 -10474 -9582 -15796 -11631 -11076 -12457 -14989 -11793 -10841 -8585 -4049 -5835 -8308
15218h308J977N783O64j395n673k100l66k202k131J981j95n251R42J258M297J1751
$$ -8308 -6331 -548 116 -1279 -6952 -9052 -9418 -11620 -13751 -11770 -11965 -17216 -16274 -15016 -10719 1032
15202A032P26M66P07o604p333n141p08J349M292M070P457Q58k383J726K153L259
$$ 1032 1758 2224 2931 -3673 -11006 -16147 -16855 -15506 -11214 -7144 313 1171 -1212 514 2667 5926
15186E926l274m865j959j444K996O190j398k268R12o85n97l060l748J212j771
$$ 5926 2652 -2213 -4172 -5616 -2620 3570 2172 -96 816 131 -466 -3526 -7274 -6062 -7833
15171g833j607L67k95L450K319j535M472K208M63R36L749m359n737J210O93j546
$$ -7833 -9440 -9073 -9368 -5918 -3599 -5134 -662 1546 2009 2945 6694 2335 -3402 -2192 -1499 -3045
15155c045p267J166L566K452l27j944n666l724k91J314K13o245k825P650J3237
$$ -3045 -10312 -9146 -5580 -3128 -3455 -5399 -11065 -14789 -15080 -13766 -13553 -19798 -22623 -14973 -1736
15140a736N653l83J865j236l340m232L209o95L443J591L558j370j1440n821r59
$$ -1736 3917 3534 5399 4163 823 -3409 -200 -895 2548 4139 7697 6327 -5113 -10934 -11893
15125a1893L351J937n371k968J928J450o08M22J722L696O281J043n849N77K52
$$ -11893 -8542 -6605 -11976 -14944 -13016 -11566 -12174 -11752 -10030 -6334 -53 990 -4859 -4282 -4030
15110d030j25M062k876j185l023J433n014p05R621L321k224n118l750J434k418
$$ -4030 -4155 -93 -2969 -4154 -7177 -5744 -10758 -11463 -1842 1479 -745 -5863 -9613 -8179 -10597
15095a0597N178N284L162J512l647J408K17l003J002p27j327n574M550l105p312
$$ -10597 -5419 -135 3027 4539 892 2300 2517 -486 516 -211 -1538 -7112 -2562 -5667 -12979
15080a2979n313K760P580J785L621J159J402l154q71K956K312k44J36j041k932
$$ -12979 -18292 -15532 -7952 -6167 -2546 -1387 15 -3139 -4010 -1054 1258 1014 1150 109 -2823
15065b823J431P848j84l787l204l787q1O012Q49j498L390k830l350K878k163j912
$$ -2823 -1392 6456 6272 2485 -719 -4506 -4587 1425 2274 776 4166 1336 -2014 864 -1299 -3211
15049c211q71o802n499n733j717O057L968M265K284n481j531J487J391P726N693
$$ -3211 -4082 -10884 -16383 -22116 -23833 -17776 -13808 -9543 -7259 -12740 -14271 -12784 -11393 -3667 2026
15034B026j408m646j004K658k972j369p191O41L545k576K467L893k111l420l50
$$ 2026 618 -4028 -5032 -2374 -5346 -6715 -13906 -13265 -9720 -12296 -9829 -5936 -8047 -11467 -11817
15019a1817j220O782Q842K147o323q539j844k244k258M812K745L195l394Q83j427
$$ -11817 -13037 -6255 2587 4734 -1589 -10128 -11972 -14216 -16474 -11662 -8917 -5722 -9116 -8233 -9660
15004i660M75N771l669p61M802l56j830J04k465J68o026K237Q009P180K166j928
$$ -9660 -9185 -3414 -7083 -7844 -3042 -3398 -5228 -5124 -7589 -7421 -13447 -11210 -3201 3979 6145 4217
14988D217o896j548K51k216k679j978k961R2M835N228l243J057P687l048j0254
$$ 4217 -2679 -4227 -3976 -6192 -8871 -10849 -13810 -13718 -8883 -3655 -6898 -5841 1846 -1202 -11456
14973a1456r16J093o41M584L283l62m495m308k245Q279K232J590J054O34j021
$$ -11456 -12372 -11279 -11920 -7336 -4053 -4415 -8910 -13218 -15463 -7184 -4952 -3362 -2308 -1674 -2695
14958b695K201L924o90Q55j512j651k949l22l519N720j41m640n224M27N508J0366
$$ -2695 -494 3430 2740 3595 2083 432 -2517 -2839 -6358 -638 -779 -5419 -10643 -10216 -4708 5658
14942E658K462m850o815k181M742M715M829p651m858k493N067L419o351Q45k796
$$ 5658 8120 3270 -3545 -5726 -984 3731 8560 909 -3949 -6442 -1375 2044 -4307 -3462 -6258
14927f258J368q322j4788J8442M2365L1090j2630m1431k3102n496j72L438M608
$$ -6258 -4890 -13212 -28000 -9558 32807 63897 51267 9836 -13266 -18762 -18934 -15496 -10888
14914a0888M67N230m93P86K16l839J606N64m138J041J501j687l106M10M218K776
$$ -10888 -10421 -5191 -5684 -4898 -4682 -8521 -6915 -6351 -10489 -9448 -7947 -9634 -12740 -12330 -8112 -5336
14898e336Q760O017j459k935q370l594j02o22q819k096P680O271J56K783N575
$$ -5336 3424 9441 7982 5047 -3323 -6917 -7019 -7641 -16460 -18556 -10876 -4605 -4449 -1666 3909
14883C909L99p495l256j273l917L687Q798k105l596l029K92M814m860j600M939
$$ 3909 4308 -3187 -6443 -7716 -11633 -7946 852 -1253 -4849 -7878 -7586 -2772 -7632 -9232 -4293
14868d293N298J261j651k518k938n841L291J443K531j79l010M233J417M43k469
$$ -4293 1005 2266 615 -1903 -4841 -10682 -7391 -5948 -3417 -3596 -6606 -2373 -956 -513 -2982
14853b982n955m097J808K510l588L201O999k965L457J0630j652j239j907k928
$$ -2982 -8937 -13034 -11226 -8716 -12304 -9103 -2104 -5069 -1612 9018 7366 6127 4220 1292
14839A292J269n12l189k591k391j894l920p452K09O908M861j294j882m119k752
$$ 1292 2561 2049 -1140 -3731 -6122 -8016 -11936 -19388 -19179 -12271 -7410 -8704 -10586 -14705 -17457
14824a7457J619Q561j276k481P83k744N69K047J384Q28O60k521J213k90J762M103
$$ -17457 -15838 -7277 -8553 -11034 -10251 -12995 -12426 -10379 -8995 -8167 -7507 -10028 -8815 -9105 -7343 -3240
14808c240J224k757L329L57l817M777k3o183L861M016o178m294R832J833l990
$$ -3240 -2016 -4773 -1444 -1087 -4904 -127 -150 -6333 -2472 1544 -4634 -8928 904 2737 -1253
14793a253Q1l847o940N00L381J1078M13R76L449j703K445J308P92k082j918m393
$$ -1253 -1172 -5019 -11959 -11459 -8078 3000 3413 4389 7838 6135 8580 9888 10680 8598 6680 2287
14777B287k945K526R882L936j549p746p761k209K267j167J963k522l743J883J454
$$ 2287 -658 1868 11750 15686 14137 6391 -1370 -3579 -1312 -2479 -516 -3038 -6781 -4898 -3444
14762c444l457J708J577J573p47J30k962n58K176J632M047J2284O249m134l51
$$ -3444 -6901 -5193 -3616 -2043 -2790 -2660 -5622 -6180 -4004 -2372 1675 13959 20208 16074 15723
14747A5723m872n293m222M105l154m350o836m248Q981j990l982K268J3539K179
$$ 15723 10851 5558 1336 5441 2287 -2063 -8899 -13147 -4166 -6156 -10138 -7870 5669 7848
14733G848O76o584p129j711n468L261l984K599K495j906J843O400N323k614o552
$$ 7848 8524 1940 -5189 -6900 -12368 -9107 -13091 -10492 -7997 -9903 -8060 -1660 3663 1049 -5503
14718e503K719r07j037j316N130P326m307o484m130j98Q11l817M144K927j85m370
$$ -5503 -2784 -3691 -4728 -6044 -914 6412 2105 -4379 -8509 -8707 -7896 -11713 -7569 -4642 -4827 -9197
14702i197l849K838K834o87K05n16j183m01l951K888K83N39J1183J0077o828n824
$$ -9197 -13046 -10208 -7374 -8061 -7856 -8372 -9555 -9956 -13907 -11019 -10736 -10197 986 11063 4235 -1589
14686a589M370n787m053l135L4O337K441k405K324L477R48O9o486k301L114J389
$$ -1589 2781 -3006 -7059 -10194 -10160 -3823 -1382 -3787 -1463 2014 2962 3031 -3455 -5756 -2642 -1253
14670a253K718m748q130L784L467J881L299k803j2296Q49J058j192N441J983j331
$$ -1253 1465 -3283 -11413 -7629 -4162 -2281 1018 -1785 -14081 -13232 -12174 -13366 -7925 -5942 -7273
14655g273j248n011m814L830j314J003L098L463j886K699N025m365l410J314k855
$$ -7273 -8521 -13532 -18346 -14516 -15830 -14827 -11729 -8266 -10152 -7453 -2428 -6793 -10203 -8889 -11744
14640a1744R292N569j22n107J474o179K283P928Q61l042p287O49Q41k587j585
$$ -11744 -2452 3117 2995 -2112 -638 -6817 -4534 3394 4255 1213 -6074 -5425 -4584 -7171 -8756
14625h756j540K626J115j603l98K166N992j123n420j294K411Q63K802R65j082
$$ -8756 -10296 -7670 -6555 -8158 -8556 -6390 -398 -1521 -6941 -8235 -5824 -4961 -2159 -1194 -2276
14610b276L262N29l857q16j322L736p029l711o817m825K064K431K991O431K579
$$ -2276 986 1515 -2342 -3158 -4480 -744 -7773 -11484 -18301 -23126 -21062 -18631 -15640 -9209 -6630
14595f630o01l484O362j062o788m235J0527N601K215n270o663q8m341M16N65M66
$$ -6630 -7231 -10715 -4353 -5415 -12203 -16438 -5911 -310 1905 -3365 -10028 -10116 -14457 -14041 -13476 -13010
14579a3010L661L141R27j691J861M982K206q373k710Q018J252J820k719O6l839
$$ -13010 -9349 -6208 -5281 -6972 -5111 -129 2077 -6296 -9006 -988 264 2084 -635 -569 -4408
14564d408n508k108j479k129J1219M039K13l99l467o123q708L653N54n801J931
$$ -4408 -9916 -12024 -13503 -15632 -4413 -374 -161 -560 -4027 -10150 -18858 -15205 -14651 -20452 -18521
14549a8521O748O414j370k807J3463P04q997l194K258L804j283k36M710L64j0047
$$ -18521 -11773 -5359 -6729 -9536 3927 4631 -4366 -7560 -5302 -1498 -2781 -3017 1693 2057 -7990
14534g990m105j489m460P109J975J169k24J308j2k18R80j976O162Q002M78P84
$$ -7990 -12095 -13584 -18044 -10935 -8960 -7791 -8015 -6707 -6719 -6937 -5957 -7933 -1771 6231 6709 7493
14518G493q429j425M591o710n27K181J13m060m803P1P208M379K218n115p094J985
$$ 7493 -936 -2361 2230 -4480 -5007 -2826 -2713 -6773 -11576 -11505 -4297 82 2300 -2815 -9909 -7924
14502g924o131L330J436K058j815q17N470M667p77l873j82k733k196K724Q64M136
$$ -7924 -14055 -10725 -9289 -7231 -9046 -9863 -4393 274 -503 -4376 -4558 -7291 -9487 -6763 -5899 -1763
14486a763L585o808n977j414K244N482M925M381l187j566K755q56p266k889P899
$$ -1763 1822 -4986 -10963 -12377 -10133 -4651 274 4655 1468 -98 2657 1801 -5465 -8354 -455
14471d55K390k493n43J228k629L570M879j102n60l099M619n53m083L947j870K07
$$ -455 1935 -558 -1101 127 -2502 1068 5947 4845 4285 1186 5805 5252 1169 5116 3246 3453
14455C453l535k832k123O71M358P264k569j2604k602J4368M707q39n648m535k804
$$ 3453 -82 -2914 -5037 -4366 -8 7256 4687 -7917 -10519 3849 8556 7717 2069 -2466 -5270
14440e270Q90n616O374n92R1O41k591m38r11n926L329O596k183r163j280J974
$$ -5270 -4380 -9996 -3622 -4214 -4123 -3482 -6073 -6511 -7422 -13348 -10019 -3423 -5606 -14769 -16049 -14075
14424a4075J804P120J341o278J163L167P56R234j477J247l446j629l5P90j186
$$ -14075 -12271 -5151 -3810 -10088 -8925 -5758 -5002 4232 2755 4002 556 -1073 -1108 -318 -1504
14409a504L91M935j440n089O71n44k281k105O05l586l019K579R43L530K673l034
$$ -1504 -1113 3822 2382 -2707 -2036 -2580 -4861 -6966 -6361 -9947 -12966 -10387 -9444 -5914 -3241 -6275
14393f275J817L058J785n158k261N312p98n1j620l747M8L036j252n028k291k956
$$ -6275 -4458 -1400 385 -4773 -7034 -1722 -2520 -2571 -4191 -7938 -7890 -4854 -6106 -11134 -13425 -16381
14377a6381M914L732N756K764J404r67p302k428J833p18N90l436J531l48K818
$$ -16381 -11467 -7735 -1979 785 2189 1222 -6080 -8508 -6675 -7393 -6803 -10239 -8708 -9056 -6238
14362f238P916K694j0460n92J914N866J663L267L443k06j1151k01M997M123q018
$$ -6238 1678 4372 -6088 -6680 -4766 1100 2763 6030 9473 9267 -1884 -2085 2912 7035 -983
14347i83l094j480K341K256O114n635J378N031n392k841m359p506K850m970K286
$$ -983 -4077 -5557 -3216 -960 5154 -481 897 5928 536 -2305 -6664 -14170 -11320 -16290 -14004
14332a4004k837O752M660m407J226l24q29p72n98K525J76l286n147L430R790M061
$$ -14004 -16841 -10089 -5429 -9836 -8610 -8934 -9763 -10535 -11133 -8608 -8432 -11718 -16865 -13435 -3645 416
14316D16l369O02n11K0K849k557l359k341L659N062n297n789M062J081n719k639
$$ 416 -2953 -2351 -2862 -2842 7 -2550 -5909 -8250 -4591 471 -4826 -10615 -6553 -5472 -11191 -13830
14300a3830J726J040N14J402O908J390l820l65q32j728N799M706M063m552n831
$$ -13830 -12104 -11064 -10550 -9148 -2240 -850 -4670 -5035 -5867 -7595 -1796 2910 6973 2421 -3410
14285c410p028J025J2176N808l803o397L414L063L055k0N120l791o255m987k541
$$ -3410 -10438 -9413 2763 8571 4768 -1629 1785 4848 7903 7883 13003 9212 2957 -2030 -4571
14270d571J699M541J562m936L630J804l023j764n78k582l607o907J418R419Q946
$$ -4571 -2872 1669 3231 -1705 1925 3729 706 -1058 -1636 -4218 -7825 -14732 -13314 -3895 5051
14255E051j490n355n608n735P581N540m874k573J2840L410k091m663l392m754
$$ 5051 3561 -1794 -7402 -13137 -5556 -16 -4890 -7463 5377 8787 6696 2033 -1359 -6113
14241f113l513p3l63j066L535l76J631N243n20q22r026m721p38K883M928N842
$$ -6113 -9626 -9699 -10062 -11128 -7593 -7969 -6338 -1095 -1615 -2437 -11463 -16184 -16922 -14039 -9111 -3269
14225c269L610l022m290k899M915Q385Q98o377o193j535J574j03l3Q57j799K446
$$ -3269 341 -2681 -6971 -9870 -4955 3430 4328 -2049 -8242 -9777 -8203 -8306 -8339 -7482 -9281 -6835
14209f835m278J306O134N464L554n467J182P03L0j115M12j1412q682p9J186k3
$$ -6835 -11113 -9807 -3673 1791 5345 -122 1060 1763 1793 678 1090 -10322 -19004 -19083 -17897 -17920
14193a7920N178O831K060m361J623j607L707O511J937r60J187O275q36o700L172
$$ -17920 -12742 -5911 -3851 -8212 -6589 -8196 -4489 2022 3959 2999 4186 10461 9625 2925 6097
14178F097o349o124j719K471O52K797l417J119K886P734o108l002L163O83m343
$$ 6097 -252 -6376 -8095 -5624 -4972 -2175 -5592 -4473 -1587 6147 39 -2963 200 883 -3460
14163c460n760J221p22m143M586L440M927m750k292j823j864N595P709r75L819
$$ -3460 -9220 -7999 -8721 -12864 -8278 -4838 89 -4661 -6953 -8776 -10640 -5045 2664 1689 5508
14148E508J410j906n369k129l647j733O72j913k815k439o833L118O247Q767L507
$$ 5508 6918 5012 -357 -2486 -6133 -7866 -7194 -9107 -11922 -14361 -21194 -18076 -11829 -3062 445
14133D45l538n334Q569J1678J001J574l348m923r604l993K522j066K387j242o758
$$ 445 -3093 -8427 142 11820 12821 14395 11047 6124 -3480 -7473 -4951 -6017 -3630 -4872 -11630
14118a1630n266Q010K560j765m05n81M952P890P82j479n454K796J090k720l188
$$ -11630 -16896 -8886 -6326 -8091 -8496 -9077 -4125 3765 4547 3068 -2386 410 1500 -1220 -4408
14103d408o893M269O350R88Q384k074q876m104Q152L501o75m292M643l980j984
$$ -4408 -11301 -7032 -682 306 8690 6616 -2260 -6364 1788 5289 4614 322 4965 985 -999
14088i99p18m031l827J477l65M129k059J582L332j251j840j497j845O682N446
$$ -999 -1717 -5748 -9575 -8098 -8463 -4334 -6393 -4811 -1479 -2730 -4570 -6067 -7912 -1230 4216
14073D216n050n99N088o614n848K900M076K664n558K955Q348j473q839L302M516
$$ 4216 -834 -1433 3655 -2959 -8807 -5907 -1831 833 -4725 -1770 6578 5105 -3734 -432 4084
14058D084l31n34n170L75L745J45j64M004q16L363Q24Q35q916k642k163j01N384
$$ 4084 3753 3219 -1951 -1576 2169 2314 2150 6154 5338 8701 9525 10360 1444 -1198 -3361 -3462 1922
14041A922L575q57p48K786m870n158O188R877L590l25m421M126j1525j1735m0
$$ 1922 5497 4640 3892 6678 1808 -3350 2838 12715 16305 15980 11559 15685 4160 -7575 -7615
14026g615N432mJ299q78m74M236K360P68k189K178K924o185l204r73l792L280
$$ -7615 -2183 -2187 -888 -1766 -2240 1996 4356 5124 2935 5113 8037 1852 -1352 -2325 -6117 -2837
14010b837Q315J058O75j180m643l477J956J469r81l839J867k207l236K488N177
$$ -2837 5478 6536 7211 6031 1388 -2089 -133 1336 355 -3484 -1617 -3824 -7060 -4572 605
13995F05K023p020m194K385Q44j734o374M994Q919R247l73q329m413J630l548
$$ 605 2628 -4392 -8586 -6201 -5357 -7091 -13465 -8471 448 9695 9322 993 -3420 -1790 -5338
13980e338M067K953o20L237N119P366j690K023l85m787l420j18M258L090p911
$$ -5338 -1271 1682 1062 4299 9418 16784 15094 17117 16732 11945 8525 8407 12665 15755 7844
13965G844m150M670r7m350M64J346o297j578K256m35l298L145P492o65l989j079
$$ 7844 3694 8364 8267 3917 4381 5727 -570 -2148 108 -327 -3625 -480 7012 6347 2358 1279
13949A279J515O071j351p478j592n170J368J795J910K11O129N370J933k101k248
$$ 1279 2794 8865 7514 36 -1556 -6726 -5358 -3563 -1653 -1442 4687 10057 11990 9889 7641
13934G641K766j757J578k915m274N71k127M282J0978N662N048M750N232M345l684
$$ 7641 10407 8650 10228 7313 3039 3610 1483 5765 16743 22405 27453 32203 37435 41780 38096
13919C8096k596J455l001J139L488l065q700p91R944J352P239P598l258n364l020
$$ 38096 35500 36955 33954 35093 38581 35516 26816 26025 35969 37321 44560 52158 48900 43536 40516
13904D0516m03o160j2660n274o939m307k906J662n97m635j95l88L90k909L4M617
$$ 40516 40113 33953 21293 16019 9080 4773 1867 3529 2932 -1703 -1898 -2286 -1896 -4805 -4771 -154
13888a54L879L456K992o38o268p702m972m030K334Q3p76N118l366o589Q272M873
$$ -154 3725 7181 10173 9535 3267 -4435 -9407 -13437 -11103 -11020 -11796 -6678 -10044 -16633 -8361 -3488
13872c488J596n2K624J557L980p127o430O30L703l490P881n57o463J063J065j091
$$ -3488 -1892 -1944 680 2237 6217 -910 -7340 -6710 -3007 -6497 1384 827 -5636 -4573 -3508 -4599
13856d599O507L778m264m052Q46Q790j340k313k054Q22l335j4K696m489O154N253
$$ -4599 1908 5686 1422 -2630 -1784 7006 5666 3353 1299 2121 -1214 -1228 1468 -3021 3133 8386
13840H386L682l133q64l434P33L622q84p814p184N901K619J165N31K414L433k439
$$ 8386 12068 8935 8071 4637 5370 8992 8108 294 -6890 -989 1630 2795 3326 5740 9173 6734
13824F734m297k445K006p086q986J945N663N016O90o817O258L142r853L7O017
$$ 6734 2437 -8 1998 -5088 -14074 -12129 -6466 -1450 -760 -7577 -1319 1823 -8030 -7993 -1976
13809a976N928J719m636l043j712J655l848k391P047J819J515l420l474l565L33
$$ -1976 3952 5671 1035 -2008 -3720 -2065 -5913 -8304 -1257 562 2077 -1343 -4817 -8382 -8049
13794h049N531O247M340J154o53p691j1375k970Q71O522P380O121L314k441j0822
$$ -8049 -2518 3729 8069 9223 8570 879 -10496 -13466 -12595 -6073 1307 7428 10742 8301 -2521
13779b521m036O030N267k682l390k291k159K072J40J238N780Q426J783K327k824
$$ -2521 -6557 -527 4740 2058 -1332 -3623 -5782 -3710 -3570 -2332 3448 11874 13657 15984 13160
13764A3160p956l109K21j625l753N299J498O815K617n965r792n300j421L65j733
$$ 13160 5204 2095 2316 691 -3062 2237 3735 10550 13167 7202 -2590 -7890 -9311 -8946 -10679
13749a0679j625O93N838L341q0o113J470N805L753l112k221J576n23j667O226
$$ -10679 -12304 -11611 -5773 -2432 -2512 -8625 -7155 -1350 2403 -709 -2930 -1354 -1877 -3544 2682
13734B682O014j814j3967l412J803O291K015L109n903j833K038L841N592O111
$$ 2682 8696 6882 -7085 -10497 -8694 -2403 -388 2721 -3182 -5015 -2977 864 6456 12567
13720A2567L397j64k133J515K423o02k231m650j0976K72R186p63N170K544l064
$$ 12567 15964 15800 13667 15182 17605 17003 14772 10122 -854 -582 8604 7841 13011 15555 12491
13705A2491k971K135M06k228l294r72m917q34M128j173o982K41O497K573M291
$$ 12491 9520 11655 12061 9833 6539 5567 650 -184 3944 2771 -4211 -3970 2527 5100 9391
13690I391p92k090k860k002l313j718J893n548o44K172L675J405o94O31N21O064
$$ 9391 8599 6509 3649 1647 -1666 -3384 -1491 -7039 -7683 -5511 -1836 -431 -1125 -494 27 6091
13674F091J834j673j634r202k393k659o66N866O201L35K678j333m382K792J510
$$ 6091 7925 6252 4618 -4584 -6977 -9636 -10302 -4436 1765 2100 4778 3445 -937 1855 3365
13659C365m229l60K340o61p632j1342o69P360M005P06O07J915M74J637J570K864
$$ 3365 -864 -1224 1116 455 -7177 -18519 -19188 -11828 -7823 -7117 -6510 -4595 -4121 -2484 -914 1950
13643A950n21K667o655l322k548O297M623M299M732o043n940N455R003J99q852
$$ 1950 1429 4096 -2559 -5881 -8429 -2132 2491 6790 11522 5479 -461 4994 13997 14196 5344
13628E344r652n674K598k881l244n22j376K090j525k092P371P848Q01l582L005
$$ 5344 -4308 -9982 -7384 -10265 -13509 -14031 -15407 -13317 -14842 -16934 -9563 -1715 -914 -4496 -1491
13613a491j44J368L151k35r92J699n657j54k793m092M660R88K861L600m342k413
$$ -1491 -1635 -267 2884 2649 1657 3356 -2301 -2455 -5248 -9340 -4680 -3692 -831 2769 -1573 -3986
13597c986N53J2167P718n643m268n551n474n337j473n03n222J326O193O807j501
$$ -3986 -3433 8734 16452 10809 6541 990 -4484 -9821 -11294 -11797 -17019 -15693 -9500 -2693 -4194
13582d194k409K681L169L280M305J586J926j71k052o995o423N027K287L144j628
$$ -4194 -6603 -3922 -753 2527 6832 8418 10344 10173 8121 1126 -5297 -270 2017 5161 3533
13567C533K178K051J395K638m542o688o269R83J3067L492m567k369M867O287k136
$$ 3533 5711 7762 9157 11795 7253 565 -5704 -4721 8346 11838 7271 4902 9769 16056 13920
13552A3920k990l020j1395j085j557k625P73J040Q218Q729j721p16l185p698m870
$$ 13920 10930 7910 -3485 -4570 -6127 -8752 -7979 -6939 1279 10008 8287 7571 4386 -3312 -8182
13537h182N239K151J734k960p098k596K728L076J039j72o950K643N761L571L268
$$ -8182 -2943 -792 942 -2018 -9116 -11712 -8984 -5908 -4869 -5041 -11991 -9348 -3587 -16 3252
13522C252J907l643j1985k933Q256O226KM33l030m120R84J24N161J1712K428n197
$$ 3252 5159 1516 -10469 -13402 -5146 1080 1082 1515 -1515 -5635 -4651 -4527 634 12346 14774 9577
13506I577K857k242j715l254p484m661K591P087J562o761l389J877m267J379j113
$$ 9577 12434 10192 8477 5223 -2261 -6922 -4331 2756 4318 -2443 -5832 -3955 -8222 -6843 -7956
13491g956L746m380k384j533K682K784N290L065O920M210O288O4j135j495q308
$$ -7956 -4210 -8590 -10974 -12507 -9825 -7041 -1751 1314 8234 12444 18732 18796 17661 16166 7858
13476G858j614L927M443J795o844q475N47K2l952M38O37j003J97r51j137k037
$$ 7858 6244 10171 14614 16409 9565 1090 1637 1659 -2293 -1855 -1218 -2221 -2024 -2975 -4112 -6149
13460f149N864K09j054N721n882m054J707j127J0546J0520P57l620k588k043n349
$$ -6149 -285 -76 -1130 4591 -1291 -5345 -3638 -4765 5781 16301 17058 13438 10850 8807 3458
13445C458r059O761K988N167l94n331j597o111m426k693J1949N351P665P723p945
$$ 3458 -5601 1160 4148 9315 8921 3590 1993 -4118 -8544 -11237 712 6063 13728 21451 13506
13430A3506r987o648M837K605r770J52m741l316N625K434M643Q0M221J064q17
$$ 13506 3519 -3129 1708 4313 -5457 -5305 -10046 -13362 -7737 -5303 -660 -580 3641 4705 3888
13415C888n173o081j043k374M674L201j887J536N899P744o2k052m825n345J988
$$ 3888 -1285 -7366 -8409 -10783 -6109 -2908 -4795 -3259 2640 10384 10322 8270 3445 -1900 88
13400H8o341j964M537K983k146M858L11p488j407J085j253L072K052L231j777
$$ 88 -6253 -8217 -3680 -697 -2843 2015 2326 -5162 -6569 -5484 -6737 -3665 -1613 1618 -159
13385a59L914N434p399m698m474k329J189k238O036K743j241J074M23J960l046
$$ -159 3755 9189 1790 -2908 -7382 -9711 -8522 -10760 -4724 -1981 -3222 -2148 -1725 235 -2811
13370b811J471k518J76J867M134N016r54l812k447J839O891Q261M078o65l593
$$ -2811 -1340 -3858 -3682 -1815 2319 7335 6381 2569 122 1961 8852 17113 21191 20526 16933
13355A6933o827Q15N141J803n597j0948n202O751l772k050J217j652P386J0696
$$ 16933 10106 10921 16062 17865 12268 1320 -3882 2869 -903 -2953 -1736 -3388 3998 14694
13341A4694j289o154j308k466n807n357J227K509J779Q198K549Q5k981L341m769
$$ 14694 13405 7251 5943 3477 -2330 -7687 -6460 -3951 -2172 6026 8575 8660 5679 9020 4251
13326D251r90L782k615J532O603Q400m356q615k673r36p70m675J48Q611N691m130
$$ 4251 3261 7043 4428 5960 12563 20963 16607 7992 5319 4383 3613 -1062 -914 7697 13388 9258
13310I258k669N063L263L366p64o49J487l42n706p015j525N267P467k776O87J170
$$ 9258 6589 11652 14915 18281 17517 16868 18355 18013 12307 5292 3767 9034 16501 13725 14412 15582
13294A5582l622k871q903p014M106K425J2151J6961J100Q40m462p847j1326n061
$$ 15582 11960 9089 186 -6828 -2722 -297 11854 28815 29915 30755 26293 18446 7120 2059
13280B059n641n323j12N502M154k888M82L301L808K222J357m493M14J417o675
$$ 2059 -3582 -8905 -9017 -3515 639 -2249 -1767 1534 5342 7564 8921 4428 4842 6259 -416
13265d16j062J746K723K07k19M630p81j663L395J276k200K160J457p11l309l471
$$ -416 -1478 268 2991 3198 2979 7609 6828 5165 8560 9836 7636 9796 11253 10542 7233 3762
13249C762q13N639j057q670j772K302M697O736l74l33m231l38O55M7Q34K51J046
$$ 3762 2949 8588 7531 -1139 -2911 -609 4088 10824 10450 10117 5886 5548 6203 6250 7084 7335 8381
13232H381M44l20q15j428J482O377K807M860P230q588j2845n89m940N808N196
$$ 8381 8825 8505 7690 6262 7744 14121 16928 21788 29018 20430 7585 6996 2056 7864 13060
13217A3060n837p793l247j25j528M71N195M13O7L336J3211P672K881o906p455
$$ 13060 7223 -570 -3817 -3942 -5470 -4999 196 609 676 4012 17223 24895 27776 20870 13415
13202A3415l502L126k925J392O115J621n5J1943R124J0580J1666K0159K6517J2842
$$ 13415 9913 13039 10114 11506 17621 19242 19187 31130 40254 50834 62500 82659 109176 122018
13188A22018k0197l7986k5965r978p718m982J1578L508J928N200k066j1217m895
$$ 122018 101821 63835 37870 27892 20174 15192 26770 30278 32206 37406 35340 24123 19228
13175A9228K85k871J581L792J322M660k422N475J524p988K490L625K720Q839L548
$$ 19228 19513 16642 18223 22015 23337 27997 25575 31050 32574 24586 27076 30701 33421 42260 45808
13160D5808L220K353l596p823N680m918l925K223l534r491K580P652J2146J0520
$$ 45808 49028 51381 47785 39962 45642 40724 36799 39022 35488 25997 28577 36229 48375 58895
13146E8895L486K092P257J0238J4946K5920M1578O4490Q0624J25503K20042L64052
$$ 58895 62381 64473 71730 81968 96914 122834 164412 228902 309526 435029 655071 1019123
13134A019123N75457O86538K23374m40064o45461n07859l15579j83746j04889
$$ 1019123 1594580 2281118 2504492 2064428 1418967 911108 595529 411783 306894
13125C06894p1565m9630l3028j5786j7148j0238n605j093O564K2760J7469N472
$$ 306894 235329 185699 152671 136885 119737 109499 103894 102801 109365 132125 149594 155066
13113A55066j0409k5754k0766j6521j4736r727j0523q949j822Q219L096p750m085
$$ 155066 144657 118903 98137 81616 66880 57153 46630 37681 35859 44078 47174 39424 35339
13100C5339n533q971N474J482l972k951r643j54o458j766K338j708M083J1404
$$ 35339 29806 20835 26309 27791 23819 20868 11225 11071 4613 2847 5185 3477 7560 18964
13086A8964O637M14q019j667L583M583l11L211L595K930M83k423J059J3324K2524
$$ 18964 25601 26015 17996 16329 19912 24495 24184 27395 30990 33920 34403 31980 33039 46363 68887
13071F8887K3010L3275K6272k879l1103k9274k2954j5345o616k977P114L166p046
$$ 68887 91897 125172 151444 148565 117462 88188 65234 49889 43273 40296 47410 50576 43530
13058D3530j0897q012j032p887l532P826k721j000j99L067k52K567l853n733P057
$$ 43530 32633 24621 23589 15702 12170 19996 17275 16275 16076 19143 18891 21458 17605 11872 18929
13043A8929R392r67k162L787K162l710p309l506n895J159j77K489J3514N372M576
$$ 18929 28321 27354 25192 28979 31141 27431 20122 16616 10721 11880 11703 14192 27706 33078 37654
13028C7654J1878Q601k063N676N120P113m807j5523j8805j1350k185p141l173
$$ 37654 49532 58133 56070 61746 66866 73979 69172 53649 34844 23494 21309 14168 10995
13015A0995J845L097l153o393N1P149J3732P872P838j459j1727r816j2496j1301
$$ 10995 12840 15937 12784 6391 6442 13591 27323 35195 43033 41574 29847 20031 7535 -3766
13001c766j4630k1589l9189n1603l0295J5906M6892N4133M2274K8171K2535Q974
$$ -3766 -18396 -39985 -79174 -130777 -161072 -145166 -98274 -44141 -1867 26304 48839 57813
12989E7813N278k693o110j3068q187R726J3524P935j69k323q404o706l918j987
$$ 57813 63091 60398 54288 41220 33033 42759 56283 64218 64049 61726 53322 46616 42698 40711
12975D0711m985j25J044L992L792l891K351O192j052Q35k532k399l141J0081J1173
$$ 40711 35726 35601 36645 40637 44429 40538 42889 49081 48029 48864 46332 43933 40792 50873 62046
12960F2046J4426Q589P579M196J0322L3257M2694L3269K3264M0975P8380R3954
$$ 62046 76472 85061 92640 96836 107158 140415 183109 216378 239642 280617 358997 452951
12948D52951J01619J36202J49532J25829J18694J12252K1216q1768j36134j67155
$$ 452951 554570 690772 840304 966133 1084827 1197079 1218295 1136527 1000393 833238
12938H33238j83228j59777j17003q3470o8199m9070k5813j6421j5299n330p695
$$ 833238 650010 490233 373230 289760 221561 172491 146678 130257 114958 109628 101933
12927A01933Q3L731l507n202j3621n888j793q63J580n31n444j075j2333j609M539
$$ 101933 102016 105747 102240 97038 83417 77529 75736 74873 76453 75922 70478 69403 57070 55461 60000
12912F0000R572J5323P774L470j48m571o005o521p858Q370M865j8516q937M258
$$ 60000 69572 84895 92669 96139 95991 91420 85415 78894 71036 79406 84271 65755 56818 61076
12898F1076P705R295J0067N789o45n080K129O17j099l210j0872j6187p504N91
$$ 61076 68781 78076 88143 93932 93287 88207 90336 90953 89854 86644 75772 59585 52081 52672
12884E2672Q421L130j1263j9291j4855n277M081Q550P358Q677R822L605O706J8356
$$ 52672 61093 64223 52960 33669 18814 13537 17618 26168 33526 42203 52025 55630 62336 80692
12870H0692J7120J4486R003j0760m855j133Q310N379J5243J5076L555p169q737
$$ 80692 97812 112298 121301 110541 105686 104553 112863 118242 133485 148561 152116 144947 136210
12857A36210m60J1073J8252K0247J2136k772m119O942N983Q775n253o1976r6773
$$ 136210 135750 146823 165075 185322 197458 194686 190567 197509 203492 212267 207014 145038 48265
12844D8265o5747k1325J1366J8705J3848J8701J6286J1121P055J0063n5J056J0101
$$ 48265 -17482 -38807 -27441 -8736 5112 23813 40099 51220 58275 68338 68283 69339 79440
12831G9440K4763K2070J6966J7041M0114P6248Q1091O2529R8969J18039P5523
$$ 79440 104203 126273 143239 160280 200394 276642 357733 420262 519231 637270 712793
12820G12793J1047l3689q5555j46833j63427j26302p3670l6646j1032l227J2569
$$ 712793 723840 690151 604596 457763 294336 168034 94364 57718 46686 43459 56028
12809E6028K4034J6546j807l204N325o158n814n694r762l417Q843O668m852n564
$$ 56028 80062 96608 94801 91597 96922 90764 84950 79256 69494 66077 74920 81588 76736 71172
12795G1172N168J1178K6922L5007L7422K7365J0049q4j2249j7220j1684J1123
$$ 71172 76340 87518 114440 149447 186869 214234 224283 224199 211950 194730 183046 194169
12783A94169K5561K9518L3403K6383J8261J2279K1523M0310O4522J17337K01647
$$ 194169 219730 249248 282651 309034 327295 339574 361097 401407 465929 583266 784913
12772G84913L15870M66718M79172K39699k1974l48351m68480m01459k65906j57903
$$ 784913 1100783 1567501 2046673 2286372 2264398 1916047 1447567 1046108 780202 622299
12762F22299q3937l9660k0223o841q922j6748k7792k8061j8454q060R30K1831
$$ 622299 538362 498702 478479 471638 462716 445968 418176 390115 371661 363601 364531 386362
12750C86362K0103L3271M1749M7256N2892O2106N3267K8463o00j0649M436K1524
$$ 386362 406465 439736 481485 528741 581633 643739 697006 725469 724869 714220 718656 740180
12738G40180K6673L6202N6036O1328L7042M029K6766O4094Q5006R4480R1361Q0573
$$ 740180 766853 803055 859091 920419 957461 961490 988256 1052350 1137356 1231836 1323197 1403770
12726A403770R7704J23785J42262J58394J61031J58410J59560J74698J61336J47572
$$ 1403770 1501474 1625259 1767521 1925915 2086946 2245356 2404916 2579614 2740950 2888522
12716B888522J74435K62599L62863N35049P58486R29645J034012J134270J230068
$$ 2888522 3062957 3325556 3688419 4223468 4981954 5911599 6945611 8079881 9309949
12707I309949J412934J672887K071465K967222M664549P341013J0737229J5401093
$$ 9309949 10722883 12395770 14467235 17434457 22099006 29440019 40177248 55578341
12699E5578341K4657701M1658818O7149226J02058740J18194915L8146099p1643773
$$ 55578341 80236042 121894860 189044086 291102826 409297741 447443840 375800067
12692C75800067j11227443r3037224n9503245l4858131k0603105j3540584r715043
$$ 375800067 264572624 171535400 112032155 77174024 56570919 43030335 33315292
12685C3315292p207669n548698m233092l091160k218369j602977j120976p67342
$$ 33315292 26107623 20558925 16325833 13234673 11016304 9413327 8292351 7525009
12677G525009n56063n01870n01765n01300m90258m48137l64485l14090l35119
$$ 7525009 6968946 6467076 5965311 5464011 4973753 4525616 4161131 3847041 3511922
12668C511922l41710l04184k26666j66570j26011j17442j14514j24579j10766
$$ 3511922 3170212 2866028 2639362 2472792 2346781 2229339 2114825 1990246 1879480
12659A879480q2950n2865m1366o9723r1331q0624l2360P828K6880J9061l25k3500
$$ 1879480 1796530 1743665 1702299 1632576 1541245 1460621 1428261 1436089 1462969 1482030 1481705 1458205
12647A458205m9105n7941n4103o8259p4198q2846q4635o2964m3603m9021m1027
$$ 1458205 1409100 1351159 1297056 1228797 1154599 1071753 987118 924154 880551 831530 790503
12636G90503l6932m2194m7233m2739l4948k8370j7129k692N35j940r829k0909
$$ 790503 753571 711377 664144 621405 586457 558087 540958 538266 538801 536861 527032 506123
12624E06123k5793k6769j2538o91O366K0500K0491P338R290J3464Q013q502j8506
$$ 506123 480330 453561 441023 440332 446698 467198 487689 495027 504317 517781 525794 517292 498786
12611D98786l5278k6795k7788r160L699J46P728O37k0808l2355l0775k7725k031
$$ 498786 463508 436713 408925 399765 403464 403610 411338 411975 391167 358812 328037 300312 298281
12598B98281J6052L3380L9678K5628K1661J4474J823L365M305j846r023l881n967
$$ 298281 314333 347713 387391 413019 434680 449154 450977 454342 458647 456801 447778 443897 437930
12585D37930N935O835N546k418r599K598K6286K7091K0861J7014L0495L7513J7156
$$ 437930 443865 450700 456246 453828 444229 446827 473113 500204 521065 538079 568574 606087 623243
12572F23243Q275M5362K8555l6317j46744j53654n2060Q565P5010Q2700O5256
$$ 623243 631518 676880 705435 669118 522374 368720 316660 325225 400235 482935 548191
12561E48191M4648M6176N3994M5196L6439M5839N5217N3917N6326O8282Q7701
$$ 548191 592839 639015 693009 738205 774644 820483 875700 929617 985943 1054225 1141926
12550A141926J07807J16243J21683J35933J42727J55239J33875J13008J73111
$$ 1141926 1249733 1365976 1487659 1623592 1766319 1921558 2055433 2168441 2341552
12541B341552L10560M74465O38889P70855Q91220R84537J052176J103816J186441
$$ 2341552 2652112 3126577 3765466 4536321 5427541 6412078 7464254 8568070 9754511
12532I754511J362393J748727K460348L727408N962092R664558J5292510K2783166
$$ 9754511 11116904 12865631 15325979 19053387 25015479 34680037 49972547 72755713
12524G2755713K9243747K9615829K5263847K0520657J1348667l328702j5114175
$$ 72755713 101999460 131615289 156879136 177399793 188748460 185419758 170305583
12517A70305583k1668925k7259921k9782683k6272548j9330239j2775380q164527
$$ 170305583 148636658 121376737 91594054 65321506 45991267 33215887 25051360
12510B5051360n307463l619648k568680j868127j446056j184206r63113q06064
$$ 25051360 19743897 16124249 13555569 11687442 10241386 9057180 8094067 7288003
12502G288003p57736p40941o80145o30408n63169m82936m01623l24677k64892
$$ 7288003 6530267 5789326 5109181 4478773 3915604 3432668 3031045 2706368 2441476
12493B441476k05478j61409j32315j17350j07157j01727j06763r7558q2631o5452
$$ 2441476 2235998 2074589 1942274 1824924 1717767 1616040 1509277 1411719 1329088 1263636
12483A263636o2478o6419o9988n7468m9730m0378m4787l5254k2645k7997k7783
$$ 1263636 1201158 1134739 1064751 1007283 957553 917175 872388 837134 814489 786492 758709
12472G58709j8226k0318k2118j7672j7468o788j8060k4808j1120j2140j5818j5159
$$ 758709 740483 720165 698047 680375 662907 656119 638059 613251 602131 589991 574173 559014
12460E59014k1859k8720j8325j4113j5636j6373j9801j5069o903r096m395k041
$$ 559014 537155 508435 490110 475997 460361 443988 424187 409118 402215 393119 388724 386683
12448C86683n871K269J1301R45k187k553o737l264j0819j7781j5152j4022j9836
$$ 386683 380812 383081 394382 395327 393140 390587 383850 380586 369767 351986 336834 322812 302976
12435C02976p710L144J070j2519j2160j4318l127Q68J412k416q568l221K711m787
$$ 302976 295266 298410 299480 286961 274801 260483 257356 258224 259636 257220 248652 245431 248142 243355
12421B43355L140J2187R034K409K179R771p765k0330o374j4097j1440q595l291
$$ 243355 246495 258682 267716 270125 272304 282075 274310 253980 247606 233509 222069 213474 210183
12408B10183j239O056R100J1405L481l267M150l558L228Q835M683K01j839l389
$$ 210183 208944 215000 224100 235505 238986 235719 239869 236311 239539 248374 253057 253258 251419 248030
12394B48030J911J0316J3236k7958n2299m6071k9972j1320N573J2624M431j298
$$ 248030 249941 260257 273493 245535 193236 147165 117193 105873 111446 124070 128501 127203
12382A27203m986m780R646J2638K0029Q309J061N973Q433K626q030j2462j2444
$$ 127203 122217 117437 127083 139721 159750 168059 169120 175093 183526 186152 178122 165660 153216
12369A53216j9357k4767k5407k6326j9420r649P04O932N145J775K695J4601N049
$$ 153216 133859 109092 83685 57359 37939 28290 28994 35926 41071 42846 45541 60142 65191
12356F5191m915l056J448l605q50p739m584K31M766J0407P526Q24O501J1041P886
$$ 65191 60276 57220 58668 55063 54213 46474 41890 42121 46887 57294 64820 65644 72145 83186 91072
12341I1072N48Q16J420L500n087m870L057J649p14k174l866q998j1170o427L996
$$ 91072 91620 92436 93856 97356 92269 87399 90456 92105 91391 89217 85351 76353 65183 58756 62752
12326F2752O259Q979j0630j0295n558k462J156j971P14R672M288o820j601p920
$$ 62752 69011 77990 67360 57065 51507 49045 50201 48230 48944 58616 62904 56084 54483 46563
12312D6563j62P707o664n807j449J949j093K45K616j091l731N934N957L687K049
$$ 46563 46401 54108 47444 41637 40188 42137 41044 41289 43905 42814 39083 45017 50974 54661 56710
12297E6710l126n166k086N430P84K098P274j545j2044p264l504m862L051K663
$$ 56710 53584 48418 46332 51762 52546 54644 61918 60373 48329 41065 37561 32699 35750 38413
12283C8413J3144j848k864O34n350n814l582K911L324j44O794O943K642q16j685
$$ 38413 51557 49709 46845 47479 42129 36315 32733 35644 38968 38824 45618 52561 55203 54387 52702
12268E2702Q32J2587J3234M752J0532Q982K878L813O658K0155L0274L4803N2882
$$ 52702 53534 66121 79355 84107 94639 103621 106499 110312 116970 137125 167399 202202 255084
12255B55084P7294J37861K35935L94483O12710O63883J19069m94093o37904m84025
$$ 255084 332378 470239 706174 1100657 1713367 2377250 2496319 2002226 1364322 880297
12245H80297k98485j72950j06150o2051m2300l9883k5542k6428j1155r024j0995
$$ 880297 581812 408862 302712 240661 198361 158478 132936 106508 95353 86329 75334
12234G5334q700k53M535J696q975j3040J473j188k484l092J205R575J3899R339
$$ 75334 66634 66381 70916 72612 63637 50597 52070 50882 48398 45306 46511 56086 69985 79324
12220G9324J7159K0634N531Q85L590j1198j3030m615r625j9547k1669p473j394
$$ 79324 96483 117117 122648 123533 127123 115925 102895 98280 88655 69108 47439 39966 38572
12207C8572L156k621l864N147k511J1017O668K778m798n134Q067M304J218J858
$$ 38572 41728 39107 35243 40390 37879 48896 55564 58342 53544 48410 56477 60781 61999 63857
12193F3857j537q390m878r71m831o096j774J814k156p875l408L42M741L585k936
$$ 63857 62320 53930 49052 48081 43250 37154 35380 37194 35038 27163 23755 24097 28838 32423 29487
12178B9487L236M895k047m958O83J735p14j073l509o773l649Q767Q009L727o177
$$ 29487 32723 37618 35571 30613 31296 33031 32317 31244 27735 20962 17313 26080 34089 37816 31639
12163C1639j0904J43N325o95p707L374L247J804M048l492r395j963l435p021j107
$$ 31639 20735 20878 26203 25508 17801 21175 24422 26226 30274 26782 17387 15424 11989 4968 3861
12148C861O40M521P810J3011N819N463K946o984p81M68l691o766q240j535Q824
$$ 3861 4501 9022 16832 29843 35662 41125 44071 37087 36306 36774 33083 26317 18077 16542 25366
12133B5366J428j138K581L079L862R893l310j659N646J298j649l469n863l230
$$ 25366 26794 25656 28237 31316 35178 45071 41761 40102 45748 47046 45397 41928 36065 32835
12119C2835K465P070n288m204k918L39J737r87N934K39Q801K292O295J188k569
$$ 32835 35300 42370 37082 32878 29960 30299 32036 31049 36983 37222 46023 48315 54610 55798 53229
12104E3229J1298J0385M697J1396K0569L6189N0348P9520J19328J49627J51187
$$ 53229 64527 74912 79609 91005 111574 147763 198111 277631 396959 546586 697773
12093F97773J37448J15493N6600k2308p9768j16356j45478j47904j35534j04421
$$ 697773 835221 950714 1007314 985006 905238 788882 643404 495500 359966 255545
12083B55545o8926m1537k4704j3705j3898j5277q047r291j0222j398M387n713
$$ 255545 186619 145082 120378 106673 92775 77498 69451 60160 49938 48540 52927 47214
12071D7214o486k113m605l475k068o653L97J389m994k890k532j802k173O309P658
$$ 47214 40728 38615 34010 30535 28467 21814 22211 23600 18606 15716 13184 11382 9209 15518 23176
12056B3176K13L245K856p85p157p584p534J4K171R81p99R771M86l993j287j041
$$ 23176 23389 26634 29490 28705 21548 13964 6430 6444 8615 9596 8797 18568 19054 15061 13774 12733
12040A2733N20n289o082k359m278J368M629J439L54L89j978l98R672M552J202
$$ 12733 13253 7964 1882 -477 -4755 -3387 1242 2681 3035 3424 1446 1048 10720 15272 16474
12025A6474M878j866l209j90m242j146K339r98l624J524k275J208M316J235N47
$$ 16474 21352 19486 16277 16087 11845 10699 13038 12040 8416 9940 7665 8873 13189 14424 14971
12010A4971o598k878n478m70N707J1076Q925o182j273M290L633j53m729K123P503
$$ 14971 8373 5495 17 -453 5254 16330 25255 19073 17800 22090 25723 25570 20841 22964 30467
11995C0467o249o407r45J988Q19m087J637j450L047l47j157o940r86n187O25M331
$$ 30467 24218 17811 16866 18854 19673 15586 17223 15773 18820 18473 17316 10376 9390 4203 4828 9159
11979I159J0816O942J1003J9807K2888K1107K0035J2859Q109j226j0517k2305
$$ 9159 19975 26917 37920 57727 80615 101722 121757 134616 142725 141499 130982 108677
11967A08677k0276j7907j8537r234o606p340p931l535j596P89j84k346m269J53
$$ 108677 88401 70494 51957 42723 36117 28777 20846 17311 15715 16504 16320 13974 9705 9858
11953I858O59n474p757M701j535K577M31n7j278l3j640m99N36O518M323m823l100
$$ 9858 10517 5043 -2714 1987 452 3029 3460 3403 2125 2092 452 -47 489 7007 11330 6507 3407
11936C407N281n233p416J731O360O20O261P235J551l290j712l175K80P44K1k671
$$ 3407 8688 3455 -3961 -2230 4130 4750 11011 18246 19797 16507 14795 11620 11900 12644 12665 9994
11920I994O54K185l49N506o967j851Q487m80n278l883r67J972j395m389k385M734
$$ 9994 10648 12833 12484 17990 11023 9172 17659 17179 11901 8018 7051 9023 7628 3239 854 5588
11904E588K303L027l788k414M882J175j855k51k422j226K91J80O431O467q878
$$ 5588 7891 10918 7130 4716 9598 10773 8918 8667 6245 5019 5310 5490 11921 18388 9510
11889I510o65p394o198k829K939M429L690K182J88p15j611j111m531m879m09O086
$$ 9510 8845 1451 -4747 -7576 -4637 -208 3482 5664 5852 5137 3526 2415 -2116 -6995 -7404 -1318
11873a318O740M11n576P6P596J84L934k796n436r22k206J29M820L437K412Q07
$$ -1318 5422 5833 257 333 7929 8113 12047 9251 3815 2893 687 816 5636 9073 11485 12292
11857A2292J816J417L028l243o439M997j486L535q97l721J099j272R5l26Q165
$$ 12292 14108 15525 18553 15310 8871 13868 12382 15917 15020 11299 12398 11126 11221 10895 19060
11842A9060M412l890j5101L481Q722J469m646j1058j661K933k449R088L438n24
$$ 19060 23472 19582 4481 7962 16684 18153 13507 2449 788 3721 1272 10360 13798 13274
11828A3274Qj807l397j0223J365N948J027n804L601O063M2r90K486l538j855o898
$$ 13274 13282 11475 8078 -2145 -780 5168 6195 391 3992 10055 10097 9107 11593 8055 6200 -698
11812f98N948n27j007r543k856N621Q50J147P911J422p598L94O781l379j289M055
$$ -698 5250 4723 3716 -5827 -8683 -3062 -2212 -1065 6846 8268 670 1064 7845 4466 3177 7232
11796G232K83K172L542q457N86N847o779k425P922j08o09j928k819L99n374k657
$$ 7232 7515 9687 13229 4772 5358 11205 4426 2001 9923 9815 9206 7278 4459 4858 -516 -3173
11780c173K336j039L911l891l172P26N326J681L200l763K06L115l505l211j515
$$ -3173 -837 -1876 2035 -1856 -5028 -4302 1024 2705 5905 2142 2348 5463 1958 -1253 -2768
11765b768L410l123L943O925K964r413m358O188N911k119l881l200N150l168m578
$$ -2768 642 -2481 1462 8387 11351 1938 -2420 3768 9679 7560 3679 479 5629 2461 -2117
11750b117j227J829O857J996n253K409J766k912n443m3J280l650L313j96L939
$$ -2117 -3344 -1515 5342 7338 2085 4494 6260 3348 -2095 -2138 -858 -4508 -1195 -1391 2548
11735B548N613k658J0495K345j424J278k033j71l612j950K602J495o478O2J717
$$ 2548 8161 5503 15998 18343 16919 18197 16164 15993 12381 10431 13033 14528 8050 8112 9829
11720I829J705m414K089M390j2j093o328j144j741l355m271M434R031P519j471
$$ 9829 11534 7120 9209 13599 13587 12494 6166 5022 3281 -74 -4345 89 9120 16639 15168
11705A5168r170j141K152L21l903N91N626j235q83n932j923L879L879M475P303
$$ 15168 5998 4857 7009 7330 3427 4018 9644 8409 7526 1594 -329 3550 7429 11904 19207
11690A9207n468o857p773L748L071J772j723N66K858L277n259n200J176R60K434
$$ 19207 13739 6882 -891 2857 5928 7700 5977 6543 9401 12678 7419 2219 3395 4355 6789
11675F789k035L242J912o316j684j104k271K379L086K760k814j96K573K300J861
$$ 6789 4754 7996 9908 3592 1908 804 -1467 912 3998 6758 3944 3748 6321 8621 10482
11660A0482p47J954K635m240N97l143m385P503J625m917m664j127J274J152N560
$$ 10482 9735 11689 14324 10084 10681 7538 3153 10656 12281 7364 2700 1573 2847 3999 9559
11645I559L109K367m016k991J280M481o487j1130K861M825Q143n485r187r38M079
$$ 9559 12668 15035 11019 8028 9308 13789 7302 -3828 -967 3858 12001 6516 -2671 -3609 470
11630D70L745m338p737m322O135J0390M231M459N356o221j013l754l212j408l517
$$ 470 4215 -123 -7860 -12182 -6047 4343 8574 13033 18389 12168 11155 7401 4189 2781 -736
11615g36O215K852n633k349J747Q985R425o927j3324K179p60K679j985j576L443
$$ -736 5479 8331 2698 349 2096 11081 20506 13579 255 2434 1674 4353 2368 792 4235
11600D235L101l35J10k961l287l40r93j69r47n507j442L232R400N040n609q36
$$ 4235 7336 7001 7111 4150 863 523 -470 -639 -1586 -7093 -8535 -5303 4097 9137 3528 2692
11584B692L985N904j927m978N34O550N886M415n586q664q64J530j646R98Q432
$$ 2692 6677 12581 10654 5676 6210 12760 18646 23061 17475 8811 7947 9477 7831 8829 17261
11569A7261K236j1215k132q78P55p794k336R02Q423M663K187n148j0210p2J217
$$ 17261 19497 8282 6150 5272 6027 -1767 -4103 -3201 5222 9885 12072 6924 -3286 -3358 -2141
11554b141J470j511m803m115m43M54O506O065M258k667n639N382L408R098k339
$$ -2141 -671 -2182 -6985 -11100 -11543 -11089 -4583 1482 5740 3073 -2566 2816 6224 15322 12983
11539A2983j892k085n596j0587N95O189L085o420m416n226N432R693M899O379
$$ 12983 11091 9006 3410 -7177 -6582 -393 2692 -3728 -8144 -13370 -7938 1755 6654 13033
11525A3033L013n818n703j051k643k164J890R9L843K221n540j0803n128N443O774
$$ 13033 16046 10228 4525 3474 831 -1333 557 656 4499 6720 1180 -9623 -14751 -9308 -2534
11510b534N55q36J0835M360j0595l079k987L018L916l289m140r0q964l299M721
$$ -2534 -1979 -2815 8020 12380 1785 -1294 -4281 -1263 2653 -636 -4776 -4866 -13830 -17129 -12408
11495a2408M950J760L188N231N036l148o351o407N660J1734L145j188j512N07
$$ -12408 -7458 -5698 -2510 2721 7757 4609 -1742 -8149 -2489 9245 12390 11202 9690 10197
11481A0197J682k253k120n762k092N545K649j318o649j087J436l102Q76N057N946
$$ 10197 11879 9626 7506 1744 -348 5197 7846 6528 -121 -1208 228 -2874 -1998 3059 9005
11466I005j207m979n624M063L129Q990M624m192n887p931K444k759n149K053j320
$$ 9005 7798 2819 -2805 1258 4387 13377 18001 13809 7922 -9 2435 -324 -5473 -3420 -4740
11451d740k906L226M868L40O768l748p005L220O663m689Q816J280K744j230p64
$$ -4740 -7646 -4420 448 788 7556 3808 -3197 23 6686 1997 10813 12093 14837 13607 12843
11436A2843k340k936K781n203M047l78N156L590o12m294p532o958O458M920M893
$$ 12843 10503 7567 10348 5145 9192 8814 13970 17560 16948 12654 5122 -1836 4622 9542 14435
11421A4435m294p95J354K138k770K448r339j24P481l786l30m294n073k79L767
$$ 14435 10141 9346 10700 12838 10068 12516 3177 3053 10534 6748 6418 2124 -2949 -3228 539
11406E39J2044M055k516j202O683L380k095j547l581j755O942p71n116k687J140
$$ 539 12583 16638 14122 12920 19603 22983 20888 19341 15760 14005 20947 20176 15060 12373 13513
11391A3513j631P1J042l292N52k162j3213l068O344N722o739P45j50j998J134
$$ 13513 11882 11953 12995 9703 10255 8093 -5120 -8188 -1844 3878 -2861 -2116 -2266 -4264 -3130
11376c130Q224J0253P046k108j1595m896J471J826k986m308o291k485K637k26
$$ -3130 5094 15347 22393 20285 8690 3794 5265 7091 4105 -203 -6494 -8979 -6342 -6568
11362f568O243L985L589K889j0455J181K906N503J0507J649l766k769l400J36
$$ -6568 -325 3660 7249 10138 -317 864 3770 9273 19780 21429 17663 14894 11494 11630
11348A1630l402K846k592l871l328n501J5P632p70k460L116Q149j38J22M935p895
$$ 11630 8228 11074 8482 4611 1283 -4218 -4203 3429 2659 199 3315 11464 11326 11448 16383 8488
11332H488j2124n836P679J1305K158k150j256J480K242j379n237k180N47j723
$$ 8488 -3636 -9472 -1793 9512 11670 9520 8264 9744 11986 10607 5370 3190 3737 2014
11318B014J352O583K169M209m075l566J234M852o34K142j918m716J555R72N22
$$ 2014 3366 9949 12118 16327 12252 8686 9920 14772 14138 16280 14362 9646 11201 12173 12695
11303A2695J169J243j787O01j358m307m299K550M431K404k733m9P342K379p470
$$ 12695 13864 15107 13320 13921 12563 8256 3957 6507 10938 13342 10609 10560 17902 20281 12811
11288A2811p043k469R392J553q186Q76o80r207n591P262L978m039J550J2093k070
$$ 12811 5768 3299 12691 14244 6058 6934 6254 -2953 -8544 -1282 2696 -1343 207 12300 10230
11273A0230J444k496K498M459m342K998K279k386O914O433K907p73L224Q511Q796
$$ 10230 11674 9178 11676 16135 11793 14791 17070 14684 21598 28031 30938 30165 33389 41900 50696
11258E0696p690j2866k432k725o93q39n63o25q070l755l466j093l037j682J905
$$ 50696 43006 30140 27708 24983 24290 23451 22888 22263 14193 10438 6972 5879 2842 1160 3065
11243C065l327j685P53M874L209K490L297J815Q177K076k357O237R035J1918J1761
$$ 3065 -262 -1947 -1194 3680 6889 9379 12676 14491 22668 24744 22387 28624 37659 49577 61338
11228F1338N094l565q002j3673p647j2097l215j510m278o342Q140J0009K740l080
$$ 61338 66432 62867 54865 41192 33545 21448 18233 16723 12445 6103 14243 24252 26992 23912
11214B3912n218n12L463K598K74l849q395k224J1605R570P224J6093J6090J6061
$$ 23912 18694 18182 21645 24243 24517 20668 12273 10049 21654 31224 38448 54541 70631 86692
11200H6692J0293r382j1636j6446j1695j3509j4143o400P363k146J312J194n902
$$ 86692 96985 87603 75967 59521 47826 34317 20174 13774 21137 18991 20303 21497 15595
11187A5595k620J690j765m668J078O46j45J242l224m410J320k746J061k878l342
$$ 15595 12975 14665 12900 8232 9310 9956 9811 11053 7829 3419 4739 1993 3054 176 -3166
11172c166n132N85M151L738R157P337K235o058m445P056P544k680p331k49n847
$$ -3166 -8298 -7713 -3562 176 9333 16670 18905 12847 8402 15458 23002 20322 12991 12742 6895
11157F895n00K239k938l083m072J257M489R5O175M995K853K476k223k489j242
$$ 6895 6395 8634 5696 2613 -1459 -202 4287 4382 10557 15552 18405 20881 18658 16169 14927
11142A4927j422j429r72l093l39jN572R661Q08p37J630p94J379j371k963P74n24
$$ 14927 13505 12076 11104 8011 7672 7671 13243 22904 23712 22975 24605 23811 25190 23819 20856 21630 21106
11125B1106p142l748M521N846M716K332j1330l292m1j863O519R827N683j275k862
$$ 21106 13964 10216 14737 20583 25299 27631 16301 13009 12968 11105 17624 27451 33134 31859 28997
11110B8997j928O184Q074J1117l420j7780m154R042l93k268j36m013m777k401
$$ 28997 27069 33253 41327 52444 49024 31244 27090 36132 35739 33471 33335 29322 24545 22144
11096B2144n297r903j62K021J849N084P425N921J1065Q557J1604j096n827R88
$$ 22144 16847 6944 6782 8803 10652 15736 23161 29082 40147 48704 60308 59212 53385 54373
11082E4373o060p566n070l958M210K653O093J431o95n947q568R41l336q22l610
$$ 54373 48313 40747 35677 31719 35929 38582 44675 46106 45411 39464 30896 31837 28501 27679 24069
11067B4069l067K141P34O024O569j503K677O183J056p684q337l762o49N463k938
$$ 24069 21002 23143 23877 29901 36470 34967 37644 43827 44883 37199 28862 25100 24451 29914 26976
11052B6976p279M19J316L052Q496k619p898J265R6O978P26L554R506O804N838
$$ 26976 19697 20116 21432 24484 32980 30361 22463 23728 23824 30802 31528 35082 44588 51392 57230
11037E7230J0954J4615J0555J2305m236j8158k1028j1800p868K13l993j912P04
$$ 57230 68184 82799 93354 105659 101423 83265 62237 50437 42569 42782 38789 36877 37581
11024C7581l589j1907M101J5536J8655K2779L5655N8167Q6969R0209O3194R58
$$ 37581 33992 22085 26186 41722 60377 83156 118811 176978 263947 354156 417350 418308
11012D18308m7878p6388o6542n1325l9381j9336k4604j3218r427j6289j1333q011
$$ 418308 370430 294042 227500 176175 136794 117458 92854 79636 70209 53920 42587 34576
11000C4576j20J527R96L408M675N542q111q008l027p173n255l123p598l308N848
$$ 34576 34456 35983 36979 40387 45062 50604 42493 34485 31458 24285 19030 15907 8309 5001 10849
10985A0849j589n754O201J0814O467l377J682Q034K368P617Q939L362n105M95
$$ 10849 9260 3506 9707 20521 26988 23611 25293 33327 35695 43312 52251 55613 50508 51003
10971E1003n780q782q904k151k603l802Q04Q466P214n464n137m283o35o556m810
$$ 51003 45223 36441 27537 25386 22783 18981 19785 28251 35465 30001 24864 20581 19946 13390 8580
10956H580O279O871j083M190P813K175j485j996M05K639L746j77L277K063P4j605
$$ 8580 14859 21730 20647 24837 32650 34825 33340 31344 31749 34388 38134 37957 41234 43297 43371 41766
10940D1766N16J584m772L659L273K452j808n213l900n961j833K798K179r050n340
$$ 41766 42282 43866 39094 42753 46026 48478 46670 41457 37557 31596 29763 32561 34740 25690 20350
10925B0350n930o756o640L86R198J3310L018q259l816N178Q221P938O90J785m39
$$ 20350 14420 7664 1024 1410 10608 23918 26936 18677 14861 20039 28260 36198 36888 38673 38234
10910C8234k275K857K062L15N53K777K772Q429R638k405L59J784Q314P690K4857
$$ 38234 35959 38816 40878 41193 41746 44523 47295 55724 65362 62957 63316 65100 73414 81104 105961
10895A05961L5110M3075N3635P9594J31783K28059L64754N15371N37500J91009
$$ 105961 141071 184146 237781 317375 449158 677217 1041971 1557342 2094842 2285851
10885B285851l11836n37916m75039l19525j97597j22116p6257n0961l4925k1036
$$ 2285851 1974015 1436099 961060 641535 443938 321822 245565 194604 159679 138643
10875A38643k0833j6194l332m722o650o439q110j1992m820K86p286n125J119P47
$$ 138643 117810 101616 98284 93562 86912 80473 72363 60371 55551 55837 48551 43426 44545 45292
10861D5292l407n273o755L87k58p529K965P444k34K641k850k85k987n174j1262
$$ 45292 41885 36612 29857 30244 29986 22457 25422 32866 32632 35273 32423 32138 29151 23977 12715
10846A2715j1167P094N530K982k67N286K577k686n795L986j661O27Q679l860l493
$$ 12715 1548 8642 14172 17154 16887 22173 24750 22064 16269 20255 18594 19221 27900 24040 20547
10831B0547m910j345o08m418m744N48P248J445l692r675o454n21R151k062P56
$$ 20547 15637 14292 13684 9266 4522 5070 12318 13763 10071 396 -6058 -6579 2572 510 1266
10816A266L548k348J732Q418N377j608l866m58M72O737P611l177l662p25l395
$$ 1266 4814 2466 4198 12616 17993 16385 12519 12061 12533 19270 26881 23704 20042 19317 15922
10801A5922l46l718l401M59O133M401l551l953m50m32j234N635K018L463l133
$$ 15922 15576 11858 8457 8916 15049 19450 15899 11946 11496 11064 9830 15465 17483 20946 17813
10786A7813p34o575l343J99J0363J1995J3879K293p018n981j0512j2430j4263
$$ 17813 17079 10504 7161 7360 17723 29718 43597 45890 38872 32891 22379 9949 -4314
10773d314k5091k7419m6404m3477o538L7378N3850M9187K8415J4157J2995N136
$$ -4314 -29405 -56824 -103228 -146705 -153243 -115865 -62015 -12828 15587 29744 42739 47875
10761D7875q366p532R769J0982J490n070N293O568L913p336j1497j2358p532O38
$$ 47875 39509 31977 41746 52728 54218 49148 54441 61009 64922 57586 46089 33731 26199 26837
10747B6837J551o23N70k774k325KO33K35p722O04L673o17l484P023J0084J4080
$$ 26837 28388 27765 28335 25561 23236 23238 23871 24106 16384 16988 20661 20044 16560 23583 33667 47747
10731D7747Q829J445M490O350J9399L0966K4630J1982J5148K0391J3973M702p638
$$ 47747 56576 58021 62511 68861 88260 119226 143856 155838 170986 191377 205350 210052 202414
10718B02414j2460j1538P797J2763o430k1867l0547l1961k4667j3055o121n403
$$ 202414 189954 178416 186213 198976 192546 170679 140132 108171 83504 70449 64328 58925
10706E8925j2075p925k122n411K834O422L869M463L238Q548M567j4395j3758J264
$$ 58925 46850 38925 36803 31392 34226 40648 44517 48980 52218 60766 65333 50938 37180 38444
10692C8444M606L505K578M467L369K402K816P064P401m93l489n949n320J652j723
$$ 38444 43050 46555 49133 53600 56969 59371 62187 69251 76652 76159 72670 66721 61401 63053 61330
10677F1330n254N795O794k54k299p188m094l25K320O086L44J733L802K861N396
$$ 61330 56076 61871 68665 68411 66112 58924 54830 54505 56825 62911 63255 64988 68790 71651 77047
10662G7047k283n667j3082o945n320p18O430l55j0866j3292j1329k973j323N890
$$ 77047 74764 69097 56015 49070 43750 43032 49462 49107 38241 24949 13620 10647 9324 15214
10648A5214Q78J4240J9390J1065J3679J6974K1072J8024l342j4710n441N97J706
$$ 15214 16092 30332 49722 60787 74466 91440 112512 130536 127194 112484 107043 107640 109346
10635A09346R139J4494K635l565o261q352J2494J6141J1199J1899R711k081l691
$$ 109346 118485 132979 135614 132049 125788 117436 129930 146071 157270 169169 178880 176799 173108
10622A73108P582R407k646l7669o8674p0627m0234K344J0112J3825J9093R228
$$ 173108 180690 190097 187451 149782 81108 10481 -29753 -27409 -17297 -3472 15621 24849
10610B4849M486K536J0151j701m89K409J7599K1756K0970K3318M6375P1240Q8470
$$ 24849 29335 31871 42022 40321 39832 42241 59840 81596 102566 125884 172259 243499 331969
10597C31969Q4358Q5556J11158R4787L9002j6441o1952j25055j63863j59015j07133
$$ 331969 416327 501883 613041 707828 746830 730389 668437 543382 379519 220504 113371
10586A13371o6534l5678j2169J610J7156J7345J5844M372m023j835J616N35l643
$$ 113371 46837 11159 -1010 600 17756 35101 50945 55317 51294 49459 51075 51610 47967
10573D7967o353o42q196m494L005R583N955J4359K8621L7846K7783J3915P207
$$ 47967 41614 40972 32776 28282 31287 40870 46825 61184 89805 127651 155434 169349 176556
10560A76556m31j3342k6187j4638k056R514J9545J2937o199j2386j2992j3401
$$ 176556 176125 162783 136596 121958 119902 129416 148961 161898 155699 143313 130321 116920
10548A16920p068n191J2066J9230J9808J8543J9295J3146J7972J6346p37o625
$$ 116920 109852 104661 116727 135957 155765 174308 193603 206749 224721 241067 240330 233705
10536B33705K16P461K5278K0263J3351K1163J2275j4069r816p901n753J777K068
$$ 233705 233921 241382 266660 286923 300274 321437 333712 319643 309827 301926 296173 297950 300018
10523C00018J3001K9895L2224K8032L3172L6223L8232L8342M3941L0005J0572
$$ 300018 313019 342914 375138 403170 436342 472565 510797 549139 593080 623085 633657
10512F33657K0278L0999L9994N8526O3622N9857L8358M7408Q3822J22089J84365
$$ 633657 653935 684934 724928 783454 847076 906933 945291 992699 1076521 1198610 1382975
10501A382975K06532J03783J527q229M5336J00537J47371J80795K00991K36054
$$ 1382975 1589507 1693290 1694817 1686588 1731924 1832461 1979832 2160627 2361618 2597672
10491B597672K72971L10694L89069N53506P80773R45941Q25018N21639M57151
$$ 2597672 2870643 3181337 3570406 4123912 4904685 5850626 6675644 7197283 7654434
10482G654434O61271R17623J152885J424380J743703K297790L407657N291508
$$ 7654434 8315705 9233328 10386213 11810593 13554296 15852086 19259743 24551251
10474B4551251Q188971J2690476K0359446L3440121N3454245Q0406528J03271178
$$ 24551251 32740222 45430698 65790144 99230265 152684510 233091038 336362216
10467C36362216P8493402p439993q0720617r8006476p7369615n0368561l1003512
$$ 336362216 414855618 407415625 326695008 228688532 151318917 100950356 69946844
10460F9946844j9205418j2278785q291004o075150m704787l608607k656803j893514
$$ 69946844 50741426 38462641 30171637 24096487 19391700 15783093 13126290 11232776
10452A1232776j280975p46470l04529p005q3058n74811r89966j060348r17437
$$ 11232776 9951801 9205331 8900802 8893797 8810739 8235928 7245962 6185614 5268177
10443E268177p17949n36888l95640k98968k41420j87376j62402j43692j42688
$$ 5268177 4550228 4013340 3617700 3318732 3077312 2889936 2727534 2583842 2441154
10434B441154j45105j48885j32768j06827p8467p8984j01384j13035r2538o2823
$$ 2441154 2296049 2147164 2014396 1907569 1829102 1750118 1648734 1535699 1443161 1380338
10424A380338m8351n4797o3591n3003n0445m8997l7172l3204k5912k4752k3486
$$ 1380338 1331987 1277190 1213599 1160596 1110151 1061154 1023982 990778 964866 940114 916628
10413I16628j7583q244q81j2100k2605m4477m0119l6338m4493m0180k3215j8586
$$ 916628 899045 890801 889920 877820 855215 810738 770619 734281 689788 649608 626393 607807
10401F07807p134J546q575j3427k1508k6496k3697j3019k478L885j165m535j023
$$ 607807 600673 602219 593644 580217 558709 532213 508516 495497 493019 496904 495739 491204 490181
10388D90181p95L263J216o373k5060k6591k6356k1959k692k21J904r475j0994
$$ 490181 489386 492649 493865 487492 462432 435841 409485 387526 384834 384613 386517 377042 366048
10375C66048k1727l0504k1686j3744k316R751K2196K8541K2655R456J189l927
$$ 366048 344321 313817 292131 278387 276071 285822 308018 336559 359214 368670 369859 365932
10363C65932M434L599p733k1226j9230j2280l830o047J624j378l148R408J5224
$$ 365932 370366 373965 366232 345006 325776 313496 309666 303619 305243 303865 300717 310125 325349
10350C25349K0776J7511J6143J0182R344m082J382M297k0013r4084j64079j29377
$$ 325349 346125 363636 379779 389961 399305 395223 396605 400902 380889 286805 122726 -6651
10338f651n4555Q562M7985M9665L1164L0541J9674J4014J7815J7446N321j955
$$ -6651 -61206 -52644 -4659 45006 76170 106711 126385 140399 158214 175660 180981 179026
10326A79026O073N984O66J406O406P740J0019P821O970j2529m9791p5253o8935
$$ 179026 185099 191083 191749 193155 199561 207301 217320 225141 232111 219582 169791 94538 25603
10313B5603l6542n428J0555L811K26R175K2234J2254J0810O973r86j5088j3144
$$ 25603 -10939 -16367 -5812 -2001 -1775 7400 29634 41888 52698 59671 58685 43597 30453
10300C0453r397k932R412K0186J7648N379k301k393O563J0620N376J1279J265
$$ 30453 21056 18124 27536 47722 65370 70749 68448 66055 72618 83238 88614 99893 101158
10287A01158m85Q803J1403J2630r69p785l417j0708k0572o016M590Q090q63q225
$$ 101158 100673 109476 120879 133509 132540 124755 121338 110630 90058 84042 88632 96722 95859 87634
10273H7634j5762k0713j2332m745L283M748j47L521R522L843Q356O965k990n690
$$ 87634 71872 51159 38827 34082 37365 42113 41966 45487 55009 58852 67208 74173 71183 65493
10259F5493j4559p167K162O200K7m17o081m612q81N309L385M6K201j267j282j419
$$ 65493 50934 43767 45929 52129 52156 51739 45658 41046 40165 45474 48859 48905 51106 49839 48557 47138
10243D7138K481K212J1705N610L294p395q073m853J758K059N125J259l23l892
$$ 47138 49619 51831 63536 69146 72440 65045 56972 52119 53877 55936 61061 62320 61997 58105
10229E8105P58P79j890l722n896k953P52Q223O160M182L980M89M888L487p16n849
$$ 58105 58863 59642 57752 54030 48134 45181 45933 54156 60316 64498 68478 68967 73855 77342 76626 70777
10213G0777k914J046p049l806l030l573L517Q391K582l710l751R78k685P869N484
$$ 70777 67863 68909 61860 58054 55024 51451 54968 63359 65941 62231 58480 59458 56773 64642 70126
10198G0126O270p76l243O38J182k268j624n571p207Q37N029K645k514n369M241
$$ 70126 76396 75620 72377 73015 74197 71929 70305 64734 57527 58364 63393 66038 63524 58155 62396
10183F2396N310j992K129P850R657J2952L2117M1181O9672R8626J17917Q8996
$$ 62396 67706 65714 67843 75693 85350 98302 130419 171600 241272 339898 457815 546811
10171E46811O1031P6597J19154O8001k2410n4801k3154l4325j09326j45963j38392
$$ 546811 607842 684439 803593 871594 849184 794383 771229 736904 627578 481615 343223
10160C43223j04388o3502l2790j9196p232n124m62P226J1603K3906J4480p000
$$ 343223 238835 175333 142543 123347 116115 110991 110529 117755 129358 153264 167744 160744
10148A60744k1939k5112j2277j0003o719j3061j0774m25j570L84n802L697n758
$$ 160744 138805 113693 101416 91413 84694 71633 60859 60434 58864 59248 53446 57143 51385
10135E1385l633M423m801n706L301N574L472j75k372n021k474L672p39l784l292
$$ 51385 47752 52175 47374 41668 44969 50543 54015 53840 51468 46447 43973 47645 46906 43122 39830
10120C9830J99M406j892p149J814L501L929L099j342m893n83L914k833K842p61
$$ 39830 40029 44435 42543 35394 37208 40709 44638 47737 46395 41502 40919 44833 42000 44842 44081
10105D4081l172n404m16N405K906l528L20Q7k178j583P04M927P950L150M874Q886
$$ 44081 40909 35505 35089 40494 43400 39872 40192 40279 38101 36518 37222 42149 50099 53249 58123 67009
10089F7009J6221K5128L5332N4068O6734J04012J12498O2339k8767q9456j12467
$$ 67009 83230 108358 143690 197758 264492 368504 481002 543341 514574 425118 312651
10078C12651r8059n5415l0434k6923j4362p164o409k945Q475l458q913o604k512
$$ 312651 214592 159177 128743 101820 87458 80294 73885 70940 79415 75957 67044 60440 57928
10065E7928Q071J1656k84R05l905j545n740m480P713L447N619Q470K506J2979
$$ 57928 65999 77655 77371 78276 74371 72826 67086 62606 70319 73766 79385 87855 90361 103340
10051A03340J2778J1761L4271M7708O4130J09113J81366K88863M38329N52154
$$ 103340 116118 127879 162150 209858 273988 383101 564467 853330 1291659 1843813
10041A843813M13789p2993m67656n23870l92252k53674j53497r2847o3869m8924
$$ 1843813 2257602 2184609 1716953 1193083 800831 547157 393660 300813 236944 188020
10031A88020l0850j9257j2766o233j7574j1181l298L04j696n769k22j342m919
$$ 188020 157170 137913 125147 118914 101340 90159 86861 87165 85469 79700 79478 78136 73217
10018G3217l989r834q035l609j537M655m050o075j747j594J279L027M016J518
$$ 73217 69228 59394 51359 47750 46213 50868 46818 40743 38996 37402 38681 41708 45724 47242
10004D7242n341k601N686O05m925k972m093J477J467J025j454O82j228n918j508
$$ 47242 41901 39300 44986 45591 40666 37694 33601 35078 36545 37570 36116 36798 35570 29652 28144
9989B8144J0695N204q223j129L223J21q085k237j287l001K341K787O456K875k318
$$ 28144 38839 44043 35820 34691 37914 38035 29950 27713 26426 23425 25766 28553 35009 37884 35566
9974C5566p89n14p14j006L227K557j524o253l109q77M187K840n465m713L16r34
$$ 35566 34777 34263 33549 32543 35770 38327 36803 30550 27441 26564 30751 33591 28126 23413 23729 22795
9958B2795M623K061J841N499j005M96L768O77R91K222Q586P300J9985J8173J0287
$$ 22795 27418 29479 31320 36819 35814 36310 40078 40755 41746 43968 52554 59854 79839 98012 108299
9943A08299M831j525j3606r769j5428j2490j0993m625o622r569O59K202m910k954
$$ 108299 113130 111605 97999 88230 72802 60312 49319 44694 38072 28503 29162 31364 26454 23500
9929B3500M526L473K991q225l410k062M278O904r88M0K83J845L84J2161Q20k751
$$ 23500 28026 31499 34490 26265 22855 20793 25071 31975 30987 31027 31310 33155 33539 45700 46520 43769
9913D3769l511m807m375r081m679m796L161M970J210j094j090N671L158n508j512
$$ 43769 40258 35451 31076 21995 17316 12520 15681 20651 21861 20767 19677 25348 28506 22998 21486
9898B1486M379L362K630Q303j255o835m950P43q193k483N442N906n282n694M258
$$ 21486 25865 29227 31857 40160 38905 32070 27120 27863 19670 17187 22629 28535 23253 17559 21817
9883B1817J0574N130k906J986L699N191Q71L460l982N90l626j173j924k204n385
$$ 21817 32391 37521 34615 36601 40300 45491 46362 49822 45840 46430 42804 41631 39707 37503 32118
9868C2118j911o872j825k802l371K23k201P457R759K240o45r04l472l042k309
$$ 32118 30207 23335 21510 18708 15337 15560 13359 20816 30575 32815 32170 31266 27794 24752 22443
9853B2443O094O03l133O503R623K429k262J282k665j3026j1848N299N241K281
$$ 22443 28537 29140 26007 32510 42133 44562 42300 43582 40917 27891 16043 21342 26583 28864
9839B8864k913m565L464j66L74M428L72J554m37L24q073q973K819P623M313k228
$$ 28864 25951 21386 24850 24684 25058 29486 29858 31412 30975 31299 23226 14253 17072 24695 29008 26780
9823B6780j042j555L723O740j020j767O706M946N563O665J2627J0211J1566J0068
$$ 26780 25738 24183 27906 34646 33626 31859 38565 43511 49074 55739 68366 78577 90143 100211
9809A00211K2607M2240P7927J29217J32505N9582o3884j30477j21585p8859l9863
$$ 100211 122818 165058 242985 372202 504707 564289 500405 369928 248343 169484 129621
9798A29621k3816j9761j0036k457p948m170l978j0337j367n90J046Q443J055L435
$$ 129621 105805 86044 76008 73551 65603 61433 57455 47118 45751 45161 46207 54650 55705 59140
9784E9140L147k208Q32O963K774j69m83M627N972J2738M501P370Q033J4635J5750
$$ 59140 62287 60079 60911 67874 70648 70479 69996 74623 80595 93333 97834 105204 113237 127872 143622
9769A43622J8700K8491L2103J2022p375P222K9037L6652M5348L6206M3988N3945
$$ 143622 162322 190813 222916 234938 227563 234785 263822 300474 345822 382028 426016 479961
9757D79961Q1475J26242K01042L01032M65330P67992J288319K078066L237187
$$ 479961 561436 687678 888720 1189752 1655082 2423074 3711393 5789459 9026646
9748I026646M415256K525133k040359l980052l462366k257631j365319q24978
$$ 9026646 13441902 15967035 13926676 9946624 6484258 4226627 2861308 2036330
9740B036330n22515l39816k30702j82891j40028j01445p9196n7906m0513k4171
$$ 2036330 1513815 1173999 943297 760406 620378 518933 439737 381831 341318 317147
9730C17147j7589j9198p809L133L295j2990l1174l8337k9095j9951j3227r732
$$ 317147 299558 280360 272551 275684 278979 265989 234815 196478 167383 147432 134205 124473
9718A24473p294o553m680j846r017k581O52q956q375m372J978k38p863J33k254
$$ 124473 117179 110626 105946 104100 95083 92502 93154 84198 75823 71451 73429 73191 65328 65461 63207
9703F3207j1727j562q66k22N701Q898R307n908n283L135n937n773M746J40r889
$$ 63207 51480 49918 49052 48830 54531 63429 72736 66828 61545 64680 58743 52970 57716 57856 47967
9688D7967p396N318O950J564J427R144J37o266k215j824k886l361k230Q52P195
$$ 47967 40571 45889 52839 54403 55830 64974 65111 58845 56630 54806 51920 48559 46329 47181 54376
9673E4376o35m435K260J389K22l461j098q21J442K061m563l415m416l787k176
$$ 54376 53741 49306 51566 52955 53177 49716 48618 47797 49239 51300 46737 43322 38906 35119 32943
9658C2943N205m771l028P26L114k359J532N874J408o92L265M009L071j749q004
$$ 32943 38148 33377 30349 31075 34189 31830 33362 39236 40644 39952 43217 47226 50297 48548 40544
9643D0544o990k496K71Q152O678l282j990l353l338m747o91J339L405l122J745
$$ 40544 33554 31058 31329 39481 46159 42877 40887 37534 34196 29449 28758 30097 33502 30380 32125
9628C2125J2102j3j531J000l749j428p360k377r05o793l910L09M106P790j843
$$ 32125 44227 44214 42683 43683 39934 38506 31146 28769 27864 21071 17161 17470 21576 29366 27523
9613B7523j934j914O456J2576L845L59n319m340q182o29Q209l21k646L374M464
$$ 27523 25589 23675 30131 42707 46552 46911 41592 37252 29070 28441 36650 36329 33683 37057 41521
9598D1521k995K890P168j1443j5171o090L709Q971J105r799J631M314L038N791
$$ 41521 38526 41416 48584 37141 21970 15880 19589 28560 29665 19866 21497 25811 28849 34640
9584C4640N374K180m825q703n448L079o2k0L150j580L258M286m404m859R187N603
$$ 34640 40014 42194 37369 28666 23218 26297 26235 26215 29365 27785 31043 35329 30925 26066 35253 40856
9568D0856L530m089m315k558L156M921O334P876j945k732r308o802P886K167o262
$$ 40856 44386 40297 35982 33424 36580 41501 47835 55711 53766 51034 41726 34924 42810 44977 38715
9553C8715p567n828M726N998o56L122L424m011K824o74l291P43P264n839k942
$$ 38715 31148 25320 30046 36044 35388 38510 41934 37923 40747 40073 36782 37525 44789 38950 36008
9538C6008K004l371k842l678j584j827l039P952L466j234O959P044Q492M24q397
$$ 36008 38012 34641 31799 28121 26537 24710 21671 29623 33089 31855 38814 45858 54350 54774 46377
9523D6377n701M064N438Q449J03p871j353k431o829k929K646k647M496L629N85
$$ 46377 40676 44740 50178 58627 58730 50859 49506 47075 40246 37317 39963 37316 41812 45441 46026
9508D6026o766J407M204n416M35N960M037L272L129J021J104j96L176R671l678
$$ 46026 39260 40667 44871 39455 39890 45850 49887 53159 56288 57309 58413 58217 61393 71064 67386
9493F7386N119Q316N69N978M283J543j077M420N036m108L960K879m701K184L68
$$ 67386 72505 80821 81390 87368 91651 93194 92117 96537 101573 97465 101425 104304 99603 101787 102155
9478A02155J08M10n547j544J420L970l241m547m792m670k955q32k768n6N969N729
$$ 102155 102263 102673 97126 95582 97002 100972 97731 93184 88392 83722 80767 79935 77167 77111 83080 88809
9462H8809k891l820R49O721j414n633n988o705J657P669M505o801P260L350n514
$$ 88809 85918 82098 83047 89768 88354 82721 76733 70028 71685 79354 83859 77058 84318 87668 82154
9447H2154p071j811N332J2200N674n278J72K837n898k403L825N69p6l282j596
$$ 82154 75083 73272 78604 90804 96478 91200 91372 94209 88311 85908 89733 90302 90226 86944 85348
9432H5348O296N367p65L344n583n743K793K287J204k536j789K518N447N682L14
$$ 85348 91644 97011 96246 99590 94007 88264 91057 93344 94548 92012 90223 92741 98188 103870 104184
9417A04184q110j927J0757P716n340k341K778O40K664J308j078J052K315J1207
$$ 104184 96074 94147 104904 112620 107280 104939 107717 108357 111021 112329 111251 112303 114618 125825
9403A25825N536j086Q280P09q94j509N958M089J256K492o25Q87L390n756L51m094
$$ 125825 131361 130275 138555 139264 138370 136861 142819 146908 148164 150656 150031 150918 154308 148552 148903 144809
9387A44809J240R113J094J819M795o52o456q308j854N522L936M480O226K379l769
$$ 144809 146049 155162 156256 158075 162870 162218 155762 147454 145600 151122 155058 159538 165764 168143 164374
9372A64374N115R474N878J235O367Q436J1888J3118P073Q956O269M928L765O003
$$ 164374 169489 178963 184841 186076 192443 200879 212767 225885 232958 241914 248183 253111 256876 262879
9358B62879Q879O459P225J430J784L329o079r883l143q53j01m200k564J255P225
$$ 262879 271758 278217 285442 286872 288656 291985 285906 276023 272880 272027 271926 267726 265162 266417 273642
9343B73642O452M598R942K5060K7520L012j4208j1726j0855q088K220M263R9O290
$$ 273642 280094 284692 294634 319694 347214 350226 336018 324292 313437 305349 307569 311832 311931 318221
9329C18221N154K91O958P224P867R83Q158J1826P926M570K208J2872P603M333
$$ 318221 323375 323666 330624 337848 345715 346698 354856 366682 374608 379178 381386 394258 401861 406194
9315D06194J1727J4265J1388L119J0323J4827M456J0886K4063K0480R245R904
$$ 406194 417921 432186 443574 446693 457016 471843 476299 487185 511248 531728 540973 550877
9303E50877K4810K0348J5593J4706J1789K2442K7382K1968J7920K5309K9168K8359
$$ 550877 575687 596035 611628 626334 638123 660565 687947 709915 727835 753144 782312 810671
9291H10671K9407J5857K0825L7478L6332L8056L1971L2731N2223N1059M6594M3536
$$ 810671 840078 855935 876760 914238 950570 988626 1020597 1053328 1105551 1156610 1203204 1246740
9279A246740M9851N2429O3039N8658O9875P1965P9577Q4140R5232R6558R9051
$$ 1246740 1296591 1349020 1412059 1470717 1540592 1612557 1692134 1776274 1871506 1968064 2067115
9268B067115J12165J23835J25765J31570J54057J70088J82832K00526K21655K50976
$$ 2067115 2179280 2303115 2428880 2560450 2714507 2884595 3067427 3267953 3489608 3740584
9258C740584K74951L01752L33575L67467M18242M77358N34930N97537O80279P81323
$$ 3740584 4015535 4317287 4650862 5018329 5436571 5913929 6448859 7046396 7726675 8507998
9248H507998Q89247J011400J165254J337447J516891J716093J926487K140314
$$ 8507998 9397245 10408645 11573899 12911346 14428237 16144330 18070817 20211131
9240B0211131K351983K533593K694981K814177K884129K881827K760106K463921
$$ 20211131 22563114 25096707 27791688 30605865 33489994 36371821 39131927 41595848
9232D1595848J935534J169719K06406q18590j793365k568508l084985l334059
$$ 41595848 43531382 44701101 44907507 44088917 42295552 39727044 36642059 33308000
9224C3308000l346739l200731k953275k655478k351856k057703j792767j554318
$$ 33308000 29961261 26760530 23807255 21151777 18799921 16742218 14949451 13395133
9216A3395133j347569j164416j021387q90998p79211o83586o09917n42861m85319
$$ 13395133 12047564 10883148 9861761 8970763 8191552 7507966 6898049 6355188 5869869
9207E869869m29899l94688l48803l15445k82670k66578k32187k04047j96136j73659
$$ 5869869 5439970 5045282 4696479 4381034 4098364 3831786 3599599 3395552 3199416 3025757
9197C025757j70974j45109j31757j24296j24400j17382r8898q9534q8854q4367
$$ 3025757 2854783 2709674 2577917 2453621 2329221 2211839 2112941 2023407 1934553 1850186
9187A850186q0287p5403o6374o4127o0879o2472n9455n0864n1180m2325l6856
$$ 1850186 1769899 1694496 1628122 1563995 1503116 1440644 1381189 1330325 1279145 1236820 1199964
9176A199964l9451m4718m3113l5407k8516k4211k8184k8264l1317k2031k2286
$$ 1199964 1160513 1115795 1072682 1037275 1008759 984548 956364 928100 896783 874752 852466
9165H52466k4921k4734k3595k3578j9368j9703j7224j5144r669j2415j3746j7692
$$ 852466 827545 802811 779216 755638 736270 716567 699343 684199 674530 662115 648369 630677
9153F30677k0801j3613j8001j8596j5670j2266j1357j2426p272o145j3578j2579
$$ 630677 609876 596263 578262 559666 543996 531730 520373 507947 500675 494530 480952 468373
9141D68373j4816q631j2154p738o322o724m646o104r061n902m697j0000m855l302
$$ 468373 453557 444926 432772 425034 418712 411988 407342 401238 392177 386275 381578 371578 366723 363421
9127C63421p18p706k367j212o260j0981n350l794o915o946m689p955k014J679
$$ 363421 362703 354997 352630 351418 345158 334177 328827 325033 318118 311172 306483 298528 296514 298193
9113B98193K47l437q854l982m415m008j125p553j3335j2400r448m156q128k501
$$ 298193 298440 295003 286149 282167 277752 273744 272619 265066 251731 239331 229883 225727 217599 215098
9099B15098J818q119j848o84M712N206o096j5516p248O024O456k358o086p624
$$ 215098 216916 208797 206949 206265 210977 216183 210087 194571 187323 193347 199803 197445 191359 183735
9085A83735J71o012n815K592J41l934q627k925q316j423p032r762n666J395L335
$$ 183735 183906 177894 172079 174671 174812 170878 162251 159326 151010 149587 142555 132793 127127 128522 131857
9070A31857j486l191J096p828p440O68Q994M374n684r838l469N428J065k810N928
$$ 131857 130371 127180 128276 120448 113008 113676 122670 127044 121360 111522 108053 113481 114546 111736 117664
9055A17664M294n095k07J176q583N64J0937K030m310K069k783k788o240p01n852
$$ 117664 121958 116863 116656 117832 109249 109813 120750 122780 118470 120539 117756 114968 108728 108027 102175
9040A02175p672K65J052k034j031O230J0843n826j2687J031M983K410l586j998
$$ 102175 94503 94768 95820 93786 92755 98985 109828 104002 91315 92346 97329 99739 96153 94155
9026I4155J872k845k895o778J176L299o188m018k079O74Q18p75k288O50M292P00
$$ 94155 96027 93182 90287 83509 84685 87984 81796 77778 75699 76373 77191 76416 74128 74778 79070 79770
9010G9770K779J926m925q849p639p02J759M038K970j360R23K368J11P54Q353r11
$$ 79770 82549 84475 79550 70701 63062 62360 64119 68157 71127 69767 70690 73058 73169 73923 82276 81365
8994H1365l954J821n891j035l910l41j577p327N150O046M220K112N48n627n48
$$ 81365 77411 79232 73341 72306 68396 68055 66478 59151 64301 70347 74567 76679 77227 71600 71052
8979G1052m825m538Q109M717J075L135q230j56N762J284j286K27N15J244M673
$$ 71052 66227 61689 69798 74515 75590 78725 70495 70339 76101 77385 76099 76326 76841 78085 82758
8964H2758O294J538K682p935j4918n042j549j723l987o166O203k708p836j200
$$ 82758 89052 90590 93272 85337 70419 65377 63828 62105 58118 51952 58155 55447 47611 46411
8950D6411R70K578j126J818L791l685l32k581L022L639k398P330j476J625J911
$$ 46411 47381 49959 48833 50651 54442 50757 50425 47844 50866 54505 52107 59437 57961 59586 61497
8935F1497J465j67P84J68l005m103M467P55o48k210L651L099m521q988l108P34
$$ 61497 62962 62795 63579 63747 60742 56639 61106 61861 61213 59003 62654 65753 61232 52244 49136 49870
8919D9870p0K511M287N768j428j2288m41j61K427M228o047o522m5L692O48l043
$$ 49870 49800 52311 56598 62366 60938 48650 48209 48048 50475 54703 48656 42134 42089 45781 46429 43386
8903D3386O024m605p434M758N149j695J352K354J534J621L581J763q912j1391
$$ 43386 49410 44805 37371 42129 47278 45583 46935 49289 50823 52444 56025 57788 48876 37485
8889C7485m74J1947n622N329k302l911j481K598O916J3899O852n606r998k824
$$ 37485 37011 48958 43336 48665 46363 42452 40971 43569 50485 64384 71236 65630 55632 52808
8875E2808J830l058J385N992M265j86J176l293N828K225P299O442Q327M247L258
$$ 52808 54638 51580 52965 58957 63222 63036 64212 60919 66747 68972 76271 82713 91040 95287 98545
8860I8545Q08J0882J4842J3926J7198K4108K5815K8941L0735L3299M0616M6074
$$ 98545 99353 110235 125077 139003 156201 180309 206124 235065 265800 299099 339715 385789
8848C85789L8680M1365O2731J24583J98943L14204M97533P90581J203062J653647
$$ 385789 424469 465834 528565 653148 852091 1166295 1663828 2454409 3657471 5311118
8838E311118J561788J57103j271344j646493j319193q78451n50257l49696k20937
$$ 5311118 6872906 7030009 5758665 4112172 2792979 1914528 1364271 1014575 793638
8829G93638j39613j03569p2360n0363m9824m6816l6568k4271k2439k0134k2674
$$ 793638 654025 550456 478096 427733 377909 331093 294525 270254 247815 227681 205007
8818B05007l0495j9844j1449j2753j9147o787J022L71N06o881j794n994j1715
$$ 205007 174512 154668 143219 130466 111319 104532 105554 105925 106431 99550 97756 91762 80047
8805H0047j3589k529K588P8J546m795m992K997p06m57J671m101j575p65K756n760
$$ 80047 66458 63929 66517 66595 68141 63346 58354 61351 60645 60188 61859 57758 56183 55418 58174 52414
8789E2414n635k581J700n045m347j04J948J966n324j903J513J706J304K861o467
$$ 52414 46779 44198 45898 40853 36506 36402 38350 40316 34992 33089 34602 36308 37612 40473 34006
8774C4006m418K031L833q27n260l55M537J252q67R58L064J382q51L313n225j458
$$ 34006 29588 31619 35452 34625 29365 29010 33547 34799 33932 34890 37954 39336 38485 41798 36573 35115
8758C5115N190J725P05O56J872l302o702j374j616J318J80k761K445p230l638
$$ 35115 40305 42030 42735 43391 45263 41961 35259 33885 32269 33587 33767 31006 33451 26221 22583
8743B2583J728Q266L982j167j408m340j141m853M352r36m238J529N1k005l087
$$ 22583 24311 32577 36559 35392 33984 29644 28503 23650 28002 27066 22828 24357 24408 22403 19316
8728A9316K488m57j990k786j754K569J347J885M704m119j25j930k17J703K868
$$ 19316 21804 21347 19357 16571 14817 17386 18733 20618 25322 21203 21078 19148 18931 20634 23502
8713B3502L366k588j0814K455O012N520M681J540m682K043k220k455J369M037
$$ 23502 26868 24280 13466 15921 21933 27453 32134 33674 28992 31035 28815 26360 27729 31766
8699C1766j419q107k147k92N765K380N668M369j848j879k017R44k781q32J423
$$ 31766 30347 22240 20093 19801 25566 27946 33614 37983 36135 34256 32239 33183 30402 29570 30993
8684C0993k442k210M545k301j98Q44n47j0854o650P837Q931q180m839Q11O438
$$ 30993 28551 26341 30886 28585 28387 29231 28684 17830 11180 19017 27948 19768 14929 15740 22178
8669B2178r25k426O21M251J597K797J173p911l939K805J0035j366l289j230j735
$$ 22178 21253 18827 19448 23699 25296 28093 29266 21355 17416 20221 30256 28890 25601 24371 22636
8654B2636k812l84j535o649O11j038M687O683M595M974J550L187j795J56j293
$$ 22636 19824 19440 17905 11256 11867 10829 15516 22199 26794 31768 33318 36505 34710 34866 33573
8639C3573J316q916n866P144O035j25O51k380l011R08j880m810m333k18M487O010
$$ 33573 34889 25973 20107 27251 33286 33161 33812 31432 28421 29329 27449 22639 18306 18088 22575 28585
8623B8585Q728k611m405n341K453N204K694K759k692L42p58J0532J3226J0181
$$ 28585 37313 34702 30297 24956 27409 32613 35307 38066 35374 35716 34958 45490 58716 68897
8609F8897K4376M5127K9232j3583l1407l1797k3250j2228j4472q271R62m297n021
$$ 68897 93273 138400 167632 154049 122642 90845 67595 55367 40895 32624 33586 29289 24268
8596B4268K26j801l476k578K290N873N782j367m319k13L39L529j563N921m413
$$ 24268 24494 22693 19217 16639 18929 24802 30584 29217 24898 24685 25024 28553 26990 32911 28498
8581B8498J846N233J907j86k270l096j478N621L961m675N451Q563J1324R001P728
$$ 28498 30344 35577 37484 37298 35028 31932 30454 36075 40036 35361 40812 49375 60699 69700 77428
8566G7428J3640L4559N8962P3187O7922j8670p4834p0832m2759k1874j3068j2641
$$ 77428 91068 125627 184589 257776 325698 307028 232194 161362 118603 96729 83661 71020
8554G1020r193p069r810o616r636R0n6M912K626r671m483o013Q769N198K391L02
$$ 71020 61827 54758 44948 38332 28696 28786 28730 33642 36268 26597 22114 16101 24870 30068 32459 32761
8538C2761R76p83l36N474k319r054j1149M575P609M026m119o548q503j126Q645
$$ 32761 33737 32954 32618 38092 35773 26719 15570 20145 27754 31780 27661 21113 12610 11484 20129
8523B0129R036J0617J0487J3044K0128K8778L6220M743k8641l3828k2832j8676
$$ 20129 29165 39782 50269 63313 83441 112219 148439 153182 124541 90713 67881 49205
8511D9205r918n469m378r90j771N710M415n918k773q05m117J514N189O85j810
$$ 49205 39287 33818 29440 28450 26679 32389 36804 30886 28113 27308 23191 24705 29894 30579 28769
8496B8769k002n923N022j471r347m921K28j662L945R476k908Q845L941K280J504
$$ 28769 26767 20844 25866 24395 15048 10127 10355 8693 12638 22114 19206 28051 31992 34272 35776
8481C5776n376J760j126M611o30r177r097k423n740K256O938j39L60L732l058
$$ 35776 30400 32160 31034 35645 35015 25838 16741 14318 8578 10834 17772 17633 17993 21725 18667
8466A8667k485k868n546l859N446L471k301L201J814k78L208M976O028J658n900
$$ 18667 16182 13314 7768 3909 9355 12826 10525 13726 15540 15262 18470 23446 29474 31132 25232
8451B5232o899J115J390l364L782L310J723l62K01L630K400R144J358N933J760
$$ 25232 18333 19448 20838 17474 21256 24566 26289 25927 26128 29758 32158 41302 42660 48593 50353
8436E0353k647o258l338q135m009J608K373l272n243N397P51l951r560m099P124
$$ 50353 47706 41448 38110 29975 25966 27574 29947 26675 21432 26829 27580 23629 14069 9970 17094
8421A7094N147j805p47j71k880M138M716j0653k078k700l275p33K78J2679J2061
$$ 17094 22241 20436 19689 19518 16638 20776 25492 14839 12761 10061 6786 6053 6331 19010 31071
8406C1071j325r141n375L43K433O371K790j1095j2778o181O70M293Q112O344M091
$$ 31071 29746 20605 15230 15573 18006 24377 27167 16072 3294 -2887 -2217 2076 10188 16532 20623
8391B0623j357l786r63l521J586Q94k474p71n020J866K813O62O584l709q910K256
$$ 20623 19266 15480 14517 10996 12582 13476 11002 10231 5211 7077 9890 10552 17136 13427 4517 6773
8375F773L076J124q82l654N146J995n404j462K046M395P267n2J882M794N69j245
$$ 6773 9849 10973 10091 6437 11583 13578 8174 6712 8758 13153 20420 20368 22250 27044 27613 26368
8359B6368k360p587j288J872p679l338j064K981L526J220j507K624m510l29l217
$$ 26368 24008 16421 15133 17005 9326 5988 4924 7905 11431 12651 11144 13768 9258 8929 5712
8344E712m209O02p30L857J325P301m994l163J250j102J304K89M52O760K603K336
$$ 5712 1503 2105 1375 5232 6557 13858 8864 5701 6951 5849 7153 7442 7894 14654 17257 19593
8328A9593m195k200N171m388p886M319J0112j763m127J663J87m351l028O307n989
$$ 19593 15398 13198 18369 13981 6095 10414 20526 18763 14636 16299 16486 12135 9107 15414 9425
8313I425n1k846J262P264J709K344j737R86N986j206k837J09k976p309q090k291
$$ 9425 9374 6528 7790 15054 16763 19107 17370 18356 24342 23136 20299 20408 17432 10123 2033 -258
8297b58m489O51M358K443K690J257K688L441L414n189m018q37j268J940k988P68
$$ -258 -4747 -4096 262 2705 5395 6652 9340 12781 16195 11006 6988 6151 4883 6823 3835 4603
8281D603J3492q14j639n84o32p715l133N092K148J0398k972l906m254M19j188
$$ 4603 18095 17281 15642 15058 14426 6711 3578 8670 10818 21216 18244 14338 10084 10503 9315
8266I315M178J489p644k194J779l79o845o677M099O623j010l79L601j326N048
$$ 9315 13493 14982 7338 5144 6923 6544 -301 -6978 -2879 3744 2734 2355 5956 4630 9678
8251I678J0007J478j626n171q603r507K777o088k035N476J0812K4654J2301j0252
$$ 9678 19685 21163 19537 14366 5763 -3744 -967 -7055 -9090 -3614 7198 31852 44153 33901
8237C3901k0743r880k506O425J904o376j373j474j159K322O172L94Q526Q86n524
$$ 33901 13158 3278 772 7197 9101 2725 1352 -122 -1281 1041 7213 7607 16133 17019 11495
8222A1495K231J838RJ12N607N71n447p938l863p33P142L358j498L263n022n094
$$ 11495 13726 15564 15573 15685 21292 21863 16416 8478 4615 3882 11024 14382 12884 16147 11125 6031
8206F031r67J012j552J552L616M698m76n527o159J2l706q01l247k508L067L668
$$ 6031 5064 6076 4524 6076 9692 14390 13914 8387 2228 2240 -1466 -2267 -5514 -8022 -4955 -1287
8190a287n110L547R359P718P091m671o624l855K835J096l773J393j668J424k005
$$ -1287 -6397 -2850 6509 14227 21318 16647 10023 6168 9003 10099 6326 7719 6051 7475 5470
8175E470L840M446j533p387l65M958J552K06O100k876l667q38k169o15j0938l334
$$ 5470 9310 13756 12223 4836 4471 9429 10981 11187 17287 14411 10744 9906 7737 7122 -3816 -7150
8159g150P046N764O605K036l653m694M369j852k589m183K513n357p040m965L587
$$ -7150 -104 5660 12265 14301 10648 5954 10323 8471 5882 1699 4212 -1145 -8185 -13150 -9563
8144i563O145Q611M086j085O9l537M14N809K922o59n484o602n488L749P781Q16
$$ -9563 -3418 5193 9279 8194 8263 4726 5140 10949 13871 13212 7728 1126 -4362 -613 7168 7984
8128G984J21l298m392K994L818j878j1017L503P016O875j212n036N824l962o046
$$ 7984 8105 4807 415 3409 7227 5349 -5668 -2165 4851 11726 10514 5478 11302 7340 1294
8113A294m645l493J864J0778L680M930J269j350n752j023L161m092n504l974M931
$$ 1294 -3351 -6844 -4980 5798 9478 14408 15677 14327 8575 7552 10713 6621 1117 -2857 2074
8098B074K620K29j409J759j689k379K116j019k575J793M999j371j911K126R23
$$ 2074 4694 4923 3514 5273 3584 1205 3321 2302 -273 1520 6519 5148 3237 5363 6286
8083F286m996P12M506J453J775L212L779M418J647K643n469L786O7n450j0785
$$ 6286 1290 2002 6508 7961 9736 12948 16727 21145 22792 25435 19966 23752 23819 18369 7584
8068G584o428l170n99l827J685Q833J727L343K43R779K052n440o738j024N067
$$ 7584 1156 -2014 -2613 -6440 -4755 4078 5805 9148 9391 19170 21222 15782 9044 8020 13087
8053A3087M873k607m670L619K360k028n183L145k793o586k0N567j76j826k408
$$ 13087 17960 15353 10683 14302 16662 14634 9451 12596 9803 3217 3197 8764 8588 6762 4354
8038D354n32N076M822J798j985q911n48K41L959L584p609N130J3304m558J15J07
$$ 4354 3822 8898 13720 15518 13533 4622 4074 4315 8274 11858 4249 9379 22683 18125 18240 18347
8022A8347m588M304m847o94N159J534q168K668N220O315P07n424P77J382l634
$$ 18347 13759 18063 13216 12522 17681 19215 11047 13715 18935 25250 25957 20533 21310 22692 19058
8007A9058m654M241O50p94j377L57r0n240O59P022J948J170q26l863K71M239O390
$$ 19058 14404 18645 19295 18501 17124 17481 17391 12151 12810 19832 21780 22950 22124 18261 18532 22771 29161
7990B9161O7m413j71k517o822j798N706K884n199m8O49M300J817l426j979M823
$$ 29161 29228 24815 24644 22127 15305 13507 19213 22097 16898 16850 17499 21799 23616 20190 18211 23034
7974B3034k452K227O171L067l9j302J30L939q781o155O256O683n97q891m732J959
$$ 23034 20582 22809 28980 32047 32008 30706 30836 34775 25994 19839 26095 32778 32181 23290 18558 20517
7958B0517j296p617N149J723j498m066K10l14M488K036j577j022O419k386m117
$$ 20517 19221 11604 16753 18476 16978 12912 13122 12808 17296 19332 17755 16733 23152 20766 16649
7943A6649l024l125n856k282L384J1680J204P30L664m724j262L516Q83R75j181
$$ 16649 13625 10500 4644 2362 5746 17426 18630 19360 23024 18300 17038 20554 21437 22412 21231
7928B1231j8L244J0527N318l85l980k760M374o508l614M826P586p238j0196j407
$$ 21231 21213 24457 34984 40302 39917 35937 33177 37551 31043 27429 32255 39841 32603 22407 21000
7913B1000l503m7j022j108k959m026J499L972j06K01l314n30l745L763l107K889
$$ 21000 17497 17450 16428 15320 12361 8335 9834 13806 13700 13901 10587 10057 6312 10075 6968 9857
7897I857J64l869K388Q971Q116N265l224K38k350k361n773n660J367L360L350
$$ 9857 10021 6152 8540 17511 25627 30892 27668 27906 25556 23195 17422 11762 13129 16489 19839
7882A9839K633k872M955K403j65q687j262J697m359J505K701j193o36J40q19k05
$$ 19839 22472 19600 24555 26958 26793 18106 16844 18541 14182 15687 18388 17195 16559 16699 15880 15675
7866A5675N77l097n645K202P622Lo96j586m463P093R72k400m828k477L726k95
$$ 15675 16252 13155 7510 9712 17334 17337 16641 15055 10592 17685 18657 16257 11429 8952 12678 12383
7850A2383K229K045J335j444m074O532m721p242k841L796m86m274M372K369K100
$$ 12383 14612 16657 17992 16548 12474 19006 14285 7043 4202 7998 7512 3238 7610 9979 12079
7835A2079L281n002l662r094j333L412L283N81k787j171J0967K053k319L038M83
$$ 12079 15360 10358 6696 -2398 -3731 -319 2964 3545 758 -413 10554 12607 10288 13326 13809
7820A3809k791j544L264L620j602o33o544L115K946n90K361J852m993p737K465
$$ 13809 11018 9474 12738 16358 14756 14123 7579 10694 13640 13050 15411 17263 12270 4533 6998
7805F998O267J520J437k114o891l610J162J386M586k789l336M280m599l29P40
$$ 6998 13265 14785 16222 14108 7217 3607 4769 6155 10741 7952 4616 8896 4297 3968 4708
7790D708m337L770M753n116n356K550l409q70M184N495k983j649N460k914n356
$$ 4708 371 4141 8894 3778 -1578 972 -2437 -3307 877 6372 3389 1740 7200 4286 -1070
7775a070k945K139O245P347J0626N991l076l945p24J322m055l28r18o683Qn996
$$ -1070 -4015 -1876 4369 11716 22342 28333 25257 21312 20588 21910 17855 17527 16609 9926 9934 3938
7759C938J569O95J367N56J573L409K228p28o440o564l970l084n873M6K373P539
$$ 3938 5507 6202 7569 8125 9698 13107 15335 14607 8167 1603 -2367 -5451 -11324 -11278 -8905 -1366
7743a366n85p089Q147J171Q7L311j483l62o70N92L519l83j651q85J885j351k788
$$ -1366 -1951 -9040 -893 278 365 3676 2193 1831 1161 1753 5272 4889 3238 2353 4238 2887 99
7726I9k389l89j612k183M571M206L881J870P22j787j997m84m494n415m404Q304
$$ 99 -2290 -2679 -4291 -6474 -1903 2303 6184 8054 8776 6989 4992 4508 14 -5401 -9805 -1501
7710a501K721j698M099K180R93K331k229p998n463m831j004P348Q159O436p789
$$ -1501 1220 -478 3621 5801 6794 9125 6896 -1102 -6565 -11396 -12400 -5052 3107 9543 1754
7695A754k213J544N396J701o489j124J310l67k94o101Q2m65n929J870L567N619
$$ 1754 -459 1085 6481 8182 1693 569 1879 1512 1218 -4883 -4801 -5266 -11195 -9325 -5758 -139
7679a39r65l466M203K098O110l64l732k65k716n274m354k353M340P414J30p611
$$ -139 -1104 -4570 -367 1731 7841 7477 3745 3480 764 -4510 -8864 -11217 -6877 537 667 -6944
7663f944j727O529m14n476M129J485J619l748m214n098m682N760P191O80M832
$$ -6944 -8671 -2142 -2556 -8032 -3903 -2418 -799 -4547 -8761 -13859 -18541 -12781 -5590 -4910 -78
7648g8o44K353M160O44K752n805l378K368j996l232N197M947K395J602J770J617
$$ -78 -722 1631 5791 6435 9187 3382 4 2372 376 -2856 2341 7288 9683 11285 13055 14672
7632A4672n653m382l825o851r09K561P060J185Q37m630j355m249j063N930K737
$$ 14672 9019 4637 812 -6039 -6948 -4387 2673 3858 4695 65 -1290 -5539 -6602 -672 2065
7617B065l048k740O794J945k119l812R8L815j849r511l891M654Q647n533m464
$$ 2065 -983 -3723 3071 5016 2897 -915 -817 2998 1149 -8362 -12253 -7599 1048 -4485 -8949
7602h949K749R295p68m552l333O48M277j068m996m343N976L459m84J592K762k471
$$ -8949 -6200 3095 2327 -2225 -5558 -4910 -633 -1701 -6697 -11040 -5064 -1605 -2089 -497 2265 -206
7586b06m786k857J3876K194j004q895k600l801Q501M540K358j540J915L520l603
$$ -206 -4992 -7849 6027 8221 7217 -1678 -4278 -8079 422 4962 7320 5780 7695 11215 7612
7571G612n038k020N40j100J401L21k111P684J056m15j129L553r4j360K449l230
$$ 7612 2574 554 1094 -6 1395 1716 -395 7289 8345 7930 6801 10354 10260 8900 11349 8119
7555H119n768L424M052K581k050M26N85k794k241p368k35n927Q29j866k132l634
$$ 8119 2351 5775 9827 12408 10358 10784 11369 8575 6334 -1034 -1269 -7196 -6367 -8233 -10365 -13999
7539a3999O89K526N733O393J189o188R10R673l807j1275P667Q123m373M869K392
$$ -13999 -13310 -10784 -5051 1342 2531 -3657 -2747 6926 3119 -8156 -489 7634 3261 8130 10522
7524A0522j178J345L773l392m189J603K333K294n632k929o354k985N314P079k957
$$ 10522 9344 10689 14462 11070 6881 8484 10817 13111 7479 4550 -1804 -4789 525 7604 4647
7509D647m700L767J3715k242p097l54j589k349k521O97j342K973m550n034P65
$$ 4647 -53 3714 17429 15187 8090 7736 6147 3798 1277 1974 632 3605 -945 -5979 -5214
7494e214J636K496k326o560K819J0945J833o632j1953k0r79M318N52M058R352
$$ -5214 -3578 -1082 -3408 -9968 -7149 3796 5629 -1003 -12956 -12976 -13955 -9637 -9085 -5027 4325
7479D325n286K80P639J168J898o543k031Q989Q144O07j928j798m712j902j785
$$ 4325 -961 -681 6958 8126 10024 3481 1450 10439 18583 19190 17262 15464 10752 8850 7065
7464G065p145n100M339M138K258l100m944k720K060K12n789K957J900o148L464
$$ 7065 -80 -5180 -841 3297 5555 2455 -2489 -5209 -3149 -2937 -8726 -5769 -3869 -10017 -6553
7449f553O110n029K776L379o4m691J406K300J089R0r54m2j675o27N456M014J206
$$ -6553 -443 -5472 -2696 683 619 -4072 -2666 -366 723 813 -141 -183 -1858 -2485 2971 6985 8191
7432H191o102p372j462L381j191K197L253K409m532j973l93p200O80K345m994
$$ 8191 2089 -5283 -6745 -3364 -4555 -2358 895 3304 -1228 -3201 -3594 -10794 -10114 -7769 -12763
7417a2763N889J2383K600o365r696l20k412k21O007P368o022r82P216K22m179
$$ -12763 -6874 5509 8109 1744 -7952 -8272 -10684 -10905 -4898 2470 -3552 -4534 2682 2904 -1275
7402a275j874k152J590J304R692K464m525l073j2752o519M714P366j776K01L247
$$ -1275 -3149 -5301 -3711 -2407 7285 9749 5224 2151 -10601 -17120 -12406 -5040 -6816 -6615 -3368
7387c368Q812L446n495l635K330M651L452m422l233L343k796J975K271P86l728
$$ -3368 5444 8890 3395 -240 2090 6741 10193 5771 2538 5881 3085 5060 7331 8117 4389
7372D389n444N886j490p46n535l474k68K6L73j21p59N58J859P91K234M8N066J424
$$ 4389 -1055 4831 3341 2595 -2940 -6414 -6682 -6656 -6283 -6404 -7163 -6605 -4746 -3955 -1721 -1673 3393 4817
7354D817l948L718l94m725k486M384p37K553q20L284L01J211k314m185N273O930
$$ 4817 869 4587 4193 -532 -3018 1366 629 3182 2362 5646 5947 7158 4844 659 5932 12862
7338A2862k818l014m402l871M32k251K356M570l535k019L211J063K835l232n07
$$ 12862 10044 7030 2628 -1243 -811 -3062 -706 3864 329 -1690 1521 2584 5419 2187 1680
7323A680j571m682J18k836R82m397P634R015L469l246j714j76m526n969J498k048
$$ 1680 109 -4573 -4455 -7291 -6309 -10706 -3072 5943 9412 6166 4452 4276 -250 -6219 -4721 -6769
7307f769j866L700M993L61L805j383l480K240O051k703m88K502J080m965m103
$$ -6769 -8635 -4935 58 419 4224 2841 -639 1601 7652 4949 4461 6963 8043 3078 -1025
7292a025K776J582m351m899L577L910N36K739K233k019m169p933N041J715J067
$$ -1025 1751 3333 -1018 -5917 -2340 1570 2106 4845 7078 5059 890 -7043 -2002 -287 780
7277G80K06q566r25J2224l190n169j450N334l577n136P58N538P024k685K211k448
$$ 780 986 -7580 -8505 3719 529 -4640 -6090 -756 -4333 -9469 -8711 -3173 3851 1166 3377 929
7261I29l374n073M958N820q39n753j48j726J192k802N93L675P13J211k077Q89
$$ 929 -2445 -7518 -2560 3260 2421 -3332 -3480 -5206 -4014 -6816 -6223 -2548 -1835 -624 -2701 -1812
7245a812L251N58j311k046o916N926k895j624q933Q401P655k765l200K225J211
$$ -1812 1439 1997 686 -1360 -8276 -2350 -5245 -6869 -15802 -7401 254 -2511 -5711 -3486 -2275
7230b275n771R40K834Q79m336k668L535Q589K76m84r517l817M89j367L82n2L08
$$ -2275 -8046 -7106 -4272 -3393 -7729 -10397 -6862 1727 2003 1519 -7998 -11815 -11326 -12693 -12311 -12363 -12055
7213a2055L336R10Q05l383L730J940k783k358O72q19J479M643O849J616k445n031
$$ -12055 -8719 -7809 -7004 -10387 -6657 -4717 -7500 -9858 -9186 -10005 -8526 -3883 2966 4582 2137 -2894
7197b894p064O101P573J692l334p541l91O057m235M217L297j392p170K188L359
$$ -2894 -9958 -3857 3716 5408 2074 -5467 -5858 199 -4036 181 3478 2086 -5084 -2896 463
7182D63l043l431l582N477p65J128o53q625k351P810j192k870K7k590L918K417
$$ 463 -2580 -6011 -9593 -4116 -4881 -3753 -4406 -13031 -15382 -7572 -8764 -11634 -11607 -14197 -10279 -7862
7166g862l98O53j685P82M216M679l072j14M29j721M02J72K648L779j419k777k479
$$ -7862 -8260 -7607 -9292 -8510 -4294 385 -2687 -2801 -2372 -4093 -3691 -3519 -871 2908 1489 -1288 -3767
7149c767J224O216K197j298r37J455J62J210l652k588K79k77j633L37k214r27
$$ -3767 -2543 3673 5870 4572 3635 5090 5252 6462 2810 222 501 224 -1409 -1072 -3286 -4213
7133d213L782P712l42m878j06J124j148P09QR88k399K832p58m017j228k034J133
$$ -4213 -431 7281 6939 2061 1955 3079 1931 2640 2648 3636 1237 4069 3311 -706 -1934 -3968 -2835
7116b835J1788J340m374N39o84k423p4K134j057M529j695j0700m034N859N845
$$ -2835 8953 10293 5919 6458 5774 3351 3277 5411 4354 8883 7188 -3512 -7546 -1687 4158
7101D158K864l8k280k075n965n72J341q00n898j648Q799P195n079n243m23j982
$$ 4158 7022 6984 4704 2629 -3336 -3908 -2567 -3367 -9265 -10913 -2114 5081 2 -5241 -5664 -7646
7085g646k335k4P02J996J26K535J61L274P994M333j192J941o04j65o868o054m213
$$ -7646 -9981 -10005 -9303 -7307 -7181 -4646 -4485 -1211 6783 11116 9924 11865 11261 11096 4228 -1826 -6039
7068f039r36o061n887l249M549J1128K709K453k882L19m058M56O437j128p472
$$ -6039 -6975 -13036 -18923 -22172 -17623 -6495 -3786 -1333 -4215 -3896 -7954 -7498 -1061 -2189 -9661
7053i661J202R620O675k370k856N83l91l512J549L168L246n675m657N82L771j695
$$ -9661 -8459 1161 7836 5466 2610 3193 2802 -710 839 4007 7253 1578 -3079 -2497 1274 -421
7037d21n649n45P18o395k031L807J758J707k56m185Q254M851L5k185k801R836
$$ -421 -6070 -6615 -5897 -12292 -14323 -10516 -8758 -7051 -7307 -11492 -3238 1613 1648 -537 -3338 6498
7021F498L745p132J739k453o486K551n19k099L59p95N434q9n206L659L804M533
$$ 6498 10243 3111 4850 2397 -4089 -1538 -2057 -4156 -3797 -4592 842 753 -4453 -794 3010 7543
7005G543J105L08N359j097m666o316p594l826J953j450P3N253J986K766m714K4
$$ 7543 8648 8956 14315 13218 8552 2236 -5358 -9184 -7231 -8681 -8608 -3355 -1369 1397 -3317 -3293
6989c293J867j865l802k051J0445j037k073K40j752k953L48J119m705Q124J243
$$ -3293 -1426 -3291 -7093 -9144 1301 264 -1809 -1569 -3321 -6274 -5926 -4807 -9512 -1388 -145
6974a45J272p33l166M853j381k669o08m195j539J507k092J270O534j346n610j013
$$ -145 1127 394 -2772 2081 700 -1969 -2577 -6772 -8311 -6804 -8896 -7626 -1092 -2438 -8048 -9061
6958i061n129k997L333L237L270M395l44j880j21m123q43P437J277p70j399o097
$$ -9061 -14190 -17187 -13854 -10617 -7347 -2952 -3296 -5176 -5297 -9420 -10263 -2826 -1549 -2319 -3718 -9815
6942i815Q90P898o92L216M600m307k124r34J48j101L195m711j548J428P07m95
$$ -9815 -8925 -1027 -1719 1497 6097 1790 -334 -1268 -1120 -2221 974 -3737 -5285 -3857 -3150 -3645
6926c645O439N496K206M165K14n796m996k886k389M112M003n586j0247o804K657
$$ -3645 2794 8290 10496 14661 14875 9079 4083 1197 -1192 2920 6923 1337 -8910 -15714 -13057
6911a3057J2970l232Q60m169k61K095j366J804o74j424M208L367L741p123m075
$$ -13057 -87 -3319 -2459 -6628 -6889 -4794 -6160 -4356 -5030 -6454 -2246 1121 4862 -2261 -6336
6896f336Q27M357j977J373L572P22j270k976O603R67n606J393j042L840o464m242
$$ -6336 -5509 -1152 -3129 -1756 1816 2538 1268 -1708 4895 5862 256 1649 607 4447 -2017 -6259
6880f259N384m956k245O007L886K389l426q398L470k675K882N265l71j699k698
$$ -6259 -875 -5831 -8076 -2069 1817 4206 780 -7618 -4148 -6823 -3941 1324 953 -746 -3444
6865c444r43K209P046l04m381J911P562J910o182m104l612L229j01m689J67K172
$$ -3444 -4387 -2178 4868 4564 183 2094 9656 11566 5384 1280 -2332 897 796 -3893 -3726 -1554
6849a554N10l149J478J106j899K749K231K295j773j839O44L16q107j042K350l785
$$ -1554 -1044 -4193 -2715 -1609 -3508 -759 1472 3767 1994 155 799 1115 -6992 -8034 -5684 -9469
6833i469N930M26J130K301r146p32N949K477J15J032N41L471J20k777N2r64p561
$$ -9469 -3539 -3113 -1983 318 -8828 -9560 -3611 -1134 -1019 13 554 4025 4145 1368 1420 456 -7105
6816g105m26L049k437k674P627j8K259k378K744o50L67j555L989j997n09N462
$$ -7105 -7531 -4482 -6919 -9593 -1966 -1984 275 -2103 641 -9 358 -1197 2792 795 286 5748
6800E748M037n59m444J900k36m848L833L319k559K936K485m141J886q289m537
$$ 5748 9785 9226 4782 6682 6446 1598 5431 8750 6191 9127 11612 7471 9357 1068 -3469
6785c469J483l60j461K144l935l253J860K298K979k118M650O201p292M000L890
$$ -3469 -1986 -2346 -3807 -1663 -5598 -8851 -6991 -4693 -1714 -3832 818 7019 -273 3727 7617
6770G617M30K243q84m818j78O986Q26m929n611o05M144q695n764m071j754N541
$$ 7617 8047 10290 9406 4588 4410 11396 12222 7293 1682 1077 5221 -3474 -9238 -13309 -15063 -9522
6754i522Q165m16n643L582J170j252RL087O064M382l768n195n289j424L867L770
$$ -9522 -1357 -1773 -7416 -3834 -2664 -3916 -3907 -820 5244 9626 5858 663 -4626 -6050 -2183 1587
6738A587l497K119k891K070l230k360l290Q09J134J781N300L151r33L453k056
$$ 1587 -1910 209 -2682 -612 -3842 -6202 -9492 -8683 -7549 -5768 -468 2683 1750 5203 3147
6723C147l072n704K427k23m25K250J180K727M178K823l083K942l94n205M237N250
$$ 3147 75 -5629 -3202 -3425 -3850 -1600 -420 2307 6485 9308 6225 9167 8773 3568 7805 13055
6707A3055L71m055m443p879M880O132M575q722m966q8j53J978L072K864k099j2427
$$ 13055 13426 9371 4928 -2951 1929 8061 12636 3914 -1052 -1140 -1293 685 3757 6621 4522 -7905
6691g905M186m837K101O617N233o79m332j240k699m629l884o48P168M409Q98p02
$$ -7905 -3719 -8556 -6455 162 5395 4716 384 -856 -3555 -8184 -12068 -12716 -5548 -1139 -241 -943
6675i43r208l060J2494N576l01m27Q322J480j526j1752n995m314n054L12N752
$$ -943 -10151 -13211 -717 4859 4558 4131 12453 13933 12407 655 -5340 -9654 -14708 -14396 -8644
6660h644L933j869l083L197Q137p057r478P707O265q252m101J577p20K624J914
$$ -8644 -4711 -6580 -9663 -6466 1671 -5386 -14864 -7157 -892 -9144 -13245 -11668 -12388 -9764 -7850
6645g850N848j908L060k149L935J920K731R15M777j383p111n622n435j012K013
$$ -7850 -2002 -3910 -850 -2999 936 2856 5587 6502 11279 9896 2785 -2837 -8272 -9284 -7271
6630g271M078j712M099K185m960O145K500q012l990l946q36J399k529k151P550
$$ -7271 -3193 -4905 -806 1379 -3581 2564 5064 -2948 -6938 -10884 -11720 -10321 -12850 -15001 -7451
6615g451J098k932J452J268J0015P911k849l307o596o809J398J189Q060L212K202
$$ -7451 -6353 -9285 -7833 -6565 3450 11361 8512 5205 -1391 -8200 -6802 -5613 2447 5659 7861
6600G861J645j816m324j848K29J764j185J553j461l680K81L400K312m838P97j359
$$ 7861 9506 7690 3366 1518 1747 3511 2326 3879 2418 -1262 -981 2419 4731 -107 690 -669
6584f69M666k074j381o30n16O381J166j158l186j023M138j390n511m532Q23K318
$$ -669 3997 1923 542 -88 -604 5777 6943 5785 2599 1576 5714 4324 -1187 -5719 -4896 -2578
6568b578O278N586J62j326m283k111q347r250p90Q882O101N642N729m955l152
$$ -2578 3700 9286 9448 8122 3839 1728 -6619 -15869 -16659 -7777 -1676 3966 9695 4740 1588
6553A588k664K791N079q245o833L107L960N98l43k369M058P72Q83L015q47J152
$$ 1588 -1076 1715 6794 -1451 -8284 -5177 -1217 -619 -962 -3331 727 1499 2382 5397 4550 5702
6537E702j745K62o733m768m250n74J165L066L418L328Q53j585Q20K048j450q86
$$ 5702 3957 4219 -2514 -7282 -11532 -12106 -10941 -7875 -4457 -1129 -276 -1861 -1041 1007 -443 -1329
6521a329m747Q64R77j686p229J563L085K886p37j762O09m478N443j508l050L110
$$ -1329 -6076 -5212 -4235 -5921 -13150 -11587 -8502 -5616 -6353 -8115 -7506 -11984 -6541 -8049 -11099 -7989
6505g989J40M307k742M777L946o300n590N07K847k098l098N00J3213K345m916
$$ -7989 -7849 -3542 -6284 -1507 2439 -3861 -9451 -8944 -6097 -8195 -11293 -10793 2420 4765 -151
6490a51r85K438m960j1538M21M942L304K515R555J555k019m638r0o204k116Q994
$$ -151 -1136 1302 -3658 -15196 -14775 -9833 -6529 -4014 5541 7096 5077 439 349 -5855 -7971 1023
6474A023N276n538j741j903k62R66j667O158O881o142p155l373n878J814O967
$$ 1023 6299 761 -980 -2883 -3145 -2179 -3846 2312 9193 3051 -4104 -7477 -13355 -11541 -4574
6459d574M864m094j0174R61P241O451m078k705K229J940l293K127K020R41n563
$$ -4574 290 -3804 -13978 -13017 -5776 675 -3403 -6108 -3879 -1939 -5232 -3105 -1085 -144 -5707
6444e707l145k031L9J981k198K437J4j623N260L245j30J321o64J008J113m866
$$ -5707 -8852 -10883 -10844 -8863 -11061 -8624 -8610 -10233 -4973 -1728 -1858 -537 -1201 -193 920 -3946
6428c946M166J707m303M455j79j599n409J893M706P300j535j818J571R81J06j0010
$$ -3946 220 1927 -2376 2079 1900 301 -5108 -3215 1491 8791 7256 5438 7009 7990 8096 -1914
6412a914O60j044j707J457P343K230k36K356p369r843n782J67J0592Q299K452
$$ -1914 -1254 -2298 -4005 -2548 4795 7025 6789 9145 1776 -8067 -13849 -13682 -3090 5209 7661
6397G661K076r136n036K492j341K628k934j684L972k248k656k379j038K968N177
$$ 7661 9737 601 -4435 -1943 -3284 -656 -3590 -5274 -1302 -3550 -6206 -8585 -9623 -6655 -1478
6382a478M048k748K036M714l54k366j010j744j711J216M368l042K890m338m80
$$ -1478 2570 -178 1858 6572 6218 3852 2842 1098 -613 603 4971 1929 4819 481 1
6367AJ92L14O50m229N428P357n510j0823N771P165o530o435P622O35k800o616
$$ 1 193 507 1157 -3072 2356 9713 4203 -6620 -849 6316 -214 -6649 973 1608 -1192 -7808
6351g808l437m217q20L185Q159l044l102k92M408L374j484M37k70P80J619M199
$$ -7808 -11245 -15462 -16282 -13097 -4938 -7982 -11084 -11376 -6968 -3594 -5078 -4641 -4911 -4131 -2512 1687
6335A687L666j980l713j123N248K472L767n204o703L857N55j508M335m590m259
$$ 1687 5353 3373 -340 -1463 3785 6257 10024 4820 -1883 1974 2529 1021 5356 766 -3493
6320c493O411N461j324l320l78J914j354J08L093M399k244r556q60Q368m477l607
$$ -3493 2918 8379 7055 3735 3357 5271 3917 4025 7118 11517 9273 -283 -1143 7225 2748 -859
6304h59J42q46N266K39K080N841j14J228l873k684k038p942q38j784O22O369K875
$$ -859 -717 -1563 3703 3942 6022 11863 11749 12977 9104 6420 4382 -3560 -4398 -6182 -5560 809 3684
6287C684n209M329M857j261M422j512o645j007m310R61L576M256K341k477j305
$$ 3684 -1525 2804 7661 6400 10822 9310 2665 1658 -2652 -1691 1885 6141 8482 6005 4700
6272D700k641l121k862l821J163L829j558J348j008m07L536K606M612K63q04r69
$$ 4700 2059 -1062 -3924 -7745 -6582 -2753 -4311 -2963 -3971 -4378 -842 1764 6376 6639 5835 4866
6256D866L318m391q653j807O2Q949J844K10n44K913m212j0061k867m277l023K750
$$ 4866 8184 3793 -4860 -6667 -6605 2344 4188 4398 3854 6767 2555 -7506 -10373 -14650 -17673 -14923
6240a4923O280r40j0457n684Q529Q695k959m064P07K110k173m203k996M530Q19
$$ -14923 -8643 -9583 -20040 -25724 -17195 -8500 -11459 -15523 -14816 -12706 -14879 -19082 -22078 -17548 -16729
6225a6729O841J682k525K932J057P53J933L062J106j148J36l261j660K161q81
$$ -16729 -9888 -8206 -10731 -7799 -6742 -5989 -4056 -994 112 -1036 -900 -4161 -5821 -3660 -4541
6210d541J351N093k084o860n743k754M255R267J437o600l680j124K631K297K925
$$ -4541 -3190 1903 -181 -7041 -12784 -15538 -11283 -2016 -579 -7179 -10859 -11983 -9352 -7055 -4130
6195d130k089k539l329K377k120k170L482J98J348L572K814J835J604j852j837
$$ -4130 -6219 -8758 -12087 -9710 -11830 -14000 -10518 -10320 -8972 -5400 -2586 -751 853 -999 -2836
6180b836j978k177L65n888j520k700J1137J583J882N352k405K617L698Q743k400
$$ -2836 -4814 -6991 -6626 -12514 -14034 -16734 -5597 -4014 -2132 3220 815 3432 7130 15873 13473
6165A3473m376M820M261J444n463m031j158k986q146J963J885n813M998M818j263
$$ 13473 9097 13917 18178 19622 14159 10128 8970 5984 -2162 -199 1686 -4127 871 5689 4426
6150D426L120n923k603n587P45N475n47K69J377O42n183j665K560M219N159J098
$$ 4426 7546 1623 -980 -6567 -5822 -347 -894 -625 752 1394 -3789 -5454 -2894 1325 6484 7582
6134G582M170N90k670j622o178l141J940M054q98p951p851j295L071K019j446
$$ 7582 11752 12342 9672 8050 1872 -1269 671 4725 3827 -4124 -11975 -13270 -10199 -8180 -9626
$$ [...]
##END NTUPLES=NMR SPECTRUM
##END=
