##TITLE=Analysis number 329399
Compound Code cc 62404
Book Reference 486/192
Project Code adrs
Chemist Name simons
##JCAMPDX= 6.0         $$ Bruker NMR JCAMP-DX V2.0
##DATA TYPE= NMR SPECTRUM
##DATA CLASS= NTUPLES
##ORIGIN= Bruker BioSpin GmbH
##OWNER= nmr
$$ XWIN-NMR		Version 3.5
$$ Thu Aug 30 09:50:29 2007 GMT Daylight Time (UT+1h)  MAYBRIDGE\nmr@NMR_250MHZ
##.OBSERVE FREQUENCY= 250.131544655141
##.OBSERVE NUCLEUS= ^1H
##.ACQUISITION MODE= SIMULTANEOUS (DQD)
##.ACQUISITION SCHEME= undefined
##.AVERAGES= 16
##.DIGITISER RES= 18
##SPECTROMETER/DATA SYSTEM= dpx250
##.PULSE SEQUENCE= zg30
##.SOLVENT NAME= CDCl3
##.SHIFT REFERENCE= (INTERNAL, CDCl3, 0, 16.4545)
##AUDIT TRAIL= $$ (NUMBER, WHEN, WHO, WHERE, WHAT)
$$ ##TITLE= Audit trail, XWIN-NMR		Version 3.5
$$ ##JCAMPDX= 5.01
$$ ##ORIGIN= Bruker BioSpin GmbH
$$ ##OWNER= nmr
$$ C:\u/data/dgb/nmr/ADRS/1800/pdata/1/auditp.txt
$$ ##AUDIT TRAIL=  $$ (NUMBER, WHEN, WHO, WHERE, WHAT)
(   1,<2007-08-30 09:49:01.23 +100>,<MAYBRIDGE\nmr>,<NMR_250MHZ>,
      <created by zg, POWCHK disabled, PULCHK disabled
       configuration hash MD5:
       76 6E 9A 78 1E 09 19 81 EC 84 63 8F B0 6A 59 2D
       data hash MD5: 64K
       CD 33 2F 24 DD DA D2 68 E2 80 42 70 A0 DA 5C 8E>)
(   2,<2007-08-30 09:49:36.63 +100>,<MAYBRIDGE\nmr>,<NMR_250MHZ>,
      <Start of raw data processing
       ef LB = 0.3 FT_mod = 6 PKNL = 1 SI = 32K 
       data hash MD5: 32K
       30 05 A6 F5 E9 C2 C3 80 E0 51 DB B8 62 F5 1F 48>)
(   3,<2007-08-30 09:49:42.10 +100>,<MAYBRIDGE\nmr>,<NMR_250MHZ>,
      <apk 
       data hash MD5: 32K
       B5 2E AD 33 AA 28 9E D9 0C 31 CF A7 9E 40 57 9D>)
(   4,<2007-08-30 09:49:46.77 +100>,<MAYBRIDGE\nmr>,<NMR_250MHZ>,
      <abs ABSG = 5 
       data hash MD5: 32K
       D5 D7 42 39 D9 10 FD 81 01 CE 93 89 DC 2F 15 18>)
$$ ##END=
$$ 
$$ hash MD5
$$ 5C 73 7B A0 42 02 91 89 B2 9A AC 98 FD 20 00 56
##$RELAX= 
##$RELAX= 
##$RELAX= 
##$RELAX= 
##$RELAX= 
##$RELAX= 
##$RELAX= 
$$ Bruker specific parameters
$$ --------------------------
##$DU= <C:\u>
##$EXPNO= 1800
##$NAME= <ADRS>
##$PROCNO= 1
##$TYPE= <nmr>
##$USER= <dgb>
##$AMP= (0..31)
100 100 100 100 100 100 100 100 100 100 100 100 100 100 100 100 100 100 
100 100 100 100 100 100 100 100 100 100 100 100 100 100 
##$AQSEQ= 0
##$AQ_mod= 3
##$AUNM= <au_zg>
##$AUTOPOS= <44 >
##$BF1= 250.13
##$BF2= 250.13
##$BF3= 250.13
##$BF4= 250.13
##$BF5= 500.13
##$BF6= 500.13
##$BF7= 500.13
##$BF8= 500.13
##$BYTORDA= 1
##$CFDGTYP= 0
##$CFRGTYP= 5
##$CHEMSTR= <none>
##$CNST= (0..31)
1 1 145 1 1 1 1 1 1 1 1 1 1 1 1 1 1 1 1 1 1 1 1 1 1 1 1 1 1 1 1 1 
##$CPDPRG= <>
##$CPDPRG1= <>
##$CPDPRG2= <>
##$CPDPRG3= <>
##$CPDPRG4= <mlev>
##$CPDPRG5= <mlev>
##$CPDPRG6= <mlev>
##$CPDPRG7= <mlev>
##$CPDPRG8= <mlev>
##$CPDPRGB= <>
##$CPDPRGT= <>
##$D= (0..31)
0 1 0 0 0 0 0 0 0 0.06 0 0 0 0 0 0 0.0002 0 0 0 0 0 0 0 0 0 0 0 0 0 0 
0 
##$DATE= 1188463737
##$DBL= (0..7)
120 120 120 120 120 120 120 120 
##$DBP= (0..7)
150 150 150 150 150 150 150 150 
##$DBP07= 0
##$DBPNAM0= <>
##$DBPNAM1= <>
$$ [...]
##$SUBNAM7= <"">
##$SUBNAM8= <"">
##$SUBNAM9= <"">
##$SW= 20.6930455092707
##$SWIBOX= (0..15)
0 0 3 0 0 0 0 0 0 0 0 0 0 0 0 0 
##$SW_h= 5175.983436853
##$TD= 65536
##$TD0= 1
##$TE= 295.16
##$TE2= 300
##$TE3= 300
##$TEG= 300
##$TL= (0..7)
0 120 120 120 120 120 120 120 
##$TP= (0..7)
150 150 150 150 150 150 150 150 
##$TP07= 0
##$TPNAME0= <>
##$TPNAME1= <>
##$TPNAME2= <>
##$TPNAME3= <>
##$TPNAME4= <>
##$TPNAME5= <>
##$TPNAME6= <>
##$TPNAME7= <>
##$TPOAL= (0..7)
0.5 0.5 0.5 0.5 0.5 0.5 0.5 0.5 
##$TPOFFS= (0..7)
0 0 0 0 0 0 0 0 
##$TUNHIN= 0
##$TUNHOUT= 0
##$TUNXOUT= 0
##$USERA1= <user>
##$USERA2= <user>
##$USERA3= <user>
##$USERA4= <user>
##$USERA5= <user>
##$V9= 5
##$VALIST= <valist>
##$VCLIST= <CCCCCCCCCCCCCCC>
##$VD= 0
##$VDLIST= <DDDDDDDDDDDDDDD>
##$VPLIST= <PPPPPPPPPPPPPPP>
##$VTLIST= <TTTTTTTTTTTTTTT>
##$WBST= 1024
##$WBSW= 4
##$XGAIN= (0..3)
0 0 0 0 
##$XL= 0
##$YL= 0
##$YMAX_a= 288197
##$YMIN_a= -254685
##$ZGOPTNS= <>
##$ZL1= 120
##$ZL2= 120
##$ZL3= 120
##$ZL4= 120
##$ABSF1= 16.45445
##$ABSF2= -4.238722
##$ABSG= 5
##$ABSL= 3
##$ALPHA= 0
##$AQORDER= 0
##$ASSFAC= 0
##$ASSFACI= 0
##$ASSFACX= 0
##$ASSWID= 0
##$AUNMP= <proc_1d>
##$AZFE= 0.1
##$AZFW= 0.1
##$BCFW= 0
##$BC_mod= 0
##$BYTORDP= 0
##$COROFFS= 0
##$CY= 12.5
##$DATMOD= 1
##$DC= 0
##$DFILT= <>
##$DTYPP= 0
##$F1P= 14.0000005364418
##$F2P= -0.99999901652339
##$FCOR= 0.5
##$FTSIZE= 32768
##$FT_mod= 6
##$GAMMA= 0
##$GB= 0
##$INTBC= 1
##$INTSCL= 1
##$ISEN= 128
##$LB= 0.3
##$LEV0= 0
##$LPBIN= 0
##$MAXI= 10000
##$MC2= 0
##$MEAN= 0
##$ME_mod= 0
##$MI= 0
##$NCOEF= 0
##$NC_proc= -5
##$NLEV= 6
##$NOISF1= 0
##$NOISF2= 0
##$NSP= 0
##$NTH_PI= 0
##$NZP= 0
##$OFFSET= 16.45445
##$PC= 1
##$PHC0= -36.54305
##$PHC1= 5.894677
##$PH_mod= 1
##$PKNL= yes
##$PPARMOD= 0
##$PSCAL= 4
##$PSIGN= 0
##$REVERSE= no
##$SF= 250.130016895736
##$SI= 32768
##$SIGF1= 0
##$SIGF2= 0
##$SINO= 400
##$SIOLD= 32768
##$SREGLST= <1H.CDCl3>
##$SSB= 0
##$STSI= 32768
##$STSR= 0
##$SW_p= 5175.98343685301
##$SYMM= 0
##$S_DEV= 0
##$TDeff= 65536
##$TDoff= 0
##$TI= <Analysis number 999999
Compound Code 99
Book Reference 9
Project Code 9>
##$TILT= no
##$TM1= 0
##$TM2= 0
##$TOPLEV= 0
##$USERP1= <user>
##$USERP2= <user>
##$USERP3= <user>
##$USERP4= <user>
##$USERP5= <user>
##$WDW= 1
##$XDIM= 32768
##$YMAX_p= 521953708
##$YMIN_p= -707419
$$ End of Bruker specific parameters
$$ ---------------------------------
##NTUPLES= NMR SPECTRUM
##VAR_NAME=  FREQUENCY,     SPECTRUM/REAL,   SPECTRUM/IMAG
##SYMBOL=    X,             R,               I
##VAR_TYPE=  INDEPENDENT,   DEPENDENT,       DEPENDENT
##VAR_FORM=  AFFN,          ASDF,            ASDF
##VAR_DIM=   32768,         32768,           32768
##UNITS=     HZ,            ARBITRARY UNITS, ARBITRARY UNITS
##FACTOR=    0.157963299565203, 1,           1
##FIRST=     4115.75200841395, 0,            0
##LAST=      -1060.23142843906, 0,           0
##MIN=       -1060.23142843906, -707419,     0
##MAX=       4115.75200841395, 521953708,    0
$$ Real data points
##PAGE= N=1
##DATA TABLE= (X++(R..R)), XYDATA
$$ [...]
17861A49491J56972J4045r6706j25761O7205p9296q7317J05155j79086L4156J85350
17850A44208m7421r5795n6401m0327J804J4818p9818O4839J05360J60149j1804
17839A59612k0166Q4765m43k52196o4480N3647l7346O7758j05304r4309J34373
17828g4089R0084j05666Q405R616K9590o7558M7070J44658R6526L7472l8900n6241
17816A20967j19666j19034j43468p2164K13286O6780J05037q9760j1170K0074
17806b9118p761K0677j12382P0075N1268O1636P2347Q2741j04145j57837J0244
17795d2255L5980m6201L0411l5060L052k7327M6039L1545j31408O3257J44388
17784G2421J4595O9897j61324j34886j83428j2705J24268K39304p5593J5134J70666
$$ plain form
17861 149491 306463 320508 223802 98041 165246 85950 -1367 103788 -75298 -41142 144208
17850 144208 96787 992 -55409 -95736 -93932 -79114 -158932 -94093 11267 171416 159612
17839 159612 139446 224211 223768 -28428 -92908 -39261 -76607 -8849 -114153 -208462 -74089
17828 -74089 15995 -89671 -81266 -71650 -42060 -109618 -62548 82110 178636 216108 177208 120967
17816 120967 1301 -117733 -261201 -333365 -120079 -53299 51738 -38022 -49192 -29118
17806 -29118 -36879 -16202 -128584 -58509 -7241 54395 126742 209483 105338 -52499 -42255
17795 -42255 -6275 -52476 -22065 -57125 -54073 -81400 -35361 -3816 -135224 -71967 72421
17784 72421 87016 156913 -4411 -139297 -322725 -335430 -211162 28142 -47451 -32317 138349
17773A38349o5857j85060j8323N1981l2406K5226j05567j14326Q4283P8307k23208
17762c66601q7846J9689J04330L1025J8588K1290j63207p0518J44253J97424J25351
17751b6222P4775k2398p9199l8327M8060J1897R4651O3978k14798j04895J73164
17740a9314m6571O7370J25205p580j75886J28795O8124l3309n0486J07701p1000
17729I3049m6134N9972J9320j21206k38150O429J89579M2336p5721O252K5089
17718c9185J78712O8262q9953p4439l9617j23700n8276J23002P7654J42172K184
17707A66816k37158L5514K8508j61727n7524M5133K1378K5037m5175j8324J23083
17696g4439J08466J21921P0750j13780q5024m1218m8548r5699k2329j55092k4003
$$ plain form
17773 138349 72492 -112568 -130891 -78910 -111316 -86090 -191657 -305983 -221700 -143393 -366601
17762 -366601 -454447 -434758 -330428 -299403 -280815 -259525 -422732 -493250 -348997 -151573 -26222
17751 -26222 48553 26155 -53044 -91371 -43311 -31414 63237 127215 -87583 -192478 -19314
17740 -19314 -65885 1485 126690 119110 -56776 72019 140143 106834 56348 164049 93049
17729 93049 46915 106887 126207 5001 -233149 -226720 -37141 5195 -70526 -64274 -39185
17718 -39185 139527 207789 117836 43397 3780 -119920 -178196 -55194 22460 164632 166816
17707 166816 -70342 -34828 -6320 -168047 -225571 -180438 -159060 -134023 -179198 -197522 -74439
17696 -74439 34027 155948 226698 112918 27894 -13324 -61872 -157571 -179900 -334992 -358995
17685c58995J06107J9305Q3565k5937j13583R6733r7803K8767K9326n084P1263
17674a66336O7753J04771M576L4329k22096m1364Q3524O8437j47529K19639R9643
17663A05347N618J00420L258j99649J5473O7526O2804M9911j60734m5649J07392
17652A11717J47498m0125k94895J07020l3375r2538M0614j10245j53250K6998
17642b90581J92043M7958O3243q0612q6140Q758P1401J95456J56609j67992l6730
17631G3413J39374p6182k24266o1796J0025L6223J23703l6618J88542q0838L534
17620I5114m1491p5478j2337K6692P2804m0368O1473n6799n9577K414l3520J2912
17608d8161J36523J97943L8232j2295l5936j27670j29610k19747j45971m4787
$$ plain form
17685 -358995 -252888 -233583 -150018 -175955 -289538 -192805 -290608 -261841 -232515 -237599 -166336
17674 -166336 -98583 6188 10764 45093 -177003 -218367 -134843 -66406 -213935 5704 105347
17663 105347 110965 211385 214643 14994 30467 97993 160797 210708 49974 4325 111717
17652 111717 259215 219090 -75805 31215 -2160 -94698 -54084 -164329 -317579 -290581
17642 -290581 -98538 -50580 12663 -67949 -154089 -145331 -73930 121526 278135 110143 73413
17631 73413 212787 136605 -87661 -149457 -139432 -103209 20494 -16124 172418 91580 95114
17620 95114 53623 -21855 -34192 -7500 65304 24936 86409 29610 -29967 -27553 -61073 -48161
17608 -48161 88362 286305 324537 312242 276306 148636 19026 -200721 -346692 -391479
17598c91479L2229R4778P4391J00277j9990L5379K2334q1248p3656K54708K9304
17587G7027j13541o0371n1625J06414P0658J05236L8008P5036K4488m2655j8384
17576B10291p6256j24650L1513J44104O6549p6770j85452j34812j39100M1187
17566b43396k5046o5220R4892L5176m8050L5642p8236n0803J495L9038J3713J75012
17554a15783J24136J21284J58061j25659j25836j04801L5887Q4555L1460L7956
17544A21260J6211j40616r1576p2402L7048K20710O4014j27867J62919J42743
17534C32444k09288j66988N3004R2913M6020q4351j88348M287M8472m1347K7848
17523h5334M1464p0469n4643R6533R1607K34529k7076k01091j09607p5014j5070
$$ plain form
17598 -391479 -359250 -264472 -190081 -89804 -109794 -74415 -52081 -133329 -206985 47723 77027
17587 77027 -36514 -96885 -148510 -42096 28562 133798 171806 246842 271330 228675 210291
17576 210291 134035 9385 40898 185002 251551 174781 -10671 -145483 -284583 -243396
17566 -243396 -268442 -333662 -238770 -203594 -251644 -216002 -294238 -345041 -343546 -304508 -290795 -115783
17554 -115783 8353 129637 287698 162039 36203 -68598 -32711 51844 83304 121260
17544 121260 137471 -3145 -94721 -167123 -130075 90635 154649 26782 189701 332444
17534 332444 123156 -43832 9172 102085 148105 63754 -124594 -120307 -71835 -113182 -85334
17523 -85334 -43870 -114339 -168982 -72449 19158 253687 226611 25520 -84087 -159101 -174171
17512a74171k18454q7382J59523K49310o3624j25991Q8966J25981L4913q3444
17502i4373J42482M0149O5800m4108L6174K4961P7750R5818k8301j53983j50902
17491A1467R6482k01554j55973O4315J94196P6660q072O9714n7923m9718l6678
17480B916k07302L3386O4090n1441J07921n2263j30092r8798J9577L3347P647
17469b71012l5415N0635N6081l5993J41784K18485r1039j78915j1649n2806J32045
17458g7799K57802k5928o7843k401K4536J1521L3353O6084p6802P3082J24090
17447C39695l1284L1981J69327J64138M39402M75604K62291n63615p16836k31111
17437C39592K9456j10488l03215p2939Q8323L5699J1679k7989N1463r8161p9936
$$ plain form
17512 -174171 -392625 -480007 -320484 -71174 -134798 -260789 -171823 -45842 -10929 -94373
17502 -94373 48109 88258 154058 109950 146124 171085 248835 344653 316352 162369 11467
17491 11467 107949 -93605 -249578 -185263 8933 85593 77521 147235 89312 39594 2916
17480 2916 -204386 -171000 -106910 -158351 -50430 -102693 -232785 -331583 -312006 -278659 -271012
17469 -271012 -306427 -255792 -199711 -235704 -93920 124565 33526 -145389 -157038 -209844 -77799
17458 -77799 180003 154075 86232 83831 108367 119888 153241 219325 142523 215605 339695
17447 339695 308411 340392 509719 673857 1113259 1588863 1851154 1287539 570703 339592
17437 339592 369048 258560 -44655 -117594 -29271 6428 18107 -9882 41581 -56580 -136516
17426a36516J90528L0599j01411J0170j23679j31344R6053J59807L8715r3290
17416f0368j68423P3631J84815J05058r7119K6271N1144o2213m6455J33474L4787
17405A74602K4999j48194j66278L1041l1492q2844j20100K6977K69828K5137r7316
17394i3640J29887O0623j219m5013J4449j24665p0536p8300J38831L60519j21252
17383A69684j34793L2907k8544p4790j6890O5263P8236o8995r5271J00971m1872
17372a4094J3225l7218P4430M4121l4374r7787j57346p9519J05933N1339K0372
17361a10918J31873l1598p0203j55858k0499o4714r6462K31901J20244m2928J6159
17350i3003K4624r4315j24106q9670k1193J16926J07789P0191l3369K20290K7207
$$ plain form
17426 -136516 54012 84611 -16800 -6630 -130309 -261653 -165600 -5793 32922 -60368
17416 -60368 -228791 -155160 29655 134713 37594 63865 115009 52796 6341 139815 174602
17405 174602 199601 51407 -114871 -83830 -115322 -198166 -318266 -291289 -21461 3676 -93640
17394 -93640 36247 96870 95651 50638 65087 -59578 -130114 -208414 -69583 290936 169684
17383 169684 34891 67798 39254 -35536 -52426 12837 91073 22078 -73193 27778 -14094
17372 -14094 -869 -38087 36343 80464 46090 -51697 -209043 -288562 -182629 -131290 -110918
17361 -110918 20955 -10643 -80846 -236704 -257203 -321917 -418379 -186478 -66234 -109162 -93003
17350 -93003 -68379 -162694 -286800 -376470 -397663 -280737 -172948 -102757 -136126 84164 111371
17339A11371j34467r2684Q6960J35782L7555J42569r943k00637P8958N6503p2517
17328A39450j48938k8047J5339k083j60123j4370R8331l537J26805J75983p1015
17317A27795m0918K6539J43183j63413j18308O0465r2196J19554R2575l8825l0123
17306H6328j03716l8346J09685j57267p6253j1966J77205K05358J2615j78658
17296B4985j06914K1502q4546M4494J11013J26769n4722p76j290J8992l0767j20754
17284e2014o8649l2567K5446L7652O315J55806R3642m4241k16184M0330J45581
17273I1117k71678r0600j7778k854R3235J08335Q5617j42782P327R9566o3021
17262a03516m6344r3462j6834J48520P5213K9866n1802o8311n0066k9859n1192
$$ plain form
17339 111371 -23096 -115780 -28820 106962 144517 287086 277143 76506 155464 211967 139450
17328 139450 -9488 -37535 -22196 -24279 -184402 -198772 -100441 -103978 22827 198810 127795
17317 127795 86877 113416 256599 93186 -25122 35343 -56853 62701 155276 116451 86328
17306 86328 -17388 -55734 53951 -103316 -179569 -191535 -14330 191028 203643 24985
17296 24985 -81929 -60427 -144973 -100479 10534 137303 82581 81805 80515 99507 68740 -52014
17284 -52014 -120663 -153230 -127784 -90132 -83817 71989 165631 121390 -94794 -54464 91117
17273 91117 -180561 -271161 -288939 -291793 -198558 -90223 -4606 -147388 -140061 -40495 -103516
17262 -103516 -149860 -243322 -260156 -111636 -36423 -6557 -58359 -126670 -176736 -206595 -257787
17251b57787J82626k9735O5R603Q925L5131q80p4735k9353N1037K4791j55063
17239b35375Q6529P1097j17994r7453O6004K6292J1139O6528J48599P3343J49734
17228B48443N1698r2483j96881j5607j3886j28487l9044K35118J01682R9904j18408
17217A32049r6137r0271j98743J60328J14778j03044q8066j62940N685K52894
17207g3467L0527l0106J34840K1908m7651N2048j61576M1638J34804j83768j99250
17196b80053J2672n050k8742P1671J13623m4016j55717M1715K4579P8417l9804
17185b10705k0619J15258q6125J18014K33804O7166r2759j8940R7501O4261n4581
17174B12275p1184M8626J01439j06517k25350o6500J26001l5989n3802M9801j20099
$$ plain form
17251 -257787 -75161 -104896 -104831 -95228 -86303 -51172 -52052 -126787 -156140 -105103 -80312 -235375
17239 -235375 -148846 -77749 -195743 -293196 -227192 -200900 -189761 -123233 25366 98709 248443
17228 248443 300141 207658 10777 -4830 -18716 -147203 -186247 48871 150553 250457 132049
17217 132049 35912 -54359 -253102 -92774 22004 -81040 -169106 -332046 -326361 -73467
17207 -73467 -42940 -73046 61794 83702 36051 88099 -73477 -31839 102965 -80803 -280053
17196 -280053 -267381 -272431 -301173 -229502 -115879 -159895 -315612 -273897 -249318 -170901 -210705
17185 -210705 -231324 -116066 -202191 -84177 149627 216793 124034 105094 202595 266856 212275
17174 212275 141091 189717 291156 184639 -40711 -107211 18790 -17199 -71001 -21200 -141299
17163a41299m4993R1712N5366j19852N665J52227J04118j72908q1743O6168J04545
17152A9006q5512J01371J20668j17409p4000K6464j7917j5906J44756j8842j35116
17141e2437J9506n9380p2955J47487P2299q1671r5425Q3591M4429J6228n1581
17130b9909J12840j43574k71234N279L33913l9195k07830j17773J45847J19137
17120i2499o1643P2088K0229m263J768j4466N8790L1512P6502R7202k13491j68469
17108a96740q3669q4477N7141l4129J02765K24139r1686K8944n9999k77533p6768
17097d92012J04989K92133j2379L2280O5015J3363l2616n8015Q0710J27246k1751
17086I8963L731M7554p9972m5139j4362j34819P7904P3248k2954P511J10578J11722
$$ plain form
17163 -141299 -186292 -94580 -39214 -159066 -153401 -1174 102944 -69964 -151707 -85539 19006
17152 19006 -66506 34865 155533 38124 -35876 -9412 -27329 -43235 101521 82679 -52437
17141 -52437 -32931 -92311 -165266 -17779 54520 -27151 -122576 -38985 5444 21672 -29909
17130 -29909 82931 -60643 -331877 -326598 7315 -31880 -239710 -357483 -211636 -92499
17120 -92499 -154142 -82054 -61825 -66088 -64320 -78786 -19996 11516 88018 185220 -28271 -196740
17108 -196740 -280409 -364886 -307745 -341874 -239109 -14970 -106656 -77712 -137711 -415244 -492012
17097 -492012 -387023 -94890 -107269 -74989 -9974 3389 -29227 -87242 -6532 120714 98963
17086 98963 102694 150248 70276 25137 10775 -124044 -46140 27108 4154 11665 122243 233965
17074B33965q267j17577O8835N6587j9603j07384l9688l0416j35061L8235J73120
17063A12746J35323l6981j05851j8144o5846M9044j37889k7557J38565o2825k14648
17052b34063J85923P9782p2694O7247Q434q1329R216K40309K7948n2960K48740
17041D26553j12965j57730n8941j03185j60240M8907J59188J20623k09634N9906
17031A2482k6538R841L14r2889N2433M6121j62549j0756P3423P4844K2506L5064
17019C4296p5038Q7602P6454k3745k14978n9812m8771J20446J16937j35029l7346
17008a58984J42923J9410j06627J0745O9692P9184N6231k6807K348o3030j04358
16997g9273l31k0449m1714j070N1092o8082q8143L6586K59325l4532j67602O2034
$$ plain form
17074 233965 225698 108121 176956 233543 213940 106556 66868 36452 -98609 -60374 112746
17063 112746 248069 211088 105237 87093 21247 70291 -67598 -95155 43410 -19415 -234063
17052 -234063 -48140 31642 -41052 26195 34629 -46700 -37484 202825 230773 177813 426553
17041 426553 313588 155858 96917 -6268 -166508 -117601 41587 162210 -47424 12482
17031 12482 -14056 -4215 -3901 -96790 -44357 1764 -160785 -171541 -98118 -23274 -768 34296
17019 34296 -40742 46860 123314 99569 -115409 -175221 -223992 -103546 13391 -121638 -158984
17008 -158984 -16061 3349 -103278 -92533 -22841 56343 112574 85767 88115 25085 -79273
16997 -79273 -79604 -100053 -141767 -142837 -91745 -159827 -247970 -211384 47941 13409 -154193 -92159
16985i2159K2395m546K8278n8230Q3378O4057j36697r4246r4242O0740r483R9866
16973a30889J97254k7405P3679n4398k85307l3962K31J00216J88544m9878J3045
16962h870m6232p0543q8997j7515J85924J67378J6481q4071m7129K821k47935
16951b38688j00J10482j02427l1717Q9202j37452m5480K58729K02791n6835k14248
16940a65743k277J33733J75875J3733q3007k7627k4956j47501l9820j43697K19640
16929i1647J02610J5431j30602k9817O9616J22831J42770j05799r2207Q7356r673
16918H0869l837p8277k20052K1003P9194O4724J09278Q1417P8049j4699j74010
16907B3659j99102J62842j88148l8963k0936L3971J236M9283J59069J21404J8829
$$ plain form
16985 -92159 -69764 -74310 -46032 -104262 -20884 43173 -93524 -187770 -282012 -221272 -230755 -130889
16973 -130889 66365 38960 112639 58241 -227066 -261028 -260797 -160581 27963 -21915 -8870
16962 -8870 -55102 -125645 -214642 -232157 -46233 121145 137626 53555 6426 9247 -238688
16951 -238688 -238788 -128306 -230733 -262450 -173248 -310700 -356180 -97451 105340 48505 -165743
16940 -165743 -168020 -34287 141588 155321 72314 44687 19731 -127770 -167590 -311287 -91647
16929 -91647 10963 26394 -104208 -134025 -64409 58422 201192 95393 3186 90542 80869
16918 80869 77032 -1245 -221297 -200294 -121100 -56376 52902 134319 212368 197669 23659
16907 23659 -175443 -12601 -200749 -239712 -260648 -226677 -225441 -176158 -17089 104315 123144
16896A23144r118J5980l2933k15601K8965P7551K1827m4095q688j81905j9150
16885b44023J05146Q006L7905q8342j78461m268J58452o562n9326J9491p3400
16874c25382K4627R9708J83452O6502K0540r0434n1060J0463l0478J10124m9559
16863c1497p2476j69780r7667r7954J41982J1388K3074K69739K0101j14898k30688
16852c48676j4958J61000K4317P8263p6176j59560j03657J1571m8685P4455K04518
16841a97588J54801J12444J5678Q581L3717J24498q5980q3484j24386m0869O7995
16830a4593K8583n3437N214O7887N2386K188k85326p9157N4579K3364J37601Q3654
16818B2943R4822O4623L1228J8948k174k7778j91882j29365J17915o4930R709
$$ plain form
16896 123144 114026 130006 97073 -118528 -89563 -12012 9815 -34280 -42968 -224873 -244023
16885 -244023 -138877 -130871 -92966 -181308 -359769 -364037 -205585 -212147 -271473 -251982 -325382
16874 -325382 -300755 -201047 -17595 48907 69447 -20987 -72047 -61584 -92062 18062 -31497
16863 -31497 -103973 -273753 -371420 -469374 -327392 -316004 -292930 -23191 -3090 -117988 -348676
16852 -348676 -363634 -202634 -178317 -100054 -176230 -335790 -439447 -427876 -476561 -402106 -197588
16841 -197588 -42787 69657 85335 93916 127633 252131 166151 82667 -41719 -82588 -14593
16830 -14593 13990 -39447 -34233 33654 86040 88228 -197098 -276255 -221676 -198312 -60711 22943
16818 22943 117765 182388 213616 232564 230390 202612 10730 -118635 -720 -65650 -55941
16807e5941J78577p8204M1873k2744n6043j88346k5518J78605J85852Q1194J30095
16796C69400m0738j42224j43550k16445j02658J33948K48485k7640j77824q5911
16786a85157P6389K68J25614J72464Q7740O3774j7583k29413j79035j3280Q6161
16775a2058k2850l53547k28299L0765J58992K13123R6589J9990P743r870j52036
16764b51458j00743J0575K30857M9633J06502p3449j59519j98425M5143J5450
16754c25434P387K22569R2111q7868j16422J40386k726J18044m4918j5553Q6575
16743G4151l0526J0423m3214n9737q8699K12566J37592p9497k62921j99860q9369
16732d19091K3029L19427L15355j76280j17351j3053l0146q1862q638J58368O0797
$$ plain form
16807 -55941 122636 44432 86305 63561 7518 -180828 -206346 -27741 158111 239305 369400
16796 369400 328662 186438 42888 -173557 -276215 -142267 106218 78578 -99246 -185157
16786 -185157 -108768 -108500 17114 189578 277318 341092 323509 94096 -84939 -98219 -12058
16775 -12058 -34908 -388455 -616754 -585989 -426997 -213874 -117285 -97295 -89552 -99422 -251458
16764 -251458 -352201 -341626 -110769 -61136 45366 -28083 -187602 -386027 -340884 -325434
16754 -325434 -318047 -95478 -3367 -91235 -207657 -67271 -69997 48047 3129 -12424 74151
16743 74151 43625 54048 10834 -48903 -137602 74964 212556 133059 -129862 -329722 -419091
16732 -419091 -396062 -76635 238720 62440 -54911 -67964 -98110 -179972 -188610 -30242 30555
16721C0555O1025l0921k242M3071j19238l4373m5736M244J54346Q4499R152J3898
16709A68280J1771k24757k7744r4870j08313P9181K17296J7600j26011k9315n2220
16698a69102l1168N7489R3270j24917l0531j387j61477J85480K60374l5346r5452
16687e2767n7533l0556O343O6977L7626J07375J64996k2479k68948j44114N0005
16676a43075J36948j17504P9979M7852j5957j13301p6712j66086J28441J34980
16666a04435J50490R8861J3763M0647o7381m7397j11515m7956j7770L5468N3630
16655c595l921n8088j22074q119M949l2509l00251j1850J55830J61972J18428
16644i9228M475P2715L6347j97098k9769j26819M5508J83667N2839K6912j2976
$$ plain form
16721 30555 91580 60659 58417 101488 -17750 -52123 -97859 -93615 60731 145230 154382 168280
16709 168280 180051 -44706 -72450 -167320 -275633 -196452 20844 38444 -87567 -116882 -169102
16698 -169102 -200270 -142781 -49511 -174428 -204959 -206346 -367823 -182343 78031 42685 -52767
16687 -52767 -110300 -140856 -134513 -67536 -29910 77465 242461 219982 -48966 -193080 -143075
16676 -143075 -6127 -123631 -43652 4200 -11757 -125058 -201770 -367856 -239415 -104435
16666 -104435 46055 144916 158679 199326 131945 84548 -26967 -74923 -92693 -57225 -3595
16655 -3595 -7516 -65604 -187678 -195797 -190848 -223357 -523608 -535458 -379628 -217656 -99228
16644 -99228 -94753 -22038 14309 -182789 -212558 -339377 -293869 -110202 -57363 -30451 -43427
16633d3427j05676j39394J8625J63828j20457O6180J0701O9141J12153O367j03474
16622f5433k051J06953J03781j61798j16219o5517J63535N2988p3921q8050k2168
16611a67900J54856J45404k4780J1273J9714L0293m8389M6286j05876k11469j01806
16600b52394J62892j5509j01579J9969m9290j13699J29969K51565J08606Q7235
16590B27765k77854j51245J23607R4915o4613O0373n0693j02824p7782Q2851l9842
16579a75342m5491J30904K54387j1108j55569j34169n0917J02326O320Q3597J8
16568D956j52770k831J56598J1140l3157J13248m3651N5951j27586j22665N133
16557a35634j38374n0772J03351j34184k3347J39911r8599J8392k2482Q2485m53
$$ plain form
16633 -43427 -149103 -288497 -269872 -106044 -226501 -160321 -149620 -80479 31674 38041 -65433
16622 -65433 -67484 39469 143250 -18548 -134767 -200284 -36749 16239 -57682 -145732 -167900
16611 -167900 -13044 132360 107580 118853 138567 168860 120471 166757 60881 -150588 -252394
16600 -252394 -89502 -105011 -206590 -186621 -235911 -349610 -219641 31924 140530 227765
16590 227765 -50089 -201334 -77727 17188 -47425 12948 -37745 -140569 -218351 -135500 -175342
16579 -175342 -220833 -89929 164458 153350 -2219 -136388 -187305 -84979 -78659 4938 4956
16568 4956 -147814 -150645 5953 17093 -16064 97184 53533 109484 -18102 -140767 -135634
16557 -135634 -274008 -324780 -221429 -355613 -378960 -239049 -337648 -319256 -341738 -259253 -259706
16546b59706J07461m9348J76991J04857l3570Q4172p9968m6470l1600M0672K6462
16535C9953j39490m2864R9055k6483P258R3447J6195J15743P446O8712k54231
16524a5259j15825N0951L48803j53786j41444j05914L087K0862J40612l332j87577
16513a58822j31175J7139P6179R2267R7603O7177j1631j49901M2580L4150r1979
16502a16413j15267n1688K20545K6966J52149k2571k77333j11425P6311J79574
16492c9152o5093j66385L5808J48458p0780n5331N9452j6496J83868J06042j90347
16481f9956p9318Q4433J9759j5781j00470K7754M5754N516k7480k7324J97010
16470E9897M7260k54272r6630N4523J17680m5881r6171k5557J05231K5625J1089
$$ plain form
16546 -259706 -152245 -201593 -24602 80255 46685 130857 50889 4419 -27181 13491 39953
16535 39953 -99537 -142401 -43346 -69829 -62571 30876 47071 162814 170260 238972 -15259
16524 -15259 -131084 -80133 268670 114884 -26560 -132474 -129387 -108525 32087 28755 -158822
16513 -158822 -289997 -272858 -196679 -104412 -6809 60368 48737 -101164 -58584 -24434 -116413
16502 -116413 -231680 -283368 -62823 -35857 116292 93721 -183612 -295037 -218726 -39152
16492 -39152 -104245 -270630 -234822 -86364 -157144 -212475 -153023 -169519 14349 120391 -69956
16481 -69956 -149274 -64841 -45082 -60863 -161333 -133579 -87825 -82309 -109789 -137113 59897
16470 59897 107157 -147115 -243745 -189222 -71542 -117423 -213594 -239151 -133920 -108295 -97206
16459i7206j9588j45421j35430N7347K01958L3536J2382J37723l3459J5311J50206
16448A77359n1567j71047j66109K9607p9581N1678L9431R2375K8162M3873q5440
16437i1259R3803O5696m3534o3365j433L955N7744j48448J11169j7008N1908l3013
16425a3785j40468o9746r3467k5096K7738J56526n6104j3898P1644K32977K13521
16414B89842j47457k06159r45m7997J55060K23208L0517n2075j02244J0786j97340
16403d4804r3297k3560l4269R225Q3742L6100Q490j16870j08301J15103j03691
16392b72132N3572J66827L7041M4468r3356j012k4386J45916J76129N8844j60666
16381A31245q0561K22371p7045J3653r1748q7578J42443j55866M3463J10981J4576
$$ plain form
16459 -97206 -116794 -262215 -397645 -340298 -138340 -104804 -92422 45301 11842 27153 177359
16448 177359 125792 -45255 -211364 -181757 -261338 -209660 -170229 -77854 -49692 -5819 -91259
16437 -91259 2544 68240 24706 -38659 -40092 -36137 21607 -126841 -15672 -32680 19228 -13785
16425 -13785 -154253 -223999 -317466 -342562 -314824 -158298 -214402 -228300 -156656 76321 289842
16414 289842 142385 -63774 -64719 -112716 42344 265552 296069 243994 141750 152536 -44804
16403 -44804 -138101 -161661 -195930 -186705 -102963 -66863 -58373 -175243 -283544 -168441 -272132
16392 -272132 -218560 -51733 -14692 29776 -63580 -64592 -88978 56938 233067 291911 131245
16381 131245 50684 273055 196010 209663 117915 30337 172780 16914 60377 171358 185934
16370A85934k7140j57968j045P394m9185K00567J12734Q5424k85667j93538J33268
16359A0778J26722J5246j07565M0010P7163P0895j44231l26061j09074q9530J35723
16348b99924K27273L8332j08946J1987m2316l7318k8110J12178J09978n9546J5199
16337f1213j06240r5044J35860n1471k4300J06136J23477P9981j14192j02590
16327a09596J07266J14144p0726r4497j7508J14516j07678j58082m0331J102Q84
16316b60506K07080L5862p3816m4171K3422J54644J13796j5266j24527q0361N0057
16305a3786J0476N9843Q0954l4668j02752j42847j94231o6007J30941n734J00965
16294a76846L78309L0826p3006p2109q1085o0707o2798k32528j0756J33043J08240
$$ plain form
16370 185934 158794 826 -219 7175 -42010 158557 271291 356715 71048 -122490 10778
16359 10778 137500 152746 45181 85191 162354 233249 89018 -237043 -346117 -435647 -299924
16348 -299924 -72651 -34319 -143265 -131278 -173594 -210912 -239022 -126844 -16866 -76412 -61213
16337 -61213 -167453 -262497 -126637 -178108 -202408 -96272 27205 107186 -7006 -109596
16327 -109596 -2330 111814 41088 -53409 -70917 43599 -64079 -222161 -262492 -261390 -260506
16316 -260506 -53426 -17564 -91380 -135551 -112129 42515 156311 141045 16518 -63843 -13786
16305 -13786 -3310 56533 137487 102819 67 -142780 -337011 -403018 -272077 -277811 -176846
16294 -176846 201463 232289 159283 87174 6089 -54618 -117416 -349944 -360700 -227657 -119417
16283a19417J18873K0859j02472p0229o2369Q3921p4417o798j3727Q0538j4988
16272a60226J45533m8942n39J84010M0022J34631r8202j46988P9486n4638j23971
16261d9824j4827J39548Q0661L8512m8982j46808L4837Q8174O736j05898r9502
16250g7373j09002j11575O9808J03078m9256J32857N5029J0491J53592J41850
16240C19499l04223r6981P0841j31230k2217Q6916R3490Q6784l1674O6611K0809
16229A58625M2049N9859K01175j03158j73577q7604l0125N6345r5262p7293j66754
16218b15720L8674J1342j54144J57992J96802N7471L592k37067k42306l5663R8833
16207c20194K08068R553o7583J2400p5658j207J11640j2479j3039J7395Q1551
$$ plain form
16283 -119417 -544 20315 -82157 -152386 -214755 -130834 -205251 -212049 -225776 -145238 -160226
16272 -160226 -14693 -63635 -64174 119836 159858 294489 196287 49299 128785 74147 -49824
16261 -49824 -64651 74897 155558 194070 145088 -1720 33117 121291 128027 22129 -77373
16250 -77373 -186375 -297950 -228142 -125064 -174320 -41463 13566 24057 177649 319499
16240 319499 15276 -81705 -10864 -142094 -164311 -77395 16095 102879 71205 137816 158625
16229 158625 200674 260533 461708 358550 184973 97369 67244 123589 28327 -48966 -215720
16218 -215720 -177046 -165704 -319848 -161856 34946 92417 96009 -141058 -383364 -419027 -320194
16207 -320194 -112126 -102573 -170156 -157756 -233414 -234621 -122981 -135460 -148499 -131104 -49553
16196d9553o220K19319L5246j39843o7046K5541J6446P7083M3547q5219L9878
16185A09179L2351M5394J5370O8425p855j8893m2773j75618m4950N4939j9741
16174A5828j6883P8269j2838J3475r700q9457l3797l5262O8281k0744q6652l6946
16162a66426L6690n0110q2150R4006K20302o6678k18835j30546K1523j44730R4077
16151c92877L54882Q7870M6310Q8815j93872j33449O3579j7739j33342o8087J73539
16140a24371J02541Q1651M8512M963M4101o0393j47385m9120J68075J15520l0868
16129A53226n9951M4465l5133j2963n3425n0226N2165J4914j48662R8450K22321
16118B25181j33373J18157R4249j19247q9904O8462o6679L2346P9110m2444j40866
$$ plain form
16196 -49553 -55773 163546 198792 58949 -8097 17444 33890 110973 154520 69301 109179
16185 109179 141530 186924 202294 270719 262864 243971 201198 25580 -19370 35569 15828
16174 15828 -1055 77214 64376 77851 68151 -21306 -55103 -90365 -22084 -42828 -129480 -166426
16162 -166426 -129736 -179846 -261996 -167990 52312 -14366 -233201 -363747 -342224 -486954 -392877
16151 -392877 -37995 49875 96185 185000 -8872 -142321 -78742 -96481 -229823 -297910 -124371
16140 -124371 -21830 59821 108333 113296 157397 97004 -50381 -99501 68574 184094 153226
16129 153226 93275 137740 102607 89644 36219 -14007 38158 53072 -95590 2860 225181
16118 225181 91808 209965 304214 184967 95063 163525 96846 129192 208302 165858 24992
16107B4992K20170j09538j38177q5998K8212J87570Q0499J5497L312j03298k74779
16096a51538J54570o2970J2312n6332J30285K05908K0586J0140k5693k38012r0914
16085i1658L9361N6769J324p7613l6999p6480K8989R4799K3185N5173P0068j77500
16073i0582M443L15093j19394j57992j46155m3342k5431K56637J30745j20461
16063C561J08607m1961l6585q103n6787j83888J44390J40397R137K9766n8788
16052D9746j41934o937K0331j2465K5032n372L4864K19950M3632p8762o9670j30781
16040e2366m538j09310P4782J03561l8453j07635J4315m320j07555l8948J62541
16029a07926P8505k5227J57588l5905r7943K3940j3765m5885m7701O9410o0222
$$ plain form
16107 24992 245162 135624 -2553 -88551 -60339 127231 207730 223227 226539 123241 -151538
16096 -151538 3032 -59938 -47626 -103958 26327 232235 252821 262961 237268 -744 -91658
16085 -91658 -52297 4472 5796 -71817 -108816 -185296 -156307 -61508 -38323 16850 86918 -90582
16073 -90582 -86139 228954 109560 -48432 -194587 -237929 -263360 -6723 124022 3561
16063 3561 112168 70207 33622 25519 -31268 -215156 -70766 69631 78768 108534 49746
16052 49746 -92188 -99125 -78794 -91259 -66227 -71599 -36735 183215 226847 148085 78415 -52366
16040 -52366 -56904 -166214 -91432 12129 -26324 -133959 -119644 -123964 -231519 -270467 -107926
16029 -107926 -29421 -54648 102940 67035 -30908 -6968 -20733 -66618 -114319 -44909 -105131
16018a05131M8901L0783J26903m5191O4337N568o3601P5512j31549k06288J6389
16007a83367m5426j45067L7905J49332j9939j5420L9945o93J02728N5263M354
15996b0385P4864O4852l5927p2054k41143K1211q018o0107J0739N3446J37521
15985g5001o8126p8168N1327J71588j2082K3627P3146J57951j2088k9977n4791
15974A47406P639o3608J2111P1820p4467q4379M9477L3062q3102j21266J69191
15963F3884P8817P152L4364j1209l4548N1036l982o6633k11610O9575J25174J96354
15951B98374l8802r2234j15121K5424P6509j64041L7762J47490R6988J19080j19862
15940B71567k40562k1278j8126k8230n0614Q0928J6212p3034k3890Q0807m1887
$$ plain form
16018 -105131 -56230 -25447 101456 56265 120602 126170 62569 138081 6532 -199756 -183367
16007 -183367 -228793 -373860 -335955 -186623 -206562 -221982 -182037 -182730 -80002 -24739 -20385
15996 -20385 54479 119331 83404 11350 -229793 -208582 -216600 -276707 -265968 -212522 -75001
15985 -75001 -143127 -221295 -169968 1620 -10462 13165 86311 244262 232174 202197 147406
15974 147406 155045 91437 103548 175368 100901 16522 65999 99061 15959 -105307 63884
15963 63884 142701 149853 184217 173008 138460 189496 185514 118881 -92729 -23154 102020 298374
15951 298374 259572 167338 52217 77641 154150 -9891 27871 175361 272349 391429 271567
15940 271567 31005 9727 -8399 -36629 -87243 -6315 9897 -63137 -87027 -6220 -48107
15929d8107m5691O7659r1228o8580J59410O3758l1899m911Q7569K0560l9871k7351
15917D1318P974q8437M8082r0893J2532K0560J55226L5404J9172K2077q7464L0662
15905A26213o8651q2239j40773O268N7987J0040P5259m5232k4907Q9396n805j20009
15893a22453K2233N9090k0617n6853J38760M9555r7979r8157N1080P0384R6066
15882I1109L066N7157L4361n7420j58141M4051Q2855R0325o1955r1942q2884J1197
15870c8221m9260m7636j21725j5702k6565k3917R5391n6409J39142R4098k85071
15859c35875k27612J04259J54604P8694J30030R9158J35576M3180j37776j96971
15849a52733j15966J20464q8654K89009O2261m7416j20720p6993Q2945j081p9536
$$ plain form
15929 -48107 -93798 -26139 -117367 -185947 -26537 37221 5322 411 87980 108540 68669 41318
15917 41318 49292 -39145 8937 -81956 -69424 -48864 106362 141766 160938 183015 95551 126213
15905 126213 57562 -24677 -165450 -159182 -101195 -91155 -15896 -61128 -86035 3361 -2444 -122453
15893 -122453 -100220 -41130 -61747 -118600 20160 69715 -28264 -126421 -75341 -4957 91109
15882 91109 94175 151332 185693 128273 -29868 14183 97038 187363 125408 33466 -49418 -38221
15870 -38221 -87481 -135117 -256842 -272544 -299109 -323026 -227635 -284044 -144902 -50804 -335875
15859 -335875 -563487 -459228 -304624 -225930 -95900 3258 138834 182014 44238 -152733
15849 -152733 -268699 -148235 -236889 52120 114381 66965 -53755 -130748 -47803 -48884 -128420
15838a28420J555J35480J5669K6353n1311j47621k9258J72569K8678J25172L2277
15827A81143K0152p3361k93695j58889P9264Q1615j5406K2028j06615j4723K40799
15816c7688J24251J4575L3521m4925o2087l2136K27910j33589p2610K1679Q6650
15805A25551M3534m7250j06730j33587J62965k987j92690M5768J01973N4964k3807
15794B7704k1406q191J2649j00086l6636j37140m4809J63194J82453P21o8629
15783c0176N3383O974n7510P7888K53097J13562o2072j14817j79210k49668J25344
15772f3205L00669j30682k83596J29507J3640J1152O1647J3722Q2774j64086j86254
15761b14712L7608J34316J18661j15594j88199n922J78601J47800n5303j20342
$$ plain form
15838 -128420 -126865 8615 24284 50637 -674 -148295 -177553 -4984 23694 148866 181143
15827 181143 201295 127934 -165761 -324650 -245386 -163771 -179177 -157149 -263764 -278487 -37688
15816 -37688 86563 101138 134659 89734 27647 -4489 223421 89832 17222 38901 125551
15805 125551 169085 121835 15105 -118482 44483 41496 -151194 -105426 -3453 51511 27704
15794 27704 6298 -1893 10756 -89330 -125966 -263106 -307915 -144721 37732 38453 -30176
15783 -30176 23207 30181 -27329 50559 303656 417218 355146 240329 61119 -188549 -63205
15772 -63205 237464 106782 -176814 -47307 -33667 -22515 39132 52854 135628 -28458 -214712
15761 -214712 -177104 -42788 75873 -39721 -227920 -233842 -55241 92559 37256 -83086
15751h3086m6372J04693K7900J5894L6468O7234m5095l3981j32415n6148o8441
15740b13349j81517J22684K73785O6425j13949j17462m1773O7490O5854L0616
15730d1196P4163R8531J9861k54214j80164Q3651j84965J88970k1127j14391l5266
15719c66147n5305J11775J48756k2304j4602P4055j0726j2134J8755M4848J02573
15708A9544L4251j55902q2896Q8660P3538j0671P8414Q7907J19393Q2282r1807
15697B42713L375j85974R466P8202r473j94227M3348R560j01582q9916r7381l6129
15685c28018J39778J78202K68974q6405l40633O2328n8761P4185P8401J63739
15675A51790P1974J19225k78149k69702J4872K03500n3904j37903Q4202j3531
$$ plain form
15751 -83086 -129458 -24765 3135 19029 55497 122731 77636 43655 -88760 -144908 -213349
15740 -213349 -394866 -272182 1603 68028 -45921 -163383 -205156 -137666 -71812 -41196
15730 -41196 32967 131498 151359 -102855 -283019 -199368 -384333 -195363 -216490 -330881 -366147
15719 -366147 -421452 -309677 -160921 -183225 -197827 -123772 -134498 -146632 -127877 -83029 19544
15708 19544 53795 -102107 -185003 -96343 -22805 -33476 44938 132845 252238 334520 242713
15697 242713 246088 60114 69580 147782 138309 -55918 -12570 -3010 -104592 -194508 -291889 -328018
15685 -328018 -188240 -10038 258936 172531 -168102 -105774 -164535 -90350 -11949 151790
15675 151790 223764 342989 64840 -204862 -189990 13510 -40394 -178297 -94095 -107626
15665a07626o583J57706q224n0915n0420K1750j19883O8583J50155O3354j2638
15654A05259J29939K29575j2753k00445j65029K5057L411Q182m318k0652L2007
15643A30233L3302j70575j08514P6916o7035J4254M9197j97466n535J54494R2838
15632B109n9139n3697l322j69731K6423J210p3188L0197J47966J02206J71334
15621A22368L3036o1707j63877M9754M9355P6988k1265q523J2022R1142n7243
15610A22050j64152K6349j70879o1642J27630J19495l8350K8974J43296L5268
15600A68039k7946j3978K2385K9353n0534J20290K7505j60506j34930P4209j34092
15589h0205J8808R5848P9035n5879o9175N8246r9726m6515r4657j11567K36435
$$ plain form
15665 -107626 -114209 43497 35273 -15642 -66062 -44312 -164195 -95612 54543 117897 105259
15654 105259 235198 464773 452020 251575 86546 111603 115014 123196 118878 98226 130233
15643 130233 163535 -7040 -115554 -38638 -105673 -91419 -42222 -239688 -245223 -90729 2109
15632 2109 -57030 -110727 -114049 -283780 -257357 -256147 -329335 -299138 -151172 -48966 122368
15621 122368 155404 93697 -70180 -20426 28929 105917 84652 76129 88151 179293 122050
15610 122050 -42102 -15753 -186632 -248274 -120644 -1149 -39499 -10525 132771 168039
15600 168039 140093 126115 148500 177853 127319 247609 275114 114608 -20322 53887 -80205
15589 -80205 -61397 34451 113486 57607 -11568 46678 -53048 -99563 -194220 -305787 -69352
15578f9352M0894j31661M4084k3490M7605j92951j08352o8589l9488J70312K06574
15567a24414K08886k8998k9316J26822J5033k76898j8959O3527J11889J35487
15557A83059j68194m2596J41026N0225k9746k23218p674o933o5271K566J39804
15546b6952Q5219l0524j9869J86512J84044O0858m8649o1044p8184j05474j88695
15535d2758j55930J9098J89852O2095L2406K6990j69954j29520o3706P4235M1810
15524a15382j01573k608L8473j00093O8817J69123J2446J15358R5272J18994q90
15513B97937p5364J13979j82580k02872m8032P350k2562n3623l7062M1537O4480
15502i6812M9947o8471J6792K23816L6837j26024p8324O9650J6998j0673M9455
$$ plain form
15578 -69352 -28458 -160119 -116035 -139525 -91920 -284871 -393223 -461812 -501300 -330988 -124414
15567 -124414 84472 55474 26158 152980 168013 -108885 -127844 -64317 47572 183059
15557 183059 14865 -27731 113295 163520 133774 -89444 -97118 -104051 -169322 -166756 -26952
15546 -26952 58267 27743 7874 194386 378430 439288 390639 329595 251411 145937 -42758
15535 -42758 -198688 -179590 10262 72357 104763 131753 -38201 -167721 -231427 -157192 -115382
15524 -115382 -216955 -219563 -181090 -281183 -212366 -43243 -30797 84561 179833 298827 297937
15513 297937 222573 336552 153972 -48900 -96932 -89582 -112144 -165767 -202829 -161292 -96812
15502 -96812 -46865 -115336 -98544 125272 162109 36085 -42239 27411 44409 33736 83191
15491H3191j37274M4731N3995j03069L2720J41531O5089j07314j4912L9906k04613
15480a06019k08027O3228J38144J30394K7592o8894q992K4799k3505L9305K6053
15469C4078N5300m6512j40580j10825K0303N1822m9609J66076O4317J7978J04903
15458A67251R9187P7686k34109K4392q3609j57589O8035J07544J64094O7423j63214
15447A37091k43359M2497P0344j81183J10288J46121J02300k47928q2390j1330
15437a57549N868o3625m3100P5625L0174j05350j62896K66613K14183m5401M4415
15426E8957O9677J29172j05897k6772L5113q1555q0151R8476p8633N6902j6752
15415E8537r8217k9713P359J19419J79397m015j53972J3403k253O1785J14120
$$ plain form
15491 83191 -54083 -9352 44643 -58426 -25706 115825 180914 73600 58688 98594 -106019
15480 -106019 -314046 -250818 -112674 17720 45312 -23582 -32574 -7775 -31280 8025 34078
15469 34078 89378 42866 -97714 -208539 -188236 -136414 -186023 -19947 44370 62348 167251
15458 167251 266438 344124 110015 134407 50798 -106791 -38756 68788 232882 300305 137091
15447 137091 -106268 -63771 6573 -174610 -64322 81799 184099 -63829 -146219 -157549
15437 -157549 -151681 -215306 -258406 -182781 -152607 -257957 -420853 -154240 59943 14542 58957
15426 58957 128634 257806 151909 125137 160250 78695 -1456 97020 18387 75289 58537
15415 58537 -39680 -69393 -62034 57385 236782 232767 78795 92198 89945 151730 265850
15404B65850j43465l29509j79353P5143J25262j06160j3391J57240l7291M3821
15394a41853M6794J88112j2941m6002J28164j39085r5766L5482J01319J37043
15384B01267m0050K0404J02630o3492j02637J10863j0189j05727P3023R4946M8409
15373C29447m993j16510k9147q5778j81159j30079K1741R0872J70436J4940q5776
15362f006M5623l2269j22258j17365l9657r4566O5249P5439M5902J58956J69012
15351A48060j63215r6335P3378l9661j34055q795K2831J5091M8484J56164j37893
15340a15946n2978J9405R1899q1320R994J40378n8684o7586J05100k091Q5703
15329G3874J51230K6831L8074P1304o9367j74695n0336J53567J35547l1080j19702
$$ plain form
15404 265850 122385 -207124 -386477 -311334 -186072 -292232 -305623 -148383 -185674 -141853
15394 -141853 -95059 93053 80112 34110 162274 23189 -72577 -37095 64224 201267
15384 201267 161217 181621 284251 220759 118122 228985 218796 113069 186092 281038 329447
15373 329447 324454 207944 178797 93019 -88140 -218219 -196478 -105606 64830 79770 -6006
15362 -6006 39617 7348 -114910 -232275 -271932 -366498 -301249 -225810 -179908 -20952 148060
15351 148060 -15155 -111490 -38112 -77773 -211828 -220623 -197792 -182701 -134217 21947 -115946
15340 -115946 -168924 -149519 -57620 -138940 -128946 11432 -47252 -114838 -9738 -11829 73874
15329 73874 225104 251935 290009 361313 291946 117251 66915 220482 356029 324949 205247
15318B05247q6307J5415J25415K050k01231j97034J64394O952j5882j27472k2059
15307a30512o220N2898P5016J36718l9256r971J7655O5053p8702p741k1037j06723
15295e2822k0174n4970Q9687k50019j03924M1777J64788M1038J12823K9544O2983
15284F0731J8490k22326M6494R5220j13980m9844j46P7879J33681j582k6847J6933
15272C4703q7866j35500j07656n5928J81692J35091j3489K3531P9069j4501k85621
15261b46475j08386Q3578j6340K12345J61047K17343P554q2097n2115L1982j65
15250B08271p694m9471r8914k06925p7643R2471J13520j5215L3286j19368k247
15239a29929J04915K06858N7393j40116k40259J17041J2151j34378o1068o4703
$$ plain form
15318 205247 118940 134355 259770 261820 60589 -136445 27949 34901 19019 -108453 -130512
15307 -130512 -136732 -83834 -8818 127900 88644 78673 96328 161381 82679 74938 53901 -52822
15295 -52822 -72996 -127966 -38279 -288298 -392222 -350445 -185657 -144619 -31796 -2252 60731
15284 60731 79221 -143105 -96611 -1391 -115371 -165215 -165361 -87482 46199 44617 17770 34703
15272 34703 -53163 -188663 -296319 -352247 -170555 -35464 -48953 -25422 53647 39146 -246475
15261 -246475 -354861 -271283 -287623 -75278 85769 303112 310666 228569 176454 208436 208271
15250 208271 200577 151106 52192 -154733 -232376 -139905 -26385 -41600 -8314 -127682 -129929
15239 -129929 -25014 181844 239237 99121 -141138 -24097 -11946 -146324 -207392 -272095
15229b72095J80326J15623n1259p4075k1109m2810k93MP580m6498O6257J18199
15217b0150Q7937J5359P3020K04985J725K2458j48533j82784m8867j52142M3522
15206a03470M0454l2572Q3442P9628J06800j40004r1396O8976M8949P8776K3980
15195A63563m0688O2265J4389M2440j96614m9542L5679M7271j6928K93230j60183
15184A94882k09075Q1184Q6897M4326L7948O0066j00932n6517K2527r1022M6618
15173A16902k5126k36738k21543J12388J18220p8892P9950j08278j672N1945O5047
15162a27797J57595J07377k58079k29363n2679J75367J69460J73276j6208j4667
15152H4282M7396J74639J64405k6704k31876o5236J03930J1940k141k09358j94889
$$ plain form
15229 -272095 -91769 23854 -27405 -101480 -122589 -165399 -165692 -165688 -158108 -204606 -138349 -20150
15217 -20150 67787 83146 156166 361151 362876 385334 236801 54017 5150 -146992 -103470
15206 -103470 -63016 -95588 -12146 67482 174282 34278 -57118 11858 60807 139583 163563
15195 163563 122875 185140 199529 241969 45355 -4187 31492 78763 61835 355065 194882
15184 194882 -14193 66991 153888 198214 236162 296228 195296 138779 161306 70284 116902
15173 116902 91776 -144962 -366505 -254117 -135897 -214789 -134839 -243117 -244789 -192844 -127797
15162 -127797 29798 137175 -120904 -350267 -402946 -227579 -58119 115157 98949 84282
15152 84282 131678 306317 470722 444018 212142 146906 250836 262776 260635 51277 -143612
15141a43612J2110L0715j68929m2085R4552J14853q4917r0122J54021j1989K5128
15130a10275J01493j5407n4055J6522j56773J13289J11635j63751J7286J76692
15120C6656l1219m6268r8252j00561J23144P3375J10029p3891j75462O0022m2618
15109a65045k607K0290K4600P582k368k3542J2289O3000K56523Q0390l4301j03119
15097A33692k71394n2125J00962q377N51N4940j52016J4595K55896M8359Q9220
15086B14303K58j1278n5146j3007o1454k42044k01174J09778J34025J40079J19948
15075A34288j31273n9090K4348R4853J22583l08012o491R2715L1950J30591m1948
15064H4514j23460K2462J76191O253r8456j31828M2561J03639J3166j24338l2193
$$ plain form
15141 -143612 -131502 -100787 -269716 -311801 -217249 -102396 -187313 -277435 -123414 -135403 -110275
15130 -110275 -8782 -24189 -78244 -61722 -218495 -105206 6429 -157322 -140036 36656
15120 36656 5437 -40831 -139083 -239644 -116500 -43125 66904 -6987 -182449 -122427 -165045
15109 -165045 -167652 -147362 -122762 -115180 -117548 -141090 -128801 -65801 190722 271112 236811 133692
15097 133692 -137702 -189827 -88865 -97242 -96691 -41751 -193767 -179172 76724 125083 214303
15086 214303 214561 203283 148137 135130 73676 -168368 -369542 -259764 -125739 14340 134288
15075 134288 3015 -56075 -31727 63126 185709 -122303 -128794 -36079 -4129 126462 84514
15064 84514 -38946 -16484 159707 165960 67504 -64324 -21763 81876 95042 -29296 -61489
15053f1489K0325n5433j04732l8420O9209P6831J19201J27028p3020j80082k7450
15042a28032J81535J86618q5765k32288Q5146M6024j69648M2390L6617J6005P0945
15031D9547R321L8377k28834k11286J15860R4155J98940j45566k17301K06669
15021i0118J68947P8857n1845j62920j42871j0079J43580J32290p3519L2527J66465
15010A91314n0316P7320j05998J9063L6188m7648J13623N6236j8374j04832j24581
14999D1995k8441J2135j67402k6682j23415q1442K2628K15008J37925R3686l3762
14988F2233j33293Q8333R3824j54N1727R2801L1631J35725N0479j39191j80945
14977A53170j75033P8115k1288j12639J06478N3423j31630K3784J68027n5041
$$ plain form
15053 -61489 -41164 -96597 -201329 -239749 -170540 -93709 25492 152520 79500 -100582 -128032
15042 -128032 53503 240121 154356 -77932 7214 53238 -116410 -74020 -37403 -21398 49547
15031 49547 58868 97245 -131589 -342875 -227015 -132860 66080 -79486 -296787 -90118
15021 -90118 78829 157686 105841 -57079 -199950 -210029 -66449 65841 -7678 24849 191314
15010 191314 140998 218318 112320 131383 167571 119923 233546 289782 271408 166576 41995
14999 41995 13554 25689 -141713 -168395 -291810 -373252 -350624 -135616 2309 95995 62233
14988 62233 -71060 17273 111097 110943 162670 255471 287102 422827 473306 334115 153170
14977 153170 -21863 56252 34964 -77675 28803 82226 -49404 -25620 142407 87366
14967H7366J42065R3470L4495j42929J0781J25407K5297j84284l16151P4624L06165
14956B56306k2771n7067m4681M5395j01823j24898m2425k64181r3728J97316j57186
14945d09743J8461P5295O4722J88281J09556j8923p1676p5917J28132J39711q745
14934A39154n9953p5896m6157N9252r3802j04946J05421o2225r7381M4183K4289
14923a68061j17237K3368N8349L7089O6673n6662j41419l1649k0446p8755K05293
14912b23457Q1793M9735N9866p9647L049J61822o5355k9257o1040l8791L3511
14901a07771J34662M5457j22467j68519n2500J07674O2673j12993J76010J68361
14891A30587j86227rQ0199J01417n9129m9132k1884o6681K13250N9410j85586
$$ plain form
14967 87366 229431 322901 357396 214467 225248 350655 375952 191668 -124483 -49859 256306
14956 256306 233535 176468 131787 177182 75359 -49539 -91964 -356145 -449873 -252557 -409743
14945 -409743 -391282 -315987 -251265 -62984 46572 27649 -44027 -119944 8188 147899 139154
14934 139154 79201 3305 -42852 16400 -77402 -182348 -76927 -139152 -236533 -192350 -168061
14923 -168061 -285298 -261930 -203581 -166492 -99819 -156481 -297900 -329549 -349995 -428750 -223457
14912 -223457 -141664 -91929 -32063 -111710 -108661 53161 -12194 -41451 -102491 -141282 -107771
14901 -107771 26891 72348 -50119 -218638 -271138 -163464 -100791 -213784 -37774 130587
14891 130587 -55640 -55649 24550 125967 66838 17706 -4178 -70859 142391 201801 16215
14880A6215K7037q1539j59233K7847J03581j17073J27671J91271j4037j10181
14870A1559N1055r9385Q6703p1466j73019N244J25397J55048J50128P8100l00597
14859A8767k06516J99627K12160k2163o8583j24629O5537j14436k712j4319M4140
14848a3127P8685r3183k59268J00507K68081o0209M53J78910J32427k2276M3563
14837C54563L4235k7220o1542m2788M446K0911J795j13098j17192O7995J8560
14826A40665o4674n6952k7480m2857J26232J59378n9452j32177N0042K3018l1300
14815H4443K2152j14380Q023n9811P0551l7570o4840j3390O5069J3719N9559J08567
14803A42092Q6202J87346K9781j88171k22156J52614J77116M615r4243P2899J97074
$$ plain form
14880 16215 43252 -38287 -197520 -169673 -66092 -183165 -55494 135777 121740 11559
14870 11559 62614 -36771 49932 -21534 -194553 -189309 -63912 91136 241264 319364 18767
14859 18767 -187749 11878 224038 201875 133292 8663 74200 -40236 -42948 -57267 -13127
14848 -13127 65558 -27625 -286893 -186386 81695 21486 21939 200849 333276 311000 354563
14837 354563 388798 361578 300036 257248 261694 282605 284400 171302 54110 122105 140665
14826 140665 75991 19039 -8441 -51298 74934 234312 174860 42683 92725 115743 84443
14815 84443 106595 -7785 238 -59573 10978 -26592 -91432 -104822 -39753 -26034 33525 142092
14803 142092 228294 415640 445421 257250 35094 187708 364824 369439 275196 348095 545169
14792E45169j21557k52065j63942L3273K78113K4883j76177m6297j30355j26748
14782a35703q7898L525J5438J63632L1346l370Q6850n0225j21630P0085L7737
14771I787L4728n3434j23857K2555J9268q8402J3088J04161J29407J12126m4025
14760A35402O2983Q5447m8332n6022j9945J5119j37585m0994J2151m0637P4684
14749D2271Q2988r948o009P6332J30483j08566j41341n2159j82397N745J1815
14738a50786K7612J42623L876Q773m4354l7355J44223j0516j41422j45123L5377
14727a67072J07136K27406J3144p9290K2919j2022Q3338J9749k90642j35186K30914
14716B0394L7969J4742k8207N1101M4368M4468j59332N49q268L1752p1509r1332
$$ plain form
14792 545169 423612 171547 7605 40878 318991 343874 167697 121400 -8955 -135703
14782 -135703 -223601 -220076 -204638 -41006 -9660 -13030 73820 23595 -98035 -27950 9787
14771 9787 44515 -8919 -132776 -110221 -90953 -179355 -166267 -62106 67301 179427 135402
14760 135402 198385 283832 235500 179478 159533 174652 37067 -3927 8224 -32413 42271
14749 42271 125259 115311 109302 185634 316117 207551 66210 14051 -168346 -162601 -150786
14738 -150786 -123174 19449 23325 32098 -12256 -49611 94612 84096 -57326 -202449 -167072
14727 -167072 -59936 167470 180614 101324 124243 112221 195559 215308 -75334 -210520 20394
14716 20394 58363 73105 44898 95999 140367 184835 25503 26052 17784 49536 -21973 -113305
14704a13305l4151k0989k22R5366N2462J26922J926j64723q7330q2185l8797J0752
14692b54274J14720P2251P6944P6940L1034K2950j26152j07215R3431K46866o6775
14681A80720j45930P4488K0318l7035J49397l8929p6798J9430n6050J1776J66647
14670B68034j14850q9292j2264l1223N1111M1152J5767o0177l2017J28314R389
14659A73944m0911R4969K9305l01029o9002M3473o7687N8449K32643O0302j10926
14648A03530k53684l725o793Q3247P6689O254L0040N7490j00253P91K3949M0626
14636E8161j70762p6144J51413M480j5630N5111r1936q8930k33421o0100J15179
14625c52579K75194J44292j95731r7717R3047l5933l1226j28240P9673J38737
$$ plain form
14704 -113305 -147456 -168445 -168667 -73301 -20839 106083 108009 -56714 -144044 -226229 -265026 -254274
14692 -254274 -139554 -67303 9641 86581 117615 140565 14413 -92802 629 247495 180720
14681 180720 34790 109278 129596 92561 241958 203029 126231 145661 89611 101387 268034
14670 268034 153184 63892 51628 20405 71516 112668 128435 68258 36241 164555 173944
14659 173944 133033 228002 257307 -43722 -112724 -69251 -136938 -78489 154154 214456 103530
14648 103530 -150154 -153879 -160672 -77425 -736 5518 35558 93048 -7205 -6414 17535 58161
14636 58161 -112601 -188745 -37332 -32852 -48482 6629 -85307 -174237 -407658 -467758 -352579
14625 -352579 -77385 66907 -128824 -226541 -133494 -169427 -200653 -328893 -249220 -110483
14615a10483R2418m083k24669n7756K42710J72107N3365j29279p4137n3409j795
14604i5011M0640l81l6476L4338M7640K25575K10099j100O9499P3816j61958p2253
14592C34428p9672j07414L1635J07170p4811k30637o8353Q7866K6586N7667k50776
14581a66311J39347J34111q4627n5447J7387M3286N7751L3899M6526L3865J30477
14570C30264J75706K25116k40491l09950r2728N4297O9319k07530L2788R0801
14560A27592P9074K7585Q9256O392j51321j72983o3705L0933J7991p068K11980
14549A95726J31430J63441P0902p2745j64785O499m4832n5874j63740M3997J18803
14538B28822k3483Q1246j96371j17358K13045J48261k16749k5773O8336M0855
$$ plain form
14615 -110483 -18065 -22148 -246817 -304573 -61863 110244 163609 34330 -39807 -93216 -95011
14604 -95011 -54371 -54752 -91228 -56890 -9250 216325 426424 425324 494823 568639 406681 334428
14592 334428 254756 147342 178977 286147 211336 -19301 -87654 212 26798 84465 -166311
14581 -166311 -26964 107147 22520 -32927 -15540 27746 85497 119396 165922 199787 330264
14570 330264 505970 731086 490595 180645 87917 142214 211533 4003 36791 127592
14560 127592 206666 234251 323507 329899 178578 5595 -58110 -27177 -9186 -16254 195726
14549 195726 327156 490597 561499 488754 323969 330468 285636 229762 66022 110019 228822
14538 228822 205339 286585 90214 -27144 185901 334162 117413 91640 159976 200831
14528B00831j215l2503j31921O9635P3462m4795r7616n0025N5295j4235K6359
14517E3272R5844J66604j42471l7111n0550Q9343Q7768j5210l3937N234J16784
14506C35570N0887p7803q1044n9196p1224j22444J10769J72588P3556k08461j0317
14495A12881J68890j16037o1766j5875n432j38011o2166J41506J30819J24927
14485B79736j20715k73225N4204J13897J90513k3587j40503j04667N9654J35808
14475A71115J31426P3885N9553Q7478k55075j92656K3999J05133r8207k1296K11628
14464B96983r6598l2581M5502j49568N242J41661J04068Q833j83786r5824P2327
14453A16259J3228K8820Q1719k4562k7191j56588j08201J64339R9607L8838r150
$$ plain form
14528 200831 199616 167113 35192 104827 178289 133494 35878 -14147 41148 26913 53272
14517 53272 149116 315720 173249 136138 85588 174931 262699 247489 213552 218786 335570
14506 335570 386457 308654 227610 168414 97190 -25254 85515 258103 331659 123198 112881
14495 112881 281771 165734 103968 88093 82661 -55350 -117516 23990 154809 279736
14485 279736 159021 -114204 -60000 53897 244410 220823 80320 -24347 35307 171115
14475 171115 302541 376426 435979 523457 268382 75726 99725 204858 106651 85355 296983
14464 296983 200385 167804 213306 63738 68980 210641 314709 323542 139756 43932 116259
14453 116259 129487 158307 240026 215464 188273 31685 -76516 87823 187430 226268 217118
14442B17118j13268P5447p799n1160P1194n9012J2606k7522j27961P2262L6940
14431I8845r529J03664J02714l6810J3845n2350J3641j45486l8428J98946K36335
14420D85387J09462k12795p3928p9370O3081j4010j44176q2607n9654O6170J12909
14409A70469J70141R5172j09206k32442j11094j7954k9162Q0608J81791m0507
14399A57816m8563n0874k01342p6507J52212m3348K9780Q4676J53054m558m8655
14388A03691j36476O4199j01344K9750O7012K6590p6756j4848J25229J3064P5142
14377A75253Q3610Q357L006Q3208M4788P536J14644r6980j54282k1997q6789j7492
14365A42862P4248K19397K7935j23749q6577j68096j13980K5857O8752M6346L4321
$$ plain form
14442 217118 103850 179297 171498 120338 191532 132520 145126 117604 -10357 61905 98845
14431 98845 89316 192980 295694 258884 272729 220379 234020 88534 50106 249052 485387
14420 485387 594849 382054 308126 228756 291837 277827 133651 51044 -8610 57560 170469
14409 170469 340610 435782 326576 94134 -16960 -34914 -64076 16532 198323 157816
14399 157816 109253 58379 -142963 -219470 -67258 -110606 -80826 3850 156904 152346 103691
14388 103691 -32785 31414 -69930 -40180 26832 53422 -23334 -38182 87047 100111 175253
14377 175253 258863 267220 270226 353434 398222 405758 520402 423422 269140 247143 160354 142862
14365 142862 217110 436507 464442 340693 254116 86020 -27960 -2103 66649 112995 147316
14354A47316j55837o9270J3990J52540K40261P9538o5142k448J8479j44450p2272
14343A42705j99910J15432N4241k5902k8397j7579M3814M013O7675q0391N0102
14332A25803j49461j23652P3098J18619Q5313j4044m8680j30997j8361L6228m8882
14321i5016r3749O8340J82010J10193m1444p4407k34298r9468K38189p0427N8921
14310e1156Q5650L123J5293J73192P0925k6488K7735N2748J27937K8617j56590
14299C50986j04594K5903k619J18495j5043k28702J6454q4848j86561R3597J02524
14288H5592N2185l17l9788j48092q1445J31529K70171Q9372j33654p8834R0222
14277B36941o9677j30101K2014J02018M2080k15542n3130J1199Q818K8829n8599
$$ plain form
14354 147316 -8521 -77791 -63801 88739 329000 408538 343396 340948 359427 214977 142705
14343 142705 -57205 58227 112468 86566 58169 40590 84404 88417 156092 75701 125803
14332 125803 -23658 -147310 -74212 44407 129720 115676 66996 -64001 -82362 -46134 -95016
14321 -95016 -188765 -120425 61585 171778 130334 55927 -178371 -277839 -39650 -110077 -51156
14310 -51156 34494 37617 52910 226102 297027 270539 298274 351022 478959 507576 350986
14299 350986 246392 272295 269676 388171 373128 144426 160880 76032 -110529 -16932 85592
14288 85592 137777 137460 97672 -50420 -131865 -336 269835 359207 225553 146719 236941
14277 236941 167264 37163 59177 161195 203275 -12267 -65397 -54198 -45380 -16551 -75150
14266g5150O7103K55958J29266q1800M2945k4812n6558M7529Q6588j23027p5658
14255A92384N296k15864m9938Q5887L4154R4485q5582K4463M393m569L9877o7242
14243E7744j88608J33852J02994k4252k83012P7354K24650K11622O1950k60494
14233A13800j65844l0333M8831j4540L2854J16301L498r577K1994o8837j08258
14222f0111k01820L04201J00401j09139l889M8592m982J04978O3931l1402q9648
14211A21112j03569j968m1271J26903J60300L0646r3413o0611N2862o6540j84931
14200f0480J6707P7624J33961m152j15367j23601J39840K1136k5581K5124J76560
14189B61771J52506P1261k31419j01910Q895k2806J77061J3589j66772q9554j16544
$$ plain form
14266 -75150 -8047 247911 377177 295377 338322 313510 256952 304481 391069 268042 192384
14255 192384 197680 -18184 -68122 17765 51919 146404 60822 85285 89678 85109 124986 57744
14243 57744 -130864 2988 105982 81730 -201282 -123928 100722 312344 374294 113800
14233 113800 -52044 -82377 -33546 -48086 -15232 101069 104567 94990 116984 48147 -60111
14222 -60111 -261931 42270 142671 33532 29643 78235 73253 178231 242162 210760 121112
14211 121112 17543 15575 -25696 101207 261507 292153 198740 138129 190991 124451 -60480
14200 -60480 -43773 33851 167812 163660 48293 -75308 64532 85668 60087 85211 261771
14189 261771 414277 485538 254119 152209 161104 138298 315359 328948 162176 72622 -43922
14178d3922J68131p8411j63911k7764o0044j19417K28618J45039J8379l0799n4781
14167a8882n6085Q6800N0034l7942L023M358j59j9482k2003k5901P7642n1030
14155i627L1028P3513M2651J23044J22189K7323j37751j75552J0565J85811p090
14144B86104j70660N283P097n3718Q5473Q6127Q4567k1553j43481n7343j2597
14133I5299J48914p0594o9804m2569k2620M5527O779K7194j88411M850J0024P8862
14121B3451j30145Q238Q7166M7746m905N0104l7988M4040m6604p7559p3640Q7306
14109b2790K03217O7108j50215p8096j1998J11562O3831l3118j0290m0195K8996
14098A28012q9263k0620J42863J40229O6080o0763j46244n6557j79548n2683K46798
$$ plain form
14178 -43922 124209 45798 -118113 -145877 -205921 -325338 -96720 48319 66698 35899 -18882
14167 -18882 -74967 11833 61867 23925 26948 31306 31147 11665 -10338 -36239 41403 -9627
14155 -9627 21401 94914 137565 260609 382798 410121 272370 96818 107383 293194 286104
14144 286104 115444 120727 127824 74106 159579 245706 330273 308720 165239 107896 95299
14133 95299 244213 173619 103815 61246 38626 84153 90932 118126 -70285 -65435 -55411 23451
14121 23451 -106694 -98456 -11290 36456 31551 81655 43667 87707 41103 -36456 -110096 -22790
14109 -22790 180427 247535 97320 19224 7226 118788 182619 149501 139211 99016 128012
14098 128012 38749 18129 160992 301221 367301 306538 160294 103737 -75811 -128494 118304
14087A18304K26857M6893j68760p4226j7619k8609j663L2151o2803Q110k1984
14076E6651q5014P1632Q6600Q3760Q1316J71045n4683k18318l5430r581K36311
14065C84289j14939q0823p4151k16J25880Q5995j74087j50078n9253J1971q4112
14054a29524n4891M4373K14921J49625J01284k6060k3363k0228q6816r921J09009
14043B68409J56437j93131M5928M3181j40273m3M1783J34707j57320k00555L7587
14032C6710j7626K3816q348Q6029L9997j14930l7272l5599m7308J37696O1432
14021A24597j56779q0142k8084J19540Q4400K9179O5710k8318J7532N4157m766
14010A97026k8362K2257N3146R658j5510n7658r0582M3385j11978k80728R3067
$$ plain form
14087 118304 345161 392054 223294 149068 131449 102840 101177 133328 70525 78635 56651
14076 56651 -28363 43269 129869 213629 294945 465990 411307 192989 157559 147978 384289
14065 384289 269350 188527 114376 114160 240040 326035 151948 1870 -57383 -45412 -129524
14054 -129524 -184415 -140042 74879 224504 325788 299728 276365 256137 169321 159400 268409
14043 268409 424846 231715 277643 320824 180551 180508 222291 356998 199678 -877 36710
14032 36710 19084 42900 34552 120581 160578 45648 8376 -27223 -74531 63165 124597
14021 124597 -32182 -112324 -140408 -20868 63532 92711 158421 130103 147635 201792 197026
14010 197026 168664 190921 244067 253725 238215 180557 89975 133360 21382 -259346 -166279
13999a66279K18641J41348R5716n5140q4126m4962j23350J13060M8232j0604j40627
13988h091l1079R6089R6332j03658k32768J0637J5215L236J39796O0352l5669
13977A0392r2152J68868M0234k54186k3353J94981J12158K2294j37577l7347J18663
13966A22975j10491m171K30800J11927j67795O1260K318k16676j08005L5571J56843
13955A14556J980l983l9346k1448n6739R4334q597j29591n3931J95070K03412
13944B95717m8976N1190P2869l2126j2609n1939k05857q7288N753N4378p0794
13933b9682l619J50947J3580k67032m8146J03246J33821O411m0621J73123K0556
13922B12584n2978j42455P7132k3898q5880P5920o004r0473j9638J39987J02051
$$ plain form
13999 -166279 52362 193710 289426 234286 150160 105198 -18152 94908 143140 132536 -8091
13988 -8091 -39170 56919 153251 49593 -183175 -172538 -157323 -154087 -14291 46061 10392
13977 10392 -81760 87108 127342 -126844 -150197 44784 156942 179236 41659 4312 122975
13966 122975 12484 8313 239113 351040 183245 244505 246823 30147 -77858 -42287 114556
13955 114556 116536 112553 73207 51759 -4980 89354 80757 -48834 -102765 92305 295717
13944 295717 246741 297931 370800 338674 326065 274126 68269 -19019 -13266 41112 -29682
13933 -29682 -33301 117646 131226 -135806 -183952 -80706 53115 59526 18905 192028 212584
13922 212584 159606 17151 94283 70385 -15495 60425 54421 -36052 -55690 84297 186348
13911A86348J3024J3485J3648j2228l7969R1313K6378o2398p1887j30079J04227
13900A33862o473M04J14615J4481r3801p1826L4915j5699J782N0995k01330j18311
13888a56386P7763L7898r6285J83751R0754r2690J4793J12277M0723n4827j20703
13877C7068j43476n55J83182O0570j70210Q0136P7771O1699k7321J1319j66444
13866C739j73239j8080J14466n9072J19467J78636m7098n5852J29870p0748j72112
13855e0023O9657K20118J52704L2967l0597j2351j53250N238J19317J62841j09667
13844D06954l4726j62249m3865K1773J16263L1269k7577j38091K2252j6751j21852
13833E3400j21104L1854P1571O0983Q5013P6136o0900k19815j88976n6795J52043
$$ plain form
13911 186348 199372 212857 226505 214277 176308 267621 293999 231601 159714 29635 133862
13900 133862 127389 127793 242408 256889 163088 91262 126177 110478 112260 163255 -38075 -156386
13888 -156386 -78623 -40725 -137010 46741 137495 44805 59598 171875 212598 157771 37068
13877 37068 -106408 -106963 76219 136789 -33421 46715 124486 186185 158864 170183 3739
13866 3739 -169500 -187580 -73114 -132186 -12719 165917 118819 62967 192837 122089 -50023
13855 -50023 19634 239752 392456 425423 394826 382475 229225 234463 353780 516621 406954
13844 406954 372228 209979 166114 187887 304150 335419 307842 169751 192003 175252 53400
13833 53400 -67704 -35850 35721 96704 181717 257853 196953 -22862 -211838 -268633 -116590
13822a16590J25454k5117O6630K8822O7661Q9894K4019N8528K5636p1799L5054
13811C08192j19508m2976N289j65793J9564p446J17753l9514j7542J5221p194
13800F6046M2675K92466J58254o8947J8203k8142l171j52962k08635O2959N7992
13789B36738J24372l5320j05197k4271Q9783q8369R5129M8035l7687r4040K14580
13778D23753R528q6678k01464j01981j3649k0633j11434J22832L1697J11412Q2135
13767B45518k5154L0932J30042k669j3095j56673k21597m502M0618J3464J39304
13756A76188J41218j24364J23990O1023R236j57777j01549l4937r3322N9893J8016
13745G7615K17466j4043Q791J28411j01856j41687j32922j8673N1667n4256m3654
$$ plain form
13822 -116590 8864 -16253 50377 79199 146860 236754 260773 319301 344937 273138 308192
13811 308192 188684 145708 150997 -14796 4768 -2678 115075 75561 58019 73240 66046
13800 66046 108721 401187 559441 490494 508697 480555 477384 324422 115787 178746 236738
13789 236738 361110 325790 220593 196322 286105 197736 292865 340900 303213 209173 423753
13778 423753 433281 346603 145139 43158 29509 8876 -102558 20274 51971 163383 245518
13767 245518 220364 251296 381338 378669 365574 208901 -12696 -17198 23420 36884 176188
13756 176188 317406 193042 317032 378055 387291 229514 127965 93028 -294 59599 77615
13745 77615 295081 281038 289829 418240 316384 174697 41775 23102 74769 20513 -23141
13734b3141j22754j15903m250q984R4750J74654Q3865J70994k9851N531k0012
13723B04899l8669o2978l0759Q2929O1234K6108L9224L9461J23777j87445m6301
13712B11480K120l7720r5335Q9315j9229L1533J04441q875j48000l7015K6632
13701A19347R2454M1407j06954n8278J33091k1864N5378J20212m9844j2344J57768
13690D70373m3598l2547q0075J816N6178K5735n594j58328m7834J1759O4545l6694
13678B25736o4244K6169k1932J16305k8843k3684l8820q9557l6047k4555l4103
13667F425K19220j563p4580K51088M7294q0242N2080j06945j41791l5061L773
13656A39698k2639N2760R8567J8155M4314J19283r3754j39154n8686J8028N5644
$$ plain form
13734 -23141 -145895 -261798 -266048 -275032 -180282 -5628 78237 249231 219380 224911 204899
13723 204899 166230 103252 72493 155422 216656 242764 281988 321449 445226 257781 211480
13712 211480 213600 175880 80545 169860 150631 182164 286605 277730 129730 92715 119347
13701 119347 211801 253208 146254 87976 221067 199203 254581 374793 324949 312605 470373
13690 470373 426775 394228 314153 315969 372147 397882 392288 233960 186126 197885 262430 225736
13678 225736 161492 187661 165729 282034 253191 229507 190687 101130 65083 40528 6425
13667 6425 225645 224082 149502 400590 447884 367642 419722 312777 170986 135925 139698
13656 139698 117059 169819 268386 286541 330855 450138 356384 217230 158544 176572 232216
13645B32216p1641k8029r6912l543o6417O99J63450R1096j21118l1142K3310J65085
13633B57054j20169N1973J7141o8920o3305K21492P1781j5734j95072j25829Q3184
13622A13596K0774m2352l4161N6831N1968q2139J60538J79310j39920M5996j18351
13611B12090j59547Q9055J95813L2414r8436q4685m8700p1077L5344n6592l5778
13600I901P968j17855O7302P4234r327R1308n5031j6838j62174o671J20954o272
13588b501j98695j32954J99025K35919K46200O6927k42951j52032K8387j65668
13578a18343J838M2803J21938K07539J86142k5772j08183j3205r6455j16702j21432
13567c9832M6015J13897J4169R1933l9618m1279Q5390o0856J035q2270q1243P4557
$$ plain form
13645 232216 160575 132546 35634 32091 -34326 -33627 129823 220919 99801 68659 91969 257054
13633 257054 136885 188858 205999 137079 73774 295266 367047 351313 156241 30412 113596
13622 113596 134370 92018 57857 114688 166656 84517 245055 424365 284445 330441 212090
13611 212090 52543 141598 337411 369825 271389 186704 138004 66927 102271 45679 9901
13600 9901 17869 -99986 -32684 41550 32223 123531 68500 51662 -110512 -117183 3771 -2501
13588 -2501 -201196 -334150 -135125 100794 346994 413921 170970 18938 47325 -118343
13578 -118343 -116505 -73702 48236 255775 441917 416145 307962 294757 198302 81600 -39832
13567 -39832 6183 120080 134249 226182 186564 145285 230675 169819 170854 88584 7341 81898
13555H1898P4189R8624m3886q7922J0432N2506P4943P407k21074k14856J14435
13544e3304M1616L028P2074L2898J42818K35349r8992m06685p3351L01926J76878
13533C74255J9912K3658j16772r7314L5879J44320J14410k75029k23638J3524
13523A3205j5888J29539Q2573J13567j8819k27176K6797N8776q6404j2970j5126
13512D8074M3837R8259K17798J7549j61520j00250k6883Q2732J44650K17475r6297
13501D85424k13537j84308j42726M4282J01308K87064M3689j72248n4552P5110
13491B69506k9568j02594l7926o2307r6791P6508J16209J37892j62795m8507R7426
13480A57053m8361K6316L3513J19347n284o7486j1167L0115m3323O6422n5781
$$ plain form
13555 81898 156087 254711 210825 122903 133335 185841 260784 268191 47117 -167739 -53304
13544 -53304 -11688 -8660 63414 96312 239130 474479 375487 -31198 -104549 197377 374255
13533 374255 394167 417825 301053 203739 239618 383938 498348 223319 -319 13205
13523 13205 -2683 126856 209429 322996 304177 77001 103798 162574 76170 63200 48074
13512 48074 91911 190170 407968 425517 263997 163747 136864 219596 364246 581721 485424
13501 485424 271887 87579 -55147 -10865 90443 377507 421196 248948 194396 269506
13491 269506 239938 137344 99418 37111 -59680 16828 133037 270929 108134 59627 157053
13480 157053 108692 135008 168521 287868 282584 215098 203931 234046 190723 257145 201364
13469B01364L6310l2415k00827J18905J81247K0105j21870J00685J0947L1635
13459C46086L3039j4577j41199o3032J8209M7534j5129j10086r9188n7862p5479
13448a31684k1814J02880J02261L3590r1036P0426O9127J02173P4162J2120P8045
13437D00250k7700q7302o3512j51989j53479m8998L00009K44724j19172j01384
13427A91447q0443r4384O1396J146J40372J20949P8287j20650r6759o172O6497
13416B61686M0631j98083o4382n9790Q4019P009n1948M0072j1235K8046N5268
13405A31293O3317k6824m9558M1744l474Q0568L1570K2589j0927N023p9151r9182
13393A06988L3182Q4567o5450k24320k3798J86087R2429J30728J5199k0270M80
$$ plain form
13469 201364 237674 205259 4432 123337 304584 324689 202819 303504 314451 346086
13459 346086 379125 364548 223349 160317 178526 226060 210931 100845 1657 -56205 -131684
13448 -131684 -153498 -50618 51643 85233 -5803 64623 133750 235923 310085 322205 400250
13437 400250 372550 285248 221736 69747 -83732 -132730 167279 412003 292831 191447
13427 191447 111004 16620 78016 79162 219534 340483 418770 298120 201361 195189 261686
13416 261686 302317 104234 39852 -19938 64081 71090 19142 59214 47979 76025 131293
13405 131293 194610 167786 118228 159972 156498 237066 268636 291225 280298 285321 206170 106988
13393 106988 140170 224737 159287 -65033 -88831 97256 189685 320413 335612 315342 315822
13382C15822j34455k5667J78412O0256Q8424o9635j18441Q2229m953l8589P0589
13371D03992K7880l5598n64k8736r1448m500k3388K14641j10833k09599J34698
13360B76545p769j26236m4092o419L6847p2431j8601J47013o6310j2723J10710
13349B16534J35251J2559q6096j88295O0884K9292l5675M8149N6947j1183J50619
13338C88986Q5018j21900p1105L5830K13212N4405p9056m0543j59975l5622N8640
13327C27890L303n176o2089J15994K0771m4806O6819q2971n2523o3115o5865O3804
13315B22036m0366j26138R3356j41726J39480J90066j10807K6825O5401J10688
13305D28815J76667k5500p8021j30252q3878j11100l4084N5195J39132j90209
$$ plain form
13382 315822 181367 155700 334112 394368 482792 413157 294716 376945 371992 333403 403992
13371 403992 431872 396274 395710 366974 275526 271026 247638 462279 351446 141847 276545
13360 276545 268776 142540 98448 92029 128876 56445 37844 184857 118547 105824 216534
13349 216534 351785 364344 278248 89953 150837 180129 144454 192603 249550 238367 388986
13338 388986 474004 352104 280999 316829 530041 584446 505390 464847 304872 269250 327890
13327 327890 331193 326017 263928 379922 400693 355887 422706 339735 287212 224097 158232 222036
13315 222036 181670 55532 148888 7162 146642 336708 225901 252726 318127 428815
13305 428815 605482 579982 501961 371709 287831 176731 142647 197842 336974 146765
13295A46765M8260R921j6013P5109M7603q355R3549j10457M6696P312k6566m7856
13283B65968M8495M9273o9387l4899J53640L1076M8849j22762j80573R8805P3618
13272C62103J15804j24878k9573k0820J47282k2129j27794r1794k8114M0242O7940
13261B88269j10870R9084J75470J14832r1621K8493m3456q9439j5963j512M7801
13250D01088j0104P5309P066q1740o8543l9473J49867J00205p651p4041Q6609
13239E38592K2111q5550L8205k0821k21008Q6884L6080n0931p4026M2752p667
13228C04621m0414J06148M6735n4065j52172J5191K07172J39224n4712j20397
13218C97331L4668J12480P1889r5490k93006n3525N9234J21360L5839n4681k7366
$$ plain form
13295 146765 195025 204946 188933 264042 311645 303290 396839 286382 333078 340390 313824 265968
13283 265968 314463 363736 294349 259450 413090 444166 493015 370253 189680 288485 362103
13272 362103 477907 353029 323456 302636 449918 427789 299995 208201 180087 220329 288269
13261 288269 177399 276483 451953 566785 475164 503657 460201 370762 354799 353287 401088
13250 401088 390984 466293 473359 391619 323076 283603 433470 533675 526024 451983 538592
13239 538592 560703 475153 513358 492537 271529 358413 394493 343562 269536 312288 304621
13228 304621 264207 370355 417090 363025 210853 226044 433216 572440 517728 397331
13218 397331 431999 544479 616368 520878 227872 174347 233581 354941 390780 336099 308733
13207C08733J67259L3760k0179p8514k9295J02668K38695M42286L38773O2369
13197A566555j9856k34132l69299j59957l7154j72716k41383k02824J53717K3348
13187C06299l7119P9431K5697o8775Q038L8034l6113j776n0251l2343j187K37064
13175D66999m6926k21047J16704J38805L0465j2240J5056L1751N037l7331j55419
13164C31854Q8088J66406K64958K31783P2654J2654J50869M01733Q05213R44689
13154C470901R92700M80234k21442p25158q80304q04035m32135l21877j76136
13145A382748k69003j46089R4143m73j50798p0294K52173N8086j29351L568N6510
13134A081220K3739O8708J66R7248K12790k4227Q6112K06437n7326K4462J66760
$$ plain form
13207 308733 475992 509752 489573 411059 381764 484432 723127 1165413 1504186 1566555
13197 1566555 1546699 1312567 943268 783311 746157 573441 332058 129234 282951 306299
13187 306299 269180 348611 374308 305533 313571 351605 315492 313716 263465 231122 229935 466999
13175 466999 420073 199026 315730 454535 485000 472760 487816 519567 524604 487273 331854
13164 331854 419942 586348 851306 1083089 1155743 1168397 1319266 1720999 2526212 3470901
13154 3470901 4463601 4943835 4722393 3997235 3116931 2312896 1880761 1558884 1382748
13145 1382748 1113745 967656 1061799 1061326 910528 840234 1092407 1150493 1021142 1024710 1081220
13134 1081220 1104959 1173667 1173833 1271081 1483871 1459644 1545756 1752193 1694867 1719329 1886089
13123A886089J20877o894j6991k24551j86855j2893o359J5833M5477k8435l0984
13112A554314J95340L22725O05158Q89816P35517L14508m82110j031687q75883
13103B227698n24257k36059j58707j03208j23410P6754J0127m4866K26475K22799
13093A573346K92627L25057J31104n5053k10596l02402l73037r3970j47300j15532
13083A024244k04478q4099q0207n3860r8249m8576K8994q7801N7262J43411L9402
13072F36043m7708j2609J16039J48875N7870J28263K33797J30328J96939J71290
13062A759127J4212k83885m33074j21091k38144m6924n2834k54098J93648J59564
13052F96501j53991j29918j53670p0180K7702J26315J17008k7889q4251J23089
$$ plain form
13123 1886089 2006966 2000072 1983081 1758530 1571675 1558782 1552423 1568256 1613733 1585298 1554314
13112 1554314 1749654 2072379 2677537 3567353 4302870 4617378 4135268 3103581 2227698
13103 2227698 1703441 1467382 1308675 1205467 1082057 1158811 1168938 1124072 1350547 1573346
13093 1573346 1865973 2191030 2322134 2267081 2056485 1754083 1381046 1287076 1139776 1024244
13083 1024244 819766 735667 655460 601600 503351 454775 483769 395968 453230 596641 636043
13072 636043 588335 575726 691765 840640 898510 1026773 1260570 1390898 1587837 1759127
13062 1759127 1773339 1489454 1056380 935289 697145 650221 597387 343289 536937 696501
13052 696501 542510 412592 258922 188742 216444 342759 459767 431878 347627 470716
13042D70716P9637M7280P0413K7710M4720m0036p1974r8335k07800O2512L8051
13031D22894n3352j39304J94319L16249q4529r9712n1634n8893O9257J43049j11398
13020E46946k4806J7972k1424J31240l6973J5745n5579j00767k3526N1973N9483
13009E60284R5537j34522M3721l7252K4901o6151p4981r9414l180R5207j5864
12998C88286j50756R3261J96618M3945J39111Q0556j0397j41517p5981L4326j1160
12987E86292L1393j12684k8996m2592j2391M5667J8097j3807p9761M6181R6187
12976E33586l2545R6240L9878j36068M670m8367p2547K02549M47p2801q8838k7696
12964C98508m6265O0711N6266J57197K14031Q2836r4011j60536j50958k21579
$$ plain form
13042 470716 550353 597633 668046 695756 740476 700440 628466 530131 322331 384843 422894
13031 422894 369542 230238 424557 740806 656277 556565 504931 446038 515295 658344 546946
13020 546946 522140 540112 518688 649928 612955 628700 573121 472354 448828 500801 560284
13009 560284 655821 521299 565020 527768 552669 486518 411537 312123 308943 404150 388286
12998 388286 237530 330791 527409 571354 710465 791021 780624 639107 563126 597452 586292
12987 586292 617685 505001 476005 433413 421022 466689 484786 470979 391218 437399 533586
12976 533586 501041 597281 637159 501091 505761 457394 384847 587396 587843 515042 426204 398508
12964 398508 352243 412954 469220 626417 840448 923284 829273 668737 517779 296200
12954B96200J43569k330K3205J95276K21986J34158k09134j39702j25876q2181
12944D55171j37602p8095q1883j15638K27941J16004p4964J6876J05059N7167
12934D90036M5827k3731p6752R9404Q1980K27960q3298j20847k1864m868j16119
12923D97728J30162L1491J19450J36000j10357j08141j9825n3007m8563m6917
12913E28021M8324j71011N1171K12849l2903n1913j20761M7439K49475j30977
12903F29714J1715J56447J82626j49420j66685J5015P9701M2762L1730J9727l5049
12892H18283N663Q428J44309q8163j11646n106N1841J73413P977j24628m4292
12881H36079O8390k3802l35296l9716J71168L4450J52031J18647n0840J32928
$$ plain form
12954 296200 439769 437439 460644 655920 877906 1012064 802930 663228 537352 455171
12944 455171 317569 239474 157591 41953 269894 385898 310934 327810 432869 490036
12934 490036 535863 512132 435380 534784 616764 844724 761426 640579 618715 613847 497728
12923 497728 627890 659381 778831 914831 804474 696333 676508 623501 574938 528021
12913 528021 576345 405334 456505 669354 636451 584538 463777 511216 760691 629714
12903 629714 641429 797876 980502 831082 664397 679412 759113 801875 833605 853332 818283
12892 818283 823946 832374 976683 888520 776874 771768 823609 997022 1004999 880371 836079
12881 836079 904469 880667 545371 505655 676823 711273 863304 981951 931111 1064039
12871A064039J08285r4912j70890k6001P7695o8312N4169m3836m0571J69614J16367
12860A145647j07800K2790J81872J82770O6243J05762j9882j65630O3474Q4217
12850A559463o7522k9928j34300p9376j03249j45223j06731J3774J82131L4808
12840A123847m2424L2240K39670J20505R693k3961O4271J69710K93003J92120
12830B178674J51422K92128L57927J42461r033o6297j16979j67940j75994k06599
12820B379770k71686N7225N63m9196n3902p8727k5838M6225Q5639J61572J25091
12809B376736j76501k58674j88441J57684Q4854r641K9308n4172J28028L5524
12799B124705J6823L2644N057l6973J54908L86918L23954K30071p0213q1898j44672
$$ plain form
12871 1064039 1172324 1077412 906522 880521 958216 889904 944073 900237 859666 1029280 1145647
12860 1145647 1037847 1060637 1242509 1425279 1491522 1597284 1577402 1411772 1475246 1559463
12850 1559463 1491941 1462013 1327713 1248337 1145088 999865 893134 906908 1089039 1123847
12840 1123847 1081423 1113663 1353333 1473838 1483531 1459570 1523841 1693551 1986554 2178674
12830 2178674 2330096 2622224 2980151 3122612 3113579 3047282 2930303 2762363 2586369 2379770
12820 2379770 2108084 2165309 2165872 2116676 2062774 1984047 1958209 2004434 2090073 2251645 2376736
12809 2376736 2200235 1941561 1753120 1910804 1995658 1986017 2015325 1961153 2089181 2124705
12799 2124705 2141528 2174172 2179229 2142256 2297164 2684082 3008036 3238107 3167894 3085996 2941324
12788B941324p0609P7496l2274j0406q2694j71116q8111j26356J14938j52475
12778B399717j78088J07556K6001q0335m2083j17799j29437q3023J59956J78315
12768B240780k839M00600R6493o2702l4758l260K28906q3029l38764q7040q7897
12757B266490q3037k0400J18813K57455P8360N5412J10495J0909J22764J53566
12747C070827M3574P3095J68897J4852L5127P0272Q7754J86046J40044M1750L5161
12736C967399K46585K20022J12870J0019J6812L65897J96659J44018K49319L98051
12726E927651K73598J82506K95863M79948M36412N14939P41545R35386J013133
12717A0800981R18391R89601J102035J284880J616640J978496K493499L196912
$$ plain form
12788 2941324 2870715 2948211 2915937 2905531 2822837 2651721 2563610 2437254 2552192 2399717
12778 2399717 2221629 2329185 2355186 2274851 2232768 2114969 1985532 1902509 2062465 2240780
12768 2240780 2237941 2638541 2735034 2672332 2637574 2634314 2863220 2780191 2441427 2354387 2266490
12757 2266490 2183453 2163053 2281866 2539321 2617681 2673093 2783588 2794497 2917261 3070827
12747 3070827 3114401 3187496 3356393 3371245 3406372 3476644 3564398 3750444 3890488 3932238 3967399
12736 3967399 4213984 4434006 4546876 4556895 4573707 4939604 5136263 5280281 5529600 5927651
12726 5927651 6201249 6383755 6679618 7159566 7595978 8110917 8852462 9787848 10800981
12717 10800981 11719372 12708973 13811008 15095888 16712528 18691024 21184523 24381435
12709B4381435M219829N628847P842946J1282262J6742803K4958578L5043359
12702A30100059M2441431L6903924J8924033L837141m275171j7193885l3089473
12695A77648059l7620593l0886549k1609165j4504354r532894n902369l257477
12688E4334658q71434J384070L533496O046861Q770199J0895002J0591995O328191
12680A01013038J313036K010520Q419159J8132478K9291250L9390119M3665212
12673B43234812M1855169L7991139L1479082J7290646m442127l0149760n0637268
12666B86621693n3285006m0076689k3521579j0394374j059707M584932O455900
12659A69325170L424228n706037j6221166j9790782j5308804p319627m1872L411342
$$ plain form
12709 24381435 28601264 34230111 42073057 53355319 70098122 95056700 130100059
12702 130100059 172541490 209445414 228369447 232206588 227931417 210737532 177648059
12695 177648059 140027466 109140917 87531752 73027398 63494504 57592135 54334658
12688 54334658 53463224 54847294 58380790 64427651 73197850 84092852 94684847 101013038
12680 101013038 102326074 104336594 112755753 130888231 160179481 199569600 243234812
12673 243234812 285089981 323081120 354560202 371850848 367408721 337258961 286621693
12666 286621693 233336687 193259998 169738419 159344045 158284338 162869270 169325170
12659 169325170 172749398 167043361 150822195 131031413 115722609 108402982 108361110 111772452
12651A11772452M46765o303122j0045888q483004m651010k91173M191265R017373
12643I5653658J5296052K4383156L8222643N5804914O9873854O7109715L9164241
12636D05508233n417350m9781717p5282920p2033550n3879270l7037242k5348115
12629H6728069j7705093j2587683r321115p373004n819942m554431l419191k511284
12621B3436326k389814k192088j984551j653093j452152q28504n93380k63552
12613A2079192j24126l13074p08774j099479r72963q10324p91636o82727m87061
12604F089028n54882l42110k18086n01765k47065n0430j40569l24681p7755r2766
12594C538919M122k39609k64847n2324k900k42041j17961J50137Q1965j35630
$$ plain form
12651 111772452 112219217 105916095 95870207 87387203 82736193 82445020 86636285 95653658
12643 95653658 110949710 135332866 173555509 229360423 299234277 366343992 405508233
12636 405508233 400090883 350309166 275026246 202992696 149113426 112076184 86728069
12629 86728069 69022976 56435293 47114178 39741174 33921232 29366801 25947610 23436326
12621 23436326 21046512 18854424 16869873 15216780 13764628 12936124 12342744 12079192
12613 12079192 11955066 11641992 10933218 9833739 8860776 8050452 7258816 6576089 6089028
12604 6089028 5534146 5192036 4973950 4472185 4225120 4174690 4034121 3709440 3631685 3538919
12594 3538919 3543041 3303432 3038585 2986261 2983361 2741320 2623359 2773496 2855461 2719831
12584B719831k21170N3355Q5480r2816L6753J7795j19496M8331l9525n3664K7806
12573B462680K2265r0440m6478o9844j56962k7301L8337J69910J15188M6902j03259
12562B360998l17400k07285P4498J14764k3072j3041L7020O7448M2417J02900
12552B239247L3052l1935J00238K0937o820K357J67544R6694k1173j09132k8149
12541B462860L07589M73141L41148M22096O25446M97905O07809L76508N2953j77817
12531E989638l76094m71985o82653m11683m32513j37585k98341j95850k2736j24367
12521B835831R0776n1269j30725K12909N09195M83417M75695P13602P34836M79773
12511F354040o0203o54430r61202o22271m16612k64713l12350l42909k21937O0349
$$ plain form
12584 2719831 2498661 2552016 2637496 2544680 2581433 2599228 2479732 2528063 2488538 2434874 2462680
12573 2462680 2484945 2394505 2348027 2278183 2121221 2093920 2132257 2302167 2417355 2464257 2360998
12562 2360998 2043598 1836313 1910811 2025575 2002503 1989462 2026482 2093930 2136347 2239247
12552 2239247 2272299 2240364 2340602 2361539 2354719 2357076 2524620 2621314 2600141 2491009 2462860
12541 2462860 2770449 3243590 3584738 4006834 4632280 5130185 5737994 6114502 6167455 5989638
12531 5989638 5613544 5141559 4458906 4047223 3614710 3477125 3178784 2982934 2960198 2835831
12521 2835831 2926607 2875338 2744613 2957522 3466717 3950134 4425829 5139431 5874267 6354040
12511 6354040 6293837 5639407 4678205 4055934 3639322 3374609 3062259 2719350 2497413 2557762
12501B557762m0058Q3960M0056J6979J2309m0781k02608p4131K0047j00679j30815
12490B142041K14481L9156m1909P3456l149j33412j34761o3454Q7478J26775M9454
12479B356156r27q4965o756K20465J24440p8512L3651J43126r0479M2693J99311
12468B858203j5165Q1643K09413J29161m6378K06197J26279N6378M5875J36324
12458C787930K42388J56230J562J31196J64614J35053K25195l5873J09368K80115
12448E197778K39416K73715L47314K49290K80585M68181L90449R2904K4264N7410
12438G621306K71622L68702K97903M22193P76675N90210L44731O65809Q60759
12429A2219910R72885J130963J194543J506193J981313K192064K395771K883267
$$ plain form
12501 2557762 2517704 2601664 2641720 2658699 2671008 2630227 2427619 2353488 2373535 2272856 2142041
12490 2142041 2356522 2395678 2353769 2427225 2424076 2290664 2155903 2092449 2179927 2306702 2356156
12479 2356156 2355229 2270264 2263508 2483973 2608413 2529901 2563552 2706678 2616199 2658892 2858203
12468 2858203 2843038 2924681 3134094 3263255 3216877 3423074 3549353 3605731 3651606 3787930
12458 3787930 4030318 4186548 4188110 4319306 4483920 4618973 4844168 4808295 4917663 5197778
12448 5197778 5437194 5710909 6058223 6307513 6588098 7056279 7446728 7539632 7563896 7621306
12438 7621306 7892928 8261630 8559533 8981726 9758401 10348611 10693342 11359151 12219910
12429 12219910 13192795 14323758 15518301 17024494 19005807 21197871 23593642 26476909
12421B6476909L677741M384506N755129P457629R200704J2525923J7245431K4072778
12413A10796750L4050619M6795729N8017060N8920750M2429266J2372908k1095114
12406C42287968m7823770n7920519n1129100l7379834k4926969j6036992r563630
12399I7507154m714746k88384L631314N820780M805898Q18378k502463k080181
12391A02997750J422724O373282J2606371J8306913J9648765J3570794K081574
12384A77008173p066324q126785j137549R673211K1700014L1905620L6158445
12377B60114805L2726002K3334290J2486635J148325j2381265k7519760l8234345
12370B51674687m0865701l6602196k8535387j9615463j1802926o413728m340283
$$ plain form
12421 26476909 30154650 34539156 40294285 47751914 56952618 69478541 86723972 110796750
12413 110796750 144847369 191643098 249660158 308580908 351010174 363383082 342287968
12406 342287968 294464198 236543679 185414579 148034745 123107776 107070784 97507154
12399 97507154 92792408 92504024 96135338 101956118 106762016 107580394 105077931 102997750
12391 102997750 104420474 110793756 123400127 141707040 161355805 174926599 177008173
12384 177008173 169941849 161815064 160677515 170350726 192050740 223956360 260114805
12377 260114805 292840807 316175097 328661732 329810057 317428792 289909032 251674687
12370 251674687 210808986 174206790 145671403 126055940 114253014 107839286 103499003
12363A03499003n340308q293041j0753807j0264316p613545m575302j713318R97518
12355E5942884L384499N989231Q755261J2802584J8060436K4023133K8364301
12348A57322329K7247692J9480538Q665779k129845j4747276k8117504l3877840
12341A33843873l0495192k3208571j6517378j1777708q788445o934268n648377
12334C0473934m800184l932897l122676k497786j750326j478923j062429r15851
12326A0912862o89534k49378j24984L8602q5138n27071q31689j006958r63079
12317F473633q53648m67636l39552l34567j76140k44854j23664J8835R7504O361
12307D056272j19815j42915m3111j20189K28325K8937J5587j00569L7993p0162
$$ plain form
12363 103499003 98158695 89865654 79111847 68847531 61233986 56658684 54945366 55942884
12355 55942884 59327383 65316614 74071875 86874459 104934895 128958028 157322329
12348 157322329 184570021 204050559 212716338 210586493 195839217 167721713 133843873
12341 133843873 103348681 80140110 63622732 51845024 43056579 36122311 30473934
12334 30473934 25673750 21740853 18618177 16120391 14370065 12891142 11828713 10912862
12326 10912862 10223328 9973950 9848966 9887568 9802430 9275359 8443670 7436712 6473633
12317 6473633 5619985 5152349 4812797 4478230 4302090 4057236 3933572 3952407 4049911 4056272
12307 4056272 3936457 3793542 3750431 3630242 3858567 3887504 3903091 3802522 3840515 3770353
12297C770353j56706j08600m5230K3063L06570K71638K83432L86979R0542L9913
12287D861954j24224l98656l44839l53462j70413l56386l17929k32038j56560
12278B407447K5081m3412p4980j79024k68954r8379l8482N4430L1170j11550j28862
12267A574485P529J82847K44244K73941K62134L25617K53107K35123K4249j98896
12257C184380k89145l53428l58904j28481k20977j44255k39779N0790N0335q8278
12247A462258j28949l4217J32967j0248O5688O2180m2515k00937j79082J21761
12237A248906m141K9515K73089K67073k1145R5093K01483M4867m488p2570j52435
12226A905247j56415j68691j33933r594N0804n4252j63545Q7684J39531j06008
$$ plain form
12297 3770353 3613647 3505047 3459817 3482880 3789450 4061088 4344520 4731499 4822041 4861954
12287 4861954 4737730 4339074 3994235 3640773 3470360 3113974 2796045 2564007 2407447
12278 2407447 2432528 2389116 2314136 2135112 1866158 1767779 1729297 1783727 1814897 1703347 1574485
12267 1574485 1582014 1764861 2009105 2283046 2545180 2870797 3123904 3359027 3383276 3184380
12257 3184380 2895235 2541807 2182903 2054422 1833445 1689190 1449411 1500201 1550536 1462258
12247 1462258 1333309 1299092 1432059 1421811 1487499 1549679 1507164 1306227 1127145 1248906
12237 1248906 1244765 1274280 1547369 1814442 1793297 1888390 2089873 2134740 2130252 2057682 1905247
12226 1905247 1748832 1580141 1446208 1436614 1487418 1433166 1269621 1357305 1496836 1390828
12216A390828j17073j56470j11134L2018L0700q106O1139J63061J27356l3054
12206A379265j4752N2686J13588J21285O5850K52172J41334j18845j72794J04477
12196A924266j942k64603j56441k25471q7483j63974k20105j19552l8794P6638
12186G22539Q3506k0718j69827j43145m6554J07146o4241n8906J1203J86752M5343
12175F53098K01070J05255k5130J6279J8867q5747Q6850O2932j82813k25538q0348
12164E44775J0788q4963K5307M4234k00036k50059k14869j57817j5594R571l7320
12153c25983L9249J48248J48552J5975j7536K1420o6862N7869M630J04953J56293
12142B86808j8345m1581N5227p962p4214j17818q6361K1381q2336k6294m9315
$$ plain form
12216 1390828 1273755 1117285 1006151 1038169 1068869 1060763 1121902 1284963 1412319 1379265
12206 1379265 1364513 1417199 1530787 1652072 1717922 1970094 2111428 1992583 1819789 1924266
12196 1924266 1922324 1657721 1501280 1275809 1188326 1024352 804247 684695 645901 722539
12186 722539 806045 785327 615500 472355 425801 532947 468706 409800 421003 607755 653098
12175 653098 854168 959423 934293 950572 969439 883692 970542 1033474 850661 625123 544775
12164 544775 555563 470600 495907 540141 340105 90046 -124823 -282640 -298234 -288663 -325983
12153 -325983 -286734 -138486 10066 26041 8505 29925 -36937 20932 25562 130515 286808
12142 286808 268463 226882 282109 274147 199933 82115 -4246 17135 -65201 -91495 -140810
12131a40810k22561K6604R4660J15559K48220j1017r9483L8267l15099n4129L13852
12120e937J05980l5079j09392Q0454J0941L6173k64305J00612J47701l7086N59
12109C0621k02176M5799J40447Q0556J159J14058k662j35313k40736J13096j0170
12098f5321N0768N3409r4948k1862k7576r9609J01668J95634J22765L1233m9231
12087A96930l01327k80932j8285N6833J59846Q3366K9963N4170J30453J878o337
12076A06558l9692j8640K316j39529r7483P5656j2191k32053J7445K15122m6002
12065a68493m3872j5707K08634R8673m6725j75664k28777r3182K4744J47896J28521
12054a63952m8450N8354K43466J30972L570J0727q6101j60257K2348j01235O1038
$$ plain form
12131 -140810 -363371 -336767 -242107 -126548 121672 110655 11172 49439 -265660 -319789 -5937
12120 -5937 100043 64964 -44428 36026 46967 83140 -181165 -80553 67148 30062 30621
12109 30621 -171555 -125756 14691 95247 96406 210464 207802 72489 -168247 -55151 -65321
12098 -65321 -14553 38856 -56092 -77954 -105530 -205139 -103471 92163 214928 246161 196930
12087 196930 -104397 -385329 -403614 -346781 -186935 -103569 -73606 -19436 111017 112895 106558
12076 106558 66866 48226 50542 -88987 -186470 -110814 -123005 -355058 -337613 -122491 -168493
12065 -168493 -212365 -228072 -19438 79235 32510 -143154 -371931 -465113 -440369 -292473 -163952
12054 -163952 -212402 -154048 89418 220390 223960 234687 148586 -11671 10677 -90558 -29520
12043b9520j23943j29420Q2921J13771Q067J77446r1284n6669k0532J02437J14344
12032A47618o3933p4690O2555R330l25327k17447L1458K09872R6287P1930M5241
12021g106L0355J13824o9392j06950j13681L2987N1315J93347J64692j79320j10960
12010h89j4810M0505j3783N149r8179p9335K54996J1151l3187n0131j40267j29976
11998b48756J91760J53359j71486j60677M7330n4169q6263J29254J21505j15944
11988a94087O6270O7677m2331O9266K1483l0750Q8766K33733n046k27627j09913
11977f2559Q5978J7033j1412J59173k51J22560J31837J04919J32870J25240L38462
11966A143850K76346J54067j07831j44645j69693j67691r7982j27451n0781O0000
$$ plain form
12043 -29520 -153463 -282883 -199962 -86191 -78124 99322 8038 -48631 -69163 33274 147618
12032 147618 83685 8995 71550 80880 -244447 -461894 -430436 -220564 -124277 -52347 -7106
12021 -7106 23249 137073 67681 -39269 -152950 -119963 -68648 124699 289391 110071 -889
12010 -889 -15699 24806 11023 16172 -82007 -161342 93654 104805 71618 21487 -118780 -248756
11998 -248756 -56996 96363 -75123 -235800 -188470 -242639 -328902 -199648 -78143 -194087
11988 -194087 -127817 -60140 -102471 -33205 -11722 -42472 46294 280027 274981 47354 -62559
11977 -62559 23419 40452 29040 188213 187962 310522 442359 547278 680148 805388 1143850
11966 1143850 1420196 1574263 1466432 1321787 1152094 984403 886421 758970 708189 768189
11956G68189j70660m0310n4035p2743q3252Q9663K36948M7542j17159n1470j28698
11945D24015N3431Q8017J6585J51548r400J28366R2687J14528n4462O2236K69331
11934A336882K02409K19658J63085j91813j50622q9405j61776j41970J0512j74570
11924A022390l61079j13876q7842o6976K1545M7124q3827L643j20870k6611l9861
11913A93760j02886O4550j3461O4671J00212J04004K14480J87122N9411J72568
11903A044431J38214J86262l7862k82518k09891k56470k21618j27657p3396l2975
11893A26520O5626R3170R3868L8377o6878j20460k51324k12795j16429m6094J8402
11882c78017J20785K26601K9875l64l0731j81928N5723n4741R93l859k36480J2205
$$ plain form
11956 768189 597529 557219 503184 430441 347189 436852 673800 721342 604183 552713 424015
11945 424015 477446 565463 582048 733596 724196 852562 945249 1059777 1005315 1067551 1336882
11934 1336882 1539291 1758949 1922034 1730221 1579599 1490194 1328418 1186448 1196960 1022390
11924 1022390 661311 547435 459593 392617 414162 461286 377459 381102 260232 233621 193760
11913 193760 90874 155424 141963 206634 306846 410850 625330 812452 871863 1044431
11903 1044431 1182645 1368907 1331045 1048527 838636 582166 360548 232891 159495 126520
11893 126520 192146 285316 379184 417561 350683 230223 -21101 -233896 -350325 -396419 -378017
11882 -378017 -257232 -30631 -756 -1120 -31851 -213779 -158056 -212797 -211804 -215663 -452143 -439938
11870d39938j2033k5931L7913M4898K9299R0204O9365R6295O3087J2238k26049
11859b60652k6803q3125K3384J36090J43994j43351J7832J28968j9126j12980
11849a95769j01373J14537J9263k0943k3046n9705Q5773R3567N1561n1010n9669
11838a46814n4355k5053R2480m3814Q267M1911m4379r2224l6322J33036j33611
11827c00878J8618K10259J09322k82766k17264J0917J70613N417k0423J58349
11817a37836P524O9900k1331m4677K21799J25282o6007k65192p4053j27343j44740
11806d56674J9713m9579Q561j37802K15261J31945j722L9101O6135k4323O184
11795a83200P5991R4972j11202o0281l622j1214M9258N6353J34839Q8189L1114
$$ plain form
11870 -439938 -451971 -477902 -439989 -395091 -365792 -275588 -206223 -109928 -46841 -34603 -260652
11859 -260652 -287455 -370580 -347196 -211106 -67112 -210463 -192631 -63663 -82789 -195769
11849 -195769 -297142 -182605 -163342 -184285 -207331 -267036 -181263 -87696 -36135 -87145 -146814
11838 -146814 -201169 -226222 -133742 -177556 -169289 -127378 -171757 -263981 -300303 -167267 -300878
11827 -300878 -282260 -72001 37321 -245445 -462709 -451792 -281179 -275762 -296185 -137836
11817 -137836 -130312 -60412 -81743 -126420 95379 220661 154654 -110538 -184591 -311934 -456674
11806 -456674 -436961 -486540 -477979 -615781 -400520 -268575 -270297 -231196 -165061 -189384 -183200
11795 -183200 -107209 -12237 -123439 -183720 -187342 -198556 -149298 -92945 41894 130083 161197
11784A61197j26181P171l4801l8372M165r2916P8985J49887K2574j29233q4802
11773h2326m2514J28847m7528M9978l8981k32065j86131L5171J10608p396J96513
11762a15824K43964q3217n8099k23532L5919K32069R3977k07497k01937q2666
11752c66843N2553J80360M6701o9127n0615M1147o7895R7243J08147Q5472J0223
11741F7366j61416M975j04108j4351l629l4585J0711l5809k334K04042J66956
11730I7818p1472n0919Q727j02165r3140K7690o1448J9103j3844n2013K90974
11719f89p3414k67554k0794J40173L0521j09275r0408R0523K5467K4439J34850
11708a16161J28516J07072r2156j43408j40374m6631O3748k5474m4921P9284N1155
$$ plain form
11784 161197 35016 42187 7386 -30986 -26821 -119737 -40752 109135 131709 2476 -82326
11773 -82326 -124840 4007 -43521 6457 -32524 -264589 -450720 -415549 -304941 -312337 -115824
11762 -115824 128140 44923 -13176 -236708 -200789 31280 125257 -82240 -284177 -366843
11752 -366843 -314290 -133930 -87229 -156356 -206971 -165824 -233719 -136476 -28329 57143 67366
11741 67366 -94050 -89075 -193183 -207534 -211163 -245748 -235037 -270846 -273180 -69138 97818
11730 97818 26346 -24573 -15846 -118011 -211151 -183461 -244909 -225806 -239650 -291663 -689
11719 -689 -74103 -341657 -362451 -222278 -191757 -301032 -391440 -300917 -275450 -251011 -116161
11708 -116161 12355 119427 27271 -116137 -256511 -303142 -239394 -264868 -309789 -230505 -179350
11697a79350J18751P1058o191j08186L3390r4615J3229L4286j07768j67281J30870
11686b61807L05513R63k19471j60634l1258R4779K02472M7907k36449k5180L6898
11675b46267J78615L87r2027J08250J04609J26354l2525j83041p5230J15798M8698
11664E3621R6795Q0630j01773o5605j44789o8097j47447l1226j56363J83402P6520
11653b24332j22838j7897p3820r318O3487J32548J27739J26428r7073j25212Q2352
11642a37936J69332L7884m6638k5631p4930J9132j68843o659L4741J85370J0021
11631d157j51298k5497R082J03645q2635Q0987L448j38607o1524P846K57605J51702
11619A50597K7349j88792k88212K7275L8659J47945l3239o9503k7578N9749J9820
$$ plain form
11697 -179350 -60599 10459 4268 -103918 -70528 -165143 -151914 -117628 -225396 -392677 -261807
11686 -261807 43706 44669 -174802 -335436 -366694 -271915 -69443 -21536 -257985 -283165 -246267
11675 -246267 -67652 -67265 -159292 -51042 53567 179921 147396 -35645 -110875 4923 53621
11664 53621 150416 231046 129273 63668 -81121 -149218 -296665 -327891 -484254 -300852 -224332
11653 -224332 -347170 -365067 -438887 -448205 -384718 -252170 -124431 1997 -95076 -220288 -137936
11642 -137936 31396 69280 22642 -2989 -77919 -58787 -227630 -234289 -199548 -14178 -4157
11631 -4157 -155455 -180952 -171870 -68225 -150860 -69873 -66425 -205032 -266556 -258710 -1105 150597
11619 150597 177946 -10846 -299058 -271783 -233124 -85179 -118418 -187921 -215499 -155750 -135930
11608a35930q2640o4573K2399k8168j07359N0374L2170l9803m1825J53718J4344
11597b27293l6967n6981n3927r914l3879L2464J12096K6922K53070P97p6285J9150
11585e0747m1873N063n1538o3486J25397J12247r8856j73096n0051K0368j6910
11574b83482j2989J36002l853R3920j04675k05539k5517K00915J27850m8578j4829
11563a40775j4029m3338l2127M0130n4137j7232R556r4451J16373L5158J09789
11552h5083K09191K18697j20594k30773j44455o5699P2270k3809p9900Q671J0854
11541b30630O9183J01403j92689M0500J49817J48998j1507q2201j21628r712J55421
11530A6955p5711k36849J57746J43105m6319j69288k5363m182R1556l4735M3527
$$ plain form
11608 -135930 -218570 -283143 -260744 -288912 -396271 -345897 -313727 -353530 -395355 -241637 -227293
11597 -227293 -264260 -321241 -375168 -385082 -418961 -386497 -274401 -247479 5591 6388 -69897 -50747
11585 -50747 -92620 -87557 -139095 -202581 -77184 35063 -63793 -236889 -286940 -266572 -283482
11574 -283482 -296471 -160469 -164322 -70402 -175077 -380616 -406133 -205218 -77368 -125946 -140775
11563 -140775 -154804 -198142 -230269 -190139 -244276 -261508 -251952 -346403 -230030 -194872 -85083
11552 -85083 124108 342805 222211 -8562 -153017 -218716 -146446 -170255 -250155 -241484 -230630
11541 -230630 -161447 -60044 -252733 -212233 -62416 86582 75075 -7126 -128754 -138466 16955
11530 16955 -58756 -295605 -137859 5246 -41073 -210361 -235724 -239906 -148350 -183085 -139558
11519a39558L7871N7638r6703J8746p2494k8011p4725m3329J12756M8634n4055
11508b33230O4775O3105L875J19846N5309o6355r6988j07042n569N1245O4622
11497h6407J03316j5626j68685j61222m754Q6133J08811J60631j9025J05919j96708
11486h7617l4941k2911q5909K1897M1612R9589R992j02702L1611O3806j94554
11475b60127M1024N5788j17403K0879M5898J69081N5308j06669M1016K8197r735
11464c6743o097M7885p3368j1169j71386l7436O0336n3804J62832l828p4501J38089
11452e9190J40349O3757j44786m3160N4335K4007O5519j03835k56416n5712O0396
11441b54736K9723L6008N6278M633l6793O4638P0231K2802R4536Q7150K6027j184
$$ plain form
11519 -139558 -101687 -44049 -140752 -122006 -194500 -222511 -297236 -340565 -227809 -179175 -233230
11508 -233230 -168455 -105350 -101475 18371 73680 7325 -89663 -196705 -202274 -151029 -86407
11497 -86407 16909 1283 -167402 -328624 -333378 -247245 -138434 22197 3172 109091 -87617
11486 -87617 -122558 -145469 -231378 -209481 -167869 -68280 -58288 -160990 -129379 -65573 -260127
11475 -260127 -219103 -163315 -280718 -259839 -213941 -44860 10448 -96221 -55205 -27008 -36743
11464 -36743 -42840 5045 -68323 -79492 -250878 -288314 -227978 -281782 -118950 -122778 -197279 -59190
11452 -59190 81159 144916 130 -43030 11305 35312 100831 -3004 -259420 -315132 -254736
11441 -254736 -225013 -189005 -132727 -128094 -164887 -100249 -30018 -7216 87320 174470 200497 199313
11429A99313M0902q3435l6587m6529q7403j4614J28079j4797n8890K3751M5790
11418I5580k23717l0325R0678N9460M8841R3177q7636L9237j16044q0264L1581
11407g9432J20195n5657k8883J13118N1793k8166p1574l33911J49117K76140J251
11396A13991k2680q2886J9909J42707k020j45955O6620n8639J13883O3700k9306
11385A79324l3571l9537k7491m8944J15684R6662O9794j41679j4889K1566j08699
11374F8220Q1701J84535O043J40416m4070j5013Q7928j47856j93290j3391R8060
11363B53283j08864j79813K08602N7487j25822N2750K9188O9531P948P5838P3544
11352D13672J7797p0392l7150O4504J45691r4536o1226j1229m6408R4920K512
$$ plain form
11429 199313 240215 156780 120193 73664 -13739 -28353 99726 84929 26039 49790 95580
11418 95580 -128137 -158462 -67784 -8324 40517 133694 46058 85295 -30749 -111013 -79432
11407 -79432 40763 -14894 -43777 69341 121134 92968 21394 -312517 -163400 112740 113991
11396 113991 91311 8425 28334 171041 169021 23066 89686 31047 144930 208630 179324
11385 179324 145753 106216 78725 29781 145465 242127 311921 170242 155353 176919 68220
11374 68220 149921 334456 340499 480915 436845 421832 509760 361904 168614 155223 253283
11363 253283 144419 -35394 173208 230695 104873 157623 186811 256342 264290 340128 413672
11352 413672 431469 361077 323927 388431 534122 439586 378360 367131 320723 415643 418155
11341D18155j14044j2824J28442O1989o4554j69525o0982p7579J8015j10238k1096
11330d241Q0409M6325j47523J7048J03189p1040K5053L6899J9958p6519m4289
11319a4731J54085J18906j3686r0784j26798N9442J04488Q8270J01580o3316l35727
11308a8271j39559J80673L5789m2422M3044n7764j02181J7859j44509j1617J06645
11297a32313L4038o7898k5895J14053J54189J05355n8196o248n3162J38123P2437
11286B74483K5476j4676Q3072j68234o0038j45913j8591J3169P5956M5982j32319
11275b1633L3490o5203r6667J3610L5448p6982l1629k7133O3011J57383j8650
11264c4955k0745j08407m9766L16110o7210o2596M0525J13415m9115j00305j38462
$$ plain form
11341 418155 304111 291287 419729 481718 417164 247639 186657 109078 127093 16855 -4241
11330 -4241 76168 122493 -25030 -7982 95207 24167 49220 86119 106077 29558 -14731
11319 -14731 139354 258260 244574 153790 26992 86434 190922 279192 380772 317456 -18271
11308 -18271 -157830 22843 58632 16210 59254 1490 -100691 -82832 -227341 -238958 -132313
11297 -132313 -98275 -166173 -192068 -78015 76174 181529 123333 117085 63923 202046 274483
11286 274483 299959 285283 368355 200121 140083 -5830 -24421 -11252 64704 110686 -21633
11275 -21633 11857 -53346 -150013 -136403 -100955 -177937 -209566 -236699 -173688 -16305 -34955
11264 -34955 -55700 -164107 -213873 102237 35027 -27569 12956 126371 77256 -23049 -161511
11253a61511j39784p7492n6598k5649J24739J19933P1208j8174M1663K20781J08673
11242B07789k60862j84033r0976L1223J69117k6815J9304L0931K9899O6239M7755
11231C9571O2659J19729j16353p5777j79704o6305P6957j16883J14857J06924
11221c4325M8781J7270p9206j2513n8180J0645R1375J70089p6150l3356Q9439
11210A33869K8180N2826q7039j25113M7366k878j86293j81796K9858J34606O821
11199a49593n0882p334K45409J45530n9273p0862j04286J35169m1402J1579M7184
11188A01239j55688j1075M1148J42071n3505p5440P1218j75807m024P8580l7313
11177g8596J95710K9699r0366N3689j22179j8561k7744l7915m642j10345k5370
$$ plain form
11253 -161511 -301295 -378787 -435385 -461034 -336295 -216362 -145154 -163328 -121665 99116 207789
11242 207789 -53073 -237106 -328082 -296859 -127742 -154557 -135253 -104322 -74423 -8184 39571
11231 39571 102230 221959 105606 29829 -149875 -216180 -139223 -256106 -141249 -34325
11221 -34325 14456 31726 -47480 -59993 -118173 -107528 -16153 153936 77786 44430 133869
11210 133869 162049 214875 127836 2723 50089 47211 -139082 -320878 -291020 -156414 -149593
11199 -149593 -200475 -207809 37600 183130 123857 52995 -51291 83878 42476 54055 101239
11188 101239 -54449 -65524 -24376 117695 64190 -11250 59968 -115839 -119863 -41283 -78596
11177 -78596 117114 146813 56447 110136 -12043 -30604 -58348 -96263 -100905 -211250 -236620
11166b36620K00000L24822k03718k16703j18305J01507n7584j09679M8497j1247
11156b79030O5138Q6221k0193k11353m6368R4988K26677J35837J59095p0178j31220
11145I614k02115J2392P1724Q3228j51971O510o3137n3691K5363J20902O8667
11134g2514p012j81405O065J87629M8001r826j86826j83082M331j2421N9445m6162
11122c93777M721N3496j8188J20388J90847N3748j07615m9224J12744J58046j14414
11111A0772l8041K6957J2003J9327J69677M3703m2112j59787q6248l4585k2705
11100a01039L9408K1521N8651k9683K1013K21426j31815j60952l5647m2337j161
11089a40615j11764O4197q328P1078K5711k09232o9660K9810P6707J13092Q4124
$$ plain form
11166 -236620 -36620 288202 84484 -132219 -250524 -149017 -206601 -316280 -267783 -279030
11156 -279030 -213892 -127671 -147864 -359217 -405585 -310597 -83920 51917 211012 140834 9614
11145 9614 -192501 -180109 -108385 -25157 -177128 -170618 -233755 -287446 -262083 -141181 -72514
11134 -72514 -79526 -260931 -254866 -67237 -19236 -29062 -215888 -398970 -394639 -407060 -347615 -393777
11122 -393777 -389056 -335560 -353748 -233360 -42513 11235 -96380 -145604 -32860 125186 10772
11111 10772 -27269 -312 11691 31018 200695 244398 202286 42499 -43749 -78334 -101039
11100 -101039 -61631 -40110 18541 -11142 9871 231297 99482 -61470 -97117 -139454 -140615
11089 -140615 -252379 -188182 -196510 -125432 -99721 -308953 -378613 -348803 -272096 -159004 -74880
11078g4880J53027J3216j86747J06957J13140k0285j93453q2463L9357r99j17598
11067b50728r4888J04779J42776J2788J83116j9318k27582L8771J28199J18046
11057A35959L0555k1800m5517q2087k7467q2414m6350J41882J1524k24973j49046
11046c59734J27917K59366J11149r84j16860M9697o3658k34587M6845m9728j72401
11035d02978P0251L9188J83647p2851k24290N9547J58955K4008K3774m6711M9174
11024a38286J4919N7178k681J26213J25488r0072j41048j03853J01460k899J5665
11013c7916R9320K10977M1118J94215Q3162j25454J14540K46209K43502L35421
11003A405094K71439k20633l17816q6020j11784l0921j71622k86862O8904m2282
$$ plain form
11078 -74880 78147 91363 -95384 11573 124713 104428 -89025 -171488 -132131 -133130 -250728
11067 -250728 -345616 -240837 -98061 -85273 97843 78525 -149057 -110286 17913 135959
11057 135959 166514 144714 99197 17110 -10357 -92771 -139121 2761 14285 -210688 -359734
11046 -359734 -231817 27549 138698 137714 20854 70551 6893 -227694 -180849 -230577 -402978
11035 -402978 -332727 -293539 -109892 -182743 -407033 -347486 -188531 -164523 -140749 -187460 -138286
11024 -138286 -123367 -66189 -68870 57343 182831 92759 -48289 -152142 -50682 -53581 -37916
11013 -37916 61404 272381 313499 507714 590876 465422 579962 826171 1069673 1405094
11003 1405094 1676533 1455900 1138084 1052064 940280 909359 737737 450875 519779 477497
10993D77497k9102R4493k13130k20657M2691J81176j01749j68621j23921k9542
10983i0865L5018k6738o592j45179J00236K86244K9024P4280n3237J59440N671
10972C67302k08599j38033P6841J71752n3503L3610J21358L3282J96653K38107
10962H38770Q1974N6368J42512K38685L52224L60802L31812M2879r2180k88485
10952B065361l06150l27655k80469j95955j46246m70k40577l29139j28225M6952
10942A57427J65781l1686j31653K475J59656j70380j66873K48994J53087k5556
10932C61272l0592j45644j08668K18880J49435N3470j08630q8748k34145j82094
10922a15464R848J05207j28096m7808N2403Q4777k6951K1644K39510K09154J94202
$$ plain form
10993 477497 448395 542888 329758 109101 151792 332968 231219 62598 -61323 -90865
10983 -90865 -55847 -82585 -89177 -234356 -134120 152124 181148 255428 202191 361631 367302
10972 367302 158703 20670 97511 269263 215760 249370 370728 404010 600663 838770
10962 838770 920744 977112 1119624 1358309 1710533 2071335 2403147 2446026 2353846 2065361
10952 2065361 1759211 1431556 1151087 955132 808886 808416 567839 238700 110475 157427
10942 157427 323208 291522 159869 162344 322000 151620 -15253 233741 386828 361272
10932 361272 330680 185036 76368 295248 444683 498153 389523 300775 66630 -115464
10922 -115464 -105616 -409 -128505 -176313 -123910 -39133 -66084 -44440 195070 404224 598426
10911E98426K05073L03924K69331L01121Q5109j88389m36469m33184k64389j07133
10901C33420j15958j72970p1691q9352k6251m1120M4491M3113l2335q7829k2914
10890b39396l3265J05463J19978M2789m030q8724j18523M6756J89465O2191K0254
10879A02958m1570j54922n316r7160k27290J14374K38061M6333J0104P2864k5659
10868C2777P8183J68806j60293k28115l9674j54910R7344J15733Q7869j22034
10858a24314J77203m5003l9049P3451O3899N1226n794r4179R3082j9464j28420
10847B638j40321n4995J25587K1980q3980k0529K1244j17304j350o292J37053
10836a16269J55831j21928L5265o5325J36460j13794J047R6787j09990M9176O9571
$$ plain form
10911 598426 803499 1107423 1376754 1677875 1762984 1574595 1138126 704942 440553 333420
10901 333420 217462 44492 -27199 -116551 -142802 -183922 -139431 -96318 -128653 -216482 -239396
10890 -239396 -272661 -167198 -47220 -4431 -8461 -97185 -215708 -168952 20513 82704 102958
10879 102958 61388 -93534 -98850 -196010 -423300 -308926 -70865 -24532 -14428 58436 32777
10868 32777 110960 279766 119473 -108642 -148316 -303226 -205882 -90149 -2280 -124314
10858 -124314 52889 7886 -31163 42288 106187 157413 151619 57440 150522 131058 2638
10847 2638 -137683 -192678 -67091 -45111 -129091 -149620 -128376 -245680 -247030 -253322 -116269
10836 -116269 39562 -82366 -47101 -112426 24034 -89760 -88713 8074 -101916 -52740 16831
10825A6831l2093j80967n4623J42884J19316J58795J35888O6407k67201k73855
10815a68618J426J77540P804j97198L4576N1837q6900l4566J8825J86930n1567
10804e9911r2946R0995J08319p6287r8050m7760J5819J79352K34500l4992k74170
10793e5131n5870P2493k4972N5119p8116k732o3969m9718n4069N0929N157R0368
10781a10511Q4168j6177O3226k7366O537P0918k26385j04135Q3779K91936R4031
10770B10021L2024J1500j38732j40158j31902l9793J02902k9067m1655P1013l3033
10759a26880k6146J0557k7149R1033r183J9931j19315m0395J09337R0410Q2796
10748E4996j01304p560M8448k6597M4968R526o5882n3186L8410p2801m1681J20776
$$ plain form
10825 16831 -15262 -196229 -250852 -107968 11348 170143 306031 372438 105237 -168618
10815 -168618 -167192 10348 18152 -179046 -144470 -92633 -179533 -214099 -195274 -8344 -59911
10804 -59911 -152857 -61862 46457 -29830 -127880 -175640 -159821 19531 254031 219039 -55131
10793 -55131 -111001 -38508 -63480 -8361 -86477 -89209 -153178 -202896 -256965 -206036 -200879 -110511
10781 -110511 -26343 -42520 20706 -6660 -123 70795 -155590 -259725 -175946 115990 210021
10770 210021 242045 253545 114813 -25345 -157247 -197040 -94138 -123205 -164860 -93847 -126880
10759 -126880 -153026 -142469 -169618 -78585 -87768 -67837 -187152 -227547 -118210 -27800 54996
10748 54996 -46308 -53868 -5420 -32017 12951 22477 -43405 -96591 -58181 -130982 -172663 -51887
10736e1887J40557j22316k12318J5915J37946o5261j27753J02161J66307P8707
10726F2058j05251L1196k14765p4033O1772J10931k6826J5505R5292j7972P4555
10715A2462l8145j12596K0038R8518J95108n8882r8295j71697j9504j45017J02657
10704b15353K00976j2706P4187J12569k375j99446k0881m768k3864l1624j05734
10693b29019K7751K41421J92138j64498j49803q9369p7068j04172J83326J61323
10683g970N7049o8895j1478k7375K547O2912j2190j32459p1527j9159m3541K5657
10671b46429J00613N2964R1710J06199q5579O273p8756M655J63525q8999j28037
10660a01861j58666r3359k0292K04253J48580O1476o3014M173p8543o712L0933
$$ plain form
10736 -51887 88670 -33646 -245964 -230049 -92103 -157364 -285117 -182956 -16649 62058
10726 62058 -43193 -11997 -226762 -300795 -239023 -128092 -154918 -139413 -44121 -62093 12462
10715 12462 -25683 -138279 -118241 -19723 175385 116503 18208 -153489 -172993 -318010 -215353
10704 -215353 -14377 -27083 47104 159673 157298 -42148 -63029 -67797 -91661 -123285 -229019
10693 -229019 -201268 40153 232291 67793 -82010 -171379 -248447 -352619 -169293 -7970
10683 -7970 49079 -19816 -31294 -58669 -56122 6790 -5400 -137859 -209386 -228545 -272086 -246429
10671 -246429 -145816 -92852 -1142 105057 19478 25751 -53005 -48350 115175 26176 -101861
10660 -101861 -260527 -353886 -374178 -169925 -21345 40131 -22883 -18710 -97253 -103965 -73032
10649g3032r8125k6521P1893J2321k459j7325l8597O4401J74536N2819k68005
10638a48094j82991J75533J79196M7987J4197k01715r0190j60806n5227k426N2158
10627c72378J52360J34237Q7020P644L0346p1703j28425n0966O4584J8333K11783
10616H2835J37714j31850k62389j57208N6352N335N3325M1793Q9312Q8290O0956
10605F4465o0063J1659P3188j26985j85716L0997Q6768J13830o9686o6320r0967
10594b18830j2799J60147R4884p0987r1440j07163J224L7341R6768R3923k36083
10583b53015j78226j3276J20169J88713J53370J03495O2483M0854l2614n0689
10573A41264j71391r6723J46861N3055J65000r1394k00052p1634L6177M7711J88845
$$ plain form
10649 -73032 -171157 -197678 -125785 -113464 -115923 -133248 -171845 -107444 67092 119911 -148094
10638 -148094 -331085 -155552 23644 71631 85828 -115887 -206077 -366883 -422110 -424536 -372378
10627 -372378 -220018 -85781 1239 8883 39229 -32474 -160899 -211865 -147281 -128948 82835
10616 82835 220549 88699 -173690 -330898 -274546 -269211 -215886 -174093 -84781 3509 64465
10605 64465 4402 16061 89249 -37736 -223452 -192455 -105687 8143 -61543 -127863 -218830
10594 -218830 -231629 -71482 23402 -47585 -139025 -246188 -244964 -207623 -110855 -16932 -253015
10583 -253015 -431241 -444517 -324348 -135635 17735 121230 183713 224567 191953 141264
10573 141264 -30127 -126850 20011 73066 238066 146672 -53380 -125014 -88837 -41126 147719
10562A47719P6756j08659q5226j47332k44438J36040K49145q2858J85236j7489
10552A08894q5979j45646q3295J42958n8521j03602j19542J67348J54397R3088
10542G0100P693P1039J02476r3619j43772N2444p1443J77257J3593K177q3878
10531A04067j17682O3331J26506M3783j26024j11504N9067J31679O9072M2697
10521B84992R0923j25198j73286j06372j33294r2546j0678P6101k6221j95526
10511d11105q3682O8690R5320L3939N6918J20129J08061J12823P1156k12327p5567
10500a15645n6721o2007j01111N2775J3955P9345R2220J3826J9768k5186Q1314
10489g467K12263N1636K768n2170j64074k06614m0886p7705J63311K23979O1041
$$ plain form
10562 147719 224475 115816 30590 -116742 -361180 -225140 24005 -58853 126383 108894
10552 108894 22915 -122731 -206026 -63068 -121589 -225191 -344733 -177385 -22988 70100
10542 70100 77793 148832 251308 157689 13917 66361 -5082 172175 185768 187945 104067
10531 104067 -13615 49716 176222 220005 93981 -17523 41544 173223 242295 284992
10521 284992 375915 250717 77431 -28941 -162235 -254781 -265459 -189358 -215579 -411105
10511 -411105 -494787 -426097 -330777 -296838 -239920 -119791 -11730 101093 172249 -40078 -115645
10500 -115645 -172366 -234373 -335484 -282709 -268754 -189409 -97189 -83363 -63595 -88781 -7467
10489 -7467 204796 256432 259200 207030 42956 -163658 -204544 -282249 -118938 105041 166082
10478A66082N9301j24760r3325q4172q7423Q7289J22516J01709l9100J57131j23217
10467A42031R029o9380p262k22932k0889J30403l7290p8836M7378K55678M6524
10456A94454l6543j57991k27095P2992L4287j1362n6921K91843J05432K0934p9806
10445A50224j50649n8343K1592J9708j01313Q6537p2158l5474K4477J49064K04544
10434B38209J23130p0693M2755m3068m3776K2374p8831j39160j98299P6615k5696
10423i6440L7826J77448j07604l1595J2651L5276Q9820n3222j5709j46057j34853
10412b32459M8675J37744K14784o8174j85626n0280k2989K4083j6630o8479J25837
10401i3514N4963n7608r5794j24155p166l6912N0264J02706j7292Q1381n3862
$$ plain form
10478 166082 225383 100623 7298 -76874 -164297 -77008 45508 147217 108117 265248 142031
10467 142031 151060 81680 74418 -148514 -169403 -39000 -76290 -155126 -107748 147930 194454
10456 194454 157911 -80 -227175 -154183 -119896 -131258 -188179 103664 209096 230030 150224
10445 150224 -425 -58768 -37176 -17468 -118781 -32244 -104402 -139876 -115399 33665 238209
10434 238209 361339 290646 333401 290333 246557 268931 190100 50940 -147359 -70744 -96440
10423 -96440 -58614 118834 11230 -20365 -7714 27562 117382 64160 48451 -97606 -232459
10412 -232459 -183784 -46040 168744 100570 -85056 -135336 -158325 -134242 -150872 -219351 -93514
10401 -93514 -38551 -96159 -191953 -316108 -323274 -360186 -309922 -207216 -224508 -143127 -196989
10390a96989o8190p1103j480J23315K03223J61972N3472k09099j34873K38814
10380I9062K22756L9292j42693o5530j58759M097L121J0503r1230l3020O5897
10369d6504o9368m6780n4344N3307J34465L0647M4969N5543j58951k2802P8063
10358a755j00672j46360J4600J64789K68878r0641j46508j30930J12413J39396
10348H3210j8892J7818r545M709q0599j06030r4415J332p872R3499J50350M5430
10336G8995J32785Q180j321L5251q2204n4652N8414l3572K366Q5904j72863K4516
10324H1799J26938r4929l1014k500r0196j55230n8049p4124o2384J95776L04896
10313A40983J34677j03319j78100L2790J48518M2015K2811N7681r7804r9388j5065
$$ plain form
10390 -196989 -265179 -336282 -337762 -214447 -11224 150748 204220 -4879 -139752 99062
10380 99062 321818 361110 218417 152887 -5872 -1775 1346 11849 -79381 -112401 -46504
10369 -46504 -115872 -162652 -216996 -163689 -29224 1423 46392 101935 -57016 -79818 -1755
10358 -1755 -102427 -248787 -234187 -69398 199480 108839 -37669 -168599 -56186 83210
10348 83210 64318 82136 72591 77300 -3299 -109329 -203744 -202412 -210284 -116785 33565 78995
10336 78995 211780 219960 218639 253890 171686 117034 175448 141876 144242 230146 57283 81799
10324 81799 208737 113808 82794 80294 -9902 -165132 -223181 -297305 -359689 -163913 140983
10313 140983 275660 172341 -5759 27031 175549 217564 240375 298056 200252 100864 85799
10302H5799J84L7527r0467O1894j00771n1820m385K06661q3719k16357N8483J30860
10290C3889L7739q8146k1732Q046k1067J704J08298O2094Q8095j03797j52143
10279d7020p1825n5385m9888K5224L4034Q5548p7007l2637j22J02139L1231o4704
10267a20412J7095N6550N5329J41686o7377r7092J33844J8874P853k6229N0228
10256A70349j02567L1514J22526k20528p5680M4225j08804P9795O6793J28568
10246A36191K0967L2211q9750j12080J06968J22133k01612n7818l3234m7381P5596
10235d7809m6277L3641L9791p6300O9756R8543j00452q616J19531o9965j419j06721
10223i6297j97883o6782J28312J676k7764N6345p7938O7272J58290J96847O9016
$$ plain form
10302 85799 85983 123510 33043 94937 -5834 -57654 -62039 144622 60903 -155454 -96971 33889
10290 33889 71628 -16518 -38250 -30204 -51271 -49567 58731 120825 208920 105123 -47020
10279 -47020 -118845 -174230 -224118 -198894 -164860 -79312 -156319 -188956 -189078 -86939 -55708 -120412
10267 -120412 -103317 -46767 8562 150248 82871 -14221 119623 138497 146350 120121 170349
10256 170349 67782 99296 221822 1294 -74386 -30161 -138965 -59170 7623 136191
10246 136191 157158 189369 99619 -12461 94507 216640 15028 -42790 -76024 -123405 -47809
10235 -47809 -94086 -60445 -20654 -96954 -27198 71345 -29107 -37723 81808 11843 10424 -96297
10223 -96297 -294180 -360962 -232650 -230974 -258738 -202393 -280331 -213059 -54769 142078 211094
10212B11094p4002j1044j38091k6572N4296n9062q5251M6060q7590k3289m7943
10201b41394j27415L3775R9643J42087k287j24469M3441J29068l2333K2831N283
10190e1770K52691M4421k13618k70604K679N202L1173K0380N3379q828J05783
10179b9112J33573K8473j02437j51138J09K04778j4794j58718N8858K5045l4380
10168c9743J42951j11082j45453n0892L5949k0134K6363L6665L1050l4784P7021
10157e2089J19876l8435q0736J5601o2840j49786J8571J56240M47o6166R1853
10146d7464n2582M8740j7194M1115M9614J80741n2256p5986J55536O7464q6414
10135B11314j65325o0020r6268N1920K4492O4021m1078l1091Q1232m8674j8549
$$ plain form
10212 211094 137092 126048 -12043 -38615 15681 -43381 -128632 -82572 -170162 -193451 -241394
10201 -241394 -368809 -335034 -235391 -93304 -95591 -220060 -176619 -47551 -79884 -57053 -51770
10190 -51770 200921 245342 31724 -238880 -236201 -230999 -199826 -179446 -126067 -134895 -29112
10179 -29112 104461 132934 30497 -120641 -120532 84246 69452 -89266 -30408 -5363 -39743
10168 -39743 103208 -7874 -153327 -204219 -168270 -188404 -162041 -125376 -94326 -129110 -52089
10157 -52089 67787 29352 -51384 -35783 -98623 -248409 -229838 -73598 -73151 -139317 -47464
10146 -47464 -100046 -51306 -68500 -27385 22229 202970 150714 74728 230264 297728 211314
10135 211314 45989 -14031 -110299 -58379 -33887 30134 -10944 -42035 39197 -9477 -28026
10124b8026J6697m9496J3185J92434Q3186k2967Q1229j09309j09214j1937j04370
10113d8588L6950J72173r8192m3579K3542J1609j25021N6983R9875o6068j9175
10102E09J18743N2536j06706k0426N4546K03846Q5172J525j31267L3846j2078
10091B80246j86219J9363K15767j69556j1450P2158p6708M518J3367o9296k8220
10080F3970k9711j26128J23076M2767r90l8243R1788N1449p4487k48992j77712
10069c23213Q435J07053P7327J59198J53481M960J54693j55663p9331K9691l4892
10058A01739n9090K8337J24970l0640K9700M9029J00724O0237n0031K07388O45932
10047A208295Q33608J103489N16359j187092j126232n62572k08635k0280o2141
$$ plain form
10124 -28026 -11329 -60825 -47640 144794 227980 205013 286242 176933 67719 55782 -48588
10113 -48588 -11638 160535 62343 18764 42306 53915 -71106 -14123 85752 19684 509
10102 509 119252 171788 65082 44656 99202 303048 388220 389745 258478 292324 280246
10091 280246 94027 113390 329157 159601 148151 220309 143601 148119 161486 92190 63970
10080 63970 34259 -91869 31207 73974 72984 34741 126529 177978 103491 -145501 -323213
10069 -323213 -314778 -207725 -130398 28800 182281 187241 341934 186271 106940 136631 101739
10058 101739 42649 70986 195956 165316 195016 244045 344769 405006 354975 562363 1208295
10047 1208295 2041903 3145392 3661751 2474659 1348427 785855 577220 556940 494799
10038D94799j92323M9966k57981j95870p2304O9825p1471j16982R3925K73079
10028G4663l4742j61122m3530J54513O2771r7354Q2394J4078q9279k7439j04987
10017a70034N2965Q5018K8823O8400P6221j582j7787n7437j8988p8563j6356J18215
10005F8895m5611J28241l3502j71918q7039j00864J76803j60179k8171J31123
9995a22222J77405k681K5395J35558J03879L6140j20405n3533l7609k4388K0625
9984A38164N1150J24840o3383k32551j04988j18963l5138k7801l5703q9001J27204
9973b66170K15241J18478j2134j3300K5181K6407k2803o8439J00638J55925J11420
9962C70444j07005q9654j90286q5470J38303J32733j58505j25523Q4119J6894
$$ plain form
10038 494799 302476 352442 94461 -101409 -173713 -103888 -175359 -292341 -198416 74663
10028 74663 39921 -121201 -164731 -10218 52553 -44801 37593 51671 -37608 -65047 -170034
10017 -170034 -117069 -32051 -3228 65172 141393 139811 122024 64587 45599 -32964 -49320 68895
10005 68895 23284 151525 118023 -53895 -140934 -241798 -64995 -225174 -253345 -122222
9995 -122222 55183 52502 77897 213455 317334 353474 233069 179536 141927 117539 138164
9984 138164 189314 314154 250771 18220 -86768 -205731 -240869 -268670 -304373 -393374 -266170
9973 -266170 -50929 67549 55415 42115 67296 93703 70900 2461 103099 259024 370444
9962 370444 263439 173785 -16501 -101971 36332 169065 10560 -114963 -30844 -13950
9952a3950q379J89148j55274j1690J74698P1623K6119J8909r4231n349K6613k2939
9940A95298j07523j09464O3701o2495J20448l937m1274j2236q9627J47527K44174
9929C44592K00921j28812q1889m0930m0196J44179P1959P3915J02102K88536K01282
9918A135659J04128J00064j57711k75466q9407n0935o7443j57122r346j2155p5978
9907D44288j96375J49225j4691J09039J8371k07455K0461n7583k08055k01834
9897a44609J02350o3152j00671N0032J66483K48511J59622R2521k29117j81393
9887A00577q6780R2040N88Q1392J62202P4445j70943M2889M8521O0981P00k53020
9875A53592l30213l6596K25947J40111j3588N4795q3650J01172N3040N806Q3767
$$ plain form
9952 -13950 -22329 166819 11545 -145 174553 246176 272295 291204 196973 191624 218237 195298
9940 195298 87775 -21689 42012 -20483 99965 96028 54754 42518 -47109 100418 344592
9929 344592 545513 416701 334812 293882 253686 397865 469824 543739 645841 934377 1135659
9918 1135659 1239787 1339851 1182140 906674 817267 766332 698889 541767 532421 520266 444288
9907 444288 247913 397138 382447 491486 509857 302402 322863 265280 57225 -144609
9897 -144609 -42259 -105411 -206082 -156050 10433 258944 418566 511087 281970 100577
9887 100577 13797 105837 106425 187817 350019 424464 253521 296410 344931 405912 406612 153592
9875 153592 -176621 -213217 12730 152841 139253 194048 110398 211570 264610 270416 354183
9864C54183Q4091J14093m7841O1915j5843J6534p2686J97533R1318N6215K25584
9853A065096J14680M4500K16989N33377Q25847J209154K586439L930518M105547
9844A4632147J412768k790381m448352l338214j812278j139987o35594n16079
9836A364030l27523j89694j44501k86558j63808K4308Q1567O0177P7600P241l5729
9825D67110l5508n8800M8545l22240k7526J26490j33244l8144J69951J45790o9561
9814B72863j30064k00505j17787J16583N8203L8682P6577J3689j71731r9737P7048
9803f6179J49971L9217M566O1351k07275j12335L7250P8333j3849N8240M4221
9792G3511j27745l1014J82989K18134o0031j18733r7833J57223J70895q8538j20211
$$ plain form
9864 354183 438274 552367 504526 566441 550598 567132 494446 691979 783297 839512 1065096
9853 1065096 1179776 1224276 1441265 1974642 2800489 4009643 6596082 10526600 14632147
9844 14632147 16044915 13254534 8806182 5467968 3655690 2515703 1880109 1364030
9836 1364030 1036507 846813 702312 415754 251946 276254 357821 417998 495598 502839 467110
9825 467110 431602 372802 421347 99107 71581 198071 64827 26683 196634 342424 272863
9814 272863 142799 -57706 -175493 -58910 -707 37975 114552 128241 -43490 -143227 -66179
9803 -66179 83792 123009 127575 188926 -18349 -130684 -93434 -15101 -28950 29290 73511
9792 73511 -54234 -85248 97741 315875 255844 137111 39278 196501 367396 278858 158647
9781A58647m6991q6268Q4877P6322j18640k0757n9595l0708K5099l2200J69826
9770A19612L1903K1827R950r5950n7620K5482j19925j73360n088J02016M8523
9759i2630K1191L2353N92n8644J0691J12217j9819J02740k8645r2787n3541K54767
9747A88485J41415j08712j75796R3094O7044r0946p2760j22941J81280K6567k0474
9736A06256M742N0537N578q3274N755J25386J27532j00607n2101J77479q3983
9725B83300q2809r0107q4858Q5037j7267J0525m5490J57711k3313P371j31601
9714F8499J006L7786l7232n4904Q8935K04873L7636l0699n2639n4844l20j71561
9702C6536k8064R217o6823N1934J67965J38426P3473J044m4489j10170O6339R5437
$$ plain form
9781 158647 111656 25388 110265 186587 67947 47190 -12405 -43113 -18014 -50214 119612
9770 119612 151515 173342 183292 87342 29722 55204 -64721 -238081 -243169 -141153 -92630
9759 -92630 -71439 -39086 -38494 -97138 -86447 25770 5951 108691 80046 -12741 -66282 188485
9747 188485 329900 221188 45392 138486 205530 114584 41824 -81117 100163 126730 106256
9736 106256 110998 161535 167113 83839 89594 214980 342512 241905 189804 367283 283300
9725 283300 200491 110384 25526 110563 93296 103821 58331 216042 192729 200100 68499
9714 68499 69505 107291 70059 15155 104090 308963 346599 315900 263261 208417 208097 36536
9702 36536 8472 17689 -49134 2800 170765 309191 382664 383708 339219 229049 295388 390825
9690C90825r7631q7176k8590j0919j06244j56831r459J86937k0605j17566Q1169
9679B3910k1417l3214J50928J98501j94543j70288o3553P9448N3165o2877O4783
9668B4843J48327N1892q2871m9765M3505n1734o0076K4675J27409j73230j07941
9657a04966J82873J76515l3517q4512K75095P7478j89062K2044j01125j6611J21017
9646C25229J87990k1735k25908j00282j05267r0452j13423k4838K14311J82850
9636B28475j1671J7115J49731n0049j41921l9234N7225M6657J62571J30885r9175
9625D50609j99100k408n1260n7854j6147K715M6615j38970j85172J07565J54278
9614A10871j46259J1233P8905J38914o3237k08346J1413J00424N8156J09468q2542
$$ plain form
9690 390825 293194 206018 177428 166509 60265 -96566 -106025 80912 60307 -57259 23910
9679 23910 2493 -30721 120207 318708 124165 -46123 -109676 -30228 22937 -39940 24843
9668 24843 173170 225062 142191 92426 135931 84197 24121 48796 176205 2975 -104966
9657 -104966 77907 254422 220905 136393 411488 488966 299904 321948 220823 204212 325229
9646 325229 513219 491484 265576 165294 60027 -30425 -143848 -168686 45625 228475
9636 228475 216804 233919 383650 333601 191680 152446 209671 256328 418899 549784 450609
9625 450609 251509 249101 197841 139987 123840 126555 173170 34200 -150972 -43407 110871
9614 110871 -35388 -24155 54750 193664 130427 -77919 -66506 33918 92074 201542 119000
9603A19000K9556J84489J38423P368K238n5141r3804N1869J8281k2606j23201
9592B56472L3481R0142n247n7371p8297l03237M8428J84032O0245P7298N2149
9581C58095O1511r6501j90341o6051o8561K7463K05468J83739L9289k17160J6618
9570B53569R8031j28781J599K3663M4124j49316N7596J46751J5992m9340L7484
9559C51372J9495q9530R2572N3537l1285J89571O421j52176j78632L8358K8423
9548C28126M5856M5363J88801N8550j26813j8053J11122J1211P9461J72381L3681
9537I29686j15017o705k3635P8829r3045q0982p8894l0672j64121L516j17380
9526C01580J01014J80326q5346j88050L7699J10296p1870P3542P9805r4539L4531
$$ plain form
9603 119000 148556 333045 471468 478836 481074 425933 332129 383998 402279 379673 256472
9592 256472 289953 380095 374848 317477 239180 -64057 -15629 168403 228648 305946 358095
9581 358095 419606 323105 132764 66713 -1848 25615 231083 414822 454111 236951 253569
9570 253569 351600 222819 224418 248081 292205 142889 200485 347236 363228 313888 351372
9559 351372 370867 281337 373909 427446 396161 585732 592153 439977 261345 299703 328126
9548 328126 373982 419345 608146 666696 539883 521830 632952 644163 723624 896005 929686
9537 929686 814669 807964 784329 863158 770113 689131 610237 579565 415444 418960 301580
9526 301580 402594 582920 497574 309524 347223 457519 385649 459191 538996 444457 478988
9515D78988J48990j55892O9623M6811o7874m8685K0361M1761j08807l4863p5823
9504C14590Q3987J04693q3622q9739L7129J27331J44296J3171j26154p0686J42797
9493E97793J04994K05778r4588J71563P5971k55996j11562j42560j75411j5310
9483C60672m909M487j13596J46615J03210P6601R5446L776l201L4578k9174j68403
9471E06102p7768P7949M3610k3177K6500J05553p9766l2411k17338O2699K28483
9460F20436Q8184Q4308q9723k1087o0212k8016q9831N5053L2332J2164J4762r7878
9448E20492L2575j08109m1682M9046J50210n889o4010Q1399N7661M3532q1917
9437F33308q6167J2174n8301K088K23408J33743o9013k14169n4900J27992R5011
$$ plain form
9515 478988 627978 472086 541709 588520 520646 471961 492322 534083 425276 390413 314590
9504 314590 398577 503270 419648 329909 367038 494369 638665 651836 525682 454996 597793
9493 597793 702787 908565 813977 985540 1061511 805515 693953 551393 375982 360672
9483 360672 355763 360250 246654 393269 496479 573080 668526 672302 669101 703679 674505 506102
9471 506102 428334 506283 549893 526716 553216 658769 579003 546592 329254 391953 620436
9460 620436 708620 792928 703205 682118 621906 593890 504059 559112 591444 603608 618370 520492
9448 520492 553067 444958 403276 452322 602532 596643 532633 614032 671693 715225 633308
9437 633308 547141 559315 501014 503102 726510 860253 791240 577071 522171 650163 745174
9426G45174j24209j47113R6150k2968o0641k1133O7452J12976J5943J00048J72737
9415I34416J0397j03972o3232p8707m3342J41726K78j44973n6439o615q6611n514
9403D97412J84536k9291j6824K44716J90827L3942m2583q2189j28988L5962R3641
9392I81161J52089K23821o9829j27419J6200K01671l0182j11342j85631P1719
9382A122258J7643N2872N5676o1078o9268l8700J88209J1611k3602k21221j6293
9371A018107J33448J97064K6458o3689j04784r8751N9268K01402J01333l4453
9361A435403N4692O6438J8395j95737J546Q426j19144J93302J8203p8474K854
9350A405904J96366K58800J59680K2678N5861R8883J83809Q2130j602r3883n1367
$$ plain form
9426 745174 620965 473852 570002 547034 486393 465260 532712 645688 661631 761679 934416
9415 934416 944813 840841 777609 698902 655560 797286 797564 652591 596152 589537 502926 497412
9403 497412 681948 652657 635833 880549 1071376 1105318 1062735 980546 851558 887520 981161
9392 981161 1133250 1357071 1287242 1159823 1176023 1377694 1347512 1236170 1050539 1122258
9382 1122258 1139901 1192773 1248449 1187371 1118103 1079403 1267612 1279223 1255621 1034400 1018107
9371 1018107 1151555 1348619 1375077 1311388 1206604 1107853 1167121 1368523 1469856 1435403
9361 1435403 1490095 1556533 1574928 1379191 1380737 1389163 1270019 1463321 1481524 1403050 1405904
9350 1405904 1602270 1861070 2020750 2043428 2099289 2198172 2381981 2464111 2462509 2368626 2317259
9339B317259L8347o2803r6107M4780m7596q355l1945K8571R2071J49302L2278
9328B455802R8996q4657m1064r0607M4218J7697j74727j05617r4623N1838N0801
9317B128057J60005J30262m4567O2007J15987P9103N6786R5688R4399J43290L9247
9306C060264M9395K05688R722O404l4246J08254J97500K39890J44527J40488m4043
9295D083843J33590P7761J37962J88514J02494n551j07746n3033o7816j07476
9285D382542J50558m1445k20382L083J71643J64508k1677Q1880m5139J11928J49103
9274D886602q2869J5805P5957J15734M1611P1305o8615L29399K56116O525j32406
9263E515164J05086K16641L74268J55263J86353K8228R0044P0995K62895J62423
$$ plain form
9339 2317259 2355606 2292803 2196696 2241476 2193880 2185525 2153580 2182151 2274222 2423524 2455802
9328 2455802 2554798 2470141 2429077 2338470 2382688 2400385 2225658 2120041 2025418 2077256 2128057
9317 2128057 2288062 2418324 2373757 2435764 2551751 2630854 2687640 2783328 2877727 3021017 3060264
9306 3060264 3109659 3315347 3325069 3331473 3297227 3405481 3602981 3842871 3987398 4127886 4083843
9295 4083843 4217433 4295194 4433156 4621670 4724164 4718613 4610867 4557834 4490018 4382542
9285 4382542 4533100 4491655 4271273 4274356 4445999 4610507 4588830 4670710 4625571 4737499 4886602
9274 4886602 4803733 4819538 4895495 5011229 5052840 5124145 5055530 5384929 5641045 5647570 5515164
9263 5515164 5620250 5836891 6211159 6366422 6552775 6581003 6671047 6742042 7004937 7167360
9253G167360L52931N33594K89257K33292J00246L1014K83374J99316J24806J41986
9243I457176K53895K16995N8205J07728J96947R0557M8771l4413K6464J76057
9233A0598382L28318K32703J88092J28342Q6682J87398K86921J27004J39846J22685
9223A2426373K20701K37849P5981J31917J34773J13218J46443J80016K02099J75384
9213A4044754J03731R8364J04610J37699r9117Q7930J58439J97790J23669J08316
9203A5066185J41115l2710J8865J21927N7926K5926q453k31650j89480l95296
9193A4574355j90605J21150k10944k66043j69932k36794j18722j36457m10464
9184A2955544Q515k14726n3408j68633k91289j63796r3579l16806k99282k82314
$$ plain form
9253 7167360 7520291 8053885 8343142 8576434 8676680 8707694 8991068 9190384 9315190 9457176
9243 9457176 9711071 9928066 9986271 10093999 10290946 10381503 10430274 10395861 10422325 10598382
9233 10598382 10926700 11159403 11347495 11475837 11562519 11749917 12036838 12163842 12303688 12426373
9223 12426373 12647074 12884923 12960904 13092821 13227594 13340812 13487255 13667271 13869370 14044754
9213 14044754 14148485 14246849 14351459 14489158 14390041 14477971 14636410 14834200 14957869 15066185
9203 15066185 15207300 15174590 15193455 15315382 15373308 15399234 15390781 15159131 14969651 14574355
9193 14574355 14383750 14504900 14293956 14027913 13857981 13621187 13502465 13366008 12955544
9184 12955544 12964059 12749333 12695925 12527292 12236003 12072207 11978628 11661822 11362540 11080226
9174A1080226j87476k22574j95264r5224k3662k05807k28174k40608j35530j70873
9164I375034k68761k88932k02668k25938k78206J9082Q6371r6325j24013m44133
9154G551511k73697m5097k29063k07065l86744j55099J65216o5364q2798j98795
9144F073005j39206j25849r9469k00559j55162p9019j31034l0741j83637j81642
9134D746687R4484j1283j37448l0619J33491n326k54547j67714O7124q2508j11887
9123D240454l06284o1464L1892M1280l10478j54920k05528n8859Q596j10838K2666
9112C136517r2459j33270K6254P5044O1612P5531k46319j75713O4215R0757k13288
9101B668881j79451L8998P1899Q1300K8870k47838j28233Q794q1798j95924j9940
$$ plain form
9174 11080226 10892750 10670176 10474912 10379688 10356026 10150219 9922045 9681437 9545907 9375034
9164 9375034 9106273 8817341 8614673 8388735 8110529 8129611 8215982 8119657 7995644 7551511
9154 7551511 7277814 7232717 7003654 6796589 6409845 6254746 6419962 6354598 6271800 6073005
9144 6073005 5933799 5807950 5708481 5507922 5352760 5273741 5142707 5111966 4928329 4746687
9134 4746687 4841171 4829888 4692440 4661821 4795312 4789986 4535439 4367725 4434849 4352341 4240454
9123 4240454 3934170 3872706 3904598 3945878 3635400 3480480 3274952 3216093 3224689 3113851 3136517
9112 3136517 3044058 2910788 2937042 3012086 3073698 3149229 2902910 2727197 2791412 2882169 2668881
9101 2668881 2489430 2528428 2600327 2681627 2710497 2462659 2334426 2343220 2261422 2065498 2045558
9090B045558k3785J07152q5641j52441j76009M0801J76823l1404m9956J7920O486
9079A875504J3527l9805R7791j5832n9805R0180K8374p7031k21193q7320j4282
9068A590108p020k8196p5704k5148K0898j6601J60246j70531r7675L459p0494
9057A283342j5725Q5817j5897j33775n3729L0881r799k2620j3380M5895M4086
9046A225096k3066n1905J2178J09477J5846o6834j73362k03687o8443J89950Q7250
9035A052500j0052K0749J50371L8242N5067k9117j98103j09635K2278k3599L0785
9024I99486j9051M7912J7494J96114L5762j57859r1976j02186J20013K8606O4684
9013A138999J2081o4094L9081j02470j25660q7363j68370n9235J06230J00275
$$ plain form
9090 2045558 2021773 2128925 2043284 1890843 1714834 1755635 1932458 1901054 1851098 1869018 1875504
9079 1875504 1889031 1849226 1947017 1931185 1871380 1961560 1989934 1912903 1691710 1604390 1590108
9068 1590108 1583088 1554892 1479188 1454040 1474938 1458337 1618583 1448052 1350377 1353836 1283342
9057 1283342 1267617 1353434 1337537 1203762 1150033 1180914 1171115 1148495 1135115 1181010 1225096
9046 1225096 1202030 1150125 1162303 1271780 1287626 1220792 1047430 843743 775300 965250 1052500
9035 1052500 1042448 1063197 1213568 1251810 1306877 1277760 1079657 970022 992300 968701 999486
9024 999486 980435 1028347 1045841 1241955 1277717 1119858 1027882 925696 1045709 1074315 1138999
9013 1138999 1151080 1086986 1126067 1023597 897937 810574 642204 582969 689199 789474
9003G89474J43789J40899l8041j89221L8154P1909o6509q9818m8870m4715j9666
8992F87385N4774n0879j05755j32978J33953Q6937N7331j04869n7902l8762r4529
8981D34706J10642R6330N4234J68835l2897j71754Q4198m3987O379J3869K8351
8970G48906R1665m2338p9056J40452j10795j13066J35421n8569k22944r793R1498
8959E71381J23831p8469k055j5481R6975r9897j13163R9454j99488J3383J01007
8948D97478R7382M9713q4668m7624k8411m5935m2356J02113J9457o5380J85497
8937F37266J70193j0543j95544j79070p3467j4389J39995J34938p0444j2488j26276
8926D00171k4188l6416J21120K28217j02317R2291O6678O8120O8932o863j42998
$$ plain form
9003 789474 933263 1074162 1036121 846900 885054 956963 890454 800636 751766 707051 687385
8992 687385 742159 691280 585525 452547 586500 673437 730768 625899 567997 529235 434706
8981 434706 545348 641678 695912 864747 831850 660096 744294 700307 706686 720555 748906
8970 748906 840571 798233 719177 859629 748834 635768 771189 712620 489676 479883 571381
8959 571381 695212 616743 614688 599207 696182 596285 483122 582576 383088 396471 497478
8948 497478 594860 644573 559905 512281 483870 437935 395579 497692 517149 451769 637266
8937 637266 807459 796916 601372 422302 348835 334446 474441 609379 538935 526447 400171
8926 400171 375983 339567 460687 688904 586587 678878 745556 813676 882608 875745 732747
8915G32747q2505J25169J1668R9770J66901j96192k89034j18844M5880m6855n7561
8904C91144l3227J252j54164p7463m4751J19209J91416j2991o070j24244J74452
8893D24563R586M9739J04313L9983K5722N9314R3414R1853j29355O0284m1983
8882G87433j2614m8442j07228J77411j06496J1647J14195J44835q1139l0656Q1594
8871I30540J87094k4619o1408k03280j58920j41153l236J30843O4721J36946J54757
8860A012285M7463k01876j50384k13170o1660J12819M0302L6254o2380n3590j61640
8849C44423R9138J87808j24014q4991Q3116n4316M2221J08068M2391J9444n0081
8838F13207n8818P2126K35283K33727P1898n7460l2110O8194j9735l3053J56955
$$ plain form
8915 732747 650242 775411 787079 886849 1053750 857558 568524 449680 495560 448705 391144
8904 391144 357917 359169 205005 127542 82791 202000 393416 380425 374355 250111 424563
8893 424563 434149 483888 588201 628184 653906 713220 806634 898487 769132 829416 787433
8882 787433 774819 726377 619149 796560 690064 701711 815906 960741 879602 848946 930540
8871 930540 1117634 1093015 1031607 828327 669407 528254 525018 655861 720582 857528 1012285
8860 1012285 1059748 857872 707488 494318 432658 545477 585779 622033 559653 506063 344423
8849 344423 443561 631369 507355 422364 505480 451164 493385 601453 643844 663288 613207
8838 613207 554389 626515 861798 1095525 1167423 1109963 1077853 1146047 1126312 1093259 1250214
8827A250214P154J3409n1718M9853Q3493m1885k34523j08697O6065K3073J38705
8816A195143j23086j15304k719q0534k1219l6967J6062m6809m7980P0925r341
8805G98171N9636n6476j41501M7047j29665p8178J2599J22105R3728q278k04288
8794E14900r027K63062m265k01503J12063j6240J9667K6817J80789J24235q0845
8783I29653o8793K30104J10229R1570p1787m6072R11K03286J54521j0748j93957
8772A328917r7269k87438k28893J16766Q3773M8253j39493k45866j03529q5916
8762C89305M5611M2628N482k778r9075O7482k3779O8127M3193j20384K7429R9914
8750E43155q9292j15400n1135M5608P1890p2503O8923J15678p4533q2704K5795
$$ plain form
8827 1250214 1257368 1270777 1219059 1268912 1352405 1310520 1075997 967300 1033365 1056438 1195143
8816 1195143 1072057 956753 954034 873500 852281 815314 831376 784567 736587 807512 798171
8805 798171 857807 801331 659830 706877 577212 499034 511633 633738 727466 719188 514900
8794 514900 505873 768935 764670 563167 675230 658990 678657 705474 886263 1010498 929653
8783 929653 860860 1090964 1201193 1292763 1220976 1174904 1175815 1379101 1533622 1522874 1328917
8772 1328917 1231648 944210 715317 832083 915856 964109 824616 578750 475221 389305
8762 389305 434916 477544 483026 480248 381173 448655 424876 493003 536196 415812 443241 543155
8750 543155 453863 338463 287328 332936 404826 332323 401246 516924 442391 359687 385482
8739C85482K42757L5001O3991L833M5949q4119n9500Q4557O6353m5645L0946J45734
8727I15339o0703j86475j02299N4583r4269q7041J14525N2399O2864j4754J9598
8716F73767j0581k9763K3406k9040j95575k31029P7986P0061K7226j5280M1693
8705D02871J20575m2644L334M9608J24982o7162R092k46841m4143Q9505r4344
8694C04833O4961J59733J06789p8012j79607r4018M456L5461J05145J75126L6193
8683F41060j55664j65900o8770J52381L648O2238p2435J47286Q9401R33j28138
8672E06040p3683n5571k5601O3576P7861M4223q3050J3855R0416R9542P3020j66596
8660E64032j6075J16430r140j57591k2542j04137L9466J00278J70029J56688o8293
$$ plain form
8739 385482 628239 663240 727231 731064 777013 692894 633394 717951 784304 738659 769605 915339
8727 915339 854636 668161 565862 620445 526176 439135 553660 606059 668923 654169 673767
8716 673767 663186 633423 656829 627789 432214 201185 279171 349232 376458 361178 402871
8705 402871 523446 480802 484136 533744 658726 591564 600656 353815 309672 399177 304833
8694 304833 369794 529527 636316 558304 378697 284679 289135 324596 429741 604867 641060
8683 641060 485396 319496 250726 403107 406755 468993 396558 543844 633245 634178 506040
8672 506040 432357 376786 351185 414761 492622 536845 453795 467650 558066 657608 730628 564032
8660 564032 547957 664387 655247 497656 475114 370977 410443 510721 680750 837438 769145
8649G69145J41165L66033M38607M51408Q91489J022310K80106j086146r85214
8640B288903m98292m61908l34418j82968n5473L1991n1389j85698j83174l1742
8630C35832k6282P6599J72157J46660n7655o5857n2417p5q9544J9094J39491K70907
8618H68910K5913k17649m3261J78353J29111N5669J0028Q3325j47940j0427L9184
8607I71216L7095J29055K80278J99972M08925M57605J027844J903618K668137
8598H083745J291924j908972k668504j520485q66018m81833k06262N6801n0730
8589A729666j37372M3612n1590j19398k03207j89317k17004o4262o4277n8233
8579F68618N733N9107j7854j50101K4934J21415O3109l5192n4406k2732j51080
$$ plain form
8649 769145 910310 1276343 1714950 2166358 3057847 4080157 4360263 3274117 2288903
8640 2288903 1790611 1328703 994285 811317 755844 787835 736446 550748 367574 335832
8630 335832 309550 386149 558306 704966 647311 581454 529037 528962 439418 458512 598003 868910
8618 868910 894823 677174 633913 812266 941377 997046 1007074 1090399 942459 932032 971216
8607 971216 1008311 1137366 1417644 1617616 2026541 2484146 3511990 5415608 8083745
8598 8083745 9375669 7466697 4798193 3277708 2411690 1929857 1723595 1780396 1729666
8589 1729666 1592294 1635906 1584316 1464918 1261711 1072394 855390 791128 726851 668618
8579 668618 674351 733458 715604 565503 590437 711852 774961 739769 685363 662631 511551
8568E11551m7267M0048P6553j33343j21219P7521J8792N1236L1655L0223J70036
8557G05786K70496M40510P86837J192242Q73202m12538j157817r17777m04010
8548A376931j26597k99226l37414o6394j90091j02892j73647R2239K33356J11992
8538E18257N867q4198n7343j14874j28922M8911J56340Q7847O510l5632K8616
8527D31379J6124j8550J8687r3752N7119k8177j11983l7466l1340j9543j31469
8516E1029j10936N5715J86337Q6228K01852J39571o6190l43493k01821j1440q3489
8505i6637J06487l1165l7984M6908p135M6402j02723n1499K27332J41620O0288
8494C01894L14p5206p8904N5910k0703N9442m6324m6171j05025p6921k2924L8981
$$ plain form
8568 511551 464284 504332 580885 447542 326323 403844 422636 473872 505527 535750 705786
8557 705786 976282 1416792 2203629 3395871 4269073 3856535 2698718 1780941 1376931
8548 1376931 1250334 951108 613694 547300 357209 254317 80670 172909 406265 518257
8538 518257 524124 439926 382583 267709 138787 187698 344038 431885 438395 402763 431379
8527 431379 447503 428953 447640 353888 411007 382830 270847 233381 202041 182498 51029
8516 51029 -59907 -4192 182145 268373 470225 609796 543606 200113 -1708 -13148 -96637
8505 -96637 9850 -21315 -59299 -12391 -19526 26876 -75847 -127346 99986 241606 301894
8494 301894 302208 227002 148098 204008 183305 242747 196423 150252 45227 -31694 -54618 -15637
8482a5637Q7007j6619o3759K09979r0406j98377P5249K00420j79822n1444r3361
8471a36770J7925O1165J1662J8826j80785J8834J07955R6403P7726J3351n9900
8460D6392P3163J5817L7666K14179l859j98955j81410k7489Q2638o8153j12851
8449a22862J25670J59043n2508o2689o3227Q1538Q7810O7816J65065l5757m5300
8438C04599j7515J15786O871j24713j34183J9950j2515M3967J20292r8372m9464
8427A74703K3218P8206P2376j90962o5368K25997j2685p7592k00407k24474K72248
8416G5260K63271j42711j92055j06468K18245L52198p6299J3995j68344N7354
8406B94446J42790j22148j07454R725p6047O911l9083k7337j8675M0408l1767
$$ plain form
8482 -15637 71370 54751 -9008 200971 110565 -87812 -12563 187857 8035 -43409 -136770
8471 -136770 -118845 -57680 -46018 -27192 -207977 -189143 -81188 15215 92941 106292 46392
8460 46392 119555 135372 173038 387217 383358 184403 2993 -24496 58142 -10011 -122862
8449 -122862 2808 161851 109343 46654 -16573 64965 152775 220591 385656 349899 304599
8438 304599 287084 402870 409741 285028 150845 170795 158280 202247 322539 224167 174703
8427 174703 197921 276127 348503 157541 92173 318170 305485 227893 27486 -196988 75260
8416 75260 338531 195820 3765 -102703 115542 467740 391441 405436 237092 294446
8406 294446 437236 315088 207634 217359 141312 148223 109140 81803 63128 103536 71769
8395G1769k18052q5217p8261J34147K8388J0765j1085K65706P0040r6956K4345
8384A15589l6273j72629n759J92748O1891P9474k1276m4209r9678R9923K8911
8373A98712n8076k17096j89217L0717j8241L9882P9741L45l2673k8815J04176
8362i0545j32588L5075J46169N3811p6702N0785m1669K43468N4823P9689q3924
8351B38392j67566q0642m2220R1226L8418l5095J07338j29434j76543n8121K06592
8340g655L0375q8464J2351n88L5440J23493m002K9375J51779J1890M9320J16381
8328D59695j96319j99700n2603N9582j2939k20354q2249J61483K32009J50855
8318B99460r8869j09283M7189M2263j87930K2677L0472J43213j49037n8263l7760
$$ plain form
8395 71769 -146283 -231500 -309761 -175614 -147226 -136461 -147546 118160 188200 91244 115589
8384 115589 79316 -93313 -99072 93676 155567 235041 213765 169556 69878 169801 198712
8373 198712 140636 -76460 -265677 -234960 -253201 -213319 -133578 -133233 -165906 -194721 -90545
8362 -90545 -223133 -188058 -41889 11922 -64780 -13995 -55664 187804 242627 322316 238392
8351 238392 70826 -9816 -52036 39190 77608 42513 149851 20417 -156126 -214247 -7655
8340 -7655 22720 -65744 -53393 -53981 -18541 104952 100950 130325 282104 293994 343314 459695
8328 459695 263376 63676 11073 70655 57716 -162638 -244887 -83404 148605 299460
8318 299460 200591 91308 138497 180760 -7170 15507 45979 189192 40155 -18108 -55868
8307e5868j306J24376q0540m6632J7891j586j02602P316k6399J18825r9145j25173
8295b70843o4379J76879J38947P5253J4758Q9332j44450j51564r0863N5414J42356
8284b9160j04922L9015J33151j9412j14504j55451j15187J55891J45789P2662
8274G872K0587K4904O0954j9900j65909k4113J02276O9196p2346j34226J91852
8263F1147J19589k17564j41545K44115J69281m3172n8989M1445p9055J00964J30959
8252C27175L0683l128j24183j18976j37975Q375J81068K27856o8557j69600j03451
8241D9287J02601R8362L10L9852R3948K1009j0765o79J4585J3260Q6152L638P6888
8228E88448m3324k13854r95k4290L3110k9764O339j7859j58365j93158P7704L56409
$$ plain form
8307 -55868 -57174 67202 -13338 -59970 -42079 -43665 -146267 -138951 -165350 -46525 -145670 -270843
8295 -270843 -335222 -158343 -19396 55857 70615 159947 15497 -136067 -226930 -171516 -29160
8284 -29160 -134082 -95067 38084 18672 -95832 -251283 -366470 -210579 -64790 7872
8274 7872 28459 53363 114317 94417 -71492 -95605 6671 75867 3521 -130705 61147
8263 61147 180736 -36828 -178373 65742 235023 191851 132862 174307 95252 196216 327175
8252 327175 357858 354730 230547 111571 -26404 -18029 163039 390895 322338 152738 49287
8241 49287 151888 250250 250560 290412 384360 405369 394604 393925 408510 421770 507922 511560 588448
8228 588448 545124 331270 330275 305985 339095 309331 315670 297811 139446 -53712 23992 380401
8216C80401p1439j02257l3082n6388l6601J21772O1070M6970K21999l2421j30097
8205C69927o8443q4771Q697m7277j21005j10478p7592O2818J2774R9646J58031
8194B02327J34167k63714j52300J09591m9156Q7458O4691l1188m0379K4224k3613
8183F2108J14166M3320K8847m8504j33811j99475j234J0187J94080J53706J32038
8172C55428P6636J41562Q729m615j42646j82842j17596J8957J46887J00248l970
8161C96778j3203K0427o0554n9737R9523j96510j28161n7454J48524J46923m7258
8150B49298J3250p7783l2485J61313L4289o1176O8797Q6359q7546k05556J89035
8139C37795J46373N6283R3743J88654J22219K19702L36792L73377N16795N17444
$$ plain form
8216 380401 308962 206705 173623 117235 80634 202406 263476 310446 532445 500024 369927
8205 369927 301484 216713 225410 178133 57128 -53350 -130942 -68124 -55350 44296 202327
8194 202327 336494 72780 -79520 30071 -19085 68373 133064 101876 61497 85721 62108
8183 62108 176274 219594 248441 199937 66126 -133349 -134583 -124396 69684 223390 355428
8172 355428 432064 573626 582355 577740 435094 252252 134656 153613 300500 400748 396778
8161 396778 383575 404002 343448 283711 383234 186724 58563 1109 149633 296556 249298
8150 249298 262548 184765 152280 313593 347882 286706 355503 441862 354316 148760 337795
8139 337795 484168 540451 634194 822848 945067 1164769 1501561 1874938 2391733 2909177
8129B909177M3724p7128m56782m98339m70479l06784j05409j98135o1975N558
8119G83428m2122k25096N2292N5665m342J33770J2535j1609N6685r044j16099
8108F86063j60315j08135q0423j59078k7526K29691K72309J54336m8971M5485
8098H03436n0731j12452O2483p2915l4684J98411J68588Q6058Q5417J98026K98789
8087A630426O57774R05222R08372Q69390N42166r9358q00240j007718r18788p36556
8077A950690l91007k93364j93597k36531l9562R5814k54609k61569k6672L1698
8067C81291M4187q0799j22716R6895J15813o2413R5906M2396r7873K8957n9811
8056C81833R6822J25725j45402j23555N987J02543J52856L1463l0835L5583J25506
$$ plain form
8129 2909177 2952901 2875773 2418991 1920652 1450173 1143389 1037980 839845 777870 783428
8119 783428 741306 516210 568502 624167 619825 753595 766130 754521 811206 802162 686063
8108 686063 525748 417613 337190 178112 150586 380277 652586 806922 757951 803436
8098 803436 752705 640253 702736 629821 595137 793548 962136 1048194 1133611 1331637 1630426
8087 1630426 2288200 3193422 4101794 4971184 5513350 5413992 4613752 3606034 2687246 1950690
8077 1950690 1559683 1266319 1072722 836191 796629 892443 637834 376265 349593 381291
8067 381291 425478 344679 221963 318858 434671 372258 468164 510560 412687 441644 381833
8056 381833 478655 604380 458978 335423 341410 443953 596809 628272 597437 633020 758526
8045G58526l3797R6632K19882R3533J71225L32958L42570K62140J26543N4936
8035B425148j96147k27257k35198k30610N6979l21934l42477j37144k192j5296
8025G73872j97026q0924R6546M8824j32949r7219n2909K41513P039n2251k2916
8014E31600j24444j94682Q1066K04145J08809J59800p5615j11082L9997N378M5624
8003F70596J98417J84851Q5661m9383l40244l0414L1710J28698M4091k25578j49497
7992E48908J48245J96452J18596j7826j83348k9285r5379P4913O9406j88512p275
7981F34895n5493q3558M7445j3750m267J0948O3882q9926j59339o7566J14452
7970C97723Q7201L0401P9893j14149o6075k903O4832o135Q5314O3798M9970J72935
$$ plain form
8045 758526 724729 821361 1041243 1134776 1306001 1638959 1981529 2243669 2370212 2425148
8035 2425148 2229001 2001744 1766546 1535936 1592915 1270981 928504 791360 789168 773872
8025 773872 576846 495922 592468 641292 508343 411124 358215 599728 606767 554516 531600
8014 531600 407156 212474 293540 497685 606494 766294 690679 579597 619594 624972 670596
8003 670596 869013 1053864 1139525 1090142 749898 719484 751194 879892 923983 698405 548908
7992 548908 697153 893605 1012201 994375 811027 781742 686363 761276 830682 642170 634895
7981 634895 579402 495844 543289 529539 525272 536220 600102 510176 350837 283271 397723
7970 397723 484924 515325 595218 481069 414994 412091 476923 470788 556102 619900 669870 842805
7958H42805k9539K8408n0648J6300n6789l1357p9603J97819J45063L308j54424
7947H31343J22191N0415j92853k58372q1232k4510j65456L4009J82013j13289
7937C84259p5814J47731R7635j414p5294K2554j99215n2632K14035N9518j3290
7926E08073r9034l2320r6385j0462N7396K66991J11328L8231J70917m7768j51750
7915G15217P5310j27156j14876L7106j64340k8769J03127N6290q3079J36413k3723
7904E81520r1291J39242j2167j63968P8382M3490O3615r774r5152j16784p5113
7893C42000K11513K82417L8589l40580m41871P6944J31401J72189J9338j22218
7883C69722k35717j03246Q3262K26925R5093J06304K7800j14902q6412J013l5952
$$ plain form
7958 842805 813266 841674 791026 807326 750537 719180 639577 837396 982459 985767 831343
7947 831343 953534 1003949 811096 552724 471492 446982 281526 315535 497548 384259
7937 384259 308445 456176 553811 552397 477103 499657 300442 247810 461845 521363 508073
7926 508073 409039 376719 280334 269872 327268 594259 705587 743818 914735 866967 715217
7915 715217 790527 663371 548495 585601 421261 392492 495619 551909 468830 605243 581520
7904 581520 490229 629471 617304 453336 531718 575208 638823 629049 533897 417113 342000
7893 342000 553513 835930 874519 533939 92068 169012 300413 472602 491940 369722
7883 369722 134005 30759 114021 340946 436039 542343 570143 455241 368829 369842 333890
7872C33890n5159Q4753L9378J1294k0689j74551m9406j0933o7014j5884k6171
7861D9508k2124J38990J82948R1447o5010M9532P7063j26260j32633J01482Q9395
7850D34338K201L4272J52987j78567k82634k9682n0474N0390m9443L738j87294
7839a00168m7565R6265M7279J04347N6245j89849l1575J4130r1707M2974K594
7828i7030J20762j23243j80545L22673M6282j03432L51j08732L7452L9713J02917
7817E7168J35945m6791p5482j4656l7923N8367J20734p4043k75791J47943K37570
7806B33041k7579q6328o6699r8610k5726q8488Q7866J55259r776K520k955l2296
7794D0229J3898k30241J55669K08814j00424J14121K4497K3434n677m0126n3518
$$ plain form
7872 333890 278731 363484 402862 414156 393467 218916 169510 158577 91563 75679 49508
7861 49508 27384 166374 349322 440769 375759 425291 502354 376094 243461 344943 434338
7850 434338 436539 470811 623798 445231 162597 132915 82441 132831 83388 87126 -100168
7839 -100168 -147733 -51468 -4189 100158 156403 -33446 -65021 -50891 -142598 -99624 -97030
7828 -97030 23732 -99511 -280056 42617 88899 -14533 -14182 -122914 -85462 -45749 57168
7817 57168 193113 146322 70840 56184 18261 76628 197362 123319 -152472 -4529 233041
7806 233041 205462 119134 52435 -46175 -71901 -160389 -72523 82736 72960 75480 72525 40229
7794 40229 54127 -176114 -20445 188369 87945 202066 226563 249997 244320 204194 150676
7783A50676N1279L0811J08430k6307q6682r8821o4945J06348o3839l03754P1160
7772a25644J17511L2201J24912N8540j79383k02068N6615J77578J67471k9685
7762A98048M8439j41979l09586K74240P3146r9815l1273j37885m9869P1206j21962
7751b27290m1233M3246J90393J70225Q2194j36900m5748R902j55624j87833K8843
7740b69825p007J0006N6116J21711J17625p0645j14890n2346J44565J25947J07117
7729A68374M4961J6261k3385j45318r6326L5382N0804j77992Q3673m4515J6545
7718g1536J01563N4847n4990k67873j80898J4277J77787J90310J49351j13249
7708d11o0549n915m0245q5525J37654L8590n0772m3304N633J03118n909M7213
$$ plain form
7783 150676 201955 232766 341196 314889 228207 129386 64441 170789 106950 -196804 -125644
7772 -125644 -8133 24068 148980 207520 28137 -173931 -117316 60262 227733 198048
7762 198048 246487 104508 -205078 69162 142308 42493 11220 -126665 -176534 -105328 -227290
7751 -227290 -268523 -225277 -34884 135341 217535 80635 34887 44789 -110835 -298668 -269825
7740 -269825 -276832 -266826 -210710 -88999 28626 -42019 -156909 -209255 -64690 61257 168374
7729 168374 213335 229596 206211 60893 -35433 -51 50753 -127239 -43566 -88081 -71536
7718 -71536 30027 84874 29884 -237989 -418887 -404610 -226823 -36513 112838 -411
7708 -411 -60960 -66875 -107120 -192645 -54991 -16401 -67173 -110477 -104844 -1726 -7635 39578
7696C9578p5127p8698j5648o9235O1928M2451p5260n058m1725L3776R1603J92972
7684A01557N7807o2258r2749O3745m2495L0138k6351j4853k1156j12922n9421
7673a78958N8135J37385Q7755o5735j14756K1764J35921J11862n4138j10932m7176
7662a8873J65779J7493r0410p0686P0692k8406n1306R794O9392j5236j31542k6937
7650a00246n1507J57804o137j08463m8711J10562P715m0611O4848P0005N4915
7639A10174q4026j67809K5577J58274K4731m1315M754J335R0019J9119P811j54738
7627f094K0357J36864q2993j15671m0119N7700j06348j47682Q0182Q5836K0016
7616i7952N6874n7420n0986J9299p5496r1997o3817L04004J86599L3288M8037
$$ plain form
7696 39578 -35549 -114247 -129895 -199130 -137202 -94751 -170011 -175069 -216794 -183018 -91415 101557
7684 101557 159364 97106 4357 68102 25607 55745 29394 14541 -6615 -119537 -178958
7673 -178958 -120823 16562 104317 38582 -76174 -54410 81511 193373 139235 28303 -18873
7662 -18873 146906 164399 73989 3303 73995 45589 -5717 4077 73469 58233 -73309 -100246
7650 -100246 -151753 6051 -86 -108549 -157260 -46698 -38983 -79594 -14746 55259 110174
7639 110174 26148 -141661 -116084 42190 66921 25606 30360 31695 121714 140833 148644 -6094
7627 -6094 14263 151127 68134 -47537 -87656 -29956 -136304 -283986 -203804 -117968 -97952
7616 -97952 -41078 -98498 -149484 -130185 -205681 -297678 -361495 -57491 129108 162396 210433
7605B10433j02449j11415o4776J82835J80899k47745k85396j53615P35P5433R1541
7594b23520L0088q6279K9670K0437m784j21526J30069K8908K2493J91235J17642
7583A34433R6104j20414j41531o2315j19705p437K90622P4392o3987R682J11839
7572B01683j31220n753j17349K2324R8930j3298k03367m8723J0136J45048R1006
7561D9417j0200j69701j20385R9914K11284l6070J666r7115p1091q3902N5208
7550a70975L094j24846q8947J50966J39467l078J23279J03045q7482j41369N3063
7539d3783N2232n1957J7771J52240K9285k00991q4454N6210J29693o4975n3446
7528f2175l9437O1928N7139j51174L4105O7887j28058m5970M2409J4984J09946
$$ plain form
7605 210433 107984 -3431 -68207 114628 295527 47782 -237614 -391229 -390494 -315061 -223520
7594 -223520 -193432 -279711 -250041 -229604 -234388 -355914 -225845 -196937 -174444 16791 134433
7583 134433 230537 110123 -31408 -93723 -213428 -220865 69757 144149 80162 89844 201683
7572 201683 70463 64710 -52639 -30315 68615 55317 -148050 -196773 -186637 -41589 49417
7561 49417 39217 -130484 -250869 -150955 60329 24259 25925 -71190 -142281 -226183 -170975
7550 -170975 -167881 -292727 -381674 -230708 -91241 -94319 28960 132005 44523 -96846 -43783
7539 -43783 8449 -43508 -25737 126503 155788 -45203 -129657 -73447 56246 -8729 -62175
7528 -62175 -101612 -39684 17455 -133719 -99614 -31727 -159785 -205755 -163346 -148362 -38416
7517c8416L5162K8292K4353J6122j83136q3806Q4769l87n8185Q101R9600Q090
7505e9441l2738O4924q4741l990K6069m0894J1947Q3001J9254J78090J3020j14242
7493F0259N1606m0056R622j0179j46896m4339O6613j16761j3565K37906J71541
7482B25751k19796L2226J37983n6978m250j84241l6705l0797o9661M9851Q639
7471a47978L1449j38575K9708J18688k3254N84l3391M4463l8795R2514k4916j8512
$$ plain form
7517 -38416 -3254 25038 49391 65513 -117623 -201429 -116660 -117047 -175232 -167131 -67531 -59441
7505 -59441 -92179 -27255 -111996 -115986 -89917 -130811 -118864 -35863 -16609 161481 174501 60259
7493 60259 111865 71809 81431 71252 -75644 -119983 -53370 -170131 -183696 54210 225751
7482 225751 5955 38181 176164 119186 114936 -69305 -106010 -136807 -206468 -156617 -147978
7471 -147978 -116529 -255104 -225396 -106708 -129962 -129378 -162769 -118306 -157101 -64587 -89503 -108015
$$ [...]
##END NTUPLES=NMR SPECTRUM
##END=
