##TITLE=Analysis number 328964
Compound Code cc 62606
Book Reference 546/4
Project Code adrs
Chemist Name craigr
##JCAMPDX= 6.0         $$ Bruker NMR JCAMP-DX V2.0
##DATA TYPE= NMR SPECTRUM
##DATA CLASS= NTUPLES
##ORIGIN= Bruker BioSpin GmbH
##OWNER= nmr
$$ XWIN-NMR		Version 3.5
$$ Fri Jul 20 08:56:23 2007 GMT Daylight Time (UT+1h)  MAYBRIDGE\nmr@NMR_250MHZ
##.OBSERVE FREQUENCY= 250.131544655141
##.OBSERVE NUCLEUS= ^1H
##.ACQUISITION MODE= SIMULTANEOUS (DQD)
##.ACQUISITION SCHEME= undefined
##.AVERAGES= 16
##.DIGITISER RES= 18
##SPECTROMETER/DATA SYSTEM= dpx250
##.PULSE SEQUENCE= zg30
##.SOLVENT NAME= CDCl3
##.SHIFT REFERENCE= (INTERNAL, CDCl3, 0, 16.522)
##AUDIT TRAIL= $$ (NUMBER, WHEN, WHO, WHERE, WHAT)
$$ ##TITLE= Audit trail, XWIN-NMR		Version 3.5
$$ ##JCAMPDX= 5.01
$$ ##ORIGIN= Bruker BioSpin GmbH
$$ ##OWNER= nmr
$$ C:\u/data/dgb/nmr/ADRS/1250/pdata/1/auditp.txt
$$ ##AUDIT TRAIL=  $$ (NUMBER, WHEN, WHO, WHERE, WHAT)
(   1,<2007-07-20 08:56:03.11 +100>,<MAYBRIDGE\nmr>,<NMR_250MHZ>,
      <created by zg, POWCHK disabled, PULCHK disabled
       configuration hash MD5:
       76 6E 9A 78 1E 09 19 81 EC 84 63 8F B0 6A 59 2D
       data hash MD5: 64K
       9F C8 3A A9 C1 07 BC 6A 47 35 21 11 37 5B B2 5E>)
(   2,<2007-07-20 08:56:14.50 +100>,<MAYBRIDGE\nmr>,<NMR_250MHZ>,
      <Start of raw data processing
       ef LB = 0.3 FT_mod = 6 PKNL = 1 SI = 32K 
       data hash MD5: 32K
       F0 6F 44 3A 47 0B E7 01 8B 71 3B 94 ED E6 F8 D0>)
(   3,<2007-07-20 08:56:16.16 +100>,<MAYBRIDGE\nmr>,<NMR_250MHZ>,
      <apk 
       data hash MD5: 32K
       FA 95 99 34 DA 5B 97 DC 4E 00 1D A5 30 BB 32 3B>)
(   4,<2007-07-20 08:56:16.81 +100>,<MAYBRIDGE\nmr>,<NMR_250MHZ>,
      <abs ABSG = 5 
       data hash MD5: 32K
       D0 E2 F8 AB DC 0A 6A 43 FA C5 D6 5A 56 EA 5B 59>)
$$ ##END=
$$ 
$$ hash MD5
$$ 37 B9 6F 17 D7 9B 23 F5 0A B5 5E E0 3D D8 03 9C
##$RELAX= 
##$RELAX= 
##$RELAX= 
##$RELAX= 
##$RELAX= 
##$RELAX= 
##$RELAX= 
$$ Bruker specific parameters
$$ --------------------------
##$DU= <C:\u>
##$EXPNO= 1250
##$NAME= <ADRS>
##$PROCNO= 1
##$TYPE= <nmr>
##$USER= <dgb>
##$AMP= (0..31)
100 100 100 100 100 100 100 100 100 100 100 100 100 100 100 100 100 100 
100 100 100 100 100 100 100 100 100 100 100 100 100 100 
##$AQSEQ= 0
##$AQ_mod= 3
##$AUNM= <au_zg>
##$AUTOPOS= <54 >
##$BF1= 250.13
##$BF2= 250.13
##$BF3= 250.13
##$BF4= 250.13
##$BF5= 500.13
##$BF6= 500.13
##$BF7= 500.13
##$BF8= 500.13
##$BYTORDA= 1
##$CFDGTYP= 0
##$CFRGTYP= 5
##$CHEMSTR= <none>
##$CNST= (0..31)
1 1 145 1 1 1 1 1 1 1 1 1 1 1 1 1 1 1 1 1 1 1 1 1 1 1 1 1 1 1 1 1 
##$CPDPRG= <>
##$CPDPRG1= <>
##$CPDPRG2= <>
##$CPDPRG3= <>
##$CPDPRG4= <mlev>
##$CPDPRG5= <mlev>
##$CPDPRG6= <mlev>
##$CPDPRG7= <mlev>
##$CPDPRG8= <mlev>
##$CPDPRGB= <>
##$CPDPRGT= <>
##$D= (0..31)
0 1 0 0 0 0 0 0 0 0.06 0 0 0 0 0 0 0.0002 0 0 0 0 0 0 0 0 0 0 0 0 0 0 
0 
##$DATE= 1184918162
##$DBL= (0..7)
120 120 120 120 120 120 120 120 
##$DBP= (0..7)
150 150 150 150 150 150 150 150 
##$DBP07= 0
##$DBPNAM0= <>
##$DBPNAM1= <>
$$ [...]
##$SUBNAM7= <"">
##$SUBNAM8= <"">
##$SUBNAM9= <"">
##$SW= 20.6930455092707
##$SWIBOX= (0..15)
0 0 3 0 0 0 0 0 0 0 0 0 0 0 0 0 
##$SW_h= 5175.983436853
##$TD= 65536
##$TD0= 1
##$TE= 296.16
##$TE2= 300
##$TE3= 300
##$TEG= 300
##$TL= (0..7)
0 120 120 120 120 120 120 120 
##$TP= (0..7)
150 150 150 150 150 150 150 150 
##$TP07= 0
##$TPNAME0= <>
##$TPNAME1= <>
##$TPNAME2= <>
##$TPNAME3= <>
##$TPNAME4= <>
##$TPNAME5= <>
##$TPNAME6= <>
##$TPNAME7= <>
##$TPOAL= (0..7)
0.5 0.5 0.5 0.5 0.5 0.5 0.5 0.5 
##$TPOFFS= (0..7)
0 0 0 0 0 0 0 0 
##$TUNHIN= 0
##$TUNHOUT= 0
##$TUNXOUT= 0
##$USERA1= <user>
##$USERA2= <user>
##$USERA3= <user>
##$USERA4= <user>
##$USERA5= <user>
##$V9= 5
##$VALIST= <valist>
##$VCLIST= <CCCCCCCCCCCCCCC>
##$VD= 0
##$VDLIST= <DDDDDDDDDDDDDDD>
##$VPLIST= <PPPPPPPPPPPPPPP>
##$VTLIST= <TTTTTTTTTTTTTTT>
##$WBST= 1024
##$WBSW= 4
##$XGAIN= (0..3)
0 0 0 0 
##$XL= 0
##$YL= 0
##$YMAX_a= 369011
##$YMIN_a= -322805
##$ZGOPTNS= <>
##$ZL1= 120
##$ZL2= 120
##$ZL3= 120
##$ZL4= 120
##$ABSF1= 16.522
##$ABSF2= -4.171173
##$ABSG= 5
##$ABSL= 3
##$ALPHA= 0
##$AQORDER= 0
##$ASSFAC= 0
##$ASSFACI= 0
##$ASSFACX= 0
##$ASSWID= 0
##$AUNMP= <proc_1d>
##$AZFE= 0.1
##$AZFW= 0.1
##$BCFW= 0
##$BC_mod= 0
##$BYTORDP= 0
##$COROFFS= 0
##$CY= 12.5
##$DATMOD= 1
##$DC= 0
##$DFILT= <>
##$DTYPP= 0
##$F1P= 14.0000005364418
##$F2P= -0.99999901652339
##$FCOR= 0.5
##$FTSIZE= 32768
##$FT_mod= 6
##$GAMMA= 0
##$GB= 0
##$INTBC= 1
##$INTSCL= 1
##$ISEN= 128
##$LB= 0.3
##$LEV0= 0
##$LPBIN= 0
##$MAXI= 10000
##$MC2= 0
##$MEAN= 0
##$ME_mod= 0
##$MI= 0
##$NCOEF= 0
##$NC_proc= -4
##$NLEV= 6
##$NOISF1= 0
##$NOISF2= 0
##$NSP= 0
##$NTH_PI= 0
##$NZP= 0
##$OFFSET= 16.522
##$PC= 1
##$PHC0= -48.00225
##$PHC1= 2.921279
##$PH_mod= 1
##$PKNL= yes
##$PPARMOD= 0
##$PSCAL= 4
##$PSIGN= 0
##$REVERSE= no
##$SF= 250.13
##$SI= 32768
##$SIGF1= 0
##$SIGF2= 0
##$SINO= 400
##$SIOLD= 32768
##$SREGLST= <1H.CDCl3>
##$SSB= 0
##$STSI= 32768
##$STSR= 0
##$SW_p= 5175.98343685301
##$SYMM= 0
##$S_DEV= 0
##$TDeff= 65536
##$TDoff= 0
##$TI= <Analysis number 999999
Compound Code 99
Book Reference 9
Project Code 9>
##$TILT= no
##$TM1= 0
##$TM2= 0
##$TOPLEV= 0
##$USERP1= <user>
##$USERP2= <user>
##$USERP3= <user>
##$USERP4= <user>
##$USERP5= <user>
##$WDW= 1
##$XDIM= 32768
##$YMAX_p= 455421620
##$YMIN_p= -132255
$$ End of Bruker specific parameters
$$ ---------------------------------
##NTUPLES= NMR SPECTRUM
##VAR_NAME=  FREQUENCY,     SPECTRUM/REAL,   SPECTRUM/IMAG
##SYMBOL=    X,             R,               I
##VAR_TYPE=  INDEPENDENT,   DEPENDENT,       DEPENDENT
##VAR_FORM=  AFFN,          ASDF,            ASDF
##VAR_DIM=   32768,         32768,           32768
##UNITS=     HZ,            ARBITRARY UNITS, ARBITRARY UNITS
##FACTOR=    0.157963299565203, 1,           1
##FIRST=     4132.6476996994, 0,             0
##LAST=      -1043.33573715361, 0,           0
##MIN=       -1043.33573715361, -132255,     0
##MAX=       4132.6476996994, 455421620,     0
$$ Real data points
##PAGE= N=1
##DATA TABLE= (X++(R..R)), XYDATA
$$ [...]
20592 -23615 -21844 -18525 13238 12020 -23045 -25245 -40859 -44067 -29173 9954 34891 12958 -842
20579 -842 2008 -9277 19491 36235 14103 -13131 -28083 -37055 -38562 -35839 -40621 -44720 -49488
20566 -49488 -50527 -62471 -43854 -43489 -50065 -17225 -27446 -33608 -68256 -73060 -48715 -18254 -30661
20553 -30661 -37813 -44989 -32576 -35899 -29911 2118 25346 11553 -4971 10473 13539 -3223 -11402
20540 -11402 -47517 -26198 -5106 8619 2203 -19150 -58202 -72474 -60545 -36761 -28685 2156
20528 2156 -10084 -12579 -27020 -31361 -15187 -8295 25442 19479 24137 11767 -11841 -11252 5498
20515 5498 -2538 -36208 -57123 -56803 -40456 -21964 -37699 -42823 -28898 -30569 -41464 -31261 -43437
20502 -43437 -36881 -33905 -37234 -57709 -79631 -82983 -73511 -48077 1819 28659 4600 -26096 -38403
20489 -38403 -56358 -53374 -65140 -45853 -30667 -52748 -77799 -55750 -11480 23467 56892 50459
20477 50459 -320 -4850 22117 25422 -85 -24391 -14198 -16536 4981 3659 -18292 -42064
20465 -42064 -31797 -11960 1577 8221 16009 13650 32921 46077 55370 35626 4692 18071
20453 18071 20510 27546 45842 31671 -6347 -12169 -41860 -52579 -74274 -88050 -67835 -41312
20441 -41312 -10959 -12256 -33830 -27913 -49724 -65885 -48099 -7285 13035 531 -16673 -14710
20429 -14710 -5383 -22385 -19089 -14117 -37923 -20855 -302 -6163 2744 -9505 -12427 -12207 -27504
20416 -27504 -39065 -33286 9470 33952 10864 1732 2307 -19021 -40333 -51549 -39988 -51828
20404 -51828 -72465 -69472 -70808 -48355 -51369 -29911 -12410 -21997 -16630 -33367 -42568 -29961 -22313
20391 -22313 -25371 2535 26857 1226 -8708 10586 -7755 -23222 -6428 -4693 -35516 -43161
20379 -43161 -23669 239 17446 19544 5926 14270 28010 11968 -10672 -12156 -6260 -21468
20367 -21468 -30110 -24602 -12650 -10410 -11809 -25803 -28365 -26314 -30995 -48072 -50772 -42917 -22951
20354 -22951 -521 29238 1267 -25740 -12681 10068 18793 9382 -23371 -15118 8119 -387
20342 -387 2129 -3392 -3726 -5711 -16287 5738 14628 -6051 -23986 -10109 103 -4864 5919
20329 5919 -5377 -3974 263 -26897 -48544 -43843 -23482 -2010 -1940 -15909 -27577 -16726 -27291
20316 -27291 -46160 -56678 -43106 -28739 -60953 -68415 -50049 -42163 -38724 -39435 -37897 -31170 -35827
20303 -35827 -21566 -30110 -44141 -40573 -19633 -42513 -35948 -35889 -40171 -64515 -49720 -29582 -18825
20290 -18825 -47230 -58856 -30245 -26081 -12472 -3247 -15656 -27299 -25264 -26757 -33723 -19783 -34430
20277 -34430 -42728 -33111 -14913 -27929 -33217 -12980 -4492 30003 34924 38128 45767 26668 41649
20264 41649 7820 -19091 -25823 -17173 -7783 -21006 -12550 -18940 -30761 -33536 -25042 -16637 -10104
20251 -10104 -26319 -68041 -97195 -107008 -120977 -124088 -132255 -109822 -86073 -53997 -47552 -41675 -36253
20238 -36253 -59221 -41793 -57693 -65571 -49214 -35016 -40104 -36950 -34666 -34648 -26161 -10695 4537
20225 4537 34081 32388 6895 29837 20742 12163 2849 6215 -1375 -33536 -43478 -40724 -24584
20212 -24584 -29482 -12639 -14890 -37607 -40295 -37038 -8547 -28125 -20160 10704 -87 -12319 -641
20199 -641 2469 1020 -15041 -3633 -1101 -8011 -8931 14077 19812 -8004 -22205 -9292 -13729 -9042
20185 -9042 1169 18542 14980 10819 6303 -19948 -31054 4554 19963 34174 73264 74463 74466
20172 74466 74258 74482 74547 68550 73352 85075 118487 129409 154063 181366 199923 215250 243662
20159 243662 262482 288206 339544 372951 421467 510733 569525 617218 688121 749955 804805
20148 804805 829656 841013 877501 917641 917839 904352 899395 874115 835867 794157 733779 677195
20136 677195 606936 538633 468676 430962 387935 309644 246980 230853 245746 241313 217770 185484
20124 185484 176190 182035 162280 137007 130202 107434 92543 90559 112071 126555 166942 187807
20112 187807 198375 221755 211346 200741 233235 277219 290432 306593 332662 342866 333847 354833
20100 354833 343224 322535 311549 291721 255526 237409 199171 175435 169923 129614 119504 121163
20088 121163 120591 128522 119476 83965 54090 61238 76112 92431 82272 55637 42459 52407 77157
20075 77157 76770 47276 14568 11238 25670 30197 -8008 -9373 -8943 -3137 50013 54345 45693 53659
20061 53659 104090 79966 9713 -9866 12368 23624 43427 43373 34188 19480 11732 -2907 122
20048 122 7965 34105 20343 -5994 -33418 -26762 -15190 30979 72733 62007 52123 46114 45284
20035 45284 40143 33460 32227 39315 36313 29636 24550 31255 14769 -13272 -5384 2457 -7192 13715
20021 13715 8251 -28211 -49126 -27175 -27677 -26166 256 28744 31996 23358 26180 44788 44598
20008 44598 31501 9796 32579 30587 28406 20303 11080 8076 -11404 -17837 -146 17046 -4082
19995 -4082 -30198 -35085 -17168 -8108 21618 14044 19376 25221 5151 -8045 8472 40063 39127
19982 39127 25040 8417 -14183 -42813 -18104 8133 14059 15786 29345 51807 59154 36993
19970 36993 15662 15696 3236 -1155 -1328 12208 37160 53827 60595 16404 -9660 -4473 12292
19957 12292 38763 23651 -10098 19279 21095 14083 4810 5395 20935 46163 53313 23733 19826
19944 19826 39281 46090 31583 9457 8402 16047 42723 46442 29914 4047 -32397 -51897
19932 -51897 8506 10730 -7925 -36006 -41176 -2749 12569 8501 -5959 5982 7763 28081
19920 28081 5241 9347 -17771 -12579 -13174 -9799 -18083 -35388 -23012 4051 19359 13127 17250
19907 17250 20648 13497 14703 45856 35778 19343 30257 2362 -10580 6577 6663 30412 32762
19894 32762 1669 5206 21987 34463 28242 4355 -19198 975 16435 24042 18663 16694 17880
19881 17880 14479 19110 20345 17240 16588 -7837 24634 32178 30746 -4468 -15451 9079 30524
19868 30524 55409 61727 54580 48287 29472 14972 29264 58924 66308 46548 31317 16287
19856 16287 12595 11704 -6199 213 21730 36784 58657 50801 55998 76634 78411 62847 65419
19843 65419 57005 65774 79743 98224 78377 58452 71017 75991 96608 114179 153658 159262
19831 159262 172561 166269 189438 223278 236687 236034 232108 223915 230146 226829 248188 280055 281859
19818 281859 248927 243126 260198 246007 222284 221424 247583 243386 242968 243127 232485 214798 226803
19805 226803 223135 185133 159501 169566 203892 198292 183594 168182 134577 104932 108093 117213
19793 117213 114133 101117 95580 115142 99179 114339 115178 122254 101577 92994 101084 113830 140071
19780 140071 146630 141671 107815 91544 99584 112531 102370 95337 110625 115831 105516 107407 126116
19767 126116 139726 141294 119717 139320 141939 126019 144185 159565 165394 162576 172681 194967
19755 194967 216859 202728 149975 117056 100325 100998 101447 80885 101071 125414 107861 127425
19743 127425 128012 127915 146351 164097 154326 167131 182317 179526 188902 206396 196270 195879 211668
19730 211668 215790 207540 231495 217896 200602 196729 182539 206708 218675 218773 252325 266110 305459
19717 305459 315762 308522 322913 346283 344014 360090 414119 453325 495821 517860 565622 632318
19705 632318 682956 742698 815306 883706 937533 988541 1037763 1110415 1191477 1255208 1298032
19694 1298032 1334887 1360362 1397162 1441829 1476629 1496301 1539453 1541713 1563021 1566619 1549099 1554264
19682 1554264 1547157 1517218 1450178 1390595 1332163 1289831 1242518 1177795 1108526 1063719 1041559
19671 1041559 1018511 990026 976069 973694 982272 990258 980211 947392 926993 933227 933421 921972
19659 921972 937591 942053 967629 994846 1024961 1052074 1070722 1080835 1098094 1141601 1166661 1197086
19647 1197086 1214232 1231105 1248486 1288860 1324133 1390478 1415823 1458698 1502780 1536192 1590339
19636 1590339 1646604 1670242 1721652 1798040 1878486 1928871 1991436 2025643 2044442 2096729 2169046
19625 2169046 2266588 2376038 2450181 2546089 2639570 2727218 2853403 2972484 3126786 3305988
19615 3305988 3483593 3621094 3784158 4009441 4230274 4436784 4670373 4947902 5253299
19606 5253299 5530191 5827657 6132929 6450254 6801263 7155338 7525644 7882896 8304022
19597 8304022 8771097 9285965 9872800 10521635 11267415 12129879 13148994 14367951 15818684
19588 15818684 17490732 19471612 21765789 24446488 27561822 31104310 35126114 39580069
19580 39580069 44582407 50130518 56203081 62763136 69737037 77172637 84914277 92792489
19572 92792489 100585300 108033928 114825475 120696527 125452779 128858289 130833550 131446883
19564 131446883 130954436 129647879 127733257 125513376 123323353 121352322 119629594 118130943
19556 118130943 116688618 115137275 113260186 110926649 108029109 104461350 100147740 95232892
19548 95232892 89845002 84109542 78235959 72402714 66799877 61538758 56675690 52285138
19540 52285138 48408873 44981362 42016193 39448708 37196336 35237109 33505445 32000165
19532 32000165 30665885 29438755 28303936 27258784 26276153 25359007 24498104 23704518 22926653
19523 22926653 22211170 21566211 20924572 20306925 19728782 19161204 18630079 18125128 17654055
19514 17654055 17173545 16694262 16225831 15782690 15344321 14900124 14511967 14118623 13704839
19505 13704839 13303672 12936029 12529186 12118835 11709589 11293865 10901672 10490462 10060610
19496 10060610 9660254 9288948 8953886 8605015 8230816 7925650 7682075 7438598 7182777
19487 7182777 6941160 6741616 6584340 6410957 6223708 6071059 5921756 5789379 5657880
19478 5657880 5515809 5409973 5310823 5259674 5214638 5144929 5061891 4994289 4940438 4857356 4781751
19467 4781751 4718962 4670929 4591929 4511276 4432071 4303770 4181702 4072571 3924669 3784359
19457 3784359 3679229 3578493 3425651 3282055 3173728 3074867 3009234 2934253 2844055 2808346
19447 2808346 2745117 2653776 2565531 2492641 2433333 2389776 2336920 2268157 2212149 2189887 2159594
19436 2159594 2095403 2016210 1985523 1955735 1911160 1869966 1815665 1765208 1716605 1653156 1611633
19425 1611633 1572897 1514391 1497429 1485824 1450844 1405606 1342904 1313394 1272353 1242786 1207064
19414 1207064 1180318 1173494 1130849 1079395 1072560 1041830 1029315 1020696 973462 957077 953596 927748
19402 927748 906167 927648 936937 927668 913536 934294 947065 920374 918189 909872 930629 932977
19390 932977 930133 920946 923186 909426 920765 931380 931240 913358 892489 905553 936265 923321
19378 923321 861388 841510 854828 851522 869199 856684 827754 824554 793633 762558 782733 805258
19366 805258 812003 762290 704278 701987 688829 695958 738910 746412 737342 725729 707721 711898 716423
19353 716423 735633 748726 759558 771417 759820 738833 728647 739421 764829 769078 771598 773098
19341 773098 744235 709411 664149 648078 641715 652444 669061 695015 680056 652875 647190 659912
19329 659912 665980 620119 606877 603111 591106 549753 547427 545590 549272 568020 577225 564261 581729
19316 581729 589821 546893 522430 526429 533799 523621 517542 508569 500270 502470 508272 496673 467622
19303 467622 454890 485296 500561 504991 486707 466613 474827 511770 535216 530529 505158 498082
19291 498082 495385 461728 420866 411781 397610 380212 398532 402427 390071 361045 322501 337284
19279 337284 355788 335965 346333 361644 350281 341143 334068 325419 297255 274464 295384 321087
19267 321087 320406 299178 299970 307489 308224 311341 294583 316890 323660 326591 324212 318207 291779 263573
19253 263573 261525 273361 304470 329423 335272 325143 321488 315273 284011 263934 245624 250518
19241 250518 274561 309253 331398 316622 315630 330130 340006 352295 341244 314157 280332 275238
19229 275238 266408 274607 257856 263327 295744 303804 274853 262574 248788 213690 218091 228772
19217 228772 247102 247519 262713 259914 256774 219352 224088 214753 231809 215295 211019 219637 238594
19204 238594 246523 227051 208660 220318 225146 226348 222275 206753 181758 161484 158409 186873
19192 186873 214913 239238 235468 223161 226424 233767 213400 212224 214182 196473 202019 215340 216314
19179 216314 238523 255881 262848 312938 322517 308602 288280 273493 278172 253788 258611 272075
19167 272075 271488 257522 246295 260486 294850 288383 291563 311269 315174 333590 344115 287484
19155 287484 258379 260311 216937 203501 211493 231083 240909 237985 242702 194315 181918 159757
19143 159757 145723 141880 174040 182819 167638 152680 131323 118846 132894 126020 126304 133607 131308
19130 131308 127342 128110 111169 111232 141952 135188 113881 109090 98358 71576 63317 86367 93088
19117 93088 112920 167684 192996 184468 145804 122945 141925 164687 175572 181677 174980 179743
19105 179743 160241 112170 110713 103076 148471 164497 109356 84629 83278 98144 96648 105580
19093 105580 130227 129969 146612 149553 182444 182835 164185 162244 153613 127052 99898 89806 90415
19080 90415 109528 117879 127945 126155 98925 126292 152333 170313 171363 165221 138866 139978 152676
19067 152676 171555 196379 181918 156090 165994 172809 148126 136594 147796 127794 114344 100783
19055 100783 109888 115732 115961 105658 123234 135009 131772 135579 120726 90691 78829 80812 98724
19042 98724 87954 77996 112207 123890 123031 121746 118309 125047 126048 102895 80747 100266 128349
19029 128349 144652 123381 101012 94681 102167 116321 103604 91997 82518 99501 128058 110727
19017 110727 125354 125748 118737 85649 97818 118974 111729 116785 131173 113925 105247 137253 143781
19004 143781 142263 148873 164060 208614 247912 272093 288116 297021 308992 337138 409828 445662
18992 445662 458294 484660 502819 520895 522881 535061 582976 618454 657644 653793 613306 566449
18980 566449 511783 467058 417986 420893 416314 430503 402382 390569 371614 373217 359795 373083
18968 373083 384689 379006 381022 378187 385062 415487 474503 512731 527810 562344 570453 569540 576949
18955 576949 561580 563800 579367 559590 532959 522456 488992 442542 444447 420822 366866 330668
18943 330668 314080 292974 257431 243357 222371 214900 228907 216183 183227 193423 222541 214862
18931 214862 168689 171279 169304 198391 211256 209831 187778 170706 181982 179356 183640 176358 175931
18918 175931 171973 169602 173340 159888 125559 102984 77074 73837 97700 118134 116158 120666 109656
18905 109656 75120 76051 80755 101708 108613 93624 90066 105516 115797 99825 82967 58260
18893 58260 61722 69906 77561 77032 74054 61665 50870 67050 88985 95316 95005 94469 67572 43516
18879 43516 61354 86409 116922 140178 133781 106161 71101 58427 49903 53329 52362 60921 69150
18866 69150 76857 86822 73173 61373 56400 77069 73016 42547 34649 26462 19372 32213 46031
18853 46031 61673 57442 63265 43848 46701 63496 67003 73150 79591 90417 106082 109082 97642
18840 97642 73859 50979 15315 35337 48123 53794 69112 119201 119252 60073 46721 62328
18828 62328 47810 68849 81492 72007 50986 45903 26855 23589 54951 54428 63739 76443 96507
18815 96507 93805 88073 75813 86831 100891 96229 89914 98829 106094 80926 86436 109703 100785
18802 100785 90966 73920 51160 104229 112797 110280 118398 106929 130188 121113 120819 170485 165266
18789 165266 157816 157908 161303 178352 207122 238775 243711 254159 285533 285057 283310 264213 222032
18776 222032 186959 187752 157879 145381 138445 141550 132130 125566 146998 163368 200653 232809 243348
18763 243348 196202 157371 160504 162057 147448 164577 167566 128628 98309 83138 72764 57617
18751 57617 78782 92855 99634 100673 104555 145830 167774 157359 161792 172127 188066 198723
18739 198723 220600 287536 325555 319368 329956 364934 404156 469424 511099 495529 503733 476608
18727 476608 435268 356317 338701 312313 262569 227107 218068 239473 246926 267875 306308 346443
18715 346443 387108 432466 437724 463314 564592 683351 745047 779901 776616 819280 860643
18704 860643 892037 923452 877386 813976 759917 794818 815338 738331 625657 549985 516132
18693 516132 462928 403282 347428 295928 291001 299214 312080 325339 324965 340800 345046 376751
18681 376751 429998 461097 489786 467722 453400 421295 378377 366188 356778 321555 305214 328718
18669 328718 341389 352984 371191 384472 395366 426656 457530 478977 498329 516605 550517
18658 550517 589751 638754 729150 744997 715829 647630 558591 484935 450893 405860 378463
18647 378463 378197 357259 329998 334463 313407 284506 272025 242693 203203 191640 201073 225882
18635 225882 204738 182950 165461 144674 147559 150999 137518 155400 172275 147860 137578 151214
18623 151214 155575 154861 170951 177391 183494 189876 194226 180018 196185 227501 285283 321359 311108
18610 311108 307318 319610 333134 335008 326272 342336 370304 406776 402254 356415 281140 254145
18598 254145 247391 232229 202426 161405 128765 109158 107872 113330 115401 132259 143542 147672
18586 147672 136845 113447 125001 139811 122796 125417 127236 134016 135811 149127 154596 127059
18574 127059 111920 100591 91196 83119 104318 115724 91720 53530 75127 103167 120787 106086
18562 106086 86162 74126 50429 43968 71707 103997 90338 68688 67598 81179 86180 78621
18550 78621 55148 53835 66181 66525 63678 37898 25437 28506 73469 101702 75260 77586 87127
18537 87127 82759 107634 103956 114031 142168 181971 190534 174138 145881 136756 124365 132215 114422
18524 114422 103881 100776 85878 96263 95313 73490 62801 62629 65379 85147 101978 78189 67901
18511 67901 48504 60296 64604 58036 61208 63516 82319 44094 22121 31779 33659 17067 38116
18498 38116 58433 66388 49909 48737 64021 90479 91832 96962 118284 116945 76954 63505 74392
18485 74392 73166 79468 92980 112633 156502 174832 193434 169550 171260 170748 173771 198681 226029
18472 226029 232532 240294 238020 247544 218350 193956 162698 136528 104380 88833 84763 100995
18460 100995 99038 79344 74098 95031 108678 86685 90264 81278 72984 60427 63449 85943 62067
18447 62067 77882 55639 46968 50175 63677 77284 75476 75216 74521 81378 99790 93970 93943 119315
18433 119315 146795 166982 172687 201611 217899 225147 233342 265109 251987 225635 262200 279287
18421 279287 298230 334223 337191 334117 315461 296596 297508 284145 242070 221231 221060 194911 181026
18408 181026 179387 214040 223015 249693 288561 309456 296643 279175 271867 274034 255916 234473
18396 234473 217860 183838 190422 181887 186270 211712 212207 197754 171297 161713 167108 171893 137529
18383 137529 139014 168515 178117 195919 195341 198524 212309 248779 266442 249414 243740 274999 328898
18370 328898 371144 381375 400420 429027 418455 372401 361572 356496 343269 328467 322808 351948
18358 351948 369176 378070 410270 441612 491780 530196 553925 595874 617809 653735 659659 612118
18346 612118 588775 560384 525848 507013 489022 464434 430789 418540 379614 336787 331550 350600
18334 350600 404990 446888 457923 450858 460881 464085 456945 466376 484586 507939 519782 570511
18322 570511 637409 693835 702242 665990 667884 696202 733420 793227 840681 878425 951123 1042535
18310 1042535 1171192 1321361 1447441 1522088 1583481 1624610 1672324 1750945 1857689 1963191
18300 1963191 2089487 2211840 2313861 2394805 2473361 2566240 2644280 2701846 2782153 2894807
18290 2894807 3042760 3278784 3666306 4229482 4952778 5882723 7052259 8397937 9864965
18281 9864965 11407796 12932932 14477047 16046010 17667987 19621267 22325582 26077850
18273 26077850 31333973 37709370 41036098 39897778 38028637 33968937 26386760 19079569
18265 19079569 14233099 11423570 9643401 8517251 7796526 7334064 7054654 6815774 6542461
18256 6542461 6266372 5976163 5704819 5474934 5292930 5177675 5051174 4918840 4820185 4793089
18246 4793089 4855145 4942877 5074971 5248521 5501703 5811818 6173219 6526836 7008990 7803402
18236 7803402 8991029 10595255 12654963 15229004 18302801 21710080 25336382 29063346
18228 29063346 32821083 36588353 40668738 45592008 51952040 60687296 71641157 80218666
18220 80218666 85863044 90083073 85399114 74300025 63021689 49956050 37343598
18213 37343598 28092784 22414140 18943109 16621656 15082781 14015475 13175856 12469109
18205 12469109 11801001 11113290 10406886 9783759 9253129 8888039 8683534 8597193 8551028 8490919
18195 8490919 8350615 8193666 8089596 8118480 8266977 8493486 8845354 9272978 9728694 10143349
18185 10143349 10611065 11308716 12362030 13795792 15557871 17599723 19773600 21919054
18177 21919054 24035900 26112056 28232448 30576383 33628731 38026631 44243703 52652366
18169 52652366 60494545 61445751 58721394 54456234 44741715 33278371 24652589 19473657
18161 19473657 16302540 14129888 12615064 11496684 10693287 10036562 9433957 8884472 8338464
18152 8338464 7861503 7511681 7266303 7081168 6959502 6857678 6682500 6428724 6151645
18143 6151645 5947888 5793636 5739799 5670649 5660152 5697059 5796359 5949636 6147177 6315326
18133 6315326 6390163 6323412 6127359 5857596 5586073 5320952 5152893 5119014 5174031 5304809
18123 5304809 5436451 5560703 5835531 6389190 7277083 8337464 9360335 10236781 10934283
18114 10934283 11515974 12101656 12848210 13892047 15620494 18442641 22713072 28866665
18106 28866665 34737518 31228047 21830444 14188210 10034995 7879581 6654198 5899975
18098 5899975 5367658 4985291 4731188 4500453 4263562 4046361 3853635 3749913 3715253 3700098
18088 3700098 3683279 3608165 3499989 3340575 3175712 3081443 3035763 3017624 3042656 3053962 3016832
18077 3016832 2960238 2914173 2807415 2722882 2678707 2670806 2649169 2580656 2500234 2410592 2355805
18066 2355805 2316468 2320788 2360214 2414227 2451494 2437599 2383959 2326013 2272015 2199142 2096008
18055 2096008 1983233 1934866 1951899 1973498 1968825 1984774 2065484 2141366 2189408 2229572 2288887
18044 2288887 2293650 2243558 2192737 2128213 2050937 1962459 1891885 1805239 1732512 1690343 1649448
18033 1649448 1667479 1678964 1641068 1649199 1695174 1738498 1764340 1797319 1833353 1819815 1771360
18022 1771360 1759734 1765458 1805894 1820931 1826888 1772781 1713771 1700115 1657776 1624263 1610037 1581024
18010 1581024 1523465 1467134 1443506 1456834 1461090 1406196 1329938 1237349 1120491 1046408 982473
17999 982473 958468 955999 950648 960797 985391 1015137 1062082 1109002 1131222 1180494 1252576 1334135
17987 1334135 1394768 1456092 1521903 1605290 1695619 1796563 1915125 1993178 2025086 2088323 2137094
17976 2137094 2202610 2238898 2255547 2258984 2199962 2130038 2072577 1997074 1932857 1863638 1777843
17965 1777843 1637525 1541787 1510116 1468431 1434741 1380147 1307420 1231906 1173368 1180458 1187421
17954 1187421 1137712 1072145 1023230 978881 928833 912486 903405 907069 925233 933723 961739 1004220
17942 1004220 1035017 1041736 1062609 1093082 1121896 1097763 1103851 1126801 1134743 1133801 1130120 1124267 1145288
17929 1145288 1172348 1170902 1149046 1112915 1104243 1111992 1122543 1115974 1088109 1064849 1041321 1035031
17917 1035031 1011798 999156 1023725 1034167 1053809 1097515 1145385 1171366 1208074 1221865 1247072
17906 1247072 1273483 1287025 1312949 1321583 1279734 1241070 1189997 1171487 1174491 1192025 1178981 1143427
17894 1143427 1108455 1080002 1056634 1032872 998509 965024 889633 809691 752453 716284 676058
17883 676058 644419 573523 560663 537234 533042 509876 506775 513884 522477 525679 512080 513950 521880
17870 521880 514139 551772 579292 601924 630781 641599 655983 667538 681779 743339 824266 874202
17858 874202 900081 915577 913963 921191 925140 942933 965583 995138 1017629 1063552 1076457 1064929
17846 1064929 1066239 1114641 1160474 1191119 1205903 1230256 1267342 1303507 1311707 1305766 1324023 1321885
17834 1321885 1329391 1320928 1316660 1309848 1329682 1375217 1434371 1469703 1479023 1495940 1515171 1506759
17822 1506759 1456835 1420741 1414069 1377195 1314141 1268142 1229456 1185511 1182594 1184327 1139289 1081733
17810 1081733 1049792 1004981 984832 998020 992303 975678 945314 927388 939376 917829 929974
17799 929974 950114 903193 869570 866102 850922 865820 900254 910718 894405 910696 917457 924256
17787 924256 974070 1004003 1017444 1045492 1057725 1061568 1047537 1040843 1029753 1066523 1117741 1169114
17775 1169114 1161959 1134849 1172501 1197404 1205189 1231512 1237280 1198766 1149012 1152393 1138802 1107609
17763 1107609 1099335 1074893 1034487 988807 934419 900160 898460 910871 934090 911581 886909 863669
17751 863669 860469 905085 923220 955050 1043693 1096640 1082925 1052466 1068090 1099309 1153497 1234290
17739 1234290 1279624 1319441 1379752 1471480 1600822 1681261 1775578 1892183 2057745 2218271
17729 2218271 2365738 2559691 2868852 3303328 3920845 4692538 5663342 6830289 8164187
17720 8164187 9498278 10813340 12160516 13797762 15848777 18279018 21225140 24814746
17712 24814746 29405790 35138744 40253196 40188197 37150518 35998895 38233281 43299855
17704 43299855 49103475 49075344 42916924 37246930 35009400 35572916 38116462 42438289
17696 42438289 47667233 49072881 44838753 40533586 39722238 42564176 47769063 49606210
17688 49606210 42040154 31253112 23283500 18618792 15897495 14217617 13139089 12504968
17680 12504968 12176709 11967255 11762044 11654399 11726254 11933905 12366732 12991633 13816080
17671 13816080 14976901 16566657 18578737 20752773 22958878 25199797 27634454 30554563
17663 30554563 34075047 38388743 43733507 50503292 59304320 70214278 79426874 80932411
17655 80932411 75713118 71576708 72550714 78374457 85440494 86703089 80862381 74686973
17647 74686973 73200003 76913119 85058770 96255341 102002141 92948744 79095900 71003556
17639 71003556 70619454 75659104 80142752 72728896 56445168 41970279 32969142 27623211
17631 27623211 24199206 21830867 20106137 18804650 17925436 17337833 16898311 16489333 16228043
17622 16228043 16199755 16374022 16766489 17267920 17815146 18375773 18923089 19562163 20449542
17613 20449542 21660450 23166434 24958490 27269828 30311562 34433864 39428251 42044250
17605 42044250 40312197 37983980 37690280 39661725 43288617 46421425 45583084 42973311
17597 42973311 42134830 44249740 49015120 55006616 55986252 49236677 41694463 37920608
17589 37920608 37945096 40351795 41394007 36220948 28232149 21938281 18222591 16072990
17581 16072990 14731074 13875046 13262689 12796269 12457590 12321255 12333294 12514547 12957387
17572 12957387 13731489 14889929 16443078 18371559 20633651 23093714 25623358 28129918
17564 28129918 30619049 33106538 35973032 39896234 45459422 53364781 63861671 73063411
17556 73063411 76326725 77877980 77642338 70369087 61321140 55756937 53794351 54153965
17548 54153965 56489834 61143806 68710595 79556429 91017900 98109585 98839998 94270414
17540 94270414 85223935 71612680 57233969 46854064 40955382 37970431 36959478 37604496
17532 37604496 39886170 43854862 48328723 49046786 46312475 42792481 36778962 29333772
17524 29333772 23443378 19788566 17606627 16160997 15116887 14329770 13662494 13057585
17516 13057585 12548803 12158579 11770591 11399466 10994793 10535765 10127405 9840672 9621355
17507 9621355 9407424 9158266 8850571 8498932 8144124 7807429 7522351 7307207 7124381
17498 7124381 6946395 6801889 6704989 6556256 6376438 6189653 6005977 5826568 5653354 5413335
17488 5413335 5144788 4914792 4728163 4573436 4453212 4384974 4301262 4160697 4022708 3880207
17478 3880207 3758357 3628729 3525244 3380033 3214491 3031967 2880330 2769334 2694567 2623269
17468 2623269 2551141 2459356 2371499 2309689 2237402 2158828 2057350 2005897 1939297 1904141 1875022
17457 1875022 1857511 1832746 1804097 1782040 1751590 1748010 1778802 1779557 1767775 1778392 1789939 1841614
17445 1841614 1879688 1886426 1854663 1822549 1842819 1877807 1891737 1847923 1774870 1710452 1664394
17434 1664394 1629121 1603684 1648008 1708088 1695826 1641760 1562391 1523999 1509495 1475559 1458781
17423 1458781 1397652 1297401 1231169 1176874 1142263 1079954 1048162 1043045 1018807 977025 938860
17412 938860 894822 851690 866398 871176 855041 834006 790289 776545 780232 758453 778038 755341
17400 755341 717299 697485 702965 696658 678047 658058 668792 658235 644392 612435 604808 603122
17388 603122 583196 569555 558462 561830 556328 521606 523580 511981 502614 525720 543890 531841
17376 531841 529612 539353 517928 496979 533994 511875 481927 495062 492153 497132 505373 532001
17364 532001 571604 577261 533227 527820 541371 551229 545422 546192 545874 558411 564504 568938 534294
17351 534294 513576 507321 475264 472886 474399 479347 460457 463854 473228 473967 445862 446212 464871
17338 464871 462320 463529 460406 448381 412983 420960 437790 429306 403610 400070 426836 437211 428109
17325 428109 413634 439020 441978 412522 394311 408357 406642 381469 421309 436795 417250 419130
17313 419130 379433 364472 378272 381412 398804 424497 439336 422924 404005 382844 329837 319348
17301 319348 309295 316155 305747 310684 295196 275638 268972 287817 310751 329450 334568 322030
17289 322030 322214 329818 322683 301270 274676 268846 266244 302082 304202 282383 281277 253703 243560
17276 243560 231950 229814 234000 243860 255935 254419 277232 273764 285602 267065 242661 246902 246143
17263 246143 249464 237021 228263 228646 212361 213756 196060 175854 181459 206210 224926 234035 231385
17250 231385 222538 216962 234170 211738 216699 227874 225402 194664 174754 173902 167763 186349 190163
17237 190163 194826 188877 192068 203115 217413 214574 190514 178534 170515 167354 180805 196868 214576
17224 214576 207769 180917 150396 140458 165473 164518 166539 172261 168402 178415 186467 182905 169794
17211 169794 155471 152020 145608 174438 229846 250348 241929 214171 208231 210462 208625 223231 244809
17198 244809 255712 267591 306733 300239 266941 272620 279791 312774 340036 354233 381712 403453
17186 403453 421841 400479 380342 372192 419987 427884 434586 419002 409136 397795 397222 394673 362570
17173 362570 358029 391258 405115 384751 359311 345081 329188 346882 356585 336852 328814 279232
17161 279232 272409 275428 263810 216536 185436 187951 192757 179029 178375 209900 219567 245531 264966
17148 264966 243377 237251 246087 252401 250500 269092 328360 379435 388677 409939 459432 521743
17136 521743 540314 592946 643875 619698 574659 559820 575784 591660 615640 590857 552461
17125 552461 516105 521453 544000 562622 561173 552670 540398 512016 482719 493718 493003 462713
17113 462713 436033 389809 307470 274906 262983 261472 244845 248398 230462 210689 204471 210175
17101 210175 224046 212548 206060 195759 212818 226285 230966 217036 222090 241727 277736 284582
17089 284582 302390 324049 344709 371005 378359 418642 408001 391656 363949 363210 389818 401128
17077 401128 415731 409814 419443 402531 396462 403509 415189 411490 395713 364013 319415 299558
17065 299558 296159 285978 268399 255281 222288 203504 196452 165579 188113 205565 216043 211736
17053 211736 189665 171890 181883 223729 233932 220378 220835 229873 240342 203395 200889 236355
17041 236355 257925 279115 308157 338130 357674 405134 457229 454326 472886 472935 439061 417531
17029 417531 402072 398262 391920 409724 462280 516667 549844 596246 635376 645439 614600 568679
17017 568679 498542 431819 374357 339440 336689 324236 295367 317000 359095 390997 428177 423639
17005 423639 356510 288819 261321 235454 218286 192557 191889 223018 241529 226291 210551 202733
16993 202733 210653 217836 222113 230845 219927 188259 189444 187685 185120 151964 149407 183783 181127
16980 181127 170899 150403 121197 108324 114496 135245 146337 153237 119085 123152 95713 72715
16968 72715 74933 84242 120574 119968 109902 121567 153496 126537 100507 119109 123645 94063 72811
16955 72811 93314 120975 124175 139364 139280 116061 85857 78446 93526 91862 111566 115450 120192
16942 120192 107842 126650 133099 108238 101142 101371 125518 116462 104052 85647 92379 111058 96718
16929 96718 92223 80402 73038 81806 90449 116015 120499 98495 91214 102475 93200 88709 81458
16916 81458 68458 86907 97155 92522 75467 72869 80024 86025 76910 81163 92352 114099 113865
16903 113865 109431 115567 102779 108571 109054 90661 74281 58692 48920 58865 69609 92953 96137
16890 96137 70016 108034 132419 104685 73756 56752 45770 16692 27869 76007 83612 106060
16878 106060 129192 129123 86716 91478 113497 91816 71380 75356 84177 95603 68470 27353 24498
16865 24498 22268 30013 84074 99469 63393 32994 65871 78743 71089 74248 90539 68099
16853 68099 54791 53120 69993 77427 73190 72652 82890 90115 85067 70433 79497 72238 47293
16840 47293 69083 122943 119031 91129 65079 40366 16788 27008 21243 18375 65737 55471
16828 55471 56631 49666 50687 46605 57296 75155 63429 41628 19793 16765 50521 66729 76881
16815 76881 76385 61010 62858 52729 38642 8280 8519 32534 64756 58565 57334 64584 55440
16802 55440 64222 44861 29700 52518 65169 68239 62631 66114 73132 66932 49194 50218 49465
16789 49465 30869 16445 31386 22809 26133 39489 52270 67869 74937 63283 74600 109568
16777 109568 113523 68723 61039 42433 16002 19035 46323 56842 60619 47870 55137 65184
16765 65184 40807 59283 49233 45614 23072 2502 33339 57582 54659 100675 116783 116102
16753 116102 97118 73363 95309 98492 91362 83618 103099 100796 83408 58770 47747 41535
16741 41535 27923 24505 47069 81681 75361 75183 64561 46789 44385 23034 -271 18982 57890
16728 57890 81182 107583 108420 88491 75294 72110 73988 66801 45039 46576 69283 68395 59007
16715 59007 19756 7021 25329 30183 26286 38555 47777 65185 57854 47566 34196 48819
16703 48819 58007 48278 40234 78759 91374 70249 56294 53972 50683 20118 21728 25839 36528
16690 36528 56965 55790 90659 88265 73220 85419 111320 109359 82359 63840 66271 51413
16678 51413 44054 54528 32347 45332 48953 61915 48129 35976 4863 30581 44336 26681
16666 26681 33105 56961 39703 24892 16572 6116 -23354 -12803 14121 17134 45419 40359
16654 40359 29575 51044 29800 11275 7482 -3093 -2730 -12360 9125 55817 69033 61992 70997
16641 70997 59303 25045 39109 76084 73189 75478 75642 101060 101068 88231 72459 68320 68723 52432
16627 52432 33231 30450 36664 37831 32574 22868 26379 67903 59873 73651 74017 67217 69283 37274
16613 37274 38732 60726 67877 76012 72119 69836 77955 72628 80308 93026 86331 56240 42243
16600 42243 39322 12426 3954 16285 28746 50698 33776 27327 8830 8522 35590 53841 65829
16587 65829 55211 48606 44632 52999 61443 10122 14976 21631 20523 34369 58437 74719 51980
16574 51980 23267 4307 31455 48652 40553 31841 17133 17484 45279 72282 82371 74753 73465
16561 73465 74572 77515 97136 87408 97483 75280 42088 19027 18476 7363 -15694 -16018 17852
16548 17852 40869 61508 54835 64806 76216 53123 49446 44176 39645 54135 55474 52239 58939
16535 58939 75264 70043 65663 69418 44823 22220 21089 13127 26436 8893 -7326 33428 67290
16522 67290 55981 13761 -15397 -16367 569 19904 30626 44573 59933 49820 29491 28097
16510 28097 39022 34391 30210 46392 41933 39588 45094 70904 54993 42000 58743 75867 51255
16497 51255 26396 49574 73767 79310 101652 105163 78990 75157 69273 84394 63997 49427
16485 49427 50954 52803 49017 53596 40917 35435 31859 57625 48445 45015 45307 43729 19499 20420
16471 20420 26893 25791 29035 2322 9105 8754 9475 13840 -3239 -35272 -33505 -12129 18739 36419
16457 36419 47232 60257 60725 44888 23676 7609 28886 26154 21404 28479 43122 36481 34218
16444 34218 22786 252 -921 12349 45057 7452 -40433 -39362 -1077 9972 10289 18194 34861
16431 34861 69396 68566 58692 37579 15360 3579 21589 39554 25526 19608 34639 53793
16419 53793 71098 68164 32373 22768 30016 57282 61867 35154 3137 -3523 13044 46220 52185
16406 52185 40662 26317 59370 76321 89436 102179 88828 63300 60106 37065 38423 57117
16394 57117 55732 73337 58522 54374 68232 70468 56561 57838 48178 18931 10087 4618 9881
16381 9881 10271 20322 31115 26136 25844 46259 37847 946 -10096 -18609 6909 5974 10194 21274
16367 21274 40114 48423 61369 54642 47423 56667 53999 58243 63338 51925 44780 55532 44874
16354 44874 33235 15388 12343 40270 55447 43859 55221 54877 38092 40485 23017 1706
16342 1706 -17425 -40721 -52678 -23494 -22850 -11737 15980 29752 41871 38068 32330 35962 45230
16329 45230 49350 35977 42010 21192 22734 14037 9646 9798 -5696 -2614 15790 35404 47407
16316 47407 56201 42731 21022 23965 30047 37465 74146 44572 16535 2292 23894 23194 6814
16303 6814 30972 54451 49209 54190 44023 50228 56359 44619 4339 14325 32752 38905 36848
16290 36848 52445 97974 110088 114757 112241 86955 58061 32694 17653 9773 6982 -1742 18409
16277 18409 46874 53575 36663 35398 46405 57551 74669 59410 56166 73253 74006 58345 71990
16264 71990 57414 59263 41077 31134 16595 9615 9627 29571 46732 18589 6132 668 23436
16251 23436 41014 54331 51925 56296 43566 34469 28063 33142 50358 34047 16358 29161 49692
16238 49692 45837 27743 14296 22223 32142 30698 37680 38274 33955 34867 12534 -5507 -1078 11506
16224 11506 39788 39935 21792 14820 1918 7523 33034 49498 44755 55420 51767 45306 44091
16211 44091 68910 71083 70595 31538 -10287 -8315 -30151 -31517 -22160 -17709 10038 12771 351
16198 351 -5851 18871 46440 44945 47689 55569 26603 11768 -14985 -10278 -10033 -15247 9601 34680
16184 34680 44849 37004 23624 24852 5807 -1840 7298 29474 27361 11854 15686 23586 6645
16171 6645 -2583 8815 21866 30864 34107 34356 36313 18088 11446 -10457 -6241 -2517 18693 52379
16157 52379 50378 70544 55101 43334 37591 25544 44104 63984 60623 36337 29341 43564
16145 43564 43045 38425 21912 38833 47242 23982 7665 9787 -1192 9032 8822 8029 18258
16132 18258 8996 38042 34775 9768 -3988 16 16968 12822 15383 29250 2455 16539 31667
16119 31667 16391 17281 5355 -5118 -16234 -22389 -617 18962 41907 33756 23219 9053
16107 9053 24441 34886 30726 38553 34366 17759 -23692 -20654 -17308 -29066 -5278 -17396 -26048
16094 -26048 13794 24975 22022 3359 7932 -18938 -67477 -30193 -23687 -23616 -16126 -13181 -14172 -25767
16080 -25767 -24906 -16389 -31996 -33649 -42519 -54486 -22867 -3801 2688 -3952 -18294 -6817 10071
16067 10071 530 -1603 16035 37356 61735 93629 86282 57579 17833 5595 -138 14420
16055 14420 34903 31163 7675 15910 42695 32705 34087 29507 6994 23211 39374 32332 33086
16042 33086 23278 20768 19714 3005 -14575 -10504 -8307 -14820 -15155 -25907 -898 35113 35754 26422
16028 26422 36246 36545 26482 26907 31624 43422 53924 38129 21412 6897 4238 -3307 -18451
16015 -18451 -11682 7163 6059 -19405 -6212 8704 -2020 1009 11430 35116 57422 58254 51500
16002 51500 29246 43197 30485 9588 -27829 -26632 3275 21180 6374 11538 28684 16344
15990 16344 12779 -10058 -14877 -25485 -31761 -41243 -1011 4239 3506 37421 25071 -2599 -8557
15977 -8557 -216 3411 -5275 -17786 -24270 8510 24086 30826 29761 3450 2186 -7527 -28210
15964 -28210 -17856 5169 15564 -13901 -21718 -8026 31135 34898 20056 3642 1388 5888
15952 5888 12514 34684 33427 35873 34613 15091 16066 29665 25071 -2951 12304 26260 29323
15939 29323 45764 39012 14484 13020 41869 25326 13445 27099 16670 -6282 -19451 -36693
15927 -36693 -18061 -2941 4787 22215 57838 53715 39065 34802 15952 7306 16124 23290 27120
15914 27120 42633 42489 18146 -17239 -36440 4671 24474 19811 8960 -16735 -13867 -3250
15902 -3250 39600 42548 19018 298 -7959 20872 50132 36819 24575 47986 51499 45856 36758
15889 36758 21782 2861 -3616 -21298 -4869 10398 1528 1827 1399 10229 23674 38781 43162
15876 43162 26054 27037 16774 11799 12885 6778 16661 20800 15177 13123 16788 -9777 -9300 -6579
15862 -6579 7525 16164 32323 14740 3051 8791 25654 5270 -6268 7641 22183 20455
15850 20455 9583 12829 8711 -13712 4971 17172 27663 17213 6574 -11312 -17141 6939
15838 6939 43902 59141 75288 67933 50778 59026 43866 22488 41191 58419 53820 26791
15826 26791 30553 16884 -8975 -10036 11328 13323 2543 14838 43461 39711 28605 28299 20584
15813 20584 18809 19869 26059 31826 38144 52692 64909 59181 65506 69603 50872 32524 -420
15800 -420 -10789 27359 7215 -17010 -12547 -21871 -5528 8631 27338 32925 23720 21515 43003
15787 43003 34000 29749 48806 51211 37497 36378 41059 29811 30179 59401 52356 39600 30680
15774 30680 -5395 -28378 -39109 -25821 -3495 20522 45664 63341 76068 41869 11971 765
15762 765 -12017 -6312 1505 21832 14515 13590 16819 -13463 -56323 -44295 -36144 -48744 -31081
15749 -31081 -19366 -26044 -16803 -7757 -14408 -36492 -37250 -8551 -15344 -18203 252 -4561 -20653
15736 -20653 -37240 -28505 268 -6949 -29745 -62782 -51275 -6965 18439 27645 28412 27957 37175
15723 37175 32677 -10640 -11147 13849 15472 7114 16890 -288 16252 18250 9478 12259 -6088
15710 -6088 -33991 -64467 -25047 14719 23762 1875 -24566 -5252 14026 17740 26513 71617
15698 71617 68452 33417 19897 22334 -17418 -41425 -30428 -32401 -13207 -3168 21180 28165
15686 28165 8260 16899 13333 24985 28140 -1827 -2807 2892 5712 -403 -284 29305 47974 38319
15672 38319 26599 51421 54449 37752 11011 14619 21811 12725 -10906 -4107 5327 -13268 -8150
15659 -8150 23265 47795 60010 38819 39714 51871 46785 24232 25516 29896 13227 -8654 8360
15646 8360 16906 9479 10230 -8677 -16733 -10294 3329 1538 14417 21919 13749 4807 -12564 -11768
15632 -11768 3162 16018 25195 28881 47552 44559 31254 31815 11865 5788 11110 11753 28043
15619 28043 33705 29389 3040 -17029 -11188 -10960 24770 52326 36825 12753 17084 33063 26169
15606 26169 37308 23961 40087 37448 34914 55819 74036 62868 39629 22717 5924 2975
15594 2975 -9512 5672 63 -12549 6682 67534 61204 20344 8745 25905 51906 44573
15582 44573 55603 46762 26962 11759 -17904 -9009 1124 37209 43353 53275 51319 44959 37729
15569 37729 25586 5757 40542 18342 -31847 -28176 -938 -487 35477 46111 38676 15648
15557 15648 -17317 -13603 1785 -4801 -22420 -36711 -14550 7509 22688 25841 39192 17278
15545 17278 6286 11958 11789 22243 35592 20273 19313 24401 9939 -7623 -10513 -5785 17334
15532 17334 9032 5774 18787 7410 22765 27127 20656 26325 22693 46565 41855 34309 43115
15519 43115 39358 35697 18036 15398 13556 17649 13774 3245 -11653 24848 43919 33957 31273
15506 31273 27786 29294 29101 33118 39109 52075 26071 -9116 -33434 -24603 5 -4460 -2885
15493 -2885 11201 28863 9734 1001 3879 -4004 14418 18355 9917 -8937 -9303 -11562 -25704
15480 -25704 3124 37751 37038 39262 42470 40670 -1285 8118 37052 37952 41768 49908 35388 42860
15466 42860 56031 50864 46580 20322 -1177 -9147 -10539 -11370 -31899 -31199 -29875 -11889 -1013
15453 -1013 -341 8245 6438 -3446 14901 13759 -7560 11511 15623 1182 20308 23214 27537 34205
15439 34205 15604 24668 17046 -11792 -30259 -9946 -2529 14256 19591 1326 24410 23656 -10308
15426 -10308 27828 50902 68784 53516 47374 34591 29532 11849 5108 21918 10596 -2761
15414 -2761 -9190 -10380 -6218 14804 23057 -8733 -46534 -35394 -2553 11836 -2722 -24091 -15197
15401 -15197 -7277 -15921 -12174 -21470 236 46211 33448 34770 47654 46619 71129 55618 39544
15388 39544 40984 20773 19031 17948 -912 -11282 -22583 -56235 -70424 -55619 -20868 -15633
15376 -15633 -28196 -13539 -23690 -18091 -51512 -51868 -37534 -37119 -32280 -12097 14270 12131 -1725
15363 -1725 -5309 -10220 4142 22422 27970 13789 6459 9144 11408 38767 24050 17437 7573
15350 7573 9123 -11706 3939 18668 7773 -21824 -33720 -27172 -12068 2583 15578 36554
15338 36554 34500 6144 -31817 -33617 -21108 19786 35518 48729 49972 33199 15752 -23475
15326 -23475 -41757 -33290 -27171 -23508 -14722 -35870 -21647 -3877 14085 14347 8703 29238 33261
15313 33261 28417 13395 3321 -28061 -25045 -12427 -5528 23256 38113 15127 7256 24894
15301 24894 37375 15961 13474 47608 38826 26917 48235 24253 14748 -3694 -26791 -29608
15289 -29608 -26597 -24210 -1311 27784 37549 37340 12742 -5482 3348 23136 40095 41256 31324
15276 31324 29863 42954 60366 58120 24324 -5000 -3973 -813 13884 16901 12626 -15317 -19182
15263 -19182 -24787 -35961 -19121 -10751 570 25548 4517 -19760 -25885 -21412 -25804 -19598 -33997
15250 -33997 -56503 -46187 -23627 -5027 -15896 -24868 -39790 -10004 27455 34498 28558 36512
15238 36512 14232 -22309 -8759 -15764 -29901 -55867 -45605 -37239 -28510 -23259 -4427 -5058 1529
15225 1529 26934 53180 64671 54421 51201 15304 -3224 -17060 -28965 -25991 -5252 -2457
15213 -2457 -3453 -15683 -11096 -5487 -13446 6726 23386 20936 -17728 -47666 -40109 -30561 -22060 -17175
15199 -17175 -17949 -16556 -6600 3549 -7198 9627 16193 -9314 -21393 11655 14266 7050 10138
15186 10138 4323 5009 17146 30746 19559 29752 29517 22347 48734 53024 1192 -1341 -1022 9147
15172 9147 -2283 -7063 -15689 -10613 -2628 14958 28911 31816 32121 22806 10588 5407 23309 24303
15158 24303 26390 17781 5140 5908 9144 21211 24411 15236 -10049 -22791 370 12087 660
15145 660 -13706 -16455 -5522 24986 34022 41984 36174 41748 49925 52555 11175 15963 32251 -12389
15131 -12389 -30218 -9924 12419 36394 32301 22479 -11347 -41964 -24810 5748 13538 16517
15119 16517 12436 -2178 16653 19191 -14559 -12378 12070 1656 31206 26524 20726 22179 11268
15106 11268 5576 2685 6630 -8819 -5752 -1590 -13799 -2971 -5539 -2509 -32331 -46359 -42243
15093 -42243 -6048 -10468 519 25725 39213 24173 11883 19196 18683 18367 13075 -13108 -34910
15080 -34910 -39807 -34490 -32918 -19457 20594 19848 18674 30129 34210 39852 65593 56023 38014
15067 38014 38774 41940 19595 -18980 -17531 14637 16607 14292 35256 41397 64745 89990 93927
15054 93927 64633 56487 64421 45062 43310 22402 -7736 -18108 -13280 -22411 -27031 -5575 -39447
15041 -39447 -17149 24252 34501 42005 41343 20023 6256 10619 31591 21565 5176 -12246
15029 -12246 -14172 152 -5129 14540 16157 26291 23350 -2305 -2016 -14167 -6694 1294 -5309
15016 -5309 -20606 -30028 -27960 -5778 -16649 -25647 -22325 -15684 1935 31014 49367 47979 28440
15003 28440 9460 -4938 -2666 6811 13043 11680 11029 14563 16303 16639 -18560 -40544 -42377 -15637
14989 -15637 21749 26321 9878 -1808 -26529 -18593 6882 19493 9755 7327 2696 -1358 25009
14976 25009 32427 21469 15982 1047 14399 -7130 -14522 -12263 -5440 13695 20098 15958 15329
14963 15329 9458 -1412 -4656 -8511 -6251 4433 1820 1653 -1581 -5188 -11645 -29192 -27909 -14661
14949 -14661 -11715 -9269 3237 -38575 -63547 -44927 -11121 14389 10179 6355 -16934 -24276 -27887
14936 -27887 -14063 13745 13041 -10447 2044 -2797 7124 6580 9662 -388 15586 22782 9478
14923 9478 11742 12874 27557 38598 20453 -3609 15654 11035 -18991 -20403 -17869 -39066 -25612
14910 -25612 -10114 -9478 568 18139 -11887 -11755 -17773 3241 -14541 -38691 -39895 -23963 -5873
14897 -5873 -11186 -31812 -32098 -6879 -24801 -43332 -13397 -6975 9847 28211 37426 39138 64665
14884 64665 65092 41623 13867 7853 -5971 -7262 10067 35027 22552 -13041 -9352 -2180 -4409
14871 -4409 -5283 -32916 -37214 -32336 -39525 -61943 -72422 -62133 -26422 -16993 -10219 11016 14749
14858 14749 28989 26012 22173 6035 20340 18757 12977 6056 -6781 -4871 -4363 -5438 -15358 -17849
14844 -17849 -22235 -39769 -53869 -51838 -9295 -1953 9359 16008 22078 11544 13241 45980 44434
14831 44434 24760 24519 4331 -8749 -4221 -20012 -38494 -20117 -4619 2507 -14982 -15354 -1848
14818 -1848 25900 15905 238 -8502 -27206 -12859 -14223 -26456 -24755 -23198 -517 4857 14884
14805 14884 26013 -7725 -23611 -17771 -2737 -810 -8694 -16 -17252 -8771 13551 2227 30252
14792 30252 49019 39978 48790 25559 22509 2973 -3207 -35894 -16397 28183 53526 50608 14793
14779 14793 942 20667 17762 -18919 -9870 1735 5210 34102 40098 21797 9652 -8521
14767 -8521 -23365 -2350 6319 10505 13781 15733 10006 34880 35880 -1996 -12522 -5661 -12113
14754 -12113 -11705 -5339 9996 9510 9354 -245 -1645 -6887 4501 13550 -5990 -19605 -4067 29720
14740 29720 19865 10965 32537 24803 56794 55976 40537 52382 40575 19852 27560 31660 7981
14727 7981 26825 55202 73227 47358 25313 11970 3538 3346 1797 13097 30949 16025 -16854
14714 -16854 -10321 -23199 -29018 23102 19453 20303 33914 39951 27918 15452 18896 -9344 -7659
14701 -7659 -10237 -9676 -6599 7998 24363 27033 38225 55278 47720 32166 -9912 -53438 -45065
14688 -45065 -53831 -32155 -10038 -5466 -36209 -31635 7756 12470 -10829 -25441 -1305 14116
14676 14116 11080 -6370 -12065 -12446 -1493 15082 33698 37476 32438 18597 31920 40047 -6371
14663 -6371 -26546 10622 32398 -7869 -12672 -46123 -58591 -19217 19314 18060 9711 -4642
14651 -4642 -16496 -26683 -33195 -49328 -40577 -28572 -32627 -39983 -32942 -11208 18042 31448 8677
14638 8677 -16299 -28080 -26191 -24472 -15348 -11650 -12488 -10883 -7559 -11007 -1990 -14125 -12045 -8454
14624 -8454 -21241 -18136 4408 18808 36653 57232 50199 55178 5788 -13806 -29922 -29280 -12366
14611 -12366 -14271 -30515 -43021 -31853 -32392 -30180 -15525 3306 255 6289 3698 -3908 -24460
14598 -24460 -26505 -8358 25667 3106 7658 19278 1140 2192 11241 16749 -6509 -4965 4310
14585 4310 6588 -213 -23676 -17497 26804 47414 53888 54005 37834 11815 6569 4982 889 10024
14571 10024 2325 235 10597 16344 32236 24609 12962 27699 17036 -2838 -18588 -4530
14559 -4530 -2880 -9921 -20756 -36954 -32762 -22596 -14266 12736 27238 3096 -20468 -9431 -13037
14546 -13037 -46949 -55209 -12514 26267 33121 7766 -22803 -49340 -49233 -26146 -11504 -15713 -3822
14533 -3822 -8758 -20820 -28919 -23457 -18934 -3426 19252 28443 2544 -37298 -32948 -41664 -24718
14520 -24718 -22407 -42012 -18620 -5510 -12707 -13218 -1551 4994 32022 40350 15912 3663 1948
14507 1948 5278 6832 -19893 -34399 -3324 1870 -19331 -37199 -27873 -19062 9578 6622 -13579
14494 -13579 -30118 -17800 -3916 -15512 -19027 25327 11067 -23741 -32289 -44573 -39717 -22834
14482 -22834 959 -12265 -37520 -9214 12430 -17263 -4097 8473 -3591 -9236 53 10444
14470 10444 24877 -37219 -38114 -11788 -19921 -8400 28751 33637 24315 4427 12404 34208 19602
14457 19602 3685 -9834 -1461 -10786 -8908 5587 29258 6514 -12264 -31633 -25329 -23008 -3242
14444 -3242 6172 -9172 -10767 -13213 -20603 -4550 6678 7083 21256 25157 31945 14351 1469
14431 1469 -9739 10752 33925 47500 57039 42430 23217 -9989 -10734 -21362 -19878 -33675 -52843
14418 -52843 -55282 -49600 -59966 -58764 -46443 -54648 -32204 11548 -5208 580 44452 60387 62211
14405 62211 67545 6920 -5427 28983 21339 16595 9973 5285 4429 7564 18398 11634 -8050
14392 -8050 -23771 -40311 -31767 -26747 -17943 -8921 15590 9676 -17641 -29786 -24117 -33160 -22548
14379 -22548 -8479 -12838 -11419 -2474 -8116 -27642 -10027 706 4215 21196 9542 -892 -23034
14366 -23034 -44092 -49676 -26850 -4692 18611 21127 30890 30389 50596 68961 57350 32520 32784
14353 32784 44072 57171 61333 54665 56397 48335 43905 26622 9674 13171 4567 -6122 9954
14340 9954 -2223 -20094 -34634 -50807 -49106 -15211 -3201 -11571 -29260 -30999 -19569 -3928
14328 -3928 11534 -974 -20084 -26888 -59692 -66093 -44003 -34350 -27512 -10025 20532 17705 157
14315 157 -4604 -5768 -32120 -21632 -13863 -27537 -30487 -16680 -6216 13596 26875 5642 23128
14302 23128 10943 1913 3245 -2698 -12218 -1368 -2684 6247 6237 12023 23920 -4255 -28209 -59410
14288 -59410 -62170 -41688 -22442 -14495 -7510 21847 9227 1806 16615 27045 56309 66315
14276 66315 45942 45469 20844 -209 5523 -11005 -18018 -26419 2268 33032 19554 5411 23129
14263 23129 47024 17798 -4134 -10147 5527 56776 38346 16264 25330 18556 13795 23296 26170
14250 26170 35057 27863 19415 5767 14026 14651 27372 29607 3609 -14918 -2578 27555 30966
14237 30966 15836 19778 12379 14882 15631 371 -22299 -29246 -13712 -6928 4755 4699 -16161 -32680
14223 -32680 -65516 -65196 -18857 -20156 -21122 -30122 -24393 -47513 -44175 -37140 -32689 -33092 -34420 -42188
14209 -42188 -6123 150 -24533 -10211 -2272 -4725 -15027 -10311 9568 17564 30283 49633 63068
14196 63068 53967 10192 973 43308 52776 31150 26368 18416 -7411 -12926 719 -15804 -5762
14183 -5762 -2612 18682 3287 -14800 -37988 -57788 -20674 22961 11057 -5047 -5275 -306 31358
14170 31358 19208 -3180 -30590 -9490 8293 3021 -22620 -15264 250 6036 9025 15991 18850
14157 18850 20918 32622 42481 30623 9523 18773 27522 32192 43714 25611 14703 -2347 -4891
14144 -4891 27008 29360 22195 21016 -19672 -43489 -56463 -87511 -80577 -39979 -3885 -17733 -21183
14131 -21183 2968 5182 13324 20338 25004 45266 42980 19314 -20127 -20794 -23739 -7242 17815
14118 17815 27265 33463 29034 34338 32085 23162 16384 13682 7559 15249 14839 8321 3812 11793 16048
14103 16048 28696 9702 3417 -200 -1610 17729 38998 38454 40312 20160 -1604 -15300 -18318
14090 -18318 -24982 -4007 9191 13541 -3047 -22113 -45803 -40413 -19534 -7642 -9087 -26143
14078 -26143 -39142 -30577 -24304 13705 22695 37770 41636 50241 22481 8495 11337 10308 18053
14065 18053 19412 29463 -13392 -7753 29000 51641 35827 -1896 4410 5577 7886 -11763 -34039
14052 -34039 -46621 -46034 -48384 -29407 -23658 -21113 -979 29786 19411 11551 -2419 -1787 13932
14039 13932 20733 33803 22801 3588 -5663 -8418 -16018 8358 35881 13988 605 20336
14027 20336 12855 -21317 -20755 -29689 -30538 -16941 4096 12806 21951 16581 3284 2807 15511 36102
14013 36102 9358 -10852 -22953 -35131 -40959 -45323 -33943 -32481 -30142 -20436 -2052 -17360 -45848
14000 -45848 -47624 -19907 -20813 -18386 -39937 -32694 -16673 -25802 -28144 -37013 -31266 -285 -9177 -1699
13986 -1699 11793 10392 6864 9970 24704 14755 16830 22311 6582 -23255 -58373 -26856 2182
13973 2182 6649 10402 -7424 -30845 -37127 -19748 -27337 -19483 -13126 -14013 -24806 -40953 -57223
13960 -57223 -43073 -51245 -47548 -38337 2221 4153 -21943 -50347 -44299 -13596 14152 9739 -7946
13947 -7946 -14535 -20233 -29379 -25454 12074 23722 9514 11212 22355 20338 5796 14146 21855
13934 21855 37339 42962 27252 13778 4594 -22977 -36384 -17841 -6016 -1542 6477 15195 -18540
13921 -18540 -23537 -7399 3386 -5260 -42895 -30189 -2846 7816 15789 33028 35144 14254
13909 14254 7197 -1852 7813 5164 7569 8571 7466 5345 18282 23117 17189 26946 12260 -4638
13895 -4638 -30734 -43801 -16400 -25216 -27348 -15128 -13108 -25391 -26730 -10966 5832 12767 12787
13882 12787 12625 12069 350 2229 2957 7074 4910 3973 16234 5852 9481 12793 -2811 -9404
13868 -9404 12748 21422 -7120 -41038 -37025 -14015 18649 30689 33416 20594 32292 41893 39733
13855 39733 10640 -26664 -32002 -22384 -7995 11752 17395 -20105 -51358 -13107 -2696 -12017
13843 -12017 -25358 -35275 -46087 -50155 -40755 -37740 -20085 -6639 -8479 4159 34000 52186 46562
13830 46562 18485 1307 9436 6008 -5282 -15319 -38549 -25345 -18405 -35011 -42027 -60115
13818 -60115 -31516 -18128 -12700 8876 31411 35298 43341 37379 18650 48015 62791 59883 42231
13805 42231 10955 9645 13904 4476 2462 6887 13832 31605 53473 60443 19730 -18266 -24092
13792 -24092 -10940 -4967 16852 28096 8351 -5866 -7485 -14442 -2785 1407 -2099 -9477 -26730
13779 -26730 -42014 -22009 16828 17882 27006 4296 6447 679 11972 9390 8003 -8390 -19214
13766 -19214 -27435 -15367 -12661 11955 32738 26420 30573 33295 30680 35093 16031 -10005 -20660
13753 -20660 -13018 -26627 -6919 -19099 -32912 -21884 9692 19269 5341 16066 35324 16798
13741 16798 3922 3478 7569 23201 22109 9074 -2877 5478 11381 6340 2683 20895 18651
13728 18651 29709 18076 4086 -7155 11083 35011 27278 26891 29720 15222 11487 3192 28284
13715 28284 8953 -12294 -23105 -42032 -15503 4554 15008 10623 11218 9998 17667 13153 314
13702 314 -2695 -23410 -12861 -12259 -10612 8066 27242 4467 4880 40793 44500 22388 1574
13689 1574 -19874 -24259 -7077 -8029 -7307 -14395 -6931 3172 -24156 -32407 -38442 -37156 -44525 -41677
13675 -41677 -20035 -37655 -54860 -58505 -65037 -64006 -60356 -46921 -38805 -41408 -29001 -31443 -37833
13662 -37833 -22129 -14432 9 4684 -700 -2510 -1954 -13259 7052 18385 3032 -7252 -8205
13649 -8205 -14720 -29291 -42620 -39391 14 14391 18577 18776 21914 -3878 -27356 -21570 -829
13636 -829 -8227 -34099 -15799 2054 24049 36272 15706 -27104 -18121 2079 4138 -2857 -5842
13623 -5842 -2227 -8334 -12667 -19543 -44282 -34069 -26144 -24508 -20307 -42742 -33528 -7276 -2107 -14104
13609 -14104 257 12730 -161 -9611 -3947 6945 -4146 -7308 -19947 -5128 -7865 -27889
13597 -27889 -42464 -28585 -24992 -20091 -23828 -6957 373 -1958 -24404 -30304 -7610 -29024 -45927
13584 -45927 -51924 -54640 -56739 -24865 1456 15555 8396 -9715 -28902 -12452 -7146 -38391 -30395
13571 -30395 -47667 -50005 -39404 -11644 16342 18633 17095 -2456 8798 7878 3570 -14832 -9554
13558 -9554 -36689 -61525 -71695 -56877 -35430 692 -19864 -16607 5845 -1365 8219 5663 -2108
13545 -2108 -13064 -1610 -7250 -14076 6685 1812 -4692 2568 19006 10050 -14000 27587 37108
13532 37108 28252 -5718 -15198 16475 -14753 -26217 -12001 10425 28331 30801 23197 26743 28600
13519 28600 27919 13765 -11123 30369 46972 19505 355 18101 47147 47136 16426 -14616 -13602
13506 -13602 14271 19602 -6700 -2817 16279 13520 20591 20763 8360 6552 7451 -1821 -9961 10330
13492 10330 3609 -6409 -5022 1973 18301 24072 4293 4600 20233 17042 27090 -14041 -54643
13479 -54643 -55659 -48199 -7583 21349 5028 6139 36066 62623 68907 56343 33723 14270
13467 14270 23146 4757 -22600 -33166 -6649 -22078 -30584 -22029 -14220 4546 -17767 -20566 -49355
13454 -49355 -66928 -83187 -48576 13254 14791 -27387 -26938 -33755 -19390 -10892 -24387 -24191 -40353
13441 -40353 -33267 -31870 -50384 -68038 -38328 -36734 -21006 -7293 -13443 -22525 -298 5671 -9066
13428 -9066 -1452 20751 19796 -9979 -9558 12871 35915 44141 44619 33072 34095 29029 31145 295
13414 295 -21753 -4804 6213 -13537 -18372 -38068 -42303 -32307 -49008 -57793 -49970 -21124 -12558
13401 -12558 2303 -4582 4209 15782 10037 -7460 -22249 -44856 -42813 -55714 -56767 -58522 -55851
13388 -55851 -54804 -41003 -9229 -28892 -41830 -29895 -17401 -17631 -35356 -45825 -51511 -65138
13376 -65138 -53716 -32507 -36590 -16468 -23217 -8022 -27035 -44907 -44067 -38602 -18908 5908 99
13363 99 4695 20175 17748 30957 28630 3152 5705 1086 -9275 -24972 -8129 7583 -9038
13350 -9038 -30885 -10600 30655 24168 -3505 2401 -6199 -3701 -447 -5583 7228 26272 15003
13337 15003 7827 -1992 -8238 13498 10427 -1639 -29450 -11447 22765 12308 5543 4004 11742
13324 11742 -11957 -42690 -40099 -28318 -9748 10098 19856 10037 -20068 -9317 15505 36080
13312 36080 31461 12175 17680 -5231 -671 40882 44744 18742 23002 22047 16136 25158 30399 29866
13298 29866 16189 4821 -11226 -1421 6078 -3026 -2233 22579 42498 59084 45082 26209 24957
13285 24957 47223 26905 32136 41695 42970 50661 36910 11617 8243 1313 -5232 -193 -2230
13272 -2230 -19435 -23951 6963 26175 -5381 -27650 -10968 -3747 -8805 -7122 -36 -6370 -19983
13259 -19983 -25306 -26244 -18341 -15094 -6666 17656 39959 23318 30196 25824 23480 14839 27972 22407
13245 22407 11132 -8940 -10877 -15261 -12567 -27747 -3223 6132 -19904 -32146 3084 -14695
13233 -14695 -21138 -14822 -7344 5299 24433 36954 23666 15124 25295 10262 -15950 -17761 3459
13220 3459 12023 8284 18769 19799 -558 -20433 -17797 -17966 -43834 -48147 -53725 -25055 15179
13207 15179 14158 4766 30293 46495 33006 24924 24680 29163 11059 11396 -2625 -18374 -20836
13194 -20836 9443 20245 22296 -13496 -34063 -58245 -36149 -27779 -48341 -25159 2097 21475
13182 21475 16291 -5188 -7864 -7363 -1177 6719 -10471 -24945 -16334 -19854 -19085 10353 -27033 -42619
13168 -42619 -34649 -50652 -52707 -44074 -12223 -14628 1748 7133 3296 9599 -8391 -18744 -13842
13155 -13842 -9538 -16711 -13104 854 23641 22885 13746 -2815 -4985 -14645 -12508 -20264 -15801 8149
13141 8149 -170 -14896 -8521 -15603 -28 117 3946 -22572 -18166 -8277 -27446 -39902 -52116
13128 -52116 -36743 -27519 -20795 -9505 -38921 -46149 -32633 -37084 -14918 5253 -21545 -27315 -8159
13115 -8159 -5432 -4173 -8803 -16206 -18661 -4546 5708 -4761 -11067 -1867 6404 4802 -9077 -14714
13101 -14714 -13847 -5333 7297 20389 19055 -2939 -35524 -4746 29640 34579 52244 46308 20779
13088 20779 -9404 -5478 -15106 -25590 -8186 22514 26233 13084 -5174 14132 20902 24824 -4614
13075 -4614 -23918 -19967 -41428 -35111 -26946 -52144 -53292 -54125 -45615 -37636 -43127 -53937 -30291 -23416
13061 -23416 -27062 -20242 -20036 -34572 -59922 -77757 -60883 -27762 -11849 -40272 -41702 -37996 -46604
13048 -46604 -17323 -9257 -15354 12617 10130 8621 10912 -22544 -30116 275 -6164 -29932 -28489
13035 -28489 -22572 -43022 -40754 -23780 4937 14162 7874 17642 25337 12045 7853 -3139 -6303
13022 -6303 -2082 -15336 -33426 -28158 -16889 -14416 -9695 -34121 -25812 -15090 -22025 -33550 -46661
13009 -46661 -19995 -4439 -3781 2180 10358 -9661 -7070 -33659 -45797 -13664 -4795 -12232 -301
12996 -301 2693 13358 4472 2651 2578 949 -7366 -6730 13896 28246 9686 28944 14789 -14941
12982 -14941 -28000 -6244 -10145 -11091 2273 18502 18815 15371 -4564 12678 16952 -7622 -4859
12969 -4859 -4496 2122 -6085 -17809 -10796 -378 -18838 -18238 -3046 -17832 -23923 -23683 -17835 -17375
12955 -17375 -26867 -22403 -16002 -13867 -22967 -13520 8212 36282 34379 4106 29717 28774 18499
12942 18499 1413 -3818 -3793 -9914 -36303 -18174 9044 15957 -23501 -45837 -25167 -10468 -9684
12929 -9684 -6418 -7486 4445 18320 5608 6214 28817 24764 12587 20387 12747 9551 57865
12916 57865 73709 91553 87007 67424 51759 49383 43505 20317 23191 10947 9514 -11037 -37818
12903 -37818 -16945 -6471 -20959 -33664 -32480 -22144 8714 17798 13797 -4360 -1563 -8205 10323
12890 10323 41929 30269 26538 21835 9407 -19943 -36696 -43680 -44887 -50129 -22891 -574 -14108
12877 -14108 -30311 -27432 -2360 12018 4279 -29366 -51165 -15139 10344 16495 19826 -4549
12865 -4549 3750 19659 46673 47013 33805 14485 18687 31666 19319 20148 18660 18681 12227 8391
12851 8391 -2289 20801 40112 9650 -26260 -17773 24783 55639 78630 121300 125431 94879
12839 94879 50676 28065 12479 12658 23658 15941 -4378 22819 31810 16822 13901 17553 -6329
12826 -6329 6515 32737 20934 24524 9392 -31080 -2039 26485 23451 45752 48228 21493
12814 21493 23149 1426 -29219 -25242 -20973 -6616 8546 -8121 -37315 -28849 11608 16902 12067
12801 12067 -3809 -512 -6714 -10395 -7812 -3235 -11615 -8720 -117 -16433 -20744 -34170 -47049
12788 -47049 -63937 -60942 -44579 -44872 -21680 -25440 -22990 -9803 -22198 -39323 -24863 -11436 -4565
12775 -4565 17640 8640 -1867 -4551 6024 -12052 4644 29239 23354 11934 -830 -16494
12763 -16494 -36266 -39592 -56976 -46938 -56568 -42251 12892 43813 48490 16916 -15067 -26466
12751 -26466 -26843 -26449 -3757 5119 1269 -13203 -22045 3503 5320 -12207 -31593 -66194 -62680
12738 -62680 -16639 11105 8752 808 -21652 -35876 -34573 -30995 -41349 -24931 -30847 -23652 8029
12725 8029 -15094 -34156 -13372 -7410 -13768 -7177 -25722 -51081 -31728 -14163 -1439 17672
12713 17672 1885 -11846 11787 11752 -33987 -31609 -3499 -5411 -35584 -23787 -12736 -12303 -10016
12700 -10016 -16435 -31132 -1978 -21596 -54101 -61353 -22336 -5557 1299 -6629 -35204 -58651
12688 -58651 -39741 -25149 -12573 -16480 -40062 -49189 -30912 -3800 952 1057 -11410 -26068 -18454
12675 -18454 -15410 -882 24252 18829 2548 -9313 -2237 -25477 -37779 -16 4536 13269 -2615
12662 -2615 -1275 7819 18185 25078 27753 -16113 -45499 -33350 -20866 7257 -6581 7356 20497
12649 20497 13069 7037 20231 8291 562 13235 40156 28753 9907 -6039 -23566 -47783
12637 -47783 -60395 -44252 -15775 6155 -8691 -14265 -29570 -5538 6441 7607 -23637 -46296
12625 -46296 -43106 -40331 -46599 -53224 -78291 -58014 -54897 -37370 -22289 -16748 22309 10123 6211
12612 6211 8511 -10250 -12165 -8462 -2320 12199 34378 14880 -7995 -38296 -38623 -10969 -17148
12599 -17148 -41378 -49366 -28160 -8407 38292 46337 36421 22610 -10451 -35157 -12061 7111
12587 7111 -16037 -37909 -7135 18272 -9228 -64881 -52078 -33095 -48286 -26823 -25598 -12130
12575 -12130 34968 54634 38812 -1154 -21644 -7653 -354 37641 37550 32335 39115 45343 39093
12562 39093 42562 65852 99823 90522 57409 22245 943 -18718 -15474 -15937 -23481 3805 7576
12549 7576 4969 8106 16654 16348 16543 13506 -1320 20590 18913 -9905 -16339 -7510 21272 30484
12535 30484 14737 12076 -10987 -51003 -70486 -53800 -33254 -35070 -33120 -23396 -21213 -11091 18098
12522 18098 18165 13606 830 1084 -10831 -29995 -17823 16291 21232 -19683 -19420 -45986 -43941 -29903
12508 -29903 -30431 -18729 1330 17398 567 -11875 -24388 -24706 -6365 13084 27737 14110
12496 14110 -8858 -6061 6365 27030 36669 35088 31227 50113 46412 39260 12957 17496 -9021
12483 -9021 -29477 5400 15859 18562 29980 27779 22985 784 -22293 -8189 -22138 -37905
12471 -37905 -27664 1789 17073 16476 27068 25862 10031 4181 -7782 -10836 -1602 -16364 -49501
12458 -49501 -21973 15087 22141 27684 19189 12627 -13142 -42319 -17269 20297 36198 5530
12446 5530 -19837 -29438 6732 16584 -5274 -8729 -13513 -27308 -59503 -72203 -77700 -52473 -33569
12433 -33569 -23258 -905 4547 1098 1081 15300 8462 -11661 -4260 2792 14199 15845 23368 -11627
12419 -11627 -966 15576 7175 -7506 -41976 -57002 -43160 -37581 -35340 -40619 -15300 -20609 -6265
12406 -6265 5129 143 -2149 -11648 -36391 -46734 -37021 -6118 19327 32336 35698 15951 -538
12393 -538 -18085 -8219 -9131 -32121 -53170 -25928 -11552 19194 10300 -13452 -6437 5008 10791
12380 10791 15079 -5298 -25921 -20629 -10000 8578 -7666 -25952 -16777 -8355 -13291 -16614 -9992
12367 -9992 -1638 25108 37570 36060 21825 9122 -709 26442 38705 34543 983 -19877 -20950
12354 -20950 -11511 -11556 -33774 -22086 -1428 -5020 9657 768 -25972 -40231 -29396 -25424 -15685
12341 -15685 707 13777 7534 18709 8162 11214 -7062 -16706 -7124 982 -7670 -35180 -57421
12328 -57421 -53148 -26164 -17052 -33386 -43274 -27452 7446 30112 15685 -6367 -12539 -4333 -17161
12315 -17161 -34002 -41167 -54396 -37705 -11837 -23958 -36010 -39072 -16925 -427 6203 29182
12303 29182 37677 32584 28555 16562 -9846 -19029 -20892 -39672 -54668 -60952 -74080 -49642 -37480
12290 -37480 -28156 7167 20527 31337 17548 6845 -9678 -28941 -57056 -44804 -26444 -30712
12278 -30712 -13686 -16746 -8227 9410 -12430 -20636 -992 3848 4028 14244 22865 6127 18008
12265 18008 10539 5155 29716 17031 -4489 -14568 6392 12466 51864 59212 17312 4137
12253 4137 -18840 -32677 -7504 -15328 -8827 -10509 -40964 -34759 -47201 -17625 -20559 -47393 -33079
12240 -33079 14163 12682 -15463 -14009 -24897 -19036 535 25962 -477 -16789 -17280 757 -9026
12227 -9026 -13546 -22462 -11807 -13403 -20311 -3095 20373 6284 -9009 -26459 -33996 -42517 -12106
12214 -12106 -2486 -33135 -32970 -15026 -15083 -3098 2767 -470 -4648 8961 408 -7843 -25496 -9838
12200 -9838 -30770 -38574 -36440 -29279 -210 -9190 15620 19959 2138 -595 607 8286 41611
12187 41611 31398 -14866 -17555 -3665 -8932 -3994 -3217 -4557 -6694 -374 -5825 -14132 -14524 -7167
12173 -7167 -6216 -10483 -13171 -32766 -21737 -3041 -11400 -13264 16880 38884 21196 30985 22174
12160 22174 -2219 -32003 -28829 -34512 -37825 -17630 13516 -2814 -24407 -20172 -23507 -35207 -19177
12147 -19177 -3904 -15981 -16402 -25414 -27086 -32339 -64287 -47497 -26274 -8582 10093 7841 -19450
12134 -19450 -43767 -71249 -61321 -21643 -26919 -13518 3595 8356 3272 -4104 -17740 4158 26439
12121 26439 18909 2122 5870 10153 -10916 -52246 -41400 -10014 2210 5232 14232 -27866 -32808
12108 -32808 -20758 -48460 -54911 -55304 -58932 -33210 -24746 -18418 -8793 -17085 -44189 -52356 -48527 -20416
12094 -20416 -3057 -15988 -44555 -50566 -58883 -66725 -27865 -20574 -37944 -21696 -12743 -31792 -37875
12081 -37875 -48298 -34282 -23239 -24674 -8247 -16044 -7726 2297 384 -11212 -8587 -10428 19158
12068 19158 32528 -4710 -27026 -22833 -10311 -10496 -20515 3533 -3662 11591 20398 7999 3357
12055 3357 -11846 -20708 -18307 4746 -5291 -22909 -5528 -4864 4953 18779 -662 -20673 -44236
12042 -44236 -42192 -35672 -28841 -4270 -7672 -29113 -37437 -54898 -51422 -29343 -26545 -34272 -17450
12029 -17450 -24719 -8320 763 -9749 -18636 -17467 16299 45664 26141 -10675 -29099 -17203
12017 -17203 -28053 -30467 -24757 -7628 7812 -6759 -2316 756 -30691 -49621 -28155 -49398
12005 -49398 -85220 -91472 -72823 -40453 -12943 1606 5447 -1956 8400 5529 -9215 3407
11993 3407 19589 4014 -15911 491 -23105 -61500 -51849 -13255 14462 10315 6810 5919 36228
11980 36228 44869 40345 42896 48650 62648 53242 49914 48421 21343 19932 21021 7696 6794 25361
11966 25361 34419 27589 5096 -18978 -39803 -18366 -922 -4797 -1419 -6099 -8235 -4958 1023
11953 1023 -20277 -38224 -32894 -13175 738 3605 -5529 -10540 -21575 -35498 -41815 -57872 -60370
11940 -60370 -41261 -44917 -41025 -44145 -64112 -50534 -16005 -30702 -37672 -54944 -61589 -45734 -29353
11927 -29353 -7711 -5631 -13734 -20373 1256 7871 4225 -14705 -20758 -27856 -11190 -25193 -41609
11914 -41609 -30814 -9408 3983 17309 46526 39281 25629 16370 -15134 -16565 44 385 -4446
11901 -4446 -767 -12168 -19739 -5865 -22400 -38374 -25210 -24709 -19959 -25398 1884 3862 -11160
11888 -11160 -22801 -36303 -46006 -33215 -55447 -45689 -3661 15672 10948 19303 15158 -1739 -23097
11875 -23097 -39795 -28752 -16910 -6847 2667 -4644 -16566 -8495 -3813 -9510 -17383 -33294 -21757
11862 -21757 -14647 -7313 -5862 2567 -14483 -11200 453 -11906 -17458 -36335 -42255 -49521 -17201
11849 -17201 4867 3331 11660 46392 47564 14019 -15894 -11206 27398 28393 488 7723 17855
11836 17855 23381 23305 -13991 -55457 -47737 -12899 -12469 -17925 -10359 13723 13928 5263 -17905 -9568
11822 -9568 -3394 -2160 -12362 -6827 230 7907 11374 22695 21359 19030 44911 40526 13435 7106
11808 7106 27618 16918 20909 32687 45603 29623 20881 6064 7763 -7033 -14379 -6565 -20078
11795 -20078 -17326 -18869 -21487 -32220 -41746 -47925 -29671 -18324 -25094 -27122 -10730 -33888 -48092
11782 -48092 -62343 -66123 -3164 42514 45071 29243 24404 19706 16006 22013 36456 48852 37973
11769 37973 11567 -10875 -1674 -171 19306 -1590 -15973 -4462 -191 -19315 -25792 -22438 -37133
11756 -37133 -40801 -31277 -13745 -35290 -52126 -36084 -18879 20285 32698 40357 32220 26274 28998
11743 28998 9835 5541 -5653 -21729 -47647 -41260 -26528 -28021 -2519 -22790 -60644 -71928
11731 -71928 -47709 -35903 -30565 -42994 -29782 -8919 -14744 1840 -16016 -31869 -43351 -17266
11719 -17266 4039 -37484 -47936 -39519 -34068 -17780 -1276 -13454 5186 27951 11663 -6152
11707 -6152 -5326 1367 -8727 -4498 -26879 -16938 -5120 7045 27860 51472 48255 17174 4915
11694 4915 -21609 -38182 -24376 -19968 -37581 -55216 -39717 -12798 -41470 -52835 -46269 -48376
11682 -48376 -35060 -26526 8949 6300 -19933 -40032 -36097 -38680 -40982 -45277 -32746 -23397 -30090
11669 -30090 -45279 -32169 -35471 -48960 2368 17269 -2135 -44322 -35750 -40996 -34342 -22163
11657 -22163 -18879 -21797 -3508 -389 -833 26272 19936 4827 -15078 -11887 -11522 8776 -4442
11644 -4442 -34747 -32345 10127 29218 23287 2321 -37629 -53847 -47709 -53378 -38337 -17764 -18428
11631 -18428 -34656 -45371 -32201 -21512 -10281 2430 7225 14432 -9090 -38780 -31407 3422
11619 3422 3274 -9211 -12006 -7681 -9841 -7296 -691 2758 -20094 -27111 -31250 -15451 -11369 4752
11605 4752 -19014 -19985 8845 31530 8494 -11278 -4166 6843 24704 13728 13385 16380 19978
11592 19978 13810 11884 25321 29114 32761 53959 31893 22750 31484 16313 -3082 -17735 -16131
11579 -16131 -18437 12102 66703 51353 27087 22809 18013 12141 15720 16753 -13390 -45968 -49146
11566 -49146 -20031 11694 26209 -5552 -38482 -19432 22225 20884 8923 -4498 -1316 6631
11554 6631 -6496 -11733 -22499 -5951 6367 6651 14304 33215 43021 48441 35349 33062 18405
11541 18405 -3381 -16009 -28529 -34726 -30406 -17991 -8139 -11161 -8795 -14777 -17408 -8633 -19329
11528 -19329 -49648 -37946 -3726 12990 -32456 -47557 -62095 -60742 -40384 -43881 -22501 -27231
11516 -27231 -54622 -44177 -9781 21962 6925 6594 4993 -1363 -140 4208 -17472 -6612 20383
11503 20383 31408 21031 149 -21377 -19471 -8250 -18519 -28795 -38936 -25897 14465 13497
11491 13497 2556 -12384 -34677 -24908 -12085 2963 24214 26322 23378 11771 3185 -7860
11479 -7860 9028 20452 -24776 -22603 -26632 14643 51429 17266 -23522 -26513 -9038 -3660 -18130
11466 -18130 -22424 -10269 6297 -30874 -31459 -33176 -33767 -10660 10412 -12483 -46922 -23405 -7463
11453 -7463 9768 151 -3405 23508 17880 28572 24777 -20280 -54622 -60863 -23597 20385 41128
11440 41128 38462 31119 -2404 -26456 -27433 -8041 -7831 7881 14865 24977 19319 3670 -41177
11427 -41177 -31980 -12694 3403 4047 -11190 -15958 735 -10738 -25370 -41288 -12216 4451
11415 4451 12893 10802 19916 -10380 -6786 -527 -3172 20044 9913 12124 -9801 -17611 15282
11402 15282 36308 36570 46108 47942 24704 27917 42623 30000 33505 45111 29006 -6961 -29746
11389 -29746 -34828 -23869 -10853 -14705 -32409 -51103 -31638 -21499 -12336 -16899 -15656 -23179 -13724
11376 -13724 -17458 -24367 -32772 -38853 -36568 -20761 -261 16232 25526 44188 22403 -5598 -7667
11363 -7667 -9700 23537 22651 -10007 -34369 -33878 -34978 -55818 -56591 -47968 -17390 -35803 -35482 -28784
11349 -28784 -26504 -34331 -29653 -12672 11943 33433 33966 23365 -2041 -19577 -18970 1446 10257
11336 10257 -5512 -10317 18844 35921 40340 44308 9997 -15596 -21515 -8574 -21004 -34741
11324 -34741 -16813 -9556 -36522 -27800 -20511 -42159 -18444 -27760 -38966 -30136 -38039 -17905 3783
11311 3783 -5629 -3202 -1575 -2980 -9063 -23371 -37960 -52251 -45209 -29752 -25269 -13256 20848
11298 20848 58862 85597 92140 66754 92990 94350 91809 109752 142921 164859 201239 215287
11286 215287 224112 230586 185227 124623 91852 42082 37870 62721 64096 29094 23140 35648
11274 35648 45620 41003 52176 48097 52394 49396 21753 13567 61717 58683 44615 29499 24125
11261 24125 17376 21854 61493 61477 62197 84696 91613 51538 54018 32722 22058 29098 36201 73174
11247 73174 55936 46369 24295 6624 6483 -7526 -24092 -8080 21069 19781 26953 18955 22367
11234 22367 35775 26761 23874 9976 964 17817 39688 17934 -564 51250 65776 47566
11222 47566 39355 39547 27020 13753 18891 -9616 -26009 -15229 4110 2773 16163 46773 28951
11209 28951 11650 25469 48889 26775 8905 22737 27585 19091 26661 33585 14570 1852
11197 1852 2002 2153 -8442 -25165 -47907 -42638 -12470 14551 -17115 -13648 25645 54214 64149
11184 64149 67582 69094 87286 99459 93571 97665 129344 143700 181715 203286 221326 258086
11172 258086 238507 213816 208586 208384 186044 139179 109011 73978 32474 32486 51879 47232 35394
11159 35394 40603 50361 53189 42657 29366 48978 36979 16470 30370 26257 13963 13561 -5878
11146 -5878 -15061 -14769 28549 36301 11490 3264 15913 27451 17021 22382 45725 50675 56890
11133 56890 50706 71555 80810 44854 31264 36158 26291 19343 17118 27260 25899 12361 16128
11120 16128 52673 71589 67316 45462 29833 31605 57256 60024 35962 22879 14981 3280
11108 3280 6726 8254 19805 53052 57477 48991 56243 68406 25270 -1223 -17881 -26712 -46348
11095 -46348 -36525 -19895 -22591 1513 13938 -14183 -23065 -34869 -34426 -35099 -41470 -28158 -15796
11082 -15796 4659 45349 61770 52837 34053 4039 -1218 -28999 -23249 -21446 -23147 -10243 17492
11069 17492 22636 30764 10546 -4405 25867 16591 16885 4847 -17974 -18159 -6005 5376 -13055
11056 -13055 -36341 -27835 1208 34175 36469 12886 11348 23566 20232 -73 3381 12994 2663
11043 2663 -20966 -22516 -36167 -27142 -8681 12931 27611 23345 10363 8476 21810 27399 6457
11030 6457 -1472 -7896 5649 -16293 -28681 -34541 -26853 -24650 -33435 -17564 -2043 27066 5449
11017 5449 -5555 15374 17495 2077 -16745 -16166 -19563 -23246 -18291 22575 28236 6030 8130
11004 8130 -5239 -37941 -36633 -580 6970 3648 15409 24132 43004 37404 20433 -19745 1290
10991 1290 16530 14744 15639 27112 48354 93316 86687 36446 34651 61632 73555 88737 94194
10978 94194 57308 44923 63167 116798 112280 101877 119038 107132 92553 81109 113223 118403
10966 118403 71473 70720 91413 94777 71570 65480 54677 43471 33768 64276 42725 -6166
10954 -6166 -10950 -1412 -12069 3573 2756 5711 18018 31925 27593 10703 -8712 -23634 -7709
10941 -7709 -9070 -29772 4726 40946 46911 49537 58622 57894 64985 32410 17480 22377 64815
10928 64815 62936 54644 32248 12912 16523 24086 20433 41662 47828 61085 36517 44334 50794
10915 50794 62419 48460 13374 18284 -2756 -7177 15747 14464 18907 28561 47203 64868 50102
10902 50102 22860 40357 85207 103682 84643 76016 63012 74502 100339 124640 134493 100388
10890 100388 97102 127295 121701 145688 134401 145802 123827 92695 78481 93390 123294 123278
10878 123278 118170 169653 209881 226713 279598 368648 432800 494988 551329 625272 718536 855154
10866 855154 983430 1122195 1301105 1506308 1751306 1988619 2144869 2202764 2304885 2480435
10856 2480435 2495010 2258942 1932802 1737898 1589790 1355678 1058639 821779 701248 599720
10846 599720 528685 489741 459117 450755 451169 446164 455183 433978 387198 369341 361536 351285 350333
10833 350333 345199 332321 303994 282968 295728 293810 297242 287103 292037 299949 299089 308676 289146
10820 289146 274985 293562 282962 294541 289567 259622 208879 172692 162124 182505 208520 226941
10808 226941 249950 238993 208239 179230 159952 165625 185015 179991 133695 108994 116081 111270
10796 111270 80539 62808 82335 110787 114589 83482 48722 31192 47157 68688 62347 65953
10784 65953 73030 51252 76730 76361 65062 58403 49334 61922 40602 57004 73109 84762 124967
10771 124967 136732 117635 86725 95929 73988 78694 108634 102119 64158 60835 68286 54329
10759 54329 48357 47264 35247 37139 65412 70708 47505 26163 33079 67355 63211 42215 65669
10746 65669 63623 66663 36291 28541 34332 57641 64509 76562 76129 37787 36846 62459 62803 95920
10732 95920 129427 135122 130107 163951 178045 186957 228207 261127 279629 289497 288571 302912 351875
10719 351875 385228 474146 549525 601793 644241 693941 711469 784340 818127 788961 763672
10708 763672 731375 704499 629585 590746 524301 451352 381547 332602 303499 258309 223759
10697 223759 167159 122146 115720 132102 143221 109853 69262 71503 85274 94166 98608 115617
10685 115617 109427 103207 95577 89559 103552 109441 103544 114438 168500 195564 194550 198863 201788
10672 201788 161131 151013 147621 127727 93774 62807 59602 64270 94744 125252 138225 147128
10660 147128 147341 151080 139638 135838 122600 125325 117674 112649 100706 88443 115180 138378 178666
10647 178666 178018 166200 182030 197347 178195 167993 170761 160699 134286 122146 89837 100406
10635 100406 108478 104353 127098 173602 177621 153553 114865 122562 130700 134865 137713 146389 153123
10622 153123 147284 168508 189431 192753 176912 191622 240458 281042 265951 295756 312652 276195
10610 276195 288131 315220 344857 350795 349046 354417 362526 376982 425470 476203 539334 553851
10598 553851 553324 558906 599002 675278 761939 867662 1018347 1177990 1363578 1524014 1757077
10587 1757077 1999376 2120845 2137445 2192212 2304541 2214787 1956012 1725228 1605832 1468516
10577 1468516 1235117 1035899 905706 841487 808748 782093 749525 707591 669065 643107 620787
10566 620787 613582 634130 629361 657653 681203 721254 769505 821011 889675 915446 954013 1028348
10554 1028348 1135128 1240417 1311689 1348400 1376266 1432401 1480303 1464959 1383409 1334728 1284636
10543 1284636 1260252 1176464 1104278 1099134 1098699 1086341 1089094 1097921 1100023 1110461 1142731 1153414
10531 1153414 1169580 1192479 1195481 1232004 1279752 1330500 1388177 1460150 1472822 1441466 1465062
10520 1465062 1526643 1592577 1609712 1614519 1662991 1737087 1791343 1863077 1941421 2001757 2059537
10509 2059537 2130111 2198016 2244842 2305850 2391574 2507441 2614919 2717376 2842802 2945356
10499 2945356 3040648 3151563 3237691 3350941 3463006 3589608 3767653 3970400 4204846 4456530
10489 4456530 4748355 5095201 5539390 6065820 6673361 7360937 8113956 8983897 10001859
10480 10001859 11201723 12642012 14322454 16175440 18443511 21433960 25349099 30346825
10472 30346825 36906216 45543038 56441954 69512693 84590179 101708359 120704855
10465 120704855 141351296 163375466 187142620 214318169 246990420 287115439 334696708
10458 334696708 377734248 397337864 408112927 431411729 455421620 439250560 384227362
10451 384227362 332184041 300327732 265305641 211668410 159038724 121801143 98442364
10444 98442364 83458757 73186659 65696228 59964143 55472527 51781704 48617671 46038443
10436 46038443 43920696 42089466 40614554 39560398 38759585 37974553 37347027 37051630 36953405
10427 36953405 36948563 37169008 37710105 38537396 39473178 40216283 40560841 40562842 40258714 39389200
10417 39389200 37654163 35346345 32958560 30657284 28317015 25976754 23887076 22123313
10409 22123313 20655119 19424721 18369184 17405704 16535276 15748942 14987408 14258277 13606890
10400 13606890 13005180 12409804 11836838 11321330 10873047 10395334 9912987 9501346 9130293
10391 9130293 8763132 8383899 8072927 7796710 7495779 7221057 6939659 6688338 6451382
10382 6451382 6223864 5998409 5800769 5566089 5334720 5142612 4966793 4736783 4523663
10373 4523663 4347329 4182776 4033831 3859014 3677469 3534848 3427049 3339155 3179635 3038965
10363 3038965 2946290 2847058 2685585 2598230 2529777 2426129 2338090 2254166 2190160 2142775 2075372
10352 2075372 1999232 1927620 1858934 1849173 1853189 1827288 1847428 1867188 1894678 1950001 2064352
10341 2064352 2185957 2328479 2470100 2623683 2789794 2994200 3234058 3479112 3657919
10332 3657919 3805332 3999631 4287101 4508749 4558773 4564845 4630316 4677444 4585741 4360711
10322 4360711 4126863 3903226 3632945 3357344 3118629 2957105 2828321 2746716 2793101 2910046
10312 2910046 3116057 3418682 3560456 3441106 3217051 3121241 3095736 2909907 2492529 2037443
10302 2037443 1693517 1461778 1321327 1242855 1181604 1120473 1084987 1087101 1102010 1119837 1112833
10291 1112833 1107901 1128486 1135647 1114323 1104674 1115976 1140267 1151161 1134282 1094226 1096164 1110088
10279 1110088 1109466 1115051 1110206 1103057 1098617 1093979 1108937 1172339 1170605 1187283 1201621 1226432 1262714
10266 1262714 1288628 1285884 1298017 1319278 1370538 1457410 1550052 1663781 1776862 1908078 2050551
10255 2050551 2188312 2363245 2550596 2734217 2958735 3223523 3512213 3750183 3862541
10246 3862541 3953840 4034033 4077202 3894255 3512414 3142846 2850585 2507049 2109685 1760604
10236 1760604 1496007 1333152 1201173 1097260 1063460 1019379 989322 962120 912698 907271 899400
10225 899400 880063 844634 800611 792956 791678 783464 779653 771343 758880 772967 770120 770336 754549
10212 754549 745621 753935 733675 685135 691412 713204 722103 707684 688771 664979 622114 606183
10200 606183 594848 556538 512277 472603 424211 399286 384066 346097 320791 317751 305591 285280
10188 285280 257487 244888 243098 245281 245535 258789 241169 240609 267093 259992 236721 234598 270776
10175 270776 258010 237783 231883 220526 212119 205032 216177 230218 231170 217804 216150 202026 185928
10162 185928 161169 169861 164094 161863 193271 212034 186721 193926 197528 191122 213625 212507 203359
10149 203359 203312 192169 192283 233250 232673 236811 237064 247921 240960 248182 248469 248258 228890 272906 303860
10134 303860 292883 263536 241538 233019 247930 256352 252835 264117 267009 248481 207980 210760
10122 210760 241944 254338 229739 220398 205085 222507 199153 181772 202557 187078 173610 158340
10110 158340 142007 154256 138735 112201 117314 136323 142538 154719 143840 133291 150931 151255
10098 151255 130420 119145 122196 129141 102556 91668 104238 151963 146727 123375 144247 161022
10086 161022 154907 148872 180164 216003 218431 206563 215493 209966 193181 185987 178158 211101 208216
10073 208216 214880 207576 209740 199270 169486 161810 172464 181967 208278 262046 295749 359285
10061 359285 439066 502801 586434 690848 815014 913892 1036502 1193074 1391886 1600850
10051 1600850 1841901 2058874 2189995 2240074 2333947 2461048 2400002 2132039 1839594 1658270
10041 1658270 1495565 1237073 947269 724724 593548 505815 458079 421912 382668 368345
10031 368345 340324 299214 284187 293737 293964 294633 296807 265222 223715 229571 210961 201533 216575
10018 216575 241992 257249 286595 303275 284058 267740 271460 259495 239573 207982 204803 227440
10006 227440 231030 211595 184146 182387 203439 202402 194706 204199 218921 217851 217873 206655 163985
9993 163985 127137 126969 135695 138999 140548 126252 134471 133104 111466 124967 135597 150599 117155
9980 117155 104686 125085 120774 88872 90840 83774 62734 74008 94867 100656 72708 73913 90310
9967 90310 117817 138747 128578 109325 83774 110660 132867 122823 107443 101802 87650 77626
9955 77626 90866 106052 115868 119299 122878 91550 96710 113326 106113 77358 89842 89595 82533
9942 82533 71967 78541 79160 51755 78211 95345 91643 101250 98808 120408 127903 98352 89738
9929 89738 115020 91817 64675 55468 53564 32764 30253 36546 25411 31585 40435 32659 49600
9916 49600 82336 79788 40823 24461 30755 28056 35024 54749 57971 68115 76607 69854 36399
9903 36399 17301 34853 40887 20281 25376 27573 48022 76686 76612 64936 68586 83590 92383
9890 92383 58605 58224 83365 90899 66325 39398 39915 23502 10066 15552 22506 35342 51393
9877 51393 52181 57972 59023 40077 34416 6690 -5884 -5623 10411 10954 20954 37912 45214 46267
9863 46267 33895 63753 81435 76445 93521 93579 90534 82886 65399 42755 55723 34015 42371
9850 42371 59781 62119 87315 96716 71999 49767 57904 69737 81250 72440 66312 63604 30705
9837 30705 29508 61287 76672 84286 91317 88187 80739 73994 67045 71435 89195 118212 111794 77587
9823 77587 75130 115210 107708 96564 58100 9295 -10834 163 19507 12668 11146 7808 22425
9810 22425 32258 21829 24243 7529 -4909 -3989 32718 56565 69947 66342 51551 7071 -468
9797 -468 27444 47047 45359 41563 60420 73115 76347 82332 64225 32759 10683 4294 22928
9784 22928 37273 -481 8807 47070 56915 60345 46430 30007 15858 11193 11041 22213 26426
9771 26426 26523 8210 -38345 -21426 10631 -11388 7532 7055 10320 3943 14549 29215 2277
9758 2277 -24857 -30210 -24101 -16438 -4704 20741 22564 12344 7982 28402 27241 9394 -884
9745 -884 -3841 10114 11888 11720 3205 -25333 -42703 -32235 -19524 7373 -4397 -6575 -5904 2097
9731 2097 17535 35192 34195 28236 19989 16026 -19876 -47497 -22781 8566 -5359 -4869 5666
9718 5666 -18730 10496 54355 58752 26307 20288 11066 39448 47916 47146 56449 51704 50054 45968
9704 45968 43723 42951 45721 80202 96917 70088 40228 21388 19541 23041 41673 44137 30955
9691 30955 29957 1763 -7834 -11699 19670 12494 10298 13680 15809 6701 4343 1787 -12656 22217
9677 22217 31667 34026 30830 11090 12889 21788 24803 21316 16850 -1305 -9540 15273 42160 24675
9663 24675 23092 20241 2733 17096 16991 1013 -41686 -38973 -22626 6392 9278 29385 13613
9650 13613 -1483 1048 -7672 -16576 -2920 -8631 4314 15973 -8476 -12263 16275 7364 10840
9637 10840 11215 -20961 -23606 -17251 -6162 2609 2016 17258 30249 40853 31418 29994 22213 -5809
9623 -5809 9482 30128 43065 21540 18046 37629 31398 16137 -22668 -23224 8186 13509 15586
9610 15586 52615 44656 33617 34355 30956 29429 25187 27683 48921 67928 59776 38877 22151
9597 22151 -17786 617 36087 37906 42612 33729 35274 30479 26765 16451 6776 -17963 -19242
9584 -19242 -11152 4374 29291 28235 25964 17705 43554 47365 4182 -34420 -61347 -57584 -27265
9571 -27265 4868 8948 -13314 -44351 -30927 -24648 1608 35886 57578 56174 39416 47727 47071
9558 47071 39178 13966 -2938 17795 20665 10401 23878 16562 -2044 10641 35566 33110 2478
9545 2478 -17113 -25159 -17520 -6915 17702 26829 31124 21308 36495 58289 55116 35048 -712
9532 -712 14575 -5984 3473 9343 26951 22440 24862 26667 32421 33316 18308 9255 -11730 -8064
9518 -8064 -1096 10151 43169 61387 46801 29771 22637 34065 49944 34591 26030 17701 -5279
9505 -5279 -23638 -19721 5145 20926 38778 33909 -2217 -3275 -13097 -27313 5904 7627 -19207
9492 -19207 11780 37819 59366 65972 34605 17618 24579 16239 21719 41390 31520 19544 22936
9479 22936 41839 40197 44701 32398 -7710 2575 3330 7584 -511 16619 38541 38024 19614
9466 19614 23574 30840 19252 31372 69661 80350 84403 118384 111712 73771 48525 60365 54828
9453 54828 52360 34406 33567 46657 39928 55314 49272 21032 14319 12690 35185 60690 80202
9440 80202 65477 64735 69075 51739 73697 73612 76833 75024 89157 128385 140616 131033 147360 189068
9426 189068 203188 205330 193968 192468 211998 197089 192329 216346 260810 284126 274230 292143
9414 292143 325419 345066 379223 400686 424257 437228 474195 524443 579119 638712 695802 775249
9402 775249 894485 1033515 1206354 1428354 1714775 2039850 2441169 2914918 3420930 3957166
9392 3957166 4529572 5071817 5610481 6217471 6926366 7753624 8690723 9754239 10837310
9383 10837310 11712942 12022961 11447794 10172451 8602175 7068980 5763216 4722624 3940530
9374 3940530 3353381 2901194 2570510 2296064 2084809 1887868 1711482 1559221 1448269 1360490
9364 1360490 1281283 1226182 1139659 1088451 1036616 991164 939996 908505 905119 923161 908879 849779
9352 849779 839271 813802 780055 755642 773322 755643 748702 741604 722556 687632 661252 621337
9340 621337 583894 567591 551692 521564 509625 505154 479318 442386 420291 421111 410055 396268
9328 396268 369623 337835 316534 300530 288183 274704 283856 272182 277844 261474 224429 201921
9316 201921 199151 167099 148286 158111 157286 165616 180587 154934 149623 154619 177118 194274 179449
9303 179449 147095 115604 112300 137294 124063 90462 104120 106185 80703 59611 38520 28870
9291 28870 48412 54876 55910 36208 50201 48020 55066 44615 34531 19308 4855 26104 64119
9278 64119 83859 64259 25101 21817 34642 51026 41764 60120 71866 63799 70510 73967 34763
9265 34763 12137 5868 59839 89193 90840 76724 37705 38277 52400 73898 90130 99532 86232
9252 86232 66959 49109 17720 23940 33352 15700 7362 -10239 -28359 -12842 22140 6631
9240 6631 17168 17365 1879 -1613 5245 20223 42395 49431 36545 22691 32754 45370 43615
9227 43615 27114 18665 -12041 -8909 23447 45809 34532 22845 8184 13994 21303 29784 41154
9214 41154 34667 42065 59543 33430 29628 23393 19225 1475 2562 28140 25475 26073 25887 12655
9200 12655 5994 23655 30287 22976 25285 34800 26700 12467 -199 -15955 -3374 7006 5831
9187 5831 -1888 26970 31331 -1150 4631 22563 13159 7452 1534 7482 48981 42222 47589 64184
9173 64184 50991 43509 42116 46092 33151 20557 20829 -6774 -3788 10109 6574 877 -2262 12165
9159 12165 11373 19702 19930 40481 40900 31137 9895 8956 24468 11632 13755 -1589 -13633 -16188
9145 -16188 -893 14903 27921 34936 36786 39208 40468 49130 74209 67870 36454 19874 19363
9132 19363 35109 51591 48125 38799 34430 36703 57140 62054 28824 4090 -23844 -26865 -20903
9119 -20903 -15017 -1191 7308 12389 7982 35543 32143 19403 21352 20302 23509 30788 25587 37137
9105 37137 47423 43838 36032 35214 19733 21611 -10796 -26557 2267 19742 12860 -7353 -15026
9092 -15026 13441 23506 29095 24086 -3591 -13305 6310 14388 15520 29744 8760 10394 7958
9079 7958 24073 35451 23264 -417 -21046 -25872 -25528 -4835 1318 13266 4050 3739 -16801
9066 -16801 -3976 8865 6105 -7263 -16220 -15600 -4124 10697 31374 33520 14102 -15684 -14531
9053 -14531 -20113 -38424 -63751 -40671 -25803 -14250 -21276 -25959 -20814 -23478 -21500 6165 14479
9040 14479 -878 4307 9872 36444 38161 40394 38767 36113 40988 44366 35376 -2290 -3180 -22143
9026 -22143 -39407 -32583 -8450 -29166 -31246 405 5149 2383 6240 7093 7878 7348 21854 37315
9012 37315 45159 40200 3730 -1630 5631 8961 -27872 -52428 -56708 -38700 -28271 -22509 -23524
8999 -23524 -35449 -35963 -25105 11552 1327 -28478 -27753 -20778 -970 10438 22523 -4061 -40582
8986 -40582 -22509 -22972 -23122 -22363 -23799 -19245 -29617 -41683 -45253 -45040 -46161 -33156 -37984 -849
8972 -849 35743 55782 62557 45114 5089 -524 18649 24039 15819 11662 23425 31581 26814 14906
8958 14906 -11237 -636 -1000 1551 7511 -3406 -1701 12408 39448 40803 44797 32914 5540
8945 5540 -11784 -25646 -19853 2166 14974 32445 32235 28303 10675 23262 27543 32368 7263
8932 7263 -28612 -28335 39 -2107 -8467 -11207 -13663 -22545 -20806 -33139 -31173 -32309 -32297 -11000 6266
8917 6266 -1426 -22122 -23091 6390 26066 48241 72109 60145 38282 31812 44834 42094 45416
8904 45416 28377 41677 17026 -306 37983 34115 21020 23169 4181 -14602 16495 22712
8892 22712 39188 28793 35453 40497 36069 5471 32834 64656 64992 52122 45865 45587 17176
8879 17176 22271 30281 33359 39125 24121 4228 6000 23272 35111 52523 55499 29212 14906
8866 14906 9034 -6926 -6288 -917 15051 15645 -3343 -9088 6797 15932 16068 -7798 2905 5955
8852 5955 10960 4127 -7776 -13475 -7405 -6748 22393 34675 3638 15791 44208 57790 54112
8839 54112 31766 27275 21263 10852 -24671 -34458 -14222 4828 24827 39877 68610 74294 73579
8826 73579 57682 33785 27688 9274 8287 33122 42100 29104 30677 37840 40106 34547 38466 35232
8812 35232 27057 8088 11592 29826 13276 29021 57735 63838 42594 39210 43915 31569 28502
8799 28502 54723 44856 25214 35346 46924 66179 82168 60797 16836 26597 38315 30092
8787 30092 71357 65662 62899 66129 91044 110358 103274 90982 80549 80056 91604 80588 84727
8774 84727 114999 92741 49365 57939 56345 13947 1535 40825 50359 54460 54992 44359 35537
8761 35537 31808 31528 15249 22500 26172 18728 12928 12952 -6859 -27857 -9019 16016 30647 27942
8747 27942 25118 -7907 -23876 -22323 4200 11067 13845 21619 56866 81704 87400 61501 62130
8734 62130 27275 8963 9502 14183 15921 6966 1004 -5714 -2151 27066 22400 17799 10444 3015
8720 3015 28078 36820 29577 42863 52994 24851 1626 2829 65421 80523 72011 70720 67456
8707 67456 66459 85635 59849 52459 56474 69652 84988 82028 51475 50109 44293 44857 57485 81185
8693 81185 80997 76371 85930 75566 35017 49449 70480 69620 65400 76331 87869 79414 70272 64722
8679 64722 74564 70054 52589 65828 58499 35496 70082 76369 61687 53152 45304 33615 37752
8666 37752 51255 63609 94737 108044 82615 79178 106888 100984 80943 90678 122116 134187
8654 134187 130442 131268 116847 101720 81465 62425 59255 51830 34277 50064 70718 83145 86722
8641 86722 108938 114080 132793 127404 125400 130786 148655 171242 167109 148842 148773 135669 116501
8628 116501 132264 143935 171170 168901 186114 193665 204821 241585 274187 282700 280413 268434
8616 268434 272811 293164 288427 298309 307897 335906 363590 377843 374892 390188 406455 428813 430988
8603 430988 449021 474555 490733 511536 509556 525008 550487 555202 534662 515371 485097 484675
8591 484675 511422 487667 489482 486089 475789 468065 434042 401779 392490 380168 358458 313785
8579 313785 301270 308680 302495 283073 285732 297718 303000 285102 264653 244209 227976 230170 232065
8566 232065 246426 241229 212538 203815 207643 206524 199482 178373 170153 153104 139028 157881 166607
8553 166607 171916 169264 188971 184082 191959 163571 136711 98629 87374 104630 121857 121970 117120
8540 117120 136322 132236 142924 129812 138409 123223 100533 108035 117537 90653 72647 66270 98676
8527 98676 126748 108701 110330 117488 119568 114665 110298 112648 98715 89456 85746 86521 75202 92899
8513 92899 112311 81648 78982 103343 75413 68845 81467 96787 113476 111090 88577 83434 58254
8500 58254 43658 44529 71863 95065 103181 137230 156465 115953 96693 115524 139185 136680 128412
8487 128412 137899 139776 140572 111447 101357 76711 81887 97136 96309 89423 108521 106315 96889 78602
8473 78602 94998 83497 66476 52843 55046 76987 81870 77520 76266 50608 24898 40198 30153
8460 30153 35329 30802 57444 76764 69168 63249 54141 55818 66762 74440 82343 84667 87075 91653
8446 91653 106699 95418 54549 45701 58819 87455 109783 79697 46201 61032 43917 49651
8434 49651 46309 58171 75471 73112 70412 32090 1772 29412 60178 58285 47862 55848 26552
8421 26552 11473 10011 18137 9257 -5228 5842 12644 30931 53086 53851 24718 3320 6974
8408 6974 28358 18303 -1251 -4415 1643 8818 5277 -3907 -97 -2766 6079 32687 67343 84125
8394 84125 72309 55462 64567 70213 77789 65974 55852 36538 38881 29133 -658 -1383 18470
8381 18470 16907 -5045 -8525 2188 -21185 -23068 6741 39209 31940 40212 69196 78735 85947
8368 85947 79306 50273 24477 34953 30913 14724 28804 49647 72434 61750 42777 61387
8356 61387 58313 37247 21006 17545 31786 44447 51947 53879 35276 27924 34367 26975 8134
8343 8134 -30958 -2793 17038 -340 -12133 -10333 8535 4101 17581 25260 28022 27663 12022
8330 12022 18873 3088 -4824 -13057 31116 63210 25565 -13608 -21320 -3145 28 -15954 -4118
8317 -4118 -12717 -29620 -21350 -2354 28182 34082 28398 11215 11655 13938 8 18481 4522
8304 4522 10277 -4770 -9472 -14535 -40855 -46499 -55032 -24026 5262 9189 -5350 -8680 -1144 2231
8290 2231 -29145 -4356 27554 14463 661 -17191 -23974 -28832 -5727 4547 -4803 1280 -6400
8277 -6400 960 3541 107 -11601 -11145 7419 -11948 -55309 -41847 -39627 -18518 5251 6133 -20953
8263 -20953 -39340 -42384 -27823 -19395 -32379 -47637 -14373 -16850 -20083 -18758 -10527 -24216 -41159
8250 -41159 -41424 -28810 -14261 1577 16496 18279 12197 16319 -1072 -2592 4255 14922 22436
8237 22436 11907 16616 8883 -12138 -13012 -24914 -39470 -39437 -40020 -23032 -7855 -12108 -12159 836
8223 836 15045 20046 12668 -2392 -21124 -21683 10827 30852 37931 29189 34683 36096 37312 30630
8209 30630 412 14139 16517 10011 13038 16007 23946 48809 55359 58000 55440 39996 15735
8196 15735 32210 26010 14809 14365 -3479 -7097 15331 11392 11006 19613 31595 42310 44185 46841
8182 46841 25467 3320 15337 17617 21860 19249 14759 -11686 -32542 -19370 4439 10253 3341
8169 3341 -13092 -16628 -5845 22756 41405 50289 64106 53291 54692 49262 25227 -13858 -34198
8156 -34198 -39543 -15891 14676 -11882 -10096 -20911 -36010 -25697 19613 28317 40147 65993
8144 65993 61411 55759 37237 30592 10184 526 2780 -12604 -19507 -12058 17128 18855 -29525
8131 -29525 -15287 2448 -27045 -41294 -44786 -27743 -6027 -39706 -32839 -21385 8919 44835
8119 44835 17421 -8143 -42966 -36622 -26410 7577 -4554 -6986 21672 48773 41699 16847
8107 16847 14203 15467 -20009 -12034 20016 12360 -1996 3105 -25102 -26614 23286 38302 52980
8094 52980 74045 44805 28394 16169 -10906 14651 37728 36719 24637 17810 34442 39982
8082 39982 34283 33082 5185 -9513 -3880 -5134 -23703 -27687 -9731 -9045 -18006 -34626 -10025
8069 -10025 39364 43986 21173 31600 35989 43402 51695 51498 35272 21259 15035 33394 9403
8056 9403 -4341 30248 33743 15144 14594 26556 30966 48615 37806 31006 63156 71310 53918
8043 53918 59061 60705 30883 16199 42835 71686 65069 77492 80969 65505 43612 35529 27551
8030 27551 26954 24958 17785 17912 25801 -14400 -38460 -9482 -25195 -18920 -3382 22968 32995
8017 32995 40675 11235 10899 51854 90515 84379 79164 56481 70084 96171 80931 83016 83003 79213
8003 79213 88089 93429 101826 114487 132693 137820 139725 142895 137345 128995 127573 104923 95498 94120
7989 94120 85282 93963 100928 87451 68652 70324 102319 84879 55625 25420 30302 40888 52413
7976 52413 47391 59122 75252 96213 88434 74851 80546 94995 104951 94157 78819 84380 68307
7963 68307 74240 88835 101351 122398 106434 113166 105140 99655 103801 95784 105404 108524 99931 103725
7949 103725 111977 121803 124253 124419 113346 107034 94580 70159 46733 47458 60153 59367 72355 93504
7935 93504 100145 92345 89690 87210 93720 73122 68438 48241 34703 59905 62272 62281 48097 41898
7921 41898 46024 25565 21480 13315 1057 18913 49314 28230 6917 43752 48949 50880 46837
7908 46837 37582 32178 27957 35282 29147 7451 20929 25555 51521 45719 36423 34866 16361 7215
7894 7215 17935 39020 32765 20820 27494 20891 20017 32891 48086 35892 19436 37165 59333
7881 59333 70992 82981 82001 72385 67276 40331 32838 36720 35673 36224 46754 37222 28939 35494
7867 35494 17532 -7210 -626 18404 49150 63981 54796 52490 36307 43333 65741 53717 30100
7854 30100 17879 31768 27498 16637 39199 10203 229 23706 32754 34771 4739 14077 21989
7841 21989 33988 10060 -1580 -7060 11973 19143 8681 17869 30991 28303 19464 19336 15487
7828 15487 -17442 -34999 -26502 16377 49653 43011 39651 45851 15303 21071 42637 54372 44120
7815 44120 35143 25417 13578 32463 27485 -6647 140 15350 -22431 -21776 1181 893 9692 6106
7801 6106 -788 -30 -8968 -16250 10218 6001 16021 14816 -7310 -37786 -43294 -31220 -20898 -2555
7787 -2555 6064 40004 28998 3174 -12496 -14761 -4813 29371 61481 53750 36681 -3748 -23193
7774 -23193 -12091 -5143 -29115 -67670 -89033 -87456 -53382 -35195 -32857 -39065 -44740 -25659 -33211
7761 -33211 -36693 -17467 -1118 52 -7453 1482 -8628 -14521 -876 25784 25203 4966 -3268
7748 -3268 -15652 7398 14230 10957 -2464 -23845 -40796 -54365 -41042 -33071 -56925 -47333 -23099
7735 -23099 -7771 -2986 -19635 -25193 -25812 -2399 11259 3025 -21998 -65228 -45036 -17107 -38069
7722 -38069 -60657 -59553 -44422 -26945 -3245 -2325 -21216 -6325 -12860 -19541 400 16356 17757
7709 17757 -3025 -6218 8120 2910 -14299 -23250 -41541 -36042 -25716 -54396 -60108 -41951 -42796
7696 -42796 -18759 5564 -11809 -43153 -32652 1769 11576 -5173 -17850 -35868 -61143 -60692
7684 -60692 -37596 -42090 -50170 -26937 -34384 -33884 -28683 -25453 -26482 -29903 -12678 -4134 6837 10748
7670 10748 14273 -6823 -5129 1044 -3050 -5505 -2424 -867 1209 16668 -6835 3003 -13520 -41292
7656 -41292 -14743 12 -13542 -40413 -42504 -79442 -96093 -56798 -10988 -6721 -15308 -12674 -33649
7643 -33649 -23027 -11162 -24058 -18467 7226 21543 12904 -11176 -24264 -18541 4294 24462
7631 24462 25690 17048 2579 -7069 11204 17529 -13390 -24623 -6406 1586 -1574 -18565 -39062
7618 -39062 -65220 -70039 -45731 -6579 29970 27021 18346 10103 -1993 9987 39930 40199 26021
7605 26021 -6681 -7891 -37699 -50431 -42145 -35363 -21396 -23642 -28966 -25666 21286 37681 26566
7592 26566 5022 -27911 -42609 -30855 -8450 2371 -10830 -17529 -8386 -9333 -19633 -23619 -18493
7579 -18493 -13514 -9231 -16399 6997 17766 -19483 -13726 -5462 4872 -36937 -52348 -24966 -27304
7566 -27304 -34903 -18186 -9546 17134 41407 26660 -8658 -1961 7797 27047 597 -21670 -35530
7553 -35530 -33959 -21010 -8785 -24538 -9532 -17866 -28575 -49181 -48374 -23924 5225 22623 2062
7540 2062 -12280 -8368 -1589 -12202 -22840 -25312 -23381 -11026 -52087 -75339 -78354 -56499 -59053
7527 -59053 -34422 -23233 -28540 -42296 -7683 -2977 -8616 -22505 -50008 -10954 9694 42438
7515 42438 56847 36330 13720 -14887 -49619 -57880 -25933 -9083 -22185 -1062 3766 6634
7503 6634 14758 -5283 -18382 -6111 16614 -4639 -4289 -7091 -3131 11096 15052 -8592 -15319
7490 -15319 -13178 -13091 -7924 -26985 -14593 33434 53627 38005 8125 -13347 -12672 -30245 -44308
7477 -44308 -37651 -12373 -10091 -16068 -11756 -1400 -11637 -15954 968 19895 2131 -7335 -5078
7464 -5078 -4644 -10399 -21057 -24479 -25770 -26091 -30974 -24246 -20290 -5580 -2270 -19334 -41550 -59147
7450 -59147 -56486 -30256 -24680 -21154 -41238 -42158 -49994 -29137 -6396 -7714 -16874 3980 -5370 -553
7436 -553 3764 -5981 -18650 -14796 -11439 -120 -7287 -15561 -1156 11022 21536 11985 -2233 6863
7422 6863 38208 38962 21550 -9695 -34645 -58188 -62060 -53648 -62174 -56829 -35996 -17023 -6461
7409 -6461 -6179 -16363 -9113 2596 -15980 -36796 -28639 13164 7542 -2422 -17430 2153 -8653
7396 -8653 -6432 -12904 -37958 -31160 -15746 -4277 -6629 -90 -8267 7320 16645 35157 35456 42189
7382 42189 30703 6252 11167 -1533 -31953 -42649 -37465 -37663 -52524 -26714 -10600 -12518 12920
7369 12920 625 -40558 -33212 -43810 -52354 -29899 -25779 -13947 9600 -7782 5832 3166 -6916
7356 -6916 -22044 -29868 -27204 -27310 -20830 -17866 -16125 -31274 -57783 -71561 -70640 -52081 -31921 -22306
7342 -22306 -12569 -11604 -26950 -2084 10124 22672 28034 30624 13893 10990 17476 2805 -1131
7329 -1131 -16251 -15941 -27138 -50209 -42774 -25566 -31455 -33870 -21085 7681 -20299 -26176 -21542
7316 -21542 -19140 -12310 -15175 1470 15349 -2876 -3482 1264 -24713 -41491 -39480 -16479 -469
7303 -469 -290 -41447 -52776 -39933 16787 7517 -17764 -16501 -24301 18576 7567 -1371 -10003 -18586
7289 -18586 -49349 -16855 7591 -15848 -42016 -31319 -35903 -46736 -56456 -51042 -36692 -30565 -2943
7276 -2943 -549 -22346 -5709 -9414 -27356 -27315 -15902 -21602 -22603 -22435 -32692 -41155 -39751 -3367
7262 -3367 19141 19259 11697 -10515 -23737 -22199 -32135 -27832 -11780 -8635 -34897 -40861 -22580 -10260
7248 -10260 -25689 -40301 -14788 -2750 -23554 -27769 -12572 10476 20696 11960 9890 -2905
7236 -2905 -3521 9295 19988 19351 41678 26677 -34588 -42922 -42091 -46106 -34029 -23967 -26901 -22871
7222 -22871 -35230 -23517 19511 60462 63945 47099 26664 20383 -19951 -45390 -49840 -40847 -17366
7209 -17366 -551 15923 3505 -46092 -49452 -44866 -22290 -8306 -20808 -39557 -27628 -22115
7197 -22115 -37298 -26267 -6189 4153 -6459 -13389 6822 3641 10832 29858 38320 26142 36414
7184 36414 25413 16828 -8521 -12729 10242 7829 -9040 -9055 -1440 -6766 -14697 -36486 -35691 -24418
7170 -24418 -32359 -19411 326 11648 -24539 -8208 -10333 -10797 7660 22843 -6313 -19946 -6331
7157 -6331 -28618 -37711 -45744 -53931 -77045 -69072 -36371 -23822 -46921 -49339 -30666 221 11000
7144 11000 12325 10156 22499 32755 28214 15112 15379 22110 37833 39783 10016 -6607 1256
7131 1256 4342 2069 17020 12914 18111 -4012 -24210 -46775 -46305 -24453 -20279 5346 37338
7118 37338 35917 15283 19337 38620 34681 40481 36426 41592 35661 4289 -19121 -45123 -55456
7105 -55456 -30530 -21583 -6584 -11021 -3530 12617 24187 39101 36981 9139 -1108 13593 33833
7092 33833 43682 37654 20901 1648 -1197 -21542 -22127 5788 5655 30873 29977 14795 26549 24877
7078 24877 11331 21579 -10674 -44125 -55927 -35568 -14458 -16641 -41477 -24489 -13993 -16954
7066 -16954 19360 36717 56430 42577 17182 5303 9973 -6126 4837 8058 25276 20188
7054 20188 20946 18311 14088 -6415 15499 24721 9144 11588 11953 15434 24424 36986 39157 55012
7040 55012 37903 4754 -38381 -30991 -16995 -32126 -29244 -46890 -47391 -34607 -19071 -24941 -53205
7027 -53205 -32944 -23206 -37653 -7158 -6478 -16121 -40635 -30103 -12099 -5659 7380 586 -44539
7014 -44539 -46115 2795 7791 -19857 -19281 -33125 -19915 -30179 -3894 -407 -8595 -5905 13150
7001 13150 23261 22989 20179 10816 -6500 -678 22086 23300 24983 12714 3551 18019 18591 13351
6987 13351 17668 -22577 -28970 -27844 -25473 -5405 21808 27813 24387 20823 -138 -29248 -28874 -47056
6973 -47056 -38724 1353 38077 33055 5466 -5350 22729 7359 -32186 -28488 -15222 998
6961 998 15625 7219 13506 33987 42689 35495 14875 4011 8480 23584 32073 41009 7703 -19083
6947 -19083 -9361 -25226 -40350 -63025 -58253 -40662 -30199 -13870 4505 -4098 -3790 -8036 664
6934 664 -7505 -28197 -25618 -50331 -49413 -20330 12240 7425 -27855 -45137 -37996 -28717 -22627 2550
6920 2550 6814 -9414 -25458 -30661 -22798 -6353 -24140 -4326 1512 -3755 7070 -3059 -23007
6907 -23007 -24267 -19128 2129 20089 936 -17127 -4505 14726 11182 -10591 -13105 -8451 -25540
6894 -25540 -28888 -35772 -33058 -29906 -46880 -61598 -42894 -21048 -5189 -8658 5822 7776 -35180
6881 -35180 -21290 19956 17287 16811 -2173 -7145 -42865 -60160 -28032 4577 18110 23780 21147
6868 21147 15500 16530 25107 32320 23897 9350 -10158 6776 7189 -13747 -20159 -37266 -19675
6855 -19675 -6075 -2723 4553 20553 33403 29350 23427 18148 14133 20754 32723 58043 50870
6842 50870 22319 14385 27616 35487 2591 5445 9629 10015 15014 21040 -123 854 23875 38281
6828 38281 56836 35658 6704 -5580 -7845 4096 11969 -13537 -65304 -55793 -8533 -29571
6816 -29571 -48513 -39807 -25212 -12663 -32999 -26167 -734 23052 -3326 -23073 15631 40741
6804 40741 26341 3908 11657 -383 -12331 6698 5655 -11893 -13263 -42028 -54663 -43111
6792 -43111 -16006 -17063 -46535 -38669 -23727 710 4655 -6501 -34562 -51867 -29693 -14262
6780 -14262 -47420 -64636 -40121 -10683 -4555 16195 5796 -11465 -36105 -13273 -21548 -11758
6768 -11758 10309 5833 16444 29588 26774 22146 45560 35021 3638 -19364 -9283 10544
6756 10544 -2692 -4451 -5605 -21543 -33256 -23392 -32213 -23964 -27297 -486 47712 45222 9525
6743 9525 -14076 -2686 1706 -4359 -14273 -27013 -11923 -1239 -2406 20043 50030 46864 36483
6730 36483 33669 18559 17778 19829 21619 13155 38701 37194 35696 22770 25240 19344 12294 16225
6716 16225 18776 23780 -7139 14011 19852 17118 5563 1537 4680 11226 -848 2924 23518
6703 23518 40264 31686 -1400 11101 37196 23311 10504 19481 54622 93788 94874 73714
6691 73714 72807 56661 46737 27407 -3073 -46098 -34026 -13748 -37332 -55909 -53712 -36945 -32918
6678 -32918 -48100 -47464 -40697 -34869 -12772 972 16062 15411 -4269 -7941 4608 2104 1553 11953
6664 11953 13846 29338 32582 -9014 -48111 -70168 -45995 2809 36155 35799 8888 -21487 -56571
6651 -56571 -60670 -30776 -29743 -8765 -6469 -7481 -13622 -14617 -23057 -23433 -6122 -10517 1189 13070
6637 13070 21709 2795 -15337 -16880 -32539 -54333 -38931 -17171 -19420 -32805 -19707 1188
6625 1188 4780 -12022 -12470 3624 20831 31289 38260 20908 31220 27394 14492 -9692 -21734
6612 -21734 -19766 -20815 -48234 -29148 12582 22585 11357 13900 211 -3893 -6158 -28374 -38742
6599 -38742 -30062 -23079 -11669 -17077 -27600 -30031 -19046 -15529 5192 -2583 -12531 -7387 -24334
6586 -24334 -29922 -11412 -15635 6512 30324 361 -5213 -12912 -28957 -11104 2058 -10271 -10579
6573 -10579 -1743 -22734 -29291 -23636 -15750 -8908 -10092 -23251 -31334 -26249 -18661 -7509 -30040 -33962
6559 -33962 -27063 -6538 -10874 -46176 -66760 -63028 -39005 -22344 -19018 -31045 -51610 -59357 -56942
6546 -56942 -22997 -26034 -35276 -34202 -40285 -54731 -52762 -31458 -35172 -34009 -34304 -20530 -30759 -54719
6532 -54719 -44423 -25838 -7268 11075 11529 22423 20840 -8458 -16580 -20855 21770 16898 4518
6519 4518 -593 372 -320 8438 37839 41976 17409 -13062 -20223 -24410 -38431 -41708 -9904 1972
6505 1972 -2093 -2639 7446 -14442 -20783 -587 -27809 -23910 -26474 -48369 -58668 -57136 -49907 -58964
6491 -58964 -7958 3402 -7674 4296 15748 35824 33060 31872 34317 10504 -9704 -20384
6479 -20384 -1570 10562 -5158 -3974 -1932 -19706 -33471 -37823 -14443 -40149 -74445 -77709 -59434
6466 -59434 -50420 -64836 -63036 -55469 -60929 -75339 -71472 -67882 -47176 -34728 -64556 -93513 -92931
6453 -92931 -84663 -58317 -44906 -55699 -54947 -32154 -11557 -11712 2123 3383 -2938 -18910 -18944 -8084
6439 -8084 -12923 -41976 -47716 -46563 -17948 11308 30710 34640 34764 43406 33151 8500 -19911
6426 -19911 -42835 -41647 -12461 10815 14238 12412 -1526 -29119 -35882 -17678 -19750 -27955 1314
6413 1314 10680 14693 18501 -5146 -5887 -17496 -37675 -47635 -39093 -34365 970 -10619 -16758 -14303
6399 -14303 -29359 -38685 -21100 -17111 -31555 -36073 -61159 -49187 -6713 -28677 -23417 -9120 -31966
6386 -31966 -8487 23755 45819 50723 15524 -14384 -22215 -22189 -14189 -3904 -10577 -29790 -41348
6373 -41348 -30264 -11211 -11828 -54720 -67019 -72817 -73340 -52258 -24028 -20895 -22170 -26369 -24303 -11148
6359 -11148 -36356 -54963 -33491 -3003 17789 38971 58503 45230 34409 19494 1640 -60
6347 -60 7490 30291 34246 26179 10602 -9331 -22274 -40215 -23782 -14396 -24632 -7335 13574
6334 13574 22686 30578 26326 41618 23408 13933 25718 11857 7024 8842 13264 -381 9692
6321 9692 27803 15714 746 -17680 -24307 -44154 -60390 -70056 -50931 -43923 -31330 -31014 -26008
6308 -26008 10516 25466 10405 18379 19913 15199 11850 -4990 -35811 -16788 -7802 -4547 9177
6295 9177 3077 -6661 1910 -9361 -14554 -22520 -21678 -37024 -52887 -49267 -37786 -22508 -15037 -16042
6281 -16042 -18860 -15126 -9680 -6752 12728 2856 12501 7000 -13227 -19173 -6049 -4709 -4905 -8422
6267 -8422 2993 1051 -22932 -34435 -22335 -19545 -30843 -48651 -37540 -21425 -11512 -18717 -24665
6254 -24665 -14455 -22504 -42800 -37757 -18802 -8916 -19540 -11858 -14315 -10220 -33409 -67995 -54781
6241 -54781 -18516 -6023 2515 1483 3468 -26047 -31731 -15460 -21704 -41226 -69595 -45699 -4464
6228 -4464 20513 11427 -16085 -16609 -50482 -59403 -39577 -21075 2358 17947 22516 11154 2927
6215 2927 30448 28573 -11423 -13701 -11460 -1559 -6303 -1414 -1577 -15822 15137 20736 16549 15590
6201 15590 28322 62336 45566 27808 11487 -9453 9932 24797 -16097 -29882 -7012 5492
6189 5492 -31337 -52666 -65226 -60438 -43525 -54997 -46573 -16805 7920 36302 58712 25194
6177 25194 2627 2182 25821 16548 1879 14051 35518 55456 62248 33524 7363 2773 -5662
6164 -5662 7598 4085 -3835 -30973 -66518 -38537 -14287 -1644 -3280 -5744 -5770 -14449 -29017 -33869
6150 -33869 -45367 -39799 -34965 -43115 -30589 -37031 -36359 -34081 7211 31913 26524 25408 20094 -194
6136 -194 5434 9131 -13849 -23744 -21151 -4297 -23174 -16487 -10979 -37427 -45108 -30885 -32040 -27856
6122 -27856 -10140 3850 -1464 975 10799 32848 31885 1878 -10207 -30138 -44705 -59973 -64847
6109 -64847 -40851 -20900 -1820 -4115 -22998 -58057 -58706 -30211 9272 6334 7647 4097 15251
6096 15251 105 -38339 -41966 -46761 -35010 -17640 -6057 -4250 -12707 -12846 -24778 -20769 -18559
6083 -18559 -12662 -10753 -37447 -49887 -45410 -3580 -963 -1611 20580 27049 -7918 467 33568
6070 33568 44088 63179 27372 22046 4276 -4709 -10740 -5136 16717 20315 2829 -17319 -18483
6057 -18483 -24611 -2718 35214 61863 39346 5930 10949 38375 21145 16270 -5438 -24747
6045 -24747 -21967 -31835 -21764 9817 14320 38236 28248 15556 27629 10994 -29738 -46273 -34419
6032 -34419 -18565 -13812 -10187 -14602 -27750 5471 -6425 -28451 -16184 6914 207 -14087 -19955
6019 -19955 -27281 -2557 6730 15743 44170 23146 13251 -5458 -3351 -6398 3893 6236 15654
6006 15654 -25145 -25573 -6144 785 -2906 27947 7027 -2996 11207 32497 31055 17505 10847
5993 10847 599 -14535 -27879 -4881 11708 12409 1709 12859 -3084 16858 16601 1896 5391
5980 5391 -6683 -12485 -12482 -30767 98 22054 19216 -9582 -37610 -41417 -23954 -31222 -56303 -39883
5966 -39883 -19390 -9971 5972 6097 -9800 -22268 -32238 -24104 -6632 -9955 -20243 -15278 8160
5953 8160 13212 13578 11174 -19307 -21672 2155 871 3686 -12900 -46643 -40638 -3596 8057 9050
5939 9050 13821 33754 34552 9435 -30220 -39620 -26125 -14397 -2830 4232 16561 23921 41974
5926 41974 36998 35637 35864 21869 12228 143 -15864 23700 25825 -7609 -21205 -22037 -33174
5913 -33174 -50018 -32432 -13470 -14201 -7905 -16209 -18314 -12193 -23211 -21861 -27700 -45536 -66677
5900 -66677 -54906 -53536 -11076 -1223 -38226 -49535 -51550 -32424 -6846 -26300 -31969 -25593 2847
5887 2847 20779 508 -6947 -832 6079 -22 28794 62223 63133 40019 4105 -15158 -23130
5874 -23130 6168 39236 32752 26760 58064 51260 32346 24168 8487 9160 -25503 -41502 -38535
5861 -38535 -39251 -24303 -6232 7534 15020 23636 7564 -26055 -51395 -46680 -32271 -28138 -46293
5848 -46293 -64127 -69489 -45700 -49441 -55362 -51997 -14646 -10885 -16788 -725 -4717 -18427 2112
5835 2112 14378 14096 31417 40533 3570 -5739 -21755 -45214 -44779 -35826 -40207 -26928 -25698 -20350
5821 -20350 -34879 -43348 -51850 -37456 -11628 -1338 -7536 -13661 -26985 -13437 -26661 -14314 -12951
5808 -12951 -1141 24239 16927 10714 -20366 -23448 -34861 -30855 -15111 19602 38263 25804 22279
5795 22279 18257 57130 51200 32888 -5337 -7789 24394 50116 75325 55456 36314 9047
5783 9047 20411 311 -7634 -18215 -36183 -20468 2602 -4814 -15937 -9000 6104 3733 7279
5770 7279 2395 687 715 22371 28584 -389 -14627 -23695 -15148 -16768 -13361 -11305 10647 14359
5756 14359 5997 12323 18266 3831 4099 21724 36001 37038 30423 1646 -20187 -45655 -26441
5743 -26441 -9663 -4948 15963 4140 -6914 24463 15137 13872 25543 11774 10523 -8121 -19260
5730 -19260 -28074 -62201 -54483 -27158 -19743 -29472 -22586 -4654 -9053 7453 -27460 -43074 -43095 -57096
5716 -57096 -47483 -17084 -10203 -32555 -39276 -52487 -34384 -31606 -1885 6080 5536 -14076 -24421
5703 -24421 -15977 22546 9295 -21313 -46483 -49103 -26494 -14534 10818 15418 -12460 -38484
5691 -38484 -48147 -54625 -49593 -67935 -73646 -33958 -15089 -21480 -22750 -9601 -774 -18385 -27059
5678 -27059 -34512 -40188 -23973 -13025 374 134 -10973 -10522 34152 54659 42208 8092 16717
5665 16717 20728 19204 3707 7180 11434 428 6834 25930 39419 40172 33871 9226 953 16986
5651 16986 -15026 -28347 -2144 10833 21884 -1851 -18965 -6758 4975 -3627 -22785 -40319
5639 -40319 -58558 -39790 -32936 -41646 -19955 -32489 -9951 9907 -10835 1044 6337 5647 -15589
5626 -15589 -29494 11169 32639 34282 29997 14314 1207 -12358 -12112 -5848 -27520 -36838 -28015
5613 -28015 -34762 -46096 -28581 -23677 -19396 7858 38516 22368 14486 9939 -1487 -12993 -14717
5600 -14717 -31638 -41241 -42785 -30832 -39108 -48830 -46405 -34606 -16204 -28662 -46450 -34973 -43319
5587 -43319 -27946 -20804 -24752 -41732 -25764 -15187 -10246 -24608 -19286 6588 34768 10028 -33794
5574 -33794 -34906 -26931 -20692 -14672 -9897 11088 27234 6301 12572 39918 45457 44595 12430 -14857
5560 -14857 -21370 -21157 -8319 -18457 -18881 -31617 -44188 -65062 -74016 -59764 -60233 -64932 -48195 2670
5546 2670 29006 4273 -20316 -41911 -53065 -44212 -17353 -6877 -1825 29465 24862 6414 22306
5533 22306 35787 28625 2637 5195 3284 16139 -1456 -9320 -16265 -22758 -4949 5972 15758
5520 15758 -9446 -10852 -1576 -3634 12353 22119 42998 34641 1456 -16948 -4339 -2503 9764
5507 9764 9743 15300 14087 40977 47895 35106 34440 12493 -16111 -29267 -3797 2056 18087 22508
5493 22508 29844 24566 8410 2893 9927 6606 -1201 15357 6599 6198 17961 25728 11837 -8188
5479 -8188 -8607 10136 -4264 -22531 -11350 9194 14944 -549 -19341 -17223 -28511 -35403 -5900
5466 -5900 17362 67 1721 -1906 -21347 -30751 -33427 -35510 -17157 -1781 -6074 -28673 -37628
5453 -37628 -27679 -36071 -36339 -47017 -33045 -15979 -22913 -55420 -41307 -22136 -6398 19301 19920
5440 19920 4419 -5694 -14945 -12163 -20193 -29215 -36991 -24348 -17622 -33723 -51258 -28972 -15156
5427 -15156 1833 28831 52755 49594 52631 53800 58881 50250 56312 58819 34999 4862 -14547
5414 -14547 -24876 -15477 4420 8119 -8838 -25812 -32921 -43777 -40006 -9194 706 -5601 -17360
5401 -17360 -7363 -4467 9794 28309 5502 -20996 -62574 -62937 -66823 -62372 -46154 -30895 -34129
5388 -34129 -34201 -13364 -17698 -29478 -32307 -27582 -24615 -10185 28064 34804 6471 -2543 -9504 -17095
5374 -17095 -41686 -24046 -21278 -28496 -20650 -17243 -19176 -5008 -6444 -15693 6410 16585 4041
5361 4041 -8491 -14127 -6357 -6704 -3227 13150 12274 16342 19414 -7213 -67657 -55293 -20157 5851
5347 5851 18714 9938 -20044 -24840 -2008 4174 5263 -17333 -11742 17772 6071 -12528 297
5334 297 -5233 -20976 -21677 -5051 20068 3146 -24243 -51021 -27029 -5368 675 906 -20295
5321 -20295 -31371 -34560 -7895 1954 24183 23983 12364 718 -12408 -6886 4892 9100 13969
5308 13969 5843 -3038 5763 18153 9654 22575 3104 -8873 -2263 -10463 -14729 -17066 -120
5295 -120 3862 -6272 -11700 -5930 10786 14314 508 -10277 -9754 -5659 -16714 -15590 -36549 -28984
5281 -28984 -31673 -44454 -49945 -38722 -40401 -50451 -9769 -23940 -32881 -25701 -11188 -25619 -25326
5268 -25326 227 27871 34690 21657 21738 2930 14726 23120 20222 20649 6754 -807 2538 -681
5254 -681 -21455 -39960 -37462 -44890 -25293 9063 -8000 -21681 -29015 -28317 -11897 11894 6316
5241 6316 -22689 -20414 -544 27225 41157 24129 4664 -8228 -11023 -20939 -19537 -31602 -46381
5228 -46381 -47191 -30888 -14043 -14027 -3525 3831 6707 6829 -13630 -52251 -44545 -13466 5981 8227
5214 8227 -31489 -43380 -23810 -6026 -32540 -33078 -33802 -41924 -25764 -11348 -6982 5726 689
5201 689 25 -17436 -17732 -31255 -23022 -15799 -28627 -43306 -43438 -26102 -1997 -17919 -19018 -9627
5187 -9627 10577 -10175 -2349 -1898 -12660 -3291 -18756 -30010 -29426 -3768 22002 27509 10216
5174 10216 4900 -1584 -16639 -24470 -27269 -16279 -23612 -7778 -331 -17081 -9008 319 -4160 7656
5160 7656 35609 47186 49026 55285 27195 4319 686 -41081 -38598 -40464 -51693 -50693 -16161
5147 -16161 -4939 -32255 -42492 -41587 -19908 -17786 -2077 -66 -37660 -51610 -30310 -20393 -5080
5134 -5080 130 315 -16269 -10346 9935 19700 16739 12308 -2588 -29370 -33891 -37133 -17115 -11216
5120 -11216 -2938 -1374 -994 -13049 -11566 10783 11867 -18831 -24844 307 15008 3077 -4611
5107 -4611 5440 33290 21446 11720 33776 7150 -8089 -18267 -19169 -20844 5784 -2796 -16850
5094 -16850 -14276 -25427 -20833 -29950 -20329 24167 33815 19630 -4535 -24854 -32219 -35551 -47921
5081 -47921 -13740 -12828 -6992 -21198 -30637 -10956 -5937 9728 -2341 -14206 -30766 17680 29956
5068 29956 8163 8353 23752 6612 26319 25408 20741 12517 2917 -9031 -7852 -10579 -8227 -20532
5054 -20532 -17504 -21481 -28837 -17314 -1338 -12616 -29573 -38386 -51393 -49542 -40664 -15099 13619
5041 13619 18459 -2710 12733 15300 12182 -15555 -10755 7076 1590 -8630 5405 24820 5103
5028 5103 -5952 -4071 -13857 -28991 -41076 -46523 -16554 -10406 -49702 -66735 -63371 -48341 -17423
5015 -17423 -19031 -22633 -12226 -15241 -9807 -11916 -31316 -36943 -17644 -19020 -22329 1401 24709
5002 24709 56853 58897 61788 53597 33412 -9322 -16550 -4417 3976 4957 -19430 -36663 -18826
4989 -18826 -266 -1942 -1832 13782 12315 5256 10640 -15195 -27266 -15719 -31422 -35836 8329
4976 8329 35370 43019 38609 34111 26484 534 -8287 -4157 -1344 -14699 -25966 -19845 -12586 -4872
4962 -4872 5559 -17642 -13218 11532 6892 -11259 -25576 -41012 -37111 -32820 -4311 4730 -11950
4949 -11950 -23530 -33858 -32905 -12740 786 -8255 -25002 -37803 -43756 -22789 2487 -19388 -29368
4936 -29368 -39002 -24237 -8137 -27777 -48757 -37241 -22632 16628 37099 21700 21996 33915
4924 33915 7474 -4829 -13814 -29368 -42445 -26857 -18379 16771 15646 33896 34741 16140 -679
4911 -679 -23884 -41628 -49100 -17465 725 3294 -5204 8685 2909 1214 -24697 -39265 -9037
4898 -9037 -26000 -25343 -17538 -43435 -52808 -45587 -36326 -23162 -33557 -34089 -16914 -13535 -652 -3190
4884 -3190 27642 22658 4350 -2045 544 2708 -11740 -31823 -46865 -51470 -58936 -28167 -635
4871 -635 -12377 -9261 -4204 5221 -11101 -44633 -37054 -55404 -50375 -26395 -21381 -16747 20156 26596
4857 26596 10898 15850 28633 35504 1214 -12629 10605 17189 10118 199 535 -6459 -19339
4844 -19339 -16943 -8042 -2608 -8280 -5934 -14364 -7344 1123 7916 -4164 -2542 -22244 -27584 -42072
4830 -42072 -21103 38073 30777 -15993 -27869 -5760 4597 -5709 -17982 -6830 19952 33671
4818 33671 36611 5334 -11433 -13586 -37239 -50862 -77358 -54985 -16684 -24711 -28313 -32192 -23779
4805 -23779 -9548 -6395 -32835 -44318 -27745 -20169 -6984 22699 39096 28961 17629 35757
4793 35757 47483 45015 38491 28568 2536 42130 50777 44416 44081 40678 23765 32146 20238 12561
4779 12561 -10019 3148 5495 14502 45833 45535 19798 12617 29989 20827 14253 1424 4425
4766 4425 -1556 4709 8547 14876 14105 17220 7138 1232 2712 -19055 -9681 -4100 33210 43704
4752 43704 43478 26965 28749 14039 15239 36305 25909 15831 21067 27422 37360 34644 19508
4739 19508 1405 -12711 -4413 5240 -11429 -43448 -16238 132 9707 -8698 -15038 -17565 -6986
4726 -6986 -28926 -47245 -5362 6622 15728 8752 -10969 -7585 -19837 -25609 20821 32563 20039
4713 20039 -1825 1691 22611 43680 42705 44636 21638 6649 10262 15506 2629 -9089 -29244
4700 -29244 -20782 -2874 13068 12928 -16245 -29144 -23228 -12866 -23527 -1780 19692 8955 3441
4687 3441 -9605 -526 -14487 -32192 -22930 159 -4198 -8197 -15048 1045 25111 2842 -5006
4674 -5006 68 387 -20197 -37654 -16343 13331 15209 -6813 3214 -85 1832 -8211 -25823
4661 -25823 -44628 -45735 -44453 -46520 -7406 21688 6126 -7156 -14564 11711 24833 25790 -18967
4648 -18967 -20201 23253 35069 39022 29592 10211 4591 6531 17999 36947 29752 4594 -1656
4635 -1656 19983 8581 -20678 -35717 -47097 -35532 -31400 -10592 51 7015 9251 15426 -7766
4622 -7766 -10445 -7261 -20125 -21287 -31476 -39423 -35520 -4671 2897 35046 36621 14804 -11872
4609 -11872 239 11273 14864 20500 26441 -10925 -28656 -25641 -23189 -41085 -36513 -19582 -29521
4596 -29521 -14821 -12668 -33590 -64395 -63161 -40667 -25933 -25854 -14292 -20793 -7639 -18210 -11219
4583 -11219 10633 3747 30147 22500 16942 14451 -4053 2376 -2592 2907 -1151 -16261 -9335 -2612
4569 -2612 -3789 24302 21787 19995 18952 17901 23196 38558 22471 18494 22335 48197 42976 28701
4555 28701 14016 27271 25077 8998 -12698 -25922 -11703 -8254 -7455 -2710 -6189 1276 -12297
4542 -12297 -26963 -46740 -61556 -56846 -36224 -54390 -43163 -15339 -11878 7195 22779 -5173
4530 -5173 -29389 -10961 1393 -32403 -33548 -37189 -42377 -56866 -59917 -44024 -36242 -16493 -13152
4517 -13152 -28407 -17147 2814 23604 48911 22230 10514 28176 34698 21980 226 21335
4505 21335 43529 37631 29841 33532 10130 -3880 15790 26582 40967 24424 -3031 -7486 -4301
4492 -4301 -18020 -21686 -3123 -8202 219 4869 -5802 23622 35101 7194 1600 8654 -3903
4479 -3903 -4274 1924 19841 21402 -16720 -21638 15388 24655 5033 10350 5023 6186 19716 17409
4465 17409 8667 25140 21909 35618 12824 -16202 -14214 -12515 -9313 -13728 -30202 -15544 3518
4452 3518 -20282 -44432 -18357 18925 16559 3772 11803 -9839 9600 -12319 -10762 -1483 5274
4439 5274 13418 31332 62644 74479 54718 9742 -49282 -58540 -36968 -34629 -38011 -66484 -43773
4426 -43773 -19235 -38742 -24260 -3856 -16944 -20739 -15039 -17982 -30334 -47006 -50165 -30198 -9362
4413 -9362 15158 46948 49816 26030 21823 13037 11050 7779 10395 2516 11210 4844 -8021 -23431
4399 -23431 -19234 -14303 -549 14071 -336 -14808 8344 14106 14968 8235 -25845 -34292 -17982
4386 -17982 -8208 -2524 -6787 -4966 -8787 -29183 -39094 -23158 -37143 -47397 -46743 -25980 -21949 -13318
4372 -13318 -17114 -26709 -19668 -38673 -38397 -35465 -25125 -24180 -19752 -20281 5320 13869 16915 12512 21386
4357 21386 34138 40051 58992 17806 -24545 -53481 -43177 -24993 -8391 -18700 -39136 -30166
4345 -30166 13464 33622 15068 16417 22180 18732 40163 59613 45778 31400 14736 -4216
4333 -4216 -15176 4867 298 -10996 -35114 -35289 -21757 -25924 -14124 2103 -17591 574 28509
4320 28509 -1710 -15340 -1793 1280 2032 -6596 -25271 -19432 7302 52634 49888 29201 -412
4307 -412 -6538 -29168 -55227 -48977 -33911 -24780 -9235 920 24005 26442 28022 13191 21648
4294 21648 60791 46867 20205 -10098 -18291 -10075 -16768 -1770 4148 10798 39393 28275 15463
4281 15463 35333 6128 -20425 -11915 -8068 3874 21405 29292 16462 -11059 -6191 -29963 -42766
4268 -42766 -26075 -8007 -5164 -13206 -42646 -34590 -28329 -23049 27 4224 5793 4797 -9003 -25022
4254 -25022 -34799 -61248 -59088 -33877 -19688 -19345 -3019 21899 36241 6083 -27665 -24592 -29924
4241 -29924 -15018 6292 -635 -13804 17006 21121 11790 4583 -11792 -16305 -5906 27260 10402
4228 10402 3290 28563 31609 23799 30468 18557 25601 22569 13223 29489 20857 -15557 -42914
4215 -42914 -55035 -50230 -18911 22829 38743 22934 13637 19614 42150 48455 20756 -1635 -920
4202 -920 1378 14123 -10067 -15946 -839 24010 17288 6411 2731 4499 28930 34381 27514 10170
4188 10170 -23827 -30514 -16201 -23411 -15847 -1902 -3849 8177 15132 15130 14581 33305 43385 36400
4174 36400 4312 10647 15581 8134 -17641 -15968 1723 17481 42439 32300 21754 38969 22621
4161 22621 -1226 -10976 1795 36694 28379 13967 28840 36509 18880 3318 -4259 -5196 -3720
4148 -3720 16364 31044 6097 3253 3450 -12799 -27770 -15502 -5902 3561 1114 7877 -4386
4135 -4386 4943 37521 48638 26244 5042 6301 16848 2135 -19744 -6272 16847 32087
4123 32087 64293 32070 16198 28964 27517 10491 828 -14029 -31030 -35109 -30143 -10651 12731
4110 12731 27111 28938 20690 16578 5864 -14466 -14799 -10765 8316 41867 47235 24527 7345
4097 7345 -437 -3728 -18474 -13633 10209 16540 30007 19898 5730 6025 2361 13378 20641 19546
4083 19546 -6258 -3415 17839 22223 17429 14272 35868 44290 76614 80078 62854 38086 23315
4070 23315 32250 20760 1512 -31638 -45592 -39654 -35328 -9237 4395 2315 18200 18279 9833
4057 9833 -10116 -18966 5656 10202 -10510 -5737 13361 30570 -3921 -14801 -8686 17245 28666
4044 28666 48738 36782 13553 9910 -2544 -8721 2293 -980 -4291 6471 12521 -1639 5785
4031 5785 22076 33251 16809 7746 5377 18460 4593 -4899 -30143 -19979 -5425 -6070 -26148
4018 -26148 -27840 -20527 -9791 -8545 11694 23056 -962 -16656 -15757 10255 12974 -5271 -21002
4005 -21002 -22838 -16357 9860 23824 -2465 -11815 -3212 13804 19661 3457 12492 24549 -13166
3992 -13166 -21957 -15058 -24680 -4136 580 15221 23487 7040 3031 5797 -14112 -10555 -9964 -13607
3978 -13607 -18646 -38192 -65626 -54862 -58678 -49951 -18928 23885 45580 9279 -3561 -7189 -14097
3965 -14097 -20711 -35499 -25916 -11845 -8827 -9741 -18768 4076 -6791 -25545 -18417 -19827 -55446
3952 -55446 -70307 -68313 -39710 -42474 -30797 -43939 -55264 -33592 -27946 -19638 -7470 -17996 -18221
3939 -18221 -26043 -32367 -19326 -7214 -4786 -3364 11483 -16207 -37299 -22022 -12619 -120 11423
3926 11423 22879 10234 27881 25968 5011 -2448 6268 9686 9257 9816 31625 28971 19183 31398
3912 31398 29481 16855 13519 12609 5892 2995 -3153 -11934 -1752 -1434 3745 -23124 -34327 -47511
3898 -47511 -68723 -84431 -33716 -5678 4531 2667 -6982 -14374 -2533 -26150 -10247 20812
3886 20812 26150 27889 12105 -583 -7542 -13188 -8450 5624 -3314 -12734 25103 69016 38073
3873 38073 -10051 -28464 5008 5230 14120 4144 -22195 -22497 -4154 33735 48847 49727 37404
3860 37404 11496 -4720 -7477 15828 32083 8711 12117 24443 37225 7061 -5521 7387
3848 7387 15370 3561 13117 26157 4055 9104 -7100 -26769 -37804 -27344 5666 4492 24060
3835 24060 53890 60917 57149 48237 21093 7233 -7352 -16562 -21814 4889 9797 3705 1912
3822 1912 40880 62782 33846 2828 5970 -6508 13305 31334 7289 -33657 -43092 -30796
3810 -30796 -4005 23590 16353 13371 8377 -10344 25383 19335 16394 15612 15933 13668 7196 -3096
3796 -3096 18054 49252 51467 23533 -13188 1389 16092 19247 33490 64545 62946 -3102 -34205
3783 -34205 -37179 -25974 -49380 -40719 -26075 -19756 -10431 -21729 -26984 -21789 -31055 -29106 -19173 -32502
3769 -32502 -46886 -30904 -13598 -5526 13556 -7429 -28941 -38280 -27140 -19024 7337 14712 46754
3756 46754 45811 11496 324 -916 -6638 17641 27203 20357 -4634 3240 -3336 16205 38255
3743 38255 17746 -13221 -14838 -11990 -1025 16678 26370 31937 41024 37950 20604 3417 32
3730 32 -1718 -14902 35473 20742 -21090 -25866 -29579 -40430 -61158 -56691 -47618 -18714 -1933
3717 -1933 -6306 -4745 15597 8415 -11522 -26362 -13058 1925 2128 -3523 1230 -4204 537 29916
3703 29916 40619 6594 -30336 -33510 -18114 -4323 21091 6219 -758 5381 24384 28863 9273
3690 9273 16032 33940 37346 26714 1723 2779 23635 21076 14288 -1923 -15876 -3600 -1771
3677 -1771 -33804 -33408 -23234 -43974 -26551 -9816 -5516 -10964 -18387 -26337 -7915 16337 17759
3664 17759 10692 -7402 -17726 -4219 897 -18645 -4593 -2230 2365 -1135 -3127 3394 9484
3651 9484 692 -10259 -6011 20420 32609 31316 17161 10633 -9592 -13595 -6450 17996 26385
3638 26385 22491 24880 17050 -527 -39067 -37955 -26984 -57456 -31940 -5222 2213 14417 9132
3625 9132 -5372 3412 4024 -9137 -25912 -29610 -20341 4158 30196 54322 24265 -2663 -19535
3612 -19535 -24800 -10545 -18781 -9272 -5825 -21080 -411 22071 21937 -2833 13476 -2586 15183
3599 15183 21339 13388 17260 15328 15433 29380 -2845 -28426 -44413 -50111 -20386 26796 13038
3586 13038 -9035 -24726 -5945 6705 31537 39730 9005 -4069 -6757 -1099 -22307 -1835
3574 -1835 -2642 -15982 -21637 -16968 -11838 -12581 -5159 -6211 -38253 -53091 -47668 -33669 -58771 -47533
3560 -47533 -58974 -37525 -54254 -49480 -54947 -37579 -39294 -15839 -1626 -16737 -31419 -34857 -43354
3547 -43354 -45784 -39337 -32254 -14784 6318 4224 -27609 -63743 -51721 -43328 -43161 -26094 2801
3534 2801 -7429 -39208 -48834 -34818 -37335 -45799 -21790 -849 -8104 -17401 10901 13307 22398
3521 22398 2650 -48902 -61192 -50789 -35032 19 12442 -18201 -29290 -14457 6856 22591
3509 22591 26283 -8646 -22647 -16964 -3111 -10363 -686 30887 16698 18991 37770 41536 34839
3496 34839 11185 -15298 -24 6505 3045 19855 25975 10184 -5023 -24336 -17741 3059 -24605
3483 -24605 -46798 -54530 -36457 -30331 -14653 9036 1471 11994 26654 -748 258 20992 -2701
3470 -2701 24240 46197 18109 -11211 -23451 -44294 -55524 -45195 -24100 -30798 -14614 5218
3458 5218 -4621 -38910 -60890 -39368 -25269 -19982 -8632 -23057 -4444 -17194 -23301 -33965 -20572
3445 -20572 -14027 -3641 -19202 -25866 -2365 -3582 -50288 -41383 -30314 -28663 -43839 -24840 14198
3432 14198 34566 14423 -7317 -16945 -8497 -16847 -18618 -22743 -9976 17697 19283 15709 -21422
3419 -21422 -32072 -26064 -40994 -48459 -36440 -45617 -22786 -21013 -23602 11177 11828 9874 49227
3406 49227 44856 38370 7584 -39473 -66820 -57001 -36116 -38851 -39483 -38209 -30433 -27822 -20448 -30283
3392 -30283 -18517 -28073 -47787 -20144 -12892 -7885 -2179 -7134 6713 2075 4041 23968 25806
3379 25806 34460 22570 21389 3317 12117 28420 28198 50199 41732 10586 13411 10512 -22967
3366 -22967 -6405 24553 35138 51243 45355 39767 43617 28429 3786 10813 32795 64350 83296
3353 83296 64759 25941 27821 10934 19923 35497 25678 26388 5871 -27288 -27947 -4428 11782
3340 11782 8627 25562 40112 24041 16459 15437 14716 18177 29218 31756 22231 19293 27480 12078
3326 12078 5447 616 -2756 -2659 -24317 -20355 9489 -5754 -5736 14149 18011 14388 28880 13546
3312 13546 -5268 -2915 11930 -8934 -18891 -4204 14338 13320 12007 1618 -10274 -10911 787
3299 787 -2819 -9518 -14199 4337 18017 28586 25714 10679 -9287 -441 -11108 -31454 -32606
3286 -32606 -32727 -35132 -34745 -61498 -54999 -25719 -2238 -6288 -32427 -36350 -8000 -10801 1025 29678
3272 29678 29097 30404 9134 13683 27424 27126 29556 785 -24231 -28969 -2675 24662 -3930
3259 -3930 -32321 -14686 -13664 712 3830 -11554 -19266 -3645 -4989 -39433 -37624 -48683 -26412
3246 -26412 -12690 -7595 -14135 -23572 -11801 -4080 -10839 -18736 -15767 -23466 -13224 31236 40856 23016
3232 23016 46839 41784 24403 3992 -11726 -25320 4646 -5613 -21174 -18338 -2683 35825
3220 35825 37970 13794 -22 396 981 3104 21483 32481 9387 10097 -3003 -26636 -38787
3207 -38787 -39190 -14466 25963 57282 37737 -2589 -20478 -27189 -12471 4422 25732 2526
3195 2526 -7425 -46594 -61836 -50239 -42467 -27858 -23990 -43370 -55207 -37710 -10444 19001 3769
3182 3769 1459 -9970 8329 1782 9716 31078 48709 19762 -17539 -18933 -17870 -10054 -6348
3169 -6348 -30957 -49929 -47459 -53664 -48778 -30560 3811 17443 20433 10011 -9147 -3 9421
3156 9421 829 18395 38820 32448 46040 34731 34418 24765 22822 9352 -9432 10125 20835
3143 20835 28916 23617 12320 819 -2312 -22853 -13543 -16359 -20199 -37464 -42988 -7755 21703
3130 21703 28154 17878 -2600 -9413 -10987 -9350 -6671 -37046 -29218 -13668 -171 20586 41850
3117 41850 41189 17947 -573 -13496 -20837 -3694 16380 -8809 -22384 -32154 -12127 -6241 -15112
3104 -15112 -20131 -26382 -2853 3866 20179 57891 47428 14754 -9388 -23323 3583 26277
3092 26277 46190 73269 77029 36944 31264 24837 -546 -18133 -1875 21657 8646 9833 2055
3079 2055 12629 -2234 -15874 -12338 -28795 -58299 -44155 18220 43564 21648 1945 23069
3067 23069 40461 26352 26242 22955 -1896 11321 24501 8154 6629 16159 29688 30093 -6085
3054 -6085 -22882 -18789 -16788 21276 30863 40098 37153 40387 27851 13902 -14922 -16394 -27
3041 -27 32217 41986 26458 497 3421 14003 7171 5017 11020 38203 32674 15226 5600 -14923
3027 -14923 -13916 -43499 -42484 -35161 -28646 -24053 -4619 -6791 -32601 -7604 -8639 -10165 7550
3014 7550 1539 24111 -5781 -7372 -12275 -20967 -39015 -35355 6334 27354 30064 6665 -14257
3001 -14257 -1234 -9284 -676 4768 4933 -7072 -12070 -9578 32350 38605 26454 8014 11914 22170
2987 22170 7963 28607 49901 36543 14051 28876 9382 -17863 -26470 -5302 10893 4144
2975 4144 11648 29646 34511 2228 -7830 22279 32341 30517 9855 -8718 -1729 23488 19762
2962 19762 10990 11479 -14355 -29945 -3936 -20077 -15401 33044 40983 25892 21290 44473 53475
2949 53475 45618 39419 63702 43071 23261 24867 41076 29051 19107 25774 22205 5389 -19636
2936 -19636 -23917 12702 39808 40003 52230 21431 25153 40820 37452 26303 6040 22239 -1030
2923 -1030 -4349 -1604 273 12041 14218 29560 2703 -14568 -7212 3595 -25409 1877 10697
2910 10697 21208 52796 84180 70157 62313 36205 12414 6406 -6176 -12364 -15913 -8632 -5062
2897 -5062 -2887 -863 -27985 -6029 41047 38948 26266 38996 30114 459 -8408 -9434 -36
2884 -36 10094 1786 -3677 -10666 -923 24776 22998 -5480 7881 4838 15742 20658 10623 -12542
2870 -12542 -15864 -18447 -1398 31662 14898 21470 31715 29274 43565 45646 42265 74025 57362
2857 57362 19788 -14137 -19363 8645 39753 44622 18135 1758 848 -10926 -28190 -23632 -38263
2844 -38263 -77343 -64693 -52436 -27784 -32099 -24955 -7653 15021 24147 41368 10474 -70
2832 -70 36614 25513 21736 36552 41305 41860 46449 40518 45999 27818 33348 60081 79256 67929
2818 67929 89797 88073 47945 30017 6881 -13697 -8412 -35843 -33738 -13207 -13115 -12804 -1784
2805 -1784 25752 20884 8924 27727 60925 71516 41290 -2752 -18335 -2044 535 -7386 -424
2792 -424 9114 30875 25773 -5345 -19573 -13365 -21313 -11507 -3726 26154 40729 28235 38682
2779 38682 29778 24907 61337 58627 52977 43543 45773 33721 29030 30631 32076 20783 6415 25215
2765 25215 34249 22256 -1875 -33446 -22157 7308 19122 18754 -5454 -16031 -2803 -33661
2753 -33661 -45757 -18289 -3948 20290 29141 3029 21238 21919 30845 43741 40033 20070 20796
2740 20796 29565 13059 -22871 2557 6107 -9886 -12466 -9695 -6916 -39688 -67978 -94894 -72010
2727 -72010 -37356 -18438 -33592 -32739 -31475 -28686 -12892 16373 -8707 -16036 -4245 18500 4215
2714 4215 1529 3119 15391 11244 25451 63064 46329 22483 15961 30193 26548 -703 -5136
2701 -5136 -29713 -36448 -57471 -81595 -63308 -34544 -6993 1963 7012 -7638 6710 25915 34401
2688 34401 34556 16226 13987 -12349 -38214 -27791 -41825 -41457 -21812 -13628 -37860 -59895 -48232
2675 -48232 -26988 -18789 -24639 -18739 6601 12909 -2388 256 19748 -7507 -3600 6139 -12716
2662 -12716 2682 48380 37776 20027 10229 -11436 -27755 -23337 -11631 6756 6093 -4485 -11567
2649 -11567 -36775 -34805 -14008 14675 18077 5551 -36533 -40239 -39324 -28928 -16111 2370 22596
2636 22596 41540 24963 -6733 -27318 -7139 17561 35062 12262 11025 22255 28087 -5472
2624 -5472 -19863 -41739 -10118 8292 19504 2584 -29654 -72357 -63627 -64985 -58122 -45514 -20214
2611 -20214 4958 -1060 2366 14874 14401 -6128 12941 20608 -2940 -7076 -10888 -14456 -20356 2040
2597 2040 14380 6817 23154 -4052 -15756 -13426 -1192 5173 11915 1214 -23894 -38680 -14180
2584 -14180 -13789 -39111 -55386 -21299 -11018 -18137 -19194 -726 -19942 -26492 -30423 -14134 14484
2571 14484 17367 6811 -20022 -25016 -4992 -17778 -15681 11950 -6412 -25526 5213 13323 1197
2558 1197 -7323 -6652 -21344 -18327 -1143 2107 -15206 -9529 -7823 3097 23621 2154 -13936
2545 -13936 -23646 -16831 -10309 -10831 -25102 1185 -1100 -13155 -12993 -7634 -4647 6505 4154 -2230
2531 -2230 12969 15828 -5121 -18978 -19142 21616 17636 -5300 -4402 -6419 25315 34115 24524 23
2517 23 11678 -4065 -19720 -14045 4487 17172 25002 46487 44264 9623 484 7254 3662 -4410
2503 -4410 10165 -14949 -32296 -13510 -1462 25320 30102 8099 15238 9821 3906 -7343 -24419
2490 -24419 -19539 -101 -5716 6253 17905 25576 48172 -1368 -38830 -40801 -7217 11348 -2747
2477 -2747 4479 21464 10933 -18605 -38447 -35640 -8560 -14876 2497 20890 24702 17732 42644
2464 42644 26879 6738 -19305 -21326 -12237 7346 22459 11038 19879 49619 63748 35093
2452 35093 26548 320 -11564 9750 11708 10491 -5918 -24378 -25025 469 -10658 -3876 -1792
2439 -1792 -34842 -57506 -67177 -19064 12192 14222 39445 33635 4061 -13352 -16111 -11424 -9636
2426 -9636 -12977 5622 9221 -3852 921 11902 44928 34848 12723 3426 18701 33512 18001
2413 18001 -12533 -38984 -45086 -18956 -16001 -11900 -26371 -19628 -13796 -19354 4361 2748 -8282
2400 -8282 -5857 -22409 -8835 11447 7321 -13961 -5317 208 -32181 -42645 -42695 -4038 19981
2387 19981 9749 22773 3377 9986 17102 13212 28613 11858 -10687 -6764 18677 31099 38029
2374 38029 20381 154 -1285 -30543 -43682 -3954 26606 19566 -3672 -14616 151 25464
2362 25464 25129 29915 5921 -11946 -26584 -1404 19249 23827 -1876 -9719 -1078 -6280 -12108
2349 -12108 -1583 2682 13036 10438 -26990 -43060 -31750 -6200 -6299 26108 26418 25354 31026 21763
2335 21763 21881 9466 2609 -11671 15346 10386 3954 -5107 6732 12994 35354 40360 35247 13052
2321 13052 -3778 1898 7170 4323 4997 17293 27430 23870 38760 26593 13366 12666 7975 5805
2307 5805 8866 12072 26306 9581 -737 11748 11220 -6662 -3176 4678 -18245 -33670 -55553
2294 -55553 -47023 -43905 -31789 -24953 -12394 -25336 -34695 -39791 -39005 -21283 -25558 -28379 -13886 -3346
2280 -3346 -11946 10974 23797 10967 -1422 -2561 12701 14399 -16132 -9066 6453 18188 21786
2267 21786 16024 -3994 -7482 -1509 27247 52496 44347 16380 3349 -3031 -5965 -23579 -32744
2254 -32744 -14064 11895 13887 14845 21988 38228 37780 34295 25750 40004 23038 10116 20129
2241 20129 14200 31098 25666 17096 26839 57191 57985 28881 1009 -4863 -32502 -58102 -16688
2228 -16688 -8864 -260 1509 7094 -4332 23683 47069 43623 29157 32441 30316 37025 44737 52513
2214 52513 37202 25092 16362 8567 9735 20595 27418 25847 22069 44388 38478 8114 -7533
2201 -7533 -43502 -23118 1730 13007 -23988 -15712 -12922 -16952 -1138 13256 12427 4979 6824
2188 6824 16526 5045 -36130 -25082 -4138 -6412 -9002 -20159 -7831 -5487 -11740 -22189 -61367
2175 -61367 -58318 -32974 -37996 -27982 -4702 1135 1236 13478 -2328 -8089 -155 16076 30474
2162 30474 45520 66258 73242 50371 15859 13500 37252 37870 23309 5561 -2944 -10216 -3401
2149 -3401 -18545 -33310 -45062 -36649 -35203 -24662 -2757 9551 24534 28864 25944 34334 1426
2136 1426 -683 -8956 -19406 -11897 -626 -1413 20532 24363 -23261 -45673 -44097 -44653 -40725 -48428
2122 -48428 -44378 -23833 -25055 -34464 -8684 12968 14529 2581 -11493 -10505 -10374 -20123 -10981 -6124
2108 -6124 -9426 4512 -11970 -37261 -32178 5966 63949 61500 18405 -6330 -4523 -16359 -26512
2095 -26512 -25261 -24007 -15381 -9999 -42370 -39465 -18062 -9099 -13986 -30236 -44879 -26271 12415
2082 12415 16499 32721 36049 23031 12134 4171 -2868 -7557 -7977 -11134 -2681 -8576 12398 -6146
2068 -6146 -31623 -17676 24772 43583 37525 36564 43637 27882 32016 37635 32256 26228 21223 24003
2054 24003 19053 924 -11637 -24284 -30880 -44660 -16122 -10348 -13974 -6478 18298 36569 27509
2041 27509 7310 -5571 9731 15559 20464 26651 36460 18349 -7137 -29508 -48808 -44233 -35105
2028 -35105 -24690 -18210 -14671 -1716 23079 30370 22741 22914 14561 -6358 -11449 11352 18906 -583
2014 -583 -15948 -11268 -8407 -17811 -43131 -51999 -31129 16536 10295 6318 7622 -8523 -23262 -9252
2000 -9252 -4535 -11230 -4551 18189 8842 -14027 -36197 -47670 -25261 -34087 -5836 21102 38557
1987 38557 57002 7999 -22690 -32865 -41991 -33679 -33252 -18370 -6775 11427 19298 22206 6287
1974 6287 276 10800 11027 18775 13138 -869 19638 17888 -919 11853 19472 27649 46583 54850
1960 54850 31347 28629 15262 18983 36153 27396 6006 -12358 -23793 -23146 -25907 25863 43121
1947 43121 34837 -7796 -5057 22186 27930 25787 -7210 -45924 -36398 -22738 -34360 -15846 -9631
1934 -9631 70 -5043 6550 -6501 -12948 8037 19870 5581 -24748 -45 14843 21221 31597
1921 31597 12487 -16776 -4704 9372 657 1400 -5569 -8525 16062 27208 37344 33795 21597
1908 21597 16237 15829 5998 -20538 -32385 -21257 -16366 -24824 -10910 11111 25452 25236 19911 12072
1894 12072 21564 44704 34661 7824 7837 13852 10107 36650 39725 53372 79816 51158 28404
1881 28404 35213 33416 51047 40255 23540 31652 32429 32267 38041 37963 30226 15215 7131 22091
1867 22091 2261 -4683 -360 10899 50926 29846 -13122 -7886 -1923 -4840 15010 23767 36413
1854 36413 16776 9704 13042 -2823 -20720 -22078 -22173 7082 28240 43595 23764 -18993 -47397
1841 -47397 -42241 -14073 8082 7251 13791 17903 -1368 -3234 2393 2655 -30547 -13588 23877 20002
1827 20002 17971 642 5259 -1054 -12488 11371 4086 2937 9172 17667 44576 44137 41345 51726
1813 51726 47023 37998 25553 19910 25426 1740 -13095 16517 9260 19 -2614 -15756 -34322
1800 -34322 -16107 -3970 -13324 -16190 3762 9232 5558 -17641 -25606 -12084 16147 12454 1064
1787 1064 -6075 -8332 6367 13144 25102 8484 -12042 783 3868 -1944 -3388 -4114 -16299 2111
1773 2111 -4329 -28050 -50090 -39184 -30495 -17746 250 6969 -8824 -5302 -8391 4105 -6060
1760 -6060 -38485 -37273 -24172 -26303 -23433 -3624 16155 -7741 -26413 -29568 -35933 -18575 -4173
1747 -4173 -16535 -13006 5129 17827 13823 12684 24614 11277 25147 43098 9255 -25260 -13791
1734 -13791 -65 -13598 -17942 12269 26817 13173 234 8274 -12849 -29493 -62464 -33811
1722 -33811 -13197 -10029 7463 7342 -647 -9137 6380 -12394 -10904 3880 16774 23020 18566
1709 18566 7731 -3755 -35574 -15545 -5337 22622 38628 45324 39948 46401 35026 38506 55691
1696 55691 57360 36813 24321 36135 40081 33141 11330 6300 14311 13615 3361 -1632 -4081 11039
1682 11039 29136 44106 46452 42329 30552 4599 -1610 -10216 -5211 -31886 -53720 -24089 -4883
1669 -4883 13737 7054 21710 10781 -13123 -14488 -9518 978 20908 47131 30356 21754 22143
1656 22143 29643 42130 46150 31146 4184 -6122 -7181 -26499 -26229 -41957 -36991 -22637 -13903
1643 -13903 7194 21236 32904 24641 46501 47101 24244 22987 23061 16611 3219 21992 30315 6332
1629 6332 10618 42901 62959 54892 39409 29522 28343 6853 -425 3954 13685 21310 2634 -4123
1615 -4123 -22106 -21983 -16560 -13773 17760 38717 19887 30220 54374 62280 20994 22985 33317
1602 33317 12500 12683 9251 -18995 -34066 -27934 3067 24620 27340 -12404 -30982 -21386 11798
1589 11798 8458 15256 20684 12455 -2074 -16221 9746 11429 -4161 -20869 -21762 -23587 -15359 -12329
1575 -12329 -17065 -18411 -21991 -22165 -10292 8524 -2499 -4095 12500 21928 12994 3592 -1005 -6067
1561 -6067 -20839 -26750 -27326 -27218 -20336 11098 18520 13724 -20777 -15758 -16265 -52289 -36587 7889
1547 7889 -13611 -30232 -35511 -31706 -61555 -27712 -1164 -17057 -43760 -50073 -52067 -34594 -12777
1534 -12777 -5354 -16381 -46633 -50180 -13622 24335 29908 38030 42962 21653 30756 60774 47779
1521 47779 3026 -47855 -60050 -38928 -17337 -33216 -24040 15734 11033 -997 12993 26953
1509 26953 5044 7642 6487 15764 39546 41044 30140 21615 9974 31247 24081 2026 21570
1496 21570 17477 3487 21228 10955 4864 10978 27381 24030 27192 -5479 -35523 -12525 3563
1483 3563 2382 15323 26937 13438 -1722 -8515 -29849 -25181 -1166 -25755 -42405 -77078 -84509
1470 -84509 -64332 -46749 -42004 -37704 -40642 -8827 -18754 -30342 -37182 -43703 -37617 -15046 -27974
1457 -27974 -12165 -6476 -8684 4303 7841 -13326 -5148 4121 5297 3455 11346 14679 2584 -3800
1443 -3800 13587 12160 14816 870 -15780 14261 14802 12521 11451 13239 51731 32174 -368
1430 -368 996 4842 -3670 -7214 4843 507 -18833 -3308 13772 40777 22456 12741 17212 7401
1416 7401 -5900 -21307 -22928 1292 11186 -15146 -38523 -16735 -8375 -10302 4689 14162 -6149
1403 -6149 1582 25686 9262 4109 13348 12340 -6497 -25825 -27115 4597 17058 8193 7544 -2934
1389 -2934 -10725 9262 35230 19600 30347 36847 51078 47973 48651 56363 41268 30347 50632
1376 50632 65301 58794 49593 8838 -16115 1397 13647 26139 10687 13958 8436 12308 32307
1363 32307 40474 23183 29679 30478 -4675 -38009 -23367 23249 44300 77717 70735 42370 31780
1350 31780 39425 22508 -2671 -22295 1277 3261 28094 53847 58804 59120 35328 15599 21438
1337 21438 44634 32224 15983 13086 18859 23844 1983 -13049 -23087 -19797 -14413 -25890 -33742
1324 -33742 -32357 -5476 1573 -5353 6505 22054 13972 -14595 -13843 3760 25169 18315 42113
1311 42113 33981 58056 54126 34646 15623 7685 25480 25232 16989 26063 23576 12086 -1532
1298 -1532 19823 4228 -6332 -7900 27886 32600 23704 10178 -9732 -26214 -2574 15287 33560
1285 33560 37128 31348 37135 23640 -2499 -14978 -15490 -8186 -21833 -35218 -28442 -27342 -13651
1272 -13651 13776 32343 -4136 -22078 -35272 -31729 -32985 -26366 -25314 -33940 -38339 -15383 15191
1259 15191 1084 -13040 11973 12183 20306 39422 46424 22843 -13936 -34632 -14556 -2268 12610
1246 12610 1210 -7134 -5877 -37253 -62864 -70493 -40256 -11618 132 -8683 -12808 -21497 -33952
1233 -33952 -17352 10853 31609 33491 23140 3768 13560 17268 34439 65046 54069 37870
1221 37870 10165 2499 -11562 -17147 -25092 -6672 -508 7324 17823 23082 46844 44568 58384
1208 58384 45181 26034 25551 15473 18343 24327 17987 21872 39838 29865 32227 46604 33502
1195 33502 38570 23099 29579 17083 -7404 -11095 -43269 -11325 1993 16146 32787 52767
1183 52767 28982 -2463 -3311 -4569 22937 38523 -3726 -16497 -24881 -7655 17191 23109 6400
1170 6400 -14754 -5799 4319 13042 27994 36173 21073 6273 -24055 -33340 -13748 -15475 -2246
1157 -2246 -12580 -17463 1553 32919 66547 52688 12240 -27645 -42596 -45981 -38168 -8094 10371
1144 10371 5714 6877 1324 -1030 -1477 -22623 -42639 -34588 -17556 -932 17294 469 4883
1131 4883 -6178 -11835 -15342 -479 17225 32471 20378 8627 -16338 -49503 -58378 -27076 -2011
1118 -2011 -17730 -37229 -22529 -16733 -40422 -33738 -3459 16674 18466 20727 42028 20909 -22760
1105 -22760 -16669 7013 -11950 -19594 -16557 -42366 -34703 -21819 -9028 -8373 -4449 1854 37349
1092 37349 55148 27114 2194 -35684 -40986 -39734 -17887 22623 36149 35107 19344 50834
1080 50834 43878 29287 42102 31037 26050 5923 20901 37611 17109 6917 12263 12565 7039
1067 7039 -6497 -219 -12484 -3153 25729 54971 20710 9769 7693 -6616 -1855 -17639 -33605
1054 -33605 -29819 -25506 -9322 18172 717 -26982 -24179 -14213 -24227 -15984 -10443 -5945 2604
1041 2604 -997 11631 15673 8664 17520 37351 22871 2049 -7983 646 -4767 -13962 -28001
1028 -28001 -29029 -7025 19121 12077 17457 30063 12907 -2481 -4677 -15564 -33104 -63678 -83852
1015 -83852 -58570 -11892 -5080 511 9458 -2455 -8880 -37407 -45414 -29439 -15767 -5567 -4583
1002 -4583 -1959 -9203 -13867 -23535 1704 17182 33944 44414 12320 19882 43720 35920 -3610
989 -3610 3878 3494 -13010 -23062 -2216 12423 -28403 -56247 -74228 -62142 -32560 -25972 -29244
976 -29244 -38731 -38350 -10640 16798 32071 51347 40654 33035 20885 33862 30051 22235 6396
963 6396 22903 47722 53514 53372 36399 19520 -9917 -52685 -39509 -34470 1589 21929 17630
950 17630 4199 18963 44825 31028 17998 -11481 -21810 -2555 49182 82887 79727 55696
938 55696 49245 41526 41234 -51 -32021 -26805 -26027 -19104 2411 -3886 -18220 -33811 -18878 329
924 329 -2150 -17189 -23984 9677 28378 1804 3061 -4030 -3362 12151 -2828 20234 15949 12655
910 12655 9743 44470 23576 -2708 11850 19554 29514 26181 -7072 4923 -1427 -10256 -12606
897 -12606 -8736 -13001 -6990 -9006 -31669 -21010 -8548 5547 17801 -7875 -15748 2265 -5320
884 -5320 -27070 -16958 -3553 -15839 -14242 -15677 -21784 9597 39687 26069 29422 34174 12710
871 12710 17340 6462 17230 17689 5653 -21467 -61816 -45471 13783 35061 -10302 1557 12268
858 12268 18599 985 -2940 3334 19467 19057 28425 -5981 -10595 -75 3790 8834 13085 16692
844 16692 -26819 -46153 -22980 -16125 -14514 -20915 -61111 -59440 -47089 -19465 6264 11985 31108
831 31108 18321 8763 -10929 -35507 -6763 19801 -4257 -25149 -38303 -36247 -25153 -28587 -31430
818 -31430 -31887 -20040 -14257 27920 56015 67043 75410 69187 82010 78749 44242 23687 29013
805 29013 20863 8666 38196 71987 51299 30865 21122 23476 8270 27524 27832 3015 10232
792 10232 -799 -12874 17711 15831 1394 16 -2580 13692 9652 17381 23932 35652 26204
779 26204 41161 61380 49904 41692 22616 12580 30381 32391 32934 4041 18657 9945 -32487
766 -32487 -43436 -23773 -9058 4645 28395 13657 -15807 -54335 -55915 -35688 -14551 -2634
754 -2634 14094 23419 26955 19811 -18398 -10391 -5695 -11799 -12017 -6744 34561 67971 46148 23412
740 23412 -5193 -7072 11750 4184 9897 7008 -9173 -13259 -24672 -29807 -8150 -4851 -9532 -3337
726 -3337 12071 25701 36169 53113 49705 39044 30397 32296 23975 5834 10775 40615 41651
713 41651 12727 29476 50217 49450 43258 31472 30837 34766 45011 19426 1182 1994 16735 48139
699 48139 60750 59811 92394 83694 63443 57315 20381 23574 32435 22725 6358 4279 -1640 -7611
685 -7611 -20094 -14115 2342 2515 18093 24521 33889 12751 17340 20246 22855 33354 61793 66741
671 66741 49363 49880 56133 53225 57369 48304 18649 12846 36950 54924 36015 37725 16036 -4970
657 -4970 -26743 -21904 -20276 -23477 -46432 -16629 -7196 -14211 -9636 4806 17589 53525 88564
644 88564 91965 47422 26258 4339 15436 28219 11743 24717 38563 40855 34850 3621 1455
631 1455 20830 46329 39205 54483 49661 53774 46264 10686 -23482 2279 17309 4548 -2182
618 -2182 5760 6058 -10871 7999 9307 -1358 6283 -13389 -11487 -5818 25252 31694 29646 17710
604 17710 9989 11550 28153 29405 30698 55924 69733 66335 46409 8832 14802 39307 50521
591 50521 44663 21607 10237 32881 55877 45494 29810 5375 -11619 -23359 -17804 8515
579 8515 -3900 -5673 -7275 -4977 20484 24332 17585 9890 23568 43371 45713 33474 32762 27923
565 27923 17350 51913 48590 38150 54914 46552 39814 40247 17248 5983 17309 30210 46881
552 46881 55152 58168 55678 32384 26128 19184 5439 3044 -1935 -7389 -8229 -22565 3513 26329
538 26329 9914 7821 26885 24652 1686 -30927 -18136 3555 5260 8753 -14502 -15020 13510
525 13510 8294 -4997 11035 31773 6794 15763 7632 -7135 -32618 -28778 1338 21932 15241
512 15241 19566 24709 31099 31424 12441 -14587 -19900 17900 42572 43417 49336 59602 62214 56576
498 56576 41113 19690 4340 15180 34110 14555 2122 -2034 -26350 -26193 -23936 -3115 -633
485 -633 5150 11252 660 -3194 -28421 -26025 -5825 48654 67874 39037 35889 11465 5413 26718
471 26718 28464 31778 11110 31536 28125 29473 40392 43057 23974 11867 -3138 -22535 -32874
458 -32874 -8513 -6355 -3882 8792 4848 12122 29487 24475 22489 29628 -8838 -12017 -10404 -14551
444 -14551 -28871 -19232 -7594 -13454 -10923 -71 9478 7505 2144 14961 27148 26586 5082 4149
430 4149 -8253 -7798 -12746 -262 18755 45660 61411 71522 71403 50441 46286 42788 14594 6375
416 6375 37323 32076 31450 15950 13764 26975 33527 33736 44152 66299 87424 46911 27328 10019
402 10019 -13306 -19774 14204 9858 22738 32257 20223 7187 21403 20279 34632 34663 9862
389 9862 -5994 29963 51335 49958 6658 -21408 -24384 3322 27019 35131 35742 34166 29469 33713
375 33713 51075 63545 44715 48657 29121 13984 2068 7311 3768 6418 33489 22155 16772
362 16772 20183 3257 -7241 13629 6026 8014 14804 12657 40434 70047 83674 68855 35028
349 35028 15581 30274 44888 46628 21932 9577 20720 9819 -11422 -8225 -13583 -14584 -8458
336 -8458 -9433 8980 10799 -2882 3059 -14762 -4410 -9722 -21128 -21690 -2925 18647 30112 30337
322 30337 23784 28632 20230 21607 13763 33318 12346 -5370 -1440 -21973 -18984 4432 13922 20593
308 20593 9385 -1121 16442 7063 -1981 27985 37891 19987 16331 40041 53055 41717 43787
295 43787 20869 30909 70292 64089 53322 31543 23184 17264 22450 47706 58228 23323 2859
282 2859 -5707 5777 22107 19316 23151 20870 40643 31604 20209 18748 13670 21513 25818 23034
268 23034 28737 28199 17453 9837 21020 30878 26120 25949 32343 37217 54887 57411 46584 41152
254 41152 29403 31274 27799 37462 22382 2438 -8595 -13792 2703 20226 8217 27740 27740 32225
240 32225 30655 23327 9528 9701 35730 40661 15338 -4834 16260 38251 44918 49291 36383
227 36383 21011 27095 23701 12945 -4395 -9342 18482 30917 38452 36233 12796 -2887 -27311
214 -27311 -11330 3454 25896 26908 4413 -3174 -4114 -14686 -10709 -21975 -19055 21658 44702
201 44702 34611 11496 64 -3452 -7065 -9865 -3989 9134 37621 29125 19268 28370 24595 13735
187 13735 -13139 -23656 -7852 4570 18966 25298 32666 32750 36687 30097 9378 -14211 -11904 5113
173 5113 9257 -2688 8664 1343 10791 14499 -9995 -16557 2268 5650 22631 31391 16865 18962
159 18962 17683 16313 -419 -16642 -23294 -7500 6236 14030 7787 12813 5177 11330 14399 8382
145 8382 -2105 9465 20977 28594 13690 7498 -962 -9463 -6262 1363 10509 -72 1626 1667
131 1667 6453 -7414 -17672 -3057 27362 46841 38188 37785 46469 56076 61453 53656 41165 39925
117 39925 49275 46508 45052 33338 28147 38885 17819 27887 54482 41665 35317 22026 -115
104 -115 -20697 6835 36813 34631 34898 16060 -12266 -12714 7353 24621 26741 13852 12174 14816
90 14816 11911 9008 3769 -3461 11156 17912 29012 33390 38756 36490 29893 42498 46298 34248
76 34248 32957 41985 42205 46203 34163 18682 37853 35297 28800 20555 14193 7404 7123 -8995 -41523
61 -41523 -17691 3917 -2573 -2328 748 4824 22196 27857 13544 25153 24597 24677 15957 -9899 -1817
46 -1817 1075 -14057 -22376 -26996 -11273 -3139 16056 18064 471 -9302 -2349 13315 32559 21305
32 21305 10945 16137 33551 35600 39060 25883 29494 38721 41439 28784 12615 15187 11562 25136
18 25136 32490 36413 24726 -816 -20019 -21843 -25254 -19586 6865 29036 39881 20058 27135
5 27135 37206 40218 23357 23975 29030
0 29030
$$ Imaginary data points
##PAGE= N=2
##DATA TABLE= (X++(I..I)), XYDATA
32767 149531 162233 168304 160711 155413 172406 190208 211667 197803 199879 197406 185906 186899 167189
32754 167189 160695 179748 177738 199023 211258 211506 204766 200453 198758 199401 198428 185612 184874 194397
32740 194397 217026 216633 197272 188274 180046 174807 185159 191690 194488 216234 234827 216303 195647
32727 195647 200118 219973 243341 248078 227426 222322 230589 231658 236988 239576 222510 217266 227629
32714 227629 245497 234881 238171 252242 250809 248037 249433 244069 258578 242268 244482 259475 262507
32701 262507 250126 253853 254839 241503 238622 262950 244935 253479 282154 281074 258610 251670 265665
32688 265665 259598 264883 262838 271492 267663 268917 267931 250472 239601 254288 280317 292588 300966
32675 300966 320838 311330 292709 288039 307617 295755 310645 305071 289730 277785 274881 278537
32663 278537 292343 313736 313121 295309 297146 311102 326294 322097 316870 318454 313751 299327 303837
32650 303837 295557 306774 326447 325465 314960 310553 323759 327582 312550 316611 320151 326811 334851
32637 334851 338501 336671 368075 392335 380884 343167 344066 363925 369742 355922 350196 357531 376930
32624 376930 380493 373451 356310 337977 327304 326799 335895 351905 365184 374209 380059 362332 364718
32611 364718 345403 338422 356087 374708 396381 372509 366705 383729 375289 360113 370784 378803
32599 378803 375042 388994 396390 397468 404579 396320 392918 385502 395266 396202 373703 358578 359720 365213
32585 365213 371136 382604 387436 398670 419678 416475 421340 406103 386935 386171 379523 381841 387267
32572 387267 383023 380711 382152 392152 410567 424212 427845 429699 408381 404701 412215 419551 428602
32559 428602 434100 418162 421905 433090 447059 457633 478738 454550 454394 455553 444829 444817 444801 429344
32545 429344 430124 437641 449991 447140 437153 433475 440046 460186 460564 469016 468523 465579 463701 484882
32531 484882 473668 465681 473168 447025 439159 447253 454024 456701 456144 439717 449094 448814 450989 463355
32517 463355 464625 479738 483057 482901 490560 497750 497092 483577 480568 474596 482277 478858 482335 479870
32503 479870 475236 492196 484997 481665 474579 470380 466088 456514 462436 451938 471244 491849 498616
$$ [...]
##END NTUPLES=NMR SPECTRUM
##END=
