##TITLE=Analysis number 328858
Compound Code cc 62702
Book Reference 521/89
Project Code adrs
Chemist Name evam
##JCAMPDX= 6.0         $$ Bruker NMR JCAMP-DX V2.0
##DATA TYPE= NMR SPECTRUM
##DATA CLASS= NTUPLES
##ORIGIN= Bruker BioSpin GmbH
##OWNER= nmr
$$ XWIN-NMR		Version 3.5
$$ Tue Jul 10 13:40:54 2007 GMT Daylight Time (UT+1h)  MAYBRIDGE\nmr@NMR_250MHZ
##.OBSERVE FREQUENCY= 250.131544655141
##.OBSERVE NUCLEUS= ^1H
##.ACQUISITION MODE= SIMULTANEOUS (DQD)
##.ACQUISITION SCHEME= undefined
##.AVERAGES= 16
##.DIGITISER RES= 18
##SPECTROMETER/DATA SYSTEM= dpx250
##.PULSE SEQUENCE= zg30
##.SOLVENT NAME= CDCl3
##.SHIFT REFERENCE= (INTERNAL, CDCl3, 0, 16.522)
##AUDIT TRAIL= $$ (NUMBER, WHEN, WHO, WHERE, WHAT)
$$ ##TITLE= Audit trail, XWIN-NMR		Version 3.5
$$ ##JCAMPDX= 5.01
$$ ##ORIGIN= Bruker BioSpin GmbH
$$ ##OWNER= nmr
$$ C:\u/data/dgb/nmr/ADRS/730/pdata/1/auditp.txt
$$ ##AUDIT TRAIL=  $$ (NUMBER, WHEN, WHO, WHERE, WHAT)
(   1,<2007-07-10 13:40:03.99 +100>,<MAYBRIDGE\nmr>,<NMR_250MHZ>,
      <created by zg, POWCHK disabled, PULCHK disabled
       configuration hash MD5:
       76 6E 9A 78 1E 09 19 81 EC 84 63 8F B0 6A 59 2D
       data hash MD5: 64K
       1D A4 E4 BA AA AE 46 D5 DA 5D 4C 59 7D BC 0E 22>)
(   2,<2007-07-10 13:40:31.38 +100>,<MAYBRIDGE\nmr>,<NMR_250MHZ>,
      <Start of raw data processing
       ef LB = 0.3 FT_mod = 6 PKNL = 1 SI = 32K 
       data hash MD5: 32K
       58 37 B8 A3 7E C5 29 09 2E 4C 9D D8 2C 57 57 1C>)
(   3,<2007-07-10 13:40:36.37 +100>,<MAYBRIDGE\nmr>,<NMR_250MHZ>,
      <apk 
       data hash MD5: 32K
       46 5A EF D3 65 8C DF 4A 29 77 B0 09 73 27 0A 7D>)
(   4,<2007-07-10 13:40:37.88 +100>,<MAYBRIDGE\nmr>,<NMR_250MHZ>,
      <abs ABSG = 5 
       data hash MD5: 32K
       BF 38 C3 AE 26 CF A1 42 B9 53 2A 99 66 7C 04 DB>)
$$ ##END=
$$ 
$$ hash MD5
$$ F3 91 B3 3A C7 4A C2 14 39 B0 34 65 92 BE C8 2C
##$RELAX= 
##$RELAX= 
##$RELAX= 
##$RELAX= 
##$RELAX= 
##$RELAX= 
##$RELAX= 
$$ Bruker specific parameters
$$ --------------------------
##$DU= <C:\u>
##$EXPNO= 730
##$NAME= <ADRS>
##$PROCNO= 1
##$TYPE= <nmr>
##$USER= <dgb>
##$AMP= (0..31)
100 100 100 100 100 100 100 100 100 100 100 100 100 100 100 100 100 100 
100 100 100 100 100 100 100 100 100 100 100 100 100 100 
##$AQSEQ= 0
##$AQ_mod= 3
##$AUNM= <au_zg>
##$AUTOPOS= <15 >
##$BF1= 250.13
##$BF2= 250.13
##$BF3= 250.13
##$BF4= 250.13
##$BF5= 500.13
##$BF6= 500.13
##$BF7= 500.13
##$BF8= 500.13
##$BYTORDA= 1
##$CFDGTYP= 0
##$CFRGTYP= 5
##$CHEMSTR= <none>
##$CNST= (0..31)
1 1 145 1 1 1 1 1 1 1 1 1 1 1 1 1 1 1 1 1 1 1 1 1 1 1 1 1 1 1 1 1 
##$CPDPRG= <>
##$CPDPRG1= <>
##$CPDPRG2= <>
##$CPDPRG3= <>
##$CPDPRG4= <mlev>
##$CPDPRG5= <mlev>
##$CPDPRG6= <mlev>
##$CPDPRG7= <mlev>
##$CPDPRG8= <mlev>
##$CPDPRGB= <>
##$CPDPRGT= <>
##$D= (0..31)
0 1 0 0 0 0 0 0 0 0.06 0 0 0 0 0 0 0.0002 0 0 0 0 0 0 0 0 0 0 0 0 0 0 
0 
##$DATE= 1184071200
##$DBL= (0..7)
120 120 120 120 120 120 120 120 
##$DBP= (0..7)
150 150 150 150 150 150 150 150 
##$DBP07= 0
##$DBPNAM0= <>
##$DBPNAM1= <>
$$ [...]
##$SUBNAM7= <"">
##$SUBNAM8= <"">
##$SUBNAM9= <"">
##$SW= 20.6930455092707
##$SWIBOX= (0..15)
0 0 3 0 0 0 0 0 0 0 0 0 0 0 0 0 
##$SW_h= 5175.983436853
##$TD= 65536
##$TD0= 1
##$TE= 296.16
##$TE2= 300
##$TE3= 300
##$TEG= 300
##$TL= (0..7)
0 120 120 120 120 120 120 120 
##$TP= (0..7)
150 150 150 150 150 150 150 150 
##$TP07= 0
##$TPNAME0= <>
##$TPNAME1= <>
##$TPNAME2= <>
##$TPNAME3= <>
##$TPNAME4= <>
##$TPNAME5= <>
##$TPNAME6= <>
##$TPNAME7= <>
##$TPOAL= (0..7)
0.5 0.5 0.5 0.5 0.5 0.5 0.5 0.5 
##$TPOFFS= (0..7)
0 0 0 0 0 0 0 0 
##$TUNHIN= 0
##$TUNHOUT= 0
##$TUNXOUT= 0
##$USERA1= <user>
##$USERA2= <user>
##$USERA3= <user>
##$USERA4= <user>
##$USERA5= <user>
##$V9= 5
##$VALIST= <valist>
##$VCLIST= <CCCCCCCCCCCCCCC>
##$VD= 0
##$VDLIST= <DDDDDDDDDDDDDDD>
##$VPLIST= <PPPPPPPPPPPPPPP>
##$VTLIST= <TTTTTTTTTTTTTTT>
##$WBST= 1024
##$WBSW= 4
##$XGAIN= (0..3)
0 0 0 0 
##$XL= 0
##$YL= 0
##$YMAX_a= 440080
##$YMIN_a= -403777
##$ZGOPTNS= <>
##$ZL1= 120
##$ZL2= 120
##$ZL3= 120
##$ZL4= 120
##$ABSF1= 16.522
##$ABSF2= -4.171173
##$ABSG= 5
##$ABSL= 3
##$ALPHA= 0
##$AQORDER= 0
##$ASSFAC= 0
##$ASSFACI= 0
##$ASSFACX= 0
##$ASSWID= 0
##$AUNMP= <proc_1d>
##$AZFE= 0.1
##$AZFW= 0.1
##$BCFW= 0
##$BC_mod= 0
##$BYTORDP= 0
##$COROFFS= 0
##$CY= 12.5
##$DATMOD= 1
##$DC= 0
##$DFILT= <>
##$DTYPP= 0
##$F1P= 14.0000005364418
##$F2P= -0.99999901652339
##$FCOR= 0.5
##$FTSIZE= 32768
##$FT_mod= 6
##$GAMMA= 0
##$GB= 0
##$INTBC= 1
##$INTSCL= 1
##$ISEN= 128
##$LB= 0.3
##$LEV0= 0
##$LPBIN= 0
##$MAXI= 10000
##$MC2= 0
##$MEAN= 0
##$ME_mod= 0
##$MI= 0
##$NCOEF= 0
##$NC_proc= -3
##$NLEV= 6
##$NOISF1= 0
##$NOISF2= 0
##$NSP= 0
##$NTH_PI= 0
##$NZP= 0
##$OFFSET= 16.522
##$PC= 1
##$PHC0= -49.17635
##$PHC1= 4.436138
##$PH_mod= 1
##$PKNL= yes
##$PPARMOD= 0
##$PSCAL= 4
##$PSIGN= 0
##$REVERSE= no
##$SF= 250.13
##$SI= 32768
##$SIGF1= 0
##$SIGF2= 0
##$SINO= 400
##$SIOLD= 32768
##$SREGLST= <1H.CDCl3>
##$SSB= 0
##$STSI= 32768
##$STSR= 0
##$SW_p= 5175.98343685301
##$SYMM= 0
##$S_DEV= 0
##$TDeff= 65536
##$TDoff= 0
##$TI= <Analysis number 999999
Compound Code 99
Book Reference 9
Project Code 9>
##$TILT= no
##$TM1= 0
##$TM2= 0
##$TOPLEV= 0
##$USERP1= <user>
##$USERP2= <user>
##$USERP3= <user>
##$USERP4= <user>
##$USERP5= <user>
##$WDW= 1
##$XDIM= 32768
##$YMAX_p= 401058006
##$YMIN_p= -124153
$$ End of Bruker specific parameters
$$ ---------------------------------
##NTUPLES= NMR SPECTRUM
##VAR_NAME=  FREQUENCY,     SPECTRUM/REAL,   SPECTRUM/IMAG
##SYMBOL=    X,             R,               I
##VAR_TYPE=  INDEPENDENT,   DEPENDENT,       DEPENDENT
##VAR_FORM=  AFFN,          ASDF,            ASDF
##VAR_DIM=   32768,         32768,           32768
##UNITS=     HZ,            ARBITRARY UNITS, ARBITRARY UNITS
##FACTOR=    0.157963299565203, 1,           1
##FIRST=     4132.6476996994, 0,             0
##LAST=      -1043.33573715361, 0,           0
##MIN=       -1043.33573715361, -124153,     0
##MAX=       4132.6476996994, 401058006,     0
$$ Real data points
##PAGE= N=1
##DATA TABLE= (X++(R..R)), XYDATA
$$ [...]
16556C9759j9670n3107Q08J8117n463K8456L5121k2850j0944P378o141R228O291
$$ 39759 20089 -33018 -32210 -14093 -19556 8900 44021 21171 10227 17605 11464 20692 26983
16543B6983J3953j1029k9262J721p908J1560k855k0660r155J7865P70k57K5698
$$ 26983 40936 29907 645 2366 -5542 6018 3163 -17497 -26652 -8787 -8017 -8274 17424
16530A7424N392K6722Q777l0993j2642J1437K3151l1682j7697j1745Q289k9865
$$ 17424 22816 49538 58315 27322 14680 26117 49268 17586 -111 -11856 -3567 -33432
16518c3432J804M1311J7161P359R94r656j6827k6776L748j9990J1706N154o89
$$ -33432 -31628 9683 26844 34203 35197 25541 8714 -18062 -14314 -34304 -22598 -17444 -18133
16505a8133J2619R834J7537k5891k4452J4321r572L3083R085l6080l7273j6194
$$ -18133 -5514 4320 21857 -4034 -28486 -14165 -23737 9346 18431 -17649 -54922 -71116
16493g1116L4042Q33j4025L2302m939R834n970j1656M101K9445O368k5354K260
$$ -71116 -37074 -36241 -50266 -17964 -22903 -13069 -19039 -30695 -26594 2851 9219 -16135 -13875
16480a3875k071K852k2200L1742K8639O218l552j4988j4869l1068k6597j0040
$$ -13875 -15946 -13094 -35294 -3552 25087 31305 27753 12765 -2104 -33172 -59769 -69809
16468f9809K747n841O443N26P733K4186M0841L1604m555j7738J5620j7670j2456
$$ -69809 -67062 -72903 -66460 -65934 -58201 -34015 6826 38430 33875 16137 31757 14087 1631
16455A631K2664R097m620j1800q660n319L582j8101l845n286K6575Q428j3429
$$ 1631 24295 33392 28772 16972 8312 2993 6575 -11526 -15371 -20657 5918 14346 917
16442I17K9349k126p167J6019k8547j9988J6374J2736J3309q873l2181R382k174
$$ 917 30266 28140 20973 36992 8445 -11543 4831 17567 30876 22003 -10178 -796 -2970
16429b970r423j997k3385k9895K0293J0627l3858J6596K0730J1606N270L206j4342
$$ -2970 -12393 -14390 -37775 -67670 -47377 -36750 -70608 -54012 -33282 -21676 -16406 -13200 -27542
16416b7542O643J5855J7417J2076k5038n8844R23M0352k104j478K3058j0737o705
$$ -27542 -20899 -5044 12373 24449 -589 -59433 -58510 -18158 -20262 -21740 1318 -9419 -16124
16403a6124J9165K5095J488l352l8887j8809q514J3039J8086K1129J0839q810
$$ -16124 3041 28136 29624 26272 -12615 -31424 -39938 -26899 -8813 12316 23155 14345
16391A4345k874p566n000r29L2018M282k8510l0715l6334k9998K6499N1945J6376
$$ 14345 11471 3905 -1095 -2024 29994 34276 5766 -24949 -61283 -91281 -64782 -12837 3539
16378C539J5188o251m0328m9370L1598J4768m1115O809L7893K7002J2251j6292
$$ 3539 18727 12476 -27852 -77222 -45624 -30856 -71971 -65162 -27269 -267 11984 -4308
16366d308j5612p641N459l0681M812J0720p304J6495m589n913l7131L2737J8990
$$ -4308 -19920 -27561 -22102 -52783 -47971 -37251 -44555 -28060 -32649 -38562 -75693 -42956 -23966
16353b3966M71K4882j240j1041k2837k139j5019j1239L1801K6582j7440j6840
$$ -23966 -23495 1387 147 -10894 -33731 -35870 -50889 -62128 -30327 -3745 -21185 -38025
16341c8025l2423J3834K1363J0358O108m137o405K5021j6425L36O019j0263K4755
$$ -38025 -70448 -56614 -35251 -24893 -18785 -22922 -29327 -4306 -20731 -20395 -14376 -24639 116
16328A16J7055k7723M521K4676J7650L6159M028m5061n032r376L191J8016Q750
$$ 116 17171 -10552 -6031 18645 36295 72454 76482 31421 26389 17013 20204 38220 46970
16315D6970o912k0890j9549j2097K4234J6702p684J5884n0k5861k7554J9957L2815
$$ 46970 40058 19168 -381 -12478 11756 28458 20774 36658 36608 10747 -16807 3150 35965
16302C5965J5383j7559k1125l5518k0936j8759R896J9678J0792O980r883Q863
$$ 35965 51348 33789 12664 -22854 -43790 -62549 -52653 -32975 -22183 -15203 -25086 -16223
16290a6223j1342l4332J5329K7808P615k6450J4594J7629K0326P632r07P115J4040
$$ -16223 -27565 -61897 -46568 -18760 -11145 -37595 -23001 -5372 14954 22586 21679 28794 42834
16277D2834j3028l109k7380o218J3415k7539j5632j5896K4775K4850K1767K2392
$$ 42834 29806 26697 -683 -6901 6514 -21025 -36657 -52553 -27778 -2928 18839 41231
16265D1231k575k3143j0539J2819k317l556q620k4841M72k3028n267L8032K2657
$$ 41231 38656 15513 4974 17793 15476 11920 3300 -21541 -21069 -44097 -49364 -11332 11325
16252A1325Q266K6990j5926j6288l1925N066K650K6174k158j6098k4068l682O957
$$ 11325 19591 46581 30655 14367 -17558 -12492 -9842 16332 14174 -1924 -25992 -29674 -22717
16239b2717j5766L795J2271K9539k9485l7139K8705N934K2929j0412o872K7598
$$ -22717 -38483 -34688 -22417 7122 -22363 -59502 -30797 -24863 -1934 -12346 -19218 8380
16227H380L0251j8024k7805K7904q061r228K8385K928j4761j3955l0909j1033
$$ 8380 38631 20607 -7198 20706 12645 3417 31802 34730 19969 6014 -24895 -35928
16215c5928K2822J2292n362o01j7219N960J3798L834l0764K6810L364J6J383k6516
$$ -35928 -13106 -814 -6176 -6777 -23996 -18036 -4238 -404 -31168 -4358 -994 -978 405 -26111
16201b6111J8222J9552j43n524J951n389K191L1408j0151o142o034j7094P61P973
$$ -26111 -7889 11663 11520 5996 7947 2558 4749 36157 26006 19864 13830 -3264 -2503 5470
16187E470j0443J6961O042J7678l653k6787m4009j7322L9724L2110l7847k5824
$$ 5470 -4973 11988 18030 35708 32055 5268 -38741 -56063 -16339 15771 -22076 -47900
16175d7900j7151k977J8513j2713J1977n173l231Q182K2855J7805K0740k0809
$$ -47900 -65051 -68028 -49515 -62228 -50251 -55424 -58655 -50473 -27618 -9813 10927 -9882
16163i882j7597j0712m851N947J6971K5742J0300M620k1148j1772l730j6335J2072
$$ -9882 -27479 -38191 -43042 -37095 -20124 5618 15918 20538 -610 -12382 -16112 -32447 -20375
16150b0375K9114M973Q341J4278k1022o910J1509j772K578j0622L2912J4226m2982
$$ -20375 8739 13712 22053 36331 15309 8399 19908 18136 20714 10092 43004 57230 14248
16137A4248o9766j5134K9155K245l480n83K6460j801k4416m847J9611K1891L2155
$$ 14248 -55518 -70652 -41497 -39252 -42732 -43315 -16855 -18656 -43072 -47919 -28308 -6417 25738
16124B5738L471Q562k3290r311j8903r277n306J9740J0915K08L774L249o130P748
$$ 25738 29209 37771 14481 5170 -13733 -23010 -28316 -8576 2339 2547 6321 9570 3440 11188
16110A1188N542J9344j5959j9618j1667o9j443N85J2351o905j114n866k509K4133
$$ 11188 16730 36074 20115 497 -11170 -11239 -12682 -12097 254 -6651 -7765 -13631 -16140 7993
16096G993j0738J3864j1536Q877P997K0163N102n080q786J2884j9577l1433j6391
$$ 7993 -2745 11119 -417 8460 16457 36620 41722 36642 27856 40740 21163 -10270 -26661
16083b6661Q034L246J6617l551j4460K4901M828L613P581M512J7533l0790m032
$$ -26661 -18627 -15381 1236 -2315 -16775 8126 12954 16567 24148 28660 46193 15403 11371
16070A1371J7689j1487J139K1142m815l0804l5417k2166J2620K1446l108N803
$$ 11371 29060 17573 18712 39854 35039 4235 -31182 -53348 -40728 -19282 -22390 -16587
16058a6587k387J1155J2985q90m19J6642Q481j9663K1328J9876l2627k0338K9990
$$ -16587 -18974 -7819 5166 4276 3857 20499 28980 9317 30645 50521 17894 -2444 27546
16045B7546N286k0647Q724p587m5032k6629J9099K3934O539P28k5755p52K0460
$$ 27546 32832 12185 20909 13322 -31710 -58339 -39240 -15306 -8767 -8039 -33794 -34546 -14086
16032a4086L7887r627j9983L290J3366k473j7634j1417j8139N09J7137J0538J3493
$$ -14086 23801 14174 -5809 -2519 10847 8374 -9260 -20677 -38816 -38307 -21170 -10632 2861
16019B861l801Q172J5110l342j375k0412k1628k0386O667K3848o426j1362J9678
$$ 2861 -940 7232 22342 19000 17625 -2787 -24415 -44801 -38134 -14286 -20712 -32074 -12396
16006a2396Q667l9053K7785L8307j8193K7538J5467p933j2807J8619J5454K0862
$$ -12396 -3729 -42782 -14997 23310 5117 32655 48122 40189 27382 46001 61455 82317
15994H2317l0358m1081k2233O991J6546J8701p551k9245l068j2797n780K8413
$$ 82317 51959 10878 -11355 -4364 12182 30883 23332 -5913 -8981 -21778 -27558 855
15982H55K1563k0234O944N395K2843K046o533k7973l3967k3490L4564K7009j4538
$$ 855 22418 2184 9128 14523 37366 39412 32879 4906 -29061 -52551 -17987 9022 -5516
15969e516J7574j029j6565K1594K4469j362l6555k8820M9632P998m3712l6214
$$ -5516 12058 11029 -5536 16058 40527 39165 2610 -26210 23422 31420 -12292 -48506
15957d8506J6167J4707K592J5304J9811J0674j6717m1628K988N01Q792p186J429
$$ -48506 -32339 -17632 -15040 264 20075 30749 14032 -27596 -24608 -24107 -15315 -22501 -21072
15944b1072k3871m02J0476K0738K4086J8095l4465J5353J6504m0776k7699J5432
$$ -21072 -44943 -45345 -34869 -14131 9955 28050 -6415 8938 25442 -15334 -43033 -27601
15932b7601m488L2520J0731j453r400k7033j9291n032p075J118L8609K527K563
$$ -27601 -32089 431 11162 9709 309 -26724 -46015 -51047 -58122 -57004 -18395 -15868 -13305
15919a3305l454k2239M385J2087j0399j1550j2995N47j2902p370L5936N2858j2000
$$ -13305 -16759 -38998 -34613 -22526 -32925 -44475 -57470 -56923 -69825 -77195 -41259 11599 -401
15906d01j978j303J272M238n105k8116J706r276J5606L6812o113Q032M606n369
$$ -401 -2379 -3682 -2410 1828 -3277 -31393 -29687 -38963 -23357 13455 7342 15374 19980 14611
15892A4611k0314M287j454k2027j3119J9912K5498q615l211K4853M0486j0310
$$ 14611 -5703 -1416 -2870 -24897 -38016 -18104 7394 -1221 -4432 20421 60907 50597
15880E0597k4136l6039p840P154J5743k0368k8947K559J4698K4126J7003L3528
$$ 50597 26461 -9578 -17418 -10264 5479 -14889 -43836 -41277 -26579 -2453 14550 48078
15868D8078l489q933k1927n3312J5206q420K507J938L6400K9148K541j8000n871
$$ 48078 44589 35656 13729 -39583 -24377 -32797 -30290 -28352 8048 37196 39737 21737 15866
15855A5866K4075q574J1164j113N989o941l27J4537J3554j9622k2240k4474q831
$$ 15866 39941 31367 42531 41418 47407 40466 40139 54676 68230 48608 26368 1894 -6937
15842f937K1432j891K1137j729m2998p886j55j0661J1998K3421K3430K0803j3668
$$ -6937 14495 12604 33741 32012 -10986 -18872 -19027 -29688 -17690 5731 29161 49964 36296
15829C6296m0731j0821L194L395N185O489k8016J1060K3088j0988j1220q025J1268
$$ 36296 -4435 -15256 -12062 -8667 -3482 3007 -25009 -13949 9139 -1849 -13069 -21094 -9826
15816i826O96p370J2673j4438J5528p814J586k3693j1114N976p615L4271q706
$$ -9826 -9130 -16500 -3827 -18265 -2737 -10551 -8965 -32658 -43772 -37796 -45411 -11140 -19846
15803a9846j9293K859O297l70o938M7122K6806l024J2251k371p88m0333m6985
$$ -19846 -39139 -36280 -29983 -30353 -37291 9831 36637 33613 45864 43493 42705 2372 -44613
15790d4613J9614L8458l4780k5953K1351K0727N202k5284l4673P523L0656q105
$$ -44613 -24999 13459 -21321 -47274 -25923 -5196 6 -25278 -59951 -52428 -21772 -29877
15778b9877L670q340j2654n421K2623Q888J7828j978l963j1802N182k730R877
$$ -29877 -26207 -34547 -47201 -52622 -29999 -21111 -3283 -5261 -9224 -21026 -15844 -18574 -8697
15765h697M46J3931l601j0671J699Q963K4785l701q731l3902k8777j2679J7196
$$ -8697 -8251 5680 2079 -8592 -6893 2070 26855 23154 14423 -19479 -48256 -60935 -43739
15752d3739n201k1965o03L2824J4601q584j0839k038m302o26j3170K4507J1207
$$ -43739 -48940 -70905 -71508 -38684 -24083 -32667 -43506 -45544 -49846 -50472 -63642 -39135 -27928
15739b7928R202j0206J8648K4329J0035n1505o265J4640r08j5291N034P351j7629
$$ -27928 -18726 -28932 -10284 14045 24080 -27425 -33690 -19050 -19958 -35249 -30215 -22864 -40493
15726d0493k1061j3436J8501K0819M2175L0177Q873j6724l0915j3484j576J3620
$$ -40493 -61554 -74990 -56489 -35670 6505 36682 45555 28831 -2084 -15568 -17144 -3524
15714c524K4668J4473k3171m6645J616J2193K0389j6057m3293n578L0893J7567
$$ -3524 21144 35617 12446 -34199 -32583 -20390 -1 -16058 -59351 -64929 -34036 -16469
15702a6469J3636M063J2680m277j0273N786l1207j9600j1576J1415L9459J7262
$$ -16469 -2833 1230 13910 9633 -640 5146 -26061 -45661 -57237 -45822 -6363 10899
15690A0899K4302N982j4636p778K5772L294j1553j9433J759L240l6670k4072j2252
$$ 10899 35201 41183 26547 18769 44541 47835 36282 16849 18608 21848 -14822 -38894 -51146
15677e1146j4858K2313M458J8758j5757k543M0546J7817k6443k3777k3785l4045
$$ -51146 -66004 -43691 -39233 -20475 -36232 -38775 1771 19588 -6855 -30632 -54417 -88462
15665h8462K6235L9475J476K3893J8163q261J8326O296k2595k2381j3442J8368
$$ -88462 -62227 -22752 -21276 2617 20780 12519 30845 37141 14546 -7835 -21277 -2909
15653b909J3775L360j9089M53O288j2240k4997j31J1776r088Q282J8630O78J4827
$$ -2909 10866 14226 -4863 -4410 1878 -10362 -35359 -35490 -23714 -32802 -24520 -5890 -5212 9615
15639I615j2352k0598L416m337J1424J2266J0571J1978o63l485J3726m116l6130
$$ 9615 -2737 -23335 -19919 -24256 -12832 -566 10005 21983 21320 17835 31561 27445 -8685
15626h685j396n711n880k512j3640K7885J9848j3925P790j6546l1951l4465Q223
$$ -8685 -10081 -15792 -21672 -24184 -37824 -9939 9909 -4016 3774 -12772 -44723 -79188 -70965
15613g0965L4540J0875K6625K4414l243k9176j2694K7163K1855N218k9199j243
$$ -70965 -36425 -25550 1075 25489 22246 -6930 -19624 7539 29394 34612 5413 4170
15601D170j1673o521J7043l351J287L1950L258o97J466q430j601m121j8429k9708
$$ 4170 -7503 -14024 3019 -332 955 32905 36163 35466 36932 28502 26901 22780 4351 -25357
15587b5357K1928J3088K6641j3450k3168J2914p677j4331J0978l670J7937J4023
$$ -25357 -3429 9659 36300 22850 -318 12596 4919 -9412 1566 -2104 15833 29856
15575B9856l202Q123k4787m161j5906j8122r866m596N858k412J5245J4769L125
$$ 29856 26654 34777 9990 5829 -10077 -28199 -38065 -42661 -36803 -39215 -23970 -9201 -6076
15562f076k0582O016K6960K3807J3305Q212j0711r462k0601j3239K5638K0401
$$ -6076 -26658 -20642 6318 30125 43430 51642 40931 31469 10868 -2371 23267 43668
15550D3668Q534k5147k5410N895O102J654p659j3412O991J4969K1002j7741J7127
$$ 43668 52202 27055 1645 7540 13642 15296 7637 -5775 1216 16185 37187 19446 36573
15537C6573K1045k832m7246n6358j4820R809K3727J7891N378r159k729Q669J2963
$$ 36573 57618 54786 7540 -48818 -63638 -53829 -30102 -12211 -6833 -15992 -18721 -10052 2911
15524B911P021J9237n085m807J9982r551k5024r876M4232j979o541k2303R057
$$ 2911 9932 29169 24084 19277 39259 29708 4684 -5192 39040 37061 30520 8217 17274
15511A7274j6423j0214J900j521Q100J0666J3004o533K1630j6250k5536j9223
$$ 17274 851 -9363 -7463 -8984 -884 9782 22786 16253 37883 21633 -3903 -23126
15499b3126K834K1521M7040l2235k5756J764k3198j3593K6974K1812Q180n84J1667
$$ -23126 -20292 1229 48269 16034 -9722 -7958 -31156 -44749 -17775 4037 12217 11633 23300
15486B3300J3247k8751n1063k5866L3228L3233L867K3014R508k024j622j2292
$$ 23300 36547 7796 -43267 -69133 -35905 -2672 1195 24209 33717 31693 30071 17779
15474A7779J435j439J9230m122j9766K1591K2129l2058j4344O362m522J6768m5968
$$ 17779 19214 17775 37005 32883 13117 34708 56837 24779 10435 16797 12275 29043 -16925
15461a6925n381L2084K850J3612L2647o891J0908k3868j9357L721n623o531K1859
$$ -16925 -22306 9778 12628 26240 58887 51996 62904 39036 19679 23400 17777 11246 33105
15448C3105j6323R127J6449k2105k9932J4043N59L188k673l3809j6833L3959K0611
$$ 33105 16782 25909 42358 20253 -9679 4364 4923 8111 5438 -28371 -45204 -11245 9366
15435I366J2227M053m547j7762m2327p133K0778J4790K177n946j933J2814O66
$$ 9366 21593 25646 21099 3337 -38990 -46123 -25345 -10555 -8378 -14324 -16257 -3443 -2777
15422b777l3184q389m142l776J4441J3113p330N180j861J9010j775K320k0683
$$ -2777 -35961 -44350 -48492 -52268 -37827 -24714 -32044 -26864 -28725 -9715 -11490 -9170 -29853
15409b9853k5625M893K9200k471k734M26L1220p742M62R122j6664m139J5850j7485
$$ -29853 -55478 -50585 -21385 -23856 -26590 -26164 5056 -2686 -2224 6898 -9766 -13905 1945 -15540
15395a5540J1005J9756J1732j1036q600l875j2697j3013n89n494K095k275j3607
$$ -15540 -4535 15221 26953 15917 7317 3442 -9255 -22268 -22857 -28351 -26256 -28531 -42138
15382d2138n072K4015K1166k029L5999n153k6905l900n786j8682n442l20K4301
$$ -42138 -47210 -23195 -2029 -4058 31941 26788 -117 -4017 -9803 -28485 -33927 -34247 -9946
15369i946p117J7060j9033k1053K4254L0950P186p814n242M72L090p461j4986
$$ -9946 -17063 -3 -19036 -40089 -15835 15115 22301 14487 9245 9717 12807 5346 -9640
15356i640k1042j6014R018R769J0098K769J8641K0668o462o104K1266O384j2756
$$ -9640 -30682 -46696 -37678 -27909 -17811 -15042 3599 24267 17805 11701 32967 39351 26595
15343B6595j6295j8129M259K456o884j6301r852k6309J661J5741J1451J3691N0785
$$ 26595 10300 -7829 -3570 -1114 -7998 -24299 -34151 -60460 -58799 -43058 -31607 -17916 32869
15330C2869K1985m2236m3053k9457L7892M0747k972k1614j1553L7821J2374k3157
$$ 32869 54854 12618 -30435 -59892 -22000 18747 15775 -5839 -17392 20429 32803 9646
15318I646J1896o801j1993K7207K26l5102k3746M781J4098n69n595L331r571k6758
$$ 9646 21542 14741 2748 29955 30181 -4921 -28667 -23886 -9788 -10357 -15952 -12621 -22192 -48950
15304d8950L57K851j1830J4328J2226o47r428K0736K0601R332R718J0489k0713
$$ -48950 -48593 -45742 -57572 -43244 -31018 -31665 -41093 -20357 244 9576 19294 29783 9070
15291I070o312k4866k2729j5085p278j2998Q19K9581K3964J74K7051J3262J3906
$$ 9070 2758 -22108 -44837 -59922 -67200 -80198 -79379 -49798 -25834 -25660 1391 14653 28559
15278B8559r860j9929J6083l249K3396j2074j0130j1094j2359j1697k9899J8384
$$ 28559 18699 -1230 14853 11604 35000 22926 12796 1702 -10657 -22354 -52253 -33869
15266c3869P434r8L3985J4728J2225j8734m3924J0813M7229J6361j8498l2738
$$ -33869 -26435 -26533 7452 22180 34405 15671 -28253 -17440 29789 46150 27652 -5086
15254e086k004J2672K0890k6189M008k9040O717J1840L8k264j6086m829q296J221
$$ -5086 -7090 5582 26472 283 4291 -24749 -18032 -6192 -6154 -8418 -24504 -29333 -37629 -36408
15240c6408n973k5586n31J6203Q527J728J7884j1233k3971Q299K0796J7668K6810
$$ -36408 -42381 -67967 -68498 -52295 -43768 -42040 -24156 -35389 -59360 -51061 -30265 -12597 14213
15227A4213J5250l2526k2309K3085J4606K0140q709n8099n556L9466j7386J978
$$ 14213 29463 -3063 -25372 -2287 12319 32459 23750 -34349 -39905 -439 -17825 -15847
15215a5847j736K278J4386O957J8583J6049j8713j8354j1987l424K6763J1608
$$ -15847 -17583 -15305 -919 6038 24621 40670 21957 3603 -8384 -11808 14955 26563
15203B6563j2996q634K720O025L073O101J4772k1400j0913n194k4717L388J9097
$$ 26563 13567 4933 7653 13678 16751 22852 37624 16224 5311 117 -24600 -21212 -2115
15190b115j392j1799J1191J7416j5507Q584K7377J1874O697l8901m7281l032K2035
$$ -2115 -3507 -15306 -4115 13301 -2206 6378 33755 45629 52326 13425 -33856 -36888 -14853
15177a4853J6059Q96l22k5670J4021J4630j473K038K1513N78Q120j5158l0130
$$ -14853 1206 2102 1780 -23890 -9869 4761 3288 5326 26839 27417 35537 20379 -9751
15164i751j7259Q986M882k7529r298q40r183L0296M6812J0461r343k9205O143
$$ -9751 -27010 -18024 -13142 -40671 -49969 -50809 -59992 -29696 17116 27577 18234 -10971 -4828
15151d828K5424k8330k3277j0011J6135M373r075k4023N346L4867J8152N122p054
$$ -4828 20596 -7734 -31011 -41022 -24887 -20514 -29589 -53612 -48266 -13399 4753 9875 2821
15138B821k6659j8688j0267J4889P342r089K3661O432N519K4932L74j7810K0848
$$ 2821 -23838 -42526 -52793 -37904 -30562 -39651 -15990 -9558 -4039 20893 21267 3457 24305
15125B4305r713J5137J037j1588J0955L2003l9854l8281p578K1613Q346j4594
$$ 24305 14592 29729 30766 19178 30133 62136 22282 -15999 -23577 -1964 6382 -8212
15113h212j2711l1519M458J7680K3889j3574j2121J5895J2543l577j6243r183
$$ -8212 -20923 -52442 -47984 -30304 -6415 -19989 -32110 -16215 -3672 -7249 -23492 -32675
15101c2675O358k6442k511L245N657J3215K5099J0125k047l2660p189j304j3357
$$ -32675 -26317 -52759 -55270 -52025 -46368 -33153 -8054 2071 24 -32636 -39825 -41129 -54486
15088e4486K7566J3626L7467M4948j6538j8825J834L798J9340N131n2797m8728
$$ -54486 -26920 -13294 24173 69121 52583 33758 35592 39390 58730 63861 11064 -37664
15076c7664J4388K5565J2218k7935o413M342J3083K7295K2340K5139K1811k0125
$$ -37664 -23276 2289 14507 -13428 -19841 -15499 -2416 24879 47219 72358 94169 74044
15064G4044l7439k0635j7522q707K1910L4182l0671m547j5969k431j0754J0227
$$ 74044 36605 15970 -1552 -10259 11651 45833 15162 10615 -5354 -7785 -18539 -8312
15052h312K644n601J5569m6260k2721L7797j9451j0079J7471J8771k641J8635
$$ -8312 -5668 -11269 4300 -41960 -64681 -26884 -46335 -56414 -38943 -20172 -22813 -4178
15040d178L1523P475j6432j6424O764J2936j9613m512J2823j9093J0031j2527
$$ -4178 27345 34820 18388 1964 8728 21664 2051 -2461 10362 -8731 1300 -11227
15028a1227j5264M326j876j6807J9554L8782R39l3355q589J9603O992O444j53
$$ -11227 -26491 -22165 -24041 -40848 -21294 17488 18427 -14928 -23517 -3914 3078 9522 9369
15015I369L6946L0926j6445n1963k8028j5518j4918m477J7067J7922k0432n129
$$ 9369 46315 77241 60796 8833 -19195 -34713 -49631 -54108 -37041 -19119 -39551 -44680
15003d4680J3449L9813J8519O805P1492P2075P8094J39874N0805j04957j42710
$$ -44680 -31231 8582 27101 33906 105398 177473 255567 395441 446246 341289 198579
14992A98579q6786l6330n030r268k3339j0426K130j474K6149j3756l1786j8432
$$ 198579 111793 75463 70433 61165 37826 27400 29530 28056 54205 40449 8663 -9769
14980i769J4566L7558p564k600o413M974R634j0637j1620N588j9172k5764m298
$$ -9769 4797 42355 34791 32191 25778 30752 40386 29749 18129 23717 4545 -21219 -25517
14967b5517J8231o494o84K7360m815j6254J142k5215J3095K529j4046O135P415
$$ -25517 -7286 -13780 -14464 12896 8081 -8173 -7031 -32246 -19151 -16622 -30668 -24533 -17118
14954a7118l18K0301R019j8278l1721j1719j0292N0021P343j6607O586n782M544
$$ -17118 -17436 2865 11884 -6394 -38115 -49834 -60126 -10105 -2762 -19369 -12783 -18565 -14021
14941a4021k0029j6185p109m029L4758K3507l6005k3284K8565j3219O4K4611K3643
$$ -14021 -34050 -50235 -57344 -61373 -26615 -3108 -39113 -62397 -33832 -47051 -46987 -22376 1267
14928A267k2834k8964K4708L2l014J0677k0605J8378J1497o133K2164K7020k6416
$$ 1267 -21567 -50531 -25823 -25791 -28805 -18128 -38733 -20355 -8858 -14991 7173 34193 7777
14915G777k384k043l2053M861R101J93L746j4113q726k084j5268K4165j122K678
$$ 7777 5393 3350 -28703 -23842 -14741 -14548 -10802 -24915 -33641 -35725 -50993 -26828 -27950 -25272
14901b5272L5063J9128j3230K409J146j4137O762o535j0186j667M699K9541j8394
$$ -25272 9791 28919 15689 18098 19244 5107 11869 5334 -4852 -6519 -1820 27721 9327
14888I327k7814K3481K1412k570j2799l706j5817J3307J9327P135K7108j0371
$$ 9327 -18487 4994 26406 23836 11037 7331 -8486 4821 24148 31283 58391 48020
14876D8020k7897j2750L3024L0032l168j5587q781m2536l8419L752K045M356n079
$$ 48020 20123 7373 40397 70429 67261 51674 42893 357 -38062 -34310 -32265 -27909 -32988
14863c2988M946M0121L3338k2652j1094L98j2040j0387j304M125J2219k998k601
$$ -32988 -28042 12079 45417 22765 11671 12069 29 -10358 -11662 -7537 4682 1684 -917
14850i17L6269j296k7641n439k3406j2151K4020K1152j0556J046j617q836P138
$$ -917 35352 34056 6415 976 -22430 -34581 -10561 10591 35 1081 -536 -9372 -2234
14837b234J2888N661j0425L851j148J7305j1248k869J5309k085j2427r222j1640
$$ -2234 10654 16315 5890 9741 8593 25898 14650 11781 27090 25005 12578 3356 -8284
14824h284K810l3092l31L0576L9212k1072J20J0782j5816k0074j949j7854j3210
$$ -8284 -5474 -38566 -38897 -8321 30891 9819 9939 20721 4905 -15169 -17118 -34972 -48182
14811d8182J9961j0968j0730p523m420J1542K2510K1061J4199J8J1730n214j9832
$$ -48182 -28221 -39189 -49919 -57442 -61862 -50320 -27810 -6749 7450 7468 19198 13984 -5848
14798e848k6801j9414K7706J7467j833j5891k66K1420j3918l2106p164K7925J4543
$$ -5848 -32649 -52063 -24357 -6890 -8723 -24614 -24880 -3460 -17378 -49484 -56648 -28723 -14180
14785a4180l503R952L950l129J1098J7305k2186p677l172K791p271J0161K442
$$ -14180 -17683 -7731 -3781 -6910 4188 21493 -693 -8370 -11542 -8751 -16022 -5861 -3419
14772c419K6145k1315k6732N173L070J9650j4066L259J2390P003j6573j7571k11
$$ -3419 22726 1411 -25321 -20148 -17078 2572 -11494 -8235 4155 11158 -5415 -22986 -23197
14759b3197J0126n567J614k545q849J6667J774m367l5037J7932L4300J2496K15
$$ -23197 -13071 -18638 -17024 -19569 -28418 -11751 -9977 -14344 -49381 -31449 2851 15347 15562
14746A5562k1974J0769j2806k5320j4422n270K1624L5065j8197p12L4784P328
$$ 15562 -6412 4357 -8449 -33769 -48191 -53461 -31837 3228 -14969 -15681 19103 26431
14734B6431o049l478m518L789q62k5519M599J0592l925j4727J366m718q949J1209
$$ 26431 20382 16904 12386 16175 15313 -10206 -5607 4985 1060 -13667 -12301 -17019 -25968 -14759
14720a4759j6154k5960j756l808L7345M2978M4265p141m9744j1675K776P225j6848
$$ -14759 -30913 -56873 -58629 -62437 -25092 17886 62151 55010 5266 -6409 -3633 3592 -13256
14707a3256K0338R348K188K792j61k7688K6779J6751J313J0936j7382j4323L945
$$ -13256 7082 16430 18618 21410 21249 -6439 20340 37091 38404 49340 31958 17635 21580
14694B1580j4722k3585n457K5697J1457j891r052j5393R889J6079J2791k3997
$$ 21580 6858 -16727 -22184 3513 14970 13079 4027 -11366 -1477 14602 27393 3396
14682C396M115j3440j9242J1296K6555K4578k8857r378j5588j2119J3186K2629
$$ 3396 7511 -5929 -25171 -13875 12680 37258 8401 -977 -16565 -28684 -15498 7131
14670G131l0830j1217J6956k461R727j0146q013J5098k1611j600Q339r557k6484
$$ 7131 -23699 -34916 -17960 -20421 -10694 -20840 -28853 -13755 -35366 -36966 -28627 -38184 -64668
14657f4668J4171L3020K5732R315L3083J8827o609m962K350O96k6529k4321j1177
$$ -64668 -50497 -17477 8255 17570 50653 69480 62871 57909 60259 60955 34426 10105 -1072
14644a072L7758J3194R033L239J14k7966k2570J0840j0987r516M10J2223M017
$$ -1072 36686 49880 58913 62152 62266 34300 11730 22570 11583 2067 2477 14700 18717
14631A8717L1907J6785j1772k8122p446k1939j8495l327J1891J7479J8999p737
$$ 18717 50624 67409 55637 27515 20069 -1870 -20365 -23692 -11801 5678 24677 16940
14619A6940j9897k2564K4574J7085J8924p694k206J1362l205q542K052K976k2637
$$ 16940 -2957 -25521 -947 16138 35062 27368 25162 36524 33319 24777 26829 29805 7168
14606G168l6597N433J0522k2889J5866K0308K64J9337l94n88j4625k531P802k2534
$$ 7168 -29429 -23996 -13474 -36363 -20497 -189 75 19412 19018 18430 3805 1274 9076 -13458
14592a3458L9801L0170q499K479j892k9293k9785j9430j6077O143K7785J9418
$$ -13458 26343 56513 48014 50493 48601 19308 -10477 -29907 -45984 -39841 -12056 7362
14580G362K2242j0674m0228j8068J4876m364J5606N335l300L581q218L0822N0937
$$ 7362 29604 18930 -21298 -39366 -24490 -28854 -13248 -7913 -11213 -7632 -15850 14972 65909
14567F5909k0337l3218j4277J4696j5921k9126j5298J8876J6998p245j528k104
$$ 65909 45572 12354 -1923 12773 -3148 -32274 -47572 -28696 -11698 -18943 -20471 -22575
14555b2575K0857k5767k2974L994j5236k1769L103K9917L8861J7961R75k6525
$$ -22575 -1718 -27485 -50459 -46465 -61701 -83470 -80367 -50450 -11589 6372 7347 -19178
14543a9178P169n069K8437J8099k7932l2587O114Q267N051q846j0037p433K4586
$$ -19178 -12009 -17078 11359 29458 1526 -31061 -24947 -16680 -11629 -20475 -30512 -37945 -13359
14530a3359J9373J1957Q041k3630j8300o824R502J1696j8676k5362M004P879J2446
$$ -13359 6014 17971 26012 2382 -15918 -22742 -13240 -1544 -20220 -45582 -41578 -33699 -21253
14517b1253J9886N7338K2515J0692J3329j1609j039k2007m0600k0701l3749J314
$$ -21253 -1367 55971 78486 89178 102507 90898 89859 67852 27252 6551 -27198 -25884
14505b5884J0707m553k3243k0030K1939O696J2676P080K1062N718k0840R339k6658
$$ -25884 -15177 -19730 -42973 -63003 -41064 -34368 -21692 -14612 6450 12168 -8672 667 -25991
14492b5991l9618L3396Q703j3001J2055J2130K7329J9579J6174j0697k9979o845
$$ -25991 -65609 -32213 -23510 -36511 -24456 -12326 15003 34582 50756 40059 10080 3235
14480C235k079K702K3883k0800k8288o023J5238L4205K364j4124j2929j3333K9740
$$ 3235 1156 3858 27741 6941 -21347 -27370 -12132 22073 24437 10313 -2616 -15949 13791
14467A3791J7303J702j922p686k5762K284J3592N175k6431k0870j3795J3507M269
$$ 13791 31094 32796 30874 23188 -2574 -290 13302 18477 -7954 -28824 -42619 -29112 -24843
14454b4843M0691P426r409m681n015j7007M536o33M477L1421P188k5947J1495
$$ -24843 15848 23274 13865 9184 4169 -12838 -8302 -8935 -4458 26963 34151 8204 19699
14441A9699O287P016m732O457J9895k4041q571j4588K68k64R498m942k4066k3085
$$ 19699 25986 33002 28270 34727 54622 30581 22010 7422 7690 7426 16924 11982 -12084 -35169
14427c5169r550N011J7324J1758K8813K142k4120K2990J3423l9374O22k715j7535
$$ -35169 -44719 -39708 -22384 -10626 18187 20329 -3791 19199 32622 -6752 -6130 -8845 -26380
14414b6380N774N2213n036n3788l7790K5289K9687L2183N975p943l1689k84k33
$$ -26380 -20606 31607 26571 -27217 -65007 -39718 -10031 22152 28127 20184 -11505 -11789 -12022
14401a2022m803J3224k4107j3930K234M44J8971k635p436P175J6925l578J5989
$$ -12022 -16825 -3601 -27708 -41638 -39404 -38960 -19989 -22624 -30060 -22885 -5960 -9538 6451
14388F451K521m728j1198J0385K4446k8085r259j535p610M585k107k5580m826
$$ 6451 8972 4244 -6954 3431 27877 -208 -9467 -11002 -18612 -14027 -16134 -41714 -46540
14375d6540M4941O904L934j0830L1612R164k3134j0898L65l231j5738K7219j3614
$$ -46540 -1599 5305 9239 -1591 30021 39185 16051 5153 5518 2287 -13451 13768 154
14362A54l0301j5029k3770J7694J5666N460r013J542j0542j0757L1165J6501K9238
$$ 154 -30147 -45176 -68946 -51252 -35586 -30126 -39139 -37597 -48139 -58896 -27731 -11230 18008
14349A8008M042l8008k1498o870J0910k8048K0598L2702l505J2815r160L40K6100
$$ 18008 22050 -15958 -37456 -44326 -33416 -61464 -40866 -8164 -11669 1146 -8014 -7674 18426
14336A8426p611k2077k4481k376L033L7381J5422j4234Q16n39j7661j7038N641
$$ 18426 10815 -11262 -35743 -38119 -35086 2295 17717 3483 4299 3760 -13901 -30939 -25298
14323b5298m294K646j754J609J0367K6399k5622l945K0018J6160j9032l648J2196
$$ -25298 -29592 -26946 -28700 -27091 -16724 9675 -15947 -19892 126 16286 -2746 -6394 5802
14310E802j2450p349k615o275J4423K6311J452J3648k0212k3490k338l1383M2199
$$ 5802 -6648 -13997 -16612 -22887 -8464 17847 19299 32947 12735 -10755 -13093 -44476 -2277
14297b277M5794j5353l7263j4760J8452k168J692k4207l977L2242j036j896M644
$$ -2277 43517 28164 -9099 -23859 -5407 -7575 -5883 -30090 -34067 -1825 -2861 -4757 -113
14284a13J219j3181l0508K1806J8734Q933k7731l0297K646Q121J0165M488k57
$$ -113 1106 -12075 -42583 -20777 -2043 6890 -20841 -51138 -48492 -40371 -30206 -25718 -25975
14271b5975R438Q126J5701J6505l8030p112P162K9487K2927K1552K1786m692o454
$$ -25975 -16537 -8411 7290 23795 -14235 -21347 -14185 15302 38229 59781 81567 76875 70421
14258G0421r668K94j0239m2392k1421j3700o769J2235M8809J4188o655l9178K3884
$$ 70421 60753 61047 50808 8416 -13005 -26705 -33474 -21239 27570 41758 35103 -4075 19809
14245A9809o852j0251l676j8519k4374K9627K1068K648K5631P58J6536k2612k7318
$$ 19809 12957 2706 -970 -19489 -43863 -14236 6832 9480 35111 35869 52405 29793 2475
14232B475L406n890p728j0960O554k797n186N359j0370P899K7733j7425m1357
$$ 2475 5881 -9 -7737 -18697 -12143 -14940 -20126 -14767 -25137 -17238 10495 -6930 -48287
14219d8287J6402Q042J2651j0894M031J6683Q479j5483l1038p800J5396J8473
$$ -48287 -31885 -23843 -11192 -22086 -18055 -1372 7107 -8376 -39414 -47214 -31818 -13345
14207a3345O37k6067k3267O0434M2215L279M122j5593P658R086M711j3053m9572
$$ -13345 -12708 -38775 -62042 -1608 40607 43886 48008 32415 40073 49159 53870 40817 -8755
14194h755l857M5743J2635j7335k9016k638k4980q405l8591J9559O839J3915K0505
$$ -8755 -12612 33131 45766 28431 -585 -3223 -28203 -36608 -75199 -55640 -48801 -34886 -14381
14181a4381R58m649J6294O754k8464N000K2080M959k9549R980j1475j5207N1425
$$ -14381 -13423 -18072 -1778 4976 -23488 -18488 3592 8551 -20998 -11018 -22493 -37700 13725
14168A3725K7325l1189j0906j0760l4307l1585Q364J0358L1611L6073J0625n926
$$ 13725 41050 9861 -1045 -11805 -46112 -77697 -69333 -58975 -27364 8709 19334 13408
14156A3408k4518j6036j094K0807K3785J1581j7452r656L740M941Q369j5747j9244
$$ 13408 -11110 -27146 -28240 -7433 16352 27933 10481 825 4565 9506 17875 2128 -17116
14143a7116j6747J5290J8596K244K4409J0298j8623k0901n893l140K9371J2538
$$ -17116 -33863 -18573 23 2267 26676 36974 18351 -2550 -8443 -11583 17788 30326
14131C0326k9988J0215R852k24k0480l9294O848K4129j6362o1122K5224M2424
$$ 30326 338 10553 20405 20181 -299 -39593 -32745 -8616 -24978 -86100 -60876 -18452
14119a8452K5025k0609q701l735J7852j3497m540l762J5526l3001r425Q603M6418
$$ -18452 6573 -14036 -22737 -26472 -8620 -22117 -26657 -30419 -14893 -47894 -57319 -48716 -2298
14106b298R383j7292J96m114N17l096L858p742k79K840J1718l749K2613o664q969
$$ -2298 7085 -10207 -10011 -14125 -13608 -16704 -12846 -20588 -20867 -18027 -6309 -10058 12555 5891 -3078
14091c078J3030n285r308j7399J5545l80q710j5414k5303L656K5984J0330L051
$$ -3078 9952 4667 -4641 -22040 -6495 -6875 -15585 -30999 -56302 -52646 -26662 -16332 -13281
14078a3281r190j0772J8019J592K0327J3438L094J2972l9903k769J7446o453k081
$$ -13281 -22471 -33243 -15224 -13632 6695 20133 23227 36199 -3704 -6473 10973 4520 2439
14065B439Q163j9j2003R49Q993j1303J6048k2433K6965J5399j053r857j6360R340
$$ 2439 10602 10583 -1420 -471 8522 -2781 13267 -9166 17799 33198 32145 22288 5928 15268
14051A5268k598j477n359k4883L6701J5715k1396n916l407N617l54j8366Q128
$$ 15268 12670 11193 5834 -19049 17652 33367 11971 6055 2648 8265 7911 -10455 -2327
14038b327p42K074k723o168k096l226o426J9984L0263j9288q527m848J7137n151
$$ -2327 -3069 -995 -3718 -9886 -11982 -15208 -21634 -1650 28613 9325 798 -4050 13087 7936
14024G936j8642k794L229l4400k1043J2470J4540K7537P528j7203j6821j1058
$$ 7936 -10706 -13500 -10271 -44671 -65714 -53244 -38704 -11167 -3639 -20842 -37663 -48721
14012d8721J927J420K465M960N306J9501O920J2957l690o051q084Q811P451j7292
$$ -48721 -46794 -45374 -42909 -37949 -32643 -13142 -6222 6735 3045 -3006 -11090 -2279 5172 -12120
13998a2120j9866n841J6724L064M548M74r362K2054L374K5223N995J1391K9675
$$ -12120 -31986 -37827 -21103 -18039 -13491 -13017 -22379 -325 3049 28272 34267 45658 75333
13985G5333l7289l309k4145k478j0307j8912r612M0240L3828l4625k1669k4853
$$ 75333 38044 34735 10590 8112 -2195 -21107 -30719 9521 43349 8724 -12945 -37798
13973c7798n541o472q52J1152J1271l5444k4123p935J1534J3573J6253j179J0836
$$ -37798 -43339 -49811 -50663 -39511 -28240 -63684 -87807 -95742 -84208 -70635 -54382 -55561 -44725
13960d4725L2096J0331j5821j2817R934l14l325j8997k6793K2169M2679N691J808
$$ -44725 -12629 -2298 -18119 -30936 -21002 -21316 -24641 -43638 -70431 -48262 -5583 108 1916
13947A916m403r886j8313k861L3166m426j5622R100m382J8427j1529P714J2537
$$ 1916 -2487 -12373 -30686 -33547 -381 -4807 -20429 -11329 -15711 2716 -8813 -1099 11438
13934A1438r905k3729k953J6406J5156o154j429K579o438K5186n366j1635r214
$$ 11438 1533 -22196 -25149 -8743 6413 259 -1170 1409 -5029 20157 14791 3156 -6058
13921f058j2051r449K1371R061n923L652j3453r162K472N900j0276p837N069j913
$$ -6058 -18109 -27558 -6187 2874 -3049 603 -12850 -22012 -19540 -13640 -23916 -31753 -26684 -28597
13907b8597K4652R011j2942M4271N765k9417l3746J7923P538Q133J6656J6684
$$ -28597 -3945 5066 -7876 36395 42160 12743 -21003 -3080 4458 12591 29247 45931
13895D5931k6834l9690j2668M366K7998N517N128p499O547K938R92J7681L132
$$ 45931 19097 -20593 -33261 -28895 -897 4620 9748 2249 8796 11734 12726 30407 33539
13882C3539l9242l787K7681R951q10K4509K0334q178k1910k7637j2389K2012N315
$$ 33539 -5703 -9490 18191 28142 27332 51841 72175 63997 42087 14450 2061 24073 29388
13869B9388j2836q439p868j4143Q66o497K4351K1209M907l1092J1669L3823r167
$$ 29388 16552 8113 245 -13898 -13032 -19529 4822 26031 30938 -154 11515 45338 36171
13856C6171j5754O768r401k4488J301K4618k031K57J9608k4968l155j2329n151
$$ 36171 20417 27185 17784 -6704 -5403 19215 17184 17441 37049 12081 8926 -3403 -8554
13843h554j9174J654J9430J006R90j9910K845L2540K4602j9104j252k0830k4000
$$ -8554 -27728 -26074 -6644 -5638 -4648 -24558 -21713 10827 35429 16325 15073 -5757 -29757
13830b9757p352K197L002J0503j9512j8326L336J8256M236n546r105j3421K3530
$$ -29757 -37109 -34912 -31910 -21407 -40919 -59245 -55909 -37653 -33417 -38963 -48068 -61489 -37959
13817c7959J2638l342J7981K5370L0570j1517j7530K6605m711j99q207J8267j3113
$$ -37959 -25321 -28663 -10682 14688 45258 33741 16211 42816 38105 37906 29699 47966 34853
13804C4853M870j7163k7907k7577k5961J3859L641j544J2332M821j6600q329k76
$$ 34853 39723 22560 -5347 -32924 -58885 -45026 -41385 -42929 -30597 -25776 -42376 -50705 -50981
13791e0981J6770L2831j3586J6090K2935l992j8050K048J338o427K0358L1068
$$ -50981 -34211 -1380 -14966 1124 24059 20067 2017 4065 5403 -1024 19334 50402
13779E0402j148n7945m9769J1494K5985J0636R199K5686Q368J6471l8458l0783
$$ 50402 49254 -8691 -58460 -46966 -20981 -10345 -1146 24540 32908 49379 10921 -19862
13767a9862K9331M457k2416K2048K0549K277k663k5197j714K7261R792K5002J662
$$ -19862 9469 13926 -8490 13558 34107 36384 33721 8524 6810 34071 43863 68865 70527
13754G0527j1107j2150K6772k742k8357l4981p70q881k918K9695R889j1268j6698
$$ 70527 59420 47270 74042 71300 42943 7962 7192 -1689 -4607 25088 34977 23709 7011
13741G011j4686p171J3358N012l3171l8026J2103J4687Q117O789J8661R479j40
$$ 7011 -7675 -14846 -1488 3524 -29647 -67673 -55570 -40883 -32766 -25977 -7316 2163 2023
13728B023K3299J0295l5428k3386J3963p660O754o756R739J9931m941m3977l485
$$ 2023 25322 35617 189 -23197 -9234 -16894 -10140 -16896 -7157 12774 7833 -36144 -39629
13715c9629Q187L226J8269J7415P498n605M539j055Q469O481J3174L437M589k3005
$$ -39629 -31442 -28216 -9947 7468 14966 9361 13900 12845 21314 27795 40969 44406 48995 25990
13701B5990k1313K1138j61k1371l4190O301K3015j3260k2520J0362J0611L684
$$ 25990 4677 25815 25654 4283 -29907 -23606 -591 -13851 -36371 -26009 -15398 -11714
13689a1714j6773J9060K8037J7560L5000p693k1040k3372j0084K334j7914q284
$$ -11714 -28487 -9427 18610 36170 71170 63477 42437 19065 8981 11315 -6599 -14883
13677a4883k5207k0714K5502k678l5485K735Q917J9402J4463K3931R248j0409
$$ -14883 -40090 -60804 -35302 -37980 -73465 -70730 -61813 -42411 -27948 -4017 5231 -5178
13665e178L1871o890l1453R89M5457O297k0626k4494j8301P585R613n596K2335
$$ -5178 26693 19803 -11650 -10661 34796 41093 20467 -4027 -22328 -14743 -5130 -10726 11609
13652A1609R925p37j455p763k1822k9471J3314J9764L734J8566m560j2291j8551
$$ 11609 21534 20797 19342 11579 -10243 -39714 -26400 -6636 -2902 15664 11104 -1187 -19738
13639a9738j366J0157K7106K9827j6990n1529K676j252Q983K7063P535j9135j2467
$$ -19738 -21104 -10947 16159 45986 28996 -22533 -19857 -21109 -12126 14937 22472 3337 -9130
13626i130J1133q69j5796l4398j6884J5107L1240L1624L8875J458j1605j6589
$$ -9130 2003 1134 -14662 -49060 -65944 -50837 -19597 12027 50902 52360 40755 24166
13614B4166l992m818J9285j8202j9297n099J8364m972j0024J050J2265k257k561
$$ 24166 20174 15356 34641 16439 -2858 -7957 10407 5435 -4589 -3539 8726 6469 3908
13601C908j1071l5367p162J8101K5504l881J4319J1753Q248j0146k5502m0290
$$ 3908 -7163 -42530 -49692 -31591 -6087 -9968 4351 16104 24352 14206 -11296 -51586
13589e1586J1893J3327J1k6209j7065L20L3837M2624K9288N274k1280j7086j2475
$$ -51586 -39693 -26366 -26355 -52564 -69629 -69309 -35472 7152 36440 41714 20434 3348 -9127
13576i127r087Q280J604K476L4716J3155m883o954k317k2345M370J1005j6907
$$ -9127 -18214 -9934 -8330 -5854 28862 42017 37134 30180 27863 5518 9888 20893 3986
13563C986k3971n83l143L984J3429K512n0506j4377M070K1970K1579L277K3336
$$ 3986 -19985 -20568 -23711 -19727 -6298 -3786 -54292 -68669 -64599 -42629 -21050 -17773 5563
13550E563K2644J9415n892k9741P148J081k941j730l991k2827j8045j0033J2512
$$ 5563 28207 47622 41730 11989 19137 20218 17277 15547 11556 -11271 -29316 -39349 -26837
13537b6837j0231M369l217j0705J9217O678j2563K0008j2888J4797O2250L6188
$$ -26837 -37068 -32699 -35916 -46621 -27404 -20726 -33289 -13281 -26169 -11372 50878 87066
13525H7066j6004p2923l0750J0274K1824R943R316K895K6745J1850j2444m1971
$$ 87066 71062 -1861 -32611 -22337 -513 9430 18746 21641 48386 60236 47792 5821
13513E821k9500J6056J1010J9996j677O574l2362k6205n479p667m618J6187L7867
$$ 5821 -23679 -7623 3387 23383 21706 28280 -4082 -30287 -35766 -43433 -48051 -31864 6003
13500F003j1135k224j8732l246J5574J6672j505k6597L4868K9272J5018O460M926
$$ 6003 -5132 -7356 -26088 -29334 -13760 2912 1407 -25190 9678 38950 53968 60428 65354
13487F5354l723o141k3202l0077j3388k4351K465R600j7947m967K9009K1830k526
$$ 65354 61631 55490 32288 2211 -11177 -35528 -33063 -23463 -41410 -46377 -17368 4462 1936
13474A936J6818j4916k0157k293J4547M0762J1042k2873k6557k8628j8394K4756
$$ 1936 18754 3838 -16319 -18612 -4065 36697 47739 24866 -1691 -30319 -48713 -23957
13462b3957J2843o704J5711j2750j554J2433M942O492k72J2473j1798l5367j4698
$$ -23957 -11114 -17818 -2107 -14857 -16411 -3978 964 7456 7184 19657 7859 -27508 -42206
13449d2206k3513j0264J3987M3676J2781N158O517J1840L877k3180r172k0393
$$ -42206 -65719 -75983 -61996 -18320 -5539 -381 6136 17976 21853 -1327 -10499 -30892
13437c0892l0306N824m180Kj0697l846L2937R805m102j6356J374J2182L1242K3889
$$ -30892 -61198 -55374 -59554 -59552 -70249 -74095 -41158 -31353 -35455 -51811 -50437 -38255 -7013 16876
13423A6876O189k5352k7193M0961K6265J1468M004m766j2103n577J4296j4156
$$ 16876 23065 -2287 -29480 11481 37746 49214 53218 48452 36349 30772 45068 30912
13411C0912r765J82k8132N148K0631K8500O828l5533n415N249l704P145P775k1440
$$ 30912 21147 21329 -6803 -1655 18976 47476 54304 18771 13356 18605 14901 22046 29821 8381
13397H381o55J1300j0508L586j6510L92K2643J409r126n646J8244j3118j7274
$$ 8381 7726 19026 8518 12104 -4406 -4014 18629 20038 10912 5266 23510 10392 -6882
13384f882j2937o403m827m894K0809L5401J6908k226j9733o555k0363J8734J4423
$$ -6882 -19819 -26222 -31049 -35943 -15134 20267 37175 34949 15216 8661 -11702 7032 21455
13371B1455o361l995O932k4863k8379q114K4634N114J8709J1896K980M516j0673
$$ 21455 15094 11099 18031 -6832 -35211 -43325 -18691 -13577 5132 17028 20008 24524 13851
13358A3851k0931k001j3253l6882m021j7994J255K6151J7968j7890P214K3627
$$ 13851 -7080 -9081 -22334 -59216 -63237 -81231 -79976 -53825 -35857 -53747 -46533 -22906
13346b2906J6275R224o480j2046k2492j3849K8767K6565J0906j9252J0312O051
$$ -22906 -6631 2593 -3887 -15933 -38425 -52274 -23507 3058 13964 -5288 5024 11075
13334A1075N255j5501k896J1407o870Q93O235R646R044j696m3L80N258P795j312
$$ 11075 16330 829 -2067 9340 2470 3363 9598 19244 28288 26592 26549 26929 32187 39982 38670
13319C8670l6156j3200J0586L647k1132L2615J6027j3940k2191K413Q564P673
$$ 38670 2514 -10686 -100 3547 -17585 15030 31057 17117 -5074 -2661 5903 13576
13307A3576N124J3499m097p843k1682m565K2660j2162j8123j5683l0846M1587
$$ 13576 18700 32199 28102 20259 -1423 -5988 16672 4510 -13613 -29296 -60142 -18555
13295a8555P1737l666j8862l1831o375O213k8082j6839K0191K428N760L0137P714
$$ -18555 53182 49516 30654 -1177 -7552 -1339 -29421 -46260 -26069 -23641 -17881 12256 19970
13282A9970K0933K1838k1586l2056l2711m324J3164R577K185j923j1852L206K9116
$$ 19970 40903 62741 41155 9099 -23612 -27936 -14772 -5195 -3010 -4933 -16785 -13579 15537
13269A5537n390k4661l25L542l2787Q755J6406J884O416Q791J6082J6334J2838
$$ 15537 10147 -14514 -14839 -11297 -44084 -35329 -18923 -17039 -10623 -1832 14250 30584 43422
13256D3422j1761J9127J941l0416j5657o831n850j257r260K6260K1275k6629m251
$$ 43422 31661 50788 52729 22313 6656 -175 -6025 -7282 -16542 9718 30993 4364 113
13243A13R300j2623m0686j9619P582O415O322m942L8697J9363J5631k715l6175
$$ 113 9413 -3210 -43896 -63515 -55933 -49518 -43196 -48138 -9441 9922 25553 22838 -13337
13230a3337j0820p595J2409n280k1766k2728J8481J3521q97K3051k409K2271M5314
$$ -13337 -24157 -31752 -19343 -24623 -46389 -69117 -50636 -37115 -38012 -14961 -17370 4901 50215
13217E0215J1336j6702r208j9954j9103k7331j9921L7596J5409k3030j6088Q51
$$ 50215 61551 44849 35641 15687 -3416 -30747 -50668 -13072 2337 -20693 -36781 -35930
13205c5930K9464k733n014J5121r866n112M1082j0370o451J4992k1713l2464k0059
$$ -35930 -6466 -9199 -14213 908 -8958 -14070 27012 16642 10191 25183 3470 -28994 -49053
13192d9053P418M4700K5683J2429j3230l5407R93M06j7913k1460p246K2056R75
$$ -49053 -41635 3065 28748 41177 27947 -7460 -6467 -6061 -23974 -45434 -52680 -30624 -29649
13179b9649R147Q822J5552l118j5224Q042J5198J1485l8009j5073P094N748l809
$$ -29649 -20502 -11680 3872 754 -14470 -6428 8770 20255 -17754 -32827 -25733 -19985 -23794
13166b3794j5018j8641m775R417M224L6330L5983J1722k5958L153L2784J762o277
$$ -23794 -38812 -57453 -62228 -52811 -48587 -12257 23726 35448 9490 12643 45427 47189 40912
13153D0912j5517k8872j1079L2580J5994k6731j4542j4169n295L2272O736j6518
$$ 40912 25395 -3477 -14556 18024 34018 7287 -7255 -21424 -26719 5553 12289 -4229
13141d229n096k115j4472J2599K7221O462j5732l4204k471L0422J9004j6962O210
$$ -4229 -9325 -11440 -25912 -13313 13908 20370 4638 -29566 -32037 -1615 17389 427 6637
13128F637J1017O761Q980o03j6862j3864J3162O232K4333l3495k021j4260j2969
$$ 6637 17654 24415 33395 32792 15930 2066 15228 21460 45793 12298 10277 -3983 -16952
13115a6952N993J7895N340N871q596l9096j3189J9235J004R264l915o690J3025
$$ -16952 -10959 6936 12276 18147 9551 -29545 -42734 -23499 -22495 -13231 -17146 -23836 -10811
13102a0811j5457M708L8207J5081j566m0719q050K267K1052N517j6010J1862m572
$$ -10811 -26268 -21560 16647 31728 30162 -10557 -18607 -16340 4712 10229 -5781 6081 1509
13089A509k5718j5340J1240N42q256K814L0257k545J0966O066J0874R18p456M037
$$ 1509 -24209 -39549 -28309 -27767 -36023 -33209 -2952 -5497 5469 11535 22409 23327 15871 19908
13075A9908P838J6413j0570O293m951m084k0798J3814l67L161m774O627q645j7821
$$ 19908 27746 44159 33589 39882 34931 30847 10049 23863 23496 26657 21883 28510 19865 2044
13061B044j0608k0337j7630M133J2929J9575o562m005j3488r597l285k740K1148
$$ 2044 -8564 -28901 -46531 -42398 -29469 -9894 -16456 -20461 -33949 -43546 -46831 -49571 -28423
13048b8423J4358j3914P094n518K0225j5441j24J9792o901J6783m20J451m067
$$ -28423 -14065 -27979 -20885 -26403 -6178 -21619 -21743 -1951 -8852 7931 7511 8962 4895
13035D895j4886N096J8150L0593K1565q762n791r289j1604n145o532j2262K0566
$$ 4895 -9991 -4895 13255 43848 65413 56651 50860 41571 29967 24822 18290 6028 26594
13022B6594j3865q701K7993j2890j5094K7232O43n696j4510o15k9271k9886J8902
$$ 26594 12729 4028 32021 19131 4037 31269 31912 26216 11706 11091 -18180 -48066 -29164
13009b9164M937j5496J9457K2966k8206n872J1671M470R50l1328l4338K4493M8570
$$ -29164 -24227 -39723 -20266 2700 -25506 -31378 -19707 -15237 -14287 -45615 -79953 -55460 -6890
12996f890K6320j4415r508L8942K3354m6859m6259J410L9675J0217k9607m1046
$$ -6890 19430 5015 -4493 34449 57803 10944 -35315 -33905 5770 15987 -13620 -54666
12984e4666L408J8861R985M893l87k7226k0649M7411M7772q161m1504K317Q357
$$ -54666 -51258 -32397 -22412 -17519 -17906 -45132 -65781 -18370 29402 21241 -20263 -17946 -9589
12971i589k097N050r10j0264p754l739j9743J7223P696J1735J3181K2384p206
$$ -9589 -11686 -6636 -7546 -17810 -25564 -29303 -49046 -31823 -24127 -12392 789 23173 15967
12958A5967j5143n776J3932K3002k5672j0493J970j3859J2864M409j868r769m932
$$ 15967 824 -4952 8980 31982 6310 -4183 -2213 -16072 -3208 1201 -667 -10436 -15368
12945a5368l375j5960O86k1046n948O302q262L3769K8229j3763l478j198l082
$$ -15368 -18743 -34703 -34017 -55063 -61011 -54709 -62971 -29202 -973 -14736 -18214 -19412 -22494
12932b2494K5259k275l8123l958J1846k1533M585M1282L4673M520k731k2769j309
$$ -22494 2765 490 -37633 -41591 -29745 -51278 -46693 -5411 29262 33782 31051 8282 6973
12919F973j7349o268J8630r119k2737j1697J8246J6715P745J7910K4152j9643
$$ 6973 -10376 -16644 1986 -7133 -29870 -41567 -23321 -6606 1139 19049 43201 23558
12907B3558p153K4337j8190l965P305J703L760r542k6382j1653K0157j461J3974
$$ 23558 16405 40742 22552 18587 25892 27595 31355 21813 -4569 -16222 3935 2474 16448
12894A6448J4607j1659l8834J8742K0049j8563J3006K5068j3940j8043j080r347
$$ 16448 31055 19396 -19438 -696 19353 790 13796 38864 24924 6881 5801 -3546
12882c546J7764J2603k8459j1764j6410k748J6150K0478J543J1508l2219j9746
$$ -3546 14218 26821 -1638 -13402 -29812 -32560 -16410 4068 5611 17119 -15100 -34846
12870c4846K2805K0337O214Q279k378k4519k6059j0385J1749L0312L0275p248
$$ -34846 -12041 8296 14510 22789 20411 -4108 -30167 -40552 -28803 1509 31784 24536
12858B4536m3003o074m858K7007P960l4756k043L3666j6766l6512J2956K4786
$$ 24536 -18467 -24541 -29399 -2392 5568 -29188 -31231 2435 -14331 -50843 -37887 -13101
12846a3101K0809M205m173N069k1421k9721L3389l55k2368J1871J9201o404K071
$$ -13101 7708 11913 7740 12809 -8612 -38333 -4944 -5299 -27667 -15796 3405 -2999 -928
12833i28l2566m447j61j2176Q081J1004j0190L2851O7770L0405j4378l7909m7427
$$ -928 -33494 -37941 -38102 -50278 -42197 -31193 -41383 -8532 59238 89643 75265 37356 -10071
12820a0071P024J4091P77q61J1650p292m5589m6584J248M6766M9212O4J5826Q094
$$ -10071 -3047 11044 11821 10960 22610 15318 -30271 -76855 -75607 -28841 20371 20435 36261 44355
12806D4355l57P017K8507j7600k9506j1601l259k8177j1278M234j2539J9889J6117
$$ 44355 43998 51015 79522 61922 32416 20815 17556 -10621 -21899 -17665 -30204 -10315 5802
12793E802K1949J568K003n013k4772r072j4915J2621L3249L991j5631M798K5269
$$ 5802 27751 29319 31322 26309 1537 -7535 -22450 -9829 23420 27411 11780 16578 41847
12780D1847j2438l8330O688K4719j1346l7386o589J6417K5054j4436j0708p867
$$ 41847 29409 -8921 -2233 22486 11140 -26246 -32835 -16418 8636 -5800 -16508 -24375
12768b4375J2535L0767j695l573p445k7579j3986K473L8157P003n518j283K1589
$$ -24375 -11840 18927 17232 13659 6214 -21365 -35351 -32878 5279 12282 6764 5481 27070
12755B7070L2071L387m9231k5220R070k5451K0008N278q157k61j3357L989K71
$$ 27070 59141 62528 13297 -11923 -2853 -28304 -8296 -3018 -11175 -11436 -24793 -20804 -20533
12742b0533P738J2675o20J5433j9932J2029O825J0286J1952R936j4419l212j4289
$$ -20533 -12795 -120 -740 14693 -5239 6790 13615 23901 35853 45789 31370 28158 13869
12729A3869J2807L497l0898j1165J4718K4392R302k3110l2441k8000j4861K9949
$$ 13869 26676 30173 -725 -11890 2828 27220 36522 13412 -19029 -47029 -61890 -31941
12717c1941J051L4815j6962R334R368r453k7445k146l61M1042K0687K9032J3441
$$ -31941 -30890 3925 -13037 -3703 5665 -3788 -31233 -33379 -33740 7302 27989 57021 70462
12704G0462k4217l1047K0619L7899l703m2513m1239l3156k541K1763J8579j9174
$$ 70462 46245 15198 35817 73716 70013 27500 -13739 -46895 -49436 -27673 -9094 -28268
12692b8268j7573K6547J6054J5033j1455j2758L2148j330j1070l2023n490N5555
$$ -28268 -45841 -19294 -3240 11793 338 -12420 19728 18398 7328 -24695 -30185 25370
12680B5370K6558J0931o042j4672j9871Q992l636m255r191J0321K751j4039J165
$$ 25370 51928 62859 56817 42145 22274 31266 27630 23375 14184 24505 27256 13217 14382
12667A4382K862k9681k4301j5516j33K840J4931Q828j4893K4998K8694K114l0679
$$ 14382 17244 -12437 -36738 -52254 -52387 -49547 -34616 -25788 -40681 -15683 13011 15125 -15554
12654a5554n311J6155N999Q062M4720J7242R730J835m6508k1510j2147j5367L0975
$$ -15554 -20865 -4710 1289 9351 54071 71313 81043 82878 36370 14860 2713 -12654 18321
12641A8321J8877l2025O83j4454J1313J1041k1001k4298J7783r560j7755J0832
$$ 18321 37198 5173 5856 -8598 2715 13756 -7245 -31543 -13760 -23320 -41075 -30243
12629c0243J3670l0332N885K3180j0496n994K7951P112j5619J750k4509j5995
$$ -30243 -16573 -46905 -41020 -17840 -28336 -34330 -6379 733 -14886 -13136 -37645 -53640
12617e3640K7733R597p756j3838o328K9522L0790L1186m5262k1555J2794j5465
$$ -53640 -25907 -16310 -24066 -37904 -44232 -14710 16080 47266 2004 -19551 -6757 -22222
12605b2222P623k33J4017J6509j5442n380R568j4368j2466J3793l050k132o118
$$ -22222 -14599 -14832 -815 15694 252 -5128 4440 -9928 -22394 -8601 -11651 -13783 -19901
12592a9901Q470K7881K0159k1737M036J9900R59k9362J6851J5622m569j0336k5204
$$ -19901 -11431 16450 36609 14872 18908 38808 39767 10405 27256 42878 38309 27973 2769
12579B769K3268P542j5324K4156J7412Q823j7489K209L6319k0438m3580r293j9441
$$ 2769 26037 33579 18255 42411 59823 68646 51157 53366 89685 69247 25667 16374 -3067
12566c067o560K8916p611K709j7339j7451O821K5185j1208j8927L4670M8569P908
$$ -3067 -9627 19289 11678 14387 -2952 -20403 -13582 11603 395 -18532 16138 64707 72615
12553G2615j6928j21l9666j8470K2369K3122j3420J62k0895l272k148m544n438
$$ 72615 55687 55566 15900 -2570 19799 42921 29501 29663 8768 5496 3348 -1196 -6634
12540f634J8844j6862l094J3364N766j7446q948J3277J1570N350k781M907n968
$$ -6634 12210 -4652 -7746 5618 11384 -6062 -15010 -1733 9837 15187 12406 17313 11345
12527A1345M118J6494P45n333J0189j0075q085j2664Q653j4605k7910P894j0333
$$ 11345 15463 31957 32702 27369 37558 27483 19398 6734 15387 782 -27128 -19234 -29567
12514b9567J7592J3095k7170q789j036M089K685J6123M3899O213l281r770J1302
$$ -29567 -11975 1120 -26050 -34839 -35875 -31786 -29101 -12978 30921 37134 33853 24083 35385
12501C5385L6003L75l6864k3669P759O611L3623J008l1968k0262J7671O847n301
$$ 35385 71388 71763 34899 11230 18989 25600 59223 60231 28263 8001 25672 32519 27218
12488B7218J2676j3584p791M954k1894L291L736K3698k4599Q7L2177k3297l7194
$$ 27218 39894 26310 18519 23473 1579 4870 8606 32304 7705 7792 39969 16672 -20522
12475b0522J1532K3163M877k676p515M447R083j6120j7101j0808J1948K0249j739
$$ -20522 -8990 14173 19050 16374 8859 13306 22389 6269 -10832 -21640 -9692 10557 8818
12462H818p479R916J2720J7376Q051J3256l7969j0697j1383J072j206M842M532
$$ 8818 1339 11255 23975 41351 49402 62658 24689 13992 2609 3681 2475 7317 11849
12449A1849J6024P738K479j5130J9629N946k4562j8530K5463j1526k2552M418
$$ 11849 27873 35611 38090 22960 42589 48535 23973 5443 30906 19380 -3172 1246
12437A246K8187J1324q985L976K087j0177J9851m186k4255O091L1044k1077k9245
$$ 1246 29433 40757 31772 35748 37835 27658 47509 43323 19068 25159 56203 35126 5881
12424E881j6193M648L539K3006K1482m511m274m171J2844J2325o810K9985K582
$$ 5881 -10312 -5664 -2125 20881 42363 37852 33578 29407 42251 54576 47766 77751 80333
12411H0333k8657J057N958J100j2514K9357J2538j8214j1130k7711j0360N747
$$ 80333 51676 52733 58691 59791 47277 76634 89172 70958 59828 32117 21757 27504
12399B7504j8402k632K9709O677k7863R38K2839q85j6034J7295J0128k038K7365
$$ 27504 9102 6470 36179 42856 14993 15931 38770 37885 21851 39146 49274 47236 74601
12386G4601q561j4771n37j8388j9062J4838n919L0106K1149j5377k772m625r177
$$ 74601 66040 51269 50732 32344 13282 28120 22201 52307 73456 58079 55307 50682 41505
12373D1505k5088J9708N758O871o191n780k8893J7669J1057J0990K4932k2375
$$ 41505 16417 36125 41883 48754 42563 36783 7890 25559 36616 47606 72538 50163
12361E0163k3851k5850k6513j9096J5578O903O284O750j1068j0057J494M668J3344
$$ 50163 26312 462 -26051 -45147 -29569 -22666 -16382 -9632 -20700 -30757 -29263 -24595 -11251
12348a1251K3780K1815j6778L50n700k5482K302q85J872N018J519L7524J581m7517
$$ -11251 12529 34344 17566 17916 12216 -13266 -10964 -11849 -9977 -4959 -3440 34084 35665 -11852
12334a1852j9400J6822K5029R883p976k0222m829Q302o152L3831L518k2899R53
$$ -11852 -31252 -14430 10599 20482 12506 -7716 -12545 -4243 -10395 23436 26954 4055 5008
12321E008J1494N873J5560L05j3754M846J6731J0054j703l063L564O39j5379j9071
$$ 5008 16502 22375 37935 38240 24486 29332 46063 56117 54414 51351 54915 55554 40175 21104
12307B1104l0752j7650Q612J6569j3230J0883m724j2052L2610L1731K3094R673
$$ 21104 -9648 -27298 -18686 -2117 -15347 -4464 -9188 -21240 11370 43101 66195 75868
12295G5868k1461l3367k0637p86j5498l5884K6218j0309O558O306j4452o718N264
$$ 75868 54407 21040 403 -383 -15881 -51765 -25547 -35856 -29298 -22992 -37444 -44162 -38898
12282c8898J7719P084m963L49J2680j5227o665K5226J3043k094J3720J6584j5926
$$ -38898 -21179 -14095 -19058 -18709 -6029 -21256 -27921 -2695 10348 8254 21974 38558 22632
12269B2632p653p41N710j3704M313l0744j2349Q398J4831K823K1588n304J109
$$ 22632 14979 14238 19948 6244 10557 -20187 -32536 -24138 -9307 -6484 15104 9800 10909
12256A0909K5552j2009k9764Q869J0071k534j9827J880N368k7348N127j3748j0839
$$ 10909 36461 24452 -5312 3557 13628 11094 -8733 -6853 -1485 -28833 -23706 -37454 -48293
12243d8293L7695Q473k0744m21J4864J0363K4141L169j5130L393j684J1431k309
$$ -48293 -10598 -2125 -22869 -23290 -8426 1937 26078 29247 14117 17510 15826 27257 24948
12230B4948k237k219J5555J3108j4359l4373P611M408N436k4044j8101K2446K7466
$$ 24948 22711 20492 36047 49155 34796 423 8034 12442 17878 -6166 -24267 -1821 25645
12217B5645K7458J2508k0923n355j0531k7885n835J1439J1369k0225k6876K871
$$ 25645 53103 65611 44688 39333 28802 917 -4918 6521 17890 -2335 -29211 -26340
12205b6340P015k358J3325l7087j5506J4634J7961J3882K7171J4187j1178K226
$$ -26340 -19325 -21683 -8358 -45445 -60951 -46317 -28356 -14474 12697 26884 15706 17932
12193A7932M052k3046j8096j2103Q983J2041J870L057j4463k2257O578L4824k2298
$$ 17932 21984 -1062 -19158 -31261 -22278 -10237 -8367 -5310 -19773 -42030 -35452 -628 -22926
12180b2926p139K7603Q357J2293k7770r652k5436j0190K0478K7377l685j6063
$$ -22926 -30065 -2462 5895 18188 -9582 -19234 -44670 -54860 -34382 -7005 -10690 -26753
12168b6753J9468r347M294R262L1467J2349n577k1000j0989p288M832J5957J2390
$$ -26753 -7285 -16632 -12338 -3076 28391 40740 35163 14163 3174 -4114 718 16675 29065
12155B9065M101k1970r394P634j7705j8934j0133l4368l715K2374L477J1055J0696
$$ 29065 33166 11196 1802 9436 -8269 -27203 -37336 -71704 -75419 -53045 -49568 -38513 -27817
12142b7817K5917J502j1852K24k86J0767n041k1720J9027K6338j5247M224j511
$$ -27817 -1900 -398 -12250 -12026 -12312 -1545 -6586 -28306 -9279 17059 1812 6036 4525
12129D525j0949N947P150J6473k2020m180Q448J1858L1953n915l8865k2840N481
$$ 4525 -6424 -477 6673 23146 1126 -3054 5394 17252 49205 43290 4425 -18415 -12934
12116a2934K8545R684P966J0686O135j7423k7787p418j1775k4835J4283K4861
$$ -12934 15611 25295 33261 43947 50082 32659 4872 -2546 -14321 -39156 -24873 -12
12104a2Q024J9673j6087J2694m033k5192J6352J0127K768J1125q023m754m591
$$ -12 8012 27685 11598 24292 20259 -4933 11419 21546 24314 35439 27416 22662 18071
12091A8071P05O799o994p524r90l6609o571L0428K6756r213j3561K366K3412R077
$$ 18071 18776 25575 18581 11057 10067 -26542 -33113 -2685 24071 14858 1297 3663 27075 36152
12077C6152Q419k1210j4587L791j8209K9597k2474J5315J1235k0140k691r9J381
$$ 36152 44571 23361 8774 12565 -5644 23953 1479 16794 28029 7889 5198 5099 6480
12064F480p456K7609M112k7087k2089m7932J6043K5631K7199O263j3962l247P093
$$ 6480 -976 26633 30745 3658 -18431 -66363 -50320 -24689 2510 8773 -5189 -8436 -1343
12051a343j761q104J2322M103j6244M580K3228K9219j5879j0452n880j4641l434
$$ -1343 -3104 -11208 1114 5217 -11027 -6447 16781 46000 30121 19669 13789 -852 -4286
12038d286O064K6577L2571r960j1813k1498k0177j2272L1306k4241j0873j2204
$$ -4286 1778 28355 60926 50966 39153 17655 -2522 -14794 16512 -7729 -18602 -30806
12026c0806R933K3299J0232k1244J4881J508j5473j0731j2189j6875R304J9093
$$ -30806 -20873 2426 12658 -8586 6295 7803 -7670 -18401 -30590 -47465 -38161 -19068
12014a9068n814J0398O652J0920q026J5897K0751k3237k5202o951P410O312K4502
$$ -19068 -24882 -14484 -7832 3088 -4938 10959 31710 8473 -16729 -23680 -16270 -9958 14544
12001A4544N566p409k8733k82R586J7271K9298j8466l9447J71J225J9139J0981
$$ 14544 20110 12701 -16032 -16314 -6728 10543 39841 21375 -18072 -17901 -16676 2463 13444
11988A3444N922j9307o317K7452o827l9530l3452J0444M2496K4750q14k3398k2492
$$ 13444 19366 59 -6258 21194 14367 -25163 -58615 -48171 -5675 19075 18261 -5137 -27629
11975b7629R175l395J418N4j9133j408J710L411K2818p772k311k382j3092K0556
$$ -27629 -18454 -21849 -20431 -20377 -39510 -40918 -39208 -35797 -12979 -20751 -23062 -25444 -38536 -17980
11961a7980K7099J1866k3770j936P141q737l208J3580J9970K7910N801n0231k8010
$$ -17980 9119 20985 -2785 -4721 2420 -6317 -9525 4055 24025 51935 57736 7505 -20505
11948b0505o496P468j247j0493J1991J815j6404q298n098q07J405r85N899L6415
$$ -20505 -27001 -19533 -20780 -31273 -19282 -17467 -33871 -42169 -47267 -48074 -46669 -47654 -41755 -5340
11934e340L6594j3323m7198J4752J8668J0470k7955k7598j3022K4089M6863L045
$$ -5340 31254 17931 -29267 -14515 4153 14623 -13332 -40930 -53952 -29863 17000 20045
11922B0045M886l4841j2409O455j2176L2899O31J5486l5438O676L2809r309j7640
$$ 20045 24931 -9910 -22319 -15864 -28040 4859 5490 20976 -14462 -7786 25023 15714 -1926
11909a926j6379r492p941m880j9080N833K4561L1754J0957k4487j1790J4801j1653
$$ -1926 -18305 -27797 -35738 -40618 -59698 -53865 -29304 2450 13407 -11080 -22870 -8069 -19722
11896a9722J4388L050o439n901K753k4419L3359M4334R637L959k2678o108K327
$$ -19722 -5334 -2284 -8723 -14624 -11871 -36290 -2931 41403 51040 54999 32321 26213 28540
11883B8540k3483j5206m964M249k4180j1710R061J621J1619J4646p452l53P53
$$ 28540 5057 -10149 -15113 -10864 -35044 -46754 -37693 -36072 -24453 -9807 -17259 -17612 -16859
11870a6859o420n249M1334n11l0911J9158l3085p082k0096l117L1069K3357j5553
$$ -16859 -23279 -28528 12806 12295 -18616 542 -32543 -39625 -59721 -62838 -31769 -8412 -23965
11857b3965M234J3046K2165k2743l5755k2455N0663K7520k3051j3599j2790k1547
$$ -23965 -19731 -6685 15480 -7263 -43018 -65473 -14810 12710 -10341 -23940 -36730 -58277
11845e8277Q475M0520M4648j6182K4543n906o4015j5354J4732M403R281K643L5912
$$ -58277 -49802 -9282 35366 19184 43727 37821 -26194 -41548 -26816 -22413 -13132 -10489 25423
11832B5423O451k4136j5787J5145J1882r310m31J1033k2349j8711m051J8807R361
$$ 25423 31874 7738 -8049 7096 18978 9668 9237 20270 -2079 -20790 -24841 -6034 3327
11819C327k1142L9862J4306l7375l3042j8725m07K2726K400p334Q876k7602j237
$$ 3327 -17815 22047 36353 -1022 -34064 -52789 -53196 -30470 -28070 -35404 -26528 -54130 -55367
11806e5367K4297K0484L0600j5837k873K3424q778j8118J4031J7238k803K426
$$ -55367 -31070 -10586 20014 4177 1304 24728 15950 -2168 11863 29101 26298 28724
11794B8724p971R574j945m330M688l0952j7767j783L7758N348k5796R240j711
$$ 28724 20753 30327 28382 24052 28740 -2212 -19979 -21762 15996 21344 -4452 4788 3077
11781C077M975P736O647K6016j845j4819K5447l136r02j995k5928p501J1609j4036
$$ 3077 8052 15788 22435 48451 46606 31787 57234 54098 53196 51201 25273 17772 29381 15345
11767A5345j1645J1789q660k896N357q317J2322J3865J3077R723m649j8180j836
$$ 15345 3700 15489 6829 3933 9290 973 13295 27160 40237 49960 45311 27131 25295
11754B5295j0821l1839j3660k9699j7933L0219M0305J7604K3417n963r587j4366
$$ 25295 14474 -17365 -31025 -60724 -78657 -48438 -8133 9471 32888 26925 17338 2972
11742B972k2928R372J5009o687K363L0637J4407j0074k5579j0292M994P108j2007
$$ 2972 -19956 -10584 4425 -2262 101 30738 45145 35071 9492 -800 4194 11302 -705
11729g05K0804m959M989m470j5564j2632q21k382J4862J8336l776Q270q60k508
$$ -705 20099 15140 20129 15659 95 -12537 -13358 -15740 -878 17458 13682 21952 21092 18584
11715A8584N65n0900k1373J8007Q879Q649P701L537k1962J2253J736m2362L0671
$$ 18584 19149 -31751 -53124 -35117 -26238 -17589 -9888 -6351 -28313 -16060 -14324 -56686 -26015
11702b6015K1410K2697Q020O776p114l0538k8159N863k37k0757J8381J6807r139
$$ -26015 -4605 18092 26112 32888 25774 -4764 -32923 -27060 -27297 -48054 -29673 -12866 -22005
11689b2005o288K5358L1767l53P363j195N501k7514O768K8455k5460k1942l3904
$$ -22005 -28293 -2935 28832 28479 35842 34647 40148 12634 19402 47857 22397 455 -33449
11676c3449k54J8156J1151J8927k547m490q747l743J5738J5051J0087O832N371
$$ -33449 -33703 -15547 -4396 14531 11984 7494 -1253 -4996 10742 25793 35880 42712 48083
11663D8083P57Q890k8636j5960j6180p86J4976j4705Q824K2388j3264o486o743
$$ 48083 48840 57730 29094 13134 -3046 -3832 11144 -3561 5263 27651 14387 7901 1158
11650A158j2166k1455k8084J2108L4262K2338k0444L866j8349k937J4052J8662
$$ 1158 -11008 -32463 -60547 -48439 -14177 8161 -12283 -8417 -26766 -29703 -15651 3011
11638C011J9811L113j9222r206J4975k2900o177L7058K6536l3647q579m210j3242
$$ 3011 22822 25935 6713 -2493 12482 -10418 -16595 20463 46999 13352 4773 563 -12679
11625a2679j2585L012P663Q312j3139j6705j834q669J3551p412q106J8178K3495
$$ -12679 -25264 -22252 -14589 -6277 -19416 -36121 -37955 -46624 -33073 -40485 -48591 -30413 -6918
11612f918J537J4534k940j829p904l8792k5325K5172K8808J0837J4690L181k4564
$$ -6918 -5381 9153 6213 4384 -3520 -42312 -67637 -42465 -13657 -2820 11870 15051 -9513
11599i513j3815J3838j5238m0978Q963L0035K9082N345l089k4880O536j6466P214
$$ -9513 -23328 -9490 -24728 -65706 -56743 -26708 2374 7719 4630 -20250 -13714 -30180 -22966
11586b2966J2423M522J1092j5732j2871j3479o69r609j8853k2939L9074K2985
$$ -22966 -10543 -6021 5071 -10661 -23532 -37011 -37680 -47289 -66142 -89081 -50007 -27022
11574b7022J4710L4819l305O697j449l109q975J2060j7054K544j6603L817p120
$$ -27022 -12312 22507 19202 25899 24450 21341 12366 24426 7372 9916 -6687 -2870 -9990
11561i990P00K9522L5920K603j5248j719o528o793j9145o317r18J9047L7418j3353
$$ -9990 -9290 20232 56152 58755 43507 41788 35260 28467 9322 3005 2087 21134 58552 45199
11547D5199m638k0777j65J332J1689m544q604r578k4833K047K6471K6543J1141
$$ 45199 40561 19784 19619 20951 32640 28096 19492 9914 -14919 -12872 13599 40142 51283
11534E1283k6812j2192j3748k0624k365J4833M423J483J7208J309p545J8687K4009
$$ 51283 24471 12279 -1469 -22093 -24458 -9625 -5202 -3719 13489 14798 7253 25940 49949
11521D9949r549k7886l6635L9947J6052j4679L1210k5365l8555J7333j1722j3599
$$ 49949 40400 12514 -24121 15826 31878 17199 48409 23044 -15511 1822 -9900 -23499
11509b3499K5119j464q969p919R105Q369R344j639r22M363r927N750j7514j6666
$$ -23499 1620 156 -8813 -16732 -7627 742 10086 8447 7525 11888 1961 7711 -9803 -26469
11495b6469k5990j2030N94M516L5014n937l035Q016L9765J8907J2533o558j1716
$$ -26469 -52459 -64489 -63895 -59379 -24365 -30302 -33337 -25321 14444 33351 45884 39326 27610
11482B7610l5056j0105k120J2503L509K6154K8746J1418k9443l6134j7355J9552
$$ 27610 -7446 -17551 -19671 -7168 -3659 22495 51241 62659 33216 -2918 -20273 -721
11470g21J7357j1191j2113Q774J9003j9843l0560j5962L044J3937K9358J8029
$$ -721 16636 5445 -6668 2106 21109 1266 -29294 -45256 -42212 -28275 1083 19112
11458A9112j9818J0778j3747Q682o474q794K157j6443K1812K310k3630r939j3200
$$ 19112 -706 10072 -3675 5007 -1467 -10261 -8104 -24547 -2735 -425 -24055 -33994 -47194
11445d7194q477N3007L2474j2261P815N918j2949N020N782K2740M598k0730k4192
$$ -47194 -55671 -2664 29810 17549 25364 31282 18333 23353 29135 51875 56473 35743 11551
11432A1551J7681J0306j9870r025J7594K1245K3206P867j5354k9628J3586j1675
$$ 11551 29232 39538 19668 10643 28237 49482 72688 80555 65201 35573 49159 37484
11420C7484k1579K5238K4784Q010k5913O245k59j7391k231R061l2976r345k5631
$$ 37484 15905 41143 65927 73937 48024 54269 54010 36619 34388 43449 10473 1128 -24503
11407b4503j513K2929L047o849j4115J2107K9496n284j5585j0895J4042L3948
$$ -24503 -26016 -3087 -40 -6889 -21004 -8897 20599 15315 -270 -11165 2877 36825
11395C6825J4008j1506k5024M790M395q223j1802j8314P947J5014M426L4248j58
$$ 36825 50833 39327 14303 19093 23488 15265 3463 -14851 -6904 8110 12536 46784 46626
11382D6626n737k0946j2100J1198K1835o534j6902j8531J199m083k1492J7323
$$ 46626 40889 19943 7843 19041 40876 34342 17440 -1091 108 -3975 -25467 -8144
11370h144J1683J8835R010n887k695j5691l0633K5794l17k4696L281O248M470
$$ -8144 3539 22374 31384 25497 22802 7111 -23522 2272 1955 -22741 -19460 -13212 -8742
11357h742p1k176O442L0949j3733J4020L4581j0666J7198L0892q500m4909m1525
$$ -8742 -8813 -10989 -4547 26402 12669 26689 61270 50604 67802 98694 90194 45285 3760
11344C760j0073k923j1967J6126K048J1139L437O523N630J4084J7218k4068m198
$$ 3760 -6313 -9236 -21203 -5077 -3029 8110 11547 18070 23700 37784 55002 30934 26736
11331B6736K5489l174O673O798l2406j284m390R729J3060M154J0087p70l6481
$$ 26736 52225 49051 55724 62522 30116 28832 24442 34171 47231 51385 61472 60702 24221
11318B4221m2893L601J9744Q147J6302m680j2588P673m65n710j4861p385k5713
$$ 24221 -18672 -15071 4673 12820 29122 24442 11854 19527 19062 13352 -1509 -8894 -34607
11305c4607P685M1428Q00l5407l2921r245k7821K3956J4066J8824P462j332J6180
$$ -34607 -26922 14506 15306 -20101 -53022 -62267 -90088 -66132 -52066 -33242 -25780 -27112 -10932
11292a0932J4712q116j8622J8668J7932j6160N775l2060o199L5475M808O435k5106
$$ -10932 3780 -4336 -22958 -4290 13642 -2518 3257 -28803 -35002 473 5281 11716 -13390
11279a3390j5019p668L9124K2627K0554k360m5570p542k396L5573J9715k4184
$$ -13390 -28409 -36077 3047 25674 46228 43868 -1702 -9244 -11640 23933 43648 19464
11267A9464k6064l500o437m1J4227m269J5572j813l1832n52R316J2976K5910J3885
$$ 19464 -6600 -10100 -16537 -16578 -2351 -6620 8952 7139 -24693 -25245 -15929 -2953 22957 36842
11253C6842k689k4864J6513J1144j3594j9255J1744L6153P313n1720j6230J2685
$$ 36842 34153 9289 25802 36946 23352 4097 15841 51994 59307 7587 -8643 4042
11241D042L1105r919L447Q433J1566n685m760J995q755l482n294P151L2340J0616
$$ 4042 35147 25228 28675 37108 48674 42989 38229 40224 31469 27987 22693 29844 62184 72800
11227G2800k2799j4226j3416j8954R342j929j34J0692L2777j9169j7276L0966
$$ 72800 50001 35775 22359 3405 12747 10818 10684 21376 54153 34984 17708 48674
11215D8674O533L236J9883Q298J1493j4707m1799n2660J275L2659J8204L90K0151
$$ 48674 55207 58443 78326 86624 98117 83410 41611 -11049 -9774 22885 41089 41479 61630
11202F1630J0387k855r957k4322l5435o793j2364P085K6948K1625K53k0586j5088
$$ 61630 72017 69162 59205 34883 -552 -7345 -19709 -12624 14324 35949 36202 15616 528
11189E28P71J3042j2225J0556K260L7899j1872j6980J5280J1541k6676K033l74
$$ 528 1299 14341 2116 12672 14932 52831 40959 23979 39259 50800 24124 26157 25783
11176B5783l6783n388K4654R406M773J8834O412j0936l4704k5702j4211L1731
$$ 25783 -11000 -16388 8266 17672 22445 41279 47691 36755 2051 -23651 -37862 -6131
11164f131L1898J9369j3690j8471J5817J09k6181o53k0531j1212l739J7800K759
$$ -6131 25767 45136 31446 12975 28792 28901 2720 2067 -18464 -29676 -33415 -15615 -12856
11151a2856N606p038k6255j1613J8882N1210J6621j3143Q032n148J1966j5630
$$ -12856 -7250 -14288 -40543 -52156 -33274 17936 34557 21414 29446 24298 36264 20634
11139B0634m731j1572L590L757j690M6388M030n4652j916Q691J4286j9497p860
$$ 20634 15903 4331 7921 11678 9988 56376 60406 5754 3838 12529 26815 7318 -542
11126e42o025P879l839j9488r754L0426J7412N743o303o038K0153L0504J3586
$$ -542 -6567 1312 -2527 -22015 -31769 -1343 16069 21812 15509 9471 29624 60128 73714
11113G3714j105o898Q10j8577j0023R259j11m256j3643O727o601Q947N451l1015
$$ 73714 72609 65711 66521 47944 37921 47180 47069 42813 29170 35897 29296 38243 43694 12679
11099A2679j5481m073n320O812K3366j2108k0555k799K0629n623J6977m186j8015
$$ 12679 -2802 -6875 -12195 -5383 17983 5875 -14680 -17479 3150 -2473 14504 10318 -7697
11086g697K7654J164l196K9302q956P163M0497j2034l3397j0426j7194K280J2839
$$ -7697 19957 21121 17925 47227 38271 45434 85931 73897 40500 30074 12880 15160 27999
11073B7999j5561j460k2184k7196j3271k271K4140L0664J6145O116L5541n08R743
$$ 27999 12438 10978 -11206 -38402 -51673 -53944 -29804 860 17005 23121 58662 58154 67897
11060F7897o958j6102K979R512q368l2866K1626L3880L357J648r926q809k8032
$$ 67897 60939 44837 47816 57328 48960 16094 37720 71600 74957 76605 66679 57870 29838
11047B9838m5918O994L3801K8424J2816P462l6725j3957k525N610o49K71k6313
$$ 29838 -16080 -9086 24715 53139 65955 73417 36692 22735 20210 25820 25171 25442 -871
11034h71j9014J5970J29j8821k0890J6107N3282l97P427j8637k9724p018M3132
$$ -871 -19885 -3915 -3786 -22607 -43497 -27390 25892 25495 32922 14285 -15439 -22457 20675
11021B0675L6193K1122j2529m0034P894p410J8030J1365j5262J5642L4389j9242
$$ 20675 56868 77990 65461 25427 33321 25911 43941 55306 40044 55686 90075 70833
11009G0833l1653K0860J1473n481q255K0765J9418l5627m1664J4135J4177l4427
$$ 70833 39180 60040 71513 66032 57777 78542 97960 62333 20669 34804 48981 14554
10997A4554Q231L8114j3483p958j8932o246R417J931L6251M943l25m758j7623
$$ 14554 22785 60899 47416 39458 20526 14280 23697 25628 61879 66822 66497 61739 44116
10984D4116j5804J3993n136k1479p06K2084J146k5197j7455k741p215M615K4706
$$ 44116 28312 42305 37169 15690 14984 37068 38214 13017 -4438 -7179 -14394 -9779 14927
10971A4927J0521j0943K76j5298K1307K1792J4485j9371K885l3590Q012J5311
$$ 14927 25448 14505 14781 -517 20790 42582 57067 37696 40581 6991 15003 30314
10959C0314J902r722j1818P466K2805o29L015k0942k5097M598K2216Q038L3453
$$ 30314 32216 22494 10676 18142 40947 40318 43333 22391 -2706 1892 24108 32146 65599
10946F5599J5983J3462m663k5586j0060j9995j8664k200p372k571J8618Q647L720
$$ 65599 81582 95044 90381 64795 54735 34740 16076 13876 6504 3933 22551 31198 34918
10933C4918P083L3469M5421J6435n2148m476K989q776p106j8079P183J3396J9411
$$ 34918 42001 75470 120891 137326 85178 80702 83691 74915 67809 49730 56913 70309 89720
10920H9720K4451j7149j5330l468P105O6980K2647N758M602J2963K1531M9690
$$ 89720 114171 97022 81692 78224 85329 152309 174956 180714 185316 198279 219810 269500
10908B69500M4704Q7759J51765K08006K39374L24261K65842J20955J71907K23559
$$ 269500 314204 401963 553728 761734 1001108 1325369 1591211 1712166 1884073 2107632
10898B107632P7547j71459k89948k20111j61115k46711k55214k31776j80326j27508
$$ 2107632 2185179 2013720 1723772 1503661 1342546 1095835 840621 608845 428519 301011
10888C01011p4131j8273k1463l0122o117m970k3180l5468k9346J3526M5226N021
$$ 301011 226880 208607 187144 157022 150905 145935 122755 87287 57941 71467 116693 121714
10876A21714k9557j290o907j9937P196q911K395l353j1825k8403K831L8209K8238
$$ 121714 92157 90867 83960 64023 71219 62308 64703 61350 49525 21122 23953 62162 90400
10863I0400O887j9717k514k3658m467M2710L090r174q941k4314k4191k2707L1754
$$ 90400 97287 77570 75056 51398 46931 89641 92731 83557 74616 50302 26111 3404 35158
10850C5158K0044n859m123J86J8078K1578k2106j1025K5778P345k7664J6826o28
$$ 35158 55202 49343 45220 45406 63484 85062 62956 51931 77709 85054 57390 74216 73588
10837G3588M689J1687l470j6695k1222J8798l02j8638N624N509p691K0556L5130
$$ 73588 78277 89964 86494 69799 48577 67375 67073 48435 54059 59568 51877 72433 107563
10824A07563L564k3448J9722P187k2329m0736M583j2032n281K4759K3852k0155
$$ 107563 111127 87679 107401 114588 92259 51523 56106 44074 38793 63552 87404 67249
10812F7249j9975P642J1571k9573l4719n56r998n88O935j086j0352K036K7307
$$ 67249 47274 54916 66487 36914 2195 1639 -8359 -8947 -2012 -3098 -13450 -11414 15893
10799A5893K1417N9231K9972p29p280K8782k3501m3472l2342K0945L1791l686
$$ 15893 37310 96541 126513 125784 118504 147286 123785 80313 47971 68916 100707 97021
10787I7021j7238K0330K7590K3300k2769l425j7578l535j6878r289l360R238o112
$$ 97021 79783 100113 127703 151003 128234 124809 107231 103696 86818 77529 74169 83407 77295
10774G7295R689M8370Q546l3512j924r373r191R026Q373J9819K2828R465o592
$$ 77295 86984 135354 143900 110388 108464 99091 89900 98926 107299 127118 149946 159411 152819
10761A52819J0311K6381p768k0179Q75K9223J8457l1851l4423K418K7305J5527
$$ 152819 163130 189511 181743 161564 162439 191662 210119 178268 143845 146263 173568 189095
10749A89095m598N663j6052k1n330j7738J1748N6892K6667n4188k656r838j6126
$$ 189095 184497 190160 174108 174087 168757 151019 162767 219659 246326 192138 189482 179644 163518
10736A63518J4079K6567L1081l019m4014m3915j2716L803J3238m627J0557N505
$$ 163518 177597 204164 235245 232226 188212 144297 131581 135384 148622 143995 154552 160057
10724A60057j226R252J3501j959l1871j0554J9725J0681J6030M7487J9153k8660
$$ 160057 158831 168083 181584 179625 147754 137200 156925 167606 183636 231123 250276 221616
10712B21616K085L4725j4499l7382j5077l4707l2890k8004J0953L5101K127k1041
$$ 221616 223701 258426 243927 206545 191468 156761 123871 95867 106820 141921 144048 123007
10700A23007P697M4360K5512j8664P144L1007k1449j0364K828J5481J8206R390
$$ 123007 130704 175064 200576 181912 189056 220063 198614 188250 191078 206559 224765 234155
10688B34155r166L959J4561l8968k8352J3938K4386J5689l5861K632l1816Q716
$$ 234155 224989 228948 243509 204541 176189 190127 214513 230202 194341 196973 165157 173873
10676A73873J3841j2263l1958P745J7927J6904K3824J6953K8465J8334q037k678
$$ 173873 187714 175451 143493 151238 169165 186069 209893 226846 255311 273645 265608 262930
10664B62930J3480J4178m079J74J9541j1769l5299j8664l8552k8414o003K3542
$$ 262930 276410 290588 286509 286683 306224 294455 259156 240492 201940 173526 167523 191065
10652A91065K8646N668r371k1101l6776N795K6665J3290m782L9606j554j9068
$$ 191065 219711 225379 216008 194907 158131 163926 190591 203881 199099 238705 237151 218083
10640B18083n995K8197J5119K5137J5504K8553K3335J39L666k9168j1261J3623
$$ 218083 212088 240285 255404 280541 296045 324598 347933 348072 351738 322570 311309 324932
10628C24932N2610M9411J1880J7462M955R034j3302k3252j7809l0787J5240R44
$$ 324932 377542 426953 438833 456295 461250 470284 456982 433730 415921 385134 400374 401318
10616D01318j4627l3098k6156q484K2957K5072k2694J2542K287k3722l2161Q518
$$ 401318 386691 353593 327437 318953 341910 366982 344288 356830 359117 335395 303234 311752
10604C11752J9268J899k4610l131K4286J878k533m0095k1553J4122L7478l344
$$ 311752 331020 332919 308309 305178 329464 331342 328809 288714 267161 281283 318761 315417
10592C15417m1889K6980M4725L4491K2566n503J4741J3414K8781L1128K4252K1600
$$ 315417 273528 300508 345233 379724 402290 396787 411528 424942 453723 484851 509103 530703
10580E30703J4241K3827L2593M747L3569K0363j1158l4024K4866M8205J9742K7554
$$ 530703 544944 568771 601364 606111 639680 660043 648885 614861 639727 687932 707674 735228
10568G35228Q116J4914K01J9004N8990L8930K2688J3684K552J5930K1377L7658
$$ 735228 743344 758258 758459 777463 836453 875383 898071 911755 914307 930237 951614 989272
10556I89272O2584K5262L0835P4803N9195J8994J3788O1596M4932L8759K9857
$$ 989272 1051856 1077118 1107953 1182756 1241951 1260945 1274733 1336329 1381261 1420020 1449877
10545A449877j2211L6083M3915N5049J11332J00674P9110P4653Q4723J09935J34153
$$ 1449877 1437666 1473749 1517664 1572713 1684045 1784719 1863829 1938482 2023205 2133140 2267293
10534B267293J34036J17219J17305J27405J93151J83959J78483K07067K32596
$$ 2267293 2401329 2518548 2635853 2763258 2956409 3140368 3318851 3525918 3758514
10525C758514K77778L56605M61267N37153O85455P84347P84303P72473R13199
$$ 3758514 4036292 4392897 4854164 5391317 6076772 6861119 7645422 8417895 9331094
10516I331094J172720J244050J131512J263242J499644J846651K254902K825129
$$ 9331094 10503814 11747864 12879376 14142618 15642262 17488913 19743815 22568944
10508B2568944L631622N003215P399447J1004800J6530158K4743728L5525258
$$ 22568944 26200566 31203781 38603228 49608028 66138186 90881914 126407172
10501A26407172M8787142N9461883M7913198K5938474K8760617M2280240K1509280
$$ 126407172 175194314 234656197 282569395 308507869 337268486 379548726 401058006
10494D01058006l1211478n4138672l8215069k8006047m6423919n7770201m5650359
$$ 401058006 369846528 315707856 277492787 249486740 203062821 145292620 99642261
10487I9642261k9202780j8188706j1699438p860468n464901l961927l074250k570781
$$ 99642261 70439481 52250775 40551337 32690869 27225968 23264041 20189791 17619010
10479A7619010k055352j556236j344003j261903j020970q17916q68840r05546
$$ 17619010 15563658 14007422 12663419 11401516 10380546 9562630 8693790 7788244
10471G788244q00170o41384o17005o95201n99754m78957l61609l11526k48419
$$ 7788244 6988074 6346690 5729685 5034484 4434730 3955773 3594164 3282638 3034219
10462C034219k03681k26691j65702j30398j51592j34817p3532r6363j21400r3899
$$ 3034219 2830538 2603847 2438145 2307747 2156155 2021338 1947806 1851443 1730043 1636144
10452A636144o2927o5780o2510j02027r6873l0270k1386n4304p4316o2549o4936
$$ 1636144 1573217 1507437 1444927 1342900 1246027 1215757 1194371 1140067 1065751 1003202 938266
10441I38266m7817j7762m7075m3488l4885j5264J7394l4479k7241j2877j6193
$$ 938266 890449 872687 825612 782124 747239 731975 749369 714890 687649 674772 658579
10430F58579l2253k7932j9246J4808k0283j8850n3887q805j5748l9391j0110K155
$$ 658579 626326 598394 579148 593956 573673 554823 500936 492131 476383 436992 426882 429037
10418D29037j1705J1208J1121j9863k1656p283J833L1453N3279j7856j6342J873
$$ 429037 417332 428540 439661 419798 398142 390859 392692 424145 477424 459568 443226 445099
10406D45099J43Q664n313j8718J7006k3504n274k7248j0393r48q396l4921j5389
$$ 445099 445242 453906 448593 429875 446881 423377 418103 390855 380462 379514 371118 336197 320808
10393C20808Q234r924q659m158K3050Q153l8914k3400j6511j2817K4167j6001
$$ 320808 329042 319118 310459 306301 329351 337504 298590 275190 258679 245862 270029 254028
10381B54028J2679K0756Q405k3064K3865K1638J361J8340K1045J2968Q498k2043
$$ 254028 266707 287463 295868 272804 296669 318307 319668 338008 359053 372021 380519 358476
10369C58476p029K1473L1618k5512k7200k5869j8304q268k246o264k6509j7828
$$ 358476 351447 372920 404538 379026 351826 325957 307653 299385 297139 290875 264366 246538
10357B46538k7161Q512L201k4747k9371o895J2719K8423J9451j8729k4998L935
$$ 246538 219377 227889 231090 206343 176972 170077 182796 211219 230670 211941 186943 190878
10345A90878L2068J3066K2559L5009J6032L1210N3022J10115J41665J63890J52782
$$ 190878 222946 236012 258571 293580 309612 340822 393844 503959 645624 809514 962296
10334I62296J79764K10151J45254Q0321K6098p078p0187j40034j99199k10358
$$ 962296 1142060 1352211 1497465 1577786 1603884 1596806 1526619 1386585 1187386 977028
10324I77028j80092j53373j56049q0690q4384o5383m0725j3808J9403k475o097
$$ 977028 796936 643563 487514 406824 322440 257057 216332 202524 221927 219452 213355
10313B13355l4031l4892r282l096j8092j1131j2942k2491k6074r783j8041l2528
$$ 213355 179324 144432 135150 132054 113962 102831 89889 67398 41324 31541 13500 -19028
10301a9028j2101L9892L0016K448J4806m562j7413J468q465l7402j6890L3618
$$ -19028 -31129 8763 38779 41227 56033 51471 34058 35526 27061 -10341 -27231 6387
10289F387N955j1297J4017j4733j6856q178J2081K3881J2050J0000R343j3956
$$ 6387 12342 1045 15062 329 -16527 -24705 -12624 11257 23307 33307 42650 28694
10277B8694l5731p064J2148k713o835K9145J1139K404o438J174J7340o936J5062
$$ 28694 -7037 -14101 -1953 -4666 -11501 17644 28783 31187 24749 25923 43263 36327 51389
10264E1389K624m000J6999J3266K2328J2368l7800o73Q634K4060j7620j0378P306
$$ 51389 54013 50013 67012 80278 102606 114974 77174 76501 85135 109195 91575 81197 88503
10251H8503Q228l0984j1728K512K3055K0209J233k3407q102J3605J520k925m1238
$$ 88503 96731 65747 54019 56531 79586 99795 101028 77621 69519 83124 84644 81719 40481
10238D0481j8500M1043J9584k8818n915J8424L525j4973j9324J4632Q709k6215
$$ 40481 21981 63024 82608 53790 47875 66299 69824 54851 35527 50159 58868 32653
10226C2653O592J4137l7570j8604K0497k1714p557j4982q438N728K3763Q350j0464
$$ 32653 39245 53382 15812 -2792 17705 -4009 -11566 -26548 -34986 -29258 -5495 2855 -7609
10213g609j1015o757O286r21j8746j3896K4011K1597k1241n430k326k1715j1057
$$ -7609 -18624 -25381 -19095 -20016 -38762 -52658 -28647 -7050 -28291 -33721 -36047 -57762 -68819
10200f8819J8965L5329l585n048j4275l9137J9847K7618J2252L9857J7241k1983
$$ -68819 -49854 -14525 -18110 -23158 -37433 -76570 -56723 -29105 -16853 23004 40245 18262
10188A8262K7835J7674K486p701k109K988k1193j140J2071M881o636L215J2885
$$ 18262 46097 63771 66257 58556 56447 59435 38242 37102 49173 54054 47418 50633 63518
10175F3518j3054M953q77k3457M422k232L646R833M009l128m355O57p510l7482
$$ 63518 50464 55417 54540 31083 35505 33273 36919 46752 50761 47633 43278 43935 36425 -1057
10161a057k7306l0359N402K0003k835N776M1046L5928l044l6377J728J011J2066
$$ -1057 -28363 -58722 -53320 -33317 -36152 -30376 10670 46598 43554 7177 8905 9916 21982
10148B1982l895m967j6395J9432M751K148n653P263j9004j3524pJ8951l845Q477
$$ 21982 18087 13120 -3275 16157 20908 23056 17403 24666 5662 -7862 -7869 11082 7237 15714
10134A5714J8368j9631j7446J1848J4118O33l419q818j5284j9757J0125J5950
$$ 15714 34082 14451 -2995 8853 22971 23604 20185 11367 -3917 -23674 -13549 2401
10122B401j425J4750J3140O786r717k615K3278K7105J802m0268J3035M7599O143
$$ 2401 976 15726 28866 35652 25935 23320 46598 73703 75505 35237 48272 95871 102014
10109A02014j4876J118L159l3215j1235N42r604K3991L2860L0092J8422M0881
$$ 102014 87138 88256 91415 58200 46965 47507 37903 61894 94754 124846 143268 184149
10097A84149M8606O7037R7470J79472K16773K77661K81223J96954J40814J97948
$$ 184149 232755 299792 397262 576734 793507 1071168 1352391 1549345 1690159 1888107
10087A888107J98146K59k53316k54718k14641j72454k50325k88114j97855j25317
$$ 1888107 2086253 2086512 1833196 1578478 1363837 1191383 941058 652944 455089 329772
10077C29772p4061p5553n2651j5484J026R289n852j4822k0447L160O823r550l6959
$$ 329772 255711 180158 127507 112023 113049 122338 116486 101664 81217 84377 91200 81650 44691
10064D4691j5494j4066j6350j1122j0694K0715K2076J6947j3116L1181J079k8468
$$ 44691 29197 15131 -1219 -12341 -23035 -2320 19756 36703 23587 54768 55847 27379
10052B7379j4850J4851L6713K920m6320q365K0324J9055L9304M956j6068L470
$$ 27379 12529 27380 64093 67013 20693 12328 32652 51707 91011 95967 79899 83369
10040H3369k8017n808m885o0418j615K1777k5490k6705K5447L5307N385J6851
$$ 83369 55352 49544 44659 -15759 -17374 4403 -21087 -47792 -22345 12962 18347 35198
10028C5198j1693m5724j4323K0216J2324N416K4128J5452k6196k1915k8344k8289
$$ 35198 23505 -22219 -36542 -16326 -4002 1414 25542 40994 14798 -7117 -35461 -63750
10016f3750K8007J3870K6406N661L1058M2113k4492l7693L802J7067n844R620
$$ -63750 -35743 -21873 4533 10194 41252 83365 58873 21180 24982 42049 36205 45825
10004D5825R458o240k0468m916K2291R7Q455Q547k3685k471j3708O404j0795p722
$$ 45825 55283 49043 28575 23659 45950 46047 54502 63049 39364 36893 23185 29589 18794 11072
9990A1072k3777J318L198j295p585O846J8562K671j2411l470J306j1403P717J3887
$$ 11072 -12705 -11387 -8189 -9484 -17069 -10223 8339 11010 -1401 -4871 -3565 -14968 -7251 6636
9976F636k2769j4819p005K3927J800m827n460j3438p881J442j0235R654K1343
$$ 6636 -16133 -30952 -37957 -14030 -12230 -17057 -22517 -35955 -43836 -42394 -52629 -42975 -21632
9963b1632k862r034J0486r631o178M506Q594j4065O60J7502q252p043K7030j2170
$$ -21632 -24494 -33528 -23042 -32673 -38851 -34345 -25751 -39816 -39156 -21654 -29906 -36949 -9919 -22089
9949b2089j635q669J0647J4368K1539m205n69P503k7626J4032J9273N246r430
$$ -22089 -23724 -32393 -21746 -7378 14161 9956 9387 16890 -10736 3296 22569 27815 18385
9936A8385M735K972j1249k8276N7J2347O77J9235J189q772J7859K3696K0091J047
$$ 18385 23120 26092 14843 -13433 -13376 -1029 -352 18883 20072 11300 29159 52855 72946 73993
9922G3993j7979l1721j1886K9873J996J3037j4579j0184k0981m4677m0931J919
$$ 73993 56014 24293 12407 42280 44276 57313 42734 32550 11569 -33108 -74039 -72120
9910g2120L3090J6354L5665Q151k796j4123j111l872j1090j1487p261J1344J5868
$$ -72120 -39030 -22676 12989 21140 18344 4221 3110 -762 -11852 -23339 -30600 -19256 -3388
9897c388m462L746J2k1877n973J1919M4524J0821K5252J1415q056l5975k000J9267
$$ -3388 -7850 -4104 -4092 -25969 -31942 -20023 24501 35322 60574 71989 63933 27958 25958 45225
9883D5225j6454k3663O394N499N708L581k1301O331N509q58j1707n386o533j4877
$$ 45225 28771 5108 11502 17001 22709 26290 4989 11320 16829 15971 4264 -1122 -7655 -22532
9869b2532n059K5237J0402j4137l1578K7l308j379M19O172J9905K6819M816n970
$$ -22532 -27591 -2354 8048 -6089 -37667 -37640 -40948 -42327 -41908 -35736 -15831 10988 15804 9834
9855I834K2484j3367j5225j861J3017L7432J3574N170l064j4391q210k311l1014
$$ 9834 32318 18951 3726 1865 14882 52314 65888 71058 67994 53603 45393 43082 12068
9842A2068k0257P668N129r71J6888m6040l2454J0005L607M7347L8430k7478l014
$$ 12068 -8189 -521 4608 3637 20525 -25515 -57969 -47964 -44357 2990 41420 13942 10928
9829A0928L186l387J7653m194P729J4579j3648l570k6801q442J233Q465J2615
$$ 10928 14114 10727 28380 24186 31915 46494 32846 29276 2475 -5967 -4734 3731 16346
9816A6346r521j2495L1761J9252j5602k2604k9445J433J6130Q619J9413j165j9805
$$ 16346 6825 -5670 26091 45343 29741 7137 -22308 -20875 -4745 3874 23287 22122 2317
9803B317j7722J57K9451K0163K2064J2699k9117K83Q75j9032O251K472M854m387
$$ 2317 -15405 -15248 14203 34366 56430 69129 40012 40295 41170 22138 28389 30861 35715 31328
9789C1328J8979j6832m366l3028J4808k528k3310J1046O435q381J2625J2127P189
$$ 31328 50307 33475 29109 -3919 10889 8361 -14949 -3903 2532 -5849 6776 18903 26092
9776B6092j8361l9397J1512O910j6671L3177J4140n342K4981n125l0240p921l725
$$ 26092 7731 -31666 -20154 -13244 -29915 3262 17402 12060 37041 31916 1676 -6245 -9970
9763i970J2531j1146j4278J7913K5523J3054n834j9203o581L8868o8j3459J8180
$$ -9970 2561 -8585 -22863 -4950 20573 33627 27793 8590 2009 40877 40809 27350 45530
9750D5530j456m699N229K1426L048n929K4773N952j3114P147j9926j0904j9790
$$ 45530 44074 39375 44604 66030 69078 63149 87922 93874 80760 87907 67981 57077 37287
9737C7287P845J6955q265j4006K4896M0207q751n8319l0264o619j1970L6531M845
$$ 37287 45132 62087 53822 39816 64712 104919 96168 37849 7585 966 -11004 25527 30372
9724C0372o075R285k5225R534J3222k0703o788J0783j8558J0993J3566J1257N084
$$ 30372 24297 33582 8357 17891 31113 10410 3622 14405 -4153 6840 20406 31663 36747
9711C6747R260O223j8687J4056Q212m9459j8547K2083K2854J9336k2946k8556
$$ 36747 46007 52230 33543 47599 55811 6352 -12195 9888 32742 52078 29132 576
9699E76o115R063L6839K8880l101k8287j8137Q18j2157K984J4919j1315p91n274
$$ 576 -5539 3524 40363 69243 66142 37855 19718 20536 8379 11363 26282 14967 14176 8902
9685H902K6119L8347j8984j7823q361Q477R547J9833n854j8164j4608q836Q040
$$ 8902 35021 73368 54384 36561 28200 36677 46224 66057 60203 42039 27431 18595 26635
9672B6635K3227N457J6138k5350r150o442o504K8680J0054m016R227k1096J0078
$$ 26635 49862 55319 71457 46107 36957 30515 24011 52691 62745 58729 67956 46860 56938
9659E6938k7954K6581Q878j9428k7811k6344M0138p577m1036k979J82M013J2135
$$ 56938 28984 55565 64443 45015 17204 -9140 30998 23421 -17615 -20594 -20412 -16399 -4264
9646d264p370j893K4644J6779L812j346j2254J0134j1728o837L457L8823K2124
$$ -4264 -11634 -13527 11117 27896 31708 30362 18108 28242 16514 9677 13134 51957 74081
9633G4081K9925m061p195j4973m1536K105J0537m581P709J6563o726l6500k4934
$$ 74081 104006 99945 92750 77777 36241 38346 48883 44302 52011 68574 61848 25348 414
9620D14J0915j2142J204M5404J3947o457J9341R605j1043j6990k2376J948m649
$$ 414 11329 -813 391 45795 59742 53285 72626 82231 71188 54198 31822 33770 29121
9607B9121R774k590N581J8698M768J0612L070j2526J0414Q298j4547P474J0622
$$ 29121 38895 36305 41886 60584 65352 75964 79034 66508 76922 85220 70673 78147 88769
9594H8769k0451j4069q602J0742m166j7083n33K4718q860K6558n785M196j1593
$$ 88769 68318 54249 45647 56389 52223 35140 34607 59325 50465 77023 71238 75434 63841
9581F3841k3178m403J0385L9170l8330r857J7748j2949k9209p827K6376J2231
$$ 63841 40663 36260 46645 85815 47485 37628 55376 42427 13218 5391 31767 43998
9569D3998j6214o331K4091K0756K7630k6792q129M246q904k243J7053L9504o484
$$ 43998 27784 21453 45544 66300 93930 67138 59009 63255 54351 52108 69161 108665 102181
9556A02181m3834r124L1870O680k5859J9746J5802K2232j113l1736P258k554j426
$$ 102181 58347 49223 81093 87773 61914 81660 97462 119694 118581 86845 94103 91549 90123
9543I0123Q969k279j2502M688j6511k2438k4328L2103K9880r648K0447K227j3345
$$ 90123 99092 96813 84311 88999 72488 50050 25722 57825 87705 78057 98504 100731 87386
9530H7386j6857K4243J0624l938L4233j1230k9394Q187R805j5388J6677M1872
$$ 87386 70529 94772 105396 101458 135691 124461 95067 103254 113059 97671 114348 156220
9518A56220j0995k1519R358M80n3316N330J1353J2855P848r41o375r629J0229
$$ 156220 145225 123706 133064 133544 80228 85558 96911 109766 117614 116673 110298 100669 110898
9505A10898j7860k7396L5934L1575J7636l208M702k125n918K7574M0080N905L443
$$ 110898 93038 65642 101576 133151 150787 147579 152281 150156 144238 171812 211892 217797 221240
9492B21240l6879j707O341j534j3674r958r425L9121J1777J070L036J005j0838
$$ 221240 184361 182654 188995 187461 173787 163829 154404 193525 205302 206372 209408 210413 199575
9479A99575l0021l0165j7851J6107k135L184N399n032Q049o184N622J5799j379
$$ 199575 169554 139389 121538 137645 135510 138694 144093 139061 147110 140926 146548 162347 160968
9466A60968J251Q994l605K520J7185J8813q744K0667R700L938k30K0299o848J3183
$$ 160968 162219 171213 167608 170128 187313 206126 197382 218049 227749 231687 231457 251756 244908 258091
9452B58091j1108L679J1298q507j3318L773m556Q882j2134J438q320l452j7700
$$ 258091 246983 250662 261960 253453 240135 243908 239352 248234 236100 237538 229218 225766 208066
9439B08066J8157M2797K0018j1044m23n451K3045J813N866J3499L2778R398j0954
$$ 208066 226223 269020 289038 277994 277571 272120 295165 296978 302844 316343 349121 358519 347565
9426C47565K635r193j484l428l3110q959K1424J4210N589K5059L6955m89Q35k646
$$ 347565 350200 341007 339523 336095 302985 294026 315450 329660 335249 360308 397263 396774 397609 394963
9412C94963k6431K7152K5857J9880n829j2612J1469K9204O189R460L1101k1818
$$ 394963 368532 395684 421541 441421 435592 422980 434449 463653 469842 479302 510403 488585
9400D88585k9030N970M3560M1577J1631m257O789O962m380J3861J50J3522J8262
$$ 488585 459555 465525 509085 550662 562293 558036 564825 571787 567407 581268 581418 594940 613202
9387F13202J5754J0792J406j6691K0069J3821J4757N382r978M850l745j2060k2226
$$ 613202 628956 639748 641154 624463 644532 658353 673110 678492 668514 673364 669619 657559 635333
9374F35333K631L1626M0361L0178K56J0564J3328k739J5552j2381j6204J5696
$$ 635333 637964 669590 709951 740129 740385 750949 764277 761538 777090 764709 748505 764201
9362G64201L5653K647J7178J7200M5720K8280J1274J6879L0456K3354j7650k8002
$$ 764201 799854 802501 819679 836879 882599 910879 922153 939032 969488 992842 975192 947190
9350I47190L0755N510m2727j3006R268L7175J7950K7268K2164l5400j4176Q932
$$ 947190 977945 983455 940728 927722 936990 974165 992115 1019383 1041547 1006147 991971 1000903
9338A000903P794L0203N551j4495j4592j976K9265J6827l2309n663O667k2988
$$ 1000903 1008697 1038900 1044451 1029956 1015364 1013388 1042653 1059480 1027171 1021508 1028175 1005187
9326A005187J1266J1030K1044l7864J1857J1537L0926L4479j1917j1830n698l146
$$ 1005187 1016453 1027483 1048527 1010663 1022520 1034057 1064983 1099462 1087545 1075715 1070017 1066871
9314A066871k043l8716J8484j3661l1826j5781o072j3164k4708l2293J960J815
$$ 1066871 1064828 1026112 1044596 1030935 999109 983328 977256 964092 939384 907091 909051 910866
9302I10866O058j699k0881q029k685k0820j6186Q449R567M103j122k2242l8609
$$ 910866 916924 915225 894344 886315 883630 862810 846624 855073 864640 868743 867621 845379 806770
9289H06770k3665j3204j6411k0060j3387n958k3647O112j8364j3249k2643k0434
$$ 806770 783105 769901 753490 733430 720043 714085 690438 696550 678186 664937 642294 621860
9277F21860L0146L0201K7610j3106l3111l1669j7359k4954j3482L76J6464K691
$$ 621860 652006 682207 709817 696711 663600 631931 614572 589618 576136 576512 592976 595667
9265E95667r357k2432p617l100r436q14J4083k914k3873k3457k5475j293j9825
$$ 595667 586310 563878 556261 553161 543725 542911 556994 554080 530207 506750 481275 479982 460157
9252D60157j3282K8061J224k4452l5316R861J7864k7213n1367Q53M230O884K5089
$$ 460157 446875 474936 476160 451708 416392 426253 444117 416904 365537 366390 370620 377504 402593
9239D02593Q46j4556l9785k264J0795l1Q227K167j5517J3938Q172J0042k5177
$$ 402593 403439 388883 349098 346834 357629 357598 365825 367992 352475 366413 374585 384627 359450
9226C59450k4225j6301n764j0098m767k6064o44r8j4753J9607J2241k1503O293
$$ 359450 335225 318924 313160 303062 298295 272231 271587 271489 256736 276343 288584 267081 273374
9213B73374l719o987J4986k735k0568j0015m240O557n166K140n938l4438K9350
$$ 273374 269655 262668 277654 274919 254351 244336 240096 246653 241487 243627 237689 203251 232601
9200B32601k644j3991l525j2329j5587j3103K041K042R263J748p841j1355k4475
$$ 232601 229957 215966 212441 200112 184525 171422 173463 175505 184768 186516 178675 167320 142845
9187A42845Q219J9095m068r071J6818N502J3592J1650l0660l6539o833j6175J3706
$$ 142845 151064 170159 166091 157020 173838 179340 192932 204582 173922 137383 130550 114375 128081
9174A28081K0566K5442L190K0615j5750k086j1472j7522J101J6088J6755K925
$$ 128081 148647 174089 177279 197894 182144 180058 168586 151064 152165 168253 185008 187933
9162A87933j1380j774j2022j6894j842J1082n92k6755p748L4073J7114J9847k9406
$$ 187933 176553 174779 162757 145863 144021 155103 154511 127756 120008 154081 171195 191042 161636
9149A61636j5366k348N99M041k0346J0099K3671k957L697k4763L767k3266M53
$$ 161636 146270 143922 144521 148562 128216 138315 161986 159029 162726 137963 141730 118464 118917
9136A18917O743N49j7008K4834m741m659K396J8947j7018j2285j543O008J587
$$ 118917 125660 126209 109201 134035 129294 124635 127031 145978 128960 116675 115132 121140 122727
9123A22727M433N975k2095l1722k664K868j3169N739J3490j3423p146n373J5154
$$ 122727 127160 133135 111040 79318 76654 79522 66353 72092 85582 72159 65013 59640 74794
9110G4794J6680J5063j2028K1224k1822j8189J2598P843l776K4340L74p315n62
$$ 74794 91474 106537 94509 115733 93911 75722 88320 96163 92387 116727 117101 109786 109224
9097A09224j4778p097k631o79J2563L226Q47k2003l4397j4564J3461J2265O784
$$ 109224 94446 87349 84718 84039 96602 99828 100675 78672 44275 29711 43172 55437 62221
9084F2221L9759J9792J4191L459q444k1506j6275q197L68J6805j2148k9626j8928
$$ 62221 101980 121772 135963 139422 130978 109472 93197 85000 85368 102173 90025 60399 41471
9071D1471J1870K9766j9366L616K0429J7573l6275j2620J5759P598k4380j2984
$$ 41471 53341 83107 63741 67357 87786 105359 69084 56464 72223 79821 55441 42457
9059D2457K1378p685k408N858M6908J12k8548L081p047k498n661l246L004l3236
$$ 42457 63835 56150 53742 59600 106508 106620 78072 81153 74106 71608 65947 62701 65705 32469
9045C2469j6694j7260K967L4258Q620J6155J5749K0008k193j7277j7883k396j5672
$$ 32469 15775 -1485 1482 35740 44360 60515 76264 96272 94079 76802 58919 56523 40851
9032D0851N429l0897j4832M6640K0642K0726K4778r334K239l158n121j8447l5650
$$ 40851 46280 15383 551 47191 67833 88559 113337 104003 106242 103084 97963 79516 43866
9019D3866k0899K3677J4569J5136M520O896j9136k4294J77L3427l8496m0876j6691
$$ 43866 22967 46644 61213 76349 80869 87765 68629 44335 44512 77939 39443 -1433 -18124
9006a8124k4260M730L6716N3553J9719J6435q403k4566M981J1626j6716l1342
$$ -18124 -42384 -37654 -938 52615 72334 88769 80366 55800 60781 72407 55691 24349
8994B4349K7174P786J1941J1385n09k42l5743j7527j6964K1750k657o891P719
$$ 24349 51523 59309 71250 82635 82126 81884 46141 28614 11650 33400 30743 23852 31571
8981C1571M0005j1024J055O413l3574j3889J2124J384j6510j0607K0916K7182
$$ 31571 71576 60552 61607 68020 34446 20557 32681 34065 17555 6948 27864 55046
8969E5046O801l9371J0043J2969p195R402j3863p102M5799k7381k0965r750l9468
$$ 55046 61847 22476 32519 45488 38293 47695 33832 26730 72529 45148 24183 14433 -25035
8956b5035j8828J7637M1069J5829j8643j9723J4936Q735R06P784L100Q613q303
$$ -25035 -43863 -26226 14843 30672 12029 -7694 7242 15977 16883 24667 27767 36380 28077
8943B8077m0327j2792n600O985l685K2456K6901K0706j3882k7085K3077K3918
$$ 28077 -12250 -25042 -30642 -23657 -27342 -4886 22015 42721 28839 1754 24831 48749
8931D8749M54n560j6996j018j1320k2037o305j2119k175K6160L2183n697l2648
$$ 48749 49203 43643 26647 25629 14309 -7728 -14033 -26152 -28327 -2167 30016 24319 -8329
8918h329J2624P870o74m923j6695l573J098M725R378L0310l2034k6731o213L2112
$$ -8329 4295 12165 11491 6568 -10127 -13700 -12602 -7877 1501 31811 -223 -26954 -33167 -1055
8904a055R621j1272K9008p106m4187K6016K0925o035j664O139q896j9404l283
$$ -1055 8566 -2706 26302 19196 -24991 1025 21950 15915 14251 20390 11494 -7910 -11193
8891a1193L0460R127j139p230j655j2667J2373n767K1034l448J425L0207P461
$$ -11193 19267 28394 27255 20025 18370 5703 18076 12309 33343 29895 31320 61527 68988
8878F8988j9823l4455j8048j3006K763J0151o722j5845q406q758j510K9120J5411
$$ 68988 49165 14710 -3338 -16344 -13581 -3430 -10152 -25997 -34403 -43161 -44671 -15551 -140
8865a40r349J4820K4208L8813K2822J7555J9049N6145k667M05l5052l5261m4444
$$ -140 -9489 5331 29539 68352 91174 108729 127778 183923 181256 181661 146609 111348 66904
8852F6904k4316l4855j8708j2292J834K0381K583Q04N414K7764P621j5615l8542
$$ 66904 42588 7733 -10975 -23267 -21433 -1052 1531 2335 7749 35513 43134 27519 -11023
8839a1023k6187J6750l082R949L3174Q457m976k4397j2806j1179m211l81N093
$$ -11023 -37210 -20460 -23542 -13593 19581 28038 23062 -1335 -14141 -25320 -29531 -29912 -24819
8826b4819J5262L5889K218O896m528k6767L0814J5812j0656k8065m823l2605n343
$$ -24819 -9557 26332 28550 35446 30918 4151 34965 50777 40121 12056 7233 -25372 -30715
8813c0715K608j208O832L4475K6306k8095k9357k4298L509M2899J5070J1191M548
$$ -30715 -28107 -29315 -22483 11992 38298 10203 -19154 -43452 -39943 2956 18026 29217 33765
8800C3765J5436J0912j4798j3464l650j1797o545j3456o771J3713J1493J8291
$$ 33765 49201 60113 45315 31851 28201 16404 9859 -3597 -10368 3345 14838 33129
8788C3129J8151l3081n1679j0765J3041K5637K6210P817j7575J6325J6851o0117
$$ 33129 51280 18199 -33480 -44245 -31204 -5567 20643 28460 10885 27210 44061 -16056
8776a6056m7120K5528J9244O965j230k2782J6239J4399J4662O165k767n693o435
$$ -16056 -63176 -37648 -18404 -11439 -12669 -35451 -19212 -4813 9849 16014 13247 7554 1119
8763A119L5328k6039J518N641M223J7643N155n19j3427j8999j8752r263j3667
$$ 1119 36447 10408 11926 17567 21790 39433 44588 44069 30642 11643 -7109 -16372 -30039
8750c0039Q922K4419N2487Q941j2751j544k8863j4328J5460K1118p568k3550J1657
$$ -30039 -21117 3302 55789 64730 51979 50435 21572 7244 22704 43822 36254 12704 24361
8737B4361k0475j5776R429L108K4809K3000J8365L640j5876k2382l4195K7465
$$ 24361 3886 -11890 -2461 647 25456 48456 66821 70461 54585 32203 -1992 25473
8725B5473L3282J2270o722j9206J9416J1787l5734j4479J695l9292k9607K1640
$$ 25473 58755 71025 64303 45097 64513 76300 40566 26087 27782 -11510 -41117 -19477
8713a9477L7518k0472j1151K8262J6651k271j039m784O755R557K233q006k1354
$$ -19477 18041 -2431 -13582 14680 31331 29060 28021 23237 29992 39549 41782 33776 12422
8700A2422L542K6506J0021J7148K3624J2033K771k0974J172K864l0419k2789m504
$$ 12422 15964 42470 52491 69639 93263 105296 108067 87093 88265 91129 60710 37921 33417
8687C3417J9739l837j1918l793K8871K4480k267J2011j0700l761L433p964N327
$$ 33417 53156 49319 37401 33608 62479 86959 84692 96703 86003 82242 85675 77711 83038
8674H3038k121J3696L453L653j0882J8123p173l0746j3387J3033K0276K1252j2462
$$ 83038 80917 94613 98066 101719 90837 108960 101787 71041 57654 70687 90963 112215 99753
8661I9753l576K011r400r308K1523O990J5891L281j2217l2297k2960R124K4487
$$ 99753 96177 98188 88788 79480 101003 107993 123884 127165 114948 82651 59691 68815 93302
8648I3302J2769P387K3203k7671m510N0284J6291l3760J712K0429N81J07m983
$$ 93302 106071 113458 136661 108990 104480 154764 171055 137295 139007 159436 160017 160124 155141
8635A55141K0147J0961j3983N139M454M113j8700k5625J0098M3464L8419q840
$$ 155141 175288 186249 172266 177405 181859 185972 167272 141647 151745 195209 233628 224788
8623B24788l5194L164N8698M6829M347N42j1372P640J3948L6385R392N3182n090
$$ 224788 189594 192758 251456 298285 302632 303174 291802 299442 313390 349775 359167 412349 407259
8610D07259k0264K4897R868j8517J5122n933k6828p266K6951R3l2039m1131m1991
$$ 407259 386995 411892 421760 403243 418365 412432 385604 378338 405289 405382 373343 332212 290221
8597B90221K157K4864M729k2906j4983N889K0561L8714j984p642Q889j1704l0884
$$ 290221 292378 317242 321971 299065 284082 289971 310532 349246 347262 339620 348509 336805 305921
8584C05921k5873m2895j1307q515K029j8672l8006l4131p343j2397r764O931K1321
$$ 305921 280048 237153 225846 217331 219360 200688 162682 128551 121208 108811 99047 105978 127299
8571A27299N184k753j5441Q568k6353k0105m9684J4441L9250j4527j5491m899
$$ 127299 132483 129730 114289 122857 96504 76399 26715 41156 80406 65879 50388 45489
8559D5489M647K5536L2666l685j3190Q738m1282l9854K395J0355M6871K3356j974
$$ 45489 50136 75672 108338 104653 91463 100201 58919 19065 21460 31815 78686 102042 100068
8546A00068j1791j1493l3292k5706q900q702K7966K7245j2873Q611M84J0847M882
$$ 100068 88277 76784 43492 17786 8886 184 28150 55395 42522 51133 51617 62464 67346
8533F7346o284j1461r339n534J4117l367r639J7836N340n7568m868J7903j7761
$$ 67346 61062 49601 40262 34728 48845 45478 35839 53675 59015 1447 -3421 14482 -3279
8520c279K3074J7393k4066j8716L7276O78L012K6005J3r118O179j9658p448q957
$$ -3279 19795 37188 13122 -5594 31682 32360 35372 61377 61390 52272 58451 38793 31345 22388
8506B2388J0380r084j525L717L3271j9467q127p999j2377o805k3616M837J7404
$$ 22388 32768 23684 22159 25876 59147 39680 31553 23554 11177 4372 -19244 -14407 2997
8493B997j6367k1916K6997J0978j2126k0453L1833N7261L6698l1629l9765L409
$$ 2997 -13370 -35286 -8289 2689 -9437 -29890 1943 59204 95902 64273 24508 27917
8481B7917L440j1956k4094J0288J4899O434j5335k3888l982J2479J405n312j31
$$ 27917 31357 19401 -4693 5595 20494 26928 11593 -12295 -16277 -3798 -2393 -7705 -7836
8468g836j0848O327K6117N551k8613j0229l4464O918Q095K9531J4052J2758R567
$$ -7836 -18684 -12357 13760 19311 -9302 -19531 -53995 -47077 -38982 -9451 4601 17359 26926
8455B6926j2104m0291j5602Q031J3819L2889j8655r94J5869K8235K2256L951j6120
$$ 26926 14822 -25469 -41071 -33040 -19221 13668 -4987 -5981 9888 38123 60379 64330 48210
8442D8210p446J3190l0343j6722N096J8146J0520l2794l3661J2874j937M359l9
$$ 48210 40764 53954 23611 6889 11985 30131 40651 7857 -25804 -12930 -14867 -10508 -10547
8429a0547K1582j378J2064P983k7976m147J2214J1577j4816j8040k0526P271J3200
$$ -10547 11035 9657 21721 29704 1728 -2419 9795 21372 6556 -11484 -32010 -24739 -11539
8416a1539K2824j8380k5179O649N1579K4634j1904j4464k6582l7577J515J3489
$$ -11539 11285 -7095 -32274 -25625 25954 50588 38684 24220 -2362 -39939 -38424 -24935
8404b4935J8247J4207j1453J8128n17p783l6949j4801M4950J3423n437P461N695
$$ -24935 -6688 7519 -3934 14194 13677 5894 -31055 -45856 -906 12517 7080 14541 20236
8391B0236j3515j9255P324Q743j0642K51J3121j0742r215o727O749J9985N405
$$ 20236 6721 -12534 -5210 3533 -7109 -6858 6263 -4479 -13694 -20421 -13672 6313 11718
8378A1718j5051J0648K3522N529J5608n295j9177m5644j1284K7765j8886J0256
$$ 11718 -3333 7315 30837 36366 51974 46679 27502 -18142 -29426 -1661 -20547 -10291
8366a0291q462j615J9132Q526k0341o254K6656l0697L788Q490r724K4461k837
$$ -10291 -18753 -20368 -1236 7290 -13051 -19305 7351 -23346 -19558 -11068 -20792 3669 832
8353H32q169j7503l407K0033J0573j2665r47j2875Q692J8580j4916J6369J3100
$$ 832 -7337 -24840 -28247 -8214 2359 -10306 -11253 -24128 -15436 3144 -11772 4597 17697
8340A7697R613l2374l0985j4240K9356J0989r219J013R647O330L3589j7504J4826
$$ 17697 27310 -5064 -36049 -50289 -20933 -9944 -19163 -18150 -8503 -2173 31416 13912 28738
8327B8738J2154r683j4933q36L6223L3788j8654j4098l2732P678K5439k0515k548
$$ 28738 40892 31209 16276 15440 51663 85451 66797 52699 19967 27645 53084 32569 30021
8314C0021j5279L16J2527L690l671q099k4461l6207j989L0553K6017K4995J1522
$$ 30021 14742 15058 27585 31275 27604 19505 -4956 -41163 -43152 -12599 13418 38413 49935
8301D9935j8382J659k1664l3564L0020M1622J106j1295j6038k059K020O566o840
$$ 49935 31553 33212 11548 -22016 8004 49626 50732 39437 23399 21340 23360 29926 23086
8288B3086o831J8807K672l00j3226o871N395J4685J0815j7033q201M059j848Q87
$$ 23086 16255 35062 37734 37434 24208 17337 22732 37417 48232 31199 22998 27057 25209 26096
8274B6096j1446N244j3225l8340j6961L3682Q591J155j9502J0244K1929P561j3794
$$ 26096 14650 19894 6669 -31671 -48632 -14950 -6359 -5204 -24706 -14462 7467 15028 1234
8261A234k507K1298K799j5322K4340j519n492J1497Q25k4970n33K536L37J800
$$ 1234 -1273 20025 22824 7502 31842 30323 24831 36328 37153 12183 11650 14186 14523 16323
8247A6323j1777K8127p249k0811O000j2456j0498m92J9824J3929j4080J966L0736
$$ 16323 4546 32673 25424 4613 10613 -1843 -12341 -12833 6991 20920 6840 8806 39542
8234C9542j7734k0798P89J6717m380j0093J6257l4077o675L7406M1095J3621j8387
$$ 39542 21808 1010 1799 18516 14136 4043 20300 -13777 -20452 16954 58049 71670 53283
8221E3283K308k2268l3788N481K0142k2589j3082j896p231l443N214J2425K2467
$$ 53283 55591 33323 -465 5016 25158 2569 -10513 -12409 -19640 -23083 -17869 -5444 17023
8208A7023K2889j2514k5226j9064j7234J2131M1367J3873k5020k4782l25J6509
$$ 17023 39912 27398 2172 -16892 -34126 -21995 19372 33245 8225 -16557 -16882 -373
8196c73j6150j7938Q198L0145Q474o635j7441l7626j0835J1492p441J9805K8674
$$ -373 -16523 -34461 -26263 3882 12356 5721 -11720 -49346 -60181 -48689 -56130 -36325 -7651
8183g651J1907M056J8932q013l4453j7750L4964j8357m797R785P685j6319L245
$$ -7651 4256 8312 27244 19231 -15222 -32972 1992 -16365 -21162 -11377 -3692 -20011 -16766
8170a6766o728R272Q544j0608K7717J7800j3363j7857j2625k4452j3271K7378
$$ -16766 -23494 -14222 -5678 -16286 11431 29231 15868 -1989 -14614 -39066 -52337 -24959
8158b4959N8786K4046l9121L168L2236O775K435J0457O6032M2545r666p0576k1662
$$ -24959 33827 57873 18752 21920 54156 60931 63366 73823 139855 182400 172734 102158 80496
8145H0496l5219n901l115j3616k3266j5667q240r227J9879n554j4784Q383L66
$$ 80496 45277 39376 36261 22645 -621 -16288 -24528 -33755 -13876 -19430 -34214 -25831 -25465
8132b5465O773R23J0160j0846j7789m229N107J4008J7698N392q362L466J5288
$$ -25465 -18692 -17769 -7609 -18455 -36244 -40473 -35366 -21358 -3660 1732 -6630 -3164 12124
8119A2124N907j0331K1990Q100j050m1533j3315J7193N2159M6660Q2873L121k0304
$$ 12124 18031 7700 29690 37790 36740 -4793 -18108 -915 51244 97904 180777 183898 163594
8106A63594n2202n0136j5253l618O372q261k0701j2695J9207j9684k1911m964
$$ 163594 111392 61256 46003 42385 48757 40496 19795 7100 26307 6623 -15288 -20252
8094b0252L3830K012K61k4454J1699J8440k1686l1400J548J5263j702j22j4659
$$ -20252 13578 15590 15851 -8603 3096 21536 -150 -31550 -30002 -14739 -16441 -16563 -31222
8081c1222R182M257j9465J1708n156k4809p067J9360M2435K6543l7130R405K5034
$$ -31222 -22040 -17783 -37248 -25540 -30696 -55505 -62572 -43212 -777 25766 -11364 -1959 23075
8068B3075P424q538J8279J7856o83l8264k2891K720J4188q756P909j2631k1218
$$ 23075 30499 21961 40240 58096 57413 19149 -3742 -1022 13166 4410 12319 -312 -21530
8055b1530j3987J4397L4069L722J2654J4748J4402K1830J7143q789P802K4368
$$ -21530 -35517 -21120 12949 16671 29325 44073 58475 80305 97448 88659 96461 120829
8043A20829J1277l138j4085N196o676K1770R945N392m676J0765K5566j3092m0551
$$ 120829 132106 128968 114883 120079 113403 135173 145118 150510 145834 156599 182165 169073 128522
8030A28522j185J2824K6275K1532k6517l9873R891j345J8027j0019k0114m321
$$ 128522 127337 140161 166436 187968 161451 121578 131469 130124 148151 138132 118018 113697
8018A13697l1111J5381L2957K87j0700j4993K3153k1125k9449Q982J4051K9433
$$ 113697 82586 97967 130924 131211 120511 105518 128671 107546 78097 87079 101130 130563
8006A30563K6053M7258J9784L2832J7713M9627J17941J32342N9162m886j08321
$$ 130563 156616 203874 223658 256490 274203 323830 441771 574113 633275 628389 520068
7995E20068r3273o0877k8708l7913m7661k2034K4085K0326N3965Q2574N1499j8527
$$ 520068 426795 365918 337210 299297 251636 229602 253687 274013 327978 410552 462051 443524
7983D43524q3473q7832p8923n0930j6151r981R883J2710K4222j3639j9797k4091
$$ 443524 360051 272219 193296 142366 126215 116234 126117 138827 163049 149410 129613 105522
7971A05522l0751j887K2479K9478M850L449L504L8670J7214J9396J1332j0665
$$ 105522 74771 72884 95363 124841 129691 133140 136644 175314 192528 211924 223256 212591
7959B12591k236K3744M0239O6170M2324M9172J0049m4480m7713m8153k0304j820
$$ 212591 210355 234099 274338 340508 382832 432004 442053 397573 349860 301707 281403 279583
7947B79583Q35J9802O2980J0429n6256r7449j3637k5392o3520l1824j4325p840
$$ 279583 280418 300220 363200 373629 317373 219924 206287 180895 117375 85551 71226 63386
7935F3386K385k76l8590k818P084N384m234L5025K7743J7473l5188j8976j5981
$$ 63386 65771 65495 26905 24087 31171 36555 32321 67346 95089 112562 77374 58398 42417
7922D2417J7553K1056J2136n710j2728l951J9462L4439J4558J8862p758p638r230
$$ 42417 59970 81026 93162 87452 74724 70773 90235 124674 139232 158094 150336 142698 133468
7909A33468j7698Q645J4739k2503j6842k7788j9796K13j2191M377O725K8964j1238
$$ 133468 115770 124415 139154 116651 99809 72021 52225 52438 40247 44624 51349 80313 69075
7896F9075j2802J3930J5714j2697j1662n915O342k7029o459J055j6624j6657k4075
$$ 69075 56273 70203 85917 73220 61558 55643 61985 34956 28497 29552 12928 -3729 -27804
7883b7804j0078J8006L5565n204k4397o690q268N508J4282J1442J2804J6844j6936
$$ -27804 -37882 -19876 15689 10485 -13912 -20602 -28870 -23362 -9080 2362 15166 32010 15074
7870A5074j0613M631q646N811j3773k259n640J5409n057j0008K4448J2174j4020
$$ 15074 4461 9092 446 6257 -7516 -9775 -15415 -6 -5063 -15071 9377 21551 7531
7857G531j6115J6710J3553J1954Q49k1040j6218m491L5337M2387o331j1311k9216
$$ 7531 -8584 8126 21679 33633 34482 13442 -2776 -7267 28070 70457 64126 52815 23599
7844B3599k3437j6636J8429k389k5048P656J2308J2719j6059k6001K914J2749
$$ 23599 162 -16474 1955 -434 -25482 -17826 -5518 7201 -8858 -34859 -31945 -19196
7832a9196j057l741J3020M962K2655j4432O573K3668P389R532m5890j3498q548
$$ -19196 -20253 -23994 -10974 -6012 16643 2211 8784 32452 39841 49373 3483 -10015 -18563
7819a8563J1041O905J1608k5108k2623l793r316J9900m18l335K8509K0700J1422
$$ -18563 -7522 -617 10991 -14117 -36740 -40533 -49849 -29949 -30367 -33702 -5193 15507 26929
7806B6929J011k4995j069J837m363Q706r462j3579r265K0382q190j1720Q804L0101
$$ 26929 27940 2945 1876 3713 -650 8056 -1406 -14985 -24250 -3868 -12058 -23778 -14974 15127
7792A5127j8600K771N902J2951J6163R795j8002j4505j4890j3482J7810L963K1202
$$ 15127 -3473 -702 5200 18151 34314 44109 26107 11602 -3288 -16770 1040 5003 26205
7779B6205J5906p114k4900M630k7051j5947M1573L3387L207l4813l620M041j7280
$$ 26205 42111 34997 10097 14727 -12324 -28271 13302 46689 49896 15083 11463 15504 -1776
7766a776M722N124j0788j4780l887J625m85Q60j767j3874k9820M789L355M570
$$ -1776 2946 8070 -2718 -17498 -21385 -19760 -20245 -19385 -21152 -35026 -64846 -60057 -56702 -52132
7752e2132j3218J0447J7698J0563M264l0352N557j8572M032O222J161k734K1814
$$ -52132 -65350 -54903 -37205 -26642 -22378 -52730 -47173 -65745 -61713 -55491 -54330 -57064 -35250
7739c5250O092K501L5171L3627j690l6922j3772k4705Q711P894K6032R363k7146
$$ -35250 -29158 -26657 8514 42141 40451 3529 -10243 -34948 -26237 -18343 7689 17052 -10094
7726a0094r908k2909j992L4785L448k2002q142r786j5923o549K2767L8227M629
$$ -10094 -20002 -42911 -44903 -10118 -6670 -28672 -36814 -46600 -62523 -69072 -46305 -8078 -3449
7713c449k449o241K0125J3674j3535r58j5550J693N640m26n403L66j3155Q762
$$ -3449 -5898 -12139 7986 21660 8125 7167 -8383 -6690 -1050 -1476 -6879 -6513 -19668 -10906
7699a0906K0426M304k311r162R52j9538k4540N698J2727j4125j3441J9118Q959
$$ -10906 9520 13824 11513 2351 3303 -16235 -40775 -35077 -22350 -36475 -49916 -30798 -21839
7686b1839l880J7844J9999j6061l1413n645K624K1164j1699k0392k5460K5924
$$ -21839 -25719 -7875 12124 -3937 -35350 -40995 -38371 -17207 -28906 -49298 -74758 -48834
7674d8834P256m589J9081M341j8431J7689L8621j8390l979k0256j2715J0765k499
$$ -48834 -41578 -46167 -27086 -22745 -41176 -23487 15134 -3256 -7235 -27491 -40206 -29441 -31940
7661c1940R03j7249L4964M4174P574k7765m2454j9279j4910o862K294J8691J5526
$$ -31940 -31037 -48286 -13322 30852 38426 10661 -31793 -51072 -65982 -72844 -70550 -51859 -36333
7648c6333J0690J4728j695j5963J315M663j6764o87J3707K8301k4429l3933o605
$$ -36333 -25643 -10915 -12610 -28573 -27258 -22595 -39359 -40046 -26339 1962 -22467 -56400 -63005
7635f3005J016J3563j705p166J446J1734J0827J3509k3025J9085J4808P470M301
$$ -63005 -61989 -48426 -50131 -57297 -55851 -44117 -33290 -19781 -42806 -23721 -8913 -1443 2858
7622B858j4034n790M100J4303J0151M430k3632l0312j5689K2365M290p951j9977
$$ 2858 -11176 -16966 -12866 1437 11588 16018 -7614 -37926 -53615 -31250 -26960 -34911 -54888
7609e4888K2801K1948J3732j7318j0045j938K7153q31o963k2854r643J2672P688
$$ -54888 -32087 -10139 3593 -13725 -23770 -25708 1445 614 -6349 -29203 -38846 -26174 -18486
7596a8486M668L273j2307m396L7313J3009J5606j7048l2067j845J9571k4238l5565
$$ -18486 -13818 -10545 -22852 -27248 10065 23074 38680 21632 -10435 -12280 7291 -16947 -52512
7583e2512l166Q790L8637j1080O43M969k1157M503j316p22R278J6124q639M838
$$ -52512 -55678 -46888 -8251 -19331 -18688 -13719 -34876 -30373 -31689 -32411 -23133 -7009 -15648 -10810
7569a0810r921k6842M4604K2013m847k6995l484J3269q7J8595L411k0689K1414
$$ -10810 -20731 -47573 -2969 19044 14197 -12798 -16282 -3013 -3100 15495 18906 -1783 19631
7556A9631K5955m7232l0198J9567L398J3395J1344j2537o794q697J8867K1941
$$ 19631 45586 -1646 -31844 -12277 -8879 4516 15860 3323 -3471 -12168 6699 28640
7544B8640k7858K0759L1848j2187k6372j5984j2682J2561K5806k4155J7628K4929
$$ 28640 782 21541 53389 41202 14830 -1154 -13836 -1275 24531 376 18004 42933
7532D2933l9079l1037J3251J9376k5368k9294M0131M0484J1952p423l9787k4334
$$ 42933 3854 -27183 -13932 5444 -19924 -49218 -9087 31397 43349 35926 -3861 -28195
7520b8195M916J1811O933K1165K215m713m1787l960K160O628j4557j0374j5761
$$ -28195 -23279 -11468 -4535 16630 18845 14132 -27655 -31615 -29455 -22827 -37384 -47758 -63519
7507f3519k9259J6563K6310M764K7097K3856O969o496J0987J5908K3312k454m4008
$$ -63519 -92778 -76215 -49905 -45141 -18044 5812 12781 6285 17272 33180 56492 54038 10030
7494A0030j3657K716K2407j1231K964k400j9702k7757r635J5821r542L1932P32
$$ 10030 -3627 -911 21496 10265 13229 10829 -8873 -36630 -46265 -30444 -39986 -8054 -7322
7481g322R616j9065k0147J7604Q672J1660p78k8130j0436j1993J9966K2106K5238
$$ -7322 2294 -16771 -36918 -19314 -10642 1018 240 -27890 -38326 -50319 -30353 -8247 16991
7468A6991J6279j8540j1282p760r822k9493J977n039j5534o103K6041M3585J6996
$$ 16991 33270 14730 3448 -4312 -14134 -43627 -41650 -46689 -62223 -68326 -42285 1300 18296
7455A8296r519k430Q011j555j7674K67k3949l4643j0360J9846J0627R070J8330
$$ 18296 8777 6347 14358 12803 -4871 -4604 -28553 -63196 -73556 -53710 -43083 -34013 -15683
7442a5683M7023j3768l2839N460Q673m416k7089q069N360M481q248J7632M53P55
$$ -15683 31340 17572 -15267 -9807 -1134 -5550 -32639 -40708 -35348 -30867 -39115 -21483 -21030 -20275
7428b0275J6815O495l931j1323j6979N623M252P426j5836k4008k9629K1564K7932
$$ -20275 -3460 3035 -896 -12219 -29198 -23575 -19323 -11897 -27733 -51741 -81370 -59806 -31874
7415c1874J3651J6147K3789p220j2081J2973k8107j8469J4831L2235Q176J9369
$$ -31874 -18223 -2076 21713 14493 2412 15385 -12722 -31191 -16360 15875 24051 43420
7403D3420J4548j3110p119l0156L336Q267j4495j8527J1086J1530j0907j6702
$$ 43420 57968 44858 37739 7583 10919 19186 4691 -13836 -2750 8780 -2127 -18829
7391a8829n697K0792P980j3329Q53k88K0310k87j6063r3j3119j102L9905k5375
$$ -18829 -24526 -3734 4246 -9083 -8230 -8518 11792 11505 -4558 -4651 -17770 -18872 21033 -4342
7377d342n6182j4114J9041K7125j9870j9464Q5J0620O742j308j940j0697j0606
$$ -4342 -60524 -74638 -55597 -28472 -48342 -67806 -67721 -57101 -50359 -51667 -53607 -64304 -74910
7364g4910o086K9615N0170J8072o356J8270R267o492j5533J3319k7044m424j802
$$ -74910 -80996 -51381 -1211 16861 10505 28775 38042 31550 16017 29336 2292 -2132 -3934
7351c934J4170J8117l4931k8937J2857J1416J4174k934k5644k0934l132j0302
$$ -3934 10236 28353 -6578 -35515 -22658 -11242 2932 -2 -25646 -46580 -49712 -60014
7339f0014J1765J6657J7616P817P403j7140J316l0762j7601k114M0789L0377k2529
$$ -60014 -48249 -31592 -13976 -6159 1244 -15896 -14580 -45342 -62943 -65057 -24268 6109 -16420
7326a6420J7391P27j9797k0001K8656j6596k1552J6470K1739k2121k4759j2479
$$ -16420 971 1698 -18099 -38100 -9444 -26040 -47592 -31122 -9383 -31504 -56263 -68742
7314f8742k58j8442J7115K1735J3901K5976O18J417j3510K695J2751j10K2908
$$ -68742 -69000 -87442 -70327 -48592 -34691 -8715 -8097 -6680 -20190 -17495 -4744 -4854 18054
7301A8054o601J1158L0999k5212j6230J9168M772m709m93j1718q560m206N109
$$ 18054 11453 22611 53610 28398 12168 31336 36108 31399 30906 19188 10628 6422 11531
7288A1531r328k6353k2244J5934k7513J6894N5706L951m542O056K305j744j682
$$ 11531 2203 -24150 -46394 -30460 -57973 -41079 14627 18578 14036 20092 22397 20653 18971
7275A8971J4586j7590k931l081j4523k825l4904m0024L7426N0718J3473k9023
$$ 18971 33557 15967 13036 9955 -4568 -7393 -42297 -82321 -44895 5823 19296 -9727
7263i727m80N179K2373N325J248j6141k2398k954M869N057J9067j4241O947J1431
$$ -9727 -10207 -5028 17345 22670 23918 7777 -14621 -17575 -12706 -7649 11418 -2823 4124 15555
7249A5555j1267o578l6417P936K7940k8605k199l54N071M773Q978M24l2285N645
$$ 15555 4288 -2290 -38707 -30771 -2831 -31436 -33635 -33989 -28918 -24145 -15167 -14743 -47028 -41383
7235d1383K0838p715J1430J659K6217Q31J1837O93j6537l6358k5509J066J8435
$$ -41383 -20545 -28260 -16830 -15171 11046 11877 23714 24407 7870 -28488 -53997 -52931 -34496
7222c4496J8863j1590k849P850N102Q311k2876n750K036N111K1572j2238j7147
$$ -34496 -15633 -27223 -30072 -22222 -17120 -8809 -31685 -37435 -35399 -30288 -8716 -20954 -38101
7209c8101P047J6131K5712L9362O601l1193m0720q204J283j1568K4886K498Q80
$$ -38101 -31054 -14923 10789 50151 56752 25559 -15161 -23365 -22082 -33650 -8764 -6266 -5386
7196e386r787j0427M876J6542J7753l320j5398N356k0297m0428L0487L4013J2506
$$ -5386 -15173 -25600 -20724 -4182 13571 10251 -5147 209 -20088 -60516 -30029 3984 16490
7183A6490k2713r798N556K7917M963k3226j4326j535j1492K9407J5370p953Q455
$$ 16490 -6223 -16021 -10465 17452 22415 -811 -15137 -16672 -28164 1243 16613 8660 17115
7170A7115R690j2512j9195R761J7624J0540j7804k2749J159L0771M419n327k209
$$ 17115 26805 14293 -4902 4859 22483 33023 15219 -7530 -6371 24400 28819 23492 21283
7157B1283l5058k5487l033K718J5928K2779j897k3964K51J7889O126k9441N354
$$ 21283 -13775 -39262 -42295 -39577 -23649 -870 -2767 -26731 -26480 -8591 -2465 -31906 -26552
7144b6552M236K8019L7936J7561k6077l4219J1317j1650N790j2513O635j398L005
$$ -26552 -22316 5703 43639 61200 35123 904 12221 571 6361 -6152 483 -915 2090
7131B090K5045m648l9331m216k0432J6223J3130P293l787k7897k0159n887J8694
$$ 2090 27135 22487 -16844 -21060 -41492 -25269 -12139 -4846 -8633 -36530 -56689 -62576 -43882
7118d3882r87k932P498L1907J3756p907l663K534l8918J918j8620M345N879R508
$$ -43882 -44869 -47801 -40303 -8396 5360 -2547 -6210 -3676 -42594 -40676 -59296 -54951 -49072 -39564
7104c9564L5237J2187J972l373k6939j7364j048K905L2271P715K721r734N305
$$ -39564 -4327 7860 9832 6459 -20480 -37844 -38892 -35987 -3716 3999 6720 -3014 2291
7091B291N331j8737J0020r199J578O317L790n70N593P455J2928k0413l7760k695
$$ 2291 7622 -11115 -1095 -10294 -8716 -2399 1391 821 6414 13869 26797 6384 -31376 -34071
7077c4071K4206K1747J5510l1783j0768K2109J1654j7001j3428q755L498Q859
$$ -34071 -9865 11882 27392 -4391 -15159 6950 18604 1603 -11825 -20580 -17082 -8223
7065h223j0634n436K5899N5635o865o5947j153K8109L572J590j9087l6774J5096
$$ -8223 -18857 -24293 1606 57241 50376 -15571 -16724 11385 14957 16547 -2540 -39314 -24218
7052b4218L6153q95l1154J1033K4499J6788o224j677k3402p289M407M75r315O809
$$ -24218 11935 11040 -20114 -9081 15418 32206 25982 24305 903 -6386 -1979 -1504 -10819 -4010
7038d010j173p200K31R9L694J2377J0453J4689K1166J3330r259q754k6524j057
$$ -4010 -5183 -12383 -12152 -12053 -8359 4018 14471 29160 50326 63656 54397 45643 19119 18062
7024A8062J0705J4042k5911m0822j0342L0160Q060j1817j7284J0599L1505J2341
$$ 18062 28767 42809 16898 -23924 -34266 -4106 3954 -7863 -25147 -14548 16957 29298
7012B9298j9786j9172j6168m478j0730J0514o567K1991J5202O007J5708R812J3308
$$ 29298 9512 -9660 -25828 -30306 -41036 -30522 -37089 -15098 104 6111 21819 31631 44939
6999D4939o983j1373J0800j9177l2736K185M722j3979M649K4292J0762j7151j3169
$$ 44939 37956 26583 37383 18206 -14530 -12345 -7623 -21602 -16953 7339 18101 950 -12219
6986a2219M017P406K632p272J2623j385k1904l825K7673R60k6763j0469J7961
$$ -12219 -8202 -796 1836 -5436 7187 5802 -16102 -19927 7746 8706 -18057 -28526 -10565
6973a0565l394k7939K9343K5929K4001j3454l6734L944l0468M380J9788j5793
$$ -10565 -13959 -41898 -12555 13374 37375 23921 -12813 -8869 -39337 -34957 -15169 -30962
6961c0962n651L1528J7006J0386l432r751k4510j4864k623q406n42j6169L3156
$$ -30962 -36613 -5085 11921 22307 18875 9124 -15386 -30250 -32873 -41279 -41821 -57990 -24834
6948b4834L5284j5627l853p151k868J7731J1099J0065o927k1567R731l139n644
$$ -24834 10450 -5177 -9030 -16181 -19049 -1318 9781 19846 12919 -8648 1083 -2056 -7700
6935g700l2994K052M540k1594K2751L1366M861j1868q847j491k2122j0449N201
$$ -7700 -40694 -38642 -34102 -55696 -32945 -1579 3282 -8586 -17433 -18924 -41046 -51495 -46294
6922d6294L504L0095Q544J8507L868k3134q747m997J8406J8648k2030O54o053
$$ -46294 -42790 -12695 -4151 14356 18224 -4910 -13657 -18654 -248 18400 -3630 -2976 -9029
6909i029k8671j1905p615o980O280K6294J158j8084J2266L1503M425p145k3649
$$ -9029 -37700 -49605 -57220 -64200 -57920 -31626 -30468 -48552 -36286 -4783 -358 -7503 -31152
6896c1152k2146m649J0583K1857K9461J7764m136K1334o054j9523k4898j8622
$$ -31152 -53298 -57947 -47364 -25507 3954 21718 17582 38916 32862 13339 -11559 -30181
6884c0181j9036j2776l49M632P656M5508K3522k7897j076j0897N128J4154J7876
$$ -30181 -49217 -61993 -62342 -57710 -50054 -4546 18976 -8921 -9997 -20894 -15766 -1612 16264
6871A6264O592j9727m316p576k6796k9211k3284j7367J2846M4032J8581o22K7129
$$ 16264 22856 3129 -1187 -8763 -35559 -64770 -88054 -105421 -92575 -48543 -29962 -30584 -3455
6858c455Q734L970L584J4187k0379o1184n0659R594K1313P936q212j0311J5334
$$ -3455 5279 9249 12833 27020 6641 -54543 -105202 -95608 -74295 -66359 -74571 -84882 -69548
6845f9548l693J0521N818J4673M0005R074k0262r692k049k1294J2069j932j0190
$$ -69548 -73241 -62720 -56902 -42229 -2224 6850 -13412 -23104 -25153 -46447 -34378 -36310 -46500
6832d6500j0307P634J320P32J2995K063j1935K1284l714k6469K9550J1452K7896
$$ -46500 -56807 -49173 -47853 -47121 -34126 -32063 -43998 -22714 -26428 -52897 -23347 -11895 16001
6819A6001K3737m3211j5684k5695J6509j591l653O98Q951J294J279R601j119j0670
$$ 16001 39738 -3473 -19157 -44852 -28343 -29934 -33587 -32889 -23938 -22644 -21365 -11764 -12883 -23553
6805b3553o19J4895P061J4549l54k231K0527J2431k0044m132j3532j8411j4208
$$ -23553 -24172 -9277 -2216 12333 11979 9748 30275 42706 22662 18530 4998 -13413 -27621
6792b7621Q450J8647N249q514r10J8593Q910m2131j229j9163K2856L4209J5774
$$ -27621 -19171 -524 4725 -3789 -4699 13894 22804 -19327 -20556 -39719 -16863 17346 33120
6779C3120m0664l481J2497O427p704L219K3039P404m4026j0947j8614M269O646
$$ 33120 -7544 -11025 1472 7899 195 3414 26453 33857 -10169 -21116 -39730 -35461 -28815
6766b8815n847J8126Q618K6471N277K221p224J84j9048o366k2210L5368J5600
$$ -28815 -34662 -16536 -7918 18553 23830 26051 18827 19011 -37 -6403 -28613 6755 22355
6753B2355m947l5897O197J4102K294l74o79j979k4720k2671q658J1037J4674J8923
$$ 22355 17408 -18489 -12292 1810 4104 3730 3051 1072 -23648 -46319 -54977 -43940 -29266 -10343
6739a0343k364o069p281n142K7318j3178P696m241m0551o9998Q026N5354Q864
$$ -10343 -12707 -18776 -26057 -31199 -3881 -17059 -9363 -13604 -54155 -124153 -116127 -60773 -51909
6726e1909K884K0854J9967L660R068J0272O0911K7532k0883K1617l0679M7j0074
$$ -51909 -49025 -28171 -8204 -4544 4524 14796 75707 103239 82356 103973 73294 73341 63267
6713F3267j9409k3796l386j5968n650j8778Q242J6613K0171k3670j4974O775K9434
$$ 63267 43858 20062 16676 708 -4942 -23720 -15478 1135 21306 -2364 -17338 -10563 18871
6700A8871J2885j5202j5747k7896J5877O19O934J3306q05k8596j8576L440K8975
$$ 18871 31756 16554 807 -27089 -11212 -10593 -3659 9647 8842 -19754 -38330 -34890 -5915
6687e915P699J0052N215k117J155j2065p460J814K6044K4751J4517J6377k5120
$$ -5915 1784 11836 17051 14934 16089 4024 -3436 -1622 24422 49173 63690 80067 54947
6674E4947l6078j1530j1912P741K9840J131L7532M171k65j9021k9524j8978l0012
$$ 54947 18869 7339 -4573 3168 33008 34139 71671 75842 75577 56556 27032 8054 -21958
6661b1958k9926Q140k0650L036M6918J4445M728j6314J008Q077j5761j7594k210
$$ -21958 -51884 -43744 -64394 -61358 -14440 5 4733 -11581 -10573 -2496 -18257 -35851 -38061
6648c8061m507k326j1715J2623m372O061M861m934j2867J3494J9801K48o65O772
$$ -38061 -42568 -44894 -56609 -43986 -48358 -42297 -37436 -42370 -55237 -41743 -21942 -21694 -22359 -15587
6634a5587j128k4487K7957Q31P857J1329k0057j7595M7418J9980k6170K0754J7958
$$ -15587 -16715 -41202 -13245 -12414 -4557 6772 -13285 -30880 16538 36518 10348 31102 49060
6621D9060k4122k7705J9150J8548l190k5329M396L240j9506k1677N312m40Q064
$$ 49060 24938 -2767 16383 34931 31741 6412 10808 14048 -5458 -27135 -21823 -22263 -14199
6608a4199N969L628k2503j1919J1173l535J5877K4464j0801O673n221O422L541
$$ -14199 -8230 -4602 -27105 -39024 -27851 -31386 -15509 8955 -1846 4827 -394 6028 9569
6595I569l1003J2644J204k6398j3088P739l406J742K0580p037J4003J8987R312
$$ 9569 -21434 -8790 -7586 -33984 -47072 -39333 -42739 -40997 -20417 -27454 -13451 5536 14848
6582A4848Q379m668l8644k0642n734j459K1428m877k9099j0606M0853L5679m32
$$ 14848 23227 18559 -20085 -40727 -46461 -47920 -26492 -31369 -60468 -71074 -30221 5458 5026
6569E026n909L4687K8312j8467r005Q767j5272j5315o010j2295Q958J3414k0323
$$ 5026 -883 33804 62116 43649 34644 43411 28139 12824 6814 -5481 3477 16891 -3432
6556c432j7533K9841K8928L32j1929j4163k5302Q53p876K1904j738j6443Q776
$$ -3432 -20965 8876 37804 38136 26207 12044 -13258 -12405 -20281 1623 -115 -16558 -7782
6543g782q430J1108j4123M46K5376P466j4280j6211q062k3385K8668M068l7086
$$ -7782 -16212 -5104 -19227 -18781 6595 14061 -219 -16430 -24492 -47877 -19209 -15141 -52227
6530e2227k301K9494K2328p91k4216l0495L0046K751j9308J4409J8109j3671J692
$$ -52227 -54528 -25034 -2706 -3497 -27713 -58208 -28162 -25411 -44719 -30310 -12201 -25872 -24180
6517b4180J5170J0992n588p759N915q084k0395K5087p447o564K5803J1440j858
$$ -24180 -9010 1982 -3606 -11365 -5450 -13534 -33929 -8842 -16289 -22853 2950 14390 12532
6504A2532L2145j7231l8941K6065j115l3514k8054J308K1020K2928J0999k976
$$ 12532 44677 27446 -11495 14570 13455 -20059 -48113 -46805 -25785 -2857 8142 5166
6492E166n56j3378o508j7360K743J2256j404k3204r429J0190K1802j0552J4230
$$ 5166 4610 -8768 -15276 -32636 -29893 -17637 -19041 -42245 -51674 -41484 -19682 -30234 -16004
6479a6004J3047J1145J5915J1256j2836j7800l483j7299j3451J7181q438o508
$$ -16004 -2957 8188 24103 35359 22523 4723 1240 -16059 -29510 -12329 -20767 -27275
6467b7275J0855J5902Q044j4168l3571J1146J0512p79j8544J1645J0562k655j6840
$$ -27275 -16420 -518 7526 -6642 -40213 -29067 -18555 -19334 -37878 -26233 -15671 -18326 -35166
6454c5166J2035M7143J5780r051Q375r728l110K0949k0896j7343j9694q363L0982
$$ -35166 -23131 24012 39792 30741 39116 29388 26278 47227 26331 8988 -10706 -19069 11913
6441A1913K2077o009m2152n944j1136J0972P573M01j8777N281k756R995k7745
$$ 11913 33990 27981 -14171 -20115 -31251 -20279 -12706 -12305 -31082 -25801 -28557 -18562 -46307
6428d6307L596O196j1742j4241J4834K876K4557L2378J0796j7531j8989J1490
$$ -46307 -42711 -36515 -48257 -62498 -47664 -44788 -20231 12147 22943 5412 -13577 -2087
6416b087p795QN974K1101J9190j4109O90R282J981K71J0069k4664j0626j788L5934
$$ -2087 -9882 -9874 -3900 17201 36391 22282 22972 32254 34235 34506 44575 19911 9285 7497 43431
6401D3431j6653k4518q928k0566n95L0192J8465K3183o54k5936O9M093j1396j3627
$$ 43431 26778 2260 -6668 -27234 -27829 2363 20828 44011 43357 17421 17490 21583 10187 -3440
6387c440m184o822K637J8587r63k4125k4753r669K2693j273L731k6566j7443L5649
$$ -3440 -7624 -14446 -11809 6778 5815 -18310 -43063 -52732 -30039 -31312 -27581 -54147 -71590 -35941
6373c5941l58j380J896J166J749J7152K013O152j1112j7694j2641J0877M526J9088
$$ -35941 -36299 -37679 -35783 -34617 -32868 -15716 -13703 -7551 -18663 -36357 -48998 -38121 -33595 -14507
6359a4507Q84n862q483L6523k211o507j0762j6941L1551K3083J1175J1227k969
$$ -14507 -13623 -19485 -27968 8555 6344 -163 -10925 -27866 3685 26768 37943 49170 46201
6346D6201l8219o0363J8450M8258J657j5855l4424j9684K9832L4349M1394L387
$$ 46201 7982 -52381 -33931 14327 15984 129 -34295 -53979 -24147 10202 51596 54983
6334E4983l8618j3898l698j1723Q007N0679L808l8385l9601J8989Q131N534n54
$$ 54983 16365 2467 -1231 -12954 -4947 45732 49540 11155 -28446 -9457 -1326 4208 3654
6321C654L726R262j4823k4672o211J0694p536L188J6748p01q357j3126L2761R173
$$ 3654 7380 16642 1819 -22853 -29064 -18370 -25906 -22718 -5970 -6671 -15028 -28154 4607 13780
6307A3780R180k0674j4820j7444j597l4364Q325k171N732m259k4459p29L2762
$$ 13780 22960 2286 -12534 -29978 -31575 -65939 -57614 -59785 -54053 -58312 -82771 -83500 -50738
6294e0738m889j9990J5654K0655J0714j8734k886l873L7664J6029J4599N68r734
$$ -50738 -55627 -75617 -59963 -39308 -28594 -47328 -50214 -54087 -16423 -394 14205 14773 5039
6281E039o405j6562J3691K6134R003r120k9945k051j7777k302k175M154l522J188
$$ 5039 -1366 -17928 -4237 21897 30900 21780 -8165 -10216 -27993 -30295 -32470 -28316 -31838 -30650
6267c0650J1632L3149j0486k3270m143r794J4736J7248j5601j6944R3J2508K8236
$$ -30650 -19018 14131 3645 -19625 -23768 -33562 -18826 -1578 -17179 -34123 -34030 -21522 6714
6254F714L1002m575m2723j5102J3758J2905J3624k4145j6211Q479P878J0882L8189
$$ 6714 37716 33141 -9582 -24684 -10926 1979 15603 -8542 -24753 -16274 -8396 2486 40675
6241D0675n913o174l238j9218j260K6951J5776r142r755J1945J0847k0808j3445
$$ 40675 34762 28588 25350 6132 4872 31823 47599 38457 28702 40647 51494 30686 17241
6228A7241k0313j4766o470j3736J3390K6843P573j4790J5847k5626n09L874q337
$$ 17241 -3072 -17838 -24308 -38044 -24654 2189 9762 -5028 10819 -14807 -15316 -11442 -19779
6215a9779j1258J5682k61j9196m091j2112J0679K2026l939j0141K7398K8136J5327
$$ -19779 -31037 -15355 -15616 -34812 -38903 -51015 -40336 -18310 -22249 -32390 -4992 23144 38471
6202C8471k0021j8920l3406J8302R389K076K187K8583j8408j1373J777J162J6737
$$ 38471 18450 -470 -33876 -15574 -6185 -4109 -1922 26661 8253 -3120 -1343 -181 16556
6189A6556j7547o46L218j5530J695n305P930l313j427n496Q928k450q504N590
$$ 16556 -991 -1637 1581 -13949 -12254 -17559 -9629 -12942 -14369 -19865 -10937 -13387 -21891 -16301
6175a6301K3574J193K5292j4745j7687L1750J5336m7435l4584N037K6835L7601
$$ -16301 7273 8466 33758 19013 1326 33076 48412 977 -33607 -28570 -1735 35866
6163C5866R047j0332K0327o979l716k7467j9094j4259k1288j9038k5090J0387
$$ 35866 44913 34581 54908 47929 44213 16746 -2348 -16607 -37895 -56933 -82023 -71636
6151g1636K1944k1152J9941K1079L8926N211k7972j6316J3796J8099J0579j4242
$$ -71636 -49692 -70844 -50903 -29824 9102 14313 -13659 -29975 -16179 1920 12499 -1743
6139a743l5874O73J114j0255L7817M280k5161o58J5938K431j2693R534O266q678
$$ -1743 -37617 -36944 -35830 -46085 -8268 -3988 -29149 -29807 -13869 -11438 -24131 -14597 -8331 -17009
6125a7009R730j8140J13j885p143J4728Q340j2109K041J6167J3541o902j3238
$$ -17009 -7279 -25419 -25306 -27191 -34334 -19606 -11266 -23375 -21334 -5167 8374 1472 -11766
6112a1766J6368L4848p219p798r540l907M534j0923j8052p199P676Q129K334j0834
$$ -11766 4602 39450 32231 24433 14893 10986 15520 4597 -13455 -20654 -12978 -4849 -2515 -13349
6098a3349l09P062m405J0117J4558J6523k5536k7910M119K3180k2534j3468l98
$$ -13349 -13658 -6596 -11001 -884 13674 30197 4661 -23249 -19130 4050 -18484 -31952 -32350
6085c2350P544L0855K2220j4520j5204o496j0772l222Q357M467m890P11J4242
$$ -32350 -24806 6049 28269 13749 -1455 -7951 -18723 -21945 -13588 -9121 -14011 -13300 942
6072I42K6807o217N916j5364L690r968j5530P217J3946j3726j9130j2565J4151
$$ 942 27749 21532 27448 12084 15774 5806 -9724 -2507 11439 -2287 -21417 -33982 -19831
6059a9831R827J0501J1260K1533k265P418j8706q144k9143j3172J2483K7394J5400
$$ -19831 -10004 497 11757 33290 31025 38443 19737 11593 -17550 -30722 -18239 9155 24555
6046B4555k3752k7547K174O536K1889p975l124q949j0604L6191O738p09N572K3307
$$ 24555 803 -26744 -24570 -18034 3855 -4120 -7244 -16193 -26797 9394 16132 15423 20995 44302
6032D4302m082k8723l3304j4335j5956Q441J6906K8586J8095k9728k1667L417
$$ 44302 40220 11497 -21807 -36142 -52098 -43657 -26751 1835 19930 -9798 -31465 -28048
6020b8048j697Q26J4847J7219P666l3k242J5070O53k1702O818q197j9109J2012
$$ -28048 -29745 -28919 -14072 3147 10813 10780 8538 23608 24261 2559 9377 1180 -17929 -5917
6006e917R226j2881R960M485p879k3261k0078N006L1112M6359P912j5661l9500
$$ -5917 3309 -9572 388 4873 -3006 -26267 -46345 -41339 -10227 36132 44044 28383 -11117
5993a1117j7191K2048R064m260k8466J0850Q582L758O742J0741M608k674j9192
$$ -11117 -28308 -6260 2804 -1456 -29922 -19072 -10490 -6732 10 10751 15359 12685 -6507
5980f507n045N875K833k1732k7258J8263L0662L628j3805J6190J8655K9528k2501
$$ -6507 -11552 -5677 -2844 -24576 -51834 -33571 -2909 719 -13086 3104 21759 51287 28786
5967B8786j2533l433n220n930k705r807N130J8990k6736j4600q648K9056o058
$$ 28786 16253 12820 7600 1670 -1035 -10842 -5712 13278 -13458 -28058 -36706 -7650 -13708
5954a3708Q49k7571r603J6249L4010R433j3105j8679k810Q026J7237p692k0395
$$ -13708 -12859 -40430 -50033 -33784 226 9659 -3446 -22125 -24935 -16909 328 -7364 -27759
5941b7759q733J5026J1675K152k72J5158J147Q631j5695l2905j7017J8707L5932
$$ -27759 -36492 -21466 -9791 -7639 -7911 7247 8394 17025 1330 -31575 -48592 -29885 6047
5928F047j2590k5983k3072P012L4743M983J3758L168k5737q141R128m615R337
$$ 6047 -6543 -32526 -55598 -48586 -13843 -8860 4898 8066 -17671 -25812 -16684 -21299 -11962
5915a1962j4875Q259j296k9489k1458J1400J2165J5661J145m45K9302M06Q848
$$ -11962 -26837 -18578 -19874 -49363 -70821 -59421 -47256 -31595 -30450 -30895 -1593 -1187 7661
5902G661k8502J984J6054j1149l145k5002p418N818k302J6986J9585K0018K1741
$$ 7661 -20841 -18857 -2803 -13952 -17097 -42099 -49517 -43699 -46001 -29015 -9430 10588 32329
5889C2329k478l0066l7339M048J8797J5351j9881q136J3539r686j442Q923k028
$$ 32329 29851 -215 -37554 -33506 -14709 642 -19239 -27375 -13836 -23522 -24964 -16041 -18069
5876a8069j1561J3331K4803L0160L976n720k5333j3247K8778q626j6368k3002
$$ -18069 -29630 -16299 8504 38664 42640 36920 11587 -1660 27118 18492 2124 -20878
5864b0878M912K553j465O023K1629K6816j4173k5895k934O814n375k09J9383q784
$$ -20878 -15966 -13413 -14878 -8855 12774 39590 25417 -478 -3412 3402 -1973 -2182 17201 8417
5850H417J6448K2049j5573k981k0758j3849p492k4309j6690K1585J7539L864J5119
$$ 8417 24865 46914 31341 28360 7602 -6247 -13739 -38048 -54738 -33153 -15614 -11750 3369
5837C369J2215J0196j0382J495k445J3493j0737O44m227j0241p881K1275j4250
$$ 3369 15584 25780 15398 16893 14448 27941 17204 17848 13621 3380 -4501 16774 2524
5824B524l886K1420J8585j125n846j3754K0476K310l4078j8233J813M3039O569
$$ 2524 -1362 20058 38643 37518 31672 17918 38394 40704 6626 -11607 -9794 33245 39814
5811C9814K0764J8518l8065m8147j1867P322K5628J3047l0120m2714k1054n178
$$ 39814 60578 79096 41031 -7116 -18983 -11661 13967 27014 -3106 -45820 -66874 -72052
5799g2052j1577K7127N4298J481k8806J1878k711J470J3731K2258p875P04K3357
$$ -72052 -83629 -56502 -2204 -723 -29529 -17651 -20362 -18892 -5161 17097 9222 9926 33283
5786C3283j9446k5124R527N49j7552J846K6661p589m934m065l269K499r013L3967
$$ 33283 13837 -11287 -1760 -1211 -18763 -16917 9744 2155 -2779 -6844 -10113 -7614 -16627 17340
5772A7340Q11l1129k2987j7153J9808J2282k3669N190K4075M786J0720J899l1508
$$ 17340 18151 -12978 -35965 -53118 -33310 -21028 -44697 -39507 -15432 -10646 74 1973 -29535
5759b9535j8353J1220O695Q895M096R714k0950k1689J9867J9636o426J8976K1042
$$ -29535 -47888 -36668 -29973 -21078 -16982 -7268 -28218 -49907 -30040 -10404 -16830 2146 23188
5746B3188N5r249j9137J3474K068n298L958L6652k6997r934M486K3607Q645m224
$$ 23188 23243 13994 -5143 8331 10399 5101 9059 45711 18714 8780 13266 36873 45518 41294
5732D1294j5581l1385R81r074L8105M6874O240l7647j7682k1154k2592J9373J9242
$$ 41294 25713 -5672 -4691 -13765 24340 71214 77454 39807 22125 971 -21621 -2248 16994
5719A6994j7592J0819M360k8854R741L263K7810j9171m6442j7475J3477o796j9490
$$ 16994 -598 10221 14581 -14273 -4532 -1269 26541 7370 -39072 -56547 -43070 -49866 -69356
5706f9356L5514L9273l836p990K0606r58N462j4704m8714J737J6996J2292M4105
$$ -69356 -33842 5431 1595 -6395 14211 13253 18715 4011 -44703 -42966 -25970 -13678 30427
5693C0427J7110o029k3263j0857R238l2292L2582L0061M559J535k1612J0530l427
$$ 30427 47537 41508 18245 7388 16626 -15666 16916 46977 51536 53071 31459 41989 38562
5680C8562m0511j1680p095K435j2443K7065L2806m513k5919m102l6899k5993L2777
$$ 38562 -1949 -13629 -20724 -18289 -30732 -3667 29139 24626 -1293 -5395 -42294 -68287 -35510
5667c5510L0069k6833P556P364q848J1012J7764m090j4401O458J629k3119K706
$$ -35510 -5441 -32274 -24718 -17354 -26202 -15190 2574 -1516 -15917 -9459 -7830 -30949 -28243
5654b8243Q171q363J6483M2816J8957o390r296j5067j5437O969L2344J8032q300
$$ -28243 -20072 -28435 -11952 30864 49821 43431 34135 19068 3631 10600 42944 60976 52676
5641E2676j2840j3765P948j6256m773j4665K372k0194j4983K8389K0130j9074
$$ 52676 39836 26071 34019 17763 12990 -1675 697 -19497 -34480 -6091 14039 -5035
5629e035q230J4012J4981K564J84k1050k5828o476k312j8834k3464L2177Q840
$$ -5035 -13265 747 15728 18292 18476 -2574 -28402 -34878 -37190 -56024 -79488 -47311 -38471
5616c8471J8968L0519Q720r598l794J1036k8621j4763J6032m741K992n552m177
$$ -38471 -19503 11016 19736 10138 6344 17380 -11241 -26004 -9972 -14713 -11721 -17273 -21450
5603b1450J4404K6575J1005J694k8825o272o879p350K3670N053r431o98j0751
$$ -21450 -7046 19529 30534 32228 3403 -2869 -9748 -17098 6572 11625 2194 1496 -9255
5590i255j0352L0051J9076l959k1236J758j0016j0011J6654J6288P536j2173p919
$$ -9255 -19607 10444 29520 25561 4325 6083 -3933 -13944 2710 18998 26534 14361 6442
5577F442M089l148J4466j4610j4414J2111K7100p702l3544P571L110q915j9310
$$ 6442 10531 7383 21849 7239 -7175 4936 32036 24334 -9210 -1639 1471 -7444 -26754
5564b6754m857j329J8407J7506J7560R703K4813j8119l5285P361p175k1700l787
$$ -26754 -31611 -32940 -14533 2973 20533 30236 55049 36930 1645 9006 1831 -19869 -23656
5551b3656o449N415K8150J3593J831K198N371K9l675J5933j5486J3214O633m1935
$$ -23656 -30105 -24690 3460 17053 18884 21082 26453 26482 22807 38740 23254 36468 43101 1166
5537A166r778m336j9891j628P66n903K1193k916k7137K0976K8940K0008n419J1852
$$ 1166 -8612 -12948 -32839 -34467 -33701 -39604 -18411 -21327 -48464 -27488 1452 21460 16041 27893
5523B7893O817k1180k0869j1335q516J2131Q096l458j4379j1076Q825N1428K6122
$$ 27893 34710 13530 -7339 -18674 -27190 -15059 -6963 -10421 -24800 -35876 -27051 24377 50499
5510E0499K232k2886m1359l998N271K3284J5103k8007k5992k2787l9427l311M0843
$$ 50499 52731 29845 -11514 -15512 -10241 13043 28146 139 -25853 -48640 -88067 -91378 -50535
5497e0535J4438L894K7955K933o992J5860J9291J1661l3480j2425L8649K8481
$$ -50535 -36097 -32203 -4248 -1315 -8307 7553 26844 38505 5025 -7400 31249 59730
5485E9730j5001l0335l8118j7504K2096L0519J2084k9850p24J6980J8295j759
$$ 59730 44729 14394 -23724 -41228 -19132 11387 23471 -6379 -7103 9877 28172 26413
5473B6413l069P945J1890o396n219K1039j0453j5240j776j2608j9149k6662P958
$$ 26413 23344 31289 43179 36783 31564 52603 42150 26910 25134 12526 -6623 -33285 -25327
5460b5327L0553J301m524j226n272J0379l287K698j5250k3050j1642J1137K7469
$$ -25327 5226 6527 2003 777 -4495 5884 2597 5295 -9955 -33005 -44647 -33510 -6041
5447f041J6768n069k4116j2357O470K4613Q443q90m832q942O351j4433J414J7501
$$ -6041 10727 5658 -18458 -30815 -24345 268 8711 7821 2989 -5953 398 -14035 -12621 4880
5433D880K2535o879k7813j3120M979L3063j4138j3937l526m7038J5690K772P966
$$ 4880 27415 20536 -7277 -20397 -15418 17645 3507 -10430 -13956 -60994 -45304 -42532 -34566
5420c4566K2777J0516r012k094l478r586P396k7843j4917O2110J4748l7772m850
$$ -34566 -11789 -1273 -10285 -12379 -15857 -25443 -18047 -45890 -60807 1303 16051 -21721 -26571
5407b6571Q338j231k394j9022l7875L8335M6537k515k3708o315L033l121l0030
$$ -26571 -18233 -19464 -21858 -40880 -78755 -40420 6117 3602 -20106 -26421 -23388 -26509 -56539
5394e6539q125J0265L5260L9725K4331n541j3973j1719Q803L659l2895k5034P15
$$ -56539 -64664 -54399 -19139 20586 44917 39376 25403 13684 22487 26146 -6749 -31783 -31068
5381c1068J2650J1982K281k7743Q657L7537N48k1536o1587J4321L6166K943M515
$$ -31068 -18418 -6436 -4155 -31898 -23241 14296 14844 -6692 -68279 -53958 -17792 -14849 -10334
5368a0334j1217j5914o476K4658L612J3380J6754J619q427O991K3437q753K1322
$$ -10334 -21551 -37465 -43941 -19283 -15671 -2291 14463 16082 7655 14646 38083 29330 50652
5355E0652o52p053J5220l3383n0206q746q970J0946K1332M4060j5967q507Q244
$$ 50652 50000 42947 58167 24784 -25422 -34168 -43138 -32192 -10860 33200 17233 8726 16970
5342A6970p822j0312j0947j4951J9362L0961Q100r866P552j8023l8825J3160m871
$$ 16970 9148 -1164 -12111 -27062 -7700 23261 31361 21495 29047 11024 -27801 -14641 -19512
5329a9512j315p213q417J7738K8082p483k5560J7107K4035K2284J3594k0949r802
$$ -19512 -20827 -28040 -36457 -18719 9363 1880 -23680 -6573 17462 39746 53340 32391 22589
5316B2589r664l0643j4986j0798Q203M0598J6102j8207j5175l6857m397M3549
$$ 22589 12925 -17718 -32704 -43502 -35299 5299 21401 3194 -11981 -48838 -53235 -9686
5304i686K6166j0359K1981Q72O529k53l6284l1151q46J6147J1999j570j8575p560
$$ -9686 16480 6121 28102 28974 35503 35250 -1034 -32185 -33031 -16884 -4885 -6455 -25030 -32590
5290c2590M0208L9505m982j2809o005k2978Q145j369l0434j2837k2189J8614N8976
$$ -32590 7618 47123 42141 29332 23327 349 8494 7125 -23309 -36146 -58335 -39721 19255
5277A9255L605J0743K6286L743q718o708l8410K7171J0026k7026l0124K6659K6524
$$ 19255 22860 33603 59889 63632 54914 48206 9796 36967 46993 19967 -10157 16502 43026
5264D3026j9286m2628k9124o110J6507J1239K0177Q076k8002J1280J5590K3693
$$ 43026 23740 -18888 -48012 -54122 -37615 -26376 -6199 1877 -26125 -14845 745 24438
5252B4438q774l5347L697J2902O78J4351J4359o273J3761R559J397l7375n0191
$$ 24438 15664 -19683 -15986 -3084 -2406 11945 26304 20031 33792 43351 44748 7373 -42818
5239d2818k1223K5971J9566K3348j0613l4018k5634P257M25m631J5558M2130K1923
$$ -42818 -64041 -38070 -18504 4844 -5769 -39787 -65421 -58164 -57739 -62370 -46812 -4682 17241
5226A7241j4416j8570l1173p51J9575L0974J795K0411n047P618k2694k0290k0248
$$ 17241 2825 -15745 -46918 -47669 -28094 2880 4675 25086 20039 27657 4963 -15327 -35575
5213c5575K2975O997k3937k117J3814j7072K584L0336J1479O341J134k4393J3980
$$ -35575 -12600 -5603 -29540 -31657 -17843 -34915 -32331 -1995 9484 15825 16959 -7434 6546
5200F546r764k8145k3204J2193L0746J9223R149j0969L055J5298K2190j4624k3572
$$ 6546 -3218 -31363 -54567 -42374 -11628 7595 16744 5775 8830 24128 46318 31694 8122
5187H122J0150K864J8474k3836j9683m1955k5118j6368p619j5173J9306N3532
$$ 8122 18272 21136 39610 15774 -3909 -45864 -70982 -87350 -94969 -110142 -90836 -37304
5175c7304M2914J7480k6381K894k541m006m49J7853k0242r099J6963Q354J8958
$$ -37304 5610 23090 -3291 -397 -2938 -6944 -7393 10460 -9782 -18881 -1918 6436 25394
5162B5394j5774k9427o370J663N0925p401l5617j3656K7537K9087O534j2025k2711
$$ 25394 9620 -19807 -26177 -24514 26411 19010 -16607 -30263 -2726 26361 32895 20870 -1841
5149a841k363j3316l4117k2535K1478L5046N526k4538O142j1617P577J2344j288
$$ -1841 -4204 -17520 -51637 -74172 -52694 -17648 -12122 -36660 -30518 -42135 -34558 -22214 -23502
5136b3502K537M313M18k2307J448K921J2268J9806m252r967K1570K9682P299k5394
$$ -23502 -20965 -16652 -16234 -38541 -37093 -34172 -21904 -2098 -6350 -16317 5253 34935 42234 16840
5122A6840q102M353j8954j130j7028k2742j5581K4448J3658K9234K258j9615j1616
$$ 16840 8738 13091 -5863 -6993 -24021 -46763 -62344 -37896 -24238 4996 7254 -12361 -23977
5109b3977j9443K2812K9221j9404J1975M517j1877j735j216j9018k8926M0174
$$ -23977 -43420 -20608 8613 -10791 1184 5701 -6176 -7911 -9127 -28145 -57071 -16897
5097a6897L8949K1964k4375Q869L9779p200m6092k0767r172J2184j8786j4890
$$ -16897 22052 44016 19641 28510 68289 61089 14997 -5770 -14942 -2758 -21544 -36434
5085c6434k791l2286o746J9440J7225K9854L0490K4570L2670j0191k5772R346
$$ -36434 -39225 -71511 -78257 -58817 -41592 -11738 18752 43322 75992 65801 40029 49375
5073D9375K3161k3523q234J7205k3093l3733k633K7259Q933l7510m71J4623M3050
$$ 49375 72536 49013 40779 57984 34891 1158 -1475 25784 34717 -2793 -3264 11359 54409
5060E4409O165j5406K239J5767j2797l5412l6388m34J4566M785K138N14j4988
$$ 54409 60574 45168 47407 63174 50377 14965 -21423 -21857 -7291 -2506 -368 146 -14842
5047a4842k2735j2032J4786M895j046O004K4004Q916k2467o136K2891j2050j8753
$$ -14842 -37577 -49609 -34823 -29928 -30974 -24970 -966 7950 -14517 -20653 2238 -9812 -28565
5034b8565K75J035K5502q660k9515j7398J4454J3355j9584l3651K793R747K7269
$$ -28565 -28290 -27255 -1753 -10413 -39928 -57326 -42872 -29517 -49101 -82752 -79959 -70212 -42943
5021d2943K8393K1605R160j9002L95J903o440p779J1054j1548j5870k0702J2636
$$ -42943 -14550 7055 16215 -2787 -2392 -489 -6929 -14708 -3654 -15202 -31072 -51774 -39138
5008c9138K8836J7115K8846O995j6805l098L888K9O093K2610j4679n1523j3445
$$ -39138 -10302 6813 35659 42654 25849 22751 26639 26668 32761 55371 40692 -10831 -24276
4995b4276m861K5655J547L093N418J7832K8826R28O216l472j0723k8709p316J6425
$$ -24276 -29137 -3482 -1935 1158 6576 24408 53234 54162 60378 56906 46183 17474 10158 26583
4981B6583k547l2889m609L0234n791j4741L2841o859k9874L408K4043j0073k7204
$$ 26583 24036 -8853 -13462 16772 10981 -3760 29081 22222 -7652 -4244 19799 9726 -17478
4968a7478k7722N058O389K8209J1296K0470L0858M445r411j7958r872r725j938
$$ -17478 -45200 -40142 -33753 -5544 5752 26222 57080 61525 52114 34156 24284 14559 12621
4955A2621K056j6004m08R603q493J6359n575j0152J2202k5299j1488J5726K008
$$ 12621 14677 -1327 -1735 7868 -625 15734 10159 7 12209 -13090 -24578 -8852 -6844
4942f844K1821q293j5558k622m283k330k0864l3102m5941J7742O9969K2908K0353
$$ -6844 14977 6684 -8874 -11496 -15779 -18109 -38973 -72075 -118016 -100274 -30305 -7397 12956
4929A2956N797k4328j104M367J4921k5214j0532j0969j4331k8224J4204J5023
$$ 12956 18753 -5575 -6679 -2312 12609 -12605 -23137 -34106 -48437 -76661 -62457 -47434
4917d7434L790N979L508r582m296R992J2511m995M297K6296J2529l4716l5121
$$ -47434 -43644 -37665 -34157 -43739 -48035 -38043 -25532 -30527 -26230 66 12595 -22121 -57242
4904e7242L8796K5677p492l114K2295N705n52j6958j4487k268k2074j228l842
$$ -57242 -18446 7231 -261 -3375 18920 24625 24073 7115 -7372 -9640 -31714 -32942 -36784
4891c6784J4831J7181J5484K589P617k1515l2934J8127J5137j8071j3528j2455
$$ -36784 -21953 -4772 10712 13301 20918 -597 -33531 -15404 -267 -18338 -31866 -44321
4879d4321J9706J2896J0039J7180j2820j2226p382o828p45l853O183J1993l947
$$ -44321 -24615 -11719 -1680 15500 2680 -9546 -16928 -23756 -24501 -28354 -22171 -10178 -14125
4866a4125p20Q334K4068P07p101o227j0313j0275P554J115M4210L510j6833j7792
$$ -14125 -14845 -6511 17557 18264 11163 4936 -5377 -15652 -8098 -6983 37227 40737 23904 6112
4852F112k122J9600j9798j2795j5831J6654m264j7740q496l7701J8891J0871J0748
$$ 6112 3990 23590 3792 -9003 -24834 -8180 -12444 -30184 -38680 -76381 -57490 -46619 -35871
4839c5871j5032K3279K1668L796J4494p583k2980j4576J5996L4171k9290l1599
$$ -35871 -50903 -27624 -5956 -2160 12334 4751 -18229 -32805 -16809 17362 -11928 -43527
4827d3527J4550K4495j7365j3248R836L405o541k3463j576J1347J7850K0115j4230
$$ -43527 -28977 -4482 -21847 -35095 -25259 -21854 -28395 -51858 -53434 -42087 -24237 -4122 -18352
4814a8352k1557J2882K5849k8572j9215R323k436N015j4114J9597J4357r094m738
$$ -18352 -39909 -27027 -1178 -29750 -48965 -39642 -42078 -37063 -51177 -31580 -17223 -26317 -31055
4801c1055K219J3956k0412l3478K9660N1520M1894k3696l7983K7408J0869k7766
$$ -31055 -28836 -14880 -35292 -68770 -39110 12410 54304 30608 -7375 20033 30902 3136
4789C136l1488m0240O047N3845N0466J054k2898j2486j4270l4159K4325M0653
$$ 3136 -28352 -68592 -62545 -8700 41766 42820 19922 7436 -6834 -40993 -16668 23985
4777B3985O487k8875j9376m978j1198J9533K0121k862q611l2762M890N8449L97
$$ 23985 30472 1597 -17779 -22757 -33955 -14422 5699 2837 -5774 -38536 -33646 24803 25200
4764B5200j9212k0135j7521M3500O252j8674p879j0850j705J157M1j45j5209n841
$$ 25200 5988 -14147 -31668 11832 18084 -590 -8469 -19319 -21024 -19867 -19826 -19971 -35180 -41021
4750d1021L1952Q148R130R033r040k5338J2253M919K5737O468K4092j2518j0136
$$ -41021 -9069 -921 8209 17242 8202 -17136 -4883 36 25773 32241 56333 43815 33679
4737C3679j5734j8740j7829m2684K6954L7321J2834L337k1406n7889j1635O953
$$ 33679 17945 -795 -18624 -61308 -34354 2967 15801 19138 -2268 -60157 -71792 -64839
4725f4839K1327m402J7046k0541K8049M9127k0457J285M437j1256K747J9235p484
$$ -64839 -43512 -47914 -30868 -51409 -23360 25767 5310 6595 11032 -224 2523 21758 14274
4712A4274j4053o529J926K7406k7201k4100j0850P136L1779n716k5225l9304n670
$$ 14274 221 -6308 -4382 23024 -4177 -28277 -39127 -31991 -212 -5928 -31153 -70457 -76127
4699g6127K6952L0133J1451J3717J8543j7116j0828p836K628J7166j4521K6261
$$ -76127 -49175 -19042 -7591 6126 24669 7553 -3275 -11111 -8483 8683 -5838 20423
4687B0423K7089l34m560j5994q428j301j9546O502K3297M650j9282O297j3150
$$ 20423 47512 47178 42618 26624 18196 16895 -2651 3851 27148 31798 12516 18813 5663
4674E663K54p149j1078j6026N872j7025L4268j0540m707L1608n9l189k4778q909
$$ 5663 5917 -1232 -12310 -28336 -22464 -39489 -5221 -15761 -20468 11140 11081 7892 -16886 -25795
4660b5795J1449J1121q77Q140j1846j509r789Q423o551J1984J4929J8650l2329
$$ -25795 -14346 -3225 -4102 4038 -7808 -9317 -19106 -10683 -17234 -5250 9679 28329 -4000
4647d000j6745J1102L2947L4703l58j643j246l4850j8058o287K879J2104o38r133
$$ -4000 -20745 -9643 23304 58007 57649 56006 54760 19910 1852 -4435 -1556 10548 9910 777
4633G77K0254N552J225j0790N369J9446J3330J0929l7618j9808L7991n706n3160
$$ 777 21031 26583 27808 17018 22387 41833 55163 66092 28474 8666 46657 40951 -12209
4620a2209o872J7951J9974l360k8794J0857Q842J460K8395r08J6627j6876j3884
$$ -12209 -19081 -1130 18844 15484 -13310 -2453 6389 7849 36244 35336 51963 35087 21203
4607B1203k6149p979p175P813p311Q266l410k055j7784K000J7659O907R711j9945
$$ 21203 -4946 -12925 -20100 -12287 -19598 -11332 -14742 -16797 -34581 -32581 -14922 -8015 1696 -18249
4593a8249Q871J9687K1856p106j7790j1750J3261K7573N505k4930n5824r915q495
$$ -18249 -9378 10309 32165 25059 7269 -4481 8780 36353 41858 16928 -38896 -48811 -57306
4580e7306K7028L9427j5051K5392M4124P643j8540k4723k4772o135k1188j3566
$$ -57306 -30278 9149 -5902 19490 63614 71257 52717 27994 3222 -2913 -24101 -37667
4568c7667o388J7067p138q038K2167J4385J3709j8008k6162l088j5041K175J3021
$$ -37667 -44055 -26988 -34126 -42164 -19997 -5612 8097 -9911 -36073 -39161 -54202 -52027 -39006
4555c9006J13j0345l194K2758j936P081N979L492L42j998J370K3552K6837J7113
$$ -39006 -38893 -49238 -52432 -29674 -31610 -24529 -18550 -15058 -14716 -16714 -15344 8208 35045 52158
4541E2158k411p978k1952K200m246K711K6696j4939j8076q654J9489J7488J312
$$ 52158 49747 41769 19817 22017 17771 20482 47178 32239 14163 5509 24998 42486 43798
4528D3798j9197k8172l5477k1126N853N3525K4932Q517r917j3098r283P655J1661
$$ 43798 24601 -3571 -39048 -60174 -54321 -796 24136 32653 22736 9638 355 8010 19671
4515A9671L2060j6472l1550L952k9245q29J2847N165L094k8743P319L286j2126
$$ 19671 51731 35259 3709 7661 -21584 -22413 -9566 -4401 -1307 -30050 -22731 -19445 -31571
4502c1571o533L2063M583k7571j2617J6126j0277j0539l4682j3473K4997J4201
$$ -31571 -38104 -6041 -1458 -29029 -41646 -25520 -35797 -46336 -81018 -94491 -69494 -55293
4490e5293L2079J8411m401R29l515j6122J0438Q09j9268k7582J6642K4743L3107
$$ -55293 -23214 -4803 -9204 -8275 -11790 -27912 -17474 -16665 -35933 -63515 -46873 -22130 10977
4477A0977J5775k6034k0684k3115L4746J3454M715o432R122j2792j6590K5455
$$ 10977 26752 718 -19966 -43081 -8335 5119 9834 3402 12524 -268 -16858 8597
4465H597Q091k8166j0435j912j703L7927o974r607K4O0O186K0134K1580m6214
$$ 8597 16688 -11478 -21913 -23825 -25528 12399 5425 -4182 -4158 -4098 2088 22222 43802 -2412
4451b412j3500k3351M3556L4773l6426k2279J6229L0513p895j4369p2l2490k5236
$$ -2412 -15912 -39263 4293 39066 2640 -19639 -3410 27103 19208 4839 4767 -27723 -52959
4438e2959L981K8858K0618p079q898R867k2813J4090K5321J0670j2542q586J2004
$$ -52959 -48978 -20120 498 -6581 -15479 -5612 -28425 -14335 10986 21656 9114 528 12532
4425A2532J2984p446k1157J3364k5921J8810q769j5670O535L1504J4880L832K9192
$$ 12532 25516 18070 -3087 10277 -15644 3166 -5603 -21273 -14738 16766 31646 35478 64670
4412F4670J3029l4171k7790j5866J2108k2484J5497J3962m585r685k6898k0147
$$ 64670 77699 43528 15738 -128 11980 -10504 4993 18955 14370 4685 -22213 -42360
4400d2360L696M4102J1997m0651m338J8023L291Q282j2345p720k927q427L329
$$ -42360 -38664 5438 17435 -23216 -27554 -9531 -6240 2042 -10303 -18023 -20950 -29377 -26048
4387b6048j3949J4364J1774K0736R310J4335j4939l6744j0807K1147q325Q567
$$ -26048 -39997 -25633 -13859 6877 16187 30522 15583 -21161 -31968 -10821 -19146 -10579
4375a0579j818l0888k0629K107n916J2633L977K5437K9648J1031p136J5372L850
$$ -10579 -12397 -43285 -63914 -61807 -67723 -55090 -51113 -25676 3972 15003 7867 23239 27089
$$ [...]
##END NTUPLES=NMR SPECTRUM
##END=
