##TITLE=Analysis number 328788
Compound Code cc 62704
Book Reference 521/81
Project Code adrs
Chemist Name evam
##JCAMPDX= 6.0         $$ Bruker NMR JCAMP-DX V2.0
##DATA TYPE= NMR SPECTRUM
##DATA CLASS= NTUPLES
##ORIGIN= Bruker BioSpin GmbH
##OWNER= nmr
$$ XWIN-NMR		Version 3.5
$$ Wed Jul  4 09:57:43 2007 GMT Daylight Time (UT+1h)  MAYBRIDGE\nmr@NMR_250MHZ
##.OBSERVE FREQUENCY= 250.131544655141
##.OBSERVE NUCLEUS= ^1H
##.ACQUISITION MODE= SIMULTANEOUS (DQD)
##.ACQUISITION SCHEME= undefined
##.AVERAGES= 16
##.DIGITISER RES= 18
##SPECTROMETER/DATA SYSTEM= dpx250
##.PULSE SEQUENCE= zg30
##.SOLVENT NAME= CDCl3
##.SHIFT REFERENCE= (INTERNAL, CDCl3, 0, 16.522)
##AUDIT TRAIL= $$ (NUMBER, WHEN, WHO, WHERE, WHAT)
$$ ##TITLE= Audit trail, XWIN-NMR		Version 3.5
$$ ##JCAMPDX= 5.01
$$ ##ORIGIN= Bruker BioSpin GmbH
$$ ##OWNER= nmr
$$ C:\u/data/dgb/nmr/ADRS/330/pdata/1/auditp.txt
$$ ##AUDIT TRAIL=  $$ (NUMBER, WHEN, WHO, WHERE, WHAT)
(   1,<2007-07-04 09:57:21.58 +100>,<MAYBRIDGE\nmr>,<NMR_250MHZ>,
      <created by zg, POWCHK disabled, PULCHK disabled
       configuration hash MD5:
       76 6E 9A 78 1E 09 19 81 EC 84 63 8F B0 6A 59 2D
       data hash MD5: 64K
       03 B0 56 5E C3 7F 97 72 39 76 11 0D A5 C2 42 22>)
(   2,<2007-07-04 09:57:34.30 +100>,<MAYBRIDGE\nmr>,<NMR_250MHZ>,
      <Start of raw data processing
       ef LB = 0.3 FT_mod = 6 PKNL = 1 SI = 32K 
       data hash MD5: 32K
       98 1E 6E 5A 1D A6 DE B2 C7 61 F2 11 ED A6 03 14>)
(   3,<2007-07-04 09:57:35.93 +100>,<MAYBRIDGE\nmr>,<NMR_250MHZ>,
      <apk 
       data hash MD5: 32K
       46 E1 C6 9D 0C 4F 1A 6E C4 52 5D F2 DB D2 D8 F8>)
(   4,<2007-07-04 09:57:36.63 +100>,<MAYBRIDGE\nmr>,<NMR_250MHZ>,
      <abs ABSG = 5 
       data hash MD5: 32K
       08 E7 9E 2C FA EC A8 49 05 82 20 3E 96 79 DE 04>)
$$ ##END=
$$ 
$$ hash MD5
$$ 5F B6 FC 8E EF 3E 41 B6 87 9A 5B 4E F2 7C 5C 75
##$RELAX= 
##$RELAX= 
##$RELAX= 
##$RELAX= 
##$RELAX= 
##$RELAX= 
##$RELAX= 
$$ Bruker specific parameters
$$ --------------------------
##$DU= <C:\u>
##$EXPNO= 330
##$NAME= <ADRS>
##$PROCNO= 1
##$TYPE= <nmr>
##$USER= <dgb>
##$AMP= (0..31)
100 100 100 100 100 100 100 100 100 100 100 100 100 100 100 100 100 100 
100 100 100 100 100 100 100 100 100 100 100 100 100 100 
##$AQSEQ= 0
##$AQ_mod= 3
##$AUNM= <au_zg>
##$AUTOPOS= <5 >
##$BF1= 250.13
##$BF2= 250.13
##$BF3= 250.13
##$BF4= 250.13
##$BF5= 500.13
##$BF6= 500.13
##$BF7= 500.13
##$BF8= 500.13
##$BYTORDA= 1
##$CFDGTYP= 0
##$CFRGTYP= 5
##$CHEMSTR= <none>
##$CNST= (0..31)
1 1 145 1 1 1 1 1 1 1 1 1 1 1 1 1 1 1 1 1 1 1 1 1 1 1 1 1 1 1 1 1 
##$CPDPRG= <>
##$CPDPRG1= <>
##$CPDPRG2= <>
##$CPDPRG3= <>
##$CPDPRG4= <mlev>
##$CPDPRG5= <mlev>
##$CPDPRG6= <mlev>
##$CPDPRG7= <mlev>
##$CPDPRG8= <mlev>
##$CPDPRGB= <>
##$CPDPRGT= <>
##$D= (0..31)
0 1 0 0 0 0 0 0 0 0.06 0 0 0 0 0 0 0.0002 0 0 0 0 0 0 0 0 0 0 0 0 0 0 
0 
##$DATE= 1183539440
##$DBL= (0..7)
120 120 120 120 120 120 120 120 
##$DBP= (0..7)
150 150 150 150 150 150 150 150 
##$DBP07= 0
##$DBPNAM0= <>
##$DBPNAM1= <>
$$ [...]
##$SUBNAM7= <"">
##$SUBNAM8= <"">
##$SUBNAM9= <"">
##$SW= 20.6930455092707
##$SWIBOX= (0..15)
0 0 3 0 0 0 0 0 0 0 0 0 0 0 0 0 
##$SW_h= 5175.983436853
##$TD= 65536
##$TD0= 1
##$TE= 296.16
##$TE2= 300
##$TE3= 300
##$TEG= 300
##$TL= (0..7)
0 120 120 120 120 120 120 120 
##$TP= (0..7)
150 150 150 150 150 150 150 150 
##$TP07= 0
##$TPNAME0= <>
##$TPNAME1= <>
##$TPNAME2= <>
##$TPNAME3= <>
##$TPNAME4= <>
##$TPNAME5= <>
##$TPNAME6= <>
##$TPNAME7= <>
##$TPOAL= (0..7)
0.5 0.5 0.5 0.5 0.5 0.5 0.5 0.5 
##$TPOFFS= (0..7)
0 0 0 0 0 0 0 0 
##$TUNHIN= 0
##$TUNHOUT= 0
##$TUNXOUT= 0
##$USERA1= <user>
##$USERA2= <user>
##$USERA3= <user>
##$USERA4= <user>
##$USERA5= <user>
##$V9= 5
##$VALIST= <valist>
##$VCLIST= <CCCCCCCCCCCCCCC>
##$VD= 0
##$VDLIST= <DDDDDDDDDDDDDDD>
##$VPLIST= <PPPPPPPPPPPPPPP>
##$VTLIST= <TTTTTTTTTTTTTTT>
##$WBST= 1024
##$WBSW= 4
##$XGAIN= (0..3)
0 0 0 0 
##$XL= 0
##$YL= 0
##$YMAX_a= 457625
##$YMIN_a= -395101
##$ZGOPTNS= <>
##$ZL1= 120
##$ZL2= 120
##$ZL3= 120
##$ZL4= 120
##$ABSF1= 16.522
##$ABSF2= -4.171173
##$ABSG= 5
##$ABSL= 3
##$ALPHA= 0
##$AQORDER= 0
##$ASSFAC= 0
##$ASSFACI= 0
##$ASSFACX= 0
##$ASSWID= 0
##$AUNMP= <proc_1d>
##$AZFE= 0.1
##$AZFW= 0.1
##$BCFW= 0
##$BC_mod= 0
##$BYTORDP= 0
##$COROFFS= 0
##$CY= 12.5
##$DATMOD= 1
##$DC= 0
##$DFILT= <>
##$DTYPP= 0
##$F1P= 14.0000005364418
##$F2P= -0.99999901652339
##$FCOR= 0.5
##$FTSIZE= 32768
##$FT_mod= 6
##$GAMMA= 0
##$GB= 0
##$INTBC= 1
##$INTSCL= 1
##$ISEN= 128
##$LB= 0.3
##$LEV0= 0
##$LPBIN= 0
##$MAXI= 10000
##$MC2= 0
##$MEAN= 0
##$ME_mod= 0
##$MI= 0
##$NCOEF= 0
##$NC_proc= -3
##$NLEV= 6
##$NOISF1= 0
##$NOISF2= 0
##$NSP= 0
##$NTH_PI= 0
##$NZP= 0
##$OFFSET= 16.522
##$PC= 1
##$PHC0= -50.86824
##$PHC1= 6.754665
##$PH_mod= 1
##$PKNL= yes
##$PPARMOD= 0
##$PSCAL= 4
##$PSIGN= 0
##$REVERSE= no
##$SF= 250.13
##$SI= 32768
##$SIGF1= 0
##$SIGF2= 0
##$SINO= 400
##$SIOLD= 32768
##$SREGLST= <1H.CDCl3>
##$SSB= 0
##$STSI= 32768
##$STSR= 0
##$SW_p= 5175.98343685301
##$SYMM= 0
##$S_DEV= 0
##$TDeff= 65536
##$TDoff= 0
##$TI= <Analysis number 999999
Compound Code 99
Book Reference 9
Project Code 9>
##$TILT= no
##$TM1= 0
##$TM2= 0
##$TOPLEV= 0
##$USERP1= <user>
##$USERP2= <user>
##$USERP3= <user>
##$USERP4= <user>
##$USERP5= <user>
##$WDW= 1
##$XDIM= 32768
##$YMAX_p= 337957319
##$YMIN_p= -96266
$$ End of Bruker specific parameters
$$ ---------------------------------
##NTUPLES= NMR SPECTRUM
##VAR_NAME=  FREQUENCY,     SPECTRUM/REAL,   SPECTRUM/IMAG
##SYMBOL=    X,             R,               I
##VAR_TYPE=  INDEPENDENT,   DEPENDENT,       DEPENDENT
##VAR_FORM=  AFFN,          ASDF,            ASDF
##VAR_DIM=   32768,         32768,           32768
##UNITS=     HZ,            ARBITRARY UNITS, ARBITRARY UNITS
##FACTOR=    0.157963299565203, 1,           1
##FIRST=     4132.6476996994, 0,             0
##LAST=      -1043.33573715361, 0,           0
##MIN=       -1043.33573715361, -96266,      0
##MAX=       4132.6476996994, 337957319,     0
$$ Real data points
##PAGE= N=1
##DATA TABLE= (X++(R..R)), XYDATA
$$ [...]
16596a6179l807O013q68j8167l1486j5397J6819M8542L2851J5836k7340n194L4413
$$ -16179 -19986 -13973 -14841 -33008 -64494 -79891 -63072 -14530 18321 34157 6817 1623 36036
16583C6036L726J364k8183j4220P353j3407q347r335j6220p927K1135j0806J0935
$$ 36036 39762 41126 12943 -1277 6076 -7331 -15678 -25013 -41233 -49160 -28025 -38831 -27896
16570b7896K1014k4968J068K9951N262j533o096K7554J3855l2067j6217K0883
$$ -27896 -6882 -31850 -30782 -831 4431 2898 -3198 24356 38211 6144 -10073 10810
16558A0810J4451M808m549j4273l465r494J4790m546m655m815K493L904K5932
$$ 10810 25261 30069 25520 11247 7782 -1712 13078 8532 3877 -938 1555 5459 31391
16545C1391N819j4958k6913q911j0998p199J4356K426J4037p047J271J4148j3401
$$ 31391 37210 22252 -4661 -13572 -24570 -31769 -17413 -14987 -950 -7997 -6726 7422 -5979
16532e979J6425J3531k3036n635q96j1164L516J1135j6115J3750J7596J3462N384
$$ -5979 10446 23977 941 -4694 -5590 -16754 -13238 -2103 -18218 -4468 13128 26590 31974
16519C1974q396O360r37m381j0060j8291p20P033J9918k7635j3526J8947J8912
$$ 31974 23578 29938 29001 24620 14560 -3731 -4451 2582 22500 -5135 -18661 286 19198
16506A9198p266J2313n640j1457M660j3116R591J0373j0133j9634K594j3279J6015
$$ 19198 11932 24245 18605 7148 11808 -1308 8283 18656 8523 -11111 -8517 -21796 -5781
16493e781J3438L392p076k447r23J1427L867J5167r682J646l2599q756J4890j3444
$$ -5781 7657 11049 3973 1526 603 12030 15897 31064 21382 23028 -9571 -18327 -3437 -16881
16479a6881j820J6076J6094K5574J095r448n412o609J6838j3330K1503L5402o224
$$ -16881 -18701 -2625 13469 39043 40138 30690 25278 18669 35507 22177 43680 79082 72858
16466G2858n0317j6790L277j5971R25J2707l917k0357j6824O285K1885N135L396
$$ 72858 22541 5751 9028 -6943 -6018 6689 2772 -17585 -34409 -28124 -6239 -1104 2292
16453B292K50l5541j513R382J2887r65m0789p731L4010K6245p274j7787M623J7690
$$ 2292 2542 -32999 -34512 -25130 -12243 -13208 -53997 -61728 -27718 -1473 -8747 -26534 -21911 -4221
16439d221J7773k221j9083j1537j8169j8147K700q201l980J2543p524j1897l357
$$ -4221 13552 11331 -7752 -19289 -37458 -55605 -52905 -61106 -65086 -52543 -60067 -71964 -75321
16426g5321j1896M9659J1998j7010j429R828R95l735K8815J833K101J802J5131
$$ -75321 -87217 -37558 -25560 -42570 -43999 -34171 -33176 -36911 -8096 -6263 -4162 -2360 12771
16413A2771j668j4874K670K2339J0260j0949r988j5560j75R583J5615j697j0392
$$ 12771 11103 -3771 -1101 21238 31498 20549 10561 -4999 -5174 4409 20024 18327 7935
16400G935l1423k3783L04J1387J4490m3J0789l9164j7700J0724j0712o938J9040
$$ 7935 -23488 -47271 -46967 -35580 -21090 -21133 -10344 -49508 -67208 -56484 -67196 -74134 -55094
16387e5094O904J3982L6037m420J187j363r593J228j4043K08q671k6472l821M902
$$ -55094 -48190 -34208 1829 -2591 -1404 -2767 -12360 -11132 -25175 -24967 -33638 -60110 -63931 -59029
16373e9029J7704J1154m062j0254j4803R978J1159l61K0909M765P839J696j0329
$$ -59029 -41325 -30171 -34233 -44487 -59290 -49312 -38153 -38514 -17605 -12840 -5001 -3305 -13634
16360a3634l602r54J8424m964j8666O025m967J5354Q13M77j7920P909K0645j5299
$$ -13634 -17236 -18190 234 -4730 -23396 -17371 -22338 -6984 -6171 -5694 -23614 -15705 4940 -10359
16346a0359K3346J8003j691j2469m086q163k198m445l5263m151M3757j1055l9326
$$ -10359 12987 30990 29299 16830 12744 4581 2383 -2062 -37325 -41476 2281 -8774 -48100
16333d8100O477M193O306k303O668Q612K1418j3429m297M891j1523J0942M558
$$ -48100 -41623 -37430 -31124 -33427 -26759 -18147 3271 -10158 -14455 -9564 -21087 -10145 -5587
16320e587Q176J5658J6818Q091Q109l0417k8796j4918j4631j6150J8911K8854
$$ -5587 2589 18247 35065 43156 51265 20848 -7948 -22866 -37497 -53647 -34736 -5882
16308e882K6732M515M725j658p632l9496j8522o092k308K1026K9508L6912R107
$$ -5882 20850 25365 30090 28432 20800 -18696 -37218 -43310 -45618 -24592 4916 41828 50935
16295E0935k1367k7254M948L80k178l517j2893j7961n727l107r881O760o73n268
$$ 50935 29568 2314 7262 7642 5464 1947 -10946 -28907 -34634 -37741 -47622 -40862 -41535 -46803
16281d6803O064J7416K1936k467J4065J259p739k4179r802n825M334q111P264
$$ -46803 -40739 -23323 -1387 -3854 10211 11470 3731 -20448 -30250 -36075 -31741 -39852 -32588
16268c2588R78k1748Q362k119N404K7548L0362n911r596l218l9006J060R647J9237
$$ -32588 -31610 -53358 -44996 -47115 -41711 -14163 16199 10288 692 -2526 -41532 -40472 -30825 -11588
16254a1588q656j3243J1719J8133J1369o08j8781n218K010k4831O25J8591K450
$$ -11588 -20244 -33487 -21768 -3635 7734 7126 -11655 -16873 -14863 -39694 -39069 -20478 -18028
16241a8028J7766L805j3896k3626l751K1135n976k2766J9025J8122K0402N9r084
$$ -18028 -262 3543 -10353 -33979 -37730 -16595 -22571 -45337 -26312 -8190 12212 12271 3187
16228C187L4181J5083k2411j0829N733n047k7909j5478p404Q840J161J9451p058
$$ 3187 37368 52451 30040 19211 24944 19897 -8012 -23490 -30894 -22054 -20893 -1442 -8500
16215h500l7116K990K226J039J2355J4459K2408q608j0306j2543p483m528L4983
$$ -8500 -45616 -42626 -40400 -39361 -27006 -12547 9861 1253 -9053 -21596 -29079 -33607 1376
16202A376J1367k8541p019l70n863J0245J7622k4614K295k22J4126P517j8499
$$ 1376 12743 -15798 -22817 -23187 -29050 -18805 -1183 -25797 -23502 -23724 -9598 -2081 -20580
16189b0580K6035k720j5617n629k177L3885j095k2026j2220N888j5090j1801K2798
$$ -20580 5455 2735 -12882 -18511 -20688 13197 12102 -9924 -22144 -16256 -31346 -43147 -20349
16176b0349L8503k675k1536m391q124J8583Q586k4336J866Q107m921j2601q979
$$ -20349 18154 15479 -6057 -10448 -18572 11 8597 -15739 -13873 -5766 -10687 -23288 -32267
16163c2267P903Q932O712j1415R85j3666k729L795P460K3605M3279p185k2435
$$ -32267 -24364 -15432 -8720 -20135 -19150 -32816 -35545 -31750 -24290 -685 42594 35409 12974
16150A2974k574j8782M165j1462n420M274O770J1731l34o483l108J7055m463j7552
$$ 12974 10400 -8382 -4217 -15679 -21099 -16825 -10055 1676 1342 -5141 -8249 8806 4343 -13209
16136a3209o419J7434k400j0148J9637M46K1279K6235l605l2802o717O902k9505
$$ -13209 -19628 -2194 -4594 -14742 4895 5341 26620 52855 49250 16448 9731 16633 -12872
16123a2872q484m392R232N460q532L0152P027L45j3985J596j6258k9962J3914
$$ -12872 -21356 -25748 -16516 -11056 -19588 10564 17591 17936 3951 5547 -10711 -40673 -26759
16110b6759K9039j3446J724J8417Q803j9765j7362j2378K778j3382L418L4618
$$ -26759 2280 -11166 -9442 8975 17778 -1987 -19349 -31727 -28949 -42331 -38913 -4295
16098d295J8220j4023J3753J183k5402k4269R216P653m778J6737K2091K184Q861
$$ -4295 13925 -98 13655 14838 -10564 -34833 -25617 -17964 -22742 -6005 16086 18270 27131
16085B7131j7587J878j697q054P144K716k5939l1047O434K2452L2340o822j3374
$$ 27131 9544 11422 9725 1671 8815 11531 -14408 -45455 -39021 -16569 15771 8949 -4425
16072d425N155m906P25J1988j0983k7911J0925J9318j7132k526j610J3168R760
$$ -4425 730 -4176 -3451 8537 -2446 -30357 -19432 -114 -17246 -19772 -21382 -8214 1546
16059A546J3748N482P00M645k2884j296J0445j3138J0339J3246j9024k3369J2807
$$ 1546 15294 20776 21476 26121 3237 1941 12386 -752 9587 22833 3809 -19560 -6753
16046f753J434J2692J9976K101L450K381k1330K0102L018p630j0917O648K9719
$$ -6753 -5319 7373 27349 29450 32900 35281 13951 34053 37071 29441 18524 25172 54891
16033E4891l844l733r962q102k4076j4343P801J1359K1386P002j0882J2015n018
$$ 54891 51047 47314 37352 29250 5174 -9169 -1368 9991 31377 38379 27497 39512 34494
16020C4494j6922n1909o087j189J0065L4181J1975o438k0746j8724m94n315J5083
$$ 34494 17572 -34337 -40424 -41613 -31548 2633 14608 8170 -12576 -31300 -31794 -37109 -22026
16007b2026k2529k838K7306J9316K1587J3005j95k8287k1128Q788l907O070o243
$$ -22026 -44555 -47393 -20087 -771 20816 33821 33626 5339 -15789 -7001 -10908 -4838 -11081
15994a1081K0038J7520p76j5971M094j5008n311m590R378j0129n697n594j4379
$$ -11081 8957 26477 25701 9730 13824 -1184 -6495 -11085 -1707 -11836 -17533 -23127 -37506
15981c7506k002J2799j6695l746J3044k2523J5950K5735L258j338j2204L420K6334
$$ -37506 -39508 -26709 -43404 -47150 -34106 -56629 -40679 -14944 -11686 -13024 -25228 -21808 4526
15968D526k9804k6038L6359K0058M12j3486j0765r111q026M1296J6756K2209k2020
$$ 4526 -25278 -51316 -14957 5101 5513 -7973 -18738 -27849 -35875 5421 22177 44386 22366
15955B2366k5153j7425R355j7359M326O568K3006J4185m4215l9781p923J0004
$$ 22366 -2787 -20212 -10857 -28216 -23890 -17322 5684 19869 -24346 -64127 -72050 -62046
15943f2046M4606K4516j2495J3977J2344J9903k8895m9035K704j0648r606M86
$$ -62046 -17440 7076 -5419 8558 20902 40805 11910 -37125 -34421 -45069 -54675 -54189
15931e4189K8854n037O806J9322q65l458L195p273J4464L5070l005k7128n518
$$ -54189 -25335 -30372 -23566 -4244 -5109 -8567 -5372 -12645 1819 36889 33884 6756 1238
15918A238n259j0791j2502n816J2615L397R37K2100J1391j4511n435m618j997
$$ 1238 -4021 -14812 -27314 -33130 -20515 -17118 -16181 5919 17310 2799 -2636 -7254 -9251
15905i251j9194q577J9954j830j3688N664K4352K9113l1886j4654l130R255K2592
$$ -9251 -28445 -37022 -17068 -18898 -32586 -26922 -2570 26543 -5343 -19997 -23127 -13872 8720
15892H720r47K4961J0581j0628k1924L2090J7410j7314n4096k0067K595J1362
$$ 8720 7773 32734 43315 32687 10763 42853 60263 42949 -11147 -31214 -28619 -17257
15880a7257O267j4090J119l531M0748K0123l012k1250m874p001J3425P805N478
$$ -17257 -10990 -25080 -23961 -27492 13256 33379 30367 9117 4243 -2758 10667 18472 23950
15867B3950j5896q519J0723k1936m887K7677K6430j5296j8438p092j908j0462
$$ 23950 8054 -465 10258 -11678 -16565 11112 37542 22246 3808 -3284 -5192 -15654
15855a5654M630j452k524J6774N396j6440J5925K2852j2101l3832O495K2400n564
$$ -15654 -11024 -12476 -15000 1774 7170 -9270 6655 29507 17406 -16426 -9931 12469 6905
15842F905m922n261m959j9775l486J2431j942Q467p640m924k3515O795M0285k459
$$ 6905 1983 -3278 -8237 -28012 -31498 -19067 -21009 -12542 -20182 -25106 -48621 -41826 -1541 -4000
15828d000k7388j9632M9725J1557o347k0106j328m223N261L709n789K1216j8563
$$ -4000 -31388 -51020 -1295 10262 3915 -16191 -17519 -21742 -16481 -12772 -18561 2655 -15908
15815a5908j0261M793O790j1646j3426L0616j9975k8682J763K2072J8391j8743
$$ -15908 -26169 -21376 -14586 -26232 -39658 -9042 -29017 -57699 -55936 -33864 -15473 -34216
15803c4216L269l081J7780K4902k8243j272j2567j7066J6092K8169L097N991r04
$$ -34216 -30947 -34028 -16248 8654 -19589 -20861 -33428 -50494 -34402 -6233 -3136 2855 1951
15790A951j8039K0444R796J1665M0319K281r571l0820k4982o509J3461k5347j400
$$ 1951 -16088 4356 14152 25817 66136 68417 58846 28026 3044 -3465 9996 -15351 -16751
15777a6751K885j1201J3700J1296K818J197j6216M019O824k0615j035J8294J035
$$ -16751 -13866 -25067 -11367 -71 2747 3944 -12272 -8253 -1429 -22044 -23079 -4785 -3750
15764c750R559J7258r879Q308J7583j0448o622o434j9093j1680p770j7096P396
$$ -3750 5809 23067 13188 21496 39079 28631 22009 15575 -3518 -15198 -22968 -40064 -32668
15751c2668L5479j1343k0501n704J3967n415l3961r237J8402J6162J2268P735
$$ -32668 2811 -8532 -29033 -34737 -20770 -26185 -60146 -69383 -50981 -34819 -22551 -14816
15739a4816K6466J3954k103l8913J702K858j2976N358K8515J1357k2603j6619
$$ -14816 11650 25604 23501 -15412 -13710 -10852 -23828 -18470 10045 21402 -1201 -17820
15727a7820q943J7466k404n09j5137K7850K0581K0867m12k4331l6557k4002K2928
$$ -17820 -26763 -9297 -11701 -12210 -27347 503 21084 41951 41539 17208 -19349 -43351 -20423
15714b0423J4453k5758n389J5090J2202J2505M543k3856k1395L023O705P710j5359
$$ -20423 -5970 -31728 -37117 -22027 -9825 2680 7223 -16633 -38028 -35005 -28300 -20590 -35949
15701c5949K2993K5959n481j2150p329L5621j667k934J4600J1137J3404k9249
$$ -35949 -12956 13003 7522 -4628 -11957 23664 21997 19063 33663 44800 58204 28955
15689B8955j8442k67j2708k6645O118J5208k5565k011J668j3822K2607L2561J6295
$$ 28955 10513 10246 -2462 -29107 -22989 -7781 -33346 -35357 -33689 -47511 -24904 7657 23952
15676B3952k4437p186J8780J1046p676j7771j0137m298p22J8374p020k2489k7184
$$ 23952 -485 -7671 11109 22155 14479 -3292 -13429 -17727 -18449 -75 -7095 -29584 -56768
15663e6768j1282N544k04P904j95J5020J3159J7979m938J0599K3089j207M742
$$ -56768 -68050 -62506 -62710 -54806 -55001 -39981 -26822 -8843 -13781 -3182 19907 18700 23442
15650B3442l693l7539j5947j4436N354M1515K1235R103J2035j3202N285P886J7223
$$ 23442 19749 -17790 -33737 -48173 -42819 -1304 19931 29034 41069 27867 33152 41038 58261
15637E8261k0751m4396j7221J6978J9226j2397j1842O048j8796q120J2128k292
$$ 58261 37510 -6886 -24107 -7129 12097 -300 -12142 -6094 -24890 -33010 -20882 -23174
15625b3174j449J1292k1166L325K7424Q673M004j7402O67k5187j1350K2948L5548
$$ -23174 -24623 -13331 -34497 -31172 -3748 4925 8929 -8473 -7806 -32993 -44343 -21395 14153
15612A4153J8562k0199q519n1609k4590J4416K2797R532m1508N405J9932J8269
$$ 14153 32715 12516 3997 -47612 -72202 -57786 -34989 -25457 -66965 -61560 -41628 -23359
15600b3359L4185K3689k691m038q220L584J3720j3997l8380k5596o59l091M5720
$$ -23359 10826 34515 31824 27786 19566 23150 36870 22873 -15507 -41103 -41762 -44853 867
15587H67J4749o500L533J477p544l4301J532K8094J1851K7l6004l5420j9585P133
$$ 867 15616 9116 12649 14126 6582 -27719 -26187 1907 13758 13785 -22219 -57639 -77224 -70091
15573g0091K9816L5696N040P658p034j7209N70J2350J873k4474r387n577p688
$$ -70091 -40275 -4579 461 8119 1085 -16124 -15554 -3204 -1331 -25805 -35192 -40769 -48457
15560d8457K4957J5183L034k5246k2283L344K2345K5140j3765m889K6145J019
$$ -48457 -23500 -8317 -5283 -30529 -52812 -49468 -27123 -1983 -15748 -20637 5508 6527
15548F527j4198K4603K62j4149J0515O842J9586l316k138j7341k1993J8324K392
$$ 6527 -7671 16932 17194 3045 13560 20402 39988 36672 34534 17193 -4800 13524 15916
15535A5916j3073n427j6513J3186J2794j5277K430O505N469l1627j9884J8472
$$ 15916 2843 -2584 -19097 -5911 6883 -8394 -5964 541 6010 -25617 -45501 -27029
15523b7029J4876J2118p157j102J8766L0389j096k8773m5933P627J1332K4498
$$ -27029 -12153 -35 -7192 -8294 10472 40861 39765 10992 -34941 -27314 -15982 8516
15511H516q125k379L0488O246j4409k0554k1571j9400K0602K256J0153O79j3650
$$ 8516 391 -1988 28500 34746 20337 -217 -21788 -41188 -20586 -18330 -8177 -7498 -21148
15498b1148J0720j5113O789J99m422o298M1627J8966j3761r874j5739J672J0405
$$ -21148 -10428 -25541 -18752 -18553 -22975 -29273 12354 31320 17559 7685 -8054 -6382 4023
15485D023j8755Q67J9999J3518j1472k2621j1717o827k2032M365L9048M7755J8246
$$ 4023 -14732 -13865 6134 19652 8180 -14441 -26158 -32985 -55017 -50652 -11604 36151 54397
15472E4397K56j9957q534n654j328k2909n512K3994p429o989j6715j8058N624
$$ 54397 54653 34696 26162 20508 19180 -3729 -9241 14753 7324 335 -16380 -34438 -28814
15459b8814J3625Q908n459j517J0265K7733J165j6973m825p862l1069J6973K1458
$$ -28814 -15189 -6281 -11740 -13257 -2992 24741 25906 8933 4108 -3754 -34823 -17850 3608
15446C608K4874o363k1657j1995J5618o518q0M187M868l154j0671j940L9469q009
$$ 3608 28482 22119 462 -11533 4085 -2433 -2513 1674 6542 3388 -7283 -9223 30246 22237
15432B2237k4980k550l079k1389K5235L4900K9181k5837r375j5423k9359K2596
$$ 22237 -2743 -5293 -8372 -29761 -4526 30374 59555 33718 24343 8920 -20439 2157
15420B157j027q455l559p17l3259l319J767K3987J6682j0194J4580N000P60l907
$$ 2157 1130 -7325 -10884 -11601 -44860 -48179 -46412 -22425 -5743 -15937 -1357 3643 4403 496
15406D96j5137J5396m799j9076j6172L958K9658J4747L583k4625k195n775J1241
$$ 496 -14641 755 -4044 -23120 -39292 -35334 -5676 9071 12654 -11971 -14166 -19941 -8700
15393h700q851j6659j5250j9574K7917K8422J183j9953J5845K0560J0244n555
$$ -8700 -17551 -34210 -49460 -69034 -41117 -12695 -11512 -31465 -15620 4940 15184 9629
15381I629Q937j7580j6004P987q397R439R395l9874M851L2108J2269j2565J3032
$$ 9629 18566 986 -15018 -7031 -15428 -5989 3406 -36468 -31617 491 12760 195 13227
15368A3227k8439m691K1022M526o273j8435N744L1030J5683l875q913J0644l2435
$$ 13227 -15212 -19903 1119 5645 -628 -19063 -13319 17711 33394 29519 20606 31250 -1185
15355a185j2189L835p558K719M051j1405K2488K14R054L0030K5048J3786Q580
$$ -1185 -13374 -9539 -17097 -14378 -10327 -21732 756 970 10024 40054 65102 78888 87468
15342H7468k3372k7655n897m5766k5114j2898n188J1Q173J8846J2793P973l867
$$ 87468 64096 36441 30544 -15222 -40336 -53234 -58422 -58411 -50238 -31392 -18599 -10626 -14493
15329a4493Q123Q073M910J3894J569P792r577k3902j0138M623l694L123Q587j5593
$$ -14493 -6370 1703 6613 20507 22076 29868 20291 -3611 -13749 -9126 -12820 -9697 -1110 -16703
15315a6703m249J8812O42l5489j154L070J1120O988j4864J6107L015q795Q600
$$ -16703 -20952 -2140 -1498 -36987 -38141 -35071 -23951 -16963 -31827 -15720 -12705 -21500 -12900
15302a2900j627j1946J4289K0097l1175q547K827K1715O132m577n115L0349j13
$$ -12900 -14527 -26473 -12184 7913 -23262 -31809 -28982 -7267 -1135 -5712 -10827 19522 19409
15289A9409j5740k4895j1276P220M5542K754l147J1104k0902q723q625J6327j0944
$$ 19409 3669 -21226 -32502 -25282 20260 23014 19867 30971 10069 1346 -7279 9048 -1896
15276a896j0869J2816J7956J5438l6741k8942j3541n303L7831J2897N42j264r701
$$ -1896 -12765 51 18007 33445 -3296 -32238 -45779 -51082 -13251 -354 188 -1076 -10777
15263a0777j8503j6898j3801J7123K3775j5936J0331m101L357j2565j6710p720
$$ -10777 -29280 -46178 -59979 -42856 -19081 -35017 -24686 -28787 -25430 -37995 -54705 -62425
15251f2425J8921K3615j2503p386L4724K7830l2793j0254m767Q260L772n311K478
$$ -62425 -43504 -19889 -32392 -39778 -5054 22776 -10017 -20271 -25038 -16778 -13006 -18317 -15839
15238a5839L0363P761L420q49O540J3965J8117k2882l9998K691j549k4920J6833
$$ -15839 14524 22285 25705 24856 31396 45361 63478 40596 598 3289 1740 -23180 -6347
15225f347N7101J693l6714j1687J0340o91j364k1458k9407j9515l928K589J1575
$$ -6347 50754 52447 15733 4046 14386 13695 12331 -9127 -38534 -58049 -61977 -59388 -47813
15212d7813o337k0060K2399J9850N31j0852j3732j5214M917M497J1432M67P936
$$ -47813 -54150 -74210 -51811 -31961 -31430 -42282 -56014 -71228 -66311 -61814 -50382 -49915 -41979
15199d1979L1606m215J8338k735l7961k3731m304L2247L0711O37j1196p314m875
$$ -41979 -10373 -14588 3750 1015 -36946 -60677 -64981 -32734 -2023 -1386 -12582 -19896 -24771
15186b4771J6204K103o551J308j2120q530J6962J0572J2287m656k3313K4060Q597
$$ -24771 -8567 -6464 -13015 -11707 -23827 -32357 -15395 -4823 7464 2808 -20505 3555 12152
15173A2152j538K1315P40l1106k7563J619m4864J9061J3526R740L304N448j6152
$$ 12152 10614 31929 32669 1563 -26000 -24381 -69245 -50184 -36658 -26918 -23614 -18166 -34318
15160c4318r691J1690J3607K2315Q498M311j4814k6263M480j158j6625p769L3613
$$ -34318 -44009 -32319 -18712 3603 12101 16412 1598 -24665 -20185 -21343 -37968 -45737 -12124
15147a2124K1385J1915K3172k5915k3142R857K6830j278m732K33J6578m2465k8863
$$ -12124 9261 21176 44348 18433 -4709 5148 31978 30700 25968 26201 42779 314 -28549
15134b8549J5321J0546M106N114K472K4196J4347k2675k2678J2534O940j4226
$$ -28549 -13228 -2682 1424 6538 9010 33206 47553 24878 2200 14734 21674 7448
15122G448J4289j8235k7921N466J559K1803N166k429k829J551m829n004L382K019
$$ 7448 21737 3502 -24419 -18953 -17394 4409 9575 7146 4317 5868 1039 -3965 -583 1436
15108A436L3567j1730j6507j3787n709J0197J2062l653m960M020J5774j2971j4996
$$ 1436 35003 23273 6766 -7021 -12730 -2533 9529 5876 916 4936 20710 7739 -7257
15095g257O956n541j4951k311j8999o188p142j470J665j2199o682J9732M4527
$$ -7257 -301 -5842 -20793 -23104 -42103 -48291 -55433 -56903 -55238 -67437 -74119 -54387 -9860
15082i860M684J63o378J9903q387q24R516P869M979k0921j5354j4990k106j1296
$$ -9860 -5176 -5013 -11391 8512 125 -699 8817 16686 21665 744 -14610 -29600 -31706 -43002
15068d3002J1260K4839K4914J1940N118J4992p115l1960r710N179J555o292J742
$$ -43002 -31742 -6903 18011 29951 35069 50061 42946 10986 1276 6455 8010 1718 3460
15055C460M300l327q210J5064L1251j3286M533r79l3983R210L0248j057k5596
$$ 3460 7760 4433 -3777 11287 42538 29252 33785 32806 -1177 8033 38281 37224 11628
15042A1628j3397j1009k3058R427J5501j3171o979J6705K9470k4248k3485J3248
$$ 11628 -1769 -12778 -35836 -26409 -10908 -24079 -31058 -14353 15117 -9131 -32616 -19368
15030a9368j2404j0878k2285P242J7542L2142N567j7982Q064J4644r058R122O179
$$ -19368 -31772 -42650 -64935 -57693 -40151 -8009 -2442 -20424 -12360 2284 -6774 2348 8527
15017H527q647J654Q800J8116k77k8072r439j0724m722K349K001L2930q40k1213
$$ 8527 -120 1534 10334 28450 28173 101 -9338 -20062 -24784 -22435 -20434 12496 11656 -9557
15003i557j0387R338j4267j5320L0688n137o15P120j435j4125o551K6047Q695
$$ -9557 -19944 -10606 -24873 -40193 -9505 -14642 -15257 -8137 -9572 -23697 -30248 -4201 4494
14990D494l2201J0077J6937K7263J1256J0059l4591l6738O784J1526r372L965
$$ 4494 -27707 -17630 -693 26570 37826 47885 13294 -23444 -16660 -5134 -14506 -10541
14978a0541l340l455n132J9572m447J4297M861j7007n313r80j3734J5037K935
$$ -10541 -13881 -17336 -22468 -2896 -7343 6954 11815 -5192 -10505 -11485 -25219 -10182 -7247
14965g247M652k1583L0575J9535r501m093R710k365j1892J0676k5346P659o112
$$ -7247 -2595 -24178 6397 25932 16431 12338 22048 19683 7791 18467 -6879 780 -5332
14952e332k3679K5192K0282l2254K197K4620L0491K1547j9236k3553j7501k6819
$$ -5332 -29011 -3819 16463 -15791 -13594 11026 41517 63064 43828 20275 2774 -24045
14940b4045k6688O455K2319K7674o232J5042K4742N344J494j3145j2953j5516
$$ -24045 -50733 -44278 -21959 5715 -517 14525 39267 44611 46105 32960 20007 4491
14928D491O654j6749m187K1054M1242J3506n890j6512k0634j3475q06J5263K2882
$$ 4491 11145 -5604 -9791 11263 52505 66011 60121 43609 22975 9500 8694 23957 46839
14915D6839j237m7247j6185O528j0539O329m97j4279N029J2115P258M667n735
$$ 46839 45602 -1645 -17830 -11302 -21841 -15512 -16009 -30288 -25259 -13144 -5886 -1219 -6954
14902f954j5751K5302p468J0022J4259R84O85J0767q866m750J3178k4704l8054
$$ -6954 -22705 2597 -4871 5151 19410 20394 21079 31846 22980 18230 31408 6704 -31350
14889c1350r187K165J6780L3797n839j5525j2864K432L4613N282j6667l566J6750
$$ -31350 -40537 -38372 -21592 12205 6366 -9159 -22023 -19591 15022 20304 3637 71 16821
14876A6821L3459k363k5268K974R266j2633j6507k7012j3466K6605J9468k1142
$$ 16821 50280 47917 22649 25623 34889 22256 5749 -21263 -34729 -8124 11344 -9798
14864i798K1734O731p48K1898J0965k6929j6203j9541r192n165k173l521J5203
$$ -9798 11936 18667 17919 39817 50782 23853 7650 -11891 -21083 -26248 -28421 -31942 -16739
14851a6739L4233J8537o392l1781r077L223j2868J1029J7903R772K26q627k1579
$$ -16739 17494 36031 29639 -2142 -11219 -7996 -20864 -9835 8068 17840 18066 9439 -12140
14838a2140j543P744J4875R442M827l981k5246j6427K4423J6627q130n086l6182
$$ -12140 -13683 -5939 8936 18378 23205 19224 -6022 -22449 1974 18601 10471 5385 -30797
14825c0797P046L3761M98N089m62q018j5040J7942L277J4598N346m33J4013j6384
$$ -30797 -23751 10010 10508 15597 15135 7117 -7923 10019 13296 27894 33240 32807 46820 30436
14811C0436m4225l0711J6765K6873l300n784j683N798o05P511O364r818O814n278
$$ 30436 -13789 -44500 -27735 -862 -4162 -9946 -11629 -5831 -6436 1075 7439 -2379 4435 -843
14797h43m663J4631J0998J5487k696p670j5856j0125j2106K918M277J8616m860
$$ -843 -5506 9125 20123 35610 32914 25244 9388 -737 -12843 -9925 -5648 12968 8108
14784H108k056K4663O836k3726k6022j7402p923Q094J5184J7523l779J2201L445
$$ 8108 6052 30715 37551 13825 -12197 -29599 -37522 -29428 -14244 3279 -500 11701 15146
14771A5146j5422R488q457o054Q317J2041M293m029R344r073k7713k4991q469
$$ 15146 -276 9212 755 -5299 3018 15059 19352 15323 24667 15594 -12119 -37110 -45579
14758d5579j3302j3679N623K124J7848J6075K2585m67k1415k8729K382K1974J5160
$$ -45579 -58881 -72560 -66937 -64813 -46965 -30890 -8305 -8772 -30187 -58916 -56534 -34560 -19400
14745a9400k7744o910L6988J0696J3095m591l7749J6173J9926L0912q667l3788
$$ -19400 -47144 -54054 -17066 -6370 6725 2134 -35615 -19442 484 31396 22729 -11059
14733a1059N0J3425j192m670J7324K7942p524k9375j9542j4197J7025O144j655
$$ -11059 -11009 2416 1224 -3446 13878 41820 34296 4921 -14621 -28818 -11793 -5649 -7304
14720g304j6998J7687O655j9818J6015j1289J4246L9545J1375j4847l551o001
$$ -7304 -24302 -6615 40 -19778 -3763 -15052 -806 38739 50114 35267 31716 25715
14708B5715k3704K6169j7246J4996J692k238J4369j8967k4504j4655K939L2857
$$ 25715 2011 28180 10934 25930 27622 25384 39753 20786 -3718 -18373 -15434 17423
14696A7423J5j091K1117K848r428j033q406j5160N948J2843j4817J0287o594j4192
$$ 17423 17438 16347 37464 40312 30884 29851 21445 6285 12233 25076 10259 20546 13952 -240
14682b40K0219q32p555j7139j1540j7128J9771K5956Q152j5133j3468k670r14
$$ -240 19979 19147 11592 -5547 -17087 -34215 -14444 11512 19664 4531 -8937 -11607 -12521
14669a2521j3448P357L7929K5319k1914k0824J5546K4828K171k2695l7036J7962
$$ -12521 -25969 -18612 19317 44636 22722 1898 17444 42272 44443 21748 -15288 2674
14657B674J5437N783L0330Q707k4209p357K0827o952k264l795J4166j801j8930
$$ 2674 18111 23894 54224 62931 38722 31365 52192 45240 42976 39181 53347 51546 32616
14644C2616K734J4999k406k6796k3168M4778K2751p099j0773J5800m36J577p642
$$ 32616 35350 50349 47943 21147 -2021 42757 65508 58409 47636 63436 63000 64577 56935
14631E6935l9074J280m264J7442J0030k226J1610j4760j0656m961L5250K3728
$$ 56935 17861 19141 14877 32319 42349 40123 51733 36973 26317 21356 56606 80334
14619H0334l3763m033j2314p171J3743J3668K4197J4176M31m852N115J5097p666
$$ 80334 46571 42538 30224 23053 36796 50464 74661 88837 89268 84416 89531 104628 96962
14606I6962j961J474l2823k8432j321L0685J3147j7973j4455n660J4918k2953
$$ 96962 95001 96475 63652 35220 33899 64584 77731 59758 45303 39643 54561 31608
14594C1608l523K3598J3154N106R668r186l081K782j4059M176j4363M760k3370
$$ 31608 28085 51683 64837 69943 79611 70425 67344 70126 56067 60243 45880 50640 27270
14581B7270j9174J0340k744j9352L0808K9456q79J5330N01l9905P338j3881K3715
$$ 27270 8096 18436 15692 -3660 27148 56604 55725 71055 71556 31651 38989 25108 48823
14568D8823K2344o756k7582k8110o518R630j9809M758o828n18M5347K2813n392
$$ 48823 71167 64411 36829 8719 2201 11831 -7978 -3220 -10048 -10566 34781 57594 52202
14555E2202j1139K0014k3322l8984j8083n250Q112P119J4311K8189j1359L302
$$ 52202 41063 61077 37755 -1229 -19312 -24562 -16450 -9331 4980 33169 21810 25112
14543B5112K420P69K2557n235l6396n282J1148K848Q695J888j9630l9186K892
$$ 25112 27532 28301 50858 45623 9227 3945 15093 17941 26636 28524 8894 -30292 -27400
14530b7400J5152j1225p944P470J1216J5262j6026J0329L1834l348m248J3022
$$ -27400 -12248 -23473 -31417 -23947 -12731 2531 -13495 -3166 28668 25320 21072 34094
14518C4094q15j5011n717j0374J7666m297j6153L871O922k7098j5996m177J3054
$$ 34094 33279 18268 12551 2177 19843 15546 -607 3264 10186 -16912 -32908 -37085 -24031
14505b4031J5014j355j2607J7083K6554K7757j8549k4485J2205R679K77k2370
$$ -24031 -9017 -10372 -22979 -5896 20658 48415 29866 5381 17586 27265 27542 5172
14493E172q689r678J3774N287J2107j3244k4983m79j8596j1059k0641R666K6634
$$ 5172 -3517 -13195 579 5866 17973 4729 -20254 -20733 -39329 -50388 -71029 -61363 -34729
14480c4729J2952J0622M204Q2k0207k0494R456L2091j338M177L790j2906L363
$$ -34729 -21777 -11155 -6951 -6869 -27076 -47570 -38114 -6023 -7361 -3184 606 -12300 -8937
14467h937j0241N162k670P239j8552J677K803J3424l774J7189O591q206k920J4474
$$ -8937 -19178 -14016 -16686 -9447 -27999 -26322 -23519 -10095 -13869 3320 9911 1705 -1215 13259
14453A3259J7782Q753j7178j6138k839J7857j3310j016n357j7007K3580M540l82
$$ 13259 31041 39794 22616 6478 3639 21496 8186 7170 1813 -15194 8386 12926 12544
14440A2544j3534j2683M3885J1252j8138j9395j1645J5985P228m329j4266l018
$$ 12544 -990 -13673 30212 41464 23326 3931 -7714 8271 15499 11170 -3096 -6114
14428f114K5131J8505j0604l1615M403K5891R787K492l055p056j0345o450k4454
$$ -6114 19017 37522 26918 -4697 -294 25597 35384 37876 34821 27765 17420 10970 -13484
14415a3484N18O841P748q455l1596j7955L611J763O135K8511K4790o768k4268
$$ -13484 -12966 -6125 1623 -6832 -38428 -56383 -52772 -51009 -44874 -16363 8427 1659 -22609
14402b2609r600K2575J2914J9722j945m878j5910k1791k368K3833R070m703j4714
$$ -22609 -32209 -9634 3280 23002 21057 16179 269 -21522 -23890 -57 9013 4310 -10404
14389a0404R32M5126J2840j0368j6353j4983j7687k819K7758p806J7681n480o939
$$ -10404 -9472 35654 48494 38126 21773 6790 -10897 -13716 14042 6236 23917 18437 11498
14376A1498J0623J6175j5492J5778n433j2463J7050j7781l0957j1485J3039J921
$$ 11498 22121 38296 22804 38582 33149 20686 37736 19955 -11002 -22487 -9448 -7527
14364g527M746Q102r780J3931N742j0158l2949j0511K9731K6334P604k4264j4347
$$ -7527 -2781 5321 -4459 9472 15214 5056 -27893 -38404 -8673 17661 25265 1001 -13346
14351a3346J0436J933j7967P189L8881J0550l953o473j6138l4574k1528r306J4743
$$ -13346 -2910 -977 -18944 -11755 27126 37676 33723 27250 11112 -23462 -44990 -54296 -39553
14338c9553L9212L683l0729k0207J6762L0925m983J571J0766j7065j1578l613
$$ -39553 -341 3342 -27387 -47594 -30832 93 -4890 -3319 7447 -9618 -21196 -24809
14326b4809J0978K800L6131K3061j7400j129j4408k3559p225m177R341J4756K746
$$ -24809 -13831 -11031 25100 48161 30761 29632 15224 -8335 -15560 -19737 -10396 4360 7106
14313G106J0701k13k4643l0938k1888J0988J5388J1187j4838J2326M4205p33j7769
$$ 7106 17807 17594 -7049 -37987 -59875 -48887 -33499 -22312 -37150 -24824 19381 18648 879
14300H79K1903J3381m971k0879l0878p381J4690R454L224L472J4073J2504J503
$$ 879 22782 36163 31192 10313 -20565 -27946 -13256 -3802 -578 2894 16967 29471 30974
14287C0974o365k1897n880J3168j3634n957K3607J0250l1716k3792r224N98R832
$$ 30974 24609 2712 -3168 10000 -3634 -9591 14016 24266 -7450 -31242 -40466 -39868 -30036
14274c0036L4165K7637l215q471q07p057p588J1053j1225J0426J7864l767k5222
$$ -30036 4129 31766 28551 20080 19273 12216 4628 15681 4456 14882 32746 28979 3757
14261C757j4928j5108O393K2531j308K3652L649q772k2531K35j3865p816r51J4021
$$ 3757 -11171 -26279 -19886 2645 1337 24989 28638 19866 -2665 -2430 -16295 -24111 -25062 -11041
14247a1041k2210K9241J6780j3052k6211K624K4509K7224J4070j9817k8128n547
$$ -11041 -33251 -4010 12770 -282 -26493 -23869 640 27864 41934 22117 -6011 -11558
14235a1558L5510R35j1795k798k960q553R686R51j9768j4854P991r139J334J5582
$$ -11558 23952 24887 13092 10294 7334 -1219 8467 9418 -10350 -25204 -17213 -26352 -25018 -9436
14221i436K7170j4499o715J1842j5046l365q398J6894J1445l0561j0743K2821
$$ -9436 17734 3235 -3480 8362 -6684 -10049 -18447 -1553 9892 -20669 -31412 -8591
14209h591J9984L398k443j9957o887K727n536q075L2393j809J3859N599J7117
$$ -8591 11393 14791 12348 -7609 -14496 -11769 -17305 -25380 7013 5204 19063 24662 41779
14196D1779r68k0544k1541J2063J0282K810J2724l731j5400k4287j4305l852J1167
$$ 41779 40811 20267 -1274 10789 21071 23881 36605 32874 17474 -6813 -21118 -24970 -13803
14183a3803q22p550K986R622q301J2172K4382j694J8620o497k0577n286k2930
$$ -13803 -14625 -22175 -19189 -9567 -17868 -5696 18686 16992 35612 29115 8538 3252 -19678
14170a9678J8576J1855R155n818l7203l0814L607J1958j0349J4353j78M354k534
$$ -19678 -1102 10753 19908 14090 -23113 -53927 -50320 -38362 -48711 -34358 -34536 -30182 -32716
14157c2716l978J6379J5178K1807N59l02j0929k1050j7426l1988J096J2682P324
$$ -32716 -36694 -20315 -5137 16670 17229 16927 5998 -15052 -32478 -64466 -63370 -50688 -43364
14144d3364P787R491K1096R92j1504j6020J7294K6794J9303J7199P33J111j92
$$ -43364 -35577 -26086 -4990 -3998 -15502 -31522 -14228 12566 31869 49068 49801 50912 50720
14131E0720k5803M787O030j5189k0274l0448K0835J6634k7786p880K747K8472
$$ 50720 24917 29704 35734 20545 271 -30177 -9342 7292 -20494 -28374 -25627 2845
14119B845J474k8906J1228P055n227o727J1302J4316r023j2134K1866M5204o235
$$ 2845 4319 -24587 -13359 -6304 -11531 -18258 -6956 7360 -1663 -13797 8069 53273 47038
14106D7038r247l3063j5247N0019K3246j7529l1120J970K0627J5539J767o496
$$ 47038 37791 4728 -10519 39500 62746 45217 14097 16067 36694 52233 54000 47504
14094D7504J4815N03k7190k3147j4579J5339j4725R73J1187L198j5317j1835r610
$$ 47504 62319 62822 35632 12485 -2094 13245 -1480 -507 10680 13878 -1439 -13274 -22884
14081b2884J1005J8650J9563m569k7244m519K0529m352j7055o146j1335J3390
$$ -22884 -11879 6771 26334 21765 -5479 -9998 10531 6179 -10876 -17022 -28357 -14967
14069a4967L532K4785K0270R683N272q31k1920k1420p643J4843n186o511P115
$$ -14967 -11435 13350 33620 43303 48575 47744 25824 4404 -3239 11604 6418 -93 7022
14056G022j0528r553Q784J2079O981m914J1766l5212m296K8602k774n450q187
$$ 7022 -3506 -13059 -4275 7804 14785 9871 21637 -13575 -17871 10731 7957 2507 -5680
14043e680K0249J0548m377m3728l198j2788k2402K1920Q934K823L5639k441m0860
$$ -5680 14569 25117 20740 -22988 -26186 -38974 -61376 -39456 -30522 -27699 7940 5499 -35361
14030c5361j1432J3391L7743J8375k428l469Q480k3029r68j427q676J690J0847
$$ -35361 -46793 -33402 4341 22716 20288 16819 25299 2270 1302 -125 -8801 -7111 3736
14017C736q505R873K4800l4310k3083l4117j7232M0039K0423N231p504Q435j786
$$ 3736 -4769 5104 29904 -4406 -27489 -61606 -78838 -38799 -18376 -13145 -20649 -12214 -14000
14004a4000j1731K4186N0566P452O81q304j8919k4419k1842O794J8999p36j9657
$$ -14000 -25731 -1545 49021 56473 57154 48850 29931 5512 -16330 -9536 9463 8727 -10930
13991a0930J5556J2849j659k7593j9708j468K1949Q866K4689O542Q669L795R638
$$ -10930 4626 17475 15816 -11777 -31485 -32953 -11004 -2138 22551 29093 37762 41557 51195
13978E1195k4120p563K4150k593k6354n961k4873k2340J7064N667J2337J6255
$$ 51195 27075 19512 43662 41069 14715 8754 -16119 -38459 -21395 -15728 -3391 12864
13966A2864L877k6323J1145K3610n320p621j4516k7314J5332p399J7273K7189
$$ 12864 16741 -9582 1563 25173 19853 12232 -2284 -29598 -14266 -21665 -4392 22797
13954B2797M029L337k707L656n853J093j5668l9193j9263K5273L2339J540j3274
$$ 22797 26826 30163 27456 31112 25259 26352 10684 -28509 -47772 -22499 9840 11380 -1894
13941a894m963k2790r312J4890L5135p432j1662j4852r0R026k5163P709P422M908
$$ -1894 -6857 -29647 -38959 -24069 11066 3634 -8028 -22880 -22970 -13944 -39107 -31398 -23976 -19068
13927a9068k2143N482J0299n437J4170j399L227l624l43J0288J5617l441j81p058
$$ -19068 -41211 -35729 -25430 -30867 -16697 -18096 -14869 -18493 -18836 -8548 7069 3628 3447 -3611
13913c611l2503j8637J8572N514K1512R395L555l187N322N530l041p06k896k7556
$$ -3611 -36114 -54751 -36179 -30665 -9153 242 3797 610 5932 11462 8421 7715 4819 -22737
13899b2737K328Q514l152p213j592k652l7153P206K6625j5794j1828J150J3435
$$ -22737 -20409 -11895 -15047 -22260 -23852 -26504 -63657 -56451 -29826 -45620 -57448 -56298 -42863
13886d2863J1538m724O062J9968K0440k0199j4590n477L746J2952l767k2459l370
$$ -42863 -31325 -36049 -29987 -10019 10421 -9778 -24368 -29845 -26099 -13147 -16914 -39373 -42743
13873d2743J2320N821j9834O463L4659J3709j0670J2719J7071J0862k3408j3915
$$ -42743 -30423 -24602 -44436 -37973 -3314 10395 -275 12444 29515 40377 16969 3054
13861C054J0101k6053J439J1036j1669M016j0555k1618j7259J0416L6819J9564
$$ 3054 13155 -12898 -11459 -423 -12092 -8076 -18631 -40249 -57508 -47092 -10273 9291
13849I291j1114m170N843j3856K69K6123L9145R216j6442l9431l5021q657O516
$$ 9291 -1823 -5993 -150 -14006 -13737 12386 51531 60747 44305 4874 -30147 -38804 -32288
13836c2288L65J1812l429j3244R051J1127O319M168j5667j8922J9991J2980J8239
$$ -32288 -31923 -20111 -23540 -36784 -27733 -16606 -10287 -6119 -21786 -40708 -20717 -7737 10502
13823A0502J0343o781l244j1650j7336j4922L167J5110J9154Q894K3315J066k0935
$$ 10502 20845 14064 10820 -830 -18166 -33088 -29921 -14811 4343 13237 36552 37618 16683
13810A6683k0155J4955M052j0866j5386j410L217j6678K652J7539L4415j3051
$$ 16683 -3472 11483 15535 4669 -10717 -12127 -8910 -25588 -22936 -5397 29018 15967
13798A5967j9382L616j8025J0502R284M497r669Q150K685j1677M9J1120N648j5353
$$ 15967 -3415 201 -17824 -7322 1962 6459 -3210 4940 7625 -4052 -4003 7117 12765 -2588
13784b588k367J2498j1050Q10j157J6364K603k7300J427K586k0053j38q297o85
$$ -2588 -4955 7543 -3507 -2697 -3854 12510 15113 -12187 -10760 -8174 -28227 -28365 -36662 -37347
13770c7347K2461N872j7868M348j2969L860J3600L0699J2609k0201p780J6037
$$ -37347 -14886 -9014 -26882 -22534 -35503 -31643 -18043 12656 25265 5064 -2716 13321
13758A3321l5629k8521p610M2427J1735L852j0672k7490k8211k714j2560j4194
$$ 13321 -22308 -50829 -58439 -16012 -4277 -425 -11097 -38587 -66798 -69512 -82072 -96266
13746i6266R442J1444M1273K4257K617j9161K5632K1551k6023j3875J787K2761
$$ -96266 -86824 -75380 -34107 -9850 -7233 -26394 -762 20789 -5234 -19109 -17322 5439
13734E439J921j6522j9643J3096J987n524K1198m105k4192Q471L0190J3125j0851
$$ 5439 7360 -9162 -28805 -15709 -13722 -19246 1952 -2153 -26345 -17874 12316 25441 14590
13721A4590k4525Q58k749M572J3852K8571R506j3376M901R671k0378J9322R221
$$ 14590 -9935 -9077 -11826 -7254 6598 35169 44675 31299 36200 45871 25493 44815 54036
13708E4036q153j5454j4498M643J4879k0221k7037k1779j4546o405J3922K4924
$$ 54036 45883 30429 15931 20574 35453 15232 -11805 -33584 -48130 -54535 -40613 -15689
13696a5689J0376j4256o401P678K0439j4249n384Q609p03j1014L0802O922j4774
$$ -15689 -5313 -19569 -25970 -18292 2147 -12102 -17486 -8877 -9580 -20594 10208 17130 2356
13683B356J0978j2036n72J5456j1133j5733R87j0720j1166K444R144j8500N153
$$ 2356 13334 1298 726 16182 5049 -10684 -9697 -20417 -31583 -29139 -19995 -38495 -33342
13670c3342L9586m414j310J1882J6106o317l0598L20Q308K2184J2838J081j4294
$$ -33342 6244 1830 520 12402 28508 22191 -8407 -8087 221 22405 35243 36324 22030
13657B2030m1799P303l499p404k972j5666J0354J1274K2412J8315k450J4052l030
$$ 22030 -19769 -12466 -15965 -23369 -26341 -42007 -31653 -20379 2033 20348 17898 31950 28920
13644B8920l9925r372J5229r89j3121q946j7901K3307k704J6844J9795j4090j1008
$$ 28920 -11005 -20377 -5148 -6137 -19258 -28204 -46105 -22798 -25502 -8658 11137 -2953 -13961
13631a3961j1244M1435K7103k9169k0292l669o036P868J6368q338k8789k0872
$$ -13961 -25205 16230 43333 14164 -6128 -9797 -15833 -7965 8403 65 -28724 -49596
13619d9596r493J6332j0270K0053J664J5837O390J7031R231J0485J8362p355k1377
$$ -49596 -59089 -42757 -53027 -32974 -31310 -15473 -9083 7948 17179 27664 46026 38671 17294
13606A7294j3051j931N116J7304J1270j1892m580j9290k5456j232N987O368P638
$$ 17294 4243 2312 7428 24732 36002 24110 19530 240 -25216 -26448 -20461 -14093 -6455
13593f455J1666k7128l7758K0811K7017q677r30J6829L415k0659l821M125K1890
$$ -6455 5211 -21917 -59675 -38864 -11847 -20524 -21454 -4625 -1210 -21869 -25690 -21565 325
13580C25J7973Q153K1733k8869l4859j225j19K116J2999p207j4774k028J0730
$$ 325 18298 26451 48184 19315 -15544 -16769 -16888 -14772 -1773 -8980 -23754 -25782 -15052
13567a5052J4703J0071M114j6280m0433j1976N541o190j5108J9727K7364L3048
$$ -15052 -349 9722 13836 -2444 -42877 -54853 -49312 -55502 -70610 -50883 -23519 9529
13555I529N796j3975j6654o271J5948m489j6125R492K6439q44r691l769j0062
$$ 9529 15325 1350 -15304 -21575 -5627 -10116 -26241 -16749 9690 8846 -845 -4614 -14676
13542a4676K654K7397O846M01j1558l8129l2897o607J5459J5294J6964J0863K311
$$ -14676 -12022 15375 22221 22622 11064 -27065 -59962 -66569 -51110 -35816 -18852 -7989 -5678
13529e678o088K783k641n97J2594J4058L3538m704j954j3783l0067n331L656L1577
$$ -5678 -11766 -8983 -11624 -12221 373 14431 47969 43265 41311 27528 -2539 -7870 -4214 27363
13515B7363J855j5164Q874n8j3169J176j1613J5208J0976j1382P886O013J2362
$$ 27363 29218 14054 22928 22870 9701 10877 -736 14472 25448 14066 21952 27965 40327
13502D0327l70j7354K795k1556q834m967p384J8499J2780o929K440K6080L007
$$ 40327 39957 22603 25398 3842 -4992 -9959 -17343 1156 13936 7007 9447 35527 38534
13489C8534k8750L345k133l1211k375m447m970J9685k8318j075J5914N857k362
$$ 38534 9784 13129 10996 -20215 -22590 -27037 -32007 -12322 -40640 -41715 -25801 -19944 -22306
13476b2306m701k7473J889j0190N280L4048k147k6631k656L3053L4949k1082k0852
$$ -22306 -27007 -54480 -52591 -62781 -57501 -23453 -25600 -52231 -54887 -21834 13115 -7967 -28819
13463b8819r168o313L690J8428J1079J5944N366j862K1593o820k3789n421r274
$$ -28819 -37987 -44300 -40610 -22182 -11103 4841 10207 8345 29938 23118 -671 -6092 -15366
13450a5366J1895k3165l442J2195j3052J7821J0381L149k0979p340K8414k792
$$ -15366 -3471 -26636 -30078 -17883 -30935 -13114 -2733 416 -20563 -27903 511 -2281
13438b281j2412j0850K3340L002p64J778O925L349j3413k6444j2488P323K3799
$$ -2281 -14693 -25543 -2203 799 35 1813 8738 12087 -1326 -27770 -40258 -32935 -9136
13425i136k504n079K0469R028n804j0156k4308J2124j4481j9804J1172L4030K0019
$$ -9136 -11640 -16719 3750 12778 6974 -3182 -27490 -15366 -29847 -49651 -38479 -4449 15570
13412A5570k597o191j6052R560L6162j3863k8127j9563l92J1877O413K051q745
$$ 15570 12973 6782 -9270 290 36452 22589 -5538 -25101 -25493 -13616 -7203 -5152 -13897
13399a3897k6301N99K6665l158M760K2586J5911J3989m8483k2359K3359M28j0892
$$ -13897 -40198 -39599 -12934 -16092 -11332 11254 27165 41154 -7329 -29688 -6329 -5901 -16793
13386a6793p160n718j3439l857R873K7644M2551k8508j1775k0732o240L9600K6242
$$ -16793 -23953 -29671 -43110 -46967 -37094 -9450 33101 4593 -7182 -27914 -34154 5446 31688
13373C1688m065R671J097j9584j808N040j4031Q77k306J5406R282p548j0904l1020
$$ 31688 27623 37294 38391 18807 16999 22039 8008 8885 6579 21985 31267 23719 12815 -18205
13359a8205n836J1597J6750Q622Q411l572J2385j7426Q5k3710j771l699p025J0315
$$ -18205 -24041 -12444 4306 12928 21339 17767 30152 12726 12811 -10899 -12670 -16369 -23394 -13079
13345a3079P555J1914N945k1016k105l64L4887j272j2159p418j8285q236J7620
$$ -13079 -5524 6390 12335 -8681 -10786 -11150 23737 22465 10306 2888 -15397 -23633 -6013
13332f013n215l1538J8084L9956M517k9423o291o03j1384K9052M68N621L545N192
$$ -6013 -11228 -42766 -24682 15274 19791 -9632 -15923 -16526 -27910 1142 1610 7231 10776 15968
13318A5968P654P198j5328J0688p374L267r364l9576K0252J4937j1832l1399R873
$$ 15968 23622 30820 15492 26180 18806 22073 12709 -26867 -6615 8322 -3510 -34909 -25036
13305b5036L6414L0164M722l0953k3491j5976k1917l195L8558L842j5895K4611
$$ -25036 11378 41542 46264 15311 -8180 -24156 -46073 -49268 -10710 -6868 -22763 1848
13293A848j258j8425j8745j067K3145K8494K0531k873k7063j7062L350K078J4716
$$ 1848 590 -17835 -36580 -37647 -14502 13992 34523 31650 4587 -12475 -9125 -7047 7669
13280G669J2184N738p582l4258j5482P698K5697J3736J6734r165k75J2745l827
$$ 7669 19853 25591 18009 -16249 -31731 -24033 1664 15400 32134 22969 22694 35439 31612
13267C1612n161J818m08J0044N844k7797l5465j5932P791R636j302P586L3928
$$ 31612 26451 28269 27861 37905 43749 15952 -19513 -35445 -27654 -18018 -19320 -11734 22194
13254B2194K8204j5364j8026l313q224j30J493J9026Q876R603J5801J3121j409
$$ 22194 50398 35034 17008 13695 5471 5341 6834 25860 34736 44339 60140 73261 71852
13241G1852k0924j9468l4586j0153J5834R824j4106m444o579R307R372j7151K644
$$ 71852 50928 31460 -3126 -13279 2555 12379 -1727 -6171 -12750 -3443 5929 -11222 -8578
13228h578J0035j9227p284J8994J9990R518J5110k5275j9421o4m581J546j0676
$$ -8578 1457 -17770 -25054 -6060 13930 23448 38558 13283 -6138 -6202 -10783 -9237 -19913
13215a9913j0219O560O912P241r160K9410N507O44M81J0043J798N371k4500r323
$$ -19913 -30132 -23572 -16660 -9419 -18579 10831 16338 16982 17463 27506 29304 34675 10175 852
13201H52q010J4002J8476K3375P218j5496k6202j7591j0391J3230R426R113K9262
$$ 852 -7158 6844 25320 48695 55913 40417 14215 -3376 -13767 -537 8889 18002 47264
13188D7264J1964j8970j7746k2274j0754r734J017m125q049k098J9985j033j1587
$$ 47264 59228 40258 22512 238 -10516 -20250 -19233 -23358 -31407 -33505 -13520 -14553 -26140
13175b6140K0735N446K8553n42k3991k2850J999k4365K583J901J137J7185J9058
$$ -26140 -5405 41 28594 28052 4061 -18789 -16790 -41155 -38572 -36671 -35534 -18349 709
13162G09O693J3081K788l835K7301L0075K069j0595k4977O259J8555q153j9289
$$ 709 7402 20483 23271 19436 46737 76812 78881 68286 43309 49568 68123 59970 40681
13149D0681J87K4378J3388j2855P069L9062L2179m63m0304n2670k4149j0937j4210
$$ 40681 40868 65246 78634 65779 72848 111910 144089 143626 103322 50652 26503 15566 1356
13136A356r973L013p321J6805p23k03K9883K5379j1214n2297k2538J3043R397
$$ 1356 -8617 -5604 -12925 3880 3157 2954 32837 58216 47002 -5295 -27833 -14790 -5393
13123e393q091J104J2565j987L425J7968j164j1700l984r018J2990j1660M66M0956
$$ -5393 -13484 -12380 185 -1802 1623 19591 18427 6727 2743 -6275 6715 -4945 -4479 36477
13109C6477J958O121J5881M450J4262k98j5455l62K4083L8132J0851M225k6606
$$ 36477 38435 44556 60437 64887 79149 78851 63396 63034 87117 125249 136100 140325 113719
13096A13719k2857o418k8851q64m0246k4875l055j1242N177J3731J471L8326m766
$$ 113719 90862 84444 55593 54729 14483 -10392 -13447 -24689 -19512 -5781 -4310 34016 29250
13083B9250j7377K4628m470L962k1895J64q922o244O678j6381j3844j4551j610
$$ 29250 11873 36501 32031 35993 14098 14262 5340 -904 5774 -10607 -24451 -39002 -40612
13070d0612L617M2060J1430O901k880J602q021L1802L7619j053j8231k2093k0836
$$ -40612 -36995 5065 16495 23396 20516 22118 14097 45899 83518 82465 64234 42141 21305
13057B1305j7112j2550l053L5811L6569J1048m835k1864l6811L943J5716l672
$$ 21305 4193 -8357 -11410 24401 60970 72018 67183 45319 8508 12451 28167 24495
13045B4495j9124O16M2699j4789j2173p568j448J0321j0245J7473R860k6022k0138
$$ 24495 5371 5987 48686 33897 21724 14156 12708 23029 12784 30257 40117 14095 -6043
13032f043J0522K2792j0219j0422N744j6651j6j4407l1476L4938K8042J6368J0023
$$ -6043 4479 27271 17052 6630 12374 -4277 -4293 -18700 -50176 -15238 12804 29172 39195
13019C9195J703M313r540j9252o807J0542L3020q517k0673k7357k470p652j7619
$$ 39195 40898 45211 35671 16419 9612 20154 53174 44657 23984 -3373 -5843 -13495 -31114
13006c1114k4168J9059J7765J4965J4485R463j1662j3902o898J5378j385p883
$$ -31114 -55282 -36223 -18458 -3493 10992 20455 8793 -5109 -12007 3371 1986 -5897
12994e897O472J4948J1570j1567j1264k2170k9063j6310o011L0028K5479J5400
$$ -5897 575 15523 27093 15526 4262 -17908 -46971 -63281 -69292 -39264 -13785 1615
12982A615j3354j8747n650k132J6978K309K4070L7995J825m728k3264q428K922
$$ 1615 -11739 -30486 -36136 -38268 -21290 -18981 5089 43084 44909 40181 16917 8489 11411
12969A1411j880k4850o970K9463Q258k2320j946r079Q174K4360J3735K5318j2829
$$ 11411 9531 -15319 -22289 7174 15432 -6888 -8834 -17913 -9739 14621 28356 53674 40845
12956D0845l6739j2408j4808N29J7521n051L759j3594J047j0644K294L374q384
$$ 40845 4106 -8302 -23110 -22581 -5060 -10111 -6352 -19946 -18899 -29543 -27249 -23875 -32259
12943c2259K9378N3763L831l7214k6562l746k9982r179N267K6168j3831J4249
$$ -32259 -2881 50882 54713 17499 -9063 -12809 -42791 -51970 -46703 -20535 -34366 -20117
12931b0117R617j0474j282J8036j4344J811O314J9895J885K2689j5193k4232j4968
$$ -20117 -10500 -20974 -22256 -4220 -18564 -16753 -10439 9456 11341 34030 18837 -5395 -20363
12918b0363K2164J3707j2234j3371k977L0409Q350o873R443k007J243j3644k8041
$$ -20363 1801 15508 3274 -10097 -13074 17335 25685 18812 28255 26248 27491 13847 -14194
12905a4194j0725j9688N096J0548j5938K5093O7949M987l0258J64j5086j8352
$$ -14194 -24919 -44607 -39511 -28963 -44901 -19808 48141 53128 22870 23034 7948 -10404
12893a0404q121m582K8347J7382L273p924k2923Q569j5050k1296L558K0065L4381
$$ -10404 -18525 -23107 5240 22622 25895 17971 -4952 3617 -11433 -32729 -29171 -9106 25275
12880B5275j1940j9798L4599m025l771J1559j6673j1805j2984r406k5309J714
$$ 25275 13335 -6463 28136 24111 20340 31899 15226 3421 -9563 -18969 -44278 -42564
12868d2564R243j9286J3201L6429K576j6577k8058J7914L4431Q718K492N318K682
$$ -42564 -33321 -52607 -39406 -2977 -401 -16978 -45036 -27122 7309 16027 18519 23837 26519
12855B6519j8838o067J881p202k752N50J4871J0481j845m1116j4690p418K495
$$ 26519 7681 1614 3495 -3707 -6459 -5909 8962 19443 17598 -23518 -38208 -45626 -43131
12842d3131K1680K3379K8675l159j11K3207l3791j7342J5702N129M719j1765l3688
$$ -43131 -21451 1928 30603 27444 27333 50540 16749 -593 15109 20238 24957 13192 -20496
12829b0496l678K1230K2007j2573l5224q451r436K276J581K4147K9101K570j3742
$$ -20496 -24174 -2944 19063 6490 -28734 -37185 -46621 -44345 -42764 -18617 10484 13054 -688
12816f88K448M048o782p763L1483J8163j9751k7455N740J5276j6432K0894K6498
$$ -688 1760 5808 -974 -8737 22746 40909 21158 -6297 -557 14719 -1713 19181 45679
12803D5679J0619j103p327j2770j3878m092l243O567N12j6522q955K5058j0022
$$ 45679 56298 55195 47868 35098 21220 17128 13885 20452 20964 4442 -4513 20545 10523
12790A0523r706j1845q947l576J0280K7220k709k9123J1817L5886j7697j9540
$$ 10523 817 -11028 -19975 -23551 -13271 13949 11240 -17883 -6066 29820 12123 -7417
12778g417Q66j2108O615K706L556k2063o207K7771O355p624Q098J8702J723q670
$$ -7417 -6551 -18659 -12044 -9338 -5782 -27845 -34052 -6281 74 -7550 548 19250 20973 12303
12764A2303o156j2380j099J6544L97k9926l4779k0067J8741Q800J8012r147L3271
$$ 12303 6147 -6233 -7332 9212 9609 -20317 -55096 -75163 -56422 -47622 -29610 -38757 -5486
12751e486J0926m743m124M676K4529Q80l0255o386j724k4384r092J0909J6514
$$ -5486 5440 697 -3427 1249 25778 26658 -3597 -9983 -11707 -36091 -45183 -34274 -17760
12738a7760j3708J3291l166J7239K7165j0963k1755k5444j6011k1759J3463M2289
$$ -17760 -31468 -18177 -21343 -4104 23061 12098 -9657 -35101 -51112 -72871 -59408 -17119
12726a7119K4819k6138j99N614K1175K0709j4909k1698J9942R408N591l125j9675
$$ -17119 7700 -18438 -18637 -13023 8152 28861 13952 -7746 12196 21604 27195 24070 4395
12713D395J1502J8036K4640k2242k4197j2353J542l4285q567J0856p272J1490
$$ 4395 15897 33933 58573 36331 12134 -219 1323 -32962 -41529 -30673 -37945 -26455
12701b6455J1520q694k1265J9917L3477M2875q481j2894q732P29J3664l3364N460
$$ -26455 -14935 -23629 -44894 -24977 8500 51375 42894 30000 21268 21997 35661 2297 7757
12688G757L0639o31j6914n478q225j1289j6594O280k713R978k7257j1216L272
$$ 7757 38396 37765 20851 15373 7148 -4141 -20735 -14455 -17168 -7190 -34447 -45663 -42391
12675d2391K8121J0092o221o172j5302k0405j8776K047L7202L3041K7745l057
$$ -42391 -14270 -4178 -10399 -16571 -31873 -52278 -71054 -69007 -31805 1236 28981 25924
12663B5924l5197k0555J761K5404N210J3734K3637J6161n959k3536n317k2048
$$ 25924 -9273 -29828 -28067 -2663 2547 16281 39918 56079 50120 26584 21267 -781
12651g81R160L4357k2659l2898n285j2592j6725J2J9266N869r8Q699K3474j099
$$ -781 8379 42736 20077 -12821 -18106 -30698 -47423 -47411 -28145 -22276 -22374 -13675 9799 8700
12637H700K947J2657k0115j4287j1399M904J4220L1743J1257k5199j9569j491
$$ 8700 11647 24304 4189 -10098 -21497 -16593 -2373 29370 40627 15428 -4141 -5632
12625e632l165j4450Q584K6915J5540P211R272O153k7167M400K4538l5610n5602
$$ -5632 -8797 -23247 -14663 12252 27792 35003 44275 50428 23261 27661 52199 16589 -39013
12612c9013K8039K0634q074K72j0052Q080j6439n562Q12J5207p653j1935N661
$$ -39013 -10974 9660 1586 1858 -8194 -114 -16553 -22115 -21303 -6096 -13749 -25684 -20023
12599b0023J3640j4853R365l3076K2859L0745j1929L621J5728K2709Q690j8283
$$ -20023 -6383 -21236 -11871 -44947 -22088 8657 -3272 349 16077 38786 47476 29193
12587B9193j500q274r11K996O718l0383l7093j4601L831q616J2007K2430m909
$$ 29193 27693 19419 18508 21504 28222 -2161 -39254 -53855 -50024 -58640 -46633 -24203 -29112
12574b9112J5159L525p631k3242k0147N751j3779K6435M0263l904k15K2219L919
$$ -29112 -13953 -10428 -18059 -41301 -61448 -55697 -69476 -43041 -2778 -6682 -6897 15322 19241
12561A9241L312j822l8854j0394L180N3838R003j0361J321j0335j8289j4344j4265
$$ 19241 22553 20731 -18123 -28517 -25337 28501 37504 27143 28464 18129 -160 -14504 -28769
12548b8769M485r542J667K637K6296L8555J1119p90n600j8040j4077J5557L002
$$ -28769 -24284 -33826 -32159 -29522 -3226 35329 46448 45658 40058 22018 7941 23498 26500
12535B6500j2412N152J2089K276K1382j4624j3393N216r437J1333j2479j6322
$$ 26500 14088 19240 31329 33605 54987 40363 26970 32186 22749 34082 21603 5281
12523E281R101k5169l237J566J2714o037J2584j8512j4225j3949n894r80k179
$$ 5281 14382 -10787 -14024 -12458 256 -5781 6803 -11709 -25934 -39883 -45777 -46757 -48936
12510d8936r802L5989J3726J3598j8149k2762p470j010J0898J2387L134k884J808
$$ -48936 -58738 -22749 -9023 4575 -13574 -36336 -43806 -44816 -33918 -21531 -18397 -21281 -19473
12497a9473R211M367J7649L4094K933j6740J589j1033J9606J6137p793n785L521
$$ -19473 -10262 -5895 11754 45848 48781 32041 33630 22597 42203 58340 50547 44762 48283
12484D8283P626Q305m3971j6371J337j5916j1238j4138m68L5964m545k1188j580
$$ 48283 55909 64214 20243 3872 5209 -10707 -21945 -36083 -36551 -587 -5132 -26320 -27900
12471b7900M467K6527J8327n395l0986m3802k1365J6389N3080J8690q389J5882
$$ -27900 -23433 3094 21421 16026 -14960 -58762 -80127 -63738 -10658 8032 -357 15525
12459A5525P190j2759j2728j7460R034J7495p106J1594L164J1154k2822m0577
$$ 15525 22715 9956 -2772 -20232 -11198 6297 -809 10785 13949 25103 2281 -38296
12447c8296N902J9113J4805j0578K068L430J2771j3080J5595K3779j6928k265
$$ -38296 -32394 -13281 1524 -9054 -6986 -3556 9215 -3865 11730 35509 18581 16316
12435A6316j9359J571K3199R123K5974k829P890J4587j6434j6574K8395n673j4953
$$ 16316 -3043 -1472 21727 30850 56824 53995 61885 76472 60038 43464 71859 66186 51233
12422E1233j227k2655o88m415j7262k019j2307k0487j5461K4754K6619J3893j1468
$$ 51233 50006 27351 26663 22248 4986 2967 -9340 -29827 -45288 -20534 6085 19978 8510
12409H510K4856j3404j3644k9878k6594m442j811K5595K7080J5303J4945M352
$$ 8510 33366 19962 6318 -23560 -50154 -54596 -56407 -30812 -3732 11571 26516 30868
12397C0868k659J0572L7167j6078k1406j5036j8789R874J7689r277j0063N1538
$$ 30868 28209 38781 75948 59870 38464 23428 4639 14513 32202 22925 12862 64400
12385F4400O990j9368m4739l352R50L979L251M622J6334k5797m347q470P353k7360
$$ 64400 71390 52022 7283 3931 4881 8860 12111 16733 33067 7270 2923 -5547 1806 -25554
12371b5554j297K8833Q070r608k0501J3839j0213j8360L44L0873j7889l1962l00
$$ -25554 -26851 1982 10052 444 -20057 -6218 -16431 -34791 -34447 -3574 -21463 -53425 -53725
12358e3725q482r401K6300K4827j7120j3484R305Q797J0143m0580J6458M0409
$$ -53725 -62207 -71608 -45308 -20481 -37601 -51085 -41780 -32983 -22840 -63420 -46962 -6553
12346f553K3430R976j7192p58J690J567k497j5223k6138j2750j010J2265J6892
$$ -6553 16877 26853 9661 8903 10593 12160 9663 -5560 -31698 -44448 -45458 -33193 -16301
12333a6301o411K4570R875K22j5251j0426r017k745J7769m05k231R361K6880j0899
$$ -16301 -22712 1858 11733 11955 -3296 -13722 -22739 -25484 -7715 -8120 -10351 -990 25890 14991
12319A4991j2742k5519q978J8973j2519J0981j804j4380Q459j8381j9877K6036
$$ 14991 2249 -23270 -32248 -13275 -25794 -14813 -16617 -30997 -22538 -40919 -60796 -34760
12307c4760K2974L4168l775k29K7655n145k4394Q622j6248j2975K616p231m70
$$ -34760 -11786 22382 18607 18378 46033 40888 16494 25116 8868 -4107 -1491 -8722 -9192
12294i192l821k8081j6269O865J4520L9185K3902O950K476k8063k9270j9733L222
$$ -9192 -13013 -41094 -57363 -50498 -35978 3207 27109 34059 36535 8472 -20798 -40531 -37309
12281c7309J8067j059N405J4385k964j2706l403J9751O999m813K30P092p239p234
$$ -37309 -19242 -20301 -14896 -511 -3475 -16181 -19584 167 7166 2353 2583 9675 2436 -4798
12267d798K3284R74r463m649j0015r514K7370K3841j6302k075K244j2781j462
$$ -4798 18486 19460 9997 5348 -4667 -14181 13189 37030 20728 18653 20897 8116 6654
12254F654j4899l5979l723p019O300K6696J4367J0092r664J0162J2969k1493K1578
$$ 6654 -8245 -44224 -47947 -54966 -48666 -21970 -7603 2489 -7175 2987 15956 -5537 16041
12241A6041P877k2015n384q195p529p642k1439j8589K4897J5495J2261j1039N050
$$ 16041 23918 1903 -3481 -11676 -19205 -26847 -48286 -66875 -41978 -26483 -14222 -25261 -20211
12228b0211J2348l5k0730j4737l262J0798N0068J8138K95M597k6569j8004J8966
$$ -20211 -7863 -7898 -28628 -43365 -46627 -35829 14239 32377 32672 37269 10700 -7304 11662
12215A1662k258L392J4531J4283N474j2770n253J1146J7707J8684j5061O510N6580
$$ 11662 9404 12796 27327 41610 47084 34314 29061 40207 57914 76598 61537 68047 124627
12202A24627O2287P1904J2388m0352m6090p2638k7817K84k3296q91k4800k4794
$$ 124627 186914 258818 271206 230854 184764 112126 84309 84593 61297 60406 35606 10812
12190A0812n35K7020O789j818K3780M0000K5718K3262K9735K7445j3704m4470
$$ 10812 10277 37297 44086 42268 66048 106048 131766 155028 184763 212208 198504 154034
12178A54034o2770m3991m780l5296q217J1723k3473j5891Q664j6713K0026L7270
$$ 154034 91264 47273 42493 7197 -1020 10703 -12770 -28661 -19997 -36710 -16684 20586
12166B0586J5022N038P257j3417k7623r363j0294L228k3970J1338K2096J4771
$$ 20586 35608 40646 47903 34486 6863 -2500 -12794 -9566 -33536 -22198 -102 14669
12154A4669N712L789J321K4163j1241k7445j7366l972O714o30j5535L8596k905
$$ 14669 20381 24170 25491 49654 38413 10968 -6398 -10370 -3656 -4286 -19821 18775 15870
12141A5870j515l276k9822n769j3813K0348k947K897O04j2323j6901K1495K2053
$$ 15870 14355 11079 -18743 -24512 -38325 -17977 -20924 -18027 -17423 -29746 -46647 -25152 -3099
12128c099j6861j7049n304p626O083K3482K3899J3940k0383K2096l166J4124k330
$$ -3099 -19960 -37009 -42313 -49939 -43856 -20374 3525 17465 -2918 19178 16012 30136 27806
12115B7806k037J5982O322j4969o021k5282j0341M3711J435l2775m80n448k7775
$$ 27806 25769 41751 48073 33104 27083 1801 -8540 35171 36606 3831 3351 -2097 -29872
12102b9872n958K5133J4820p452j8774K6509k3001j7290m177Q615j8612K213L3717
$$ -29872 -35830 -10697 4123 -3329 -22103 4406 -18595 -35885 -40062 -31447 -50059 -47846 -14129
12089a4129J0937p092j6780O189q149l259n460L259j0161K2011J105J9163K6468
$$ -14129 -3192 -10284 -27064 -20875 -29024 -32283 -37743 -34484 -44645 -22634 -21529 -2366 24102
12076B4102R743j6474j2268M075n904k586J1428J9853J3433j8278j2785O174K2620
$$ 24102 33845 17371 5103 9178 3274 688 12116 31969 45402 27124 14339 20513 43133
12063D3133O980j3686k7148k7012J5655K214K008j8789Q910L567Q223j798j1316
$$ 43133 50113 36427 9279 -17733 -2078 136 2144 -16645 -7735 -4168 4055 2257 -9059
12050i059M046K0720M447k7993j1170P427R759m891l818J8611j3521k8328k69
$$ -9059 -5013 15707 20154 -7839 -19009 -11582 -1823 -6714 -10532 8079 -5442 -33770 -34039
12037c4039R058J1896L7L7939K4494k0429k3483j219q81L772o956j9921N463J8012
$$ -34039 -24981 -13085 -13048 24891 49385 28956 5473 4254 3373 7145 189 -19732 -14269 3743
12023C743n887l875K3620L0146M570q99k4187o167N438l781r117k8526O587L2892
$$ 3743 -2144 -6019 17601 47747 52317 51418 27231 21064 26502 22721 13604 -14922 -8335 24557
12009B4557J7305j2300K1474J6762l9814m0760N500K642j360J8537J2001Q431
$$ 24557 41862 29562 51036 67798 27984 -12776 -7276 -4634 -5994 12543 24544 32975
11997C2975j0083k0606M411k351J7276p158j0896k12k980k251j8165J0785K7331
$$ 32975 22892 2286 6697 4346 21622 14464 3568 3356 376 -1875 -20040 -9255 18076
11984A8076P704k9427l4800j153J4253L3944J4126k0131J3284m41l0680k2912
$$ 18076 25780 -3647 -38447 -39600 -25347 8597 22723 2592 15876 15435 -15245 -38157
11972c8157N03M2112J3897k3387j0612J1003m486J8300M63k3443m793J0715J48
$$ -38157 -37654 4458 18355 -5032 -15644 -4641 -9127 9173 9636 -13807 -18600 -7885 -7737
11959g737J6877O417j4282r436j2714J4099Q511J1581J8542l5330J7826p293j5323
$$ -7737 9140 15557 1275 -8161 -20875 -6776 1735 13316 31858 -3472 14354 7061 -8262
11946h262k4868K82L67K4060P41k5127Q621o66J3570K4632k7961r698K7705J7404
$$ -8262 -33130 -32848 -32481 -8421 -7680 -32807 -24186 -24852 -11282 13350 -14611 -24309 3396 20800
11932B0800p501k8902M63o244J611n27r549P173J9965J3399j512j021j2516l940
$$ 20800 13299 -15603 -15140 -21384 -19773 -20300 -29849 -22676 -2711 10688 9176 8155 -4361 -8301
11918h301l971k679l2859q844J4462J3433J1280J1841J2535O045j7341q395J9130
$$ -8301 -12272 -14951 -47810 -56654 -42192 -28759 -17479 -5638 6897 12942 -4399 -12794 6336
11905F336L256k9901p675J7418n834j469o855m031n374k335L573N881P913Q140
$$ 6336 9592 -20309 -27984 -10566 -16400 -17869 -24724 -28755 -34129 -36464 -32891 -27010 -19097 -10957
11891a0957j7112N104O273K8656o152q486m654k7013r448J2282K0004K9832k3575
$$ -10957 -28069 -22965 -16692 11964 5812 -2674 -7328 -34341 -43789 -31507 -11503 18329 -5246
11878e246n490J3086j2296l0441L327j2905j5083J4114K4999P313P235n360J6882
$$ -5246 -10736 2350 -9946 -40387 -37060 -49965 -65048 -50934 -25935 -18622 -11387 -16747 135
11865A35P190p612n509K629n77m010J315l4315j2151K1490K7290k156l0459K5064
$$ 135 7325 -287 -5796 -3167 -3744 -7754 -6439 -40754 -52905 -31415 -4125 -6281 -36740 -11676
11851a1676K2533q332K89J6023O010j24k6492j5730n211P97K5826L3795r45p859
$$ -11676 10857 2525 2814 18837 24847 24723 -1769 -17499 -22710 -21913 3913 37708 36763 28904
11837B8904j3606L945m237l2713j2293r403O860J6913M399J272l1134l3528N993
$$ 28904 15298 19243 15006 -17707 -30000 -39403 -32543 -15630 -11231 -9959 -41093 -74621 -68628
11824f8628K3171K4952l573o23o234L3350N627p748k2312O930J3539M411m871
$$ -68628 -45457 -20505 -24078 -24701 -30935 2415 8042 294 -22018 -15088 -1549 2862 -2009
11811b009L262R090l5294k7498J0580R628m440J6751K1093r033k872j410k6292
$$ -2009 1253 10343 -24951 -52449 -41869 -32241 -36681 -19930 1163 -7870 -10742 -12152 -38444
11798c8444K2660L4995J3329k6519j9077l9313j0927J1652K9591J9104q835J637
$$ -38444 -15784 19211 32540 6021 -13056 -52369 -63296 -51644 -22053 -2949 -11784 -10147
11786a0147L1969R075j844J8762j8919l5361o2K2903J2033j6242J0322K7902J4930
$$ -10147 21822 30897 29053 47815 28896 -6465 -6527 16376 28409 12167 22489 50391 65321
11773F5321k572k6873j5526j0027K178K1313j3465k1281P603m29p817P015j2074
$$ 65321 62749 35876 20350 10323 12501 33814 20349 -932 6671 6242 -1575 5440 -6634
11760f634k6579m207J5173J5165k8370j7665j192j123J4061L376K6239J8161K1205
$$ -6634 -33213 -37420 -22247 -7082 -35452 -53117 -54309 -55432 -41371 -37995 -11756 6405 27610
11747B7610K2072k8286k4105J6919J5954j9235l4L943K2073P513j3494k0598n251
$$ 27610 49682 21396 -2709 14210 30164 10929 10895 14838 36911 44424 30930 10332 5081
11734E081L124l782J3927j7201j8755P113q010j0552K7040p760Q05J6561L742
$$ 5081 8205 4423 18350 1149 -17606 -10493 -18503 -29055 -2015 -9775 -8970 7591 11333
11721A1333J4141j106j7555J2787J157n925m127j769J7421J7802j5558j2752n763
$$ 11333 25474 24368 6813 19600 20757 14832 10705 8936 26357 44159 28601 15849 10086
11708A0086j16L4328J0188n099m1381j2028j2905K2282J1565k7592q091L1806
$$ 10086 9970 44298 54486 49387 8006 -4022 -16927 5355 16920 -10672 -18763 13043
11696A3043n102l595n070j3230K5467J5221L235j7339k0733J4655j745k4442k1266
$$ 13043 7941 4346 -724 -13954 11513 26734 29969 12630 -8103 6552 4807 -19635 -40901
11683d0901k695J5582j9724L615L2030o13K7001K1099j0879J284J0270p305J1235
$$ -40901 -43596 -28014 -47738 -44123 -12093 -12706 14295 35394 24515 25799 36069 28764 39999
11670C9999j3346k6277J1774J1971j2215m996J9628j5446K6718L5200j4195k6544
$$ 39999 26653 376 12150 24121 11906 6910 26538 11092 37810 73010 58815 32271
11658C2271Q618m0800q073M6909Q199k4794j50K014R264n212k2296k4368R302
$$ 32271 40889 89 -7984 38925 47124 22330 22180 24194 33458 28246 5950 -18418 -9116
11645i116k48K0618M412j3092L722J7405J3520N972k0414j2755J6626Q772k84
$$ -9116 -9364 11254 15666 2574 6296 23701 37221 43193 22779 10024 26650 35422 35138
11632C5138J2656m0765j6303j1978j2227N998J2877R108p585n242j4400J6022
$$ 35138 47794 7029 -9274 -21252 -33479 -27481 -14604 -5496 -13081 -18323 -32723 -16701
11620a6701J951J4147J3258Q799K3103j020r422k0920j0832m616o98K4501k697
$$ -16701 -14750 -603 12655 21454 44557 43537 34115 13195 2363 -2253 -2951 21550 18853
11607A8853n353l4799j3476J8053j2821J7295J5690j651j0722j383j6819J4487
$$ 18853 13500 -21299 -34775 -16722 -29543 -12248 3442 1791 -8931 -10314 -27133 -12646
11595a2646L6848o034q396j1272P10M37O473J804p640Q558J237m876q0J0088Q304
$$ -12646 24202 18168 9772 -1500 -790 -353 6120 7924 284 8842 10079 5203 5123 15211 23515
11580B3515J0120m903R874J8554J4893L7315j4021j1838k597m283K8637L1369
$$ 23515 33635 28732 38606 57160 72053 109368 95347 83509 80912 76629 105266 136635
11568A36635j2370j2862K8328k1395k3577L382J3853j2888j3739K1246j9941m8967
$$ 136635 124265 111403 139731 118336 94759 98141 111994 99106 85367 106613 86672 37705
11556C7705J5416L0422P184l852J5791K3535J0459p864K7916J5711j7075k899
$$ 37705 53121 83543 90727 86875 102666 126201 136660 128796 156712 172423 155348 152449
11544A52449k1226n2942l6663J206O800M95j2763L062J1091J681k7482k0234J6425
$$ 152449 131223 78281 41618 42824 49624 50119 37356 40418 51509 53190 25708 5474 21899
11531B1899K5914K0916j942k4648j4915K5973M2834L6085L9327Q336j8016K960
$$ 21899 47813 68729 66787 42139 27224 53197 96031 132116 171443 179779 161763 164723
11519A64723K7288M1390J3037k9600k6570p907J4275J8799k2553m8802n0470j6999
$$ 164723 192011 233401 246438 216838 190268 182361 196636 215435 192882 144080 93610 76611
11507G6611j7506j2615l9195m460N711j0545j9274k0637R258J7899J2810j483
$$ 76611 59105 46490 7295 2835 8546 -1999 -21273 -41910 -32652 -14753 -1943 -3426
11495c426J4729L7264j3703k0731k3427l5364j4315O159K3887m916j0893R489
$$ -3426 11303 48567 34864 14133 -9294 -44658 -58973 -52814 -28927 -33843 -44736 -35247
11483c5247K2264K0496O184k0938p689J5442K1893k4215n34R614J9264n845j9413
$$ -35247 -12983 7513 13697 -7241 -14930 512 22405 -1810 -2344 7270 26534 20689 1276
11470A276K7702K0205N00k5928k6734j4645J0965J4596K4667q870l1033K655N971
$$ 1276 28978 49183 49683 23755 -2979 -17624 -6659 7937 32604 23734 -7299 -4644 1327
11457A327J7243Q761o517k4383k5738K1014L3880M37k656q452l2326J385L0054
$$ 1327 18570 27331 20814 -3569 -29307 -8293 25587 26024 23368 14916 -17410 -16025 14029
11444A4029J7819Q049q298o081m880L306J5515P120j3972k1307k3213k2372J0720
$$ 14029 31848 39897 31599 25518 20638 23944 39459 46579 32607 11300 -11913 -34285 -23565
11431b3565J6308K6214M578q081Q333K2441M905o077k3167l2441q516m253R431
$$ -23565 -7257 18957 23535 15454 23787 46228 51133 45056 21889 -10552 -19068 -23321 -13890
11418a3890K1315O596j786j5059j7775J1378k364j0975J0110j0104m246K1460
$$ -13890 7425 14021 12235 -2824 -20599 -9221 -11585 -22560 -12450 -22554 -26800 -5340
11406e340J1506L0261n281k0507n03l278k9305n147K0192P217K0051q570O257
$$ -5340 6166 36427 31146 10639 10136 6858 -22447 -27594 -7402 -185 19866 11296 17553
11393A7553K4877q177j6501L037N492j9633l0800Q230o861J4084K1261J8611r235
$$ 17553 42430 34253 17752 20789 26281 6648 -24152 -15922 -22783 -8699 12562 31173 21938
11380B1938j172j4951l1944J0866K7317l1247k2909N600N5082N372j7850r806
$$ 21938 20766 5815 -26129 -15263 12054 -19193 -42102 -36502 18580 23952 6102 -3704
11368c704j8220r640J2203O672J7292j6725j0771M070N046L8969r123j0491P421
$$ -3704 -21924 -31564 -19361 -12689 4603 -12122 -22893 -18823 -13777 25192 16069 5578 12999
11355A2999p519p33j8653l702M409M799J339j031L702k046N616n914M577N967
$$ 12999 5480 4747 -13906 -17608 -13199 -8400 -7061 -8092 -4390 -6436 -820 -6734 -2157 3810
11341C810J741o829j0624N392K2604j4549j2871p145p618J1006J1311l468J660
$$ 3810 5551 -1278 -11902 -6510 16094 1545 -11326 -18471 -26089 -15083 -3772 -7240 -5580
11328e580p218p886K2131Q337p859Q826k8905k2130O696J7632K0812J0061J807
$$ -5580 -12798 -20684 1447 9784 1925 10751 -18154 -40284 -33588 -15956 4856 14917 16724
11315A6724k6795K076l97P732k133k9389k7290R490K2758o307N82r77J8424K1282
$$ 16724 -10071 -7995 -8392 -660 -2793 -32182 -59472 -49982 -27224 -33531 -32949 -33926 -15502 5780
11301E780m581j7844j4033R357O412q970O493K1269m99J4555J4394k2288k1509
$$ 5780 1199 -16645 -30678 -21321 -14909 -23879 -17386 3883 3384 17939 32333 10045 -11464
11288a1464J2728J1873K3625j7785k7374q52K2272n783k6288Q884J1633l944K085
$$ -11464 1264 13137 36762 18977 -8397 -9249 13023 7240 -19048 -10164 1469 -2475 -390
11275c90k2124P974J1347n80J1874j2336q181L2033P969m6830j5897J6240L1070
$$ -390 -22514 -14540 -3193 -3773 8101 -4235 -12416 19617 27586 -19244 -35141 -18901 12169
11262A2169q716l0116Q729L5968j280J7036j2990k2129k198p210K8327p146k1798
$$ 12169 3453 -26663 -17934 18034 16754 33790 20800 -1329 -3527 -10737 17590 10444 -11354
11249a1354N475o292n292m971j1800j380n459J3042L4876K516j6540j5214L5363
$$ -11354 -5879 -12171 -17463 -22434 -34234 -35614 -41073 -28031 6845 9361 -7179 -22393 12970
11236A2970k448j8987M753j8331L590J7200P036j1787j0359M326K632M124q790
$$ 12970 10522 -8465 -3712 -22043 -18453 -1253 5783 -6004 -16363 -12037 -9405 -5281 -14071
11223a4071k8395N577J8607M926J6314K4445k2550k1729j5613m99L0979J0944
$$ -14071 -42466 -36889 -18282 -13356 2958 27403 4853 -16876 -32489 -32988 -2009 8935
11211H935j4023J5500J7472j7062j3613K1167j288l985l3006j6483J7841j7118
$$ 8935 -5088 10412 27884 10822 -2791 18376 17088 13103 -19903 -36386 -18545 -35663
11199c5663K773J0355K7146J6845k0974J9890k817k6896Q93J5777l156j2612j1093
$$ -35663 -32890 -22535 4611 21456 482 20372 17555 -9341 -8448 7329 4173 -8439 -19532
11186a9532J6060R255l7767j6378r057j6795J7583J5730K4055K2824L510o687
$$ -19532 -3472 5783 -31984 -48362 -57419 -74214 -56631 -40901 -16846 5978 9488 2801
11174B801j5422r661J0339J6452p139l632L4976o7l9646j7953J5187P733j816
$$ 2801 -12621 -22282 -11943 4509 -2630 -6262 28714 28647 -10999 -28952 -13765 -6032 -7848
11161g848J4042k3569o160J5431J9355R682J2752O928j6077j2807j5136J3267
$$ -7848 6194 -17375 -23535 -8104 11251 20933 33685 40613 24536 11729 -3407 9860
11149I860J3287M126j834K003J1858k2967k6319J218P727j4533j3896J7057K1616
$$ 9860 23147 27273 25439 27442 39300 16333 -9986 -8768 -1041 -15574 -29470 -12413 9203
11136I203k674J6419J185j8816k367Q48o881K0583r762N711N491j2560j78Q918
$$ 9203 6529 22948 24133 5317 2950 3798 -3083 17500 7738 13449 18940 6380 6202 15120
11122A5120K6560N709j0290j5465j9178K5445J8924j6582K0345K597m7255r031
$$ 15120 41680 47389 37099 21634 2456 27901 46825 30243 50588 53185 5930 -3101
11110c101P321j0331J3975K2717L069k1761r261J6773J1974J8821j1356p634k0158
$$ -3101 4220 -6111 7864 30581 33650 11889 2628 19401 31375 50196 38840 31206 11048
11097A1048k6438k5349J0129K9701K8544R404J92k4031P55q483l1133P371J5631
$$ 11048 -15390 -40739 -30610 -909 27635 37039 37231 13200 13955 5472 -25661 -18290 -2659
11084b659J8381K937J0661n758k2843L645p80R09k447m747k3041Q775L4453j9801
$$ -2659 15722 18659 29320 23562 719 4364 3584 4493 2046 -2701 -25742 -16967 17486 -2315
11070b315k9482l775K0222J446N557K0456o437l922K2427J7950k1606k3957J5674
$$ -2315 -31797 -35572 -15350 -13904 -8347 12109 5672 1750 24177 42127 20521 -3436 12238
11057A2238O828m184P052q589M153j35j0761J1863j0141P972o749j5916J1901
$$ 12238 19066 14882 21934 13345 17498 17363 6602 18465 8324 16296 9547 -6369 5532
11044E532l566L6891Q371k5824k0211k1341J022j3783j3699M7110J0929l246j8457
$$ 5532 1966 38857 47228 21404 1193 -20148 -19126 -32909 -46608 502 11431 8185 -10272
11031a0272p205j5802K943j0185Q44K5864k410k7889K2466K8369N280j5059p491
$$ -10272 -17477 -33279 -30336 -40521 -39677 -13813 -16223 -44112 -21646 6723 12003 -3056 -10547
11018a0547Q132K0789J9821o584j0552j2567m123K824j1408J1651J559J770J7368
$$ -10547 -2415 18374 38195 31611 21059 8492 4369 7193 -4215 7436 8995 10765 28133
11005B8133J3284k4963q071K437o167k4853J3489K3660n929n618J6637n694r293
$$ 28133 41417 16454 8383 10820 4653 -20200 -6711 16949 11020 5402 22039 16345 7052
10992G052K5772n701j798k7731k723L5190J9967l789N45M223j876O894j1015l320
$$ 7052 32824 27123 25325 -2406 -5129 30061 50028 46239 46784 51007 49131 56025 45010 41690
10978D1690J45j5734K94j0554m058P684j4885l639J1731P527K228j6443j9814
$$ 41690 41835 26101 26395 15841 11783 19467 4582 943 12674 20201 22429 5986 -13828
10965a3828n64K1215J6827K5469j745J1284K95n481j7521j3432J1852P724j1115
$$ -13828 -14392 6823 23650 49119 47374 58658 58953 53472 35951 22519 34371 42095 30980
10952C0980M720l070q982J6658J8489K0923o979j7083l4119k5838j0665N654K7544
$$ 30980 35700 32630 23648 40306 58795 79718 72739 55656 21537 -4301 -14966 -9312 18232
10939A8232J5045R389J0308J2133J905k5087J5257k8289j8032K2763J8014J925
$$ 18232 33277 42666 52974 65107 67012 41925 57182 28893 10861 33624 51638 53563
10927E3563j82k2102k3958l737L3129J453M087j665O724j4660k6793K926J6372
$$ 53563 53381 31279 7321 3584 36713 38166 42253 40588 47312 32652 5859 8785 25157
10914B5157j5555o17L924M041M0150J9607j1029o042L877K0223q629k616k27o776
$$ 25157 9602 8985 12909 16950 57100 76707 65678 59636 63513 83736 75107 72491 72264 65488
10900F5488j1506j434K3822M0180K2311L9002L9590M0992N7449N5038N8888Q3470
$$ 65488 53982 52548 76370 116550 138861 177863 217453 258445 315894 370932 429820 513290
10888E13290Q4258J06647J29366J56288J62657K27457J42080L7176N4466J32085
$$ 513290 597548 704195 833561 989849 1152506 1379963 1522043 1559219 1613685 1745770
10878A745770Q9226j93841l09399j65430p3988j99699k76838j85917j34052o0925
$$ 1745770 1834996 1641155 1331756 1166326 1092338 892639 615801 429884 295832 234907
10868B34907m0427m7080j4843J4325P846l2141j1686j5205r911K900j4251k2911
$$ 234907 194480 147400 132557 146882 154728 122587 110901 95696 85785 88685 74434 51523
10856E1523J4586O727j9976k653K03j862j9807J0996O339j579P839L688q57j4883
$$ 51523 66109 72836 52860 50207 50410 48548 28741 39737 46076 44497 52336 56024 55167 40284
10842D0284J8017n200l616o152l1302l4918Q496J3870L1358P308k215j2399K2480
$$ 40284 58301 53101 49485 43333 12031 -22887 -14391 -521 30837 38145 35930 23531 46011
10829D6011J1173r605j7329P999J2933j4719P138m802k2392m062r880L792J3579
$$ 46011 57184 47579 30250 38249 51182 36463 43601 38799 16407 12345 2465 6257 19836
10816A9836J8486M026l5651j4025K0031N540L50Q811K1423r683l4860j7774L2351
$$ 19836 38322 42348 6697 -7328 12703 18243 18593 27404 48827 39144 4284 -13490 18861
10803A8861J054P048j4317l398N73q103j9657J9542J9684M2477j61j6907p232
$$ 18861 19915 26963 12646 9248 9821 1718 -17939 1603 21287 63764 63603 46696 39464
10790C9464L6160j7897j7561M067J9757K6626k7571k6630r471R799O959Q048N129
$$ 39464 75624 57727 40166 44233 63990 90616 63045 36415 26944 36743 43702 51750 56879
10777E6879M819P459J454M577P754R878k629n157j9231O796J592R400Q215J0044
$$ 56879 61698 69157 70611 75188 82942 92820 90191 85034 65803 72599 74191 83591 91806 101850
10763A01850j3703k3432J1432j1554j5222K188n978K7406K3474k1150k1804K0464
$$ 101850 88147 64715 76147 64593 49371 51559 45581 72987 96461 75311 53507 73971
10751G3971O125K3597J7063m346J3261J3293K6757J3403J2595m575n2315k1000
$$ 73971 80096 103693 120756 116410 129671 142964 169721 183124 195719 191144 138829 117829
10739A17829K6110L6609P506l9343j1465J9742J0565k6456k6680o462J6204L3094
$$ 117829 143939 180548 188054 148711 137246 156988 167553 141097 114417 107955 124159 157253
10727A57253j1516o622J1960q496O870K9854J4998j6533k1153j7350k1202p600
$$ 157253 145737 139115 151075 142579 149449 179303 194301 177768 156615 139265 118063 110463
10715A10463J3348k3145n662K9405J3451n621q84L545k074J2313L750o613K8261
$$ 110463 123811 100666 95004 124409 137860 132239 131355 134900 132826 145139 148889 142276 170537
10702A70537R298R634j0023J7286P568k0066m5640j2259j3405k0j5962j2259j7643
$$ 170537 179835 189469 179446 196732 204300 184234 138594 126335 112930 112910 96948 84689 67046
10689F7046j3656r503L342J9206J4117k091J124J0889j0090O382K4383L138l248
$$ 67046 53390 43887 47229 66435 80552 78461 79585 90474 80384 86766 111149 114287 111039
10676A11039j3195p391m784J4246L9204L190j9535j241L4260L4849J7956j7962
$$ 111039 97844 90453 85669 99915 139119 142309 122774 121533 155793 190642 208598 190636
10664A90636j7298l321k8978m9668j7941M609J0829J2011K0939N159J4917N605
$$ 190636 173338 170017 141039 91371 73430 78039 88868 100879 121818 126977 141894 147499
10652A47499j0407L102K2746n41m1983K748L0690o100j2223k624K189O08J7123
$$ 147499 137092 140194 162940 162399 120416 123164 153854 147754 135531 132907 135096 135704 152827
10639A52827J4689n592N082j2175l4932m1388n5088l5452k8766K424J4290R57
$$ 152827 167516 161924 167006 154831 119899 78511 23423 -12029 -40795 -38371 -24081 -23124
10627b3124j3931j1299M2028j220P901J1126J4824r668k2956l198r782k4413j8869
$$ -23124 -37055 -48354 -6326 -7546 355 11481 26305 16637 -6319 -9517 -19299 -43712 -62581
10614f2581n524K3639k961j9983J6188N7798R0010P0937j784K3363N9960K8931
$$ -62581 -68105 -44466 -47427 -67410 -51222 6576 96586 167523 165739 189102 249062 277993
10602B77993Q743L634N1185N8243N6235K2210l143o978j5566n39j2380k4601j8957
$$ 277993 286736 290370 341555 399798 456033 478243 475100 468122 452556 452017 439637 415036 396079
10589C96079m3819p625j9263j2093J2166l442k688M091J4101J8559Q9K2575J1181
$$ 396079 352260 344635 325372 313279 325445 322003 319315 323406 337507 356066 356155 378730 389911
10576C89911O75J6853L0072K2777k0643q742k677J0431j4818j6680J3313J3908
$$ 389911 390586 407439 437511 460288 439645 430903 428226 438657 423839 407159 420472 434380
10564D34380j7718L1982K2157J5923J2997p705o306K1540L3922l856M058K4421
$$ 434380 416662 448644 470801 486724 499721 492016 485710 507250 541172 537316 541374 565795
10552E65795J5580J033K985J8137K6925K7184M63j889J8753L3567K9172J0659
$$ 565795 581375 582408 585393 603530 630455 657639 658102 656213 674966 708533 737705 748364
10540G48364K9927P019L4730N1694K8223l893K0553N3417L3229R702J1339K2044
$$ 748364 778291 785310 820040 871734 899957 896064 916617 970034 1003263 1012965 1024304 1046348
10528A046348P2652O9530Q0566M6959M5744P8334P2435P4839J07985J42660J19937
$$ 1046348 1119000 1188530 1269096 1316055 1361799 1440133 1512568 1587407 1695392 1838052 1957989
10517A957989J07335R3336J21828J55851J50099J68906K25582K77504K94961K75489
$$ 1957989 2065324 2158660 2280488 2436339 2586438 2755344 2980926 3258430 3553391 3828880
10507C828880L30477M07918N05969N69060O38867P23911R39660J120887J160493
$$ 3828880 4159357 4567275 5073244 5642304 6281171 7005082 7944742 9065629 10226122
10498A0226122J249034J672971K319439K746652L098262M032022N507924P154279
$$ 10226122 11475156 13148127 15467566 18214218 21312480 25344502 30852426 38006705
10490C8006705Q456571R493125J1306193J3359214J4618851J5818982J8870281
$$ 38006705 46463276 55956401 67262594 80621808 95240659 111059641 129929922
10483A29929922K3752125K9497067L7156994M1757166K2998498l75665J1697815
$$ 129929922 153682047 183179114 220336108 262093274 285091772 284716107 296413922
10476B96413922L1244312J0299085m4246150n7356994k8699034j4068131l6200684
$$ 296413922 327658234 337957319 293711169 236354175 207655141 193587010 157386326
10469A57386326n0540083l6195998k0623895j2089621p799674n321868l639118
$$ 157386326 106846243 70650245 50026350 37936729 30137055 24815187 21176069
10462B1176069k614284k134973j806320j438029j113468r94806q83118o61509
$$ 21176069 18561785 16426812 14620492 13182463 12068995 11074189 10191071 9529562
10454I529562n97214p13942p35488n50241l92795l67898m09368m40924l68901
$$ 9529562 8932348 8218406 7482918 6932677 6539882 6171984 5762616 5321692 4952791
10445D952791k42811j35941k38983l83043l15251j81340j77964k73873k82471
$$ 4952791 4709980 4574039 4335056 3952013 3636762 3455422 3277458 3003585 2721114
10436B721114j89337j05420j30945j60810j55260o9012o1418p2158p4045p2274
$$ 2721114 2531777 2426357 2295412 2134602 1979342 1910330 1848912 1776754 1702709 1630435
10426A630435k8318l7732j4984n433j2522j3980L4526K564r3J5920Q2256N3303
$$ 1630435 1602117 1564385 1549401 1543968 1531446 1517466 1551992 1554556 1554463 1570383 1652639 1705942
10414A705942n289r250L5724L5954r1076k02806j62401j07890j09692j32191j18154
$$ 1705942 1700653 1691403 1727127 1763081 1672005 1469199 1306798 1198908 1089216 957025 838871
10403H38871r3085n1493j7876l9254l6172j0812j1805J4267p271k0129n2363m0758
$$ 838871 745786 694293 676417 637163 600991 590179 578374 592641 585370 565241 512878 472120
10391D72120k6104J397k3898l028k4837k8118l933m854J2980l3668l7434j2066
$$ 472120 446016 447413 423515 420487 395650 367532 363599 358745 371725 338057 300623 288557
10379B88557J2978L0564J3862j3235j8457j9205l526J2521l492J4423J093j6453
$$ 288557 301535 332099 345961 332726 314269 295064 291538 304059 300567 314990 316083 299630
10367B99630j0513K079J7625j2572l6127l3954K244K3213k0969j8538K0829K5624
$$ 299630 289117 291196 308821 296249 260122 226168 228412 251625 230656 212118 232947 258571
10355B58571L5994M2763L0110M104J6733N5706M4902Q807k2651J6133L896n677
$$ 258571 294565 337328 367438 371542 388275 443981 488883 497690 475039 491172 495068 489391
10343D89391q315o472j4932J1629P137P067J5653R88k1595k0757l0449j6044j1464
$$ 489391 481076 474604 459672 471301 478438 485505 501158 502146 480551 459794 429345 413301 401837
10330D01837l6712j7835K3181J3907J2240q511j7068k7678k1893L282J722m7859
$$ 401837 365125 347290 370471 384378 396618 388107 371039 343361 321468 324750 326472 278613
10318B78613o8845l0892q089k080k3924j1047N273K957n332j4012j3424J4736
$$ 278613 209768 178876 170787 168707 144783 133736 139009 141966 136634 122622 109198 123934
10306A23934L7190L2515P394N934j6729r404j0972k4532l512n926j6318j1262
$$ 123934 161124 193639 201033 206967 190238 180834 169862 145330 141818 135892 119574 108312
10294A08312N905j362j031j1458N472K666J3552k5918l3996K00J7558J5750j1478
$$ 108312 114217 112855 111824 100366 105838 108504 122056 96138 62142 62342 79900 95650 84172
10281H4172j1998J5671k1544J00J069J0813L1909K4746o887j4366k1755m022j8615
$$ 84172 72174 87845 66301 66401 67470 78283 110192 134938 128051 113685 91930 87908 69293
10268F9293M688J9033k2420l844p196j745J1964m596k4581J8180j5455j6347N252
$$ 69293 73981 93014 70594 66750 59554 57809 69773 65177 40596 58776 43321 26974 32226
10255C2226K1852J6592j2031r202M515K4312j7560l1500R301L5267J6302K163
$$ 32226 54078 70670 58639 49437 53952 78264 60704 29204 38505 73772 90074 92237
10243I2237l774k419O396N941K1529j2747l5271J4095L2917O536P909j6755j5959
$$ 92237 88463 86044 92440 98381 119910 107163 71892 85987 118904 125440 133349 116594 100635
10230A00635p632J1143o087j7547l703j195J7140M4731P385K612l9601j0473O901
$$ 100635 93003 104146 98059 80512 76809 75614 92754 137485 144870 147482 107881 97408 104309
10217A04309N15K8276N121l2398k5141j9256o424n263L606j5538N639L757L436
$$ 104309 104824 133100 138221 105823 80682 61426 55002 49739 53345 37807 43446 47203 50639
10204E0639L1773J2054l4114k7895p330L1395J2690j4232R21l4556n838J0940
$$ 50639 82412 94466 60352 32457 25127 56522 69212 54980 55901 21345 15507 26447
10192B6447j8085l2816o617M466j7704J776K0806J2462J971k5778K102Q551J247
$$ 26447 8362 -24454 -31071 -26605 -44309 -42533 -21727 -9265 -7294 -33072 -30970 -22419 -21172
10179b1172j0043N495K9909K0595J4870j8987k7340N5589M0023j7132m8005j0354
$$ -21172 -31215 -25720 4189 24784 39654 20667 -6673 48916 88939 71807 23802 13448
10167A3448J9839r997r56K6137K1252p330m4283j1353J5743Q738N070J320J3083
$$ 13448 33287 23290 22334 48471 69723 62393 18110 6757 22500 31238 36308 37628 50711
10154E0711K5269n022M224k937j8320j2257n065J3462P807p491J9682N344j3735
$$ 50711 75980 70958 75182 72245 53925 41668 36603 50065 57872 50381 70063 75407 61672
10141F1672j7407q48K7751P331j461J0826J6011K132j7463k5829M165j377k7859
$$ 61672 44265 43417 71168 78499 77038 87864 103875 106007 88544 62715 66880 65503 37644
10128C7644M198j1851q051O940K3325l438j3442q464N937K746Q819k1798K4857
$$ 37644 41842 29991 21940 28880 52205 48767 35325 26861 32798 35544 44363 22565 47422
10115D7422L7822M636o382j7373k0761j4967p241K5591J1652q851o177J5293j9707
$$ 47422 85244 89880 83498 66125 45364 30397 23156 48747 60399 51548 45371 60664 40957
10102D0957k3865o170j2484k895K8716K3188L3987P749m4938l2210K9518L1849
$$ 40957 17092 10922 -1562 -4457 24259 47447 81434 89183 44245 12035 41553 73402
10090G3402P800N763J1409L0587l297K7661M6517L3471M0607N1099O6422P7255
$$ 73402 81202 86965 98374 128961 125664 153325 199842 233313 273920 325019 391441 468696
10078D68696M2378R4104R5565R8059J44524J89668K15180J69202M7031L4917J17779
$$ 468696 511074 605178 700743 798802 943326 1132994 1348174 1517376 1564407 1599324 1717103
10067A717103J17803j35003l28943k20458o1012j14744k69562k72577j41979p2555
$$ 1717103 1834906 1699903 1370960 1150502 1089490 974746 705184 432607 290628 218073
10057B18073n5876n3855o669k551j2051m659K0494K3999P619l1618k2226k1083
$$ 218073 162197 108342 101673 99122 87071 82412 102906 126905 134524 102906 80680 59597
10045E9597j1939k5207j8872j1327N1336L1260k4957q419p289r991j5230J1127
$$ 59597 47658 22451 3579 -7748 43588 74848 49891 41472 34183 24192 8962 20089
10033B0089L207O828p204j8472m382j4595l501L0442K600l281J1764J9157j0623
$$ 20089 23296 30124 22920 4448 66 -14529 -18030 12412 15012 11731 23495 42652 32029
10020C2029K005K1480k2997K169k959j3426p939J1808R609P493q059K4932K3507
$$ 32029 34034 55514 32517 34686 31727 18301 10362 22170 31779 39272 31213 56145 79652
10007G9652k0815k0558k897o969N765l263r713J0383j8399p105j6778L1674P590
$$ 79652 58837 38279 35382 28413 34178 30915 21202 31585 13186 6081 -10697 20977 28567
9994B8567kk2688j4376r026J1904Q834K472j3163j4901K4461K1898l1095j3141
$$ 28567 28565 5877 -8499 -17525 -5621 3213 5685 -7478 -22379 2082 23980 -7115 -20256
9981b0256K4527K5377J2838j4606j9584K988R69p788n133K0080p951o0610l044
$$ -20256 4271 29648 42486 27880 8296 11284 12253 4465 -668 19412 11461 -49149 -52193
9968e2193L5972K4095p993l460l633P733o653J0880L958l910j1298r407M7471
$$ -52193 -16221 7874 -119 -3579 -7212 521 -6132 4748 8706 4796 -6502 -15909 31562
9955C1562J4982p429L557J2402O996k7834o559j692j7272L760N552j4357P521
$$ 31562 46544 39115 42672 55074 62070 34236 27677 25985 8713 12473 18025 3668 11189
9942A1189R210l289m2398M3K8500J710O632k135n834K6105r621r978m782N632
$$ 11189 20399 17110 -25288 -25245 3255 4965 11597 9462 3628 29733 20112 10134 5352 10984
9928A0984j4411j8167N185J7382J8861L8767j3118k3079l0843j1360P047N810
$$ 10984 -3427 -21594 -16409 973 19834 58601 45483 22404 -8439 -19799 -12752 -6942
9916f942m239J5367K0185P245J8845m992l851k597j2613j7609k7500m1649k4907
$$ -6942 -11181 4186 24371 31616 50461 45469 41618 39021 26408 8799 -18701 -60350 -85257
9903h5257M314L7745K2997K423m027n276l331K0864L0936M317k7075K520P583
$$ -85257 -80943 -43198 -20201 -17778 -21805 -27081 -30412 -9548 21388 25705 -1370 1150 8733
9890H733j2241J1954j6186l01q086J7831J8936q187j0401n0223j6666K3027J1204
$$ 8733 -3508 8446 -7740 -8041 -16127 1704 20640 12453 2052 -48171 -64837 -41810 -30606
9877c0606o953p051J7656J7620j5704j2997n383J3041K2814J6580m500n913M75
$$ -30606 -37559 -44610 -26954 -9334 -25038 -38035 -43418 -30377 -7563 9017 4517 -1396 -921
9864i21J084o413M905J7793J0863q518k9728J369L3894O467R789o475k8909L529
$$ -921 163 -6250 -1345 16448 27311 18793 -10935 -9566 24328 30795 40584 34109 5200 8729
9850H729J0469K1705L7217N147J3282K7690J1701K3528J8667L9007N5572m197
$$ 8729 19198 40903 78120 83267 96549 124239 135940 159468 178135 217142 272714 268517
9838B68517j4313L3042R3219J29617J26149M3686p2728j84885j88708q9942k5658
$$ 268517 254204 287246 380465 510082 636231 679917 607189 422304 233596 143654 117996
9827A17996j9622l6748l2849j7841K355l5277n103Q847J0529O124m887N743L0335
$$ 117996 98374 61626 28777 10936 13291 -21986 -27089 -18242 -7713 -1589 -6476 -733 29602
9814B9602n812N707j321j4359o238R316j59j5734J4285L7909q264j8932P073J9744
$$ 29602 23790 29497 28176 13817 7579 16895 16736 1002 15287 53196 44932 26000 33073 52817
9800E2817j0116j9537j3298k0987o373m887j4971J0133M0772k1117q843L587J2617
$$ 52817 42701 23164 9866 -11121 -17494 -22381 -37352 -27219 13553 -7564 -16407 -12820 -203
9787b03L2040j9413k5477j6361K3466J8835O950j5058k1873j2665K0364J6277
$$ -203 31837 12424 -13053 -29414 -5948 12887 19837 4779 -17094 -29759 -9395 6882
9775F882P259j935o943L076L9054P289L262l7600j0338j1532K608K384J3583o108
$$ 6882 14141 12206 5263 8339 47393 54682 57944 20344 10006 -1526 1082 3466 17049 10941
9761A0941j039K564l748J3612J5873l048k1658o800j5056l966K3736M5679j9399
$$ 10941 9902 12466 8718 22330 38203 35155 13497 6697 -8359 -12325 11411 57090 37691
9748C7691m3950k9680L272L1352K0161Q344j2291o091k2795q084P53O273q28L2101
$$ 37691 -6259 -35939 -32667 -1315 18846 27190 14899 8808 -13987 -22071 -21318 -15045 -15873 16228
9734A6228J1187p291j2737p226P972J3631K6974N531j0111r384q279j9943l3985
$$ 16228 27415 20124 7387 161 8133 21764 48738 54269 44158 34774 26495 6552 -27433
9721b7433j3380K3894L0955P633j7560j5530n431K1208J075k064J753k1759j932
$$ -27433 -40813 -16919 14036 21669 4109 -11421 -16852 4356 5431 3367 5120 -16639 -18571
9708a8571R467j6248j7024m043L9556j633r047N298O570L5899n627j7908p704
$$ -18571 -9104 -25352 -42376 -46419 -6863 -8496 -17543 -12245 -5675 30224 24597 6689 -1015
9695a015k0488l307j0972J4877M3523J8867j3341r324K1566L67m7904O91r85l923
$$ -1015 -21503 -24810 -35782 -20905 22618 41485 28144 18820 40386 40753 -7151 -6460 -7445 -11368
9681a1368k1989M060N4759j8152k6812J4341Q884r006K0313J7855L846k7591j8156
$$ -11368 -33357 -29297 25462 7310 -19502 -5161 3723 -5283 15030 32885 36731 9140 -9016
9668i016j4393K4680J2313p839l0063K459J6052j1773N18j6910k1109J3132J8691
$$ -9016 -23409 1271 13584 5745 -24318 -21859 -5807 -17580 -17062 -33972 -55081 -41949 -23258
9655b3258J1396r356J0938o285o871j240k80j6475R836K7961L6339J6334j8344
$$ -23258 -11862 -21218 -10280 -16565 -23436 -24676 -24956 -41431 -31595 -3634 32705 49039 30695
9642C0695L173J8487j3574q807j5518j3166p351j2553L626K653N927Q050Q984
$$ 30695 33868 52355 38781 29974 14456 1290 -6061 -18614 -14988 -12335 -6408 1642 10626
9629A0626Q104m999J4254p702l7772k0707J0458L6758K5411K2877k1501k6159
$$ 10626 18730 13731 27985 20283 -17489 -38196 -27738 9020 34431 57308 35807 9648
9617I648o363o447R68K178l079L028m767j7183q720j7270N432J4214K4125J0206
$$ 9648 3285 -3162 -2194 -16 -3095 -67 -4834 -22017 -30737 -48007 -42575 -28361 -4236 5970
9603E970P095J0456m145j1065j2432L194k1554n635J1879K8268j0766K340M598
$$ 5970 13065 23521 19376 8311 -4121 -927 -22481 -28116 -16237 12031 1265 3605 8203
9590H203M215n335r888j2482J9820K1869k3201k8336q075J4996J3555J6683r6
$$ 8203 12418 7083 -2805 -15287 4533 26402 3201 -25135 -33210 -18214 -4659 12024 11928
9577A1928J1037q049k3705n977J5684q442j2077J907j1673K042J3662K4763o990
$$ 11928 22965 14916 -8789 -14766 918 -7524 -19601 -17694 -29367 -27325 -13663 11100 4110
9564D110Q971J2110n613j651P481K0870n373r072k1054N636o114Q225N76J6358
$$ 4110 13081 25191 19578 17927 25408 46278 40905 31833 10779 16415 10301 18526 19102 35460
9550C5460j5271J183J065O919R569L332L959j4501L222R123k5902k6390j1459
$$ 35460 20189 21372 22437 29356 38925 42257 46216 31715 34937 44060 18158 -8232 -19691
9537a9691j496L96K3187L2224L123J5600r730K8398j598l3776l4890j0377j5057
$$ -19691 -21187 -20791 2396 34620 37743 53343 43613 72011 70413 36637 1747 -8630 -23687
9524b3687K4381L5249k2153o288k2745L1462J3191n117k5740k1332K610M538K6388
$$ -23687 694 35943 13790 7502 -15243 16219 29410 24293 -1447 -22779 -20169 -15631 10757
9511A0757K6749o855l5955k606j0677O845j3701j8259J2699K4694J0238N843k3662
$$ 10757 37506 30651 -5304 -7910 -18587 -11742 -25443 -43702 -31003 -6309 3929 9772 -13890
9498a3890p781O702K4681O341r01J0727L2708j6906j2343k8344r080j3020M11
$$ -13890 -21671 -14969 9712 16053 15152 25879 58587 41681 29338 994 -8086 -21106 -20695
9485b0695K580N144R755j0491r361n227J953J4934L6291J5680M149m888J5009
$$ -20695 -18115 -12971 -3216 -13707 -23068 -28295 -26342 -11408 24883 40563 44712 39824 54833
9472E4833k1424p414q48P793L421O835K753j5699j1743k0109k5940K0480J6846
$$ 54833 33409 25995 25147 32940 36361 43196 45949 30250 18507 -1602 -27542 -7062 9784
9459I784k609n237j5815K8171N39K879O542J7895R485n039l7825l5990J0112J0428
$$ 9784 7175 1938 -13877 14294 14833 17712 24254 42149 51634 46595 8770 -27220 -17108 -6680
9445f680M553k447j4987n626Q526K3838j9250J0232j1515j2094J8395K2545J613
$$ -6680 -2127 -4574 -19561 -25187 -16661 7177 -12073 -1841 -13356 -25450 -7055 15490 17103
9432A7103K5567K5472j4318n2065k7464j69j97R008M268K826K1966J20j7108k4406
$$ 17103 42670 68142 53824 1759 -25705 -25874 -26071 -17063 -12795 -9969 11997 12117 -4991 -29397
9418b9397j2347J6605j0494j1516K2572p892k667J6757j0048J1192K62p61J9738
$$ -29397 -41744 -25139 -35633 -47149 -24577 -32469 -35136 -18379 -28427 -17235 -16973 -17734 2004
9405B004N976m523J0300j6128J2707M631j8945n269m222J5333Q978P910j9749
$$ 2004 7980 3457 13757 -2371 10336 14967 -3978 -9247 -13469 1864 10842 18752 -997
9392i97j3961J3606l493J2054K4316j3909j6844L259K7879J4749J9108K0122K728
$$ -997 -14958 -1352 -4845 7209 31525 17616 772 4031 31910 46659 65767 85889 88617
9379H8617j8456m5773k1999J1094o04q663j2047J7525p243j8482J3003K691r25
$$ 88617 70161 24388 2389 13483 12879 4216 -7831 9694 2451 -16031 -3028 -337 -1262
9366a262L075N224j0749O295J8210j6325j9084k0179J8971J4620J3476N329L736
$$ -1262 1813 7037 -3712 2583 20793 4468 -14616 -34795 -15824 -1204 12272 17601 21337
9353B1337p044j585r287R184n251J5549J1045J703J4491j7376k5604o290M62K2453
$$ 21337 14293 12708 3421 12605 7354 22903 33948 35651 50142 32766 7162 872 1334 23787
9339B3787q900n667o986K4108K180j894k7603K166L6336L1143J4476j806j0072
$$ 23787 14887 9220 2234 26342 28522 26628 -975 1191 37527 68670 83146 81340 71268
9326G1268J3745M655K115j6621K92J0417j5768k1600J5613Q404j2528k6036K426
$$ 71268 85013 89668 91783 75162 75454 85871 70103 48503 64116 72520 59992 33956 36382
9313C6382O546r943K1947L480K7844L5977j0360K3453K7293K6831J6123J9545
$$ 36382 42928 32985 54932 58412 86256 122233 111873 135326 162619 189450 205573 225118
9301B25118J2925L0089O0783L0322M8350P9977R8008J98626K49932L15166M04707
$$ 225118 238043 268132 328915 359237 407587 487564 585572 784198 1034130 1349296 1754003
9290A754003N43245O36517O23082O40229P11707O58346N32511P86121J289022
$$ 1754003 2297248 2933765 3556847 4197076 4908783 5567129 6099640 6885761 8174783
9281H174783K064267L240027M618448K600924m763648o738201l938807j920729
$$ 8174783 10239050 13479077 18097525 20698449 15934801 9196600 5257793 3337064
9273C337064j035601o05296l76074k87981k27020j62696j21204r3158l6762j6374
$$ 3337064 2301463 1696167 1320093 1032112 805092 642396 521192 428034 391272 374898
9263C74898k0408m9146m8907k7600k783j0190n661N083M37m2442k4059n940J569
$$ 374898 354490 305344 256437 228837 226054 215864 210203 215286 215723 173281 149222 143282 144851
9250A44851k9396j0364r616M200p753j079J2288q942k947k9145K022J8309L013
$$ 144851 115455 105091 95475 99675 91922 90843 103131 94189 91242 62097 64119 82428 85441
9237H5441m996k0121J5056O69j1773l1285r688n444m131L085J0678J8677k1288
$$ 85441 80445 60324 75380 76049 64276 32991 23303 17859 13728 16813 27491 46168 24880
9224B4880P38J4266l894l4356j7064p40R145K1208Q675K619M032O926L179k2683
$$ 24880 25618 39884 35990 1634 -15430 -16170 -7025 14183 22858 25477 29509 36435 39614 16931
9210A6931M169k1713J701J2478l1499r902N732l82K2937J3840j3346J0391L504
$$ 16931 21100 -613 1088 13566 -17933 -27835 -22103 -22485 452 14292 946 11337 14841
9197A4841J202K1378n044m420j7921P204j5973m6490Q993L2554M1036N090m062
$$ 14841 16043 37421 32377 27957 10036 17240 1267 -45223 -36230 -3676 37360 42450 38388
9184C8388k2679j853K6763K2744K549k2756j8349J0443J2035J4228k870j7201
$$ 38388 15709 13856 40619 63363 65912 43156 24807 35250 47285 61513 58643 41442
9172D1442j8025j0738k1458j5112O573J8518J4585K0559j9189J1181J7382p102
$$ 41442 23417 12679 -8779 -23891 -17318 1200 15785 36344 17155 28336 45718 38616
9160C8616p448j0975n460M945J8442M009k3625j0752L995m0482J7092K4746K8399
$$ 38616 31168 20193 14733 19678 38120 42129 18504 7752 11747 -28735 -11643 13103 41502
9147D1502j748l878J3505k79J5179K322L4493L494l7162j3056m121j1073p460
$$ 41502 39754 35876 49381 49102 64281 66603 101096 104590 67428 54372 50251 39178 31718
9134C1718j873O464k2898j2524K1229j6319j8175k957K391J8162J0083j0216n660
$$ 31718 29845 36309 13411 887 22116 5797 -12378 -15335 -12944 5218 15301 5085 -575
9121e75N686J895J9049J8704M488j0062m2390j510j3865o729K5030j238j511O441
$$ -575 5111 7006 26055 44759 49247 39185 -3205 -4715 -18580 -25309 -279 -1517 -3028 3413
9107C413O477j9422j5746K6060O286k8Q828l250j0828K7930m293k2419O656P34
$$ 3413 9890 -9532 -25278 782 7068 7040 15868 12618 1790 29720 25427 3008 9664 10398
9093A0398O837j6157k09M1117j1135j2152K267j955j5124R592K8292J5211l0656
$$ 10398 17235 1078 869 41986 30851 18699 20966 19011 3887 13479 41771 56982 26326
9080B6326l6048j1j1339j1478L410p204O868K5989j1268l2232j3012J1136M1217
$$ 26326 -9722 -9733 -21072 -32550 -29140 -36344 -29476 -3487 -14755 -46987 -59999 -48863 -7646
9067g646m346K3781K3701j0311k200Q565J755j3640o487p0k007j6749R167J8361
$$ -7646 -11992 11789 35490 25179 22979 31544 33299 19659 13172 13102 11095 -5654 3513 21874
9053B1874M554j0197p507k369J8829k467J232J6521j3895n162j0091k4049o575
$$ 21874 26428 16231 8724 6355 25184 22717 23949 40470 26575 21413 11322 -12727 -19302
9040a9302j2203j879J9551O092n751m086J1419K1592o675k7205L373K2682j192
$$ -19302 -31505 -33384 -13833 -7741 -13492 -17578 -6159 15433 8758 -18447 -15074 7608 6416
9027F416o317n615j4289J4030J0899J0487J2547O279k966Q05r455j9406J8995
$$ 6416 99 -5516 -19805 -5775 5124 15611 28158 34437 31471 32276 22821 3415 22410
9014B2410K4119J3230L212k009k5938j9063K6117J2227j5779n204j1511O876O793
$$ 22410 46529 59759 62971 60962 35024 15961 42078 54305 38526 33322 21811 28687 35480
9001C5480k4441k3161J3743j994l520J6120l27Q191R817j3708K854m983m780q006
$$ 35480 11039 -12122 1621 -373 -3893 12227 11900 20091 29908 16200 19054 14071 9291 1285
8987A285k877J8694k123L642k3999j0735J1526q252L2294K1260j5414J5862J7165
$$ 1285 -1592 17102 14979 18621 -5378 -16113 -4587 -12839 19455 40715 25301 41163 58328
8974E8328j5510k3062l6843K7515N1724J4424m261j1685n008j7311n536O528l785
$$ 58328 42818 19756 -17087 10428 62152 76576 72315 60630 55622 38311 32775 39303 35518
8961C5518j3539j1430q295j2241n34r706J5841k4486l285P208j1044j4641J7320
$$ 35518 21979 10549 2254 -9987 -10521 -20227 -4386 -28872 -32157 -24949 -35993 -50634 -33314
8948c3314L4051q159J2441O931p226l154k7652J763j591R320k1347J5216J6872
$$ -33314 737 -7422 5019 11950 4724 1570 -26082 -24319 -25910 -16590 -37937 -22721 -5849
8935e849L1425j0345l0296N644J6778k890N254J2861K3371K0589j5656m8861k6236
$$ -5849 25576 15231 -15065 -9421 7357 4467 9721 22582 45953 66542 50886 2025 -24211
8922b4211P231j595J351l714J7574J6216k3640Q33J8835K0434l894j0829j6123
$$ -24211 -16980 -18575 -17224 -20938 -3364 12852 -10788 -9955 8880 29314 25420 14591 -1532
8909a532n954J4612k0642j2998l868K721L0022K3187j3288J855J3342K0839O280
$$ -1532 -7486 7126 -13516 -26514 -30382 -27661 2361 25548 12260 14115 27457 48296 54576
8896E4576k7977J6678N503k5527k2313j4008O77r48J193O276J6822P06r630n16
$$ 54576 26599 43277 48780 23253 940 -13068 -12391 -13339 -12146 -5870 10952 11658 2028 1512
8882A512J7637J1552K6962o582m1563l0806J9639n80k1300k177k684n707J2588
$$ 1512 19149 30701 57663 51081 9518 -21288 -1649 -2229 -23529 -25706 -28390 -34097 -21509
8869b1509J3704Q016K123J6882k497k9134k4968K7522K2074k7067N276J446k1393
$$ -21509 -7805 211 2334 19216 16719 -12415 -37383 -9861 12213 -14854 -9578 -8132 -29525
8856b9525m961J7925J6737J0139K3472O845L0275L1461p153n0748m0212j0187
$$ -29525 -34486 -16561 176 10315 33787 40632 70907 102368 95215 44467 4255 -5932
8844e932j1975M830j7243j0405L730J5965L533N463K6300r479o950Q945n071k1687
$$ -5932 -17907 -13077 -30320 -40725 -36995 -21030 -17497 -12034 14266 4787 -2163 6782 1711 -19976
8830a9976o14J0069k2891o018J6041o746j568L0146J2325Q601P977j8618K136
$$ -19976 -20590 -10521 -33412 -39430 -23389 -30135 -31703 -1557 10768 19369 27346 8728 10864
8817A0864Q792j0511J3399j0805j8549j202J8246K121l3751J5782L0888l193m5298
$$ 10864 19656 9145 22544 11739 -6810 -8012 10234 12355 -21396 -5614 25274 22081 -23217
8804b3217M565K767L735j6238K6940K0197j9590o296M957k3480M382K4974L541
$$ -23217 -18652 -15885 -12150 -28388 -1448 18749 -841 -7137 -2180 -25660 -21278 3696 7237
8791G237J3431k3237k5756j5377L1281J3217k0304K449K100n495J2808K5006J6479
$$ 7237 20668 -2569 -28325 -43702 -12421 796 -19508 -17059 -14959 -20454 -7646 17360 33839
8778C3839P28n643j2011K4723p988k7097m2334o287L5782J9321j5234N358O284
$$ 33839 34567 28924 16913 41636 33648 6551 -35783 -42070 -6288 13033 -2201 3157 9441
8765I441J6752J5718j1230j7218m270J0621j1563q481j4627O197J3493J2177p400
$$ 9441 26193 41911 30681 13463 9193 19814 8251 -230 -14857 -8660 4833 17010 9610
8752I610n915j1014J6405Q977j7345j9158J6105K2399N316p385K8382K4222j2240
$$ 9610 3695 -7319 9086 18063 718 -18440 -2335 20064 25380 17995 46377 70599 58359
8739E8359p902m714j0984j3177l987Q119L8064k268k952j5326j8722j6738k938
$$ 58359 50457 45743 34759 21582 17595 25714 63778 61510 58558 43232 24510 7772 4834
8726D834M640P5j5459J038R70k4925k3028J6179L3103L8695J9402j6678P086P168
$$ 4834 9474 9549 -5910 -4872 -3902 -28827 -51855 -35676 -2573 36122 55524 38846 45932 53100
8712E3100N997O446n742j7792L942K6100J2343k4710k1772j7227j6490K1296K0508
$$ 53100 59097 65543 59801 42009 45951 72051 84394 59684 37912 20685 4195 25491 45999
8699D5999j7622Q910O337k0485m355O161J7246k8161k7023K4352L1686J1104j3853
$$ 45999 28377 37287 43624 23139 18784 24945 42191 14030 -12993 11359 43045 54149 40296
8686D0296k4062j0750k2166L830L1189J1994j7321M1392K7980k541r479k1295
$$ 40296 16234 5484 -16682 -12852 18337 30331 13010 54402 82382 79841 70362 49067
8674D9067j3910k6356j9157J4806J1850p121K180J3585M975J6794R338M423q053
$$ 49067 35157 8801 -10356 4450 16300 9179 11359 24944 29919 46713 56051 60474 52421
8661E2421j8150j5735K2355n11K362L0037J0059m0224l3534L4596J8019M635k3402
$$ 52421 34271 18536 40891 40380 42742 72779 82838 42614 9080 43676 61695 66330 42928
8648D2928L405L111o646L3047K3622n562L0121J5712q02J9799j2686j0908L0368
$$ 42928 46333 49444 42798 75845 99467 93905 124026 139738 138936 158735 146049 135141 165509
8635A65509P0138O1483K3808j5799n4322o0830j2582P3j6527k1699l5435m299
$$ 165509 235647 297130 320938 305139 250817 189987 177405 177478 160951 139252 103817 99518
8623I9518J1413J4934N56Q810J8861j683j8873L2152J7260j0070K798J9161J6089
$$ 99518 110931 125865 126421 135231 154092 152409 133536 165688 182948 172878 175676 194837 210926
8610B10926o801O431K4570K1185J1075L1314J6066m453k3280j4519j0123K5506
$$ 210926 204125 210556 235126 256311 267386 298700 314766 310313 287033 272514 262391 287897
8598B87897K2014k987j6634L6639J5419m388J4099J8198L8817O7342O9930k0977
$$ 287897 309911 306924 290290 326929 342348 337960 352059 370257 409074 476416 546346 525369
8586E25369j11722r1883o3286l5335k9574j8091P733M301k7668l0549k2315J1727
$$ 525369 413647 321764 258478 223143 193569 175478 183211 187512 159844 129295 106980 118707
8574A18707R55l4827L67r803k956K1113J9237j4394n0746k2576Q284K6415j843
$$ 118707 119662 84835 85202 75399 72443 93556 112793 98399 47653 25077 33361 59776 57933
8561E7933k4795L571K3207J8203l0224L775J5699J0386p026j6647j4398r259K6670
$$ 57933 33138 36709 59916 78119 47895 51670 67369 77755 70729 54082 39684 30425 57095
8548E7095M7446N2959K9619p861k729Q793J3595l7749o6372n4757j3305j8292
$$ 57095 104541 157500 187119 179258 176529 185322 198917 161168 94796 40039 26734 8442
8536H442J0719J988N83n441o570j2707m851j2321K3957L4755j4832J927K5412
$$ 8442 19161 21149 21732 16291 9721 -2986 -7837 -20158 3799 38554 23722 25649 51061
8523E1061O906k0531k1869J2966q300r420n825j1655j4788k6996j296K7692L4847
$$ 51061 57967 37436 15567 28533 20233 10813 4988 -6667 -21455 -48451 -49747 -22055 12792
8510A2792J6300K4040k4068j3952N983j1615j4959O467j1310n567j2854N44j9868
$$ 12792 29092 53132 29064 15112 21095 9480 -5479 988 -10322 -15889 -28743 -28199 -48067
8497d8067L1907J3090L12N26J675L562P195N027K5485k521j7314l975p687m107
$$ -48067 -16160 -3070 -2758 -2232 -557 3005 10200 15227 40712 38191 20877 16902 9215 5108
8483E108L1113j2202o81j2560k843N525k9075L717J8836o223q624L2137k4849
$$ 5108 36221 24019 23338 10778 7935 13460 -15615 -11898 6938 715 -7909 24228 -621
8470f21l4243j8312J1609l523R240j005L432J0230K8632P113o3j8853j3396n346
$$ -621 -34864 -53176 -41567 -45090 -35850 -36855 -33423 -23193 5439 12552 12489 -6364 -19760 -25106
8456b5106O441K2900j1803k1262K369J2226M5242K1669L4931j9967j5609j2669
$$ -25106 -18665 4235 -7568 -28830 -26461 -14235 31007 52676 87607 67640 52031 39362
8444C9362q013k0142j9357j2296N009M389m415q566j1906j2421K2061K9010J011
$$ 39362 31349 11207 -8150 -20446 -15437 -11048 -15463 -24029 -35935 -48356 -26295 2715 3726
8431C726j9961k5160K426L8515J6601l0141N939J5387r51m456j271J7296o216
$$ 3726 -16235 -41395 -38969 -454 16147 -13994 -8055 7332 6381 1925 654 17950 11734
8418A1734j2393j0762J1570L9447K7175J2566l991k0851k1302o872n482j0362
$$ 11734 -659 -11421 149 39596 66771 79337 75346 54495 33193 26321 20839 10477
8406A0477L30O141J2241N786K4132j0685l6128J20J5113Q389j0090O352J9616
$$ 10477 10807 16948 29189 34975 59107 48422 12294 12414 27527 35916 25826 32178 51794
8393E1794k0052j2614P393j8288k8255j3219L1976Q517q479N022k416J1813J29
$$ 51794 31742 19128 26521 8233 -20022 -33241 -1265 7252 -1227 3795 1379 13192 13321
8380A3321L360O936k3018m245P624P732j1169j7753j1347J5455K4258K4652O733
$$ 13321 16681 23617 599 -3646 3978 11710 541 -17212 -28559 -13104 11154 35806 42539
8367D2539j4604l268m947j4222N80J6353j917J1036J6313m5890k0820n256L3938
$$ 42539 27935 24667 19720 5498 6078 22431 20514 31550 47863 1973 -18847 -24103 9835
8354I835J0507k39n028Q798J4668k6985O368j787j9689j8164k9369J5442M5728
$$ 9835 20342 20103 15075 23873 38541 11556 17924 16137 -3552 -21716 -51085 -35643 10085
8341A0085K3319p613K5354l701j9440j7202K3246K2573k9187k3875J7794J6400
$$ 10085 33404 25791 51145 47444 28004 10802 34048 56621 27434 3559 21353 37753
8329C7753o697p142r141J620J2661j3529M347J0525L4350O698m3031l840N432
$$ 37753 31056 23914 14773 16393 29054 15525 19872 30397 64747 71445 28414 24574 30006
8316C0006P13j346l1368j1660J5467N402k0471K2951J6303J3192Q216k2737j8395
$$ 30006 30719 29373 -1995 -13655 1812 7214 -13257 9694 25997 39189 47405 24668 6273
8303F273k6822j260L1485P293k0390J3327k705j1833l450J495j0242J1384K412
$$ 6273 -20549 -21809 9676 16969 -3421 9906 7201 -4632 -8082 -6587 -16829 -5445 -3033
8290c033Q424J5166j5152K323J8266P339j4365r476k5518j956R093o267K2209
$$ -3033 5391 20557 5405 7728 25994 33333 18968 9492 -16026 -17982 -8889 -15156 7053
8277G053K7145j2439N895o067l7802j4848j0411J258J4709J755o470n99N678M966
$$ 7053 34198 21759 27654 21587 -16215 -31063 -41474 -40216 -25507 -23752 -30222 -30821 -25143 -20177
8263b0177o534J5028K4149J797q073j26J6644l696j7938j6276k0784m635K6580
$$ -20177 -26711 -11683 12466 14263 6190 6064 22708 19012 1074 -15202 -35986 -40621 -14041
8250a4041L1940J0231m99K8254L644l4694q819m285j9001k0882r248Q453K4457
$$ -14041 17899 28130 27631 55885 59529 24835 16016 11731 -7270 -28152 -37400 -28947 -4490
8237d490J7845j5840l3261m31J4781R195J0552K0914m424r887P67p665J981J8461
$$ -4490 13355 -2485 -35746 -36177 -21396 -12201 -1649 19265 14841 4954 5721 -1944 37 18498
8223A8498P44P031K449j8803l0021l728j9678R175q342R20K8232K147N552K62
$$ 18498 19242 26273 28722 9919 -20102 -23830 -43508 -34333 -42675 -41755 -13523 -11376 -5824 -5562
8209e562J2765Q999J4667k8507l6891j3441L903K0861K5414r984k2160M1807j4075
$$ -5562 7203 16202 30869 2362 -34529 -47970 -44067 -23206 2208 -7776 -29936 11871 -2204
8196b204k7658L997L429K7831K250j1258J6181O107q817j973J6768k6566L491
$$ -2204 -29862 -25865 -22436 5395 7645 -3613 12568 18675 9858 7885 24653 -1913 1578
8183A578k2939j5245J3088N526l1848J9283K2102p76J801l4416j7439L1569K4727
$$ 1578 -21361 -36606 -23518 -17992 -49840 -30557 -8455 -9231 -7430 -41846 -59285 -27716 -2989
8170b989J5024N752l8147j5346J2926K4315P493K2367k0374k1611K908J3413r57
$$ -2989 12035 17787 -20360 -35706 -22780 1535 9028 31395 11021 -10590 -7682 5731 4774
8157D774j9272l0911j4671K7880J5995Q121J5390R578P517q463j4389L0062P630
$$ 4774 -14498 -45409 -60080 -32200 -16205 -8084 7306 16884 24401 15938 1549 31611 39241
8144C9241j0068j6337J3848L3990l709k9073R0L763K5405k2861m6816m067k448
$$ 39241 29173 12836 26684 60674 56965 27892 27982 31745 57150 34289 -12527 -16594 -19042
8131a9042j2454K33J2054P729o672J1347k960j4322K7235m265o870J2213P718
$$ -19042 -31496 -31263 -19209 -11480 -18152 -6805 -9765 -24087 3148 -1117 -7987 4226 11944
8118A1944l012R356r569J2262m401m109O740J6431M992J368k2402j7521L0877
$$ 11944 8932 18288 8719 20981 16580 12471 19211 35642 40634 42002 19600 2079 32956
8105C2956K4791k3640q483j9240K4494K2555R564l1319m0974j1795K0454J7540
$$ 32956 57747 34107 25624 6384 30878 53433 62997 31678 -9296 -21091 -637 16903
8093A6903N911k6864M597J3796J4525M425l4483j2223l849p020k701K2520R402
$$ 16903 22814 -4050 547 14343 28868 33293 -1190 -13413 -17262 -24282 -26983 -4463 4939
8080D939k5985j5810J6079J1505m056J2755k1578j2183M1804L5878q226Q279k920
$$ 4939 -21046 -36856 -20777 -9272 -13328 -573 -22151 -34334 7470 43348 35122 43401 40481
8067D0481k2741k3364N814p091j0342j3013K3264L7021p447p278O935Q645K7209
$$ 40481 17740 -5624 190 -6901 -17243 -30256 -6992 30029 22582 15304 22239 30884 58093
8054E8093J3253q287k3220l04k6094j1333K180J2551M752l121K422j4609m951
$$ 58093 71346 63059 39839 39535 13441 2108 4288 16839 21591 18470 20892 6283 1332
8041A332J9627L2944J4975L1199P649k6683j4360K1259o348K2111L828k5190k9721
$$ 1332 20959 53903 68878 100077 107726 81043 66683 87942 81594 103705 107533 82343 52622
8028E2622j0855J3475j421J9492Q427K103J2781N878K2087J0567k4197j6943j659
$$ 52622 41767 55242 53821 73313 81740 83843 96624 102502 124589 135156 110959 94016 92357
8015I2357k879j5030J9444J329k0561M366Q072p502j912j1788l4175R497N6621
$$ 92357 89478 74448 93892 95221 74660 79026 87098 79596 77684 65896 31721 41218 97839
8002I7839L8811J8285K4800j6023k2351L5453K6582M2623J3319L5984L3020J9310
$$ 97839 136650 154935 179735 163712 141361 176814 203396 246019 259338 295322 328342 347652
7990C47652L7996l2441m9944n5162m9500K232K027L003K429M996K7746J6655J168
$$ 347652 385648 353207 303263 248101 198601 200833 202860 205863 208292 213288 241034 257689 258857
7977B58857j0904l7871m5360k5031k9239j2854L172p062l2412j9780J4004K3744
$$ 258857 247953 210082 164722 139691 110452 97598 100770 93708 61296 41516 55520 79264
7965G9264J0344j063k1718l190J9502K5021K4413M835Q686j5232J152Q95l030
$$ 79264 89608 88545 66827 63637 83139 108160 132573 137408 146094 130862 132014 132909 129879
7952A29879J3285L4926J7317K9499L2607J5942q98j361j484k478m8782m6997j5212
$$ 129879 143164 178090 195407 224906 257513 273455 272557 271196 269712 267234 218452 171455 156243
7939A56243R951M9296K0065J4542l4915o5668l6631j6143j1842j5298j1458k422
$$ 156243 166194 215490 235555 250097 215182 149514 112883 96740 84898 69600 58142 55720
7927E5720K0382p847k5350p650P149M827n129k9079p876J9491M0696J1481k5859
$$ 55720 76102 68255 42905 35255 42404 47231 42102 13023 5147 24638 65334 76815 50956
7914E0956j0088j692M700J1178J6111J0860j9633J2641K5320L860M796j6023j8394
$$ 50956 40868 39176 43876 55054 71165 82025 62392 75033 100353 104213 109009 92986 74592
7901G4592n67l6385q406R849N538J3356J1388k3881j1810L517j2944l217K0736
$$ 74592 74025 37640 29234 39083 44621 57977 69365 45484 33674 37191 24247 21030 41766
7888D1766m048n999j0866r735O152J3392j7731j9155R454r50J0322P805Q870j5259
$$ 41766 37718 31719 20853 11118 17270 30662 12931 -6224 3230 2280 12602 20407 29277 14018
7874A4018K1264l109o521q751j9477N766O235k5109k4517K0905N688J112k0133
$$ 14018 35282 32173 25652 16901 -2576 3190 9425 -15684 -40201 -19296 -13608 -12496 -32629
7861c2629J908J8333J5491j8092O434L3884j2808k9266K2183p596m674m431J894
$$ -32629 -30721 -12388 3103 -14989 -8555 25329 12521 -16745 5438 -2158 -6832 -11263 -9369
7848i369K8930n841q354J3807J024k2618j8838L0005P161m82k1047j5787o957
$$ -9369 19561 13720 5366 19173 20197 -2421 -21259 8746 15907 15425 -5622 -21409 -28366
7835b8366Q186J906O997p689L941n410L756j1620p179r374j3567L165L1814L089
$$ -28366 -20180 -18274 -11277 -18966 -15025 -20435 -16679 -28299 -35478 -44852 -58419 -55254 -23440 -20351
7821b0351R841J3926J313j1182K618l553k9214j1975R972K1759J0608l5824k9635
$$ -20351 -10510 3416 4729 -6453 -3835 -7388 -36602 -48577 -38605 -16846 -6238 -42062 -71697
7808g1697P730M2478J8549K5531N720l0901m1941j947J011K1330k797j7090j6336
$$ -71697 -63967 -21489 -2940 22591 28311 -2590 -44531 -46478 -45467 -24137 -26934 -44024 -60360
7795f0360q183J4699M9844N219J88l6134j4421K9255Q620J616P541O135k0928
$$ -60360 -68543 -53844 -4000 1219 1407 -34727 -49148 -19893 -11273 -9657 -2116 4019 -16909
7782a6909l1360M351J384j1603L280L4939J56k2094j8411j1331K2878M6686N994
$$ -16909 -48269 -43918 -42534 -54137 -50857 -15918 -15762 -37856 -56267 -67598 -44720 1966 7960
7769G960k3097j3675j2484J4224M075k8708n052K3889J1445Q709J1441J3188N147
$$ 7960 -15137 -28812 -41296 -27072 -22997 -51705 -56757 -32868 -21423 -12714 -1273 11915 17062
7756A7062p4m3973j9894M668L2999J6102Q67r264k8853j589J7667O070k5671P128
$$ 17062 16988 -26985 -46879 -42211 -9212 6890 7757 -1507 -30360 -31949 -14282 -8212 -33883 -26755
7742b6755J1459K5397K1198J0777n699k4887j1375m108J5807R771m280J0470j3458
$$ -26755 -15296 10101 31299 42076 36377 11490 115 -3993 11814 21585 17305 27775 14317
7729A4317r326k725k5292O46J4285k5306J1588j3901j7281L619K2932q873q659
$$ 14317 4991 2266 -23026 -22380 -8095 -33401 -21813 -35714 -52995 -49376 -26444 -35317 -43976
7716d3976K5749K3187J3948m434j1697l0143k9244M9577K8162l1193n141J981
$$ -43976 -18227 4960 18908 14474 2777 -27366 -56610 -7033 21129 -10064 -15205 -13224
7704a3224K2460J8265J0756k0333l4998J4711K1957m363j4137K98J1908j3488
$$ -13224 9236 27501 38257 17924 -17074 -2363 19594 15231 1094 1392 13300 -188
7692a88m616j0543P997l140k4879Q652K986p341N688k172J7465l720k2068j4394
$$ -188 -4804 -15347 -7350 -10490 -35369 -26717 -23731 -31072 -25384 -27556 -10091 -13811 -35879 -50273
7678e0273j499K1865J8368L6726j1463j2929M212J4389j2531r872J9207Q024j5859
$$ -50273 -51772 -29907 -11539 25187 13724 795 5007 19396 6865 -3007 16200 24224 8365
7665H365L906j7559k5397J033J9997J1851J2642k9678k4296J2873J7723O230J0409
$$ 8365 12271 -5288 -30685 -29652 -9655 2196 14838 -14840 -39136 -26263 -8540 -2310 8099
7652H099J8517j6079k2866K3097J9367k2446j7206K0285j791j0143j2280l0268
$$ 8099 26616 10537 -12329 10768 30135 7689 -9517 10768 8977 -1166 -13446 -43714
7640d3714j8771K7025K9772o126J9333j6364j1128J0239j2215L021o645P025R934
$$ -43714 -62485 -35460 -5688 -11814 7519 -8845 -19973 -9734 -21949 -18928 -25573 -18548 -8614
7627h614j7030O7K1336P189k569J4952o497k5655J1126o352J5620k139m717l704
$$ -8614 -25644 -25577 -4241 2948 379 15331 8834 -16821 -5695 -12047 3573 1434 -3283 -6987
7613f987Q053K0571n28J4680m238N848M140m306j2532K2005O492l4711k2135r904
$$ -6987 1066 21637 21109 35789 31551 37399 41539 37233 24701 46706 53198 18487 -3648 -13552
7599a3552K2408J8276K771L558r162j9626j0514k210J5189K831k5776k2772L4298
$$ -13552 8856 27132 29903 33461 24299 4673 -5841 -8051 7138 9969 -15807 -38579 -4281
7586d281q496j8843l397L1402J1019j1748J4628L998l0399j3214K1824L673Q952
$$ -4281 -12777 -31620 -35017 -3615 7404 -4344 10284 14282 -16117 -29331 -7507 -3834 5118
7573E118k4794L0197k2876l0522l183J565R376J3663J0297P947n958p927J805
$$ 5118 -19676 10521 -12355 -42877 -46060 -44495 -35119 -21456 -11159 -3212 -9170 -17097 -15292
7560a5292j1321N041J0941j9503l3005J5596K4105L8249Q392k1776j0990J9557
$$ -15292 -26613 -21572 -10631 -30134 -63139 -47543 -23438 14811 23203 1427 -9563 9994
7548I994j399l908k9723P412R78j0849K6495K4205Q036m2755j5439J3548J290
$$ 9994 8595 4687 -25036 -17624 -16646 -27495 -1000 23205 31241 -11514 -26953 -13405 -12115
7535a2115r503J0161n3N416K6857j8123J1775j7010J9500k638l4982K6254J5771
$$ -12115 -21618 -11457 -11510 -6094 20763 2640 14415 -2595 16905 14267 -20715 5539 21310
7522B1310l804q839J5099j101l474o927k3411j0028N907J3296L1567j3172o38
$$ 21310 17506 8667 23766 22665 19191 12264 -11147 -21175 -15268 -1972 29595 16423 15785
7509A5785q879j9960j1393o664R123Q478K2951k525Q725p990l110k3628j0207
$$ 15785 6906 -13054 -24447 -31111 -21988 -13510 9441 6916 15641 7651 4541 -19087 -29294
7496b9294J5818J2340k2755O440Q943L934j5950n730J1981J8499J4514k687k0500
$$ -29294 -13476 -1136 -23891 -17451 -8508 -4574 -20524 -26254 -14273 4226 18740 16053 -4447
7483d447r435q908M240k1537q580j45L4771k967N617p324k932P098k1803j7338
$$ -4447 -13882 -22790 -18550 -40087 -48667 -48812 -14041 -17008 -11391 -18715 -21647 -14549 -36352 -53690
7469e3690Q848J6616J3945J4515j3969n296R637J6221P150L279k1524n047Q256
$$ -53690 -44842 -28226 -14281 234 -13735 -19031 -9394 6827 13977 17256 -4268 -9315 -1059
7456a059J4569R409l097q908j3494l020n184n498J0111J035k2908r960p186J3251
$$ -1059 13510 22919 19822 10914 -2580 -5600 -10784 -16282 -6171 -5136 -28044 -38004 -45190 -31939
7442c1939K0622J4153j0503J517p64k730K1783q409n520j016L1241L3966k30r230
$$ -31939 -11317 2836 -7667 -6150 -6914 -9644 12139 3730 -1790 -2806 28435 62401 62171 52941
7428E2941l3247l4826j1432J8499J671m831N141l510m326J7012Q171j0846r620
$$ 52941 19694 -15132 -26564 -8065 -6394 -11225 -6084 -9594 -13920 3092 11263 417 -9203
7415i203j7215O592L10n154O063J2369K4072M402l9800j3222J1719J829J5119
$$ -9203 -26418 -19826 -19516 -24670 -18607 -6238 17834 22236 -17564 -30786 -19067 -17238 -2119
7402b119R454J9570j4970k9341N993J08l4081j6266N336L7000k689j2924K2791
$$ -2119 7335 26905 11935 -17406 -11413 -11305 -45386 -61652 -56316 -19316 -22005 -34929 -12138
7389a2138O561m664L2316j2942k2430K084L4848N26M059K2746k848k8142j9060
$$ -12138 -5577 -10241 22075 9133 -13297 -11213 23635 24161 28220 50966 48118 19976 916
7376I16o812O084n620o254L1071M424o154L126K4847M061j8244L667k6641k9789
$$ 916 -5896 188 -5432 -11686 19385 23809 17655 20781 45628 49689 31445 35112 8471 -21318
7362b1318J453p365J7316J0577J3973j8980j1991k0778q753J9143J0858P004j4739
$$ -21318 -19865 -27230 -9914 663 14636 -4344 -16335 -37113 -45866 -26723 -15865 -8861 -23600
7349b3600j4806k172J6513L233L8145j2449k3950J0005k019m68J9093K2236j0635
$$ -23600 -38406 -40578 -24065 -20832 17313 4864 -19086 -9081 -11100 -11568 7525 29761 19126
7336A9126k0049Q758K598k3089j986Q778M502J7921l820j7019Q722K8701J7563
$$ 19126 -923 7835 10433 -12656 -14642 -5864 -1362 16559 12739 -4280 4442 33143 50706
7323E0706k2854j1905O184j8442k654M305q970J5171L3776k8268m27q466j4637
$$ 50706 27852 15947 22131 3689 1035 5340 -3630 11541 45317 17049 16622 8156 -6481
7310f481q52r415k1660l630K9028J0752q023r620M492n96M128J0872j1403J2084
$$ -6481 -7333 -16748 -38408 -42038 -13010 -2258 -10281 -19901 -15409 -16005 -11877 -1005 -12408 -324
7296c24M255l7353k046J1831K1180o156J0435J145j3921k4753J469J5742n135
$$ -324 3931 -33422 -35468 -23637 -2457 -8613 1822 2967 -10954 -35707 -34238 -18496 -23631
7283b3631j9366Q108J0437J0901J5124j3697j37k5251j1958K7170J4984L077L3507
$$ -23631 -42997 -34889 -24452 -13551 1573 -12124 -12261 -37512 -49470 -22300 -7316 -4239 29268
7270B9268J0640k9040R649O562q136r01M474k5059j741q070m255L614K3942j8056
$$ 29268 39908 10868 20517 27079 18943 18042 22516 -2543 -4284 -12354 -16609 -12995 10947 -7109
7256g109k4501K7306K5065j8007J814J2594L323L1488J3408K434j2862m7988k2371
$$ -7109 -31610 -4304 20761 2754 4568 17162 20485 51973 65381 67815 54953 6965 -15406
7243a5406J0669K5189j0063k5069j5241r85O929J6092k011o09M94j5340J1829
$$ -15406 -4737 20452 10389 -14680 -29921 -30906 -23977 -7885 -9896 -10505 -10011 -25351 -13522
7230a3522J5370k4980k8951R410M8456j701j3919q119K1448n541k0492J4543j1112
$$ -13522 1848 -23132 -52083 -42673 5783 4082 -9837 -17956 3492 -2049 -22541 -7998 -19110
7217a9110k457Q011Q449J3785L6170J7680m536k7470k6238l6149J2715K7439K1042
$$ -19110 -21567 -13556 -5107 8678 44848 62528 57992 30522 4284 -31865 -19150 8289 29331
7204B9331N553m0423l4436m740K7555p195k0925Q032N963M390o651p077N149P530
$$ 29331 34884 -5539 -39975 -44715 -17160 -24355 -45280 -37248 -31285 -26895 -33546 -40623 -35474 -27944
7190b7944r337J0128J1251Q563K5809j6709k4594k2921j1203N638Q35j357L0661
$$ -27944 -37281 -27153 -15902 -7339 18470 1761 -22833 -45754 -56957 -51319 -50484 -51841 -21180
7177b1180k278O378J3928j2545k5834L8474Q796p918K7793J8152J1159q873j5753
$$ -21180 -23458 -17080 -3152 -15697 -41531 -3057 5739 -2179 25614 43766 54925 46052 30299
7164C0299r502o440l9872k470o078j7496K9701J8574L7970J9163j7286k1784q498
$$ 30299 20797 14357 -25515 -27985 -34063 -51559 -21858 -3284 34686 53849 36563 14779 6281
7151F281k6048j3057j7254O556J4266M3390q692j0691J1245J3275J3033j7167
$$ 6281 -19767 -32824 -50078 -43522 -29256 14134 5442 -5249 5996 19271 32304 15137
7139A5137j4008j6827j6323J2483J9374j2710O44j268k567N523J1428N524j4883
$$ 15137 1129 -15698 -32021 -19538 -164 -12874 -12230 -13498 -16065 -10542 886 6410 -8473
7126h473m789p017j7047j4706K0308L6056J8441m508j265k4486k2698L829j7136
$$ -8473 -13262 -20279 -37326 -52032 -31724 4332 22773 18265 17000 -7486 -30184 -26355 -43491
7113d3491q91R550m385M0290N775K071k451j2962k8986K4315N160k4224K519J2845
$$ -43491 -44382 -34832 -39217 1073 6848 8919 6468 -6494 -35480 -11165 -6005 -30229 -27710 -14865
7099a4865j1610J5554o973p741L4921n162m393q606N654K5611r289k300k6995
$$ -14865 -26475 -10921 -17894 -25635 9286 4124 -269 -8875 -3221 22390 13101 10801 -16194
7086a6194J037L7680J7274j0018k1431j0922J9576k113k9024q595J5789J5599
$$ -16194 -15157 22523 39797 29779 8348 -2574 17002 14889 -14135 -22730 -6941 8658
7074H658l212J1545l989j0026k4824P411q350j2680K0750P819K3582J7599j9170
$$ 8658 5446 16991 13002 2976 -21848 -14437 -22787 -35467 -14717 -6898 16684 34283 15113
7061A5113j5201J827r320j5523j3137M604K1867J7531k631j5740P192J4901j2240
$$ 15113 -88 1739 -7581 -23104 -36241 -31637 -9770 7761 5130 -10610 -3418 11483 -757
7048g57j7311m961J3235o330k1806l1303P952J9206K956J1361o237j8769P63J0603
$$ -757 -18068 -23029 -9794 -16124 -37930 -69233 -61281 -42075 -39119 -27758 -33995 -52764 -52001 -41398
7034d1398J1877J2894J8117Q97l1597k4915J7011L5009J6594r312j618R07J4464
$$ -41398 -29521 -16627 1490 2387 -29210 -54125 -37114 -2105 14489 5177 3559 4466 18930
7021A8930J6636l7363j8161l474Q29J981j394p553K5073K280l0715j0457N864
$$ 18930 35566 -1797 -19958 -23432 -22603 -20622 -22016 -29569 -4496 -2216 -32931 -43388 -37524
7008c7524L0230J5317k3920K0387K9804r173j7803j6758k9644M791O081j3927
$$ -37524 -7294 8023 -15897 4490 34294 25121 7318 -9440 -39084 -34293 -28212 -42139
6996d2139K5016R197j009j4155k045K5118j0328l7005L2234K9913N171j9887k0375
$$ -42139 -17123 -7926 -8935 -23090 -25135 -17 -10345 -47350 -15116 14797 19968 81 -20294
6983b0294k2895l6485J2249L0686L6218K9988j3519k9875k3708K4287O952M059
$$ -20294 -43189 -79674 -67425 -36739 -521 29467 15948 -13927 -37635 -13348 -6396 -2337
6971b337j66L530j7065j9301n730j019J8167J3530j3176j1543r243J3628K0135
$$ -2337 -2503 1027 -16038 -35339 -41069 -42088 -23921 -10391 -23567 -35110 -44353 -30725 -10590
6958a0590J3401n76j2269R500J276Q415J1026j957j1370j4333j3562q82K5406
$$ -10590 2811 2235 -10034 -534 742 9157 20183 18226 6856 -7477 -21039 -21921 3485
6945C485K5424L1663j2249J5438m3551n2709j2021L2016Q365l982j952J0656N467
$$ 3485 28909 60572 48323 63761 20210 -32499 -44520 -12504 -4139 -8121 -10073 583 6050
6932F050p361j1127l1158j8265K8253R280o197J9963J970N191k0413q759K1143
$$ 6050 -1311 -12438 -43596 -61861 -33608 -24328 -30525 -10562 -8592 -3401 -23814 -32573 -11430
6919a1430n197j930J3980r48k1424k1973l754J3203J2482l0667m210K3150K3919
$$ -11430 -16627 -18557 -4577 -5525 -26949 -48922 -52676 -39473 -26991 -57658 -61868 -38718 -14799
6906a4799l954Q548J0977j4425J6468m184j8840L525J3217o13l3878j9495J1647
$$ -14799 -18753 -10205 772 -13653 2815 -1369 -20209 -16684 -3467 -4080 -37958 -57453 -45806
6893d5806Q538K2119N542J8946m655j0265J1865r604K2257Q259q139L104j4801
$$ -45806 -37268 -15149 -9607 9339 4684 -5581 6284 -3320 18937 27196 19057 22161 7360
6880G360p637M246j5480K969O478m225L170J4618j6470m9463m935L0556K7945
$$ 7360 -277 3969 -11511 -8542 -2064 -6289 -3119 11499 -4971 -54434 -59369 -28813 -868
6867h68j5463m174j7249n170N528P443J0556J8787q69R359j0143j0615j1032m513
$$ -868 -16331 -20505 -37754 -42924 -37396 -29953 -19397 -610 -1479 7880 -2263 -12878 -23910 -28423
6853b8423J2248K5514J7045r046j6038L095k2066j0173O479K4107L6930K0668
$$ -28423 -16175 9339 26384 17338 1300 4395 -17671 -27844 -21365 2742 39672 60340
6841F0340k0447k46n323q766j2391q644k7869M5j1991k375k092J5569R595J5716
$$ 60340 39893 39647 34324 25558 13167 4523 -23346 -23301 -35292 -37667 -39759 -24190 -14595 1121
6827A121L519l692K2368K0814j5285j7704n688m656J0706j6694n25N074M004r101
$$ 1121 4640 948 23316 44130 28845 11141 5453 797 11503 -5191 -5716 -642 3362 -5739
6813e739l4139O351L236j4193J8842K0631j5425j6739P972J2542k613J0585M346
$$ -5739 -39878 -33527 -30291 -44484 -25642 -5011 -20436 -37175 -29203 -16661 -19274 -8689 -4343
6800d343J5313N874q134R81J1356l0990k7639K9546P615J274k4554q467K3303
$$ -4343 10970 16844 8710 9691 21047 -9943 -37582 -8036 -421 853 -23701 -32168 -8865
6787h865J915p283K1864p978j6558J6546J0681Q369J0437k429k061j4903j9584
$$ -8865 -6950 -14233 7631 -347 -16905 -359 10322 18691 29128 26699 24638 9735 -9849
6774i849j665k5931m7P969O014J6710j1362j6391k082R275K6765J4162l2625j2826
$$ -9849 -11514 -37445 -37492 -29523 -23509 -6799 -18161 -34552 -36634 -27359 -594 13568 -19057 -31883
6760c1883l909l8719J7660L7999J5846J1949r099p213j0854K488p823l0035K155
$$ -31883 -35792 -74511 -56851 -18852 -3006 8943 -156 -7369 -18223 -15735 -23558 -53593 -51438
6747e1438M1853K2710L709p045J2901k3005P65J6405j3558r195j335j7297J2505
$$ -51438 -9585 13125 16834 9789 22690 -315 450 16855 3297 -5898 -7233 -24530 -12025
6734a2025j4411o853j1460j6192K8740M6198j559q41Q256j3953j6732p667M882
$$ -12025 -26436 -33289 -44749 -60941 -32201 13997 12438 11597 19853 5900 -10832 -18499 -13617
6721a3617O357J6303L1637J0140k3473j4417N961l7818J3935J6040r359l79L444
$$ -13617 -7260 9043 40680 50820 27347 12930 18891 -18927 -4992 11048 1689 1310 4754
6708D754J0562J7993k3250k2742r74J9726K3950k268l7214J679K3726j0532p341
$$ 4754 15316 33309 10059 -12683 -13657 6069 30019 27751 -9463 -7784 15942 5410 -1931
6695a931K4685j6731m0393M078j476k570J4864J9314J116K783K1650n59j072q411
$$ -1931 22754 6023 -34370 -30292 -31768 -34338 -19474 -160 956 3739 25389 24830 23758 15347
6681A5347j937K0629J3660L3686j2754j7938j657o547o622k3046J981o150M285
$$ 15347 13410 34039 47699 81385 68631 50693 49036 42489 35867 12821 14802 8652 12937
6668A2937K5329r887L038m181K141p837L1158j9666k3544P475K534R980j4283
$$ 12937 38266 28379 31417 27236 29377 21540 52698 33032 9488 16963 19497 29477 15194
6655A5194k4960J673R13j383p11q342J6889K2520q885r328J839l605J2710n081
$$ 15194 -9766 -8093 -7180 -8563 -9274 -17616 -727 21793 12908 3580 5419 1814 14524 9443
6641I443j4490j4546m339r287K6515q332m701M095j6226K0453K4233J8083J5042
$$ 9443 -5047 -19593 -23932 -33219 -6704 -15036 -19737 -15642 -31868 -11415 12818 30901 45943
6628D5943r138k9970J5505M660P109P193J897N796K8559q771l2553j7828j0026
$$ 45943 36805 6835 22340 27000 34109 41302 43199 48995 77554 68783 36230 18402 8376
6615H376Q642J1328l449l419k3747j7331K6257K7725k8204J1442m117l2647r84
$$ 8376 17018 28346 24897 21478 -2269 -19600 6657 34382 6178 17620 13503 -19144 -20128
6602b0128j0056L468r318o518O291J9754L797J3701m4j1308j4713J185K7399J783
$$ -20128 -30184 -26716 -36034 -42552 -36261 -16507 -12710 991 947 -10361 -25074 -23889 3510 5293
6588E293m298J892q831k3158N585Q427r81j8545m035O848J8924J2694j7202J1910
$$ 5293 995 2887 -5944 -29102 -23517 -15090 -16071 -34616 -38651 -31803 -12879 -185 -17387 -5477
6574e477J7255k1236p315q981j5003J7376K3080j4133k7270k1399R97K3396n004
$$ -5477 11778 -9458 -16773 -25754 -40757 -23381 -301 -14434 -41704 -63103 -62106 -38710 -43714
6561d3714j0688j2514K706P976J1860K327J2909n812R580K5339R296K8785J2874
$$ -43714 -54402 -66916 -64210 -56234 -44374 -42047 -29138 -34950 -25370 -31 9265 38050 50924
6548E0924q240j8243j945k5288o831O268j1218j7171J935J7730J3486L8768K2846
$$ 50924 42684 24441 22496 -2792 -9623 -3355 -14573 -31744 -29809 -12079 1407 40175 63021
6535F3021r902j0626j5039n524k5001N487L302k271p144k0286M666k7119j8814
$$ 63021 53119 42493 27454 21930 -3071 2416 5718 3447 -3697 -23983 -19317 -46436 -65250
6522f5250R14J2838J4852K2985l801K0113J6482K2036N117k3321j2163J9940l203
$$ -65250 -64336 -51498 -36646 -13661 -17462 2651 19133 41169 46286 22965 10802 30742 27539
6509B7539k0661M633J1129m685j7236j7557j0672O314J9708N054j044J1008l565
$$ 27539 6878 11511 22640 17955 719 -16838 -27510 -21196 -1488 3566 2522 13530 9965
6496I965j7337j0308L3693L0592k3463m8444K3802J0696k422p550l9380p112L0544
$$ 9965 -7372 -17680 16013 46605 23142 -25302 -1500 9196 6774 -776 -40156 -47268 -16724
6483a6724J5441q611R761J5962j1919j8941l194J3620L192k3130O351K8728J6366
$$ -16724 -1283 -9894 -133 15829 3910 -15031 -18225 -4605 -1413 -24543 -18192 10536 26902
6470B6902l6980j6732j7476J8501J3762J6590j3506l9650p40K5070L7355O211
$$ 26902 -10078 -26810 -44286 -25785 -12023 4567 -8939 -48589 -49329 -24259 13096 19307
6458A9307j8080m762k4726k3599K5968J77K1162p924q16M658M041O35o94k562
$$ 19307 1227 -3535 -28261 -51860 -25892 -25715 -4553 -12477 -13293 -8635 -4594 -3959 -4653 -7215
6444g215r036R556J1517k0584Q627k390j0500j0186Q205o335K2809K459k0171
$$ -7215 -16251 -6695 4822 -15762 -7135 -9525 -20025 -30211 -22006 -28341 -5532 -3073 -23244
6431b3244k1023m962M926J258j1895J1052j8298J0289M2184N348l442J917j9383
$$ -23244 -44267 -49229 -44303 -43045 -54940 -43888 -62186 -51897 -9713 -4365 -7807 -5890 -25273
6418b5273J8757K2422j0752r989L872k3606o458p514N227J7256K5204M3548j8628
$$ -25273 -6516 15906 5154 -4835 -963 -24569 -31027 -38541 -33314 -16058 9146 52694 34066
6405C4066m0351q403J0073l879R549n420R882J6946k1635p071K7138r533O800
$$ 34066 -6285 -14688 -4615 -8494 1055 -4365 5517 22463 828 -6243 20895 11362 18162
6392A8162L1880J5196p932q733J5853j3046k5662j1107k1845k7945p416L5295
$$ 18162 50042 65238 57306 48573 64426 51380 25718 14611 -7234 -35179 -42595 -7300
6380g300J6650J6967r390k9129p863J9319L1389o263m3772j3175J7457J4317J3501
$$ -7300 9350 26317 16927 -12202 -20065 -746 30643 24380 -19392 -32567 -15110 -793 12708
6367A2708o687j9317P727o957l483L081k1105k1411K424L4767J0994r375L3203
$$ 12708 6021 -13296 -5569 -12526 -16009 -12928 -34033 -55444 -53020 -18253 -7259 -16634 16569
6354A6569N637J2977q918j7840l506l916l667K6543q168k3222J09p99L2769N204
$$ 16569 22206 35183 26265 8425 4919 1003 -2664 23879 15711 -7511 -7402 -8201 24568 29772
6340B9772j3321j1542R41L30p322j4723O180K4287o205R23j6923k1354J0408J7238
$$ 29772 16451 4909 5850 6180 -1142 -15865 -9685 14602 8397 9320 -7603 -28957 -18549 -1311
6326a311k915k27k364P319J0181l652P535j6069k4627j1728J1341J1118k0363
$$ -1311 -4226 -4453 -6817 502 10683 7031 14566 -1503 -26130 -37858 -26517 -15399 -35762
6313c5762M377j931Q997L284L176L851j8501K14J3525J990k6486l418K4737r600
$$ -35762 -31385 -33316 -24319 -21035 -17859 -14008 -32509 -32295 -18770 -16780 -43266 -46684 -21947 -31547
6299c1547p532K2663K7830J8287l3463k2252J4123J8769J8627J4398q220l463
$$ -31547 -39079 -16416 11414 29701 -3762 -26014 -11891 6878 25505 39903 31683 28220
6287B8220J2894K525k6382j1596j9170p536M191K3516m722j9149J3564p664m136
$$ 28220 41114 43639 17257 5661 -13509 -21045 -16854 6662 1940 -17209 -3645 -11309 -15445
6274a5445J1975P376j9717Q241J8346J0049k0187k0784J9871j7613j3472L264
$$ -15445 -3470 3906 -15811 -7570 10776 20825 638 -20146 -275 -17888 -31360 -28096
6262b8096k1950J3543K6603k5222L249J9954J5269K1303L7590L11o078k5912p774
$$ -28096 -50046 -36503 -9900 -35122 -31873 -11919 3350 24653 62243 62554 56476 30564 22790
6249B2790j6183k1013l938K5764J9095k165r214J2710o981r314Q181J0080L571
$$ 22790 6607 -14406 -18344 7420 26515 24350 15136 27846 20865 11551 19732 29812 33383
6236C3383o266n328R993r81j3004j6711r099P311j4280m597L8104K083o233j5890
$$ 33383 27117 21789 31782 30801 17797 1086 -8013 -702 -14982 -19579 18525 20608 14375 -1515
6222a515Q896l288k2954o186L5265M8977K592k4895j2700k373j6449r077J7679
$$ -1515 7381 4093 -18861 -25047 10218 59195 61787 36892 24192 21819 5370 -3707 13972
6209A3972j1760j0986K6876N892o4912o430O068P395L0322J6486J4543R163N321
$$ 13972 2212 -8774 18102 23994 -40918 -47348 -41280 -33885 -3563 12923 27466 36629 41950
6196D1950j3565l5206j1877N817K0406K5789L995p001l9684k3022P466K3427K7098
$$ 41950 28385 -6821 -18698 -12881 7525 33314 37309 30308 -9376 -32398 -24932 -1505 25593
6183B5593j7905j5415K9115l095m688m716k3318Q129P349p202j4550j6127L953
$$ 25593 7688 -7727 21388 18293 13605 8889 -14429 -6300 1049 -6153 -20703 -36830 -32877
6170c2877m466j0109L8848J110k9336L981J6231L694m900j6253J5632N5775L5826
$$ -32877 -37343 -47452 -8604 -7494 -36830 -32849 -16618 -12924 -17824 -34077 -18445 37330 73156
6157G3156p186o0590j8616P984R596L9198j0468k2724l2420j6455L2626k324k1256
$$ 73156 65970 5380 -13236 -5252 4344 43542 33074 10350 -22070 -38525 -5899 -8223 -29479
6144b9479M051K73L0424k507j3682q45o639R31J0411K0517J4932q711l4264k1540
$$ -29479 -25428 -25155 5269 2762 -10920 -11765 -18404 -17473 -7062 13455 28387 19676 -14588 -36128
6130c6128m939J3685N160k1039k1047j3971J8986J9291o830Q727M348L0370J9596
$$ -36128 -41067 -27382 -22222 -43261 -64308 -78279 -59293 -40002 -46832 -38105 -33757 -3387 16209
6117A6209k3570k5271J4730Q404n835j8990k3153K4809L8772K3849K9408p472
$$ 16209 -7361 -32632 -17902 -9498 -15333 -34323 -57476 -32667 6105 29954 59362 51890
6105E1890l4451j3601r937n353L4862L362k985N857J2151l604j2552k6182j2432
$$ 51890 17439 3838 -6099 -11452 23410 26772 23787 29644 41795 38191 25639 -543 -12975
6092a2975J038K9351j8757j4565k321r738J1464K8232j4375J4994L443j6972k1812
$$ -12975 -11937 17414 -1343 -15908 -18229 -27967 -16503 11729 -2646 12348 15791 -1181 -22993
6079b2993J3367K5377J4387q250l4904k8476j9946J6272J8510K566j341J2209
$$ -22993 -9626 15751 30138 21888 -13016 -41492 -61438 -45166 -26656 -24090 -25431 -13222
6067a3222R105o887J7483L345l935l583j3450j3145o793L799j603K0242J7202
$$ -13222 -4117 -11004 6479 9824 5889 2306 -11144 -24289 -31082 -27283 -28886 -8644 8558
6054H558j2334K5824Q780j2067K6705j3155j7118J044j5887k5804n618J0041k063
$$ 8558 -3776 22048 30828 18761 45466 32311 15193 16237 350 -25454 -31072 -21031 -23094
6041b3094l2201N066M3311K835l411O839J9841l5694n904R612K9828J5143j9772
$$ -23094 -55295 -50229 -6918 -4083 -7494 -655 19186 -16508 -22412 -12800 17028 32171 12399
6028A2399p900j8906j6041j3551M1759K9923o593k2726k782k270K8304j6816k0655
$$ 12399 4499 -14407 -30448 -43999 -2240 27683 21090 -1636 -4418 -6688 21616 4800 -15855
6015a5855L081J5076L015J708j064p029%J6868Q046j4815l781l996R620k6525
$$ -15855 -12774 2302 5317 7025 5961 -1068 -1068 15800 23846 9031 5250 1254 10874 -15651
6001a5651j77K2422M102q386p494M337K745J1750m254l5006j2551J2364N3539
$$ -15651 -15828 6594 10696 2310 -5184 -847 1898 13648 9394 -25612 -38163 -25799 27740
5988B7740K8972l0604k4126p989j412L7038M99m8297j105J213j0410R154k123
$$ 27740 56712 26108 1982 -6007 -7419 29619 30118 -18179 -19284 -18071 -28481 -19327 -21450
5975b1450M364J0814L0246L316m806l0598j2386K4263J7473Q312O95r052j8927
$$ -21450 -17086 -6272 23974 27290 22484 -8114 -20500 3763 21236 29548 30243 21191 2264
5962B264k5659q404K2059L3504k684j6548p720P294j706K5431J3196k7656m827
$$ 2264 -23395 -31799 -9740 23764 21080 4532 -3188 4106 2400 27831 41027 13371 8544
5949H544j510q583j6105r272J572Q434M9325Q530j4497r630j4029j6632K1067
$$ 8544 7034 -1549 -17654 -26926 -25354 -16920 32405 40935 26438 16808 2779 -13853 7214
5936G214p806l0145k0262Q768R708j929K3313J6615k606l947o750l229j965J8497
$$ 7214 -592 -30737 -50999 -42231 -32523 -34452 -11139 5476 2870 -1077 -7827 -11056 -13021 5476
5922E476k6870k6186N125J9988R97r229j0150Q417J3392J8380K1277J2042l0243
$$ 5476 -21394 -47580 -42455 -22467 -21470 -30699 -40849 -32432 -19040 -660 20617 32659 2416
5909B416k8530J8708K2455j5588l0485q170K0904J4851J3040Q164L918j2041k0433
$$ 2416 -26114 -7406 15049 -539 -31024 -39194 -18290 -3439 9601 17765 21683 9642 -10791
5896a0791R120L0573L480j1170O644j9492J0819l830j6739k9230j5722k0598M8989
$$ -10791 -1671 28902 32382 21212 27856 8364 19183 15353 -1386 -30616 -46338 -66936 -17947
5883a7947M7338O033n279k1294l7695J3461K2563J1493r600J487k859Q92j1503
$$ -17947 29391 35424 30145 8851 -28844 -15383 7180 18673 9073 10560 7701 8593 -2910
5870b910l1758J0580J2851K695J0921R316J8035n151l1414j5632j884P940R336
$$ -2910 -34668 -24088 -11237 -8542 2379 11695 29730 24579 -6835 -22467 -24351 -16411 -7075
5857g075J2405J4400k3395r580l736J4982k226j464p843j9293J8287P895r95Q211
$$ -7075 5330 19730 -3665 -13245 -16981 -1999 -4225 -5689 -13532 -32825 -14538 -6643 -7638 573
5843E73j8530k616J4192K4826J6188m48j7320L74K897J533K6330K2231k7944k5364
$$ 573 -17957 -20573 -6381 18445 34633 34185 16865 17239 20136 21669 47999 70230 42286 16922
5829A6922p800J5412J8689O230r013n0005l1839J9794j7755J3450k857J61L4310
$$ 16922 9122 24534 43223 49453 40440 -9565 -41404 -21610 -39365 -25915 -28772 -28611 5699
5816E699P609K4915Q137k5021m0735J0513J0397J8848m548j3544J001J7213J971
$$ 5699 13308 38223 46360 21339 -19396 -8883 1514 20362 15814 2270 3271 20484 22455
5803B2455l2669k9686l269Q856J9815J5731k6829j954j847j0689k382J0396N042
$$ 22455 -10214 -39900 -43169 -34313 -14498 1233 -25596 -27550 -29397 -40086 -42468 -32072 -27030
5790b7030j743n075L747k0638j0978L4008K5098K350M33k479j2386j54l819N901
$$ -27030 -28773 -33848 -30101 -50739 -61717 -27709 -2611 -261 172 -2307 -14693 -14847 -18666 -12765
5776a2765K1367O758q688K5447J2730k4558p980k684L114O834k2500k5312J9314
$$ -12765 8602 15360 6672 32119 44849 20291 12311 9627 12741 19575 -2925 -28237 -8923
5763h923J1330J7971J0077k9628m2009O868K9846K3655k0633L574j7379o501K2001
$$ -8923 2407 20378 30455 827 -41182 -34314 -4468 19187 -1446 2128 -15251 -21752 249
5750B49Q908j7272j1549J7669R270j8736r353O421k1413r542J0165L3962L8083
$$ 249 9157 -8115 -19664 -1995 7275 -11461 -20814 -14393 -35806 -45348 -35183 -1221 36862
5737C6862J7219j4661l8130j8723K8273J548j0681R74M866k1608n2756P063K3348
$$ 36862 54081 39420 1290 -17433 10840 12388 1707 2681 7547 -14061 -66817 -59754 -36406
5724c6406J6085L5987L5783k0863j5240j9335k2314J49j2936p997K7274J7210
$$ -36406 -20321 15666 51449 30586 15346 -3989 -26303 -26154 -39090 -47087 -19813 -2603
5712b603K5100k3322O952k51k5114K041J4588j2358p078K1667r634R691j0734
$$ -2603 22497 -825 6127 5876 -19238 -17197 -2609 -14967 -22045 -378 -10012 -321 -11055
5699a1055J3418O233l5408n754M127k0325J7035R566J0321J5397j9177j8507K2803
$$ -11055 2363 8596 -26812 -32566 -28439 -48764 -31729 -22163 -11842 3555 -15622 -34129 -11326
5686a1326K7374K2510m013r471k4189L614Q052J0274M261K3090j9362m0100R773
$$ -11326 16048 38558 34545 25074 885 4499 12551 22825 27086 50176 30814 -9286 487
5673D87K5992k734q352n334L91n243k5743j1418K1613J1891R213N127r37R006
$$ 487 26479 23745 15393 10059 10450 5207 -20536 -31954 -10341 1550 10763 15890 14953 23959
5659B3959r288l2220K270L1394p20o266j3866k0298R424J5832L364j1281J79L914
$$ 23959 14671 -17549 -15279 16115 15395 9129 -4737 -25035 -15611 221 3585 -7696 -7517 -3603
5645c603N754p52k883N165J9562j4305k4211j1971K1821j799j3287l536N550J4784
$$ -3603 2151 1399 -1484 3681 23243 8938 -15273 -27244 -5423 -7222 -20509 -24045 -18495 -3711
5631c711k4614j2756L1286L0690L1382j0149l1833l9164p788J0845K3478k527
$$ -3711 -28325 -41081 -9795 20895 52277 42128 10295 -28869 -36657 -25812 -2334 -4861
5619d861M233J2465j1231R55j0904l85J3551N2342K049j3223k4349j2538J6121
$$ -4861 -628 11837 606 1561 -9343 -9728 3823 56165 58214 44991 20642 8104 24225
5606B4225m082j5333l3004k581J1858J6977J1740r460j0171p268n741n452J7351
$$ 24225 20143 4810 -28194 -30775 -18917 -1940 9800 340 -9831 -17099 -22840 -28292 -10941
5593a0941K7340k4432k9472j0051M5987k0163l1232Q963J6145J9105K0348M8k2790
$$ -10941 16399 -8033 -37505 -47556 -1569 -21732 -52964 -44001 -27856 -8751 11597 11645 -11145
5580a1145r85m590j6452j76j1839J0532K5324J4084k4562J1288j2757p60K4521
$$ -11145 -12130 -16720 -33172 -33348 -45187 -34655 -9331 4753 -19809 -8521 -21278 -22038 2483
5567B483O285n0613o562K6722M107j8957P260p32J5809q524J9580J9771k1157
$$ 2483 8768 -41845 -48407 -21685 -17578 -36535 -29275 -30007 -14198 -22722 -3142 16629 -4528
5554d528j8774J5036J9083O761j3309L639j4623m08K8795J777q827j5781j3598
$$ -4528 -23302 -8266 10817 17578 4269 7908 -6715 -7123 21672 23449 14622 -1159 -14757
5541a4757P735P139k5560q393K3751j4187k356o227k3674J9111J8550J2699K0354
$$ -14757 -7022 117 -25443 -33836 -10085 -24272 -26628 -32855 -56529 -37418 -18868 -6169 14185
5528A4185j5198j7166j1577K211k4504Q440P236N324K0180k5574l0657k17L4735
$$ 14185 -1013 -18179 -29756 -27545 -52049 -43609 -36373 -31049 -10869 -36443 -67100 -67317 -32582
5515c2582P692L82J3919j5676L451J4103q744M734K6390l203j5259k6438j3544
$$ -32582 -24890 -24508 -10589 -26265 -22814 -8711 -17455 -12721 13669 10466 -4793 -31231 -44775
5502d4775K2821o508K6740Q921O42M519J2764k2698j4571n105K0541K6221k260
$$ -44775 -21954 -28462 -1722 7199 7841 12360 25124 2426 -12145 -17250 3291 29512 27252
5489B7252P424k1585o221o528N047M328k1842k666J2400p891k4691o417J0660
$$ 27252 34676 13091 6870 342 5389 9717 -12125 -14791 -2391 -10282 -34973 -41390 -30730
5476c0730J0697Q446Q722j3026j9316K0412J7630J3993j1028k6054k0238p577
$$ -30730 -20033 -11587 -2865 -15891 -35207 -14795 2835 16828 5800 -20254 -40492 -48069
5464d8069M7603K6040o604j3499j7757k6637q739N601L129K1850M296M433K5685
$$ -48069 -466 25574 18970 5471 -12286 -38923 -47662 -42061 -38932 -17082 -12786 -8353 17332
5451A7332M1591J4298k8439p28l152j3673q688J3398j4524q532j4890K28j08k148
$$ 17332 58923 73221 44782 44054 40902 27229 18541 31939 17415 8883 -6007 -5779 -5887 -8035
5437h035N647n891n191j8387K494J0864N858J4782P402j259K751J4596j8852n541
$$ -8035 -2388 -8279 -13470 -31857 -29363 -18499 -12641 2141 9543 8284 11035 25631 6779 1238
5423A238q403r586q033q864J0054J5052o729j5187K4586P763r036Q736j4679k478
$$ 1238 -7165 -16751 -24784 -33648 -23594 -8542 -15271 -30458 -5872 1891 -7145 1591 -13088 -15566
5409a5566J3402m429j7899K549k1882k701K2453l329N626P815Q765N661j6867
$$ -15566 -2164 -6593 -24492 -21943 -43825 -46526 -24073 -27402 -21776 -13961 -5196 465 -16402
5396a6402m122J740l181n728L1213J0152k7159N375j0235j5215J2789K9908j4929
$$ -16402 -20524 -18784 -21965 -27693 3520 13672 -13487 -8112 -18347 -33562 -20773 9135 -5794
5383e794m099M391K6893O522o965l4155k8813J7093K7412l00j1311K2236J1602
$$ -5794 -9893 -5502 21391 27913 20948 -13207 -42020 -24927 2485 2185 -9126 13110 24712
5370B4712O876J1111l4517Q866k450k6321j9224J3323l861J0400N632l270J0006
$$ 24712 31588 42699 8182 17048 14598 -11723 -30947 -17624 -21485 -11085 -5453 -8723 1283
5357A283n269l155L1364j316o80j2946j832j3283O672k270k8430J3692J5016r460
$$ 1283 -3986 -7141 24223 22907 22227 9281 7449 -5834 838 -1432 -29862 -16170 -1154 -10614
5343a0614p772j0130j8663k0802j831J8385J7244M866J1562J6882j0709k630n263
$$ -10614 -18386 -28516 -47179 -67981 -69812 -51427 -34183 -29317 -17755 -873 -11582 -14212 -19475
5330a9475N398J4433K113J9599J4950Q483J354l2403j0271k3199J5385K8350P270
$$ -19475 -14077 356 2469 22068 37018 45501 46855 14452 4181 -19018 -3633 24717 31987
5317C1987j5287J1393L1061o653j0413j2228j1143k2787o729K4946P684n797R219
$$ 31987 16700 28093 59154 52501 42088 29860 18717 -4070 -10799 14147 21831 16034 25253
5304B5253L951P403k8677l591M5124O856n282R164l2331k7204K368m66j6163k796
$$ 25253 29204 36607 7930 4339 49463 56319 51037 60201 27870 666 3034 2568 -13595 -16391
5290a6391J9089Q538k1697o575j909J9768N242K9678K1529k1910l5086j7005j9676
$$ -16391 2698 11236 -10461 -17036 -18945 823 6065 35743 57272 35362 276 -16729 -36405
5277c6405k4814p327K5923K9270K9836O224j189j6952P010J06J1880J7254K389
$$ -36405 -61219 -68546 -42623 -13353 16483 22707 21518 4566 11576 11682 23562 40816 43205
5264D3205n557k8928J636R798J6031m955J0313J7194j9007n499l1303k4774l1972
$$ 43205 37648 8720 10356 20154 36185 31230 41543 58737 39730 34231 2928 -21846 -53818
5251e3818m284P65k443J6745J6772k70J842j7429J7615J9730J9482k7605r810
$$ -53818 -58102 -57337 -59780 -43035 -26263 -26533 -24691 -42120 -24505 -4775 14707 -12898 -22708
5238b2708j5177O922j4188P083j022j0455K2713K5085K4984K0802j3421j5990
$$ -22708 -37885 -30963 -45151 -38068 -39090 -49545 -26832 -1747 23237 44039 30618 14628
5226A4628m633J1427J0659R915N091J1831J2197k0082l1733k062j9070r794L622
$$ 14628 9995 21422 32081 41996 47087 58918 71115 51033 19300 17238 -1832 -11626 -8004
5213h004P046j7411J6005O297L634L3049J2698l941j4652k1185j5842L6865j5994
$$ -8004 -958 -18369 -2364 3933 7567 40616 53314 49373 34721 13536 -2306 34559 18565
5200A8565k0439L562l520R58j140l8024j550J2705K3021M5264m411j7698n835
$$ 18565 -1874 1688 -1832 -874 -2014 -40038 -41588 -28883 -5862 39402 34991 17293 11458
5187A1458J6725j1758m1479R509K2834j1696L43k0595O420K6638k6355l843j8662
$$ 11458 28183 16425 -25054 -15545 7289 -4407 -4064 -24659 -18239 8399 -17956 -21799 -40461
5174d0461P728J3304K2528M583K3652J5301n359k2196M136M408k4498j2345p579
$$ -40461 -32733 -19429 3099 7682 31334 46635 41276 19080 23216 27624 3126 -9219 -16798
5161a6798P154p586m524o966J8263K5567k1815k1562Q351j5850J0399j2008M036
$$ -16798 -9644 -17230 -21754 -28720 -10457 15110 -6705 -28267 -19916 -35766 -25367 -37375 -33339
5148c3339r028J1988P752n483K5438K4406K1315k31l2190l8380m153j5632k0076
$$ -33339 -42367 -30379 -22627 -28110 -2672 21734 43049 42818 10628 -27752 -31905 -47537 -67613
5135f7613K0390m185o173J1249K1549j468j0794L075N081K6732K8726O431k1120
$$ -67613 -47223 -51408 -57581 -46332 -24783 -26251 -37045 -33970 -28889 -2157 26569 33000 11880
5122A1880k9285k66K6366J32k2366O321r834Q740L0120L4414j2322K727J3221
$$ 11880 -17405 -17671 8695 8827 -13539 -7218 -17052 -8312 21808 56222 43900 46627 59848
5109E9848j1789k3391j9906J295j3624k4498k4251r783K2228J8050K0933j578
$$ 59848 48059 24668 4762 6057 -7567 -32065 -56316 -66099 -43871 -25821 -4888 -6466
5097f466l5286p225J3555O823K1535j9138R974K9285k239k670R463l655J5398
$$ -6466 -41752 -48977 -35422 -28599 -7064 -26202 -16228 13057 10818 8148 17611 13956 29354
5084B9354J205j5090l6956q113M7043o430k2156J6920O000n729J5188j9576j1532
$$ 29354 30559 15469 -21487 -29600 17443 11013 -11143 5777 11777 6048 21236 1660 -9872
5071i872J2241m989K8427j3538j6962n168k361k9808K480R097K7317K753k9996
$$ -9872 2369 -2620 25807 12269 -4693 -9861 -12222 -42030 -39550 -30453 -3136 -383 -30379
5058c0379R697L8681j7819k5483J9066K0558j1341q642K7014l399n001K1516P206
$$ -30379 -20682 17999 180 -25303 -6237 14321 2980 -5662 21352 17953 12952 34468 41674
5045D1674l4140j0284l8945p722J4572M599k6840P855J9633K6097K9379K4096
$$ 41674 7534 -2750 -41695 -49417 -34845 -30246 -57086 -49231 -29598 -3501 25878 49974
5033D9974M311k2695j2822j4667l6772j2413P077M0100J9463k1468j8972N988
$$ 49974 54285 31590 18768 4101 -32671 -45084 -38007 2093 21556 88 -18884 -12896
5021a2896j715J7523m70K431L120J601k5035p659J9474n731j436K652m957K0532
$$ -12896 -14611 2912 2442 4873 7993 9594 -15441 -23100 -3626 -9357 -10793 -8141 -13098 7434
5007G434K7800n217p860o210j5395j0626K226J2575L0322o565l083n138K4352
$$ 7434 35234 30017 22157 15947 552 -10074 -7848 4727 35049 28484 25401 20263 44615
4994D4615J1799l7879n4927l590P021p41R270N7662R769n091k1901p529j0629
$$ 44615 56414 18535 -36392 -39982 -32961 -33702 -24432 33230 42999 37908 16007 8478 -2151
4981b151O115k5443L094K5541Q381k5635k0796Q276J1381J8576O439J5522j9112
$$ -2151 3964 -21479 -18385 7156 15537 -10098 -30894 -22618 -11237 7339 13778 29300 10188
4968A0188q084j2389k8499J8950L9563k27l4452j1986K7579O6j74n096j1731r920
$$ 10188 2104 -10285 -38784 -19834 19729 19502 -14950 -26936 643 709 535 -4561 -16292 -26212
4954b6212r081K126K2805K9583k3631l0701l5123M2947L9127j7403k1510J7470
$$ -26212 -35293 -33167 -10362 19221 -4410 -35111 -70234 -27287 11840 -5563 -27073 -9603
4942i603J7546k46j6594j8852K3547p201k4456j7210Q922J3996j3452m652l29
$$ -9603 7943 7697 -8897 -27749 -4202 -11403 -35859 -53069 -44147 -30151 -43603 -48255 -48584
4929d8584k425J5526J506p762Q792K3189j83K660P844p863P940l087j610q110
$$ -48584 -51009 -35483 -33977 -41739 -32947 -9758 -9941 -7281 563 -7300 640 -2447 -4057 -12167
4915a2167j3182q858o952K9367L2374j500l8584J0737L0314J4949N322l3693j0321
$$ -12167 -25349 -34207 -41159 -11792 20582 19082 -19502 -8765 21549 36498 41820 8127 -2194
4902b194j5528k653j1677N107K0083L6655l643k4683q125J9257K1730m412k2141
$$ -2194 -17722 -20375 -32052 -26945 -6862 29793 26150 1467 -6658 12599 34329 29917 7776
4889G776r07R238J3938r907j6183o627j1970Q47O735j0333L49J8999K0313k8742
$$ 7776 6869 16107 30045 20138 3955 -2672 -14642 -13795 -7060 -17393 -17044 1955 22268 -6474
4875f474j0416N239K761r39J1749j682P53n302j2421P418K39K7030L0780j2286
$$ -6474 -16890 -11651 -8890 -9829 1920 238 991 -4311 -16732 -9314 -9075 17955 48735 36449
4861C6449J0030N246j2569o026j515L468j6362j9563J9966R024j0574q898Q374
$$ 36449 46479 51725 39156 33130 31615 35083 18721 -842 19124 28148 17574 8676 17050
4848A7050P091o248O636J9757j7937l7870N066k364J2415q584K3956J281l2329
$$ 17050 24141 17893 24529 44286 26349 -11521 -6455 -8819 3596 -4988 18968 20249 -12080
4835a2080j7761j8661K0562L0513J5303Q094j5467k89J6541j2653p607J2515N26
$$ -12080 -29841 -48502 -27940 2573 17876 25970 10503 10214 26755 14102 6495 19010 19536
4822A9536J726k1363J4170R70j5544J7423o977M818J7590J201K006j9851k9917
$$ 19536 21262 -101 14069 15039 -505 16918 9941 14759 32349 33550 35556 15705 -14212
4809a4212j2202r81j1405K2280L8610m7m9811o582K0574M158m110n159k0105J0741
$$ -14212 -26414 -27395 -38800 -16520 22090 22043 -27768 -34350 -13776 -9618 -13728 -18887 -38992 -28251
4795b8251K5287N535P286K731j5879K065n918J7542J9296J3530O28l4940j8757
$$ -28251 -2964 2571 9857 12588 -3291 -1226 -7144 10398 29694 43224 43852 8912 -9845
4782i845K877O520J2565K1317k014j6906j6813J2263p500N432M109J8147J5689
$$ -9845 -6968 -448 12117 33434 31420 14514 -2299 9964 2464 7896 12005 30152 45841
4769D5841q453k2679k0789k4845J2855K228r356J3607K998r115K2636P584j7753
$$ 45841 37388 14709 -6080 -30925 -18070 -15842 -25198 -11591 -8593 -17708 4928 12512 -5241
4756e241q778K7378J9556p172J791p887j396K249J7105j8092m0946N034L1173
$$ -5241 -14019 13359 32915 25743 27534 19647 18251 20500 37605 19513 -21433 -16399 14774
4743A4774j6877k4915K2984J7077j2960Q21J0143J523k4285l4151j0745J0867
$$ 14774 -2103 -27018 -4034 13043 83 904 11047 12570 -11715 -45866 -56611 -45744
4731d5744O032K44J5814J4020R595L286L687j9589j2038L806n281J9215l247O137
$$ -45744 -39712 -39468 -23654 -9634 -39 3247 6934 -12655 -24693 -20887 -26168 -6953 -10200 -4063
4717d063J4038k2740o426j6094j7122M059O369K1609L0748n152M942o064j7051
$$ -4063 9975 -12765 -19191 -35285 -52407 -48348 -41979 -20370 10378 5226 10168 4104 -12947
4704a2947j123J1708J9402k954l1222P189M024J1344n902n848j4502j9612j3366
$$ -12947 -14070 -2362 17040 14086 -17136 -9947 -5923 5421 -481 -6329 -20831 -40443 -53809
4691e3809j101J934l392O741K1554k757m529m496j1704j7405J1196J511Q952L2334
$$ -53809 -54910 -52976 -56368 -49627 -28073 -30830 -35359 -39855 -51559 -68964 -57768 -56257 -47305 -14971
4677a4971m1n850n680k067p302J739R25L710J0343K7069J2540M581K7630j911
$$ -14971 -15012 -20862 -26542 -28609 -35911 -34172 -33247 -29537 -19194 7875 20415 24996 52626 50715
4663E0715J7903k726j3627k5815J173o260k5390j6039L2662N763r627j7357j5222
$$ 50715 68618 65892 52265 26450 27623 21363 -4027 -20066 12596 18359 8732 -8625 -23847
4650b3847N451L186p869j1188K7356J1323J2565j0257P66J7149J449q163j6870
$$ -23847 -18396 -15210 -23079 -34267 -6911 4412 16977 6720 7486 24635 26084 17921 1051
4637A051K109r368j3632j0454j6339K0193J2821J4465L852N268J3160k912p238
$$ 1051 3160 -6208 -19840 -30294 -46633 -26440 -13619 846 4698 9966 23126 20214 12976
4624A2976J1988j0675j9718J3382P359J1008j5614j2031L380j2253R036N852j607
$$ 12976 24964 14289 -5429 7953 15312 26320 10706 -1325 2055 -10198 -1162 4690 3083
4611C083Q811o316j0583n841J0319J5253J6992o26j029J8149j7387k8492j8735
$$ 3083 11894 5578 -5005 -10846 -527 14726 31718 31092 30063 48212 30825 2333 -16402
4598a6402J87k816L8r854k1657n129L6872j0891R883J5034J9128K2149j0827n723
$$ -16402 -16215 -19031 -18993 -28847 -50504 -55633 -18761 -29652 -19769 -4735 14393 36542 25715 19992
4584A9992q639k4545l562K186Q599J0831Q051j4879K340K542O082j4535N509O289
$$ 19992 11353 -13192 -16754 -14568 -5969 4862 12913 -1966 374 2916 8998 -5537 -28 6261
4570F261j4165J7509J0517j196P727q391j498l375q760L1921m193k7465j2665
$$ 6261 -7904 9605 20122 18926 26653 18262 16764 13389 4629 36550 32357 4892 -7773
4557g773R392J9282j1485k0686L092M0189L3829j9458l2551R026J2044j2627k3513
$$ -7773 1619 20901 9416 -11270 -8178 32011 65840 46382 13831 22857 34901 22274 -1239
4544a239o64J3075l454k061L1181J0474N227j8763Q847j1299l8596k1398k3021
$$ -1239 -1903 11172 7718 5657 36838 47312 52539 33776 42623 31324 -7272 -28670 -51691
4531e1691k4919M8249K0148q520n883p666q04K2591J2239K1186J4314J1761l602
$$ -51691 -76610 -28361 -8213 -16733 -22616 -30282 -31086 -8495 3744 24930 39244 51005 47403
4518D7403Q83l2910P966r243k1247J1361L0081J0841j3559j0284k1004n175j7234
$$ 47403 48286 15376 23342 14099 -7148 4213 34294 45135 31576 21292 288 -4887 -22121
4505b2121J8707K7342j1751p425K1350o895O094k770j2741J3425L2828k7908m0288
$$ -22121 -3414 23928 12177 4752 26102 19207 25301 22531 9790 23215 56043 28135 -12153
4492a2153k0690J4642K8080J842q638p228J4179M785N220K7319r984O365k057
$$ -12153 -32843 -18201 9879 11721 3083 -4145 10034 14819 20039 47358 37374 43739 41682
4479D1682j0474r036r817O337j5212j285l49K704K2565J1629j971o002k3202j0312
$$ 41682 31208 22172 12355 18692 3480 2195 1846 4550 27115 38744 36773 30771 7569 -2743
4465b743j4202j0021L1731O493j0540r064J7209J4409k2453j9808j2197m281K0530
$$ -2743 -16945 -26966 4765 11258 718 -8346 8863 23272 819 -18989 -31186 -35467 -14937
4452a4937j4246o681k081J614K3975K0019q486L731l3222p425K8326J9366R486
$$ -14937 -29183 -35864 -37945 -36331 -12356 7663 -823 2908 -30314 -37739 -9413 9953 19439
4439A9439j1551o001l832K4355o410k767j1835J815Q072j8635o236r325j936J8782
$$ 19439 7888 1887 -1945 22410 16000 13233 1398 3213 11285 -7350 -13586 -22911 -24847 -6065
4425f065r936M150K2929l9994j9930j1169R327K1684R283O02R020J4730M625j3350
$$ -6065 -16001 -11851 11078 -28916 -48846 -60015 -50688 -29004 -19721 -19119 -10099 4631 9256 -4094
4411d094Q960Q22J3905j4841J7625J5578j6395k0476k419p773j6508K8562k603
$$ -4094 4866 5688 19593 4752 22377 37955 21560 1084 -1335 -9108 -25616 2946 343
4398C43o075K2343K638k0554J2087O354m298j4898k94J4494j4858m167o73K319
$$ 343 -5732 16611 19249 -1305 10782 17136 12838 -2060 -2354 12140 -2718 -6885 -7558 -5239
4384e239k349r070q777J8736k314O267J6045m514J5344J8904p054P213j2571l7727
$$ -5239 -7588 -16658 -25435 -6699 -9013 -2746 13299 8785 24129 43033 35979 43192 30621 -7106
4370g106k6877L409J8774o854R876O187n008Q972j3447J146K596P274K886p6o732
$$ -7106 -33983 -30574 -11800 -18654 -8778 -2591 -7599 1373 -12074 -10928 -8332 -1058 1828 1752 -4980
4355d980J043j4292J1828N253m319K1733o456l705l077k0732l0174o752M6013
$$ -4980 -3937 -18229 -6401 -1148 -5467 16266 9810 6105 3028 -17704 -47878 -54630 -8617
4342h617K7188n428k1221R59J8495J6393n290j3547j1413j1455j3244o642p611
$$ -8617 18571 13143 -8078 -7119 11376 27769 22479 8932 -2481 -13936 -27180 -33822 -41433
4329d1433j2660K9344K5444J2487m100P427j3534m567o656J3882K1380M550j7392
$$ -41433 -54093 -24749 695 13182 9082 16509 2975 -1592 -8248 5634 27014 31564 14172
4316A4172k1872q563k9375N959K8943P251j3573j1203k317K1574N724J585q499
$$ 14172 -7700 -16263 -45638 -39679 -10736 -3485 -17058 -28261 -30578 -9004 -3280 -1695 -10194
4303a0194n361j1105K3645L6461l918l308P085M96j889j383m968J0131k0625p507
$$ -10194 -15555 -26660 -3015 33446 29528 26220 33305 33801 31912 30529 25561 35692 15067 7560
4289G560J4601m342J566n708O383K7471P587k5763l555k3136k9920p977J2346
$$ 7560 22161 17819 19385 13677 20060 47531 55118 29355 25800 2664 -27256 -35233 -22887
$$ [...]
##END NTUPLES=NMR SPECTRUM
##END=
