##TITLE=Analysis number 328997
Compound Code cc 62706
Book Reference 521/97
Project Code adrs
Chemist Name evam
##JCAMPDX= 6.0         $$ Bruker NMR JCAMP-DX V2.0
##DATA TYPE= NMR SPECTRUM
##DATA CLASS= NTUPLES
##ORIGIN= Bruker BioSpin GmbH
##OWNER= nmr
$$ XWIN-NMR		Version 3.5
$$ Tue Jul 24 11:09:00 2007 GMT Daylight Time (UT+1h)  MAYBRIDGE\nmr@NMR_250MHZ
##.OBSERVE FREQUENCY= 250.131544655141
##.OBSERVE NUCLEUS= ^1H
##.ACQUISITION MODE= SIMULTANEOUS (DQD)
##.ACQUISITION SCHEME= undefined
##.AVERAGES= 16
##.DIGITISER RES= 18
##SPECTROMETER/DATA SYSTEM= dpx250
##.PULSE SEQUENCE= zg30
##.SOLVENT NAME= CDCl3
##.SHIFT REFERENCE= (INTERNAL, CDCl3, 0, 16.4496)
##AUDIT TRAIL= $$ (NUMBER, WHEN, WHO, WHERE, WHAT)
$$ ##TITLE= Audit trail, XWIN-NMR		Version 3.5
$$ ##JCAMPDX= 5.01
$$ ##ORIGIN= Bruker BioSpin GmbH
$$ ##OWNER= nmr
$$ C:\u/data/dgb/nmr/ADRS/1370/pdata/1/auditp.txt
$$ ##AUDIT TRAIL=  $$ (NUMBER, WHEN, WHO, WHERE, WHAT)
(   1,<2007-07-24 11:08:32.60 +100>,<MAYBRIDGE\nmr>,<NMR_250MHZ>,
      <created by zg, POWCHK disabled, PULCHK disabled
       configuration hash MD5:
       76 6E 9A 78 1E 09 19 81 EC 84 63 8F B0 6A 59 2D
       data hash MD5: 64K
       E0 78 99 2E 9E FC FA CD A2 FC E8 AC C3 58 F7 D0>)
(   2,<2007-07-24 11:08:50.27 +100>,<MAYBRIDGE\nmr>,<NMR_250MHZ>,
      <Start of raw data processing
       ef LB = 0.3 FT_mod = 6 PKNL = 1 SI = 32K 
       data hash MD5: 32K
       D9 3F 70 4A BA A3 BB 02 98 EA 2D B5 FE A7 36 DD>)
(   3,<2007-07-24 11:08:52.23 +100>,<MAYBRIDGE\nmr>,<NMR_250MHZ>,
      <apk 
       data hash MD5: 32K
       71 06 AD ED 1B BB 6A 6A 94 D5 37 68 3E D7 1A 22>)
(   4,<2007-07-24 11:08:52.99 +100>,<MAYBRIDGE\nmr>,<NMR_250MHZ>,
      <abs ABSG = 5 
       data hash MD5: 32K
       AE AA BE D8 4C 5C 0E 9E FF 02 05 F7 A4 72 45 7A>)
$$ ##END=
$$ 
$$ hash MD5
$$ 9C 6F 37 2C 27 51 16 53 4B FF 8C 3C CE 50 98 D4
##$RELAX= 
##$RELAX= 
##$RELAX= 
##$RELAX= 
##$RELAX= 
##$RELAX= 
##$RELAX= 
$$ Bruker specific parameters
$$ --------------------------
##$DU= <C:\u>
##$EXPNO= 1370
##$NAME= <ADRS>
##$PROCNO= 1
##$TYPE= <nmr>
##$USER= <dgb>
##$AMP= (0..31)
100 100 100 100 100 100 100 100 100 100 100 100 100 100 100 100 100 100 
100 100 100 100 100 100 100 100 100 100 100 100 100 100 
##$AQSEQ= 0
##$AQ_mod= 3
##$AUNM= <au_zg>
##$AUTOPOS= <7 >
##$BF1= 250.13
##$BF2= 250.13
##$BF3= 250.13
##$BF4= 250.13
##$BF5= 500.13
##$BF6= 500.13
##$BF7= 500.13
##$BF8= 500.13
##$BYTORDA= 1
##$CFDGTYP= 0
##$CFRGTYP= 5
##$CHEMSTR= <none>
##$CNST= (0..31)
1 1 145 1 1 1 1 1 1 1 1 1 1 1 1 1 1 1 1 1 1 1 1 1 1 1 1 1 1 1 1 1 
##$CPDPRG= <>
##$CPDPRG1= <>
##$CPDPRG2= <>
##$CPDPRG3= <>
##$CPDPRG4= <mlev>
##$CPDPRG5= <mlev>
##$CPDPRG6= <mlev>
##$CPDPRG7= <mlev>
##$CPDPRG8= <mlev>
##$CPDPRGB= <>
##$CPDPRGT= <>
##$D= (0..31)
0 1 0 0 0 0 0 0 0 0.06 0 0 0 0 0 0 0.0002 0 0 0 0 0 0 0 0 0 0 0 0 0 0 
0 
##$DATE= 1185271711
##$DBL= (0..7)
120 120 120 120 120 120 120 120 
##$DBP= (0..7)
150 150 150 150 150 150 150 150 
##$DBP07= 0
##$DBPNAM0= <>
##$DBPNAM1= <>
$$ [...]
##$SUBNAM7= <"">
##$SUBNAM8= <"">
##$SUBNAM9= <"">
##$SW= 20.6930455092707
##$SWIBOX= (0..15)
0 0 3 0 0 0 0 0 0 0 0 0 0 0 0 0 
##$SW_h= 5175.983436853
##$TD= 65536
##$TD0= 1
##$TE= 297.16
##$TE2= 300
##$TE3= 300
##$TEG= 300
##$TL= (0..7)
0 120 120 120 120 120 120 120 
##$TP= (0..7)
150 150 150 150 150 150 150 150 
##$TP07= 0
##$TPNAME0= <>
##$TPNAME1= <>
##$TPNAME2= <>
##$TPNAME3= <>
##$TPNAME4= <>
##$TPNAME5= <>
##$TPNAME6= <>
##$TPNAME7= <>
##$TPOAL= (0..7)
0.5 0.5 0.5 0.5 0.5 0.5 0.5 0.5 
##$TPOFFS= (0..7)
0 0 0 0 0 0 0 0 
##$TUNHIN= 0
##$TUNHOUT= 0
##$TUNXOUT= 0
##$USERA1= <user>
##$USERA2= <user>
##$USERA3= <user>
##$USERA4= <user>
##$USERA5= <user>
##$V9= 5
##$VALIST= <valist>
##$VCLIST= <CCCCCCCCCCCCCCC>
##$VD= 0
##$VDLIST= <DDDDDDDDDDDDDDD>
##$VPLIST= <PPPPPPPPPPPPPPP>
##$VTLIST= <TTTTTTTTTTTTTTT>
##$WBST= 1024
##$WBSW= 4
##$XGAIN= (0..3)
0 0 0 0 
##$XL= 0
##$YL= 0
##$YMAX_a= 353667
##$YMIN_a= -351973
##$ZGOPTNS= <>
##$ZL1= 120
##$ZL2= 120
##$ZL3= 120
##$ZL4= 120
##$ABSF1= 16.44956
##$ABSF2= -4.243612
##$ABSG= 5
##$ABSL= 3
##$ALPHA= 0
##$AQORDER= 0
##$ASSFAC= 0
##$ASSFACI= 0
##$ASSFACX= 0
##$ASSWID= 0
##$AUNMP= <proc_1d>
##$AZFE= 0.1
##$AZFW= 0.1
##$BCFW= 0
##$BC_mod= 0
##$BYTORDP= 0
##$COROFFS= 0
##$CY= 12.5
##$DATMOD= 1
##$DC= 0
##$DFILT= <>
##$DTYPP= 0
##$F1P= 14.0000005364418
##$F2P= -0.99999901652339
##$FCOR= 0.5
##$FTSIZE= 32768
##$FT_mod= 6
##$GAMMA= 0
##$GB= 0
##$INTBC= 1
##$INTSCL= 1
##$ISEN= 128
##$LB= 0.3
##$LEV0= 0
##$LPBIN= 0
##$MAXI= 10000
##$MC2= 0
##$MEAN= 0
##$ME_mod= 0
##$MI= 0
##$NCOEF= 0
##$NC_proc= -3
##$NLEV= 6
##$NOISF1= 0
##$NOISF2= 0
##$NSP= 0
##$NTH_PI= 0
##$NZP= 0
##$OFFSET= 16.44956
##$PC= 1
##$PHC0= -48.93726
##$PHC1= 3.364127
##$PH_mod= 1
##$PKNL= yes
##$PPARMOD= 0
##$PSCAL= 4
##$PSIGN= 0
##$REVERSE= no
##$SF= 250.130018118989
##$SI= 32768
##$SIGF1= 0
##$SIGF2= 0
##$SINO= 400
##$SIOLD= 32768
##$SREGLST= <1H.CDCl3>
##$SSB= 0
##$STSI= 32768
##$STSR= 0
##$SW_p= 5175.98343685301
##$SYMM= 0
##$S_DEV= 0
##$TDeff= 65536
##$TDoff= 0
##$TI= <Analysis number 999999
Compound Code 99
Book Reference 9
Project Code 9>
##$TILT= no
##$TM1= 0
##$TM2= 0
##$TOPLEV= 0
##$USERP1= <user>
##$USERP2= <user>
##$USERP3= <user>
##$USERP4= <user>
##$USERP5= <user>
##$WDW= 1
##$XDIM= 32768
##$YMAX_p= 383708261
##$YMIN_p= -147357
$$ End of Bruker specific parameters
$$ ---------------------------------
##NTUPLES= NMR SPECTRUM
##VAR_NAME=  FREQUENCY,     SPECTRUM/REAL,   SPECTRUM/IMAG
##SYMBOL=    X,             R,               I
##VAR_TYPE=  INDEPENDENT,   DEPENDENT,       DEPENDENT
##VAR_FORM=  AFFN,          ASDF,            ASDF
##VAR_DIM=   32768,         32768,           32768
##UNITS=     HZ,            ARBITRARY UNITS, ARBITRARY UNITS
##FACTOR=    0.157963299565203, 1,           1
##FIRST=     4114.52878222222, 0,            0
##LAST=      -1061.45465463079, 0,           0
##MIN=       -1061.45465463079, -147357,     0
##MAX=       4114.52878222222, 383708261,    0
$$ Real data points
##PAGE= N=1
##DATA TABLE= (X++(R..R)), XYDATA
$$ [...]
23822c8367q006j1053r823q865J5772k179J2685M4825N275M368M884k6439l587
23809b0510M2378J1584J4538J7817l4702P87l5971j0413j2755O770K7649O616
23797A3788j7465j0909k3365k6929J8551N0187J6309j8602j0821m7k9488k4326
23785f3117J8718J6929K0508K3167K4288n948k1947R870P629j6454l8501J3677
23773a1181K552j7862k5618l637K5404J987P024O567o288J6366K3611j9554o617
23760g246J1793K8575L024m2927j5771j474j6118n027K9460O747j7432M856K0130
23747a410j77j1210M8422J2409k0504k5441j1626Q253R665J2887l6717j5362J1414
23734a9397J8196L008j8195p102J8669J9761o823m182k2425J6184N870j3570j1480
$$ plain form
23822 -38367 -46373 -57426 -67249 -76114 -60342 -62521 -49836 -5011 264 4632 9516 -16923 -20510
23809 -20510 21868 33452 47990 65807 31105 31892 -4079 -14492 -27247 -20477 7172 13788
23797 13788 -3677 -14586 -37951 -64880 -46329 3858 20167 1565 -9256 -9303 -38791 -63117
23785 -63117 -44399 -27470 -6962 16205 40493 34545 12598 22468 30097 13643 -24858 -11181
23773 -11181 -8629 -26491 -52109 -55746 -30342 -28355 -21331 -14764 -21052 -4686 18925 -629 -7246
23760 -7246 4547 33122 36146 -6781 -22552 -24026 -40144 -45171 -15711 -8964 -26396 -21540 -1410
23747 -1410 -1587 -12797 35625 48034 27530 2089 -9537 -1284 8381 21268 -15449 -30811 -19397
23734 -19397 -1201 1807 -16388 -23490 -4821 14940 8117 3935 -18490 -2306 3564 -10006 -21486
23721b1486k6346k5518M457K9722K3366K6891O126k5808q166l89j6383L132J6969
23708a3433Q739O987J0599n0506j8349K1201j4853L0658K0010L916K5329k10J082
23695C1170l4992o39k1832l711j715O525K2709L210l8998k8340J525m846L9952
23682b9982K5614j0444J9980j1011l6433j054P00M111q637l946L0809Q547p261
23669a9007j9480l293k5963q179K2971P64L9752L0569M096R702M916l7496K702
23656B054n976O208k066J0560K4754N880j9311j6948j3890j4776J9557Q118m3812
23643c9648J200K8113M049o131j1166k070j1571l680p659o85p400K0417L1765
23630d466K4073q111j3492J757J7247j8601l6727j4539j5029J2707M0449K9904
$$ plain form
23721 -21486 -47832 -73350 -68893 -39171 -15805 11086 17212 -8596 -16762 -17151 -33534 -30402 -13433
23708 -13433 -4694 2293 12892 -37614 -55963 -34762 -49615 -18957 1053 4969 30298 30088 31170
23695 31170 -3822 -4461 -26293 -30004 -31719 -25194 -2485 725 -38273 -66613 -65088 -69934 -29982
23682 -29982 -4368 -14812 5168 -5843 -42276 -43330 -42630 -38519 -47156 -51102 -20293 -11746 -19007
23669 -19007 -38487 -41780 -67743 -75922 -52951 -52187 -12435 18134 22230 31932 36848 -648 2054
23656 2054 -3922 2286 220 10780 35534 41414 22103 5155 -8735 -23511 -3954 4164 -39648
23643 -39648 -38448 -10335 -6286 -12417 -23583 -25653 -37224 -40904 -48563 -49248 -56648 -36231 -4466
23630 -4466 19607 11496 -1996 -239 17008 -1593 -38320 -52859 -67888 -55181 -14732 15172
23618A5172j0424k4420J7294J6843j4740k223K640L117R206L955l3404k2211m641
23605d3836n579P146K4848Q336P400j7536N744O290J6746j0228R95j8967K0114
23592A473p4j6648j337K2402j2816j0466o49J9397j4914k0734M787p487J0047
23579b7019O25J1643N769k440r166j6135K5041K1286k0331j0251J1755n47k1195
23566c0965l430l968J3565k1782J1244L7974J0720L928o672k5453j2508O905J0410
23553a0032l693J5854j2050j632J4080M2190K7157n612m3979k1346J6896m747
23541A3086J7265J7400M338k4691k3643m994O555O588k3412k8267K3200L0945
23529A4370J4389J6230N144n807j4323k4589j7149R047M03p294L24l2910Q608
$$ plain form
23618 15172 4748 -19672 -2378 14465 -275 -2498 142 3259 12465 16420 -16984 -39195 -43836
23605 -43836 -49415 -42269 -17421 -9085 -1685 -19221 -13477 -7187 9559 -669 326 -18641 1473
23592 1473 1399 -15249 -16586 5816 -7000 -17466 -18115 1282 -13632 -34366 -29579 -37066 -27019
23579 -27019 -26394 -14751 -8982 -11422 -20588 -36723 -11682 9604 -10727 -20978 -9223 -9770 -30965
23566 -30965 -34395 -38363 -24798 -46580 -35336 2638 13358 17286 10614 -14839 -27347 -20442 -10032
23553 -10032 -13725 2129 -9921 -11553 2527 44717 71874 66262 22283 937 17833 13086
23541 13086 30351 47751 52089 27398 3755 -1239 5316 11904 -11508 -39775 -16575 14370
23529 14370 28759 44989 50133 44326 30003 5414 -11735 -2688 -2285 -9579 -9255 -42165 -33557
23516c3557J3822k482O095n771j2649m531J2597J5224L5478M710j2902M712p5328
23503e4582l2009M6013J3341K6883L812P618N282p671j8175J0143l9798J2907
23491b6236L9848K2483j366K1421j9734l8151K0303L1150l3812j5570n58j3423
23479a3645j2222L060l2607l2729L1762j387j3654J9597L4267m300O301L1912
23467A6355n950K581o436m86k8479k0010J1676k5172k0666Q952K2535K0197J0664
23454a4239q590Q531K2116K5267k3752k6204O527J0632k479l5313N806o060j3373
23441e1131J4312J7773K8174k2147j6966K382N899K199K731l37K3135M132k1738
23428a1582L87q06l7267j5142J2865L416k296k423n182M187N890J8613o178K1255
$$ plain form
23516 -33557 -19735 -22217 -16122 -21893 -34542 -39073 -26476 -11252 24226 28936 16034 20746 -54582
23503 -54582 -86591 -40578 -27237 -354 3458 11076 16358 8687 -9488 655 -39143 -26236
23491 -26236 13612 36095 34729 56150 36416 -1735 18568 49718 15906 336 -222 -13645
23479 -13645 -25867 -22807 -55414 -88143 -56381 -57768 -71422 -51825 -17558 -21858 -15557 16355
23467 16355 10405 12986 6550 6064 -22415 -42425 -30749 -55921 -76587 -67635 -45100 -24903 -14239
23454 -14239 -22829 -14298 7818 33085 9333 -16871 -10344 288 -2191 -37504 -31698 -37758 -51131
23441 -51131 -36819 -19046 9128 -13019 -29985 -27603 -21704 -19505 -16774 -17111 6024 10156 -11582
23428 -11582 -11195 -12001 -49268 -64410 -51545 -48129 -50425 -52848 -58030 -53843 -47953 -29340 -35518 -14263
23414a4263j011j4632J120N051J5024J7053L1738K0656K2365L216k4580l2029
23402B9708l0869L953o494R80l8753K5491J6169L484k6899R532L6657J3852o074
23389C0737L602l752p111j8049m619k5894J0609j1403k2801N564K3342K4986O926
23376A2137j1949J3832L0088k694k3705j8809k241k661N989k162l0074K7501M692
23363e6j9996m911q706P701J9677j6497j9745P447J3152K0536L890l0073j162
23350b8743L5188P652M30O131O758O027J0893k7866k4964j7753r87N141q367J8116
23336a2344L0214J231l0422l3901K729J6539M862J4072K5879J8119n265p688j1333
23323A2692p256k2463k3217N102J0484k2987j6714K7063p808j2528J1859K9700
$$ plain form
23414 -14263 -15274 -29906 -28786 -23735 -8711 8342 40080 60736 83101 86317 61737 29708
23402 29708 -1161 2792 -3702 -2722 -41475 -15984 185 3669 -23230 -13698 22959 36811 30737
23389 30737 34339 30587 23476 5427 808 -25086 -14477 -25880 -48681 -43117 -19775 5211 12137
23376 12137 188 14020 44108 41414 17709 -1100 -3341 -6002 -13 -2175 -32249 -4748 -56
23363 -56 -20052 -24963 -33669 -25968 -6291 -22788 -42533 -35086 -21934 -1398 2492 -27581 -28743
23350 -28743 6445 14097 14527 20658 27416 33443 44336 16470 -8494 -26247 -27234 -22093 -30460 -12344
23336 -12344 17870 19101 -11321 -45222 -42493 -25954 -21092 -7020 18859 36978 31713 24025 12692
23323 12692 5436 -17027 -40244 -35142 -24658 -47645 -64359 -37296 -45104 -57632 -45773 -16073
23311a6073q134M396m872k0888j381K4529O733O37L068m735k2237j2518J5730
23298c5745n314n02n441M366j1467r337K5093K8221Q816k0037k3607j0691J4155
23285d1490K8410l409n204Q629l296m143M786J6467K3968j7197j4597l1614j9730
23272e8420K8774J9454J1654m723J1445k1798j8565J9602q32j111J6772p84R393
23259A0861J4092l5944M987J7218j1323N071J344R471q930O966l4899j00J4689
23246f497j7374O130K2190R398l17J6564j0131J9294K5785O88r444m9783j1611
23233e108m732J7616K0868J0787k6695j4899o338k017n389R56K5262k444k6173
23220a8306J0111R271j0898k760J293j846L023J189j3178j4152J0238r137P636
$$ plain form
23311 -16073 -24207 -19811 -24683 -45571 -46952 -22423 -15690 -15053 -11985 -16720 -38957 -51475 -35745
23298 -35745 -41059 -41561 -47002 -42636 -54103 -63440 -38347 -10126 -1310 -21347 -44954 -55645 -41490
23285 -41490 -13080 -16489 -21693 -13064 -16360 -20503 -15717 750 24718 7521 -7076 -38690 -58420
23272 -58420 -29646 -10192 1462 -3261 8184 -13614 -32179 -12577 -13409 -14520 2252 1468 10861
23259 10861 24953 -10991 -6004 11214 -109 4962 6306 15777 6847 13813 -21086 -21186 -6497
23246 -6497 -23871 -17741 4449 13847 13530 30094 19963 39257 65042 65730 56286 6503 -5108
23233 -5108 -9840 7776 28644 39431 12736 -2163 -8501 -10518 -15907 -14951 10311 7867 -18306
23220 -18306 -8195 1076 -9822 -12582 -11289 -13135 -10112 -8923 -22101 -36253 -26015 -35152 -27516
23207b7516K8258K4804L843j9059L6542J6250k9658m7392l0655R367M079j9123
23195e0260j5021K1620q388K2885o937J7524o233o488Q52J3555J6868j3595l9431
23182e3049J4877K6104n529N97K1867q728j7412J2795o138J5888N088l4742L240
23169b5142J8505p128j8427j0169J4800K238R689R458O7289J5906m2264m327K387
23156C2815K796K4943j2829k56j2146K354L817j0304m007p72l2725k2269O996
23143b1587K6455n907P761k3481j3916M4494K7998j6387k7742m28k029J7641k198
23130A0674J3087J164L28K3614Q206k9680j6906j7383j8126l847L783j1633K5562
23117a1157K4545K8064j2970q815j213j2429k1237j7656J2446L385p369j4793
$$ plain form
23207 -27516 742 25546 29389 10330 46872 63122 33464 -13928 -44583 -35216 -31137 -50260
23195 -50260 -65281 -43661 -52049 -29164 -36101 -18577 -24810 -31298 -30446 -16891 -23 -13618 -53049
23182 -53049 -38172 -12068 -17597 -17000 4867 -3861 -21273 -8478 -14616 1272 6360 -28382 -25142
23169 -25142 -6637 -13765 -32192 -42361 -27561 -25323 -15634 -6176 61113 77019 34755 30428 32815
23156 32815 35611 60554 47725 47469 35323 37677 41494 31190 27183 26411 -6314 -28583 -21587
23143 -21587 4868 -1039 6722 -16759 -30675 13819 41817 25430 -2312 -2740 -4769 12872 10674
23130 10674 23761 24925 25253 48867 57073 27393 10487 -6896 -25022 -28869 -25086 -36719 -11157
23117 -11157 13388 41452 28482 19667 18454 6025 -15212 -32868 -20422 -17037 -24406 -39199
23105c9199q579J5049M555P827O524j7861n985K2166J4893R858J9917J4621l770
23092D0016l1012l0612o043l033p421k3882j0321O305q535J4805k661K6874k713
23079c8233M447j3662k302J6517P216k0043j3539J6237j340K685M828M834K4146
23066h209J8086r713O243k0479j8894M199L2931J3750P112K187O447p649j5430
23053A0581k3840l326k2854j726J2027N813J0944K5341R17K153k5828k4966n164
23040c9928K8124J495n488P926Q180k3710J5988r684K530R031j9552R144O159
23027i785m704j4707K5450k9759j5933M1403K301K4609j1331k3019p365n981Q781
23014b0040k0314J8818q23Q261j0690r813N919K9035m279k3271k3180J4430J6579
$$ plain form
23105 -39199 -47778 -32729 -28174 -20347 -13823 -31684 -37669 -15503 -610 9248 29165 43786 40016
23092 40016 9004 -21608 -27651 -30684 -38105 -61987 -72308 -66003 -74538 -59733 -62394 -35520 -38233
23079 -38233 -33786 -47448 -49750 -33233 -26017 -46060 -59599 -43362 -44702 -42017 -37189 -32355 -8209
23066 -8209 9877 164 6407 -14072 -32966 -28767 4164 17914 25026 27213 33660 26011 10581
23053 10581 -13259 -16585 -39439 -41165 -29138 -23325 -12381 12960 13877 16030 -9798 -34764 -39928
23040 -39928 -11804 -10309 -15797 -7871 309 -23401 -7413 -17097 -14567 -5536 -25088 -15944 -9785
23027 -9785 -14489 -29196 -3746 -33505 -49438 -8035 -5734 18875 7544 -15475 -22840 -28821 -20040
23014 -20040 -40354 -21536 -22359 -14098 -24788 -34601 -28682 353 -3926 -27197 -50377 -35947 -19368
23001a9368J9158O119k5722J2338K6031j866j2188j2339l210j4201j2249j356
22989c8853J1648K0847N945J4009j294M732Q500r373j549M775K5259n50k0847
22976B3249l4479M583N126k5919M925k5116J0896J5379o959M418J5638K0327O215
22963A8283l123r343J3546j0973R433L0483m472J350M04k9636j6477n281n350
22950a1156P746j1703K1042N34j4100j9898l80K615K4652K368l646l646j1087
22937a6659J4167J2616L997j839j4091l1487p303Q89L083p228L3354J9708K0125
22924B9332K808l4257k1453j4853j067L9975K2573k9847p486P338k4999J1981
22912a9955J4916p16K1548P13k9372j0286K5253M292k1049k8023P653K6538J6267
$$ plain form
23001 -19368 -210 5909 -19813 -7475 18556 16690 4502 -7837 -11047 -25248 -37497 -38853
22989 -38853 -27205 -6358 -413 13596 12302 17034 25534 16161 14612 19387 44646 44096 23249
22976 23249 -11230 -6647 -1521 -27440 -22515 -47631 -36735 -21356 -28315 -23897 -8259 12068 18283
22963 18283 15160 5817 19363 8390 17823 48306 43834 45184 45588 15952 -525 -5806 -11156
22950 -11156 -3410 -15113 5929 6463 -7637 -27535 -27915 -25300 -648 1720 -1926 -5572 -16659
22937 -16659 -2492 10124 14121 12282 -1809 -33296 -40599 -39710 -36627 -43855 -10501 9207 29332
22924 29332 32140 -2117 -23570 -38423 -39490 485 23058 -6789 -14275 -6937 -31936 -19955
22912 -19955 -5039 -5755 15793 16506 -12866 -23152 2101 6393 -14656 -42679 -35026 -8488 7779
22899G779k8875j9501k1042p531K3984J0604R589L780j55K344m213m6589q652
22886g8478L5172N0685j252J3027K733l574k6768k1650N111K9024L844k3617r700
22873b5443k7469J0985J7529L980j6266M307k4492m1799J9821L5870J8879L0100
22861F002K6020M522k6257l7098j4188K0827N290j1707N485J0177J8989N037O019
22848A9118l9104r488P498J6533L1102J1308k114j9261k3132l7620o324J994K4973
22835b4517L7147J8283K7114K333k5827k1534j7116J11K8197J8576j2435m8506
22823a8174k4843N6826K5296k631r943l608J920R561k6588k7158M833j260r898
22810b5667k79j7639p407j3786r591j0375J899J9828K9221K4907L317m588O769
$$ plain form
22899 7779 -21096 -40597 -61639 -69170 -45186 -34582 -24993 -21213 -21368 -19024 -23237 -69826 -78478
22886 -78478 -43306 7379 6127 19154 21887 18313 -8455 -30105 -24994 4030 7874 -15743 -25443
22873 -25443 -52912 -41927 -24398 -20418 -36684 -32377 -56869 -98668 -78847 -42977 -24098 6002
22861 6002 32022 36544 10287 -26811 -40999 -20172 -14882 -26589 -21104 -10927 8062 13099 19118
22848 19118 -19986 -29474 -21976 -5443 25659 36967 34853 15592 -7540 -45160 -51484 -49490 -24517
22835 -24517 12630 30913 58027 60360 34533 12999 -4117 -4006 24191 42767 30332 -18174
22823 -18174 -43017 13809 39105 36474 26531 22923 24843 34404 7816 -19342 -14509 -15769 -25667
22810 -25667 -25946 -43585 -50992 -64778 -74369 -84744 -82845 -63017 -33796 -8889 -5572 -10160 -3391
22797c391J323n28j9807k3126k5104j186l123Q074J1602o909N012K8980q80J90
22783b8873P654K2505J0285l809K579J2889J8095M188M466k2694j4263o952J3193
22770A9263k5815k0080K3301K6553j5082j3493k1926K2429R976j922n0175l901
22758e0872R634J2010R411O208r508J3939p88k2575P391K9971J7589Q422j7801
22745A3031j722N342M047J5084K0782j0202m1277k4342O809j165L1787j535l3867
22732a7228K1276P694k910J5541n090j0323j0107o109j9411j12N748K2387j5092
22719a3736m6744N646Q023l078P520m529M91K2840K2793o555K0473J6102k9171
22706G5k4246O915K1341Q730q802k934m355n340J1476J8111J2759p563j6308j7845
$$ plain form
22797 -3391 -2068 -2596 -22403 -45529 -70633 -71819 -74942 -66868 -55266 -62175 -57163 -28183 -29063 -28873
22783 -28873 -21219 1286 11571 7762 10341 23230 41325 45513 49979 27285 13022 6070 19263
22770 19263 -6552 -26632 -3331 23222 8140 -5353 -27279 -4850 5126 3204 -46971 -50872
22758 -50872 -41238 -29228 -19817 -13609 -23117 -9178 -9966 -32541 -25150 4821 22410 30832 13031
22745 13031 11309 16651 20698 35782 56564 46362 5085 -19257 -12448 -13613 18174 16639 -17228
22732 -17228 4048 11742 8832 24373 19283 8960 -1147 -7256 -26667 -26779 -21031 1356 -13736
22719 -13736 -60480 -54834 -46811 -49889 -42369 -46898 -46407 -23567 -774 -7329 13144 29246 75
22706 75 -24171 -17256 4085 12815 4013 1079 -3276 -8616 2860 20971 33730 26167 9859 -7986
22692g986k3161K1482l647l747Q045L839k0012R244N781k0872j7057P87J9412
22679b7892J7887m142j7754J8918J6814J2681l72J0758j9179l6120j9787J780
22667d6408L4425M470k1505r914J5758J4389J933J5926K8157J6211q214j632K3168
22654F6764k8073o7303l615K3575Q974J6001m730p73J0730m350n710r278k2181
22641a9969j0989J3352J2630R925k466Q95J9980j2884l353L018j1310j8517P229
22628a2459K1314P421k5272l5004n491K0115K1029M518N857K5805j5238K613n942
22615I266l778j648j2411j640K8379J6024J5439k7016j5745J1888k465K1701l99
22602C7595p014l3810p701j9782j3431j3995K3710J0122j4441J8242K0545j4702
$$ plain form
22692 -7986 -31147 -9665 -13312 -17059 -9014 -5175 -25187 -15943 -10162 -31034 -48091 -47304 -27892
22679 -27892 -10005 -14147 -31901 -12983 3831 16512 16140 26898 7719 -28401 -48188 -46408
22667 -46408 -11983 -7513 -29018 -38932 -23174 -8785 -6852 9074 37231 53442 45228 43596 66764
22654 66764 38691 -28612 -32227 -8652 322 16323 11593 10820 21550 17200 11490 2212 -19969
22641 -19969 -30958 -17606 -4976 4949 2483 3378 23358 10474 7121 10139 -1171 -19688 -12459
22628 -12459 8855 16276 -8996 -44000 -49491 -29376 -8347 -3829 2028 27833 12595 15208 9266
22615 9266 5488 3840 -8571 -10211 18168 34192 49631 22615 6870 18758 16293 37994 37595
22602 37595 30581 -3229 -10930 -30712 -44143 -58138 -34428 -24306 -38747 -20505 40 -14662
22590a4662k2001j9167n125L4130K3639k0499J221k5807k8368J1399L6293L06
22578b8641K598K109j6792L0434N1381P651k0574k4381J2284K0605J7782k0805
22566C3651j987k315j978l0193l4286K3063O856o687k2256Q688K0212q177k239
22553a7648J0103j5009m777J4076K4041M655j2844n3o471O000Q178J7017Q027
22540C5295k8528k8872J8337R183l2269O832M07n037J2290j396j7463p914L7005
22527b130m673o686O985m5810m850K6939K8968J7938L0810k8378l119J7100q177
22514B4917k1149j3265p929l707j1848M4963L6773M284j5636j2136J2519L4990
22502G2776J837r893l5504k70j6574k4393J4481R352l2037j4807j8135O37J9816
$$ plain form
22590 -14662 -36663 -55830 -60955 -26825 -3186 -23685 -22464 -48271 -76639 -65240 -28947 -28641
22578 -28641 -26043 -23934 -40726 -10292 41089 48740 28166 3785 16069 36674 54456 33651
22566 33651 31664 29349 27371 -2822 -37108 -14045 -7189 -13876 -36132 -27444 -7232 -15409 -17648
22553 -17648 -7545 -22554 -27331 -13255 10786 15441 2597 2544 -3927 2073 10251 27268 35295
22540 35295 6767 -22105 -3768 5415 -26854 -20022 -19615 -24652 -12362 -13758 -31221 -39135 -2130
22527 -2130 -6803 -13489 -6504 -52314 -57164 -30225 -1257 16681 47491 19113 15994 33094 24917
22514 24917 3768 -9497 -17426 -21133 -32981 11982 48755 53039 37403 25267 37786 72776
22502 72776 74613 64720 29216 28946 12372 -12021 2460 11812 -20225 -35032 -53167 -52530 -32714
22489c2714K056j9412J7706J5572J7069J4947Q952J2741J8899o615j4536j6356
22477A8309l3096R665M719j7745q943p215J948N688m4096n100M2937R346j647
22464b5230K1080J169k1326p28j368k2684j4263O3301j4444k634j766l5622J8698
22451c5817L7798K639O971k1591P068K0212j5955j5777N718L882N917j3111j1769
22438b3815N753K1121J8438k963j8278r390J8600K1114J1430r920j8303j1374
22426B413j2873J9189O537m0448M909j9890K721J2168J7609J4791R419o239j7498
22413g192o670N194o1504m725K2861L807O403K1479k0929R753J6414K3928o709
22400B110k7639j7409O301M8270P561p658j0462K383p881N507j553l6592K861
$$ plain form
22489 -32714 -30658 -50070 -32364 -16792 277 15224 24176 36917 55816 49201 34665 18309
22477 18309 -14787 -5122 -403 -18148 -27091 -34306 -32358 -26670 -70766 -75866 -32929 -23583 -25230
22464 -25230 -4150 -2981 -24307 -25035 -26403 -49087 -63350 -49 -14493 -17127 -18893 -54515 -35817
22451 -35817 1981 4620 11591 -10000 -2932 17280 1325 -14452 -8734 -4852 1065 -12046 -23815
22438 -23815 -18062 3059 21497 18534 256 -9134 9466 30580 42010 32090 13787 2413
22426 2413 -10460 8729 15266 -25182 -20273 -40163 -37442 -25274 -7665 7126 16545 10306 -7192
22413 -7192 -13862 -8668 -70172 -74897 -52036 -48229 -41826 -20347 -41276 -31523 -15109 8819 2110
22400 2110 -25529 -42938 -36637 11633 19194 11536 1074 3457 -4424 1083 -470 -37062 -34201
22387c4201J1382K1484K9641J1175q56m675J872j6107n2546k3307k119L2034K3834
22374b389O999k9802J031K482r877O92j5961K763L6562j5641k4707K2815P842
22361a7191O560J5573m2k210n898j2656r923m046j1912k996J5960p876P065N866
22347b3726j4301R736N437k4101k763l144L447K7264p347k117K289m3060j7845
22334i0231K9262L2714J50j2892P42n518N522M546K5535R903M245r999k2853K5399
22320c475L3567K7173j3073j2121j6823k3357l037n147n98J4082l34J9997p456
22307I398j3431K369l3210k4287K8660K5663K5852P315J2068J895r803l437j7973
22294A1079k732Q600R797k1493l426R77j1558l115N408j8343J8953j2070n851
$$ plain form
22387 -34201 -22819 -1335 28306 39481 38625 33950 35822 19715 -32831 -56138 -58257 -26223 -2389
22374 -2389 4610 -25192 -24161 -21679 -31556 -30864 -46825 -44062 -7500 -23141 -47848 -25033 -17191
22361 -17191 -10631 4942 4900 2690 -3208 -15864 -25787 -29833 -41745 -44741 -28781 -36657 -29592 -23726
22347 -23726 -38027 -28291 -22854 -46955 -49718 -52862 -49415 -22151 -29498 -31615 -29326 -72386 -90231
22334 -90231 -60969 -28255 -28105 -40997 -40255 -45773 -40251 -35705 -10170 -267 3978 -6021 -28874 -3475
22320 -3475 30092 57265 44192 32071 15248 -8109 -11146 -16293 -16891 -2809 -3143 16854 9398
22307 9398 -4033 -1664 -34874 -59161 -30501 -4838 21014 28329 40397 42292 32489 29052 11079
22294 11079 8347 16947 26744 5251 1825 2802 -8756 -11871 -6463 -24806 -5853 -17923 -23774
22281b3774q622K128J3228n616K719L2418j097N159k4773l756p520o499M99Q545
22267a6961j0396j738R927J8995K0573l475J929K1790k3060j6360q269L4759Q261
22254C5975j4720j0966j7973J2435q95j2731O57K964Q899K022j703L423L9107
22241D6494K1370O86o0879p300j2844j5105r201K3099K2602J2038j7562j2685
22229i287q949J0027L227j4662j561j6296j2716j456J2108L6553M4639N824k7673
22216A9778j3674q169o877J3117j1513r005r973J404j2403Q274K0036k733j5733
22203b7471L2828o31q440j8735j8471l2456r714J9650K387L4009J5859j7179J6209
22190a2155J9460J3097k0985l0799o069K1675J5293J0525N10j1129M891N678J0691
$$ plain form
22281 -23774 -32396 -30268 -17040 -22656 -19937 12481 11384 16543 -8230 -11986 -19506 -26005 -25506 -16961
22267 -16961 -27357 -29095 -19168 -173 20400 16925 18854 40644 17584 1224 -7045 27714 35975
22254 35975 21255 10289 -7684 4751 3856 -8875 -8218 -5254 3645 5667 3964 7387 46494
22241 46494 67864 68550 7671 371 -12473 -27578 -36779 -13680 8922 20960 3398 -9287
22229 -9287 -18236 -8209 -4982 -19644 -21205 -37501 -50217 -51673 -39565 -3012 41627 47451 19778
22216 19778 6104 -2065 -8942 4175 -7338 -16343 -26316 -24912 -37315 -29041 -9005 -11738 -27471
22203 -27471 5357 4726 -3714 -22449 -40920 -73376 -83090 -63440 -61053 -27044 -11185 -28364 -12155
22190 -12155 7305 20402 -583 -31382 -37451 -15776 -483 10042 10552 -577 4314 9992 20683
22177B0683j5558j7721R000K3919N907k4472p231J521j5944l912N130p528K0958
22164e248K0342p207j5960L0281J7322m005j8458q461j8750k8871J593J6021r418
22151c0819J9603m760l74k8405n470K9220o360k446P398K3291L219P81k2127Q618
22137h631p067J8227j141p822o040r819Q850N195k5490j4001K009J4768J3411
22124a7551K8015M587P207L736q373j5830J2426K730O952L9770j3516Q649m6052
22111A2750q342j1405k3905J56k5712o156K0681M0939J2316k8351n649J173J7260
22098d245k5362m6416l965K6123J4839J578j2640j3092L5798J3361J531K5599
22086A3109M276J1241r362j0167n257K0175J0172K0503L371K643j9443j8697J1269
$$ plain form
22177 20683 5125 -12596 -3596 20323 26230 1758 -5473 -3952 -19896 -23808 -18678 -26206 -5248
22164 -5248 15094 7887 -8073 22208 39530 35525 17067 8606 -10144 -39015 -37422 -21401 -30819
22151 -30819 -11216 -15976 -16350 -44755 -50225 -21005 -27365 -29811 -22413 878 4097 4878 -17249 -8631
22137 -8631 -15698 2529 1388 -6434 -12474 -22293 -13443 -8248 -33738 -47739 -45730 -30962 -17551
22124 -17551 10464 15051 22258 25994 17621 1791 14217 16947 23899 63669 50153 58802 12750
22111 12750 4408 -6997 -30902 -30746 -56458 -62614 -41933 -994 11322 -17029 -22678 -21505 -4245
22098 -4245 -29607 -76023 -79988 -53865 -39026 -37448 -50088 -63180 -27382 -14021 -12490 13109
22086 13109 17385 28626 19264 9097 3840 24015 34187 54690 58061 60704 41261 22564 33833
22073C3833Q949l2009k5762n263L8241J3144k9377J953N330j2942K303L127J276
22060B803J275k0604J0667r039n20m245J5273j3625J205K1034K5803p04J245o411
22046B4157l3627k0773j5489R182J6019j5640n469L6784J0020l6769k4445k481
22034e8531K5062M3596l206m0171j9156k955P45K3333J7575K4706p010l755J76
22021D09j8668k4335j7822L8726L8832K1809j7794j531r140J84J9001P517k5193
22008A1995l6688L989K5933J2337J334m1737J4118K6495J502l6171k1441J8879
21996a9455J1286J9203j9015l2278N493J6781J4150l247m3515K445L9029K021
21984g102q841j5890J5527j3129K533K6582K3371P997N624k9715j2846O376p352
$$ plain form
22073 33833 42782 10773 -14989 -20252 17989 31133 1756 3709 9039 -3903 -1600 1527 2803
22060 2803 4078 -16526 -5859 -14898 -15418 -19663 -4390 -18015 -16810 4224 30027 29323 30568 24157
22046 24157 -9470 -30243 -45732 -36550 -20531 -36171 -41640 -4856 5164 -31605 -56050 -58531
22034 -58531 -33469 10127 6921 -33250 -52406 -55361 -54616 -31283 -13708 10998 3988 233 409
22021 409 -18259 -42594 -60416 -21690 17142 38951 21157 19626 10486 10670 29671 37188 11995
22008 11995 -24693 -20704 5229 17566 18900 -22837 -8719 17776 19278 -16893 -38334 -19455
21996 -19455 -8169 11034 -7981 -40259 -34766 -17985 -3835 -7082 -50597 -48152 -9123 -7102
21984 -7102 -15943 -31833 -16306 -29435 -26902 -320 23051 31048 36672 6957 -5889 487 -6865
21971f865O27j619Q68k6778j4762O617K1337J0649j6778p368O87K5457J7251j8908
21957i585q987M2052O678k346k9309R338R319q17J4046P364j6517p159j8608m0287
21943d4818m1056K9454L3067Q521J1706J1332j1655p814n18r226q452j2682J7309
21930b4832M305M567j702m857J7096j4066j1108J8854l245j0981j879J309R120
21917a7419K8799j7601k4375K256r789r023L89j8826L6967K7212l8158j4356J1828
21904d2096J584r394K071P798K1530M6420J4416k9915l4623k6255J6171P323P490
21891a7480k179k3444K0630K4820J5971k8958K1232J0643o016L958L9176P335
21879F5688j4192J2956P444m4794j9964J0764k3190j7542K8963J9837k4488k4048
$$ plain form
21971 -6865 -6238 -7857 -6989 -33767 -48529 -41912 -20575 -9926 -26704 -34072 -33385 -7928 9323 -9585
21957 -9585 -18572 23480 30158 27812 -1497 7841 17160 16343 30389 37753 21236 14077 -4531 -44818
21943 -44818 -85874 -56420 -23353 -14832 -3126 8206 -3449 -11263 -11781 -21007 -29459 -42141 -24832
21930 -24832 -20527 -15960 -17662 -22519 -5423 -19489 -30597 -11743 -14988 -25969 -27848 -26539 -17419
21917 -17419 11380 -6221 -30596 -28340 -38129 -47152 -46763 -65589 -28622 -1410 -39568 -53924 -42096
21904 -42096 -40512 -49906 -47835 -40037 -18507 27913 42329 12414 -22209 -48464 -32293 -24970 -17480
21891 -17480 -19659 -43103 -22473 2347 18318 -10640 10592 21235 15219 19177 58353 65688
21879 65688 51496 64452 71896 27102 7138 17902 -5288 -22830 6133 25970 1482 -22566
21867b2566r305K4753O817j2314k5528q404L5327K7894q078n694L944Q023k3226
21854h357l6477j7823J2233j5778J3361J8770K1619J1522J8485j3275J948k079
21842D149K590R800K2307M062j8167J1191L6220n0487m4496k019O785k088K401
21829a7752L9848N095K3879J3581j4654l4720j8411O167j9583p682K0593K7317
21817B3678M760n287k4517K8813q013k8961r808j1932o690R807J0040J0179K0481
21804A2550j4888l1817L7313L2350r1m0943q478o944k953K5105J2457L732J3705
21791C1098O627j9350J9071j0202j5498r303j3301M150m902O969K289n632k9565
21778c7549j5430K6060L1562J9780J0624Q923J164j0329k1997j1080r319r45P033
$$ plain form
21867 -22566 -31871 -7118 -301 -12615 -38143 -46547 -11220 16674 8596 2902 6846 14869 -8357
21854 -8357 -44834 -62657 -50424 -66202 -52841 -34071 -12452 -930 17555 4280 6228 4149
21842 4149 6739 16539 38846 42908 24741 35932 72152 21665 -22831 -24850 -18065 -20153 -17752
21829 -17752 22096 27191 51070 64651 49997 15277 -3134 3033 -16550 -24232 -3639 23678
21817 23678 28438 23151 -1366 27447 19434 -9527 -19335 -31267 -37957 -28150 -18110 -7931 12550
21804 12550 -2338 -34155 3158 35508 35417 -5526 -14004 -20948 -23901 1204 13661 17393 31098
21791 31098 37725 18375 37446 27244 11746 2443 -10858 -6708 -11610 -4641 -2352 -7984 -37549
21778 -37549 -52979 -26919 4643 24423 35047 43970 45134 34805 12808 1728 -7591 -8536 -1503
21765a503J0876J2887n719j3082n190J019j6007m859K1081j8996k3076j0234J8544
21752c4259K2167j5142J7014q605k015l463M5565K0619k5214j3415k7269J8682
21740e335J0247l2254J6178K0151m927k628J8657j1538m9356p531l711M1150L3098
21727B2201P156k8902l8425J5692J9224q776M445k1901k3428K269j7505L9994
21715b7956M3757j7306k2222j7865J1361Q031j812j2005L715J120j0140L9400
21703a922j0724j0653K8349K4123P722J0564J4965j3042j4341l6942j0554p918
21691b0373k9434o077K360J6663K8456N790j6060J373R296J0888n738k5744j2628
21678d1228r374K4505M926j5062r597P078O880r440k9118j883M3530L9075j6486
$$ plain form
21765 -1503 9373 22260 16541 3459 -1731 -712 -16719 -21578 -497 -19493 -42569 -52803 -34259
21752 -34259 -12092 -27234 -10220 -18825 -20840 -24303 21262 41881 16667 3252 -24017 -5335
21740 -5335 4912 -27342 -11164 8987 4060 1432 20089 8551 -40805 -48336 -52047 -10897 22201
21727 22201 29357 455 -37970 -22278 -3054 -11830 -7385 -29286 -52714 -50445 -67950 -27956
21715 -27956 15801 -1505 -23727 -41592 -30231 -22200 -24012 -36017 -32302 -31182 -41322 -1922
21703 -1922 -12646 -23299 5050 29173 36895 47459 62424 49382 35041 -1901 -12455 -20373
21691 -20373 -49807 -55884 -53524 -36861 -8405 -2615 -18675 -17302 -8006 2882 -2856 -28600 -41228
21678 -41228 -50602 -26097 -21171 -36233 -45830 -38752 -31872 -41312 -70430 -72313 -28783 10292 -6194
21665f194k0222o638l0J5891J6175J3294j6062k7712m659J0705J5347N736O885
21652B516j822K927r687p038j8742Q319J9588j1138j919J0062M268k8264k1318
21639e2248K5545K3850K6518k2613j6147m0085L865r710k7909j917l548K2307
21627g2092J6889j3467N72n054K1687K3893K3235k0917J0312M40p711k319o222
21614c0754N004Q168o185o661Q056l3038n669L3997O4681q880j5294P745K5724
21601D6894j5983l1178j0190J7178M48K3527J8131r765j3712m422l1725j9174
21589b9971M596J922J8276K5824P720J5886j8568l194L277n601k2113J0967j2364
21576c343K042K7013J8085N249p32j7644r128j9035J2768l9605j412K0095j140
$$ plain form
21665 -6194 -26416 -33054 -33084 -17193 -1018 12276 -3786 -31498 -36157 -25452 -10105 -4369 2516
21652 2516 694 3621 -6066 -13104 -31846 -23527 -3939 -15077 -16996 -6934 -2666 -30930 -52248
21639 -52248 -26703 -2853 23665 1052 -15095 -55180 -51315 -61025 -88934 -90851 -94399 -72092
21627 -72092 -55203 -68670 -68098 -73152 -51465 -27572 -4337 -25254 -14942 -14502 -22213 -24532 -30754
21614 -30754 -25750 -17582 -23767 -30428 -22372 -55410 -61079 -27082 37599 28719 13425 21170 46894
21601 46894 30911 -267 -10457 6721 7169 30696 48827 39062 25350 20928 -10797 -29971
21589 -29971 -25375 -23453 -5177 20647 28367 44253 25685 22491 25768 20167 -1946 9021 -3343
21576 -3343 -1301 25712 43797 49046 48314 30670 21542 2507 15275 -24330 -25742 -5647 -6787
21563f787m927r732Q293j1139J613J2879m061J5151J6492j3207n074j473K768
21550G96n921j9080L753J3325Q285j5841n490L6814n093N271l2408r599K1245
21537c943Q032n652N96M610L1564k7414P576L533r70L648Q859k488J6937q348
21523C6540k1766j6966j1076o628L7700J4740J0927M517m0904m2706l567j6719
21511e5908j691L872Q331R666J1828J7073N561k037j2935K2985J5536q259j011
21498A3011l4848k3498K7543K3225l6313j9494J4950L3824q286J8118k181o373
21486c22K319k1489J0019j2745p469J0392j1624k028K4221O353J5721r397j8356
21473a4405j1446J5537O126o462o778M58J0298j7279l1298J3050o48K7786L5363
$$ plain form
21563 -6787 -11714 -21446 -13153 -24292 -22679 -9800 -13861 1290 17782 4575 -499 -1972 796
21550 796 -5125 -24205 -20452 -7127 1158 -14683 -20173 16641 11548 16819 -15589 -25188 -3943
21537 -3943 4089 -1563 -967 3643 35207 7793 15369 18902 17932 21580 30439 27951 44888 36540
21523 36540 14774 -2192 -13268 -19896 17804 32544 43471 47988 7084 -35622 -39189 -55908
21511 -55908 -57599 -53727 -45396 -35730 -23902 -6829 -1268 -3305 -16240 6745 22281 14022 13011
21498 13011 -21837 -45335 -17792 5433 -30880 -50374 -35424 -1600 -9886 8232 6051 -322
21486 -322 1997 -19492 -9473 -22218 -29687 -19295 -30919 -32947 -8726 -2373 13348 3951 -14405
21473 -14405 -25851 -10314 -4188 -10650 -17428 -16970 -6672 -23951 -55249 -42199 -42847 -15061 20302
21460B0302m512M303j767j7508j0373k8827K711r016o188J7739L7797k886l0636
21447b8861N680J7033K3069j1035k0536L830n358p391q545J184L90L0900K6733
21434B7093m381k7803j5572k6982J090O080m020J033K216R954j7186K6574K4713
21421B809J3254J1708j3708j2090k5089j8462N976K7087J1365k7301m606j928
21409c0985Q086J0079J6262j5844j7878k8335J894M299J5668p308j3360j4008
21397g1430p829L8236K8313P826J689r081J7772j3727q0j4076J1510J1964j8306
21384a7219j2687n477J8369K684P039J3700J4922j848J2633R83j9617J581L0367
21371D5430l1438k3044k6520k9683K0838L5979k122k3513j412L1353K9779P357
$$ plain form
21460 20302 15790 20093 18326 818 -9555 -38382 -35671 -44687 -50875 -33136 4661 1775 -28861
21447 -28861 -23181 -6148 16921 5886 -14650 -10820 -16178 -23569 -32114 -30930 -30540 360 27093
21434 27093 22712 -5091 -20663 -47645 -46555 -40475 -44495 -43462 -41246 -31292 -48478 -21904 2809
21421 2809 16063 27771 14063 1973 -23116 -41578 -35602 -8515 2850 -24451 -29057 -30985
21409 -30985 -22899 -12820 3442 -12402 -30280 -58615 -56721 -52422 -36754 -44062 -57422 -71430
21397 -71430 -79259 -41023 -12710 -4884 -3195 -12276 5496 -8231 -8311 -22387 -10877 1087 -17219
21384 -17219 -29906 -35383 -17014 -14330 -7291 6409 21331 19483 32116 33099 13482 15063 45430
21371 45430 13992 -9052 -35572 -65255 -44417 -8438 -10560 -34073 -35485 -4132 25647 33004
21359C3004k7305k7638k8636n184J4925L0900J9456l315J4921O388l040K1046
21347D5522r021j0311j4010O909P621J3841j2759l7707o914J7675P111K0274K9166
21334E7397j1890k6134J4060K756k7640O424K9780J1573j5082J9783M587p821
21322E7793k7453j2419K6251q287j2308l6921j89N291k626n774N601Q60k779k875
21308a5835j1935J4990K8565J587j7106k6347l2371k4028K4364M4580J5356j2672
21296a0852k6712n934J2005L0078J9130n444k7341J0329j6035k0991K8034q954
21284b2687J1637M588J7435J6792j7125l1699k1223K4846L5576K8461k9226l6674
21272a9299j7020K1686K3162K361j2428o927J9261n519K457K3088K2981m0682
$$ plain form
21359 33004 5699 -21939 -50575 -55759 -40834 -9934 9522 6207 21128 27516 24476 45522
21347 45522 36501 26190 12180 19089 26710 40551 27792 -9915 -16829 846 7957 28231 57397
21334 57397 45507 19373 33433 36189 8549 14973 44753 56326 41244 61027 65614 57793
21322 57793 30340 17921 44172 35885 23577 -13344 -13533 -8242 -10868 -16642 -11041 -10181 -12960 -15835
21308 -15835 -27770 -12780 15785 17372 266 -26081 -58452 -82480 -58116 -13536 1820 -10852
21296 -10852 -37564 -43498 -31493 -1415 17715 12271 -15070 -4741 -20776 -41767 -13733 -22687
21284 -22687 -11050 -6462 10973 27765 10640 -21059 -42282 -17436 18140 46601 17375 -19299
21272 -19299 -36319 -14633 8529 10890 -1538 -8465 10796 5277 7734 30822 53803 13121
21260A3121j7543J848k2821m274J3739n271p787j0057L553J4559Q412p37k9667
21247d2925Q74L6550q789P554O248j5477k831K378J5496K6423j9950j5078J3192
21234C665j5842O599J0600o747j130k4544J9645K7003J655J1941k8990J3990L8026
21221E5871j9978m2049j4283Q297k6401o556K0279k344O033l634l236R456P675
21208a0870J6439J6846k3670j5671k2099j7718n216P197n371J9962o835n178J9296
21195c2888L2727j7321J0331l248j5792k6142K2528M2237L549p719L810l8390
21183b6318k974m449q105Q722R185J5563k935j9197J44j1428k6090l122J7990
21170e3014J4515K4122r457K6234K2009Q053L048m6818k8988j499n266L4724n168
$$ plain form
21260 13121 -4422 -2574 -25395 -29669 -15930 -21201 -28988 -39045 -35492 -20933 -12521 -13258 -42925
21247 -42925 -42051 -5501 -14290 -6736 -488 -15965 -18796 -16418 -922 25501 5551 -9527 3665
21234 3665 -12177 -5578 5022 -1725 -2855 -27399 -7754 19249 20904 32845 3855 17845 55871
21221 55871 35893 -6156 -20439 -12142 -38543 -45099 -24820 -27164 -21131 -24765 -28001 -18545 -10870
21208 -10870 5569 22415 -1255 -16926 -39025 -56743 -61959 -54762 -60133 -40171 -47006 -52184 -32888
21195 -32888 -161 -17482 -7151 -10399 -26191 -52333 -29805 12432 15981 8262 12072 -26318
21183 -26318 -29292 -33741 -41846 -33124 -23939 -8376 -11311 -30508 -30364 -41792 -67882 -71004 -53014
21170 -53014 -38499 -14377 -23834 2400 24409 32462 35510 -11308 -40296 -41795 -47061 -12337 -17505
21157a7505J0845M0814m545q318l773P410M949l0437j7447l299K898q644k5056
21144e2108K0350K9776M8228K9330j8101j1509k9079J607J5617J7590k974m46
21132D8281O252Q640K4195j6220k9661j7025K5107J7811K196o335j9053l0670
21120A3518l835P902o061Q29j1095K8213J1793k6250l6058P423p979o104L2377
21107D673n621N990j2704J6955L4830k0982k1679j4896p302L0393J6472J890l0676
21094b657J0889Q251O443j0732m930k9896R233j3186o533L0668r374j603Q190
21081e237J4951k0181j0761L0032N078m329j0736q247J0578L7245j4508l217r529
21068A1139j0356k2335O958L2071P502R794j0438l862l705j0013j570j0683K1974
$$ plain form
21157 -17505 -6660 34154 29609 21291 17518 24928 29877 -560 -18007 -21306 -18408 -27052 -52108
21144 -52108 -31758 -1982 46246 75576 57475 45966 16887 18494 34111 51701 48727 48281
21132 48281 54533 63173 87368 71148 41487 24462 49569 67380 69576 63241 44188 13518
21120 13518 9683 17585 11524 12353 1258 29471 41264 15014 -21044 -13621 -21600 -27704 4673
21107 4673 -948 5042 -7662 9293 44123 23141 1462 -13434 -20736 9657 26129 28019 -2657
21094 -2657 8232 16483 22926 12194 7264 -22632 -13399 -26585 -33118 -2450 -11824 -13427 -5237
21081 -5237 9714 -10467 -21228 8804 13882 9553 -1183 -9430 1148 38393 23885 20668 11139
21068 11139 783 -21552 -14594 17477 24979 34773 24335 20473 16768 6755 5185 -5498 16476
21055A6476N962m426r882j6384Q816j125j047J4584j4927k1932j5276K844j3298
21042d9615o102J6224J0780j478p318J5043P748O995J2150K3935J5351Q684J845
21029E4242k1230n743J218J3151j1240k2388L3976J504n428J9942J3105j9412
21017E1697p960J0936K304k9716k1024J6405L324k1085j8551k2424J6217N8093
21005C8216K5966j1097m2883p872K2480k0784k1155j447J4177k4117j568O579
20993b3505K0443L262p829J882J9180J6864k7347k6062J4284J0899j561L392m492
20980e90J0543j957M963r942L8464J5868j0682p28k1137n376l0031J5973J0822
20967A6190K1717l6713l7671M052n935q642K3027K9719K686j70k88M856k57j3214
$$ plain form
21055 16476 22438 18012 8130 -8254 562 -563 -1610 12974 -1953 -23885 -39161 -36317 -49615
21042 -49615 -55717 -39493 -28713 -30191 -37509 -22466 -14718 -7723 4427 28362 43713 52397 54242
21029 54242 33012 27269 28487 41638 30398 8010 41986 43490 38062 58004 71109 51697
21017 51697 43737 54673 56977 27261 6237 22642 25966 4881 -13670 -36094 -19877 38216
21005 38216 64182 53085 10202 2330 24810 4026 -17129 -18576 -4399 -28516 -30084 -23505
20993 -23505 -3062 200 -7629 -5747 13433 30297 2950 -23112 -8828 2071 510 3902 -590
20980 -590 9953 7996 12959 3017 41481 57349 46667 45939 24802 19426 -10605 5368 16190
20967 16190 37907 1194 -36477 -32425 -38360 -47002 -23975 5744 8430 8260 7972 12828 12571 -643
20953f43K2641J1515j3580M801j3340n786j4724N804o244k0607o419l0417j2972
20940g9971J8767K5282J3530J3078k974m099k0854N868L3410J2479l6252q460
20928c0196J2955q466j0827j2501j4561J3253m016K2544J7236J4945J6306p956
20916H716j1213L477o722j603J4087Q215j4468o165L4814J8688k251j2268j0346
20903B2961J1744J520J1135J033k821j2436r141K0786k0139j8900j5840j0883
20891b0981K8030M1140L129M960j3268j2261j1965m0106p137k7216L089O100K2809
20878b3677O409j6677K0567J0306J2581l643j3283k8033j6357N944N018J7799
20866b3046L2485J1592Q831K1149o834r566m703j9916O776N629j3567k6305j0552
$$ plain form
20953 -643 21998 33513 19933 24734 11394 5608 -9116 -3312 -9556 -30163 -36582 -66999 -79971
20940 -79971 -61204 -35922 -22392 -9314 -12288 -16387 -37241 -31373 2037 14516 -21736 -30196
20928 -30196 -17241 -25707 -36534 -49035 -63596 -50343 -54359 -31815 -14579 366 16672 8716
20916 8716 -2497 980 -5742 -7345 6742 14957 489 -5676 29138 47826 45575 33307 22961
20903 22961 34705 36225 47360 48393 45572 33136 23995 44781 24642 5742 -10098 -20981
20891 -20981 7049 48189 51318 56278 43010 30749 18784 -21322 -28459 -55675 -52586 -46486 -23677
20878 -23677 -17268 -33945 -13378 -3072 9509 5866 -7417 -35450 -51807 -45863 -40845 -23046
20866 -23046 9439 21031 29862 51011 44177 34611 29908 9992 16768 22397 8830 -17475 -28027
20853b8027K6554K9301r301j1116N73j6563J0322j4081K0262n014k3790l539m153
20840b8572P308M922K3155J7059P559l1285m74J4738K627j6749l545J0753J4385
20827B1881k5654J742J0543J516O699J3921j7649k1392j0362K2766K5770k5714
20815D067j7593o579j573L870J2720O306r356J0628K5141K2508j8001o349m396
20802B1393J1876j6415j4567k819L452j539k4926m731j0620l457o311M0671K7170
20789A9177n535j6913J3696l778j3999k3050r744R379j465J4948K6462k1321l5219
20776d7362P545J6299K0764N37J015J819j0171K3090N5374j3577m2720n588m545
20763B480J9233j5472j97K1273k162o202J4427J8911K718l0716k5453j8953L636
$$ plain form
20853 -28027 -1473 27828 18527 7411 7984 -8579 1743 -12338 7924 2910 -20880 -24419 -28572
20840 -28572 -21264 -16342 6813 23872 31431 146 -328 14410 17037 288 -3257 7496 21881
20827 21881 -3773 -2031 8512 10028 16727 30648 12999 -8393 -18755 4011 29781 4067
20815 4067 -13526 -20105 -21678 -17808 -5088 1218 -8138 2490 27631 50139 32138 25789 21393
20802 21393 33269 16854 2287 -532 2920 1381 -23545 -28276 -38896 -42353 -48664 -7993 19177
20789 19177 13642 -3271 10425 6647 -7352 -30402 -40146 -30767 -32232 -17284 9178 -12143 -47362
20776 -47362 -39817 -23518 -2754 -2217 -1202 617 -9554 13536 68910 55333 12613 7025 2480
20763 2480 21713 6241 6044 27317 25155 18953 33380 52291 55009 24293 -1160 -20113 -16477
20750a6477N20j4958j4942L8117J8753j3966K7233j0274l471q752k86J0423N671
20737A7591j4918j7814o904J6192j9949j2202P189L3771k1930j2496K6034l791
20725i227o366k1239j8162J1990K2222k1277J0512q777J2874K0697J8723J7811
20713B9781K225K1728j0079j1015l050n9660j6911M73K840J3122j499J2162J837
20700a8046r087j6498M247L6065p396k3816k807L0663k5746p886L3742k2909J820
20687b7654K1393K0752P504K1926j5538j7501m228j266k101k539j2113L679J3993
20674F307R620k8360j4836j5218J0802N0036k90k1166k5159j5565K795J2643O956
20661b1435J253J1431p58N755J5530J7271p449j0977M243p636m3009l856M7261
$$ plain form
20750 -16477 -15957 -30915 -45857 -7740 11013 -2953 24280 14006 10535 1783 1497 11920 17591
20737 17591 2673 -15141 -22045 -5853 -25802 -38004 -30815 2956 -18974 -31470 -5436 -9227
20725 -9227 -15593 -36832 -54994 -43004 -20782 -42059 -31547 -40324 -27450 -6753 11970 29781
20713 29781 32006 53734 43655 32640 29590 -30070 -46981 -46508 -43668 -30546 -32045 -19883 -18046
20700 -18046 -27133 -43631 -39384 -3319 -10715 -34531 -37338 -6675 -32421 -40307 -6565 -29474 -27654
20687 -27654 -6261 14491 21995 43921 28383 10882 6654 5388 3287 748 -11365 -7686 6307
20674 6307 15927 -12433 -27269 -42487 -31685 18351 18061 -3105 -28264 -43829 -41034 -28391 -21435
20661 -21435 -20182 -8751 -9509 -3754 11776 29047 21598 10621 14864 7228 -35781 -39637 7624
20648G624K0043n014l4795k1750M0291R414r972n541r729L608m831J0589M560
20635D497q312j1159P586J2377M109j1819k3364j1468K6853L2955k884j4659r610
20622d898J6659L0275k2386l0601O629l0427j1205J5643k2190N159M1132K2611
20610A6401l675k1472m1654k7198J3726M328Q122J2759l171J8049N49k547K740
20597b3043Q596P076N610n350j4136J3800l772r417k4408j1978J9528K8145k7875
20584c7224k363J4151O144K6097m9318k5409J5640L0801M813J3544k5502K0011
20572h615K0605P318p303r563J0978K597k8408J5987J0608K7274k3684l9487j0020
20559c1713Q049J3409K977r179N14M997k3517k5470K3436J4355o599j9792J1082
$$ plain form
20648 7624 27667 22653 -12142 -33892 6399 15813 5841 300 -9429 -5821 -10652 -63 4497
20635 4497 -3815 -14974 -7388 4989 9098 -2721 -26085 -37553 -10700 22255 19371 4712 -4898
20622 -4898 11761 42036 19650 -10951 -4322 -34749 -45954 -30311 -52501 -47342 -6210 16401
20610 16401 12726 -8746 -50400 -77598 -63872 -59544 -51422 -38663 -41834 -23785 -23236 -25783 -23043
20597 -23043 -14447 -7371 -1761 -7111 -21247 -7447 -11219 -20636 -45044 -57022 -37494 -9349 -37224
20584 -37224 -39587 -25436 -19292 6805 -42513 -67922 -52282 -21481 -16668 -3124 -28626 -8615
20572 -8615 11990 19308 12005 2442 13420 16017 -12391 3596 14204 41478 17794 -21693 -31713
20559 -31713 -23664 -10255 -7278 -16457 -15943 -10946 -34463 -59933 -36497 -22142 -28741 -48533 -37451
20546c7451J8952J001k2842k5294J2826R815O763Q582n859n695m356J9995K1553
20533b010J8301q960k3140l2892J494K6175K7757J5468j9240j9563J7429J4150
20521A4969J9748J3847J7067l0755m3457j3822K4759j4038k5078K6793J1202p516
20509f281m3025L876M6337K3259K8q600K127O819R539J5728l368m0834K112J8020
20495B5737k0957k6148R043K819n36L837P383K709o036o19P021K9224J6271m271
20481D5477J9627l3347p0200j9611J3167J3925q079J8764M4937l432k1458K8735
20469B8505J8124k1731k917j0782M368K0656k0323J6142j1721k6627j0695N744
20457a1257p781K8007L566j169K304J1689J1446j4917P610j8971l1931J315q982
$$ plain form
20546 -37451 -18499 -17498 -40340 -65634 -52808 -42993 -36230 -27648 -33507 -39202 -43558 -23563 -2010
20533 -2010 16291 7331 -15809 -48701 -47207 -21032 6725 22193 2953 -16610 819 14969
20521 14969 34717 48564 65631 34876 -8581 -22403 2356 -11682 -36760 -9967 1235 -6281
20509 -6281 -49306 -45430 907 24166 24194 15594 17721 24540 34079 49807 46439 5605 7717 25737
20495 25737 4780 -21368 -12325 -9506 -10042 -6205 1178 3887 -2149 -2768 4253 33477 49748 45477
20481 45477 65104 31757 -38443 -58054 -44887 -30962 -39041 -20277 24660 21228 -230 28505
20469 28505 46629 24898 21981 11199 15567 36223 15900 32042 20321 -6306 -17001 -11257
20457 -11257 -19038 8969 12535 11366 13670 25359 36805 21888 29498 10527 -21404 -20089 -29071
20444b9071q135O597j0527J8018K2964N772l0319n91L1646N331j6989Q222J1794
20431A4712P187n889N26q659k6038R537o503j8696k545K2595k067N504j4857k9420
20417e4613j019n86J9677K1435n69L0372R052J215r82j5683o763R17n769l5540
20403c8856j6318K0606K5775j642k5469K1975j327J2268Q690J314P004j4735m233
20390d948q557k6181j0834J7347O505P909q030j6324L6248J5430m961K1822n4026
20377b8600j2877L8678K5542R099O73j2173k8296k2470l3317r990j747K8308M7106
20364f4j4596j173L9866P128l7789m16J0648O001n89l4057l1817j1244P569K8316
20350c2217M940m690L8453j3894m0074k871J4096L2144K4365l669j9973l2891
$$ plain form
20444 -29071 -37206 -30609 -41136 -23118 -154 5618 -24701 -25292 6354 11685 -5304 2918 14712
20431 14712 21899 16010 16536 7877 -18161 -8624 -15127 -33823 -36368 -13773 -15840 -10336 -25193 -54613
20417 -54613 -55632 -56218 -36541 -15106 -15675 14697 23749 24964 23982 8299 1536 2453 -3316 -38856
20403 -38856 -55174 -34568 -8793 -10435 -35904 -13929 -15256 -2988 5702 7016 14020 -715 -4948
20390 -4948 -13505 -39686 -50520 -33173 -26668 -18759 -26789 -43113 -6865 8565 3604 25426 -28600
20377 -28600 -41477 -2799 22743 31842 32515 20342 -7954 -30424 -63741 -73731 -75478 -47170 -64
20364 -64 -14660 -15833 24033 31161 -6628 -7044 3604 9605 9016 -25041 -56858 -68102 -60533 -32217
20350 -32217 -27277 -31967 6486 -7408 -47482 -50353 -36257 -4113 20252 16583 -3390 -36281
20338c6281K8757M214n322O99J8915N1012N955k8661n846m5836q094J680K9108
20325A0300K2357o126o263l5804L712P881P737K4754r925n4964j0442M7589J6335
20312A7141k1722j5609j2214J4631L858J0827j057j6783P224j8544q74J7576k351
20299a7897K26k2481k1034K7174K9490N12M033J205l914R772K1375j8793k0025
20286a0357q825p086P186j8636K1445L4950L503j5866J095P857r40R299j4999
20273H626k6715R602L389Q588J6830k9965n619J106J9270j350K060k593k905l4483
20259c4159o214L3158K8580N169O165k7502k9251j5724j7360L0503P273k0674
20247d0036P655k773j3941r563N6816L6309J5424l3510j9410q886j0167J2309
$$ plain form
20338 -36281 -7524 -3310 -8632 -7933 10982 61994 67949 39288 33442 -12394 -20488 -18808 10300
20325 10300 32657 26531 20268 -15536 -11824 -3943 3794 28548 18623 -36341 -46783 806 17141
20312 17141 -4581 -20190 -32404 -17773 -13915 -3088 -4145 -20928 -13704 -32248 -33122 -15546 -17897
20299 -17897 -17671 -40152 -61186 -34012 -4522 -4010 23 1228 -2686 7086 28461 9668 -10357
20286 -10357 -19182 -26268 -19082 -37718 -16273 18677 22180 6314 7409 15266 14326 23625 8626
20273 8626 -18089 -8487 -5098 3490 20320 -9645 -15264 -14158 5112 3762 5822 3229 324 -34159
20259 -34159 -40373 -7215 21365 26534 32699 5197 -24054 -39778 -57138 -26635 -19362 -40036
20247 -40036 -32381 -35154 -49095 -58658 -1842 34467 49891 16381 -3029 -11915 -22082 -9773
20235i773L7456K3489j0460k7347J0750J4288n981k7689j3485k8542j0830J5110
20223c3014M5900L1749j4126k0603N030p641P27o713J7036L363m1986k5664K5551
20210b0391J0754N785N828j3776N056j1340k580j0521O077K1737J1035k177J6538
20197B2025l2305k7618K7765Q049K5029K214q912O209k5084p365j3759L814N580
20184a4358P070R665N320o371J602k9072o139m928K1718O932p050j3233Q393q983
20170b9434l516N403K1208j266J3133O086j0046k2528R17K8126R929o146K5540
20157C7406L9894j9468j9999j7191j4651Q146J2487J833Q592P404J1705r10M2709
20144I7957k423k484J2926J5254M9622K1575K3984K4464R173R389L7949L8826
$$ plain form
20235 -9773 27683 51172 40712 13365 24115 38403 32422 4733 -8752 -37294 -48124 -33014
20223 -33014 12886 44635 30509 9906 14936 7295 8022 1309 18345 21708 -20278 -45942 -20391
20210 -20391 -9637 -3852 1976 -11800 -6744 -18084 -20664 -31185 -25108 -3371 7664 5487 22025
20197 22025 -10280 -37898 -10133 -2084 22945 25159 16247 22456 -2628 -9993 -23752 -19938 -14358
20184 -14358 -7288 2377 7697 1326 2928 -26144 -32283 -37211 -15493 -8561 -15611 -28844 -20451 -29434
20170 -29434 -32950 -27547 -6339 -7605 5528 11614 1568 -20960 -20043 8083 18012 11866 37406
20157 37406 77300 57832 37833 20642 5991 14137 26624 28457 37049 44453 56158 55248 97957
20144 97957 95534 93050 105976 121230 170852 192427 216411 240875 250048 259437 297386 336212
20132C36212q710o536J8139J0200R620Q434l7162m5521N489J7134J790L4864p492
20119C36461Q513L8475j6268j5099J1870P264k3880k018K3162j4064m8636m5568
20107B60212l953J136l9906k3539k7415j3141l6198k400M120N99n508p17j9320
20094I3970j79k6966m1015K9896O684J3888p602k2471j7473J3254Q904R744O419
20081F7053n312k5611M113j2467J4813q92L886j7203j5351j3643J0830J5665L7269
20068F3150p047k9396j7786o815J1992p646J0590j5350l4630M262P288R14L4104
20055A3630P304N92N379k73n120J3214o444j5761k9646P262K7510j0946j2586
20042e885K4515K8284J4285K308q91k9307j9307J5097j6253q281k0970K934r340
$$ plain form
20132 336212 327502 320966 339105 349305 358925 367359 330197 284676 290165 307299 309089 343953 336461
20119 336461 344974 383449 367181 352082 363952 371216 347336 345318 368480 354416 305780 260212
20107 260212 256259 257395 217489 193950 166535 153394 117196 114796 118916 119515 114007 113290 93970
20094 93970 93791 66825 25810 55706 62390 76278 68676 46205 28732 41986 50890 60634 67053
20081 67053 61741 36130 40243 27776 42589 41697 45583 28380 13029 -614 10216 25881 63150
20068 63150 56103 26707 8921 2106 14098 6452 17042 1692 -32938 -28676 -21388 -20474 13630
20055 13630 20934 21526 26905 26632 21512 34726 28282 12521 -17125 -9863 17647 6701 -5885
20042 -5885 18630 46914 61199 63507 62616 33309 14002 29099 12846 4565 -16405 -13471 -22811
20029b2811l0505K800L0198J5642O045m748j099j3442J9551J8300q145J5416r24
20016B6278J2477K9262n255j9379k0052j6422J1192Q107q847q48K958k865k2773
20003f167j4921R30J8291J0735l116o054Q778J255J0817k777l0664l791M900j1459
19989b3243k1145P811L3818j4215j3344K6459L3350j3329L133N420k2253J9609
19977B2071k6165j0119K3885L4416j9687J270K0780p322k2279n0488L145J5001
19965a5492J9054K5237j5208j9549j6272q860O049M311R112J0287j5490r815R793
19952a6843L6879J7855L9169k6012o0492k3817J6873J0196n378J4608K2057J2945
19940C8040M0405j2267k7823k2411J3646j1453J9992n568j9040j4532j4769j18
$$ plain form
20029 -22811 -53316 -50516 -20318 -4676 1369 -3379 -4478 -17920 1631 19931 11786 27202 26278
20016 26278 38755 68017 62762 43383 23331 6909 18101 26208 17361 16513 19471 16606 -6167
20003 -6167 -21088 -20158 -1867 8868 5752 -302 8476 9731 20548 17771 -12893 -16684 -11784 -23243
19989 -23243 -44388 -36577 -2759 -16974 -30318 -3859 29491 16162 19295 24715 2462 22071
19977 22071 -4094 -14213 9672 44088 24401 25671 46451 39129 16850 -33638 -30493 -15492
19965 -15492 3562 28799 13591 -5958 -22230 -31090 -25041 -20730 -11618 -1331 -16821 -26636 -16843
19952 -16843 20036 37891 77060 51048 -9444 -33261 -16388 -6192 -11570 3038 25095 38040
19940 38040 78445 66178 38355 15944 29590 18137 38129 32561 13521 -1011 -15780 -15898
19928a5898R472J383j2415k1333R367K7970K5453k8794j8246M997L4664M3695
19916F0315N413J672p236K1041m464k2686k505K2107o120m3972l2058K9932J6907
19903C8346k6501K0813j2937K305p704l915P366l1843j2090q55J4474L3505l90
19890B0574k9465P597r478k9525J8583J74k4942j2834j5344M060L2550J7591P313
19877a3146K0329L8917N719j9820K216P375j505K4879N180j3862m869j0175M265
19864D5503K2734O00k7792n946j058j0393j0226o528n690k7715j5763L1875L8556
19851B8157r269l138N340j1964J898j7239j3846P865M461k009L628J8836k592
19838A0128j2271j3623J5282n539M081K4624M9611j1905j1710n429k0554o487
$$ plain form
19928 -15898 -6426 -5043 -17458 -38791 -29424 -1454 23999 -4795 -23041 -18044 16620 60315
19916 60315 65728 67400 60164 81205 76741 54055 51550 73657 67537 23565 -8493 21439 38346
19903 38346 11845 32658 19721 22026 14322 10407 17773 -14070 -26160 -27015 -12541 20964 20574
19890 20574 -8891 -1294 -10772 -40297 -21714 -21540 -46482 -59316 -74660 -70600 -38050 -20459 -13146
19877 -13146 7183 46100 51819 31999 34215 41590 40085 64964 70144 56282 51413 41238 45503
19864 45503 68237 68837 41045 35099 34041 23648 13422 6894 1204 -26511 -42274 -10399 28157
19851 28157 18888 15750 21090 9126 11024 -6215 -20061 -12196 -7735 -9744 -6116 12720 10128
19838 10128 -2143 -15766 -484 -6023 -1942 22682 72293 60388 48678 43249 22695 16208
19826A6208J639k1180j8196j9931k3055K8438P2616L5311l982J7395l2075j8818
19814C4370m070K521J7780J3329P206l2080k8359N787J6904J2425l484K9940K9216
19801A01485j4629J994K9933J1222M436l7771J7873L2812l2419j4420K1326p154
19789A14688j0424o150J8590K6546J0336j4201k256j4204k758k1466k3717j1798
19777F3186j8366k4710K223L9750n031k6913J6823j7489J1983p586N827P279K1554
19764F8530R248N164q235k7598R394K0905j5955j3226o54Q38L410J7303J825j3051
19750E7898K8683j6194J4750j6741M1J7392n590l7914j2349J9454K0639R448J2238
19737I1755j2060J1613M2944K3454p795L3241M3395k0423p776J5228Q282j3595
$$ plain form
19826 16208 17847 -3333 -21529 -41460 -64515 -36077 36539 71850 67868 85263 53188 34370
19814 34370 30300 32821 50601 63930 71136 39056 10697 16484 33388 45813 42329 72269 101485
19801 101485 86856 88850 118783 130005 134441 96670 114543 147355 114936 100516 121842 114688
19789 114688 104264 98114 116704 143250 153586 139385 137129 122925 120167 98701 74984 63186
19777 63186 44820 20110 22333 62083 57052 30139 46962 29473 41456 33870 39697 46976 68530
19764 68530 77778 82942 74707 47109 56503 77408 61453 48227 47573 48411 51821 69124 70949 57898
19750 57898 86581 70387 85137 68396 68437 85829 80239 42325 29976 49430 70069 79517 91755
19737 91755 79695 91308 134252 157706 149911 183152 226547 206124 198348 213576 221858 208263
19725B08263k469K9061p075m1063m4408P035K824J2553L8014J7754j9778l4749
19713A65962p992O500r78k5816k1997j834l2474j990J9141J1119J6441P790L9657
19700A73529K7799K078k0322j4979q787J1036n251k1463j282J6362J573K4844
19688A85137j6503J9023J6473j8555m0471L317k490J2371K1560Q635K802j2990
19676A78309J6322N761K2360R391m515P036K6671N1422L2134J9168L5396O0477
19664D59932K9099J2402J4212j7376J4733k6920J992n187K0648K0305k6973r409
19652D87458p127l8987m2039k9883p095R281K4353J3439p624l2275Q188K7233
19640D04922K7655J3553N117q945K7397L1141R634K5570j0992J9587J7798j6218
$$ plain form
19725 208263 205794 234855 227780 186717 142309 149344 152168 164721 202735 220489 200711 165962
19713 165962 157970 164470 163492 137676 115679 113845 81371 79381 98522 109641 126082 133872 173529
19700 173529 201328 203406 183084 168105 159318 170354 165103 143640 142358 158720 160293 185137
19688 185137 168634 187657 204130 185575 145104 148421 145931 158302 179862 188497 191299 178309
19676 178309 194631 200392 222752 232143 227628 234664 261335 312757 344891 364059 399455 459932
19664 459932 489031 501433 515645 498269 513002 486082 488074 482887 503535 523840 496867 487458
19652 487458 480331 441344 399305 369422 362327 371608 395961 409400 401776 369501 377689 404922
19640 404922 432577 446130 451247 442302 469699 500840 510474 536044 525052 544639 562437 546219
19628E46219p752J8505J4675J7512j5353P121N5462K1377k7904J449J8377o295
19616F43393J1436L5205R564k8863r291K9187K1755L5261M8046J6118J41J7146
19604H29098N771J3873K6313K3252N3165K0641j578N3237L6771K6755O5769N8000
19592A211067R2286R7163N1845J0966M8304J08658O5648P0188R0507J34077J11093
19581B091802J26563J21771K17108K35478J90628K05008J95960K50067K26102
19572C860487K03907K46315K64898K73435K73748K27633K04343K66013L41872
19563F162651L73483M18608M98508N23675O43786Q24503R67449J165013J445972
19554A3023648J758089K145877K603441L196014L984884M799380N736965O754959
$$ plain form
19628 546219 538467 556972 571647 589159 573806 580927 636389 657766 629862 631311 649688 643393
19616 643393 654829 690034 699598 670735 661444 690631 712386 747647 795693 811811 811952 829098
19604 829098 834869 848742 875055 898307 951472 972113 970535 1023772 1060543 1087298 1153067 1211067
19592 1211067 1303353 1400516 1452361 1463327 1511631 1620289 1685937 1756125 1846632 1980709 2091802
19581 2091802 2218365 2340136 2557244 2792722 2983350 3188358 3384318 3634385 3860487
19572 3860487 4064394 4310709 4575607 4849042 5122790 5350423 5554766 5820779 6162651
19563 6162651 6536134 6954742 7453250 7976925 8620711 9445214 10412663 11577676 13023648
19554 13023648 14781737 16927614 19531055 22727069 26711953 31511333 37248298 44003257
19546D4003257P712657Q522826R202457R527767R283522Q290296O806579N048422
19538A08397783K878884K03610k527502m853802o686954q274534r322436r486214
19530G0328835r046537q341761p431928o356924n286936m313359l473604k840206
19522B3237580k345114j909385j614052j387193j190076j068607r43513q17182
19514A1962458p26239o73777o07360n27941m80057m48532l82536l71126l52016
19505G392874l39861k94824k89210l11635l09035k92582k80911k58831k71147
19496D744838k75298k34923k27803k14089k13043j99930j74189j57454j16135
19487B931974j15890j35925r4301j18695j18565r2885q6177q5891p5992r0485
$$ plain form
19546 44003257 51715914 60238740 69441197 78968964 88252486 96542782 103349361 108397783
19538 108397783 111276667 111480277 108952775 104098973 97412019 89137485 79815049 70328835
19530 70328835 61282298 52940537 45508609 39151685 33864749 29551390 26077786 23237580
19522 23237580 20892466 18983081 17369029 15981836 14791760 13723153 12779640 11962458
19514 11962458 11236219 10562442 9955082 9427141 8947084 8498552 8116016 7744890 7392874
19505 7392874 7053013 6758189 6468979 6157344 5848309 5555727 5274816 5015985 4744838
19496 4744838 4469540 4234617 4006814 3792725 3579682 3379752 3205563 3048109 2931974
19487 2931974 2816084 2680159 2585858 2467163 2348598 2255713 2169536 2083645 2007653 1917168
19477A917168p4563l9262p2840r6318k0184n5610m6418k9435l0743k1475l1217
19466A399103p9713n4431m2044l9793o9907l3052o977l5797l2739l1548k4793
19455I48309q363j2945l4559k0842J2691O305k7905k9053m0717p420K3m7438l5947
19442G02139j2906j6932k904n8860k1018J6996P963j3238l2277j3226k2032J4379
19430E48084k7352J0295m231p062o385o433j0447k2632m5385r874l2361j8766
19418C67451n523k0741R821N333K202P465R508r051p320N639j0300R096J1515
19405C75095J7431P359k1288K4609R933k8382l777R066J5354l9785j7710J03J5257
19392C63265R928l6300m414j658j7341k5703k3340l4059n247J4737K8577j1483
$$ plain form
19477 1917168 1842605 1803343 1730503 1634185 1614001 1558391 1511973 1482538 1451795 1430320 1399103
19466 1399103 1319390 1264959 1222915 1183122 1113215 1080163 1073186 1037389 1004650 973102 948309
19455 948309 939946 927001 892442 871600 884291 890596 862691 833638 792921 785501 785524 738086 702139
19442 702139 689233 672301 669397 610537 589519 606515 614478 601240 568963 555737 533705 548084
19430 548084 520732 531027 526796 519734 513349 506916 496469 473837 428452 418578 386217 367451
19418 367451 361928 341187 351008 356341 358543 366008 375516 366465 359145 364784 354484 363580 375095
19405 375095 392526 399885 378597 403206 413139 384757 380980 390046 405400 365615 347905 348008 363265
19392 363265 373193 336893 332479 330821 313480 287777 264437 230378 225131 239868 268445 256962
19380B56962J1414P502p585l315k5075N682j9674j4974m971J7163j1576j2474
19368A99079Q262r833R924n763p99j4532j7279j3899P899Q668q10j9552q201l1671
19354A11493k970k298L1733n889j1109k967k9728k8208M192j0387n833K1311J8811
19341H8151P197J3603K9384m134L837K3319j4184K222O914j7974R805N98m581
19328A44157k4244J0046J6135k0949q241J8701k5317J0905l383j4089J5406j668
19316A17459l1939k917J9088L29q503j5905j2910p249K7587K2759N822K371M749
19303A20741m542j0154j596N720j9478K0930K560J3833J28N37l4414l9191M432
19290E9506m188j1486J1584L0040K9889r144R972K4957L302l1212m3060j8673
$$ plain form
19380 256962 268376 275878 268293 264978 239903 245585 225911 210937 205966 223129 211553 199079
19368 199079 207341 197508 207432 201669 200870 186338 169059 155160 163059 171727 170917 151365 143164 111493
19354 111493 108523 106225 137958 132069 120960 117993 88265 60057 64249 53862 48029 69340 88151
19341 88151 95348 108951 138335 134201 138038 161357 147173 149395 156309 138335 148140 148738 144157
19328 144157 119913 129959 146094 125145 116904 135605 110288 121193 117810 103721 119127 117459
19316 117459 85520 82603 101691 102020 93517 77612 64702 57453 85040 107799 113621 115992 120741
19303 120741 116199 106045 104449 110169 90691 111621 114181 128014 128142 128679 94265 55074 59506
19290 59506 55318 43832 55416 85456 115345 106201 116173 141130 144432 113220 70160 51487
19278E1487J8957J2276j2680k1882J0341Q909l7312N084K4216N464J5928r150
19266G1638l172J4234J5490m9474l3478j2402p897L2965J4576J2252J9635M453
19254G8820p571j675j7231o445J940O384L377j2910K1022J9474l574j9106q791
19241E3714l9465j5189L1058M368l340R994k0680N508N1595j186K434P725K1471
19228A08007J2484k1033k2173J703K916J2574J0365k8928j2889j8647J2776P072
19216F4227K9907j5016j1416P119J0979j2191J6600O542l095k3102O392P442k1362
19203F3026j5790M563L4120M8173L6919l0228m4893l4293K1819K9681j7525l0317
19191F5255k8616K081N100l5121K839L7921m656J9965k719J6033J6898J2827j8654
$$ plain form
19278 51487 70444 82720 70040 48158 58499 67408 30096 35180 59396 64860 80788 71638
19266 71638 68466 82700 98190 48716 15238 2836 -5061 27904 42480 54732 74367 78820
19254 78820 71249 69574 52343 45898 47838 54222 57599 44689 65711 85185 81611 62505 53714
19241 53714 14249 -940 30118 34486 31146 41140 20460 25968 77563 76377 78811 86536 108007
19228 108007 120491 99458 77285 78988 81904 94478 104843 75915 63026 44379 57155 64227
19216 64227 94134 79118 67702 74821 85800 73609 90209 96751 93656 70554 76946 84388 63026
19203 63026 47236 51799 85919 134092 171011 140783 95890 61597 83416 113097 95572 65255
19191 65255 36639 38720 43820 8699 11538 49459 44803 64768 62049 78082 94980 107807 89153
19178H9153j0679K0723R764l4837m6837o739j5061M927K7169L7835q206l5522
19166C1690j8827q730J5770K0278K5095N921p7k094j7204q381O61J5979k4015
19153C6066J3779K1294r331j0011j158r968O79n098J0805J316j3912N577J9473
19140E9511K2900q828j9191l2647L2354J8671k8578Q712L3015j4215l869l5936
19128C1899J2244J861j3423o835j4709P797M081q079M827j2830J0373L1110l9735
19115H581o499R659k1441o83J7577L118M736K035m774K3383L4494L870q442j3468
19101E2146M82k0819l1215N36J4464J5269J8470K062Q102L997j1034k5555K4186
19088E1091j0380R859J4144n913l2605k8630j4851J9159Q116J5116J4887J8188
$$ plain form
19178 89153 78474 99197 108961 74124 27287 20548 5487 10414 37583 75418 67212 31690
19166 31690 12863 4133 19903 40181 65276 71197 71120 69026 51822 43441 44102 60081 36066
19153 36066 49845 71139 61808 51797 50639 40671 41350 36252 47057 48373 34461 40038 59511
19140 59511 82411 73583 54392 21745 54099 72770 44192 52904 85919 71704 67835 31899
19128 31899 44143 46004 32581 25746 11037 18834 22915 14836 19663 6833 17206 48316 8581
19115 8581 2082 11741 -9700 -10383 7194 10312 15048 17083 12309 35692 70186 74056 65614 52146
19101 52146 52628 31809 594 1130 15594 30863 49333 51395 59497 63494 52460 26905 51091
19088 51091 40711 50570 64714 58801 26196 -2434 -17285 1874 9990 25106 39993 58181
19076E8181j4610k2326p026k3450J5207K2356J3313k220k3287K6835n742m1218
19064c987l478l898L3706K3274J820K153m88k4764o006N505j047j1335J0358q1
19050B1732j1035J4509K224M476J1832L4974j6103m3300j0686l2990l684Q847
19038a9204K6973L8013k0990l4406k2311J5019Q045K0170M054J0544R853k9124
19026F636k1077M04J3288r543n2J2348j1664L2045J6736j9736j5561k3052L066
19013a6162J9696J4370J0635Q198K8589k7365r826J7358j6167L158j4626j9462
19001a604j3812p554k951J8029L0006J076O009M807j263P545n610o702k2586N194
18987A0584J9286J3951k894J2057K4686O931p885k2779n492L382o722N713K7308
$$ plain form
19076 58181 43571 21245 14219 -9231 5976 28332 41645 39425 16138 42973 37231 -3987
19064 -3987 -7465 -11363 22343 45617 47437 49590 49102 24338 18332 23837 22790 11455 21813 21732
19050 21732 10697 25206 27430 31906 43738 78712 62609 19309 8623 -24367 -28051 -19204
19038 -19204 7769 45782 24792 -9614 -31925 -16906 -8861 11309 15363 25907 35760 6636
19026 6636 -14441 -14037 -749 -10292 -10344 2004 -9660 22385 39121 19385 3824 -19228 -16162
19013 -16162 3534 17904 28539 36737 65326 37961 28135 45493 29326 32484 17858 -1604
19001 -1604 -15416 -22970 -25921 -7892 22114 23190 29199 34006 32743 40288 34678 27976 5390 10584
18987 10584 29870 43821 40927 52984 77670 84601 76716 53937 48445 51827 45105 50818 78126
18974G8126L0495k0891l7441k85J6066K1867l11J7745J6819K8894M0506M6941
18962B38531K4962R031L1593J7173R303L6283K6513j5011J0717o451K5554n070
18950D03128p848M781M506q127k536L3144l0787k7606r287J5757j2881m657j6270
18937C41317k8076m2939j4032p443m1952l7174l7030J7503J7748Q172l1344l2648
18925A12102L582k1613j9926r365j1089J6064L2863J7340l8667j2437k0188l6321
18913A2345j6879K0551L2397J1613J805n2472k0249p824Q640K1001J186k3543
18901a1429M387J6732K728k5595J1005L4595j4709K1619P133Q043L441j5012j3936
18888B9002l2010L235J993j7548J3127L3670p817R890j8254l652L8689M0737l7156
$$ plain form
18974 78126 108621 87730 50289 50004 66070 87937 87626 105371 122190 151084 191590 238531
18962 238531 263493 272524 304117 321290 330593 366876 393389 378378 389095 382644 408198 403128
18950 403128 395280 400061 404567 396440 393904 427048 396261 368655 359368 375125 362244 357587 341317
18937 341317 313241 270302 256270 248827 206875 169701 132671 150174 167922 176094 144750 112102
18925 112102 115684 94071 74145 64780 53691 69755 102618 119958 81291 68854 48666 12345
18913 12345 -4534 16017 48414 60027 61832 9360 -10889 -18713 -10073 10928 12114 -11429
18901 -11429 -7042 9690 12418 -13177 -2172 32423 17714 39333 46466 54509 57950 42938 29002
18888 29002 -3008 227 2220 -15328 -2201 31469 23652 33542 15288 11636 50325 91062 53906
18875E3906l3899l8573L2699J1571J5444L4522k6851l9147k5634R673L4671j5110
18863A3272p698J9752n18O775J7573o558J0886k4772n536J4529o63o057l4832
18850c847j7153L0140Q064J2786O263o562N068J2358j0645j3129j862l0585L56
18837h748L9014Q317k0861L320p028j6737p628L7017j2452j3968P084K6789P86
18824C4905l8486j4700J1609j0610r450n327P43Q62K5495N823M716k2635m268
18811b1323l346r255K0512J2271J9590k2352Q542p376k3237J8133K1037M6027
18799E9223p770k7714j1599m092k0248M641Q311J8399Q834K61r987l6647j2499
18786c0887L6409L9228K6819n854j8020l3635j2705J2422k181m200q14J72P523
$$ plain form
18875 53906 20007 -18566 14133 25704 41148 75670 48819 9672 -15962 -6289 28382 13272
18863 13272 5574 25326 24808 31583 49156 42598 53484 28712 23176 37705 37042 30985 -3847
18850 -3847 -21000 9140 17204 29990 36253 29691 34759 47117 36472 23343 21481 -9104 -8748
18837 -8748 30266 38583 17722 21042 14014 -2723 -10351 26666 14214 246 7330 34119 34905
18824 34905 -3581 -18281 -6672 -17282 -26732 -32059 -31316 -30454 -4959 864 5580 -17055 -21323
18811 -21323 -24669 -33924 -13412 -1141 18449 -3903 4639 -2737 -25974 -7841 13196 59223
18799 59223 51453 23739 12140 8048 -12200 -7559 752 19151 27985 28246 18259 -18388 -30887
18786 -30887 5522 44750 71569 65715 47695 14060 1355 13777 11596 7396 6582 6754 14277
18773A4277N944M4241K5471j368J9514M4468J0446J4197j2385O910k8695m0379
18761A02641k2762r028K2858j9160j6581j1614n748k4657j6782l327k4253o507
18749c4920K4596J7238l483m791j1528n017k983J4789K5093L018n992K470M547
18736B3037N159J260K5068J1888j9654k188j0650n641J5638l9169j9287L4279
18724A9740l2555l8183r77K7319J8631J2649K7064k9361j2072J2579M4374K702
18712E1910j3187l7196j3069L3244K4038j8775M468J5431p039m6760k1906J2908
18700a5933J9586L160J9371J4525J6116O502J111k4617o094j5497k6647n152L4818
18687B1249l569j3384L415M0100J1891j47K8210O646k1685l2670P67N155j636
$$ plain form
18773 14277 20221 64462 89933 88565 108079 152547 162993 177190 164805 171715 143020 102641
18761 102641 79879 70851 93709 74549 57968 46354 40606 15949 -833 -4160 -28413 -34920
18749 -34920 -10324 6914 3431 -1360 -12888 -17905 -20888 -6099 18994 22012 16020 18490 23037
18736 23037 28196 29456 54524 66412 46758 44570 33920 28279 43917 4748 -14539 19740
18724 19740 -12815 -50998 -51975 -24656 -6025 6624 33688 4327 -7745 4834 49208 51910
18712 51910 38723 1527 -11542 21702 45740 26965 31433 46864 39825 -6935 -28841 -15933
18700 -15933 3653 6813 26184 40709 56825 63327 64438 39821 33727 18230 -8417 -13569 21249
18687 21249 17680 4296 7711 47811 59702 59555 87765 94411 72726 40056 40823 45978 44342
18674D4342j1202m925j5958J7373L4599r56j0135k2720o370k427J9207P093Q177
18661E6098J7852j880m7915n2J3469J068k3217k0606R328j5892j1329j8128j3401
18648e4605N3242Q956j7309n822J5245M765k963Q665L4626k188j0028K3817J1240
18635F7641k7548k0525l544j0637L3096Q745k3079J325k1047l1859j7530J4012
18623c0950M554j2271r947K6829R070k2316J3768K6685K1197J1854K81j304R559
18610D7009p473O397j8814k1590R847j1720N127K6579O956n482R550j6909k3199
18597F278K875j4670l4124P12M2337J6741J3794p573r474K4434k4898j5491j3549
18584a2608k3858J9292J6735R172K7293j5237m134J5103J3170j3499P002K2746
$$ plain form
18674 44342 33140 28215 12257 29630 64229 63273 53138 30418 24048 21621 40828 47921 56098
18661 56098 73950 72070 24155 24103 37572 38640 15423 -5183 4145 -11747 -23076 -41204 -54605
18648 -54605 -1363 7593 -9716 -15538 -293 4472 1509 10174 44800 42612 32584 56401 67641
18635 67641 40093 19568 16024 5387 38483 47228 24149 25474 4427 -27432 -44962 -30950
18623 -30950 -26396 -38667 -48614 -21785 -12715 -35031 -21263 5422 26619 38473 38754 37450 47009
18610 47009 39536 45933 27119 5529 15376 3656 8783 35362 42318 36836 46386 29477 6278
18597 6278 9153 -5517 -39641 -38929 3408 20149 33943 26370 16896 41330 16432 941 -12608
18584 -12608 -36466 -17174 -439 8733 36026 20789 16655 31758 44928 31429 38431 61177
18572F1177l0061n1138j1011M9873Q639N120j3028K4165j5333r931m511O800K1589
18559D2350j0471R929K0182j8604k6444J4447P213j6086q330k649J8865J7567
18547D7969o385l778r569J3765K6090L1998j136k1615k2992j2207J4840K3376
18535H0356k3485o678k6242p317K1233j8499j8759Q884J0360K978R428q9j4977
18522A7193K2757o539j6412p989M4133q461j0873J9566J5496J8607M588r157R360
18509I2269L0446N501l6k2801j7316r545L8367O427m3451k4033k7544J7080L864
18496D9228R132J0123q914M0080K4433j2283J5737j454k9353l1705M882N558K6209
18483A01673K947p307r856m70O632k2220j3043K3181n486l7837O187M4416J9417
$$ plain form
18572 61177 31116 -20022 -31033 18840 27479 32599 19571 43736 28403 18472 13961 20761 42350
18559 42350 31879 41808 61990 43386 16942 31389 38602 22516 14186 11537 30402 47969
18547 47969 41584 37806 28237 42002 68092 100090 98954 77339 54347 42140 56980 80356
18535 80356 56871 50193 23951 16634 37867 19368 609 9493 19853 22831 32259 32170 17193
18522 17193 39950 33411 16999 9010 53143 44682 33809 53375 68871 87478 92066 82909 92269
18509 92269 122715 128216 128180 105379 88063 78518 116885 123312 79861 55828 28284 45364 49228
18496 49228 58360 68483 59569 99649 124082 111799 127536 126082 96729 65024 69906 75464 101673
18483 101673 104620 97313 87457 86987 93619 71399 58356 81537 76051 38214 44401 88817 108234
18470A08234m466P926J6185L3088N4363M3773L346J7065K8638k1461l2179k0546
18458B33966j9290l8790L0449M7129J6837Q9L442J1358J9858J2164N00L1196K8644
18445C77552J014k6751j0215r259l6509k9636j5295j588K1320K2710q257j9832
18433B65254L862J7812M0597M5606M7958K1364r408j2456M1212J260M1492J8053
18421E22606n691n669J9113j724k4203m7276k1115k6606O035K8176K0603K4034
18409D88283K0009j740L7916O608j5910k8598n7583n4468j4960j8578j6931k3380
18397C20668j1k527j6212l4515j5326M1384K6318p084K2182O9784M1205L2215
18385D78081P928k711r813n901l8657p013M6199K7088N4185M7638L1702K5467
$$ plain form
18470 108234 103768 111694 127879 160967 215330 259103 262449 279514 308152 286691 254512 233966
18458 233966 214676 175886 206335 253464 270301 270390 273832 285190 305048 317212 317712 348908 377552
18445 377552 378566 351815 341600 332341 295832 266196 250901 249313 270633 293343 285086 265254
18433 265254 269116 286928 327525 373131 421089 442453 433045 420589 461801 463061 504553 522606
18421 522606 516915 511246 530359 528635 504432 457156 436041 409435 415470 443646 464249 488283
18409 488283 508292 506552 544468 551076 535166 506568 448985 394517 379557 360979 344048 320668
18397 320668 320657 318130 301918 267403 252077 293461 319779 312695 334877 404661 445866 478081
18385 478081 486009 483298 473485 467584 428927 421914 468113 495201 549386 597024 628726 654193
18373F54193O3631O7993M2936J939j7132l9197p9250o2349m6894j1549l2309O939
18361E48951M6502J3347K4350p187j2746m1971p2540k9944l1828n165j6239K006
18349D17536J0993m2456l1247j7008q442m2129m841K7142K9529J7974l840j1882
18337C41329J796j4784n4640j8958P936P441J7568J7452R729K541o271J5143J1053
18324C37335j6697P312K8939L0926L6360P1577P2075O9582N9149M1113l3423o8816
18312F35432o7605o8942o5324o0567k9205j2084L587j0394L007l3280k2388O222
18300B78459J1767Q991j184k016R848M299j4509o782j8023n308j7824k8645L989
18287B23062M3024R273k1343j3177k3462j6080l4583P409K0094J7430J2309M3174
$$ plain form
18373 654193 717824 785817 828753 830692 813560 774363 695113 632764 585870 574321 542012 548951
18361 548951 595453 608800 633150 625963 613217 571246 498706 468762 436934 431769 415530 417536
18349 417536 428529 386073 354826 337818 329376 287247 282406 309548 339077 357051 353211 341329
18337 341329 343125 328341 273701 254743 262679 270120 287688 305140 314869 317410 311139 326282 337335
18324 337335 320638 327950 356889 387815 424175 495752 567827 637409 696558 737671 704248 635432
18312 635432 567827 498885 433561 372994 343789 331705 335292 324898 327905 294625 272237 278459
18300 278459 290226 299217 298033 296017 305865 310164 295655 288873 270850 265542 247718 219073 223062
18287 223062 266086 275359 254016 240839 217377 201297 166714 174123 194217 211647 223956 267130
18275B67130l8943o3605k2236O523j4500M184L2932J9503N829K1292j3269k5480
18263A79360P467L4715L0416k1731p229L339K4521K9652q110j9494j7459k6971
18251B08476j2280J8313L5583L9594j8615k3370l3247k3044l2338o755p099o202
18239A39016k1900M139L2321L6578K6510J3644j6901l811k6266o853k258j9816
18227A54403j0944m0719r992M8672J6410j325J6301j260K9497N99o978M873J183
18214B00720J3695n61l1363O519K337j3546J5864K4520L6379L8308K2353l392
18202C11833k9256l6225l4892k6182R40O05j4415j8908o064J4825J4985J0906
18190A88152n840L392M450k2618R028J0042M218j0136N04L743j934j9164Q499
$$ plain form
18275 267130 228187 164582 142346 148869 134369 138553 171485 190988 196817 218109 204840 179360
18263 179360 186827 221542 251958 230227 222998 226337 250858 280510 272400 252906 235447 208476
18251 208476 196196 214509 250092 289686 271071 247701 214454 191410 159072 152317 145218 139016
18239 139016 117116 121255 153576 190154 216664 230308 213407 209596 183330 176477 174219 154403
18227 154403 143459 102740 92748 141420 157830 156505 172806 171546 201043 201642 194664 199537 200720
18214 200720 214415 213854 182491 189010 191347 177801 193665 218185 254564 292872 315225 311833
18202 311833 282577 246352 211460 185278 186218 186823 172408 153500 147436 162261 177246 188152
18190 188152 182312 185704 190154 167536 176564 186606 190824 180688 181192 184935 183001 163837 172336
18177A72336j184k0292J1318J9326m970K813P651K9341J2914l3925j8685J0268
18165A86911q673j7789J571K2216L575n44j9725K2834j494K5208L2112k2616M783
18152B28369J7857R253K6627M267p141J3750K7676N0633L3226P557K7564K3489
18140D63127L1009O822p967K9418M3628N4781N3799Q2532J8903L0604N5828N7960
18128I20444N8623L1832L3871K7545L2130J01388J52730J95861K44621K97711
18118B096756L75047N53491P47061J010149J454610K154588L424152N267552P193642
18109B4277048O762354K802975k45041j902418n286797p295293n527651l498433
18101A0086744k217086j528870j068132p40809n69992m37678l50341k32443k12214
$$ plain form
18177 172336 171152 150860 162178 181504 176534 179347 186998 216339 229253 195328 176643 186911
18165 186911 178238 160449 162020 184236 187811 187267 167542 190376 188882 214090 246202 223586 228369
18152 228369 246226 255479 282106 286373 279232 292982 320658 371291 404517 412074 439638 463127
18140 463127 494136 500958 492991 522409 566037 620818 674617 757149 776052 806656 862484 920444
18128 920444 979067 1010899 1044770 1072315 1104445 1205833 1358563 1554424 1799045 2096756
18118 2096756 2471803 3025294 3772355 4782504 6237114 8391702 11815854 17083406 24277048
18109 24277048 31039402 33842377 33597336 31694918 26408121 19112828 13585177 10086744
18101 10086744 7869658 6340788 5272656 4531847 3961855 3524177 3173836 2941393 2729179
18092B729179k16975j86892j76419j36058j15794r8858j01488r5516r7691j02900
18082A400588q6141o3165p8470n7744m7189k566k6157m3758l8679l2301J079k4580
18070I00917j8814l0842j3321p512l9450k5868k1890j7000o356j0645j9654j8932
18058F70633k4719j8604q627J7286P801K059k4465n3739n4994k574K2356J7285
18046E49698j4099j1046J447L3474J4330L143J0315j784k2174l8686k7357j6592
18034D80669j4918r641k6976j8385k2276m2541k8728K1344K1142O2274K2687J8670
18022D63321J3720J0040k8050J4766K5062k4233n6588n2066l3595K9109P6322
18011D37808J03738J57673J82340J29825O1947M5733O127n6763p0574r2824q4368
$$ plain form
18092 2729179 2512204 2325312 2148893 2012835 1897041 1798183 1696695 1601179 1503488 1400588
18082 1400588 1314447 1251282 1172812 1115068 1067879 1065313 1039156 995398 956719 924418 925497 900917
18070 900917 882103 851261 837940 830428 790978 765110 743220 726220 719864 709219 689565 670633
18058 670633 645914 627310 618683 635969 643770 645829 621364 567625 512631 510057 532413 549698
18046 549698 535599 524553 526000 559474 573804 576947 587262 585478 563304 524618 497261 480669
18034 480669 465751 456110 429134 410749 388473 345932 317204 338548 359690 421964 444651 463321
18022 463321 477041 487081 459031 473797 498859 474626 418038 365972 332377 361486 437808
18011 437808 541546 699219 881559 1011384 1073331 1119064 1125191 1068428 997854 905030 820662
18000H20662l3579l5547k4850j9279l1612j5552k4152L081J1201j7324o210m633
17988F22206n604K1867l556j981Q053M526K7073O190N1872K3736L633J0406L697
17975G72118R707J1000n066K4060K7208K5946L6035P8139N5432Q1816Q4441O4767
17963A265603O7007L4473K5778M3080L5866N5207O6545J01414J19082J45928J85082
17952B145065J83892J86702K27437K45296L42474L63197K90982K52022K66567
17943D503634J77623J42406M5665j9030J341K8429K0044o0027j44908k13788k76423
17932D204966l80874k97391j62168m1354L4759O4115N0015Q1435J07602J13487
17922C774592Q7653J50693K75844L89803M90454O01764N62521L60370K48453J85991
$$ plain form
18000 820662 787083 751536 726686 707407 675795 660243 636091 639172 650373 633049 626839 622206
17988 622206 616602 638469 634913 632932 640985 645511 672584 678774 730646 754382 758015 768421 772118
17975 772118 781825 792825 787759 811819 839027 864973 901008 979147 1034579 1116395 1200836 1265603
17963 1265603 1332610 1367083 1392861 1435941 1471807 1527014 1593559 1694973 1814055 1959983 2145065
17952 2145065 2328957 2515659 2743096 2988392 3330866 3694063 3985045 4237067 4503634
17943 4503634 4681257 4823663 4869328 4850298 4851639 4880068 4900112 4840085 4695177 4481389 4204966
17932 4204966 3824092 3526701 3364533 3323179 3357938 3422053 3472068 3553503 3661105 3774592
17922 3774592 3862245 4012938 4288782 4678585 5169039 5770803 6333324 6693694 6942147 7128138
17912G128138R8023P2305K25695L01853L38170L62449L63715L93658M87683N46754
17902A0318443O38700P87759R25946J133446J441710J810464K264365K810598
17894B2131431L347322M041675M985867O349951Q345043J1515050J6508246K4540519
17886A01765104L6641645N1609338O1896377N9129308M6739832K5926657o935162
17879C76773099l7085855n1618473n8144690n6051847m3060239k9237389j9806359
17872H1768247j3883128j0087450p591219n921158m678881l838822l309181k843804
17864B9614604k472085k089713j780488j552506j328035j167096j060181j001504
17856A7162996r75588r04155q69212q11267o45944m90555l56268k69362l54961
$$ plain form
17912 7128138 7226161 7298466 7524161 7826014 8164184 8526633 8890348 9284006 9771689 10318443
17902 10318443 10957143 11744902 12670848 13804294 15246004 17056468 19320833 22131431
17894 22131431 25478753 29520428 34506295 40856246 49201289 60716339 77224585 101765104
17886 101765104 138406749 190016087 251912464 311041772 357781604 383708261 376773099
17879 376773099 339687244 288068771 229924081 173872234 130811995 101574606 81768247
17872 81768247 67885119 57797669 50206450 44285292 39606411 35767589 32458408 29614604
17864 29614604 27142519 25052806 23272318 21719812 20391777 19224681 18164500 17162996
17856 17162996 16187408 15283253 14414041 13602774 12956830 12466275 12110007 11840645 11485684
17847A1485684n52634o30920o60857p74370p34000o16913m79258m12468l25994
17838F298270k62833k14263j38940j26283j70754j69469m9197K1144J17304K66743
17828E571722K44784J02099O1950O7222J5075o9419r0059o1552j12532j73364
17818E555926k24510l02510l82574l53650l53072m00153l46496k92701k21684
17809B678576j42387j41219j45104j25219p9678q1285r7764q0838q5775p2352
17799A626955j8154m321l9835n7920n4783m6856m8876n0045m1723J279j7529m6525
17787A201667l3762l8598l6365l0663m3117j1882K277m1213l7091k8777O858R107
17775I18441k9330p9639m5790m664j4004J2569j4725k1833R453k049k3319o4009
$$ plain form
17847 11485684 10933050 10302130 9641273 8866903 8132903 7515990 7036732 6624264 6298270
17838 6298270 6035437 5821174 5682234 5555951 5385197 5215728 5166531 5187675 5304979 5571722
17828 5571722 5816506 5918605 5980555 6047777 6062852 5993433 5903374 5841822 5729290 5555926
17818 5555926 5331416 5028906 4646332 4292682 3939610 3539457 3192961 2900260 2678576
17809 2678576 2536189 2394970 2249866 2124647 2044969 1963684 1865920 1785082 1699307 1626955
17799 1626955 1608801 1604480 1564645 1506725 1451942 1405086 1356210 1306165 1264442 1265721 1248192 1201667
17787 1201667 1167905 1129307 1092942 1062279 1019162 1007280 1009557 968344 931253 902476 909334 918441
17775 918441 889111 809472 763682 759018 745014 757583 742858 721025 730478 728429 705110 641101
17763F41101k8332l1344q3726o4081m1437j2406J1487L5953M5970K1391N33L9416
17751E34525M8530K6223Q03L9104K3987j4656j5330j607k423k6718j8409j745
17739E92284K3777J0605j1432j4639j3803k0369j1433N627k8818r31j9105k8978
17727D82785m3691k4207m8708m7146l3453l3877q026J7480J4150N100M8731K9392
17715C58530J0514J896m9376N929J1533r93j2017k3553k5242k1894l2996j2588
17703B09743p356n522J2461j960k0358l9026l3430P35j1165j2843n018n727Q621
17690H9155k191j0141K1818J4075j0648J1572L7139l7986Q22L8452J4651k2993
17678A43725J6822L4753p800n0306l0412l0081J055P330K4990J2831r67R45Q020
$$ plain form
17763 641101 612769 581425 497699 433618 392181 379775 391262 427215 473185 494576 495109 534525
17751 534525 583055 609278 610081 649185 673172 658516 643186 641579 639156 612438 594029 592284
17739 592284 616061 626666 615234 600595 586792 566423 554990 560617 531799 530868 511763 482785
17727 482785 439094 414887 366179 319033 285580 251703 243677 261157 275307 280407 329138 358530
17715 358530 369044 370940 321564 327493 339026 338033 326016 302463 277221 255327 222331 209743
17703 209743 202387 196865 209326 207366 187008 147982 114552 115287 104122 91279 86261 80534 89155
17690 89155 86964 76823 98641 112716 102068 113640 150779 112793 113615 152067 166718 143725
17678 143725 160547 195300 187500 137194 106782 76701 77756 85086 110076 122907 121940 122885 130905
17665A30905O939N756j890k9179j4610j8671k1591M7459K5594K4159L6994k6194
17653A65671j194j0044L640J4342j8019N601q394j2665K8090J9028J6693j5165
17641A87584L841K8288J2781q427k3699k1802j2625k4186j3645m121J0476K6271
17629A60736k4487l0893L713J8922J7152q268j3323L5073J8134k3339j3416k1548
17617A18456o950j0092j1547J5829l538l1543j0192J7087N8398O6923O782o1002
17605A48611p91K595N03J0762j1282o508k8443J3691k8893j0418J5519q716j3429
17592H3201l860p970N01j902q68k7593p853J449J6585k883K1472L698L291j4830
17578F2438J284M5403J0893k1859j927L537M054k90k0560n6414k5108K3265M6016
$$ plain form
17665 130905 137844 143600 141710 112531 97921 79250 57659 105118 130712 154871 191865 165671
17653 165671 164477 154433 158073 172415 154396 159997 151603 138938 167028 186056 202749 187584
17641 187584 191425 219713 232494 224067 200368 178566 165941 141755 128110 123989 134465 160736
17629 160736 136249 105356 109069 127991 145143 136875 123552 158625 176759 153420 140004 118456
17617 118456 111506 101414 89867 105696 102158 70615 60423 77510 135908 202831 209613 148611
17605 148611 147820 150415 150918 161680 150398 143890 115447 129138 100245 89827 105346 96630 83201
17592 83201 79341 71371 71872 69970 69102 41509 33656 35105 51690 48807 70279 73977 77268 62438
17578 62438 63722 109125 120018 98159 96232 99769 103823 103533 82973 26559 1451 24716 70732
17565G0732K9534J2647J071j0257j6088l9964J7269L3104N166j5869j0385N032
17553H1992J0417k3559j5034J0289J5762L4581n935k7868j7075J926K3452j1606
17541G7342J0402j3535k5313R149J8634J8560o557J4040k0405p458K4489P773
17529A07121K535N052j4160k5892L62p39j012J035o706J884K004l925m598K370
17515F5331r11n33j6071O848J6696j4010k6154j3072L4020K6732J9543J6451l4291
17502H0579m051j5976r071j8739L159k9090j4165l357P650J9882K0230P641j8383
17489B6309j7542K8106L2568k5846j0151Q349K4272n593l7005k0233Q093j383
17477I944m707J7686J0430M717l843l2362j2567J7197m133J8193L265m3733O396
$$ plain form
17565 70732 100266 112913 113984 103727 87639 47675 64944 98048 103214 87345 76960 81992
17553 81992 92409 68850 53816 64105 79867 114448 108513 80645 63570 65496 88948 77342
17541 77342 87744 74209 48896 58045 76679 95239 88682 102722 82317 74859 99348 107121
17529 107121 109656 114708 100548 74656 75018 74279 73267 74302 67596 69480 71484 67559 62961 65331
17515 65331 64420 63887 47816 54664 71360 57350 31196 18124 52144 78876 98419 114870 80579
17502 80579 76528 60552 51481 32742 35901 6811 -7354 -10711 -3061 16821 37051 44692 26309
17489 26309 8767 36873 69441 43595 33444 41793 66065 60472 23467 3234 11327 9944
17477 9944 5237 22923 33353 38070 34227 1865 -10702 6495 2362 20555 23820 -19913 -13517
17464a3517J6645L4771J9234N539o701k5629j733J3123K849K0118J6160l0119
17452E0740Q523Q39J6555J7275N713O051M311J0352P3523M5280P930n136m1045
17439B00911j1615j9101j4411r199q341j8216l1041K9230J3825o039L145Q928
17427A38076J0321p181l0521k7414j771r130j5088J432N6j4069L161j4685p98
17414C2389L3913K1465J009J7618K6091Q369M5774M2162K3347J8438O122k7064
17402B49633j3504J4324O5392M7056Q95j5001N74j2251j8875j5830o56N988J7509
17389C25254K033j2378K0199j3247l3780j0339O287J2850J2047J5682K5026p994
17377C41640j5568k56J016L01K0969M4131J1344M083K0513m3889m9115l5770o8008
$$ plain form
17464 -13517 3128 37899 57133 62672 55971 30342 28609 41732 44581 64699 80859 50740
17452 50740 59263 60102 76657 93932 99645 105696 110007 120359 193882 239162 247092 241956 200911
17439 200911 189296 170195 155784 146585 138244 120028 88987 118217 132042 126003 129148 138076
17427 138076 148397 141216 110695 83281 81510 72380 57292 58724 58780 44711 47872 33187 32389
17414 32389 66302 87767 88776 106394 132485 140854 186628 228790 252137 270575 276697 249633
17402 249633 236129 250453 315845 362901 363796 348795 349369 337118 318243 302413 301757 307745 325254
17389 325254 327287 314909 335108 321861 288081 277742 284029 296879 308926 324608 349634 341640
17377 341640 326072 325816 326832 327133 348102 392233 403577 407660 428173 384284 335169 299399 231391
17364B31391n0051m0399l788N187J2328j2586j1508j405N321P3J985Q452L5352
17351A80352L8383J1601j374j776J6869L8572p524K8029R02l0621J1397N1789
17339C36599Q169o566J4779L6206K3214l7265o4174l3688j1340m399p477j1912
17327B42146J7106k2438j1838q195R463n029l7426k5166j2454J2505j8514j029
17315A39131L2937M3039J3431M950P73r886k3977j4834k5580l0693j3481R234
17303A25044k8798k1174j0856J2841K0692j6986k5351k2500l034J0161J7201K053
17291E9293j5370k06N72K9626J2358L022j9038m00j4011j0144J863j804J5797
17278F1558j1360n503k1925k9621L4697J419j1433K0658N483M56k1041k5469N019
$$ plain form
17364 231391 181340 140941 137153 142340 154668 142082 130574 129169 134490 134563 136548 145000 180352
17351 180352 218735 230336 228962 227186 244055 282627 275103 303132 304034 273413 284810 336599
17339 336599 344768 338202 352981 389187 412401 375136 310962 277274 265934 261535 254058 242146
17327 242146 259252 236814 224976 216781 226244 221215 183789 158623 146169 158674 140160 139131
17315 139131 172068 215107 228538 233488 234261 224375 200398 185564 159984 129291 115810 125044
17303 125044 96246 75072 64216 77057 97749 80763 55412 32912 29878 40039 57240 59293
17291 59293 43923 43717 44289 73915 86273 89295 70257 69857 55846 45702 47565 45761 61558
17278 61558 50198 44695 22770 -6851 27846 29265 17832 38490 43973 44429 23388 -2081 2938
17265B938J2973L8803J6066k1135k9132q18J0787k5036n855J7560M755r395j3071
17252e60k0056L1576J6062j3374k5598L178N4976k0848k4765j470L455o308N626
17239A894o972M6069l776J471R150j4173m0099J5890m82K0796Q634k2592p969
17226G841j863J4466l62J907K1124j0957j3191j8742J0891K1768O476l064l2759
17213C535m056K4729O609o553k7406k7972J6452K6106p396O32k8518N464N524
17200a2850o105L0636J0819l1593Q40L6435J8111k784l0348j0293q75L0547M975
17187C7515K472r16K260r863J3949L719l1320j0056K8454R393k5880j0766J2751
17174B1712J8881k1304p746M4871J2994q744m4474j1903L3030p961r574P724j2549
$$ plain form
17265 2938 15911 54714 70780 49645 20513 19695 30482 5446 -409 17151 21906 12511 -560
17252 -560 -20616 10960 27022 13648 -11950 -8772 46204 25356 591 -879 2576 -3732 1894
17239 1894 -5078 40991 37215 38686 47836 33663 -6436 9454 8972 29768 38402 15810 7841
17226 7841 5978 20444 20082 21989 43113 32156 18965 223 11114 32882 39358 36294 3535
17213 3535 -521 24208 30817 24264 -3142 -31114 -14662 11444 4048 4680 -23838 -18374 -12850
17200 -12850 -18955 11681 22500 -9093 -8253 28182 46293 43509 13161 2868 1993 32540 37515
17187 37515 39987 39071 41331 31468 45417 49136 17816 7760 36214 45607 19727 8961 21712
17174 21712 40593 19289 11543 56414 69408 60664 16190 4287 37317 29356 19782 27506 14957
17161A4957j8588k57J9475J0512k17k3815M716k5452J8619K4646j4004j8158l0657
17148c8223m642L3888J8922o084L2934K7701P967J5357j3272q804N607l3612j651
17135C6088Q347k2090j1559L205L847O821M1014J660J770J830k074J5717Q439
17122I3015N741K619j1557j4508l1604J1239P438K5272J9299n235O375K2833K4796
17109A55723K2436O567Q854L3400K0627J7284r49o175L517L7848K2990k6564k9476
17096B66082m9844k7910k904j0087l152l234k5015j1510J4982l0654j3517q199
17084I5038j3020n95J5206L0009J4293O981k4221l1498O312j1032j6607l8629
17072C2237q60o329Q054k250q029n17N522P025J3939k425r37Q256k1368k5057
$$ plain form
17161 14957 -3631 -3888 15587 26099 25882 2067 6783 -18669 -50 24596 10592 -7566 -38223
17148 -38223 -42865 -8977 9945 3861 36795 64496 72463 87820 74548 65744 71351 37739 36088
17135 36088 44435 22345 10786 13991 17838 24659 65673 67333 69103 70933 68859 84576 93015
17122 93015 98756 101375 89818 75310 43706 54945 62383 87655 106954 101719 108094 130927 155723
17109 155723 178159 184726 193580 226980 247607 264891 263942 257767 261284 299132 322122 295558 266082
17096 266082 216238 188328 185424 175337 172185 168951 143936 132426 147408 116754 103237 95038
17084 95038 82018 81423 96629 126638 140931 147912 123691 92193 98505 87473 70866 32237
17072 32237 31377 25048 33102 30852 22823 22306 27828 34853 48792 46367 45430 53686 32318 7261
17058G261R221l690K2827m09j2490j5426J055K6471j9712j6387K8952J2740m429
17045C5984o084J179J1880k742k1172j726m4739k9751J6226K8392K9444J3018
17033B9909k4562j4368o360J3874k2723n731O263J1912q79o51k5147m951M5081
17020A667k349l9048N603N6237P698K23K141j1989o071k8576j3713K9241R607
17007A0671n832J4207J376j8636K0671r619k0504j0245O534l163l10K2354j005
16994F499O408j1738k2538j348K6641r002l752M045r851p58j2142k0118J3632
16981c4022q207q107J4822R046Q833l987l681O791O394N72P070o890j4109K113
16967b3362K9382P628N219R804k3768L61N896P935J0757k9986k065J2375j0400
$$ plain form
17058 7261 16482 12792 35619 35210 22720 7294 8349 34820 15108 -1279 27673 40413 35984
17045 35984 29900 31079 42959 40217 19045 17319 -27420 -57171 -40945 -12553 16891 29909
17033 29909 5347 -9021 -15381 -1507 -24230 -29961 -23698 -11786 -12665 -13316 -38463 -43414 1667
17020 1667 -682 -39730 -34127 22110 29808 30031 32172 20183 14112 -14464 -28177 1064 10671
17007 10671 4839 19046 20422 1786 22457 12838 -7666 -17911 -11377 -14540 -14850 7504 6499
16994 6499 12907 1169 -21369 -22717 3924 -5078 -8830 -4785 -14636 -15394 -27536 -47654 -34022
16981 -34022 -42229 -50336 -35514 -26468 -17635 -21622 -25303 -18512 -12118 -11546 -4476 -11366 -25475 -23362
16967 -23362 6020 13648 18867 28671 4903 5264 11160 19095 29852 -134 -2199 10176 -224
16954b24J94j1119J1147J4375k7708j6339Q31K9801K4597N676K927J6841L427
16941E4426k9572j5439J5914l829o838k0267k1701O820M173K1009p404l6416r607
16928d8731L0748J3811K2297L7512j6938q462k1897l564J303O815J154M091j1556
16915F583k7770L88K2495K8824p093p511O821k5235j7203O766J2882k770j507
16902d330k0343r319K146K2470L0742J0967l937L530l688N056j2940j996j2303
16889F055J0868k522k281J2267K841j5920l9021j124L5045J962j5900r401J7948
16876H17J5852m227N874k046r102k3595R36R276J025k4282l9375j4724J4583K8463
16862d0525L9782p407K1339N713P81M236Q838q453q59J835k6588O417J8633k371
$$ plain form
16954 -224 -30 -11149 -2 14373 -13335 -29674 -28843 958 25555 31231 34158 50999 54426
16941 54426 24854 9415 25329 21500 14662 -5605 -27306 -20486 -16313 4696 -2708 -39124 -48731
16928 -48731 -17983 -4172 18125 55637 38699 30237 8340 4776 6079 12894 14048 18139 6583
16915 6583 -21187 -20799 1696 30520 23427 15916 22737 -2498 -19701 -12935 -53 -2823 -4330
16902 -4330 -24673 -33992 -31846 -9376 21366 32333 28396 31926 28238 33294 20354 18358 6055
16889 6055 16923 14401 12120 24387 27228 11308 -27713 -28837 6208 8170 -7730 -17131 817
16876 817 16669 12442 18316 16270 7168 -16427 -15491 -6215 -5190 -29472 -68847 -83571 -68988 -40525
16862 -40525 -743 -8150 13189 18902 19683 23919 32757 24304 23445 25280 -1308 5109 23742 21371
16848B1371n679J9067k4847p841O233J6728j7332j7524n948L35K516L3453m850
16835A5682n602J6933L938l4193k8694J6273N1110r207j5886o843m5186O790M3546
16822H661M199j8213k0827L701J1940J0260J5203n660K985J7466O783q356O011
16809C4153Q743J02o026o694j9376j6726j1375j8386j1214K7430K7002K366J3244
16796B3243j1627j7130o723J6126K5263j5193l7346k1468L4522j418J0852J4509
16784A3610l581K1045Q775j0984n0568j7065J5984K5653p965K074N669N381J1395
16771A9423k5606k4664O868J1565K0236k652j0461k2892J3263K5094O836j967
16759A5043j9591o223j9708q878L4409J6648k3345j254Q285J5373M429J3545m607
$$ plain form
16848 21371 15692 34759 9912 2071 8304 25032 7700 -9824 -15772 -15437 -12921 20532 15682
16835 15682 10080 27013 30951 -3242 -31936 -15663 35447 26240 10354 3511 -41675 -34885 8661
16822 8661 12860 -5353 -26180 -22479 -10539 -279 14924 9264 12249 29715 36498 28142 34153
16809 34153 42896 42998 36972 30278 10902 -5824 -17199 -35585 -46799 -19369 7633 9999 23243
16796 23243 11616 -5514 -12237 3889 29152 13959 -23387 -44855 -10333 -11751 -899 13610
16784 13610 10029 31074 39849 28865 -21703 -38768 -22784 2869 -5096 -3022 2647 8028 19423
16771 19423 -6183 -30847 -23979 -12414 7822 5170 -5291 -28183 -14920 10174 17010 15043
16759 15043 -4548 -10771 -30479 -39357 -4948 11700 -11645 -12899 -4614 10759 15188 28733 24126
16746B4126k4812j1586n735J1771n461K096r87n594n669P041K8656j3123k6556
16733b5833j1435K253K4837L633n868Q249J5109K647O198n09l3461P301K6992
16720B0113n85J6949n5811l0333L8465L476l3467J7244J63j991L4686k0101j0421
16707b1613J9061K6508J9857r074j2394j5048J4921J6605l766k9988m440J9503
16695B0132j2371R577J7650o908m1464k1476J9678L0453J4726k0477l5150o056
16683c1686M0086K2181j3820j8721j0787m196n229N862m594Q916Q12j5962r5J0019
16669a7214j3266p169r945L9118K8375J979j0660k4447M784J2675k051j5750k6371
16656c9942R850k570L7662K2605o942k1881j0637K0282j2514J5137K9166j5111
$$ plain form
16746 24126 -686 -12272 -18007 -6236 -11697 -9601 -10588 -16182 -21851 -14810 13846 723 -25833
16733 -25833 -37268 -35015 -10178 -6545 -12413 -4164 10945 13592 19790 19281 -14180 -6879 20113
16720 20113 19528 36477 -19334 -49667 -11202 -7726 -41193 -23949 -23786 -25777 8909 -11192 -21613
16707 -21613 -2552 23956 43813 34739 22345 7297 22218 38823 35057 5069 629 20132
16695 20132 7761 17338 34988 28080 -13384 -34860 -15182 15271 29997 9520 -25630 -31686
16683 -31686 8400 30581 16761 -1960 -12747 -16943 -22172 -16310 -20904 -11988 -11176 -27138 -27233 -17214
16669 -17214 -30480 -37649 -47594 -8476 19899 21878 11218 -13229 -8445 4230 2179 -13571 -39942
16656 -39942 -30092 -32662 5000 27605 20663 -1218 -11855 8427 -4087 11050 40216 25105
16644B5105l6209j8280J783K048k97J377j2365j1192K6895L520m822m326n190
16631c1953J0754L2226O866l5700j3995J1481J1818K0934J0443j9967o517M41
16619c169l0724J8542l865q789l529R455K8653J2256j445R667l7409l9459K831
16606d6985L2001k43l2375J5249o67j962j8421J4636N684J8431J239K5612J220
16593A3419j9210r370L0093p055j8110m2374r660K5762K0297J9544K441K9534
16581C5311j9373k6355J087L525J8886K1096m3223l3383k004L5689Q772j7787
16569a7759L486r056r11p972L58L1540P615j7104K3665j9155o855J7583k5230
16556a9795l6702j2216K0057K2905p756k0026J7799K4253L5089Q408k1575j2147
$$ plain form
16644 25105 -11104 -29384 -27601 -25553 -25850 -24473 -36838 -48030 -21135 -17615 -22437 -26763 -31953
16631 -31953 -21199 11027 17893 -17807 -31802 -20321 -8503 12431 22874 2907 -3610 -3169
16619 -3169 -33893 -15351 -19216 -28005 -31534 -22079 6574 18830 17385 27052 -10357 -49816 -46985
16606 -46985 -14984 -15227 -47602 -32353 -33020 -34982 -53403 -38767 -33083 -14652 -13413 12199 13419
16593 13419 -5791 -15161 14932 7877 -10233 -52607 -62267 -36505 -16208 3336 5777 35311
16581 35311 15938 -10417 -9330 -5805 13081 34177 -9046 -42429 -44433 -8744 28 -17759
16569 -17759 -14273 -23329 -24240 -32212 -31854 -314 7301 -9803 13862 -5293 -12148 5435 -19795
16556 -19795 -56497 -68713 -48656 -25751 -33507 -53533 -35734 -11481 23608 32016 10441 -1706
16544a706k2620M8080K2461J2104l294j7785k4556j911j8940k6682K3573K0500
16532I224k7515l3983m710J4638j3310J3106J9298k1142k3155K4215K2187j8537
16520c9684J0849J0419n21k0351j8351O903j3242k08j7265J5568K9507M0043L355
16507G022m638n287k636k1142l612J3517J316J4835J2822n233k6712j4215p66
16494c4729N248L1136R900P119N264R05L918q823L513J2514K9315o1k7776r038
16480B8405k0014j9819J1555M991j5134j645K3283r66j2232k0759M921j802j5258
16467c4474O294L3013l0722n5993R908P1050K1213J013L5162j6671r753m5174
16455a5134k9480J4155J2988j2758k0401L9647J8341j955L953J0772o595k9042
$$ plain form
16544 -1706 -24326 23754 46215 58319 55025 37240 12684 10773 -8167 -34849 -11276 9224
16532 9224 -18291 -52274 -56984 -42346 -55656 -42550 -23252 -44394 -67549 -43334 -21147 -39684
16520 -39684 -28835 -18416 -18937 -39288 -57639 -50736 -63978 -64186 -81451 -65883 -36376 3667 7022
16507 7022 2384 -2903 -5539 -26681 -30293 -16776 -15460 -625 12197 6964 -19748 -33963 -34729
16494 -34729 -29481 1655 11555 18674 23938 24843 28761 19938 23451 35965 65280 65219 37443 28405
16480 28405 8391 -11428 127 5118 -10016 -11661 11622 10656 -1576 -22335 -17414 -19216 -34474
16467 -34474 -28180 4833 -25889 -81882 -71974 -924 20289 21302 56464 39793 30040 -15134
16455 -15134 -44614 -30459 -17471 -30229 -50630 -10983 7358 5403 9356 20128 13533 -15509
16443a5509K878k0744q982P015K9902N836K015m946R983p566J0917L295M026k328
16429A5792j0824k3456m855M733Q922o680L4417k6878j5268k814R839J1340p383
16416a3115L740j4131K8546J7860l7718k343j160K9113J8452m574n589j0593q029
16403D59j6427K0748J2739j0211J795k6871n160K1779q325J6393p513J6837K7161
16390D3404p482j8673q851k719K4496l670J0987O41r483q497J0101K585p442n9818
16376c4421m8766K7414L7350J5171K5401r836k5809K0129J9547k8970l6077K8506
16364a0361L2995q886r262k3376R77k664o751J5526N459j7553k4675j2666j95
16351f1432K7467K6960K1942J9931j5514m425K9109j7049j5563j5837n2891j0488
$$ plain form
16443 -15509 -12631 -33375 -42357 -35342 -5440 396 2411 -2535 7448 -118 10799 14094 18120 15792
16429 15792 4968 -18488 -23343 -18610 -9688 -16368 18049 -8829 -24097 -26911 -17072 -5732 -13115
16416 -13115 -9375 -23506 5040 22900 -14818 -17161 -18321 10792 29244 24670 19081 8488 459
16403 459 -15968 4780 17519 7308 9103 -17768 -22928 -1149 -9474 6919 -594 16243 43404
16390 43404 35922 17249 8398 5679 30175 26505 37492 38133 28650 20153 30254 32839 25397 -34421
16376 -34421 -83187 -55773 -18423 -3252 22149 12313 -13496 6633 26180 -2790 -38867 -10361
16364 -10361 22634 13748 4486 -18890 -17913 -20577 -27328 -11802 -6343 -23896 -48571 -61237 -61432
16351 -61432 -33965 -7005 14937 34868 19354 14929 44038 26989 11426 -4411 -57302 -67790
16339f7790K3253J3596J1925L0602K0564p601j0707J4906O904j4722M120K8438
16327E3488l5500l7745n304O389L4368K7562k4063q977j9357m475K0798L8752
16315D5936k97o011k1830j2851j4152j6342m774J9798J8641j5078m157n731J0156
16302f692J4673J8244l689k0354k5423k970l98J3190K2369M0365L99r639p919
16289C2156l0384r737m154j7095J0652L5291N337k8315J3198n494o247L0055K0791
16276D6054p05J569r775l946j7043q474p52J56J341k5083k4124r725J7019l575
16262c7063k4020k527k262K3221N978P086P27j4246R895J9870j1701j248K0669
16249e621Q307n587q231k0824k621L62l062L1319K2701L2306n122j7244o835K7687
$$ plain form
16339 -67790 -44537 -30941 -19016 11586 32150 24549 13842 28748 35652 20930 25050 53488
16327 53488 17988 -19757 -25061 -18672 15696 43258 19195 10218 -9139 -13614 7184 45936
16315 45936 45639 39628 17798 4947 -9205 -25547 -30321 -10523 8118 -6960 -11117 -16848 -6692
16302 -6692 7981 26225 22536 2182 -23241 -26211 -26609 -13419 8950 49315 49714 40075 32156
16289 32156 1772 -7965 -12119 -29214 -18562 16729 22066 -6249 6949 1455 -4792 25263 46054
16276 46054 45349 46918 37143 33197 16154 7680 6928 7084 8425 -16658 -40782 -50507 -33488 -37063
16262 -37063 -61083 -63610 -65872 -42651 -36673 -29587 -28860 -43106 -33211 -13341 -25042 -26290 -5621
16249 -5621 2686 -2901 -11132 -31956 -34577 -34215 -37277 -5958 16743 49049 43927 26683 19848 47535
16235D7535J0094n755k0136l5424j1307m649K5683P664o459Q864K699J8815M28
16222C8052L3621k4764p804kj0062j1616k8920J0080o584R300J3853O213j3140
16209H227m07J290j4033j7762j8244k2161L714P958J427J7887N6660m482l1778
16196a1704K0645M541l8323j2079o152J2816K7777l682L41L364O049J1892K2925
16183C8410J2536K1350m4964l5643k3918L7078K7347j3327J5464Q089m5837m841
16171h256M1386K7681K551m7576j1530J1857K222j1446J141J3330k8158j4215
16159b1013j0629K3295Q969J5737Q500j0541k6008O074K7739k9961j407p405n582
16146b2232n125j1544K2959L6580j779l2910n943K4159o718m042k7088L7712J9195
$$ plain form
16235 47535 57629 51874 31738 -3686 -14993 -19642 6041 13705 7246 16110 18809 37624 38052
16222 38052 71673 46909 39105 39103 29041 17425 -11495 -1415 -7999 1301 15154 21367 8227
16209 8227 7820 9110 -4923 -22685 -40929 -63090 -59376 -51418 -49991 -32104 24556 20074 -11704
16196 -11704 8941 13482 -24841 -36920 -43072 -30256 -2479 -6161 -5820 -2456 3593 15485 38410
16183 38410 50946 72296 27332 -8311 -32229 4849 32196 18869 34333 42422 -3415 -8256
16171 -8256 33130 60811 63362 15786 4256 16113 18335 6889 8030 21360 -6798 -21013
16159 -21013 -31642 -8347 622 16359 24859 14318 -11690 -5616 22123 -7838 -9245 -16650 -22232
16146 -22232 -27357 -38901 -15942 20638 18859 -14051 -19994 4165 -2553 -6595 -33683 4029 23224
16133B3224j6431L44k2014K3004J2795k4771k301O206J7121l238J4161R431j2474
16120B5057m2849K581J4893J4031M584J451J8908J6471p496j6259j4977k2448
16108f053J619J0402j0037M233J6029j2935k543M904j3151R138P363J4778k7221
16095c474j8038J4429K7699k4901k365j4788J752J9084q87J2470L1511M037n6887
16082a0358p888P101J1600O637L376l0361q631L1989M318J0183j8562K1867R154
16069C0425j6755j5293J3795J1331J1661L648j2988l0358j3129J2783R545j7842
16057a3177q268k5389J2605K2194K5946O219j1923j1368O871K6921M0519j7135
16045E4015m1414k8070k3461P756O067O433K1695K5028r227j951k2510j6869q502
$$ plain form
16133 23224 6793 7137 -14877 8127 20922 -3849 -6150 56 17177 13939 28100 37531 25057
16120 25057 -17792 -15211 -318 13713 18297 19748 38656 55127 47631 31372 16395 -6053
16108 -6053 -4434 5968 -4069 164 16193 3258 715 5619 -7532 1606 8969 23747 -3474
16095 -3474 -21512 -7083 20616 -4285 -6650 -21438 -19686 -602 -1489 10981 42492 46529 -10358
16082 -10358 -18246 -11145 455 7092 10468 -19893 -28524 3465 7783 17966 -596 21271 30425
16069 30425 13670 -1623 12172 23503 35164 38812 25824 -4534 -17663 -4880 4665 -13177
16057 -13177 -21445 -46834 -34229 -12035 13911 20130 8207 -3161 3710 30631 71150 54015
16045 54015 12601 -15469 -38930 -31174 -25107 -18674 3021 28049 18822 16871 -5639 -22508 -31010
16032c1010J1934K6901j272J7483l983j1084j3118k1926k6796K7364J3263l7094
16020d9338K453j4826J6149J6895r702j6613J1600K6224l738j0174M137l706J1997
16007a8642J4270m242n0910K243K7162N286M0215L4741l2626l6407n689L9038
15995A4439J5096j7303l9717k0575J9176J0488k0756o386J5661M9472J8330k0806
15983A7119k4387K0747R701j8389j7846J1595K2145N946o39j3303o198R848K222
15970A8561j7946j5773p290n81R342O355K358J1901K1322q094j2766j676J2813
15957A8526r474j741K4116j761k0646j0004R525L713L2708j7066m136L1866l2990
15944B2636k3554J6459q234o977J9464n188k5327q48j3090L3484K2081l6500j1183
$$ plain form
16032 -31010 -19076 7825 6553 24036 20053 8969 -4149 -26075 -52871 -25507 -12244 -49338
16020 -49338 -46885 -61711 -45562 -28667 -38369 -54982 -43382 -17158 -20896 -31070 -26933 -30639 -18642
16007 -18642 -4372 -8614 -59524 -57281 -30119 -24833 15382 50123 17497 -18910 -24599 14439
15995 14439 29535 12232 -27485 -48060 -28884 -18396 -39152 -45538 -29877 19595 37925 17119
15983 17119 -7268 13479 23180 4791 -13055 -1460 20685 26631 25992 12689 6491 16339 18561
15970 18561 615 -15158 -22448 -23029 -13687 -7332 -4974 6927 28249 20155 7389 5713 18526
15957 18526 9052 7311 31427 29666 9020 -984 8541 12254 44962 27896 23760 55626 22636
15944 22636 -918 15541 7307 330 19794 14606 -10721 -11569 -24659 8825 30906 -5594 -16777
15931a6777K3358m579n052J3967J3290J262j5434K2227j136k0736n741k0670j2716
15918b8737L1073l7845k4424K4326K4072J476Q058J4688j480r414k3720l0971
15906e2898j9417J1176L4164L5984K1038j0402j6228K0044Q011J3271J173l1498
15894A4418j7179M0980N333j1870r079l1823J250O858O515j3705J5228k4764n605
15881b3443J5247L875P028o219n064j0891J8545L2436j4512l096p649j1985k2388
15868b8116j0613q752j0160J3597O47j535p830K9351P811J8508K374o744J9156
15855A7694j6212j8370M765m94J3626J1721n003m97K1016J5414L2001l8687k9780
15842G194J4015k938l6014m6241Q925J502j4851J1793k059J8877M2798K1073K1
$$ plain form
15931 -16777 6581 2002 -3050 10917 24207 25469 10035 32262 31126 10390 4649 -16021 -28737
15918 -28737 2336 -35509 -59933 -35607 -11535 -10059 -2001 12687 11207 1793 -21927 -52898
15906 -52898 -72315 -61139 -26975 9009 30047 19645 3417 23461 31472 44743 45916 14418
15894 14418 -2761 38219 43552 31682 22603 -9220 -7970 -1112 5403 -8302 6926 -17838 -23443
15881 -23443 -8196 -4321 2707 -3512 -8576 -19467 -922 31514 17002 13906 6257 -5728 -28116
15868 -28116 -38729 -47481 -57641 -44044 -43397 -44932 -52762 -23411 -15600 2908 5282 -1462 17694
15855 17694 1482 -16888 -12123 -12617 1009 12730 7727 7230 28246 43660 75661 36974 7194
15842 7194 21209 18271 -17743 -63984 -55059 -53557 -68408 -56615 -58674 -39797 3001 24074 24095
15829B4095j1495j8705m5297j7294L8990N342n665j712n167p946J5402m994j888
15816c6334J9871M2066J9642j7612k4605K596j3788j9307k119K7404J8728L0435
15804D6977J3917J2276J0566j6506k7292m4099l4942P848J4524k7602Q149O074
15792c0110J3604o66j5161O492J0377L2261Q082r451k2795j8979J6687n055o531
15779b1245k837j4255L5421K8797P945M587K6130n353J5491j3134l2862k0838
15767G847k9705j8917j6228J6005J2906P657J018J1898j496O546j3305k6765J9056
15754b3483J3590O664m909k6534O492l161J247n264J8095P465k406q848J1867
15741i185Q790K042J0667q574k408R798p909O410q44n778K5200r658j6451r79
$$ plain form
15829 24095 12600 -6105 -51402 -68696 -29706 -24364 -30029 -31741 -36908 -44854 -29452 -34446 -36334
15816 -36334 -16463 25603 45245 27633 3028 5624 -8164 -27471 -29590 -2186 16542 46977
15804 46977 60894 73170 83736 67230 39938 -4161 -39103 -31255 -16731 -44333 -36184 -30110
15792 -30110 -16506 -17172 -32333 -25841 -15464 16797 24879 15428 -7367 -26346 -9659 -14714 -21245
15779 -21245 -24082 -38337 -2916 25881 33826 38413 64543 59190 74681 61547 28685 7847
15767 7847 -21858 -40775 -57003 -40998 -28092 -20435 -19417 -7519 -9015 -2469 -15774 -42539 -23483
15754 -23483 -9893 -3229 -8138 -34672 -28180 -31341 -30094 -35358 -17263 -9798 -12204 -21052 -9185
15741 -9185 -395 1647 12314 3740 1332 11130 3221 9631 8787 3009 28209 18551 2100 1121
15727A121q371J1395L2435P046j2916P847j5360o402K6346K814k7674k1452k6324
15714b9495J5401K0697N353O903m4806O234K030k470l240K764L0303p273r355
15701f954p174n613j2745J4407J3724q697O243O652m1915k0421J2061K6077J2099
15688a2256K4783O912J677L571k8863J2105R632k5847k2528J4033K8388P132m739
15675A4000Q03k1083N357L0552L8305j2933n7172j7599k594J784j2636j2928K1438
15662b4706K6856j8645p719r4K5891j3897J366K3120j1967j9488n316O270R183
15649i146K1680p03n2297k2242J8716K5067K7645p399l2910Q110P474j470K3196
15636E721J791k1551k124J8382l031P166J2898J6632j8610l2256j4265K1718K2502
$$ plain form
15727 1121 -7250 4145 36580 43626 30710 38557 23197 16795 43141 45955 18281 -3171 -29495
15714 -29495 -14094 6603 11956 18859 -25947 -19713 -17683 -20153 -23393 -20629 9674 2401 -6954
15701 -6954 -14128 -19741 -32486 -18079 -4355 -13052 -6809 -157 -42072 -62493 -50432 -24355 -12256
15688 -12256 12527 19439 21116 24687 -4176 7929 17561 -8286 -30814 -16781 11607 18739 14000
15675 14000 14803 -6280 -923 29629 67934 55001 -2171 -19770 -22364 -20580 -33216 -46144 -24706
15662 -24706 2150 -16495 -24214 -24308 1583 -12314 -10948 12172 205 -19283 -24599 -18329 -9146
15649 -9146 12534 11831 -40466 -62708 -43992 -18925 8720 1321 -31589 -23479 -16005 -17475 5721
15636 5721 7512 -14039 -16163 2219 -812 6354 19252 35884 17274 -14982 -29247 -7529 14973
15623A4973j4317m765P995R297J0942n052M766j3961k4754k86j0730J0627P136
15610h129O121L7173l1034k4356K1207L550q9J8827J9244j406m6867j0364k0114
15597c6237K6334J3841J2086k4277O612N959j1973j4236P354Q414j9457K0757
15585d823J4408j5310j0867J3601P607l027n728o862n473k6476k3047n066J7599
15572e3464M2608J3369R309K276M592n830j2720n069k7356J3777K1307K2427m321
15559B0905L311o18j8334O164q859J5850J001q013r138K8397J601k1698j5664
15546e095k5032q569k8347J877j3186J8804M7030k010J721K316M092j1584m8K300
15532a5731J4625P685K8151J3348o215l3558l2298r588J7888q814j1047K425j767
$$ plain form
15623 14973 656 -4109 3886 13183 24125 19073 23839 9878 -14876 -15162 -25892 -15265 -8129
15610 -8129 -2008 35165 4131 -20225 982 4532 4443 23270 42514 41108 -5759 -16123 -36237
15597 -36237 -9903 3938 16024 -8253 -1641 4318 -7655 -21891 -14537 -6123 -25580 -4823
15585 -4823 9585 -5725 -16592 -2991 4616 1589 -4139 -11001 -16474 -42950 -65997 -71063 -53464
15572 -53464 -10856 2513 11822 14098 18690 12860 140 -4929 -32285 -18508 2799 25226 20905
15559 20905 24216 23598 5264 11428 2569 18419 19420 11407 2269 30666 32267 10569 -5095
15546 -5095 -30127 -38696 -67043 -65166 -78352 -59548 -12518 -14528 -12807 -10491 -6399 -17983 -18031 -15731
15532 -15731 -1106 6579 34730 48078 41863 8305 -23993 -33581 -15693 -24507 -35554 -33129 -34896
15519c4896l693P41Q563M911N427J1231J1597j3792q400p912j6088p092l932j4710
15505f8045J1102J2170J1944L0988J6174j5830n759k3030O982K6114j4361k9947
15493d1498K0611J9833l124n875k8192P176K1693p709R374J0199k7428m6107j257
15480g2304R375N1668J790m531p1k1014N719k6770k3023J3589M0926K3518Q793
15467G665k6427k8416pN8481K5254l934k92k7483m557L484j5667k0018R773j112
15453b3256K4168N043p83j2561j3979k954Q968J2796l409J0701l440m635o556
15440i897R262j7197j8827K4060J8109J2014r567l8900N69J8100J4019k4321K731
15427a9845J0582j1778J0224P635J5027o064K628N488l4213K0403J0924J573J3024
$$ plain form
15519 -34896 -38589 -37848 -29285 -24374 -18947 -7716 3881 -9911 -18311 -26223 -42311 -49403 -53335 -68045
15505 -68045 -56943 -44773 -32829 -1841 14333 -1497 -7256 -30286 -23304 2810 -11551 -41498
15493 -41498 -20887 -1054 -4178 -10053 -38245 -31069 -9376 -17085 -7711 2488 -24940 -71047 -72304
15480 -72304 -62929 -11261 -9471 -14002 -14073 -35087 -29368 -56138 -79161 -65572 -24646 -1128 7665
15467 7665 -18762 -47178 -47185 11296 36550 32616 32324 4841 284 3768 -11899 -31917 -22144 -23256
15453 -23256 912 5955 5172 -7389 -21368 -24322 -15354 -2558 -5967 4734 1294 -3341 -9897
15440 -9897 -635 -17832 -36659 -12599 5510 17524 7957 -30943 -30374 -12274 1745 -22576 -19845
15427 -19845 -9263 -21041 -10817 -3182 11845 5781 8409 13897 -20316 87 11011 12584 25608
15414B5608q852K0552n224q58j277K670j7148Q044P283j458l5297r138K8467M972
15400A8344J4498j4991m3802j0472q162J54M1968K3201j1797l4207k0210K399
15388d3077K5397O8105m753j7227o058l3140M592l678k2749J2899M328k731r524
15375b7616l7623j1675J1723L5827M9405l3388k8544K060k6122J0483K6628J5576
15363a3266J604J7694k0076k3723p055L3053L6423k0477l744K128J4228m724m0518
15350b8453m419J6497L259o578j5725q164J0588R266O551Q617r410O076j7823
15337b9718j814J2227K696j743O277k9081k1360L4070J4306L332L301k4j1909
15324a9440L476R029K2457R683k029k1995j7515R703K556j1918q288J3542J590
$$ plain form
15414 25608 16756 37308 32084 31226 29949 32619 15471 23515 30798 29340 -5957 -15095 13372 18344
15400 18344 32842 17851 -25951 -36423 -44585 -44431 -2463 20738 8941 -25266 -45476 -43077
15388 -43077 -17680 50425 45672 28445 22387 -10753 -6161 -9839 -32588 -19689 -15361 -18092 -27616
15375 -27616 -65239 -76914 -65191 -29364 20041 -13347 -41891 -39831 -65953 -55470 -28842 -13266
15363 -13266 -11662 6032 -14044 -37767 -44822 -11769 24654 4177 433 2561 16789 12065 -28453
15350 -28453 -32872 -16375 -13116 -19694 -35419 -43583 -32995 -23729 -17178 -8561 -17971 -11895 -29718
15337 -29718 -31532 -19305 -16609 -18352 -12075 -41156 -62516 -28446 -14140 -10808 -7507 -7531 -19440
15324 -19440 -15964 -6935 15522 25205 23176 1181 -16334 -6631 -4075 -15993 -24281 -10739 -9149
15311i149l420k243j2440j7090k638J906R788K9472M0794P509m440j3124k8365
15298c440m6816L0942K6880j2678j3749J9587R391j0991J9920M999j6974q157
15286a086p277j0577N002O479J2933k6041J3593J9516q340j9589K9577K5300j1593
15273B7897l3264j0125O098j481R95J013K16j6694J3293P149j5238J1370J5467
15260F696J1694j3575J7103k061M015j1146k2680j5083j155m294j0872J8254L1283
15247H179N835N787L3776k3196l1568j3156M736O915k2302j5956L136p965N1497
15234E718N7635R193k3086k6565L828L0794J5965j243k6828j8551K797k764o84
15221B6209j8985j6839r345L937m57j5335k9266J1109j5003L3075M9709J9721
$$ plain form
15311 -9149 -12569 -14812 -27252 -44342 -46980 -45074 -35286 -5814 34980 42489 38049 24925 -3440
15298 -3440 -50256 -19314 7566 -5112 -18861 726 10117 -874 19046 24045 7071 -1086
15286 -1086 -8363 -18940 -13938 -7459 5474 -20567 -6974 12542 4202 -15387 14190 39490 27897
15273 27897 -5367 -15492 -9394 -10875 -9880 -8867 -8651 -25345 -12052 -4903 -20141 -8771 6696
15260 6696 18390 4815 21918 19857 23872 12726 -9954 -25037 -26192 -30486 -41358 -23104 8179
15247 8179 14014 19801 53577 30381 -1187 -14343 -9607 -2692 -24994 -40950 -37814 -45779 5718
15234 5718 63353 72546 49460 22895 26723 57517 73482 72239 45411 26860 29657 26893 26209
15221 26209 7224 -9615 -18960 -15023 -15480 -30815 -60081 -48972 -63975 -30900 18809 38530
15209C8530j5705p698l8374j0594J5955K0875m72j8331k8181J2736K2177J5077
15197E995l5154k3763J6253M2551k0748k5089k4790m627J405L1497J3911J345
15185b1214j5531n913J5840L1037r881k2196j1455M516M136N427K5471K51Q151
15172H639K171O990k40o901k4765j1916p520j74J9980K9436J4308j3132k0392
15159c516j1872J2174M163J4461J703m057K442j1664k8102l3101k8474k371K1485
15146f6729L0035m698j0811L802K8880P159j5146p212J4196J9228j1533l26L2806
15133A9651K7975k4584k8961L0382l854j2454j5985j6839J5152J4273O934Q730
15121B0420j0752j8442N956L344K9381J1392k1383k1520Q011P726k23K7446J1932
$$ plain form
15209 38530 22825 15127 -23247 -33841 -17886 2989 2517 -15814 -43995 -31259 -9082 5995
15197 5995 -29159 -52922 -36669 5882 -14866 -39955 -64745 -69372 -67967 -36470 -22559 -21214
15185 -21214 -36745 -42658 -26818 4219 -5662 -27858 -39313 -34797 -30661 -25234 237 488 8639
15172 8639 10810 17800 17560 10659 -14106 -26022 -33542 -33716 -13736 15700 30008 16876 -3516
15159 -3516 -15388 -3214 949 15410 17113 13056 15498 3834 -24268 -57369 -85843 -88214 -66729
15146 -66729 -36694 -41392 -52203 -48401 -19521 -12362 -27508 -34720 -20524 -1296 -12829 -13155 19651
15133 19651 47626 23042 -5919 24463 20609 8155 -7830 -24669 -9517 4756 11690 20420
15121 20420 9668 -8774 -2818 526 29907 41299 19916 -1604 6407 14133 13910 41356 53288
15108E3288k3606J310l5128O627K7612r418n405m362k6863k0050J3583L2392j4359
15095d379k9713j6859J4045J4055q429p429l167L8703P423j7681J0676m386k0493
15082b7634j5701K3253L4770J7668k02j4924N3430o316k4152R671J0640p0k8585
15069C1848k8249k8366j9612j5318O754N953K0071K44L061j1873P21L0628L0787
15056B6649M19k9596q833J2469P849J493r642K31j3893K3762j7255K427k627N931
15042f16j6472R935K1543R231R896j0879l3397Q743J9827L535n127q155K755o65
15028A0154m206J3512J2774K234k1124k4193p40K4350m462r938j7576j3853K5662
15015g406L5136J9108l5374j9083j15k7982k16K6871J1701L186j5538N19j2958
$$ plain form
15108 53288 29682 30992 -4136 2491 30103 20685 15280 10918 -15945 -35995 -22412 9980 -4379
15095 -4379 -34092 -50951 -36906 -22851 -31280 -38709 -41876 -3173 4250 -13431 -2755 -7141 -27634
15082 -27634 -43335 -20082 14688 32356 32154 17230 70660 64344 40192 49863 60503 60433 31848
15069 31848 3599 -24767 -44379 -59697 -52943 -46990 -26919 -26675 -23614 -35487 -34766 -4138 26649
15056 26649 27068 -2528 -11361 1108 8957 10450 808 1039 -12854 10908 -6347 -3920 -6547 -616
15042 -616 -17088 -7153 14390 23621 33517 22638 -10759 -2016 17811 21346 16219 8064 10819 10154
15028 10154 5948 19460 32234 34468 13344 -10849 -11589 12761 8299 -1639 -19215 -33068 -7406
15015 -7406 27730 46838 11464 -7619 -7734 -35716 -35932 -9061 2640 5826 -9712 -9193 -22151
15002b2151k1410K1156K7820J6611J4690k6389k0119j3409l1389n643L2413K4572
14990c248n125j1540j7657k886J0145K5675L2275J0098k8779k2767K1627J6848
14978B4666L5081O011M849N511j9310l2629j8735k1575K3582l2763K7558J6543
14966A8789Q322k3045r263L2476p339j1846j8175J8465K8244l9442k4753k2K9927
14953B338r574k1889p505J2329J5420j3219J12L5358N096j1017j1344M541J9168
14940A9814o439r938k7093o750k836m788L3605K6785n080j9433K5614m982o531
14927A1948K909o30J2119j2168j4275k5453M064K7019L1610j9205R302k7047l2902
14914c2709j5486J9919K2312J0800j0439r521j365l733K0648n541j9721J6469
$$ plain form
15002 -22151 -43561 -22405 5415 22026 36716 10327 -9792 -23201 -54590 -60233 -27820 -3248
14990 -3248 -8373 -19913 -37570 -40456 -30311 -4636 27639 37737 8958 -13809 7818 24666
14978 24666 59747 65758 70607 76118 56808 24179 5444 -16131 7451 -25312 2246 18789
14966 18789 27111 4066 -5197 27279 19940 8094 -10081 8384 36628 -2814 -27567 -27589 2338
14953 2338 -7236 -29125 -36630 -24301 -8881 -22100 -21988 13370 18466 7449 -3895 646 19814
14940 19814 13375 3437 -23656 -30406 -33242 -38030 -4425 22360 17280 -2153 23461 18479 11948
14927 11948 14857 14227 26346 14178 -97 -25550 -21486 5533 37143 17938 27240 193 -32709
14914 -32709 -48195 -28276 -5964 4836 -5603 -15124 -16489 -20222 426 -5115 -24836 -8367
14902h367K0613j7957K6917J1402j3369l8702l4931j7483N3884K8222p569J3636
14890A6296N026N880q587k9343K317k0116J774L2382Q693j2835K278K4862J379
14877C0006m8410O875J7157L695k3480M876K704M898k457O492P848j3325n940
14864i061j2088J3471R58m193j2997J2777J2332J979l326J8887j5238j5257k414
14851a4170L230M581K6306j6886j1465q995j7464K4871N982K89L490r495K9472
14838A9746P167k2008o273k053K6631p401L424K7122j9241n790k8426k1190L0321
14825B029m810q514O773L8104J9897k8092l7609j0310K207J0454J9900o739R333
14812A2623m429P753J0617Q388q543l2321j3101J7717P311k7857J4158L0890k2869
$$ plain form
14902 -8367 12246 -5711 21206 32608 19239 -19463 -54394 -71877 -17993 10229 2660 16296
14890 16296 21322 27202 18615 -10728 -8411 -28527 -26753 5629 14322 1487 3765 28627 30006
14877 30006 -18404 -11529 5628 9323 -14157 -9281 -6577 -1679 -4136 2356 10204 -3121 -9061
14864 -9061 -21149 -7678 -6720 -10913 -23910 -11133 1199 3178 -148 18739 3501 -11756 -14170
14851 -14170 -10940 -6359 19947 3061 -8404 -17399 -34863 -9992 -4010 -3721 -231 -9726 19746
14838 19746 26913 4905 -1368 -3421 23210 15809 19233 46355 27114 21324 -7102 -28292 2029
14825 2029 -2781 -11295 -4522 33582 53479 25387 -12222 -22532 -20325 -9871 10029 3290 12623
14812 12623 8194 15947 26564 34952 26409 -5912 -19013 -1296 6015 -21842 -7684 23206 337
14799C37j9365J8372J7081J5738j7608j800J4640j5402m1694j2141J0210J9916
14787a1716M755K4782M100k0194k9388J7141K5185J483m6100K098J8815K3650
14775A4611j0563j7550k264j2002J184L328J4584J9972k384k1836j1968L9290
14763A4402l857j1728j4518j4640q58N540o571j6729K4034J5301O501p203L923
14750f403O55J4848M6585J2381j9649k9096j7867j2548L8570J9201k4247j9213
14738C217j1238P387j5962l021j1309J6978M2298R950k358j0598J370j7237k6021
14725a6544k135P027J6582N971Q067j0057R92J7104L8564K261l3068l0168j4517
14712i921k5771K3174k371j6129J5189q56j3121K824L0321J5136K4180j464M619
$$ plain form
14799 337 -19028 -656 16425 32163 14555 12755 27395 11993 -29701 -41842 -31632 -11716
14787 -11716 -6961 17821 21921 1727 -27661 -10520 14665 16148 -29952 -27854 -9039 14611
14775 14611 4048 -13502 -15766 -27768 -26584 -23256 -8672 11300 8916 -12920 -24888 14402
14763 14402 10545 -1183 -15701 -30341 -31199 -25659 -32230 -48959 -24925 -9624 -3123 -10326 -6403
14750 -6403 -5748 9100 55685 68066 48417 19321 1454 -11094 27476 46677 22430 3217
14738 3217 -8021 -634 -16596 -19617 -30926 -13948 28350 38300 35942 25344 26714 9477 -16544
14725 -16544 -18679 -11652 4930 10901 18968 8911 9903 27007 65571 67832 34764 4596 -9921
14712 -9921 -35692 -12518 -14889 -31018 -15829 -16685 -29806 -26982 3339 18475 42655 41191 45810
14699D5810l0461j2508J1491j0850j5269k874l7194j347n14K502R122M2963J6691
14686A7562l5175j4046J1122J3573j3487K488j0367p674R020k2339J2021J0543
14674b6759J1505m065j4098n87J3314L4382J7390p852j5452P730N700k9772j8009
14661b6573O047J1068j1601k231j8371K8151L3269K307j0119o158L303n145m812
14648h65J7711k1706J8762q593j2559j4600J0254K6522r59n971o63J2006K2847
14635D2186j329j5370J6815J6297l4123j2955J7348j4815o643l5426l0593K5846
14623c2762L4212l351j7625J3821L6152q148j8000j2430r507J5708R813j0814
14611b931m824j2704m024J7767J7156l0018j0374J7020j8113n481k2469L3780
$$ plain form
14699 45810 15349 2841 14332 3482 -11787 -14661 -51855 -53202 -53716 -51214 -42092 871 17562
14686 17562 -17613 -31659 -20537 -6964 -20451 -17963 -28330 -36004 -26984 -49323 -37302 -26759
14674 -26759 -15254 -19319 -33417 -34004 -20690 13692 31082 23230 7778 15508 21208 -8564 -26573
14661 -26573 -20526 -9458 -21059 -23290 -41661 -13510 19759 22066 11947 5789 9092 3947 -865
14648 -865 16846 -4860 13902 5309 -7250 -21850 -11596 14926 13967 7996 7333 19339 42186
14635 42186 40857 25487 42302 58599 24476 11521 28869 14054 7411 -28015 -58608 -32762
14623 -32762 1450 -1901 -19526 -5705 30447 22299 4299 -8131 -17638 -1930 7883 -2931
14611 -2931 -7755 -20459 -24483 -6716 10440 -19578 -29952 -12932 -31045 -36526 -58995 -25215
14599b5215L6373r652j6844j2650J4925M985m8438J9484L5552k4707K520K4763
14587A096L4445K1219R237k6390l2856o466J1066J6625k246k9882J1678K7539
14575C5065j9233J612M1504j9871r395P908l4809n728J6009j9521R722K824p705
14562a618J1032l0365k8428j404M592L8561N1399O857l2041l1600R845L1228j2624
14549A5434k1429K0308O847k5880j8932j6176J8760O355L530k562j8726K307K4114
14536f050j4238l3905J0110L4805K9368L2488K8044j7690j6079j5967N686k795
14524C3777j1188m6069j227j9736J2469r662j805L7986R330R026K2326j1005l3791
14511i569j1749k866J7544L5344J2943L065o969j1762j8683J0085L664r016k0738
$$ plain form
14599 -25215 11158 1506 -15338 -27988 -13063 -8078 -56516 -37032 -1480 -26187 -23667 1096
14587 1096 35541 56760 65997 39607 6751 285 11351 27976 25730 -4152 7526 35065
14575 35065 15832 17444 58948 39077 29682 37590 2781 -2947 13062 -6459 3263 6087 -1618
14562 -1618 9414 -20951 -49379 -50783 -46191 -7630 43769 50626 18585 -13015 -3170 28058 15434
14549 15434 -5995 14313 21160 -4720 -23652 -39828 -21068 -14713 -11183 -13745 -32471 -30164 -6050
14536 -6050 -20288 -54193 -44083 -9278 20090 52578 80622 62932 46853 30886 36572 33777
14524 33777 22589 -23480 -24707 -44443 -31974 -41636 -43441 -5455 3875 12901 35227 24222 -9569
14511 -9569 -21318 -24184 -6640 28704 41647 44712 37743 25981 7298 17383 21047 12031 -8707
14498h707n903L2976J2176K6892o623k3226k3722j9723q383J7361j3644j1764
14486c2290K8821O479m8K1384J5069j4690l5853j6845J6275M4736k3945k8944
14474a9851J7271n813Q509O812P082Q131M599K9325j4803j8399j2541K306l1377
14461a8749j5776J9974K096k2356J0409N9841J5349l8630k7253J7856J1203r007
14449D957k3289P607Q141r429O623j0821j6116Pj9328J2585Q691J8563K6826j6672
14435a655k7165K3226R947K31n285J9483J7696k2229j6474j0518M0644n508k7832
14422e439j0822K4439o271k9343r841j0986K870P370k5421m588J0120L1521J9226
14409g165Q721k6479k033J5569K4932M17k5784j3670L3002K4607J1746n375k5817
$$ plain form
14498 -8707 -14610 18366 30542 57434 50811 27585 3863 -15860 -24243 -6882 -20526 -32290
14486 -32290 -3469 3010 2962 24346 39415 24725 -11128 -27973 -11698 33038 9093 -19851
14474 -19851 -2580 -8393 116 6928 14010 22141 26740 56065 41262 22863 10322 12628 -18749
14461 -18749 -34525 -14551 -12455 -34811 -24402 35439 50788 12158 -15095 2761 13964 4957
14449 4957 -18332 -10725 -2584 -12013 -5390 -16211 -32327 -32320 -51648 -39063 -30372 -11809 15017 -1655
14435 -1655 -28820 -5594 4353 4584 -701 18782 36478 14249 -2225 -12743 27901 22393 -5439
14422 -5439 -16261 8178 1907 -27436 -37277 -48263 -45393 -38023 -63444 -68032 -57912 -26391 -7165
14409 -7165 1556 -24923 -26956 -11387 13545 13962 -11822 -25492 7510 32117 43863 38488 12671
14396A2671j2970J8848l710j077M592O085l1143k4275j4305J8197J512k2854P363
14383d1066R553M5582j9189k1714L006J1196j413k078j902R15j1862n428p188
14370d1588L2020J0366j0023m520r515j1730J0090J1332r192J4484J2623j6526
14358a2179J8384J4529m84j0851k4102O126l514J7122j3722K0294j8909r830K877
14345a4259N771j7011N699O273R56q183q606j288j1943j2887k564K9271L1068
14332B297P739L4056R969l7577l2577P183M5834J6748K963k2967n2065p677J2341
14319a3733O258k0369Q643m458M000m582j0797K6469o454k5734K1716L5485j5243
14306A201k2438R938K7869J7295j7379j3487j2507K6190r94n67P160P927j3602
$$ plain form
14396 12671 -299 18549 14839 13762 18354 24439 -6704 -30979 -45284 -27087 -25575 -48429 -41066
14383 -41066 -31513 14069 -5120 -26834 -23828 -12632 -14045 -16123 -18025 -17110 -28972 -34400 -41588
14370 -41588 -9568 798 -9225 -13745 -23260 -34990 -24900 -13568 -22760 -8276 4347 -12179
14358 -12179 6205 20734 20250 9399 -14703 -8577 -12091 5031 -8691 11603 -7306 -17136 -14259
14345 -14259 -8488 -25499 -19800 -13527 -12571 -20754 -29360 -30648 -42591 -55478 -58042 -28771 2297
14332 2297 10036 44092 54061 16484 -16093 -8910 36924 53672 56635 33668 -18397 -26074 -13733
14319 -13733 -7475 -27844 -19201 -23659 -19659 -24241 -35038 -8569 -15023 -40757 -19041 16444 1201
14306 1201 -21237 -11299 16570 33865 16486 2999 -9508 16682 15688 15121 22281 30208 16606
14293A6606P795j0232P370J8187j6002l8011o457M1851j882k7311k9826r507J587
14280d5832J947q058O911M381J0381n056m158q2J0081R076K1728J7182m6380r979
14266c7858J7163j3292K9479P044m581K4362J0393j0843j8703M294J4934l118
14254A9274J096K1501n604l3279j8824o407M0826K2495m414o067j707k3619l159
14241B112K7750J1572j3671j1921j8350R098q707r241q866j1673o793J7911J2637
14228h142p969J8990L4226l2339j7011K3309j990q507j9983l3966M473M0525q493
14215a6877j6404J4686L5217R133J1503l4844o066O020J550j3440k8054J3780
14203b3796L7934J1567j2959O636j2261j0166j3343o248J4566J1835j0604O412
$$ plain form
14293 16606 24401 14169 21539 39726 23724 -14287 -20744 21107 19225 -8086 -37912 -47419 -45832
14280 -45832 -43885 -51943 -45032 -40651 -30270 -35326 -39484 -39566 -29485 -20409 1319 18501 -27879 -37858
14266 -37858 -20695 -33987 -4508 2536 -2045 22317 32710 21867 3164 7458 22392 19274
14254 19274 20370 41871 36267 2988 -15836 -22243 18583 41078 36664 30597 28890 5271 2112
14241 2112 29862 41434 27763 15842 -2508 6590 -2117 -11358 -20224 -31897 -38690 -20779 -8142
14228 -8142 -16111 2879 37105 4766 -12245 11064 9074 567 -19416 -53382 -48909 -8384 -16877
14215 -16877 -33281 -18595 16622 25755 37258 2414 -3652 2368 3918 -9522 -37576 -23796
14203 -23796 14138 25705 12746 19382 7121 -3045 -16388 -22636 -8070 3765 -6839 -427
14191d27q59k5452n27L789N701j9746K327K2185J8196Q21K8358j9580L834j4239
14177D381K5822j003k1268k3297l3232j1497J9687J1780J7361l616J0444r924
14165a4362J7784l835o547Q30p815j4898k009m833K5176L4312q997k4814k6887
14152c6895r099k2276J8279K8250J9332J5131j135k606k021l0094J5572Q589j9555
14139a8528m297K9911j669j7527P570J9596J3317k4189k9196J6658j6088k732
14127b7174j0207Q539m675j2237N487q808l586j0792J3796L7334J572r096j2517
14114c2364k3775K3115J258q257p505K4315J135O238R863k1331J0764o588J0127
14101a3005M187Q854R046O566p06J2800j5749k1654j642K3156j6000j798j1276
$$ plain form
14191 -427 -1286 -26738 -27265 -23476 -17775 -37521 -35194 -13009 5187 6008 34366 14786 18620 4381
14177 4381 30203 29200 7932 -15365 -48597 -60094 -40407 -28627 -11266 -14882 -4438 -14362
14165 -14362 3422 -413 -6960 -6130 -13945 -28843 -30852 -35685 -10509 23803 14806 -10008 -36895
14152 -36895 -45994 -68270 -49991 -21741 -2409 12722 11587 8981 6960 -23134 -7562 1027 -18528
14139 -18528 -22825 7086 5417 -12110 -4540 15056 28373 4184 -25012 -8354 -24442 -27174
14127 -27174 -37381 -28842 -33517 -45754 -40267 -49075 -52661 -63453 -49657 -12323 -10751 -19847 -32364
14114 -32364 -56139 -33024 -31766 -40023 -47528 -23213 -22078 -15840 -5977 -27308 -16544 -23132 -13005
14101 -13005 -8818 36 9082 15648 14942 27742 11993 -9661 -11303 11853 -4147 -5945 -17221
14088a7221J2729J193k14j564k6512J1273K4244J3839k9026k2699J9448K7697
14076A3187K321j1849K319o889J1529K682k6233J634K2090Q909r789k2333q475
14063b0897J5569J4979J8459M1253l608k1201p353N933l1833m339m019o611j7545
14050b1213j4468r858J9320K6238J2909l2004k2417o645J3223L3370p038O878
14038a705K653j3148j1447r778k657K6335K6749K3934k2704j278J6337J4244l2042
14025A5493l3502J4753J4142j9155k0710Q776J0839K4484k217k1809J1125o700
14013d481j4205R815O71j371Q795J6250K6993k7081m1170j283J2627p920K5364
14000C004L660J6164Q084J602L620j8643k9880O818m313k8966K085O794L545L6914
$$ plain form
14088 -17221 -4492 -3299 -3513 -5077 -31589 -20316 3928 17767 -11259 -33958 -14510 13187
14076 13187 15508 3659 5978 -911 10618 13300 -12933 -11299 10791 19700 9911 -12422 -20897
14063 -20897 -5328 9651 28110 69363 65755 44554 37201 43134 11301 6962 2943 -3668 -21213
14050 -21213 -35681 -45539 -26219 19 12928 -19076 -41493 -48138 -34915 -1545 -8583 -1705
14038 -1705 948 -12200 -23647 -33425 -36082 -9747 17002 40936 18232 16954 33291 47535 15493
14025 15493 -18009 -3256 10886 -8269 -28979 -20203 -9364 15120 12903 -8906 2219 -4481
14013 -4481 -18686 -8871 -8200 -9571 -776 15474 42467 15386 -25784 -27067 -14440 -22360 3004
14000 3004 6664 22828 30912 32514 36134 17491 -12389 -5571 -9884 -38850 -36765 -29971 -26426 10488
13986A0488k9615k8996j483J6616J8299N658p92K5829L2458k4382j9686O561j8478
13973g523Q128K9096L5128K2866R189n2619j8011R12j673K400o288m022k1026
13960c443j3122J1580J4811o059p169j4760p831J7537j4436n989J6017R275M929
13947A340o3J0852O548N679L425l644J7819o212l3287k7600L545L526M499J2112
13933a461K4109J3948k6897p690k1140j6220j4622K7301K9555j3761k0429p248
13921c4555M422J6152K7699P887l288k9414j4253q211J5115J9109L6331R67l8411
13908d50k1527K2046J5362L452j3575l1654k578R688K8689J3301m1303r710j849
13895c0108m526M7990j5620J1953K9320K901Q068j1207j4917k736j8332L3737
$$ plain form
13986 10488 -19127 -48123 -49606 -32990 -14691 -9033 -9825 16004 48462 24080 4394 10955 -7523
13973 -7523 605 29701 64829 87695 96884 44265 26254 27166 25493 27893 21605 17583 -3443
13960 -3443 -16565 -4985 9826 3767 -3402 -18162 -25993 -8456 -22892 -28881 -12864 -3589 1340
13947 1340 1277 12129 18677 24356 27781 24137 41956 35744 2457 -25143 -21598 -18072 -13573 -1461
13933 -1461 22648 36596 9699 2009 -19131 -35351 -49973 -22672 6883 -6878 -27307 -34555
13921 -34555 -30133 -13981 13718 21605 18317 -11097 -25350 -33561 -18446 663 36994 37961 -450
13908 -450 -21977 69 15431 18883 5308 -26346 -28924 -19236 9453 22754 -18549 -28259 -30108
13895 -30108 -34634 13356 -2264 9689 39009 41910 49978 38771 23854 21118 2786 36523
13883C6523K7099m944q158r53p967J910r399k9870k7208K457j7011J5822L0525
13870H826l0110k3336l306J0924M4489J2152o683m1750K0110j599j7420L357K2626
13857a720n283p842m740J7223J2923J0701J7217K5334k2792k5761k5841j990n813
13844a8384j5674r892q821l7908K3083K3583K607j2032J62K7770J810k0078l8225
13831h1999j8046L3922K3978L181M668J918l208N536M7206k42j2372j2661k4648
13818c2767R740N275N869K3192P698n637o898j1878l2358k1095j8502K094J6903
13805e8364L1002P787j648K9055l556J9027J557r743N45k4924Q786N627j3769
13792h618j4805k6252k0439o10j171J2638n066N016J9920J5433l461j3277Q331
$$ plain form
13883 36523 63622 58678 50520 49567 41600 43510 34111 4241 -22967 -20510 -37521 -21699 8826
13870 8826 -21284 -44620 -47926 -37002 7487 19639 12956 -28794 -8684 -10283 -27703 -24346 -1720
13857 -1720 -7003 -14845 -19585 -2362 10561 21262 38479 63813 41021 15260 -10581 -12571 -18384
13844 -18384 -34058 -43950 -52771 -90679 -67596 -44013 -41406 -53438 -53276 -25506 -23696 -43774 -81999
13831 -81999 -100045 -66123 -42145 -38964 -34296 -32378 -35586 -30050 17156 16914 4542 -8119 -32767
13818 -32767 -23027 -17752 -11883 11309 19007 13370 6472 -5406 -37764 -58859 -77361 -75267 -58364
13805 -58364 -27362 -19575 -21223 7832 4276 23303 24860 15117 15662 -9262 -476 5151 -8618
13792 -8618 -23423 -49675 -70114 -70724 -71895 -59257 -64323 -59307 -39387 -23954 -27415 -40692 -32361
13779c2361L4045m698l4037J184K5756k1037J6076J8996O609J404j1071j8696
13767a7830j27J4443K1950J6382J1101j4440m484m241j0127M135m721N827R48
13754A8816j2131m163J6424J7674P117j5670k4913k3902K6226n713j484o679j5888
13741b4286P8j759K5499K6105J2656j7406O992j6602N367k348q538l2126M869
13728b1499k713M432J9471J0878Q33j3247J9016J1163m8219j5425J4754J5312
13716e244J7510N5227O58k8594m3652k2285j0470L0685L5386K2951j5960j9263
13704A6949j5591L8897k753r152J7184m805k785q756o057l4971l28Q775K4724
13691B1331j3533k2634l273j0124m2835L1579L8294j9102K3918L4437j0914k5038
$$ plain form
13779 -32361 1684 -3014 -37051 -35867 -10111 -31148 -15072 3924 10533 11937 866 -17830
13767 -17830 -17957 -3514 18436 34818 45919 31479 26995 22754 12627 16762 12041 17868 18816
13754 18816 6685 2522 18946 36620 43737 28067 3154 -20748 5478 -235 -1719 -8398 -24286
13741 -24286 -24208 -25967 -468 25637 38293 20887 27879 11277 16644 14296 5758 -26368 -21499
13728 -21499 -24212 -19780 -309 10569 11402 -1845 17171 28334 -19885 -35310 -20556 -5244
13716 -5244 12266 67493 68151 39557 -4095 -26380 -36850 -6165 29221 52172 36212 16949
13704 16949 1358 40255 37502 28350 45534 40729 37944 29188 23131 -11840 -12168 -3393 21331
13691 21331 7798 -14836 -18109 -28233 -71068 -39489 -1195 -20297 3621 38058 27144 2106
13679B106K839j6618j1917R427J2676q097q440p382r6j8834J7904l558p938K823
13665c5105o698k0350l034J2299K0702J1984P354r997n036K4176k7n55k3347j0185
13651c7819J3087O360J7298r521O125n931k378j8744M758J1042o512P209L719
13638a1307O475J6301J2116k6426j3432k076K645J1265j6481L188M9813J4955
13626D7036l6036k5824j8978k4842O486j7212R145L7147L422M166O29J0961q445
13613a2345n531J7583J8858o690q314j1367j7327R655L4577k0514p486J113N419
13600b369K0745m018K866k169j2683j3447n568J771j2188p368j944K7596r99j1120
13586b0895r355J9304J3292l936o106O702n008l5070J3208L4901l72j4717j3833
$$ plain form
13679 2106 4945 -11673 -23590 -14163 -1487 -9584 -18024 -25406 -25502 -44336 -26432 -29990 -37928 -35105
13665 -35105 -41803 -62153 -65187 -52888 -32186 -20202 -12848 -22845 -27881 -3705 -3732 -4287 -27634 -37819
13651 -37819 -24732 -18372 -1074 -10595 -4470 -10401 -12779 -31523 -26765 -15723 -22235 -15026 -11307
13638 -11307 -4832 11469 23585 -2841 -16273 -18349 -15704 -4439 -20920 -17732 32081 47036
13626 47036 11000 -14824 -33802 -58644 -52158 -69370 -60225 -23078 -19656 -15490 -14861 -3900 -12345
13613 -12345 -17876 -293 18565 11875 3561 -7806 -25133 -15478 19099 -1415 -8901 -7788 -2369
13600 -2369 18376 14358 17224 15055 2372 -11075 -16643 -14872 -27060 -34428 -36372 -8776 -9775 -20895
13586 -20895 -30250 -10946 2346 -1590 -7696 -994 -6002 -41072 -27864 7037 6665 -8052 -21885
13573b1885L659J2521J7183k5300L526J3008m361N621k4162j1002n569j999O358
13560c2402O873J832K4023o127J4556J9462j5634n629n171o93l244J494K0091
13547A9431k938J147J9559j3964j9834o714K765J1110j56r751j393J7713J8642
13534C5617o227j2489k1220j5368J4994J5604M626k5217k2213l1566J8920K7667
13522a6872q227p619L637L842K8409J0521k98K754R061k2717j4387J0629l9097
13509d0364q467J4345O270K8081l51l157L0119K9307j6887k1047O31J2615l681
13496B7414p398j7498J5180n901l1904L529L035J2179K3642j3262q192l389L0580
13483B8015M0152J174l1721m3421n029L0023L1297J6253r705l4509m760k5076
$$ plain form
13573 -21885 -18226 -5705 11478 -13822 -10296 2712 -1649 3972 -20190 -31192 -36761 -38760 -32402
13560 -32402 -25529 -23697 326 -5801 8755 28217 12583 6954 1783 1090 -2154 -660 19431
13547 19431 16493 17640 37199 23235 3401 -3313 -548 10562 10406 655 -738 16975 35617
13534 35617 29390 16901 -4319 -19687 -4693 10911 15537 -9680 -31893 -63459 -44539 -16872
13522 -16872 -25099 -32718 -29081 -25239 3170 13691 13393 16147 25208 2491 -11896 -1267 -40364
13509 -40364 -48831 -34486 -28216 -135 -486 -3643 26476 55783 38896 17849 18480 31095 27414
13496 27414 20016 2518 17698 11797 -20107 -16578 -13543 -1364 22278 9016 824 -2565 28015
13483 28015 68167 69341 37620 -5801 -10830 19193 50490 66743 57038 22529 17769 -7307
13471g307k6512K718K7997J6350j3904q670L4195K0585m3341j4223K2376m731
13459E533m0694K1085q668l778Q337J2456J2699j110J0068j2449j9321J0524j922
13446g240N14J0623K9500J5677k7055l1080l9291J1849K9685Q906k1222k4451
13434d3585N048j7416J6875J2178j3003J1944K7877J5615K488J3243p261l837
13422B0166K4256j4941J215p36K846m314k7823m622j5335J4647Q711l6188m112
13409c6230L6822K8790j2795j7990R58k4436J599n403j2967p20Q978J8629k069
13396a6834k2686j0667N182K1795J7114K1904j7291j2232p517P112j7494k494
13384c4108K3055P054J748J6631K0047J2113M460k5073k0986j2530q665O61R144
$$ plain form
13471 -7307 -33819 -31101 -3104 13246 -658 -9328 24867 45452 2111 -12112 10264 5533
13459 5533 -35161 -14076 -22744 -26522 -18185 -5729 6970 5860 15928 3479 -15842 -5318 -7240
13446 -7240 -6726 3897 33397 49074 22019 -9061 -48352 -36503 -6818 2088 -19134 -43585
13434 -43585 -38537 -55953 -39078 -26900 -39903 -27959 -82 15533 18021 31264 24003 20166
13422 20166 44422 29481 30696 29960 32806 28492 669 -3953 -19288 -4641 4070 -32118 -36230
13409 -36230 592 29382 16587 -1403 -445 -24881 -23282 -28685 -41652 -42372 -33394 -14765 -16834
13396 -16834 -39520 -50187 -45005 -23210 -6096 15808 -1483 -13715 -21232 -14120 -31614 -34108
13384 -34108 -11053 -3999 -2251 14380 34427 46540 51000 25927 4941 -7589 -16254 -15593 -6449
13371f449j1845N160K4134r772J3070j6912O905M56k3933J369J2976n830L869
13358f802L537k0707k0367J092N326K4338K6929J9732n164j823J5166J9253K833
13345F3343m2270M893P186j7986k8748j3409K7077k366k6958n79L840J759n936
13332c0154J2525K1615L552l8240K035J7636j0676P315K2899r562k4092j9601
13320d4748P462j7372O810Q096O177m358M3494L0341j7264k804K15j0372o236
13307e59j6393K6969O597K05p61J9788l197N202k9528k6940k439l586L655J7031
13293c956j2437J0370L1989K607q371j674r153N297P181j4688q056K8603J6369
13280D4081k1470j8823m0844j8439R057k1648J7699L0953J6394j2247j7659k3375
$$ plain form
13371 -6449 -18294 -13134 11000 1228 14298 -2614 4291 4747 -19186 -17817 -4841 -10671 -6802
13358 -6802 -3265 -23972 -44339 -43247 -37921 -13583 13346 33078 27914 26091 41257 60510 63343
13345 63343 21073 25966 33152 15166 -13582 -26991 86 -2280 -29238 -29817 -25977 -24218 -30154
13332 -30154 -17629 3986 7538 -30702 -28667 -11031 -21707 -14392 8507 -1055 -25147 -44748
13320 -44748 -37286 -54658 -47848 -39752 -33575 -37933 5561 35902 18638 15834 16049 5677 -559
13307 -559 -16952 10017 16614 16819 16058 35846 32649 37851 8323 -18617 -21056 -24642 -20987 -3956
13293 -3956 -16393 -6023 25966 28573 20202 18528 9375 14672 21853 7165 -891 27712 44081
13280 44081 22611 3788 -37056 -55495 -46438 -68086 -50387 -19434 -3040 -15287 -32946 -56321
13268e6321j7887J2123J8098K542J1244M0919J21j1998P183k096m1642M771K2988
13255i955N161O633m158j8832j9230Q21L7116K1736O585R530l9178l7882J4574
13242b7079J3099j55K675K1039r70j1556J6277L6832J4074p254j5646l0342j1527
13229e33j6982k1302L877J2278J7588m307j2363j4344l439J9585Q573k4568k7186
13216f3123L552M4446m455O323K8964q453l115M0611r855o796j2512j1866J0287
13203A4008l024O916K6927m154j0774k3672J3681P768o861q582J1731n401j563
13190A7000k640j4173j334Q119q98r296j8559n583L2531J339j2098j7104n384
13177b8080L467l238j0413n217J5748J2278n330N032J9632j3800k7566m870k7538
$$ plain form
13268 -56321 -74208 -62085 -43987 -41445 -30201 10718 10839 -1159 6024 3928 -37714 -32943 -9955
13255 -9955 -4794 1839 -2319 -21151 -40381 -39560 -2444 19292 25877 35407 -3771 -41653 -27079
13242 -27079 -13980 -14135 -11460 9579 8609 -2947 13330 50162 64236 56982 41336 10994 -533
13229 -533 -17515 -38817 -34940 -22662 -5074 -9381 -21744 -36088 -39527 -19942 -11369 -35937 -63123
13216 -63123 -59571 -15125 -19580 -13257 15707 7254 4139 44750 34895 28099 15587 3721 14008
13203 14008 10984 17900 44827 40673 29899 6227 19908 27676 20815 12233 23964 18563 17000
13190 17000 14360 187 -1147 6972 6074 -3222 -21781 -27364 5167 6506 -5592 -22696 -28080
13177 -28080 -24613 -27851 -38264 -43481 -27733 -15455 -20785 -15753 3879 -9921 -37487 -42357 -69895
13164f9895L8212J7482j9634k721L2697p778j8881K1221j5876j6440K2837K2397
13152C621K6301j5822M195j7165j2492o274k8743j0501J1974K752N925m146k3598
13139f3973Q71j0534J9102Q587m64K5766K7074L114l724L4074L0880k3594j8300
13126B8879j5230l062P914k7048k5423o490j1445M075K8173K6049J0799P2o396
13113A0867P841P54J0482n176j8130l855J5897j681J8914k0735j3615J3863J5773
13100C1199J8987j2255j7352j306P454j1855R442k7397j7744L1457K71p846R985
13087A3040J8188p591k3604m1773o00N33J7019m943o669l528K499J8604L213K8783
13073A3171Q473o436K0189q223j2490J0515k3844k1364K6155J0421J9297L8428
$$ plain form
13164 -69895 -31683 -14201 -33835 -36556 -3859 -11637 -30518 -9297 -25173 -41613 -18776 3621
13152 3621 29922 14100 18295 1130 -11362 -17636 -46379 -56880 -44906 -42154 -36229 -40375 -63973
13139 -63973 -63102 -73636 -54534 -45947 -46411 -20645 6429 9543 5819 39893 70773 47179 28879
13126 28879 13649 10587 18501 -8547 -33970 -40460 -51905 -47830 -19657 6392 17191 17263 10867
13113 10867 18708 19462 29944 24768 6638 2783 18680 16999 35913 15178 1563 15426 31199
13100 31199 50186 37931 20579 19273 26727 14872 24314 -3083 -20827 10630 10901 3055 13040
13087 13040 31228 23637 33 -41740 -42340 -41807 -24788 -29731 -36400 -39928 -37429 -18825 -15612 13171
13073 13171 21644 15208 35397 27174 14684 25199 1355 -20009 6146 16567 35864 74292
13061G4292P701l8778j5366k6409l084J2250j4420k6036j505K0920j055J416j3539
13048b3613O203M1960J4338k4647m6570k6295K94Q732L3919K0892P455O644j2839
13035F473O074K082M6892M7630j8580l8998n882l1499k9567M22J2194j3084J7142
13022A299P575j5180k2761o282M325Q398p84p25m057K5097k1594k0127L0909k004
13008a5911J3093j0813k6857N756k089R866L066j1343n970J2432K7577J1833q424
12995B216l5041k7063O746J6495J4488q282k31K5401j2460J1709K762j5819j4107
12982c3186K8203P914J297k896j0392q03j2589L3628L1890q484l5144k8660J3303
12969a5919L2450K8021J0737j9925n470k2541k7124J9566J7981M484j0427j3241
$$ plain form
13061 74292 81993 43215 27849 1440 -1644 10606 -3814 -29850 -31355 -10435 -11490 -10074 -23613
13048 -23613 -17410 24550 38888 14241 -32329 -58624 -58330 -49598 -15679 5213 12668 19312 6473
13035 6473 12547 14629 61521 109151 90571 51573 45691 14192 -15375 -14953 -2759 -15843 1299
13022 1299 8874 -6306 -29067 -35349 -31024 -22626 -23410 -24135 -28192 -3095 -24689 -44816 -13907 -15911
13008 -15911 -2818 -13631 -40488 -34732 -36821 -26955 -23889 -35232 -41202 -28770 -1193 10640 2216
12995 2216 -32825 -59888 -53142 -36647 -22159 -30441 -30672 -5271 -17731 -6022 -3260 -19079 -33186
12982 -33186 -4983 2931 4228 1332 -9060 -9863 -22452 11176 43066 34582 -562 -29222 -15919
12969 -15919 16531 44552 55289 35364 29894 7353 -19771 -205 17776 22260 11833 -1408
12957a408J5885r616j2219K4013k4514n278m040J6358j0621l5669K9381R780m551
12944a2499K000r707O294Q717J527Q764L2297q347j2573k5559j3193j8517J4250
12931b6546K7887q087r075J1702J2576m877K3677O028j9063k7231J3718j4943
12919a4234K1857J753l1223o571Q253J2389j6188K5549J5702j5923J630K0541
12907B3535K0467j7108j662n327l5565k6147m072J6098m650N956K2753j6365J0101
12894a1986M556n906j6274r063M267K9420L5728j7233k3395k669k0408K858K9821
12881b84j5859r360j3557k1607J4957N0640J3986J5620o525k2592j6941K4681
12869A3159R124k570r191p077J0834J3757Q830j2423k2894J966r968q630j8151
$$ plain form
12957 -1408 14477 4861 -7358 16655 -7859 -13137 -17177 -819 -11440 -47109 -17728 -7948 -12499
12944 -12499 -10499 -20206 -13912 -5195 -3668 5096 37393 29046 16473 -9086 -22279 -40796 -26546
12931 -26546 1341 -6746 -15821 -4119 8457 3580 27257 33285 14222 -13009 709 -14234
12919 -14234 7623 9376 -21847 -28418 -20165 -7776 -23964 1585 17287 1364 2994 23535
12907 23535 44002 26894 25232 19905 -15660 -41807 -45879 -29781 -34431 -28475 -5722 -22087 -11986
12894 -11986 -7430 -13336 -29610 -38673 -34406 -4986 30742 13509 -9886 -12555 -32963 -30105 -284
12881 -284 -16143 -25503 -39060 -60667 -45710 4930 18916 34536 28011 5419 -11522 13159
12869 13159 22283 19713 10522 3445 14279 28036 36866 24443 1549 3515 -6453 -15083 -33234
12856c3234k1091J2138M994J4259j1069j5315j8894L2539K3877P807j9186K9154
12844E979N3018J4207l9971j4746k3916J1782J2873J6570k8801j2411q441j6805
12832c0662J669K3193K6095J515j5711K451l4096j3571N954K2288J8153k2336
12820a5058j2952Q52K6525J1661r843K1051p354q057r164j003M677J9592K086
12807B3013j7601q794m210K503J7501l5663J245L4761J5298k894m294K5j5552
12794E338p786r145k4722k8031J3382K2987J7515K8709J5936j5921j028J7118
12782C4352K1478J0346J4807L586j4396k7059m218m193j4756L008q533k5048K2204
12769A1578L2718k5093k2069O767J3694p625M097J7171P726M330j7850k0958r279
$$ plain form
12856 -33234 -54325 -42187 -37193 -22934 -34003 -49318 -68212 -35673 -11796 -3989 -23175 5979
12844 5979 58997 73204 33233 18487 -5429 6353 19226 35796 6995 -5416 -13857 -30662
12832 -30662 -28993 -5800 20295 21810 6099 8550 -25546 -39117 -33163 -10875 7278 -15058
12820 -15058 -28010 -27158 -633 11028 1185 22236 14882 6825 -2339 -3342 1335 20927 23013
12807 23013 5412 -3382 -7592 -5089 12412 -23251 -22006 12755 28053 25159 20865 20890 5338
12794 5338 -2448 -11593 -36315 -64346 -50964 -27977 -10462 18247 34183 18262 17234 34352
12782 34352 55830 66176 80983 84569 70173 43114 38896 34703 19947 22955 14422 -10626 11578
12769 11578 44296 19203 -2866 3901 17595 9970 14067 31238 38964 43294 25444 4486 -4793
12756d793J7989Q763L3227J5216j3635l1849q620Q925K9968k6675J929P987k2563
12743A5869j3848m282k1231o958J7101p749j1392p871L664K6474k2003J4085q588
12730b6729l3801K8114J9655P756j655k279J8588J2260j3171m0792J2222M2812
12718B2980l1049K2730L210k2289k1142k6595O273J7773j1211o663R127L1487
12706e369K0237k8460L2031j6l181J0499o84J4264k740j0534K3970K1458K3352
12693I4827l4538l9427r477j35p510j3458P092p913l033J934J5849j0300k0602
12680b6691k952J0842J1873K444k020Q769J6044K7653j9889j292m533r548K7927
12667C8627n017L1675l7844m7286l246J426o314J1479j170K1638k1587J1896K234
$$ plain form
12756 -4793 13196 21959 55186 70402 56767 24918 16298 25223 55191 28516 30445 38432 15869
12743 15869 2021 -2261 -23492 -30450 -13349 -21098 -32490 -40361 -36697 -10223 -32226 -18141 -26729
12730 -26729 -60530 -32416 -12761 -5005 -6660 -8939 9649 21909 8738 -32054 -19832 22980
12718 22980 -8069 14661 17871 -4418 -25560 -52155 -45882 -28109 -39320 -45983 -36856 -5369
12706 -5369 14868 -13592 18439 18423 15242 25741 25057 39321 36581 26047 50017 71475 94827
12693 94827 60289 20862 11385 11250 3740 -9718 -2626 -10539 -13572 -11638 4211 -6089 -26691
12680 -26691 -29643 -18801 -6928 -4484 -6504 2265 18309 45962 26073 24781 20248 10700 38627
12667 38627 33610 65285 27441 -19845 -23091 -21665 -27979 -16500 -17670 3968 -17619 -5723 -3489
12654c489J0929ON660K811O306P425K0921j736J5445k9049k2882m977l0244J967
12640b0907l40J2822O475K2964J3367M073j0974l5028j7126k5933j2404K1355
12628d1656L6989K6953N012j1748N638K0340R775j8069k5424k6008J8878N278
12616E958K1081k02J0054o598J891k0804L505K5547J4310J172O876J2582k3764
12603E1608k2787j012L7274Q623j1568m006j1282l3755m711q165J415j7113r064
12590b4543K832L458l355J3898P072K25n399J2310j2057r742N287J7029j9916
12577a2901k8089m305K6465J8378K5160l1412j7305k2745o086R327J5508K219
12565b5786p580J7246M572J6134R786o5l5100k1881R677m737L591L2072r590n834
$$ plain form
12654 -3489 7440 7446 13106 15917 22223 29648 50569 48833 64278 35229 12347 7370 -22874 -20907
12640 -20907 -21247 -8425 -1950 21014 34381 38454 27480 -7548 -24674 -50607 -63011 -41656
12628 -41656 -4667 22286 27298 15550 21188 41528 51303 33234 7810 -18198 680 5958
12616 5958 27039 26837 36891 30293 32184 11380 14885 40432 54742 55914 62790 75372 51608
12603 51608 28821 27809 65083 73706 62138 58132 46850 13095 8384 219 1634 -15479 -24543
12590 -24543 -21711 -18253 -21608 -7710 -638 -413 -5812 6498 -5559 -15301 -10014 7015 -12901
12577 -12901 -40990 -45295 -18830 -452 24708 -6704 -24009 -46754 -52840 -43513 -28005 -25786
12565 -25786 -33366 -16120 -11548 4586 14372 14307 -20793 -42674 -32997 -37734 -34143 -2071 -11661 -17495
12551a7495Q002q456J6750p647N595n28m997L881k929n705l69j593k7803j9205
12537f2499K3626K8656K2536L2285l1074m2735n345K4290j1496k0603M5963K1930
12525B5534j2620j1420j8728O373p38Q265J3172m972J475j9412O581J827r591
12512a4254j6583l250L3621N453j1075n414j535J4097M0860k3636j3853m846q993
12499i408L5167O206j0894j1494j6881J0159L1376J0640k701J635p94k983j1321
12486B8707j6940k9220k6146K9098k624R051K5099k7014n545N2582j0412k148
12474B4488j3783m516n850Q407q594Q72k0039L4502l714K394Q74O574j6232m545
12460H38q003l566K5530J5808J1938n826l6500L465J9438k9908j9224o93M2118
$$ plain form
12551 -17495 -9493 -17949 -1199 -8846 -3251 -3779 -8776 -4895 -7824 -13529 -13898 -15491 -43294 -62499
12537 -62499 -38873 -10217 12319 44604 13530 -29205 -34550 -10260 -21756 -42359 3604 25534
12525 25534 12914 1494 -17234 -10861 -11599 -3334 9838 4866 6341 -13071 -6490 -4663 -14254
12512 -14254 -30837 -34087 -466 4987 -6088 -11502 -13037 1060 41920 18284 4431 -415 -9408
12499 -9408 25759 31965 21071 9577 -7304 2855 34231 44871 42170 43805 43011 40028 28707
12486 28707 11767 -17453 -43599 -14501 -17125 -8074 17025 -9989 -15534 37048 26636 24488
12474 24488 10705 6189 339 8746 152 1024 -19015 15487 11773 14167 15041 21615 5383 838
12460 838 -7165 -10731 14799 30607 42545 36719 219 3684 23122 -6786 -26010 -26703 15415
12447A5415J3909k9404r706N998j2254J7829P289K5817K5825J0269j2318r818
12435D8851l2684j4724o395k5434J1124J2155J147l580q59p816K147J9188K6498
12422B9618k1251p755k2216j232j1247j3187J8765K1175Q663j9041J1200K0231
12410A3723P846o589N3l5622q811P744K4249k1901k1188Q819m450J1946L6663
12397A2482J4997J5502l3362l4307k303J2699J1368J2905J156K287q450n29m617
12384a72Q7R313J0694l211J8376J5905k1112n0582j4295K6917K7128N328L4067
12371E8443j5509l1819k5443k3869P546k503J5237k7976J664K0420p543J4593
12359a6759Q802J2085k7027J2422K6679o365r423j1954j6487K1182K7152L218
$$ plain form
12447 15415 29324 -80 -9786 -3788 -16042 1787 9076 34893 60718 70987 58669 48851
12435 48851 16167 1443 -4952 -30386 -19262 -7107 -5960 -9540 -10399 -18215 -16068 3120 29618
12422 29618 8367 612 -21604 -22836 -34083 -47270 -28505 -7330 1333 -17708 -6508 13723
12410 13723 21569 14980 15033 -20589 -29400 -21656 2593 -19308 -40496 -31677 -36127 -24181 12482
12397 12482 27479 42981 9619 -24688 -26991 -14292 -2924 9981 11137 13424 4974 4445 -172
12384 -172 -85 9228 19922 16711 35087 50992 29880 -20702 -34997 -8080 19048 24376 58443
12371 58443 42934 11115 -14328 -38197 -30651 -33154 -17917 -45893 -44229 -23809 -31352 -16759
12359 -16759 -7957 4128 -22899 -10477 16202 9837 414 -11540 -28027 -6845 20307 23525
12347B3525j2658k9582P081o418P140L029k9392L8537P324O471k3595l570K2926
12334A0818m237k252k9059j4967M2291K4787J3277m3100j8384J3633r53K252M605
12321a289n0808j4388K0086j7740O982K0201R317K5244K2816n049k0963p043K5623
12308A2989q962m2584j783L0853J0230M7846M493n279J680k4388J1777J536m512
12295C3896J7067Q784l744j3288R441j6395j7360j0909N761n208k4010l95R372
12282f988j589K0185m975K6091J1798n748J6793J9653R390l7687l7000o802K7402
12269C0523j0418j9145K8697k2041k1349N859l012Q846K3433N490l8476l2606
12257d4199J2303k544m944N691p297j4743j6501J5928M3177M7692j8226k4930
$$ plain form
12347 23525 10867 -18715 -11634 -18052 -10912 -7883 -37275 1262 8586 15057 -8538 -12108 10818
12334 10818 6581 4329 -24730 -39697 2594 27381 40658 -2442 -20826 -7193 -8146 -5894 -1289
12321 -1289 -52097 -66485 -46399 -64139 -57157 -36956 -27639 -2395 20421 15372 -5591 -12634 12989
12308 12989 4027 -38557 -40340 -9487 743 48589 53082 47803 49483 25095 36872 38408 33896
12295 33896 50963 59747 56003 42715 52156 35761 18401 7492 13253 8045 -15965 -16360 -6988
12282 -6988 -8577 11608 6633 32724 44522 38774 55567 75220 84610 46923 9923 3121 30523
12269 30523 20105 960 29657 7616 -13733 -7874 -10886 -2040 21393 26883 -11593 -44199
12257 -44199 -31896 -34440 -39384 -33693 -40990 -55733 -72234 -56306 -13129 34563 16337 -8593
12245h593o397J989j2545J8094j7819M425k720J1896j0405K0973K0714O504J869
12232B7985j8995P712N951N140m711K548k3848k4840j7630J5882K3548L1502J926
12219C2170k6129k9205j5672M701J0761K4007K1684r60j7937j0629P983Q724j4580
12206e082j0308J6141K0751n200J166K5980P112k3490j8715j5905P270J080j1887
12193a1087m268K0439j2383P488O266j4354r516j7295J3542K9699K0917J6765
12181D6213L8367j4505o717K448J732k2815k3682k2507L971j1823j1479R607J2080
12168H90Q63P326N821k6k3827p849J0267J4580l7311j7413Q951J2858K8436K6076
12154B9642o699l1744j3773J3036k5589O749K9069j2650m5358k3035N1391N2617
$$ plain form
12245 -8593 -14990 -13001 -25546 -7452 -25271 -20846 -23566 -11670 -22075 -1102 19612 26116 27985
12232 27985 8990 16702 22653 27793 23082 25630 1782 -23058 -40688 -24806 -1258 30244 32170
12219 32170 6041 -23164 -38836 -34135 -23374 633 22317 21357 3420 -7209 774 9498 -5082
12206 -5082 -15390 751 21502 16302 17468 43448 50560 27070 8355 -7550 -280 800 -11087
12193 -11087 -15355 5084 -7299 189 6455 -7899 -17415 -34710 -21168 8531 29448 46213
12181 46213 84580 70075 63358 65806 67538 44723 21041 -1466 2505 -9318 -20797 -11190 890
12168 890 1753 9079 14900 14874 -8953 -16802 -6535 8045 -29266 -46679 -37728 -24870 3566 29642
12154 29642 22943 -8801 -22574 -9538 -35127 -28378 691 -11959 -57317 -80352 -28961 23656
12142B3656J094j7762O87L7438J3139j994q636L1277p133k0069k3465l1828k4818
12129b8414R205K7864J01M597N166l039N792J587l8579N201M2587M072j5865n001
12115A5274m161J0828m347l7806Q128J2452j2506k286k011j5157Q829R204J4974
12102A415J0145R158p370K2946J7412J1638J6216K6679K3591O272J9705j3997
12090A43810m7164n7014j0040O273o951R405K10R9J028j3670j9636k3787o647
12077b4084K1581K4124p108j2803o754j7811J423j188l902j4698K4831K457j9877
12064c3809K2494r289n904K1422q569J986P627j5380J5624K5601J6081k512k5399
12051I973K4272K7255k490o092k8661m0468j59K9941j3884l031L346j1183J0612
$$ plain form
12142 23656 24750 6988 7675 45113 58252 56258 47622 78899 71766 51697 28232 -3596 -28414
12129 -28414 -19209 8655 8756 13353 18519 15480 21272 22859 -15720 -10519 32068 36140 20275 15274
12115 15274 11113 21941 17594 -20212 -12084 368 -12138 -14424 -16435 -31592 -22763 -13559 1415
12102 1415 11560 20718 13348 36294 53706 65344 81560 108239 131830 138102 157807 143810
12090 143810 96646 39632 29592 35865 28914 38319 38529 38628 39656 25986 6350 -17437 -24084
12077 -24084 -2503 21621 14513 1710 -5044 -22855 -21432 -22620 -26522 -41220 -16389 -13932 -33809
12064 -33809 -11315 -20604 -26508 -5086 -13655 -11669 -4042 -19422 -3798 21803 37884 35372 9973
12051 9973 34245 61500 59010 52918 24257 -16211 -16370 13571 -313 -3344 2 -11181 -569
12038e69J0034n20p513k747P463K9815k0696j1843J5915l2p395N854m57j2149
12024E160l7559J2601L0662j0483q432O588j2644l5840j0583J0725J6845K7033
12012e927j611k4306j9332J0526j0181J31L986p858P887K8069K8922r199q059
11999f952q130l973j0217K1280j5287q484M0759K4331j8607l007J0313l7797j4080
11986b9851K0431L228l0204j3106J8468K5856k0834j577Q759K8065J0797J9543
11974C9575k2898k4187j3644r896j1503J2604K4727M853k8863r168R728l220Q273
11961b3619J7356m005L1196o766l583N661q909j0668k0114l118j1952j32L376
11948c5277K2980QQ170J0952O641m329j5597K5788j5134k443J0689M860j0027
$$ plain form
12038 -569 9465 8945 1432 -1315 6148 35963 15267 3424 19339 19307 11912 17766 17309 5160
12024 5160 -32399 -19798 10864 381 -8051 -1463 -14107 -49947 -60530 -49805 -32960 -5927
12012 -5927 -7538 -31844 -51176 -40650 -50831 -50700 -46714 -54572 -46685 -18616 10306 1107 -6952
11999 -6952 -15082 -19055 -29272 -7992 -23279 -31763 8996 33327 14720 11713 22026 -15771 -29851
11986 -29851 -9420 -6192 -36396 -49502 -31034 -5178 -26012 -27589 -18830 9235 20032 39575
11974 39575 16677 -7510 -21154 -31050 -42553 -29949 -5222 -369 -29232 -38400 -28672 -31892 -23619
11961 -23619 -6263 -10268 20928 14162 10579 16240 7331 -3337 -23451 -26569 -38521 -38653 -35277
11948 -35277 -12297 -12289 -4119 6833 13474 9145 -6452 19336 4202 1759 12448 17308 7281
11935G281j4453j1750j8459k3168p456K3710O3216n922k880R08j2043j1690J8174
11922E468K9275q566J3513l968k6533j2177k85j5809J522J997J271L4235K7678
11909D7621m716l7632n323Q349K1124r715k2877k7707J6504l493j3231K8424R865
11896G193K365k7136K308K5710K236N612j989L383j4736K9015J562k6726j8337
11883i540J7005j996j681R401k475J9063M827k462J6709o86m981J5271j9035n5137
11869a5717j5877J2457l6087J437L6895J844K0828j3094P432J1894k2087K6716
11857A6641Q398J696k8839j9561J1915M923J5433j3120m851J1986L898j6462m884
11844a2827j3335l568n207K0918K5677O33n981O999k9818l1685q236K0370L7852
$$ plain form
11935 7281 -7172 -18922 -37381 -60549 -68005 -44295 18921 12999 10119 11027 -1016 -12706 5468
11922 5468 34743 26177 39690 35722 9189 -2988 -3273 -19082 -17560 -15563 -14292 19943 47621
11909 47621 42905 5273 -50 8299 29423 19708 -3169 -30876 -14372 -17865 -31096 -2672 7193
11896 7193 9558 -17578 -15270 10440 12676 18288 16299 19682 4946 33961 35523 8797 -9540
11883 -9540 7465 5469 3788 13189 10714 29777 34604 32142 48851 48165 43184 58455 39420 -15717
11869 -15717 -31594 -19137 -55224 -53787 -16892 -15048 5780 -7314 118 12012 -10075 16641
11857 16641 25039 26735 -2104 -21665 -9750 -4827 10606 -2514 -7365 4621 8519 -7943 -12827
11844 -12827 -26162 -29730 -34937 -14019 11658 12291 6310 13309 -16509 -48194 -56430 -36060 1792
11831A792M0941n386j2650K6603R648l6352N12L302k172n830p169j7234q174k740
11817a4909J7293J3517r72j3224O704K6359J3536n22k4758j2369j0408q998J3167
$$ plain form
11831 1792 42733 37347 24697 51300 60948 24596 25108 28410 26238 20408 13239 -3995 -12169 -14909
11817 -14909 2384 15901 14929 1705 8409 34768 48304 47782 23024 10655 247 -8751 4416
$$ [...]
##END NTUPLES=NMR SPECTRUM
##END=
