##TITLE=Analysis number 329258
Compound Code cc 62713
Book Reference 521/108
Project Code adrs
Chemist Name evam
##JCAMPDX= 6.0         $$ Bruker NMR JCAMP-DX V2.0
##DATA TYPE= NMR SPECTRUM
##DATA CLASS= NTUPLES
##ORIGIN= Bruker BioSpin GmbH
##OWNER= nmr
$$ XWIN-NMR		Version 3.5
$$ Tue Aug 14 13:15:47 2007 GMT Daylight Time (UT+1h)  MAYBRIDGE\nmr@NMR_250MHZ
##.OBSERVE FREQUENCY= 250.131544655141
##.OBSERVE NUCLEUS= ^1H
##.ACQUISITION MODE= SIMULTANEOUS (DQD)
##.ACQUISITION SCHEME= undefined
##.AVERAGES= 16
##.DIGITISER RES= 18
##SPECTROMETER/DATA SYSTEM= dpx250
##.PULSE SEQUENCE= zg30
##.SOLVENT NAME= CDCl3
##.SHIFT REFERENCE= (INTERNAL, CDCl3, 0, 16.4659)
##AUDIT TRAIL= $$ (NUMBER, WHEN, WHO, WHERE, WHAT)
$$ ##TITLE= Audit trail, XWIN-NMR		Version 3.5
$$ ##JCAMPDX= 5.01
$$ ##ORIGIN= Bruker BioSpin GmbH
$$ ##OWNER= nmr
$$ C:\u/data/dgb/nmr/ADRS/640/pdata/1/auditp.txt
$$ ##AUDIT TRAIL=  $$ (NUMBER, WHEN, WHO, WHERE, WHAT)
(   1,<2007-08-14 13:15:22.47 +100>,<MAYBRIDGE\nmr>,<NMR_250MHZ>,
      <created by zg, POWCHK disabled, PULCHK disabled
       configuration hash MD5:
       76 6E 9A 78 1E 09 19 81 EC 84 63 8F B0 6A 59 2D
       data hash MD5: 64K
       61 79 0C 02 90 83 48 EC 05 3F E5 D6 B9 12 54 56>)
(   2,<2007-08-14 13:15:37.16 +100>,<MAYBRIDGE\nmr>,<NMR_250MHZ>,
      <Start of raw data processing
       ef LB = 0.3 FT_mod = 6 PKNL = 1 SI = 32K 
       data hash MD5: 32K
       8D 0A 6A E8 90 32 6F D8 CB C9 DD AE FA 8D 60 F0>)
(   3,<2007-08-14 13:15:38.81 +100>,<MAYBRIDGE\nmr>,<NMR_250MHZ>,
      <apk 
       data hash MD5: 32K
       D8 F8 EC 03 42 54 80 CE CA 92 4C 56 B1 E1 9F 32>)
(   4,<2007-08-14 13:15:39.50 +100>,<MAYBRIDGE\nmr>,<NMR_250MHZ>,
      <abs ABSG = 5 
       data hash MD5: 32K
       64 5C D6 51 B8 F9 C6 AD F0 31 A5 2B 3D 55 81 60>)
$$ ##END=
$$ 
$$ hash MD5
$$ 97 16 A9 21 9F 3D 53 40 17 CA C1 B5 8E 80 B4 C4
##$RELAX= 
##$RELAX= 
##$RELAX= 
##$RELAX= 
##$RELAX= 
##$RELAX= 
##$RELAX= 
$$ Bruker specific parameters
$$ --------------------------
##$DU= <C:\u>
##$EXPNO= 640
##$NAME= <ADRS>
##$PROCNO= 1
##$TYPE= <nmr>
##$USER= <dgb>
##$AMP= (0..31)
100 100 100 100 100 100 100 100 100 100 100 100 100 100 100 100 100 100 
100 100 100 100 100 100 100 100 100 100 100 100 100 100 
##$AQSEQ= 0
##$AQ_mod= 3
##$AUNM= <au_zg>
##$AUTOPOS= <28 >
##$BF1= 250.13
##$BF2= 250.13
##$BF3= 250.13
##$BF4= 250.13
##$BF5= 500.13
##$BF6= 500.13
##$BF7= 500.13
##$BF8= 500.13
##$BYTORDA= 1
##$CFDGTYP= 0
##$CFRGTYP= 5
##$CHEMSTR= <none>
##$CNST= (0..31)
1 1 145 1 1 1 1 1 1 1 1 1 1 1 1 1 1 1 1 1 1 1 1 1 1 1 1 1 1 1 1 1 
##$CPDPRG= <>
##$CPDPRG1= <>
##$CPDPRG2= <>
##$CPDPRG3= <>
##$CPDPRG4= <mlev>
##$CPDPRG5= <mlev>
##$CPDPRG6= <mlev>
##$CPDPRG7= <mlev>
##$CPDPRG8= <mlev>
##$CPDPRGB= <>
##$CPDPRGT= <>
##$D= (0..31)
0 1 0 0 0 0 0 0 0 0.06 0 0 0 0 0 0 0.0002 0 0 0 0 0 0 0 0 0 0 0 0 0 0 
0 
##$DATE= 1187093721
##$DBL= (0..7)
120 120 120 120 120 120 120 120 
##$DBP= (0..7)
150 150 150 150 150 150 150 150 
##$DBP07= 0
##$DBPNAM0= <>
##$DBPNAM1= <>
$$ [...]
##$SUBNAM7= <"">
##$SUBNAM8= <"">
##$SUBNAM9= <"">
##$SW= 20.6930455092707
##$SWIBOX= (0..15)
0 0 3 0 0 0 0 0 0 0 0 0 0 0 0 0 
##$SW_h= 5175.983436853
##$TD= 65536
##$TD0= 1
##$TE= 297.16
##$TE2= 300
##$TE3= 300
##$TEG= 300
##$TL= (0..7)
0 120 120 120 120 120 120 120 
##$TP= (0..7)
150 150 150 150 150 150 150 150 
##$TP07= 0
##$TPNAME0= <>
##$TPNAME1= <>
##$TPNAME2= <>
##$TPNAME3= <>
##$TPNAME4= <>
##$TPNAME5= <>
##$TPNAME6= <>
##$TPNAME7= <>
##$TPOAL= (0..7)
0.5 0.5 0.5 0.5 0.5 0.5 0.5 0.5 
##$TPOFFS= (0..7)
0 0 0 0 0 0 0 0 
##$TUNHIN= 0
##$TUNHOUT= 0
##$TUNXOUT= 0
##$USERA1= <user>
##$USERA2= <user>
##$USERA3= <user>
##$USERA4= <user>
##$USERA5= <user>
##$V9= 5
##$VALIST= <valist>
##$VCLIST= <CCCCCCCCCCCCCCC>
##$VD= 0
##$VDLIST= <DDDDDDDDDDDDDDD>
##$VPLIST= <PPPPPPPPPPPPPPP>
##$VTLIST= <TTTTTTTTTTTTTTT>
##$WBST= 1024
##$WBSW= 4
##$XGAIN= (0..3)
0 0 0 0 
##$XL= 0
##$YL= 0
##$YMAX_a= 400176
##$YMIN_a= -573738
##$ZGOPTNS= <>
##$ZL1= 120
##$ZL2= 120
##$ZL3= 120
##$ZL4= 120
##$ABSF1= 16.46586
##$ABSF2= -4.227312
##$ABSG= 5
##$ABSL= 3
##$ALPHA= 0
##$AQORDER= 0
##$ASSFAC= 0
##$ASSFACI= 0
##$ASSFACX= 0
##$ASSWID= 0
##$AUNMP= <proc_1d>
##$AZFE= 0.1
##$AZFW= 0.1
##$BCFW= 0
##$BC_mod= 0
##$BYTORDP= 0
##$COROFFS= 0
##$CY= 12.5
##$DATMOD= 1
##$DC= 0
##$DFILT= <>
##$DTYPP= 0
##$F1P= 14.0000005364418
##$F2P= -0.99999901652339
##$FCOR= 0.5
##$FTSIZE= 32768
##$FT_mod= 6
##$GAMMA= 0
##$GB= 0
##$INTBC= 1
##$INTSCL= 1
##$ISEN= 128
##$LB= 0.3
##$LEV0= 0
##$LPBIN= 0
##$MAXI= 10000
##$MC2= 0
##$MEAN= 0
##$ME_mod= 0
##$MI= 0
##$NCOEF= 0
##$NC_proc= -3
##$NLEV= 6
##$NOISF1= 0
##$NOISF2= 0
##$NSP= 0
##$NTH_PI= 0
##$NZP= 0
##$OFFSET= 16.46586
##$PC= 1
##$PHC0= 161.2307
##$PHC1= 4.996754
##$PH_mod= 1
##$PKNL= yes
##$PPARMOD= 0
##$PSCAL= 4
##$PSIGN= 0
##$REVERSE= no
##$SF= 250.130014041377
##$SI= 32768
##$SIGF1= 0
##$SIGF2= 0
##$SINO= 400
##$SIOLD= 32768
##$SREGLST= <1H.CDCl3>
##$SSB= 0
##$STSI= 32768
##$STSR= 0
##$SW_p= 5175.98343685301
##$SYMM= 0
##$S_DEV= 0
##$TDeff= 65536
##$TDoff= 0
##$TI= <Analysis number 999999
Compound Code 99
Book Reference 9
Project Code 9>
##$TILT= no
##$TM1= 0
##$TM2= 0
##$TOPLEV= 0
##$USERP1= <user>
##$USERP2= <user>
##$USERP3= <user>
##$USERP4= <user>
##$USERP5= <user>
##$WDW= 1
##$XDIM= 32768
##$YMAX_p= 384848484
##$YMIN_p= -34989
$$ End of Bruker specific parameters
$$ ---------------------------------
##NTUPLES= NMR SPECTRUM
##VAR_NAME=  FREQUENCY,     SPECTRUM/REAL,   SPECTRUM/IMAG
##SYMBOL=    X,             R,               I
##VAR_TYPE=  INDEPENDENT,   DEPENDENT,       DEPENDENT
##VAR_FORM=  AFFN,          ASDF,            ASDF
##VAR_DIM=   32768,         32768,           32768
##UNITS=     HZ,            ARBITRARY UNITS, ARBITRARY UNITS
##FACTOR=    0.157963299565203, 1,           1
##FIRST=     4118.60588475636, 0,            0
##LAST=      -1057.37755209665, 0,           0
##MIN=       -1057.37755209665, -34989,      0
##MAX=       4118.60588475636, 384848484,    0
$$ Real data points
##PAGE= N=1
##DATA TABLE= (X++(R..R)), XYDATA
$$ [...]
16921A1926o183p509j2332M741N809J0992J2720j651j5056j1307k18J3852J817
16908G601q358p731m480M236N071K95n040J473Q056M044n228K067J0738J60k804
16893A0100j976q129l217l015K267J442K007M586m866l830N43O855P061P930J2735
16878C0493n277j4926q274l696J798R509n802j003J0695o836o495m457n229q030
16864a7530O434O531K128j587k309O390L775k46Q395N713q386l167L543P76l466
16849F994r12N11k748j736o424j2060k153q328j018K188n181J5727R108N887j826
16834a971r624j388P467k854O441J1999m743k873o72K391m570j718L646k906M162
16819B787L884K91o629l677K58m34K9N582o200R834M477k764o53J884m543k979
$$ plain form
16921 11926 5743 -1766 -14098 -9357 -3548 7444 20164 18513 3457 -7850 -8068 5784 7601
16908 7601 -757 -8488 -12968 -8732 -3661 -3366 -8406 -6933 1123 5167 -61 2006 12744 12904 10100
16893 10100 8124 -5 -3222 -6237 -3970 -2528 -521 4065 -801 -4631 -4088 2767 9828 17758 30493
16878 30493 25216 10290 2016 -1680 118 9627 3825 2822 13517 6681 186 -4271 -9500 -17530
16864 -17530 -11096 -4565 -2437 -4024 -6333 57 3832 3586 11981 17694 9308 6141 9684 10460 6994
16849 6994 6082 6593 3845 2109 -4315 -16375 -18528 -26856 -27874 -25686 -30867 -15140 -6032 -145 -1971
16834 -1971 -11595 -12983 -5516 -8370 -1929 10070 5327 2454 1782 4173 -397 -2115 1531 -1375 2787
16819 2787 6671 6962 333 -3344 -3086 -3520 -3491 2091 -4109 5725 10202 7438 6785 8669 4126 1147
16803A147N316j2119m525n03k219P540J3415K987M716n578n351q762k142K459
16789c619j1357l293N351J241k968J1111R140n290K227K18M300q183K184J453
16775B515k891j907M902j73J584k382j332o561k885J935J0266L791k050j005L398
16760G205M303l327m008O489N586jm870n610l630J039r824q069J0469O603N8n398
16744b985j3341k028J0696M757R96n98j467J084K617Q486j213j3330J305L494
16730a527R46n039M005P443L544j293n166m21j762r514l287N055l27j453k297
16715a1093j967R045M612J2644m841k4l56n147k418j276m968J587m807j0498J727
16700a7780J9131j002K782k853m490n944l65N710J976j95J675k947j544k765O842
$$ plain form
16803 1147 6463 -5656 -10181 -10684 -12903 -5363 8052 11039 15755 10177 4826 -3936 -6078 -3619
16789 -3619 -14976 -18269 -12918 -11677 -14645 -3534 5606 316 2543 2761 7061 -1122 1062 2515
16775 2515 -376 -2283 2619 2446 4030 1648 316 -6245 -9130 -7195 3071 6862 4812 3807 7205
16760 7205 11508 8181 4173 10662 16248 16247 11377 5767 2137 3176 -6648 -14717 -4248 2355 2413 -2985
16744 -2985 -16326 -18354 -7658 -2901 -1905 -2503 -3970 -2886 -269 8217 7004 -6326 -5021 -1527
16730 -1527 -581 -5620 -1615 5828 9372 8079 2913 2492 730 -8784 -12071 -7016 -7343 -8796 -11093
16715 -11093 -13060 -4015 597 13241 8400 8376 8020 2873 455 -821 -5789 -4202 -9009 -19507 -17780
16700 -17780 1351 349 3131 278 -4212 -10156 -10521 -4811 -2835 -3030 -1355 -4302 -5846 -8611 -1769
16685a769Q91l369n357n170k625J365L262j170P850k317p293K096Q788M279l999
16670d538k772l926n271K983M858K6l203r408O49Q439R103L243J0009J711l117
16655H786p780j1940l825p005j16N018j811J193j896N046K941Q62k523P849P431
16640B230K19n141M764n654o985o628k925O320K404n643K934K359R311L228q744
16625g951n15k927n520K290J0905M390o002m682j057O25R867P65m945M110j380
16610b027n167M021L132n243q931r530m063L955m73N796O387Q733P618M657M395
16595A3260r560j2657r481m083l354L445n28O073P762k648o411J277o88o411J068
16580b2936O606L493K313L100L776k252J0661r22n953Q342J201m255R04k394j673
$$ plain form
16685 -1769 -878 -4247 -9604 -14774 -17399 -16034 -12772 -13942 -6092 -8409 -15702 -13606 -4818 -539 -4538
16670 -4538 -7310 -11236 -16507 -13524 -8666 -8640 -11843 -21251 -20602 -12163 -3060 183 10192 11903 8786
16655 8786 1006 -10934 -14759 -21764 -21880 -16862 -18673 -17480 -19376 -14330 -11389 -10527 -13050 -5201 2230
16640 2230 2449 -2692 2072 -3582 -10567 -17195 -20120 -13800 -11396 -17039 -14105 -11746 -2435 793 -7951
16625 -7951 -8466 -11393 -16913 -14623 -3718 672 -5330 -10012 -11069 -10444 -577 188 -4757 -647 -2027
16610 -2027 -7194 -3173 -41 -5284 -14215 -23745 -27808 -23853 -24326 -18530 -12143 -3410 4208 8865 13260
16595 13260 3700 -8957 -18438 -22521 -25875 -22430 -22958 -16885 -9123 -11771 -18182 -16905 -17593 -24004 -22936
16580 -22936 -16330 -12837 -10524 -7424 -3648 -5900 4761 3839 -2114 6228 7429 3174 4078 1684 11
16565A1O249M618p2r953o608K50l054j1722j0126k23J546O548J005M971P400J495
16549g665Q433q313m317Q141Q224j1065j2079J1107k482l780r7M946J390k81K831
16534e007j98j351K147K030j162K776n324K095J02L270R877n735l615M984j306
16519C583p241O505J0362j2745j0731k258j482M475M995l719n003K430N140L957
16505a732p22j951l72n910K341O300k485K702j156n572m503K404j658N479j092
16490g927M59K842r694l708O771J1243l301p410j498J870r275l266J7243m936
16476a0587k93J1880J992j1358m502P947M281L564J975M691n344m987n905n272
16462a1918l913J797N662j861j2057M005o42O405O433P273m578j3260Q5Q543J990
$$ plain form
16565 11 6260 10878 10806 853 -5755 -5505 -8559 -20281 -30407 -30630 -29084 -22536 -21531 -16560 -9160 -7665
16549 -7665 768 -7545 -11862 -3721 4503 -6562 -18641 -7534 -10016 -13796 -13893 -8947 -7557 -7838 -5007
16534 -5007 -5205 -6556 -4409 -2379 -3541 -765 -6089 -3994 -3892 -622 9255 3520 -95 4889 3583
16519 3583 -3658 2847 13209 464 -10267 -12525 -14007 -9532 -4537 -8256 -13259 -10829 -5689 -1732
16505 -1732 -2454 -4405 -4777 -10687 -8346 -2046 -4531 -1829 -2985 -8557 -13060 -10656 -12314 -6835 -7927
16490 -7927 -7468 -4626 -14320 -18028 -11257 -14 -3315 -10725 -12223 -10353 -19628 -22894 -5651 -10587
16476 -10587 -10880 1000 2992 -8366 -12868 -4921 -640 2924 4899 9590 4246 -741 -6646 -11918
16462 -11918 -15831 -14034 -8372 -10233 -22290 -18285 -18927 -12522 -6089 1184 -3394 -16654 -16569 -8026 -6036
16447f036j141l507m28O80M612J0478j368l359n656J587J386Q232N895m10l929
16432G036L057j0861r315J091j898p36J646K373J3596k888p173K680K767J0165
16418A1540l600kn326p543M390J4870j0384j051k325r195o205m24M363J1500P038
16403G646n989l155L710j4391m931N091M205O332j24M873J0071N270o285O76m931
16388H068r707j1103r23Q064L233o676P19Q923o019m607M969N683O396j995k799
16373B226M492l380q301k922j246J556K394r086l232Q311R048Q322j168r779j0563
16358a3328k377r691R546J5127J1316l291p506j5652m212O132M835j128l497R131
16344d595J806q512n722o469O474N369l091k064j163k513m138Q942J0810o163
$$ plain form
16447 -6036 -7177 -10684 -11112 -10432 -5820 4658 3290 -69 -5725 -4138 -2752 5480 11375 10965 7036
16432 7036 10093 -768 -10083 -8992 -10890 -11626 -9980 -7607 5989 3101 -4072 -1392 1375 11540
16418 11540 7940 7938 2612 -4931 -541 14329 3945 2894 569 -8626 -14831 -15255 -10892 608 7646
16403 7646 1657 -1498 2212 -12179 -17110 -12019 -7814 -1482 -1606 3267 13338 18608 12323 12999 8068
16388 8068 -1639 -12742 -13665 -5601 -2368 -9044 -8325 598 -5421 -10028 -5059 624 7020 5025 2226
16373 2226 6718 3338 -4963 -7885 -9131 -7575 -5181 -14267 -17499 -9188 -140 8182 7014 -2765 -13328
16358 -13328 -15705 -25396 -15850 -723 10593 7302 -204 -15856 -20068 -13936 -9101 -10229 -13726 -4595
16344 -4595 -2789 -11301 -17023 -23492 -17018 -11649 -14740 -16804 -17967 -20480 -24618 -15676 -4866 -11029
16330a1029k509l012k816M968J018j371J560o75K34O625O469J238j307q747n461
16315a4815J049m251Q865n360o709K717m703O974Q572l719m428n752p81k057R224
16300a5174R474L450M343L90p339P35K574L879J595j487R493m914n154q549l615
16285a0299m127O091R266K701o308o201l405q282k514Q96J0718O312n454j5153
16271b5759P617O611J1468M907l907J28J628o556o882J026k561P89Q59J657M554
16256d421Q382L308j262J422j683o069p623j473N329j117l98N726o138j1013M581
16241a2449J0133l004n940o210j421K0276J4036K051L289j970j1548p870J206
16228E79L655n850j976l739q274O301J3620N778o053p879J913J319o847l105J2269
$$ plain form
16330 -11029 -13538 -16550 -19366 -14398 -13380 -14751 -13191 -13866 -13632 -7007 -538 700 -607 -9354 -14815
16315 -14815 -13766 -18017 -9152 -14512 -21221 -18504 -23207 -16233 -7661 -11380 -15808 -21560 -22341 -24398 -15174
16300 -15174 -5700 -2250 2093 2483 -4856 -4121 -1547 2332 3927 2440 11933 7019 1865 -6684 -10299
16285 -10299 -14426 -8335 931 3632 -2676 -8877 -12282 -20564 -23078 -22182 -11464 -5152 -10606 -25759
16271 -25759 -18142 -11531 -63 4844 937 1065 2693 -3863 -10745 -9719 -12280 -11491 -10632 -8975 -4421
16256 -4421 3961 7269 6007 7429 5746 -323 -7946 -9419 -4090 -5207 -5605 121 -6017 -17030 -12449
16241 -12449 -2316 -5320 -11260 -17470 -18891 1385 15421 17472 20761 18791 7243 -627 579
16228 579 4234 -1616 -3592 -7331 -15605 -9304 4316 10094 4041 -3838 -1925 -606 -7453 -10558 1711
16213A711J5233k125n609o734j0328q104j614O095R086j315j064J819p537r00
16199a1386R18N300Q050L765K906K14j854l350k614O766r97l62l910O452N593
16184A5491mp215k823Q90n78N99r340k998P43N78q436J276L425J164j77K304l064
16167h165J808Q915O162k257k112J246R197Q983j613J121Q31l655p91J575m884
16152A6361j1388p835M045O677m671M72P79K349J258l816n190n98n388l572l537
16137a4054q226M539M919l401M733M712L103N391j415k309j3286m718L342M416
16123a2254P212Q574M974J3285N095k3632j4024K467J450O31J197J1568N21l88
16109F676j157r888q991N898l530Q862P459l467K418N837k646q067M16j746k09
$$ plain form
16213 1711 16944 14819 9210 2476 -7852 -15956 -17570 -11475 -2389 -3704 -4768 -2949 -10486 -11386
16199 -11386 -10468 -5168 2882 6647 9553 9767 7913 4563 1949 8715 7718 7356 3446 9898 15491
16184 15491 15487 8272 5449 6339 5761 6360 -2980 -5978 -5235 -4657 -13093 -11817 -8392 -7228 -7405 -5101 -8165
16167 -8165 -6357 2558 8720 6463 4351 5597 14794 23777 22164 23285 24116 20461 19670 21245 16361
16152 16361 4973 -2862 1183 7860 3189 3661 4440 6789 8047 4231 -959 -1557 -6945 -10517 -14054
16137 -14054 -22280 -17741 -12822 -16223 -11490 -6778 -3675 1716 301 -2008 -15294 -20012 -16670 -12254
16123 -12254 -5042 3532 8506 21791 26886 3254 -10770 -8303 -6853 -6222 -5025 6543 7064 6676
16109 6676 5519 -4369 -13360 -7462 -10992 -2130 5329 1862 4280 10117 7471 -596 -180 -1926 -2135
16094b135Q08L392l324n89Q123J383L73j004n474n156o650O880K172M1K852k732
16078a040k274N817J395r884J413L822k441j645j0202M08R915N557L185l333n758
16063e065M96K478o576P486J003o353p341J58J140O051j658j766J487K387q04
16048f877P496k322o952J206N262k95k745K329j639R31l510O39j810M32l229m725
16032a5809O367l493p26j65J0994K044o466o380l382m956J069M236J893m495L766
16017a5503J5685M934r850M493J512m256j4827l889J670N249K123K340m763m844
16003a9926P804L799j307n855k748r58N457M311J322Q669j989j5804j0044O154
15989b1115J4903J991o787J0249J246o275l004o462p72J2003O709j486q876k006
$$ plain form
16094 -2135 -1327 2065 -1259 -1848 6275 7658 8031 7027 1553 -3603 -10253 -3373 -1201 -1160 1692 -1040
16078 -1040 -3314 2503 3898 -5986 -4573 -751 -3192 -4837 -15039 -14631 -4716 841 4026 693 -5065
16063 -5065 -4569 -2091 -8667 -1181 -178 -6531 -13872 -13714 -12574 -6523 -8181 -9947 -8460 -6073 -6877
16048 -6877 619 -1703 -8655 -7449 -2187 -2482 -5227 -2898 -4537 -3606 -7116 -6477 -8287 -7855 -11084 -15809
16032 -15809 -9442 -12935 -13661 -13826 -2832 -788 -7254 -13634 -17016 -21972 -20903 -16667 -14774 -19269 -15503
16017 -15503 182 5116 -4734 -241 1271 -2985 -17812 -21701 -20031 -14782 -12659 -10319 -15082 -19926
16003 -19926 -12122 -8323 -9630 -15485 -18233 -19191 -13734 -9423 -8101 568 -1421 -17225 -27269 -21115
15989 -21115 -6212 -4221 -11008 -759 487 -5788 -8792 -15254 -16026 -4023 2686 1200 -7676 -9682
15975i682o356n089J5160J3141N188j581j0346m187P989l904n8P42K903J881J296
15960G097j310J234o111l190r76j4626o894J2465k38k89J352K54O365q68q402
15945a4137m201J079M072K817m899O830P023L935J935j1308p874j969q9m24o430
15930b3640j627o42O997O138K844L579L408j861q899j3531K910Q918L067L648
15916h691K27r96q869k299J8455N012R76N069K161j716n349l477J514J958L07
15901D282q401J264r009p760n491l804P139Q951j964k724k110P728q03K042m028
15886a4688j091K339Q690j684j1507o341J1181J1892L583n266o121q47K203L920
15872c737j189n044Q964L238O202n662Q69m131j993j4735j2342P739J4650J8729
$$ plain form
15975 -9682 -16038 -21127 -5967 7174 12362 10781 435 -3752 4237 333 275 1017 3920 5801 7097
15960 7097 5787 7021 910 -2280 -3256 -17882 -24776 -12311 -12549 -12838 -11486 -11232 -4867 -5735 -14137
15945 -14137 -18338 -17259 -13187 -10370 -15269 -8439 -1416 2519 4454 -6854 -14728 -16697 -16786 -17210 -23640
15930 -23640 -25267 -25909 -18912 -12774 -9930 -6351 -2943 -4804 -13703 -27234 -24324 -15406 -12339 -8691
15916 -8691 -8464 -9460 -18329 -20628 -2173 2839 3815 8884 11045 9329 3980 503 2017 3975 4282
15901 4282 -4119 -2855 -11864 -19624 -25115 -28919 -21780 -12829 -14793 -17517 -19627 -11899 -12702 -10660 -14688
15886 -14688 -15779 -13440 -4750 -6434 -17941 -24282 -13101 -1209 2374 -2892 -9013 -9860 -7657 -3737
15872 -3737 -4926 -9970 -1006 2232 8434 2772 3641 -490 -2483 -17218 -29560 -21821 -7171 11558
15858A1558Q337q719j1277K819m821l778l512k840J185m215j1492j694o540J263
15844c3726R209R898m86j246l928j798K137N252k148J883J030k715J729J333L680
15829i896O919J916p708q685M578L057l355n417n282N057O852r381j346Q56J685
15814b0150J3756P638o67O322P36j0114q096k014l04L76P191K63O42j728m53l33
15798f935L050J0718P033n008p222q88p330j1706M141j37l793J0335R211m73o898
15783e902N978M85L449j2053k643m841o552K623J901K724M78N759O504K942q278
15768g426l388L409N373j934p176n263L417J713K196M246j681K862J2193Q63m875
15753D529n311k984l764K934P092q346j1441o627M173O411k384M43P250M407M18
$$ plain form
15858 11558 19895 11176 -101 2718 -2103 -5881 -9393 -12233 -11048 -15263 -26755 -28449 -34989 -33726
15844 -33726 -24517 -14619 -15105 -16351 -20279 -22077 -19940 -14688 -16836 -14953 -13923 -16638 -14909 -13576 -9896
15829 -9896 -2977 -1061 -8769 -17454 -12876 -9819 -13174 -18591 -23873 -18816 -11964 -21345 -22691 -21835 -20150
15814 -20150 -6394 1244 577 6899 7635 -2479 -10575 -12589 -12893 -12517 -5326 -5063 -4421 -6149 -6602 -6935
15798 -6935 -3885 6833 13866 8858 1636 748 -6582 -18288 -14147 -14284 -18077 -7742 1469 996 -5902
15783 -5902 76 561 4010 -8043 -10686 -15527 -22079 -19456 -17555 -14831 -14353 -8594 -2090 852 -7426
15768 -7426 -10814 -7405 -2032 -3966 -11142 -16405 -12988 -11275 -9079 -4833 -6514 -3652 8541 9404 4529
15753 4529 -782 -3766 -7530 -4596 2496 -5850 -17291 -23918 -19745 -13334 -15718 -15275 -8025 -3618 -3200
15738c200L802J0109n846j5099J813R527p992l194K739K601M911n737q984N408
15724i142N041n168K837J1311o402L337l049r120l508P0P542L907m195mj0724
15709a7267j192Q809L19Q63o855q395J2599J4530m234J504K708j934m764J556
15695a753o850R82l93o498j3105r81R81J2977N292J176O493k148n00M109o263
15680f481j145N203L902K4n541n729n195N046m272K923J2240K890k778j8529q841
15665b6283m265Q223M639l032K422J1257j282L960k194j441M339m186n790Q313
15651e320k738Q29O834N074K777O585o646k991p42M156J1981l324m71j00l785
15636A2119R719k530q313o273o668l779j0179n982O907P176Q657M167k033n856
$$ plain form
15738 -3200 602 10711 4865 -10234 -8421 1106 -6886 -10080 -7341 -4740 171 -5566 -14550 -9142
15724 -9142 -4101 -9269 -6432 4879 -1523 1814 -1235 -10355 -13863 -13793 -6251 -2344 -6539 -6543 -17267
15709 -17267 -18459 -9650 -9331 -8468 -15323 -23718 -11119 3411 -823 681 3389 1455 -3309 -1753
15695 -1753 -8603 -7621 -8014 -14512 -27617 -28598 -27617 -14640 -9348 -8172 -1679 -3827 -4327 -218 -6481
15680 -6481 -7626 -2423 1479 1503 -4038 -9767 -14962 -9916 -14188 -11265 975 3865 1087 -17442 -26283
15665 -26283 -30548 -22325 -17686 -20718 -18296 -7039 -8321 -4361 -6555 -7996 -3657 -7843 -13633 -5320
15651 -5320 -8058 -7229 -395 4679 7456 14041 7395 4404 3662 7818 19799 16475 16004 15904 12119
15636 12119 21838 19308 10995 4722 -1946 -5725 -15904 -21886 -14979 -7803 854 5021 2988 -2868
15622b868n940M099J0579j068N054J3079Q392J1908j1541j4247K782n220n522
15609I487k154r12Q47r57o314j728n78o417J836J690O181L525K250m273n111J776
15593h52L037q80P38N572M163r129j0653O672j241l269L028m964m838k336P605
15578g347L626n397m393P238L799O385N546n315L463J395o505r039m838o003L507
15563a3878o974J881j411N229O428M44J434J6488J889m357n957n583o668J950
15549i085O21J052Q742n398j5805m868J0761J5352N34m07J43P813L477O699O79
15534B0310r265o436q492P434k792m830m875O1p40J2321o87r80p443J11K659l784
15518g428L161K178J825n236j1570Q029J1866n273j0030n611K659N321l600M161
$$ plain form
15622 -2868 -8808 -4709 5870 4802 9856 22935 31327 43235 31694 17447 20229 15009 9487
15609 9487 7333 6421 7268 6311 -3 -1731 -2309 -8726 -6890 -5200 981 4506 6756 2483 -2628 -852
15593 -852 2185 1305 2043 7615 11778 2649 -8004 -1332 -2573 -5842 -2814 -7778 -12616 -14952 -7347
15578 -7347 -3721 -9118 -13511 -6273 -2474 3911 9457 4142 7605 9000 2495 -6544 -11382 -17385 -13878
15563 -13878 -20852 -18971 -20382 -15153 -8725 -8281 -6847 9641 11530 7173 1216 -4367 -11035 -9085
15549 -9085 -8464 -7412 1330 -4068 -19873 -24741 -13980 1372 1906 1499 1642 9455 12932 19631 20310
15534 20310 11045 4609 -3883 3551 759 -4071 -8946 -8885 -9625 2696 2009 1029 -6414 -6303 -3644 -7428
15518 -7428 -4267 -2089 -264 -5500 -17070 -9041 2825 -2448 -12478 -18089 -15430 -10109 -13709 -9548
15504i548N406j525M170J4o583K599J413n458K69O638J565l172O38k989k91L051
15488c803k195p432K843J1823J1046Q170Q031k821p333q385L656l067j0188M88
15474H33n727K24K003L262n966r007m981R127Q640P386P058K352M83r653j1346
15459e312j887o05k947N559P616m520p893r415N591Q630n249o884O698L212P677
15444B71K324l351j521J984K546o390r268K459J1032L559o782j60N115j837J706
15429A687j114n575m210p863O74Q880Q326L394m360n963n700m367j773J807L340
15414a2817J0858N741p53m751n461L453n350J828k283j2326l502J1377R532k414
15400f868J91P926O190o808q874n462j177K703k772L507O517l391k071N298R1
$$ plain form
15504 -9548 -4142 -5667 -1497 -1483 -8066 -5467 -4054 -9512 -9243 -2605 -1040 -4212 -3574 -6563 -6854 -3803
15488 -3803 -5998 -13430 -10587 1236 12282 20452 28483 25662 18329 9944 13600 10533 345 833
15474 833 -4894 -4670 -2667 595 -5371 -14378 -19359 -10232 -1592 5794 12852 15204 15687 6034 -5312
15459 -5312 -7199 -7804 -10751 -5192 2424 -2096 -9989 -19404 -13813 -5183 -10432 -17316 -10618 -7406 271
15444 271 2595 -756 -2277 -293 2253 -4137 -13405 -10946 86 3645 -3137 -3297 1818 -19 1687
15429 1687 573 -5002 -9212 -17075 -16401 -7521 805 4199 -161 -6124 -11824 -16191 -17964 -16157 -12817
15414 -12817 -1959 3782 3029 -1722 -7183 -3730 -9080 -7252 -9535 -21861 -25363 -13986 -4454 -6868
15400 -6868 -6677 1249 7439 631 -8243 -13705 -14882 -12179 -14951 -11444 -4927 -8318 -10389 -5091 -5000
15385e000n681k006J321J2151M585n074q07L4L548J271Q037l449p192O168R218
15370A7124m357l627n750k765q573N16L837n99n831m792n333j694J1205P364N570
15355B295J956p684O40K591l312j091j901R41Q400L352L713k421j595k460K141
15340E565M886j0293m542j181j461n609K229M456j331J784M647K300J206L456
15326F112k875j931o196J0030l55o65P077K645J733J856k792p032j1736r286o57
15311a4072J791o252P364j161j0481l658P046M521J477m753R76R157K768M063
15297a214j858m329q35J0607J1819p515n459r071j830L738k019K067R652o573
15283b820n814J657K069J2271K283l533l739j083M370K011L074p828n96J2035
$$ plain form
15385 -5000 -10681 -12687 -11366 785 5370 296 -511 -477 3071 4342 12379 8930 1738 7906 17124
15370 17124 12767 9140 3390 625 -7948 -7432 -3595 -4194 -10025 -14817 -20150 -21844 -10639 -3275 2295
15355 2295 4251 -3433 -2793 -202 -3514 -4605 -6506 -5565 2835 6187 9900 7479 5884 3424 5565
15340 5565 10451 158 -4384 -5565 -7026 -12635 -10406 -5950 -7281 -5497 -850 1450 2656 6112
15326 6112 3237 1306 -4890 5140 4785 4120 11197 13842 15575 17431 14639 7607 -4129 -13415 -14072
15311 -14072 -12281 -18533 -11169 -12330 -22811 -26469 -19423 -14902 -13425 -18178 -17202 -8045 -5277 -1214
15297 -1214 -3072 -7401 -8236 2371 14190 6675 1216 -7855 -9685 -5947 -7966 -5899 3753 -2820
15283 -2820 -8634 -6977 -4908 7363 9646 6113 2374 1291 5661 7672 10746 2918 2322 14357
15269A4357j0200p869P20O95n81O68r52l434O62J1642P687m811j0045k798l62
15254d621p097L54o33L358K553J3861J5071M314j4870o591m287K939r266j0008
15240a4923k216R80N043M407J0561m956j615O521p030o51K689j739O713J3435
15226A7219l52j6748k906M237J211j145k774N422J932J274p634o957J173Q70k976
15211h154M690M293J595J262J0379k595K398n859k954l794j759j15J277O750O152
15196A3566n246J032j060l387l97J856j207N108Q161N50q095l628J394m248L098
15181G497q11J819R43k588o760K307l408p290Q34Q914N941m783m464p134L889
15166e094Q389R261k17m335K779P967j0516k966J2003M447o273j2143j0640n958
$$ plain form
15269 14357 4157 -3712 -2992 -2297 -2878 -2210 -3162 -6596 -5934 5708 13395 8584 -1461 -4259 -4621
15254 -4621 -11718 -11364 -11997 -8639 -6086 7775 22846 27160 12290 5699 1412 4351 -4915 -14923
15240 -14923 -17139 -16159 -11116 -6709 3852 -1104 -2719 3802 -3228 -3879 -1190 -2929 3784 17219
15226 17219 16867 119 -2787 1450 2661 1516 -1258 4164 6096 7370 -264 -7221 -6048 -5178 -8154
15211 -8154 -3464 829 2424 3686 14065 11470 13868 8009 5055 1261 -498 -613 664 7414 13566
15196 13566 8320 9352 8292 4905 4508 6364 5157 10265 18426 18976 10881 7253 8647 4399 7497
15181 7497 6686 8505 9448 6860 100 2407 -1001 -8291 -7457 1457 7398 2615 -1849 -8983 -5094
15166 -5094 3295 12556 12339 8004 10783 18750 8234 5268 17271 21718 15445 3302 -7338 -13296
15152a3296n41K046J1212R322q456j0779m070l33J5892N811J2056O31n076n420
15138H999q956m42l468j590m075k943L007J116J0715O581l969P132m405j1358
15124c656J4123q69k503L197j280j295O110N616p061j7413j869N211P003l82o54
15109D278K882n561L524O03j105r98N234J4245J0030j2880j2440n454j761n894
15095e297J392K719o048P276m99M480L478m707o092p721L085M626J56M080M069
15080D997n649K506j160q896k777P176m597O184l827j0739M756Q294K425j690
15066b997k134m122k992j909N361J843j489R303J2690K824o235m306J710P422
15052A4969l021K888n06k315j2294m935n166m069J369K080P359J4420k238j6820
$$ plain form
15152 -13296 -13837 -11791 -579 8743 287 -10492 -14562 -14895 997 6808 18864 19495 14419 8999
15138 8999 43 -399 -3867 -5457 -9532 -12475 -9468 -8352 2363 8944 4975 12107 7702 -3656
15124 -3656 10467 9598 7095 10292 9012 7717 13827 19443 12382 -5031 -6900 -1689 5314 4932 4278
15109 4278 7160 1599 5123 5726 4621 3623 8857 23102 33132 20252 7812 2358 597 -5297
15095 -5297 -3905 -1186 -7234 42 -457 4023 7501 2794 -3298 -11019 -7934 -3308 -3152 928 4997
15080 4997 -652 1854 694 -8202 -10979 -3803 -8400 -2216 -6043 -16782 -12026 -3732 -1307 -2997
15066 -2997 -5131 -9253 -12245 -14154 -8793 -6950 -8439 864 13554 16378 10143 5837 7547 14969
15052 14969 11948 14836 14330 12015 -279 -5214 -10380 -14449 -13080 -11000 -3641 10779 8541 -8279
15038h279p734M222O842M371j481Q106m415j4727k378P255L733K509M983M747
15024G754O45p922m780L322J1568O637o70j0943o123k483l356J1253K545o345
15010A102j1438j780m465M146K330j217j019K724N720j215l305P402R060k834
14996E211J426r19l37j630j761j640J78n100q3j555j566l214n138J0059O581K071
14980B583k706k20m169p338J056P105Q47L705J36r02p91q198K425N023k059O883
14964C380K799m803r358o298M816J2156M647l88q135m222p991N458o05J923L797
14949b824J966o234M884j315k358k590J1604J0866M153K238K577n312m976n802
14935F877l109n744j0185j565o764J925L797M258L785M334o262j714N053l679
$$ plain form
15038 -8279 -16013 -11791 -4949 -578 -2059 6047 1632 -13095 -15473 -8218 -4485 -1976 3007 7754
15024 7754 8399 477 -4303 -981 10587 17224 16554 5611 -512 -2995 -6351 4902 7447 1102
15010 1102 -10336 -12116 -16581 -12435 -10105 -11322 -12341 -9617 -3897 -5112 -8417 -1015 8045 5211
14996 5211 6637 5718 5381 3751 1990 350 528 -4572 -4655 -6210 -7776 -10990 -16128 -6069 512 2583
14980 2583 -123 -343 -4512 -11850 -10794 -3689 -2842 863 999 97 -694 -8892 -6467 -1444 -3503 3380
14964 3380 6179 1376 -7982 -14280 -9464 2692 7339 6951 -1184 -5406 -13397 -7939 -8544 -6621 -2824
14949 -2824 -858 -7092 -2208 -3523 -5881 -8471 3133 13999 18152 20390 22967 17655 12679 6877
14935 6877 3768 -1976 -12161 -13726 -20490 -18565 -14768 -10510 -6725 -2391 -8653 -10367 -5314 -8993
14921h993N69K806J014P902q165P01J64o22k10j493Q211J261j0490m072M22q55
14905a1850L497j442K467J3779m619n943r73r57O876M010k014M357m247r457k082
14890h598P265L868m855o864l648R310k23L149k865L786p058k233N841M813K21
14875A909o524J196Q458P004j192K515L090k713m212n416j451Q871M0j754j829
14860G992l610o407J381j071M82k640n482o134k568M144M712M280l552l862M09
14845a1926k577P62k321J484R382J2212M03N150o302k129J367k536m484N857P99
14830E141o62L975J026m043K329M834j190k893m56k488n004O27j2194r387Q174
14815a2211J1528k003O09J758j278m817P91l625j0977p41P716P774p59q59k033
$$ plain form
14921 -8993 -8424 -5618 -4604 3298 -4867 -4166 -4002 -4624 -4834 -6327 1884 3145 -7345 -11417 -10995 -11850
14905 -11850 -8353 -9795 -7328 6451 1832 -4111 -5084 -6041 835 4845 2831 7188 2941 -6516 -8598
14890 -8598 -1333 2535 -2320 -9184 -12832 -3522 -3745 -596 -3461 325 -6733 -8966 -3125 1688 1909
14875 1909 -4615 -3419 5039 12043 10851 13366 16456 13743 9531 4115 2664 11535 11575 9821 7992
14860 7992 4382 -2025 -644 -1715 -1233 -3873 -9355 -15489 -18057 -13913 -9201 -4921 -8473 -12335 -11926
14845 -11926 -14503 -13741 -16062 -14578 -5196 7016 7419 12569 6267 4138 5505 2969 -1515 4342 5141
14830 5141 4479 8454 9480 5437 7766 12600 11410 8517 8061 5573 569 1196 -10998 -20385 -12211
14815 -12211 -683 -2686 -2077 -319 -1597 -6414 -5623 -9248 -20225 -20966 -13250 -5476 -6235 -7094 -9127
14800i127K315J716O473r562M053N718K933n484R80Q69O214M983p937m822k958
14785c636n386k711o38K914Q491J414r117j3289j153O642M996L727l210j0409
14771b1365J916M868Q580N771j1022m439K353L960K086N350J082r579K933M531
14757b975m801j450n67L613N840K856P836m54q453p758P616J699k346j069N92
14742A79J751R011K717m313j7025J141M557o553r641k836N339Q928K174N21k24
14727d274K097j899j2333l39p34L614P863J028M927o06r282L768K0695K832q424
14712H933k217L238J2941j671o054n483K17j003o020k814M938r45j0056j720l87
14697h103J776M037L400k158Q320l590j1633J211O137l654J79O910P136l882K197
$$ plain form
14800 -9127 -6812 -5096 1377 -8185 -4132 1586 4519 -965 15 884 7098 12081 4144 -678 -3636
14785 -3636 -9022 -11733 -12371 -9457 -966 448 -8669 -21958 -23111 -16469 -11473 -7746 -10956 -21365
14771 -21365 -19449 -14581 -6001 -230 -11252 -15691 -13338 -9378 -7292 -1942 -860 -10439 -7506 -2975
14757 -2975 -7776 -9226 -9793 -6180 -340 2516 10352 9898 1445 -6313 1303 3002 656 -413 179
14742 179 1930 10941 13658 9345 -7680 -6539 -1982 -8535 -18176 -21012 -15673 -6745 -4571 -4050 -4274
14727 -4274 -2177 -4076 -16409 -16748 -17482 -13868 -6005 -4977 -50 -656 -9938 -6170 14525 17357 8933
14712 8933 6716 9954 22895 21224 15170 9687 9904 8901 2881 67 5005 4060 -5996 -7716 -8103
14697 -8103 -6327 -2290 1110 -1048 7272 3682 -7951 -6740 -603 -4257 -4078 2832 9968 6086 8283
14682H283m852l214J945m901l257L884L658p054J0212J3077j834j1444M717r016
14668B04j4732k30R15L116q187j869J3509J1821n439n061L056O63K562K723K630
14653E681J652l276J623m397k95O361k881M662J412j6715j2429k153J0458O459
14639c838q788k996R845M572r754M317k250k066P290Q834J826J099n810L263J5316
14624B0860R70J024J795p511n534K541J860R07N61K472J470r709j6117p378L187
14609h602L56j048O66O37O569L202L780K948k068N833m005j1310n665O952k75
14594b030L645N26J268J700l569M949k051L699p18P410m636l241K542K50o69R54
14578A0029m682l298k958n317L305O98Q460M480r25M217o596p579j409p66j07
$$ plain form
14682 8283 3431 217 2162 -2739 -5996 -2112 1546 -5508 4704 17781 15947 4503 9220 204
14668 204 -14528 -14758 -13843 -10727 -18914 -20783 -7274 4547 -892 -5953 -2897 -2234 328 3051 5681
14653 5681 7333 4057 5680 1283 988 7349 4468 9130 10542 -6173 -18602 -20755 -10297 -3838
14639 -3838 -12626 -15622 -5777 -1205 -10959 -6642 -8892 -10958 -3668 5166 6992 8091 2281 5544 20860
14624 20860 21830 22854 24649 17138 11604 14145 16005 16912 17473 19945 21415 11706 -4411 -11789 -8602
14609 -8602 -8246 -9294 -8628 -7991 -1422 1780 5560 8508 6440 12273 8268 -3042 -8707 -1755 -2030
14594 -2030 1615 2141 3409 5109 1540 6489 4438 8137 7419 14829 10193 6952 9494 9744 9075 10029
14578 10029 5347 2049 -909 -6226 -2921 -2223 6237 10717 9792 14009 7413 -166 -1575 -2341 -2448
14563b448K636N94J0900j79j0828J534m144k46L606l532k817O683O097R209N35
14548A7600j363j538j106l097J0753Q323k137m066l11J4203N909M319n421m324
14534C7744j2478j1211n856j9646r290L041N165M929p21l251K141O166J666K441
14520H40n190M384m112n575j742j915J757m18O317K161o83K512P190J2377J093
14505A8996o435l461P370r305p051M441O064j203o431j294P757J0591j039o328
14491A2672j6311k0103K362N788L630L136M047O378p846p316J656j468R249L358
14477g68n518p679l416K514O314K073R400J245j696m576L450m72j2005n698Q850
14462g982L658L827p21o591R567L617m058n177k048O142L41k607o309L362r56
$$ plain form
14563 -2448 188 782 11682 11503 675 2209 -1935 -2181 1425 -2107 -4924 1759 7856 17065 17600
14548 17600 16237 14699 13593 10496 21249 29572 27435 23369 23058 37261 43170 47489 42068 37744
14534 37744 25266 14055 8199 -11447 -20737 -17696 -12531 -7602 -8323 -11574 -9433 -3267 -1601 840
14520 840 -4350 34 -4078 -9653 -11395 -13310 -11553 -11971 -5654 -3493 -4176 -1664 5526 17903 18996
14505 18996 12561 9100 16470 7165 114 4555 10619 9416 2985 1691 9448 20039 19000 12672
14491 12672 -3639 -23742 -21380 -15592 -11962 -8826 -4779 1599 -6247 -13563 -11907 -13375 -4126 -768
14477 -768 -6286 -13965 -17381 -14867 -8553 -6480 2920 4165 2469 -2107 1343 871 -11134 -16832 -7982
14462 -7982 -4324 -497 -1218 -7809 1758 5375 1317 -3860 -5908 234 575 -2032 -8341 -4979 -5935
14447e935L132m95l552q127k116O433k777q152n719j577R393k257O770J2156K149
14432f74M343j0102o27K598j052J1527K620j1039q22N304k911k393j400j038N660
14417fk437o142M636N569j2255k650N854N005o934j978J142j6j502M327m401O270
14401e518L996N77m225l959K848p735k563R147O834O667q27l764r89p538m154
14386a1203J702o509j3856R611J4205R920L293n944j2389q70J0639O770m863L732
14372D238R694K95o766j0746L533K142o989q933k686J842L436P803m290O01J2719
14357E893J521r497n554J012J561l169j223n783o315l755P930J4790J0030m764
14343B677k946o873M40r253N221M739r553l031R097L226N398p163l683j504J230
$$ plain form
14447 -5935 -2803 -3298 -6850 -14977 -17093 -10660 -13437 -21589 -27308 -28885 -19492 -21749 -14979 -2823 -674
14432 -674 3669 -6433 -7060 -4462 -5514 6013 8633 -2406 -3228 2076 -835 -3228 -4628 -5666 -6
14417 -6 -2443 -8585 -3949 1620 -10635 -13285 -7431 -2426 -9360 -11338 -10196 -10212 -11714 -7387 -11788 -5518
14401 -5518 -1522 -945 -5170 -9129 -6281 -14016 -16579 -7432 -598 6069 5242 1478 489 -7049 -11203
14386 -11203 -9501 -16010 -29866 -20255 -6050 3870 7163 1219 -11170 -12040 -1401 5369 506 4238
14372 4238 13932 14227 7461 -3285 248 2390 -4599 -13532 -16218 -14376 -10940 -3137 -7427 -6826 5893
14357 5893 7414 -2083 -7637 -6625 -5064 -8233 -9456 -15239 -21554 -25309 -17379 -2589 7441 2677
14343 2677 -269 -7142 -6702 -15955 -10734 -5995 -15548 -18579 -9482 -6256 -858 -8021 -11704 -13208 -11978
14328a1978n95K034M63J380J1387J1964p546q007p273q831P7j696K865R984N403
14313c69m384r953l160R503N060r621l018N856M842n233q42O434J1357M681m038
14298G115k887p892m033O993j264n670K532N048M546Q515O031J0032Q914Q205
14284D6185j1110j4065n340l632k429k69r14R099l054j1133k901k577L68O623
14270D851N81J539J0974r20LM383N29P65j779n72k920o734o491M13K786P195N741
14253B0344K707J602j0880j2870l215r012J0969J286p871l771K393J0831k280
14240B33j805Q375K766j445r481r88l962j137o0J518Q018J0474R969q449r759
14225D267m338k782L886M390M741N767j0936q52J1964q73r178K150k072J351Q225
$$ plain form
14328 -11978 -12573 -10539 -10076 -8696 2691 14655 7109 -898 -8171 -17002 -16925 -18621 -15756 -5772 -369
14313 -369 -4753 -14706 -17866 -8363 -3303 -12924 -15942 -10086 -5244 -10477 -11319 -4885 6472 11153 7115
14298 7115 4228 -3664 -7697 -704 -1968 -7638 -5106 -58 4488 13003 19034 29066 37980 46185
14284 46185 35075 21010 15670 12038 9609 9340 8426 17525 14471 3338 437 -2140 -1772 4851
14270 4851 5432 6971 17945 17025 17028 21411 21940 22705 20926 20354 17434 10700 4209 4622 7408 14603 20344
14253 20344 23051 24653 13773 903 -2312 -11324 -355 931 -6940 -10711 -8318 2513 233
14240 233 -1572 6803 9569 8124 -1357 -2345 -6307 -7444 -7504 -5986 2032 12506 22475 14026 4267
14225 4267 -71 -2853 1033 5423 10164 15931 4995 4143 16107 15234 6056 8206 6134 7485 15710
14210A5710n543n570l221J056Q369j644j2435K191Q965j232p82l316R32K412j623
14195D269J902J0201k820j0741m481J724N727Q550o307m386J695l234N484k082
14181E501P590L178m910p007m019L465L806o834J508K821O889p473o024J502L400
14166C393o556k113J2546m073n672K027K194K433L096J301k275m292k758l012
14152c761j141P362N659k57m608n060o651J26l009j057K962m545r498J2975R308
14137a195P021Q169l344k015L950N227k060j907j2188j0023j50J308k794k825
14123a2826P330K066m90j0232k753k42j028N823R431N169O985J13m250o127K370
14108A339k547M404j2908n065Q50j854J467k514K213J3802P109o803j879J041
$$ plain form
14210 15710 10167 4597 1376 2432 10801 9157 -3278 -1087 7878 6646 5864 2548 3480 5892 4269
14195 4269 6171 16372 13552 2811 -1670 54 5781 14331 8024 3638 5333 2099 7583 5501
14181 5501 13091 16269 11359 4352 333 3798 7604 770 2278 5099 11988 4515 -1509 -7 3393
14166 3393 -3163 -5276 7270 3197 -2475 -448 1746 4179 7275 8576 6301 2009 -749 -3761
14152 -3761 -4902 2460 8119 7862 3254 -1806 -8457 -8331 -11340 -12397 -9435 -13980 -23478 -10503 -1195
14137 -1195 5826 13995 10651 8636 12586 17813 15753 13846 1658 -8365 -8515 -7207 -10001 -12826
14123 -12826 -5496 -3430 -3920 -14152 -16905 -17147 -18175 -12352 -2921 2248 9233 9346 5096 -1031 1339
14108 1339 -1208 3196 -9712 -14777 -13927 -15781 -14314 -16828 -14615 -813 6296 -507 -2386 -1345
14094a345n655L415n188Q4P056m035m548J316K752R909q7J827m853q63n768m225
14078a0208Q255J636j390L757m772j1202l983L594J0751N694L810l907J800J3413
14064A7248M59j0405n477P908k595p268K029L606P703m685n305N464J4496j335
14050B1843j2520j293K499l325L074o931o02k671p910l315O229O187n806m749
14036i290L652n498K481R637N025l757q988o780l562l934K368J1486Q179J557
14022B576r2K178j64k228J4950J4138M984j4295p229J012j4322m19K015m838p451
14007i185P32o678r34R080m387L303M892P636l486j796J40K191N972J0198l011
13992A4667J4656M195N60N801Q543N937J1871J8410M3074N0558O1223P2528O2178
$$ plain form
14094 -1345 -7000 -3585 -8773 -8689 -1633 -5668 -10216 -8900 -6148 3761 3674 5501 648 -215 -5983 -10208
14078 -10208 -1953 -317 -1707 2050 -2722 -13924 -17907 -14313 -3562 2132 5942 2035 3835 17248
14064 17248 17707 7302 1825 9733 7138 -130 1899 5505 13208 8523 3218 8682 23178 21843
14050 21843 9323 8030 10529 7204 10278 3347 2745 74 -7836 -11151 -4922 1265 -4541 -9290
14036 -9290 -5638 -11136 -8655 982 6007 2250 -6738 -13518 -17080 -21014 -18646 -7160 1019 2576
14022 2576 2484 4662 4498 2270 17220 31358 36342 22047 14818 15830 1508 1089 3104 -1734 -9185
14007 -9185 -8453 -15131 -16065 -6985 -11372 -8069 -3177 4459 973 -823 -683 1508 7480 17678 14667
13992 14667 29323 33518 34078 39879 48422 54359 66230 84640 127714 178272 239495 312023 374201
13979C74201N0278N0781M1484Q789k3917l9956n8632o9197p1355o0727m7057l4298
13967A20394l0213k6658k0825j0430k013j3303q609M100l726j581q413L813L135
13954E671k269j645K301L593J374N40j4008p243N819J0641L03l074L004L664k413
13939F258n092N186k442L164R78O68N263k857n062k819n20j222O96J557o709O81
13923b272J02q345L839M307K327K471O11m243k185j027L079L963R631p09j760
13908I789R27l422J0274l079j0429J626O95K057J683l524N850J2994j3459j2035
13894e3p607m162P91K2208J2426k434o032j492q236o435j108r557O519R315M386
13879H529Q920q756j2812J823K469j634j494P900j263j0766j0167M645J0043J148
$$ plain form
13979 374201 424479 475260 516744 525533 501616 461660 403028 333831 262476 201749 154692 120394
13967 120394 90181 63523 42698 32268 30255 16952 8343 12443 8717 7136 -1277 2536 5671
13954 5671 3402 1757 4058 7651 9025 9565 -4443 -11686 -5867 4774 5077 2003 5007 8671 6258
13939 6258 1166 6352 3910 7074 8052 8720 13983 11126 6064 3245 2725 1503 2199 3756 -2953 -2272
13923 -2272 -2170 -10515 -6676 -2369 -42 2429 3040 -1203 -3388 -4415 -1336 2627 12258 11549 9789
13908 9789 10716 7294 17568 14489 4060 5686 6381 8438 10121 6597 12447 25441 11982 -53
13894 -53 -7660 -11822 -11031 11177 23603 21169 15137 13645 5409 -1026 -2134 -11691 -5172 4143 8529
13879 8529 17449 8693 -4119 -2296 173 -1461 -2955 4945 3682 -7084 -17251 -12606 -2563 -1415
13865a415P14k577k067k541m96M372J776j769J393l657k779L751M855J557j190
13850g3L153O351J519k480l948k914Q158o595m499J462J526k44m796j836m140
13835i356j0823L82J368Q692J2136l747K727L069l002j525M322L193l775L269
13821F930J565j687o414N389M104l493j958k712L104N583j661m156M089K675J2048
13806B3406M471m101j5453m418L100M284n886j1289j9q29M654N599R897J897j393
13791A3920M477k344m161q661o532J078M907n066P62K807j553K742k417l568n830
13776i439P821J2520J1068k031j0932p953J845Q294M553n487l600j84k662J0279
13762A4092R968l856r706p663o119J0118K733m922k000J135J0096J529p320L410
$$ plain form
13865 -1415 -701 -3278 -5345 -7886 -8382 -4010 -2234 -4003 -2610 -6267 -9046 -5295 -440 1117 -73
13850 -73 3080 9431 10950 8470 4522 1608 9766 3171 -1328 134 1660 1416 -3380 -5216 -9356
13835 -9356 -20179 -19797 -18429 -9737 2399 -1348 1379 4448 1446 -79 4243 7436 3661 6930
13821 6930 8495 6808 394 5783 9887 6394 4436 1724 4828 10411 8750 4594 8683 11358 23406
13806 23406 27877 23776 8323 3905 7005 11289 5403 -5886 -5905 -6734 -2080 3519 13416 15313 13920
13791 13920 18397 16053 11892 3231 -3301 -2223 2684 -2382 -1620 1187 -366 2376 -41 -3609 -9439
13776 -9439 -1618 10902 21970 19939 9007 1054 2899 11193 15746 10259 6659 6475 3813 14092
13762 14092 24060 20204 10498 2835 -3284 6834 9567 4645 2645 3780 13876 15405 8085 11495
13748A1495k156p647m585k110k38J600l387p660M504K173m39j416P216O942J42
13733D434m108l240o29J849J057j048n11p54N336N318r83Q602J813q182n481J090
13717D563J1975R823j762l635l901J0268o06k057Q74r592k20k515M313J0324j45
13702B7707n707P076J609J086J895L348J0521J2821J0655n553o736Q110L184j5711
13688E4305j1286r151K274n119q226Q44n173M747K355l574r64j2993j0384O98
13674a647J0747L635o509p129j347m152Q742M216r92O18k75J2790N010K328L34
13659B6369K191J0189L715N229K626Q981Q639M741n99j6837o473M586j0365j7158
13645B5834m671L060N0j411R47L375o930m235k38p622k907K733N144n929j4871
$$ plain form
13748 11495 9339 1692 -2893 -5003 -5241 -3641 -7028 -14688 -10184 -8011 -8450 -9866 -2650 4292 4434
13733 4434 326 -2914 -3543 -1694 -637 -1685 -2196 -2950 2386 7704 6721 15323 17136 8954 3473 4563
13717 4563 16538 26361 24599 20964 17063 27331 26725 24668 25542 15950 15730 13215 17528 27852 27707
13702 27707 22000 29076 30685 31771 33666 37014 47535 60356 71011 65458 58722 66832 70016 54305
13688 54305 43019 33868 36142 31023 22797 23641 18468 23215 25570 21996 21032 8039 -2345 -1647
13674 -1647 9100 12735 6226 -903 -2250 -6402 2340 6556 5564 6182 5907 18697 23707 26035 26369
13659 26369 28560 38749 42464 47693 50319 59300 67939 72680 72081 55244 48771 53357 42992 25834
13645 25834 21163 24223 24273 22862 23809 27184 20254 16019 15781 8159 5252 7985 13129 7200 -7671
13630g671K083P705N361M232j0168O651O81p962k002L222Q175L877P1n91n073
13615H591L397J2057J3359K868m900k687P321m297j5773l248M633O965p010n625
13601A5651Q55r688n822J0502N860p099J1273N344q984M400k132j2094m828P573
13587A0811M699R531J3405j3972j1549q841n075q73K845P773N75l498l195K467
13573E103N901R752j346m052l22k864j460j631N25l316L319P201m332n836m914
13558A728M340K145O355l359l425J521P594K478L301L531q901J596P152M03p927
13543A8532j2504o379k401O56n641L341O394P497m416q444O874q519p69N540L782
13528C543j1617J999J0344R207J715n081j0657q098p315j848J2224P104m313J89
$$ plain form
13630 -7671 -5588 2117 7478 11710 1542 8193 8874 912 -1090 2132 10307 14184 14255 13664 8591
13615 8591 11988 24045 37404 40272 35372 32685 40006 35709 19936 16688 21321 28286 21276 15651
13601 15651 16506 6818 996 11498 17358 10259 21532 26876 17892 22292 20160 8066 3238 10811
13587 10811 15510 25041 38446 24474 12925 4084 -991 -1864 981 8754 9329 5831 2636 5103
13573 5103 11004 20756 19410 15358 15036 12172 10712 9081 9606 6290 9609 16810 12478 6642 1728
13558 1728 6068 8213 14568 11209 7784 9305 16899 19377 22678 26209 17308 18904 26056 26459 18532
13543 18532 6028 -351 -2752 -2096 -7737 -4396 1998 9495 5079 -3365 3509 -5010 -5779 -239 3543
13528 3543 -8074 -6075 4269 13476 15191 10110 -547 -8645 -15960 -17808 -5584 1520 -2793 -2604
13514b604K482o192k879o233R855J4557J908R34m344j30J035L466m890Q48n51
13499G262j519J170n765r135l903Q649P79Q005N429M697M668j1122K830K649L896
13484A8590j0716q843j460K131N925m574R464L801k45p636k367m250K98P15M889
13469E722p915j0798J0743J2729J1196p955N305k901l951k3r379n542m064j541
13455h374M23R750J0280L969p115o406R769M316L748L729j2839r563p96O081R869
13440A6841J2558q82m861o847j679M463N72m08q559n430l962m813O769K444R81
13425G187K920l769j391R657n55k517n464J55j167K601J098n332J290Q311p106
13410E918p593M630K026P356J1177L387p323j7453K021J784R910J334n981q228
$$ plain form
13514 -2604 -122 -6314 -9193 -15426 -5571 8986 10894 11828 7484 7354 8389 11855 6965 7813 7262
13499 7262 5743 6913 1148 -7987 -11890 -3241 -2462 5543 10972 15669 20337 9215 12045 14694 18590
13484 18590 7874 -969 -2429 -298 5627 1053 10517 14318 14073 6437 4070 -180 118 833 5722
13469 5722 -2193 -12991 -2248 10481 21677 13722 19027 16126 12175 12152 2773 -2769 -6833 -8374
13455 -8374 -7951 1799 12079 16048 8933 2527 12296 16612 20360 24089 11250 1687 891 6972 16841
13440 16841 29399 28517 23656 16809 15130 19593 20165 19757 11198 5768 1806 -3007 3762 6206 7187
13425 7187 10107 6338 4947 14604 14049 11532 6068 6223 5056 7657 8755 3423 4713 13024 5918
13410 5918 -1675 2955 4981 12337 23514 26901 19578 2125 4146 5930 15840 17174 11193 2965
13396B965j907q0r775J657K530J9L858k543l105M22J1741P178j824k362M8l04
13380H518k730j366N507Q097p865k278J8353k864j9975q346J761O837n972j259
13366c582j242o045K450K87p97Q288p033P62L681o14K919P154n673o994J135P456
13350B152M901L109q922q7M10M169J391q461J042Q940K028J1677n683m297k51
13335A2118O59l48L914J662N560l467j005N73p8r75o496J590j929o894Q826J224
13319A4934j1028j0991k867J0678P916k973m915Q81n48o697j9785L68P928J108
13305a5991P535R392m674K169N257k203n825J1692K522J210R899q773M13J052
13291A3675l180K222k727o671K101R454L419L64j088j721M738O325p13j139N85
$$ plain form
13396 2965 1058 978 -8797 -7140 -4610 -4591 -733 -3276 -6381 -5959 5782 12960 11136 8774 8822 8518
13380 8518 5788 4422 9929 18026 10161 7883 26236 23372 3397 -4949 -3188 3649 -2323 -3582
13366 -3582 -4824 -10869 -8419 -8132 -8929 -641 -7674 -6912 -3231 -3845 -926 6228 555 -6439 -5304 2152
13350 2152 7053 10162 1240 1153 1563 5732 7123 -1338 -296 8644 10672 22349 16666 12369 12118
13335 12118 12777 12429 16343 18005 23565 20098 19093 19666 19588 18613 12117 13707 11778 4884 13710 14934
13319 14934 3906 -7085 -9952 726 8642 5669 754 1635 1087 -5610 -25395 -25027 -17099 -15991
13305 -15991 -8456 936 -3738 -1569 3688 1485 -4340 7352 9874 11084 20983 12210 12623 13675
13291 13675 10495 12717 9990 3319 5420 14874 18293 18657 17569 15848 20586 26911 26198 25059 25644
13276B5644J390l600j2848O945J0044K683p81K360k827l241k470o843o992K877
13262A2341j392K844J818j5k525n929j5l211k354L269o213n411J840j320M674
13247a599N947N788R389q123r689M262K454m583l062K694J4645J1091L232n461
13233B6985O81m118j917M731L611r051l402m184N97K432l52p183L615R842j0050
13218A2237n112r99O005J1454K382l19Q666r787r684n54J787L160k754o368O224
13203A6338O814r017n446k732L892lN823M824j445L61k188J5074R557j3486r268
13188A9098o812P270J418n421m582J628J6051Q383J361j530p206J146q36j1079
13174A8889j962n55L320P792K31J2798J7817J2324Q409l471O437J3111J6358J7992
$$ plain form
13276 25644 27034 23434 10586 17531 27575 30258 29477 31837 29010 25769 23299 16456 9464 12341
13262 12341 10949 13793 15611 15596 13071 7142 7127 3916 1562 4831 -1382 -6793 -4953 -6273 -1599
13247 -1599 4348 10136 19525 11402 1713 5975 8429 3846 784 3478 18123 29214 32446 26985
13233 26985 27666 23548 21631 26362 29973 20922 17520 13336 13933 16365 16013 8830 12445 22287 12237
13218 12237 7125 6126 12131 23585 25967 25648 34314 24527 14843 14289 16076 19236 16482 10114 16338
13203 16338 23152 14135 8689 5957 9849 9846 15669 20493 19048 19409 17221 32295 41852 28366 19098
13188 19098 12286 19556 20974 15553 10971 12599 28650 37033 38394 36864 29658 30804 29968 18889
13174 18889 16927 16372 19692 27484 27715 40513 58330 70654 79063 75592 82029 95140 111498 129490
13160A29490J8608M0188N4099R3367J19477J51762J50768J46890J29515J18518
13150A152682P6032J9642n2278r6741j21988j37884j49971j47041j28236j00086
13140C14131o9661n7532m0194j4022p237j7436j7001n920q203q945j2151r632
13128D6197q4J591m944l045J640l313P770K387j7126j42K87k806o882J229j560
13113B1199Q962J0022K807k860j24n799O44j697n066N799O647l221j0669q635
13099A8009k614J674L27N051j091m147j2419q808N018M777J956O603L669N626
13085B3631n703k452L457j370O144K236K647L986L868j59M124l250K25l117n060
13070B9207q305n92L002n589q811j764P130m871l039Q85Q126k886o16M178L509
$$ plain form
13160 129490 148098 188286 242385 335752 455229 606991 757759 904649 1034164 1152682
13150 1152682 1228714 1248356 1196078 1099337 977349 839465 689494 542453 414217 314131
13140 314131 244470 186938 146744 132722 125485 108049 91048 85128 76925 67980 55829 46197
13128 46197 46113 47704 42760 39715 41355 38042 45812 48199 31073 30931 31218 28412 21530 22759 21199
13113 21199 30161 40183 42990 40130 40006 34207 34851 33154 28088 33887 40534 37313 26644 18009
13099 18009 15395 17069 17396 22447 21356 17209 4790 -4018 1000 5777 7733 14336 18005 23631
13085 23631 17928 15476 18933 17563 23707 25943 28590 32576 36444 36285 40409 37159 37384 34267 29207
13070 29207 20902 20310 23312 17723 8912 7148 14278 9407 6368 7253 15379 12493 11877 16055 19564
13055A9564r236l990P929L17R60K654n970m190o532l135L323M444J0362K411n146
13040A3765j1296k062J863k769Q370J2511J0348Q623o106M781j083m212K056J371
13026C6160n430M152m161l713M402n081l230K276L886J427K128M109j557o230
13012B9138O87m304q155J1915M974K424M756q76j046M816J669R254P623N806n478
12997F3203m407P631O932J5990J0269M833R568k918n294o654M221J9486L049k718
12983A23191j602m53J0884N800P47k170R171p860j2130j3011q499j3706j0575
12970G9787J502r086j4640j0231p164j0564m053r822j870J2790J3354M745M741
12957D9489K852p2k65M62L551M272J108M887J075j840m526l141M032j750k167
$$ plain form
13055 19564 10328 6338 14267 14584 15544 18198 12228 8038 1506 -1629 1694 6138 16500 18911 13765
13040 13765 2469 407 2270 -499 7871 20382 30730 39353 33247 38028 36945 32733 34789 36160
13026 36160 30730 34882 30721 27008 31410 26329 23099 25375 29261 30688 32816 36925 35368 29138
13012 29138 29825 25521 17366 29281 34255 36679 41435 40559 39513 44329 45998 55252 62875 68681 63203
12997 63203 58796 66427 73359 89349 99618 104451 114019 111101 105807 99153 103374 122860 125909 123191
12983 123191 121589 121136 132020 137820 138567 136397 145568 137708 125578 112567 104068 90362 79787
12970 79787 81289 72203 57563 47332 40168 29604 25551 15729 13859 26649 40003 44748 49489
12957 49489 52341 52269 52004 52466 56017 60289 61397 66284 67359 65519 60993 57852 61884 60134 57967
12942E7967n590K76R477L732l509o085j120q75j937n028J186l884L552P438J2108
12927F7708J7586O709o549R31M770Q51o877o82P65l948j675q784j3188j5051n465
12912C7101l284m302m390M730O254J2298R065M712L52n120P093J1900N025q69
12898H0565L705j536P46J2962R20L661R656j702J501R018J1104J403o879M952
12884A30076J4073K548J305m303j4355j6346j288k438l067j1143m970P212J2764
12871A10068n9K408K777j377j0185j6814o796O059Q460K4993L5014M5613N5100
12858B55261P5391P5224P5210P9859O5738L7575R641q096l4702o1019p6672o8238
12846D25172o3788m6893m9207l5496j3173k33N436N406J78j921p806p443Q161
$$ plain form
12942 57967 52377 52653 62130 65862 62353 56268 55148 54273 52336 47308 48494 44610 48162 55600 67708
12927 67708 85294 92003 85454 86385 91155 92006 85129 84447 85212 81264 79589 70805 57617 42566 37101
12912 37101 33817 29515 25125 29855 36109 48407 57472 62184 62536 57416 64509 76409 81434 80565
12898 80565 84270 82734 83480 96442 97362 101023 110679 108977 110478 119496 130600 132003 125124 130076
12884 130076 144149 146697 148002 143699 129344 112998 111710 109272 106205 95062 90092 97304 110068
12871 110068 110009 112417 115194 113817 103632 86818 80022 86081 94541 119534 154548 200161 255261
12858 255261 330652 405876 481086 560945 626683 664258 673899 665803 631101 570082 493410 425172
12846 425172 361384 314491 265284 229788 216615 216382 221818 227224 227402 225481 217675 210232 218393
12833B18393J0491k053j829Q551J1131J0368J472n933l664K640N472k263l965
12820B48811o841r953r488n04J0924J1328J5281J4489J2769N216J0173J4681J3593
12807C30479J1483J0701M178O336K742j542N663J3975K9597K3487J4901R248J2025
12794D73273K1894J6604J8781L2701L0531L1112N2879R3696J16438J46975J44230
12783A179114J42306J25886R7120O8401J5756l3796n9462p9880q9696q9112n8265
12772A218372l1972k9K9797M0521M9702N9829N5326M3251M9851N6148O1573O2801
12760A695170P4400Q7729J01238J22803J39767J67971J90549K20415K54387L02584
12750C357013L70064M42078N29412O62812Q20478R72446J086337J206044J331182
$$ plain form
12833 218393 228884 226831 225002 233553 244684 255052 256524 250591 246927 249567 255039 252776 248811
12820 248811 241970 232017 222529 222025 232949 244277 259558 274047 286816 292032 302205 316886 330479
12807 330479 341962 352663 356841 363177 365919 364377 370040 384015 413612 437099 452000 461248 473273
12794 473273 495167 511771 530552 563253 593784 624896 677775 771471 887909 1034884 1179114
12783 1179114 1321420 1447306 1544426 1612827 1628583 1594787 1535325 1455445 1365749 1276637 1218372
12772 1218372 1186400 1186371 1216168 1256689 1306391 1366220 1421546 1464797 1514648 1570796 1632369 1695170
12760 1695170 1769570 1857299 1958537 2081340 2221107 2389078 2579627 2800042 3054429 3357013
12750 3357013 3727077 4169155 4698567 5361379 6181857 7154303 8240640 9446684 10777866
12741A0777866J509262J716089J983178K409527L222160M659767P113528J1138845
12733D4530222J7088067K3550968K7131087K8287527K6811852K5337125K1252855
12726B13989703J3814479J756591j0749126j9248302k4168900k6329688k8178781
12719A20885976k7849830k4949251j8919294j2568236p973114n159732l513968
12712A9952551k551569k030937j763388j595633j444062j328630j199738j074226
12704F964368r25523p49310o02642m93927l89845l18588k79076k32537k17616
12695B755304k02026j75904j58364j43788j42158j31647j19435j13802r3649q2429
12685A392102n7540n5986n0022m4724l2077l3013l0011l0724k7007k2259k4066
$$ plain form
12741 10777866 12287128 14003217 15986395 18395922 21618082 26277849 33391377 44530222
12733 44530222 61618289 85169257 112300344 140587871 167399723 192736848 213989703
12726 213989703 227804182 229560773 218811647 199563345 175394445 149064757 120885976
12719 120885976 93036146 68086895 49167601 36599365 28626251 23466519 19952551
12712 19952551 17400982 15370045 13606657 12011024 10566962 9238332 8038594 6964368
12704 6964368 6038845 5289535 4686893 4192966 3803121 3484533 3205457 2972920 2755304
12695 2755304 2553278 2377374 2219010 2075222 1933064 1801417 1681982 1568180 1474531 1392102
12685 1392102 1334562 1278576 1228554 1183830 1151753 1118740 1088729 1058005 1030998 1008739 984673
12674I84673m6912l8513k6929k9037k1827j4355j6857j4627j4510k3266j6747
12663G21093j4723m584j0231L293J0951M2290M8816O4639P6205P8594P7469O6151
12651A159963L3086j3304n7110q4189r8715j07644j15898j03384q5208o3478m1655
12640D22464j7984j6619p564n407p452p061j0807j9433k2366j0272j2765j4814
12628B69920j5768j5389o930j0236p205m742j5216j3695J192J4779P451l152M519
12615B05528J2741q757j324K013M755r603k0267j3136j34j3758k2643k0823j0022
12602A04570l002lM397O441J4416K0634L1832K6260J8324K5309J4890o72q334
12589B55062j604n960o331j3840j7976j1532j0195r505o347j1728r206l009L893
$$ plain form
12674 984673 937761 899248 872319 843282 821455 807100 790243 775616 761106 737840 721093
12663 721093 706370 701786 691555 694848 705799 748089 796905 861544 937749 1016343 1093812 1159963
12651 1159963 1193049 1179745 1122635 1038446 939731 832087 716189 612805 527597 464119 422464
12640 422464 404480 387861 380297 374890 367438 360377 349570 330137 307771 297499 284734 269920
12628 269920 254152 238763 231833 221597 214392 209650 194434 180739 181931 196710 204161 201009 205528
12615 205528 218269 209512 208188 210201 214956 205353 185086 171950 171816 158058 135415 114592 104570
12602 104570 101568 101565 105962 112403 126819 147453 179285 205545 223869 249178 264068 263396 255062
12589 255062 253458 247498 241167 227327 209351 197819 187624 178119 171772 160044 150838 147829 151722
12576A51722p642j1749k099l491n591o909q186j475m725r708n724O88Q893R52
12562I4956J1494j0580l463O732M132q18N395O465M022j971K083N135J1411L828
12548A38821L357j682J604J0570K3548J7121K0588J6861K6564K3015J6059K8189
12536C24615N8496Q2004J01186J08463R5646Q4587N8089L1993l2147p8881r3309
12525G40742j01667j15989j07916q4289o7177m1506l1501k4983q703j0907q513
12514A37591j0076j2848n64K027o636j3362k841p996j0818p082l905l362O45k905
12500E7868k032P137L018P629J47k588O082j255L429P644R040P912N34n664k293
12485I6608n478k699m242J0555R070N781m007J145j9735j6556K166N932k963q747
$$ plain form
12576 151722 144080 132331 130232 126741 121150 114241 106055 104580 99855 90147 84423 85111 94004 94956
12562 94956 106450 95870 92407 99139 103271 102453 107848 114313 118335 116364 118447 123582 134993 138821
12548 138821 142178 140496 142100 152670 176218 193339 213927 230788 257352 280367 296426 324615
12536 324615 383111 465115 566301 674764 770410 854997 913086 945079 912932 834051 740742
12525 740742 639075 523086 415170 330881 263704 222198 190697 165714 157011 146104 137591
12514 137591 127515 114667 114103 116130 109494 96132 93291 85295 74477 67395 63490 60128 60773 57868
12500 57868 55836 62973 65991 73620 73767 71179 77261 76006 79435 87079 96119 104031 104565 98901 96608
12485 96608 91130 88431 84189 94744 103814 109595 105588 106733 86998 70442 72608 78540 75577 66830
12471F6830L536j09J6182J8952k007q166j1064j1J386j3198o586p84l191M424
12457F6194j0687r396n57j676l87J138q711J494j150o71j2842J746J2688R476
12443D6659n789M57O887N953j214O371O081p840j2420j334k701m363k156L937
12429C8528L414r017n725j446O077J040o963M106k03L347K543M984O743J657l43
12414D8742J571J203n956o308J3836L86n441q304q334P191K910K746P314K1338
12400G2894J9799J9474K0219J5051j611j6616k2801j8975o751p372J799J0328
12388H5438K7545K8551J3832k0060l1393k9250j2692M45k910r396j532o07j2134
12375C5837n743N227J808K242j3768k859J2021R202k230l956l716j711l746m10
$$ plain form
12471 66830 70366 70257 86439 105391 103384 95218 84154 84143 85529 72331 65745 64961 61770 66194
12457 66194 55507 46111 45554 43878 43491 44629 35918 37412 36262 35591 22749 24495 37183 46659
12443 46659 40870 41327 48214 54167 52953 59324 65405 57565 45145 43811 41110 36747 34591 38528
12429 38528 41942 32925 27200 25754 31831 32871 25908 30014 29811 33158 35701 40685 47428 49085 48742
12414 48742 50313 51516 45560 39252 53088 53474 48033 39729 31395 38586 41496 44242 51556 72894
12400 72894 92693 112167 132386 147437 145826 129210 106409 87434 80683 73311 75110 85438
12388 85438 112983 141534 155366 135306 103913 74663 61971 62416 59506 50110 48578 47971 35837
12375 35837 30094 35321 37129 39371 25603 22744 34765 43967 41737 37781 34065 32354 28608 28198
12361B8198p83J083j177l031l886m503J122L375n26J8286J4010m762L269P081
12347E7756R059k107J1007j704j0069o592p869o35J000L096p350n794Q489L457
12333E1744k047K370Q122p433j0268J0507P229N412M511J911k340Q516P080q907
12319G6407J960j201j741k606j731J6496J3877J4281O897J1748J8088J4805P382
12306A74662J5776J9385L9975Q7144J24150J40666J53944J47478J32947J15951
12296A152078P9877K3101m4993r8701j34883j50047j47939j41710j32129j05063
12286B99591p5935m4683j9272j9867j3639r464k2889p000J732o95j2386o561M772
12273G3704r225o418p632j4051p21Q97k921O115M431J650L863K584q322j0416
$$ plain form
12361 28198 27415 28498 27321 24290 20404 15901 17023 20398 19872 38158 52168 47406 50675 57756
12347 57756 66815 64708 75715 74011 63942 57350 49481 48846 49846 52942 45592 39798 48287 51744
12333 51744 49697 52067 60189 52756 42488 52995 60224 65636 70147 72058 69718 78234 85314 76407
12319 76407 78367 77166 75425 72819 71088 87584 101461 115742 122639 134387 152475 167280 174662
12306 174662 190438 209823 249798 336942 461092 601758 755702 903180 1036127 1152078
12296 1152078 1231955 1255056 1210063 1111362 976479 826432 678493 536783 404654 299591
12286 299591 223656 178973 159701 139834 126195 116731 93842 86842 88574 87879 75493 68932 73704
12273 73704 64479 58061 50429 36378 35657 36554 33633 39748 44179 45829 49692 52276 43954 33538
12259C3538k002L990M795l291J82l177J043N247j551L26Q958M164n40j1729p440
12244C2513n28q726o406Q573R705l56K088j914n827K053p163o137L197M799N20
12229B6391j5986o653O503O109N286p736j74L298m45m400n087J0417L968p35K878
12214B3634L16p844k772M613l27o129p541k587Q29L148j661j736O643R527j515
12199A6598J107n236K686P795K828r12n064q546r292J1470L422o582K799l577
12185I496m666k582o513N044J1247Q618k634l285j2092m679L548K802J938j86
12171F056M103J860J110J1934K900m683j3616M245n318m94k836n673k658j687
12157d757M821j1145j284l403L981L022N753J3091P163P656n176j3372P347P374
$$ plain form
12259 33538 31536 35526 40321 37030 37212 34035 35078 40325 38774 39100 48058 52222 51682 39953 32513
12244 32513 31985 23259 16853 25426 35131 34775 36863 34949 29122 31175 24012 17875 21072 25871 26391
12229 26391 10405 3752 10255 16364 21650 13914 13740 17038 16593 12193 7106 17523 21491 20756 23634
12214 23634 23950 16106 13334 17947 17620 11491 3950 1363 2192 5340 3679 1943 8586 18113 16598
12199 16598 17705 12469 15155 22950 25778 24866 19802 11256 1964 13434 16856 10274 13073 9496
12185 9496 4830 2248 -4265 779 12026 20644 18010 14725 2633 -2046 1502 4304 6242 6056
12171 6056 10159 12019 13129 25063 27963 23280 9664 13909 8591 8097 5261 -412 -3070 -4757
12157 -4757 64 -11081 -12365 -15768 -11787 -8765 -3012 10079 17242 24898 19722 6350 13697 21071
12143B1071k423P51p376M289R699q47n732j0288k0176j543R373K329J5N502J1454
12128A6098M689q791m314k238n05J163j749P00m772p284J926J416j256L083M992
12113C158L898k224j79M425O510n157M070l006p458K447Q541J0002N531j408j739
12098B7411q328j2559o36J723L705M85K856Q423j122n765L235j125O36N806O544
12083C1289n631j277j882K099M435n174j459j277P517J475r000L862k180n42l35
12068B1920m555k819m24M718m760r211N653P821m315k884m668L79j0383N358K088
12053C918j648R088R521j22Q331N245J321m026r442j4779J542k233j0995k012
12039f291Q23J320L963j683J4075L985j6196p936q21J44P551R031M115j95n484
$$ plain form
12143 21071 18648 19399 12023 16312 26011 25164 19432 9144 -11032 -12575 -3202 -873 -858 4644 16098
12128 16098 20787 11996 7682 5444 4939 6102 4353 5053 281 -7003 -5077 -3661 -4917 -1834 3158
12113 3158 7056 4832 4653 9078 15588 10431 14501 11495 4037 6484 15025 25027 30558 29150 27411
12098 27411 19083 6524 5888 7611 11316 11801 14657 23080 21958 16193 19428 18303 18939 24745 31289
12083 31289 25658 24381 22499 24598 29033 23859 22400 21123 28640 30115 21115 24977 22797 22255 21920
12068 21920 17365 14546 14122 18840 14080 4869 10522 18343 14028 11144 6476 6855 -3528 1830 3918
12053 3918 2270 11358 20879 20757 29088 34333 35654 31628 22186 7407 8949 6716 -4279 -6291
12039 -6291 -5468 -4148 -185 -1868 12207 16192 -4 -7940 -8761 -8617 -1066 7965 12080 11885 6401
12024F401N90M745L063k550P47k675M347Q334K890j1238r036P335p01l595k063
12009F594M987M638Q37M908J0188o014j1426j842p405j348N330P330r667n263
11995A847m284n945n024K741K391K067l821O98K990N549L828m438r1K086K288
11980B882k745n333o194L157N080K298m638j0644N565L028J619J71P73L349J93
11965a439J793J70l904M690J640p240j4720o859J530P270o833n060L270O672N950
11950a3070Q36j3389J40Q691j171P818K04j564P028o302o31J71r26L091P165p39
11934b648j273M680M891Q453k989j1950n337R484P355j220j2875O367N076m700
11920C314n190K136K493K108j13j2296m452K112R976Q914J1114q00m732L564l849
$$ plain form
12024 6401 6991 11736 14799 12249 12996 10321 14668 23002 25892 14654 5618 12953 12252 8657 6594
12009 6594 11581 16219 17056 21964 32152 26138 14712 12870 5465 4117 9447 16777 7110 1847
11995 1847 -2437 -8382 -13406 -10665 -8274 -6207 -10028 -9330 -6340 -791 3037 -1401 -1492 594 2882
11980 2882 137 -5196 -11390 -8233 -3153 -855 -5493 -16137 -10572 -7544 -5925 -5754 -4981 -1632 -1439
11965 -1439 354 524 -3380 1310 2950 -4290 -19010 -25869 -24339 -17069 -23902 -28962 -25692 -19020 -13070
11950 -13070 -12234 -25623 -25483 -16792 -17963 -10145 -9941 -11505 -4477 -10779 -11410 -11239 -12165 -9074 -1909 -2648
11934 -2648 -3921 759 5650 14103 11114 -836 -6173 3311 10666 9446 -3429 2938 8014 3314
11920 3314 -1876 260 2753 4861 4748 -7548 -12000 -9888 88 9002 20116 19316 14584 18148 14299
11905A4299j3147l141O368R024L454j0201q591l149m633k764p217P734J7399N696
11891A1131q56n098q29q902k100j563N278L611J452P330P20j005n106J822l362
11876B523K998J117J829j477l545k511M339j0440o806O503J9121q213j1127M917
11862g72P378N547K934O924K673O717J0742K3176L0517n332k8922j4030j3908
11849C3644j2647j631K839j645j1667O716J362m375O780K145Q176J4480L1798
11836G5975M5502M9903j2085m8248m0935k4299j6091k0570n289J0532R302j0364
11824A3333r231L733O55K201k999n610l1L489J2910K39q970m38o669q813j1560
11809a7761L313L609P841R192k654P061L75p932m076N607n20r502k316J782K958
$$ plain form
11905 14299 1152 -1989 4379 13403 16857 6656 -1935 -5084 -9717 -12481 -19698 -11964 5435 11131
11891 11131 10275 5177 4348 -4554 -6654 -8217 -2939 672 2124 9454 10174 9169 4063 5885 2523
11876 2523 5521 6638 8467 6990 3445 934 5273 -5167 -11973 -5470 13651 5438 -5689 -772
11862 -772 6606 12153 15087 22011 24684 31401 42143 65319 95836 90504 61582 47552 33644
11849 33644 20997 19366 22205 20560 8893 15609 16971 12596 19376 21521 29697 44177 75975
11836 75975 121477 171380 159295 111047 70112 45813 29722 9152 3863 14395 23697 13333
11824 13333 4102 7835 8490 10691 7692 2082 2051 5540 18450 18689 9719 9281 2612 -6201 -17761
11809 -17761 -14448 -10839 -2998 6194 3540 10601 10976 3044 -1032 4575 4055 -5447 -7763 -5981 -3023
11794c023O524N299l199k529j670M807L902p548m444O79K295m314m914K433j0693
11779a6395J751J1388Q624k132k699j436p138k798n127P56L121p1n424K169J0199
11764e212J3458m126j4034K408j6848m48K444L110J2088J3806m80q012O33K964
11750A751K094n057n996j283K620k456J0132N846k851j81m409k46L656m896j5091
11735a6367J544N746L779K561k036N465K17k210m558M048r66o796K07L99p666
11720a6633J857m731L151Q251N464j0974m279Q747L39L081r215o743K766n734
11706b4653O631J1403l2j205R824O708p898m783M097Q341p15K940m457l265o951
11691d015J1745K794O62k881l141O962q70r514j7262L492L067Q34j320j673Q51
$$ plain form
11794 -3023 3501 8800 5601 3072 1402 6209 10111 2563 -1881 -1202 1093 -3221 -8135 -5702 -16395
11779 -16395 -14644 -3256 5368 3236 537 -899 -8037 -10835 -15962 -15206 -12085 -12156 -17580 -15411 -5212
11764 -5212 8246 4120 -9914 -7506 -24354 -24802 -22358 -19248 -7160 6646 6166 -1846 -1213 1751
11750 1751 3845 -1212 -7208 -8491 -5871 -8327 1805 7651 4800 4619 210 -36 3620 -1276 -16367
11735 -16367 -14823 -9077 -5298 -2737 -4773 692 909 -1301 -5859 -1811 -2777 -9573 -9366 -8967 -16633
11720 -16633 -14776 -19507 -16356 -8105 -2641 -13615 -17894 -9147 -8808 -5727 -14942 -21685 -18919 -24653
11706 -24653 -18022 -6619 -6651 -7856 1968 8676 778 -4005 92 8433 7718 10658 6201 2936 -4015
11691 -4015 7730 10524 11186 8305 5164 12126 11256 1742 -15520 -12028 -8961 -8127 -9447 -11120 -10269
11676a0269J532J568N850j022K633l311k885r21m192R8K963J1358P789q51q04
11661I536j987r384J763k986n880J551K004r71j711o774O957J0347n685n152Q405
11646C3P410O095n420J55K055M908M906n465l891L271p71j3060n781L782P406
11631E633J3117m978j0912j2730Q851Q256j971R67k00p181k872p985R804L274
11617A073J183q365n080J583J2546L240m205j646R10n462O405o92m031j914j707
11602f162K778m473P730Q547o064o023N273K586O921M70m084m443k488l212n025
11587g669j117J314O721J090o650O002M703j1992l301J791M084M576p706J697
11573f457R61k422m572j35N107J3910n301K052n145o144J961M960n946j909n06
$$ plain form
11676 -10269 -8737 -7169 -1319 -2341 292 -3019 -5904 -6825 -11017 -10919 -7956 3402 11191 10340 9536
11661 9536 7549 -1835 -72 -3058 -8938 -7387 -5383 -6354 -8065 -14839 -7882 2465 -3220 -8372 33
11646 33 7443 13538 8118 8273 10328 15236 20142 14677 10786 14057 13286 226 -5555 -1773 5633
11631 5633 18750 13772 2860 -9870 -1019 7237 5266 6233 6033 -1148 -4020 -12005 -2201 1073
11617 1073 2256 -6109 -11189 -9606 2940 6180 1975 329 1239 -4223 2182 1490 -2541 -4455 -6162
11602 -6162 -3384 -7857 -127 8420 2356 -3667 1606 4192 11113 11583 7499 3056 568 -2644 -7669
11587 -7669 -8786 -7472 -751 339 -6311 -309 4394 -7598 -10899 -9108 -5024 -448 -8154 -6457
11573 -6457 -5496 -7918 -12490 -12625 -7518 6392 1091 3143 -2002 -8146 -6185 -1225 -7171 -9080 -9586
11558i586P547L224j962J212j648p653L680J760N009m83m896m379p933J741Q382
11543e985Q261L991k737j3018l984P712Q647k082m770k124J0073J412N964j565
11529I795k052K010n533k604l02M87m854j287p87m64J06r790o74J0226Q228K810
11513E315k657L550j2046K966L223K51o767m185J36J1342N643K334J371q778n004
11498c306p20M567j337n595P23O325J150m358J153L239n024k618J990m098o560
11483a4469j091Q153J5798l165n301m318N652M966L022r513n575p022Q934J7017
11469A3088P181J90o453K634p1j2227k16J32k261k422r984J820R111L543J29l00
11453C894p557j771J8M292m059M023K206N565k972q658l137M45Q314N854k540
$$ plain form
11558 -9586 -2039 1185 -777 435 -1213 -8866 -5186 -3426 1583 1100 -3796 -8175 -16108 -14367 -5985
11543 -5985 2276 6267 3530 -9488 -13472 -5760 2887 805 -3965 -6089 3984 5396 11360 9795
11529 9795 7743 9753 4220 1616 1314 1801 -3053 -4340 -5127 -5591 -5485 -15275 -15949 -5723 2505 5315
11513 5315 2658 6208 -5838 -2872 351 602 -6165 -10350 -10214 1128 6771 9105 10476 1698 -3306
11498 -3306 -4026 541 -796 -6391 -5668 657 1807 -2551 -1398 1841 -3183 -5801 -3811 -7909 -14469
11483 -14469 -15560 -7407 8391 5226 -75 -4393 1259 6225 9247 -266 -5841 -12863 -3929 13088
11469 13088 20269 20459 14006 16640 16569 4342 4126 4258 1997 -425 -10409 -8589 522 4065 4194 3894
11453 3894 -3663 -5434 -5416 -1124 -5183 -1160 1046 6611 3639 -5019 -8156 -7711 603 6457 3917
11438C917j661j85n570K798R8r0P169J76n250q692k750M98n959j187M431L092
11422i165J861Q978Q689j262r209l060p77O018L405M636M008j15Q982p087o132
11407I770q500l778l625R502J0061K134M990k117m757k719n049P74J952J0434
11393A9072l181o890n522j841n177p26k907K830J3459M525n533p869n750J70J093
11378d247M385O782N604J1507R965j5413j3245M812j027l652o856K808J09K832
11364D364K133J794Q63m372P688J1897m647M705l092M133Q283O561l01j320r493
11349B9196N023K773p920M513m57o040o896M289J2421J5361J9162L0969K1407
11336A23801K1828K7668K9271L2573M6018N0238M6591L6412J3070q824l4308l4597
$$ plain form
11438 3917 2256 2071 -3499 -701 -603 -693 6476 6652 1402 -7290 -10040 -9542 -15501 -16688 -12257 -9165
11422 -9165 -7304 1674 10363 9101 -108 -3168 -3945 2073 5478 10114 14122 14007 22989 15902 9770
11407 9770 1270 -2508 -6133 3369 13430 15564 20554 18437 13680 10961 5912 6686 8638 19072
11393 19072 15891 9001 3479 1638 -3539 -4265 -7172 -4342 9117 13642 8109 240 -5510 -5340 -4247
11378 -4247 138 6920 12524 24031 33996 18583 5338 10150 9123 5471 -1385 1423 1532 4364
11364 4364 6497 8291 9154 4782 12470 24367 19720 24425 21333 25466 33749 40310 40009 38689 29196
11349 29196 34219 36992 29072 33585 33128 27088 20192 24481 36902 52263 71425 102394 123801
11336 123801 145629 173297 202568 235141 281159 331397 377988 414400 427470 418646 384338 349741
11324C49741k5661n3033m7811l8409k7275k2747l2828k6364j0207j1932l295q422
11312D1757q472j0201k322L961R172l683q323l095M047l387M162k004m961k327
11298A4324k307l216J283L625J654R044j675r468L072k711L062K227L37q456M71
11283A1266m75K492K890J230N385N832l515j5379n368k635J029m065J62M804Q719
11268A2372m88j1487k823M30N417M799l734k734j923j959l966M874M303J3974
11254A7055P261l390n136o217R31M147N726l246J1471N045l223n268P807K736
11240C5699N633J9620J6621J9881M6398P6158Q1643N0785K644p294k6692o9152
11228B51944q4371o0528l2063j8316q896j0030j1000p193l460n962r731L064K988
$$ plain form
11324 349741 324080 271047 223236 184827 157552 134805 101977 75613 65406 53474 50179 41757
11312 41757 33285 23084 20762 24723 33895 30212 21889 18794 22841 19454 23616 21612 16651 14324
11298 14324 12017 8801 10084 13709 15363 24407 22732 13264 16336 13625 16687 18914 19251 10795 11266
11283 11266 10791 13283 16173 17403 22788 28620 25105 9726 4358 1723 2752 -1313 -1151 3653 12372
11268 12372 11884 397 -2426 -1996 3421 8220 4486 1752 -171 -2130 -6096 -1222 3081 17055
11254 17055 24316 20926 15790 9573 10504 14651 20377 17131 28602 33647 30424 25156 32963 35699
11240 35699 41332 60952 77573 97454 143852 220010 301653 352438 355082 347788 321096 251944
11228 251944 167573 107045 74982 56666 47770 37740 26740 19547 16087 10125 394 3458 6446
11215F446j735m556R645J0567l592j358P044j1113o795J062j462m310l943l412
11201g512R06M700Q069L113k76r296q201N388K20o453P694K674M021P947p75l825
11185H394Q99o049j0952M131Q527kp115l715m489P327J0882l591l088m226p99
11170c866P549N174J316K322q959r668K407M237Q30R04R432p643o97M778M727
11155A2843K156O008L826j1874q697J312M54O707n09o831N092K252m665k371m442
11140A261Q56J374P431K521j085O000m5m89Q429N713K842j4Q133J7522L5204M9621
11124A45274O3277P1367M1316k2746j8068K0154l467p1217p4533m5957k8857j5114
11112F1429j2862j1507Q63j223n706l296m138n627j876J3019k182r903J679M200
$$ plain form
11215 6446 4711 155 9800 20367 16775 15417 22461 11348 4553 5615 4153 -157 -4100 -7512
11201 -7512 -6606 -1906 6163 9276 9000 -296 -8497 -3109 -2889 -9342 -1648 1026 5047 12994 12219 8394
11185 8394 9293 3244 -7708 -3577 4950 4948 -2167 -5882 -10371 -3044 7838 4247 1159 -3067 -3866
11170 -3866 3683 8857 10173 12495 3536 -6132 -3725 512 1342 2246 11678 4035 3338 8116 12843
11155 12843 14999 21007 24833 12959 4262 5574 6028 12735 12226 5395 10487 12739 8074 5703 1261
11140 1261 2117 3491 10922 13443 12358 18358 18313 17824 26253 31966 34808 34794 42927 60449 95653 145274
11124 145274 208551 279918 321234 298488 280420 300574 297107 225890 151357 105400 76543 61429
11112 61429 48567 37060 37923 36700 30994 27698 23560 17933 16057 29076 26894 16991 18670 22870
11098B2870j486m855k369n448o80O845L713Q282m528r692k421o332M393j696O920
11083A3516j652K958l095k209Q29j446l401M077n433l960P812M007J0774o707
11069A6070m259J369k896l428R022K002j5108K32j1566O769M921J226j549m33
11055B372R92R356M70J758o671j603J512Q79R43j949J155R935L883p175p16J483
11039A6624m510k467m017R46K509K540k514m139J775K569J514K14m728k801j011
11024B504l250L830P477L340L612R06L99M565L570K30P703j2087o329j0030M886
11009A1326K594M003J206l754m1J26L571K237n662k986p639p28L324K778j143
10994I212J444l037J2458Q66m062p497p302O115k394P07N48L659p793M250J4111
$$ plain form
11098 22870 21384 16529 14160 8712 8032 14877 18590 26872 22344 12652 10231 3899 8292 6596 13516
11083 13516 11864 14822 11727 9518 10347 8901 5500 9577 4144 184 7996 12003 22777 16070
11069 16070 11811 13180 10284 6856 15878 17880 2772 3004 -8562 -1793 3128 4354 2805 2372
11055 2372 3364 12720 13190 14948 8277 6674 8186 9065 10008 8059 9214 19149 23032 15857 15141 16624
11039 16624 12114 9647 5630 6576 9085 11625 9111 4972 6747 9316 10830 11044 6316 3515 2504
11024 2504 -746 3084 10561 13901 17513 18419 18818 23383 26953 27183 34886 22799 16470 6440 11326
11009 11326 13920 17923 19129 15375 15334 15460 19031 21268 15606 12620 4981 4253 7577 10355 9212
10994 9212 10656 7619 20077 20943 16881 9384 2082 8197 5803 6510 7058 10717 2924 7174 21285
10979B1285J792J451m226j849K332l317L33j545K990O275J3176r85q090J386L332
10964C4340k103j3909p968j0266M646l167o541M317m406J0097O683N684n801q109
10950C497K399J669m84Q177r464K058M628L801L718j1095J676L247n524M380J1161
10935B3844L554j800n607n020O916K236M876k997o21m806q591k102J3686P075
10921C0643j743J119Q78j0495p900K549J1623R96o700j2803P124O547j408J3606
10907C4036O605p329n807o118l774O373R97j254Q212J347N5N410l549m591K282
10892C2895J19j492p669l325N100P123J696L45K173L768P028J41m245L203o187
10877D0673R33k824j085j2538j3658R806M199q002q800M907P980r634j512L23
$$ plain form
10979 21285 23077 24528 20302 18453 20785 17468 17801 16256 19246 25521 38697 37712 29622 31008 34340
10964 34340 32237 18328 10360 94 4740 1573 -4968 -651 -5057 5040 11723 17407 11606 3497
10950 3497 5896 7565 7081 15258 5794 7852 12480 16281 19999 8904 10580 13827 8303 12683 23844
10935 23844 27398 25598 19991 14971 21887 24123 28999 26002 25381 20575 11984 9882 23568 30643
10921 30643 28900 30019 30897 20402 12502 15051 26674 27670 20970 8167 15291 21838 20430 34036
10907 34036 40641 33312 27505 21387 17613 23986 24983 23729 31941 33288 33343 38753 35204 30613 32895
10892 32895 33014 31522 23853 20528 25628 32751 34447 34792 36965 40733 47761 47902 43657 46860 40673
10877 40673 41606 38782 37697 25159 11501 21307 25506 17504 8704 13611 21591 11957 10445 10768
10863A0768J0399j371M431K62o97L602Q929m424L286Q483j003l270j1019r372
10849A9004q8p47j593R361M947M470j464L310j727J562J2027N121R01j395J239
10834E4928M61k774J435k765M8m696j535P673J3955O364j201L163J372Q162L468
10819H8058N492Q021R387J4389J0226J9048J0901J6845L2841N1465P0570J06348
10807D43591J85011K85189L09802J74764R9901K13839L17902Q6195k51422k82435
10797A582337j38894j03679k55102l11648k34660j39938r2833n8183m0522l3699
10787A73179k3574k971n924l631j5993j6686q518j722L780j1539j3104j652N634
10774G7279K005j145j33N578p71N04L974o959p816j3970j3131j764k759K476L860
$$ plain form
10863 10768 21167 19796 24227 24489 23792 27394 36323 31899 35185 43668 42665 39395 28376 19004
10849 19004 18916 18169 16576 25937 30884 35354 33890 37200 35473 37035 49062 54183 55084 53689 54928
10834 54928 55389 52615 54050 51285 51333 46637 45102 52775 66730 73094 71893 75056 76428 84590 88058
10819 88058 93550 101571 110958 125347 135573 154621 165522 182367 215208 266673 337243 443591
10807 443591 628602 913791 1223593 1398357 1498258 1712097 2029999 2116194 1864772 1582337
10797 1582337 1443443 1339764 1084662 773014 538354 398416 305583 247400 206878 173179
10787 173179 149605 146634 140710 137079 121086 104400 95882 94160 97940 86401 73297 71645 77279
10774 77279 79284 78139 78006 83584 82813 83317 87291 80332 72516 58546 45415 43651 40892 43368 47228
10759D7228j29L26J973O14o672r156n272n641j7404L450R283R507m685J966J8477
10744D3865J4241M869M62J94L098n718j4941r2Q47j1286n233k544J0730J186j089
10729C8589Q541O192n062j1865M000j407k00m10n33K138K448k19n722L981N640
10714D6111j0102M749J3356N539K126n039l337K704p894J947J8908j98k170j626
10700F5074N040K211P032K579m696l337n400j656j532r356j0087N110J3227L084
10686F7293M679k825r443j945P406q384O86M108J2090O728m002P736N053P183
10672I6363J2268j365Q063R470Q948K438l63J5180J0418o135n1J2460J1597J0072
10658A89363P829N767O202P309J3474j792m881J4522K435K67j7361k0657j2362
$$ plain form
10759 47228 47099 47425 49398 50012 43340 34184 28912 23271 5867 9317 18600 28107 23422 25388 43865
10744 43865 58106 62975 63437 63631 66729 61011 46070 45978 46825 35539 30306 27762 38492 39678 38589
10729 38589 47130 53322 48260 36395 40395 38988 38788 38378 37845 39983 42431 42212 36490 40471 46111
10714 46111 36009 40758 54114 59653 61779 56740 53403 56107 48213 50160 69068 68870 66700 65074
10700 65074 70114 72325 79357 81936 77240 73903 68503 66847 65315 55959 45872 50982 64209 67293
10686 67293 71972 69147 59704 57759 65165 56781 57467 61575 73665 80393 76391 84127 89180 96363
10672 96363 108631 107266 115329 124799 133747 136185 135822 151002 161420 155285 155234 167694 179291 189363
10658 189363 197192 202959 209161 216470 229944 228152 223271 237793 240228 240495 223134 202477 190115
10645A90115j1786j5217k7089k3806p871o668N778j0132j0587j7171K20L815J26
10632F9727J723P554M70M505J0260J153o21P369J4947m252k504k282P314j49r320
10617A05894l059O984j211p926j650K87m036k689Q997Q254q894j4004K153J2463
10603A01563J9454j0033k306J2433J2180k619K589J3253J0601L277l420n873j3651
10590A37448j2617k0216k368k7805j7886n455n255K917l600Q437O374p1J525J8517
10576G9945K6992J2719J5008J0208K981o243L106R031Q747J4508J777j119l131
10563A74529L285M014K503Q680Q950P007J2382M341N985O153o089p833j7588k3774
10549A82545l916k861p863L075J09N928J4319J87p272j4468q310n357K890n800
$$ plain form
10645 190115 178329 163112 136023 112217 104346 97678 103456 93324 82737 65566 65786 69601 69727
10632 69727 71450 79004 79474 83979 94239 95392 94771 102140 117087 112835 110331 108049 115363 115214 105894
10617 105894 102835 109819 108608 100682 99032 99319 95283 92594 101591 109845 100951 86947 89100 101563
10603 101563 121017 110984 108678 121111 133291 130672 133261 146514 157115 160392 156972 151099 137448
10590 137448 124831 104615 102247 74442 56556 51101 45846 48763 45163 53600 59974 59903 61428 79945
10576 79945 106937 119656 134664 144872 147853 141610 144716 153747 162494 177002 178779 177660 174529
10563 174529 177814 181828 184331 193011 201961 208968 221350 225691 231676 237829 231740 223907 206319 182545
10549 182545 178629 175768 167905 170980 171089 177017 191336 191523 184251 169783 161473 156116 159006 153206
10535A53206Q057P1144J01351P8166Q4298J65860K05580J59855J02597Q2975M9408
10524A262497m430p3388r8971j52923j71382j26914r3891q4537p2383n3998k9926
10513B99754p037R375K7620J1927J0014K1989K0310J8631J5327j581k980k054
10501D21295P749P789l290k7862j9030p343k844n596p976M591J2060R387j2617
10488C76313M938K3327J4699J2953J5879K4180K6138O072K1369K0941O371r961
10476E43219p373R236L016O674J2899K0815J0107n89J1369K4200K4481J5074J2249
10463F85377R094J2904R273J095K2616M3501M7496L7859K3133M3503N8383L5932
10451A030166Q768L6975N0948N7356N5861N4234P9160J05273J07132R5063J01169
$$ plain form
10535 153206 161263 232407 333758 411924 496222 662082 867662 1027517 1130114 1213089 1262497
10524 1262497 1258067 1184679 1085708 932785 761403 634489 540598 456061 383678 329680 299754
10513 299754 292717 302092 329712 341639 351653 373642 393952 412583 427910 426329 423349 421295
10501 421295 429044 436833 433543 405681 386651 379308 376464 370868 362892 367483 379543 388930 376313
10488 376313 381251 404578 419277 432230 448109 472289 498427 504499 525868 546809 553180 543219
10476 543219 535846 545082 548098 554772 567671 588486 598593 598004 609373 633573 658054 673128 685377
10463 685377 694471 707375 716648 717743 740359 783860 831356 869215 892348 935851 994234 1030166
10451 1030166 1038934 1075909 1126857 1184213 1240074 1294308 1373468 1478741 1585873 1680936 1782105
10440A782105J02325J15269R4514Q2958J01481J31093J23389J10086J14710J66033
10430B923963K09161K23129K47163K90475L79377M96775O47414P64672P06535
10421F888664O16619Q07663J139009J255158J100733J113484J409082J889361
10413A6219773K210120K514978K989065M002955N707291Q065927J1875314J8863330
10405G2448753L1198358M8487361O0197385L9622424J2346899K6850769N6420931
10398C47572880L7275604k9526128n7473364l2532674j0569039l5375953n8945076
10391A60426250n1748807l3334480j9956625j2539405q455602n858018m022068
10384B4511245k908921k330993j922815j547697j328123j118382r60467r51184
$$ plain form
10440 1782105 1884430 1999699 2094213 2177171 2278652 2409745 2533134 2643220 2757930 2923963
10430 2923963 3133124 3356253 3603416 3893891 4273268 4770043 5417457 6182129 6888664
10421 6888664 7505283 8312946 9451955 10707113 11807846 12921330 14330412 16219773
10413 16219773 18429893 20944871 23933936 27936891 33644182 41710109 53585423 72448753
10405 72448753 103647111 152134472 212331857 251954281 264301180 291151949 347572880
10398 347572880 384848484 355322356 297848992 265316318 254747279 219371326 160426250
10391 160426250 108677443 75342963 55386338 42846933 34391331 28533313 24511245
10384 24511245 21602324 19271331 17348516 15800819 14472696 13354314 12393847 11442663
10376A1442663j102773j091592q96976p48451p64840p99804p04538n65301m46249
10367D322139l65661k98245k62443k54287k36769k18487j78912j39867j42276
10358B225192j46817j26865p7142o4783p8355p4984l9499k3878l4267m9155m6414
10347A463033k3172j7385k6891n4234m0955k7007l1240k7762j7188j0719j3324
10336A173156l8020l1666Q663J1017m44j9354k8046N576K4702L096m9325o6126
10324I93229m0288m0878o6738o8556m6806l6890m4475l8471j2840m039j7838j4225
10312E61185k42N778J870m350q51n681o999j0476M121K804j6373l9485l1145j1344
10298D48812j4950k4313l1282k3289p884j578j4008j0461Q044J0861P822m887
$$ plain form
10376 11442663 10339890 9248298 8351322 7602871 6838031 6038227 5333689 4768388 4322139
10367 4322139 3956478 3658233 3395790 3141503 2904734 2686247 2507335 2367468 2225192
10358 2225192 2078375 1951510 1874368 1809585 1731230 1656246 1616747 1592869 1558602 1509447 1463033
10347 1463033 1439861 1422476 1395585 1341351 1300396 1273389 1242149 1214387 1197199 1186480 1173156
10336 1173156 1135136 1103470 1112133 1123150 1122706 1103352 1075306 1080882 1105584 1108680 1059355 993229
10324 993229 952941 912063 845325 776769 729963 693073 648598 610127 597287 593248 575410 561185
10312 561185 560943 566721 568591 564241 563390 557709 550710 540234 544355 547159 530786 491301 460156 448812
10298 448812 433862 409549 378267 354978 347094 345516 331508 321047 329091 339952 347774 342887
10286C42887P502J4579Q362o291j9222l2541k4785l6827n2573l8092k3986k4576
10274A14437k8381J041K4507M3281M1004K7129K9245M9820O9678M1092k9982k6012
10262C56859L4480K2080k6255n9186l1211k18j1319j6600j2743k808k72j423r283
10249B42101J226r877n612M466m390j6985j4070j4889l0109j4515p145l395L758
10236A30564N873k733R8O033k634q50k775K734j388o644M395J0184P649M101J4653
10221A69260J9402J4910J6452K6787K0894m843j2698j9682j0975q734j0709j8224
10209A81840l0604j8791m251n733j1397n629j3996o194n230N403J1671J3944O892
10196A17925L948R189r782j7986K808J5254L866l94m553J912N276l699m017q963
$$ plain form
10286 342887 350389 364968 373330 367039 347817 315276 290491 253664 201091 162999 139013 114437
10274 114437 86056 87097 111604 154885 195889 223018 252263 302083 371761 412853 382871 356859
10262 356859 391339 413419 387164 327978 296767 296549 285230 268630 255887 253079 252807 251384 242101
10249 242101 243327 233450 227838 232304 227914 210929 196859 181970 151861 137346 130201 126806 130564
10236 130564 136437 133704 133802 139835 137201 136351 133576 136310 134922 128278 132673 142857 150506 154607 169260
10221 169260 188662 203572 220024 246811 267705 262862 250164 230482 219507 210773 200064 181840
10209 181840 151236 132445 128194 122461 111064 105435 91439 85245 80015 85418 97089 111033 117925
10196 117925 121873 131062 121280 103294 106102 121356 125222 124828 120275 122187 127463 123764 119747 110784
10182A10784j1691m884l011j212l91q571j7524r571M375q4p537j599O962J8676
10168G4722J9197J9888L660j715p951m430J482M85O375L110l697M15l26j866m084
10153A05265j60j331l928n216L73m290n84K023P404p032l219R457O417N342P587
10138A18108N472L89p648j6303j2126j313j0117l506Q009L249j1722j7644o635
10125D8213J161J0750l469k694R005Q349K279j970P531J315q56k23J045o1p527
10110G2848m63m321R59n045k806P586m809j0352j0316o596o857N880J2680Q692
10096E7080q4l961O866J226J327L562j68j107m34J2359r70r488L274K003M487
10081G5972k426j919R104l620p352k062j57o993m817k530O096Q301J1531P269
$$ plain form
10182 110784 99093 94209 91198 89986 89595 81024 63500 53929 58304 58220 50683 49084 56046 74722
10168 74722 93919 113807 117467 115752 107801 103371 104853 105338 111713 114823 111126 111541 111215 109349 105265
10153 105265 105105 103774 99846 94630 95003 90713 90129 92152 99556 92524 89305 98762 105179 110521 118108
10138 118108 123580 123969 116321 100018 87892 86579 76462 72956 80965 84214 72492 54848 48213
10125 48213 49374 60124 56655 53961 62966 71315 73594 71624 79155 80470 79614 79391 80436 80375 72848
10110 72848 72385 68064 69023 63978 61172 68758 63949 53597 43281 36685 29828 35708 48388 57080
10096 57080 56996 53035 59901 61127 62454 66016 65848 64741 64307 76666 75696 66208 69482 71485 75972
10081 75972 73546 71627 80731 77111 69759 67697 67540 60547 55730 53200 59296 67597 79128 86397
10067H6397r217p741l618o70Q5k131k247l205l024p444o699q331M611J2486N769
10052E5021j1133k889L070M000P78M377K468N17M860J2124L955N152L724j493
10038H4531k259l406N00l870n964L275N516j1376o860K538R718J5266P173K139
10024I6921J099O382l093n593m323j130k226J510K2904R307K913J496P33k404
10010A24496K358l789N268J0832P346R120J7299K2404K0355K8044L8429O1898
9998C44060J12289J81510K78232L27523J98588R6217J81351L03295J31922k17835
9988A937152l07106j51761r1437k36419l20684k61039j58082q8685n7399m2050
9978B22490l7245l1553j6832j3350K02o359j6902j636P667k34j2004j1645j0969
$$ plain form
10067 86397 77180 69439 65821 65151 65236 63105 60858 57653 54629 47185 40486 32155 36766 49252 55021
10052 55021 43888 40999 44069 48069 48847 53224 55692 56209 61069 73193 77148 82300 86024 84531
10038 84531 82272 78866 79366 75496 69532 72807 78323 66947 60087 62625 72343 87609 94782 96921
10024 96921 98020 104402 101309 95716 91393 90263 88037 89547 112451 121758 124671 126167 126900 124496
10010 124496 126854 123065 128333 139165 146511 155631 172930 195334 215689 243733 282162 344060
9998 344060 456349 637859 916091 1243614 1442202 1538419 1719770 2023065 2154987 1937152
9988 1937152 1630046 1478285 1386848 1150429 829745 568706 410624 321939 264540 222490
9978 222490 185245 153692 136860 123510 123712 117353 100451 98815 106482 106248 94244 82599 71630
9965G1630m540k876L181J506j1570j1987m278l02J381N72J967N409K991K233L612
9950E8929J1997J0990L710N68j358k723r989o577j3709l916J3453o533l134l547
9936D8161J180M93K244M571L210J372o448J49M037N032L223p361o500m859m615
9921D3889J225O831L668l994M01P076l041k968p37p193m126o577Q165M611N041
9906E2271l893o057M014N78o716o77o426o120N553M473j0849l772J058P297j203
9891B9531l252J681q618K143l275J773P340J2240P502n615j0974J0760M192K321
9877D7749q993R24k55M438R280o176J864J187K508l540k999q036q595n009n65
9862B3782Q954R662J863r9p88K243r554n233k024M729J562M585K554j99L705J772
$$ plain form
9965 71630 67090 64214 67395 68901 57331 45344 41066 40764 42145 42717 44684 50093 53084 55317 58929
9950 58929 70926 81916 85626 86194 84836 82113 72124 65547 51838 47922 61375 54842 51708 48161
9936 48161 49341 49834 52078 56649 59859 61231 54783 54932 58969 64001 67224 59863 53363 48504 43889
9921 43889 45114 51945 55613 51619 52020 59096 56055 53087 52350 45157 41031 34454 42619 47230 52271
9906 52271 48378 42321 46335 46913 40197 39520 33094 26974 32527 37000 26151 22379 23437 30734 29531
9891 29531 26279 27960 19342 21485 18210 19983 27323 39563 47065 41450 30476 41236 45428 47749
9877 47749 38756 39680 39425 43863 53143 46967 48831 50018 52526 48986 45987 37951 29356 24347 23782
9862 23782 32736 42398 44261 44162 43374 45617 36063 30830 28806 33535 35097 39682 42236 42037 45742 47514
9846D7514r705m018k061J3429J2806J206l557O794P716J2096j799M805N805n918
9832H5113l151j3710j7588q760k070Q423K525q829p014M932j358n52K894K525
9818D3380Q95K888N053L811o4n320o292k970N068R751q921o309j243J610l036
9803C8301k911m543N217O962n855P676J1992Q521m09j0190k448N36l578k792J61
9788D6640k736k060j984L828P898Q059J3491J2773Q997J440j832o98j2096p846
9774G3874p254j7207r0M656O461K289m184m161L681O481J271r747J7036O750L626
9759H3482N051l12J2454N186LN687J4642J2317J8442K5422K2884M3309R2651J41686
9745D82904K30072L41064L12422n7080l37407l30105k10592j28757p8058n1457
$$ plain form
9846 47514 37809 33791 31730 45159 57965 59171 55614 62408 70124 82220 80421 85226 91031 85113
9832 85113 81962 68252 50664 41904 39834 48257 50782 41953 34939 39871 38513 37961 40855 43380
9818 43380 44275 47163 52216 56027 55963 50643 44351 41381 46449 56200 47279 40970 39727 41337 38301
9803 38301 35390 30847 36064 43026 37171 44847 56839 65360 64951 54761 52313 52849 49271 46479 46640
9788 46640 43904 41844 39860 43688 51586 59645 73136 85909 94906 96346 94514 93816 81720 73874
9774 73874 66620 49413 49323 53979 60440 62729 58545 54384 58065 64546 65817 56070 73106 79856 83482
9759 83482 88533 88221 100675 105861 105864 111551 126193 138510 156952 182374 205258 248567 341218 482904
9745 482904 712976 1054040 1366462 1309382 971975 641870 431278 302521 224463 173006
9735A73006k5819k0608l932K452P42J519p931m905P44j867j2K261m164p024j9384
9720H5078j3393p146q364m427J0928O40l046p65J907l230l859k291J326M051k142
9705E5267N626N739L417k681M940m222j5292k412O253M198o47N129o321J380j836
9690E8538M057K594O131J08r692o656J683k242Q980P658N72K069j337J694q032
9675F6125r417Q52j1016k109J31L52M725m911K340R561Q488K307O452P135M163
9660H5178Q343L107j637P498K6935N1245P0470K1465m9232n5525k0265j1616k7236
9647A08730j6586K638M571P746J8058Q425J1079K1154J3626K6402M0196M7413
9635B93452J00898K05910L62901N04250K83453l40619n13160l40223j83396j01487
$$ plain form
9735 173006 147187 126579 122647 125099 125841 127360 119429 114524 115268 113401 113389 115650 111486 104462 85078
9720 85078 71685 64539 56175 51748 62676 63316 60270 59505 61412 58182 54323 52032 53358 57409 55267
9705 55267 60893 66632 70049 67368 72308 68086 52794 50382 56635 60833 60186 65315 58994 60374 58538
9690 58538 62595 65189 71320 71428 61736 55080 56763 54521 63501 71159 71731 73800 72463 74157 66125
9675 66125 56708 57560 46544 44435 44566 44918 49643 44732 47072 56633 65121 67428 73880 81015 85178
9660 85178 93521 96628 94991 102489 129424 180669 251139 272604 223372 167847 147582 135966 108730
9647 108730 92144 94782 99353 107099 125157 133582 144661 165815 179441 205843 246039 293452
9635 293452 394350 600260 963161 1467411 1750864 1410245 897085 556862 373466 271979
9625B71979n0759l1269k0537j1501j5027J56p054j3331M602L188l157J478K129
9612A30897N740J7808K3844M5218Q6720J13059O6374K7183N9132R8763Q4682K3107
9600G82527m1625j25968j39675j27272r4814n6307k3449j3062j9313p185q410
9589A25447j7490j3092p042R5L776N58j170J470m480k627o318K786j34J964J2977
9574I6720J4070Q508O509m24j0696j0803j3733j943k779j073N28k613M489q611
9560G8149j282N424k033j693n662J52K20J770R745P433m726N16J598L246m119
9545H8738k247j6553r790L463J4338J0230L775K822O070K274k996L240L445n000
9531A01809n734n683m177j659J1557J0039l783o970j6501m520N12Q408J0232K030
$$ plain form
9625 271979 221220 189951 169414 157913 142886 143042 135988 122657 127259 130447 127290 128768 130897
9612 130897 136637 154445 178289 223507 310227 423286 489660 516843 575975 674738 759420 782527
9600 782527 740902 614934 475259 347987 253173 196866 173417 160355 141042 133857 125447
9589 125447 107957 94865 87823 87918 91694 92252 91082 92552 88072 85445 79127 81913 81779 83743 96720
9574 96720 110790 119298 125807 125383 114687 103884 90151 88208 85429 84356 84884 82271 86760 78149
9560 78149 76867 82291 80258 78565 72903 73055 73275 75045 84790 92223 87497 88013 89611 92857 88738
9545 88738 86491 69938 60148 63611 77949 88179 91954 94776 100846 103120 100124 103364 106809 101809
9531 101809 96075 90392 86215 84556 96113 106152 102369 95399 78898 74378 74890 83298 93530 95560
9517I5560n725j3577r716J0631R967P567P46p429q079n287J230J660N38N739J2172
9502I5997M072J750p937m918k523k463k840J143R48L584K207O680L966k011n210
9487I2445q567K297M060M781q79N569J4801P513l987p100j0745j0292M513Q219
9473A02628m793j528l491k542R877p90k041k795N704j640J0501M326K203r89n43
9458A14087N208j287j1404m086l091N27N581J3319K62o807p008m854m438L926
9444I9935m457j0831R75P217M799Q583J1026J122m226j415Q75k0q372J208J778
9429A08197N574J1192J0662L34M94o52m87N138J423o267p203O879J0954J2643
9415A58881k073j4391m604n268P386j598o362K39M002n442o41K739O3n801l24
$$ plain form
9517 95560 89835 76258 66542 77173 87140 94707 95453 88024 79945 74658 75888 77548 78086 83825 95997
9502 95997 100069 101819 93882 88964 86441 83978 81138 82281 83229 86813 89020 95700 99666 97655 92445
9487 92445 83878 86175 90235 95016 94137 99706 114507 122020 118033 110933 100188 89896 94409 102628
9473 102628 97835 96307 92816 90274 100151 99361 97320 94525 100229 98589 109090 113416 115619 114630 114087
9458 114087 119295 118008 106604 102518 99427 99954 105535 118854 119116 112309 105301 100447 96009 99935
9444 99935 95478 84647 85622 92839 97638 106221 117247 118369 114143 112728 113603 113583 105211 106419 108197
9429 108197 113771 124963 135625 135959 136453 135801 135314 140452 141875 135608 128405 135284 146238 158881
9415 158881 156808 142417 137813 132545 139931 138333 131971 132210 136212 130770 130129 132868 132931 127130 126806
9400A26806O721j841k745L787M047L64p187N357K407k428N52N976J5907O142L663
9385A67528M821m611j6529m554J4531R016M793N183p136q107m00J1509J435J510
9371A78989K824M985j4876Q644J0593R859k97q2j650Q388Q581J6648K6213L1422
9357B90241M7986R1243J32273J33440J34052O1089k4150j15968j32946j23270
9347D93990r8616o3495l3684k4387j6111p113q236r152q267l789R952O090P656
9334B44838K243j152J2094P726M597J4710L1803J7366O954m794k4556k6486r866
9321B75477r798j0333M682L163L204n034o780N266n968N253N80o516L011N104
9307B61311J0152J290m684N47K527P941J0271L480n088J0650M438q876l699M582
$$ plain form
9400 126806 133527 131686 128941 132728 136775 137139 129952 135309 137716 135288 135840 141816 157723 163865 167528
9385 167528 172349 167738 151209 146655 161186 170202 174995 180178 173042 164935 164535 176044 177479 178989
9371 178989 181813 186798 171922 180566 191159 201018 200721 200639 198989 207377 215958 232606 258819 290241
9357 290241 338227 429470 561743 695183 829235 890324 866174 750206 617260 493990
9347 493990 395374 331879 298195 273808 257697 250584 242348 233196 224929 221140 231092 237182 244838
9334 244838 247081 245929 258023 265749 270346 285056 316859 334225 341179 336385 311829 285343 275477
9321 275477 265679 255346 260028 263191 266395 261361 254581 259847 253879 259132 259712 253196 256207 261311
9307 261311 271463 272753 268069 268616 271143 279084 289355 292835 287747 298397 302835 293959 290260 294842
9293B94842K869J2721M722j389Q323J1802J0024J2771J2314K979M976m916j2646
9280C59392n317R830l223n283M582o400L628L900l440N810J888o533n482R700
9266C63052N672K223P08n879p57k766J1525O206p596K061J1506O046k89k745m030
9251C84937M66O599J4831J2161J2709o94n598J175R566q01j412j197Q69o71Q690
9236D41630J0168L028j940J663n453l857P355J3221P049J0535L521J1749J4425
9223E13094Q132P900L909J378l04o723r22J2820P456M53o185J249O192N753M310
9208E58512M404J0173P216Q010Q018J0162Q740J0630J0353P750J5744P303J0627
9195F77642J4460n40l603Q52J0575J9561K2645K0445J2047k634j489J3892J0822
$$ plain form
9293 294842 297711 310432 315154 313765 322088 333890 343914 356685 368999 371978 376954 372038 359392
9280 359392 354075 363905 360682 355399 359981 353581 357209 361109 357669 363479 365367 358834 353352 363052
9266 363052 368724 370947 371655 365776 365019 362253 373778 379984 372388 374449 385955 392001 391712 388967 384937
9251 384937 385403 392002 406833 418994 431703 431009 425411 426586 436152 435351 433939 432742 433611 432940 441630
9236 441630 451798 454826 452886 454549 449096 445239 452594 465815 472864 483399 486920 498669 513094
9223 513094 521226 529126 533035 534413 534109 527386 526464 539284 546740 547193 541008 542257 548449 554202 558512
9208 558512 562916 573089 580305 588315 596333 606495 615235 625865 636218 643968 659712 667015 677642
9195 677642 692102 691562 687959 688811 699386 718947 741592 762037 774084 771450 769961 783853 794675
9182G94675Q258R709M928R567J1390J21J4028J7408K5901J2547J270J0081K709
9169I22592J2237J8094K1240J9466J8617J3694M753M046K6335L3042J7381J2357
9157A123854J8732K0084J9626K4705K6557K0779J7943K1029K0702J4183J6489
9146A344683K4983J9727J7462K0455J1121J1413K5233K5921J9693J7105K2428
9135A560224J0969P798J9240K5169K7361K7404K1842K3622K8128K5132K4273L9748
9123A840910L6581L3662L0116L1361L9928L8269K7874L4619M3779M5464M0077
9112B242640L7912N1680N1440M6704N4164N6597O0439M9474O3154P6738O2406
9101B853348N9668O6514O2201Q4770Q1405Q4770Q5561Q6685R9772Q8996R3551
$$ plain form
9182 794675 802933 812642 817570 827137 838527 838648 852676 870084 895985 908532 909802 919883 922592
9169 922592 934829 952923 974163 993629 1012246 1025940 1030693 1034739 1061074 1094116 1111497 1123854
9157 1123854 1142586 1162670 1182296 1207001 1233558 1254337 1272280 1293309 1314011 1328194 1344683
9146 1344683 1369666 1389393 1406855 1427310 1438431 1449844 1475077 1500998 1520691 1537796 1560224
9135 1560224 1571193 1578991 1598231 1623400 1650761 1678165 1700007 1723629 1751757 1776889 1801162 1840910
9123 1840910 1877491 1911153 1941269 1972630 2012558 2050827 2078701 2113320 2157099 2202563 2242640
9112 2242640 2280552 2332232 2383672 2430376 2484540 2541137 2601576 2651050 2714204 2790942 2853348
9101 2853348 2913016 2979530 3041731 3126501 3207906 3292676 3378237 3464922 3564694 3653690 3747241
9090C747241J16209J02740J14805J13342J18692J16709J27768J46537J43670J49895
9080D997608J72366J74073J73782J87354J88933J95198K21430K24281K28084K52284
9070G015393K80966K87864L03749L15553L24557L40798L71633L85771M19810M52450
9060A0498544M75675M95159N29193N79400O04935O33520O65730P19874P83192
9051A5985222Q40683R05236R69995J035243J110722J190199J273126J364106J468830
9042B6143362J569993J678134J785263J884511K001303K113217K214463K303609
9034D1693855K376510K425589K443113K423183K360252K246114K076243J838913
9026E9883772J558985J214332Q17443M01104l9153m73808q82502j264651j596948
$$ plain form
9090 3747241 3863450 3966190 4080995 4194337 4313029 4429738 4557506 4704043 4847713 4997608
9080 4997608 5169974 5344047 5517829 5705183 5894116 6089314 6310744 6535025 6763109 7015393
9070 7015393 7296359 7584223 7887972 8203525 8528082 8868880 9240513 9626284 10046094 10498544
9060 10498544 10974219 11469378 11998571 12577971 13182906 13816426 14482156 15202030 15985222
9051 15985222 16825905 17731141 18701136 19736379 20847101 22037300 23310426 24674532 26143362
9042 26143362 27713355 29391489 31176752 33061263 35062566 37175783 39390246 41693855
9034 41693855 44070365 46495954 48939067 51362250 53722502 55968616 58044859 59883772
9026 59883772 61442757 62657089 63474532 63875636 63836483 63362675 62480173 61215522 59618574
9017E9618574j883590k115722k271540k379971k431005k448754k418821k368583
9009D1300588k286564k192907k094728j972260j861942j758523j660177j556848
9001B5916639j447647j355562j263508j177407j095767j024218r57390q97555
8993A6697585q40279p88127p37544o79338o29908n95827n65073n23725m94670
8984A0843094m72882m40815m18903l88549l51098l39819l28298l17563k93020
8975G492147k73083k62639k50738k31280k20632k12911k08533k04073j82031j77813
8965E268414j62863j48300j52834j36396j33479j28825j23116j36127j17115j14437
8955C914922j03780j04077r6797r9065r3442q0844q9488r3634q1230p3995p5083
$$ plain form
9017 59618574 57734984 55619262 53347722 50967751 48536746 46087992 43669171 41300588
9009 41300588 39014024 36821117 34726389 32754129 30892187 29133664 27473487 25916639
9001 25916639 24468992 23113430 21849922 20672515 19576748 18552530 17595140 16697585
8993 16697585 15857306 15069179 14331635 13652297 13022389 12426562 11861489 11337764 10843094
8984 10843094 10370212 9929397 9510494 9121945 8770847 8431028 8102730 7785167 7492147
8975 7492147 7219064 6956425 6705687 6474407 6253775 6040864 5832331 5628258 5446227 5268414
8965 5268414 5105551 4957251 4804417 4668021 4534542 4405717 4282601 4146474 4029359 3914922
8955 3914922 3811142 3707065 3610268 3511203 3417761 3336917 3247429 3153795 3072565 2998570 2923487
8944B923487o9376p4591p2189o5197n1130o7555o5322m7018m9741n6882m7209
8933B257277m2448n1276n6572n1834m0126l7014l9979l8739k2502l3669m2777
8922A800341l7311m1248m1704k8819k9230k6302l8082l0189j8187k9994k4155
8911A455120l2439l4115l0197k4315k9291k4418k1291j2517j7060j2457j2849
8900A204171k1438k1574k1847k6072j7320j5072K94r853k0213j7720j2287p538
8888A013531r226j1719j1906j5107j7039j4036k0808o631p492m904j8314k0129
8876H56220j4439o259k0434k0831j8462j0590j830N88p379j7484r350r88p984
8863G20778q684k360m706j9177k1203r187m518p450n595o121p331q913j1603q373
$$ plain form
8944 2923487 2854111 2779520 2707331 2642134 2591004 2523449 2458127 2411109 2361368 2304486 2257277
8933 2257277 2214829 2163553 2106981 2055147 2015021 1978007 1938028 1899289 1876787 1843118 1800341
8922 1800341 1763030 1721782 1680078 1651259 1622029 1595727 1557645 1527456 1509269 1479275 1455120
8911 1455120 1422681 1388566 1358369 1334054 1304763 1280345 1259054 1246537 1229477 1217020 1204171
8900 1204171 1182733 1161159 1139312 1113240 1095920 1080848 1081142 1071289 1051076 1033356 1021069 1013531
8888 1013531 1004305 992586 980680 965573 948534 934498 913690 907059 899567 894663 876349 856220
8876 856220 841781 835522 815088 794257 775795 765205 763375 763963 756584 739100 729750 728762 720778
8863 720778 712094 709734 705028 685851 664648 655461 650943 643493 637898 631777 624446 615533 603930 595557
8849E95557j0460n417j3609j9370o561J92N68M375M452n872j2938r268k59j839
8835E19551k897l060m247p674p326j1980o091j4744r148n34j2661m261p51j240
8821D32937P646K16l250j1681p056p328p342J616M308q174j0920j7928Q28m89
8807C73383N617O284n560q65k091o551o068p156j3927j1544M255l466j0749L701
8793C25263O90L896K791L47n711o322K402l920N97M241M871q865r570k547K89
8778C08452J680j0983o813O712J0511r874n594j2342j2528o77J037o441J582L731
8764B68453Q928l317k787p115K128m834n571Q864J1432r328j1228k884M719j54
8750B57306j658l307n554p268K553J926p139l369o736k061k738j2995k082L621
$$ plain form
8849 595557 585097 579680 566071 546701 540140 540332 540900 545275 549727 543855 530917 521649 521390 519551
8835 519551 516654 513594 509347 501673 494347 482367 476276 461532 452384 451850 439189 434928 434177 432937
8821 432937 440583 440799 437549 425868 418812 411484 404142 405758 410066 401892 390972 373044 373872 373383
8807 373383 379000 385284 379724 378859 376768 370217 364149 356993 343066 331522 335777 332311 321562 325263
8793 325263 325953 329849 332640 332987 327276 320954 323356 319436 320033 324274 329145 320280 310710 308163 308452
8778 308452 310132 299149 292336 299048 309559 299685 294091 281749 269221 268544 269581 263140 264722 268453
8764 268453 277381 274064 271277 264162 266290 261456 255885 264749 276181 266853 255625 252741 257460 257306
8750 257306 255648 252341 246787 239519 242072 243998 236859 233490 226754 224693 221955 208960 206878 210499
8736B10499L19J189j425m32j419p159o259j196J0215k344o506r703N231J44l635
8721A87519p478r802M775J174M262P229N559j385p314q538j059Q30R26N943N317
8706A87958Q264j1103j2415P993P984k425p903J452n400m846N568L69l288J280
8692A73488J756n424J701m95l314o876j0770N442O217k048j354N78q62k276l215
8677A52548P890k950o933m293N789N696l428K098m146l85k429k945l64j03k815
8662A43230o485J0557J578o649p8r97p255L610J1222K938n833k106k315N680q117
8647A38980p90N836k166r338Q31q527k415M906L499k691n633m479n73j639K181
8632A17982N357j277J373q00k709N370k267l634n068p318P867P769l82l790k539
$$ plain form
8736 210499 210818 212007 210582 210150 208731 201572 195313 194117 204332 201988 195482 185779 191010 191154 187519
8721 187519 180041 170239 175014 176188 180450 187679 193238 191853 184539 176001 174942 175772 176698 182641 187958
8706 187958 196222 185119 172704 180697 188681 186256 178353 179805 174405 169559 175127 175496 172208 173488
8692 173488 175244 169820 171521 171026 167712 160836 150066 155508 161725 159677 158323 158901 158039 155763 152548
8677 152548 160438 157488 150555 146262 152051 157747 154319 156417 152271 151886 149457 146512 146148 146045 143230
8662 143230 136745 147302 148880 142231 142153 141156 133901 137511 148733 151671 145838 143732 141417 147097 138980
8647 138980 138190 144026 141860 132522 133353 124826 122411 127317 130816 128125 122492 118013 117440 115801 117982
8632 117982 123339 122062 123435 122635 119926 125296 123029 119395 114327 107009 114876 122645 122263 118473 115934
8617A15934L246L174O652Q825K387k09q190j189M492n296K0L319K394k81N01K786
8601A38565L619o750k192q806q622n840L731Q62O980O111j1303n598P230L600
8587A21587O232J0190K082l379P4K517M624m901j0750n799P74k396K89M753Q638
8572A34535M220M956N050j790k276P022J3184J0113J437N631L54j1566N034R376
8558A85280O231L947Q925L065m355K698O667o307j1614j2541j1778l259m373r373
8544A53213j0690n901M163q59L572R709K3836P907k2761k3814j2729j1977j1333
8531A02336lp289p491N113M768L289M457J0729O859N529j341q236o541j4406p860
8516H9913J47j2o548J1947n60r456j1131j757Q770o844r32J2487R6J979M960R112
$$ plain form
8617 115934 119180 122354 129006 137831 140218 140009 131819 130630 135122 129826 129846 133165 135559 135278 135779 138565
8601 138565 142184 135434 133242 124436 115814 109974 113705 114567 121547 127658 116355 110757 117987 121587
8587 121587 127819 138009 140091 136712 136786 139303 143927 139026 128276 122477 123251 120855 121144 125897 134535
8572 134535 138755 143711 148761 146971 144695 151717 164901 175014 176451 182082 182436 170870 175904 185280
8558 185280 191511 195458 204383 207448 203093 205791 212458 206151 194537 181996 170218 166959 162586 153213
8544 153213 142523 136622 140785 139926 143498 153207 177043 184950 162189 138375 125646 113669 102336
8531 102336 102333 95044 87553 92666 97434 100723 105180 115909 122768 128297 126956 118720 112179 97773 89913
8516 89913 90060 90048 83500 95447 94887 85431 74300 72543 81313 74469 73537 86024 86120 88099 93059 102171
8500A02171r46j2389j1647l453K140R848l486j166M932J3839K0817R462r477m843
8486A15802J7634J5721o817j1018R635M520j8048j1392k668j2273l720j4239p847
8473G5290L937J0180k700j1793K855p164m464J319K971P976L792L058l213o166
8459G5878n67O026L609J2860J9086J2334J0540J2246P116j863j3241j6791j5836
8446A11397j3806l94K341L292J4310q374k1146j0836r161l788J4233m440M737
8433G8365L535j1277o564k842P238J1288R37N745P776J0980J1236M849o221j2200
8419A02845j3698M145J0320J1783J2118Q447J3965J0892J0409j2931j9874j8996
8407A19425k5006k4562q343J121L644j995N914j789O649R068k030m566M705m400
$$ plain form
8500 102171 101225 88836 77189 73736 75876 85724 82238 81072 86004 99843 120660 130122 120645 115802
8486 115802 133436 149157 142340 131322 140957 145477 127429 116037 113369 101096 97376 83137 75290
8473 75290 79227 89407 86707 74914 77769 70605 66141 67460 70431 78407 82199 85257 82044 75878
8459 75878 75311 81337 84946 97806 116892 129226 139766 152012 159128 157265 144024 127233 111397
8446 111397 97591 97197 99538 102830 117140 108766 87620 76784 67623 63835 78068 73628 78365
8433 78365 81900 70623 64059 61217 68455 79743 80680 86425 94201 105181 116417 121266 115045 102845
8419 102845 89147 93292 103612 115395 127513 135960 149925 160817 171226 158295 138421 119425
8407 119425 94419 69857 61514 62635 66279 64284 70198 68409 75058 84126 82096 77530 82235 77835
8393G7835m610r500l958L196J4312N512m155J0160J7151O331j1459k1465q417
8380G0933j1071j028k057J4287K6358K1190N621m036m450j5427r485m340m579
8367H1916m109o739j2956J971m595m375M236r954o925K919O893P53L95J7860O728
8352G4018j446j1321q571O591J631j2202l908P904n058J335R392O873o460L802
8338F2580O366L721J0690J2534J3327M727k8629k3663q803j6733m930M995j678
8325C4504m702P391O746q848j359Q959m925p546j04k228O200N904j0617P08L133
8310C3216Q4n737m251R896R460o440j2232N911J3552P611K675m836J2600J3591
8296G5100J324J487o643j7357j5841k475M377n167L65j556j0361j188K914R359
$$ plain form
8393 77835 73225 63725 59767 62963 77275 82787 78632 88792 105943 112274 100815 79350 70933
8380 70933 59862 58834 56777 71064 97422 118612 124233 120197 115747 100320 90835 86495 81916
8367 81916 77807 71068 58112 60083 55488 51113 55349 45395 38470 41389 48282 49035 49430 67290 74018
8352 74018 72572 61251 52680 59271 60902 48700 44792 52696 47638 48973 58365 65238 58778 62580
8338 62580 68946 72667 83357 95891 109218 113945 85316 61653 52850 36117 31187 36182 34504
8325 34504 29802 37193 43939 35091 33732 42691 37766 30220 30116 27888 34088 39992 29375 30083 33216
8310 33216 33300 27563 23312 33208 42668 36228 23996 29907 43459 51070 53745 48909 61509 75100
8296 75100 76424 77911 71268 53911 38070 35595 39972 34805 35170 33614 23253 22065 24979 34338
8282C4338O876j231j0308j6531l984R171M092K392P566L244O19q428n544K639
8268B4911K338j02K811l512q545j812O167L582M51n723N229K175P067L438R40
8253C9415P825J5535J8011Q444k311j268j4529k2668j8499r701j638k430q855
8240G331R63J1193J629L46J225l832k73k953r643o321N056O915M760K725K655
8225B1776L443q229K573J0349j194M29K610m893r24k699n703L439j696k70P021
8210B6032N911o747L036P61J787M030o391j079j590J0561j934m552p131q277n065
8195I352k941k992K180Q125Q563k003J170o074p015M070J1206m302j414M797J684
8180B4406L454n529q996q265L450O357Q766J80L340r8l356O787M754j1298p681
$$ plain form
8282 34338 41214 39983 29675 13144 9160 18331 22423 24815 32381 35625 36244 27816 22272 24911
8268 24911 27249 27147 29958 26446 17901 16089 22256 25838 26289 20566 25795 27970 35037 38475 39415
8253 39415 47240 62775 80786 89230 86919 85651 71122 48454 29955 20254 18616 16186 7331
8240 7331 8294 19487 21116 21462 22687 18855 18582 15629 5986 -335 4721 11636 16396 19121 21776
8225 21776 25219 16990 19563 29912 28718 29147 31757 26864 25940 23241 17538 20977 19281 19011 26032
8210 26032 31943 25196 28232 28993 30780 34810 28419 27340 25750 36311 34377 29825 22694 14417 9352
8195 9352 6411 3419 5599 13724 22287 20284 21454 15380 8365 12435 23641 19339 17925 22722 24406
8180 24406 27860 22331 13335 5070 8520 14877 23643 23823 27163 27065 23709 30496 35250 23952 16271
8165A6271n074m716j099o100L834J5275k215R35j15o830L11O00p808N72J1690
8150A5531J1059J372j1890J128M413J336N33Q50k429l955p285n258k536Q676r90
8135A0555m735J5766P975n700m858k667j0424n856j267L613J32O079M997k022
8121A1588k244L468k43J853M701m425N59J052k338q11M612K821n495J99K40r070
8105F467j592R075P190n30k164K53k947j552q118K005J812k710l189K107K71N789
8089A2167L471l301k336j719k938k028j1934n062L34K847O289R198N853N705P270
8074B3816K572N172Q231J2920N662j2249j4924q629J498p642m689p650M45J8581
8060B3114O938j517N780J0280K524l56J544r227l532o552k747n114r786j0809
$$ plain form
8165 16271 11197 6481 5382 -718 3116 18391 16176 17111 16996 10166 10477 11077 3269 3841 15531
8150 15531 26590 27962 16072 17200 21613 22949 23482 24332 21903 17948 10663 5405 2869 11545 10555
8135 10555 5820 21586 29561 23861 19003 16336 5912 56 -1211 2402 2534 8613 13610 11588
8121 11588 9344 12812 12569 14422 19123 14698 15257 16309 13971 13160 17772 20593 15098 15297 15537 6467
8105 6467 4875 13950 21140 20610 18446 18699 15752 14200 6082 8087 9899 7189 4000 6107 6378 12167
8089 12167 15638 12337 10001 8282 5344 3316 -8618 -13680 -13346 -10499 -4210 4988 10841 16546 23816
8074 23816 26388 31560 39791 52711 58373 46124 31200 22571 24069 16427 11738 4088 4533 23114
8060 23114 30052 28535 34315 44595 47119 46763 48307 39080 35548 28996 26249 21135 11349 540
8046E40l381N602J4489n57q378m668j852j618K786L131j543n310m759k587M167
8031c938P517J1876l999O737R344J1500L218l593l348l975l751O69q035r133L744
8016A4833J2241L906J4240J1841L304M80L409l379r576j3436n061k840p251l272
8002A9439k552p190L374R197L758o810P067L606K546m660j633p274n156P103p071
7987A3744p800J250N511k641l21O517O039J1963Q938K311j5161m19j504O576P309
7972D2312M887l176l717k825L307M83j568N028j0386m805K631m671P660L460o588
7957C2032q310J648L734K100J614q73O94n510j4104k93M280k574p081O593J0407
7942B4357K629Q87j3498m783K640J0227L419O148j025q355O56p298N044K963N931
$$ plain form
8046 540 -2841 2761 17250 16693 8315 3647 1795 177 2963 6094 4551 -759 -5518 -8105 -3938
8031 -3938 3579 15455 11456 18193 27537 39037 42255 38662 35314 31339 27588 28257 20222 11089 14833
8016 14833 27074 30980 45220 57061 60365 60845 64254 60875 51299 37863 32802 29962 22711 19439
8002 19439 16887 9697 13071 22268 26026 19216 26283 29889 32435 27775 26142 18868 13712 20815 13744
7987 13744 5944 7194 12705 10064 9743 16260 22299 34262 43200 45511 30350 29931 28427 35003 42312
7972 42312 47199 44023 40306 37481 40788 41271 39703 44731 34345 29540 32171 27500 35160 38620 32032
7957 32032 23722 25370 29104 31204 32818 31945 32639 27129 13025 12732 17012 14438 7357 13950 24357
7942 24357 26986 27873 14375 9592 12232 22459 25878 32026 31001 22646 23302 16004 21048 24011 29942
7927B9942n0n795o829j0037O707O508L789K18J601M765J200m06j359j1278k572
7912A6404O122O889J681j000K151K729n59j650j1071n555m998r390K750Q705L922
7897A7130n443m699ll006L004L594P459p38o751J0221j848j825O284j0246j9201
7882f068p490Q383O196j096N867N918N98j496J829K519o453m22J996o322k548
7867A411R570Q651N971r292M004M424j6214k664J0548l232k755L2k487j0520M113
7852A560N931l530M739J343Q38j2j81l210j4619q540R899P733Q311l186K663o689
7836C050k184J405L387J0898L584j560l95p234k715n249N432J1187J914n8o601
7821A4861r52n199j958P430n181l615l45M910o879r539J169J818O548J865k649
$$ plain form
7927 29942 29892 24097 17268 7231 13938 20446 24235 24453 26054 30819 32019 31613 30254 18976 16404
7912 16404 22526 29415 31096 30096 32247 34976 34417 32767 21696 16141 11143 1753 4503 13208 17130
7897 17130 11687 6988 6985 3979 6983 10577 18036 17298 10547 20768 18920 17095 23379 13133 -6068
7882 -6068 -13558 -5175 1021 -75 5792 11710 12308 10812 12641 15160 8707 8285 10281 3959 1411
7867 1411 10981 19632 25603 16311 20315 24739 8525 5861 16409 13177 10422 10454 7967 -2553 1560
7852 1560 7491 3961 8700 10043 10881 10869 10688 7478 -7141 -15681 -5782 1951 10262 7076 9739 3050
7836 3050 866 2271 5658 16556 20140 18580 18185 10951 8236 2987 8419 19606 21520 21462 14861
7821 14861 13909 8710 6752 14182 9001 5386 5041 9951 3072 -6467 -5298 -3480 3068 4933 2284
7806B284P073P028o411p433m873O80L037K838n330n241j0639k140P522Q811N622
7791B828p034M183M658P995P540p820k962j843l398l032K180L170k701M409o761
7776A412L90N972K552m402r059o224l20M173M002P652n863j0640M500r820j085
7761a6760Q821q38L419n992r83O199k020J986m152m023O088N823M240o757N428
7746D79O485j1038K205M753K785L611l722o889j391o033l23J056l777J0407K749
7731A357m149m054l756O006k27J706J457K217r50r39L486R599L990J440q019K395
7715A1559n115k674R995M142r695j2078j0724J545J2371M905Q25j175r988j0135
7701a6242O177L176o250k800J1390Q614k072M93k272N748O978j1645J77k004P459
$$ plain form
7806 2284 9357 16385 9974 2541 -2332 -1652 1385 4223 -1107 -6348 -16987 -19127 -11605 -2794 2828
7791 2828 -4206 -23 4635 12630 20170 12350 9388 7545 4147 1115 3295 6465 3764 8173 1412
7776 1412 1802 7774 10326 5924 -3135 -9359 -9679 -5506 -1504 6148 285 -10355 -5855 -15675 -16760
7761 -16760 -7939 -8777 -5358 -11350 -12333 -6134 -8154 -6168 -10320 -14343 -8255 -2432 1808 -4949 479
7746 479 6964 -4074 -1869 2884 5669 9280 5558 -1331 -2722 -8755 -9078 -8022 -11799 -1392 1357
7731 1357 -2792 -6846 -10602 -4596 -4823 -3117 -1660 557 -393 -1332 2154 11753 15743 17183 9164 11559
7715 11559 6444 3770 13765 17907 8212 -3866 -14590 -13045 -674 4231 5056 3881 -6107 -16242
7701 -16242 -10065 -6889 -13139 -15939 -4549 4065 1993 2486 214 5962 12940 1295 1472 -532 6927
7686F927O437O151r141K725R852j0318n47O083j145r873q670j867L518N965m465
7671A632p212L246N923J0269L632J463q408j90O90r880n853l638n090O647K628
7656d141J905N27r235o031P850P191n30p510K348J0104l196R85N745q21n331m437
7640d577q424L197k594q333m818j599Q99K473L59J5464M813l199K943l267K604
7625d059K389m716r79J23j245O161j641m759m668J174J2409J452J37J281N909
7610H968p892j1230O95J6185J629q081r816M75L677P695O966q845n655J043o835
7595a1021j1962m799J0728J2669J859K516J495J319L480l144J131P712n137l620
7581C226k201j1083p78N162K675q761j432J0984P880j2775j1164Q661n71n87m362
$$ plain form
7686 6927 13364 19515 10374 13099 22951 12633 12086 18169 17024 7151 -1519 -3386 132 6097 1632
7671 1632 -5580 -2334 3589 13858 17490 18953 10545 10355 11045 1165 -4688 -8326 -13416 -6769 -4141
7656 -4141 -2236 -1709 -10944 -16975 -9125 -1934 -2464 -9974 -7626 2478 -718 267 6012 5191 -140 -4577
7640 -4577 -13001 -9804 -12398 -20731 -25549 -27148 -26249 -23776 -23417 -7953 -3140 -6339 -3396 -6663 -4059
7625 -4059 -1670 -6386 -7365 -7242 -8487 -2326 -3967 -8726 -13394 -12220 189 1641 1778 3059 8968
7610 8968 1076 -10154 -9459 6726 8355 274 -9542 -9067 -5390 2305 9271 426 -5229 -4186 -11021
7595 -11021 -22983 -27782 -17054 -4385 -2526 -10 1485 2804 6284 3140 4271 11983 6846 3226
7581 3226 1025 -10058 -10836 -5674 -2999 -11760 -13192 -2208 5672 -7103 -18267 -9606 -10177 -10764 -15126
7566a5126l35K156L745N419O63o679N493k73o428N3l223L261M196L637m56k83
7550d180K762k036M26j062N081m897K691P256L803o051k928J882m292K1n513o010
7534a3047l146M740j194N718J2639j254o415m488n560O789N348J4803K755p163
7520A0525l374m516j3855r140m879M313J5277O270m559K592J0026r325j0813k537
7506a3995L958O981l533r241N14M688J237p843N630L92p439n850R59N824K429
7491a5289k460J1043L096m545k978J032m241p874N046J817M455o953m821o591
7477b9263q28J1273M487m848k688N104O284R192j989J442R358j988K34n135o936
7462f301l764j490j601M536l307L443R949k220l807l199k843P667R569J168q706
$$ plain form
7566 -15126 -15461 -13305 -9560 -4141 -3478 -10157 -4664 -4937 -11365 -11312 -14535 -11274 -7078 -3441 -3897 -4180
7550 -4180 -1418 -3454 -3028 -4090 991 -3906 -1215 6041 9844 3793 865 2747 -1545 -1524 -7037 -13047
7534 -13047 -16193 -11453 -12647 -6929 5710 4456 -1959 -6447 -12007 -5218 130 14933 17688 10525
7520 10525 7151 2635 -11220 -20360 -25239 -20926 -5649 621 -3938 -1346 8680 -645 -11458 -13995
7506 -13995 -10037 -3056 -6589 -15830 -15316 -10628 -9391 -17234 -11604 -11212 -18651 -24501 -23542 -17718 -15289
7491 -15289 -17749 -6706 -3610 -8155 -11133 -10101 -14342 -22216 -17170 -15353 -10898 -17851 -22672 -29263
7477 -29263 -30091 -18818 -14331 -19179 -21867 -16763 -10479 -1287 -3276 -1834 7524 5536 5770 635 -6301
7462 -6301 -10065 -11555 -13156 -8620 -11927 -8484 1465 -755 -4562 -7761 -10604 -2937 6632 7800 -906
7447i06j2936J1022J779n418L034N74L709m036m71M595k482r247J758j2595k738
7432b4358J6041O500k521L996K941R04n000L718K371n14o025o183J0943Q606l0
7417A1389K849n280k0522p559K129J445O980M421J877M678l049l834Q255o770
7403b991r489R791J349J608j921r236n086N526R242j1435q742Q061J3832L11j584
7388g64q573p451L192P532R230l818p775N881n65K961l634M715L069N12q055k856
7372f399n23k401J991N094k605m732k619M208M22M050L427m952j011L408N021
7357B379L075k421l319p218p037o024M176n308M779J2304R123m317M086M728j0648
7342a642j1949O203N801n170J376K46N36M281Q30P41K555n443k475J189R595P533
$$ plain form
7447 -906 -13842 -2820 -1041 -6459 -3425 -2851 858 -3178 -3649 946 -1536 -10783 -9025 -21620 -24358
7432 -24358 -8317 -1817 -4338 -342 2599 3503 -1497 2221 4592 4078 -1947 -8130 2813 11419 11389
7417 11389 14238 8958 -11564 -19123 -16994 -15549 -8569 -4148 -2271 2407 -642 -4476 3779 -2991
7403 -2991 -12480 -2689 -1340 268 -1653 -10889 -15975 -10449 -1207 -12642 -21384 -13323 509 820 -764
7388 -764 -9337 -16788 -13596 -6064 3166 -652 -8427 -2546 -3111 -150 -3784 931 4000 4512 -3543 -6399
7372 -6399 -6922 -9323 -7332 -2238 -4843 -9575 -12194 -7986 -7564 -3514 -87 -5039 -6050 -2642 2379
7357 2379 5454 3033 -286 -7504 -14541 -20565 -16389 -21697 -16918 -4614 4509 192 4278 9006 -1642
7342 -1642 -13591 -7388 -1587 -6757 -5381 -5135 -4599 -318 512 1253 3808 -1635 -4110 -2921 6674 14207
7326A4207k0578q034O876J329K810l884r888j0113J37J2612L033k410K586p465
7312a8782K309P389m70J4205O207l662r084l297j085l587O616M129l672l762K596
7297c950m116k962k889R543N032j804O852k85n518k018J553l83k904r12O695M019
7281E953J873r330r720K490N506k261n983j110R810j340m851j229N109M931R166
7266I014n824o837j155m302L220L521J375m686p62R802J760O76k391k633j9J2252
7250A3011l197j2554q093P116J2359M726k714J015j814q630j338O185P519K865
7236A6456r506k156L932j2060j378L885j517o219l101N067l247j513l38k55L229
7221h721O230k041j125n31j1558l908M747P042o403p94J0009M436N14q271K341
$$ plain form
7326 14207 -6371 -14405 -7529 -6200 -3390 -7274 -17162 -27275 -27138 -14526 -11493 -13903 -11317 -18782
7312 -18782 -16473 -9084 -9554 4651 10858 7196 -1888 -5185 -6270 -9857 -3241 888 -2784 -6546 -3950
7297 -3950 -8066 -11028 -13917 -4374 658 -1146 5706 5421 -97 -2115 -562 -945 -3849 -4761 1934 5953
7281 5953 7826 -1504 -11224 -8734 -3228 -5489 -11472 -12582 -2772 -4112 -8963 -10192 -5083 -152 9014
7266 9014 3190 -3647 -4802 -9104 -5884 -2363 -988 -5674 -6436 3366 5126 5802 3411 778 759 13011
7250 13011 9814 -2740 -10833 -3717 8642 13368 10654 11669 9855 1225 -113 6072 13591 16456
7236 16456 6950 4794 8726 -3334 -4712 -827 -2344 -8563 -11664 -6597 -9844 -11357 -11695 -11950 -8721
7221 -8721 -2491 -4532 -5657 -6188 -17746 -21654 -16907 -9865 -16268 -17062 -7053 -2617 -2103 -10374 -8033
7206h033k78P162q80O239l293j977N567M285J259Q54j0096k765N323q83N407j770
7190F121n33j1511k168r40r79l276l521q083M72J7591J1517k921k439o787q022
7175a5479j582K555m169J974k588m698q589Q688Q359j97K183n273o677N20P747
7160a7226K111m767j483J0733J2178J038n226j74p635o953J144M03R680K382l164
7145f959m720l449R108K822m950k714K1l502K18l816J658N22K297N22Q79J0006
7129b057j344j320o926m588J236n053K997K995J168L958O258j7j0355N515o428
7114a3961j0551L879j476K823R965J486O545Q55k700O831J096k207j082k033J039
7099E09O923m802l602N408l67p0l052j842j935P572N067L297L232J042q792j0142
$$ plain form
7206 -8033 -8311 -1149 -2029 4210 917 -1060 4507 8792 10051 10905 809 -1956 3367 2484 7891 6121
7190 6121 5588 -5923 -8091 -9031 -10010 -13286 -16807 -24890 -24418 -6827 4690 1769 -670 -7457 -15479
7175 -15479 -17061 -14506 -18675 -16701 -19289 -23987 -32576 -23888 -15529 -15726 -13543 -18816 -25493 -24973 -17226
7160 -17226 -15115 -19882 -21365 -10632 1546 2584 -2642 -2816 -10451 -17404 -16260 -15857 -6177 -3795 -6959
7145 -6959 -11679 -15128 -6020 -3198 -8148 -10862 -10841 -14343 -14125 -17941 -16283 -15761 -13464 -12942 -12063 -2057
7129 -2057 -3401 -4721 -11647 -16235 -14999 -20052 -17055 -14060 -12892 -8934 -2676 -2693 -13048 -7533 -13961
7114 -13961 -24512 -20633 -22109 -19286 -9321 -7835 -1290 -435 -3135 3696 4792 2585 1503 -530 509
7099 509 7432 2630 -972 4436 4069 3999 947 -895 -2830 4742 9809 13106 16338 17380 8588 -1554
7083a554k564K766J586m88p689l487K316N590j410K215n81k579K229r289J841
7068a1098O846r86L419N415P165j12p857q974m483M986K176P223k709q316L991
7053c314J0210J333N08n768m749n246j262j478O28O890K465K470o905p021k22
7038a1461N28K071o1k616K780J357k460K371l017K943m607m834k047j230L226
7023a7057q40J939N636J968Q407M434k354k166j805l758k148R87K965Q618k105
7008B721k177j1057j186J056l777l65P015O186l790n596N020K0O812P28q370p176
6992a3936L913M042r107r856O182M293P274Q972r308j554m894p838N279Q624O89
6977g225l995K144P418J724l328l927J002O980O069l705J410m66n701j692n875
$$ plain form
7083 -1554 -4118 -1352 234 -254 -7943 -11430 -9114 -3524 -4934 -2719 -3300 -5879 -3650 -12939 -11098
7068 -11098 -4252 -5238 -1819 3596 10761 10649 2792 -6182 -10665 -5679 -3503 3720 1011 -7305 -3314
7053 -3314 6896 8229 8737 2969 -1780 -7026 -8288 -9766 -9138 -2248 217 2687 -4218 -11239 -11461
7038 -11461 -10933 -8862 -8923 -11539 -8759 -7402 -9862 -7491 -10508 -7565 -12172 -17006 -19053 -20283 -17057
7023 -17057 -17897 -15958 -10322 -8354 53 4487 2133 -33 -1838 -5596 -7744 -6757 -3792 4826 2721
7008 2721 544 -10513 -11699 -10643 -14420 -14785 -7770 -1584 -5374 -10970 -5950 -5930 882 1610 -6760 -13936
6992 -13936 -10023 -5981 -15088 -24944 -18762 -14469 -7195 1777 -7531 -9085 -13979 -21817 -16538 -7914 -7225
6977 -7225 -11220 -9076 -1658 66 -3262 -7189 -6187 793 6862 3157 4567 4101 -1600 -3292 -9167
6962i167l514N985l663j001K630P471K625O640M544r81j3490j439P10k619k070
6947g339q39P900J125l016m784o141j11K342m33j1386L606J1112K471M346P24
6932d23J72n129l511M422L400j586k357Q29m902m239Q309j321j527M908l544K808
6916c691m691j4223R58K710J5818Q365n74n270P82q18n314o212J784K478q09O67
6900h040J664j345R216L243n983J225k239L031J676K155J657q261j0250n356m837
6885b2444P854P991n468o326P18O774O30N265J760l927J725O057L701Q74k992
6870B192k538r393k542K058j657j27J821J530l013j1794N585R224L049k037q99
6855h541M513R97o434j385N848l894N811o024j5845M637R841k109k428O655Q134
$$ plain form
6962 -9167 -12681 -6696 -10359 -11360 -8730 -1259 1366 8006 12550 11569 -1921 -3360 -2650 -5269 -7339
6947 -7339 -8178 -278 847 -2169 -6953 -13094 -13205 -10863 -11296 -22682 -19076 -7964 -5493 -1147 -423
6932 -423 -251 -5380 -8891 -4469 -1069 -2655 -5012 -4183 -9085 -13324 -5015 -6336 -7863 -2955 -6499 -3691
6916 -3691 -8382 -22605 -21647 -18937 -3119 5246 4672 -598 184 -634 -5948 -12160 -10376 -7898 -8707 -8040
6900 -8040 -6376 -7721 1495 4738 -1245 -20 -2259 772 2448 4603 6260 -2001 -12251 -17607 -22444
6885 -22444 -14590 -6599 -12067 -18393 -17675 -10901 -10271 -5006 -3246 -7173 -5448 609 4310 5184 2192
6870 2192 -346 -9739 -12281 -10223 -11880 -12007 -10186 -8656 -11669 -23463 -17878 -8654 -5605 -7642 -8541
6855 -8541 -4028 -3031 -9465 -10850 -5002 -8896 -3085 -9109 -24954 -20317 -10476 -12585 -15013 -8358 -224
6840b24J2084K099l977p077q861K390K914K868p196q557k79P509K837N378L378
6825E286j176k912r367R69M328L127K148K562k796j670L674o680r362m47M638
6810g678K654P294m832o549n255K682L174J0101J380m580L627m016k698n099P926
6795a869K2576M069r431l276k417K196r555o169j255J2895k774q16R864O773o195
6780A4616r767O446P95j805J794k842L532Q4q367Q264J0130J388J207m486J750
6765B2739R986n714p221l226M374o344p593l078J522J334N80M37N602n11l838
6750I049Q447N105q099n257r32L016K879l133N696j191J639p677P713K347Q394
6735B7996O728j805Q23j1602j931L858J2021R148j223j2395J0847O759J2107L1717
$$ plain form
6840 -224 11860 13959 9982 2905 -5956 -3566 -652 2216 -4980 -13537 -13816 -6307 -3470 1908 5286
6825 5286 4110 1198 -8169 -7200 -2872 255 2403 4965 2169 499 4173 -2507 -11869 -12316 -7678
6810 -7678 -5024 2270 -2562 -9111 -14366 -11684 -8510 1591 2971 -1609 2018 -1998 -4696 -9795 -1869
6795 -1869 20707 24776 15345 12069 9652 11848 2293 -3876 -5131 7764 4990 4174 14038 20811 14616
6780 14616 4849 11295 12090 10285 12079 9237 12769 12853 4486 12750 22880 24268 25475 20989 22739
6765 22739 32725 27011 19790 16564 20938 14594 7001 3923 5445 6779 7359 7796 13398 12887 9049
6750 9049 17496 22601 14502 9245 8313 11329 14208 11075 16771 15580 17219 9542 17255 19602 27996
6735 27996 34724 32919 33742 22140 20209 24067 36088 45236 44013 31618 42465 49224 61331 93048
6721I3048K6857K7644K8600L8040L4269L2153L9077J4197m7460o3860m0803l451
6709A78311J5991j73Q390J8846L0813L8767N0795Q1243J19038J94744L01465M73455
6697A511685O58169Q32345R00635M52634m99905j030868r17480n93383l92721
6688I21111k79952j82599j17893o4326m6294m1331k4375k1438j8468j1742j5495
6677I7198j6887k891P533J5736J2327N972Q550K329k0739k6125j4834j1805j2532
6664D3832j4534k506j513K30K27m339K557N050J833m951J0722J4088L7549M3999
6650A32244p65l5489l3486j5966m488p584q662N536j6970j5159M425J92N187J007
6636A0022r814l378K629P08R135k243n419N544K04o602j1781j680L510Q881L125
$$ plain form
6721 93048 119905 147549 176149 214189 248458 280611 319688 333885 286425 222565 181762 178311
6709 178311 194302 194129 202519 221365 252178 290945 341740 422983 542021 736765 1038230 1511685
6697 1511685 2169854 3002199 3902834 4355468 3855563 2824695 1907215 1313832 921111
6688 921111 641159 458560 340667 276341 230047 188716 164341 142903 124435 112693 97198
6677 97198 80311 77420 84953 100689 113016 118988 127538 129867 109128 83003 68169 56364 43832
6664 43832 29298 26792 25279 25509 25736 21397 23954 29004 30837 25886 36608 50696 88245 132244
6650 132244 131479 95990 62504 46538 42050 34466 25804 31340 14370 -789 3636 3828 9015 10022
6636 10022 208 -3170 -541 167 9302 7059 1640 7184 7388 786 -10995 -12675 -9165 -284 2841
6621B841K112n458o604m966j2092n645J966Q589J1911K918j1701j2804k092R08
6607c0117M146J0698Q202J947L95N644l439q492O14P006j50m487K761K920j0606
6592a2958m04J088P370N018N38J740j100l915K278J202p618j4034J509N067J2160
6577b059J4999k647j1370n953k643p873q907l728J0007O421n541O41K626M353
6563a1674K13K094L719P32j429m263j091O893P343O55k885Q208p273R26j510j796
6547a138l957m122n471K51k374Q153R50r962k004M325O099k548M594P073o29k31
6531i91n468K365m209k353N753N143N63m357K331p838j2729R114J1858N174m322
6516C4Q564J038n261j6990j5093K744J4079j400j693N32p813m729N535M655K748
$$ plain form
6621 2841 4953 -505 -7109 -12075 -24167 -29812 -27846 -19257 -7346 -4428 -16129 -28933 -31025 -30117
6607 -30117 -25971 -15273 -7071 -5124 -4729 915 -2524 -11016 -10402 -3396 -3546 -8033 -5272 -2352 -12958
6592 -12958 -13362 -12274 -4904 114 652 2392 1292 -2623 -345 857 -6761 -20795 -19286 -14219 -2059
6577 -2059 12940 10293 -1077 -7030 -9673 -17546 -26453 -30181 -20174 -13753 -19294 -18653 -16027 -11674
6563 -11674 -11461 -9367 -5648 -4916 -6345 -10608 -11699 -4806 2537 3192 307 8515 1242 2168 658 -1138
6547 -1138 -5095 -9217 -14688 -14437 -16811 -8658 -7708 -17670 -19674 -15349 -9250 -11798 -7204 -131 -760 -991
6531 -991 -6459 -4094 -8303 -10656 -4903 240 803 -3554 -1223 -9061 -21790 -12676 -818 4356 34
6516 34 8598 9636 4375 -12615 -27708 -24964 -10885 -12285 -13978 -13446 -21259 -25988 -20453 -15798 -13050
6501a3050K912k14q03O991r19m281o196m337L658K703q3P201l102L97L05k501
6485a1319K554J3542J7890j1200j4798q355n590j79N361J715k244k6L455l237
6471a2431Q10J05J401P6J1965N992m681j0586p944M341J609k146J2094k29k541
6456b165j531Q30j295l911J195n8O335L396k775k738m680j590P984K038l581n552
6440h098N963k953n285n625O646k856k035k889r848L747R718J1527P459l79K429
6425G521j1649j449Q553m054p841p569k740j469P024J0111P778m829k736m949
6411h298m903k69K28K645K618K985Q85k917m318j184l34P866L919q934l638j935
6395a5584r94m589p070M033l102L679J779J6675P763O902l330m425J397R992m165
$$ plain form
6501 -13050 -10138 -10352 -11155 -4164 -5083 -9364 -15560 -19897 -16239 -13536 -13619 -6418 -9520 -9123 -8818 -11319
6485 -11319 -8765 4777 22667 11467 -3331 -11686 -17276 -17455 -12094 -10379 -12623 -12649 -9194 -12431
6471 -12431 -11621 -11516 -10115 -10039 1926 7918 3237 -7349 -15293 -10952 -9343 -11489 605 376 -2165
6456 -2165 -3696 -2866 -4161 -8072 -6877 -6935 -600 2796 21 -2717 -7397 -8987 -1003 1035 -2546 -8098
6440 -8098 -2135 -5088 -10373 -15998 -9352 -12208 -14243 -17132 -26980 -23233 -13515 -1988 5471 5092 7521
6425 7521 -4128 -5577 2976 -1078 -8919 -16488 -19228 -20697 -13673 -3562 4216 -613 -3349 -8298
6411 -8298 -13201 -13470 -13242 -10597 -7979 -4994 -4109 -7026 -11344 -12528 -12862 -4996 -1077 -10011 -13649 -15584
6395 -15584 -16578 -21167 -28237 -24204 -27306 -23627 -21848 -5173 2590 9492 6162 1737 3134 13126 8961
6380H961q257J620J304K307j136N702m333j2928l15J1911Q092O273m877n339j4300
6365e315q860L560L155j0406q620M505O821P461j0279q131J0767M286M345m086
6351a0797J462R728Q970M197J33L703R30m324l497p559j4272n140M225N442K471
6336d328J639P0l21l347o595j153K808P762J967l837k771O226P901P771q621j442
6320C729M091L63P621M776L873r895m255m101j155m062j0408n273M898l838r187
6305b2823P106J5829m13m212o087J440p16L81K487O112L87m470j0238M19J5570
6290G72J1413m605j2610o67Q83J346P619k40k265j0773k288k809n080O404K791
6275a0109k452P659q841m369L380k187J957Q683P583k96p964n58L058k49j2090
$$ plain form
6380 8961 704 2324 3628 5935 4799 10501 6168 -6760 -7075 4836 12928 19201 14324 8985 -5315
6365 -5315 -14175 -10615 -7460 -17866 -26486 -21981 -15160 -7699 -17978 -26109 -15342 -11056 -6711 -10797
6351 -10797 -9335 393 9363 13560 13693 17396 18326 14002 10505 2946 -11326 -16466 -12241 -6799 -4328
6336 -4328 -2689 -2619 -2940 -6287 -12882 -14035 -11227 -3465 -1498 -5335 -8106 -1880 6021 13792 5171 3729
6320 3729 7820 8183 15804 20580 24453 14558 10303 6202 5047 985 -9423 -14696 -9798 -13636 -22823
6305 -22823 -15717 112 -301 -4513 -10600 -9160 -9876 -9495 -7008 -896 -509 -4979 -15217 -14798 772
6290 772 12185 7580 -5030 -5697 -4814 -3468 4151 3911 1646 -9127 -11415 -14224 -19304 -12900 -10109
6275 -10109 -12561 -4902 -13743 -18112 -14732 -16919 -14962 -6279 1304 1008 -6956 -7514 -4456 -4705 -16795
6260a6795J623n988K764P581J8m289P013l08j0919l31J3168j795o066O694J298
6245f332q647m947Q915J876K589P927m348k833L968j841K527O093k380n483j392
6230d308o959M990N925l543q365p196J257k709K63R357J1363K99L504J306k877
6215B307j3206p393J507K898n166P284K846o398M362J0305n602q241o547M817
6201a6227o36M689J828R983Q900J982L319k740m912n78q449K435J349q764p01
6186h522k021O393M363K549n698p044K30K918O512K220L009L33j876k137l877
6171b648M265l56M349q602l342j681r342l870J5064J0340L854j0595m260M182
6157b642J0417Lm546o810N39n106N435j828M117L394N136j573n733l461r754m767
$$ plain form
6260 -16795 -15172 -21160 -18396 -10815 -10797 -15086 -8073 -8381 -19300 -19631 -6463 -8258 -14324 -7630 -6332
6245 -6332 -14979 -19926 -11011 -9135 -6546 1381 -2967 -5800 -1832 -3673 -1146 4947 2567 -2916 -4308
6230 -4308 -11267 -6277 -352 -3895 -12260 -19456 -18199 -20908 -20645 -11288 75 374 3878 5184 2307
6215 2307 -10899 -18292 -16785 -13887 -19053 -11769 -8923 -15321 -10959 -654 -6256 -14497 -21044 -16227
6201 -16227 -16863 -12174 -10346 -363 8537 10519 13838 11098 6186 5608 -2841 -406 943 -7821 -8522
6186 -8522 -10543 -4150 213 2762 -2936 -9980 -9750 -6832 -320 1900 4909 5242 3366 1229 -2648
6171 -2648 1617 1261 5610 -2992 -6334 -8015 -17357 -21227 -6163 4177 8031 -2564 -6824 -2642
6157 -2642 7775 7778 3232 -3578 -3039 -8145 -2710 -4538 -421 2973 8109 6536 803 -2658 -12412 -17179
6141a7179j712N421K681o391k162J690L807j754l133J0477J1620J971j5494q277
6127a8435m3o013M338M211l424m318r18r83R497P174J0653L603m271M031n326
6112b24m394j1339p847L503J5209J0265j789J818q23M822k228k402q344p548K952
6097h369Q45J279L309p311n937P6N308P421J0251J2094p475o728l970n999p710
6082a2916l902N152j1758m057J105O001J1153N526J3820L859k288n50k677o649
6068A819j0013n047O137J885J67m955M663J914l273O044r82m615J009n814n801
6053a6862O490m46K100j624L445N321J169M2n931r145p812k759k191O143J0000
6038a2060M949p08p40l411l689L312K909K417P471m374p845k747O620K532L380
$$ plain form
6141 -17179 -18891 -13470 -10789 -17180 -19342 -17652 -13845 -15599 -18732 -8255 3365 5336 -10158 -18435
6127 -18435 -18478 -24491 -20153 -15942 -19366 -23684 -24602 -25585 -16088 -8914 1739 5342 1071 5102 -224
6112 -224 -4618 -15957 -23804 -20301 -5092 5173 3384 5202 4379 9201 6973 4571 -3773 -11321 -8369
6097 -8369 -7524 -6245 -2936 -10247 -16184 -16108 -10800 -3379 6872 18966 11491 4763 793 -5206 -12916
6082 -12916 -16818 -11666 -23424 -27481 -26376 -20375 -9222 -3696 10124 13983 11695 11145 8468 1819
6068 1819 -8194 -13241 -7104 -5219 -5052 -10007 -5344 -3430 -6703 -659 -1641 -6256 -5247 -11061 -16862
6053 -16862 -10372 -10818 -8718 -10342 -6897 -1576 -407 -365 -6296 -15441 -23253 -26012 -28203 -22060 -12060
6038 -12060 -7111 -7819 -8559 -11970 -15659 -12347 -9438 -7021 450 -3924 -11769 -14516 -7896 -5364 -1984
6023a984J314p306J56L183P275L508M898N263R17n962m850k605r824n241K616
6008h642Q373O911j0107L685k973p586m828k08K652k753j899M595M352L727P696
5993B995j22q557j4487k068J3450R586r816o072J2540m787o245O1P255M480o926
5978h713j131O723l246j2183J537J907J2089J1615J109j0100j6536j3413N919
5965b4423N246Q88L893j979J873N659O855j078j1398M799L025N869L096P786l802
5950F309l347l096r660l394R849Q691p1j1407q399K046Q52J824J0245N897l649
5935B690J553k629q727P432m791q502o83m865M861n606o444O920R333P885M168
5920B595l029m72K960R348J698j1194l158j2509K495J1662k60p804n44P99J3057
$$ plain form
6023 -1984 -670 -7976 -7820 -4637 2638 6146 11044 16307 17224 11262 6412 3807 -6017 -11258 -8642
6008 -8642 -269 6642 -3465 220 -2753 -10339 -15167 -15375 -12723 -15476 -17375 -12780 -8428 -4701 2995
5993 2995 2873 -5684 -20171 -22239 -8789 797 -9019 -15091 -2551 -7338 -13583 -13522 -6267 -1787 -8713
5978 -8713 -9844 -3121 -6367 -18550 -17013 -15106 -3017 8598 9707 -393 -16929 -30342 -24423
5965 -24423 -19177 -18289 -14396 -16375 -14502 -8843 -1988 -3066 -14464 -9665 -6640 -771 2325 10111 6309
5950 6309 2962 -134 -9794 -13188 -3339 5352 5281 -6126 -14525 -12479 -11627 -9803 442 6339 2690
5935 2690 4243 1614 -7113 319 -4472 -12974 -13657 -18522 -13661 -19267 -25711 -18791 -9458 -1573 2595
5920 2595 -434 -906 2054 11402 13100 1906 -1252 -13761 -11266 396 136 -7668 -8212 -7413 5644
5905E644M029p04j0248o142qN686L901p42l138o594l941j815p242K167O513n158
5889a7792j78J980N45Q21M325J4204j479j1467m87M226N398N068o347k668J004
5874b847k568r663m498k422J619M687J2324N456n303r497Q024L294m033m195l724
5859a3346l157n768k397l700N667R539P260K152q019L982J645J232k207N888K94
5844i35p498M715q744o200Q52P802J675O160r59j1637n605K900J1707m347o178
5829a6292K220N317j071N677J1386o627k930j313N507M491l239n474K596q097
5815g849j465j606J925p366J026N904O195j415P118j096o53j062m618Q097R710
5800A2845m405p118j267l587l103J155j46K357J874O078O843l240k749o781q37
$$ plain form
5905 5644 9673 8969 -1279 -7421 -7429 -1743 2158 1416 -1722 -8316 -12257 -14072 -21314 -19147 -12634 -17792
5889 -17792 -17970 -15990 -15445 -14624 -10299 3905 2426 -9041 -9528 -5302 96 5164 -1183 -3851 -2847
5874 -2847 -5415 -15078 -19576 -21998 -20379 -15692 -3368 2088 -3215 -12712 -4688 -1394 -5427 -9622 -13346
5859 -13346 -16503 -22271 -24668 -28368 -22701 -13162 -5902 -3750 -11769 -7787 -6142 -4910 -7117 -1229 -935
5844 -935 -8433 -3718 -12462 -18662 -17810 -10008 -8333 -2173 -3132 -14769 -20374 -17474 -5767 -10114 -16292
5829 -16292 -14072 -8755 -9826 -4149 7237 610 -2320 -3633 1874 6365 3126 -2348 248 -7849
5815 -7849 -9314 -10920 -8995 -16361 -15335 -9431 -3236 -4651 2467 1371 718 -344 -4962 3135 12845
5800 12845 8440 1322 55 -3532 -6635 -5480 -5626 -3269 -1395 4683 11526 8286 5537 -1244 -2081
5785b081j943R861L004l448K70k733Q435M201n176j1151l421r604L587R541K028
5770A370r3J809j0588n373L609r131J808J0955J256L244N252O394K236l947m193
5755D608l709l72k645R74k365k086n129k093L96k086m49o039P936P813O887L293
5739D934R424k076l474k235r047m362L489P657K986o406J108j19k038p38n10P461
5723F054r090k860n68j56k804j0209k422K389J1310K898j532k488m088M637M753
5708d176L236p907k533J702L81j011M509N788m03Q17R365N729r03k078R99o020
5692G495K026q043J072N007O238j928j3280j620M059K160q094m425p506L669Q980
5677d190L57m302L299J472j772K861R530m28m846L685J578j5769j3082k863J1625
$$ plain form
5785 -2081 -4024 5837 8841 5393 5663 2930 11365 15566 10390 -761 -4182 -13786 -10199 -658 1370
5770 1370 1277 3086 -7502 -12875 -9266 -18397 -16589 -5634 -4378 -1134 4118 10512 12748 8801 4608
5755 4608 899 527 -2118 -1144 -3509 -5595 -10724 -12817 -12421 -14507 -14956 -20995 -13059 -5246 1641 4934
5739 4934 14358 12282 8808 6573 -2474 -6836 -3347 4310 7296 890 1998 1879 -159 -897 -1407 6054
5723 6054 -3036 -5896 -6464 -6620 -9424 -19633 -22055 -19666 -8356 -5458 -6990 -9478 -13566 -8929 -4176
5708 -4176 -940 -8847 -11380 -9678 -9297 -10308 -5799 -11 -414 403 9768 15497 14594 12516 13515 7495
5692 7495 9521 1478 2550 7557 13795 11867 -1413 -3033 1026 3186 -4908 -9333 -16839 -13170 -4190
5677 -4190 -3833 -8135 -4836 -3364 -5136 -2275 7255 6827 1981 5666 7244 -8525 -21607 -24470 -12845
5662a2845J0915K019J197J435j1829m631R401J5576o347j2565j1661L190R995
5649f150J012L014J225M253l3j3941m236O999J969K023Q34p674o235J0383M610
5634a947r777n885J1103J8063L879J062o948q874o42M171j107j432l269j1987
5620a3590l187j708j370P47N288J475m472J730M587J155k097P232N393L324m380
5605A27j2489J1512k412k707N964j0774p327K016J240L468N84l547K239L871J397
5590f838J483j778m895M48M850P386n571r740K915K307M551j0405l559M206N025
5575i615k150Q98l291P767M297j900L994O935J818n398L313M845P17r303n201
5560b274Q00l888L603r13p730K359O739J981k78K304K279m842Q412p12k093r835
$$ plain form
5662 -12845 -1930 89 1286 2721 -9108 -13739 -4338 11238 4891 -7674 -19335 -16145 -6150
5649 -6150 -5138 -2124 -899 3354 3321 -10620 -14856 -7857 -5888 -3865 -3031 -10705 -16940 -6557 -1947
5634 -1947 -11724 -17609 -6506 11557 15436 16498 9550 676 34 4205 3098 1666 -1603 -13590
5620 -13590 -16777 -18485 -19855 -19108 -13820 -12345 -16817 -15087 -10500 -9345 -11442 -4210 1183 4507 127
5605 127 -12362 -850 -3262 -5969 -5 -10779 -18106 -16090 -14850 -11382 -10798 -14345 -12106 -8235 -6838
5590 -6838 -5355 -7133 -12028 -11580 -6730 656 -4915 -14655 -11740 -9433 -4882 -15287 -18846 -14640 -9615
5575 -9615 -11765 -10867 -14158 -6391 -2094 -3994 0 6935 8753 3355 6668 11513 12230 2927 -2274
5560 -2274 -1474 -5362 -1759 -2672 -10402 -8043 -1304 677 399 2703 4982 140 8552 7840 5747 -4088
5544d088j703l197q85J273P286r514l793j616L737R444L924J568j525L947q629
5529c771K889M434k932p727n934n088K703K049Q893J1067k87j3740m340M010J5818
5514H044l214K806m093M377n999k786j264j049q208p089o57Q47L618K190O509
5499e968k70m864l559P066M444o565O410J579m030OJ1032l096q077n529o201K912
5483a4710J0433K124k918O023k005l895p902M69Q485K461n81l259k057q258k084
5468a7674P980K341r434j0896J9232K4953o096l225p590n718m954m762P013Q184
5454f46J847o54M32k519M85p04Q26n747M658j121R59o755l49O538J1543j136m961
5437B696o738j699j855L836P927K442q088K515Q03n453m474p083L938j780l821
$$ plain form
5544 -4088 -5791 -8988 -9873 -8600 -1314 -10828 -14621 -16237 -12500 -3056 868 2436 911 4858 -3771
5529 -3771 -882 3552 620 -7107 -13041 -18129 -15426 -13377 -4484 6583 6296 -7444 -11784 -7774 8044
5514 8044 4830 7636 3543 7920 1921 -865 -2129 -3178 -11386 -18475 -19132 -18285 -14667 -12477 -5968
5499 -5968 -6238 -11102 -14661 -7595 -3151 -9716 -3306 -1727 -5757 -5751 5281 2185 -5892 -11421 -17622 -14710
5483 -14710 -4277 -2153 -5071 952 -1053 -4948 -12850 -12381 -3896 -1435 -2016 -5275 -7332 -15590 -17674
5468 -17674 -9694 -7353 -16787 -27683 -8451 16502 10406 7181 -409 -6127 -11081 -15843 -8830 -646
5454 -646 1201 547 979 -1540 -1055 -1759 -933 -6680 -2022 -3143 -2184 -8939 -9288 -2750 8793 7657 2696
5437 2696 -4042 -5741 -7596 -3760 4167 6609 -1479 1036 1839 -3614 -8088 -15171 -11233 -13013 -16834
5422a6834J346J0569P995j662L685j720p170Q226J0697j193j21q15o219j1015
5408d231q506j104J694R43l580n106N499J719M766J0232P685M93K164l151n074
5393D443L493K392p830l214O547J0551l11q771r019p458l159M50o599P015L913
5378g557M897L076n888j236R236n784l476n050P65P60K951k479L603R19P188L986
5362E911j662o748p420J522N346L02K891o382L719O947j0129l105O821N038l4
5347C017r79j3589j1580k140J1189J3288n385o592M758O101N144r087o291k971
5333a5117J226J2824K591K88L125l004k06j3632l647M52J3160J060j0950q5M581
5318g334J0863O834N163J709m983k086o949j3089o510K771N700R621m408m674
$$ plain form
5422 -16834 -15488 -4919 3076 1414 5099 3379 -3791 4435 15132 13939 13818 13003 6784 -4231
5408 -4231 -12737 -13841 -12147 -11204 -14784 -19890 -14391 -12672 -7906 2326 10011 10504 12668 9517 4443
5393 4443 7936 10328 2498 -716 5831 16382 16071 7300 -1719 -9177 -12336 -11886 -18485 -11470 -7557
5378 -7557 -2660 416 -5472 -6708 2528 -3256 -6732 -11782 -11017 -10257 -7306 -9785 -6182 -5263 1925 5911
5362 5911 4249 -2499 -9919 -8397 -3051 -2749 142 -6240 -2521 4426 -5703 -8808 -1987 3051 3017
5347 3017 2038 -11551 -23131 -25271 -14082 -794 -6179 -12771 -8013 -1912 3232 -5855 -12146 -15117
5333 -15117 -13891 -1067 1524 1812 4937 1933 1727 -11905 -15552 -15100 -1940 -880 -11830 -11915 -7334
5318 -7334 3529 10363 15526 17235 12252 10166 3217 -9872 -16382 -13611 -7911 1710 -2698 -7372
5304g372k647l418J753J109L826J602M610K105r668K810l688r244n461O410Q23
5289a6450J776J0459K962j367j551j0189P3P067l77Q557J0922m298p816p32K607
5274A643O346J1158p809p137n476n147k37N314J0666O783K194J428O329m311j0847
5259A0897j5277k537O376Q047K228j2442q265L123J393L149J0139J1672l576L68
5245A5295r182j0605m925K321j700Q089J2403R360q990j1933j197P600R567l026
5231A3077j0202l790L595K108p180m756j357o592r949O42l884Q00M377P267J271
5216a4573K160J0356N221j8515k601M106P752p465j904k088j313J2018M07o667
5202a3106n346P40J2303N342O612N028m957M58o424p53o99J179q645M88R527n68
$$ plain form
5304 -7372 -10019 -13437 -11684 -10575 -6749 -5147 -537 1568 -8100 -5290 -8978 -18222 -23683 -17273 -16450
5289 -16450 -14674 -4215 -1253 -2620 -4171 -14360 -14287 -7220 -7597 960 11882 7584 -232 -964 1643
5274 1643 7989 19147 11338 4201 -1275 -6422 -6659 -1345 9321 16104 18298 19726 26055 21744 10897
5259 10897 -4380 -6917 -541 7506 9734 -2708 -10973 -7850 -6457 -3308 6831 18503 14927 15295
5245 15295 6113 -4492 -9417 -7096 -8796 -707 11696 21056 12066 133 -1064 6536 16103 13077
5231 13077 2875 -915 2680 4788 -2392 -7148 -8505 -15097 -25046 -24404 -28288 -27488 -23111 -15844 -14573
5216 -14573 -12413 -2057 3164 -15351 -17952 -13846 -6094 -13559 -15463 -17551 -18864 -6846 -6439 -13106
5202 -13106 -18452 -17712 -5409 -67 6545 11573 6616 7074 650 -103 -802 377 -8268 -7780 1747 1179
5186A179r608o45P861k791p830P521P267L541P25l545M326P496j200r502n503
5171g08p543n202J167P241m0j0442l004J1095J0560L642M321R510m15p99p578
5156A1805p303q652n333N138J381M194l790p32o3O34o815R308J0843o022j448
5141C145m81r806m606l112O113O101J3242K167q803k597m10J434o545j0848L429
5126a1577O723P379K535n780l983o978m263M023p160K274K327J6505N829Q996
5112A6850P894j0682p594O625l304m574p114m674k031L270R90M246Q664J6735
5098B5301J792j1585j2567j3175q187O688O429j868p817k918J0611Q115M458K338
5084G615K681N78K3q418p377J634K968N06l898k577M431N449J610L163K076j3399
$$ plain form
5186 1179 -8429 -9074 -1213 -4004 -11834 -4313 2954 6495 7220 3675 8001 15497 14297 4795 -708
5171 -708 -8251 -13453 -12286 -5045 -5085 -15527 -18531 -7436 3124 6766 11087 20597 20182 19383 11805
5156 11805 4502 -4150 -9483 -4345 -2964 1230 -2560 -3292 -3355 -2721 -9536 -228 10615 4593 3145
5141 3145 2664 -7142 -11748 -14860 -8747 -2646 10596 12763 3960 1363 953 2387 -4158 -15006 -11577
5126 -11577 -4854 2525 5060 -720 -4703 -11681 -15944 -11921 -19081 -16807 -14480 2025 7854 16850
5112 16850 24744 14062 6468 13093 9789 5215 -1899 -6573 -8604 -5334 -4344 -98 8566 25301
5098 25301 27093 15508 2941 -10234 -18421 -11733 -5304 -7172 -14989 -17907 -7296 819 5277 7615
5084 7615 10296 10874 10897 2479 -4898 -3264 -296 210 -3688 -6265 -1834 3615 5225 8388 10464 -2935
5068b935l645j226J407L216j78q410O788n33j0208n435M915k483K18M360M453
5053i696M562l11j444J347N285l818o44O2l781L035L353j588l64J542l240N955
5037B55L603K982j1885k865J062K322k418j0260q035k047J2432P32M878J0859
5023A615P944N325p41n351r700J235J0648L095m61j2534m149j413l928K93L913
5008d209J2003N177n616J016q157p320m3n124M32L064j6463L9P146M739O435R963
4992C082R866j280m387Q23O2p425K010K767l955r270n224l71J0344P230j193p095
4976d016J585P124O01j557l020j063j542p568L585l043j701N437L511O07L618
4961B558J866n067K73J0088L279j1867j3065N100Q793P872j696J781m375m652
$$ plain form
5068 -2935 -6580 -7806 -6399 -3183 -3361 -11771 -4983 -5516 -15724 -21159 -16244 -18727 -18509 -14149 -9696
5053 -9696 -5134 -5445 -6889 -5542 -257 -4075 -4719 -4657 -8438 -5403 -2050 -3638 -4002 -2460 -5700 255
5037 255 3858 6840 -5045 -7910 -6848 -4526 -6944 -17204 -25239 -27286 -14854 -14122 -9244 1615
5023 1615 9559 14884 14143 8792 -908 327 10975 14070 13609 1075 -3074 -4487 -8415 -8122 -4209
5008 -4209 7794 12971 7355 8371 214 -7106 -7149 -12273 -11841 -8777 -25240 -25201 -18055 -13316 -6881 3082
4992 3082 12948 11668 7281 8104 8166 741 2751 5518 1563 -7707 -12931 -13302 -2958 4272 3079 -4016
4976 -4016 -2431 4693 5294 3737 717 -346 -1888 -9456 -5871 -8914 -10615 -5178 -1667 -1060 2558
4961 2558 4424 -643 -370 9718 12997 1130 -11935 -6835 1958 9830 8134 9915 5540 888
4947H88M469k176Q135k058j109n37O912o130l439J112L692q515q585j270J248
4932g363L248m174p01O775n074Q371K947o760o588J879J98Q993M192J435k71N047
4916A2154k92k657j458j0290m885M876L630l407o106l560j360J3486O292L949
4902A0372J69k254l45n682r723j0793M653J826K409n86P85O298N772L957p070
4887b12m200L559l493m7m074j1609J728J618k152j858M866J1826M983l55l873
4872c293Q442N992n205j579Q197J349m239O06p176p136p064L553Q054M999m782
4857G18j284l126m066N478J0327M577m73p588r048Q629Q830o540j338L994r196
4842a06J24K758p16o406L94l112l366o41L086N262K187k035l349K521j0468P49
$$ plain form
4947 888 5357 3181 11316 9258 8149 7612 14524 8394 4955 6067 9759 1244 -7341 -8611 -7363
4932 -7363 -4115 -8289 -8990 -2215 -7289 1082 4029 -2731 -9319 -7440 -7242 1751 5943 7378 7107 12154
4916 12154 11862 9205 7747 -2543 -7428 -2552 1078 -2329 -8435 -11995 -13355 131 6423 10372
4902 10372 10541 8287 7942 2260 -7463 -18256 -13603 -11777 -9368 -9954 -9169 -2871 2901 6858 -212
4887 -212 -4412 -853 -4346 -4393 -8467 -20076 -18348 -16730 -18882 -20740 -15874 -4048 935 580 -3293
4872 -3293 5149 11141 5936 4357 12554 13903 9664 10270 3094 -4042 -11106 -7553 501 5500 718
4857 718 -566 -3692 -7758 -2280 8047 12624 12151 4563 -4485 4144 12974 6434 5096 9090 -106
4842 -106 18 2776 2060 -4346 -3952 -7064 -10430 -11071 -7985 -2723 -536 -2571 -5920 -3399 -13867 -13118
4826a3118M855l500l545J3063N74m090K831J0948k79j3334J19k875m567Q716K795
4811a407p732n680J3778o62m961n569m797j413J1565l106K475n332N085J3621
4797E865Q077K616q428k952k709n064O03L586O26q526l318J0679k845l341N570
4782D39q075o674M85N253o616L354N987M165j787L988n616J3484K851k105j698
4767G435P706Q917k846q768r04n897q242n776n256k65J2864L087l719l80R009
4752F965O325J2124j1394p619R735L519p408q228J802j542J988j351m933j089
4738a106n07k330o352N815L218k8P911N141j4855p4R349P379O62O037K808o163
4722A6905n684j214o057o400L969l318j038L185O68k871P927L855q728J657k958
$$ plain form
4826 -13118 -8263 -11763 -15308 -2245 -1671 -5761 -2930 8018 7739 -5595 -5476 -8351 -12918 -4202 -1407
4811 -1407 -9139 -14819 -1041 -1703 -6664 -12233 -17030 -18443 -6878 -9984 -7509 -12841 -7756 5865
4797 5865 13942 16558 8130 5178 2469 -2595 -1992 1594 2220 -6306 -9624 1055 -1790 -5131 439
4782 439 -7636 -14310 -13825 -8572 -15188 -11834 -5847 -1682 -3469 519 -5097 8387 11238 9133 7435
4767 7435 15141 24058 21212 12444 11540 5643 -2599 -8375 -13631 -13896 -1032 2055 -1664 -2044 6965
4752 6965 13290 25414 14020 6401 16136 19655 12247 4019 5821 4279 6267 4916 -17 -1106
4738 -1106 -1613 -3943 -10295 -4480 -1262 -1290 6621 11762 -3093 -3167 6182 13561 14223 20260 23068 16905
4722 16905 11221 10007 3950 -2450 1519 -1799 -2837 348 1016 -1855 6072 9927 1199 2856 -102
4707a02p997q967n502P256Q699Q780J254K356L462j1291J646L859P299J3082J219
4692B5053l620n925j0435o947q78K041Q078j834J050Q654l128r739k485k782J216
4677a681J1348J258J236J901n459j0063J802M2j742K182j782m974R32O840J298
4662C138j0927L334Q570P778p192m602M726k074k599q642p643p270m12J1338P921
4647d556j228k676J7751q28j016o756n927M205K049p720k851L586O239r34J436
4632G74M787J287l645J77p889r77R72P866J0006J562l542q595q574l754J0746
4617A201K495M15R46R1L66k588J111O041l71o706J748l845k682M926L140m454
4601A834m551p49O199o537L160o10n894k398K021Q448l58O183k46J560L678k524
$$ plain form
4707 -102 -8099 -17066 -22568 -15312 -6613 2167 3421 5777 9239 -2052 -406 3453 10752 23834 25053
4692 25053 21433 15508 5073 -1874 -2752 -711 7367 5533 6583 15237 12109 2370 -115 -2897 -1681
4677 -1681 9667 10925 12161 14062 8603 -1460 342 384 -1358 824 -958 -5932 -5000 1840 3138
4662 3138 -7789 -4455 4115 11893 4701 99 4825 2751 152 -8490 -16133 -23403 -23815 -12477 -4556
4647 -4556 -5784 -8460 9291 8463 7447 691 -5236 -1031 1018 -6702 -9553 -5967 272 -662 774
4632 774 5561 6848 3203 3380 -4509 -5486 -4514 3352 13358 14920 11378 2783 -5791 -9545 1201
4617 1201 3696 4111 5057 5148 5514 2926 4037 10078 9707 3001 4749 904 -1778 3148 6288 1834
4601 1834 -2717 -3466 2733 -3804 -644 -1254 -7148 -9546 -7525 923 565 6748 6502 8062 11740 9216
4585I216n249m332Q59O767Q384l804n105m217r566k213M3L124R265k768r145n462
4569a4203k107N757K09K3l34n801m796K290k514J565J0099J3136M202k46o409
4554H71o925l10k072l793M967K425L891L558q27J2696n92j7473p305k479J176
4539a2192J601M505M00k504o035N225J2299M160K865J652r9K221p949j0007l207
4524g065m702r145J907J1632M489j2854m927Q629J3918l81r046M738O346N673
4510I212J313p444J122J20o144n145J987O119J7733L33q154j03Q87j053q594j1193
4494i004j230R427m077m077J0620L4P08k70P1L104j057N487M399m786K036j4738
4478c353m116P948O284R52j366r11J0755P981K600l461j7642j4767m24j722j626
$$ plain form
4585 9216 3967 -365 494 7261 15645 11841 6736 2519 -7047 -9260 -9217 -6093 3172 404 -8741 -14203
4569 -14203 -16310 -10553 -10344 -10321 -10655 -16456 -21252 -18962 -21476 -19911 -9812 3324 7526 7280 871
4554 871 -6054 -6364 -8436 -12229 -7262 -4837 -946 2612 1785 14481 13889 -3584 -10889 -13368 -12192
4539 -12192 -10591 -6086 -5686 -8190 -14225 -9000 3299 7459 10324 11976 11877 14098 6149 -3858 -7065
4524 -7065 -11767 -20912 -19005 -7373 -2884 -15738 -20665 -12036 1882 1501 -7545 -2807 3539 9212
4510 9212 10525 3081 4203 4323 -1821 -6966 -4979 1140 18873 19206 11052 10949 11836 10783 2189 -9004
4494 -9004 -10234 -807 -4884 -8961 1659 1693 2401 2131 2202 5306 4249 9736 14135 9349 11385 -3353
4478 -3353 -7469 479 6763 7715 6349 5438 16193 24174 26774 23313 5671 -9096 -9520 -11242 -12868
4463a2868L543l252j437m40N268N56K625Q638J967j0094j0349O096N087O022J485
4448B847j928O60q68l255l724j323K158M146O058j0551j626Q662N613l941k312
4433F16P844L121J020o025q776m22J1745J2316j975m972p074n320O55j076l615
4418a938j583M783J4p022n102k386k272K880J2988m569j3395L505J977o188J2991
4403e317N558p555M597M365K759j621M448m603L059q702m091K871K698o037j2814
4388b0385Q128M272Q286O949q700j9027r632O896N150N163R606J144K029N538
4374E417p495l038P916J0028o428o928p65P396l434r129m839R663J497L16M707
4359D884p822p486m833J0792K386m144R4M751m084N270Q919l700o377O393P800
$$ plain form
4463 -12868 -9325 -12577 -14014 -14454 -9186 -8630 -6005 2633 4600 -5494 -15843 -9747 -4660 1362 2847
4448 2847 919 1579 711 -2544 -6268 -7591 -5433 -1287 4771 -5780 -7406 1256 6869 2928 616
4433 616 8460 11581 12601 6576 -2200 -2622 9123 21439 19464 14492 7418 2098 2753 1677 -1938
4418 -1938 -3521 1262 1276 -5746 -10848 -13234 -15506 -12626 362 -4207 -17602 -14097 -12120 -18308 -5317
4403 -5317 241 -7314 -2717 1648 4407 2786 7234 2631 5690 -3012 -7103 -4232 -1534 -7571 -20385
4388 -20385 -12257 -7985 301 7250 -1450 -20477 -30109 -23213 -18063 -12900 -3294 -2150 -121 5417
4374 5417 -2078 -5116 2800 12828 6400 -528 -1293 6103 2669 -6460 -11299 -1636 -139 177 4884
4359 4884 -2938 -10424 -15257 -4465 -2079 -6223 -6129 -1378 -5462 -192 8727 5027 -1350 5043 12843
4344A2843J992o585m430j442q930O677J807K415K347m27p058R006m037J1071L901
4329A9150j5121o532N232O923r48j2874n894M744p18k859P116p972K348N12P592
4314F99L865o607l404K549P890R020r550j2085K512O915k238l110J975l764j038
4299f371l489J430J211K267N445Q65j792k160k650o142N725n902J641L289L136
4284c497Q823O399M362k2733n896P975J2672N452l4j6415j2876M882P902L544
4270E60J370O693r776p562J007j630j0945J1566Q101L335L936o885k239L385l642
4255b726R168M754n488O456K408n931o916j672l127l009O499M537J544J50m835
4240A812J211r6m321M097N99m159K905J258l281M054K227m486l956n144K357N987
$$ plain form
4344 12843 14835 8250 3820 2378 -6552 125 1932 4347 6694 6267 -791 8215 4178 15249 19150
4329 19150 4029 -2503 2729 9652 8704 -4170 -10064 -5320 -6038 -8897 -1781 -9753 -7405 -6893 699
4314 699 4564 -2043 -5447 -2898 4992 14012 4462 -7623 -5111 1804 -434 -3544 -1569 -5333 -6371
4299 -6371 -9860 -8430 -7219 -4952 493 1358 -434 -2594 -5244 -11386 -5661 -11563 -9922 -6633 -3497
4284 -3497 5326 11725 16087 -6646 -12542 -4567 8105 13557 13523 -2892 -15768 -10886 -2984 560
4270 560 1930 8623 -1153 -8715 -7708 -9338 -20283 -8717 -616 2719 6655 -230 -2469 916 -2726
4255 -2726 6442 11196 5708 12164 14572 8641 1725 53 -3074 -6083 416 4953 6497 6647 1812
4240 1812 3023 2927 -1394 2703 3302 -857 2048 3306 25 4079 6306 1820 -2136 -7280 -4923 1064
4224A064K721p595j862J586q13K658M208N348N98N873m297j6497K257O317l933
4209b367o628M479Q732J873M416R145m825j1272L369N823p309j0973o597K876
4195i258n113O078J0233j137n193J312L767O406M9j2672L656L118m94m336P295
4180C711J3504j069n453k649n23m537p372j81l06O902O642r9P261n686j3066p444
4164a0365n753K276l9P193P715m088m119k224K239M897J484m284N336M311K17
4149D796q806o809l530M800L220n178K441l378M595o88l511k602k690P164J789
4134h387K607J870k272R200k957M730P161N926r048K427P501m988j1367n397l183
4119f177r14N529O3l858R722P705J752j504q475p272l374j189N599K195m701J287
$$ plain form
4224 1064 3785 -3810 -5672 -4086 -4899 -2241 1967 7315 7913 13786 9489 -7008 -4751 1566 -2367
4209 -2367 -8995 -4516 4216 6089 10505 19650 14825 3553 6922 12745 5436 -5537 -12134 -9258
4195 -9258 -14371 -8293 1940 803 -4390 -3078 689 7095 7144 -5528 -1872 1246 752 -3584 3711
4180 3711 17215 16146 10693 8044 7521 2984 -4388 -4569 -4875 2027 8669 8570 15831 10145 -2921 -10365
4164 -10365 -16118 -13842 -13881 -6688 1027 -3061 -7180 -9404 -7165 -2268 -784 -5068 268 4579 4796
4149 4796 -4010 -10819 -14349 -9549 -6329 -11507 -9066 -12444 -7849 -8537 -12048 -14650 -17340 -10176 -8387
4134 -8387 -5780 -3910 -6182 3018 61 4791 11952 17878 8830 11257 18758 13770 2403 -2994 -6177
4119 -6177 -7091 -1562 -1499 -5357 4365 12070 13822 12318 3843 -3429 -6803 -7992 -2393 -198 -4899 -3612
4103c612m26J483J179k327k201M566l055J945Q505n355k545j3775P090J4317k219
4088C570j049N766j298o671o972n913Q48P088N756J930q395l850o384J918J482
4073a2174L648M343M055l007K037J3852l159q526j280l221m009O983P190k677
4059D055n464n993L88M268N935J70j685r966n507N372J0596K603q905J836K305
4044Ho928o77K969O660Q765j7568o397O155M917K224J009L445M312m117j650J810
4028D937k371r013Q729p570k941M3q761N016J4407M084j1235k340J256O005P268
4013G514l777l564m056J006R45L247K63j5621k266J4096O369q197j1828O770Q996
3998a03R557L663q693L243l640l325m954j221P600k23K413L717L532P637q133
$$ plain form
4103 -3612 -4038 -2555 -1376 -3703 -5904 -1338 -4393 -2448 6057 702 -1843 -15618 -8528 5789 3570
4088 3570 2521 8287 6989 318 -6654 -12567 -11719 -4631 1125 3055 -5340 -9190 -15574 -13656 -12174
4073 -12174 -8526 -4183 -128 -3135 -1098 12754 9595 1069 -211 -3432 -7441 -458 6732 4055
4059 4055 -1409 -7402 -7014 -2746 3189 3359 1674 -8292 -13799 -8427 2169 4772 -4133 -2297 8
4044 8 -6920 -7597 -4628 2032 10797 -6771 -13168 -7013 -2096 128 1137 4582 8894 4777 3127 4937
4028 4937 2566 -6447 2282 -5288 -8229 -8186 -16947 -11931 2476 6560 -4675 -7015 -5759 246 7514
4013 7514 3737 173 -3883 -2877 -1932 1315 1578 -14043 -16309 -2213 4156 -4041 -15869 -9099 -103
3998 -103 9454 13117 4424 7667 4027 702 -4252 -5473 2127 1904 4317 8034 11566 19203 11070
3983A1070p671q664R33N316j017j417P476Q542K811n663m01N020l853p490k225
3968B767M545L839K152n919n651q060N744o303K116j12L219N278K784k933J1405
3953A4871K879j1016m1N284r260n731j798J0642J0438j9204n077j175J51M673
3939d364k746K001k349m112R983J1724l929n615O440l621O18r3K033l135q353
3924e518o87Q200N23M150N427m370J189J27m927L748K984j1558l818M259M8N251
3908E028j512P469p062l364k513k390J55L765J3902J449j4458n476o537K346k403
3893a1601M685P92N343K751k114r246K642N958p54l590L944L582n255M375m782
3878c270J246O08j801M261O330j1974p022J843Q483K602L205M657l145l502l428
$$ plain form
3983 11070 3399 -5265 -4332 984 -33 -1450 6026 14568 17379 11716 11315 16335 12482 4992 2767
3968 2767 7312 11151 13303 7384 1733 -6327 -583 -6886 -4770 -4882 -1663 3615 6399 3466 14871
3953 14871 17750 6734 6693 11977 2717 -3014 -4812 5830 16268 -2936 -8013 -9188 -9037 -4364
3939 -4364 -7110 -5109 -7458 -11570 -1587 10137 6208 593 7033 3412 4030 3937 5970 2835 -5518
3924 -5518 -6205 1995 2518 6668 12095 7725 8914 9041 4114 7862 10846 -712 -4530 -271 -223 5028
3908 5028 3516 10985 3923 559 -1954 -4344 -4189 -424 13478 14927 469 -5007 -11544 -9198 -11601
3893 -11601 -6916 -6124 -781 1970 -144 -9390 -6748 -790 -1544 -5134 -1190 2392 -2863 1512 -3270
3878 -3270 -2024 -1416 -3217 1044 7374 -4600 -11622 -9779 -1296 1306 4511 9168 6023 2521 -907
3863i07l593J1029N066o63p67O607m256k04q95n952o560q323P685L088J726j111
3847A970l609k692N238N582l607J208k145l212r779n839P0N024k073l40M200J2145
3831B141m627P85l283K730Q310l829N362l631r280r999O081M525J97j108m63r17
$$ plain form
3863 -907 -4500 6529 11595 10932 10165 16772 12516 12312 11417 5465 -1095 -9418 -1733 1355 3081 1970
3847 1970 -1639 -4331 907 6489 2882 4090 1945 -1267 -11046 -16885 -16815 -11791 -13864 -14204 -10004 2141
3831 2141 -2486 -1701 -4984 -2254 6056 2227 7589 3958 -5322 -15321 -9240 -4715 -4518 -5626 -6089 -7006
$$ [...]
##END NTUPLES=NMR SPECTRUM
##END=
