##TITLE=Analysis number 328696
Compound Code cc 62723
Book Reference 521/79
Project Code adrs
Chemist Name evam
##JCAMPDX= 6.0         $$ Bruker NMR JCAMP-DX V2.0
##DATA TYPE= NMR SPECTRUM
##DATA CLASS= NTUPLES
##ORIGIN= Bruker BioSpin GmbH
##OWNER= nmr
$$ XWIN-NMR		Version 3.5
$$ Wed Jun 27 09:36:03 2007 GMT Daylight Time (UT+1h)  MAYBRIDGE\nmr@NMR_250MHZ
##.OBSERVE FREQUENCY= 250.131544655141
##.OBSERVE NUCLEUS= ^1H
##.ACQUISITION MODE= SIMULTANEOUS (DQD)
##.ACQUISITION SCHEME= undefined
##.AVERAGES= 16
##.DIGITISER RES= 18
##SPECTROMETER/DATA SYSTEM= dpx250
##.PULSE SEQUENCE= zg30
##.SOLVENT NAME= CDCl3
##.SHIFT REFERENCE= (INTERNAL, CDCl3, 0, 16.4531)
##AUDIT TRAIL= $$ (NUMBER, WHEN, WHO, WHERE, WHAT)
$$ ##TITLE= Audit trail, XWIN-NMR		Version 3.5
$$ ##JCAMPDX= 5.01
$$ ##ORIGIN= Bruker BioSpin GmbH
$$ ##OWNER= nmr
$$ C:\u/data/dgb/nmr/ADRS/2040/pdata/1/auditp.txt
$$ ##AUDIT TRAIL=  $$ (NUMBER, WHEN, WHO, WHERE, WHAT)
(   1,<2007-06-27 09:35:34.93 +100>,<MAYBRIDGE\nmr>,<NMR_250MHZ>,
      <created by zg, POWCHK disabled, PULCHK disabled
       configuration hash MD5:
       76 6E 9A 78 1E 09 19 81 EC 84 63 8F B0 6A 59 2D
       data hash MD5: 64K
       7F AA 8D 29 BF F2 BA 12 32 F1 DD 2F 34 4A BF BC>)
(   2,<2007-06-27 09:35:51.65 +100>,<MAYBRIDGE\nmr>,<NMR_250MHZ>,
      <Start of raw data processing
       ef LB = 0.3 FT_mod = 6 PKNL = 1 SI = 32K 
       data hash MD5: 32K
       46 0D A8 50 A3 9A 31 93 D7 EA 2A 7C 73 88 A1 73>)
(   3,<2007-06-27 09:35:53.37 +100>,<MAYBRIDGE\nmr>,<NMR_250MHZ>,
      <apk 
       data hash MD5: 32K
       E9 E7 A0 24 C9 40 4B C3 6C 40 75 E1 7F 32 76 53>)
(   4,<2007-06-27 09:35:54.14 +100>,<MAYBRIDGE\nmr>,<NMR_250MHZ>,
      <abs ABSG = 5 
       data hash MD5: 32K
       FA 63 57 B0 57 15 2F 27 E1 19 8A 6D D3 9B FA 93>)
$$ ##END=
$$ 
$$ hash MD5
$$ A1 E4 E0 E8 58 B5 E0 AA 10 B0 57 04 81 BF E9 8E
##$RELAX= 
##$RELAX= 
##$RELAX= 
##$RELAX= 
##$RELAX= 
##$RELAX= 
##$RELAX= 
$$ Bruker specific parameters
$$ --------------------------
##$DU= <C:\u>
##$EXPNO= 2040
##$NAME= <ADRS>
##$PROCNO= 1
##$TYPE= <nmr>
##$USER= <dgb>
##$AMP= (0..31)
100 100 100 100 100 100 100 100 100 100 100 100 100 100 100 100 100 100 
100 100 100 100 100 100 100 100 100 100 100 100 100 100 
##$AQSEQ= 0
##$AQ_mod= 3
##$AUNM= <au_zg>
##$AUTOPOS= <3 >
##$BF1= 250.13
##$BF2= 250.13
##$BF3= 250.13
##$BF4= 250.13
##$BF5= 500.13
##$BF6= 500.13
##$BF7= 500.13
##$BF8= 500.13
##$BYTORDA= 1
##$CFDGTYP= 0
##$CFRGTYP= 5
##$CHEMSTR= <none>
##$CNST= (0..31)
1 1 145 1 1 1 1 1 1 1 1 1 1 1 1 1 1 1 1 1 1 1 1 1 1 1 1 1 1 1 1 1 
##$CPDPRG= <>
##$CPDPRG1= <>
##$CPDPRG2= <>
##$CPDPRG3= <>
##$CPDPRG4= <mlev>
##$CPDPRG5= <mlev>
##$CPDPRG6= <mlev>
##$CPDPRG7= <mlev>
##$CPDPRG8= <mlev>
##$CPDPRGB= <>
##$CPDPRGT= <>
##$D= (0..31)
0 1 0 0 0 0 0 0 0 0.06 0 0 0 0 0 0 0.0002 0 0 0 0 0 0 0 0 0 0 0 0 0 0 
0 
##$DATE= 1182933332
##$DBL= (0..7)
120 120 120 120 120 120 120 120 
##$DBP= (0..7)
150 150 150 150 150 150 150 150 
##$DBP07= 0
##$DBPNAM0= <>
##$DBPNAM1= <>
$$ [...]
##$SUBNAM7= <"">
##$SUBNAM8= <"">
##$SUBNAM9= <"">
##$SW= 20.6930455092707
##$SWIBOX= (0..15)
0 0 3 0 0 0 0 0 0 0 0 0 0 0 0 0 
##$SW_h= 5175.983436853
##$TD= 65536
##$TD0= 1
##$TE= 296.16
##$TE2= 300
##$TE3= 300
##$TEG= 300
##$TL= (0..7)
0 120 120 120 120 120 120 120 
##$TP= (0..7)
150 150 150 150 150 150 150 150 
##$TP07= 0
##$TPNAME0= <>
##$TPNAME1= <>
##$TPNAME2= <>
##$TPNAME3= <>
##$TPNAME4= <>
##$TPNAME5= <>
##$TPNAME6= <>
##$TPNAME7= <>
##$TPOAL= (0..7)
0.5 0.5 0.5 0.5 0.5 0.5 0.5 0.5 
##$TPOFFS= (0..7)
0 0 0 0 0 0 0 0 
##$TUNHIN= 0
##$TUNHOUT= 0
##$TUNXOUT= 0
##$USERA1= <user>
##$USERA2= <user>
##$USERA3= <user>
##$USERA4= <user>
##$USERA5= <user>
##$V9= 5
##$VALIST= <valist>
##$VCLIST= <CCCCCCCCCCCCCCC>
##$VD= 0
##$VDLIST= <DDDDDDDDDDDDDDD>
##$VPLIST= <PPPPPPPPPPPPPPP>
##$VTLIST= <TTTTTTTTTTTTTTT>
##$WBST= 1024
##$WBSW= 4
##$XGAIN= (0..3)
0 0 0 0 
##$XL= 0
##$YL= 0
##$YMAX_a= 446774
##$YMIN_a= -327843
##$ZGOPTNS= <>
##$ZL1= 120
##$ZL2= 120
##$ZL3= 120
##$ZL4= 120
##$ABSF1= 16.45313
##$ABSF2= -4.240042
##$ABSG= 5
##$ABSL= 3
##$ALPHA= 0
##$AQORDER= 0
##$ASSFAC= 0
##$ASSFACI= 0
##$ASSFACX= 0
##$ASSWID= 0
##$AUNMP= <proc_1d>
##$AZFE= 0.1
##$AZFW= 0.1
##$BCFW= 0
##$BC_mod= 0
##$BYTORDP= 0
##$COROFFS= 0
##$CY= 12.5
##$DATMOD= 1
##$DC= 0
##$DFILT= <>
##$DTYPP= 0
##$F1P= 14.0000005364418
##$F2P= -0.99999901652339
##$FCOR= 0.5
##$FTSIZE= 32768
##$FT_mod= 6
##$GAMMA= 0
##$GB= 0
##$INTBC= 1
##$INTSCL= 1
##$ISEN= 128
##$LB= 0.3
##$LEV0= 0
##$LPBIN= 0
##$MAXI= 10000
##$MC2= 0
##$MEAN= 0
##$ME_mod= 0
##$MI= 0
##$NCOEF= 0
##$NC_proc= -4
##$NLEV= 6
##$NOISF1= 0
##$NOISF2= 0
##$NSP= 0
##$NTH_PI= 0
##$NZP= 0
##$OFFSET= 16.45313
##$PC= 1
##$PHC0= -50.90503
##$PHC1= 6.587246
##$PH_mod= 1
##$PKNL= yes
##$PPARMOD= 0
##$PSCAL= 4
##$PSIGN= 0
##$REVERSE= no
##$SF= 250.130017223685
##$SI= 32768
##$SIGF1= 0
##$SIGF2= 0
##$SINO= 400
##$SIOLD= 32768
##$SREGLST= <1H.CDCl3>
##$SSB= 0
##$STSI= 32768
##$STSR= 0
##$SW_p= 5175.98343685301
##$SYMM= 0
##$S_DEV= 0
##$TDeff= 65536
##$TDoff= 0
##$TI= <Analysis number 999999
Compound Code 99
Book Reference 9
Project Code 9>
##$TILT= no
##$TM1= 0
##$TM2= 0
##$TOPLEV= 0
##$USERP1= <user>
##$USERP2= <user>
##$USERP3= <user>
##$USERP4= <user>
##$USERP5= <user>
##$WDW= 1
##$XDIM= 32768
##$YMAX_p= 472567909
##$YMIN_p= -191655
$$ End of Bruker specific parameters
$$ ---------------------------------
##NTUPLES= NMR SPECTRUM
##VAR_NAME=  FREQUENCY,     SPECTRUM/REAL,   SPECTRUM/IMAG
##SYMBOL=    X,             R,               I
##VAR_TYPE=  INDEPENDENT,   DEPENDENT,       DEPENDENT
##VAR_FORM=  AFFN,          ASDF,            ASDF
##VAR_DIM=   32768,         32768,           32768
##UNITS=     HZ,            ARBITRARY UNITS, ARBITRARY UNITS
##FACTOR=    0.157963299565203, 1,           1
##FIRST=     4115.42187088888, 0,            0
##LAST=      -1060.56156596413, 0,           0
##MIN=       -1060.56156596413, -191655,     0
##MAX=       4115.42187088888, 472567909,    0
$$ Real data points
##PAGE= N=1
##DATA TABLE= (X++(R..R)), XYDATA
$$ [...]
$$ plain form
16270 35314 29930 1894 20398 37808 544 -22209 7178 51275 46537 9639 -17324 -28678
16258 -28678 -64059 -61447 -34001 -18149 -30474 -29980 -36797 -25267 -9919 6632 18100 -2117
16246 -2117 5884 -14903 -29832 -74684 -76853 -18999 -5701 9638 -15574 -8766 -4297 -4314 3316
16233 3316 28728 38189 29092 50395 44377 40905 19114 -8618 -30319 -24941 -35887 -29149 -19733
16220 -19733 -31555 -50797 -57788 -62521 -47757 -5989 -6068 12901 31552 16347 9359 19017 24102
16207 24102 -10167 8969 8042 -3221 4740 -3015 -6893 22799 12908 -5281 -6052 -11107 -43960
16194 -43960 -77008 -67546 -12735 -6572 -30079 -33596 -46367 -60892 -39560 -9088 -16913 -69998
16182 -69998 -30878 8810 39501 56056 52493 12834 21855 10572 12697 -9732 -11653 -38593
$$ packed form
16270C5314n384k8036J8504J7410l7264k2753K9387M4097m738l6898k6963j1354
16258b8678l5381K612K7446J5852j2325M94o817J1530J5348J6551J1468k0217
16246b117Q001k0787j4929m4852k169N7854J3298J5339k5212O808M469j7P630
16233C316K5412R461r097K1303o018l472k1791k7732k1701N378j0946O738R416
16220a9733j1822j9242o991m733J4764M1768p9J8969J8651j5205o988R658N085
16207B4102l4269J9136r27j1263P961p755l878K9692r891j8189p71n055l2853
16194d3960l3048R462N4811O163k3507l517j2771j4525K1332L0472p825n3085
16182f9998L9120L9688L0691J6555l563l9659R021j1283K125k2429j921k6940
$$ plain form
16170 -38593 -80124 -96970 -70039 -25213 -42784 -34369 -63194 -85311 -71980 -55568 -76159 -44871
16158 -44871 -50626 -28216 -2809 -48477 -76527 -59334 -59090 -53313 -60404 -26544 -16564 -5997 -10768
16145 -10768 -26436 -3679 -8400 -46144 -68566 -41766 12871 20890 -5853 -25318 -9886 26035
16133 26035 51779 44642 22200 26670 17897 14491 22250 40352 17585 43534 53975 72059 63386
16120 63386 43263 -183 -37563 -49132 -53690 -41065 -14941 1331 2973 24349 5766 -22683
16108 -22683 -14578 -3614 17039 57504 28876 -27234 -60009 -38925 -11721 -37041 -57717 -64422
16096 -64422 -46937 -12694 -30914 -33452 -12385 14609 -23798 -27683 -26120 28946 852 -43433
16084 -43433 -48121 -5451 51044 35449 21955 -3804 8020 -13987 -18206 -23349 -39782 -60501
$$ packed form
16170c8593m1531j6846K6931M4826j7571Q415k8825k2117J3331J6412k0591L1288
16158d4871n755K2410K5407m5668k8050J7193K44N777p091L3860R980J0567m771
16145a0768j5668K2757m721l7744k2422K6800N4637Q019k6743j9465J5432L5921
16133B6035K5744p137k2442M470q773l406P759J8102k2767K5949J0441J8084q673
16120F3386k0123m3446l7380j1569m558J2625K6124J6272J642K1376j8583k8449
16108b2683Q105J0964K0653M0465k8628n6110l2775K1084K7204k5320k0676o705
16096f4422J7485L4243j8220k538K1067K6994l8407l885J563N5066k8094m4285
16084d3433m688M2670N6495j5595j3494k5759J1824k2007m219n143j6433k0719
$$ plain form
16072 -60501 -70291 -84168 -69958 -4271 35480 14473 -19696 -35351 -33878 -17684 -4599 -25501
16060 -25501 -9994 12737 30408 27847 37715 15787 -31744 -27288 -31922 -13290 -11431 -3219 -8448
16047 -8448 6520 -15981 -15094 4006 5536 -15124 23435 36541 18695 -24565 -73146 -75736 -59511
16034 -59511 -60041 -55150 -71189 -82722 8968 21231 -1897 8595 -35544 -8529 9007 3947
16022 3947 8419 20631 22714 69831 22802 -19289 -51136 -95455 -86332 -77572 -44983 -11628 33845
16009 33845 22095 -22231 -23737 -34078 -76775 -76242 -42054 -70020 -82118 -76435 -52959 -36647
15997 -36647 -30871 -16405 -2230 12746 -10020 -249 13841 7607 30358 12065 -13395 -83259
15985 -83259 -101628 -52986 -34745 -15510 -47880 -73958 -70483 -50871 -28077 -23810 -47697 -42897
$$ packed form
16072f0501r790j3877J4210O5687L9751k1007l4169j5655J473J6194J3085k0902
16060b5501J5507K2731J7671k561R868k1928m7531M456m634J8632J859Q212n229
16047h448J4968k2501Q87J9100J530k0660L8559J3106j7846m3260m8581k590J6225
16034e9511n30M891j6039j1533R1690J2263k3128J0492m4139K7015J7536n060
16022C947M472J2212K083M7117m7029m2091l1847m4319R123Q760L2589L3355M5473
16009C3845j1750m4326j506j0341m2697N33L4188k7966j2098N683K3476J6312
15997c6647N776J4466J4175J4976k2766R771J4090o234K2751j8293k5460o9864
15985h3259j8369M8642J8241J9235l2370k6078L475J9612K2794M267k3887M800
$$ plain form
15973 -42897 -24663 -35250 -55450 -70329 -57725 -41924 -46698 -9347 -28219 -49942 -47979 5323
15961 5323 14533 36833 14189 3577 -59467 -50455 -15786 -12269 -21772 8002 -5442 -13461 -18747
15948 -18747 46 -4234 -46450 -62084 -40418 -16760 -10771 31152 28996 -7438 -35109 -48634
15936 -48634 -49064 -17584 16083 27896 18547 4983 17852 6208 5703 -12529 3018 16817 20249
15923 20249 11529 24181 -13775 -15653 2633 18569 36525 35746 45442 61540 46651 37078 55777
15910 55777 49339 984 -838 -9125 1468 -20760 -4759 -13932 -12216 -11798 -22484 -3962 -7190
15897 -7190 -1643 -25772 -20475 -19961 -21045 -121 -22029 -41157 -65675 -42087 -39553 -50430 -32042
15884 -32042 -18572 27356 31104 3906 45535 104830 108792 75628 52831 44200 27919 28027 -15347
$$ packed form
15973d2897J8234j0587k0200j4879J2604J5801m774L7351j8872k1723J963N3302
15961E323R210K2300k2644j0612o3044R012L4669L517r503K9774j3444q019n286
15948a8747J8793m280m2216j5634K1666K3658N989M1923k156l6434k7671j3525
15936d8634m30L1480L3667J1813r349j3564J2869j1644n05j8232J5547J3799L432
15923B0249q720J2652l7956j878J8286J5936J7956p79R696J6098j4889r573J8699
15910E5777o438m8355j822q287J0593k2228J6001r173J716M18j0686J8522l228
15897g190N547k4129N297N14j084K0924k1908j9128k4518K3588K534j0877J8388
15884c2042J3470M5928L748k7198M1629N9295L962l3164k2797q631j6281J08m3374
$$ plain form
15871 -15347 -52540 -40382 -7808 5435 10657 11258 5020 -19876 -24175 -39714 -72956 -57270 -28810
15858 -28810 -15374 20813 33958 354 -5752 -7772 16823 28245 17614 5019 15168 2010
15846 2010 -13383 -12128 1490 485 394 12134 18997 -20 16827 16070 12297 19987 17119 18391
15832 18391 46436 62790 5237 22910 28353 24425 16426 12099 -9291 -30309 -44124 -63670
15820 -63670 -65716 -46449 -48806 -69272 -81592 -80408 -27230 -23783 -34743 -47016 -46670 -6186 27257
15807 27257 13120 -11458 -30953 16586 -4635 -6704 -1516 -26883 -49652 -72198 -54795 -36911
15795 -36911 -50208 -66208 -24118 -1591 4150 -3589 16642 27057 1093 -23020 -18710 -27011
15783 -27011 -5975 8708 -9695 -11091 -11405 -215 -5566 -39863 -26259 -4753 -34752 -102109
$$ packed form
15871a5347l7193J2158L2574J3243N222O01o238k4896m299j5539l3242J5686K8460
15858b8810J3436L6187J3145l3604o106k020K4595J1422j0631j2595J0149j3158
15846B010j5393J255J3618j005r1J1740O863j9017J6847p57l773P690k868J272
15832A8391K8045J6354n7553J7673N443l928p999m327k1390k1018j3815j9546
15820f3670k046J9267k357k0466j2320J184N3178L447j0960j2273L46M0484L3443
15807B7257j4137k4578j9495M7539k1221k069N188k5367k2769k2546J7403J7884
15795c6911j3297j6000M2090K2527N741p739K0231J0415k5964k4113M310q301
15783b7011K1036J4683j8403j396l14J1190n351l4297J3604K1506k9999o7357
$$ plain form
15771 -102109 -111591 -75719 -5591 32407 39275 51156 32658 34238 41041 53830 -24009 -42742
15759 -42742 3188 14129 17319 32248 23324 26381 40975 -13566 -40995 -33619 -22657 -41021
15747 -41021 -38489 24966 44722 45649 18733 11987 19488 23210 -10277 -16987 12591 11846 -21378
15734 -21378 -33409 -11449 -22389 613 23055 -23025 -39647 7354 -4008 -9721 -13753 18901
15722 18901 12986 -4848 -15567 -8582 -2668 6313 -14226 -718 13798 33911 31058 48968 24198
15709 24198 4115 5713 38931 49301 50082 39801 32160 22086 -4577 -4348 32287 4113 -27820
15696 -27820 23235 32089 5499 -18860 -6906 45755 31161 9506 -12421 1786 19784 48935
15684 48935 79089 72809 25517 11160 15485 22084 16280 -26069 -48893 -27631 -7413 -18203
$$ packed form
15771a02109r482L5872P0128L7998O868J1881j8498J580O803J2789p7839j8733
15759d2742M5930J0941L190J4929q924L057J4594n4541k7429P376J0962j8364
15747d1021K532O3455J9756R27k6916o746P501L722l3487o710K9578p45l3224
15734b1378j2031K1960j0940K3002K2442m6080j6622M7001j1362n713m032L2654
15722A8901n915j7834j0719O985N914Q981k0539J3508J4516K0113k853J7910k4770
15709B4198k0083J598L3218J0370P81j0281p641j0074k6663K29L6635k8174l1933
15696b7820N1055Q854k6590k4359J1954N2661j4594k1655k1927J4207J7998K9151
15684D8935L0154o280m7292j4357M325O599n804m2349k2824K1262K0218j0790
$$ plain form
15672 -18203 -15947 20053 -1459 -19433 5400 14131 9546 8282 4037 -9576 23067 25046 39090
15659 39090 3162 15869 22790 -2650 -29726 -29536 -37445 -21960 11717 53919 24514 -27471
15647 -27471 -49740 -89483 -83771 -58252 -12790 -5069 -26000 3504 18162 1482 4680 11216
15635 11216 5509 -10416 -16345 -39026 -12200 19463 -38177 -55042 -21803 -1362 -1643 2356 43367
15622 43367 35334 41331 31018 -24091 -97131 -93531 -94712 -74547 -64523 -54481 -2862 19207
15610 19207 21907 12100 20771 38545 29425 38554 26463 -5994 9994 15969 -6555 38299 44036
15597 44036 -2120 4831 -240 -10184 19869 9144 -15440 -18712 21003 41146 6944 1260 5419
15584 5419 30955 17045 11952 12204 4506 2248 -32838 -5325 14810 21516 14335 -581 7205
$$ packed form
15672a8203K256L6000k1512j7974K4833Q731m585j264m245j3613L2643J979J4044
15659C9090l5928J2707O921k5440k7076J90p909J5485L3677M2202k9405n1985
15647b7471k2269l9743N712K5519M5462P721k0931K9504J4658j6680L198O536
15635A1216n707j5925n929k2681K6826L1663n7640j6865L3239K0441k81L999M1011
15622D3367q033N997j0313n5109p3040L600j181K0165J0024J0042N1619K2069
15610A9207K700r807Q671J7774r120R129j2091l2457J5988N975k2524M4854N737
15597D4036m6156O951n071r944L0053j0725k4584l272L9715K0143l4202n684M159
15584E419K5536j3910n093K52p698k258l5086K7513K0135O706p181j4916P786
$$ plain form
15571 7205 -18515 -4985 17165 -21037 -25458 -20531 -48707 -93996 -100768 -46228 -19210 781
15559 781 -18220 -33505 -31993 -43443 -29366 12520 62204 58253 67747 57672 24869 2479 -25622
15546 -25622 2688 11694 20114 30151 16542 -5695 12517 43334 72811 52511 17988 -21571
15534 -21571 -39841 -34966 -41912 -81823 -73178 -32840 -5011 -12611 8508 48485 57262 35343 -4731
15521 -4731 -24069 -5472 -6020 -15727 -12831 -5789 -39444 -29454 -14009 -7075 10148 18645 25881 5032
15507 5032 13403 27628 33262 33857 48161 38118 20859 -19136 -54451 -79207 -26437 23179 13801
15494 13801 5222 -7560 6781 -19675 -24970 -12507 19551 45767 30870 12950 -26222 -29287
15482 -29287 -41894 -31155 -14494 -7746 -3402 853 -787 -25426 -41314 -14582 1231 -33992
$$ packed form
15571G205k5720J3530K2150l8202m421M927k8176m5289o772N4540K7018J9991
15559G81j9001j5285J512j1450J4077M1886M9684l951R494j0075l2803k2390k8101
15546b5622K8310R006Q420J0037j3609k2237J8212L0817K9477k0300l4523l9559
15534b1571j8270M875o946l9911Q645M0338K7829p600K1119L9977Q777k1919m0074
15521d731j9338J8597n48r707K896P042l3655R990J5445O934J7223Q497P236k0849
15507E032Q371J4225N634N95J4304j0043j7259l9995l5315k4756N2770M9616r378
15494A3801q579j2782J4341k6456n295J2463L2058K6216j4897j7920l9172l065
15482b9287j2607J0739J6661O748M344M255j640k4639j5888K6732J5813l5223
$$ plain form
15470 -33992 -36633 -18453 13991 -7829 -59834 -65408 -57634 -38990 -30285 19616 28998 38782 51062
15457 51062 64591 54500 22746 -3483 -32763 -56261 -50116 -18573 -27554 -75650 -42591 -16283
15445 -16283 -322 -3669 -13290 1894 45564 28129 21607 33791 58231 55839 67070 33339
15433 33339 7880 -30428 -65852 -84552 -93032 -63738 -40563 15646 31497 28041 16826 -8540
15421 -8540 -15098 -34071 -37748 -8689 -4996 -26778 -26843 -41176 -47370 -49764 -32994 -45726 -64699
15408 -64699 -45271 -32995 -48764 -17194 13107 23245 14909 -16321 -20537 -22649 -15760 -2205
15396 -2205 21985 9134 -14624 -21092 -25469 -25715 -24530 -18244 -21169 8209 11170 -14389 -33106
15383 -33106 -39899 -59823 -55807 -8630 33770 22999 38743 24995 15829 -18095 -51420 21715
$$ packed form
15470c3992k641J8180L2444k1820n2005n574P774J8644Q705M9901R382R784J2280
15457E1062J3529j0091l1754k6229k9280k3498O145L1543q981m8096L3059K6308
15445a6283J5961l347r621J5184M3670j7435o522J2184K4440k392J1231l3731
15433C3339k5459l8308l5424j8700q480K9294K3175N6209J5851l456j1215k5366
15421h540o558j8973l677K9059L693k1782o5j4333o194k394J6770j2732j8973
15408f4699J9428J2276j5769L1570L0301J0138q336l1230m216k112O889J3555
15396b205K4190j2851k3758o468m377k46J185O286k925K9378K961k5559j8717
15383c3106o793j9924M016M7177M2400j0771J5744j3748r166l3924l3325P3135
$$ plain form
15371 21715 74635 66718 33526 8949 5462 8733 -1124 4238 26174 40525 47900 44972 19620
15358 19620 -17537 -35510 -50354 -94781 -64767 -38814 -16567 -9411 7904 -23882 -39843 -18175
15346 -18175 13624 23813 20440 -10934 -313 9648 -7060 -37844 -45141 -34397 -2402 11038
15334 11038 19812 -8038 -39181 -25089 -18158 -40947 -49768 -18679 -11611 -17051 -38964 -30210 -9436
15321 -9436 12365 31551 2790 -8014 -18876 6510 -11187 16956 36458 -10694 -50434 -42494
15309 -42494 -25000 -19707 -25036 -29195 -11385 -21628 -31570 -46627 -31035 31129 79990 75588 57599
15296 57599 32443 -7850 -9598 -4789 -29665 -44842 -32083 -1952 19613 3335 -7944 16226
15284 16226 91907 92977 59942 40587 21804 1542 -10236 -35429 -37170 1526 26959 -6803
$$ packed form
15371B1715N2920p917l3192k4577l487L271r857N362K1936J4351P375k928k5352
15358A9620l7157j7973j4844m4427L0014K5953K2247P156J7315l1786j5961K1668
15346a8175L1799J0189l373l1374J0621R961j6708l0784p297J0744L1995J3440
15334A1038Q774k7850l1143J4092O931k2789q821L1089P068n440k1913Q754K0774
15321i436K1801J9186k8761j0804j0862K5386j7697K8143J9502m7152l9740P940
15309d2494J7494N293n329m159J7810j0243r942j5057J5592O2164M8861m402j7989
15296E7599k5156m0293j748M809k4876j5177J2759L0131K1565j6278j1279K4170
15284A6226P5681J070l3035j9355j8783k0262j1778k5193j741L8696K5433l3762
$$ plain form
15272 -6803 -57041 -47464 -53959 -50165 -24874 -47145 -50075 -12398 1167 2220 -7173 19762 69887
15259 69887 91980 110122 98841 59167 73565 61420 68644 72324 68455 71753 67397 52311 70262
15246 70262 104854 129799 128417 120476 112554 71508 84897 87382 51436 25580 16352 -14165 -29382
15233 -29382 13643 112 -33989 -32489 -10744 16889 10383 -2154 43980 74314 91928 58793
15221 58793 34206 24640 10417 -29335 -39491 -570 11411 -8814 -33620 -53086 -22816 2285
15209 2285 -5170 36367 73715 97322 74245 77158 75706 56848 28927 43119 58185 55417 20953
15196 20953 4977 15248 32454 24674 4063 19437 34390 55630 17377 10585 635 5468
15184 5468 -6596 -17315 -28532 -7101 821 9662 24833 46256 71655 37376 41312 11221
$$ packed form
15272f803n0238R577o495L794K5291k2271k930L7677J3565J053r393K6935N0125
15259F9887K2093J8142j1281l9674J4398j2145P224L680l869L298m356j5086J7951
15246G0262L4592K4945j382p941p922m1046J3389K485l5946k5856r228l0517j5217
15233b9382M3025j3531l4101J500K1745K7633o506j2537M6134L0334J7614l3135
15221E8793k4587r566j4223l9752j0156L8921J1981k0225k4806j9466L0270K5101
15209B285p455M1537L7348K3607k3077K913j452j8858k7921J4192J5066k768l4464
15196B0953j5976J0271J7206p780k0611J5374J4953K1240l8253o792r950M833
15184E468j2064j0719j1217K1431P922Q841J5171K1423K5399l4279L936l0091
$$ plain form
15172 11221 -26916 -28009 -31295 -9397 31694 37549 -7248 -18481 -35901 -30508 -12400 -1605
15160 -1605 29818 20133 -15358 -16185 -28427 -52803 -29150 38909 27086 12639 10669 -5061 -6986
15147 -6986 14355 4251 -1609 -7174 17124 21709 30688 9941 1775 3495 -47583 -31068 -10253
15134 -10253 11630 -16962 -41508 -37773 -34320 -65833 -59625 -25712 5515 27963 46334 11648
15122 11648 -6939 -1510 7336 -21906 -24157 -4777 -5461 382 -4548 -6151 7485 9384 1547 19467
15108 19467 -2894 -35314 -21100 -9704 -46913 -89213 -85475 -60243 -28859 -44011 -64743 -32741
15096 -32741 -37182 -18581 -9101 -19826 -29023 -35227 -16955 12831 7898 -2723 -20049 -27419 -39341
15083 -39341 -8933 36300 26063 6397 -37305 -83836 -92829 -59562 -20334 5549 12000 37812
$$ packed form
15172A1221l8137j093l286K1898M1091N855m4797j1233j7420N393J8108J0795
15160a605L1423r685l5491q27j2242k4376K3653O8059j1823j4447j970j5730j925
15147f986K1341j0104n860n565K4298M585Q979k0747q166J720n1078J6515K0815
15134a0253K1883k8592k4546L735L453l1513O208L3913L1227K2448J8371l4686
15122A1648j8587N429Q846k9242k251J9380o84N843m930j603J3636J899p837J7920
15108A9467k2361l2420J4214J1396l7209m2300L738K5232L1384j5152k0732L2002
15096c2741m441J8601R480j0725r197o204J8272K9786m933j0621j7326p370j1922
15083c9341L0408M5233j0237j9666m3702m6531q993L3267L9228K5883O451K5812
$$ plain form
15071 37812 54546 22853 12456 -25445 -46052 -55151 -48729 -24762 -15771 -35609 -2928 47441
15059 47441 50926 72621 49463 8085 -1377 16505 1038 2153 -978 17249 27886 9562
15047 9562 -4015 32538 44867 59169 50488 31533 16669 -6173 -25306 -36982 -2294 23095
15035 23095 42354 -1975 -16818 -13530 -6566 15321 65310 76375 61019 39626 17088 9885
15023 9885 14993 41381 33976 1664 -5001 24564 17646 -3515 -17313 481 17801 -13105 -34042
15010 -34042 -10105 10469 50783 60583 34375 19030 51875 63372 52330 27854 13721 17297
14998 17297 18978 -3357 -41724 -30942 -23585 -50242 -22697 21629 39979 40428 32250 -14208 -49269
14985 -49269 -43706 -22721 3733 1880 5444 -41010 -19091 3716 4139 5890 10171 -9088 -10781
$$ packed form
15071C7812J6734l1693j0397l7901k0607r099O422K3967Q991j9838L2681N0369
15059D7441L485K1695k3158m1378r462J7882j5467J115l131J8227J0637j8324
15047I562j3577L6553J2329J4302q681j8955j4864k2842j9133j1676L4688K5389
15035B3095J9259m4329j4843L288O964K1887M9989J1065j5356k1393k2538p203
15023I885N108K6388p405l2312o665K9565o918k1161j3798J7794J7320l0906k0937
15010c4042K3937K0574M0314R800k6208j5345L2845J1497j1042k4476j4133L576
14998A7297J681k2335l8367J0782P357k6657K7545M4326J8350M49q178m6458l5061
14985d9269N563K0985K6454j853L564m6454K1919K2807M23J751M281j9259j693
$$ plain form
14972 -10781 -37434 -31127 19837 -4444 -17261 -18430 -41604 -4410 -28853 -51382 -16137 35019
14960 35019 61450 52865 29612 43295 22938 3700 -29190 -48268 -17242 -35383 8928 34434
14948 34434 45793 40762 17696 -1572 -8146 485 -3785 -1286 11116 17576 -11243 -35557 -36191
14935 -36191 -29063 -34369 -35032 -39656 -21774 -24072 -33128 -67394 -36664 9931 18180 -1737 -37088
14922 -37088 -37791 -32167 -27886 945 1064 34574 45732 14930 35880 26042 508 -9495 -11493
14909 -11493 32415 32366 24645 27892 22484 2227 -15114 -32749 -14888 -32312 -13444 -16445 -19437
14896 -19437 -14173 -1330 -7134 -19550 -12475 15200 29752 -13290 -48134 -49059 -40672 5982 50444
14883 50444 28609 10381 -7321 -20194 -56488 -50746 6392 11764 5897 1093 -16381 -21663 -43069
$$ packed form
14972a0781k6653O307N0964k4281j2817j169k3174L7194k4443k2529L5245N1156
14960C5019K6431q585k3253J3683k0357j9238l2890j9078L1026j8141M4311K5506
14948C4434J1359n031k3066j9268o574Q631m270K499J2402O460k8819k4314o34
14935c6191P128n306o63m624J7882k298r056l4266L0730M6595Q249j9917l5351
14922c7088p03N624M281K8831J19L3510J1158l0802K0950r838k5534j0003j998
14909a1493M3908m9p721L247n408k0257j7341j7635J7861j7424J8868l001k992
14896a9437N264J2843n804j2416P075K7675J4552m3042l4844r25Q387M6654M4462
14883E0444k1835j8228j7702j2873l6294N742N7138N372n867m804j7474n282k1406
$$ plain form
14870 -43069 -24619 -17271 -16272 -15469 -27133 -28598 -32868 -55094 -66144 -65421 -21062 -258 989 1595
14856 1595 -17534 -21579 -12219 -17468 -2757 -3148 43461 42176 43701 25683 -8376 -30008 -20347
14843 -20347 -6959 37534 72165 38993 15478 38624 7052 -11754 -6257 -2489 12159 -2215
14831 -2215 -24860 -5761 16484 -3141 -9422 -21985 -44864 -60477 -36741 -392 -15400 -4724
14819 -4724 12222 -7774 -29743 -25713 12739 -15814 -33140 -33752 -27296 -35044 -23356 -18051 4743
14806 4743 6717 9579 19541 20391 49947 43676 -2181 -36982 -4097 -7704 -35488 -32399 -30213 -79761
14792 -79761 -96280 -81775 -62151 -55717 -83171 -101721 -33558 5950 -9945 -57808 -13683 -2904
14780 -2904 -19923 5752 32455 30265 19309 8958 6031 -20458 -45062 -35826 -9599 -7274 16447
$$ packed form
14870d3069J8450P348R99Q03j1664j465m270k2226j1050P23M4359K0804J247O06
14856A595j9129m045R360n249J4711l91M6609j285J525j8018l4059k1632R661
14843b0347J3388M4493L4631l3172k3515K3146l1572j8806N497L768J4648j4374
14831b215k2645J9099K2245j9625o281j2563k2879j5613K3736L6349j5008J0676
14819d724J6946j9996k1969M030L8452k8553j7326o12O456p748J1688N305K2794
14806D743J974K862R962Q50K9556o271m5857l4801L2885l607k7784L089K186m9548
14792g9761j6519J4505J9624O434k7454j8550O8163L9508j5895m7863M4125J0779
14780b904j7019K5675K6703k190j0956j0351k927k6489k4604R236K6227K325K3721
$$ plain form
14767 16447 6266 -6020 -21000 -35974 -73425 -117736 -66305 -1011 25305 -23256 -21638 -2786
14755 -2786 -12625 18288 12322 -2363 -28827 -62743 -75327 -69495 -33381 -14578 -20664 -38494 -16672
14742 -16672 8643 7550 -8372 34419 40263 -37437 -89057 -110108 -65914 -20078 -498 -947
14730 -947 -15987 -42058 -38752 -9684 -16311 -32568 -53171 -59260 -38634 -36413 -28892 -19854 -4326
14717 -4326 -17474 -13759 -28731 -54638 -59222 -13355 3535 -8441 -18180 20180 23216 8527 9709
14704 9709 25157 12525 -12851 -80451 -89213 -84821 -43226 2785 17879 38824 51389 39099
14692 39099 19950 17188 32176 45812 30942 28870 52120 15516 -1399 6627 18808 50259
14680 50259 15613 23917 15908 -8891 -3319 25467 22421 48963 34163 10283 -1301 5803 34663
$$ packed form
14767A6447j0181j2286j4980j4974l7451m4311N1431O5294K6316m8561J618J8852
14755b786r839L0913n966j4685k6464l3916j2584N832L6114J8803o086j7830K1822
14742a6672K5315j093j5922M2791N844p7700n1620k1051M4194M5836J9580m49
14730i47j5040k6071L306K9068o627j6257k0603o089K0626K221P521R038J5528
14717d326j3148L715j4972k5907m584M5867J6890j1976r739L8360L036j4689J182
14704I709J5448j2632k5376o7600q762M392M1595M6011J5094K0945J2565j2290
14692C9099j9149k762J4988J3636j4870k072K3250l6604j6915Q026J2181L1451
14680E0259l4646Q304q009k4799N572K8786l046K6542j4800k3880j1584P104K8860
$$ plain form
14667 34663 20946 -9022 -52740 -69992 -48233 -15093 1132 -43314 -82238 -45529 -86 -16940
14655 -16940 -27160 -16335 -27032 10319 28459 -14216 -21594 -2630 9719 -4363 11361 35627
14643 35627 42069 14919 -1981 27515 40102 38309 41208 34925 49155 -6424 -57640 -72774
14631 -72774 -65164 -67020 -91923 -89099 -90103 -97117 -71811 -21039 -30871 -11273 8740 16791 -632
14618 -632 -5790 -3540 18811 20095 22503 -9144 -12343 -1170 -4671 -48235 -27927 -16735 4376
14605 4376 1176 9938 18685 4959 -387 -37900 -39185 -30277 -67067 -57448 -7243 -6102 -2147 -32833
14591 -32833 -66837 -61635 -50389 -45970 -50201 7757 8654 -23908 11561 19686 5403 -42628 -80927
14578 -80927 -73373 -23910 -49334 -39455 -42048 -86766 -95686 -84878 -93728 -58477 -18603 725 23091
$$ packed form
14667C4663j3717k9968m3718j7252K1759L3140J6225m4446l8924L6709M5443j6854
14655a6940j0220J0825j0697L7351J8140m2675p378J8964J2349j4082J5724K4266
14643C5627O442k7150j6900K9496J2587j793K899o283J4230n5579n1216j5134
14631g2774P610j856k4903K824j004p014K5306N0772r832J9598K0013Q051j7423
14618f32n158K250K2351J284K408l1647l199J1173l501m3564K0308J1192K1111
14605D376l200Q762Q747j3726n346l7513j285Q908l6790R619N0205J141L955l0686
14591c2833l4004N202J1246M419m231N7958Q97l2562L5469Q125j4283m8031l8299
14578h0927P554M9463k5424R879k593m4718q920J0808q850L5251L9874J9328K2366
$$ plain form
14565 23091 33002 24101 -5137 2916 12283 69274 95688 77698 61063 30758 20349 23923 11561
14552 11561 -11274 13922 39995 22201 13884 2703 -42638 -68797 -31587 -18108 -40313 -39088
14540 -39088 -25644 -10388 11064 28304 19349 7936 42975 9768 -57087 -55950 -34991 -42112
14528 -42112 -78481 -52920 -26563 -41163 -41225 -23580 927 17104 13993 11726 23184 13998 -20572
14515 -20572 -43329 -47543 -52632 -48912 -32233 -24554 -37868 -66174 -31838 2383 36285 -10230
14503 -10230 -92981 -62270 -12929 2866 -26941 -49592 -55909 -54920 -19804 -18582 -8980 11264 11449
14490 11449 36026 40254 26436 22713 23000 35932 29228 58590 88016 75026 23340 9626 34951
14477 34951 26092 48482 60489 47720 -14463 -68608 -48271 -69378 -100843 -78457 -61311 -48739
$$ packed form
14565B3091R911q901k9238Q053R367N6991K6414j7990j6635l0305j0409L574j2362
14552A1561k2835K5196K6073j7794q317j1181m5341k6159L7210J3479k2205J225
14540c9088J3444J5256K1452J7240q955j1413L5039l3207o6855J137K0959p121
14528d2112l6369K5561K6357j4600o2J7645K4507J6177l111k267J1458r186l4570
14515b0572k2757m214n089L720J6679P679j3314k8306L4336L4221L3902m6515
14503a0230q2751L0711M9341J5795k9807k2651o317R89L5116J222R602K0244J85
14490A1449K4577M228j3818l723K87J2932o704K9362K9426j2990n1686j3714K5325
14477C4951q859K2390J2007j2769o2183n4145K0337k1107l1465K2386J7146J2572
$$ plain form
14465 -48739 -18749 -5233 -5599 -7800 37473 47235 41248 39563 50641 61164 69853 69043 19507
14452 19507 4148 22730 52577 57694 74237 63981 85954 76229 15415 -2939 11203 12673
14440 12673 35003 19509 39461 62169 34722 13854 10038 -633 3667 3681 22628 35097 36169
14427 36169 48992 35195 17392 5733 3404 17987 44279 62098 47402 16810 -7214 -16067
14415 -16067 13810 20798 -27811 -53478 -8106 16910 33188 51725 19199 -7100 -24082 -34398
14403 -34398 -21869 10163 1333 -32632 -44599 -37174 -2243 9140 -4509 -7136 42092 56601
14391 56601 6169 14814 25755 38398 32843 53344 52256 48885 32029 -905 -8906 -64335 -85789
14378 -85789 -44553 2833 11690 -1393 28718 35558 13862 35127 68300 81634 54183 2654
$$ packed form
14465d8739K9990J3516l66k201M5273R762n987j685J1078J0523Q689q10m9536
14452A9507j5359J8582K9847N117J6543j0256K1973r725o0814j8354J4142J470
14440A2673K2330j5494J9952K2708k7447k0868l816j0671M300J4J8947J2469J072
14427C6169J2823j3797j7803j1659k329J4583K6292J7819j4696l0592k4024q853
14415a6067K9877O988m8609k5667M5372K5016J6278J8537l2526k6299j6982j0316
14403c4398J2529L2032q830l3965j1967P425L4931J1383j3649k627M9228J4509
14391E6601n0432Q645J0941J2643n555K0501j088l371j6856l2934q001n5429k1454
14378h5789M1236M7386Q857j3083L0111O840k1696K1265L3173J3334k7451n1529
$$ plain form
14366 2654 -15691 8836 54422 48145 31540 56074 50259 16476 -13618 -33367 -49985 -44343
14354 -44343 14317 70759 46858 41323 66523 43012 -11437 -56887 -42759 -42634 -54913 -40612
14342 -40612 6574 22031 12183 3038 6964 21257 6334 -16496 3001 26411 15948 -6649
14330 -6649 -11639 -25572 -63908 -39878 -34586 -26361 -44165 -25185 -2700 -5904 -2670 4127 5119
14317 5119 12049 23346 12653 -20363 -26419 6167 -23167 -27041 -40263 -23471 -16475 -3319 -769
14304 -769 -33013 -63155 -82358 -62212 -22610 1509 -1046 -26035 -69597 -81522 -94550 -55495
14292 -55495 -48540 -75365 -43107 -55755 -65583 -32824 -64773 -40689 -59227 -39212 -26459 229
14280 229 16841 1540 7677 25053 -10972 -43820 -63167 -46446 -34973 -44800 2938 17268
$$ packed form
14366B654j8345K4527M5586o277j6605K4534n815l3783l0094j9749j6618N642
14354d4343N8660N6442k3901n535K5200k3511n4449m5450J4128J25j2279J4301
14342d0612M7186J5457r848r145L926J4293j4923k2830J9497K3410j0463k2597
14330f649m990j3933l8336K4030N292Q225j7804J8980K2485l204L234O797R92
14317E119O930J1297j0693l3016o056L2586k9334l874j3222J6792O996J3156K550
14304g69l2244l0142j9203K0146L9602K4119k555k4989m3562j1925j3028L9055
14292e5495O955k6825L2258j2648r828L2759l1949K4084j8538K0015J2753K6688
14280B29J6612j5301O137J7376l6025l2848j9347J6721J1473r827M7738J4330
$$ plain form
14268 17268 25852 29046 -7133 3523 -25763 -40202 -71014 -82836 -68742 -53323 -102607 -114988
14256 -114988 -48708 6550 5987 -50122 -65424 -68721 -36347 -7350 -28234 -5050 1114 22438
14244 22438 17205 -30243 -55798 -46156 -41591 -38530 -41592 -2225 40951 28769 10268 -1342 -52782
14231 -52782 -77803 -85631 -64127 -39501 -5510 -2935 31875 53477 35990 16390 -8645 -40199
14219 -40199 -35955 -6530 9639 27919 31057 5331 11513 36021 -19113 -27873 -23029 17736 38611
14206 38611 59811 65644 39548 11348 8981 -24528 -38337 -29195 -56609 -55542 -29689 -26925 -42642
14193 -42642 -27418 5450 32154 42824 46928 10495 -15852 8376 10388 21374 20711 36347
14181 36347 66798 13901 -53174 -48436 -18088 -8147 -37892 -69287 -39215 15261 32715 11645
$$ packed form
14268A7268Q584L194l6179J0656k9286j4439l0812j1822J4094J5419m9284j2381
14256a14988O6280N5258n63n6109j5302l297L2374K8997k0884K3184O164K1324
14244B2438n233m7448k5555R642M565L061l062L9367M3176j2182j8501j1610n1440
14231e2782k5021p828K1504K4626L3991K575L4810K1602j7487j9600k5035l1554
14219d0199M244K9425J6169J8280L138k5726O182K4508n5134q760M844M0765K0875
14206C8611K1200N833k6096k8200k367l3509j3809R142k7414J067K5853K764j5717
14193d2642J5224L2868K6704J0670M104l6433k6347K4228K012J0986o63J5636
14181C6347L0451n2897o7075M738L0348R941k9745l1395L0072N4476J7454k1070
$$ plain form
14169 11645 -47803 -42052 -21652 -13148 14008 27749 -1919 -1331 6085 29504 24809 24061 17072
14156 17072 1375 -10923 14960 3734 -78 19022 19526 -10366 -25412 -15910 17495 46955
14144 46955 35742 16163 9874 -6304 -8892 -8757 -13519 -30310 -42657 -36590 -10859 4289 16064
14131 16064 27411 18529 -2056 -5968 12171 17240 15699 1640 -16636 -47869 -57522 -49204 -43273
14118 -43273 -71997 -75648 -82587 -90474 -61912 -28877 -33928 -42259 10515 32323 33826 24270 -21551
14105 -21551 -12189 20351 53963 65092 20903 -188 8162 22032 27073 20324 46302 56003 38789
14092 38789 14426 2961 -3830 4155 19896 42385 94048 113945 94099 114213 109188 141445
14080 141445 150578 133234 138649 191341 232514 242803 266322 282866 279245 248012 209171 167261
$$ packed form
14169A1645n9448N751K0400Q504K7156J3741k9668N88P416K3419m695p48o989
14156A7072j5697j2298K5883j1226l812J9100N04k9892j5046R502L3405K9460
14144D6955j1213j9579o289j6178k588J35m762j6791j2347O067K5731J5148J1775
14131A6064J1347q882k0585l912J8139N069j541j4059j8276l1233r653Q318N931
14118d3273k8724l651o939p887K8562L3035n051q331N2774K1808J503r556m5821
14105b1551R362L2540L3612J1129m4189k1091Q350J3870N041o749K5978R701j7214
14092C8789k4363j1465o791P985J5741K2489N1663J9897j9846K0114n025L2257
14080A41445R133j7344N415N2692M1173J0289K3519J6544l621l1233l8841m1910
$$ plain form
14068 167261 109616 56900 36021 -5546 -44287 -28087 16749 41064 53677 32523 37574 33153
14056 33153 782 13361 13161 -1806 -17110 -9403 1966 -35646 -64971 -75835 -36600 -921
14044 -921 20611 12521 23029 52029 70649 83682 81625 96185 145691 195469 229121 330136
14032 330136 420673 554389 675687 750611 812615 746111 641989 512067 356914 240403
14022 240403 172687 148275 131432 137787 105475 62746 72183 72997 52848 78511 70710 35794
14010 35794 56405 79786 32098 52909 81127 65501 39189 10307 9042 30555 43353 25647
13998 25647 40440 64555 97483 137682 201056 233566 247688 274721 294373 329413 359498 434090
13986 434090 543293 652041 741635 824600 844856 748933 597296 415732 295833 219625
$$ packed form
14068A67261n7645n2716k0879m1567l8741J6200M4836K4315J2613k1154N051m421
14056C3153l2371J2579k00j4967j5304P707J1369l7612k9325j0864L9235L5679
14044i21K1532q090J0508K9000J8620J3033k057J4560M9506M9778L3652J01015
14032C30136R0537J33716J21298P4924O2004o6504j04122j29922j55153j16511
14022B40403o7716k4412j6843O355l2312m2729R437Q14k0149K5663p801l4916
14010C5794K0611K3381m7688K0811K8218j5626k6312k8882j265K1513J2798j7706
13998B5647J4793K4115L2928M0199O3374L2510J4122K7033J9652L5040L0085P4592
13986D34090J09203J08748Q9594Q2965K0256r5923j51637j81564j19899p6208
$$ plain form
13976 219625 178244 131768 96590 94337 85257 37755 2358 42983 53927 21195 9331 24076
13964 24076 70403 77665 47990 63510 69434 82342 101859 132092 120727 71037 51167 39957
13952 39957 20181 27820 60199 70863 96877 120109 113225 119350 111675 139932 186482 240739
13940 240739 266056 277963 286377 297649 244305 194158 166871 146961 75416 26237 43624 81770
13928 81770 69560 43617 14985 10329 -19008 -32618 1506 43275 27899 49845 57104 34673
13916 34673 19731 -5129 -35788 -8136 23875 30936 -3807 5383 1097 12266 36448 40874
13904 40874 10716 4865 -2945 6584 -46 -8156 -8594 -27772 2292 12505 -12245 -1546 2808
13891 2808 -2216 45948 70186 56764 34985 48328 78350 108530 119129 89658 74219 -6372
$$ packed form
13976B19625m1381m6476l5178k253r080m7502l5397M0625J0944l2732j1864J4745
13964B4076M6327P262k9675J5520N924J2908J9517L0233j1365m9690j9870j1210
13952C9957j9776P639L2379J0664K6014K3232o884O125p675K8257M6550N4257
13940B40739K5317J1907Q414J1272n3344n0147k7287j9910p1545m9179J7387L8146
13928H1770j2210k5943k8632m656k9337j3610L4124M1769j5376K1946P259k2431
13916C4673j4942k4860l0659K7652L2011P061l4743R190m286J1169K4182M426
13904D0874l0158n851p810R529o630q110m38j9178L0064J0213k4750J0699M354
13891B808n024M8164K4238j3422k1779J3343L0022L0180J0599k9471j5439q0591
$$ plain form
13879 -6372 -83213 -54645 -48333 -90504 -122935 -117040 -37605 7579 25771 -1747 -13618 49571
13867 49571 74385 84760 107207 125383 109450 76461 54270 83317 70372 71448 69772 31467
13855 31467 59266 110491 128870 104682 60043 28573 43246 18103 -25618 -20685 -39000 -61692
13843 -61692 -60493 -25822 31695 59397 23427 7995 2772 -40404 -36964 7950 30483 70636
13831 70636 73712 58850 58962 52299 29630 46432 64606 55376 86265 78757 106341 116875 101896
13818 101896 79697 121309 158975 116598 54490 14602 14232 30752 32508 -2190 -53922 -5250
13806 -5250 14673 30230 27087 -3609 -9605 27607 -12413 10515 38494 45137 59210 71975
13794 71975 40098 23383 5827 -11721 6584 55765 46933 46198 64982 86262 59261 27209
$$ packed form
13879f372p6841K8568O312m2171l2431N895P9435M5184J8192k7518j1871O3189
13867D9571K4814J0375K2447J8176j5933l2989k2191K9047j2945J076j676l8305
13855C1467K7799N1225J8379k4188m4639l1470J4673k5143m3721M933j8315k2692
13843f1692J199L4671N7517K7702l5970j5432n223m3176L440M4914K2533M0153
13831G0636L076j4862J12o663k2669J6802J8174r230L0889p508K7584J0534j4979
13818A01896k2199M1612L7666m2377o2108l9888l70J6520J756l4698n1732M8672
13806e250J9923J5557l143l0696n996L7212m0020K2928K7979O643J4073J2765
13794G1975l1877j6715j7556j7548J8305M9181q832p35J8784K1280k7001l2052
$$ plain form
13782 27209 31120 23532 71640 113616 149688 165663 136056 136153 185503 199871 197562 176117 158464
13769 158464 144657 113731 58911 37327 77032 94633 86491 54662 33958 80277 102869 109227
13757 109227 110466 73004 64646 48302 37084 60443 72200 71652 65293 41920 67876 110602
13745 110602 139024 127019 108126 99746 126734 129566 120904 54281 21025 -3100 33562 69070
13733 69070 83451 81363 95616 114343 116514 153042 139680 134156 106477 92686 92832 102421 110562
13720 110562 98616 66223 41302 43658 54230 74498 83388 108351 105599 88635 45424 17183
13708 17183 27450 29256 61778 108049 124719 144811 170116 176741 171383 169666 193568 173663
13696 173663 133970 105199 77503 84391 65976 74967 120735 127562 106338 113238 86385 78210
$$ packed form
13782B7209L911p588M8108M1976L6072J5975k9607R7M9350J4368k309k1445j7653
13769A58464j3807l0926n4820k1584L9705J7601q142l1829k0704M6319K2592O358
13757A09227J239l7462q358j6344j1218K3359J1757n48o359k3373K5956M2726
13745A10602K8422j2005j8893q380K6988K832q662o6623l3256k4125L6662L5508
13733F9070J4381k088J4253J8727K171L6528j3362n524k7679j3791J46R589Q141
13720A10562j1946l2393k4921K356J0572K0268Q890K4963k752j6964m3211k8241
13708A7183J0267J806L2522M6271J6670K0092K5305O625n358j717K3902j9905
13696A73663l9693k8771k7696O888j8415Q991M5768O827k1224O900k6853q175
$$ plain form
13684 78210 92872 107033 146232 115485 140206 160602 173938 184545 187185 190510 193937 215803
13672 215803 245751 273826 255465 227935 238798 226945 221058 227267 246265 279603 306175 291466
13660 291466 315229 329252 337132 357149 380810 418568 472280 492738 502348 513895 523230 528493
13648 528493 556540 577498 573283 539148 557376 604526 615049 617517 648823 675793 719690 774371
13636 774371 849340 900536 962325 1034961 1141690 1305989 1464200 1658270 1857325 2112563
13626 2112563 2413565 2842491 3427502 4135990 5065269 6245519 7658038 9260985 11110197
13617 11110197 13422550 16431245 20473811 26035238 33133854 41156221 48284008 51471532
13609 51471532 48238052 39644639 29424896 20985902 15294097 11713658 9417662 7884881
$$ packed form
13684G8210J4662J4161L9199l0747K4721K0396J3336J0607K640L325L427K1866
13672B15803K9948K8075j8361k7530J0863j1853n887O209J8998L3338K6572j4709
13660B91466K3763J4023P880K0017K3661L7758N3712K0458R610J1547R335N263
13648E28493K8047K0958m215l4135J8228M7150J0523K468L1306K6970M3897N4681
13636G74371P4969N1196O1789P2636J06729J64299J58211J94070J99055K55238
13626B112563L01002M28926N85011P08488R29279J180250J412519J602947J849212
13617A1110197K312353L008695M042566N561427P098616Q022367P127787L187524
13609E1471532l233480q593413j0219743q438994n691805l580439k295996j532781
$$ plain form
13601 7884881 6800048 6016200 5363808 4747580 4269260 3968676 3751483 3589711 3503292
13592 3503292 3444976 3439268 3528746 3667945 3825761 4043292 4333431 4669665 5072982 5623209
13582 5623209 6316353 7154510 8341166 9936456 12056819 14849596 18339729 22467084
13574 22467084 27197363 32690201 39399921 47947558 59568377 75922287 97730904 123177649
13566 123177649 147571787 161744052 154856604 127920555 93211551 63974418 44789136
13559 44789136 33055970 25786088 21055205 17806555 15356308 13242467 11404180 9929777
13551 9929777 8767956 7900918 7241119 6694771 6281720 6038287 5918078 5870132 5863604 5916031
13541 5916031 6063285 6305816 6633224 7081927 7726738 8557219 9631425 11072782 13064537
$$ packed form
13601G884881j084833p83848o52392o16228m78320l00584k17193j61772q6419
13592C503292n8316n708Q9478J39199J57816K17531K90139L36234M03317N50227
13582E623209O93144Q38157J186656J595290K120363K792777L490133M127355
13574B2467084M730279N492838O709720Q547637J1620819J6353910K1808617K5446745
13566A23177649K4394138J4172265o887448k6936049l4709004k9237133j9185282
13559D4789136j1733166p269882m730883l248650k450247k113841j838287j474403
13551I929777j161821q67038o59799n46348m13051k43433j20209m7946o528N2427
13541E916031J47254K42531L27408M48703O44811Q30481J074206J441357J991755
$$ plain form
13532 13064537 15756613 19168304 23249272 27937369 33346570 39945171 48384855 59580674
13524 59580674 75277808 96630996 122090089 147363886 163965333 160255077 134873440
13517 134873440 99504160 68093750 47052794 34213113 26291868 21178612 17672016
13510 17672016 15052973 12833668 10861068 9241897 7999578 7035906 6269666 5666363
13502 5666363 5209545 4853654 4588969 4441918 4286901 4160535 4091361 4022190 4053291 4128070
13492 4128070 4272449 4498894 4805849 5260177 5853336 6638896 7651042 8938434 10479666
13483 10479666 12250445 14337795 17070172 20724966 25721027 32442569 40506739 48595291
13475 48595291 54026390 53414638 46032881 35058496 24741227 17386890 12708809 9778904
$$ packed form
13532A3064537K692076L411691M080968M688097N409201O598601Q439684J1195819
13524E9580674J5697134K1353188K5459093K5273797J6601447l710256k5381637
13517A34873440l5369280l1410410k1040956j2839681p921245n113256l506596
13510A7672016k619043k219305j972600j619171j242319r63672p66240o03303
13502E666363m56818l55891k64685j47051j55017j26366o9174o9171L1101P4779
13492D128070J44379K26445L06955M54328N93159P85560J012146J287392J541232
13483A0479666J770779K087350K732377L654794M996061O721542Q064170Q088552
13475D8595291N431099o11752p381757j0974385j0317269p354337m678081k929905
$$ plain form
13467 9778904 7855977 6502037 5478132 4664295 3942086 3329884 2886290 2571119 2301676
13458 2301676 2046991 1833669 1647234 1542078 1502539 1512455 1484773 1439208 1383457 1323823 1328766
13447 1328766 1325846 1294764 1228290 1208089 1140346 1047899 946063 873669 827561 759242 718465
13436 718465 665312 651325 649863 612403 598864 622382 605251 561316 524693 481092 456715 427786
13424 427786 395896 378032 402023 383455 360073 365552 353529 332432 349316 361740 352433 313203
13412 313203 301445 322066 324136 315507 358691 376220 373310 400255 432600 429337 447665 471118
13400 471118 462061 436131 408705 399559 374435 365953 356269 363914 358129 333792 280572 252331 245518
13387 245518 207851 186010 203535 226257 243316 215565 183068 182163 181071 177406 214230 212792
$$ packed form
13467I778904j922927j353940j023905q13837p22209o12202m43594l15171k69443
13458B301676k54685k13322j86435j05156l9539R916k7682m5565n5751n9634M943
13447A328766k920l1082o6474k0201o7743r2447j01836p2394m6108o8319m0777
13436G18465n3153j3987j462l7460j3539K3518j7131m3935l6623m3601k4377k8929
13424D27786l1890j7864K3991j8568k3382N479j2023k1097J6884J2424r307l9230
13412C13203j1758K0621K070q629M3184J7529k910K6945L2345l263J8328K3453
13400D71118r057k5930k7426r146k5124q482r684P645n785k4337n3220k8241o813
13387B45518l7667k1841J7525K2722J7059k7751l2497r05j092l665L6824j438
$$ plain form
13375 212792 230712 203509 191900 133563 109061 63081 63562 92149 145660 204364 237784 215675
13363 215675 161382 152983 124726 134720 150396 121511 131499 166178 158243 169222 171663 139635
13351 139635 113350 139186 155408 157749 163228 159774 149468 162778 163607 185736 189039 161512 130755
13338 130755 124591 113507 131387 125075 138937 178815 186227 185881 157899 145188 133261 118816
13326 118816 93981 74979 68535 87096 118192 137511 149186 144096 103059 67555 54288 84508
13314 84508 84347 91582 85180 67030 81727 117782 117825 118282 99193 120143 135533 105833 88172
13301 88172 97585 127270 136016 127790 99594 78661 79532 69931 97413 94211 78911 105444 100876
13288 100876 76435 55918 48839 21118 29001 81014 70187 43289 79050 73787 83070 105808
$$ packed form
13375B12792J7920k7203j1609n8337k4502m5980M81K8587N3511N8704L3420k2109
13363B15675n4293q399k8257R994J5676k8885R988L4679p935J0979K441l2028
13351A39635k6285K5836J6222K341N479l454j0306J3310Q29K2129L303k7527l0757
13338A30755o164j1084J7880o312J3862L9878P412l46k7982j2711j1927j4445
13326A18816k4835j9002o444J8561L1096J9319J1675n090m1037l5504j3267L0220
13314H4508j61P235o402j8150J4697L6055M3M57j9089K0950J5390k9700j7661
13301H8172R413K9685Q746q226k8196k0933Q71r601K7482l202j5300K6533m568
13288A00876k4441k0517p079k7721P883N2013j0827k6898L5761n263R283K2738
$$ plain form
13276 105808 50533 78522 105137 105659 94703 121013 101200 80582 84246 91571 94444 89391 112109
13263 112109 90223 61633 31592 -10491 -36012 5447 23962 40543 90132 84841 59237 51667
13251 51667 63360 59660 50361 32818 25522 23850 28256 29387 32009 55915 50256 48907 78812
13238 78812 67302 34536 38810 39566 22049 34197 -9770 -14581 38010 84829 58530 50280 66839
13225 66839 65521 29486 -2400 -16010 6481 -4258 -34428 -19770 15947 13643 6453 24976
13213 24976 16351 16508 19634 88001 102483 67184 72212 76996 35199 -1237 -28643 -40194 -12369
13200 -12369 1718 -28529 -25564 -1435 5547 -614 -15179 -14737 1909 -2182 21839 45946 25689
13187 25689 6777 10391 21807 29887 -3873 16875 37618 45492 30278 -12552 -44569 -39571
$$ packed form
13276A05808n5275K7989K6615N22j0956K6310j9813k0618L664P325K873n053K2718
13263A12109k1886k8590l0041m2083k5521M1459J8515J6581M9589n291k5604p570
13251E1667J1693l700r299j7543p296j672M406J131K622K3906n659j349K9905
13238G8812j1510l2766M274P56j7517J2148m3967m811N2591M6819k6299q250J6559
13225F6839j318l6035l1886j3610K2491j0739l0170J4658L5717k304p190J8523
13213B4976q625J57L126O8367J4482l5299N028M784m1797l6436k7406j1551K7825
13200a2369J4087l0247K965K4129O982o161j4565M42J6646m091K4021K4107k0257
13187B5689j8912L614J1416Q080l3760K0748K0743P874j5214m2830l2017M998
$$ plain form
13175 -39571 7625 42038 24726 32120 43714 55198 21345 8727 34294 58710 64140 76292
13163 76292 106639 123036 105389 99949 102815 104460 101984 87446 38110 11476 23149 56615
13151 56615 76238 78526 72367 71351 118232 145918 158531 188050 220246 243913 242841 297447
13139 297447 314523 321110 285475 244260 176374 140265 148790 175463 115711 91589 92946 75892
13127 75892 50194 57445 61243 55646 58105 72643 81926 55810 59245 45639 44272 60438 30512
13114 30512 30919 63774 70379 58305 57450 42689 66999 78559 91755 109703 145782 150768 211004
13101 211004 312705 334556 355446 428381 512109 656340 791164 873949 878452 825503 708314
13090 708314 578420 477298 374631 286453 237643 227600 191031 161429 141398 151207 125900
$$ packed form
13175c9571M7196L4413j7312P394J1594J1484l3853j2618K5567K4416N430J2152
13163G6292L0347J6397j7647n440K866J645k476j4538m9336k6634J1673L3466
13151E6615J9623K288o159j016M6881K7686J2613K9519L2196K3667j072N4606
13139B97447J7076O587l5635m1215o7886l6109Q525K6673n9752k4122J357j7054
13127G5892k5698P251L798n597K459J4538R283k6116L435j3606j367J6166k9926
13114C0512M07L2855O605j2074q55j4761K4310J1560J3196J7948L6079M986O0236
13101B11004J01701K1851K0890P2935Q3728J44231J34824Q2785M503n2949j17189
13090G08314j29894j01122j02667q8178m8810j0043l6569k9602k0031R809k5307
$$ plain form
13079 125900 108959 111860 101230 88465 81292 133366 137106 100326 128941 128262 110303 79759
13067 79759 77760 75974 99265 125986 118838 106636 98204 129312 121176 149518 181926 217667 250155
13054 250155 362147 421911 491851 623559 777999 888937 920802 875468 736842 597547
13044 597547 447094 343710 285208 218175 185084 123335 65217 28077 53320 98243 80492
13033 80492 71824 45272 55143 71677 118970 114034 47372 20950 44682 89170 91716 83760 87006
13020 87006 74873 44270 12175 20057 18505 12634 20623 82353 127463 119614 124444 107395 155968
13007 155968 166900 214905 242550 288417 324646 280787 224579 156100 130779 116222 95134
12996 95134 86489 42487 -18188 19311 54697 59082 66361 62013 55695 32466 25990 13786 -13802
$$ packed form
13079A25900j6941K901j0630j2765p173N2074L740l6780K8615o79j7959l0544
13067G9759j999j786K3291K6721p148j2202q432L1108q136K8342L2408L5741L2488
13054B50155J11992N9764O9940J31708J54440J10938L1865m5334j38626j39295
13044E97547j50453j03384n8502o7033l3091o1749n8118l7140K5243M4923j7751
13033H0492q668k6552R871J6534M7293m936o6662k6422K3732M4488K546p956L246
13020H7006j2133l0603l2095P882j552n871P989O1730M5110p849M830j7049M8573
13007A55968J0932M8005K7645M5867L6229m3859n6208o8479k5321j4557k1088
12996I5134q645m4002o0675L7499L5386M385P279m348o318k3229o476j2204k7588
$$ plain form
12983 -13802 -22504 4104 43674 66961 21025 2947 -8229 4088 8663 13910 -4984 10216
12971 10216 10064 -22000 -32652 -36507 -25956 -11731 5790 -35772 -12347 -28251 -46547 -3457
12959 -3457 2427 -14992 -26111 -42471 -45871 -902 -22695 -33088 -43566 -62797 -73837 -83662
12947 -83662 -69250 -44757 -60966 -50607 -41394 -34583 -14969 7365 15759 14465 13207 -13018 -7941
12934 -7941 51 9149 26484 -1590 -15384 -15412 5241 48126 66654 53379 5012 -19116 26171
12921 26171 65784 58578 23528 -9962 -14491 -37797 5106 20532 38102 24286 719 6682
12909 6682 -2978 -13004 -54519 -54565 -7154 6246 -6162 -20900 -5745 7803 -11284 -20665 -39448
12896 -39448 -11248 4817 6924 43955 31193 6653 -3690 -18785 19244 50632 65679 44649
$$ packed form
12983a3802q702K6608L9570K3287m5936j8078j1176J2317M575N247j8894J5200
12971A0216j52l2064j0652l855J0551J4225J7521m1562K3425j5904j8296M3090
12959c457N884j7419j1119j6360l400M4969k1793j0393j0478j9231j1040r825
12947h3662J4412K4493j6209J0359R213O811J9614K2334Q394j294j258k6225N077
12934g941P992R098J7335k8074j3794k8K0653M2885J8528j3275m8367k4128M5287
12921B6171L9613p206l5050l3490m529k3306M2903J5426J7570j3816k3567N963
12909F682r660j0026m1515m6M7411J3400j2408j4738J5155J3548j9087r381j8783
12896c9448K8200J6065K107L7031j2762k4540j0343j5095L8029L1388J5047k1030
$$ plain form
12884 44649 27229 9357 17930 -8910 -31854 -29808 -63048 -36432 -13776 -32103 -54913 -34177
12872 -34177 -25056 -7720 -13836 -52212 -43339 9896 27292 24188 25779 33072 62037 73598 72813
12859 72813 66502 57628 72009 47148 -4653 -43967 -45440 -18858 -1016 25129 48852 14919
12847 14919 19832 31586 25979 20762 24036 14941 20616 -10166 -6900 -11965 -51072 -67145 -62565
12834 -62565 -46392 3495 23637 27565 16636 10816 -702 -2970 9176 13377 34074 4405
12822 4405 -26690 34067 48101 48369 48914 55756 44734 36582 31598 32682 59553 78356 73952 68703
12808 68703 47390 41421 59096 56233 78731 62553 46654 29086 18631 14887 29860 37233
12796 37233 24590 19907 11583 4763 6274 15211 -44344 -80649 -44295 -4434 20415 29754 19201
$$ packed form
12884D4649j7420j7872Q573k6840k2944K046l3240K6616K2656j8327k2810K0736
12872c4177R121J7336o116l8376Q873N3235J7396l104J591P293K8965J1561p85
12859G2813o311q874J4381k4861n1801l9314j473K6582J7842K6145K3723l3933
12847A4919M913J1754n607n217L274r095N675l0782L266n065l9107j6073M580
12834f2565J6173M9887K0142L928j0929n820j1518k268J2146M201K0697k9669
12822D405l1095O0757J4034K68N45O842j1022q152m984J084K6871J8803m404n249
12808F8703k1313n969J7675k863K2498j6178j5899j7568j0455l744J4973P373
12796C7233j2643m683q324o820J511Q937n9555l6305L6354L9861K4849R339j0553
$$ plain form
12783 19201 -18550 -5755 18874 13714 25227 45487 21987 11154 -6643 -40896 -35444 -19246
12771 -19246 -7755 -10168 10896 33236 71489 15872 -44235 -3223 24013 14178 18839 18661 3583
12758 3583 16958 3683 11375 3765 10374 14050 20510 -12426 -30283 -43176 -72089 -47350 -14801
12745 -14801 16588 -12511 -28500 -51957 -64920 -47041 -46732 -49549 -19320 -9293 2536 44005
12733 44005 64546 36274 -311 2837 15704 18725 29629 5827 -22464 -2702 -20123 -22569
12721 -22569 -3625 -23843 -40115 -37824 -14605 3474 -7200 -32456 -34865 -30697 -20299 -26040
12709 -26040 -41539 -18298 -17 -9225 44 13990 24078 8675 -34343 -16397 -1336 15795
12697 15795 6515 4752 27133 39952 35218 62443 86909 76294 25256 -16118 -31204 -16722
$$ packed form
12783A9201l7751J2795K4629n160J1513K0260k3500j0833j7797l4253N452J6198
12771a9246J1491k413K1064K2340L8253n5617o0107M1012K7236r835M661j78j5078
12758C583J3375j3275P692p610O609L676O460l2936j7857j2893k8913K4739L2549
12745a4801L1389k9099j5989k3457j2963J7879L09k817L0229J0027J1829M1469
12733D4005K0541k8272l6585L148J2867L021J0904k3802k8291J9762j7421k446
12721b2569J8944k0218j6272K291K3219J8079j0674k5256k409M168J0398n741
12709b6040j5499K3241J8281r208R269J3946J0088j5403m3018J7946J5061J7131
12697A5795r280j763K2381J2819m734K7225K4466j0615n1038m1374j5086J4482
$$ plain form
12685 -16722 -14291 -46862 -61643 -35940 -2723 19830 34663 34295 4806 -5377 -11019 -15258 -33668
12672 -33668 -46271 -55888 -89375 -63347 5689 -22150 -38495 -44873 -8494 24155 -34424 -55574
12660 -55574 -38473 -10471 -24220 -40811 -17779 -10225 -12178 -8240 -1596 31321 35635 -10789 4513
12647 4513 17690 7234 12629 -17639 -10457 -11086 -40214 -32793 -2807 7228 622 -28407 -56557
12634 -56557 -52400 -53907 -27275 -17564 -8632 -16472 -11569 5027 -15668 -3080 -37 -7724 -2299
12621 -2299 19471 47074 63783 25011 2096 8940 5611 -15759 -21938 -11648 4843 -537 7224
12608 7224 45005 49597 59217 25315 -14543 -15329 -33 3264 7197 9552 28792 35797 12367
12595 12367 6930 14435 33167 -3768 9418 -6968 -33971 -35743 -19851 -20979 -13 1676 -4095
$$ packed form
12685a6722K431l2571j4781K5703L3217K2553J4833l68k9489j0183n642m239j8410
12672c3668j2603r617l3487K6028O9036k7839j6345o378L6379L2649n8579k1150
12660e5574J7101K8002j3749j6591K3032P554j953L938O644L2917M314m6424J5302
12647D513J3177j0456N395l0268P182o29k9128P421K9986J0035o606k9029k8150
12634e6557M157j507K6632R711Q932p840M903J6596k0695J2588L043p687N425
12621b299K1770K7603J6709l8772k2915O844l329k1370o179J0290J6491n380P761
12608G224L7781M592R620l3902l9858p86J5296L297L933K355J9240P005k3430
12595A2367n437P505J8732l6935J3186j6386k7003j772J5892j128K0966J689n771
$$ plain form
12582 -4095 -19119 -40480 -46065 -42109 -30255 -52571 -53534 -14485 -7561 10478 12493 36872 41031
12569 41031 51974 46744 11494 -17142 -24641 -8492 -14331 -53895 -60265 -31591 -29594 -8820 37485
12556 37485 51108 27721 9144 24552 47402 20076 -48985 -74661 -66290 -36220 -9286 -2148
12544 -2148 13578 11941 10383 -2778 -39331 -26478 -48537 -80973 -99654 -81007 -34806 -12946
12532 -12946 -1335 -20592 -20802 -40110 -26896 8222 -46218 -64017 -63069 -36965 -56305 -70494
12520 -70494 -29123 -19325 -12613 -14839 -45118 -30350 -22791 -72569 -81910 -70547 -24557 -10707 23455
12507 23455 67511 61150 40152 19413 25098 4462 -9731 -20359 -32010 -21256 2729 -17656
12495 -17656 -12248 5848 -4775 44221 68602 55302 10184 -27367 -34596 -28196 -29072 -31931 -28488
$$ packed form
12582d095j5024k1361n585L956J1854k2316r63L9049O924J8039K015K4379M159
12569D1031J0943n230l5250k8636p499J6149n839l9564o370K8674J997K0774M6305
12556C7485J3623k3387j8577J5408K2850k7326o9061k5676Q371L0070K6934P138
12544b148J5726j637j558j3161l6553J2853k2059l2436j8681J8647M6201K1860
12532a2946J1611j9257k10j9308J3214L5118n4440j7799R48K6104j9340j4189
12520g0494M1371R798O712k226l0279J4768P559m9778r341J1363M5990J3850L4162
12507B3455M4056o361k0998k0739N685k0636j4193j0628j1651J0754K3985k0385
12495a7656N408J8096j0623M8996K4381j3300m5118l7551p229O400q76k859L443
$$ plain form
12482 -28488 -21729 -17146 9973 41263 42846 9704 -33822 -44035 -19914 -6069 29807 16881
12470 16881 -20438 -26657 -29207 -24052 -4419 10418 25097 -13594 -8599 32566 15019 -21209
12458 -21209 -37156 -40982 -31408 -47958 -37615 -25712 -33897 -50473 -26728 8914 11015 -15711
12446 -15711 -33636 -62574 -39998 -20802 -31556 -36325 -12002 35375 27500 -14356 -23620 -6149
12434 -6149 -17184 -12788 -8728 -42163 -60166 -73187 -37279 -11762 -19172 -23573 -2461 -8020 -36042
12421 -36042 -51908 -58839 -72784 -36749 -16817 12837 28010 11093 4814 13232 7894 -7052
12409 -7052 -16369 21883 50807 24989 20245 -42111 -38965 -178 -9172 -15860 -53678 -61410 -34429
12396 -34429 -30679 -16416 -11748 -13159 19760 -6966 -31530 -30226 -32002 -54384 -56035 -48402 -39719
$$ packed form
12482b8488O759M583K7119L1290J583l3142m3526j0213K4121J3845L5876j2926
12470A6881l7319o219k550N155J9633J4837J4679l8691M995M1165j7547l6228
12458b1209j5947l826R574j6550J0343J1903q185j6576K3745L5642K101k6726
12446a5711j7925k8938K2576J9196j0754m769K4323M7377p875m1856r264J7471
12434f149j1035M396M060l3435j8003j3021L5908K5517p410m401K1112n559k8022
12421c6042j5866o931j3945L6035J9932K9654J5173j6917o279Q418n338j4946
12409g052r317L8252K8924k5818m744o2356L146L8787q994o688l7818p732K6981
12396c4429L750J4263M668j411L2919k6726k4564J304j776k2382j651P633Q683
$$ plain form
12383 -39719 -16980 28261 59021 26854 18385 17682 -9017 -27419 -31471 -18541 -33583 -25925 15518
12370 15518 4670 15135 17657 -626 -20544 -7347 2575 -12027 -25958 -14079 -2516 -24846
12358 -24846 -56618 -47782 -24200 -54023 -73142 -62516 -9718 9479 21705 11175 -19829 -12542
12346 -12542 -20069 -34570 -41750 -70748 -78808 -71956 -36056 -22205 10624 12503 -2926 -20955 -23382
12333 -23382 -8863 -16913 -40260 -67510 -63900 -57397 -32227 11724 -19189 -59089 -66692 -82512
12321 -82512 -63068 -53458 -44014 -14478 -23430 -47640 -42414 -21320 -33875 -13934 -7212 -25483 -31399
12308 -31399 -53348 -43013 5756 15973 786 -17533 6057 24654 11861 1790 -9600 -9491
12296 -9491 -23488 -48141 -51586 -2413 17622 13186 26657 13659 -22496 -36063 6052 19610
$$ packed form
12383c9719K2739M5241L0760l2167q469p03k6699j8402m052J2930j5042P658M1443
12370A5518j0848J0465K522j8283j9918J3197R922j4602j3931J1879J1563k2330
12358b4846l1772Q836K3582k9823j9119J0626N2798J9197J2226j0530l1004P287
12346a2542p527j4501p180k8998q060O852L5900J3851L2829J879j5429j8029k427
12333b3382J4519q050k3347k7250L610O503K5170M3951l0913l9900p603j5820
12321h2512J9444R610R444K9536q952k4210N226K1094j2555J9941O722j8271n916
12308c1399k1949J0335M8769J0217j5187j8319K3590J8597j2793j0071j1390J09
12296i491j3997k4653l445M9173K0035m436J3471j2998l6155j3567M2115J3558
$$ plain form
12284 19610 35440 78884 59637 30362 26373 60891 70144 47184 68606 64876 45813 44208
12272 44208 50023 28951 4108 31060 51532 37482 -4343 5444 3966 12958 45033 12087
12260 12087 -18951 -1833 31405 67050 32845 9655 -4763 -22386 -19344 -30014 -54411 -46734
12248 -46734 -44113 -42741 -14586 -41779 -72097 -48166 -10685 -9649 -12854 4321 51513 46694 24539
12235 24539 39343 38154 14792 42966 66199 64563 27907 6520 9543 28906 77943 76825
12223 76825 87996 63066 26522 9085 19442 315 2773 22236 35814 67356 86205 81602
12211 81602 57274 34716 33394 25721 45684 32967 38556 33288 -2976 -11586 -2830 25104 16491
12198 16491 8102 -11625 -33878 -25045 -34689 -28178 -27455 -6887 4716 6559 21977 19966 14412
$$ packed form
12284A9610J5830M3444j9247k9275l989L4518R253k2960K1422l730j9063j605
12272D4208N815k1072k4843K6952K0472j4050m1825R787j478Q992L2075l2946
12260A2087l1038J7118L3238L5645l4205k3190j4418j7623L042j0670k4397P677
12248d6734K621J372K8155k7193l0318K3931L7481J036l205J7175M7192m819k2155
12235B4539J4804j189k3362K8174K3233j636l6656k1387L023J9363M9037j118
12223G6825J1171k4930l6544j7437J0357j9127K458J9463J3578L1542J8849m603
12211H1602k4328k2558j322p673J9963j2717N589n268l6264q610Q756K7934q613
12198A6491q389j9727k2253Q833r644O511P23K0568J1603J843J5418k011n554
$$ plain form
12185 14412 11913 11528 23964 4123 21799 17336 -9481 10850 6918 -4431 10792 -4008 -3625
12172 -3625 -29553 -26661 -31528 -46739 -59238 -58893 -53398 -37576 -19635 -19684 -43951 -38623 -28477 -46597
12158 -46597 -31151 -24869 -21230 14916 33341 15142 47399 15435 -11054 -32436 -1960 9693
12146 9693 -11591 -1583 -21998 -44822 -55494 -73263 -63771 -49547 -44032 -44615 -38853 -6313 -1697
12133 -1697 -13835 -20066 -7663 -23549 -25981 5060 -9730 27945 39404 5731 -24401 -37847
12121 -37847 -13697 -21041 -45379 -58407 -76254 -53093 -20975 -9994 -34175 -20678 -8408 -1238
12109 -1238 -18715 -42111 -35208 -24806 3428 13108 -10611 -24030 -2903 26005 29953 10902
12097 10902 -15467 -28143 -33203 -38613 -26617 -18875 14742 31172 18326 -3838 -406 13763
$$ packed form
12185A4412k499l85J2436j9841J7676m463k6817K0331l932j1349J5223j4800L83
12172c625k5928K892m867j5211j2499L45N495J5822J7941m9k4267N328J0146j8120
12158d6597J5446O282L639L6146J8425j8199L2257l1964k6489k1382L0476J1653
12146I693k1284J0008k0415k2824j0672j7769R492J4224N515n83N762L2540M616
12133a697j2138o231J2403j5886k432L1041j4790L7675J1459l3673l0132j3446
12121c7847K4150p344k4338j3028j7847K3161L2118J0981k4181J3497J2270P170
12109a238j7477k3396O903J0402K8234R680k3719j3419K1127K8908L948j9051
12097A0902k6369j2676n060n410J1996P742L3617J6430j2846k2164L432J4169
$$ plain form
12085 13763 53470 25618 -22007 -31500 -63004 -8651 21395 -3085 -34415 -35107 -32944 -34443 39144
12072 39144 95474 90305 38929 -5176 -15220 -3421 14255 11034 -13022 -71451 -68854 -54187
12060 -54187 -24773 -10687 -10152 -17396 -32736 -36120 -19067 26694 61802 25474 -21416 -32101
12048 -32101 5627 31563 10730 -649 -6028 -31016 -48285 -42514 -41964 -15075 21701 1911
12036 1911 -27555 -46510 -52334 -47427 -39281 -28576 -23928 -7931 31116 66518 52550 25802 16175
12023 16175 10145 833 -19588 -12028 -34147 -19480 -28972 -53312 -55389 -41519 3634 33220 27105
12010 27105 5820 63024 61065 47104 52955 38767 66561 64081 41111 30238 1466 12967
11998 12967 12813 10017 -15331 -48380 -54211 -37812 -43660 -20785 -13215 -29817 -60534 -32711 8554
$$ packed form
12085A3763L9707k7852m7625r493l1504N4353L0046k4480l1330o92K163j499P3587
12072C9144N6330n169n1376m4105j0044J1799J7676l221k4056n8429K597J4667
12060e4187K9414J4086N35p244j5340l384J7053M5761L5108l6328m6890j0685
12048c2101L7728K5936k0833j1379n379k4988j7269N771N50K6889L6776j9790
12036A911k9466j8955n824M907Q146J0705M648J5997L9047L5402j3968k6748r627
12023A6175o030r312k0421P560k2119J4667r492k4340k077J3870M5153K9586o115
12010B7105k1285N7204j959j3961N851j4188K7794k480k2970j0873k8772J1501
11998A2967j54k796k5348l3049n831J6399n848K2875P570j6602l0717K7823M1265
$$ plain form
11985 8554 21536 -5217 -11052 -24827 -71715 -101549 -80751 -48989 -18947 13111 39067 -15232
11973 -15232 -53148 -20824 -5219 -8067 338 1113 -15491 -40491 -52140 -40407 -43680 -60252 -72036
11960 -72036 -74843 -10816 29862 31019 15263 24141 4039 -29411 -23869 -28555 -29867 -81633 -101117
11947 -101117 -73348 -101777 -96316 -79959 -79149 -50138 -22737 -45594 -80802 -94909 -57548 -21439
11935 -21439 -3681 34080 23424 10909 20496 49441 34689 17131 6294 -13649 -9918 22910
11923 22910 1219 -18244 -33931 -24778 -46340 -79822 -48336 -16973 -2989 -2724 -39241 -63382
11911 -63382 -15281 5623 -8518 -2714 -20228 -8347 9698 1863 -22401 -38282 -48538 -57012
11899 -57012 -63007 -35063 7639 -632 -49184 -43270 -12764 3206 19899 4829 -37798 -38695 -2064
$$ packed form
11985H554J2982k6753n835j3775m6888k9834K0798L1762L0042L2058K5956n4299
11973a5232l7916L2324J5605k848Q405P75j6604k5000j1649J1733l273j6572j1784
11960g2036k807O4027M0678J157j5756Q878k0102l3450N542m686j312n1766j9484
11947a01117K7769k8429N461J6357Q10K9011K7401k2857l5208j4107L7361L6109
11935b1439J7758L7761j0656j2515R587K8945j4752j7558j0837j9943L731L2828
11923B2910k1691j9463j5687R153k1562l3482L1486L1363J3984K65l6517k4141
11911f3382M8101K0904j4141N804j7514J1881J8045p835k4264j5881j0256q474
11899e7012n995K7944M2702q271m8552N914L0506J5970J6693j5070m2627q97L6631
$$ plain form
11886 -2064 7083 -18147 14079 38947 3221 -1837 -3368 5539 -19765 -37542 13540 66771 17872
11873 17872 -2885 17088 -10111 -941 3254 -6202 -16182 -6334 2964 45178 94188 73314 9538
11860 9538 -5578 10079 22746 -30621 -44727 1982 -9535 -31760 -34131 -19842 -25423 -8388
11848 -8388 10236 -18395 -60677 -68848 -74572 -57374 -62594 -50394 -84458 -77009 -91503 -76594 -27790
11835 -27790 -17251 -55874 -25554 18289 -2522 -42649 -51257 -45457 -33545 1876 26695 10214
11823 10214 30844 36641 24286 16205 11066 -4357 9636 5945 -33127 -64673 -39651 -53980
11811 -53980 -79280 -49624 -28177 -19325 -33537 13445 35617 -4370 51819 74830 76822 64970
11799 64970 63061 35881 22198 16993 15998 7096 415 -4116 -29708 -7598 -23157 -40000 -68818
$$ packed form
11886b064R147k5230L2226K4868l5726n058j531Q907k5304j7777N1082N3231m8899
11873A7872k0757J9973k7199R170M195r456r980R848R298M2214M9010k0874o3776
11860I538j5116J5657J2667n3367j4106M6709j1517k2225k371J4289n581J7035
11848h388J8624k8631m2282q171n724J7198n220J2200l4064P449j4494J4909M8804
11835b7790J0539l8623L0320M3843k0811m0127q608N800J1912L5421K4819j6481
11823A0214K0630N797j2355q081n139j5423J3993l691l9072l1546K5022j4329
11811e3980k5300K9656K1447Q852j4212M6982K2172l9987N6189K3011J992j1852
11799F4970j909k7180j3683n205r95q902o681m531k5592K2110j5559j6843k8818
$$ plain form
11786 -68818 -64384 -61191 -27788 -37297 -68703 -84484 -83082 -59503 -50452 -42759 -69398 -84744 -76827
11773 -76827 -26749 -7672 -333 -8668 -41739 -59356 -39600 -17993 -53825 -41964 -45322 -15351
11761 -15351 -3120 -12032 -1488 29712 33831 35795 33533 37658 16245 -26810 -59052 -57938 -51894
11748 -51894 -61491 -60967 -72748 -90845 -83653 -81159 -88121 -69834 -23253 1436 -36411 -58173 -48551
11735 -48551 14211 36548 2308 -14917 -1064 -25454 -47922 -62148 -69837 -87708 -58441 -50676
11723 -50676 -44674 -43654 -30244 -24909 -39027 -43725 -49105 -24378 -44958 -26540 6470 6775 3791
11710 3791 -7991 -6638 1782 7912 -4269 -31988 -39834 -5275 6334 1901 13757 51793 71499
11697 71499 62453 40552 26932 25789 17342 14762 16074 27752 40807 -7271 -27025 -28798 -2607
$$ packed form
11786f8818M434L193L3403r509l1406j5781J402K3579R051P693k6639j5346P917
11773g6827N0078J9077P339q335l3071j7617J9756K1607l5832J1861l358K9971
11761a5351J2231q912J0544L1200M119J964k262M125k1413m3055l2242J114O044
11748e1894r597N24j1781j8097P192K494o962J8287M6581K4689l7847k1762R622
11735d8551O2762K2337l4240j7225J3853k4390k2468j4226p689j7871K9267P765
11723e0676O002J020J3410N335j4118m698n380K4727k0580J8418L3010L05k984
11710C791j1782J353Q420O130j2181k7719p846L4559J1609m433J1856L8036J9706
11697G1499r046k1901j3620j143q447k580J312J1678J3055m8078j9754j773K6191
$$ plain form
11684 -2607 3391 14268 20935 19488 40134 12274 -31808 -42340 -62889 -29919 -32738 -24264 -5132
11671 -5132 -30614 -26648 -31485 -41698 -29264 -5609 15752 -25436 -19312 10768 -3781 -34775
11659 -34775 -42777 -35696 -22381 -22405 -4412 4781 -27386 -64983 -55009 -33411 -7763 -25853 -31945
11646 -31945 -36306 -21835 14117 29088 1867 -62896 -59756 -38198 7748 -577 -28702 -8904
11634 -8904 -17228 -20855 -5232 -22560 -20554 -13168 -17647 13161 6514 -24656 -44282 -53751 -30391
11621 -30391 10292 -6041 -25634 100 23616 66589 69510 32433 42090 46170 51174 56043 28066
11608 28066 30381 6924 -48439 -68401 -52062 14918 68081 40666 -4775 -28277 -24294 -10372
11596 -10372 -21773 -29115 6682 8625 -19181 -14985 -13344 -49858 -47636 -3930 5453 5632 13021
$$ packed form
11684b607N998J0877O667j447K0646k7860m4082j0532k0549L2970k819Q474J9132
11671e132k5482L966m837j0213J2434K3655K1361m1188O124L0080j4549l0994
11659c4775q002P081J3315k4J7993R193l2167l7597R974K1598K5648j8090o092
11646c1945m361J4471L5952J4971k7221o4763L140K1558M5946q325k8125J9798
11634h904q324l627J5623j7328K006P386m479L0808o647l1170j9626r469K3360
11621c0391M0683j6333j9593K5734K3516M2973K921l7077R657M080N004M869k7977
11608B8066K315k3457n5363j9962J6339O6980N3163k7415m5441k3502L983J3922
11596a0372j1401p342L5797J943k7806M196J641l6514K222M3706R383J79P389
$$ plain form
11583 13021 -7736 -21286 -27007 -3425 -19091 -55856 -65523 -39123 -22114 -14522 -49137 -40879
11571 -40879 -26606 -35131 -52724 -49022 -29307 -20501 -16727 13743 4264 -30260 -16346 26049 28656
11558 28656 17287 -35094 -105193 -103371 -73493 -79373 -66337 -35053 -29145 -2882 19905 4006
11546 4006 -45597 -77510 -54150 -36374 -21870 33076 61073 66168 44317 20944 9916 30033
11534 30033 54558 22105 2257 33248 50466 41827 17162 34661 8541 17464 8602 4693
11522 4693 -42570 -62391 -60492 -23139 -12056 -35847 -29922 -36778 -53314 -37749 -41251 -40984 -33546
11509 -33546 -44554 -55822 -16886 -14114 -28204 -15724 -10320 6923 11592 3623 42261 18623
11497 18623 3192 -36078 -28540 -33556 -50921 -22320 -31429 -35669 -32149 -58403 -75685 -68762 -20364
$$ packed form
11583A3021k0757j3550n721K3582j5666l6765r667K6400J7009P592l4615Q258
11571d0879J4273q525j7593L702J9715Q806L774L0470r479l4524J3914M2395K607
11558B8656j1369n2381p0099J822K9878n880J3036L1284N908K6263K2787j5899
11546D006m9603l1913K3360J7776J4504N4946K7997N095k1851k3373j1028K0117
11534C0033K4525l2453j9848L0991J7218q639k4665J7499k6120Q923q862l909
11522D693m7263j9821J899L7353J1083k3791N925o856j6536J5565l502K67P438
11509c3546j1008j1268L8936K772j4090J2480N404J7243M669p969L8638k3638
11497A8623j5431l9270P538n016j7365K8601r109m240L520k6254j7282O923M8398
$$ plain form
11484 -20364 -2082 -285 -34398 -9467 63569 76904 73585 37611 50040 21915 23532 30843
11472 30843 17265 -2249 -15917 -13476 -25473 -44363 -62505 -38604 -12868 -30225 -6013 1583
11460 1583 -59103 -73535 -57872 -30127 -15197 -34280 -43949 -36216 -21866 7719 27959 -10831
11448 -10831 -41937 -34588 -31568 -33541 -16655 -31624 -1671 15312 11391 -3280 38234 67661
11436 67661 84866 49468 -8597 -10950 -13606 9346 43668 30469 -5618 14388 3010 -2050
11424 -2050 -9351 -7481 -27435 -72693 -74963 -70808 -49551 -26924 -30140 -10003 7075 289 17138
11411 17138 -10073 -15410 -27257 -15240 -5669 9357 48142 38177 -4201 16412 11404 -10816
11399 -10816 -9991 -16336 -30469 -50515 -41814 22703 19517 45129 38432 -33024 -34686 -48670 -41672
$$ packed form
11484b0364J8282J797l4113K4931P3036J3335l319l5974J2429k8125J617P311
11472C0843j3578j9514j3668K441j1997j8890j8142K3901K5736j7357K4212P596
11460A583o0686j4432J5663K7745J4930j9083r669P733J4350K9585K0240l8790
11448a0831l1106P349L020j973J6886j4969K9953J6983l921j4671M1514K9427
11436F7661J7205l5398n8065k353k656K2952L4322j3199l6087K0006j1378n060
11424b050p301J870j9954m5258k270M155K1257K2627l216K0137J7078o786J6849
11411A7138k7211n337j1847J2017R571J5026L8785r965m2378K0613n008k2220
11399a0816Q25o345j4133k0046Q701O4517l186K5612o697p1456j662j3984O998
$$ plain form
11386 -41672 -35971 -35117 -33053 -58061 -64469 -47028 -60027 -27730 -44838 -57641 8259 21363 -10160
11373 -10160 -14221 -1532 -11546 -6128 -16033 -23823 -18642 -34853 -66001 -52445 -15934 5582 14128
11360 14128 33598 16422 -19037 -32401 -26920 -6403 37522 3912 -24653 -18655 -7201 -8808
11348 -8808 -20901 -17563 -3835 27339 29488 26983 12799 -9081 -25551 -38401 -44002 -47672 -57738
11335 -57738 -16808 6235 24086 -3889 -23098 -2970 8443 17162 51826 33879 46174 76524
11323 76524 39520 24052 20514 18381 15651 14795 15777 4416 -33451 -43778 -23110 -6545 -2541
11310 -2541 19443 14712 -4714 -3475 -3233 -9942 -45386 -19674 1279 25232 44330 17117 -19905
11297 -19905 -25311 -6008 -18386 -9666 4969 -22445 -37055 -50816 -35430 -34217 -42259 -73163
$$ packed form
11386d1672N701Q54K064k5008o408J7441j2999L2297j7108j2803O5900J3104l1523
11373a0160m061J2689j0014N418r905p790N181j6211l1148J3556L6511K1516Q546
11360A4128J9470j7176l5459j3364N481K0517M3925l3610k8565N998J1454j607
11348h808j2093L338J3728L1174K149k505j4184k1880j6470j2850n601l670j0066
11335e7738M0930K3043J7851k7975j9209K0128J1413Q719L4664j7947J2295L0350
11323G6524l7004j5468l538k133k730q56R82j1361l7867j0327K0668J6565M004
11310b541K1984m731j9426J239K42o709l5444K5712K0953K3953J9098k7213l7022
11297a9905n406J9303j2378Q720J4635k7414j4610j3761J5386J213q042l0904
$$ plain form
11285 -73163 -94741 -69351 -25357 -34518 -47915 -86932 -82137 -62646 -20783 19236 51713 50617
11273 50617 14895 51771 80413 73952 54630 39013 11684 -391 8920 -11786 -16159 -28530
11261 -28530 -42865 -31399 24905 64092 71068 50441 27062 7431 -17190 -9410 -26558 -62324
11249 -62324 -60980 -41752 -17350 16182 27384 3796 -28316 -10409 14320 -3425 -37323 -5827
11237 -5827 19824 28973 1091 -8913 5094 1631 -21152 -25420 -283 46659 56793 18508
11225 18508 -6026 9966 22649 13731 11671 1753 -31959 -32998 -29180 -18318 -1949 -33512 -27394
11212 -27394 8494 -35165 -56943 -22041 1649 22496 -648 -39659 -30009 -40195 -20559 -20616
11200 -20616 -21423 -9722 -677 13091 -1458 11816 12958 -12533 -46225 -33630 -22492 12984
$$ packed form
11285g3163k1578K5390M3994r161j3397l9017M795J9491M1863M0019L2477j096
11273E0617l5722L6876K8642o461j9322j5617k7329j2075R311k0706m373j2371
11261b8530j4335J1466N6304L9187O976k0627k3379j9631k4621P780j7148l5766
11249f2324J344J9228K4402L3532J1202k3588l2112J7907K4729j7745l3898L1496
11237e827K5651R149k7882j0004J4007l463k2783m268K5137M6942J0134l8285
11225A8508k4534J5992J2683q918k060r918l3712j039L818J0862J6369l1563O118
11212b7394L5888m3659k1778L4902K3690K0847k3144l9011R650j0186J9636n7
11200b0616q07J1701R045J3768j4549J3274J142k5491l3692J2595J1138L5476
$$ plain form
11188 12984 -5076 -54457 -22057 -26824 -43361 -55671 -54651 -52669 -62899 -74291 -62341 -19389
11176 -19389 -12615 -29168 -47812 -48469 -22533 9429 46842 11784 -47405 -68969 -66440 -25458
11164 -25458 -18405 -61986 -47614 -15688 4008 8830 5052 -25363 -23491 -4108 -33233 -52654
11152 -52654 -33060 -26860 -42820 -29837 -4043 19989 12998 -12313 -58255 -68314 -50319 -75322
11140 -75322 -89662 -72811 -84533 -83091 -59810 -47805 -30011 -1224 -10569 -53786 -34499 -37367
11128 -37367 -67315 -61679 -36497 25073 55779 5812 -12636 -1126 4085 -41302 -48873 -41152
11116 -41152 -39560 -26950 -15607 -7320 -15732 -19685 -19039 7830 22130 1326 -34015 -35592 5317
11103 5317 -1305 -10209 -10077 -6817 2114 3105 14682 38828 47784 33942 21059 6344 15352 43300
$$ packed form
11188A2984j8060m9381L2400m767j6537j2310J020J982j0230j1392J1950M2952
11176a9389O774j6553j8644o57K5936L1962L7413l5058n9189k1564K529M0982
11164b5458P053m3581J4372L1926J9696M822l778l0415J872J9383k9125j9421
11152e2654J9594O200j5960J2983K5794K4032o991k5311m5942j0059J7995k5003
11140g5322j4340J6851j1722J442K3281J2005J7794K8787r345m3217J9287k868
11128c7367k9948N636K5182O1570L0706m9967j8448J1510N211m5387p571P721
11116d1152J592J2610J1343Q287q412l953O46K6869J4300k0804l5341j577M0909
11103E317o622q904J32L260Q931R91J1577K4146Q956j3842j2883j4715R008K7948
$$ plain form
11089 43300 26584 -4293 -6545 9153 -21199 -7138 29058 23861 12514 4782 39983 26326
11077 26326 31949 24000 14360 19624 43960 8383 15793 47028 38048 25946 67941 67568 46129
11064 46129 22615 -11571 -33808 -9784 3373 8584 18681 25156 26667 21262 -17119 -22302 14420
11051 14420 -6681 -25276 -12118 -20576 -37009 -45711 -16507 -23799 -14530 -2630 -15473 -22489 -16419
11038 -16419 -32068 -13574 -1012 -560 -13899 1158 19597 47385 29294 -22371 4742 9422
11026 9422 -18605 -30183 -35817 -7350 6125 19969 35340 36597 9999 -18620 -11964 10091
11014 10091 -2273 -466 -798 12027 44383 23120 -19695 -3281 6969 -34942 -44081 -12972
11002 -12972 -5451 -2800 -8260 -14681 -40720 -63359 -32287 5161 31394 16770 -3530 -13 893
$$ packed form
11089D3300j6716l0877k252J5698l0352J4061L6196n197j1347p732L5201j3657
11077B6326N623p949r640N264K4336l5577P410L1235q980j2102M1995l73k1439
11064D6129k3514l4186k2237K4024J3157N211J0097O475J511n405l8381n183L6722
11051A4420k1101j8595J3158q458j6433q702K9204p292R269J1900j2843p016O070
11038a6419j5649J8494J2562M52j3339J5057J8439K7788j8091n1665K7113M680
11026I422k8027j1578n634K8467J3475J3844J5371J257k6598k8619O656K2055
11014A0091j2364J807l32J2825L2356k1263m2815J6414J0250m1911r139L1109
11002a2972P521K651n460o421k6039k2639L1072L7448K6233j4624k0300L517R06
$$ plain form
10989 893 -243 23846 47319 55444 76745 74196 23373 -6915 -4620 -35936 -21588 21236 33195
10976 33195 36733 24311 16196 4599 2533 -14973 8682 29557 34810 38500 77669 97006 109404
10963 109404 135069 122109 129278 135763 130506 93306 102521 119575 107987 59849 44017 10074
10951 10074 -10512 -24255 -18405 -47514 -49605 -8653 1322 -2028 19883 24683 5868 -20067 -30342
10938 -30342 -16687 17269 13143 17789 46476 27340 23544 29249 32252 41688 40001 14962 -8499
10925 -8499 4690 60450 22226 -8848 -14359 -23738 -24080 -35886 -22253 -16146 -528 31074 12561
10912 12561 167 5045 17781 54453 64455 44123 31805 15169 10207 22068 12224 9681
10900 9681 26538 9474 9805 -6836 8764 44644 77506 110543 169407 184241 152931 122810
$$ packed form
10989H93j136K4089K3473Q125K1301k549n0823l0288K295l1316J4348M2824J1959
10976C3195L538j2422q115j1597k066j7506K3655K0875N253L690L9169J9337J2398
10963A09404K5665j2960P169O485n257l7200R215J7054j1588m8138j5832l3943
10951A0074k0586j3743N850k9109k091M0952R975l350K1911M800j8815k5935j0275
10938c0342J3655L3956m126M646K8687j9136l796N705L003R436j687k5039k3461
10925h499J3189N5760l8224l1074n511r379l42j1806J3633O107J5618L1602j8513
10912A2561j2394M878J2736L6672J0002k0332j2318j6636m962J1861r844k543
10900I681J6857j7064L31j6641J5600L5880L2862L3037N8864J4834l1310l0121
$$ plain form
10888 122810 72614 38170 26665 33477 11536 50666 113396 92962 64704 68508 99348 98816
10876 98816 114697 103080 83772 66424 100059 144888 194462 218346 248218 328703 433291
10865 433291 561039 718551 887851 1091429 1363955 1656485 1969856 2180617 2320295 2446118
10855 2446118 2532934 2436047 2199489 1940933 1703804 1441454 1157877 858399 611282 443892
10845 443892 343090 270791 224742 175355 130556 84160 74988 90833 136719 154166 109597
10834 109597 95101 99994 79695 50720 57762 53196 46647 49173 86404 67924 69579 64267 34349
10821 34349 56956 63522 43096 54573 46104 49244 55490 44650 51468 53353 40635 7115 2260
10808 2260 28474 48006 32705 31433 37495 28267 -5910 -13812 21187 35991 61598 67727 79908
$$ packed form
10888A22810n0196l4444j1505O812k1941L9130O2730k0434k8258L804L0840n32
10876I8816J5881j1617j9308j7348L3635M4829M9574K3884K9872Q0485J04588
10865D33291J27748J57512J69300K03578K72526K92530L13371K10761J39678J25823
10855B446118Q6816r6887k36558k58556k37129k62350k83577k99478k47117j67390
10845D43892j00802p2299m6049m9387m4799m6396r172J5845M5886J7447m4569
10834A09597j4496M893k0299k8975P042m566o549K526L7231j8480J655n312k9918
10821C4349K2607O566k0426J1477q469L140O246j0840O818J885j2718l3520m855
10808B260K6214J9532j5301j272O062r228l4177p902L4999J4804K5607O129J2181
$$ plain form
10795 79908 80876 62758 30321 11915 -924 -397 12720 36829 62164 77997 90382 100883
10783 100883 114716 105692 99022 90607 94988 76955 60736 69286 53473 54234 55695 80033 65067
10770 65067 43722 33852 74875 87077 53499 26965 3585 -3201 843 32252 66959 7645
10758 7645 -18488 -30627 -16936 18036 36322 60013 42284 39889 65895 40246 53341 56235
10746 56235 54367 20636 -790 16642 31339 24286 5356 -7327 6936 6151 7419 32873 46225
10733 46225 35605 1443 -21792 2236 11259 17133 52142 69127 71551 46788 24692 23129
10721 23129 69366 81041 65976 78370 80523 86459 94361 113980 173678 251119 283245 284588
10709 284588 351224 373416 371222 385467 377718 409459 391034 361527 369454 339655 322948 250750
$$ packed form
10795G9908R68j8118l2437j8406j2839N27J3117K4109K5335J5833J2385J0501
10783A00883J3833r024o670q415M381j8033j6219Q550j5813P61J461K4338j4966
10770F5067k1345r870M1023J2202l3578k6534k3380o786M044L1409L4707n9314
10758G645k6133j2139J3691L4972J8286K3691j7729k395K6006k5649J3095K894
10746E6235j868l3731k1426J7432J4697p053j8930j2683J4263p85J268K5454J3352
10733D6225j0620l4162k3235K4028R023N874L5009J6985K424k4763k2096j563
10721B3129M6237J1675j5065J2394K153N936P902J9619N9698P7441L2126J343
10709B84588O6636K2192k194J4245p749L1741j8425k9507P927k9799j6707p2198
$$ plain form
10697 250750 175228 137539 148837 165835 117073 80198 54860 55732 70470 70624 51167 18428
10685 18428 -16117 -39983 -34925 -44536 -25796 26978 49913 87490 114619 123228 152542 173094
10673 173094 181733 185754 218450 261322 301123 335344 369242 411598 495916 573536 730965 924108
10661 924108 1121626 1340810 1466441 1554116 1658898 1711074 1662395 1472898 1253245 1121344
10651 1121344 991723 809076 534665 352563 273236 213844 181525 145110 149461 152096 144922
10640 144922 150587 106848 139305 126831 114147 114771 118452 143352 148452 145020 127055 104373 110889
10627 110889 99362 44527 31832 31606 72783 146385 185046 251359 322943 381933 459004 502793
10615 502793 534230 526330 492321 453834 389967 338829 303683 278439 271530 216990 181917 226048
$$ packed form
10697B50750p5522l7689J1298J6998m8762l6875k5338Q72J4738J54j9457l2739
10685A8428l4545k3866N058r611J8740N2774K2935L7577K7129Q609K9314K0552
10673A73094Q639M021L2696M2872L9801L4221L3898M2356Q4318P7620J57429J93143
10661I24108J97518K19184J25631Q7675J04782N2176m8679j89497k19653j31901
10651A121344j29621j82647k74411j82102p9327n9392l2319l6415M351K635p174
10640A44922N665m3739L2457j2474j2684O24L681K4900N100l432j7965k2682O516
10627A10889j1527n4835j2695k26M1177P3602L8661O6313P1584N8990P7071M3789
10615E02793L1437p900l4009l8487o3867n1138l5146k5244o909n4540l5073M4131
$$ plain form
10603 226048 238917 215069 224341 248068 258039 224771 229331 274639 295543 287168 272872 297442
10591 297442 377889 430823 429383 438423 470821 484025 455267 422741 346314 311111 285467 274518
10579 274518 260481 231167 194184 166214 195658 177288 130979 136837 161667 141203 119456 134951
10567 134951 155287 168448 162778 160468 191998 202771 216168 254166 298056 304130 324574 363067
10555 363067 357230 324763 368153 408294 394417 367690 407865 440600 432105 432704 415733 419261
10543 419261 380068 350686 337445 377715 451529 464228 449083 474074 494602 559508 551217 519655
10531 519655 561812 573934 570685 600859 627360 641559 617214 646594 702796 747650 770675 801787
10519 801787 843347 871014 892552 922000 951852 989043 1049735 1089823 1150898 1193166 1215981
$$ packed form
10603B26048J2869k3848R272K3727R971l3268M560M5308K0904q375j4296K4570
10591B97442Q0447N2934j440R040L2398J3204k8758l2526p6427l5203k5644j0949
10579B74518j4037k9314l6983k7970K9444j8370m6309N858K4830k0464k1747J5495
10567A34951K0336J3161n670k310L1530J0773J3397L7998M3890O074K0444L8493
10555C63067n837l2467M3390M0141j3877k6727M0175L2735q495N99j6971L528
10543D19261l9193k9382j3241M0270P3814J2699j5145K4991K0528O4906q291l1562
10531E19655M2157J2122l249L0174K6501J4199k4345K9380N6202M4854K3025L1112
10519H01787M1560K7667K1538K9448K9852L7191O0692M0088O1075M2268K2815
$$ plain form
10508 1215981 1262449 1329930 1389341 1435681 1495281 1605700 1711629 1762312 1889031 2060712
10498 2060712 2233865 2365985 2470004 2584411 2745187 2916736 3119435 3336414 3552614
10489 3552614 3821065 4125759 4410145 4662031 4922387 5166587 5494496 5908971 6370028
10480 6370028 6932238 7652393 8557422 9636315 10801765 12052089 13484802 15211937 17311812
10471 17311812 19697609 22573364 26319008 31306420 37590094 45199726 54627830 66800610
10463 66800610 82369379 102146882 128435570 164124879 209848803 263796864 320928333
10456 320928333 369300846 403910527 432273405 460061022 472567909 448512802 396967643
10449 396967643 342923032 299095803 251202038 194381921 138670232 97182457 71230493
$$ packed form
10508A215981M6468O7481N9411M6340N9600J10419J05929N0683J26719J71681
10498B060712J73153J32120J04019J14407J60776J71549K02699K16979K16200
10489C552614K68451L04694K84386K51886K60356K44200L27909M14475M61057
10480F370028N62210P20155R05029J078893J165450J250324J432713J727135K099875
10471A7311812K385797K875755L745644M987412O283674P609632R428104J2172780
10463F6800610J5568769J9777503K6288688L5689309M5723924N3948061N7131469
10456C20928333M8372513L4609681K8362878K7787617J2506887k4055107n1545159
10449C96967643n4044611m3827229m7893765n6820117n5711689m1487775k5951964
$$ plain form
10442 71230493 55010550 44215238 36705738 31349058 27315761 24050672 21375245 19176833
10434 19176833 17340451 15759073 14420848 13212830 11993825 10832893 9773988 8910376
10426 8910376 8115624 7304863 6516036 5835930 5274723 4828351 4444252 4152838 3955806
10417 3955806 3776788 3577708 3365614 3198086 3038355 2920421 2766421 2641922 2522201
10408 2522201 2431242 2311911 2230349 2151735 2050859 1964600 1857481 1773315 1699880 1662660 1610988
10397 1610988 1557547 1513069 1497088 1455927 1377693 1324026 1284701 1263277 1237901 1147955 1090722
10386 1090722 1084785 1076641 1041468 1032306 1010455 974131 984410 950050 908988 900622 903709 853387
10374 853387 773478 720536 722226 734002 731597 739342 776018 795237 759943 706284 712096 723847
$$ packed form
10442G1230493j6219943j0795312p509500n356680m033297l265089k675427k198412
10434A9176833j836382j581378j338225j208018j219005j160932j058905q63612
10426H910376p94752q10761p88827o80106n61207m46372l84099k91414j97032
10417C955806j79018j99080k12094j67528j59731j17934j54000j24499j19721
10408B522201r0959j19331q1562p8614j00876q6259j07119q4166p3435l7220n1672
10397A610988n3441m4478j5981m1161p8234n3667l9325k1424k5376q9946n7233
10386A090722n937q144l5173r162k1851l6324J0279l4360m1062q366L087n0322
10374H53387p9909n2942J690J1776k405P745L6676J9219l5294n3659N812J1751
$$ plain form
10362 723847 711915 671776 645979 642608 592163 579962 572232 520371 493896 474689 465457 463386
10350 463386 474035 484319 505301 527970 541863 548302 568119 581915 599888 632757 704871 731446
10338 731446 703032 722277 759924 762041 755257 758642 754881 761093 737177 698227 680902 688726 661363
10325 661363 612254 610392 631198 575344 495090 471503 476746 465733 436968 447219 375163 360692
10313 360692 375298 350644 279071 282325 339548 337621 342079 353850 347835 321136 319792 302030
10301 302030 266651 245762 283061 286930 254025 224435 232759 222771 245021 240076 243205 268073
10289 268073 305802 336575 342266 351771 349978 348318 373978 441506 434275 407156 384345 373157
10277 373157 380212 328387 290052 284636 251025 207952 221019 241674 234578 237427 247756 234483
$$ packed form
10362G23847j1932m0139k5797l371n0445j2201p730n1861k6475j9207r232k071
10350D63386J0649J0284K0982K2669J3893O439J9817J3796J7973L2869P2114K6575
10338G31446k8414J9245L7647K117o784L385l761O212k3916l8950j7325P824k7363
10325F61363m9109j862K0806n5854q0254k3587N243j1013k8765J0251p2056j4471
10313C60692J4606k4654p1573L254N7223j927M458J1771o015k6699j344j7762
10301C02030l5379k0889L7299L869l2905k9590Q324r988K2250m945L129K4868
10289B68073L7729L0773N691R505j793j660K5660O7528p231k7119k2811j1188
10277C73157P055n1825l8335n416l3611m3073J3067K0655p096K849J0329j3273
$$ plain form
10265 234483 235665 264396 297130 322777 286829 294055 301502 301190 297651 283966 247366 198686 228927
10252 228927 258475 239885 215528 214496 200424 231377 269442 235203 190423 170282 162533 223280
10240 223280 249314 227938 229011 247108 207582 197659 174766 181880 176061 191387 229430 236141
10228 236141 190949 162162 155002 174399 192125 182850 191654 244867 252093 192716 181341 182665
10216 182665 191015 169368 141997 161120 149871 113211 95836 98743 131014 126629 167044 167972
10204 167972 155452 130603 131505 124849 130283 119394 126053 146161 132778 100934 89979 85448 59465
10191 59465 71319 125383 160143 158082 123307 111740 128936 132603 128088 117327 142377 166338
10179 166338 145042 145100 168711 163873 155284 127612 141442 132338 153192 152025 168849 172246 197887
$$ packed form
10265B34483J182K8731L2734K5647l5948P226P447l12l539j3685l6600m8680L0241
10252B28927K9548j8590k4357j032j4072L0953L8065l4239m4780k0141p749O0747
10240B23280K6034k1376J073J8097l9526r923k2893P114n819J5326L8043O711
10228B36141m5192k8787p160J9397J7726r275Q804N3213P226n9377j1375J324
10216A82665Q350k1647k7371J9123j1249l6660j7375K907L2271m385M0415R28
10204A67972j2520k4849R02o656N434j0889O659K0108j3383l1844j0955m531k5983
10191E9465J1854N4064L4760k061l4775j1567J7196L667m515j0761K5050K3961
10179A66338k1296N8K3611m838q589k7672J3830r104K0854j167J6824L397K5641
$$ plain form
10166 197887 188218 183882 153654 172974 190179 134868 143685 126415 96396 99405 105062 126808
10154 126808 113945 96296 104972 149913 170538 195676 221902 158406 129197 154251 156438 146564
10142 146564 134717 129507 92160 34228 18612 30537 -9144 9075 57507 76245 68854 49439
10130 49439 76620 79641 84770 47813 41740 66341 50025 80465 70605 55307 30542 56448
10118 56448 63795 29258 -12290 17177 57294 43090 46719 60727 89068 133665 121596 85472
10106 85472 73939 77131 62445 81087 87478 60784 32273 64705 73390 71269 25702 14634
10094 14634 8127 7595 29021 55551 63603 44051 38606 48486 41250 33419 87303 119484 114363
10081 114363 87170 88275 62930 71846 105747 123290 129861 149347 130541 132471 127135 137954
$$ packed form
10166A97887r669m336l0228J9320J7205n5311Q817j7270l0019L009N657K1746
10154A26808j2863j7649Q676M4941K0625K5138K6226o3496k9209K5054K187r874
10142A46564j1847n210l7347n7932j5616J1925l9681J8219M8432J8738p391j9415
10130D9439K7181L021N129l6957o073K4601j6316L0440r860j5298k4765K5906
10118E6448P347l4537m1548K9467M0117j4204L629J4008K8341M4597j2069l6124
10106H5472j1533L192j4686J8642O391k6694k8511L2432Q685k121m5567j1068
10094A4634o507n32K1426K6530Q052j9552n445R880p236p831N3884L2181n121
10081A14363k7193J105k5345Q916L3901J7543O571J9486j8806J930n336J0819
$$ plain form
10069 137954 128799 100011 130449 150830 166560 170365 175184 213420 213555 253080 330808 344652
10057 344652 355473 420952 502968 645213 802105 987082 1217226 1498170 1785759 2083401
10047 2083401 2306370 2437610 2574979 2649905 2572861 2316255 2016353 1763428 1547437 1365434
10037 1365434 1108178 928506 772520 631959 488913 391199 314415 267357 208685 146314
10027 146314 144821 115839 102468 77366 59540 40854 20252 39864 34313 32411 37591 14775
10015 14775 10627 37077 54517 74620 63770 83662 115204 114406 98931 116380 125139 93937
10003 93937 88507 116499 136560 107064 85407 83187 77846 46557 25030 44187 50297 70202
9991 70202 62424 51082 9522 10611 55176 88851 98254 85526 76818 55070 52807 83447 67170
$$ packed form
10069A37954r155k8788L0438K0381J5730L805M819L8236J35L9525P7728J3844
10057C44652J0821O5479Q2016J42245J56892J84977K30144K80944K87589K97642
10047B083401K22969J31240J37369P4926p7044k56606k99902k52925k15991j82003
10037A365434k57256j79672j55986j40561j43046r7714p6784m7058n8672o2371
10027A46314j493k8982j3371k5102j7826j8686k0602J9612n551j902N180k2816
10015A4775m148K6450J7440K0103j0850J9892L1542p98j5475J7449Q759l1202
10003I3937n430K7992K0061k9496k1657k220n341l1289k1527J9157O110J9905
9991G0202p778j1342m1560J089M4565L3675R403j2728q708k1748k263L0640j6277
$$ plain form
9978 67170 80407 83824 64091 26863 43707 54998 21892 45200 81332 55685 51713 40529
9966 40529 64647 81389 51706 42999 58564 51884 60171 91997 109156 86476 97292 96299 93029
9953 93029 80506 53446 54748 51306 46927 51491 58088 32160 9732 51007 46603 -3003 -27346
9940 -27346 -32631 -37561 -34987 -9239 -17124 -17582 -22837 13386 40229 60882 61494 73028 88172 77998
9926 77998 51300 52797 36837 31318 27987 53331 55394 25041 30828 61129 63982 66480 23798
9913 23798 15668 8405 15803 2376 1264 18732 13163 20141 113 -16473 4330 33108 10001
9900 10001 15347 41601 42512 32302 26177 25909 82086 85723 72926 63314 55784 67083 67696 66521
9886 66521 48316 34564 72992 61434 77446 92076 83034 49765 52486 19628 -36534 -13655
$$ packed form
9978F7170J3237L417j9733l7228J6844J1291l3106K3308L6132k5647l972j1184
9966D0529K4118J6742k9683q707J5565o680Q287L1826J7159k2680J0816r93l270
9953I3029j2523k7060J302l442m379M564O597k5928k2428M1275m404m9606k4343
9940b7346n285m930K574K5748p885m58n255L6223K6843K0653O12J1534J5144j0174
9926G7998k6698J497j5960n519l331K5344K063l0353N787L0301K853K498m2682
9913B3798q130p263P398j3427j112J7468n569O978k0028j6586K0803K8778k3107
9900A0001N346K6254R11j0210o125k68N6177L637j2797r612p530J1299O13j175
9886F6521j8205j3752L8428j1558J6012J4630r042l3269K721l2858n6162K2879
$$ plain form
9874 -13655 16100 21300 25824 37965 35972 30681 16406 -20211 -24142 -11899 22030 27165 35358
9861 35358 20121 728 10462 32280 55643 86267 78287 63607 45890 42563 9620 -17504
9849 -17504 25117 50428 64272 50483 50775 104441 152912 173690 151973 159707 165196 189025 255730
9836 255730 305957 300894 275831 195069 132805 105196 60361 39114 20893 -8559 -27581 -31183
9824 -31183 -21051 10162 42918 49027 47684 56846 43447 46736 31251 33390 53772 53409 73291
9811 73291 67692 39005 16112 16264 29505 35362 43490 44699 22339 -16767 -32643 1395 34632
9798 34632 33589 50540 30771 23541 17199 38741 46863 8542 18008 27660 -1805 -19435 -17939
9785 -17939 40044 57539 47278 30454 -3131 -10111 11924 24102 10570 -16655 18320 24737
$$ packed form
9874a3655K9755N200M524J2141j993n291j4275l6617l931J2243L3929N135Q193
9861C5358j5237j9393R734K1818K3363L0624p980j4680j7717l327l2943k7124
9849a7504M2621K5311J3844j3789K92N3666M8471K0778k1717P734N489K3829O6705
9836B55730N0227n063k5063q0762o2264k7609m4835k1247j8221k9452j9022l602
9824c1183J0132L1213L2756O109j343R162j3399L289j5485K139K0382l63J9882
9811G3291n599k8687k2893J52J3241N857Q128J209k2360l9106j5876L4038L3237
9798C4632j043J6951j9769p230o342K1542Q122l8321R466R652k9465j7630J496
9785a7939N7983J7495j0261j6824l3585o980K2035J2178j3532k7225L4975O417
$$ plain form
9773 24737 62674 56083 42578 71520 98386 94668 101135 107214 72275 69082 48955 17474 -22219
9760 -22219 -24488 -30153 -10575 38618 48877 40260 26779 46519 76677 66729 30061 30831 16910
9747 16910 4598 19799 49284 71682 34378 39949 99191 121720 80670 43491 62808 68743
9735 68743 53792 5079 -7219 18085 -531 26854 4572 2901 25659 138 -1691 -14335
9723 -14335 -54569 -46608 -30645 -13573 -337 35350 45597 41236 62366 77524 71820 27810
9711 27810 15363 23565 33792 14001 -15036 -30844 -13214 -6729 -7434 -44381 -33691 -19951 -16897
9698 -16897 11399 9357 -562 8666 20595 26133 -7531 -23430 -15959 5740 29190 3722 3687
9685 3687 25713 15413 8356 14567 8548 -6512 -21191 -19929 -35248 -17212 19363 -20211 -53325
$$ packed form
9773B4737L7937o591j3505K8942K6866l718O467O079l4939l193k0127l1481l9693
9760b2219k269n665J9578M9193J0259q617j3481J9740L0158r948l6668P70j3921
9747A6910j2312J5201K9485K2398l7304N571N9242K2529m1050l7179J9317N935
9735F8743j4951m8713j2298K5304j8616K7385k2282j671K2758k5521j829j2644
9723a4335m0234P961J5963J7072J3236L5687J0247m361K1130J5158n704m4010
9711B7810j2447Q202J0227j9791k9037j5808J7630O485p05l6947J0690J3740L054
9698a6897K8296k042r919R228J1929N538l3664j5899P471K1699K3450k5468l5
9685C687K2026j0300p057O211o019j5060j4679J262j5319J8036L6575l9574l3114
$$ plain form
9672 -53325 -13766 -3677 13727 12331 36175 70726 63349 20787 14200 32926 20513 -7295
9660 -7295 2568 -98 -1339 8967 9101 20034 14188 6824 23299 8457 -6177 -6290 -1577 6441
9646 6441 2848 -25309 -6819 17407 10061 14339 20142 4737 -7532 16565 58799 34969 33858
9633 33858 73556 61183 450 -35420 -4930 -8762 49560 35848 40254 46382 8634 -14319
9621 -14319 -4212 -27012 1239 34654 17410 4963 29150 67239 69016 78544 43200 20156
9609 20156 2498 -630 19276 27084 32721 30162 12692 11178 -9002 -3318 -26526 -28410 -15628
9596 -15628 -38891 -54291 -53236 -62143 -46869 -8794 15807 46171 12815 8284 15381 30069 34527
9583 34527 37340 -21459 -27222 -27250 -26647 10721 22649 14966 8251 20111 10350 -50837 -73208 -79630
$$ packed form
9672e3325L9559J0089J7404j396K3844L4551p377m2562o587J8726j2413k7808
9660g295R863k666j241J0306J34J0933n846p364J6475j4842j4634j13M713Q018
9646F441l593k8157J8490K4226p346M278N803j5405j2269K4097M2234k3830j111
9633C3858L9698j2373o0733l5870L0490l832N8322j3712M406O128l7748k2953
9621a4319J0107k2800K8251L3415j7244j2447K4187L8089J777R528l5344k3044
9609B0156j7658l128J9906P808N637k559j7470j514k0180N684k3208j884J2782
9596a5628k3263j5400J055q907J5274L8075K4601L0364l3356m531P097J4688M458
9583C4527K813n8799n763k8O03L7368J1928p683o715J1860r761o1187k2371o422
$$ plain form
9569 -79630 -45513 -35662 -20698 -13563 -28098 -33051 -26075 7786 19136 21215 16089 -11275 -18871
9556 -18871 -3634 35119 24701 36345 40864 45388 52999 80036 101514 43312 -46 -885 10529
9543 10529 9675 -19951 34527 23463 13957 14704 40491 57771 60404 53939 46039 42969 32815 11826
9529 11826 -5368 -1504 9066 19562 20206 -16626 -24127 -35224 -51052 -35607 -36097 -11134 12005
9516 12005 15830 -5308 -52075 -72221 -99500 -91655 -64655 -34180 -16563 -45970 -61975 1406
9504 1406 10026 8542 -2364 -27417 -3873 -19669 -26572 11432 48550 63129 32951 27230 34773
9491 34773 10893 -19815 -31776 -10916 -18584 -19307 12271 36867 20440 -19968 1034 19610
9479 19610 -9038 -35760 -28850 -26999 -45315 -65452 -15644 65211 101921 66024 59552 33421
$$ packed form
9569g9630L4117R851J4964P135j4535m953O976L3861J1350K079n126k7364p596
9556a8871J5237L8753j0418J1644M519M524P611K7037K1478n8202m3358q39J1414
9543A0529q54k9626N4478j1064r506P47K5787J7280K633o465p900l070j0154k0989
9529A1826j7194L864J0570J0496O44l6832p501j1097j5828J5445m90K4963K3139
9516A2005L825k1138m6767k0146k7279P845K7000L0475J7617k9407j6005O3381
9504A406Q620j484j0906k5053K3544j5796o903L8004L7118J4579l0178n721P543
9491C4773k3880l0708j1961K0860p668p23L1578K4596j6427m0408K1002J8576
9479A9610k8648k6722O910J851j8316k0137M9808Q0855L6710l5897o472k6131
$$ plain form
9467 33421 -20809 -2140 12172 26748 -6527 12595 54222 28501 46256 75878 92072 95799
9455 95799 86725 80918 31154 22227 37333 7692 -22492 -49593 -12415 5346 11709 14135 20400
9442 20400 -14873 -21754 18010 43207 29997 9657 -5512 -840 45225 82850 84460 66264
9430 66264 66593 93770 52204 41648 67555 64231 66439 31744 -17773 -23880 -21593 -31711 -46824
9417 -46824 -10351 53730 63403 41217 63434 106805 112939 115457 92940 67231 49884 70039
9405 70039 74739 62867 45510 21361 24028 23057 17671 18243 -13563 11699 22738 27237 20404 -10230
9391 -10230 -9997 23846 33523 -16833 -28435 -12290 39342 65328 58323 76570 118257 120253 92127
9378 92127 83215 46059 16379 36975 21354 6910 37892 43786 21517 66380 79632 71134
$$ packed form
9467C3421n4230J8669J4312J4576l3275J9122M1627k5721J7755K9622J6194L727
9455I5799r074n807m9764q927J5106k9641l0184k7101L7178J7761O363K426O265
9442B0400l5273o881L9764K5197j3210k0340j5169M672M6065L7625J610j8196
9430F6264L29K7177m1566j0556K5907l324K208l4695m9517o107K287j0118j5113
9417d6824L6473O4081R673k2186K2217M3371O134K518k2517k5709j7347K0155
9405G0039M700j1872j7357k4149K667r71n386N72l1806K5262J1039M499o833l0634
9391a0230K33L3843R677n0356j1602J6145N1632K5986p005J8247M1687J996k8126
9378I2127q912l7156k9680K0596j5621j4444L0982N894k2269M4863J3252q498
$$ plain form
9366 71134 81927 85247 54404 45570 58239 54521 48977 53677 98140 74825 25101 69764 96034
9353 96034 100481 119343 93775 58686 59426 29998 44682 59117 56932 69004 85881 79753 105392
9340 105392 106218 83150 81264 59883 74910 72593 60769 93415 102330 107005 89094 60173 114543
9327 114543 153155 130685 143821 132939 95254 93512 123569 149544 134943 161870 166926 195235
9315 195235 202966 207485 192977 181141 187803 229828 251698 299537 280074 287374 330618 427858
9303 427858 531458 604499 663689 804747 929110 1166861 1472257 1832088 2284530 2839611
9293 2839611 3469975 4209152 5175302 6497123 8407614 11076079 14393647 17864237 20349179
9284 20349179 20086355 16843645 12205735 8137174 5515973 3921195 2887798 2242352
$$ packed form
9366G1134J0793L320l0843q834J2669l718n544M700M4463k3315m9724M4663K6270
9353I6034M447J8862k5568l5089P40k9428J4684J4435k185J2072J6877o128K5639
9340A05392Q26k3068j886k1381J5027k317j1824L2646Q915M675j7911k8921N4370
9327A14543L8612k2470J3136j0882l7685j742L0057K5975j4601K6927N056K8309
9315A95235P731M519j4508j1836O662M2025K1870M7839j9463P300M3244R7240
9303D27858J03600P3041N9190J41058J24363K37751L05396L59831M52442N55081
9293B839611O30364P39177R66150J321821J910491K668465L317568L470590K484942
9284B0349179k62824l242710m637910m068561k621201j594778j033397o45446
$$ plain form
9276 2242352 1822677 1504049 1241522 1093409 977251 880415 803496 770162 737045 748429
9266 748429 743586 755052 818529 887871 986943 1126377 1215652 1165385 1008353 845379 687142
9255 687142 539574 416793 349493 339349 346775 302733 255733 253767 229335 226235 261922 294329
9243 294329 279697 228146 194596 201393 205013 213561 218651 215994 209081 217045 201890 214217 234609
9230 234609 267291 283398 300862 304230 322032 315101 354738 403374 420834 490764 622494 798902
9218 798902 1019435 1307447 1563322 1751625 1791860 1602416 1260621 943880 696527 518761
9208 518761 428851 364055 318821 314574 278377 226269 209814 226896 211617 210985 212087 184580
9196 184580 173611 174189 189265 178428 125612 98692 150983 126026 150188 153854 163245 158103 127185
$$ packed form
9276B242352m19675l18628k62527j48113j16158r6836p6919l3334l3117J1384
9266G48429m843J1466O3477O9342R9072J39434Q9275n0267j57032j62974j58237
9255F87142j47568j22781o7300j0144P426m4042m7000j966k4432l100L5687L2407
9243B94329j4632n1551l3550O797L620Q548N090k657o913P964j5155J2327K0392
9230B34609L2682J6107J7464L368J7802o931L9637M8636J7460O9930J31730J76408
9218G98902K20533K88012K55875J88303M0235j89444l41795l16741k47353j77766
9208E18761q9910o4796m5234m247l6197n2108j6455J7082j5279o32J102k7507
9196A84580j0969N78J5076j0837n2816k6920N2291k4957K4162L666R391n142l0918
$$ plain form
9183 127185 138327 151526 132556 190158 264037 279629 281757 317886 370369 451674 522940 626899
9171 626899 757132 851439 852330 795531 636494 452273 355216 317192 265644 231247 186633
9160 186633 99966 64273 54097 71826 59244 84823 91412 77114 71923 85030 97125 98678
9148 98678 102382 102715 84774 80967 47309 34176 66796 120583 118581 102359 71913 78640 110468
9135 110468 81126 94023 97001 89217 84457 43481 26799 34883 22531 21780 26758 65713 87738
9122 87738 61727 41838 65870 105504 109979 99164 113463 171398 202018 218581 223903 194456
9110 194456 159934 149341 143153 148520 109160 83322 87101 87334 81418 93715 115866 91316 36827
9097 36827 25111 38885 27006 32230 73461 84629 89069 68495 121050 163345 164654 168660 149146
$$ packed form
9183A27185J1142J3199j8970N7602P3879J5592K128L6129N2483Q1305P1266J03959
9171F26899J30233R4307Q91n6799j59037j84221r7057l8024n1548l4397m4614
9160A86633q6667l5693j0176J7729j2582K5579O589j4298n191J3107J2095J553
9148I8678L704L33j7941l807l3658j3133L2620N3787k002j6222l0446O727L1828
9135A10468k9342J2897K978p784m760m0976j6682Q084j2352p51M978L8955K2025
9122H7738k6011j9889K4032L9634M475j0815J4299N7935L0620J6563N322k9447
9110A94456l4522j0593o188N367l9360k5838L779K33n916J2297K2151k4550n4489
9097C6827j1716J3774j1879N224M1231J1168M440k0574N2555M2295J309M006j9514
$$ plain form
9084 149146 136964 85944 73336 82170 66786 69779 68664 104790 149129 171568 185144 192755
9072 192755 218060 256416 295046 309996 326876 359072 339778 290797 213245 173390 167305 174802
9060 174802 155596 100040 62943 71308 124984 109119 83467 56670 41214 26221 48012 69251
9048 69251 87640 86395 92753 107847 102379 98544 122608 137834 143772 64973 41989 32987 24312
9035 24312 15817 20763 66737 132465 139177 155886 169456 164907 187472 194181 168711 203358 211844
9022 211844 248389 256998 202167 158690 109210 101822 98113 93322 118126 116043 146085 170925 150293
9009 150293 130152 127245 74559 32294 14644 23784 24987 24791 31414 77012 111154 115994 135398
8996 135398 148666 164494 198895 216522 198594 176248 132867 117134 147371 115245 83593 83885
$$ packed form
9084A49146j2182n1020j2608Q834j5384K993j115L6126M4339K2439J3576P611
9072A92755K5305L8356L8630J4950J6880L2196j9294m8981p7552l9855o085P497
9060A74802j9206n5556l7097Q365N3676j5865k5652k6797j5456j4993K1791K1239
9048F9251J8389j245O358J5094n468l835K4064J5226N938p8799k2984r002q675
9035B4312q495M946M5974O5728O712J6709J3570m549K2565O709k5470L4647Q486
9022B11844L6545Q609n4831m3477m9480p388l709m791K4804k083L0042K4840k0632
9009A50293k0141k907n2686m2265j7650R140J203j96O623M5598L4142M840J9404
8996A35398J3268J5828L4401J7627j7928k2346m3381j5733L0237l2126l1652K92
$$ plain form
8984 83885 97530 64686 83212 113914 128938 183031 192683 193690 174466 150999 127964 120990
8972 120990 91827 91771 136533 135388 141611 132170 165089 194352 166234 193479 224525 197355 186656
8959 186656 231306 271222 279654 284948 283090 316172 401183 400513 373132 358779 366275 375308 374440
8946 374440 374738 412760 411538 382628 318144 245871 200787 204647 225613 198760 205386 207055 188700
8933 188700 239878 265992 295026 345833 368181 365745 364752 418034 447952 470286 464958 448736
8921 448736 465963 528530 652075 707691 734952 742452 725327 701899 673160 633475 601381 623782
8909 623782 697224 759250 849247 916022 956166 957885 949129 971242 998594 1018179 1080312 1185236
8897 1185236 1285647 1327562 1383590 1418296 1464607 1533379 1596906 1695331 1809471 1925591 2050908
$$ packed form
8984H3885J3645l2844J8526L0702J5024N4093R652J007j9224k3467k3035o974
8972A20990k9163n6M4762j145O223r441L2919K9263k8118K7245L1046k7170j0699
8959A86656M4650L9916Q432N294j858L3082Q5011o70k7381j4353P496R033q68
8946C74440K98L8022j222k8910o4484p2273m5084L860K0966k6853O626J669j8355
8933A88700N1178K6114K9034N0807K2348k436r93N3282K9918K2334n328j6222
8921D48736J7227O2567J23545N5616K7261P500j7125k3428k8739l9685l2094K2401
8909F23782P3442O2026Q9997O6775M0144J719q756K2113K7352J9585O2133J04924
8897A185236J00411M1915N6028L4706M6311O8772O3527R8425J14140J16120J25317
$$ plain form
8886 2050908 2248409 2487834 2751231 3001801 3329300 3710808 4183668 4725122 5383482 6196573
8876 6196573 7287306 8788502 10714644 13136938 16142766 19691909 23823970 28703229
8868 28703229 34769411 42533277 52852566 67299469 87511336 113156988 141050366
8861 141050366 164087510 169878387 151641178 117683364 82670458 56933535 40695317
8854 40695317 30605324 24132410 19778490 16740190 14536580 12866232 11631409 10745629
8846 10745629 10085187 9541311 9066251 8626268 8261206 8062834 8006251 8061171 8267626 8582947
8836 8582947 9089028 9754187 10607302 11711526 13095954 14988285 17552073 20954828 25354406
8827 25354406 30866814 37569387 45407326 54629697 66079643 80691690 99833510 126822868
$$ packed form
8886B050908J97501K39425K63397K50570L27499L81508M72860N41454O58360Q13091
8876F196573J090733J501196J926142K422294L005828L549143M132061M879259
8868B8703229O066182P763866J0319289J4446903K0211867K5645652K7893378
8861A41050366K3037144N790877j8237209l3957814l5012906k5736923j6238218
8854D0695317j0089993o472914m353920l038300k203610j670348j234823q85780
8846A0745629o60442n43876m75060m39983l65062j98372n6583N4920K06455L15321
8836H582947N06081O65159Q53115J104224J384428J892331K563788L402755M399578
8827B5354406N512408O702573P837939R222371J1449946J4612047J9141820K6989358
$$ plain form
8819 126822868 165866402 217136044 275340635 327799920 347066636 313004903 242042557
8812 242042557 166449982 111559080 77646788 56934267 43782331 35013996 28899858
8805 28899858 24405029 21006938 18503109 16714820 15387128 14210361 12989587 11759841
8797 11759841 10646278 9779328 9195497 8784485 8463466 8321758 8299328 8386735 8593565 8997048
8787 8997048 9504861 10237667 11312352 12787555 14771634 17325027 20551544 24398142 28939197
8778 28939197 34470252 41481941 50564882 62992731 80548654 103537465 129680030 153678020
8770 153678020 164896959 153327067 123052986 87607619 59471022 41273730 30026752
8763 30026752 22913615 18196219 14907989 12495893 10670502 9311330 8303629 7537990
$$ packed form
8819A26822868L9043534N1269642N8204591N2459285J9266716l4061733p0962346
8812B42042557p5592575n4890902l3912292k0712521j3151936q768335o114138
8805B8899858m494829l398091k503829j788289j327692j176767j220774j229746
8797A1759841j113563q66950n83831m11012l21019j41708k2430Q7407K06830M03483
8787H997048N07813P32806J074685J475203J984079K553393L226517L846598M541055
8778B8939197N531055P011689R082941J2427849J7555923K2988811K6142565K3997990
8770A53678020J1218939j1569892l0274081l5445367k8136597j8197292j1246978
8763C0026752p113137m717396l288230k412096j825391j359172j007701p65639
$$ plain form
8755 7537990 6852318 6202219 5513862 4870022 4347874 3959433 3659880 3405568 3172450 2990779
8745 2990779 2841264 2653540 2487439 2388758 2333224 2241909 2107213 2006513 1942981 1883280
8735 1883280 1833154 1806475 1794874 1744791 1661616 1577632 1508592 1492986 1456379 1375447 1314354
8724 1314354 1260985 1168218 1108426 1085520 1031371 987683 973648 964079 933202 906738 911589 884838
8712 884838 846382 815700 791345 800730 803673 827552 870673 886016 892605 909267 958415 968446
8700 968446 922470 918952 936537 969644 926804 911240 951306 973087 908767 840966 821842 803606
8688 803606 787546 809846 838825 838949 770826 751742 754555 729539 665094 618462 562824 549530
8676 549530 519475 519381 530810 520524 493570 495633 496983 503824 527955 519823 503555 508890 491664
$$ packed form
8755G537990o85672o50099o88357o43840n22148l88441k99553k54312k33118j81671
8745B990779j49515j87724j66101r8681n5534r1315j34696j00700o3532n9701
8735A883280n0126k6679j1601n0083q3175q3984o9040j5606l6607q0932o1093
8724A314354n3369r2767n9792k2906n4149m3688j4035r569l0877k6464M851k6751
8712H84838l8456l0682k4355R385K943K3879M3121J5343O589J6662M9148J0031
8700I68446m5976l518J7585L3107m2840j5564M0066K1781o4320o7801j9124j8236
8688H03606j6060K2300K8979J24o8123j9084K813k5016o4445m6632n5638j3294
8676E49530l0055r4J1429j0286k6954K063J350O841K4131q132j6268N335j7226
$$ plain form
8663 491664 503481 506811 502401 514033 539449 543800 572786 543303 526034 491340 498607 508190 543435
8650 543435 593180 582772 591127 619316 626144 580227 536255 529145 576028 567023 539806 542002 553230
8637 553230 544558 524979 507710 474740 480108 486381 472166 494124 514002 499046 472717 444842
8625 444842 464520 445367 438263 459035 471507 447542 417806 398025 406250 432565 421787 445873
8613 445873 509885 515279 493588 532440 620532 661700 641956 610663 638119 669374 679878 676908
8601 676908 685921 719967 789175 853574 938159 1005289 1048503 1082274 1159838 1239571 1312388 1383703
8589 1383703 1454908 1551637 1630241 1648423 1677062 1691408 1644317 1558967 1448235 1345302 1190532
8578 1190532 1007762 878155 777377 669025 573957 541663 508851 475558 426976 386443 405004
$$ packed form
8663D91664J1817L330m410J1632K5416M351K8986k9483j7269l4694P267R583L5245
8650E43435M9745j0408Q355K8189O828m5917m3972p110M6883r005k7217K196J1228
8637E53230q672j9579j7269l2970N368O273j4215K1958J9878j4956k6329k7875
8625D44842J9678j9153p104K0772J2472k3965k9736j9781Q225K6315j0778K4086
8613D45873O4012N394k1691L8852Q8092M1168j9744l1293K7456L1255J0504k970
8601F76908R013L4046O9208O4399Q4585O7130M3214L3771P7564P9733P2817P1315
8589A383703P1205R6729P8604J8182K8639J4346m7091q5350j10732j02933j54770
8578A190532j82770j29607j00778j08352r5068l2294l2812l3293m8582m0533J8561
$$ plain form
8567 405004 423391 404379 421823 437409 452765 444083 437325 460014 473284 424181 349288 319046
8555 319046 298512 299661 283278 292989 380585 400866 359161 315584 307392 304697 320732 293237
8543 293237 300105 288307 247986 252274 262030 262568 245910 245592 275166 257803 245397 237143 270414
8530 270414 258615 197178 171569 166711 177385 174999 183012 208251 232856 201021 150822 177382
8518 177382 209584 257066 259310 267092 267376 262240 253891 251591 245230 228604 225595 220608 213295 163372
8504 163372 152726 153089 154733 144284 204961 206411 217265 193036 140948 106477 94191 95111 87303
8491 87303 129439 157392 146738 135393 145681 132016 137674 148292 151179 117417 119741 124854 163719
8478 163719 173247 194643 212654 213385 195142 180201 219626 231388 184854 196887 218490 218121 213353
$$ packed form
8567D05004J8387j9012J7444J5586J5356q682o758K2689J3270m9103p4893l0242
8555C19046k0534J149j6383R711Q7596K0281m1705m3577q192k695J6035k7495
8543B93237O868j1798m0321M288R756N38j6658l18K9574j7363j2406q254L3271
8530B70414j1799o1437k5609m858J0674k386Q013K5239K4605l1835n0199K6560
8518A77382L2202M7482K244P782K84n136q349k300o361j6626l009m987p313m9923
8504A63372j0646L63J644j0449O0677J450J0854k4229n2088l4471j2286R20p808
8491H7303M2136K7953j0654j1345J0288j3665N658J0618K887l3762K324N113L8865
8478A63719R528K1396J8011P31j8243j4941L9425J1762m6534J2033K1603l69m768
$$ plain form
8465 213353 210134 251491 316520 356398 431555 492656 594817 748196 890725 1011175 1002454
8454 1002454 893326 689870 470842 323370 249113 240907 212474 203235 206965 194585 165854
8443 165854 167171 186037 181848 154956 126919 88626 74412 78449 108950 133326 174632 195276
8431 195276 180659 163695 130137 140381 155952 168692 215732 220917 208252 242118 299179 351715
8419 351715 414396 494802 571528 646003 814186 1049988 1311548 1622251 1880955 1930258 1738205
8408 1738205 1349702 976447 731108 566183 431836 333915 268299 209749 190019 185096 163637
8397 163637 148693 149501 160447 166800 153675 138146 125298 101639 124393 128300 103926 92226
8385 92226 89337 84822 85173 101123 116623 71606 96828 116861 148657 181953 191628 221499 260749
$$ packed form
8465B13353l219M1357O5029L9878P5157O1101J02161J53379J42529J20450q721
8454A002454j09128k03456k19028j47472p4257q206k8433r239L730j2380k8731
8443A65854J317J8866m189k6892k8037l8293j4214M037L0501K4376M1306K0644
8431A95276j4617j6964l3558J0244J5571J2740M7040N185j2665L3866N7061N2536
8419C51715O2681Q0406P6726P4475J68183K35802K61560L10703K58704M9303j92053
8408A738205l88503l73255k45339j64925j34347r7921o5616n8550j9730m923k1459
8397A63637j4944Q08J0946O353j3125j5529j2848k3659K2754L907k4374j1700
8385I2226k889m515L51J5950J5500m5017K5222K0033L1796L3296R675K9871L9250
$$ plain form
8372 260749 335592 378549 425010 525351 628919 746792 908082 956712 865803 740307 583845
8361 583845 454257 346384 276124 191908 123748 109131 153605 182141 181677 160727 141345 159595
8349 159595 181742 149862 145859 119057 131034 147614 136619 97658 96292 116011 139023 120636
8337 120636 85167 76849 64692 59711 33603 71928 86778 71780 117453 142469 118700 93791
8325 93791 92087 107357 147635 122580 73692 60006 62212 53696 75110 75543 76784 53921 63322
8312 63322 121872 107563 78290 62097 73919 39525 48415 40765 28798 100842 127664 103971
8300 103971 139768 169572 168683 147940 151330 162802 152829 106866 74519 111494 122933 133334
8288 133334 122030 83852 78762 58720 65555 79244 62984 68664 70701 68106 45685 49790 24814
$$ packed form
8372B60749P4843M2957M6461J00341J03568J17873J61290M8630r0909j25496j56462
8361E83845j29588j07873p0260q4216o8160j4617M4474K8536m64k0950j9382J8250
8349A59595K2147l1880m003k6802J1977J6580j0995l8961j366J9719K3012j8387
8337A20636l5469q318j2157m981k6108L8325J4850j4998M5673K5016k3769k4909
8325I3791j704J5270M0278k5055m8888j3686K206q516K1414M33J241k2863R401
8312F3322N8550j4309k9273j6193J1822l4394Q890p650j1967P2044K6822k3693
8300A03971L5797K9804q89k0743L390J1472r973m5963l2347L6975J1439J0401
8288A33334j1304l8178n090k0042O835J3689j6260N680K037k595k2421M105k4976
$$ plain form
8275 24814 30451 61392 76467 101635 90236 30663 4133 4605 16350 30263 50754 77902
8263 77902 44403 63588 50080 46904 40878 20528 10598 37469 62227 88702 119982 97535
8251 97535 111843 132579 92331 49599 33359 76065 96325 73840 62053 71346 65262 68688
8239 68688 53822 41276 39759 39455 35299 17006 26300 42426 54221 41147 67391 27057 -4622
8226 -4622 222 47297 72812 89092 70131 51540 64408 52991 55796 50778 54099 59775 62206
8213 62206 52275 48987 -6105 -29037 -17039 4470 -26448 -59592 -3589 1147 -37460 -30032 -6604
8200 -6604 52089 91122 47590 46928 74857 80522 69303 21688 21593 38245 38294 -2049 -12960 -17550
8186 -17550 -22028 -30452 -27276 -44223 -51124 -28292 19893 11956 -2203 -10562 -5037 -6830 1822 24082
$$ packed form
8275B4814N637L0941J5075K5168j1399n9573k6530M72J1745J3913K0491K7148
8263G7902l3499J9185j3508l176o026k0350r930K6871K4758K6475L1280k2447
8251I7535J4308K0736m0248m2732j6240M2706K0260k2485j1787R293o084L426
8239F8688j4866j2546j517l04m156j8293R294J6126J1795j3074K6244m0334l1679
8226d622M844M7075K5515J6280j8961j8591J2868j1417K805n018L321N676K431
8213F2206r931l288n5092k2932J1998K1509l0918l3144N6003M736l8607P428K3428
8200f604N8693L9033m3532o62K7929N665j1219m7615r5J6652M9m0343j0911m590
8186a7550m478q424L176j6947o901K2832M8185p937j4159q359N525j793Q652K2260
$$ plain form
8172 24082 26975 51679 36048 41302 32132 66472 80230 111373 127749 130886 141493 126926 113295
8159 113295 90219 54033 86679 87647 87228 94985 90942 74978 103352 79775 71985 68824 85527
8146 85527 89419 53598 35668 69691 62490 51313 56402 32372 65479 129039 154104 156840 88754
8133 88754 55184 53946 71063 59087 75908 74776 41598 28437 29381 53261 88563 81862 70505
8120 70505 72879 74971 68143 76154 117522 142309 128247 76091 86619 156483 182989 120928 93717
8107 93717 71535 41595 39198 46368 46330 46925 68899 84098 112049 103913 81024 67910 70799 9776
8093 9776 20119 27746 39191 29441 40091 60406 44776 22665 37450 59284 82244 75659 46994
8080 46994 53650 78874 118638 87970 74076 93622 112904 119135 135733 101847 104675 96660 124967
$$ packed form
8172B4082K893K4704j5631N254r170L4340J3758L1143J6376L137J0607j4567j3631
8159A13295k3076l6186L2646R68m19P757m043j5964K8374k3577p790l161J6703
8146H5527L892l5821j7930L4023p201j1177N089k4030L3107O3560K5065K736o8086
8133H8754l3570j238J7117j1976J6821j132l3178j3161R44K3880L5302o701j1357
8120G0505K374K092o828Q011M1368K4787j4062n2156J0528O9864K6506o2061k7211
8107I3717k2182k9940k397P170l8N95K1974J5199K7951q136k2889j3114K889o1023
8093I776J0343P627J1445r750J0650K0315j5630k2111J4785K1834K2960o585k8665
8080D6994O656K5224L9764l0668j3894J9546J9282O231J6598l3886K828q015K8307
$$ plain form
8067 124967 112045 108344 122309 126956 98514 103084 113208 152512 184441 166247 171804 210197
8055 210197 170332 127670 103537 117928 135883 108344 92479 78796 65912 77383 90857 106331
8043 106331 124475 98056 102522 101268 131814 87753 94830 99531 100904 98805 91407 57574 64859
8030 64859 98240 148087 159264 206837 183274 175372 153831 155910 185448 214608 199368 220131
8018 220131 220086 193677 146271 187833 219427 195141 184528 191324 201923 189343 174073 141018
8006 141018 160637 193553 189060 184308 210528 230314 216925 224696 257102 298602 280186 267335
7994 267335 248620 253660 269505 286597 291526 261328 262475 247928 231338 236503 210393 190528
7982 190528 194021 206140 189395 190439 183305 169187 149975 144961 117362 136914 204738 274300
$$ packed form
8067A24967j2922l701J3965M647k8442M570J0124L9304L1929j8194N557L8393
8055B10197l9865m2662k4133J4391J7955k7539j5865j3683j2884J1471J3474J5474
8043A06331J8144k6419M466j254L0546m4061P077M701J373k099p398l3833P285
8030F4859L3381M9847J1177M7573k3563p902k1541K079K9538K9160j5240K0763
8018B20131m5k6409m7406M1562L1594k4286j0613O796J0599j2580j5270l3055
8006A41018J9619L2916m493m752K6220J9786j3389P771L2406M1500j8416j2851
7994B67335j8715N040J5845J7092M929l0198J147j4547j6590N165k6110j9865
7982A90528L493J2119j6745J044p134j4118j9212n014k7599J9552O7824O9562
$$ plain form
7970 274300 262101 229394 197439 166287 176676 171596 172331 159503 128111 132532 162776 173622
7958 173622 169700 201042 233766 255168 253218 274436 269526 232175 217597 233798 258222 259414
7946 259414 254955 267391 267322 226477 179464 177588 205239 171206 134524 132664 136752 122127 129727
7933 129727 155638 180967 169481 150056 138509 145188 146673 150480 169239 153177 152540 123087 113301
7920 113301 106161 96390 107517 132751 158400 167461 163803 159353 142152 119274 122409 123234 125209
7907 125209 171158 210183 190388 162872 110776 82041 99255 100069 134948 182701 208390 174560
7895 174560 143305 115128 104347 94282 86777 79026 52761 66280 50389 69882 68363 64675
7883 64675 51341 40816 25205 19120 27701 43032 79465 85464 47450 36375 43853 21666 21271
$$ packed form
7970B74300j2199l2707l1955l1152J0389n080P35j2828l1392M421L0244J0846
7958A73622l922L1342L2724K1402j950K1218m910l7351j4578J6201K4424J192
7946B59414m459J2436o9m0845m7013j876K7651l4033l6682j860M088j4625P600
7933A29727K5911K5329j1486j9425j1547O679J485L807J8759j6062o37k9453r786
7920A13301p140r771J1127K5234K5649R061l658m450j7201k2878L135Q25J975
7907A25209M5949L9025j9795k7516n2096k8735J7214Q14L4879M7753K5689l3830
7895A74560l1255k8177j0781j0065p505p751k6265J3519j5891J9493j519l688
7883F4675j3334j0525j5611o085Q581J5331L6433N999l8014j1075P478k2187l95
$$ plain form
7870 21271 58180 103643 103561 95114 61038 75389 76380 76932 74574 62270 53452 41389 51339 31670
7856 31670 12335 6218 33277 98735 81612 60922 62838 73268 50388 41092 36711 47781 57753
7843 57753 53159 51291 44165 43427 39473 67144 33111 22797 43434 25776 4336 5585 28724
7830 28724 49079 29040 50215 56477 31615 -889 -563 7661 16272 -9620 -51681 -45528 -28960
7817 -28960 -6515 28335 41739 18539 45104 30699 25410 30520 6531 7054 49442 55351 30796
7804 30796 14059 47315 80279 68998 86061 91922 116233 79216 46366 54322 16733 -16420
7792 -16420 9581 8833 9617 22978 8295 -41584 -21252 -16932 -45700 -13946 10228 -7571 -16057
7779 -16057 9832 18420 20768 20720 12630 14465 32432 22061 -5573 21548 42626 53923 35422
$$ packed form
7870B1271L6909M5463q2q447l4076J4351R91N52k358j2304q818j2063R950j9669
7856C1670j9335o117K7059O5458j7123k0690J916J0430k2880r296m381J1070R972
7843E7753m594j868p126p38l954K7671l4033j0314K0637j7658k1440J249K3139
7830B8724K0355k0039K1175O262k4862l2504L26Q224Q611k5892m2061O153J6568
7817b8960K2445L4850J3404k3200K6565j4405n289N110k3989N23M2388N909k4555
7804C0796j6737L3256L2964j1281J7063N861K4311l7017l2850P956l7589l3153
7792a6420K6001p48P84J3361j4683m9879K0332M320k8768L1754K4174j7799q486
7779a6057K5889Q588K348m8q090J835J7967j0371k7634K7121K1078J1297j8501
$$ plain form
7766 35422 45342 65518 16300 13196 20579 6306 12099 41854 68257 110397 115006 60789 60580
7753 60580 62040 61160 75565 56842 51665 23095 28514 27393 11004 11704 20425 8304 8013 -11128
7739 -11128 -67849 -67184 -37594 -28593 -22505 -31577 -47284 -41462 -7979 35877 46518 48521 59270
7726 59270 62328 59579 29230 42598 27330 34218 40596 20118 12444 24601 17534 -13598 -20286
7713 -20286 2459 31518 20348 -29744 -30910 14179 32090 5394 4217 36263 76180 118521
7701 118521 75801 32834 14907 875 9397 14986 30379 31680 46876 13290 10617 57753
7689 57753 47863 18244 3765 -8436 -35881 -30925 -22418 1984 -11356 32377 82370 80055 72234
7676 72234 22341 5823 -22970 -12869 -16437 -30052 -31877 -15052 -43978 -71683 -39140 -28688
$$ packed form
7766C5422R920K0176m9218l104P383j4273N793K9755K6403M2140M609n4217k09
7753F0580J460q80J4405j8723n177k8570N419j121j6389P00Q721j2121k91j9141
7739a1128n6721O65K9590R001O088r072j5707N822L3483M3856J0641K003J0749
7726E9270L058k749l0349J3368j5268O888O378k0478p674J2157p067l1132o688
7713b0286K2745K9059j1170n0092j166M5089J7911k6696j177L2046L9917M2341
7701A18521m2720m2967j7927j4032Q522N589J5393J301J5196l3586k673M7136
7689E7753r890k9619j4479j2201k7445M956Q507K4402j3340M3733M9993k315p821
7676G2234m9893j6518k8793J0101l568j3615j825J6825k8926k7705L2543J0452
$$ plain form
7664 -28688 -43305 -16091 24568 47879 61304 74242 37636 32662 -3404 -14530 -49452 -18687
7652 -18687 38243 22800 -9837 1091 34339 47164 19803 2389 35601 38700 49071 9400
7640 9400 -16512 -11984 -22517 -32167 9596 33956 44728 6444 -47361 -50843 1241 33324 64329
7627 64329 51857 22415 60689 88439 43941 29030 23474 44071 66175 48315 57851 50500
7615 50500 15836 37204 -5041 -19768 9607 8829 -12857 -34110 -30451 4151 9505 23868 3952
7602 3952 -11221 16087 18947 1756 7401 8630 -344 -26978 -25133 -26768 -54468 -22919 8639
7589 8639 367 15612 22202 34395 11603 -12249 -9448 -20959 -43476 -72524 -55098 -17056 12145
7576 12145 26361 25988 -22230 -63264 -64607 -37367 -25678 -8767 12608 3133 28973 -15382 -35256
$$ packed form
7664b8688j4617K7214M0659K3311J3425J2938l6606m974l6066j1126l4922L0765
7652a8687N6930j5443l2637J0928L3248J2825k7361j7414L3212L099J0371l9671
7640I400k5912M528j0533r650M1763K4360J0772l8284n3805l482N2084L2083L1005
7627F4329j2472k9442L8274K7750m4498j4911n556K0597K2104j7860R536p351
7615E0500l4664K1368m2245j4727K9375p78k1686k1253L659L4602N354J4363j9916
7602C952j5173K7308K860j7191N645J229q974k6634J845j635k7700L1549L1558
7589H639q272J5245O590J2193k2792k3852K801j1511k2517k9048J7426L8042K9201
7576A2145J4216l73m8218m1034j343K7240J1689J6911K1375r475K5840m4355j9874
$$ plain form
7563 -35256 -25567 -12106 42706 69461 75426 38475 21487 26127 19228 1967 3661 10019 5270
7550 5270 24162 50326 30118 4721 -16706 13306 72651 72075 47678 50213 36275 -24681 -31126
7537 -31126 -30475 -2525 12979 24838 13317 21895 12320 19218 11629 -45494 -49250 -51117 -48070 -34177
7523 -34177 -6462 -2151 1089 18034 16984 -3704 -20120 -8956 -43674 -70635 -58475 -68324 -55799
7510 -55799 10589 51968 33706 30869 39626 44407 42916 28052 17536 -419 -13271 -6621 -8254
7497 -8254 4430 -34901 -50488 -50859 -75676 -66380 -55198 -41476 -23980 -56488 -62862 -64445 -61649
7484 -61649 -53407 -25002 -10241 -9021 1029 2337 -31641 -80208 -86422 -40196 -25399 -8331 1493
7471 1493 27489 45911 63354 53695 63990 58834 35640 17970 20476 37885 21722 14160 6630
$$ packed form
7563c5256R689J3461N4812K6755N965l6951j6988M640o899j7261J694O358m749
7550E270J8892K6164k0208k5397k1427L0012N9345n76k4397K535j3938o0956o445
7537c1126O51K7950J5504J1859j1521Q578r575O898p589n7123l756j867L047J3893
7523c4177K7715M311L240J6945j050k0688j6416J1164l4718k6961J2160r849J2525
7510e5799O6388M1379j8262k837Q757M781j491j4864j0516j7955j2852O650j633
7497h254J2684l9331j5587l71k4817R296J1182J3722J7496l2508o374j583K796
7484f1649Q242K8405J4761J220J0050J308l3978m8567o214M6226J4797J7068R824
7471A493K5996J8422J7443r659J0295n156k3194j7670K506J7409j6163p562p530
$$ plain form
7458 6630 -16480 -32699 -36054 -61442 -56228 -60489 -56809 -19651 -18406 -44583 -35544 -32679 -41939 -40900
7444 -40900 -31542 6944 68939 58702 5630 841 9653 -18906 -34337 -14602 17013 -15470
7432 -15470 -15911 1632 8353 9572 -21802 -18892 27221 30249 9058 30359 43271 59150 60273
7419 60273 25142 -6434 29997 61023 28766 -19027 -34045 -26210 -12262 7592 7378 18297
7407 18297 7961 -7031 -528 -13844 -26736 -34646 -47112 -26799 -25630 -47792 -69117 -96494
7395 -96494 -76860 -57573 -48441 5787 13654 -5308 -41116 -36615 -35787 -52658 -39558 -28711 -12148
7382 -12148 -4901 -14523 -47152 -23031 -333 -5491 606 9740 36197 22997 25482 5376 12635
7369 12635 22551 855 -33793 -38125 -27567 -26093 -18319 -9978 -35502 -73459 -70826 -73128 -72547 -60286
$$ packed form
7458F630k3110j6219l355k5388N214m261L680L7158J245k6177R039K865r260J039
7444d0900R358L8486O1995j0237n3072m789Q812k8559j5431J9735L1615l2483
7432a5470m41J7543O721J219l1374K910M6113L028k1191K1301J2912J5879J123
7419F0273l5131l1576L6431L1026l2257m7793j5018P835J3948J9854k14J0919
7407A8297j0336j4992O503j3316j2892p910j2466K0313J169k2162k1325k7377
7395i6494J9634J9287R132N4228P867j8962l5808M501Q28j6871J3100J0847J6563
7382a2148P247r622l2629K4121K2698n158O097R134K6457j3200K485k0106P259
7369A2635R916k1696l4648m332J0558J474P774Q341k5524l7957K633k302N81J2261
$$ plain form
7355 -60286 -3848 29353 49044 47721 13375 5885 11997 4361 13840 579 -31045 -2287 48195
7342 48195 53665 63089 51590 37877 35497 36671 17784 -16372 10433 42174 28623 39585 24321
7329 24321 -4918 -15377 -20839 -46089 -54327 -29747 -29288 -40197 -55185 -46486 -28552 -45010 -23615
7316 -23615 27125 49357 44164 31459 20742 11434 2892 22750 -12600 -32180 7208 26195
7304 26195 27033 29247 12287 -27716 -66575 -44261 9731 26243 48239 40969 10460 -26426 2740
7291 2740 -1904 -7564 1664 51957 62019 87664 61968 45580 27046 16233 10547 -18682 11678
7278 11678 51594 56983 53134 41343 11645 191 9150 16744 33217 13606 -18083 -62341 -80465
7265 -80465 -58360 -38358 -45181 -23913 -23324 -17183 22940 29410 -17789 -25535 -58324 -59264 -7827
$$ packed form
7355f0286N6438L3201J9691j323l4346p490O112p636R479j3261l1624K8758N0482
7342D8195N470R424j1499j3713k380J174j8887l4156K6805L1741j3551J0962j5264
7329B4321k9239j0459n462k5250q238K4580M59j0909j4988Q699J7934j6458K1395
7316b3615N0740K2232n193j2705j0717r308q542J9858l5350j9580L9388J8987
7304B6195Q38K214j6960m0003l8859K2314N3992J6512K1996p270l0509l6886K9166
7291B740m644n660R228N0293J0062K5645k5696j6388j8534j0813n686k9229L0360
7278A1678L9916N389l849j1791k9698j1454Q959P594J6473j9611l1689m4258j8124
7265h0465K2105K0002o823K1268N89O141M0123O470m7199p746l2789r40N1437
$$ plain form
7252 -7827 -22869 2599 14364 -17953 -70618 -58707 -34911 -33105 -33493 -54459 -14863 29858 40255
7239 40255 13878 -22167 -62682 -47152 -41620 -35402 -44246 -53711 -39307 -46257 -66215 -73445 -67844
7226 -67844 -51485 -47379 -45910 -2312 1689 -42985 -27289 -7686 -57622 -63679 -68192 -48000 -2606
7213 -2606 57177 58858 106226 109333 34635 12404 42705 41369 32377 5225 20576 39416 16801
7200 16801 -14983 43108 56611 45793 40475 36819 5944 1489 4196 -31170 -56811 -65446 -56528
7187 -56528 -72200 -43501 -14073 -35837 -49268 16824 59094 40960 22681 14369 13568 -36889
7175 -36889 -50150 -6982 -26386 -27463 -18233 21866 35653 -4764 -41658 -31852 -34130 -59191 -49214
7162 -49214 -28563 -49108 -25473 -21771 -30702 -24255 -47719 -66363 -50303 -23177 -12250 -1131
$$ packed form
7252g827j5042K5468J1765l2317n2665J1911K3796J806l88k0966L9596M4721J0397
7239D0255k6377l6045m0515J5530N532O218q844r465J4404o950j9958p230N601
7226f7844J6359M106J469M3598M001m4674J5696J9603m9936o057m513K0192M5394
7213b606N9783J681M7368L107p4698k2231L0301j336q992k7152J5351J8840k2615
7200A6801l1784N8091J3503j0818n318l656l0875m455K707l5366k5641q635Q918
7187e6528j5672K8699K9428k1764j3431O6092M2270j8134j8279q312q01n0457
7175c6889j3261M3168j9404j077R230M0099J3787m0417l6894R806k278k5061R977
7162d9214K0651k0545K3635L702q931O447k3464j8644J6060K7126J0927J1119
$$ plain form
7150 -1131 -4374 -39834 -17211 -3197 41369 13680 -875 -6487 -8902 -17183 -35648 -32837 -56367
7137 -56367 -69107 -34463 2230 -14961 4930 7257 -14325 -8035 14115 -5145 -2192 -17065
7125 -17065 577 8546 -7766 -8506 23134 23178 17853 17626 25294 22201 -15059 -19673 -27141 -6811
7111 -6811 12824 7843 -9693 -43945 -33288 19721 34472 35002 60603 52747 -16490 -32615 -5411
7098 -5411 31310 31179 20420 11225 20479 14271 -9681 8337 38056 31672 35593 25742 1795 -10160
7084 -10160 -5016 -18747 -50583 -49153 -28205 11200 -7839 -6978 -645 -26922 -40737 -10585 30178
7071 30178 15182 1706 -25607 -41527 -40317 -2880 9923 32178 6695 -6945 17889 51334
7059 51334 67394 42290 5671 49391 32048 32415 34572 43323 29268 13603 -12219 -14353 -8069
$$ packed form
7150a131l243l5460K2623J4014M4566k7689j4555n612k415q281j8465K811k3530
7137e6367j2740L4644L6693j7191J9891K327k1582O290K2150j9260K953j4873
7125a7065J7642P969j6312p40L1640M4n325k27P668l093l7260m614p468K0330
7111f811J9635m981j7536l4252J0657N3009J4751N30K5601p856o9237j6125K7204
7098e411L6721j31j0759r195R254o208k3952J8018K9719o384L921r851k3947j1955
7084a0160N144j3731l1836J430K0948L9405j9039Q61O333k6277j3815L0152M0763
7071C0178j4996j3476k7313j5920J210L7437J2803K2255k5483j3640K4834L3445
7059E1334J6060k5104l6619M3720j7343L67K157Q751j4055j5665k5822k134O284
$$ plain form
7046 -8069 -9964 -24213 -1492 8661 3356 -14874 42946 44397 26447 29023 833 -20849 -20431
7033 -20431 -51594 -35729 -15991 -20888 32826 57252 79128 63029 59187 77335 68720 27217
7021 27217 -17227 -34446 -38300 -22775 -13950 -12049 -29848 -46746 -26466 -42715 -50315 -43014 -66485
7008 -66485 -51146 -22362 -38878 8656 16031 -27079 -39861 -25458 -20337 -16345 7541 -2915
6996 -2915 -36440 -42033 18345 38770 33849 24036 9999 3819 9757 -517 8393 21477 -14725
6983 -14725 -17143 -22205 6964 18261 18283 -11242 -36114 -52783 -37759 -13287 4766 -8439 21830
6970 21830 33034 -13359 -51446 -31760 -19559 -20778 -42681 -23055 -1686 30836 -948 -47629
6958 -47629 -34502 24136 12142 -27203 -42633 -92953 -93961 -57717 -31725 -23243 9110 3436
$$ packed form
7046h069j895j4249K2721J0153n305j8230N7820J451j7950K576k8190k1682M18
7033b0431l1163J5865J9738m897N3714K4426K1876j6099l842J8148q615m1503
7021B7217m4444j7219l854J5525Q825J901j7799j6898K0280j6249p600P301k3471
7008f6485J5339K8784j6516M7534P375m3110j2782J4403N121L992K3886j0456
6996b915l3525n593O0378K0425m921r813j4037o180N938j0274Q910J3084l6202
6983a4725k418n062K9169J1297K2k9525k4872j6669J5024K4472J8053j3205L0269
6970B1830J1204m6393l8087J9686J2201j219k1903J9626K1369L2522l1784m6681
6958d7629J3127N8638j1994l9345j5430n0320j008L6244K5992Q482L2353n674
$$ plain form
6946 3436 -27343 -12393 33552 36977 56279 58889 46629 18164 -8234 -50314 -32269 -5798
6934 -5798 11236 -12516 -10939 -28039 -54290 -78265 -61704 -22565 7477 28761 -2185 -28715
6922 -28715 -34389 -26659 -26010 -14611 -26550 -17174 -19406 13708 9475 -1911 -15816 -8117 -8130 -629
6908 -629 -13490 -36254 -37152 837 24044 1593 -28485 -34523 -7265 17618 36825 58503 66248
6895 66248 40082 57505 73079 64032 4392 -9827 -27495 -59493 -79512 -41377 -29056 235
6883 235 12174 -26217 -57868 -17230 13168 7149 -4878 18244 12447 4983 -6171 11091 25009
6870 25009 -24748 -26064 -10954 3561 -9974 -32027 -10387 628 -5201 -1627 22146 37167
6858 37167 13434 -14949 -385 -37715 -51011 -54211 -45223 -35720 -15404 3355 -17928 -42841
$$ packed form
6946C436l0779J4950M5945L425J9302K610j2260k8465k6398m2080J8045K6471
6934e798J7034k3752J577j7100k6251k3975J6561L9139L0042K1284l0946k6530
6922b8715n674P730O49J1399j1939R376k232L3114m233j1386j3905P699j3P501
6908f29j2861k2764q98L7989K3207k2451l0078o038K7258K4883J9207K1678P745
6895F6248k6166J7423J5574r047n9640j4219j7668l1998k0019L8135J2321K9291
6883B35J1939l8391l1651M0638L0398o019j2027K3122n797p464j1154J7262J3918
6870B5009m9757j316J5110J4515j3535k2053K1640J1015n829L574K3773J5021
6858C7167k3733k8383J4564l7330j3296l200Q988R503K0316J8759k1283k4913
$$ plain form
6846 -42841 -46368 -101940 -115220 -90279 -45197 -39128 -25315 28577 17241 44997 64555 77355
6834 77355 81109 55983 16156 40919 20244 14644 -17115 -40261 -36166 7238 37294 27130
6822 27130 10258 -27178 -13497 -5463 7784 8255 -2503 2896 -515 -28632 -54070 -33306 -20926
6809 -20926 -3770 -45749 -63921 -52321 -45277 -15903 23464 59474 41492 33336 56950 39202
6797 39202 68613 68118 60589 41320 15979 -42576 -34450 -22527 -18773 -45458 -20784 9217 24133
6784 24133 3680 9988 -1183 -29880 -61507 -52626 -69083 -45379 -4718 -40177 -59218 -68659
6772 -68659 -82105 -54454 -22712 -913 9840 -5820 -9258 28697 16498 15187 30385 11488
6760 11488 -2761 -28795 -74880 -88837 -80480 -9261 -9256 4976 10720 -3015 -1786 -12218 36133
$$ packed form
6846d2841l527n5572j3280K4941M5082O069J3813N3892j1336K7756J9558J2800
6834G7355L754k5126l9827K4763k0675n600l1759k3146M095M3404L0056j0164
6822B7130j6872l7436J3681Q034J3247M71j0758N399l411k8117k5438K0764J2380
6809b0926J7156m1979j8172J1600P044K9374L9367L6010j7982q156K3614j7748
6797C9202K9411m95p529j9269k5341n8555Q126J1923L754k6685K4674L0001J4916
6784B4133k0453O308j1171k8697l1627Q881j6457K3704M0661l5459j9041r441
6772f8659j3446K7651L1742K1799J0753j5660l438L7955j2199j311J5198j8897
6760A1488j4249k6034m6085j3957Q357P1219NJ4232N744j3735J229j0432M8351
$$ plain form
6747 36133 48197 35847 48582 26897 13853 32390 65405 27048 -31703 -15681 14281 -105
6735 -105 -12958 13631 41725 30195 7351 25212 -17983 12705 58778 74028 90660 139665
6723 139665 148414 171556 231554 310747 414502 558115 760593 939723 1076913 1121149 1030825
6712 1030825 830830 592977 396874 248998 148505 118497 83761 43896 26913 41943
6702 41943 19132 46285 43751 63788 66432 74433 46564 1045 37128 45304 53789 51897 71174
6689 71174 47925 46582 27566 -12938 -26153 -17162 -11129 -11460 -23937 7316 -7989 -36703 -37658
6676 -37658 -53147 -55257 -50478 -7225 13796 39724 41831 33940 -3203 -45369 -47457 -49728 -19673
6663 -19673 10134 13528 12985 -2739 -37459 -25379 -16547 29378 33344 37435 35264 25844 12407
$$ packed form
6747C6133J2064j2350J2735k1685j3044J8537L3015l8357n8751J6022K9962j4386
6735a05j2853K6589K8094j1530k2844J7861m3195L0688M6073J5250J6632M9005
6723A39665Q749K3142N9998P9193J03755J43613K02478J79130J37190M4236r0324
6712A030825j99995k37853j96103j47876j00493l0008l4736l9865j6983J5030
6702D1943k2811K7153k534K0037K644Q001k7869m5519L6083Q176Q485j892J9277
6689G1174k3249j343j9016m0504j3215Q991O033l31j2477L1253j5305k8714r55
6676c7658j5489k110M779M3253K1021K5928K107p891l7143m2166k088k271L0055
6663a9673K9807L394n43j5724l4720J2080Q832M5925L966M091k171r420j3437
$$ plain form
6650 12407 119 -18873 -23037 -16839 19189 -4499 -2166 -9782 -44682 -38030 18655 36440 48865
6637 48865 41217 35566 52810 36578 -5752 9557 46546 25595 7634 -9312 -19073 -35667
6625 -35667 -41237 -24547 -29331 -35624 1848 -3899 -23538 -22368 -22035 -8706 13662 58814 24684
6612 24684 5396 -10037 -15869 -27730 -21398 -16844 -3136 21695 27732 21566 14582 21143 -7973
6599 -7973 -14193 -18488 -21162 -2891 -8333 -5876 3512 -12184 -23119 -19801 -34654 -35089 -55901 -47808
6585 -47808 -29612 -10015 -27238 -2636 -5965 -32696 -77320 -107689 -122142 -57041 -21865 -29477
6573 -29477 -59726 -45854 -11129 15651 21819 -8209 -25157 116 -12898 -24443 17847 23224
6561 23224 45015 29155 -10543 -36410 -28689 -9666 -2582 42621 66833 21383 10988 17661
$$ packed form
6650A2407j2288j8992m164O198L6028k3688K333p616l4900O652N6685J7785J2425
6637D8865p648n651J7244j6232m2330J5309L6989k0951j7961j6946r761j6594
6625c5667n570J6690m784o293L7472n747j9639J170L33J3329K2368M5152l4130
6612B4684j9288j5433n832j1861O332M554J3708K4831O037o166o984O561k9116
6599g973o220m295k674J8271n442K457R388j5696j0935L318j4853m35k0812Q093
6585d7808J8196J9597j7223K4602l329k6731m4624l0369j4453O5101L5176p612
6573b9477l0249J3872L4725K6780O168l0028j6948K5273j3014j1545M2290N377
6561B3224K1791j5860l9698k5867P721J9023P084M5203K4212m5450j0395O673
$$ plain form
6549 17661 7999 -9626 -23931 -11003 120 -25591 -12076 -24545 -35213 -32642 18281 13996
6537 13996 -26253 -75678 -93316 -72356 -41205 -32375 -29391 -26593 -25851 -33914 -15870 -32151 -48863
6524 -48863 -49035 -62534 -62052 -42795 -25905 -25079 -4035 19590 51910 20963 -29926 -59179 -68958
6511 -68958 -40175 -25294 -21889 7022 -27409 -50340 -45553 -46664 -64857 -47573 -54106 -58993 -39416
6498 -39416 838 32891 -24263 -78304 -81488 -72530 -63431 -59451 -61570 -50170 -31216 -1585 22891
6485 22891 7931 8856 14299 15693 -11094 -11298 30233 30909 -17464 -16457 -9968 -13295 -57882 -40536
6471 -40536 -15316 -6834 2851 9768 6011 16817 22904 25311 55535 50489 39161 61765 70540
6458 70540 48076 58812 49869 53607 10477 -29149 -48797 -40741 1836 28809 14304 4121
$$ packed form
6549A7661r662j7625j4305J2928J1123k5711J3515j2469j0668K571N0923m285
6537A3996m0249m9425j7638K0960L1151Q830K984K798P42q063J8044j6281j6712
6524d8863j72j3499M82J9257J6890Q26K1044K3625L2320l0947n0889k9253r779
6511f8958K8783J4881L405K8911l4431k2931M787j111j8193J7284o533m887J9577
6498c9416M0254L2053n7154n4041l184Q958R099L980k119J1400J8954K9631K4476
6485B2891j4960R25N443J394k6787k04M1531O76m8373J007O489l327m4587J7346
6471d0536K5220Q482R685O917l757J0806O087K407L0224n046j1328K2604Q775
6458G0540k2464J0736q943L738m3130l9626j9648Q056M2577K6973j4505j0183
$$ plain form
6446 4121 -38714 -51242 -11664 5886 30254 38796 53205 37415 -508 -8664 -53057 -23012
6434 -23012 -40663 -61042 -22415 -15923 -39406 -23454 41257 51603 39999 -9191 -6691 9593
6422 9593 -7229 -35248 10268 30585 -16821 -30835 -28517 -11477 -9970 23578 29427 -46 -16211
6409 -16211 -21044 11939 20480 405 20377 10042 -5098 -43773 -35763 -23094 -33097 -23749 -12249
6396 -12249 -39717 -36779 -23092 -23427 -8388 27627 30278 18294 22146 -11941 -25511 -39998 -51950
6383 -51950 -52932 -49224 -52889 -28299 16702 -9904 -71695 -74284 -66782 -60414 -64680 -74591 -76145 -57838
6369 -57838 -27529 46155 85223 84780 66024 13143 23233 -1596 2451 -1605 -22519 -69088 -74310
6356 -74310 -32279 11136 29108 -4726 -7894 -1404 1111 21609 54293 46654 28597 21030 16178
$$ packed form
6446D121m2835j2528L9578J7550K4368Q542J4409j5790l7923q156m4393L0045
6434b3012j7651k0379L8627O492k3483J5952O4711J0346j1604m9190K500J6284
6422I593j6822k8019M5516K0317m7406j4014K318J7040J507L3548N849k9473j6165
6409a6211m833L2983Q541k0075J9972j0335j5140l8675Q010J2669j0003R348J1500
6396a2249k7468K938J3687l35J5039L6015K651j1984L852l4087j3570j4487j1952
6383e1950r82L708l665K4590M5001k6606o1791k589P502O368m266r911j554J8307
6369e7838L0309P3684L9068m43j8756n2881J0090k4829M047m056k0914m6569n222
6356g4310M2031M3415J7972l3834l168O490K515K0498L2684p639j8057p567m852
$$ plain form
6343 16178 -5993 -46543 -28231 481 10295 1717 758 -11802 -26680 -56453 -62178 -47346 -13959
6330 -13959 5482 12544 27288 38450 34090 1431 -9805 -10990 -4674 -27107 -46835 -26510 -29518
6317 -29518 -34367 -33736 -26957 -7746 -30869 -32918 10784 9642 7022 -14407 -2252 2653 -22632
6304 -22632 -17051 8582 1096 -518 3033 1181 20191 21367 10628 23959 19521 28883 35783 34334
6290 34334 47451 20370 13080 19273 25804 54771 46837 8058 18528 33570 9602 -6686 -36611
6277 -36611 -62488 -104624 -88051 -70082 -57647 -14036 -5966 -28894 -21734 1023 2273 -16423
6265 -16423 -14080 -15883 -29616 -47500 -56266 -14098 6875 3244 11881 10593 10087 -23581 -29285 -4906
6251 -4906 24883 24848 -16777 -35111 -12172 25723 20120 3641 -4641 15749 161 20070 41083
$$ packed form
6343A6178k2171m0550J8312K8712R814q578r59j2560j4878k9773n725J4832L3387
6330a3959J9441P062J4744J1162m360l2659j1236j185O316k2433j9728K0325l008
6317b9518m849O31O779J9211k3123k049M3702j142k620k1429J2155M905k5285
6304b2632N581K5633p486j614L551j852J9010J176j0739J3331m438R362O900j449
6290C4334J3117k7081p290O193O531K8967p934l8779J0470J5042k3968j6288k9925
6277c6611k5877m2136J6573J7969J2435M3611Q070k2928P160K2757J250j8696
6265a6423K343j803j3733j7884q766M2168K0973l631Q637j288n06l3668n704K4379
6251d906K9789l5m1625j8334K2939L7895n603j6479q282K0390j5588J9909K1013
$$ plain form
6238 41083 -15028 -27037 -39831 -63949 -62949 -79163 -52321 -54431 -39992 -2762 15780 18761
6226 18761 28786 10185 -10826 -33321 -22891 -41010 -31274 15237 28226 27883 31265 28952 29881
6213 29881 -1112 11126 25091 6541 -6777 4688 -4855 -41087 -41171 -6098 3834 4346 -38515
6200 -38515 -45892 667 -765 -34928 -78374 -94686 -72582 -21223 6159 3623 -15901 -12547 -31949
6187 -31949 -7488 -20200 -28039 43206 48014 14674 28207 27331 -2448 -9173 -26607 -41539 -16468
6174 -16468 -10972 -23778 -4399 27998 45548 25449 15991 25196 8824 850 -13671 -58445 -47341
6161 -47341 2950 16057 3857 144 10835 23649 19537 -11617 -21318 -11475 -7779 -10944 -10555
6148 -10555 -7201 25066 5358 -33651 -30150 -42028 -69707 -70148 -79357 -45258 668 24271 29303
$$ packed form
6238D1083n6111j2009j2794k4118J000j6214K6842k110J4439L7230J8542K981
6226A8761J0025j8601k1011k2495J0430j8119R736M6511J2989l43L382k313R29
6213B9881l0993J2238J3965j8550j3318J1465r543l6232q4L5073R932N12m2861
6200c8515p377M6559j432l4163m3446j6312K2104N1359K7382k536j9524L354j9402
6187c1949K4461j2712p839P1245M808l3340J3533q76k9779o725j7434j4932K5071
6174a6468N496j2806J9379L2397J7550k0099r458R205j6372p974j4521m4774J1104
6161d7341N0291J3107j2200l713J0691J2814m112l1154r701R843L696l165L89
6148a0555L354L2267j9708l9009L501j1878k7679m41r209L4099M5926K3603N032
$$ plain form
6135 29303 6436 14346 25854 31178 35092 9739 8153 -19753 -26698 5951 4260 1900 15247
6122 15247 -30913 -72742 -43845 -15366 1228 -28167 -70192 -67701 -57466 -7821 10316 -19385
6110 -19385 -25886 -51174 -55414 -17886 19785 19834 9823 14855 17286 -5267 -21472 -28627 -66647
6097 -66647 -49133 -12057 5295 14215 13633 23723 5795 -35623 -53009 -28077 7851 15211 12313
6084 12313 9423 -15038 -10864 -10241 9527 40225 53245 61831 64185 40439 -9184 -37908 1166
6071 1166 33389 40986 31832 -17771 -3695 7454 -13847 20694 40068 25716 -6625 7363
6059 7363 10829 16996 7499 54772 47666 6507 -21519 -43392 -26472 -24385 -16538 -533 -7419
6046 -7419 -9514 -6787 6905 8964 20075 23447 -5052 -9219 -15670 -1437 7079 -6253 5278
$$ packed form
6135B9303k2867P910J1508N324L914k5353j586k7906o945L2649j691k360J3347
6122A5247m6160m1829K8897K8479J6594k9395m2025K491J0235M9645J8137k9701
6110a9385o501k5288m240L7528L7671M9j0011N032K431k2553j6205p155l8020
6097f6647J7514L7076J7352Q920n82J0090j7928m1418j7386K4932L5928P360k898
6084A2313k890k4461M174O23J9768L0698J3020Q586K354k3746m9623k8724L9074
6071A166L2223P597r154m9603J4076J1149k1301L4541J9374j4352l2341J3988
6059G363L466O167r497M7273p106m1159k8026k1873J6920K087P847J6005o886
6046g419k095K727J3692K059J1111L372k8499m167o451J4233Q516j3332J1531
$$ plain form
6033 5278 -5095 -17154 -67151 -56407 -42890 -69430 -73763 -35729 -9585 -22302 -8573 1792
6021 1792 -12341 24430 53644 35172 39094 61757 54807 59393 43753 6099 -791 -27162 -20112
6008 -20112 -4071 -21549 -34840 -41654 -30883 674 20258 39465 -9918 -5396 -12689 15204
5996 15204 47011 52311 40005 28213 1144 -17527 -35052 -38174 -25374 -21826 -20525 -43858 -56130
5983 -56130 -51656 -8985 -7133 -52180 -41547 2484 7686 -18240 -18390 -39486 -39832 -27662 -28018 -27588
5969 -27588 -27335 -18471 -8605 9280 -18461 -47667 -42247 -29867 -22230 -13972 -25070 -65513 -66811
5956 -66811 -40934 -13431 -5716 -1745 -14815 -6195 13472 22700 3874 -26928 -17329 -2577 -1826
5943 -1826 -1432 -14766 -21549 -29755 996 -5360 -31157 -53150 -29924 -14565 -24175 -19384 -8439
$$ packed form
6033E278j0373j2059m9997J0744J3517k6540m333L8034K6144j2717J3729J0365
6021A792j4133L6771K9214j8472L922K2663o950M586j5640l7654o890k6371P050
6008b0112J6041j7478j3291o814J0771L1557J9584J9207m9383M522p293K7893
5996A5204L1807N300j2306j1792k7069j8671j7525l122J2800L548J301k3333j2272
5983e6130M474M2671J852m5047J0633M4031N202k5926j50k1096l46J2170l56M30
5969b7588K53Q864R866J7885k7741k9206N420J2380P637Q258j1098m0443j298
5956f6811K5877K7503P715L971j3070Q620J9667R228j8826l0802R599J4752P51
5943a826L94j3334o783q206L0751o356k5797k1993K3226J5359r610M791J0945
$$ plain form
5930 -8439 14249 25687 -15648 -53934 -65970 -44060 -6068 -21313 -27430 -9979 -17758 -16109 7080
5917 7080 -38195 -45411 -9766 3236 -12139 -37367 -45971 -17557 -29899 -31452 -28022 3539 17034
5904 17034 8088 20021 21557 11281 8310 5253 14967 18279 43240 23292 45980 51335 51215 28957
5890 28957 -12689 -46299 -55632 -51898 -51925 -19189 -19716 -20379 -34043 -3768 -17128 -6520 9470 12272
5876 12272 -25878 -22177 -13270 -10268 -22409 -27620 -9310 747 -13718 -30775 -38260 -33225 -18867
5863 -18867 -33925 -20792 -45841 -67063 -54231 -44705 -47218 -28306 -7026 -5743 -14435 725 -23487
5850 -23487 -30089 -39571 -58472 5732 65531 35507 -5563 3066 52611 59647 39239 26204 49432
5837 49432 48893 36408 11546 -6516 -5336 9500 22212 51690 61094 3459 20447 32915 40825
$$ packed form
5930h439K2688J1438m1335l8286j2036K1910L7992j5245o117J7451p779J649K3189
5917G080m5275p216L5645J3002j5375k5228q604K8414j2342j553L430L1561J3495
5904A7034q946J1933J536j0276k971l057R714L312K4961j9948K2688N355j20k2258
5890B8957m1646l3610r333L734k7L2736n27o63j3664L0275j3360J0608J5990K802
5876A2272l8150L701Q907L002j2141n211J8310J0057j4465j7057p485N035J4358
5863a8867j5058J3133k5049k1222J2832R526k513J8912K1280J283q692J5160k4212
5850b3487o602r482j8901O4204N9799l0024m1070Q629M9545P036k0408j3035K3228
5837D9432n39j2485k4862j8062J180J4836J2712K9478R404n7635J6988J2468P910
$$ plain form
5824 40825 55649 5911 -22851 -6309 -10402 14337 42765 24476 -12922 -55957 -72920 -45982
5812 -45982 3311 -263 -2271 17524 32525 35174 35998 10309 -12798 5571 -752 -5364 25545
5799 25545 24171 41783 52988 34930 28214 19847 32315 21039 19256 25179 43718 47366 8797
5786 8797 11497 31755 21287 -7667 -51960 -56138 -74009 -80809 -65788 -40102 15952 27693 23080
5773 23080 30254 20521 17062 499 17349 45827 52383 72235 67436 48446 19934 -8275 24010
5760 24010 -16524 -53310 -83429 -73987 -40075 -7520 37418 45838 -13733 -20037 16713 23822 9621
5747 9621 -21335 -11523 35918 51714 29762 32690 30148 32355 23976 20730 20709 -911 -26942 -43197
5733 -43197 -32095 -23794 -44065 -27136 -23403 30058 44193 16718 32352 53526 51814 4956
$$ packed form
5824D0825J4824m9738k8762J6542m093K4739K8428j8289l7398m3035j6963K6938
5812d5982M9293l574k008J9795J5001K649Q24k5689k3107J8369o323m612L0909
5799B5545j374J7612J1205j8058o716q367J2468j1276j783N923J8539L648l8569
5786H797K700K0258j0468k8954m4293m178j7871o800J5021K5686N6054J1741m613
5773B3080P174r733l459j6563J6850K8478O556J9852m799j8990k8512k8209L2285
5760B4010m0534l6786l0119R442L3912L2555M4938Q420n9571o304L6750P109j4201
5747I621l0956R812M7441J5796k1952K928k542K207q379l246k1k1620k6031j6255
5733d3197J1102Q301k0271J6929L733N3461J4135k7475J5634K1174j712m6858
$$ plain form
5721 4956 2338 15438 43448 51095 65528 43769 -4093 -30137 5781 40218 16720 -10424
5709 -10424 11480 21578 31682 35937 41745 44505 6402 -1230 -6593 4543 25239 51864 74545
5696 74545 90386 99641 85479 36809 19585 -11309 -30518 -23733 -17243 -16366 24935 17936 -5238
5683 -5238 19040 -24928 -54416 -47609 -36051 -15107 -29763 -55542 -38549 -18093 -18950 -16452 4472
5670 4472 71800 86058 24589 25527 55396 49801 19402 -28251 -3167 56007 57713 69633 43208
5657 43208 14677 15645 25461 8646 38088 51586 22549 -16693 -40531 -24910 -25242 -46937 -13659
5644 -13659 -18032 -8237 2854 8961 -25456 -44700 -71467 -39429 -42960 -6956 6191 744 17220
5631 17220 19253 -117 -5531 -47212 -67922 -57189 -24290 -20762 -9430 -46872 -41975 -35997 -50323
$$ packed form
5721D956k618J3100K8010P647J4433k1759m7862k6044L5918L4437k3498k7144
5709a0424K1904J0098J0104M255N808K760l8103p632n363J1136K0696K6625K2681
5696G4545J5841R255j4162m8670j7224l0894j9209O785O490Q77M1301o999k3174
5683e238K4278m3968k9488O807J1558K0944j4656k5779J6993K0456q57K498K0924
5670D472O7328J4258o1469R38K9869n595l0399m7653K5084N9174J706J1920k6425
5657D3208k8531R68R816j6815K9442J3498k9037l9242k3838J5621l32k1695L3278
5644a3659m373R795J1091O107l4417j9244k6767L2038l531L6004J3147n447J6476
5631A7220K033j9370n414m1681k0710J0733L2899L528J1332l7442M897N978j4326
$$ plain form
5618 -50323 -65561 -15588 11039 -27654 -69040 -95650 -74798 -29159 4453 -9242 -5770 -15705
5606 -15705 -49907 -53610 -42366 -44074 -65098 -80961 -91176 -71870 -43447 -39957 -31799 17199 47913
5593 47913 19988 22082 30675 607 21802 18875 32703 17860 -27907 -70254 -89766 -67927
5581 -67927 -62690 -32930 3312 20776 -14001 -20728 -42767 -84025 -95422 -45288 -39742 -19261
5569 -19261 -6485 -1620 -11343 17545 25896 7661 -4225 -4414 22376 16214 23644 34791 24742
5556 24742 -5301 -24557 -19375 -2163 3009 -20635 19998 64808 53261 40950 34172 4216
5544 4216 -17533 -16499 17214 15508 -8416 -31131 -45415 -58986 -65502 -48434 -29937 -32635 -25743
5531 -25743 -9610 -37125 -39159 -19499 8470 3343 -12572 5547 8963 10456 -45 8627 6757
$$ packed form
5618e0323j5238M9973K6627l8693m1386k6610K0852M5639L3612j3695L472r935
5606a5705l4202l703J1244j708k1024j5863j0215J9306K8423L490Q158M8998L0714
5593D7913k7925K094Q593l0068K1195k927J3828j4843m5767m2347j9512K1839
5581f7927N237K9760L6242J7464l4777o727k2039m1258j1397N0134N546K0481
5569a9261J2776M865r723K8888Q351j8235j1886j89K6790o162P430J1147j0049
5556B4742l0043j9256N182J7212N172k3644M0633M4810j1547j2311o778k9956
5544D216k1749J034L3713j706k3924k2715j4284j3571o516J7068J8497k698O892
5531b5743J6133k7515k034J9660K7969n127j5915J8119L416J493j0501Q672j870
$$ plain form
5518 6757 10898 19068 966 -1578 -16433 1311 -1645 1994 21351 -15232 -13303 10002 -3624
5505 -3624 -21381 -20471 11725 62548 60176 14621 25977 23921 24923 50527 50356 27225 -10929
5492 -10929 -54540 -20508 11991 1848 -23568 -27348 9114 16622 26078 1261 -11062 -4624 27509
5479 27509 23945 -1880 -50662 -68463 -45264 -50112 -26891 -12319 -6890 -52060 -64819 -32051
5467 -32051 235 41216 42803 22507 -9753 -28547 -19265 -2723 48817 79642 82553 40875
5455 40875 4835 -36578 -41305 -48311 -54032 -63029 -13878 10299 3081 4346 -5205 25569 11185
5442 11185 25770 21783 13245 36329 29885 14726 7341 7118 -35976 -29478 -47810 -50478 3466
5429 3466 33706 56415 82345 79345 34113 -20031 -38109 -14137 13614 -821 -3681 -3371 38282
$$ packed form
5518F757M141Q170j8102k544j4855J7744k956L639J9357l6583J929K3305j3626
5505c624j7757R10L2196N0823k372m5555J1356k056J002K5604j71k3131l8154
5492a0929m3611L4032L2499j0143k5416l780L6462P508R456k4817j2323O438L2133
5479B7509l564k5825m8782j7801K3199m848K3221J4572N429m5170j2759L2768
5467c2051L2286M0981J587k0296l2260j8794R282J6542N1540L0825K911m1678
5455D0875l6040m1413m727p006n721q997M9151K4177p218J265r551L0774j4384
5442A1185J4585l987q538K3084o444j5159p385k23m3094O498j8332k668N3944
5429C466L0240K2709K5930l000m5232n4144j8078K3972K7751j4435k860L10M1653
$$ plain form
5416 38282 39607 20921 33421 54689 44033 27827 44296 36840 28790 29140 35572 -3527 -13820
5403 -13820 17946 38622 39696 17729 -10886 -17803 1719 -8726 2204 19394 17779 964
5391 964 20665 49116 46836 29235 1660 -67019 -63219 -27978 49461 18668 17934 6421 7706
5378 7706 -6168 -17284 -5688 25028 82836 91125 33845 4131 -28101 -25426 23118 12544
5366 12544 -29877 -71566 -68219 -67931 -39007 33884 37952 46153 23116 -6116 -2996 31063 48336
5353 48336 37147 40263 59307 54482 29521 16512 5772 22446 -6812 -38029 -10147 1736
5341 1736 8616 43545 69358 37437 18715 10760 30111 26730 -15491 -4551 24199 39898 7917
5328 7917 -26961 -16975 -3504 -46434 -42666 -21015 4726 17711 47809 37804 6323 -17775
$$ packed form
5416C8282J325j8686J2500K1268j0656j6206J6469p456q050L50O432l9099j0293
5403a3820L1766K0676J074k1967k8615o917J9522j0445J0930J7190j615j6815
5391I64J9701K8451k280j7601k7575o8679L800L5241P7439l0793p34j1513J285
5378G706j3874j1116J1596L0716N7808Q289n7280k9714l2232K675M8544j0574
5366A2544m2421m1689L347K88K8924P2891M068Q201k3037k9232L120L4059J7273
5353D8336j1189L116J9044m825k4961j3009j0740J6674k9258l1217K7882J1883
5341A736O880L4929K5813l1921j8722p955J9351l381m2221J0940K8750J5699l1981
5328G917l4878R986J3471m2930L768K1651K5741J2985L0098j0005l1481k4098
$$ plain form
5316 -17775 -5830 10219 30061 -5235 6356 8666 -37594 -22335 -15380 -23057 -29892 -35800 -33882
5303 -33882 -9571 25890 11421 -23238 -52331 -77773 -44023 -7234 13858 42423 50886 -14164
5291 -14164 -41846 -31515 -10410 20465 31986 28985 40005 66740 74994 63667 56140 32958
5279 32958 3281 12594 8349 29015 49347 51665 20911 -15278 -38531 -3600 -26142 -65079
5267 -65079 -69181 -40670 -40363 -84382 -104313 -149425 -132620 -72017 -15192 1136 -24103 -5400
5255 -5400 -10462 -34529 -19070 -5300 -13310 -49479 -48380 -29580 -9040 60335 57141 6886 -23825
5242 -23825 -6702 -39939 -59110 -48038 -16731 -13285 369 -6169 -32006 -15709 -8318 -17107 -8817
5229 -8817 -7777 -39540 -22807 -3476 9286 24521 65389 57757 40028 12771 9726 62902 36977
$$ packed form
5316a7775J1945J6049J9842l5296J1591K310m6260J5259O955p677o835n908J918
5303c3882K4311L5461j4469l4659k9093k5442L3750L6789K1092K8565Q463o5050
5291a4164k7682J0331K1105L0875J1521l001J1020K6735Q254j1327p527k3182
5279C2958k9677R313m245K0666K0332K318l0754l6189k3253L4931k2542l8937
5267f5079m102K8511L07m4019j9931m5112J6805O0603N6825J6328k5239J8703
5255e400n062k4067J5459J3770q010l6169J099J8800K0540O9375l194n0255l0711
5242b3825J7123l3237j9171J1072L1307L446J3654o538k5837J6297P391q789Q290
5229h817J040l1763J6733J9331J2762J5235M0868p632j7729k7257l045N3176k5925
$$ plain form
5216 36977 -7479 -26167 -53691 -34060 -26052 -29898 -13380 3842 -11794 10913 13195 43112
5204 43112 8592 2520 14126 -11201 -17326 -29798 -8460 12130 29461 41816 42460 25852 -4327
5191 -4327 -27697 -661 -1879 -14305 7235 -1142 -18503 -37181 -42513 -62790 -45104 -67760 -74069
5178 -74069 -48030 -93000 -172719 -191655 -145938 -125090 -66683 -35768 -34839 -36916 -12941 20920
5166 20920 13391 13489 329 -13000 -5822 15880 7781 21564 25149 50740 49160 37360 10964
5153 10964 1651 10104 19646 4451 25347 12750 7412 14289 15170 12655 35494 24886 34722 23802
5139 23802 26728 -1533 -45157 -58428 -45731 -31522 -35 -5171 -10024 -30139 -31437 -35874 -31136
5126 -31136 -16893 16951 32123 62493 78988 38271 33802 53869 55584 68028 44161 7716
$$ packed form
5216C6977m4456j8688k7524J9631Q008l846J6518J7222j5636K2707K282K9917
5204D3112l4520o072J1606k5327o125j2472K1338K0590J7331J2355O44j6608l0179
5191d327k3370K7036j218j2426K1540q377j7361j8678n332k0277J7686k2656o309
5178g4069K6039m4970p9719j8936M5717K0848N8407L0915R29k077K3975L3861
5166B0920p529R8j3160j3329P178K1702q099J3783L585K5591j580j1800k6396
5153A0964r313Q453R542j5195K0896j2597n338O877Q81k515K2839j0608R836j0920
5139B3802K926k8261m3624j3271J2697J4209L1487n136m853k0115j298m437M738
5126c1136J4243L3844J5172L0370J6495m0717m469K0067J715J2444k3867l6445
$$ plain form
5114 7716 2267 21532 33918 28706 20545 37767 30373 12683 -40991 -38923 -5491 -4109 4596
5101 4596 51248 59178 37752 9072 4141 15452 8157 -7253 -29582 -32742 -29079 -5082 14186
5088 14186 26992 -5791 -35209 -55589 -64094 -43501 -45229 -14341 -1276 -11282 -11092 -26222 -42934
5075 -42934 -25630 -42819 6246 12844 8593 6231 -3511 8005 4161 -12045 -4567 18535 19296
5062 19296 9312 1993 17723 42252 19547 -30503 -27914 -39785 -4776 31165 16986 18153 13254
5049 13254 -11081 -21157 -9191 -7316 -31496 -16824 25020 60415 33463 -763 -8444 7465
5037 7465 15869 -34173 -40747 -7425 3201 33604 36408 -3991 -37151 -15762 21642 64329 41515
5024 41515 19150 6984 21764 17055 8044 12371 46755 44157 7116 -45521 -65254 -26438 -3028
$$ packed form
5114G716n449J9265J2386n212q161J7222p394j7690n3674K068L3432J382Q705
5101D596M6652P930k1426k8680m931J1311p295j5410k2329l160L663K3997J9268
5088A4186J2806l2783k9418k0380q505K0593j728L0888J3065j0006J90j5130j6712
5075d2934J7304j7189M9065O598m251k362r742J1516l844j6206P478K3102P61
5062A9296r984p319J5730K4529k2705n0050K589j1871L5009L5941j4179J167m899
5049A3254k4335j0076J1966J875k4180J4672M1844L5395k6952l4226p681J5909
5037G465Q404n0042o574L3322J0626L0403K804m0399l3160K1389L7404M2687k2814
5024D1515k2365j2166J4780m709r011M327L4384k598l7041n2637j9733L8816K3410
$$ plain form
5011 -3028 7905 -26390 -44900 -37610 -26586 -17132 18355 -12130 -23716 -18035 -4263 -13510 -5881
4998 -5881 30771 57960 69199 62311 47733 21071 36850 47880 80342 37297 16507 12808
4986 12808 -3628 -9201 -7952 -35065 -52401 -85441 -138479 -115812 -112932 -69560 -6997 13082
4974 13082 8497 20103 7199 -28731 -24825 -22902 -38587 -14690 -1399 15215 -3448 -19482
4962 -19482 -31783 -23215 -40908 -78641 -86451 -31683 -11632 -3661 26855 24435 56821 34633 8615
4949 8615 -23736 -20601 -25191 -31638 -17659 -51439 -49594 -24803 -20554 -25956 -30470 -28397 -10465 10594
4935 10594 9855 -4393 29183 52062 44082 10625 -1168 -19069 -13512 2094 36310 32246 8834
4922 8834 8239 40800 41629 18170 15803 -22787 -27742 -24411 -48920 -72874 -52940 -47127 7859 20974
$$ packed form
5011c028J0933l4295j8510P290J1024R454L5487l0485j1586N681J3772r247P629
4998e881L6652K7189J1239o888j4578k6662J5779J1030L2462m3045k0790l699
4986A2808j6436n573J249k7113j7336l3040n3038K2667K880M3372O2563K0079
4974A3082m585J1606j2904l5930L906J923j5685K3897J3291J6614j8663j6034
4962a9482j2301Q568j7693l7733p810N4768K0051P971L0516k420L2386k2188k6018
4949H615l2351L135m590o447J3979l3780J845K4791M249n402m514K073J7932K1059
4935A0594p39j4248L3576K2879p980l3457j1793j7901N557J5606L4216m064k3412
4922H834n95L2561Q29k3459k367l8590m955L331k4509k3954J9934N813N4986J3115
$$ plain form
4908 20974 39702 48130 9993 8228 33812 59976 51326 54248 54629 14315 -25868 -21665 32222
4895 32222 44371 56991 67050 66207 99443 115904 72237 4417 -3308 11728 22569 15856 20931
4882 20931 37300 21743 1365 20356 30348 8751 13448 26094 26888 27806 -6968 -36897 -25134
4869 -25134 -515 32478 26288 42356 16807 18158 -14875 -18906 -25997 10483 41199 83965 70190
4856 70190 32693 -20057 -28544 7212 49739 19492 -11952 13098 -1037 -10705 545 -10745
4844 -10745 2443 -19215 -12998 31586 43655 -924 26063 18111 5601 17434 13939 12798 22257
4831 22257 -6219 -22404 -27532 -21178 -16760 13847 4159 -7575 -7434 -1798 -5702 635 -27302 -32543
4817 -32543 -23553 -37215 -48577 -15274 56769 77207 29614 3373 31628 29282 44291 43332 19954
$$ packed form
4908B0974J8728Q428l8137j765K5584K6164q650K922L81m0314m0183M203N3887
4895C2222J2149J2620J0059q43L3236J6461m3667o7820p725J5036J0841o713N075
4882B0931J6369j5557k0378J8991R992k1597M697J2646P94R18l4774k9929J1763
4869b5134K4619L2993o190J6068k5549J351l3033m031p091L6480L0716M2766j3775
4856G0190l7497n2750q487L5756M2527l0247l1444K5050j4135r668J1250j1290
4844a0745J3188k1658O217M4584J2069m4579K6987p952j2510J1833l495j141R459
4831B2257k8476j6185n128O354M418L0607r688j1734J41N636l904O337k7937n241
4817c2543Q990j3662j1362L3303P2043K0438m7593k6241K8255k346J5009r59k3378
$$ plain form
4804 19954 7337 21878 45041 -3571 -8578 29498 39341 7037 -13518 -50482 -36307 11620
4792 11620 20842 -8422 -27863 -52855 -31930 -13494 9321 23191 32457 48352 19738 2257
4780 2257 -23888 -978 -13912 -40659 -8763 -36205 -62577 -50916 -41395 -42678 -29227 -12656
4768 -12656 6325 -9328 -49123 -40532 -67420 -78900 -52489 -76263 -49793 -33715 23709 43526
4756 43526 42628 50955 87752 48929 14251 3979 -5438 -38884 -7854 21672 42043 49142 35718
4743 35718 49358 34739 10226 -1232 15236 3917 -11747 -35005 -53235 -80150 -81518 -71039
4731 -71039 -13179 7294 -2747 -13554 -22923 -42262 -38675 5058 -2604 -23437 -26466 -46668 -27463
4718 -27463 -28055 -38969 -48875 -60751 -51523 -13453 22924 24172 23619 31472 7086 35526 47665
$$ packed form
4804A9954j2617J4541K3163m8612n007L8076R843l2304k0555l6964J4175M7927
4792A1620R222k9264j9441k4992K0925J8436K2815J3870R266J5895k8614j7481
4780B257k6145K2910j2934k6747L1896k7442k6372J1661R521j283J3451J6571
4768a2656J8981j5653l9795Q591k6888j1480K6411k3774K6470J6078N7424J9817
4756D3526q98Q327L6797l8823l4678j0272r417l3446L1030K9526K0371P099j3424
4743C5718J3640j4619k4513j1458J6468j1319j5664k3258j8230k6915j368J0479
4731g1039N7860K0473j0041j0807r369j9339L587M3733p662k0833l029k0202J9205
4718b7463n92j0914r906j1876R228L8070L6377J248n53P853k4386K8440J2139
$$ plain form
4705 47665 38227 27561 42581 31391 23708 42108 56103 37221 -24267 -15680 -18074 10138 3915
4692 3915 -4174 13968 35129 11754 15375 10118 16175 56986 55517 33864 37330 27481 -16641
4679 -16641 -49619 -36578 -21029 -1835 -19041 -13905 -1341 -16666 -4779 -1162 -47745 -60184
4667 -60184 -51460 -14609 -12111 -36846 -56385 -41776 -11712 -11833 -5139 26060 34785 29683 13644
4654 13644 -13153 -19699 -29757 -17159 -7505 -5036 5386 3651 16632 3009 -19424 -23632 3566
4641 3566 3272 -16432 -30561 -13786 -18080 -8021 15532 24132 -13040 -6740 31941 14501 1705
4628 1705 -19622 -41066 -35570 -38619 -54319 -56733 -39409 -22434 16441 -5338 -39344 -54400 -63828
4615 -63828 -77807 -65317 -73906 -113132 -87616 -40119 -28508 10815 -2015 7191 23554 8754
$$ packed form
4705D7665r438j0666J5020j1190p683J8400J3995j8882o1488Q587k394K8212o223
4692C915q089J8142K1161k3375L621n257O057M0811j469k1653L466r849m4122
4679a6641l2978J3041J5549J9194j7206N136J2564j5325J1887L617m6583j2439
4667f0184Q724L6851K498k4735j9539J4609L0064j21O694L1199Q725n102j6039
4654A3644k6797o546j0058J2598R654K469J0422j735J2981j3623k2433m208K7198
4641C566k94j9704j4129J6775m294J0059K3553Q600l7172O300L8681j7440j2796
4628A705k1327k1444N496l049j5700k414J7324J6975L8875k1779l4006j5056r428
4615f3828j3979J2490q589l9226K5516M7497J1611L9323j2830R206J6363j4800
$$ plain form
4603 8754 27086 -20156 -20789 -30722 2530 10016 -17117 -33493 -20614 -13483 -58399 -66722 -48452
4590 -48452 -21746 -32543 -50085 -2156 23354 16307 -17227 -1339 29825 -17824 -30496 -7001
4578 -7001 17512 21293 9675 21671 60191 2021 -29998 -35270 -42745 -48881 -1550 24095 33987
4565 33987 13691 1858 618 1343 -1486 36735 69307 58574 53483 51308 27816 -20059 6012
4552 6012 35381 8233 -2321 -21679 -49785 -74486 -54045 -53234 -54481 -41358 -37507 -36421 -1262
4539 -1262 17616 8250 18214 6690 -12558 -22218 -11854 20802 5121 -1156 -10691 19741 -20472
4526 -20472 -50790 -22493 -56234 -68044 -56329 -43314 -45352 -39987 -14766 -3144 -705 28655
4514 28655 53642 44705 37610 20037 -18401 -20057 -25469 -17244 -19653 -30107 -10495 9766 15064
$$ packed form
4603H754J8332m7242o33r933L3252P486k7133j6376J2879P131m4916q323J8270
4590d8452K6706j0797j7542M7929K5510p047l3534J5888L1164m7649j2672K3495
4578g001K4513L781j1618J1996L8520n8170l2019n272p475o136M7331K5645R892
4565C3987k0296j1833j240P25k829L8221L2572j0733n091k175k3492m7875K6071
4552F012K9369k7148j0554j9358k8106k4701K0441Q11j247J3123L851J086L5159
4539a262J8878r366R964j1524j9248r660J0364L2656j5681o277r535L0432m0213
4526b0472l0318K8297l3741j1810J1715J3015k038N365K5221J1622K439K9360
4514B8655K4987q937p095j7573l8438j656n412Q225k409j0454J9612K0261N298
$$ [...]
##END NTUPLES=NMR SPECTRUM
##END=
