##TITLE=Analysis number 329090
Compound Code cc 62724
Book Reference 521/99
Project Code adrs
Chemist Name evam
##JCAMPDX= 6.0         $$ Bruker NMR JCAMP-DX V2.0
##DATA TYPE= NMR SPECTRUM
##DATA CLASS= NTUPLES
##ORIGIN= Bruker BioSpin GmbH
##OWNER= nmr
$$ XWIN-NMR		Version 3.5
$$ Tue Jul 31 09:54:54 2007 GMT Daylight Time (UT+1h)  MAYBRIDGE\nmr@NMR_250MHZ
##.OBSERVE FREQUENCY= 250.131544655141
##.OBSERVE NUCLEUS= ^1H
##.ACQUISITION MODE= SIMULTANEOUS (DQD)
##.ACQUISITION SCHEME= undefined
##.AVERAGES= 16
##.DIGITISER RES= 18
##SPECTROMETER/DATA SYSTEM= dpx250
##.PULSE SEQUENCE= zg30
##.SOLVENT NAME= CDCl3
##.SHIFT REFERENCE= (INTERNAL, CDCl3, 0, 16.4486)
##AUDIT TRAIL= $$ (NUMBER, WHEN, WHO, WHERE, WHAT)
$$ ##TITLE= Audit trail, XWIN-NMR		Version 3.5
$$ ##JCAMPDX= 5.01
$$ ##ORIGIN= Bruker BioSpin GmbH
$$ ##OWNER= nmr
$$ C:\u/data/dgb/nmr/ADRS/1780/pdata/1/auditp.txt
$$ ##AUDIT TRAIL=  $$ (NUMBER, WHEN, WHO, WHERE, WHAT)
(   1,<2007-07-31 09:54:33.45 +100>,<MAYBRIDGE\nmr>,<NMR_250MHZ>,
      <created by zg, POWCHK disabled, PULCHK disabled
       configuration hash MD5:
       76 6E 9A 78 1E 09 19 81 EC 84 63 8F B0 6A 59 2D
       data hash MD5: 64K
       01 1B 36 A6 E0 30 E8 98 E1 CF 91 24 9C EC 16 6E>)
(   2,<2007-07-31 09:54:45.90 +100>,<MAYBRIDGE\nmr>,<NMR_250MHZ>,
      <Start of raw data processing
       ef LB = 0.3 FT_mod = 6 PKNL = 1 SI = 32K 
       data hash MD5: 32K
       28 2D 17 97 9D C7 82 FB AE 54 6F 5A 78 C4 88 FC>)
(   3,<2007-07-31 09:54:47.53 +100>,<MAYBRIDGE\nmr>,<NMR_250MHZ>,
      <apk 
       data hash MD5: 32K
       44 EB 1D 1F C6 FD 10 4C CF 9B FD 96 29 7E 49 8C>)
(   4,<2007-07-31 09:54:48.23 +100>,<MAYBRIDGE\nmr>,<NMR_250MHZ>,
      <abs ABSG = 5 
       data hash MD5: 32K
       D0 A0 11 AE B0 40 9B BB 56 BA 2F 15 22 B2 49 B6>)
$$ ##END=
$$ 
$$ hash MD5
$$ 6B C1 24 C2 D3 8C 3A CF 2F 65 2F FF 92 CA 09 B4
##$RELAX= 
##$RELAX= 
##$RELAX= 
##$RELAX= 
##$RELAX= 
##$RELAX= 
##$RELAX= 
$$ Bruker specific parameters
$$ --------------------------
##$DU= <C:\u>
##$EXPNO= 1780
##$NAME= <ADRS>
##$PROCNO= 1
##$TYPE= <nmr>
##$USER= <dgb>
##$AMP= (0..31)
100 100 100 100 100 100 100 100 100 100 100 100 100 100 100 100 100 100 
100 100 100 100 100 100 100 100 100 100 100 100 100 100 
##$AQSEQ= 0
##$AQ_mod= 3
##$AUNM= <au_zg>
##$AUTOPOS= <13 >
##$BF1= 250.13
##$BF2= 250.13
##$BF3= 250.13
##$BF4= 250.13
##$BF5= 500.13
##$BF6= 500.13
##$BF7= 500.13
##$BF8= 500.13
##$BYTORDA= 1
##$CFDGTYP= 0
##$CFRGTYP= 5
##$CHEMSTR= <none>
##$CNST= (0..31)
1 1 145 1 1 1 1 1 1 1 1 1 1 1 1 1 1 1 1 1 1 1 1 1 1 1 1 1 1 1 1 1 
##$CPDPRG= <>
##$CPDPRG1= <>
##$CPDPRG2= <>
##$CPDPRG3= <>
##$CPDPRG4= <mlev>
##$CPDPRG5= <mlev>
##$CPDPRG6= <mlev>
##$CPDPRG7= <mlev>
##$CPDPRG8= <mlev>
##$CPDPRGB= <>
##$CPDPRGT= <>
##$D= (0..31)
0 1 0 0 0 0 0 0 0 0.06 0 0 0 0 0 0 0.0002 0 0 0 0 0 0 0 0 0 0 0 0 0 0 
0 
##$DATE= 1185872072
##$DBL= (0..7)
120 120 120 120 120 120 120 120 
##$DBP= (0..7)
150 150 150 150 150 150 150 150 
##$DBP07= 0
##$DBPNAM0= <>
##$DBPNAM1= <>
$$ [...]
##$SUBNAM7= <"">
##$SUBNAM8= <"">
##$SUBNAM9= <"">
##$SW= 20.6930455092707
##$SWIBOX= (0..15)
0 0 3 0 0 0 0 0 0 0 0 0 0 0 0 0 
##$SW_h= 5175.983436853
##$TD= 65536
##$TD0= 1
##$TE= 297.16
##$TE2= 300
##$TE3= 300
##$TEG= 300
##$TL= (0..7)
0 120 120 120 120 120 120 120 
##$TP= (0..7)
150 150 150 150 150 150 150 150 
##$TP07= 0
##$TPNAME0= <>
##$TPNAME1= <>
##$TPNAME2= <>
##$TPNAME3= <>
##$TPNAME4= <>
##$TPNAME5= <>
##$TPNAME6= <>
##$TPNAME7= <>
##$TPOAL= (0..7)
0.5 0.5 0.5 0.5 0.5 0.5 0.5 0.5 
##$TPOFFS= (0..7)
0 0 0 0 0 0 0 0 
##$TUNHIN= 0
##$TUNHOUT= 0
##$TUNXOUT= 0
##$USERA1= <user>
##$USERA2= <user>
##$USERA3= <user>
##$USERA4= <user>
##$USERA5= <user>
##$V9= 5
##$VALIST= <valist>
##$VCLIST= <CCCCCCCCCCCCCCC>
##$VD= 0
##$VDLIST= <DDDDDDDDDDDDDDD>
##$VPLIST= <PPPPPPPPPPPPPPP>
##$VTLIST= <TTTTTTTTTTTTTTT>
##$WBST= 1024
##$WBSW= 4
##$XGAIN= (0..3)
0 0 0 0 
##$XL= 0
##$YL= 0
##$YMAX_a= 472628
##$YMIN_a= -409005
##$ZGOPTNS= <>
##$ZL1= 120
##$ZL2= 120
##$ZL3= 120
##$ZL4= 120
##$ABSF1= 16.4486
##$ABSF2= -4.244572
##$ABSG= 5
##$ABSL= 3
##$ALPHA= 0
##$AQORDER= 0
##$ASSFAC= 0
##$ASSFACI= 0
##$ASSFACX= 0
##$ASSWID= 0
##$AUNMP= <proc_1d>
##$AZFE= 0.1
##$AZFW= 0.1
##$BCFW= 0
##$BC_mod= 0
##$BYTORDP= 0
##$COROFFS= 0
##$CY= 12.5
##$DATMOD= 1
##$DC= 0
##$DFILT= <>
##$DTYPP= 0
##$F1P= 14.0000005364418
##$F2P= -0.99999901652339
##$FCOR= 0.5
##$FTSIZE= 32768
##$FT_mod= 6
##$GAMMA= 0
##$GB= 0
##$INTBC= 1
##$INTSCL= 1
##$ISEN= 128
##$LB= 0.3
##$LEV0= 0
##$LPBIN= 0
##$MAXI= 10000
##$MC2= 0
##$MEAN= 0
##$ME_mod= 0
##$MI= 0
##$NCOEF= 0
##$NC_proc= -3
##$NLEV= 6
##$NOISF1= 0
##$NOISF2= 0
##$NSP= 0
##$NTH_PI= 0
##$NZP= 0
##$OFFSET= 16.4486
##$PC= 1
##$PHC0= -45.02793
##$PHC1= 3.133469
##$PH_mod= 1
##$PKNL= yes
##$PPARMOD= 0
##$PSCAL= 4
##$PSIGN= 0
##$REVERSE= no
##$SF= 250.130018357778
##$SI= 32768
##$SIGF1= 0
##$SIGF2= 0
##$SINO= 400
##$SIOLD= 32768
##$SREGLST= <1H.CDCl3>
##$SSB= 0
##$STSI= 32768
##$STSR= 0
##$SW_p= 5175.98343685301
##$SYMM= 0
##$S_DEV= 0
##$TDeff= 65536
##$TDoff= 0
##$TI= <Analysis number 999999
Compound Code 99
Book Reference 9
Project Code 9>
##$TILT= no
##$TM1= 0
##$TM2= 0
##$TOPLEV= 0
##$USERP1= <user>
##$USERP2= <user>
##$USERP3= <user>
##$USERP4= <user>
##$USERP5= <user>
##$WDW= 1
##$XDIM= 32768
##$YMAX_p= 363225478
##$YMIN_p= -128010
$$ End of Bruker specific parameters
$$ ---------------------------------
##NTUPLES= NMR SPECTRUM
##VAR_NAME=  FREQUENCY,     SPECTRUM/REAL,   SPECTRUM/IMAG
##SYMBOL=    X,             R,               I
##VAR_TYPE=  INDEPENDENT,   DEPENDENT,       DEPENDENT
##VAR_FORM=  AFFN,          ASDF,            ASDF
##VAR_DIM=   32768,         32768,           32768
##UNITS=     HZ,            ARBITRARY UNITS, ARBITRARY UNITS
##FACTOR=    0.157963299565203, 1,           1
##FIRST=     4114.28881232048, 0,            0
##LAST=      -1061.69462453253, 0,           0
##MIN=       -1061.69462453253, -128010,     0
##MAX=       4114.28881232048, 363225478,    0
$$ Real data points
##PAGE= N=1
##DATA TABLE= (X++(R..R)), XYDATA
$$ [...]
20736 -13062 -1332 -14603 -12843 -296 -21660 -43326 -50612 -24012 -15421 -13369 -4686 -16527 -42873
20723 -42873 -43774 -29335 -22121 -20145 -19679 -23452 -36289 -37038 -44798 -31123 7187 -13090 -32766 -11409
20709 -11409 -16393 -36581 -30533 -38727 -38761 -38304 -33313 -20897 -17998 -7369 8260 -12482 -22789 -38676
20695 -38676 -40597 -57261 -57854 -50309 -38835 -28046 -6032 -11413 -23685 -41505 -45693 -40278 -37258
20682 -37258 -8976 3252 16286 13298 18350 23119 4703 -19393 -16269 -37299 -59345 -57796 -16696
20669 -16696 26455 18771 -20528 -26797 -24081 -29251 -16331 -3417 -611 -5121 -39139 -50100 -42603
20656 -42603 -41891 -31407 -35530 -50008 -27377 -17316 934 8917 -19809 -31026 -12880 6891
20644 6891 1391 -11700 -6974 -25999 -31195 -65918 -46552 -24608 -8974 -12101 -4601 6431 -16444
20631 -16444 -32539 -21752 17920 41309 35082 7433 -19014 -39194 -42078 -33030 -30276 -1366
20619 -1366 6918 -18592 -27515 -22013 -7692 151 11897 16033 -17694 -36778 -58997 -49441 -10942
20606 -10942 -26906 -33051 -42883 -45292 -47382 -27033 -12022 1964 3601 11721 1910 9746 32339
20593 32339 16043 -11807 -22467 -37195 -46003 -35290 -41063 -56984 -49692 -56005 -31313 -20101
20581 -20101 -13739 -13898 -19187 -507 15871 17919 3579 -6961 -23067 -11772 -1395 26680 39591
20568 39591 16369 -2102 -15188 -25317 -51272 -25551 -21252 -36018 -54119 -59395 -39795 -53367
20556 -53367 -47418 -35777 -28902 -3897 2405 -2200 -9517 -23855 -35285 -32673 -26974 14364 7180
20543 7180 -5989 -17823 -23645 17044 29454 47465 58071 28221 12905 -24211 -59547 -58174
20531 -58174 -58406 -49171 -34328 -46787 -44752 -37194 -35326 -28270 -9282 -8399 -22416 -6110 -3364 -24968
20517 -24968 -29029 -16887 -5902 -18281 -20904 -36809 -56955 -36446 -23560 -406 44155 41350
20505 41350 34506 19061 10347 -1980 10096 29 -7726 94 -30462 -21984 -18592 -12708 2623
20492 2623 33062 12011 -14714 -8262 -1376 4709 13834 8574 -16449 -36183 -32045 -17035 6503
20479 6503 32448 38234 17161 -162 -13503 -13920 -9821 15097 27914 -1491 -28991 -32921 -552
20466 -552 5236 -13026 -32355 -44802 -38774 -32849 -24026 -8731 -24752 -38877 -38561 -17427 -18905
20453 -18905 -28788 -11142 5535 -2351 -34959 -38446 -12276 -9933 -14084 -58 -9299 -21006 7866
20440 7866 19164 30015 26436 -12305 -51717 -61464 -38400 -4000 -10366 3466 -14456 -18822 388
20427 388 11033 -13414 -31468 -50456 -43302 -35574 -27528 -13098 -5850 6051 6296 -18628 -44101
20414 -44101 -23025 3035 14305 -12309 -8063 -22889 -17905 -14667 -3234 -903 -13055 -10325 1014
20401 1014 -1248 -3425 23995 -2324 5388 30082 35935 13583 -4236 20929 16648 22906 19261
20388 19261 12142 25771 14183 551 -16271 3621 -6976 -26818 -23812 -37063 -44566 -34420
20376 -34420 -13679 9141 7124 -15425 -41841 -30307 -21976 -50928 -77690 -48451 -17839 4143
20364 4143 -15191 -21554 741 -7214 -3930 -9347 -20050 -46935 -44968 -11079 -6589 -2416 -10587
20351 -10587 -33413 -39682 -40676 -34783 -2513 4392 -22156 -11210 10027 17231 18702 13570 40976
20338 40976 19747 -2555 -13109 -25019 -8048 -12618 3198 -12507 -11320 -11953 -11889 -44224 -44426
20325 -44426 -32045 -13615 -8277 5439 -5588 -22181 -29850 -35640 -37059 12215 29498 21408 19679
20312 19679 38176 29755 15706 7884 -3328 -15161 6882 -3079 -9873 -7673 -12788 -4208 -12474
20299 -12474 -31755 -33140 -21956 -53667 -48036 -28646 -34087 -34072 -11159 7685 -3968 -802 -31448
20286 -31448 -57239 -57328 -44625 -43248 -25671 -12749 -11894 -17247 -5648 3139 -18665 -43849 -28698
20273 -28698 -18897 -27382 -27540 -44821 -22072 3827 5705 -10693 -34082 -35299 -53838 -65968 -66644
20260 -66644 -57680 -12796 15313 22593 24466 25126 -3522 -17961 -18207 -19372 -15171 -4775 -1941 -4532
20246 -4532 -16550 -30481 -28466 -13905 4428 -912 -10531 -17252 -3561 -442 -251 2381 13314
20233 13314 27476 -5028 -35786 -24152 -35107 -29292 -39068 -14926 -34735 -38261 -26443 -22764
20221 -22764 9016 18444 34264 33571 25842 13039 -2520 -10427 -18571 -37776 -29167 -32712 -28256
20208 -28256 -26707 -11262 -1904 -1579 14138 4959 -10715 -30152 -26643 -18563 -8829 -7636 -5559 -13560
20194 -13560 10035 10345 -9926 -41264 -49220 -32523 -13561 -16340 3838 15384 8859 15885 16814
20181 16814 -7401 3981 13696 4584 -13520 -32921 -31162 -15077 -1417 -11940 -44400 -38542
20169 -38542 -10469 -17232 -16549 15307 17971 17177 20290 31788 32437 23993 21062 26061 31006 15444
20155 15444 8423 20463 37504 25977 4726 -1123 24372 39216 39147 43918 9978 9488 8053
20142 8053 26184 30366 46437 43273 36428 30536 69953 111602 136144 162736 190765 270615 339099
20129 339099 404447 483283 545145 583410 665306 758396 804230 820490 840716 836345 804574 749924
20117 749924 674148 636160 568851 487722 417566 337174 257765 220869 189089 134472 83194
20106 83194 73018 76378 54492 66347 87191 62685 38549 22009 23019 7373 1709 14462
20094 14462 9182 5477 10838 23577 25934 46923 45734 54369 72875 86189 88867 78474 26546
20081 26546 2714 -10789 -9981 -9102 -17951 -9928 -3867 17174 19476 50469 61493 66508 72239 86191
20067 86191 87021 74054 85238 51139 33074 52141 38975 43971 34763 34891 44996 57113 58071
20054 58071 42836 58449 43631 11784 6884 14227 323 -5736 -31983 -33899 -20368 -36447
20042 -36447 -49199 -61930 -52600 -30329 5420 40838 47249 57990 70590 74641 68902 62282 38003
20029 38003 5678 -18968 -38707 -23301 -14409 7283 -20292 -43084 -44770 -23251 8890 22116
20017 22116 -5226 -31503 -39577 -36343 -45619 -50469 -43886 -31117 1492 25282 1239 -24329 -28212
20004 -28212 -9141 -4374 -34579 -59276 -60626 -62263 -24974 15484 -14792 -29764 -12227 -1807
19992 -1807 -12954 6357 25956 15040 -1036 -11960 -25674 -22045 -25322 -38681 -17124 -8890
19980 -8890 15790 32309 32474 48490 40014 39085 53851 84846 52993 22567 4096 1119 -4342
19967 -4342 3399 23647 30490 2249 -7832 475 5938 12177 28664 28434 11593 -2871 2172
19954 2172 -8905 -27916 -26690 -33349 -23888 14989 25216 48683 61930 71338 93888 118494 138776
19941 138776 160897 160214 179880 195627 206174 207907 201700 201340 184601 153749 146942 128622 111649
19928 111649 107961 74370 37734 41601 44914 35276 29191 9675 -855 7477 -5611 12266 34608
19915 34608 37281 35668 21276 8976 76 -9484 -25265 -33564 -30701 -49524 -55020 -55241 -34547
19902 -34547 -13674 -17184 -1483 18377 52465 54117 46958 24181 -3628 6023 30660 55421
19890 55421 48153 38935 26832 15676 -13177 -21853 -2277 6456 27677 4094 -30946 -17937
19878 -17937 4611 10846 -284 5495 18867 -2691 -20093 -17660 -25147 -6514 25182 60652
19866 60652 62111 75683 97311 122477 104264 100071 108407 146131 182762 202079 251840 277287
19854 277287 308174 328504 316221 310258 283439 282219 267826 235118 198131 175728 149592 108146
19842 108146 93580 111567 108940 96333 72568 38755 26741 12760 15540 13128 5371 6852
19830 6852 34165 57806 41103 14582 15141 9432 6079 37635 58152 67555 70104 55262 35582
19817 35582 26043 13768 -11553 -24872 -1701 9634 -2177 -14553 2928 24675 40219 38877
19805 38877 44616 37865 42279 30361 30621 60225 97239 137328 122717 98590 86884 107857 119505
19792 119505 142750 135943 129707 146438 161618 126359 88050 71006 68039 100063 106688 118909
19780 118909 128097 126523 120548 115347 131949 148442 164876 195992 207196 229840 263740 311836
19768 311836 323280 283450 228283 197125 166643 137431 119308 101388 86007 75485 52749
19757 52749 52966 49288 47536 62068 81691 78148 76870 91188 105007 112962 93294 82497 91333
19744 91333 95737 75077 72296 46925 32342 43419 51937 16286 13095 41980 28309 6664
19732 6664 28205 59134 69217 39881 27008 22958 29397 30889 36031 13612 -5969 -1794 4954
19719 4954 15008 3861 -15773 -11753 -4705 3511 -5236 -10537 10352 -8443 -9676 6673 24199
19706 24199 5544 -8425 -24347 -3339 17157 21798 31505 24946 42095 43199 60338 58596 66055
19693 66055 78747 61135 33956 13205 32295 59291 60860 71940 75205 89887 144519 192180
19681 192180 231809 264140 293124 295360 291514 280075 270141 244017 213571 193435 182801 208276
19669 208276 238529 245474 251259 265945 248671 259100 306088 346561 361731 378680 384332 371983
19657 371983 369508 374193 390954 358769 332894 349811 348916 326949 333925 329278 315935 329300 338705
19644 338705 318777 331803 354795 361694 382045 409755 453448 514421 594934 642614 629780 599417
19632 599417 618044 646247 655767 642933 650398 673822 685498 669235 685344 743117 731891 710933
19620 710933 669483 650801 622579 559271 503386 488815 466418 436706 422740 464833 493581
19609 493581 483718 462238 477927 480504 466946 462047 488790 522578 543795 572988 608542 642675
19597 642675 673981 703843 762765 844032 934883 1014146 1053691 1075410 1102542 1160698 1215271
19586 1215271 1285998 1388045 1495844 1615374 1799503 2002714 2179001 2347541 2529747 2661262
19576 2661262 2725457 2757286 2820378 2872718 2887968 2902281 2972353 3107149 3281313 3466061 3711255
19565 3711255 3987297 4319360 4725111 5165162 5712690 6358793 7180087 8191378 9461033
19556 9461033 11189472 13579193 17011941 21972501 28378705 35894722 45500174 58253292
19548 58253292 71383819 81149272 90666245 103138578 111702316 111924073 111322624 114553478
19540 114553478 114123792 107614490 102973399 104905729 107693018 104502287 99418776 99009848
19532 99009848 101167692 98793982 90122040 81183782 74431302 66134959 55293574 44703624
19524 44703624 36328778 29556682 23448758 18277217 14435094 11738966 9841607 8499450
19516 8499450 7569085 6843308 6275075 5884825 5578491 5282843 4987691 4724930 4474218
19507 4474218 4204597 3946786 3735102 3531356 3321512 3130210 2961147 2770074 2617372
19498 2617372 2518218 2414967 2242971 2051666 1918341 1774439 1621115 1465021 1321877 1200994
19488 1200994 1091529 1038332 988458 931255 867282 831617 813705 783438 740007 724920 703535
19477 703535 642154 606477 600907 606230 594821 576629 542417 515021 495897 469424 438492 425830
19465 425830 416435 406692 391420 366972 370304 388479 348414 326311 341123 327783 350924 374617
19453 374617 365699 371678 367767 355815 321297 307906 300099 300086 312619 314934 283366 244093 236183
19440 236183 233885 220190 206863 218612 205927 180107 157925 176714 192788 221422 223778 190865
19428 190865 158046 175182 177516 178510 179299 168964 169683 189363 211851 216848 214728 215396 224155 234482
19414 234482 231408 248234 255559 255507 245484 235971 261685 290541 301503 296218 282360 280230 276632
19401 276632 266397 253065 241622 260314 249419 229463 224995 224476 219341 199706 174405 152320
19389 152320 158685 179516 179863 190486 183886 168580 178100 166433 174042 163729 166640 149213 135128
19376 135128 156635 147786 169179 194124 177094 153768 135048 120320 104767 137392 131712 130721
19364 130721 138339 136223 128476 131261 138365 120269 128275 130326 141722 128224 136954 131874 120380
19351 120380 95756 98719 94199 95830 112494 125826 120411 92302 88240 69309 46776 38527 39856
19338 39856 52239 76196 59945 37778 41992 59074 55951 68115 115876 157667 139372 114917
19326 114917 120840 102980 85021 65677 79749 110050 127400 137650 137411 131013 111929 90257
19314 90257 88054 107032 119512 113086 104313 110715 104774 114528 111289 102965 78448 89506 131679
19301 131679 118100 92792 97017 112355 101566 93050 95923 76073 79999 80444 52701 66995 105127
19288 105127 120818 92970 74314 79953 99865 99272 103098 67264 45900 55295 58264 63591 70358
19275 70358 86014 81226 75499 91238 83822 66382 39517 45060 48459 54439 66931 50695 41431
19262 41431 58327 87955 95413 92793 79075 32253 33778 54932 36423 39285 59897 64084 71855
19249 71855 69347 44176 26252 22709 42789 45642 28993 9782 4993 15596 34183 46796
19237 46796 49836 30776 9683 16238 49178 48905 56744 104243 106447 98429 101658 115106 119152
19224 119152 121753 112839 88652 82753 118274 124120 131625 94564 98414 106967 88129 77193 69985
19211 69985 60656 75558 59552 67122 96627 93156 65071 80314 84031 88467 100963 112352 113462
19198 113462 60681 26030 31070 34988 22239 8248 -1538 -1511 14504 48370 41387 42618 19645
19185 19645 9518 7093 11010 17028 32858 30073 40504 34674 34449 55070 44033 29254 40629
19172 40629 43980 37939 30326 24893 35995 56710 40227 26433 51848 62758 86940 77779 36411
19159 36411 18323 -13217 -16652 7597 -1779 27585 58499 76242 43868 28829 17284 7264
19147 7264 -7483 2180 4142 -24221 -22876 -15368 5433 24646 34161 44536 30552 13574 8658
19134 8658 12758 -1012 15381 49026 56392 42203 37814 32417 36781 29809 37338 14562 20619
19121 20619 16345 4775 40223 22844 7664 3281 4810 16287 13005 15684 15233 21626 7591
19108 7591 -5473 -6782 1192 7194 25960 35659 30448 30077 15990 47321 63489 27900 12683
19095 12683 -11965 9100 27427 14243 -12252 -15895 -12950 -19430 6750 13471 31155 38151 19120
19082 19120 31234 35620 28308 19994 19127 22185 29245 29134 42419 55101 39654 31182 6568 -6883
19068 -6883 13886 17045 18868 26635 39333 46643 57576 45830 39699 13565 -9019 3434 4306
19055 4306 6184 5621 309 11270 23258 38368 21821 -1480 -35268 -21094 10209 38749 59753
19042 59753 44454 53954 43755 38734 46632 67708 69150 42842 31651 60673 88155 86329 87148
19029 87148 86995 92568 117125 124140 105749 99017 124156 131641 155970 195315 222985 245655 257867
19016 257867 254996 260496 225237 203449 196691 178148 149108 94203 77705 89548 154853 143706
19004 143706 119733 122903 110475 104831 115039 117089 103713 92514 106781 81575 82436 61017
18992 61017 43958 45774 84314 95928 76972 46692 46967 47134 49437 45907 80842 119269 123980
18979 123980 121475 139029 155830 146046 167356 177905 189380 203058 224624 271553 320013 398087
18967 398087 498046 566900 646832 724271 814065 860893 824294 753214 672909 567296 475464
18956 475464 402351 351432 315961 277342 235981 215013 184575 179367 167502 159494 173651 187409
18944 187409 193518 228534 239790 235269 255508 330120 396908 450346 487322 517811 529994 527015
18932 527015 526720 491021 432757 394668 345268 298448 279337 223395 186292 138844 137715 142765
18920 142765 148617 119938 120408 97018 97866 138994 152669 148810 150494 213658 208301 214508 211649
18907 211649 208225 219653 210749 182329 152697 165145 178571 178417 187450 206088 223278 266726
18895 266726 295877 309088 298870 298013 311134 293068 265390 229108 200135 193884 189051 205272
18883 205272 226121 211234 179492 126357 116942 118027 90068 53978 67737 61445 52384 53522
18871 53522 53022 25583 3628 9719 35851 57854 75753 88318 131993 158952 185782 184487
18859 184487 149437 142464 149949 157979 172725 195943 233617 251299 285591 287819 291461 319036
18847 319036 333330 334491 347762 371784 340471 290156 265720 254838 262452 268046 262543 264280
18835 264280 250085 251375 241073 244868 252927 220782 189866 153891 121056 86551 69771 42637
18823 42637 49102 53240 46704 67169 59983 52932 66448 65120 46681 37408 50187 65577 86240
18810 86240 62996 49649 38053 45179 63838 53119 31322 44399 30231 18574 12097 22403
18798 22403 70081 74743 45596 47436 31332 42336 57397 51229 34430 38487 53224 42853
18786 42853 42860 77608 90616 64678 46375 51469 54238 49362 44948 41800 72685 84472 79849 34712
18772 34712 47012 79429 98484 123738 150997 237769 303133 254041 148374 82452 48385
18761 48385 37217 12179 20593 27519 31538 21314 33762 40397 62205 77425 79334 66330 66717
18748 66717 81962 59210 26348 17141 24936 40356 44430 39926 27932 35583 40701 51892 63014
18735 63014 61201 51607 32471 37259 48190 44991 40722 51685 56627 67718 66380 64686 88397
18722 88397 87863 78066 55618 34147 40105 17983 28012 20055 15520 26224 50918 49317 40213
18709 40213 16728 11468 29034 36132 17319 25363 -444 -16189 -36935 -36686 -27166 -1364 14390
18696 14390 12596 10100 26549 38382 24674 14167 211 10841 46363 50583 53640 54514 33557
18683 33557 17143 28925 54575 46949 43234 36299 31366 57670 69528 70132 50061 32824 34141
18670 34141 19223 34603 75162 80136 60473 39469 38979 37808 26099 29363 1262 1614 34816
18657 34816 43108 53597 75271 93182 66452 38935 30782 30540 39675 52391 51699 30787 24942
18644 24942 19955 39147 50032 57208 69363 91164 80594 76392 77549 68162 56677 67515 69918
18631 69918 52103 63762 57726 66360 71857 64577 76605 85773 84346 69824 68348 58838 36779
18618 36779 35250 11966 -8784 -8860 9863 32796 73112 93328 100668 109813 117714 119650 130181
18605 130181 143965 115663 113302 143344 169065 197230 200700 218716 228035 214724 213419 216330
18593 216330 197301 162629 174918 167238 142824 133672 160654 122834 108182 98548 120523 148364
18581 148364 153671 130785 114247 116064 117112 93393 88704 95458 74226 52592 56113 38249 53637
18568 53637 33321 42937 41276 50988 43605 52032 50565 57501 61823 53181 70206 83047 101843
18555 101843 116162 130040 111781 97199 112986 117444 107545 87594 73806 96160 138519 155748
18543 155748 190216 229716 219666 202738 229926 232160 243925 229021 191678 176039 165313 146401
18531 146401 140053 117967 84604 78094 82087 87964 116198 126261 145323 173021 193931 195714
18519 195714 193466 210043 216568 234308 247488 245918 260367 270005 277962 267418 272411 288307 325809
18506 325809 340098 332393 282990 271507 278878 277935 296369 292143 252019 242281 215663 181242 176648
18493 176648 181508 186258 209362 196912 222192 265766 300165 350288 425168 467573 518889 587449
18481 587449 607006 606812 575250 514300 455394 401629 394412 407550 458422 497521 483245 481558
18469 481558 523445 583104 645610 673404 707516 732736 748283 739235 711333 705871 704082 690849
18457 690849 648806 607592 571772 578098 576196 586572 584450 601961 637192 667335 675940 688317
18445 688317 692440 688076 662821 678479 745780 845784 916780 991239 1057903 1132122 1214257 1334815
18433 1334815 1502154 1699020 1869254 2043077 2239688 2397994 2509907 2622018 2728954
18424 2728954 2828406 2936024 3057693 3223677 3517289 4091645 5024006 6211972 7354330
18415 7354330 8521933 9581137 9856103 9502138 9066278 8630031 8227751 8019108 8161165
18406 8161165 8666702 9647337 11425062 14463558 19651281 28198156 39940809 52048850
18398 52048850 64776402 78706401 86095996 85018565 80861958 73469274 61721900 49382523
18390 49382523 39393400 31902866 27048200 25176441 25532216 26723240 28489583 30238748
18382 30238748 29793342 27123230 23753620 20029356 16098813 12675204 10223764 8642498
18374 8642498 7641319 6954974 6460889 6095046 5861311 5701347 5616891 5594515 5689189 5919444
18364 5919444 6285090 6875368 7833262 9376052 11786318 15376807 19730808 23967512 28167901
18355 28167901 31928355 33050032 31673909 29745034 27895100 26555629 27140313 30981819
18347 30981819 38392451 49143171 63855841 81201829 95176724 104638068 111511475
18340 111511475 108737287 95149551 78950383 62815153 46645992 33079035 23812291
18333 23812291 18090818 14537896 12326902 11032268 10531072 10802261 11618093 12486756 13374073
18324 13374073 14252898 14095590 12744439 11086415 9341721 7497111 5870260 4687543
18316 4687543 3910732 3394176 3104762 2896444 2746900 2635330 2523552 2401769 2228656
18307 2228656 2031284 1800203 1602282 1434546 1282170 1157847 1083171 1040280 999929 959775
18297 959775 953547 964818 980757 996680 1006892 981922 916825 859679 778496 736893 683153 629861
18285 629861 613868 585395 566806 540894 521975 511700 515877 530506 526641 518698 518485 552825
18273 552825 564661 583361 617941 637008 644917 655150 605484 606708 618411 593328 559757 571206
18261 571206 591083 574676 537612 483209 424205 384528 375440 366838 352617 378393 406127 396316
18249 396316 404327 375442 321981 300163 324454 355756 358217 357101 410934 456225 495053 527790
18237 527790 552132 553314 521359 461688 391590 324387 289586 269158 224523 222036 252937 282786
18225 282786 269310 275572 275900 259201 248259 254725 247566 236859 234491 245601 236821 250000 261849
18212 261849 299140 304058 283345 255491 255580 241669 234970 255671 288890 291098 258366 246449 251362
18199 251362 248009 247493 229755 209935 203776 219261 230644 253992 225755 198617 212591 224886
18187 224886 216568 199674 196727 216667 246973 260666 224141 190548 194132 205046 196618 193252
18175 193252 198042 222726 227100 228280 217837 197026 201219 236439 232332 220319 208753 223512
18163 223512 235173 242119 269850 306509 311300 338525 425187 480298 514569 529847 546932 540854
18151 540854 527658 513507 488390 440987 410288 420122 430676 434725 418569 399730 392092 400023
18139 400023 413710 412169 414775 412993 424502 423492 455197 491923 508829 547759 573006 613410
18127 613410 657364 698550 737484 821934 881249 943163 1017584 1163152 1420050 1731567 2069391
18116 2069391 2503840 3111305 4036070 5483071 7817554 11888057 19533327 33546924
18108 33546924 51375352 55040839 41003470 24586870 14814304 9681094 6810001 5105143
18100 5105143 3984467 3174563 2576513 2138103 1808768 1579090 1381028 1214539 1081448
18091 1081448 967148 861462 751066 658440 641803 608746 578916 547882 542462 570090 616141
18080 616141 617441 606040 578247 547068 508629 484602 473050 479119 492152 503687 495844 497149
18068 497149 492887 486518 473866 472149 467121 443358 403708 382661 380654 384382 376170 358774 314939
18055 314939 306833 322761 314517 322261 340244 332883 316536 299203 293597 303441 290055 282154 293702
18042 293702 275641 270245 267477 262135 273907 333519 354316 368980 360613 376585 405922 434081
18030 434081 460252 489029 485767 523739 566621 589296 573164 527775 507661 493310 475878 478356
18018 478356 495445 527917 550536 557324 555252 581078 589590 589792 596537 576524 567342 550445 561839
18005 561839 558204 548834 574420 603948 644466 692104 766201 863248 931770 962658 993495 975782
17993 975782 969250 971665 1006254 1029704 1033740 1010783 1046570 1095115 1143413 1239642 1345560 1425407
17981 1425407 1545422 1685175 1809285 1941544 2139806 2418192 2797548 3243740 3682270
17972 3682270 4141956 4721543 5563911 6967558 9144933 11874990 14407484 15540121 14816909
17963 14816909 12931401 11023592 9837188 9529076 9945009 10831544 12141116 14022617
17955 14022617 16799227 21263021 28826965 41677292 61796927 87615823 113427291
17948 113427291 128684512 128182883 114338610 93593844 71995305 53499513 39718212
17941 39718212 30672162 25593103 23596836 24365603 27754588 32811184 37336550 38404305
17933 38404305 34817761 28277100 21383509 15842726 12116337 9792726 8406581 7537068
17925 7537068 6958723 6566238 6268707 6040325 5853673 5731629 5684102 5717816 5829565 6024962
17915 6024962 6328378 6896952 7781165 9118524 11182454 14451813 19373816 25518609 31237548
17906 31237548 34006098 32709273 28765806 24603912 22009556 21726115 24042932 29351859
17898 29351859 38112701 50308919 64981016 80574519 93801706 100880903 96438891
17891 96438891 81011648 60763430 42326426 29021356 20712707 15738484 12680708
17884 12680708 10686016 9323408 8375528 7800027 7556412 7731129 8454549 9603507 10706750
17875 10706750 11050301 10221473 8603973 6903816 5591857 4697826 4088520 3598395 3104267
17866 3104267 2629726 2240472 1926538 1739802 1611977 1475234 1331411 1228471 1158582 1094386
17856 1094386 1005864 951541 919274 879892 850398 825116 786345 779866 781699 772987 772182 766085
17844 766085 760163 769807 746020 712256 671346 646314 616349 558472 491626 469759 456803 462020
17832 462020 455298 465817 467141 462925 454928 444550 445198 482810 482487 507175 512984 498707 475753
17819 475753 409133 363751 363915 374453 381795 405240 428694 416321 392070 372982 360357 330386
17807 330386 317335 292604 288321 286997 274192 282101 288676 284957 288205 267057 250841 212314 208758
17794 208758 209994 220982 204445 183882 181532 193917 208516 190139 187788 154420 156218 172527
17782 172527 176236 174884 210019 221628 208044 210488 230771 195335 192350 195185 182291 190375 181222
17769 181222 179177 208379 212758 193220 186421 185221 167601 157899 177036 177970 190658 220619 217812
17756 217812 193570 180872 145083 109594 105982 112139 104893 128096 165710 193243 198393 203566
17744 203566 179924 170368 185955 215530 199840 215450 260982 280466 283657 262980 233982 227128
17732 227128 177413 165363 156676 168889 193946 201738 218088 230802 213193 215377 214634 212710 207122
17719 207122 203460 191943 171413 166195 164815 182826 181778 161173 163256 163941 153535 174677 210327
17706 210327 267692 324262 400156 460168 497520 473035 413915 331654 288609 242857 205626
17695 205626 190206 170827 166655 179260 180191 209821 214177 199911 207025 205250 223809 196346 171195
17682 171195 126500 103543 118877 112100 76177 45755 14677 39570 89541 115446 114215 99116
17670 99116 93697 111644 125546 118909 115585 120484 134328 143952 158691 165938 170564 139417 125635
17657 125635 128308 130653 135065 159726 212049 221160 256689 306263 346187 401582 429098 427388
17645 427388 397290 316165 222714 166961 128138 127127 105704 120361 177895 200783 206653 174965
17633 174965 145975 114469 112972 108002 90657 80762 83988 91416 66049 84231 94220 83878 72735
17620 72735 69937 67748 85782 93599 73799 49759 68302 83374 63553 70360 78055 74529 71755
17607 71755 78956 76365 38793 8288 19882 28309 16214 18451 53599 40396 52525 48138 50385
17594 50385 27446 36386 39893 54357 53394 41048 28664 22542 17118 21961 26845 27230 49080 68715
17580 68715 53092 52279 60224 30444 15694 -25709 -43522 -1133 46216 43249 34598 44406 22053
17567 22053 8330 18524 35627 70844 76316 38098 25285 44655 32427 27253 27991 32106 30428
17554 30428 13241 4504 10557 15944 7249 29667 30491 25979 46188 33498 17394 10547 27800
17541 27800 52489 51520 43978 46913 22428 20125 46944 50740 21291 40579 50013 35933 35442
17528 35442 18662 -779 -9846 -3725 19863 12351 17247 -6749 10807 12678 20183 11227 11440
17515 11440 5718 6087 3856 14916 21514 7776 23112 36272 28226 -3232 -30231 -20051 16380
17502 16380 33542 48106 41669 4568 542 25056 13718 16585 18026 14034 11388 33595 31439
17489 31439 43238 81100 85898 90469 65224 47611 41000 44549 8506 -23558 -3816 -141 -1096
17476 -1096 -2463 -5428 -13645 11383 9839 9562 23079 25774 36990 31519 -2377 -4004 353 -6175
17462 -6175 8626 11881 25754 55474 48599 29882 27821 23075 38034 67179 90204 123522 138159
17449 138159 125328 111486 134937 130426 128362 160024 239489 364463 470856 488079 442758
17438 442758 395213 350941 333834 325739 327346 334664 329583 296297 243916 217544 229395 276840
17426 276840 306529 369690 423595 418030 361637 326547 271651 212613 175615 167017 134346 99295
17414 99295 75779 80445 73506 73589 99930 118915 133377 108392 84303 69254 64304 49268 53541
17401 53541 77920 71892 73851 70913 89767 100500 115681 98152 112240 132463 167528 207807
17389 207807 242393 264796 265953 269183 310915 339736 365933 332698 259700 165988 117526 102028
17377 102028 90440 99736 146967 152658 135872 128136 140977 190799 229554 245909 268230 274324
17365 274324 256605 234899 203866 164023 139921 128105 117392 70979 33172 23392 36042 64074
17353 64074 78337 59287 45956 -3239 -19703 -17160 -4614 -3895 -18394 -14422 36337 29693 40373
17340 40373 32316 2150 27508 24564 -1640 -101 -23171 -31097 -17378 -21657 -6981 -3872 -6062
17327 -6062 -25450 -11278 -18116 -33586 -42820 -29520 -14837 -24586 -6648 -3976 -28250 -34119 -8532
17314 -8532 7696 28823 30789 25674 14619 -1188 -23797 -18696 -32183 -32969 -34167 7193 -2426
17301 -2426 -6460 2614 1318 5023 12848 16362 4679 3533 17733 58562 59485 40090 57641 90635
17287 90635 83309 55133 38806 45569 38607 30359 29949 13716 27819 30439 18327 -48806 -46237
17274 -46237 -30543 -12272 10888 37070 7625 -20063 -18470 -21820 -5593 16012 14166 21224
17262 21224 14915 -8751 -13438 -11325 -7258 -8827 -24347 -20574 6923 13285 7687 37192 34792
17249 34792 34250 22864 7224 11714 205 3909 -5387 -6617 -3810 -3975 -13069 -20582 2239 24937
17235 24937 17242 7405 -10791 -2159 1167 11504 15902 21719 2984 -32412 -37317 -28268 -26248
17222 -26248 -43160 -36880 -11320 19685 6880 -20751 -7086 10469 23463 23377 6524 -5645
17210 -5645 -17909 -11579 10204 9741 7302 -18950 -30183 -26966 2846 8125 20744 17149 13526
17197 13526 -10856 -42601 -33144 -13540 2377 -6215 -26718 -40679 -23570 -18409 -4363 2193
17185 2193 -1502 2882 30494 29519 28561 21357 -24039 -28825 -23805 -18980 -4991 -22324 -37193 -29397
17171 -29397 -50780 -61733 -5771 36166 7792 -16212 -14358 -30745 -35551 -46710 -39645 -33955
17159 -33955 -28146 -3401 -11503 4417 31026 17820 7588 -4745 -21218 -19086 3986 20814
17147 20814 27851 59 -34275 -41122 -36502 -46097 -53717 -23185 -12422 8141 7240 -487 2147
17134 2147 -2590 665 -4703 -8245 11710 36925 28360 -2785 -22326 -22611 -5540 -13367 7228
17121 7228 11821 12288 22206 5745 -24539 -15758 1803 18811 18007 -745 -6604 6577 23476
17108 23476 11871 1267 23184 33688 5759 24260 52007 74324 62257 21545 15290 9296
17096 9296 12517 7754 8331 829 -11358 -23462 -7747 -10278 -37981 -52397 -40372 -52087 -47421
17083 -47421 -23018 -4752 -22061 -2728 3965 -6947 1338 -8499 -20395 -17395 -23910 -58950 -58089
17070 -58089 -49216 -46304 -36870 -41840 -57989 -34849 -17254 -29351 -30722 -38866 -73817 -78678 -46776
17057 -46776 -16638 -9317 -28103 -41140 -8604 9042 24220 9047 -2186 2654 7645 -1003
17045 -1003 -5236 -10304 -20312 -9328 -3578 -13656 -37398 -25075 -25347 -45839 -57055 -55965 -58942
17032 -58942 -72723 -41579 -16424 28510 28269 20912 20109 22834 44073 51709 31389 13230 23174
17019 23174 9239 -16363 -35029 -28579 -31424 -37136 -27361 -31333 -15707 -10707 -7121 -17451 -20110
17006 -20110 -30312 -48360 -29986 -16069 -7290 -14121 1515 27803 25638 -5116 4964 8469
16994 8469 -8199 -18892 -23046 1553 20044 24962 24813 48954 51179 1010 -36698 -47768 -39246
16981 -39246 -51207 -39858 -10320 -7164 -1444 20439 8086 15263 25809 36100 34352 26918 10049
16968 10049 6841 6776 12759 32304 26968 14536 -8769 -24409 -45270 -26149 -7450 17975 23237
16955 23237 27317 22651 20426 12024 13282 23822 11985 -3961 3272 -11439 -34699 -22518 -9656
16942 -9656 -9375 -31444 -45275 -40138 -6820 -11309 -3212 5137 6529 -7564 -1563 25120 33813 24978
16928 24978 14275 -33099 -39907 13511 41703 9534 -4464 -17247 -23664 -42343 -34986 -8210
16916 -8210 4408 -6935 -23059 -8144 -9261 -24083 -7116 1107 12397 6106 13829 12457 -7357
16903 -7357 -1627 -6429 -21042 -23074 -25861 -7674 -14505 4038 2141 -11373 -23754 -18677 -9942
16890 -9942 13499 19834 6236 -18055 -1755 3639 1377 -9067 7628 32045 40121 53009 42870
16877 42870 34035 30494 12467 -8396 -23780 -23672 -27995 -20231 -5955 -10612 397 12085 16120
16864 16120 -8267 -38016 -45401 -9260 4979 -12917 -36638 -36592 -18442 5272 12200 -1146 15856
16851 15856 29994 20683 14380 32369 14660 271 -8498 27125 46550 29628 10539 -4073
16839 -4073 -5335 -10475 7943 8790 -634 -2489 11240 22585 34164 72098 90213 68632 44958
16826 44958 42221 40023 42244 10441 25551 27206 15141 6874 22695 30141 4501 -2365 21573
16813 21573 38063 72884 87447 74907 53350 42506 54717 65113 65536 45423 47576 57924
16801 57924 60903 95858 108660 110370 104372 127179 154580 158460 159250 169161 199333 240648 253563
16788 253563 258216 305327 314373 303946 292033 287918 287750 318105 365578 364049 314784 282443 269735
16775 269735 244679 232930 183148 137578 119046 108853 108890 104046 85006 77676 72684 57666 68325
16762 68325 66016 65246 61553 49461 33328 14812 21405 35732 45168 38902 56093 41133 10738
16749 10738 14803 5312 14230 35868 57167 23100 -2810 18273 10354 -7101 8086 5009 -559
16736 -559 -2684 -19531 -2117 2604 -20779 -19562 23936 28676 -19859 -25960 12276 -1572 -19167
16723 -19167 -38020 -58700 -39066 -25073 -23596 -43275 -34046 -31366 -25870 -17180 -18037 -36883 -32963
16710 -32963 -41734 -55107 -12891 -25428 -5863 18037 22800 11878 9968 -6370 -16277 -6745 12416
16697 12416 1526 12549 16643 4656 4280 10473 9784 16373 28386 31078 28889 48941 46257 75646
16683 75646 82665 52192 34598 45127 16023 -8001 -308 19347 35326 25717 2767 612
16671 612 9472 2250 -28681 -3932 1733 -26708 -24576 -13400 -2182 2067 -6865 -18674 -42864
16658 -42864 -61818 -61403 -23174 -8653 -43867 -13398 10830 29350 43313 -4227 -5513 20466
16646 20466 16724 271 4276 38236 44764 22083 -4768 -19851 -19533 -42838 -53963 -39508 -23100
16633 -23100 -19255 -18937 -7847 2229 8724 -1247 -148 30742 57083 34274 23027 26098 21125
16620 21125 17986 13631 11363 -8473 4096 -4180 -22416 -35256 -43109 -31683 -31765 -21587 19112
16607 19112 24012 33097 11027 -11637 -18618 -19162 -3621 -20503 -34811 -26908 -26787 -26183 5440 13452
16593 13452 -2222 743 16113 24192 39625 59032 36270 16899 41694 40721 44511 12620 7264
16580 7264 -2262 -4 10905 -7980 -7343 12565 14586 -8870 -8706 -20778 -24245 2119 -13477
16567 -13477 -27736 4271 39167 61309 62304 33429 -19033 -8518 2936 11681 9161 11666 3560
16554 3560 -41225 -44315 -18232 7543 3502 29049 51641 34327 12735 4126 -4494 -1738 10771
16541 10771 -3537 -23900 -44814 -52260 -51193 -58421 -55443 -37758 -3462 -3293 -4600 -28684 -16597
16528 -16597 7884 -9296 -23048 -5748 8024 6188 17691 27564 30037 35632 27249 29472 20285
16515 20285 13742 17615 28349 25081 1261 -2309 -18702 -31042 -34479 -24057 -26165 -28924 -13971
16502 -13971 -37212 -28586 -12138 -18152 -24286 -33511 -54080 -60227 -40482 -28972 -18594 5822 27480
16489 27480 30793 36747 18984 1862 13023 200 -24383 -3243 25568 13016 15206 10490
16477 10490 28388 27792 12435 12272 4230 -23035 -22105 -25982 -30866 -12734 -8895 23608 9511 5442
16463 5442 -1940 -27358 -42861 -35011 -31096 -36501 -15225 -7006 -1279 11207 19703 8515 -10518
16450 -10518 160 14222 42811 54514 51889 41327 36264 41273 61760 64997 63973 27573 -7348
16437 -7348 728 12925 16172 -1136 -25005 -22182 2803 -7963 -16939 -4322 17895 8120 -27226
16424 -27226 13386 -6656 -22370 -13227 -16814 -33350 -26461 -17187 -32251 -14274 861 6400 10090
16411 10090 3514 -5340 7369 17373 -10940 -12703 15883 42039 27075 -2458 -8564 11236
16399 11236 27419 47473 29397 4612 21763 54872 41083 21427 -9672 -18267 -9785 -3560
16387 -3560 -11307 -7210 -745 5481 -4409 11307 30762 41852 45275 26416 5124 -2961 21172
16374 21172 28855 9021 8725 -826 -37337 -35329 -7321 -20114 -36375 -36479 -38717 -12349 -14485
16361 -14485 -18789 -18827 -43988 -32543 -16569 -39297 -38024 -14373 -15351 7858 7546 -12552 9657
16348 9657 20870 4099 6111 10732 22455 34175 46800 57459 38687 19074 882 -2668
16336 -2668 -9541 5431 47439 44508 34400 62882 68282 61007 41784 15844 -2652 -8531 -14001
16323 -14001 -22675 -12429 11343 6115 -9175 -17425 19605 24491 25197 44883 45192 33181 -7864
16310 -7864 -14185 5640 48877 67751 63187 68882 38897 -4761 -5969 -23823 -30671 -34332 -23025
16297 -23025 -5889 2749 17285 15658 20247 2088 -2856 -2152 -13337 -31656 -26834 -21907 -10681
16284 -10681 -2792 -12787 -19083 -8479 -18206 -24417 -24042 -34760 -26162 8603 -1625 993 16520
16271 16520 30932 21128 -136 -3882 -13768 -33009 -30139 -4237 -5750 -742 -36443 -41710 -37490
16258 -37490 -29862 -18459 -6321 196 -5260 -2016 -265 -6564 13492 19811 25867 43244 31204
16245 31204 24844 24865 24722 42189 47924 48913 47764 61079 55165 40993 45070 15343 9901 5427
16231 5427 8428 28675 49135 49380 49006 50394 50799 48931 25209 12632 22739 31163 29942 23088
16217 23088 6224 4220 32512 57402 34699 12377 15219 -8049 -10006 -22751 -21464 -5694
16205 -5694 13257 7487 3943 313 -12385 -13171 -16709 -12887 -6756 -5613 -223 -16264 -16921 -22224
16191 -22224 -23040 -36247 -45063 -41433 -9741 -15880 -12511 6412 -19852 -29515 -40956 -46518 -43898
16178 -43898 -26176 -25443 -30385 -47524 -42162 -41057 -37527 -51527 -54092 -40871 -25436 -15364 -32159
16165 -32159 -37722 -23110 410 11341 34448 40648 -5137 -50186 -55902 -38236 -32623 -37645 -21419
16152 -21419 2282 -23574 -18035 -8274 -18000 5909 1611 -7954 3660 -12189 -28657 -26493 -21534
16139 -21534 -16317 -12160 -29173 -29896 936 10231 -12411 -42033 -27601 -30633 -20711 3646 5024
16126 5024 -7656 -9630 7670 23060 3271 -7366 25286 68378 39061 -17130 -27243 -11204
16114 -11204 -2947 11993 -4665 -20454 -5651 24135 -2946 -18210 -11940 -1580 -1761 -17223
16102 -17223 2144 -4055 -43845 -61737 -29567 -18671 -24837 -20113 -8378 -4727 -2151 -24259 -42488
16089 -42488 -47901 -31705 10439 37885 25210 -3678 10635 39453 21643 20668 -5704 -14076
16077 -14076 11278 23595 10477 10268 46152 33296 8390 -9629 -12258 -11929 -11824 -31803 -18522
16064 -18522 -8745 -8805 -5252 -13641 -25203 -18171 -8989 8528 6702 26044 16610 7096 18571 19832
16050 19832 13985 20407 34433 18498 -6747 -12481 -17783 -24055 -21628 -13602 -22476 -43306 -45772
16037 -45772 -18576 -1034 1294 -31359 -56477 -47197 -8409 2344 -27546 -55146 -63061 -37008
16025 -37008 -35976 -17634 -7689 474 -3698 -23654 -39124 -37512 -5228 23971 30672 17852 32113
16012 32113 42903 40221 6594 -34295 -53269 -42483 -24570 6561 -17497 -38186 -11854 1903
16000 1903 -3353 8804 29989 35947 35247 30177 18429 -6881 -13913 -21557 10436 22118 35155
15987 35155 36637 -7037 -32849 -22436 -39442 -32052 45 5125 -18090 -17089 -31366 -16175
15975 -16175 -11540 -38505 -19369 21407 19302 7685 396 1518 17711 2557 -32716 -37825 -40500
15962 -40500 -57557 -34600 10121 32916 22468 24299 30349 25040 28662 26882 11055 -3389 -17927
15949 -17927 -28914 -20106 -34192 -62633 -71208 -35540 -15826 6495 21091 20062 10262 -14030
15937 -14030 -13516 -7003 -18019 -38063 -31717 -21315 -1124 22629 36882 30975 23008 -5229 -35976
15924 -35976 -38973 -23435 -24199 -25518 -6619 -1930 9121 5207 -614 8857 10035 5596 20067 25966
15910 25966 6292 12817 21119 25656 15794 19426 6693 11089 13307 31081 25374 -4092 -6513
15897 -6513 25677 32323 18195 22242 13360 16045 20302 -2232 -9192 5964 13699 10906 14656 22288
15883 22288 8898 -17510 -27938 -26073 -25087 -15502 15146 41576 -25465 -47033 -49548 -32662 -18093
15870 -18093 -15672 -17720 -17034 -26133 -22191 -14060 -28937 -35010 -36883 -3034 35816 13174 -16791
15857 -16791 -15417 2143 2120 5055 5321 -651 -13866 -30267 -13195 -11035 8620 -15912 -43334
15844 -43334 -22877 3588 794 -22782 -20423 -40965 -30394 -6232 -11404 -6646 -18736 -16247 -7504
15831 -7504 -21369 -24072 -27939 -46915 -49671 -58389 -14203 14876 13248 -2321 -12085 -23375 -36185
15818 -36185 -40006 -63570 -51616 -45895 -41244 -39966 -24641 -15897 1616 -9122 -15236 -2850 -2105
15805 -2105 -7075 -27123 -39305 -25410 -20229 -11606 -1659 33294 51468 8594 -3819 4923 -526
15792 -526 -1690 -8476 -20411 -13891 489 -4354 16998 5741 -13408 -37598 -42738 -17762 1811
15779 1811 -5882 -7486 -11020 7636 13590 17311 11780 -15097 -4204 -6796 -4556 -3704 -7652 -26102
15765 -26102 -22003 -8482 -22173 -16244 6112 23504 9843 -22695 -31352 -41714 -50657 -62869
15753 -62869 -51350 -46378 -40019 -48005 -56745 -46729 -53730 -42437 -28040 -17069 16645 22665 14309
15740 14309 27976 22993 26167 24788 4993 -25198 -16816 -3123 23096 18229 -19593 -2242 30815
15727 30815 22715 -4770 5007 -5470 -7679 -11129 -11787 -7630 -7846 2967 12379 -9067 -19654 -33045
15713 -33045 -14849 1011 -14672 1581 -7019 -11675 -5775 -3815 -2286 -11412 -21448 -42214 -24650
15700 -24650 -1204 4587 -25625 -38319 -21219 -41565 -46036 -19957 14822 29581 -15271 -31018
15688 -31018 -7892 4511 29158 26770 -7092 -3979 5550 178 -226 6091 -2786 1620 805 4743
15674 4743 51100 51883 25165 1360 2407 1444 1401 -11213 17027 52954 37189 39134 16398 -36092
15660 -36092 -35494 -10863 -12279 -21116 -21486 -407 13243 13502 831 -1984 2679 -41716 -64780 -57794
15646 -57794 -47410 -18364 1652 20524 11071 -13149 -14321 -31625 -22735 -10630 -9231 556 -2338
15633 -2338 -13085 -25398 -2126 17672 28803 -5890 -14949 -17419 -28382 -34316 -19829 -32136
15621 -32136 -29123 -59248 -71262 -70394 -52543 -37654 -18137 -7037 -10004 -9739 -23505 -11728 9887
15608 9887 4711 -7171 -18631 -49673 -42364 -12538 -22280 -12562 -14232 -1936 7695 1645 -5704
15595 -5704 3302 -6661 -29700 -11649 10970 12523 7518 -1016 -10876 -23335 -46690 -45676 -13975
15582 -13975 12821 25282 30442 5577 -5301 -28733 -31602 -19273 4998 3604 -16423 -49338
15570 -49338 -37042 -17358 -6584 -27581 -21480 -20261 -22736 2769 -5481 -13956 -2037 11984 -770
15557 -770 -24105 -18693 -858 -5199 -18555 -9287 7211 -5359 3731 7068 -8734 -2707 20384
15544 20384 29951 -592 -4135 -2755 -20415 -12061 -5970 -8909 4747 12383 21259 14689 3977
15531 3977 -18507 -31773 -22024 -25887 -5370 17920 34613 33787 40271 46849 47180 19739 31057
15518 31057 44624 32284 29039 -441 -8264 10370 19215 1513 -18578 10561 33159 -3336
15506 -3336 -43542 -41025 -23124 -26983 -19631 2067 37519 42117 17518 9319 9811 17075 3703
15493 3703 4303 8065 -3622 -19949 -22884 -2638 21357 29751 17523 -1287 -457 -3747 -33717
15480 -33717 -24732 -58420 -43474 -6353 5180 -16543 -21664 -23268 -15562 -27100 870 21268
15468 21268 20632 3328 2255 -944 -64081 -79232 -48110 -33510 -50717 -16672 -4803 -10598 -2670
15455 -2670 16085 34110 21082 20959 9836 10905 18482 20700 15361 -10278 -31568 -37735 -34309
15442 -34309 -623 -16827 -55780 -45909 -37818 -28884 -9312 21030 30843 33740 28422 -5581 -21307
15429 -21307 -36777 -47418 -28357 883 -8725 1026 3485 -13309 -22770 -28861 -31668 -18889 -1821
15416 -1821 16426 7311 -23289 -18053 -13676 -13782 -12301 -11424 -17414 -16876 -11811 -11840 -10381 13072 2386
15401 2386 -2384 19975 36029 20734 -2783 4338 95 -24923 -20624 -6166 -1778 -8735 -25705
15388 -25705 -24422 -35226 -16267 19217 32889 7690 692 -2687 -10268 -15923 -32542 5932 30185
15375 30185 24143 6552 8454 -14909 -16894 235 -3026 -3136 -9669 7297 36770 45368 17684
15362 17684 7812 -6508 -18777 -23079 -19171 -15081 17375 35504 54233 63676 60666 54608 34907
15349 34907 19672 14149 14065 23190 29634 43660 21003 -18801 -29574 -5864 755 3435 -19658
15336 -19658 -32033 -23131 -20150 -52304 -46666 -34052 -55901 -50290 -53861 -44849 -17827 -10145 -24740
15323 -24740 -32499 -7904 37846 27875 31825 32014 28454 24414 25246 28845 29773 14542 21613 41893
15309 41893 43605 9505 -26273 -11091 4649 -17791 -4977 18518 24874 17091 -10703 -23121
15297 -23121 -27674 2565 12618 5546 21723 41076 12468 -22561 -33221 -24549 -17080 -1313
15285 -1313 -4230 -12644 -7772 -13928 -17675 10644 55443 54426 41233 4640 -35385 -46831 -31204
15272 -31204 -10451 -6882 8152 -5735 -5628 -5882 14692 26163 27803 14424 -16561 -2983 -25440
15259 -25440 -25097 9264 13826 15915 35442 24337 13043 1931 -12967 -28875 -24942 -28918 -16408
15246 -16408 11044 9888 -14960 -22483 -13066 -10607 1720 -234 -9433 10898 34531 7290 -39084
15233 -39084 -39325 -11761 -19880 -4155 14274 11397 9224 13699 13796 18219 -521 6725 29495 26547
15219 26547 32007 17874 32 4360 6458 3636 388 31052 27837 6280 13870 9119 17699
15206 17699 15440 9519 11784 17173 6612 -4857 2257 -3450 -17891 -5896 2165 -10998 -24973
15193 -24973 -27522 -28264 -2805 25613 6942 9901 3604 -31418 -49901 -26338 12834 827 859
15180 859 671 -16103 -20671 -30396 -46210 -31890 -12768 24872 45983 29786 34820 11352 -3651
15167 -3651 -19669 -7115 19430 35517 38293 21075 -2008 -2687 -3378 -24604 -6972 3059 -20783
15154 -20783 -18127 5738 21863 28196 27643 25622 29564 17198 21485 27927 15035 -6888 -583
15141 -583 8328 23448 28658 -897 13643 15650 4184 -3414 35525 27845 -3122 -343 -22651
15128 -22651 -19832 -1602 -20534 -18577 -16834 -5474 5082 10367 12295 -14400 -30544 -44375 -48875
15115 -48875 -42272 -20583 4886 27806 44038 23293 28895 20414 12802 8778 -1471 6030 20761
15102 20761 48411 55206 31561 31930 5506 -19172 -18883 -8612 -30185 1328 20568 7509 -6779
15089 -6779 -29031 -47925 -18407 2566 -8870 -21194 -21650 -18864 -9769 -2268 6564 -22395 -24487
15076 -24487 1982 30404 31781 -17058 -29712 -13956 -2775 -8088 4774 43729 31451 19060
15064 19060 18852 24031 42772 45405 31866 19545 -19406 -5081 16857 19390 22561 36802 51948
15051 51948 25001 -3012 -38110 -48150 -25107 -15852 -1331 -14606 -25683 -28739 -34833 -17648
15039 -17648 7618 33942 58696 59431 78860 50950 -7224 -17062 -1764 27879 42117 44506
15027 44506 33066 41079 55526 61280 52169 58791 65997 59819 68679 75530 76351 58863 63616 30200
15013 30200 16413 12937 9948 10523 5998 -14290 -30831 -15717 1243 -420 -17884 1624 19211
15000 19211 35383 56557 68972 70455 68788 77347 65698 116621 129487 111056 94355 90802
14988 90802 64328 32385 22844 22965 38238 78260 93700 68047 53116 81295 87093 94018 74567
14975 74567 27005 5479 18832 57498 55035 33810 49631 84981 82892 59521 53793 72130
14963 72130 62762 45671 54829 46442 18269 7682 14369 40752 56453 42780 20498 -9852
14951 -9852 -37018 -41254 -19322 -10899 -14586 -9580 -25247 -14068 12908 32787 58133 35971 208
14938 208 4606 42712 57378 67303 76826 43977 57093 50080 35967 36086 50974 68570 75725
14925 75725 70008 63603 61070 71393 83037 64365 31903 14239 20436 11151 5897 17060 23834
14912 23834 -10786 -7124 -5172 -8747 -3901 -1685 10858 8966 2425 9305 -33109 -27122 -7313
14899 -7313 21312 23722 26992 3565 -4761 -17856 -21334 -26583 -4144 -8453 4374 5207 220 -15527
14885 -15527 -3823 72 579 -2251 19699 41296 11378 -16425 -29942 -41059 -7106 3801
14873 3801 -9124 -15927 -15760 -3053 -5249 -10476 17318 8751 5296 29616 30682 25102 23851 -4197
14859 -4197 -23742 -4444 8869 28127 29162 -2663 -17042 489 31027 38095 31380 42786
14847 42786 38411 26672 16007 -14199 -25220 -20450 -20824 -8218 13726 17031 -509 5761 13422
14834 13422 -7849 -9562 -1660 -1604 2681 9211 -7122 -19502 -29748 -48241 -53597 -19077 -1243
14821 -1243 -21141 -24526 -24414 -30494 -33482 -30990 -32815 -34886 -50040 -38640 -39901 -25483 -26275 -45674
14807 -45674 -21494 -2046 2895 23706 31931 16532 18138 44782 31323 32552 19505 2711
14795 2711 8348 11313 -14046 -39441 -40130 -40814 -38790 -14116 12079 -14436 -28545 -15179 -7237
14782 -7237 -4380 9495 16965 30434 28324 41005 12364 -5660 -28545 -32917 9550 12462 14459
14769 14459 -2613 18003 31978 29937 12175 -8512 2312 11036 16452 39370 42730 40901 26176
14756 26176 20925 22397 -4769 -5609 23008 13611 -3789 -5277 -20908 -9380 -759 -9805 20614
14743 20614 14826 -22086 -18284 8573 -5001 -1124 12972 24527 45290 46670 28149 27443 21975
14730 21975 30944 63155 53765 35957 27179 7581 -3422 -32747 -42959 -15120 3676 10982
14718 10982 -8113 -5465 -3677 8669 1341 21621 13894 -193 -16192 -14718 11664 30457 8207
14705 8207 -18747 -18834 -8409 -19184 -17255 2869 11638 22422 32922 33393 10242 -13053 -1097
14692 -1097 5387 7675 -33428 -38518 -22781 -11815 20415 15687 -15700 -18632 -18957 -19137 706 32963
14678 32963 31350 5495 -10318 -16760 19917 15160 -8063 13099 34908 6081 -6022 -3529
14666 -3529 -4486 5085 27953 26350 32923 22057 3501 15234 28605 46646 44823 53597 66478
14653 66478 72262 70954 18711 14773 29495 38193 46131 9185 -16088 -12307 15152 16139 -5652
14640 -5652 -8065 5776 23973 -171 -17151 -14924 -8432 19369 35749 49600 43583 20418 28333
14627 28333 14148 -18100 -30367 -29273 -32499 -11899 6060 -11572 9445 42383 43689 31736
14615 31736 21615 12445 9495 5314 14255 23880 4063 1440 -24458 -24906 -1070 33997 25699
14602 25699 -13625 -32255 -31340 -17463 -3720 3930 -14289 -31394 -58249 -43117 -7854 28216
14590 28216 37401 84155 101686 109409 116005 150446 182386 178134 144036 122791 117945 93629 70541
14577 70541 52302 26571 9871 2812 -12279 -19064 -16186 -1907 6848 9184 15892 4426 -22084
14564 -22084 -12383 4676 875 1614 -2860 -18006 6839 28991 22799 17005 11839 21062 7279
14551 7279 -27941 -14 34073 33304 30859 55900 82904 47419 17818 -1350 -13171 -22351 -1739
14538 -1739 16591 47795 54828 21456 421 -4456 20912 26591 29048 13564 7883 -19928 -16157
14525 -16157 -11071 -1683 -11472 -37879 -28643 -29201 -37201 -23357 -1616 4597 3654 18295 10977 -15127
14511 -15127 -14894 -24031 -35422 -44407 -34442 -32989 -22562 -5461 1564 -5264 -12001 -31757 -35038 -18389
14497 -18389 -5422 8943 1862 -16004 -3685 31123 52623 33837 23655 39704 52056 65098
14485 65098 77298 88092 85102 104213 134500 161233 192306 195611 189282 168567 106537 104503
14473 104503 112391 88716 56849 50760 38010 26211 14194 30421 23837 26772 18852 25422 58142
14460 58142 74717 64756 37535 6084 2964 -1834 954 3423 -1444 5321 -1945 -38769 -30647
14447 -30647 -6900 -7699 -14498 9573 35800 26880 -20308 -47277 -32037 16263 54423 48348 40763
14434 40763 21880 46170 72272 49520 39049 27836 51181 46416 33144 32575 8392 3482
14422 3482 26590 47413 68626 73967 46273 36208 60920 46471 25578 30068 27398 32799 39124
14409 39124 51139 55399 57930 87886 98852 90417 107639 111687 122498 119062 92374 99254 150118
14396 150118 190306 254135 349578 472905 628346 818731 1038489 1183198 1324207 1373728
14386 1373728 1297747 1145923 968355 808409 591296 421322 298683 194460 140455 124137
14376 124137 110410 89836 72633 75241 84174 80531 40123 37655 49991 20055 20352 31974 12288
14363 12288 586 -3725 -5574 9486 8310 16659 23162 6335 22235 23826 22959 18828 -5676
14350 -5676 19942 39612 28848 11525 25968 28302 42855 59463 51177 25421 -5439 429
14338 429 7894 -1470 -24877 -19488 -7643 14000 30599 48873 53944 50242 15865 -3203 4960
14325 4960 21785 24406 10912 22707 39446 56868 65498 40309 45621 37225 25527 29854 24666
14312 24666 11105 16452 10862 11536 28334 30725 27318 42101 21348 19240 29701 26193 25502 32725
14298 32725 31568 31888 53892 53731 35819 30021 18324 19119 29851 52745 53455 41394 46845 46270
14284 46270 41325 18308 4956 19033 29922 7882 5407 48768 70338 54854 49674 63105
14272 63105 69255 62596 37475 17090 -5342 522 31926 37844 17343 1308 -11994 2640
14260 2640 -2577 -5324 -20441 -13946 -503 -8219 -6742 11468 10567 10427 7782 1942 -16046 -22204
14246 -22204 -620 10274 978 -3936 811 11419 18949 22115 15143 6685 25963 31006 51738
14233 51738 44505 60990 79263 73080 51878 42703 46062 17538 -9117 4878 18218 18495 30145
14220 30145 55352 55910 31183 30337 60684 68529 31249 18888 18662 3543 4919 10112 23474
14207 23474 19892 3584 -22377 -11420 -291 18510 56130 68286 66876 62990 43598 31705
14195 31705 22737 32572 28057 42840 39021 43196 61867 48645 49955 34768 24483 36377 65032
14182 65032 37530 14867 27985 20525 23445 37271 24865 27015 13317 9027 14910 24420 30641
14169 30641 22238 30000 51543 67256 54964 43090 60309 70854 92642 98070 105476 105638 131871
14156 131871 126130 106947 104047 88841 90277 101077 99092 110362 85563 105237 120752 114259
14144 114259 90567 70424 65422 46989 15627 10878 36457 26630 11390 19727 10357 -3580
14132 -3580 13236 41260 69270 46791 4433 9458 36487 75040 105807 124279 122902 132275
14120 132275 117144 115248 88266 80144 83434 73706 95017 142638 152655 137636 136103 124107
14108 124107 99253 103658 113452 117649 85387 84409 91942 120280 126465 123579 111626 149122 179705
14095 179705 219823 259742 276029 273284 250524 260336 256494 250585 232768 218775 224430 215487 230973
14082 230973 231592 192209 204582 199921 211187 228251 225476 218671 194826 195338 196073 189401 199835
14069 199835 208040 238186 256123 264743 310380 323073 312723 255994 218014 206599 188047 197992
14057 197992 193600 201683 185670 173193 171419 163817 142033 125454 113760 124761 119923 120234 143896
14044 143896 156733 163236 211197 248816 325367 384730 423119 490544 522806 541380 542991 540410
14032 540410 558068 578507 551764 518378 492542 478676 443535 417748 383899 323671 307346
14021 307346 318992 309102 309610 290964 271807 263418 261793 256805 239289 253000 266353 278000 276045
14008 276045 295177 272407 284860 302835 343612 365820 371925 363504 365300 387681 399673 389772
13996 389772 400586 405189 414642 385900 361633 341019 352964 369949 376442 416639 429865 454692
13984 454692 491319 481372 490350 519604 549588 596549 621976 627926 633136 679042 701085 722228
13972 722228 755356 827714 873312 933941 1026488 1149403 1280345 1352740 1372522 1357228 1327388
13961 1327388 1284615 1248801 1214239 1182584 1215397 1281251 1343922 1403938 1508216 1662546 1807363
13950 1807363 1965192 2158896 2323608 2471176 2591897 2693818 2738920 2793968 2876645 2986401
13940 2986401 3138821 3330504 3562913 3816729 4222146 4746656 5397638 6234973 7204280
13931 7204280 8289375 9464117 10717311 12020933 13373626 14911636 16768208 19165948
13923 19165948 22532456 27466740 35060525 47216403 66718170 95064715 130855671
13916 130855671 171213495 210180269 241173580 258119380 256157386 236600681 203927702
13909 203927702 164296482 124562375 89696427 63073302 45076113 33652955 26447229
13902 26447229 21866331 18873546 16824776 15265515 13885159 12542959 11149401 9684992
13894 9684992 8238875 6933468 5844009 4989713 4344886 3832741 3417330 3087459 2808246
13885 2808246 2533129 2282330 2081170 1905972 1796996 1693977 1587104 1530823 1489055 1475045
13875 1475045 1481265 1492163 1532096 1603138 1696983 1809895 1881028 1870665 1825657 1706873 1520050
13864 1520050 1291886 1118213 951181 802916 711845 659750 624233 591187 598819 580853 551774
13853 551774 548876 540909 527203 488318 469727 469126 444136 427167 379483 373001 356947 328170
13841 328170 340867 360787 364844 356587 339693 313570 295072 284419 255582 220668 215743 230922
13829 230922 208242 184063 183819 177715 164226 167004 162917 146832 165520 186077 203664 226108
13817 226108 231103 211414 233725 232051 221448 233828 229285 183018 155203 139253 112918 91409
13805 91409 95877 112475 108492 85659 78438 70903 89835 135266 145494 158449 156204 144201 134058
13792 134058 142466 172235 181184 204255 220424 246423 270069 286537 282701 280993 281408 250467 229378
13779 229378 223314 215691 215961 191685 184595 194947 190208 172230 153665 147199 148139 152687 194657
13766 194657 206305 199580 182611 170895 160385 148685 117823 119331 108548 92712 98497 115467
13754 115467 124850 126337 127793 131499 133210 128390 116552 109109 124714 156148 162862 157847 143254
13741 143254 156666 174485 172766 180472 179402 152409 109122 89839 75662 80446 78210 79522 91134
13728 91134 107564 97002 89882 96427 117369 127126 103907 117853 91985 53628 39439 25009
13716 25009 7053 15892 1610 -21906 30 38753 74148 79725 61526 35800 30326 -9408
13704 -9408 -24893 7757 9805 11199 29352 49847 41036 46467 78527 122782 123586 93805 91175
13691 91175 96191 75722 62902 60183 81193 82827 60407 56240 52116 35272 43849 35696 35819
13678 35819 22980 24650 30887 58008 71018 40435 29218 18255 10764 1693 -939 21587 29549
13665 29549 35525 54760 53405 46603 45756 38465 34193 14900 -11377 -13450 19764 25090 7178
13652 7178 16809 25934 26539 4636 -19975 -1117 26399 53158 64156 45184 29238 30793 36427
13639 36427 35115 20377 -4308 12987 371 15093 42091 69676 77777 55603 35681 26606
13627 26606 52171 39283 5380 6956 10043 4290 -29098 -23830 -11817 28030 46247 39387 30521
13614 30521 34333 17339 17044 -16426 -20874 -11828 -33254 -31196 -11528 -9534 -15694 -5481 135
13601 135 -35309 -48909 -36591 -10074 683 5403 -5841 7948 26667 -12213 -21166 -14595 10181
13588 10181 35860 11644 20096 25950 13481 -12912 -25825 -24991 -22892 -21038 -13674 -29476 -41426
13575 -41426 -35629 -7024 18956 46291 31059 12567 -3307 -9059 195 35538 25672 -10734
13563 -10734 25036 48102 35744 31352 10935 15883 36249 39802 46844 40987 36897 8925 -17730
13550 -17730 -10722 18214 17435 23522 45142 31039 6386 15953 11708 10916 -7014 -8417 -15452 -20745
13536 -20745 6070 -16957 -51667 -57226 -51710 -42167 -34304 -37905 -52999 -43729 -22744 -14895 -2026
13523 -2026 21174 18517 48892 54858 20866 -7066 -27092 -32804 -5883 3586 17968 13886 4836
13510 4836 -5619 -6668 -11229 328 984 -5757 -10943 -25610 -16443 -7856 -9074 -10079 -4458 16228
13496 16228 42235 36433 39629 34239 21978 31370 25872 38823 21531 8598 17097 20296 12950
13483 12950 13469 1716 -3471 -1926 3186 16393 -176 -10808 -18122 -6248 -12808 -34770 -34108
13470 -34108 -20472 -20148 -34445 -18040 6608 13346 21202 17171 18562 22154 27289 46613 47549 47866
13456 47866 23115 29979 54832 72320 60086 52289 31719 34305 44782 51482 71180 97222
13444 97222 103267 116290 121899 142111 154814 201433 279514 382477 551677 750369 944336
13433 944336 1125198 1270228 1361967 1377790 1270440 1073426 827535 618947 426608 284684
13423 284684 200701 132799 96370 94565 82529 59735 49224 57735 47185 28759 44178 60495
13411 60495 52401 34286 32078 10863 -12394 14812 19055 9663 16687 -9475 1090 5153 -10222
13398 -10222 17951 29239 16957 -24922 -35024 -15962 473 6910 18036 32409 31539 6390
13386 6390 4604 6600 5340 -9395 8732 16349 31255 28955 12287 -19320 -24360 -37395 -12757
13373 -12757 -1981 26695 30444 31988 30498 50873 41619 48932 86446 51182 14910 10741 21722
13360 21722 31159 9116 19691 21036 3290 -3567 -14967 -10611 9276 -13291 -41269 -51098 -32686
13347 -32686 -35165 -5299 20533 -2146 8045 -4418 -39001 -42069 -12339 -15067 -20793 -11865 -14422
13334 -14422 14254 26821 -4251 -22693 -28141 -44470 -66569 -55115 -32075 -14453 7435 18963
13322 18963 43639 38868 23576 14326 -5337 12346 19421 7010 -28244 -31800 543 15127
13310 15127 7702 -7813 -5278 -9765 -811 8377 9502 -4111 -11018 3654 46068 82431 51061
13297 51061 25423 51181 50864 34506 52113 47611 24451 11862 12743 11894 4416 12910 17932 4979
13283 4979 -9384 -4119 2297 21854 2983 -8591 611 28311 20253 -2292 -6074 13282 25303
13270 25303 8951 -7768 -714 6975 -2547 14743 42046 34850 9521 -5013 27460 35147 12815
13257 12815 1456 14993 11777 12081 -2408 6281 23551 19138 -3000 -12525 -27516 -38904 -25633
13244 -25633 -27259 -40689 -12950 -2384 -3134 -4760 -7196 24858 48507 37828 23098 12303 30500
13231 30500 14734 -8242 -5001 -15704 852 10248 7591 -2867 -22306 -14060 -19211 -44604 -27284
13218 -27284 -10717 -22438 -32037 -17210 4123 14002 12498 14774 -7690 411 -13383 2079 -14421
13205 -14421 -5782 -12676 -7258 11708 34121 31746 35623 33431 27966 24237 -1460 -39994 -22845
13192 -22845 9571 -4430 -19708 -29295 -11081 -24402 -34926 -47819 -66177 -58868 -46155 -60096
13180 -60096 -55083 -3795 21442 37308 28199 6129 -22152 -40915 -42455 -49903 -30239 19590
13168 19590 26195 26288 33756 45959 33964 72291 81002 57528 54357 79014 119037 126340 179361
13155 179361 223988 250232 196436 145870 114466 90850 88723 69959 41948 29324 19014 22196
13143 22196 -14449 -3746 430 -14807 -30592 -16173 11401 22877 -6878 -16165 -13355 21285
13131 21285 38557 49753 24300 14165 8215 -3214 9876 10968 -7974 -5801 -2989 -6161 7830
13118 7830 -1291 23395 47371 40379 32141 35398 93386 164928 217709 240001 220095 184504 144941
13105 144941 82893 72757 80506 115450 79417 29047 6829 9083 15882 5187 -1673 2592
13093 2592 5375 14172 35875 32880 7593 1834 -21352 -40593 -31407 -25547 -15421 -8141 -20758
13080 -20758 -34840 -27356 -8861 12282 9864 8588 12808 -8597 -9290 -6427 -33016 -7377 32886
13067 32886 31573 25472 12745 -11110 1212 37672 53672 27196 6383 -2929 13942 25762
13055 25762 29264 -16156 -25004 -1372 -6022 -5873 -1357 34126 39561 21747 13737 15647 -10785
13042 -10785 -15164 -8140 479 6113 5831 -12315 -25775 -33745 -17649 13141 7233 -4529 -45195
13029 -45195 -42897 -21743 -20270 -9481 -21402 -32206 -41547 -50811 -57132 -55421 -33698 -20000 -25431
13016 -25431 -27456 7089 34496 22956 17295 15846 22576 11854 -22284 -53973 -28454 -20024 -23974
13003 -23974 -34767 -37998 -29593 -15578 -25899 -33806 -32134 -22044 -29097 -26322 -1179 -23546 -26065
12990 -26065 8001 13566 1198 2968 5798 9264 -4634 -34990 -32660 -29841 -25905 -24033 15865
12977 15865 10407 -16900 -3836 -3980 739 4443 14311 34790 13568 17451 20171 11151 10881 -8286
12963 -8286 -8465 5030 -20405 -36159 -37365 -26524 -34562 -32771 -34097 -29240 -39323 -34158 -7795
12950 -7795 455 -5411 17137 -1231 -18797 -34776 -43010 -54231 -64031 -30922 -25828 -36036 -41673
12937 -41673 -16329 4968 6874 34320 35887 -5422 -36046 -2616 18696 24783 26714 22231 1885
12924 1885 -11068 -9133 -26911 1796 29707 12045 -10444 -24073 -30704 2585 23689 -7993
12912 -7993 -10422 -2649 3316 -10527 -33360 -34458 -22632 -17827 -1710 1869 -11304 -4562 28210
12899 28210 2071 -12945 -9426 -16328 -31313 -34564 -7152 776 10829 10185 -29887 -30161 -20138
12886 -20138 -10933 -18126 -26808 -13383 -9941 -14493 -16862 -27333 -20318 -22905 -39322 -33021 -23957 11277
12872 11277 17251 -4342 -34969 -34739 -18129 19479 24055 9862 15138 23363 10344 4336 18599
12859 18599 64408 52245 27482 7512 10713 11014 15923 -4737 -1697 20423 35231 35697 37303
12846 37303 36549 20711 8644 6619 10106 17182 10016 18216 16181 18335 16605 25273 21894 -929
12832 -929 -12644 -9767 10427 25235 17522 -3620 -1578 24885 13264 8471 -2370 -12214 22180
12819 22180 36730 12002 704 8167 17459 28837 48232 33791 -9716 -63270 -96953 -74996
12807 -74996 -47727 -16973 -5822 -32854 -22753 5537 22830 11072 1131 -3514 1559 17812
12795 17812 6514 21718 -2444 -20361 -8 7504 -1736 -1713 -7658 385 -19470 -33638 -25909
12782 -25909 -14257 -29526 -29671 -8752 25115 56530 44070 14990 5218 5610 2316 8966 -29069
12769 -29069 -51164 -29635 -30380 -45759 -48010 -52454 -41035 -22760 -18901 -31917 -51778 -51157 -43411
12756 -43411 -21637 -10188 -2920 -6052 3263 6973 21017 26603 -149 6190 22202 3751 9826
12743 9826 21027 44212 32474 33309 25474 24413 17333 -38133 -65266 -50844 -29995 -31970 -19321
12730 -19321 -4430 -25050 -34097 -16214 -1584 -13572 -61847 -39826 -13111 -10673 -18260 -22690
12718 -22690 -27696 -10453 -22800 -29021 -41517 -42141 -58991 -71650 -74149 -62995 -56553 -46409 -21901
12705 -21901 -5288 18185 41229 49505 42002 53164 39998 43606 50354 35725 24248 15883 -6360
12692 -6360 -562 -6890 5676 24115 11233 -5600 -6530 697 10838 3688 16971 14633 -1780
12679 -1780 18878 34694 20110 -2562 -12731 -37420 -69305 -73593 -71178 -55048 -30951 -21107
12667 -21107 -24739 -52947 -48113 -25849 -46994 -74802 -53697 -59917 -69220 -56856 -25989 -1953
12655 -1953 16779 38765 34820 1806 9076 22996 3940 10397 8362 10616 5792 3793 -8804
12642 -8804 -5279 -8564 -26332 -25772 -23499 -26297 -32309 -28083 -9401 -2981 280 -5322 7297 18985
12628 18985 -32224 -48197 -40051 -43172 -15192 -10183 -2877 767 -15742 -33123 -50032 -32922 -27867
12615 -27867 -10996 -10024 -11758 -42653 -60464 -43815 -17451 -12203 657 -2255 -3774 10485 19313
12602 19313 7084 -22990 -6990 3128 -776 14983 2999 8021 36034 9570 -5451 -4042
12590 -4042 3385 355 -3826 -12908 -26016 -34653 -31627 -21078 -18766 -11975 15213 9507 8368 -11567
12576 -11567 6096 30889 26916 7451 -7276 6164 -5217 -16185 -18109 -5263 -6669 4752
12564 4752 16595 12099 12813 -15268 -23110 -46217 -43243 -37811 -33819 -6289 10170 23023 34900
12551 34900 43137 35732 17126 -2121 -995 -632 -679 13265 11241 2558 -5653 -6158 1030 3846 1502
12536 1502 -985 17592 42443 33923 21650 6259 -555 -25030 -42851 -23954 -9126 8381
12524 8381 24754 41480 29978 -11829 -11224 -9913 -25353 -22451 8378 20116 3243 -8077 -9587
12511 -9587 -20581 -17980 -5142 6439 3980 -10940 -8051 -3612 -7398 -28906 -14699 -13674 3984
12498 3984 19489 -2851 -16833 -34501 -38944 -39320 -38277 -37922 -40670 -34610 -9754 -1276 -594 12953
12484 12953 23963 10767 -7671 -6511 -19260 -19482 -20492 -653 15483 24223 38368 24049 11455
12471 11455 21880 10778 7930 16214 18282 -6480 -16285 -24035 -8349 -7685 -6137 4007 -24793
12458 -24793 -34360 -11650 -3244 -8090 1257 15324 17471 10676 1857 30273 45451 28836 10594
12445 10594 -8885 -19077 -54012 -52816 -34733 -28428 -12577 -11578 -5955 8385 31310 18145 14202
12432 14202 -10358 -18877 -8942 -2263 13349 25844 29718 27479 30481 38166 43919 16881 -10373
12419 -10373 9233 7914 13033 24043 19867 19873 21684 30083 39437 44051 25169 9209 -3506 -46209
12405 -46209 -47057 -24549 3401 -15943 -21046 5197 4517 3778 1337 -12874 -30511 -27490 -27667 -3660
12391 -3660 -6618 -20051 -1295 13930 -1024 -6453 -8891 19452 21633 32879 39046 45784 34813
12378 34813 27549 19690 17886 8417 15714 19190 28367 19809 -745 -10699 -17877 -25933 -26 10552
12364 10552 9104 -1658 -6108 -5402 -13153 -2186 2497 -1787 -118 20228 11493 -1025 -2336 27357
12350 27357 69780 53597 25632 38888 51103 20662 8355 -175 742 -12719 12939 19184
12338 19184 20325 1551 -3119 8506 7464 10694 18557 14828 1311 -12427 -22010 -34716 -26952
12325 -26952 -37319 -40594 -26453 -13835 -8732 -15967 -22766 -17000 -14356 -6660 10923 25722 10484
12312 10484 3755 -11262 -27778 -22226 -11548 -15288 -28197 -42192 -40459 -16484 8447 -9836
12300 -9836 -34170 -26085 -25000 -24882 5433 18384 37057 46418 34116 33749 43443 36904 7889 -31451
12286 -31451 -12326 -5967 24195 31441 23869 7335 -6186 -6446 6574 -821 -25860 -29604 -31359
12273 -31359 -7073 19413 42784 38808 -9197 -50110 -60945 -16194 28567 44812 -3874 -33092
12261 -33092 -18818 -10309 -40473 -44251 -44017 -22129 -24155 -32002 -18482 -15917 -32149 -18766 6296
12248 6296 1510 11141 1801 -11233 -24410 -6568 -7818 -5024 -32653 -26861 -17797 -31730 -30920 -43732
12234 -43732 -39248 -48920 -40663 -54849 -70682 -47075 -25147 4077 14803 16333 16769 4683 4854
12221 4854 -17492 -8657 5599 15716 -3624 -22648 1388 22343 35582 40753 36952 48522
12209 48522 31359 20756 20340 11215 -17586 -7834 18797 18848 -21533 -15453 25451 21981 13513 6505
12195 6505 26386 23533 -14370 949 -2126 -9521 -18634 -26112 2142 -17556 -46217 -22545 -26549
12182 -26549 -44300 -46478 -36756 -17012 -25990 -49346 -48201 -7892 10163 15952 23767 18084 1067
12169 1067 3476 8158 1908 -7296 -832 -5514 -12564 -12014 4418 -1861 -20843 -41477 -47571 -31489
12155 -31489 24063 36399 1618 6002 7089 -17647 8064 11242 2004 -18860 -25147 11885 31030
12142 31030 28149 4354 8463 -4760 12102 14058 24956 27673 26657 24652 34836 18909 -4402
12129 -4402 12010 19535 10404 5715 4572 -881 1521 16379 15513 13175 18252 -636 -1968 -17029
12115 -17029 -6927 -11167 -10005 -4760 23557 41410 49245 42921 37443 34968 30624 49486 77925
12102 77925 80426 89202 102753 83539 61741 85668 84464 54326 57468 55901 39285 37153 50599
12089 50599 25813 27210 24812 4453 17325 2728 -16302 -2991 25835 36385 44768 62833
12077 62833 58966 16193 -16335 -19161 -9347 6723 12772 33718 40742 56480 43778 64027 77820
12064 77820 84386 71772 80682 59206 36021 37084 32901 19170 29405 53006 66075 72759 77297
12051 77297 106762 114743 121965 100557 77004 72962 82104 65221 50586 36794 23045 11666
12039 11666 18995 13506 -2846 -12550 3605 13608 25322 25983 17564 21239 36160 83995 95540
12026 95540 52182 47149 48638 47287 48383 62821 58115 25851 18503 43065 38021 28157 28679 20703
12012 20703 33194 10228 -19429 -28234 -9560 -16290 -11943 -23811 7336 26882 40145 48440
12000 48440 29118 9409 -554 31573 27289 15978 3307 27211 43800 48664 63008 66160
11988 66160 49032 34920 70129 91148 87852 73889 78578 77473 68592 38345 25456 13465
11976 13465 7827 33150 23552 14100 18879 40304 55633 64645 46844 5985 -25670 -9244 -22784
11963 -22784 -40317 -19499 -6474 13223 25102 17803 -7843 -45527 -20433 -14395 -2046 -2055 -34682
11950 -34682 -40802 -6342 26912 31220 15366 -3588 7891 22958 5181 -22734 -5302 -20032
11938 -20032 -9477 18547 12567 -17971 -31158 -13240 9953 34149 29898 16647 29729 13697
11926 13697 21453 28732 31792 11119 -7044 8545 12987 6518 674 21312 35843 21029 15019
11913 15019 -6263 -46466 -58455 -24342 1535 -7524 -16487 -26513 -34473 -25237 -19236 -5838 17085
11900 17085 -23291 -51978 -30726 -6554 2990 5767 -15694 -10841 6364 23468 32593 36176 33438
11887 33438 -3767 -19275 -18651 -35119 -56711 -53509 -31845 -19350 -26605 -19308 14186 14299 13997
11874 13997 -21811 -19887 2122 18472 10121 -6225 -7870 9805 14135 1056 1955 9137 10479
11861 10479 6618 27257 27601 -16047 7017 26004 28482 7729 -29443 -67305 -60906 -43511 -35033
11848 -35033 -7375 39088 43548 28998 11862 -2595 -207 19415 27567 33027 8181 4702 23461
11835 23461 25760 10651 11879 3190 4201 -5442 -7308 -2822 10994 22738 13615 8611 15073 -1589
11821 -1589 -162 24458 36484 8774 -16031 -5837 -9537 9248 4068 9288 -22652 -35249 -35302
11808 -35302 -21712 -35321 -45528 -24549 -10868 -12113 -24396 -16991 -14922 293 -1835 13914
11796 13914 33821 49774 18207 -17633 -25037 -28339 -3165 -6513 -1180 -8601 7088 -6051 -8492
11783 -8492 -12142 -2418 -3090 -19037 -32314 -43621 -39179 -28324 -9925 22250 29822 28537 24743
11770 24743 18217 3808 -39438 -35013 -27386 -15953 -4636 -8462 -16164 -15301 -19117 9483 15328
11757 15328 2817 8218 -2996 -15484 -39929 -26237 -16157 -8594 -2470 -20541 -11108 -25574
11745 -25574 -259 23200 12674 -27187 -56516 -56905 -19688 -13484 -18763 -3097 6003 24378 12432
11732 12432 -45747 -70718 -50259 -26839 -31129 -2208 -32431 -63607 -50761 -37340 -19779 -6822
11720 -6822 1647 10017 -9900 -24682 -13831 24349 53399 41645 17100 2783 -13537 -33985
11708 -33985 -14316 -23382 -12937 -18037 -44239 -28469 -12392 -17749 -19437 -751 16820 14087 3168
11695 3168 -29662 -25183 2630 9137 5063 -26421 -33090 -24050 -15979 -1524 7373 7381 -6740 -9168
11681 -9168 -9342 -17877 -27481 -8414 29889 41127 27612 29945 7895 -10017 -13921 -11581 -16442
11668 -16442 -25121 -7718 -2615 -13747 5653 4995 20363 29188 34938 31531 -3673 -24588 -27031
11655 -27031 17062 43738 42843 22237 36804 43719 26019 29642 28901 31757 44369 39730 24181
11642 24181 27365 18871 11183 37876 62729 68468 33374 15759 -7795 1896 6247 -5403 -6489
11629 -6489 -6322 -10972 11664 10362 12241 1722 14535 31117 11695 -12536 -20946 -5756 7173
11616 7173 -3759 -4421 9297 23465 38381 30075 20768 -34214 -47551 -19156 -2521 4117 -7491
11603 -7491 -2741 8964 7394 -3897 -2983 -10884 -10979 -26660 -49131 -72196 -62721 -53628 -34201 -30683
11589 -30683 -43535 -58087 -29156 -4573 2714 -16927 7484 5962 6585 -4293 -36311 -31280 -24032
11576 -24032 -13781 -544 943 20864 16749 42869 57343 22606 -11874 -11809 -25228 -41117 -39576
11563 -39576 -43334 -49157 -35517 -30605 -23761 -18062 -24529 -6334 -7277 -18776 -30244 -27599 -7652
11550 -7652 25756 45199 29183 25758 43765 43710 20581 -19591 -15463 -17577 -37716 -57091 -55177
11537 -55177 -26642 -17982 -24558 -48162 -56527 -44417 -12938 -23145 -32730 -12914 -4174 -201 15611
11524 15611 632 922 4110 11215 1111 -20596 -23855 -14303 -431 13620 22778 19202 39426
11511 39426 57070 46438 46242 57128 39702 -4852 -18152 4462 -11234 9340 1148 -18389
11499 -18389 -16068 -9172 -5435 -18040 -18344 2468 815 -20141 -49768 -46649 -16309 -5833 3085
11486 3085 20565 46998 54521 44063 8078 -27883 10641 22127 64495 77708 70901 48084
11474 48084 34126 17282 8259 -14733 -21288 -16477 -3112 40 -4301 -1134 3237 21846 33048
11461 33048 18320 5878 6583 2476 -672 -4330 3498 -14162 -14335 6200 9179 22782 25902 34063
11447 34063 42528 46520 35907 43411 43234 24822 6493 -11456 -1009 12084 -6066 -6431 2746
11434 2746 10648 14229 31469 11430 17980 6302 -6900 -14881 -22101 -47427 -31045 -13102 -5354
11421 -5354 22529 43219 28531 -9102 6309 7577 8317 633 -10906 -1416 -5962 2570 -3081
11408 -3081 1916 -9729 -40648 -40266 -33076 -28182 -16111 -26119 -17901 -3015 -1375 6174 17956
11395 17956 47207 39776 40260 13920 -4751 -3899 14429 16733 4135 4331 22066 21549 22088 -186
11381 -186 15616 60227 72235 67009 53635 44641 49297 54181 37711 19799 31976 15452 275
11368 275 4583 21136 2815 -16412 -27463 -33944 -57758 -42070 -37703 -29229 -25306 -45034 -12871
11355 -12871 -10403 296 27611 34480 13003 8451 5049 3769 -11298 -17176 13288 17313 17498
11342 17498 20870 18740 234 -16813 -16236 -15986 -21116 -3278 11420 15808 -3281 9639 1943
11329 1943 -12141 -14633 -25375 -4167 21420 7369 -21498 1004 -11282 -23324 -16319 -4204
11317 -4204 5777 13373 696 -25434 -44296 -56022 -40222 -2994 25622 42360 43989 46621 2827
11304 2827 -21858 3091 11014 -2570 -8613 -3484 11221 26829 26260 20688 967 -14296 -10272
11291 -10272 -17588 -24109 -11434 -23874 -23168 -4468 3892 -5179 -7335 -4511 -13074 -18564 -40807 -57610
11277 -57610 -43403 -20320 18827 3904 -413 9586 3112 669 669 5166 15457 10244 49531 73025
11263 73025 64377 54691 61358 53992 64557 57736 50336 44342 45583 37138 35756 28775 34596 23687
11249 23687 13836 24654 17277 -13643 -28548 -37283 -21736 27319 62177 58936 32034 29009 29675
11236 29675 80676 91684 52672 20154 27260 40152 21225 10378 -13197 -20285 -7325 -13299
11224 -13299 -2300 33142 20117 -15601 1615 13823 14092 -6989 -23484 -12776 -2171 17701
11212 17701 12217 4122 3403 23151 30187 25725 13439 32084 37342 -896 -18104 -6543 9333
11199 9333 14961 24848 22224 4753 7560 16006 9267 -10638 -37039 -28227 -5425 -10797 -9440 30824
11185 30824 39313 23539 28216 49300 48788 34286 29805 46049 56827 67276 82668 70803 39077
11172 39077 40789 42017 23867 13049 22919 21671 23161 24691 3198 10464 -550 -986 3500 7161
11158 7161 25052 11864 -10801 -39399 -44862 -19288 -1393 12302 -24160 -26657 -11137 -3980
11146 -3980 -18662 -41687 -42938 -19308 5051 3814 -11798 -12138 -24311 1142 4347 13121 24410
11133 24410 21929 -13530 -16465 -10741 -7760 -14438 -12406 2224 -6098 9295 30462 27380 21058
11120 21058 41693 43208 14814 25630 48676 55845 36148 22913 25389 44548 31415 32566
11108 32566 47031 47500 41323 22421 9188 12058 18300 25558 20005 -2587 -22980 -12674 92
11095 92 17655 21335 13150 -13610 1997 7374 3591 -8551 -4840 37517 31988 9274 7268 -2158
11081 -2158 -23760 -11552 -7124 22398 22236 17665 -5914 -20193 -6328 20381 31876 52238 55081
11068 55081 69365 63394 39968 32196 18918 -7528 -21266 -37680 -7256 21179 29759 19680
11056 19680 31914 70266 69868 30954 5587 6241 19219 21420 25492 17015 -14037 -41213 -25708
11043 -25708 1683 11210 24465 41452 22070 -673 2554 7413 19025 19949 32607 31503 12623
11030 12623 -9300 -747 8362 19266 29616 25275 -7767 -40165 -55398 -7299 39201 56850
11018 56850 41058 19274 6948 -9630 9040 26810 28870 57668 43597 31776 64138 85123
11006 85123 52002 20501 9280 18971 26872 36035 39779 20636 33010 57979 74230 99353
10994 99353 75564 79986 50787 31033 42971 56938 60451 60978 55417 26803 8971 30697 43942
10981 43942 64747 82493 71541 43880 65832 92147 76457 61065 66856 78093 84339 86979
10969 86979 66604 46266 39629 35655 35498 31576 24193 34591 45206 58575 77703 73093 38469
10956 38469 43325 51509 47857 40736 36489 29219 19576 31916 25490 25624 31548 43175 31372 23909
10942 23909 29937 43425 44531 48115 67848 72649 67595 65947 73510 94646 104212 78653 62920
10929 62920 65458 55089 38083 45203 27650 53556 61950 65246 89141 89571 69133 82287 76092
10916 76092 85994 84481 94888 83583 92967 116877 98445 66284 41167 80074 92553 80497
10904 80497 68600 68103 62501 38064 12068 24967 43976 33489 42687 48282 63390 67574 72698
10891 72698 87279 111598 73445 71947 105590 111944 95694 110181 105278 112267 101728 102371 82293
10878 82293 64080 90800 107871 115924 133001 146280 146343 147373 148847 154334 170486 211062 242863
10865 242863 282880 329971 413660 562946 776089 1085988 1307592 1392456 1512868 1794520
10855 1794520 2020046 1936941 1684646 1525824 1443814 1268685 990864 727145 548447 434559
10845 434559 386568 386878 352293 325453 287691 274484 299478 349279 403167 468188 552404 676064
10833 676064 791279 903964 1019887 1093940 1084035 1041011 989388 912736 818007 714150 612313
10822 612313 532862 452937 396268 334368 308152 267777 228895 194297 169661 158738 147480
10811 147480 138091 159104 152254 140267 127355 121299 112230 129534 109411 104418 109217 76586 48671
10798 48671 58623 83281 92001 119221 125562 107121 93527 70403 63925 88224 108110 70427
10786 70427 71610 79386 89016 99925 129458 110670 92518 70799 73895 81204 72290 18442 22847
10773 22847 58928 76617 66525 65482 87642 84687 102061 106888 105621 99055 98874 106025 108267
10760 108267 83816 85651 105883 88464 68471 79634 88133 64940 80187 81648 44668 48165
10748 48165 58458 90342 94820 86431 68823 70945 96469 113764 110258 97585 84162 104425
10736 104425 109377 110712 92874 72384 58676 81361 85843 63117 39124 69216 73249 66547
10724 66547 81210 61004 63986 66702 69939 84760 58851 62180 75229 60980 72297 91823
10712 91823 99910 101956 109832 94678 106370 116538 95333 111399 157443 181353 186553 151523
10700 151523 131620 135695 157822 191818 195356 191924 176392 159465 152189 146383 151043 165038 185464
10687 185464 179165 159230 149499 180416 165134 125073 126534 113008 91967 126716 161209 179869
10675 179869 203801 214189 200104 217701 272397 392810 589435 745957 802203 858855 998753
10664 998753 1135062 1122191 958881 843369 798343 718196 571710 423547 316858 291350
10654 291350 271471 252358 232522 195407 174217 162823 188231 191331 149785 110484 92676 98792
10642 98792 116993 141361 143865 153999 135087 119771 120059 154560 197171 214227 217164 203224
10630 203224 193650 188241 156752 158862 156180 137425 139322 159053 170776 176698 181592 180812 176417
10617 176417 172455 139539 132608 148047 170477 180055 185361 183991 221952 246940 243083 229781 222152
10604 222152 209787 196561 168072 168370 183099 195434 202558 239084 284581 336561 396376 472014
10592 472014 501669 486893 462394 446620 428890 360912 282400 265226 295945 361539 414026
10581 414026 445735 520514 620705 700687 721911 791918 827907 854165 930196 974261 972788
10570 972788 958484 921654 896697 863885 785339 704598 630849 608030 594178 544693 520835
10559 520835 535807 509048 480401 471913 441935 458205 484215 481411 492578 519042 549358 541655
10547 541655 566940 586936 583823 588366 619395 675281 758152 820003 853660 859736 843621 836146
10535 836146 825784 863069 887101 851958 813447 815627 809265 768713 759593 787842 791604 776411
10523 776411 807071 850808 893680 885973 898992 935087 949642 967804 987819 1037134 1098921 1143591
10511 1143591 1190945 1216230 1277799 1299674 1343393 1398006 1426509 1446165 1448329 1465482 1523847
10500 1523847 1572138 1591855 1620784 1701382 1824185 1945368 2036920 2148617 2272908 2417179
10490 2417179 2573728 2722524 2894342 3129182 3388641 3626489 3893921 4161863 4473970
10481 4473970 4833504 5214841 5651612 6273320 6984527 7593481 8195750 9072561 10209433
10472 10209433 11279996 12191284 13181262 14554446 16365908 18475207 20838980 23781223
10464 23781223 28040837 34354333 43363968 56508028 77352184 112286155 165911511
10457 165911511 218779644 242999359 257894752 299759745 355196326 363225478 317633904
10450 317633904 270874287 252779319 233185899 186700895 132360636 91325476 65474248
10443 65474248 49248677 38574729 31353993 26292849 22470182 19278735 16734232 14805871
10435 14805871 13211885 11658420 10352037 9480244 8681428 7707991 6747487 6069772 5578069
10426 5578069 5022125 4410468 3912740 3592983 3381069 3164535 2968605 2873710 2822129 2672456
10416 2672456 2451822 2277373 2169189 2063987 1909264 1746593 1597969 1491718 1444784 1386724
10406 1386724 1282645 1184790 1083123 1017549 961094 893493 827920 766532 709209 677922 676157
10395 676157 634379 585870 575518 539842 526029 507374 505138 491341 495360 496769 478140 478362
10383 478362 482356 440114 421545 442143 434871 442044 422328 385905 365872 315684 243746 229112
10371 229112 221617 208341 199020 186404 160261 157828 184717 191028 185075 187062 194216 195306 209892
10358 209892 210685 196031 184719 209788 221642 204370 202332 181006 144786 138352 161205 164463
10346 164463 125795 82043 43866 35736 46006 97569 120145 82517 38721 64789 119681 124326
10334 124326 105069 114885 169644 197704 206869 225799 237614 247580 279952 296389 293798 288830
10322 288830 287673 320453 322146 288269 282813 250013 244384 235474 234472 227031 201932 201194 202041 206264
10308 206264 221979 217131 210996 179205 164499 164632 168540 151237 149340 152599 144968 136353 114131
10295 114131 76813 66405 87355 113124 99654 94463 107109 119575 124487 121474 132254 151052
10283 151052 161250 150687 115048 81184 79030 68918 64186 72479 76959 60954 61061 76254 83720
10270 83720 86146 88314 58450 45447 74200 94455 104543 74601 55631 36701 17417 34048
10258 34048 47536 24218 12082 1957 -15960 -22252 -13733 20397 45295 50211 50014 32429 34914
10245 34914 31572 47017 35977 22010 9252 17765 53306 45342 44766 43867 37960 27759 49260
10232 49260 83115 76516 69454 54586 34996 35349 18677 4790 49318 55845 75152 69076 60087
10219 60087 65361 67997 79771 73456 63943 50933 53578 60663 54831 53225 43420 30674 35251 59098
10205 59098 67992 89702 69995 53658 43893 29338 6402 -1950 -1386 19295 73027 69799 35267
10192 35267 13346 10748 -2391 16831 11090 9416 28734 40312 36224 30187 47275 44353 9117
10179 9117 -5872 -24676 -49085 -58518 -45373 -33580 -11719 -3294 -10105 7345 30219 50418
10167 50418 44277 23052 33567 29735 10203 5599 18323 3354 -32121 -48856 -32748 -25148
10155 -25148 -20538 -41816 -31794 -5985 -10449 -567 8837 34233 41776 4312 -40746 -40345 -23314
10142 -23314 -31832 -59404 -36567 -15418 -28176 -38319 -18170 1372 14229 -9020 -12204 -12550
10130 -12550 -13792 -29058 -34183 -15647 1498 5485 -4102 -16174 -32712 4014 11692 14973 4597
10117 4597 3792 -3376 -6755 -4992 -35300 -45812 -30956 -26951 -7027 -14070 -25857 -33960 -23809
10104 -23809 -1569 -15711 -20558 -15022 -1167 765 -12784 -16727 -9433 -13813 197 36659 82512
10091 82512 84231 82465 90698 90632 74418 84681 76367 70589 58219 41295 48242 44418 27781 14726
10077 14726 2652 17336 3620 -26220 -55429 -30609 -22221 -10641 -20533 -16077 4 12064
10065 12064 57704 56690 35993 21011 31458 66260 89611 89009 109325 123483 147665 204295
10053 204295 290577 395881 564128 862355 1152635 1302674 1392288 1601251 1861952 1901019
10043 1901019 1681960 1450877 1344547 1230825 974527 708527 480888 327442 235805 155966
10033 155966 118793 106182 87272 65303 59638 30439 18370 18216 25016 -7653 -39537 -19526
10021 -19526 -14219 -4169 101 -2754 -28292 -47394 -43980 -30081 -2518 7404 -19632 -26511 -32851
10008 -32851 -47233 -74474 -74374 -56830 -77951 -83208 -59282 -25373 -23140 -14456 -13989 -14131 -26755
9995 -26755 -35392 -18179 -36216 -39657 -6727 69 8330 16479 9274 29874 26268 -26231 -32282
9982 -32282 -7121 -6143 -3809 3202 -14591 -21950 -15190 3208 12846 -11188 -154 -7527 -19753
9969 -19753 -27634 -32016 -42946 -51693 -31328 -11969 -35112 -60015 -50974 -28555 -8065 -7618 -25564
9956 -25564 -39166 -32046 -20126 -2667 -16001 -43596 -41335 -23876 -29039 -23821 -31151 -33972 -44516
9943 -44516 -69287 -89242 -54979 -42225 -59443 -35427 -16434 -18534 -39270 -49865 -58998 -33972
9931 -33972 -27874 -37453 -49934 -42280 -41129 -44701 -43024 -23088 -13602 11020 15513 18889 40796 40779
9917 40779 44027 56384 48443 41429 22142 44377 70306 96522 75836 45642 52257 60338 75089
9904 75089 78318 53029 27081 28396 33631 35692 22766 12794 -24999 -31117 -14398 962 2070
9891 2070 21828 34054 41783 46806 33522 13693 -5026 -25472 -33796 -24523 -308 -8540 -18769
9878 -18769 1614 -1823 2482 -21491 -38463 -59924 -72450 -62735 -43637 -31525 -27996 -23928 -24952
9865 -24952 -21287 -12324 -36 14444 18910 25143 30402 8660 -11328 -5038 -14211 -8172 6309
9852 6309 29976 54006 83287 106387 172037 317012 520607 800575 1034073 1037458 825401
9841 825401 586277 369066 177809 76714 69939 84175 66310 45643 27571 -5352 -2145
9830 -2145 20096 32685 23222 31974 28610 17502 20897 12962 15212 26518 18945 8549 7152 1096
9816 1096 -15373 -988 5254 -12857 1190 15327 25117 12987 2885 2704 13967 41841 50213
9803 50213 42148 36917 20718 44229 47153 49221 29390 14262 10665 2909 5215 38519 51341
9790 51341 44831 25051 19915 1692 6434 -1958 -35338 -60567 -29506 -9381 -2265 18933 35368
9777 35368 25788 15133 8332 -1139 11209 25686 4963 -11960 -7478 -15151 -2862 -4107 -2113
9764 -2113 1388 8217 25383 17801 -26047 -47693 -38463 -30056 -43074 -44347 -42003 -1813 25885
9751 25885 -2654 -16475 -19136 -41149 -40938 -20819 -25695 -8466 -11526 -7049 5814 27967 39686
9738 39686 38148 18536 -19494 -7099 2489 -8132 -13091 10603 37813 20546 8207 8151 13415
9725 13415 15960 879 -14890 -9028 -1913 6180 -3655 -12190 866 7064 -3446 -8740 11903
9712 11903 20364 8716 13887 23552 15078 2243 24176 33177 23131 24836 24670 5185 -8680
9699 -8680 -3270 10570 20809 -2512 -43669 -41247 10625 39292 23473 43232 40398 27555 -7288
9686 -7288 -2477 -688 7860 24643 32483 44330 53493 52102 57499 55179 53662 22473 2017 24540
9672 24540 36176 33467 56128 57552 36687 25879 11740 -13973 -23162 337 14992 47531
9660 47531 52925 30534 11336 -2514 -3756 -5997 8919 13292 20749 -4235 -18664 -14038 2152
9647 2152 33066 44453 31606 8067 -6196 -21401 -22715 11135 37167 28870 12454 -10498
9635 -10498 -8195 5300 -28137 -27484 -459 14509 6952 -15185 -26976 -7418 15283 -9433 -33651
9622 -33651 -9277 10313 11014 17739 -12318 -39943 -43593 -22510 -2568 9727 10542 28819 -2429
9609 -2429 -13489 -11528 -15874 2692 34103 32613 4337 -41290 -68487 -71658 -57141 -28708 -32471
9596 -32471 -36814 -45893 -81881 -100994 -65838 -42624 -8728 -14 -25823 -22397 -5442 8201 12140
9583 12140 18399 24567 49075 58688 32167 -1207 9131 27668 14868 -21968 -27833 -48014 -60642
9570 -60642 -51402 -48297 -57611 -58579 -13917 -7877 13529 19208 18173 5102 5181 10770 -11194 -5087
9556 -5087 -11537 -6959 -18555 -28732 -31551 -36137 -27288 -21317 -13701 -19964 -29302 -14831 -15058 511
9542 511 -9448 -19654 -10302 4250 549 26242 33477 40077 33976 27168 12583 16533 10496 -17839
9528 -17839 736 -4110 -37719 -38440 -22954 -7051 16661 25349 6093 904 -23579 -49572 -30080
9515 -30080 -18279 -11685 4542 27478 35191 29290 5255 5958 29244 22302 -28662 -40615 -36504
9502 -36504 -41177 -48327 -54395 -51750 -35706 -29270 -21257 9675 18267 11176 1147 -8261 -4484 12938
9488 12938 11011 -32759 -40367 -19939 -5471 10537 22809 19865 4344 -34023 -36917 -27678 -26251
9475 -26251 -24959 -13401 -16023 19053 38779 10602 -6022 -15925 -14786 -13207 -27992 -39080 -43086
9462 -43086 -16369 -7495 -16590 -16647 -1561 10493 10584 19985 11785 9505 3964 -6024 -42150 -39432 -15701
9447 -15701 4430 4826 -21754 -19403 3359 25571 49275 48544 30256 27744 50356 36117 31373
9434 31373 -981 -11314 -4703 -6281 -16328 13219 47940 71465 24356 -10381 -240 -18675
9422 -18675 -40406 -10789 -11038 -10104 10149 22560 31042 107 -25762 -49283 -53744 -68400 -48322
9409 -48322 -25600 -132 3210 -3485 -5924 -13342 -12934 12955 26211 12095 16253 43902 39055
9396 39055 26131 6812 6383 -3150 4489 5148 -15660 -27096 -25967 -15063 -22077 -6202 31335
9383 31335 38294 38592 48016 5533 -16005 -21900 -11318 19389 20612 43915 38248 24896 5233
9370 5233 -668 -14751 -43055 -30057 -22952 17029 33939 19768 6438 8560 30041 44099 70433
9357 70433 46369 19312 18730 22301 23079 23206 30258 21909 7877 15500 37503 58163 75637 36577
9343 36577 20654 22366 33113 43964 51036 54800 69930 72185 39801 16432 32961 27378 29411
9330 29411 33261 22108 -4904 -15879 -2412 6605 21282 18210 950 6549 12321 29166 39755
9317 39755 51146 52193 41395 43629 55776 52624 61679 62220 43717 18154 39119 79071 74281
9304 74281 78545 86067 88540 94262 95702 107687 109738 83222 68345 59895 66575 50599 58361 57756
9290 57756 31145 45023 20480 42417 48462 52803 67886 90272 127748 144650 137054 136066 144448
9277 144448 168524 150657 150417 155860 142445 145285 158779 151740 146189 142671 160317 186986 204191
9264 204191 232557 266905 273526 296759 288468 297354 317972 357098 413317 477991 528535 624050
9252 624050 721821 827640 983820 1205566 1501638 1847306 2263143 2716773 3075914 3297601
9242 3297601 3354369 3320308 3300485 3365968 3565676 3908853 4408856 5071672 5891333 6688838
9232 6688838 7143437 6984204 6188113 5062764 3964672 3053094 2399520 1899923 1538418
9223 1538418 1266610 1060864 892216 775290 683211 609025 544067 471008 407029 367548 329756
9212 329756 282593 259989 233259 229133 230733 235690 232310 210324 185163 163001 137304 115748
9200 115748 114035 122654 147497 162560 128810 138385 126539 113954 120875 100823 92432 86343 99507
9187 99507 96286 81326 106326 116035 120589 105155 78871 52778 63226 62864 55052 50471 45895
9174 45895 18162 30393 34660 26335 33653 43865 48338 50458 57089 36525 28369 48527 15396
9161 15396 -9891 7380 12715 11957 42939 66494 91757 79544 38346 24429 38482 44589 47259
9148 47259 37923 35948 34523 17307 14996 31097 31950 41293 29752 15488 17476 12884 15184 30070
9134 30070 47912 52573 38469 33964 40866 57896 42453 17156 1462 17005 30032 31000 12656
9121 12656 -577 26775 40978 26215 49350 63013 48276 19902 16345 -3961 4253 16781
9109 16781 10419 12812 21554 9752 5115 13640 -446 10370 7899 -7554 -13056 3410 72109
9096 72109 82316 47064 42212 16100 2276 6016 13569 25353 41016 32041 32448 34102 9776
9083 9776 -4085 14854 39799 56557 53821 11601 -20477 -20938 8576 24905 14670 8449 14435
9070 14435 28579 36093 20548 -2414 -4657 5019 20110 16596 12660 5867 18429 12819 -12941
9057 -12941 -22800 -1637 4161 9911 -13636 -14089 19801 37512 77204 88121 35990 -12495 -14562
9044 -14562 17773 3688 -10694 -14678 -1675 28740 20915 16733 42108 50398 68205 68887 33743
9031 33743 26920 11580 17872 24782 13232 5737 17440 2704 -22503 -43919 -40482 -41786 -21591
9018 -21591 -18122 -18685 16515 26595 13204 -23027 -42049 -8161 21308 29883 -6674 -5646 18469
9005 18469 35325 28788 31094 27682 8514 -9991 -25979 -15891 11408 6740 -6654 -10530 -5566
8992 -5566 4529 9288 22571 34080 41158 52178 36084 35067 28615 16947 7767 4487 16713
8979 16713 6972 -11553 -27629 -23848 -33688 -47342 -28155 -44331 -50555 -47699 -40266 7179 22292
8966 22292 5882 10660 14051 34370 27697 15440 10515 24597 37936 56517 47356 10126 -4431
8953 -4431 4930 22841 54090 28080 16160 11022 -11247 -17377 4661 21791 27358 14626 -9556
8940 -9556 -6759 -14255 -21776 2627 55618 63870 43411 33188 16799 20782 9514 20495 47191
8927 47191 44904 14092 -17087 1690 -5182 9550 15455 33481 15495 27850 26977 5652 27181
8914 27181 60703 52854 15296 -19651 -22157 21270 52116 85063 86365 33380 3024 12352 27782
8901 27782 28803 24508 21860 8720 -23271 4591 31380 8175 -7876 -23084 -17010 -10455 -6028
8888 -6028 1660 1858 25272 51626 33611 13394 22944 9258 16246 23101 16050 9829 -16688 2872
8874 2872 20071 -6612 -14215 3139 11737 18946 3076 2494 23801 31740 8157 -6837 21355
8861 21355 59362 52168 33718 22629 18203 9949 17064 28732 32776 10101 25532 32215 9294
8848 9294 2056 2368 23250 39802 33351 30656 1894 14137 9240 -736 16354 14122 -9160 -21480
8834 -21480 -28334 -23274 -19715 9060 23726 4308 16025 31284 23277 35194 54727 66888 62320
8821 62320 43356 33030 44417 26117 28241 14911 2952 21319 46029 48525 33650 -4232
8809 -4232 2808 2989 5159 -4802 -4904 -4784 18257 45347 67687 47158 43989 60124 59367 56662 39825
8794 39825 37286 46082 49448 47301 48466 66632 73120 58617 63965 53735 31690 17285 35462
8781 35462 41762 53295 63878 83474 90663 80924 48470 33497 32070 18720 32969 45096 41800
8768 41800 18951 12439 10077 -7316 -4229 15287 38855 64349 73406 63452 72625 79482 64426
8755 64426 67385 95539 120784 115988 95899 77712 62720 57822 35006 41027 18747 25039 51566
8742 51566 50942 62451 102303 110110 95856 85611 103434 94400 100399 124697 99680 79845 57561
8729 57561 75851 66864 57258 88771 106126 106101 104177 117026 87803 109757 126385 121614 138307
8716 138307 134765 143480 140911 113924 110312 134984 148125 134774 136253 186864 176770 184616 172042
8703 172042 140421 107484 120084 134659 175232 190599 202326 202404 162711 164796 199501 206413 203332
8690 203332 189342 178133 195501 212476 210315 189451 177133 178059 168631 158314 183778 200456
8678 200456 223493 240300 233666 204245 195442 184216 182952 175910 171599 185309 198527 199576 195223
8665 195223 205517 218129 227647 220180 216895 226653 230698 254689 251042 247017 245793 257379 266694
8652 266694 271785 273022 276658 311450 336610 376872 418206 492231 579912 575858 507822 431275
8640 431275 361854 372203 361731 336568 321141 335104 362229 380016 371800 376391 394551 431481
8628 431481 427261 427573 445418 476597 488639 489548 528037 540295 534592 544046 550548 540929 581583
8615 581583 639931 669985 697237 691946 705689 758476 843464 880896 918291 971475 1030190 1128149
8603 1128149 1242894 1367593 1527230 1782600 2052411 2179051 2161636 2148521 2154075 2167944
8593 2167944 2137120 2038810 1847508 1598090 1344369 1124647 953949 814632 698973 631876
8583 631876 603655 592981 553953 508575 482678 443700 430134 379325 334516 314797 306899 271986
8571 271986 260190 262106 272569 259564 230699 214989 201857 197908 203528 203741 204406 228183 235308
8558 235308 231369 224205 265048 344037 390510 373877 314106 244904 167458 133667 136546 115708
8546 115708 96345 79827 93134 126429 162614 148177 140591 137132 133958 149509 144268 114755
8534 114755 110855 148895 152215 147201 148640 161887 177435 152147 106365 59427 54061 62517 64113
8521 64113 75990 79223 80421 89565 102320 76862 47966 49489 77241 94494 91990 66764 48866
8508 48866 73901 78322 62213 51551 58592 55502 61383 69969 51666 48569 43460 66262 75029
8495 75029 76590 59272 41347 57284 78258 61728 51799 37366 18526 41244 41116 52697 55726
8482 55726 53350 54762 63482 45821 40135 63613 76577 61437 45839 26547 15118 -5046 330
8469 330 -4354 -5491 13619 30813 57033 46483 27664 30291 45675 26893 11903 20726 26456
8456 26456 18860 4644 13404 42939 56236 71939 92787 92618 85980 87793 63387 49333 27943
8443 27943 -7076 -7715 -21531 -14390 -12455 -23120 -37541 -20711 -13646 12037 50765 64101 60806
8430 60806 28443 14089 6110 -5687 1211 21380 30023 18815 7422 9081 24953 10315 7486
8417 7486 19699 18066 40962 38249 51535 38310 8709 5454 37147 39945 37438 15512 -16151
8404 -16151 -27704 -39350 -41280 -37419 5543 510 -20941 -15994 5001 27668 43534 23020 22379
8391 22379 37798 28823 39121 35403 35528 34284 11572 13121 27309 26833 30662 21176 10389 -4058
8377 -4058 19113 29926 -397 -7041 -3731 -2429 457 3033 14847 30182 20084 13606 9230
8364 9230 6712 22394 44136 29957 30731 32501 58306 59934 62412 70855 69518 63723 32643 29880
8350 29880 50363 17910 1233 11992 66185 74245 54601 24255 7493 -12696 -18064 18325
8338 18325 14371 13950 4617 40463 41452 25501 29948 25675 15691 9530 -7077 -14164 -23479 1881
8324 1881 -13037 -8458 891 18329 28419 16210 6365 12953 -7282 -25929 4016 38800 43244
8311 43244 24821 30246 37169 34907 15507 -10174 -6292 -15381 -31408 -50083 -42546 -8042 14043
8298 14043 27621 32090 17165 19229 19503 40467 27544 10743 19943 18342 35028 27559 316
8285 316 -2287 -809 -2869 13137 5986 -7990 752 22781 44975 50036 29599 17059 17878 19225
8271 19225 37062 34018 37196 23170 20934 6095 195 25647 26348 18528 31364 30624 22300 20325
8257 20325 -15036 -41206 -21113 -12045 32862 52179 41954 29025 30389 26499 24353 14343 14380
8244 14380 31005 28799 11444 4528 -1259 13125 23353 24248 18212 29520 32788 30577 39173 27442
8230 27442 11402 1059 5671 39528 64393 50613 22706 5515 -8731 -51422 -24834 13989
8218 13989 25100 46849 21449 -5424 4334 2580 -15872 14653 23169 11137 6344 3183 -12606
8205 -12606 -12441 15804 32731 32204 8266 -10901 -38685 -39359 -25187 -15869 5347 19494 17469
8192 17469 8666 31170 45132 44180 33967 30815 29633 29329 30530 33366 30820 30106 18150 36728
8178 36728 27980 31033 28189 27043 19952 10561 -5339 -22313 -15516 5872 20475 14556 -8006
8165 -8006 -36594 -61712 -32257 88 29952 39113 32958 17171 10173 -12025 4890 -6219 -2875
8152 -2875 6856 19865 20938 24198 -2879 -5767 -142 10730 35982 29983 665 21848 71705
8139 71705 76394 70192 44275 8747 12715 21875 26270 10511 -10734 11961 36423 67099 76560
8126 76560 50262 27138 -8021 -18676 -4793 18616 27892 8232 -5189 16642 45275 44473
8114 44473 38703 28812 39856 47290 29266 10792 16960 52826 70441 50078 26129 15782 14235
8101 14235 9376 -15240 -7018 13587 11371 6701 -685 23401 57502 48801 33311 45712 34907
8088 34907 30606 38314 22469 3247 -6080 17146 42098 73080 91181 71802 40562 48538 14118
8075 14118 -750 5118 -1560 16702 50599 73722 89111 83217 96761 103176 131047 143980 125491
8062 125491 51570 43761 65850 48685 33929 26133 31118 63007 63654 55957 33879 78531 100246
8049 100246 99733 102361 128937 113020 91948 94899 108095 140466 164781 157779 153871 142773 143276
8036 143276 140767 142669 172743 162289 144654 162790 158345 133833 137582 130927 151669 156263 147825
8023 147825 145383 119537 160315 167088 153088 169815 171440 175571 211213 241300 232263 208250 214573
8010 214573 231198 220634 218213 238230 262519 255430 226517 230818 247815 283405 322557 362854
7998 362854 380160 330477 267936 243347 233348 232130 226591 209070 230508 250044 193949 137018
7986 137018 135121 154851 159746 170920 167878 183839 173178 172679 188941 170501 146375 132425 143014
7973 143014 175357 180239 175098 163643 156168 155909 166297 191749 201303 214164 222755 208588 226726
7960 226726 246167 253759 256288 276498 295795 306505 275651 265119 260634 238758 234279 254466
7948 254466 220067 168536 151460 151995 135346 126553 150887 155029 108141 110495 137459 103875 74726
7935 74726 81067 73317 61214 68930 83806 100027 109540 77807 73877 95690 114881 124829 131209
7922 131209 124306 116507 118272 125282 127034 123537 113881 105537 111691 122549 89205 78443 76561 81535
7908 81535 84336 77881 59380 27087 39423 39841 33017 34824 47538 43584 36405 37800 30742 43527
7894 43527 63750 64814 47977 45892 34672 17474 14872 38288 53916 66561 68023 57993 57211
7881 57211 66708 69754 52670 17203 11125 21248 25056 9619 13848 30793 12075 -16777 -26973
7868 -26973 -1456 19797 17239 34333 32875 13350 -21041 7738 -4293 -37109 -6876 12706
7856 12706 20642 38813 28911 22966 6578 -29921 -25439 -32552 -23475 -10154 -10329 3769 12974 20440
7842 20440 2226 5148 7796 14114 21364 19884 13747 10459 5716 11564 32291 21532 -8237 -27573
7828 -27573 -22049 -26138 -41750 -44478 -38235 -24759 -27525 -6698 -8153 -14882 -13417 -2085 -19662
7815 -19662 -21795 -2067 14401 8448 -16725 -30427 -40553 -19976 -7721 8193 15275 2717
7803 2717 -21910 -18397 1388 -24477 -52640 -33624 -5947 -32936 -29039 -27354 -10995 34657 13419
7790 13419 16903 16793 23108 7946 16183 30375 -2145 -11456 -15565 -7357 -22510 -14921 8797 35726
7776 35726 38998 53208 38139 11104 -584 -18350 -9070 -2398 -10099 -7962 -8264 -591 218 10179
7762 10179 25515 16667 4069 -1115 72 3912 -4232 -19949 -22158 -1444 13050 2084 -12592
7749 -12592 -6853 332 -5844 -4718 3298 -3711 3315 15331 -26166 -64325 -72392 -75407 -91933 -80170
7735 -80170 -42875 -19739 -6550 5009 7517 26178 39870 38522 18262 -9704 8838 35463
7723 35463 37609 21491 15224 -8850 -33448 -7801 -6423 -10614 -16637 -16230 -22621 -22827 3185 13708
7709 13708 9076 -8456 -19614 -5269 -10132 -17597 -32715 -21316 -4392 -3847 -34151 -30998 -2618
7696 -2618 -9042 -30067 -15272 -35955 -41579 2769 49106 21101 11879 45411 58313 67837 30568
7683 30568 24791 16649 -12666 -18380 -18262 -2778 -21372 -12337 -14933 -10213 -21548 -24110 -11943 11366
7669 11366 21880 -2179 -7948 -9090 -8679 -30038 -44374 -58996 -66023 -62104 -67566 -51270 -12318
7656 -12318 -15363 -34146 -47402 -75603 -54873 -10945 34527 29544 -3336 -15310 -1318 -3299
7644 -3299 9380 4363 -19837 -53369 -100386 -81943 -18772 12189 15177 23466 12933 -14548 -29424
7631 -29424 -38044 -56294 -61323 -60298 -40686 -43615 -45817 -34957 -21620 -33840 -68330 -54777 -45917
7618 -45917 -17314 6333 -8587 -5145 -25077 -14539 3536 -749 -7123 -5607 -9369 -21402 -8737
7605 -8737 -14595 -18681 -30523 -27281 2099 16396 25451 2416 9374 26642 42926 9916 -13506
7592 -13506 -15910 -21219 -30887 -38520 -37020 -24676 -50063 -66439 -62172 -35983 -33440 -33070 -13889 -22539
7578 -22539 -34196 -9245 -1580 -13080 -3383 9399 4734 7714 9775 -13892 -6878 1003 -5242
7565 -5242 -4503 -6508 -16045 -22760 -33935 -34827 -44037 -46385 -42103 -48952 -44364 -37621 -41563 -44300 -44230 -50990
7549 -50990 -50828 -44298 -13595 -40749 -47609 -17929 -15566 -5970 5633 16756 -11599 -50821 -60607
7536 -60607 -32061 -27341 -28030 -10667 5877 19565 25775 12898 -18920 -38912 -49490 -40808 -33797
7523 -33797 -43530 -48543 -48937 -59501 -40303 -36604 -16057 -18275 -9488 15814 1877 -36507 -21257
7510 -21257 -26956 -27915 -7803 21059 22978 15972 9459 -12467 -27814 -651 8301 1143 -10587
7497 -10587 -30569 -11743 1472 2803 10441 29309 27658 30474 8382 -4075 880 1068 1680 6708
7483 6708 -8096 -13721 -10222 -11012 -7350 -13144 -23659 -32988 -14903 -24372 -49390 -36545 -17216 -25757
7469 -25757 -21520 -24436 -48261 -36551 -40377 -15931 -187 -23265 -8913 17809 47808 39071 19632
7456 19632 18186 -4067 -19886 -5962 -4149 -25963 -35324 -12764 -2688 -26578 -24425 -7049 2069
7443 2069 -15190 -41851 -38242 -16262 -21554 5314 23061 4351 -46626 -62396 -35485 -36073 -32465
7430 -32465 -13844 -7876 -407 2364 20433 32196 6403 2050 -1491 20829 24090 -3298 -12349
7417 -12349 -500 -16162 -9227 14298 -4243 -35672 -39012 -22998 -37422 -42300 -60924 -51049 -30016
7404 -30016 -8025 2501 1209 1336 -17578 -20565 -45345 -30793 -11109 -12693 6974 14533 -3364
7391 -3364 -30706 -53326 -32654 -8024 -9187 -16564 -33203 -23404 -3144 -12433 -45868 -51094 -32185
7378 -32185 -24593 -23963 -34251 -25847 -24872 -25983 -40836 -23110 -16153 -26491 -27848 -13854 9246 18774
7364 18774 12270 6436 13502 -17240 -10561 -22575 -2222 -6575 -8178 8212 -8594 -5396 -26619
7351 -26619 -25489 -36563 -17508 16958 13385 -24891 -33782 -12210 -15128 9032 3667 12386 33576
7338 33576 24654 -2213 -19570 -41015 -33701 -13508 -17543 -23532 -42149 -41222 -4170 7515 6410
7325 6410 10450 -1074 -11117 -13583 -23998 -40161 -40954 -38851 -22444 -4257 -4875 -31643 -43207
7312 -43207 -24132 -26671 -23997 -5690 16469 21916 6898 6721 23028 5430 -3764 -17530 -13354
7299 -13354 4882 6494 12619 10437 26036 22166 4278 -1107 -22738 -7016 1168 15361 38333
7286 38333 35189 -7965 1370 -7595 -25375 -3023 8886 22805 18232 15197 181 -13173 -7344
7273 -7344 -4815 -2187 -5806 -17188 -14332 -22578 -22347 -22671 -28522 -51579 -60337 -51062 -25342 -44550
7259 -44550 -72718 -77976 -42103 -26782 -44791 -19128 -3643 -2478 -3751 3060 -4379 8220 19480
7246 19480 -5610 -35112 -59264 -52292 -54045 -84219 -38130 -20206 -8881 4963 -7810 -39306
7234 -39306 -22398 -2147 11334 6666 7846 -3885 -21661 -31485 -44331 -21335 -40538 -45633 -26126
7221 -26126 -13154 473 -10188 -27759 -36192 -46325 -35641 -26967 -35000 -41520 -62202 -81570 -41534
7208 -41534 -15716 -13001 -19957 8893 21679 18448 -206 -24446 -38051 -29118 -5932 8840 7297
7195 7297 -12142 -15563 -9562 -26309 -45194 -33094 8585 8042 -2120 -19437 -27906 -34743 -70787
7182 -70787 -70486 -39985 -17550 -23553 -70622 -79075 -61452 -42420 -25177 -34009 -30286 269 8687
7169 8687 -18191 -32546 -54647 -58548 -55803 -28644 -12658 -4540 -1315 -7238 -6862 -9442 -18259 -11395
7155 -11395 -17091 -4260 -16139 -38271 -20773 -3196 1332 -2241 -18688 -39168 -41433 -31039 -37782
7142 -37782 -56993 -65361 -55482 -40321 -42196 -38933 -21858 -1821 -4769 4314 2420 -2807 1104 22319
7128 22319 19914 -2293 -33542 -43032 -56503 -37327 -13611 -13276 -14908 11900 23326 13153 8979
7115 8979 8554 -1795 -10581 12131 34622 9266 6325 869 -17060 -14165 -22746 -30489 -4461 8533
7101 8533 4853 -12825 -28500 -22379 -18950 -40076 -47470 -41982 -20342 -22624 -8074 4800 -11938
7088 -11938 2314 3183 -43212 -28097 -27520 -28170 -29116 -35664 -7998 7263 29132 31310 24395 19705
7074 19705 24074 10613 -7943 -25810 -37345 -33933 -13491 -2313 1499 -15236 -60126 -65432 -52910
7061 -52910 -50750 -66355 -72575 -77430 -31773 13856 5745 -1574 1180 -24983 -51623 -66405 -63234
7048 -63234 -53826 -62389 -89254 -90946 -49606 -30126 -18900 -8709 -6253 18380 33128 16429 -3160
7035 -3160 -24436 -33400 -13460 16550 5210 147 4609 -5141 -43414 -61023 -50380 -44343 -52810
7022 -52810 -49371 -46066 -19763 15085 19023 22725 11964 -2248 11946 10991 -17522 -34180 -34497
7009 -34497 -38788 -44488 -68951 -69380 -39655 -12633 -15349 -37997 -39422 -27479 -23021 -12426 32331
6996 32331 53014 54162 36367 30818 47454 69417 78039 75689 34735 13172 -2559 10848 -8399
6983 -8399 2572 -10015 -8583 -14341 -15148 -41598 -41289 -27696 -18703 -23487 -46438 -58308 -84907 -78175
6969 -78175 -70927 -35325 -4807 26321 45054 31491 50193 35021 -4083 -2808 16179 -14749
6957 -14749 -40343 -25741 -31682 -25088 -67157 -70093 -66555 -49916 -49247 -61044 -46702 -37667 -32524
6944 -32524 -33189 -16887 -22165 -19338 -30565 -44893 -24542 -18825 -15690 -7982 -19270 -19358 -16002 -28819
6930 -28819 -54490 -71245 -50903 -51946 -53365 -34964 -20803 -39659 -46986 -35491 -52177 -41809
6918 -41809 -31910 -9649 1972 3944 -10976 -17218 -33297 -25436 11478 19994 16378 -24 -9729
6905 -9729 -22508 -33785 -16795 8429 -3721 -20056 -26311 -20722 -17595 12261 -4144 -15008 -27346
6892 -27346 -34590 -13203 -10301 -18938 -27483 -32868 -34442 -43972 -34216 -29021 -35604 -53584 -67128 -44692
6878 -44692 -40793 -48279 -49298 -43039 -46802 -42319 -45036 -34723 -37341 -43270 -45189 -26602 -2249 -3093
6864 -3093 -27833 -17802 -7313 -11426 -11211 15728 37948 43512 34858 8229 18713 23734 24443 8946
6850 8946 -31777 -46127 -37328 -50275 -72163 -28638 -10804 -20523 -35126 -19316 -16688 -28464 -17907
6837 -17907 -4857 12279 5412 -332 -528 -18822 -32464 -9510 16941 12311 -7123 1265 18794
6824 18794 37122 34149 32949 32176 30141 2578 -24091 -32555 -34079 -392 3224 8285 27540 15318
6810 15318 7319 -2340 4404 7831 17134 23783 37826 31629 41409 56809 60599 23938 -4618 -7204
6796 -7204 -17332 -30921 -47257 -42952 -27831 -10203 -18097 -16594 -11880 11358 17042 18632 -3313
6783 -3313 -10159 12569 24058 639 -13502 -19826 -39992 -27105 -21584 -4663 1647 -13492 5235
6770 5235 2887 20967 17063 3359 8797 19197 15537 14092 -12024 -21872 -14570 13728 33449
6757 33449 27966 19998 -2638 -14222 -8193 23402 34890 14809 9240 1271 2649 22678 52161
6744 52161 49724 61205 81442 91777 74795 52112 50269 44892 46138 20355 34216 48604 42939
6731 42939 50938 77123 113313 161715 215939 296056 404706 571368 796806 1011135 1045911
6720 1045911 845350 564436 365649 252832 170031 102860 71551 62465 50543 32470 57538
6709 57538 41011 35260 36363 26940 6186 11625 -7975 -10654 27192 54555 77589 61415 46497
6696 46497 22280 -2881 -22318 -30425 -33936 -23363 -27482 -8474 8599 6926 13344 19947 2468
6683 2468 -2509 5821 23199 24208 12606 -5969 -21185 -27741 -17641 16988 19180 16263 7938
6670 7938 -8859 -30263 -17386 9972 12577 -6957 -8308 -11670 -9283 2011 -18612 -40625 -31274
6657 -31274 -8263 -5636 -11274 -37469 -25151 -2782 -3419 5454 19782 36484 25003 -847 -23617
6644 -23617 -19508 -38418 -21134 -26930 -28888 -12176 23129 6323 -17082 -18083 -24780 -22678 -13970
6631 -13970 15545 23516 25665 15130 8535 13792 3032 -3589 8152 33062 25675 29808 -6965
6618 -6965 -27305 1796 -18170 -46524 -60604 -45752 -18053 -5547 -22508 -38338 -61136 -41033
6606 -41033 -10092 -48 -35095 -49670 -36398 -23350 -22831 -3557 26383 40840 29441 -12709
6594 -12709 -1264 10691 3960 6369 -21732 -9368 127 -798 -22238 -54452 -47481 -45278 -54134
6581 -54134 -46863 -51022 -65851 -61316 -63982 -58454 -44760 -41467 -38793 -30827 -23311 -14987 -18577 -13365
6567 -13365 -11026 -15564 -18024 -16055 -22122 -25297 -3888 3399 12547 4311 7676 16673 4604 938
6553 938 7977 12321 6300 -23340 -24639 -21270 20290 31315 7477 -10593 24209 16658 4648
6540 4648 -7327 -29842 -36066 -17606 2689 -15957 -26427 -31689 -7103 18533 15113 4912 20111
6527 20111 -3017 4950 21472 23638 6812 3243 10824 7400 -18166 -29858 -11293 -13518 -16864
6514 -16864 -36507 -52304 -55115 -20634 7775 -7319 -23113 -11591 -15768 -27244 -1516 19401
6502 19401 4331 -17062 -27429 -39863 -41755 -51325 -54286 -29908 -35663 -41971 -23214 787 -46
6489 -46 -26629 -45641 -22127 1960 -3202 -22044 -28017 -20423 -28452 -42632 -40145 -33042 -39009 -39355
6475 -39355 -16754 1218 16111 42830 52566 21453 -28462 -31917 -24168 -28364 -35794 -32639 -15037
6462 -15037 -7299 7423 7534 15327 5059 4126 3879 2715 1838 11397 19473 -3383 -7310 15006 11881
6447 11881 -19578 -50143 -91666 -70488 -46963 -42231 -15336 -14243 -1452 -4084 -9256 -12065 -21240
6434 -21240 -16350 4383 22841 41464 -7062 -26640 -26976 -61378 -83919 -70333 -53084 -22161
6422 -22161 21989 4884 -8030 -23503 -48902 -43096 -41527 -39240 -48017 -50059 -8026 -6424 5349
6409 5349 -11079 -23929 -15253 -3039 -18233 -14588 -27772 -9255 -4422 -1584 5773 -10012 -42399
6396 -42399 -59307 -74096 -70175 -55433 -17424 19560 -3474 -20722 -90 12098 -1807 -910
6384 -910 15533 36869 23569 7088 -12923 -49158 -52635 -48076 -20114 -4240 -1474 -19593 -29987
6371 -29987 -12728 13545 -4366 -19664 -36658 -63029 -54144 -36929 -23682 -27214 -23564 -16664 -16975
6358 -16975 -15443 -3489 22989 16249 2956 -26806 -14367 -18547 -9525 17751 18439 8462 25802
6345 25802 7742 14794 11512 7907 -4395 676 -317 -13466 -18847 19809 37183 24457 20779
6332 20779 -322 -32760 -42966 -37241 -38628 -25265 -28199 -30658 -24299 -27829 -38859 -43974 -38918
6319 -38918 -45932 -42932 -45584 -69687 -74798 -42080 -15381 -4358 4092 -18908 -54149 -26668 -2356
6306 -2356 23403 17589 -1978 -1937 -12753 -23380 -45451 -33297 -11707 22642 25091 6856 -4584
6293 -4584 -24754 -30852 -30426 -23383 -17329 -22389 -33026 -16396 -14639 -4477 -16580 -31767 -31120 -32171
6279 -32171 -35813 -16638 -23648 -12737 -20903 -12068 -12311 -35881 -18216 -3415 -6717 -2094 1281 -5087
6265 -5087 -1302 -1411 4242 31570 68130 59728 43667 19465 -4422 -11102 -6172 5002 -1393 -16768
6251 -16768 -6555 872 -24337 -40066 -32560 -14853 -15295 -31228 -22901 -27172 -25431 3572 1185
6238 1185 7795 -23276 -32603 -15589 -21719 -30840 -47987 -52226 -11411 -19350 -41702 -61873 -45822
6225 -45822 -31839 -35165 -10248 32626 43722 23590 -15426 -47093 -56057 -37906 -17287 5316
6213 5316 -9897 1024 27387 14145 -362 -25899 -27860 -20271 -25636 -31600 -35074 -24359 -8957
6200 -8957 2605 -15373 -41725 -28093 -30289 -20122 -6297 10329 14883 19884 -6738 -14778 13271
6187 13271 23409 381 -29085 -45408 -26442 11944 11439 8266 26221 49279 69985 58544
6175 58544 51966 32307 -3686 -30977 -32961 -44955 -55097 -31990 -9375 -8964 -17256 -45469 -50651
6162 -50651 -29180 -25057 -34855 -45897 -36140 -7968 -17285 -33046 -40133 -15182 -16268 -7839 -29748
6149 -29748 -47599 -52701 -3341 42807 9352 -19027 -13723 -10794 -23406 -43190 -35365 -6662 6937
6136 6937 4679 -1525 -9776 -3955 12333 37920 52946 40171 6784 -33426 -36986 -30181 9704
6123 9704 2692 -1831 -819 -6678 -3735 -16854 -31141 -40903 -41696 -37310 -39133 -30221 -26241 -21479 -15650
6108 -15650 1770 -1147 -13397 -31518 -30537 -20720 -938 -262 -2652 8131 11689 -7223 -11372 16703
6094 16703 10730 8932 12886 18266 26115 9650 1383 4053 2564 7207 -1236 -5065 352 -12833
6080 -12833 -10361 18418 35945 36208 44200 34256 25100 -7556 -37681 -36138 -31515 -23781 -19219 -16184
6066 -16184 -11207 -25752 -30554 -3994 10578 -191 5693 -9541 -35670 -39151 -15433 9173 19064
6053 19064 22510 8707 -6375 -3156 26410 80827 73068 52104 2225 -26732 -23377 -29388 -29035
6040 -29035 -23274 -27978 -38321 -30494 -43110 -44166 -38007 -35090 -2781 -11662 -37939 -20239 -15946
6027 -15946 -30754 10662 24038 11085 5642 -111 -25373 -24278 -28425 -21120 -23453 -32074 -32056 -14398
6013 -14398 3582 12594 37721 27812 13234 6260 9377 -11475 -2672 6800 211 -13027 -11910
6000 -11910 -28618 -41115 -20802 -32141 -25559 -11223 -6247 -17366 -30768 -18994 -15219 -9338 39140
5987 39140 26279 -500 -10691 -8264 14484 40462 51826 55372 37197 -1421 -6666 -14660 -9616
5974 -9616 -10825 -10526 10164 9356 620 -12024 -31320 -40655 -28910 -2767 -15492 -16030 -328 9124
5960 9124 -1977 -11978 -25170 -11322 -19651 4650 50107 55481 29380 17418 23342 13782 36050
5947 36050 48139 39502 44898 66461 34897 11401 -10987 -12404 -11605 7199 7989 -5 27408
5934 27408 47427 46866 37897 29794 35264 54091 49944 36389 11959 17236 3179 3330 16170 -7959
5920 -7959 -17145 13461 23049 25857 17699 28417 9285 -8092 -8278 -6243 -19123 3810 24181
5907 24181 18225 -12069 -16475 14842 41058 21476 -23923 -32026 -1264 26302 11012 -20370
5895 -20370 -42171 -37091 -12643 -18492 -8706 4593 16315 12903 -234 -1508 -3017 -21075 -35977
5882 -35977 -37705 -20395 4280 -7218 -32341 -43219 -37307 -10013 -12569 -32978 -33149 -31987 -44046
5869 -44046 -28689 -20278 -36913 1186 10644 -9976 -10627 7156 -21881 -39198 -13673 6666 2178
5856 2178 1289 -582 13082 29386 50074 36661 40498 38704 15998 8186 3406 -11615 -5441 -18431
5842 -18431 -15738 18833 -5197 -14119 -1036 -13024 -6271 8831 1614 -13841 8773 15397 20323
5829 20323 7025 -1081 16207 -13551 2433 26867 33807 24073 -19785 -49479 -70135 -23277
5817 -23277 7514 12858 37887 52894 33840 2223 2012 9487 1337 150 -6365 3259 25897
5804 25897 13157 -12855 -2236 16700 9866 8292 8690 -8938 -8863 -962 -13886 -30126 -14328
5791 -14328 1590 27210 28645 16867 12535 -10167 -10490 8251 22494 -13866 -41589 -50898 -38794
5778 -38794 -39721 -28724 -23398 -9311 31556 18960 796 20997 13140 -2666 -13082 -25423 -35209
5765 -35209 -29991 -18851 -7452 -10414 -21249 -11751 -4758 -29774 -21098 -27149 -34837 -44113 -53430 -46389
5751 -46389 -42426 -22393 -19578 -15462 10523 23126 13897 -3132 -10779 -9196 -7747 -44331 -61167
5738 -61167 -41887 -37389 -42506 -31753 -60123 -63088 -37441 -31802 -30732 -21146 -15440 -14857 -31879 4653
5724 4653 32948 13931 22291 13602 15008 14147 28409 22632 8388 -26174 -54004 -53181 -36752 -56430
5710 -56430 -51750 -33036 -34655 -15051 -4054 -16366 -13111 -20242 -21937 -14205 -17222 -27294 -20130
5697 -20130 29627 36653 28500 29003 27535 21463 14170 8704 1072 10140 23698 22752 14716 3932
5683 3932 -557 -24104 -28813 -19336 20899 24610 7445 -22738 -21543 -14781 -9374 -10890 -26401 -53930
5669 -53930 -40671 -25304 -14982 -9623 9370 17140 12602 -10410 -26850 -80065 -81189 -50849 -12962
5656 -12962 6093 9458 14120 18093 7137 4201 -10071 -4372 -3296 -3347 -8371 -25248 -54234 -38952
5642 -38952 -39114 -24900 6888 45138 55120 59507 59374 42190 22929 -787 21211 34361 50192
5629 50192 37120 7329 14081 42237 34372 6098 2092 18665 23015 29957 23474 17276 30848
5616 30848 35381 41585 31641 5886 3143 8424 -9943 -38237 -22548 -21365 -36461 -10371 5487
5603 5487 -23559 -29345 -6356 -10853 698 -2618 -15894 -9052 12931 11116 -699 7003 32950
5590 32950 34112 23185 -22761 -17612 -6791 3974 5807 -1662 -11338 -18181 -18197 -17273 11269 42595
5576 42595 39265 19930 11806 9181 4090 10175 -12729 -3080 17675 28890 -2596 22685 10524
5563 10524 -4787 -20100 -13524 -5933 -3392 -7872 -24109 -26762 -13352 -2484 6346 -3458 5325
5550 5325 -1205 -13147 16770 11410 -12633 -13805 -27974 -53460 -49239 -58216 -53340 -32550 -23860
5537 -23860 -29950 -27242 -36662 -34137 -41786 -24221 1767 -361 -11431 546 813 3963 -7779 14667
5523 14667 49753 40584 36384 44245 18226 -16508 -38128 -42760 -22648 -8110 7080 21698 8972
5510 8972 985 -13526 -25451 -27545 -34612 -29398 -44104 -20389 -8027 -4369 -10547 5684 5511 -24328
5496 -24328 -28084 -21721 -7723 -19037 -26883 -9534 22967 23050 12467 6052 2702 22580 22634 19453
5482 19453 37568 46107 51939 42283 35529 30557 3887 -11546 1772 -931 -8964 -25441 -17685
5469 -17685 -8849 20501 39031 41426 35754 36300 36730 32317 31320 7146 2069 14082 24764 7653
5455 7653 -3409 230 12648 12551 22637 42169 48698 41503 29768 25704 33734 30363 25602 10520
5441 10520 10488 27125 43447 27335 -9513 -19652 -5392 13338 25567 -2182 -43397 -45706 -10749
5428 -10749 -1981 -6730 -12567 -8967 15436 23119 20011 18867 17686 46507 41796 27688 9363 -16818
5414 -16818 -28076 -53959 -62055 -65889 -29352 -5301 -7655 -31367 -44666 -20373 -34639 -30709 -21379
5401 -21379 2907 2362 8842 34721 31424 -20503 -19774 345 7743 10330 27452 17955 17026 2885
5387 2885 -9248 -1696 11046 8969 10928 -9521 -39638 -37462 9814 931 -20304 -2512 13197
5374 13197 -20118 -39652 -32009 -12562 -6400 -6654 -100 1689 -4638 -13844 -10135 16595 50089 29671
5360 29671 -5573 -41220 -75710 -67707 -53125 -41449 -15265 -14404 -25853 -26437 -23866 -3835 -31986
5347 -31986 -33459 -42652 -27926 -13907 -18957 -27976 -19950 -14764 -699 -18697 -21909 -7774 14154
5334 14154 -1546 -2076 3272 15473 29260 29994 12572 5821 -1897 -2155 33568 38066 21051 32563
5320 32563 35197 6189 -6699 -6363 -19957 -38176 -29664 -269 18204 10934 3755 -20799 1127
5307 1127 -8707 -13921 -17916 -10118 -7402 -6490 8918 -5595 -59625 -70518 -69345 -61301 -39330 4212
5293 4212 38557 54689 45456 35733 23478 -1462 -11578 -14 -2370 11538 13213 -6853 -16483
5280 -16483 -9837 -9502 -8409 22913 1434 -39904 -49348 -41901 -24436 -31741 -17301 12580 -1921
5267 -1921 -25665 -35757 -18706 -2395 -28493 -66052 -51587 -58880 -57189 -31951 -17291 -13979 -2805
5254 -2805 18321 25193 -2716 -16288 -21225 -9285 8085 28564 48640 41449 5910 16020 15463
5241 15463 -1981 -9375 851 8525 4997 -1967 -7151 -6461 -35595 -35539 -10710 4466 7045 -5463
5227 -5463 -22080 -29798 -10242 -16019 -30022 -29483 -17878 -1966 -8704 -12842 -38855 -23349 -8561
5214 -8561 -27266 -32316 -25054 -20113 -34129 -30676 -53463 -40235 -41755 -17656 -2636 -35394 -49751
5201 -49751 -26850 -4742 -19972 -12573 -23914 -33703 -14237 -12804 -15234 -17738 -7181 11696 13747
5188 13747 -7724 -1392 15366 12383 -9401 24194 63728 39242 4333 -22277 -36003 -51913
5176 -51913 -63107 -60213 -52919 -1198 35049 42639 37801 35577 14671 -3796 -17145 -25897 -21285
5163 -21285 -26382 -23423 -821 21172 41665 58183 36034 2245 21548 48221 34068 23140
5151 23140 147 -10797 -11475 -23424 -42469 -13310 27267 4676 7958 33811 37993 21456 34458
5138 34458 32087 15818 17521 7470 2632 -738 12241 29613 18091 7871 -32502 -41930 -39123
5125 -39123 -14188 -25365 -40798 -12009 -2674 -16765 -24857 -14549 -18940 -7592 531 5139 1942
5112 1942 5050 7574 -5789 -35570 -46692 -45218 -29385 -21905 -10887 -27059 -60314 -30026 -13850
5099 -13850 -30955 -22589 -28082 -41462 -27496 -10517 -14091 -6449 2111 -14934 7717 25019 32601
5086 32601 49551 50262 16537 264 -9672 -9621 -1827 -3354 10446 4955 8789 -756 -22338 -10289
5072 -10289 2929 537 -11342 -12916 -19898 -25256 -22164 -17532 -2791 17178 18812 -4561 -37742
5059 -37742 -46910 -21881 -22765 -43748 -24997 10006 39101 58872 38985 28487 53279 53978 23833
5046 23833 3597 15377 24648 -3241 -28014 -21406 -23261 -44538 -47089 -43818 -14920 -7925 -31455
5033 -31455 -21832 -581 12420 -14192 -38222 -45218 -63505 -49126 -39879 -37669 -39468 -4851 -22035
5020 -22035 -37023 -31549 -18764 -13589 -33477 -24963 -20367 10399 19939 6682 10594 16788 21627
5007 21627 -7000 -30231 -7846 3769 16171 -12816 -38095 -37803 -36757 -16348 11092 -14360
4995 -14360 -14393 -7112 -6682 16117 12551 -13450 -21653 -19478 560 -1636 -5053 7723 -7266 -20086
4981 -20086 -4794 -21753 -7897 -27243 -12799 8298 -17859 -18014 -19306 -23258 -39541 -21320 11618
4968 11618 12063 -11218 -15191 12582 9035 6948 8985 -9253 -26463 -22627 -4264 -9193 -7321 -2986
4954 -2986 -16775 -24792 -6652 4938 4378 21965 -2209 -27427 -30760 -33033 -17114 -1883 8193
4941 8193 -7193 -12186 -18417 11803 13705 -21558 -23692 -33289 -58937 -27732 -588 15335 33433
4928 33433 13983 -533 -14752 -40025 -23430 -24731 -34215 -62798 -27964 10764 1226 -7769 8948
4915 8948 -21846 -47129 -26493 19586 39709 31240 16096 17101 6934 10017 5219 -8263 -8366
4902 -8366 -2529 -10789 -27218 -11306 4383 -10476 -1470 17071 18392 14999 17346 11105 5635 -10636
4888 -10636 5795 13257 -2105 3822 8701 16163 19567 32821 18903 16897 33261 19834 4133
4875 4133 13054 2496 2670 1747 -1978 -19876 -10829 -6955 20066 25463 10025 -9189 -29691 -30161
4861 -30161 -28944 -15331 3078 30409 30344 8467 -18309 -17561 -7069 -14102 -6782 -1751 -9233 -11792
4847 -11792 -2141 -16862 -8879 -1871 19050 25759 253 -8121 7810 -1093 -1532 -15228 -28614
4834 -28614 -3500 2978 -1222 9523 6129 12939 25026 5358 18061 36840 23513 26528 8860
4821 8860 -34475 -43664 -32113 -41691 -27700 -6355 18751 28997 35248 28021 14052 4084 1580
4808 1580 1556 5642 -24423 -41233 -32932 -1479 25928 30381 16187 -9699 -19145 -3597 -7619 -13535
4794 -13535 -9967 -4933 18110 23333 16918 -12330 -32143 -42936 -29321 -4527 4322 -5347 1607
4781 1607 9007 186 -1447 -4149 -25628 -20212 -20207 -30571 -32535 -6368 10075 31507 -15986 -8880
4767 -8880 26077 24071 15888 30321 60483 20688 27451 34508 13938 -5730 -2963 2930 7999
4754 7999 9088 -7395 -24366 -48105 -39568 -22337 -23240 -15376 20904 25079 40372 63882 69910
4741 69910 36838 22104 10825 -17471 -13181 -32464 -36359 -38469 -48110 -52506 -30213 -14269 -24675
4728 -24675 -9825 12510 25033 36484 23418 -508 918 4765 -5380 -1448 -4731 -7917 -7171
4715 -7171 4556 7320 8553 6801 1191 -11731 -27436 -38135 -49457 -55495 -51621 -44230 -42285 -31192
4701 -31192 -1462 25132 -6195 -6813 -5395 23397 29588 20015 2612 24973 41564 27109 16324
4688 16324 29842 38462 31324 40526 57323 54322 47614 24685 13729 25981 -3371 -37376 -41219
4675 -41219 -27401 9829 24593 26631 20137 13335 14621 27180 32303 -9077 -16173 -8561 -516
4662 -516 -3251 -10878 -10712 -7203 -23315 985 8482 17063 -2888 -25151 -6955 821 -18703 598
4648 598 18441 5321 -14605 -22345 -8243 -11700 -32745 16128 36375 20310 1925 -22541 -12172
4635 -12172 8731 -5278 -25770 -10367 10496 -13872 -37808 -39641 -24860 -14069 -12734 14000
4623 14000 11048 -449 -20148 -30574 -37614 -39293 -27259 -14082 10675 9029 28420 28354 693
4610 693 -15689 -21283 -10571 -7607 -1858 -22404 -33834 -27553 4158 25938 13517 6216 16777
4597 16777 5448 -11363 -620 6004 7876 4859 31014 39428 16001 -310 -8882 -13784 2915
4584 2915 15368 18173 2347 -14559 -1412 19130 -8624 -25861 -5912 15291 9061 32077
4572 32077 65163 52282 24191 40920 31234 18903 5335 13613 17531 7196 18808 34659
4560 34659 40220 20402 9442 -6729 -18648 -7027 13869 12579 -6180 -2454 19788 -2378
4548 -2378 -12015 -13246 -6622 -20812 -31013 -11792 -8102 -16939 -14686 25177 24753 3658 11662 -7194
4534 -7194 -10748 9935 31570 28198 12991 1765 -8185 -5665 -19895 -21959 -7361 8970 -21567
4521 -21567 -47711 -25157 -9397 -18012 -3374 2380 3241 -3628 -22013 -18992 -22738 -16100 -28488
4508 -28488 -36527 -20480 -9881 -18391 8531 12471 18926 17467 18071 11903 34988 43797 51957 21808
4494 21808 -5717 15795 36224 17269 4006 -2224 19977 33060 44531 35492 10942 -249
4482 -249 16944 21840 -1588 -24891 -10595 10991 23447 15842 18087 -12593 -25581 -38337 -17860
4469 -17860 7844 21806 5887 -8126 -20196 -49538 -61597 -49664 -46928 -27306 -17278 -27426
4457 -27426 -42454 -20897 -21455 -9030 21290 22530 5772 -33195 -58334 -48524 -11809 26325 36256
4444 36256 34766 14462 29986 25127 -2537 -26976 -15478 -6101 -12288 -16485 -9952 -24370 -38823
4431 -38823 -46442 -17693 -9127 18751 13293 14487 33577 46382 26406 6964 28979 11500 6435
4418 6435 19677 50137 42303 15121 25728 30415 10389 36230 62344 40352 53050 48350 14124
4405 14124 7010 24450 12232 -4124 -20636 -19089 -8948 19436 28342 31277 33682 12720 15506
4392 15506 20024 21483 7170 2618 -10570 -840 9962 25734 29164 28693 15225 -17998 -32735
4379 -32735 -7940 3743 2633 11544 7087 3764 23529 35885 49093 56961 61992 35969 42715
4366 42715 55856 51861 33413 25493 12221 18490 30088 19524 5960 24223 28431 21960 52273
4353 52273 74640 48450 17333 7506 -748 -3374 24307 44006 61683 36039 43980 30533 -13329
4340 -13329 -37068 -29862 -10691 -142 21295 7476 32226 32907 4912 -6753 -13590 -887 49512
4327 49512 61419 43396 20392 23446 20226 24964 47631 16721 1921 9405 11442 23044 22062
4314 22062 23132 9488 14193 25186 21438 -3716 -973 -8896 -7499 -34339 -55248 -40955 -26159
4301 -26159 -21216 -7460 -5613 287 -2556 -15766 -4586 6945 -12889 -11117 -21019 -31274 -42860
4288 -42860 -45242 -32456 -29404 -21945 -19785 -24556 -7531 -5038 5452 -2727 4656 6778 -19695 -40395
4274 -40395 -7113 -7298 -6749 26327 40318 12817 8346 2104 861 -7458 -7271 -10154 -18445 -25485
4260 -25485 -47893 -34490 -9432 -6650 -10837 -21552 -16821 -1122 18208 2264 -1682 10100 10052
4247 10052 8787 -25206 -22868 -37047 -32191 -22853 -26459 -43082 -76813 -63492 -42354 -42559 -28763
4234 -28763 -15792 -22984 -15566 -14371 -19298 -27527 -46076 -12909 559 3046 -612 -5697 -42125
4221 -42125 -40483 -26123 -28724 -44639 -46798 -52867 -45770 -45857 -36592 -43213 -49662 -36262 -11638 -1336
4207 -1336 -18247 -37108 -48849 -52437 -38653 -8428 -11973 -24727 -40605 -41311 -17308 -20006 -39382
4194 -39382 -28013 -26144 -475 5670 -16759 3492 14349 11444 24826 19586 19755 16659 -598
4181 -598 19077 29544 9827 -9069 -10935 -28231 -47340 -51403 -53305 -36385 -31476 -46816 -35689
4168 -35689 -30818 -8265 9766 620 -41570 -60927 -30599 -11861 -39631 -36332 -21169 -12808 -18764
4155 -18764 -5825 5446 -2124 10147 2921 -11426 -9787 1265 7907 24048 25842 23989 21862
4142 21862 37209 59643 77150 52255 24748 37238 23398 16112 15736 -5229 -2279 18267 10684
4129 10684 -17892 -29708 -16046 15741 35618 20936 -26571 -46289 -7399 2428 4487 10409
4117 10409 10446 11319 16766 12590 -5328 -18433 -23505 -10364 -4421 -14425 -16749 -34689 -40794 -7854
4103 -7854 -13430 -31324 18392 40531 16481 -28314 -41866 -20099 -13477 -24952 -5696 2185 -7585
4090 -7585 -27673 -40122 -16980 -7981 -21081 -23153 13191 -2264 -17935 9027 6735 11589 23650
4077 23650 6547 -10940 -17658 -22568 7559 16610 11348 -5070 -34630 -36217 -24322 -15686 -28642
4064 -28642 -2136 16306 46763 52267 21027 -7632 -5418 -19664 -30906 -24152 -36128 -37502 -42577
4051 -42577 -32326 -29110 -27990 -15544 -40200 -54666 -53674 -53257 -53771 -59207 -40891 -14270 -25092 -13902
4037 -13902 17276 9488 -16559 -26323 -4116 22255 22822 -17123 -26282 -8267 11543 5881 -3144
4024 -3144 7823 18047 6778 -43348 -64431 -34186 -11735 -5251 11376 15729 9973 -2582 9646
4011 9646 20770 43302 31705 18496 25012 8262 33975 11677 -38060 -29375 1339 25087
3999 25087 45812 43416 41001 20454 4941 -7380 4562 20433 23636 18232 31591 20356 -4509
3986 -4509 -11227 -11397 -22554 -25068 1199 19386 15361 16727 15845 23594 20398 12693 16597 20562 21966
3971 21966 27052 23015 11320 8264 841 -2058 11404 11415 -28370 2132 33140 26078 16196 -6455
3957 -6455 1916 21488 12169 1323 -7102 2777 4186 -24478 -25519 -24313 -31285 -27246 -14368 -33087
3943 -33087 -55160 -58323 -53886 -38183 -16908 -28645 -28279 -11024 -18764 -13741 5767 20685 -13915
3930 -13915 -53363 -42231 -56507 -65704 -50014 -35869 -31075 -66600 -82756 -47657 -17270 -30434
3918 -30434 -18305 -288 4807 -15794 -17357 -11060 -15026 -1500 7176 -8222 -14874 -18665 -11025
3905 -11025 32887 49347 4596 -18348 -42813 -25816 -17421 -15580 -10047 -17883 -6359 3527 -2963
3892 -2963 -7642 7724 -11814 -16718 4737 -9617 -15316 -24675 -14320 -8468 -20683 -10789 -20988
3879 -20988 -43668 -45200 -34749 -47051 -39792 -54880 -42750 1467 29768 27352 -1130 -23072
3867 -23072 -7366 -7102 -14444 -9702 -15883 493 16613 21341 -5562 -21798 -26285 -36367 -35175
3854 -35175 -28314 14807 30551 6380 7612 2873 17754 52923 35099 15252 -13984 -16300 13902
3841 13902 2024 -5771 -11179 -23698 -14561 -7187 -3931 -9424 7476 26776 41767 21946 -12666
3828 -12666 15768 43014 62353 45682 50855 36353 2776 12952 17078 14502 5010 -5302 12329
3815 12329 13325 5303 -26668 -61138 -58889 -30488 -19468 -2989 12500 8036 -439 -4454 7038
3802 7038 6777 6321 -20128 -29111 -40482 -17476 -20719 -34123 -5234 21806 13885 -4305 3119 7911
3788 7911 -3486 -8772 -14488 -12528 -36842 -8986 10461 8649 -13303 -30359 -1684 24009 2893
3775 2893 5870 21939 8156 -91 4728 2160 -10011 -2484 -7696 -12494 2664 8375 -6865 -7168
3761 -7168 -26308 -20306 2780 9226 20760 8728 -3921 3106 27902 18379 12363 15752 20313
3748 20313 33760 23067 -6173 -13170 -41946 -42116 -52546 -52616 -46922 -26456 -3562 19267 29871
3735 29871 14479 -3341 18062 48728 34969 27471 16441 32243 35340 40265 36309 4388 -38
3722 -38 8006 -6569 7521 21589 21410 -4397 -39388 -52279 -54444 -23813 -20747 -12143 -12678 -13232
3708 -13232 -2439 2018 17864 9396 -9220 -6285 -1040 -2790 -189 -2247 14966 2963 -24922
3695 -24922 -43267 -30203 16933 10909 296 -7663 10957 16254 319 -9109 -5006 -27160 -18651
3682 -18651 -15147 11136 14078 2473 -6831 16191 42804 15786 6478 14700 25106 29889 39461
3669 39461 63803 44672 30768 26686 -12304 -26281 -10973 -8526 -8043 -29672 -42308 -29006 -52251
3656 -52251 -37578 -2169 -16546 -19352 -19857 3937 5841 13839 32846 14712 -6625 -42086 -75141
3643 -75141 -62070 -54294 -50851 -28251 -11858 -10577 -8740 -569 -23943 -55962 -53697 -42461 -27582
3630 -27582 -19462 10739 6954 10610 789 -14551 -6049 26557 10869 -18625 -12653 -3460 3179
3617 3179 -4500 -12002 13673 9008 26398 60784 26318 1002 -1121 -5993 12781 33706 32812
3604 32812 20436 17116 11495 -15497 -26458 -17677 3077 26068 42823 26568 29487 10893 -17404
3591 -17404 -19693 -3306 13144 695 -11294 -21951 -32835 1067 3758 18934 20156 14667 -21395
3578 -21395 -48320 -35980 -15174 13752 14709 3224 -3531 5092 35635 51310 22529 270 7874
3565 7874 11691 16986 2018 -3072 -5707 18238 26439 17544 9608 1124 17213 19840 30288 34571
3551 34571 12582 7725 28608 38688 25899 29299 36251 26039 32599 31138 2108 13310 34383
3538 34383 28397 14290 8324 -12392 -20873 -5622 799 -8364 -1487 -17133 -29414 -41633 -36423
3525 -36423 -53399 -76123 -65872 -39292 -31540 1076 23193 24798 23445 15944 -6906 -20493 -4210
3512 -4210 10973 2680 -20214 -12537 -10779 -22488 -23472 -19238 10593 21038 19252 19000 11889 -15920
3498 -15920 -42761 -28071 -36399 -40393 -32419 -13165 2091 -20752 -22671 -16077 -17167 6251 13109
3485 13109 -8701 -8894 8406 13341 9579 1701 32465 39746 52632 44637 28179 25030 22605 8128
3471 8128 -1117 -3513 14219 35411 36169 15065 14535 37250 42879 24365 -6435 4519 16551
3458 16551 12336 16159 4953 -9830 6182 17332 11152 -4612 -32379 -26095 -14372 -4918 -24875
3445 -24875 -33206 -19273 -11269 -2064 25272 11139 2954 429 10790 6512 -11315 248 13551
3432 13551 -1872 -23189 -37887 -20393 -7251 -46835 -57390 -31152 -37408 -72903 -71321 -46511
3420 -46511 -7381 10392 -12688 -16965 14181 23486 24337 14415 15414 50940 66827 41372 46942
3407 46942 78502 62546 31010 15388 -5110 13701 39361 14895 6627 6456 19626 17966 3442
3394 3442 5527 -310 -5727 -2755 -10784 19508 31585 26588 11964 -12281 -12468 -6013 4203 8331
3380 8331 4878 -7018 -6598 -16786 8111 27995 42833 60042 38394 14251 6905 7911 30692
3367 30692 21657 11358 -10409 -24665 -6336 12774 12903 11794 -9694 1885 18419 12905 -16547
3354 -16547 -11378 -1658 7370 18565 29210 26718 37088 59591 55655 31433 32493 32088 12419
3341 12419 6518 35193 42974 38623 32014 46451 47844 37304 35419 47794 63913 71097 64755
3328 64755 42100 30350 39396 67425 94008 57080 28936 17685 -137 -22653 -27537 -14683
3316 -14683 -15093 -44413 -29741 -5781 13295 21435 10327 3821 -2280 11068 -4034 -15395 -11159
3303 -11159 5455 15372 10629 4731 1880 10045 24137 14171 34871 54412 50996 29432 -3272
3290 -3272 -24927 -20080 -11884 -22681 -20619 -33328 -21082 -13351 26862 -9622 -7855 38960 35587
3277 35587 -6453 -26675 -11319 -20178 -20260 -22486 -22996 2741 20564 22425 44401 26377 20010 19755
3263 19755 -10773 -25644 -10561 29119 47618 15095 8358 38170 40799 44553 26266 15075
3251 15075 2554 3292 40642 63370 48507 15899 -14631 -17306 -22945 -33101 -14582 12983 39312
3238 39312 35095 2478 -4597 7237 -7241 -33930 -38234 -12459 624 -9098 -9300 1694 17743
3225 17743 18551 41076 29139 30023 19136 8254 10715 11981 23834 45678 54424 51699 13843
3212 13843 -1337 -3513 3162 -19645 -28964 -19713 -29684 -13897 -8375 -6595 -2485 19431 33749
3199 33749 13370 5325 -6189 -4390 2446 -14418 -23573 -15855 -8764 -25613 -28687 -30199 -49424
3186 -49424 -26476 -20751 -29510 -17689 -11662 1211 -10908 -13584 -26348 -1732 6575 16173 19781
3173 19781 12369 22129 26885 -3781 -17096 3063 18334 459 -4776 -6745 22866 11210 -4931
3160 -4931 -22540 -34188 -32992 -29315 -24533 -8566 -1066 9087 -17805 -7326 22490 29821 18479
3147 18479 -9422 -20023 2198 12395 41552 62295 59195 12864 -9865 9497 10261 -6133
3135 -6133 -12752 5293 35905 19460 1478 12994 18700 19055 9863 28427 39913 51043 37059
3122 37059 29111 24320 16337 4352 35610 46927 10738 -11104 5204 7621 21686 18982 15446
3109 15446 13698 -2113 -14675 1007 -18542 -29819 -16065 -31270 -37806 -23901 1067 -8505
3097 -8505 -13480 -11730 -11202 8321 31824 48926 19719 -2270 -14247 -15846 -207 -1603 -6794
3084 -6794 5163 2236 12147 6352 10739 8438 7830 15130 5192 -15704 -19119 -33022 -16111 2037
3070 2037 28479 32864 58596 76924 60794 38280 44426 48484 31102 25758 21124 13931 30314
3057 30314 34795 8994 7803 20216 12056 11509 -10640 16685 30505 33998 13409 -16498 -3597
3044 -3597 8972 25536 31968 23079 6934 11661 -5341 -1494 29669 45173 51898 75511 73292
3031 73292 65205 55450 56108 37054 29261 8606 20186 7501 2442 2311 -1092 14106 25871 37415
3017 37415 22745 -22300 2860 7702 -25925 -19695 -9209 -23226 -24055 -10990 -14769 -40115 -63474
3004 -63474 -70657 -35064 -39640 -51598 -49754 -32293 -11384 -9712 22677 28206 13838 2542 -3767
2991 -3767 11942 2088 13744 38176 46918 27742 10663 -42860 -53294 -26283 -11639 9489
2979 9489 39425 13762 16961 14954 22576 31456 18455 7185 3811 -8372 -465 16085 13580
2966 13580 -8517 -8540 -10515 -1221 9980 22167 21360 11206 -15954 -23814 -449 -13826 -31185
2953 -31185 -5992 13996 364 -9414 4458 16843 11164 8855 13427 12556 36010 47614 27486
2940 27486 3166 -5164 -1471 20007 27752 2383 -31671 -14147 -14111 -25151 -13911 -13021 -34756
2927 -34756 -23085 3483 27251 28943 14903 41543 55250 38884 39094 35036 32640 39035 45978
2914 45978 14785 -24490 -41371 -27981 -5708 19759 43835 40757 17576 18978 -7207 -41995
2902 -41995 -32324 -16331 -20542 -28924 -18905 6563 -28979 -5756 8313 2685 -17317 -30881 3792
2889 3792 -4553 -22304 -33281 -16126 -36712 -26076 9773 24162 18166 -8490 -17100 -33548 -20872
2876 -20872 -47225 -47084 -26399 -19942 -988 2970 17102 29183 34352 23270 13503 40715 46419
2863 46419 30644 26906 -9852 -25298 -54260 -65296 -25851 -10308 8664 597 -35643 -43654
2851 -43654 -17356 7494 29665 52746 47252 25234 22833 13223 23297 21262 -6412 -19907 6586
2838 6586 5606 -5178 -6248 16951 30920 34913 81816 74633 25289 11350 17142 -9455 -13622
2825 -13622 -3937 8960 10002 9053 4426 -9813 -43495 -47055 -24661 -9604 -14663 16483 10648
2812 10648 -16761 -30262 -23947 -5356 9982 13974 -5506 -40458 -22764 -8991 -19491 -38797
2800 -38797 -29517 -23762 -3328 555 -19491 -31135 -46382 -16764 18634 56683 46342 52394 53372
2787 53372 36878 51423 45823 32075 19961 24356 16616 30356 36142 31267 18437 977 -13954
2774 -13954 -15318 5054 34721 35694 45454 32867 11478 3739 17014 13636 -1427 22395 39067
2761 39067 50075 20141 -3435 -11608 -5338 33481 34994 17558 -2510 -2244 1922 20828 23857
2748 23857 26995 23349 21590 25898 10692 -20571 -31875 -30896 796 9777 -4245 -33929 -38732
2735 -38732 -32683 -10145 12611 720 9460 6758 13089 3927 -15706 13117 41534 37492 11297
2722 11297 -10632 -25127 -16212 -2765 15302 32685 18308 -2093 -10396 -47309 -41627 -22120
2710 -22120 -13555 -18515 -33230 -37122 -32430 -44268 -10929 -23600 -49645 -54265 -43805 -40376 -57434
2697 -57434 -51407 -38653 -26558 -28274 -30307 -28502 -37690 -43575 -28423 -8997 -7866 2692 -2029
2684 -2029 -16068 -25117 -33005 3337 43849 21080 4761 -1296 4458 21349 22069 2435 -8130
2671 -8130 -994 -14157 -6509 25807 13521 -2282 -8896 -15757 -3109 -12363 -34339 -58372 -35052
2658 -35052 -14389 -9044 -14601 -15938 -24259 -39535 -20886 -17527 15778 33502 38149 37735 38490 36243
2644 36243 39973 9916 -11732 -9911 -4208 -661 13220 -9069 -44002 -37048 -25656 -3968 -9976
2631 -9976 -32515 -31572 -29320 -42130 -25064 -2936 9523 22598 13442 -17600 -12690 12819 21131
2618 21131 -3882 -26598 1407 31978 36676 25098 29340 37589 22041 28839 43873 48422 36978
2605 36978 27430 26307 20403 12755 15480 8819 13876 4823 -2314 -7554 -5066 -33074 -24256 4976
2591 4976 18742 8509 30179 40185 25898 23089 30007 13163 -12846 8855 12409 -9831 -24389
2578 -24389 -56766 -64185 -44496 -28127 -868 1103 -28888 -29855 -24291 -11141 15329 14012 24919
2565 24919 29015 25799 42942 43224 29611 16973 -14149 -22652 -17376 -14560 -15202 -17473 -3484 2387
2551 2387 -3312 -6068 -19110 -14306 10004 28035 35696 982 -9542 16404 27628 28814 41584
2538 41584 21670 -9152 -23167 -19307 -5637 -3702 -15045 -32593 -46315 -40493 -21868 -6888
2526 -6888 -12907 -3936 20588 -2451 -10968 -31139 -37351 -34847 -53617 -49381 -35926 -24022 -28312
2513 -28312 -36629 -2317 24524 44164 40009 30887 24370 13567 3311 14546 7775 -14393 -7193
2500 -7193 -5063 -15335 -11235 -6695 -21229 -24848 6660 49459 79540 56958 44676 33794 16132
2487 16132 -910 -1631 331 24679 19868 -409 -10833 -26290 -31585 -35072 -8362 -3536 -11558
2474 -11558 -13674 -7078 -5574 53 32790 34679 -7916 -26534 -21708 13161 27599 9676 5443
2461 5443 -1259 -8152 -19915 -5308 17730 26681 15153 12976 10940 -15420 -10979 11231 -839
2448 -839 3824 -11212 -7714 3893 8652 -19351 -2677 -10734 -27001 -8232 17429 37998 36656
2435 36656 27681 4963 -1872 -176 1294 -14163 -53070 -47707 -34254 -41178 -11271 11430 18497
2422 18497 21301 27258 11712 19744 29243 27724 -2486 33193 42650 9252 -20909 -26870 -40379
2409 -40379 -8530 23391 20319 34016 33918 24849 46506 44273 25440 -157 -9028 -21869 -1477
2396 -1477 20367 -6261 -37271 -38544 -53944 -48856 -53520 -41761 -5334 -97 -18513 -28990 -19940
2383 -19940 -33750 -33046 -5090 7833 -18427 -14447 11874 19171 -11261 -13359 14080 21200 29008
2370 29008 -13001 -31720 6422 34847 29842 19507 4116 15914 38337 18927 8670 9540
2358 9540 -338 -4298 14048 13192 3812 1601 -1852 -5574 -4842 -27025 -34242 -9052 -20633 -3685
2344 -3685 18690 -3540 -22814 -26218 -42804 -25696 -8455 228 11203 -7096 -24087 -35190
2332 -35190 -25826 -16192 -11295 -13729 2458 26273 27029 2302 14087 15904 -19908 -17126 14365
2319 14365 9798 -7265 -15492 15523 35793 -1179 -27825 -1266 -3760 -756 3092 10297 9254
2306 9254 -3300 4082 3490 -10802 -23485 -18367 -22569 -21348 23929 20130 20439 14130 13076 -5327
2292 -5327 -4486 6972 18611 19237 13225 36599 54146 51308 68784 48805 52033 46563 45466 38435
2278 38435 41912 3823 -37121 -21848 34777 38772 39387 3452 -31475 -46674 -62576 -55174 -8470
2265 -8470 14855 2069 -11554 -7771 -7651 2429 16397 9492 5629 -20163 -15271 7564 25535
2252 25535 41660 39018 22012 -7787 -7512 13935 10614 -6921 -14585 -30505 -13029 -1433 4522
2239 4522 267 13519 24701 -5030 -35902 -52479 -45758 -72211 -92699 -47712 -30658 -3301
2227 -3301 -8745 3622 -15122 -37009 -9108 -20891 -24864 -5244 1352 -457 -12733 -16521 -13549
2214 -13549 -12513 -23458 -13317 5384 -4897 -19092 -31316 -33184 7839 25676 12433 -7720
2202 -7720 -33181 -29373 -62952 -61947 -59731 -75011 -36800 -42482 -61135 -35628 -8315 23445 36612
2189 36612 19301 26385 26328 6861 -8298 23921 41000 52973 19666 12973 20946 16227 27429
2176 27429 16475 7998 24356 19304 -18962 -7122 1985 21611 57158 51490 30010 37661 48746
2163 48746 52870 56294 63753 45732 44957 61043 56259 31467 -7653 -40591 -45987 -59027 -50114
2150 -50114 -13925 -22154 -14788 2280 -3297 -33268 -36593 -10933 -947 16274 21153 29364 12358
2137 12358 1518 -7506 -17489 -7080 14346 36750 25347 30943 21168 20972 20817 14107 10599 20358
2123 20358 37636 44599 57533 57176 27457 17392 7436 7805 26378 39972 29102 30291 26823
2110 26823 52587 41804 15422 15141 16701 22632 15240 -38129 -24070 9990 20348 18573 14777
2097 14777 19970 9320 -10534 -32151 -22830 -29911 -57715 -54148 -31268 -30639 -30037 -38993 -53600 -23090
2083 -23090 -24186 -34821 -21011 8934 -2774 1724 -14059 -27465 -6722 -558 -10105 -4776 283
2070 283 17831 29030 12499 -13568 -30097 -12842 -17503 -4684 39272 19152 -11156 -16629 -5361
2057 -5361 -482 -3507 7391 21403 59623 86477 59778 25551 -5901 21183 42808 50822 14094
2044 14094 14987 15159 -10314 -17308 -919 -12446 7910 2773 -12628 5952 -5381 -13482 27158
2031 27158 9468 -16045 -22870 -14363 -10589 22759 38241 24882 18894 15544 2370 -12440 -3766
2018 -3766 -2240 -15911 -18084 -14486 -4275 18009 -495 2253 35819 9039 -7253 14664 7676
2005 7676 -5823 18248 23661 2220 -19879 -12309 12778 8107 17551 15348 4175 638 -4471
1992 -4471 -21583 -22083 -20206 -31278 -29091 -36626 -32351 -25911 -32498 -15743 -2068 -16112 -9991 11079
1978 11079 35046 20358 6911 2455 7210 -12627 -15739 -47796 -42868 -13579 14651 37060 34548
1965 34548 27638 8918 15447 39097 36434 9625 -21587 41370 49726 20717 -2120 15496 -4875
1952 -4875 -35 23154 35474 25622 -15571 -20416 1915 3889 19546 34430 37968 58025 55840
1939 55840 43959 6731 -20096 -17231 21362 33598 1609 -84 9497 -20073 14671 53247
1927 53247 44160 42012 47938 56205 24495 19027 28845 18698 19869 27536 2008 324 13280 5533
1913 5533 13625 22905 24943 23767 15449 27770 29086 14389 9812 17916 5293 16244 46124 41953
1899 41953 45713 51706 40449 28712 42789 6743 -14310 -10921 -21264 -20545 -14530 745 31253
1886 31253 43661 26946 18773 30473 35934 35408 14570 -10752 -27806 -3638 8416 8365 6789
1873 6789 -11967 3746 14608 19863 32754 -10344 -24698 120 28236 19283 -20762 -45703
1861 -45703 -25575 -16500 -18051 -15255 -20226 -18662 1119 13724 321 -28708 -33042 -15006 714
1848 714 -14997 -17635 -11489 5694 32778 26302 1633 9023 7384 -4160 -2516 -20656 -20638 -10504
1834 -10504 -5022 10144 14335 -14127 -2384 -529 -1290 7768 32049 38489 12781 -28446 -45006
1821 -45006 -45325 -41975 -17731 -6496 -2912 -4528 -16781 -56289 -54245 -20891 -1268 -6081 -5949 -11231
1807 -11231 -19789 -34676 -31772 -28600 7771 8338 -10095 -23193 -44984 -28699 -2385 -3149 1807
1794 1807 -11114 6798 6235 2775 -4529 -31461 -51545 -35154 10604 26610 19116 15938 7766
1781 7766 7090 11058 12305 18417 3026 -11222 -36698 -14208 2983 4782 -19213 -978 22013
1768 22013 41386 24597 -7415 -21861 -19793 -13483 -13854 2092 27645 56857 64681 47818 18889
1755 18889 12598 9665 -5658 1787 -1896 2805 -18964 -37118 -38739 -25063 -13407 -9188 386
1742 386 -13647 -18890 -893 10939 -139 -2307 6656 18988 -12352 -30479 -32326 -22778 -18306
1729 -18306 -24379 -15103 -24245 -22820 2242 -13639 -7762 15819 8910 -1026 53 -6856 -2314 1988
1715 1988 -19158 -19247 -27129 -32030 -41273 -44975 -23933 20089 33580 44265 49674 32694 3770 -21011
1701 -21011 -9088 12707 21742 30517 17045 -15340 -30840 -29305 -44817 -65310 -37711 -14685
1689 -14685 5430 18080 28710 28961 18766 7255 12741 3900 13514 14167 -11110 -23453 -10127
1676 -10127 14871 569 3667 4951 9064 16856 11725 14653 14367 21670 33602 27872 17254 3747
1662 3747 -17841 5011 -721 -33100 -32586 -33935 -23543 -10463 -107 -8351 -1642 17182 16723 23915
1648 23915 10824 -1295 -2907 4180 12408 7074 -3427 -13529 -30314 -29315 -35993 -28216 -16503
1635 -16503 -16671 -21287 -7239 2477 5020 11505 21267 -7368 9764 46711 41861 47513 44163 31368
1621 31368 25198 5575 6435 -11611 -17781 120 20488 24879 25578 11964 20235 23957 7605 -7214
1607 -7214 -5834 -7227 -3087 18003 48302 60822 72463 54624 17553 19711 32763 13130 9852
1594 9852 19685 17014 25300 25507 49780 65716 57440 35622 40185 18143 27118 3490 -17482 -21973
1580 -21973 -15410 15212 -2627 25529 34199 26089 16509 7957 11428 4438 -1040 -17331 -19002 -29214
1566 -29214 -40466 -41166 -27002 -5908 13263 15943 17008 -4614 1160 4008 847 -9665 -39216
1553 -39216 -29906 -13396 -24765 -2246 8930 -5599 -1935 -3068 679 -18609 -53754 -43975 2642
1540 2642 30694 33399 12869 10482 -14118 -13936 -45607 -53690 -53517 -65031 -39137 -35176 -25167 -7777
1526 -7777 9049 -3950 -4305 -41779 -34103 -8855 12998 25104 30076 17823 14193 16905 36035
1513 36035 47204 46323 23324 -6488 -7976 -5437 11468 32434 32298 31770 8008 -2270 23081
1500 23081 34957 34890 32848 26492 24923 16905 20691 14806 -7327 -17494 -16863 11160 15907 3133
1486 3133 -15554 -7504 -19 2659 4319 14423 -1243 22085 56432 51426 40732 29887 38076
1473 38076 35188 20481 5517 -9442 -9204 -18433 -33918 -4440 -8266 -21118 -15257 -753 13363
1460 13363 45818 31870 1487 -147 2806 29599 16937 -6713 -12079 -12233 -15611 -33132 -43407
1447 -43407 -15559 5285 18535 4934 -8473 -4217 -15389 -18253 -20665 -24965 -9881 8107 -2388
1434 -2388 -29651 -36823 38 -5836 -23964 -15180 -18157 -28740 -37418 -30730 -8535 11022 19932
1421 19932 17291 21109 26315 13517 12680 -1710 3144 1844 11753 -29469 -43116 -42581 -32639 -12310
1407 -12310 -21619 -18603 2643 12562 12228 141 -210 -25477 -20488 4591 -3513 -15648 -18827 -14456
1393 -14456 -2278 11000 11791 -10433 -6196 -184 12744 22566 1935 -21136 -17378 2092 2566
1380 2566 970 -4609 -8745 -9400 -13768 -8561 17084 20386 7200 12640 14304 -3305 -19006 -40159
1366 -40159 -16784 6199 7235 5149 -18984 -9791 -17664 -6064 13820 10067 3318 9529 13044
1353 13044 20210 45456 43128 28681 24203 26130 36764 36806 928 16931 11711 -6113 -1810 -4623
1339 -4623 2731 1042 23897 32355 43858 50787 33031 -13986 -26585 -9591 -7522 1667 1481 15337
1325 15337 32330 33934 5367 -1006 -14198 -20290 -8241 14708 1483 4782 -8429 -9676 18739
1312 18739 17074 13550 8152 701 5784 -2645 3016 -17698 -18819 10247 19172 25624 46376 56619
1298 56619 40023 40414 27814 23848 20175 24210 21022 8133 -24658 -13673 -18972 -17474 -25044 -14872
1284 -14872 -7202 -1584 6416 20613 24459 18649 -1338 -6466 28934 39181 1534 -31422 -8133
1271 -8133 -3846 -5894 9120 30822 36446 29976 28025 24738 -330 5057 31024 26181 17552 -15003
1257 -15003 -20117 -31584 -15235 -15783 -7477 10091 -5866 7910 6291 -1863 2547 11820 11398 13614
1243 13614 291 -30251 -33279 19299 30905 1936 1466 -908 -1250 635 -29760 -50363 -4591
1230 -4591 2420 3924 -13204 -10415 -21718 -41597 -34014 -2003 7594 -12821 -26408 -16701 -11002
1217 -11002 -24306 1292 20164 37728 37121 37593 25102 10258 6904 767 1359 -579 6631 1527
1203 1527 -24371 -35196 -35763 -38777 -27282 -13906 -11872 869 33444 46172 40807 36168 36288 44634
1189 44634 20398 20993 14588 13790 6104 -10199 -31705 -29704 -7912 16764 -7052 -33915 -46573
1176 -46573 -33665 -761 31108 46733 32539 25758 32899 28302 -522 -2941 27666 10189 9426
1163 9426 4529 914 14644 4400 -16088 -4847 -1485 18564 16716 6020 -12289 -33102 -6834
1150 -6834 17061 52541 47900 14558 586 11417 21175 38890 32356 -12424 -14985 19521 16133
1137 16133 -7631 13058 2727 502 2077 211 23549 38375 11901 4935 8962 7520 -2926
1124 -2926 -10647 10024 10287 17320 12930 9314 13102 19740 8568 -15328 -3629 12187 -2808 -12823
1110 -12823 -1522 16200 -1488 -16558 -11581 -21874 -17405 -27385 -37742 -23779 -26955 -27216 -24950
1097 -24950 -18678 -23078 -42844 -65496 -27044 9128 22344 32332 26891 20137 19293 6936 -1662
1084 -1662 -17543 19061 36646 54488 60925 70796 59339 51963 58292 47038 43219 21938 18763
1071 18763 17147 28160 -2044 -3711 -15350 -46338 -51427 -11333 306 6337 -8606 719 29825
1058 29825 34552 28445 12412 -12379 -8535 -6494 -9257 5753 16398 18220 24837 49010 56773
1045 56773 25638 -34078 -38753 -2181 35696 31765 8381 1613 -10794 -15554 -739 -28699 -81059
1032 -81059 -74932 -38869 -2087 5874 15329 28390 29703 -2782 -3458 3747 10168 4889 -18371 -33087
1018 -33087 -58765 -31285 -5250 7457 17138 17153 10066 21874 31406 23797 -7250 5540 40171
1005 40171 31294 -2403 -14168 -20659 -29183 -15315 -10973 2489 8995 4177 7454 -568 -4987 -22213
991 -22213 -12147 13242 -770 -12526 -9480 -27094 -37117 -32685 1842 41430 22898 21025 14225
978 14225 -10719 -67996 -91038 -83483 -41155 -12906 3996 13058 10701 12438 9233 241 1977
965 1977 -9668 14138 51956 30929 32959 41375 9330 4112 9280 -6774 17371 10859 -28137
952 -28137 -42365 -48088 -37413 -32738 -35152 -11993 1273 528 -3829 -12858 26876 71470 91439
939 91439 61741 18483 21538 27557 26458 17827 29268 47659 41270 30989 10548 30282 39211
926 39211 10984 -14925 3327 19924 5369 -12107 -1104 -6772 -4314 -1834 9175 12327 8863
913 8863 4760 6213 -12776 -11265 9325 1825 9597 27970 28633 34615 39614 53093 16575 -3847
899 -3847 2078 -6699 -2160 15288 14802 25969 11727 -15705 -26394 -36498 -30287 -12269 -4819 13211
885 13211 23524 13657 15581 -27338 -54546 -43721 -25096 -7619 27026 26022 611 -11263 -24449
872 -24449 -16968 -13937 -41372 -19954 -47085 -67435 -68564 -76991 -66645 -42023 -29513 -27318 -46980
859 -46980 -35591 -9696 8461 25551 38019 12769 -5081 -19980 -31754 -24854 -25576 -39827 -13615
846 -13615 20494 19812 -18242 -16900 -17920 -17033 -28536 -40455 -53094 -63935 -60529 -62431 -68084 -88688
832 -88688 -79470 -58501 -22190 -8171 -11418 -8113 -3803 7009 36530 39210 -3667 -35505 -42912
819 -42912 -42098 -38608 -35586 -36811 -34900 -8870 11360 -311 -9444 -26141 -36279 -12114 -10719 -21856
805 -21856 -13983 -7749 -40882 -27115 -24721 -25182 -17075 -45199 -34731 1237 -1500 19305 39197
792 39197 13443 5345 13789 10247 -124 -17719 -32034 -18476 -7337 -25428 -37652 -31572 -3043
779 -3043 -5393 -32765 -53290 -31830 541 8282 8154 1110 -3741 15101 11915 16769 12953 12842
765 12842 8222 9733 17197 8540 10131 38935 31396 12505 -21317 -58505 -76973 -60222 -35879
752 -35879 -32070 -27372 -50549 -35715 -12541 -53885 -69109 -64766 -71678 -48419 -28314 -15449 -22990
739 -22990 -16416 278 17576 13620 20018 16995 -9924 -12251 -27308 -25890 -8147 17656 44911
726 44911 38841 36194 21381 18530 7919 -2816 -4225 12101 8409 -6214 6348 8706 -10181
713 -10181 -48109 -28804 -10145 -8595 -25436 -14464 -4916 -14782 -27772 -18519 -6796 -10645 -22667
700 -22667 -37012 -34788 -24317 -37435 -15157 3750 -8889 -1222 14226 10383 19809 13030 10137
687 10137 -12394 -27406 -35043 -26953 -30258 -39356 -42119 -5306 21229 16152 -1693 -2157 -2302 6101
673 6101 -3052 -5590 -9556 -10855 -22326 -24857 -32388 -26289 -13595 -3420 -4590 10351 17247 -13044
659 -13044 -9703 10876 -8567 -34721 -28262 -15531 14438 37988 25516 1380 -36146 -44414 -20339
646 -20339 3331 -1300 725 10040 13743 5832 15266 -25544 -60403 -79182 -94593 -69343 -17156
633 -17156 16723 19554 26222 34752 -15495 -34267 -15114 -22831 -17128 -27466 -8780 -15527 -44013
620 -44013 -25867 -5527 -12948 -33162 -26518 -47584 -53807 -58525 -51252 -5876 -4899 -1093 6576 -23500
606 -23500 -23058 -29247 -34160 -22131 5179 24421 11339 -2176 -8334 -15752 -23871 -17817 -24210 -26958
592 -26958 -30980 -35899 -54071 -24625 -24709 -3114 11292 -19859 -45317 -33676 -39704 -40525 -31463 -12799
578 -12799 7899 7100 -24391 -41953 -45260 -35235 -26843 -18100 5321 33633 35246 21149 20982 2736
564 2736 -33899 -35608 -14458 -18046 -40158 -32784 -23963 -44108 -60678 -37282 -47030 -35642 12184
551 12184 6121 6282 9733 -18387 -44299 -62081 -68679 -30977 -14589 -16406 -19799 -38421 -43059 -56014
537 -56014 -51954 -23900 -24427 -37271 -42695 -19075 -1186 -1374 5298 14553 -19398 -27262 -33346 -47755
523 -47755 -46158 -63460 -71013 -80000 -64735 -37828 -24558 -39799 -56861 -33659 -4808 34290 16765
510 16765 9966 12597 1884 -19243 -3811 3832 -5947 -14139 -11599 9215 11478 -6204 -14844 9468
496 9468 5090 -24323 -29731 -20883 2315 11827 1513 -14837 -37779 -49328 -58358 -72575 -57668
483 -57668 -25146 -8689 -5725 -5380 8968 8439 -27469 -36508 -32393 -54226 -62333 -42219 -20352 -13194
469 -13194 -4649 -10400 -3948 -40276 -54382 -40718 -15267 -16316 -34160 -25880 4620 -4722 -35450
456 -35450 -40070 -46329 -26962 -19843 -15469 -21073 -5265 13655 33962 22528 6781 16362 17442
443 17442 18375 32102 8979 2138 8119 14267 39215 12143 -13047 -21356 -20682 -39329 -20281 -15172
429 -15172 7678 -14866 -11488 -15024 -30316 -44185 -25260 -42957 -49159 -34471 -22572 -4399 9358
416 9358 2692 12880 13890 -2183 -7273 8455 8997 5738 -8472 -18553 -20810 -31402 -56501 -61569
402 -61569 -35905 -18927 -25991 -2586 10579 23665 20111 17934 -236 -1908 -3594 5084 11942
389 11942 17729 -9954 -17997 -6818 -5826 -9610 -8369 -21664 -37923 -39797 -40195 -47678 -38385 -5307
375 -5307 -9437 13146 32736 25121 15792 12776 -16593 -29555 -12629 -29755 -37562 -24179 -15061
362 -15061 -19187 -27415 132 9871 12155 13076 -7476 -7480 -17271 -7932 5965 -26736 -19830 -1966 7548
347 7548 -23205 -44188 -47059 -21475 -15689 -24491 -23445 -16810 -28915 -31885 -10351 -17620 -21869 -7138
333 -7138 -24444 -12911 -25669 -20948 -11508 5851 27754 38334 11496 -4917 -10135 6257 -12112
320 -12112 -8515 -9155 -17449 -30577 -14397 15733 15878 4980 -3129 -23185 -14379 3782 -17930 -28505
306 -28505 -28635 -6693 -18095 -39157 -37028 -24923 -12519 -25955 -23699 -21452 -20829 -9104 -16665 -46829
292 -46829 -59926 -64544 -56493 -44687 -72376 -79189 -72988 -64961 -54077 -23375 -28110 -28435 -46378 -38663
278 -38663 -14030 -9281 13441 -1555 -36080 -10259 20282 -1674 -21306 -28204 -48008 -45928 -34755
265 -34755 1255 1049 -12781 -8692 7760 -10377 -9004 -16549 -23703 -20631 4165 18026 6228
252 6228 1939 8912 29368 20464 17108 -1925 -4595 -5175 -19750 -36074 -23613 -7061 -3869 -9147
238 -9147 -5949 -15658 -18191 -11414 -27996 -35069 -53070 -48530 -58503 -63867 -42134 -18975 -6756 -27695
224 -27695 -57132 -63077 -40580 -22902 -32875 -39759 -42644 -48254 -27686 -19186 -27482 -55127 -73819
211 -73819 -57113 -29360 -32434 -39232 -26031 -19093 -12385 -21690 -39065 -24472 -18824 -40283 -66560
198 -66560 -63389 -82199 -64082 -46854 -48273 -41779 -46224 -32779 -28905 -6586 -39623 -53225 -52720
185 -52720 -42033 -19225 -13367 -6342 -3852 2047 3201 8723 2983 4046 13900 9919 5478 -15135
171 -15135 -26767 -19848 -575 3616 9372 12255 3306 8411 1040 -18987 -6392 783 -12665 -17268
157 -17268 -34721 -37181 -28033 -20504 -17952 -37331 -42425 -68395 -66623 -40331 -38321 -37546 -28640 -12079
143 -12079 -8474 8295 16551 -7791 -46820 -51836 -46424 -33312 -32899 -39725 -30155 -31780 -31618 -33879
129 -33879 -45524 -48535 -26421 -10288 -5195 5650 17364 5897 18176 15650 -2003 -19842 -21409
116 -21409 -27746 -19474 2831 3233 -10107 -25338 -7052 -6985 -18092 -35646 -36768 -17431 -7803 -4293
102 -4293 -14538 -38566 -47362 -63427 -70499 -48709 -48985 -36867 -30749 -32370 -27412 -27396 -16129 -8208
88 -8208 -17838 169 7504 -8001 -15568 2685 -11455 -31507 -15543 -12674 -14273 -16030 -27099 -19464
74 -19464 -16035 -3954 18420 11401 -2916 -14323 -15127 -7040 -8299 -15050 -14201 -9516 -8729 -7709 -28854
59 -28854 -36217 -29194 -33455 -34642 -21551 -20501 -13676 -4640 -2695 -6583 -12570 1208 6042 -3950 -8427
44 -8427 -2534 -20579 -13098 -12576 -15707 -25196 -33191 -41216 -30164 -9451 1293 10761 -6803 -4002
30 -4002 -2508 -8275 -11716 -21281 -34243 -46403 -46092 -45307 -30446 -32076 -25245 -30921 -10492 -15926 -44841
15 -44841 -45690 -30953 -37973 -38625 -53707 -66993 -51632 -40832 -29017 -3454 3056 -12425 -32801
2 -32801 -41701 -22391
0 -22391
$$ Imaginary data points
##PAGE= N=2
##DATA TABLE= (X++(I..I)), XYDATA
32767 98953 108264 110254 110085 85947 83235 112896 139090 124523 110102 110037 99278 83371 80807
32754 80807 90814 69367 82750 84508 96151 110299 114032 119240 116726 114946 133397 142779 136245
32741 136245 154090 128446 117245 124693 119064 124407 137490 139164 124715 122314 125471 141579 149761
32728 149761 133798 125842 121344 108445 125048 119564 125540 139388 142305 150550 154374 147095 154460
32715 154460 149427 150231 154308 153381 149051 129457 111384 113409 101723 108139 110223 124968 142475
32702 142475 138591 142279 143549 152480 147380 146306 130919 127729 143219 155034 164623 173604 156427
32689 156427 144441 146871 139545 151562 145238 142853 154702 169588 176464 165801 158136 151436 157397
32676 157397 183083 186353 177721 175623 185501 194916 175732 174578 201946 221301 215544 205929 203802
32663 203802 169188 155358 154997 180710 189496 172703 174341 178058 186609 194028 201258 209017 213942
32650 213942 215312 210083 183268 165011 170281 203750 218225 236390 241656 241848 232683 221208 215182
32637 215182 224399 236649 242994 220859 205887 222454 242164 244108 247293 236009 226529 229989 207980
32624 207980 209089 236335 227098 209998 220313 244909 231453 221289 226739 230744 233323 236494 229021
32611 229021 233658 244453 257014 276280 265987 228702 231592 232447 223386 230816 235014 217879 217918
32598 217918 231109 228660 236338 237267 241428 245796 253724 249187 228797 229650 247309 259256 260485 250517
32584 250517 267965 270232 272534 272052 251428 244341 258631 257177 260109 264670 262364 257387 255649 266663
32570 266663 294788 296289 290640 278965 277864 279864 257877 267106 284621 284852 291614 313487 301510
32557 301510 307330 306061 287314 278508 283137 274118 253692 248825 247340 247343 264585 261311 268517 282118
32543 282118 280211 276366 260452 254033 272278 291273 290195 272562 277332 268316 271541 274543 251247
32530 251247 234121 254245 271834 268536 248965 268566 264375 259388 282771 296572 292135 300277
32518 300277 301286 273057 285214 286276 279970 300056 302417 286489 290959 312767 310769 311381 292528
32505 292528 296223 304597 297911 272442 283920 289074 275525 266638 281723 303824 319275 327511 294968
32492 294968 289631 319754 339993 332069 325742 316667 311620 330335 348418 337351 312776 316852 331886
32479 331886 328063 314953 309164 291890 256476 257608 291268 321228 341367 331747 322140 330587 349581
32466 349581 359916 340712 316181 322475 325068 327717 348943 338748 321533 335439 332966 336452
32454 336452 353480 349818 317973 311190 306778 294718 311296 341864 342574 305237 270440 299383
32442 299383 322490 329977 345276 346574 357020 373548 370987 357759 359935 371788 375334 364608
32430 364608 354430 355608 370314 355989 351464 355336 338686 347601 351648 351963 346043 331919 337887
$$ [...]
##END NTUPLES=NMR SPECTRUM
##END=
