##TITLE=Analysis number 328861
Compound Code cc 62746
Book Reference 521/91
Project Code adrs
Chemist Name evam
##JCAMPDX= 6.0         $$ Bruker NMR JCAMP-DX V2.0
##DATA TYPE= NMR SPECTRUM
##DATA CLASS= NTUPLES
##ORIGIN= Bruker BioSpin GmbH
##OWNER= nmr
$$ XWIN-NMR		Version 3.5
$$ Wed Jul 11 10:15:59 2007 GMT Daylight Time (UT+1h)  MAYBRIDGE\nmr@NMR_250MHZ
##.OBSERVE FREQUENCY= 250.131544655141
##.OBSERVE NUCLEUS= ^1H
##.ACQUISITION MODE= SIMULTANEOUS (DQD)
##.ACQUISITION SCHEME= undefined
##.AVERAGES= 16
##.DIGITISER RES= 18
##SPECTROMETER/DATA SYSTEM= dpx250
##.PULSE SEQUENCE= zg30
##.SOLVENT NAME= CDCl3
##.SHIFT REFERENCE= (INTERNAL, CDCl3, 0, 16.522)
##AUDIT TRAIL= $$ (NUMBER, WHEN, WHO, WHERE, WHAT)
$$ ##TITLE= Audit trail, XWIN-NMR		Version 3.5
$$ ##JCAMPDX= 5.01
$$ ##ORIGIN= Bruker BioSpin GmbH
$$ ##OWNER= nmr
$$ C:\u/data/dgb/nmr/ADRS/750/pdata/1/auditp.txt
$$ ##AUDIT TRAIL=  $$ (NUMBER, WHEN, WHO, WHERE, WHAT)
(   1,<2007-07-11 10:15:41.06 +100>,<MAYBRIDGE\nmr>,<NMR_250MHZ>,
      <created by zg, POWCHK disabled, PULCHK disabled
       configuration hash MD5:
       76 6E 9A 78 1E 09 19 81 EC 84 63 8F B0 6A 59 2D
       data hash MD5: 64K
       D8 85 25 10 C2 0F 69 97 88 10 1F DC 19 DA B6 2F>)
(   2,<2007-07-11 10:15:51.94 +100>,<MAYBRIDGE\nmr>,<NMR_250MHZ>,
      <Start of raw data processing
       ef LB = 0.3 FT_mod = 6 PKNL = 1 SI = 32K 
       data hash MD5: 32K
       CE DD 09 21 7D C8 00 24 2A C6 95 A0 68 F4 73 78>)
(   3,<2007-07-11 10:15:53.62 +100>,<MAYBRIDGE\nmr>,<NMR_250MHZ>,
      <apk 
       data hash MD5: 32K
       5D EE FF DC 0C BB 27 82 36 9B 33 06 2D E8 69 5B>)
(   4,<2007-07-11 10:15:54.44 +100>,<MAYBRIDGE\nmr>,<NMR_250MHZ>,
      <abs ABSG = 5 
       data hash MD5: 32K
       B8 E7 7C CF F5 9C 94 A5 0D 61 49 4B 1F 26 D1 61>)
$$ ##END=
$$ 
$$ hash MD5
$$ B5 46 28 38 D9 3B 97 6D 7E 12 D1 B8 79 C9 6E 71
##$RELAX= 
##$RELAX= 
##$RELAX= 
##$RELAX= 
##$RELAX= 
##$RELAX= 
##$RELAX= 
$$ Bruker specific parameters
$$ --------------------------
##$DU= <C:\u>
##$EXPNO= 750
##$NAME= <ADRS>
##$PROCNO= 1
##$TYPE= <nmr>
##$USER= <dgb>
##$AMP= (0..31)
100 100 100 100 100 100 100 100 100 100 100 100 100 100 100 100 100 100 
100 100 100 100 100 100 100 100 100 100 100 100 100 100 
##$AQSEQ= 0
##$AQ_mod= 3
##$AUNM= <au_zg>
##$AUTOPOS= <4 >
##$BF1= 250.13
##$BF2= 250.13
##$BF3= 250.13
##$BF4= 250.13
##$BF5= 500.13
##$BF6= 500.13
##$BF7= 500.13
##$BF8= 500.13
##$BYTORDA= 1
##$CFDGTYP= 0
##$CFRGTYP= 5
##$CHEMSTR= <none>
##$CNST= (0..31)
1 1 145 1 1 1 1 1 1 1 1 1 1 1 1 1 1 1 1 1 1 1 1 1 1 1 1 1 1 1 1 1 
##$CPDPRG= <>
##$CPDPRG1= <>
##$CPDPRG2= <>
##$CPDPRG3= <>
##$CPDPRG4= <mlev>
##$CPDPRG5= <mlev>
##$CPDPRG6= <mlev>
##$CPDPRG7= <mlev>
##$CPDPRG8= <mlev>
##$CPDPRGB= <>
##$CPDPRGT= <>
##$D= (0..31)
0 1 0 0 0 0 0 0 0 0.06 0 0 0 0 0 0 0.0002 0 0 0 0 0 0 0 0 0 0 0 0 0 0 
0 
##$DATE= 1184145340
##$DBL= (0..7)
120 120 120 120 120 120 120 120 
##$DBP= (0..7)
150 150 150 150 150 150 150 150 
##$DBP07= 0
##$DBPNAM0= <>
##$DBPNAM1= <>
$$ [...]
##$SUBNAM7= <"">
##$SUBNAM8= <"">
##$SUBNAM9= <"">
##$SW= 20.6930455092707
##$SWIBOX= (0..15)
0 0 3 0 0 0 0 0 0 0 0 0 0 0 0 0 
##$SW_h= 5175.983436853
##$TD= 65536
##$TD0= 1
##$TE= 296.16
##$TE2= 300
##$TE3= 300
##$TEG= 300
##$TL= (0..7)
0 120 120 120 120 120 120 120 
##$TP= (0..7)
150 150 150 150 150 150 150 150 
##$TP07= 0
##$TPNAME0= <>
##$TPNAME1= <>
##$TPNAME2= <>
##$TPNAME3= <>
##$TPNAME4= <>
##$TPNAME5= <>
##$TPNAME6= <>
##$TPNAME7= <>
##$TPOAL= (0..7)
0.5 0.5 0.5 0.5 0.5 0.5 0.5 0.5 
##$TPOFFS= (0..7)
0 0 0 0 0 0 0 0 
##$TUNHIN= 0
##$TUNHOUT= 0
##$TUNXOUT= 0
##$USERA1= <user>
##$USERA2= <user>
##$USERA3= <user>
##$USERA4= <user>
##$USERA5= <user>
##$V9= 5
##$VALIST= <valist>
##$VCLIST= <CCCCCCCCCCCCCCC>
##$VD= 0
##$VDLIST= <DDDDDDDDDDDDDDD>
##$VPLIST= <PPPPPPPPPPPPPPP>
##$VTLIST= <TTTTTTTTTTTTTTT>
##$WBST= 1024
##$WBSW= 4
##$XGAIN= (0..3)
0 0 0 0 
##$XL= 0
##$YL= 0
##$YMAX_a= 412121
##$YMIN_a= -427433
##$ZGOPTNS= <>
##$ZL1= 120
##$ZL2= 120
##$ZL3= 120
##$ZL4= 120
##$ABSF1= 16.522
##$ABSF2= -4.171173
##$ABSG= 5
##$ABSL= 3
##$ALPHA= 0
##$AQORDER= 0
##$ASSFAC= 0
##$ASSFACI= 0
##$ASSFACX= 0
##$ASSWID= 0
##$AUNMP= <proc_1d>
##$AZFE= 0.1
##$AZFW= 0.1
##$BCFW= 0
##$BC_mod= 0
##$BYTORDP= 0
##$COROFFS= 0
##$CY= 12.5
##$DATMOD= 1
##$DC= 0
##$DFILT= <>
##$DTYPP= 0
##$F1P= 14.0000005364418
##$F2P= -0.99999901652339
##$FCOR= 0.5
##$FTSIZE= 32768
##$FT_mod= 6
##$GAMMA= 0
##$GB= 0
##$INTBC= 1
##$INTSCL= 1
##$ISEN= 128
##$LB= 0.3
##$LEV0= 0
##$LPBIN= 0
##$MAXI= 10000
##$MC2= 0
##$MEAN= 0
##$ME_mod= 0
##$MI= 0
##$NCOEF= 0
##$NC_proc= -3
##$NLEV= 6
##$NOISF1= 0
##$NOISF2= 0
##$NSP= 0
##$NTH_PI= 0
##$NZP= 0
##$OFFSET= 16.522
##$PC= 1
##$PHC0= -49.73937
##$PHC1= 3.681833
##$PH_mod= 1
##$PKNL= yes
##$PPARMOD= 0
##$PSCAL= 4
##$PSIGN= 0
##$REVERSE= no
##$SF= 250.13
##$SI= 32768
##$SIGF1= 0
##$SIGF2= 0
##$SINO= 400
##$SIOLD= 32768
##$SREGLST= <1H.CDCl3>
##$SSB= 0
##$STSI= 32768
##$STSR= 0
##$SW_p= 5175.98343685301
##$SYMM= 0
##$S_DEV= 0
##$TDeff= 65536
##$TDoff= 0
##$TI= <Analysis number 999999
Compound Code 99
Book Reference 9
Project Code 9>
##$TILT= no
##$TM1= 0
##$TM2= 0
##$TOPLEV= 0
##$USERP1= <user>
##$USERP2= <user>
##$USERP3= <user>
##$USERP4= <user>
##$USERP5= <user>
##$WDW= 1
##$XDIM= 32768
##$YMAX_p= 330450710
##$YMIN_p= -106000
$$ End of Bruker specific parameters
$$ ---------------------------------
##NTUPLES= NMR SPECTRUM
##VAR_NAME=  FREQUENCY,     SPECTRUM/REAL,   SPECTRUM/IMAG
##SYMBOL=    X,             R,               I
##VAR_TYPE=  INDEPENDENT,   DEPENDENT,       DEPENDENT
##VAR_FORM=  AFFN,          ASDF,            ASDF
##VAR_DIM=   32768,         32768,           32768
##UNITS=     HZ,            ARBITRARY UNITS, ARBITRARY UNITS
##FACTOR=    0.157963299565203, 1,           1
##FIRST=     4132.6476996994, 0,             0
##LAST=      -1043.33573715361, 0,           0
##MIN=       -1043.33573715361, -106000,     0
##MAX=       4132.6476996994, 330450710,     0
$$ Real data points
##PAGE= N=1
##DATA TABLE= (X++(R..R)), XYDATA
$$ [...]
20820 -5668 -19506 -39799 -8439 9973 -3115 -33911 -38344 -27346 -14731 8075 3783 20877
20808 20877 44707 12341 -8476 -3894 -3731 -15843 -18780 -10177 2484 3668 -12788 -11199 8517
20795 8517 1603 -8933 -17572 -11265 -3640 -26881 -45372 -13483 7658 31757 44890 34276 18429
20782 18429 39155 19525 -18889 -50694 -61520 -40176 -23182 -35552 -44812 -50392 -48423 -38367
20770 -38367 -47677 -45567 -53259 -33159 -21533 -11589 -25224 -25973 -18940 -12937 5811 14067 -5109
20757 -5109 -30004 -23684 -13325 5323 23540 28217 19533 13867 3348 -9371 -10886 -2900 -5993
20744 -5993 -11528 -18064 -17662 -12441 -6285 -1040 -7535 -14833 -7978 -3123 2720 -8071 -6183 -16592
20730 -16592 -48050 -25429 -21789 -32083 -42646 -43502 -37030 -17964 -4971 -1008 3748 -6096 -32388
20717 -32388 -47150 -36113 -42442 -19865 -6796 20164 31995 15534 17779 8037 2636 -3752 -9482
20704 -9482 -6913 4899 -6093 -24063 -12270 6659 19743 -14688 -25535 -22242 -16929 8026
20692 8026 11521 -8331 -24131 -48345 -45567 -42471 -46864 -33568 -19390 -12391 1444 -7374 -21611
20679 -21611 -32090 -24403 -2974 -1371 -12402 4907 1473 630 -14514 -20595 -28278 -27408 -12006
20666 -12006 -20160 -35496 -32097 -25755 -28737 -18876 -19271 -17665 -7676 7880 -13733 -11572 1808 15968
20652 15968 8562 -26563 -42330 -43746 -30714 -3151 4172 10623 7771 3146 3250 -2656 -146 8338
20638 8338 8179 13965 14355 7112 3045 -6249 -1589 6504 27038 54940 44861 21216 -4362 -29542
20624 -29542 -21554 -18185 -16136 -944 5163 -13256 113 11939 8358 3220 -5109 -6651 -17654
20611 -17654 -913 -13523 -31096 -14157 -11626 -6389 -2153 7509 -13728 -48182 -22079 -6235
20599 -6235 9517 16294 -1960 -12294 -14146 -1175 -6991 -23654 -11502 -13178 -16741 -16885 -18410
20586 -18410 12388 14917 15344 11068 17480 21543 11130 -1993 -16748 -37477 -34017 -29875 -30574 -53376
20572 -53376 -34951 -24452 -27626 -15016 -6460 -35568 -38596 -25590 -13210 11385 20518 9299
20560 9299 4708 17336 -4422 -4259 -15505 -37815 -41630 -38810 -31346 -10188 6037 14593 -2339
20547 -2339 -22946 -17700 -13082 1896 11196 43611 34890 18299 6887 14444 35946 48514 32440
20534 32440 5286 -3995 -2935 -2705 5226 -2574 -8920 -10301 11538 11466 -4822 -35841 -29096 2502
20520 2502 33029 37113 -6109 -11704 -17286 -16492 -2578 12073 25179 40820 54284 27052 -10055
20507 -10055 -14287 -34348 -47706 -44168 -25101 -16070 -19811 -34369 -28830 -18881 -14383 -37382 -23177
20494 -23177 -15399 -14088 5103 -1538 -20866 -17726 -5551 -4472 -9589 1690 20008 -5512 -27060
20481 -27060 -25080 -10042 3060 -879 -18523 -2943 22418 22529 -6557 -4710 -2028 19534 40639
20468 40639 40453 39437 23057 9615 34920 48952 41939 21633 15360 35334 30891 -7254 -23714
20455 -23714 -26325 -28769 -26715 -10065 6655 -5346 -39665 -48399 -29218 -15672 -15219 -6524 -19301
20442 -19301 -24643 -16266 -8770 -31447 -38902 -28341 -34227 -33920 -36100 -20682 9311 7866 -20290
20429 -20290 -17410 -11375 -16396 -4660 1054 -403 -12359 -1124 152 -13428 -21847 -31026 -38967
20416 -38967 -17956 -27734 -26184 -9333 -34791 -35671 -45065 -42981 -63881 -102458 -102210 -58472 -24651
20403 -24651 -5766 12874 18234 1568 -16171 -27092 -17569 -34386 -35127 -15937 4370 -5046 -14907
20390 -14907 10453 16234 -6303 11850 15793 -3792 -9152 5592 16560 10907 -6340 -15974 14305
20377 14305 31441 14770 -333 -2282 -3439 -3946 -18763 -23307 3936 -6628 -17476 -9747 3238
20364 3238 -3123 9349 23107 19633 5991 -21318 -24496 -29275 -16846 -6156 -1168 -7517 6096
20351 6096 23321 8195 -5951 -14190 -26463 -35742 -28709 -40443 -38621 -27537 6013 16419 34630
20338 34630 36234 23224 31796 37585 44893 29244 15906 12669 17912 18066 5183 6291 38282
20325 38282 19551 -1385 -689 11802 14815 2625 -22819 -28835 -19778 -7034 3110 18881 34337
20312 34337 39648 23069 3887 -411 -5618 -10004 -6896 26229 40416 25706 26712 4412 -14426
20299 -14426 -13794 -11058 -8801 1456 -19494 -32338 -24404 12255 19260 54103 38151 15576 21382
20286 21382 39155 35930 47918 25489 2143 -2837 -12032 542 36142 53807 21090 -19798
20274 -19798 -31207 -14698 -14896 -5598 14447 25786 2355 -7588 -2025 9145 2550 -6421 -1971
20261 -1971 3763 -17423 -15926 5091 15893 -8244 -10783 -2831 2927 603 10983 17584 9369
20248 9369 3587 -6885 -665 10801 -1 -25538 -29686 1236 17167 1168 12787 5341 -25859
20235 -25859 -34588 -11261 13544 -2154 5507 18677 16603 28884 22649 24377 19016 13742 -13913
20222 -13913 -871 13087 -26667 -45254 -41767 -19549 -5730 18572 16311 -4209 11633 11832
20210 11832 9402 31981 40040 37772 6420 1306 39140 19655 -17271 -8157 4395 12883 11410
20197 11410 11597 -2732 -14667 -18095 -8561 -10357 -9522 -2608 -10908 -4841 9865 29285 43458 19417
20183 19417 -125 -31316 -27196 -6498 -6643 -17438 -23997 -36859 -37921 -13410 -20838 -53893 -27090
20170 -27090 -16081 -16699 -23852 -20451 -27659 -42408 -27720 -769 4275 -247 -4938 -17702 -13681
20157 -13681 -445 18987 20691 27392 21609 2848 2282 14110 63950 47755 31176 29585 -6248
20144 -6248 -3636 21563 25224 24459 40599 32747 28818 41253 31678 9657 5174 11935 21997 38398
20130 38398 53351 35979 24385 33173 36664 17796 29562 46291 27778 31586 35249 15020
20118 15020 13556 14092 12584 8726 -1967 -6147 -10824 -21037 -14058 -3437 13756 24922 20871
20105 20871 3598 14547 -4480 -12551 1741 17261 17487 15890 6017 -2720 -6803 -26862 -19882
20092 -19882 -11920 4191 24835 17955 17031 28476 31711 30689 52684 68715 96531 118906 123087
20079 123087 147694 183458 227020 251081 283556 303863 328705 362353 377911 365757 353137
20068 353137 326786 294971 249723 188954 156397 117265 93208 74181 68699 64305 64829 61118
20056 61118 27976 21123 41312 50844 55091 62114 72397 91126 129219 144430 163834 228677
20044 228677 278025 306897 335319 342462 347476 317664 295104 297866 289953 267442 236193 191012
20032 191012 183599 181317 152218 126711 101662 95595 72350 46740 30157 38438 41403 39786 23904
20019 23904 16474 40543 47785 29084 21118 14711 3359 4459 -1951 -15575 -9099 12256 7365
20006 7365 17410 12059 1080 4544 -17183 -39988 -36650 -16444 -8155 9493 17759 20297 -825
19993 -825 1730 -8142 -12298 4536 25954 28538 10723 673 15925 27820 41900 34905 29499
19980 29499 15008 -4882 3329 -1565 -6666 -27798 -36782 -31498 -28390 -31056 -21396 12940 13953
19967 13953 10250 16719 11298 3658 7085 2179 -13896 -2745 -7097 -4551 -1765 -7100 -8862 -33346
19953 -33346 -48512 -34848 -4816 20072 -2308 -3288 -1657 -24861 -24874 -13358 -8929 7165 25585
19940 25585 29596 27021 28995 48672 23939 3278 6966 10563 12413 6829 35374 42519 42208 37982
19926 37982 29461 16785 5799 4870 10546 28449 45953 41639 10536 -6654 -14479 -6569 -7236
19913 -7236 -2603 14533 19613 -6047 -17775 4699 3002 -18323 203 8822 22758 30960 34427
19900 34427 24757 2795 -6594 -19613 -16654 12502 12811 9810 2330 1049 26231 40087 30091
19887 30091 3486 368 21783 2736 -7794 7567 11425 -2971 -12339 957 14241 32105
19875 32105 53814 39154 12845 14590 -926 11644 37610 29249 13693 7682 23131 14936
19863 14936 -12005 -15081 -2504 -3515 -4002 -16051 -20587 -29740 -30676 -10134 -9301 5541 33730 37385
19849 37385 34823 46833 39597 11839 -7389 -15264 -6446 -7801 -19189 -3538 36798 36714 19769
19836 19769 7448 4857 6559 5224 7192 -3670 -8958 -4679 -7393 4672 12780 9983 20571
19823 20571 33066 26367 15413 4828 20043 3734 -796 16783 7794 6883 -9746 -5152 -3261
19810 -3261 11330 5083 -15986 -8171 10733 4189 11158 41406 15697 -27260 -32779 -4111 -190
19797 -190 -2822 28518 27615 4832 20285 10536 1471 12951 20941 31503 39805 12718 23796
19784 23796 12429 -3094 16236 37116 46849 66972 63819 61628 43190 19573 1693 -7143
19772 -7143 -21680 -23295 -5949 12263 23973 34197 34495 24893 19974 56130 67103 79330 91508
19759 91508 73150 58785 55508 39224 76706 96097 98214 105394 103046 88278 97005 97636 94600
19746 94600 106032 114612 89853 75116 88719 130119 170885 182113 189036 208392 222668 250355
19734 250355 288200 299686 283461 262144 235161 188161 206143 250724 262890 292827 323847
19723 323847 344372 365190 385607 350648 294539 249386 206505 167284 144253 124743 91067
19712 91067 75512 89398 98908 97998 96227 88232 72391 56945 82972 108652 110885 117112 105431
19699 105431 105759 99274 83052 69225 62372 62721 49513 45063 34285 24860 22573 30616 26623 20422
19685 20422 41143 55002 65592 39621 24494 33554 24679 -4831 -9218 -4364 1002 35844 51116
19672 51116 41108 14256 -8875 3814 24667 33716 13356 -15486 -17513 4277 -11090 7254
19660 7254 -4622 -19115 -12880 -14502 -7569 10481 32582 50473 53269 54304 58037 40991 21993
19647 21993 20563 27990 35557 18403 23359 29898 44686 28174 13088 8349 26771 27698 53888
19634 53888 70803 60093 65000 83865 86072 84716 106005 144900 142198 123337 128895 133674 146342
19621 146342 162220 175456 177147 141180 97630 91178 90877 88283 105692 101038 91891 95140 110906
19608 110906 98958 94356 116489 118102 111170 105498 109294 129013 140683 113555 103036 115977
19596 115977 143151 150622 150533 144261 156689 167934 177410 187324 208009 216826 216907 231827 244786 271287
19582 271287 286005 271548 279223 301682 332836 382851 453448 539465 647457 775871 987033
19571 987033 1268754 1537516 1750215 2056317 2523768 2893867 2850708 2714251 2832433 3057897
19561 3057897 2850462 2341008 1961190 1741182 1505873 1249971 1042169 893223 799722 763908
19551 763908 761503 781155 827669 846462 837662 850933 903268 926814 928565 930893 951548 950578 937510
19538 937510 968228 1031978 1140100 1228237 1331708 1445140 1508157 1600728 1686624 1725172 1730555
19527 1730555 1737723 1709436 1662368 1625794 1623189 1640676 1695197 1824213 1955735 2131451 2398402
19516 2398402 2710622 3039243 3435303 3914235 4485891 5266239 6308571 7664510 9502647
19507 9502647 12095601 15877854 20818206 26540942 33206119 41908334 52090277 59666418
19499 59666418 64143843 70193375 75623835 73794751 67747594 63502055 58542969 49274284
19491 49274284 39354911 31595630 25378940 19855429 15322348 12038188 9821684 8345515
19483 8345515 7359521 6621412 6007633 5621877 5377097 5111982 4809890 4514989 4313057
19474 4313057 4114125 3921009 3787357 3720040 3687760 3752070 3888766 4089466 4371836 4714371
19464 4714371 5134366 5720489 6541320 7658975 9233946 11578821 15031732 19498802 24252094
19455 24252094 29269941 35877708 44422749 52642883 56823959 59330171 63916713 67659322
19447 67659322 66875456 61809827 57314355 54150430 48143147 39782784 32053801 26202985
19439 26202985 21379691 16770912 12802666 9865634 7815037 6393413 5372361 4607607
19431 4607607 4034584 3563029 3160211 2843133 2617020 2430499 2215473 2035389 1902027
19422 1902027 1803284 1703492 1582945 1527303 1481917 1401014 1342375 1275918 1200684 1138322 1045693
19411 1045693 978163 919062 839706 771123 715773 661794 611540 563794 523498 502564 492841
19400 492841 470675 439383 420647 394918 367828 370887 362185 335480 337078 324058 315699 297335
19388 297335 248512 229390 229963 235156 243263 251359 241098 230158 212953 228510 222738 184696 187890
19375 187890 200740 205376 226985 230604 215680 211547 220203 202883 191206 193742 199970 196318 173800
19362 173800 174842 198599 212707 217866 214198 201375 197267 169891 156060 158021 155374 114530 101895
19349 101895 83298 75616 91520 82254 102271 108568 110279 112449 112120 95258 94453 122878 146788
19336 146788 127363 94017 92987 91975 82547 79651 102607 94488 87393 110933 130921 118321 108916
19323 108916 99765 123606 145334 147941 150525 139633 139843 133112 131897 139636 126945 111705 100005
19310 100005 117433 121700 111595 111676 118720 112718 100266 101313 102016 90488 83854 88398 100793 112728
19296 112728 93522 78270 91973 95741 79917 81328 81919 66170 50382 67817 54698 34457
19284 34457 20464 14436 19419 29506 46437 62821 78887 62876 57109 39175 50579 34624
19272 34624 40805 37864 47516 50750 17754 36824 68960 58072 46521 44137 72743 90828 70950
19259 70950 64793 52821 31191 28543 31383 22854 27567 26093 20794 38579 43897 35336 50992
19246 50992 45840 47329 41377 17403 21295 44405 50860 48771 37921 15058 44720 58972 34720
19233 34720 23583 29705 21091 31155 39970 54433 55472 22992 8324 32653 24125 13856 7698
19220 7698 12413 14326 2976 12036 17281 20586 33886 22489 30130 25058 8297 14951 25479
19207 25479 23219 26649 28002 1260 2386 4582 15081 38667 35733 45129 39250 34870 22034
19194 22034 -6971 7990 8922 34275 32963 24864 23724 19202 159 -22983 -2536 -5435 15324
19181 15324 22669 -5621 -11989 -3855 -9587 -919 -12567 -6440 20545 30119 30473 27924 4316 -8648
19167 -8648 8020 4070 -13108 -22693 -22778 5915 24461 27558 9350 -18849 4840 1270 1112 27444
19153 27444 41513 24683 25533 20476 3889 -3904 2202 14183 21635 18869 16109 16566 19325 16384
19139 16384 16911 15633 7133 7801 14992 11484 12009 27052 25978 27552 8669 11150 7248 13974 28070
19124 28070 30754 29362 18513 28888 25077 1516 -3565 16670 33636 28660 9299 5476 14862
19111 14862 46846 56147 45527 48259 44677 13177 8241 14135 14025 9625 -320 -3087 -16635 -19765
19097 -19765 -14180 -19806 7172 19642 22954 44389 30359 22784 13177 874 -4882 -2547 9284
19084 9284 11969 -7988 10541 19115 1129 2569 319 -3817 -27433 -19339 -14521 -20840 -23050 -19209
19070 -19209 -12201 -9045 2664 508 18166 1607 -6056 -562 -6114 -4173 13474 25412 40821
19057 40821 25580 911 -16751 -13026 5774 19243 4222 -17103 -22763 -19668 -23723 -20825 -26044
19044 -26044 -30483 -12691 -2078 12235 19618 10583 33516 46990 41299 36134 14098 -13390 -15896
19031 -15896 -40095 -52165 -26581 -23307 -39383 -8360 17111 6860 -2466 12129 29993 38327
19019 38327 21582 35678 39566 26578 24548 14872 978 -7857 -15050 3399 1872 -19217 -48514
19006 -48514 -37012 -14799 5680 26347 11601 -2190 -6274 -1119 -5122 -21214 -38832 -54850
18994 -54850 -26666 -13426 3279 3184 3622 8259 -5281 11031 20378 -8398 -25821 -3963 17858
18981 17858 4890 23535 32938 32929 21235 -3266 -7799 3312 3791 -17502 -18006 -13483 -19871 -29933
18967 -29933 -11671 -3627 -4810 -13964 -6679 8826 28253 31881 32966 20232 8734 -21868 -34449
18954 -34449 -28339 -35304 -30208 6901 28820 21783 13012 7140 9754 14793 25337 33368 5544
18941 5544 2254 21792 47753 47993 28290 24972 20199 19237 8724 13005 26864 48547 59800
18928 59800 65385 57185 74555 103082 138226 179387 184397 214070 277212 318530 324472 331799 358429
18915 358429 385489 386941 393378 370813 320685 275990 238249 203136 149850 97935 85276 62271
18903 62271 49349 44666 38030 39687 58227 63058 74620 46995 -8015 -12778 4065 8774 25145
18890 25145 14944 2890 26885 16963 24882 21749 37840 48514 47302 42868 43135 45686 42991
18877 42991 40853 59242 71595 49746 56352 55303 33153 28636 41100 53718 65534 73559 69122
18864 69122 49906 33850 58792 96087 118052 136439 183369 204971 227665 257126 282632 317824
18852 317824 360858 360205 337253 326399 320806 297771 277887 243109 197492 168695 130511 134715
18840 134715 131300 121400 94130 70095 32060 12660 4360 3653 -9446 -12113 7225 46716 62815
18827 62815 69595 52918 26080 14703 13150 14399 31252 41305 47266 58322 42840 24851
18815 24851 17280 28335 13675 38797 66036 47818 35240 42816 65643 102632 137755 160849
18803 160849 150124 135766 103305 115069 130839 125468 126869 122263 110519 86582 59876 51446
18791 51446 60650 81498 86377 75791 96413 120544 131634 147074 166769 176386 201304 202185 203808
18778 203808 206759 204958 221260 263684 275535 280615 269461 255454 279610 325800 374747 454423
18766 454423 526910 476457 369508 292829 246860 205623 192758 174304 161544 132629 133328 119723
18754 119723 90566 54399 39646 33443 52453 53882 38103 48500 71897 50151 21946 3533
18742 3533 4093 27199 31446 29327 52697 77641 113114 114481 97874 109050 108698 100959 108807 101912
18728 101912 108661 130111 141913 161130 163811 199210 208790 234365 243786 246165 246852 266987 245596
18715 245596 216202 212941 213307 200923 200749 186922 180645 162069 140668 110750 91031 79493 95352
18702 95352 109608 125259 117122 85412 72254 62467 71614 58552 45449 51257 45544 21435 22817
18689 22817 42869 30315 22659 5904 12744 33235 28992 19442 25144 30208 14636 15242 21261
18676 21261 6873 -3935 5583 25118 51088 49850 39418 27339 34379 58827 50109 20949
18664 20949 18659 27161 59782 50121 37711 47547 41942 34876 47195 57381 78300 81317 48909
18651 48909 22311 16680 28866 36361 30591 28233 27572 48690 58562 46714 37121 48429 71910
18638 71910 89265 110347 125640 112337 95389 81196 82464 112306 122895 106392 82003 56786
18626 56786 52935 55029 50162 48416 36304 62327 68622 68827 66221 61221 45523 62480 73061
18613 73061 62712 36092 19002 30971 50291 40647 59726 70357 87052 96195 106862 90835
18601 90835 57471 61388 53415 18224 -6418 3839 34289 35698 49349 68992 104463 108451
18589 108451 113784 151454 189710 196892 181986 159172 156011 170044 168200 167644 137865 86287 49152
18576 49152 58354 62188 76055 80252 78752 89087 69148 34551 10962 38349 41097 42140 28482
18563 28482 25819 33977 21667 29400 34547 30880 48669 68794 66321 48188 45285 69518 46988
18550 46988 46376 47346 73941 86487 73811 80565 85182 69336 64631 82616 110306 107858 114197
18537 114197 133808 152069 196378 281778 331467 339713 370232 408788 422348 379921 336642 293378
18525 293378 236673 193481 160952 133876 114084 106112 102660 106860 93790 102707 97307 89855 100876
18512 100876 103254 78822 76350 81639 73783 48821 35960 28704 37811 31413 33903 34570 25487 28899
18498 28899 42799 42099 37623 44429 71656 77359 85658 73758 49519 38594 40879 46959 47195 39897
18484 39897 40045 39699 34331 35339 37494 48829 68085 67450 66437 73138 70994 79997 94983 91850
18470 91850 93924 98181 119099 96452 80338 82841 86598 87670 73654 78359 71125 66067 81441
18457 81441 64707 56799 41359 34972 51594 48597 49264 57131 48181 75532 78703 86424 94021 73745
18443 73745 64197 69037 69278 80147 91970 96342 83294 56762 43429 35917 55360 54971 56977
18430 56977 62212 63073 69028 73321 80526 100420 113133 126118 118216 102150 109660 113518 124585
18417 124585 146293 147863 155314 155081 167366 184761 188953 189202 201347 185468 179766 173661 152996
18404 152996 143003 142072 165794 195618 212738 225866 239398 251851 295412 301183 292279 286449 272053
18391 272053 251815 234289 214504 201985 209928 225450 262357 277809 244487 230675 234475 231876
18379 231876 223532 217872 208514 220149 224139 257962 270560 281773 283433 295522 292479 283323 290307
18366 290307 317707 350577 380984 424831 483513 527914 569632 631241 738003 880045 985567
18355 985567 1132902 1310433 1462121 1517609 1473924 1419886 1366106 1287640 1205580 1111544 1024135
18344 1024135 951905 880549 847199 855720 898538 967638 1005034 1001099 979562 952419 895274 831175
18332 831175 757274 725934 692252 678199 651171 604386 570772 561477 570861 606617 636899 629517
18320 629517 647190 676232 702040 734049 788954 841275 918208 986449 1071734 1183404 1304014
18309 1304014 1390887 1472944 1566426 1692459 1858651 2021724 2162492 2387932 2627171 2865305
18299 2865305 3108664 3414812 3759598 4165574 4625578 5133863 5625132 6106351 6597515
18290 6597515 6900371 6869209 6750611 6727864 6758788 6845650 7176139 7884772 9095803 11059224
18280 11059224 14117672 18598341 24527645 31013031 37178815 43502249 49968227 53704255
18272 53704255 53042769 50297746 46972025 42366023 36463024 30871815 26641994 23778536
18264 23778536 21992401 20961437 20431613 20421909 20417749 19520464 17698381 15690456 13758211
18255 13758211 11787153 9864614 8271830 7070901 6241440 5690734 5322764 5056313 4865095
18246 4865095 4773344 4738284 4793361 4948670 5272068 5753426 6486952 7579248 9102901 11108699
18236 11108699 13446611 15776054 18034429 20298347 22172331 22854184 22633689 22555326 23053711
18227 23053711 24281834 26668448 30598850 36301532 43773051 52215358 59516971 64944358
18219 64944358 69518423 71688605 68138424 60407830 52221314 44210968 35711848 27673725
18211 27673725 21311032 16866656 13906082 12012024 10916030 10404956 10201154 10101692 10166372
18202 10166372 10320821 10132390 9338813 8288488 7240335 6202905 5169107 4270401 3571660
18193 3571660 3051881 2709156 2460911 2291888 2157852 2054151 1948705 1867525 1743360 1614668
18183 1614668 1488463 1372758 1264461 1175872 1140857 1138050 1135034 1123673 1133621 1127504 1092451
18172 1092451 1042705 987016 947956 927257 932897 975625 1074737 1256464 1477225 1711659 1933129
18161 1933129 2089618 2163160 2100133 1897568 1641513 1363516 1097860 896325 755423 678113
18151 678113 651421 608164 608972 627926 632459 631939 645480 649658 656176 654861 652007 644645 616961
18138 616961 595143 589165 564976 553327 536519 545298 555380 545692 555747 560851 586454 608469
18126 608469 644503 691137 727242 799595 917427 1058713 1183139 1318865 1515895 1792900
18116 1792900 2104576 2586658 3460699 4911273 7345081 11568717 18680750 30667198
18108 30667198 46841159 47146476 31546655 18721245 11433499 7542595 5388664 4152399
18100 4152399 3306918 2695444 2253726 1879643 1545831 1312835 1141904 1022299 922948 849727
18090 849727 765202 699399 630695 581926 535811 528943 524894 491823 467522 429862 404137 385899
18078 385899 349397 318236 298160 279116 258095 241053 236508 257418 259906 242097 229445 206644
18066 206644 214030 204859 207231 207189 193725 208759 213109 213149 218816 217264 194137 165942 172461 174026
18052 174026 188097 200549 194976 192702 185330 213857 244383 258690 254615 262537 261737 249509 234270
18039 234270 222311 227984 242334 280813 339143 395027 473804 505858 448092 398822 357357 340935
18027 340935 366800 385233 408980 446873 496419 617801 811015 1089072 1508978 1976961
18017 1976961 2298212 2379618 2217640 1895772 1555268 1254799 1024870 844521 694067 612185
18007 612185 565752 564937 595165 654838 725881 742818 667813 554104 470364 409367 357721 315106
17995 315106 263202 226068 255243 257242 241022 232618 257797 260659 248438 213453 235052 273803
17983 273803 279064 320077 348824 360265 384777 438982 518867 605552 678520 672847 613086 574715
17971 574715 550693 547674 594984 657640 783298 914967 1077203 1242761 1410286 1564294
17961 1564294 1618751 1470601 1248053 1055043 896638 798905 749716 736280 739103 736272 706922
17950 706922 691068 678847 679950 713303 734274 728079 717036 718297 693766 633534 604964 617552
17938 617552 616576 593708 620234 689595 778770 893939 1060878 1305856 1577794 1812812 1954130
17927 1954130 1966154 1831702 1664654 1458235 1294449 1198319 1171000 1166495 1200962 1276860 1422629
17916 1422629 1580849 1732619 1852504 1950262 2080977 2258703 2500924 2800500 3175809 3684237
17906 3684237 4330547 5246928 6551577 8193111 9831808 10945629 11079612 10388325 9487250
17897 9487250 8825276 8607991 8865638 9557369 10724346 12568724 15431558 19770939 26350376
17888 26350376 36120277 49541743 65389451 79995872 87821839 85966919 76623010 63989795
17880 63989795 51278914 40316282 31909663 26189723 22916159 21678243 22137745 23834204
17872 23834204 25959293 27349367 26704164 23755464 19608950 15498476 12195178 9863122
17864 9863122 8306948 7303199 6601805 6035499 5588295 5215393 4888525 4695815 4616628
17855 4616628 4603779 4641280 4751121 4945618 5247684 5729664 6528419 7805201 9691416
17846 9691416 12355740 15735164 19346480 22173591 23060408 21917465 19873096 18161950
17838 18161950 17657415 18747333 21683413 26638021 33499621 41824549 50810880 59428742
17830 59428742 65488875 66107799 59428994 47973768 35908104 26014201 19042522 14469123
17822 14469123 11499353 9535642 8205987 7271445 6654879 6349346 6371634 6676947 7190418
17813 7190418 7676991 7732948 7149926 6140616 5059604 4153335 3505685 2984754 2525357
17804 2525357 2129644 1824566 1599900 1443937 1312776 1198958 1111688 1042580 959762 866490
17794 866490 789229 749795 727317 702985 655853 588139 556305 536987 492746 448381 433640
17783 433640 443569 444458 425229 411191 379663 379566 385927 392294 386511 430727 491996 500542 521693
17770 521693 509665 499569 500153 503051 483470 461998 443592 434168 434584 416060 430298 446815 469864
17757 469864 504757 501893 468351 454840 447029 447324 451889 447953 434072 424200 419068 420634 398804
17744 398804 376232 351721 345134 307142 278986 255144 253822 250379 230431 228631 262149 293916
17732 293916 336236 350659 335492 305772 277503 271495 254707 214517 189357 200294 201944 195043
17720 195043 204259 191842 169116 180579 203514 205737 200356 211835 232299 223865 225802 236857
17708 236857 245930 244419 215900 205076 239256 246584 236805 245355 244714 235146 209692 189826 162275
17695 162275 144874 127954 107743 100843 97614 111101 111248 96429 101043 113965 98366 53217
17683 53217 23704 20875 48544 74412 75819 75594 66427 56359 58427 49671 69181 68595 59925 58740
17669 58740 58132 63030 68584 58547 75965 85430 106164 112308 93576 93803 77174 82055 65667
17656 65667 48700 45494 33705 37840 21567 -4077 -11347 2152 21424 38421 57549 94593
17644 94593 112144 110710 97994 107321 108669 108202 95616 84935 64460 83822 102345 105517 110687
17631 110687 120002 134906 134621 144639 124418 100764 115608 117270 78824 42309 -3926 -16660
17619 -16660 -4078 26598 30878 23867 15720 1235 1718 -1919 -12795 -2896 25717 16817 12695
17606 12695 17606 17164 50715 55616 48328 33561 -6967 -20550 1216 37366 18313 36353 64885
17593 64885 50952 48637 34329 21127 28462 33289 39827 42836 28386 16491 8238 11263 14680
17580 14680 9200 7195 20107 36771 23206 -9460 -25904 -24360 -14268 -17802 -22567 -8538 -12030
17567 -12030 -14031 -21070 -12412 -947 -16202 -20586 -56876 -56806 -48436 -55758 -38724 -54504 -60464 -24532
17553 -24532 -34513 -25251 -1350 25227 14272 9378 -10758 -25144 -36579 -23193 -14689 -22003 -18832
17540 -18832 -28172 -41546 -32725 -50020 -41970 -21183 2923 -5577 -19598 -21357 918 19409 -7645
17527 -7645 2104 3883 -20915 -54438 -53083 -21622 -20238 -45603 -52757 -36105 -1490 21903 33186
17514 33186 22281 14553 9866 -147 -14643 -7674 -2504 -2460 19442 32664 40708 40228 29734 37997
17500 37997 43867 23058 14985 20489 27326 7534 -11731 -6557 -2047 12155 14550 21089 16439
17487 16439 -3241 -5288 33030 46542 9292 -8126 -1159 8655 16714 48637 71863 45968
17475 45968 23776 14565 -8198 -20450 -17597 -12249 -15025 -31110 -51221 -59689 -47155 -36610 -46465
17462 -46465 -30274 -14712 -14725 4628 7031 6710 10976 8028 -2003 -1273 -1534 10783 8960 10807
17448 10807 -9281 -4694 29092 54947 84980 149636 205770 244748 184220 109821 63297 33226
17436 33226 18612 6511 14052 24435 17570 17988 121 -12733 1544 8591 -8720 -13136 1200
17423 1200 7211 -3480 -1713 734 29075 32604 11611 -30807 -18608 12929 46528 31772 -38
17410 -38 -11580 -6333 -14477 -5482 7369 6141 -3845 1489 -952 -2392 -11635 11256 31575 51073
17396 51073 58280 53722 48478 28738 22582 23084 32092 50038 46236 50196 49966 63963 83472 121332
17382 121332 136334 146378 189498 193555 202421 192648 169106 168350 180642 156350 152946 167787 147907
17369 147907 138077 155950 159623 167059 210652 222926 196843 187148 172293 153258 114288 69050
17357 69050 56817 45481 31215 41838 67718 49857 47023 57436 46598 21574 21744 24451
17345 24451 40128 38252 21158 10416 35786 25624 20426 25876 31484 23074 23577 32912 63392
17332 63392 83920 79807 89653 133544 149173 165019 178643 227391 245834 231658 208790 161490
17320 161490 149318 110865 76894 57186 52311 57071 65743 69066 84280 91804 94697 124991 168162
17307 168162 173527 167070 150770 115576 92682 82109 62519 27901 18695 32825 17636 5500
17295 5500 -599 -22031 -49755 -30668 -6975 11801 21091 3398 1125 -1933 -11257 16425 43126
17282 43126 26107 3247 14317 7523 -15114 -19982 -18114 -2548 -2123 -7396 -10001 -15150 -38281
17269 -38281 -45681 -27350 -18584 -32217 -30466 -31274 -45172 -9167 -688 7302 5419 1330 2286 -6449
17255 -6449 -6938 -12270 -8755 -12153 -30958 -21229 -6957 -995 -11490 -7525 -5681 1260 -12094 -36240
17241 -36240 -35959 -29159 -18877 1745 9555 -5396 -17877 -5694 -2407 -26153 -20009 2853 11842
17228 11842 33792 35522 14303 822 15730 13555 4854 15131 2595 24236 37278 24756
17216 24756 17187 9392 -1605 -17274 5577 14121 13564 10340 353 -17349 -17517 -7039 -17620
17203 -17620 -17554 -13004 -12889 1212 -3567 -15765 -18230 -13332 -13178 -889 -3457 -10694 -10738 -4784 -30923
17188 -30923 -56696 -38143 -12679 15298 -8706 -27329 -53435 -43366 -18487 -4803 3978 -23175
17176 -23175 -30215 -37612 -15559 -10142 -29245 -43481 -40848 -52351 -55798 -20756 11680 12345 7396
17163 7396 6626 5049 13488 1735 -25957 -14438 16994 1579 -8338 -21008 -25233 -20219 -29985
17150 -29985 -41145 -27372 -34208 -46851 -62895 -65641 -53724 -46903 -30701 -22922 -21541 -6109 -311
17137 -311 -27663 215 18242 -6105 -16414 -5405 7493 3963 -20364 -25655 -22636 -22881 -33185
17124 -33185 -46018 -48461 -39774 -42798 -50365 -56815 -57583 -61264 -71142 -66265 -56353 929 9913 21739
17110 21739 11649 -7043 -1390 -12340 -19322 -43233 -36771 -45815 -34043 -29584 -19165 -8485 -24713
17097 -24713 -35116 -20628 -4811 -30640 -31569 -35038 -21825 -17891 -6924 4078 -12866 -14930 -26414
17084 -26414 -14314 -15964 -20019 -6433 3834 18065 22411 35379 47236 3487 -27299 -21854
17072 -21854 15914 5895 -10682 -2894 1023 22688 31818 24979 28167 22013 24331 3001 1941
17059 1941 -1510 641 13677 9259 -1852 -15656 2269 11198 -13146 -26393 -20437 -1507 8074
17046 8074 -8745 -34074 -37221 -30525 -29852 -17434 12754 2004 -14284 -29423 -25229 -12868 1034
17033 1034 -18349 -15729 -9619 7217 21706 28402 33466 27553 34994 40681 44317 43668 36795 13088
17019 13088 -345 24092 19720 -1050 6332 -4647 -20191 -43308 -46358 -37730 -15547 -17942 5369
17006 5369 -5355 11106 19434 -4784 -20793 -30716 -25747 -14366 -23914 -60171 -56179 -43632 -29987
16993 -29987 -4788 7852 -14745 -31319 -20966 -2579 33030 30595 -6551 -18289 -30383 -21994
16981 -21994 2097 7723 13290 7583 -3206 -2264 25020 24948 1332 -14834 -42383 -54309 -29467
16968 -29467 -11607 2216 10438 23590 24620 -270 -15853 -19064 -16054 1421 23199 21597 6276
16955 6276 -4306 9752 36684 32720 -1519 -38178 -17740 17641 41685 56674 39604 17719
16943 17719 -15412 -16629 -1814 -17179 -23194 -50031 -68661 -48851 -16679 -26428 -11442 -9710
16931 -9710 -33405 -44897 -32962 -13584 -34999 -55761 -48981 -29635 -20180 -32966 -51418 -41401
16919 -41401 -47646 -38634 -29310 -23898 -24170 -18582 -19331 -25476 -37738 -54439 -28148 -9730 -18900 -21523
16905 -21523 -26766 -9424 351 5553 -25129 -25339 -18225 -36506 -35865 -31332 -20822 5656 17922
16892 17922 18008 31984 28135 24178 20046 8688 -9391 -18605 -1892 28462 30836 20077 -19618
16879 -19618 -14507 13446 14294 3365 -10521 -1944 5480 -2611 -18596 -27573 -12792 6682 -12375
16866 -12375 -36162 -34249 -57410 -58358 -32354 -38982 -34345 -33765 -15503 9943 -12027 -11418 -19272 -23404
16852 -23404 -24160 -19428 -14686 -6230 -10256 -17554 -126 5552 -6473 -22977 -8057 11200 -16087
16839 -16087 -4591 -11749 -33710 -34576 -10427 -11216 -15289 -35245 -51091 -39727 -14386 2599 -10204
16826 -10204 -31740 -42465 -33715 -15914 -17558 -26193 -10947 36669 33605 18237 9664 12464 -8993
16813 -8993 -18564 -11179 -5213 -11480 -24660 -22748 -8837 11429 28885 26363 2201 -9541 1510
16800 1510 -3818 -23644 -23173 9202 16652 -3495 -26698 -21851 -17489 -8725 -2575 -11810 -13115 -14531
16786 -14531 -7335 -7908 -24899 -12490 -12167 -12633 -11632 -39784 -50557 -31913 -28478 -19740 -5575 3050
16772 3050 4449 -1275 7951 10442 24436 21138 -12215 -33344 -47917 -86149 -86613 -40123 -25049
16759 -25049 -8750 -11973 -8671 -8886 -22837 -35404 -41449 -33135 -20652 -9239 -13008 4935 13218
16746 13218 4818 11270 43118 21199 13369 -3400 -34660 -33291 -35328 -19237 -2459 -17880 -22041
16733 -22041 -21763 -33360 -15070 -3596 13451 -2168 -5223 8265 -877 -9565 -22780 -10808 -27421
16720 -27421 -25476 -8251 11388 16881 14215 30427 44035 64806 54008 8806 -13388 -5110
16708 -5110 -31651 -14027 -7749 -28912 -10618 -13071 -20986 -32389 -30016 -5281 7152 2727 -32501
16695 -32501 -55754 -40380 -35206 -12443 17333 28923 11455 16726 12357 -15269 -24505 -43099
16683 -43099 -55166 -53557 -42335 -18289 -13942 953 10839 24712 34984 29135 -1436 -20216
16671 -20216 -19172 12774 23326 28210 49012 51763 37738 16930 -5897 -14556 -25109 6849
16659 6849 4534 -23127 -29229 -40864 -31586 -15731 2632 23802 19656 9276 830 3388 1595
16646 1595 -4141 -12359 -29059 -38813 -30468 -22083 -24210 -29433 -24090 -35022 -41295 -31977 -2598 385
16632 385 3613 -2470 -6526 -13213 -10545 5021 10906 25864 16826 10270 23767 28262 15916 -3021
16618 -3021 504 -32307 -20629 -3956 -3575 12646 31656 -7968 -19976 4559 21078 1166
16606 1166 -10449 -12156 -20986 -34835 -32379 -30974 -28927 -26632 -43298 -39828 -20971 -11765 -16027 -20507
16592 -20507 -18590 -16606 -7449 -1040 5460 2091 -3162 421 -15611 -19550 -38464 -60173 -62007 -45980
16578 -45980 -48381 -34887 -32476 -29474 -34592 -38114 -31077 -1811 9876 6433 3276 -11254 -20075
16565 -20075 -22926 -29846 -41140 -19132 -4183 -8203 -17418 -30580 -20871 -28055 -7387 -8424 -26218
16552 -26218 -17995 -37705 -62837 -24764 2823 -218 -14106 -8802 4198 7952 -16316 -44504
16540 -44504 -41996 -35183 -30485 -27613 -25850 -4618 4568 26600 43092 32388 4259 -2897 -577
16527 -577 -4239 -18309 -35147 -32984 -26919 -6891 -3781 -5762 3659 3048 -19899 -10867 -12089 -33401
16513 -33401 -31950 -38361 -31967 -38221 -10251 -8492 -20546 -16101 -26240 -12271 26979 33855 13856
16500 13856 29277 45358 13692 6090 580 -24553 -33754 -43592 -35524 -19067 14169 29306 2263
16487 2263 -9957 -11764 -22641 -13349 -7915 5138 13237 7138 -12901 -28691 -13190 6468 -3909
16474 -3909 -3399 -23524 -35782 -51335 -51685 -40287 -52836 -72558 -94025 -74327 -45100 -25926 -27889
16461 -27889 -30424 -37342 -27200 -3393 -17909 -18095 -17228 -16568 -9532 -12876 -17802 -29756 -27044 -467
16447 -467 22473 17211 -12889 -16122 -29914 -30441 -32266 -50324 -46262 -32176 -36533 -24847 -28888 -20852
16433 -20852 -4852 -3200 -3251 -3150 -7454 -15072 -11828 -12126 -22770 -38901 -38297 -31165 -10700 6178
16419 6178 16213 29801 9514 -7002 -19747 -12771 -2524 -3832 3238 17456 -2174 -17319
16407 -17319 -39590 -56513 -44328 -11836 18567 13947 4193 2424 -18154 -32369 2101 35358
16395 35358 28316 16587 5615 -9721 -26726 -29481 -16635 -11482 -8112 -9383 -13797 -4625 -621
16382 -621 -2694 -31112 -27537 -13367 -13942 -44665 -42687 -57882 -90942 -82321 -55662 -45137 -48323
16369 -48323 -40956 -19011 -7567 -8719 -15334 -18604 -32591 -33915 -45342 -56239 -43317 -44827 -20284
16356 -20284 9096 16830 5267 -4852 -30775 -20983 -26817 -35822 -53323 -39604 -37575 -26227 -17993
16343 -17993 -15281 -10859 -22797 -21565 5562 8249 -1212 4478 21469 15972 15115 -10567 -19740 -16269
16329 -16269 -18645 -3388 -15292 -18169 -15525 -38824 -71221 -83882 -80384 -56164 -57384 -45761 -6573
16316 -6573 9215 14062 291 -4491 -22609 -17558 -5153 -18650 -16525 1308 31021 29816 11261
16303 11261 -15064 -35263 -28514 -23379 -29944 -24614 -3204 -1767 -18481 -16074 -3963 16171 24982
16290 24982 9989 -7446 -32350 -61857 -90457 -73599 -70120 -54403 -14950 5170 -13762 -15393
16278 -15393 -10380 -35094 -42445 -44279 -30373 -34655 -24413 -7064 -28348 -40040 -52682 -40861
16266 -40861 -45411 -42883 -32240 -21180 1907 9187 -10693 -15061 -5426 -15244 -47655 -36623 -34254
16253 -34254 -43025 -60545 -57629 -52492 -37634 -27997 -20873 -12723 -5926 -2236 -375 9555 11709 7572
16239 7572 15675 13793 15461 31556 12098 6625 38400 25524 492 6698 5308 -27273 -19553
16226 -19553 4633 -10456 -18871 -1084 -13499 -46309 -48079 -38749 -22327 -12783 1444 -8363 -32079
16213 -32079 -45445 -42727 -67551 -33552 -27523 -30353 -21053 -4606 -3386 -15774 -2612 21228 -1106
16200 -1106 -10964 -3224 -15069 -41662 -39976 -32635 -25539 -26994 -28846 -12631 -4329 -6937 6950 6563
16186 6563 12678 24111 16053 -12124 -19688 948 7143 -8513 -9745 4721 21897 38694 18201
16173 18201 -11244 -5796 -16938 -41131 -39568 -27363 -15860 -23391 -40846 -29829 -7741 -11561
16161 -11561 -1751 -1267 -17619 -29087 -15394 -1378 -3209 -14320 -14625 1235 3987 3205 683 192
16147 192 -7808 1234 8493 13333 19391 18005 -12058 -18217 -14039 -42745 -52721 -44263 -48260 -54404
16133 -54404 -78044 -67229 -38280 -31837 -52489 -66593 -61078 -58951 -45406 -43020 -27223 -31456 -3119
16120 -3119 28607 36983 10432 25200 21380 19401 26767 11427 404 -7582 -16661 6851 -1898
16107 -1898 -10096 -9184 -3632 10147 2232 4190 15605 24220 19293 1411 -2308 5968 11349 27660
16093 27660 13048 -19285 -36662 -45145 -39371 -49887 -20348 -8053 -5164 -6603 -31535 -22868 -6968
16080 -6968 -30947 -48441 -36078 -28215 -18496 -8274 -8387 -5857 -18927 -27299 -6568 -22797 -16212
16067 -16212 -13504 -31023 -47205 -45189 -35381 -37144 -33368 -36370 -237 15233 -10464 -28695 -29690
16054 -29690 -31521 -41401 -58969 -88960 -86918 -55997 -26289 -27426 -36362 -9233 -6729 -35414 -28281
16041 -28281 -12723 -12235 -7653 -13351 -15616 -14092 -29610 -37541 -28696 -16910 -11907 -41398 -47490 -48324
16027 -48324 -37063 -25696 -30910 -53748 -52208 -12878 4670 7837 -10270 -20565 -20300 -9810 3302
16014 3302 -11775 -26511 -27437 -18654 -45628 -60805 -72881 -55503 -33257 -15228 -7922 -17658 -43815
16001 -43815 -60322 -64291 -65158 -56803 -35287 -16248 -8627 -28362 -36763 -45393 -56063 -57077 -51430
15988 -51430 -41758 -39688 -58025 -52002 -41817 -23184 -23374 -18791 -17731 -8456 -16761 -53752 -49526 -53300
15974 -53300 -43634 -27160 -13009 65 3319 5768 8349 943 10340 21189 -3298 -2501 4568
15961 4568 27051 18808 7398 3626 7859 4866 -1380 232 -8954 -10413 -25006 4558 9124 -14446
15947 -14446 -14435 3931 -3527 -28814 -23260 5966 20688 22856 -9334 -31150 -23387 -23926 222
15934 222 -9796 4245 10405 -2007 -19082 -27866 -12097 -1672 12575 4800 17040 24338 24183
15921 24183 527 -7392 -19709 -31572 -37780 -17020 9203 -4324 -14469 -8315 -9980 -25791
15909 -25791 -16360 -21994 -33902 -7471 11818 -816 -26783 -30751 -28922 -23174 -4795 2030 6188
15896 6188 -9704 -12145 -7279 5153 -6866 -20594 -14980 -15605 -10355 -445 -10012 -27234 -44203
15883 -44203 -40893 -3515 5285 -4750 -22668 -35004 -22671 -11415 -15078 -28394 -27475 -18648 -23696
15870 -23696 -6308 5387 5702 -1482 -2985 -12539 -32036 -19261 12446 33984 43210 29383 2995
15857 2995 -13477 -18390 -11198 6852 10973 -11244 -1513 -10784 -22996 -41064 -34638 -42577 -31211
15844 -31211 -4525 -18253 -23210 7339 -1246 -9306 -12929 392 18510 17245 -5609 -34672 -42895
15831 -42895 -43467 -44072 -38861 -34057 -47716 -48555 -51999 -24475 -20986 -34301 -19244 592 -8708 -30622
15817 -30622 -31931 -30690 -14969 -24168 -31807 -29477 -18953 -3515 -11135 -12025 -7252 9143 6290 -10945
15803 -10945 -27718 -63354 -51462 -39865 -35518 -34529 -21203 -14614 -12117 -17336 -27970 -5131 6627
15790 6627 -26609 -34341 -36765 -35232 -25681 -5620 4948 -6584 551 -16622 -32501 -25869 -14896
15777 -14896 3414 -3499 -20013 -16992 -14092 -23543 -38778 -19576 -8746 -25149 -22619 -20826 -21308
15764 -21308 -26520 -41021 -51716 -26368 -27238 -29848 -32820 -41449 -67278 -44766 -52529 -44440 -39739
15751 -39739 -23758 -10223 -16993 -60496 -76405 -42439 -14555 7235 -16885 -31734 -35157 -45417
15739 -45417 -41321 -30699 -26615 -33156 -28121 -24828 -28675 -45304 -43629 -37592 -33028 -49729 -46408 -48740
15725 -48740 -54015 -51807 -37855 -30507 -41565 -42823 -36769 -36964 -24609 3591 3492 4450 12019 6483
15711 6483 -3764 -18500 -15680 193 10032 -5776 4311 -5458 19008 30505 9049 -3248
15699 -3248 -3501 4179 -3648 -11727 7929 4453 -28844 -53084 -40700 -24155 3751 16130 -4395
15686 -4395 -34116 -33513 -15738 8406 10826 7428 11211 19169 17486 30728 23830 5144 -4001 11484
15672 11484 24044 21677 18362 12129 19282 13971 400 10682 21922 30387 26188 22582 5151
15659 5151 -1422 -4973 3894 -11389 -12078 -11797 -20473 10696 53380 31157 455 -14437 -25692
15646 -25692 -23801 -9884 -4085 -17294 -22037 -8015 -11743 -17072 -31299 -38757 -54684 -49212 -38146
15633 -38146 -27627 -27126 -3867 -12364 -34704 -43230 -41106 -40602 -30227 19206 39536 27470 -2672
15620 -2672 -23614 -20279 -16023 -24034 -18082 -19647 -9904 -15263 -16339 -38489 -36355 -42090 -30611 -37017
15606 -37017 -33534 -19474 -18163 4800 16564 14425 23313 5900 -14673 -42231 -29147 -25403 -2810
15593 -2810 28600 31402 -1657 4755 12676 9170 19189 6986 -7093 -19424 -6863 -17104 -18378
15580 -18378 -3162 31691 28633 27548 6826 -6912 -13437 8013 8998 -3031 -9673 -7533 10678
15567 10678 25869 18027 10853 12513 9831 9482 19516 19587 3733 4207 -22594 -13605 17189 22547
15553 22547 15374 27697 35831 16347 8351 -11017 -12437 15317 45675 36264 16059 9240 25606
15540 25606 9074 -3892 12053 15510 -4762 -43327 -47318 -31206 -6930 14362 8371 5243
15528 5243 4396 16662 16987 22886 17212 1579 8153 28235 -3405 -2459 641 -19488 -6929 -15311
15514 -15311 -21603 -15704 -24722 -16268 -9285 -2332 -26664 -22671 -26025 -291 7271 7960 -5005 7736
15500 7736 4740 -17635 -12998 -3777 -9235 -2526 21970 21965 7590 -5731 -14162 1140 16159 9519
15486 9519 9887 -12427 -16694 -11663 -26564 -9290 -12908 -27124 -36765 -38480 -39598 -35215 -16282 -5234
15472 -5234 5551 17573 14139 -3257 6735 10426 18567 33458 20460 11032 11737 21245 5750
15459 5750 -10941 -10229 -5612 16923 25661 35931 33687 32522 -5863 -29201 -29877 -22381 -27377 -21211
15445 -21211 -15705 -20842 -18630 -15222 -9790 6023 13392 561 4763 -12116 -22797 -21571 -25263
15432 -25263 -948 13197 8240 21688 -11389 -7938 -2871 3628 -9345 -28760 -40178 -35069 -28109
15419 -28109 -3945 17454 12887 10778 -17917 -30452 -25211 2791 29031 27754 51512 47428 40655
15406 40655 13462 17696 29006 26954 13054 -3520 4186 -593 -16862 15 8490 3902 15402
15393 15402 25603 22394 28381 32890 8201 -27275 362 14759 28751 16918 -8605 -8357 -18845
15380 -18845 -17436 -45408 -52036 -51312 -29957 -9483 12416 12311 -8848 -14974 -14060 -15475 -20603 -25135
15366 -25135 -36009 -11113 -21137 -24858 -37915 -41373 -22688 -2106 -233 -9432 -13811 -4627 -22882
15353 -22882 -21847 -411 8024 8937 4402 -20816 -36588 -32725 -20023 -13982 -12038 -9669 -9971 -15859
15339 -15859 -14212 -21630 -26499 -29679 -7090 6826 7584 5259 10818 18671 23423 31561 20859 14499
15325 14499 20425 23964 9123 9010 5008 -16469 -22341 -709 7427 4711 -8824 -28828 -33663
15312 -33663 -44354 -37639 -16900 -1088 7612 8786 -11217 -9802 -5093 -13847 -22364 -14013 -28534
15299 -28534 -48993 -44755 -26464 -24847 -22552 -20492 -25426 -38913 -73984 -70651 -36892 -14325 9652
15286 9652 22579 7199 -28071 -48207 -39315 -28184 -11745 -6916 1363 -12628 -26269 -10528
15274 -10528 -11671 6223 5096 -9208 -15122 6779 -989 -27430 -58861 -43670 -8349 3822
15262 3822 -12750 -7115 -999 996 12490 -10869 -9631 7762 11717 -8151 -9817 -28582 -19780
15249 -19780 -2386 -23885 -33949 -10585 -12152 2102 -5603 9713 14943 -1388 9125 -5960
15237 -5960 -13865 -16865 -21262 54 11895 19089 8238 44 -162 -10879 -26079 -12093 15386
15224 15386 16771 41175 26709 6372 -13651 -12551 14027 11708 -30840 -46852 -18934 14340
15212 14340 22419 21277 -13338 -19572 24275 43246 41922 24230 6319 15621 25123 16826 14064
15199 14064 22710 45566 46186 23782 17278 7711 1187 -14138 -18956 -31218 -32540 2824 8173
15186 8173 -9916 -40141 -51946 -35057 -33588 -18973 -11616 -6563 -1778 -6765 -5532 -16244 -21690
15173 -21690 -14380 -1836 -22950 -53656 -43521 -32890 -9349 -19046 -17396 -4957 -2681 -30729
15161 -30729 -40552 -38227 -26806 -234 9923 -16048 -8390 -4083 -10896 -16364 -5884 5260 8412
15148 8412 5051 -9940 -16165 -12731 12860 10015 7304 -2389 -6796 -7634 -3463 4773 6185 3549
15134 3549 488 -3727 -3176 17340 21304 -1010 -24085 -25434 -15094 -18029 -39967 -64073 -79421
15121 -79421 -58492 -38290 -26003 -3419 2678 -26192 -36459 -28290 -27954 5691 23681 36699
15109 36699 37161 34475 14673 32537 18427 25636 47676 18183 13258 -4787 -13857 -21051 -4258
15096 -4258 -12953 -19069 -19273 -20052 -6707 -5500 -31851 -39221 -35211 -26588 -3157 8476 638 -14181
15082 -14181 -8640 -10609 -24173 -21595 -19553 -17378 -28944 -14060 16310 26252 16808 -4912 -19842
15069 -19842 -448 12597 -15750 -29268 -24886 -3577 241 -19841 -55403 -62510 -61051 -55696 -32570
15056 -32570 2296 -13744 -23018 -17856 -25707 -31203 -9071 7171 -3314 -25006 -20253 6741 25374
15043 25374 20455 13908 2984 5530 6435 -21139 -17034 -1851 17570 30802 31564 21193 19859
15030 19859 7539 15860 14552 8808 16795 32669 17959 -10910 -31541 -18998 10870 10989 17119
15017 17119 -5704 -19791 -21937 5604 8870 -8457 -33392 -65724 -66448 -41128 -17632 7877
15005 7877 1427 11775 18818 12362 -2920 -9652 -26546 -23516 5472 10773 1954 6970 1854 -19178
14991 -19178 -39001 -36933 -50144 -45204 -54506 -53913 -46428 -27349 2441 24575 6495 13356 5854
14978 5854 13443 33741 33804 21226 9906 -12729 -20044 -15779 -10401 -22732 -17308 3900 16841
14965 16841 -9023 -32453 -31144 -30389 -20318 4434 418 -17352 -17013 -14935 -21089 -6227 -205
14952 -205 1783 5054 -8836 -8847 -12977 -3257 18006 -3573 20790 50922 40078 38184 43459 16378
14938 16378 -5016 5631 16353 709 2220 7946 -8807 -22587 8955 24608 22864 -20464
14926 -20464 -35836 -15007 -10016 -23515 -40667 -51597 -59996 -18502 -11498 1791 4049 -18273
14914 -18273 -24866 12399 7987 -6104 -7299 -23267 -26539 -11144 -23772 -42135 -53509 -21910
14902 -21910 -17929 -29296 -30169 -22320 -21802 -27864 -51530 -24215 127 12849 10536 10227 7323 17854
14888 17854 -13508 -32581 -17087 21820 13097 6913 11621 7513 22509 33867 35568 14294 -622
14875 -622 2756 6706 23245 41693 33489 29329 31295 30010 38911 29931 14119 -279 -4447 -19569
14861 -19569 -43053 -29207 704 8905 4445 11184 2037 -25028 -18575 2739 -15564 -2873 -15409
14848 -15409 -40293 -35735 -15546 -18975 -31467 -24184 -4618 -16209 -67427 -47114 -23786 832
14836 832 6163 17471 -339 -28903 -48071 -37682 -20827 -13687 -557 -2883 -1359 -10864 -13584
14823 -13584 -300 -20963 -37729 -25029 -23059 -23279 -1067 5297 6742 -10999 -7711 -4223 3807
14810 3807 -306 -19878 6094 23543 14755 -13508 -59069 -63239 -54365 -47980 -62465 -58434 -50593
14797 -50593 -16746 -13938 -25997 -25723 -25519 -13182 -4918 -6270 18785 8296 -4862 -5641 -3227 -2316
14783 -2316 2121 -13035 -25983 -6453 1894 -89 -5471 -4552 8983 -15008 -20702 -15513 -4762
14770 -4762 -3456 -7292 -25748 -38076 -12021 -929 25110 26614 6684 -460 4401 3041 36761
14757 36761 41312 10613 -12911 -12999 -20753 -33646 -20039 11437 20332 10315 -5348 -21058 -34676
14744 -34676 -32007 -11606 6964 19705 -11192 -28531 -15249 -2191 -8363 3888 1382 -14853
14732 -14853 -11586 -1641 -32290 -38992 -64132 -40952 -7320 8357 11445 13748 2875 -17181 -19621
14719 -19621 11180 35059 38517 2969 -9799 -20052 -26647 -22888 -16292 21212 39320 23394
14707 23394 18750 30913 30754 11652 6786 28511 21895 17216 18827 22549 23045 31647 25077 23918
14693 23918 -1384 -19259 -12954 -10952 -26232 -53434 -50030 -10543 9509 17275 22545 2652 -6396
14680 -6396 -10454 10154 -1615 -10374 -8609 5103 20984 9184 -9729 148 21591 22234 20147
14667 20147 16948 20014 46503 23004 9485 -8288 -8048 6072 12552 18807 38816 46958 53840
14654 53840 23070 14246 7078 -25442 -34208 -32319 -7135 10298 7168 -26829 -41344 -47978 -52650
14641 -52650 -46792 -48461 -18292 4694 -9892 -1769 -5857 -25250 -26067 13391 16536 18174 27803
14628 27803 23304 33871 59056 40426 33529 31224 17443 -7263 -7934 15625 790 -13123 -8348
14615 -8348 -4681 5326 3814 11247 11143 16902 20865 34033 27979 45265 55129 63945 67216 66609
14601 66609 75878 85102 86122 69003 35255 14228 5065 13174 20915 16083 13799 31034 41684
14588 41684 48176 37518 31897 16151 -9963 -20067 -33408 -29167 12273 55492 41252 38395
14576 38395 46565 43725 50630 54540 60416 51327 55699 68807 74915 84659 64765 50163 35876
14563 35876 34466 46764 44846 40151 38205 60704 53786 29653 31941 31402 -7291 34 -1609 -8403
14549 -8403 10588 15586 6837 -16464 -43613 -21466 -14793 -18837 -12891 -21269 -23377 6895 13869
14536 13869 8198 17416 12331 14371 8075 12307 22263 41194 47958 37580 12417 11249 36880
14523 36880 21139 9782 32915 31435 16581 16961 18513 22321 19324 1283 -9842 -18964 -13297
14510 -13297 7455 -10585 -23742 -24984 -38702 -10866 2294 -13204 -35467 -49021 -41541 -36115
14498 -36115 -3560 27507 49991 36274 32226 30348 25391 -2193 -18088 -20304 8184 9516 -17000
14485 -17000 -40737 -35189 -11736 -20079 -19003 -10055 -4199 -12096 -1186 26552 36394 17146 14173
14472 14173 22264 26022 10163 10718 28557 34777 27397 9145 -10185 -20752 -5520 18687 55872
14459 55872 88036 71281 30044 26721 40393 30214 29262 35113 25213 21736 9938 22878 39341
14446 39341 39108 23526 24599 2428 3093 14485 -1450 -12439 9672 -2479 -9658 -9700 -22726
14433 -22726 -6222 -10142 -19285 -17441 -24055 -37963 -23800 -15982 -3926 -2302 -105 -2930 -8949
14420 -8949 -15009 3526 848 -5091 -11707 -18680 -22059 -35086 -16682 -13963 -61650 -71179 -58104
14407 -58104 -42953 -21055 -4550 -15459 -5278 3900 20855 5419 -9590 -10125 6349 41893
14395 41893 48711 20758 2051 2398 16106 -837 816 9243 9154 -7373 -17997 -15370 13993
14382 13993 26894 2094 15668 47278 47465 25096 4738 18202 36829 42971 -300 -32616
14370 -32616 -30821 -47959 -51220 -30673 -32585 -17331 -23445 -47977 -17227 15753 12735 14870 10616
14357 10616 -9439 -24660 -28868 -47702 -53844 -18984 -10527 -7934 9638 21261 33049 49724
14345 49724 41077 45805 6526 3930 9959 -14657 -17866 -12039 -16434 -13375 -8470 -16295 114 15061
14331 15061 25259 21993 18608 9572 -10176 -33166 -125 34036 11468 -5185 3155 8581 -12873
14318 -12873 -24136 -10704 -6760 -20735 -37412 -40312 -24705 6602 5258 5973 539 2885 14252
14305 14252 25462 13901 -5672 -6348 -10568 10244 10974 16841 29994 29047 31476 3890 -17104
14292 -17104 -18575 -30802 -25447 -27705 -46503 -42750 -34599 -17282 -3040 -125 -8469 -9747 -11235
14279 -11235 -1715 14707 8268 -21102 -13878 -21357 -23054 -28866 -18631 -5117 -9826 -7690 -11160
14266 -11160 3147 6727 -2168 -20956 -28535 -11041 -15162 -13507 -968 20744 31531 31365 4950
14253 4950 -974 -7925 -11193 -13630 -19886 -26857 -13407 20934 49137 55404 49454 34419 14915
14240 14915 7114 6847 9884 19478 22084 20233 -2814 -16541 11446 26780 21695 7114 -11749
14227 -11749 -34331 -16181 -15560 -25753 -15313 -797 -16491 -5469 3359 -1696 5581 4606 -1670
14214 -1670 -20603 -38303 -38839 -16981 -30311 -30837 -14295 -2960 32344 23668 1031 -2088 11707
14201 11707 10888 5123 5259 10169 -17198 -27271 -11103 -15944 -6609 -18357 -57789 -75399 -35308
14188 -35308 11403 -7238 -11994 10160 -131 -12536 1542 -1477 5265 -10161 -32167 -32890 -12254
14175 -12254 -467 -19766 -13719 -9639 -19171 -15552 -32694 -38769 -33886 -30783 -20821 -5407 13924
14162 13924 10740 3215 -8924 -10087 -4281 -15023 -47163 -50018 -44142 -17421 -3643 -11184 -16458
14149 -16458 -23609 -41038 -61504 -34256 -1379 20775 37073 36011 33633 36591 36691 29995 16588
14136 16588 -19911 -30002 -29576 -20255 -4302 -3312 -25610 3296 40718 59124 56321 53675 39372
14123 39372 22187 16563 23232 2474 -29663 -33183 -37430 -18850 -3976 -13765 -11087 -14646 -24640
14110 -24640 -32468 -31906 -29808 -4166 8257 23208 21501 39599 26208 8128 1675 -12013 -28880
14097 -28880 -14484 11623 14979 4622 8432 21001 8394 -8931 -21662 -17685 1315 27114
14085 27114 14821 12493 11541 19147 24500 28355 8386 -11327 -17451 -18100 6408 11051 -8703 -4507
14071 -4507 5973 12229 38299 35026 20744 27359 28131 54984 49558 46748 62749 78307 83560
14058 83560 103124 88147 105402 147535 194699 236759 249547 311215 399408 525610 715380
14047 715380 969461 1236862 1517527 1756823 2019286 2222838 2336657 2318547 2195938 1978677
14037 1978677 1724682 1450299 1163992 923603 695637 507129 374910 276357 249682 251010
14027 251010 226993 206183 188636 160712 145849 127298 113931 64032 54463 77086 81358 75893
14015 75893 62393 71784 78886 65325 56382 37550 12051 12025 20197 25798 29142 16891 5558
14002 5558 -8010 -2677 14693 27205 40170 53237 44782 51385 49355 40546 13977 2805 411
13989 411 10914 11072 18980 24563 26606 14048 12303 8168 3222 -30613 -16809 17142 40053 20107
13975 20107 12558 35088 36346 27654 3273 -1318 686 605 -18526 -4556 3945 -4571 -9105 12933
13961 12933 18800 7244 -5466 -28140 737 10864 26984 37391 22759 -5650 -8640 21864
13949 21864 36040 14446 -6745 -16599 -11619 1145 9047 12254 -4327 -7350 568 -312 5687
13936 5687 12051 10656 -6231 5539 3253 -6697 6321 9525 14664 33157 21921 -43 24219
13923 24219 50003 63252 53902 51970 63778 89096 63746 33610 9308 -998 -11 -12271
13911 -12271 -23601 -20168 -35491 -22992 -11211 -14250 -4372 4596 23384 10935 2856 13813 10368
13898 10368 10602 6331 2292 -15885 -9955 31192 43164 18848 -11646 -6969 11830 20698 26947
13885 26947 31828 18238 -313 13140 33244 54437 21548 -13025 -26159 5894 15733 13538
13873 13538 3483 242 17227 25387 12668 10759 -23775 -36342 -50904 -22627 -15787 -8517 -8907
13860 -8907 -19877 -28809 -19634 -2671 14508 18323 13996 7946 -4553 -1438 16881 32151 47264
13847 47264 50860 43143 36400 16030 7758 30278 61077 50136 30824 35258 34796 10648 9520
13834 9520 6450 1148 15106 27004 47153 45017 36887 35560 33919 34694 32945 41900 44534 42453
13820 42453 55809 39508 28765 42139 55347 38373 12535 39824 41116 25417 24121 24750
13808 24750 26562 28947 35402 24516 -2388 -1093 684 -15878 -34644 -17835 4457 8849 12332
13795 12332 1730 -5379 9232 -4116 -14990 -14607 -14841 -15248 -7287 18058 7896 2232 27618
13782 27618 50883 26832 24268 23754 20244 19020 26225 36278 25739 35439 40085 36697 28531 4651
13768 4651 -2265 20853 17319 4473 5372 -10067 9863 27846 34163 21436 7387 -6383 -33463
13755 -33463 -37420 -13381 18332 18553 11386 675 -2487 -676 578 6263 -11200 -17534 -7140
13742 -7140 23187 47182 30637 1081 5866 31166 35759 15726 -3594 -29174 -29791 -32734 3410
13729 3410 30741 24267 1862 14606 15605 25780 28480 43174 33984 11819 -21582 -18226 5645
13716 5645 33654 43480 54480 43879 36178 14376 15958 18504 1727 -2829 17983 33846 48595
13703 48595 39392 30946 2589 14303 34183 43913 16677 5000 11440 5240 -364 15479 8232
13690 8232 2350 9766 21694 -4392 -25590 -12496 -1306 -2091 3435 -10456 -11456 5859 10279
13677 10279 24692 52927 65971 38027 35776 38300 31265 30649 48742 53704 16620 -1347 -8516
13664 -8516 298 18381 18823 28586 23670 20434 16666 26213 41139 46383 53076 35283 16477 -16862
13650 -16862 -36867 -23498 -863 -12674 -40423 -45806 -36768 -16848 607 18260 6015 19387
13638 19387 32221 9986 -34397 -30229 1539 6289 39308 47995 26366 23532 -4603 -20069
13626 -20069 -33685 -28608 -8155 -4948 -22365 -27610 -45380 -32032 -25380 -19423 -1399 2868 16850
13613 16850 15494 16898 20515 23158 14711 12898 16309 17457 12562 1231 -11628 -2383 12741 19166
13599 19166 22372 15854 13052 12140 17101 -7211 -26247 -2999 43078 58188 47586 35799 43150
13586 43150 40349 8793 -5361 5358 6555 -19806 -20225 8223 20341 21085 14442 6910 -2865
13573 -2865 6491 5128 17455 6104 -20695 -1191 8840 12710 33161 51617 59269 52999 44457
13560 44457 17350 8019 19746 22598 -6515 -8295 -9859 -13715 9356 46059 39124 35005 29116
13547 29116 20430 17051 14523 21254 21404 34028 29120 22141 -4453 -17884 -11618 8847 2943 4569
13533 4569 -3293 -20573 -42190 -27260 -10406 -999 36152 33418 -14260 -41241 -22869 -18085 -11679
13520 -11679 -2282 4758 -10786 -17045 550 -11303 -17184 -16725 -500 26100 37277 10219 -4846
13507 -4846 -15944 -173 -10199 -6705 7707 -9034 -14547 -6128 2298 -4765 -27932 -37600 -33600
13494 -33600 -20028 -1088 -323 -13906 1946 19008 27620 15104 -8307 -40495 -41245 -57200 -58899
13481 -58899 -45291 -47713 -35961 -27892 -487 -4482 -12240 1095 4456 14103 1255 -2583 -16795
13468 -16795 -9606 1105 26624 37450 30536 27388 38481 37092 46159 26489 14551 17001 18050
13455 18050 9270 -8795 -18148 -4722 25969 25951 993 -3008 6608 6191 -481 -17551 -26182 -17714
13441 -17714 -32931 -30397 -10134 3395 23076 30300 7579 3094 2524 13692 33044 26980 33670
13428 33670 41061 48826 61974 90449 100826 121003 176005 174937 181183 205272 222075 250885
13416 250885 279538 303390 285031 249171 218000 190371 162872 170063 158909 119235 113406 123830
13404 123830 139826 184234 199324 217601 261734 295013 313806 327322 311438 300385 240942
13393 240942 210199 187001 172670 136143 110814 77957 40541 30255 37633 44307 43140 46080
13381 46080 63250 79310 63705 70405 58963 31150 25273 40932 34974 20393 6781 24704
13369 24704 -1458 -12156 20143 26822 29765 28416 32976 41615 45623 49312 16498 20001 53754
13356 53754 49168 34332 34569 25356 28028 50359 53598 55236 48594 50047 45090 46891 25061 -1936
13342 -1936 6569 68912 111355 124080 121193 131296 163192 205407 229135 260565 306594 354334
13330 354334 364435 361649 351847 337362 312245 279968 244913 223622 187211 164462 164450 180813
13318 180813 219109 259594 276609 300849 313621 321515 338691 358337 362873 340368 291383 232481
13306 232481 221479 203727 163978 157354 163149 150125 127226 104554 117238 130336 105263 80915
13294 80915 81594 68371 48573 56744 61279 52556 84761 90550 64464 46892 25661 -17074 -39721
13281 -39721 -12640 19234 28837 34111 43555 49719 53001 39209 5051 -1528 7778 11620 7845
13268 7845 17170 14056 22663 9366 4829 -185 1705 -457 -18046 -37680 -43831 -43122 -45336 -47662
13254 -47662 -37368 -7700 5239 -13296 10497 30991 24220 21849 27374 27840 35266 5416 -11306
13241 -11306 19642 28392 7562 8469 36354 47252 31608 20013 15624 10622 19130 25452 44778
13228 44778 46816 27626 -3906 -13323 3974 10988 23536 32374 50536 25700 13438 22713 22158
13215 22158 7131 6505 15456 10118 25877 29093 2429 -16875 -22089 8211 29477 44283 39104
13202 39104 41177 37485 13875 7420 -10189 -7614 14192 34659 37454 30416 27334 24449 3427
13189 3427 -16372 -11850 -115 -4065 -4299 13164 33158 36224 40004 29242 30208 33360 15834 -14589
13175 -14589 -26654 -24770 -3998 -5868 -953 6357 4379 -14792 -4407 -2289 53 13621 22360
13162 22360 11216 -13497 -4302 24562 21511 11641 6107 3422 3753 -2478 -8454 5814 5746 9244
13148 9244 11875 20551 30587 22036 20839 -3218 14285 51425 62008 64746 56668 26433 29080
13135 29080 28460 21782 19113 17024 28345 38504 25725 14885 34913 39232 34850 30136 52759
13122 52759 71508 41359 9114 22772 54456 48749 34707 33430 14094 7881 21155 21540 -2222
13109 -2222 2148 3791 -14657 -9062 -11910 4260 16980 16362 18644 10334 -818 -15304 611
13096 611 24670 33008 36832 34800 23764 44056 56399 52115 41626 29716 34044 45701 58450
13083 58450 58051 45176 58067 67706 25941 8746 3040 11221 22303 47946 43092 51837 51737
13070 51737 47579 33653 33621 31225 38457 49626 53247 41788 29705 46915 57335 44716 43290
13057 43290 45810 43593 42157 17550 14189 14994 22220 31195 27534 41827 55289 75380 69780 47558
13043 47558 54141 51598 32396 16783 15466 30500 54247 43641 42679 33964 14241 38533 53481
13030 53481 46405 42755 41211 29163 20593 10189 17755 39790 51947 50512 51929 58187 62207
13017 62207 49560 40557 44019 56456 67722 84471 83774 78182 59460 53268 44935 50811 66304
13004 66304 65812 59338 39929 41079 45087 53315 58142 77035 95162 107067 92367 87444 93709
12991 93709 107446 147440 166392 195149 242999 320626 387335 460291 547457 617923 664211 684627
12979 684627 674037 673393 652643 596154 525552 457844 377684 326208 272545 252254 223913 203963
12967 203963 157949 129069 117738 110626 100966 88821 91745 98177 91171 85825 90390 85827 79589
12954 79589 76130 73529 74272 70041 51509 66809 78980 74784 79082 77099 71104 66450 53658 60122
12940 60122 57877 49617 65780 66365 46028 19544 19650 28969 10661 22216 35267 38695 44249
12927 44249 48981 67478 50851 20221 28122 45938 44133 36336 34178 48883 37327 41435 33588
12914 33588 39707 64489 81783 75677 65975 62733 55674 39190 45097 68678 81810 73041 57437
12901 57437 69577 73927 79901 58598 35609 37460 47350 52711 54667 37196 49768 57828 76113
12888 76113 62824 66635 74968 84845 64662 66978 71079 53733 47698 50537 42703 49692 70720
12875 70720 54540 56710 55739 28571 14506 -5659 -2486 -8873 -30988 -18534 20685 62095 62494
12862 62494 76607 83799 72031 97546 104158 91323 82348 109132 134012 118676 95836 91195
12850 91195 112395 139311 161228 167707 147856 119581 78461 69701 91273 83108 69630 70166 74364
12837 74364 62826 44153 54650 70339 90057 99595 74252 67013 56898 59662 66567 76630
12825 76630 71317 84274 122735 152960 158151 147915 144906 153900 180979 182105 170894 172128 182716
12812 182716 185904 182549 173416 148578 135792 116970 107735 97600 99623 117866 123381 126515 101138
12799 101138 97841 89372 83013 92526 87257 70604 61964 86363 97565 91843 117458 112981 100817
12786 100817 113044 112976 102710 118815 137886 149160 149594 137313 118007 127242 124130 132223 133874
12773 133874 145190 171137 161316 151624 161754 170994 152441 114382 98583 119368 123657 144542
12761 144542 154098 133874 119424 175609 222488 218299 180041 148802 144860 183858 211796 221346
12749 221346 197856 172961 157768 146523 144602 168429 176593 174909 176244 185579 209436 227326
12737 227326 202453 203766 203483 201262 202928 217704 209902 202054 204155 213149 217123 214105 225032 215063
12723 215063 223036 229440 216535 223474 215657 208343 197196 194541 188226 200561 197785 239415 265068
12710 265068 241751 224244 211019 223386 216477 218603 220871 243714 280559 269698 258846 281131
12698 281131 295592 286943 276548 256985 241415 253270 291277 314885 341811 356807 379723 419738
12686 419738 440190 433477 435704 435072 409443 383714 371429 370590 367947 375366 381513 362131 360614
12673 360614 368296 356749 360819 352470 334725 338899 354953 351392 356352 367239 371049 381240 395730
12660 395730 376509 332610 333759 355371 375181 373262 363144 370619 381339 374404 370509 385865
12648 385865 413790 405566 418604 433297 450750 478175 493867 452071 436684 423174 430321 443302
12636 443302 476624 497570 498296 513545 541764 575857 588671 585222 572967 590439 602627 648734
12624 648734 683342 688744 721432 779004 814788 863516 919159 982506 1038039 1102993 1191807 1251217
12612 1251217 1277921 1296869 1319375 1291153 1264857 1249474 1225341 1242131 1284441 1327160 1355209
12601 1355209 1369898 1401892 1456612 1543075 1639140 1722481 1823223 1928786 2043142 2206381
12591 2206381 2364224 2515315 2650165 2868048 3093265 3332000 3616490 3943430 4329463
12582 4329463 4800074 5395672 6119764 6971082 7981752 9101471 10304568 11658439 13131570
12573 13131570 14793110 16761691 19234463 22500841 27002532 33267558 41848026 53097176
12565 53097176 66867201 82340160 98273997 113268670 125882343 134521374 137785468
12558 137785468 135068193 126925510 114728260 100041175 84290256 68844716 54965058
12551 54965058 43543630 34753122 28268231 23516209 20006240 17356391 15258965 13491872
12543 13491872 11928726 10555660 9298882 8170752 7144978 6245645 5503884 4876761
12535 4876761 4332546 3867250 3473733 3163036 2889161 2638461 2415362 2240918 2100435
12526 2100435 1961594 1828625 1737060 1654008 1554621 1475526 1361409 1288018 1251209 1213289 1168787
12515 1168787 1117960 1075370 1028961 970879 914844 871215 832601 789110 760282 748013 724696
12504 724696 678734 641143 624584 600594 574530 590788 589270 550306 524032 501491 500547 486424
12492 486424 460326 429586 415682 438693 433764 427390 418232 413989 440239 464690 458078 448966 414210
12479 414210 407339 423243 443663 424139 423729 417041 355878 320769 298363 290623 288963 278056 255170
12466 255170 264428 249913 254983 230609 196772 200244 208800 197846 204411 180860 153574 163639
12454 163639 165735 160599 150315 135662 142814 162209 164961 160139 167237 163105 168732 158726 147062
12441 147062 136423 117141 127419 160126 186344 208832 213576 201945 189539 184077 206269 198114
12429 198114 186696 182893 190274 194557 203028 199071 197896 170337 152839 166896 168491 150543 122176
12416 122176 103800 97066 108904 121926 141885 120967 107187 99829 113255 119625 144671 148935
12404 148935 145675 140837 121344 110609 115521 124823 120553 129757 138137 124217 79242 59388 82071
12391 82071 89641 88613 115029 118108 152914 185526 203191 218189 219359 209841 246605 286094 296005
12378 296005 317762 357850 397998 429714 479080 544042 619055 634764 590003 527251 486074
12367 486074 438359 375102 306329 259735 220486 176121 173004 172817 144277 128796 125116 108864
12355 108864 101597 117459 100478 69723 64708 85480 71122 67110 67626 86284 79215 54735 48754
12342 48754 52042 57257 61723 51453 32390 13871 34657 52584 49618 63020 67671 56995 55727
12329 55727 56599 40341 16134 16714 47925 78564 96573 101149 91828 76258 40545 30541 57277
12316 57277 51260 36471 50187 56159 40651 44997 36235 42911 21996 11247 18823 29169 36155
12303 36155 37032 58770 97565 93276 54669 33385 25827 37569 85378 81785 76454 75964 68551
12290 68551 64231 63692 70315 72892 66321 67191 86117 67595 61214 99482 107342 116591 138417 161610
12276 161610 175587 217362 279312 360555 437487 493960 523280 515692 489389 443074 369876 318223
12264 318223 258577 200652 156019 154290 135205 93322 88621 111706 118337 104776 92901 92735
12252 92735 91336 106831 95697 64212 54209 56148 39097 36948 62114 63804 75820 84246 96265
12239 96265 106388 101706 113096 104742 93351 94711 86481 86157 89810 100045 142326 170141 177512
12226 177512 193018 207028 205645 186514 200203 227983 248710 214407 189473 175916 183488 175530
12214 175530 187345 247559 295495 343109 403195 458332 463689 433733 394092 337149 291866 256134
12202 256134 235134 207462 189849 175408 169161 147146 119594 131027 136423 140673 155680 206781
12190 206781 214734 220388 237405 315665 400108 463131 508698 509147 474731 421885 353658 256623
12178 256623 177841 127355 135020 139640 116504 100183 106389 123937 106388 70991 59248 84682
12166 84682 91718 66605 62193 68826 61493 62673 62733 57453 64565 85294 104957 130908 120802 111827
12152 111827 96219 112503 125384 134172 151924 145850 149912 171034 207558 230521 274088 307221
12140 307221 354866 426794 487549 551631 626070 698300 746830 770148 770216 726880 676694 642593
12128 642593 589623 525013 486217 477451 477775 493692 497605 466113 434897 392923 339891 289271
12116 289271 238747 186388 144805 106466 95497 78970 83977 88138 80133 75191 41781 41461 51844
12103 51844 42430 50439 56674 57296 25234 15375 18564 6824 -15220 -392 23359 29910 41085
12090 41085 71219 87576 74237 58941 42850 55619 55586 41006 3230 -7453 1371 49671
12078 49671 43036 35126 36711 47441 41316 25556 18100 32141 39292 18104 -8101 -10582 16352
12065 16352 23356 19924 18665 9258 -12842 -6010 17702 5700 9467 -997 -14429 -10503 -6889
12052 -6889 5898 -521 -9521 -5707 15133 32160 18672 21810 14307 -5165 -7315 -14879 -8358
12039 -8358 -929 17899 40347 46696 37484 42409 55264 65800 53716 44880 46872 47049 75431
12026 75431 92816 88348 102924 99756 72141 62074 38972 14906 24953 33967 10323 -12652
12014 -12652 -3133 9653 3754 10984 1148 -9586 1195 5206 1750 -19600 -12445 -9471 -27537
12001 -27537 -19162 16298 35451 39216 32609 33949 17746 -3506 -4354 30393 44842 39279 22083
11988 22083 22713 4737 -7127 -22401 -4136 4840 -1425 -15288 -28893 -29301 -38106 -23010 564
11975 564 10643 17306 278 4789 12907 9892 25199 30593 7848 -16586 -23487 -15094 -16285 -11890
11961 -11890 -4034 19444 35042 33742 15752 4312 -8734 -1014 9224 -502 -5282 -8929 -4303
11948 -4303 6379 -858 -12247 432 10519 9352 16025 9651 19800 21782 13504 14735 19560
11935 19560 43349 51746 34823 29177 36371 30611 23174 8724 3799 33466 60171 71682 46021
11922 46021 5911 26299 64873 76099 64402 46442 24641 12386 16422 36662 46317 27004
11910 27004 21621 -921 3687 18155 19045 10351 18618 28831 16426 1322 -15912 8025 -1588
11897 -1588 -5152 -11108 -24295 -20153 -9990 19297 12912 1499 10210 5947 14288 6763 31007
11884 31007 66677 60763 28841 1958 -13333 -5188 -25816 -6942 21863 24559 37033 43873
11872 43873 45708 43979 27489 26173 14607 13001 29934 -3328 -23075 -7866 20850 40654
11860 40654 33589 45481 30653 -8771 -6359 -8110 -18622 -15818 -27247 -41437 -25114 7845
11848 7845 17459 6125 1661 23611 34729 47523 39673 4517 -20875 -7508 -5840 5073 18047
11835 18047 4256 -16508 -4025 27626 31382 18569 13275 29162 22190 27299 24744 19651 18446
11822 18446 13754 3224 -14139 -9893 24972 19395 5973 -1362 5191 23825 65292 75229 68401
11809 68401 51266 38221 13573 7458 7638 -8010 -21313 -26142 -7854 -3067 -8071 -4906 31316
11796 31316 36992 39016 11872 -13898 -23371 -23512 -27313 -21643 -10053 7259 10573 -5158 -27424
11783 -27424 -38696 -34248 -10496 -1157 -5597 -22943 -25803 -30785 -41574 -10311 -9472 2424 2677
11770 2677 -19436 -32562 -17681 -25692 -12389 -7734 2745 2981 36506 40695 -3443 -9018 -9649
11757 -9649 1182 6334 1193 21611 40888 26500 20644 10336 14344 25871 46588 49057 23927
11744 23927 7256 -16671 -5669 32489 56158 55876 35142 25663 15807 10324 5033 16575 14018
11731 14018 9098 21696 16714 28517 52000 73369 69611 49925 25828 25098 41768 26935 26212
11718 26212 19888 17562 10336 6487 26133 30040 37609 52658 65556 87941 98740 85884 67760
11705 67760 48077 44226 5026 -30065 4904 27650 47359 23532 12328 12783 1551 7044
11693 7044 14313 18285 8955 25999 21730 15411 -3117 16564 21165 12635 5982 -354 11007 9634
11679 9634 13743 28059 51121 24862 5214 1505 10916 16330 17033 13286 14573 24590 19520 23349
11665 23349 39515 25405 19402 45649 43464 30775 -8736 -23714 6069 2794 -3428 3372 5425
11652 5425 17037 12283 -395 -9443 -16968 16805 19253 19943 27973 34283 43316 36266 26694 40963
11638 40963 34543 26378 12176 35746 48185 52242 53082 33537 1524 -12319 12499 32217 40354
11625 40354 43054 23960 16348 34070 33677 22351 17897 -2101 6334 12341 -8931 -7078 2533
11612 2533 -12527 -29143 -35919 -27434 1813 5653 18093 30801 32619 38079 50146 22900 19578
11599 19578 5155 10960 9335 -26920 -30928 -24029 -21269 -8330 -4759 -3302 25898 26700 16163
11586 16163 31340 28310 6743 7996 16852 2259 6136 2881 29977 43168 70158 56072 42066
11573 42066 4620 10615 26730 10056 39880 45079 28774 -1745 -20797 -14573 1655 9436
11561 9436 18780 6413 -21297 -6189 3155 -7016 -7355 20763 31508 38015 14691 10344 42937
11548 42937 58111 34326 16787 27109 13836 -985 -2918 21361 58108 66503 43462 11505
11536 11505 22999 34959 42989 47714 37271 39978 32719 37665 31641 6802 -5176 6435 19528
11523 19528 25958 39563 48602 36761 21337 27967 45340 48259 39825 27642 23092 40712 50543
11510 50543 23001 1851 4096 28492 40543 41356 34892 40379 37409 26264 31063 49142 51476
11497 51476 59932 46984 30266 28171 28624 80980 104308 91544 93606 89929 95526 116211 111995
11484 111995 91972 107038 129550 135476 136996 149978 132445 140947 121583 112450 124203 153387
11472 153387 164172 141081 128872 117959 103126 104867 96610 83215 81162 82738 106771 156694
11460 156694 178654 192191 218922 262100 280982 269912 302831 293903 249900 203727 185376 199028
11448 199028 219787 219436 228552 242844 231203 239980 239800 225303 209232 200549 197028 191893 185031
11435 185031 165249 130212 120730 98717 88764 106395 99864 70720 63406 55216 59430 55404 56033
11422 56033 55967 70899 72758 55858 32938 26455 35251 24175 32714 25096 47453 81457 88137
11409 88137 84774 91484 83161 92814 102204 98897 84472 89042 84743 77000 74964 69346 72787 68655
11395 68655 57451 47828 65827 73594 81972 54149 22240 25660 34268 51638 46952 42007 36589
11382 36589 44878 40033 32940 40293 37173 41771 52946 25809 36176 50864 48573 66565 76677
11369 76677 69836 35027 19613 22159 12009 18010 27105 30599 39019 42708 68385 67692 57230
11356 57230 59069 42366 44261 51848 84778 98369 106121 93297 82335 79163 87371 97650 100618
11343 100618 96182 71946 72396 71264 62286 64095 75633 72503 49399 34382 37393 55634 30851
11330 30851 5197 9023 29264 69886 90991 92670 88808 71443 59531 59906 74629 60289 36404
11317 36404 56599 71435 36715 33655 35532 36311 54637 58949 72529 112824 154163 216379 296046
11304 296046 320282 259898 178782 120492 98626 88976 99078 113237 115537 98842 86652 84184
11292 84184 96234 103548 94076 74763 74755 67209 57641 43738 58868 63109 54464 51005 54861 46338
11278 46338 46394 51471 63791 118629 182015 253136 292799 297022 275596 237911 177142 121509 99633
11265 99633 84896 75671 65572 46064 42807 41589 39051 32035 37559 37137 36054 43339 34981 30546
11251 30546 29298 49383 55912 35015 27731 6241 -3530 9920 612 24495 39266 26843 39648
11238 39648 35448 46584 62876 75365 70794 75606 83670 84704 47851 32760 19952 10437 21703
11225 21703 14940 31083 53159 50681 49370 51982 66638 77883 82025 67154 55663 42893 64729
11212 64729 81992 97844 80071 62703 58750 87350 125136 129511 123897 127044 156014 161566 175114
11199 175114 189147 185112 182869 167431 188598 204863 179532 153886 118280 115711 113094 98364
11187 98364 67261 61896 89514 71353 59005 47566 47732 52689 43015 29781 27975 35739 33859
11174 33859 24667 47798 50031 76378 108543 98513 88131 81591 70914 69883 76273 77389 65147
11161 65147 81392 104346 89280 66681 35030 35649 60037 76321 81762 88171 91654 93122 86229
11148 86229 72672 61178 45436 50845 50479 52604 70083 71400 46299 46393 52371 34125 26131 41861
11134 41861 45024 29978 35395 52072 44526 33934 31956 29475 38353 29366 30476 30494 32768 24737
11120 24737 12127 26905 50842 50621 45719 48233 31255 42677 51494 59803 68125 53128 45749
11107 45749 44986 27688 37818 54295 64526 75159 57020 53896 64022 80445 69296 55979
11095 55979 44520 55774 62709 53664 50573 39953 39735 29101 1989 6297 33060 54455 29312
11082 29312 15503 27566 36497 41261 45385 55535 57909 61118 76881 52458 28735 53612 78396
11069 78396 108533 127360 111839 111558 105097 93217 73581 52643 66279 84528 94116 90744 77472
11056 77472 83246 113550 104510 95146 84384 92405 97705 66099 64745 79646 64857 46030 13970
11043 13970 5158 39234 63817 62643 43204 7238 27875 49417 59578 49992 20506 27673
11031 27673 48571 65172 60471 40314 49213 43891 48112 55579 56311 44249 56344 75715 69718
11018 69718 79048 101866 114860 122892 121079 96880 53699 46522 37470 52884 87856 96499 71215
11005 71215 49809 60830 67932 55936 57073 70580 69072 54244 49347 62575 52204 45871 68463
10992 68463 90167 92867 100669 131635 129899 121508 93442 83346 79720 72406 68192 102925 116435
10979 116435 106887 94780 89927 104584 138806 154525 147817 127014 111848 109189 123035 91716
10967 91716 68354 103177 142452 170087 185013 203722 219506 235562 249908 257557 264982 297553
10955 297553 345529 441840 572284 772000 1014431 1329958 1646629 1814661 1739271 1446120
10945 1446120 1124862 860454 655892 518436 432994 372520 318529 301372 295313 279040 253020
10934 253020 216819 195090 196081 183246 156294 141853 132537 127437 133155 129571 125418 109077 102944
10921 102944 101676 102699 116876 155052 145235 107759 72591 79668 117284 140018 132897 123007 95185
10908 95185 73463 82608 86558 109279 105533 107412 115100 108842 103392 96294 90065 101131 108488 118495
10894 118495 107723 99873 109710 122808 129710 117140 106696 101372 107173 113863 103261 117202 133346
10881 133346 134674 152500 136260 111896 102751 99612 102802 135402 157338 178491 177967 159549 145738
10868 145738 129016 128828 131726 153791 176749 191347 185844 182386 187052 180179 196240 200074 206292
10855 206292 265374 328175 424427 564715 729558 899336 1019572 1112639 1246258 1424199
10845 1424199 1473973 1382101 1200919 1079148 982691 842937 654802 523027 423374 352361
10835 352361 304360 293240 266969 248597 238137 231668 222601 199244 186492 176399 155136 166060
10823 166060 163260 152920 145145 136566 156459 178495 190192 179723 163754 162838 150157 150101 127205
10810 127205 98258 102984 120608 149056 173208 152786 135991 128985 131355 138884 144296 139671 182809
10797 182809 203424 184876 174451 175941 172123 147423 162083 175752 170434 187332 222958 271093
10785 271093 343533 404861 452346 441094 384042 315094 258535 223889 198872 188230 188100 212451
10773 212451 200726 201050 191585 188334 200483 189735 169078 164232 147368 159742 187050 175004
10761 175004 186847 207557 221099 227945 216982 175701 154030 144873 172717 192128 209313 221977
10749 221977 220816 225974 211152 197616 211025 221228 221493 215510 191586 180836 208020 206077 183448
10736 183448 181719 179229 163445 157720 163750 176429 185526 208623 248044 259759 265566 268557 260566
10723 260566 249876 263967 247537 233111 238179 227591 199021 182633 163108 134380 132012 151855
10711 151855 201257 217935 223825 243886 264494 264910 246273 255009 275871 337043 370923 402415
10699 402415 398312 388685 381995 402257 425387 444885 454381 419118 402851 371933 330232 294344
10687 294344 273259 258266 241261 233985 239239 230074 250258 277127 304351 312731 322189 337311
10675 337311 329804 325546 306794 292204 288004 322355 309363 297158 308421 326563 342037 355483
10663 355483 376350 412041 452427 513408 591787 636125 685417 720324 683012 634118 579352
10652 579352 553003 530430 490968 478323 492159 494470 502012 490888 480675 502327 490607 504465
10640 504465 523263 526851 547862 543901 546291 567567 564178 530824 496786 490261 498514 513074 507652
10627 507652 517955 531009 547893 564479 544417 551902 589111 624405 627500 650868 652964 651179
10615 651179 607874 597588 597237 638220 671341 693616 707907 714031 737056 754070 796689 852396
10603 852396 876421 884723 890162 919754 915263 899912 885488 871380 893927 942051 997127 1063536
10591 1063536 1129522 1185439 1227910 1241601 1282822 1315073 1351164 1374991 1377016 1405818 1457447
10580 1457447 1527392 1587323 1651906 1734752 1820500 1920721 2013195 2104914 2226644 2366887 2485828
10569 2485828 2565438 2661269 2814186 2974643 3135991 3348183 3608550 3909802 4230777 4574646
10559 4574646 4956532 5298253 5507363 5627954 5786067 6082460 6492801 6993612 7639713
10550 7639713 8452302 9443907 10579135 11792018 12977653 14193521 15701513 17661407
10542 17661407 20048329 23009076 26789556 31722588 38264479 47274405 60029603 78531486
10534 78531486 105585751 144563593 197851195 262193900 318072654 330450710 288849347
10527 288849347 223390951 163642649 119291474 88743527 67936785 53552450 43294163
10520 43294163 35718491 29950490 25467862 21881906 18980102 16739810 15069038 13787865
10512 13787865 12711947 11636439 10528497 9438810 8498811 7796084 7287465 6966775 6815117
10503 6815117 6735822 6656161 6548336 6353665 6052292 5646927 5211477 4791488 4438036 4193090
10493 4193090 4037728 3928879 3800148 3667149 3521502 3378233 3278955 3211812 3172171 3171560
10483 3171560 3169917 3179078 3202270 3236953 3314346 3405964 3545909 3701065 3864274 4022752 4182051
10472 4182051 4372104 4595045 4863618 5219283 5709985 6213858 6725245 7297865 8039260
10463 8039260 8933151 9791394 10717424 11816415 13181045 14965891 17138719 19584048 22603076
10454 22603076 26896097 33133252 42045470 55039103 74386462 102481103 138206582
10447 138206582 167801389 182383606 199509530 229412288 252412206 241474112 210939226
10440 210939226 188490508 175828131 153454059 119499703 88796096 66471008 51463332
10433 51463332 41478049 34771808 29881711 25904959 22236929 19075494 16845053 15213550
10425 15213550 13484070 11761316 10414753 9405712 8487941 7534763 6710645 6055355 5455401
10416 5455401 4819536 4223765 3730024 3328068 3030795 2778534 2568465 2396051 2242719
10407 2242719 2130956 2032649 1950490 1862565 1796091 1733657 1644613 1568347 1483552 1412059 1360893
10396 1360893 1323513 1264640 1215612 1171477 1102529 1044187 999892 970023 942732 892285 863796
10385 863796 813441 767695 728687 701568 695756 689095 653908 657709 640323 603521 605979 611189
10373 611189 568500 524015 496852 467493 438352 429241 432786 446501 453410 428004 422907 428192
10361 428192 442432 428010 421628 416666 419793 411645 429415 419331 378579 336677 301121 291533
10349 291533 344145 375831 393933 406762 413927 381459 351963 340110 353649 368623 366132 375824
10337 375824 385010 373323 382351 434344 469413 463468 423031 404377 407465 400200 369309 333561
10325 333561 305370 292555 277724 237390 228006 234011 235608 260428 291345 291777 276685 275544 253322
10312 253322 267657 270445 254643 231152 221627 232626 211512 192130 181572 181948 188429 166835
10300 166835 147997 140174 131678 132492 162264 198532 215534 211821 215074 199567 218350 215763 225452
10287 225452 206971 183791 189908 174587 138076 112825 91748 85732 95004 95761 97181 98893 99107
10274 99107 87447 72074 76096 78480 89035 83364 57822 61946 83955 108095 128531 136602 165929
10261 165929 170638 161049 182245 189690 152404 138468 136701 132691 103513 77297 66070 43307
10249 43307 30615 3633 -15654 9305 29317 29426 40148 50162 38012 35847 32691 60022
10237 60022 57761 34319 35342 30371 9327 18859 46436 73770 74733 29301 11298 14017 33335
10224 33335 40840 41885 43681 58383 56720 89248 110309 89173 61195 71696 77446 70850 46526
10211 46526 34590 36678 25981 13971 3828 23134 48474 41271 17404 26451 53961 71555
10199 71555 76167 79166 74224 85860 88234 83845 81810 73651 81202 81817 104404 149112 151957 179531
10185 179531 239607 291031 350613 469204 635900 813655 990532 1103046 1083398 959027
10175 959027 792664 625907 498796 400886 317766 268017 240647 215782 178104 137815 109724
10164 109724 92307 96908 111055 79811 65669 81925 94548 69405 54581 48609 43599 53993
10152 53993 60954 62425 69219 44268 42546 29301 37508 46102 33972 52670 63996 62998 79689
10139 79689 94221 128683 166449 168656 163992 148015 152037 199554 249721 253405 214550 200834
10127 200834 193306 174427 136053 124084 132661 149271 151008 123278 112735 114170 120488 127913 147707
10114 147707 189562 225538 267556 291824 386157 547529 771861 1097786 1428527 1662768
10104 1662768 1680814 1463759 1144183 828564 594679 469862 367492 291457 244747 194089
10094 194089 157023 129509 99836 91098 84295 70433 67061 61062 70068 42133 25559 17412 44003
10081 44003 51445 48669 28830 22498 38811 37480 29368 45303 66142 61148 48093 52609 44271
10068 44271 28894 39909 58882 76302 67860 40477 40146 53142 63955 43457 35403 65137
10056 65137 69816 75402 86434 101603 124725 135641 149233 151517 146404 175957 195399 242448
10044 242448 296723 393171 530232 685601 902098 1120781 1323731 1616548 2059216 2226553
10034 2226553 1882630 1472613 1217016 1065154 901045 708064 546086 434137 357095 285406
10024 285406 230006 229672 215299 173234 123658 121164 99449 83490 66269 49113 50877 40739
10012 40739 25763 6953 6908 1644 14711 28679 58558 60946 45073 31833 31398 18143 4161
9999 4161 -7460 -15118 18828 37489 54149 46203 17098 8680 1120 1036 8472 31998 13142 21912
9985 21912 4456 -10217 -11515 -17138 -3229 25356 57803 63608 51327 51897 33976 28331 30667
9972 30667 34681 28937 9110 -14540 -14680 -2587 -1839 584 -9657 -23844 -8689 -2381 8225
9959 8225 10565 12840 17153 17234 9794 -3688 9851 36865 30043 25954 14982 14670 14063 2072 14689
9944 14689 19570 33070 12017 -2089 7746 19987 8939 14603 30204 32206 28258 26915 29394
9931 29394 32589 19133 25908 18058 6990 14787 33354 24556 14711 19046 11924 23684 17911 14136
9917 14136 18296 13692 23391 6864 5985 18055 4116 15615 27453 29391 22831 10611 21515
9904 21515 41891 31361 14916 17805 15389 18181 48753 64695 36844 14682 15312 3393 12914
9891 12914 1585 2052 3324 14520 14875 6877 7208 9173 -768 -4078 12421 37017 52900 39640
9877 39640 20406 36737 49292 52557 46515 39707 13894 10439 12221 26971 57349 64321 29920
9864 29920 -3736 -1124 13818 24167 17344 4879 4418 12622 16676 10339 16590 31768 24491 17147
9850 17147 6399 16617 24365 44541 58724 34915 45194 56074 41698 26343 28397 19354
9838 19354 14018 19902 25318 23812 13066 27422 36261 54260 40108 11262 8522 -10490 6922
9825 6922 5130 -24512 -8304 7397 17591 40556 43363 33047 12386 4322 19347 8223 13898
9812 13898 28284 21846 12349 18004 25139 37376 33528 40885 41588 35833 35269 42886 37622 19698
9798 19698 26917 49477 55424 67871 66083 66754 43827 25192 10090 19934 47730 67129 62174
9785 62174 71215 57299 43924 25375 34847 32922 28138 14278 2251 -5484 -10410 2260 27678
9772 27678 36900 40282 35562 50111 59238 28391 14146 10022 3106 30305 64479 54367 46763
9759 46763 34791 18186 2049 10706 37269 60125 70648 67844 54870 46402 46318 45024 56648
9746 56648 68037 85256 75488 45431 47850 64649 53338 17351 29184 70610 68773 50034
9734 50034 50503 44480 30707 44318 40452 58069 76074 71094 76642 65617 55168 49181 57891
9721 57891 36846 29439 46427 29199 17225 46109 51888 46531 38527 30575 32710 50672 49852
9708 49852 22225 22094 35118 31160 23491 10580 21175 30584 39919 38714 50162 50298 42243 30403
9694 30403 15418 6916 11882 29035 32317 26394 36345 32367 50158 58780 77294 83356 60123
9681 60123 50944 69147 68314 55393 48172 45204 55124 76031 56612 33816 15854 44130 53293
9668 53293 48173 45823 53615 60110 77174 82549 58374 27533 13936 35352 52785 82106 75733
9655 75733 57578 33729 12667 31651 36339 23139 8989 5911 10843 17157 6910 29679 46787
9642 46787 36152 47002 46667 26034 34320 42285 53672 57907 66063 74076 65697 71968 68347 55190
9628 55190 37497 32757 15012 12044 17592 36621 55889 62758 39534 29384 36523 23799 50956
9615 50956 66633 64059 47629 64531 78020 67626 60919 51021 27091 11138 23300 40048
9603 40048 73052 74179 58553 47860 52827 48125 47331 78312 90870 73346 67651 57206 81131
9590 81131 80023 70284 69405 73025 61580 42937 33951 41176 45233 66528 52639 65306 97312
9577 97312 86196 77290 67751 57102 63910 73719 70695 52434 38219 27273 32957 47502 61566
9564 61566 70279 74961 66406 68443 68123 43814 54625 63778 75810 73108 60409 40401 23575
9551 23575 47694 55174 70419 72789 97204 88748 44021 53370 66173 39519 41989 82184 75647
9538 75647 48169 37427 41135 51394 62214 52661 54014 62706 68988 81229 75217 73480 54178
9525 54178 55947 60348 86404 104285 86967 89699 95297 88826 71559 46639 57338 73590 85873
9512 85873 88593 92859 70662 43773 51170 61578 68207 90157 85470 61085 57158 53135 42818
9499 42818 59454 61310 62640 64281 80850 90247 84724 88573 97310 74935 61024 59041 68396 76536
9485 76536 75072 66510 52403 34154 43312 58176 54970 63935 83911 80109 54499 52960 53392 42323
9471 42323 31721 40093 46330 71158 76400 76734 90178 93107 82517 69895 62653 61422 48371
9458 48371 58173 54221 42133 29029 59304 79864 85996 93719 72361 74503 91053 102633 94305
9445 94305 80835 86078 76717 65107 78138 76616 70941 73412 69322 64310 55520 49300 71283 66720
9431 66720 64778 55105 68619 69762 69220 63632 71856 75355 89055 83213 79185 64365 50546 62667
9417 62667 74985 80144 92147 94062 83938 80285 61795 77909 93039 108543 98697 82042 72005
9404 72005 56793 54815 73878 97723 105411 109167 97774 77950 76155 98295 111705 99255 80394
9391 80394 78053 104515 105521 90770 93612 88883 107862 104150 95571 104146 101035 88887 104721
9378 104721 108493 117334 128316 111708 100879 93368 78504 98355 105041 85374 63724 63914 92959
9365 92959 101999 93075 97466 103388 90287 86041 109369 115965 111211 113225 117829 118628 96544 73753
9351 73753 73989 59685 62600 68970 82084 106968 103520 113088 101069 67872 63572 78786 83992
9338 83992 98192 107412 90201 88976 90272 107358 91195 73370 79105 85000 94760 95372 95352 92373
9324 92373 76697 80885 110338 130853 147358 134800 117914 123718 125841 124842 115739 87833 90902
9311 90902 98999 111778 105850 91525 99609 106196 119018 112288 113691 103959 98390 97280 114620 129686
9297 129686 142668 117990 100018 92496 98088 115654 108542 98255 101042 111371 123797 138991
9285 138991 145994 148650 160691 153598 145132 142521 137180 125842 145492 150131 144483 154413 166813
9272 166813 147799 124568 99796 103889 110485 123448 119510 118933 142078 145067 146213 142591 132346
9259 132346 105615 65562 74590 83303 94947 113514 128041 144642 150994 142715 112462 117220 145189
9246 145189 165556 140437 143516 147749 124350 128137 149572 163190 159894 163202 118544 97025 106959
9233 106959 123878 157986 170958 158042 138784 146301 159337 163810 168753 159965 153545 152073 154053
9220 154053 150006 156311 192506 171646 174476 182036 177009 168024 165994 175609 197224 185186 197966
9207 197966 203682 184718 175830 187233 187845 186107 184411 169520 150980 156350 177251 167503 172491
9194 172491 196660 200930 176556 178852 185862 183737 183086 177596 170448 176486 189155 175278 158556
9181 158556 161882 177125 167995 158656 165587 197078 215582 204678 195952 190877 180506 198286 216486
9168 216486 230491 219572 202689 206751 220530 216910 213341 228684 245655 236338 209748 196359
9156 196359 188935 147786 157846 184072 206155 226200 235461 241241 228521 212413 186231 190381
9144 190381 212507 237958 245986 243032 256892 273458 275101 244965 241226 241323 254448 262716 272326
9131 272326 285578 268293 287705 287932 262112 262722 270432 279785 275820 279728 301245 302187 278076 265583
9117 265583 258017 257418 257793 262301 265624 260105 259455 277070 277634 292961 318978 302637 268920 257300
9103 257300 260442 271434 290474 265608 265134 292854 311997 324778 301536 284856 292839 284581 285427
9090 285427 289192 297670 298279 318227 340784 322834 317149 333993 365262 357212 310187 325401 347409
9077 347409 369504 372713 361662 343259 343779 357825 376369 372325 372224 375077 376048 388701 397716 402445
9063 402445 391265 415100 390096 358446 374544 400547 425841 428230 403597 402701 398234 412194
9051 412194 424694 425880 422949 417646 402019 402011 397513 396964 398007 418481 449377 463641 476937 488411
9037 488411 481933 491361 499653 494630 468782 445282 454526 463185 446970 453080 437519 415012 435502
9024 435502 435438 447636 463111 476016 467857 505860 550876 572612 563241 533886 528069 546172 534212
9011 534212 547658 541362 564520 562250 570882 570534 556207 561680 568275 566391 557617 558969 602851 634732
8997 634732 629299 624739 608067 628965 651452 644919 671559 672245 670900 672076 678963 680019 693332
8984 693332 709308 714589 712013 694395 705736 737625 743672 701818 699645 709463 711561 731660 762536
8971 762536 792962 815360 799009 788247 802410 829859 860305 861288 852707 841714 831173 833515
8959 833515 832045 837855 848810 882598 909920 933225 932838 917908 917521 928326 935112 942937 959541
8946 959541 964636 980652 1007718 1040055 1042590 1024443 1041218 1056702 1078916 1129814 1135184 1126780
8934 1126780 1116809 1127076 1140317 1158598 1183068 1197857 1232777 1268491 1285407 1276545 1286753 1293340
8922 1293340 1307966 1319846 1360185 1401528 1419980 1420593 1416257 1436483 1475462 1499011 1514647 1538964
8910 1538964 1573285 1592888 1613676 1624979 1635810 1644491 1662317 1675370 1698014 1729884 1770634 1798225
8898 1798225 1808041 1826334 1833051 1886396 1934575 1970368 1993743 2016154 2062511 2110453 2136841 2156741
8886 2156741 2169262 2206281 2252423 2310594 2337395 2361430 2390298 2399311 2456477 2513933 2560998 2585615
8874 2585615 2613558 2652733 2676478 2728148 2773713 2833742 2910894 2968853 3024814 3068030 3107792
8863 3107792 3166236 3248135 3317395 3358524 3407984 3470515 3530585 3580936 3646303 3728716 3783394
8852 3783394 3866656 3934409 3971296 4016852 4088741 4172951 4263254 4341578 4427247 4472336 4557015
8841 4557015 4658450 4716895 4808792 4907331 5005737 5073100 5147426 5239054 5328389 5417298 5510657
8830 5510657 5600533 5708921 5788839 5878039 5933841 6026849 6144568 6236284 6330024 6409868 6487185
8819 6487185 6569673 6673710 6760330 6840523 6932150 7029272 7113266 7200597 7271458 7342588 7415125
8808 7415125 7476152 7536116 7572326 7636246 7711891 7736879 7770072 7822040 7862844 7902219 7928459
8797 7928459 7943322 7965927 7964062 7950984 7939424 7924331 7920710 7931078 7917368 7884675 7848611 7805658
8785 7805658 7749422 7713206 7651962 7622826 7592339 7528028 7444939 7380673 7308155 7230693 7164367
8774 7164367 7088598 7012108 6954465 6858971 6749127 6633435 6534781 6437028 6348203 6283189 6192868
8763 6192868 6098764 6015508 5921837 5829587 5720638 5623213 5559828 5503672 5431105 5328603 5222308
8752 5222308 5118497 5048185 4968188 4897700 4819218 4722158 4614689 4520516 4433889 4362358 4280196
8741 4280196 4202702 4109515 4028646 3958445 3879715 3838252 3771723 3700182 3646155 3578801 3512759
8730 3512759 3452333 3380490 3330597 3281822 3234385 3187402 3146590 3098564 3045484 2989878 2935427
8719 2935427 2882390 2851391 2781743 2709129 2671498 2624665 2562621 2530717 2510195 2470457 2439700
8708 2439700 2408336 2358378 2319152 2281200 2217208 2159698 2129596 2104663 2079504 2079916 2061017 2028231
8696 2028231 1986816 1935988 1892890 1833374 1784205 1762197 1767502 1740164 1693326 1664875 1665256 1632709
8684 1632709 1600095 1579504 1595811 1583766 1546816 1522913 1502492 1477044 1474021 1430996 1394596 1396670
8672 1396670 1402486 1371562 1348279 1321249 1284279 1263055 1268446 1258771 1245533 1225442 1229690 1236420
8660 1236420 1204007 1170770 1136340 1102262 1081554 1083852 1092702 1093040 1068787 1034124 1016695 1022130
8648 1022130 1026233 1010311 981580 965357 951756 958898 960136 954154 955348 939867 920939 910614
8636 910614 887045 883364 874261 864263 852155 841280 841467 812444 793135 816971 806468 804836 784034
8623 784034 770210 768108 750947 757825 753237 729493 735346 747476 710611 698384 683045 640980
8611 640980 648954 665057 674400 686872 681487 672333 667296 655642 652122 651109 643353 641623 639081 634834
8597 634834 626347 626306 631373 614504 584764 586023 592029 591126 589299 591053 589765 570142 563177 563026 567061
8582 567061 568668 578529 571080 549786 536715 525918 529223 500381 492224 492271 478135 475064 459801
8569 459801 459488 445573 450736 443953 417190 427545 426911 422343 428573 419327 406305 396664 420245 419175
8555 419175 388400 374013 375173 365812 391568 411816 410975 388041 378571 377790 375717 381729 352320
8542 352320 334110 354312 362777 341814 317014 320617 342041 345292 332398 317856 322393 331036 347868
8529 347868 337821 337098 329694 360380 367631 346408 320638 317421 326996 331176 323389 313792 320671 335250
8515 335250 331824 318899 304024 310129 319728 325888 342508 357802 360736 352752 358008 355620 365086
8502 365086 380441 388070 396034 406817 377049 359107 347865 304505 286717 303136 290239 280831
8490 280831 267725 251353 250808 261390 281190 278402 246304 248653 262857 254493 243240 227113 242554
8477 242554 246379 267065 261520 250258 252092 274062 287249 281343 258751 252602 250849 241934 243563
8464 243563 264672 268868 280875 331024 353041 362356 332132 302317 288562 265428 231963 216075
8452 216075 219784 214363 200938 199704 184203 167476 147776 158900 194248 190083 187230 167619 184154
8439 184154 213296 177514 156731 164027 161813 164707 189002 202281 214487 199950 187832 177966
8427 177966 164579 178655 173134 157686 137760 117827 135140 169722 219570 264560 280210 272993
8415 272993 246590 230985 212520 191371 191913 211320 185714 156431 142864 117832 120625 134017
8403 134017 120285 113752 115210 119959 106765 107164 142398 163531 135415 126192 165823 180545 179476
8390 179476 178134 142568 131361 120897 120026 117597 138424 148509 157291 163765 171805 170850 173125 151141
8376 151141 149997 149052 147412 166440 192260 196170 182386 178480 216332 246835 231620 211467 193284
8363 193284 180281 149729 110306 120509 125260 152179 165161 155867 129053 150730 151177 141421 141460
8350 141460 158521 128137 101844 97705 96777 108722 96208 86389 87978 111929 132107 110654 93124
8337 93124 92931 93672 122312 136988 121562 133882 150298 172918 176806 165563 180188 203955 227468
8324 227468 216655 185508 165112 149807 161617 136008 108303 103846 126619 104361 89667 86732
8312 86732 93458 106635 99566 85187 81477 60430 81242 63361 43426 65434 78782 80448 96404
8299 96404 83532 70530 76343 77954 74565 103410 95012 53276 57955 55834 68288 61669 65227
8286 65227 103162 139773 132890 96170 90049 84608 60953 53114 48820 50498 54470 46130 50961 68415
8272 68415 55014 30290 53113 68860 74879 90241 109801 99972 88859 94371 103852 98156 80153
8259 80153 56472 54245 31245 29115 44434 53813 66053 90306 102589 108021 80909 34607 28096
8246 28096 9182 6965 49566 75614 67058 52403 59023 70726 79669 66435 52385 53867 42434
8233 42434 44489 59031 55378 34371 13769 22203 25952 41086 40719 51677 85711 86266 82388 67967
8219 67967 46584 42582 41547 31272 36527 27626 -2526 3322 36910 56449 73478 82781 62188
8206 62188 56489 48219 59169 73939 59357 26174 13318 8539 33882 48044 68890 60490 51923
8193 51923 44375 32869 35537 25980 19065 26188 28753 38281 59116 51947 29122 19312 20515 15057
8179 15057 27789 21221 2926 16834 27658 31651 58853 37223 21490 27709 37973 51310
8167 51310 61689 49325 37832 65941 60738 44185 30537 26444 42220 49924 45952 39055 30070
8154 30070 41694 49148 49358 50889 68371 67541 69292 89775 84322 75410 70893 65695 56921 54496
8140 54496 31424 3757 6319 10864 46047 64735 51951 24171 14962 30885 34321 33262 33181
8127 33181 31351 53691 59731 51278 60914 60687 45060 31384 19059 12646 11180 13170 23692 41166
8113 41166 26796 13362 14085 20935 23864 -1590 -16002 -4947 22057 7811 12820 20850 35952
8100 35952 33463 33983 49207 52030 44700 71351 55936 52966 51056 39578 48053 29633 7168
8087 7168 22098 35574 31409 29265 17209 19612 24096 30231 29927 40132 54393 67482 55315
8074 55315 46592 41094 27546 34151 61146 43499 40712 54040 38786 27202 44642 54386 40378
8061 40378 33763 32528 28137 19042 30870 31512 43532 47333 38753 47397 51141 25060 5587 -2939
8047 -2939 11308 15608 25654 40686 32005 45522 30851 19578 21450 44261 38516 24785 51294
8034 51294 51597 28134 22737 39305 35995 26880 15886 29048 13625 -7623 7156 3148 18851
8021 18851 39818 57086 58476 71630 92373 64723 35042 42583 31599 37340 50117 56757 44151
8008 44151 28585 32667 33462 52631 47036 53605 71943 68441 69712 57255 51893 78109 59289
7995 59289 59772 61056 66984 75056 81351 99285 81834 28273 5383 37731 60333 60123 58491 45876
7981 45876 40787 39506 18440 7175 20406 957 -18476 -10392 20471 37703 47168 27617 24116
7968 24116 15997 26018 17030 19508 21585 14795 25222 32141 52478 70265 52285 48569 41353
7955 41353 26284 24981 9796 -2837 3632 38461 59126 77007 77388 82142 54189 53781 73572
7942 73572 65783 57685 39870 52783 61014 33096 30231 31820 43988 44587 28720 16448 29187
7929 29187 33003 53234 61700 34374 21134 24551 12605 9713 13967 27519 27137 19285 11876 20095
7915 20095 23533 42322 40866 16486 -9493 -8375 -1088 4915 -1658 26384 38043 46299 46452 21192
7901 21192 -8249 -19506 24695 54992 70977 71953 64834 34169 28780 46347 47270 38226 47027
7888 47027 39025 40074 42509 28018 9781 4470 1792 16894 45194 54405 59369 27058 -4574
7875 -4574 -8344 -5068 -6880 17876 46076 55985 39080 22700 43529 65165 56096 52362 31650
7862 31650 5962 8009 20178 -1254 -29091 -19283 21106 34240 32999 26191 12642 14712 16363
7849 16363 8993 13425 16267 25435 2671 -8966 5720 10277 17474 12032 11649 9903 9873 13209 9209
7834 9209 3611 1428 -9082 14612 17462 -7204 -17464 -4505 8523 -3963 5647 13113 8328
7821 8328 -3489 -21239 -20727 -18325 -30052 -26660 -38863 -38637 -34490 -10799 14685 52947 29701
7808 29701 17586 3463 -5548 3630 -1473 3783 -9954 -21107 17674 39335 38457 5371 -20087
7795 -20087 -28791 -16341 12952 26494 15297 6579 13841 29122 12991 -4795 -13825 11923 3195
7782 3195 -8056 152 -14826 -25463 -23049 -17836 7915 25500 10917 20151 12808 -13922 -18231
7769 -18231 -8550 6654 -4454 3726 -9745 -8900 13647 17181 -3925 -13988 -556 6613 11016
7756 11016 1777 -23486 -26580 2 10685 14490 11313 -8577 -25103 -18517 10337 14134 65
7743 65 5733 24038 48571 50811 16295 7189 18628 16551 18036 28176 25856 9039 -7300 2442
7729 2442 6220 2892 -3257 -15761 -25956 -33135 -15225 7877 6053 -23537 -7457 -12935 -30242
7716 -30242 -9187 -20260 -35600 -16131 5808 -3067 -7496 -2048 2876 8985 6944 12511 12728 11368
7702 11368 4360 5247 8018 30381 19513 -1942 6025 4925 12066 22585 9551 -2488 13845
7689 13845 19676 33007 33139 3719 -2417 1769 8134 -451 -12389 -6326 864 2990 -13786 -32737
7675 -32737 -39190 -33882 -40542 -32040 -28503 -15839 -502 -8008 -26853 -19324 -761 23013 16047
7662 16047 12018 15266 -1415 -32502 -22987 -17626 -33848 -37207 -18975 -18966 -9751 7080 9485 18058
7648 18058 25808 15273 19873 25999 29657 23007 -3367 -19826 -21720 -28041 -38294 -32013 -37207 -6335
7634 -6335 -29611 -56782 -59947 -47023 -34425 -15861 -25545 -7307 -7045 -28407 -35237 -28968 -7221
7621 -7221 17770 41459 44259 19891 1734 -25372 -25916 -10701 -17868 -38828 -44847 -41761 -16368
7608 -16368 1725 14905 -2766 -18628 -22318 -26055 -26120 -21484 -33407 -52502 -33558 -55054 -43269
7595 -43269 -12571 -24718 -39666 -53582 -24280 -28793 -39089 -28048 -25071 -40100 -70966 -65634
7583 -65634 -45494 -26828 -33057 -32678 -18178 -26104 -25935 -22915 -22721 -21850 4447 24932 39691 31477
7569 31477 13075 642 -1839 -6950 -18610 -15927 -8493 16236 23721 30263 48843 46464 9072
7556 9072 -23769 -45907 -43245 -31724 -36048 -20043 -19504 -46073 -58146 -28473 -11629 732 6104
7543 6104 -7515 -20949 -17070 -1153 17150 18807 27436 18986 -21601 -47699 -32545 -9940 6021
7530 6021 10934 17933 -1630 -12765 -9745 12248 19812 15947 18121 18994 3891 -11546 -11580 209
7516 209 31834 23902 -15406 -31374 -42293 -21937 -24139 -15472 2885 -10544 -12294 4257 22863
7503 22863 7792 -16451 -3819 10939 17710 11499 -4529 -22965 -29866 -27613 -25261 -33051 -30095
7490 -30095 -26927 -15374 -18977 -21984 -28549 -5590 24446 35380 28656 18805 4616 -2687 -40
7477 -40 -1452 301 -6325 -10533 -15668 -24984 -7634 -22321 -26020 -8851 10868 10295 1834 -22307
7463 -22307 -22574 -27206 -35066 -31644 -46570 -47491 -44955 -45346 -18989 6474 21886 27188 37001 33047
7449 33047 13731 9136 -4622 -15147 2329 -9054 -26827 -10902 -8732 -16158 -9196 -17688 -26817
7436 -26817 -14173 -4532 29647 19110 -19857 -13085 6572 16785 6502 -9190 -11383 -12314 -46600
7423 -46600 -49992 -16416 2583 6757 9962 17896 12968 17208 4333 20048 18319 11006 -5522
7410 -5522 -2174 12740 28000 31625 38895 39780 24479 2484 -6742 17460 34213 23162 4817
7397 4817 -11653 -22234 -33354 -23622 -14277 -14597 2334 15393 16513 2789 -8542 -25132 -38884
7384 -38884 -42840 -58066 -77590 -86354 -75585 -47093 -6573 -10976 -12946 -25230 -34727 -41577 -49941
7371 -49941 -44764 -35706 -21746 -29304 -25085 -5936 -22882 -10154 3591 249 3446 18601 980
7358 980 -24315 -40446 -40174 -26235 -6617 8164 37978 27330 -7616 -14166 -14424 -16152 -24288 -35741
7344 -35741 -40861 -38299 -38962 -37549 -34349 -29626 -30526 -19568 -14619 -11432 -28141 -53991 -44551 -16457
7330 -16457 8086 20880 22460 16277 10275 8630 3442 10605 2763 -490 12902 6761 11831 29201
7316 29201 22075 -7669 -25276 -19570 8959 25308 27967 23455 4378 -10959 -11039 -10294 -7618 14426
7302 14426 -1625 4851 13904 17459 31231 5124 -29631 -21369 -18737 -28790 -33584 -27391 -31858
7289 -31858 -44850 -36357 -37912 -35709 -47440 -31227 -12265 -15091 -5486 -2206 -10920 6141 8937
7276 8937 -22721 -35150 -12955 7435 4013 5137 -7760 -23127 -1638 10460 -2782 -16376
7264 -16376 -12615 -1417 -4415 4003 30476 25266 6046 -16992 1279 107 -20077 -15544 6590
7251 6590 10064 13717 5319 10123 7736 5820 -2602 -23057 -31390 -27767 -27271 -57225 -41006 -11232
7237 -11232 -4521 1668 13335 15081 1613 -12798 -36237 -40288 -26566 -33293 -44624 -40819 -22986
7224 -22986 2438 7683 12399 -14 4886 -6932 -18747 -24315 -17476 -17255 -21516 -19642 -8516 327
7210 327 5698 12071 3689 7180 4910 -6728 -2820 -8425 -7193 3759 28218 28114 -5673 -27211
7196 -27211 -24091 -23205 -2244 -213 -26839 -17159 -9459 1144 5283 2703 13833 18494 15310 23302
7182 23302 16373 588 -15623 -10758 5195 -7184 -15617 5277 -14749 -38010 -19178 9450
7170 9450 -2858 -24909 -34409 -55409 -67342 -71542 -84184 -41220 -21007 -11471 -9404 -21368 -5
7157 -5 5851 11582 5045 -4074 -7539 -33619 -35443 -18445 -14060 -14552 8 22692 23847 20507 22177
7142 22177 -1964 -11574 -10244 -39277 -64416 -65112 -33909 -26307 -31153 -44711 -38921 -41526 -49001 -48099
7128 -48099 -70255 -91359 -87678 -75806 -62489 -66589 -39574 -24280 -21685 -9470 -748 -276 -13534
7115 -13534 -28159 -37886 -47519 -64302 -37446 -14190 -34005 -36415 -41230 -42377 -34709 -29909 -27478
7102 -27478 -20451 -18048 -20348 -24997 -16258 -14558 -40419 -14850 -2650 -7824 -3154 -1048 -564 -10715
7088 -10715 -12239 -1926 10979 15396 8160 -4289 -27561 -10591 14982 4482 5009 -29670 -53844
7075 -53844 -41579 -24617 -42065 -54152 -43348 -33335 -8655 -9137 -29108 -29469 -31006 -33893 -26957
7062 -26957 -30745 -31787 -11872 -3408 -4661 -3096 -10338 1778 1674 6472 -10587 -41680 -43791 -21103
7048 -21103 -15261 11505 4138 -38705 -41624 -27759 -8885 -452 12948 2609 -7472 923 2865
7035 2865 6621 -10613 -7799 -5864 -24478 -34164 -37523 -22947 -17850 -25172 -27940 -35710 -43331 -48838
7021 -48838 -34813 -16993 -7713 -3633 -25979 -22789 -5885 -20700 -13971 -9844 1603 4605 -5916
7008 -5916 -9955 -11605 -20521 -5851 4570 -15613 -48524 -62782 -46781 -4735 33 -11285 -5294
6995 -5294 -4344 -9828 -7860 -12725 -37810 -56525 -42596 -28031 -13112 -22920 -35498 -13018 -8523
6982 -8523 -19263 -24877 -30659 -34244 -36106 -7879 25788 26598 13034 -1763 -5170 -10952 -8619 -22261
6968 -22261 -22310 -6791 -919 -14516 -8943 -7868 -28295 -3230 1156 5099 9854 13942 11144 2417
6954 2417 -17552 -10617 -15899 -4354 14542 -2327 -31096 -41815 -36498 -30229 -43450 -51138 -46674
6941 -46674 -46691 -47000 -54784 -40236 -11804 -5634 6372 29386 18731 19374 12429 16647 44492 56996
6927 56996 58834 46266 -1147 -19454 -3657 -12032 5749 -4955 -15889 -9086 -7229 -8295 5829
6914 5829 -14626 -20992 -5659 -6846 -19405 -22116 -15227 -26320 -17308 -94 -2811 -3974 -973 -3905
6900 -3905 -2494 -18326 -9303 -3337 -797 -2968 -9858 3048 13479 -10316 -15619 9895 8972 6020
6886 6020 -6932 -7380 15236 39060 43329 35213 22852 23005 8258 3360 -17753 -15249 -3321 -2420
6872 -2420 -2315 26380 15127 -17460 -6950 1184 -3957 4036 27292 21402 -5981 -29344 -33163
6859 -33163 -28199 -15673 -13280 3156 -2092 -9570 -22779 -12043 2311 10214 8519 10651 9517
6846 9517 -16905 -40827 -56662 -52449 -48596 -30113 -9219 -28253 -41551 -40689 -39736 -17252 -2308
6833 -2308 -3513 -36745 -47420 -39058 -28515 -26230 -37776 -37698 -50483 -46807 -57206 -47543 -31304 -31399
6819 -31399 -44676 -25699 -26042 -31101 -38284 -38088 -23000 -21545 -37354 -29157 -23992 -15152 -26527 -49417
6805 -49417 -60228 -47492 -32532 -5132 -3714 -14032 -16152 7119 26846 3491 -7844 12504
6793 12504 20815 30842 36096 31566 40699 34255 11695 1870 -2158 1901 5320 8515 13218 828
6779 828 -2092 -10245 -7782 -9404 -9123 -7777 -11902 -5852 -19369 -24582 -3853 -30885 -43411 -23510
6765 -23510 -26401 -32037 -51780 -62112 -68045 -52417 -54273 -73790 -82123 -75631 -75873 -73316 -22434 -11115
6751 -11115 -14884 -12450 -21186 -30883 -1509 -15311 -18427 10669 -14353 -25175 -14525 9671 20622
6738 20622 12567 3332 -10323 -7271 2612 6324 4676 2724 15156 -4555 -14746 -8926 -11168 -18678
6724 -18678 -27910 -28678 -16712 -21593 1283 23652 27279 8924 5902 36033 52842 49175 15547
6711 15547 20441 14376 3570 1294 -19527 -29470 -30705 -37522 -17700 -9735 -1468 -13501 -3579 1266
6697 1266 -11311 -17794 -25793 -30511 -29473 -24516 -43938 -66540 -51849 -31190 -31504 -13226 -23295
6684 -23295 -25040 -26630 -32984 -27235 -34862 -34936 -13039 6904 1956 -2267 -10020 -29623 -35964 -27367
6670 -27367 5948 6435 -12803 -28809 -7989 -11585 -4873 4123 3026 -10225 -27195 -39224 -48644
6657 -48644 -37886 -35741 -50789 -38412 -764 2441 7339 10639 -31742 -33784 -37117 -50188 -17609
6644 -17609 -12898 -23432 -18490 433 -2241 -28547 -19824 13916 38295 22783 13295 25776 6574
6631 6574 -12790 -14751 4037 21498 22478 5601 -21750 -32344 -12840 -10137 -9533 -19986 -3218
6618 -3218 9483 7470 -5966 -18020 -11922 -10694 -33754 -22497 13473 18879 1332 -9583 -571
6605 -571 2589 28954 37527 40813 16757 -4875 -29969 -26447 -19717 -25727 -37871 -21389 -3361
6592 -3361 -17194 -43479 -37829 -32984 -37096 -24148 -9928 -17288 -35065 -30138 -7381 -6200 -23329
6579 -23329 -38290 -55700 -59104 -44754 -25680 -1289 -1174 -4106 1874 -13871 -21008 2968 18420
6566 18420 24442 23905 -1243 -19294 -5873 1588 -13943 -15225 -9965 -31167 -56156 -53978 -48502
6553 -48502 -47145 -38445 -27538 -16929 -6343 -8148 -22336 -12062 -12546 -12683 -25943 -38701 -51488
6540 -51488 -53862 -25704 -9059 -27956 -27029 -14580 -4587 1969 -213 -13036 -41203 -33210 -17407
6527 -17407 -19231 -14866 -2016 -3216 3384 18207 12704 9888 7800 -6548 1516 -7204 -8138 -7123
6513 -7123 8246 10521 -9352 -18471 -31449 -29251 -16782 -27183 -33043 -24223 -256 33726 33436
6500 33436 26100 15743 13800 1445 7715 -10466 -3262 9190 -2270 -13383 -39863 -49271 -51312
6487 -51312 -64810 -34087 -4742 -6004 -10782 10996 29822 33141 30000 18352 12333 13249 2031
6474 2031 -27966 -29441 -6314 5867 18762 20542 -808 -25546 -13842 1952 27536 21144 25293
6461 25293 9762 -14462 -8874 -7130 -15042 -2134 9342 12300 20653 -7694 -43135 -25169 -10091
6448 -10091 13305 26223 34836 16311 12006 -2511 -11986 -16223 -14212 -19672 -21068 -31726 -39080
6435 -39080 -50109 -51053 -52818 -42124 -28841 -34760 -41059 -36176 -46371 -32126 -20819 -48334 -66499
6422 -66499 -62208 -48027 -48401 -31162 -9885 -13553 -36853 -26226 -16763 -29433 -40402 -26722 -17260
6409 -17260 -30488 -20641 -9584 -9542 5934 6013 -16754 -16333 -30287 -39422 -38984 -24480 -13014 1602
6395 1602 -4454 -1500 5743 7426 -25646 -38519 -41076 -41823 -29620 4313 -5871 -11139 -1099 3550
6381 3550 -750 -10742 -21828 -28088 -26516 -26481 -24096 -34288 -27241 -4295 -6073 -40286 -41678 -15406
6367 -15406 -6644 -19266 -11266 -15606 -4056 7930 -11944 7149 18413 3082 -12040 -6985 -13690
6354 -13690 14268 20155 -2108 5183 2984 -22907 -58457 -35107 2456 3077 -12295 -9097 11497
6341 11497 19925 11945 -21677 -30561 -12237 5420 -3534 -1378 8264 16098 -554 -11 -3257 -15797
6327 -15797 -1289 -944 -14692 -31902 -35622 -14308 12396 -668 -5774 3231 2959 -3012 -13820
6314 -13820 -27958 -38828 -40818 -19738 1301 958 -7743 -12143 -27134 -50069 -69597 -63416 -45982
6301 -45982 -14908 12407 24770 13574 -5039 -27835 -23508 -4060 -18008 -1930 15537 2749
6289 2749 -21355 -15124 -14035 -22501 -21650 4327 5304 1550 4282 8483 1127 -21640 -36947 -36975 -54916
6274 -54916 -45056 -42215 -28092 -13247 -5802 -25063 -29301 -29277 -41099 -33604 -4914 4680 3739 9934
6260 9934 -855 -19343 -1961 -3405 -17184 -26086 -26623 -3795 2006 -147 -17292 -25195 -9798
6247 -9798 6824 -2097 -8719 -4297 35558 26800 -4158 23441 21409 -25811 -49433 -46750 -30535
6234 -30535 -20913 -19930 -10498 -1461 -5869 -26394 -29378 -2165 1681 -33561 -50537 -39277 -19864
6221 -19864 -9485 -12969 -6080 -8843 14124 26918 15321 -636 -29319 -43478 -17206 -18721 -18489
6208 -18489 -4802 13955 16789 12695 28334 27163 18651 -17939 -34445 -28387 -30587 -19660 -12776
6195 -12776 -6215 1856 12218 -4850 -30318 -50651 -34316 -10902 -5628 -24274 -16732 -21042 -28914
6182 -28914 -36855 -27435 -28213 -4878 17137 16922 -2919 -4837 -11987 -15981 87 -8044 -7056 -14429
6168 -14429 -9823 -1119 15393 26350 29478 19517 -889 -22057 -8740 -8421 -4479 -4176 -32913 -38414
6154 -38414 -23277 -26766 -24410 -25684 -9790 26381 29399 11015 -5637 -1507 -1534 -8567 5760 14793
6140 14793 9285 -6014 -10158 -18138 -19046 -37083 -45759 -48918 -36779 -38257 -44307 -43379 -23939 -15491
6126 -15491 5716 967 -22007 -16429 -8053 -24095 -13576 -6115 -13016 -40331 -37437 -37972 -27889
6113 -27889 -17354 -8088 11654 238 -14530 -19406 -4513 4711 -6951 7276 35246 49713
6101 49713 26077 11314 13557 15651 19138 10897 -741 -24623 -30416 -1606 19433 -491 -12707
6088 -12707 -7352 -7235 -22315 -29353 -10141 14626 26647 27603 4405 16261 4894 -8167 -16337
6075 -16337 -15944 -26490 -38796 -52267 -36446 -13626 -23502 -21787 -27319 -15100 -6413 -22013 -28334
6062 -28334 -34802 -36776 -19585 -42234 -41668 -32112 -21890 1556 2621 -3489 -8980 -1930 9571 18300
6048 18300 11360 11938 8936 -25695 -32772 -25681 -55508 -59278 -46909 -44929 -56005 -35247 -22483
6035 -22483 -31765 -21989 -8541 5911 -5541 -7587 -13782 -8569 -18184 -40358 -37936 -31781 -30649 -24178
6021 -24178 -4525 -25231 -45456 -59648 -54966 -20700 9481 6023 1117 -20614 -32764 -38206 -38988
6008 -38988 -43263 -41235 -35448 -33951 -29361 -40806 -6462 6500 5609 2126 -14696 -2860 -4782 8650
5994 8650 -2002 -19646 -16264 -8778 11175 854 9605 27362 13212 -7857 -36689 -42534 -34354
5981 -34354 -39158 -30172 -24278 -17109 7487 -8783 -21055 2317 9536 8292 24638 20374 21548
5968 21548 4009 -10956 3251 8294 33908 21550 -1803 -2920 1832 -3806 -23863 -35138 -40344
5955 -40344 -34516 -29778 -19408 -15962 -26710 -24960 -11794 4520 23576 24613 -8155 -19194 -21599
5942 -21599 -25830 3050 21300 28260 988 -25706 -14899 -5000 -10959 -11575 -13654 5381 -537
5929 -537 9664 13081 11475 -10072 -17128 -13475 11787 26258 16161 -1323 -10148 -22095 -35688
5916 -35688 -50448 -43568 -15770 -8829 -22975 -50715 -45786 -23795 -18117 -17120 -20562 -23375 -16957 -15730
5902 -15730 -1468 21033 -9110 -36761 -41741 -60137 -64705 -71441 -74544 -61251 -44799 -3360 -20206
5889 -20206 -37071 -43505 -53770 -62356 -44094 2439 27746 -1337 -7377 -15944 -33685 -49259 -48998
5876 -48998 -62311 -69376 -44124 -34952 -26652 3867 14193 11416 7771 5486 -7928 -15479 -19623
5863 -19623 -29912 -36809 -32386 -37998 -19041 -4088 -20494 -28446 -15613 -22012 -42177 -44671 -27715
5850 -27715 -13013 -4790 -14990 -24783 -22110 -3701 26421 24360 29360 15047 1013 -27439 -44352
5837 -44352 -26032 331 2990 -8838 3002 12052 8499 4229 10093 10972 7983 21592 35618
5824 35618 20507 12504 -4165 -30824 -42261 -44058 -23486 8452 15183 -15830 -23287 -32113 -47229
5811 -47229 -23469 -13615 -6012 -29993 -12507 -8974 -4064 12992 11510 -13865 -23446 -19363 -2679
5798 -2679 15728 -14271 -23247 1345 -3155 4324 4978 -2200 -25904 -41844 -32355 -25784 -11040 -2980
5784 -2980 10069 -5731 -19627 -33653 -47043 -34789 -21204 -15300 -20817 -32501 -26219 -14734 4449
5771 4449 19656 5123 10341 1244 -17252 -29754 -17513 -23255 -40159 -46384 -28934 -35700 -24618
5758 -24618 3213 16554 5580 2491 -1132 -13583 -11744 8302 7887 981 10892 -38 -10951
5745 -10951 -11630 9215 33499 26707 15650 8650 2949 -16103 -4290 -1718 -12524 -5904 -18149
5732 -18149 -18588 -5379 6193 4270 7910 5564 9261 -9025 -29402 -15653 -22797 -10712 338
5719 338 2760 -4434 -37589 -35060 -8615 19343 11972 10760 4200 -23323 -26912 -10020 6919 5279
5705 5279 3777 14027 13898 3778 1023 7875 24798 17956 -9299 -24264 -35879 -56070 -44425
5692 -44425 -22494 -8503 -23630 -14247 719 165 -24480 -29530 -7053 -14031 11256 25798 37546
5679 37546 14474 -6410 -17176 7101 26380 799 -9915 10253 -253 -28839 -25969 -34167
5667 -34167 -38470 -43289 -59522 -47237 -54700 -40249 -30742 -13785 -23936 -20748 -30991 -28350 -20085
5654 -20085 -29005 -13162 -7263 -14682 -600 18300 25049 29291 36856 30271 27811 18404 9124 4121
5640 4121 8356 2490 -23760 -15886 -20299 -31108 -24160 -6268 7624 -6771 6222 21035 16000
5627 16000 -3335 6043 -14738 -9750 -17467 -1238 14353 31670 15082 -1480 26800 36465 13182
5614 13182 19901 38131 27037 12360 -3708 -14154 -11224 320 -1675 -20078 -22614 -8200 6631
5601 6631 -7568 10289 28959 12465 7291 13993 29772 2450 -15468 -6820 -17288 -15430 -1311
5588 -1311 19360 23248 7892 -4192 -11680 3380 -9906 -2288 16149 11792 -12277 -33358 -11461
5575 -11461 11713 11134 15214 -770 -16982 -29748 -29376 -37490 -22304 -19778 8567 22893 1939
5562 1939 -4455 -5630 -11770 9300 10484 -4755 -5127 -17632 -16697 -404 3601 -6077 -26139 -10960
5548 -10960 6129 -12090 -4556 -9700 -39508 -31799 -15797 -21795 1424 21993 14006 7429 2480
5535 2480 4180 24190 32987 -3370 -8379 16278 1311 -23309 -20861 -754 -12099 -22732 -12849
5522 -12849 -18260 -12046 -794 1534 6666 -3362 -16436 -16955 -11346 -9094 -8017 -1895 17213 -16519
5508 -16519 -31536 -31237 -11541 6626 8575 19037 33401 48888 27787 14564 13792 -24861 -35642
5495 -35642 -39431 -47458 -46324 -26997 -30754 -13798 -13281 -25855 -26859 -9234 21338 33982 17667
5482 17667 -6332 -9087 4876 -6315 -24976 -10116 -5274 -288 4525 4436 -5170 -6838 -30855 -20178
5468 -20178 -30051 -40414 -21406 -8856 -17925 -19044 -34541 -36883 -16571 13144 16816 -8151 -13028
5455 -13028 -31430 -29128 -22149 -46748 -49051 -48054 -41825 -31381 -11911 -8140 -7988 10716 21200 16521
5441 16521 -10434 -16103 -9536 -13655 -13048 -9493 -5752 1788 -25793 -17251 -20540 -22031 11149 24229
5427 24229 28845 7040 4195 -3643 -15113 -15161 -14041 -8750 -15303 -15298 -11607 15657 26357 40431 21283
5412 21283 -9880 -48439 -47574 -458 11365 -15538 -50472 -57255 -33464 -21396 -11980 8920 26878
5399 26878 10774 -19521 1510 20338 22179 6238 1419 -10031 -42776 -48247 -28377 -34072 -48189
5386 -48189 -40262 -40853 -28994 -2272 1764 33001 37683 7752 -12565 -20373 -35457 -30852 -8061
5373 -8061 -2577 -23774 -28171 -17514 -20201 -49710 -46109 -30620 -47571 -36709 -30783 -17045 -12651
5360 -12651 -6985 10546 -9747 -26504 -48572 -54211 -20631 -34940 -15143 15719 5280 -9813
5348 -9813 -14339 -31812 -51662 -39649 -24526 -25627 -17090 -32478 -25694 -6686 -21694 -14885 -8076
5335 -8076 5496 5711 15857 12069 7685 886 7714 11947 -3467 6521 -4894 -8329 15656 32937
5321 32937 13849 3678 -4932 5255 14561 18351 22881 4719 -32096 -18933 -21424 -42835 -48071
5308 -48071 -38415 -33503 -36668 -36272 -40294 -48186 -39079 -30686 -23131 -25109 -19425 2735 18755 -6889
5294 -6889 -15207 -30017 -42826 -58114 -43924 -18521 -10772 -7370 -16609 -2347 -21415 -23007 -25191
5281 -25191 -9535 -6214 8036 4159 -3216 8459 -11336 -24923 -34218 -33277 -6943 35024 23219
5268 23219 6895 25260 31051 34796 16229 4199 7372 21701 -3343 -18552 -12238 -12067 -7249
5255 -7249 -570 -5636 -8818 -3161 -21241 -23673 -36591 -24500 -5236 -10348 -10368 5272 24873 24924
5241 24924 2233 -963 -8535 2563 33667 34684 24195 8010 -1079 -6969 -509 7123 6043
5228 6043 -9169 -4842 -5144 -16768 -13253 -3382 -14772 -21551 4885 5403 -2305 -8128 -16321 -30374
5214 -30374 -41477 -39890 -8189 -9765 -3283 -5776 -19128 -23814 -23956 -32054 -27492 -19758 -21954 -15576
5200 -15576 -29646 -42477 -18328 -10262 -4083 6178 947 -21423 -18363 -33062 -50414 -52792 -15147
5187 -15147 -3546 -3375 -16114 -22346 -5115 11791 11738 5448 -4779 -14696 -15172 -21036 -25805 -47685
5173 -47685 -43018 -18651 -19813 -9275 -16175 -6225 13933 37443 30310 1382 -12654 -11738 -9676
5160 -9676 -9096 -2509 -5306 -15193 -31111 -14665 20050 32045 21935 10451 8247 12957 17923 20932
5146 20932 -5142 -97 -3549 -5572 -12225 -18112 -14772 -24953 -33812 -7215 27149 21316 17941 25613
5132 25613 32032 18623 -140 -5245 6559 5683 10042 14882 -4409 -3607 923 -5905 -4537 -24014
5118 -24014 -26813 -1138 15104 23614 16648 13182 9842 -14301 -11563 13659 14845 -21954 -29202
5105 -29202 -18595 -4582 -11868 -27047 -21764 -24152 4821 24365 33323 36788 25478 -39613 -20799
5092 -20799 26951 25341 6113 -9494 -11785 -2201 11577 -10055 -30490 -30881 -26592 -6519 4603
5079 4603 14391 16663 -858 159 -21770 -31071 -52865 -24343 -14437 -2354 5166 1040 5184 -15000
5065 -15000 -41907 -33554 -28015 -28989 -29914 -18785 -24682 -17837 7418 25524 34172 26302 13080 5927
5051 5927 4950 8872 9267 5732 -6224 -20678 -9834 -4247 -15241 -6684 -4089 1928 17151 18324
5037 18324 22718 -3658 -18378 -18342 -14340 2349 2697 9876 10646 1972 15373 17441 4421 -11757
5023 -11757 -10623 -23850 -23098 -1939 11756 16237 16405 17710 6512 38038 42467 25901 21266 17232
5009 17232 8255 9748 18528 -6871 -14759 7081 25110 -5549 -12466 1889 3250 29654 51533
4996 51533 49735 30052 18622 29238 49423 39031 33289 17867 29015 13634 -10371 -965
4984 -965 30868 40961 26349 -360 -5348 19069 13923 -21995 -13156 -28667 -29521 -28763 -42824 -56713
4970 -56713 -28517 7280 2344 -6245 -11588 -20439 -23817 -16351 6382 25190 12734 10263 22343
4957 22343 25291 25374 27029 15253 10820 8311 18526 16447 -4596 -301 7913 7935 2783 17661 15224
4942 15224 7942 7106 -16854 -3459 -11716 -37988 -53098 -45527 -12570 12202 1020 4495 30687
4929 30687 40835 62372 60188 54824 28058 11159 449 8944 12360 -4107 7075 18801 -10634
4916 -10634 -32083 -17591 13645 19879 27459 29480 17073 -5555 13125 27257 32270 36403 33938
4903 33938 10641 18178 957 -25330 -32823 -23489 -9509 27650 33470 10554 -6658 -1325 14712
4890 14712 25572 22924 11932 -1631 -815 -7928 -16834 -16883 -8037 -4358 5392 17998 9006 21591
4876 21591 20061 -9608 -48929 -36612 -6424 778 -20535 -13871 -7306 -9631 17165 7190 -4859
4863 -4859 3355 9909 -2974 -13763 -16370 -23294 -18079 -9367 2629 16287 10796 855 -9362 -10521
4849 -10521 1947 -713 10670 1887 4894 20032 14398 2534 24611 29226 5466 -22177 -24536
4836 -24536 -17393 -7648 8108 -4811 -17863 -16377 -37740 -45889 -48171 -35641 -26606 -18446 1790
4823 1790 -11532 -25319 -17364 -3043 2004 16134 21472 25793 31615 32065 19361 14340 8407 19442
4809 19442 13368 10856 14608 5965 -400 8274 19811 31091 46176 25870 5170 7493 54945
4796 54945 76964 53674 43492 24524 12192 18082 22576 4577 -4882 -1743 11153 38156 11954
4783 11954 -13120 -13804 -23490 -14914 -7498 -9105 1804 21622 11265 21735 7005 -8404 -2890
4770 -2890 4513 22248 8022 11417 19175 9205 -12096 -33663 -36660 -32174 -10216 -21584 -17415
4757 -17415 -18825 -16558 -8028 -16393 -20318 -32855 5087 11962 12736 20449 2824 6279 27492 12205
4743 12205 -9667 8396 13088 16796 15163 11239 17845 2546 3810 16964 11445 -4037 10994
4730 10994 20950 26514 34818 24930 19252 11742 17575 16595 24290 26751 27763 28052 25603 17340 14323
4715 14323 11312 -22402 -27104 5391 37684 34528 8945 -13011 -12249 265 -4396 -20116 -20566
4702 -20566 -10407 -5063 -3472 -8100 -23579 -32271 -2213 23145 4340 -18124 -33422 -26488 -36351
4689 -36351 -31759 -16837 -4211 5791 -12876 -28451 -27697 -16692 -1879 12327 -154 1694 6723
4676 6723 7716 7156 -2914 6730 2336 -198 -12384 -28117 -20648 -41458 -36787 -52131 -35977 -16386
4662 -16386 -13249 24055 48904 44813 12217 6013 13364 -843 -14512 -14531 -6694 2623 10708 1819
4648 1819 7411 17723 19720 27278 15046 -12215 -14554 -6055 -9598 -5172 1065 -2411 -31278 -32731
4634 -32731 -20599 -27873 -24136 -24569 -12746 -26021 -18343 -12404 -39096 -51905 -47011 -45546 -29887
4621 -29887 -16788 -26719 -16318 5721 -540 13428 31583 11466 11352 9047 -897 -14567 -18565
4608 -18565 -6698 2721 25786 31047 24283 7986 4410 11124 10065 238 -1737 19069 18373 -4799
4594 -4799 -5658 -4942 -11126 -8679 -21591 -14534 -4800 14087 36300 47925 19305 -11927 -3658 -2548
4580 -2548 -16555 -53570 -63363 -55532 -48627 -26246 -14406 -8280 -26511 -31278 -30766 -23862 -32575 -28643
4566 -28643 -21295 -11366 8075 -4810 -25809 -34267 -4670 24665 35012 31808 36350 42697 42523
4553 42523 18695 9579 7491 -6696 -13585 -15435 -12685 -3903 -4504 -24525 -40121 -28214 6041
4540 6041 12373 -224 3308 -3084 -1773 13743 25788 15569 -255 -3456 13147 45120 33072
4527 33072 5592 -27730 -30532 -38588 -38564 -45240 -36822 -4985 26586 48817 29145 914 -5939
4514 -5939 -27303 -46727 -32159 -23141 -10025 2444 6709 9290 13106 14148 -6539 -3766 24850
4501 24850 17116 -4453 -2117 3784 -5121 -22040 -45152 -27359 -13558 -29726 -36672 -26635 -24914
4488 -24914 -30411 -27109 -13906 -15127 17247 32565 8203 -16654 -29188 -20416 169 -7689 -20553
4475 -20553 -24359 -28274 -16680 -14499 -1663 6948 10464 13060 25473 19928 18681 46 -17911
4462 -17911 -20129 -4846 -5667 -15778 -37596 -40653 -32949 -14170 -12404 26518 28692 6257 -7324
4449 -7324 -4060 10726 24818 60773 53314 38713 9609 -16631 -28323 -45613 -25139 -10261
4437 -10261 -36951 -47268 -34694 -29204 -25432 -15558 -14445 -19346 -9472 24308 29124 11027 2727
4424 2727 7711 8067 14696 16337 -5132 -9422 1323 17966 11010 11621 16626 10754 11806 13014 11925
4409 11925 -5520 -5268 -3443 -2923 -13176 -21041 -8620 -21048 -26818 -32350 -5422 29842 28317 31425
4395 31425 33680 33314 17397 6310 9198 4553 -3289 -5389 -12232 -8000 49 21443 22982 -18502
4381 -18502 -21019 -9023 2471 19954 21496 -10348 -4455 2011 -2206 847 14449 1631 884
4368 884 25280 9395 -4273 8287 20896 -949 -1865 2236 -21150 -13472 5913 21010 11776
4355 11776 -27287 -29852 -2049 5133 3703 -3190 4122 3108 3973 5745 6289 7574 10100 -775
4341 -775 -616 1776 15320 24942 23122 12663 19656 9243 -3348 -7514 15657 11526 14542 5062
4327 5062 -15451 -14830 -5117 -14176 -14319 -11378 -18578 -8994 -13824 1526 -8502 -12156 -4108 -37890
4313 -37890 -43902 -52519 -44287 -34381 -27720 -15791 3604 7651 -6813 -2690 9056 18499 478
4300 478 -35602 -36565 -33903 -32971 -30210 -6708 -3362 -20426 -24993 -6284 15403 34370 35329 43196
4286 43196 62921 57188 57768 66407 53506 24911 9145 16123 22891 19562 32420 31328 28718 32755
4272 32755 13961 -3404 3026 7574 27400 60009 74722 67648 55683 30607 8254 312 4364
4259 4364 -819 1577 -14043 -35020 -28328 -21525 -12520 -856 3986 -31610 -42069 -35781 -28541 -27348
4245 -27348 1922 22704 23735 3931 25065 38214 33139 24256 19310 12997 7580 1204 1442 21152
4231 21152 12985 -15127 -10867 -11187 -43862 -59518 -63713 -62003 -16825 -1366 -19711 -12721 -12174 8100
4217 8100 37589 52225 24384 18726 -5029 -18911 -4975 -25734 -27978 -21963 -16023 -3981 -652
4204 -652 -13682 -12690 -22953 -31680 -13179 -9219 -27317 -17064 -20572 -21354 -12707 -3579 -2215 5641
4190 5641 6652 13003 13864 23305 21167 -3521 -9232 1408 5757 -1374 -6543 -11328 -19384 -20860 -38754
4175 -38754 -53396 -9054 17228 7573 -21302 -30708 -20690 -4918 -6974 -18896 -38854 -34268 -2602
4162 -2602 15619 19901 19838 1175 -11703 -15 10222 5831 -4148 -1681 -5845 -8656 -11002 -10155
4148 -10155 -4421 -8750 -11376 47 20096 35316 38011 23535 29788 18943 -12583 -26776 -9830
4135 -9830 4883 15917 27558 17506 6958 -22207 -64036 -78273 -70373 -42017 -14122 20135
4123 20135 59356 62059 55676 41728 15527 22975 6573 -22967 -21648 -22407 -10151 -4301 5525
4110 5525 -11243 -5400 6551 -13385 -10619 -28907 -20813 -34298 -30567 10323 11098 -19508 -25764
4097 -25764 -6244 3484 19773 54729 24772 14476 3928 -8832 14182 9506 -27070 -32334
4085 -32334 -13122 16985 31688 27794 16016 20344 37977 17634 883 2805 -6918 9979 14331
4072 14331 -8542 -392 -308 -5696 -18895 -14643 -2183 -1966 5112 7415 25074 33027 2429 4403
4058 4403 29236 42955 21950 -5152 -15647 -13988 -30803 -41055 -22528 -14135 8103 28910
4046 28910 19010 18182 17928 3545 3720 5738 10684 16120 10271 -7780 2315 -15702 -12599 -16306
4032 -16306 2944 -854 -23401 -31716 -33294 -10687 -5424 -7783 3869 21308 17914 14065 11313
4019 11313 27112 27567 27859 22203 23512 17486 8991 -7936 892 -2968 -6950 -4636 4206 18097
4005 18097 29766 4676 -6396 -27939 -32289 -25620 -19696 -32277 -31932 -19514 9350 3283 5484
3992 5484 -10089 -17924 -3030 -27356 -27919 -31802 -54938 -63176 -34391 -17112 -8203 -7475 4376 23977
3978 23977 17445 7281 -3629 -18849 -26113 -34732 -26845 -11071 -19937 -15776 -17185 84 14167
3965 14167 5997 3786 -3833 -7054 -18652 -20836 -38258 -17906 18741 22824 2056 976 -1872
3952 -1872 4903 -2781 -4703 7253 3532 4428 -13518 -21558 -4117 10233 2132 -3884 -3534 1290
3938 1290 734 14007 10894 13436 9326 -21726 -30573 -6403 2174 -4981 2610 8706 -7756 -29043
3924 -29043 -22163 -20976 -7884 10309 5873 -11883 -14129 1402 -24952 -30850 -21393 -24198 -13766
3911 -13766 -10477 173 -7061 -13080 -26888 -33398 -28959 -12601 -11972 1014 9960 10606 -6306 -2940
3897 -2940 3673 -5779 -16272 -12335 -6167 -18929 -13829 7428 13746 -9715 -20024 -23711 -42194
3884 -42194 -49203 -21255 -5336 -4546 2198 3539 -3742 -1020 -3973 -8467 -16665 -3534 18186 15884
3870 15884 31974 14640 1376 -7277 -7561 9895 -10062 -20549 -8746 -6832 -36504 -44421 -32604
3857 -32604 -14194 -3551 -4794 -14262 -18806 -14293 -1916 3555 8620 -9020 13031 45078 34607
3844 34607 15180 2023 -1771 -15106 -14755 -6077 -5384 11117 7217 1227 -11625 -3318 6889 15796
3830 15796 22771 8633 -14706 -17056 -20910 -10618 -1633 -1764 -14621 -20895 -34189 -47687 -50172
3817 -50172 -32524 -20387 -4983 -1287 1869 2953 5921 21509 27917 13903 10922 10770 -1302
3804 -1302 13357 28601 30308 26667 30236 36226 14927 2475 14192 10818 -1078 18838 24371
3791 24371 3002 13721 16219 18066 46627 31766 9438 23635 30295 28140 -5563 -30591 -28112
3778 -28112 -19289 -22900 -33451 -29909 -1266 15178 16553 11498 15942 20216 -3200 -19433 -8012
3765 -8012 9324 8230 8474 18143 -7091 -10735 -7105 -22092 -10351 -12594 -5018 -11800 -10776 1415
3751 1415 21329 29332 34559 35606 28217 4148 -12658 -15577 -32571 -29995 -63557 -57591 -63534 -87815
3737 -87815 -67746 -43694 -20994 -10762 -15085 -4412 19516 25534 16875 8606 8162 35246 19394
3724 19394 -3371 -13548 -23990 -21188 -14275 412 26564 51722 43729 15598 -369 -6654 28143
3711 28143 33876 14266 1140 -6854 -14621 -22004 -3479 19802 24958 4023 2010 15396 37198
3698 37198 38281 20027 14048 20283 24571 26050 1243 -5946 21702 47650 41276 32463 14485
3685 14485 6208 8355 19952 23754 10272 -29104 -16389 2698 -5409 2266 28164 14311 5256
3672 5256 17439 17057 35552 15283 11370 -4479 -26499 -17112 -7516 -29107 -42304 -38142 -8273
3659 -8273 6837 -3189 23177 17802 8201 13798 10136 9011 8922 -2493 -10227 -46914 -83062 -69294
3645 -69294 -45868 -51685 -47570 -29257 -32903 -36642 -46130 -15748 7044 5964 2938 2735 15307 12474
3631 12474 13178 -15139 -29905 -29190 -34105 -24962 -14488 -8073 4623 -8886 -11936 -22609 261
3618 261 26712 32304 19052 -4109 -803 -5342 -119 -8985 -30854 -33946 -22614 -31777 -21116 -12577
3604 -12577 -14092 -2407 1065 -7950 -32252 -57329 -44564 -29718 -36080 -37776 -36169 -13902 12754
3591 12754 3006 11189 12924 -19496 -23767 932 -17186 -5106 10665 30342 2200 -6412 -3118
3578 -3118 -29794 -57146 -53663 -17122 -14229 -26076 -18596 -18509 5253 36216 37546 32930 14256 11294
3564 11294 956 540 -21384 -14107 1579 2312 -11739 -2679 -5678 20240 22243 31468 14071 32959
3550 32959 45785 28873 19250 40939 56413 53822 40171 30184 32123 10408 7271 15254 26604
3537 26604 7363 -10803 -20134 -15817 -4699 21125 27043 33158 19111 1099 6247 11399 11440 16193
3523 16193 21028 7334 -597 -1928 -6153 2107 32517 29274 23555 15490 13576 19389 16827 18994
3509 18994 17821 4482 -2593 -6448 -8280 6446 11468 -8200 -32504 -43384 -36090 -53194 -45154
3496 -45154 -40045 -34010 -16113 -4269 -11608 -9892 -3132 11857 4578 -3654 -8250 -8684 -16397 -14078
3482 -14078 -18375 -5311 21075 19953 -11199 5847 24389 33763 39837 23510 19535 32901 32111
3469 32111 33632 26764 10230 10664 5371 -741 -350 19651 29824 35811 36921 13014 4756 -4440
3455 -4440 -26610 -10680 17280 915 -7310 9637 27961 40308 30738 19087 -702 -21871
3443 -21871 -19027 -45647 -24661 -5337 -3097 15181 30829 41553 40942 47185 64299 51246 21245
3430 21245 33324 49283 37874 21876 15610 -2791 -25130 -25676 -16053 -36834 -34939 -27745 12866
3417 12866 15885 25772 30155 20334 24556 21061 23772 22343 -9729 -14109 16362 16388 16069 11828 8725
3402 8725 12562 -7865 -41007 -42964 -45330 -32746 -17834 -3143 12081 17894 14477 7601 7941 2838
3388 2838 15425 7784 12943 21513 23723 4031 -4679 -18255 -12903 -26422 -34269 -32509 -9513 1269
3374 1269 -16187 -31192 -1475 5095 17226 23498 6544 24913 46458 42848 45599 32963 244
3361 244 -24086 -18668 -15253 -14342 -2098 -3006 10817 -15970 -20141 6952 32381 26302 44220 46063
3347 46063 28482 -4265 -8643 -2519 1001 -10335 7532 11927 5897 3846 17323 27431 47607
3334 47607 68778 49076 34957 7269 -18044 -11078 -1195 15740 24184 -3786 168 11263 27964
3321 27964 18256 25752 20507 15022 24739 24524 12730 8961 4495 -12167 -2870 -7979 -8528 30287
3307 30287 35895 39893 39584 20768 407 -18289 -20508 -16958 1961 1266 9484 -13416 -15057 -4427
3293 -4427 -1747 -15551 -13726 600 8085 5443 6242 -9569 -8019 -4170 8060 16268 16634 -11200
3279 -11200 -6062 9754 21683 8016 -25673 -33667 -28186 -24107 2231 19257 13732 -2698 -1880
3266 -1880 5709 -25821 -40062 -16811 -3574 -44619 -40364 -3896 32099 24812 20208 18246 29026
3253 29026 29394 28097 40367 18529 -973 1356 20234 12433 -5970 -13554 -7297 14281 30125
3240 30125 16750 179 -25440 -28623 -21648 -7015 -932 7199 -557 15639 28175 38372 42880
3227 42880 27150 1655 -10376 -10657 -24328 -31659 -26742 -24361 -6515 8208 1438 -12296 -25954
3214 -25954 -2548 5389 16077 30897 18928 20085 16730 17383 -438 -3367 5798 31127 34488
3201 34488 48269 53313 47627 25888 14222 1607 -7516 -21302 3658 42674 44585 14722 10382
3188 10382 16624 1383 -19837 -35543 -23781 -19379 -18866 -37465 -45735 -45846 -10208 11201 29263
3175 29263 49579 34097 6629 7651 4665 9184 18780 26986 24366 19909 28440 7779 -18664
3162 -18664 -7919 5877 17974 -5103 -3867 -4212 -15714 -18495 -4905 4284 680 -7487 -1012
3149 -1012 4531 19349 37847 38151 33958 26181 41989 44603 55688 61186 71398 79376 83645 56436
3135 56436 52512 34379 45737 49097 43811 23922 1232 -2100 -14533 -15368 -18930 -6189 -1206
3122 -1206 9575 8438 -5700 -27944 -19164 -21538 -21971 6193 20202 7177 1309 16235 12786
3109 12786 38935 44491 21709 11227 11172 3975 -5203 114 -17233 -19583 -16832 -32595 -25042 -28664
3095 -28664 -17882 -25507 -10636 -12631 -3903 17831 22947 12973 4596 19124 28666 21142 9115
3082 9115 4878 -2683 -17699 -5704 -4892 -26934 -18305 -24275 -27191 -3745 14320 34754 27028 22894
3068 22894 13554 16893 11017 -6274 -7954 -14761 -8824 -2470 -5464 -1152 5561 20838 13295 661
3054 661 -13151 -2000 -8285 -4170 -5924 -3369 -3466 -9197 -13255 -3801 6589 7649 -13884 -25215
3040 -25215 -27748 -6959 -11211 -14015 595 -9505 8993 24756 18118 -8530 -6828 4647 -4842
3027 -4842 -23307 -37123 -11144 1573 7538 -335 -19552 -11418 12235 21533 -2925 37066 70094
3014 70094 38158 -2569 1887 22995 5582 8688 10271 -4204 -26092 -23455 6036 10510 23477
3001 23477 6827 -10970 -3048 19201 34035 38661 45202 18924 -11363 -19624 -16273 -15217 -15290 -5857
2987 -5857 14686 3711 12084 24620 27581 26331 34827 6322 12536 6997 13558 24405 24614 40363
2973 40363 40664 38633 13034 237 7569 -14029 -42672 -33059 -2495 5281 -21634 -3853 2557
2960 2557 23508 21350 1728 -21047 -50278 -67938 -55652 -1946 24859 11575 1979 -470 -1017
2947 -1017 11329 -6307 -12574 -17382 -32881 -35889 -47022 -31640 -35092 -29902 -22410 -36309 -16159
2934 -16159 3697 13178 11968 1393 -8429 -14659 -33583 -42159 -42593 -22553 -13252 -2723 1589 -9946
2920 -9946 6324 17393 -8345 -7326 -11974 -3413 1959 -23257 -37250 -32960 7712 29561 15105
2907 15105 22519 6850 4766 -13979 -14211 -5410 11821 8517 5089 21766 48799 54616 40090
2894 40090 25876 7892 22792 6421 -24481 -34454 -11225 5025 1339 5365 13831 34230 33708
2881 33708 8160 -19780 -29080 -26629 -11022 6754 4020 -21392 -21480 803 14503 -20988 -14124
2868 -14124 16183 25790 40200 20091 2934 -11650 -12377 4646 5813 1973 -19277 -47857 -50828
2855 -50828 -58764 -69537 -61077 -39071 -38489 -25353 -9862 5283 -2820 -40477 -50179 -47786 -16290
2842 -16290 6793 -26574 -27635 -15765 3979 14066 7587 -6601 -22615 -36405 -11757 3441
2830 3441 -2566 7337 11421 19798 47556 45231 28431 26665 16592 -15404 -23429 -16785 -17344 -20093
2816 -20093 4563 2938 11144 -4764 3685 560 8808 7611 6515 -6279 -23523 -29087 -50893
2803 -50893 -65799 -60991 -45158 -38898 -10402 2035 8335 34465 26754 8850 8335 23037 20811
2790 20811 30181 41751 21263 1332 3893 18497 22963 -22235 -37353 -37666 -23603 -2911 8483
2777 8483 -14631 -27933 -41832 -26336 14979 14256 8626 18382 24070 22304 21456 5780 -5536 -2370
2763 -2370 10897 28326 30026 21237 -1354 -31140 -52055 -30946 -6315 15211 16498 21876 25660
2750 25660 46644 56011 45642 29424 31210 33592 19405 20214 4318 -5147 15397 17116 8178
2737 8178 -10657 -17600 -2741 2613 502 -7119 -2857 -23575 -30111 -18512 11395 25660 22760
2724 22760 25286 47019 39132 33199 41436 41938 14911 17506 12882 -3083 3767 7198 -10799 -36550
2710 -36550 -54115 -39006 -36251 -52042 -59866 -59935 -37389 -18299 -14303 -20752 -38224 -29214 -5608
2697 -5608 27981 17345 12277 1076 -19840 -25067 -26737 -35486 -24365 -16697 -30063 -23112 -1608
2684 -1608 42323 42629 30809 27123 13982 18286 40988 36776 36111 12148 3772 7728 -7703 -20102
2670 -20102 -12483 -4383 -31999 -37762 -23287 -16020 -5704 -7529 8984 6316 27171 34424 40966
2657 40966 50585 13913 3191 19403 27041 25196 10486 -12683 -7714 17086 29246 43202 17738
2644 17738 16448 25655 27859 40205 45068 17490 6283 11818 449 -23122 -13648 2059 -8010
2631 -8010 5191 19058 5515 -20815 -13272 -3536 -2447 439 1642 14956 28791 12214 10322
2618 10322 6853 5289 30952 29132 13953 7488 -10063 -24416 -15970 4511 12611 6844 5490
2605 5490 6544 10948 6700 4134 17851 29102 20161 -21 -18079 -32112 -23676 -14918 4156
2592 4156 22088 40360 13975 -4167 9385 16640 26753 -855 -26819 -18709 14947 13572 1881
2579 1881 -18304 -26525 10783 -1994 -29661 -11447 -8043 15684 21911 7295 -24123 -29889 -23986
2566 -23986 -45452 -26657 -12527 -13469 909 5388 -3872 -9502 75 -2379 13552 29605 11927
2553 11927 -6722 -14232 -20134 -30264 -21407 4298 22138 953 -3316 5892 5975 -17053 -31435
2540 -31435 -16779 -11468 9152 7774 5263 -4537 -11200 -5635 4104 17673 12597 2968 6624 689
2526 689 27297 33138 15644 18850 24723 15933 21069 33000 10824 4105 287 -3239 7076 -2939
2512 -2939 -6658 -20285 -22759 -12340 -14956 -21329 -130 21689 22207 20388 14851 7092 809 10970
2498 10970 29892 22343 9169 33231 45988 27261 -22042 -43685 -9029 16370 15414 -9651
2486 -9651 -34337 -18271 13930 26825 33679 26016 20003 11820 36101 52387 40308 23803 4273
2473 4273 -8580 -13397 -1714 23997 36365 25621 25033 16874 -9706 -19540 -9962 -32957 -37378
2460 -37378 -39301 -4250 1559 -6609 -1339 5844 18299 -2607 -7364 9695 21804 21816 18439 4578
2446 4578 -1159 -13722 -14323 1268 13990 5844 25337 19082 10090 16850 5734 5804 14341 12778
2432 12778 5277 6774 21685 25559 21314 6499 -273 214 -14541 -5936 -5040 -10879 829 26824
2418 26824 32373 17625 2813 15411 8576 -750 8543 29551 14616 -319 19243 35800 47002
2405 47002 35990 15262 8900 7058 -7031 -20181 -27299 -14895 10073 28989 29685 14297 -4736
2392 -4736 -21002 -13107 8058 -7995 -24626 -18341 -1237 51606 45258 18578 -6873 -5865 -13770
2379 -13770 -9751 -2413 -3180 -5893 -2834 -20766 -23022 -46389 -56318 -35455 -1866 24293 28679 22141
2365 22141 12491 -21724 -59472 -56562 -34055 -28065 -52194 -50344 -51116 -18222 12033 8025 -19056
2352 -19056 -19552 -2551 -4600 -8499 -562 18990 18877 4902 14643 26810 19792 6993 -8204 -9749
2338 -9749 -6402 -2164 10846 24418 21442 14464 18174 25081 28001 19240 -2404 -8206 14744 35498
2324 35498 29228 20875 8560 14459 23493 21447 23265 9159 -16074 -30268 -59924 -50774 -7962
2311 -7962 276 -25038 -23566 -21613 -1788 -5898 -6881 5775 23400 17430 5334 -4685 -2137 9761
2297 9761 3330 -20223 -12843 243 3036 10484 2093 -4487 -6286 -14441 -22433 -12662 531 38100
2283 38100 39330 17539 -6457 -22255 -24941 -9693 160 -77 -17985 -18714 -21233 -14210 -6070 -4434
2269 -4434 -14655 -2574 2587 -294 11860 -9876 -26920 -30836 -12897 3101 -4490 -19427 -30526
2256 -30526 -38018 -20064 -16133 -23481 -36105 -21726 9794 18083 28618 32297 26028 10459 8063
2243 8063 15338 8164 -2384 6485 6524 -10459 -17677 5188 4957 15577 7718 7192 -1305 2392 6575
2228 6575 -11749 -15575 -17004 -5869 -1111 -3886 3047 5225 -412 -5620 4501 16902 13444 23393
2214 23393 11444 -8044 -4440 4951 7708 1111 4746 -415 4944 12249 16060 15138 2047 11312
2200 11312 19889 -207 4782 19826 18946 11301 -11818 -18301 -12236 -3937 6130 11660 -1977 -17934
2186 -17934 -26730 -6128 14477 29654 37906 22589 20576 30615 11844 -3740 10447 12913 13090
2173 13090 14762 -8315 -4254 -4164 -5593 -6044 6527 27826 17623 -5029 16567 12218 3962 -11206
2159 -11206 1512 2550 -1013 20625 40515 53570 49152 48596 33687 12371 -19419 -40714 -44223
2146 -44223 -37306 -28616 -40327 -34955 -16756 -13959 -19928 -15231 -1966 -11048 -11510 -24853 8264 20092
2132 20092 -6596 -6423 30658 62148 60510 44350 15669 34895 53694 53424 37170 -19671 -27265
2119 -27265 6810 19178 20627 8689 7146 -1496 -16730 -8494 1772 -4772 771 -9555 -10508
2106 -10508 -25894 -20746 -14457 -9427 -4380 -7776 -14458 2079 23873 32059 14693 6970 18067
2093 18067 15061 -18316 -48202 -47770 -33991 -2772 26885 24346 20042 39900 32951 38669 38490 22080
2079 22080 21515 35174 37448 16902 18821 32130 9923 11124 23224 27634 24980 16102 19716 13598
2065 13598 7823 16609 34066 24297 25866 24976 10332 4817 18729 1201 -10338 -10365 3973 7641
2051 7641 2643 3968 34837 41832 32389 35038 61130 69936 29053 3547 9289 30489 41840
2038 41840 12268 -12568 -21141 -8382 1960 14322 18867 10640 -12383 -25955 -28277 -46158 -52501
2025 -52501 -30888 -15718 -212 8141 7165 10086 24623 38611 7672 -25598 -21257 -21944 7531
2012 7531 18019 5710 -11814 -20282 -17517 -8589 4870 -4115 -6853 -13784 -16089 -6247 -15676 -19388
1998 -19388 5914 36388 29857 9684 -3304 -21881 2655 34621 43691 38607 14255 6715 13804
1985 13804 18183 18397 5501 -7962 -7306 -29163 -46710 -27226 1386 12856 9874 -9487 -13864
1972 -13864 -14230 -22514 -15367 4718 13509 26853 25339 16591 20495 26270 47893 23437 33773 65004
1958 65004 70408 37417 15750 11825 5642 16100 23234 26682 7005 12477 31257 40704 40474 30341
1944 30341 14576 17256 13567 29271 8985 -14987 -5932 -2507 -3281 1256 7663 -5614 13342
1931 13342 2984 -3879 -6326 -15126 -16787 -23793 -17512 -24686 -19952 -2538 -24768 -24174 -23582 -27888
1917 -27888 -10321 -24298 -19668 -6437 -18512 -16500 -7078 -905 2014 -20553 -7024 1874 6143
1904 6143 8078 9294 -12722 -3275 16605 673 -11725 -18453 -14994 12970 17909 17474 -12632 -44178
1890 -44178 -40693 -24964 -6809 8195 2684 -6069 -15595 -28128 -19426 -17360 -4583 4609 2721
1877 2721 6730 -5029 -26995 1955 10416 29383 22230 -970 -32682 -17716 12721 12824 10865
1864 10865 6646 -2007 9341 8416 11065 34093 54013 50758 42642 49713 42179 34585 29807 6312
1850 6312 14344 18277 17375 -7029 -15977 -23369 -37069 -47351 -47409 -30055 315 5403 6561 25333
1836 25333 25909 9513 3123 25877 32470 28406 11980 13985 32072 23565 1961 -8098 -20540
1823 -20540 4659 34010 15734 3355 7499 3375 -1572 -12562 724 -13916 -31191 -15361
1811 -15361 2893 -2262 -12065 -7075 -7226 -8069 -2883 -4227 -23244 -33952 -28570 -25634 -11369 -23857
1797 -23857 -17862 1832 12183 11444 10537 22136 41534 21192 8953 14426 -3671 -13256 -7907
1784 -7907 -6096 21421 39414 28006 20765 29641 25824 822 12777 17981 20912 9017 -2267
1771 -2267 -13324 -22768 -17649 14114 5707 -25414 -33049 -20190 -8287 -355 11476 6600 6157 7548
1757 7548 29223 19816 -7226 -15670 -11466 24907 29842 44167 58391 41076 31077 13659 20534
1744 20534 9529 9690 16565 30775 34735 47283 40345 33458 34706 14823 -16275 -48576 -47049
1731 -47049 -47558 -35086 -17180 -23793 -22970 -7347 -8415 -28716 -34670 -11929 -7967 -25139 -38514
1718 -38514 -21976 -12344 -11656 -13055 6298 16384 18895 20154 36928 34946 42629 42824 25577 11283
1704 11283 20245 24445 19836 12819 38900 35006 -3427 -20132 -13499 -7629 -907 26832 15014
1691 15014 50 2485 -1096 25670 57445 35930 29825 23755 15051 15782 1863 -24857 -33269
1678 -33269 -31327 -25528 -21026 -10228 4937 -7204 -18751 -3867 7488 15760 11895 -8162 -26616
1665 -26616 -28046 -26423 -7655 -11604 -15402 -18292 5949 34620 41077 30805 27182 -8020 -18496
1652 -18496 22910 35966 17967 13390 28027 44039 57258 54585 60413 66423 41110 34203 26848
1639 26848 734 -11050 -129 3042 1544 12556 19989 30069 19468 22528 17852 5884 14418
1626 14418 27383 29978 7917 -12269 7750 16830 21779 41770 31457 32398 34514 22375 8287
1613 8287 -5123 -2678 -5226 -11698 -6454 4229 32016 11056 -10858 -14102 -26360 -18751 -22396
1600 -22396 -14005 -3673 -11946 -23327 -16363 -8281 -8431 -32050 -24323 -49219 -70609 -62244 -31677
1587 -31677 -1874 14282 1668 -4871 -2083 12081 36260 12600 -10321 -40386 -37703 -26733
1575 -26733 -22080 -29549 -12291 -10055 -3890 3449 -12318 -568 1255 -17989 -15417 -9259 -9447 -11352
1561 -11352 -15540 -3316 -954 9648 -7239 7466 31771 13377 -3435 14569 9750 14770 10564
1548 10564 -10284 -6237 968 5795 536 -8196 14539 -10634 -13729 -8647 -946 -1340 -21812 -27792
1534 -27792 -13788 -15440 -21632 -11722 1112 -21263 -39966 -6872 20664 12461 -7501 20476 2376
1521 2376 -24347 -13756 -2634 -18358 -37759 -29665 -12368 -22733 -28872 -22231 -15347 -28404 -25217
1508 -25217 -12338 3668 34164 30689 12100 21724 31720 13210 1276 -1978 -11856 -17597 -16434
1495 -16434 -10540 -3217 -20886 -19952 2175 24470 43633 23811 22089 7508 10135 11577 22
1482 22 10793 27425 55954 34384 24991 19487 30969 35115 36068 52731 44136 42170 42677 31591
1468 31591 11007 -1849 -2243 3813 -19649 -629 17605 26613 13910 1327 42803 41567 22305
1455 22305 25788 22461 1731 -4666 -5179 6479 7410 13662 12024 6596 38528 56308 52789 53708
1441 53708 34878 8219 16149 37492 13033 -4014 1935 14621 34351 30190 1066 -17781
1429 -17781 -32636 -9821 12157 18350 8562 -16028 -27062 -2205 22930 36876 32697 1043
1417 1043 -1270 29768 39941 30141 20734 14307 18027 21647 16022 36090 40695 15742 -2306 -8493
1403 -8493 -8213 1678 1315 -1800 -773 24 -8541 1067 14984 18274 -2745 -38205 -41656 -13290 -14722
1388 -14722 -1298 24037 10603 -18879 -26734 1337 21669 12758 9258 -6691 -26246 -34426 -34382
1375 -34382 -28538 -10417 -1179 -18709 -24021 -5573 -7736 -15435 -4914 14964 997 -28100 -62762
1362 -62762 -58574 -24471 22098 6979 -14146 -7326 8125 5066 -9293 -7294 -6487 -28157 -49206
1349 -49206 -38916 -13114 -5019 -10824 -40579 -30749 -27406 -27112 -20795 13898 25558 28025 33265 25801
1335 25801 24129 -5064 -8613 -6623 -2820 33238 21568 19594 24346 24719 8711 -6871 -27876
1322 -27876 -44983 -44068 -30186 -27876 -18256 11789 4243 -15091 -10313 -830 -5323 -19028 -24311 -31267
1308 -31267 -42951 -28775 -15180 -790 7937 5972 17734 6223 -8977 -17052 6476 29269
1296 29269 64052 55458 35784 9122 4793 13266 27335 3542 -13860 -14038 -9561 -8525 -4208
1283 -4208 -22003 -24403 -8106 -38659 -45311 -47017 -39767 -58248 -73444 -62148 -30286 -23986 -56740
1270 -56740 -48240 -17305 27 6678 2560 -29797 -15470 -2484 -11541 -4660 5367 3021 10109
1257 10109 8367 556 -27201 -47886 -52528 -42518 -42116 -34632 -14388 -5431 5699 13899 21523 14315
1243 14315 -3354 -8208 14888 17970 20813 22287 19698 7685 4252 3497 1234 19707 23706 18540
1229 18540 -4809 -13994 -26601 -3597 11809 -7179 -21467 -16775 -14763 -27939 -5951 22489
1217 22489 32326 9693 -7686 -14685 13842 38430 28452 -3475 -6991 -1169 11603 -1489 -5178
1204 -5178 -2302 8903 14130 28149 24481 22533 22267 16479 21745 36604 42388 35406 16617 -6263
1190 -6263 -17423 -3934 -13241 -6113 149 13458 17319 4878 5879 23896 24808 15410 7201 211
1176 211 -3381 -51934 -53463 -40251 -26357 -44574 -24790 11751 -12171 -37790 -33335 -33212 -28590
1163 -28590 -3185 -4264 -1243 5603 17424 28840 12902 22720 22564 11171 14154 1316 -11227
1150 -11227 -27657 -15470 14091 12483 11252 14202 2571 4987 40516 57172 59958 37740 30853
1137 30853 13215 7036 4149 16196 -4525 -13540 -5273 -8207 -11616 -1724 10437 -6400 -20560
1124 -20560 -13628 -2291 -19939 -25123 -32588 -15065 -7692 -3439 8021 21485 39494 51561 36553
1111 36553 15961 -11252 -29156 -25417 -10910 -15848 -25666 -5708 -5570 -21439 -18969 -8371 23707
1098 23707 13372 -2385 -5260 -11242 -31842 -37022 -26580 -9190 33346 44750 70652 57975
1086 57975 40086 28099 33963 40162 38151 44704 34938 24692 22578 7231 -10205 -4409 -13035
1073 -13035 -33254 11177 45051 36370 7691 -6309 3298 9586 -4809 744 3199 -4041 200
1060 200 -1723 5479 10502 19072 18127 30062 27403 26025 1293 -4484 -14497 -3485 -8988 12619
1046 12619 5826 6540 -2882 -9470 -29962 -40331 -17123 7094 -3252 -19942 -32246 -22386 -2180
1033 -2180 -9121 -2572 13335 14694 14500 30857 17163 22931 50017 51429 41188 29954 3607
1020 3607 12902 22263 24050 4403 11001 19250 1833 9743 32776 37105 14080 12569 21566 31065
1006 31065 19005 11414 20464 12727 15428 29149 50138 51567 42007 19793 -12449 -15318 9878
993 9878 26559 22003 18031 -1048 14079 18283 27247 33994 -4328 -21699 -11273 -6392 -8791 2667
979 2667 8743 11951 -3327 -20412 -40939 -33023 -30224 -22854 -27917 -43324 -61891 -56258 -34776 690
965 690 10719 -7589 -9938 8944 7225 9640 -4570 -23470 7901 37655 20606 1895 -15623
952 -15623 -20322 -12036 -279 8521 11443 14637 6060 7590 -1834 13713 -1074 -10908 -10296 -13331
938 -13331 -2098 -2137 -25469 -22432 -27173 -9679 25081 11853 -1384 -8308 -13679 -26108 -13542
925 -13542 -8954 -2891 -25938 -28801 -4871 -24561 -41519 -28090 -12065 8608 9178 4651 -5648
912 -5648 -24296 -26545 2587 -1020 -14511 -7426 -639 -2199 -24684 -24239 819 3555 13764 6454
898 6454 -795 -1515 6039 14444 5883 6336 -6255 -2048 -6462 -2719 -6754 -22210 -28372 -27951 -19681
883 -19681 -2107 2630 -13992 2790 11747 20602 35711 28580 17464 -8616 -18831 2337 14870
870 14870 22797 25074 22646 3184 -7178 -18185 -9480 3793 1033 -466 4850 998 4476 1633
856 1633 -19489 -3918 20728 23255 19555 12622 7805 6495 18037 16747 30382 8515 7755 -2969
842 -2969 7799 12924 -8011 -19180 -16468 -8548 -543 14078 18008 21529 32046 5355 13532 27340
828 27340 49497 38659 21826 19509 17450 15020 18443 16322 10805 12773 -629 -3579 615 -21042
814 -21042 -31746 -33154 -6513 -1951 -16416 -37488 -63170 -59603 -45565 -17893 31298 31314 12144
801 12144 3421 11595 28375 12046 -8495 -3230 16893 4254 -8899 -12086 8125 5561 -1812
788 -1812 -16158 -8195 -66 15539 22324 11552 18676 37777 54883 55602 51750 38399 24437 748
774 748 2299 13842 -11829 -20188 -5889 3872 -8178 -15657 -10815 -586 -34098 -39565 -36311 -31475
760 -31475 -11578 4597 10223 16145 22099 20072 -12070 6947 3880 -22004 -29495 -37165 -37965 -26974
746 -26974 -23849 -34066 -29931 -45782 -64306 -54078 -17475 -43 -4759 -9341 -17588 -21887 -20553
733 -20553 -6342 823 -4095 27543 23417 4680 -11800 -20592 1360 -7138 -18934 -27915 -39559
720 -39559 -42644 -39024 -8270 4772 -7927 -7348 -18336 -18690 -19809 -40159 -41192 -38077 -40245 -26710
706 -26710 -20991 -25591 -27776 -21290 -15165 13508 23301 35288 39801 7132 -562 -9784 -29642 -36514
692 -36514 -48213 -31486 5939 16267 1456 -10974 -5393 -5745 -5562 -29283 -41195 -8295 1951
679 1951 -8602 -4306 19644 17645 8480 14562 -7064 -22626 6633 43662 28400 24636 33982
666 33982 41897 49049 58899 69567 55928 31175 8502 17577 -8439 -27135 -42933 -60541 -39169
653 -39169 6225 -18157 -36176 -11376 27710 32499 -2663 -20240 -25171 -11653 7504 13991 18956
640 18956 39203 28774 21563 4404 -12696 -35511 -26190 -20051 -24681 -22806 -11225 1865 15116
627 15116 14956 14695 -29064 -29222 -15268 5570 21222 32601 22896 15939 -8829 -3309 1744 -3347
613 -3347 -13632 7565 115 -5219 -24404 -27014 -26184 -12565 -1519 8511 7017 21519 9006
600 9006 16514 26255 24068 26213 9687 2030 19136 34383 48869 28746 34166 39166 28481 24633
586 24633 24029 21906 9425 -8339 -34212 -38890 -32119 -21666 -4396 985 -17513 -32756 -22924
573 -22924 -19696 -12355 3149 14162 37117 37884 34047 44153 26432 7069 -15496 -30242 -17909
560 -17909 -4848 23361 18368 -7753 -34466 -23856 -23208 -31505 -12091 -8831 -6759 -14929 -11399 7506
546 7506 9451 -7594 -25511 -29542 -26071 -34560 -47507 -22057 -3894 -19493 -16955 -3265 8148
533 8148 -10037 -13971 -6213 -9608 -10773 -9217 -10626 -6868 -12033 -14254 5880 3138 -23609 -24810
519 -24810 -23901 -17182 -32687 -14379 -3335 -1474 -11637 -4486 -3038 1777 5243 10866 14803 10399
505 10399 7801 19680 26277 13789 71 3159 -3152 -164 -10815 -3154 -13770 -30920 -47849
492 -47849 -46488 -23716 -1005 14431 -8938 -38635 -35643 -15583 -3060 4942 -22676 -30205 -9367
479 -9367 11215 459 -15927 -26713 -19614 -28599 -27922 -1810 23015 27976 32145 29140 24441 10702
465 10702 9435 -1515 -4427 -20661 -31105 -35616 -28150 -9892 -9728 -7031 -788 -8205 -12071 -27324
451 -27324 -35014 -35776 -62379 -56071 -33381 -28221 -29737 -15810 6283 936 17381 27749 19529 28040
437 28040 11612 -13710 -11490 -3865 1980 2762 -6843 -17935 -21118 -29633 -12565 -9359 -33458 -12437
423 -12437 -14 -19338 -38681 -34978 -42690 -47649 -41858 -29749 -28606 -34960 -40545 -22891 28188
410 28188 51274 38993 31651 9511 6267 -958 -4970 6277 -12376 -3551 -6114 10039 23956
397 23956 -8603 -30199 -12044 -22958 -32842 -24778 -15284 3419 19373 6067 -6467 -7258 -7800
384 -7800 -5121 -1502 -2392 -22653 -8609 24947 15415 5330 19011 3198 2375 24379 38340 34441
370 34441 13231 10941 599 -8383 -14424 -31298 -6770 5083 -7161 2102 1285 1231 -20510 -16193
356 -16193 -7893 93 4177 2102 8008 -2417 -4620 -3399 126 -22680 -12351 13395 -7999 4457
342 4457 46406 55080 47536 59279 38777 6075 -2406 -13602 -40865 -65129 -53713 -38328 -21156
329 -21156 -14639 -6784 -1933 13624 13023 4465 -17804 8250 14185 14117 13328 3901 12724 14282 14255 15111
313 15111 19343 12219 -50 577 -1667 11372 24686 17803 13365 -958 -9139 -6252 7511 14628
299 14628 16707 14975 1833 17887 22592 25830 8675 10712 12696 6592 12916 22688 32685 25192
285 25192 22325 6936 -6002 8015 5538 4599 3425 4059 -13014 -5195 -1460 -7499 -8942 -17321
271 -17321 -2644 9355 -7827 -25662 -15435 -1369 7089 8739 13274 20354 20316 14962 24762 23943
257 23943 10129 3020 -3940 2499 1436 7206 -2798 5975 -9812 -33529 -37313 -19011 13228
244 13228 35287 13772 -17562 -7954 28617 9205 -4013 14588 10565 10619 1412 -7584 -5229 -21844
230 -21844 -13300 -19605 -27827 -37643 -28762 -21791 -16971 -24282 -29754 -31893 -30468 -6383 927 -15544
216 -15544 -27963 -18011 978 5805 12385 10799 -6195 -19200 -28429 -30002 -23066 -24115 -15957 -6284
202 -6284 -9285 -30520 -37548 -23247 -16541 -23454 -16821 -2289 -3278 -207 720 3247 1393 -3967 -12299
187 -12299 -661 -3316 -868 -5859 13637 22501 7510 -2973 -3378 763 -12616 -30764 -47527
174 -47527 -40671 -28937 -38311 -18052 -1971 2994 1643 -3433 2678 9452 9932 19860 33497 19487
160 19487 36411 42461 23021 5893 -7504 -14156 -18267 -18662 -12001 6106 10367 9032 -6247 -13750
146 -13750 -14570 -673 -11478 -1579 3987 -6966 -3726 -6248 2113 -3787 -3172 -7060 -20027 -23921
132 -23921 -24969 -22842 -15987 -17568 -34378 -45374 -48125 -45956 -28377 -7210 -19661 -29031 -23750 -18650
118 -18650 -1190 3863 1052 37422 41446 28824 23144 29925 27032 37084 44610 23302 -7947
105 -7947 -17395 -422 13180 15355 12442 -2961 -12135 -4670 -1203 -3925 -1483 18604 25460 19113
91 19113 13580 13513 3456 -6051 -6694 -18316 -8570 -1677 1373 -13583 -14007 -3568 -2256 2988 -11251
76 -11251 -13638 -24223 -22004 -24799 -15434 806 16047 13896 8702 4163 -2279 8037 2709 -17080
62 -17080 -5467 5716 10033 15142 10555 14850 16242 -6200 -18028 -30321 -15259 -2315 -12495
49 -12495 -15493 -6677 11796 3814 1812 4921 -6646 -13928 9210 4666 -10662 -14764 -6113 2906
35 2906 8904 15365 19577 24402 21002 13664 11442 -4158 -13105 -18694 -8454 1771 -1615 -269 -3566
20 -3566 2568 8388 19924 15786 7616 10563 3586 -9929 -10763 -19904 -17057 -6809 6828 7759 -11192
5 -11192 -5856 -16964 -12249 -11426 -21573
0 -21573
$$ Imaginary data points
##PAGE= N=2
##DATA TABLE= (X++(I..I)), XYDATA
32767 88449 90257 84863 81292 87140 86576 68003 61955 54788 63863 64143 60132 59554 63371 68930 74804
32752 74804 83441 86746 97813 92968 92529 84095 85191 87610 92813 93876 101431 115964 116385 94533
32738 94533 89777 80775 83692 84759 77309 87920 113738 128772 117876 104789 101269 106696 117186
32725 117186 132275 135201 119684 122098 116272 97065 100174 124368 138617 116801 85369 83374
32713 83374 111303 125150 116025 126906 112457 93085 101318 118266 132290 137404 131675 143378
32701 143378 156593 150138 148213 117194 103055 112784 133420 139393 126397 143217 166618 171409
32689 171409 166341 158780 151565 166827 161625 149194 137324 148434 145667 146741 155081 146915 141254
32676 141254 141042 141979 149403 148767 159376 164231 176674 187132 175312 172698 167890 172796 189161 197032
32662 197032 195555 194166 193669 179621 178425 192629 187623 165562 186339 217422 220596 210231 185210
32649 185210 170850 164877 172031 172388 175203 195744 211540 206851 197916 189230 200769 189948 188415
32636 188415 198544 212822 218783 199284 201687 220254 206685 190367 184888 187369 209425 213880
32624 213880 195843 192423 197239 205393 230141 235488 220228 203129 204312 203558 215683 222541 220807
32611 220807 218285 201820 209312 214420 218195 205126 191980 200942 224622 229648 225242 223393 221256
32598 221256 217767 201024 194264 203045 215659 203791 197802 213928 230157 232341 235732 234168 238437
32585 238437 249514 243685 259254 275077 289115 285860 256871 221559 216632 243498 256223 259072
32573 259072 239319 217640 230115 243709 257016 230792 225080 233559 229790 226581 236943 244865
32561 244865 245823 251347 258409 252457 247091 255949 258313 244638 240818 245150 229245 216607 223495 247498
32547 247498 235250 233754 234098 230239 226213 214870 216877 243176 251258 266112 279596 289676 293592
$$ [...]
##END NTUPLES=NMR SPECTRUM
##END=
