##TITLE=Analysis number 329680
Compound Code cc 62902
Book Reference 554/2/4
Project Code adrs
Chemist Name bruced
##JCAMPDX= 6.0         $$ Bruker NMR JCAMP-DX V2.0
##DATA TYPE= NMR SPECTRUM
##DATA CLASS= NTUPLES
##ORIGIN= Bruker BioSpin GmbH
##OWNER= nmr
$$ XWIN-NMR		Version 3.5
$$ Mon Sep 24 09:46:18 2007 GMT Daylight Time (UT+1h)  MAYBRIDGE\nmr@NMR_250MHZ
##.OBSERVE FREQUENCY= 250.131544655141
##.OBSERVE NUCLEUS= ^1H
##.ACQUISITION MODE= SIMULTANEOUS (DQD)
##.ACQUISITION SCHEME= undefined
##.AVERAGES= 16
##.DIGITISER RES= 18
##SPECTROMETER/DATA SYSTEM= dpx250
##.PULSE SEQUENCE= zg30
##.SOLVENT NAME= CDCl3
##.SHIFT REFERENCE= (INTERNAL, CDCl3, 0, 16.522)
##AUDIT TRAIL= $$ (NUMBER, WHEN, WHO, WHERE, WHAT)
$$ ##TITLE= Audit trail, XWIN-NMR		Version 3.5
$$ ##JCAMPDX= 5.01
$$ ##ORIGIN= Bruker BioSpin GmbH
$$ ##OWNER= nmr
$$ C:\u/data/dgb/nmr/ADRS/2180/pdata/1/auditp.txt
$$ ##AUDIT TRAIL=  $$ (NUMBER, WHEN, WHO, WHERE, WHAT)
(   1,<2007-09-24 09:45:52.07 +100>,<MAYBRIDGE\nmr>,<NMR_250MHZ>,
      <created by zg, POWCHK disabled, PULCHK disabled
       configuration hash MD5:
       76 6E 9A 78 1E 09 19 81 EC 84 63 8F B0 6A 59 2D
       data hash MD5: 64K
       21 6A 85 00 1F 22 30 85 37 4B 96 1D 8A 56 F5 83>)
(   2,<2007-09-24 09:46:07.32 +100>,<MAYBRIDGE\nmr>,<NMR_250MHZ>,
      <Start of raw data processing
       ef LB = 0.3 FT_mod = 6 PKNL = 1 SI = 32K 
       data hash MD5: 32K
       FA B3 5F AB 7D 61 26 80 FA D9 1B 19 B3 F6 20 E9>)
(   3,<2007-09-24 09:46:08.94 +100>,<MAYBRIDGE\nmr>,<NMR_250MHZ>,
      <apk 
       data hash MD5: 32K
       7C 76 2E A4 10 E0 CD 36 A2 A3 4F B5 07 DE 7E AD>)
(   4,<2007-09-24 09:46:09.66 +100>,<MAYBRIDGE\nmr>,<NMR_250MHZ>,
      <abs ABSG = 5 
       data hash MD5: 32K
       EC 40 4B 46 A5 5C B8 B6 43 A1 40 71 DB A7 36 EC>)
$$ ##END=
$$ 
$$ hash MD5
$$ 30 06 C8 90 9C CC 75 BB 23 8B D5 3F 6A 7B E3 00
##$RELAX= 
##$RELAX= 
##$RELAX= 
##$RELAX= 
##$RELAX= 
##$RELAX= 
##$RELAX= 
$$ Bruker specific parameters
$$ --------------------------
##$DU= <C:\u>
##$EXPNO= 2180
##$NAME= <ADRS>
##$PROCNO= 1
##$TYPE= <nmr>
##$USER= <dgb>
##$AMP= (0..31)
100 100 100 100 100 100 100 100 100 100 100 100 100 100 100 100 100 100 
100 100 100 100 100 100 100 100 100 100 100 100 100 100 
##$AQSEQ= 0
##$AQ_mod= 3
##$AUNM= <au_zg>
##$AUTOPOS= <5 >
##$BF1= 250.13
##$BF2= 250.13
##$BF3= 250.13
##$BF4= 250.13
##$BF5= 500.13
##$BF6= 500.13
##$BF7= 500.13
##$BF8= 500.13
##$BYTORDA= 1
##$CFDGTYP= 0
##$CFRGTYP= 5
##$CHEMSTR= <none>
##$CNST= (0..31)
1 1 145 1 1 1 1 1 1 1 1 1 1 1 1 1 1 1 1 1 1 1 1 1 1 1 1 1 1 1 1 1 
##$CPDPRG= <>
##$CPDPRG1= <>
##$CPDPRG2= <>
##$CPDPRG3= <>
##$CPDPRG4= <mlev>
##$CPDPRG5= <mlev>
##$CPDPRG6= <mlev>
##$CPDPRG7= <mlev>
##$CPDPRG8= <mlev>
##$CPDPRGB= <>
##$CPDPRGT= <>
##$D= (0..31)
0 1 0 0 0 0 0 0 0 0.06 0 0 0 0 0 0 0.0002 0 0 0 0 0 0 0 0 0 0 0 0 0 0 
0 
##$DATE= 1190623550
##$DBL= (0..7)
120 120 120 120 120 120 120 120 
##$DBP= (0..7)
150 150 150 150 150 150 150 150 
##$DBP07= 0
##$DBPNAM0= <>
##$DBPNAM1= <>
$$ [...]
##$SUBNAM7= <"">
##$SUBNAM8= <"">
##$SUBNAM9= <"">
##$SW= 20.6930455092707
##$SWIBOX= (0..15)
0 0 3 0 0 0 0 0 0 0 0 0 0 0 0 0 
##$SW_h= 5175.983436853
##$TD= 65536
##$TD0= 1
##$TE= 296.16
##$TE2= 300
##$TE3= 300
##$TEG= 300
##$TL= (0..7)
0 120 120 120 120 120 120 120 
##$TP= (0..7)
150 150 150 150 150 150 150 150 
##$TP07= 0
##$TPNAME0= <>
##$TPNAME1= <>
##$TPNAME2= <>
##$TPNAME3= <>
##$TPNAME4= <>
##$TPNAME5= <>
##$TPNAME6= <>
##$TPNAME7= <>
##$TPOAL= (0..7)
0.5 0.5 0.5 0.5 0.5 0.5 0.5 0.5 
##$TPOFFS= (0..7)
0 0 0 0 0 0 0 0 
##$TUNHIN= 0
##$TUNHOUT= 0
##$TUNXOUT= 0
##$USERA1= <user>
##$USERA2= <user>
##$USERA3= <user>
##$USERA4= <user>
##$USERA5= <user>
##$V9= 5
##$VALIST= <valist>
##$VCLIST= <CCCCCCCCCCCCCCC>
##$VD= 0
##$VDLIST= <DDDDDDDDDDDDDDD>
##$VPLIST= <PPPPPPPPPPPPPPP>
##$VTLIST= <TTTTTTTTTTTTTTT>
##$WBST= 1024
##$WBSW= 4
##$XGAIN= (0..3)
0 0 0 0 
##$XL= 0
##$YL= 0
##$YMAX_a= 190075
##$YMIN_a= -244283
##$ZGOPTNS= <>
##$ZL1= 120
##$ZL2= 120
##$ZL3= 120
##$ZL4= 120
##$ABSF1= 16.522
##$ABSF2= -4.171173
##$ABSG= 5
##$ABSL= 3
##$ALPHA= 0
##$AQORDER= 0
##$ASSFAC= 0
##$ASSFACI= 0
##$ASSFACX= 0
##$ASSWID= 0
##$AUNMP= <proc_1d>
##$AZFE= 0.1
##$AZFW= 0.1
##$BCFW= 0
##$BC_mod= 0
##$BYTORDP= 0
##$COROFFS= 0
##$CY= 12.5
##$DATMOD= 1
##$DC= 0
##$DFILT= <>
##$DTYPP= 0
##$F1P= 14.0000005364418
##$F2P= -0.99999901652339
##$FCOR= 0.5
##$FTSIZE= 32768
##$FT_mod= 6
##$GAMMA= 0
##$GB= 0
##$INTBC= 1
##$INTSCL= 1
##$ISEN= 128
##$LB= 0.3
##$LEV0= 0
##$LPBIN= 0
##$MAXI= 10000
##$MC2= 0
##$MEAN= 0
##$ME_mod= 0
##$MI= 0
##$NCOEF= 0
##$NC_proc= -2
##$NLEV= 6
##$NOISF1= 0
##$NOISF2= 0
##$NSP= 0
##$NTH_PI= 0
##$NZP= 0
##$OFFSET= 16.522
##$PC= 1
##$PHC0= 163.2852
##$PHC1= 1.461265
##$PH_mod= 1
##$PKNL= yes
##$PPARMOD= 0
##$PSCAL= 4
##$PSIGN= 0
##$REVERSE= no
##$SF= 250.13
##$SI= 32768
##$SIGF1= 0
##$SIGF2= 0
##$SINO= 400
##$SIOLD= 32768
##$SREGLST= <1H.CDCl3>
##$SSB= 0
##$STSI= 32768
##$STSR= 0
##$SW_p= 5175.98343685301
##$SYMM= 0
##$S_DEV= 0
##$TDeff= 65536
##$TDoff= 0
##$TI= <Analysis number 999999
Compound Code 99
Book Reference 9
Project Code 9>
##$TILT= no
##$TM1= 0
##$TM2= 0
##$TOPLEV= 0
##$USERP1= <user>
##$USERP2= <user>
##$USERP3= <user>
##$USERP4= <user>
##$USERP5= <user>
##$WDW= 1
##$XDIM= 32768
##$YMAX_p= 292736382
##$YMIN_p= -157969
$$ End of Bruker specific parameters
$$ ---------------------------------
##NTUPLES= NMR SPECTRUM
##VAR_NAME=  FREQUENCY,     SPECTRUM/REAL,   SPECTRUM/IMAG
##SYMBOL=    X,             R,               I
##VAR_TYPE=  INDEPENDENT,   DEPENDENT,       DEPENDENT
##VAR_FORM=  AFFN,          ASDF,            ASDF
##VAR_DIM=   32768,         32768,           32768
##UNITS=     HZ,            ARBITRARY UNITS, ARBITRARY UNITS
##FACTOR=    0.157963299565203, 1,           1
##FIRST=     4132.6476996994, 0,             0
##LAST=      -1043.33573715361, 0,           0
##MIN=       -1043.33573715361, -157969,     0
##MAX=       4132.6476996994, 292736382,     0
$$ Real data points
##PAGE= N=1
##DATA TABLE= (X++(R..R)), XYDATA
$$ [...]
30357 7542 -15503 -86260 -102717 -80156 -44247 -59847 -62664 -24866 -8777 -21538 -16403 2499
30345 2499 40827 42036 24949 34576 51202 45269 39069 34100 8507 -31949 -14189 -20654 -38805
30332 -38805 -19954 25536 56747 35477 -35488 -27614 -23346 15916 48724 37588 42909 -2944
30320 -2944 -16641 19340 41429 25988 -39669 -82949 -85373 -1575 34659 27160 30279 57519
30308 57519 58189 48303 50363 85956 67077 47364 14443 -9693 -3009 565 -12474 -8064 -10506
30295 -10506 13489 38233 -6854 -23148 -34248 1851 62474 63597 78782 75407 48374 40520
30283 40520 43653 48055 62329 34390 -6010 -10094 -11679 -15152 -7892 48051 72924 44950 15333
30270 15333 -2999 -50911 -52071 -22474 -40575 -45898 -62556 -35819 -17044 -38759 -55745 -51508
30258 -51508 1695 37548 43620 32309 -3187 16893 3635 -5884 -5359 -4452 16017 3796 13979
30245 13979 7297 29811 -6459 -23615 -37603 -20685 57089 99961 11882 -8400 -2289 -34931
30233 -34931 8087 -4339 -38455 -60262 -40405 2546 -8925 -11111 -12786 -22898 14598 6396
30221 6396 19793 -6421 -3790 -7025 -51740 -41273 15975 14013 16666 22935 -5698 6457 -34796
30208 -34796 -85116 -87919 -71209 -29065 -16843 -47136 -66999 -77719 -49742 -40719 25315 70064
30196 70064 66993 77607 86285 75218 16468 -14819 18389 39947 23947 22484 46860 49909
30184 49909 38417 29864 12199 27912 14797 24399 11965 17782 -11198 -31799 -5384 -24668
30172 -24668 -41436 -7962 -9298 -48562 -69870 -109451 -89822 -50811 -32124 -46821 -15578 -10142
30160 -10142 -14272 -15303 -253 14365 -2645 -35687 -20038 -44093 -54907 -52940 -33452 18861
30148 18861 49008 50553 75918 64261 78467 90535 100063 126490 64184 67731 20345 -42773
30136 -42773 -52011 -33019 -17373 -42843 -43745 -28653 -33189 -44384 -63960 -50457 -24022 -40129
30124 -40129 -35769 21248 68162 85014 44477 -2109 14300 -5979 -22992 7084 -26714 -100601
30112 -100601 -131665 -113083 -77132 -57478 -47250 -24566 -34900 -18890 -11942 -33320 -24093 -898
30100 -898 -46638 -81498 -61498 -53691 -31939 -14521 -49647 -52732 -67019 -54703 -84727 -47420
30088 -47420 -794 15966 12167 14900 26216 23604 45282 48256 62322 -7600 -56696 -41875
30076 -41875 -34519 -67570 -78074 -34946 55290 81109 78475 58812 75683 95775 31195 -18907
30064 -18907 -18179 -5820 -32 -5251 9502 2863 -18781 -70932 -44762 -35633 -42887 -39303 21752
30051 21752 65346 53967 22887 -34776 -50512 -41900 -74627 -94167 -34435 17889 38985 25882
30039 25882 22980 37327 43614 11970 -2551 -15860 -44821 -50365 -9946 38909 8387 4115
30027 4115 -24761 -30671 -36892 -4335 -4370 -25583 8773 34712 11784 26215 53298 39337 53225
30014 53225 45257 104577 108386 76665 68572 62762 80725 45805 -28159 -50743 -28338 -16869
30002 -16869 -13188 -8626 -32429 -88011 -87727 -62858 -14824 854 49767 47858 40679 14488 -22859
29989 -22859 -50753 -90780 -92675 -49540 -44420 -51863 -26115 13773 8901 -21865 -18832 -40102 -44734
29976 -44734 -51318 -48245 -15578 -12884 -4864 -25004 -23881 -9303 43889 50808 28334 26383 -15733
29963 -15733 -54753 -29137 -8682 36419 83751 81287 68036 14602 25331 9558 -12609 -26624
29951 -26624 10001 11465 -23470 -30709 -12856 18229 47921 42903 23198 19541 18300 -33630 -24307
29938 -24307 -46581 -73727 -43566 -19797 -557 -12446 -36977 -8546 -21846 -14741 -16766 -48343
29926 -48343 -28549 -8372 -4780 16892 43740 34364 61335 65332 16313 -41212 -31167 -35310
29914 -35310 -55357 -23141 3875 -13803 -29565 5368 35474 28741 -4787 -25564 -4362 -11806
29902 -11806 -29846 -32095 -48795 -42494 -50163 -41684 -28449 -13917 5577 -2569 18318 51167 42985
29889 42985 -22906 -26833 18677 22024 -28058 -50134 -29412 -38427 -24025 -26157 -57923 -60911 -123098
29876 -123098 -140376 -99739 -102502 -112774 -120478 -106396 -80402 -23225 -16417 -3602 -59999 -63175
29864 -63175 -54173 -30347 13052 -3047 4514 -26551 -73588 -62926 -25827 -33878 -26780 -27096 -191
29851 -191 -5707 -11385 -33892 -24333 7266 13341 33806 25910 -1342 5508 3214 18249 32624
29838 32624 61407 73186 65702 11986 -35017 -3293 -42929 -79025 -55254 -21977 -11792 328
29826 328 5487 17219 40779 11362 -39359 -57441 -19203 -6480 48499 74391 45686 22101
29814 22101 -7163 -1592 4911 15618 5392 25648 52396 82168 68114 14045 -17442 6752
29802 6752 -2811 -43896 -41904 -13383 22706 13087 -15028 27371 82101 103187 81253 22279
29790 22279 8310 -44722 -35102 -1227 21834 50531 50830 22113 -18637 -10178 4472 5843 38565
29777 38565 40975 18227 -23613 -66440 -98832 -35911 -18504 -39520 -25944 -23552 -11534 9548
29765 9548 28370 24795 27612 -7861 15422 -2658 -18722 -35842 -57918 -1972 7312 -4319
29753 -4319 -46333 -84200 -82700 -41765 18498 57532 52709 40509 10839 2297 -901 7165 -12952
29740 -12952 -42941 -38226 1510 10618 15205 -3761 13446 23979 29860 -1347 -9211 -911 -6469
29727 -6469 -28709 -53186 -60647 -27328 -40507 -46004 -24678 -20071 -20060 -27058 1046 29304 4230
29714 4230 -12702 9900 49523 48099 18749 16338 15412 -10139 1169 24638 12308 8621 -5504
29701 -5504 -74855 -65842 -39183 -48799 -53633 -70253 -76543 -66751 -19052 18299 68384 67351 97752
29688 97752 53590 1291 32206 33047 347 -24231 -2280 -6614 -57832 -43022 -20875 -18515
29676 -18515 -32082 -46006 -36321 -32590 -15192 25252 48935 21801 20349 50368 32665 29002
29664 29002 -20581 -79595 -88403 -100378 -81297 -56655 -61938 -66569 -61043 -59532 -33111 -69853 -40340
29651 -40340 23911 211 -19866 -11549 13777 -2633 -8059 11112 17255 6717 -43289 -97047
29639 -97047 -106257 -92827 -78690 -62988 -63021 -58791 -30871 16965 30477 8377 -32449 -37988 -1288
29626 -1288 38472 23327 11586 16007 49036 44148 -3157 -8268 10030 51427 94003 58742
29614 58742 28107 5565 -34361 -25169 9469 10813 -14404 -8223 28643 16847 29559 56808
29602 56808 9862 -24339 4407 64518 108049 101389 41567 26160 38766 60286 24009 -8408
29590 -8408 -59556 -63430 -48181 -72040 -124147 -101495 -52521 -55955 -40078 -16818 -16352 44050 71952
29577 71952 76200 42425 34384 30557 27777 21149 59241 63600 78285 89808 85732 51841 18802
29564 18802 9887 -6169 -15942 -26786 -17522 -622 6112 13064 53324 57869 52548 39305 -3094
29551 -3094 -8007 -9311 -20012 -25433 -25179 -14932 -41313 -54683 -5525 32126 44683 50884 75548
29538 75548 47398 -11413 -6389 5705 -4312 -50221 -47325 -38020 -48791 -25920 25582 7028
29526 7028 -18407 -17815 -33301 -11924 -18687 4064 -247 -18932 -76202 -82386 -26193 -16109 5862
29513 5862 -3927 -31992 1727 29795 52721 68435 12190 4774 38172 24478 -26101 -49879
29501 -49879 -13896 30536 72369 55761 27264 2588 -13765 -20149 -20023 -27793 -29571 -37331 -26577
29488 -26577 34339 49499 59451 33383 -19234 -62885 -40958 -4995 -15239 -28904 -38611 -33698
29476 -33698 -76744 -95026 -66033 -10532 15043 -18976 -62000 -88641 -61562 -21672 1917 9573
29464 9573 -23213 -41637 -48612 -71256 -47838 -16868 -4220 -31663 -41442 31578 41359 -49112
29452 -49112 -79172 -74696 -53020 -10138 2043 -18843 -40319 3314 43759 51941 44870 593
29440 593 -22326 -43188 -35728 -3450 -20 6744 3006 -28801 9521 52479 71245 59292 73334
29427 73334 41110 6415 -5518 15197 17432 -27991 -16654 17876 27232 47683 30395 -20246
29415 -20246 -60342 -76120 -60675 -54491 -26235 -24643 -15999 3111 12080 -16787 -62323 -75463
29403 -75463 -99189 -127042 -87577 -52160 -13498 10811 1531 8000 -16333 -36501 7293 37602
29391 37602 14205 13702 50067 75624 62991 56380 35180 2595 -7656 41013 30818 -17515
29379 -17515 -24026 3178 46509 49223 17602 6878 10368 -30311 -30301 -4375 37048 20124 27222
29366 27222 56198 70347 95394 77950 46007 28204 15806 -49386 -3865 25247 63 -61551
29354 -61551 -58063 30547 19814 9600 -22390 18253 49186 27859 -14086 -41950 -21696 -39354
29342 -39354 -60537 -41863 -6031 -7531 -19200 -16348 -14286 15581 -22074 -78437 -94020 -85740
29330 -85740 -15682 39454 15148 6635 29699 68987 46729 12197 24446 100 4731 -5196
29318 -5196 -23276 -8800 59492 99226 69008 52700 62712 74822 77695 80507 67734 -10179
29306 -10179 -79148 -65001 -52215 -75982 -84957 -72444 -29488 -33245 -60566 -9445 12282 4704
29294 4704 11177 28209 25648 37988 64682 76141 84729 95981 84853 45378 7534 -11724
29282 -11724 -37444 1113 29104 36310 47736 38388 20615 63420 60562 64949 8649 -1598
29270 -1598 31691 79163 115481 146376 121592 86055 37001 -3726 13186 19397 47730 57119
29258 57119 32692 -2759 -8692 -8131 354 15285 28958 33273 59837 22806 -43703 -12889 -1870
29245 -1870 -7539 -953 10615 23600 34150 46414 109434 108674 48173 438 -31949 -30482 -27742
29232 -27742 -20276 -11931 -25641 -34910 4631 28247 49301 37523 21076 66294 62169 68082 40075
29219 40075 24592 -3755 14126 29920 41933 42540 37951 37261 4587 -76773 -61141 -2938 -20316
29206 -20316 -12635 -3207 16628 47629 29624 21977 33480 38434 21688 21674 2816 14992 38630
29193 38630 56089 47671 -6771 6294 7047 7496 22296 11567 -1002 2990 -18216 -34895 -24126
29180 -24126 4610 37815 59290 29607 7105 -9774 -15822 -29917 10148 21036 3735 -6867
29168 -6867 -3076 10190 15508 39622 94731 102152 58315 32832 20023 10215 8679 42945 3445
29155 3445 -15852 2699 42118 53195 48981 62775 83742 106753 64747 34561 26530 31333
29143 31333 22080 -4926 -51940 -32761 -9753 1317 -18653 6963 9943 11552 16888 41231
29131 41231 46110 79744 68838 45071 -8002 -47057 5690 48652 26282 -26117 -24718 20498
29119 20498 19146 -793 -9872 27028 23484 36229 69663 49450 57240 20999 22575 2000 37591
29106 37591 66709 30150 -3035 -8986 4723 28086 71263 89517 71238 36192 52225 77994
29094 77994 71299 86118 89657 72902 -98 12244 39216 33236 -2097 -8752 5278 10421 28956
29081 28956 1541 -33698 -92491 -109148 -98894 -106833 -43339 14795 1366 -22911 -6938 -1308
29069 -1308 12815 23223 -4399 -30794 -18302 9966 -13310 -40429 -30930 -55545 -36180 -36564
29057 -36564 -44857 -23817 12686 -3308 -29861 -10287 -4276 4551 -8526 25621 119662 109427
29045 109427 75344 48855 53612 67607 74319 89517 73160 45352 18261 17342 13497 43489
29033 43489 41820 39912 32450 -2260 -6030 -13318 -26965 -27035 -12141 10454 -4838 -10023 12055
29020 12055 25916 42785 43639 49608 5961 14153 -1959 23903 -12104 -37470 -53023 -75801
29008 -75801 -65130 -53770 -31697 11936 36156 26334 23882 27946 50772 44413 1550 -17618
28996 -17618 27279 48345 27484 23484 32496 7486 -16519 -8704 21793 60916 68232 54137
28984 54137 27304 16691 6062 -30532 -55364 -25663 19916 29275 31873 21953 21397 26372 35144
28971 35144 41718 -9027 -16088 -37188 -37892 -32092 -41602 -40501 -47551 -43115 -16506 19987 44415
28958 44415 43456 25210 -19101 -4761 10077 -17113 -9430 22028 38171 -7947 29084 70380
28946 70380 61989 42791 53930 51505 6644 -48735 -61711 -78046 -55300 -20526 -17106 22351
28934 22351 43019 23796 21361 -4798 -51154 -71092 -124628 -63247 -9822 46494 30297 9691
28922 9691 8405 -13032 -11896 7953 12170 -11754 1191 43564 52616 40374 -10649 -21317 28606
28909 28606 24414 17125 -10869 -35415 -10506 6724 -17417 -49748 -58174 -42844 -16715 -5968
28897 -5968 -50643 -54214 -13036 15943 6622 21944 5807 -310 15801 7374 -25435 -68482 -63107
28884 -63107 -89172 -36195 -5664 -10936 -55912 -51062 -39023 -27973 -38167 -40067 429 27524
28872 27524 39296 12411 -37718 -2859 41245 33576 25945 21510 14823 35044 25665 1335 16534
28859 16534 20115 -19423 -35997 -6437 -13759 31431 44315 54626 48453 3561 27585 56938
28847 56938 28876 -7474 -13236 -48794 -61125 -92352 -81689 -86868 -58215 -37627 -55672 -18222
28835 -18222 -2571 34284 17579 33726 23567 65349 64577 50845 20246 20671 23722 -18140 -32633
28822 -32633 -38145 -27068 32073 62288 39463 26720 27852 40052 34353 33041 32058 48158 52008
28809 52008 13075 -13045 -16689 5617 -15863 -36117 -18765 6607 18349 13460 3019 2969 41
28796 41 2657 10018 8836 28657 21176 6195 18756 7888 -562 -30178 -33436 -8026 -18945
28783 -18945 -33003 9394 36174 53504 26651 36370 52313 81377 94503 123392 98018 3966
28771 3966 -10009 14564 2324 18586 -5746 -58980 -61261 -44371 -14842 -2168 15912 -9573
28759 -9573 -27221 -43125 -74896 -48392 -9530 10561 14650 1402 1260 4454 3942 35596 23418
28746 23418 17367 23907 21681 32297 17336 10465 21306 3813 -26514 -112 33613 13653
28734 13653 2963 -8554 -8062 -51692 -95142 -93438 -65943 -61243 -54976 -20466 14198 14552 17599
28721 17599 -12642 -4953 -1592 -14730 598 20879 25802 -7449 -7105 11305 -13088 23103 30580
28708 30580 57328 20925 -5559 -25107 -10201 6804 34247 67317 130394 143440 104545 82016
28696 82016 28109 -54700 17958 50716 48903 -111 12276 13259 17897 -9110 -16242 -21655 15253
28683 15253 10445 -58026 -102143 -68900 -19524 34156 33425 16821 -6745 -7986 -5900 -15137 -2637
28670 -2637 24412 -13563 -44007 -50619 -8827 16365 -25019 -32948 20622 49711 54952 34491
28658 34491 25365 6460 4233 -984 -26835 -58902 -22533 17456 -4552 -23849 -33249 -22842
28646 -22842 -921 4435 38079 48508 46967 19650 -17070 -39631 -32079 -7794 46465 60375
28634 60375 63190 94376 86093 21701 17028 24520 -26066 -53529 -4778 -30693 -34514 -18875 -37456
28621 -37456 -37815 -15188 -44371 -48095 -13311 -1838 27777 42150 42183 31818 5 -639 9656
28608 9656 34328 32767 9869 38544 44745 65570 37219 5340 23010 -1900 -10433 -30120
28596 -30120 -12348 329 17532 36098 35767 17893 -25170 -9877 19707 6127 -8565 10984
28584 10984 38359 18261 -46465 -70918 -71132 -36569 -5437 14900 42429 54206 19688 3088
28572 3088 -51129 -63127 -9849 -18731 -12295 22310 -18752 -44830 -50691 -31367 -48517 -109311
28560 -109311 -147448 -73802 -16339 8173 -3434 20623 4208 -17137 -1183 -22593 -14241 -1051
28548 -1051 -4289 -27069 4725 18997 25494 13473 -7934 13597 -3167 13012 47302 36604
28536 36604 13427 7463 4317 -32864 -7839 -20710 -39567 -50963 -55792 9661 35387 41103
28524 41103 37395 17879 -10490 -18998 -27341 -47733 -45457 -6346 6955 3403 10836 10723 -12993
28511 -12993 -3666 46114 46651 59679 75764 65342 54987 16963 -37745 -66820 -56034 -5326
28499 -5326 18986 6851 -7880 -32172 -47159 -79164 -109106 -80857 -59274 -44025 -4670 -10431
28487 -10431 -31635 -25360 -19779 5999 28481 35739 -5116 -62861 -50047 -22005 -48444 8533
28475 8533 22708 9684 44359 47312 42074 63874 37712 3635 51091 74824 45304 28214
28463 28214 91177 123459 72338 35591 6353 -15719 -20011 8350 14841 17353 36105 24334
28451 24334 28171 54376 63380 56668 30957 35880 37957 36657 41444 53694 51542 45728 22277
28438 22277 -311 14242 6115 23999 -28706 -27595 2831 25331 33029 -1214 -38044 -12937
28426 -12937 1241 9949 21467 -13009 -45025 17911 49157 29 -15543 -21660 -19204 44435
28414 44435 80257 73276 45556 46433 25418 3700 13356 32035 37419 43339 66579 58531 53292
28401 53292 38543 13582 34510 10574 -6464 32743 39412 25278 22006 25942 48030 1421
28389 1421 -20177 -6041 -26581 3109 54395 2957 -66078 -106134 -89752 -37251 9160 -24587
28377 -24587 -45958 -35497 -68594 -21710 39307 91080 86377 60438 28589 11552 -19448 -43637
28365 -43637 -53985 -78081 -118098 -136820 -98267 -20592 -2889 38049 38306 21367 -19988 -7067
28353 -7067 9071 7019 33770 50202 12840 -30176 -26349 17980 24180 22214 48105 28756 33915
28340 33915 68693 80011 72480 33488 14897 12184 -30446 -47025 -16718 12682 -16123 -46071
28328 -46071 -38442 4638 21030 54599 38742 53088 18852 -215 -20780 8884 24264 41729
28316 41729 33409 51506 46569 52003 31879 9625 -16813 -25791 -15302 7269 -35686 -3860
28304 -3860 -8308 -29780 -60661 -45696 -50152 -38305 -2413 17865 27653 2257 -5522 -58241 -75223
28291 -75223 -28873 13920 41731 14357 24914 23610 -18479 2814 9967 21830 30075 52034
28279 52034 44229 52076 58517 39957 639 -9315 -2552 7636 3344 -1509 -67574 -137200 -102005
28266 -102005 -52085 -43084 -60630 -35927 -38504 -45326 -42879 -72466 -59971 -12023 4237 13489
28254 13489 -36620 -28249 -3633 18086 42601 45272 22528 21136 27881 36516 -8651 -20087 12960
28241 12960 53788 61844 9670 12862 61160 52294 47373 42063 28461 32882 51906 35957 36294
28228 36294 49033 35932 59565 75501 54024 44133 55499 73917 58638 3146 3881 -11924
28216 -11924 -34196 -15857 -20817 6291 -24185 -68932 -23366 48415 100266 42752 7596 -17607
28204 -17607 -17323 17347 51289 77623 60975 1476 -38038 -392 -10114 47339 81218 80043
28192 80043 68558 60080 84444 101606 88247 87541 65540 -1992 -43470 -97658 -97158 -69471 -35675
28179 -35675 -32921 -49838 -7679 -27037 -16994 -19142 -37463 -31121 -41508 -65654 -61046 -2120
28167 -2120 13920 17373 -14531 -50693 -51903 -23037 -55404 -70570 -74014 -70119 -76172 -27005 7315
28154 7315 -31384 -71226 -51386 -33224 -28088 -13104 -37132 -37773 -19774 -46759 -31056 4658
28142 4658 6301 -2530 18421 8369 23212 27124 -15871 -48717 -54621 -29339 -15111 -20611 -8466
28129 -8466 -45145 -26861 -35515 -46292 -42844 -45450 -40516 -1034 32266 28268 14234 5718 10962
28116 10962 -16865 -9847 13119 11252 35497 29477 31487 37182 68902 43195 11869 19919 23005
28103 23005 4057 20340 44729 36387 -6142 -12670 6701 41641 68027 62604 100203 114164
28091 114164 60553 -6767 -29643 -12841 -13175 -30566 -72209 -57505 -15426 -7131 -31156 -12067
28079 -12067 16091 15308 33178 41456 -8117 -40165 -47372 14294 42146 12833 -33140 -30120 -27899
28066 -27899 -44584 -21880 4207 6884 7830 -3332 -16500 12749 17127 -17041 15195 29411
28054 29411 10888 22653 6845 -3869 16268 -18678 -75843 -67192 -38026 22841 19457 12201
28042 12201 27017 21231 7381 -12622 6721 14780 20029 39749 46390 96706 77725 27720
28030 27720 -19265 -28703 -1019 -19458 -38594 -62593 -90913 -29868 24751 17243 -14542 -4274
28018 -4274 62375 79644 34474 33803 43953 -3330 -29748 -16783 -30744 -54876 -53527 -42797
28006 -42797 -2828 10797 23778 6008 4617 14743 9380 139 45897 65622 72278 57761
27994 57761 -1168 19796 15106 -745 -11514 10069 31378 5277 19725 1563 3550 34035
27982 34035 67206 81691 61719 10405 -853 -1327 34213 63818 82652 44406 2431 -9111
27970 -9111 -14106 4434 15112 -18226 -35418 -20296 13708 -5560 13216 37142 554 -18869
27958 -18869 -27440 -42258 -20591 -22340 -49980 -70102 -20270 -14218 -61746 11797 20769 -38011
27946 -38011 -76030 -15583 -7192 18662 32410 52389 51098 26965 9972 27871 14551 7163
27934 7163 34564 13621 26980 25846 11152 36243 39616 14200 -14883 -11263 -28016 -12834
27922 -12834 -46126 -99807 -92974 -73884 -79964 -77247 -62067 -33720 -512 8512 29711 33497 24001
27909 24001 42527 33472 -8558 -30048 -20687 -56419 -49579 -48899 -64380 -77033 -52967 3606 -11031
27896 -11031 -11834 14314 35204 -394 -5743 9962 57462 36025 34959 11959 2476 -578 -4366
27883 -4366 -7609 1283 -6329 12366 35012 41797 -142 -57625 -72233 -73370 2301 44261 48048
27870 48048 31769 47677 54717 49329 2635 -12319 11256 36226 51987 34042 27446 31685
27858 31685 45462 46929 21694 12837 2802 -20333 -18752 1576 12328 27707 -4319 3264
27846 3264 26229 31047 5261 118 -16258 -45955 -66565 -54723 -31242 -36903 -81369 -69266
27834 -69266 -32528 15370 10345 -13765 -37891 -36848 -3255 44024 52825 84261 59587 -1549
27822 -1549 -3916 -3826 -14665 489 16458 -19461 -49540 -20570 15155 20440 48462 22730 -33417
27809 -33417 -50142 -30196 -8864 5256 2749 3024 2939 34479 43022 11969 -32870 -33169 -31913 -10203
27795 -10203 30981 20495 848 -921 33062 36971 33875 20387 -2779 -18793 15702 36497
27783 36497 6258 13784 49964 19012 5068 -3529 706 168 2852 3347 -5754 -34166 -41328 -42396
27769 -42396 -25636 -7911 -7553 -2784 -51554 -51013 -25476 -25789 -7737 -2143 -4001 -2267 4394 -9387
27755 -9387 24333 56303 47573 117 -35909 -73958 -42748 -13371 17258 45814 48476 65799
27743 65799 106139 70173 61026 21086 10015 24084 43242 -3212 -58970 -74505 -64987 -94710
27731 -94710 -75205 3155 13759 -9247 18762 33637 31623 20153 12857 -5435 -17514 -41300
27719 -41300 -27304 17273 8697 -39627 -60384 -45808 -9241 1207 88 3164 -12833 -53670
27707 -53670 -53509 -1098 20310 -21604 -68396 -62956 -34003 -35989 32006 57063 25611 -24232
27695 -24232 12929 10405 -3631 -53147 -62505 10725 34171 56298 60947 61817 32308 16233 5468
27682 5468 -1934 779 42771 25302 2928 31274 39099 18111 -11713 36124 44845 21171 880
27669 880 4315 -19083 -18385 -7066 4682 23477 67660 79513 98007 60307 73896 89154 94089
27656 94089 87488 79275 88358 87798 55413 12614 -5803 -29805 -39035 -5682 -24103 -36161 13974
27643 13974 55896 104554 101465 63208 53570 34026 -14083 -42450 -65383 -59328 -75865 -65045
27631 -65045 -34321 10361 -13888 -42931 -76716 -121147 -95374 -32378 15365 -537 -22674 -49666
27619 -49666 -48070 -14529 1121 -34462 -9950 37071 64118 109927 89638 -5545 -88001 -84252
27607 -84252 -108841 -68067 -24820 17651 35070 14129 24773 23135 -9651 -17040 -8581 -8266 18585
27594 18585 9720 -15096 -25309 15883 3000 -9107 -4860 -13689 31173 59729 44298 46964
27582 46964 48343 65427 77655 57336 87750 104034 76236 58654 56906 44692 26966 13492
27570 13492 10666 6354 3604 -7826 4414 52859 92173 97282 57220 15442 9232 -10394 -35854
27557 -35854 -62659 -68321 -20844 25234 27638 19601 -10222 -57539 -52119 -47917 -46482 -53991 -53596
27544 -53596 -2129 15314 15203 5438 -45425 -50885 -20595 -3126 177 -14863 -26548 -12719 -3012
27531 -3012 -13319 -13030 25695 -1854 -56566 -66888 -30600 -38278 -10468 23789 -6786 -39358
27519 -39358 -14213 -13712 -38187 -86934 -90838 -14060 32491 11508 -2538 43060 99888 69666
27507 69666 2224 20571 24313 -11490 -16170 19142 67471 38959 -12858 -9068 -10560 -2767 -11336
27494 -11336 -32747 -54386 -68126 -55885 -55488 -58610 -77921 -61914 -38646 -2044 6250 4005 11856
27481 11856 -165 1605 7705 17583 -735 -20923 -22268 22674 12059 25533 34750 18241 -32440
27468 -32440 -72436 -74196 -25975 -32186 21105 50425 5710 -10395 -31044 -66708 -58916 -68678
27456 -68678 -82557 -71073 -44529 10615 65360 66017 47062 40684 22640 27477 25299 3490 -13194
27443 -13194 -26431 -14428 9309 20057 46271 38861 44642 51319 15735 -25641 -31986 -9557
27431 -9557 3397 32930 72226 39255 -11154 29167 34132 3073 -7190 -13688 11753 35201
27419 35201 37445 17108 6997 -20379 -6422 58326 67759 20454 -29435 -27092 -54182 -93921
27407 -93921 -80749 -15804 10350 -48288 -49178 13996 20491 7814 9264 34692 40736 27701 33117
27394 33117 32767 13274 5816 -129 -705 -6722 -7104 -9278 -34645 -21971 18950 29699 14827 10260
27380 10260 36589 41853 28125 8754 -33192 -62306 -49616 -24433 5182 22337 -1000 -40464
27368 -40464 -43051 -46597 -54864 -38180 -34911 -34573 -36629 18107 79657 68186 75210 97459 134572
27355 134572 151795 111100 24106 -2308 29145 50110 22817 -2608 21885 16768 36756 8159
27343 8159 -39852 -39202 -21840 -63693 -65473 -41017 -15415 -9168 -11168 21514 44051 28099 -25580
27330 -25580 -32660 -55279 -26335 50873 46265 29653 -29822 -31267 25907 36331 40826 48112 6849
27317 6849 15252 45059 17793 33516 71233 61124 67670 78772 48512 -2160 3459 18636
27305 18636 13456 -31382 -55578 -88656 -86065 -58958 -23665 -27681 -51072 -36493 -31235 -36986 -50767
27292 -50767 -40349 -18363 -35526 -32039 -9320 49757 64548 30463 25200 25775 -5457 -37024
27280 -37024 -17434 -35411 -28205 -44932 -28889 -2130 19745 -28895 -24487 7388 11595 9051
27268 9051 -20774 -23455 350 5463 -11062 -17372 -21328 -11034 45198 43683 42614 57681 38833
27255 38833 16812 26862 33256 17571 50160 59225 68228 34432 31755 343 -26104 -8042
27243 -8042 -22333 -34164 -11565 -10119 -38843 -37799 11232 43412 28734 5924 -41690 -74882
27231 -74882 -93306 -66086 -47178 -40112 -23250 -10503 -20919 14899 -8899 -32868 -14600 12943
27219 12943 14982 -49507 -100777 -61301 -29397 -17939 -4300 -4081 -18390 -36079 -61832 -29101
27207 -29101 12836 47431 55677 65114 59589 57920 21017 -55574 -56049 -1250 52778 60030 46769
27194 46769 31587 -5490 -44188 -36677 7531 21916 3859 17161 32451 17152 4546 -18981
27182 -18981 -18469 45 5344 4985 -25596 -884 39646 49163 33717 -32360 -41220 -30139 -18410
27169 -18410 12028 36164 19744 48979 44271 38062 -698 -57500 -89353 -37473 -10630 12901
27157 12901 58287 74899 33762 14150 16456 46243 78122 59994 2673 -24099 -42784 -44677
27145 -44677 -50295 -37994 -35161 -47364 10627 24622 12594 -7984 -9270 -30697 -36773 -16223
27133 -16223 -7477 -13294 9137 13344 21758 19921 3700 -15082 -34072 -68927 -37553 13395 10967
27120 10967 14893 6666 -5770 -12331 -30033 26828 5367 7695 36071 18727 18697 31268 43336
27107 43336 66233 37946 575 8935 28166 35183 6584 17811 60623 45249 8944 23775
27095 23775 35419 -12673 -58811 -32625 -4231 -26911 -6064 -23864 -10458 33298 -996 6634
27083 6634 6684 -36264 -32244 17165 41469 36573 33625 -22685 -47671 -35266 -24138 -13491 -14253
27070 -14253 21583 13988 16338 30136 27601 -18797 233 -30720 -64654 -66414 -24824 18451
27058 18451 18470 10619 -45659 -90372 -62572 -25104 -34831 -25028 -7883 1322 -53019 -74090 -62537
27045 -62537 -58481 -67092 -35025 -7647 -13083 -227 18411 34227 50616 68225 82282 75881
27033 75881 62828 48879 24817 31778 36920 9808 4487 -14330 -12529 -16756 -14716 12169 15201
27020 15201 29589 33587 40748 46273 34333 34902 28553 7408 19254 17968 -40148 -39307 5168
27007 5168 -22042 2278 5517 8011 20443 64480 69971 45939 47945 90535 87945 58000 37826
26994 37826 14450 14441 50742 29306 -2707 -15532 -26952 -25305 -1186 28897 14199 13421 -14354
26981 -14354 -24029 -43627 -20580 -46940 -15201 -27344 -36201 -21940 -34734 -51508 -50221 -28984
26969 -28984 5133 33628 26931 -358 15070 9413 6805 30850 39579 31254 37207 13761 -20784
26956 -20784 -21019 27619 87958 109489 92317 77074 34991 16250 7489 -12743 -15772 -7877 12104
26943 12104 23656 13654 3518 1142 5127 7776 17801 3311 -7912 -38619 736 29728
26931 29728 -8366 -23378 -42405 -15525 -10797 -34579 -2869 29797 18074 19775 34692 37308
26919 37308 4137 33839 63073 49209 36068 -4857 -6761 -17196 18975 7172 -12324 -9346
26907 -9346 -23378 -14956 1477 15103 -2156 -26014 -7249 11973 -49568 -76640 1128 -8145
26895 -8145 -21685 26673 11246 -7965 -39110 -26298 32327 68311 49837 7672 -8965 -43670
26883 -43670 -62919 -26355 -8947 -8595 29881 1397 -28580 -35109 -27340 -50597 -66709 -46453
26871 -46453 -33585 -26084 -65493 -55725 -14664 -5065 -46475 -50667 -38476 -25825 -3875 33855
26859 33855 2926 -22486 -40819 -47194 -19539 46791 53956 42385 25406 27703 28445 26827 29787
26846 29787 55191 42911 9615 -6721 7835 19711 35411 49339 78016 56967 45801 71270
26834 71270 62248 24609 -7195 -17820 25639 71360 57492 48348 47873 18092 1787 23337
26822 23337 -3771 -45560 -55754 -20399 -27354 -60850 -61753 -54744 -37646 -32177 -4517 41467 40803
26809 40803 34374 13652 15856 37442 28702 30872 45217 19948 -10270 884 29762 52052
26797 52052 35757 6713 -6784 -18779 -33296 -25655 -29361 -61762 -37936 -22179 -6523 -30999
26785 -30999 -60173 -46583 -23294 -26884 -13612 29287 40494 43585 56369 35220 -5649 -3568
26773 -3568 3611 22557 4816 -33261 -50811 -73718 -49513 -18937 11395 66870 77481 81233
26761 81233 75932 65492 27 -7746 -41 23084 91574 81833 25523 -36055 -16630 1642
26749 1642 -25512 -13217 -16964 12805 38010 76848 79873 68051 43666 -7413 -10583 32751
26737 32751 79002 76360 52734 15706 21183 2619 -22306 21544 1934 -19264 -17565 -26100
26725 -26100 -65027 -94116 -71017 6713 32255 26689 39483 31007 76641 95081 55540 24558
26713 24558 20654 18444 -18424 -20 4245 20538 50531 34261 17999 9263 25662 -6678
26701 -6678 -24915 -22671 -30717 -3426 -16921 2549 38681 51038 3681 17562 57764 44995
26689 44995 -2828 11386 25391 -28539 -33980 -17495 -30924 20275 73242 101950 98772 87647
26677 87647 87472 88196 43569 20718 45793 46959 25905 20987 12731 29645 25595 10297 -4297
26664 -4297 -37482 -38230 -54149 -10837 4114 -36558 8753 31874 13209 -28658 -30137 25580
26652 25580 40739 17180 2628 -24648 -31701 5892 57673 57433 32093 10203 19179 8803
26640 8803 6138 -7571 28575 28803 6120 -4686 -17391 -2071 1676 -14711 -34792 -38886 -41436
26627 -41436 -44547 -2995 55223 52029 16344 -2093 1265 -38931 -56345 -48599 -19910 19283
26615 19283 27714 61529 88650 81966 88753 48099 20047 8673 -4055 -26851 -27179 -42396 -78255
26602 -78255 -55228 -51861 -38187 -13076 -15479 -21010 16775 52162 677 -21677 -23870 -32425 -10889
26589 -10889 -8852 18938 -10353 -50151 -12017 5233 -24204 -4906 -21997 17446 47759 32793
26577 32793 34016 45240 58403 15267 -37003 -18627 3518 -52275 -50399 -19152 12628 20602
26565 20602 -9888 -26117 -7668 7894 -19202 -29888 -27635 -168 41604 64201 47076 6040
26553 6040 -67593 -82629 -28071 -12132 9091 22117 15642 18972 51097 63566 73404 46402
26541 46402 -147 18017 49308 31014 25615 43389 13890 -25304 -35909 -521 37639 75641
26529 75641 69897 40357 53919 -1941 -85562 -47479 -9090 27510 49562 51794 62694 50534
26517 50534 11412 10832 2170 4699 30055 -11029 -23903 12439 19629 10600 -9164 12027 20420
26504 20420 -9432 -41800 -58111 -73010 1549 35470 14443 1936 -10067 -34697 -38889 -37431
26492 -37431 -29788 -50548 -41672 -48285 -10182 18757 24404 39601 53783 62404 44762 11421 -11646
26479 -11646 12019 2805 -36184 -30108 4592 33130 7704 -26329 -51916 -64323 -27709 -22478
26467 -22478 -22828 -143 30384 -4378 -225 -7473 3283 13239 -20102 -30586 -3742 -7995 -4874
26454 -4874 29511 25112 50242 31698 27506 77934 88991 63458 79014 109934 119238 76842
26442 76842 48047 -2566 -23122 28614 34782 3822 -19410 -11948 31989 57411 41578 35983
26430 35983 3148 -4293 2206 12613 -409 -16493 9581 28831 24660 2182 -3404 -13219 53252
26417 53252 43769 42556 87315 61860 15605 47278 73150 40561 49107 74428 69463 23919
26405 23919 -4356 10560 64876 57472 11870 -34993 -58080 -45975 -4599 -5450 20295 25970
26393 25970 33899 75881 95748 86510 44151 -2221 -24376 -76979 -115135 -81904 1894 14326
26381 14326 -13036 8563 4241 42033 31401 -10558 -31002 -28616 -33104 -17349 -20077 15955
26369 15955 -2227 -40189 -65178 -42380 -16990 12567 15593 -18822 21279 52258 15484 35122
26357 35122 46877 2351 17049 13052 14341 -9232 -9664 7150 28929 32200 3143 -39515 -33975
26344 -33975 -1314 10515 65654 102805 56840 24135 40110 52942 -5910 -27832 -8423 117
26332 117 -5381 15027 -18788 4669 37902 46406 33977 13420 16482 25443 31933 16440 1689
26319 1689 15011 41604 5354 -11876 12032 -20293 -9743 15983 40282 7277 -10418 -24545
26307 -24545 -5982 38949 63195 15290 -12359 -16550 -16580 -37048 -26181 -15016 -5304 12346 18198
26294 18198 32832 23398 30158 -4411 -415 16687 12186 -12777 -2186 35047 58207 85992
26282 85992 95083 61562 32353 -50716 -101957 -91907 -42898 -9624 8668 39286 21703 21482
26270 21482 31781 28019 4946 7935 20882 34764 3633 -39561 -30543 -1881 -10820 -13329 -25648
26257 -25648 -21840 -52383 -29945 -12271 -63494 -84343 -69162 -7634 34512 -21638 -31555 10219
26245 10219 17082 33518 14189 -19234 -9682 34712 39081 19268 8500 9429 -22663 -4394 8446
26232 8446 4359 15142 51482 19078 -17244 2310 7470 -14560 -30878 10987 -25144 -20931
26220 -20931 -8689 -36874 -63307 -50211 11008 18829 36574 58141 57015 19791 -4147 -17792
26208 -17792 -24754 10432 5436 -3922 -5524 10741 45642 24383 -7886 3297 25368 -30794
26196 -30794 -77020 -55238 -40093 -15179 -22018 -7651 18175 47319 27321 20078 -3022 -11949
26184 -11949 26275 44227 21144 -13362 -59849 -77386 -61556 827 11331 39184 30566 28371
26172 28371 -3401 61492 72642 -11072 -18536 -7188 -9802 2073 1983 18685 -3863 19162 57778
26159 57778 3974 11437 43892 41462 14620 4880 -4709 -38866 -38203 -13721 -9455 -17546 -24898
26146 -24898 -74660 -80567 -25331 5575 17939 11111 -14578 -29337 -42667 -51698 -9935 -9601 -7784
26133 -7784 27733 41270 25294 -2536 -11135 -20253 -23363 4313 -32304 -4974 1652 -5375 14859
26120 14859 40342 26762 -13172 -34969 -58040 -91011 -39271 -11338 -46775 -67374 -29845 13133
26108 13133 18703 19960 27395 46078 17210 -7713 5691 16635 35420 48405 19953 57973
26096 57973 87789 50220 25585 9938 36961 21192 1406 15829 34672 44089 20330 2910
26084 2910 -48024 -40903 -26358 -19225 30302 45314 19163 51554 86145 57974 42330 64162
26072 64162 82328 82590 39940 17765 35761 30348 4983 -47691 -89356 -66088 -56990 -27415
26060 -27415 17585 76549 59559 23823 60342 110706 102873 89321 91268 16899 -13962 -46905
26048 -46905 -45077 10410 37900 32037 21477 30614 -907 -15340 -56919 -72924 -38191 14972
26036 14972 61883 42706 7774 32197 45993 19350 -14073 1285 -7210 -4225 -8061 -34889
26024 -34889 -54664 -43806 -33349 -20886 -10887 4965 1688 -2127 -9844 -23195 -20303 -35370 -47926
26011 -47926 -52969 -56123 -50308 -28870 9508 -6136 2755 8710 -5845 20587 37254 32283 -2291
25998 -2291 -32959 -54373 -42160 -35495 -8120 26392 39552 17495 32757 49629 78925 54736
25986 54736 18387 42217 47201 49192 56948 25731 -21432 -16710 -9556 -70560 -80066 -35158 9965
25973 9965 67088 86457 70221 35008 33945 29369 -20565 9476 58569 19816 20959 61159
25961 61159 52979 104381 139570 81175 7415 -25378 -7350 8405 2733 -20255 -19772 20343
25949 20343 38251 30167 62451 48964 11191 14056 -16211 -29178 -15586 -34089 -35862 -6100
25937 -6100 -28620 -43842 -34625 -6841 -1828 3796 -14795 -41878 -81389 -50098 -36480 -15661
25925 -15661 22063 7280 11926 40592 49038 30729 15175 -15719 -68003 -56733 -53979 -33152
25913 -33152 4020 22870 16375 -17295 -35231 -12038 9593 25115 36464 15622 18740 -17906
25901 -17906 -25189 -34936 -38608 -35274 -16215 -34490 -22518 -46620 -61140 -62320 -53472 -50160 -55352
25888 -55352 -47676 -54268 -38822 -11529 -5824 -12030 -33135 -35684 -7673 -32758 -36879 -31462 16447
25875 16447 40176 40022 45946 34416 28173 36840 31836 3355 45646 41276 9397 -28355 -23659
25862 -23659 23648 44815 38299 -5700 -4490 54235 61565 30750 41485 35149 -1980 19692
25850 19692 4977 845 185 57476 34936 -4969 11834 24375 1520 -15353 -21138 -64398
25838 -64398 -30503 -3025 6344 -37625 -13170 11034 8292 2065 6096 30411 38734 2329 -13837
25825 -13837 16109 6495 4807 -24631 -30080 -25762 -873 29628 24896 -26015 -43778 -13369 10977
25812 10977 4605 11989 4880 26298 33588 15814 9383 27614 33367 38727 28979 17733 -3412
25799 -3412 13782 16491 11393 13558 3394 15027 -997 -22965 -5183 14110 3408 4251 -1527
25786 -1527 -54703 -31531 7348 40026 19044 11699 5151 -42358 -59757 -61801 -15542 2889
25774 2889 5956 16633 41737 51628 44545 4431 -41677 -66116 -31695 -11704 17878 17302 27411
25761 27411 51609 6272 -28233 1065 13991 15306 5792 8575 1006 -1594 14125 12203 39873
25748 39873 25643 11403 37202 48739 45041 30854 5960 13612 35410 58526 69315 37296
25736 37296 31808 46075 4484 -20078 -29979 -61707 -57768 -37041 -28001 -15337 24870 -8173
25724 -8173 -45550 -61100 -61346 -39949 -33835 -4932 2887 20979 30728 -4662 19715 48036 2776
25711 2776 -27265 -21872 -19396 -16426 -35994 -9875 39246 26800 12212 684 -7077 -2108 -21353
25698 -21353 -13907 26217 16730 -11289 -3676 9183 -8236 13636 -11985 -15608 -53220 -33863
25686 -33863 -15710 -54704 -75537 -97414 -48732 -35874 -13825 28480 43098 37582 55449 53251
25674 53251 32005 56203 9496 -416 5675 6445 -21286 -39590 -64161 -57011 -33721 -19916 492
25661 492 14851 21347 43318 22752 3034 4064 22415 57737 55430 16888 13538 4669 33695
25648 33695 33961 10346 24656 7892 -49724 -33945 -2212 -20514 -5337 -1836 16972 12307
25636 12307 -12765 -1263 31781 35345 -12394 -28391 43 -19007 -24615 -16344 -16525 -20411 -659
25623 -659 4920 9242 27207 36373 37188 25956 43623 22399 -2318 -13707 -26855 -36647 -10240
25610 -10240 35847 41094 23519 -2989 -2634 15668 -6950 -18951 -957 15494 -25896 -35408
25598 -35408 -5276 -23014 -37402 -30619 2455 -1257 -29489 16665 71344 79319 78329 44498 22040
25585 22040 -46199 -73531 -23853 -11858 -8770 7466 -1522 -7339 36126 68120 85204 52221
25573 52221 20518 18786 -20342 -29167 -58289 -17011 3089 7895 14510 14441 22062 20475 1599
25560 1599 -39926 -40118 26090 50640 33782 -4851 -66625 -90310 -66263 -32989 5513 -27100
25548 -27100 -3302 24420 35727 41568 52222 90957 68733 75609 36016 -210 -13718 20857
25536 20857 28316 41180 99724 86345 17115 -15770 -19033 23261 71779 88099 14472 -13041
25524 -13041 67443 69500 57834 2636 -167 5255 -14049 25623 55034 38634 29431 28974 57184
25511 57184 41555 21128 -1819 -7161 13405 19597 16911 6392 -27273 -56003 -30896 -15719
25499 -15719 -18624 -2858 -6925 -2895 -13098 -25491 -30445 -16651 -10701 19017 42680 34782 45179
25486 45179 35334 -4530 -4655 30012 11226 -33393 -25334 15309 42802 45778 84956 53881 45314
25473 45314 34357 14623 27018 20191 41136 44281 24527 14326 -1148 -21095 6902 2558
25461 2558 3649 7965 1514 -13769 -13239 -43111 -15920 -1670 -27091 -20788 -53096 -46563 -1223
25448 -1223 -4871 30338 32130 8403 29330 76423 68888 42077 22695 6904 -13183 -125
25436 -125 1203 -24654 -3663 19028 32095 2364 -34421 -44750 -12768 -12926 -22581 -50656 -76314
25423 -76314 -19879 16803 19224 29975 51542 1659 -63187 -49660 -53392 -36421 159 674
25411 674 31624 66444 61252 56204 65443 28204 -14916 -31691 -45660 -2443 22531 12242 -32991
25398 -32991 -5452 8088 3725 16885 54794 68430 28714 -22036 -30813 -29790 31376 77911
25386 77911 63419 57072 8786 -2577 8868 -56634 -70963 -46207 9478 52722 65657 43276
25374 43276 27362 54419 67655 31132 -38463 -28622 -17632 -23380 -25518 -40437 -28738 -27680
25362 -27680 6253 8312 8352 -5519 19484 43027 6510 7149 26852 45814 41819 20707 28964
25349 28964 12842 -2182 3944 1498 -592 -10080 13900 47580 52820 58583 27391 -11704 -13295
25336 -13295 -24512 -21185 -20578 -22162 -20735 14841 2991 -49421 9015 -2850 -38899 -21526 -41467
25323 -41467 -19451 2473 -56008 -35971 -6880 -54247 -89330 -54757 -58888 -46376 -25846 -29032
25311 -29032 -29352 -15921 -8192 -29021 -37249 -27426 -7372 32624 10291 -28323 96 7218 -32607
25298 -32607 -35480 5007 -26146 -23636 -35104 -37322 -20108 -40212 -7252 -36119 -20443 10340
25286 10340 4431 22046 923 -40589 -17562 5629 6100 21495 23060 -632 9835 -17265
25274 -17265 -58017 -93607 -139624 -92519 -29173 -18898 -24572 -17670 -32166 -30387 -6016 22928
25262 22928 -2973 20172 54258 37803 40807 15079 25814 16054 -1135 36469 19921 -23070
25250 -23070 -4321 -9961 8284 36178 43008 31735 62722 61164 43329 18412 4138 10062
25238 10062 -15093 -23557 16868 19664 34966 78952 81744 66603 64210 48772 13242 -37724
25226 -37724 -25145 7079 45717 32018 39455 38253 23978 -30534 -77672 -31411 -33716 -67751
25214 -67751 -35695 29709 47422 38793 28226 62419 91505 65582 50311 43858 31855 73111
25202 73111 95213 44098 26517 43501 29278 31290 9432 35506 23813 12246 -18889 16337
25190 16337 63885 13087 1159 54839 104794 105712 89031 29274 17567 5679 -4550 -13459
25178 -13459 -6205 8628 -27953 32034 66082 74425 104185 52406 -36071 -71679 -43737 -13202
25166 -13202 28583 16672 -12780 8875 -35 -20908 8593 39488 50872 16655 11214 4772
25154 4772 4589 8340 -22818 28198 18078 -13502 9947 16385 -9283 13766 41527 34635 22737
25141 22737 -8215 -22952 -60721 -123751 -80400 -13902 8607 55880 67028 19168 -54493 -68115
25129 -68115 -40068 -91330 -94874 -34966 -17707 23910 36870 30866 58097 73796 57095 32724
25117 32724 20618 32316 14950 -25899 -8616 528 4298 10493 -23543 -36339 -53108 -60302
25105 -60302 -47050 -39592 -21839 -34575 -64893 -39118 -17815 -25406 -20653 15806 36767 -4148
25093 -4148 -21093 13592 15098 17023 33287 -1939 1695 55400 27750 5139 -23731 -57397
25081 -57397 -67515 -54594 -21631 -3083 3016 -29155 10382 7169 1237 -2348 20666 61331
25069 61331 58440 103938 130201 51725 4939 -18370 -9856 7989 -1017 -10549 15799 19663 -13074
25056 -13074 -68838 -45928 24938 1327 -72637 -67657 -66680 -100186 -96285 -48924 -43328 -8819 28376
25043 28376 22516 -12421 -15634 24889 32213 -15102 -44086 -56810 -31031 39812 46563 38344 64300
25030 64300 55831 -6750 -14298 -18487 -34149 -24411 -12152 -28830 -44557 -3128 4564 5671 -33363
25017 -33363 -68174 -73890 -88830 -85087 -37683 -8353 -25298 -961 45676 69609 47173 19442
25005 19442 23944 -1337 -42382 -30155 -16147 -31236 -76864 -48815 -38802 -18119 7112 52152
24993 52152 55731 6256 15347 27809 26675 31425 -46399 -83077 -50562 -1765 17562 13688 11951
24980 11951 -22383 -42379 -48493 -42400 15392 20955 -35674 -57225 -53117 -7128 8930 45913
24968 45913 78252 57447 24169 -6427 -3917 -9455 23717 64063 77821 13819 -28218 -3715
24956 -3715 25459 18326 -19536 -11434 9472 14535 31413 3869 7629 4705 6681 35398 29795
24943 29795 309 -14800 -37946 -37266 -35888 -45785 -37860 -9378 -11962 -12105 -20979 -11312 19590 45834
24929 45834 63088 27192 -18089 -42255 -73460 -41999 -35707 -27746 -23511 -37636 -32895 -52075
24917 -52075 -34356 -32919 -17484 -16355 5863 14081 34676 -2268 2244 8410 -12309 -6167 16026
24904 16026 9901 -2851 -20270 -35346 -16844 -21152 -23969 -6123 -40539 -28508 -12608 17990
24892 17990 -5752 -54625 -79359 -61902 -27333 -28655 -4678 -4820 -27735 16825 28106 33825
24880 33825 22768 -11335 -23019 -36653 -72619 -40109 -28352 3130 14137 24293 34881 66706
24868 66706 34576 17044 26220 19641 -18133 -33215 27222 69703 29719 23525 -14572 -28054
24856 -28054 -63345 -118083 -120463 -80676 -67148 -52672 -20636 53347 67435 67087 53645 67491
24844 67491 39719 -4106 1816 31695 38578 24997 18824 41364 65432 72303 67645 54716 16592
24831 16592 -39685 -34670 -19338 6698 24152 17082 37227 44225 34012 35448 41704 31473 18759
24818 18759 -12557 -7033 6088 -15542 6793 9302 -4355 -11421 -25428 -13028 26475 31237
24806 31237 -13139 -40644 -22317 -13540 -22746 -35933 -37183 -6173 10082 40605 20909 12755
24794 12755 -495 -60567 -92348 -88382 -88910 -76268 -21264 -11294 15932 16115 23088 34425 38673
24781 38673 -37656 -29948 -4907 24434 16770 10009 -35207 -47614 -23877 -19744 8209 40795
24769 40795 48954 23268 -38764 -72802 -58209 -58339 -90154 -79635 -36583 -17908 -44344 -10289
24757 -10289 7852 5068 -19557 -49250 -20115 -14962 -16607 -5081 6714 -27641 -51678 -47576
24745 -47576 -3559 1105 12764 11851 16387 41531 36780 22355 5524 -43219 -47427 -42510 -40765
24732 -40765 -46171 -53280 -19271 35200 -14561 -68 35915 40181 21712 1189 37495 56908
24720 56908 38639 70587 90836 87347 52506 2958 -28804 -4218 -1836 5715 7379 -8480
24708 -8480 -4437 -33694 -52456 -82018 -34651 18912 4051 -42596 -10208 30612 18820 5085
24696 5085 -5973 -4464 -22959 -15020 5455 5846 36495 46846 38586 30278 50111 61131 15106
24683 15106 11336 30250 60332 24601 -18968 9321 -16361 -30270 24656 -11515 -27018 -9070
24671 -9070 20822 51225 23616 -14961 -40627 -28941 -33190 -41519 -34025 17598 4762 -33073
24659 -33073 -17657 -39588 -44980 -27996 -4844 15685 -552 -15305 -23149 -16131 2839 7000
24647 7000 -17557 -24677 17058 14766 4640 -44556 -34646 -19748 -23296 -56685 6796 28168 53623
24634 53623 21237 5369 -11207 -29789 -47115 -31820 18326 6313 30268 -7896 -18564 -50895
24622 -50895 -78576 -34692 -9939 -36155 -70020 -99392 -71484 -51723 -60611 -31929 3803 12371
24610 12371 24593 -4698 -28013 -15222 10060 1428 -6554 -18288 -29829 -72816 -76741 -42583
24598 -42583 -49063 -80933 -67872 -40090 -574 -37500 -54575 -1469 4281 -9607 -1588 14922
24586 14922 8451 12883 -19445 -31868 -283 8007 29379 22900 41735 24199 33125 32830 52662
24573 52662 32141 -3342 21723 30463 43395 59753 82199 68590 49040 28166 1752 -40794
24561 -40794 -65317 -21734 41341 43815 19346 -36427 -53276 -43593 -32698 -66806 -96210 -97492
24549 -97492 -70580 -76480 -37611 -914 5321 28341 40427 16486 9544 12095 35766 16301
24537 16301 -39725 -45455 3301 30952 14004 6845 -13934 -11369 8572 43216 43802 18542 -23725
24524 -23725 -48045 7878 16577 570 10947 28983 10146 -23989 -38131 -84082 -60440 -12927
24512 -12927 -17498 -21271 -44680 -69220 -75031 -18306 -10764 -2484 27056 1477 -46480 -18994 24002
24499 24002 68217 61106 22536 -1251 12261 26650 45881 -6522 -16819 -34274 -42294 -45451
24487 -45451 -45910 6816 19797 -24856 22986 36975 42291 25747 -47765 -67640 -50777 -12937
24475 -12937 11947 -1082 -1493 52831 75292 47932 20507 16900 -1712 -6570 -34266 -37011 -21898
24462 -21898 9702 31370 23742 44913 52500 -1842 4450 29211 33867 36741 48922 57117 33015
24449 33015 31973 24110 43266 2928 -9490 -22438 -63439 -97493 -53812 -16986 10168 18871
24437 18871 40066 52238 31662 10849 10218 29518 7203 -1579 31243 46646 33956 36499
24425 36499 27202 47754 62955 43668 27165 12630 -356 -17331 -23168 -45250 -5007 16944
24413 16944 12256 44007 51161 12107 -24803 -28813 -62173 -74413 -25564 -5472 28603 78309
24401 78309 92852 65887 82181 126873 90927 -2019 -33286 -23753 -16656 -24027 -38784 -38963 1188
24388 1188 24946 30589 36239 57718 32056 4057 -13640 -18639 -72822 -86039 -71269 -109645
24376 -109645 -115096 -94257 -19731 38766 76706 109750 82315 70248 47478 48924 47182 66944
24364 66944 90519 51048 56932 52294 3686 -31042 -32050 -22398 -9100 -26397 -4899 32493
24352 32493 45804 34096 33577 24938 5929 23953 41452 57031 55323 65744 37701 13947
24340 13947 17370 -6862 2633 -20085 -51518 -27426 -10364 -27449 -52736 1635 36294 16539
24328 16539 -15580 -48150 -66568 -85960 -59418 -39019 -26064 -34856 -42359 -32596 -21194 -21116 -13891
24315 -13891 -16287 11169 62521 69509 -4428 -35238 -18242 5001 2802 -1074 4245 12204 29077
24302 29077 39124 46088 153 6934 -15710 -57559 -116278 -148192 -111720 -29038 -13171 -19967
24290 -19967 12067 -20363 8662 -2534 -27764 -21516 -16815 -14930 -3026 11562 36591 20617
24278 20617 2325 -8090 16188 19812 40381 6912 -7035 -104 19207 17435 -47027 -73632
24266 -73632 -103864 -99230 -74473 -58381 -36151 -13607 -25769 -39544 -42427 -37055 -64256 -87244
24254 -87244 -83069 -44323 -29888 15934 66342 78643 60104 24530 5483 1444 -26800 -41078
24242 -41078 -13946 -2678 1396 -5692 -39674 -27421 -10892 -39078 -18822 38989 36065 -14561
24230 -14561 -37579 -4455 18498 15661 30578 28489 53209 43798 12808 -29275 -60248 -88389
24218 -88389 -61754 -20311 -19147 4818 25933 36592 23004 19716 -1019 -26179 13212 7413
24206 7413 -29347 -55683 -72892 -79388 -55586 -14468 9467 -9151 -19962 -36938 -60843 -5952
24194 -5952 26735 7898 -5226 20683 52566 57871 41023 3159 -805 11880 -777 4483
24182 4483 4981 4594 -3987 30490 45827 51457 25028 -31906 -54051 -5964 20981 -1217 30351
24169 30351 49993 58432 41396 37430 28160 30070 -10324 -50943 -36110 3374 24997 45174
24157 45174 57926 55900 38676 15786 -40894 -29316 -28699 -16061 10367 52573 46257 22768
24145 22768 20665 54359 48332 62013 104545 80816 72428 24035 -6594 -11666 -1524 26960
24133 26960 47211 41670 23683 -6628 4890 29753 31589 42568 31702 -8335 4500 31414
24121 31414 32267 64418 54595 33979 58224 68209 28104 -10868 -10608 41808 29626 39551 68072
24108 68072 29167 12059 23602 -26734 -42254 -23835 3698 3560 -5949 -16291 45592 25850
24096 25850 7727 -1392 -22284 -33499 -8973 20566 48262 29750 -22279 -49855 -42398 -54227
24084 -54227 -37578 -41743 -20021 36000 17602 10109 38882 9721 45832 74540 45986 9555
24072 9555 15602 40065 32524 -182 9577 37244 48186 50736 58922 63499 51138 32900 -24281
24059 -24281 -64226 -45125 -15868 -15149 -11148 3179 -31364 -46636 -61366 -88122 -64223 3404
24047 3404 55809 63781 69142 27321 304 13484 1125 -20828 5145 37166 55014 71605
24035 71605 61673 89667 61231 38969 25042 27701 46265 15902 -9001 -16210 -13937 12174
24023 12174 52745 56858 43351 39630 17714 5894 -1146 -846 11639 29405 50506 56299 55777
24010 55777 64692 53647 31772 49283 50791 42926 36742 41541 55422 55366 58224 -14437 -20239 -25118
23996 -25118 12404 24124 -2356 -7799 3052 22285 9612 12889 -61443 -58848 -12024 18374
23984 18374 19349 -17519 -14286 -40454 -23745 17434 9265 34748 -13310 -54028 -31480 -22408 -11954
23971 -11954 -1077 35953 -26724 -56762 -32497 -33673 -31947 -20163 -20836 -603 -2651 -13659 -15618
23958 -15618 -18237 9465 15356 -346 678 -21968 -5378 24393 11589 9996 37827 81901
23946 81901 93784 90459 88414 83104 65060 44601 -10800 -27123 -37230 -41046 -13195 17419
23934 17419 60788 35182 2523 10256 -19889 -64038 -51830 -42392 -41530 -77043 -61687 -9947
23922 -9947 16120 8307 -12538 -23118 -50052 -53375 -36019 -57396 -43916 1344 47609 12324
23910 12324 6934 -20142 5699 13172 33100 5881 -53166 -73487 -47975 -1927 39574 10185
23898 10185 -47492 -55320 -44804 -34795 -8891 5755 -24887 -35558 -27446 -15899 -29696 -82860
23886 -82860 -99613 -34606 -24900 -7774 22459 30085 27317 11669 -37067 -38982 6456 45070
23874 45070 59585 53602 47209 45137 7048 -22432 -49974 -61960 -64057 -66603 -90980 -63747 -31250
23861 -31250 -13608 -5502 -23273 -35442 -32819 -53355 -22316 -4463 -899 8000 11652 1991 10541
23848 10541 1496 20250 44131 11674 -24014 -21995 -30647 -26487 -32658 -20007 -3337 3962 8289
23835 8289 8325 18150 23830 30445 -14271 -59335 -72510 2106 4761 3666 -5936 11793 -12400 -24310
23821 -24310 -4501 15920 -9481 -50353 -26457 -60155 -81150 -64992 -12738 6443 -8573 2068
23809 2068 23188 30154 37485 49590 20394 -8979 -729 -20218 -13866 19190 -7566 -18784 -23473
23796 -23473 -32956 -28455 -27830 -37635 -68102 -87222 -57301 -4331 34275 51996 11791 -31169 5401
23783 5401 70165 40624 4993 -6898 -19118 -36768 -30655 18746 -4413 -48464 -33640 -34604
23771 -34604 -56711 -62293 -54476 -30231 -13963 20378 35786 6254 -4775 21007 -313 -18192
23759 -18192 -39629 -48088 10529 50572 28162 15538 4364 -26123 -19242 -2700 -28986 -16524
23747 -16524 13635 -8690 22477 33986 -7187 -56732 -73805 -44788 -61434 -35142 -24390 -14948
23735 -14948 -7353 -5222 5978 1593 32974 33662 47214 13209 2323 21041 21619 17407 39281
23722 39281 66659 17995 -11351 15644 -15081 -2378 25469 65069 63832 17434 -42711 -26219
23710 -26219 4894 51250 57158 59812 61516 73260 31677 -708 -20027 -29304 36524 61827
23698 61827 40811 -6680 -3995 -21491 -22445 -10874 -12525 -1513 -306 4120 -25005 -67508 -38920
23685 -38920 -29135 5007 -24 339 -12375 -7263 -8304 2300 -19685 8445 -15483 -2968 -5385
23672 -5385 -22918 -34098 -24018 -4689 28252 47030 70 12987 18802 35401 58965 27060
23660 27060 29642 20120 -36318 -35768 -26862 -4097 15452 -15087 -16603 3790 -23764 -17089 31495
23647 31495 19198 41962 59552 71749 63186 37838 -40645 -33147 -5057 14324 37259 26830
23635 26830 30269 8655 -30478 -55932 -67626 -27329 -28077 -37012 -14675 -3530 -29994 -45812
23623 -45812 -2383 19988 24536 31945 9635 18226 5723 18097 23823 24045 26541 -4869 24612
23610 24612 79027 74393 56932 31887 55243 55477 20453 -38625 -73643 -83274 -76864 -12121 -11093
23597 -11093 20100 25039 15297 -884 -17472 -4364 19647 14017 32240 30035 1299 -7970 44278
23584 44278 113156 122930 85997 63444 47855 24142 18219 17359 32803 -28392 -44305 -5461
23572 -5461 -4870 3803 -46 19782 37833 -8569 9299 2527 -20263 -52261 -24502 -22940 -4287
23559 -4287 -17693 -60372 -52085 -25778 -31033 -68396 -15038 41452 25209 6708 27795 21908
23547 21908 -8665 -10682 -26466 -61158 -46745 -24034 -2297 -20056 -52140 -47306 -27593 -77393
23535 -77393 -103033 -73291 -58942 -79078 -48341 -52893 -70302 -96707 -68351 -17753 -5674 18330
23523 18330 28597 49603 46186 49344 23069 677 211 -20317 637 8545 14252 11292 -9772
23510 -9772 -1258 12052 13549 -5534 7824 30600 23368 29696 52584 34551 49930 75826 63731
23497 63731 35519 30993 -1230 -5525 4620 -32188 -39169 2217 24357 28094 37149 33898 45704
23484 45704 8022 47997 46780 53031 46364 49108 33035 39284 -4607 -23844 -10777 4937 -126
23471 -126 -8436 -9466 -4868 7969 18820 -11332 -2804 -1982 949 -13056 -14011 12547 10035 -2246
23457 -2246 -19641 -47224 -29155 2126 13897 19458 22286 11966 -6609 -26455 -40232 -55891
23445 -55891 -48202 -30673 -45890 -5811 -21944 -17038 -22179 -31934 -59744 -21031 -6150 -3300 6271
23432 6271 28973 35964 74746 71457 55359 23871 10040 6831 28245 43283 -3946 -29060
23420 -29060 1339 48738 70924 42364 35326 13683 -6440 7638 2146 20180 10479 -11763
23408 -11763 29273 34282 -27527 -35274 -3695 7683 -21739 3411 9998 -9606 -38595 -54211
23396 -54211 -2953 7836 -33092 5461 95892 52233 6325 2760 -45430 -52819 -22419 9110
23384 9110 -4223 -16405 -35772 -18876 -37021 -40940 -79 6044 -16173 -34036 -35081 -1740
23372 -1740 44007 56791 45359 51784 60591 77879 84317 53313 54317 81721 87169 67335 40302
23359 40302 24049 26715 33172 -221 -43804 -57288 -86055 -97837 -73604 -31024 -38853 -77457
23347 -77457 -63488 -2880 25510 -12176 -47098 -61776 -73399 -84787 -138869 -155005 -145998 -118512
23335 -118512 -111395 -95726 -72873 -87521 -91110 -64805 -13942 5254 25 -34883 -40962 -19908
23323 -19908 -37999 -16836 27581 3002 -1913 4406 1119 4145 -31008 -20625 11457 14123 -18059
23310 -18059 -17607 15077 35230 17045 25748 -12749 -6450 -16742 -15082 -8126 -32584 -30141 -9563
23297 -9563 -24221 -29502 -12241 -47819 -32333 -4082 32969 29433 31984 34677 58329 31977 -19041
23284 -19041 -7603 -1344 -39055 -64106 -27587 14294 9560 -16186 -60854 -48404 -16702 28342
23272 28342 22052 -20647 -41776 -60942 -57387 -60487 -32925 -34435 -37292 -25898 -38193 -13043 11893
23259 11893 -5510 846 13792 69996 90450 84917 51409 -5175 -43802 -20804 31263 70211
23247 70211 48198 51566 46434 38039 39764 16972 -47082 -58137 -23631 14701 45762 4701
23235 4701 -40008 -33852 -13936 20041 25506 14889 -4370 -48327 -46540 -33671 -42864 -14263 30395
23222 30395 17058 21992 3792 786 4535 10953 -33148 -48546 -72246 -15165 -51706 -60650 -10240
23209 -10240 15699 15878 -17333 17214 40916 48130 32082 11831 7788 -10367 -2256 30632 28203
23196 28203 -4249 111 39535 19740 -51385 -45633 -9054 51066 13535 -5851 21184 17577
23184 17577 -17804 -31097 -12123 -17657 -49892 -36610 -26699 -5574 13921 15376 37368 44393
23172 44393 5784 -3549 8759 -6376 -29842 -17202 -6802 22316 29757 15195 -9585 -17709
23160 -17709 -12791 -43171 -79697 -76126 -74791 -59041 -33203 -43784 -53731 -60113 -52120 -27225 -10878
23147 -10878 4471 32285 21828 8948 -3303 -19226 -37081 -97610 -82379 -44342 -14738 -22452
23135 -22452 6178 16965 23533 38013 27387 -10008 -17918 -15558 -29496 -30174 -23651 -2887 33223
23122 33223 41959 14784 -28228 -25737 -29205 -47441 -79009 -124753 -151888 -157969 -109758 -98567
23110 -98567 -73250 -33594 -14725 -25836 -9867 -28291 -64055 -74394 -31415 13646 35570 70383
23098 70383 33354 10524 -35382 -70800 -43140 -19270 -7110 1107 38728 54618 34801 20768
23086 20768 -8444 -59853 -92989 -64166 -53230 -65718 -53005 -60696 -79060 -71979 -67866 -47036
23074 -47036 -33774 12710 -16000 10900 38228 23448 -25871 -33767 -14637 -29214 -55265 -38214
23062 -38214 1411 10896 -3014 -20165 31719 78187 73874 62765 67183 29976 8491 -32976
23050 -32976 9010 58164 46456 27885 2295 -10825 -7375 24892 31188 4561 2629 7414
23038 7414 -18942 9265 49033 -120 -24864 -33726 -11833 -12691 -28063 -47200 -17032 -21629 -13732
23025 -13732 20426 9376 -11767 -15149 -45361 -89756 -49094 1257 18585 20137 -4324 -10419
23013 -10419 -54261 -42601 -11660 9392 235 2692 -5677 7100 34937 17934 -16849 -14248
23001 -14248 6505 52566 43253 24952 -20875 -44331 -62484 -16519 43126 67459 71213 32201
22989 32201 12996 40044 31922 50789 51640 14652 18924 15789 -17337 -23469 -58185 -50395 9039
22976 9039 -3829 -52749 -43880 -8537 -9441 -43248 -37554 21041 27220 -2533 -81408 -73827 -34264
22963 -34264 24924 32445 -12690 -30331 1375 36176 68851 84190 92570 101392 91606 50713
22951 50713 37745 8317 22526 24880 33059 40074 18122 14494 -42399 -44942 -26192 -34810 -38574
22938 -38574 -49321 -36112 -49895 -60271 -46874 -2637 -14170 10872 -8758 11682 47509 31928
22926 31928 21489 19768 -9504 -1132 32778 40256 -25075 -62615 13043 3703 5252 5207 27291
22913 27291 34886 53866 47421 16770 -1017 -23753 -31966 -54123 -23394 -9634 -12163 -28281
22901 -28281 -34741 -39276 -22368 11207 11406 25005 9431 46779 51943 -10649 -38001 10775 32695
22888 32695 28695 44667 60606 114377 51396 30375 -9899 -38628 -52529 -45753 -23046 -19915
22876 -19915 -41480 -55472 -58541 -48887 -11227 6391 1108 38937 49520 48660 26616 23341 48625
22863 48625 26314 -37605 -94599 -63436 -59973 -65444 -34722 -10118 21435 -14279 -31623 -7049
22851 -7049 -56517 -80396 -59364 -29181 21461 -6338 -27025 -69076 -88171 -118163 -115533 -93878
22839 -93878 -113807 -87876 -75046 -64446 2729 56133 16237 -18754 -10004 -21073 5035 27015
22827 27015 15245 7547 5069 -2206 33334 68926 63936 27561 18948 26255 14419 -22050 -54388
22814 -54388 -98394 -100606 -61010 -34538 -13097 -4672 -23901 -65747 -69754 -31819 -13086 -14001 -1441
22801 -1441 665 14142 2213 -44576 -27756 -47436 -35087 -53745 -74431 -55837 -21872 11797
22789 11797 30372 19282 4794 18984 -6702 -11772 23760 12511 -9241 -8581 -33776 -10456
22777 -10456 -5412 -44243 -86798 -102850 -49157 -15308 447 44429 15289 -3678 -29939 -41070
22765 -41070 -8175 -837 -3071 4212 45542 35246 4541 -16591 -26942 -35183 2680 38256
22753 38256 20459 6120 -46944 -53929 -17735 -5299 -7720 -1627 -323 -49656 -51194 -27788 -17104
22740 -17104 -5846 -13428 14534 54055 25611 7584 -9104 38222 57957 74242 101309 51504
22728 51504 -7687 19544 32917 -3177 -28480 -14233 33402 48988 10288 13965 -11921 -45472
22716 -45472 -42170 6743 15375 31567 17063 -24767 -35886 -36659 -4376 46321 79178 61684
22704 61684 10838 -90283 -86449 -87797 -60531 -50477 -42225 -7866 -16305 -9932 41959 78202
22692 78202 56684 42065 19234 -13422 -41890 -13978 -32342 -9194 18013 8444 17773 -5546
22680 -5546 4724 -21880 488 36721 9850 11223 -4526 -41932 -52872 -22881 14697 939
22668 939 28413 83650 119395 125438 112487 68572 42538 11649 18383 40439 55825 49885 48408
22655 48408 43115 12624 -23035 -26369 21730 36600 32334 -823 -6819 16204 46348 59564
22643 59564 65131 33733 37834 65239 44483 41910 15398 39031 49229 26252 7467 -20127
22631 -20127 -7691 6987 -23688 -18528 23681 29489 230 13298 10395 -7217 -26152 17925
22619 17925 7566 -19754 -13538 8878 33559 6224 12902 29387 92839 98886 21342 -18970
22607 -18970 -28936 -54373 -52465 -16382 24321 34963 4215 -7975 -13838 1921 16185 10162
22595 10162 -34871 -16707 -19514 6013 1860 -27545 -40708 -30625 96 19275 42017 86834
22583 86834 55338 13150 19205 -1775 -14504 -31279 -23962 -28852 -49454 -49970 -8120 -3200 2455
22570 2455 -1440 -9988 16201 -3155 -13532 -33909 1277 31134 33784 46376 39677 17991 24352
22557 24352 4466 17757 1110 4612 -28579 -55637 -57656 -27107 -19514 2186 3042 -12461 2192
22544 2192 6301 43522 8420 2529 -22211 -33171 -73094 -27172 -27521 -25889 -6402 -9801 -14188
22531 -14188 -13804 -16636 -10297 -8011 58939 40186 19473 27881 4803 -37048 -22942 -26336 -14086
22518 -14086 -26923 -15650 -8387 -66315 -63436 -48649 -47787 -68490 -31823 -35741 -34106 -40259 -39027
22505 -39027 -35435 -51073 -24337 -12190 -11709 -27305 -50183 -39767 -71601 -65902 -33530 -53782
22493 -53782 -76412 -40717 -30685 -52923 -65264 -59850 -22840 -25783 -30740 -65927 -96702 -54499
22481 -54499 -7761 -40102 -39495 -9738 -5552 14946 53866 89135 53218 30706 36611 -449
22469 -449 9318 37347 22099 -6861 -8488 -6792 -12936 -10814 11495 37149 13648 -10815 -27299
22456 -27299 -17686 -11919 -49714 -79782 -48949 -22562 -58801 -48551 -55706 -68401 -37933 -19651
22444 -19651 -24177 -18983 -23096 23456 17571 -16458 -35037 -36171 -58387 -71010 -54164 -4073 34586
22431 34586 23054 3038 25086 34153 44259 20847 -21919 3942 24917 49181 71039 89796
22419 89796 121419 86342 47379 86844 106537 78739 44682 -12430 -20857 -20474 -31043 -49693
22407 -49693 -33324 -12846 -4568 -13870 16480 17520 -17010 -34939 -35226 -47672 -60180 -65934 -70379
22394 -70379 -62544 -57740 -55045 -50694 -53051 -38735 -61775 -36117 -50569 -101150 -74699 -40231 -44268
22381 -44268 14057 39296 41710 37724 -24345 -41748 -16524 9881 40818 56501 49743 21599
22369 21599 24476 92888 112090 51945 50985 38179 12209 -32914 -60206 -83571 -66233 8217
22357 8217 16874 7655 4182 -12517 -17840 12145 39188 10689 53794 93220 49260 -4932 -20451
22344 -20451 3480 7892 43187 98559 107726 69273 33889 -6990 -46487 -42965 -878 -6991
22332 -6991 -9412 -3448 7688 12259 -40086 -76560 -43431 -28576 -29630 -17636 7815 38458 35207
22319 35207 29009 45406 8707 6471 13458 5785 -22519 -22569 -23143 -53917 -42292 -47570 -27087 29902
22305 29902 45850 33289 -15025 -56663 -43793 -38915 5988 9131 84 -1150 -19075 1696
22293 1696 -12404 10570 14198 36144 53063 28368 21463 28378 40179 52883 87931 28237
22281 28237 -37213 -43365 -46489 -37855 -12872 -48 57226 55327 23879 -11367 -11590 -29474 -15668
22268 -15668 -18049 9604 -13201 -34113 13524 51067 21613 38047 41427 3162 20075 -1027
22256 -1027 -27733 -6574 1506 12532 13497 -3799 8644 17156 17182 8932 -36921 -60617 -46752
22243 -46752 18608 33651 29922 28342 27226 -34074 -47319 -17760 -12858 159 11128 18767 46365
22230 46365 21001 -5269 -6613 -40879 -60034 -38323 -5325 9426 27593 60481 29239 -41587
22218 -41587 -49369 -36863 -61384 -40049 -40766 -38851 -35212 -10222 -7517 10580 -2184 -31002 -45805
22205 -45805 -12078 13580 4824 -37146 -24398 -37517 -67241 -53178 -33859 -33116 -34240 -32299 -63913
22192 -63913 -105871 -83236 -65912 -38891 -12425 -47238 -73396 -74851 -14045 -12399 -9109 -26261
22180 -26261 -28839 -12908 -19843 -6340 35681 35972 2943 -26013 -19722 19322 67587 35152 5518
22167 5518 -24369 -61405 -85711 -45882 -3440 9716 20138 9255 -26089 -70701 -80167 -22521
22155 -22521 -2602 -33807 -43006 -58478 -57989 -41676 -28442 -12884 -17216 -17130 17023 68134 58612
22142 58612 75795 70773 29597 17549 33979 34790 31027 -27576 -33907 -15851 -35011 -35117 1922
22129 1922 39893 31738 50724 17812 -13312 4380 775 -21489 28956 16150 44202 69571
22117 69571 79632 90216 80697 71933 56065 30708 56825 61646 -14098 -31053 22590 60235
22105 60235 16924 -15643 -50503 -2085 56182 36679 30232 25242 17002 -635 -24977 -49793
22093 -49793 -34000 24864 20050 4453 8067 -16194 -26714 12476 64658 61797 23909 -34873
22081 -34873 -45020 -3941 13374 -899 19324 23633 -12874 7170 60602 25982 -4693 -42546
22069 -42546 -30981 -3330 8529 -13114 -22217 -1982 -11611 -21648 -37095 -21678 229 6239
22057 6239 -17187 -8946 -28349 -49067 -62864 -49820 4353 15973 27757 37925 46904 25840
22045 25840 21604 -10537 -9315 -6012 -64072 -99171 -73472 -55759 -13227 8332 27232 38325
22033 38325 66101 54195 13008 9717 23533 -28023 -31091 -45801 -73670 -51937 -18494 16244
22021 16244 50372 55133 -3273 -20325 7916 -21954 -46404 -10377 -3290 -2879 -5197 -23218 -20114
22008 -20114 8773 26707 23567 1567 -7450 -11155 -53825 -28072 -3805 2718 -62305 -62509 -64180
21995 -64180 -38339 -27760 -61278 -61637 -41095 15116 17036 -10223 -24040 -21661 7812 47467
21983 47467 55426 29645 15760 28363 27480 43971 38910 622 -10488 -16356 -18460 -14961 2922
21970 2922 11313 -13038 -37924 -38777 -27784 -30077 -71731 -81761 -44461 -27708 3798 39269 52741
21957 52741 53957 43395 17499 -18912 -34143 -74332 -71743 -72383 -85494 -109419 -74236 -595
21945 -595 15732 5857 12226 4799 -10205 4421 25461 7635 4758 11403 -4904 -23392 -53505
21932 -53505 -64644 -74011 -14154 9326 -50207 -86861 -81702 -37883 9127 29794 59529 61235
21920 61235 30729 23512 -14654 -46439 -68604 -63214 -49573 -18970 15268 -17882 -69119 -77567
21908 -77567 -33084 -40683 -26116 1793 -31733 -48027 -65591 -31819 13698 7157 -22718 -77063
21896 -77063 -47649 8682 46203 41042 -9599 -49105 -22127 -13940 -33729 -69666 -108045 -84562
21884 -84562 -7863 19263 22761 -28073 -39283 15456 35068 22314 -388 -1872 -4062 -58069
21872 -58069 -40560 -37745 -62135 -44669 -13839 37426 23600 -4503 -23934 -49688 -48898 -44254
21860 -44254 -51957 -52231 -48616 -51768 -34210 33513 35535 8516 -14016 -61416 -30549 -2780 -19366
21847 -19366 3392 21189 -10002 -18637 -20125 -33814 2794 32001 22018 19302 13551 14360 22591
21834 22591 -1997 -6601 23182 11245 117 13710 -27627 -89410 -82580 -41493 -13658 -3221
21822 -3221 10936 -17031 -64580 -50140 -57763 -69372 -80442 -75947 -51875 -6058 31712 67910
21810 67910 22911 -24274 5057 11634 -21102 -28294 -20963 -17668 -20051 -16065 -38802 -38141 17153
21797 17153 52467 33138 1611 8213 -6067 -39379 -24458 -5659 -10114 -53292 -60407 -38094
21785 -38094 -20198 13863 4941 25491 8860 -11372 18972 27560 30755 -1170 -26 9953 46021
21772 46021 53526 68199 70217 67514 63296 51494 -20430 -63274 -80265 -72467 -48572 -81875 -31258
21759 -31258 36467 23096 15524 28466 -4140 -44603 -38632 -29247 -14598 -7153 -45451 -51086 -35404
21746 -35404 -1350 6003 -11458 14884 -3642 361 34266 88128 72082 17660 -4039 -14499
21734 -14499 -29793 -38445 -23956 7373 47934 67325 52786 6993 -28555 -36751 -50969 -70008
21722 -70008 -60135 -54892 -84118 -40418 -26428 2982 32576 59891 -364 -6727 24979 -4742
21710 -4742 -4592 12029 -26881 -57000 -79430 -97945 -79475 -73580 -71748 -55112 -56331 -31847 -47911
21697 -47911 -44954 -27210 -76703 -48315 -31026 -15907 -25899 -67408 -58016 9743 45123 79555
21685 79555 73474 57228 77435 83430 75404 65766 1064 -24446 -4135 -24326 -40800 -20479
21673 -20479 -17550 -51664 -94483 -121678 -67655 -9256 15837 48113 65024 33784 10583 26695
21661 26695 24823 2117 7890 10606 18523 28072 -24705 -22181 -2483 5427 12706 -12881 -42361
21648 -42361 -45682 22269 42252 436 29408 46469 18610 7381 23822 5248 -11480 -26835
21636 -26835 15534 24929 2956 -13046 -9625 -10227 4704 28640 16648 6304 -2241 -1268 2147
21623 2147 20578 5138 -22385 -29 -224 13050 17488 -23605 -42447 -65175 -54605 -28955
21611 -28955 67189 109781 96375 97519 56810 2242 -28744 -15338 -14585 -5756 -4349 -20764 -23685
21598 -23685 16160 20121 -10950 -14535 -38279 -10229 -19406 -13101 21746 -3186 -24293 -43297
21586 -43297 -45677 -33719 -13259 4303 32673 24279 -46057 -108211 -97563 -65545 -47453 -72584
21574 -72584 -60113 -33303 -21816 -33515 -38579 -28448 1018 38020 103187 122445 72911 53677
21562 53677 65615 64880 89594 33104 4670 -13011 -488 -11295 -15619 -15952 -35152 -7665 -22487
21549 -22487 -14822 23510 27420 41544 51518 22240 -14931 -29878 -51572 -52838 -63861 -54531 -63715
21536 -63715 -58463 -68139 -59111 -55248 5714 52046 49538 35558 -25634 -75221 -96173 -69052 -59270
21523 -59270 -55601 -30255 -50026 -37966 -30296 -8499 1014 -20535 -28820 -22212 -45230 -41248 -21502
21510 -21502 -36111 -40657 -26645 -50252 -48930 -36658 8127 -2253 -43023 -22131 2122 53697
21498 53697 88599 48482 4557 35615 30125 14375 18268 23411 35730 47118 37655 18612
21486 18612 5614 -29680 2038 18984 32906 10325 -9828 -9155 -6144 5146 -30549 -29210
21474 -29210 -42945 -54425 -65691 -95631 -26237 8563 12567 14822 -6665 -14729 -59415 -89345
21462 -89345 -107402 -78015 -51638 -19887 -9844 -47263 -45304 -32019 -26710 -28577 -21325 47388
21450 47388 38364 -26020 -30598 -26482 -9505 31461 52664 52016 14949 -23766 -17809 -33729 -9568
21437 -9568 -30169 2674 28804 27689 12762 -19668 -53714 -94785 -92310 -36504 920 -11018
21425 -11018 16799 45394 69865 62323 26508 16296 -13465 28799 69857 42447 46596 75130
21413 75130 23406 2650 28908 -1109 -32302 -23541 -18735 -8798 22467 41521 -6593 -41318
21401 -41318 -19747 29105 36114 18431 -4136 -41604 -69685 -65251 -65619 -93021 -111389 -111248 -53616
21388 -53616 -48051 -67502 -20209 -42179 -27674 19817 22856 28098 -29171 -47876 -38192 -3558
21376 -3558 37819 49311 49517 37627 -7280 -46984 -35320 -36385 -15081 -12246 -15039 3428 40585
21363 40585 35331 7922 12916 28258 51860 68184 67057 21498 -12105 -25318 -43702 555
21351 555 15475 47756 70249 78024 70829 76029 76738 41908 -10758 -21432 20498 41162 2993
21338 2993 5935 19349 35161 4308 -34673 -35274 15443 75674 59585 30409 19639 70180
21326 70180 64056 60460 76016 85276 91040 52707 -9182 -21194 -19990 -12084 -15726 -12632 7016
21313 7016 17559 1404 -17648 -17393 -48993 -31078 6946 26322 36617 45760 33031 37904 31017
21300 31017 -28167 -69015 -68584 -47377 1153 36430 -8442 -44737 -31957 -33224 -29977 -19166
21288 -19166 -23895 -42847 -30772 -46950 -7722 -8453 -5554 2048 11908 -1950 -29190 -53252 -44347
21275 -44347 33353 36251 -10724 -14947 8437 22677 68089 51001 -4889 -10877 -12685 -525
21263 -525 2631 16000 -9456 7935 -9089 -4508 -280 55845 88140 63531 38825 42335 -8277
21250 -8277 -40086 -34862 3042 31113 26658 13092 -13812 -39926 -66854 -86747 -80817 -63973
21238 -63973 -35456 -34187 -35160 -82047 -72037 -3087 39039 -8929 -8882 -27237 -45867 -19174 -9938
21225 -9938 22198 12306 -17460 -46345 -62929 -69346 -53440 -52865 -65558 -54932 -43351 -10960 -16657
21212 -16657 -26681 -50086 -2802 42771 -4472 -34033 -21088 -34617 -36994 -9085 36653 15060
21200 15060 -25003 -45234 -39755 -22007 -18511 -18281 -31456 -37770 2602 31692 19334 46095 61172
21187 61172 27811 20736 40090 18507 -2094 -14128 14159 37763 51925 32658 27617 8092
21175 8092 -6294 25065 41551 26687 6936 13645 -19089 -48747 -26842 -34398 -33842 -35266 -30111
21162 -30111 -21169 -4188 -50 12233 44669 48633 624 -22957 -33550 -43973 -24225 -18440
21150 -18440 -558 -18866 -23760 -44013 -24203 -64052 -75602 -35423 -38434 -42698 -47930 -14969
21138 -14969 -21432 -21141 -21580 -45242 -50075 -22690 -9335 27115 16104 11694 5266 -47265 -44236
21125 -44236 22743 31926 10846 -17647 -19182 29492 67073 102140 44411 -14413 -56435 -66023
21113 -66023 -43179 -17636 33507 -3710 -14436 -12863 -22478 -63856 -105251 -57147 -38484 -41552
21101 -41552 -71508 -101661 -119036 -70360 -76468 -80140 -71127 -29398 4530 19887 51121 56052
21089 56052 27472 4453 7597 18896 68540 70432 68891 73352 61090 63171 92355 126348 76570
21076 76570 67724 23146 -8909 -6297 7891 11949 -2836 -23678 7190 61491 72636 31830
21064 31830 -14547 -64473 -39252 -17968 26153 24236 30177 31862 18076 8216 -4438 3810 16760
21051 16760 22288 6677 -16112 -869 -7714 -10757 3550 16479 48145 73106 76374 75125 19770
21038 19770 -5535 809 20376 5146 -54934 -47569 -15368 -10339 -14552 -21591 -27041 -29374 -829
21025 -829 10106 -9381 -35451 -34193 -31494 -47373 -53815 -40804 -36506 -63073 27542 66059 27452
21012 27452 21990 29482 38617 55028 -5177 -10407 33898 96661 106691 111234 81747 54785 28892
20999 28892 -5242 -47578 -28604 -3827 -16256 -45386 -37581 -8257 -35578 -63995 -53674 -24736
20987 -24736 -42157 -58838 -101586 -93400 -30766 -11672 -1621 33069 2471 22554 4267 -50023
20975 -50023 -65146 -27726 -32148 -31820 -5995 13138 -23108 -38943 -57413 -56430 -32064 -18128 -6969
20962 -6969 11279 22774 19862 -16382 -32332 -40178 -6398 45647 43448 21144 32029 8455
20950 8455 9810 -22571 -53619 -43088 2932 2210 28184 77768 76948 66701 40677 44697 26619
20937 26619 10039 4047 -6237 -45262 13218 62321 8971 -40652 -64340 -32093 -16990 -31446
20925 -31446 -23413 -22136 -57709 -59846 -49092 -17859 -24970 -40178 -32782 -16119 26573 26477 -18888
20912 -18888 -68685 -58112 -886 15234 21836 6532 -18497 -14847 -35336 -66581 -63239 -53188
20900 -53188 -10596 48014 78302 34756 36522 65802 64006 28788 -19261 -32795 -33560 -42787 -42175
20887 -42175 -15312 -4812 -16560 -16071 4386 34311 9248 -48848 -93623 -105222 -81312 -68620
20875 -68620 -69437 -80745 -52349 3681 31340 48417 59082 68074 85047 63064 39813 15062
20863 15062 2439 10980 12787 56554 58852 66438 48943 21442 18748 39170 40598 9644 24175
20850 24175 15870 -21914 -18173 -32392 -30177 -2031 11754 15594 -3918 -19958 -5472 25028
20838 25028 47838 29427 31572 49612 63223 55111 26265 -517 -12783 -42060 -50643 -17360
20826 -17360 -6546 -40158 -58588 -68943 -55541 -47774 -74296 -47447 -20427 -4149 -1094 -24107
20814 -24107 -85964 -66117 11142 -11452 10928 21993 29770 19606 9662 30757 46772 37050
20802 37050 -12965 3004 -32897 -19913 -21253 -659 25846 64503 87442 80075 29505 3452
20790 3452 43720 54688 33414 56648 20197 7617 32248 33794 38988 23794 -17012 10862
20778 10862 15965 1177 28900 35100 -8067 1675 -15681 -19425 -8988 6489 19187 32486
20766 32486 24535 41878 47513 27013 3474 -24248 -43979 -58178 -71858 -73243 -71309 -88832
20754 -88832 -75837 -69443 -65094 -52474 -26612 -13728 -9436 -18551 -2434 -1737 -7675 -11342 -1313
20741 -1313 7666 -15276 -42417 -32211 -22763 -10925 -4741 2187 20974 5349 -222 -14128 -17214
20728 -17214 8869 476 -67610 -55018 -13928 14500 -3335 -34400 -33537 3847 9570 67775
20716 67775 90172 119085 82665 42529 19990 41642 59713 87879 46992 21588 6827 -11984
20704 -11984 -11777 -4700 -28618 -36827 -34994 -3732 -26707 -45490 -72624 -51311 -12540 5140 31212
20691 31212 75312 79112 58074 27064 4056 -5565 -20709 12231 50019 38324 23 -22665
20679 -22665 -6490 38681 14731 18538 29306 -3269 -14350 -17767 -77555 -79928 -39390 -49009
20667 -49009 -52901 -29877 -26121 -19015 -39428 -54160 -67754 -55227 -71767 -46272 3754 -12369
20655 -12369 -626 4703 -3202 -17171 14467 6304 -2379 -4063 -24396 -13069 -29620 -51290 -58094
20642 -58094 -81901 -48649 -31149 -55731 -44301 -29486 -25266 -13470 -24073 -26956 -1229 5759
20630 5759 56634 15471 -38574 -68503 -43820 -29008 -15376 -37320 -5395 19606 -19470 -95071
20618 -95071 -102596 -66270 -27163 -2058 -22023 -5444 23525 31380 -10378 -32638 -17242 1718
20606 1718 -6048 -8191 -2935 -33891 -40805 -50085 -56491 -63912 -70584 -40978 -10604 9390 26469
20593 26469 45281 51532 47355 14464 7592 -19533 3695 -7696 -56471 -61459 -91305 -89603 -73453
20580 -73453 -51787 -25922 -765 2694 -4891 -6206 -9315 -42810 -24208 -667 17275 19944 22235
20567 22235 17647 -8847 -36473 -32471 -13962 29584 258 -33730 -37946 -5378 -6451 -152 -4627
20554 -4627 -74965 -99124 -77703 -15972 19730 3037 18883 51071 23260 -4329 -32195 -40761
20542 -40761 -35765 -51978 -63580 -62866 -60960 -67585 -84821 -54677 -27108 -18999 -28677 -5103 29000
20529 29000 13392 -18933 -25427 18388 -7543 -45223 -113014 -91894 -72924 -36378 -29489 -25051
20517 -25051 -9705 1121 -11608 -27697 -37709 -67097 -65047 -45571 -13472 27009 28172 53326
20505 53326 27540 8113 -12077 14110 23264 1735 8309 -10436 9434 39642 15342 26988
20493 26988 15605 3470 35720 23708 -8237 8132 54041 41295 57765 16954 22104 5769
20481 5769 -16881 -15087 16419 25016 41322 31155 66890 8046 5575 39577 14644 -41798
20469 -41798 -29547 -7418 33551 51126 77652 24627 58765 122295 161579 143092 170099 244986
20457 244986 333750 419822 554352 805351 1162338 1524498 1615636 1394372 1086581 787748
20447 787748 555670 387335 297034 225661 158273 112976 97094 113313 113009 125160 56899
20436 56899 25807 28251 24250 -27383 -37945 -39706 -65485 -27232 -17863 7728 -3424 -19352
20424 -19352 10456 18844 25944 47955 62727 58511 26698 31966 44188 78019 58941 81378
20412 81378 63935 74110 41759 17467 16646 -7944 -27255 -26701 -37667 14316 23013 -22356 -45732
20399 -45732 -33688 -42914 -19471 -38332 -34247 -18608 -24164 -44294 -5910 -38734 -14947 -159
20387 -159 43931 45464 12673 -2524 16412 48471 53367 11150 -33914 13154 81060 108790
20375 108790 99562 54530 37268 63281 86048 21487 -43354 18826 25456 49667 69029 49627
20363 49627 55324 79550 98175 48063 22148 19122 39627 52172 26317 15576 10510 27948
20351 27948 48344 -5998 -3825 33685 54884 68818 105604 135941 96688 24654 13318 12802
20339 12802 44064 25027 -27665 -13449 10660 7236 11207 32058 51217 62271 20172 18084
20327 18084 64167 56671 9122 -2615 -31647 -23735 -9507 -14677 -1887 11905 -34637 -41864
20315 -41864 -26194 -32729 -51320 -59136 -12744 28836 68344 55206 14440 -18293 -20517 -33225
20303 -33225 -31653 -8996 4404 12045 -5980 -4453 11742 2949 -12622 -7773 11844 -15509 -17327
20290 -17327 -11639 11667 25334 39460 58782 51258 -54473 -79158 -52231 -25076 15249 30986
20278 30986 73574 39701 -21900 -44964 -560 -12726 -39540 -63606 -53110 -11646 -11084 10548
20266 10548 34549 4369 -25238 -9297 13242 -22194 -17295 1427 -17509 4426 19490 22673
20254 22673 69928 77409 8945 83 -36560 -33939 -14066 5566 60838 48607 -11568 -44953
20242 -44953 -29134 -2042 17037 -1118 -7210 -19543 -22079 -3295 7997 -29572 -31119 -44755
20230 -44755 840 30278 29729 -523 -28495 -11565 5466 6155 -15859 -61834 -24661 -11344
20218 -11344 -23565 -18731 -31113 -20892 25411 84275 64467 25181 24606 42113 39355 33543 36571
20205 36571 44167 -22180 -8301 -6757 11738 -6366 -36971 -58968 -48273 -42453 -36706 -20289
20193 -20289 10815 -17688 852 11046 -4922 -41336 -47422 -32461 -44803 -42559 -44325 -46896
20181 -46896 -15322 51781 76905 39352 27737 53210 26792 -1570 -19803 -784 19839 -48210
20169 -48210 -62494 -20832 32755 14676 29442 61586 67079 6032 -11959 1181 -29246 -11581
20157 -11581 -9253 1174 4998 -303 -20848 -80168 -80961 -65169 -74069 -73601 -74102 -57025 -73645 -68479
20143 -68479 -73198 -55666 -15690 -23124 -22986 -19876 -10603 -28206 -36903 -1528 17668 3401 -40581
20130 -40581 -15689 43887 33987 69815 81598 33675 4655 -7107 -3193 -26126 -6360 1328
20118 1328 -20136 -49762 -47546 -25062 -27160 -12795 13276 29302 67441 68659 54675 27209
20106 27209 55708 62663 78557 117893 82520 41442 11934 187 26677 50421 77706 135383
20094 135383 104576 60036 52793 93853 158184 169424 191184 220855 185805 121926 78932 81728
20082 81728 51520 47912 38795 38754 102972 153266 138949 66966 -21610 7391 -529 -25091 -63481
20069 -63481 -74672 -977 13873 19428 8124 -25663 -93871 -129256 -123234 -97793 -48135 -8033
20057 -8033 48287 87405 82396 64974 47707 34189 44394 51767 -1451 -15639 14057 36818
20045 36818 23352 -11646 -6003 34232 13846 5466 56346 61474 56780 82136 81730 45018 -1472
20032 -1472 7756 27415 25284 9931 5008 51189 105061 90794 92621 73313 58285 61091 61263
20019 61263 67890 69893 66853 83509 101482 114307 72861 90765 107840 131898 138198 75384
20007 75384 32195 19402 11431 -38280 -38909 -3455 -13173 6370 45092 68587 92144 111324
19995 111324 90797 60363 49801 50140 81811 65745 64523 33004 24127 3051 20678 55248
19983 55248 95227 114068 68398 62310 88733 89341 113522 166075 170688 175562 193102 184334 152352
19970 152352 200767 254157 244406 265279 315594 328041 343467 314782 295392 180871 36684
19959 36684 -87341 -117686 -62973 -30257 -18357 -30410 -2238 12372 39853 55363 36614
19948 36614 27892 50052 20078 22499 94085 89560 100521 85293 49136 -1173 48628 100288
19936 100288 113242 99655 75719 59107 62722 56877 74250 72740 90529 114726 142866 132380
19924 132380 147046 185360 114266 90464 78070 77113 79673 76746 138274 213716 253700 268851
19912 268851 262142 274526 324812 359545 421139 477346 628921 868741 1184837 1558713 1869925
19901 1869925 1909079 1696146 1390118 1103229 857017 711332 613263 584974 530376 513876
19891 513876 504741 488777 495956 526029 560135 596267 674357 719819 742059 798010 844770 893052
19879 893052 977778 1091529 1222947 1399259 1659010 2012906 2483299 2945944 3093084 3105895
19869 3105895 3094159 2892033 2629380 2401206 2269117 2261196 2352125 2510411 2714362 2889142
19859 2889142 3102725 3361832 3688286 4059224 4453619 4965087 5601078 6289290 7156256
19850 7156256 8252207 9568123 11241605 13365138 16128649 19927521 25195634 32386903
19842 32386903 42150267 55684993 75397090 105840697 153617480 219594253 278975004
19835 278975004 292736382 256208084 195748475 138938119 98110925 72029383 55274526
19828 55274526 43762653 35483643 29315531 24547350 20783656 17793993 15383337 13330882
19820 13330882 11704829 10354876 9200339 8230755 7343506 6600862 5976195 5437800 4939984
19811 4939984 4497306 4118624 3794981 3600659 3425816 3243314 3085055 2991640 3024458 3171582
19801 3171582 3463725 3691026 3818425 3782169 3490561 3035716 2539624 2149822 1853098 1652002
19791 1652002 1565006 1554758 1573506 1535304 1449920 1367685 1238871 1164297 1098410 1072158 1047808
19780 1047808 1021854 988110 982876 988092 995250 1045908 1052616 1119989 1235393 1457136 1821430
19769 1821430 2163802 2244764 2007718 1634714 1304843 1064960 904833 822528 731360 652956
19759 652956 613397 600298 619267 570635 553207 537679 486585 475221 496421 496098 429774 392982
19747 392982 365359 359938 319562 268515 326395 415526 428044 414925 421701 418018 379957 358090
19735 358090 371811 377472 321727 286387 297206 314271 309898 288990 256244 259045 280677 275911
19723 275911 296368 317662 343409 415071 404240 370719 325797 317478 353870 395817 410779 405657
19711 405657 377685 298904 196586 116688 5911 -45763 -7353 2697 248 319 10047 35787
19699 35787 9923 37303 92870 130197 89386 47387 9206 8009 -8037 -2812 362 37674
19687 37674 67949 79494 85010 121568 102837 83904 66473 86230 143524 147077 176652 176575 179596
19674 179596 140079 96046 84137 66870 59123 47044 43628 48320 50465 88592 93931 54913
19662 54913 48887 67305 95149 123499 73422 38712 49012 65053 95026 82385 92836 104579
19650 104579 139041 135578 101614 83990 100590 76371 37293 -4741 23057 52768 79322 101936
19638 101936 117258 80790 26056 18716 -12016 -20454 40961 73289 78791 89242 105667 104368
19626 104368 109355 72730 63463 49618 71186 67977 55634 91480 69765 48941 16623 13810
19614 13810 1585 20703 30431 60552 80354 90137 109137 119776 97569 55653 98569 129706
19602 129706 129306 113631 66304 69561 62848 45939 26268 33714 84840 47075 13612 8069 18109
19589 18109 20032 21778 13001 49453 76679 95186 80692 -23461 -90237 -82064 -32011 23335
19577 23335 55247 65936 83382 90134 100076 131099 94237 86068 62507 47198 37585 35341 32995
19564 32995 69503 76919 69287 50930 30791 33487 -1143 -18836 -18425 -1447 55283 46485 5790
19551 5790 -25170 -33108 -49419 -62536 -46635 -3947 22380 19708 7272 -9586 -26087 -10086
19539 -10086 -65935 -69828 -65171 -74701 -86815 -113549 -69703 -49313 -7115 26711 63891 85919
19527 85919 51117 33024 64007 90997 89966 113467 146726 93812 90419 75667 82315 62129
19515 62129 62829 47949 30533 45559 7370 -3288 -7563 13774 57314 31378 49781 28526
19503 28526 53484 59976 58490 103398 104305 46068 56161 96743 64267 59039 52658 -5025 4367
19490 4367 8950 -24707 -47807 -45321 -27133 1505 -12062 -418 8558 28623 4180 -30198
19478 -30198 -4565 27896 -10147 32405 94725 75264 77955 43432 15754 42650 73401 56076
19466 56076 92436 108660 83618 59887 60684 39650 1027 -13275 37858 70450 59116 36707
19454 36707 21917 -16098 -19232 6648 4660 -25571 12964 -28314 -1700 37533 33580 13767
19442 13767 35322 12153 -5857 -12703 -9454 17904 -14131 5059 22448 48273 54391 47930
19430 47930 12941 -2222 -34774 -35432 -25143 -37313 -12907 -24120 -21154 -5668 14175 33551
19418 33551 28014 17050 35112 52693 20328 38891 58941 41593 50353 17386 -5763 -3376
19406 -3376 2832 24505 40751 12993 20995 -5174 -48283 -53082 -9280 16671 12537 23047 9834
19393 9834 15838 15855 10616 3176 25448 30760 11700 -935 69466 71474 65165 29423 -15560 -20953
19379 -20953 957 25649 13714 26475 24374 66068 64098 40968 30231 -1128 -31423 -27080
19367 -27080 15836 19108 12837 11416 -7197 -9240 -30874 -21322 -197 13283 14717 37633 26866
19354 26866 -13041 -14145 12857 19635 43488 35821 22443 48960 47108 34241 17160 14616 9424
19341 9424 -12411 -6199 49958 66239 37061 6667 11466 30241 9503 1542 4200 43515 62567
19328 62567 18013 21201 18001 4346 14006 17802 36861 53293 23040 -271 -18308 -25543 -453
19315 -453 45586 44474 26002 8900 -33498 -68593 -66838 -37403 -49336 -74208 -50206 6954
19303 6954 -6598 -16031 21576 14100 27698 8433 -21675 -12672 -16358 -25433 -23961 -64370 -65659
19290 -65659 -47049 -42952 -51565 -53770 -76638 -73523 -56283 -8431 4406 3176 3631 30138 22503
19277 22503 20280 18966 -12185 -29519 50594 66615 51763 29525 50460 36563 14652 -18163
19265 -18163 -16790 -34507 -23067 345 34120 36536 38940 17520 -17626 -49238 -40642 -33895 -54691
19252 -54691 -2341 -8425 -30616 -7767 13795 21803 23567 2913 20904 13800 -5774 5282
19240 5282 6120 2148 12867 24545 19004 8592 -50467 -57120 -42837 -21516 -20038 -13369 23828
19227 23828 31746 22974 7860 50386 42119 68028 141957 188603 236806 306422 425989 661740
19215 661740 924378 1259346 1553911 1602650 1415709 1128922 788085 496376 360949 281174
19205 281174 219911 191359 162089 113533 110319 133948 111561 114332 100365 82852 57233 48849
19193 48849 65878 55346 54036 100990 84346 43558 2150 -17194 3031 7626 -3396 23407
19181 23407 17842 -11821 -10604 -31516 -67545 -36247 8073 -6295 -18954 17099 26774 20774
19169 20774 47743 48915 -606 66469 77545 61427 30742 969 14912 17162 37901 100674
19157 100674 63293 6866 -27315 -13654 7710 11415 1303 39849 40314 -36472 -64441 -45262
19145 -45262 -26251 -12960 -16531 -12296 47486 51119 29721 28172 1970 -23645 -31301 -20695 -32482
19132 -32482 -611 70573 85265 35362 -20717 -22776 38772 67155 2009 -35959 -37651 3590
19120 3590 5382 6185 17096 46150 82346 39362 32605 57165 10451 -35217 -38008 -41575 -27620
19107 -27620 -47518 -62124 -40297 -37872 -28592 14153 -8546 1276 13792 681 45463 26319
19095 26319 10873 44254 31334 40746 43548 -12637 -35197 -16082 -2243 26079 23059 6570
19083 6570 6701 14696 5506 4435 31076 11746 -14061 19077 42230 25895 26291 -14042 -6510
19070 -6510 5218 -6271 20108 20648 23570 -3240 -16005 -19911 11896 67150 70169 65304 3862
19057 3862 -15508 9328 11244 -45018 -36417 8364 8838 -27377 -59542 -64201 -41464 -28014 -34020
19044 -34020 -18356 -24669 -1023 23202 12803 -31395 -58036 -65652 -83963 -77944 -31368 -20786
19032 -20786 -36610 -6221 17836 11449 -26132 -3700 33261 25099 52922 44183 10929 -6400
19020 -6400 -46186 -48737 -64390 -50778 -6898 18262 17890 12001 -9325 -37607 -14431 -20568 -22434
19007 -22434 1406 5147 -44943 -56210 -30406 -18433 -40697 -68274 -57843 -90923 -95325 -33872
18995 -33872 39859 48377 26952 69650 38237 -4362 -8516 27712 67472 44432 26404 32475
18983 32475 8483 -7931 -52289 -54463 -68399 -62413 -47032 -11086 4906 22404 11832 32103
18971 32103 34786 8014 -47411 -65388 -105777 -58297 -40251 -44057 -36753 -45080 -42380 -5876 16934
18958 16934 -27866 -28838 -11173 23181 39793 27368 14272 38504 92618 57047 6954 8640
18946 8640 25341 -22352 -22224 -17860 -26833 4590 38298 30323 3440 24401 81747 79005 45108
18933 45108 61862 39636 -12624 -41328 -15837 -1532 -7213 -19039 -26164 -434 -3675 -26986
18921 -26986 -12293 25859 66985 78571 53660 18343 1755 24596 26752 36879 14435 2078
18909 2078 31143 68647 57459 57218 43638 32215 68600 6096 -10156 27238 52353 22228
18897 22228 -3607 14824 10142 -49076 -71052 -22655 -16447 14189 29271 47579 54847 65089
18885 65089 40960 -26742 -3328 36388 35706 47937 55211 27562 10197 18961 24969 26028 16930
18872 16930 54350 62318 72276 38123 -27090 -35554 -21819 -6572 -11879 14271 17358 9010 20547
18859 20547 -23263 -21168 1481 -17727 -42640 -41744 -32841 -4979 26627 43595 65569 4375
18847 4375 -12465 -21097 -5911 19960 -11234 -29003 -5483 28531 51561 51857 -3073 -57895
18835 -57895 -112553 -100772 -98550 -51617 -24596 -7685 10435 21983 46721 45210 34829 25204
18823 25204 30940 35541 -12392 -21370 -56656 -67901 -20386 -6019 -25382 -59710 -78119 -63247
18811 -63247 -20596 4256 -24433 -25740 -41498 -1119 57028 53421 41783 33835 59390 75648
18799 75648 19750 -40585 -13785 19934 27104 2463 -21794 -40213 -58576 -57074 -10125 46480
18787 46480 64762 60312 64140 55433 51525 20840 12014 -24154 -32441 -24040 -19779 -38548 -36071
18774 -36071 -25906 29050 122656 157732 202782 304967 421635 487048 399892 298525 176290
18763 176290 105615 66266 48263 44306 23189 -3407 -7151 -9719 11640 51742 75229 70895
18751 70895 -14977 -64827 -89614 -40096 7214 22750 -1820 -2340 -6548 -3755 8612 -16084
18739 -16084 -50246 -57866 -36382 -38634 -62814 455 36786 41459 -16623 -66711 -44485 -12799
18727 -12799 -37458 -64191 -72003 -52548 -69280 -78197 -96239 -54068 -16886 -18451 -9081 -32012
18715 -32012 -22480 -32352 -65829 -98301 -100170 -34940 -7147 -11417 15964 44090 13688 -35685
18703 -35685 -53460 -28211 -46009 -55554 -2219 17469 -21672 -29768 -40514 -62893 -38167 -41640
18691 -41640 -48890 -52958 -47118 -36536 6689 -17957 -49158 -64868 -60386 -3731 24753 22245 6583
18678 6583 -3422 20549 11403 2994 33713 46489 65019 45575 25431 14633 15254 13017 8121
18665 8121 21918 22548 -16812 -37462 -26898 763 18114 -34089 -78470 -72644 -62185 -91177
18653 -91177 -91371 -95861 -57727 16231 44244 35524 16006 -25588 -35476 -53009 -39396 -38510 -30419
18640 -30419 3923 27881 2276 11080 15917 37519 83039 81872 73729 51255 10200 -11249
18628 -11249 27260 34768 19081 9010 22145 60445 29075 -54524 -69082 -43042 -1788 23539
18616 23539 35528 22997 32710 28904 670 19779 32973 29332 27287 14066 37689 23531
18604 23531 6317 25539 -5118 -42176 -49514 -30591 -6860 -13236 -3434 -12989 -58197 -81872
18592 -81872 -51242 5427 15127 26361 25900 -8121 -10277 -10714 -27208 -26667 -27432 -21812 -38005 -73510
18578 -73510 -80958 -21192 -20956 -56103 -61489 -27940 -9903 10542 -9035 -38334 -38331 3101 -892
18565 -892 -45084 -15150 14364 31042 18934 -12192 59414 71738 67642 15030 -6702 -26327
18553 -26327 -22106 -4625 -51848 -81830 -69064 -42620 -10934 -9591 -24909 2774 9048 12161
18541 12161 15770 19730 10370 14132 -29189 -55141 -37737 -16027 -1756 -30358 -22705 6387 7170
18528 7170 -53681 -83545 -41505 -4478 17699 2683 12837 16697 22443 21472 16106 36049 22101
18515 22101 -392 7533 -3882 -14582 -32631 -63047 -55127 -7012 30723 49460 35147 12382
18503 12382 3932 -23404 -53270 -97199 -61729 -68942 -73955 -53090 -44954 -56845 -45049 -47455 -32630
18490 -32630 -7401 21272 34883 18938 -2848 1383 14968 21682 -17636 -28417 -26762 14630
18478 14630 22447 9312 55755 75736 26275 32296 53933 26526 7598 34785 12500 -19400
18466 -19400 27264 42653 85110 103214 73718 52375 61013 52213 62774 72385 68608 54968
18454 54968 19307 25528 -12680 -2171 35616 48085 6185 -9684 -12380 -36104 -10815 -16490
18442 -16490 -57659 -75347 -93364 -73098 -58263 -45994 -33837 -43707 12433 22260 35899 41879
18430 41879 32960 36686 19201 -22540 -27743 -8106 8701 20712 7860 3769 -21187 -36100
18418 -36100 -10794 12436 12772 5105 -11861 -1052 -7819 -47586 -38804 -40144 -51567 -13022 -28376
18405 -28376 -52170 -59905 -12135 5566 -6283 -24679 -50045 -58243 -42222 -30957 6850 -1035
18393 -1035 -16260 -9757 9656 -11297 -40286 -52324 -60669 -51637 -30070 -39477 -23872 -61991 -109059
18380 -109059 -77950 -9760 -22933 -22819 -35176 -48368 -58278 -31197 26240 45372 58494 58184
18368 58184 59785 88316 90807 89752 84473 86478 62524 20656 -44107 -59835 -46865 -20300 -35789
18355 -35789 -73229 -108023 -75712 -62264 -33589 -55271 -65247 -77070 -30862 -4238 -57182 -85613
18343 -85613 -75002 -91999 -73882 -76314 -27837 22910 26983 -26578 -39276 -10200 722 -18203
18331 -18203 -7360 5728 -15096 -8199 5613 -31340 -40978 -32954 -40400 -4485 25678 32573 26483
18318 26483 -9618 -19679 5312 23684 -7197 -47698 -77033 -99676 -108743 -75909 -41699 -21097
18306 -21097 -5268 47665 71014 73861 64849 46306 25887 25762 95028 157388 156242 137882 114968
18293 114968 64585 59773 42866 78017 109724 87908 63957 3495 23755 48027 -18538 -53783
18281 -53783 -18173 -12019 -12321 -10036 25090 14638 -3683 -2540 -11574 5511 2200 34246 31593
18268 31593 2345 33682 40216 11114 -4051 5298 4176 31637 12088 21121 13133 11450 4580
18255 4580 9959 23473 -24415 -41958 -17031 -2850 -16625 -19490 15991 67882 72850 21609
18243 21609 -39535 -6012 24700 22082 68648 79865 79036 82122 60906 6457 -51182 -30953
18231 -30953 -31319 -28032 -31203 -47054 -21799 30016 5992 -30743 -10605 2584 -24571 -62920
18219 -62920 -58595 -43710 -2822 34807 27423 -1552 -12910 7932 29314 10811 5502 -3087
18207 -3087 15636 42172 89828 99870 115857 72057 63317 69646 63950 45456 36911 38508 33001
18194 33001 34231 -1323 -24489 -30283 -37642 -27302 -25959 -26009 -7823 -6680 10914 20659 10946 6793
18180 6793 -7167 25867 74009 96881 121557 101984 93396 110147 100066 60297 43814 50861
18168 50861 71239 97059 66176 65691 60928 71622 90842 60334 86019 116650 98081 128844
18156 128844 114096 129863 133554 116950 86006 73469 95158 97910 72160 80194 138578 176706
18144 176706 176378 153938 149337 137346 143052 143200 154711 181539 247046 269388 251645 310777 440586
18131 440586 464201 446406 442289 505321 563904 625266 760521 905718 1025283 1219204 1498382
18120 1498382 1809418 2248359 2855222 3704056 5025682 6990162 9871737 14541195 23402576
18111 23402576 41714431 69556091 82621037 71770036 49649291 29899040 17931919
18104 17931919 11954667 8716411 6781952 5488862 4547472 3873145 3398458 2965992 2530236
18095 2530236 2154211 1877801 1641228 1440097 1298232 1152988 1032056 903362 838967 771489
18085 771489 701959 585705 549189 496610 458146 428985 357738 309770 327155 342223 354580
18074 354580 379641 356967 312642 271445 268743 245323 260739 245181 202898 182357 164672 163197
18062 163197 174736 166402 128951 135255 149512 218224 287005 360083 394010 372934 350771 334924
18050 334924 334165 323274 314752 266373 219576 203335 215616 177285 132137 99168 86702 74624
18038 74624 10249 -54222 -39917 -22713 26502 49242 60081 63341 73588 75992 66157 26214
18026 26214 18621 26430 23046 45038 41643 54469 46226 45154 58487 88341 111456 131293 137180
18013 137180 133197 132836 71505 51957 94285 121273 59954 43291 48282 35129 35489 46773 7070
18000 7070 36993 89669 102542 119828 148477 228953 201301 190780 230126 256965 233114 251445
17988 251445 316190 378062 426371 428565 419231 365906 313218 268169 258162 249818 231583 237232
17976 237232 216057 202558 143578 137126 104348 93863 62243 97669 76871 73525 111406 95135
17964 95135 68937 61922 62322 39631 70243 91455 59700 84669 77804 94564 131290 133751 113845
17951 113845 86894 82959 108241 134061 115371 108433 128269 144817 149353 131255 157745 207264
17939 207264 226825 205584 189558 157341 135024 134491 133209 120894 149104 119595 85560 42167
17927 42167 21449 48308 53062 27569 11579 13993 13728 -26726 -33042 8891 46641 40826 13806
17914 13806 37000 54516 28418 -57219 -62220 -59753 -45834 -20043 3470 37264 46074 -188
17902 -188 13596 55951 55808 20153 26099 54125 48819 68612 46015 -10952 -40095 -25000 35084
17889 35084 75321 107034 97938 57881 4641 -2346 4484 14024 21812 4849 -20151 -22103 -58117
17876 -58117 -85031 -136817 -91898 -11136 -44711 -26217 9955 1035 27321 31562 -30157 -67402
17864 -67402 -88203 -98851 -55453 -11120 -5460 -25206 -5411 22105 14203 1556 54000 55174
17852 55174 41503 39919 52171 29500 12603 42943 88075 83476 90007 93144 55153 56203 49140
17839 49140 30571 4534 -6492 23015 25324 5486 35905 46660 43 -31933 -36608 -26461
17827 -26461 -62620 -59820 -77461 -58998 -59377 -33167 -7015 3194 -10099 6963 -6576 -7256 3283
17814 3283 -13153 -20342 -18568 -39592 -6095 16783 -11657 -5087 21616 56786 42525 33522 29123
17801 29123 -38355 -30078 -379 11766 18423 -178 32568 46896 18078 10706 12397 5741 24489
17788 24489 23304 -18074 -54168 -64630 -56798 -57336 -28407 24967 -1492 3846 492 14773 37205
17775 37205 -6875 -42704 -93846 -70067 -29756 -22958 -33626 -36066 -7008 -898 11229 12079 -38296
17762 -38296 -39674 -29010 -60219 -80751 -60972 -59666 -48296 -30664 15038 34273 458 -27656
17750 -27656 -55073 -62286 -35648 -21977 -48714 -68743 -94383 -85320 -42626 -73981 -78777 -18717
17738 -18717 -34490 -49605 -35692 16843 45117 42984 46349 35144 57824 45885 31643 55324
17726 55324 24946 -18841 -24298 -18958 -13808 -28287 -66168 -82862 -52434 -28754 6178 28053
17714 28053 15254 -19624 -52898 13097 37724 2595 -22805 -1275 1516 2359 -13527 -25956
17702 -25956 -62479 -96873 -44641 -24226 -29722 -58908 -67888 -57225 -8293 -26641 -12384 1828
17690 1828 24239 -30091 -50614 -43592 -12977 5837 6471 -50786 -77255 -40054 -53321 -82902
17678 -82902 -58682 -58911 -70379 -63728 -64388 -52920 -36261 -17936 194 12663 62816 39713 -18547
17665 -18547 -41880 -36278 -5502 -18462 -48677 -46316 -72328 -84403 -76771 -56889 -67942 -71737
17653 -71737 -55846 -25885 -32678 -37101 -31898 -13605 -1824 -17561 2283 13817 15550 -30390
17641 -30390 -37747 -34246 -56343 -25511 6610 56818 93407 70078 -857 -33537 -42379 -12004
17629 -12004 15441 56096 95547 118048 98890 42857 29422 41756 50405 -19910 -30055 -37852
17617 -37852 -38052 -22655 -38751 -26471 -36628 -46684 -38572 -81093 -76196 -18711 -3971 -12146 -20202
17604 -20202 -35112 -31238 -6544 18889 22087 -1721 5678 32341 6120 21287 32661 13018
17592 13018 -2775 5265 29835 15494 5742 12133 21326 215 -20693 -36608 -5479 21196
17580 21196 -6331 -31214 -10034 5236 -14435 -1787 -8065 -14587 -30121 13087 58807 41817
17568 41817 36154 14436 751 -4595 -5066 -27765 -17674 12809 49398 49476 -7035 -36816 -45834
17555 -45834 -48471 -27489 -22064 -32891 -10941 24621 -8250 14101 46667 32493 2195 20828
17543 20828 47419 -14124 -31014 21198 50082 44822 76977 67568 41421 63754 84763 97889
17531 97889 97517 88355 55259 9178 -23111 -24966 -50649 -39986 -12131 -10733 6934 54732 12316
17518 12316 -37704 -42807 -23228 8672 51609 31087 6118 39090 60446 46617 28910 3102
17506 3102 -10969 -4475 -27219 -82269 -123526 -147165 -127923 -126088 -125613 -76668 -90534 -89161 -79344
17493 -79344 -10165 -13413 -38007 -38076 -44748 -57734 -88604 -41133 -15378 -4674 33121 7550 -26503
17480 -26503 -51984 -43848 -50920 -35087 10103 20141 47286 4136 -4868 -6206 -32115 -40882 -74436
17467 -74436 -59896 -6381 -9206 -31757 -34545 -3417 16504 -15542 -24110 -11147 -1110 -1824 -6177
17454 -6177 -2768 10383 -18286 -10160 7443 2307 -24135 26928 68845 144897 334779 406497
17442 406497 385806 257144 154662 84635 42290 12631 30074 51176 79108 81726 40116
17431 40116 409 -875 46446 45609 -6363 -31169 -22088 -15452 -24448 -54726 -20159 -3300 -12368
17418 -12368 10793 28138 -7957 25376 43703 -3474 -34721 -29204 -20277 -1086 -23534 -30565
17406 -30565 -34085 -43647 -88619 -128818 -84931 -46226 -35797 -52535 -28342 -24902 -18288 -6100
17394 -6100 16568 22058 19958 -23918 -36871 -22964 11149 28639 39849 40303 44 -10950 -21095
17381 -21095 19892 15404 5134 5677 -28639 -68397 -64944 -73364 -49061 -10488 -34549 -74537 -77931
17368 -77931 -52050 -51575 -57818 -43750 -37537 -3912 -274 -43920 -14527 -10721 -6031 21871 9239
17355 9239 -17677 -13068 477 -70211 -41538 -14474 -8084 12699 -22602 -61473 -43717 -37884
17343 -37884 -73062 -51048 -13443 4853 3688 25091 42285 4597 -27415 -58495 -56361 -23633
17331 -23633 -10564 -40739 -90485 -59409 -12145 41339 37801 7388 -2184 20118 50735 78462
17319 78462 44836 -28079 -19170 -5412 -35566 -58292 -41254 -29531 -25239 8125 22963 30242
17307 30242 100043 90347 70164 62809 30997 22069 30429 47575 26987 43779 54687 -8692
17295 -8692 -30629 -17561 -48924 -7111 30029 27703 -12987 -64415 -61835 -26736 7522 7739 -19644
17282 -19644 -35881 23249 13147 -9567 -86811 -71395 -44363 -30098 7084 39637 69832 23329
17270 23329 20209 -18424 10183 12685 -403 -12142 -20543 -25221 -48941 -63762 -113682 -120652 -89844
17257 -89844 -97929 -126251 -104493 -88601 -38538 -28953 -48527 -48821 -11732 -4750 -1100 3556 -59950
17244 -59950 -77469 -66482 -40218 -48704 -68072 -92236 -67941 -75303 -62690 -39104 -36164 -25533
17232 -25533 23582 49399 30 -23755 -31989 -73437 -73962 -46279 -43282 -48785 -58291 -20434 12966
17219 12966 -18750 -53832 6915 103262 121068 78738 -17478 -58031 -94905 -103985 -32003 6604
17207 6604 11901 5466 -65031 -85130 -69758 -40927 -11697 -6734 -37379 -58681 -110443 -97134
17195 -97134 -66000 -88479 -62709 39718 74046 79680 69432 65389 63023 21183 -16464 -17744
17183 -17744 -41378 -55954 -31643 -22466 6433 -16164 145 -8654 -20008 -29353 -40068 -52087
17171 -52087 -40773 -61376 -27903 19642 27042 15741 -25954 -4034 3506 3116 -3011 9420 -2451
17158 -2451 -10790 -10367 7635 29936 30526 22921 28020 -23548 -25738 -61410 -36413 -31077 -44295 -34775
17144 -34775 5801 36150 72771 59313 31386 21674 34264 52114 36518 -912 -14629 -20571
17132 -20571 11008 2095 -41495 -71396 -66175 -35781 -9458 21467 53292 95260 81793 17108
17120 17108 8400 14711 -18232 -20611 46243 49944 74179 87403 45043 3979 -4190 -50002 -65382
17107 -65382 -76404 -66914 -37247 -23621 -2418 45006 45765 -46407 -112034 -75371 -32480 -9904
17095 -9904 -18078 -30054 -45595 -81967 -77327 -56038 -34165 -17145 -5247 -8353 12761 14445 -2688
17082 -2688 -34485 -11143 -18706 -44762 -64369 -32109 -25395 -24513 -26943 -4113 -38487 -75239 -85481
17069 -85481 -64164 -53877 -41995 -12846 4669 -10718 3104 28898 19387 -18455 -18978 -29962
17057 -29962 -31592 -5883 20281 4562 -8563 363 15829 -343 29409 30259 -13241 -18584 -13664
17044 -13664 -4208 -19509 -30981 1930 24014 28903 25937 4460 31427 25180 3493 -17194
17032 -17194 -47379 -39325 -28972 -39458 -66957 -80437 -40232 -1629 -4314 -29492 -59280 -79574
17020 -79574 -65875 -59050 -27189 -5444 876 5427 23358 -2310 -16460 -16645 -17694 -10451 -15951
17007 -15951 6443 31056 15275 23660 20247 -6317 -25898 -25048 -20816 -10088 1809 -8876 -25048
16994 -25048 -3453 38459 10267 -60071 -63300 -60381 -1375 30896 40083 -2793 -25666 -22230
16982 -22230 -54522 -35751 -25581 -49636 -90540 -101856 -37400 -69831 -77701 -65423 -50781 -51168
16970 -51168 -19943 10636 49651 41547 12553 -26121 -45257 -54786 -57788 -50999 -54815 -43266 -10091
16957 -10091 18243 -6313 -7497 1624 24521 40296 9582 -12616 -16094 -58087 -81589 -57813
16945 -57813 -41496 -56894 -76620 -92260 -76895 -55613 -11203 24868 6600 -8358 19477 34857
16933 34857 22245 -2490 -27717 -57921 -93884 -36636 -49331 -49752 999 42446 40310 25427
16921 25427 -5155 -59074 -68793 -60718 -71440 -40842 -58610 -52391 -58279 -62745 -87792 -27370 5785
16908 5785 -6933 -19488 -30409 -13074 -21402 6886 -13991 -33341 -16151 5504 -19201 -70003
16896 -70003 -78917 -76979 -60234 -20777 -31408 -50597 37175 36191 15975 -21405 -51480 -73879
16884 -73879 -65841 -47902 -39727 -57584 -35021 -25413 -11822 11067 32645 43436 27232 -8452
16872 -8452 -50514 -31993 -38106 -21511 -21776 -16080 23632 12181 22615 19817 -6093 -24347 -40945
16859 -40945 -32044 13260 49736 13319 -20491 36726 79570 76719 72562 30626 -31754 -56973
16847 -56973 -58189 -70896 -24354 -4142 10142 9371 21420 -2838 1518 6732 -38742 -72838 -93952
16834 -93952 -94195 -118460 -92945 -55394 -51289 -64363 -77701 -111655 -139950 -101620 -48206 -8661
16822 -8661 -15460 -37333 -66288 -68269 -66411 -34851 -24737 -12421 24966 41419 36230 63167 65892
16809 65892 27025 -11293 -54977 -63747 -83724 -78862 -48176 7201 3231 -29580 -42011 -31185
16797 -31185 -7906 36993 44023 32866 -3928 -42799 -29598 -36736 -18123 -26940 -74148 -110086
16785 -110086 -71924 -49820 -98498 -101516 -84561 -36705 -31431 -19828 -3808 -32876 -19701 3573
16773 3573 3904 -14153 -34604 -36333 -32634 -26428 -30111 8356 22517 14003 -12201 -7256 -27621
16760 -27621 -33269 -29591 -61774 -97017 -58711 -52577 -48501 -72434 -87332 -55069 -14006 892
16748 892 11675 95822 118958 62914 7427 15952 23872 11593 45662 34458 -9755 -44778
16736 -44778 -16350 38051 50297 21532 45353 85868 77119 54204 6561 -2317 7793 3371
16724 3371 11743 -8338 -15771 -50290 -55997 -54466 -27762 1873 17329 -11934 -46881 -15851 1743
16711 1743 28897 51320 56982 67741 55462 23535 15281 22328 59897 48923 5782 16471
16699 16471 37586 26688 23770 10037 -4017 -1894 11936 26699 -18784 -52838 -13456 -10776
16687 -10776 11254 46972 36663 9125 -10943 -29383 -34003 -70352 -75232 -53562 -26263 -42549
16675 -42549 -62512 -61508 -81372 -104509 -111697 -70803 -57392 -49909 -20401 -6467 -41124 -41301 -41235
16662 -41235 -61860 -43228 -33652 -1495 56486 30422 1491 -3988 1003 -66799 -63832 -3712
16650 -3712 -11005 -37759 -68964 -84363 -42087 -27675 45158 69750 20607 -31411 -45242 -26051
16638 -26051 -49577 -14059 -10121 -25863 -56413 -69161 -71168 -66271 -57425 -46270 -40822 -71021 -99985
16625 -99985 -79904 -31071 -20085 -5403 -2882 -34275 -37885 -21195 -25219 11206 -14571 -29644
16613 -29644 -36568 -51174 -70266 -57876 -50019 -47513 -66452 -60111 -74426 -73125 -76757 -67537 -86177
16600 -86177 -140512 -129318 -97382 -85809 -68596 -60684 -35257 -49911 -81126 -93654 -49311 -39775
16588 -39775 -55519 -39532 -41679 -63808 -57914 -46496 -83250 -75314 -27866 -6676 -53435 -110835
16576 -110835 -136068 -112662 -55960 -82436 -51999 -14972 5425 9326 -7547 -35209 -28126 3033
16564 3033 34504 31620 19722 62452 119039 79820 -23253 -64655 -107515 -74675 21534 55659
16552 55659 63967 82472 94403 67388 36974 -786 -26060 -43429 -28706 -14127 -51986 -16446
16540 -16446 -8092 -4920 10811 58388 51795 -7520 -49247 -45888 -33166 2224 12004 -128 -8430
16527 -8430 -8119 26352 39815 20474 -16960 -27880 6023 -17545 -42800 -7287 12982 9143
16515 9143 12040 29744 39556 13094 -1142 -27140 -28667 32 24425 45513 40860 17100 -18071
16502 -18071 -5172 67041 63951 28733 3661 -2683 -6697 -46812 -29844 -9791 -2204 -859 59862
16489 59862 64241 34968 -4636 -19399 14561 -24441 -7878 13828 28252 -6402 -40749 11367
16477 11367 47626 27831 -15548 -5190 27607 55185 53114 45584 -2967 -39057 -2718 14302
16465 14302 33644 23015 6576 -23811 -30202 -10884 -15359 -43811 -43204 -27238 -10888 25994
16453 25994 15399 766 11712 17728 10119 28148 28882 6022 -21088 -5250 9214 -751 37960
16440 37960 63959 17225 7430 -42518 -43142 -72294 -95025 -55846 -10103 -4366 -21948 -5227
16428 -5227 -1053 30390 80213 65454 18475 20381 23727 12610 13995 13991 9805 9271 -3245 -15764
16414 -15764 -1117 2015 -4027 -41884 -101311 -81839 -45942 17556 47349 90071 89330 101468
16402 101468 73872 8065 -27383 -35810 -55355 -81881 -99126 -52639 -46272 -72150 -83073 -88364
16390 -88364 -52798 -43799 -49067 -12124 -48553 -33344 29641 34852 608 -7765 -2697 -48667 -47039
16377 -47039 -11008 3255 26326 13360 -4823 -28709 -3363 21336 36137 42278 -24661 -30229
16365 -30229 -32827 15817 49750 43807 16609 24643 21466 25506 -10352 -15937 -4154 -413 -22822
16352 -22822 -5334 -38035 -11532 45666 45615 25144 15378 -10087 20911 52603 34358 19447
16340 19447 47312 30257 -19212 -46791 -21998 -12234 -47352 -1629 8672 -1047 -15418 -47706
16328 -47706 -83845 -34858 22787 21917 11827 -9360 -59715 -48270 -59939 -80573 -51690 -30910
16316 -30910 -29620 -62720 -13475 32144 18409 28203 66498 98907 56529 4718 -44315 -11411
16304 -11411 21537 -3382 -10504 19466 25754 17178 5439 -7767 -30165 -25801 17125 15000 20536
16291 20536 5996 13425 19285 8638 -20668 -59720 -96352 -120122 -111865 -81646 -50515 -52487
16279 -52487 -18811 54159 48454 1498 -30544 -51450 -36611 -15565 -19603 -82522 -87693 -60275
16267 -60275 -22785 19415 27024 42026 85918 61746 52628 23149 -22802 -24369 2846 33592
16255 33592 50470 60654 27090 -20055 -20028 16649 25005 12091 -57324 -47099 11910 -16902
16243 -16902 -11092 20116 22855 54727 58243 28402 -13573 -1388 -11516 -11396 569 37002 36733
16230 36733 12281 -30731 -31986 -6620 15685 19913 5261 -23202 -30570 -13108 20518 42890
16218 42890 -7623 -43987 -17937 20577 51014 59051 26285 -109 -64945 -69392 -80525 -33774
16206 -33774 -57420 -465 51343 46397 39781 52869 19574 -2145 -320 39613 44211 -18433
16194 -18433 -51169 -15847 17663 48540 60552 27722 23706 28982 19767 10768 -2655 -1386 15683
16181 15683 24828 3177 -9170 14483 40252 15522 -32755 -32422 11173 18062 282 -13655
16169 -13655 5886 25067 18657 -25569 -46034 -44284 -18065 -7921 -22659 -29801 -49012 -48378 -34144
16156 -34144 -39208 -61319 -70397 -63190 -80628 -85897 -42014 4444 -19065 -44841 -76197 -79137 -96735
16143 -96735 -54281 -48304 -37844 -49085 -25332 19106 -8076 -22086 -36734 -63716 -90001 -40128
16131 -40128 15501 31801 34587 73192 60071 49153 30639 19537 39537 22888 28446 166
16119 166 4130 43094 36079 20189 246 66333 61426 55518 71955 54337 -19991 -55241 -17684
16106 -17684 34239 49968 41025 -14766 -47159 -50453 -43768 -49441 -29719 47667 13786 -10434
16094 -10434 -8970 -36284 -1212 34812 33806 19002 14419 -20721 4885 9004 31156 -10466
16082 -10466 -95038 -87743 -70730 -54919 -41822 -27622 -6987 13438 28510 36691 29022 -37632
16070 -37632 -64663 -41856 -38453 -34275 -47100 -23539 4449 37575 50566 -14797 -21362 13248
16058 13248 25915 7054 -11983 -28630 -17342 -13733 -4920 24375 41877 7361 1935 -33962
16046 -33962 -11992 20377 31265 48630 12882 -53833 -50761 -18904 -61587 -36487 40951 83030
16034 83030 74265 73407 71547 45117 44505 -3754 -31048 4768 -10419 -11147 -6802 5226 -8572
16021 -8572 -31818 -7502 -8397 -44646 -77076 -56128 -19096 -53272 -55234 -31434 19859 37955
16009 37955 20816 25629 48868 106925 89024 39808 -45066 -63836 -47687 -55153 -66791 -38942
15997 -38942 21008 21983 28113 23795 -95 720 -13431 -23544 -8882 24346 14996 16623 14267
15984 14267 -14135 11126 54790 33818 4808 17757 1944 27052 31886 -19410 -96243 -106992
15972 -106992 -71428 17074 40224 -4902 -945 -7043 42566 56538 86486 70733 39293 -8536
15960 -8536 -22345 -20928 -30141 11324 14147 20390 307 48159 46431 35859 1350 -18540 -6653
15947 -6653 2764 -21787 34895 75417 46376 38203 39245 -32786 -116802 -117326 -64622 -19502 3854
15934 3854 30239 43452 5746 -39404 -18533 -1184 13057 -4912 28462 68333 34132 -2138
15922 -2138 -13889 -7521 19767 23882 11897 14242 8719 32073 -23363 -16215 -13903 -1897 -10309
15909 -10309 -26110 927 53007 52589 39230 38742 58748 48473 23759 13539 14389 4778 -24861
15896 -24861 -44787 -755 44479 53289 60943 59082 64782 57658 32267 -19749 -23826 -16773 -5947
15883 -5947 -7155 7002 29782 -988 -12657 20691 56096 24154 -27028 -50802 -83992 -73168
15871 -73168 -79040 -38695 -74368 -71712 -61981 -55635 -67686 -1296 -21149 -61922 -87808 -57143
15859 -57143 -16158 -22153 25098 25525 29805 45556 31713 8599 -16183 -5235 33342 30370 -14140
15846 -14140 -6759 11538 578 1685 -1713 -16341 -15544 11578 30562 45730 36495 -10428 -21976
15833 -21976 10262 53098 72871 76311 83933 117603 110481 63982 23884 21947 15746 33359 24916
15820 24916 -11053 -31529 -27077 -45917 -31047 -53704 -58559 -48426 -33022 -20993 -39679 -46275
15808 -46275 -14528 -12229 -22135 -60878 -62385 -60847 -71807 -65775 -43606 -33361 -34096 6326 50538
15795 50538 47135 35884 15978 12573 -11919 -20829 -33036 -27911 -58215 -105659 -59951 12452
15783 12452 -20610 -43652 -28326 5113 7855 -15111 -39361 -42810 -9230 -12101 -9979 -16548 -59678
15770 -59678 -60002 -11953 16440 -2861 8950 27933 -8476 -13766 -14422 -31014 -9037 11276 -12321
15757 -12321 -39295 -47406 -49323 -8841 2744 38091 27007 20871 -20285 7546 21981 13702
15745 13702 23800 11517 -6008 -28979 -48099 -31496 -30055 -6997 16222 24307 9683 -2359
15733 -2359 -26356 -39175 -33358 -30289 17385 21195 24620 41496 -11365 -25899 15384 30203 -6012
15720 -6012 -35910 -25535 10474 32956 43592 -14875 -54455 -30066 -19230 4954 15585 18633
15708 18633 36472 5877 2304 56298 36515 -5719 14690 63362 61027 6360 -14224 20750
15696 20750 26869 2825 955 34756 7115 20919 49891 85129 95278 52962 17171 3085
15684 3085 13222 -12323 3911 -13877 -15868 -4026 -44718 -28161 -24539 -9362 1349 -34466
15672 -34466 -46584 -54660 -54058 -41882 -30873 10143 15603 -1029 -12008 4707 14988 38150
15660 38150 32417 -12265 -55626 -40233 -33649 -29715 4632 32025 2733 -36852 19790 65807
15648 65807 64888 59757 51426 38490 19067 -8025 -24561 23430 5966 -11726 1764 -16624
15636 -16624 -4822 41413 41381 79463 55871 33572 51949 49021 -8495 -65251 -27868 16614
15624 16614 23546 -6923 -40107 -24217 19072 18229 -3862 23401 31070 -2027 -17847 8302
15612 8302 14346 -3422 32627 40987 6835 -40829 -9021 42315 65640 74818 113784 149518
15600 149518 132129 99483 62823 60439 48444 43416 11995 -3282 -8603 -19223 -9400 -27792
15588 -27792 16556 52252 36677 -13804 -12964 1325 3403 -15926 -649 9161 -17340 12346
15576 12346 44537 10231 -13651 -7506 44407 78420 14943 -820 -6794 12759 13891 17593
15564 17593 7276 6091 11551 25365 2731 -17521 -55789 -43676 11762 32782 13274 11182
15552 11182 13922 49177 80351 68935 47810 43247 54567 69921 58806 36902 19255 36670
15540 36670 27515 11873 -30356 -16351 10171 34134 19060 -9547 -71834 -19547 20723 66303
15528 66303 36824 12876 14145 8271 21066 25961 -10052 -40307 -52281 -46105 -30110 -36284 -26454
15515 -26454 -22216 -3356 8471 18387 65797 45661 31070 65188 79568 48862 32616 14551
15503 14551 -2780 -9964 3200 17419 6976 -22520 -16801 -18190 7247 6724 14663 14036 22322
15490 22322 14126 10129 19666 41603 11203 -24989 -39467 -24758 -25139 -34839 -24160 -52500 -121255
15477 -121255 -110958 -65068 -14279 -765 -8845 -16479 -31567 8965 -366 -29904 -42127 -19999
15465 -19999 -32044 -48270 -51122 -32321 1227 -15724 -17712 7466 16820 -15085 -17450 18481
15453 18481 61584 54261 15733 5692 -2427 21877 46938 75404 70280 78077 54541 11220
15441 11220 -53537 -37058 -19644 2685 35879 53215 7287 -24188 -16930 32282 34872 -2328
15429 -2328 20343 14602 34904 52566 44031 44735 54881 17675 40812 84263 82073 43637 41564
15416 41564 35210 58727 86497 89671 61993 6351 -13898 4789 -22885 -38023 -60620 -78335
15404 -78335 -64038 -48977 -53779 -55919 -40827 -49449 -27680 -13625 -20616 -6414 10900 3779 -17583
15391 -17583 7714 1737 -10664 -17227 37347 85417 63176 30068 21608 33577 10309 -49322
15379 -49322 -28399 5270 10495 -35276 -58969 -45546 -19734 19348 14445 36494 16742 21126
15367 21126 17685 -34036 -56035 -5404 3636 54367 66037 46308 29437 24024 4003 -33723
15355 -33723 -45182 -4028 25867 693 -13366 -49573 -77634 -73885 -12386 11301 12744 16836
15343 16836 3561 -27478 -18746 -2403 49584 56681 13928 5685 14610 -10956 -22200 -26090 -17419
15330 -17419 -21045 20067 -3826 -42219 -13048 3762 -7129 -37485 -66552 -46099 -34521 20053
15318 20053 24263 67410 77241 41494 25951 25679 18355 1686 -12269 -41624 -44420 -12926 -53183
15305 -53183 -15833 16747 -738 11638 3607 1736 13295 39755 35521 25297 15634 26995
15293 26995 50721 41191 -2636 -8881 8343 17099 20404 -19871 -24906 -6037 -33922 -44742 -45452
15280 -45452 -5378 4068 5066 5963 52496 50319 30381 -15596 -14544 7922 31300 2952 1213
15267 1213 -13703 -6811 -9604 -20413 1820 37665 53427 9098 18013 14649 -27895 -11420 -15213
15254 -15213 -28362 -25375 -32196 -23031 -6033 39305 47809 31045 29492 34857 5668 -16206 12317
15241 12317 18527 6906 -24279 -25161 6456 18860 5591 -13626 8009 11457 42105 12232
15229 12232 25583 28004 34823 23046 36667 76176 38927 29380 -7325 28852 47562 28697
15217 28697 -7056 11820 57741 79134 41725 68182 49607 39736 43288 32934 53346 37928
15205 37928 -13217 -20108 9843 7887 -23040 -23577 -960 15157 51908 29034 -4568 4054 -19148
15192 -19148 -46295 -73745 -83511 -77894 -98024 -39432 -15742 -45634 -60171 -56995 -38881 -5743
15180 -5743 -8879 -43658 -40121 -23031 -36477 -69067 -37267 -2531 11267 -21184 -76330 -61825
15168 -61825 -12995 3683 28358 72969 79934 81269 104031 87099 37870 7254 -12770 9524
15156 9524 44552 40222 3859 -4904 5568 15190 24990 26435 -27919 -3536 -20737 -11782 9435
15143 9435 35881 48512 18700 -42788 -54039 -17087 2418 -24721 -30291 -8457 3259 -9284
15131 -9284 -4479 18865 21284 -10149 5608 -27666 -41016 -53781 -88377 -28510 18089 13019
15119 13019 -15061 -29978 -79311 -104842 -73978 -53218 -68619 -112765 -100604 -50083 -22622 568
15107 568 7796 39967 54838 58164 70623 25823 -36553 -45579 -28242 11319 -22774 -53834 -74966
15094 -74966 -54273 -17954 -32582 -9745 5811 977 17428 -28373 -56296 -76512 -84695 -74185
15082 -74185 -31986 -19168 6328 54965 63059 13259 -19999 -40791 -26977 -21408 18847 38315
15070 38315 57726 60678 53993 63736 64789 5748 -19189 -29491 -14015 3410 -14590 5044
15058 5044 37602 32325 -1482 36996 87691 91560 92319 63642 77468 83694 55538 29453 31307
15045 31307 30634 -3625 13564 47778 50089 38310 37000 22872 -16648 -64322 -74736 -39641
15033 -39641 -21800 19235 52963 47638 7387 24879 61318 48228 51673 27668 39900 65957
15021 65957 43127 28614 29380 39875 20190 2600 -11315 -30682 2641 95390 57810 52476
15009 52476 60585 44672 33416 39084 42311 42214 58696 22134 -18738 -28053 -16653 -5797 -722
14996 -722 8972 41664 12243 -2144 5550 -23841 -58598 -82403 -82329 -51401 -89206 -114453 -119225
14983 -119225 -78742 -24535 -13860 3655 -7052 -21337 -4580 -34897 -30508 -11852 32215 24302
14971 24302 22110 13385 6275 -6067 -38641 -20598 16289 9383 16554 51791 32535 4976 12999
14958 12999 48180 35654 16029 29712 22653 3320 -9055 137 19782 15337 -23027 -60954
14946 -60954 -71694 -5328 33412 -3288 -10511 28527 50378 17578 33064 66228 52831 25945
14934 25945 33788 35879 -8467 -6582 25558 41686 43654 42391 44075 28452 -3080 1394 -30613
14921 -30613 -8161 16023 -13660 21470 18688 -22248 -11641 28790 44146 20656 38781 61984
14909 61984 65793 51608 42800 45097 29866 29452 46630 36944 42707 30261 19572 31201 -9981
14896 -9981 -526 23982 27270 13796 13115 -5959 -8018 -11254 -22715 -35755 -34719 -40872 -20629
14883 -20629 26008 40539 -17716 -22606 38839 49940 60851 33060 62716 44116 28454 14817
14871 14817 -7526 -8360 11327 2414 29161 22872 41185 54332 23569 1941 -51986 -52452 -51541
14858 -51541 -74016 -81462 -101429 -92380 -41248 -19689 -12711 -9099 14306 -9715 -25172 -28517 -22746
14845 -22746 -25966 -8640 -12003 -36324 -25205 -1856 11833 12468 -48647 -61330 15503 36265
14833 36265 17262 29003 55366 31166 21653 56707 103343 123000 91734 52322 30470 31140
14821 31140 21362 21287 2178 20951 -4598 -29567 -31661 38679 83033 78768 71643 41086 53183
14808 53183 24458 -24963 -8276 -7023 -7779 9825 41832 44785 17261 -6599 -23829 357
14796 357 16847 6280 2169 -53959 -63240 -45326 -29123 -27181 -44527 -52660 -25380 -24505 -6500
14783 -6500 18736 14316 -19683 14101 19968 14883 25307 46074 46387 41753 50658 41753 69169
14770 69169 76485 61014 35870 -12933 -28451 -13423 10043 37690 48474 24762 20349 6306
14758 6306 24625 53625 69110 85270 64134 40567 17086 -12943 -14124 -19572 -4492 -5214 -25642
14745 -25642 -46793 -24496 -35966 -67826 -27361 -3390 4381 -11721 -2735 -7263 19749 28754
14733 28754 29457 26732 9193 3036 38104 16043 -3904 -19229 -101 -75 27024 41215 28219
14720 28219 34112 26339 -18069 -59003 -36600 -6841 42617 -3014 -27418 -33914 -28115 6810
14708 6810 48645 82954 50758 258 10325 20179 -6163 4092 37637 83084 54007 33408
14696 33408 34714 27639 -11174 -25941 2923 -24312 -9181 10429 -31222 -67481 -79084 -47695
14684 -47695 6650 14465 -13419 -57015 -41939 12040 39601 61984 88816 79412 47718 59964
14672 59964 68029 37559 9682 23992 19729 56995 81455 39058 2836 26308 24752 10571
14660 10571 -9629 -14988 -18323 9237 10365 -16245 -23281 -21331 1761 48588 41755 9565 5702
14647 5702 -1113 3658 -21215 6258 37365 17041 6947 -15673 -26191 -10522 20220 48001
14635 48001 31147 23540 25803 17552 46629 28665 31021 39310 1399 20910 76636 105046 98427
14622 98427 105007 103800 102973 63002 122306 128019 88654 99160 96275 60850 87394 83359 104490
14609 104490 71621 35415 59648 62635 48524 32800 52310 53184 -530 -30209 -12821 -27819
14597 -27819 -37971 -33456 -47474 -25308 11664 23710 63178 88979 71941 34396 54646 68375
14585 68375 17340 -22122 -1931 17259 47882 71639 71192 8207 -2624 4641 26855 11873
14573 11873 6850 44647 45169 3833 3302 27722 30802 3118 -6883 -12126 -50096 -35282 -23393
14560 -23393 -25395 -25318 26694 38299 32371 29617 58666 73642 65692 74503 75545 73559 64407 33321
14546 33321 37044 56808 59918 38526 19356 23250 -6450 -76455 -51459 -21724 20802 46580
14534 46580 45075 39316 50251 22597 9398 44004 58698 81571 87623 56171 26829 14977
14522 14977 11839 -6954 -9781 45382 95192 103713 67709 32285 41883 4779 -18971 -10356 -2912
14509 -2912 -35556 -53070 -18147 9584 47919 73339 -2983 -53006 -81468 -110949 -65711 -16904
14497 -16904 -25790 -2692 -4399 -13263 -3955 -10025 -20729 -19008 -35432 2157 23321 31305 11326
14484 11326 -29285 -43822 -54518 -33475 30149 16345 57288 71620 27270 46330 60195 75579
14472 75579 30221 -23882 -40715 -3777 -9368 -2509 -28123 -12781 -10568 -33535 -8842 24693
14460 24693 22968 5013 40079 52289 53463 53107 29834 -6535 -3447 -27511 -17119 -50195 -79698
14447 -79698 -39365 3165 -10418 -6832 -574 1351 -49788 -79770 -37976 20154 -6278 -51429
14435 -51429 -95780 -91772 -51279 -56341 -60312 -36408 -43998 -22376 7216 28728 4703 -308 32349
14422 32349 66783 83934 96772 28743 29995 6891 31209 51313 17461 -14390 -44901 -44490
14410 -44490 -29651 -43438 -51948 -28782 -13053 -10731 11126 52594 40795 15839 39028 71053
14398 71053 87678 10177 -59556 -90776 -69230 -17611 28579 40706 30139 10196 3138 7508
14386 7508 17648 38163 21867 -16019 -39045 -19970 -60313 -38936 -4612 -41661 -37963 -39571
14374 -39571 -23265 -17780 -29928 -46793 3030 -941 8327 -17870 -26326 -28687 -11143 -19858 -50863
14361 -50863 -53358 -26486 -19701 -8062 -40775 -100748 -45716 30121 22139 3479 6621 3062 22998
14348 22998 60259 76957 13815 32413 64680 16677 -17626 -36100 -29376 -17374 -28381 -42787
14336 -42787 -35128 -25729 -32756 -15453 -45604 -67508 -32966 48427 53329 29860 17438 -8816
14324 -8816 -26564 29349 72002 113817 136717 52064 -29020 -29931 16039 81168 88737 26001
14312 26001 23017 44816 21951 -14462 -22443 -901 22115 30848 34033 33082 -2063 -45563 -70694
14299 -70694 -62269 -65594 -36979 -33608 -29749 8885 2281 1467 9913 10812 39263 7466 -19679 -20223
14285 -20223 -13697 23168 57483 57070 39294 26222 36473 28690 -15713 -31661 -5942 13583
14273 13583 -2638 2252 25247 2343 4613 38163 62782 51771 48612 39843 16671 -5919
14261 -5919 806 21146 26760 20636 24571 16459 41449 76353 40324 -17130 -2285 2535 3905
14248 3905 12120 7728 -5679 -4373 -12752 -32471 -55343 -54143 -24236 -47540 -69541 -43164 -27861
14235 -27861 -25495 -22706 -32955 -27934 3295 -9688 -31928 -25673 -18369 -8757 -5048 29627 -542
14222 -542 -32160 -66047 -92682 -17196 20231 954 15240 40246 49364 79409 75498 64601
14210 64601 45989 36154 23467 4257 -22018 -13972 -28443 -42837 -51036 -70699 -72763 -59516
14198 -59516 -29344 -44938 -44902 -69931 -79114 -43586 -15069 6254 40754 17360 50252 65814
14186 65814 -6129 -12023 -33189 -22226 20054 -18004 15444 51552 37848 49329 48687 28576
14174 28576 4580 -5318 38464 40669 -15202 -30538 -30617 26125 56739 51394 42771 -3520 37484
14161 37484 28844 29222 43558 8574 -566 4872 2206 -5587 16883 43010 -18311 -69886 -82805
14148 -82805 -58500 -62771 -102045 -88192 -28522 -9955 -20571 -772 28942 33971 -4773 -15513
14136 -15513 1522 10101 -24288 -62466 -61146 -46220 -19551 15396 37166 -8704 -22078 -6216
14124 -6216 3395 42619 55670 59696 33103 17354 27288 71835 107819 81669 70139 16770
14112 16770 11208 10285 3863 7255 44742 26265 -7644 -9418 3438 15700 7066 4560 5055 9023
14098 9023 -19198 -28562 -37594 -27321 -3021 43365 46379 35351 50094 56886 53119 47378 16588
14085 16588 40573 60789 81279 72175 57932 46987 29180 -13382 -57602 -55148 -23487 5240
14073 5240 2562 -10774 15849 34555 40173 44037 1807 10166 16228 34611 66609 42989 -6471
14060 -6471 11758 46299 13542 42057 31546 4125 -5692 8933 17847 -17939 -63065 -53927
14048 -53927 -71265 -61304 -72880 -72477 -47401 -22485 -42904 -54343 -48135 -24063 -6769 -6490 5965
14035 5965 15979 -6760 11099 1110 3485 22505 29163 16708 15004 37102 51203 21550 34057
14022 34057 2998 -20773 13030 36224 13057 -20337 -46379 -76783 -37420 -27513 -21977 -3982
14010 -3982 -1414 -26799 -13706 -2362 66606 32095 -11505 -52572 -37898 28916 40668 4999
13998 4999 -2116 -6334 3352 -3873 53211 50149 29252 32899 22985 -18825 -45556 -2147 22360
13985 22360 -6674 -67432 -87228 -84495 -46831 -58048 -65066 -48725 -29457 -23206 -27103 -25503 -9154
13972 -9154 22244 -4053 -5006 38657 32014 10352 14402 56662 85187 64369 77078 73978 18250
13959 18250 5740 21358 27924 33930 30172 28234 46748 2637 -29870 -21736 -41107 -31478 -32455
13946 -32455 3821 25803 -5602 -35216 -35121 -41589 -19099 23204 1106 -20444 -22016 -41271 -64069
13933 -64069 -75400 -68074 -29084 -20733 43360 80707 51182 -1026 -21271 17005 -3720 -15495
13921 -15495 7647 41874 20733 -8284 39954 39693 35184 85246 65920 50914 21002 -18373
13909 -18373 7411 24161 21562 9227 10081 4759 1296 22234 -2911 -18136 50580 26011 -10024
13896 -10024 -15311 38431 29654 -14358 3949 -10972 -18874 -7402 18710 56891 89136 106241
13884 106241 115954 88250 106358 45792 426 -11436 -41970 -64073 -71494 -83920 -51439 -15398
13872 -15398 -24865 -30989 -5038 239 -14662 -10156 -3776 -31183 -51708 -57083 1241 53353 45035
13859 45035 29450 -6636 -36456 7302 31300 320 -27910 -15599 -55073 -50108 -54148 -68213
13847 -68213 -41255 23671 30507 23122 14082 -32288 -235 63657 40352 51025 34598 32441
13835 32441 45620 64124 21981 -26431 -33336 -24106 -51476 -12344 17347 16848 -353 -5749 42305
13822 42305 34982 -12190 -17055 -6996 -18357 -25601 -27043 -43613 -24294 6083 29062 4625
13810 4625 -52331 -65660 -48628 -50539 -48831 -54803 -61373 -58338 -41010 -26009 6294 12669 -2760
13797 -2760 -16548 -9925 -32339 -5600 12954 -20357 -51080 -8903 67279 93597 85608 50657
13785 50657 61507 56550 53802 40574 34382 26250 -43226 -35323 -37289 -29586 -17245 -17784 21812
13772 21812 40100 26334 568 -2581 -2601 -30317 -61784 -49735 -29390 2729 22961 12396
13760 12396 -21843 3004 1224 -2224 -24159 -27894 10006 35092 21603 -8402 -19469 -22816
13748 -22816 19587 27100 -12231 -5700 5949 -25647 -63590 -82264 -89211 -97443 -52711 4221
13736 4221 5562 -36331 -40789 -38017 -38028 15394 26449 15781 15705 -23256 17764 56287 1943 -41807
13722 -41807 160 -32715 -20577 42806 15695 6794 -6964 -30565 -31755 -31089 -748 -20410
13710 -20410 -19652 138 -22637 -31755 -15455 9902 2682 17647 16592 30527 6652 -27716 -39380
13697 -39380 -10887 7335 45068 32880 14925 30870 40456 8840 7645 28972 69486 91146
13685 91146 45897 57023 102571 55190 12388 -31428 -3754 45585 40033 995 -55256 -55080
13673 -55080 -672 -31602 -38592 -67104 -57950 -31425 -12344 -23079 -57266 -60067 -53754 -33001
13661 -33001 28267 69686 21562 -39415 -31087 -4673 21818 24542 40444 45759 45161 40164 478
13648 478 -47075 -40912 1764 17662 -33645 -52335 -44980 -37871 -49588 -20224 14204 20467 -8385
13635 -8385 -46041 -64156 -17381 -7737 -5160 11862 -7708 2721 45174 57126 92806 44944
13623 44944 -1175 14822 30235 25042 18162 -6236 -31275 -40942 -43288 -69740 -40508 -13604
13611 -13604 -34505 -11242 -26503 -34935 -73895 -71776 -47773 12565 20833 21653 21261 27925 -11429
13598 -11429 -50104 -68696 -32205 -20376 9543 21116 33991 24323 16275 35564 57498 87432
13586 87432 39348 22356 33561 -4973 -62495 -54491 -63516 -33355 -15856 -19952 11996 -2568
13574 -2568 -12926 28330 53417 31727 3766 22374 51802 83614 88736 101310 71001 68865
13562 68865 101905 74649 42789 -5192 -28207 -45721 -20419 1557 -19898 -29080 29532 45713
13550 45713 26554 14992 27266 33800 14175 13641 25304 3004 -20127 -69801 -85406 -75981
13538 -75981 -60420 -74355 -48918 827 -69052 -135740 -37017 29760 55972 55444 50176 17662
13526 17662 19771 11058 4305 14298 28060 22622 25535 67752 84407 68551 65256 59421 44466
13513 44466 34146 29623 290 -37552 -57331 -36419 -78954 -98175 -95378 -91338 -8587 23839
13501 23839 17720 26875 21611 -20384 -35634 -27799 -17967 19973 15742 39324 23427 -5404 -24896
13488 -24896 15069 15169 -4484 6991 -3335 -5898 21280 12343 2423 1300 9940 23190 3447
13475 3447 14079 28248 14319 -26512 -29358 -29770 -78716 -100228 -19754 78888 83540 30945 -28191
13462 -28191 -46759 -29719 -30916 -36358 -48935 -33241 -52382 -42929 -56168 -35371 -14032 -36566
13450 -36566 -7194 -12712 -17124 12111 18653 22524 1179 -30604 -55681 -46518 -2422 -1672 72694
13437 72694 74325 22376 -19638 -35043 -30879 58424 75769 81976 59683 34714 -2465 -25130
13425 -25130 -30329 1929 23804 -13938 91 7134 -46470 -41833 -2809 78 30035 9486
13413 9486 -2976 -31214 -78882 -77195 -55813 -2904 23960 55984 -2449 -22796 2984 4937
13401 4937 27697 21958 51167 58850 34737 3525 20878 24634 -3109 -24616 11553 25171
13389 25171 15178 -10642 9274 -19181 -11042 1338 -30713 1292 31337 29011 25603 54372
13377 54372 60613 59983 63174 62585 20082 -8421 -14105 -36110 -38003 -8562 33120 12840 -7720
13364 -7720 -4594 12140 -18835 -17837 -27255 -19599 -26297 -18652 -4118 -10480 20922 30135 36964 52311
13350 52311 55995 23973 -6252 -23554 -20580 -25006 -37772 -47560 -27310 -20395 4652 30483 -6155
13337 -6155 -64179 -52142 -21539 -6710 8796 43678 45823 54898 54894 35781 5626 -9731 1878
13324 1878 25440 -5049 32122 51483 -7179 -67503 -104553 -61761 -39031 -50554 -82389 -124952
13312 -124952 -105315 -63810 -7223 16333 13617 -29072 2571 45753 49041 28346 37050 21373
13300 21373 38667 13679 -14783 -18819 12988 49543 35564 5713 35831 45611 21956 -3347
13288 -3347 -40086 -70839 -54317 -39905 -37059 -1021 10731 5965 -1225 -30928 -34936 -22311 1770
13275 1770 58697 37821 15388 47734 15832 -7674 -10944 -39531 -78372 -65191 -25777 -7466
13263 -7466 5534 3722 3712 -9896 -43536 -44530 -88027 -86859 -63414 -18766 -1594 -45923 -23992
13250 -23992 17362 -868 -8892 38315 80274 37798 17608 13136 15205 -43109 -27194 28360
13238 28360 47573 33456 -6403 -28532 8122 27726 46561 49895 17122 5071 14663 39492
13226 39492 67835 39011 459 39413 75805 70486 17548 17214 58472 101292 103932 74623
13214 74623 44158 6926 8970 23206 12904 -14399 9162 -5578 -8255 -22626 235 -6844
13202 -6844 -36424 -35711 -40826 -51536 -44302 13576 48423 34694 24093 35502 6951 4826 33609
13189 33609 -28801 -42330 -20913 -6779 5679 -2664 -32517 -31720 -12 38109 20044 32528
13177 32528 14327 6862 30074 50146 46640 -17948 -59637 -53490 -35757 -16369 -18979 3055
13165 3055 -15164 -26845 -18200 11705 15781 15229 -37234 -52623 -21569 12613 34045 19271 35848
13152 35848 49404 7052 -7880 5218 -9112 -56015 -74469 -73258 -73935 -56948 -24264 26262
13140 26262 4182 18819 30533 39685 31064 -2314 -23050 -26162 -29083 -38505 -16124 -11637 -45095
13127 -45095 -8865 -2477 9342 -5845 -57990 -39986 -5220 -8969 23218 19990 28156 -12435
13115 -12435 -39375 -73111 -46596 -16088 33958 27265 13022 -4678 2978 13615 1318 40271
13103 40271 71312 30196 5447 16996 35450 41751 22739 -7165 -13521 -21757 -40212 -54469
13091 -54469 14400 43991 44097 58718 20368 43323 36958 16006 41941 34722 17758 17188 25636
13078 25636 19672 18444 24398 26659 42885 58006 51871 38346 40343 13929 -6896 20488 31157
13065 31157 7923 -14564 -21635 -19975 7859 17547 1920 38316 63064 71588 56507 17406
13053 17406 -22383 -15378 -37213 -49522 -47488 -29103 -40211 -37943 -39596 -30824 -35690 -8186 -9169
13040 -9169 14342 30561 -11281 -62691 -43154 -16803 -18280 15524 27860 30173 24649 -5577
13028 -5577 -58007 -36250 -61792 -94414 -80890 -76382 -40734 -15778 -25483 -48944 -60934 -19975
13016 -19975 27352 41429 16663 -6137 9325 15657 1019 15811 5944 4114 -10086 -26131
13004 -26131 -46104 -70115 -52609 -17040 16748 -5227 -16066 -10959 27061 36137 50676 66254
12992 66254 23151 30548 37527 67422 42431 40735 46348 3334 -2337 -573 -335 34775 53457
12979 53457 55598 46853 62696 24743 52491 75517 80328 46034 31959 75393 62486 28896
12967 28896 37798 21978 -5418 -21412 -23537 34116 45070 -5637 -30356 -11995 -17120 -39505
12955 -39505 15168 8728 25401 58564 8463 -18839 -11486 -59364 -100502 -92761 -66724 -37602
12943 -37602 -5255 -5283 -5254 -9457 -26707 -21654 -5620 7013 -17706 -47805 -49903 -64468 -30283
12930 -30283 -44551 -89599 -96561 -93054 -69150 -52976 -21737 -34051 -20874 35707 38025 -14109
12918 -14109 -72827 -72751 -102816 -81966 -26739 -1924 -26520 -48342 -19499 866 24241 29310
12906 29310 -1530 -22613 8351 12536 37065 31648 11843 -13564 -49417 -34539 -26570 11686
12894 11686 47992 79089 51048 20868 9881 33724 31684 9962 -23195 -54111 -60659 -46136
12882 -46136 -24901 -7599 6713 564 32610 17994 -14322 -32296 -57539 -40942 -35017 -27247
12870 -27247 -2011 4287 -18175 -58750 -29750 -2772 8447 -12971 9528 34014 21636 -4345
12858 -4345 -6310 -8103 10804 19258 34461 8072 11901 19267 8447 61228 37593 -20893 -16031
12845 -16031 -3684 -19705 30395 67485 84749 70035 30412 -474 -9980 -29077 1987 -6085
12833 -6085 -27941 -20642 -29113 -56438 -67280 -80968 -104857 -87668 -77961 -45473 -82961 -78759 -40705
12820 -40705 -12421 14387 39506 2851 -17350 -37661 -47225 24682 79184 70074 45918 20503
12808 20503 -16808 8408 53948 73631 23560 -17771 726 13148 18098 -12432 342 18998
12796 18998 -514 -28214 -7162 508 12424 11821 -7364 -49958 -84019 -100649 -50575 -38850
12784 -38850 -11590 -14998 -15587 -38205 -30171 -10568 -18400 -33187 -31554 -9767 12220 26108 22177
12771 22177 4271 1771 36171 52703 30513 -5985 -43792 -31427 -28902 -6747 23877 22327
12759 22327 21912 -17826 -27331 28381 54453 52927 28640 28287 33003 10049 31198 49090 60771
12746 60771 28926 15470 4100 2147 -15526 -36241 -79647 -93154 -72123 -18485 6321 16391
12734 16391 21895 -5023 1062 -7043 -5749 43987 47223 20207 -10493 4272 32449 21986 21379
12721 21379 31577 -418 -29189 9614 11338 -195 16067 38249 57467 18067 11392 19081
12709 19081 -2800 -3042 28369 23524 -16503 -1117 6762 -11797 -62842 -52281 -18849 14738
12697 14738 19471 59020 74421 33113 -5376 -23251 -53959 -51266 -68226 -25779 -14205 -44486
12685 -44486 -83831 -78229 -60026 -57098 -45723 -1961 26419 -16295 -33376 -13822 -21986 -5713
12673 -5713 57748 26148 15368 20569 17159 31797 33094 -21898 -21473 -1104 -42088 -50256 -24672
12660 -24672 -5960 23859 85634 117698 108106 79327 40368 15227 27788 18776 -17170 -27268
12648 -27268 9896 37220 53676 55573 -8945 -11177 17375 12171 11344 11975 -5134 -28079 -25246
12635 -25246 -34532 -45838 -45847 -70166 -75536 -55684 -64983 -30655 -26093 -24985 -38363 -57307 -95414
12622 -95414 -70761 -3575 14249 -33730 -76646 -69604 -31130 -32310 -37917 -51791 -71851 -62677
12610 -62677 -17821 -9260 -16680 10337 -7707 -35443 5993 16159 -5383 15769 -9962 -50549
12598 -50549 -33246 -3288 -17983 34870 36968 3284 -3813 -46571 -42376 -48181 -78768 -77177 -47211
12585 -47211 -33910 -43812 10783 35401 52750 31325 -4327 -16258 -15935 34143 19526 8649
12573 8649 24441 2573 -31841 -61083 -36538 -1987 -28260 -71067 -66430 -67012 -5375 21133
12561 21133 -22230 -19955 -6488 -25795 -30018 -84123 -99681 -60920 -18960 -13471 -8722 -20430
12549 -20430 -56536 -65635 -55682 -18605 -30354 -41566 -30632 -28119 -15975 -28304 -47147 -31271
12537 -31271 -9305 -27063 -38153 -19344 12415 23591 13717 -31302 -33711 -20976 -15100 5253
12525 5253 9031 34148 15790 -19185 -52239 -83565 -19213 51248 51319 35332 34177 4863 -17366
12512 -17366 6 -2739 -5516 -27291 -5668 -4042 -32475 5381 38058 28973 6559 48909
12500 48909 67100 54161 40176 2873 -6081 -14276 -4288 6333 -23897 -49009 -44773 -49059 -73490
12487 -73490 -94312 -79537 -76730 -43175 -39999 -56110 -22012 -18074 10305 -819 -9336 24001
12475 24001 -386 -3523 41149 38973 21446 2523 5345 -15626 -9960 15264 12541 -13836 -38629
12462 -38629 -35214 -1066 43750 13653 32811 82240 27721 -2419 9667 22120 60097 70561
12450 70561 32324 28404 58957 73603 63353 63820 76712 45757 -16554 1831 18915 25464
12438 25464 23425 18726 2819 10727 10988 -22876 -23185 -19590 12548 15857 -24643 -35999 -35518 -17411
12424 -17411 -19514 14900 23837 42542 -12694 -37382 -23286 2557 28837 63310 -867 -14891
12412 -14891 -6304 37006 21928 24438 17245 37370 29678 25902 19353 5881 21681 52203 34897
12399 34897 20408 -15779 -53249 -59905 -32797 -1429 40013 21144 13637 19804 -17132 -31936
12387 -31936 -56359 -72201 -40221 9463 13285 296 -20005 -28077 -22711 -1649 6653 -27286
12375 -27286 912 39975 101289 99659 71967 45205 26011 42860 19497 25236 47173 103608
12363 103608 97576 57665 54714 36255 22881 9055 7573 11994 -12403 -5339 -7283 -19142 -24207
12350 -24207 14964 40913 45749 45791 19249 -3229 26665 24131 -24790 -4981 40566 30369 17622
12337 17622 33461 19460 -17436 -41049 -13023 2729 -52683 -28991 16387 35518 16902 9524
12325 9524 18931 56706 92444 40402 3431 -52236 -59019 -42571 -39222 -47522 1499 13187 -11889
12312 -11889 20626 6002 -18986 -3464 24527 19756 43606 33750 7189 22453 48529 27042
12300 27042 35687 26261 -687 -8910 -2658 -4594 16548 31245 72886 88474 46790 -32883 -65683
12287 -65683 -71337 -66079 -43846 22906 57722 25659 12028 11665 -30996 -34750 -14374 -17629 -19781
12274 -19781 -33153 -19965 -40383 -41266 -39065 -15412 39155 10721 -29216 -10235 -18763 -71290
12262 -71290 -49572 -44876 -6174 15726 -10627 -5028 27532 36561 49982 24276 -45424 -45267 460
12249 460 5276 -14005 -939 -34512 -88251 -88680 -26347 -30199 17540 -8505 -19188 29639 32834
12236 32834 46001 32334 17741 22945 41343 36051 41794 7556 -19342 43334 93904 72230
12224 72230 36149 34026 23248 28289 5154 3835 30246 58985 46382 20132 28517 30887 27536
12211 27536 -13812 -33813 -8835 -1408 130 35086 58627 28181 22172 40112 82991 48197
12199 48197 8648 -49183 -84621 -77592 -17050 28639 49923 60387 104063 105197 101022 45825
12187 45825 24797 18688 15839 -1643 8373 74268 99657 47433 -50817 -75636 -31247 -11051
12175 -11051 -18089 -54520 -45905 -60061 -24509 -42515 -57850 -41112 -13373 -12479 31700 26973 33898
12162 33898 18649 39884 36761 -5432 -34644 -40499 -45553 -33586 2087 3936 -22440 -11624
12150 -11624 6457 -30217 -12912 16156 -1823 -438 -15488 -10098 -5812 -19153 -22935 -17860 -33806
12137 -33806 -5098 14337 13166 18072 -5850 2153 7731 -26174 -32747 9436 1136 4991 22073
12124 22073 25833 16990 41568 -19456 -46552 22573 58053 13769 -48316 -44586 -42693 -42725 -29474
12111 -29474 -43483 -21194 16168 17414 2508 -1279 548 -4401 -51653 -36353 -9633 10234
12099 10234 -44566 -77601 -56766 -36156 -13420 -5892 -14522 -20034 8010 15387 15754 -2429 -27259
12086 -27259 -26488 -20236 -49661 -67758 -56756 -15318 -932 -13649 -31438 -31711 -24104 -20052 -31046
12073 -31046 -17657 -31371 -4381 48304 33381 8823 38994 81518 110327 86352 45009 20617
12061 20617 36159 -20733 25646 46717 54007 26855 2298 -29155 17250 36299 11456 -10097
12049 -10097 20572 41186 17880 42780 36816 -35977 -92039 -97710 -39009 -30123 23211 36422
12037 36422 37334 15031 -33509 -51770 -74400 -76465 -46585 -60511 -56716 -62930 -31786 -26607 -10677
12024 -10677 7158 24098 21224 -8427 -23697 9450 17797 33082 18934 33919 66057 60667
12012 60667 6495 -6156 -5067 -29590 -42427 -49919 -102934 -68498 -54341 -83480 -103940 -79511
12000 -79511 -2936 19145 -15983 -61388 -41960 -13951 37891 44991 -23611 -68379 -47890 -20398
11988 -20398 25091 -8789 -47520 -62984 -58091 -22441 -29251 -29572 -19366 -24173 -58603 -74212 -54352
11975 -54352 -59099 -29981 18293 39360 27321 -22903 -35562 -57219 -96365 -62735 -1749 -19142
11963 -19142 -23790 -21079 -30235 -39630 -49193 -21625 -1325 -16107 -69082 -88287 -50787 -10041 26985
11950 26985 75771 43965 23653 23783 34244 28638 54241 49512 10730 5509 -14807 -7979 -35626
11937 -35626 -90444 -139043 -98197 -52080 -51974 -31910 38192 65985 32073 2639 -3362 -13019
11925 -13019 -27010 -69054 -72899 -36441 15120 40315 67774 24916 -21422 22461 36348 20035
11913 20035 -8620 -19080 -22275 -21947 7396 40172 37051 42956 42724 33115 66290 113788 122653
11900 122653 82472 30472 -7412 -21253 -6711 15870 -4037 3498 34464 19316 24898 43566
11888 43566 9717 -34715 -35180 -23920 -19178 -18347 15519 53395 9130 -2415 -16249 -77822 -55984
11875 -55984 -24459 5761 13758 -25221 -34813 -49862 -60925 -28404 -13279 -25063 -59712 -65210
11863 -65210 -39053 -50365 -22206 297 -21923 -35853 -16503 -8860 8088 25859 18249 -4446
11851 -4446 -37999 -45214 -40338 -12759 -56582 -51499 -29847 2869 34253 60339 55540 -15226 -6150
11838 -6150 4465 -39365 -65170 -85499 -70982 -15187 -33063 -18193 -83 -1469 -9849 21661
11826 21661 -15743 -83079 -90289 -56339 -30951 -7297 44052 55578 59011 39296 39476 29672 8549
11813 8549 -4858 47425 71280 4262 -5223 21228 62796 84213 72077 41402 8186 -4771
11801 -4771 8773 8691 -31352 -49539 -55562 -36371 -15284 -2244 6320 -12156 -42863 -29854 -42499
11788 -42499 -58529 -46266 -64721 -37017 -46176 -58874 -39991 -41157 -56605 -90543 -78992 -39997
11776 -39997 7979 50278 75753 54124 24544 1236 11551 35186 45061 -216 7421 34044
11764 34044 42451 9554 -23679 2907 36077 43912 -1977 -30637 -54763 -32504 -1061 5906
11752 5906 -1729 -1710 17437 2521 25475 -26530 -17101 2066 19688 27880 -38033 -92904 -92837 -97372
11738 -97372 -72670 -59346 -78270 -69701 -59944 -20306 13544 26662 69491 63383 47047 19467
11726 19467 -20321 -43832 314 19275 7451 18676 39147 47231 19071 2895 -34566 -49088
11714 -49088 -48687 -50884 -66562 -44057 -15212 -4464 -13466 -16307 -28524 -46966 -76848 -53904 -55915
11701 -55915 -105314 -113000 -74300 -52032 -3324 57152 30585 -7862 -9088 21708 72455 45032
11689 45032 -32516 -53696 -13469 8173 40198 36996 -21924 33270 54324 5658 -40211 -18867
11677 -18867 8773 19996 11769 -12377 -5267 10087 -6212 5539 18882 -3080 -49053 -73085
11665 -73085 -49402 -19315 -39193 -25890 -5487 35712 58742 44554 32481 1813 -26376 -49680
11653 -49680 -43023 -27412 -35116 -39769 -25597 -33528 -45239 -66041 -9798 50000 50948 6079 -14867
11640 -14867 12311 50545 67083 82430 100876 45463 4355 7455 14306 22833 68810 45191
11628 45191 27076 44722 36496 56303 57296 105371 130185 123412 152939 175763 238783 312198
11616 312198 427245 570279 745483 977167 1313311 1627759 1907162 1977894 1840205 1584610
11606 1584610 1266749 957935 716601 572911 488838 427843 350835 285858 242276 238452 235889
11595 235889 204278 138750 135746 98462 114110 102117 101556 106449 79508 49727 60807 51876
11583 51876 1181 -13963 33837 58537 42573 14490 -14324 -10720 38811 31708 -6795 15058
11571 15058 -1545 -12293 -16053 3317 3245 -17663 -7141 -22363 -3774 138 3833 -36246 -23998
11558 -23998 -3994 17658 5598 -5147 -11331 -1843 4189 1449 11646 9244 24940 18756 20780
11545 20780 16444 -22892 15280 36284 -2300 -1599 43328 51197 85503 121067 109710 57337
11533 57337 -609 -7788 -5877 7137 15748 -10530 -9141 -6013 -36258 -19410 -33334 -68293 -51353
11520 -51353 -14727 -7334 23846 28459 7457 44678 34164 36696 19234 46561 76283 46805
11508 46805 53550 63365 48532 93846 99681 83848 69735 38648 32071 13469 10793 13066 30229
11495 30229 61385 54543 40494 55375 84618 55289 49340 43101 27750 32898 51350 49870 68048
11482 68048 79002 91351 66088 73964 70762 87602 139283 180826 222835 251948 270293 240740
11470 240740 279367 386809 462866 609551 851383 1187737 1529481 1816444 1969852 1863552
11460 1863552 1574454 1255556 953598 704888 562448 490538 412039 298028 230199 181607
11450 181607 131623 115812 162133 191781 198850 135280 103991 59042 44356 51503 38443 29405
11438 29405 -4770 -64378 -56496 -1676 4188 -9793 -10963 -44231 -47021 10871 11995 42869 82546
11425 82546 103198 88174 21282 -18009 -9888 -1798 -5583 7467 49704 31663 -15405 -14943 7868
11412 7868 862 -24079 -13523 21173 28158 9134 -32634 -70255 -91879 -61388 -22630 8595
11400 8595 57005 61158 78631 68044 34237 -9288 -28806 -36255 -35171 -56186 -29545 -5560
11388 -5560 13661 -29496 -46171 -29175 -29138 -20532 -44412 -47077 -38827 -30130 -35669 -16015 -47877
11375 -47877 -62132 -52280 -50133 -120879 -66141 -9534 -40206 -83728 -47650 -41110 -47015 -65655
11363 -65655 -88707 -70008 -50021 -2300 2484 -14537 -22209 4872 -8610 -15261 -20572 -650
11351 -650 -10966 -29148 -40597 -41368 -21359 -30048 -5445 3688 -12540 39646 45922 55449 6362
11338 6362 -45865 -29221 23731 5357 -28726 -30737 -4306 15793 -20168 -9870 -10929 15657
11326 15657 51890 67420 72308 29546 11358 -909 9924 19858 5054 -23886 -26099 18771
11314 18771 63182 48768 7662 -57124 -36402 -17146 13091 14747 -1965 -15755 -5893 43124
11302 43124 44974 31209 30638 26543 56923 59872 33490 45200 35892 -320 6714 -3661 -34818
11289 -34818 -45365 -28699 10300 32573 49201 47410 40089 11899 26141 21071 14363 -17234
11277 -17234 -41809 -51515 -7868 26231 22881 18166 -18927 -51789 -64895 -6409 56837 59916
11265 59916 27648 43459 50257 42842 13227 17485 -787 -22916 9204 71774 68407 66166 53506
11252 53506 27036 -17712 -22071 -28553 -36180 -1218 26547 21293 -10171 22946 51401 32203
11240 32203 -29528 -58333 -51649 -62656 -56880 -51045 -32830 -39926 -94695 -103160 -63164 -31350 -29826
11227 -29826 8995 16072 7999 3872 26513 29663 -11432 -40654 -30604 -30273 -13437 -18855 -52012
11214 -52012 -20690 -17788 -60873 -75168 -80058 -77872 -63902 -34961 -25287 -3363 -8619 -18842 -33370
11201 -33370 -32038 12635 24268 60807 50869 15596 -27690 8783 -11373 -18499 52214 56005
11189 56005 -13748 -55311 -67847 -73607 -56003 -41105 -29975 -55145 -45160 -40326 -51036 -46766
11177 -46766 -53994 -55030 -92691 -152566 -125600 -19090 17653 -10814 -40570 -43496 -35240 -6105
11165 -6105 -20657 -42445 -75495 -79946 -76954 -75325 -15399 45114 25584 29879 12264 -24035 -20325
11152 -20325 -49071 -52562 -41588 -23797 -2719 -37214 -80432 -107714 -97430 -34399 -21086 4649
11140 4649 9317 -19651 -44369 -48479 -20588 -67467 -99100 -62061 -37023 -78217 -42718 19399
11128 19399 38326 21932 -13330 14037 19193 -17059 -3431 30084 6393 6923 25683 -3121
11116 -3121 -45364 -23179 313 30607 43925 42900 35336 36486 26283 -3805 -50725 -30708
11104 -30708 -14673 -48376 -61020 -41704 -33027 -31192 -29437 -43022 -60138 -42134 -15323 5940
11092 5940 24446 65502 31169 8703 23166 -2729 -17993 -17545 -56419 -79965 -130743 -88839
11080 -88839 -3728 4344 -8763 -33279 -48654 -49707 -54637 -23987 -22186 9730 4880 -35845 -60473
11067 -60473 -83391 -62358 -38409 -9255 16928 -3824 -28172 -47602 -23569 -22929 -49792 -28306
11055 -28306 -23349 -45866 -60961 -68704 -17640 -33778 -73276 -83392 -8470 6653 -18138 -30724
11043 -30724 -73024 -56704 -42804 -45138 -68367 -50440 -28867 -3551 -185 13844 5744 -447
11031 -447 -27321 -31991 17791 21590 9332 16041 47287 89579 65618 61269 111033 129891 69497
11018 69497 41254 28668 58776 49810 61233 56175 66429 51948 28155 16197 -43265 -72055
11006 -72055 -80568 -42342 9130 44301 29960 29544 12782 -30481 -31246 -23138 -32996 -18205 1275
10993 1275 2564 -29557 -38863 -5980 15791 41945 32439 5950 -20825 -8716 -4053 22447 19012
10980 19012 -15115 -11503 10086 10133 40271 69526 44200 27239 53753 44478 39612 13242 -41863
10967 -41863 -42623 25244 64380 47787 29951 -998 31680 39636 40450 11482 -11597 -36021 5616
10954 5616 -1975 1426 22477 34249 4413 -8436 21951 39121 -1544 -11692 -29317 -26156
10942 -26156 14489 23368 -9660 7371 -3471 -37153 -64495 -60514 -74067 -67124 -22753 2911
10930 2911 1843 -22965 -82742 -49797 -27646 -2305 -5703 -18827 -6795 16433 61163 50914
10918 50914 49718 73278 78662 59242 60425 51419 17413 -15148 445 -28062 -6930 65936
10906 65936 63240 46597 29591 28757 54184 49699 70516 75509 42386 21410 47584 49795 25327
10893 25327 -10606 -42703 -45868 -42039 -49663 -41666 -32791 -10428 2817 -12429 -32820 -34042 -52981
10880 -52981 -63165 -57151 -24157 15695 16375 30728 12061 74183 70654 28612 40099 38005 51156
10867 51156 74272 121849 147281 120076 66539 30429 356 -14779 -31557 -53278 -33848 11237
10855 11237 48022 23793 20345 31519 19716 39108 3472 -44455 -48772 33114 60610 57511
10843 57511 76182 37580 -23168 -76281 -103353 -83202 -36634 21505 14859 -25090 3725 15952
10831 15952 -24773 -50712 -77717 -49330 -44873 -12694 11953 77635 63599 -8492 -85170 -75431
10819 -75431 -41474 24101 78068 67317 41064 35445 21746 -17441 -43824 -29594 2172 39132
10807 39132 71208 37519 5784 11071 18511 -44815 -40885 -24345 39792 45266 33580 56597
10795 56597 50350 37877 25973 47922 35443 21307 3621 -2194 41669 67727 37483 19357
10783 19357 -13843 -23700 -21613 21858 37131 69748 118381 88662 33681 -7533 19480 59626
10771 59626 54131 45802 47288 50551 64606 50976 23731 31624 40850 75825 56970 36958 19080
10758 19080 -30851 -15102 6691 21985 25699 25868 20684 26268 46238 54000 26907 10459 -3620
10745 -3620 -1156 16769 31290 6264 -7188 12927 9463 -4612 187 31794 19248 8640
10733 8640 -25447 -62178 -21628 14278 -8674 -13797 -17816 -7539 18581 12122 7694 -1895 20860
10720 20860 30433 60636 79386 47750 25038 2942 12619 -4747 15662 34848 9381 -6230
10708 -6230 -40494 4749 20466 -161 -6745 -19604 -9274 -26321 -39148 -29847 -43048 -1186
10696 -1186 38084 23453 15991 24980 -14399 -25145 -17837 10507 60258 42206 35081 -11692 -28886
10683 -28886 -26693 -36101 -78324 -19969 13474 2801 -7698 -3074 -3015 8776 34345 56909 90406
10670 90406 61756 28942 37863 29967 27917 19500 32014 29582 20458 14815 -28417 3969 12510
10657 12510 25392 78058 119741 76215 -11753 -15123 9975 8558 1114 -19404 21578 28091
10645 28091 20084 19023 -15352 -26954 4005 2403 -7522 4975 708 -15901 -25260 20311 50744
10632 50744 56337 73036 3752 -37414 -73968 -59074 -44591 -14776 -19463 -40588 -59815 -68155
10620 -68155 -55823 -25152 -43782 -46858 -40508 -16475 -10169 -12108 -2610 21491 43860 64171 53952
10607 53952 22320 -35548 -52690 -12401 -21 -2129 -32014 -32299 -49672 -87437 -85579 -46422
10595 -46422 -76462 -30521 -53240 -66789 -100571 -87497 -65211 -53177 -48408 -34698 21730 51485
10583 51485 32487 7602 -15506 -35402 -47350 -24631 -52076 2128 21980 -24277 -12898 -35706
10571 -35706 -30865 -24524 -9403 28925 -17552 -16659 35176 36914 21073 21289 6122 2489 2063 38407
10557 38407 62464 4655 -31497 -31215 -41170 -64269 -460 14719 -3789 11059 15988 19680 -17559
10544 -17559 -25738 13714 -6476 -7071 1086 29182 2122 25857 35951 39683 34365 35240 64102
10531 64102 35134 53453 102502 73455 61022 34924 -6818 -13467 16596 58647 35177 22143
10519 22143 13223 -20381 -50010 -22396 5753 12018 -29292 -35889 -8487 -5409 -28750 -19843 -1680
10506 -1680 27951 -7717 6973 11113 -27214 -46529 -34442 15783 69657 73764 39761 38927 29049
10493 29049 38975 67787 54641 50858 47894 24980 33082 29176 36345 34733 35406 21395 1536
10480 1536 10444 9604 -19086 -13996 -7486 10557 -11121 -16421 -11050 6367 -13928 -27070 -13495
10467 -13495 14564 -5886 -24179 -13331 -5767 19419 -45662 -62533 -66986 -70137 -92900 -96071
10455 -96071 -51441 36936 59106 15902 6435 66 -39797 -62456 -62205 -43206 -3455 6251 -4877
10442 -4877 -19930 -8497 4699 7554 42692 43054 34161 7767 -15512 -39966 -25052 -2472 25684
10429 25684 24128 18906 32422 -668 -6924 34151 77880 70746 71986 55911 -3059 -23440 -11421
10416 -11421 59890 13390 -19618 59720 44059 14182 2786 -723 10786 -320 -38065 -64900
10404 -64900 -63066 1958 41077 26702 4665 32527 81593 54844 68084 77232 78202 74969 76464
10391 76464 54334 35176 -20321 -14260 17445 50114 35610 55633 92106 57148 21873 22027
10379 22027 1778 13293 14293 13754 -7076 16136 32623 27857 -967 5881 -3286 4466 13160
10366 13160 34456 24990 17816 -8424 -36979 -48939 -26889 -11198 7794 5428 23567 50730
10354 50730 50162 29145 45949 85877 98315 110101 69258 53059 69826 110743 201250 279714
10342 279714 351267 402925 546563 674027 797836 869173 874437 849849 839688 831985 794110
10331 794110 674463 540297 416990 339813 249967 160327 99123 46999 30646 42472 80377
10320 80377 75495 48229 5221 34741 42583 -404 31107 52008 65585 62972 30912 21718
10308 21718 -3434 -35035 23460 74858 55671 46153 31595 7218 1828 -1626 -21403 -36035
10296 -36035 -18742 -17829 -34905 -37172 -10455 -22178 -10780 6953 4832 -11877 -55233 -67552
10284 -67552 -77510 -32798 29656 63319 50329 46934 46150 41967 47654 36452 37429 -492 -19531
10271 -19531 4288 15985 28372 33474 26956 -6278 -14218 -27350 8882 15573 3871 13808 18230
10258 18230 31709 24885 30677 39346 50562 66575 89469 57760 63262 53907 -2971 -58763 -42451
10245 -42451 -29818 -3138 -2562 12498 -29590 -68380 -52748 -26560 -27812 -27522 13795 19607 19397
10232 19397 27397 -9523 -13537 4077 -7114 -56336 -4799 65962 61380 35779 20714 21171 15200
10219 15200 15741 40383 21135 34455 48377 52589 25300 11815 -7463 -22735 -16770 -20490 1170
10206 1170 19323 25988 -16757 -44951 -1523 42844 40401 -183 2514 33656 19924 -15249
10194 -15249 -26657 8807 20645 34932 21665 -12796 -26907 -5368 19754 8256 -2250 -16577
10182 -16577 -26 11080 23375 -12406 -32218 -20429 61528 90427 83319 88202 91559 127665
10170 127665 92406 67260 99158 106060 68612 70189 46021 4880 2355 21914 606 16648
10158 16648 56584 14668 -19441 19386 32336 63104 68234 55857 59472 62678 28372 32019
10146 32019 11384 -21865 -36630 -24040 -2735 35526 32469 14569 -6169 -60192 -45479 -14898
10134 -14898 19278 40841 2406 -1061 92675 145215 103454 56471 48443 28430 23277 22304 -21967
10121 -21967 -22594 6243 11821 34521 34303 84992 64934 -6147 -46197 -41811 -48656 -54219 -25314
10108 -25314 -4733 -26902 -4107 -25383 -43918 -37486 -17041 -54927 -43830 6886 32193 -23528
10096 -23528 -30810 -23262 -139 -60417 -63911 -41527 17017 66753 12670 -36864 -45010 7672
10084 7672 -10202 -10158 -19562 -34950 -25165 -18893 -17084 -48460 -55598 7967 16852 31559 37982 -16852
10070 -16852 28015 15028 -14855 -8951 -18939 4040 7705 15911 2441 -851 -6269 7696 51702
10057 51702 76243 37500 28622 37813 117 -32082 -22418 55481 77159 57587 58210 77076 27427
10044 27427 864 -4406 -12423 35050 70765 34151 -978 -30426 -25113 3120 44630 52524
10032 52524 23553 22746 -11594 12649 19959 -37446 -46658 -11042 34594 71795 46621 12230
10020 12230 -2031 -12410 -29995 -34188 14036 761 -14406 -58253 -45664 -21347 -23533 13713
10008 13713 -528 -16045 -17511 -37668 -20122 -15948 14992 51894 46633 7163 -42766 -39014
9996 -39014 -19278 -3952 13144 4094 -20311 -22420 -7836 18690 10542 19906 55655 25728 -16590
9983 -16590 -60722 -21530 -6792 -7526 -15558 -47781 -41831 -56651 -1272 54848 22779 14248 20692
9970 20692 30972 51454 75633 68714 53092 88042 82290 84970 67989 65692 34462 12026 23948
9957 23948 -3360 -4730 3754 -17942 -16810 -36421 12508 63400 60311 39491 55511 75476 61130
9944 61130 70029 61191 44193 45155 62103 60682 28741 -4724 -22366 15718 3676 -22855 -10287
9931 -10287 -19583 -874 29312 47741 17320 11857 11758 -25889 -17933 -27518 -5285 29481 20590
9918 20590 11127 33854 3903 -19988 35256 32054 13919 3808 34624 44244 34569 27979 4018
9905 4018 6915 -15625 -5357 22097 40909 51881 50927 59143 59531 82075 123817 133580 135777 111109
9891 111109 102918 76051 21607 6290 -19519 -10622 14707 20365 35568 65235 74331 74863 65174
9878 65174 86181 94579 72491 86208 96857 50683 28636 35596 44597 31147 -4213 13322
9866 13322 54683 94935 87813 64250 56766 72586 70119 -8156 -3544 -10225 19568 -1599 1318
9853 1318 -4878 16961 -3737 19224 13782 -12190 -14443 -18445 8973 29157 46467 60857 52100
9840 52100 49293 27877 23363 1783 -29801 3675 -15593 -14103 32141 31598 -23700 -44105 -69636
9827 -69636 -83134 -32597 26382 30089 -9386 -28745 -8793 -34437 -43192 2236 -894 8854 10168
9814 10168 30518 7841 -35460 -28638 -35690 12016 32819 34041 21158 10674 38914 1460
9802 1460 -6428 12502 14389 51199 77505 50065 66634 20041 35621 53956 66534 72681 24413
9789 24413 -19308 -38389 24022 51019 40891 50862 55736 61207 37580 35877 68914 131909 112927
9776 112927 102349 73967 75894 80052 57172 58473 17716 -15197 19178 65384 27524 34291
9764 34291 57575 45081 35615 -2263 42881 23234 -9239 -1926 22631 19763 -6628 -18005
9752 -18005 -50342 -60585 -23531 26570 16140 -23686 -28390 -21230 -16341 14593 40306 30342 18393
9739 18393 -7367 28093 52922 47899 9062 -45808 -32336 2062 28284 27580 68880 85529
9727 85529 77068 43775 27762 32171 34471 -10661 -33031 -61966 -46344 -19226 -8393 478 10137
9714 10137 11541 2291 -1497 20 11921 53293 75843 135153 84037 31925 13844 30701 57743
9701 57743 54512 43987 60846 28622 -4572 -18665 -18173 29657 53324 24794 9108 37351
9689 37351 45322 -9209 -32655 -17620 -25421 -15017 -10213 21558 43618 40121 56874 37070 45159
9676 45159 71612 83446 81524 62425 54334 -2794 -6312 23051 48080 26714 6579 9058 14750
9663 14750 -18279 -45169 -21246 3849 21581 17838 48517 63311 51450 44411 54601 64506
9651 64506 63049 72736 76221 55050 61847 56328 42050 8696 -7679 52120 90320 27210 -5911
9638 -5911 25858 37266 37880 28208 21808 -49784 -57235 -37778 -36364 7469 37969 23760 45098
9625 45098 70382 53936 20621 9049 11201 39168 88870 63961 13857 -15785 -40803 -5934
9613 -5934 44876 87632 63075 31828 45134 23558 32404 55755 41578 42168 17182 38302 16225
9600 16225 -9288 24436 43131 23156 20029 66449 111942 97804 32993 -11144 -20268 16960
9588 16960 12520 25770 43246 48416 63813 90032 61534 -7135 -4379 51342 40979 80267
9576 80267 87421 85565 70828 81914 106562 105988 79199 57671 29603 32011 65679 66609 71421
9563 71421 64111 107106 98788 69549 75015 58871 33676 57240 57721 29119 38521 46803 55176
9550 55176 56001 77567 88055 91479 72165 50634 19795 -1391 49197 37851 26420 34788 18078
9537 18078 21465 10896 43987 61218 80165 116915 119415 114996 123907 133091 149201 131614 67681
9524 67681 36095 16566 -140 -6089 30891 72882 49581 44720 61047 81113 100614 78885
9512 78885 71547 67744 28247 11256 21573 66215 85577 58173 35518 29725 46786 54550 56301
9499 56301 44765 37435 62710 33267 24170 63856 96421 58202 70266 63836 24488 4629
9487 4629 56729 92098 96901 55388 73597 74034 79492 102916 115157 82665 52512 59322 75507
9474 75507 51619 36636 30915 41387 73868 63729 64671 105351 130023 108906 65780 44545
9462 44545 34983 28504 13658 28194 26218 -14168 -45363 32852 78953 30638 6007 37216
9450 37216 69766 79716 90289 109900 98390 91906 55081 34516 48545 85693 88395 40594
9438 40594 39083 48915 43044 62992 69372 85495 91424 45285 9952 -12682 -12193 36041 61997
9425 61997 36594 31329 -8198 6827 78226 43841 13482 52938 50242 65583 79130 96798
9413 96798 85751 77748 96272 102963 71333 65079 32784 22308 28543 -1177 -22344 3189 7386
9400 7386 -14570 17684 65654 102433 94470 97938 88840 70567 62976 69455 65559 54189 37243
9387 37243 22258 39394 69770 69455 53960 58371 107442 136491 124436 97296 86081 71116
9375 71116 66381 91737 62334 73247 43134 46499 37799 83028 111270 78032 80405 73655 71155
9362 71155 97171 97193 104403 123630 85573 38110 52091 74360 90790 127457 118958 108579 150879
9349 150879 180779 144868 117520 126853 111367 49674 9546 3839 42102 95027 80936 28159
9337 28159 -19511 14999 75839 73580 74504 88020 80435 83837 85377 74400 76047 78307 81711 99982
9323 99982 78465 57351 76433 51424 10488 4871 26825 68806 116557 103515 107608 119503
9311 119503 142477 149828 100825 75345 90022 93048 67527 73617 86666 53828 44323 84806
$$ [...]
##END NTUPLES=NMR SPECTRUM
##END=
