##TITLE=Analysis number 329086
Compound Code cc 62904
Book Reference 423/174/6
Project Code adrs
Chemist Name bruced
##JCAMPDX= 6.0         $$ Bruker NMR JCAMP-DX V2.0
##DATA TYPE= NMR SPECTRUM
##DATA CLASS= NTUPLES
##ORIGIN= Bruker BioSpin GmbH
##OWNER= nmr
$$ XWIN-NMR		Version 3.5
$$ Tue Jul 31 09:39:27 2007 GMT Daylight Time (UT+1h)  MAYBRIDGE\nmr@NMR_250MHZ
##.OBSERVE FREQUENCY= 250.131544655141
##.OBSERVE NUCLEUS= ^1H
##.ACQUISITION MODE= SIMULTANEOUS (DQD)
##.ACQUISITION SCHEME= undefined
##.AVERAGES= 16
##.DIGITISER RES= 18
##SPECTROMETER/DATA SYSTEM= dpx250
##.PULSE SEQUENCE= zg30
##.SOLVENT NAME= CDCl3
##.SHIFT REFERENCE= (INTERNAL, CDCl3, 0, 16.522)
##AUDIT TRAIL= $$ (NUMBER, WHEN, WHO, WHERE, WHAT)
$$ ##TITLE= Audit trail, XWIN-NMR		Version 3.5
$$ ##JCAMPDX= 5.01
$$ ##ORIGIN= Bruker BioSpin GmbH
$$ ##OWNER= nmr
$$ C:\u/data/dgb/nmr/ADRS/1760/pdata/1/auditp.txt
$$ ##AUDIT TRAIL=  $$ (NUMBER, WHEN, WHO, WHERE, WHAT)
(   1,<2007-07-31 09:38:56.92 +100>,<MAYBRIDGE\nmr>,<NMR_250MHZ>,
      <created by zg, POWCHK disabled, PULCHK disabled
       configuration hash MD5:
       76 6E 9A 78 1E 09 19 81 EC 84 63 8F B0 6A 59 2D
       data hash MD5: 64K
       4B F2 D0 51 27 FA 70 10 E9 12 F8 45 D6 37 34 24>)
(   2,<2007-07-31 09:39:11.92 +100>,<MAYBRIDGE\nmr>,<NMR_250MHZ>,
      <Start of raw data processing
       ef LB = 0.3 FT_mod = 6 PKNL = 1 SI = 32K 
       data hash MD5: 32K
       48 14 E6 A2 91 B5 2B 31 0C 05 1F 42 F0 45 E3 0F>)
(   3,<2007-07-31 09:39:16.23 +100>,<MAYBRIDGE\nmr>,<NMR_250MHZ>,
      <apk 
       data hash MD5: 32K
       4C FA 59 F9 E6 0F 89 E3 12 1C 55 AE F8 98 F0 7D>)
(   4,<2007-07-31 09:39:17.81 +100>,<MAYBRIDGE\nmr>,<NMR_250MHZ>,
      <abs ABSG = 5 
       data hash MD5: 32K
       E9 9A 09 9E 12 A6 C7 BA E0 9B 58 5E 23 83 AD AC>)
$$ ##END=
$$ 
$$ hash MD5
$$ 94 E6 B0 77 3C 61 A9 3E 1A 43 5F 4F 10 D4 E3 34
##$RELAX= 
##$RELAX= 
##$RELAX= 
##$RELAX= 
##$RELAX= 
##$RELAX= 
##$RELAX= 
$$ Bruker specific parameters
$$ --------------------------
##$DU= <C:\u>
##$EXPNO= 1760
##$NAME= <ADRS>
##$PROCNO= 1
##$TYPE= <nmr>
##$USER= <dgb>
##$AMP= (0..31)
100 100 100 100 100 100 100 100 100 100 100 100 100 100 100 100 100 100 
100 100 100 100 100 100 100 100 100 100 100 100 100 100 
##$AQSEQ= 0
##$AQ_mod= 3
##$AUNM= <au_zg>
##$AUTOPOS= <11 >
##$BF1= 250.13
##$BF2= 250.13
##$BF3= 250.13
##$BF4= 250.13
##$BF5= 500.13
##$BF6= 500.13
##$BF7= 500.13
##$BF8= 500.13
##$BYTORDA= 1
##$CFDGTYP= 0
##$CFRGTYP= 5
##$CHEMSTR= <none>
##$CNST= (0..31)
1 1 145 1 1 1 1 1 1 1 1 1 1 1 1 1 1 1 1 1 1 1 1 1 1 1 1 1 1 1 1 1 
##$CPDPRG= <>
##$CPDPRG1= <>
##$CPDPRG2= <>
##$CPDPRG3= <>
##$CPDPRG4= <mlev>
##$CPDPRG5= <mlev>
##$CPDPRG6= <mlev>
##$CPDPRG7= <mlev>
##$CPDPRG8= <mlev>
##$CPDPRGB= <>
##$CPDPRGT= <>
##$D= (0..31)
0 1 0 0 0 0 0 0 0 0.06 0 0 0 0 0 0 0.0002 0 0 0 0 0 0 0 0 0 0 0 0 0 0 
0 
##$DATE= 1185871135
##$DBL= (0..7)
120 120 120 120 120 120 120 120 
##$DBP= (0..7)
150 150 150 150 150 150 150 150 
##$DBP07= 0
##$DBPNAM0= <>
##$DBPNAM1= <>
$$ [...]
##$SUBNAM7= <"">
##$SUBNAM8= <"">
##$SUBNAM9= <"">
##$SW= 20.6930455092707
##$SWIBOX= (0..15)
0 0 3 0 0 0 0 0 0 0 0 0 0 0 0 0 
##$SW_h= 5175.983436853
##$TD= 65536
##$TD0= 1
##$TE= 297.16
##$TE2= 300
##$TE3= 300
##$TEG= 300
##$TL= (0..7)
0 120 120 120 120 120 120 120 
##$TP= (0..7)
150 150 150 150 150 150 150 150 
##$TP07= 0
##$TPNAME0= <>
##$TPNAME1= <>
##$TPNAME2= <>
##$TPNAME3= <>
##$TPNAME4= <>
##$TPNAME5= <>
##$TPNAME6= <>
##$TPNAME7= <>
##$TPOAL= (0..7)
0.5 0.5 0.5 0.5 0.5 0.5 0.5 0.5 
##$TPOFFS= (0..7)
0 0 0 0 0 0 0 0 
##$TUNHIN= 0
##$TUNHOUT= 0
##$TUNXOUT= 0
##$USERA1= <user>
##$USERA2= <user>
##$USERA3= <user>
##$USERA4= <user>
##$USERA5= <user>
##$V9= 5
##$VALIST= <valist>
##$VCLIST= <CCCCCCCCCCCCCCC>
##$VD= 0
##$VDLIST= <DDDDDDDDDDDDDDD>
##$VPLIST= <PPPPPPPPPPPPPPP>
##$VTLIST= <TTTTTTTTTTTTTTT>
##$WBST= 1024
##$WBSW= 4
##$XGAIN= (0..3)
0 0 0 0 
##$XL= 0
##$YL= 0
##$YMAX_a= 178052
##$YMIN_a= -138585
##$ZGOPTNS= <>
##$ZL1= 120
##$ZL2= 120
##$ZL3= 120
##$ZL4= 120
##$ABSF1= 16.522
##$ABSF2= -4.171173
##$ABSG= 5
##$ABSL= 3
##$ALPHA= 0
##$AQORDER= 0
##$ASSFAC= 0
##$ASSFACI= 0
##$ASSFACX= 0
##$ASSWID= 0
##$AUNMP= <proc_1d>
##$AZFE= 0.1
##$AZFW= 0.1
##$BCFW= 0
##$BC_mod= 0
##$BYTORDP= 0
##$COROFFS= 0
##$CY= 12.5
##$DATMOD= 1
##$DC= 0
##$DFILT= <>
##$DTYPP= 0
##$F1P= 14.0000005364418
##$F2P= -0.99999901652339
##$FCOR= 0.5
##$FTSIZE= 32768
##$FT_mod= 6
##$GAMMA= 0
##$GB= 0
##$INTBC= 1
##$INTSCL= 1
##$ISEN= 128
##$LB= 0.3
##$LEV0= 0
##$LPBIN= 0
##$MAXI= 10000
##$MC2= 0
##$MEAN= 0
##$ME_mod= 0
##$MI= 0
##$NCOEF= 0
##$NC_proc= -4
##$NLEV= 6
##$NOISF1= 0
##$NOISF2= 0
##$NSP= 0
##$NTH_PI= 0
##$NZP= 0
##$OFFSET= 16.522
##$PC= 1
##$PHC0= -35.37346
##$PHC1= -5.796276
##$PH_mod= 1
##$PKNL= yes
##$PPARMOD= 0
##$PSCAL= 4
##$PSIGN= 0
##$REVERSE= no
##$SF= 250.13
##$SI= 32768
##$SIGF1= 0
##$SIGF2= 0
##$SINO= 400
##$SIOLD= 32768
##$SREGLST= <1H.CDCl3>
##$SSB= 0
##$STSI= 32768
##$STSR= 0
##$SW_p= 5175.98343685301
##$SYMM= 0
##$S_DEV= 0
##$TDeff= 65536
##$TDoff= 0
##$TI= <Analysis number 999999
Compound Code 99
Book Reference 9
Project Code 9>
##$TILT= no
##$TM1= 0
##$TM2= 0
##$TOPLEV= 0
##$USERP1= <user>
##$USERP2= <user>
##$USERP3= <user>
##$USERP4= <user>
##$USERP5= <user>
##$WDW= 1
##$XDIM= 32768
##$YMAX_p= 449982758
##$YMIN_p= -499214
$$ End of Bruker specific parameters
$$ ---------------------------------
##NTUPLES= NMR SPECTRUM
##VAR_NAME=  FREQUENCY,     SPECTRUM/REAL,   SPECTRUM/IMAG
##SYMBOL=    X,             R,               I
##VAR_TYPE=  INDEPENDENT,   DEPENDENT,       DEPENDENT
##VAR_FORM=  AFFN,          ASDF,            ASDF
##VAR_DIM=   32768,         32768,           32768
##UNITS=     HZ,            ARBITRARY UNITS, ARBITRARY UNITS
##FACTOR=    0.157963299565203, 1,           1
##FIRST=     4132.6476996994, 0,             0
##LAST=      -1043.33573715361, 0,           0
##MIN=       -1043.33573715361, -499214,     0
##MAX=       4132.6476996994, 449982758,     0
$$ Real data points
##PAGE= N=1
##DATA TABLE= (X++(R..R)), XYDATA
$$ [...]
##PAGE= N=2
##DATA TABLE= (X++(I..I)), XYDATA
27382F82166l0251l5439N6880j0039j5344J4960P8312L5397l6630K877K6129o9103
$$ 682166 651915 616476 673356 663317 647973 662933 741245 776642 740012 742889 769018 699915
27370F99915J29340M1153j04744l6985j55558j19551o7698N9733P7097N8963o1697
$$ 699915 829255 870408 765664 728679 573121 453570 385872 445605 522702 581665 519968
27359E19968L2393o950o6651n8854J3871M4057J19947J13176K20714j13765k03768
$$ 519968 552361 545411 478760 419906 433777 477834 597781 710957 931671 817906 614138
27348F14138L6012m1103J21137n7562p8479N1706K7842m9003O7026J49219M8539
$$ 614138 650150 609047 730184 672622 594143 645849 673691 624688 691714 840933 889472
27337H89472p2670j2750j5690j85771p2069k6417L6457J28982O4449K5384l9282
$$ 889472 816802 804052 788362 602591 530522 504105 540562 669544 733993 759377 720095
27326G20095m0134J49473O7422j10046k9014p4217L212J4259K0881O853n4523
$$ 720095 679961 829434 896856 786810 757796 683579 686791 701050 721931 728784 674261
27315F74261j49045r5992J46975M7621l372n9194p3560P9976J55525J22297K0767
$$ 674261 525216 429224 576199 623820 620448 561254 487694 567670 723195 845492 866259
27304H66259q6035r6493o8349K3836L7839J54204M4363j08288j01038q6560k1152
$$ 866259 780224 683731 615382 639218 677057 831261 875624 767336 666298 579738 558586
27293E58586O0722k9605r36M9926K4734m399L3048M6444m1694k9695m2158q4490
$$ 558586 619308 589703 588767 638693 663427 659028 692076 738520 696826 667131 624973 540483
27281E40483o658m4356j6395N4255K7626k0722l2692J2027P7092O0983k8315j23825
$$ 540483 533825 489469 473074 527329 554955 534233 501541 513568 590660 651643 623328 499503
27269D99503k7087J7471M0773J02305N4o444M6675P3445K7778m896l5225j06680
$$ 499503 472416 489887 530660 632965 633019 626575 673250 746695 774473 769577 734352 627672
27257F27672k4809O2239j7043L1257J04943L6474q3557L0037r7710j21768J7236
$$ 627672 602863 665102 648059 679316 784259 820733 737176 767213 669503 547735 564971
27246E64971M3587k8874j43655J30210J62234l1951L093K4912l0404m375k850
$$ 564971 608558 579684 436029 566239 728473 696522 699615 724527 694123 689748 686898
27235F86898l6728o1169J08382J01655n8877j35072j37748J2627K0218Q7895k1400
$$ 686898 650170 589001 697383 799038 740161 605089 467341 479968 500186 588081 566681
27224E66681m8021P2895P0273P598j09592O573M0027J08620m4826m6079p7997
$$ 566681 518660 591555 661828 669426 559834 566407 606434 715054 670228 624149 546152
27213E46152O6277N2776m5418n8390L9737O0778m1217r8848l8122M3538J01062
$$ 546152 612429 665205 619787 561397 601134 661912 620695 521847 483725 527263 628325
27202F28325N953j27383r0331J62175J92872L4894M8597O57n5253o1358J2669
$$ 628325 634278 506895 416564 578739 771611 806505 855102 855759 800506 739148 751817
27191G51817m5075p0257m138O5974J4742L4549N9585O0261L6738N1003o6047k9048
$$ 751817 706742 636485 632347 698321 713063 747612 807197 867458 904196 955199 889152 860104
27179H60104j05376K2829N1129j54347n026K5720J3589M2653m9002r1639R7789
$$ 860104 754728 777557 828686 674339 669313 695033 708622 751275 702273 610634 708423
27168G08423K8640k2042o950r9068L3728p0972m5676J2492m7775k5075Q2996m1051
$$ 708423 737063 715021 708071 609003 642731 571759 526083 538575 490800 465725 548721 507670
27156E07670P5137J01769k772j8968p0010j9769n6945L1910K5885K9452r821O4801
$$ 507670 582807 684576 681804 662836 592826 573057 516112 548022 573907 603359 593538 658339
27144F58339L2441R4690k7855k06325r1259Q1555J90876j0102o0403p50n9669
$$ 658339 690780 785470 757615 551290 460031 541586 732462 722360 661957 661207 601538
27133F01538K0795r415m9360J53660O8493L4741L3370K3887j40294k1442R0181
$$ 601538 622333 612918 563558 717218 785711 820452 853822 877709 737415 715973 806154
27122H06154J24506L3823q7328q3780m8794o3560M3974m7463j33526N8007l6773
$$ 806154 930660 964483 877155 793375 744581 681021 724995 677532 544006 602013 565240
27111E65240j5479Q3651j4808n4271M7357j0864n1904K0837l1498O4481O2521
$$ 565240 549761 633412 618604 564333 611690 600826 548922 569759 538261 602742 665263
27100F65263L4920J43440r1763j63887P1151J71210O891n1327j01218J9971o4971
$$ 665263 700183 843623 751860 587973 659124 830334 837225 785898 684680 704651 639680
27089F39680K3482j14507j2807J9005P1801M8656J15322k6004m2483O0644J4800
$$ 639680 663162 548655 535848 554853 626654 675310 790632 764628 722145 782789 797589
27078G97589j78028r2866N4969k3920O2695J06030J9506N6026k2242j22981N7692
$$ 797589 619561 526695 581664 557744 620439 726469 745975 802001 779759 656778 714470
27067G14470L7263K6000N8407k0695M361J1132N8188k1337r7712Q2003p9296p9630
$$ 714470 751733 777733 836140 815445 819806 830938 889126 867789 770077 852080 772784 693154
27055F93154N760O233k529r2008n985L2958k401Q0991m5274l5643l3089K3484
$$ 693154 698914 705147 702618 610610 604625 637583 635182 716173 670899 635256 602167 625651
27043F25651p3678l716K8258O9140J6143Q1943l5886M5746m068j08849r2706j6694
$$ 625651 551973 548257 576515 645655 661798 743741 707855 753601 749533 640684 547978 531284
27031E31284M446M1742J979K6149K703Q6464K6045l6855k9166j3896q3862j53104
$$ 531284 535730 577472 579451 605600 608303 694767 720812 683957 654791 640895 557033 403929
27019D03929L2837K15822J26012O93j9905Q7030J1276j11021m7451l5061n0314
$$ 403929 436766 652588 778600 779293 759388 846418 857694 746673 699222 664161 613847
27008F13847P3314K0400M3741J18889J15813k6882r1899q7953J5178K1019M4874
$$ 613847 687161 707561 751302 870191 986004 959122 867223 779270 794448 815467 860341
26997H60341N119J2334o4931j75509j00100K6801O3677R9974M6150J5168o407
$$ 860341 865460 877794 812863 637354 537254 564055 627732 727706 773856 789024 782617
26986G82617o1571j42818L446J30969j4206J6110Q1605L8363K3422p2310j4657
$$ 782617 721046 578228 581674 712643 698437 714547 796152 834515 857937 785627 770970
26975G70970o8996p6849P2088n578r1894P7607J16790J2219m1473q668r1253J0988
$$ 770970 701974 625125 697213 691635 599741 677348 794138 806357 764884 756216 664963 675951
26963F75951J09423l90k13249l9361R0145J78658J07387j14349l0925N7267J5606
$$ 675951 785374 784984 571735 532374 622519 801177 908564 794215 763290 820557 836163
26952H36163j62949k8636j15942k9591J10355R3827P808k8948k6896q0104N2190
$$ 836163 673214 644578 528636 499045 609400 703227 711035 682087 655191 575087 627277
26941F27277N213K021j1126j42179n2513N4494J91804N9146L0917j4241K3071
$$ 627277 632490 634511 623385 481206 428693 483187 674991 734137 765054 750813 773884
26930G73884o0364n9169r433K5299r2182r4063O0230J10115R3617k3247j15257
$$ 773884 713520 654351 644918 670217 578035 483972 544202 654317 747934 724687 609430
26919F09430K1458J53499k5004p8100m477L1865L8551K2168M8580K2652l9520
$$ 609430 630888 784387 759383 681283 676806 708671 747222 769390 817970 840622 801102
26908H01102n5076r3823M2200l7702k1095L2380N193L7158K7643R5299N8160j06739
$$ 801102 746026 652203 694403 656701 635606 667986 673179 710337 737980 833279 891439 784700
26896G84700j05315M2581J62419j30831j69581j36978l4840J08517O8598j0541
$$ 784700 679385 721966 884385 753554 583973 446995 412155 520672 589270 578729
26886E78729L8143J1633K6262L9405R972K7240q3198L8267J11841J5457n480l7878
$$ 578729 616872 628505 654767 694172 704144 731384 648186 686453 798294 813751 808271 770393
26874G70393J1220m3846l1310j29353J0662J00285L8790K7659j0084r9834j4381
$$ 770393 781613 737767 706457 577104 587766 688051 726841 754500 744416 644582 630201
26863F30201k4261N2664J01015M2150J00775L2433r8690q4678m6627K4726L3369
$$ 630201 605940 658604 759619 801769 902544 934977 836287 751609 704982 729708 763077
26852G63077R8533J26333n9640q233n9385m6877m4208j867K0548k3282l7265L4461
$$ 763077 861610 987943 928303 920070 860685 813808 769600 767733 788281 764999 727734 762195
26840G62195Q8839M5089k3945K0011p9608k3500K1334J23046q2162j23458j50375
$$ 762195 851034 896123 872178 892189 812581 789081 810415 933461 851299 727841 577466
26829E77466m8465K3588R923O5212J47660N3494j22564O1616L9163J66684j7223
$$ 577466 529001 552589 562512 627724 775384 828878 706314 767930 807093 973777 956554
26818I56554j75607k7594p838K9945p1438j5260k8454q7402M3544P7884M0402
$$ 956554 780947 753353 745515 775460 704022 688762 660308 572906 616450 694334 734736
26807G34736j71949k8000M7799R9629J07288J35719l0327p0163k2097J267q6998
$$ 734736 562787 534787 582586 682215 789503 925222 894895 824732 802635 803902 716904
26796G16904Q0741Q6840n2408J4825p255O4532M803j49801O2000N1729j31712
$$ 716904 797645 884485 832077 846902 839647 904179 908982 759181 821181 872910 741198
26785G41198r6182N1727J35586P6013o7063j23627k3170M3709Q5032m5388m7697
$$ 741198 645016 696743 832329 908342 841279 717652 694482 738191 823223 777835 730138
26774G30138O4102j4338m653r8809j45468J14171M7322J5531p8613K1663k3165
$$ 730138 794240 779902 775249 676440 530972 645143 692465 707996 629383 651046 627881
26763F27881L199l688O5949j1248r2386J498R1449l7579m8037P6651p2248o2875
$$ 627881 631080 627392 693341 682093 589707 591205 682654 645075 597038 673689 601441 538566
26751E38566k6035N2863j051M0023O0422j4008n3974r128J0340Q7851L7080Q4343
$$ 538566 512531 565394 564343 604366 664788 650780 596806 587678 598018 685869 722949 807292
26739H07292K0829l9453M6154j1244j74398R8796J92788n5578j29972J9095J18171
$$ 807292 828121 788668 834822 823578 649180 747976 940764 885186 755214 774309 892480
26728H92480j1345k0815m0868R198R1949o5942l1661m0981l0286p7902l5974Q2660
$$ 892480 881135 860320 819452 828650 920599 854657 822996 782015 751729 673827 637853 720513
26716G20513R1422P2886j8650q591l7340n2881j4833K419J0952K7592l6527p0638
$$ 720513 811935 884821 866171 857580 820240 767359 752526 754945 765897 793489 756962 686324
26704F86324J7515J10264j02887j57602j2788N5908p8929Q1029P6698N3043j5795
$$ 686324 703839 814103 711216 553614 540826 596734 517805 598834 675532 728575 712780
26693G12780l4475L9006r544Q8554l9137l3903L5930M7655L0133L0490q0245o9296
$$ 712780 678305 717311 707767 796321 757184 723281 759211 806866 836999 867489 787244 717948
26681G17948j02379n1819R9177J2059o6558J1161j7720M3601J10240p0140L0286
$$ 717948 615569 563750 662927 674986 608428 619589 601869 645470 755710 685570 715856
26670G15856n8660j17215j01617O794J08970N2456K5311O9604q4078o7269o9165
$$ 715856 657196 539981 438364 445158 554128 606584 631895 701499 617421 550152 480987
26659D80987O1004N6882J8477M8038k6014O1544m2854j86708p3338J61270J09453
$$ 480987 541991 598873 617350 665388 639374 700918 658064 471356 398018 559288 668741
26648F68741N8910o2506P4561l6939r7340J9566P0678P5407O9249j8419k035N5945
$$ 668741 727651 665145 739706 702767 605427 624993 695671 771078 840327 821908 819873 875818
26636H75818N1650O3060r6422l2660j9924k4875J21215r79n2060M105L9727q0597
$$ 875818 927468 990528 894106 861446 841522 816647 937862 936883 884823 888928 928655 848058
26624H48058n6833O4934K9535j0687j02295j17967Q9545R511l6535o8492r5273
$$ 848058 791225 856159 885694 875007 772712 654745 744290 753801 717266 648774 553501
26613E53501j5568k9702j2394J24880P5889j6856p4571N2097J5696O8907L0673
$$ 553501 537933 508231 495837 620717 696606 679750 605179 657276 672972 741879 772552
26602G72552n5756m0133N7594K5078o2051K9561O3516J8597r3608k0294N7658
$$ 772552 716796 676663 734257 759335 697284 726845 790361 808958 715350 695056 752714
26591G52714k4686l6766j3528m0931M1152j09491j537P6629m4923J41356O4266
$$ 752714 728028 691262 677734 636803 677955 568464 566927 643556 598633 739989 804255
26580H04255p6091l7391K2492l3701M6641K535J988n5725o9763p528O9264K1599
$$ 804255 728164 690773 713265 679564 726205 728740 730728 675003 605240 597712 666976 688575
26568F88575n1245K6393j7081p7424J33665J29970m4498m1606k9424l9833k7164
$$ 688575 637330 663723 646642 569218 702883 832853 788355 746749 717325 677492 650328
26557F50328L5861r0678M6590O4466n5110j2717O7300N1219R6753k6091o2518
$$ 650328 686189 595511 642101 706567 651457 638740 706040 757259 854012 827921 765403
26546G65403Q783J04739m8442k1873n3160l440l9030K8545n35j3807j2415M4838
$$ 765403 774186 878925 830483 808610 755450 752010 712980 741525 740990 727183 714768 759606
26534G59606j0986L9665J12569j2789j84842n2553P8541K2548L9550P6069k3324
$$ 759606 748620 788285 900854 888065 703223 650670 729211 751759 791309 867378 844054
26523H44054k658p2538o7285Q1218L9224K3384q7881P319N2585k6034j00288m6679
$$ 844054 841396 768858 701573 782791 822015 845399 757518 764837 817422 791388 691100 644421
26511F44421J7739J4777J1912J01416O7323M9430o2868n2436L4624l9799o6270
$$ 644421 662160 676937 688849 790265 857588 907018 844150 791714 826338 786539 720269
26500G20269o2179K3095K7465N4159q6267q1476J04342J11904R0169K6349o0399
$$ 720269 658090 681185 708650 762809 676542 595066 699408 811312 901481 927830 867431
26489H67431r5742j39118n9389J13564K3860n092m8807m5288J76667M0214N2297
$$ 867431 771689 632571 573182 686746 710606 705514 656707 611419 788086 828300 880597
26478H80597K2293M3005p5730n5758j23420p2896M6224O901M122j1951K786k058
$$ 880597 902890 945895 870165 814407 690987 618091 664315 671216 675338 663387 666173 664115
26466F64115J27805J7466j15285j08173m1666L7710J9488M5128l1250q8900J09248
$$ 664115 791920 809386 694101 585928 544262 581972 601460 646588 615338 526438 635686
26455F35686J87853J35209L6478m0876r3449j50419j61847J8058O8083j5689J7371
$$ 635686 823539 958748 995226 954350 860901 710482 548635 566693 634776 619087 636458
26444F36458Q8056Q7247R4598j29534k23445q0005M6607L1307o7015J00416N0165
$$ 636458 724514 811761 906359 776825 553380 473375 519982 551289 484274 584690 634855
26433F34855J40760m5282r017N6257L3954K1614k256k7305n1975o4067J12257
$$ 634855 775615 730333 721316 777573 811527 833141 830885 803580 751605 687538 799795
26422G99795K5841L9430J23987M0461o9339j05530M1846O2950r3011m7024J5094
$$ 799795 825636 865066 989053 1029514 960175 854645 896491 959441 866430 819406 834500
26411H34500L9688l2344j35329R9511K9453N382J29469o4725j50364j1483J1163
$$ 834500 874188 841844 706515 806026 835479 840861 970330 905605 755241 743758 754921
26400G54921J00267K611J1094q6643n8370P0345p4842j19753L1781J08181L3656
$$ 754921 855188 857799 868893 782250 723880 794225 719383 599630 631411 739592 773248
26389G73248j1759K7521P6390j06401j6263N1737r8742n7688R1178L8098j574
$$ 773248 761489 789010 865400 758999 742736 794473 695731 638043 729221 767319 765745
26378G65745K2638L4433J2604m181o6737r7514k1869p8404p0061l2477L6950O0283
$$ 765745 788383 822816 835420 831239 764502 666988 645119 566715 496654 464177 501127 561410
26366E61410L6461M8739O990O1227J51034M9904r3336m5930n2888j8721j24033
$$ 561410 597871 646610 653600 714827 865861 915765 822429 776499 723611 704890 580857
26355E80857p8555J05690P6359J0925P3650M8628m5442m4882L2826l6895o7401
$$ 580857 502302 607992 684351 695276 768926 817554 772112 727230 760056 723161 655760
26344F55760R6763J24947l3058j07551n6348r6682K07057J25829O3301l1128j82858
$$ 655760 752523 877470 844412 736861 680513 583831 790888 916717 980018 948890 766032
26333G66032j03314K6560N4077j4196K6810J7409m7154n4994O7582K2725j7421
$$ 766032 662718 689278 743355 729159 755969 773378 726224 671230 738812 761537 744116
26322G44116J15816j05442O0652m6583j30298r3850p4416J01762J76957q4408
$$ 744116 859932 754490 815142 768559 638261 544411 469995 571757 748714 664306
26312F64306o1956J11297J47519p076l8858n1726j1768Q17j122O8519j61276r8275
$$ 664306 602350 713647 861166 854090 815232 763506 751738 752555 751433 819952 658676 560401
26300E60401Q1728P0044Q8185K2024j07683p7560j1212K3759M7821K6102j6624
$$ 560401 642129 712173 800358 822382 714699 637139 625927 649686 697507 723609 706985
26289G06985N2468K333j47587J122L7597K1859J22479L940j02532l5411L5078
$$ 706985 759453 761786 614199 615321 652918 674777 797256 801196 698664 663253 698331
26278F98331J1170l7019l0984R7400J31790J5144j42860p9856k2889J06179k9281
$$ 698331 709501 672482 641498 738898 870688 885832 742972 663116 640227 746406 717125
26267G17125k8267M1543Q1906n2372M396J7656m4737k0520N8909O7808k4414m7119
$$ 717125 688858 730401 812307 759935 764331 781987 737250 716730 775639 843447 819033 771914
26255G71914P199M1151j1213k5550m487q8147q7845o413M8174L5571m4576J2102
$$ 771914 779113 820264 809051 783501 779014 690867 603022 596609 644783 680354 635778 647880
26243F47880p3286J517q73m4152K3363N9691O2682p6799q9448J45060L6089R669
$$ 647880 574594 576111 575238 531086 554449 614140 676822 600023 510575 655635 691724 701393
26231G01393N1774M2346P352n2355J335n5998p3713k2677M0284L7600j6242O3591
$$ 701393 753167 795513 802865 750510 751845 695847 622134 599457 639741 677341 661099 724690
26219G24690K387j66808j01456n7056m0800j00328J15678J19396L4964J00988
$$ 724690 727077 560269 458813 401757 360957 260629 376307 495703 530667 631655
26209F31655K7606J09398j091K1318J49204q4262r8772j5192Q095L8810M8125
$$ 631655 659261 768659 767568 788886 938090 853828 755056 739864 747959 786769 834894
26198H34894P078L2575L0391J4268K4374p6669q9611r336o6476K0227K5312N0343
$$ 834894 841972 874547 904938 919206 943580 866911 777300 767964 701488 721715 747027 797370
26186G97370o2836j4032J5600Q335o545j07963j63802p1518J67039N032l8940
$$ 797370 734534 720502 736102 744437 737892 629929 466127 394609 561648 566680 527740
26175E27740N1373K4869m4851P4244K8070L8083n7231j7042J04946Q4279m1167
$$ 527740 579113 603982 559131 633375 661445 699528 642297 625255 730201 814480 773313
26164G73313J3971l2657j00574N2422J25361N0574j904n0329q1887M0391J50112
$$ 773313 787284 754627 654053 706475 831836 882410 880506 830177 748290 788681 938793
26153I38793j3836m5301o4187R028j82647k6968J38145l8018p2593k67M4887p1918
$$ 938793 924957 879656 815469 824497 641850 614882 753027 715009 642416 642149 687036 615118
26141F15118k2737R0702K1554N5221J4003k8999r0800j52545J01365J10520J02831
$$ 615118 592381 683083 704637 759858 773861 744862 654062 501517 602882 713402 816233
26130H16233l1453k31K7559q8730n5600j4480J4166K6643L8675k5475l5402O365
$$ 816233 784780 784549 812108 723378 667778 653298 667464 694107 732782 707307 671905 678270
26118F78270j3576l0232P2335R0825L3508L3310m552m5426L4368p8172j7981J08561
$$ 678270 664694 634462 706797 797622 831130 864440 859888 814462 848830 770658 752677 861238
26106H61238J581N8493J00850k7849K4074J4520q1196j05050r3389J7655M3593
$$ 861238 862819 921312 1022162 994313 1018387 1032907 951711 846661 753272 770927 814520
26095H14520p1940o9667p5554R2749P116k7058l0637k0619J9475J48571O8529
$$ 814520 742580 672913 597359 690108 697224 670166 639529 618910 638385 786956 855485
26084H55485p3493n6663O7795J12890m6173m2762n3576l276m8250N0151P855r2471
$$ 855485 781992 725329 793124 906014 859841 817079 763503 760227 711977 762128 769983 677512
26072F77512o020j11285o1230J23428J61199Q8214j12854L0728K6964q4191p923
$$ 677512 671492 560207 498977 622405 783604 871818 758964 789692 816656 732465 724542
26061G24542k5345l9720r801J19906N3741Q1077p4395Q1251o3146k0935J25220
$$ 724542 699197 659477 649676 769582 823323 904400 830005 911256 848110 827175 952395
26050I52395J142m0814j28857O4456n4897P359o7267o5916p7025M4528O9026K5048
$$ 952395 953537 912723 783866 848322 793425 800784 733517 667601 590576 635104 704130 729178
26038G29178J4548M9878J5103N5071l4892j87120K5467J10077J26849m3398j00797
$$ 729178 743726 793604 808707 863778 828886 641766 667233 777310 904159 860761 759964
26027G59964q3212M4930j08334j4236O576J19280J36440j00788n2394M4100l2773
$$ 759964 676752 721682 613348 599112 605688 724968 861408 760620 708226 752326 719553
26016G19553p7721O5337M1492L5175Q8630Q275j25254K826K2644J18835Q1993
$$ 719553 641832 707169 748661 783836 872466 880741 755487 758313 780957 899792 981785
26005I81785o847J4645j35965K7860K7099j16738q5677n3613Q9034M4067r0932
$$ 981785 974938 989583 853618 881478 908577 791839 706162 652549 741583 785650 694718
25994F94718j4453J11465P4305l1462p4945J8544J21549O8871k0940n2795K060
$$ 694718 680265 791730 866035 834573 759628 778172 899721 968592 947652 894857 896917
25983H96917j4356r3963j20758K001J06955j8078q117m0993J20785M3874n7812
$$ 896917 882561 788598 667840 669841 776796 758718 750601 709608 830393 874267 816455
25972H16455j10364N1236K3526M5579Q6901m6701r1431j3645j10610o318J47420
$$ 816455 706091 757327 780853 826432 913333 866632 775201 761556 650946 644628 792048
25961G92048J0043L0572j25277q5485J7877J5609k1720l579Q0078J63054R5760
$$ 792048 802091 832663 707386 621901 639778 655387 633667 630088 710166 873220 968980
25950I68980l6828k15862o6350N1090O2113M9639P3096K4104j00492J6845O0947
$$ 968980 932152 716290 649940 701030 763143 812782 885878 909982 809490 826335 887282
25939H87282n91o5191K2263K9938m1981j8601m447Q0429J20317p0195r0696l2260
$$ 887282 886691 821500 843763 873701 831720 813119 808672 889101 1009418 939223 848527 816267
25927H16267n135N2527q1265n9542k3754k6554M6590K2658k5205l659P4892J10990
$$ 816267 811132 863659 782394 722852 699098 672544 719134 741792 716587 712928 787820 898810
25915H98810N6328m1710j29789r813K7474K6136N8784p0728j48732L2879K3712
$$ 898810 955138 913428 783639 773826 801300 827436 886220 815492 666760 699639 723351
25904G23351r275J30937R4360j19956j08186j08545P402O3923r6k5036Q9603O6220
$$ 723351 714076 845013 939373 819417 711231 602686 610088 674011 673915 648879 738482 804702
25892H04702j0944j5258l9024l3808l0337L3947K4052L20437J14158q9257j00544
$$ 804702 793758 778500 739476 705668 675331 709278 733330 1053767 1167925 1078668 978124
25881I78124q207P372j7456k5214l231o2881K5044o610p7752m398N0904J15170
$$ 978124 969917 977289 959833 934619 931388 868507 893551 886941 809189 804791 855695 970865
25869I70865n8407k23044j21032O8457r738J00113P7653q5793o0548P5100P482
$$ 970865 912458 689414 568382 636839 627101 727214 804867 719074 658526 733626 741108
25858G41108n6345K5377N3088j1314l907Q335K2432J3833m4950N92J72430k6677
$$ 741108 684763 710140 763228 751914 748007 756342 778774 792607 747657 748249 920679 894002
25846H94002j63799n2165L6153P8926j76687l1589J19955P6018M9604J1717o3951
$$ 894002 730203 678038 714191 793117 616430 584841 704796 780814 830418 842135 778184
25835G78184N206q3080p5392M9089O1556l6646N6386L6034j21131N2757J32780
$$ 778184 783390 700310 624918 674007 735563 698917 755303 791337 670206 722963 855743
25824H55743m4740j54058m3530N4116N2882k0761j4574J8624Q2327n1370q5043
$$ 855743 811003 656945 613415 667531 720413 699652 685078 703702 786029 734659 649616
25813F49616J511O9474N7105j41251j67587K8592J01277L2687J54097R1116L178
$$ 649616 651127 720601 777706 636455 468868 497460 598737 631424 785521 876637 879815
25802H79815j68087p0522O3527r400n128Q5381k6560r8371O9718J39873M2634
$$ 879815 711728 641206 704733 695333 690205 775586 749026 650655 720373 860246 902880
25791I02880j16907K0708K0498P5845P74q1774j26347N9794L6277L7382J4142
$$ 902880 785973 806681 827179 903024 903798 822024 695677 755471 791748 829130 843272
25780H43272O6233M4340J6431O5246L2950o7371K8131l7974j01258P1434l3212
$$ 843272 909505 953845 970276 1035522 1068472 1001101 1029232 991258 890000 961434 928222
25769I28222r8630k2232Q3602Q049p3901J04881N1942p2715L0874j5598M2883
$$ 928222 829592 807360 890962 899011 825110 929991 981933 909218 940092 924494 967377
25758I67377j1913o4847k8566n2085j6129j3175J32946P3444R2348J4213j70972
$$ 967377 955464 890617 862051 809966 793837 780662 913608 987052 1079400 1093613 922641
25747I22641p7519O8828N0725J0796K361L4889j23452J2614O3033p0151j61770
$$ 922641 845122 913950 964675 975471 977832 1012721 889269 901883 964916 894765 732995
25736G32995P8527n040J07661L3104l9626O2195O5502o1195j35064n1928o7861
$$ 732995 811522 806482 914143 947247 907621 969816 1035318 974123 839059 787131 719270
25725G19270N8779Q485j6207N177p3423K0674O4419J18426j3216q0894P5767O853
$$ 719270 778049 786534 770327 775504 702081 722755 787174 905600 892384 811490 887257 894110
25713H94110o1317L6628R1286n1768m9882L8482L9377O6406j32556J5224P9447
$$ 894110 832793 869421 960707 908939 859057 897539 936916 1003322 870766 885990 965437
25702I65437q8124q0650j1989O2318l7591k5078q4535p0005m043M1650Q4585K9462
$$ 965437 877313 796663 784674 846992 809401 784323 699788 629783 625740 667390 751975 781437
25690G81437l763N485j01929p3422N9535P405Q7342J27247R1754q2674l1831P7777
$$ 781437 777674 783159 681230 607808 667343 674748 762090 889337 981091 898417 866586 944363
25678I44363K2408m0082J12646J4157l5820m0641j16056j15398J7726R1792M51
$$ 944363 966771 926689 1039335 1053492 1017672 977031 860975 745577 763303 855095 855546
25667H55546j42799Q6304L4201q7892M0539L3769o2856K992m9041n0637j7224
$$ 855546 712747 799051 833252 745360 785899 819668 756812 759804 710763 660126 642902
25656F42902Q0579R8743l7019m7240R3995J2913j7834J6531l9279r8037Q0605
$$ 642902 723481 822224 785205 737965 831960 844873 827039 843570 804291 706254 786859
25645G86859K4783k0168r4354M1368M3952j1313m9165R130L1030q4859r04N0388
$$ 786859 811642 791474 697120 738488 782440 771127 721962 731092 762122 677263 676359 726747
25633G26747J76834Q1602o0114p4541l4216p8895Q4701J2366k7189n2497p5241
$$ 726747 903581 985183 925069 850528 816312 737417 822118 834484 807295 754798 679557
25622F79557R8013O3046l5029j00049o1898J30147K8238J83803J55220j69644
$$ 679557 777570 840616 805587 705538 643640 773787 802025 985828 1141048 971404
25612I71404j53165j5041L5763M5391k9929o2491L7953n4066j09222J45824J63996
$$ 971404 818239 803198 838961 884352 854423 791932 829885 775819 666597 812421 976417
25601I76417p2969J5036J39975k2582k7153j0033l9596j89585j03178K8267P3165
$$ 976417 903448 918484 1058459 1035877 1008724 998691 959095 769510 666332 694599 767764
25590G67764P3645p785r9343N7661R4429o2033m1790N9582J0825j06416n5782
$$ 767764 841409 833624 734281 791942 886371 824338 782548 842130 852955 746539 690757
25579F90757j9357N3288J2824k798k8032l6248O4186L1692j23L4357M1301J468
$$ 690757 671400 724688 737512 734714 706682 670434 734620 766312 766189 800546 841847 843315
25567H43315r840p956N2490p0912J324p684q9193P3311J20578m287m9205J7226
$$ 843315 833475 825519 878009 807097 808421 800737 711544 784855 905433 901146 851941 869167
25555H69167m451m5787k494n1455n0015K9976J05013J55558J67529m2859j40249
$$ 869167 864716 818929 816435 764980 714965 744941 849954 1005512 1173041 1130182 989933
25544I89933o3287m120M9662k0325j27399j81095j07728J10841J83943R1629q1673
$$ 989933 926646 922526 972188 951863 824464 643369 535641 646482 830425 922054 840381
25533H40381j13281j11399n407O9891J41113J16438l8962j07560r882p4240M6893
$$ 840381 727100 615701 610294 680185 821298 937736 898774 791214 781332 707092 753985
25522G53985M0328k6064l6916P4930L7250j37J3409j4466M2047J4371j04357j32400
$$ 753985 794313 768249 731333 806263 843513 843376 856785 842319 884366 898737 794380 661980
25510F61980J30653J22179N772n0141L6003Q0122k2805p1782j0555L4769k1952
$$ 661980 792633 914812 920584 870443 906446 986568 963763 891981 881426 916195 894243
25499H94243r8167K8431m649j1032K629j904o6331l1961J29196Q3397M770l8166
$$ 894243 796076 824507 819858 808826 811455 809551 743220 711259 840455 923852 928622 890456
25487H90456k4646m4158j2682j4782m2690q7308J1957K15325J6048J6315m9736
$$ 890456 865810 821652 808970 794188 751498 664190 676147 891472 907520 923835 874099
25476H74099m0187o4344q6309O6688k1222J1553Q5224q0967J21590J35445K0080
$$ 874099 833912 769568 683259 749947 728725 740278 825502 744535 866125 1001570 1021650
25465A021650j4208j13796j37355J12451J38789L2030r9504o7774O9851L1386
$$ 1021650 1007442 893646 756291 868742 1007531 1039561 940057 872283 942134 973520
25455I73520K7400N0366J3169l0249M1931R824m7624l7060n529J0100L1638j9720
$$ 973520 1000920 1051286 1064455 1034206 1076137 1085961 1038337 1001277 995748 1005848 1037486 1017766
25443A017766m9761p9890n7452P9311K0077n6290k266R0185J1361l4337K917r1722
$$ 1017766 968005 888115 830663 909974 930051 873761 871495 961680 973041 938704 941621 849899
25431H49899l3601L4577O6109N9423Q5398Q100l8321k5847O626m9309n6965n4748
$$ 849899 816298 850875 916984 976407 1061805 1069905 1031584 1005737 1012363 963054 906089 851341
25419H51341k8501j35239m0103P7387P7500M7766Q5752N6925K1375j07511j21073
$$ 851341 822840 687601 647498 724885 802385 850151 935903 992828 1014203 906692 785619
25408G85619J56672P5912l8426O6151Q248O381r4797O813N5638j22058r7400O9893
$$ 785619 942291 1018203 979777 1045928 1054176 1060557 965760 972573 1028211 906153 808753 878646
25396H78646M6772j9017l6230q4614l365R2267j35824L4201L9477L6885j31883
$$ 878646 925418 906401 870171 785557 782192 874459 738635 772836 812313 849198 717315
25385G17315o6453L8983l757n1602J07538M6951L9146j709l4582o5946o1790O9669
$$ 717315 650862 689845 686088 634486 742024 788975 828121 826412 791830 725884 664094 733763
25373G33763L6485Q4466j4960J9823r380K2256M308m1632j2159L8362J25013N8692
$$ 733763 770248 854714 839754 859577 850197 872453 876761 835129 822970 861332 986345 1045037
25361A045037J8594j14034J2702l554o2116J6234n9359n392J7426r4137n5481
$$ 1045037 1063631 949597 962299 958745 896629 912863 853504 848112 865538 771401 715920
25350G15920O293Q8119O1387N0159j3584K204n9027j9758Q1072q7698P094l3006
$$ 715920 722213 810332 871719 921878 908294 910498 851471 831713 912785 825087 832181 799175
25338G99175j1679P5283O3714J28027n5672j35396Q918P5788K020j74685m5153
$$ 799175 787496 862779 926493 1054520 998848 863452 872370 948158 950178 775493 730340
25327G30340R0464N1406j7847K5959J16424o436K7579L6303j07870L722K2078
$$ 730340 820804 872210 854363 880322 996746 990310 1017889 1054192 946322 950044 972122
25316I72122n6234O975J51141L7230j22738j15657l5983J5864m8384Q8815L0548
$$ 972122 915888 922863 1074004 1111234 988496 872839 836856 852720 804336 893151 923699
25305I23699K6501P215j01424p7059J13657N5991k8479p2130j05738M125J3956
$$ 923699 950200 957415 855991 778932 892589 948580 920101 847971 742233 746358 760314
25294G60314J04416M8273N3236J8248k8713l4786P9787j222r9799j01929j4937
$$ 760314 864730 913003 966239 984487 955774 920988 1000775 999553 899754 797825 782888
25283G82888J16571M9495J58292L5426m8134j69600r4226R845Q3373L1766N0938
$$ 782888 899459 948954 1107246 1142672 1094538 924938 830712 840557 923930 955696 1006634
25272A006634j01504m0183R7743M7364j18824j18392M5303j0083j998M3617R8437
$$ 1006634 905130 864947 962690 1010054 891230 772838 818141 808058 806060 849677 948114
25261I48114O9127n4686r7555q949n2929J736Q7073Q3832L5380p2275j1369J57700
$$ 948114 1017241 962555 865000 856051 803122 804858 891931 975763 1011143 938868 927499 1085199
25249A085199N5711j0415q6645r2726o0060l7585R5610L0800J9606Q7631J01549
$$ 1085199 1140910 1130495 1043850 951124 891064 853479 949089 979889 999495 1087126 1188675
25238A188675k8044k12870m8813L0136l5873M3001N2250o4677j44278k0644J12545
$$ 1188675 1160631 947761 898948 929084 893211 936212 988462 923785 779507 758863 871408
25227H71408R2788L0441j16780j38912r119r5106n452J58598O9735r2251j9435
$$ 871408 964196 994637 877857 738945 729826 634720 629268 787866 857601 765350 745915
25216G45915o7512J414P0658O749K1420p7365n6258Q8661J89124K8211Q0960o7173
$$ 745915 678403 679817 750475 757224 778644 701279 645021 733682 922806 951017 1031977 964804
25204I64804n3593p1097L0943M4037l2918N8143P1663L5303j6495q6831p7247
$$ 964804 911211 840114 871057 915094 882176 940319 1011982 1047285 1030790 943959 866712
25193H66712K8374J4720L2921N1152k9429O1662M0906o7630j00228p6222p3746
$$ 866712 895086 909806 942727 993879 964450 1026112 1067018 999388 899160 822938 749192
25182G49192M9113L3002o1287o1607k0119L0033L7158k0179L6392J30031L7283
$$ 749192 798305 831307 770020 708413 688294 718327 755485 735306 771698 901729 939012
25171I39012M6725q1511m566O588K4618L1917J73992l1608j05952n7251l0283
$$ 939012 985737 904226 899660 906248 930866 962783 1136775 1105167 999215 941964 911681
25160I11681k4968L9399R6751O3250m259j3334k8108m5658l0227o482l7541j67256
$$ 911681 886713 926112 1022863 1086113 1081854 1068520 1040412 994754 964527 958045 920504 753248
25148G53248Q7789N3731K560L3636J19738l522j20851k45690J1702J73310Q2729
$$ 753248 841037 894768 897328 930964 1050702 1047180 926329 680639 692341 865651 948380
25137I48380r2044j57481O9541J38963k8453j91275J3904J95059K11821P3976
$$ 948380 856336 698855 768396 907359 878906 687631 701535 896594 1108415 1182391
25127A182391j37025j77682j8187N8002k3154k8933p0026p1298J0262R9940K0729
$$ 1182391 1045366 867684 849497 907499 884345 855412 785386 714088 724350 824290 845019
25116H45019O308N1651q5971l9587m220m5654K6427K0185R449M2347J59654K696
$$ 845019 851327 902978 817007 777420 773200 727546 753973 774158 783607 825954 985608 988304
25104I88304J7727J5783l4048j5979O498l1501l1389M4998Q6986K1430q3541j18665
$$ 988304 1006031 1021814 987766 971787 978285 946784 915395 960393 1047379 1068809 985268 866603
25092H66603n0603J5087J01220O2636n5895L0262m0711p742o8148k9387j10032
$$ 866603 816000 831087 932307 994943 939048 969310 928599 920857 852709 823322 713290
25081G13290q0196P0576J86833m7297q8366J6572P5910Q7781M6340O357K2977
$$ 713290 633094 703670 890503 843206 754840 771412 847322 935103 981443 987800 1010777
25070A010777O976K5298K5320o6417m5939M2122o6238m6212Q2679j17298j37583
$$ 1010777 1017753 1043051 1068371 1001954 956015 998137 931899 885687 968366 851068 713485
25059G13485l0689J74760J54719K0313m2104j0365n1476N7107k8901Q4358j6924
$$ 713485 682796 857556 1012275 1032588 990484 980119 928643 985750 956849 1041207 1024283
25048A024283r2593J3165m9101k2028q8332o9856p1090O0384K1734l3921K7749
$$ 1024283 931690 944855 895754 873726 785394 715538 644448 704832 726566 692645 720394
25037G20394P6892p6409Q7183P0206k9427o1738r597q818Q5537j5540J01175m1845
$$ 720394 797286 720877 808060 878266 848839 787101 777504 768686 854223 838683 939858 898013
25025H98013j05119O0312l0448j0853O4647P4936M810p6517k8423k6123J7092
$$ 898013 792894 853206 822758 811905 876552 951488 956298 879781 851358 825235 842327
25014H42327m4856O2352O6732o8469K0069K0436K7728J04364P6805N0341p5689
$$ 842327 797471 859823 926555 858086 878155 898591 926319 1030683 1107488 1157829 1082140
25003A082140j26166n2690j4298j76572q7533J15826M6696R7354L5875m4333J1613
$$ 1082140 955974 903284 888986 712414 624881 740707 787403 884757 920632 876299 887912
24992H87912l2055j5740k0884M0521J02398n8245j55274n3250J97437J62522k6706
$$ 887912 855857 840117 819233 859754 962152 903907 748633 695383 892820 1055342 1028636
24981A028636j03066J08120K1634l170o5337J1738L5204L3222k501j21268q3459
$$ 1028636 925570 1033690 1055324 1052154 986817 998555 1033759 1066981 1064480 943212 859753
24970H59753J7039M1470k9487K7334o9893J19008J03308n7229j24282k40851O5343
$$ 859753 876792 918262 888775 916109 846216 965224 1068532 1011303 887021 646170 711513
24959G11513K00235O0737n377J9289P7835P856r4059l4215L5557m4225o4478P0332
$$ 711513 911748 972485 967108 986397 1064232 1072088 978029 943814 979371 935146 870668 941000
24947I41000k2509P693q0918j39065M0954J37854O0679j2690J16334O0495q4565
$$ 941000 918491 926184 845266 706201 747155 885009 945688 932998 1049332 1109827 1025262
24936A025262p2442l3240L4950q141O5641M4200j8072Q6037J30236j6362p9427
$$ 1025262 952820 919580 954530 946389 1012030 1056230 1038158 1124195 1254431 1238069 1158642
24925A158642j03736p6127r446K3174k6727l3039Q4572O238k3822K063M886O6086
$$ 1158642 1054906 978779 969333 992507 965780 932741 1017313 1023551 999729 1001792 1006678 1072764
24913A072764j9252k08796j09672p5834R3517N7868K00828N710P863r6344K6613
$$ 1072764 1053512 844716 735044 659210 752727 810595 1011423 1017133 1024996 928652 955265
24902I55265n0125J0966P739p8217K1825M8821Q4586K3966o0820J79947K3978
$$ 955265 905140 916106 923845 845628 867453 916274 1000860 1024826 964006 1143953 1167931
24891A167931j24893q3325N7387M5122j6847Q31J26346o1453o1473o1911p1236
$$ 1167931 1043038 959713 1017100 1062222 1045375 1046206 1172552 1111099 1049626 987715 916479
24880I16479p8460M9868O4090O9254k7903R382J8523J141l5260k6803n6763O939
$$ 916479 838019 887887 951977 1021231 993328 1002710 1021233 1022374 987114 960311 903548 910487
24868I10487N5739q9745j447Q244L5603J2625M6414P8561R5534O5809p7176j46637
$$ 910487 966226 876481 875034 883278 918881 931506 977920 1056481 1152015 1217824 1140648 994011
24856I94011p4040Q8804O1862l1888j5012J04442l3437j06803P4898J22163j15690
$$ 994011 919971 1008775 1070637 1038749 1023737 1128179 1094742 987939 1062837 1185000 1069310
24845A069310Q3801J00948j48098k59489J2153O2946K9591J22436j19108j28731
$$ 1069310 1153111 1254059 1105961 846472 858625 921571 951162 1073598 954490 825759
24835H25759O8765J29254o2396O6741N3933J6091q0604q9731o6530K0924J62467
$$ 825759 894524 1023778 961382 1028123 1082056 1098147 1017543 927812 861282 882206 1044673
24824A044673J38179j11243q5100j8463J00200l3452j89373p1840n2502K29129
$$ 1044673 1182852 1071609 986509 968046 1068246 1034794 845421 773581 721079 950208
24814I50208L9228r3160j6492J21870K4992M5669J06898j11674j57338J10007
$$ 950208 989436 896276 879784 1001654 1026646 1072315 1179213 1067539 910201 1020208
24804A020208O7718L1737k6319m894o4127k36002J06440K00103K36245j14995
$$ 1020208 1087926 1119663 1093344 1088450 1024323 788321 894761 1094864 1331109 1216114
24794A216114k8845j23867j04088o2702p6076J31O0180R7236J22212l0679j13486
$$ 1216114 1187269 1063402 959314 896612 820536 820667 880847 978083 1100295 1069616 956130
24783I56130j03250M5383M0691m701J16255K6533l4422J1659p1763q6327J723
$$ 956130 852880 898263 938954 934253 1050508 1077041 1042619 1054278 982515 896188 897911
24772H97911J4378M6466K6002l0601m1884n9537J23695L6414l4726o1010o7040
$$ 897911 912289 958755 984757 954156 912272 852735 976430 1012844 978118 917108 850068
24761H50068R9098O9477Q1565J6666n8382P2372J1618O5404p992m1036r7524p4366
$$ 850068 949166 1018643 1100208 1116874 1058492 1130864 1142482 1207886 1199894 1158858 1061334 986968
24749I86968m0575R7036M0426M2189r9996p6551j7571o6245n5860L0660M5682
$$ 986968 946393 1043429 1083855 1126044 1026048 949497 931926 865681 809821 840481 886163
24738H86163M5463l7070L0571K9971j5329K0700N8386P707j56636k2170L4557
$$ 886163 931626 894556 925127 955098 939769 960469 1018855 1026562 869926 847756 882313
24727H82313M4721O7277n0011p9599r617J43409j7712j4860L9081J7102p7157
$$ 882313 927034 994311 944300 864701 855084 998493 980781 965921 1005002 1022104 944947
24716I44947r3004R9719M0347k1671J9213j6215m7012L2488J19525O7401k6757
$$ 944947 851943 951662 992009 970338 989551 973336 926324 958812 1078337 1145738 1118981
24705A118981m5922j16770j06842M0223K5521Q7445O3466k8491j2765q0454k5018
$$ 1118981 1073059 956289 849447 889670 915191 1002636 1066102 1037611 1024846 944392 919374
24694I19374R194n6481k5687N3060L4870j06635R6895J53957Q0129r1206p6676
$$ 919374 928568 872087 846400 899460 934330 827695 924590 1078547 1158676 1067470 990794
24683I90794q0456M1454N3316M2761o1214j00956j2801J61582n1287J14039L1213
$$ 990794 910338 951792 1005108 1047869 986655 885699 872898 1034480 983193 1097232 1128445
24672A128445j4435l8746p8309l7226M3843J23670J16101M5728j19451j77431
$$ 1128445 1114010 1075264 996955 959729 1003572 1127242 1243343 1289071 1169620 992189
24662I92189K7712K1436l5130J7966l417l3583m6890P571N1451p6857j9305R370
$$ 992189 1019901 1041337 1006207 1024173 1020756 987173 940283 947854 999305 922448 903143 912513
24650I12513J6447n8126l0427R8955J2671p188J14476M0191p4413m6373K6478
$$ 912513 928960 870834 840407 939362 952033 944845 1059321 1099512 1025099 978726 1005204
24639A005204Q6393l3365N4481q0056j8695M5971O0218J22232q2586j32530j41560
$$ 1005204 1091597 1058232 1112713 1032657 1013962 1059933 1120151 1242383 1159797 1027267 885707
24628H85707L7704P7719N1725J4974m1926n4795m354l4504j2787P4293P2438J2735
$$ 885707 923411 1001130 1052855 1067829 1025903 971108 966754 932250 919463 993756 1066194 1078929
24616A078929O649P8145K4467Q7705p6771j25643k7521J44520M3626j11033p7776
$$ 1078929 1085578 1163723 1188190 1275895 1199124 1073481 1045960 1190480 1234106 1123073 1045297
24605A045297P8694o5757M72O3911l4637m3655p8879N0941K224L6021q2475o3283
$$ 1045297 1123991 1058234 1058706 1122617 1087980 1044325 965446 1016387 1018611 1054632 972157 908874
24593I08874N3899J93868k2505n5404l3232l4048j0247J7899K8944r7272m9762
$$ 908874 962773 1156641 1134136 1078732 1045500 1011452 1001205 1019104 1048048 950776 901014
24582I01014P6454N324K9880k16462j85949J83973K0669J1469P4529j29401k5359
$$ 901014 977468 982792 1012672 796210 610261 794234 814903 826372 900901 771500 746141
24571G46141L9408J27780n0415m5699R9855P3798k1131q8722P0235J25307L8421
$$ 746141 785549 913329 862914 817215 917070 990868 969737 881015 951250 1076557 1114978
24560A114978L5167j65014M8483K09082j10944j20948l3437M9356m3905j3308
$$ 1114978 1150145 985131 1033614 1242696 1131752 1010804 977367 1026723 982818 969510
24550I69510J22261J08770J358q1187n0845J896k880N1473P302n329r4047q4151
$$ 969510 1091771 1200541 1201899 1120712 1069867 1071763 1068883 1120356 1127658 1122329 1028282 944131
24538I44131J4838L7357R9596m9574k25541j5804J28615K56509J81097j69860
$$ 944131 958969 996326 1095922 1046348 820807 805003 933618 1190127 1371224 1201364
24528A201364p5301P0772K4883j14637r0593n833K6189J9800J32629J68896j00529
$$ 1201364 1126063 1196835 1221718 1107081 1016488 1010655 1036844 1056644 1189273 1358169 1257640
24517A257640K7433O3633j5173L4334o152l0285o3873j26325p8543r898o9056
$$ 1257640 1285073 1348706 1333533 1367867 1361715 1331430 1267557 1141232 1062689 1052791 983735
24506I83735J0841L8468P6443J26194K2901M8058r7614J5757N868k2060Q8602
$$ 983735 994576 1033044 1109487 1235681 1258582 1306640 1209026 1224783 1230651 1208591 1297193
24495A297193K8224P9176n0574m9284k4453o3393L1278j547m6343Q4750n9374
$$ 1297193 1325417 1404593 1354019 1304735 1280282 1216889 1248167 1246620 1200277 1285027 1225653
24484A225653j06958j06993J1410o6517J8241J26692j14247n4734J67799O9393
$$ 1225653 1118695 1011702 1023112 956595 974836 1101528 987281 932547 1100346 1169739
24474A169739R3848L5943k5132j21312j6714N1348J2067q3011l3585q700J8809
$$ 1169739 1263587 1299530 1274398 1153086 1136372 1187720 1199787 1116776 1083191 1074491 1093300
24463A093300j4335n0839M6865L0922N7255r9717M1082l218n0665m0813R254J52102
$$ 1093300 1078965 1028126 1074991 1105913 1163168 1063451 1104533 1101315 1050650 1009837 1019091 1171193
24451A171193O5411o9116p0826Q4127J5810J8479P3463R9281n1473p6032j5748
$$ 1171193 1236604 1167488 1096662 1180789 1196599 1215078 1288541 1387822 1336349 1260317 1244569
24440A244569k03433j1598m8641l7362J73619J89576o0647p9445l003N9462K0434
$$ 1244569 1041136 1029538 980897 943535 1117154 1306730 1246083 1166638 1163635 1223097 1243531
24429A243531r5013j9691j10714l9704J03818k9525Q0081K8051l6807n8085l2492
$$ 1243531 1148518 1128827 1018113 978409 1082227 1052702 1132783 1160834 1124027 1065942 1033450
24418A033450K6957K94559J04528j00231q3170n9330J4518n080j9140J14122j0898
$$ 1033450 1060407 1354966 1459494 1359263 1276093 1216763 1231281 1226201 1207061 1321183 1310285
24407A310285r8231n7107n4700Q0476P9285O4339R701m4594n3573J2353p6469
$$ 1310285 1212054 1154947 1100247 1180723 1260008 1324347 1334048 1289454 1235881 1248234 1171765
24396A171765n7252N8483L570k6575L3797M184K3186k8165N387J741M4411L756
$$ 1171765 1114513 1172996 1176566 1149991 1183788 1187972 1211158 1182993 1188380 1190121 1234532 1238288
24384A238288j6087j4072k4603P18J4627N6824K5244l435J6435j84746M1454J45514
$$ 1238288 1222201 1208129 1183526 1184244 1198871 1255695 1280939 1277504 1293939 1109193 1150647 1296161
24372A296161Q3534M7360n9634j47710r7282n9275J5478Q8780J35133k7715n2468
$$ 1296161 1379695 1427055 1367421 1219711 1122429 1063154 1078632 1167412 1302545 1274830 1222362
24361A222362m8835j25778O4665N3273n069M9803o6229o0827r2920m3586k2992
$$ 1222362 1173527 1047749 1112414 1165687 1160618 1210421 1144192 1083365 990445 946859 923867
24350I23867m7247P2821M253J01398J2668l6220P4442J66814j382j77888o9883
$$ 923867 876620 949441 953694 1055092 1067760 1031540 1105982 1272796 1271414 1093526 1023643
24339A023643L6687M7320p5262j51852j6711J21939N2708J10508M0052k144N9390
$$ 1023643 1060330 1107650 1032388 880536 863825 985764 1038472 1148980 1189032 1186888 1246278
24328A246278N0316J5570J0109m4726j19370M647J68161K1096k3333J1169j23584
$$ 1246278 1296594 1312164 1322273 1277547 1158177 1162824 1330985 1352081 1328748 1339917 1216333
24317A216333r0580P2454o8546n5355R4906J3806r109n2867J2571j3916K9826
$$ 1216333 1125753 1198207 1129661 1074306 1169212 1183018 1173909 1121042 1133613 1119697 1149523
24306A149523n7973j3694J72925j10204J5767j9785j98734R5861J82465m1281
$$ 1149523 1091550 1077856 1250781 1140577 1156344 1136559 937825 1033686 1216151 1174870
24296A174870n7357N3096r5997j2825K12579J03791r7657j05291N086K9817J0525
$$ 1174870 1117513 1170609 1074612 1061787 1274366 1378157 1280500 1175209 1180295 1210112 1220637
24285A220637m7837l8813k5935J446P888k3462L1992O8762J6336j36404J8539
$$ 1220637 1172800 1133987 1108052 1109498 1117386 1093924 1125916 1194678 1211014 1074610 1093149
24274A093149J07089O1523L05j11353M7389K8371o4073P2191K2836q08l6328n2182
$$ 1093149 1200238 1261761 1262066 1150713 1198102 1226473 1162400 1234591 1257427 1256619 1220291 1168109
24262A168109L2102L2650j21152L8479j8235l6101M5876Q2283K270M159n7424
$$ 1168109 1200211 1232861 1111709 1150188 1131953 1095852 1141728 1224011 1226281 1230440 1173016
24251A173016L1682K6486o5058j9006Q3678o085p5898k437J5717L6386R2492j0573
$$ 1173016 1204698 1231184 1166126 1147120 1230798 1224713 1148815 1146378 1162095 1198481 1290973 1280400
24239A280400j12555j05732o7259N785O2050J6155N2216L9638M7638M8014m8294
$$ 1280400 1167845 1062113 994854 1000639 1062689 1078844 1131060 1170698 1218336 1266350 1218056
24228A218056j4153j3875k6518k264L3604R2332r6590n1878M524o6574L7303L7451
$$ 1218056 1203903 1190028 1163510 1161246 1194850 1287182 1190592 1138714 1143238 1076664 1113967 1151418
24216A151418m8510r9593p7755M1836l7650j2684R8489P3274M5538k9887k6357
$$ 1151418 1102908 1003315 925560 967396 929746 917062 1015551 1088825 1134363 1104476 1078119
24205A078119q39L6661k7562j44251J08777P4496M2937K7247j4959m2229N4158
$$ 1078119 1077280 1113941 1086379 942128 1050905 1125401 1168338 1195585 1180626 1138397 1192555
24194A192555J2398J9477r9140j21363J22463J33291o9234j15742P5452P5668
$$ 1192555 1204953 1224430 1125290 1003927 1126390 1259681 1190447 1074705 1150157 1225825
24184A225825L847L0978Q6180O190q0492l2932l6470K558J15183l9944r3440j6044
$$ 1225825 1229672 1260650 1346830 1353020 1272528 1239596 1203126 1205684 1320867 1280923 1187483 1171439
24172A171439l4328M9948m6002J50124O3116j8837O600L7564J49859k47001r2965
$$ 1171439 1137111 1187059 1141057 1291181 1354297 1335460 1342060 1379624 1529483 1282482 1189517
24161A189517K1258j03736J27684O9911K0411k6225l0648k2048J4210J2734r406
$$ 1189517 1210775 1107039 1234723 1304634 1325045 1298820 1268172 1246124 1260334 1273068 1263662
24150A263662n8114l4278R9913r239n5957J8365o5637R0993N4720j29430j35036
$$ 1263662 1205548 1171270 1271183 1261944 1205987 1224352 1158715 1249708 1304428 1174998 1039962
24139A039962R7137J40748J45866m9991K3444m0024q5055q4339l8059J948L9554
$$ 1039962 1137099 1277847 1423713 1373722 1397166 1357142 1272087 1187748 1149689 1151637 1191191
24128A191191K9667q8106m7332K17187J02079j32601M6326M8107j73606p224k4335
$$ 1191191 1220858 1132752 1085420 1302607 1404686 1272085 1318411 1366518 1192912 1185688 1161353
24117A161353J24577Q6784p9096m2466m4897k6623J4760o7102J29023J48870K187
$$ 1161353 1285930 1372714 1293618 1251152 1206255 1179632 1194392 1127290 1256313 1405183 1407370
24106A407370K4194m4841o6202l6543k3792j7515r3254J24889L8751N4481k7406
$$ 1407370 1431564 1386723 1320521 1283978 1260186 1242671 1149417 1274306 1313057 1367538 1340132
24095A340132j5063L5323N2416j17334l5931M6908n8811j2773J6250J9065k5000
$$ 1340132 1325069 1360392 1412808 1295474 1259543 1306451 1247640 1234867 1251117 1270182 1245182
24084A245182n8346k3788R9788m8485j19999J7982M9809P2383k2656N9624q4495
$$ 1245182 1186836 1163048 1262836 1214351 1094352 1112334 1162143 1234526 1211870 1271494 1186999
24073A186999L0900J6605L5658k8460q4221N3269J06748L3461j2034m0541m4965
$$ 1186999 1217899 1234504 1270162 1241702 1157481 1210750 1317498 1350959 1338925 1298384 1253419
24062A253419q647M158k6791O2809J40469q7976j33139J7298P2017m5620O1275
$$ 1253419 1244772 1248930 1222139 1284948 1425417 1337441 1204302 1221600 1293617 1247997 1309272
24051A309272m0322j18445m390O4173M3769L2615P4567o1457o245Q2212j18809
$$ 1309272 1268950 1150505 1146115 1210288 1254057 1286672 1361239 1299782 1293537 1375749 1256940
24040A256940k3419O6143P7545l3844m9112L1377l178m8918n7546q0253P8273
$$ 1256940 1233521 1299664 1377209 1343365 1294253 1325630 1322452 1273534 1215988 1135735 1214008
24029A214008J5040j9008j18485j29512O0362J22313l4925L531R1597K4724q2625
$$ 1214008 1229048 1210040 1091555 962043 1022405 1144718 1109793 1113324 1204921 1229645 1147020
24018A147020O8591p144M3571m7197n7340k3664n0625J23264K677M9558m2298
$$ 1147020 1215611 1208467 1252038 1204841 1147501 1123837 1073212 1196476 1199153 1248711 1206413
24007A206413L4214k3771J69084Q0831j34900n5867q2714R060M8358O2470k10664
$$ 1206413 1240627 1216856 1385940 1466771 1331871 1276004 1193290 1202350 1250708 1313178 1102514
23996A102514K9837Q5265P2311K564r0604m7350N4978n9107O3174J28436k7476
$$ 1102514 1132351 1217616 1289927 1292491 1201887 1154537 1209515 1150408 1213582 1342018 1314542
23985A314542j29716q9408J71887K55482P6735j22883j73700j10004Q8066J2040
$$ 1314542 1184826 1095418 1267305 1522787 1599522 1476639 1302939 1192935 1281001 1293041
23975A293041K0476O7296K4647O9274r9886q6161m8239j9953J62028J11763k2574
$$ 1293041 1313517 1380813 1405460 1474734 1374848 1288687 1240448 1220495 1382523 1494286 1471712
23964A471712n0946k4966M6741j16350q4041J08460M4535l7604l0123l7099J4822
$$ 1471712 1420766 1395800 1442541 1326191 1242150 1350610 1395145 1357541 1327418 1290319 1305141
23953A305141K6787M4770R7289j1391o8715O1506m2312K5816N2353n7577p739
$$ 1305141 1331928 1376698 1473987 1462596 1393881 1455387 1413075 1438891 1491244 1433667 1425928
23942A425928j0922j11562K5106k3970m953k6477k695M2747l9489p8470Q9150
$$ 1425928 1415006 1303444 1328550 1304580 1299627 1273150 1270455 1313202 1273713 1195243 1284393
23931A284393n9m0078k6286N8317L4657K8249O2524M317m8573L6593q2524m1895
$$ 1284393 1284334 1244256 1217970 1276287 1310944 1339193 1401717 1406034 1357461 1394054 1311530 1269635
23919A269635J39018P3414L2029p5777L2668m1179j17315k9338M5392J8123m9451
$$ 1269635 1408653 1482067 1514096 1438319 1470987 1429808 1312493 1283155 1328547 1346670 1297219
23908A297219J0751n8777p9287O8300J04177J04103L6909j0390J10213O2347m6726
$$ 1297219 1307970 1249193 1169906 1238206 1342383 1446486 1483395 1473005 1583218 1645565 1598839
23897A598839p9660j49472j29333l0946O9811Q8448k0415p1608o1589k881J31497
$$ 1598839 1519179 1369707 1240374 1209428 1279239 1367687 1347272 1275664 1214075 1211194 1342691
23886A342691M9369P256q6574j5149Q8072M516M1603l5038o5243O354J12215J01015
$$ 1342691 1392060 1399316 1312742 1297593 1385665 1390181 1431784 1396746 1331503 1337857 1450072 1551087
23874A551087P2084j63337p1988n9023q378n8449k8051K0106M2421N8498L9943
$$ 1551087 1623171 1459834 1387846 1328823 1320445 1261996 1233945 1254051 1296472 1354970 1394913
23863A394913K93j8547n4693r1266p8058J02251O8344q4574n923J32301j04509
$$ 1394913 1395206 1376659 1321966 1230700 1152642 1254893 1323237 1238663 1232740 1365041 1260532
23852A260532P9608j7168l4411P8637L1311M5272j1507L4180j5019l8921L990
$$ 1260532 1340140 1322972 1288561 1367198 1398509 1443781 1432274 1466454 1451435 1412514 1416504
23841A416504p3494K6427J41448N3442j02871o9827R4097m8660K4195O2351j9704
$$ 1416504 1343010 1369437 1510885 1564327 1461456 1391629 1485726 1437066 1461261 1523612 1503908
23830A503908j08224j1073j5588o2118M2129N0827k08066M4552L5153o199K8645
$$ 1503908 1395684 1384611 1369023 1306905 1349034 1399861 1191795 1236347 1271500 1265301 1293946
23819A293946j4822L7095k8201J24631P214k3292r8153n7695o964J4874J00776
$$ 1293946 1279124 1316219 1288018 1412649 1419863 1396571 1298418 1240723 1233759 1248633 1349409
23808A349409Q0499j0752K4509k1101P5118Q7278q3865O4534j4115k5136J03791
$$ 1349409 1429908 1419156 1443665 1422564 1497682 1584960 1501095 1565629 1551514 1526378 1630169
23797A630169n9938r1478j6455L2761N2304P7064q7089j32249m949J3452j11492
$$ 1630169 1570231 1478753 1462298 1495059 1547363 1624427 1537338 1405089 1400140 1413592 1302100
23786A302100m3641J7783R5108K2965n6192K3886L7598j17802n8500P6497J06930
$$ 1302100 1258459 1276242 1371350 1394315 1338123 1362009 1399607 1281805 1223305 1299802 1406732
23775A406732J58327j3272r9225j03833q3339P190M7009L3167K7402J8707m5193
$$ 1406732 1565059 1551787 1452562 1348729 1265390 1272580 1319589 1352756 1380158 1398865 1353672
23764A353672R7453P7175k2549r2116r8223K4285J51824l9610q1735l840R5049
$$ 1353672 1451125 1528300 1505751 1413635 1315412 1339697 1491521 1451911 1370176 1366336 1461385
23753A461385Q7493o1615k9652k8190M2493N9061N9492n8310r7571m1138J39519
$$ 1461385 1548878 1487263 1457611 1429421 1471914 1530975 1590467 1532157 1434586 1393448 1532967
23742A532967M9693r403p6788m8562O3572R8414j04695n7581m8734j24663q439
$$ 1532967 1582660 1573257 1496469 1447907 1511479 1609893 1505198 1447617 1398883 1274220 1265781
23731A265781J18322K9674J9112J902J56247P3409K0969j11068p2835N1928k781
$$ 1265781 1384103 1413777 1432889 1434791 1591038 1664447 1685416 1574348 1501513 1553441 1550660
23720A550660m9053K9197l1593P7997O8061j19872j12010L0360K7927k464N0907
$$ 1550660 1501607 1530804 1499211 1577208 1645269 1525397 1413387 1443747 1471674 1469210 1520117
23709A520117M5163M6997j53061l6582O5468J7187Q0131J43478k4660q7146j13545
$$ 1520117 1565280 1612277 1459216 1422634 1488102 1505289 1585420 1728898 1704238 1617092 1503547
23698A503547l7341L1186P6895O2975k4934j98994k4186l4451n5079M3177J24084
$$ 1503547 1466206 1497392 1574287 1637262 1612328 1413334 1389148 1354697 1299618 1342795 1466879
23687A466879O8573j01716J07791P3003q3742n5046J23977n512k3243Q3863L2589
$$ 1466879 1535452 1433736 1541527 1614530 1530788 1475742 1599719 1594207 1570964 1654827 1687416
23676A687416m2442K8601p8275N8861p5350R783L3480n3823q7090N5585J36463
$$ 1687416 1644974 1673575 1595300 1654161 1578811 1588594 1622074 1568251 1481161 1536746 1673209
23665A673209r3212j27226P0301J9043m903J08043L6565Q8845j5728p2048p5407
$$ 1673209 1579997 1452771 1523072 1542115 1537212 1645255 1681820 1770665 1754937 1682889 1607482
23654A607482K1623N667J17228N7874k4153j01629j17539m7113K9093q173k9291
$$ 1607482 1629105 1634772 1752000 1809874 1785721 1684092 1566553 1519440 1548533 1540360 1511069
23643A511069J49499o1226J3143M3800L9476r1504n3871K4324r9490L4398q960
$$ 1511069 1660568 1599342 1612485 1656285 1695761 1604257 1550386 1574710 1475220 1509618 1500658
23632A500658m0217o0400j2591J24611q9608j26010O790P5458Q4567q5647O9284
$$ 1500658 1460441 1400041 1387450 1512061 1422453 1296443 1303233 1378691 1463258 1377611 1446895
23621A446895J02841K9126P6127Q5680j9083n8300p6355m8201M3182K3553l0867
$$ 1446895 1549736 1578862 1654989 1740669 1721586 1663286 1586931 1538730 1581912 1605465 1574598
23610A574598j22112k6634N1782P8566K33403k6293j09521k2120n5860j4291P5039
$$ 1574598 1452486 1425852 1477634 1556200 1789603 1763310 1653789 1631669 1575809 1561518 1636557
23599A636557O8252L9362O188O142L331n8104J0366l5948j6242Q4948p9406j01375
$$ 1636557 1704809 1744171 1750359 1756501 1759832 1701728 1712094 1676146 1659904 1744852 1665446 1564071
23587A564071n6354O7747L7135K8496J26969J02914j51504p9755k0124k5068J05225
$$ 1564071 1507717 1575464 1612599 1641095 1768064 1870978 1719474 1639719 1619595 1594527 1699752
23576A699752R0143j10128j40569Q8169K2987J59202n6360k5897K5550n812k6038
$$ 1699752 1789895 1679767 1539198 1627367 1650354 1809556 1753196 1727299 1752849 1747037 1720999
23565A720999N5342l5661j02064j7929M2123j44785j10439m6968L7346L8050J70611
$$ 1720999 1776341 1740680 1638616 1620687 1662810 1518025 1407586 1360618 1397964 1436014 1606625
23554A606625J38305o7693n7596K3428O5791L2006J15172r763o5865j51922p7273
$$ 1606625 1744930 1677237 1619641 1643069 1708860 1740866 1856038 1846275 1780410 1628488 1551215
23543A551215J6247j44857l7417J03324K01987O4567N1507R951M8572M7550j9677
$$ 1551215 1567462 1422605 1385188 1488512 1690499 1755066 1806573 1816524 1865096 1912646 1892969
23532A892969p4754j67022j30566j29375P7195J54582Q3706p4003j5734K8029
$$ 1892969 1818215 1651193 1520627 1391252 1468447 1623029 1706735 1632732 1616998 1645027
23522A645027P6209j25701n6580J01309M5269K1685j2806p6627K691L9478q750
$$ 1645027 1721236 1595535 1538955 1640264 1685533 1707218 1694412 1617785 1620476 1659954 1651204
23511A651204m258o8622L7317M0357O0437j9506J8745r879p6912l3402j8795R479
$$ 1651204 1646946 1578324 1615641 1655998 1716435 1696929 1715674 1705795 1628883 1595481 1576686 1586165
23499A586165O436k3387K4918q3274j6796J39142P7667J010j7338L816O665j06247
$$ 1586165 1592601 1569214 1594132 1510858 1494062 1633204 1710871 1711881 1694543 1698359 1705024 1598777
23487A598777l9916J07760Q8119o4338R7841J8593l9342m7561m4634j41863m1743
$$ 1598777 1558861 1666621 1754740 1690402 1788243 1806836 1767494 1719933 1675299 1533436 1491693
23476A491693N8289J11342L7191n4208P4837m2842o3979R2168k0564k6185J57571
$$ 1491693 1549982 1661324 1698515 1644307 1719144 1676302 1612323 1704491 1683927 1657742 1815313
23465A815313K3062j9189o1656j17451J4292j07216p4819M2062K3322P5615J15242
$$ 1815313 1838375 1819186 1757530 1640079 1654371 1547155 1472336 1514398 1537720 1613335 1728577
23454A728577J15226m6453n7640m7648j1842J11333P6399o3236r875m5337j9429
$$ 1728577 1843803 1797350 1739710 1692062 1680220 1791553 1867952 1804716 1794841 1749504 1730075
23443A730075K3975M0280l1602L5520q4444M6395l6240P9855j0312J07061N55
$$ 1730075 1754050 1794330 1762728 1798248 1713804 1760199 1723959 1803814 1793502 1900563 1901118
23432A901118r6803p8791j76987r9148Q7175J02610J05771J10143L5034j11147
$$ 1901118 1804315 1725524 1548537 1449389 1536564 1639174 1744945 1855088 1890122 1778975
23422A778975j04428K1620N5020r4972j3511J24117q2221K468Q1725p5721M3854
$$ 1778975 1674547 1696167 1751187 1656215 1642704 1766821 1684600 1687068 1768793 1693072 1736926
23411A736926N0080l7531J6264L7937j18575j6795p282R5531O3237J6014j36520
$$ 1736926 1787006 1749475 1765739 1803676 1685101 1668306 1661024 1756555 1819792 1835806 1699286
23400A699286j57936J29412P4264P755L9755n3783j17874J1657M5732J6650J6408
$$ 1699286 1541350 1670762 1745026 1752781 1792536 1738753 1620879 1632536 1678268 1694918 1711326
23389A711326J25322O3849l6433M1488O941q129r6631j52545L0036O9214O3974
$$ 1711326 1836648 1900497 1864064 1905552 1912493 1904364 1807733 1655188 1685224 1754438 1818412
23378A818412R532Q9429P2042P9010J8146q7164j1638J4788j2904m0758K2608
$$ 1818412 1827944 1917373 1989415 2068425 2086571 1999407 1987769 2002557 1989653 1948895 1971503
23367A971503k24520p3128p900J2032J3471J00972K427J22878L4464l7221p5250
$$ 1971503 1746983 1673855 1665955 1677987 1691458 1792430 1794857 1917735 1952199 1914978 1839728
23356A839728j3926j5281M13k1675Q1468j7734l168j23723j58049P4716K46132
$$ 1839728 1825802 1810521 1810934 1789259 1870727 1852993 1849825 1726102 1568053 1642769 1888901
23345A888901J7239j1067q1591M8912R5194M0569j04030k9852N2705k4739o5991
$$ 1888901 1906140 1895073 1813482 1862394 1957588 1998157 1894127 1864275 1916980 1892241 1826250
23334A826250o4457L3479O5346J26568L1004L1315j22032r1400K9248l6675r4347
$$ 1826250 1761793 1795272 1860618 1987186 2018190 2049505 1927473 1836073 1865321 1828646 1734299
23323A734299o6125O6763J5212N2266O3425p071q9950J05049N2321m7874J19672
$$ 1734299 1668174 1734937 1750149 1802415 1865840 1858769 1768819 1873868 1926189 1878315 1997987
23312A997987m4131j30047o2470J2575O8519M471j3454Q8889J30103N7660n0906
$$ 1997987 1953856 1823809 1761339 1773914 1842433 1846904 1833450 1922339 2052442 2110102 2059196
23301B059196j13430L3560n0782o58j8489m202n9517n6611j3944N0175r3331O8534
$$ 2059196 1945766 1979326 1928544 1927886 1909397 1905195 1845678 1789067 1775123 1825298 1731967 1800501
23289A800501J7291K7680N9222J20712J0415j11547P8652J10298L8863j32124
$$ 1800501 1817792 1845472 1904694 2025406 2035821 1924274 2002926 2113224 2152087 2019963
23279B019963M5208J03011l9390j09052o2067K2432Q3969K9230j31139j7049N490
$$ 2019963 2065171 2168182 2128792 2019740 1957673 1980105 2064074 2093304 1962165 1945116 1950606
23268A950606q922o7639J8806n221J14039P026q7342J61190k4645n7806p9630
$$ 1950606 1941684 1874045 1892851 1887630 2001669 2008695 1921353 2082543 2057898 2000092 1920462
23257A920462j71552J1885J44063L6729m3371m9379p4398j0802K30259J17880
$$ 1920462 1748910 1760795 1904858 1941587 1898216 1848837 1774439 1763637 1993896 2111776
23247B111776J8061k0736n7436m6659j5054P9752O8947m1667m3997l1939l251
$$ 2111776 2129837 2109101 2051665 2005006 1989952 2069704 2138651 2096984 2052987 2021048 2017797
23236B017797l3950L8894P9511J2322j16403J2252N4099K898L6919J05540K4085
$$ 2017797 1983847 2022741 2102252 2114574 1998171 2010423 2064522 2067420 2104339 2209879 2233964
23225B233964j52605p4109j07422Q470J11463q099N2987K0645J6241l2766j727
$$ 2233964 2081359 2007250 1899828 1908298 2019761 2011662 2064649 2085294 2101535 2068769 2067042
23214B067042P5052O1362q5678q0384P7809k6502q2623P77m7190P1063o096J63789
$$ 2067042 2142094 2203456 2117778 2037394 2115203 2088701 2006078 2006855 1959665 2030728 2024632 2188421
23202B188421M8271k15666j1468M0008J12555L5845o1041j1527m5290L1458j1
$$ 2188421 2236692 2021026 2009558 2049566 2162121 2197966 2136925 2125398 2080108 2111566 2111555
23191B111555l525R8086J15181j52093k3393q8184L7456q119l9886M3211o544
$$ 2111555 2108030 2206116 2321297 2169204 2145811 2057627 2095083 2086964 2047078 2090289 2083745
23180B083745Q6082M1079m3128J7414j72853p7816J22483k5826l62N2611P5403
$$ 2083745 2169827 2210906 2167778 2185192 2012339 1934523 2057006 2031180 2030818 2083429 2158832
23169B158832Q6533L6662m3725k8216n7173l2237l8817k2321R6160n0199j3122
$$ 2158832 2245365 2282027 2238302 2210086 2152913 2120676 2081859 2059538 2155698 2105499 2092377
23158B092377K6848O3699M6149P1085r7892j37802N7384l6030m6372M1763J14240
$$ 2092377 2119225 2182924 2229073 2300158 2202266 2064464 2121848 2085818 2039446 2081209 2195449
23147B195449J35599k1529j11529K8357j5935j15132m767J06107P2985p9531o1779
$$ 2195449 2331048 2309519 2197990 2226347 2210412 2095280 2090513 2196620 2269605 2190074 2128295
23136B128295L6607J80429J13736j54780n2453m2171p7636l2510K6467k5732L0552
$$ 2128295 2164902 2345331 2459067 2304287 2251834 2209663 2132027 2099517 2125984 2100252 2130804
23125B130804M5408o6635J16548J02133o0108o8122k7964J0834J24237L3281O9423
$$ 2130804 2176212 2109577 2226125 2328258 2268150 2200028 2172064 2182898 2307135 2340416 2409839
23114B409839M3893J2496L2305r5723Q1184Q7990J9764j14445j28264k35937L1829
$$ 2409839 2453732 2466228 2498533 2402810 2483994 2571984 2591748 2477303 2349039 2113102 2144931
23103B144931N9495J61021p1257p7881p9648M4610M9677J3475m8727p9965J72030
$$ 2144931 2204426 2365447 2294190 2216309 2136661 2181271 2230948 2244423 2195696 2115731 2287761
23092B287761R9819l0277O6014n3795j57193n3355J94940J14518o4756N538O7015
$$ 2287761 2387580 2357303 2423317 2369522 2212329 2158974 2353914 2468432 2403676 2409214 2476229
23081B476229j19852M3220J00239N4927j7723N1075p5275o857o1061r2675N7393
$$ 2476229 2356377 2399597 2499836 2554763 2537040 2588115 2512840 2505983 2444922 2352247 2409640
23070B409640K0932m1844M5207R0938n610J55618J15828l6801K5287l4407j37270
$$ 2409640 2430572 2388728 2433935 2524873 2519263 2674881 2790709 2753908 2779195 2744788 2607518
23059B607518j06937M167J22470J9990n1804J8317j15801j57129p585N3088L9884
$$ 2607518 2500581 2504748 2627218 2647208 2595404 2613721 2497920 2340791 2333206 2386294 2426178
23048B426178R1890N0437j42073M689M1278L9375J70730L8842n4120q0713j27117
$$ 2426178 2518068 2568505 2426432 2431121 2472399 2511774 2682504 2721346 2667226 2586513 2459396
23037B459396o8286J08498J20735Q0964p5965o4997N929L1998o361N7318L9050
$$ 2459396 2391110 2499608 2620343 2701307 2625342 2560345 2566274 2598272 2591911 2649229 2688279
23026B688279J403j61143j7983R8438J07776m8080k00902p6796R6336J250P0314
$$ 2688279 2689682 2528539 2510556 2608994 2716770 2668690 2467788 2390992 2487328 2488578 2558892
23015B558892j9894M3846k041k4960m0676M7687O3271r8773n5401j8100O8217
$$ 2558892 2538998 2582844 2580803 2555843 2515167 2562854 2626125 2527352 2471951 2453851 2522068
23004B522068J24799O9252M9491J3700j4273j42469J9233R1883j1867j16381l3761
$$ 2522068 2646867 2716119 2765610 2779310 2765037 2622568 2641801 2733684 2721817 2605436 2571675
22993B571675M0197L7979q7634k2290r5432L8231J54775n3601p8812m1783L1407
$$ 2571675 2611872 2649851 2562217 2539927 2444495 2482726 2637501 2583900 2505088 2463305 2494712
22982B494712P5087l7413n7071J4012j6855J3002J12440N2957P6006L2847o7896
$$ 2494712 2569799 2532386 2475315 2489327 2472472 2485474 2597914 2650871 2726877 2759724 2691828
22971B691828R8382J71794m467j86897N9561J36101r192k6303j7317J00396j1410
$$ 2691828 2790210 2962004 2957537 2770640 2830201 2966302 2957110 2930807 2913490 3013886 3002476
22960C002476N9282Q9285P225p0755n1336j10304N3753L414k2425J4412J16781
$$ 3002476 3061758 3151043 3158268 3087513 3036177 2925873 2979626 2983040 2960615 2975027 3091808
22949C091808J27505J9277J70482J1397J3888K0023q134J14417P8508O3401K1823
$$ 3091808 3219313 3238590 3409072 3420469 3434357 3454380 3446246 3560663 3639171 3702572 3724395
22938C724395q1253l2551l43378p01527r62602n40839J47325L86559L20795J22011
$$ 3724395 3643142 3610591 3267213 2565686 1603084 1062245 1209570 1596129 1916924 2038935
22928B038935K0449J9932m7909O2694j0463J63192J47136J04253O7307j3690q8744
$$ 2038935 2059384 2079316 2031407 2094101 2083638 2246830 2393966 2498219 2565526 2551836 2463092
22917B463092k7420l0559N0143J66919k5844m1542j7585L5500m267l2558r0985
$$ 2463092 2435672 2405113 2455256 2622175 2596331 2554789 2537204 2572704 2568437 2535879 2444894
22906B444894n0788J05055M2046K0083k7879J3514J19302r8487m0385J02273P5213
$$ 2444894 2394106 2499161 2541207 2561290 2533411 2546925 2666227 2567740 2527355 2629628 2704841
22895B704841J14992J7136j0203j13966J0169N2102O7670J19572J5879N1725l2776
$$ 2704841 2819833 2836969 2826766 2712800 2722969 2775071 2842741 2962313 2978192 3029917 2997141
22884B997141j07312l7575K1543o244m7007L8523P7509L1154q2585J694J44769
$$ 2997141 2889829 2852254 2873797 2867553 2820546 2859069 2936578 2967732 2885147 2886841 3031610
22873C031610J23158j7807n8229o4513M9440Q6140K449j14831j3818J5971L1089
$$ 3031610 3154768 3136961 3078732 3014219 3063659 3149799 3152248 3037417 3023599 3039570 3070659
22862C070659L0490j90751l4648M7906j1844L3040J05671J03654k5985q0459l8192
$$ 3070659 3101149 2910398 2875750 2923656 2911812 2944852 3050523 3154177 3128192 3047733 3009541
22851C009541K3131K7308M0187J13844r7151o4218K8549R3911Q3992O1558j04166
$$ 3009541 3032672 3059980 3100167 3214011 3116860 3052642 3081191 3175102 3259094 3320652 3216486
22840C216486k26275K5245j1883L5461J13490k4312n0139R2102K8294j43090o7908
$$ 3216486 2990211 3015456 3003573 3039034 3152524 3128212 3078073 3170175 3198469 3055379 2987471
22829B987471l8255O3257P4672n3172m561J31522n7357n5051P2453J30454o3861
$$ 2987471 2949216 3012473 3087145 3033973 3029412 3160934 3103577 3048526 3120979 3251433 3187572
22818C187572L2577J11674J06780l0715j37855j9482Q6178q2478j39787M9850
$$ 3187572 3220149 3331823 3438603 3407888 3270033 3250551 3336729 3254251 3114464 3164314
22808C164314J12557M4893J5903n9561p2472q6473J1287J11052J89245J7176m1934
$$ 3164314 3276871 3321764 3337667 3278106 3205634 3119161 3130448 3241500 3430745 3447921 3405987
22797C405987K1353M14j55938r1856N5713Q3503m3313Q7251J24101l1830n9766
$$ 3405987 3427340 3427754 3271816 3179960 3235673 3319176 3275863 3363114 3487215 3455385 3395619
22786C395619J01932J3562l1754L5517J13429P8066m3560N3767L876o6831j42224
$$ 3395619 3497551 3511113 3479359 3514876 3628305 3706371 3662811 3716578 3720454 3653623 3511399
22775C511399R9238Q1026j52605M2489J3963l3875L4295J4438J1075N1966j6513
$$ 3511399 3610637 3691663 3539058 3581547 3595510 3561635 3595930 3610368 3621443 3673409 3656896
22764C656896k09871k1874J61959J06059j04746j8465J75261L6068q5165k4350
$$ 3656896 3447025 3425151 3587110 3693169 3588423 3569958 3745219 3781287 3696122 3671772
22754C671772J27457j8488o8225o1040o0569n8740K1853L7848L1969n3623J9021
$$ 3671772 3799229 3780741 3712516 3651476 3590907 3532167 3554020 3591868 3623837 3570214 3589235
22743C589235O6120J72518J46599n0375m233J0514j69833m6756J17793O2853m0840
$$ 3589235 3655355 3827873 3974472 3924097 3919864 3930378 3760545 3713789 3831582 3894435 3853595
22732C853595j19818N845J01165P4932k3892M0357k4776n8171J3066k8983J53919
$$ 3853595 3733777 3739622 3840787 3915719 3891827 3932184 3907408 3849237 3862303 3833320 3987239
22721C987239J00318j91527m7727O3508O7239n3101K4363k2534N3034N1316k3992
$$ 3987239 4087557 3896030 3848303 3911811 3979050 3925949 3950312 3927778 3980812 4032128 4008136
22710D008136O6520m5065n4949J354O2605k1550R5995J56467J03154L1775o1214
$$ 4008136 4074656 4029591 3974642 3975996 4038601 4017051 4113046 4269513 4372667 4404442 4343228
22699D343228q3483j60036m0438K40171K12095j63955j40222q448Q6800N6993
$$ 4343228 4259745 4099709 4059271 4299442 4511537 4347582 4207360 4198912 4285712 4342705
22689D342705J50897n6228K8410l4616n441M0332n6782J5809L8014Q1188L9264
$$ 4342705 4493602 4437374 4465784 4431168 4425727 4466059 4409277 4425086 4463100 4544288 4583552
22678D583552n4206r9622l7J53602P0050N1650m7093p9674n550J56987P4723L591
$$ 4583552 4529346 4429724 4429687 4583289 4653339 4704989 4657896 4578222 4572672 4729659 4804382 4807973
22666D807973K9870o6996j18973q7000J28818J82283n449o3707j0715o8649M5591
$$ 4807973 4837843 4770847 4651874 4564874 4693692 4875975 4870526 4806819 4796104 4727455 4773046
22655D773046M2962J37818K0373o2591j9591L6995n7525P2705O3142j04366p6647
$$ 4773046 4816008 4953826 4974199 4911608 4892017 4929012 4871487 4944192 5007334 4902968 4826321
22644D826321k2605n4498J1860L7380J1904Q7960n8596o9726n1498M6015P8596
$$ 4826321 4803716 4749218 4761078 4798458 4810362 4898322 4839726 4770000 4718502 4764517 4843113
22633D843113L9970O610K0026k2038J11267l632r211J48599L5978K4868j2004
$$ 4843113 4883083 4889693 4909719 4887681 4998948 4995316 4986105 5134704 5170682 5195550 5183546
22622E183546q4880N3767J53559M9381J9476Q4203j31056j12844R234J27341J39104
$$ 5183546 5098666 5152433 5305992 5355373 5374849 5459052 5327996 5215152 5224386 5351727 5490831
22611E490831k20746j61720n4212J23342R5264O1379M2948J3493m5216N3418J60542
$$ 5490831 5270085 5108365 5054153 5177495 5272759 5334138 5377086 5390579 5345363 5398781 5559323
22600E559323J15652k054m2040L0130L3645R6757M4119l862M1129m894n5939J03243
$$ 5559323 5674975 5672921 5630881 5661011 5694656 5791413 5835532 5831670 5872799 5867905 5811966 5915209
22588E915209O9673M6058j03516q1462J34391J99215P3079m1610j06680O165l8108
$$ 5915209 5984882 6030940 5927424 5845962 5980353 6179568 6252647 6211037 6104357 6110522 6072414
22577F072414P3380J04473N1331O4132L049o1756n1798l1044J0102R0373O4703
$$ 6072414 6145794 6250267 6301598 6365730 6368779 6307023 6255225 6224181 6234283 6324656 6389359
22566F389359J32349J18068r6608q5552J26795L7721R646J74127J88802N4195
$$ 6389359 6521708 6639776 6543168 6457616 6584411 6622132 6631778 6805905 6994707 7048902
22556G048902j05626p137k6731k1107O5450J5597J7259J00257n4131j03012J17221
$$ 7048902 6943276 6936139 6909408 6888301 6953751 6969348 6986607 7086864 7032733 6929721 7046942
22545G046942N8703J28042J0886L805O0542J2671n1401p1875K924J41385K84237
$$ 7046942 7105645 7233687 7244573 7248378 7308920 7321591 7270190 7198315 7201239 7342624 7626861
22534G626861J26062J9007n4682j9638J9426o549J27320O6394O2880l8409j2315
$$ 7626861 7752923 7771930 7717248 7697610 7717036 7710487 7837807 7904201 7967081 7928672 7916357
22523G916357J18145J11108j1005j2271l1726J7245R1144P7060J82428J4037J20684
$$ 7916357 8034502 8145610 8134605 8122334 8090608 8107853 8198997 8276057 8458485 8472522 8593206
22512H593206J31868J12040O3204r204J11302J01057N9912J0999O977J1624P7292
$$ 8593206 8725074 8837114 8900318 8891114 9002416 9103473 9163385 9174384 9181361 9192985 9270277
22501I270277J28859m0075n8190P0654L1847J07172R8079J2015m6111j13114o4024
$$ 9270277 9399136 9359061 9300871 9371525 9403372 9510544 9608623 9620638 9574527 9461413 9397389
22490I397389J22004K01723J77792K45536K53350J12446Q0462j40506J10228K43841
$$ 9397389 9519393 9721116 9898908 10144444 10397794 10510240 10590702 10450196 10560424 10804265
22480A0804265K59913J45982J83905K57093J18750l4973p0373k73991o37027p26030
$$ 10804265 11064178 11210160 11394065 11651158 11769908 11734935 11664562 11390571 10753544 10027514
22470A0027514k09666O3997L65010L27020J40001M5604J49942K03542J32735J28238
$$ 10027514 9817848 9881845 10246855 10573875 10713876 10759480 10909422 11112964 11245699 11373937
22460A1373937L10305L57424K99898Q2574K01640J97156O8598N8573J21932K63691
$$ 11373937 11684242 12041666 12341564 12424138 12625778 12822934 12891532 12950105 13072037 13335728
22450A3335728R4521J09521L33327J87378J61632K72771J83589J79609J88352
$$ 13335728 13430249 13539770 13873097 14060475 14222107 14494878 14678467 14858076 15046428
22441A5046428K8N4736K64447L27026J49018J36883L00072L13832K15055J38326
$$ 15046428 15046456 15101192 15365639 15692665 15841683 15978566 16278638 16592470 16807525 16945851
22431A6945851J81481M5048J89156K67815K81686L09326M47389L05372L39335
$$ 16945851 17127332 17172380 17361536 17629351 17911037 18220363 18667752 18973124 19312459
22422A9312459K89296K23654K50705M10431K71487K75699M29866M90812M47236
$$ 19312459 19601755 19825409 20076114 20486545 20758032 21033731 21463597 21954409 22401645
22413B2401645M37773L97048M72000N77604M35257N01231N78652O82660P49067
$$ 22401645 22839418 23236466 23708466 24286070 24721327 25222558 25801210 26483870 27232937
22404B7232937M28204N39045P65305P83872P52263Q27065R12995Q72845O68182
$$ 27232937 27661141 28200186 28965491 29749363 30501626 31328691 32241686 33114531 33782713
22395C3782713Q60810J194549J287741J343292J128998J208016J543557J649270
$$ 33782713 34643523 35838072 37125813 38469105 39598103 40806119 42349676 43998946
22387D3998946J704578J804853K038547K227248K424058K621866K859924L262952
$$ 43998946 45703524 47508377 49546924 51774172 54198230 56820096 59680020 62942972
22379F2942972L608513M014376M555951N080986N601935N847652O167489O976556
$$ 62942972 66551485 70565861 75121812 80202798 85804733 91652385 97819874 104796430
22371A04796430Q009106Q394622R240548J1156403J3807876J6288129J5639790
$$ 104796430 112805536 121200158 130440706 141597109 155404985 171693114 187332904
22364A87332904O787278n611843j6064393m5358871j17385738j74765317r5391414
$$ 187332904 194120182 188508339 172443946 127085075 9699337 -165065980 -260457394
22357b60457394q631469L4568323L7425255K9004636K2060890J7077831J3669228
$$ -260457394 -269088863 -234520540 -197095285 -168090649 -146029759 -128951928 -115282700
22350a15282700J0874166R046635P725594O567196N362238M780074M345596L820046
$$ -115282700 -104408534 -95361899 -87636305 -81069109 -75706871 -70926797 -66581201 -62761155
22342f2761155L498281L105127K850076K489230K150932K018169J882552J594954
$$ -62761155 -59262874 -56157747 -53307671 -50818441 -48667509 -46649340 -44766788 -43171834
22334d3171834J584696J723829J656273J374095J040932J005560J104431J061791
$$ -43171834 -41587138 -39863309 -38207036 -36832941 -35792009 -34786449 -33682018 -32620227
22326c2620227R09154P75400Q09225Q17697Q25642Q68055Q14643P27442O07470
$$ -32620227 -31711073 -30935673 -30126448 -29308751 -28483109 -27615054 -26800411 -26072969 -25465499
22317b5465499O58453O29902N29565M32840M49212M28545L54378L08837M77868
$$ -25465499 -24807046 -24177144 -23647579 -23214739 -22765527 -22336982 -21982604 -21673767 -21195899
22308b1195899M86006L58300K97204M31403M48371L29922L52530M14145J16745
$$ -21195899 -20709893 -20351593 -20054389 -19622986 -19174615 -18844693 -18492163 -18078018 -17961273
22299a7961273J46168L47313M28499L67970L88370L16349K12808J79668J11443
$$ -17961273 -17815105 -17467792 -17039293 -16671323 -16282953 -15966604 -15753796 -15574128 -15462685
22290a5462685J97229L33717J76522R3831J97628L72727K63342J48853J99886
$$ -15462685 -15265456 -14931739 -14755217 -14661386 -14463758 -14091031 -13827689 -13678836 -13478950
22281a3478950L62289J82414K05799J57256J56668J57010L7657R4323L44861K27007
$$ -13478950 -13116661 -12934247 -12728448 -12571192 -12414524 -12257514 -12219857 -12125534 -11780673 -11553666
22271a1553666J73247J55315P9744J1929m8807Q9271K58746J94020J48263J45353
$$ -11553666 -11380419 -11225104 -11145360 -11133431 -11182238 -11092967 -10834221 -10640201 -10491938 -10346585
22261a0346585K60969J77719Q9813J10191K40226J33879K00166J71461Q9781O0947
$$ -10346585 -10085616 -9907897 -9818084 -9707893 -9467667 -9333788 -9133622 -8962161 -8872380 -8811433
22251h811433J82450J33215O8872M9397j21742n54383p87739l78580O4168L31799
$$ -8811433 -8628983 -8495768 -8426896 -8377499 -8499241 -9053624 -9841363 -10219943 -10155775 -9823976
22241i823976J70107J52277K41625N7625j25006o2501K06068K68543M6993J10504
$$ -9823976 -9653869 -9501592 -9259967 -9202342 -9327348 -9389849 -9183781 -8915238 -8868245 -8757741
22231h757741m060J46243J17393J85320K37437J91770Q1904K3469J14931M5343
$$ -8757741 -8761801 -8615558 -8498165 -8312845 -8075408 -7883638 -7801734 -7778265 -7663334 -7617991
22221g617991R3454j9630q5001O0325M0162J50904J61176K4656J22818O0240J75520
$$ -7617991 -7524537 -7544167 -7629168 -7568843 -7528681 -7377777 -7216601 -7191945 -7069127 -7008887 -6833367
22210f833367J68035n8505k9341P4684L8620J02407Q8092j5234r7516J2940P7237
$$ -6833367 -6665332 -6723837 -6753178 -6678494 -6639874 -6537467 -6449375 -6464609 -6562125 -6549185 -6471948
22199f471948J2097J9344J55552J28018P3516L5187r7465p37M3135N4602M0229
$$ -6471948 -6459851 -6440507 -6284955 -6156937 -6083421 -6048234 -6145699 -6146436 -6103301 -6048699 -6008470
22188f008470Q3544J15422M7365j0646N8088J22868k4418P4928O7439O0431k6282
$$ -6008470 -5924926 -5809504 -5762139 -5772785 -5714697 -5591829 -5616247 -5541319 -5473880 -5413449 -5439731
22177e439731n9661M4918J57275R0636J20590M1569l8518J9066Q3921O8197n6718
$$ -5439731 -5499392 -5454474 -5297199 -5206563 -5085973 -5044404 -5082922 -5063856 -4979935 -4911738 -4968456
22166d968456K2773J4907J09437M8007j51261Q3386P4943p4860P9397Q5942r1659
$$ -4968456 -4945683 -4930776 -4821339 -4773332 -4924593 -4841207 -4766264 -4841124 -4761727 -4675785 -4767444
22155d767444j37634J0061J60297J27957L2188J3594P7002J05177K6817l3825
$$ -4767444 -4905078 -4895017 -4734720 -4606763 -4574575 -4560981 -4483979 -4378802 -4351985 -4385810
22145d385810j46912k5779L7500P7076J19118l5441L9686R993Q4067J27378L0161
$$ -4385810 -4532722 -4558501 -4521001 -4443925 -4324807 -4360248 -4320562 -4310569 -4226502 -4099124 -4068963
22134d068963j09260L6413M5512J75424P0899j09745o5208k7350R4813M314K4671
$$ -4068963 -4178223 -4141810 -4096298 -3920874 -3849975 -3959720 -4024928 -4052278 -3957465 -3953151 -3928480
22123c928480R3723n7860K4785O4345r1576J70284P9156r867o9423p4653p1799
$$ -3928480 -3834757 -3892617 -3867832 -3803487 -3895063 -3724779 -3645623 -3655490 -3724913 -3799566 -3871365
22112c871365Q482O7412N6602O3176K6703M2333J4205j10851Q8720J23635j90695
$$ -3871365 -3862883 -3795471 -3738869 -3675693 -3648990 -3606657 -3592452 -3703303 -3614583 -3490948 -3681643
22101c681643r3672R73J36135J8521l8617m4763R5155J52153J15524P355r6044
$$ -3681643 -3775315 -3774342 -3638207 -3619686 -3658303 -3703066 -3607911 -3455758 -3340234 -3332879 -3428923
22090c428923q1289k7936L7528K2558k6083N0538P6490J18831O2482n145n9036
$$ -3428923 -3510212 -3538148 -3500620 -3478062 -3504145 -3453607 -3377117 -3258286 -3195804 -3200949 -3259985
22079c259985M7600j7365p3878J16319J99402J46182n3518r1061n9900P0414J26466
$$ -3259985 -3212385 -3229750 -3303628 -3187309 -2987907 -2841725 -2895243 -2986304 -3046204 -2975790 -2849324
22068b849324q3353k1662J75917J22163n3633j16670q6718O0200L7414K563n5087
$$ -2849324 -2932677 -2954339 -2778422 -2656259 -2709892 -2826562 -2913280 -2853080 -2815666 -2813103 -2868190
22057b868190P8569J3124M5504m4023j06602R349N2723J43749J8541N0720j1711
$$ -2868190 -2789621 -2776497 -2730993 -2775016 -2881618 -2872269 -2819546 -2675797 -2657256 -2606536 -2618247
22046b618247N1183N5728q0816j2899L2557m786p3627j783J28265J09061O8276
$$ -2618247 -2567064 -2511336 -2592152 -2605051 -2572494 -2577280 -2650907 -2652690 -2524425 -2415364 -2347088
22035b347088n6343r9591n0388M6716P0903m5104m0444J5305N7784n0959n218
$$ -2347088 -2403431 -2503022 -2553410 -2506694 -2435791 -2480895 -2521339 -2506034 -2448250 -2499209 -2504427
22024b504427P6105n696J8506m8326n7985J20609L0473P26M215J32239j0208L6411
$$ -2504427 -2428322 -2434018 -2415512 -2463838 -2521823 -2401214 -2370741 -2370015 -2365800 -2233561 -2243769 -2207358
22012b207358M3290l8756p6746J04860J25476N5072M5091l6412o4500j03116J7870
$$ -2207358 -2164068 -2202824 -2279570 -2174710 -2049234 -1994162 -1949071 -1985483 -2049983 -2153099 -2135229
22001b135229Q9547n3890j01144J30072J67464R9551j22265M1174n8535l382R3295
$$ -2135229 -2045682 -2099572 -2200716 -2070644 -1903180 -1803629 -1925894 -1884720 -1943255 -1946637 -1853342
21990a853342l4029q9162M431K2634J17012O8966J96975N3822k1105q9125J23488
$$ -1853342 -1887371 -1976533 -1972102 -1949468 -1832456 -1763490 -1566515 -1512693 -1533798 -1622923 -1499435
21979a499435M595M6474L4241r5952o8469M8944J03805J5556j39978K7100P1343
$$ -1499435 -1494840 -1448366 -1414125 -1510077 -1578546 -1529602 -1425797 -1410241 -1550219 -1523119 -1451776
21968a451776Q1958m8368K3986M2635M3553O0969Q3217j5694m417P0103M4753
$$ -1451776 -1369818 -1418186 -1394200 -1351565 -1308012 -1247043 -1163826 -1179520 -1183937 -1113834 -1069081
21957a069081K0116K757J16657J05279j7438O7526R0588J57179J19943J39271
$$ -1069081 -1048965 -1046208 -929551 -824272 -841710 -774184 -683596 -526417 -406474 -267203
21947b67203K86501Q2062J36776R1583J49746J55315K62364K61850K27568L31490
$$ -267203 19298 101360 238136 329719 479465 634780 897144 1158994 1386562 1718052
21937A718052L91921L04652J19418j31823m27413j106402k823806l939970k031764
$$ 1718052 2109973 2414625 2534043 2402220 1974807 868405 -1955401 -5895371 -7927135
21928g927135q2364Q21177Q32037O54475L44563L65570K82227K47211K69346K85119
$$ -7927135 -8009499 -7188322 -6356285 -5701810 -5357247 -4991677 -4709450 -4462239 -4192893 -3907774
21918c907774L59482K89204Q7710P327P5780Q1131j8560J5446N2572J7431M5469
$$ -3907774 -3548292 -3259088 -3171378 -3164051 -3088271 -3007140 -3025700 -3010254 -2957682 -2940251 -2894782
21907b894782K47210P683j9116Q859m4290J07801J59462M1245J6942j0476M3875
$$ -2894782 -2647572 -2639889 -2659005 -2650146 -2694436 -2586635 -2427173 -2385928 -2368986 -2379462 -2335587
21896b335587M1210M4545J0233J7246J5709o7691Q2993N4799K3887J6395o6337
$$ -2335587 -2294377 -2249832 -2239599 -2222353 -2206644 -2274335 -2191342 -2136543 -2112656 -2096261 -2162598
21885b162598P4953Q9543o233j10449M8405P0979J09894R7206j08914q6486N7080
$$ -2162598 -2087645 -1998102 -2004335 -2114784 -2066379 -1995400 -1885506 -1788300 -1897214 -1983700 -1926620
21874a926620L6497k1246o7559k9545Q7438N4779p8194j6587Q1399P2951j6894
$$ -1926620 -1890123 -1911369 -1978928 -2008473 -1921035 -1866256 -1944450 -1961037 -1879638 -1806687 -1823581
21863a823581L8269J56815K7761j11402r0845j1950K1440J6754j24986m7143L9426
$$ -1823581 -1785312 -1628497 -1600736 -1712138 -1802983 -1814933 -1793493 -1776739 -1901725 -1948868 -1909442
21852a909442Q663J55143O2853j9978j03670K4550Q1345J63959m1782L692k9362
$$ -1909442 -1900779 -1745636 -1682783 -1702761 -1806431 -1781881 -1700536 -1536577 -1578359 -1574667 -1604029
21841a604029j12253j26987l7531R7520P5857L5800L4565J5346P8290M0387L6032
$$ -1604029 -1716282 -1843269 -1880800 -1783280 -1707423 -1671623 -1637058 -1621712 -1543422 -1503035 -1467003
21830a467003l3992k4723M6942J122J01027J39600M0425j5018m3725m5785n3832
$$ -1467003 -1500995 -1525718 -1478776 -1477654 -1376627 -1237027 -1196602 -1211620 -1255345 -1301130 -1354962
21819a354962K0099J1968l9580Q4369j2175L3982k1394P8797m022p1995m2706
$$ -1354962 -1334863 -1322895 -1362475 -1278106 -1290281 -1256299 -1277693 -1198896 -1202918 -1274913 -1317619
21808a317619P4840Q755L1380o3145K6726K5435l974L3529M6758k4329r2972m3771
$$ -1317619 -1242779 -1234024 -1202644 -1265789 -1239063 -1213628 -1217602 -1184073 -1137315 -1161644 -1254616 -1298387
21796a298387O7999j6178q2545J14235N0246o7832J733J29777J45895K02003J16236
$$ -1298387 -1230388 -1246566 -1329111 -1214876 -1164630 -1232462 -1230729 -1100952 -955057 -753054 -636818
21785f36818P3035J5301o5699L736R7058J54853N2193K9294r7859n09702q12945
$$ -636818 -563783 -548482 -614181 -610445 -513387 -358534 -306341 -277047 -374906 -884608 -1697553
21774a697553p88291l21360J32388K13368J70229K19195J26313M9392J14672P4405
$$ -1697553 -2485844 -2807204 -2674816 -2461448 -2291219 -2072024 -1945711 -1896319 -1781647 -1707242
21764a707242M967O4741O683N6578k2496j6920J3365l240J00197l5359m7176L2794
$$ -1707242 -1702275 -1637534 -1630851 -1574273 -1596769 -1613689 -1600324 -1603564 -1503367 -1538726 -1585902 -1553108
21752a553108R3419q1689Q1623J6366O2677L3085J6053m8917m7411o8802R0809
$$ -1553108 -1459689 -1541378 -1459755 -1443389 -1380712 -1347627 -1331574 -1380491 -1427902 -1496704 -1405895
21741a405895P3227M5157l5425q5187l5780J22885K050K5604k7624q7954q3740
$$ -1405895 -1332668 -1287511 -1322936 -1408123 -1443903 -1321018 -1318968 -1293364 -1320988 -1408942 -1492682
21730a492682J33570J27674K00203o243m4036j2226j33602q3723N087j1059L9248
$$ -1492682 -1359112 -1231438 -1031235 -1037478 -1081514 -1093740 -1227342 -1311065 -1305978 -1317037 -1277789
21719a277789n063J33547J15447m6793l8619m5658j2285m6049M9055P4916P769
$$ -1277789 -1282852 -1149305 -1033858 -1080651 -1119270 -1164928 -1177213 -1223262 -1174207 -1099291 -1091522
21708a091522M9725j6730o5269j284P4222J9843P9373j64641j28702N111J20665
$$ -1091522 -1041797 -1058527 -1123796 -1125080 -1050858 -1031015 -951642 -1116283 -1244985 -1239874 -1119209
21697a119209J28249j7772m1618O107O4483O9305k3528J65025k0491r6667K6423
$$ -1119209 -990960 -1008732 -1050350 -1044243 -979760 -910455 -933983 -768958 -789449 -886116 -859693
21686h59693p2335m2198O0517j39367l3379M5039j531L1666r270r8827r3410p7311
$$ -859693 -932028 -974226 -913709 -1053076 -1086455 -1041416 -1042947 -1011281 -1020551 -1119378 -1212788 -1290099
21674a290099Q5600K44748J27139k23802j84979m162J20470L8139J8719Q064l5800
$$ -1290099 -1204499 -959751 -832612 -1056414 -1241393 -1245555 -1125085 -1086946 -1068227 -1060163 -1095963
21663a095963P3096J35385J20816l6708j5454N5954j8147j01351p6523N5668K2025
$$ -1095963 -1022867 -887482 -766666 -803374 -818828 -762874 -781021 -882372 -958895 -903227 -881202
21652h81202l6981j567q4621J30419J59266p2138k07237K7253Q3649k1703n6074
$$ -881202 -918183 -919750 -1004371 -873952 -714686 -786824 -994061 -966808 -883159 -904862 -960936
21641i60936J6732L5912O235N4903n6918p9488J35341R6227r3895N4444L044o7634
$$ -960936 -944204 -908292 -902057 -847154 -904072 -983560 -848219 -751992 -845887 -791443 -788399 -856033
21629h56033N5007n9809l5022J8296O8308M7361O4371N1480k1011j2072j09215
$$ -856033 -801026 -860835 -895857 -877561 -809253 -761892 -697521 -646041 -667052 -679124 -788339
21618g88339l137K6727M7673n9020j12326J3877J40130k5079r9843o3926l8408
$$ -788339 -791476 -764749 -717076 -776096 -888422 -874545 -734415 -759494 -859337 -923263 -961671
21607i61671K6771J5930J68135j5561r9402J28642J71721q4171k02456L9489J089
$$ -961671 -934900 -918970 -750835 -766396 -865798 -737156 -565435 -649606 -852062 -812573 -811484
21596h11484q4223N0546N1061R0417J12014l2978m4537p1323K8835L3012n1170
$$ -811484 -895707 -845161 -794100 -703683 -591669 -624647 -669184 -740507 -711672 -678660 -729830
21585g29830J09984q333j40050j57171m2545J5155N5238J2766L3458N6038k5111
$$ -729830 -619846 -628179 -768229 -925400 -967945 -952790 -897552 -884786 -851328 -795290 -820401
21574h20401m1048M7197R1404J0853j4226N4728Q6955R9005K5571j14072l8538
$$ -820401 -861449 -814252 -722848 -711995 -726221 -671493 -584538 -485533 -459962 -574034 -612572
21563f12572p2354N0783k5742P0130J08146Q3357j5768j42043p4970p8781J9514
$$ -612572 -684926 -634143 -659885 -589755 -481609 -398252 -414020 -556063 -631033 -709814 -690300
21552f90300Q7225k0905Q67K4235J34562k0889j12597J11215Q516j19747P1487
$$ -690300 -603075 -623980 -623113 -598878 -464316 -485205 -597802 -486587 -478071 -597818 -526331
21541e26331J64450o1362j69629k6293P4572l4530n973R8769L011n7434L886R6106
$$ -526331 -361881 -423243 -592872 -619165 -544593 -579123 -585096 -486327 -483316 -540750 -536864 -440758
21529d40758l1142K3963q218o685q7650j00058m2261J1326Q2578n4499N7754O1302
$$ -440758 -471900 -447937 -456155 -462840 -550490 -650548 -692809 -681483 -598905 -653404 -595650 -534348
21517e34348P7700k2993Q3924L6994j46720k5993K0106K0156q007m7776J25881
$$ -534348 -456648 -479641 -395717 -358723 -505443 -531436 -511330 -491174 -499181 -546957 -421076
21506d21076J36175k7927m6957j32851K7161J7892k9847M400L6173Q8934J4202
$$ -421076 -284901 -312828 -359785 -492636 -465475 -447583 -477430 -473030 -436857 -347923 -333721
21495c33721O2414q5101o1206o9445m6212j7364J44538N6487J7653j3401L9264
$$ -333721 -271307 -356408 -417614 -487059 -533271 -550635 -406097 -349610 -331957 -345358 -306094
21484c06094K1653K9002r6429o1685q0224o5556r4197o7267M1763n2775J4545
$$ -306094 -284441 -255439 -351868 -413553 -493777 -559333 -653530 -720797 -679034 -731809 -717264
21473g17264K01448J2120o4539K7674j1108L8069j3392k2075N8077k4223p9312
$$ -717264 -515816 -503696 -568235 -540561 -551669 -513600 -526992 -549067 -490990 -515213 -594525
21462e94525j8454K11161J28307o3470n6072J5301l780L3342J35582j0920k2899
$$ -594525 -612979 -401818 -273511 -336981 -393053 -377752 -381532 -348190 -212608 -223528 -246427
21451b46427p1938j6259j6129O959k4227p5235O7875k286N5783J50446M1442p8092
$$ -246427 -318365 -334624 -350753 -343794 -368021 -443256 -375381 -377667 -321884 -171438 -129996 -208088
21439b08088r5201r3927p6920Q0868p545K3426P2083M6144j0060K5427J59322
$$ -208088 -303289 -397216 -474136 -393268 -400813 -377387 -305304 -259160 -269220 -243793 -84471
21428h4471R1021p2295j09762M9265m7158j8920n1762l5182j03149j21857m6455
$$ -84471 6550 -65745 -175507 -126242 -173400 -192320 -244082 -279264 -382413 -504270 -550725
21417e50725J72636P8705J2015r0940o5443L0245L483Q0063P6822N6695J8080
$$ -550725 -378089 -299384 -287369 -378309 -443752 -413507 -410024 -329961 -253139 -196444 -178364
21406a78364j24752J8727J11024M2033J4186m1628j02924j5730k4521k8891k3147
$$ -178364 -303116 -284389 -173365 -131332 -117146 -158774 -261698 -277428 -301949 -330840 -353987
21395c53987K8007N1048m9438l2523J2862j492O2779R5887p328k0579J657K3059
$$ -353987 -325980 -274932 -324370 -356893 -344031 -345523 -282744 -186857 -194185 -214764 -213107 -190048
21383a90048M5398J7660o4871m9215N3261k6192J8427m190k9470K8164m5238k5421
$$ -190048 -144650 -126990 -191861 -241076 -187815 -214007 -195580 -199770 -229240 -201076 -246314 -271735
21371b71735J04242n5958q9101N5600l5933L179o671m1298M7171P6684L3720L5582
$$ -271735 -167493 -223451 -312552 -256952 -292885 -289706 -296377 -337675 -290504 -213820 -180100 -144518
21359a44518p5463j3016q2396p0263J37715p0493n9011J14957J41713J8934q1360
$$ -144518 -219981 -232997 -315393 -385656 -247941 -318434 -377445 -262488 -120775 -101841 -183201
21348a83201j12147J11045N9778P7657K6438l759M9414q8327r004l8011J840L709
$$ -183201 -295348 -184303 -124525 -46868 -20430 -24189 25225 -63102 -72106 -110117 -108277 -104568
21336a04568J03305K1186j52769r685K9730K3688j6881l7584Q4370J974n3153
$$ -104568 -1263 19923 -132846 -142531 -112801 -89113 -105994 -143578 -59208 -57234 -110387
21325a10387K9004J39719K3172m1775p6925j0773j4149m5463o3331k869J4033
$$ -110387 -81383 58336 81508 39733 -37192 -47965 -62114 -107577 -170908 -173777 -159744
21314a59744P665J77459r4350j16320L4897L240J35599Q8075j4026l8866j19715
$$ -159744 -152079 25380 -68970 -185290 -150393 -147153 -11554 76521 62495 23629 -96086
21303i6086o2705k00864J943J03423O5920m44l6350M5492J48109j9879r2596r7151
$$ -96086 -158791 -359655 -357712 -254289 -188369 -188813 -225163 -179671 -31562 -51441 -144037 -241188
21291b41188J5171J5369J40535O2139L5242j6115p510l4636L6687J33692j59204
$$ -241188 -226017 -210648 -70113 -7974 27268 11153 3643 -30993 5694 139386 -19818
21280a9818j2569l0401j8377Q3239K5891l0874M7172M0719M5614l053j48939j3433
$$ -19818 -32387 -62788 -81165 2074 27965 -2909 44263 84982 130596 127543 -21396 -34829
21268c4829l8539j09891K513k776K7933J67428K4143j4822j4540r9621L9043O0080
$$ -34829 -73368 -183259 -180746 -183522 -155589 11839 35982 21160 6620 -93001 -53958 6122
21256F122k4144j59511R6896J01325J072K6711P5254L8303j425q5650j87924o4568
$$ 6122 -18022 -177533 -80637 20688 21760 48471 123725 162028 160603 74953 -112971 -177539
21244a77539M8452L9832k096J9131n624Q1097Q7765n1606l7826L54J40517k4346
$$ -177539 -129087 -89255 -91351 -72220 -77844 3253 91018 39412 1586 1940 142457 118111
21232A18111r5595M625J6235L9522j8591m927n3929j28884N2016K7291m5352j09297
$$ 118111 22516 27141 43376 82898 64307 59380 5451 -123433 -71417 -44126 -89478 -198775
21220a98775r4946O2774J21456n585j6706J18053J55631O9906O5377j4384m2442
$$ -198775 -293721 -230947 -109491 -115076 -131782 -13729 141902 211808 277185 262801 220359
21209B20359o3604l3146K2693o8714M4311k42q4429m3682K8730j932N0941Q126
$$ 220359 156755 123609 146302 77588 121899 121657 37228 -6454 22276 20344 71285 79411
21197G9411O5197p324l6517k2789m2769J77045O2991j00958j17304p065r2917
$$ 79411 144608 137284 100767 77978 35209 212254 275245 174287 56983 49918 -42999
21186d2999N024R3821J9924n3916m5817J4900p9701J00652J43327P3170p355o0877
$$ -42999 -37975 55846 75770 21854 -23963 -9063 -88764 11888 155215 228385 221030 160153
21174A60153O0111R5660j27752p3254L143o4897j36989r5285Q053J00268J90238
$$ 160153 220264 315924 188172 114918 118061 53164 -83825 -179110 -171057 -70789 119449
21163A19449J25292l0880k0647R5223N8502k2443p7291l6037l8185n0373l689
$$ 119449 244741 213861 193214 288437 346939 324496 247205 211168 172983 122610 118921
21152A18921m8252R8746L6343l2576n0448L6754n3601j1415N7904n971j4125Q9031
$$ 118921 70669 169415 205758 173182 122734 159488 105887 94472 152376 146405 132280 221311
21140B21311K9226o35o7607Q562P6091k1559j18735j30100Q053N8107J22293k2471
$$ 221311 250537 249902 182295 190857 266948 245389 126654 -3446 4607 62714 185007 162536
21128A62536n1765L4577Q8833k341K6519j47146K7033N3522O3525k0998j28166
$$ 162536 110771 145348 234181 231840 258359 111213 138246 191768 255293 234295 106129
21117A06129q9530J63023J53291k8434j159j27378o3762K9156R9658m9013j23858
$$ 106129 16599 179622 332913 304479 303320 175942 112180 141336 240994 191981 68123
21106F8123J19709Q5124j6816q5897l982M0350L6986o4334m6655J27755P4037
$$ 68123 187832 272956 256140 170243 166261 206611 243597 179263 132608 260363 334400
21095C34400K4983j07544l9794P8733m1193j73923o5305P6190L1899N6915L7371
$$ 334400 359383 251839 212045 290778 249585 75662 10357 86547 118446 175361 212732
21084B12732O9669k0089r8348K9084N0801Q0022M9646L3018r8253K6087J06324
$$ 212732 282401 262312 163964 193048 243849 323871 373517 406535 308282 334369 440693
21073D40693J36505l9856j18230M9453p1396j31818m057K8709J03178K4318k3329
$$ 440693 577198 537342 419112 468565 397169 265351 261294 290003 393181 417499 394170
21062C94170R5703L0033j28122o7604J67921J25675R1364p7965k9116o2289j56360
$$ 394170 489873 519906 391784 324180 492101 617776 709140 631175 602059 539770 383410
21051C83410j30625N8273O951k2802n3316m964k3062m2458M8839R0138j02482
$$ 383410 252785 311058 318009 295207 241891 236927 213865 171407 220246 310384 207902
21040B07902o5582R1726J8808j30719j23015p0153J17099q0134o2433P9238P9832
$$ 207902 142320 234046 252854 122135 -880 -71033 46066 -34068 -96501 -17263 62569
21029F2569O4500p36O8009J15982J0627l6375m975J04856J6293k1168j12226J29888
$$ 62569 127069 126333 194342 310324 320951 284576 279601 384457 400750 379582 267356 397244
21017C97244R9892j94928J02091k8834j5859Q6730o82r8392j31283M7841O6283
$$ 397244 497136 302208 404299 375465 359606 446336 445654 347262 215979 263820 330103
21006C30103J13873j7216m2208L407M884j04921o8105J9700m9740p8207N6032
$$ 330103 443976 426760 384552 387959 392843 287922 219817 239517 189777 111570 167602
20995A67602P0220J6944M8870M81M5905J7787L5898j8865l2088o7116n1200J22603
$$ 167602 237822 254766 303636 304117 350022 367809 403707 384842 352754 285638 234438 357041
20983C57041J13989n7782k9028L0994Q6707j40832j52089l4626J35541N4029j66368
$$ 357041 471030 413248 384220 415214 501921 361089 209000 174374 309915 363944 197576
20972A97576J0771J45593l0280l371N2571J8943l9585K2033m8961q1307j7370
$$ 197576 208347 353940 323660 320289 372860 391803 352218 374251 325290 243983 226613
20961B26613N8775l4551M5068M4675Q7241M0351k984j1379j46096n9510P9307
$$ 226613 285388 250837 295905 340580 427821 468172 465188 453809 307713 248203 327510
20950C27510O0138J17601n2355n5389J10200k4286P386L3551m4868K8829J15407
$$ 327510 387648 505249 452894 397505 507705 483419 490805 524356 479488 508317 623724
20939F23724j77396o258O6966L7547M6294l6518p9240M3012J8694m0312j37278
$$ 623724 446328 440070 507036 544583 590877 554359 475119 518131 536825 496513 359235
20928C59235j86810K4745J85966K3226P4325n2880l6708J1066N402J8242m1050
$$ 359235 172425 197170 383136 406362 480687 427807 391099 402165 407567 425809 384759
20917C84759l4938j2094N341R3032R7406N0063Q8282m6552J472O0096K4140j94223
$$ 384759 349821 337727 343068 436100 533506 583569 671851 625299 626771 686867 711007 516784
20905E16784p8457m8003j28655O5476N0033N2187P9636P976o9525n5578M0086
$$ 516784 438327 390324 261669 327145 377178 429365 509001 516977 447452 391874 431960
20894D31960K163r246P8000N5817j00235l39o6577J94221P6528j64612o2719q0006
$$ 431960 434123 424877 502877 558694 458459 458120 391543 585764 662292 497680 434961 354955
20882C54955L1981l6445j6026j6272p1049Q6746J14645J75437M4990j19783n3196
$$ 354955 386936 350491 334465 318193 247144 333890 448535 623972 668962 549179 495983
20871D95983P4604L9478j09491p0622j41290M0103J08379R9427M894p4765R13
$$ 495983 570587 610065 500574 429952 288662 328765 437144 536571 541465 466700 467613
20860D67613p7156o2855m3558Q1563n7845o3740J08903J360J95297l8181L4521
$$ 467613 390457 327602 284044 365607 307762 244022 352925 354285 549582 511401 545922
20849E45922J758J9699r0238l9786m8571J8252P7447J53373j00168m1535R0341
$$ 545922 547680 567379 477141 437355 388784 407036 484483 637856 537688 496153 586494
20838E86494j22911j9909Q8918L0402l4075P848l0975k0766j7296P8057k7894
$$ 586494 463583 443674 532592 562994 528919 536767 505792 485026 467730 545787 517893
20827E17893l5742J74355L9433j32555k319l4746R385R3619o8059k955K0837j00874
$$ 517893 482151 656506 695939 563384 561065 526319 535704 629323 561264 558309 579146 478272
20815D78272q8663m9024k5940M0632n848N5757O2837n7645k5559p5646N3274O6544
$$ 478272 389609 340585 314645 355277 349429 405186 468023 410378 384819 309173 362447 428991
20803D28991J03797P6979r008P5679m5758j19639p9607K04252J7431o790M2413
$$ 428991 532788 609767 600759 676438 630680 511041 431434 635686 653117 646327 688740
20792F88740j0327j5207N5244K2838R1937L0980j51654N3934N2493k4239M2474
$$ 688740 678413 663206 718450 741288 833225 864205 712551 766485 818978 794739 837213
20781H37213M9282j58935j11287m1174j5685r347K9889J06959j1344K01763j1981
$$ 837213 886495 727560 616273 575099 559414 550067 579956 686915 675571 877334 865353
20770H65353k40540m5847P9195N2133j2678l9650m8461O8795J2967j15955p7713
$$ 865353 624813 578966 658161 710294 697616 657966 609505 678300 691267 575312 497599
20759D97599o188p4027L6147Q448o1053K6837J23250J74694K0342o729Q9479m9623
$$ 497599 491411 417384 453531 461979 400926 427763 551013 725707 746049 739320 828799 779176
20747G79176p4161N4147L1547j30169M6646L1517l1623J7655p726q3549l5945
$$ 779176 705015 759162 790709 660540 707186 738703 707080 724735 717009 633460 597515
20736E97515J8179J10524P0009L5275r0082Q390K2614N1462p6451m5374p9272
$$ 597515 615694 726218 796227 831502 741420 749810 772424 823886 747435 702061 622789
20725F22789r8392m3425J60484K36794l4103k8680K6280l8287J8388j13580k07578
$$ 622789 524397 480972 641456 878250 844147 815467 841747 803460 821848 708268 500690
20714E00690K0246Q8522Q7785J09964R5718L18m7432n2821n0246k1963m3263l6904
$$ 500690 520936 609458 697243 807207 902925 903243 855811 802990 752744 730781 687518 650614
20702F50614j257J4344k6483R9318k9078j08266j3593J51775J42421m8375p3485
$$ 650614 649357 663701 637218 736536 707458 599192 585599 737374 879795 831420 757935
20691G57935R3583K3370o3774q9916O41l0147L1974N1373l2131j9897J6941n1514
$$ 757935 851518 874888 811114 721198 721839 691692 723666 775039 742908 723011 739952 688438
20679F88438l8668J39039P4161N1269j05519L770O8233n1707o7748q3224P4346
$$ 688438 649770 788809 862970 914239 808720 812490 880723 829016 761268 678044 752390
20668G52390M5521J20703n707j56440j17107p254j8819O1346Q1800L1439j4602
$$ 752390 797911 918614 912907 756467 639360 632106 613287 674633 756433 787872 773270
20657G73270o5387N709k1271l4355N4630R4511J38096R7071l2703j35639j36842
$$ 773270 707883 713592 692321 657966 712596 807107 945203 1042274 1009571 873932 737090
20646G37090n5207O4252J16467l1367p140K6711J2732m9983r6647Q9189L2992
$$ 737090 681883 746135 862602 831235 824095 850806 863538 813555 716908 806097 839089
20635H39089M1305M381o0084L192n4580Q1665R9131j26399k6228k3286L7981m5214
$$ 839089 880394 884775 824691 827883 773303 854968 954099 827700 801472 778186 816167 770953
20623G70953n839Q3475P2112n2061r964o4697q4862J163l7785O6559J45087k9690
$$ 770953 765114 848589 920701 868640 858676 793979 709117 710280 672495 739054 884141 854451
20611H54451l8425m7508o9874q5887J16533J34416L531P5527M1370j9177j14439
$$ 854451 816026 768518 698644 612757 729290 863706 867237 942764 984134 964957 850518
20600H50518j15670k0980P573P8926K9301J5234m0058J9611L6996O3362P5294
$$ 850518 734848 713868 721441 800367 829668 844902 804844 824455 861451 924813 1000107
20589A000107m877m395M216j6840J16002N9263o4742l4771j13223q2661n425L5614
$$ 1000107 995230 990835 995051 978211 1094213 1153476 1088734 1053963 940740 858079 852654 888268
20577H88268j02544m0651J1392J4595J09721j0458j7111L0387k5011L6999J06281
$$ 888268 785724 745073 756465 771060 880781 870323 853212 883599 858588 895587 1001868
20566A001868l8187l3702J09524m7858n3628o3885K0761L2612n1777M8943N9157
$$ 1001868 963681 929979 1039503 991645 938017 874132 894893 927505 875728 924671 983828
20555I83828L9517j60454j04725J10593J03568J13686p7652m5162J29622k7929
$$ 983828 1023345 862891 758166 868759 972327 1086013 1008361 963199 1092821 1064892
20545A064892J01186k711j5206q9460n9938M3368J15525m857n9540j21744q4664
$$ 1064892 1166078 1163367 1148161 1058701 998763 1042131 1157656 1152799 1093259 971515 886851
20534H86851M4965m1884N5080J4241k7246J5445j81312m647J34030K8326n1188
$$ 886851 931816 889932 945012 959253 932007 947452 766140 761493 895523 923849 872661
20523H72661P8546M4705L3986P0326n193j00842l714L6050M4401n3293M7692j287
$$ 872661 951207 995912 1029898 1100224 1095031 994189 990475 1026525 1070926 1017633 1065325 1064038
20511A064038j33886M8562K34572J38037q1334l5611p7711p4626j16466l7175
$$ 1064038 930152 978714 1213286 1351323 1269989 1234378 1156667 1082041 965575 928400
20501I28400R9941M2285j563O6002j6005M2825M6897O043K5648k9671o5231m3794
$$ 928400 1028341 1070626 1069063 1135065 1119060 1161885 1208782 1214825 1240473 1210802 1145571 1101777
20489A101777k262j02874l6085R360N918k9586N1146N7072J05094r7963r5101
$$ 1101777 1099515 996641 960556 969916 975834 946248 997394 1054466 1159560 1061597 966496
20478I66496R8196j754M8820J34368L3466o31j1302l2163k3830M1779k7196l4733
$$ 966496 1064692 1062938 1111758 1246126 1279592 1278961 1267659 1235496 1211666 1253445 1226249 1191516
20466A191516M8474M8863o1728r5441J1684L4240L4933L1455o81K3416L3234n9134
$$ 1191516 1239990 1288853 1227125 1131684 1143368 1177608 1212541 1243996 1243315 1266731 1299965 1240831
20454A240831n2360j33285j53145J44076K76176M7019j45720o6840j188J24237
$$ 1240831 1188471 1055186 902041 1046117 1322293 1369312 1223592 1156752 1155564 1279801
20444A279801O4244L6517p2500j04417j02976n0903N1550J9186L0569P737l7690
$$ 1279801 1344045 1380562 1308062 1203645 1100669 1049766 1101316 1120502 1151071 1158808 1121118
20433A121118M9532j3241q2663j14838k7871M5751J02442J40422m9267j9960m936
$$ 1121118 1170650 1157409 1074746 959908 932037 977788 1080230 1220652 1171385 1151425 1146489
20422A146489k5733m6854N8689P3811j12740j00284M9386K1081K4037L4998M7390
$$ 1146489 1120756 1073902 1132591 1206402 1093662 993378 1042764 1063845 1087882 1122880 1170270
20411A170270P4437N7982N6818N6955M4028j58608j6534Q5657o9704j01249N700
$$ 1170270 1244707 1302689 1359507 1416462 1460490 1301882 1285348 1371005 1301301 1200052 1205752
20400A205752k3714n200M0432Q380l7217M8025K3834O9472K9560j6767N0330r6223
$$ 1205752 1182038 1176838 1217270 1225650 1188433 1236458 1260292 1329764 1359324 1342557 1392887 1296664
20388A296664l1927R5868M7367J26576O720j58692j70289L6510M5961M6460n297
$$ 1296664 1264737 1360605 1407972 1534548 1541268 1382576 1212287 1248797 1294758 1341218 1335921
20377A335921j13295J5616J634L8085P8639J07509J17815j550k10837m350K1504
$$ 1335921 1222626 1238242 1239876 1277961 1356600 1464109 1581924 1580374 1369537 1365187 1386691
20366A386691R2617K0798r036j2028o7442p2706m1955l004J873J6603n829P6375
$$ 1386691 1479308 1500106 1491070 1479042 1411600 1338894 1296939 1293935 1295808 1312411 1306582 1382957
20354A382957J8098K0906K9086q1849o2500J822k3502n8501L296R8726Q0328O3203
$$ 1382957 1401055 1421961 1451047 1369198 1306698 1308520 1285018 1226517 1229813 1328539 1408867 1472070
20342A472070J09882n6086j76740l4422O5138O8580O0530J1853N6289r3927n2214
$$ 1472070 1581952 1525866 1349126 1314704 1379842 1448422 1508952 1520805 1577094 1483167 1430953
20331A430953N4201J11258p785O7277P5012k02441m7283r7721m0061M6580N7600
$$ 1430953 1485154 1596412 1588627 1655904 1730916 1528475 1481192 1383471 1343410 1389990 1447590
20320A447590Q4575M7456k8622l3974p5328o5324O5206O6673j15943M2236k086
$$ 1447590 1532165 1579621 1550999 1517025 1441697 1376373 1441579 1508252 1392309 1434545 1432459
20309A432459k7082J11241M478L0426J02639O181M4080j57022m4282O3664L6864
$$ 1432459 1405377 1516618 1521096 1551522 1654161 1660342 1704422 1547400 1503118 1566782 1603646
20298A603646j0250j25329L0344j4715J2635J20049m8966j04108l7671J53554
$$ 1603646 1593396 1468067 1498411 1483696 1496331 1616380 1567414 1463306 1425635 1579189
20288A579189J42388L7403J5469j06606o7691l4112o3512m6213J31117N9884o5952
$$ 1579189 1721577 1758980 1774449 1667843 1600152 1566040 1502528 1456315 1587432 1647316 1581364
20277A581364r549n6577k0491K7685L1817O6052K2192k2562L5388k6142o0193
$$ 1581364 1571815 1515238 1494747 1522432 1554249 1620301 1642493 1619931 1655319 1629177 1568984
20266A568984L1908Q9193K6402j33478j07534l0927J45852r411K0010O2558j57698
$$ 1568984 1600892 1690085 1716487 1583009 1475475 1444548 1590400 1580989 1600999 1663557 1505859
20255A505859o5793K39444N9057m4573n1147M956M3885j10208K9357P2657K02426
$$ 1505859 1440066 1679510 1738567 1693994 1642847 1647803 1691688 1581480 1610837 1683494 1885920
20244A885920N5762j09910j38375J30384L4241L4997Q5209o1409p6400q9072L2559
$$ 1885920 1941682 1831772 1693397 1823781 1858022 1893019 1978228 1916819 1840419 1751347 1783906
20233A783906K9946l9247N76J81924N8616j1486j517j35659k0408p7976J7309
$$ 1783906 1813852 1774605 1775181 1957105 2015721 2004235 2002718 1867059 1846651 1768675 1785984
20222A785984K938L1711j15892q220J29126N3482j08625O2245R5394J32944L7269
$$ 1785984 1788922 1820633 1704741 1696521 1825647 1879129 1770504 1832749 1928143 2061087 2098356
20211B098356O907o045j00320j40561q59L0591J0199J2271J83722P195k74792
$$ 2098356 2105263 2099218 1998898 1858337 1857478 1888069 1898268 1910539 2094261 2101456 1826664
20200A826664n6769J16604J81038J11074N4569L8805j28598k6192N0114j38518
$$ 1826664 1769895 1886499 2067537 2178611 2233180 2271985 2143387 2117195 2167309 2028791
20190B028791m8097M6346L1802J40389J10648P4743P8974M1312J34866N2154n2453
$$ 2028791 1980694 2027040 2058842 2199231 2309879 2384622 2463596 2504908 2639774 2691928 2639475
20179B639475N5692N554Q0761J83382m1150j61124k4742k20980l12378m64934
$$ 2639475 2695167 2700721 2781482 2964864 2923714 2762590 2737848 2516868 2204490 1739556
20169A739556n02753k64699r4628R7725m8346k6055O0370K01600J88081K0615
$$ 1739556 1236803 972104 877476 975201 926855 900800 961170 1162770 1350851 1371466
20159A371466P6291n7544l5009L7490J09819J54520P3955m9476j07186J0865m496
$$ 1371466 1447757 1390213 1355204 1392694 1502513 1657033 1730988 1681512 1574326 1585191 1580695
20148A580695R1440k9536l0199P7406P6938M2433Q9872n6156q7588j21484J85599
$$ 1580695 1672135 1642599 1612400 1689806 1766744 1809177 1899049 1842893 1755305 1633821 1819420
20137A819420J88284R0231l2667r2846j66933m5423J4647O6044j00315N0769o466
$$ 1819420 2007704 2097935 2065268 1972422 1805489 1760066 1774713 1840757 1740442 1791211 1784745
20126A784745r6889j7210Q7247Q1993N6997j27266n2677q780Q2245L6087k104
$$ 1784745 1687856 1670646 1757893 1839886 1896883 1769617 1716940 1708160 1790405 1826492 1824388
20115A824388n0507K0331J1590P0693K4548n6839M9702L842O3468Q4488j9281
$$ 1824388 1773881 1794212 1805802 1876495 1901043 1844204 1893906 1897748 1961216 2045704 2026423
20104B026423N3403r0591m2916J8652L8867R6498n6822o2711k4840O6935m3342
$$ 2026423 2079826 1989235 1946319 1964971 2003838 2100336 2043514 1980803 1955963 2022898 1979556
20093A979556l9922M8757J0321M1004J4090j333o2515l1469O0809Q0240m9463
$$ 1979556 1939634 1988391 1998712 2039716 2053806 2052473 1989958 1958489 2019298 2099538 2050075
20082B050075J10846L4192N3961M6093m3977r4991K7870N8576j07915p480Q2798
$$ 2050075 2160921 2195113 2249074 2295167 2251190 2156199 2184069 2242645 2134730 2127250 2210048
20071B210048J51335L8071o7786Q157N0599J7547m6205j8779m978j60556k01505
$$ 2210048 2361383 2399454 2331668 2339825 2390424 2407971 2361766 2342987 2338009 2177453 1975948
20060A975948J16895K02469P6268n2325q3881L2093M4144O8767M372M7022N1935
$$ 1975948 2092843 2295312 2371580 2319255 2235374 2267467 2311611 2380378 2384750 2431772 2483707
20049B483707r4137j72273o8360N044N8765M6412O6222k9551k0980J8507j286
$$ 2483707 2389570 2217297 2148937 2153981 2212746 2259158 2325380 2295829 2274849 2293356 2292070
20038B292070n7029J00713K01808J02058O8918O4286p8821Q295n631j16645n5802
$$ 2292070 2235041 2335754 2537562 2639620 2708538 2772824 2694003 2702298 2696667 2580022 2524220
20027B524220M3379k2369R4611m8348j6104k9233j61532Q8062M0556n7873M3586
$$ 2524220 2567599 2545230 2639841 2591493 2575389 2546156 2384624 2472686 2513242 2455369 2498955
20016B498955M077q413J703Q0705J37400Q9835k1822j09007k6612M3953j08573
$$ 2498955 2503032 2494619 2496322 2577027 2714427 2804262 2782440 2673433 2646821 2690774 2582201
20005B582201j7026Q1245J79555N5024l1776p1875j59940O079Q6964R0501O4843
$$ 2582201 2565175 2646420 2825975 2880999 2849223 2777348 2617408 2623487 2710451 2800952 2865795
19994B865795O1581j0415n8161r4782j4540j6045j50644K1630K51448l1925l4549
$$ 2865795 2927376 2916961 2858800 2764018 2749478 2733433 2582789 2604419 2855867 2823942 2789393
19983B789393K675j85916j0643J40795Q3208m3808p0876M5691Q8369q2059o0332
$$ 2789393 2792068 2606152 2595509 2736304 2819512 2775704 2704828 2750519 2838888 2756829 2696497
19972B696497P1547K7563M8648J00653L9726l4147p2073n1021P87M1434M8762
$$ 2696497 2768044 2795607 2844255 2944908 2984634 2950487 2878414 2827393 2828180 2869614 2918376
19961B918376N7680j01661K4190N8024L6560M4885m8416q8350M6154m9243q5242
$$ 2918376 2976056 2874395 2898585 2956609 2993169 3038054 2989638 2901288 2947442 2898199 2812957
19950B812957N4527Q5584J37392J5631k6410j19227O8691J18809k8082Q4756J53260
$$ 2812957 2867484 2953068 3090460 3106091 3079681 2960454 3029145 3147954 3119872 3204628 3357888
19939C357888r2745j90635p04O4281J06747Q0819R917l9379M469m2425m5380r8708
$$ 3357888 3265143 3074508 3073804 3138085 3244832 3325651 3335568 3296189 3300658 3258233 3212853 3114145
19927C114145n3511L0541O7272R7459Q6139R8521J4534K2160L0827J54120P8172
$$ 3114145 3060634 3091175 3158447 3255906 3342045 3440566 3455100 3477260 3508087 3662207 3740379
19916C740379k3106q6289q5717N3303L2722j18639M7796n7875j22239O1764J50570
$$ 3740379 3717273 3630984 3545267 3598570 3631292 3512653 3560449 3502574 3380335 3442099 3592669
19905C592669J02972j26388j7126K4515k0025K170m5642K6007N9957J36370q9172
$$ 3592669 3695641 3569253 3552127 3576642 3556617 3558787 3513145 3539152 3599109 3735479 3646307
19894C646307r5782N0554M4728j1922N0906P5769M5417q0812o3192K9275k9342
$$ 3646307 3550525 3601079 3645807 3633885 3684791 3760560 3805977 3725165 3661973 3691248 3661906
19883C661906k262J25303P1962m1375O2682j42958j01766K5209J06172J86761
$$ 3661906 3659644 3784947 3856909 3815534 3878216 3735258 3633492 3658701 3764873 3951634
19873C951634M0240o1952Q193J3717l9217q0781O9467N33K8884p878j4576M6054
$$ 3951634 3991874 3929922 3938115 3951832 3912615 3831834 3901301 3901834 3930718 3922840 3908264 3954318
19861C954318M763J9102L4352o6350k0632J72041N7251j4329q8283J09564O6881
$$ 3954318 3959081 3978183 4012535 3946185 3925553 4097594 4154845 4140516 4052233 4161797 4228678
19850D228678R2332k2021K3092J22852m3836J29730N6394r992L9663o0102l6686
$$ 4228678 4321010 4298989 4322081 4444933 4401097 4530827 4587221 4577229 4616892 4556790 4520104
19839D520104r3537k3598J5349J13900J06968J8838q8562p0775M1062J18551n6152
$$ 4520104 4426567 4402969 4418318 4532218 4639186 4658024 4569462 4498687 4539749 4658300 4602148
19828D602148p8705j2522J13996L6329j3037P798P470l6132Q2608N2857J1525
$$ 4602148 4523443 4510921 4624917 4661246 4648209 4656007 4663477 4627345 4709953 4762810 4774335
19817D774335J09136M8598n7192Q4608J27377N4806l8141j61121j5198p9466M8716
$$ 4774335 4883471 4932069 4874877 4959485 5086862 5141668 5103527 4942406 4927208 4847742 4896458
19806D896458J47157K4741m5402n4750m9751N8813M0897N4322K6696k644J69961
$$ 4896458 5043615 5068356 5022954 4968204 4918453 4977266 5018163 5072485 5099181 5096537 5266498
19795E266498J70491m5865k8135P8365O0871O1367j18597J2185J30176J01013
$$ 5266498 5436989 5391124 5362989 5441354 5502225 5563592 5444995 5457180 5587356 5688369
19785E688369Q577j8856j21152N7545J36410J12182J55891M8042j23112r0739
$$ 5688369 5696946 5678090 5556938 5614483 5750893 5863075 6018966 6067008 5943896 5853157
19775E853157K9421P9765R6299K9906j3281L2026J29835R8732j6770o4032j6708
$$ 5853157 5882578 5962343 6058642 6088548 6075267 6107293 6237128 6335860 6319090 6255058 6238350
19764F238350o8504j1392J11204J9479R2223O7964R271l5288L3819o6992p2888
$$ 6238350 6169846 6158454 6269658 6289137 6381360 6449324 6458595 6423307 6457126 6390134 6317246
19753F317246R9209M5596N2103O5444N2510Q7359P1826J9761n8063M3848R2021
$$ 6317246 6416455 6462051 6514154 6579598 6632108 6719467 6791293 6811054 6752991 6796839 6888860
19742F888860O7789J01789J4890n7606k200P0694J41703K5935K2473O8934Q3150
$$ 6888860 6956649 7058438 7073328 7015722 7013522 7084216 7225919 7251854 7274327 7343261 7426411
19731G426411J59996J17313J00795k9546J7865k3788R235J92716J40791p2800
$$ 7426411 7586407 7703720 7804515 7774969 7792834 7769046 7778281 7970997 8111788 8038988
19721H038988L992J13112o0803k7717J68933L2762M1886J07529J28141R3530J14783
$$ 8038988 8042980 8156092 8095289 8067572 8236505 8269267 8311153 8418682 8546823 8640353 8755136
19710H755136j12630j10083J81386n3233J04404R2474O4035j11585j9893K5574
$$ 8755136 8642506 8532423 8713809 8660576 8764980 8857454 8921489 8809904 8790011 8815585
19700H815585M0299Q4098M3107P6531P336Q7308J46160N4710N1677N4306J35494
$$ 8815585 8855884 8939982 8983089 9059620 9066956 9154264 9300424 9355134 9406811 9461117 9596611
19689I596611K19325J76433K7953Q5043J20087J21161J24692P6952J63760M1372
$$ 9596611 9815936 9992369 10020322 10105365 10225452 10346613 10471305 10548257 10712017 10753389
19679A0753389K0428K81242J49638j0040R3309N9430J89499J83740J11075J46992
$$ 10753389 10773817 11055059 11204697 11194657 11287966 11347396 11536895 11720635 11831710 11978702
19669A1978702J53798J63556J41957J8790J36545K59084Q3314J30824L98148K10125
$$ 11978702 12132500 12296056 12438013 12456803 12593348 12852432 12935746 13066570 13464718 13674843
19659A3674843R2791K40943L15959L9230J16320J43191J16734J51778J40579K77969
$$ 13674843 13767634 14008577 14324536 14363766 14480086 14623277 14740011 14891789 15032368 15310337
19649A5310337K65754K52643J21145J89683K73094L01837L32868K25200J99292
$$ 15310337 15576091 15828734 15949879 16139562 16412656 16714493 17047361 17272561 17471853
19640A7471853L50858K94056J02664J90417p1281j63774n9423J08125J86831L74591
$$ 17471853 17822711 18116767 18219431 18409848 18338567 18174793 18115370 18223495 18410326 18784917
19630A8784917N44949M69224M19134N50162N24141L16955M17237N62155O03016
$$ 18784917 19329866 19799090 20218224 20768386 21292527 21609482 22026719 22588874 23191890
19621B3191890N66480M31498O24785P13551O90738O83656O39778P39095M19232
$$ 23191890 23758370 24189868 24814653 25528204 26218942 26902598 27542376 28281471 28700703
19612B8700703J85982J92588L73665O55108Q96985J003010J063108J269288J091252
$$ 28700703 28886685 29079273 29452938 30108046 31005031 32008041 33071149 34340437 35431689
19603C5431689P72636Q32289J238580J617347J667084J781783J985002J968959
$$ 35431689 36204325 37036614 38275194 39892541 41559625 43341408 45326410 47295369
19595D7295369K119034K279292K562981K864176L186284L380890L624735M116028
$$ 47295369 49414403 51693695 54256676 57120852 60307136 63688026 67312761 71428789
19587G1428789M720249M915628N072328N305995N854763O230696O614237O970119
$$ 71428789 76149038 81064666 86136994 91442989 97297752 103528448 110142685 117112804
19579A17112804P747493Q395743P985839N121033j789842j2076941k6138122m9352033
$$ 117112804 124860297 133256040 141241879 146362912 144573070 132496129 106358007 57005974
19571E7005974p9066062q9398244o0355536j9269408P779746J7586810J8003129
$$ 57005974 -22060088 -111458332 -171813868 -191083276 -183303530 -165716720 -147713591
19564a47713591J5497204J2782130J0734774R270858P918999O799840N891984
$$ -147713591 -132216387 -119434257 -108699483 -99428625 -91509626 -84709786 -78817802
19557g8817802N210242M641136M129534L601252L157888K950863K729129K486705
$$ -78817802 -73607560 -68966424 -64836890 -61235638 -58077750 -55126887 -52397758 -49911053
19549d9911053K279224J958790J693163J686890J611334J620817J436412J330012
$$ -49911053 -47631829 -45673039 -43979876 -42292986 -40681652 -39060835 -37624423 -36294411
19541c6294411J244191J178188J116413J114375Q24721M74800N53856Q86337R51453
$$ -36294411 -35050220 -33872032 -32755619 -31641244 -30816523 -30341723 -29787867 -28901530 -27950077
19532b7950077Q56598N86874M18663K91794Q5186K02604L68671N35460N72874
$$ -27950077 -27093479 -26506605 -26087942 -25796148 -25710962 -25508358 -25139687 -24604227 -24031353
19523b4031353N42499N41582M25018O21714N24638M18594M85633M82159N32416
$$ -24031353 -23488854 -22947272 -22522254 -21900540 -21375902 -20957308 -20471675 -19989516 -19457100
19514a9457100M27920L79412L38412L15131M56319K33759J64661j04j45206k07128
$$ -19457100 -19029180 -18649768 -18311356 -17996225 -17539906 -17306147 -17141486 -17141590 -17286796 -17493924
19504a7493924j06385J29170K10447K57695K67131K29591M81645L50797K62598
$$ -17493924 -17600309 -17471139 -17260692 -17002997 -16735866 -16506275 -16024630 -15673833 -15411235
19495a5411235L92222K80726J49723Q5262K12911K91150K04939K02682J99183
$$ -15411235 -15019013 -14738287 -14588564 -14503302 -14290391 -13999241 -13794302 -13591620 -13392437
19486a3392437J95769J50038K00657J77879o756J90038J70567J57255J12653J47317
$$ -13392437 -13196668 -13046630 -12845973 -12668094 -12674850 -12484812 -12314245 -12156990 -12044337 -11897020
19476a1897020J67456Q5484J26077J73291N7841J56213P9976N7195l2152P9925
$$ -11897020 -11729564 -11644080 -11518003 -11344712 -11286871 -11130658 -11050682 -10993487 -11025639 -10945714
19466a0945714J37752K06334J81270J59099J57734J09119N6700O0241j1113R1143
$$ -10945714 -10807962 -10601628 -10420358 -10261259 -10103525 -9994406 -9937706 -9877465 -9888578 -9797435
19456i797435O7721J83318J26385o67j0631Q1701O3440Q658K0633J23367J11517
$$ -9797435 -9729714 -9546396 -9420011 -9420678 -9431309 -9349608 -9286168 -9277510 -9256877 -9133510 -9021993
19445i021993N2696m0971o3307k0932L6474K64240l8966O2537K00255J42472J65580
$$ -9021993 -8969297 -9010268 -9073575 -9094507 -9058033 -8793793 -8832759 -8770222 -8569967 -8427495 -8261915
19434h261915J58027m5567j7565J10200K32323O2748j18346l0621J58937L7091
$$ -8261915 -8103888 -8149455 -8167020 -8056820 -7824497 -7761749 -7880095 -7910716 -7751779 -7714688
19424g714688J31134K0479J42426J68221o1584n062J5285L9431R8449R1564J4999
$$ -7714688 -7583554 -7563075 -7420649 -7252428 -7314012 -7319074 -7303789 -7264358 -7165909 -7074345 -7059346
19413g059346R8114J92385m4072j00465J8048l6036j10212J61532Q7104j3262
$$ -7059346 -6961232 -6768847 -6812919 -6913384 -6895336 -6931372 -7041584 -6880052 -6792948 -6806210
19403f806210M4444m946M4882J3888J48600J97759K5476n9196k7439M1959K1410
$$ -6806210 -6761766 -6766712 -6721830 -6707942 -6559342 -6361583 -6336107 -6395303 -6422742 -6380783 -6359373
19392f359373K9934O5217Q7537M620O0681J41563O7041J2574r3542l581Q6525
$$ -6359373 -6329439 -6264222 -6176685 -6172065 -6111384 -5969821 -5902780 -5890206 -5983748 -5987329 -5900804
19381e900804J8047P7861J86705Q2531r6129j0259j21482k5371J22261J50278
$$ -5900804 -5882757 -5804896 -5618191 -5535660 -5631789 -5642048 -5763530 -5788901 -5666640 -5516362
19371e516362j1684j21050N5630L6049L6807M6946J95985J49447k2595n618k5152
$$ -5516362 -5528046 -5649096 -5593466 -5557417 -5520610 -5473664 -5277679 -5128232 -5150827 -5156445 -5181597
19360e181597P8579J16071K5214n7617K05268K06446p2096m3070o5260R8542J63833
$$ -5181597 -5103018 -4986947 -4961733 -5019350 -4814082 -4607636 -4679732 -4722802 -4788062 -4689520 -4525687
19349d525687r5112k44322K1948Q6561l0194L575M3332J3036j3042n2178J13490
$$ -4525687 -4620799 -4865121 -4843173 -4756612 -4786806 -4783231 -4739899 -4726863 -4739905 -4792083 -4678593
19338d678593k3636k9430m7351P8073J57578P4044j37341M9269K13339P8912L0800
$$ -4678593 -4702229 -4731659 -4779010 -4700937 -4543359 -4469315 -4606656 -4557387 -4344048 -4265136 -4234336
19327d234336p662k5275J0122R6490m4053k3247P7445m4753l6727m7851l6763
$$ -4234336 -4241998 -4267273 -4257151 -4160661 -4204714 -4227961 -4150516 -4195269 -4231996 -4279847 -4316610
19316d316610k7575Q1426M2906P92J16687J13508j4651o7071r6263N2780p2047
$$ -4316610 -4344185 -4262759 -4219853 -4219061 -4102374 -3988866 -4003517 -4070588 -4166851 -4114071 -4186118
19305d186118n6242J40876R1963O2824k8165m0525l2846p9027n218K5500L7208
$$ -4186118 -4242360 -4101484 -4009521 -3946697 -3974862 -4015387 -4048233 -4127260 -4132478 -4106978 -4069770
19294d069770K17376Q4168l1609j9518J17896J07260m0582n3775l2538n9759o8066
$$ -4069770 -3852394 -3768226 -3799835 -3819353 -3701457 -3594197 -3634779 -3688554 -3721092 -3780851 -3848917
19283c848917O5603O6066M5485P3165N8507J6203k6142J53979N5634j12809j29125
$$ -3848917 -3783314 -3717248 -3671763 -3598598 -3540091 -3523888 -3550030 -3396051 -3340417 -3453226 -3582351
19272c582351P3308L7149k7878o1575N4061M7148M8833J04708L0879K2704n5768
$$ -3582351 -3509043 -3471894 -3499772 -3561347 -3507286 -3460138 -3411305 -3306597 -3275718 -3253014 -3308782
19261c308782r1737r0308P1432O9653R5333Q1150k12664j23513R3583m976q516
$$ -3308782 -3400519 -3490827 -3419395 -3349742 -3254409 -3173259 -3385923 -3509436 -3415853 -3420829 -3429345
19250c429345J61722J07233q2240n2513J33905J16708n5589j78444j04919L6242
$$ -3429345 -3267623 -3160390 -3242630 -3295143 -3161238 -3044530 -3100119 -3278563 -3383482 -3347240
19240c347240O6523J27347Q6049M6413Q7476J5083o5318l6801j6391n2688K2361
$$ -3347240 -3280717 -3153370 -3067321 -3020908 -2933432 -2918349 -2983667 -3020468 -3036859 -3089547 -3067186
19229c067186J5797J4030N4290K2666j4744K1346k3913Q7702J99600J01084L0910
$$ -3067186 -3051389 -3037359 -2983069 -2960403 -2975147 -2953801 -2977714 -2890012 -2690412 -2589328 -2558418
19218b558418j63325n3225O8033k3064o9984p955l029M1590k4721J22213o9394
$$ -2558418 -2721743 -2774968 -2706935 -2729999 -2799983 -2807938 -2810967 -2769377 -2794098 -2671885 -2741279
19207b741279r24N7083N300Q037K6228M5383J6630J41942N0358J7850p7062l9830
$$ -2741279 -2742203 -2685120 -2679820 -2671783 -2645555 -2600172 -2583542 -2441600 -2391242 -2373392 -2450454 -2490284
19195b490284N3303l192L5922l660n1873j8706M4116o0656n0317L0071m9392n0900
$$ -2490284 -2436981 -2440173 -2404251 -2407911 -2459784 -2478490 -2434374 -2495030 -2545347 -2515276 -2564668 -2615568
19183b615568J51195K27234j16918j28348p3402J11383Q3225M2100l0407n5550
$$ -2615568 -2464373 -2237139 -2354057 -2482405 -2555807 -2444424 -2361199 -2319099 -2349506 -2405056
19173b405056J16170P8943j02200m1432K4532L8482O3123k4808O9479N9386j3591
$$ -2405056 -2288886 -2209943 -2312143 -2353575 -2329043 -2290561 -2227438 -2252246 -2182767 -2123381 -2136972
19162b136972J4722K8644M9638m6960m0496m9875j25804J75486K95179j65672
$$ -2136972 -2122250 -2093606 -2043968 -2090928 -2131424 -2181299 -2307103 -2131617 -1836438 -2002110
19152b002110k68364J01735J65636p1777M565j9690j5997P1594J15080N9124J0502
$$ -2002110 -2270474 -2168739 -2003103 -2074880 -2070315 -2090005 -2106002 -2034408 -1919328 -1860204 -1849702
19141a849702P4983n9773j04906O9561J05076O3529l3575n4262R8830N3802R0036
$$ -1849702 -1774719 -1834492 -1939398 -1869837 -1764761 -1701232 -1734807 -1789069 -1690239 -1636437 -1546401
19130a546401k373j9058Q9322m8220l5012J9403k1262P8975L0144k2800j6316
$$ -1546401 -1548774 -1567832 -1478510 -1526730 -1561742 -1542339 -1563601 -1484626 -1454482 -1477282 -1493598
19119a493598l6993K034R0286J2393n0826K5702N0061J3343r2042k8819K13478
$$ -1493598 -1530591 -1528557 -1438271 -1425878 -1476704 -1451002 -1400941 -1387598 -1479640 -1508459 -1294981
19108a294981J54806M5776L1913k867o136O5280j323r7490p4904O678J04871l070
$$ -1294981 -1140175 -1094399 -1062486 -1065353 -1071489 -1006209 -1007532 -1105022 -1179926 -1173248 -1068377 -1071447
19096a071447J25235J89951J07628L909J64885J21574J04490R7134K02326O3737
$$ -1071447 -946212 -756261 -648633 -644724 -479839 -358265 -253775 -156641 45685 109422
19086A09422J36226J33242K77663K00381K39513J80272P2086J09636R7070k87563
$$ 109422 245648 378890 656553 856934 1096447 1276719 1348805 1458441 1555511 1267948
19076A267948o86991j029676j486364j750626j434913q73939j44688K48273M89148
$$ 1267948 580957 -448719 -1935083 -3685709 -5120622 -5994561 -6139249 -5890976 -5401828
19067e401828L97998L24529L41257K39529J99886R1422L6705J70276J55403J08461
$$ -5401828 -5003830 -4679301 -4338044 -4098515 -3898629 -3807207 -3770502 -3600226 -3444823 -3336362
19057c336362R1752J15361R2632Q1272k0088j0643k5002J33049J60004R2879L9409
$$ -3336362 -3244610 -3129249 -3036617 -2955345 -2975433 -2986076 -3011078 -2878029 -2718025 -2625146 -2585737
19046b585737m0036L828l9353p056K7138J42511J57327R4433j7534K4366j06461
$$ -2585737 -2625773 -2621945 -2661298 -2668354 -2641216 -2498705 -2341378 -2246945 -2264479 -2240113 -2346574
19035b346574J6910O9604k7545l0079M1783J42355J49713j09531j75738R664J5690
$$ -2346574 -2329664 -2260060 -2287605 -2317684 -2275901 -2133546 -1983833 -2093364 -2269102 -2259438 -2243748
19024b243748p6639R3881J36839J16723K6177r061p9633J6802n7647o6531J02608
$$ -2243748 -2320387 -2226506 -2089667 -1972944 -1946767 -1955828 -2035461 -2018659 -2076306 -2142837 -2040229
19013b040229P572O1255j08j9683R420J41756N9531j8861P040P7588j2878j12384
$$ -2040229 -2032657 -1971402 -1971510 -1991193 -1981773 -1840017 -1780486 -1799347 -1792307 -1714719 -1727597 -1839981
19001a839981k6658J38164O2640m4919j42532n2616k6849N0880L4799N3674J38390
$$ -1839981 -1866639 -1728475 -1665835 -1710754 -1853286 -1905902 -1932751 -1881871 -1847072 -1793398 -1655008
18990a655008M6688j9305r0510J00602R7100N9065J50422L5155P8667j3476p3071
$$ -1655008 -1608320 -1627625 -1718135 -1617533 -1520433 -1461368 -1310946 -1275791 -1197124 -1210600 -1283671
18979a283671k9547R5233k8944J01925N9384K0631J27249J22434p3630j10377
$$ -1283671 -1313218 -1217985 -1246929 -1145004 -1085620 -1064989 -937740 -815306 -888936 -999313
18969i99313K5149j0130k3789k9240k38145m65501n18104k77988j44994J12241
$$ -999313 -974164 -984294 -1008083 -1037323 -1275468 -1740969 -2259073 -2537061 -2682055 -2569814
18959b569814P3318J00027J39252J58019q9738P197K2811J29786J20326L2802
$$ -2569814 -2496496 -2396469 -2257217 -2099198 -2188936 -2181739 -2158928 -2029142 -1908816 -1876014
18949a876014n354N9338K2225q0040j09190j21116j04896n0142M6087Q3907K25029
$$ -1876014 -1881368 -1822030 -1799805 -1879845 -1989035 -2110151 -2215047 -2265189 -2219102 -2135195 -1910166
18938a910166J59746k3437l2985j15658K7130k2903K7445J0931Q2262Q6657N7318
$$ -1910166 -1750420 -1773857 -1806842 -1922500 -1895370 -1918273 -1890828 -1879897 -1797635 -1710978 -1653660
18927a653660J05068Q1301p9441l3901J25035L7505j03165K2409p5865j3811J15751
$$ -1653660 -1548592 -1467291 -1546732 -1580633 -1455598 -1418093 -1521258 -1498849 -1574714 -1588525 -1472774
18916a472774K164j7471n859m4713j32920k4052N4785o648J14842O0480M1905
$$ -1472774 -1470610 -1488081 -1493940 -1538653 -1671573 -1695625 -1640840 -1647488 -1532646 -1472166 -1430261
18905a430261J02527K9434J05777k9409j77547n592j8867l3516R124M3309P7170
$$ -1430261 -1327734 -1298300 -1192523 -1221932 -1399479 -1405071 -1423938 -1457454 -1448330 -1405021 -1327851
18894a327851o0770j03209R1174K07974j2890q8523j45309o2172K0282J37319
$$ -1327851 -1388621 -1491830 -1400656 -1192682 -1205572 -1294095 -1439404 -1501576 -1481294 -1343975
18884a343975O1672j17281o4639R7434N9493j4041L9274Q5646r9755j75514j14155
$$ -1343975 -1282303 -1399584 -1464223 -1366789 -1307296 -1321337 -1282063 -1196417 -1296172 -1471686 -1585841
18873a585841J9776N9392K6768J06948J25420J4630N1132r5769j02909j20307
$$ -1585841 -1566065 -1506673 -1479905 -1372957 -1247537 -1232907 -1181775 -1277544 -1380453 -1500760
18863a500760J3499K3544O4937l3925k4503N0645J33953l0097k2040J3847l5146
$$ -1500760 -1487261 -1463717 -1398780 -1432705 -1457208 -1406563 -1272610 -1302707 -1324747 -1310900 -1346046
18852a346046J9293Q7545J31258m5867j0517M6617J2922j06064P5860L1878q5548
$$ -1346046 -1326753 -1239208 -1107950 -1153817 -1164334 -1117717 -1104795 -1210859 -1134999 -1103121 -1188669
18841a188669n5859K7422P2461j07243K1990J81253j5795j57704J5346K6912J67427
$$ -1188669 -1244528 -1217106 -1144645 -1251888 -1229898 -1048645 -1064440 -1222144 -1206798 -1179886 -1012459
18830a012459j2383r8125N3452k4251P3546L46j4561k3185m3022K0359j12942
$$ -1012459 -1024842 -1122967 -1069515 -1093766 -1020220 -1019874 -1034435 -1057620 -1100642 -1080283 -1193225
18819a193225N8870N3767n4849K3596O815O0610Q2925P433o1236r8144m1009J62443
$$ -1193225 -1134355 -1080588 -1135437 -1111841 -1105026 -1044416 -961491 -954058 -1015294 -1113438 -1154447 -992004
18807i92004J20191m3849N748m6403L6432p2381o3268M8849J48034R733k2592
$$ -992004 -871813 -915662 -909914 -956317 -919885 -992266 -1055534 -1006685 -858651 -848918 -871510
18796h71510p95J20816l7798M5937m9032j06101m3212n3583J94308k3211k13318
$$ -871510 -872305 -751489 -789287 -743350 -792382 -898483 -941695 -995278 -800970 -824181 -1037499
18785a037499j64657o464J46435O8988L1635J32561k117q0904m9959j7434R9113
$$ -1037499 -1202156 -1208620 -1062185 -993197 -961562 -829001 -831118 -912022 -961981 -979415 -880302
18774h80302J76971J88419N0290N5193j8644m9360j23071j61173k078j54820l45674
$$ -880302 -703331 -514912 -464622 -409429 -428073 -477433 -600504 -761677 -763755 -918575 -1264249
18763a264249k05514r6902J48417K11030J21718J09096L9814j3898J02510J82097
$$ -1264249 -1469763 -1566665 -1418248 -1207218 -1085500 -976404 -936590 -950488 -847978 -665881
18753f65881n240j01949n9145k3674j5742p7662n9164q2017L46Q9718n193N0247
$$ -665881 -671121 -773070 -832215 -855889 -871631 -949293 -1008457 -1090474 -1090128 -1000410 -1005603 -955356
18741i55356p3931L7936J31035P509p3962O9541k9666m1696P337P0061R3636N5832
$$ -955356 -1029287 -991351 -860316 -852807 -926769 -857228 -886894 -928590 -921253 -851192 -757556 -701724
18729g01724o4544l8930j5475M752m0988r6315L189K1494J06707o035P0816P10
$$ -701724 -766268 -805198 -820673 -815921 -856909 -953224 -950035 -928541 -821834 -827869 -757053 -756343
18717g56343l7193l0750p9364N5841J41791o041R6457J2920m1242R494l2389o2859
$$ -756343 -793536 -824286 -903650 -847809 -706018 -712059 -615602 -602682 -643924 -634430 -666819 -729678
18705g29678J3015n4269p4439L7806j08934J01799K40833M2834L3451j10563j41697
$$ -729678 -716663 -770932 -845371 -807565 -916499 -814700 -573867 -531033 -497582 -608145 -749842
18694g49842K3399m13n3183j39938J9513r694P1703J68456K3645M0020m7229j4438
$$ -749842 -726443 -726856 -780039 -919977 -900464 -910158 -838455 -669999 -646354 -606334 -653563 -668001
18682f68001L8580N2665L4683j1513K7151O3929J10264N4015r9120j74432r5892
$$ -668001 -629421 -576756 -542073 -553586 -526435 -462506 -352242 -298227 -397347 -571779 -667671
18671f67671K0013n8754M8248j7230M7169j04746n1937Q4690L6313l4083j2957
$$ -667671 -647658 -706412 -658164 -675394 -628225 -732971 -784908 -700218 -663905 -697988 -710945
18660g10945K18069K08765l753j03845o7665l2147l8987q3131o6191J412p8066
$$ -710945 -492876 -284111 -287864 -391709 -459374 -491521 -530508 -613639 -679830 -678418 -756484
18649g56484k18j6855M2277K9799K0897L7047o0298Q6352J32634p312r4547L0137
$$ -756484 -756702 -773557 -731280 -701481 -680584 -643537 -703835 -617483 -484849 -492161 -586708 -556571
18637e56571Q0858k94l5769j5646o3077o6214m8095M7490j0456J33377J05672
$$ -556571 -475713 -476007 -511776 -527422 -590499 -656713 -704808 -657318 -667774 -534397 -428725
18626d28725m2396J6233L1887n3j1465n2694q1687O5489M1439K3562J53548m6277
$$ -428725 -471121 -454888 -423001 -423054 -434519 -487213 -568900 -503411 -461972 -438410 -284862 -331139
18614c31139j27667P777K3544J57131R2721J15k2177N7126j35356j60483N0729
$$ -331139 -458806 -451029 -427485 -270354 -177633 -177518 -199695 -142569 -277925 -438408 -387679
18603c87679J16718N7390r4866r8468n3271R8956k2276K6636o0349q7714P775
$$ -387679 -270961 -213571 -308437 -406905 -460176 -361220 -383496 -356860 -417209 -504923 -497148
18592d97148K0175J74529M6550r1113o1356O317J20915J47714n9791p3255j2374
$$ -497148 -476973 -302444 -255894 -347007 -408363 -402046 -281131 -133417 -193208 -266463 -278837
18581b78837o4551o618O3780J50625J30281j19177o0576P5736L1118l3534K2926
$$ -278837 -343388 -350006 -286226 -135601 -5320 -124497 -185073 -109337 -78219 -111753 -88827
18570h8827n6181K9945r1040n8171J23171J28288J9589o8113k6573k5270j39951
$$ -88827 -145008 -115063 -206103 -264274 -141103 -12815 6774 -61339 -87912 -113182 -253133
18559b53133m3814J250J09437J38864O3396O156p6653j0567l0136M4185N7592
$$ -253133 -296947 -295697 -186260 -47396 16000 22156 -54497 -65064 -95200 -51015 6577
18548F577M0480k0126n2868p004j20584J04064O1552K2932L1101j7960l3571r0578
$$ 6577 47057 26931 -25937 -32941 -153525 -49461 12091 35023 66124 48164 14593 -75985
18536g5985p4200j0975j5655K7946M6187k0511l7622J15107O8979l1430K7650
$$ -75985 -150185 -161160 -176815 -148869 -102682 -123193 -160815 -45708 23271 -8159 19491
18525A9491k2018o5797n1108R288r165k9064k9659M1778P0686k5863j5831Q0075
$$ 19491 -2527 -68324 -119432 -110144 -119309 -148373 -178032 -136254 -65568 -91431 -107262 -27187
18513b7187M2480j23534j3507L9807O8153P6465K7605k724P6976q8901Q77Q1529
$$ -27187 15293 -108241 -121748 -81941 -13788 62677 90282 87558 164534 75633 76510 158039
18501A58039P5164N4676J04422j03030r4205o5654P2872Q6368M7997P8677j39366
$$ 158039 233203 287879 392301 289271 195066 129412 202284 288652 336649 415326 275960
18490B75960o4890Q6898p6181l3679p0046J0708R0171o6138P3792M8125O7792
$$ 275960 211070 297968 221787 188108 118062 128770 218941 152803 226595 274720 342512
18479C42512j5151o6874K0878L9881r666M7835j8511l3306M3265L6523k9174P2
$$ 342512 327361 260487 281365 321246 311580 359415 340904 307598 350863 387386 358212 358284
18467C58284N2887j9499n7050j6294L3525j7062m9026P8578J08173M6369j6053
$$ 358284 411171 391672 334622 318328 351853 334791 285765 364343 472516 518885 502832
18456E02832p8858l1923q1116J7019J33363P4929K108P2680r871k9331q7943q7090
$$ 502832 423974 392051 310935 327954 461317 536246 538354 611034 601163 571832 483889 396799
18444C96799j0725P8841K1419j5663K6408R9879M316M3506J74403L5419k2229
$$ 396799 386074 464915 486334 470671 497079 596958 601274 644780 819183 854602 832373
18433H32373j24536o3748J1511N311R5945o6726j15178j14207J21452O5538k9662
$$ 832373 707837 644089 655600 660911 756856 690130 574952 460745 582197 647735 618073
18422F18073M4676L9572k4170k2886j34141p3281l384P6402P9087N2508M1362
$$ 618073 662749 702321 678151 655265 521124 447843 444459 520861 599948 652456 693818
18411F93818J550j6306K9095R6983J20184J11825J03781n1070l5547J34257k4533
$$ 693818 695368 679062 708157 805140 925324 1037149 1140930 1089860 1054313 1188570 1164037
18400A164037k9680P7435J28799J4005O8450n1175q6774j44216p3780l8755r4763
$$ 1164037 1134357 1211792 1340591 1354596 1423046 1371871 1285097 1140881 1067101 1028346 933583
18389I33583k11154k82831k49634j52776j50445N1489l1471m0444j07777p4378
$$ 933583 722429 439598 189964 37188 -113257 -61768 -93239 -133683 -241460 -315838
18379c15838p6315O6524J1705N2425J36416J26929J3193k6232o1632J45491J32315
$$ -315838 -392153 -325629 -313924 -261499 -125083 1846 15039 -11193 -72825 72666 204981
18368B04981Q6399P9309O8161R236Q747j8777K9862P7892P7042P4764l7430n6187
$$ 204981 291380 370689 438850 448086 456833 438056 467918 545810 622852 697616 660186 603999
18356F03999o7580n4295M9836N5833Q2095J3722j4643q9092l6276K5164Q9523
$$ 603999 536419 482124 531960 587793 669888 683610 668967 579875 543599 568763 658286
18345F58286J32647n5594M479Q3672k2458n9053M0974J08269K8903k8455m9428
$$ 658286 790933 735339 739818 823490 801032 741979 782953 891222 920125 891670 842242
18334H42242K3438M2579K3739j02463L0170N8477r501L7289K3087P0635K3585
$$ 842242 865680 908259 931998 829535 859705 918182 908681 945970 969057 1039692 1063277
18323A063277r9804N1422N6951q9586o1606k2647J00235J34915R2963J6991n6868
$$ 1063277 963473 1014895 1071846 982260 920654 898007 998242 1133157 1226120 1243111 1186243
18312A186243q8227k9952J00575M0245k363q7379l4002L9905j716J1674J13367
$$ 1186243 1098016 1068064 1168639 1208884 1206521 1119142 1085140 1125045 1123329 1135003 1248370
18301A248370N6435l1614P755K605J34319J11295J2044n3291n8368j14396j8312
$$ 1248370 1304805 1273191 1280946 1283551 1417870 1529165 1541209 1487918 1429550 1315154 1296842
18290A296842J03850o400J04579L2437j4003j1491m1104M3890M680J14085P714
$$ 1296842 1400692 1394292 1498871 1531308 1517305 1505814 1464710 1508600 1513280 1627365 1635079
18279A635079j5317M9586J856J2272J10273J52929R7870N5674j3062k2613o3298
$$ 1635079 1619762 1669348 1671204 1683476 1793749 1946678 2044548 2100222 2087160 2064547 2001249
18268B001249L3442N5931j2046r5383K7837K6626O8488J29685N3425J02935m4050
$$ 2001249 2034691 2090622 2078576 1983193 2011030 2037656 2106144 2235829 2289254 2392189 2348139
18257B348139P9256J32451m8562L5894r799j59673r4671K0863O9380L4300K3175
$$ 2348139 2427395 2559846 2511284 2547178 2537379 2377706 2283035 2303898 2373278 2407578 2430753
18246B430753J0833n068L6507L9155P0706N0723m5207j21253N7818j29979j46177
$$ 2430753 2441586 2436518 2473025 2512180 2582886 2633609 2588402 2467149 2524967 2394988 2248811
18235B248811L1064J09662K00559L00877J21350q0905j07041j06896L8571J47265
$$ 2248811 2279875 2389537 2590096 2890973 3012323 2931418 2824377 2717481 2756052 2903317
18225B903317K4336q2243J11657J13186J9492O4473J34069J12375J3129m881K11447
$$ 2903317 2927653 2845410 2957067 3070253 3089745 3154218 3288287 3400662 3413791 3408910 3620357
18214C620357J03014L9381o8978N4867j5077j45877Q9649J72559R614Q7016M6115
$$ 3620357 3723371 3762752 3693774 3748641 3733564 3587687 3677336 3849895 3859509 3946525 3992640
18203C992640R617Q9263L3853M5373R0146O1301O1903L6327J09021P4134R0394
$$ 3992640 4002257 4091520 4125373 4170746 4260892 4322193 4384096 4420423 4529444 4603578 4693972
18192D693972Q4353K2539Q1419P2684J06870J63945Q0845K4250R3722J44517N7071
$$ 4693972 4778325 4800864 4882283 4954967 5061837 5225782 5306627 5330877 5424599 5569116 5626187
18181E626187R0277M3841m312R8149R7863J76771J78096J39346J64964J89536
$$ 5626187 5716464 5760305 5755993 5854142 5952005 6128776 6306872 6446218 6611182 6800718
18171F800718J28778J2043j6580K11281L39816K31960O5638O1235P2173M8492
$$ 6800718 6929496 6941539 6924959 7136240 7476056 7708016 7773654 7834889 7907062 7955554
18161G955554J20735J88038K26747K36905K67431K80433J37644J49501J65746
$$ 7955554 8076289 8264327 8491074 8727979 8995410 9275843 9413487 9562988 9728734
18152I728734M13022L38647K41363K89721K86705L46862L48731L73826K42767
$$ 9728734 10141756 10480403 10721766 11011487 11298192 11645054 11993785 12367611 12610378
18143A2610378K53782M51974O03233N33712N45765M52210N21105N59515O84347
$$ 12610378 12864160 13316134 13919367 14453079 14998844 15451054 15972159 16531674 17216021
18134A7216021O95674P81348Q59154R06238R56000J123153J173929J435510J597714
$$ 17216021 17911695 18693043 19552197 20458435 21414435 22537588 23711517 25147027 26744741
18125B6744741J680102J785455K044134K335528K463462K385143K703971L142072
$$ 26744741 28424843 30210298 32254432 34589960 37053422 39438565 42142536 45284608
18117D5284608L430352L594483M164355N276914O302026O594418M142692j361469
$$ 45284608 48714960 52309443 56473798 61750712 68052738 74647156 78789848 77428379
18109G7428379n763932j3778271l6402199p2773981n5809946j2837232J1522082
$$ 77428379 71664447 57886176 21483977 -51290004 -107099950 -119937182 -108415100
18102a08415100J6937288J3724967J0453857P954961O214761N162268M372019
$$ -108415100 -91477812 -77752845 -67298988 -59344027 -53129266 -47966998 -43594979
18095d3594979L474228K815326K531431K152436J920361J664876J590443J470243
$$ -43594979 -40120751 -37305425 -34773994 -32621558 -30701197 -29036321 -27445878 -25975635
18087b5975635J336505J116479R88533Q80648R20431P34368N51313O31872O94501
$$ -25975635 -24639130 -23522651 -22534118 -21653470 -20733039 -19998671 -19447358 -18815486 -18120985
18078a8120985O92850O12855N28263L22510M63833L81623L04288L11854L11430
$$ -18120985 -17428135 -16815280 -16287017 -15964507 -15500674 -15119051 -14814763 -14502909 -14191479
18069a4191479L96602M15480K74019K72905K81316K89120K48736L22203K38710
$$ -14191479 -13794877 -13379397 -13105378 -12832473 -12551157 -12262037 -12013301 -11691098 -11452388
18060a1452388J02543M5965J58271K56554K28599Q9157K28546L06061K37394J21663
$$ -11452388 -11349845 -11303880 -11145609 -10889055 -10660456 -10571299 -10342753 -10036692 -9799298 -9677635
18050i677635J31237Q1811J08664K38035J57083K2539K29188K09668R9707K1404
$$ -9677635 -9546398 -9464587 -9355923 -9117888 -8960805 -8938266 -8709078 -8499410 -8399703 -8378299
18040h378299P8662J89892J07555L659L7274O1682K14392K40828K04598O8918
$$ -8378299 -8299637 -8109745 -8002190 -7998531 -7961257 -7899575 -7685183 -7444355 -7239757 -7170839
18030g170839N6701Q0765P3316J09174p948J75106J16138O0624Q3494R9237n7143
$$ -7170839 -7114138 -7033373 -6960057 -6850883 -6858831 -6683725 -6567587 -6506963 -6423469 -6324232 -6381375
18019f381375j78883J03341K38210J13018Q5505R7322r9585p1263J38730n1481
$$ -6381375 -6560258 -6456917 -6218707 -6105689 -6020184 -5922862 -6022447 -6093710 -5954980 -6006461
18009f006461Q3909J09363K3814q461M0967J13794M6589Q5639R3656K4998p6714
$$ -6006461 -5922552 -5813189 -5789375 -5797836 -5756869 -5643075 -5596486 -5510847 -5417191 -5392193 -5468907
17998e468907q4768Q4870M1766J05928J45369R7645K5208K0286m4852m9402J77517
$$ -5468907 -5553675 -5468805 -5427039 -5321111 -5175742 -5078097 -5052889 -5032603 -5077455 -5126857 -4949340
17987d949340J40730r29k146r3537m338N2253l1215j14710K6941P4327L1741R3658
$$ -4949340 -4808610 -4809539 -4811685 -4905222 -4909560 -4857307 -4888522 -5003232 -4976291 -4901964 -4870223 -4776565
17975d776565o4660P6772J28424J21236J16131K4162j41812j56899J25047R1982
$$ -4776565 -4841225 -4764453 -4636029 -4514793 -4398662 -4374500 -4516312 -4673211 -4548164 -4456182
17965d456182O9468p6567o403O8178J48321J16790R2305R536m645o1322k9388
$$ -4456182 -4386714 -4463281 -4469684 -4401506 -4253185 -4136395 -4044090 -4034554 -4039199 -4100521 -4129909
17954d129909q1882l671l7387Q8190J22161Q3580N7014L0897J0875K1648L3469
$$ -4129909 -4211791 -4215462 -4252849 -4164659 -4042498 -3958918 -3901904 -3871007 -3860132 -3838484 -3805015
17943c805015Q672l5273q3157Q3699j89473K4295J74407J43082N1421N3411l2946
$$ -3805015 -3796343 -3831616 -3914773 -3831074 -4020547 -3996252 -3821845 -3678763 -3627342 -3573931 -3606877
17932c606877j6101j16764l8624J44562J3796l5074K51l4313J2048N2114j5648
$$ -3606877 -3622978 -3739742 -3778366 -3633804 -3620008 -3655082 -3654831 -3689144 -3677096 -3624982 -3640630
17921c640630L535k2636K0303O3663K21855O0474R7043K1262M4479m5367o5633
$$ -3640630 -3637095 -3659731 -3639428 -3575765 -3353910 -3293436 -3196393 -3175131 -3130652 -3176019 -3241652
17910c241652j48349K7155R6483M4106N669n352L1752j13628m6316j5089j7796
$$ -3241652 -3390001 -3362846 -3266363 -3222257 -3216588 -3221940 -3190188 -3303816 -3350132 -3365221 -3383017
17899c383017J1777M814P7558o5393Q9691J21148n8580j881M9338N4186J4585
$$ -3383017 -3371240 -3366426 -3288868 -3354261 -3264570 -3143422 -3202002 -3203883 -3154545 -3100359 -3085774
17888c085774m1265j00225Q0086L3909k8965J29344O289K1429j9178n3491J18722
$$ -3085774 -3127039 -3227264 -3147178 -3113269 -3142234 -3012890 -3006601 -2985172 -3004350 -3057841 -2939119
17877b939119J55770n5086r2075o2663l8856N7002R3582o5587M1920K3390J2076
$$ -2939119 -2783349 -2838435 -2930510 -2993173 -3032029 -2975027 -2881445 -2947032 -2905112 -2881722 -2869646
17866b869646l2912J4975O0062J36049R0650p8482M8178O607q5955m8332K699
$$ -2869646 -2902558 -2887583 -2827521 -2691472 -2600822 -2679304 -2631126 -2624519 -2710474 -2758806 -2756107
17855b756107p78J650K2386J34038O7848r5113j46884n1146R6160M8423P3718
$$ -2756107 -2756885 -2755235 -2732849 -2598811 -2530963 -2626076 -2772960 -2824106 -2727946 -2679523 -2605805
17844b605805J66523R8162o1673j4867n784L3684m2919m264j04094j09068j17553
$$ -2605805 -2439282 -2341120 -2402793 -2417660 -2423444 -2389760 -2432679 -2436943 -2541037 -2650105 -2767658
17833b767658M3482M6363J30641m3009K9823K5442j1130j2251j35047j49441P5168
$$ -2767658 -2724176 -2677813 -2547172 -2590181 -2560358 -2534916 -2546046 -2558297 -2693344 -2842785 -2767617
17822b767617O8251R525K2985L5609o6692O6215L8230K9553K9485J02982p0631
$$ -2767617 -2699366 -2689841 -2666856 -2631247 -2697939 -2631724 -2593494 -2563941 -2534456 -2431474 -2502105
17811b502105j39803Q3269J58272O4799j38429p4446P7627k5536K5964l9624n8138
$$ -2502105 -2641908 -2558639 -2400367 -2335568 -2473997 -2548443 -2470816 -2496352 -2470388 -2510012 -2568150
17800b568150J18696Q9241J5989j00845N9629P7980j7078o347J6098R233n1490
$$ -2568150 -2449454 -2360213 -2344224 -2445069 -2385440 -2307460 -2324538 -2330885 -2314787 -2305554 -2357044
17789b357044L2177l0150k5849Q250o7087P9923o6947m5112M1536Q5708R3778
$$ -2357044 -2324867 -2355017 -2380866 -2372616 -2439703 -2359780 -2426727 -2471839 -2430303 -2344595 -2250817
17778b250817l7527l2349K2379k2974N1907K6191J1234J1310Q5133P3069q0363
$$ -2250817 -2288344 -2320693 -2298314 -2321288 -2269381 -2243190 -2231956 -2220646 -2135513 -2062444 -2142807
17767b142807n0541k46997N5926N0891n7943J41169P8813r9237l7798n4743Q883
$$ -2142807 -2193348 -2440345 -2384419 -2333528 -2391471 -2250302 -2171489 -2270726 -2308524 -2363267 -2354384
17756b354384J82958J28894M5783o0632k035j73086J1386J66358N1625j3556Q176
$$ -2354384 -2171426 -2042532 -1996749 -2057381 -2059416 -2232502 -2221116 -2054758 -2003133 -2016689 -2008513
17745b008513j58432p9873k6867J23800K28731p674o9747l323o3101o9067n9621
$$ -2008513 -2166945 -2246818 -2273685 -2149885 -1921154 -1928828 -1998575 -2001898 -2064999 -2134066 -2193687
17734b193687M081R1521K6502o1526q633j9387q1825j3203Q0797P8020J00854
$$ -2193687 -2189606 -2098085 -2071583 -2133109 -2141742 -2161129 -2242954 -2256157 -2175360 -2097340 -1996486
17723a996486N8401j44711j52596O6667K1026L5456O1164K8609j19506J8682N0665
$$ -1996486 -1938085 -2082796 -2235392 -2168725 -2147699 -2112243 -2051079 -2022470 -2141976 -2123294 -2072629
17712b072629P9138q0545l7745J16763L6158m7374n4104M6737J17593L1371L8523
$$ -2072629 -1993491 -2074036 -2111781 -1995018 -1958860 -2006234 -2060338 -2013601 -1896008 -1864637 -1826114
17701a826114m552L8006k1363l8629n7512L1019R5040o9455m4231l6507N1012
$$ -1826114 -1830666 -1792660 -1814023 -1852652 -1910164 -1879145 -1784105 -1853560 -1897791 -1934298 -1883286
17690a883286Q9762p0818r9248N5137N0220J8465q7912K9773k5608q5804N5993
$$ -1883286 -1793524 -1864342 -1963590 -1908453 -1858233 -1839768 -1927680 -1897907 -1923515 -2009319 -1953326
17679a953326N8923k5594J21305J38367o515q0256k4090p1987j68205J01167J02093
$$ -1953326 -1894403 -1919997 -1798692 -1660325 -1666840 -1747096 -1771186 -1843173 -2011378 -1910211 -1808118
17668a808118j44177j46928K5943M2408J69052J6699j17531o2791R9681M6170
$$ -1808118 -1952295 -2099223 -2073280 -2030872 -1861820 -1845121 -1962652 -2025443 -1925762 -1879592
17658a879592L760J73748J14411l4612q3029L3336j07648r2826K2484O26O2741
$$ -1879592 -1875832 -1702084 -1587673 -1622285 -1705314 -1671978 -1779626 -1872452 -1849968 -1849342 -1786601
17647a786601O1328q120K9051q6999n5378J25121m8699j39536p5261j6525O9931
$$ -1786601 -1725273 -1733393 -1704342 -1791341 -1846719 -1721598 -1770297 -1909833 -1985094 -2001619 -1931688
17636a931688J63517Q0861j55935n6123K8074j12378N1449J07461M6639k1396
$$ -1931688 -1768171 -1687310 -1843245 -1899368 -1871294 -1983672 -1932223 -1824762 -1778123 -1799519
17626a799519Q8830J92808m695k204J5698j04118P8446R4066j27773o0839O5456
$$ -1799519 -1710689 -1517881 -1522576 -1524780 -1509082 -1613200 -1534754 -1440688 -1568461 -1629300 -1563844
17615a563844L0772p7140p194O3713j31165o8207J41025K12821j7643j49693l5505
$$ -1563844 -1533072 -1610212 -1617406 -1553693 -1684858 -1753065 -1612040 -1399219 -1416862 -1566555 -1602060
17604a602060J42648m2964n6114R020k5862j57883l0160R4306p1879q0472j33982
$$ -1602060 -1459412 -1502376 -1558490 -1549470 -1575332 -1733215 -1763375 -1669069 -1740948 -1821420 -1955402
17593a955402o0941m6995J97018J31432k4240O6014J74423k9349m0131J21933
$$ -1955402 -2016343 -2063338 -1866320 -1734888 -1759128 -1693114 -1518691 -1548040 -1588171 -1466238
17583a466238j24505l9392N8300j3605M2968M108o0082j1520M1561R2089o9884
$$ -1466238 -1590743 -1630135 -1571835 -1585440 -1542472 -1538364 -1598446 -1609966 -1568405 -1476316 -1546200
17572a546200P2300m1279J9447L0792r1599M6183l1999o624N4480J3650J2570
$$ -1546200 -1473900 -1515179 -1495732 -1464940 -1556539 -1510356 -1542355 -1548979 -1494499 -1480849 -1468279
17561a468279j754N8507m1426O2954k5351q9292N2425l6784j31938q7423J9325
$$ -1468279 -1470033 -1411526 -1452952 -1389998 -1415349 -1504641 -1452216 -1489000 -1620938 -1708361 -1689036
17550a689036M9423J24565J03423l0047m2658j8214Q0652N0509o5480m1890R9545
$$ -1689036 -1639613 -1515048 -1411625 -1441672 -1484330 -1502544 -1421892 -1371383 -1436863 -1478753 -1379208
17539a379208j1967p7840o2803Q0668l4081p7891j05135M4083R4840J20072K4639
$$ -1379208 -1391175 -1469015 -1531818 -1451150 -1485231 -1563122 -1668257 -1624174 -1529334 -1409262 -1384623
17528a384623o4163m0144L270k417L988J1549p8437R3686P8141p2959o0063J0238
$$ -1384623 -1448786 -1488930 -1485660 -1488077 -1484089 -1472540 -1550977 -1457291 -1379150 -1452109 -1512172 -1501934
17516a501934j2480N1320j036k2530m8973n3982m8591O8604Q3838k4887m4870
$$ -1501934 -1514414 -1463094 -1464130 -1486660 -1535633 -1589615 -1638206 -1569602 -1485764 -1510651 -1555521
17505a555521O3056L8721J16757J20376j5872l6997l4944o2719L8270n7787J7904
$$ -1555521 -1492465 -1453744 -1336987 -1216611 -1232483 -1269480 -1304424 -1367143 -1328873 -1386660 -1368756
17494a368756l7242n7640J08375N1005j32437L400M0651q3586o0409Q3325O1689
$$ -1368756 -1405998 -1463638 -1355263 -1304258 -1436695 -1433295 -1392644 -1476230 -1536639 -1453314 -1391625
17483a391625J1425Q9326Q5375o9997q9222M5950J021L1596M6075j13779n0594
$$ -1391625 -1380200 -1290874 -1205499 -1275496 -1364718 -1318768 -1317747 -1286151 -1240076 -1353855 -1404449
17472a404449O437O1761O9021j08658k2471L4939R1097P2996J27549j09377j78642
$$ -1404449 -1398012 -1336251 -1267230 -1375888 -1398359 -1363420 -1272323 -1199327 -1071778 -1181155 -1359797
17461a359797k9070J0099Q5878Q3077O0263j28968l4018P9263n5964j48765m010
$$ -1359797 -1388867 -1378768 -1292890 -1209813 -1149550 -1278518 -1312536 -1233273 -1289237 -1438002 -1442012
17450a442012J47927J03792j8197J11374O8452m6857l9937M154k2606j82395l57646
$$ -1442012 -1294085 -1190293 -1208490 -1097116 -1028664 -1075521 -1115458 -1111304 -1133910 -1316305 -1673951
$$ [...]
##END NTUPLES=NMR SPECTRUM
##END=
