##TITLE=Analysis number 328924
Compound Code cc 64501
Book Reference 510/64
Project Code adrs
Chemist Name jimp
##JCAMPDX= 6.0         $$ Bruker NMR JCAMP-DX V2.0
##DATA TYPE= NMR SPECTRUM
##DATA CLASS= NTUPLES
##ORIGIN= Bruker BioSpin GmbH
##OWNER= nmr
$$ XWIN-NMR		Version 3.5
$$ Tue Jul 17 09:22:14 2007 GMT Daylight Time (UT+1h)  MAYBRIDGE\nmr@NMR_250MHZ
##.OBSERVE FREQUENCY= 250.131544655141
##.OBSERVE NUCLEUS= ^1H
##.ACQUISITION MODE= SIMULTANEOUS (DQD)
##.ACQUISITION SCHEME= undefined
##.AVERAGES= 16
##.DIGITISER RES= 18
##SPECTROMETER/DATA SYSTEM= dpx250
##.PULSE SEQUENCE= zg30
##.SOLVENT NAME= DMSO
##.SHIFT REFERENCE= (INTERNAL, DMSO, 0, 16.522)
##AUDIT TRAIL= $$ (NUMBER, WHEN, WHO, WHERE, WHAT)
$$ ##TITLE= Audit trail, XWIN-NMR		Version 3.5
$$ ##JCAMPDX= 5.01
$$ ##ORIGIN= Bruker BioSpin GmbH
$$ ##OWNER= nmr
$$ C:\u/data/dgb/nmr/ADRS/1070/pdata/1/auditp.txt
$$ ##AUDIT TRAIL=  $$ (NUMBER, WHEN, WHO, WHERE, WHAT)
(   1,<2007-07-17 09:21:52.19 +100>,<MAYBRIDGE\nmr>,<NMR_250MHZ>,
      <created by zg, POWCHK disabled, PULCHK disabled
       configuration hash MD5:
       76 6E 9A 78 1E 09 19 81 EC 84 63 8F B0 6A 59 2D
       data hash MD5: 64K
       E3 18 D4 45 D6 07 45 CA 8E 23 7D 78 45 CC 23 CF>)
(   2,<2007-07-17 09:22:05.56 +100>,<MAYBRIDGE\nmr>,<NMR_250MHZ>,
      <Start of raw data processing
       ef LB = 0.3 FT_mod = 6 PKNL = 1 SI = 32K 
       data hash MD5: 32K
       EB 38 0F F9 76 A0 E6 2E 9C DF DC 9B 3D 9D FF 51>)
(   3,<2007-07-17 09:22:07.25 +100>,<MAYBRIDGE\nmr>,<NMR_250MHZ>,
      <apk 
       data hash MD5: 32K
       B6 04 A9 A2 6B 8B 7E D5 A5 5C 00 7E 8F 6A 1F 09>)
(   4,<2007-07-17 09:22:07.98 +100>,<MAYBRIDGE\nmr>,<NMR_250MHZ>,
      <abs ABSG = 5 
       data hash MD5: 32K
       46 30 71 9A 82 4C DC 6A FB 16 CE EA C8 3B 2F 27>)
$$ ##END=
$$ 
$$ hash MD5
$$ 4A 7D E1 9F 2C 40 35 B2 3F 13 08 A6 7C 7B 3E 18
##$RELAX= 
##$RELAX= 
##$RELAX= 
##$RELAX= 
##$RELAX= 
##$RELAX= 
##$RELAX= 
$$ Bruker specific parameters
$$ --------------------------
##$DU= <C:\u>
##$EXPNO= 1070
##$NAME= <ADRS>
##$PROCNO= 1
##$TYPE= <nmr>
##$USER= <dgb>
##$AMP= (0..31)
100 100 100 100 100 100 100 100 100 100 100 100 100 100 100 100 100 100 
100 100 100 100 100 100 100 100 100 100 100 100 100 100 
##$AQSEQ= 0
##$AQ_mod= 3
##$AUNM= <au_zg>
##$AUTOPOS= <5 >
##$BF1= 250.13
##$BF2= 250.13
##$BF3= 250.13
##$BF4= 250.13
##$BF5= 500.13
##$BF6= 500.13
##$BF7= 500.13
##$BF8= 500.13
##$BYTORDA= 1
##$CFDGTYP= 0
##$CFRGTYP= 5
##$CHEMSTR= <none>
##$CNST= (0..31)
1 1 145 1 1 1 1 1 1 1 1 1 1 1 1 1 1 1 1 1 1 1 1 1 1 1 1 1 1 1 1 1 
##$CPDPRG= <>
##$CPDPRG1= <>
##$CPDPRG2= <>
##$CPDPRG3= <>
##$CPDPRG4= <mlev>
##$CPDPRG5= <mlev>
##$CPDPRG6= <mlev>
##$CPDPRG7= <mlev>
##$CPDPRG8= <mlev>
##$CPDPRGB= <>
##$CPDPRGT= <>
##$D= (0..31)
0 1 0 0 0 0 0 0 0 0.06 0 0 0 0 0 0 0.0002 0 0 0 0 0 0 0 0 0 0 0 0 0 0 
0 
##$DATE= 1184660511
##$DBL= (0..7)
120 120 120 120 120 120 120 120 
##$DBP= (0..7)
150 150 150 150 150 150 150 150 
##$DBP07= 0
##$DBPNAM0= <>
##$DBPNAM1= <>
$$ [...]
##$SUBNAM7= <"">
##$SUBNAM8= <"">
##$SUBNAM9= <"">
##$SW= 20.6930455092707
##$SWIBOX= (0..15)
0 0 3 0 0 0 0 0 0 0 0 0 0 0 0 0 
##$SW_h= 5175.983436853
##$TD= 65536
##$TD0= 1
##$TE= 296.16
##$TE2= 300
##$TE3= 300
##$TEG= 300
##$TL= (0..7)
0 120 120 120 120 120 120 120 
##$TP= (0..7)
150 150 150 150 150 150 150 150 
##$TP07= 0
##$TPNAME0= <>
##$TPNAME1= <>
##$TPNAME2= <>
##$TPNAME3= <>
##$TPNAME4= <>
##$TPNAME5= <>
##$TPNAME6= <>
##$TPNAME7= <>
##$TPOAL= (0..7)
0.5 0.5 0.5 0.5 0.5 0.5 0.5 0.5 
##$TPOFFS= (0..7)
0 0 0 0 0 0 0 0 
##$TUNHIN= 0
##$TUNHOUT= 0
##$TUNXOUT= 0
##$USERA1= <user>
##$USERA2= <user>
##$USERA3= <user>
##$USERA4= <user>
##$USERA5= <user>
##$V9= 5
##$VALIST= <valist>
##$VCLIST= <CCCCCCCCCCCCCCC>
##$VD= 0
##$VDLIST= <DDDDDDDDDDDDDDD>
##$VPLIST= <PPPPPPPPPPPPPPP>
##$VTLIST= <TTTTTTTTTTTTTTT>
##$WBST= 1024
##$WBSW= 4
##$XGAIN= (0..3)
0 0 0 0 
##$XL= 0
##$YL= 0
##$YMAX_a= 369386
##$YMIN_a= -329130
##$ZGOPTNS= <>
##$ZL1= 120
##$ZL2= 120
##$ZL3= 120
##$ZL4= 120
##$ABSF1= 16.522
##$ABSF2= -4.171173
##$ABSG= 5
##$ABSL= 3
##$ALPHA= 0
##$AQORDER= 0
##$ASSFAC= 0
##$ASSFACI= 0
##$ASSFACX= 0
##$ASSWID= 0
##$AUNMP= <proc_1d>
##$AZFE= 0.1
##$AZFW= 0.1
##$BCFW= 0
##$BC_mod= 0
##$BYTORDP= 0
##$COROFFS= 0
##$CY= 12.5
##$DATMOD= 1
##$DC= 0
##$DFILT= <>
##$DTYPP= 0
##$F1P= 14.0000005364418
##$F2P= -0.99999901652339
##$FCOR= 0.5
##$FTSIZE= 32768
##$FT_mod= 6
##$GAMMA= 0
##$GB= 0
##$INTBC= 1
##$INTSCL= 1
##$ISEN= 128
##$LB= 0.3
##$LEV0= 0
##$LPBIN= 0
##$MAXI= 10000
##$MC2= 0
##$MEAN= 0
##$ME_mod= 0
##$MI= 0
##$NCOEF= 0
##$NC_proc= -4
##$NLEV= 6
##$NOISF1= 0
##$NOISF2= 0
##$NSP= 0
##$NTH_PI= 0
##$NZP= 0
##$OFFSET= 16.522
##$PC= 1
##$PHC0= -64.85584
##$PHC1= 15.44013
##$PH_mod= 1
##$PKNL= yes
##$PPARMOD= 0
##$PSCAL= 4
##$PSIGN= 0
##$REVERSE= no
##$SF= 250.13
##$SI= 32768
##$SIGF1= 0
##$SIGF2= 0
##$SINO= 400
##$SIOLD= 32768
##$SREGLST= <1H.DMSO>
##$SSB= 0
##$STSI= 32768
##$STSR= 0
##$SW_p= 5175.98343685301
##$SYMM= 0
##$S_DEV= 0
##$TDeff= 65536
##$TDoff= 0
##$TI= <Analysis number 999999
Compound Code 99
Book Reference 9
Project Code 9>
##$TILT= no
##$TM1= 0
##$TM2= 0
##$TOPLEV= 0
##$USERP1= <user>
##$USERP2= <user>
##$USERP3= <user>
##$USERP4= <user>
##$USERP5= <user>
##$WDW= 1
##$XDIM= 32768
##$YMAX_p= 422805826
##$YMIN_p= -1679030
$$ End of Bruker specific parameters
$$ ---------------------------------
##NTUPLES= NMR SPECTRUM
##VAR_NAME=  FREQUENCY,     SPECTRUM/REAL,   SPECTRUM/IMAG
##SYMBOL=    X,             R,               I
##VAR_TYPE=  INDEPENDENT,   DEPENDENT,       DEPENDENT
##VAR_FORM=  AFFN,          ASDF,            ASDF
##VAR_DIM=   32768,         32768,           32768
##UNITS=     HZ,            ARBITRARY UNITS, ARBITRARY UNITS
##FACTOR=    0.157963299565203, 1,           1
##FIRST=     4132.6476996994, 0,             0
##LAST=      -1043.33573715361, 0,           0
##MIN=       -1043.33573715361, -1679030,    0
##MAX=       4132.6476996994, 422805826,     0
$$ Real data points
##PAGE= N=1
##DATA TABLE= (X++(R..R)), XYDATA
$$ [...]
16482b5518k4525K7074K4227k532j2973n558J4688o356M951p812j6496k5282p050
16469f3162J8212J0706J4137j1327O6L3076J0840j1647k2703o334q471Q683k3686
16456e1610q51J6287J2317Q034N402M455L005k1187j7338J8425M876O11J9490
16443A916j7706r792K3353K1849j45l7397j7510j2734j723J9734J1160O1l565
16430b2499J1076K0908q415l3503m169P547J1939j3237R202J0454R908J736l4058
16417c3111q211J5535J2676K1914K8555j0170k5276J1830r417M26m837l1409P507
16404b3988J1356o326j353J1771n180j1205N00j8932R866N236L258J2634L1039
16391A8676Q043n9855m559J4177N893J140k2831K3039r182J0042P224J75Q750
$$ plain form
16482 -25518 -50043 -22969 1258 -1274 -14247 -19805 -5117 -11473 -6522 -14334 -30830 -56112 -63162
16469 -63162 -44950 -34244 -20107 -31434 -31368 1708 12548 901 -21802 -28136 -36607 -27924 -51610
16456 -51610 -52461 -36174 -23857 -15823 -10421 -5966 -2961 -24148 -41486 -23061 -18185 -17574 1916
16443 1916 -15790 -25582 -2229 19620 19475 -17922 -35432 -48166 -49889 -30155 -18995 -18934 -22499
16430 -22499 -11423 9485 1070 -32433 -36602 -29055 -17116 -30353 -21151 -10697 -789 947 -33111
16417 -33111 -41322 -25787 -13111 8803 37358 27188 1912 13742 4325 4751 -86 -31495 -23988
16404 -23988 -12632 -18958 -20311 -8540 -13720 -24925 -24425 -43357 -33491 -28255 -24997 -12363 18676
16391 18676 26719 -33136 -37695 -23518 -17625 -16485 -39316 -16277 -25459 -15417 -8193 -8018 732
16378G32q55j7938j5635J1907j4423K383K2706o518M52j2807r676j7030j4590
16365g1292L8623J173j2243J4165j2548j2550M305p91J914q43L1150m250L47L243
16351a9597p036J3981L030J8478q270J3896N117K4166k5332j764N232m143K543
16338B0301n668k4008M16J8617J1006k0959l852m871r817J761L2781j0036j1313
16325e642j8952k3053m461J597r267J0598K7548k135k1393n494J9998K4471J5370
16312I185J7272J4157M800N680o671k0185K001k773j6388K640k2886J968J397
16299i803M120l773J571r013R770J6577J8053k2313k741M486m9764l0019J2571
16286f0278L0780L1820J2787j03q497k7415k182K1254K93k790N594p400p58m427
$$ plain form
16378 732 -123 -18061 -33696 -21789 -36212 -33829 -11123 -17641 -17189 -29996 -39672 -56702 -71292
16365 -71292 -32669 -31496 -43739 -29574 -42122 -54672 -50367 -51158 -49244 -50087 -18937 -23187 -22840 -19597
16351 -19597 -26633 -12652 -9622 8856 586 14482 19599 43765 18433 16669 21901 17758 20301
16338 20301 14633 -9375 -8959 9658 20664 -295 -4147 -9018 -18835 -17074 15707 5671 -5642
16325 -5642 -24594 -47647 -52108 -50511 -59778 -49180 -21632 -23767 -45160 -50654 -30656 -6185 9185
16312 9185 26457 40614 45414 51094 44423 24238 26239 23466 7078 9718 -13168 -11200 -9803
16299 -9803 -5683 -9456 -7885 -16898 -7128 9449 27502 5189 2448 6934 -42830 -72849 -60278
16286 -60278 -29498 2322 15109 15006 6509 -20906 -23088 -1834 -1541 -4331 1263 -6137 -6895 -11322
16272a1322l7647J229J9204J7899J5354J1934L1123n633l5090j2853P189q162
16260f775p277j5113L274j744l292J6328J6909R019J2177o064j2491K309j414
16247E846J2751q958O512R868R126R204m982k0106m1077j7244j0156l806J4790
16234c8232L1975K5262l7361K49n073J0411J1540n193O912l185K124J3523l442
16221I510j5163L2781K27k7180k0977K999K1716L877j0676j0454L088Q176r728
16208a1804r555J2191K295j2600R301j0027K876J6390J4704m0080P11J5162o800
16195a7236J0701L809J3151J2593q370J499r766O824j482J6950L2274J7635l6560
16182D2022n3022j931L0123O725j1163k3225r207o121l939J3606J7090K0685l829
$$ plain form
16272 -11322 -48969 -47740 -28536 -10637 4717 16651 47774 42141 7051 -5802 1387 -6775
16260 -6775 -14052 -29165 -25891 -27635 -30927 -14599 2310 11329 23506 17442 4951 7260 5846
16247 5846 18597 9639 16151 26019 35145 44349 39367 19261 -21816 -39060 -49216 -53022 -38232
16234 -38232 -6257 19005 -18356 -18107 -23180 -12769 -1229 -6422 490 -2695 -571 12952 9510
16221 9510 -5653 27128 27355 175 -20802 -17803 3913 7790 -2886 -13340 -10252 -2076 -11804
16208 -11804 -21359 -9168 -6873 -19473 -10172 -20199 -17323 -933 13771 -26309 -25598 -10436 -17236
16195 -17236 -6535 -2726 10425 23018 14648 16147 6381 13205 11723 28673 60947 78582 42022
16182 42022 -11000 -12931 17192 23917 12754 -10471 -19678 -25799 -29738 -16132 958 21643 17814
16169A7814q87k7321j1016L5018Q329j7833J772o055P270Q177N281J7590m6317
16156h178N50J9224R402j4518k2717j8561k717R678J1338L0526N96j3020q925
16143g322J411j8729j3508m0L011K5439R506J1697J937l47O454r847k2537j2364
16129b5239o157j1374P544M94j8194K7202J0529l274P885J9069j3422j1837l034
16116a9808j3308O585M0307j4212j9736J1464o309R214K1491k725j8219k9732
16104c4988J2169J4244n182J9138M797k659J9342j5611J2921r154l9186j9986
16092d4155K8515L7269J1476o358j0817N890K6820O686k2812k5517k1684J4759
16080G2J1348k5517q078j903P572O67J1311M219m422J4828O753J2338j6129k8319
$$ plain form
16169 17814 16927 -10394 -21410 13608 21937 4104 5876 -179 7091 15268 20549 38139 -8178
16156 -8178 -7628 11596 20998 6480 -16237 -34798 -37515 -27837 -16499 14027 14623 1603 -7322
16143 -7322 -5911 -24640 -38148 -38188 -35177 -9738 -232 11465 13402 13055 19509 9662 -12875 -25239
16129 -25239 -31396 -42770 -35226 -34732 -52926 -25724 -15195 -18469 -10584 8485 -4937 -16774 -19808
16116 -19808 -33116 -26531 13776 -436 -20172 -8708 -15017 -5803 15688 12963 -5256 -34988
16104 -34988 -22819 -8575 -13757 5381 10178 7519 26861 11250 24171 15017 -24169 -44155
16092 -44155 -15640 21629 33105 26747 15930 21820 48640 55326 32514 6997 -14687 72
16080 72 11420 -14097 -22175 -24078 -16506 -15839 -4528 -309 -4731 10097 16850 29188 13059 -15260
16066a5260m3287PL9408j949L449K5069J518J6464r212o104k2836l2303M754J0332
16052b9950m638k026K7872J0012o839k1190l2237K6301J3747L640J0933J1144
16040F769m1484r161j2642Q465k1390l232J8999L2488J9863j0737J7262P150J2515
16027B4865J0863r223j6057q372Q06j8271o518J658p867n376J1528J8271k7015
16014c0708j6694M704K89Q06J0658J2735j2871J5248K367J498j1550K42M6353
16001B3077m917k3801l5274M426J4073K6589J0309k2302J8034M700j9862O856
15989A908q64r590k1516J0601M1666K950l4912j3101p381j2879J7495K2764L5997
15976C3138K3416m1003k0316J2545L4j8223k434l556p279n325J1663j1793k1257
$$ plain form
16066 -15260 -58547 -58540 -19132 -21081 -17632 7437 8955 25419 16207 10103 -12733 -45036 -40282 -29950
16052 -29950 -34588 -36614 -8742 1270 -5569 -26759 -58996 -32695 -18948 -15308 -4375 6769
16040 6769 -34715 -43876 -56518 -48053 -69443 -72675 -53676 -21188 -1325 -12062 5200 12350 24865
16027 24865 35728 26505 10448 2076 2882 -15389 -21907 -20249 -28116 -33492 -21964 -3693 -30708
16014 -30708 -47402 -42698 -42409 -41603 -30945 -18210 -31081 -15833 -13466 -11968 -23518 -23276 23077
16001 23077 18160 -5641 -40915 -36489 -22416 4173 14482 -7820 10214 14914 -4948 1908
15989 1908 1044 -8546 -30062 -19461 22205 25155 -9757 -22858 -30239 -43118 -25623 -2859 33138
15976 33138 56554 15551 -4765 7780 7814 -10409 -12843 -16399 -23678 -29003 -17340 -29133 -50390
15963e0390O557J1481j1447p30l817j2926M369J778P936J1935j7235j1767Q966
15950e5290R40O592M946R26j1465J6711J6308J5876O571k2203M308L0881j3596
15937A505l318k3306N443K224j7252r721J9416j7255P420K2629j7051j1281K348
15924c8199K1359R976K6357m487r234k1756r114J8114j7131n383o194j4430K5273
15911b4849l295j8786L746K5500J9305j4774L1115J1519J0308j705n857r840k5452
15898c065l4106R448k754J1500J1768m982J1551J6980n631j179J5018N139p470
15885B2217N941r771p857L2164m2495l3012J3602j4434O718K9523q91J2435m557
15872I583r374J1728J295k02K4108R11j1802j289Q945k2508K5625r882O122p144
$$ plain form
15963 -50390 -43833 -32352 -43799 -44529 -48346 -61272 -56903 -55125 -47189 -35254 -52489 -64256 -55290
15950 -55290 -54350 -47758 -42812 -41886 -53351 -36640 -20332 -4456 2115 -20088 -15780 15101 1505
15937 1505 -1813 -25119 -19676 -17452 -34704 -44425 -25009 -42264 -34844 -12215 -29266 -40547 -38199
15924 -38199 -16840 -6864 19493 15006 5772 -15984 -25098 -6984 -24115 -29498 -35692 -50122 -24849
15911 -24849 -28144 -46930 -43184 -17684 1621 -13153 17962 29481 39789 38084 32227 22387 -3065
15898 -3065 -37171 -27723 -30477 -18977 -7209 -12191 -640 16340 10709 9530 24548 29687 22217
15885 22217 28158 18387 10530 42694 199 -32813 -19211 -33645 -26927 2596 1705 14140 9583
15872 9583 209 11937 13232 13030 37138 38049 26247 24958 33903 11395 37020 27138 33260 26116
15858B6116l2637J4607K740j6680p020j9232k336J493r1K642K890o588K1915j1259
15844b3440p610J8972k966j937l708J784J4182k0854p084m839K7473J513j3655
15831b2169j5204q062K0394r29K5485K7350k618k1555q684L361J4363J3113M251
15818B9096k0530k9085J4161j9359j8695J2816K9126J2009k1207l4826j3894q990
15806f9378R644J1313J5738L3549J1057j4464m094J0161n354N653j2914n002j1792
15793b5883L029j672l2421J3260L9309o41j361J5983l782m715J8794J2711N061
15780C7672p327m1469k3813O838m503j3585K2280Q789L3053J3879j4378q962l621
15767D853j3301l509J3095k2971j2050P033m903r771k3222M3J3957K303J3699
$$ plain form
15858 26116 -6521 8086 10826 -5854 -12874 -32106 -34442 -32949 -33040 -30398 -27508 -34096 -12181 -23440
15844 -23440 -31050 -12078 -15044 -16981 -20689 -18905 -4723 -25577 -32661 -37500 -10027 -8514 -22169
15831 -22169 -37373 -45435 -25041 -25970 -485 26865 24247 2692 -5992 -2631 11732 24845 29096
15818 29096 8566 -20519 -6358 -25717 -44412 -31596 -2470 9539 -11668 -46494 -60388 -69378
15806 -69378 -59734 -48421 -32683 866 11923 -2541 -6635 3526 -1828 3825 -9089 -14091 -25883
15793 -25883 -22854 -24526 -56947 -43687 -4378 -5019 -6380 9603 5821 1106 19900 32611 37672
15780 37672 30345 -11124 -34937 -28099 -32602 -46187 -23907 -15118 17935 31814 17436 8474 4853
15767 4853 -8448 -11957 1138 -21833 -33883 -26850 -31753 -41524 -64746 -64703 -50746 -48443 -34744
15754c4744M721J5803m649l3015k434j742L3009K6597N459q141j0598j0783K5940
15741E423j4479K136J271m158j9503K489O318j4402j0876K2848L364j6732q483
15728d4784j6665j2430O801j2115j2011J3542L8234L257o67j490J8999J2706Q267
15715A644J4919L4658o838k0354j0423o67K4477j5713q955Q803o270l2512o415
15702b3646J2359J3479N317J0494J1183k5923N138L4568J5502j7697q540j1021
15690B1213o587j5749j8363K6801K2474L143j7483j550N958k6754J5772J5084
15678B3959j4174L534m121k0452n547J9839N64j4272J5657O618p523J3830K3028
15665D0940J404k1314j2933K209j1129j5262K682K8267q673j0455K0794P306m671
$$ plain form
15754 -34744 -30023 -14220 -18869 -51884 -54318 -56060 -23051 3546 9005 864 -9734 -20517 5423
15741 5423 -9056 -6920 -5649 -9807 -29310 -26821 -20503 -34905 -45781 -22933 -19569 -36301 -44784
15728 -44784 -61449 -73879 -67078 -79193 -91204 -77662 -39428 -36171 -36838 -38328 -19329 -6623 1644
15715 1644 16563 51221 44383 24029 13606 12939 37416 21703 12748 21551 15281 -17231 -23646
15702 -23646 -11287 2192 7509 18003 29186 3263 8401 42969 58471 40774 32234 21213
15690 21213 14626 -1123 -19486 7315 29789 32932 15449 13899 19857 -6897 8875 23959
15678 23959 9785 13319 9198 -11254 -16801 3038 3602 -10670 4987 11605 4082 17912 40940
15665 40940 42344 21030 8097 10306 -823 -16085 -13403 14864 6191 -4264 16530 23836 19165
15652A9165J9734N664m1542l9997l0254j2198J6169O783K0213K4201K351K0121
15640A0410l510j3535o115k311K378j8974k9277j5206J7193L6540L1613J9807
15628B9013J6417j6629R076M096r553l0428J2291J4925J7098l070l9615j1710
15616h089K8735k010k3077j2056k5532k7068J1534K9826R988O637J647M727K9934
15603B5196J8189j1641k0960o042J6924K0817J6095j0078j6027J313q157K4401
15591E0030L855q336k7969K5870k571o865k187J3749L0614K0793O551L4197M7445
15578A85176M0648O2185O6884N7594P1267M3795m185j7342K451n5642q3307p0073
15566B99451o2157m9233k7098K761m5141M81k978k7461l4167l8007J3233J6499
$$ plain form
15652 19165 38899 44563 3021 -36976 -67230 -79428 -63259 -56476 -36263 -12062 -9711 10410
15640 10410 6900 -6635 -12750 -15061 -12683 -31657 -60934 -76140 -58947 -22407 9206 29013
15628 29013 45430 28801 37877 41973 32420 1992 14283 29208 46306 43236 3621 -8089
15616 -8089 20646 18636 -4441 -16497 -42029 -69097 -57563 -27737 -17749 -11112 -9465 -4738 25196
15603 25196 43385 31744 10784 4742 21666 42483 58578 48500 32473 33786 25629 50030
15591 50030 53885 45549 17580 43450 40879 34014 31827 45576 76190 96983 103534 137731 185176
15578 185176 225824 288009 354893 412487 483754 527549 523364 506022 508473 452831 369524 299451
15566 299451 237294 188061 160963 163724 118583 119064 116086 88625 54458 16451 29684 46183
15554D6183j5558j8922j3771o853O82l147M037K3666k5817k1126L41r570J6628
15541b3227J8627j1761j8925l2156J1288K1689K0723L715J065J3933j1405j6483
15529b2917q590K1656J8737J2916K920m020O794M573o405r73k7297k289n278k4447
15515c4620Q767P778N714K2309Q593l407k2306k5896q856k2558J2118K0360P121
15502b4883L759j4337j0207m600J0906L1401J0061N318j1367j3869r509j6133
15490d3460K6536K8916J4770O056j2028m435j1931k8334k9209o109L6456J1319
15478a1453J6191N247j6079j9507M584o486J9169J2460P377m4875o934J6457J9321
15465d528K5974P74m1476m3116K2601K8710K0278k9810j9595J1158K5313k1705
$$ plain form
15554 46183 30625 11703 -2068 -8921 -8239 -11386 -7349 16317 -9500 -30626 -30285 -39855 -23227
15541 -23227 -4600 -16361 -35286 -67442 -56154 -34465 -13742 -10027 -8962 4971 -6434 -22917
15529 -22917 -31507 -9851 8886 21802 24722 20702 27496 32069 25664 24691 -2606 -4895 -10173 -34620
15515 -34620 -25853 -18075 -12361 9948 18541 15134 -7172 -33068 -41924 -64482 -52364 -32004 -24883
15502 -24883 -21124 -35461 -45668 -50268 -39362 -7961 2100 7418 -3949 -17818 -27327 -43460
15490 -43460 -16924 11992 26762 32818 20790 16355 4424 -23910 -53119 -59228 -22772 -11453
15478 -11453 4738 9985 -6094 -25601 -21017 -27503 -8334 4126 11503 -33372 -40306 -23849 -4528
15465 -4528 21446 22220 -19256 -62372 -39771 -11061 9217 -20593 -40188 -29030 -3717 -25422
15453b5422j1634M99p225P44J7666K4315L2907j3614l1993n968J6374J3817J1821
15440B2287J0239l297j427o598j0853k1212j7150p617J4326K4689J872j9864j1952
15427b6557j5327J963J4777R367r571K26J0711O612j0945o043K1108j6025J4489
15414e215P430K721j0129k736k1783J3160K5337j2945k7501l749K8767K348l885
15401h180J6004K2237L639K110l5541k6161j9987M55J1737P652j1471J1964R802
15388a5740J4788J0045l6208r48j0952p967J2590K873n78j6239J2778j8476K7387
15375b6647K2315m6780k3220L4135K5779J5040j1782L860j0522l3166J748J9111
15363c0129J1543J1097L856k1023k01l744K23J957J3822N592j4403k2006j7788
$$ plain form
15453 -25422 -37056 -36557 -43782 -43038 -25372 -1057 31850 18236 -13757 -19725 -3351 10466 22287
15440 22287 32526 29229 27802 21204 10351 -10861 -28011 -35628 -21302 3387 5259 -14605 -26557
15427 -26557 -41884 -39921 -25144 -15777 -25348 -25122 -14411 -7799 -18744 -24787 -3679 -19704 -5215
15414 -5215 2215 4936 -5193 -7929 -29712 -16552 8785 -4160 -31661 -35410 -6643 -4295 -8180
15401 -8180 7824 30061 33700 35810 269 -25892 -45879 -45424 -33687 -26035 -37506 -25542 -15740
15388 -15740 -952 9093 -27115 -28063 -39015 -46982 -34392 -31519 -32097 -48336 -35558 -54034 -26647
15375 -26647 -4332 -51112 -74332 -40197 -14418 622 -11160 -7300 -17822 -50988 -49240 -30129
15363 -30129 -18586 -7489 -3633 -24656 -24857 -28601 -28378 -26421 -12599 -7007 -21410 -43416 -61204
15350f1204J2289R180M339j854K1756M678L3530J5562J9078m360k4392k0821p054
15337G27O522J9298P966j6262j282p593j338J0607k2947O581K5832o382N43J4034
15323C6306O119k1282l4063r718K6148j515j6549L123j292J4484L120q583J3660
15310I958N558k7980k8771J4816O240j4991o375n052k4668J04J8049L5273K9051
15297A1212K0418N244l0574m0607k3306o760l167L2837K2546R868j865j0704l7
15284a4895m369m858J8299J9380J577l154l5040k0615j787j59m136P223J7215
15271b5319p132M221J1909L6791J4940k3967J934l977j871N454k1805l1779l736
15258d4337m814J7533K9905q592J714j9211p126P44J1891Q033m909j1885J0457
$$ plain form
15350 -61204 -48915 -39735 -35396 -37250 -15494 -10816 22714 38276 57354 52994 28602 7781 727
15337 727 7249 26547 34513 18251 16969 9376 8038 18645 -4302 2279 28111 21729 22272 36306
15323 36306 42425 21143 -12920 -22638 3510 1995 -14554 -11431 -12723 1761 4881 -3702 9958
15310 9958 15516 -12464 -41235 -26419 -20179 -35170 -41545 -46597 -71265 -71161 -53112 -17839 11212
15297 11212 31630 36874 6300 -34307 -57613 -64373 -67540 -34703 -12157 -2289 -4154 -14858 -14895
15284 -14895 -19264 -24122 -5823 13557 15134 11980 -23060 -43675 -45462 -45621 -49757 -42534 -25319
15271 -25319 -32451 -28230 -16321 20470 35410 11443 13377 9400 7529 12983 -8822 -40601 -44337
15258 -44337 -49151 -31618 -1713 -10305 -8591 -27802 -34928 -34184 -22293 -14260 -19169 -31054 -20597
15245b0597K698l0500M246J7665O975Q425k1300j0029j5796R587J2797K6186J1608
15232A965m491r965l0702M810k673j4823Q356N5180o677n621j8888K3020J9304
15219A8795J9712K186k7431k1432K1688j5539l4100k241L284M06J0676J3252O732
15206d012M892n792q673j0841k3199L92P56k5401k0767P058K4407K2296J7825
15193b1059j0548Q30J3959O129n124J713R971k2344r945K6811M114J2742j7030
15180i781k5063K5496K2193j0305J706p841n035M694k3370j8838J0249M5005J4829
15167B3939k5735j8431J3761K3795j8577K0084J8821l3727l7357k4525L3552K2435
15155a965k2603q238q76J1316K8243K0581j263k910J282l341r586m58r629l868
$$ plain form
15245 -20597 -17899 -48399 -44153 -26488 -19513 -11088 -32388 -42417 -58213 -48626 -35829 -9643 1965
15232 1965 -2526 -12491 -43193 -38383 -41056 -55879 -47523 7657 980 -4641 -23529 -509 18795
15219 18795 38507 40693 13262 -8170 13518 -2021 -36121 -38362 -35078 -34672 -23996 -10744 -4012
15206 -4012 880 -4912 -13585 -24426 -47625 -47233 -46477 -71878 -92645 -85587 -61180 -38884 -21059
15193 -21059 -31607 -30777 -16818 -10689 -15813 -14100 -4129 -26473 -36418 -9607 -5493 7249 -9781
15180 -9781 -34844 -9348 12845 2540 4246 -3595 -8630 -3936 -27306 -46144 -35895 9110 23939
15167 23939 -1796 -20227 -6466 17329 -1248 18836 37657 3930 -33427 -57952 -24400 -1965
15155 -1965 -24568 -32806 -33682 -22366 5877 26458 25195 22285 23567 20226 10640 10182 553 -3315
15141c315k1576o295N858O50K6059M356j5050K073O06j9314j7963J4231N383m440
15127b8737M755J9172K8361J9283k0651l0134k2746j4380j6919K1902J9382k792
15115b3504m797Q606J7531K5728O061j4831J4077K419l698j6598r23j5491l5438
15102d0858O837L5984j4673J0782k8317J996M979r336J7058p512m4381R60M0427
15089b6054J5829L12J0299J3693R648j3710K486j6276l0389o2J7090M048Q227
15076d859j9266j7669L2388L952K56j3261J2662K4613j2691j8051k2558M62J148
15063c2874j4720j3907J5848K3074K474p604Q540K334K1456J2229o618j2055L839
15050B016Q937r987j1507J1372n240k5006q857J9670M3206N700k4032r36j8389
$$ plain form
15141 -3315 -24891 -31186 -25328 -24678 1381 5737 -9313 -7240 -6634 -25948 -43911 -29680 -24297 -28737
15127 -28737 -23982 -4810 23551 42834 22183 -7951 -30697 -45077 -61996 -40094 -20712 -23504
15115 -23504 -28301 -19695 -2164 23564 29625 14794 28871 31290 27592 10994 10071 -5420 -40858
15102 -40858 -34021 1963 -12710 -1928 -30245 -28249 -23270 -32606 -15548 -23060 -67441 -66481 -26054
15089 -26054 -10225 -9913 386 14079 23727 10017 12503 -3773 -34162 -34224 -17134 -13086 -4859
15076 -4859 -24125 -41794 -9406 -5454 -5198 -18459 -5797 18816 6125 -11926 -34484 -34022 -32874
15063 -32874 -47594 -61501 -45653 -22579 -20105 -27709 -19169 -16835 4621 16850 10232 -1823 2016
15050 2016 10953 966 -10541 831 -4409 -29415 -38272 -18602 24604 30304 6272 5336 -13053
15037a3053j2591K2719Q365j1236l526j2719M946j491N527J3378J3523k317o832
15024D693k2316j6666k273Q169j6959j6104L408N26J4044K3084n688j5961k7601
15011f9644L260j931J7759M766l1185M536J9003r686K9597J2427K1524j177k613
14998c364J0548J7692O668j8829j9458j7762l283m508J8618N888J401r581N331
14985a0639R374j721j5754k4616P971l397j0646J8254n251j1617J6982l416J5120
14972a9356K4536K5289j3689P062J2478k6910j4490k847j812K9308J958l3222
14960a1695L937n077N862j1551k157J292O202k0677J0174o147k1636J0594m587
14947d5466J424K2188N0711L5924k2706k4738j8373K872r100j1984k7421K2077
$$ plain form
15037 -13053 -25644 -2925 5440 -5796 -9322 -22041 -17095 -18586 -13059 319 13842 11525 4693
15024 4693 -17623 -34289 -36562 -28393 -45352 -61456 -58048 -57522 -43478 -20394 -26082 -42043 -69644
15011 -69644 -66384 -68315 -50556 -45790 -76975 -72439 -53436 -63122 -33525 -21098 426 -751 -3364
14998 -3364 7184 24876 31544 12715 -6743 -24505 -27788 -32296 -13678 -7790 -6389 -15970 -10639
14985 -10639 -1265 -2986 -18740 -43356 -35385 -38782 -49428 -31174 -36425 -48042 -31060 -34476 -19356
14972 -19356 5180 30469 16780 23842 36320 9410 -5080 -7927 -9739 19569 21527 -11695
14960 -11695 -7758 -12835 -6973 -18524 -20681 -19389 -13187 -33864 -23690 -29837 -51473 -40879 -45466
14947 -45466 -44042 -21854 28857 64781 42075 17337 -1036 1836 -7264 -19248 -46669 -24592
14935b4592J1192N553K374J0216j11k33J8412K790k4594p999j0416J8259O067
14922F918k214N219k3736j6838N944J5377N682j1875j8485n331J231O034O276
14909b5798r455j3140M315K6990k131j260J5372M266k716K5920m38K047k9793
14896e821l3841J1880K293J6925P026j5959j8277j7225p288k549k5639j8546K7083
14883g9938L3018K0058L7106N481j8960l752p150k892j4367j7064M388K146K0198
14870b1728q468N016J7326K5810j079q58q34j7269p881k8243j0199P279j886O750
14856c6264P117Q025K4052o481j5286k5742J8536O651j9499K0162K3338p607j4024
14843a7022R395J2862j2139O477J1741l0111l429L0972J6811j5826j8424j4659
$$ plain form
14935 -24592 -13400 -7847 -5473 4743 4632 4399 22811 25601 1007 -6992 -17408 851 6918
14922 6918 4704 9923 -13813 -30651 -24707 -9330 -3648 -15523 -34008 -39339 -38108 -32074 -25798
14909 -25798 -35253 -48393 -44078 -17088 -19219 -20479 -5107 -841 -3557 22363 21925 23972 -5821
14896 -5821 -39662 -27782 -25489 -8564 -1538 -17497 -35774 -52999 -60287 -62836 -88475 -107021 -79938
14883 -79938 -46920 -26862 10244 15725 -3235 -6987 -14137 -17029 -31396 -48460 -44072 -41926 -21728
14870 -21728 -30196 -25180 -7854 17956 16877 16019 15185 -2084 -9965 -38208 -48407 -41128 -43014 -36264
14856 -36264 -29147 -21122 2930 -3551 -18837 -44579 -26043 -19392 -38891 -18729 4609 -2998 -17022
14843 -17022 -7627 5235 -6904 -427 11314 -18797 -22226 8746 25557 9731 -8693 -23352
14831b3352J1771M931j8017k2412l241K0132l17o761KK8169l596K551N068j6706
14817b1778q320l252k26K553k052q993M828J0824j4428J0730O458N574m6324k9300
14803i3706L1011K7637P592l0767J3969J7702j4647r309J7216j124j4926j1459
14791f0811j535O791J0940j70q252j1503K1176L1539L417k2249j5901j3228J6844
14778d2942K9058n437l7087P551L3249J2809q533k1478l751J6269o080p348K2124
14765a1596K6960j4498L745J1043j4559k0451Q008r802l6046J0992K0799L879
14753b1526j3538j6468J270K0375J2819j3383N595r151l705K1643l248k5987L4965
14740a0339J0916q824p329j1205q655n65p454J6881J4913p707k7386j4331J8865
$$ plain form
14831 -23352 -11581 -6650 -24667 -47079 -50320 -30188 -30505 -37266 -37264 -9095 -12691 -10140 -5072 -21778
14817 -21778 -30098 -33350 -33576 -31023 -33075 -42068 -37240 -26416 -40844 -30114 -23656 -18082 -64406 -93706
14803 -93706 -62695 -35058 -27466 -58233 -44264 -26562 -41209 -50518 -33302 -34426 -49352 -60811
14791 -60811 -62346 -55555 -44615 -44785 -53037 -64540 -43364 -11825 -8408 -30657 -46558 -59786 -42942
14778 -42942 -13884 -19321 -56408 -48857 -15608 -2799 -11332 -32810 -36561 -20292 -26372 -33720 -11596
14765 -11596 15364 866 4611 15654 1095 -19356 -11348 -21150 -57196 -46204 -25405 -21526
14753 -21526 -35064 -51532 -50262 -29887 -17068 -30451 -24856 -34007 -37712 -16069 -19317 -45304 -10339
14740 -10339 577 -8247 -15576 -26781 -35436 -36001 -43455 -26574 -11661 -19368 -46754 -61085 -42220
14727d2220L1488J8940K65j2454L728L719J0578K1630j8916K535k2932j8263O009
14714a5893J4517N885K2276P303j1678j0032q47J1667j1351j2347l2715k537J7791
14701a7961l149j3247P26J1842k00l802j288N740j864J9946L1357J7408k3171
14688B2337j3406k943l318L932n423K328J1548k075m385q786j2818K0863J2262
14675B0116q515n69j5936r882L170j5236L43M423J474l873R525n393k4612J0868
14661c4097L2411Q419k846j4631J9205m375m904k2988j4267j1988n894J0716M912
14648d0327L0273l383l45J1669J3706L7140k2370l3283l1891O719j5530J1004
14636c6618J9426m733j0821o08j5282J818j0421K0921L3513o859Q254J5429q49
$$ plain form
14727 -42220 -10732 8208 8473 -3981 -253 3466 14044 35674 16758 19293 -3639 -21902 -15893
14714 -15893 -1376 4509 26785 34088 22410 12378 11531 23198 11847 -500 -33215 -35752 -17961
14701 -17961 -21110 -34357 -33631 -21789 -21989 -25791 -27079 -21339 -23203 -3257 28100 45508 22337
14688 22337 8931 5988 2670 6602 1179 3507 15055 12980 8595 -191 -13009 7854 20116
14675 20116 11601 11032 -4904 -14786 -11616 -26852 -26509 -22086 -20612 -24485 -14960 -20353 -44965 -34097
14661 -34097 -1686 6733 3887 -10744 8461 4086 -818 -23806 -38073 -50061 -55955 -45239 -40327
14648 -40327 -10054 -13437 -13782 -2113 11593 48733 26363 -6920 -38811 -32092 -47622 -36618
14636 -36618 -17192 -21925 -32746 -33354 -48636 -46818 -57239 -36318 -2805 -9664 -1410 14019 13170
14623A3170p662J5386N643R35M264m309j8547J1129L811n116j6473j1220N218
14610c771Q992m361k526j9318k9339k6021P656L7012Q564L2164Q413l2441k1891
14597c6867J0673K502j5469m594J0019K477J5389l6707j7998M520J6687J4222
14585c5146M054J6017L864j9242l635J886R822J8296k4914j3164J6238J0127J1401
14572d396J5040J247j4384k0105j7922J2742L8725Q12j2318k3006K077R947m244
14559a5785k8560j912K9086j8979J5006J5995o53q046r782j5592m111k4066M500
14546f2899J8059r345K6220N0190k2220l3910P432J7961P539J3450k6789k2598
14534c6910J7234l600j2905R041K669J9666O674l0639J668K8555L2102L451R803
$$ plain form
14623 13170 5508 20894 26537 27472 31736 27427 8880 20009 23820 18704 2231 -8989 -3771
14610 -3771 5221 860 -1666 -20984 -50323 -76344 -68688 -31676 -23112 9052 17465 -14976 -36867
14597 -36867 -26194 -23692 -39161 -43755 -33736 -31259 -15870 -52577 -70575 -66055 -49368 -35146
14585 -35146 -31092 -15075 -11211 -30453 -34088 -32202 -22380 -4084 -28998 -42162 -25924 -15797 -4396
14572 -4396 10644 11891 -2493 -22598 -40520 -27778 10947 11759 -559 -23565 -21488 -11541 -15785
14559 -15785 -44345 -46257 -17171 -36150 -21144 -5149 -5802 -13848 -23630 -39222 -43333 -67399 -62899
14546 -62899 -44840 -54185 -27965 22225 5 -33905 -26473 -8512 -973 12477 -14312 -36910
14534 -36910 -19676 -23276 -36181 -27140 -24471 -4805 1869 -28770 -27102 1453 33555 37006 46809
14521D6809j2024k4641m8373j6873M5375L2604L766m0686m946o134k0271J9364
14509b6030K2654R932m2447k8505k9762J5346L4792R186K0374R594K880N570K3636
14496B7220l2248j6270M9113R014o786k6815k5921Q617j043j9696j0812J6524
14484b9103K0986q138l0394J0232J1133k840n587K9175K2651K449j7744j2043
14472i223k3606J1919J758J8907J0460k0500J1414N179k9116r097J6855J8141
14460C091j3693j1036J2113J4095j4658j2802J5376K0898n589J1104N577O991
14448C1467J0975J848j5958j8212p683J7428j1377n02j0132p248p791r098K5703
14435e80n726r686k3593q998L9561J378j0811j0588O782M0631L1499n823k2288
$$ plain form
14521 46809 34785 10144 -38229 -55102 -9727 22877 26643 -14043 -18989 -25123 -45394 -26030
14509 -26030 -3376 6556 -35891 -64396 -94158 -78812 -44020 -34834 -14460 -4866 -1986 3584 27220
14496 27220 -5028 -21298 27815 36829 30043 3228 -22693 -14076 -15119 -34815 -45627 -29103
14484 -29103 -8117 -16255 -46649 -36417 -25284 -28124 -33711 -4536 18115 20564 2820 -9223
14472 -9223 -32829 -20910 -19152 -245 10215 -10285 1129 6308 -22808 -31905 -15050 3091
14460 3091 -10602 -21638 -9525 4570 -10088 -22890 -7514 13384 7795 18899 24476 31467
14448 31467 42442 44290 28332 10120 2437 19865 8488 7986 -2146 -9394 -17185 -26283 -580
14435 -580 -6306 -15992 -39585 -48583 -9022 -7644 -18455 -29043 -22261 18370 49869 44046 21758
14422B1758j4500j3620K3210L0316O221j4449k1837j3264j5603K898o402q106
14410b3378M943J8524J0851J6480R772p730r913k4443l4616j9896P841O783K0861
14397b3921k5551p939J7039m520N146K3677l425j3480K0946N984O634j872r015
14384a0297j212K1518K3074K597l4112l1343K704M967N277J06R215l514M591j0312
14370a6741j1759J265j4445J1405K5335L999K9K8096n693m620l395j6719k2743
14357b5986M826k4425j048L509R000p365K33J4613j5264K1002J3075M642P186
14344C998j506j5162k5749J334K5009J7955j4616k8246J5192L0540p062K0467
14332B2154Q467p513j9338k8955J011q308j1156j9909L168M6820J9059P392k4969
$$ plain form
14422 21758 7258 -6362 16848 47164 53385 38936 17099 3835 -11768 -8870 -15272 -23378
14410 -23378 -18435 89 10940 27420 37192 29462 19549 -4894 -39510 -59406 -51565 -44782 -23921
14397 -23921 -49472 -57411 -40372 -44892 -39746 -16069 -19494 -32974 -12028 -6044 590 -1282 -10297
14384 -10297 -11509 10009 33083 35680 1568 -29775 -27071 -22104 -16827 -16721 -7506 -11020 -6429 -16741
14370 -16741 -28500 -27235 -41680 -30275 -4940 -941 -912 27184 21491 16871 13476 -3243 -25986
14357 -25986 -21160 -45585 -46633 -43124 -34124 -41489 -41256 -26643 -41907 -20905 -7830 -3188 3998
14344 3998 2492 -12670 -38419 -37085 -12076 5879 -8737 -36983 -21791 8749 1687 22154
14332 22154 30621 23108 3770 -25185 -24174 -32482 -43638 -63547 -60379 -13559 5500 12892 -12077
14319a2077k5594J5629J8743o967l546j2702J3468K8782q752K731L755K315J2673
14306B8458j2943j912J9078J0593l289l2007o906J3056j1934m8577q261K85r086
14293f3445M494J5514N802M034j1551p632J2230J9763j6387n163j8662p673q513
14280g7189L1118J0692l0257L866P560K2650K4469o2N956j6495m0030J5686J3582
14267b8454q375J1666J4224O26n528J9090q287l8283j3462r95K6571N611k50J9366
14253f480q023J1349M470q128J4631M0465j1722l5629k943j8858J4187M014J4108
14240A1441N76r253M4106P311j2650j9960j451n34j1371o323Q157j7865o7232
14227g5048j5502J8200M5990L5163r147j5625K6565j3662J269l758j0323O529
$$ plain form
14319 -12077 -37671 -22042 -3299 -10266 -13812 -26514 -13046 15736 6984 9715 13470 15785 28458
14306 28458 15515 13603 32681 43274 39985 7978 1072 14128 2194 -46383 -54644 -54359 -63445
14293 -63445 -58951 -43437 -37635 -33601 -45152 -52784 -40554 -20791 -37178 -42341 -61003 -68676 -77189
14280 -77189 -46071 -35379 -65636 -61770 -54210 -31560 -7091 -7153 -1197 -17692 -57722 -42036 -28454
14267 -28454 -36829 -25163 -10939 -10313 -15841 3249 -5038 -43321 -56783 -57778 -31207 -25596 -25846 -6480
14253 -6480 -14503 -3154 1316 -6812 7819 48284 36562 933 -2010 -20868 -6681 -2667 11441
14240 11441 12017 2764 46870 54181 41531 21571 20120 19586 8215 1892 10049 -7816 -75048
14227 -75048 -90550 -72350 -26360 8803 -344 -15969 10596 -3066 -1797 -5555 -15878 -9349
14215i349l841j286N228P99N808J8030Q862q280j0555j850m1798K5k867j9926
14201f1000R981m154J6962o959j6667k5843K2959L4351P346M225L927O056j0530
14188a9346j0687k0860j0828M758K9394q22Q052J8064L4790Q620k9145j7813j7413
14175b3236k1698L125J3617r431M788j2135j9248J5772K3783K5152M681q912r293
14162a3035j9890O537K3516q166J559k4294K650J4003o107j4159q434J2650J1632
14149b1538j8177M489L102L3457K1661l4641k2586Q155l634L2843j0968n300m60
14136a3597k49m152R134M274l0086L452J2075J6517J3362l4134n340K6903K3750
14123B1909J0453J898j0483l7383r580j3707j0323K9331J1423j0050o743k7003
$$ plain form
14215 -9349 -13190 -14476 -9248 -8449 -2641 15389 24251 15971 5416 3566 -38232 -38207 -41074 -61000
14201 -61000 -51019 -55173 -38211 -45170 -61837 -87680 -64721 -30370 -23024 -18799 -14872 -8816 -19346
14188 -19346 -30033 -50893 -61721 -56963 -27569 -28391 -20339 -2275 32515 41135 11990 -5823 -23236
14175 -23236 -44934 -41809 -28192 -37623 -32835 -44970 -64218 -48446 -24663 489 5170 -3742 -13035
14162 -13035 -32925 -26388 -2872 -11038 -9479 -33773 -31123 -17120 -23227 -37386 -45820 -33170 -21538
14149 -21538 -39715 -35226 -32124 1333 22994 -11647 -34233 -26078 -29712 3131 -7837 -13137 -13597
14136 -13597 -13846 -17998 -8864 -4590 -34676 -31224 -19149 -2632 10730 -23404 -28744 -1841 21909
14123 21909 32362 34260 23777 -13606 -23186 -36893 -47216 -17885 -6462 -16512 -23255 -50258
14111e0258j0108J8156K1350L542J7381K0895J0573l094k2888l0275J0190Q684
14099e852r35j6729J0866J8941p243K708J4490J0966j7326q890J1726J5537j0915
14086A7344m46j0481j3578q762n901R276K2345J7138j141k4969j0775j5207k0668
14073d5825O329j1624J1062k344j1725K1824N3841K6522K5693q273l1887j6486
14061A7107j5649J2968K6497m015o085l1450m7676R801K841l1455K0768J1454
14049c4894P095L6334J7316j7434k2721j614Q186l3620j8430l454J4120L4880
14037a4236j5559k4819j0374K3450O785j0328J7059J7687K2629J1373Q562m1798
14025i569O668L9472L643j8955p899k6730l194K1010L1464M260R225K7067k8899
$$ plain form
14111 -50258 -60366 -42210 -20860 -17318 63 20958 31531 28437 5549 -24726 -14536 -5852
14099 -5852 -6787 -23516 -12650 6291 -952 1756 16246 27212 9886 996 12722 28259 17344
14086 17344 16898 6417 -7161 -15923 -21824 -12548 9797 26935 25794 825 -9950 -25157 -45825
14073 -45825 -39496 -51120 -40058 -42402 -54127 -32303 21538 48060 73753 65480 33593 17107
14061 17107 1458 14426 40923 36908 30823 -627 -48303 -38502 -35661 -67116 -46348 -34894
14049 -34894 -27799 8535 25851 8417 -14304 -15918 -7732 -41352 -59782 -63236 -49116 -14236
14037 -14236 -29795 -54614 -64988 -41538 -34753 -45081 -28022 -10335 12294 23667 32229 -9569
14025 -9569 -2901 36571 40214 21259 13360 -13370 -16564 4446 35910 40170 49395 76462 47563
14012D7563m4130k6085l977J6011J3399J6175o644R735M334R822l0064J0559j850
13999A4848j8396k0126j3317j1471K16O560K775J4140J9091J2240j3798K6346
13987A9108J5901p400k8858j8865j1331J1551m01P289K2314j039j8001K7821L4472
13974E2561l0822k4960j7177r804L2513M4988q419j3958n257N9o683M584J6604
13961C4229n106J0276j8758p827J8821q046j9426k514J1512K758q29R608k5667
13948i69J534J2872j13J4205M141K243J3652O1218L6325J4938N760J0409O631
13935A82846j8235j326l35l6551n6803k6815k1207J0774m354Q815p177j6771l147
13922I714k7155k0877K2889J1441j2688J1072q285O434N438l6910P247L4584k8593
$$ plain form
14012 47563 3433 -22652 -26629 -10618 2781 18956 12312 22047 26381 36203 6139 16698 14848
13999 14848 -3548 -23674 -36991 -48462 -48246 -41686 -38911 -24771 -5680 6560 -7238 19108
13987 19108 35009 27609 -1249 -20114 -31445 -19894 -20295 -13006 9308 8269 -9732 18089 52561
13974 52561 21739 -3221 -20398 -30202 2311 47299 38880 24922 19665 19724 13041 17625 34229
13961 34229 29123 39399 20641 12814 31635 23589 4163 1649 13161 15919 15090 24698 -969
13948 -969 565 13437 13324 27529 31670 33913 47565 108783 145108 160046 165806 176215 182846
13935 182846 164611 163285 162950 126399 69596 42781 21574 32348 27994 36809 29632 12861 9714
13922 9714 -17441 -38318 -15429 -3988 -16676 -5604 -13889 -7455 -2017 -38927 -31680 2904 -25689
13909b5689R639K2432J283k6724j102m090K2581J7751Q993K4388k457j3565k0483
13896A2957q158k4173K7073L6450J1554p461m254j3308j0928K0992k00n60M736
13883D4720r353J8084j90j5288l9714j6K228j7567k873J5028L84J0786m1k277
13869C911J1381k5574k2061j1127L5895R592K1R176q111J5652o971m963j4354
13856g533m577Q730j4851K3500J1957q994q591j130P922j1955J5152Q028J3051
13843C0709m149Q707k7181n442k0456j2043M869K9335r20J9438L903j2894n268
13830H608p483j1611L6280J7900k3433k1882j3087k0754m42J3045K3728J2512
13818A3381J4701k300l9258P244Q745j8219m990J8695Q986o353K0172o463j6567
$$ plain form
13909 -25689 -16050 6382 7665 -19059 -20161 -24251 -1670 16081 25074 49462 47005 33440 12957
13896 12957 4799 -19374 7699 44149 55703 48242 43988 30680 19752 40744 40544 39984 44720
13883 44720 35367 53451 53261 37973 -1741 -1757 471 -17096 -19969 -4941 -4557 6229 6188 3911
13869 3911 15292 -10282 -32343 -43470 -7575 2017 2038 11214 3103 18755 11784 6821 -7533
13856 -7533 -12110 -3380 -18231 5269 17226 8232 -359 -1489 6433 -5522 9630 17658 30709
13843 30709 26560 35267 8086 2644 -17812 -29855 -24986 4349 3429 22867 26770 13876 8608
13830 8608 1125 -10486 25794 43694 20261 -1621 -14708 -35462 -35904 -22859 869 13381
13818 13381 28082 25782 -13476 -6232 2513 -15706 -20696 -2001 6985 632 20804 14341 -2226
13805b226k544J3758J1844K26q015k512j3088K0590J7710j4245j6243r829r922
13792a4496J7877J2236n055j9818k6132j2012K2520K8944j5533J3577J4319l8428
13780b2001r359J6391J4875l724J328j8303l1005J6335J7401K9680P72k708N164
13767A4846L3176L066O767n690k9178j7976M39j4159j8445l6313j0703J6821M3440
13754a3909K9845j3002k7972j3110Q480M684k0820k0876j825L4236K1226J5959
13742B916Q204k1532J5795k1173k1829K561L1779K056M70O63Q922J2621O256j3973
13728A3736q003J5160m531O933M067k0372r799j778L0236J3207M720J44n462l202
13714C5056P321k4420j7681J779q28J836p222L8116J8231k7181k4080R5j0224
$$ plain form
13805 -2226 -4770 8988 20832 21058 13043 10531 -2557 18033 35743 21498 5255 -4574 -14496
13792 -14496 3381 15617 10562 -9256 -35388 -47400 -24880 4064 -11469 2108 16427 -22001
13780 -22001 -31360 -14969 -94 -3818 -2490 -20793 -51798 -35463 -18062 11618 12390 9682 14846
13767 14846 48022 51088 57855 52165 22987 5011 5450 -8709 -27154 -63467 -74170 -57349 -13909
13754 -13909 15936 2934 -25038 -38148 -29668 -24984 -45804 -66680 -68505 -34269 -13043 2916
13742 2916 11120 -10412 5383 -15790 -37619 -35058 -3279 -1223 -753 -90 8832 21453 27709 13736
13728 13736 5733 20893 16362 23295 27362 6990 -2809 -4587 25649 38856 43576 43720 38258 35056
13714 35056 42377 17957 276 2055 1227 3063 -4159 33957 52188 25007 927 1022 -9202
13701i202j232n394n309m535j22O567j5386L2822J8473j1353j6628k326j4290
13688b7915L1267K3124j8366j1938P167P980O956q02q272p370P801M040k0936
13675g264M082O198J2141o180j3387M741J7004j2466m869Q132m658O18k4476J5046
13661e338J0438j0862j6396k4658j3482r482J7272N563R168o66k2967J8426J4173
13648b8811J1856k304K938m425j0960J2038K747M6863J0453j7299k1337j076P600
13635H283J7273k430P897r33j3655N599J9144O941J426k1248j1727k2400j3061
13622a8891J3290J9730j0484K5553K3357j3963p307j9353j2369K0840J4511J4863
13610D9777J7463l06k3563j9494j5861J8436K5225k518l0746N300K1862J0768
$$ plain form
13701 -9202 -10434 -15828 -21137 -25672 -25794 -19227 -34613 -1791 16682 5329 -11299 -13625 -27915
13688 -27915 3352 26476 8110 -3828 3339 11319 18275 17473 9201 1831 9632 13672 -7264
13675 -7264 -3182 3016 15157 8977 -4410 331 17335 4869 0 8132 3474 4092 -20384 -5338
13661 -5338 5100 -5762 -22158 -46816 -60298 -69780 -52508 -46945 -37777 -38443 -61410 -42984 -28811
13648 -28811 -16955 -19259 -16321 -20746 -31706 -19668 -16921 29942 40395 23096 1759 683 8283
13635 8283 25556 23126 31023 30090 16435 22034 41178 48119 49545 28297 16570 -5830 -18891
13622 -18891 -5601 14129 3645 29198 52555 38592 31285 11932 -437 20403 34914 49777
13610 49777 67240 66934 43371 23877 8016 26452 51677 49159 18413 23713 45575 56343
13598E6343J2604p133k1578k7616p483m140J3542n86M64K4354o94j214K2139Q72
13584E9874q733j1421q502J2660P212j0296J2517Q358l5050k3774j4062j6833
13572b8050L5744K833k1554q819P352J3349R092j950p80j5470N41M50j816J8065
13558H987K5900L116j9245J1516m755j4122J2785k138J0732j3662k464J3308j4039
13545A5919p47k1433j2684J8894N771j0091L0022P806r795j4874q060l3670n24
13532c3466L0984L2025J2138J1236k8247j8990k425J4046r892j6046k1130n085
13520c4852R220J2158K0249K2955K0044p23l7321j4013m8j0139J4614J7858J2555
13507C2557l6427j6859j3273K4322J1165K5442J9260K2811J4661n1030l9491K0248
$$ plain form
13598 56343 68947 61814 40236 12620 5137 997 14539 13953 14417 38771 38077 36863 59002 59874
13584 59874 51141 39720 31218 43878 51090 40794 53311 61669 26619 2845 -11217 -28050
13572 -28050 7694 10527 -11027 -19846 -12494 855 9947 7997 7217 -8253 -7712 -7262 -9078 8987
13558 8987 34887 38003 18758 30274 25519 11397 24182 22044 32776 19114 16650 29958 15919
13545 15919 15172 -6261 -18945 -51 5720 -4371 25651 33457 23662 8788 728 -32942 -33466
13532 -33466 -2482 29543 41681 52917 24670 5680 3255 17301 7409 -8637 -29767 -34852
13520 -34852 -25632 -13474 6775 29730 49774 49051 11730 -2283 -2331 -12470 2144 20002 32557
13507 32557 -3870 -20729 -34002 -9680 1485 26927 46187 68998 83659 32629 -6862 13386
13495A3386J5239m758j395j1842j0609j490r300K6028j2233J2948J3558j926M345
13482C1951K6307J0682m6976l2925K266J9856N07j0256N577J955J6277K912k6023
13469B110m405O895J4141j0014N039L5272J3905n2560q530J4814j4420k7648r838
13456c5239N230J1402O917K959J4178J3381J482J0157l6645J561J1668N658k5277
13443a2568K2411K224J7257K0161j1008k6850j9453k0496L1492K2184k571j5346
13431G437j4326K0013m276J4932j0708j1481N397l888l2440O750J8978M236k7291
13418b6667J8229m421o291k3263P268L1148L0823k641l399j4032M578J3919O723
13405C1974j6559o162o192j7574q119K9526O845j6924J8657J5413K761R914R602
$$ plain form
13495 13386 28625 23867 22472 10630 21 -1469 -10769 15259 3026 15974 29532 27606 31951
13482 31951 58258 68940 21964 -10961 -8695 11161 11668 1412 6989 8944 25221 28133 2110
13469 2110 -2295 4600 18741 8727 13766 49038 62943 10383 1853 16667 2247 -25401 -35239
13456 -35239 -30009 -18607 -11690 -8731 5447 18828 20310 30467 -6178 -4617 7051 12709 -12568
13443 -12568 9843 12067 29324 49485 38477 11627 -7826 -28322 3170 25354 22783 7437
13431 7437 -6889 13124 8848 23780 13072 1591 6988 3100 -29340 -22590 -3612 624 -26667
13418 -26667 -8438 -12859 -19150 -42413 -35145 -3997 26826 24185 20786 6754 11332 25251 31974
13405 31974 15415 9253 3061 -14513 -22632 6894 13739 -3185 15472 30885 33646 43560 53162
13392E3162J4659K1034n310j3758k4575l3396j4303j6941J3062K2225J134j7363
13380c70L282J5452J4046J4129j573j1897O083l42J946j2507m182j9911K5614
13367B9770K0179K113M766k517K1098k2442l1317j8354J8818K7798p28L3724p780
13354G5128k4037J5403J007j0795k0001O552m121l436j5301j1927L3047K0993
13342F2512r646j0756n942k0727M842l2458O136J6466M027k0687p606l4402P953
13329d0288L2743O830R159m024L2578L0947K440k1065j3892k433j8885k9778j2208
13316b7876M213P237j0346J233K2223K1172m379q223J314J8011o11K783L993l860
13302B6884k3414K022L8559j0130J2890p855K9394N173l2631N505r930l3851j5346
$$ plain form
13392 53162 67821 88855 83545 69787 45212 11816 -2487 -19428 -6366 15859 16993 -370
13380 -370 2912 18364 32410 46539 44966 33069 39152 38810 40756 28249 24067 4156 29770
13367 29770 49949 52062 56828 54311 75409 52967 21650 3296 22114 49912 49184 82908 75128
13354 75128 51091 66494 67501 56706 36705 43257 39136 35700 20399 8472 41519 62512
13342 62512 52866 42110 36168 15441 20283 -12175 -6039 10427 14454 -6233 -13839 -48241 -40288
13329 -40288 -7545 -715 8444 4420 36998 67945 70385 49320 35428 32995 14110 -15668 -27876
13316 -27876 -23663 -16426 -26772 -25539 -3316 17856 13477 5254 6568 24579 23968 26751 30744 26884
13302 26884 3470 5492 44051 33921 46811 38956 68350 73523 40892 46397 36467 2616 -12730
13289a2730j932J2338L1215K1304J2723n660k2198j3751k6300j250K3140O861
13277B3760L1519P042j5123M451K957q445j4690j4921j8264P482J8559l880r249
13264A1198N82L510J2244r524l282R729l341j0964J0536p7p005J3727J9465K1223
13250F8021k498M350N99l6318j1656J8502j6184j6781J5362J8147L3828j8173
13238E7199j9488q266k4836L394M702o255J5441M360j8055L8337k38L327m938
13225D4684k0824J6130M025Q508o572k6923k1533J1524J5463J6681l048K6638
13213F4753M158k6570J7325O792k0621l0698N719J4995J6325J2921j4396N393
13201E6096R399k2363o819J761j5005J7535N064o562j186o656l795J7300j1440
$$ plain form
13289 -12730 -14662 -2324 28891 50195 62918 57258 35060 21309 -4991 -6241 16899 23760
13277 23760 55279 62321 47198 51649 54606 46161 31471 16550 -1714 5768 24327 20447 11198
13264 11198 11780 15290 27534 18010 14728 24457 21116 10152 20688 20611 13606 27333 46798 68021
13250 68021 65523 69873 70472 34154 22498 41000 24816 8035 23397 41544 75372 57199
13238 57199 37711 29445 4609 8003 12705 6450 21891 26251 8196 46533 46295 49622 44684
13225 44684 23860 39990 44015 52523 45951 19028 -2505 9019 24482 41163 38115 64753
13213 64753 68911 42341 59666 66458 45837 15139 20858 35853 52178 65099 50703 56096
13201 56096 65495 43132 36313 38074 23069 40604 45668 39106 37920 31264 27469 44769 33329
13188C3329k4083o558Q550n302j0259L2368N1849L956N479k102l3880l890j3835
13175C5622q225j2342K611J0287j0980L9697J2680k0930p023J6717K6445j1106
13163G3453q284k7435j3147k800J935o091k049M970L5433J0647j2969R522K1886
13150H5071j2120q673j3335j464k83o265k7448j0151K9375J8779M430K41o393
13137E1764j4923J2295R979J9504J3491m1300r44J5675j233k1006j6947m344J3821
13124C5832k037L079J4438j222o269j8823J0879J6822o240J3290K100k5125j5722
13111B1002K6315K164J2417O161r045n566J1901N309J7616J1791j3560j897l317
13098H1291K153n964R483L3233O279k0656k2441M667j9645r473n129O184L6962
$$ plain form
13188 33329 9246 2688 11238 5936 -4323 28045 79894 83850 89329 87227 53347 49457 35622
13175 35622 27397 15055 17666 27953 16973 56670 69350 48420 41397 58114 84559 73453
13163 73453 65169 37734 24587 21787 23722 17631 15582 20552 55985 66632 53663 63185 85071
13150 85071 72951 64278 50943 49479 49196 42931 15483 5332 34707 53486 57916 58157 51764
13137 51764 36841 49136 59115 78619 92110 50810 49866 65541 64308 43302 26355 22011 35832
13124 35832 33795 36874 51312 50090 43821 24998 35877 52699 46459 59749 61849 36724 21002
13111 21002 47317 49481 61898 68059 59014 53448 65349 70658 88274 100065 86505 84608 81291
13098 81291 83444 77480 86963 120196 126475 105819 83378 88045 68400 58927 53798 59982 96944
13085I6944n722l843L258K3091j7829k4764r184N039r196L588J098o469r922Q082
13071E4171J9948J29K7655N4033O5166O5943M0030R40o8836o2544j7103l7014
13059A42518m3777j0796j6214Q734N957n435O32R805J4741J0998k4522j1848M132
13046H4925J0191J2286j2504q421n192m651n703K5684K6207K523m4367k496Q229
13033H6711j370K781R107L559L1052J2689K0140K3612M0717P7757Q9450J26931
13021E23136J58992Q1989l0351q9028j07751j20351j14882p6466n4807l8899l8906
13010I2676k468k384R56J1439K814k6961j2048J1704R937p187J3107j5807l4496
12997D1282j0616J2661j125q354J7161J3785K2472p156m912K630L8145k921j4543
$$ plain form
13085 96944 91222 87379 90637 113728 95899 71135 61951 66990 57794 61382 62480 56011 46089 54171
13071 54171 74119 74248 101903 155936 221102 287045 327075 328015 259179 196635 179532 142518
13059 142518 98741 87945 71731 80465 86422 80987 81619 91424 106165 117163 92641 80793 84925
13046 84925 95116 107402 94898 86477 81285 76634 70931 96615 122822 125345 80978 78482 86711
13033 86711 85341 88122 97229 100788 131840 144529 164669 188281 228998 306755 396205 523136
13021 523136 682128 764117 733766 644738 536987 416636 301754 225288 170481 131582 92676
13010 92676 90208 87824 88780 100219 103033 76072 64024 75728 85665 78478 91585 75778 41282
12997 41282 30666 43327 42202 33848 51009 64794 87266 80110 75198 77828 115973 113052 98509
12984I8509J9093J1884m520L132O4022N9258P9837J86178J77095J14824j0757
12973G98555j13950j51411j54026j07013l2109m8514l6523L744J8200P602k166
12962A82389k1677n285j1734k3994k7667j3028L3544o935r323j2610j3509J2521
12950H2692J6765L429r752P084K10M278J9862J544p382J6766j0481j2317P13J7691
12936A31102k450O009L4646M8758K9586O4031N1818r373o7290m5114n038j9763
12924B16922n6239j9697n060L1551k8009j6850p287k560j5996o187j1659O26J790
12911H1345k0370J950J5692J2522J1821j893j7004j5602k1682n770L419R240l0432
12898B3236r075K0333M2402R671k1621r636J1401J3262J590j8308o336L1193K4769
$$ plain form
12984 98509 117602 129486 124966 128098 192120 251378 331215 517393 694488 809312 798555
12973 798555 684605 533194 379168 272155 240046 191532 155009 158753 176953 184555 182389
12962 182389 160712 155427 143693 119699 92032 79004 112548 105613 96290 83680 70171 82692
12950 82692 99457 102886 93134 100218 100428 104706 124568 126112 118730 135496 125015 112698 113411 131102
12936 131102 128652 134661 169307 218065 247651 311682 363500 354127 286837 241723 236685 216922
12924 216922 160683 140986 135926 167477 139468 122618 115331 112771 96775 90588 78929 79555 81345
12911 81345 60975 62925 78617 91139 102960 101067 84063 68461 46779 41009 44428 53668 23236
12898 23236 14161 34494 76896 86567 64946 55310 66711 79973 81563 63255 56919 88112 112881
12885A12881l873j7738j6869J1689j4009r431J2778Q089L976j3866j5440J6259
12873G4446J0457K2117l217J9017J9721k5787J1238L9286J8259m631M2203J2479
12861B35588j4672j4917k5606k8298j7067P656M812J285r588m915L983j2812J075
12848A26524J6957j664k8091O149j1602M537J6855j929j3548r202k5683J6005
12836I5308M619j3950p662R891N510K8285M3696k3927j6039K3374P755k5932J1275
12823A42203j282k9280k4344N531L0745K7448Q607j6208k6788j7174J6378M025
12811A19861r591m907J851J0223r966J0768M997J5924m826k5007k062J6598P192
12798A31055j9823L429J95J0395N63j9219j2576N340j1771j2971J0120P219K3301
$$ plain form
12885 112881 109008 91270 74401 86090 72081 62650 75428 83517 87493 73627 58187 74446
12873 74446 84903 107020 103803 122820 142541 116754 127992 167278 185537 180906 223109 235588
12861 235588 220916 205999 180393 152095 135028 142684 147496 148781 139193 134278 138261 125449 126524
12848 126524 143481 141817 113726 119875 108273 112810 129665 127736 114188 104986 79303 95308
12836 95308 99927 85977 78315 88206 93716 122001 165697 141770 125731 149105 156860 130928 142203
12823 142203 140921 111641 87297 92828 123573 151021 159628 143420 116632 99458 115836 119861
12811 119861 110270 105363 107214 117437 107471 118239 123236 139160 134334 109327 107265 123863 131055
12798 131055 111232 114661 114856 125251 125814 106595 94019 99359 87588 74617 84737 91956 115257
12785A15257M363p852K982q458r765j7157q132J0873J6282J0341o099J4799J442
12772A18876k7880p901J184J8414P68M542p310j1653K1936J468j0444j7951o352
12759G7697J8567M1694m695l1241j75k1151l1470K4962K2055J4166j7186j1832
12747H1391q229n307K7962m9j6174M921Q444L395j3731q416J2986j758J689r656
12733G7468J7917J7802P392j4034k6497j2730K9605J8372L676J69p659j2877J9226
12720A17830K0264L533p74J5400q571k1312l1196n686J094J5260L5487J4367K907
12707A58603k7744j6783l282K5919k2194N270K3229O131p258j0012j0193q733
12695A12953N306k3633K1344K6078L75j288J578O71k7523j1148N530J642p924
$$ plain form
12785 115257 119620 111768 114750 106292 96527 79370 71238 82111 98393 108734 102635 117434 118876
12772 118876 90996 83095 84279 102693 103461 108003 100693 89040 110976 112444 102000 84049 77697
12759 77697 96264 137958 133263 102022 101847 80696 49226 74188 96243 110409 93223 81391
12747 81391 73162 67855 95817 95768 79594 84515 92959 96354 82623 74207 87193 85435 87124 77468
12733 77468 95385 113187 120579 106545 80048 67318 96923 115295 118971 119140 111481 98604 117830
12720 117830 138094 141627 140853 156253 147682 126370 95174 89488 90582 105842 141329 155696 158603
12707 158603 130859 114076 110794 136713 114519 119789 143018 149149 141891 131879 121686 112953
12695 112953 118259 94626 115970 142048 142423 141135 142713 143384 115861 104713 110243 111885 103961
12682A03961j2783J382n592L2164J5286J5301l107J447J2738K4649P318m2024
12670A50740l2487l923J7502J445j2361J1545L0995N1532k1912l5538m0001j4985
12658A02552j1636J9604J923M687K0251J0369M518m280j0571j7701R619j5092
12646A14243j8717K5075K7276l159j1249J4634k1329j6507J9976J8806J0050j0980
12634A48119O355J9417L593l640k0931K109p894K367L0732R902J855k1550k1396
12621A49038j431j931l778j1668p272J0372q287R721j3127k3162L598j268L4719
12608A35524M1649K7123J4473m0911k8929j8844J904J0274J8145Q623j257k6744
12596A41030l407j2437j4060P95M288J2448j0999q547J0433N31P653j3557J1928
$$ plain form
12682 103961 91178 92560 86968 119132 134418 149719 146612 148059 160797 185446 192764 150740
12670 150740 118253 114330 131832 133277 120916 132461 163456 214988 193076 157538 117537 102552
12658 102552 90916 110520 112443 117130 137381 147750 152268 147988 137417 119716 129335 114243
12646 114243 95526 120601 147877 144718 133469 148103 126774 110267 130243 149049 159099 148119
12634 148119 154474 173891 177484 173844 152913 155022 147128 149495 180227 190129 191984 170434 149038
12621 149038 147607 145676 141898 130230 122958 133330 125043 134764 121637 98475 102073 100805 135524
12608 135524 177173 204296 218769 177858 148929 130085 131989 142263 160408 169031 167774 141030
12596 141030 137623 125186 111126 111921 116209 128657 117658 109111 119544 120075 127728 114171 126099
12583A26099m303m8667j0506L1864L3272j297L694M976J5134J3613K6224K831
12571A92934j9609r677j4981k7468k56J0438l362j6385J5379L8841r22k120k0770
12558A42042k58K7547K1369j605J2363k464l7515j9228J5014K9663J006K218P162
12545A97314m662K6565K5570k7441l1986k2537j8649j1248K824L834K006K3589
12533A65179J2376K0099j0925l438j383l1970K861K8377R541j037L022J323k2985
12520A71040k0403j1259P557L504r29J5497k911J8473r240j9818J1901j8429l126
12507A41857j2480J1685O599k9615O773J8309J9606K8312Q709j9698l3176l1581
12495A15300K9272m904o173J3827J4839L441J8452J248k1846N339n332k3175K0943
$$ plain form
12583 126099 121796 73129 62623 94487 127759 126462 130156 135132 150266 163879 190103 192934
12571 192934 173325 163648 148667 121199 120943 131381 128019 111634 127013 165854 164932 162812 142042
12558 142042 141784 169331 190700 189095 201458 198994 161479 142251 157265 186928 187934 190152 197314
12545 197314 192652 219217 244787 217346 185360 162823 144174 132926 135750 139584 141590 165179
12533 165179 177555 197654 186729 183291 181908 149938 152799 181176 190717 189680 192702 194025 171040
12520 171040 150637 139378 146935 150439 149510 165007 162096 180569 171329 151511 163412 144983 141857
12507 141857 129377 141062 147661 118046 124819 143128 162734 191046 199755 180057 146881 115300
12495 115300 144572 139668 133495 147322 162161 165602 184054 185302 163456 168795 163463 140288 161231
12482A61231R835P124L014k091r898n407k0928j2869K1995K1492J086R499r835
12469A74248J7618J1661j0675q744j8158R606j7194K17K2404j3983J2792J4754
12457A94546j5112j6178j0854j309N502J5382K2204j986O785J841j7010m0839
12445A42972J1186M5516m547o669J0707k139j9870k3630j0835N4189K1475K91
12433B18646j895Q312q882j6254k0012j4983j2016J1646r387n475M508M755K990
12420A61953O367m31P537M01J2659K142j3547k3984N616j1146k669l489P305K8989
12406A77703o424q967J3284N333K4535J6763n374j0196R292O806j1354j5962J4762
12393B10201k1352k5920M628J620M107N335N555k1806K565J9984N156J949j260
$$ plain form
12482 161231 171066 178190 181204 179113 169215 163808 142880 130011 152006 173498 174584 184083 174248
12469 174248 191866 203527 192852 184108 165950 175556 158362 158579 180983 167000 179792 194546
12457 194546 179434 163256 152402 151093 156595 171977 194181 192195 198980 200821 183811 142972
12445 142972 154158 199674 195127 188458 199165 197026 177156 153526 142691 196880 218355 218646
12433 218646 216751 225063 216181 199927 179915 164932 152916 164562 155175 149700 154208 158963 161953
12420 161953 168320 167889 175426 175827 188486 190628 177081 153097 158713 147567 144898 141409 148714 177703
12406 177703 171279 162312 175596 180929 205464 222227 216853 206657 215949 222755 211401 195439 210201
12393 210201 188849 162929 167557 169177 173284 178619 184174 162368 164933 184917 190073 192022 190762
12380A90762J827J3701O968n422j227o281q877L698M0731K6873j6969k3676o357
12367B15751k222j6721j1931L2985K3847j707l4291K891K6499P092k3230l3698
12355A85265J5527K730j4080k2797j2013K2371J460j9309j4044o286K3093P635
12343A69552M3233k1852j0688J6860o924j0084j4464j3424R680K4474o431o095
12331A73837j517K2411K0307j6243j7682Q098K984k9386L712L5300K2640j8381
12319B06080j6326K2920q735j6361k1258Q909K2938j0934k5497J214L278n70j9433
12306A46225J9204J4245q443K4564J6496j3771p350q717R89K3022q285r477K9643
12293B18345K3853P310K4657J5925j2599k0130K03N822k0326l0063o35j9879j271
$$ plain form
12380 190762 192589 206290 213258 207836 206609 200328 191451 195149 235880 262753 245784 222108 215751
12367 215751 213529 196808 184877 217862 241709 240002 205711 208602 235101 242193 218963 185265
12355 185265 200792 203522 189442 166645 154632 177003 178463 159154 145110 138824 161917 169552
12343 169552 212785 190933 180245 197105 190181 180097 165633 152209 161889 186363 179932 173837
12331 173837 172320 194731 215038 198795 181113 189211 192195 162809 166521 201821 224461 206080
12319 206080 189754 212674 203939 187578 166320 175229 198167 187233 161736 162950 166228 165658 146225
12306 146225 165429 179674 171231 195795 212291 198520 191170 182453 183442 206464 198179 188702 218345
12293 218345 242198 249508 274165 290090 277491 257361 257564 263386 243060 212997 212362 192483 191212
12280A91212Q125J714j0615j4040K581K1066Q196k523p672J5393k360m0056K443
12267A73464K825M165j0887O750j1311J8963K6802J3859p808n912k2876m692J8437
12254B01779K1911j5359k1785j6933O789l346J1136Q801K1782K2473k9525l4436
12242A73287o380K9266Q70m2486j087J8862M735K426J5509K1655J3532L062j1543
12229B21708j7798j8078J3660K0580j1041l3681k826K5816J2467l3280j8423K1423
12217A80527K0962j895J075J4657J5125k5486L14m331K8279J6015k1273n612j5139
12204B03218m927J304K8765L4714K667j6937l9195j5039J7015L139q64j5197j0957
12191A87706K3349M0931L2449j9148o692J3069j3802j6929k733J2115K4377M475
$$ plain form
12280 191212 199337 201051 190436 176396 178977 200043 208239 205716 198044 213437 211077 171021 173464
12267 173464 176289 180454 169567 176317 165006 183969 210771 224630 216822 210910 188034 183342 201779
12254 201779 223690 208331 186546 169613 176402 173056 184192 192993 214775 237248 207723 173287
12242 173287 166907 196173 197043 154557 153470 172332 177067 179493 195002 216657 230189 233251 221708
12229 221708 203910 185832 199492 220072 209031 175350 172524 198340 210807 177527 159104 180527
12217 180527 201489 199594 200669 215326 230451 204965 205279 200948 229227 245242 223969 218357 203218
12204 203218 198291 199595 228360 263074 265741 248804 209609 194570 211585 214724 213860 198663 187706
12191 187706 211055 251986 284435 265287 258595 271664 257862 240933 238200 250315 274692 279167
12179B79167j6230R943j5093k3435k7940k5693P876J7509J2693J3396k861R987
12167B39319O499N502j0825j2878n406q660j224J1486J2489k095j0463j965J0990
12154B32769K4744R958j1828j2105n771O08J732q954m935j0290j3156M214K9411
12141B36397o084k1834Q747r797j3086K9562J1189k3816K3506k094R445J435k3458
12128B20112J1479j0448o50%k1357k5757M600J8577j350K7194J8833k1550J4077
12115B33760J3672J3402J4359J6624j7933o0588q856n743j2954j3386K6981J0122
12103B09460Q680K1370K3059L0894j6467n6317m589J0764M533J8362r342J4942
12091B55349j0315j1919k5207l5879J335P878R550q015K2357q20L0390J7421j7784
$$ plain form
12179 279167 262937 272880 257787 234352 206412 180719 188595 206104 218797 232193 229332 239319
12167 239319 245818 251320 240495 227617 222211 213551 212327 223813 236302 234207 223744 221779 232769
12154 232769 257513 267471 255643 243538 237767 238375 240107 231153 226218 215928 202772 206986 236397
12141 236397 230313 208479 217226 207429 194343 223905 235094 211278 234784 232690 242135 243570 220112
12128 220112 231591 221143 220493 220493 199136 173379 177979 196556 195206 222400 241233 219683 233760
12115 233760 247432 260834 275193 291817 273884 213296 204440 198697 185743 172357 199338 209460
12103 209460 218140 239510 262569 293463 276996 220679 216090 226854 231387 249749 240407 255349
12091 255349 245034 233115 207908 172029 173364 181242 190792 182777 205134 204314 234704 252125 234341
12078B34341j4999R797k2085k6391P781R984P191P900J069n546k724J4894N270
12065B26482J5590N109j5074k0739P444J597j5617k9246K6055m651j8419J0870
12053A89401K529j0905M416K1896l79J5104K547J0895M6351j8512j3391J1703
12041B61655j6581k6556j0815K4289O384j8182k1600Q984n786J0463J7625r903
12029B19977j4339l4752M443K4201p076K8251M498M97k6025l9169J2084K2706
12017A95296J3943j951l959J2007J0405j8424j6143J5533p407J2651O244j0341
12005B07854J1098k682K816j0056J1676q763r554k0707k4032J0936K3181k47o348
11992A85172J6857J9900p210j666n091q980M105M0171l348j518k883k8580K432
$$ plain form
12078 234341 219342 229139 207054 180663 188444 198428 205619 213519 214588 209042 206318 221212 226482
12065 226482 242072 247181 232107 211368 218812 220409 204792 175546 201601 196950 178531 189401
12053 189401 191930 181025 185441 207337 206958 222062 224609 235504 281855 263343 249952 261655
12041 261655 245074 218518 207703 231992 238376 220194 198594 207578 201792 212255 229880 219977
12029 219977 205638 170886 175329 199530 192454 220705 225203 225700 199675 160506 172590 195296
12017 195296 209239 207288 203329 215336 225741 207317 191174 206707 199300 211951 218195 207854
12005 207854 218952 216270 219086 209030 220706 211943 202389 181682 157650 168586 191767 191520 185172
11992 185172 202029 221929 214719 213053 207962 198982 203087 243258 239910 238392 235509 206929 209361
11979B09361J1840J3291K6088j0277l069l2999k5310j9286L1959K9585p695l129
11967B20359N95l3043j1435j2877j096k8241K6484L7830O51N497j1021J5257J1126
11954B20086k5426J706L692j1285j5849J8690k765P992j4227p316J5723K3537
11942B14558R141l6116k8182O81Q733N552O674K3496J045N828j3458J9376J7226
11929B34554M161j1569j9004p315j0076k742l9873J3126K5259Q652k326p636j1360
11916A73851K731M0238J0139r948M974l461j0401j1158J365l1536N954M694j0116
11903A67326l134J5086J8346k5066k494o631R019K5561J1416k3511j1556O288
11891A80650l4075P140K8018L0883P801N317r920k5170J3964L0936n757l3043
$$ plain form
11979 209361 221201 234492 260580 250303 247234 214235 188925 169639 201598 231183 223488 220359
11967 220359 220954 187911 176476 163599 162503 134262 160746 198576 199227 204724 193703 208960 220086
11954 220086 194660 196366 200058 188773 172924 191614 188849 196841 182614 175298 191021 214558
11942 214558 223699 187583 159401 160082 168815 174367 181041 204537 205582 211410 197952 217328 234554
11929 234554 238715 227146 208142 200827 190751 188009 148136 161262 186521 195173 192847 185211 173851
11916 173851 176582 216820 226959 217011 221985 218524 208123 196965 198330 166794 172748 177442 167326
11903 167326 164192 179278 197624 172558 170064 163433 172452 198013 209429 185918 174362 180650
11891 180650 146575 153715 181733 212616 220417 225734 215814 190644 204608 235544 229787 196744
11879A96744l2736k1656j2829L524J6839o715r991K1920J2194N14j4418J8677
11867A72067l676j3290O375R640K8883R226j3982m0130j0146J8760q484J550P804
11854A64597n698j5714J4593J9J7546j4461j5164l932J270J3304O677J0975j943
11841A72069n561l1715J952Q674n949j3608K9235L4924K080j6970o791K517J4766
11828A85623L938K751k1131m001K6058Q251K9489j2550k5235J597l391m1L036
11815A94394j0020n444j7456J824J253n701m905p706M265J1690R181Q955O005
11802A86335j512j9435p93L3632M3931k4738j8780j4925k1490R202L6203N063
11790B12693n4286l2101R510p980j3637Q477M3555K5458j2473j4766k420O151
$$ plain form
11879 196744 164008 142352 129523 133047 149886 143171 133180 155100 167294 167808 153390 172067
11867 172067 168391 155101 161476 171116 199999 209225 195243 155113 144967 163727 155243 156793 164597
11854 164597 158899 143185 157778 157797 175343 160882 145718 141786 143056 156360 163037 174012 172069
11841 172069 166508 134793 136745 145419 139470 125862 155097 190021 192101 175131 168340 170857 185623
11828 185623 189561 192312 171181 167180 193238 201489 230978 218428 193193 194790 191399 191358 194394
11815 194394 184374 178930 161474 163298 164551 158850 153945 146239 150504 162194 171375 180330 186335
11802 186335 184823 165388 164595 198227 242158 217420 198640 183715 162225 171427 207630 212693
11790 212693 158407 126306 135816 127836 114199 122676 166231 191689 179216 164450 162030 168181
11778A68181m0933j631R405k367J5238M041j574K4012N642R168l908j2014j0239
11765A63021p693J8096l0592q518J2710K5278P070k2946k0612K5135J0715P402
11753A79066j8913j0536l1247j3239K5972k7771o024J6785J5877k1969k615j3458
11741I1928L705L7143J0153r610k6991J0367K1662j9020j0469K6577N0163k0074
11729A65534k7685n941M675J549J6020n089k1838k3421K6499J6025R512J4889
11717A70729j6775J840M106j0594k6876J518n323j6329K0219J2402q446L126L738
11704A33335j2233r915J4374K368K3918M21j0682k6005n983P819J4367L285M331
11691A39400m822j4928k1164J2080O923o585N230L280j4795k3681k3178l463J1624
$$ plain form
11778 168181 127248 125617 135022 132655 147893 151934 150360 174372 180014 189182 185274 173260 163021
11765 163021 155328 173424 142832 134314 147024 172302 179372 156426 135814 160949 171664 179066
11753 179066 160153 149617 118370 105131 131103 103332 97308 114093 129970 108001 105386 91928
11741 91928 95633 132776 142929 133319 106328 116695 138357 119337 108868 135445 185608 165534
11729 165534 137849 131908 136583 138132 154152 149063 127225 103804 130303 146328 155840 170729
11717 170729 153954 155794 159900 149306 122430 123948 118625 102296 122515 134917 126471 129597 133335
11704 133335 121102 111187 125561 127929 151847 152268 141586 115581 109598 117417 131784 135069 139400
11691 139400 134578 119650 98486 110566 117489 110904 116134 119414 104619 80938 57760 54297 65921
11678F5921J6789L9373J3948k1035l2530M222J3999K3983r982j0308L4742J826
11666A40948m4796k9904O930J6793K5490K2805j4703j7529J935M3021J3459L211
11654A67660l0830j9618K757j4098J1515j415j9603q350j8997J0892J0579J0297
11642A00789J3166q688M833J1597j4723p418p995m474q78R620O679Q421k73k711
11628A07945j0789M646j8475k0164N922K3138J6770j5263R03J0282K4074L26M018
11615A33333k9465k2832J0970j7363p126K4205j4955j5415p52K737p971q770m505
11602D2091o091J9373J7271K561q852j4589J399R907q195j6223J939l350K6556
11589F3797R089j4294k3705j0920p396L588M2446J6533j0618J1572Q409j2375
$$ plain form
11678 65921 82710 122083 136031 114996 82466 86688 100687 124670 114688 104380 139122 140948
11666 140948 96152 66248 73178 89971 115461 138266 123563 106034 107969 150990 164449 167660
11654 167660 136830 117212 119969 105871 117386 115971 96368 88018 69021 79913 90492 100789
11642 100789 113955 105267 110100 121697 106974 99556 91561 87087 86209 95829 102508 110929 110656 107945
11628 107945 97156 101802 83327 63163 69085 92223 108993 93730 94633 104915 128989 129315 133333
11615 133333 103868 81036 92006 74643 67517 91722 76767 61352 60600 63337 55366 46596 42091
11602 42091 36000 55373 72644 75205 66353 51764 53163 63070 54875 38652 40591 37241 63797
11589 63797 72886 58592 34887 23967 16571 20159 62605 79138 68520 80092 88501 76126
11577G6126Q942L037J7900n23j414j3229j8083n998O012n862k2102j7577L6532
11564F3761J6772J934N71r209n691L919j5987l83m563q42P862N255L533K4950
11550I1882p753k6451j0139N050R980L169M945k3870o658K698j0247k796k719
11537B7091J7805J0026J592K555k1228R816M0616j6379l9677M570J2142n490l2400
11524A1039k310k095l851L3303J4078J9759K701k2548K631l4647j6833J7877L3782
11511E2886m349K975l5200l5226M6095O246M962o244k5591j1645J1051R248n559
11498I649L65J5826k2051p225L4234J961l0935R187p383l827j7865l5620M078
11485d9606K9844J6030K1299K0836j4235j6309o102J1970K769p54N947j1072L2322
$$ plain form
11577 76126 85068 88105 106005 105482 104068 90839 72756 66758 72770 66908 44806 27229 63761
11564 63761 80533 82467 83038 73829 68138 72057 56070 55687 51124 50282 58144 63399 66932 91882
11550 91882 84129 57678 47539 52589 62569 65738 70683 46813 40155 42853 32606 29810 27091
11537 27091 44896 54922 56514 59069 37841 47657 88273 71894 32217 36787 48929 43439 11039
11524 11039 8729 6634 2783 36086 50164 69923 72624 50076 52707 18060 1227 19104 52886
11511 52886 48537 51512 16312 -18914 27181 33427 38389 32145 6554 -5091 5960 15208 9649
11498 9649 10014 25840 3789 -3436 30798 32759 1824 11011 3628 -199 -18064 -53684 -49606
11485 -49606 -19762 -3732 17567 38403 24168 7859 1757 13727 16496 15742 21689 10617 42939
11472D2939k6963j9849k2282O275P248J1144J806j2071J9799K2004q515j9375
11460B160k0J623l4879j1776K0663m483m827j669l3670j4324J4518o86K455k747
11446f7662P204L6012K542J0228L0843r021r741J4371m008k0393l566n064r879
11433b8134p605J3078k2142k0816K6481K0805p314j3279j6532k926J5823M777
11421c7784J470j157J9067K1438j089k3696r430K484q863J1062J2483j1584J0883
11408a4716N708j3717j612J1625n768O522J2355r941l3095K09J9223l466P11r167
11394c5129m550O011J039N892o623j8887l724O516J1997k647P467n666n245j6996
11380f0545q944J3130J7923n329K421j0233j1448M499O990J4609o684n506K74
$$ plain form
11472 42939 15976 -3873 -26155 -19880 -12632 -1488 318 -11753 8046 30050 21535 2160
11460 2160 2140 3763 -31116 -42892 -22229 -26712 -31539 -33208 -66878 -81202 -66684 -67370 -64915 -67662
11446 -67662 -60458 -24446 -21904 -11676 19167 10146 405 14776 10768 -9625 -13191 -18255 -28134
11433 -28134 -35739 -22661 -44803 -65619 -39138 -18333 -25647 -38926 -55458 -58384 -42561 -37784
11421 -37784 -36314 -37471 -18404 3034 1945 -21751 -31181 -28697 -37560 -26498 -14015 -25599 -14716
11408 -14716 -9008 -22725 -24337 -12712 -18480 -11958 397 -9544 -42639 -42430 -23207 -26673 -25962 -35129
11394 -35129 -39679 -33668 -32629 -26737 -33360 -52247 -55971 -49455 -37458 -40105 -32638 -38304 -43549 -60545
11380 -60545 -69489 -56359 -38436 -43765 -41344 -51577 -63025 -58526 -51536 -36927 -43611 -49117 -48843
11367d8843o574k2224J5395J6120J7598o691K288o922m824L037m436k2024k1195
11354h9295j64N895j6903Q088l937j4814K5614K8651k3571n488j0532k263O64
11341i8055K8242K997k3599k6169J8883K301j4073L2177Q008O336J6555j1528
11329e7925Q226J38j6422j3788j8908j0837k4468k3676Q992R929M288K8507J6244
11316h9700J7040r261k1418N318o6J9803J4855o249Q489j7977l7528j8591j1916
11303a47201j1061R530K1466J8383J4401J307p847k1892r790K6564N081j1103
11291a12162L547K5134m60J1427k9305j7745j874m665j4899q742Q180M7648K2814
11278g1102j5355j6181k6131j663j3452N061J9528L788j2074o143J1721O91j3114
$$ plain form
11367 -48843 -55417 -77641 -62246 -46126 -28528 -35219 -32931 -39853 -44677 -41640 -46076 -68100 -89295
11354 -89295 -89459 -83564 -100467 -92379 -96316 -111130 -85516 -56865 -80436 -85924 -96456 -98719 -98055
11341 -98055 -69813 -66816 -90415 -116584 -97701 -95400 -109473 -77296 -69288 -62952 -46397 -57925
11329 -57925 -49699 -49561 -65983 -79771 -98679 -109516 -133984 -157660 -148668 -138739 -134451 -105944 -89700
11316 -89700 -72660 -81921 -103339 -98021 -98087 -78284 -63429 -69678 -61189 -79166 -116694 -135285 -147201
11303 -147201 -158262 -148732 -127266 -108883 -94482 -93175 -101022 -122914 -132704 -106140 -101059 -112162
11291 -112162 -108615 -83481 -83941 -72514 -101819 -119564 -121438 -126103 -141002 -149744 -141564 -93916 -71102
11278 -71102 -86457 -102638 -128769 -130432 -143884 -138823 -119295 -115507 -127581 -133724 -122003 -121312 -134426
11265a34426j6639J9376J9946p868j8422p240O64J6342J4927k1072N13k826J894
11252a34831j7866q02M024k9140l5025K3302J1635P110J6398L16p988J3576k2956
11239a72247j2756o288J3567Q597j9017k1955n858L5179J0151J5699J788k3182
11227a76322Q376j2412J5492J809Q47q479J8192o523j1433K2841N0936K5767k6957
11214i7866j9854o717l3773k5923J2759P086r868J7010J4349m626J511k6354p649
11201a79915j190M983m516j2328j482K5427l444j8471l0823J7809L4958R633J4409
11188a44950Q217l7657m1403m088J041M484Q459J5730j7205k8935j4627p018J855
11175b56097l528L0779K1572r884L5111P363j22j9089l313n749p371m604m847
$$ plain form
11265 -134426 -151065 -131689 -111743 -119611 -138033 -145273 -144609 -128267 -113340 -134412 -133899 -136725 -134831
11252 -134831 -152697 -153499 -149475 -178615 -213640 -190338 -178703 -171593 -155195 -154879 -162867 -149291 -172247
11239 -172247 -185003 -191291 -177724 -169127 -188144 -210099 -215957 -180778 -170627 -154928 -153140 -176322
11227 -176322 -167946 -180358 -164866 -163057 -162210 -170689 -152497 -159020 -170453 -147612 -96676 -70909 -97866
11214 -97866 -117720 -124437 -158210 -184133 -171374 -164288 -174156 -157146 -142797 -147423 -145912 -172266 -179915
11201 -179915 -181105 -176122 -180638 -192966 -194448 -169021 -172465 -190936 -221759 -203950 -168992 -159359 -144950
11188 -144950 -136733 -174390 -215793 -219881 -218840 -214356 -205897 -190167 -207372 -236307 -250934 -257952 -256097
11175 -256097 -259625 -228846 -207274 -217158 -182047 -174684 -174806 -193895 -197208 -202957 -210328 -214932 -219779
11162b19779k3299J3626J9251Q112k485K6386j8987k6881R411o191j0239J5489
11150b15586J1030J973k3963l553k531K2879J0476J293j4033j9137r480J6010
11138b24622p161k8497O257K367j9575J6921K786n287Q684r824K5244k7768j2066
11125b72541L0689K3753j726l4386k054K4996j4244n365K961J1747N848L750j0487
11112b37059p663j2842n390R279n370N871o959o367Q067K2443n040j6344o434
11099b63808k4524j4420J9231J1935j5263n446J13J1859K8912K5026j0364L217
11087b33532k5455J3731j4056k7694k1904p616J2611L2998L1788O818j8121j5520
11075b65952j0575L143j5566m523K1887r015k3231K780J0840K469J9667M2244
$$ plain form
11162 -219779 -243078 -229452 -210201 -202089 -204574 -178188 -197175 -224056 -214645 -220836 -231075 -215586
11150 -215586 -204556 -202583 -226546 -230099 -232630 -209751 -199275 -197982 -212015 -231152 -240632 -224622
11138 -224622 -231783 -260280 -254023 -251656 -271231 -254310 -251524 -256811 -248127 -257951 -232707 -260475 -272541
11125 -272541 -241852 -218099 -219825 -254211 -256265 -231269 -245513 -250878 -247917 -236170 -230322 -226572 -237059
11112 -237059 -244722 -257564 -262954 -253675 -259045 -253174 -260133 -266500 -258433 -235990 -241030 -257374 -263808
11099 -263808 -288332 -302752 -283521 -271586 -286849 -292295 -292182 -280323 -251411 -226385 -236749 -233532
11087 -233532 -258987 -245256 -259312 -287006 -308910 -316526 -303915 -270917 -239129 -232311 -250432 -265952
11075 -265952 -276527 -273384 -288950 -293473 -271586 -280601 -303832 -301052 -290212 -287743 -268076 -225832
11063b25832O591J8560J8039Q808N188P619O196l3931q798J296K2044M4530M4567
11050h5123O2332O0239O3407Q3465O2613O5810P1020M9232O695q743J8883j2711
11038D37119M468M4220J19749J49758J74967K09414J54502j273j21190j42181
11028A029553r2179n7151j9184Q0766J52948K19634K75730K49697J38185k7892
11018A950107k12144k73935k22998j80752j21369j3787P0571J05729J22936J21699
11008A346057L4465j07521k27946k16089j87705j48964q8259k5338j852M0993
10998D17841O4848P481o2951q9923j03412q7090r3262j13406o0655l5820m5389
10987b01738l0509J0555j7874l2052k340n890j2314q500l4315k7595k5850j5044
$$ plain form
11063 -225832 -219241 -200681 -182642 -173834 -168646 -161027 -154831 -188762 -197560 -196264 -174220 -129690 -85123
11050 -85123 -22791 37448 100855 184320 246933 312743 383763 432995 439690 430947 449830 437119
11038 437119 441587 485807 605556 755314 930281 1139695 1294197 1292924 1171734 1029553
11028 1029553 937374 880223 861039 941805 1094753 1314387 1590117 1839814 1977999 1950107
11018 1950107 1737963 1464028 1241030 1060278 938909 925122 995693 1101422 1224358 1346057
11008 1346057 1380522 1273001 1045055 828966 641261 492297 404038 378700 376848 417841
10998 417841 482689 490170 427219 337296 233884 146794 53532 -59874 -120529 -156349 -201738
10987 -201738 -232247 -221692 -239566 -271618 -273958 -279848 -292162 -300662 -334977 -362572 -388422 -403466
10975d03466J1877O653o905J489J3237K7894j2606r938k467l4427p835J5499l1149
10962d32144J6586K9045J8454l4459l0183J8441J7690j7731j3120j022N69K5395
10950d02479M91l445Q414j4296k0678p769o562M6358J7943O922k3295l465r108
10937d10969k8854q344J2558J2983K782j7386L568N601K171o947j3491l3566q452
10924d88346N970L347Q772K2373k600l2101m9404k4153M879J4692k608J2570l785
10911e30394M508K0519M399j9498J3121L521k8556l4441l2398L436J0677q647
10899e93753J8538M93l6513J1996R981J4607k9268m7Q716n720M805k792J6465
10886e82492j1424o056K0279j2136l9738j6204K7216n3j876N52M425j4835J769
$$ plain form
10975 -403466 -391589 -384936 -391841 -390352 -377115 -349221 -361827 -371765 -374232 -408659 -416494 -400995 -432144
10962 -432144 -415558 -386513 -368059 -402518 -432701 -414260 -396570 -414301 -427421 -428443 -427874 -402479
10950 -402479 -401988 -405433 -397019 -411315 -431993 -439762 -446324 -399966 -382023 -375101 -398396 -401861 -410969
10937 -410969 -439823 -448167 -435609 -422626 -419844 -437230 -433662 -428061 -425890 -432837 -446328 -479894 -488346
10924 -488346 -482376 -479029 -470257 -447884 -450484 -482585 -531989 -556142 -551263 -536571 -539179 -526609 -530394
10911 -530394 -525886 -505367 -500968 -520466 -507345 -503824 -532380 -566821 -599219 -595783 -585106 -593753
10899 -593753 -575215 -574722 -611235 -599239 -589258 -574651 -603919 -603966 -595250 -600970 -596165 -598957 -582492
10886 -582492 -593916 -599972 -579693 -591829 -631567 -647771 -620555 -620608 -622484 -621932 -617507 -632342 -630573
10873f30573J4516L103J7824J2116j3653K2081J5289J7782M241K1139K3711J3237
10861d79187l564j477R971j5686J7917K3334p12q621p835J1284J2436q380P953
10848d42567J0902j4287J315q573J993n835l2385P875L4409J1826j1056J2048
10836d34335j8886j2765o643o168j5012m883R400K2130j5510j6151J1771l538
10824d90590m4521l9172K5868R653k2728m0860j6675L6339l858N748r951n4414
10812f45161k6436J9825J454l4274l1762j8472n73Q67l525K2952j235l8059k7958
10799g82357k6695K2446K4245m200j2007k1582Q778R066P486j5441k6913m5337
10787h62511j6182j7095m296K2028J3642k0327n361O980j1662l4542k5361m668
$$ plain form
10873 -630573 -616057 -612954 -595130 -583014 -596667 -574586 -559297 -541515 -537274 -516135 -492424 -479187
10861 -479187 -482751 -484228 -474257 -489943 -472026 -448692 -449404 -458025 -465860 -454576 -442140 -450520 -442567
10848 -442567 -431665 -445952 -444637 -453210 -451217 -457052 -489437 -481562 -447153 -435327 -446383 -434335
10836 -434335 -453221 -465986 -472629 -478797 -493809 -498692 -489292 -467162 -482672 -498823 -487052 -490590
10824 -490590 -535111 -574283 -548415 -538762 -561490 -602350 -619025 -582686 -586544 -580796 -590747 -645161
10812 -645161 -671597 -651772 -650318 -684592 -716354 -734826 -735399 -734532 -738057 -715105 -716340 -754399 -782357
10799 -782357 -809052 -786606 -762361 -766561 -778568 -800150 -791372 -782306 -774820 -790261 -817174 -862511
10787 -862511 -878693 -895788 -900084 -878056 -864414 -884741 -890102 -883122 -894784 -929326 -954687 -959355
10775i59355m234K2727o206L948L5456o118l287j4064j6815k8992l4769J7983
10763i93726L451N345J1434J5380k0236k8869J3160n886k5717j3133L0623M364
10751a003810p393J8534j3119K8314K6073j3033r631L2497k5991j0491j113J5809
10739i63354L2258J0460J3751N0010M7580N0644m842k5236m6856m6533k3229K2646
10727h82701K2273N4188M3657N1673M7030K3079n6604o9080o6401m4683Q352j4800
10715h84017j091L6218M1824L3057K3485k1682n3569q4086p6150n0325j4137q648
10703a059121M3L578k973l2003k0038j8760p3785k9865j7649n8462n8373k9398
10691a396806j5883R659J5669k7985j2264k6450o6286l6494J1091j26m772J9464
$$ plain form
10775 -959355 -963589 -940862 -947068 -943120 -907664 -913782 -917069 -931133 -947948 -976940 -1011709 -993726
10763 -993726 -990275 -984930 -973496 -958116 -978352 -1007221 -994061 -999947 -1025664 -1038797 -1008174 -1003810
10751 -1003810 -1011203 -992669 -1005788 -977474 -951401 -964434 -974065 -941568 -967559 -978050 -979163 -963354
10739 -963354 -931096 -920636 -906885 -856875 -809295 -758651 -763493 -788729 -835585 -882118 -905347 -882701
10727 -882701 -860428 -806240 -762583 -710910 -663880 -640801 -697405 -766485 -832886 -877569 -869217 -884017
10715 -884017 -885108 -848890 -807066 -774009 -750524 -772206 -825775 -909861 -986011 -1036336 -1050473 -1059121
10703 -1059121 -1059078 -1055500 -1058473 -1090476 -1110514 -1129274 -1203059 -1232924 -1250573 -1309035 -1367408 -1396806
10691 -1396806 -1412689 -1403030 -1387361 -1415346 -1427610 -1454060 -1520346 -1556840 -1545749 -1545875 -1550647 -1531183
10679a531183J1202J3k1878r306j7395m3738j4404j4679k1133q059J0752j1889
10667a671697J2471R448k9252J9852K3743n43Q744J6205L7370L0378P130J9048
10655a517103M0718N5554O6570Q8007R7836J31776J95903K49959K17294N8481
10645c15005p330M1784P2677J39676J88005K70467M08950N26850P24598J041984
10635C092656J528826K218454K998497L708297L749229K379131K08351j125907
10627A8757534j253521o10288L80914J555570K997441M856236P215105R964715
10619D3863706J2572157J3862743J4677843J6672861J7719991J4727981P379250
10612A41476532m80577m763709m422469n00220N653463J2913559K0421883K8308233
$$ plain form
10679 -1531183 -1519981 -1519968 -1541846 -1551152 -1568547 -1612285 -1626689 -1641368 -1662501 -1670560 -1659808 -1671697
10667 -1671697 -1659226 -1649778 -1679030 -1659178 -1635435 -1635978 -1627234 -1611029 -1573659 -1543281 -1536151 -1517103
10655 -1517103 -1476385 -1420831 -1354261 -1266254 -1168418 -1036642 -840739 -590780 -373486 -315005
10645 -315005 -322335 -280551 -207874 -68198 119807 390274 799224 1326074 2050672 3092656
10635 3092656 4621482 6839936 9838433 13546730 17295959 19675090 19883441 18757534
10627 18757534 17504013 16893725 17274639 18830209 21827650 26683886 33898991 43863706
10619 43863706 56435863 70298606 84976449 101649310 119369301 134097282 141476532
10612 141476532 140995955 136232246 131809777 131309557 136963020 149876579 170298462 198606695
10604A98606695L5690700L7543285K7363345O069944j4445742k4341153k3359190
10597B43127884j5362269l747719R716484K4298971L8585806M8799823M8089701
10590C93508681K9297145m050539l3251941m5947463m4058861l3917640k0650457
10583B40928925o868410O338714J7840427K5009724K3494691R442567j3199925
10576C02986713l1632666l8261428l5164978k7219746j8079168r545142k335725
10569A40747860L057334N729369M330997j906489j0789635j7662204k0075044
10562A03432188j8770162j5677076j2279961r352993p054644n386549m208258
10555C0702545l326905k657282k201919j878803j641055j440041j238363j073573
$$ plain form
10604 198606695 234297395 271840680 299204025 305273969 290828227 266487074 243127884
10597 243127884 227765615 224017896 233734380 258033351 296619157 345418980 393508681
10590 393508681 422805826 418755287 385503346 339555883 295497022 261579382 240928925
10583 240928925 234060515 240399229 258239656 283249380 306744071 316186638 302986713
10576 302986713 271354047 233092619 197927641 170707895 152628727 143083585 140747860
10569 140747860 143805194 149534563 153865560 151959071 141169436 123507232 103432188
10562 103432188 84662026 68984950 56704989 47351996 40297352 34910803 30702545
10555 30702545 27375640 24718358 22516439 20637636 18996581 17556540 16318177 15244604
10547A5244604r46936p88641o92774o10285n69254n26382m95803m64283m21773
10538I728473l48832l33330l16546k54135k22779k54425k40838j78165j91492
10529G387931k21771j90909j63440j68539j47061j38192j46575j45908j45530
10520E920006j36828j26378j11869j05226r8523j05418j14534j09096r1016m6787
10510D874331m6649o3022p7003r0750r3422p2288p0486o5049q1726n3496m6453
10499D113987p4803n2231n6886n9696l8861o6505r4816n5650k6788l6546k9276
10488C521929k8326l3175l7989m9373n6411k7091k5934l3386l4037j8407J3627
10477C191427j4917k6591m2376m5913m2381m5425o3638o8923j3723j9478Q370
$$ plain form
10547 15244604 14297668 13509027 12816253 12205968 11636714 11110332 10614529 10150246 9728473
10538 9728473 9379641 9046311 8729765 8475630 8252851 7998426 7757588 7579423 7387931
10529 7387931 7166160 6975251 6811811 6643272 6496211 6358019 6211444 6065536 5920006
10520 5920006 5783178 5656800 5544931 5439705 5341182 5235764 5121230 5012134 4921118 4874331
10510 4874331 4827682 4764660 4687657 4596907 4503485 4431197 4360711 4295662 4213936 4160440 4113987
10499 4113987 4039184 3986953 3930067 3870371 3831510 3765005 3670189 3614539 3587751 3551205 3521929
10488 3521929 3493603 3460428 3422439 3373066 3316655 3289564 3263630 3230244 3196207 3177800 3191427
10477 3191427 3176510 3149919 3107543 3061630 3019249 2973824 2910186 2841263 2827540 2808062 2816432
10466B816432M651j9580j0599J0178l9632j03555n5750m3510o2579j7533j5838
10455B462685r8Q168o874j5388l5385j4584m2564q1076m4248k9772l1831l2029
10443B137004k2883q896J582o558K8298k4098j3088m8099n2347l6309k451r930
10431A942225L7l02q114k0799l1007m863L677K599q278j0521j9393k0620q781
10418A815860m214m988l878j2128l987k9991r651L103l218j9707j6974j7987l413
10405A688827j8376m5798p483K325J2122L743k1310l1549k5845k0377j8277l3249
10393A484753m122K1467K9323k4965l1116o393j7390l5869k1998M880p48l249
10381A394573o960l1895j1381M461n885k1319L867m775j2899o442j9104k4973
$$ plain form
10466 2816432 2821083 2801503 2790904 2801082 2761450 2657895 2602145 2558635 2496056 2478523 2462685
10455 2462685 2462587 2470755 2463881 2448493 2413108 2398524 2355960 2274884 2230636 2200864 2169033 2137004
10443 2137004 2114121 2105225 2106807 2100249 2128547 2104449 2091361 2043262 1990915 1954606 1952155 1942225
10431 1942225 1942262 1941960 1933846 1913047 1882040 1877177 1880854 1883453 1875175 1864654 1845261 1824641 1815860
10418 1815860 1811646 1806658 1802780 1790652 1786665 1756674 1747023 1750126 1746908 1727201 1710227 1692240 1688827
10405 1688827 1670451 1624653 1617170 1619495 1631617 1635360 1614050 1582501 1556656 1536279 1518002 1484753
10393 1484753 1480631 1502098 1531421 1506456 1475340 1468947 1451557 1415688 1393690 1398570 1397822 1394573
10381 1394573 1387613 1355718 1344337 1348798 1342913 1321594 1325461 1320686 1307787 1301345 1282241 1257268
10369A257268l073L959Q484L591n0870j8421J670M847P162J0466k1040j0573L62
10356A193832j6280j2108q232O044j0140K4545K7235n006J736k676N01o68j5851
10343A182932Q298J9850J834j6058j2224j1628k0026k8172O666P74L857j7788
10331A118315n969J3291p077j5378k1669M950J1222M5957J1849j9143k7999J3194
10319A121543k137j9854k1152j1461j2879K2497K8757k700j5591l0776j5327J0626
10307A051546J7358M316p626J1921L457k2149j8281j404o681m237j0983j1618
10295A005619l5857l8059q386M67N3487J2420j4177j716M456j6925o571k0549
10283I34209j0580j9069l290l737J7724K5881o068j8671j4145l9766j5601N313
$$ plain form
10369 1257268 1254195 1258154 1266638 1270229 1219359 1200938 1202608 1207455 1214617 1225083 1204043 1193470 1193832
10356 1193832 1177552 1165444 1157212 1163256 1153116 1177661 1204896 1199890 1201626 1198950 1199451 1198783 1182932
10343 1182932 1191230 1211080 1212914 1196856 1184632 1173004 1152978 1124806 1131472 1132246 1136103 1118315
10331 1118315 1112346 1125637 1118560 1103182 1081513 1086463 1097685 1143642 1155491 1136348 1108349 1121543
10319 1121543 1119406 1099552 1078400 1066939 1054060 1076557 1105314 1102614 1087023 1056247 1040920 1051546
10307 1051546 1068904 1073220 1065594 1077515 1080972 1058823 1040542 1039138 1032457 1028220 1017237 1005619
10295 1005619 969762 931703 923317 923784 977271 989691 975514 973798 978254 961329 954758 934209
10283 934209 923629 904560 901270 897533 915257 941138 935070 916399 902254 862488 846887 852200
10271H52200K8872j0236j5313m189k2358j5828k719j2314J0781J463j5649k867
10259G91843k8540L260K3459k1594k6979J8504J8097j6601n52R091K9032k1537
10247G77483k7102M514j8447p268p024q946P50j8054K7331K9013j0317K0140J6614
10234G78687r541m1666k3578q449j0662J2722J9891q987O07Q50q360j0749o559
10221F84206J097J9394l973P081m2158k1201J659J6402N3865J8815q342l3479
10209F93366n695P136p911R574r731r330m449N529j604p204Q987l542Q233J3452
10195F96811L0088K4638J2559L0552J5315L229j0505k8931k4650J7630J6157L9097
10183H21990L5658Q6388R7974R3771R0975J12322N6460R037k0688j1689l8100
$$ plain form
10271 852200 881072 870836 855523 851334 828976 813148 810429 798115 808896 810359 794710 791843
10259 791843 763303 766563 790022 768428 741449 759953 778050 761449 760897 769988 799020 777483
10247 777483 750381 754895 736448 729180 722156 713210 713960 695906 723237 752250 741933 762073 778687
10234 778687 769146 727480 703902 695453 684791 697513 717404 708417 709024 709874 701514 690765 684206
10221 684206 685303 704697 700724 707805 665647 644446 646105 662507 716372 735187 726845 693366
10209 693366 687671 694807 686896 696470 686739 677409 672960 678489 676885 669681 678668 675126 683359 696811
10195 696811 726899 751537 764096 794648 809963 813192 802687 773756 749106 766736 782893 821990
10183 821990 857648 944036 1042010 1135781 1226756 1339078 1395538 1404575 1383887 1372198 1334098
10172A334098o062J6004Q8143J43713J80054J79120J90493J32125J5929q6872
10162B186745j31053j29198q3537j7650N4170J28847K09765K91917K80374J54893
10152B945273q5040k10984k45692k13177j64711r5736l3994O554J06132J33747
10142B142372J37847L2473j20434j88721j93150j77655j28638j01941m7188K4027
10132A378992M8947P270l2475m2432o1919r8043j07905q7539q3719o4340m4306
10121H12531m6165m2289j9566r385o721l6614m0271j6377J6525J649j1551j8184
10109E83582j4913o497K720J9902n638L856M287J4590l471k0107j4939p559j4871
10096E40942l4482j3753M0750O5857J6564l9462j2773j402k5178j7064L357j3127
$$ plain form
10172 1334098 1328036 1344040 1432183 1575896 1755950 1935070 2125563 2257688 2273617 2186745
10162 2186745 2055692 1926494 1842957 1825307 1879477 2008324 2218089 2510006 2790380 2945273
10152 2945273 2860233 2649249 2403557 2190380 2025669 1929933 1895939 1902493 2008625 2142372
10142 2142372 2280219 2312692 2192258 2003537 1810387 1632732 1504094 1402153 1354965 1378992
10132 1378992 1427939 1435209 1402734 1360302 1298383 1200340 1092435 1004896 921177 856837 812531
10121 812531 766366 724077 704511 695126 688405 651791 611520 595143 611668 613317 601766 583582
10109 583582 568669 562172 564892 584794 579156 583012 587299 601889 598418 578311 563372 555813 540942
10096 540942 506460 492707 533457 599314 615878 576416 563643 562241 537063 519999 523356 510229
10084E10229L706j407l28J1015L493J2784p943N356P737j5721q281k9436j1546
10071D79658J3708P656J0062O870K0942K1295L254l2971l7500k9342K2881P405
10059D93918j491L797l571j9762J5359j0067M051J6410n946O98m098o939L897
10046D86256j1444J2535j7374j051J8642J322Q519k1928n559l623J4821J4982
10034D96098J4302L0705q25m1718l4037p842j8403j3283L5528K8170J86l4248
10022D54633k8022j8273K8620K6837k4032j7276o525r321q608j3865J256N720
10010C91144p560k517K1457J1214K7084J4858P083R23j4251l7211k2953Q571Q060
9997D05902k2331j0579N862K2738Q611j0161k3060o087k6293k1183L8495O1721
$$ plain form
10084 510229 513935 512528 512200 523215 526708 539492 531549 536905 544642 528921 520640 491204 479658
10071 479658 493366 501022 511084 517954 538896 560191 563445 530474 492974 463632 486513 493918
10059 493918 492427 496224 492653 472891 488250 478183 482234 498644 492698 493396 489298 482359 486256
10046 486256 474812 487347 469973 468922 487564 488886 497405 475477 469918 466295 481116 496098
10034 496098 510400 541105 540280 498562 464525 456683 438280 424997 460525 488695 488881 454633
10022 454633 426611 408338 436958 463795 439763 422487 415962 406641 398033 384168 385424 391144
10010 391144 383584 381067 402524 413738 440822 455680 462763 463686 449435 412224 389271 397842 405902
9997 405902 383571 372992 378854 401592 410203 400042 376982 370895 344602 323419 361914 423635
9985D23635n573j9325j7070L4020j49j8001p293l0650Q844Q906J5433m860j3979
9972C73938k3407j1297q392J6015L4355J3640q702o348o148q415m922j2426P412
9959C55303J8834j2676l0884j796P245J6575R239r520o99l495L5595J208j1729
9946C73200j6057M236Q174j0438Q636J3024n070q373P059j8452j7865K0290N988
9933C64352J0732j9651k5750O687j508L0059J4963j6157K369K7405J6956o973
9921D03484K511r007k6609q445J1673J2745J0525Q092p295r216q390j2540j5024
9908C52504q203P357r67j4772J154K4821j5928j1227Q761J7541j6504P81q426
9895C36892K4187L009Q488J7382j7894k4881J6762r64J5638j3386l8915l020m525
$$ plain form
9985 423635 418062 398737 381667 415687 415538 397537 390244 359594 368438 377344 392777 387917 373938
9972 373938 350531 339234 330842 346857 381212 394852 386150 379802 373654 365239 360317 347891 355303
9959 355303 374137 361461 330577 328781 336026 352601 361840 352320 351621 348126 383721 384929 373200
9946 373200 357143 361379 369553 359115 367751 380775 375705 367332 374391 355939 338074 358364 364352
9933 364352 375084 355433 329683 336370 334862 364921 379884 363727 366096 393501 410457 403484
9921 403484 405995 396988 370379 361934 373607 386352 396877 404969 397674 388458 380068 367528 352504
9908 352504 344301 351658 350691 335919 337073 361894 345966 334739 343500 361041 344537 345318 336892
9895 336892 361079 364088 372576 389958 372064 347183 363945 362981 378619 365233 326318 323298 318773
9882C18773M170Q239J7460O538m263K6092n194k5188J4601p653j5990K8479R766
9869C75830J3391M521k0350j9394K7435K1848j2463k0141j513j5180m912Q370
9857C57442R457m482k371j0096P254K7136j3860l6774k3996j0472j1473J6818
9845C04583J8603J2154K932J7009J3134k2390r336K4972O99k8212P474J2477q051
9832C46048j1846j1844r076k8347k7713p734Q161o737q172J4435J5946K6806J5410
9819C15337p894L51K268q489K859J2543l799k2405l5599K480M8809K4294J302
9806C32057j411n609j9747m910P134o602J321J247o333K7782J8897j0594k5548
9793C07684L827K192J4810m623l431j378j2930P998J5057R347j6091r5K847N705
$$ plain form
9882 318773 322943 331182 348642 355180 350917 377009 371815 346627 361228 353575 337585 366064 375830
9869 375830 389221 393742 373392 353998 381433 403281 390818 370677 369164 353984 349072 357442
9857 357442 366899 362417 360046 349950 357204 384340 370480 333706 309710 299238 287765 304583
9845 304583 323186 335340 338272 355281 368415 346025 336689 361661 362360 334148 341622 354099 346048
9832 346048 334202 322358 313282 284935 257222 249488 257649 250912 242740 257175 273121 299927 315337
9819 315337 307443 307794 310062 301573 304432 316975 313176 290771 255172 257652 306461 330755 332057
9806 332057 330646 325037 305290 300380 307514 300912 302233 303480 297147 324929 343826 333232 307684
9793 307684 311511 313703 328513 323890 320459 319081 306151 314149 329206 338553 322462 322367 325214 330919
9779C30919K1389K7725M0312Q3041J28735K04271L60263O08782Q31785P61280
9769C398502K32628m57978p43384o35041m77249l47150j84970r1795q5843o3636
9759E44084m7296n3238k2445k1003j1447n006o753m617k368k3323k7582j4203
9747C04803J008o461k3713J3039J7568j9489P874P313n800r227N483K6113j3557
9734C04954k2040j1774k056j1117J5852M14q797K269k5341j2053J674j823Q688
9721B38850R85J7249L3679l94j314j2457j0764k3866r929N562m02J286J7258L3480
9707B89223Q296j6941K3800Q562k9983J5966J9719j3489j5874j8243J3578l358
9695B81256k1910P149K7169J8805K4429j7431K16l0264j9754J6220j7840J0457
$$ plain form
9779 330919 352308 380033 420345 503386 632121 836392 1196655 1805437 2637222 3398502
9769 3398502 3631130 3173152 2429768 1794727 1317478 970328 785358 693563 607720 544084
9759 544084 496788 443550 421105 400102 388655 383649 376896 372279 369911 346588 319006 304803
9747 304803 305811 299350 275637 288676 306244 286755 294629 301942 296142 286915 292398 318511 304954
9734 304954 282914 271140 269084 257967 273819 274233 265436 267705 242364 230311 231985 230162 238850
9721 238850 239835 257084 290763 290369 289055 276598 265834 241968 232039 237601 237199 238485 255743 289223
9707 289223 297519 280578 304378 312940 282957 298923 318642 305153 289279 271036 284614 281256
9695 281256 259346 266495 293664 312469 336898 319467 319683 289419 269665 285885 268045 278502
9683B78502r285j7369K3065o145R177q038j3628j8280N894J0970Q448J0671k1153
9670B52829o48r38p818l576l155j184J6357M617l866J310J371J7243J4917q202
9656B79257N238M1989M2655j2411J4437K8220N1511n938l8430n3980m7637k3051
9644B81860J2133k4383k5495k0656k2726J9867K2746K677k5003j926l154J7389
9632B33329J9324J4466q338j0527q605k885r31k6866l0004K6359J369k1044n363
9619A80284J5562K0191K2912R811o345j6227j104l999k4959q588J5085k114R146
9606B09655K8516Q812n361j3356M85J6041n63j0934j2426O946j5741j3101m449
9593A94524P99Q207K0289n373j9227j3909J5163K5410L244j6670j6183J7342k1032
$$ plain form
9683 278502 269217 251848 274913 268768 277945 269907 256279 237999 243893 254863 263311 273982 252829
9670 252829 252181 251243 243425 239849 236694 235510 251867 256484 252618 253928 255299 272542 287459 279257
9656 279257 284495 326484 369139 356728 371165 399385 450896 444958 406528 352548 304911 281860
9644 281860 293993 269610 244115 223459 200733 220600 243346 246023 221020 219094 215940 233329
9632 233329 252653 267119 258781 248254 239649 236764 235833 208967 178963 205322 206691 185647 180284
9619 180284 195846 216037 238949 248760 242415 226188 225084 221085 196126 187538 202623 200509 209655
9606 209655 238171 246983 241622 228266 228751 244792 244229 233295 220869 227815 212074 198973 194524
9593 194524 195323 203530 223819 218446 199219 185310 200473 225883 229127 212457 196274 213616 192584
9580A92584j8535Q664Q549P515O547j5861L062K0971J8874n475M169o417j1980
9567B12667p915j4761q165j6228K2448r949k200j6243J0645J7875K6698K6704
9555B41576N576n3113j4496n544P732L418L6323j2556M064J1376o413n163j4117
9542A98663o290l159L149j1496m7432r155K3036P639j1311j4259J2713N1845m649
9529A89294J7927R989j7833l0303J3720L41K448j471M198J2734o793O780J4532
9516B15563m263L2332J1750j8311j8740j844R001k1620k495j4318r97L561P233
9503A96852L0794l493j6731k6780k1960K3704Q713J1162M607j9714P613K7725
9491B22492l1345J2218p775k6917j4830K371k309j856K5421J0222K084k683jq407
$$ plain form
9580 192584 174049 182713 191262 198777 205324 189463 192525 213496 232370 226895 231064 224647 212667
9567 212667 204752 189991 181826 165598 188046 178097 175897 159654 170299 188174 214872 241576
9555 241576 247152 194039 179543 173999 181731 185149 221472 208916 212980 224356 217943 212780 198663
9542 198663 192373 189214 192363 180867 133435 124280 147316 154955 143644 129385 142098 193943 189294
9529 189294 207221 217210 199377 169074 182794 183135 185583 184112 188310 201044 194251 201031 215563
9516 215563 211300 243632 255382 237071 218331 216487 225488 203868 201373 187055 186058 189619 196852
9503 196852 227646 224153 207422 180642 158682 182386 191099 202261 206868 187154 194767 222492
9491 222492 191147 203365 195590 168673 153843 156214 153905 152049 177470 187692 189776 187093 187092 178685
9477A78685l4641l7768L6240K3120K4301J0168j3395l1821j894L324n275J4679
9465A65723L829M8534j4861k9282o225N236k3342J975R939L7016J3844l3868j8272
9452A60246j4408J9529J9069N052k5473q513r961J6182k3999k3525L0936R444
9440A54579o60K7715K9946l4486k6189J3793p708l299R484J1240k2461R18J7067
9427A69939l4283j3134J9312K1963J7679k494j0081J4768m386l50j107k2197l4092
9414A21537j6108M930M0889P255j395O014J7904R644K1065k2490j5235N92j5084
9401A59518l9755k85O321R571J7009Q759j6461o949L16p060K0682J8198k017K853
9387A70700J1290N663J2905r631j1259R736j5360o132P651J2333O741K819r399
$$ plain form
9477 178685 144044 106276 142516 165636 189937 200105 186710 154889 152995 156319 151044 165723
9465 165723 169552 218086 203225 173943 167718 172954 149612 151587 161526 198542 212386 178518 160246
9452 160246 145838 165367 184436 189488 164015 155502 145541 161723 137724 114199 145135 154579
9440 154579 153919 181634 211580 177094 150905 164698 156990 153691 163175 174415 151954 152872 169939
9427 169939 135656 122522 141834 163797 181476 178982 168901 183669 179283 178933 177826 155629 121537
9414 121537 105429 110359 151248 158503 157108 163122 181026 190670 211735 189245 174010 174602 159518
9401 159518 119763 119478 125799 135370 152379 161138 144677 137728 138044 130984 151666 169864 167847 170700
9387 170700 181990 187653 200558 190927 179668 189404 174044 167912 175563 187896 194637 197456 188057
9374A88057j7502k933J7377k7621k0780K033n029J4112J9088R08k6349j1029j9391
9361A10941J1247M4622N921j1760L248J4962j611j8416K5863J8941P347j6839
9349A94466j4516j5218J1440j065O49k0300k1178K780N823J1975J5148r336j4437
9336A46231o411k321m355n921R258N965q35K2357J3721l3903k7483J6985J8753
9323A52041L685j1316P707j8654j3381k667M777J3809J0297o443l5077J2628K1148
9310A38554n431R655K8154R615o356M925M581k7006n028k5144n37R954M4870L3920
9296B14726l61l7184l3774k3482j8286R185O764J2075R423P490p590N871J3117
9283A57974n855j2943N471M054j7036p95J139J197k5895K5259J0596O797J271
$$ plain form
9374 188057 170555 167622 184999 157378 136598 138631 133602 147714 166802 167710 141361 130332 110941
9361 110941 122188 166810 172731 160971 164219 179181 177570 159154 185017 203958 211305 194466
9349 194466 179950 164732 176172 175107 175756 155456 134278 137058 142881 154856 170004 160668 146231
9336 146231 139820 137499 133144 127223 136481 142446 141611 163968 177689 143786 116303 133288 152041
9323 152041 155726 144410 152117 133463 120082 117415 122192 136001 146298 139855 104778 117406 138554
9310 138554 133123 142778 170932 180547 174191 179116 183697 156691 151663 126519 125982 135936 180806 214726
9296 214726 214365 177181 143407 119925 101639 110824 117588 129663 139086 146576 138986 144857 157974
9283 157974 152119 139176 144647 148701 131665 130870 132009 133206 107311 132570 143166 149963 151234
9270A51234R977P349k436j9804k7953p302J2959Q766J795P545J33J9314K5984
9257A87561j6321L802K9984j0968p099l0864m478J6383K3742k0131k9057r678
9245A32876j0017L550J1921r848j2161J3227o414j5637p875L2604K8498l768j3344
9232A43612j3294J0630K871N855k6292J780L843l735J3387r61o495j4816j5012
9219A01373N897k2051n623L0533J5063P339m72o962J1239K8182J6558k4505m651
9206A51920P687l30l1764k2485K3015J2816P584j926J0045q30j3521L3823K1994
9193A98028n4916l4748L378J8541K5313J2068J2364o423r64k6396J059k382J545
9180A46467k6504j6457K6105K1691m882j6331j1072p505q022N251J1001J7693
$$ plain form
9270 151234 161211 168560 166124 146320 118367 111065 124024 132790 134585 142130 142263 161577 187561
9257 187561 171240 175042 205026 194058 186959 156095 151617 168000 191742 171611 142554 132876
9245 132876 122859 126409 138330 128482 116321 129548 123134 107497 99622 132226 160724 156956 143612
9232 143612 130318 140948 143819 149674 123382 125162 129005 125270 138657 137696 131201 116385 101373
9219 101373 107270 85219 79596 110129 125192 132531 132059 125097 136336 164518 181076 156571 151920
9206 151920 159607 159277 127513 105028 128043 140859 148443 146517 156562 155732 142211 176034 198028
9193 198028 143112 108364 111742 130283 155596 167664 180028 173605 172641 146245 147304 144922 146467
9180 146467 119963 103506 129611 151302 146420 130089 119017 111512 103490 108741 119742 137435
9168A37435j1110j3090J4747K2981r931j6343K0313M837r432O468J2763k2738
9156A36900r674K5899j0354l589j1144k0592M088J6166K0509K6217K1233l1237
9144A64422j3652j0665k9371P618M6570P900q718p077K391R470k0198l828M210
9131A49072k858k61k870j5310j6140p151J0405J6131j32l34R06l4364k543L0393
9117A24944o280j4133M896R278r605q851k3170K8870L923J0415J8957M0274o222
9104A73296k3955k6133m410L53k4579K397j814N05N373j3667l038J374J0050K1282
9090A17034J9599J2795J0773l0351k3920N300K1528n654J0094K1919J5836L926
9078A78879J189k9614r497L1720r174m566L1452p625l2874q668R201j4027k321
$$ plain form
9168 137435 126325 113235 127982 150963 141032 124689 145002 149839 140407 146875 159638 136900
9156 136900 127226 153125 142771 139182 128038 107446 111534 127700 148209 174426 195659 164422
9144 164422 150770 140105 110734 118352 164922 172822 164104 157027 159418 168888 148690 144862 149072
9131 149072 146214 145953 143083 127773 111633 104482 114887 131018 130886 130552 131458 97094 94551 124944
9117 124944 118664 104531 109427 118705 109100 100249 77079 105949 109872 120287 139244 179518 173296
9104 173296 149341 123208 118798 119151 94572 96969 95155 95660 101033 87366 84328 85702 95752 117034
9090 117034 136633 149428 160201 129850 105930 111230 132758 127104 137198 159117 174953 178879
9078 178879 180068 150454 140957 172677 163503 158937 190389 182764 149890 141222 150423 136396 134075
9065A34075k3715j4552R679P400n344p028j6501K5048L4053J3058K667j1830l5563
9052A11447l8232J753K6621J4114J4002J693p149o150j6178J3237J8449j6239
9040A17368j4076J0264K357Q026J2802Q75l0682k2779J470K8217K1784j3430k7236
9027I4960J6284J2466o442r741j587l712r20P166K4298j4140j2424Q118J7202
9014A31528j2785k0810j321p363J0781Q970l3816J4299l564K147O677L717Q742
9001A07202K7547K502J0483n85j6248k4295n25J1230O417J8866P05J1266j5583
8988A38982j9457r968j497k2673j193J4861K5970j441k2640k3017M0883L5649
8976A54459o778J031O481K0503k374j168K66l645j5225J3496j4498j7711j0819
$$ plain form
9065 134075 110360 95808 105487 112887 107543 100515 84014 109062 143115 156173 158840 147010 111447
9052 111447 73215 74968 101589 115703 129705 131398 124249 118099 101921 115158 133607 117368
9040 117368 103292 113556 115913 123939 136741 137616 106934 84155 85625 113842 135626 122196 94960
9027 94960 111244 123710 117268 107527 105940 102228 101308 108474 132772 118632 106208 114326 131528
9014 131528 118743 97933 96612 89249 100030 109000 75184 89483 85919 88066 94743 98460 107202
9001 107202 134749 137251 147734 147149 130901 106606 106081 117311 123728 142594 143299 154565 138982
8988 138982 119525 109557 108060 85387 84194 99055 125025 123584 100944 77927 118810 154459
8976 154459 147681 148712 155193 175696 173322 172154 172420 168775 153550 167046 152548 134837 124018
8963A24018l018j0097k3209M59L0022K6533k4630l0325P086Q60m420Q940O303
8950A08522Q983L852L060Q389J8088j8182j8860j0565J3545m745j7311J7378P934
8937A20088J389j413k8338J5136L1343k0823k1316K0408L892q127k569R318J2886
8924A31874j8885o137o862M007K3895J4414l0529k2879j805J8929r788o135M74
8911I0573N236K2085k568J2001O450k9736k0502m017J5941j3686J182R316K4087
8898A16362n87k6107p615K3363Q994K7798j6723l295J0682n844l2857n215l740
8885H5216j0724k2064J0743j749k2087O065J1642l734n016J5136J9618j386n875
8872G5785j0143J8978M4414M702l225R095k9780k3644L473J4855J7759O644o314
$$ plain form
8963 124018 121000 110903 87694 88153 118175 144708 120078 89753 96839 97699 93279 102219 108522
8950 108522 117505 121357 124417 132806 150894 132712 113852 103287 116832 112087 94776 112154 120088
8937 120088 121477 120064 91726 106862 138205 117382 96066 116474 120366 112239 109670 118988 131874
8924 131874 112989 106852 99990 103997 127892 142306 111777 88898 87093 106022 96234 90099 90573
8911 90573 95809 117894 115326 127327 133777 104041 83539 79522 95463 81777 82959 92275 116362
8898 116362 115775 89668 82053 105416 114410 142208 125485 122190 132872 127028 94171 88956 85216
8885 85216 74492 52428 63171 61422 39335 45400 57042 53308 48292 63428 83046 81660 75785
8872 75785 65642 84620 129034 133736 130511 139606 109826 86182 89655 104510 122269 128913 122599
8859A22599O329J0692k0200r168J9341n080k379L7J0349j9712j9277K5235P551
8846A26317k2393l3955J746N465q090j4926j3179Q397L1751J1462n231p223j4054
8833F6087j2851J1628K0559n429K0993L1123J9498j7997j8334J8089Q4063O5028
8821B82457K3055n086m4676m5978m0611j9024j8698l1152Q307j3950j4092l702
8809G6850P207J3213j668j7775j5874K9685R786J01j820J2467J9330j5055l6702
8796G9745N32m486j7540K6855K0179J2573m8512j8011J1997M563K7336Q983l0427
8783G3787n565p47k651l898Q456P773K933J0123j4012p567N732R991r888J2215
8769H6682K3850N196k661q320O075N473K3809N175j2460j352j5073r226n034o08
$$ plain form
8859 122599 128928 139620 119420 110252 129593 124513 122134 122171 132520 112808 93531 118766 126317
8846 126317 103924 69969 71715 77180 69090 54164 40985 49382 81133 92595 87364 80141 66087
8833 66087 53236 64864 85423 79994 100987 132110 151608 133611 115277 133366 217429 282457
8821 282457 305512 300426 255750 209772 169161 150137 131439 100287 108594 94644 80552 76850
8809 76850 84057 97270 95602 77827 61953 91638 101424 101525 99705 112172 131502 116447 79745
8796 79745 80277 75791 58251 85106 105285 117858 69346 51335 63332 67895 95231 104214 73787
8783 73787 68222 67475 64824 60926 69382 77155 80088 90211 76199 68632 74364 84355 74467 86682
8769 86682 110532 115728 113067 104747 110822 116295 140104 145279 132819 131467 116394 107168 102134 101526
8755A01526k524J3467L6112j8565k1387j1417N010J2367p721P301j0559j8373
8743H5237j8414o733J7356o215k207K289p796j6803o215K2345M826N219K6608
8730I9497K722p093j7748q76K8369n281l6993K576L0211J0584k1545L954q094
8717H0283O590N951j0794K7552J0744k0056q923K1916j983J6680p174m9611j2054
8704E9121P767m691n757q208j2538Q684K4546K1481K5493j4126k573J4780q062
8691A05917k1211q10J0874J598p74O16K4371j2963j6559K971J0554J0332o486
8678A08430l6120j4769J0325j774N190J0942L5876O800j5597j3851o700q376l938
8665G6438j0621n831Q154M7314J1701q096L43j2870O135K1129M361k858J4589
$$ plain form
8755 101526 99002 112469 148581 130016 108629 97212 102222 114589 106868 114169 103610 85237
8743 85237 66823 60090 77446 71231 69024 71313 63517 46714 40499 62844 67670 72889 99497
8730 99497 102219 95126 77378 76502 104871 99590 62597 65173 95384 105968 84423 88377 80283
8717 80283 86873 92824 82030 109582 120326 100270 91347 113263 111280 127960 120786 71175 59121
8704 59121 66888 62197 56440 48232 35694 44378 68924 90405 115898 101772 99199 113979 105917
8691 105917 84706 83896 94770 96368 95594 96210 120581 107618 91059 94030 104584 114916 108430
8678 108430 72310 57541 67866 66092 71282 82224 118100 124900 109303 95452 88752 80376 76438
8665 76438 65817 59986 68140 115454 127155 119059 119402 106532 112667 133796 138157 135299 149888
8652A49888K7240j7182l2426M752P795k1051J4623J6816K0633j1256L696j8180
8640A45348k3332k3895j1802L0606J8473o996j8950R904K9642K3825J236k793
8628A71266m9912m40L9331Q468k5590j2418j4179r914q10J4260M1734K7326J113
8615A90235J1251j5040M17K1941L0216K1371q537J1162j1401l337J4327m721p737
8602B50147k1105j7359L2808L0479J5985r443k4243l650K0872L5466J3543Q72
8590C24372L8816M6335J5135K5992J2741K7772L2703L3909K4491O1298K7161K013
8578F72738L501l5518n003J2498r287j3423k9390l8993k5328j1415K5150l3215
8566E12315l2972k8377k2458r341J7452J0732j8237k5002q530j012r733k0173
$$ plain form
8652 149888 177128 159946 127520 132272 140067 119016 133639 150455 171088 159832 163528 145348
8640 145348 122016 98121 86319 116925 135398 128402 109452 119356 148998 172823 174059 171266
8628 171266 121354 120914 160245 168713 143123 130705 116526 106612 105802 120062 161796 189122 190235
8615 190235 201486 186446 186863 208804 239020 260391 251854 263016 251615 248278 262605 257884 250147
8602 250147 229042 211683 244491 274970 290955 281512 257269 253619 274491 309957 323500 324372
8590 324372 363188 409523 424658 450650 463391 491163 523866 557775 582266 643564 670725 672738
8578 672738 676239 640721 635718 648216 638929 625506 596116 557123 531795 520380 545530 512315
8566 512315 479343 450966 428508 419167 436619 447351 429114 404112 395582 394570 384837 364664
8554C64664j8943j4655j5243k6415j2452r744l177P228k0109l4426k3246m627
8542A88855k1892K2163J0138P253k7554q275q767K4220N587J6307n214j2155J1467
8529B02133Q081J520J4941P0187J12742J98346K30901J85602m4101j95119j86803
8518E98430j41887j01210p0558j0440n1257m7153J9790P143k030p849n489K684
8506A90174N513m7656l6804L85l52J6462O317j893J4114r860k4583j7822M81k7
8492I4449L946p421K7225J0629j0735K0084M8895r180K4350M1589N9173Q1398
8480C84402K14573L70605M77003M03621j24830l75148l63206k62299j92295j11547
8470D20879n1145p7911m9100m8854m0430Q026n967J232k439k825j7847k0033q569
$$ plain form
8554 364664 345721 331066 315823 289408 276956 267212 264035 271263 251154 216728 193482 188855
8542 188855 166963 189126 199264 206517 178963 170688 161921 186141 191728 208035 202821 190666 202133
8529 202133 210214 211734 226675 296862 409604 607950 838851 1024453 980352 785233 598430
8518 598430 456543 355333 284775 274335 223078 175925 195715 202858 200828 192979 187490 190174
8506 190174 195687 148031 111227 111612 111260 127722 134039 132146 146260 136400 111817 93995 94476 94449
8492 94449 98395 90974 118199 128828 118093 138177 187072 177892 202242 243831 303004 384402
8480 384402 598975 969580 1446583 1850204 1725374 1350226 987020 724721 532426 420879
8470 420879 369734 291823 242723 193869 153439 161465 155498 156730 154291 151466 133619 113586 105017
8457A05017Q868J3372N740L0863J7951J5347P618R498p862j5871q200j6370k453
8444A63518Q929m816n122k7433J2065M3321K0258L8224O6605J06017J69560J99989
8432G91115J73522n3098j80962j53691j27262j02820p8292l9924j2339p044k9010
8421A80195p634j2012j1127j8149j3729m996n214K4953r019k7523K5277K1886
8409A42908j1495P953J1611J762j9323l7164Q780K7132k1949k2430J2557N586
8397A05928j6028j2547j7597L593m948K6691K4826J5392p085p758l4417j8647
8385E7403P050J596J5432J7832L489Q297n763j1692j9066J1297M284k966o857
8372H0336q611J742P166J7996P475M219q754j051j128j0898j7601k7671L782Q734
$$ plain form
8457 105017 113885 127257 132997 163860 181811 197158 204776 214274 206412 190541 182341 165971 163518
8444 163518 172447 167631 162509 135076 147141 190462 210720 248944 315549 421566 591126 791115
8432 791115 964637 911539 730577 576886 449624 346804 268512 228588 216249 209205 180195
8421 180195 172561 160549 149422 131273 117544 112548 107334 132287 123268 95745 121022 142908
8409 142908 131413 139366 150977 152739 133416 96252 105032 132164 110215 87785 100342 105928
8397 105928 89900 77353 59756 63349 58401 85092 109918 125310 118225 110467 76050 57403
8385 57403 64453 66049 81481 99313 102802 111099 105336 93644 74578 85875 90159 87193 80336
8372 80336 71725 73467 80633 98629 106104 110323 101569 100518 99390 88492 70891 43220 47002 55736
8358E5736J2292L2926j022j1039m648J4095l917k2445o93o25K665P497J752k1570
8344F1004J3204L01q072J1552J2777j3719k815J8618K253k2460r516L0831J2800
8331A06758j1627j4102k7307o167R721l956j7298m762J4919r08L510J2271J6983
8318G8035K806N83K663Q251K344n025j5444R484p909Q610K0749j0157M306k5177
8304G4119l0257J1008M243n523J4296K8694j704r017j0267J2461J2134J6030N428
8291A21645n032N460r247l42j6487j2399P79k336m2232l128L3891J4409j9452
8278F5529j5164K319J4422L623J435l7680k0055J4031K3564L397Q762J1069m473
8265G0779M782J2998K4483p90j878M276k2913j2117O177K1378j5793q229j1806
$$ plain form
8358 55736 68028 100954 99932 88893 84245 98340 94423 71978 71285 70660 73325 80822 82574 61004
8344 61004 74208 74509 66437 77989 90766 77047 74232 92850 95103 72643 63127 93958 106758
8331 106758 95131 81029 53722 47555 57276 53320 36022 31260 46179 45271 48781 61052 78035
8318 78035 80841 81424 84087 92338 94682 89657 74213 83697 75788 84398 105147 94990 99296 74119
8304 74119 43862 54870 59113 53590 67886 96580 94876 85859 75592 88053 100187 116217 121645
8291 121645 116613 122073 112826 112484 95997 83598 84377 82041 39809 36681 70572 84981 65529
8278 65529 50365 52684 67106 70729 72164 34484 14429 28460 52024 55421 64183 75252 70779
8265 70779 75561 88559 113042 112252 110374 114650 91737 79620 85797 107175 91382 83153 71347
8252G1347j8457j3089K82j6013l560K6886J7245J3066J588r328J8161o216n741
8239G6171j5137J9464K1220j5438M610J4150k2125k2788l3595n345M1786J4287
8227G7260j818l227o782j6452Q739M2772p153l3357j5385J9963N463p792j6368
8214D5863K161J0716r176j4286J5277n773J1226M3430P842m2772j220j0425K5491
8201G8354k422l885l382K2190j2055Q832r053j6015L990R908O625p144j0515j7086
8187D8342r114J7148J0329J2290j3449n802J1116j1063j0544q824k8946k1771
8175a0288O911Q203Q58O35K4355K7143k21o223r09L2208L1575N810m6941k5639
8161D7477K5596r063j3589m366p941R150m936Q518Q619J6933M699k0652o216R325
$$ plain form
8252 71347 52890 39801 40083 24070 20510 47396 64641 77707 79295 69967 88128 81912 76171
8239 76171 61034 80498 101718 86280 90890 105040 82915 60127 26532 21187 62973 77260
8227 77260 75442 72215 65433 48981 57720 100492 93339 59982 44597 64560 70023 62231 45863
8214 45863 48024 58740 49564 35278 50555 44782 56008 99438 107280 64508 63288 52863 78354
8201 78354 75932 72047 68665 90855 78800 87632 78579 62564 66554 76462 83087 75943 65428 48342
8187 48342 39228 56376 66705 78995 65546 59744 70860 59797 49253 40429 11483 -10288
8175 -10288 -3377 4826 5684 6319 30674 57817 57596 51373 50464 82672 114247 120057 73116 47477
8161 47477 73073 64010 50421 46055 38114 47264 42328 50846 59465 76398 81097 60445 54229 63554
8147F3554l197l31K4082l4202J3260J3834r359J554j7851Q820j3133l9363j931
8134E737R543N8972J7376O623J6272N3585M7481M3601p841m7665o3476l1182l2705
8121G6321j4941j8235r731L5804Q176l8642j1240j1276j1867o267L2242K6105
8109E6449L1327L2j1297j7602J500k1026m813L0440l560j8676P906K067M016m285
8095E2478N346j9137m997j7706o197M5702L9891L4863J4109J5682p13q500m2202
8082A08619m4378l498k0079p95q424j2360O034L225r800j2274j0555P31J0133
8069F579K2527L911K2039l143j0465j3845k708r014j046k1284K3859K8267k684
8056D2993K158J0314j8693k5462K0506P850k3947j1534j0074O59K2590K7997m650
$$ plain form
8147 63554 60357 60026 84108 49906 63166 77000 67641 69195 51344 60164 47031 7668 5737
8134 5737 15280 74252 91628 98251 114523 168108 215589 259190 251349 203684 140208 109026 76321
8121 76321 61380 43145 33414 69218 77394 38752 27512 16236 4369 -1898 30344 56449
8109 56449 87776 87808 76511 58909 60409 39383 34570 65010 61450 42774 50680 52747 56763 52478
8095 52478 57824 38687 33690 15984 9787 55489 95380 130243 144352 160034 159321 150821 108619
8082 108619 64241 60743 40664 39869 31445 19085 25119 28344 18544 6270 -4285 -3554 6579
8069 6579 29106 33017 55056 51913 41448 27603 24895 15881 14835 -6449 17410 45677 42993
8056 42993 45151 55465 36772 11310 31816 39666 15719 4185 -5889 -5230 17360 45357 40707
8043D0707j2452K1574N427j3148O91j7004r945k950J9893K1706J1425r270o105
8030E0549K3125n373j1014K8218k1400K258L1035J5180K245k0330j0229M264J9268
8017A07796L2609R783J5920J5935J4137J0353M850O906J6896K0081j5427L5104
8005B74943o62k7716j4634j6197K8021J4782k2047j0746m7194l5425J6687K2152
7993A81964j311j9323r30K8026L3484J2195j4580k1837k5953k677n02K8012J6226
7980B12794J8079j2966O604K3903J9556N6589P0511P2489Q9702J48127K13347
7969I18735J53348K5010r0403j65747j82632j07859o9288n3308m4449l3995J8101
7958C67513J6562m901j4984n6119l4235j5964j566K996j6061k1638J6712j4008
$$ plain form
8043 40707 28255 49829 55256 42108 42799 25795 15850 12900 32793 54499 65924 56654 50549
8030 50549 73674 68301 57287 85505 64105 66363 97398 112578 114823 94493 84264 88528 107796
8017 107796 140405 150188 166108 182043 196180 206533 211383 218289 235185 255266 239839 274943
8005 274943 274281 246565 231931 215734 243755 258537 236490 225744 178550 143125 159812 181964
7993 181964 180653 161330 160400 188426 221910 234105 219525 197688 171735 169058 168556 196568 212794
7980 212794 230873 217907 224511 248414 267970 324559 395070 467559 557261 705388 918735
7969 918735 1072083 1097093 1006690 840943 658311 550452 481164 427856 383407 349412 367513
7958 367513 384075 379174 364190 308071 273836 257872 256306 259302 243241 221603 238315 224307
7946B24307o473Q122L3567M28m2326M733k1933m6385J0154L1458K3109M7165J2166
7933B78092k536M4639N4211L9965P1149J06608J16450N7442j8249o6830j01524
7922E79417p7093n6586p7624l5968j3394p698r235k069k2772k0973m929j7634
7910B33442k4184j3150j2557K688M165N796l4446m0214j0175l2322J8717K7078
7898A24838j0562l654J6050K4738m215m418K2669K2183l4826m8919k7092j5013
7886F1779L9156J4359M191J4301L0251N201j2159j3261k3116j1017o480j2370
7874I0835j1449j8490M862k0170q163K1087q055o919K3556J9414L156j9510l1600
7861C8554j694j2484J1559K2069J4768Q430o559J1600m953k2517j6174j1623J7618
$$ plain form
7946 224307 217834 225956 259523 259951 217625 222358 200425 154040 164194 195652 218761 265926 278092
7933 278092 275556 320195 374406 414371 485520 592128 708578 766020 747771 680941 579417
7922 579417 502324 445738 368114 332146 318752 311054 301819 299750 276978 256005 251076 233442
7910 233442 209258 196108 183551 186239 190404 196200 161754 121540 111365 79043 97760 124838
7898 124838 114276 110622 126672 151410 147195 142777 165446 187629 152803 103884 76792 61779
7886 61779 100935 115294 119485 133786 164037 169238 157079 143818 120702 109685 103205 90835
7874 90835 79386 60896 65758 45588 37425 58512 50457 43538 67094 86508 89664 70154 38554
7861 38554 36860 24376 35935 58004 72772 81202 74643 86243 81290 58773 42599 30976 48594
7848D8594j5526J6416J2976n4316j5341K5070J0698l82K0966K950r470L1430J8881
7835I2946j2502l016n471N198o689K2275m335j7372k9728j685k2900j5644K2897
7822B3974J5119J0386k824r599j3157m970m883l425R276j2442r438OL712K0128
7808B1863J1515k3994L791K1994J5272J7076l4012j1636j255j210J6342J015l768
7795C2993j7639Q26Q555M513J1535k372k8582J0326M0080K0173k0693k980j1129
7782D5606j2474k8367k3612L0499K9465K1253r238K023j5281j750N531m746j4672
7769B4237p116J0961J938j8327l5592J1522K5309J3842J2416O30j4664O86j5414
7756A0428M259L5879j1887P26J1086R904j9717j4994M147k89q029J363k795l2110
$$ plain form
7848 48594 33068 49484 62460 8144 -7197 17873 28571 28189 49155 52105 42635 74065 92946
7835 92946 80444 77428 71957 77155 70466 92741 88406 71034 41306 39621 16721 1077 23974
7822 23974 39093 49479 46655 37056 23899 18929 14046 10621 19897 7455 -1983 -1977 1735 21863
7808 21863 33378 9384 13175 35169 50441 67517 33505 21869 20614 19404 35746 36761 32993
7795 32993 15354 16180 24735 29248 40783 38411 9829 20155 60235 80408 59715 56735 45606
7782 45606 33132 4765 -18847 11652 41117 62370 53132 55155 39874 38124 43655 38909 24237
7769 24237 17121 28082 30020 11693 -23899 -12377 12932 26774 39190 39820 25156 25842 10428
7756 10428 14687 50566 38679 39405 50491 60395 40678 25684 29831 29542 21513 22876 20081 -12029
7742a2029k3203J6608N9093j0539j5522O559n843K0372j9050k4068j668j0290
7730a9580J4838L269j3215j0420m633J4455P626j8613L953J0600j3263Q808J4955
7717a220j5835J3141o065m705N634n533n789J3768M3142l023O061j5282j651Q212
7703C0855k0002j8554J122P315K009K7749J2082k253j1122j5117l380J4039K0016
7690D4759m808O733P98j6392k4557k3288K5271R17J6081K9346J6597j0631k2028
7677C8798o384Q023J5203J3826j2805j3739J836k1292L421R27l2257J187P523
7664D267j599q091j0771o427M857J1262J9264q469J095l500L4764O815P76Q927
7650E3170k5240n619J2837p925q168q982L2559P265J5263J1719p760j3088k909
$$ plain form
7742 -12029 -35232 -18624 40469 29930 14408 20967 15124 35496 16446 -7622 -9290 -19580
7730 -19580 -4742 -1473 -14688 -25108 -29741 -15286 -7660 -26273 -22320 -11720 -24983 -16175 -1220
7717 -1220 -17055 -3914 -9979 -14684 -9050 -14583 -20372 -6604 36538 33515 39576 24294 22643 30855
7703 30855 10853 -7701 -6579 736 2745 30494 42576 40323 29201 14084 10704 24743 44759
7690 44759 39951 46684 47482 31090 6533 -16755 8516 9433 25514 54860 71457 60826 38798
7677 38798 32414 40437 55640 69466 56661 42922 44758 23466 26887 27814 -4443 -3256 4267
7664 4267 2668 -5423 -16194 -22621 -17764 -6502 12762 4293 5388 1888 36652 43467 44243 53170
7650 53170 27930 22311 35148 27223 19055 10073 42632 49897 65160 76879 69119 56031 53122
7637E3122k9140k4659J3382L858m06p780J6327L0229n691k277m742j5225k4145
7624B853J6216K4384q556O50j5126r357P423l401J5424J0303J310r00j2857j1593
7610A6773J1207K0695j3138n251O707L6096m886k7340j7794J0164j2089n565J1580
7597B7159K207p757J934o533q410K459l972j0621J2927K3043r005j6936J7497
7584B3992L6684p417j9079k1868K2728j012k5662j1598J8034J5394r038m6379
7572b5221k7537J1762K6391J5187L600J3313j5767k5625J3808r94O561L1610J2072
7559C9160Q666K9196J3176j6466K743j1076k9802p73L8541N007k6191j2497n769
7546C3915n969L584k4312j0787O013K3525J9136l4465k6327L907J7565K8712q666
$$ plain form
7637 53122 23982 -677 12705 16563 16157 8377 24704 54933 49242 46965 42223 26998 2853
7624 2853 19069 43453 34897 35547 20421 11064 18487 15086 30510 40813 42123 41223 28366 16773
7610 16773 27980 48675 35537 30286 36993 73089 68203 40863 23069 33233 21144 15579 27159
7597 27159 29366 21609 23543 17010 8600 11059 7087 -3534 9393 32436 23431 6495 23992
7584 23992 60676 53259 34180 12312 35040 34028 8366 -3232 14802 30196 21158 -25221
7572 -25221 -52758 -40996 -14605 582 4182 17495 1728 -23897 -10089 -11083 -4522 27088 39160
7559 39160 47826 77022 90198 73732 76475 65399 35597 34824 73365 78372 52181 39684 33915
7546 33915 27946 31530 7218 -3569 2444 25969 45105 10640 -15687 -11780 5785 34497 25831
7533B5831l4935K7077K2297K1812N852J2733M414k8929l0877J5143j4230q767
7521A7421j8698j1087J0367K09J4353l324k802J7325J5605M015j6164j773p84
7508B4663j5080j8609j2237q872J4170j6805L911J9983J6818K0945l567j1959
7496A3361O204J1416k8010j9048p66K6643L0745p965j8099K0153j479m429L383
7483C2109k3126l5296K1529J0504k9789q098J6043K9618l9448L074n091m361J8697
7470a3635N57k7478l328L2679K6957L306J2306k6684K9397N2615M557l3438P884
7457F5695j881j3248j7955m00j618j6065p855J1921J6525p695k1938l2912n460
7444c2886Q336j4744J6040Q223J3648q626N673P259O424J2610j6300m541J0012
$$ plain form
7533 25831 -9104 17973 40270 62082 67934 80667 85081 56152 25275 40418 26188 17421
7521 17421 -1277 -12364 -1997 -1788 12565 9241 6439 23764 39369 43384 27220 25447 24663
7508 24663 9583 -9026 -21263 -30135 -15965 -32770 -28859 -8876 7942 28887 25320 13361
7496 13361 19565 30981 2971 -16077 -16843 9800 40545 32580 14481 34634 33155 28726 32109
7483 32109 8983 -26313 -4784 5720 -24069 -32167 -16124 13494 -25954 -22880 -27971 -32332 -13635
7470 -13635 -13078 -40556 -43884 -11205 15752 19058 31364 4680 34077 86692 91249 57811 65695
7457 65695 63814 50566 32611 32211 30593 14528 6673 18594 35119 27424 5486 -27426 -32886
7444 -32886 -24550 -39294 -23254 -15031 -1383 -10009 -4336 2923 9347 21957 5657 1116 11128
7431A1128K4983J4360R574M234m241l943k3047l1664l626M0308k0848P541K9590
7418E4349K6229l9522m134J5430k999m1055l7407J1360J5148N01l651K2953j1307
7405E895k479p77o858J5672K2053j0637m556J9455r178J8578N507J6300p230j2292
7391D9453Q171O555j4620j1769J0278j4456j0244M020K8800J3127k6150j3536
7379B9629o372N513k474P139j1254k365j9493m196J7115j5895j8695p968L9165
7366I849o240j7661J2523j2811j0217J251J9673J649J0118L4338K5107j4676l1988
7353B0915k804J1412P898k006M573J438M708L37j5524k3888o583R507K0705j4496
7339A6192J5729Q995m327j2253j0489R150L851l56j0032Q239m193K432j6051R4
$$ plain form
7431 11128 36111 50471 60045 64279 60038 56095 33048 1384 -2242 38066 17218 24759 54349
7418 54349 80578 41056 36922 52352 49353 8298 -29109 -17749 -2601 -2100 -5751 17202 5895
7405 5895 3416 2639 -4219 11453 33506 22869 18313 37768 28590 47168 52675 68975 61745 49453
7391 49453 57624 64179 49559 37790 48068 33612 23368 27388 56188 69315 43165 29629
7379 29629 23257 28770 26296 33435 22181 19816 323 -3873 13242 -2653 -21348 -29316 9849
7366 9849 3609 -14052 -1529 -14340 -24557 -23306 -3633 -1984 8134 42472 67579 52903 20915
7353 20915 18111 29523 37421 35415 39988 41426 46134 46471 30947 7059 476 9983 30688 16192
7339 16192 31921 40916 36589 24336 13847 22997 26848 26492 16460 24699 20506 22938 6887 6981
7325F981K5131Q440j1707r970j3155p360J063K7600J760k680P421k1676l3883
7312b2035N115K3267J0412N17J608j1594l7335q414O317M5398L53P009N213p732
7298A8099j6801j6813j4548J8K4639K2674K5787j4219J4370j8812J9613m725j465
7285C7817j682j8723r524n119l026K9965P492q27r188k210j1520J4484l411r921
7271A4607o856J2625j9228l0565J3189N443K2167K8525j0025r978k6194p432P320
7258f402K4207K50k764p496Q03Q899K5567o75k3726l9434l792K1894J1619N998
7244A4948J0976k530p13j5013n004j652J6110R236j2748j2723m673N29j5859j4390
7230c3506M587K814K2832j2336J3132R303j1891j9712j8174j862P07j3525L2714
$$ plain form
7325 6981 32112 40552 28845 18875 5720 -1640 -577 27023 28783 26103 33524 11848 -22035
7312 -22035 -16920 6347 16759 17276 18884 7290 -30045 -38459 -32142 13256 13609 20618 25831 18099
7298 18099 1298 -15515 -30063 -30045 -5406 17268 43055 28836 43206 24394 44007 39282 37817
7285 37817 36135 17412 7888 2769 -257 29708 37200 36373 27185 24975 13455 27939 24528 14607
7271 14607 7751 20376 1148 -29417 -16228 -10785 11382 39907 29882 19904 -6290 -13722 -6402
7258 -6402 17805 18055 15291 7795 8598 17497 43064 42389 18663 -20771 -24563 -2669 8950 14948
7244 14948 25924 23394 22681 7668 2664 1012 17122 26358 13610 887 -3786 -3257 -19116 -33506
7230 -33506 -28919 -26105 -3273 -15609 -2477 6826 -5065 -24777 -42951 -44813 -44106 -57631 -24917
7217b4917N013L823m431N049l298K402L2029j544r093j2955o839O948m465j1741
7203b4019P180J0584j5975p094j3210J382J9259P230l089J3793Q670J0285J4740
7190B9736j9015k2275J9397J1155o02J0254k2213o819K131K4964L6318n669k0999
7177C6363k8426j8623j1968O665L3334K654l651J2898j6176j6199J0804K554O356
7164A6585J5645j7691k1255m678l6448K495J4615K3879k436q239J6796O465n498
7151B35n790j3944K3811K8248k663K0697r742k8636m025O304O545J3529N859j9021
7137B1407N495k0225k8380j9648K792J9064o986l2897k031L3618J9536R489J5160
7124A6394j3186j0623P929J0010q259j6825O729K9964j080j3328j5678k8753n081
$$ plain form
7217 -24917 -19904 -16081 -20512 -15463 -18761 -16359 15670 14126 5033 -7922 -14761 -7813 -12278 -24019
7203 -24019 -16839 -6255 -22230 -29324 -42534 -41152 -21893 -14663 -17752 -3959 4711 14996 29736
7190 29736 10721 -11554 7843 18998 18396 28650 6437 -382 1749 26713 63031 57362 36363
7177 36363 7937 -10686 -22654 -15989 17345 19999 16348 29246 13070 -3129 7675 10229 16585
7164 16585 32230 14539 -6716 -11394 -47842 -45347 -30732 -6853 -9289 -17528 -732 5733 235
7151 235 -5555 -19499 4312 32560 29897 50594 40852 12216 8191 14495 21040 34569 40428 21407
7137 21407 26902 6677 -21703 -41351 -38559 -19495 -26481 -59378 -61409 -27791 -8255 1234 16394
7124 16394 3208 -7415 514 10524 2265 -14560 -7831 22133 21053 7725 -7953 -36706 -41787
7111d1787J4350j9631J3802j198K4350O448K8840k344k1162q006p676j801N227
7098a0588L698K7049J6523J662p101k1003p435p873l661K0144J4094j4303j3062
7085a856J104J5591j8971l9245q651K344L3964J9092j2762m296L1766j2973m953
7072A54O110m819q029K596J105j1841J6813k0134j5593K8084M3183J6138m48j6320
7058C6999j2197J9379j5024k0707K45m639P144n269J7149J6737J4195o398k1209
7045B6405M432k0428m926J3970j1448l276K0440K091l3042k8987J6253M879K3720
7032A0083J6109o581o529l1568J7165K0126M013l140K208j3917N231K4893P92
7019C8885j339k3408j2994K4510M490r357M684j9890j3199P528K101r518J2350
$$ plain form
7111 -41787 -27437 -47068 -33266 -34464 -10114 -3666 25174 22830 1668 -6338 -14014 -15815 -10588
7098 -10588 -6890 20159 36682 38344 31243 10240 2805 -5068 -8729 11415 25509 11206 -1856
7085 -1856 -752 14839 -4132 -43377 -52028 -49684 -15720 3372 -9390 -13686 18080 5107 154
7072 154 6264 1445 -6584 -3988 -2883 -14724 2089 -18045 -33638 -5554 37629 53767 53319 36999
7058 36999 24802 44181 29157 8450 8695 4056 11200 5931 23080 39817 54012 47614 26405
7045 26405 30837 10409 5483 19453 8005 4729 25169 27260 -5782 -34769 -18516 -13637 10083
7032 10083 26192 19611 13082 -18486 -1321 18805 22818 19678 21886 7969 13200 38093 38885
7019 38885 37546 14138 1144 25654 30144 20787 25471 5581 -7618 -90 2011 -7507 4843
7006D843L676O25P298J2416m521l2630k8854P549M2828L046k3313j2286M0555
6993B1232L5768P776l1603j3819j323m951j4865L189O422J8621P315n2093j8138
6980c6469L3539J0588j5875j0028K4791j1802M215j005K885R334k630o117j7969
6967a6543R125n258K3998n442k1615J9523K4103n801j9881Q929J4471O393j3223
6954A8779k5079k991n099k5140m039j0994J8123L5510J595J3598K236m957K5027
6941C6569Q92J6199J9790l263k7816k5761p313O762j8834K795k048P689j1971
6928f310M198N436J8331R894J8965k113k3674j1896K627J585K6103j3908J372
6915C0610q501Q91q034J0873o524j4856j3424n640Q650M713j6992K3883j0887
$$ plain form
7006 4843 8519 9144 16442 28858 24337 -8293 -37147 -29598 13230 16276 -7037 -19323 21232
6993 21232 57000 64776 33173 19354 18031 13080 -1785 1404 7826 26447 33762 -18331 -36469
6980 -36469 -2930 7658 -8217 -18245 6546 -5256 -1041 -2046 839 10173 7543 1426 -16543
6967 -16543 -7418 -12676 11322 5880 -15735 3788 27891 22090 2209 11138 25609 32002 18779
6954 18779 -6300 -9291 -14390 -39530 -43569 -54563 -36440 -930 665 14263 16499 11542 36569
6941 36569 37461 53660 73450 70187 42371 16610 9297 16059 -2775 20 -2028 5661 -6310
6928 -6310 -2112 3324 21655 31549 50514 48401 24727 12831 15458 17043 43146 29238 30610
6915 30610 22109 23000 14966 25839 19315 4459 -8965 -14605 -5955 -1242 -18234 5649 -5238
6902e238j7880j7683J1729M000K0055J3432j1453l2393N300J9873J6937k1481
6890a4802j4947J3681R945k6322l5395r14N042N6896K4147j1993J0481M326k3397
6877c252J1940L7745K082l1249k408J3247J3407k4669j4819j785j7044n068K5111
6864C238K0060j0979r485r719j3903k3177j7045Q865J1571J928j6160j3787J3703
6851e4890M2116J9861K688l1647l2970j6947L7966N1415q934J2560k3990j2469
6839a5241J233j4213r736L2049K3680J4038j4742j2366n797j471J5268J4443l848
6826B3297k1667Q399R503k695P468K1556l716k2819k9337l1787j5652J3508K2562
6813b1380l950j5460k006J9110j0422O828J4752R787J9607J8923j4101O68l7049
$$ plain form
6902 -5238 -23118 -40801 -29072 -25072 -5017 8415 -3038 -35431 -30131 -10258 6679 -14802
6890 -14802 -29749 -16068 -6123 -32445 -67840 -68754 -63712 -6816 17331 5338 15819 20145 -3252
6877 -3252 8688 46433 48515 17266 14858 28105 41512 16843 2024 239 -16805 -21873 3238
6864 3238 23298 12319 2834 -6885 -20788 -43965 -61010 -52145 -40574 -38646 -54806 -68593 -54890
6851 -54890 -12774 7087 9775 -21872 -54842 -71789 -33823 17592 8658 21218 -2772 -15241
6839 -15241 -14008 -28221 -37957 -5908 17772 31810 17068 4702 -1095 -2566 12702 27145 23297
6826 23297 1630 10029 19532 16837 24305 45861 42145 19326 -10011 -41798 -57450 -43942 -21380
6813 -21380 -25330 -40790 -42796 -23686 -34108 -27280 -12528 -2741 16866 35789 21688 22356 -14693
6800a4693l7980J8125K4182l679p400J1811K5370M694L4442J2837m6460k1453
6788b04j6594K45L0947Q294m834m688L733J3616Q095j4797r707K454R414k482
6774B3492J751n072q430n779J6285K49K2565L684l9662n165J0872J0569k8696
6761c337j2332q739J2717K4753m960l4666N465r72j4404K3211p075j2119r87j451
6747c4896O064K1322P223j2333K1691q848P884J5164J3696j7630l5253k4605J5105
6734b5416k8q295j3465P857P836P451L1124N451l8106Rj1346p623K2755L1808
6720A0012J8821l5605n871K0009p323j3099n05O27j0898Q122j3208N452J7066
6707f400j2950j9001p632K5365J0082j2261k0009j6366K0669K6655j518j7669
$$ plain form
6800 -14693 -52673 -34548 -10366 -14045 -21445 -9634 15736 20430 54872 67709 21249 -204
6788 -204 -16798 -16553 14394 22688 17854 13166 16899 30515 38610 23813 14106 16560 25974 23492
6774 23492 25243 20171 11741 5962 22247 22496 45061 48745 9083 3918 14790 25359 -3337
6761 -3337 -15669 -24408 -11691 13062 8102 -26564 -21099 -22071 -36475 -13264 -20339 -32458 -33445 -34896
6747 -34896 -28832 -7510 -287 -12620 9071 223 8107 23271 36967 19337 -15916 -40521 -25416
6734 -25416 -25444 -33739 -47204 -39347 -31511 -24060 7064 12515 -25591 -25582 -36928 -44551 -21796 10012
6720 10012 28833 -6772 -12643 7366 43 -13056 -13561 -12934 -23832 -15710 -28918 -23466 -6400
6707 -6400 -19350 -38351 -45983 -20618 -10536 -22797 -42806 -59172 -38503 -11848 -13366 -31035
6695c1035j0707j5452J9736O078n191J2127J1757k058j6077j9640K5978J8787
6683e697n845L250J1790l760o657L4904K7226j9925o0661l0793O477L4264p004
6670b2431k5273J2380J0084R773L4493k6361l3337p032K3670J2210n941L557k66
6657a4474j5828O66Q196L2782Q610l1486r376L801J9003O677q552R78j3422l7613
6643e0038j0242O663K0307k762j0162J6604N984J8335j2901j0204J4023K8147
6631A3754j0305l5514j8547P697q80j5937L4208K8136k0762J016j1509J2708K6063
6618A0128J1609j187k2434k0797r988l7416J2059K9207J373M401L692j1218j3094
6605d3665J3130j1540l3109J6158O453l617J7777J2479p216R538J766K706j8048
$$ plain form
6695 -31035 -41742 -57194 -37458 -31380 -36571 -24444 -12687 -14745 -30822 -50462 -24484 -5697
6683 -5697 -11542 -8292 3498 -262 -6919 27985 55211 35286 -25375 -56168 -49691 -15427 -22431
6670 -22431 -47704 -35324 -25240 -15467 19026 -7335 -40672 -47704 -24034 -11824 -17765 -14208 -14474
6657 -14474 -30302 -29636 -21440 11342 19952 -11534 -20910 -17109 1894 8571 19 997 -12425 -50038
6643 -50038 -60280 -53617 -33310 -36072 -46234 -29630 -23646 -5311 -18212 -28416 -14393 13754
6631 13754 3449 -32065 -50612 -42915 -43795 -59732 -25524 2612 -18150 -17134 -28643 -15935 10128
6618 10128 21737 20550 -1884 -22681 -32669 -70085 -58026 -28819 -27446 -23045 -19353 -30571 -43665
6605 -43665 -30535 -42075 -75184 -59026 -52573 -56190 -38413 -25934 -33150 -23612 -21846 -19140 -37188
6592c7188J0964J5577j3885j2051R061r363n531J3187M699j6323M384m676j8122
6579e9267k173J8466K8799j707l135l305N772J0291j2279J3362J3720K4065L108
6566C5717L719k6056k6152J173K6233K681j0856q171l2924K8540L0809R576j7219
6553A7070j2857J3954o73o539j2287P752J0525j0198k9503R598R814L7584j0924
6540B3316l1602k1175j0389J554K6431K8549q664J8801K5114Q099n475p665j8124
6527B8770Q119k0661j1926j3594j5311J1316J4400L4380j8906j0292j5554j271
6515a0530k369M87j0143j0044J9997q963j2724J6388L348P969j144J836K1553
6502A5661l520l5574K17k911R799M047J4264L4872P303j9720r720j0398J3949
$$ plain form
6592 -37188 -26224 -10647 -24532 -36583 -27522 -36885 -42416 -29229 -24530 -40853 -36469 -41145 -59267
6579 -59267 -61440 -42974 -14175 -15882 -19017 -22322 -16550 -6259 -18538 -5176 8544 32609 35717
6566 35717 39436 13380 -12772 -11599 14634 17315 6459 -1712 -34636 -6096 24713 34289 17070
6553 17070 4213 18167 17494 10955 -1332 6420 16945 6747 -22756 -13158 -3344 34240 23316
6540 23316 -8286 -29461 -39850 -38296 -11865 16684 8020 26821 51935 60034 54559 46894 28770
6527 28770 36889 16228 4302 -9292 -24603 -13287 1113 35493 16587 6295 -9259 -10530
6515 -10530 -12899 -12412 -22555 -32599 -12602 -21565 -34289 -17901 -14553 -6584 -7728 -5892 15661
6502 15661 12141 -23433 -23216 -26127 -16328 -12281 1983 36855 44158 24438 14718 4320 18269
6489A8269J195j1653m836j707K239j3590q343j0565K5567K4511k0468p711R933
6476B841N951k051k2193O373J1500M798k8116k2892L0297N06j7548o06K145k2358
6462e1353J4815K6980K0136j3321J767M351l1318O680j3625Q094J6493K4995J3061
6449B7755p860n141l92l413l1975j0890m031J9588M935k892K0565K7368j8237
6436A5380l2454k259J3423k482p30j0269r402M9403K6697K983l5311j6856n839
6423g716k7675K857L4917J2111R888R465O847k1649j9782k1039j8460l40J6404
6410b4172L9694K2359P642j7699q83K8919M680l0949j2426k749j0714q749j5885
6397b0932l703J1540J0155l288R829l4764k6251R358K1303M221K0740M4483j5803
$$ plain form
6489 18269 19464 7811 2975 1268 3507 -10083 -18426 -28991 -3424 21087 619 -7092 2841
6476 2841 8792 6741 -15452 -9079 2421 7219 -20897 -43789 -13492 -12986 -30534 -31140 -28995 -51353
6462 -51353 -36538 -9558 10578 -2743 -976 3375 -27943 -21263 -34888 -26794 -10301 14694 27755
6449 27755 19895 14754 14362 10949 -21026 -31916 -35947 -16359 -11424 -14316 6249 33617 15380
6436 15380 -17074 -19333 -5910 -8392 -9122 -19391 -28793 20610 47307 50290 14979 -1877 -7716
6423 -7716 -35391 -32534 2383 14494 24382 33847 40694 19045 -737 -21776 -40236 -40576 -24172
6410 -24172 15522 37881 45523 27824 26941 55860 60540 29591 17165 14416 3702 -5047 -20932
6397 -20932 -24635 -13095 -2940 -6228 3601 -31163 -57414 -48056 -26753 -22532 -1792 42691 26888
6384B6888k7185r107J446j3690J1975j4164j9086M555K4478J2940j2548l5855
6372d9353k471L1525Q289K578J5244o052j6466J5907r236q180R653K1403P635
6359B0476o098r306j3004J9605O180m4672J0057K4795l562o758J2539R341p520
6346A2073K6p175O881K5286P919k1545k9589k1519r394q950l0976J3644n222k3187
6332i1728M572J1964L115J4118J7475J0462P037P04m192J1967k899j7501j6467
6319e1373j1766J7418K0922J3689M981J2254j0535j0721R287j9521j1826j0710
6307d7901J0411J743J881m109j9690K2890P608P713r61n43J2737j706R736K6404
6293B6213j2322l1420k49K8108J0387o137J85j8104j0471j902L872J7373P661
$$ plain form
6384 26888 -297 -9404 -7958 -21648 -9673 -23837 -42923 -38368 -13890 -950 -13498 -49353
6372 -49353 -51824 -20299 -12010 -9432 5812 -240 -16706 -799 -10035 -18215 -8562 12841 20476
6359 20476 14378 5072 -7932 11673 17853 -26819 -16762 8033 4471 -2287 10252 19593 12073
6346 12073 12099 4924 11805 37091 45010 23465 -6124 -27643 -37037 -45987 -76963 -63319 -68541 -91728
6332 -91728 -87156 -75192 -72077 -57959 -40484 -30022 -22985 -22281 -26473 -14506 -17405 -34906 -51373
6319 -51373 -63139 -45721 -24799 -11110 -6129 6125 -4410 -15131 -5844 -25365 -37191 -47901
6307 -47901 -37490 -35747 -33866 -37975 -57665 -34775 -27167 -19454 -20415 -20958 -8221 -9927 -191 26213
6293 26213 13891 -17529 -17778 10330 20717 14580 14765 -3339 -13810 -15712 -11840 5533 13194
6280A3194k909R90K486J0815k4905k0743p242K0888J9342j861P859Q591j7716
6267H789k372p257k0110k5838k4206j2886J8529l242R841j232N60O843J5091M0853
6253C363N568o649k3518m059k744O62J3816R453k0554r041J1610J7429J610p968
6239a1022K3409j0724K984j57n672q493j591R41j7948m281J4080J27K527K7075
6225A1255P816l1546k4971O795O157p615J5935K0382P953J4182m729j8656l6633
6212c3675M090K4009R725K191j7539J1751r941l040K1396K631J1086j281j9820
6199A583j5253k0863J5990o030r566n141J4852O119J4213M1035O648o386j9210
6186A7991O16J8475j4521j4974j1880j9288K9843K3862M428L597j442k3704l6106
$$ plain form
6280 13194 10285 11275 13761 24576 -329 -21072 -28314 -7426 11916 10055 17914 26505 8789
6267 8789 6417 -840 -20950 -46788 -70994 -83880 -65351 -68593 -58752 -59984 -59424 -52581 -37490 3363
6253 3363 8931 2282 -21236 -25295 -28039 -27377 -13561 -4108 -24662 -33703 -22093 -4664 -3054 -11022
6239 -11022 12387 1663 4647 4490 -1182 -9675 -11266 -10325 -28273 -32554 -18474 -18347 -15820 11255
6225 11255 19071 -12475 -37446 -30651 -24494 -32109 -16174 4208 12161 26343 21614 2958 -33675
6212 -33675 -29585 -5576 4149 6340 -11199 552 -9389 -12429 8967 11598 22684 21403 1583
6199 1583 -13670 -34533 -18543 -24573 -34139 -39280 -24428 -18309 -4096 36939 43587 37201 17991
6186 17991 18607 37082 22561 7587 -4293 -23581 6262 30124 34552 38149 36707 13003 -23103
6173b3103Q808J1263j1040J5069q516k2364j2871M618J7403K55M227J7794k9773
6160b8230O85Q995K7648j1700l131q795j0792j8212J316K8347J9220o863r846
6147a1358M64m585j9706j0091O742J929J5040L5811k097p414j2041j7126K0050
6134d382L384o606j509M083j1783J3203K0087K2007o001K041L61p091k7180M818
6120E432l746N092R867q335j0056j7502J6113J5108L2603j1142m8349J225q85
6107a4575M105J7255Q611k0223m3070k823K1687K1464O109K195j2576J1685J613
6094A457J8729p330k7881k378K5541n048j6290j9012R669J8755L142l2214J1579
6081b1281L3556J4078j5059j2030j5455k4276R395J7296j0694j0278q392K5085
$$ plain form
6173 -23103 -14295 -3032 -14072 997 -7519 -29883 -42754 -38136 -20733 -20478 -16251 1543 -28230
6160 -28230 -27545 -18550 9098 -2602 -5733 -14528 -25320 -43532 -42216 -13869 5351 -1512 -11358
6147 -11358 -10894 -15479 -35185 -45276 -38534 -36605 -21565 14246 12149 4735 -7306 -24432 -4382
6134 -4382 -998 -7604 -9113 -5030 -16813 -3610 16477 38484 32483 34524 34885 27794 614 5432
6120 5432 1686 6778 16645 8310 -1746 -19248 -3135 11973 44576 33434 -14915 -13690 -14575
6107 -14575 -10470 6785 15396 -4827 -47897 -50720 -29033 -7569 -1460 735 -11841 -156 1457
6094 1457 20186 12856 -15025 -17403 8138 3090 -13200 -32212 -22543 -3788 -646 -32860 -21281
6081 -21281 12275 26353 11294 -736 -16191 -40467 -31072 -13776 -24470 -34748 -43140 -18055
6069a8055J0808r072l1749j5482J0327J4703M234L148j501J8517M7950J4642j384
6056D7086l5209j5136J9992n373j2668j2930L082J9258P40k370q081J0080M862
6043A3333P837k8725l2717J3601j6499j3530L7212L1866j4868J1066L459j8515
6031f480j8055l505L795j838K356k090j4569q935K5691J569j8099r808l010j1426
6017f4404J3094J749q901j643K8720J8759m247j5291k569J2776R348O249K386
6004c974p286j5434K068l300m088J6884P991J8052k400L779k2766j3545P841l4164
5990e0342M579K2198l239o86P014k3908j1815M1024O701J8026L623j2857K06J865
5976B389m839l1266k012M8771R109q84k8281p252j4401n989J1622J4185J3600
$$ plain form
6069 -18055 -7247 -16319 -48068 -63550 -53223 -38520 -34286 -31138 -32639 -14122 33828 48470 47086
6056 47086 11877 -3259 16733 11360 -1308 -14238 -11156 8102 8842 6472 -1609 8471 13333
6043 13333 21170 -7555 -40272 -26671 -43170 -56700 -19488 12378 -2490 8576 12035 -6480
6031 -6480 -24535 -28040 -24245 -26083 -23727 -25817 -40386 -49321 -23630 -22061 -40160 -49968 -52978 -64404
6017 -64404 -51310 -49561 -58462 -60105 -31385 -12626 -16873 -32164 -34733 -21957 -12609 -6360 -3974
6004 -3974 -11260 -26694 -24626 -27926 -32014 -15130 -7139 10913 8513 12292 -10474 -24019 -16178 -50342
5990 -50342 -45763 -23565 -26804 -27490 -20476 -44384 -56199 -15175 -8474 9552 13175 318 524 2389
5976 2389 -2450 -33716 -35728 13043 22152 21268 -7013 -14265 -28666 -34655 -23033 -8848 4752
5963D752o240L198k7725J462l161l968j4573j215K5745O6347J6400r658l2073
5950A9291j0796p666o547P302j7917l3594J8310M2657J2494P487o757j9380O251
5937A1135J1834J6340k4217k4864N847M19j4473j9569Q071J1545k1410j1455Q939
5924d1858j5312K1606M5995K4422j5552j8345L614k566R493Q354j9085k0177J3277
5911f134K0342j1610K762J1342K815K2068j5509O749N962J4789k604j0978m1378
5898a384o294K5480L32J146k2286o566j0529o084k8086J0455L7067j0552j051
5885a8352J5628p080N72J6799j7046Q982J0946j15k3210Q906j018M2415L3380
5872G0807N404l8304k3290j1163m4246j0232L2602K6752K9485J3021j5539l7993
$$ plain form
5963 4752 -1488 1710 -26015 -24553 -27714 -31682 -46255 -47470 -21725 44622 61022 51364 19291
5950 19291 8495 829 -5718 1584 -16333 -49927 -31617 11040 23534 31021 24264 4884 11135
5937 11135 22969 39309 15092 -9772 -3925 -3506 -17979 -37548 -29477 -17932 -39342 -50797 -41858
5924 -41858 -57170 -35564 10431 34853 19301 956 4570 2004 11497 19851 766 -19411 -6134
5911 -6134 14208 2598 5360 16702 19517 41585 26076 32825 38787 53576 50972 39994 -1384
5898 -1384 -7678 17802 18134 19280 -3006 -9572 -20101 -26185 -54271 -43816 -6749 -17301 -18352
5885 -18352 -2724 -9804 -9232 7567 -9479 -497 10449 10334 -12876 -3970 -4988 37427 70807
5872 70807 76211 37907 14617 3454 -40792 -51024 -18422 8330 37815 50836 35297 -2696
5860b696j181m801K1049J0345K2122r695K0572l239j2221P005j6044n549j8187
5847G480q661j4040j7173R268J1875k0180j4065K8679P779K3934M916j0258k0684
5834a1130k6371j093K9341J7564l228j7809j8695j9470N75K8406L243m12n609
5821b4688K638k3802O74j8498j9575j0522J0572L2928J4507j4547J3102J0158
5809b7053j5113l662J7884J137m753J2648J5483j2664J0995j477j419J7920k4352
5796a4426j616K2449j0092j9201m542k7k6950R087J3676q308J4860L576r585q237
5782c9336Q278M853j1163r17J1288J4907l832m186j797n187j2609K2732L566j7504
5768c0907O861O712K2332k2249j5055K4272k5320P13k8171o957J3163Q023J1311
$$ plain form
5860 -2696 -3877 -8678 12371 22716 44838 35143 55715 52476 40255 47260 31216 25667 7480
5847 7480 -1181 -15221 -32394 -23126 -11251 -31431 -45496 -16817 -9038 14896 19812 9554 -11130
5834 -11130 -37501 -38594 -9253 8311 5083 -12726 -31421 -50891 -50316 -21910 -18667 -19079 -24688
5821 -24688 -22050 -45852 -45178 -63676 -83251 -93773 -83201 -50273 -35766 -50313 -37211 -27053
5809 -27053 -42166 -45828 -27944 -26807 -31560 -18912 -3429 -16093 -5098 -6575 -7994 9926 -14426
5796 -14426 -16042 6407 -3685 -22886 -27428 -27455 -54405 -45318 -31642 -39950 -25090 -21514 -31099 -39336
5782 -39336 -31058 -26205 -37368 -38285 -26997 -12090 -15922 -20108 -21905 -27092 -39701 -16969 -13403 -30907
5768 -30907 -24046 -17334 4998 -17251 -32306 -8034 -33354 -32641 -60812 -67769 -54606 -46583 -35272
5755c5272k2697K0774J9438P689J5994m576l0417m836k099q114L7244R553j318
5742A363J769j6238l709N649K609M838Q115k5390j5592J8976o600m463J8700O469
5728c504k7562q683M0258K0071j292n134j5407k0744p269o503J273l803n190m037
5714d7526o697j75L1198L4054l903k2014J096R681k8404j1876O317K0228O994
5701a1027J392k543J335p8j8121n09K0427j2814o936j7083p667P898l5831q64
5687h2421J4317M613J8477K6107l653j3548n990J8212q630K1715P233p336j027
5674a1931Q114P963j3841K068P729L052j2288m197q378p923m715R147J1365P073
5660f762p817m7419k0141K3682L5329J7670k9682J9955M0263k5546k4758M601
$$ plain form
5755 -35272 -57969 -37195 -17757 -10068 5926 1350 -29067 -33903 -36002 -44116 -6872 2681 1363
5742 1363 3132 -13106 -16815 -11166 -8557 -3719 4396 -20994 -36586 -17610 -24210 -28673 -9973 -3504
5728 -3504 -31066 -39749 509 20580 19288 14154 -1253 -21997 -29266 -35769 -34496 -38299 -43489 -47526
5714 -47526 -54223 -54398 -23200 10854 6951 -15063 -13967 -4286 -32690 -44566 -38249 -18021 -11027
5701 -11027 -9635 -12178 -10843 -10921 -29042 -29551 -9124 -21938 -28874 -45957 -53624 -45726 -81557 -82421
5687 -82421 -68104 -63491 -45014 -18907 -22560 -36108 -42098 -23886 -32516 -10801 -3568 -10904 -11931
5674 -11931 -3817 4146 -9695 -7627 102 3154 -9134 -13331 -21709 -29632 -34347 -25200 -13835 -6762
5660 -6762 -14579 -61998 -82139 -58457 -23128 -5458 -35140 -15185 25078 -468 -25226 -20625
5648b0625M904N947m054M040J3339J2498J3809k580k0049l6231n156J1007N326
5635a7825K18q186O847J2816k0042M612J4496J3583K7673j0476k3455r08K613
5622A966Q458J828Q90k8680l0682J1763K0097o31r453K3595K5587J5838k1738
5609A8838l6554r792N449J0304L5109K5823K2770k6965n0621j1675Q931m158o079
5596a8620K437n804N718M220J026j0600l0305j170J2552k984R623R495j6637k7559
5582f8608k48R774K0478J110M605O467r149Q497O6k5807Q952M3258J5481p698
5568G178j064O019j8228K289j1098j5704Q163J4226Q708o459o93R630l436J3779
5554A3310J5682j965J8674J1583k4634j26J324j0603j1117r159l9237J0166k37
$$ plain form
5648 -20625 -15721 -9774 -13828 -9788 3551 16049 29858 27278 7229 -29002 -34158 -23151 -17825
5635 -17825 -17607 -25793 -18946 -6130 -26172 -21560 -7064 6519 34192 23716 261 -647 1966
5622 1966 10424 12252 13142 -15538 -46220 -34457 -14360 -14991 -24444 -849 24738 40576 18838
5609 18838 -17716 -27508 -22059 -11755 23354 49177 71947 44982 -5639 -17314 -8383 -12541 -18620
5596 -18620 -16183 -21987 -16269 -12049 -11023 -21623 -51928 -53098 -40546 -43530 -33907 -24412 -41049 -68608
5582 -68608 -68856 -59082 -38604 -37494 -32889 -26422 -35571 -27074 -27008 -52815 -43863 -605 14876 7178
5568 7178 6114 12133 -6095 -3806 -14904 -30608 -22445 -8219 489 -5970 -6663 2967 -469 13310
5554 13310 28992 27027 45701 57284 32650 32524 33848 23245 12128 2969 -36268 -26102 -26339
5541b6339q981M319J4715J8043J367O298o206n913r353o878J1958o302J0086j4456
5527a7642j7342J6607L373K3850O288j1755M311N015m123j0020K2994K3142j8403
5514B6295N618k2682j8097J2712J1874r911j7046q061k4612k1335K3921K9258
5502a2066j484j9237J0169m226k091P640n445K1325N574k4914q587N18O916kj1029
5487c6939J1392J5477k3501j0330p271j7107Q956N670K2486M9867j5167k6556
5475b3023J4414P959k37j7343J0639N439j6588J686n468j2976j6294l835J4424
5462d1203M592J4364K6917m891M944R400k936N014k066n025J2986m774P218l701
5448B0839L974J4141J9028P872k6148k4868k5291m5707J478J6986q057J1533k0759
$$ plain form
5541 -26339 -35320 -31001 -16286 1757 3124 9422 3216 -2697 -12050 -18928 -6970 -13272 -3186 -17642
5527 -17642 -34984 -18377 -15004 8846 15134 3379 7690 12705 8582 -1438 21556 44698 26295
5514 26295 31913 9231 -8866 3846 15720 5809 -11237 -19298 -43910 -65245 -41324 -12066
5502 -12066 -13550 -32787 -22618 -26844 -28935 -21295 -26740 -5415 159 -24755 -33342 -32824 -25908 -25910 -36939
5487 -36939 -25547 -10070 -33571 -43901 -51172 -68279 -59323 -53653 -31167 18700 3533 -23023
5475 -23023 -8609 -650 -887 -18230 -7591 -2152 -18740 -17054 -22522 -35498 -51792 -55627 -41203
5462 -41203 -36611 -22247 4670 -221 4723 14123 11187 16201 14135 9110 22096 17322 24540 20839
5448 20839 24813 38954 57982 65854 39706 14838 -10453 -56160 -54682 -37696 -45753 -34220 -54979
5435e4979L358K7881p651J7948m1l9239m708P564K0323j2020K234L4518p7q239
5421a3128K234N994j2041k1668L585k0911m0033k390K9401L1723K9877J2009j7276
5408a2624J9682P021J106j9443N075L003N151k7650L015K3856R266o359j7288
5395f189j2451K2954Q946J162k0952J843J5338n2898o112J2988j1659K3973J1775
5382a1282Q898L020q676j9399J2347R094P005l1226q486K5085J1736k2430P347
5369a6967l2933k6314P907J4720l460K9686K6509l652L266j2041k7842j0749J3647
5356c8223L710M492j2567q58M489J8482R515n307j1658K112k5562l8109r049L4222
5342f4311L6796Q852J6150Q285Q534K5519m661l1699Q579J8460Q794o487l2011
$$ plain form
5435 -54979 -51621 -23740 -31391 -13443 -13484 -52723 -57431 -49867 -29544 -41564 -39330 -4812 -4889 -13128
5421 -13128 -10894 -4900 -16941 -38609 -35024 -55935 -95968 -98358 -68957 -37234 -7357 4652 -12624
5408 -12624 7058 14079 15185 -4258 817 3820 8971 -18679 -15664 8192 17458 11099 -6189
5395 -6189 -18640 4314 13260 14422 -6530 -4687 10651 -42247 -48359 -35371 -47030 -23057 -11282
5382 -11282 -2384 636 -8040 -27439 -15092 -5998 1007 -30219 -38705 -13620 -1884 -24314 -16967
5369 -16967 -49900 -76214 -68307 -53587 -57047 -27361 -852 -4504 -1238 -13279 -41121 -51870 -38223
5356 -38223 -34513 -30021 -42588 -43446 -38957 -20475 -10960 -16267 -27925 -25813 -51375 -89484 -98533 -64311
5342 -64311 -27515 -18663 -2513 5772 14306 39825 35164 3465 12044 30504 39298 32811 800
5329H00N425R067p611j4523j2354j7355j225K0645L2732J9578M522P091k4176
5316B2616j9575Q805l5036r45J5537J864J0938J0142j4514j5142K414J3606O902
5303G612l2473j4052j2779K9787K2608k8983k6706J6791J2431j0976R984J4143
5291a2613k7977j4244l083K053J4890k080K3890J5135M512L488p29J8196P302
5278B8740q960p145k1498p475j1607M602J0144P408J1350n449n490k3009J085
5265b7304o961l0035J4627J9803P631K411K18j5498j2376J6767N702L9128K2676
5252C6789k5274k2442j6514j0504K7192P384J610J1778j0663l6686j8383j0118
5240f5831L2188L612l6578J804K7314K9968P280k5637l774J8131j9404Q816J5657
$$ plain form
5329 800 6225 15292 7681 -6842 -19196 -36551 -37776 -17131 15601 35179 39701 46792 22616
5316 22616 3041 11846 -23190 -24135 -8598 -6734 4204 14346 -168 -15310 -12896 710 7612
5303 7612 -24861 -38913 -51692 -21905 703 -28280 -54986 -38195 -25764 -36740 -26756 -12613
5291 -12613 -40590 -54834 -57917 -55864 -40974 -43054 -19164 -4029 483 3971 3242 21438 28740
5278 28740 19780 12635 -8863 -16338 -27945 -23343 -13199 -5791 5559 110 -5380 -28389 -27304
5265 -27304 -34265 -64300 -49673 -29870 -22239 -19828 -19610 -35108 -47484 -30717 -25015 14113 36789
5252 36789 11515 -10927 -27441 -37945 -10753 -3369 -1759 10019 -644 -37330 -55713 -65831
5240 -65831 -33643 -30031 -66609 -64805 -37491 -7523 -243 -25880 -29654 -11523 -30927 -22111 -6454
5227f454J7541k099k9876j3584j6197l983J6821R064J1473m680J0257k7616k6933
5214f6266K6464J8437L8833K4725N251m59j0782Q060K867l5529k4701N733O227
5201a140J868R660J0292M485k0305o179p550k7615j7908M664Q576r007j1583Q492
5187e3250J0466M3735L735l7243o211l223L6685M5512k0732r619k6012p47P808
5174i096j3329R322j1089j043l086k1929k5353J0839R338J2384j540Q344J0278
5161b5960j671r86P223L520j5344o959j4846M02J6086K3761J4468J2538j7493
5148e261k6437Q816K977K3420M863k4586k1465J3871j0967O563K4847m881j0464
5135a8704P388P424K2248k8184j1741J2510k567k9708K238J3856j442J3887K2479
$$ plain form
5227 -6454 11087 8988 -20888 -34472 -50669 -54652 -37831 -28767 -17294 -21974 -11717 -39333 -66266
5214 -66266 -39802 -21365 17468 42193 47444 46985 36203 44263 47130 11601 -13100 -7367 -1140
5201 -1140 728 10388 20680 25165 4860 -1319 -8869 -36484 -54392 -49728 -41152 -50159 -61742 -53250
5187 -53250 -42784 951 4686 -32557 -38768 -41991 -5306 40206 19474 9855 -16157 -16904 -9096
5174 -9096 -22425 -13103 -24192 -25235 -28321 -50250 -75603 -64764 -55426 -43042 -44582 -36238 -25960
5161 -25960 -27631 -28617 -21394 -17874 -33218 -40177 -55023 -54621 -38535 -14774 -306 12232 -5261
5148 -5261 -31698 -22882 -19905 3515 8378 -16208 -37673 -23802 -34769 -28206 -3359 -8240 -18704
5135 -18704 -11316 -3892 18356 -9828 -21569 -9059 -11626 -41334 -39096 -25240 -26682 -12795 9684
5122I684j2161p741j1699L997O754N34M967k7849j1940K0847J6858K6278l1467
5109a2938o813o973k6012L0169M1640J4448K54j9450k0779j0084j7898j151K3561
5096a2026K1021k166j0101k2396l3275j3794j2053N521M644J3174L7741L5698
5084A1988r539j6546K931J538j6584P864O906M421K9249M70j2485n52j1927j4718
5070a6984J8184K5524R565j9886k3782j6629R633J5584J2528j8316q503j0791
5058b3873r204L154J7194j2110R852N628K068P021K8658K6877k3752k4740j1303
5045d530k3113J2237j3410K5969K4901j6585k7540l5043J5553N6955P163l4061
5033a1504j406J9373q842m6291K7781J0531j2420P18k2936o260j2050j2169K2429
$$ plain form
5122 9684 -2477 -10218 -21917 -17920 -11166 -10632 -5665 -33514 -45454 -24607 -7749 18529 -12938
5109 -12938 -19751 -26724 -52736 -22567 19073 33521 33775 14325 -6454 -16538 -34436 -35587 -12026
5096 -12026 8995 6829 -3272 -25668 -58943 -72737 -84790 -79269 -74625 -61451 -23710 11988
5084 11988 2449 -14097 -11166 -9628 -26212 -18348 -11442 -7021 22228 22698 10213 9661 -2266 -16984
5070 -16984 1200 26724 36289 16403 -7379 -24008 -14375 1209 13737 -4579 -13082 -23873
5058 -23873 -33077 -29923 -12729 -24839 -14987 -9359 -7291 -270 28388 55265 31513 6773 -4530
5045 -4530 -27643 -15406 -28816 -2847 22054 5469 -22071 -57114 -41561 15394 22557 -11504
5033 -11504 -12910 6463 -2379 -48670 -20889 -10358 -22778 -22060 -44996 -51256 -63306 -75475 -53046
5020e3046j3216j2012K509K0828J1151J0787J0067K597L893l7900j9327K9862
5008d3807Q605Q03L3574j1746j6244K6338Q778j8509j5289K3449k842J2364n829
4995c55n500l1737k763j6702J9167j7154K825q333R126j2413J3524K5022m068
4982b9361j4305K6110j8913O728J427q950j8537n744K5534q176m291O384p437
4969d9531J1048j195l663J2340K1959q394J6156M1883j2796n1094k7554P179L246
4956d0416J1999J3392j0083k6514J7667k0414K377J5343J6798M733m94j681O610
4943a0683j1956j0826P373P099K118k1533j0633J3208R95K7335J0032j8828k2124
4930c8423J3363Q214N154N020J3735J5565K2262k088J885j4437k3586k1719k1858
$$ plain form
5020 -53046 -66262 -78274 -75765 -54937 -43786 -32999 -22932 -20335 -16442 -54342 -73669 -43807
5008 -43807 -35202 -34399 -825 -12571 -28815 -2477 6301 -12208 -27497 -4048 -6890 5474 -355
4995 -355 -5855 -37592 -40355 -57057 -37890 -55044 -52219 -60552 -51426 -63839 -50315 -25293 -29361
4982 -29361 -43666 -17556 -36469 -29741 -28314 -37264 -55801 -61545 -36011 -44187 -48478 -42094 -49531
4969 -49531 -38483 -39678 -43341 -31001 -9042 -17436 -1280 40603 27807 -23287 -50841 -43662 -40416
4956 -40416 -28417 -15025 -25108 -51622 -33955 -54369 -51992 -36649 -19851 -15118 -15612 -17293 -10683
4943 -10683 -22639 -33465 -26092 -18993 -16875 -38408 -49041 -35833 -34838 -7503 2529 -16299 -38423
4930 -38423 -25060 -16846 -11692 -6672 7063 22628 44890 42802 44687 30250 6664 -15055 -36913
4917c6913k8650j6942K860L0122Q394L818Q862L26q780l735N490J3699j2369k9178
4903f2996Q521L2234q715j8554Q490J52r439K0999K1337J0831j1483N079L031
4890e13M453L016j0133l471j2872j7456p247p752O431J1717J4121j6826j4015
4877e0547L5119r607L476m170p04K141p3P939q341M6790J0507j233k5447l3631
4863b7781j7645O507J2105L353j1655O775K0617j266o552o20m0572J4167K6349
4850a6218L635j7101P375k2202j8293m610J7747M0850n308k253o493R371L3003
4837A9503m352J2122j6819j1079J2310j5793j9464L832K0380P54r495l373j9383
4824c0857P336J3070n255M855J3280K156J2687K873j195P135k0894R551j386k6410
$$ plain form
4917 -36913 -65563 -82505 -79645 -49523 -41129 -37311 -28449 -28123 -36903 -40638 -35148 -21449 -33818 -62996
4903 -62996 -54475 -22241 -30956 -49510 -41020 -40868 -50307 -29308 -7971 2860 -8623 -3544 -513
4890 -513 3940 6956 -3177 -6648 -19520 -36976 -44223 -51975 -45544 -33827 -19706 -36532 -50547
4877 -50547 -15428 -25035 -21559 -25729 -26433 -24292 -24365 -16426 -24767 22023 32530 31297 5850 -27781
4863 -27781 -45426 -38919 -26814 -23461 -35116 -28341 -7724 -8990 -15542 -16162 -56734 -42567 -16218
4850 -16218 -12583 -29684 -22309 -44511 -62804 -67414 -49667 -8817 -14125 -16378 -22871 -13500 19503
4837 19503 15151 27273 10454 -625 11685 -4108 -23572 -19740 640 1394 -8101 -11474 -30857
4824 -30857 -23521 -10451 -15706 -10851 2429 4585 17272 20145 18950 26085 5191 14742 13356 -13054
4810a3054Q689K1170j5514N27p77k7465j8293j2877O901K8272l023k7215J6416
4797c6243J9485J7061J5516M027k0544l550L090o022R125j2851j0334J2344j4750
4784b3646j706j279N566k170L210q933K987J7930p603J2826k1576l19J3567K5989
4770A4843j9164k6124P837K5727j9453k7430O445P984Q591K383K833Q094J0833
4757C399l453j6321K951L046L2905o760j4153k3651j1101R642J5424K4819J2638
4744B9385j5808k1494O079m832j325J1403k871K514j7708k1964P084P089J522
4731b0926Q859R571O760K8704N240j5950j1044q68j9745k4858j7357K5371J7019
4718i224j8528q864J7637M190n773L5036J779k4194J0870k2570l3442J9462K5239
$$ plain form
4810 -13054 -4365 16805 1291 1818 1041 -26424 -44717 -57594 -50693 -22421 -25444 -52659 -36243
4797 -36243 -16758 303 15819 19846 -698 -4248 -1158 -7180 1945 -10906 -21240 -8896 -23646
4784 -23646 -25352 -26631 -21065 -23235 -20025 -28958 -25971 -8041 -15644 -2818 -24394 -24713 -11146 14843
4770 14843 -4321 -30445 -22608 3119 -16334 -43764 -37319 -29335 -20744 -18361 -15528 -7434 3399
4757 3399 -54 -16375 -13424 -10378 22527 15767 1614 -22037 -33138 -23496 -8072 16747 29385
4744 29385 13577 -7917 -1838 -6670 -7995 3408 537 3051 -14657 -36621 -29537 -22448 -20926
4731 -20926 -12067 -2496 4264 32968 38208 22258 11214 10346 -9399 -34257 -51614 -26243 -9224
4718 -9224 -27752 -36616 -18979 -14789 -20562 14474 16253 -7941 2929 -19641 -53083 -33621 -8382
4705h382m564j893J0511J3717j6433P701J9638j446j0303k7546j6780o337K6949
4692a5168J7583K909j177J5595K017J1605k0461l7602k7280j1787J3308J2881
4680c7577L1315M014k5945n286J4856L655m091K937P372J2288j7630o833r450
4667c0375k6173J559K4971O769j2333J7305k020k0839l2355J4858M112J9428L229
4654c1864l480n797q572k165L343j8372k209J1819N317J8147L332j635J9919o379
$$ plain form
4705 -8382 -12946 -14839 -4328 9389 -7044 657 20295 18849 8546 -19000 -35780 -42117 -15168
4692 -15168 2415 5324 4147 19742 21759 33364 12903 -24699 -51979 -63766 -50458 -37577
4680 -37577 -6262 -2248 -28193 -33479 -18623 -14968 -19059 -16122 -8750 3538 -14092 -20925 -30375
4667 -30375 -56548 -54989 -30018 -23249 -35582 -18277 -20297 -41136 -73491 -58633 -54521 -35093 -31864
4654 -31864 -35344 -41141 -49713 -51878 -48535 -66907 -69116 -57297 -51980 -33833 -30501 -32136 -12217 -18596
$$ [...]
##END NTUPLES=NMR SPECTRUM
##END=
