##TITLE=Analysis number 329123
Compound Code cc 64502
Book Reference 510/74
Project Code adrs
Chemist Name jimp
##JCAMPDX= 6.0         $$ Bruker NMR JCAMP-DX V2.0
##DATA TYPE= NMR SPECTRUM
##DATA CLASS= NTUPLES
##ORIGIN= Bruker BioSpin GmbH
##OWNER= nmr
$$ XWIN-NMR		Version 3.5
$$ Mon Aug  6 10:10:55 2007 GMT Daylight Time (UT+1h)  MAYBRIDGE\nmr@NMR_250MHZ
##.OBSERVE FREQUENCY= 250.131544655141
##.OBSERVE NUCLEUS= ^1H
##.ACQUISITION MODE= SIMULTANEOUS (DQD)
##.ACQUISITION SCHEME= undefined
##.AVERAGES= 16
##.DIGITISER RES= 18
##SPECTROMETER/DATA SYSTEM= dpx250
##.PULSE SEQUENCE= zg30
##.SOLVENT NAME= CDCl3
##.SHIFT REFERENCE= (INTERNAL, CDCl3, 0, 16.4481)
##AUDIT TRAIL= $$ (NUMBER, WHEN, WHO, WHERE, WHAT)
$$ ##TITLE= Audit trail, XWIN-NMR		Version 3.5
$$ ##JCAMPDX= 5.01
$$ ##ORIGIN= Bruker BioSpin GmbH
$$ ##OWNER= nmr
$$ C:\u/data/dgb/nmr/ADRS/200/pdata/1/auditp.txt
$$ ##AUDIT TRAIL=  $$ (NUMBER, WHEN, WHO, WHERE, WHAT)
(   1,<2007-08-06 10:10:33.27 +100>,<MAYBRIDGE\nmr>,<NMR_250MHZ>,
      <created by zg, POWCHK disabled, PULCHK disabled
       configuration hash MD5:
       76 6E 9A 78 1E 09 19 81 EC 84 63 8F B0 6A 59 2D
       data hash MD5: 64K
       E0 33 E1 C2 C1 13 63 2B 02 2A 05 8C 6A 03 6C 67>)
(   2,<2007-08-06 10:10:45.93 +100>,<MAYBRIDGE\nmr>,<NMR_250MHZ>,
      <Start of raw data processing
       ef LB = 0.3 FT_mod = 6 PKNL = 1 SI = 32K 
       data hash MD5: 32K
       8E 6B BE E4 E3 11 F9 01 A7 FF D1 68 EB 41 14 4F>)
(   3,<2007-08-06 10:10:48.41 +100>,<MAYBRIDGE\nmr>,<NMR_250MHZ>,
      <apk 
       data hash MD5: 32K
       DF FD E8 C1 4F A6 39 06 BE 64 32 E7 C6 5D 5D FE>)
(   4,<2007-08-06 10:10:49.18 +100>,<MAYBRIDGE\nmr>,<NMR_250MHZ>,
      <abs ABSG = 5 
       data hash MD5: 32K
       69 F2 8D 82 7B 53 CA 44 B2 B4 CF F6 21 1A BA 72>)
$$ ##END=
$$ 
$$ hash MD5
$$ DF BB EF F9 67 80 8C 82 AA BE 2E E8 FA 38 69 B5
##$RELAX= 
##$RELAX= 
##$RELAX= 
##$RELAX= 
##$RELAX= 
##$RELAX= 
##$RELAX= 
$$ Bruker specific parameters
$$ --------------------------
##$DU= <C:\u>
##$EXPNO= 200
##$NAME= <ADRS>
##$PROCNO= 1
##$TYPE= <nmr>
##$USER= <dgb>
##$AMP= (0..31)
100 100 100 100 100 100 100 100 100 100 100 100 100 100 100 100 100 100 
100 100 100 100 100 100 100 100 100 100 100 100 100 100 
##$AQSEQ= 0
##$AQ_mod= 3
##$AUNM= <au_zg>
##$AUTOPOS= <37 >
##$BF1= 250.13
##$BF2= 250.13
##$BF3= 250.13
##$BF4= 250.13
##$BF5= 500.13
##$BF6= 500.13
##$BF7= 500.13
##$BF8= 500.13
##$BYTORDA= 1
##$CFDGTYP= 0
##$CFRGTYP= 5
##$CHEMSTR= <none>
##$CNST= (0..31)
1 1 145 1 1 1 1 1 1 1 1 1 1 1 1 1 1 1 1 1 1 1 1 1 1 1 1 1 1 1 1 1 
##$CPDPRG= <>
##$CPDPRG1= <>
##$CPDPRG2= <>
##$CPDPRG3= <>
##$CPDPRG4= <mlev>
##$CPDPRG5= <mlev>
##$CPDPRG6= <mlev>
##$CPDPRG7= <mlev>
##$CPDPRG8= <mlev>
##$CPDPRGB= <>
##$CPDPRGT= <>
##$D= (0..31)
0 1 0 0 0 0 0 0 0 0.06 0 0 0 0 0 0 0.0002 0 0 0 0 0 0 0 0 0 0 0 0 0 0 
0 
##$DATE= 1186391432
##$DBL= (0..7)
120 120 120 120 120 120 120 120 
##$DBP= (0..7)
150 150 150 150 150 150 150 150 
##$DBP07= 0
##$DBPNAM0= <>
##$DBPNAM1= <>
$$ [...]
##$SUBNAM8= <"">
##$SUBNAM9= <"">
##$SW= 20.6930455092707
##$SWIBOX= (0..15)
0 0 3 0 0 0 0 0 0 0 0 0 0 0 0 0 
##$SW_h= 5175.983436853
##$TD= 65536
##$TD0= 1
##$TE= 296.16
##$TE2= 300
##$TE3= 300
##$TEG= 300
##$TL= (0..7)
0 120 120 120 120 120 120 120 
##$TP= (0..7)
150 150 150 150 150 150 150 150 
##$TP07= 0
##$TPNAME0= <>
##$TPNAME1= <>
##$TPNAME2= <>
##$TPNAME3= <>
##$TPNAME4= <>
##$TPNAME5= <>
##$TPNAME6= <>
##$TPNAME7= <>
##$TPOAL= (0..7)
0.5 0.5 0.5 0.5 0.5 0.5 0.5 0.5 
##$TPOFFS= (0..7)
0 0 0 0 0 0 0 0 
##$TUNHIN= 0
##$TUNHOUT= 0
##$TUNXOUT= 0
##$USERA1= <user>
##$USERA2= <user>
##$USERA3= <user>
##$USERA4= <user>
##$USERA5= <user>
##$V9= 5
##$VALIST= <valist>
##$VCLIST= <CCCCCCCCCCCCCCC>
##$VD= 0
##$VDLIST= <DDDDDDDDDDDDDDD>
##$VPLIST= <PPPPPPPPPPPPPPP>
##$VTLIST= <TTTTTTTTTTTTTTT>
##$WBST= 1024
##$WBSW= 4
##$XGAIN= (0..3)
0 0 0 0 
##$XL= 0
##$YL= 0
##$YMAX_a= 344905
##$YMIN_a= -253407
##$ZGOPTNS= <>
##$ZL1= 120
##$ZL2= 120
##$ZL3= 120
##$ZL4= 120
##$ABSF1= 16.44812
##$ABSF2= -4.245052
##$ABSG= 5
##$ABSL= 3
##$ALPHA= 0
##$AQORDER= 0
##$ASSFAC= 0
##$ASSFACI= 0
##$ASSFACX= 0
##$ASSWID= 0
##$AUNMP= <proc_1d>
##$AZFE= 0.1
##$AZFW= 0.1
##$BCFW= 0
##$BC_mod= 0
##$BYTORDP= 0
##$COROFFS= 0
##$CY= 12.5
##$DATMOD= 1
##$DC= 0
##$DFILT= <>
##$DTYPP= 0
##$F1P= 14.0000005364418
##$F2P= -0.99999901652339
##$FCOR= 0.5
##$FTSIZE= 32768
##$FT_mod= 6
##$GAMMA= 0
##$GB= 0
##$INTBC= 1
##$INTSCL= 1
##$ISEN= 128
##$LB= 0.3
##$LEV0= 0
##$LPBIN= 0
##$MAXI= 10000
##$MC2= 0
##$MEAN= 0
##$ME_mod= 0
##$MI= 0
##$NCOEF= 0
##$NC_proc= -5
##$NLEV= 6
##$NOISF1= 0
##$NOISF2= 0
##$NSP= 0
##$NTH_PI= 0
##$NZP= 0
##$OFFSET= 16.44812
##$PC= 1
##$PHC0= -106.8724
##$PHC1= 159.4875
##$PH_mod= 1
##$PKNL= yes
##$PPARMOD= 0
##$PSCAL= 4
##$PSIGN= 0
##$REVERSE= no
##$SF= 250.130018478406
##$SI= 32768
##$SIGF1= 0
##$SIGF2= 0
##$SINO= 400
##$SIOLD= 32768
##$SREGLST= <1H.CDCl3>
##$SSB= 0
##$STSI= 32768
##$STSR= 0
##$SW_p= 5175.98343685301
##$SYMM= 0
##$S_DEV= 0
##$TDeff= 65536
##$TDoff= 0
##$TI= <Analysis number 999999
Compound Code 99
Book Reference 9
Project Code 9>
##$TILT= no
##$TM1= 0
##$TM2= 0
##$TOPLEV= 0
##$USERP1= <user>
##$USERP2= <user>
##$USERP3= <user>
##$USERP4= <user>
##$USERP5= <user>
##$WDW= 1
##$XDIM= 32768
##$YMAX_p= 531360921
##$YMIN_p= -1083294
$$ End of Bruker specific parameters
$$ ---------------------------------
##NTUPLES= NMR SPECTRUM
##VAR_NAME=  FREQUENCY,     SPECTRUM/REAL,   SPECTRUM/IMAG
##SYMBOL=    X,             R,               I
##VAR_TYPE=  INDEPENDENT,   DEPENDENT,       DEPENDENT
##VAR_FORM=  AFFN,          ASDF,            ASDF
##VAR_DIM=   32768,         32768,           32768
##UNITS=     HZ,            ARBITRARY UNITS, ARBITRARY UNITS
##FACTOR=    0.157963299565203, 1,           1
##FIRST=     4114.16858884715, 0,            0
##LAST=      -1061.81484800586, 0,           0
##MIN=       -1061.81484800586, -1083294,    0
##MAX=       4114.16858884715, 531360921,    0
$$ Real data points
##PAGE= N=1
##DATA TABLE= (X++(R..R)), XYDATA
$$ [...]
23469A11354o3403j45293l7503O8838K0277j83827q9911K53125J82431J13987
23459B30075J9865k15879j97j18409j73739J08285o508L7037P333J8173R0749
23448c215J04551j60447j68089J67741L4953o3706J06450J83733m9204N2164m0955
23437A63976r0322j33528K3881J65741j97893L8133K2782j77716l4025K1852M16
23426a96703O4904K3374O7381j38057j53837Q4826K29708j3507Q8804J12739j8849
23415A50783l5154m4843p8937p9939R6054K0874q472J40670m3596p1888R9526
23404A45078J1609j45038k52766M886O8046J7101j32230r4750J34138J90142j52282
23393b06066j26877R3797K3227p3404K0451J24781k24603n7480J22650J57618
$$ plain form
23469 111354 47951 -97342 -134845 -66007 -45730 -229557 -319468 -66343 116088 230075
23459 230075 249940 34061 33864 -84545 -258284 -149999 -156507 -119470 -112137 -93964 -3215
23448 -3215 101336 -59111 -227200 -59459 -24506 -88212 18238 201971 152767 204931 163976
23437 163976 73654 -59874 -35993 129748 -68145 -30012 -7230 -184946 -218971 -197119 -196703
23426 -196703 -131799 -108425 -41044 -179101 -332938 -248112 -18404 -31911 56893 169632 150783
23415 150783 115629 70786 -8151 -88090 7964 28838 20366 161036 117440 45552 145078
23404 145078 156687 11649 -241117 -236231 -168185 -151084 -283314 -378064 -243926 -53784 -206066
23393 -206066 -332943 -239146 -215919 -289323 -268872 -144091 -368694 -426174 -303524 -145906
23383a45906Q1945j4722J1108P7256j58468k03538m6027K25449J83468k1105L8682
23372B8142J58316m2768j0213M0412j78264j47009N303J24050j58327j10679L28111
23361C7074J69825k46223j02865J98964p0907l3416j5094j05136J9989j1658J29570
23350b9877K18447K7600j04472j07175J6364J93426J8322l5761R2320j62061n3766
23339G3367j1226j15310J38717J4370o622J4250Q2989K2031j9609J31341o933
23328C17365j04885J08492J20563N4202k82291n7554L2870J66676q7717r2688
23318A75033o9036o8534j10907J58744J47952N3583o6050J28131j49105q7098
23308A12713j19474j94452N4343P1546O7094N2883R0951j33268j66197M5344j5939
$$ plain form
23383 -145906 -63961 -78683 -67575 9681 -148787 -352325 -398352 -172903 10565 -10540 28142
23372 28142 186458 143690 133477 173889 -4375 -151384 -146081 -22031 -180358 -291037 37074
23361 37074 206899 -39324 -142189 56775 -14132 -47548 -62642 -167778 -147789 -159447 -29877
23350 -29877 188570 216170 111698 4523 20887 214313 232635 196874 289194 127133 73367
23339 73367 62141 -53169 85548 99918 93296 107546 190535 212566 192957 324298 317365
23328 317365 212480 320972 441535 495737 213446 155892 188762 355438 267721 175033
23318 175033 105997 37463 -73444 85300 233252 286835 220785 348916 199811 112713
23308 112713 -6761 -201213 -146870 -75324 -8230 44653 135604 2336 -163861 -118517 -134456
23297a34456k0530P7282K23392J14620J29384L8593k71868k05161j08447J4917
23287a42274r7675n9925R2359J72427N6591J75624n1210j74328M3579r9470N1023
23276c3279p9044q0276O8828N7388k321j08399R423O5022K90607M36298J0734
23265F34981j52579j00096j40151r5173P8714J16731P491k13166l9632J32357
23255B29477O7290j7888j17990k28200j8751J14705k1583J4393O2842n5613q0084
23244e1402m7558J11833l2880K8181n656q6015n4749j4343j70012r1248J41456
23233b72393J68927R6705L4082J38018j21478j31056J42801M3916j42167j35297
23223a77942J63395q5642k24668p6549R5673K9222K16305K8606P2923O2978O3991
$$ plain form
23297 -134456 -154986 -77704 145688 260308 389692 428285 156417 -48744 -157191 -142274
23287 -142274 -239949 -299874 -207515 -35088 21503 197127 145917 -28411 15168 -84302 -33279
23276 -33279 -112323 -192599 -123771 -66383 -68704 -177103 -167680 -102658 187949 624247 634981
23265 634981 482402 382306 242155 146982 225696 342427 349918 136752 97120 229477
23255 229477 296767 278879 160889 -67311 -86062 28643 7060 21453 84295 28682 -51402
23244 -51402 -98960 12873 -20007 8174 2518 -83497 -138246 -152589 -322601 -413849 -272393
23233 -272393 -103466 -6761 27321 165339 43861 -87195 55606 99522 -42645 -177942
23223 -177942 -14547 -100189 -324857 -401406 -305733 -276511 -60206 -31600 41323 104301 168292
23212A68292k04159R1563L04273r1038k97393j09263J63940m0700j3114J74157
23202A46558K2431N3067k20468n4422j20279J4753J90995o2369j48203N5900n4844
23191a76881J65286J27241Q242j3419k29006O3648J49365l6396M3355j34968J38680
23180A05147J68474q3627l25792o3801K42133K16017n1692k24992p7836p2042
23170a68011j4928l0027Q2230q8871P2395j762k5380O081J70935J00932N5815
23159A59409o798O0802K63864j14592k31016J3590j06935J7741k2854J4218P5531
23148A22960j82653o6672m3135j7113m2985L4251J75136N502J8545k3535J58434
23137A38735J40544j15653j07967J40241m0541j75517j86590o0339R9198J20838
$$ plain form
23212 168292 -35867 55696 359969 268931 -28462 -137725 26215 -14485 -27599 146558
23202 146558 168989 222056 1588 -52834 -173113 -158360 32635 -29734 -177937 -122037 -176881
23191 -176881 -11595 115646 123888 110469 -118537 -54889 94476 58080 101435 -33533 105147
23180 105147 273621 189994 -135798 -199599 42534 258551 206859 -18133 -95969 -168011
23170 -168011 -182939 -212966 -130736 -219607 -147212 -148974 -174354 -168273 2662 103594 159409
23159 159409 152611 213413 477277 362685 131669 145259 38324 56065 33211 47429 122960
23148 122960 -59693 -126365 -169500 -186613 -229598 -195347 -20211 -14709 3836 -19699 138735
23137 138735 279279 163626 55659 195900 155359 -20158 -206748 -267087 -167889 -47051
23127d7051j76598j10803j3324j39611P2310l9328K81495J17884J64901k2762
23117H7113k56349N9338K49384L6167N6254k59008k08216j04439J37437K90643
23107H8324m2267l63752r9959J56066j1083j63827L01961Q0316J03524R2422L9896
23096A81621J9119j61162k03631p8625p8411J44770J14655J61409O9095j54456
23086A4384r8932n3479M8873J22201R387r0222J00414N7271K4746l06731N7992
23075a14096R011l50367k12441J25203L70314r4247k8518K82425J5845r6769j12057
23064b05697k34393N877J48197K037Q932J42029l5557q2486k01488N74J84370
23053b67605L62465o8811q7152L2783P1414M2093k02074j14656r5468N7332o6469
$$ plain form
23127 -47051 -223649 -334452 -347776 -487387 -415077 -454405 -172910 -55026 109875 87113
23117 87113 -169236 -109898 139486 175653 231907 -27101 -235317 -339756 -202319 88324
23107 88324 46057 -317695 -417654 -261588 -272671 -436498 -134537 -54221 49303 141725 181621
23096 181621 200740 39578 -164053 -242678 -321089 -176319 -61664 99745 168840 14384
23086 14384 -84548 -138027 -89154 33047 42434 -47788 52626 109897 134643 -172088 -114096
23075 -114096 -105085 -455452 -667893 -542690 -172376 -266623 -295141 -12716 3129 -93640 -205697
23064 -205697 -440090 -434213 -286016 -283979 -275047 -133018 -168575 -251061 -452549 -451975 -267605
23053 -267605 94860 26049 -61103 -28320 43094 85187 -116887 -231543 -327011 -269679 -336148
23042c36148K3976J60828O4238q9795N9j89175j8931J9334R3183R8580J89636
23031A5785N9576q8072l6740j51845M9601R548J70108J26313K29305O3797J638
23020D49014j76075k57663k50600p2122l0574J75481J70199m3140p9999J37227
23010B1748O1419J6014n7163P1016j36598j8585J58708K0110q8038n5419j84574
22999a91362O8548o4214K6707Q6597L8020R4594P7221J32638k7354k75501j70493
22988b04599J6760k0223j385J6108P9604j22898k37571o2449J07593J06443J1613
22977c11004m3087J37622O6202J2056M1153q5401M9677P7530o0516j33723n1689
22966c01180K58092m0344j09292P9575R463P6781l6404j5795Q1473O4690j7486
$$ plain form
23042 -336148 -312172 -151344 -87106 -176901 -176842 -366017 -384948 -365614 -272431 -173851 15785
23031 15785 75361 -12711 -49451 -201296 -151695 -142147 27961 154274 383579 447376 449014
23020 449014 272939 15276 -235324 -307446 -338020 -162539 7660 -35480 -115479 21748
23010 21748 83167 99181 42018 113034 -23564 -42149 116559 136669 48631 -6788 -191362
22999 -191362 -122814 -187028 -160321 -73724 -35704 58890 136111 268749 241395 -34106 -204599
22988 -204599 -187839 -208062 -209447 -193339 -113735 -236633 -474204 -536653 -429060 -322617 -311004
22977 -311004 -354091 -216469 -150267 -138211 -97058 -182459 -132782 -55252 -115768 -249491 -301180
22966 -301180 -43088 -83432 -192724 -113149 -103686 -26905 -63309 -79104 2369 67059 49573
22955D9573J67745M3242j10752k4238j49520N6896J18929j7026k4179K0604k4270
22944A07004k6425q0782J04847L7451R1435j49095j80915j33083J24050J92176
22934H6663J82521j86863j22885K7054j92374P20J42881Q1964j41255k26701j62922
22923e11197R1638L21060K90893j29731N80n1332K2862K7952j25195J08591Q5784
22912A31905j87888j42865Q8986k247J48944J26458M7566l17436M374K54448N1364
22901B03609l20524j50052j6028J9108J91813J02532j83001J15077R6308j3491
22891D5351m2548r738p7911J56387K52006O8150n74k55290n5625m1458J58515
22880A97265k7820J90739K01507k69000l59639n8134O8504p7178O7821k846p4761
$$ plain form
22955 49573 217318 260560 149808 125570 -23950 32946 151875 134849 110670 131274 107004
22944 107004 80579 -203 104644 142095 233530 84435 -96480 -229563 -105513 86663
22934 86663 269184 82321 -40564 -13510 -205884 -205164 -62283 19681 -121574 -348275 -511197
22923 -511197 -419559 -98499 192394 62663 63243 11911 34773 62725 -62470 46121 131905
22912 131905 -55983 -198848 -109862 -112109 36835 163293 210859 -106577 -102203 152245 203609
22901 203609 -116915 -266967 -282995 -263887 -72074 30458 -152543 -37466 58842 45351
22891 45351 2803 -6935 -84846 71541 323547 391697 391123 135833 80208 38750 197265
22880 197265 169445 360184 561691 292691 -66948 -125082 -56578 -133756 -65935 -68781 -143542
22869a43542o0387j22702n7132J99412J60747q4586j92414j2979P8346p1946K34323
22858g2860J53026J65489m8083k07054O4328R1594M2594M2908n1300J36591j7834
22847B99399k73378n1594M1798J15755j64111M76o371N9411n9839j08355J23062
22836b3747O321m8672r9987q8553j857J03185P6324Q7340l1079J57142l97J6227
22824A52247O9121k2693n7379O0347n3249k11930J44084K9925P2595k32009k04901
22813b53842P449m7277J17437j2524K09704J22293k25169k41279J4208K83819
22803b5181J54601j46050m2757j70432O8696K18625J69166r6462P957J58762k31284
22792F5641O244J40437N7300p6384k22106k43418m4209j00666J61465R7801Q4731
$$ plain form
22869 -143542 -203929 -326631 -383763 -184351 -23604 -108190 -300604 -313583 -235237 -307183 -72860
22858 -72860 80166 245655 197572 -9482 54846 146440 189034 231942 180642 317233 299399
22847 299399 26021 -25573 16225 131980 -32131 -31655 -38026 21385 -38454 -146809 -23747
22836 -23747 -17426 -66098 -166085 -254638 -256495 -153310 -76986 10354 -20725 136417 136020 152247
22824 152247 221368 198675 141296 201643 148394 -63536 80548 110473 183068 -48941 -253842
22813 -253842 -246393 -293670 -176233 -188757 20947 143240 -81929 -323208 -309000 -25181
22803 -25181 129420 -16630 -59387 -229819 -161123 57502 226668 130206 138163 296925 65641
22792 65641 71885 212322 269622 193238 -28868 -272286 -316495 -417161 -255696 -157895 -73164
22781g3164O2146J2684r6686j13640j46127j06147K39478Q1842J23915J76404
22771A60705j18794k37467k2977l3995K8064Q0021M7156R7832n3080n4743p3228
22760a80506j40495n6780J71185J32665L3613K5925R0955J6596K6010q7150j42603
22749a10585l9191J53357J24083o1222R865M999J25028P7458n1154j87673k16231
22738a71266j09104J21148J35181r2955m2785J04394L036p5642j73940k5851p9892
22727d07676J16058K21463J20827l385m2365p1599l4490k5170J3336J23866k3710
22716a2845q9453l26178j54193J11060J59987l9434J76642Q6608J65647L51l36762
22705b58570J20497Q9918p2987j41912O136J68123O448o696j28774k3240J93272
$$ plain form
22781 -73164 -11018 1666 -95020 -208660 -354787 -460934 -221456 -139614 -15699 160705
22771 160705 41911 -195556 -218533 -252528 -224464 -144443 -97287 545 -52535 -107278 -180506
22760 -180506 -321001 -377781 -206596 -73931 -40318 -14393 76562 93158 119168 32018 -110585
22749 -110585 -149776 3581 127664 66442 76307 81306 206334 283792 232638 44965 -171266
22738 -171266 -280370 -159222 -24041 -116996 -159781 -55387 -52351 -127993 -301933 -327784 -407676
22727 -407676 -291618 -70155 50672 47287 4922 -66677 -101167 -126337 -113001 10865 -12845
22716 -12845 -102298 -428476 -582669 -471609 -311622 -351056 -174414 -87806 77841 78192 -258570
22705 -258570 -138073 -48155 -121142 -263054 -256918 -88795 -82347 -89043 -217817 -241057 -47785
22694d7785Q5028J07233K01237m00743k78270J79013N5465n9984O5235k0620j16421
22683b30612J25028J13984K2988O9220K2055j76921l90821j29272J32579J04129
22673c37643K51158P2690m4543k7783O2332O090k1219J48448j5940j12698J16242
22662I7134N7481l5975P3963k28877k74994O1103J90189P2250J03922N8588K1466
22651A96250j88288j4100n7159J52086K3551n5779j33102j09977J33561n9574
22641a12531J62758M4370K13668j79144q6079J91518n3676k43110R7174Q8339
22631A23287l9313J07987K25851j42922j77289N6589M4355k67208j19007R955
22621a77715K69024J36060j2916j82237j13472j33524k19097P495J44333J71451
$$ plain form
22694 -47785 37243 144476 345713 -55030 -333300 -154287 -98822 -158806 -93571 -114191 -230612
22683 -230612 -105584 8400 31388 100608 122663 -54258 -445079 -574351 -441772 -337643
22673 -337643 -86485 -13795 -58338 -86121 -23789 -17699 -38918 109530 93590 -19108 97134
22662 97134 154615 118640 192603 -36274 -311268 -250165 -59976 12274 116196 174784 196250
22651 196250 7962 -6138 -63297 88789 112340 56561 -76541 -186518 -52957 -112531
22641 -112531 50227 94597 308265 129121 43042 234560 180884 -62226 34948 123287
22631 123287 83974 191961 417812 274890 97601 154190 198545 -68663 -187670 -177715
22621 -177715 91309 227369 214453 32216 -81256 -214780 -433877 -426382 -282049 -110598
22611a10598J29598q0896j45644k19977K07733J60544j69087k32454n9771P6247
22601d44305K53847K61978P7182p6282J17148P4203j51985j04671J70259l6537
22591A40837j7439m3890l6028l23778J24994m7317j04472J56746J23015P4882
22581D7550J13247K416K9281J05066j04873K615n7105j6343J02727j54855o2985
22570F741R5897j37842J34136J05867q3075l04830r4486J33435k4665j2400K3239
22559a57983r2536j666q6707j4795R5355P2593n659O1864l626k62o3738j0753
22547b07913J74529R2075J12449n7401k11837j77031L7561J05561N9597j01883
22537a74293Q6062N4810p6299J03191O1560n4299K9936r5486J299L001J3618r9180
$$ plain form
22611 -110598 19000 -61896 -207540 -427517 -219784 -59240 -228327 -460781 -520552 -444305
22601 -444305 -190458 71520 148702 72420 189568 263771 111786 7115 177374 140837
22591 140837 123398 79508 43480 -280298 -155304 -202621 -307093 -150347 -27332 47550
22581 47550 160797 163213 192494 297560 192687 195302 138197 121854 224581 69726 6741
22570 6741 102638 -35204 98932 204799 121724 -183106 -277592 -144157 -168822 -181222 -157983
22559 -157983 -250519 -252185 -338892 -353687 -258332 -185739 -191398 -129534 -133160 -133422 -197160 -207913
22547 -207913 -33384 58691 171140 113739 -98098 -275129 -237568 -132007 -72410 -174293
22537 -174293 -88231 -33421 -109720 -6529 55031 732 30668 -64818 -63519 -60518 -46900 -146080
22525a46080K5560J3379k6225q675N1246n801k5510m8252O9676J16304N2770m6589
22513B1803l1669n1559J43103j20839j98766N8370M0012N030R8517N3414j46698
22502a29282p5506K15833L09834J22678j46346l60534L3675P5559K01082q3019
22492A63974L6996l6027j53265p9210j2742J82909J55433j49186k15291J28721
22482B2312r3379p5465M7698k22163p9082K23585O2492l3755Q930M8668K43354
22471A53195q0836k19720j50986J68193Q9827K3009J08024J15057j0928l600k6291
22460A64944N3806N477M7486j62181m07767j87746J87734R6609O8367O5859J41688
22449G4276j3945p5108j12043j8697J01800N7900j17623P1386K80108R0318j93162
$$ plain form
22525 -146080 -120520 -107141 -133366 -142041 -90795 -96596 -122106 -170358 -100682 15622 68392 21803
22513 21803 -9866 -61425 81678 -39161 -237927 -179557 -139545 -134515 -35998 17416 -129282
22502 -129282 -204788 11045 320879 443557 297211 -63323 -29648 45911 246993 163974
22492 163974 200970 164943 11678 -67532 -80274 102635 258068 108882 -106409 22312
22482 22312 -71067 -146532 -98834 -320997 -400079 -176494 -114002 -147757 -138827 -90159 153195
22471 153195 72359 -147361 -298347 -130154 -40327 -17318 90706 205763 194835 191235 164944
22460 164944 218750 224227 271713 109532 -298235 -485981 -298247 -201638 -133271 -67412 74276
22449 74276 60331 -14777 -126820 -145517 -43717 14183 -103440 -32054 248054 338372 145210
22438A45210k48892m9825O5818p1096n9681K7345R8173L1037j16989j9355J15095
22427h3160l2408J35991j13455j18582Q0778J3572o9735L787N5061r9969n1624
22416b79744J16139m6636M791q786Q3278j9853q9422j52077J41717Q3002K4352
22405a43239N6269J83367p6403K2643r3849q4170O0082J36304N267j54933j21918
22394b10580O5619J59206R2554n097J04042j56253j59138M9141q1148j60047Q8501
22383b13200Q0653j22202j80002j1454k82007j04078Q3497R4550L4630K36437
22373c83176K56429j90928J6129J03365M7450j32115K12645L16396k3171p7296
22363A45728j82095N6241O7128j34407j39569J480q0839O8843J87958r12j33978
$$ plain form
22438 145210 -103682 -153507 -87689 -158785 -218466 -191121 -92948 -61911 -178900 -198255 -83160
22427 -83160 -115568 20423 -93032 -211614 -130836 -117264 -186999 -183212 -128151 -228120 -279744
22416 -279744 -163605 -210241 -205450 -214236 -130958 -150811 -240233 -392310 -250593 -167591 -143239
22405 -143239 -86970 96397 19994 42637 -51212 -135382 -75300 61004 66271 -88662 -210580
22394 -210580 -144961 14245 106799 101702 205744 49491 -109647 -60506 -141654 -301701 -213200
22383 -213200 -132547 -254749 -434751 -446205 -728212 -832290 -748793 -654243 -619613 -383176
22373 -383176 -126747 -317675 -301546 -198181 -150731 -282846 -70201 246195 223024 145728
22363 145728 -36367 19874 87002 -47405 -186974 -185494 -266333 -197490 -9532 -10444 -144422
22352a44422N6557J14505j25369J135K13664M6590k0075j45830k07251k22891
22342d33387L3099J99819p1973l4264J2524J79823K3984q7893q9413L7860j60045
22331c89866m4638P3594N0868J18934J50512J59890k20964j07779r8341J09735
22321a98055J53823J90237L08432M3163j24008k58649k9368o9217O641j38199
22311a15200J25098J4275J5979m5868m8801P4388K8228l91643j56382O9359J96222
22300b34345J00886j699k19473Q316J46977J12912j5793m8325r6792n6314K37703
22289f5947n4863O8768P0248k69217j06776K11417L8416P5413q552Q8149K8429
22278G5485j64987j3588N8279m8929P3888o3108p5990J19993R116J79477R0687
$$ plain form
22352 -144422 -87865 26640 -98729 -97594 116070 162660 142585 -3245 -210496 -433387
22342 -433387 -400288 -200469 -272442 -306706 -294182 -114359 -90375 -178268 -267681 -229821 -389866
22331 -389866 -434504 -360910 -310042 -191108 -40596 119294 -101670 -209449 -307790 -198055
22321 -198055 -44232 146005 454437 497600 373592 114943 85575 16358 22999 -115200
22311 -115200 9898 24173 40152 -5716 -54517 19871 48099 -343544 -499926 -430567 -234345
22300 -234345 -133459 -135158 -354631 -346315 -199338 -86426 -102219 -150544 -247336 -303650 -65947
22289 -65947 -120810 -52042 18206 -251011 -357787 -146370 -107954 -32541 -41093 47056 75485
22278 75485 -89502 -103090 -44811 -93740 -19852 -82960 -158950 -38957 -29841 149636 240323
22267B40323j21270k12296j43796P6938K59395J05780k5159L6658j74089j41455
22257i8971J0468M1408L7136r0222J21189K6427j38322j23947J38719J57336N3937
22246A35158L7619q830k79818q5479J3431j3168J51203O2855K67411Q0188m47006
22235h6436r3430k0701p8848L1036J388q3800Q160K6916r7739j9135J89524j60588
22223c83653P8698K67908J45031p4117k0234m861p7843j38472Q563R2840J81036
22212G4896J68178P7597K4391q2617j50497L5350p3634j62405k45882J16722K26593
22201H692M2358m4669J50636P7926q0591l5489K7373K0183k3989p6825o6958N1417
22189E0064l9411J7163M7181M9539r8308O0096m8952o4367j80449j44136m7282
$$ plain form
22267 240323 119053 -93243 -237039 -160101 99294 205074 179915 216573 42484 -98971
22257 -98971 -88503 -47095 -9959 -100181 21008 47435 -90887 -214834 -76115 81221 135158
22246 135158 172777 163947 -115871 -201350 -187919 -201087 -49884 12971 280382 360570 -86436
22235 -86436 -179866 -200567 -279415 -248379 -246991 -330791 -322631 -295715 -393454 -412589 -223065 -383653
22223 -383653 -304955 -37047 107984 33867 13633 8772 -69071 -207543 -198980 -106140 74896
22212 74896 243074 320671 345062 262445 111948 147298 73664 -88741 -334623 -217901 8692
22201 8692 51050 6381 157017 234943 154352 118863 146236 166419 142430 65605 -1353 50064
22189 50064 10653 27816 74997 124536 26228 86324 37372 -26995 -207444 -351580 -398862
22178c98862K17299L59473K073q9079O1729L0350p8204m229L1473R3508K2686
22167B48217k51690j16267J25820j9704N9009q531q3028n0514P2957j58513J06676
22156g5568l5017O2462n4231l9810Q7292R1368n636J03942J46276M5309k80942
22145D5445m8414j29935j74059L1507L01886j551p0855J09273k0851Q720R3656
22134A44822p0857k27752O1554J70993l7956j39574K4617J15490l9044O0603L2514
22123I5410J71331J11236r2128o4308r1413J99786M1554J03307J87840k44053
22113D18562l16374k4112l2411J71322N9041J68504r5226M4585j77002j59741
22103E7148k3908j67949m8803K4809P0278Q7798K36343k06430j98762K0222p2540
$$ plain form
22178 -398862 -181563 177910 179983 90904 152633 182983 104779 100550 132023 225531 248217
22167 248217 -3473 -119740 6080 -13624 45385 36854 -46174 -96688 -23731 -182244 -75568
22156 -75568 -110585 -48123 -102354 -142164 -54872 36496 30860 134802 281078 326387 45445
22145 45445 -2969 -132904 -306963 -275456 26430 24879 -45976 63297 42446 51166 144822
22134 144822 73965 -153787 -92233 78760 40804 -98770 -74153 41337 2293 62896 95410
22123 95410 266741 377977 285849 221541 130128 329914 371468 474775 662615 418562
22113 418562 102188 78076 45665 216987 276028 444532 349306 393891 216889 57148
22103 57148 33240 -134709 -183512 -158703 -88425 -627 235716 29286 -169476 -149254 -221794
22092b21794J15580K49796P1522j2097J710o9649o7079O8183j08772p0932K2215
22081b1317L7390O8198R10P2152j39071q9110P325p3938K08498r033n5336q1463
22069g4795r7810P0610P2014j8284J50766q9719k23155l6602Q0249J66438n6417
22058e6705p255J1516O312J91304n0178j13643j19460j38427N6426J8592J81919
22047a9599N5446O554j9911k601J23251m6658j31127j92956j10334M2148R6114
22036a99673Q0404K0761j47107j09066P2231K98548L65853m753k20914k09274
22026e2990n3183n818O2410q2345j00253l4151L9807P9425o1809k26494J51008
22015b84393K10176j5570J89454k0904n2537M3960q5506j80057r5593j50J59424
$$ plain form
22092 -221794 -106214 143582 215104 203007 204717 135068 67989 136172 27400 -43532 -21317
22081 -21317 16073 84271 85181 157333 18262 -70848 -63523 -137461 71037 62004 6668 -74795
22069 -74795 -172605 -101995 -29981 -48265 102501 12782 -210373 -246975 -166726 -288 -56705
22058 -56705 -63960 -52444 -46132 145172 94994 -18649 -138109 -276536 -220110 -201518 -19599
22047 -19599 35847 42401 22490 19889 143140 96482 -34645 -227601 -337935 -295787 -199673
22036 -199673 -119269 -98508 -245615 -354681 -282450 16098 381951 377198 156284 -52990
22026 -52990 -106173 -111991 -49581 -131926 -232179 -266330 -226523 -147098 -208907 -435401 -284393
22015 -284393 -74217 -89787 99667 78763 26226 70186 -15320 -195377 -290970 -291120 -131696
22004a31696J88078o1006k23494p1769L8351J19246k3088j92279J42454J65973
21994d9230J05767k61825r369J68077p8314j50828R1986O9897j86530J3469Q5607
21983b01293J93833P9745J8152p1156n8229K2382k9595k28949J50036j2256M4824
21972i2506N3999N8588J28124Q0849j39004j63105l6615m0930j39818k03830k5545
21961e19793N2925P5206Q5075K60912J16318j02924p9882j62746J27655J29215
21951a8039k5758J34355M5484K2329l1429l930m0607n8046Q2698J69013k2266
21940B53804j66881m1894l5570Q8560J66563k8915r0140j55660l3174k9143L7233
21929c5217R1645j53750O3028J01759J58654j0981K8905j73559J70140K0761P231
$$ plain form
22004 -131696 56382 -4624 -228118 -299887 -261536 -142290 -165378 -357657 -215203 -49230
21994 -49230 56537 -205288 -214657 -46580 -124894 -275722 -183736 -113839 -300369 -286900 -201293
21983 -201293 -7460 72285 90437 19281 -38948 -16566 -46161 -275110 -125074 -137330 -92506
21972 -92506 -38507 20081 148205 229054 90050 -73055 -109670 -150600 -290418 -494248 -519793
21961 -519793 -466868 -391662 -306587 -45675 70643 -32281 -112163 -274909 -147254 -18039
21951 -18039 -43797 90558 136042 158371 126942 123012 82405 24359 107057 276070 253804
21940 253804 86923 45029 9459 98019 264582 235667 145527 -10133 -43307 -72450 -35217
21929 -35217 56428 -97322 -34294 67465 226119 215138 244043 70484 240624 261385 268616
21918B68616l13963j24695j98367M2853Q6964M0306l0869J26724P2172L728J67452
21907A40921q4251O0087k0530j36412J67571J0166k5949l6956q3945k0507l7960
21896f7765N2494j00509p8672j3369O3482J89838N8742q0502m2470j67580J4149
21885a72162J52232J94192j23160k28889J12986L3692J43750p9759k38029p457
21875b12604P8551j6469J29402Q4142M208m3449R8652L9176r5469r1440q1504
21864a06804k29434M8379L6679O987K24413J65450p1893k06400q9489J79846J19695
21853G7429j39442j38150m9392p8550O3257n1955m0877O1559K59020o4204o0892
21842a62197k1821m4685R872j19509M252M2891J39968J17241K5556Q6393Q2634
$$ plain form
21918 268616 -45347 -170042 -368409 -325556 -238592 -198286 -229155 -102431 -30259 -26531 140921
21907 140921 56670 116757 96227 -40185 127386 137552 111603 74647 -9298 -29805 -67765
21896 -67765 -15271 -115780 -194452 -207821 -144339 45499 104241 23739 -18731 -186311 -172162
21885 -172162 -19930 174262 51102 -177787 -64801 -31109 112641 32882 -205147 -212604
21875 -212604 -134053 -150522 -21120 63022 67230 23781 122433 161609 66140 -25300 -106804
21864 -106804 -336238 -287859 -251180 -244193 -19780 145670 73777 -132623 -222112 -42266 77429
21853 77429 -62013 -200163 -249555 -328105 -264848 -316803 -357680 -296121 -37101 -101305 -162197
21842 -162197 -184018 -228703 -218831 -338340 -334088 -291197 -151229 -33988 -8432 77961 160595
21831A60595j76989o6383j05058m13R1617o1238N9678j02970r9742r0507j17788
21820e09198J99135J59562j1807r9951J21740J06566k56513j14011J90548N5105
21810a58824J04560P4985M0384J90934k7317r8749N8934Q5632m1986j57252J43368
21799B14669P5119j70197j54130L6097R7331k15933j00151O2247K4445O0612k01764
21788b71655K8525J71034J32295j7402j41170M330K849m6k5161J62984J27715
21777A74298j24649o2764Q0236J9207K56349j21097k03915k26617o3331N2860
21767b19423O3026Q27P3010l99J73212K3761k5635J59148m2780j30317Q7165J11608
21755B73203J41385q306J20929J65028j08714l07082l07100j13455R154o5985
$$ plain form
21831 160595 -16394 -82777 -187835 -188248 -96631 -157869 -98191 -201161 -300903 -391410 -509198
21820 -509198 -310063 -150501 -162308 -262259 -140519 -33953 -290466 -404477 -213929 -158824
21810 -158824 -54264 20721 61105 252039 224722 125973 184907 270539 228553 71301 214669
21799 214669 289788 119591 -34539 1558 98889 -117044 -217195 -154948 -130503 -69891 -271655
21788 -271655 -243130 -72096 60199 42797 -98373 -94043 -91194 -91240 -116401 46583 174298
21777 174298 49649 -13115 67121 86328 342677 221580 17665 -208952 -272283 -219423
21767 -219423 -156397 -155570 -82560 -82959 90253 114014 88379 247527 204747 74430 161595 273203
21755 273203 414588 406282 527211 692239 583525 276443 -30657 -144112 -134958 -200943
21745b00943J00728m1920n601K99570Q308j57556j1414N4551j85547k22558L2973
21734c29409K28646K32039J89011q1719j05826L0713j42573j72946j020j19415
21724b72499K0334K85647r6889k17674J41672J19970j80262n4232j02137J22052
21714b34018J40761N7183J59069J78984J7338m87797l20384K03278L03411M2810
21704F0635j67579j09315J06333K83846k3173j12323m312L3218n0679k24022J39471
21693f7900J81116L925R4025l1452N912P6923j69657J6470j20308j05146R4131
21682b1961J32611q5810N2412R0884j98143m1288O6479l658q5523O4799p486l01174
21670c37858j19910k6111R3772J56888J4337P0957J76204q479n7201k09199j0216
$$ plain form
21745 -200943 -100215 -142135 -147736 151834 160142 2586 -8828 45723 -139824 -362382 -329409
21734 -329409 -100763 131276 320287 238568 132742 163455 20882 -152064 -153084 -272499
21724 -272499 -252165 33482 -63407 -281081 -139409 -19439 -199701 -253933 -356070 -234018
21714 -234018 -93257 -36074 122995 301979 319317 -168480 -488864 -285586 17825 60635
21704 60635 -106944 -216259 -109926 173920 150747 38424 34112 67330 16651 -207371 -67900
21693 -67900 113216 117141 211166 179714 185626 262549 92892 109362 -10946 -116092 -21961
21682 -21961 110650 24840 77252 168136 -30007 -71295 -4816 -8474 -93997 -29198 -36684 -337858
21670 -337858 -457768 -483879 -390107 -233219 -218882 -147925 28279 19800 -37401 -246600 -256816
21659b56816J72164L4577l13408J3802k8823Q5555K19702K6335J09831J14510
21649A77429m8557n0392r4539o9350k04358k15323o8781N1146m9623K42047K75060
21638e5241O8337j17800O4419J49264k3673p2747r279j18418N7828N6192N474
21627D356j50534l5438K12652q6673P3067j73384r0931J12173J55260M6579J90677
21616B57804j3845k13319k00022k1660j8483j6114L5569J53899j04568N5969O7533
21605a7237j443n4164o4413N3723k6089M0524J18273r2840q7445M3904J6410M556
21593f6241J90291j33979r7122J64354J81934o3553j48867J0691J96658O5875
21583C00041n7412k28939K560p1592j40977J40223P0575J60558p8502n5139L40177
$$ plain form
21659 -256816 -84652 -50075 -363483 -349681 -378504 -292949 -73247 -46912 62919 177429
21649 177429 128872 78480 -16059 -85409 -289767 -505090 -573871 -522725 -572348 -330301 -55241
21638 -55241 13096 -104704 -40285 108979 85306 12559 3280 -115138 -57310 -1118 4356
21627 4356 -146178 -181616 31036 -55637 17430 -155954 -246885 -134712 20548 67127 257804
21616 257804 243959 30640 -169382 -191042 -209525 -225639 -190070 -36171 -140739 -84770 -17237
21605 -17237 -18680 -72844 -137257 -83534 -109623 -69099 49174 -43666 -131111 -87207 -70797 -66241
21593 -66241 124050 -9929 -107051 57303 239237 175684 26817 37508 234166 300041
21583 300041 242629 13690 16250 -55342 -196319 -56096 14479 175037 96535 41396 381573
21572C81573k86604k69005J7499j74854N3887J57036j1257K0185J81422J98533
21562B68415j43216j09023m3380N8229J36610Q9810j43111M2118M2085l6759k69931
21551a08153n2476J06565J32521j0515l81836N3649K73027K07760j88611j17086
21541h5155k2640j92703j488J18528K27063J64160j02664j35408k15117j22078
21531c67502p6405Q2106K05070m3020N7823L2528M0278Q7887K26482L0402m2597
21520B33052k7563j80001N6961K05965P6426q6928J929j25182j55912k7668J38015
21509A09094j1079k94179o2679p473R7946J54554l5819p8321o4961N630o2303
21498b49590N1286L3872j03478P8714K47102K67010M2199j45362l4088j8425J02080
$$ plain form
21572 381573 94969 -174036 -156537 -331391 -277504 -120468 -131725 -111540 69882 268415
21562 268415 125199 16176 -27204 31025 167635 257445 114334 156452 198537 161778 -108153
21551 -108153 -160629 -54064 78457 67942 -313894 -260245 12782 220542 31931 -85155
21541 -85155 -107795 -300498 -301986 -183458 43605 207765 105101 -30307 -245424 -367502
21531 -367502 -443907 -361801 -156731 -199751 -141928 -109400 -69122 18765 245247 275649 233052
21520 233052 205489 25488 82449 288414 364840 277912 279841 154659 -1253 -28921 109094
21509 109094 98015 -196164 -258843 -266316 -168370 -13816 -49635 -127956 -192917 -187287 -249590
21498 -249590 -198304 -164432 -267910 -189196 57906 324916 367115 221753 187665 169240 271320
21487B71320k21904J27304J62387l5260P1820q9357J9192m7646m39536L715K58003
21476H0038K3472R4131N7210k0444q0719k77120n5911J15214J25305l6081j73960
21465a48865J17311r1883j33583r6709m0716n1749L14844J59711k51283j0354
21455b33276m4687n5180K8494P8349o0156J88689J70666j03614m8013J38889J76857
21444B37018n9297q1506r1808o0660K42440J02732j92747j31970q7083J8327k8035
21433a32589J87795K04783p2650r9772j13255J31213L38841q70j30502J7179j46237
21422A83936l8978P317k0252Q2765j81257j91426m5890J32375j9247r2014j8422
21411b01093N1028p3543O2768J06878m3301K29098K206J9278R2283N0033R0425
$$ plain form
21487 271320 49416 176720 339107 303847 375667 286310 305502 257856 -181680 -177965 80038
21476 80038 103510 197641 254851 234407 153688 -123432 -179343 -64129 61176 25095 -148865
21465 -148865 -31554 -123437 -257020 -353729 -394445 -446194 -131350 28361 -222922 -233276
21455 -233276 -277963 -333143 -304649 -226300 -286456 -97767 72899 -30715 -78728 60161 237018
21444 237018 177721 96215 4407 -56253 186187 288919 96172 -35798 -122881 -104554 -132589
21433 -132589 55206 259989 187339 87567 -25688 105525 444366 443496 312994 330173 183936
21422 183936 144958 152275 132023 214788 33531 -157895 -203785 -71410 -90657 -182671 -201093
21411 -201093 -150065 -223608 -160840 -53962 -97263 131835 134041 153319 245602 295635 386060
21400C86060M5435k01224l14843N854J20296K55063n0332k89989j77627L35399
21390A14092n3644j50606m9430Q7882P8594l7365K72889L03470J85525j12835
21380F38572l85178j11292l7924j6746j54721j01647J57108J57492j04785j36021
21370i5142K7715N9855J38317J69766l5743N8284j47748m5762o173J7927p2768
21359F8528J09267K8801j56774J74765K37357o9239l22200k0541l8746r9999R4920
21348F139J02406m8328j9273m5528P1908m5273j80515m862k906J9257K63607J43943
21336B60575J27699k40125l54832q5431J39457J34108K10712J3889J18766k08934
21326A15884j51507J25905m8048j59492J24452R2779j36319r148O2052K0584j15711
$$ plain form
21400 386060 431495 230271 -84572 -78718 41578 296641 246309 -43680 -221307 114092
21390 114092 60448 -90158 -139588 -51706 26888 -10477 262412 565882 751407 638572
21380 638572 253394 142102 104178 87432 -67289 -168936 -11828 145664 40879 -95142
21370 -95142 -67427 -7572 130745 300511 264768 323052 175304 129542 123369 141296 68528
21359 68528 177795 206596 49822 224587 461944 392705 70505 49964 11218 -88781 6139
21348 6139 108545 60217 40944 -4584 67324 22051 -158464 -163326 -166232 -146975 116632 260575
21336 260575 388274 148149 -206683 -292114 -152657 -18549 192163 206052 324818 115884
21326 115884 -35623 90282 42234 -117258 7194 99973 -36346 -45494 16558 37142 -78569
21315g8569j1341j6922N2629j4577k5618J73383J60587r4094K04388Q0695k69765
21304A60796j24202j27223k8521Q3816j7855n2084j76235j34245J27197K11779
21294g6777J57463M4652j2233O6152j87722o4457J54470J71820R7208r1982j57649
21283A00945n0588M4560j80538N6972J36362O9873J22825J32647j23819m01066
21273i1827r6583J08867L04744L39073K52161L33546K91190M25001O58406J019883
21263C544461J679388J494204J058703K70389j651404k712194j531448p40993
21255A411106m32530k15325j92556j85211J00138K931j02863j05644M7066P510
21245C34622J71179r1094k6135m6498o6131k05049j71728p039L3539o637J920
$$ plain form
21315 -78569 -89910 -106832 -54203 -68780 -94398 78985 239572 145478 349866 430561 160796
21304 160796 36594 -90629 -119150 -35334 -53189 -105273 -281508 -415753 -288556 -76777
21294 -76777 80686 125338 113105 179257 -8465 -72922 81548 253368 350576 258594 100945
21283 100945 50357 94917 -85621 -28649 107713 177586 300411 433058 309239 -91827
21273 -91827 -188410 -79543 225201 564274 816435 1149981 1441171 1866172 2524578 3544461
21263 3544461 5223849 6718053 7776756 8047145 6395741 3683547 2152099 1411106
21255 1411106 978576 763251 570695 385484 485622 488553 385690 280046 327112 334622
21245 334622 505801 414707 388572 342074 275943 70894 -100834 -107873 -74334 -80971 -79051
21234g9051j45386k9145J22273m8762j23715J2165L2313L0190j39901l19454M5966
21223f42507Q1514K26556M1213r5716p2504J22999K30479J29632P8765k15769
21213a15338k26885j61586L5065M37863k3179q5333n3627j03213n0855J63173
21203a83915K54232J22495o7833k61489K6738J22051O0623J70537k0314j56675
21193F6450N0859J56042N6634j12237j94562l4633R0182n3061k64513l76747k1668
21182f37254K23845K44458N0126o7667k70148K47863J13100k09057j36791K38246
21172b03279J00210O96k26792Q1627J77374j14747k70581N6379K2746j3316J20912
21161b68771L00254Q3270K7575k09197k45150k9679j44521m4498K43609K06001
$$ plain form
21234 -79051 -224437 -253582 -131309 -180071 -303786 -291621 -259308 -229118 -369019 -688473 -642507
21223 -642507 -560993 -334437 -293224 -388940 -461444 -338445 -107966 21666 100431 -115338
21213 -115338 -342223 -503809 -468744 -30881 -54060 -139393 -193020 -296233 -347088 -183915
21203 -183915 70317 192812 124979 -136510 -109772 12279 72902 243439 223125 66450
21193 66450 117309 273351 329985 217748 23186 -11447 78735 25674 -238839 -615586 -637254
21182 -637254 -413409 -168951 -118825 -186492 -456640 -208777 -95677 -304734 -441525 -203279
21172 -203279 -103069 -102373 -329165 -247538 -70164 -184911 -455492 -399113 -376367 -389683 -268771
21161 -268771 31483 114753 142328 -66869 -312019 -341698 -486219 -530717 -287108 -81107
21151h1107p478o7807Q0583J27129j05513n8910r8319J06552j92858r5895J19456
21140b74167J3920P1070M7718J87235K5373k06084J57943K73510j17139m1921
21130A37458j52189l0184P9729j57241j37661o6535J62J85397q5068K9863J41782
21119e4487K7009j06487k29651R8394J10735N9797j02484J40503J34589j82865
21109a04947j44279q9741M7252J68370O0111O3706j61303R026J55556J68970P900
21098A80621k24506l04792M3944L18340K19151J3378R4896O0364j07806j03785
21088A89805k59699M8691J91849J74688J56480l3053j45850K022n8448K13289
21078D79774l0106j71777j52120j65157k3940J04630m6692l509J0144O2590j2837
$$ plain form
21151 -81107 -88585 -156392 -75809 51320 -54193 -113103 -211422 -104870 -297728 -393623 -274167
21140 -274167 -260247 -189177 -141459 45776 71149 -134935 23008 296518 179379 137458
21130 137458 -14731 -44915 34814 -122427 -260088 -326623 -326461 -141064 -226132 -196269 -54487
21119 -54487 -27478 -133965 -363616 -265222 -154487 -94690 -197174 -56671 77918 -104947
21109 -104947 -249226 -338967 -291715 -123345 -63234 472 -160831 -151805 3751 172721 180621
21098 180621 -43885 -348677 -304733 13607 232758 246136 341032 401396 293590 189805
21088 189805 -69894 -21203 170646 345334 501814 468761 322911 324933 266485 479774
21078 479774 449668 277891 125771 -39386 -63326 41304 -5388 -8897 1247 63837 51000
21067E1000O725J30459L12424J88342J2078K0906o0656J99066M37677P84807J169085
21056C251913J285267Q50540J64636j032012k012838j195979o09855k47522r8450
21047C55700Q6484n0048J635q2627k11370J25582N7925J55530J120j20720L3221
21036C52432K6535R1675j72621j87495p1034p0326K0877m6970K0555q2370q9979
21025b08721j96706p4940j36108J16633K78818J7898J57035n1040n7358j22186
21015b76675K7083O7962j56256Q5346K83479P0626n4913M725J5009q5802n0079
21004f9495k393K32021K13300J27437k28883k21474L8026p2286j97105j97056
20994c77908j5163L48313K32606j42211l28251M8110r900J26425j23505r5285
$$ plain form
21067 51000 57725 188184 500608 688950 701028 721934 661278 860344 1298021 2082828 3251913
21056 3251913 4537180 5387720 5552356 4520344 2507506 1311527 701672 454150 355700
21047 355700 442184 392136 393771 311144 99774 225356 283281 438811 439931 319211 352432
21036 352432 378967 470642 298021 110526 39492 -30834 -9957 -56927 -36372 -118742 -208721
21025 -208721 -405427 -480367 -616475 -499842 -221024 -203126 -46091 -97131 -154489 -276675
21015 -276675 -249592 -181630 -337886 -252540 30939 101565 46652 51377 66386 -19416 -69495
21004 -69495 -71888 160133 373433 500870 271987 50513 88539 16253 -180852 -377908
20994 -377908 -393071 -44758 187848 45637 -282614 -234504 -244404 -117979 -241484 -336769
20984c36769P208J79253j4226N9307K56526L9197J09270J04309j94299j26187
20974H3589m5747J6298p8395k91993k2712L8374j0768P6334L59105L5468k54052
20963i4499j11566O4821k7093o0093q3572r753J0879O1730P2373m7526L9593J08409
20951g6297J50462o0417r6530K1358k91389J05810j7956R702J27202l5470j08461
20940b71986J9063Q7393j71163P770J58343L2723l7900r5019J22867R0283p3845
20929a31471M1361j4408l79262q5405J65465O6549o0448k1874K64489j6302j23150
20918b94456l730m0648J8608M1841J826J67653O0045j29524P6743K8527M0009
20907c3106L5530L1667O207Q4061j49501j03407m677j7340o8590J29296P9611
$$ plain form
20984 -336769 -329561 -150308 -164534 -105227 151299 190496 299766 404075 209776 83589
20974 83589 37842 54140 -24255 -316248 -338960 -300586 -311354 -235020 124085 159553 -94499
20963 -94499 -206065 -141244 -168337 -228430 -312002 -321755 -310876 -249146 -176773 -224299 -184706 -76297
20951 -76297 74165 13748 -82782 -61424 -352813 -247003 -264959 -255257 -128055 -163525 -271986
20940 -271986 -252923 -165530 -336693 -328923 -170580 -137857 -175757 -270776 -147909 -57626 -131471
20929 -131471 -90110 -104518 -483780 -569185 -403720 -337171 -397619 -419493 -155004 -171306 -294456
20918 -294456 -298186 -338834 -320226 -278385 -276559 -108906 -48861 -178385 -101642 -73115 -33106
20907 -33106 2424 34091 40298 124359 -25142 -128549 -133226 -150566 -219156 -89860 -10249
20896a0249J46356J31907k87260l1412L7691r5388R3572n1105l8288m7920R9695
20885e2401J66604Q6706j25920j54749j24113j45751K4477J80283J18417J03049
20875G6602K6773l0725L5777n6180J5829k14062M3492J1759o3419R307K5075R029
20863a10743K5611J91145K7853j62709n237o8724q9352J29869p6826J84576J30145
20852A75608r2735j37756j37757k29190j19245L7959K27829J40137J57823n012
20842A7661p2412r0697j690m7855j5095O6560J61560j52272p4041M8110J63942
20831C771o2891k2074K2452P0134J4296M1335J8053J7r0442J79628R0925N2657
20819C17861j96001j87697K7985K10055R5253k31433j32094l7818Q5572j3184
$$ plain form
20896 -10249 136107 268014 -19246 -50658 -12967 -108355 -14783 -65888 -104176 -152096 -52401
20885 -52401 114203 200909 74989 -79760 -203873 -349624 -325147 -144864 -26447 76602
20875 76602 103375 72650 108427 52247 68076 -145986 -102494 -90735 -154154 -144847 -119772 -110743
20863 -110743 -85132 106013 133866 -28843 -34080 -102804 -192156 -62287 -139113 45463 175608
20852 175608 82873 -54883 -192640 -421830 -541075 -503116 -275287 -135150 22673 17661
20842 17661 -54751 -145448 -147138 -194993 -210088 -143528 18032 -134240 -208281 -160171 3771
20831 3771 -59120 -81194 -58742 11392 25688 67023 85076 85093 -5349 174279 265204 317861
20819 317861 121860 -65837 -37852 172203 267456 36023 -96071 -133889 -48317 -61501
20809f1501m9640N0246J71081k740j62837j56254M3585l4469L38305j02l65105
20798b29431j68820K59318K18508j135P3039r6410k43635j75362J6660J09919
20788b37349o494j4000L0862r0082m5413J12414N7108O1901J20397R7667J94271
20777B81282l7307r9041j8772o5504Q1147j25499n5411j6912O2556K15131j87795
20766C3875j31709j93090Q7420P7563J69153J08897r5387L4893K9014j66313o6155
20755a11839J879P4142j43155J3293J34780M8010j01410l9949L5575j07556k254
20744a98484K7992R2872J66369r7734j43354R878L8133L734k5692p9770K04443
20733a613K08509M62o5781l36738K8437L71894J74591l62957j95606K13198J49607
$$ plain form
20809 -61501 -111141 -60895 110186 107446 -55391 -211645 -168060 -202529 135776 135674 -229431
20798 -229431 -398251 -138933 79575 78440 151479 55069 -188566 -363928 -347268 -237349
20788 -237349 -243843 -257843 -226981 -317063 -362476 -250062 -192954 -131053 -10656 87011 281282
20777 281282 243975 144934 126162 60658 141805 16306 -39105 -56017 6539 221670 33875
20766 33875 -97834 -290924 -203504 -125941 43212 152109 56722 91615 120629 -45684 -111839
20755 -111839 -109960 -35818 -178973 -165680 -30900 17110 -84300 -124249 -88674 -196230 -198484
20744 -198484 -170492 -77620 88749 -8985 -152339 -142461 -104328 -100594 -126286 -206056 -1613
20733 -1613 206896 207358 141577 -195161 -166724 205170 379761 16804 -178802 34396 184003
20722A84003O6748j64148j92548m3231J1127J1409j45542q4701K8081j1273P1609
20711b68466J33046r816R6200J30884J27331j87644j58070o5596m0822J66934
20701g6019P3249J61060k19846j37432J0621K01114k3308m4109J64828j75373
20691f5215j49467J12243j31144k19457L1415N7738q4160J72953J03617k6345
20681a97822R4142O3319j02313j83829J3879J38686J11743J53303j21681p0309
20671a00882k65083R4696K18899o2387Q551J12053J33642q8721j5863j8301N733
20660B2337L1514O1227k79891j90387K49102J47002L4449j93257p3936l5039j7986
20649b44865n1500L23673L073j18331j77593j51194j0143L07174J2666J26678
$$ plain form
20722 184003 250751 86603 -105945 -149176 -138049 -126640 -272182 -356883 -328802 -340075 -268466
20711 -268466 -135420 -145236 -49036 81848 209179 21535 -136535 -202131 -242953 -76019
20701 -76019 -2770 158290 -61556 -198988 -188367 12747 -10561 -54670 110158 -65215
20691 -65215 -214682 -102439 -233583 -453040 -421625 -363887 -448047 -275094 -171477 -197822
20681 -197822 -103680 -40361 -142674 -326503 -312624 -173938 -62195 91108 -30573 -100882
20671 -100882 -365965 -271269 -52370 -114757 -106206 5847 139489 50768 34905 16604 22337
20660 22337 53851 115078 -164813 -355200 -106098 40904 75353 -117904 -191840 -226879 -244865
20649 -244865 -296365 27308 30381 -87950 -265543 -416737 -426880 -119706 -107040 19638
20639A9638J41122j7649j32111N1696J07353n3507J53553J4372l30465L0540K52488
20628B37030M5787k23947k12577K7944J37176K18607k39848N6645K1695p3338
20618d826P134k98528j05157J55447n676N2774J72425J8287j20237O3173M7020
20607a8164Q0068R7697N3818j85602o9276K6099k1660J27732J12510o4711j02216
20596C6295K8358j42706O8469L7256o1883R635R1950J7411q3233j8042k119n2706
20584g1315j61434K07405L73209l5863k17102r0824J8304J6821J8285j7024k71539
20573b31077j05396l9069l414J42956J63775M5103p6934l3483j13838r5554m8524
20562c95455O4372M4242n8173j01486l3198J31743J17893l0691j12662M7915K49004
$$ plain form
20639 19638 160760 143111 11000 62696 170049 116542 270095 284467 -45998 -15458 237030
20628 237030 282817 58870 -153707 -125763 11413 230020 -9828 46817 68512 -4826
20618 -4826 2308 -296220 -401377 -245930 -251606 -198832 -26407 -8120 -128357 -65184 -18164
20607 -18164 61904 159601 213419 27817 -41459 -15360 -37020 90712 203222 138511 36295
20596 36295 64653 -78053 -9584 27672 -34211 -24576 67374 84785 1552 -16490 -18609 -71315
20584 -71315 -232749 -25344 347865 312002 94900 4076 22380 39201 57486 40462 -231077
20573 -231077 -336473 -375542 -378956 -236000 -72225 -27122 -104056 -137539 -251377 -346931 -395455
20562 -395455 -331083 -286841 -345014 -446500 -479698 -347955 -230062 -260753 -373415 -325500 -76496
20551g6496K19041k65408k39523j15444K6774j45971j05703L32925M27784j2621
20541D5358j02934j1402q899M7672l2755j40661M2251j2546R1023O8866M6523
20530C2496j88653p2039J14060J9064j10969k07749K4462K02203j6740O987P60
20519a96118J44611p1009j7355K6497M5825M8588R919n6424m50k09074P8923J54011
20507d2056J51564J39531j46626o2457m4041K861j81391p6234j01549R9789R2930
20496a67679J68175K5094j05136P2376J6659N867Q9630k4420l04460j8607j5127
20485b57628m4074j81846M5612j32255m4617K65906O8840J58527L62020q1460
20475A59025k9885L8610q0808k4969k5235J02908Q3169l7366j18639K5470Q9020
$$ plain form
20551 -76496 142545 -122863 -362386 -477830 -451056 -597027 -702730 -369805 57979 45358
20541 45358 -57576 -68978 -77877 -30205 -62960 -203621 -161370 -173916 -82893 -14027 32496
20530 32496 -156157 -228196 -114136 -95072 -206041 -413790 -389328 -187125 -203865 -196878 -196118
20519 -196118 -51507 -122516 -139871 -113374 -67549 -18961 -9042 -65466 -65916 -274990 -196067 -42056
20507 -42056 109508 249039 102413 39956 -4085 -1224 -182615 -258849 -360398 -260609 -167679
20496 -167679 496 25590 -79546 -7170 9489 15356 104986 80566 -223894 -242501 -257628
20485 -257628 -301702 -483548 -437936 -570191 -614808 -348902 -280062 -121535 240485 159025
20475 159025 129140 167750 86942 61973 36738 139646 222815 185449 66810 92280 181300
20464A81300L2251J29112r5220j83510p1920J59780Q5469J36974l40093j39458
20454a05315J3230j21693m8053J26304K16487Q5376p4133O3971j1553k42232R472
20443h8139K42363J85465R8088k38934j43242P7721L0429n9271j47834m1986K73487
20432A88147j28678j62073j45659o5567m6441J88043J17421p5607j49490J40436
20422a39468n4767o4478j04415J6851J49989K09737Q1201p4755j39578j56812
20412b76495J09977J88458O7520J00075m8719j55724o6164N8728J87617j1062
20402A54211j63287p9035O9806J94826N0956j79183l80967j26992K24845L85274
20392A50454K3488O0702j56279j33195Q5408k4006m6873J19704J00596J9161q0053
$$ plain form
20464 181300 213551 342663 247443 63933 -7987 151793 237262 374236 34143 -105315
20454 -105315 -92085 -213778 -261831 -135527 80960 166336 92203 156174 144621 -97611 -88139
20443 -88139 154224 339689 437777 198843 55601 133322 163751 104480 -43354 -85340 188147
20432 188147 59469 -102604 -248263 -313830 -360271 -172228 -54807 -130414 -279904 -139468
20422 -139468 -194235 -258713 -363128 -346277 -196288 13449 94650 19895 -119683 -276495
20412 -276495 -166518 21940 89460 189535 140816 -14908 -81072 -22344 165273 154211
20402 154211 -9076 -88111 -18305 176521 227477 48294 -332673 -459665 -234820 150454
20392 150454 173942 234644 78365 -54830 30578 6572 -40301 79403 179999 199160 119107
20381A19107L5383O2121R9715q0525n6428k06950j29819O7359Q8580O5268j45264
20370h1453p5489n6650n9941O4561J21704K08171j05317n2597P370k29356k33039
20359d92036J5464N6811O1687J2127J41293J6483J26894M1630p0248P8761O6459
20348E5325k75078j06203l6139K06956P9258m1323j24431J18781K11654K4640
20338A13440j04381m8691K4557j25017j21913j37879J09545J46834K14519p8881
20328g867J4016R1746m0763k05704p7895k6419J30475K07936M510r3151K30525
20317B27409j3679r7066q4311r6650N9544Q1905j15705o6012L3756k40726L0963
20306b80572J81970J74362K4843l7722K1203n6019j01274p9041j75199m9473Q9192
$$ plain form
20381 119107 154490 216611 316326 235801 179373 -27577 -157396 -90037 -1457 63811 -81453
20370 -81453 -156942 -213592 -273533 -208972 -87268 120903 15586 -37011 -29641 -258997 -492036
20359 -492036 -476572 -419761 -358074 -345947 -204654 -188171 -61277 -19647 -89895 -11134 55325
20348 55325 -219753 -325956 -362095 -155139 -75881 -117204 -241635 -122854 88800 113440
20338 113440 9059 -39632 -15075 -140092 -262005 -399884 -290339 -143505 71014 -7867
20328 -7867 6149 97895 57132 -148572 -226467 -252886 -122411 85525 90035 -3116 227409
20317 227409 213730 116664 32353 -64297 -4753 77152 -38553 -104565 -70809 -311535 -280572
20306 -280572 -98602 75760 100603 62881 84084 28065 -73209 -152250 -327449 -376922 -287730
20295b87730q7018K2441J63208J87092J18483j82969l43897q7635o5277K12534
20285c50768K48934K27072K0889j07061k28411m8482K40659O868J81189J80644
20275C71533l25544l14596J6037j9662Q3330j05650k57329j9736K15976L1647
20265c23994J39440J41446R8701m3048j2524J47603k07898j47174N3903K2224
20255a31321K5275N3132m2540k3753J37046J81991k9856p5651j12284R9220J74470
20244B55729Q9431l53742k03883R8869j2951k9378L3513j14636j41904Q365P7961
20233b92626P0798N6745K4569p1374j07401K06113J32995K1266q8579J04438J63419
20222B20363Q6884j17008j54031j9987l6817m3242O4167L705k8892j48897m6206
$$ plain form
20295 -287730 -374748 -352307 -189099 -2007 116476 -66493 -410390 -498025 -563302 -350768
20285 -350768 -101834 125238 146127 39066 -189345 -237827 2832 9700 190889 371533
20275 371533 45989 -268607 -252570 -272232 -188902 -294552 -551881 -571617 -355641 -323994
20265 -323994 -184554 -43108 55593 12545 21 147624 -60274 -207448 -153545 -131321
20255 -131321 -106046 -52914 -95454 -119207 17839 199830 169974 94323 -17961 81259 255729
20244 255729 345160 -8582 -212465 -113596 -126547 -155925 -122412 -237048 -378952 -370587 -292626
20233 -292626 -221828 -165083 -140514 -211888 -319289 -113176 19819 41085 -47494 56944 220363
20222 220363 307247 190239 36208 16221 -20596 -63838 329 4034 -24858 -173755 -219961
20211b19961K51508j60355r3418j3062K57900K04306r169o9165j12876l42045
20201c06337q3551J60607J69712J30732j17828J07929K1100j12457o6265M6324
20191e0034N8686M1203P7258q3856j12589j44559R0480k9293j95130l9220J66858
20180b20196K0361R0994M280j33272j7368j84717N3929O432P4708k7691j47221
20169d79761L4410K19795J42438N9604N0509M78j06832J6122J24997K3944k82813
20158a97109J008K45057J01388K6804J29922k52133k7402O3810R303m5168j5566
20147C9914K0422k09418k25596Q1612M4692K2026j0229O2384Q0856K1071Q7832
20136A5566J5930q033J05551J6746j12696j34030M9112q0456k8056J98476K88338
$$ plain form
20211 -219961 31547 -128808 -222226 -235288 22612 226918 217749 148584 35708 -306337
20201 -306337 -389888 -229281 -59569 71163 -46665 61264 82364 -30093 -96358 -50034
20191 -50034 8652 49855 127113 43257 -69332 -213891 -123411 -152704 -347834 -387054 -220196
20180 -220196 -199835 -108841 -104561 -237833 -255201 -439918 -385989 -379557 -304849 -332540 -479761
20169 -479761 -445351 -225556 -83118 -23514 26995 27473 -79359 -63237 61760 85704 -197109
20158 -197109 -196101 48956 150344 177148 307070 54937 27535 91345 100648 55480 39914
20147 39914 60336 -149082 -374678 -293066 -248374 -226348 -236577 -174193 -93337 -72266 15566
20136 15566 31496 23463 129014 145760 33064 -100966 -51854 -132310 -160366 38110 326448
20125C26448j50244m0767j97166l0268J72559M2896K5786J46855O6824k16661
20115A46262J2118O3383j32928m7140j61394J52530J31887K8718j8699M1758j12420
20104A04075j18744l15172k8712K87359K01705j99084j28219K0159K358Q8609
20094h5666Q4411j73812n8991K30310J21535p2998j27295N4449l5017l3096J72336
20083G6166j70444q8833K70937n3520r5920j39134k87692r9663J12105J68771
20073c07227K0078J40223j47658R5527J53285K7673j33180K0560j390L8170n8820
20062a52759j24990Q305J29644P2173J2906Q4197Q3757j28534k11086J4551J78236
20051c3600K46313p3601L3340o027j13787j20781j16355q476J51330K54852n3135
$$ plain form
20125 326448 176204 135437 -61729 -91997 80562 123458 149244 296099 362923 146262
20115 146262 158380 221763 88835 41695 -119699 32831 164718 193436 174737 216495 104075
20104 104075 -14669 -329841 -358553 -71194 130511 -68573 -196792 -176633 -174275 -85666
20094 -85666 -1255 -175067 -234058 -3748 117787 44789 -82506 -28057 -63074 -96170 76166
20083 76166 -94278 -183111 87826 34306 -61614 -200748 -488440 -588103 -475998 -307227
20073 -307227 -287149 -146926 -294584 -199057 -45772 -18099 -151279 -130719 -132109 -93939 -152759
20062 -152759 -277749 -269444 -139800 -67627 -54721 29476 113233 -15301 -226387 -211836 -33600
20051 -33600 212713 139112 172452 166425 52638 -68143 -184498 -192974 -41644 213208 160073
20040A60073j14426j0880m2656J5137q8592j26872n0821l7864q739l7947J85479
20029a58108J96488n1473k86501k8238L61971K63481l5109l13106p1233K08902
20019H7074J25179j14354j06772j77372J00119K68459M3793m0698L6124j20593
20009A00959M9129R4150O9881r1966j22809r6603j04674j27073J40161O2020j66122
19998a92947j69275J85287j09267j01132l589L24198K45497j8946l7555l241j00634
19987A8396k40523Q0506J20402J26246R8084O374m968p4119l5237o5520J3677
19976D3318K53577J74923j43450q4814m3420m1896p6670r7845j9876j19409J03191
19965e2371K16982J23777r29l30321j32729J18269J52175j55014j37204Q305L04316
$$ plain form
20040 160073 45647 34767 -7889 7248 -81344 -208216 -259037 -296901 -305640 -343587 -158108
20029 -158108 38380 -13093 -299594 -327832 34139 297620 262511 -50595 -121828 87074
20019 87074 212253 97899 -8873 -186245 -86126 182333 226126 185428 221552 100959
20009 100959 150088 244238 314119 222153 99344 2741 -101933 -229006 -88845 -26825 -192947
19998 -192947 -362222 -176935 -286202 -387334 -390923 -66725 178772 159826 122271 119030 18396
19987 18396 -222127 -141621 -21219 105027 203111 209485 204517 130398 95161 29641 43318
19976 43318 296895 471818 328368 243554 200134 158238 81568 -16277 -36153 -155562 -52371
19965 -52371 164611 288388 287459 -42862 -175591 -57322 94853 -60161 -197365 -189060 115256
19954A15256J08540j05425m3844j5538J36994K2040p1985K104L8864J04626J46817
19943D38449J64226N9953k43909k60345j84162j1161J84134j54030j18266q8589
19933b13700L9950l9401J20118P9648J7786o2401O1787K53293M6411Q455q917
19922C03029L1054J46951j79831J5354l2471m9113p0879n9530j73204M8354J49189
19911A28903j23154q9238K510p5156J09918K71423l3256R8460j2185q1951P2731
19900B69005K19303J02994J4350q0383m1848p3356J8185j36120l99r0015j67666
19889C4050j3762Q5380l4130j31636J43350J40396J19184q3556j88125j05777
19879c4626n4426N1603L9759J54491O3809p7505O1529k15276j67328K06294j1521
$$ plain form
19954 115256 223796 118371 74527 58989 195983 218023 146038 148142 187006 291632 438449
19943 438449 602675 662628 418719 158374 -25788 -36949 147185 -6845 -125111 -213700
19933 -213700 -173750 -213151 -93033 -13385 4401 -58000 3787 257080 303491 311946 303029
19922 303029 334083 481034 301203 316557 284086 234973 164094 104564 -68640 -20286 128903
19911 128903 5749 -83489 -80979 -156135 -46217 225206 191950 290410 278225 196274 269005
19900 269005 488308 591302 605652 525269 483421 410065 428250 292130 291731 201716 34050
19889 34050 20288 105668 71538 -60098 83252 223648 342832 259276 71151 -34626
19879 -34626 -89052 -37449 2310 156801 220610 143105 204634 -10642 -177970 28324 16803
19868A6803k563O1336q4165j52781N3828O7247J61512P3806q2368j2753q379K6166
19856A17689l7822j00786j24805n1291J21866L8110P0267r5055k5002K22338R5550
19845B31059n3886j51338J70165J52753J41234q8321r3536j39237O1031J75219
19835D05143q1262k14965l3593j55747r8739J96559J97437j59633j6299K87164
19825C26065J40201m2078k11644k8113R1818q4143k1528n2203J35101n3036l25308
19814a24868n3309j57084N7397N1583m8146K01988R1557Q1550J5304n0951J48218
19803B13239k5348J51085M2465m7452p1645j40109L8577P0032L8444Q5301k3185
19792C31404j48724K09488P746L381L5101J05411J90830K00027K20762O6392q
$$ plain form
19868 16803 14240 75576 -8589 -161370 -107542 -40295 121217 195023 112655 99902 91523 117689
19856 117689 79867 -20919 -145724 -197015 -75149 -37039 33228 -61827 -86829 135509 231059
19845 231059 177173 25835 196000 348753 489987 401666 308130 168893 229924 405143
19835 405143 323881 108916 75323 -80424 -179163 17396 214833 55200 38901 326065
19825 326065 466266 424188 212544 184431 276249 192106 170578 118375 253476 200440 -124868
19814 -124868 -178177 -335261 -277864 -226281 -274427 -72439 19118 100668 115972 65021 213239
19803 213239 187891 338976 381441 333989 262344 122235 160812 230844 269288 354589 331404
19792 331404 182680 392168 399914 403295 438396 543807 734637 934664 1155426 1221818 1221810
19781A221810K2719n9439j43786j86215j95953q6719J41857K45473o2815L8952
19771I35884k9415j5927k410M4873q3884j77030k61464j73353P9307J220O5149
19760C82950J8618L7371j92699n3004J48535R6852k1081J20719J52669J89415
19750H80345J86620k27506l36012j40522J85356J02678J36028q5511j1979J68546
19740H58043O6238R0030P8733j16743j22358l649R1272k19364j51254p4275j74550
19729C22123q8203J68247k929j93289m6361R6180K94718J00889J70403J54649
19719I76427K549M9089k0268k26475J55013K6557k62420l63490N9305J34119Q4284
19708F14690k262l3701j08610j76564M6760K6078o7484j51778J86913M8331q7838
$$ plain form
19781 1221810 1244529 1185090 1041304 855089 659136 572417 714274 959747 896932 935884
19771 935884 906469 890542 888132 933005 849121 672091 410627 237274 316581 317801 382950
19760 382950 401568 438939 246240 193236 341771 438623 417542 538261 690930 880345
19750 880345 1066965 839459 503447 362925 548281 650959 786987 701476 689497 858043
19740 858043 924281 1014311 1093044 976301 853943 850294 941566 722202 570948 496673 322123
19729 322123 233920 402167 399238 205949 159588 255768 550486 651375 821778 976427
19719 976427 978976 1028065 1007797 781322 936335 962892 700472 336982 396287 530406 614690
19708 614690 612428 578727 470117 293553 340313 366391 298907 147129 334042 382373 294535
19697B94535r2058O5391p8434k21717K04345J46425o053l3843j3840p0087j40385
19686E4279J34607K32697l49219p4583K23721J27952j5787K02510J21626j83763
19676D74040J30536N5684l701O7613K37901p6821j68414O2621j42733j10674n1961
19665D74091J31001O9923p4987j00506J7321P7004l4340r0959n9586j8507j50867
19654B39588J26794j46223r283K6343j6808N058L4245J03337L29732k12551k15413
19643B64819j39024k0886Q2153J7881p3042J27189L08611j3140k1559j04505K19388
19632F47885Q1442J2741J27657K7248l5993J0865l00855q2455l6947j29053r5132
19621B27403N9960K58460j256k04543P6908J44492K2332j40800j29377q8460J27656
$$ plain form
19697 294535 202477 267868 189434 -32283 172062 318487 312434 278591 264751 194664 54279
19686 54279 188886 421583 72364 -2219 221502 349454 333667 536177 657803 474040
19676 474040 604576 660260 656559 724172 962073 885252 716838 779459 636726 526052 474091
19665 474091 605092 675015 600028 499522 516843 593847 559507 468548 408962 390455 239588
19654 239588 366382 220159 210876 237219 220411 225469 259714 363051 692783 480232 264819
19643 264819 125795 104909 187062 204943 131901 259090 567701 554561 533002 428497 647885
19632 647885 729327 742068 869725 896973 860980 871845 570990 488535 451588 322535 227403
19621 227403 287363 545823 544567 340024 416932 561424 583756 442956 313579 225119 352775
19610C52775K48023J48660p1406l0946j29454r721o4085j60393N0043K4438N1048
19599D08982p9958R9463J30660J03238j35218p8479n3395J36418M7168p940l9020
19588E31919O4504P1391P1586j19899q7796O7174j22378p2214Q9619J37160L6129
19577F67195K58595J38388K331j06031j87744J12796K24137J6399L1586R5552
19567A253204J50340L27978j16893r8271j58857L45033J49711O1749J3840J65642
19557B093476P8113J10819J20942K6706J3914j1440o9876l77473j73265j10616
19547A701300l5151j62569K3876L86916L6770J35462n9701k4261n6066r8959j48392
19536A699225k7232j0714n7579j09258j58042j29854J8820K8108q8229m5119K4185
$$ plain form
19610 352775 600798 749458 678052 647106 517652 507931 443846 283453 333496 357934 408982
19599 408982 329024 428487 559147 662385 527167 448688 395293 531711 578879 570939 531919
19588 531919 596423 667814 739400 619501 531705 598879 476501 404287 493906 631066 667195
19577 667195 925790 1064178 1066509 960478 772734 885530 1109667 1126066 1157652 1253204
19567 1253204 1403544 1731522 1614629 1516358 1357501 1702534 1852245 1913994 1927834 2093476
19557 2093476 2171589 2282408 2403350 2430056 2443970 2432530 2362654 1985181 1811916 1701300
19547 1701300 1666149 1503580 1527456 1914372 1951142 2086604 2026903 2002642 1946576 1847617 1699225
19536 1699225 1671993 1661279 1603700 1494442 1336400 1206546 1225366 1253474 1165245 1120126 1144311
19525A144311M786R2241P4633L34273K21005J22167q9610J91210J07327M84072
19515B686415K6736q0414j29539k9644p7568P8302M08557K72723K21864J56641
19505C534073J3962j2256m8469n67703n84640l90158R4223P5150N8560N291j93755
19494A984278j43900p0795j33984j68922O1733j96972j95252j89309k11701o6098
19484F69078K12469K66649J16042J53617K483K13614P2340J32421J60453k43344
19474A755822j6442M48866Q1237L9033K55981M37235L36914k14611n31856k51436
19464B340743l07334k29049k11335k7749R8002k0105J02534L11690r771j92246
19454A855380l43182l15649l46687j9073m725R484J09617k95220k44137n3031
$$ plain form
19525 1144311 1149097 1241338 1315971 1650244 1871249 1993416 1903806 2095016 2202343 2686415
19515 2686415 2713151 2632737 2503198 2473554 2395986 2474288 2882845 3155568 3377432 3534073
19505 3534073 3548035 3535779 3487310 2919607 2334967 1944809 2039032 2114182 2172742 2178033 1984278
19494 1984278 1840378 1769583 1635599 1466677 1528410 1331438 1136186 946877 735176 669078
19484 669078 881547 1148196 1264238 1417855 1420338 1633952 1706292 1838713 1999166 1755822
19474 1755822 1739380 2188246 2269483 2308516 2564497 3001732 3338646 3124035 2592179 2340743
19464 2340743 2033409 1804360 1593025 1565276 1663278 1643173 1745707 2057397 2047626 1855380
19454 1855380 1512198 1196549 849862 830789 826064 835548 945165 649945 405808 352777
19444C52777J01224K13566M454m3159l7710j04661j18535K7509l6460J88132P6976
19433F24113l3170J05071J40771L38776M8018p915K69923N3427J63327m7071m9459
19422A605811j44074k11856k17057Q7982L4899J03243K05122J39712j98547k65797
19412A139438L4050N242k4279J04716P792l2635j53339r5020J714j15235Q6723
19401I59167J56302j04324j63275j37111j85028J42015J75888M040j90959j56713
19391E00002M6059N3658j71296o1065Q1737j9088j66843n510N7957L3078r6342
19380B52347o2534J27059R0474J6819j11100R5823J92621q8447M8507k10085k17435
19369A34049J02819L84151P3347j01648L0559j63950q0215K11103J9204J18509
$$ plain form
19444 352777 454001 667567 672021 628862 591152 486491 367956 395465 359005 547137 624113
19433 624113 590943 696014 836785 1175561 1223579 1215664 1485587 1539014 1702341 1655270 1605811
19422 1605811 1461737 1249881 1032824 1120806 1155705 1258948 1464070 1603782 1405235 1139438
19412 1139438 1173488 1178730 1154451 1259167 1266959 1234324 1080985 985965 987679 872444 959167
19401 959167 1115469 1011145 847870 710759 525731 667746 843634 847674 656715 500002
19391 500002 546061 599719 428423 367358 449095 430007 263164 257654 315611 348689 252347
19380 252347 189813 316872 407346 424165 313065 408888 601509 513062 561569 351484 134049
19369 134049 236868 621019 694366 592718 623277 459327 379112 590215 609419 727928
19359G27928J91348o2042l6077m1336k4750n0435P3313k1488o7784K65179M9878
19348A003734j91013j72559m3948J33223L2723j7903j34537R2129k23485N396
19338D83760J57519j39465j07240N3682l5292j45726M7330j1591N0245j9037j05073
19327B29112j1266N0125j06193R9428J40687J83861j99283o6953J45366k1526
19317D43358n2486j18164n9297K69912J31384j70233j26602K1108N1513M7269
19307D37762M2210j54810J08252K86589m534k54679j2717p6025o9979P8119R7553
19296D77741K6371n4290j20320J09531N6971l2102k28186j6029l1518M0347J17442
19285C45958O641J07183J68112Q2431p9866n7807k6637N7735J59264m9655j54649
$$ plain form
19359 727928 919276 857234 821157 779821 755071 704636 777949 756461 688677 953856 1003734
19348 1003734 812721 640162 596214 729437 762160 744257 609720 701849 478364 483760
19338 483760 641279 501814 394574 448256 412964 267238 314568 302977 353222 334185 229112
19327 229112 217846 267971 161778 261206 401893 585754 386471 319518 464884 443358
19317 443358 390872 272708 213411 483323 614707 444474 317872 338980 390493 437762
19307 437762 479972 325162 433414 720003 715469 460790 448073 372048 302069 380188 477741
19296 477741 504112 449822 329502 439033 496004 463902 235716 219687 188169 228516 345958
19285 345958 352599 459782 627894 710325 630459 572652 546015 603750 763014 713359 558710
19274E58710l0820q9429k4555J30880k37444j22430J44371m7722k8695l3345O2162
19263B81683J74747K43764j68131L8040m266O8912k19874p4432J39926L02619
19253G82988l0081k24421k56658O4309K62883N1708l06375O3204j4019J00738
19243D94276J20414j43601j38491J15816Q7868k8367j25371p8665J16486J18874
19233E39239P4612J56284o1927k29214m8769L17761j5401j66406r6987o3215J49939
19222E55916M323q9383j7149J16998K1744p9867j11950J4638K23297O5256N898
19211G09721m6981p000n3980j46113P6872l6905n7979L3263J07226n4150N5459
19200E79433p0523J25870N213Q0728L3411O7975k1833R644L0170R249R932p1860
$$ plain form
19274 558710 527890 438461 413906 544786 307342 184912 329283 281561 252866 219521 281683
19263 281683 456430 700194 532063 570103 565837 634749 414875 340443 480369 782988
19253 782988 752907 528486 271828 336137 599020 650728 344353 407557 393538 494276
19243 494276 614690 471089 332598 448414 536282 507915 382544 303879 420365 539239
19233 539239 613851 770135 708208 478994 430225 747986 732585 566179 469192 405977 555916
19222 555916 560239 470856 453707 570705 592449 512582 400632 415270 638567 703823 709721
19211 709721 662740 655740 601760 455647 532519 495614 437635 470898 578124 523974 579433
19200 579433 508910 634780 639993 720721 754132 822107 800274 809918 840088 849337 859269 787409
19188G87409j2238P4452m7278k06993j35418M0629J52815o0247Q4906K13883M5177
19177I37097k7929p9196j18473k5402m7829P2318Q9689J2671p3634Q6533L66671
19166A192516L10493m2176l70915k4002J36100J13549J60500R9392r5798j8583
19156A461076J79535r8626k14456j44159K33113J72992q5517j03325M5402M3153
19146A489188J55058j39785l1980j0139Q2200R8572R2717M4090J02137r9427M5175
19135A827806M6599M5465P1122J33976o2468j8197J17859J50354k00366l1052
19125B081098N4703k8603J19518L18471q1863j21484p7284N2229Q7604J70641
19115B575030J95629Q7198m3239l9018L1715L11644N60583M76471P70409O81551
$$ plain form
19188 787409 775171 849623 802345 595352 459934 500563 653378 593131 678037 891920 937097
19177 937097 909168 829972 711499 686097 638268 710586 800275 812946 739312 825845 1192516
19166 1192516 1503009 1460833 1089918 1065916 1202016 1315565 1476065 1575457 1479659 1461076
19156 1461076 1640611 1541985 1327529 1183370 1416483 1589475 1503958 1400633 1446035 1489188
19146 1489188 1644246 1504461 1472481 1462342 1544542 1643114 1735831 1779921 1882058 1782631 1827806
19135 1827806 1874405 1919870 1990992 2124968 2062500 2044303 2162162 2312516 2112150 2081098
19125 2081098 2135801 2107198 2226716 2545187 2463324 2341840 2264556 2316785 2404389 2575030
19115 2575030 2770659 2857857 2814618 2775600 2807315 3118959 3679542 4156013 4926422 5607973
19105E607973O68090O37392K26733j0082J02966k45257L6357L3730N88172O57476
19095H303550N88412J126786J599893J957426K561407K403805J629024k02092
19087A9968211k032358k344729j194164o75604M2953L79808Q36999J624503K053718
19078A8659337K333355K535910K746785K363114K754354M399345O119568Q772215
19070E0683983J3476124J9112920K2987359K0814447J2039966k809304k1471497
19063A14833998k6987225j7414292p685034p60513N623459J0781090J4340024
19056I2731507J5990532J5234130J0571528R342602J2038378Q562177n156618
19049A59314236k3852867k9012998j9238712r828847l922321o80138N26792O75540
$$ plain form
19105 5607973 6276063 6913455 7140188 7130106 7233072 6987815 7024172 7057902 7646074 8303550
19095 8303550 8891962 10018748 11618641 13576067 16137474 18541279 20170303 19968211
19087 19968211 17935853 15591124 14396960 13721356 13764309 14144117 14981116 16605619 18659337
19078 18659337 20992692 23528602 26275387 28638501 31392855 35792200 41911768 50683983
19070 50683983 64160107 83273027 106260386 127074833 139114799 136305495 114833998
19063 114833998 87846773 70432481 62747447 61986934 67610393 78391483 92731507
19056 92731507 108722039 123956169 134527697 143870299 155908677 164470854 159314236
19049 159314236 135461369 106448371 87209659 77380812 73458491 72778353 73305145 73980685
19041G3980685M58071K792830P454965J1704807J3585578J2170247P295279K839889
19033A32282351J918418K558383Q202465J6161649J8237236J1370708N78379j3773231
19025A77536358k8449561k7794291j6344497n566985J397541M695847M315958
19018A09790370N21695n410618p272202k333961M342051Q562102R398642O135177
19010A23733256j485973l846505K208630J0597376J7810040J8114747R059279
19003A76190850j1457051l0270570k5869396j3117622n750998l940258o285467
18996G9499488r260537p722650n805731o077460n726399m256773k494319j558104
18988C6597515q13919o94784n28632n89225j421270k844751k936377k029340j513984
$$ plain form
19041 73980685 74438756 77231586 84686551 96391358 109976936 122147183 129442462 132282351
19033 132282351 134200769 136759152 144961617 161123266 179360502 190731210 191309589 177536358
19025 177536358 149086797 121292506 104948009 99381024 100778565 105474412 109790370
19018 109790370 110312065 104901447 97629245 95295284 99637335 108199437 117598079 123733256
19010 123733256 122247283 118400778 120609408 131206784 149016824 167131571 176190850
19003 176190850 164733799 134463229 108593833 95476211 89725213 85784955 79499488
18996 79499488 70238951 62516301 56710570 50633110 44906711 40649938 38155619 36597515
18988 36597515 35783596 35088812 34560180 33970955 32549685 29704934 26768557 24739217 23225233
18979B3225233j140464m06427O98387Q89537N02648l63889j709628k802264k762571
18970A6130562j971532j153852k07117J43357M98599M44239o43043j267874j337290
18961A0636049q74701o85002q04552r39372l20217o9870p724M7704k07565l83760
18951F390990n72642m31543l87147k09037k25958k73889j20555M8071l71345l08625
18941C538320O5463r2850L8548N9872Q6479j00299M2061j50627J86294m1928j35613
18930C495720j95823m51009q7437j32794p5573j13061Q129R6411K09845J08985
18920B863393J29757J89159p6528j58703k47231l53404k77495k18429P6980J48735
18910B076234L9121j32076J26259J58915L14622M92509R8080j16695k42936l32027
$$ plain form
18979 23225233 22084769 21678342 22376729 23266266 23768914 23405025 21695397 18893133 16130562
18970 16130562 14159030 13005178 12798061 12941418 13440017 13884256 13241213 11973339 10636049
18961 10636049 9761348 9076346 8271794 7332422 7012205 6942335 6934611 6982315 6774750 6390990
18951 6390990 5818348 5386805 4999658 4790621 4564663 4290774 4170219 4218290 3846945 3538320
18941 3538320 3603783 3510933 3549481 3609353 3695832 3595533 3637594 3486967 3673261 3631333 3495720
18930 3495720 3299897 2848888 2761451 2628657 2553084 2440023 2448152 2544563 2754408 2863393
18920 2863393 2993150 3182309 3105781 2947078 2699847 2346443 2068948 1850519 1927499 2076234
18910 2076234 2115355 1983279 2109538 2268453 2583075 3075584 3173664 3056969 2814033 2482006
18900B482006j70386k44282k83360k0533N139L9198O4562K91837K31705O102j99816
18889B202172j72607J43824j27566k72934j942O3809K97118K03936J33815J47467
18879B617092k70477j01364o0923j84577J4402J10951k28158j70677k17530l0525
18869A478214J73208K9078P4050k27977k67963K9020k3969J35208K60175M5024
18859A704068M258j65116k11400k50959k03595N594J49391K07410K00973O2333
18849A502957J3117J90492N4856R4366N6661L6203R756k8873m3360J22245j26784
18838A881636O3123k26108j04822P192J22248J03015J41634Q9556K16188J86880
18828B480542j24378k77127j52055k75269r5945L2234K26175L49194L73983J33521
$$ plain form
18900 2482006 2311620 2067338 1783978 1763445 1768584 1807782 1872344 2164181 2395886 2401988 2202172
18889 2202172 2029565 2173389 2045823 1772889 1770947 1834756 2131874 2335810 2469625 2617092
18879 2617092 2346615 2245251 2184328 1999751 2014153 2125104 1896946 1726269 1508739 1478214
18869 1478214 1651422 1680500 1754550 1526573 1258610 1287630 1263661 1398869 1659044 1704068
18859 1704068 1708326 1543210 1331810 1080851 877256 882850 1032241 1239651 1440624 1502957
18849 1502957 1516074 1706566 1761422 1855788 1912449 1948652 1958408 1929535 1886175 2008420 1881636
18838 1881636 1944759 1718651 1613829 1621021 1743269 1846284 1987918 2077474 2293662 2480542
18828 2480542 2356164 2079037 1926982 1651713 1555768 1588002 1814177 2163371 2537354 2670875
18818B670875K21565j28643k90384l26160K769j20112k56187J98547P22880N04277
18808C199427J76037K5753l09133k66293k73207l15428j66853j18922O9660q5572
18798A935469j92813K78789K04366J49817L18732m3044l08166l16750k43779k55834
18788A526787j66183J42589M69769M32804J88097K03801K50881K35355l31516
18779B952384k88509K08660K46871K44113M49431L43506M40386L96694j58442
18770D835094k0608K51358K28741K30329k22510j75494o55330o22899l22069j26323
18760C400289Q7468L21450L45900J76752L978m99385r81186o18704l13795Q8679
18750B011446J28969j86831j45943J23491j5516j45558K6470k190j33071q0252
$$ plain form
18818 2670875 2892440 2763797 2473413 2147253 2150022 2029910 1773723 1972270 2695150 3199427
18808 3199427 3375464 3401217 3092084 2825791 2552584 2237156 2070303 1951381 2021041 1935469
18798 1935469 1742656 2021445 2225811 2375628 2694360 2651316 2343150 2026400 1782621 1526787
18788 1526787 1360604 1503193 1972962 2405766 2593863 2797664 3048545 3283900 2952384
18779 2952384 2663875 2872535 3119406 3363519 3812950 4156456 4596842 4993536 4835094
18770 4835094 4814486 5065844 5294585 5524914 5302404 5126910 4471580 3848681 3526612 3400289
18760 3400289 3487757 3809207 4155107 4331859 4335837 3836452 2855266 2236562 1922767 2011446
18750 2011446 2140415 1953584 1807641 1931132 1915616 1770058 1796528 1794338 1661267 1581015
18740A581015j8141j26000k4091J56727K84074K42949L78506M24833K06151J08221
18730C214244K19790j16964n68605n40914n3154M96780M78480L62488M13364L01856
18720D207365l9610l08272n19882k57820l32389j52500j90643l9760O6548J03114
18710B536151J28920N2530q3139k27668j07909j87299J56161J67434J13156O9436
18700B617773k78k68952k2721K24262o6510l47462j85145k6766J62840o1814r051
18689B016176o2109L6172m9969j61372K1933n0998J06105j26156L6780N4289j35841
18678A685010J02332P2104L6776N5885K35538M87527N83612L68597P2549N03179
18668D203109K71190j01698m3339m1123p17485n98610j43715J36497M528J9124
$$ plain form
18740 1581015 1562874 1436874 1412783 1569510 1853584 2096533 2475039 2899872 3106023 3214244
18730 3214244 3434034 3317070 2748465 2207551 2154397 2651177 3129657 3492145 3905509 4207365
18720 4207365 4167755 3859483 3339601 3081781 2749392 2596892 2406249 2366489 2433037 2536151
18710 2536151 2665071 2717601 2634462 2406794 2298885 2111586 2267747 2435181 2548337 2617773
18700 2617773 2617495 2348543 2325822 2550084 2483574 2136112 1950967 1924201 2087041 2025227 2016176
18689 2016176 1954067 1990239 1940270 1778898 1800831 1749833 1855938 1729782 1766562 1820851 1685010
18678 1685010 1787342 1859446 1896222 1952107 2187645 2675172 3258784 3627381 3699930 4203109
18668 4203109 4474299 4372601 4329262 4288139 3570654 2972044 2828329 2964826 2969354 2988478
18658B988478j08532j81887j57677m41p3901J10645Q4381J90270O4724k98110
18648B617950l114R1892Q2603K10191K69187R4762J6552k07655N9100j91224l70048
18637B670196O9381J5384K5574J93956L06882L89683M74038L41235K8304j62530
18627D352103l58690k26542j35543o9805J39523Q4087q7919k34287p1738R5210
18617C486399k9512k67375R8023k9628j685L3466k32974k7012j90786r8083M9611
18606B790444J82J69144R4915K20867J9457k3098O1671j6255K9040K5769Q7971
18595C460107J80084K83591J88983J1758p021J73822J08447K25238N82853J134618
18585F342480J031265O90492k9444p73329q75208l11688j27389J47044M54656
$$ plain form
18658 2988478 2879946 2698059 2540382 2539941 2466040 2576685 2661066 2851336 2916060 2617950
18648 2617950 2614836 2706728 2789331 2999522 3268709 3363471 3380023 3172368 3231468 3040244 2670196
18637 2670196 2739577 2754961 2780535 2974491 3281373 3671056 4145094 4486329 4514633 4352103
18627 4352103 3993413 3766871 3631328 3561523 3701046 3785133 3697214 3462927 3391189 3486399
18617 3486399 3456887 3189512 3287535 3257907 3256222 3289688 3056714 3029702 2838916 2740833 2790444
18606 2790444 2790626 2959770 3054685 3275552 3295009 3271911 3333582 3317327 3346367 3372136 3460107
18595 3460107 3640191 3923782 4112765 4124523 4117502 4291324 4399771 4625009 5207862 6342480
18585 6342480 7373745 8064237 8034793 7261464 6386256 6074568 5947179 6094223 6548879
18576F548879P38314O25838O72068N74474O77968M41513O43211J268192K275026
18567A4465483L324697M739897N665319N577636M964773K086792j267652l010394
18559C6546551m382623m074897k079363l39372J563409L528639N438993O128631
18551D2329968N755654M346357R44732Q97429N142664J0100305J3817559J7744386
18543A01079054K2284095L1114649M9702444O8935824P2338921N3833971J272367
18536D00561325p2848886r0685291n8380483l0212552j2822176n37915R188686
18529A44262708J6782257K2992555K7297804K7285701K7881587L4486118L4612531
18522C35601261J8293062q310604l1594957m7316719n1037035l9986066k4405098
$$ plain form
18576 6548879 7287193 7913031 8585099 9159573 9837541 10279054 10922265 12190457 14465483
18567 14465483 17790180 22530077 28195396 33773032 38737805 40824597 39556945 36546551
18559 36546551 32163928 28089031 26009668 25670296 27233705 30762344 36201337 42329968
18551 42329968 48085622 52431979 53376711 54274140 59416804 69517109 83334668 101079054
18543 101079054 123363149 154477798 204180242 273116066 345454987 399288958 400561325
18536 400561325 327712439 237027148 178646665 148434113 135611937 135074022 144262708
18529 144262708 161044965 184037520 211335324 238621025 266502612 300988730 335601261
18522 335601261 353894323 345583719 313988762 266672043 215635008 175648942 151243844
18515A51243844j1928432k532629M346034R557175J2503478J2712301J1323397
18508A87225168O536224j734939n755859o27880R608373J5303740J2827705J866262
18500B25248794j1074699j2553496P6500J3546343J8553234J1756109o952546
18493B38600239k5739037l4144573k9739162j9103793j2451533r494007p981170
18486I9946964p103200m466384p00137J583249J994581P09213l010643o611519
18478H2342124n632120k086286Q72803K763418L194019K257158j985644n543386
18470G6182086l967005k335897j955466k673604l917514m420585m258870l299346
18462D9353799k192363j930285k497334k183227j072578l60710P1924J33505L09306
$$ plain form
18515 151243844 139315412 136782783 141128817 150685992 163189470 175901771 187225168
18508 187225168 193761392 192026453 186270594 185642714 195251087 210554827 223382532 225248794
18500 225248794 214174095 201620599 201697099 215243442 233796676 245552785 238600239
18493 238600239 212861202 178716629 148977467 129873674 117422141 107928134 99946964
18486 99946964 92843764 88377380 87677243 89260492 91255073 91964286 88953643 82342124
18478 82342124 76710004 74623718 75496521 78259939 81453958 83711116 81725472 76182086
18470 76182086 72215081 69879184 67923718 65250114 61332600 56912015 52653145 49353799
18462 49353799 47161436 45231151 42733817 40550590 39478012 39117302 39189226 39322731 39632037
18453C9632037J28802J22619M77032N74762L42333J539312L479037N989169R605247
18444F1890350J5800829K7264770M7530275P7186584J04131889J06144975Q2271933
18437E22221605R139316j22217540j44463288q1789056m3408410k6407706j7865611
18430I5209310j2566551q955245o410364m318317k625675j349692k74113N3660
18422E8763013j157785l754331n210948m427090l428882k642580k240237j950706
18414C3950454j902839j665720j764014j768381j621755j953667j679375j149170
18406B0445533r37918j044976j211992j275459r24315p52784p55708m00283m30523
18397A2711575p61281o24207m33703o11522n58548l57418m65873l56829l63189
$$ plain form
18453 39632037 39760839 39883458 40360490 40935252 41277585 42816897 46295934 52285103 61890350
18444 61890350 77691179 104955949 152486224 229672808 333804697 439949672 522221605
18437 522221605 531360921 409143381 264680093 182891037 139482627 113074921 95209310
18430 95209310 82642759 73687514 67277150 62958833 60333158 58983466 58709353 58763013
18422 58763013 57605228 53850897 48639949 44212859 40783977 38141397 35901160 33950454
18414 33950454 32047615 30381895 28617881 26849500 25227745 23274078 21594703 20445533
18406 20445533 19507615 18462639 17250647 15975188 15050873 14298089 13542381 13142098 12711575
18397 12711575 11950294 11326087 10892384 10280862 9722314 9364896 8899023 8542194 8179005
18388H179005l76705l87626k46589k30819o4042j21650l14386k11201l74074k82433
18378E569480r4132k75420j43197j27719l95981p977O8669k2142o6905j22985
18368D381691n7845J15200M5362o4915j48330j58134r2857l4789J7121j19682
18358C882822N3649R2902O5817j26753p3012k45715k37405M4885R0410Q467J27845
18347C683912j19713k51046l94663l132p3805k02530j3974J73546J33698R5719
18337C028012l9337J5014J31936J5721k48602j32201l0314j05690l7271j07266
18327B490002j16451J06135K30978J83059r597j86371K6404l0021p1998k22648
18317B399492k25462J92874J84922K61300R7166r3579l45708m74411M0364P5691
$$ plain form
18388 8179005 7802300 7414674 7168085 6937266 6873224 6751574 6437188 6225987 5851913 5569480
18378 5569480 5475348 5199928 5056731 4929012 4533031 4525054 4593723 4571581 4504676 4381691
18368 4381691 4323846 4439046 4484408 4419493 4271163 4113029 4020172 3985383 4002504 3882822
18358 3882822 3936471 4029373 4095190 3968437 3895425 3649710 3412305 3457190 3547600 3556067 3683912
18347 3683912 3564199 3313153 2918490 2915358 2841553 2639023 2625049 2798595 2932293 3028012
18337 3028012 2988675 3003689 3135625 3151346 2902744 2770543 2740229 2634539 2597268 2490002
18327 2490002 2373551 2479686 2710664 2893723 2884126 2697755 2724159 2694138 2622140 2399492
18317 2399492 2174030 2366904 2551826 2813126 2910292 2816713 2471005 1996594 2036958 2112649
18307B112649r1937m881j4687j0646n9920R1176J64606k29712k47899R7635q7760
18296A718624l00412j83495j36099q416J66442J04873N57Q1333Q7401J61543l189
18285A689162o4983L2058M8657J15778K4989j6689O9323Q8533J6346j10295j90352
18274A702527p3422m4130q8094L86535K44286j53674j38473N482K3228J78339
18264B042604L96963N32805O59792P58737J261760K557481M329995O086193P102310
18255B5728640O345639L814990k363506q331555p662253m669582k833088j773383
18247H255902j265024q27502o01157m21942k23371j89530R0493J38316J02172
18238E058357k45222j14209m2604R8387j09112P09530J331383J706922J619609
$$ plain form
18307 2112649 2020712 2015831 2001144 1990498 1930578 2021754 2186360 1956648 1708749 1806384 1718624
18296 1718624 1418212 1234717 1098618 1090202 1256644 1361517 1362074 1443407 1530808 1692351 1689162
18285 1689162 1624179 1656237 1704894 1820672 1845661 1828972 1898295 1986828 2003174 1892879 1702527
18274 1702527 1629105 1584975 1496881 1883416 2127702 1974028 1835555 1841037 1864265 2042604
18264 2042604 2439567 2972372 3632164 4390901 5652661 8210142 12540137 18626330 25728640
18255 25728640 32074279 35889269 33525763 25194208 17531955 12862373 10029285 8255902
18247 8255902 6990878 6163376 5562219 5140277 4916906 4727376 4817869 4956185 5058357
18238 5058357 4813135 4698926 4656322 4754709 4645597 5355127 6686510 8393432 10013041
18229A0013041R61760q32073k474826k052138j270972q44209j99803l20812k45257
18220B734711k52260j91368j52130R7267M8965j98894k10310j59325k9784j97756
18210A489116K0158m6286P9491k10368j99959J80470R7437P3850k92912j64006
18200A026991m9965L1666K28662P0862R4527p2009k39570o0681k90135J40483
18190H80831R6466r0161m1935P3287m8816j54125l27554L5923L2727j1770J64808
18179F09681M8459j19951R0683q2288K6203J78877m7818k84012j64396R934j6893
18168B48479Q3250J22264J21109J40955K5537O661L6846M2484J308p707o9028
18157G52158j29194j94231q5524M4763R1570M7268j31760j20331j12303k89J70760
$$ plain form
18229 10013041 10974801 10142728 7667902 5615764 4344792 3500583 3300780 2979968 2734711
18220 2734711 2482451 2291083 2138953 2236220 2285185 2086291 1875981 1716656 1686872 1489116
18210 1489116 1509274 1462988 1542479 1332111 1132152 1312622 1410059 1483909 1190997 1026991
18200 1026991 977026 1008692 1237354 1308216 1402743 1330734 1091164 1030483 740348 880831
18190 880831 977297 887136 845201 918488 869672 715547 387993 423916 456643 444873 609681
18179 609681 658140 538189 628872 546584 572787 751664 703846 419834 255438 265372 248479
18168 248479 331729 453993 575102 716057 741594 748255 785101 827585 828893 821186 752158
18157 752158 622964 428733 343209 387972 479542 526810 395050 274719 162416 162127 332887
18146C32887j40196j17440q734J47770K57529p245P5426l2377J76122k0111O9645
18135G33276M1704m5189p8552m5982Q8075O2876J72757L33965M72158L23876L83737
18124B442701L83561N40617O72964P77568J098422J678784J897615K283542L528074
18115A5303848N792344R762362J6928452L0213038N0669775P1214624P6036222
18108B75920665O2333709J6318999p4138395j01800287o0743633l1847495j8399142
18101F7644421j1563728p784668n922381m190952k963368k162578j448241r81635
18093C0626870m78585o01152j499452k038741k205833k071227j811392j561298
18085A8359190j564682j390019j319058j214264j048137p58873q95694o11096
$$ plain form
18146 332887 192691 75251 66517 214287 471816 464571 539997 507620 683742 663631 733276
18135 733276 774980 729791 651239 605257 693332 756208 928965 1262930 1735088 2058964 2442701
18124 2442701 2826262 3366879 4039843 4817411 5915833 7594617 9492232 11775774 15303848
18115 15303848 21096192 30858554 47787006 78000044 128669819 199884443 275920665
18108 275920665 338254374 354573373 280434978 178634691 117891058 86043563 67644421
18101 67644421 56080693 48296025 42373644 38182692 35219324 33056746 31608505 30626870
18093 30626870 30148285 29547133 28047681 26008940 23803107 21731880 19920488 18359190
18085 18359190 16794508 15404489 14085431 12871167 11823030 11064157 10168463 9557367
18077I557367n52569n85035o22969m34996m56142l76925k79755n24711n99212
18068E125053k15091j2184k14814r9499k6402n2425o9219p4561K9557l28955k56058
18057C805402j64179j92298o2418k2890j53150M36j92777j04161L6688j64068
18047B786585O1353o983j91501j46247J42116L4697o9492o3973m0803j27701j51880
18036B226171n2979k41798j23823j54425J77618J12848N5722M59Q8983J32086
18026B220862n6937l24001k61331K7425J56727m5026L5924K20978K00369J95654
18016B370644R3607l5354k00627j28236r52R7900j06169n3950M0213J4274K1697
18005B113047q8554k24646O3026K74027J70167R4750j95006K1567Q2022L1120
$$ plain form
18077 9557367 9004798 8419763 7796794 7361798 6905656 6528731 6248976 5724265 5125053
18068 5125053 4909962 4897778 4682964 4583465 4557063 4504638 4435419 4360858 4390415 4061460 3805402
18057 3805402 3641223 3448925 3386507 3363617 3210467 3210903 3018126 2913965 2950653 2786585
18047 2786585 2847938 2840955 2649454 2503207 2645323 2680020 2610528 2546555 2505752 2378051 2226171
18036 2226171 2173192 1931394 1807571 1653146 1830764 1943612 1999334 1999793 2088776 2220862
18026 2220862 2163925 1839924 1578593 1606018 1762745 1717719 1753643 1974621 2174990 2370644
18016 2370644 2464251 2428897 2228270 2100034 2099082 2196982 2090813 2036863 2077076 2091350 2113047
18005 2113047 2024493 1799847 1862873 2136900 2307067 2401817 2206811 2228378 2310400 2341520
17995B341520k80147l10219j10673l9640J25102J48607j56339j25840J61097J33322
17985A886790K27724J06842j60602j1658K7947n1041j46050j76067j33179J91615
17975A762321j63466j10188k1712K1472l76028n9014N8846n228M13j92324n4783
17964H60309J79682J25848J40031O3082J71987K03506J48915R8572J49237J10723
17954B251892k63453j88881j2842l34745k77504j51619J04092K91472J72941l11765
17944A279588k29531K13344J93998j67710j3194n3916p9035R8415J13296J20814
17934A476069J06368o7159k30422J4322P4700j47637n2034q8569m7304Q3105M1044
17923A162483k15262k25897j9427J69670j417L7361k00783j87275L3039L4093
$$ plain form
17995 2341520 2061373 1751154 1640481 1600841 1725943 1874550 1718211 1592371 1753468 1886790
17985 1886790 2114514 2221356 2060754 2049096 2077043 2026002 1879952 1703885 1570706 1762321
17975 1762321 1598855 1488667 1466955 1488427 1112399 1053385 1112231 1107003 1107416 915092 860309
17964 860309 1039991 1165839 1305870 1368952 1540939 1744445 1893360 1991932 2141169 2251892
17954 2251892 1988439 1799558 1786716 1451971 1174467 1022848 1126940 1418412 1591353 1279588
17944 1279588 1050057 1263401 1457399 1289689 1276495 1222579 1143544 1241959 1355255 1476069
17934 1476069 1582437 1515278 1284856 1299178 1373878 1226241 1174207 1085638 1038334 1121439 1162483
17923 1162483 947221 721324 701897 871567 870150 907511 706728 519453 552492 586585
17913E86585J91515J19240J74811j19505j2051k0022J3856K3254K725j52413K01064
17902A009059L36270K69185J37484K30213j36679m84117k14841k11819p8041j8616
17892H38098j80383J9625n236j64969q5724R4682J2666R1994K12221k5988k17267
17881E89719o3213n316j15694k761J52085R6863m9127P7395N9660N7949n8535
17870G39025k39354l7075K52349j642J01489n6077R3972k35504l02559j60977
17860A53647J99170K78524j70J5183J13758L2259j70966J4836J10987j8087k6669
17849G02472K17425M33947M12766M09368L47564J65061j54101n30244l40946j63104
17839A500208l29335j18685j52571l8320q0640r5621J0279j868j82848k2511J69510
$$ plain form
17913 586585 778100 897340 1072151 952646 940595 920573 934429 957683 960408 807995 1009059
17902 1009059 1345329 1614514 1751998 1982211 1845532 1361415 1146574 934755 856714 838098
17892 838098 657715 677340 672104 507135 421411 516093 528759 620753 832974 806986 589719
17881 589719 526506 521190 405496 402735 554820 651683 602556 679951 739611 797560 739025
17870 739025 499671 462596 714945 713303 814792 758715 852687 617183 314624 153647
17860 153647 352817 631341 631171 646354 760112 792371 621405 636241 747228 729141 702472
17849 702472 919897 1353844 1766610 2175978 2523542 2688603 2534502 2004258 1663312 1500208
17839 1500208 1170873 1052188 899617 861297 780657 685036 695315 693447 510599 488088 657598
17828F57598K37034j10887k23998m4354o7946J25187Q26Q4977l0017M439O6860
17817F99719j12317j09893K2748j24784n2003J23222J07099O4444J23143J17189
17807H58567j80115k09694K9949r4325j49698J71922J76270j00797j71375j22476
17797B08228m6484R5109J32778L1464P6973N617o2503m6789P4456j49416M7387
17786C66820K1323j6597m7746k53569K5638Q7873k9580q3969K0987L73Q6120J26254
17774C03927q374l5556J16552O5172o2474k2563J7507R652j5769M8936J1L1291
17762D48312K11306j41940j09742r6059j7424j97742j28595J5859m7209J31506
17752F8272J17882Q5213J03195m198l8711n3079n8573J10290J51980k4004Q8172
$$ plain form
17828 657598 894632 783745 559747 515393 447447 572634 573460 658437 628420 632859 699719
17817 699719 587402 477509 500257 375473 323470 446692 553791 618235 741378 858567
17807 858567 678452 468758 498707 404382 254684 426606 602876 502079 330704 208228
17797 208228 161744 256853 389631 421095 498068 503685 441182 394393 468849 319433 366820
17786 366820 388143 371546 323800 70231 95869 183742 154162 70193 91180 91553 177673 303927
17774 303927 295553 259997 376549 441721 379247 356684 374191 383843 368074 417010 417021 448312
17762 448312 659618 517678 407936 311877 294453 96711 -31884 -16025 -63234 68272
17752 68272 186154 271367 374562 370364 331653 278574 220001 330291 482271 458267 546439
17741E46439r7747j11201J39365J38090j06938k45306k08887l9225M5144Q5139
17731A44873j38367j5108L69727P7584n1561j74382R5635P1051o8793N4146n3668
17720C11137j20146J15272J96696R6992o3261j87224n2910n9239j09308J37302
17710B65311J05419M6823r1448n6523J46546j25994k19582K30564J38147j33952
17700C05311j02729J43302j0594M8986R1856K04191j47630m8300M0060j66216
17690C58237j59666p4490Q7915J51464O9472L9462R942k94047q7367N5005l5894
17679A20033J43036J18234M2610K7658n6265l1885j58736m8695j41536l7203o3597
17668h6346J73678J46460J62763O7434L131m7540j88200o2842n3864q2462J41945
$$ plain form
17741 546439 448692 337491 476856 614946 508008 262702 53815 14590 59734 144873
17731 144873 6506 -8602 361125 438709 387148 212766 308401 379452 310659 364805 311137
17720 311137 190991 306263 502959 599951 536690 349466 296556 237317 128009 265311
17710 265311 370730 417553 326105 269582 416128 290134 70552 301116 439263 305311
17700 305311 202582 345884 335290 384276 476132 680323 532693 484393 524453 358237
17690 358237 198571 124081 211996 363460 432932 472394 482336 188289 100922 155927 120033
17679 120033 263069 381303 423913 451571 395306 363421 204685 155990 14454 -22749 -86346
17668 -86346 87332 233792 396555 463989 467120 419580 231380 168538 114674 32212 174157
17657A74157j55382r6325K0251J7543O5979J72556o7258q0124L0410J10398J41592
17646C33797L53q2172L21n1582p1351J85454J21540q52l77262k28717j4226L7208
17634a47489j54538O3956J37535k6483L7242J27104L0008l7172j10945K23946
17624A43164j49365j4078L0096o942j19295p1510M7964P7174J40183M0596N3506
17613A71493l2481J7640j52330j75273m7355J72698n1781P6729J57565Q0250o7359
17602A49796O40q2021J2948j00748p3428O717O4064J08077N9913L6469o4946j81690
17590f4209j13588k2815K03030J69360k5853j66596R7974p1119J85245J91688
17580C83117j2739p122o9768j33711q4293Q9963R3021L4498j59037J24078J05108
$$ plain form
17657 174157 18775 -77550 -57299 -39756 26223 198779 131521 51397 81807 192205 333797
17646 333797 334150 251978 252299 200717 129366 314820 436360 435508 58246 -170471 -184697 -147489
17634 -147489 -302027 -238071 -100536 -127019 -89777 37327 67335 30163 -80782 143164
17624 143164 -6201 -20279 9817 2875 -116420 -187930 -139966 -62792 77391 117987 171493
17613 171493 139012 156652 4322 -170951 -218306 -45608 -97389 -20660 136905 217155 149796
17602 149796 150436 68415 81363 -19385 -92813 -86096 -22032 86045 145958 182427 117481 -64209
17590 -64209 -177797 -200612 2418 171778 145925 -20671 77303 6184 191429 383117
17580 383117 370378 363256 293488 159777 75484 165447 258468 292966 133929 258007 363115
17569C63115j9568k41272k74860n9097K0664J31525J33393j19562j9662J13000
17559B7676R15j46656J0572j02419j1593r7006n1926J29107J45852M6045j9565
17548f8998J69733M3270J72757K2629j63183l1471m0309n0934j34649j8001J66884
17537F7728K73376k616k81057j59706j63105M9968K36677M3231o5179k4698k56739
17526b82120R3197J23299M7205Q2887q518j97332q080K43010J5906j4483k2056
17515G2915k41863J2417K10905K07593j14256k31664J81067o9200N2274J51791
17505B31979K1178j30626k11538j36244P7006K6295j45190J44314J38725J80228
17495A96127L3476n6696j53645k03313R8540J62322r0152j36358q0814J7512J40082
$$ plain form
17569 363115 343547 102275 -172585 -231682 -211018 -79493 53900 -65662 -85324 27676
17559 27676 28591 -118065 -107493 -209912 -221505 -318511 -370437 -241330 -95478 -49433 -68998
17548 -68998 100735 144005 316762 339391 176208 144737 104428 53494 -81155 -99156 67728
17537 67728 341104 338488 57431 -102275 -265380 -215412 21265 64496 -683 -25381 -282120
17526 -282120 -188923 -65624 -18419 64468 55950 -141382 -149462 93548 109454 94971 72915
17515 72915 -168948 -156531 54374 261967 147711 -83953 97114 27914 80188 231979
17505 231979 253157 122531 -89007 -225251 -148245 -121950 -267140 -122826 15899 196127
17495 196127 229603 172907 19262 -184051 -85511 76811 -13341 -149699 -230513 -213001 -72919
17484g2919P4261o70J3078o7633Q811K6515K8403L34384K2297j82483j09592k40006
17472a65554r9261J70542J81376p6196l31967j65911J65103K19084J48216J22405
17462A67837j14570j75300J32368j8843q9290R7442J98745K14721q2214j83775
17452A47121J0104p5300Q888O8610j88822L10028K51487J90705L46505L94933
17442A464259L35767J51900l06170n54151k06612k79066P7041k59364m27916j05560
17432a09872R4709J16604J95226p3812n8234r8598P065P2032K25231J05332o6096
17421D09587q786j15168j26862j05801Q2674n0431O2105K02370J18890o0066o5751
17410C42761M2018j07945j40423r9953l84138q203M3327J619j19359r527J73826
$$ plain form
17484 -72919 1342 672 13750 -53883 -45072 -18557 9846 344230 366527 184044 74452 -165554
17472 -165554 -264815 -94273 87103 10907 -321060 -486971 -321868 -102784 45432 167837
17462 167837 53267 -122033 10335 -8508 -97798 -356 198389 413110 330896 147121
17452 147121 157225 81925 90813 159423 -29399 280629 532116 722821 1069326 1464259
17442 1464259 1800026 1951926 1645756 1091605 884993 605927 682968 423604 -4312 -109872
17432 -109872 -15163 101441 296667 222855 164621 66023 73088 145120 370351 475683 409587
17421 409587 400801 285633 158771 52970 135644 85213 147318 349688 468578 408512 342761
17410 342761 384779 276834 136411 36458 -347680 -355883 -312556 -310937 -430296 -439823 -265997
17399b65997K12818J71877M5634Q0936Q1158J1598J04663j78558k70053L935n1234
17388e3223j34572l2052n3327Q2396k4607j2951J44l5197J32344j71346J49828
17377a52563J0503k5205J75981Q9180J76905M454K6303k176j58417k37762l9792
17366a32589M6167n736J43229M1230J00384K9123j30917j4579p3133p1426o4946
17355a33193O1833K8835J56152k0310r9246r9248K5273k3526j13679q3178K56900
17344d3387K32014j13246J16795M27955N02386M34384O56217Q86862P41170O55877
17334D497027N90867L09735j1528o71088o22659m50420o71481q07102n67007k39924
17324A356420m11510j74582j3577j899N2771j8561l8251R8061j92404l6628N323
$$ plain form
17399 -265997 -53179 118698 164332 245268 326426 338024 442687 264129 -5924 -1989 -53223
17388 -53223 -187795 -219847 -273174 -190778 -215385 -228336 -228192 -263389 -131045 -302391 -152563
17377 -152563 -142060 -167265 8716 97896 274801 279255 305558 303382 144965 -92797 -132589
17366 -132589 -86422 -92158 51071 92301 192685 221808 90891 76312 3179 -68247 -133193
17355 -133193 -71360 -42525 113627 93317 -5929 -105177 -79904 -103430 -217109 -300287 -43387
17344 -43387 188627 75381 192176 620131 1122517 1556901 2213118 3099980 3841150 4497027
17334 4497027 5087894 5397629 5386101 4715013 4092354 3641934 2970453 2163351 1596344 1356420
17324 1356420 944910 770328 756751 754852 807623 789062 750811 848872 656468 619840 625163
17313F25163l6011j73387k91895J0249R9908j77382P8731M194r9155q4116Q2546
17302C8845J13859m9761j79522N4183L83714n4385m0060r5164q1026j00668J07275
17291I7290L7229j13842M4541J59448j00397J45221J15174P9591O0985Q9616m3899
17280E70957k37242k02509l9752K62742j13637j63516n4879J11735r134k6760
17270I8005J21866j1134k79023j29361N1800r1715q9941j38385K66333j960j20853
17259c24368J81069J68731m9656l3684l501J8680J5438N5654m7427K4511K16252
17248B21699L9001n2661k84074J6545m271j55989O3072L9961m6955O45j6619K0882
17236a58764J18372J4082J02889K57822j40488r7487l6315M6229M9434j1691p8865
$$ plain form
17313 625163 589152 415765 123870 134119 234027 56645 135376 139570 40415 -43701 38845
17302 38845 152704 102943 -76579 -22396 361318 306933 266873 171709 90683 -9985 97290
17291 97290 134519 20677 65218 224666 124269 269490 384664 464255 525240 614856 570957
17280 570957 333715 131206 91454 354196 240559 77043 22164 133899 124765 98005
17270 98005 219871 208737 -70286 -199647 -147847 -239562 -329503 -467888 -201555 -203515 -324368
17259 -324368 -143299 25432 -24224 -57908 -61409 -42729 -27291 28363 -19064 5447 221699
17248 221699 260700 208039 -76035 -59490 -63761 -219750 -156678 -116717 -163672 -163027 -179646 -158764
17236 -158764 -40392 -26310 76579 334401 193913 96426 60111 106340 155774 144083 65218
17225F5218J01118Q0664j06191r7719k5593J1436K7726J17550o3109j43639p104
17214c9643P5752j17888J41687K13564j94913k6222R5478m276j15563J05529q0139
17203E3366k3341l9781N050J17424m1826j83973m5999K18156O4023J82161K20585
17192E25845j91828j10499j19438j08997J79380k3543j24460k17141Q1265j38606
17182b48022Q4638J24815n1009j29143n1690R4634j1226m5672r5807K3062J93523
17171a11897k1723k01466j37522J54536J69956m3240K10415R4888o5482m9113
17161f48K17514j02466k37571o8055j06682J7918J23256J65518k2019o5061P0747
17150g549o7143L2990J2554J12774J28713j60714k51220Q3516N8434J27911R7289
$$ plain form
17225 65218 166336 247000 140809 43090 17497 28933 56659 174209 111100 -32539 -39643
17214 -39643 36109 -81779 59908 273472 78559 52337 147815 143539 27976 133505 53366
17203 53366 30025 -9756 -4706 112718 70892 -113081 -159080 59076 123099 305260 525845
17192 525845 334017 223518 104080 -4917 174463 150920 26460 -190681 -109416 -248022
17182 -248022 -163384 -38569 -89578 -218721 -270411 -175777 -187003 -232675 -328482 -305420 -111897
17171 -111897 -133620 -335086 -472608 -318072 -148116 -191356 19059 113947 48465 -648
17161 -648 216866 114400 -123171 -191226 -297908 -279990 -156734 8784 -13235 -78296 -7549
17150 -7549 -74692 -41702 -29148 83626 212339 51625 -199595 -116079 -57645 70266 167555
17139A67555J4217J53407J23448K91139L94960m2813j12513O4238N5887q8316
17129A021209j68243p5172J76759J78158l10971l30887k12327n5587J48067J85433
17119E56439j69927j67730j76029q2748L7992J24892P1176O7283k5233n090M1034
17108B72059L6364J19074O4172k00046m9018J51542j23153m4032r7199j21247
17098H516j11421Q9580J7326q5709K8698r2158J66471P1243q4624J87722J02373
17087B98017J5373q6131q6571j85967k0825p0419Q8121L3314k27347J9357J50514
17076g2564J47860O6239j11016r7148j03371P171J38114n2239K28136l7965k00312
17065h7095N1375K7087J52256K9251k5852r7508j60462m9017J63927r83j1812
$$ plain form
17139 167555 181772 335179 458627 749766 1144726 1101913 989400 1053638 1109525 1021209
17129 1021209 852966 777794 954553 1132711 821740 490853 278526 222939 371006 556439
17119 556439 386512 218782 42753 -39995 -2003 122889 194065 261348 236115 231025 272059
17108 272059 308423 427497 491669 291623 242605 394147 270994 226962 129763 8516
17098 8516 -102905 -13325 4001 -81708 -53010 -145168 21303 92546 7922 195644 298017
17087 298017 313390 227259 140688 -45279 -66104 -136523 -48402 -15088 -242435 -223078 -72564
17076 -72564 75296 141535 30519 -66629 -170000 -162829 -24715 -76954 151182 113217 -87095
17065 -87095 -35720 -8633 143623 172874 147022 49514 -110948 -159965 3962 2979 -8833
17054h833l473L9161N599n0162j42331j04277J76661K57536K5264K69403Q8542
17043E53090k52767j62830p3217p5637K12057N2620k00132j1727L7252m743M7384
17032A21350O90P816J21478m0812r2111k77252K5865K03489M8099n7742n2487
17021H383j21264j12263J0072L12078Q1751j28912N7615l4405j34827j78723q2654
17010c23149K2377J04961J48536L8103o50o9437q807P3440j10630n9166J17670
16999f6752J66079L1370l34759M1820q4933N7784M0893J32984o330K839l7148
16988e6153l8839k361j5781N2819N4131K19155J17062k11945k12926q8141J00369
16977h2610M7062j89834J9225n7907j14112j06435K02924n6542J88728K52576
$$ plain form
17054 -8833 -12306 26855 32454 -17708 -160039 -264316 -87655 169881 195145 464548 553090
17043 553090 300323 137493 64276 -11361 200696 253316 53184 41457 78709 73966 121350
17032 121350 122040 129856 251334 210522 118411 -158841 -132976 70513 118612 60870 8383
17021 8383 -112881 -225144 -215072 97006 178757 49845 107460 73055 -61772 -240495 -323149
17010 -323149 -300772 -195811 -47275 -9172 -9822 -79259 -88066 -14626 -125256 -184422 -66752
16999 -66752 99327 130697 -204062 -162242 -247175 -189391 -148498 -15514 -21844 -19005 -56153
16988 -56153 -94992 -97353 -113134 -60315 -6184 212971 330033 118088 -94838 -182979 -82610
16977 -82610 -35548 -225382 -206157 -264064 -378176 -484611 -281687 -338229 -149501 103075
16967A03075P5545j1595l8106l3053J10450j7339k0160j05166R594M2454r3699
16956B2000N5585j20209N1194R067j89718R2671K37361J02132r8578k12014J40650
16945I0141J73058n5252l50973j26576J45270K71924J18722K0003j8137r0118
16935A78062M257p029k12831l5824J44769J39626j25185p6803j90157K2151j83473
16924c42437P0959J66163q1617O2878N5327k6556J18682J49349k0224j55877q8499
16913i1852k09724m5814K58898J48350l5202j1691k6206R9536n7839o6234N573
16902c2205L5405p8791j27142M4330K0024P9074J32503R1426k89870j18801J52415
16891i1632J24573q5557R7171p7695j417J74810P8107p3378j49031k08743l08848
$$ plain form
16967 103075 178620 167025 128919 95866 206316 188977 168817 63651 73245 115699 22000
16956 22000 77585 -42624 8570 17637 -172081 -79410 157951 260083 161505 -50509 90141
16945 90141 263199 207947 -143026 -269602 -124332 147592 266314 286317 268180 178062
16935 178062 182319 175290 -37541 -73365 71404 211030 85845 9042 -181115 -158964 -342437
16924 -342437 -271478 -105315 -186932 -124054 -68727 -95283 23399 172748 152524 -3353 -91852
16913 -91852 -301576 -347390 -88492 59858 24656 12965 -13241 86295 28456 -37778 -32205
16902 -32205 3200 -75591 -202733 -158403 -138379 -59305 73198 164624 -125246 -244047 -91632
16891 -91632 32941 -52616 44555 -33140 -34557 140253 218360 144982 -4049 -212792 -521640
16880e21640j01170M23847Q4722p105p5002j59550q975J84986J26711k67385k27298
16869e47859J35735o9154l5314k0959M8144J55154J15319K8467j68859M7551L46557
16858C4782J55918j8400k32134j9056L6509k4157M5892m9855j41932P1198q793
16847a50028J15140K03398q491J78565j02774m19080n3619J46906N8839P1004
16837C9860J0789j51543j16878K35285J41144l9223q1025r7239q3388j44700J78273
16826a08645J96960J08726J02048O1347j49401j71623k9080J24204j11856m7101
16816b4421j19735k3880o8603j52796N591J35272J30436K02458j25788J79218
16806A37752J1131n1260j70908n5925O7822Q7643j43446K29769N9896p9284k13594
$$ plain form
16880 -521640 -622810 -198963 -114241 -121346 -196348 -355898 -364873 -179887 -53176 -320561 -547859
16869 -547859 -412124 -481278 -516592 -537551 -489407 -334253 -218934 -190467 -359326 -311775 34782
16858 34782 190700 172300 -59834 -78890 -42381 -66538 -20646 -70501 -212433 -141235 -150028
16847 -150028 -34888 168510 160019 338584 235810 -183270 -236889 -89983 -31144 39860
16837 39860 50649 -100894 -217772 17513 158657 119434 38409 -58830 -142218 -286918 -108645
16826 -108645 88315 197041 299089 360436 211035 39412 10332 134536 22680 -24421
16816 -24421 -144156 -168036 -236639 -389435 -383844 -248572 -118136 84322 -41466 137752
16806 137752 148883 97623 -73285 -129210 -61388 26255 -117191 112578 172474 93190 -120404
16795a20404j22333J35979J86719j13441p7603K44419q93j68419K2189J7653j0193
16784f327j25909o6437Q8868Q3915J1156j43300m1444K208j3775j19451j1886
16773c42382Q9432J26684o2188k06328l7265K70349K63838Q4908J16154l70116
16763f6914k6630j3738L1428R6394P3275j81128p7281K8598K28983p7652R1864
16752A07199o011N4038j67247p9958J79589j19378j70576N6204M8646K57536J44939
16741C04981j32607J1375m1126m5921j1835P352J07594Q0277o1231J51611l837
16730C66633J6504r6299j51843P52m7856p4812k7627K21573q0906k75096O2432
16719h6545J54432J91927N9250k38308j45499j46110p5224k3476J9617Q1264o2417
$$ plain form
16795 -120404 -242737 -106758 79961 -33480 -111083 133336 132443 -35976 -13787 3866 -6327
16784 -6327 -132236 -198673 -109805 -25890 -14734 -158034 -199478 -197270 -211045 -330496 -342382
16773 -342382 -252950 -126266 -188454 -394782 -432047 -161698 102140 187048 303202 -66914
16763 -66914 -93544 -107282 -75854 20540 93815 -87313 -164594 -135996 92987 15335 107199
16752 107199 101188 155226 -12021 -91979 87610 -31768 -202344 -146140 -97494 160042 304981
16741 304981 172374 183749 142623 96702 84867 92219 199813 280090 218859 370470 366633
16730 366633 383137 286838 134995 135747 87891 13079 -14548 207025 126119 -148977 -86545
16719 -86545 67887 259814 319064 80756 -64743 -210853 -286077 -309553 -289936 -208672 -271089
16708b71089J9376r2332Q3580j3154k3510J7402J93344J45746R2621j52652q144
16697h812j14813j5477k02583J9962L43500J71652M136j83306o1556j93799o9957
16686c11053p3317J02728N3720J7099q0614k6133J23434J45700J11818j47497
16676h4115q5770O5706o5618Q4027J18498n544j21993N2058o7023N476j35722
16665b40020k5567J67832J27962j56347k38914r4190J44077Q645j16983L1255
16655c92250k4850J75220K25490j06927J27606k2079k12546k1865K21038J10721
16645G9558m3256j25940j28263Q7820P7080J82907K79913j27837K1297j71219
16635A32060n029j20658l60717J05520K07186N9381R315K9159k1179n6572l8406
$$ plain form
16708 -271089 -251713 -344045 -260465 -273619 -297129 -279727 -86383 59363 151984 -668 -8812
16697 -8812 -123625 -139102 -341685 -321723 21777 193429 197565 14259 -47297 -241096 -311053
16686 -311053 -384370 -281642 -227922 -210823 -291437 -317570 -194136 -48436 63382 -84115
16676 -84115 -169885 -104179 -169797 -85770 32728 27184 -94809 -42751 -109774 -104298 -240020
16665 -240020 -265587 -97755 30207 -126140 -365054 -459244 -315167 -306522 -423505 -392250
16655 -392250 -417100 -241880 -16390 -123317 4289 -17790 -230336 -252201 -31163 79558
16645 79558 36302 -89638 -217901 -130081 -53001 129906 409819 281982 303279 132060
16635 132060 127031 6373 -354344 -248824 -41638 17743 27058 56217 35038 -21534 -59940
16624e9940J16203n1077k596k2818j93846K05433J34101j85530N6678L2424J6277
16613D5309j07052j10122P7616P2578Q328k8592m4511j50764N2438P4335k0951
16602a31388m8287O8157N5117j48642j58134N2931J86637J50741J15068j08217
16592C3983j4040j04682j87053J2170n3238j17823L947K57724m9251n0124K20978
16581d7409R6211J02594n9045j22364O4469n3084j96534j49901Q5119J98506P7508
16570c930K1204q3636l18541k3053J37728p0798o0931O8474Q1914M5773k6647
16559b32443J55834Q0215j07376R6475j61363m5056r874K18500K40964j60613
16549G5263l42548j85686Q8469L63501J49261j09462j67643J1139J75080J24267
$$ plain form
16624 -59940 56263 5186 2590 -20228 -214074 -8641 125460 -60070 -3392 29032 45309
16613 45309 -61743 -171865 -94249 -21671 -13343 -41935 -86446 -237210 -184772 -110437 -131388
16602 -131388 -179675 -111518 -56401 -205043 -363177 -310246 -123609 27132 142200 33983
16592 33983 19943 -84739 -271792 -259622 -312860 -430683 -426736 -169012 -218263 -268387 -47409
16581 -47409 48802 151396 92351 -30013 34456 -18628 -215162 -365063 -279944 -81438 -3930
16570 -3930 17274 -66362 -384903 -407956 -270228 -341026 -401957 -333483 -251569 -205796 -232443
16559 -232443 -76609 3606 -103770 -7295 -168658 -213714 -223588 -5088 235876 75263
16549 75263 -267285 -452971 -364502 -1001 148260 38798 -128845 -117706 57374 181641
16539A81641l24782k6405K16147L1130o2811p2179q6785K2511K7705P9587M9300
16528C5059r9027J133J15301n9218O0102J29744k9781K7383l7352k1029r1487
16517C0828N1040J65054o2172l66832j61191K90147L65530j26028l0332J34022
16507B90066j01866j07315k36620j78254J96475K33000j991J86912O8436k03158
16497A45685n5713j07287j4221N5732L3202k4402j31353o9366q3999o077J46591
16486a11208N8526J57974r2961k38680Q7896J75634M4649l7301j61727L0870K72931
16475A86603o4597k87767k9867K07394J71476k33806Q457J5236j24224j48866
16465b99961N1874J6735j91236k21016K7376J73640J19883O679p8589J85458K17726
$$ plain form
16539 181641 -143141 -169546 46601 77731 14920 -57259 -144044 -121533 -93828 -14241 35059
16528 35059 -63968 -62835 52466 -6752 53350 183094 153313 180696 143344 122315 30828
16517 30828 81868 246922 184750 -182082 -343273 -53126 312404 186376 156044 290066
16507 290066 188200 80885 -155735 -333989 -137514 95486 93495 280407 348843 145685
16497 145685 89972 -17315 -31536 24196 57398 32996 -98357 -167723 -251722 -257799 -111208
16486 -111208 -52682 105292 12331 -226349 -138453 37181 81830 44529 -117198 -86328 186603
16475 186603 122006 -165761 -195628 11766 183242 -50564 -42107 -26871 -151095 -299961
16465 -299961 -248087 -231352 -422588 -643604 -616228 -442588 -322705 -316026 -394615 -209157 8569
16454H569K3791J02664j09624j46516N4898K7774j01562q5894p6459K60842R3921
16443E2404K992r2667k2316J41080j13692k59632J77401K633O3511M1293j4778
16432b1771o7390q6909j56033J29488J6174j37147J60856J78269K68143o8825
16422B14855k69683p9883P7280R5655J34458O7217j05097j76265N5347J89838
16412B03722j00940p4255M3185J62183J50940N876k68201j75325k47874j8595
16402c19284O0698L7434j0334j30933J5121K00200L9694j03323J66623j08692
16392a52796j26762J10381J51192l5582o96j78442o7349j06087q5323l7142J63722
16381c64884K73962J92657j03807j47700j1216L6554O8992k13181o2795Q9134
$$ plain form
16454 8569 32360 135024 25400 -121116 -66218 -38444 -140006 -225900 -302359 -41517 52404
16443 52404 55396 -37271 -59587 81493 -32199 -291831 -114430 -111797 -48286 -6993 -21771
16432 -21771 -89161 -176070 -332103 -202615 -186441 -323588 -162732 15537 283680 214855
16422 214855 -54828 -134711 -57431 38224 172682 239899 134802 -41463 13884 203722
16412 203722 102782 28527 71712 233895 384835 390711 122510 -52815 -300689 -319284
16402 -319284 -258586 -221152 -231486 -362419 -347298 -147098 -107404 -210727 -44104 -152796
16392 -152796 -279558 -169177 -17985 -53567 -54263 -232705 -300054 -406141 -491464 -528606 -364884
16381 -364884 -90922 101735 -2072 -149772 -160988 -124434 -55442 -268623 -331418 -242284
16371b42284Q4389J8619L0021J49J12934K46891K81622o3431j59362j57550l20915
16360a68917j07493N5659J52849M3746p1278j6701P2469J4709j3055n4290j6504
16349a08806N9823N6475n9001Q0097K2809J7340K9685j84994p2432N7114J26240
16338B4350m8940K9149k5768J26798N1768j3428j18956k972J09327J58242l1153
16327B58417k42098k33938k70562J24061N7286J16768P2323N8522n9344J6508
16317a02057L479k51554j22203J17559K98733J12232m1904n0306Q5062R2820k17677
16306g5816q809r7888O4494J27350p5670r8839J5856M4669l4232j32974o9679
16295c41538M6415N4069M8768J5382M2290q4355N5894J18775N996J33075J03001
$$ plain form
16371 -242284 -157895 -139276 -109255 -109106 3828 250719 532341 468910 309548 151998 -168917
16360 -168917 -276410 -220751 -67902 -24156 -95434 -112135 -39666 -24957 -38012 -92302 -108806
16349 -108806 -48983 7492 -51509 28588 51397 68737 98422 -86572 -159004 -101890 24350
16338 24350 -24590 4559 -21209 105589 157357 143929 24973 22001 131328 289570 258417
16327 258417 16319 -217619 -488181 -364120 -306834 -190066 -117743 -59221 -118565 -102057
16317 -102057 -98578 -350132 -472335 -354776 -56043 56189 14285 -36021 49041 141861 -75816
16306 -75816 -84625 -182513 -118019 9331 -66339 -165178 -149322 -104653 -138885 -271859 -341538
16295 -341538 -295123 -241054 -192286 -176904 -134614 -218969 -163075 -44300 -38304 94771 197772
16284A97772L1876j33167j06517o3645j76790j01317J09524L0203j27107j30835
16274d70003J47740K23054J04420N9656j41803p2943N3224j82026r5615J30987
16264b43309K02863k5007m9099j7052K9151P2786r0791q4644J40081K04192p3956
16253F5215j14772N9184O2982O9452k1401o5753q6842q4582N2968o4667N1218
16242g6998N1641L3447R5771j3463j8640j97330l2348J09020J8357m1196R7885
16231B6146L7461L8415J54474k16052k1060j8459J51657J04062p10n5849q7428
16220A12657n9413k07876j40875M49K60439J50485j5895j45410J87787q9682l7879
16209A4787n6785K4798O8481o947j82143o5776J66846J33440o5841r6222L7534
$$ plain form
16284 197772 229648 96481 -10036 -73681 -250471 -351788 -242264 -212061 -339168 -470003
16274 -470003 -322263 -99209 5211 64867 -76936 -149879 -96655 -278681 -374296 -243309
16264 -243309 -40446 -65453 -114552 -131604 -102453 -29667 -120458 -205102 -65021 139171 65215
16253 65215 -49557 9627 72609 142061 120660 54907 -31935 -116517 -63549 -128216 -76998
16242 -76998 -25357 8090 103861 90398 71758 -125572 -157920 -48900 -30543 -71739 26146
16231 26146 63607 102022 256496 40444 19384 925 152582 256644 255934 200085 112657
16220 112657 53244 -154632 -295507 -295058 -34619 115866 99971 -45439 142348 52666 14787
16209 14787 -41998 -17200 51281 44334 -137809 -203585 -36739 96701 30860 -65362 -27828
16198b7828R8659j04635p0244k3081K5362L1428j29865j49353j18755K75791m2699
16187b35220R5306J62807L6120k38181k13393M1811K72208K15975K7565k10794
16177d5796l2691p5348o8846k25348P3774J04745k0415L8803j09328O9029L37014
16166D5593J05630m6072M0812L4148j00423j06328k16001l4831L1862q9108r0643
16155d25361M8663K51193O0518k0884p8282P0695r9499k6608k1685J9560j93334
16144d15024p6335P0821M0011K5149n9858Q292n3424n0456J66806L35538J37177
16133A28697k15124k24103K24686J67716j94929k39016m3939m0810J25385J31659
16123a79778l424j43029O6836P368O4559L03438j20654P5159J1747l1350n0526
$$ plain form
16198 -27828 70831 -33804 -104048 -127129 -101767 -70339 -200204 -349557 -468312 -192521 -235220
16187 -235220 -139914 22893 59013 -179168 -392561 -350750 -78542 137433 164998 -45796
16177 -45796 -78487 -153835 -222681 -448029 -374255 -269510 -289925 -251122 -360450 -291421 45593
16166 45593 151223 105151 145963 180111 79688 -26640 -242641 -277472 -245610 -334718 -425361
16155 -425361 -376698 -125505 -64987 -85871 -164153 -93458 -192957 -219565 -241250 -221690 -415024
16144 -415024 -491359 -420538 -380527 -355378 -415236 -406944 -460368 -510824 -344018 -8480 128697
16133 128697 -86427 -310530 -85844 81872 -113057 -352073 -396012 -436822 -311437 -179778
16123 -179778 -183202 -326231 -259395 -252027 -187468 115970 -4684 70475 82222 50872 346
16112C46j76556P1806J63104J84695j75408k34436Q3153j0636Q1161j46867K7503
16101a32135N2018M8954M2381O3523l8771j6155O5036j70719j51811M0063Q0769
16090a16847L4793j23978J18592K44239L4525r7034l8741j2954p1103m6231j10300
16079a85039m6917k12791r1840J13928l2181j43816K62907K90908O075o5055J2313
16068i1508J4739K2038R6285k03061m2142K53685J7043j29864j29999O0J91064
16057a660J49420o8772n0449j9513k11889j55359P9623O9712O7372P4314N7412
16046i789j03864p9117O1756k6046Q0893p3405p5173J89378O333q9132j36326
16035b54492J66985J64076o2953j22397O1132k41078j27300q823J27582o5801
$$ plain form
16112 346 -176210 -104404 58700 243395 67987 -166449 -83296 -93932 -12771 -159638 -132135
16101 -132135 -80117 -31163 11218 74741 35970 19815 84851 -85868 -237679 -197616 -116847
16090 -116847 -82054 -206032 -87440 156799 191324 94290 55549 42595 -28508 -74739 -185039
16079 -185039 -231956 -444747 -536587 -422659 -454840 -598656 -335749 -44841 -38766 -103821 -91508
16068 -91508 -76769 -54731 41554 -161507 -203649 50036 67079 -62785 -192784 -192724 -1660
16057 -1660 147760 78988 28539 9026 -202863 -358222 -278599 -208887 -141515 -67201 -9789
16046 -9789 -113653 -192770 -131014 -157060 -76167 -149572 -224745 -35367 -29034 -118166 -254492
16035 -254492 -87507 76569 13616 -108781 -47649 -288727 -416027 -424850 -297268 -363069
16025c63069k515K7635J9279P0104J12959j06583n4265J94416R1884j03521p9831
16014a93507J8404j95833l322J91389J27027r944J8662J08906P4150j12620l22374
16003b99062l0607K72587J18816j25484j6468j62975k63247k5206J67641R9275
15993b64730K32899K8501j74701j34055J5954K11840K0321j9433q1j01505j21470
15982c06460K19074K28066M5334Q9984K5574l0798j42494j98856r4257q609j81512
15971c54954Q755Q8498r2952r0978K58724K65782j86948j64757J02227K2026J8208
15960a26369j08636l0039L8790j59419r8355K0608J21391O2200M1052J32451l1891
15949a38217P4631Q3066m6132m0619n5016k07678p1378J17073J14232q1780k0277
$$ plain form
16025 -363069 -365584 -337949 -318670 -248566 -135607 -242190 -296455 -102039 -10155 -113676 -193507
16014 -193507 -175103 -370936 -374258 -182869 -55842 -65786 -47124 61782 135932 23312 -299062
16003 -299062 -329669 -57082 61734 -63750 -80218 -243193 -506440 -531646 -364005 -264730
15993 -264730 -31831 -3330 -178031 -312086 -296132 -84292 -63971 -83404 -83485 -184990 -306460
15982 -306460 -87386 140680 186014 275998 301572 270774 128280 -70576 -164833 -173442 -354954
15971 -354954 -346199 -257701 -350653 -441631 -182907 82875 -104073 -268830 -166603 -144577 -126369
15960 -126369 -235005 -265044 -226254 -385673 -484028 -463420 -342029 -279829 -238777 -106326 -138217
15949 -138217 -63586 19480 -26652 -67271 -122287 -329965 -401343 -284270 -170038 -251818 -272095
15938b72095n9460J7790J7716J47521K7800j11277Q368q3145N3987O7275O0749
15927a24771k23124R8525J98130o0186j31509j73863j03560k88O2207K71722P6769
15916a09948m8318L9148j54203p8577O6588q2226J24677M1140Q0294J72384j03297
15905e2338k17657j8111l8926N6340K20150p2595j04538K27054J06049l0909l4550
15894C9969p2573m0468j64439r9457R2332P6077N3095M7157L0846P2785q7125
15883e1801l1827J97527K17098p3699j08248j78062m8364j18127R7513M2110l0626
15872h6506j60089j09200P4888J24717N3274J30118L9058R2828k03310j0632J07231
15861E2377j53196j13369O8858L8105N4737k43994j14121J12554L5024j11659
$$ plain form
15938 -272095 -331555 -313765 -296049 -148528 -120728 -232005 -223637 -306782 -252795 -185520 -124771
15927 -124771 -347895 -249370 -51240 -111426 -242935 -416798 -520358 -520646 -458439 -186717 -109948
15916 -109948 -158266 -119118 -273321 -351898 -285310 -367536 -242859 -201719 -121425 50959 -52338
15905 -52338 -269995 -288106 -327032 -270692 -50542 -123137 -227675 -621 105428 74519 39969
15894 39969 -32604 -73072 -237511 -336968 -244636 -168559 -115464 -68307 -37461 35324 -51801
15883 -51801 -83628 113899 330997 257298 149050 -29012 -77376 -195503 -97990 -55880 -86506
15872 -86506 -246595 -355795 -280907 -156190 -102916 27202 66260 159088 -44222 -54854 52377
15861 52377 -100819 -214188 -145330 -107225 -52488 -296482 -410603 -298049 -263025 -374684
15851c74684j038N2199j02318j57675J47019K99766J01084j70260k05574r4309
15841e05790k4739Q874M8565n3911N2908K25773K08499K6130j07698l2697R0860
15830f3226R861J95381R0523j70344j63642o3658J22670M2349j65796j958r5146
15819b62986J92646O3489j64935o525j24010k65132M2479j0846K94351K11682
15809b9787R9957J2983J36922p917P2438J18231j31276j15349j58313l91895K26929
15798a67077L49661q2804J39808q3855k45405k39002J4819M9014j10967p2061
15788d47869L11945J63147j0611j49103j1553J82853j3037J87130J26585o3676
15778B75811j87518p408L0560q1734O0713q7824j64943q1573j16173j31334r7679
$$ plain form
15851 -374684 -375722 -323523 -425841 -583516 -436497 -136731 -35647 -205907 -411481 -505790
15841 -505790 -530529 -521655 -473090 -527001 -474093 -248320 -39821 -13691 -121389 -154086 -63226
15830 -63226 -53365 142016 232539 62195 -101447 -165105 -42435 -86 -165882 -167840 -262986
15819 -262986 -70340 -6851 -171786 -178311 -302321 -567453 -524974 -535820 -241469 -29787
15809 -29787 70170 83153 220075 212158 284596 402827 271551 156202 -2111 -394006 -167077
15798 -167077 182584 99780 239588 155733 -89672 -328674 -313855 -264841 -375808 -447869
15788 -447869 -135924 27223 16612 -132491 -144044 38809 25772 212902 339487 275811
15778 275811 88293 80885 111445 29711 90424 2600 -162343 -243916 -360089 -491423 -589102
15767e89102J84872K60298J79045K5937K36472o9601j82424r4800J35512J40564
15757B26773j32411j64519j00041J6141Q8873j1221k76405j22428R539K32497
15747b33202J70948m8315m1801M2825o7572j02458n4277j35407J38237j06811
15737d37833M9992J93996R2195l0487J59411L2573j48041j53713o8383M086q740
15726c14944Q8220K00117J07787J25787N7025n1824l55242k34645o7617J54391
15716b90945K88M8524j52643k8677J91692K26024J20927J13599o0133j79546q1616
15705i2506j01360J08608p2167p2813j6157L01803K8852r5286p570j2428j54961
15694a85985j21228J8417J92811L1610J31463J24301k01567j78867q7117j21594
$$ plain form
15767 -589102 -404230 -143932 35113 61050 297522 227921 45497 -49303 86209 226773
15757 226773 94362 -70157 -170198 -154057 -65184 -76405 -352810 -475238 -465699 -233202
15747 -233202 -62254 -110569 -152370 -109545 -177117 -279575 -333852 -469259 -331022 -437833
15737 -437833 -387841 -193845 -101650 -132137 27274 59847 -88194 -241907 -310290 -306204 -314944
15726 -314944 -226724 -26607 81180 206967 263992 212168 -143074 -377719 -445336 -290945
15716 -290945 -290657 -242133 -394776 -423453 -231761 -5737 115190 228789 168656 -10890 -92506
15705 -92506 -193866 -85258 -157425 -230238 -246395 55408 84260 -11026 -18596 -31024 -185985
15694 -185985 -307213 -288796 -95985 -64375 67088 191389 -10178 -189045 -276162 -397756
15684c97756j28666n348J54917k8744Q7096N2329q384k5646O5339k4515J22049
15673a37329L6776l1777Q2782K4139j23693q791K7847J37952K8309r2107o0966
15662a16858j6837r4259p9625n8674J02913O3522J88582K30509J0208M081j95179
15651C8383k2014n0456P947Q9726J01581r8918n8218n8904j34798o4471N316L0787
15639b14039k27306l1225m7724P483l9135L3576N3113J50582J75300J44849l7019
15628c1545k01665j23443j41920J13441K32309j37080J9384K1911n1618J40934
15618a59292o3065p6373O4671L5649r1845m9610J41170j82947L737R2313J75202
15607a10390P386o6180Q6228n1401j46955j31496j49626N7477L53380r8106K8290
$$ plain form
15684 -397756 -526422 -531770 -376853 -405597 -318501 -266172 -274556 -300202 -234863 -259378 -137329
15673 -137329 -100553 -132330 -49548 -25409 -149102 -157893 -130046 7906 36215 -55892 -116858
15662 -116858 -133695 -227954 -307579 -366253 -263340 -199818 -11236 219273 229481 233562 38383
15651 38383 16369 -34087 -26140 63586 165167 66249 8031 -50873 -185671 -250142 -244826 -214039
15639 -214039 -441345 -472570 -520294 -512811 -551946 -518370 -465257 -314675 -139375 5474 -31545
15628 -31545 -233210 -356653 -498573 -385132 -152823 -289903 -270519 -248608 -300226 -159292
15618 -159292 -222357 -298730 -234059 -198410 -290255 -339865 -198695 -381642 -377905 -285592 -110390
15607 -110390 -103004 -169184 -82956 -134357 -281312 -412808 -562434 -504957 -151577 -249683 -221393
15596b21393J17320o9711P6888l4354J80995P246p3521j15292L2088J06948K1205
15585B8419J43182J06161j09316j56263O2108J2755j16849J34136o4606j65824
15575a26097j56574k7915j06669j13184j8356L26920J05480j08070j37001l5247
15565c96713j09072r7653J47216K3470O0902J77914K05642o1283j35313J13872
15555g1018r5817j4060j58299j83894J74075J09320J6140L2501N9693j93366j6897
15544c41622m8518j55626j25903J47110J19966j13186n2538K8024n9195R5655
15534e05833O2857J11769q0994K49522J69221j59512k8583J04471L3161j76249
15524b20170n5063Q0979J16151j54731J89405J13243r4621R7086Q7710p1241j38167
$$ plain form
15596 -221393 -104073 -173784 -96896 -131250 49745 56991 -16530 -131822 -99734 7214 28419
15585 28419 171601 277762 168446 12183 74291 87046 -29803 104333 39727 -126097
15575 -126097 -282671 -310586 -417255 -530439 -548795 -221875 -116395 -224465 -361466 -396713
15565 -396713 -505785 -603438 -456222 -432752 -371850 -193936 11706 -49577 -184890 -71018
15555 -71018 -166835 -180895 -339194 -523088 -349013 -239693 -223553 -191052 -131359 -324725 -341622
15544 -341622 -390140 -545766 -671669 -524559 -404593 -517779 -570317 -542293 -601488 -505833
15534 -505833 -442976 -331207 -412201 -162679 6542 -152970 -181553 -77082 -43921 -220170
15524 -220170 -275233 -194254 -78103 -232834 -43429 69814 -24807 72279 159989 88748 -49419
15513d9419j19620j63426l0300K59823K2421o3575k54044j50075o023L34142J06402
15502a13694j82277j77157q1884J82534M7620m5509K6627l9646j70293J49810
15492d03869J15875J529k46527k16426R8720J02147K57580J00218o8106k345L2836
15481b28368M0416o4322k73703N740K07542R1865j03961j99468q2561J35244K30096
15470b41480l7507m0230o1427M4484J4641R1603j45124p2952J99004J02397J16239
15459c0352j3741l9165j42160J7034J25648j43828O9364j05529M3332J132j08913
15448c27178j1167N2555r5812j8825n221o7795N3246O8901r0258P0926l0119K1507
15436c79240J33979L5510k13161j71366R7419N7933O1024k3799J50978J7904j25885
$$ plain form
15513 -49419 -169039 -332465 -362765 -102942 -80521 -144096 -398140 -548215 -554238 -220096 -113694
15502 -113694 -295971 -473128 -555012 -372478 -324858 -370367 -343740 -383386 -553679 -403869
15492 -403869 -287994 -286465 -532992 -749418 -650698 -548551 -290971 -190753 -258859 -261204 -228368
15481 -228368 -187952 -252274 -525977 -520237 -312695 -220830 -324791 -524259 -606820 -471576 -241480
15470 -241480 -278987 -319217 -380644 -336160 -321519 -229916 -375040 -447992 -248988 -146591 -30352
15459 -30352 -44093 -83258 -225418 -208384 -82736 -226564 -157200 -262729 -219397 -218265 -327178
15448 -327178 -338345 -285790 -381602 -400427 -405648 -473443 -420197 -351296 -441554 -370628 -400747 -379240
15436 -379240 -245261 -209751 -422912 -594278 -496859 -438926 -377902 -401701 -250723 -232819 -358704
15425c58704k65927j60337K11651P35k8344J05383o0572j67965j45771k13443
15415a083294L0264K50286J12440j11270J05201L1621R8564P0264J34295l9255
15405d00884r1156M03439M14173K12808M86653J220634J387367J616669J811195
15396G060898J429072J029386M04093q1022o64036j171579j274909j401317q40266
15387D490320n66392p53442l67385j28454r2572j48856l3570k56611k01286Q0915
15377B022667p098k87296k45215j532Q6662N133j08544k35835r5790M2531j36832
15366A038851j70648k76510j1014j93251O3748N1290J80116J39312r397k94860
15356E17637K20100L85j86779r4399j39021L1196K2892N2436k82227j75234M2113
$$ plain form
15425 -358704 -624631 -784968 -573317 -572582 -600926 -495543 -556115 -724080 -869851 -1083294
15415 -1083294 -1053030 -802744 -690304 -801574 -696373 -664752 -566188 -495924 -361629 -400884
15405 -400884 -492040 -88601 325572 538380 1025033 2245667 3633034 5249703 7060898
15396 7060898 8489970 9519356 9923449 9842427 9178391 8006812 6731903 5330586 4490320
15387 4490320 3923928 3170486 2803101 2674647 2582075 2433219 2399649 2143038 1941752 2022667
15377 2022667 2015569 1728273 1483058 1481526 1568188 1573321 1464777 1228942 1133152 1175683 1038851
15366 1038851 868203 591693 580679 387428 451176 502466 682582 821894 812497 517637
15356 517637 737737 738122 551343 456944 317923 349119 372011 424447 142220 -33014 9099
15345I099L3959r1792q7900p0261J90606M50600L6313o7926J9849J00299J416
15334E24262o5265p479J19712k52961q1558P5099J14046m5201k22940j20518j87
15323C7010M7069K36321M3552p8186m2506L6278P8101j63024j05549J92592L3488
15312C15146m2899l49894O1810O4334R860p4505J05564L4995K89245j29578j51654
15301A32424J64287J1387r241r5252j13913O134N1626K4268j02622k3455M000
15290D9643P4046O52j91886l04373j91185J68595J85339J52977J9797P2025l5714
15279h4J1813j8697K63m2178J3452J8133J11965o9316Q2856n429O9749n8394k10362
15266i6229r1209J28559O3380j0160k57574m8353M5156j9355J79913Q0962q1719
$$ plain form
15345 9099 43058 -48734 -136634 -206895 -16289 434311 470624 402698 422547 522846 524262
15334 524262 458997 451518 571230 318269 236711 311810 425856 380655 157715 37197 37010
15323 37010 84079 320400 363952 285766 243260 279538 357639 194615 89066 281658 315146
15312 315146 272247 -77647 -15837 48497 58357 -16148 89416 124411 413656 284078 132424
15301 132424 296711 308098 298857 203605 89692 95826 147452 171720 69098 45643 49643
15290 49643 123689 124341 -67545 -371918 -563103 -394508 -209169 -56192 -36395 35630 -84
15279 -84 11729 -6968 -6705 -48883 -35431 -17298 94667 25351 108207 102778 172527 114133 -96229
15266 -96229 -187438 -58879 4501 -5659 -263233 -311586 -266430 -285785 -105872 -24910 -106629
15255a06629J60852N4928j10529l4751J39319P6945j82551j18084j39678m4143
15245c04321J82443k1314j7892P7887K26434k6915N5988J65504m7000l44647l973
15234e7806P1083l8026M1003m1298P720J34683R5796j80013k92002J41403j07986
15223b25443j15441L38108J91165j5886j14768L1571o9968J12579j45548m3018
15213e6649j54341J5777J90367J09880k6830n3642n378m7147n4578K48103M9878
15202B15440l12399R9855r7317M1323p1092j25600J06621K49059O526j32868j36491
15191a56943R2233J42611m1156q1810k20636j02577J8908l2754K53105j09536
15181b38555j37732P4410J15416P6177k6622K3810J9597p0232M5700K6923j06233
$$ plain form
15255 -106629 54223 109151 -1378 -36129 103190 180135 -2416 -120500 -260178 -304321
15245 -304321 -121878 -143192 -161084 -83197 143237 116322 172310 337814 290814 -53833 -57806
15234 -57806 13277 -24749 16254 -25044 -17324 117359 213155 33142 -258860 -117457 -225443
15223 -225443 -340884 -2776 188389 172503 57735 89306 19338 131917 -13631 -56649
15213 -56649 -210990 -195213 -4846 105034 78204 24562 19184 -27963 -82541 165562 215440
15202 215440 -96959 2896 -94421 -53098 -124190 -249790 -143169 105890 112416 -20452 -156943
15191 -156943 -64710 77901 36745 -45065 -265701 -368278 -349370 -382124 -129019 -238555
15181 -238555 -376287 -301877 -186461 -110284 -136906 -113096 -93499 -163731 -118031 -91108 -197341
15170a97341N848j11195K864P785O1968J85256J62161O9829l1639j31428J01298
15159A25406L14156n8443l78124j45740J83844J38289j09641j0260K05548J18483
15149C83518L7581j23605J80645K70045K26702o9116k21035r9036j11757Q505
15139D82447O5268j47214j30784k7979Q7137k05583j31899j26782J21579L7547
15129B3737j34367M1921K40017K79201j92452j17925J48221k23484l70811M5962
15119b59980j12684j34357K93372L95171J02348j48233q0838n0995j16442n8972
15109a71610j31858r9081j0978M2088J11232j29278j17004k218J91833K19763
15099i7111R4427J07590j2329n8075l18434j41744K72297J12115O8999J5300M8167
$$ plain form
15170 -197341 -191493 -302688 -299824 -292039 -230071 -44815 117346 187175 155536 24108 125406
15159 125406 439562 381119 2995 -142745 41099 179388 69747 59487 265035 383518
15149 383518 421099 297494 478139 748184 974886 905770 684735 585699 473942 482447
15139 482447 547715 400501 269717 241738 328875 123292 -8607 -135389 -13810 23737
15129 23737 -110630 -68709 171308 450509 258057 140132 288353 64869 -305942 -259980
15119 -259980 -372664 -507021 -213649 181522 283870 135637 54799 3804 -112638 -171610
15109 -171610 -303468 -402549 -413527 -371439 -260207 -389485 -506489 -508707 -316874 -97111
15099 -97111 -2684 104906 92577 34502 -283932 -425676 -153379 -41264 27735 43035 91202
15088I1202j57490J94131O778L9176k80642q8878q6387n5026p7525J53339K03905
15077e7417R7075N5599J65248q3292k66095M3473O0557j66505R1113J45525L724
15066H9005K4517R7960L3938n3742m7991N0570r2308M8466k6353k00911P0071
15055f778J54226j1947l1410O9502Q2554j17516j2123j83771r863n2675O770j78849
15043b91880k8639J98190J47688j38192j1516L7304J0271l9002q973J8513k5747
15032a31983k7721p4352p3924j28976O6027J22593R2332J09764O765m3593L0595
15021e2473J1534q1258j00408J03615K3307R7155l2827k14845K8687J35131K96880
15010B14498K96478k0745l56919k16184p5871J12805K16992k47686j16379K6458
$$ plain form
15088 91202 -66288 127843 134621 173797 -106845 -195723 -282110 -337136 -414661 -261322 -57417
15077 -57417 39658 95257 260505 177213 -88882 -45409 15148 -151357 -60244 85281 89005
15066 89005 113522 211482 245420 191678 143687 194257 101949 150415 124062 -76849 -6778
15055 -6778 147448 135501 104091 173593 256147 138631 126508 -57263 -67126 -119801 -113031 -291880
15043 -291880 -320519 -122329 25359 -112833 -124349 -87045 -76774 -115776 -124749 -106236 -131983
15032 -131983 -159704 -234056 -307980 -436956 -370929 -248336 -156004 -46240 -39475 -83068 -52473
15021 -52473 -40939 -122197 -222605 -118990 -95683 1472 -31355 -246200 -217513 -82382 214498
15010 214498 510976 490231 133312 -82872 -158743 -45938 171054 -76632 -193011 -166553
15000a66553k6863P6461K24800Q6473k81583k79781L4083k2094n525K21312O7054
14989g2216n8273r836j75473N0543K7699r0736j22869L2659J21313Q7782J44796
14978f4611M6973k12337j08122p3205n7921K10219j3066n0655J41079P6784M6621
14967e8241j01265J15996J00923l2775L5957j10498o332j9411R5639J64553j83094
14956A452J53688L8597k2228j28618j61934l5155J5645p5480k46975J62902J42468
14945a55638k7456j36149Q5902K75789q5886m2855j7655J0329R5945k00607J44034
14934e4247j10136O08K11385M7011k5982m8949j23286J45385Q3619m5452j44650
14923f4694j8429R1490J29758J61147j92654n7352J7888r0529q1082j76148Q135
$$ plain form
15000 -166553 -193416 -116955 107845 194318 -87265 -367046 -332963 -355057 -360582 -139270 -72216
14989 -72216 -130489 -140325 -315798 -265255 -237556 -328292 -451161 -418502 -297189 -209407 -64611
14978 -64611 -17638 -229975 -338097 -411302 -469223 -259004 -272070 -322725 -181646 -104862 -58241
14967 -58241 -159506 -43510 57413 24638 60595 -49903 -56235 -75646 19993 184546 1452
14956 1452 155140 193737 171509 42891 -119043 -154198 -138553 -214033 -461008 -298106 -155638
14945 -155638 -183094 -319243 -233341 42448 -43438 -86293 -103948 -93619 2326 -198281 -54247
14934 -54247 -164383 -163775 47610 94621 68639 19690 -103596 41789 125408 79956 -64694
14923 -64694 -83123 8367 138125 299272 106618 49266 67154 -23375 -104457 -280605 -272470
14912b72470O3246J4346J6042J48027m9913J54984J39291k2497k76788n8814K74445
14901A29899J12533j12820j63829J26458m5440j72786P920l4442J48728J45527
14891A41748K0753n8896j80623k1185q011j0510L1227k3754J1492m1333k42511
14880c81603J77549Q1751J16358l7398j55548n2583P111j9292n2633J37320R1046
14869h7922m890o4754j75211J2251P7121j77212o5012J93605k5647J58196J27630
14858c1845p6687j41512J16147N5387O4104Q5255p1253J151K8895m2590q6958
14847i9906j6527o928J52181o6652j34913N2990j26083l2295J8751P1930n1218
14836b38670P053J57286J20386Q3382J05982j76884j21817M3179J43955p3437
$$ plain form
14912 -272470 -209224 -194878 -178836 -30809 -80722 74262 213553 191056 -85732 -144546 129899
14901 129899 242432 129612 -34217 92241 46801 -125985 -118065 -152507 -3779 141748
14891 141748 162501 103605 -77018 -98203 -106214 -116724 -85497 -109251 -97759 -139092 -381603
14880 -381603 -204054 -122303 -5945 -43343 -198891 -251474 -244363 -263655 -316288 -178968 -87922
14869 -87922 -92812 -157566 -332777 -320526 -243405 -420617 -485629 -292024 -317671 -159475 -31845
14858 -31845 -108532 -250044 -133897 -78510 -14406 70849 -404 747 29642 -12948 -99906
14847 -99906 -116433 -123361 28820 -37832 -172745 -119755 -245838 -278133 -259382 -187452 -238670
14836 -238670 -231617 -74331 46055 129437 235419 58535 -63282 -20103 123852 50415
14826E0415j73351q6104j65693j26416O9679J54345K06429K41451r7400k91978
14816b18623Q2646l8183J47930P7843l26121j7427K67405J98055r623Q319r6370
14805G5851k0804K28239k72256k87556K68145K20556J70650N1201m38752o5333
14795g0059L9378J06791m5450j25391N7859J22257l0939K7536j70894k26867K18909
14784i6870K1033j61317M3063o9172J63090J43135m1970p865M5509K51345Q7982
14773C77963j38204j89635N6745J09546K06758j48857k65282k57409n6739J26778
14763a78336q0292J2488j77778M6398J71482J54885P4076j31066R554J01027O0304
14752F2742l5611j06602J6624J0485k2826L059j53370Q3787j4221p1832P8528
$$ plain form
14826 50415 -122936 -209040 -374733 -501149 -431470 -277125 -70696 170755 73355 -218623
14816 -218623 -135977 -174160 -26230 51613 -274508 -291935 -24530 173525 163902 172221 75851
14805 75851 55047 283286 11030 -276526 -8381 212175 382825 434026 -4726 -70059
14795 -70059 -30681 76110 30660 -94731 -36872 85385 54446 81982 -88912 -315779 -96870
14784 -96870 -75837 -237154 -194091 -263263 -100173 42962 992 -6873 38636 289981 377963
14773 377963 239759 50124 106869 216415 423173 274316 9034 -248375 -305114 -178336
14763 -178336 -258628 -246140 -423918 -377520 -206038 -51153 22923 -108143 -98589 2438 62742
14752 62742 27131 -79471 -62847 -52362 -75188 -72129 -225499 -141712 -155933 -227765 -149237
14741a49237J88426j8239J02463M1414q2062j08013q5459n4402O7905J10393o9073
14730e5884R6669J50084P4142k27964j5136q2399n2485q5566j17447j3516L8890
14719b90612n0886O7912J68510m8477j97500j51548k9999K10621J47265J75277
14709E63J66568j1355j15443l27958j85649J39002J06567J00919N8148O611j8542
14698h0569J91760N1080j41891Q212J8019L8533r395P677r6425P7140J2050j09806
14686c3615J29568K67173P3468l90530k06412P9286J30849J30456j86384o374
14676a2515O9061r9848k6636j7266o9941P2261R8684R5715K40327J8075k19511
14665A48406P1672O2714M1876J92935K75p8344j64376J9210o7047n4427p2388
$$ plain form
14741 -149237 39189 20950 123413 164827 82765 -25248 -110707 -165109 -97204 13189 -55884
14730 -55884 40785 190869 265011 37047 21911 -60488 -112973 -198539 -315986 -329502 -290612
14719 -290612 -341498 -273586 -105076 -153553 -351053 -502601 -532600 -321979 -174714 563
14709 563 167131 155776 40333 -287625 -473274 -334272 -227705 -126786 -68638 -62027 -80569
14698 -80569 111191 162271 20380 28592 46611 85144 75749 83426 -12999 64141 76191 -33615
14686 -33615 95953 363126 436594 46064 -160348 -81062 49787 180243 -6141 -12515
14676 -12515 56546 -43302 -69938 -87204 -157145 -84884 13800 109515 349842 367917 148406
14665 148406 220078 282792 324668 517603 517878 439534 275158 294368 227321 172894 100506
14654A00506k07031j43242l3017j30812O0228J12341K83005M7275r5685k08779
14644b15211m9712K6847o392R4622J86756J36490p3051j86965L0970k26167k56599
14633e38412J75046J68654K2741k5021j37760M183P4087j4384K16924J67790O076
14622A19924j82970M8233n7210K949j5666N7057P7528r6530K23650N9753j01821
14611A34897r6628K1076l9881l990o9254n4335k4941R2300O6813J88805O5205
14600B80067k66515m9340J08551L0907Q1167P8231R6170J20173L6068q2310k49684
14589A83485j74660j05158l9000O369p2457O1483K9241J6708K3543L4184N3738
14578A7476j53537J06239J04443K19086q6076k29710k8006J59535l8385j70058
$$ plain form
14654 100506 -106525 -249767 -282784 -413596 -353368 -241027 41978 89253 -6432 -215211
14644 -215211 -264923 -238076 -244468 -149846 36910 173400 100349 -86616 -55646 -281813 -538412
14633 -538412 -363366 -194712 -171971 -196992 -334752 -330569 -256482 -270866 -53942 113848 119924
14622 119924 -63046 -14813 -72023 -69074 -84740 -27683 49845 -46685 176965 236718 134897
14611 134897 38269 59345 19464 15474 -53780 -108115 -133056 -40756 26057 214862 280067
14600 280067 13552 -35788 72763 103670 184837 263068 359238 479411 515479 433169 183485
14589 183485 8825 -96333 -135333 -128964 -201421 -139938 -110697 -93989 -70446 -36262 17476
14578 17476 -136061 -29822 74621 293707 207631 -22079 -50085 109450 71065 -98993
14568i8993j33926j51723j07696p0229K87106K36122p6827j23957n1643j1065
14558c02831J6649N5209O2085M8034L1163J3988l3383O4615j60163l278K54056
14547D6144P0692o6969k3628L9875k40675l30603o2038Q2930l956P0348N5222
14536c62658R9092J57818k8233q2727k0421O1573N3511q2788M4467K2297q6148
14525b24217J31319J30984q4187j89182j72915J16412J10106J92742L4841j71232
14515a25329n427L49541P4779N0766j06475J89262O3744N0105o3876k21782k54878
14504D30j27831n2134O9131m3597R0149N4788q0103j91234r7077p4787j19149
14493e71414J09498N4016j3763K37697K46953J23292O048R7417N502o7517j93288
$$ plain form
14568 -98993 -232919 -384642 -492338 -562567 -275461 -39339 -116166 -240123 -291766 -302831
14558 -302831 -286182 -230973 -168888 -120854 -89691 -75703 -109086 -44471 -204634 -207912 46144
14547 46144 116836 49867 26239 66114 -174561 -505164 -567202 -484272 -488228 -417880 -362658
14536 -362658 -263566 -105748 -133981 -216708 -237129 -175556 -122045 -204833 -160366 -138069 -224217
14525 -224217 -92898 38086 -46101 -235283 -408198 -291786 -181680 11062 45903 -125329
14515 -125329 -130756 218785 293564 344330 237855 427117 490861 540966 477090 255308 430
14504 430 -127401 -179535 -110404 -154001 -63852 -9064 -89167 -280401 -377478 -452265 -571414
14493 -571414 -461916 -407900 -421663 -183966 62987 186279 192327 289744 295246 227729 34441
14482C4441k40810p7745J40409J49932m8444j22905J38297K19453P191j70492
14472B9327r8580p4070n9380j52962q3077J92306j5112N12j11764O4260n456N3838
14460b60158J33396J7420J38571J28348o2452j88699J05489J39946Q0050j05521
14450A26390L8838j0494Q9742j51506l04872o7519J33848n9475J95146j13438
14440a23340j05618q5088j68616M8761L9680l8736K96730K24453n8939l4421J13993
14429A08859q906j49567k2600j77303J26689r6607j76772J40340m2784m9972J9436
14418c29187k6353l2991O7108K93064O318r5734j78786k9304J02510J29281j2649
14407a06723J5320Q7782o3484j86667J7364K16350K80704k12940l8935J20641
$$ plain form
14482 34441 -206369 -284114 -143705 6227 -42217 -165122 -26825 192628 199819 29327
14472 29327 -69253 -143323 -202703 -355665 -438742 -246436 -261548 -261036 -372800 -308540 -313996 -260158
14460 -260158 -126762 -109342 29229 157577 95125 -93574 11915 151861 231911 126390
14450 126390 165228 154734 244476 92970 -211902 -279421 -145573 -205048 -9902 -123340
14440 -123340 -228958 -314046 -482662 -433901 -394221 -432957 -136227 88226 29287 -5134 108859
14429 108859 99953 -49614 -72214 -249517 -122828 -219435 -396207 -255867 -298651 -348623 -329187
14418 -329187 -355540 -388531 -321423 -28359 -22041 -117775 -296561 -325865 -223355 -94074 -106723
14407 -106723 -91403 -3621 -67105 -253772 -236408 -20058 260646 47706 8771 129412
14397A29412j13594K19579j4036L4588j68496n4251j17641N0453O3552J61101
14387A90667R8791j73364m1396K5161m8104k29183j4986o3036q1254J90985l09740
14376d55459l1865L49862L40633J02232j09979n4101l2616p8954j17186k19163
14366c06596j10710P0424J84078J16929j01798p5810k9018J25682J48244j26596
14356a05171j00491M22148k5706j63172M1025N9402L0782j73016j9526j48807
14346a82532j4472J7055J13646J09857N5026j03489k5077r0123O7234J941Q3577
14335C2643J49659q2288j58312M515o3507L191j27817L6603k20060L4152L04905
14324h6316R9673m8392n0581j65751l826R3916j21455O9185J33785m1125j80642
$$ plain form
14397 129412 15818 235397 221361 255949 87453 33202 -84439 -33986 29566 190667
14387 190667 289458 116094 74698 99859 51755 -177428 -192414 -255450 -336704 -145719 -455459
14376 -455459 -487324 -137462 203171 305403 195424 141323 108707 29753 -87433 -306596
14366 -306596 -417306 -346882 -162804 -45875 -147673 -223483 -252501 -126819 21425 -105171
14356 -105171 -205662 216486 190780 27608 68633 128035 158817 -14199 -33725 -182532
14346 -182532 -197004 -179949 -66303 43554 98580 -4909 -29986 -120109 -52875 -50934 32643
14335 32643 182302 100014 -58298 -53783 -117290 -114099 -241916 -205313 -425373 -391221 -86316
14324 -86316 13357 -35035 -85616 -251367 -255193 -161277 -282732 -213547 -79762 -120887 -301529
14313c01529Q390r302M9004J58444J30387n1927K8259q6443r3113m6793J3792
14302b00831L3624L6050k82506r8617J58855R2202P883l7116p1903N2968K45600
14291f3791K04506r7977M7635M74060r21m15375n4593J04375j04372m9240J09676
14280A53983M3830q3082J5021J36795j63026l04768j14250O9406P5679j57943
14270c28355j16463J73380o7322N9387p9113o9435K98996K99074R194j41434M0515
14259G8424J23471j41381k34387j27715J49380L2983j04620p9656J80068L51811
14249B28378k6364k38144p8259j8880K54134K8376j36895Q7223J17737K6051n2081
14238A91276j65226r5101J33610Q9080L0984k7317m4314p8756k4761m1318K7534
$$ plain form
14313 -301529 -293139 -302441 -253437 -94993 35394 -16533 11726 -74717 -167830 -214623 -200831
14302 -200831 -167207 -131157 -413663 -512280 -353425 -261223 -253340 -290456 -362359 -309391 -63791
14291 -63791 140715 42738 90373 564433 563512 148137 93544 197919 93547 44307 153983
14280 153983 197813 114731 129752 266547 103521 -201247 -315497 -246091 -170412 -328355
14270 -328355 -444818 -271438 -338760 -279373 -358486 -427921 -128925 170149 179343 37909 78424
14259 78424 201895 60514 -173873 -301588 -152208 -119225 -223845 -303501 -123433 228378
14249 228378 202014 -36130 -114389 -133269 120865 149241 12346 99569 217306 243357 191276
14238 191276 26050 -69051 64559 153639 184623 157306 112992 34236 9475 -31843 -4309
14227d309j41843j95210O5646P4778R1755l9402o0446l3944k0851K6648o9706
14216c06884l2238k7713J64866j3934p8391J81832k10515o2501L4469r3923J86372
14205b58560K21058p4680j49337l4875M9802K9249J0998K3953Q3388J14785r979
14194E802l06181o7512L5903M03J58074P7754o2918j74680r7674J15000M18457
14183A02428R7414k83470M5717J76928m3401j13512j50637R9284p2563j7026Q4353
14172g4485O4326J42347q9415j77425o9982J24151L931m7636n0848j42816p2039
14161c89891J7473o3611q8137O6438Q8529R0169N2200K48484k56316j08031L5122
14150c07571Q8561J3216K05801j00275l71731J13586L5236J02717k939q6930J26977
$$ plain form
14227 -4309 -146152 -341362 -275716 -200938 -109183 -148585 -209031 -242975 -263826 -237178 -306884
14216 -306884 -339122 -366835 -201969 -215903 -294294 -112462 -322977 -385478 -351009 -444932 -258560
14205 -258560 -37502 -112182 -261519 -296394 -246592 -217343 -206345 -182392 -99004 15781 5802
14194 5802 -300379 -367891 -331988 -331585 -173511 -95757 -158675 -333355 -431029 -316029 102428
14183 102428 199842 -83628 -37911 139017 95616 -17896 -168533 -69249 -141812 -158838 -74485
14172 -74485 -10159 132188 42773 -134652 -204634 -80483 -76552 -124188 -175036 -317852 -389891
14161 -389891 -372418 -436029 -524166 -457728 -369199 -279030 -226830 21654 -234662 -342693 -307571
14150 -307571 -219010 -205794 7 -100268 -471999 -358413 -323177 -220460 -223399 -310329 -183352
14139a83352J23824j07838j08207m1100J05606J3545J36419k399j59392J39534
14129h3360J07146l7503l77063k44674K15266K15639J09581Q1200m9573j03736
14119a67077p0412J2988m5399P5864K99780J5624j45844l7394j49177K0645J51473
14108c8929O5744Q8070M6170N0312P26P5014j17454j03949O5110r6531q2106M0924
14096f899O0595J5498R298J48192k31894k03899N5987K70024k570L7712J57106
14085C09150q6629k9460m5393j89278k06199j19775j36695J16136K85422K27728
14075A25007j29612j43652j4264o1077N2576l3557m5738M012K1389J25357J56131
14064E6572j09534n2073O9383J33277j63940r0835j21118q8499K34982O4425O2802
$$ plain form
14139 -183352 -59528 -167366 -275573 -316673 -211067 -197522 -61103 -63502 -222894 -83360
14129 -83360 23786 -13717 -390780 -635454 -420188 -204549 -94968 -13768 -63341 -167077
14119 -167077 -237489 -224501 -269900 -194036 105744 121368 -24476 -61870 -211047 -190402 -38929
14108 -38929 26815 114885 161055 211367 212093 287107 169653 65704 130814 34283 -47823 -6899
14096 -6899 53696 69194 78492 226684 -5210 -209109 -153122 116902 114332 152044 309150
14085 309150 222521 193061 147668 -41610 -247809 -367584 -504279 -388143 -102721 125007
14075 125007 -4605 -148257 -162521 -223598 -171022 -204579 -250317 -246305 -224916 -99559 56572
14064 56572 -52962 -105035 -35652 97625 -66315 -157150 -278268 -366767 -131785 -67360 -4558
14053d558K97316Q5873j61160l19489l01010k32235J48362o0431q2832M0387K32191
14042c57586p3160J82851r7687J02521K00642O3358q6689k07054J42459l2401
14032a62746j15193R9458M7581K4886J52282J01221J48181j57095k54419k30955
14022c46799p0619M4182K13633j00705j1239j40214k91332L2811N9728K09008
14012d01546N04750L73520M89212M97322M91005M51809K30747Q4350K62822j19263
14002B864728m41292o28716l63612j56563P6370j13440j99767k39578r6893O5199
13992G66436k5538r1069j01074n3696j3203Q2938j18142l08084J6640J50577R6814
13981D02599l8864j51010K3126M4298p9580k0252K7786p5208J5383p020k27410
$$ plain form
14053 -4558 292758 378631 217471 -102018 -403028 -635263 -486901 -547332 -630164 -589777 -357586
14042 -357586 -430746 -247895 -345582 -243061 -42419 20939 -65750 -272804 -130345 -162746
14032 -162746 -277939 -178481 -130900 -106014 46268 147489 295670 138575 -115844 -346799
14022 -346799 -417418 -373236 -159603 -260308 -271547 -411761 -703093 -670282 -610554 -401546
14012 -401546 103204 476724 965936 1463258 1954263 2406072 2636819 2721169 2983991 2864728
14002 2864728 2423436 1794720 1431108 1274545 1350915 1237475 1037708 798130 701237 766436
13992 766436 740898 649829 548755 495059 481856 564794 446652 138568 155208 305785 402599
13981 402599 363735 212725 235851 280149 200569 180317 208103 132895 148278 141258 -86152
13970h6152K508J03551o9879n6904R4627O6427K8581N8808r6638N6854Q7733K20548
13958D10064O5883k6158k65649q6097o870o4138N2256k00041j53217J04220J52641
13947a7106Q9989N7464r0067j23400Q8167O2658Q0961r3358j95308Q0052J1620
13936d8328J15857J03084J4279p1015R3651M4619k01958k76154M2237L05985m5615
13925G6642o8856j04583n323O0390J22900J31465j23578k10879K1019J21072k3269
13914c000J80929p9002n509j01753m6867Q4719m090J34742j46211j19556l1396
13903a36994J12293J22011J96420M2021j96440k68388P5356l394M2034O556l2886
13892d1411n726P5670O6291J7562K82643m82k45898K6465Q5332n9784j32195M5360
$$ plain form
13970 -86152 -83644 19907 -49972 -106876 -12249 54178 82759 141567 44929 101783 189516 410064
13958 410064 475947 449789 184140 98043 91173 27035 79291 -120750 -273967 -169747 -17106
13947 -17106 72883 130347 40280 -83120 5047 67705 148666 55308 -140000 -59948 -48328
13936 -48328 67529 170613 184892 113877 207528 252147 50189 -225965 -183728 122257 76642
13925 76642 7786 -96797 -102120 -41730 81170 212635 89057 -121822 -100803 20269 -3000
13914 -3000 177929 98927 93418 -8335 -55202 29517 25427 160169 13958 -105598 -136994
13903 -136994 -24701 97310 293730 335751 139311 -129077 -53721 -57115 -15081 -8525 -41411
13892 -41411 -47137 28533 94824 112386 395029 394547 148649 175114 260446 200662 68467 113827
13880A13827p4571j6768p5424J82355K88266r6080p3613R3213O4460j25279L914
13869B84300M9536r3911J17643j02064l39418j58375j6729j656p9542N8629R9544
13858a82043K6532J32550M7648K7724P6767p130j02061J75085M3342K6420P528
13847B72362o4484R8187J02488j40415k10958M496J32882L3740q255K1751j81010
13836F0784J95688K21787m1451p6316j15588J04857j32529J20666N9942k39919
13826A57921n4469P6722P7438j57234j33201l5964q9258J0929O4839K1912J10235
13815D9870o2670J30089J38304P4930Q1933N4768O5428m4488o6189j10426j49821
13804A61728J9496J74997o4223k05696m5836k9524J385J34600Q8559L1860J02022
$$ plain form
13880 113827 39256 22488 -52936 129419 417685 321605 247992 341205 405665 280386 284300
13869 284300 333836 239925 357568 255504 -83914 -242289 -259018 -260674 -340216 -281587 -182043
13858 -182043 -155511 -22961 24687 52411 129178 122048 19987 195072 238414 264834 272362
13847 272362 207878 306065 408553 268138 57180 61676 194558 228298 220043 241794 60784
13836 60784 256472 478259 436808 360492 244904 349761 217232 337898 397840 157921
13826 157921 103452 180174 257612 100378 -32823 -68787 -158045 -147116 -82277 -60365 49870
13815 49870 -12800 117289 255593 330523 412456 467224 532652 488164 421975 311549 161728
13804 161728 181224 356221 291998 86302 40466 10942 12327 146927 235486 267346 369368
13793C69368m9983k62223J03331Q3565j44960o8090m6819k02599n8406M6993P7610
13782a52213J98119M8475m6557j14206L5613J16996r4247m2446j00148K16935
13772F6321K0551n3384J47038L2849J16677J81273j54352m6420k23523R883J37295
13761B34208K2057O1319J4686m1956l5452l8935k94443J51936J92731n1411n7466
13750A57274N5560Q3008m7815k29704j24924J56633l4074k0150m8741o3697J16924
13739B94j03105J5508J51691J32651J0436R9134J6380r39r6581M422N3001L429
13727B86321J4938j08353j39366j19256j04439J05828k36988j38352O4304K1815
13717c53548J41789K5497o7124M0437L58527K3039M8042q9468m8692K18547J24242
$$ plain form
13793 369368 319385 57162 160493 244058 99098 31008 -15811 -218410 -276816 -229823 -152213
13782 -152213 45906 94381 47824 -66382 -30769 86227 -8020 -50466 -150614 66321
13772 66321 86872 33488 180526 213375 330052 511325 356973 310553 87030 96913 234208
13761 234208 256265 317584 332270 290314 254862 215927 -78516 73420 266151 214740 157274
13750 157274 212834 295842 248027 18323 -106601 50032 15958 -4192 -52933 -116630 294
13739 294 -102811 -87303 64388 197039 207475 306609 322989 322050 225469 229891 282892 286321
13727 286321 301259 192906 53540 -65716 -170155 -64327 -301315 -439667 -375363 -353548
13717 -353548 -211759 -186262 -253386 -212949 145578 168617 216659 127191 78499 297046 421288
13706D21288k33006q0671m5609k30730J70901J32955o9251j60356J33755J04364
13696A43640J50016J6983r3859j27989n8470j04831J69438P5641n3605J3956J17769
13685B48689J64088J31683j95819k33830Q3430J9246k55608k36436K24735J73371
13675A23549q021o5235R1298J45088j5627o7187L0096k45387r7430J53975J29734
13664A74853J7762n5717J0209M1586L6189o5452P4544N9722L1680N2450j59052
13653B18774J99556n8955j27685L1375j53496p7082k4562J93660Q2539p1905m7109
13642A65110n6320J3740Q0347k0995q6536j51560M3291Q4683J8341j26711j63556
13631b00166Q0193J73236O667l2907m7891R490j61006N9593J92494N9078M6280
$$ plain form
13706 421288 188282 107611 62002 -168728 2173 135128 65877 -94479 39276 143640
13696 143640 293656 310639 216780 88791 30321 -74510 94928 170569 116964 130920 248689
13685 248689 412777 544460 348641 114811 198241 217487 -38121 -274557 -49822 123549
13675 123549 115528 50293 141591 286679 271052 203865 233961 -11426 -108856 45119 174853
13664 174853 192615 136898 147107 188693 224882 159430 233974 293696 325376 377826 218774
13653 218774 418330 359375 231690 263065 109569 32487 7925 201585 284124 212219 165110
13642 165110 108790 122530 202877 181882 95346 -56214 -12923 71760 90101 -36610 -200166
13631 -200166 -119973 53263 59930 27023 -20868 -11378 -172384 -112791 79703 138781 185061
13620A85061j47293J00328R2487O0982j95955j41442J16587K41088L3860l8834
13610C06869j29110j35678j48341j08364J14890n9019K4993J19809K33471J43806
13600C63326q814j51302j42527P287R3096k4857P9945p4615j28050p5539q525
13589g0575N9555R2943R7854j47385n4092J58108O2886J8887m5977n5097j49880
13578c2773r450P5671K31761R0926n4937k46116p545L5124j53196m8894N6485
13567f2944K74994K891j84768n7140l3133L207J08619K69460j1219j10731p6622
13556A22614j28394L6008R4989j03150M6820N3459j5772J01294J16500k30458
13546I3910l5343M8828Q6764j05364N158M7002j95570M6488M9079n1014J0517
$$ plain form
13620 185061 37768 138096 230583 291565 95610 -45832 70755 311843 345703 306869
13610 306869 177759 42081 -106260 -214624 -99734 -158753 -133760 -13951 219520 363326
13600 363326 354512 203210 60683 67970 161066 136209 216154 141539 13489 -62050 -70575
13589 -70575 -11020 81923 179777 32392 -21700 136408 199294 218181 172204 117107 -32773
13578 -32773 -42223 33448 265209 356135 301198 55082 47537 82661 -70535 -119429 -62944
13567 -62944 212050 214941 30173 -26967 -60100 -56893 51726 321186 309967 199236 122614
13556 122614 -5780 30228 125217 22067 68887 122346 106574 207868 324368 93910
13546 93910 58567 107395 194159 88795 93953 140955 -54615 -8127 40952 -10062 455
13535D55l8971P5511J11921n1229j554j75162r5458j76413K09732J84379L18911
13524C62122M3402j82618j69661j65246N0536J21126R6453N8842l2296j78358
13514D302Q8020K1614P0217J01542j86739m4154r3821J08374M3087j22516j31212
13503a41286J72572N1309M1821K6253o9646j03834k7084o0896J79031k1927J03658
13492A49971N8585r7564n9804j92895R4945k9874J6168J15888J23386j31330j90157
13481a42681J44431K28890Q353R5335j30940k02910J02206Q8250J50041l76696
13471c5721k07903K43306J01386j15748O2885J48669o6573K08459K05518q4408
13461D59870j21534q2608j8019l5255m884j65860K7119l967o6271J22075n3522
$$ plain form
13535 455 -38516 36995 148916 97687 96133 -79029 -174487 -350900 -141168 43211 362122
13524 362122 405524 222906 53245 -112001 -61465 59661 156114 214956 182660 4302
13514 4302 92322 113936 184153 285695 98956 54802 -39019 69355 112442 -10074 -141286
13503 -141286 31286 82595 124416 150669 81023 -22811 -49895 -110791 68240 46313 149971
13492 149971 208556 110992 51188 -141707 -46762 -76636 -60468 55420 178806 47476 -142681
13481 -142681 1750 230640 238993 334328 203388 478 102684 190934 340975 -35721
13471 -35721 -243624 -318 101068 -14680 48205 196874 130301 338760 544278 459870
13461 459870 338336 255728 237709 202454 197570 31710 58829 54862 -11409 110666 57144
13450E7144j4981J39489J37225j10622n898K0967P1230R0541P9287q1807j13248
13439B69327m4985q4575r7494p8678L01848K24054j31070j27307n9853l9188Q497
13428A40576J43841P0996N2957J4604j8019M7896r2477r2961m77j34164o6272
13417F6500Q3158J8918j29524j3181P3188Q4163J70226n1343k9774k03421j59040
13406i0130J02778J71155p1084l44494J1471J5741m8433J91689J06490l7836J06491
13395A13838J39017O0204j63662N3664J19298k01340k4806J35511Q0295R680q8680
13384B33019k10022J5509N9867k1366J85019j36201L3594J13099j10675o2751
13374I9092J10706j56103M7065J03659O2280o1199J05650j67949L2789M9920k3163
$$ plain form
13450 57144 42163 181652 318877 208255 202357 223324 294554 385095 464382 382575 269327
13439 269327 224342 139767 42273 -36405 265443 489497 358427 231120 171267 132079 140576
13428 140576 284417 355413 408370 422974 404955 452851 360374 267413 266936 132772 66500
13417 66500 149658 168576 39052 25871 99059 183222 353448 302105 272331 68910 -90130
13406 -90130 12648 183803 112719 -231775 -220304 -204563 -252996 -61307 45183 7347 113838
13395 113838 252855 313059 149397 203061 322359 121019 96213 231724 312019 321699 233019
13384 233019 22997 38506 98373 77007 262026 125825 159419 272518 161843 99092
13374 99092 209798 53695 100760 204419 266699 205500 311150 143201 175990 225910 202747
13363B02747J2296J45010N8504N0585r7854j52277j29046p0554J02708K18234
13353C40353J34312p9928K1544L9188J64359o1080k49440k22604K48631k5969
13343C09366j75894J17223O9328M7642J70270j74602k57439j84684k0735K22225
13333A22700J36191o2649Q2741j7405m4273r8780k7162J31089L458Q704J17420
13322C52034o9207Q2303o7816q9032q9792j61k30280j35515L36734k4241j79946
$$ plain form
13363 202747 215043 360053 418557 469142 371288 219011 89965 19411 122119 340353
13353 340353 474665 394737 416281 455469 619828 558748 309308 86704 335335 309366
13343 309366 133472 250695 320023 367665 537935 363333 105894 -78790 -99525 122700
13333 122700 258891 196242 278983 261578 217305 118525 91363 222452 225910 234614 352034
13322 352034 282827 365130 297314 208282 118490 118329 -111951 -247466 89268 65027 -114919
$$ [...]
##END NTUPLES=NMR SPECTRUM
##END=
