##TITLE=Analysis number 317828
Compound Code cc 48616
Book Reference 414/192
Project Code adrs
Chemist Name mattw
##JCAMPDX= 6.0         $$ Bruker NMR JCAMP-DX V2.0
##DATA TYPE= NMR SPECTRUM
##DATA CLASS= NTUPLES
##ORIGIN= Bruker BioSpin GmbH
##OWNER= nmr
$$ XWIN-NMR		Version 3.5
$$ Mon Mar  6 15:50:58 2006 GMT Standard Time (UT+0h)  MAYBRIDGE\nmr@NMR_250MHZ
##.OBSERVE FREQUENCY= 250.131544655141
##.OBSERVE NUCLEUS= ^1H
##.ACQUISITION MODE= SIMULTANEOUS (DQD)
##.ACQUISITION SCHEME= undefined
##.AVERAGES= 16
##.DIGITISER RES= 18
##SPECTROMETER/DATA SYSTEM= dpx250
##.PULSE SEQUENCE= zg30
##.SOLVENT NAME= CDCl3
##.SHIFT REFERENCE= (INTERNAL, CDCl3, 0, 16.522)
##AUDIT TRAIL= $$ (NUMBER, WHEN, WHO, WHERE, WHAT)
$$ ##TITLE= Audit trail, XWIN-NMR		Version 3.5
$$ ##JCAMPDX= 5.01
$$ ##ORIGIN= Bruker BioSpin GmbH
$$ ##OWNER= nmr
$$ C:\u/data/dgb/nmr/ADRS/130/pdata/1/auditp.txt
$$ ##AUDIT TRAIL=  $$ (NUMBER, WHEN, WHO, WHERE, WHAT)
(   1,<2006-03-06 15:50:33.74 +000>,<MAYBRIDGE\nmr>,<NMR_250MHZ>,
      <created by zg, POWCHK disabled, PULCHK disabled
       configuration hash MD5:
       84 BC 41 DB A1 6E 1D 46 DA 25 12 A5 C1 ED C5 3A
       data hash MD5: 64K
       71 02 B6 8D 0D 43 47 8C 87 86 A5 AA D4 54 FC AC>)
(   2,<2006-03-06 15:50:47.76 +000>,<MAYBRIDGE\nmr>,<NMR_250MHZ>,
      <Start of raw data processing
       ef LB = 0.3 FT_mod = 6 PKNL = 1 SI = 32K 
       data hash MD5: 32K
       23 0F 4A 0A E6 42 0C F6 27 E1 F6 95 1A 43 73 C3>)
(   3,<2006-03-06 15:50:49.48 +000>,<MAYBRIDGE\nmr>,<NMR_250MHZ>,
      <apk 
       data hash MD5: 32K
       0B 6A E1 07 0E AA 82 64 AD 25 CF B2 62 C9 A1 53>)
(   4,<2006-03-06 15:50:50.21 +000>,<MAYBRIDGE\nmr>,<NMR_250MHZ>,
      <abs ABSG = 5 
       data hash MD5: 32K
       38 58 B1 BC 4B 7E 1F E8 ED 9F A8 59 A0 85 46 80>)
$$ ##END=
$$ 
$$ hash MD5
$$ 0E 22 73 A2 3F B5 41 B6 06 E4 78 10 62 82 21 97
##$RELAX= 
##$RELAX= 
##$RELAX= 
##$RELAX= 
##$RELAX= 
##$RELAX= 
##$RELAX= 
$$ Bruker specific parameters
$$ --------------------------
##$DU= <C:\u>
##$EXPNO= 130
##$NAME= <ADRS>
##$PROCNO= 1
##$TYPE= <nmr>
##$USER= <dgb>
##$AMP= (0..31)
100 100 100 100 100 100 100 100 100 100 100 100 100 100 100 100 100 100 
100 100 100 100 100 100 100 100 100 100 100 100 100 100 
##$AQSEQ= 0
##$AQ_mod= 3
##$AUNM= <au_zg>
##$AUTOPOS= <2 >
##$BF1= 250.13
##$BF2= 250.13
##$BF3= 250.13
##$BF4= 250.13
##$BF5= 500.13
##$BF6= 500.13
##$BF7= 500.13
##$BF8= 500.13
##$BYTORDA= 1
##$CFDGTYP= 0
##$CFRGTYP= 5
##$CHEMSTR= <none>
##$CNST= (0..31)
1 1 145 1 1 1 1 1 1 1 1 1 1 1 1 1 1 1 1 1 1 1 1 1 1 1 1 1 1 1 1 1 
##$CPDPRG= <>
##$CPDPRG1= <>
##$CPDPRG2= <>
##$CPDPRG3= <>
##$CPDPRG4= <mlev>
##$CPDPRG5= <mlev>
##$CPDPRG6= <mlev>
##$CPDPRG7= <mlev>
##$CPDPRG8= <mlev>
##$CPDPRGB= <>
##$CPDPRGT= <>
##$D= (0..31)
0 1 0 0 0 0 0 0 0 0.06 0 0 0 0 0 0 0.0002 0 0 0 0 0 0 0 0 0 0 0 0 0 0 
0 
##$DATE= 1141660231
##$DBL= (0..7)
120 120 120 120 120 120 120 120 
##$DBP= (0..7)
150 150 150 150 150 150 150 150 
##$DBP07= 0
##$DBPNAM0= <>
##$DBPNAM1= <>
$$ [...]
##$SUBNAM7= <"">
##$SUBNAM8= <"">
##$SUBNAM9= <"">
##$SW= 20.6930455092707
##$SWIBOX= (0..15)
0 0 3 0 0 0 0 0 0 0 0 0 0 0 0 0 
##$SW_h= 5175.983436853
##$TD= 65536
##$TD0= 1
##$TE= 293.16
##$TE2= 300
##$TE3= 300
##$TEG= 300
##$TL= (0..7)
0 120 120 120 120 120 120 120 
##$TP= (0..7)
150 150 150 150 150 150 150 150 
##$TP07= 0
##$TPNAME0= <>
##$TPNAME1= <>
##$TPNAME2= <>
##$TPNAME3= <>
##$TPNAME4= <>
##$TPNAME5= <>
##$TPNAME6= <>
##$TPNAME7= <>
##$TPOAL= (0..7)
0.5 0.5 0.5 0.5 0.5 0.5 0.5 0.5 
##$TPOFFS= (0..7)
0 0 0 0 0 0 0 0 
##$TUNHIN= 0
##$TUNHOUT= 0
##$TUNXOUT= 0
##$USERA1= <user>
##$USERA2= <user>
##$USERA3= <user>
##$USERA4= <user>
##$USERA5= <user>
##$V9= 5
##$VALIST= <valist>
##$VCLIST= <CCCCCCCCCCCCCCC>
##$VD= 0
##$VDLIST= <DDDDDDDDDDDDDDD>
##$VPLIST= <PPPPPPPPPPPPPPP>
##$VTLIST= <TTTTTTTTTTTTTTT>
##$WBST= 1024
##$WBSW= 4
##$XGAIN= (0..3)
0 0 0 0 
##$XL= 0
##$YL= 0
##$YMAX_a= 463582
##$YMIN_a= -620705
##$ZGOPTNS= <>
##$ZL1= 120
##$ZL2= 120
##$ZL3= 120
##$ZL4= 120
##$ABSF1= 16.522
##$ABSF2= -4.171173
##$ABSG= 5
##$ABSL= 3
##$ALPHA= 0
##$AQORDER= 0
##$ASSFAC= 0
##$ASSFACI= 0
##$ASSFACX= 0
##$ASSWID= 0
##$AUNMP= <proc_1d>
##$AZFE= 0.1
##$AZFW= 0.1
##$BCFW= 0
##$BC_mod= 0
##$BYTORDP= 0
##$COROFFS= 0
##$CY= 12.5
##$DATMOD= 1
##$DC= 0
##$DFILT= <>
##$DTYPP= 0
##$F1P= 14.0000005364418
##$F2P= -0.99999901652339
##$FCOR= 0.5
##$FTSIZE= 32768
##$FT_mod= 6
##$GAMMA= 0
##$GB= 0
##$INTBC= 1
##$INTSCL= 1
##$ISEN= 128
##$LB= 0.3
##$LEV0= 0
##$LPBIN= 0
##$MAXI= 10000
##$MC2= 0
##$MEAN= 0
##$ME_mod= 0
##$MI= 0
##$NCOEF= 0
##$NC_proc= -3
##$NLEV= 6
##$NOISF1= 0
##$NOISF2= 0
##$NSP= 0
##$NTH_PI= 0
##$NZP= 0
##$OFFSET= 16.522
##$PC= 1
##$PHC0= 246.3561
##$PHC1= 4.682947
##$PH_mod= 1
##$PKNL= yes
##$PPARMOD= 0
##$PSCAL= 4
##$PSIGN= 0
##$REVERSE= no
##$SF= 250.13
##$SI= 32768
##$SIGF1= 0
##$SIGF2= 0
##$SINO= 400
##$SIOLD= 32768
##$SREGLST= <1H.CDCl3>
##$SSB= 0
##$STSI= 32768
##$STSR= 0
##$SW_p= 5175.98343685301
##$SYMM= 0
##$S_DEV= 0
##$TDeff= 65536
##$TDoff= 0
##$TI= <Analysis number 999999
Compound Code 99
Book Reference 9
Project Code 9>
##$TILT= no
##$TM1= 0
##$TM2= 0
##$TOPLEV= 0
##$USERP1= <user>
##$USERP2= <user>
##$USERP3= <user>
##$USERP4= <user>
##$USERP5= <user>
##$WDW= 1
##$XDIM= 32768
##$YMAX_p= 388757353
##$YMIN_p= -92874
$$ End of Bruker specific parameters
$$ ---------------------------------
##NTUPLES= NMR SPECTRUM
##VAR_NAME=  FREQUENCY,     SPECTRUM/REAL,   SPECTRUM/IMAG
##SYMBOL=    X,             R,               I
##VAR_TYPE=  INDEPENDENT,   DEPENDENT,       DEPENDENT
##VAR_FORM=  AFFN,          ASDF,            ASDF
##VAR_DIM=   32768,         32768,           32768
##UNITS=     HZ,            ARBITRARY UNITS, ARBITRARY UNITS
##FACTOR=    0.157963299565203, 1,           1
##FIRST=     4132.6476996994, 0,             0
##LAST=      -1043.33573715361, 0,           0
##MIN=       -1043.33573715361, -92874,      0
##MAX=       4132.6476996994, 388757353,     0
$$ Real data points
##PAGE= N=1
##DATA TABLE= (X++(R..R)), XYDATA
$$ [...]
$$ plain form
18448 289170 297640 304079 296439 244896 231930 243249 237947 255219 235113 217151 199770 202798
18436 202798 197129 154647 133576 152986 174820 187174 187521 152470 142992 155003 147594 174122
18424 174122 213366 242156 248560 240265 219092 220138 242906 230025 183505 181884 166214 136297
18412 136297 96602 93712 88206 86644 88895 127366 146358 146488 138539 146824 162484 167828 183545
18399 183545 189395 176125 134429 116657 115885 124461 121260 106844 81004 89811 106106 135146 138391
18386 138391 155057 163019 143573 147222 162009 190824 205802 180922 142364 152118 142614 135994
18374 135994 129107 136597 143306 141108 128776 115791 117091 139942 160580 162829 170223 150895 126919
18361 126919 141214 170568 140024 141814 167291 177355 186054 174610 163579 188691 180231 199771
$$ packed form
18448B89170Q470O439p640n1543j2966J1319n302J7272k0106j7962j7381L028
18436B02798n669m2482k1071J9410K1834J2354L47l5051r478J2011p409K6528
18424A74122L9244K8790O404q295k1173J046K2768j2881m6520j621j5670k9917
18412A36297l9695k890n506j562K251L8471J8992J30p949Q285J5660N344J5717
18399A83545N850j3270m1696j7772p72Q576l201j4416k5840Q807J6295K9040L245
18386A38391J6666P962j9446L649J4787K8815J4978k4880l8558R754r504o620
18374A35994o887P490O709k198j2332j2985J300K2851K0638K249P394j9328k3976
18361A26919J4295K9354l0544J790K5477J0064Q699j1444j1031K5112q460J9540
$$ plain form
18349 199771 227991 246083 273986 316188 380309 475016 621630 813193 1156721 1776139 2777111
18338 2777111 4002836 4490491 3986119 3130853 2314344 1750826 1396265 1172947 1003095
18329 1003095 915136 853447 814187 789109 773735 827059 918511 1003609 1073461 1138536 1239531
18318 1239531 1452872 1738955 2163684 2786168 3726194 5181646 7462937 10859643 14861027
18309 14861027 18855692 22813195 24621940 23425400 20864127 17173022 13254525 10002316
18301 10002316 7604232 6024377 5035016 4400615 4022963 3863212 3881985 4133695 4656166
18292 4656166 5555416 7146181 9924709 14608927 21263192 26907223 27185800 23029933
18284 23029933 17619669 12993195 9925146 8173525 7391210 7478590 8421159 9817272 10683754
$$ packed form
18349A99771K8220J8092K7903M2202O4121R4707J46614J91563L43528O19418J000972
18338B777111J225725M87655n04372q55266q16509n63518l54561k23318j69852
18329A003095q7959o1689l9260k5078j5374N3324R1452Q5098O9852O5075J00995
18318A239531K13341K86083M24729O22484R40026J455452K281291L396706M001384
18309A4861027L994665L957503J808745j196540k561273l691105l918497l252209
18301A0002316k398084j579855r89361o34401l77652j59751J8773K51710N22471
18292D656166Q99250J590765K778528M684218O654265N644031K78577m155867
18284B3029933n410264m626474l068049j751621p82315Q7380R42569J396113Q66482
$$ plain form
18275 10683754 11084853 11954467 13977705 16020135 15743079 14187354 12912820 12314968 11743506
18266 11743506 10777783 10089240 10206986 11577367 14075185 16950339 20113500 22817388
18258 22817388 23284530 22447367 21345153 20384781 20014693 20318862 21264730 21212004 19511048
18249 19511048 17134056 14187411 11261980 8926881 7298965 6402083 6061636 6229456
18241 6229456 7040464 8753357 11872206 16563707 20578968 20599451 17556385 13860399 10955443
18232 10955443 9480469 9345969 9888351 10130766 10175314 10748739 12297112 13977731 13723399
18223 13723399 12320622 11103786 10390394 9634806 8274881 6803128 5561736 4666322
18215 4666322 4046690 3633097 3402933 3349495 3478822 3772092 4316833 5182930 6620527
$$ packed form
18275A0683754M01099Q69614K023238K042430k77056j555725j274534n97852n71462
18266A1743506r65723o88543J17746J370381K497818K875154L163161K703888
18258B2817388M67142q37163j102214r60372l70088L04169R45868n2726j700956
18249A9511048k376992k946645k925431k335099j627916q96882l40447J67820
18241F229456Q11008J712893L118849M691501M015261K0483l043066l695986k904956
18232A0955443j474974j34500N42382K42415M4548N73425J548373J680619k54332
18223A3723399j402777j216836p13392p55588j359925j471753j241392q95414
18215D666322o19632m13593k30164n3438J29327K93270N44741Q66097J437597
$$ plain form
18206 6620527 8608592 10672755 12859836 14529879 14322860 13026045 11053283 8632936
18198 8632936 6411653 4700595 3537556 2751973 2251568 1884749 1634265 1444739 1326117
18189 1326117 1229610 1150670 1071436 1003997 955754 918724 930462 959963 1056495 1184630 1282323
18178 1282323 1326663 1367565 1489995 1615910 1567073 1391186 1237628 1095067 1000756 906662
18168 906662 796913 701408 612457 537208 505087 459248 413405 348545 329126 319502 292858
18157 292858 290472 306975 289958 276560 278821 273429 263607 217878 171448 145193 164089 207125
18145 207125 216309 205569 176418 181745 168598 175950 180453 163550 180278 183828 192611 241101 256920
18132 256920 234770 237759 239219 260358 265641 256593 274913 309215 333776 365989 398196 405569
$$ packed form
18206F620527J988065K064163K187081J670043k07019j296815j972762k420347
18198H632936k221283j711058j163039p85583n00405l66819k50484j89526j18622
18189A326117r6507p8940p9234o7439m8243l7030J1738K9501R6532J28135R7693
18178A282323M4340M0902J22430J25915m8837j75887j53558j42561r4311r4094
18168I06662j09749r5505q8951p5249l2121m5839m5843o4860j9419r624k6644
18157B92858k386J6503j7017j3398K261n392r822m5729m6430k6255J8896M3036
18145B07125R184j0740k9151N327j3147P352M503j6903J6728L550Q783M8490J5819
18132B56920k2150K989J460K1139N283r048J8320L4302K4561L2213L2207P373
$$ plain form
18120 405569 461010 557323 645419 738124 870717 1051631 1326848 1724479 2273744 3073410
18110 3073410 4300351 6363524 10286236 18724911 34967714 48422795 42336397 30724248
18102 30724248 19621331 12041852 7975550 5768351 4450644 3588865 2987192 2531559
18094 2531559 2171939 1883780 1671826 1477765 1362111 1270436 1172527 1065177 953058 860541
18084 860541 775333 672524 561023 490730 444442 430473 425058 380450 350971 342306 331390
18073 331390 330365 313241 281601 248299 248304 256243 237688 208405 218786 245431 263249 261064 264341
18060 264341 270523 263765 270036 286286 314666 364779 352233 368484 391939 431440 484566 511975
18048 511975 472186 419527 418064 414559 389600 336483 353168 361677 355413 314994 288305 245277
$$ packed form
18120D05569N5441R6313Q8096R2705J32593J80914K75217L97631N49265P99666
18110C073410J226941K063173L922712Q438675J6242803J3455081o086398j1612149
18102C0724248j1102917p579479m066302k207199j317707q61779o01673m55633
18094B531559l59620k88159k11954j94061j15654r1675r7909j07350j12119r2517
18084H60541q5208j02809j11501p0293m6288j3969n415m4608k9479q665j0916
18073C31390j025j7124l1640l3302NP939j8555k9283J0381K6645J7818k185L277
18060B64341O182o758O271J6250K8380N0113j2546J6251K3455L9501N3126K7409
18048E11975l9789n2659j463l505k4959n3117J6685Q509o264m0419k6689m3028
$$ plain form
18036 245277 181826 159874 150414 137240 129452 123794 134321 138803 104688 67663 88483 113945
18024 113945 118089 107154 104402 103622 85716 86050 62752 59582 75215 85023 99361 101263 102609
18011 102609 108725 150925 193891 194101 216387 258311 288181 306832 310367 300587 308955 290037 264894
17998 264894 220701 202525 184189 158758 170967 173483 178198 176253 161468 153214 130497 91699
17986 91699 67140 34480 20185 39777 76939 67846 43601 4553 -5479 -7375 -27336 -25996
17974 -25996 -8795 -11553 86 28995 49330 42860 37733 49109 30378 27721 22972 17022 26400
17961 26400 26793 35397 31429 17127 12395 8434 2754 12224 19416 14692 731 -492 -10632 -11634
17947 -11634 -14616 17181 53977 43191 39369 27321 33333 13779 -6640 -9192 -27558 -33679 -26330
$$ packed form
18036B45277o3451k1952r460j3174p788n658J0527M482l4115l7025K0820K5462
18024A13945M144j0935k752p80j7906L34k3298l170J5633R808J4338J902J346
18011A02609O116M2200M2966K10K2286M1924K9870J8651L535r780Q368j8918k5143
17998B64894m4193j8176j8336k5431J2209K516M715j945j4785q254k2717l8798
17986I1699k4559l2660j4295J9592L7162r093k4245l9048j0032j896j9961J340
17974b5996J7201k758J1639K8909K0335o470n127J1376j8731k657m749n950R378
17961B6400L93Q604l968j4302m732l961n680R470P192m724j3961j223j0140j002
17947a1634k982L1797L6796j0786l822j2048O012j9554k0419k552j8366o121P349
$$ plain form
17934 -26330 -43221 -47444 -17838 8563 -5523 -19484 -13107 21023 37347 33667 13171 1316
17922 1316 10142 14198 2093 8501 3622 -2560 -13789 -11888 -12017 -24791 -19784 -13332 4576 632
17908 632 14794 25432 32032 29103 17388 -4387 -14032 -8280 4183 31652 23860 1242 -7228
17895 -7228 -17625 -12965 -563 15842 18247 19362 48879 32914 14950 17558 10063 30141 37267
17882 37267 29639 38670 36866 22014 11346 6769 -375 14760 29250 19612 11495 7818 21152
17869 21152 49875 57934 38255 23264 24943 37417 45569 45531 25360 18621 20327 26971 19985 -2194
17855 -2194 -6537 -12207 -12419 -2855 22927 38997 13496 13193 14772 9168 19352 14598 18857 25435
17841 25435 33485 19401 3150 188 3847 16261 33973 32740 41829 47070 35550 30522 43952
$$ packed form
17934b6330j6891m223K9606K6401j4086j3961O377L4130J6324l680k0496j1855
17922A316Q826M056j2105O408m879o182j1229J901j29j2774N007O452J7908l944
17908F32J4162J0638O600k929j1715k1775r645N752J2463K7469p792k2618q470
17895g228j0397M660J2402J6405K405J115K9517j5965j7964K608p495K0078P126
17882C7267p628R031j804j4852j0668m577p144J5135J4490r638q117l677J3334
17869B1152K8723Q059j9679j4991J679J2474Q152l8k0171o739J706O644o986k2179
17855b194m343n670k12R564K5782J6070k5501l03J579n604J0184m754M259O578
17841B5435Q050j4084j6251k962L659J2414J7712j233R089N241j1520n028J3430
$$ plain form
17828 43952 45404 22999 30636 27716 16237 -5459 5474 8137 4738 1565 -49 -3671 -16664
17815 -16664 -15709 -3720 -6024 -12724 -7196 23199 30043 31315 34241 32251 27234 33658 47617 38972
17801 38972 9663 -12670 -9483 7024 18257 -5075 1195 11575 17624 29083 58198 59836
17789 59836 73947 68205 69764 65545 62668 71348 65490 34435 14349 8308 12037 25124 48626
17776 48626 85374 112193 114480 133279 141918 130835 103354 106137 73295 60335 71237 45813
17764 45813 49093 32924 12910 17046 29577 9488 7779 19390 40718 59698 56972 23426
17752 23426 15970 43029 50728 48585 55783 41980 67024 79265 72083 94366 100070 94928 95782
17739 95782 88088 88636 88025 95016 118834 140369 130776 113858 107790 93360 78772 70445 81843
$$ packed form
17828D3952J452k2405P637k920j1479k1696J0933K663l399l173j614l622j2993
17815a6664R55J1989k304o700N528L0395O844J272K926j990n017O424J3959q645
17801C8972k9309k2333L187J6507J1233k3332O270J0380O049J1459K9115J638
17789E9836J4111n742J559m219k877Q680n858l1055k0086o041L729J3087K3502
17776D8626L6748K6819K287J8799Q639j1083k7481K783l2842j2960J0902k5424
17764D5813L280j6169k0014M136J2531k0089j709J1611K1328J8980k726l3546
17752B3426p456K7059P699k143P198j3803K5044J2241p182K2283N704n142Q54
17739I5782p694N48o11O991K3818K1535r593j6918o068j4430j4588q327J1398
$$ plain form
17726 81843 76257 75196 75906 93302 130486 133017 97030 46815 -14272 -40974 -34473 -26467 -16569
17713 -16569 5296 25188 26083 42038 25887 30963 35153 9417 25679 65367 85235 80953 89194
17700 89194 89090 83446 86691 76231 57282 44800 52209 37552 29394 79451 99370 82534 74329
17687 74329 76135 78936 104383 100689 77299 55547 51503 50129 44299 26073 -9707 -34760 -34465
17674 -34465 -28966 -12152 -4397 -1170 -15760 -11082 -15449 -12891 -13080 -15328 -13076 -46784 -46278 -10604
17660 -10604 -16018 1541 18937 16142 -5200 -4595 13759 17233 19099 3437 -25647 -45591 -28687
17647 -28687 13243 26455 50989 53560 42342 51013 57620 49853 34552 948 8669 33221 33569
17634 33569 30029 25129 22936 6003 -313 -4253 -14338 -3621 1425 13730 -254 -12179 -26911
$$ packed form
17726H1843n586j061P10J7396L7184K531l5987n0215o1087k6702O501Q006R898
17713a6569K1865J9892Q95J5955j6151N076M190k5736J6262L9688J9868m282Q241
17700H9194j04n644L245j0460j8949j2482P409j4657q158N0057J9919j6836q205
17687G4329J806K801K5447l694k3390k1752m044j374n830j8226l5780k5053K95
17674c4465N499J6814P755L227j4590M678m367K558j89k248K252l3708N06L5674
17660a0604n414J7559J7396k795k1342O05J8354L474J866j5662k9084j9944J6904
17647b8687M1930J3212K4534K571j1218Q671O607p767j5301l3604P721K4552L48
17634C3569l540m900k193j6933o316l940j0085J0717N046J2305j3984j1925j4732
$$ plain form
17621 -26911 -14979 -28423 -39463 -24734 -22160 -22178 -7907 1408 13346 4034 17654 32393 23946
17608 23946 34199 26856 5620 -1267 8715 11508 3775 -6958 -5105 14681 17712 30631 32370
17595 32370 22125 25969 36341 29910 16714 9155 11488 15339 32351 56528 64635 60096 38741
17582 38741 22191 3011 -13915 25219 41427 29947 31469 28963 79 -30900 -28173 -49080
17570 -49080 -68511 -52703 -46347 -27403 1295 26387 15747 21173 45600 14863 20689 20290 -4479
17557 -4479 -15043 -2641 -5701 1562 14676 13293 21399 26394 6161 -6582 -2696 -4172 -5710
17544 -5710 -1428 2150 6211 1926 -16797 -12680 -1001 -14385 -16657 -6598 3314 8689 4057 -14664
17530 -14664 -13222 -15137 -7833 -22157 -3396 20904 16696 7357 16383 32376 23325 5647 1852
$$ packed form
17621b6911J1932j3444j1040J4729K574j8J4271R315J1938r312J3620J4739q447
17608B3946J0253p343k1236o887R982K793p733j0733J853J9786L031J2919J739
17595C2370j0245L844J0372o431j3196p559K333L851J7012K4177Q107m539k1355
17582C8741j6550j9180j6926L9134J6208j1480J522k506k8884l0979K727k0907
17570d9080j9431J5808O356J8944K8698K5092j0640N426K4427l0737N826l99k4769
17557d479j0564J2402l060P263J3114j383Q106M995k0233j2743L886j476j538
17544e710M282L578M061m285j8723M117J1679j3384k272J0059R912N375m632j8721
17530a4664J442j915P304j4324J8761K4300m208r339R026J5993r051j7678l795
$$ plain form
17517 1852 -15298 -43788 -48022 -27936 -8564 -21567 -16007 -9885 -10967 -5675 -21451 -16886 -3151
17504 -3151 -4423 -6608 -19294 -5506 18622 30577 34460 40944 48160 29420 17210 -4453 1500
17491 1500 -6463 16161 10684 29482 14628 -2494 24017 44309 42436 33164 18150 20613 20385
17478 20385 9156 -9729 -27163 -40699 -24116 -6482 2729 9096 -4367 -6948 -4929 -23311
17466 -23311 -17887 -2843 -7779 -19323 -22509 -12637 9752 28889 9423 -9160 -11327 7344 9198
17453 9198 22716 10758 2968 -6019 -29629 -29976 -17285 36660 47050 45698 42523 40252 70971
17440 70971 109601 200303 215414 177097 122043 55411 17601 16397 9504 18529 20404 6361
17428 6361 -18535 -29264 -7738 6073 12230 11722 5141 -6338 -1308 -8219 -2485 6597 -14349
$$ packed form
17517A852j7150k8490m234K0086J9372j3003N560O122j082N292j5776M565J3735
17504c151j272k185j2686J3788K4128J1955L883O484P216j8740j2210k1663N953
17491A500p963K2624n477J8798j4854j7122K6511K0292j873r272j5014K463k28
17478B0385j1229j8885j7434j3536J6583J7634R211O367j3463k581K019j8382
17466b3311N424J5044m936j1544l186R872K2389J9137j9466j8583k167J8671J854
17453I198J3518j1958p790q987k3610l47J2691N3945J0390j352l175k271L0719
17440G0971L8630R0702J5111l8317n5054o6632l7810j204o893R025J875j4043
17428F361k4896j0729K1526J3811O157n08o581j1479N030o911N734R082k0946
$$ plain form
17415 -14349 -70895 -54035 -17863 -18511 -21524 -15640 416 -9858 -21599 -16253 2671 -4157 -3141
17402 -3141 7935 14425 -8623 -28976 -29447 -17284 -25163 -43043 -51900 -22710 -19915 -29861 -21945
17389 -21945 -41666 -22950 -13313 -11890 19284 31008 18341 19108 27152 29167 29162 18510 2478 -1226
17375 -1226 4093 1819 -12642 -13392 18477 34695 17201 -7657 4044 8662 36714 33881 7216
17362 7216 -15466 -18999 -5324 27676 12166 15587 26889 34591 22756 29832 24714 -666 -15770
17349 -15770 -10396 -293 -16073 -9693 -15119 -25593 -26140 -30307 -6640 5647 11833 -1549 -7954
17336 -7954 2018 -1895 8966 7740 17250 14800 -549 -14971 -12379 20628 46302 19025 -3690
17323 -3690 -18690 -3787 29 6634 -3832 -14631 -320 -16684 -20533 -7767 -20788 -38475
$$ packed form
17415a4349n6546J6860L6172o48l013N884J6056j0274j1741N346J8924o828J016
17402c141J1076O490k3048k0353m71J2163p879j7880q857K9190K795r946P916
17389b1945j9721J8716R637J423L1174J1724j2667P67Q044K015nj0652j6032l704
17375a226N319k274j4461p50L1869J6218j7494k4858J1701M618K8052k833k6665
17362G216k2682l533J3675L3000j5510L421J1302P702j1835P076n118k5380j5104
17349a5770N374J0103j5780O380n426j0474n47m167K3667J2287O186j3382o405
17336g954R972l913J0861j226R510k450j5349j4422K592L3007K5674k7277k2715
17323c690j5000J4903L816O605j0466j0799J4311j6364l849J2766j3021j7687
$$ plain form
17311 -38475 -28694 -17619 -28090 -27457 -29656 -18782 1730 3926 -23782 -21567 -6220 495 10393
17298 10393 2020 -11903 -22991 -37110 -35139 -54422 -71767 -42139 -11413 6555 -7298 -22633
17286 -22633 -55007 -51772 -19052 -10188 4765 3504 -12599 -21414 -20538 -8265 6889 6171 17762
17273 17762 9472 -1171 6277 21355 37056 20743 2606 4999 6904 21130 6384 -2915 10258
17260 10258 20219 18058 5535 11329 19390 12809 726 9139 27252 34184 36222 47073 45713
17247 45713 11513 3720 -5292 -33971 -46692 -48556 -15634 23416 22818 13318 -10711 -24302 -22292
17234 -22292 4286 15661 41779 21741 -1144 -8009 -1924 174 9225 12959 3181 -24374 -45378
17221 -45378 -38889 -27845 -2800 3340 1441 8646 4972 -7951 3613 18963 7853 2644 -4057
$$ packed form
17311c8475R781J1075j0471O33k199J0874K0512K196k7708K215J5347O715R898
17298A0393q373j3923j1088j4119J971j9283j7345K9628L0726J7968j3853j5335
17286b2633l2374L235L2720Q864J4953j261j6103q815Q76J2273J5154p18J1591
17273A7762q290j0643P448J5078J5701j6313j8137K393J905J4226j4746r299J3173
17260A0258R961k161j2523N794Q061o581j2083Q413J8113O932K038J0851j360
17247D5713l4200p793r012k8679j2721j864L2922L9050n98r500k4029j3591K010
17234b2292K6578J1375K6118k0038k2885o865O085K098R051L734r778k7555k1004
17221d5378O489J1044K5045O140j899P205l674j2923J1564J5350j1110n209o701
$$ plain form
17208 -4057 -15926 -29137 -6255 12571 -32122 -48491 -30275 -19199 -30391 -35661 -40948 -19523
17196 -19523 -11455 -8508 5979 9808 402 5524 1469 -13543 -19353 -15717 -14745 -30879 -30692 -40763
17182 -40763 -52316 -35681 -13913 -34817 -44672 -54326 -48912 -37277 -22827 -22598 -2720 2782 2248
17169 2248 10296 13408 -7353 -15262 -12963 -50201 -84102 -86666 -49043 -21360 844 10623 17793
17156 17793 -3764 -25861 -21181 -7851 -29148 -15286 -19062 -14523 936 4545 -20415 -16681 14568
17143 14568 32765 23154 -4729 -4693 -14328 -4789 -14625 -20483 -28013 -18915 -31338 -26930 -22092 -5386
17129 -5386 -6526 -4096 -4568 -9747 -6541 -6086 -40548 -70302 -37183 -13373 -5029 7168 14902 18045
17115 18045 23475 38162 35076 17494 -250 -6043 1410 10523 11797 27385 36426 9304 -12323
$$ packed form
17208d057j1869j3211K2882J8826m4693j6369J8216J1076j1192n270n287K1425
17196a9523Q068K947J4487L829r406N122m055j5012n810L636R72j6134J87j0071
17182d0763j1553J6635K1768k0904r855r654N414J1635J4450K29J9878N502n34
17169B248Q048L112k0761p909K299l7238l3901k564L7623K7683K2204R779P170
17156A7793k1557k2097M680J3330k1297J3862l776M539J5459L609k4960L734L1249
17143A4568J8197r611k7883L6r635R539r836n858p530R098j2423M408M838J6706
17129e386j140K430m72n179L206M55l4462k9754L3119K3810Q344J2197P734L143
17115A8045N430J4687l086j7582j7744n793P453R113J274J5588R041k7122k1627
$$ plain form
17102 -12323 -24881 -38223 -41399 -12377 12989 18070 7427 -2241 32494 45152 41724 18780
17090 18780 23193 13093 -6646 -12401 -636 5011 -20549 -6104 3419 -9879 -14464 -2831 8337
17077 8337 7438 -8269 -6263 -19176 -7982 5567 15508 3802 -19530 -15610 -11629 -20652 -3258
17064 -3258 -8746 -11408 791 1923 -11003 -10145 -1808 10250 4994 -10654 -23952 -8366 -3163
17051 -3163 -25286 -29581 -20847 -8829 -1419 -7001 -12913 -5565 10334 1158 -10388 -23560 121
17038 121 30819 27106 29940 30706 18246 171 4120 20265 11647 1239 -3265 -13231 -18115 -17145
17024 -17145 -15385 -2291 -25219 -24796 -4113 -3908 -7194 6280 8747 25785 6017 -11053 -43643
17011 -43643 -42780 -29502 -40086 -25466 1717 11490 7294 -1229 -1949 -5248 -1821 -7655 -25655 -42403
$$ packed form
17102a2323j2558j3342l176K9022K5366N081j0643r668L4735J2658l428k2944
17090A8780M413j0100j9739n755J1765N647k5560J4445R523j3298m585J1633J1168
17077H337q99j5707K006j2913J1194J3549R941j1706k3332L920L981r023J7394
17064c258n488k662J2199J132j2926Q58Q337J2058n256j5648j3298J5586N203
17051c163k2123m295Q734J2018P410n582n912P348J5899r176j1546j3172K3681
17038A21L0698l713K834P66j2460j8075L949J6145q618j0408m504r966m884R70
17024a7145J760J3094k2928M23K0683K05l286J3474K467J7038j9768j7070l2590
17011d3643Q63J3278j0584J4620K7183R773m196q523p20l299L427n834j8000j6748
$$ plain form
16997 -42403 -77293 -63740 -35940 -22127 -13591 11151 21297 30563 32829 36346 24709 26593 49243
16984 49243 35009 26278 21006 8278 -54 -21719 -35154 -20604 17207 11987 -6679 -3919 8110
16971 8110 45587 53256 47786 45289 30432 14783 -5410 4418 -9963 -30865 -36485 -28486 1887
16958 1887 2745 -493 5690 7036 9974 9291 2790 -6010 -6706 -8553 -1242 3575 -26270 -36135 -33710
16943 -33710 -8154 30091 32843 -5464 -14730 -3066 4728 3829 -12437 -8028 -15058 -36425 -37904
16930 -37904 -14999 -12933 -14641 -13603 -17067 -14395 -19069 -1857 -3368 -21727 -4825 16929 2373
16917 2373 -3848 -11700 8953 -1744 5620 22556 7841 -5550 -11639 -14579 -3079 -1182 -14202
16904 -14202 -6519 4184 -11592 -7869 -20665 -10243 28602 20651 -3504 -13817 -5932 14706
$$ packed form
16997d2403l4890J3553K7800J3813Q536K4742J0146R266K266L517j1637J884K2650
16984D9243j4234q731n272j2728q332k1665j3435J4550L7811n220j8666K760J2029
16971H110L7477P669n470k497j4857j5649k0193R828j4381k0902n620P999L0373
16958A887Q58l238O183J346K938o83o501q800o96j847P311M817k9845r865K425
16943c3710K5556L8245K752l8307r266J1664P794q99j6266M409p030k1367j479
16930c7904K2905K066j708J038l464K672m674J7212j511j8359J6902K1754j4556
16917B373o221p852K0653j0697P364J6936j4715j3391o089k940J1500J897j3020
16904a4202P683J0703j5776L723j2796J0422L8845p951k4155j0313P885K0638
$$ plain form
16892 14706 11113 -21028 -8243 1478 9033 -9191 -29422 -21249 -2035 -2455 -7996 -23589 -11578
16879 -11578 -13111 6605 23895 29989 25951 12482 13325 22755 17684 -10471 -20978 2841 9847
16866 9847 -1401 -9910 -29677 -13512 5456 -1030 12893 20756 6281 12753 8224 13167 16364
16853 16364 36943 39887 20529 -22804 -24011 -12829 -8886 -3580 5650 -11876 -29306 -23424 -25404
16840 -25404 -2421 17073 24688 30136 9445 6822 20538 20163 101 -9028 -25352 -24238 -36396
16827 -36396 -40158 -20383 -9661 -1940 27701 27600 -1340 1468 1021 -7261 -12176 -11578 -19518 2657
16813 2657 -6120 -8396 -12377 -4703 -9659 -41140 -53590 -46275 -27043 -23155 -30044 -36348 -41115 -19695
16799 -19695 1732 11479 18558 10205 2130 1375 4504 8899 28182 27162 37737 35524 33655 20600
$$ packed form
16892A4706l593l2141J2785R721P555j8224k0231Q173J9214m20n541j5593J2011
16879a1578j533J9716J7290O094m038j3469Q43R430n071k8155j0507K3819P006
16866I847j1248q509j9767J6165J8968o486J3923P863j4475O472m529M943L197
16853A6364K0579K944j9358m3333j207J1182L943N306R230j7526j7430N882j980
16840b5404K2983J9494P615N448k0691k623J3716l75k0062r129j6324J114j2158
16827c6396l762J9775J0722P721K9641j01k8940K808m47q282m915N98p940K2175
16813B657q777k276l981P674m956l1481j2450P315J9232L888o889o304m767K1420
16799a9695K1427R747P079q353q075p55L129M395J9283j020J0575k213j869j3055
$$ plain form
16785 20600 13982 15697 8083 621 -16702 -31041 -26823 -20408 -14942 -15429 -7735 -4967 7345 3454
16771 3454 -5870 -16404 -12399 2980 2455 10910 27603 37277 34090 7134 -3315 -6990 -10869 -25132
16757 -25132 -34889 -24678 -17000 11026 6755 -34537 -21840 -17840 -21175 -22055 -33063 -27458 -20695
16744 -20695 -7934 -12371 -20672 -17137 -39925 -41042 -42912 -46847 -48806 -33559 437 17756 3016
16731 3016 -26921 -36674 -24500 -27683 -21122 -10257 -11156 -31016 -33718 -36856 -22257 -12534 -9484 -3289
16717 -3289 12505 30742 15792 -7895 -19511 -32841 -29719 -2170 -7068 -14912 -22342 -11216 8218
16704 8218 28362 18184 25783 39905 17110 11156 3626 -13757 -40235 -58026 -50730 -57015 -50880
16691 -50880 -56012 -48842 -47502 5666 24982 22529 -2468 -16137 4502 20979 10009 -728
$$ packed form
16785B0600o618J715p614p462j7323j4339M218O415N466m87P694K768J2312l891
16771C454r324j0534M005J5379n25Q455J6693R674l187k6956j0449l675l879j4263
16757b5132r757J0211P678K8026m271m1292J2697M000l335q80j1008N605O763
16744b0695J2761m437q301L535k2788j117j870l935j959J5247L3996J7319j4740
16731C016k9937r753J2174l183O561J0865q99j9860k702l138J4599R723L050O195
16717c289J5794J8237j4950k3687j1616j3330L122K7549m898p844p430J1126J9434
16704H218K0144j0178P599J4122k2795n954p530j7383k6478j7791P296o285O135
16691e0880n132P170J340N3168J9316k453k4997j3669K0639J6477j0970j0737
$$ plain form
16679 -728 4574 -7615 -28235 -20837 2917 13187 2074 -16514 -7202 5946 -11635 -58718 -70014
16666 -70014 -40804 6352 11251 -12388 13252 6508 -24700 -55968 -45727 -15489 -6160 -34581
16654 -34581 -39205 -33529 -29179 -16735 -18638 -28096 -33616 -58682 -45043 -20778 -20091 -24689 -18648 -20653
16640 -20653 -18319 -10283 -7565 11851 37860 57841 35754 15280 -7297 -26449 -50487 -48582
16628 -48582 -42928 -40458 -36837 -6505 -3451 -11284 -4771 -1808 -18790 -33109 -35270 -46127 -36688
16615 -36688 -17685 1134 18280 38609 57041 44673 32123 1046 -32453 -33399 -13028 2978
16603 2978 -14830 -11003 -2872 -5794 -47040 -52256 -42804 -32859 -46514 -27310 -36567 -36445 -5331 33092
16589 33092 29364 17434 19756 22687 20845 1236 9875 -4296 2341 18459 27139 -2103 -30382
$$ packed form
16679g28N302j2189k0620P398K3754J0270j1113j8588R312J3148j7581m7083j1296
16666g0014K9210M7156M899k3639K5640o744l1208l1268J0241L0238R329k8421
16654c4581m624N676M350J2444j903r458n520k5066J3639K4265O87m598O041k005
16640b0653K334Q036K718J9416K6009J9981k2087k0474k2577j9152k4038J905
16628d8582N654K470L621L0332L054p833O513K963j6982j4319k161j0857R439
16615c6688J9003J8819J7146K0329J8432j2368j2550l1077l3499r46K0371J6006
16603B978j7808L827Q131k922m1246n216R452R945j3655J9204r257J22L1114L8423
16589C3092l728j1930K322K931j842j9609Q639j4171O637J6118Q680k9242k8279
$$ plain form
16576 -30382 -16910 9422 28057 31702 10306 -13004 -22169 -23081 -18510 -1021 -9373 -33610 -34651
16563 -34651 -21908 -19006 -38473 -35873 -52128 -63168 -48346 -20272 18837 30090 19007 3663
16551 3663 -22318 -14225 -16529 -3785 -8125 -9956 4068 -8957 -20738 7881 5936 21228 16527
16538 16527 14358 25864 11516 16092 17201 22831 6801 3334 6467 6323 22731 19467 30071
16525 30071 16687 -13318 -35504 -15477 5398 -5281 -31481 -35529 -14043 -29806 -27678 -18664
16513 -18664 -23994 -18811 -6035 -200 8963 4183 5542 -13624 -415 -219 -7831 3580 18135
16500 18135 1125 8498 3290 15776 10378 -19487 -17916 -6173 -6499 -20361 -14626 2294 29541
16487 29541 24939 50068 66015 62309 31483 23654 8209 5862 21768 -2323 -22041 -8393
$$ packed form
16576c0382J3472K6332J8635L645k1396k3310r165r12M571J7489q352k4237j041
16563c4651J2743K902j9467K600j6255j1040J4822K8074L9109J1253j1083j5344
16551C663k5981Q093k304J2744m340j831J4024j3025j1781K8619j945J5292m701
16538A6527k169J1506j4348M576J109N630j6030l467L133j44J6408l264J0604
16525C0071j3384l0005k2186K0027K0875j0679k6200m048K1486j5763K128R014
16513a8664n330N183J2776N835R163m780J359j9166J3209J96p612J1411J4555
16500A8135j7010P373n208J2486n398k9865J571J1743l26j3862N735J6920K7247
16487B9541m602K5129J5947l706l0826p829j5445k347J5906k4091j9718J3648
$$ plain form
16475 -8393 7987 -14484 -34662 -29534 -25944 -6581 18518 13553 5889 3331 -5054 -19373 -36191
16462 -36191 -10274 -8694 -8679 -10267 -21191 -28337 -32912 -13461 -8955 -26422 -37746 -26159 -26081 -13731
16448 -13731 -5758 13280 8501 -2989 -20263 -36745 -17854 5411 1312 -12281 -32567 -44636
16436 -44636 -19735 -16818 -20872 -27332 -8409 -24773 -45194 -41684 -30730 -14663 -9439 -22532 -16592
16423 -16592 -22893 -26511 -23413 -12077 -30882 -26958 -25267 -42034 -39869 -54311 -45168 -14196 24108
16410 24108 62562 56628 6836 -26768 -23442 6587 -8861 -23320 -35614 -35599 -15026 -19281 -21460
16397 -21460 -9226 -9787 -4412 -17268 -3798 -5771 -15617 1697 26148 19686 -310 -26281 -17997
16384 -17997 -3777 3330 -15208 -5182 1622 -5707 -2110 11004 30022 42093 34441 19806 20418
$$ packed form
16475h393J6380k2471k0178N128L590J9363K5099m965p664k558q385j4319j6818
16462c6191K5917J580J5j588j0924p146m575J9451M506j7467j1324J1587P8J2350
16448a3731P973J9038m779j1490j7274j6482J8891K3265m099j3593k0286j2069
16436d4636K4901K917m054o460J8923j6364k0421L510J0954J6067N224j3093N940
16423a6592o301l618L098J1336j8805L924J691j6767K165j4442R143L0972L8304
16410B4108L8454n934m9792l3604L326L0029j5448j4459j2294J5K0573m255k179
16397b1460J2234n61N375j2856J3470j973r846J7314K4451o462j9996k5971Q284
16384a7997J4220P107j8538J0026O804p329L597J3114J9018J2071p652j4635O12
$$ plain form
16371 20418 11175 8431 -2731 -11700 -23837 -17604 2526 28975 20477 -3570 -9274 -7961 -3402
16358 -3402 13390 43776 45881 45937 22874 9732 18557 21172 49516 61678 37952 -11068 -17892
16345 -17892 20187 45714 51623 53430 21175 10689 15083 16713 1215 203 30979 22042 8744
16332 8744 21248 12000 1290 -17374 -19706 -7736 3142 8375 10204 1141 -2240 9295 688
16319 688 -8433 4911 22449 -3253 -34345 -31281 -25747 -21493 -29978 -61825 -38956 -9791 -15026
16306 -15026 1653 -6728 -32380 -14467 11157 36816 30243 19610 22170 -10933 -40473 -18333
16294 -18333 1963 -5073 -274 9666 11953 12977 5303 -2644 -19692 -45785 -35081 -9300 -4935
16281 -4935 -12564 -2403 7847 32298 27043 -3847 -13679 21105 17779 -1013 -10379 4475 14343
$$ packed form
16371B0418r243k744j1162q969j2137O233K0130K6449q498k4047n704J313M559
16358c402J6792L0386K105N6k3063j3142Q825K615K8344J2162k3726m9020o824
16345a7892L8079K5527N909J807l2255j0486M394J630j5498j012L0776q937j3298
16332H744J2504r248j0710j8664k332J1970J0878N233J829r063l381J1535q607
16319F88r121J3344J7538k5702l1092L064N534M254q485l1847K2869K9165n235
16306a5026J6679q381k5652J7913K5624K5659o573j0633K560l3103k9540K2140
16294a8333K0296p036M799R940K287J024p674p947j7048k6093J0704K5781M365
16281d935p629J0161J0250K4451n255l0890r832L4784l326j8792r366J4854R868
$$ plain form
16268 14343 -35 2597 -12309 -17933 -5296 -9944 -12503 16422 1571 -2843 -11148 -18484 648
16255 648 12239 2712 842 8341 21762 8483 -10174 -26363 -40296 -23454 -10313 -13658 -18525
16242 -18525 -25853 -33755 -34488 -40617 -24408 -7366 4550 29210 7332 -3824 -51 -5318 5300
16229 5300 32657 27424 17796 7616 -702 4455 27420 40146 23898 31318 44845 52607 55038
16216 55038 43657 18336 10313 7282 40098 32232 14602 -17976 -20656 2677 16315 4302
16204 4302 7003 3430 -21859 -19874 -1275 -1351 -12692 -19757 -13351 -23644 -37852 -21550 -19689 14075
16190 14075 37430 16222 11956 -17911 -22822 -8647 -5234 -17209 -8456 3345 673 8750 10696
16177 10696 10900 18784 -11147 -23250 -37605 -59415 -35138 -13036 -8304 -14612 -35746 -10065 -15192
$$ packed form
16268A4343j4378K632j4906n624J2637m648k559K8925j4851m414q305p336J9132
16255F48J1591r527j870P499J3421j3279j8657j6189j3933J6842J3141l345m867
16242a8525p328p902p33o129J6209J7042J1916K4660k1878j1156L773n267J0618
16229E300K7357n233r628j0180q318N157K2965J2726j6248P420J3527P762K431
16216E5038j1381k5321q023l031L2816p866j7630l2578k680K3333J3638j2013
16204D302K701l573k5289J985J8599p6j1341p065O406j0293j4208J6302J861L3764
16190A4075K3355k1208m266k9867m911J4175L413j1975Q753J1801k672Q077J946
16177A0696K04P884k9931j2103j4355k1810K4277K2102M732o308k1134K5681n127
$$ plain form
16164 -15192 -21780 -9636 3894 -25590 -11600 -16193 -5747 2900 8422 20678 18719 7144 18479
16151 18479 15784 -19651 -37550 -38179 3314 12648 -13052 -24973 -5981 12389 8671 30180 38335
16138 38335 38673 49535 43518 25074 767 -2748 -20322 -15496 -18774 12696 8650 -5379 -15234
16125 -15234 11605 46283 29114 11072 -3564 -23567 -30625 -19850 -4662 -12349 -25636 -23897
16113 -23897 -27748 -12994 -4360 -2148 11674 21902 17896 12765 12868 -2561 -23014 -31157 -6764
16100 -6764 -13981 836 11232 11283 6340 -4755 -32088 -32712 -26112 -21771 -8951 -13624 -14581 2942
16086 2942 -7313 -381 2109 -35478 -41080 -29402 -16639 10124 35347 28430 17477 1371 -13518
16073 -13518 -5065 40845 57283 35435 46998 61679 51627 12779 3924 -15753 -29543 -14760
$$ packed form
16164a5192o588J2144J3530k9484J3990m593J0446Q647N522J2256j959j1575J1335
16151A8479k695l5435j7899o29M1493R334k5700j1921J8992J8370l718K1509Q155
16138C8335L38J0862o017j8444k4307l515j7574M826l278L1470m046j4029r855
16125a5234K6839L4678j7169j8042j4636k0003p058J0775J5188p687j3287J739
16113b3897l851J4754Q634K212J3822J0228m006n131J03j5429k0453q143K4393
16100f764p217J4817J0396N1m943j1095k7333o24O600M341J2820m673r57J7523
16086B942j0255O932K490l7587n602J1678J2763K6763K5223o917j0953j6106j4889
16073a3518Q453M5910J6438k1848J1563J4681j0052l8848q855j9677j3790J4783
$$ plain form
16061 -14760 -7050 -7146 4687 -2316 -6301 1172 25863 42559 34911 38837 45338 44465 22146 20004
16047 20004 9506 2152 11350 37861 21282 22131 30085 16846 -3875 -8189 -8863 3019 5636
16034 5636 -5399 -28354 -19206 -13246 -6698 12152 11014 13955 10599 15585 18473 8601 7862 7104
16020 7104 -21188 -63103 -46664 -29232 -37449 -31569 -21790 -58684 -70724 -55202 -49692 -40024 -34067
16007 -34067 -42996 -56210 -38609 -5022 15701 -6622 7283 21928 33235 10123 -6601 -12725
15995 -12725 -2370 9424 14704 22438 12210 -14956 -49380 -41883 -36627 -30704 -14976 -28424 -33664
15982 -33664 -19901 -15506 -16552 -2678 -4804 2668 14422 7887 10539 30817 23447 12628 17145
15969 17145 -9545 -25583 -14154 -3963 -13167 -42255 -30125 11141 20266 37062 47762 36530
$$ packed form
16061a4760P710r6J1833p003l985P473K4691J6696p648L926O501q73k2319k142
16047B0004j0498p354R198K6511j6579Q49P954j3239k0721m314o74J1882K617
16034E636j1035k2955R148N960O548J8850j138K941l356M986K888r872p39p58
16020G104k8292m1915J6439J7432q217N880R779l6894j2040J5522N510R668N957
16007c4067q929j3214J7601L3587K0723k2323J3905J4645J1307k3112j6724o124
15995a2725J0355J1794N280P734j0228k7166l4424P497N256N923J5728j3448n240
15982c3664J3763M395j046J3874k126P472J1754o535K652K0278p370j0819M517
15969A7145k6690j6038J1429J0191r204k9088J2130M1266R125J6796J0700j1232
$$ plain form
15957 36530 24766 34856 32824 29865 10623 -29754 -29077 -25315 -15581 -7699 -12611 -9625 -26814
15944 -26814 -47343 -34189 -7670 3806 -2547 -22177 -23906 -19622 -9478 6483 651 2688 -3570
15931 -3570 -18865 -18673 -10070 -12320 -45567 -39015 -4982 21315 15106 9299 9938 17370 41362 29994
15917 29994 1669 -9687 -12435 3412 17047 15784 -3465 -22055 -29088 -19512 9700 37176
15905 37176 39284 47038 28554 22687 9902 -7139 11466 35507 26628 8486 17201 28830 25245
15892 25245 12778 3913 11349 44691 33948 11186 13389 7885 6542 19625 3961 -2446 -12224
15879 -12224 -11284 -15573 -14359 -3986 -2788 -4726 -17729 -14606 -2513 9805 -13811 -22501 -5109
15866 -5109 23355 36860 30019 28159 21258 347 -7443 -10277 11210 15482 10462 12758 -15260
$$ packed form
15957C6530j1764J0090k032k959j9242m0377O77L762R734P882m912K986j7189
15944b6814k0529J3154K6519J1476o353j9630j729M284J0144J5961n832K037o258
15931c570j5295J92Q603k250l3247O552L4033K6297o209n807O39P432K3992j1368
15917B9994k8325j1356k748J5847J3635j263j9249j8590p033R576K9212K7476
15905C7176K108P754j8484n867j2785j7041J8605K4041q879j8142Q715J1629l585
15892B5245j2467q865P436L3342j0743k2762K203n504j343J3083j5664o407r778
15879a2224R40m289J214J0373J198j938j3003L123J2093J2318k3616q690J7392
15866e109K8464J3505o841j860o901k0911p790k834K1487M272n020K296k8018
$$ plain form
15853 -15260 -28228 -18087 -10865 6231 23331 27342 16053 38167 30507 6444 14396 22494 14901
15840 14901 15718 19414 18354 18255 31653 32280 -4488 -10460 29401 59323 52515 33111 1752 307
15826 307 26365 8228 -11676 -11689 3526 3894 11119 23552 -20827 -37067 -4927 26314 16503
15813 16503 -471 -22390 -35731 -11560 -7213 -18835 -17654 -6582 -8281 -2486 -17608 -53045
15801 -53045 -58594 -44017 -30774 -4975 14493 8732 6498 18891 12314 1943 -4624 7057 17461
15788 17461 10184 13052 10328 17380 37180 18863 -25571 -52266 -43831 -20025 -225 4757 -10622
15775 -10622 5343 16370 14681 3653 -8264 17189 32584 37702 23084 3933 2163 -1902
15763 -1902 -22994 -19169 -11558 -23644 -30092 -39098 -32069 5046 33720 30323 35519 51788 52047 48760
$$ packed form
15853a5260j2968J0141P222J7096J7100M011j1289K2114p660k4063P952Q098p593
15840A4901Q17L696j060r9J3398O27l6768n972L9861K9922o808j9404l1359j445
15826C07K6058j8137j9904j3J5215L68P225J2433m4379j6240L2140L1241r811
15813A6503j6974k1919j3341K4171M347j1622J181J1072j699N795j5122l5437
15801e3045n549J4577J3243K5799J9468n761k234J2393o577j0371o567J1681J0404
15788A7461p277K868k724P052J9800j8317m4434k6695Q435K3806J9800M982j5379
15775a0622J5965J1027j689j1028j1917K5453J5395N118j4618j9151j770m065
15763a902k1092L825P611j2086o448r006P029L7115K8674l397N196J6269K59l287
$$ plain form
15749 48760 26001 35961 48158 34183 26681 7853 -2485 13938 18598 17100 7311 -7202 744
15736 744 18794 23604 19690 7896 -28561 -39842 -28989 -17856 -12606 -9147 -26169 -38361 -44120
15723 -44120 -30505 -17834 -7905 5215 4188 1847 -22080 -30105 -23482 -29413 -1182 28466 20865
15710 20865 6887 14849 -13126 -22624 -33324 -33219 -2262 -18170 -32112 -34180 -14447 -3088 -11406
15697 -11406 -13099 -4216 5680 2426 -9440 -23480 -1878 -27224 -36091 -53350 -47584 -32464 -7013
15684 -7013 -2988 22171 20771 2994 -23732 -42170 -32593 -19712 -26922 -40872 -44133 -24280 -21841
15671 -21841 -6261 -4747 -3153 8850 15352 17746 15399 4786 -72 16762 28822 12738 -1277
15658 -1277 -9003 5139 -2926 1242 18666 23895 35529 23490 -3514 6922 15304 10628 4347
$$ packed form
15749D8760k2759R960J2197j3975p502j8828j0338J6423M660j498r789j4513P946
15736G44J8050M810l914j1794l6457j1281J0853J1133N250L459j7022j2192n759
15723d4120J3615J2671R929J3120j027k341k3927q025O623n931K8231K9648p601
15710B0865j3978P962k7975r498j0700J05L0957j5908j3942k068J9733J1359q318
15697a1406j693Q883R896l254j1866j4040K1602k5346q867j7259N766J5120K5451
15684g013M025K5159j400j7777k6726j8438R577J2881p210j3950l261J9853K439
15671b1841J5580J514J594J2003O502K394k347j0613m858J6834J2060j6084j4015
15658a277p726J4142q065M168J7424N229J1634j2039k7004J0436Q382m676o281
$$ plain form
15645 4347 3876 -22550 -23887 -32110 -29591 316 -8132 -23029 -6199 29040 20877 299 -9575
15632 -9575 -22791 -22020 -1705 8578 25373 28875 4330 -6986 -13187 -18727 -31348 -18130 -7233
15619 -7233 -19801 -16881 -7505 25089 35431 16668 725 -13872 -15651 -16999 1918 -9093 -9865
15606 -9865 14784 50224 40669 6262 8584 -13624 -7556 -3011 -22607 -16109 -24554 -200 10480
15593 10480 3042 -12867 -20855 -11201 -9493 -31750 -22238 -21255 -34364 -25858 2788 4710 1356 -2957
15579 -2957 4562 -4767 3881 32477 53054 33341 12073 -7987 -13831 -13630 -22933 -395 10133
15566 10133 6906 -8033 -14734 -12696 -17577 1743 20693 18968 -4269 -7630 -3210 -7843 -4373
15553 -4373 28701 58882 35184 7512 -12717 -3007 -3142 -9601 -8147 2958 16183 29305 36417
$$ packed form
15645D347m71k6426j337q223K519K9907q448j4897J6830L5239q163k0578r874
15632i575j3216P71K0315J0283J6795L502k4545j1316o201n540j2621J3218J0897
15619g233j2568K920R376L2594J0342j8763j5943j4597j779j348J8917j1011p72
15606i865K4649L5440r555l4407K322k2208O068M545j9596O498q445K4354J0680
15593A0480p438j5909p988R654J708k2257R512R83j3109Q506K8646J922l354m313
15579b957P519r329Q648K8596K0577j9713k1268k0060n844K01r303K2538J0528
15566A0133l227j4939o701K038m881J9320J8950j725k3237l361M420m633L470
15553d373L3074L0181k3698k7672k0229R710j35o459J454J1105J3225J3122P112
$$ plain form
15540 36417 -8049 -25501 -5532 6199 17816 26339 24921 4509 -15870 -12238 13131 19214
15528 19214 29622 39252 48204 37440 26797 3329 -26750 -41967 -31749 -24463 -9418 6339
15516 6339 18290 17272 -478 -14267 -3146 977 -19667 -32650 -20496 -20661 -21189 -23069 -33930
15503 -33930 -19071 -24079 -22507 11818 16415 13311 46606 16938 -5489 -25284 -21554 -20274 -46356
15490 -46356 -73049 -65788 -16666 35610 37514 17171 -3442 1022 15338 38272 33757 3624
15478 3624 -5663 -12343 -26246 -14752 2598 30155 23026 -3478 6952 23058 3775 -1445 -28057
15465 -28057 -38188 -40172 -18787 -17056 -31010 -43044 -38683 -18450 11788 10449 -19436 -31902
15453 -31902 -29475 -20119 -11962 -2259 -8676 2093 14604 19483 16693 6115 -6418 11262 32015
$$ packed form
15540C6417m4466j7452J9969J1731J1617Q523j418k0412k0379L632K5369O083
15528A9214J0408R630Q952j0764j0643k3468l0079j5217J0218P286J5045J5757
15516F339J1951j018j7750j3789J1121M123k0644j2983J2154j65n28j880j0861
15503c3930J4859n008J572L4325M597l104L3295k9668k2427j9795L730J280k6082
15490d6356k6693P261M9122N2276J904k0343k0613M464J4316K2934m515l0133
15478C624r287o680j3903J1494J7350K7557p129k6504J0430J6106j9283n220k6612
15465b8057j0131j984K1385J731j3954j2034M361K0233L0238j339k9885j2466
15453c1902K427R356Q157R703o417J0769J2511M879k790j0578j2533J7680K0753
$$ plain form
15440 32015 38588 15154 2318 -7302 -10000 -23047 -23092 -21623 -25058 -16249 15371 -12230 -29587
15427 -29587 -31069 -47072 -32688 -19237 -3778 -1707 9704 13078 17497 24477 -12419 -37947 -38202
15414 -38202 -42647 -31463 -16525 -4552 -12085 -2456 23662 24774 -95 -27132 -27543 -23545 -4201
15401 -4201 -13483 -6749 15149 16281 -5325 -34033 -33590 -29781 -55405 -52829 -10125 27161 9279
15388 9279 20840 43034 47423 48781 34320 18831 -22496 -33660 -24848 -6774 3793 -8712
15376 -8712 -7395 -594 -825 8512 28621 29360 36311 28273 18906 -9004 -4052 4807 7276 22041
15362 22041 25459 16323 23638 16646 -1679 8489 9673 27804 31882 41453 -7032 -39712 -49431
15349 -49431 -32664 -37289 -38674 -37185 -18441 -4000 9916 13771 -19668 -24582 -7652 -24601 -22879
$$ packed form
15440C2015O573k3434j2836r620k698j3047m5J469l435Q809L1620k7601j7357
15427b9587j482j6003J4384J3451J5459K071J1411L374M419O980l6896k5528k55
15414c8202m445J1184J4938J1973p533R629K6118J112k4869k7037m11L998J9344
15401d201r282O734K1898J132k1606k8708M43L809k5624K576M2704L7286j7882
15388I279J1561K2194M389J358j4461j5489m1327j1164Q812J8074J0567j2505
15376h712J317O801k31R337K0109P39O951q038r367k7910M952Q859K469J4765
15362B2041L418r136P315o992j8325J0168J184J8131M078R571m8485l2680r719
15349d9431J6767m625j385J489J8744J4441J3916L855l3439m914J6930j6949J722
$$ plain form
15336 -22879 3310 14627 30899 8477 403 -7912 -6809 1673 25188 22398 -4794 -9963 9268
15323 9268 -757 -13247 -12847 -15352 -14616 -25716 -47414 -26897 -9309 23609 34075 21986 27918
15310 27918 30926 14059 17032 1421 -20643 -8647 1236 5933 31862 31480 14933 -3579 -28939
15297 -28939 -45002 -24183 3354 4744 -5122 -4601 -1030 -32019 -29541 -26050 -31676 -26905 -2674
15284 -2674 8203 26577 23280 16511 39252 63919 53476 55169 20897 -14776 -8269 3044 40492
15271 40492 63750 57363 50406 49978 37634 21092 -5525 5980 36559 49190 23020 -6224
15259 -6224 -180 3127 6021 -3812 10680 41855 38188 16374 10830 -32246 -29852 -11812 -13677
15246 -13677 -29327 -11195 7073 -8109 -40384 -54655 -45035 -44555 -45016 -42404 -22332 -22272 -20436 -19283
$$ packed form
15336b2879K6189J1317J6272k2422q074q315J103Q482K3515k790k7192n169J9231
15323I268j0025j2490M00k505P36j1100k1698K0517J7588L2918J0466j2089N932
15310B7918L008j6867K973j5611k2064J1996R883M697K5929l82j6547j8512k5360
15297b8939j6063K0819K7537J390r866N21L571l0989K478L491n626M771K4231
15284b674J0877J8374l297o769K2741K4667j0443J693l4272l5673O507J1313L7448
15271D0492K3258o387o957m28j2344j6542k6617J1505L0579J2631k6170k9244
15259f224O044L307K894r833J4492L1175l667k1814n544m3076K394J8040j865
15246a3677j5650J8132J8268j5182l2275j4271R620M80m61K612K0072O0J836J153
$$ plain form
15232 -19283 -8319 7824 17972 14204 -5926 -12203 -22412 -29209 -30283 -18344 -9142 -6891 15783
15219 15783 9229 -995 -19364 -18773 -22411 -30849 -27562 -38135 -35717 -13079 11055 6085 6319 25583
15205 25583 30443 21383 2540 -10590 -436 -958 -2193 -1702 -20137 -32026 -33566 -32300 -5939
15192 -5939 885 -5592 -7943 -7667 -7369 1519 -23558 -29029 -15496 -10746 7584 4909 18832 33053
15178 33053 5427 -27011 -27548 -18730 1981 23561 33419 12624 1275 -7995 -14725 -1775 9794
15165 9794 -19177 -33926 -37474 -40092 -36998 -48651 -30278 3323 -3299 -39307 -42086 -30662 -21366
15152 -21366 -15922 -10972 -8803 -22125 -34349 -22824 7759 33453 15704 -12247 -31936 -44354
15140 -44354 -27335 5719 1144 -14228 -27991 -48968 -33918 -40853 -34225 -3574 19214 2542
$$ packed form
15232a9283J0964J6143J0148l768k0130o277j0209o797j074J1939R202K251K2674
15219A5783o554j0224j8369N91l638q438L287j0573K418K2638K4134m970K34J9264
15205B5583M860r060j8843j3130J0154n22j235M91j8435j1889j540J266K6361
15192e939O824o477k351K76K98Q888k5077n471J3533M750J8330k675J3923J4221
15178C3053k7626l2438n37Q818K0711K1580R858k0795j1349r270o730J2950J1569
15165I794k8971j4749l548k618L094j1653J8373L3601o622l6008k779J1424R296
15152b1366N444M950K169j3322j2224J1525L0583K5694j7749k7951j9689j2418
15140d4354J7019L3054m575j5372j3763k0977J5050o935O628L0651K2788j6672
$$ plain form
15128 2542 -21180 -29700 -9047 6037 18754 11572 -4969 -16856 -4637 -3522 -161 -3642 -700
15115 -700 8363 12278 33113 35737 11758 -26111 -62253 -49416 -29045 -35266 -37793 -22034 -27840
15102 -27840 -40267 -32214 -34481 -34086 -33188 -36075 -25519 -4793 13199 -889 4285 -3525 -12003 -17796
15088 -17796 -30105 3298 36161 31291 6712 -3823 19147 16985 16342 8100 8127 -3173 -17506
15075 -17506 -29500 -31101 -42520 -52122 -25186 4625 22854 6930 9425 32062 21915 3646
15063 3646 -8230 -23755 -7019 -2854 9463 11661 29406 24244 2716 -30382 -6613 23447
15051 23447 37634 54639 42753 17960 4559 4801 -21756 -5120 5662 -3500 -1633 -8824 1389
15038 1389 5885 22734 3353 -24832 -39310 -25519 2759 7810 13573 35427 51195 30890
$$ packed form
15128B542k3722q520K0653J5084J2717p182j6541j1887J2219J115L361l481K942
15115g00R063L915K0835K624k3979l7869l6142J2837K0371o221k527J5759n806
15102b7840j2427Q053k267L95Q98k887J0556K0726J7992j4088N174p810q478n793
15088a7796j2309L3403L2863m870k4579j0535K2970k162o43q242K7j1300j4333
15075a7506j1994j601j1419r602K6936K9811J8229j5924K495K2637j0147j8269
15063C646j1876j5525J6736M165J2317K198J7745n162k1528l3098K3769L0060
15051B3447J4187J7005j1886k4793j3401K42k6557J6636J0782r162J867p191J0213
15038A389M496J6849j9381k8185j4478J3791K8278N051N763K1854J5768k0305
$$ plain form
15026 30890 19197 20785 -2963 -7169 -15968 -11238 -17035 -9767 -6294 9907 2988 -10030 -19180
15013 -19180 -23606 -2038 17622 17353 16700 -7216 -19087 17429 26083 7571 3646 -3061 2184
15000 2184 -25307 -45587 -37909 -27849 -15733 -16740 -1966 -1414 -25748 -28616 -32353 -31913 -37142 -45324
14986 -45324 -22327 18810 17794 16935 14107 -1459 7460 -3623 -18322 -13429 2401 28017 2078
14973 2078 -1315 -9106 -16309 -32407 -47086 -28419 -11256 -8116 -19414 -809 14402 30243 5442
14960 5442 -5763 -32873 -30602 -22027 -28995 -4594 10167 11134 -14869 -32937 -37295 -29163 -24859
14947 -24859 -19909 -16692 -4516 -19502 -4580 19019 24237 27117 9913 -3285 -7676 10041 8605
14934 8605 12 -2742 -10720 -36889 -27978 -24501 -19970 -7158 -10733 -7533 25530 25035 -5836 -28657
$$ packed form
15026C0890j1693J588k3748m206q799M730n797P268L473J6201o919j3018r150
15013a9180m426K1568J9660k69o53k3916j1871L6516Q654j8512l925o707N245
15000B184k7491k0280P678J0060J2116j007J4774N52k4334k868l737M40n229q182
14986d5324K2997M1137j016q59k828j5566Q919j1083j4699M893J5830K5616k5939
14973B078l393p791p203j6098j4679J8667J7163L140j1298J8605J5211J5841k4801
14960E442j1205k7110K271Q575o968K4401J4761R67k6003j8068m358Q132M304
14947b4859M950L217J2176j4986J4922K3599N218K880j7204j3198m391J7717j436
14934H605q593k754p978k6169Q911L477M531J2812l575L200L3063m95l0871k2821
$$ plain form
14920 -28657 -13245 6954 32879 57268 38825 4872 17812 37984 40837 33679 21263 -1447
14908 -1447 -8518 1911 7826 -26564 -48672 -28960 -14415 -15993 -8755 24497 22399 18807 17779
14895 17779 15430 15615 13794 6149 -9269 -19692 -16392 1063 -1954 -24251 -47734 -27728 10551
14882 10551 10941 10980 -10387 -13608 -5533 -27518 -36537 -34649 -18612 2007 -5141 -10693 -22348 -37183
14868 -37183 -41710 -40752 -32024 -27165 -38330 -33504 -21941 -19885 -33713 -17593 1149 7787 22028
14855 22028 20150 27400 14138 -7044 -18104 -23264 -35998 -53158 -29927 -16561 -23795 -25653 -16733
14842 -16733 -17246 -7208 -9810 -28819 -36174 -19232 -12030 -22199 -8288 7322 -2694 -14220 -16305
14829 -16305 -8546 10761 10936 -7612 -1658 18699 7779 -23731 -29328 -13764 -6319 -13131 667
$$ packed form
14920b8657J5412K0199K5925K4389j8443l3953J2940K0172K853p158j2416k2710
14908a447p071J0429N915l4390k2108J9712J4545j578P238L3252k098l592j028
14895A7779k349J85j821p645j5418j0423L300J7455l017k2297k3483K0006L8279
14882A0551L90L9k1367l221Q075k1985r019J888J6037K0619p148n552j1655j4835
14868c7183m527R58Q728M859j1165M826J1563K056j3828J6120J8742O638J4241
14855B2028j878P250j3262k1182j1060n160j2734j7160K3231J3366p234j858Q920
14842a6733n13J0038k602j9009p355J6942P202j0169J3911J5610j0016j1526k085
14829a6305P759J9307J75j8548N954K0357j0920l1510n597J5564P445o812J3798
$$ plain form
14816 667 8310 1477 14414 22113 15219 17715 20532 16979 25540 18662 -11081 -2591 455 16048
14802 16048 31365 29232 1005 -11345 -3476 -8686 -3047 14179 3720 -5990 -3698 -12552 -17750
14789 -17750 -10430 -21086 -40588 -10564 4411 1429 -4379 -1170 3646 3045 -20675 -30441 -30633 -25262
14775 -25262 -33030 -31778 -21695 -11014 -11774 -12990 -36729 -37390 -5949 18520 6553 -25804 -33460
14762 -33460 -47491 -30177 -15192 -19882 -11373 8038 24471 12012 -10337 -19377 -19206 2947 1693
14749 1693 10122 38447 50576 33450 23699 13920 8017 -11608 -11129 -23738 -25240 -29135 -8817
14736 -8817 -19884 -20549 -1000 3161 -4646 -7008 17227 10839 10894 8268 -23663 -28925 -47222 -47805
14722 -47805 -46767 -29930 -17715 -2323 11537 -9964 -25023 -24729 -8764 -902 7767 -12932 2742
$$ packed form
14816F67P643o833J2937P699o894K496K817l553Q561o878k9743Q490L046J5593
14802A6048J5317k133k8227j2350P869n210N639J7226j0459r710K292q854n198
14789a7750P320j0656j9502L0024J4975k982n808L209M816o01k3720r766j92N371
14775b5262p768J252J0083J0681p60j216k3739o61L1441K4469j1967l2357p656
14762c3460j4031J7314J4985m690Q509J9411J6433j2459k2349r040J71K2153j254
14749A693Q429K8325J2129j7126r751r779n903j9625M79j2609j502l895K0318
14736h817j1067o65J9549M161p807k362K4235o388N5k626l1931n262j8297n83
14722d7805J038J6837J2215J5392J3860k1501j5059K94J5965P862Q669k0699J5674
$$ plain form
14709 2742 27187 44034 47047 45854 33991 10714 -1095 7094 5226 -9361 -24549 -34861 -25597
14696 -25597 -26466 7279 28132 15417 -842 2494 584 -7446 -18928 944 603 -18300 -18127
14683 -18127 -29324 -6042 -30412 -24200 -13740 16596 4691 -6157 -8731 -7721 14088 31950
14671 31950 19080 -17595 -31983 -27785 -27220 -25300 -27289 -35908 -38627 -9323 -18092 -21688 10610
14658 10610 21165 9835 -4168 -10673 -30875 -24712 -14005 -17334 -2291 -6413 -20282 -11573 7986
14645 7986 -1617 -9650 -170 12984 -3071 -8176 9015 13519 -1465 -11640 -18067 -22497 -40936
14632 -40936 -48960 -8062 8703 11703 5040 2941 -3307 -14763 -3292 3389 -3658 -26244 -9927
14619 -9927 2779 4134 8208 119 13996 19360 7577 2676 21811 49196 45317 26700 23070
$$ packed form
14709B742K4445J6847L013j193j1863k3277j1809Q189j868j4587j5188j0312R264
14696b5597q69L3745K0853j2715j6259L336j910q030j1482J9872l41j8903J73
14683a8127j1197K3282k4370O212J0460L0336j1905j0848k574J010K1809J7862
14671C1950j2870l6675j4388M198N65J920j989q619k719K9304q769l596L2298
14658A0610J0555j1330j4003o505k0202O163J0707l329J5043m122j3869Q709J9559
14645G986r603q033R480J3154j6055n105J7191M504j4984j0175o427m430j8439
14632d0936q024M0898J6765L000o663k099o248j1456J1471O681p047k2586J6317
14619i927J2706J355M074q089J3877N364j1783m901J9135K7385l879j8617l630
$$ plain form
14606 23070 8306 23882 8317 -1768 6963 3464 -24889 -29942 -12903 8245 -147 -5814 11031
14593 11031 8552 1301 -4458 11232 -12152 -32274 -8943 3595 -12929 -15516 1463 23096
14581 23096 2095 27586 36304 1491 -12814 12039 22451 13793 29425 34583 31329 25949 30531
14568 30531 9593 -2575 5524 34223 18898 56100 65085 29435 10309 16213 4640 5268 25333
14555 25333 2322 -6921 -25699 -12862 3272 602 -7912 -18923 -44323 -44037 7429 16707 21780
14542 21780 13103 9250 15943 10021 -5087 -24694 -13096 -8492 10405 19746 14321 9003 18122
14529 18122 15868 15006 5325 -18627 -23752 718 7789 20415 34140 11007 10225 -9146 -41655
14516 -41655 -48709 -28083 -4193 14290 11730 -10778 -2791 -1185 259 -14404 -18129 -20657 -20393
$$ packed form
14606B3070j4764J5576j5565j0085Q731l499k8353n053J7039K1148q392n667J6845
14593A1031k479p251n759J5690k3384k0122K3331J2538j6524k587J6979K1633
14581B3096k1001K5491Q718l4813j4305K4853J0412q658J5632N158l254n380M582
14568C0531k0938j2168Q099K8699j5325L7202Q985l5650j9126N904j1573O28K0065
14555B5333k3011r243j8778J2837J6134k670q514j1011k5400K86N1466R278N073
14542B1780q677l853O693n922j5108j9607J1598M604J8897R341n425n318R119
14529A8122k254q62r681k3952n125K4470P071J2626J3725k3133p82j9371l2509
14516d1655p054K0626K3890J8483k560k2508P987J606J444j4663l725k528K64
$$ plain form
14503 -20393 7298 44661 32541 28354 21657 20038 17313 21392 9189 -3614 -21407 -14403 -22363
14490 -22363 -38149 -38334 -28048 -12182 376 4112 652 34225 56267 49595 41615 26399 763
14477 763 -15120 -6436 17525 3061 16054 25627 30681 43192 49048 22970 -11860 5078 24956
14464 24956 24429 10632 -12600 -8262 8553 -10359 -18933 -23865 -18081 9185 7245 25016 4721
14451 4721 1248 14410 28614 23763 9344 19297 41904 23799 5002 10018 -2087 -5893 -12488
14438 -12488 -25358 -35961 -6325 26805 19860 26530 10518 -17032 -36358 -68794 -72211 -33993
14426 -33993 -7475 8254 3775 -7255 -4499 -22319 -14235 -9656 -13874 1894 -13436 23 -4781
14413 -4781 -31536 -38159 -7047 11468 16729 8358 -7909 215 -6427 -24062 -14131 4181 27860
$$ packed form
14503b0393K7691L7363j2120m187o697j619k725M079j2203j2803j7793P004p960
14490b2363j5786j85J0286J5866J2558L736l460L3573K2042o672p980j5216k5636
14477G63j5883Q684K3961j4464J2993R573N054J2511N856k6078l4830J6938J9878
14464B4956n27j3797k3232M338J6815j8912q574m932N784K7266j940J7771k0295
14451D721l473J3162J4204m851j4419R953K2607j8105j8797N016j2105l806o595
14438a2488j2870j0603K9636L3130o945O670j6012k7550j9326l2436l417L8218
14426c3993K6518J5729m479j1030K756j7820Q084M579m218J5768j5330J3459m804
14413d781k6755o623L1112J8515N261q371j6267Q124o642j7635R931J8312K3679
$$ plain form
14400 27860 21111 35325 63707 52495 38036 56368 66518 45303 42103 39427 35718 46375
14388 46375 56819 64616 59951 59091 84319 101699 113069 127424 116603 120010 126950 107228 81365
14375 81365 60165 49744 29335 48975 59400 20483 4678 3640 311 10472 6392 -8041
14363 -8041 -14443 -4077 -610 2277 29094 26036 11146 11026 12329 40321 51992 77714 56107
14350 56107 36148 16286 14571 14136 10197 -17879 -24370 -4595 -15774 -23774 -20643 2753 7941
14337 7941 24330 15324 1261 8778 15465 -1671 -5941 -19387 -23891 -12161 10865 33306 48419
14324 48419 39035 23812 3288 -2830 12002 13453 30170 31642 25104 21017 20392 26005 29026 20581
14310 20581 26623 18299 8821 10338 31895 26054 8101 21610 29464 15453 4572 3203 -8006
$$ packed form
14400B7860o749J4214K8382j1212j4459J8332J0150k1215l200k676l709J0657
14388D6375J0444P797m665q60K5228J7380J1370J4355j0821L407O940j9722k5863
14375H1365k1200j0421k0409J9640J0425l8917j5805j038l329J0161m080j4433
14363h041o402J0366L467K887K6817l058j4890j20J303K7992J1671K5722k1607
14350E6107j9959j9862j715m35l939k8076o491J9775j1179q000L131K3396N188
14337G941J6389r006j4063P517O687j7136m270j3446m504J1730K3026K2441J5113
14324D8419r384j5223k0524o118J4832J451J6717J472o538m087o25N613L021q445
14310B0581O042q324r478J517K1557n841j7953J3509P854j4011j0881j369j1209
$$ plain form
14297 -8006 11895 32527 22072 34296 33991 22274 26153 14231 49087 47013 36823 36323 25958
14284 25958 -7025 -25536 -26216 -12621 866 3473 625 -16523 -39252 -24097 -30546 -6493 -15538
14271 -15538 -31975 -28602 -32292 -39637 -12905 359 -18244 -20612 -7963 -19477 -22716 -35664 -20565
14258 -20565 -4268 13887 25876 18381 491 2577 -2487 -10382 -14505 6320 16224 26066 34953
14245 34953 25737 2493 8166 15350 10316 9098 -1196 -3296 -19007 -21031 -9457 -3109 -3641 -2898
14231 -2898 2340 -1210 -2482 11937 -12756 -243 27188 19511 24353 20887 -1953 -7611 7894
14218 7894 2538 25197 45428 47442 18348 402 -9971 -9533 539 -15441 -31720 -22409 -19751
14205 -19751 -34750 -29084 -19228 -23340 -12470 -10683 -17910 -7836 -11808 -22023 -7791 1144 -2226
$$ packed form
14297h006J9901K0632j0455J2224l05j1717L879j1922L4856k074j0190n00j0365
14284B5958l2983j8511o80J3595J3487K607k848j7148k2729J5155o449K4053r045
14271a5538j6437L373l690p345K6732J3264j8603k368J2649j1514l239j2948J5099
14258b0565J6297J8155J1989p495j7890K086n064p895m123K0825R904R842Q887
14245C4953r216k3244N673P184n034j218j0294k100j5711k024J1574O348n32P43
14231b898N238l550j272J4419k4693J2513K7431p677M842l466k2840n658J5505
14218G894n356K2659K0231K014k9094j7946j0373M38J0072j5980j6279R311K658
14205a9751j4999N666R856m112J0870J787p227J0074l972j0215J4232Q935l370
$$ plain form
14192 -2226 19983 -14187 -16967 -25195 -34496 -53905 -40035 -20650 -3881 21688 31565 20965 3159
14179 3159 -1675 -29790 -16290 11880 25477 27546 9621 -4424 3299 11286 13522 20236 27597
14166 27597 7233 -20568 -23300 -1903 17892 6387 -20380 -15278 -4891 -14983 -17875 -3681
14154 -3681 -16736 -25513 -20137 -17033 -32390 -33773 -8944 10128 21286 11739 17246 15275 24306
14141 24306 39649 13529 3660 -22213 -23659 -21925 -3658 -5229 -3526 -5310 2977 29974 25028
14128 25028 5277 8123 40291 65443 42945 26471 17286 22656 19458 16372 7261 15591 -11867
14115 -11867 -1812 24149 29661 -8013 -30734 -26603 -14407 -23074 -37950 -37587 -31383 -27255 -24538
14102 -24538 3861 12641 28548 35769 23069 28267 15245 8248 4659 -1269 -18168 7438 -5772
$$ packed form
14192b226K2209l4170k780q228r301j9409J3870J9385J6769K5569R877j0600j7806
14179C159m834k8115J3500K8170J3597K069j7925j4045P723P987K236O714P361
14166B7597k0364k7801k732K1397J9795j1505k6767N102J0387j0092k892J4194
14154c681j3055q777N376L104j5357j383K4829J9072J1158r547N507j971R031
14141B4306J5343k6120r869k5873j446J734J8267j571J703j784Q287K6997m946
14128B5028j9751K846L2168K5152k2498j6474r185N370l198l086r111Q330k7458
14115a1867J0055K5961N512l7674k2721M131J2196q667j4876L63O204M128K717
14102b4538K8399Q780J5907P221j2700N198j3022o997l589n928j6899K5606j3210
$$ plain form
14089 -5772 -41699 -42933 -26889 -7747 -15025 -7551 16840 28925 6396 -6061 -2715 -7710 -15071
14076 -15071 -421 1844 -17673 -8675 -9435 5114 19500 22296 7504 -14547 9892 12991 20538
14063 20538 -2834 -14729 -17872 -38963 -27838 -8047 -752 -5324 -6987 17307 22851 2979 -10918
14050 -10918 -8748 -6950 8079 21044 5876 -16765 -30893 -33290 -25417 -4427 177 3039 30969
14037 30969 24701 -29341 -30297 -35683 -24754 -21056 -18123 -17602 -20872 -30729 -12343 374 893 10201
14023 10201 27897 42631 6831 -4945 4877 -1500 -4244 27 20267 35056 29907 24285 24366
14010 24366 19730 -2415 -17257 933 -6047 7505 3073 12309 17256 -5066 -29466 -4795 -6574
13997 -6574 -23758 -5383 15077 23574 6935 629 -2657 13520 15001 -15280 -47296 -28284 -11282
$$ packed form
14089e772l5927j234J6044J9142p278P474K4391J2085k2529j2457L346m995p361
14076a5071J4650K265j9517Q998p60J4549J4386K796j4792k2051K4439L099P547
14063B0538k3372j1895l143k1091J1125J9791P295m572j663K4294N544j9872j3897
14050a0918K170J798J5029J2965j5168k2641j4128k397P873K0990M604K862K7930
14037C0969o268n4042r56n386J0929L698K933N21l270r857J8386J2717N19R308
14023A0201J7696J4734l5800j1776R822o377k744M271K0240J4789n149n622Q1
14010B4366m636k2145j4842J8190o980J3552m432R236M947k2322k4400K4671j779
13997f574j7184J8375K0460Q497j6639o306l286J6177J481l0281l2016J9012J7002
$$ plain form
13984 -11282 -21740 -35457 -13360 1807 11452 -3262 -28750 -37811 -14387 -14983 -8830 6677 -3160
13971 -3160 17880 29330 38039 19493 9500 17243 20830 20743 14583 20554 5021 6364 21473 6201
13957 6201 -2615 3162 1349 -5142 19598 38238 20118 -2371 -11538 -7910 7278 -2960 9271
13944 9271 16129 5013 4700 8322 6582 4420 12940 29621 33709 23842 28690 24532 37515 33771
13930 33771 33998 36704 48099 37465 35214 14039 12341 -11213 -27375 -15645 1344 18561 8213
13917 8213 -24844 -31136 -24230 -30494 -25542 2545 9536 6727 18647 2363 16312 -7326 -55448
13904 -55448 -33140 -18621 -52806 -30879 9798 21069 -1630 -21247 -27157 -35430 -21012 -7403
13892 -7403 3673 26021 27909 39740 19271 -8620 -4924 -7100 895 23048 41268 9495 1325
$$ packed form
13984a1282j0458j3717K2097J5167R645j4714k5488r061K3424n96O153J5507r837
13971c160K1040J1450Q709j8546r993P743L587q7o160N971j5533J343J5109j5272
13957F201q816N777j813o491K4740J8640j8120k2489r167L628J5188j0238J2231
13944I271O858j1116l13L622j740k162Q520J6681M088r867M848m158J2983l744
13930C3771K27K706J1395j0634k251k1175j698k3554j6162J1730J6989J7217j0348
13917H213l3057o292O906o264M952K8087O991k809J1920j6284J3949k3638m8122
13904e5448K2308J4519l4185K1927M0677J1271k2699j9617n910q273J4418J3609
13892g403J1076K2348J888J1831k0469k7891L696k176P995K2153J8220l1773q170
$$ plain form
13879 1325 -6095 -2858 -28598 -36966 -18493 -5466 -13403 2022 17500 5581 -4389 -26370 -31343
13866 -31343 -31798 -30299 -8016 -3203 -7767 -18926 -23408 -20089 -23173 -16907 -8769 -9550 -8813 -23314
13852 -23314 -11056 -6712 339 -12116 -25683 4289 20371 14803 2428 9206 14625 17547 33953
13839 33953 35185 19792 13698 14407 2768 -16138 -8655 -21832 -35190 -23661 -11713 -27438 -51053
13826 -51053 -67307 -60524 -47524 -10860 -3352 -11766 7579 19324 16342 9980 24976 49757 45021
13813 45021 56152 49835 24839 36568 35643 30477 39660 38449 34554 34452 33063 35672 25729 3565
13799 3565 -5740 491 -4677 -1653 1779 3890 -3110 -34329 -38385 -33928 -8758 -7117 -12857 -11774
13785 -11774 -2697 11522 25042 25264 28493 42697 63134 54554 37321 32196 24866 12795 26728
$$ packed form
13879A325p420L237k5740q368J8473J3027p937J5425J5478j1919r970k1981m973
13866c1343m55J499K2283M813m564j1159m482L319l084O266Q138p81P37j4501
13852b3314J2258M344P051j2455j3567K9972J6082n568j2375O778N419K922J6406
13839C3953J232j5393o094P09j1639j8906P483j3177j3358J1529J1948j5725k3615
13826e1053j6254O783J3000L6664P508q414J9345J1745k982o362J4996K4781m736
13813D5021J1131o317k4996J1729r25n166R183j211l895j02j389K609r943k2164
13799C565r305O231n168L024L432K111p000l1219m056M457K5170J641n740J083
13785a1774R077J4219J3520K22L229J4204K0437q580j7233n125p330j2071J3933
$$ plain form
13772 26728 42067 7589 -8800 -12910 3955 7454 2297 -11950 -16311 -6678 -16218 -9743 13634
13759 13634 2313 -11189 -9067 -23406 -26284 -24913 -6237 14230 17707 28946 27594 15110 24075
13746 24075 28421 29894 8720 -4689 2726 -15331 -9676 22289 32342 54027 63307 45361 23326
13733 23326 20275 29456 29228 11902 19101 10904 12133 32706 26381 -668 -17722 -16220 -16582 -2385
13719 -2385 2948 30540 25440 2885 16626 34753 27155 19181 25664 33887 29282 14254 -3211
13706 -3211 19398 20397 8560 5728 14548 24726 14924 50654 64829 49490 39990 44970 29353
13693 29353 18457 11364 4320 -13790 -21847 -15053 1494 11029 9852 -3050 -5657 15412 26422
13680 26422 19409 -12396 -25834 -17981 -21181 -1321 -5433 -5340 4133 -284 1926 -3392 1027 -471
$$ packed form
13772B6728J5339l4478j6389m110J6865L499n157j4247m361R633r540O475K3377
13759A3634j1321j3502K122j4339k878J371J8676K0467L477J1239j352j2484Q965
13746B4075M346J473k1174j3409P415j8057N655L1965J0053K1685R280j7946k2035
13733B3326l051R181k28j7326P199q197J229K0573o325k7049j7054J502l62J4197
13719b385N333K7592n100k2555J3741J8127p598p974O483Q223m605j5028j7465
13706c211K2609R99j1837k832Q820J0178r802L5730J4175j5339r500M980j5617
13693B9353j0896p093p044j8110q057O794J6547R535j177j2902k607K1069J1010
13680B6422p013l1805j3438P853l200J9860m112R3R473m417K210n318M419j498
$$ plain form
13666 -471 3067 4945 8451 -3871 -1808 11356 14325 24162 21858 7140 14569 6347 -7573 -20854
13652 -20854 -9628 -6419 12929 6103 5467 1319 2806 7699 5766 32517 56082 55518 64549 77636
13638 77636 62629 57970 27751 17152 -18647 -36779 -44771 -24031 -6406 -14005 -31784 -37181
13626 -37181 -15689 -15169 -35574 -42310 -27671 -5028 2761 -1078 -6714 -31054 -35195 -15979 -8116
13613 -8116 -10049 -9511 -17629 -11110 -3770 19955 32666 34615 20719 8979 517 3392 19018 5178
13599 5178 -22417 -5840 -2793 -20371 5649 8764 -22386 -35496 -30629 -23836 -10041 8913 -3823
13586 -3823 -6326 12411 19642 20532 -1175 3555 -1946 -6142 24854 39604 30348 13787 11094 13565
13572 13565 33678 61924 73598 31197 -5355 158 5061 5230 -5899 6741 -218 -6188 -15339
$$ packed form
13666d71L538J878L506j2322K063J3164K969R837k304j4718P429q222j3920j3281
13652b0854J1226L209J9348o826o36m148J487M893j933K6751K3565n64R031J3087
13638G7636j5007m659l0219j0599l5799j8132p992K0740J7625p599j7779n397
13626c7181K1492N20k0405o736J4639K2643P789l839n636k4340m141J9216P863
13613h116j933N38q118O519P340K3725J2711J949j3896j1740q462K875J5626j3840
13599E178k7595J6577L047j7578K6020L115l1150j3110M867O793J3795J8954j2736
13586c823k503J8737P231Q90k1707M730n501m196L0996J4750r256j6561k693K471
13572A3565K0113K8246J1674m2401l6552N513M903J69j1129J2640o959n970r151
$$ plain form
13559 -15339 -7579 5818 4261 11450 14822 26314 33718 21065 13335 12512 2963 14585 36049
13546 36049 35696 27856 -3125 -14637 477 18857 4978 1727 8485 28405 37840 27410 20387
13533 20387 8252 -5127 -37030 -32243 90 24816 19844 20914 5730 5776 -7569 2960 12632
13520 12632 32105 28343 38505 28785 11112 -9945 410 11396 18031 18662 15203 -8232 -33587
13507 -33587 -58652 -44331 -16791 -1398 19320 23663 45105 44241 27967 9493 15737 36902
13495 36902 26041 9002 11885 -5538 8380 8490 1324 -10411 4784 12014 -581 2526 11152
13482 11152 21840 32463 47954 49730 33782 31102 43069 31634 21747 4604 -19949 -20442 -11789
13469 -11789 11273 -9644 -2263 10734 -13413 -16694 1279 15566 3723 1990 -19440 -30681
$$ packed form
13559a5339P760J3397j557P189L372J1492P404j2653p730q23r549J1622K1464
13546C6049l53p840l0981j1512J5114J8380j3879l251O758J9920R435j0430p023
13533B0387j2135j3379l1903M787L2333K4726m972J070j5184M6j3345J0529R672
13520A2632J9473l762J0162r720j7673k1057J0355J0986O635O31l459k3435k5355
13507c3587k5065J4321K7540J5393K0718M343K1442q64j6274j8474O244K1165
13495C6902j0861j7039K883j7423J3918J10p166j1735J5195P230j2595L107Q626
13482A1152J0688J0623J5491J776j5948k680J1967j1435r887j7143k4553m93Q653
13469a1789K3062k0917P381J2997k4147l281J7973J4287j1843j733k1430j1241
$$ plain form
13457 -30681 -26112 1478 148 152 20295 17554 24702 8201 -4502 12778 15864 25726 30736 16614
13443 16614 8891 6480 7399 -29163 -35303 -11842 28692 19144 2571 14919 26483 31146 36852
13430 36852 30789 23466 29259 29017 21488 2638 -3500 23401 24923 28421 40871 46115 51307 32967
13416 32967 50655 58347 69314 73813 64822 46143 45604 44115 15562 11578 13645 29046 43891
13403 43891 35221 27893 46340 42696 32609 25254 9093 -297 -4786 -2080 11112 18127 33076
13390 33076 40105 23151 11685 -19407 -15694 372 6409 48257 37718 43855 48672 45815 38143
13377 38143 31088 46641 60302 40760 25152 44571 66843 69047 74792 28829 -16289 -29693
13365 -29693 8238 48895 65973 42786 32622 19863 9856 5436 36634 14047 21782 22734
$$ packed form
13457c0681M569K7590j330MK0143k741P148j6501j2703J7280L086R862N010j4122
13443A6614p723k411R19l6562o140K3461M0534r548j6573J2348J1564M663N706
13430C6852o063p323N793k42p529j8850o138K6901J522L498J2450N244N192j8340
13416C2967J7688P692J0967M499q991j8679n39j489k8553l984K067J5401J4845
13403D3891q670p328J8447l644j0087p355j6161r390m489K706J3192P015J4949
13390C3076P029j6954j1466l1092L713J6066O037M1848j0539O137M817k857p672
13377C8143p055J5553J3661j9542j5608J9419K2272K204N745m5963m5118j3404
13365b9693L7931M0657J7078k3187j0164j2759j0007m420L1198k2587P735R52
$$ plain form
13353 22734 1258 17261 39798 33217 13025 -3673 -18483 -13052 36456 62955 78666 82091
13341 82091 72020 57447 43917 19781 -5625 -12185 24913 65520 62967 56239 35335 27690
13329 27690 21961 23635 -8643 -2301 4339 14596 882 -17914 -31062 -17671 7426 12862 773
13316 773 7244 7592 -7155 21737 13836 -2876 27427 47842 47363 36822 13942 21755 21977 24944
13302 24944 5652 5544 22189 31781 39974 26303 16700 14741 15463 10055 -12646 -4106 18038 46313
13288 46313 70763 76267 93393 95378 64969 49397 34347 34947 51267 35896 39178 32047 21091
13275 21091 20587 26397 25689 35886 11129 -26151 -24825 -17306 11641 11505 -16643 -19113 -1709 23820
13261 23820 16701 25531 27845 8974 19909 29253 18530 9067 31346 42793 35844 23396 9804
$$ packed form
13353B2734k1476J6003K2537o581k0192j6698j4810N431M9508K6499J5711L425
13341H2091j0071j4573j3530k4136k5406o560L7098M0607k553o728k0904p645
13329B7690n729J674l2278O342O640J0257j3714j8796j3148J3391K5097N436j2089
13316G73O471L48j4747K8892p901j6712L0303K0415m79j0541k2880P813K22K967
13302B4944j9292j08J6645R592Q193j3671r603j959P22n408k2701Q540K2144K8275
13288D6313K4450N504J7126J985l0409j5572j5050O00J6320j5371L282p131j0956
13275B1091n04N810p08J0197k4757l7280J326P519K8947j36k8148k470J7404K5529
13261B3820p119Q830K314j8871J0935R344j0723r463K2279J1447o949j2448j3592
$$ plain form
13248 9804 3214 16844 30077 14649 9242 18304 30542 57289 63406 65826 59191 55615 51227
13235 51227 45553 37247 41190 44865 52201 52627 34635 27143 38097 45885 48466 36122 18993 16788
13221 16788 12114 21516 11879 13405 11653 16701 37399 24859 26682 21180 -1661 -21358 -22341 15687
13207 15687 33002 34473 35850 26948 12826 1451 31031 31440 34074 29240 39400 34608 21563
13194 21563 16160 21795 35721 34598 34689 41992 39302 46509 50790 19797 -3711 -12731 -24127 7214
13180 7214 33164 53288 45967 31176 25328 19051 41167 61678 65173 49877 46284 50018 66851
13167 66851 67503 34387 37080 59046 55164 57891 29072 4713 9104 39457 39686 27120 26459 20671
13153 20671 29135 53624 65962 58171 70437 72993 77465 73212 69044 87544 102727 107293 87607
$$ packed form
13248I804o590J3630J3233j5428n407R062J2238K6747O117K420o635l576m388
13235E1227n674q306L943L675P336M26j7992p492J0954P788K581j2344j7129k205
13221A6788m674R402r637J526j752N048K0698j2540J823n502k2841j9697r83L8028
13207A5687J7315J471J377q902j4122j1375K9580M09K634m834J0160m792j3045
13194B1563n403N635J3926j123R1P303k690P207M281l0993k3508r020j1396L1341
13180G214K5950K0124p321j4791n848o277K2116K0511L495j5296l593L734J6833
13167F6851O52l3116K693K1966l882K727k8819k4359M391L0353K29j2566o61n788
13153B0671Q464K4489J2338p791J2266K556M472m253m168J8500J5183M566j9686
$$ plain form
13140 87607 50214 36708 37429 34311 59986 59773 46272 35860 59469 82431 71912 67140 62449
13127 62449 49210 44808 35611 47441 38744 33449 13621 18505 39516 49610 35769 34044 56075
13114 56075 57055 63057 61481 57007 37528 14848 20142 53410 40620 26842 11561 28111 46022
13101 46022 44218 41687 50960 60858 55617 44683 31947 48967 72608 57937 37872 13843 3422
13088 3422 -12404 12872 23878 36542 39612 11687 -1434 -2255 4451 22299 33472 15021 -14627
13075 -14627 -5822 17034 34005 34310 63451 62032 41894 22768 4691 -4723 -8181 1725 31522
13062 31522 55102 56041 64234 65588 34972 33208 28425 -10791 -9436 8698 2752 8887 24904
13049 24904 24389 21817 27852 63294 70188 38067 5621 88 24883 8963 3275 4508 27260
$$ packed form
13140H7607l7393j3506P21l118K5675k13j3501j0412K3609K2962j0519m772m691
13127F2449j3239m402r197J1830q697n295j9828M884K1011J0094j3841j725K2031
13114E6075R80O002j576m474j9479k2680N294L3268j2790j3778j5281J6550J7911
13101D6022j804k531R273R898n241j0934j2736J7020K3641j4671k0065k4029j0421
13088C422j5826K5276J1006J2664L070k7925j3121q21O706J7848J1173j8451k9648
13075a4627Q805K2856J6971L05K9141j419k0138j9126j8077r414l458R906K9797
13062C1522K3580R39Q193J354l0616j764m783l9216J355J8134n946O135J6017
13049B4904n15k572O035L5442O894l2121l2446n533K4795j5920n688J233K2752
$$ plain form
13036 27260 30514 23029 20199 17701 20557 21758 28140 32042 15429 23071 56101 66165 77908
13023 77908 70375 76927 99503 114255 100758 70138 78208 98083 85487 71754 62731 50942
13011 50942 55131 60932 56093 76312 80898 64591 65396 70653 90124 116500 110586 76070 67754
12998 67754 66953 39236 22245 57462 81365 83887 87768 73247 69148 61262 68458 72968 92629
12985 92629 80086 88415 99297 122625 143658 155968 139972 99431 81182 86833 102796 114464
12973 114464 116539 112440 129715 136867 127690 141453 175168 166661 167715 213914 262151 330402 411557
12960 411557 531925 627220 675524 666819 611852 521658 436479 373091 349209 311694 263904
12949 263904 259786 271671 296771 299230 296581 309596 330436 373474 373668 376932 373808 410155 448597
$$ packed form
13036B7260L254p485k830k498K856J201O382L902j6613P642L3030J0064J1743
13023G7908p533O552K2576J4752j3497l0620Q070J9875j2596j3733r023j1789
13011E0942M189N801m839K0219M586j6307Q05N257J9471K6376n914l4516q316
12998F7754q01k7717j6991L5217K3903K522L881j4521m099p886P196M510J9661
12985I2629j2543Q329J0882K3328K1033J2310j5996m0541j8249N651J5963J1668
12973A14464K075m099J7275P152r177J3763L3715q507J054M6199M8237O8251Q1155
12960D11557J20368R5295M8304q705n4967r0194q5179o3388k3882l7515m7790
12949B63904m118J1885K5100K459k649J3015K0840M3038J94L264l124L6347L8442
$$ plain form
12936 448597 500812 544980 537705 571774 609478 624370 640084 654942 663491 667253 651843 617056
12924 617056 599127 573919 529114 496157 486087 471105 459568 462346 445629 424481 422813 414047
12912 414047 365899 331246 297272 267331 261180 278491 287984 311859 373965 407508 472900 559555
12900 559555 633686 657930 679554 679663 634224 536793 451111 387755 366275 333092 285648 268281
12888 268281 261105 250966 218218 199166 191007 184440 182930 193992 182058 189325 230627 248876
12876 248876 295939 349813 400308 481705 605897 817993 1064013 1279540 1412153 1428204
12866 1428204 1357713 1222903 1047886 845916 645128 503675 424646 368684 322632 296364
12856 296364 291858 271102 240957 204431 179763 192705 193506 176533 139521 122219 121233 115097 121542
$$ packed form
12936D48597N2215M4168p275L4069L7704J4892J5714J4858Q549L762j5410l4787
12924F17056j7929k5208m4805l2957j0070j4982j1537K778j6717k1148j668q766
12912D14047m8148l4653l3974k9941o151J7311R493K3875O2106L3543O5392Q6655
12900E59555P4131K4244K1624J09m5439r7431q5682o3356k1480l3183m7444j7367
12888B68281p176j0139l2748j9052q159o567j510J1062j1934P267M1302J8249
12876B48876M7063N3874N0495Q1397J24192K12096K46020K15527J32613J6051
12866A428204p0491j34810j75017k01970k00788j41453p9029n5962m6052k6268
12856B96364m506k0756l0145l6526k4668J2942Q01j6973l7012j7302r86o136O445
$$ plain form
12843 121542 129221 138864 103781 98214 84297 72348 90352 97345 113582 118713 146938 144275 115388
12830 115388 107901 119725 109378 116761 125754 113010 99374 77846 83123 63996 60707 62803 66288
12817 66288 72610 80569 90428 116669 118517 119659 119976 134074 119702 96161 94231 103891 99892 104012
12803 104012 122540 149036 148265 131548 148818 197810 177765 142788 111159 81493 83218 98466
12791 98466 105203 92359 100327 127001 120756 103997 98679 116696 128535 120612 105781 132796 114411
12778 114411 127527 164425 158976 147445 175615 191977 187829 168867 178132 191091 178432 154251
12766 154251 157456 156787 168207 183050 182279 160835 147523 171119 197336 202467 195059 223285 217103
12753 217103 222740 223517 210350 222897 257140 269138 247476 235469 223725 209474 186334 179448
$$ packed form
12843A21542P679R643l5083n567j3917j1949J8004O993J6237N131K8225k663k8887
12830A15388p487J1824j0347P383Q993j2744j3636k1528N277j9127l289K096L485
12817F6288O322P959R859K6241J848J142L17J4098j4372k3541j930R660l999M120
12803A04012J8528K6496p71j6717J7270M8992k0045l4977l1629k9666J725J5248
12791I8466O737j2844P968K6674o245j6759n318J8017J1839p923j4831K7015j8385
12778A14411J3116L6898n449j1531K8170J6362m148j8962R265J2959j2659k4181
12766A54251L205o69J1420J4843p71k1444j3312K3596K6217N131p408K8226o182
12753B17103N637P77j3167J2547L4243J1998k1662j2007j1744j4251k3140o886
$$ plain form
12741 179448 177662 192483 173597 162189 152726 172183 177236 196297 240347 251990 245817 246979
12729 246979 226765 213590 229885 246545 255277 271137 253439 221839 217056 207048 219751 248864
12717 248864 300838 319080 316439 329856 330160 318249 323070 330136 332450 358713 369320 364760 339710
12704 339710 342288 345300 308757 292172 319096 342375 323639 295379 289281 291889 299997 314930
12692 314930 301819 271751 276945 293042 315558 312165 292572 284378 269489 266033 278659 287577
12680 287577 279210 257080 271925 282234 289469 291108 288780 263097 235614 244897 271541 280003 272902
12667 272902 262628 296050 320652 331689 329612 318399 329112 318338 328566 346297 343162 339922
12655 339922 320507 340819 340289 357299 373589 390242 402471 410881 419254 417608 440061 488525
$$ packed form
12741A79448j786J4821j8886j1408r463J9457N053J9061M4050J1643o173J162
12729B46979k0214j3175J6295J6660Q732J5860j7698l1600m783j0008J2703K9113
12717B48864N1974J8242k641J3417L04j1911M821P066K314K6263J0607m560k5050
12704C39710K578L012l6543j6585K6924K3279j8736k8260o098K608Q108J4933
12692C14930j3111l0068N194J6097K2516l393j9593q194j4889l456J2626Q918
12680B87577q367k2130J4845J0309P235J639k328k5683k7483R283K6644Q462p101
12667B72902j0274L3422K4602J1037k077j1213J0713j0774J0228J7731l135l240
12655C39922j9415K0312n30J7010J6290J6653J2229Q410Q373j646K2453M8464
$$ plain form
12643 488525 498283 513105 517376 518983 492385 483443 483985 489918 465809 478686 493982 483177 484679
12630 484679 499865 515751 550739 582202 604225 619568 624111 633103 645517 656783 666417 664781
12618 664781 643581 630605 616626 571289 547115 549147 543121 533303 529731 554352 554349 539813 556747
12605 556747 568995 578147 574836 598590 650616 654192 621319 601085 588887 576858 584157 607464
12593 607464 585054 550908 548122 562853 575478 605224 626417 654932 694924 729295 759633 781294
12581 781294 794475 801810 808589 830552 851424 860139 865971 846899 796350 723371 710026 722217
12569 722217 738387 762997 790057 834948 848888 844676 875040 907481 939789 994633 1047611 1056203
12557 1056203 1050499 1072547 1108160 1128368 1145970 1189746 1244710 1307939 1358104 1392083 1433743
$$ packed form
12643D88525R758J4822M271J607k6598q942N42N933k4109J2877J5296j0805J502
12630D84679J5186J5886L4988L1463K2023J5343M543Q992J2414J1266R634j636
12618F64781k1200j2976j3979m5337k4174K032o026r818l572K4621lj4536J6934
12605E56747J2248R152l311K3754N2026L576l2873k0234j2198j2029P299K3307
12593F07464k2410l4146k786J4731J2625K9746K1193K8515L9992L4371L0338K1661
12581G81294J3181P335O779K1963K0872Q715N832j9072n0549p2979j3345J2191
12569G22217J6170K4610K7060M4891J3940m212L0364L2441L2308N4844N2978Q592
12557A056203n704K2048L5613K0208J7602M3776N4964O3229N0165L3979M1660
$$ plain form
12546 1433743 1488989 1538661 1623391 1708299 1804867 1873998 1984432 2090672 2178042 2270152 2394874
12535 2394874 2535333 2655308 2796982 2997726 3257094 3559357 3902172 4307611 4753062
12526 4753062 5254848 5849238 6523290 7268955 8135765 9203208 10570328 12329893 14639065
12517 14639065 17693670 21786987 27311133 34845970 45152364 58936087 76400494 95921539
12509 95921539 112704315 120708375 117611620 106001208 90546275 75356833 62643762
12502 62643762 53045895 46255352 41749651 39097792 37970635 38174940 39594971 42198054
12494 42198054 45922530 50562125 55716384 60971418 65955705 70442633 74552756 78626344
12486 78626344 82995876 87914688 93541413 99750339 106162082 112032470 116561199 118986122
$$ packed form
12546A433743N5246M9672Q4730Q4908R6568O9131J10434J06240Q7370R2110J24722
12535B394874J40459J19975J41674K00744K59368L02263L42815M05439M45451
12526D753062N01786N94390O74052P45665Q66810J067443J367120J759565K309172
12517A4639065L054605M093317N524146P534837J0306394J3783723J7464407J9521045
12509I5921539J6782776Q004060l096755j1610412j5454933j5189442j2713071
12502F2643762r597867o790543m505701k651859j127157K04305J420031K603083
12494D2198054L724476M639595N154259N255034M984287M486928M110123M073588
12486G8626344M369532M918812N626725O208926O411743N870388M528729K424923
$$ plain form
12478 118986122 118872026 116305231 111866963 106328037 100506575 95031980 90280638 86338939
12470 86338939 83152180 80563371 78298647 76017774 73562246 70889182 68061280 65168724
12462 65168724 62480489 60289674 58931639 58918223 60832243 65366672 73564495 86977149
12454 86977149 108039026 140471823 188661956 252564850 320600055 371639163 388757353
12447 388757353 371118507 330533725 280293416 228564928 179765325 137994824 105641420
12440 105641420 82344366 66273227 55336231 47840875 42622765 38805861 35683991
12433 35683991 32765407 29797087 26814750 23938373 21247688 18786777 16627395 14788682
12425 14788682 13263308 12031393 10988670 10114574 9338167 8627493 7990053 7443696 6936415
$$ packed form
12478A18986122j14096k566795m438268n538926n821462n474595m751342l941699
12470H6338939l186759k588809k264724k280873k455528k673064k827902k892556
12462F5168724k688235k190815j358035j3416J914020M534429Q197823J3412654
12454H6977149K1061877L2432797M8190133O3902894O8035205N1039108J7118190
12447C88757353j7638846m0584782n0240309n1728488m8799603m1770501l2353404
12440A05641420k3297054j6071139j0936996p495356n218110l816904l121870
12433C5683991k918584k968320k982337k876377k690685k460911k159382j838713
12425A4788682j525374j231915j042723q74096p76407p10674o37440n46357n07281
$$ plain form
12416 6936415 6525970 6142496 5799952 5495594 5219339 4950381 4727562 4507481 4272634
12407 4272634 4066659 3882556 3704869 3510102 3321246 3122919 2961316 2815448 2687480
12398 2687480 2552222 2404025 2248480 2105142 2027008 1962298 1873001 1773632 1684884 1622902
12388 1622902 1555233 1513241 1480326 1440033 1402961 1356494 1306075 1279049 1271636 1245158 1236410 1210333
12376 1210333 1176874 1124611 1077483 1059882 1039126 1018913 989033 968863 945181 919867 886551
12365 886551 893738 874963 853212 807433 768718 746299 725972 684695 690075 686770 652633 635239
12353 635239 615124 575748 564535 553185 548444 552207 559731 569607 555741 554960 563772 557182 542797
12340 542797 535071 557465 573307 583583 602583 604480 599399 570931 553577 581027 562796 556468
$$ packed form
12416F936415m10445l83474l42544l04358k76255k68958k22819k20081k34847
12407D272634k05975j84103j77687j94767j88856j98327j61603j45868j27968
12398B687480j35258j48197j55545j43338p8134o4710q9297r9369q8748o1982
12388A622902o7669m1992l2915m0293l7072m6467n0419k7026p413k6478q748k6077
12376A210333l3459n2263m7128j7601k0756k0213k9880k0170k3682k5314l3316
12365H86551P187j8775k1751m5779l8715k2419k0327m1277N380l305l4137j7394
12353F35239k0115l9376j1213j1350m741L763P524R876j3866p81Q812o590j4385
12340E42797p726K2394J5842J0276J9000J897n081k8468j7354K7450j8231o328
$$ plain form
12328 556468 538716 522035 509216 494306 460134 392048 344512 300336 276057 239000 190098
12317 190098 175736 151002 154900 176785 186344 191386 193697 219273 228361 241402 239329 219028 210463
12304 210463 199436 184779 165603 133669 117478 109568 126228 126549 123830 119823 135971 150348
12292 150348 146420 158720 191233 204566 189988 190946 178924 168357 177335 170197 160229 144713 130942
12279 130942 123750 125256 105850 83755 83156 119386 151466 115737 101801 121467 128836 122493 118225
12266 118225 85490 68980 78329 91091 102664 84606 96770 106272 71860 63826 54437 13992
12254 13992 -4474 4302 -12610 -33638 8170 27748 51744 84261 94750 89092 94538 109969
12242 109969 114983 127218 146875 152586 154313 167224 163673 146909 137525 112400 92423 87551 75304
$$ packed form
12328E56468j7752j6681j2819j4910l4172o8086m7536m4176k4279l7057m8902
12317A90098j4362k4734L898K1885R559N042K311K5576R088J3041k073k0301q565
12304B10463j1027j4657j9176l1934j6191p910J6660L21k719m007J6148J4377
12292A50348l928J2300L2513J3333j4578R58j2022j0567Q978p138r968j5516j3771
12279A30942p192J506j9406k2095n99L6230L2080l5729j3936J9666P369o343m268
12266A18225l2735j6510R349J2762J1573j8058J2164R502l4412q034r389m0445
12254A3992j8466Q776j6912k1028M1808J9578K3996L2517J0489n658N446J5431
12242A09969N014J2235J9657N711J727J2911l551j6764r384k5125j9977m872j2247
$$ plain form
12229 75304 61634 52341 67021 98650 108628 105636 107544 110003 91047 102875 96947 98451 127959
12216 127959 120148 126589 124283 146469 156043 148292 129075 90944 100513 104254 98064 93188 75235
12203 75235 77012 79601 69918 67752 54506 60667 93464 92741 96320 89334 89739 110810 113579 108468
12189 108468 78741 72662 72547 90791 99034 123786 145449 134029 125562 95000 69110 61965 61787
12176 61787 54665 61117 62072 74845 95937 100262 83122 65891 56178 64387 76765 105756 113863
12163 113863 98461 83798 68776 50600 54679 45357 82034 86736 82747 70936 90408 90492 73671
12150 73671 73893 69080 54810 33997 26476 17468 32419 52851 62807 72814 83567 71872 53652
12137 53652 54437 57989 55365 46165 59536 62904 40616 36606 70963 74245 100431 123457 117154
$$ packed form
12229G5304j3670r293J4680L1629R978k992J908K459j8956J1828n928J504K9508
12216A27959p811O441k306K2186R574p751j9217l8131R569L741o190m876j7953
12203G5235J777K589r683k166j3246O161L2797p23L579o986M05K1071K769n111
12189A08468k9727o079j15J8244Q243K4752K1663j1420q467l0562k5890p145j78
12176F1787p122O452R55J2773K1092M325j7140j7231r713Q209J2378K8991Q107
12163A13863j5402j4663j5022j8176M079r322L6677M702l989j1811J9472Q4j6821
12150G3671K22m813j4270k0813p521r008J4951K0432R956J0007J0753j1695j8220
12137E3652P85L552k624r200J3371L368k2288m010L4357L282K6186K3026o303
$$ plain form
12124 117154 103041 98890 95864 87882 69641 79606 131159 149167 150682 128982 127684 129977 128669
12111 128669 149043 109321 70943 53986 46461 61314 77774 87627 104262 114378 104253 74522
12099 74522 55366 67097 66568 56664 48389 38928 23223 49181 61036 39075 50747 48888 74146
12086 74146 87492 76519 69909 47064 36406 55128 70867 73478 93733 126396 115070 86778
12074 86778 75758 67713 79055 69240 43973 5787 -4729 2611 24313 63485 98513 109491
12062 109491 107214 124060 134601 146033 205252 257907 312527 399746 486283 567985 643123 664713
12050 664713 617046 548238 487044 440763 392207 352425 319293 288651 269723 270466 282017 305336
12038 305336 332473 356340 396423 445906 472351 504930 535446 552145 597000 668513 751989
$$ packed form
12124A17154j4113m151l026p982j8241R965N1553J8008J515k1700j298K293j308
12111A28669K0374l9722l8378j6957p525J4853J6460R853J6635J0116j0125k9731
12099G4522j9156J1731n29r904q275r461j5705K5958J1855k1961J1672j859K5258
12086G4146J3346j0973o610k2845j0658J8722J5739K611K0255L2663j1326k8292
12074H6778j1020q045J1342r815k5267l8186j0516P340K1702L9172L5028J0978
12062A09491k277J6846J0541J1432N9219N2655N4620Q7219Q6537Q1702P5138K1590
12050F64713m7667o8808o1194m6281m8556l9782l3132l0642j8928P43J1551K3319
12038C05336K7137K3867M0083M9483K6445L2579L0516J6699M4855P1513Q3476
$$ plain form
12027 751989 858422 1071910 1327637 1587162 1806905 1907021 1892886 1778391 1602836 1418104
12017 1418104 1240815 1069942 949657 829867 709645 643054 612888 568103 510038 469717
12007 469717 425282 387304 357356 340757 320923 270697 261357 282922 307861 359836 392277 447527
11995 447527 490495 569474 659497 696635 695281 647333 559155 452792 371514 289975 204016
11984 204016 155513 135448 125366 131142 116104 88875 69614 61356 56163 69810 72800 54610
11972 54610 68312 62009 40758 33403 36109 40431 55517 53331 48202 31711 31292 29773 14023
11959 14023 34794 31251 7133 -7944 3771 38061 54641 50192 44099 36283 39567 56405 27385
11946 27385 11029 24207 31629 30421 27701 6657 8065 11878 23450 36390 45014 42720 49508
$$ packed form
12027G51989J06433K13488K55727K59525K19743J00116j4135j14495j75555j84732
12017A418104j77289j70873j20285j19790j20222o6591l0166m4785n8065m0321
12007D69717m4435l7978k9948j6599j9834n0226r340K1565K4939N1975L2441N5250
11995D47527M2968P8979R0023L7138j354m7948q8178j06363q1278q1539q5959
11984B04016m8503k0065j0082N776j5038k7229j9261q258n193J3647K990j8190
11972E4610J3702o303k1251p355K706M322J5086k186n129j6491m19j519j5750
11959A4023K0771l543k4118j5077J1715L4290J6580m449o093p816L284J6838k9020
11946B7385j6356J3178P422j208k720k1044J408L813J1572J2940Q624k294O788
$$ plain form
11933 49508 51416 38998 38484 19514 12206 22617 23237 3155 -10743 -10016 -20641 -58205 -46375
11920 -46375 -32490 -46869 -41219 -23583 7230 28583 19194 3045 -4832 10590 10723 8786 1629
11907 1629 24316 7231 2804 16879 -3448 -19151 -17034 9905 7473 28930 52998 48764 28347
11894 28347 -2156 -1355 2381 27921 40274 33549 40257 49913 59855 70872 45251 16217 4084
11881 4084 8937 12904 40440 44100 17900 16323 30434 23693 10408 17269 32408 43505 13022
11868 13022 -22077 -25493 -27482 -26904 -19887 26824 54890 40156 26393 13774 7326 20423 24005
11855 24005 23623 26497 36786 30709 36887 27040 22959 32989 24003 5642 7761 10316 12404 25563
11841 25563 45423 53058 32883 24593 23020 22695 33918 12075 11487 12229 17281 -1973 15347 37220
$$ packed form
11933D9508J908j2418n14j8970p308J0411O20k0082j3898P27j0625l7564J1830
11920d6375J3885j4379N650J7636L0813K1353r389j6149p877J5422J33j937p157
11907A629K2687j7085m427J4075k0327j5703K117K6939k432K1457K4068m234k0417
11894B8347l0503Q01L736K5540J2353o725O708R656R942J1017k5621k9034j2133
11881D084M853L967K7536L660k6200j577J4111o741j3285O861J5139J1097l0483
11868A3022l5099l416j989N78P017M6711K8066j4734j3763j2619o448J3097L582
11855B4005l82K874J0289o077O178r847m081J0030q986j8361K119K555K088J3159
11841B5563J9860P635k0175q290j573l25J1223k1843n88P42N052j9254J7320K1873
$$ plain form
11827 37220 49064 28328 21472 36185 40487 31362 17526 24773 38523 32188 13993 -1772 -8714
11814 -8714 21130 26435 37811 46022 10913 -7389 5262 3755 -6550 -2797 -11544 -27581 -35604
11801 -35604 -28593 -42374 -32512 3494 7248 4024 8626 -5588 -5206 10303 17111 20934 14991 25454
11787 25454 23645 8845 12433 -14396 -5058 -4629 1953 8102 18900 9234 1178 -5951 -25601 -15558
11773 -15558 -10402 -15230 478 13060 10639 18087 29821 21723 12844 20415 41639 57383 57440 40539
11759 40539 29970 -4680 -19906 -12583 17509 52944 67027 64033 52526 29430 14229 11780
11747 11780 2688 2603 -14280 -20544 -17336 -21001 -17337 -20315 -21831 -27214 -52455 -55545 -44318 -48228
11733 -48228 -33871 -36180 -26193 -15177 -11982 -38422 -43485 -33809 -18008 -21285 -21875 -5736 36427
$$ packed form
11827C7220J1844k0736o856J4713M302r125j3836P247J3750o335j8195j5765o942
11814h714K9844N305J1376Q211l5109j8302J2651j507j0305L753q747j6037q023
11801c5604P011j3781R862L6006L754l224M602j4214L82J5509O808L823n943J0463
11787B5454j809j4800L588k6829R338M29O582O149J0798r666q056p129j9650J0043
11773a5558N156m828J5708J2582k421P448J1734q098q879P571K1224J5744N7j6901
11759D0539j0569l4650j5226P323L0092L5435J4083k994j1507k3096j5201k449
11747A1780r092q5j6883o264L208l665L664k978j516n383k5241l090J1227l910
11733d8228J4357k309R987J1016L195k6440n063R676J5801l277n90J6139M2163
$$ plain form
11720 36427 50789 35480 23287 -2204 -10492 -20207 -8224 -11038 10237 35221 6618 -3734
11708 -3734 20976 28770 43180 31710 26371 1265 16425 28442 28479 32314 23034 14763 12727 -1914
11694 -1914 22941 26353 14173 10695 38660 88487 83831 78280 81378 55890 34548 10720 -20589
11681 -20589 -7121 -12362 -13277 2559 28488 21495 -6235 -7821 -15195 -11538 -27914 -17962 15801
11668 15801 30156 40765 59378 51562 34079 14345 -9879 -23077 -19852 -24175 -14300 -1883
11656 -1883 1810 -2809 14746 25546 6207 5816 21003 15365 13568 16623 29114 29354 32857 32100
11642 32100 -15711 -27681 -10880 4726 17666 27779 24921 32449 50219 29068 4481 -3458
11630 -3458 4552 6454 12690 14908 20696 25245 6990 -19712 -27389 -27339 772 15882 28785 56431
$$ packed form
11720C6427J4362j5309j2193k5491q288r715J1983k814K1275K4984k8603j0352
11708c734K4710P794J4410j1470n339k5106J5160J2017L7L835r280q271k036j4641
11694a914K4855L412j2180l478K7965M9827m656n551L098k5488k1342k3828l1309
11681b0589J3468n241r15J5836K5929o993k7730j586p374L657j6376R952L3763
11668A5801J4355J0609J8613p816j7483j9734k4224j3198L225m323R875J2417
11656a883L693m619J7555J0800j9339l91J5187n638j797L055J2491K40L503p57
11642C2100m7811j1970J6801J5606J2940J0113k858P528J7770k1151k4587p939
11630c458Q010J902O236K218N788M549j8255k6702p677N0K8111J5110J2903K7646
$$ plain form
11616 56431 27900 9379 -11944 -39287 -32794 -1965 29829 37716 38177 39309 19301 -26592 -23752
11603 -23752 -41979 -43291 -41258 -10666 5097 11857 29873 20284 10328 7839 13379 9116 378
11590 378 13393 12343 15115 18259 14072 22661 30632 50479 19787 12080 6401 607 10820 37432
11576 37432 31953 14212 -11536 -44132 -43231 -25828 -8100 30715 38216 46835 27243 37724 17523
11563 17523 18064 36094 46942 16795 -7567 3294 -18574 -26209 -35317 -35026 -25544 -19730 -13129
11550 -13129 -1419 3155 13827 16166 23034 30967 30599 24045 10756 -8626 -11249 -24322 -46527
11537 -46527 -18382 6812 17620 45621 30017 17655 -1188 -7070 -10373 -9395 -8186 -13089 1212
11524 1212 17165 28103 34494 11651 18779 25427 35044 13568 12948 12766 5253 -18699 -16640 -6385
$$ packed form
11616E6431k8531j8521k1323k7343O493L0829L1794P887M61J132k0008m5893K840
11603b3752j8227j312K033L0592J5763O760J8016r589r956k489N540m263q738
11590C78J3015j050K772L144m187Q589P971J9847l0692p707n679n794J0213K6612
11576C7432n479j7741k5748l2596R01J7403J7728L8815P501Q619j9592J0481k0201
11563A7523N41J8030J0848l0147k4362J0861k1868p635r108K91R482N814O601
11550a3129J1710M574J0672K339O868P933l68o554j3289j9382k623j3073k2205
11537d6527K8145K5194J0808K8001j5604j2362j8843n882l303R78J209m903J4301
11524A212J5953J0938O391k2843P128O648R617k1476o20j82p513k3952K059J0255
$$ plain form
11510 -6385 -4499 3129 16 7899 6383 33031 63670 23400 -4566 -9376 -5669 -21300 -12054
11497 -12054 1989 17857 45013 47774 23889 22530 5087 12972 17659 17188 40958 47282 46263
11484 46263 52105 47501 49040 50868 37631 44689 37420 17318 11901 35287 57472 62478 45802
11471 45802 38832 39356 22741 5349 13774 6688 -18178 -13079 7956 29207 23531 10958 12824
11458 12824 19274 26747 6115 -6028 -6872 -1347 11227 15315 14247 21704 19517 19120 42649 53597
11444 53597 24770 -853 1220 15888 25347 62841 71120 39879 22955 37562 31777 -5146
11432 -5146 -4630 -45 14764 25260 20859 23829 28168 49525 58123 22671 30869 18011 37971
11419 37971 39755 11858 -11399 -17405 -49788 -51360 -12355 11876 31788 62826 86025 50125
$$ packed form
11510f385J886P628l113P883j516K6648L0639m0270k7966m810L707j5631R246
11497a2054J4043J5868K7156K761k3885j359j7443P885M687m71K3770O324j019
11484D6263N842m604J539J828j3237P058p269k0102n417K3386K2185N006j6676
11471D5802o970N24j6615j7392Q425p086k4866N099K1035K1251n676j2573J866
11458A2824O450P473k0632j2143q44N525J2574M088j068P457k187l97K3529J0948
11444E3597k8827k5623K073J4668R459L7494Q279l1241j6924J4607n785l6923
11432e146N16M585J4809J0496m401K970M339K1357Q598l5452Q198j2858J9960
11419C7971J784k7897k3257o006l2383j572L9005K4231J9912L1038K3199l5900
$$ plain form
11407 50125 50009 59950 47656 30050 40944 21177 4806 27901 24976 22707 30229 41530 29791
11394 29791 6444 -7281 -13235 11473 9124 13905 26957 13344 -2513 -27576 -20539 6645
11382 6645 30034 47144 40894 20344 -6446 -5209 5102 31813 29738 44664 61739 33517
11370 33517 21434 10673 8551 2549 -6389 -10608 -5762 -7963 7311 2778 17407 21043 21461 19713
11356 19713 21859 6467 -5263 3403 18272 13286 22771 20884 16271 17843 10150 9175 11035 -3846
11342 -3846 -14436 7689 4907 -8066 -22912 -16294 17374 23243 2227 -3107 22461 44077 10231
11329 10231 -9841 19223 34752 30187 29601 40677 23243 -4942 315 26132 38131 32694 47387
11316 47387 56632 27175 35404 55485 67000 69085 70422 84581 83874 75635 59570 37723 14887
$$ packed form
11407E0125j16R941j2294j7606J0894j9767j6371K3095k925k269P522J1301j1739
11394B9791k3347j3725n954K4708k349M781J3052j3613j5857k5063P037K7184
11382F645K3389J7110o250k0550k6790J237J0311K6711k075J4926J7075k8222
11370C3517j2083j0761k122o002q938m219M846k201J5274m533J4629L636M18j748
11356A9713K146j5392j1730Q666J4869m986R485j887m613J572p693r75J860j4881
11342c846j0590K2125k782j2973j4846O618L3668N869k1016n334K5568K1616l3846
11329A0231k0072K9064J5529m565n86J1076j7434k8185N257K5817J1999n437J4693
11316D7387R245k9457Q229K0081J1515K085J337J4159p07q239j6065k1847k2836
$$ plain form
11303 14887 19186 10919 24011 33797 24046 4892 38510 63573 66375 59877 68165 60383 33115
11290 33115 25580 25465 25190 11132 19799 26390 45248 43227 20445 15854 32661 57703 72038
11277 72038 60862 51852 40051 14177 4023 -1872 1935 31395 49567 33177 12759 23162
11265 23162 41518 34706 40295 32587 27730 22724 15779 21902 38384 50800 50135 67794 80748
11252 80748 64265 38577 55578 39001 27972 28812 22205 16747 3511 11755 32422 52426 48103
11239 48103 61129 60875 50283 54003 49816 79701 77981 33576 5524 9361 -4839 -27874 -30250
11226 -30250 -12588 2546 7089 16059 25549 13594 32470 12358 -11912 -1987 678 12972 36780
11213 36780 55638 49652 22987 22878 6464 -9606 -15726 8584 26038 32953 44908 58085 52977
$$ packed form
11303A4887M299q267J3092R786r751j9154L3618K5063K802o498Q288p782k7268
11290C3115p535j15k75j4058Q667O591J8858k021k2782m591J6807K5042J4335
11277G2038j1176r010j1801k5874j0154n895L807K9460J8172j6390k0418J0403
11265B3162J8356o812N589p708m857n006o945O123J6482J2416o65J7659J2954
11252H0748j6483k5688J7001j6577j1029Q40o607n458j3236Q244K0667K0004m323
11239D8103J3026k54j0592L720m187K9885j720m4405k8052L837j4200k3035k376
11226c0250J7662J5134M543Q970R490j1955J8876k0112k4270R925K665J2294K3808
11213C6780J8858n986k6665j09j6414j6070o120K4310J7454O915J1955J3177n108
$$ plain form
11200 52977 58467 49578 35531 39215 53237 42521 38932 25778 26401 18612 20999 11426 9489 5671
11186 5671 5753 10003 -1989 24145 52228 75953 77097 42742 36283 20085 27969 47750 54760
11173 54760 61785 51533 29677 30241 55055 52523 53790 46257 71689 90038 72323 61291 41559
11160 41559 24385 24211 50802 53048 55550 64571 46573 46306 54624 44866 15617 5322 31641
11147 31641 42854 48789 55813 58377 58957 60513 17957 26935 45486 62485 42212 42845 45421 79925
11133 79925 70804 61510 40750 144 64 13050 17569 21886 32065 36662 34794 50819 56605 66777
11119 66777 75203 100415 96873 71562 43848 40026 75364 102048 94780 80703 61106 29628
11107 29628 31226 24722 -1052 -24727 -21559 -7801 -4897 18151 12279 -8967 -20982 10831 23680
$$ packed form
11200E2977N490q889j4047L684J4022j0716l589j3154O23p789K387r573j937l818
11186E671Q2M250j1992K6134K8083K3725J144l4355o459j6198P884J9781P010
11173E4760P025j0252k1856N64K4814k532J267p533K5432J8349j7715j1032j9732
11160D1559j7174j74K6591K246K502R021j7998k67Q318r758k9249j0295K6319
11147C1641J1213N935P024K564N80J556m2556Q978J8551J6999k0273O33K576L4504
11133G9925r121r294k0760m0606q0J2986M519M317J0179M597j868J6025N786J0172
11119F6777Q426K5212l542k5311k7714l822L5338K6684p268j4077j9597l1478
11107B9628J598o504k5774k3675L168J3758K904K3048n872k1246j2015L1813J2849
$$ plain form
11094 23680 38201 37662 27242 38130 90366 104565 94177 89748 91899 84035 60029 42859 40958
11081 40958 61609 45468 47538 76066 80789 75179 54936 23747 16514 26736 36634 37878 44492
11068 44492 69176 90707 107919 107019 134028 182741 220002 259291 285518 267129 207638 150652
11056 150652 132285 122022 109212 87195 102768 108097 91441 85476 68766 68158 69073 91080 83974
11043 83974 70131 73024 91542 98768 88102 102048 85252 69992 101137 135314 164961 203067
11031 203067 235305 252755 275517 290742 306805 346130 406215 492635 546713 554979 551246 567768
11019 567768 538713 481754 421516 378255 352000 339946 319264 312168 325891 325101 342845 355407
11007 355407 364679 389376 393761 397745 393445 399583 408815 432327 427160 420521 441308 487430 528925
$$ packed form
11094B3680J4521n39j0420J0888N2236J4199j0388m429K151p864k4006j7170j901
11081D0958K0651j6141K070K8528M723n610k0243l1189p233J0222R898J244O614
11068D4492K4684K1531J7212r00K7009M8713L7261L9289K6227j8389n9491n6986
11056A50652j8367j0263j2810k2017J5573N329j6656n965j6710o08R15K2007p106
11043H3974j3843K893J8518P226j0666J3946j6796j5260L1145L4177K9647L8106
11031B03067L2238J7450K2762J5225J6063L9325O0085Q6420N4078Q266l733J6522
11019E67768k9055n6959o0238m3261k6255j2054k0682p096J3723p90J7744J2562
11007C55407R272K4697M385L984m300O138R232K3512n167o639K0787M6122M1495
$$ plain form
10994 528925 554294 595990 615336 620116 596674 578880 572853 570027 553627 492536 473226 463722
10982 463722 444380 422856 429501 445998 418639 386696 390980 373608 322330 304168 300306 313164
10970 313164 320131 319632 336384 352978 407535 459598 497251 525652 531940 495421 444182 445076 414095
10957 414095 362229 315993 298548 286780 241440 211729 202229 217429 199960 169174 152977 159299
10945 159299 98604 79987 92823 118942 119652 117230 117964 116426 98505 91209 98438 99778 118429
10932 118429 107229 108985 128015 130936 143148 122423 111850 102025 115334 125377 101839 75340
10920 75340 82373 88679 86707 65103 54926 52676 71366 80505 86017 105771 122544 116374 112010
10907 112010 129083 113201 110441 100288 101661 97573 98709 113420 95078 88912 81977 84732 97882
$$ packed form
10994E28925K5369M1696J9346M780k3442j7794o027k826j6400o1091j9310r504
10982D63722j9342k1524O645J6497k7359l1943M284j7372n1278j8162l862J2858
10970C13164O967m99J6752J6594N4557N2063L7653K8401O288l6519n1239Q94l0981
10957D14095n1866m6236j7445j1768m5340k9711r500J5200j7469l0786j6197O322
10945A59299o0695j8617J2836K6119P10k422P34j538j7921p296P229J340J8651
10932A18429j1200J756J9030K921J2212k0725j0573r825J3309J0043k3538k6499
10920G5340P033O306j972k1604j0177k250J8690R139N512J9754J6773o170m364
10907A12010J7073j5882k760j0153J373m088J136J4711j8342o166o935K755J3150
$$ plain form
10894 97882 75118 55905 66009 84767 103568 115142 108909 107929 120650 126284 121605 124639 121682
10881 121682 126052 125994 135827 157795 155530 147223 151840 132924 110351 113587 114646 146487 170045
10868 170045 162719 158561 171875 170252 168165 158872 166820 179917 167153 154190 148790 162787 176169
10855 176169 176547 179806 184224 189350 168895 163645 163316 169355 165997 149933 154841 167555 177878 196061
10841 196061 205256 200841 190911 184818 204619 208047 206876 219570 225227 229963 240890 264875 270985
10828 270985 261599 236121 223987 225797 237710 256647 246633 220787 211976 229956 239397 202658
10816 202658 181335 186029 209666 226372 192469 174267 178210 201766 222184 206038 213753 220662
10804 220662 220414 213719 238654 261889 263604 248330 229509 258068 254519 258556 259345 248475 254556
$$ packed form
10894I7882k2764j9213J0104J8758J8801J1574o233r80J2721N634m679L034k957
10881A21682M370n8R833K1968k265q307M617j8916k2573L236J059L1841K3558
10868A70045p326m158J3314j623k087r293P948J3097j2764j2963n400J3997J3382
10855A76169L78L259M418N126k0455n250l29O039l358j6064M908J2714J0323J8183
10841A96061R195m415r930o093J9801L428j171J2694N657M736J0927K3985O110
10828B70985r386k5478j2134J810J1913J8937j0014k5846q811J7980R441l6739
10816B02658k1323M694K3637J6706l3903j8202L943K3556K0418j6146P715O909
10804B20662k48o695K4935K3235J715j5274j8821K8559l549M037P89j0870O081
$$ plain form
10791 254556 279656 268839 263159 276487 284030 297134 284731 261454 265491 261087 241687 234478
10779 234478 227165 250391 242784 230101 229651 226738 232126 249683 271285 283179 295093 282705 302713
10766 302713 299902 299656 307977 299536 292791 284999 307783 312487 322589 318282 321690 343807 350404 320002
10752 320002 310653 342154 367092 360908 345411 329796 344171 356781 359246 373771 399072 385399
10740 385399 375666 394693 428275 462258 453508 445552 440240 423192 427252 454243 465479 463217 464828
10727 464828 475504 485594 502766 501455 527956 562610 601207 631012 670090 715612 734079 734126
10715 734126 746916 726606 718225 702917 686560 654741 623019 606191 577779 575117 584912 572337
10703 572337 569697 579009 582155 594922 600928 594175 589590 586144 590144 595222 616200 608752 598968 607129
$$ packed form
10791B54556K5100j0817n680J3328P543J3104j2403k3277M037m404j9400p209
10779B34478p313K3226p607j2683m50k913N388J7557K1602J1894J1914j2388K0008
10766C02713k811k46Q321q441o745p792K2784M704J0102m307L408K2117O597l0402
10752C20002r349L1501K4938o184j5497j5615J4375J2610K465J4525K5301j3673
10740C85399r733J9027L3582L3983q750p956n312j7048M060K6991J1236k262J611
10727D64828J0676J0090J7172j311K6501L4654L8597K9805L9078M5522J8467M7
10715G34126J2790k0310q381j5308j6357l1819l1722j6828k8412k662R795j2575
10703E72337k640R312L146J2767O006o753m585l446M000N078K0978p448r784Q161
$$ plain form
10689 607129 603475 581690 587398 610446 605704 610329 639170 654271 676478 699103 708023 716658 742359
10676 742359 766684 764468 780166 773020 785077 808032 819209 829236 839164 841322 843811 866021
10664 866021 901786 956991 984964 1023217 1051572 1048765 1056268 1094789 1116568 1150378 1201175 1245855
10652 1245855 1285179 1323910 1350833 1369643 1378437 1405491 1488824 1573842 1624087 1705030 1803066
10641 1803066 1887928 1966162 2068208 2203954 2320097 2459531 2592925 2735895 2880174 3034685
10631 3034685 3204761 3377498 3611355 3879717 4181280 4514508 4865908 5304273 5815668
10622 5815668 6408824 7104163 7899070 8822979 9937916 11283557 12880946 14867320 17367584
10613 17367584 20501334 24505628 29670885 36343529 44958742 55908275 69176095 83778378
$$ packed form
10689F07129l654k1785N708K3048m742M625K8841J5101K2207K2625Q920Q635K5701
10676G42359K4325k216J5698p146J2057K2955J1177J0027R928K158K489K2210
10664H66021L5765N5205K7973L8253K8355k807P503L8521K1779L3810N0797M4680
10652A245855L9324L8731K6923J8810Q794K7054Q3333Q5018N0245Q0943R8036
10641A803066Q4862P8234J02046J35746J16143J39434J33394J42970J44279J54511
10631C034685J70076J72737K33857K68362L01563L33228L51400M38365N11395
10622E815668N93156O95339P94907R23909J114937J345641J597389J986374K500264
10613A7367584L133750M004294N165257O672644Q615213J0949533J3267820J4602283
$$ plain form
10605 83778378 97239387 106277212 108567382 104148261 94990985 83743278 72651274 63000365
10597 63000365 55374362 49793435 46110223 44104773 43650606 44706567 47208796 51039842
10589 51039842 55889984 61147727 66037376 69732624 71687269 72038974 71616204 71488297
10581 71488297 72580056 75507849 80570063 87672978 96239583 105099113 112573097 116908530
10573 116908530 116938440 112785260 105676047 97342649 89351521 82766940 78125051 75500652
10565 75500652 74481585 74240844 73704561 71979160 68758077 64330732 59263649 54218522
10557 54218522 49784856 46400598 44276067 43479691 44034586 46051640 49625950 54906780
10549 54906780 61943487 70572324 80177333 89413245 96250512 98526283 95217723 87223479
$$ packed form
10605H3778378J3461009R037825K290170m419121r157276j1247707j1092004r650909
10597F3000365p626003n580927l683212k005450m54167J055961K502229L831046
10589E1039842M850142N257743M889649L695248J954645L51705m22770j27907
10581G1488297J091759K927793N062214P102915Q566605Q859530P473984M335433
10573A16908530K9910m153180p109213q333398p991128o584581m641889k624399
10565G5500652j019067k40741n36283j725401l221083m427345n067083n045127
10557E4218522m433666l384258k124531p96376N54895K017054L574310N280830
10549E4906780P036707Q628837R605009R235912O837267K275771l308560p994244
$$ plain form
10541 87223479 76561314 65307779 54873261 45985420 38698043 32842075 28131497 24357081
10533 24357081 21328158 18841818 16757258 15002121 13520008 12234319 11094971 10101673
10525 10101673 9220685 8439805 7755283 7148234 6595521 6080280 5633088 5237552 4890887
10516 4890887 4587387 4324988 4078219 3860764 3626425 3418753 3250880 3077001 2934478
10507 2934478 2812467 2689271 2573734 2486286 2391484 2289870 2188025 2097481 1985794 1898288
10497 1898288 1807994 1734208 1644937 1566898 1498984 1446489 1398042 1338826 1299463 1261366 1213532
10486 1213532 1142829 1098594 1080995 1098796 1085330 1077983 1028152 942802 895895 868189 838731
10475 838731 816971 797778 771854 766946 772846 779759 759179 714615 674736 657158 641838 625164
$$ packed form
10541H7223479j0662165j1253535j0434518q887841p287377n855968m710578l774416
10533B4357081l028923k486340k084560j755137j482113j285689j139348r93298
10525A0101673q80988p80880o84522o07049n52713n15241m47192l95536l46665
10516D890887l03500k62399k46769k17455k34339k07672j67873j73879j42523
10507B934478j22011j23196j15537q7448r4802j01614j01845r0544j11687q7506
10497A898288r0294p3786q9271p8039o7914n2495m8447n9216l9363l8097m7834
10486A213532p0703m4235j7599J7801j3466p347m9831q5350m6907k7706k9458
10475H38731k1760j9193k5924m908N900O913k0580m4564l9879j7578j5320j6674
$$ plain form
10463 625164 619483 629249 635647 628260 583087 548452 508947 500769 515707 509391 501007 485165 485391
10450 485391 508902 511831 474528 432213 418898 421574 407119 414999 437109 428223 420356 427407 406698
10437 406698 400533 412470 442215 467577 492580 507762 520908 501685 476329 466291 449246 420981
10425 420981 401989 399600 377463 329277 291160 267346 277507 298216 268391 259189 249482 224144
10413 224144 224505 233969 236781 199548 172523 172350 157985 183856 195658 215369 217938 197542 174625
10400 174625 185519 187034 187518 183371 188447 183698 168263 161267 151441 143419 139642 135559 120715 125932
10386 125932 134911 128137 155941 170234 161646 156979 125720 116205 121576 111770 124039 124018 108464
10373 108464 111545 120134 118134 113820 114232 122786 141871 146446 141442 124039 97981 81117 66633
$$ packed form
10463F25164n681R766O398p387m5173l4635l9505q178J4938o316q384j5842K26
10450D85391K3511K929l7303m2315j3315K676j4455P880K2110q886p867P051k0709
10437D06698o165J1937K9745K5362K5003J5182J3146j9223k5356j0038j7045k8265
10425D20981j8992k389k2137m8186l8117k3814J0161K0709k9825r202r707k5338
10413B24144L61R464K812l7233k7025j73j4365K5871J1802J9711K569k0396k2917
10400A74625J0894J515M84m147N076m749j5435o996r826q022l777m083j4844N217
10386A25932Q979o774K7804J4293q588m667l1259r515N371r806J2269k1j5554
10373A08464L081Q589k000m314M12Q554J9085M575n004j7403k6058j6864j4484
$$ plain form
10360 66633 76945 90991 120923 141108 146693 125993 89820 107943 120680 104360 93659 104784
10348 104784 119349 123313 101813 67787 90589 92216 74546 65838 70823 102947 80926 66700
10336 66700 74195 64478 41871 43080 42302 44922 79013 102578 59650 47879 44254 31803 46806
10323 46806 55672 47360 59616 69866 74585 66553 66540 95498 104892 109805 76493 85427 110902 100162
10309 100162 85864 92033 112111 108172 75495 75419 80917 93591 104882 91021 59140 38396 35369
10296 35369 29369 33236 33423 28924 29122 31663 32360 52514 59855 53915 36757 53153 43589 49272
10282 49272 53225 39913 56425 79120 79836 55861 50654 63210 67012 63391 76077 85972 69459
10269 69459 50343 34402 51076 66591 59822 58927 47532 65686 73369 53897 49644 69207 52784
$$ packed form
10360F6633J0312J4046K9932K0185N585k0700l6173J8123J2737j6320j0701J1125
10348A04784J4565L964k1500l4026K2802J627j7670q708M985L2124k2021j4226
10336F6700P495r717k2607J209p78K620L4091K3565m2928j1771l625j2451J5003
10323D6806Q866q312J2256J0250M719q032j3K8958R394M913l3312Q934K5475j0740
10309A00162j4298O169K0078l939l2677p6N498J2674J1291j3861l1881k0744l027
10296C5369o000L867J87m499J98K541O97K0154P341n940j7158J6396r564N683
10282D9272L953j3312J6512K2695P16k3975n207J2556L802l621J2686R895j6513
10269F9459j9116j5941J6674J5515o769q95j1395J8154P683j9472m253J9563j6423
$$ plain form
10256 52784 42620 27518 35705 31413 28442 25974 26600 33046 43029 54187 63882 45207 20622
10243 20622 21960 28082 39192 67537 50965 31796 34809 49167 42902 56100 70947 79394 67767
10230 67767 73582 77039 70680 72598 71469 62349 42471 50406 67455 67534 59105 91933 111364 93983
10216 93983 74557 52335 51913 44774 27395 21712 47875 44471 -256 25872 42341 44409 62506
10203 62506 109605 111412 89430 80089 72554 56636 55039 80814 96580 105164 108426 113103 124513
10190 124513 150185 182287 197657 232615 260546 294726 360699 410548 457191 536797 590704
10179 590704 621313 631561 598517 534167 477445 422549 378935 345748 308430 296289 314480
10168 314480 324693 332286 343419 357457 368699 385747 373610 378845 382895 376510 391331 420826
$$ packed form
10256E2784j0164j5102Q187m292k971k468O26O446R983J1158R695j8675k4585
10243B0622J338O122J1110K8345j6572j9169L013J4358o265J3198J4847Q447j1627
10230F7767N815L457o359J918j129r120j9878P935J7049P9q429L2828J9431j7381
10216I3983j9426k2222m22p139j7379n683K6163l404m4727K6128J6469K068J8097
10203F2506M7099J807k1982r341p535j5918j597K5775J5766Q584L262M677J1410
10190A24513K5672L2102J5370L4958K7931L4180O5973M9849M6643P9606N3907
10179E90704L0609J0248l3044o4350n6722n4896m3614l3187l7318j2141J8191
10168C14480J0213P593J1133J4038J1242J7048j2137N235M050o385J4821K9495
$$ plain form
10156 420826 427911 441534 478862 506357 552023 575335 591607 578013 586972 574322 555083 511933
10144 511933 494318 473973 420088 389035 402212 414820 394118 356730 352475 337477 308471 273202
10132 273202 241420 233433 249587 262005 262917 271345 294959 330649 378026 411801 439546 477533
10120 477533 496048 480239 463685 435124 395547 344497 305697 271835 200840 167210 159073 143769
10108 143769 138630 126255 111594 93962 77167 63486 50546 23766 29667 51001 77359 71940
10096 71940 48682 32385 25670 26721 41910 26975 -2441 -26421 -29550 -1721 4538 20726
10084 20726 26875 10985 -267 -1707 9251 17115 2197 27255 52770 34753 30873 34756 10744
10071 10744 -19294 -8743 20116 20166 -6624 -13921 -24339 -5944 34194 57148 38376 27063
$$ packed form
10156D20826P085J3623L7328K7495M5666K3312J6272j3594Q959j2650j9239m3150
10144E11933j7615k0345n3885l1053J3177J2608k0702l7388m255j4998k9006l5269
10132B73202l1782p987J6154J2418R12Q428K3614L5690M7377L3775K7745L7987
10120D77533J8515j5809j6554k8561l9577n1050l8800l3862p0995l3630q137j5304
10108A43769n139j2375j4661j7632j6795j3681j2940k6780N901K1334K6358n419
10096G1940k3258j6297o715J051J5189j4935k9416k3980l129K7829O259J6188
10084B0726O149j5890j1252j440J0958P864j4918K5058K5515j8017l880L883k4012
10071A0744l0038J0551K8859N0k6790p297j0418J8395M0138K2954j8772j1313
$$ plain form
10059 27063 30338 30658 24986 1014 -18480 -32510 -28227 -5610 21707 41414 56951 70869 106269
10046 106269 161941 273216 447084 836084 1385238 1457745 1134340 777998 497251 317423
10036 317423 205016 160989 109163 73773 57564 39294 27604 26908 26680 39237 48023 66728
10024 66728 52025 11444 7410 21618 38760 29168 11946 -6611 -16326 -1074 17024 46285
10012 46285 28474 8008 8677 21175 14136 -3075 23281 37864 34389 27828 29313 42539 55935
9999 55935 59769 41299 27126 18674 -2418 3046 15523 31046 42639 24996 10291 9444 246
9986 246 10161 31939 46710 37922 22236 40484 48539 35534 10516 -3198 3553 6865 22506
9973 22506 35432 37085 15400 -15989 -20872 -12735 4649 19677 30045 38380 33148 3763 -2333
$$ packed form
10059B7063L275L20n672k3972j9494j4030M283K2617K7317J9707J5537J3918L5400
10046A06269N5672J11275J73868L89000N49154P2507l23405l56342k80747j79828
10036C17423j12407m4027n1826l5390j6209j8270j1690o96k28J2557Q786J8705
10024F6728j4703m0581m034J4208J7142r592j7222j8557r715J5252J8098K9261
10012D6285j7811k0466O69J2498p039j7211K6356J4583l475o561J485J3226J3396
9999E5935L834j8470j4173q452k1092N464J2477J5523J1593j7643j4705q47r198
9986B46R915K1778J4771q788j5686J8248Q055j3005k5018j3714O751L312J5641
9973B2506J2926J653k1685l1389m883Q137J7384J5028J0368Q335n232k9385o096
$$ plain form
9960 -2333 -2698 8246 18903 20960 10183 -21498 -40382 -60140 -39763 -21026 -19742 -30218 -24549
9947 -24549 -37358 -37882 -32126 -51101 -56867 -33332 -1879 -14267 -29596 -48870 -33492 -11633 -23448
9934 -23448 -27559 -5292 29665 56417 57195 63345 59070 44068 3333 -24231 -10531 -5305 -14492
9921 -14492 -6158 23363 25262 1943 -7103 -20501 -39673 -35215 -18751 -9285 8322 44505 49912
9908 49912 32707 -8926 2502 35640 38205 22634 13839 5604 10979 15939 25061 9343 -10470
9895 -10470 -8342 8265 -12925 -21658 -36128 -18267 -2193 -16371 -31187 -13337 9446 16449
9883 16449 16124 28347 39007 17410 2902 15099 5645 807 -20577 -28846 -23019 -10422 5771
9870 5771 31383 10643 10480 31444 -2215 -27310 -26824 -4129 -4510 7714 22110 11017 7729
$$ packed form
9960b333l65J0944J0657K057j0777l1681j8884j9758K0377J8737J284j0476N669
9947b4549j2809n24N756j8975n766K3535L1453j2388j5329j9274J5378K1859j1815
9934b3448m111K2267L4957K6752P78O150m275j5002m0735k7564J3700N226r187
9921a4492Q334K9521J899k3319r046j3398j9172M458J6464R466J7607L6183N407
9908D9912j7205m1633J1428L3138K565j5571q795q235N375M960R122j5718j9813
9895a0470K128J6607k1190q733j4470J7861J6074j4178j4816J7850K2783P003
9883A6449l25J2223J0660k1597j4508J2197r454m838k1384q269N827J2597J6193
9870E771K5612k0740j63K0964l3659k5095M86K2695l81J2224J4396j1093l288
$$ plain form
9857 7729 -15541 -9271 -11534 4243 8869 -5425 -23598 -30635 -22722 10487 28043 52836 56909
9844 56909 49377 53608 63315 68030 101296 108819 93325 65628 46832 55217 53794 16170 -278
9831 -278 1362 -13923 -35900 -26818 1655 17635 20091 -7816 -26426 -13226 -16820 -15884 -39189
9818 -39189 -57871 -57475 -50403 -46885 -11786 8581 21892 22991 25411 16309 -12970 -35201 -34455 -18818
9804 -18818 -15882 -14180 -13216 -25712 -10919 -4793 3138 -12684 -39996 -35010 -24049 -17988 -38446
9791 -38446 -18301 -16364 -8199 13012 27336 36545 31236 31100 27984 5597 3868 -5200 -6660 -21011
9777 -21011 -14905 -25639 -22268 -1653 -322 18478 12453 -24913 -22556 -12656 -9380 -13848 -18590 -13710
9763 -13710 5495 14916 15447 -6700 10806 27667 26842 34658 20564 28881 15124 13023 18234 26557
$$ packed form
9857G729k3270O270k263J5777M626j4294j8173p037P913L3209J7556K4793M073
9844E6909p532M231R707M715L3266P523j5494k7697j8796Q385j423l7624j6448
9831b78J640j5285k1977R082K8473J5980K456k7907j8610J3200l594R36k3305
9818c9189j8682L96P072L518L5099K0367J3311J099K420r102k9279k2231P46J5637
9804a8818K936J702R64j2496J4793O126P931j5822k7312M986J0961O061k0458
9791c8446K0145J937Q165K1211J4324R209n309j36l116k2387j729r068j460j4351
9777b1011O106j0734L371K0615J331J8800o025l7366K357R900L276m468m742M880
9763a3710J9205R421N31k2147J7506J6861q25P816j4094Q317j3757k101N211Q323
$$ plain form
9749 26557 22290 26352 34787 42630 19605 -4046 -2659 -1915 -13942 2581 6316 887 -15346 -22365
9735 -22365 -17073 9693 13054 -8433 -15885 8550 31519 38365 24508 18373 -1283 -24750 -15764
9722 -15764 -9973 -4684 -18624 -20928 -25091 -21914 -35702 -32045 -23893 -12136 -1750 13960 33717
9709 33717 45376 23714 31098 20054 6080 -17537 -12080 -7753 -8797 -10878 -2152 11821 20213
9696 20213 19146 18809 11896 -3986 7324 13873 20323 1202 -12968 -41870 -40754 -27445 -16212
9683 -16212 -24627 -11395 1806 10123 8152 8477 9292 4435 4300 -9578 8082 24575 24698 16284
9669 16284 -1863 -9521 -4957 -2890 19064 2532 -19243 -17982 -11389 2527 723 4459 16800
9656 16800 22009 32568 10596 -13636 -8176 -24396 -25984 -53868 -53187 -54470 -74784 -90283 -58570
$$ packed form
9749B6557m267M062Q435P843k3025k3651J387P44j2027J6523L735n429j6233p019
9735b2365N292K6766L361k1487p452K4435K2969O846j3857o135j9656k3467Q986
9722a5764N791N289j3940k304m163L177j3788L657Q152J1757J0386J5710J9757
9709C3717J1659k1662P384j1044j3974k3617N457M327j044k081Q726J3973Q392
9696B0213j067l37o913j5882J1310O549O450j9121j4170k8902J116J3309J1233
9683a6212q415J3232J3201Q317j971L25Q15m857j35j3878J7660J6493J23q414
9669A6284j8147p658M564K067K1954j6532k1775J261O593J3916j804L736J2341
9656A6800N209J0559k1972k4232N460j6220j588k7884O81j283k0314j5499L1713
$$ plain form
9643 -58570 -21282 -13321 -285 3475 -6562 -20880 -18520 8651 498 -29898 -29714 -37263 -29221
9630 -29221 -10161 6377 15005 5347 -11017 -15911 -20915 3981 7668 -12730 -25199 705 25813
9617 25813 16053 -2547 3180 21679 32416 35757 39038 24779 26301 51228 53243 15115 -25460
9604 -25460 -11622 -5419 -16961 -11531 5285 -7710 -3693 -12147 -1472 18755 17659 -16 -16604
9591 -16604 -21968 -242 8686 17224 -271 -23018 -26322 -11892 23952 43259 13510 -11037 -38437
9578 -38437 -42205 -23491 1575 18180 14558 13593 21638 3120 -7302 -1371 3203 -4434 -31347
9565 -31347 -24493 -16276 11652 22085 17290 4626 6264 1567 -17327 -23742 -34851 -21167 421
9552 421 5615 12924 8177 9492 27261 32315 50247 58480 36657 -77 -30295 -40904 -30858
$$ packed form
9643e8570L7288P961J3036L760j0037j4318K360K7171q153l0396J84p549Q042
9630b9221J9060J6538Q628r658j6364m894n004K4896L687k0398j2469K5904K5108
9617B5813r760j8600N727J8499J0737L341L281j4259J522K4927K015l8128m0575
9604b5460J3838O203j1542N430J6816j2995M017q454J0675K0227j096j7675j6588
9591a6604n364K1726Q928Q538j7495k2747l304J4430L5844J9307k9749k4547k7400
9578c8437l768J8714K5066J6605l622r65Q045j8518j0422N931M574p637k6913
9565c1347O854Q217K7928J0433m795j2664J638m697j8894o415j1109J3684K1588
9552D21N194P309m747J315J7769N054J7932Q233k1823l6734l0218j0609J0046
$$ plain form
9539 -30858 -4550 -77 -2211 -14810 -19138 -24514 -18694 -16982 -11952 -11883 -12970 -10694 -23104 -42804
9525 -42804 -51470 -26560 -33535 -31867 -2905 12444 10715 12718 25236 15736 5194 1573 -12571
9512 -12571 -9909 10561 226 -7858 -29965 -51044 -34294 -38380 -39793 -43561 -38368 -44275 -31915
9499 -31915 -10633 -28554 -15333 -3632 -12708 -23983 -34774 -44123 -44210 -39906 -29786 -38132 -28721
9486 -28721 -25357 -30334 -22443 -4355 11106 -10535 -48913 -46488 -42726 -4872 8446 1790 2150
9473 2150 972 -21442 -9079 -17650 -32461 -61989 -54298 -28843 -7876 -8127 -26455 -27575 -23146
9460 -23146 -11756 16031 28734 25244 11157 -2416 24905 47462 36467 10107 -2828 5731
9448 5731 23781 2377 -23134 -15553 7753 13133 15653 4855 940 -22784 -23516 2051 9444
$$ packed form
9539c0858K6308M473k134j2599m328n376N820J712N030O9j087K276j2410j9700
9525d2804q666K4910o975J668K8962J5349j729K003J2518r500j0542l621j4144
9512a2571K662K0470j0335q084k2107k1079J6750m086j413l768N193n907J2360
9499c1915K1282j7921J3221J1701r076j1275j0791r349q7M304J0120q346R411
9486b8721L364m977P891J8088J5461k1641l8378K425L762L7854J3318o656L60
9473B150j178k2414J2363q571j4811k9528P691K5455K0967k51j8328j120M429
9460b3146J1390K7787J2703l490j4087j3573K7321K2557j0995k6360j2935Q559
9448E731J8050k1404k5511P581K3306N380K520j0798l915k3724p32K5567P393
$$ plain form
9435 9444 40537 55373 43456 46963 28765 5936 -6083 3715 16972 31959 4818 5135 -5366
9422 -5366 3064 15110 13791 21519 15626 -3381 17274 19136 32300 21994 -10493 -3939 33795
9409 33795 38185 22923 22687 40335 52414 28471 25807 37363 50176 31385 8555 13026 25351
9396 25351 46768 42427 20601 23897 6937 5858 1123 -3380 4962 13903 2598 3642 -936 -1501
9382 -1501 14807 18282 2777 -35830 -50720 -47692 -20719 29568 33634 25607 42871 43413 32488
9369 32488 38530 64969 51785 40572 14283 14832 7760 14520 32626 38069 48364 32604 33368
9356 33368 41919 42347 63776 46200 15912 19824 22486 14381 71 10414 11441 4154 13358 28030
9342 28030 42794 47103 56376 26735 18561 17454 23611 18084 12017 10017 17511 23699 7025 -4489
$$ packed form
9435I444L1093J4836j1917L507j8198k2829j2019R798J3257J4987k7141L17j0501
9422e366Q430J2046j319P728n893j9007K0655J862J3164j0306l2487O554L7734
9409C3795M390j5262k36J7648J2079k3943k664J1556J2813j8791k2830M471J2325
9396B5351K1417m341k1826L296j6960j079m735m503Q342Q941j1305J044m578n65
9382a501J6308L475j5505l8607j4890L028K6973N0287M066q027J7264N42j0925
9369C2488O042K6439j3184j1213k6289N49p072O760J8106N443J0295j5760P64
9356C3368Q551M28K1429j7576l0288L912K662q105j4310J0343J027p287R204J4672
9342B8030J4764M309R273k9641q174j107O157n527o067k000P494O188j6674j1514
$$ plain form
9328 -4489 -539 8344 10874 32264 55997 30348 10217 16439 32889 47062 56923 28787 17086
9315 17086 48322 49918 41657 27086 27856 56044 65936 60333 48650 57174 94889 107832 115659
9302 115659 96640 93793 89705 97118 95663 93131 118804 121970 110788 104083 113631 147263 136297
9289 136297 112479 126834 162426 190690 208507 214261 236210 259170 243746 258142 293372 315855
9277 315855 342295 356351 397284 443221 485792 526050 560321 618282 663901 705750 773408 864741
9265 864741 1002447 1157962 1329099 1529452 1752635 2020538 2303299 2590899 2904605 3206804
9255 3206804 3448831 3627466 3697188 3683288 3571208 3363337 3064187 2777471 2487500 2208477
9245 2208477 1945843 1703514 1519604 1351707 1194175 1066604 950909 875691 782722 716661
$$ packed form
9328d489L950Q883K530K1390K3733k5649k0131O222J6450J4173R861k8136j1701
9315A7086L1236J596q261j4571P70K8188R892n603j1683Q524L7715J2943P827
9302A15659j9019k847m088P413j455k532K5673L166j1182o705R548L3632j0966
9289A36297k3818J4355L5592K8264J7817N754K1949K2960j5424J4396L5230K2483
9277C15855K6440J4056M0933M5937M2571M0258L4271N7961M5619M1849O7658R1333
9265H64741J37706J55515J71137K00353K23183K67903K82761K87600L13706L02199
9255C206804K42027J78635O9722j3900j12080k07871k99150k86716k89971k79023
9245B208477k62634k42329j83910j67897j57532j27571j15695p5218r2969o6061
$$ plain form
9235 716661 669883 597675 570092 534182 504565 475627 448629 415028 368000 323159 279313 268013
9223 268013 266122 222369 201036 195206 209110 199202 194036 202463 209490 204988 173665 128667 125185
9210 125185 130619 123866 111807 113207 125744 127406 107383 92871 134681 138351 125733 128278 117505
9197 117505 89227 85986 91823 96785 74384 52985 62151 90551 83350 62837 49282 39959 32425
9184 32425 42080 24487 34804 49138 54419 60206 64929 66467 45133 20912 23547 20050 25000
9171 25000 49606 57435 33591 17867 22279 22905 -9378 -9883 -6323 6832 2953 15093 3628
9158 3628 -8083 18335 45942 40243 18457 10854 12983 -3562 -1992 -20713 -26368 -18499 -15169
9145 -15169 -3354 -9410 -2557 15275 20723 12138 4166 14661 28432 13179 -1846 7544 12801
$$ packed form
9235G16661m6778p2208k7583l5910k9617k8938k6998l3601m7028m4841m3846j1300
9223B68013j891m3753k1333n830J3904r908n166Q427P027m502l1323m4998l482
9210A25185N434o753j2059J400J2537J662k0023j4512M1810L670j2618K545j0773
9197A17505k8278l241N837M962k2401k1399R166K8400p201k0513j3555r323p534
9184C2425R655j7593J0317J4334N281N787M723J538k1334k4221K635l497M950
9171B5000K4606P829k3844j5724M412O26l2283n05L560J3155l879J2140j1465
9158C628j1711K6418K7607n699k1786p603K129j6545J570j8721n655P869L330
9145a5169J1815o056O853J7832N448q585p972J0495J3771j5253j5025R390N257
$$ plain form
9132 12801 16281 24182 19949 3669 -2967 -30631 -25607 -1144 27536 37426 33468 29627 29783 39280
9118 39280 43870 28195 33721 29376 30122 44445 56019 55129 48172 49346 41638 45524 47568 29852
9104 29852 16730 4621 -20691 -6271 19237 30547 37351 34879 24382 18877 10527 -12584 -27279
9091 -27279 -29533 -30854 -42156 -28119 -29753 -32412 -30795 -13696 5520 13326 13022 15981 19502 6100
9077 6100 2536 -4676 993 -3211 -11970 -22502 -24895 9980 12056 -10289 -33378 -29459 -18240 -13439
9063 -13439 -22924 -7095 -8014 20227 28574 27188 55585 58279 68381 55913 41394 30815 18914
9050 18914 22916 -5811 -5879 22300 43556 61717 47372 16751 11247 5176 11212 8418 -22137
9037 -22137 -19016 -25459 -28720 -14105 9377 28254 50751 43693 14869 -666 5363 7650 14064
$$ packed form
9132A2801L480P901m233j6280o636k7664N024K4463K8680R890l958l841J56R497
9118C9280M590j5675N526m345P46J4323J1574q90o957J174p708L886K044j7716
9104B9852j3122j2109k5312J4420K5508J1310O804k472j0497n505q350k3111j4695
9091b7279k254j321j1302J4037j634k659J617J7099J9216P806l04K959L521j3402
9077F100l564p212N669m204q759j0532k393L4875K076k2345k3089L919J1219M801
9063a3439r485J5829r19K8241Q347j386K8397K694J0102j2468j4519j0579j1901
9050A8914M002k8727o8K8179K1256J8161j4345l0621n504o071O036k794l0555
9037b2137L121o443l261J4615K3482J8877K2497p058k8824j5535O029K287O414
$$ plain form
9024 14064 9738 35415 62683 22498 9200 8809 -6188 -21280 -26967 -27565 -42753 -30595 -7334
9011 -7334 31289 23452 -33166 -72513 -46443 -36768 -13668 16625 21121 -3678 -14230 -8163 63
8998 63 -314 18684 27915 38743 53693 41371 30690 49827 57630 70094 62187 42433 5497
8985 5497 -15741 -10081 -32929 -43137 -23030 344 11446 -26435 -48587 -33099 -11384 -2902
8973 -2902 13008 6755 -6478 -16578 -8675 -7968 -18886 -37263 -32879 -28560 -31592 -9020 -12368 -13829
8959 -13829 -24869 -36034 -19995 -1503 -2881 -12288 -20778 14560 13934 4786 -22254 -26513 -8899
8946 -8899 -4393 3769 -21972 -28076 -17011 18899 15705 -2573 -3825 -8365 -1811 7766 -6773 -26771
8932 -26771 -27698 -25015 -30752 -6165 22040 5285 -9244 -9462 7416 -2977 2634 10484 6457 395
$$ packed form
9024A4064m326K5677K7268m0185j3298l91j4997j5092n687n98j5188J2158K3261
9011g334L8623p837n6618l9347K6070R675K3100L0293M496k4799j0552O067Q226
8998F3l77J8998R231J0828J4950j2322j0681J9137P803J2464p907j9754l6936
8985E497k1238N660k2848j0208K0107K3374J1102l7881k2152J5488K1715Q482
8973b902J5910o253j3233j0100P903P07j0918j8377M384M319l032K2572l348j461
8959a3829j1040j1165J6039J8492j378r407q490L5338o26r148k7040m259J7614
8946h899M506Q162k5741o104J1065L5910l194j8278j252m540O554R577j4539j9998
8932b6771r27K683n737K4587K8205j6755j4529k18J6878j0393N611P850m027o062
$$ plain form
8918 395 10629 -15350 -50497 -21014 9029 8761 -8761 -16988 -14137 -1481 -4477 -3752 5140 -2855
8904 -2855 -13481 -10134 -25271 -30674 -25373 -19927 -10501 -17154 -15254 1128 5744 -5738 -19281 -16105
8890 -16105 3716 -11254 -15818 -21310 -21869 -15747 13648 17935 13017 3954 -4940 -3725 -4590 -6746
8876 -6746 -1254 17201 29237 25854 44300 46484 47624 50325 24903 -11065 -14345 -16856 3174
8863 3174 25908 41803 49466 43186 31986 5449 -8282 8606 24922 51052 83054 109413
8851 109413 122830 124859 105467 83584 81253 80253 76673 40810 21487 808 -2422 -3716 -647
8838 -647 11682 44492 68626 24177 16350 33600 20667 4562 -11409 -15429 -2650 7239 465
8825 465 -5697 22353 10233 -994 7689 17195 25856 34708 32658 26932 16061 1186 -6551 -6960
$$ packed form
8918C95J0234k5979l5147K9483L0043k68j7522q227K851J2656k996P25Q892p995
8904b855j0626L347j5137n403N301N446R426o653J900J6382M616j1482j3543L176
8890a6105J9821j4970m564n492n59O122K9395M287m918r063q894J215q65k156
8876f746N492J8455J2036l383J8446K184J140K701k5422l5968l280k511K0030
8863C174K2734J5895P663o280j1200k6537j3731J6888J6316K6130L2002K6359
8851A09413J3417K029j9392k1883k331j000l580l5863j9323k0679l230j294L069
8838f47J2329L2810K4134m4449p827J7250j2933j6105j5971m020J2779R889o774
8825D65o162K8050j2120j1227Q683R506Q661Q852k050n726j0871j4875p737m09
$$ plain form
8811 -6960 7433 9868 12873 11772 10614 34974 40450 27597 27407 38135 -5784 -17813 7722
8798 7722 20321 34210 23558 12844 4104 6425 1723 -11609 17163 32671 16239 23466 22866
8785 22866 6765 -7014 -23843 -25509 -43832 -68353 -42228 -27489 -22146 -15616 -15954 11520 39767
8772 39767 53012 40705 42309 35112 28190 9906 16889 -1883 -20329 -35882 -39585 -18621 -16807
8759 -16807 -29099 -6550 38221 38315 27846 25324 44067 48574 27184 13407 32456 40445 32394
8746 32394 9059 4824 -20423 -5651 -1488 -6405 -3893 -4429 -18011 -6818 -7466 -8671 4992 22530
8732 22530 19329 -4200 -23369 -7698 -11379 13324 14394 18689 36401 41764 33106 29075 41554
8719 41554 33595 40434 26589 20395 9479 14969 18737 28228 28887 13017 26271 46129 39620 30483
$$ packed form
8811f960J4393K435L005j101j158K4360N476j2853j90J0728m3919j2029K5535
8798G722J2599J3889j0652j0714q740K321m702j3332K8772J5508j6432P227o00
8785B2866j6101j3779j6829j666j8323k4521K6125J4739N343O530l38K7474K8247
8772C9767J3245j2307J604p197o922j8284O983j8772j8446j5553l703K0964J814
8759a6807j2292K2549M4771R4j0469k522J8743M507k1390j3777J9049P989q051
8746C2394k3335m235k5247J4772M163m917K512n36j3582J1193o48j205J3663J7538
8732B2530l201k3529j9169J5671l681K4703J070M295J7712N363q658m031J2479
8719D1554p959O839j3845o194j0916N490L768R491O59j5870J3254J9858o509r137
$$ plain form
8705 30483 23051 20465 24878 26749 20533 23774 11283 -1129 3365 462 7775 -2894 -11488 -1755
8691 -1755 -20939 -27698 -10705 -5959 -3906 22193 26288 20613 25183 24136 33297 46205 44076 42463
8677 42463 32138 15884 20018 32217 56380 71710 57011 40507 38127 49694 52213 41809
8665 41809 19112 29431 49856 36524 49581 51972 54900 40761 52459 60891 67644 78085 89061
8652 89061 78954 75036 50696 49249 46296 28816 26040 44772 66397 64128 53036 49736 72633
8639 72633 84137 85718 108313 108397 120557 97702 79460 60929 84695 103004 101171 87322 87127
8626 87127 79106 89715 94250 100173 99600 82743 87364 99963 133913 143267 118944 106871 85161
8613 85161 103296 98727 105253 107896 124901 112378 108784 157497 208462 242778 253240 250866 229771
$$ packed form
8705C0483p432k586M413J871o216L241j2491j2412M494k903P313j0669q594R733
8691a755j9184o759J6993M746K053K6099M095n675M570j047R161J2908k129j613
8677D2463j0325j6254M134J2199K4163J5330j4699j6504k380J1567K519j0404
8665D1809k2697J0319K0425j3332J3057K391K928j4139J1698Q432O753J0441J0976
8652H9061j0107l918k4340j447k953j7480k776J8732K1625k269j1092l300K2897
8639G2633J1504J581K2595Q4J2160k2855j8242j8531K3766J8309j833j3849j95
8626H7127q021J0609M535N923n73j6857M621J2599L3950R354k4323j2073k1710
8613H5161J8135m569O526K643J7005j2523l594M8713N0965L4316J0462k374k1095
$$ plain form
8600 229771 210745 216956 216508 186037 183880 162433 177981 218784 228209 220102 176359 158047 159500
8587 159500 188593 185268 185937 209102 217173 206874 187801 182720 159731 130055 139445 139314 130726
8574 130726 99300 71081 62485 69271 56407 54347 71067 88513 82293 70605 47671 20482
8562 20482 20496 12135 7639 43257 46596 29365 19001 24052 8329 5873 33602 40888 21222 21229
8548 21229 33694 23205 21017 25222 10889 32792 40164 36699 28767 36662 45178 43481 35575 22798
8534 22798 1401 10715 5849 -3770 -12401 25400 41168 41479 25370 27317 17371 -325 -19751
8521 -19751 -37695 -34595 -39045 -33069 -13973 -5111 -34355 -44211 -60071 -54484 -24217 12675 20335
8508 20335 30687 30681 12479 18960 35535 67721 76954 37512 11454 1294 -17726 -31883 -47914
$$ packed form
8600B29771j9026O211m48l0471k157k1447J5548M0803R425q107m3743j8312J453
8587A59500K9093l325O69K3165Q071j0299j9073n081k2989k9676R390j31q588
8574A30726l1426k8219q596O786j2864k060J6720J7446o220j1688k2934k7189
8562B0482J4q361m496L5618L339j7231j0364N051j5723k456K7729P286j9666P
8548B1229J2465j0489k188M205j4333K1903P372l465p932P895Q516j697p906j2777
8534B2798k1397R314m866r619q631L7801J5768L11j6109J947r946j7696j9426
8521a9751j7944L100m450N976J9096Q862k9244r856j5860N587L0267L6892P660
8508B0335J0352oj8202O481J6575L2186R233l9442k6058j0160j9020j4157j6031
$$ plain form
8495 -47914 -30167 -24440 -34157 -28301 -10034 23647 35425 40932 58480 28052 -97 12006 -3850
8482 -3850 -228 -11118 -6845 13275 5229 -30533 -49528 -29388 6338 16241 18188 14311 21773
8469 21773 23188 16850 7396 -12716 -7932 19028 31273 15306 13467 17934 53078 69997 71270
8456 71270 70334 74593 52142 33148 36292 62598 69477 49558 21743 5847 12504 12021 1165
8443 1165 11848 23210 -1001 -16636 -34986 -25248 -13952 -14550 -32758 -26108 10604 -2565 -8309
8430 -8309 -7692 -22088 1577 54754 76509 54072 51071 60207 66862 35874 13757 2623 22328
8417 22328 14349 1933 1517 2953 -11113 -22689 8564 28867 41635 29158 31631 44122 21827
8404 21827 27515 1811 -4116 -3242 -24243 -54244 -75621 -54791 -24166 -12697 -18715 -21147 -37891
$$ packed form
8495d7914J7747N727r717N856J8267L3681J1778N507J7548l0428k8149J2103j5856
8482c850L622j0890M273K0120q046l5762j8995K0140L5726R903J947l877P462
8469B1773J415o338r454k0112M784K6960J2245j5967j839M467L5144J6919J273
8456G1270r36M259k2451j8994L144K6306O879j9919k7815j5896O657m83j0856
8443A165J0683J1362k4211j5635j8350R738J1296n98j8208O650L6712j3169n744
8430h309O17j4396K3665N3177K1755k2437l001R136O655l0988k2117j1134J9705
8417B2328p979j2416m16J436j4066j1576L1253K0303J2768j2477K473J2491k2295
8404B1827N688k5704n927Q74k1001l0001k1377K0830L0625J1469o018k432j6744
$$ plain form
8391 -37891 -66827 -61968 -19998 -11850 -9704 -14595 -8190 7696 9247 -2111 8509 -1811 -8217
8378 -8217 -8624 -10522 -9557 -12142 -15383 -31115 4713 37044 25041 24903 16315 -1242 -14628 -5879
8364 -5879 11360 27217 15862 1010 12723 16836 4730 15589 -18586 -30330 -16016 -5612
8352 -5612 -1730 24758 54395 54484 16994 -14622 -17440 -25567 -30933 -32135 -16304 -4041 -15892 -10437
8338 -10437 3813 -7759 -9019 -14382 -8289 4068 21829 47313 35549 26075 7628 -9965 -19266
8325 -19266 -20504 -24776 -26127 -10568 16002 18088 8184 9448 17662 497 -12109 -27663 -4169
8312 -4169 7910 -910 8702 3664 5195 5713 1920 3593 8658 2732 -9009 -23330 -31436 -42062
8298 -42062 -42819 -20617 -5658 -15687 -16352 -33299 -12774 18410 39766 46442 36802 28863 19883
$$ packed form
8391c7891k8936M859M1970Q148K146m891O405J5886J551j1358J0620j0320o406
8378h217m07j898R65k585l241j5732L5828L2331j2003j38q588j7557j3386Q749
8364e879J7239J5857j1355j4852J1713M113j2106J0859l4175j1744J4314J0404
8352e612L882K6488K9637Q9l7490l1616k818q127n366j202J5831J2263j1851N455
8338a0437J4250j1572j260n363O093J2357J7761K5484j1764r474j8447j7593r301
8325a9266j238m272j351J5559K6570K086r904J264Q214j7165j2606j5554K3494
8312d169J2079q820R612n038J531N18l793J673N065n926j1741j4321q106j0626
8298d2062p57K2202J4959j0029o65j6947K0525L1184K1356O676r640p939q980
$$ plain form
8285 19883 16962 18352 -3766 -27289 -45307 -65372 -48485 -28472 -24884 -7922 -5390 4613 11172
8272 11172 9959 16806 26973 36689 41585 36635 22135 8786 -15036 -20736 -6970 1806 -17702
8259 -17702 -57758 -57510 -38605 -16896 10770 19270 7945 -14484 -26573 -30447 -15148 -13146 -19627
8246 -19627 16091 17648 13760 8194 10021 -13761 -36301 -31448 -27860 -29819 -26849 -24427 -13502 2053
8232 2053 23469 27219 25922 21229 8245 4758 -1732 -11086 -19641 -11693 -4008 -5223 -4074 -21710
8218 -21710 -20628 -23084 -40622 -21987 -2495 -6618 -5629 -38503 -38096 -17452 9622 7013 -5892
8205 -5892 -12624 -12720 -9871 8860 13041 -14519 -24061 -6388 -2963 2248 4699 -12674 -3681 3782
8191 3782 43831 47898 11707 4247 -19232 -1328 -7835 -4931 5725 2052 18891 22536 2650
$$ packed form
8285A9883k921J390k2118k3523j8018k0065J6887K0013L588J6962K532J0003O559
8272A1172j213O847J0167R716M896m950j4500j3349k3822n700J3766Q776j9508
8259a7702m0056K48J8905K1709K7666Q500j1325k2429j2089l874J5299K002o481
8246a9627L5718J557l888n566J827k3782k2540M853L588j959K970K422J0925J5555
8232B053K1416L750j297m693j2984l487o490r354q555P948P685j215J149j7636
8218b1710J082k456j7538J8635J9492m123R89l2874M07K0644K7074k609j2905
8205e892o732r6K849J8731M181k7560r542J7673L425N211K451j7373Q993P463
8191C782M0049M067l6191p460k3479J7904o507K904J0656l673J6839L645j9886
$$ plain form
8178 2650 7526 13633 20224 20502 24878 35966 26502 31350 2784 320 6746 -16928 -30925 -15093
8164 -15093 -22633 -36842 -22163 20675 45879 28473 -644 -29844 -27771 -9608 -7577 -8272 -33730
8151 -33730 -48932 -42129 -31638 642 38624 64520 100138 78898 39759 15147 -9016 -9841
8139 -9841 -20612 -4635 717 -9287 -7715 -15168 -12472 -14587 -5088 24148 32501 20244 5877
8126 5877 -4531 12114 3078 -26232 -35709 -33423 -30416 -12989 4837 -8307 7030 26951 19622
8113 19622 7665 -3624 -6120 -16337 -18444 -32057 -23030 2523 4991 5473 30136 35302 13804
8100 13804 16899 28949 44208 59266 52861 11910 11876 -3801 -17324 9960 12450 12158 6380 17373
8086 17373 21056 -3597 -17536 -10691 -7490 -2807 935 7303 22881 18812 -4318 607 12002
$$ packed form
8178B650M876O107O591K78M376J1088r464M848k8566k464O426k3674j3997J5832
8164a5093p540j4209J4679M2838K5204j7406k9117k9200K073J8163K031o95k5458
8151c3730j5202O803J0491L2280L7982K5896L5618k1240l9139k4612k4163q25
8139i841j0771J5977N352j0004J572p453K696k115R499K9236Q353j2257j4367
8126E877j0408J6645r036k9310r477K286L007J7427J7826j3144J5337J9921p329
8113A9622j1957j1289k496j0217k107j3613R027K5553K468M82K4663N166k1498
8100A3804L095J2050J5259J5058o405m0951l4j5677j3523K7284K490k92n778J0993
8086A7373L683k4653j3939O845L201M683L742O368J5578m069k3130M925J1395
$$ plain form
8073 12002 18103 11378 22077 3205 -17190 -34910 -45566 -32168 -18827 -2410 -2110 3273 8381
8060 8381 13884 2412 10053 50043 61804 53687 20209 23080 24689 23412 -3228 3274 -182 25678
8046 25678 28457 30004 32344 18561 30299 45318 80775 114883 97623 78968 91677 87168 80080
8033 80080 77105 93907 85382 85829 84867 70441 73397 81229 92406 91048 74209 65340 83598 61586
8019 61586 45015 48867 50946 26505 5382 17411 -6403 -23221 18340 57504 55103 42830
8007 42830 59668 56053 63480 75742 70619 59975 85488 89877 101629 130321 187110 209447 266894
7994 266894 332600 359124 340141 301529 281587 247729 192593 168234 140467 140095 157563 194110
7982 194110 240087 257499 267705 250357 200261 173323 113058 72059 78054 78755 71691 73863 75433
$$ packed form
8073A2002O101o725J0699j8872k0395j7720j0656J3398J3341J6417L00N383N108
8060H381N503j1472P641L9990J1761q117l3478K871J609j277k6640O502l456K5860
8046B5678K779J547K340j3783J1738J5019L5457L4108j7260j8655J2709m509p088
8033H0080k975J6802q525M47r62j4426K956P832J1177j358j6839q869J8258k2012
8019F1586j6571L852K079k4441k1123J2029k3814j6818M1561L9164k401j2273
8007D2830J6838l615P427J2262n123j0644K5513M389J1752K8692N6789K2337N7447
7994B66894O5706K6524j8983l8612j9942l3858n5136k4359k7767l72J7468L6547
7982A94110M5977J7412J0206j7348n0096k6938o0265m0999N995P01p064K172J570
$$ plain form
7969 75433 66482 81133 101649 94145 112907 110092 73586 71643 83657 101858 98281 96896 103199
7956 103199 90066 82113 84735 101516 108271 118896 158395 196317 185963 198580 191724 171638
7944 171638 146030 135577 124968 131462 164027 212667 229067 193015 138342 120406 107134 104601
7932 104601 79336 58159 69345 71314 60201 41844 44298 47321 59558 58077 57357 54916 73067
7919 73067 83963 85275 82933 85353 70326 70709 66252 67533 72704 74405 71843 88553 84086 62381
7905 62381 39589 38907 52499 55202 34620 53269 53361 67283 50580 26563 36776 30959 18800
7892 18800 2538 -12656 -25456 -23366 -10152 10428 18434 20770 -5736 -1213 9565 -2372 -9425
7879 -9425 929 34575 37378 1723 -7712 22011 23667 1167 -14687 -11628 -1438 -7714 7976
$$ packed form
7969G5433q951J4651K0516p504J8762k815l6506j943J2014J8201l577j385O303
7956A03199j3133p953K622J6781O755J0625L9499L7922j0354J2617o856k0086
7944A71638k5608j0453j0609O494L2565M8640J6400l6052n4673j7936j3272k533
7932A04601k5265k1177J1186J969j1113j8357K454L023J2237j481p20k441J8151
7919G3067J0896J312k342K420j5027L83m457J281N171J701k562J6710m467k1705
7905F2381k2792o82J3592K703k0582J8649R2J3922j6703k4017J0213n817j2159
7892A8800j6262j5194j2800K090J3214K0580Q006K336k6506M523J0778j1937p053
7879i425J0354L3646K803l5655r435K9723J656k2500j5854L059J0190o276J5690
$$ plain form
7866 7976 17864 16690 20425 12657 9021 11969 -5243 -16791 -15919 -5143 16152 1761 -4327 3869
7852 3869 18829 37283 21658 -13215 -12096 7657 32132 33172 19207 26423 46558 41846 32459
7839 32459 4903 -25642 -29487 -14590 -4988 5928 1687 1591 -13756 -29141 -32406 -41033 -32996 -5382
7825 -5382 25046 35101 52599 40652 20637 27196 34159 24040 26028 32530 19793 6873 -5512
7812 -5512 -19655 -38439 -15564 -17720 -15334 -13594 -4912 6966 -1132 -26808 -60092 -62626 -47185
7799 -47185 -26427 -18016 -7789 -14131 -21305 -6342 -2058 14548 23793 15176 12720 18652 7577
7786 7577 8835 -9358 -22473 -35379 -24177 -28724 -20328 -12719 3582 -3223 -15479 -26445 -17673
7773 -17673 5531 29027 6244 -10291 -12437 -15859 -20424 -17675 -10264 -38218 -78018 -77917 -59986
$$ packed form
7866G976R888j174L735p768l636K948j7212j1548Q72J0776K1295j4391o088Q196
7852C869J4960J8454j5625l4873J119J9753K4475J040j3965P216K0135m712r387
7839C2459k7556l0545l845J4897R602J0916m241r6j5347j5385l265q627Q037K7614
7825e382L0428J0055J7498j1947k0015O559O963j0119J988O502j2737j2920j2385
7812e512j4143j8784K2875k156K386J740Q682J1878q098k5676l3284k534J5441
7799d7185K0758Q411J0227o342p174J4963M284J6606R245q617k456N932j1075
7786G577J258j8193j3115j2906J1202m547Q396P609J6301o805j2256j0966Q772
7773a7673K3204K3496k2783j6535k146l422m565K749P411k7954l9800J01J7931
$$ plain form
7760 -59986 -40868 -14048 -2110 -10600 -15083 -1194 -2614 -13840 26 -2580 -12869 -6506 -2074
7747 -2074 -14469 -16471 -21939 -14512 -14709 -21096 -32475 -57843 -62494 -55949 -62214 -71003 -59990 -34829
7733 -34829 -27282 12881 24845 -751 -20048 -22611 -14980 -6482 -363 -18776 -37975 -25316 -6758
7720 -6758 12899 16903 10423 -3278 -24033 -15567 5635 6941 -4469 -6600 -23798 -21601 4984
7707 4984 1112 -5787 1899 -24092 -50801 -15689 14708 183 -27258 -52661 -35931 -20301 -21230
7694 -21230 -30014 -33674 -25929 -8566 13210 14650 19252 16967 23682 4011 -4480 -7104 -8644 -16949
7680 -16949 -13246 -9688 -16913 -34231 -26858 -20157 -13360 -3344 9579 -2750 -10949 -14244 -12370 -10578
7666 -10578 -34724 -13155 -33125 -29300 -32242 -22696 -35528 -46778 -34469 -29935 -35039 -74731 -73855
$$ packed form
7760e9986J9118K6820J1938q490m483J3889j420j1226J3866k606j0289O363M432
7747b074j2395k002n468P427j97o387j1379k5368m651O545o265q789J1013K5161
7733c4829P547M0163J1964k5596j9297k563P631Q498O119j8413j9199J2659J8558
7720f758J9657M004o480j3701k0755Q466K1202J306j1410k131j7198K197K6585
7707D984l872o899P686k5991k6709L5112L0397j4525k7441k5403J6730J5630r29
7694b1230q784l660P745J7363K1776J440M602k285O715j9671q491k624j540q305
7680a6949L703L558p225j7318P373O701O797J0016J2923j2329q199l295J874J792
7666a0578k4146K1569j9970L825k942R546j2832j1250J2309M534n104l9692Q76
$$ plain form
7653 -73855 -38558 -32844 -33601 -4116 14307 5870 31058 55077 46217 32837 -2319 -1307 24481
7640 24481 47348 15164 -20587 -22017 -32661 -12326 -20082 -21551 -16940 -37430 -28166 -23753 -35429
7627 -35429 -35213 -31411 -26473 4024 -3521 -6216 -537 -12527 7086 26979 13604 -22499 -45928
7614 -45928 -34136 -40725 -55198 -35472 -21520 -14812 12044 12755 -11834 -18646 -13531 -27485 -20877
7601 -20877 -34688 -22406 11711 37212 26000 7393 7968 -8402 -23867 -36693 -30129 -9009
7589 -9009 19321 27040 29609 2678 5193 22348 19575 23355 29753 3225 -2417 -15046 -12322 -1707
7575 -1707 -12936 -4201 -11897 -17326 -9808 2507 7189 18582 24129 22061 17700 24948 12540 -11233
7561 -11233 -23362 -32125 -52151 -48879 -31561 -16493 -10539 -29240 -18444 -22942 -13308 15981 4207
$$ packed form
7653g3855L5297N714p57K9485J8423q437K5188K4019q860j3380l5156J012K5788
7640B4481K2867l2184l5751j430j0644K0335p756j469M611k0490R264M413j1676
7627c5429K16L802M938L0497p545k695N679j1990J9613J9893j3375l6103k3429
7614d5928J1792o589j4473J9726J3952O708K6856P11k4589o812N115j3954O608
7601b0877j3811J2282L4117K5501j1212j8607N75j6370j5465j2826O564K1120
7589i009K8330P719K569k6931K515J7155k773L780O398k6528n642j2629K724J0615
7575a707j1229Q735p696n429P518J2315M682J1393N547k068m361P248j2408k3773
7561a1233j2129q763k0026L272J7318J5068N954j8701J0796m498R634K9289j1774
$$ plain form
7548 4207 -19735 -22114 -24012 -17956 -19945 4582 6129 -7816 -17840 -8177 -946 -26565 -54080
7535 -54080 -53749 -14622 16587 13663 9794 129 1904 -5985 -4161 4201 1101 -3233 -34353 -27069
7521 -27069 -7727 -6736 6676 719 -30818 -30835 -26446 -34076 -33708 -29072 -35082 -42388 -31313 -40871 -42435
7506 -42435 -27927 -28159 -11094 13226 3234 -280 20944 23866 41297 34814 2807 4665 19493
7493 19493 18318 3522 -14706 1282 16284 25747 16998 32476 24399 26068 11488 12416 2272
7480 2272 -10022 -16893 -27277 -40334 -22179 -9689 -2484 -2216 -10033 -7793 -7187 -10240 2351 6343
7466 6343 6559 5542 5526 -55 -2319 -6825 -32542 -13011 5512 -14089 -34442 -18225 -8210 -6653
7452 -6653 -6356 -15274 -30932 -52343 -57090 -38063 -19531 -26251 -23966 -24087 14292 49971 42100 31797
$$ packed form
7548D207k3942k379j898O056j989K4527J547j3945j0024R663P231k5619k7515
7535e4080L31L9127L1209k924l869r665J775p889J824Q362l100m334l1120P284
7521b7069J9342R91J3412n957l1537j7M389p630L68M636o010p306J1075r558j564
7506d2435J4508k32J7065K4320r992l514K1224K922J7431o483l2007J858J4828
7493A9493j175j4796j8228J5988J5002R463q749J5478q077J669j4580R28j0144
7480B272j2294o871j0384j3057J8155J2490P205K68p817K240O06l053J2591L992
7466F343K16j017j6n581k264m506k5717J9531J8523j9601k0353J6217J0015J557
7452f653K97q918j5658k1411m747J9027J8532o720K285j21L8379L5679p871j0303
$$ plain form
7438 31797 44472 31716 14114 4177 2887 -9756 -12597 -27326 -31712 -12876 -5772 2240 11786
7425 11786 24417 14603 36379 40915 20249 20003 5990 1343 -8739 -12311 -255 -4798 -17013
7412 -17013 -14335 -15361 -4095 5602 -25794 -34314 -24048 -13691 -9951 -15841 -7348 -2698 6464 4161
7398 4161 13198 16595 23168 49224 60787 38647 -772 4665 14847 6180 -12892 -11253 6626
7385 6626 7150 -6497 -11467 2431 -5598 -11162 -24441 -11404 -907 -19871 -34012 -17282 -11129
7372 -11129 -16752 -18562 -9760 24503 30743 11633 7106 -10576 -34658 -38152 -32441 -10056 -12034
7359 -12034 -4368 -19067 -20410 28378 21587 -6174 -23477 -397 1407 -8891 -3399 -11782 -24537
7346 -24537 -14641 -16118 -28347 -36057 -21519 -20397 -39175 -49051 -50605 -40079 -29659 -15995 -3204
$$ packed form
7438C1797J2675j2756j7602r937j290j2643k841j4729m386J8836P104Q012R546
7425A1786J2631r814K1776M536k0666k46j4013m647j0082l572J2056m543j2215
7412a7013K678j026J1266R697l1396q520J0266J0357L740n890Q493M650R162k303
7398D161R037L397O573K6056J1563k2140l9419N437J0182q667j9072J639J7879
7385F626N24j3647m970J3898q029n564j3279J3037J0497j8964j4141J6730O153
7372a1129n623j810Q802L4263O240j9110m527j7682k4082l494N711K2385j978
7359a2034P666j4699j343M8788o791k7761j7303K3080J804j0298N492q383j2755
7346b4537R896j477j2229p710J4538J122j8778r876j554J0526J0420J3664J2791
$$ plain form
7333 -3204 12905 -12232 -12572 -7199 -20006 -6225 -3297 -13652 -17322 -17141 9358 25670 27263 24103
7319 24103 -5470 -8886 -6305 1723 -21147 -47031 -44518 -32598 -45836 -66390 -51103 -28258 -20707
7306 -20707 -4571 -22218 -31592 -16503 -3818 -4820 -18702 -28749 -37872 -35026 -8608 -3570 8238
7293 8238 15282 -5549 -23930 -12187 438 -7671 -6943 3716 13450 -19672 -34572 -38109 -64478
7280 -64478 -67942 -49624 -28240 -13755 -21741 -531 475 -29897 -30555 -27268 -22616 -13804 -3716
7267 -3716 -32118 -28860 -34997 -15464 13462 9086 9346 38058 12387 -7620 12893 9311 -13672
7254 -13672 -28935 -10440 8932 -6951 -17802 -19467 -10629 8848 21754 26407 6656 -11034
7242 -11034 3966 2267 -18720 -10621 -27167 -35923 -19605 -28805 -24101 -14239 -8931 -1974 14175
$$ packed form
7333c204J6109k5137l40N373j2807J3781K928j0355l670J81K6499J6312J593l160
7319B4103k9573l416K581Q028k2870k5884K513J1920j3238k0554J5287K2845P551
7306b0707J6136j7647r374J5089J2685j002j3882j0047r123K846K6418N038J1808
7293H238P044k0831j8381J1743J2625q109P28J0659R734l3122j4900l537k6369
7280f4478l464J8318K1384J4485p986K1210J006l0372o58L287M652Q812J0088
7267c716k8402L258o137J9533K8926m376K60K8712k5671k0007K0513l582k2983
7254a3672j5263J8495J9372j5883j0851j665Q838J9477J2906M653j9751j7690
7242a1034J5000j699k0987Q099j6546q756J6318r200M704R862N308O957J6149
$$ plain form
7229 14175 11050 6850 12736 18728 -12520 -19152 -23655 -15578 16774 43589 38179 14522 -8271
7216 -8271 -1284 13242 -4789 5762 13018 8370 -20742 -48019 -64081 -58669 -47709 -37817 -19951
7203 -19951 -16797 -26621 -27970 2031 8519 -2930 613 -5143 9114 5285 -1646 -3528 -11587 -2235
7189 -2235 -155 -3712 -10193 -5795 -15685 -10704 -5172 -26381 -44808 -41140 -19804 -27940 -42526 -44917
7175 -44917 -32104 -24780 -15645 -14731 -888 10485 4859 5906 1551 -7758 -7495 -5257 -18529 -27942
7161 -27942 -28192 -26768 -12478 5466 10580 11815 8319 -1497 3787 22219 23037 10890 -18857 -19284
7147 -19284 -11944 -1056 -16335 -20049 -24803 -11426 15865 -4300 2645 21111 34264 18784 12428
7134 12428 -2574 -9421 -18621 -28379 -19645 -13170 -17936 -3898 2021 8352 32332 47506 32637
$$ packed form
7229A4175l125m200N886N992l1248o632m503Q077L2352K6815n410k3657k2793
7216h271O987J4526j8031J0551P256m648k9112k7277j6062N412J0960R892J7866
7203a9951L154r824j349L0001O488j1449L543n756J4257l829o931j882q059R352
7189b235K080l557o481M398r890M981N532k1209j8427L668K1336q136j4586k391
7175d4917J2813P324R135R14J3843J1373n626J047m355r309K63K238j3272r413
7161b7942k50J424J4290J7944N114J235l496r816N284J8432Q18j2147k9747m27
7147a9284P340J0888j5279l714m754J3377K7291k0165O945J8466J3153j5480o356
7134A2428j5002o847r200r758Q734O475m766J4038N919O331K3980J5174j4869
$$ plain form
7121 32637 6373 3103 -12927 -20452 -18758 -8470 -237 -18961 -29122 -19563 -10673 -6427 -27045
7108 -27045 -35502 -5964 11653 4401 -48249 -66266 -13185 12397 -11401 -3686 10429 12185 18502
7095 18502 24731 -1455 1840 -10914 3958 18262 16374 11640 10508 17963 35941 65856 58205
7082 58205 39137 46106 38188 33403 21927 10995 1204 -448 -10868 -17900 7947 20097 36307
7069 36307 28028 13194 19108 37600 36997 27130 11828 -3601 5050 238 -14265 -7933 9533
7056 9533 3334 -5229 11211 23675 1102 -13439 -11493 -3149 -2092 -25748 -46846 -60910 -41565
7043 -41565 -8767 -19348 -38433 -8669 4651 13989 23434 21936 18352 -735 -17205 -14585 -31293
7030 -31293 -11035 -11284 9565 7313 15741 -8613 -18215 -14862 -24044 -6050 14186 2805 -43622
$$ packed form
7121C2637k6264l270j6030p525J694J0288Q233j8724j0161R559Q890M246k0618
7108b7045q457K9538J7617p252n2650j8017N3081K5582k3798P715J4115J756O317
7095A8502O229k6186L295j2754J4872J4304j888m734j132P455J7978K9915p651
7082E8205j9068O969p918m785j1476j0932r791j652j0420p032K5847J2150J6210
7069C6307q279j4834N914J8492o03r867j5302j5429Q651m812j4503O332J7466
7056I533o199q563J6440J2464k2573j4541J946Q344J057k3656k1098j4064J9345
7043d1565L2798j0581j9085K9764J3320R338R445j498l584j9087j6470K620j6708
7030c1293K0258k49K0849k252Q428k4354r602L353r182J7994K0236j1381m6427
$$ plain form
7017 -43622 -58690 -50970 -25506 -15276 -21773 -28173 -29548 -31250 -30019 -26128 -36105 -49302 -50158 -20102
7003 -20102 25671 3313 -22266 -30462 -36908 -44332 -48043 -33403 -30835 -22815 -15572 -22986 -13229 -12169
6989 -12169 -19085 -5599 -3574 3675 -1313 -8459 2541 10087 -600 -17262 -2697 5218 -4997
6976 -4997 -25267 -27037 -30746 -17797 -29891 -22557 17834 7118 -28393 -13029 23087 21204 2677
6963 2677 8431 20686 26095 17026 7036 23384 -9872 -43826 -20497 17190 -4082 -8021 -3943
6950 -3943 -35091 -26353 15390 43083 28433 -7191 -5542 447 -15821 -16463 16664 37957 13486
6937 13486 9542 19993 18510 10321 -21304 -37814 -8656 3987 -926 -23119 -32530 -11685 6757
6924 6757 6751 -8352 -33947 -21713 -27755 -19097 -6446 -9464 -14151 -9925 30868 12924 -15229 -18322
$$ packed form
7017d3622j5068P720K5464J0230o497o400j375j702J231L891r977j3197q56L0056
7003b0102M5773k2358k5579q196o446p424l711J4640K568Q020P243p414R757J060
6989a2169o916J3486K025P249m988p146J1000P546j0687j6662J4565P915j0215
6976d997k0270j770l709J2949j2094P334M0391j0716l5511J5364L6116j883j8527
6963B677N754J2255N409r069r990J6348l3256l3954K3329L7687k1272l939M078
6950c943l1148Q738M1743K7693j4650l5624J649N989j6268o42L3127K1293k4471
6937A3486l944J0451j483q189l1625j6510K9158J2643m913k2193r411K0845J8442
6924F757oj5103k5595J2234o042Q658J2651l018m687M226M0793j7944k8153l093
$$ plain form
6910 -18322 25008 51458 44848 39523 29914 16328 9226 12191 4717 7546 2385 -2272 2144 -6035
6896 -6035 2878 7263 16189 19283 540 -12787 -30080 -41535 -57832 -46720 -37034 -21828 -10791
6883 -10791 -21518 -30688 -33904 -35802 -46387 -45011 -25780 -18947 -15383 -15356 -11148 -3467 380 18650
6869 18650 20317 18212 15925 -1890 -29633 -17244 -5860 26766 23770 2243 -11856 -27728 -27159
6856 -27159 -34279 -45143 -22988 -7307 -7657 3259 11523 33127 35740 8519 -36516 -28148 6894
6843 6894 18558 -4959 -14580 325 9255 -1825 -15067 -28830 -38587 -36594 -37129 -20822 7456
6830 7456 8078 -19451 -5762 17966 9833 18301 34585 52459 46195 37481 19483 968 14112
6817 14112 659 -10658 -25910 -26416 -12961 3232 -13858 -1852 16415 25266 5837 9597 10721
$$ packed form
6910a8322M3330K6450o610n325r609j3586p102K965p474K829n161m657M416q179
6896f035Q913M385Q926L094j8743j3327j7293j1455j6297J1112R686J5206J1037
6883a0791j0727r170l216j898j0585J376J9231O833L564K7M208P681L847J8270
6869A8650J667k105k287j7815k7743J2389J1384L2626k996k1527j4099j5872N69
6856b7159p120j0864K2155J5681l50J0916Q264K1604K613k7221m5035Q368L5042
6843F894J1664k3517r621J4905Q930j1080j3242j3763r757J993n35J6307K8278
6830G456O22k7529J3689K3728q133Q468J6284J7874o264q714j7998j8515J3144
6817A4112j3453j1317j5252n06J3455J6193j7090J2006J8267Q851j9429L760J124
$$ plain form
6804 10721 18245 -8975 -31203 -50779 -24038 -25605 -23921 -28095 2185 24333 39928 28073 33603
6791 33603 39714 -8947 -21397 -34649 -27315 -5995 1320 -3290 -6275 -18419 -26445 -17809 -24103
6778 -24103 -39314 -46599 -15737 -10684 -35582 -27908 -407 -2598 -11322 24116 -13137 -36869 -18027
6765 -18027 12274 41721 45921 22715 -9258 -8913 8557 -6467 -12706 -30283 -5293 -2881 -8961
6752 -8961 -13497 -21111 -29118 -24658 -25546 -22581 -19283 -28431 -43022 -47125 -25146 -7993 -6930 -12246
6738 -12246 -8387 4322 2189 24704 29439 21294 6995 30592 29860 18993 13171 -5511 -25212
6725 -25212 -16703 -30977 -16075 12344 -797 -16160 1941 23334 -821 -34965 -46934 -61756
6713 -61756 -58543 -34260 -2525 8950 9566 10576 -10486 -18454 -14992 -22549 -28597 7608 39011
$$ packed form
6804A0721P524k7220k2228j9576K6741j567J684m174L0280K2148J5595j1855N530
6791C3603O111m8661j2450j3252P334K1320P315m610k985j2144q026Q636o294
6778b4103j5211p285L0862N053k4898P674K7501k191q724L5438l7253k3732J8842
6765a8027L0301K9447M200k3206l1973L45J7470j5024o239j7577K4990K412o080
6752h961m536p614q007M460q88K965L298r148j4591m103K1979J7153J063n316
6738a2246L859J2709k133K2515M735q145j4299K3597p32j0867n822j8682j9701
6725b5212Q509j4274J4902K8419j3141j5363J8101K1393k4155l4144j1969j4822
6713f1756L213K4283L1735J1475O16J010k1062p968L462p557o048L6205L1403
$$ plain form
6700 39011 25674 44700 28725 6744 -5413 3662 14647 7665 -12207 -36880 -36831 -17266 -3520
6687 -3520 7862 -4270 -26046 -23468 -33045 -17702 -11005 -23071 -35595 -34644 -5240 6105 5402
6674 5402 969 -6233 -8522 -331 -17172 -5470 8857 -6322 5702 32941 11377 -22062 -26902
6661 -26902 -30726 -8287 -2866 -22818 -29869 -26634 -6529 -3789 -31131 -29091 -28594 -29601 -2071 5041
6647 5041 1232 -11033 5595 21451 22625 21954 21378 9435 -3156 -17921 -34470 -32598 -33205 -22428
6633 -22428 -19878 -11829 -16974 -5983 -14753 -57883 -47816 -15107 -2126 10204 -5446 -21652 -13644
6620 -13644 -9900 -5493 -14348 -12993 -9861 2111 -3570 4455 -2581 12368 -8139 1913 16636
6607 16636 24135 -4121 24740 34476 25064 1485 -18794 -15495 9991 21285 18458 -8240 4796
$$ packed form
6700C9011j3337J9026j5975k1981j2157R075J0985o982j9872k4673M9J9565J3746
6687c520J1382j2132k1776K578r577J5343O697j2066j2524R51K9404J1345p03
6674E402m433p202k289Q191j6841J1702J4327j5179J2024K7239k1564l3439m840
6661b6902l824K2439N421j9952p051L235K0105K740k7342K040M97j007K7530P112
6647E041l809j2265J6628J5856J174o71n76j1943j2591j4765j6549J872o07J0777
6633b2428K550Q049n145J0991q770m3130J0067L2709J2981J2330j5650j6206Q008
6620a3644L744M407q855J355L132J1972n681Q025p036J4949k0507J0052J4723
6607A6636P499k8256K8861R736r412k3579k0279L299K5486J1294k827k6698J3036
$$ plain form
6594 4796 18036 8408 -29397 -37704 -18011 10100 32390 31022 36299 30845 15128 6851 -6861
6581 -6861 -27431 -13736 -7293 -28263 -7217 -470 11890 899 -15175 -15226 -15697 -28166 -36570 -32886
6567 -32886 -14040 3288 -20692 -29948 -456 1022 -4773 -11957 -12156 -38793 -51187 -19844 5235
6554 5235 -25874 -48719 -42898 -38405 -27830 -4593 -7044 -41448 -18698 1531 -4548 -15955 -10305
6541 -10305 -17171 -21020 -13497 -15215 -15738 -29692 -5190 -7922 12276 12249 4688 -20569 -29774 -16498
6527 -16498 13322 23373 13606 23365 -10145 -8415 -2198 -6335 10453 11598 25603 12497 -2895
6514 -2895 -17993 1787 31012 13359 -7305 -11492 -2190 -4197 -3702 7463 -14215 -19594 1736
6501 1736 29304 28163 6810 -8330 -4990 -4386 12892 -538 9897 2533 -11487 -39706 -34255
$$ packed form
6594D796J3240r628l7805q307J9693K8111K2290j368N277n454j5717q277j3712
6581f861k0570J3695O443k0970K1046O747J2360j0991j6074n1m71j2469q404L684
6567c2886J8846J7328k3980r256K9492J478n795p184j99k6637j2394L1343K5079
6554E235l1109k2845N821M493J0575K3237k451l4404K2750K0229o079j1407N650
6541a0305o866l849P523j718n23j3954K4502k732K0198k7p561k5257r205J3276
6527a6498K9820J0051r767R759l3510J730O217m137J6788J145J4005j3106j5392
6514b895j5098J9780K9225j7653k0664m187R302k007M95J1165k1678n379K1330
6501A736K7568j141k1353j5140L340O04J7278j3430J0435p364j4020k8219N451
$$ plain form
6488 -34255 -12990 -27011 -17456 12447 19583 15061 10153 -19019 -26675 -22544 -7937 -23687 -31897
6475 -31897 -16731 -2737 -16022 -58265 -71740 -46566 -55131 -56297 -46547 -30749 -35552 -57187 -60293
6462 -60293 -59921 -57245 -15868 37781 55362 24995 11459 -14775 -13514 -13631 -22238 -38721 -14240
6449 -14240 6448 9528 11504 -12011 -24488 -25451 6370 4291 -167 5199 -7438 -4979 33639
6436 33639 23314 2484 3806 23319 -14913 -36417 -27191 -12955 21975 47075 18401 -183
6424 -183 -18947 -14022 -3471 3019 33144 43688 -1498 -13521 -22963 2173 11629 17998 3633
6411 3633 -1821 4396 3855 2851 -2732 -4764 -3253 -17055 -28383 -36559 -10726 -13661 -6974 9985
6397 9985 -13647 -21776 -1027 -5404 -15210 -11240 -6791 1496 12241 -3450 -13280 -19354 -24268 -19120
$$ packed form
6488c4255K1265j4021R555K9903P136m522m908k9172p656M131J4607j5750q210
6475c1897J5166J3994j3285m2243j3475K5174q565j166R750J5798m803k1635l106
6462f0293L72K676M1377N3649J7581l0367j3536k6234J261j17q607j6483K4481
6449a4240K0688L080J976k3515j2477r63L1821k079m458N366j2637K459L8618
6436C3639j0325k0830J322J9513l8232k1504R226J4236L4930K5100k8674j8584
6424a83j8764M925J0551O490L0125J0544m5186j2023r442K5136R456O369j4365
6411C633n454O217n41j004n583k032J511j3802j1328q176K5833k935O687J6959
6397I985k3632q129K0749m377r806L970M449Q287J0745j5691r830o074m914N148
$$ plain form
6383 -19120 -54005 -58380 -55269 -26358 -22092 -13201 860 6234 13789 27336 25887 42779 59712
$$ packed form
6383a9120l4885m375L111K8911M266Q891J4061N374P555J3547j449J6892J6933
$$ [...]
##END NTUPLES=NMR SPECTRUM
##END=
