##TITLE=Analysis number 317469
Compound Code cc 48702
Book Reference 456/114/2
Project Code qc-cat
Chemist Name anns
##JCAMPDX= 6.0         $$ Bruker NMR JCAMP-DX V2.0
##DATA TYPE= NMR SPECTRUM
##DATA CLASS= NTUPLES
##ORIGIN= Bruker BioSpin GmbH
##OWNER= nmr
$$ XWIN-NMR		Version 3.5
$$ Tue Feb 21 11:49:31 2006 GMT Standard Time (UT+0h)  MAYBRIDGE\nmr@NMR_250MHZ
##.OBSERVE FREQUENCY= 250.131544655141
##.OBSERVE NUCLEUS= ^1H
##.ACQUISITION MODE= SIMULTANEOUS (DQD)
##.ACQUISITION SCHEME= undefined
##.AVERAGES= 16
##.DIGITISER RES= 18
##SPECTROMETER/DATA SYSTEM= dpx250
##.PULSE SEQUENCE= zg30
##.SOLVENT NAME= CDCl3
##.SHIFT REFERENCE= (INTERNAL, CDCl3, 0, 16.522)
##AUDIT TRAIL= $$ (NUMBER, WHEN, WHO, WHERE, WHAT)
$$ ##TITLE= Audit trail, XWIN-NMR		Version 3.5
$$ ##JCAMPDX= 5.01
$$ ##ORIGIN= Bruker BioSpin GmbH
$$ ##OWNER= nmr
$$ C:\u/data/dgb/nmr/ADRS/16540/pdata/1/auditp.txt
$$ ##AUDIT TRAIL=  $$ (NUMBER, WHEN, WHO, WHERE, WHAT)
(   1,<2006-02-21 11:48:52.64 +000>,<MAYBRIDGE\nmr>,<NMR_250MHZ>,
      <created by zg, POWCHK disabled, PULCHK disabled
       configuration hash MD5:
       84 BC 41 DB A1 6E 1D 46 DA 25 12 A5 C1 ED C5 3A
       data hash MD5: 64K
       43 96 00 4D 13 56 C9 F8 79 7C C8 06 FA C2 EB 43>)
(   2,<2006-02-21 11:49:13.33 +000>,<MAYBRIDGE\nmr>,<NMR_250MHZ>,
      <Start of raw data processing
       ef LB = 0.3 FT_mod = 6 PKNL = 1 SI = 32K 
       data hash MD5: 32K
       E5 6A 53 6A AD 84 E8 EE 0E 24 24 C6 AB C1 6A 87>)
(   3,<2006-02-21 11:49:18.61 +000>,<MAYBRIDGE\nmr>,<NMR_250MHZ>,
      <apk 
       data hash MD5: 32K
       26 BE 11 AA 05 D5 BD 41 9A DB A3 0F 6A A2 F5 61>)
(   4,<2006-02-21 11:49:20.31 +000>,<MAYBRIDGE\nmr>,<NMR_250MHZ>,
      <abs ABSG = 5 
       data hash MD5: 32K
       61 A9 7C 10 95 92 B7 E1 85 0F 71 4D 34 B4 7B E6>)
$$ ##END=
$$ 
$$ hash MD5
$$ 94 CC 44 DC 1B B3 BE 4F 9D 0E A4 8E F1 F9 90 23
##$RELAX= 
##$RELAX= 
##$RELAX= 
##$RELAX= 
##$RELAX= 
##$RELAX= 
##$RELAX= 
$$ Bruker specific parameters
$$ --------------------------
##$DU= <C:\u>
##$EXPNO= 16540
##$NAME= <ADRS>
##$PROCNO= 1
##$TYPE= <nmr>
##$USER= <dgb>
##$AMP= (0..31)
100 100 100 100 100 100 100 100 100 100 100 100 100 100 100 100 100 100 
100 100 100 100 100 100 100 100 100 100 100 100 100 100 
##$AQSEQ= 0
##$AQ_mod= 3
##$AUNM= <au_zg>
##$AUTOPOS= <24 >
##$BF1= 250.13
##$BF2= 250.13
##$BF3= 250.13
##$BF4= 250.13
##$BF5= 500.13
##$BF6= 500.13
##$BF7= 500.13
##$BF8= 500.13
##$BYTORDA= 1
##$CFDGTYP= 0
##$CFRGTYP= 5
##$CHEMSTR= <none>
##$CNST= (0..31)
1 1 145 1 1 1 1 1 1 1 1 1 1 1 1 1 1 1 1 1 1 1 1 1 1 1 1 1 1 1 1 1 
##$CPDPRG= <>
##$CPDPRG1= <>
##$CPDPRG2= <>
##$CPDPRG3= <>
##$CPDPRG4= <mlev>
##$CPDPRG5= <mlev>
##$CPDPRG6= <mlev>
##$CPDPRG7= <mlev>
##$CPDPRG8= <mlev>
##$CPDPRGB= <>
##$CPDPRGT= <>
##$D= (0..31)
0 1 0 0 0 0 0 0 0 0.06 0 0 0 0 0 0 0.0002 0 0 0 0 0 0 0 0 0 0 0 0 0 0 
0 
##$DATE= 1140522530
##$DBL= (0..7)
120 120 120 120 120 120 120 120 
##$DBP= (0..7)
150 150 150 150 150 150 150 150 
##$DBP07= 0
##$DBPNAM0= <>
##$DBPNAM1= <>
$$ [...]
##$SUBNAM7= <"">
##$SUBNAM8= <"">
##$SUBNAM9= <"">
##$SW= 20.6930455092707
##$SWIBOX= (0..15)
0 0 3 0 0 0 0 0 0 0 0 0 0 0 0 0 
##$SW_h= 5175.983436853
##$TD= 65536
##$TD0= 1
##$TE= 294.16
##$TE2= 300
##$TE3= 300
##$TEG= 300
##$TL= (0..7)
0 120 120 120 120 120 120 120 
##$TP= (0..7)
150 150 150 150 150 150 150 150 
##$TP07= 0
##$TPNAME0= <>
##$TPNAME1= <>
##$TPNAME2= <>
##$TPNAME3= <>
##$TPNAME4= <>
##$TPNAME5= <>
##$TPNAME6= <>
##$TPNAME7= <>
##$TPOAL= (0..7)
0.5 0.5 0.5 0.5 0.5 0.5 0.5 0.5 
##$TPOFFS= (0..7)
0 0 0 0 0 0 0 0 
##$TUNHIN= 0
##$TUNHOUT= 0
##$TUNXOUT= 0
##$USERA1= <user>
##$USERA2= <user>
##$USERA3= <user>
##$USERA4= <user>
##$USERA5= <user>
##$V9= 5
##$VALIST= <valist>
##$VCLIST= <CCCCCCCCCCCCCCC>
##$VD= 0
##$VDLIST= <DDDDDDDDDDDDDDD>
##$VPLIST= <PPPPPPPPPPPPPPP>
##$VTLIST= <TTTTTTTTTTTTTTT>
##$WBST= 1024
##$WBSW= 4
##$XGAIN= (0..3)
0 0 0 0 
##$XL= 0
##$YL= 0
##$YMAX_a= 467009
##$YMIN_a= -488612
##$ZGOPTNS= <>
##$ZL1= 120
##$ZL2= 120
##$ZL3= 120
##$ZL4= 120
##$ABSF1= 16.522
##$ABSF2= -4.171173
##$ABSG= 5
##$ABSL= 3
##$ALPHA= 0
##$AQORDER= 0
##$ASSFAC= 0
##$ASSFACI= 0
##$ASSFACX= 0
##$ASSWID= 0
##$AUNMP= <proc_1d>
##$AZFE= 0.1
##$AZFW= 0.1
##$BCFW= 0
##$BC_mod= 0
##$BYTORDP= 0
##$COROFFS= 0
##$CY= 12.5
##$DATMOD= 1
##$DC= 0
##$DFILT= <>
##$DTYPP= 0
##$F1P= 14.0000005364418
##$F2P= -0.99999901652339
##$FCOR= 0.5
##$FTSIZE= 32768
##$FT_mod= 6
##$GAMMA= 0
##$GB= 0
##$INTBC= 1
##$INTSCL= 1
##$ISEN= 128
##$LB= 0.3
##$LEV0= 0
##$LPBIN= 0
##$MAXI= 10000
##$MC2= 0
##$MEAN= 0
##$ME_mod= 0
##$MI= 0
##$NCOEF= 0
##$NC_proc= -4
##$NLEV= 6
##$NOISF1= 0
##$NOISF2= 0
##$NSP= 0
##$NTH_PI= 0
##$NZP= 0
##$OFFSET= 16.522
##$PC= 1
##$PHC0= -122.5618
##$PHC1= 32.90287
##$PH_mod= 1
##$PKNL= yes
##$PPARMOD= 0
##$PSCAL= 4
##$PSIGN= 0
##$REVERSE= no
##$SF= 250.13
##$SI= 32768
##$SIGF1= 0
##$SIGF2= 0
##$SINO= 400
##$SIOLD= 32768
##$SREGLST= <1H.CDCl3>
##$SSB= 0
##$STSI= 32768
##$STSR= 0
##$SW_p= 5175.98343685301
##$SYMM= 0
##$S_DEV= 0
##$TDeff= 65536
##$TDoff= 0
##$TI= <Analysis number 999999
Compound Code 99
Book Reference 9
Project Code 9>
##$TILT= no
##$TM1= 0
##$TM2= 0
##$TOPLEV= 0
##$USERP1= <user>
##$USERP2= <user>
##$USERP3= <user>
##$USERP4= <user>
##$USERP5= <user>
##$WDW= 1
##$XDIM= 32768
##$YMAX_p= 526541567
##$YMIN_p= -701004
$$ End of Bruker specific parameters
$$ ---------------------------------
##NTUPLES= NMR SPECTRUM
##VAR_NAME=  FREQUENCY,     SPECTRUM/REAL,   SPECTRUM/IMAG
##SYMBOL=    X,             R,               I
##VAR_TYPE=  INDEPENDENT,   DEPENDENT,       DEPENDENT
##VAR_FORM=  AFFN,          ASDF,            ASDF
##VAR_DIM=   32768,         32768,           32768
##UNITS=     HZ,            ARBITRARY UNITS, ARBITRARY UNITS
##FACTOR=    0.157963299565203, 1,           1
##FIRST=     4132.6476996994, 0,             0
##LAST=      -1043.33573715361, 0,           0
##MIN=       -1043.33573715361, -701004,     0
##MAX=       4132.6476996994, 526541567,     0
$$ Real data points
##PAGE= N=1
##DATA TABLE= (X++(R..R)), XYDATA
$$ [...]
##PAGE= N=2
##DATA TABLE= (X++(I..I)), XYDATA
22867B528809o7130L6479O1393J37391K4228R3659o9014K3593j06496j46238p131
$$ 2528809 2461679 2498158 2559551 2696942 2721170 2814829 2745815 2769408 2662912 2516674 2509543
22856B509543J3206N0072O463l9247K832k8690j12870J97321J94821J82364k42045
$$ 2509543 2522749 2572821 2579284 2540037 2542869 2514179 2401309 2598630 2793451 2975815 2733770
22845B733770k85518K4951J76636n1701j42690j14026j19585P3989K88805J10274
$$ 2733770 2448252 2473203 2649839 2598138 2455448 2341422 2221837 2295826 2584631 2694905
22835B694905k643P6688m4372j1765L8714O5260L2683M2451k51062K7846L8274
$$ 2694905 2692262 2768950 2724578 2712813 2751527 2816787 2849470 2891921 2640859 2668705 2706979
22824B706979J14036n7342m7296K18840m6870r3226m9998q2136k20701m5203J69132
$$ 2706979 2821015 2763673 2716377 2935217 2888347 2795121 2745123 2662987 2442286 2397083 2566215
22813B566215J23218J64768K8546j18J11456j85585j65451j33467J1845L23554
$$ 2566215 2689433 2854201 2882747 2882629 2994085 2808500 2643049 2509582 2521427 2844981
22803B844981Q0853n7104l5838p8282J1535K4750j50740r4615J79044K3840q5861
$$ 2844981 2925834 2868730 2832892 2754610 2766145 2790895 2640155 2545540 2724584 2748424 2662563
22792B662563l8603l6512n3085J3104O7663J25822j8479k0867p1034Q7938q0172
$$ 2662563 2623960 2587448 2534363 2547467 2615130 2740952 2722473 2701606 2630572 2718510 2638338
22781B638338m2014N7952O4150p1552j34984J7560J58078n3650q1777J7203m5126
$$ 2638338 2596324 2654276 2718426 2646874 2511890 2529450 2687528 2633878 2552101 2569304 2524178
22770B524178O8379k0951J53886L57771l5720r1565p0214j85342N5184j29462
$$ 2524178 2592557 2571606 2725492 3083263 3047543 2955978 2885764 2700422 2755606 2626144
22760B626144j18192m2785K06249J84843j45986j92352j1460J17174M1503m9201
$$ 2626144 2507952 2465167 2671416 2856259 2710273 2517921 2506461 2623635 2665138 2615937
22750B615937Q974P4250J38570L2641J32411M7705o0472j19190r8830q1055k5366
$$ 2615937 2624911 2699161 2837731 2870372 3002783 3050488 2990016 2870826 2771996 2690941 2665575
22739B665575J38695J61143j11876Q9473q7081l4006R4888N2318k0231q9928m711
$$ 2665575 2804270 2965413 2853537 2943010 2855929 2821923 2916811 2969129 2948898 2858970 2854259
22728B854259l5586N780m8518j2212J25005n825N8957p0633P0177p1491p6710
$$ 2854259 2818673 2824453 2775935 2763723 2888728 2882903 2941860 2871227 2941404 2869913 2793203
22717B793203m3371O7838K81666j44926k72897l2958N3468R9558L099r4176K0748
$$ 2793203 2749832 2817670 3099336 2954410 2681513 2648555 2702023 2801581 2804680 2710504 2731252
22706B731252o5324R8516R4720o553j66971L9077J17423K9953j08368j59028L8245
$$ 2731252 2665928 2764444 2859164 2852611 2685640 2724717 2842140 2872093 2763725 2604697 2642942
22695B642942J98603j477P1717Q2618p383l0328j42146k54165j3364P9093j2423
$$ 2642942 2841545 2840068 2911785 2994403 2987020 2956692 2814546 2560381 2547017 2626110 2613687
22684B613687J23629J39406J01586M6748j28397n0010M3283O2533L00o9247q9335
$$ 2613687 2737316 2876722 2978308 3025056 2896659 2846649 2889932 2952465 2952765 2883518 2794183
22673B794183j40141q5413J6339J33855j6507J16384Q9182Q5486l4473j3038J13780
$$ 2794183 2654042 2568629 2584968 2718823 2702316 2818700 2907882 2993368 2958895 2945857 3059637
22662C059637j71696l07869j8887J11373K25912O3863P4272k02494J76297Q0561
$$ 3059637 2887941 2580072 2561185 2672558 2898470 2962333 3036605 2834111 3010408 3090969
22652C090969l26380q8107Q5984j04444j84421j39765M9885K34078J91656L1527
$$ 3090969 2764589 2676482 2762466 2658022 2473601 2333836 2383721 2617799 2809455 2840982
22642B840982j4106l9101m9538P3571j13247Q0828j40607L121l9834O6269j1348
$$ 2840982 2826876 2787775 2738237 2811808 2698561 2779389 2638782 2641903 2602069 2668338 2656990
22631B656990k8709o6773o8212J4475K29256J85620q3161o127J41144n805r6381
$$ 2656990 2628281 2561508 2493296 2507771 2737027 2922647 2839486 2833359 2974503 2968698 2872317
22620B872317m1476k1106L2526n795m5226o2253P7885M6304j3469j3075p3760
$$ 2872317 2830841 2809735 2842261 2836466 2791240 2728987 2806872 2853176 2839707 2826632 2752872
22609B752872k14797K7557j2847J03013n099n9163J10914K94963J46289j30844
$$ 2752872 2538075 2565632 2552785 2655798 2650699 2591536 2702450 2997413 3143702 3012858
22599C012858k31704j80551j30353J18010J06499o4969K05110J68594j26073j8959
$$ 3012858 2781154 2600603 2470250 2588260 2694759 2629790 2834900 3003494 2877421 2858462
22589B858462n9392j0787n2514n7449L9325K9399p713J56699P7376j19214o618
$$ 2858462 2799070 2788283 2735769 2678320 2717645 2747044 2739331 2896030 2973406 2854192 2847574
22578B847574j49462j37120q8552L4072J22023K78577p178r6052p5989r6879O3605
$$ 2847574 2698112 2560992 2472440 2506512 2628535 2907112 2899934 2803882 2727893 2631014 2694619
22567B694619K84781n184r5590O2000k9722l2262R0308j45410j0386Q1418K29570
$$ 2694619 2979400 2974216 2878626 2940626 2910904 2878642 2968950 2823540 2813154 2894572 3124142
22556C124142R546j11677l7356p1859l681k8460J0229o9543K501m9990r944p1133
$$ 3124142 3133688 3022011 2984655 2912796 2909115 2880655 2890884 2821341 2823842 2773852 2763908 2692775
22544B692775O3003J3499M3617J42o2200J56490K18271j27677j38682q4194r1362
$$ 2692775 2755778 2769277 2812894 2813036 2750836 2907326 3125597 2997920 2859238 2775044 2683682
22533B683682J23181M4607J3581J8046m6297q2760J18185j07055o8609J41305
$$ 2683682 2806863 2851470 2865051 2883097 2836800 2754040 2872225 2765170 2696561 2837866
22523B837866J88417M8645Q6139j15704l5186j44443R4595J67206M238j05456
$$ 2837866 3026283 3074928 3161067 3045363 3010177 2865734 2960329 3127535 3131773 3026317
22513C026317k39733q0961j22302L4834K61290Q2216j20525L4660L5721N4298
$$ 3026317 2786584 2705623 2583321 2618155 2879445 2961661 2841136 2875796 2911517 2965815
22503B965815k0432q0630n0342j12827k9364J45049K48710J9458j7143k0904j55500
$$ 2965815 2945383 2864753 2814411 2701584 2672220 2817269 3065979 3085437 3068294 3047390 2891890
22492B891890k69720L4403J48111J04353P3610N8848r443k25901k67751R3043
$$ 2891890 2622170 2656573 2804684 2909037 2982647 3041495 3032052 2806151 2538400 2631443
22482B631443J77106o5453O8034J18434J05121j33282j33773J4549N8027N6079
$$ 2631443 2808549 2743096 2811130 2929564 3034685 2901403 2767630 2782179 2840206 2896285
22472B896285L826K2391j6283Q824R067o253j38926N9453P1619L0393J1119P0479
$$ 2896285 2900111 2922502 2906219 2915043 2924110 2917857 2778931 2838384 2910003 2940396 2951515 3021994
22460C021994n2091n0263L8722J8400K08972O6098k98800q7209o6788L4465N5014
$$ 3021994 2969903 2919640 2958362 2976762 3185734 3251832 2953032 2865823 2799035 2833500 2888514
22449B888514R0256r006j0959j39266j52846J44032K0171J53502J14362J51987
$$ 2888514 2978770 2969764 2958805 2819539 2666693 2810725 2830896 2984398 3098760 3250747
22439C250747K12989K0645j54251l3621j49781O6472j2892r411J689j0104j18793
$$ 3250747 3463736 3484381 3330130 3296509 3146728 3213200 3200308 3190897 3192586 3182482 3063689
22428C063689M5549K8820j14632m5452O8685j07050p9497J13321L0403M5210j99572
$$ 3063689 3109238 3138058 3023426 2977974 3046659 2939609 2860112 2973433 3003836 3049046 2849474
22417B849474j04614K199j00240J7783J96046q6588Q5234O6992p057J02333r0949
$$ 2849474 2744860 2747059 2646819 2664602 2860648 2774060 2859294 2926286 2919229 3021562 2930613
22406B930613Q2211J36098M8800O6929l7378M4555R9280L4970j70454k3778J06155
$$ 2930613 3012824 3148922 3197722 3264651 3227273 3271828 3371108 3406078 3235624 3211846 3318001
22395C318001j88552K7600R7058N200l08106q5767M2848j2924j4353N7136K4877
$$ 3318001 3129449 3157049 3254107 3259307 2951201 2865434 2908282 2895358 2881005 2938141 2963018
22384B963018J65749J7368j11929p1569L1654L3433j15090j17802J07531m8124
$$ 2963018 3128767 3146135 3034206 2962637 2994291 3027724 2912634 2794832 2902363 2854239
22374B854239j9951q4302P4961J28611j0901m0402M3070j27333K3012p7079J3725
$$ 2854239 2834288 2749986 2824947 2953558 2942657 2902255 2945325 2817992 2841004 2763925 2777650
22363B777650J13778p500K354k3390K7695o7240J79273J53507O5552O3199j05285
$$ 2777650 2891428 2883928 2886282 2862892 2890587 2823347 3002620 3156127 3221679 3284878 3179593
22352C179593j87023j20696J11732O7538J9738J20317R4202K7593P2284r1950
$$ 3179593 2992570 2871874 2983606 3051144 3070882 3191199 3285401 3312994 3385278 3293328
22342C293328j37033P381K36210j43923K213j7240j50254J37265j14376l63426
$$ 3293328 3156295 3163676 3399886 3255963 3258176 3240936 3090682 3227947 3113571 2750145
22332B750145p1051Q2666J36913l8282l994l803N1991p2068P4208J14723p170
$$ 2750145 2679094 2761760 2898673 2860391 2856397 2852594 2904585 2832517 2906725 3021448 3014278
22321C014278k9493J32379J04753M3358j35393k13989j18196R807J21408m5035
$$ 3014278 2984785 3117164 3221917 3265275 3129882 2915893 2797697 2807504 2928912 2883877
22311B883877j1971J37861J46890P3696M3293m189o0115k62980k4640m2403j04461
$$ 2883877 2871906 3009767 3156657 3230353 3273646 3269457 3209342 2946362 2921722 2879319 2774858
22300B774858K5058J78946K04230O4617p3010p5141L6685j77346J19078J40967
$$ 2774858 2799916 2978862 3183092 3247709 3174699 3099558 3136243 2958897 3077975 3218942
22290C218942j35635n0876n7649n386K4233j04116j14195O0187L21135N8217j51612
$$ 3218942 3083307 3032431 2974782 2969396 2993629 2889513 2775318 2835505 3156640 3214857 3063245
22279C063245k21567o7876K2650J35765K9936P6628J64097O8163n0858m8552L2952
$$ 3063245 2841678 2773802 2796452 2932217 2962153 3038781 3202878 3271041 3220183 3171631 3204583
22268C204583r7836j77374J6870K60491J53602K3927j35630j03051j61609K0550
$$ 3204583 3106747 2929373 2946243 3206734 3360336 3384263 3248633 3145582 2983973 3004523
22258C004523m834q2500L7354M5916J70348o8733j8650M9615l3830O2114L9940
$$ 3004523 2999689 2917189 2954543 3000459 3170807 3102074 3083424 3133039 3099209 3161323 3201263
22247C201263K8592q6877J13077j5360p8803j80840N5352o5442M9681N0835J00589
$$ 3201263 3229855 3142978 3256055 3240695 3161892 2981052 3036404 2970962 3020643 3071478 3172067
22236C172067J37009j29550n6199O8894J252k1787O6371j21214k15016M087J15794
$$ 3172067 3309076 3179526 3123327 3192221 3193473 3171686 3238057 3116843 2901827 2905914 3021708
22225C021708J21552K3371n6440J27617l1860P5291j3920k08925j5023L6874l9097
$$ 3021708 3143260 3166631 3110191 3237808 3205948 3281239 3267319 3058394 3043371 3080245 3041148
22214C041148J15954m3126l22941r4909K74575J02416L0748q4948q2887J30141
$$ 3041148 3157102 3113976 2791035 2696126 2970701 3073117 3103865 3018917 2936030 3066171
22204C066171K15482R7596l2160p8557K8733J51635k33238k16289N6149J33100
$$ 3066171 3281653 3379249 3347089 3268532 3297265 3448900 3215662 2999373 3055522 3188622
22194C188622j29274q1737P0065L7055m8616k18300R1137J64522J60445J00144
$$ 3188622 3059348 2977611 3047676 3084731 3036115 2817815 2908952 3073474 3233919 3334063
22184C334063M3379P484P9417N7115j56091j48412k1656K1003l4333M8217N3789
$$ 3334063 3377442 3384926 3464343 3521458 3365367 3216955 3195299 3216302 3181969 3230186 3283975
22173C283975j8465K3489q4368j24507j3912J32454q116R7032j15777k17435J5147
$$ 3283975 3265510 3288999 3204631 3080124 3066212 3198666 3190550 3287582 3171805 2954370 2969517
22162B969517Q963K7040M7924J54101M9719j062p4267k9872q8502j3851P2302
$$ 2969517 2978480 3005520 3053444 3207545 3257264 3256202 3181935 3152063 3063561 3049710 3122012
22151C122012J44512M0954J8617J48798L05425N272l88730l07488l7991J02161
$$ 3122012 3266524 3307478 3326095 3474893 3780318 3785590 3396860 3089372 3051381 3153542
22141C153542O9981m4891n9497J77401R5012j70832M3898O396j173j9870k6461
$$ 3153542 3223523 3178632 3119135 3296536 3391548 3220716 3264614 3271010 3269837 3249967 3223506
22130C223506J66274j0633j15274R4708j2789K097P1638m1027j80063q8543J04708
$$ 3223506 3389780 3379147 3263873 3358581 3345792 3347889 3419527 3378500 3198437 3109894 3214602
22119C214602o277r143q4673N3204J40581J27668K3211k80697j19817p6244J78661
$$ 3214602 3208325 3199182 3114509 3167713 3308294 3435962 3459173 3178476 3058659 2982415 3161076
22108C161076J93578J32056k67232k29978k0969K04324J9792j8451J07619J69584
$$ 3161076 3354654 3486710 3219478 2989500 2968531 3172855 3192647 3174196 3281815 3451399
22098C451399J2988J76321J00429P532j53549k06761j73463K9013q2237l0548
$$ 3451399 3464387 3640708 3741137 3748669 3595120 3388359 3214896 3243909 3161672 3131124
22088C131124K82601J47965o2632j62729k01322J37774K75790p485k51889j55082
$$ 3131124 3413725 3561690 3499058 3336329 3135007 3272781 3548571 3541086 3289197 3134115
22078C134115L5245Q2826K1030o1892q7371j17141j7035J92406k8507l4476J41730
$$ 3134115 3169360 3252186 3273216 3211324 3123953 3006812 2989777 3182183 3153676 3119200 3260930
22067C260930k6787j86779J07556K37024J0451n0029J83334M4502P8685L279l9690
$$ 3260930 3234143 3047364 3154920 3391944 3402395 3352366 3535700 3580202 3658887 3662166 3622476
22056C622476j29841j4432m2879J21377J98789j92900j62170j32795P8717j733
$$ 3622476 3492635 3478203 3435324 3556701 3755490 3562590 3400420 3267625 3346342 3344609
22046C344609p052N7854J51482J39029k51371r5333J93745j25474j32893j05977
$$ 3344609 3337557 3395411 3546893 3685922 3434551 3339218 3532963 3407489 3274596 3168619
22036C168619j1294K07985J94085n0247q4925j24422m0620J11445j0431J41950
$$ 3168619 3157325 3365310 3559395 3509148 3424223 3299801 3259181 3370626 3360195 3502145
22026C502145J31251j06091J11042j48549j43351j9195L1431M6225J37870Q3688
$$ 3502145 3633396 3527305 3638347 3489798 3346447 3327252 3358683 3404908 3542778 3626466
22016C626466k55080K4884K00808J057k53046J6565M3481p0481Q0720L4648j56764
$$ 3626466 3371386 3396270 3597078 3598135 3345089 3361654 3405135 3334654 3415374 3450022 3293258
22005C293258j88223N2185J66422k1298K6357R0540p1810q2753J2599M4589K08958
$$ 3293258 3105035 3157220 3323642 3302344 3328701 3419241 3347431 3264678 3277277 3321866 3530824
21994C530824P747N657M6351q491j33816P8404J26986r6395l9514m0356j62996
$$ 3530824 3538571 3544228 3590579 3582088 3448272 3526676 3653662 3557267 3517753 3477397 3314401
21983C314401j50509R4464K23680j26130l0228Q6485J48502J3990j32439j76003
$$ 3314401 3163892 3258356 3482036 3355906 3325678 3412163 3560665 3574655 3442216 3266213
21973C266213j857N5533l6217J40915L99228j16947k35707n6809L712J56808k9192
$$ 3266213 3264356 3319889 3283672 3424587 3823815 3706868 3471161 3414352 3418064 3574872 3545680
21962C545680j22845p5336J13094J51459m0353o5420j8212n9972K1198J96236
$$ 3545680 3422835 3347499 3460593 3612052 3571699 3506279 3488067 3428095 3449293 3645529
21952C645529K9193k8644O315M4060N529M4427M0580j01133j43166J20756j6728
$$ 3645529 3674722 3646078 3652393 3696453 3701982 3746409 3786989 3685856 3542690 3663446 3646718
21941C646718k23396j14988j0146p121J07241j01192M1091K12304m2375q6093
$$ 3646718 3423322 3308334 3298188 3291067 3398308 3297116 3338207 3550511 3508136 3422043
21931C422043j22203R4789O8474k0358l3874n4574j12473m0375K19213J85898
$$ 3422043 3299840 3394629 3463103 3442745 3408871 3354297 3241824 3201449 3420662 3606560
21921C606560o6747k49369j86508J6186K6602J30180J08597k572M4202n9143l8486
$$ 3606560 3539813 3290444 3103936 3120122 3146724 3276904 3385501 3382929 3427131 3367988 3329502
21910C329502K23897n4777p9863J61674K27207p4456k93936k8832j09075j26762
$$ 3329502 3553399 3498622 3418759 3580433 3807640 3733184 3439248 3410416 3301341 3174579
21900C174579k1085Q1897O0730K50384O3285j31396p7258K60818J24517j06216
$$ 3174579 3153494 3235391 3296121 3546505 3609790 3478394 3401136 3661954 3786471 3680255
21890C680255j80923n4915J45655K9765j58081J04063R0802k19067R220j5697
$$ 3680255 3499332 3444417 3590072 3619837 3461756 3565819 3656621 3437554 3446774 3431077
21880C431077r284R519j05126J40308J85461r5003j01845j09969J37339J75859
$$ 3431077 3421793 3431312 3326186 3466494 3651955 3556952 3455107 3345138 3482477 3658336
21870C658336N4658r9604j74079J5053J21228K3560J829M7351j87921j45643n2148
$$ 3658336 3712994 3613390 3439311 3454364 3575592 3599152 3600981 3648332 3460411 3314768 3262620
21859C262620L1312j2069n3838Q3478J07914k01196m3110J1119J9998L3413K86015
$$ 3262620 3293932 3281863 3228025 3311503 3419417 3218221 3175111 3186230 3206228 3239641 3525656
21848C525656M7008O3401j6844q1644J23093L9595K9316j4030M1542K00707r3851
$$ 3525656 3572664 3636065 3619221 3537577 3660670 3700265 3729581 3715551 3757093 3957800 3863949
21837C863949j46269p4598J07269J34134L234j72633p4627j1060R796P4029j65501
$$ 3863949 3717680 3643082 3750351 3884485 3887719 3715086 3640459 3629399 3639195 3713224 3547723
21826C547723j30242l3837L3957o6136P2462m6524N1436J30763K1337P0496j21785
$$ 3547723 3417481 3383644 3417601 3351465 3423927 3377403 3428839 3559602 3580939 3651435 3529650
21815C529650p5211k7989P1031J18325J18478j4998k20163j28861K07677J65362
$$ 3529650 3454439 3426450 3497481 3615806 3734284 3719286 3499123 3370262 3577939 3743301
21805C743301q6612k89941K317J90796k8657P8242M1725Q3345j4459n8573L359
$$ 3743301 3656689 3366748 3369065 3559861 3531204 3609446 3651171 3734516 3720057 3661484 3664843
21794C664843k9693j4396K7366J02831J04313M950l0058m2990n1223Q7655N6292
$$ 3664843 3635150 3620754 3648120 3750951 3855264 3860214 3830156 3787166 3735943 3823598 3879890
21783C879890m4953l3814j39352o7156K3915P1259M7674J39202j20972k34612
$$ 3879890 3834937 3801123 3661771 3594615 3618530 3689789 3737463 3876665 3755693 3521081
21773C521081j26334J7571M0042Q6383O9990J49148j69884o3118J57635p4554
$$ 3521081 3394747 3412318 3452360 3538743 3608733 3757881 3587997 3524879 3682514 3607960
21763C607960N7577o943J38476K7898j20894p9521J0643o8033q0101P2975M7801
$$ 3607960 3665537 3658594 3797070 3824968 3704074 3624553 3635196 3567163 3487062 3560037 3607838
21752C607838J44273N3042j82255N5259J04726m1698j4925j55822q1810J42641
$$ 3607838 3752111 3805153 3622898 3678157 3782883 3741185 3726260 3570438 3488628 3631269
21742C631269M3185m8389p2090r6398k62809K33732K85095M8998N9538J21590
$$ 3631269 3674454 3626065 3553975 3457577 3194768 3428500 3713595 3762593 3822131 3943721
21732C943721J22542k74497p3561j67573J13566J25438p818K3284N245r2197J3706
$$ 3943721 4066263 3791766 3718205 3550632 3664198 3789636 3781818 3805102 3810347 3718150 3731856
21721C731856J06201O4512n9630j17732r1251l569j5769K20208K4564j11725j07731
$$ 3731856 3838057 3902569 3842939 3725207 3633956 3630387 3614618 3834826 3859390 3747665 3639934
21710C639934j83483q3919J4537M3072J18247J32618K59566j4311j67279o5587
$$ 3639934 3456451 3372532 3387069 3430141 3548388 3681006 3940572 3926261 3758982 3693395
21700C693395j06717N7167J52419J77864M1461p6571p4495R6878J5978m935N9614
$$ 3693395 3586678 3643845 3796264 3974128 4015589 3939018 3864523 3961401 3977379 3972444 4032058
21689D032058M8859Q0818j23928j94232l7054j9670p8307Q8512J66408k4392m4302
$$ 4032058 4080917 4161735 4037807 3843575 3806521 3786851 3708544 3797056 3963464 3939072 3894770
21678C894770J1786M0342l3413K8724m3322j34964j717L8875r7035K9516J6822
$$ 3894770 3906556 3946898 3913485 3942209 3898887 3763923 3762206 3801081 3704046 3733562 3750384
21667C750384M6612Q526J53424P3873l1081j31465o20m0288j00451j16550p8860
$$ 3750384 3796996 3805522 3958946 4032819 4001738 3870273 3869653 3829365 3728914 3612364 3533504
21656C533504K17451J14614J71788r9177j18797k0075J5011j9492J85464O1421
$$ 3533504 3750955 3865569 4037357 3938180 3819383 3799308 3814319 3794827 3980291 4041712
21646D041712o8264o4136q7011j09102n3686J09718L0260j06448O6654M2607M9914
$$ 4041712 3973448 3909312 3822301 3713199 3659513 3769231 3799491 3693043 3759697 3802304 3852218
21635C852218n2403l0771J4991k2595P1958J51411N9500J20682j28181r2382q8628
$$ 3852218 3799815 3769044 3784035 3761440 3833398 3984809 4044309 4164991 4036810 3944428 3855800
21624C855800O5782J72768P2700K6830j11699p006j5476k2099J27528K6431k8588
$$ 3855800 3921582 4094350 4167050 4193880 4082181 4075175 4059699 4037600 4165128 4191559 4162971
21613D162971P71k0016k37575j89687j04264M759Q0379K31209M8666k14554r9051
$$ 4162971 4163742 4143726 3906151 3716464 3612200 3616959 3697338 3928547 3977213 3762659 3663608
21602C663608J27488n7923J26319K36541P036o1054k04690J9049m9841k6252J85158
$$ 3663608 3791096 3733173 3859492 4096033 4103069 4042015 3837325 3856374 3806533 3780281 3965439
21591C965439J41230j07626q816J49375R9872j71740j89980m7580q5472L866J46358
$$ 3965439 4106669 3999043 3990227 4139602 4239474 4067734 3877754 3830174 3744702 3748568 3894926
21580C894926J43399q4975L0516l4482R196k6454j17999j08749o2698J04065m6467
$$ 3894926 4038325 3953350 3983866 3949384 3958580 3932126 3814127 3705378 3642680 3746745 3700278
21569C700278O0886J14473j16671m4353O3257J36747J42596j8834k33575j03530
$$ 3700278 3761164 3875637 3758966 3714613 3777870 3914617 4057213 4038379 3804804 3701274
21559C701274J73395j44325k7516J8241J14948K5830R202o7968L0493M0349j4626
$$ 3701274 3874669 3730344 3702828 3721069 3836017 3861847 3871049 3803081 3833574 3873923 3859297
21548C859297J38852J14164j15951j05919l9232q8128P5165O3604J49629P6474
$$ 3859297 3998149 4112313 3996362 3890443 3851211 3763083 3838248 3901852 4051481 4127955
21538D127955j9836O9160K11959J11039k33749k45511j35210l5326k8232k7146
$$ 4127955 4108119 4177279 4389238 4500277 4266528 4021017 3885807 3850481 3822249 3795103
21528C795103k0984q5379M8206K00417L1833l01j53757j48902K23372J64695J4258
$$ 3795103 3774119 3688740 3736946 3937363 3969196 3968895 3815138 3666236 3889608 4054303 4068561
21517D068561n6956k01551l073K59662j2860j50813k19979r2426J28780K82156
$$ 4068561 4011605 3810054 3806981 4066643 4053783 3902970 3682991 3590565 3719345 4001501
21507D001501K53558P295l5687j20809J16842m6687m0983K4213o0559j09151J63706
$$ 4001501 4255059 4262354 4226667 4105858 4222700 4176013 4135030 4159243 4098684 3989533 4153239
21496D153239L3321k21323j07838J99955K37284N7700k52713j45198m1192J71060
$$ 4153239 4186560 3965237 3857399 4057354 4294638 4352338 4099625 3954427 3913235 4084295
21486D084295Q535k877J87051N5554j8269K0601M2571P0889k0564N8208q1381
$$ 4084295 4092830 4089953 4277004 4332558 4314289 4334890 4377461 4448350 4427786 4485994 4404613
21475D404613j86832j29700Q3659j22373j257K33310J02152K2267j61817m1672
$$ 4404613 4217781 4088081 4171740 4049367 4048110 4281420 4383572 4405839 4244022 4202350
21465D202350J8538l7575m7929J37946n8021l4925K3151J60598N7885J44323j1869
$$ 4202350 4220888 4183313 4135384 4273330 4215309 4180384 4203535 4364133 4422018 4566341 4554472
21454D554472j49149M583K97945M1472j85427m253p9365j18913p3651j05138l4173
$$ 4554472 4405323 4409906 4707851 4749323 4563896 4559643 4480278 4361365 4287714 4182576 4148403
21443D148403k306k730K7695J98647J75543j82566j64149p8153P7767j42451P7628
$$ 4148403 4146097 4143367 4171062 4369709 4545252 4362686 4198537 4120384 4198151 4055700 4133328
21432D133328L460P3125j6578r2467j6176o1484M6043m3216O8750K37252k3047
$$ 4133328 4136788 4209913 4193335 4100868 4084692 4023208 4069251 4026035 4094785 4332037 4308990
21421D308990r0288j10609n49p5388l9142l1928R5105j9163j48692R778L6540
$$ 4308990 4218702 4108093 4107544 4032156 3993014 3961086 4056191 4037028 3888336 3898114 3934654
21410C934654J21911J63277J98712k1742m7764j37212j8612J07487J12485n5990
$$ 3934654 4056565 4219842 4418554 4396812 4349048 4211836 4193224 4300711 4413196 4357206
21400D357206j6706p017n8022P6121l0534j97308L795p1974L0991O5110J58807
$$ 4357206 4340500 4333483 4275461 4351582 4321048 4123740 4127535 4055561 4086552 4151662 4310469
21389D310469J67725m6617l16343r0784p4865J04629J3360o1250M9132Q0037o4936
$$ 4310469 4478194 4431577 4115234 4024450 3949585 4054214 4067574 4006324 4055456 4135493 4070557
21378D070557J85428J59661k7575P2638L3124j10830k9499J07182J7802k10817
$$ 4070557 4255985 4415646 4388071 4460709 4493833 4383003 4353504 4460686 4478488 4267671
21368D267671n3882J62944N9972L8500m8338q2921k49472m5886J66854R6498J5074
$$ 4267671 4213789 4376733 4436705 4475205 4426867 4343946 4094474 4048588 4215442 4311940 4327014
21357D327014n2782k4798Q7762J47721q5006j38399j09641j5530n051Q0439J01147
$$ 4327014 4274232 4249434 4337196 4484917 4399911 4261512 4151871 4136341 4131290 4211729 4312876
21346D312876Q6636O967j27307j26068p5204P7003Q7328J24693J3226m9893M6953
$$ 4312876 4399512 4406479 4279172 4153104 4077900 4154903 4242231 4366924 4380150 4330257 4377210
21335D377210P5776O4748J038j84718r8440L5227K4012J13173J16606j15481N2360
$$ 4377210 4452986 4517734 4518772 4334054 4235614 4270841 4294853 4408026 4524632 4409151 4461511
21324D461511J432j24344m9630J6075j3459M0972l5576j0551r854P2541K6888
$$ 4461511 4462943 4338599 4288969 4305044 4291585 4332557 4296981 4286430 4276576 4349117 4376005
21313D376005j2151L14294j18600r6872K7638m708k6559O1896J00651p5194j87860
$$ 4376005 4363854 4678148 4559548 4462676 4490314 4485606 4459047 4520943 4621594 4546400 4358540
21302D358540P6900K1101M1926l8368R3545P2533L98r4399j31808J39526J3171
$$ 4358540 4435440 4456541 4498467 4460099 4553644 4626177 4626575 4532176 4400368 4539894 4553065
21291D553065N727j09401k5264K16788j00242J0852M4529J1996p9036O5941q7404
$$ 4553065 4558792 4449391 4424127 4640915 4540673 4551525 4596054 4608050 4529014 4594955 4507551
21280D507551j2759J05243J93185j59553k04003J18761j12087j97077Q0323o084
$$ 4507551 4494792 4600035 4793220 4633667 4429664 4548425 4436338 4239261 4319584 4313500
21270D313500J9259L5380J17112P355N2378n506P985P7395j00621P3943R5601
$$ 4313500 4332759 4368139 4485251 4492606 4544984 4539478 4547463 4624858 4524237 4598180 4693781
21259D693781k90073j45378J19788l3408j19425R4103J4018J45216J78720M6463
$$ 4693781 4403708 4258330 4378118 4344710 4225285 4319388 4333406 4478622 4657342 4703805
21249D703805j30201n9208l662L295k551Q5979k1008Q8136n3186q8258J13866
$$ 4703805 4573604 4514396 4510734 4514029 4511478 4597457 4576449 4664585 4611399 4523141 4637007
21238D637007J25074L8437K667j7484o7559j93358j41113K04483K05303j1918
$$ 4637007 4762081 4800518 4803185 4785701 4718142 4524784 4383671 4588154 4793457 4781539
21228D781539O8785m1573P159j61098J0223j00104j03384K13457J26140j43891
$$ 4781539 4850324 4808751 4815910 4654812 4665035 4564931 4461547 4675004 4801144 4657253
21218D657253j08906j41751k2533n9298k21086N3134O4214j24119R4436O8332
$$ 4657253 4548347 4406596 4384063 4324765 4103679 4156813 4221027 4096908 4191344 4259676
21208D259676Q534M3020k0713j1794J42254L23195L0856j47490n6350Q8649J37854
$$ 4259676 4268210 4311230 4290517 4278723 4420977 4744172 4775028 4627538 4571188 4659837 4797691
21197D797691p276j78107N6593J48387J79645k7904j93865k51473L3523J34419
$$ 4797691 4790415 4612308 4668901 4817288 4996933 4969029 4775164 4523691 4557214 4691633
21187D691633m7906j35583K5276J25411K4983j31537n8111p2402J12413N9626
$$ 4691633 4643727 4508144 4533420 4658831 4683814 4552277 4494166 4421764 4534177 4593803
21177D593803K6893L8192q94N3911Q0113K4323Q3557j07118j91500m9409l4442
$$ 4593803 4620696 4658888 4657994 4711905 4792018 4816341 4899898 4792780 4601280 4551871 4517429
21166D517429L5184K1946n3511j3602p9928R3060J5139K19519J93698P473r2578
$$ 4517429 4552613 4574559 4521048 4507446 4427518 4520578 4535717 4755236 4948934 4956407 4863829
21155D863829O986J8736p6221j38071P4880q1053m059n9483J07478J10937j37
$$ 4863829 4870815 4889551 4813330 4675259 4750139 4669086 4665027 4605544 4713022 4823959 4823822
21144D823822n5978o814m2619o4656M3992L2042l9934m9585J57520J05748m1435
$$ 4823822 4767844 4761030 4718411 4653755 4697747 4729789 4689855 4640270 4797790 4903538 4862103
21133D862103j39937L1411N1328M4065j4915j51857L3889K0877r0062j9163j91028
$$ 4862103 4722166 4753577 4804905 4848970 4834055 4682198 4716087 4736964 4646902 4627739 4436711
21122D436711j42788P5575j09871q221J15567J24470K12432K2945r6712p7777
$$ 4436711 4293923 4369498 4259627 4251406 4366973 4491443 4703875 4726820 4630108 4552331
21112D552331J53824n3551q3811K97607K15343L042j00850q5812k08839k31210
$$ 4552331 4706155 4652604 4568793 4866400 5081743 5084785 4983935 4898123 4689284 4458074
21102D458074k6205M7989K06684k3758o0007K56678J29343n2255N4614j10276
$$ 4458074 4431869 4479858 4686542 4662784 4602777 4859455 4988798 4936543 4991157 4880881
21092D880881p5019p6473M938K5235j16182q4131p5354J15980J16462l9190J37585
$$ 4880881 4805862 4729389 4734327 4759562 4643380 4559249 4483895 4599875 4716337 4677147 4814732
21081D814732J08066J97309p882l35034n4186l9874R0731L1033J02733N2933P1392
$$ 4814732 4922798 5120107 5112225 4777191 4723005 4683131 4773862 4804895 4907628 4960561 5031953
21070E031953N7936k2851M5119k59242k5316R6615q7849p7051j52839l4159K6297
$$ 5031953 5089889 5067038 5112157 4852915 4827599 4924214 4836365 4759314 4606475 4572316 4598613
21059D598613O2554o6925N3622K74063M1906j09869M9765K87P0300J68912j72160
$$ 4598613 4661167 4594242 4647864 4921927 4963833 4853964 4903729 4904016 4974316 5143228 4971068
21048D971068p6764P1825J06552j1896q8673o6176j37362O7230J21812K3455j810
$$ 4971068 4894304 4966129 5072681 5060785 4972112 4905936 4768574 4835804 4957616 4981071 4979261
21037D979261o3763j38821R3933J75231j08012J2921M1174J24173j9009L6648
$$ 4979261 4915498 4776677 4870610 5045841 4937829 4950750 4991924 5116097 5097088 5133736
21027E133736o1101M881k08241M2452Q4516J32444L8805N3182J4407R482J6005
$$ 5133736 5072635 5077516 4869275 4911727 4996243 5128687 5167492 5220674 5235081 5244563 5260568
21016E260568o040k55810M0454N3233J1349K1758j97330j21913Q5659j54472o9518
$$ 5260568 5254528 4998718 5039172 5092405 5103754 5125512 4928182 4806269 4891928 4737456 4667938
21005D667938J114r5994P3610O7396J63461J26723Q4061N7393m1270j18060j78003
$$ 4667938 4669052 4573058 4646668 4714064 4877525 5004248 5088309 5145702 5104432 4986372 4808369
20994D808369m9466L1421M6762l169o8881K0272K92156K28508K4656j49682o0453
$$ 4808369 4758903 4790324 4837086 4833917 4765036 4785308 5077464 5305972 5330628 5180946 5120493
20983E120493j4918l2919J7186m4650j03823n5556l1732P1972l3006j2852P3473
$$ 5120493 5105575 5072656 5089842 5045192 4941369 4885813 4854081 4926053 4893047 4880195 4953668
20972D953668J54269r8133j01356l18j6953J26350K36534L759j38418N4533L79995
$$ 4953668 5107937 5009804 4908448 4908130 4891177 5017527 5254061 5257820 5119402 5173935 5553930
20961E553930k0223j66589P1542M3636r1644j24573j5174j9463L9514p708J8323
$$ 5553930 5533707 5367118 5438660 5482296 5390652 5266079 5250905 5231442 5270956 5263248 5281571
20950E281571q8039k37968R8116J20864j10170R3777R0523k10843k1205j248O2270
$$ 5281571 5193532 4955564 5053680 5174544 5064374 5158151 5248674 5037831 5016626 5015378 5077648
20939E077648k0854j21942j57742K7778L6683K42275J31333K0722j86098K58097
$$ 5077648 5056794 4934852 4777110 4804888 4841571 5083846 5215179 5235901 5049803 5307900
20929E307900J26458k28671k3943q6012m5699K06949n240r4044J5424J7901O6914
$$ 5307900 5434358 5205687 5181744 5095732 5050033 5256982 5251742 5157698 5173122 5191023 5257937
20918E257937N5340Q7121M866j43840O0410L7460j06403n121k0768l2039J27126
$$ 5257937 5313277 5400398 5405264 5261424 5321834 5359294 5252891 5247770 5227002 5194963 5322089
20907E322089L0607M09J7489J31343o0558j20337j56739o1530k5370j1873o8803
$$ 5322089 5352696 5353105 5370594 5501937 5441379 5321042 5164303 5102773 5077403 5065530 4996727
20896D996727m0346J8129J10797j068J12144l2946j5056P454O0976N2706O7190
$$ 4996727 4956381 4974510 5085307 5084239 5196383 5163437 5148381 5155835 5216811 5269517 5336707
20885E336707r3355n3242r963P4002K15110m5353L1152p8696L0819K8359M0678
$$ 5336707 5243352 5190110 5180147 5254149 5469259 5423906 5455058 5376362 5407181 5435540 5476218
20874E476218K5638n2527J21951j14854K1203M299o3434m2714r0328n0868p1315
$$ 5476218 5501856 5449329 5571280 5456426 5477629 5481928 5418494 5375780 5285452 5234584 5163269
20863E163269L7592o3723j792N6626J02929n5922j01675J79458Q6327M512N0476
$$ 5163269 5200861 5137138 5135346 5191972 5294901 5238979 5137304 5316762 5403089 5407601 5458077
20852E458077j0547J51348J18882M8564J3704k14030j10941r7937K6680m6247
$$ 5458077 5447530 5598878 5717760 5766324 5780028 5565998 5455057 5357120 5383800 5337553
20842E337553J49432Q9182n5879J06444Q209j38524k6530N837p3272Q7737J95027
$$ 5337553 5486985 5576167 5520288 5626732 5634941 5496417 5469887 5475724 5402452 5490189 5685216
20831E685216n8266K0273j05581j19733j53782J23545j6670P2179O2124K404j44471
$$ 5685216 5626950 5647223 5541642 5421909 5268127 5391672 5375002 5447181 5509305 5511709 5367238
20820E367238r9195J52287P8456Q8757J5528M6457r8889j22261J54373p8242j08932
$$ 5367238 5268043 5420330 5498786 5587543 5603071 5649528 5550639 5428378 5582751 5504509 5395577
20809E395577o3004J35727N7356k43602j17713K613J61920P4441O1439K4979j6286
$$ 5395577 5332573 5468300 5525656 5282054 5164341 5166954 5328874 5403315 5464754 5489733 5473447
20798E473447Q4137m1774k44009L160J74844J06615P4374J19192n3593n4362n7958
$$ 5473447 5557584 5515810 5271801 5274961 5449805 5556420 5630794 5749986 5696393 5642031 5584073
20787E584073j01453o2252n9978O4808q7358j30288J62677K65492k6750j38829
$$ 5584073 5482620 5420368 5360390 5425198 5337840 5207552 5370229 5635721 5608971 5470142
20777E470142p7213J41441R4992K9576K07784J51234j30225j85905N1915n0687
$$ 5470142 5392929 5534370 5629362 5658938 5866722 6017956 5887731 5701826 5753741 5703054
20767E703054j55714M8028L4405j34119j01714P5664J95745r7469K9704L19490
$$ 5703054 5547340 5595368 5629773 5495654 5393940 5469604 5665349 5567880 5597584 5917074
20757E917074j44755K9206r9173q1934R0989o1493J110Q1079m805n4288k3813
$$ 5917074 5772319 5801525 5702352 5620418 5711407 5649914 5651024 5732103 5727298 5673010 5649197
20746E649197Q3570j3552J960P4186k32207j9912P2450R2589m6297O7421p9577
$$ 5649197 5732767 5719215 5721175 5795361 5563154 5543242 5615692 5708281 5661984 5729405 5649828
20735E649828N3387l8698N6062J53594o8829J34207J18156k2742j60803R0900
$$ 5649828 5703215 5664517 5720579 5874173 5805344 5939551 6057707 6034965 5874162 5965062
20725E965062R9931m4814j15058J29459R4677q8396l4213j8346N8565q7331q5426
$$ 5965062 6064993 6020179 5905121 6034580 6129257 6040861 6006648 5988302 6046867 5959536 5874110
20714E874110N0505J91875M1481M2809M1406o2380r3853r7174M758m8972J4069
$$ 5874110 5924615 6116490 6157971 6200780 6242186 6179806 6085953 5988779 5993537 5944565 5958634
20703E958634o4822k43887j0560J40124J6811k39935Q0836K24243M1307p3401
$$ 5958634 5893812 5649925 5639365 5779489 5796300 5556365 5637201 5861444 5902751 5829350
20693E829350K252K0738L024K4710J14123J53094P0953q1207j91877j18689K3174
$$ 5829350 5831602 5852340 5855364 5880074 5994197 6147291 6218244 6137037 5945160 5826471 5849645
20682E849645J16181J22535Q9139j79396j10599J17168Q5557P1449l5919j56455
$$ 5849645 5965826 6088361 6177500 5998104 5887505 6004673 6090230 6161679 6125760 5969305
20672E969305r8726r2k9770k6987J42252J94625R3032J23104j8013j36794k079
$$ 5969305 5870579 5870487 5840717 5813730 5955982 6150607 6243639 6366743 6348730 6211936 6209857
20661F209857j43767M6323M9021M9947j07099k49024j28192P2591P3500J18934
$$ 6209857 6066090 6112413 6161434 6211381 6104282 5855258 5727066 5799657 5873157 5992091
20651E992091Q0924M6701r3833J0209j47571P133k8605L0872P7218n359R232l9008
$$ 5992091 6073015 6119716 6025883 6036092 5888521 5895654 5867049 5897921 5975139 5969780 5979012 5940004
20639E940004n6180J69138J54976O5437j30298P9344J06492K5781J82825j19424
$$ 5940004 5883824 6052962 6207938 6273375 6143077 6222421 6328913 6354694 6537519 6418095
20629F418095k22211j32571N3876P5082J23765M5983J8420m8225m8795k01597
$$ 6418095 6195884 6063313 6117189 6192271 6316036 6362019 6380439 6332214 6283419 6081822
20619F081822o1717L5335J37466J25034J5420m0511j03519j90598j52212J61080
$$ 6081822 6020105 6055440 6192906 6317940 6333360 6292849 6189330 5998732 5846520 6007600
20609F007600j01867j41614R0465J43035O5179J76099J64913J21494n5518l9242
$$ 6007600 5905733 5764119 5854584 5997619 6062798 6238897 6403810 6525304 6469786 6430544
20599F430544n6820O1792j0164l7653Q9345K15249L7481k4740k37868n9420P8053
$$ 6430544 6373724 6435516 6425352 6387699 6477044 6692293 6729774 6705034 6467166 6407746 6485799
20588F485799Q1548r2862l4473J4551q587R7630l3582j26136O2974R3238J17775
$$ 6485799 6567347 6474485 6440012 6454563 6445976 6543606 6510024 6383888 6446862 6540100 6657875
20577F657875m0550j6723P0428o4513j35053j37624q8293K1771O7616J63288M3297
$$ 6657875 6617325 6600602 6671030 6606517 6471464 6333840 6245547 6267318 6334934 6498222 6541519
20566F541519r9274J55263M2318j28039j36346J2184J49886O6686j61472j88366
$$ 6541519 6442245 6597508 6639826 6511787 6375441 6387625 6537511 6604197 6442725 6254359
20556F254359J2377J25966j54634j22198K00395K56594o762K2198P8831N2594
$$ 6254359 6266736 6392702 6238068 6115870 6316265 6572859 6566097 6588295 6667126 6719720
20546F719720l0478j75856L1052J4831J6554J33242k24209k46416J50591J72294
$$ 6719720 6689242 6513386 6544438 6559269 6575823 6709065 6484856 6238440 6389031 6561325
20536F561325j7312j90273O9162J23133R6099j39260j5223j4368o9798q5341R7448
$$ 6561325 6544013 6353740 6422902 6546035 6642134 6502874 6487651 6473283 6403485 6318144 6415592
20525F415592R1797L1384P203q188Q8307n4420N1361j13296l0814P6858J40165
$$ 6415592 6507389 6538773 6545976 6537788 6626095 6571675 6623036 6509740 6478926 6555784 6695949
20514F695949R9664m3253j03856j40567N4826K80849K32164J84419q3322l73857
$$ 6695949 6795613 6752360 6648504 6507937 6562763 6843612 7075776 7260195 7176873 6803016
20504F803016k07573J13062J01293l8061j2852L9051m2081Q3867O848R2217k7475
$$ 6803016 6595443 6708505 6809798 6771737 6758885 6797936 6755855 6839722 6846570 6938787 6911312
20493F911312j62498m2190J07680j88737J87830o524J47233J98485q6432l480
$$ 6911312 6748814 6706624 6814304 6625567 6813397 6806873 6954106 7152591 7066159 7062679
20483G062679L1259l49680j60693p4447N3148j13948K1014J67930J04781j06996
$$ 7062679 7093938 6744258 6583565 6509118 6562266 6448318 6469332 6637262 6742043 6635047
20473F635047m0531L32157P6084j84035k9460O7394l6433J45718J14194N1229
$$ 6635047 6594516 6926673 7002757 6818722 6789262 6856656 6820223 6965941 7080135 7131364
20463G131364L4985j48462k29522k01887J16205O7630L8669J76847L0597m5735
$$ 7131364 7166349 7017887 6788365 6586478 6702683 6770313 6808982 6985829 7016426 6970691
20453F970691r5749L1236J68172J17153J7698k1333N8081j14985j23685k5045
$$ 6970691 6874942 6906178 7074350 7191503 7209201 7187868 7245949 7130964 7007279 6982234
20443F982234Q553j09347J38909O4102j1980N2803J09673q6794j13520J8663J00841
$$ 6982234 6990787 6881440 7020349 7084451 7072471 7125274 7234947 7148153 7034633 7053296 7154137
20432G154137J08725o7525J43762M3218o0821j80364j45821n9369Q4745J09736
$$ 7154137 7262862 7195337 7339099 7382317 7321496 7141132 6995311 6935942 7020687 7130423
20422G130423J17898q3289j06341K9635P8626P1176j16355p3717m3799J6630L35329
$$ 7130423 7248321 7165032 7058691 7088326 7166952 7238128 7121773 7048056 7004257 7020887 7356216
20411G356216j335l22533p1845j92659J61947K66635P3762J87400j05153j61404
$$ 7356216 7354881 7032348 6960503 6767844 6929791 7196426 7270188 7457588 7352435 7191031
20401G191031j8335O1805P5863J16449J55594O8356k26474J41853J84437o1589
$$ 7191031 7172696 7234501 7310364 7426813 7582407 7650763 7424289 7566142 7750579 7688990
20391G688990k55666N0412O1535r3221p7133o4427O6669j66287j93092J80243
$$ 7688990 7433324 7483736 7545271 7452050 7374917 7310490 7377159 7210872 7017780 7198023
20381G198023J99867J29874K12471P2144j7049J054o7209q4795n1146O4504p8212
$$ 7198023 7397890 7527764 7740235 7812379 7795330 7796384 7729175 7644380 7593234 7657738 7579526
20370G579526l5112L4213P8286j11667j10788Q8699j547K2715R1122K8442M8668
$$ 7579526 7544414 7578627 7656913 7545246 7434458 7523157 7521610 7544325 7635447 7663889 7712557
20359G712557J73531j2922j54731r0149K2760M4812p9705k48143K7785J74859
$$ 7712557 7886088 7873166 7718435 7628286 7651046 7695858 7616153 7368010 7395795 7570654
20349G570654J54301J80952k68016l4422J2977l7566l5687k3612j37143J48024
$$ 7570654 7724955 7905907 7637891 7603469 7616446 7578880 7543193 7519581 7382438 7530462
20339G530462J27468p4247K19571J3331l8365o5879L3661J4118l474J70914j36042
$$ 7530462 7657930 7583683 7803254 7816585 7778220 7712341 7746002 7760120 7756646 7927560 7791518
20328G791518k21164K65276K21421n8363k2489j29114j44373r2985o4490j14596
$$ 7791518 7570354 7835630 8057051 7998688 7976199 7847085 7702712 7609727 7545237 7430641
20318G430641n23J75277n126k4775J36661K49380j11856k10071P0196J57754N8424
$$ 7430641 7430118 7605395 7600269 7575494 7712155 7961535 7849679 7639608 7709804 7867558 7925982
20307G925982j8796k0590l867J03011l3246O3880j5671r8750J19256N2300j73897
$$ 7925982 7907186 7886596 7882729 7985740 7952494 8016374 8000703 7901953 8021209 8073509 7899612
20296G899612j21074J43154J0860k9363O6471j7373L1843J7486j25674r0842J81606
$$ 7899612 7778538 7921692 7932552 7903189 7969660 7952287 7984130 8001616 7875942 7785100 7966706
20285G966706O7462J55250P2545j82982j89907J3538K00146n1945k07424q1360
$$ 7966706 8034168 8189418 8261963 8078981 7889074 7902612 8102758 8050813 7843389 7762029
20275G762029k4181O8039J38441K26175M0410j85938k8940m4246J7214o9115K09172
$$ 7762029 7737848 7805887 7944328 8170503 8210913 8024975 7996035 7951789 7969003 7899888 8109060
20264H109060J94074j35249j34879O2382J17088J11483r7768q5268N675l9696
$$ 8109060 8303134 8167885 8033006 8095388 8212476 8323959 8226191 8140923 8146598 8106902
20254H106902M4322j9250j15381R3324N2280Q8136K08457J05501j38343k26028
$$ 8106902 8151224 8131974 8016593 8109917 8162197 8250333 8458790 8564291 8425948 8199920
20244H199920q1867P7446O4168n6124J25243j6607Q3919r678k6373P3820N0052
$$ 8199920 8118053 8195499 8259667 8203543 8328786 8312179 8396098 8386420 8360047 8433867 8483919
20233H483919P9915k5751m337r2521N7136o2245O8903M2521j32984R631O5075
$$ 8483919 8563834 8538083 8533746 8441225 8498361 8436116 8505019 8547540 8414556 8424187 8489262
20222H489262j0401j01383o2221O4452J5179N4698K03649O5822j09452l5904J66686
$$ 8489262 8478861 8377478 8315257 8379709 8394888 8449586 8653235 8719057 8609605 8573701 8740387
20211H740387n7600K4795r8756J91108m5772j78483J11347p1417n4558L4426j5558
$$ 8740387 8682787 8707582 8608826 8799934 8754162 8575679 8687026 8615609 8561051 8595477 8579919
20200H579919J00998J38825j18278n6584o5298o2571J39643L33792K22690j18942
$$ 8579919 8680917 8819742 8701464 8644880 8579582 8517011 8656654 8990446 9213136 9094194
20190I094194j73632o2427J1177K9718J25750K6624j36978j00538M6279K00227
$$ 9094194 8920562 8858135 8869312 8899030 9024780 9051404 8914426 8813888 8860167 9060394
20180I060394k8294R2842j27759k38164J20683P4490j48353j70372q6880J45660
$$ 9060394 9032100 9124942 8997183 8759019 8879702 8954192 8805839 8635467 8548587 8694247
20170H694247Q7563K16060J22025J31375L7297n453j15545O4618j4139n0699j3741
$$ 8694247 8781810 8997870 9119895 9251270 9288567 9283114 9167569 9232187 9218048 9167349 9153608
20159I153608J21416n4844j03773k103J03848K1733j7463N0256j14041l74967
$$ 9153608 9275024 9220180 9116407 9114304 9218152 9239885 9222422 9272678 9158637 8783670
20149H783670k004K33742K18886J46468J22455k11278j15155L0179O5717k1196
$$ 8783670 8781666 9015408 9234294 9380762 9503217 9291939 9176784 9206963 9272680 9251484
20139I251484k8682R5071j9299P9492K25134J50130L3486j92897M5833k6352m8251
$$ 9251484 9222802 9317873 9298574 9378066 9603200 9753330 9786816 9593919 9639752 9613400 9565149
20128I565149l3433J38694m4460j37890n1058j37272n1244P6609J36280P8635
$$ 9565149 9531716 9670410 9625950 9488060 9437002 9299730 9248486 9325095 9461375 9540010
20118I540010K6105J24061j8188O1716j34976k44767M1849P5726J0627K2588J4676
$$ 9540010 9566115 9690176 9671988 9733704 9598728 9353961 9395810 9471536 9482163 9504751 9519427
20107I519427K27714Q0595r6797m9800O2446O8227K0678j37878J77018K54990
$$ 9519427 9747141 9827736 9730939 9681139 9743585 9811812 9832490 9694612 9871630 10126620
20097A0126620J3887K6653q8907l6793L9916K5581J97066j2713j49543P4028J6256
$$ 10126620 10140507 10167160 10078253 10041460 10081376 10106957 10304023 10291310 10141767 10215795 10232051
20086A0232051J14805j04363q7139o5926K6288J6408k3080n0388J8807j6333j7485
$$ 10232051 10346856 10242493 10155354 10089428 10115716 10132124 10109044 10058656 10077463 10061130 10043645
20075A0043645L18807K26828N1940L1005J02091q18l10208l61305j09488J29906
$$ 10043645 10362452 10589280 10641220 10672225 10774316 10773498 10463290 10101985 9992497 10122403
20065A0122403o9382l0581J51611K61307K6497J20891J49368l3325q1035j31657
$$ 10122403 10053021 10022440 10174051 10435358 10461855 10582746 10732114 10698789 10617754 10486097
20055A0486097m11815k11624Q9291J96053J01367j85087j43024j63547J07402
$$ 10486097 10074282 9862658 9951949 10148002 10249369 10064282 9921258 9757711 9865113
20046I865113J10517O6650J96395J24426K5771j67416j04877K47529J15149Q527
$$ 9865113 9975630 10042280 10238675 10363101 10388872 10221456 10116579 10364108 10479257 10487784
20036A0487784P6663k0619L998m7841l6628K30768J85024L4464j73153j15122
$$ 10487784 10564447 10543828 10547826 10499985 10463357 10694125 10879149 10913613 10740460 10625338
20026A0625338K7093r8003J04161J08304J72472m3295K9449J52593J26589P3485
$$ 10625338 10652431 10554428 10658589 10766893 10939365 10896070 10925519 11078112 11204701 11278186
20016A1278186J08001o7595j10906j82492k53019k08250j8669J21240O872N8305
$$ 11278186 11386187 11318592 11207686 11025194 10772175 10563925 10545256 10666496 10673368 10731673
20006A0731673j11166R16L1959J04997M1527N602k18250k38182l865o7742j03272
$$ 10731673 10620507 10621423 10653382 10758379 10799906 10805508 10587258 10349076 10345211 10277469 10174197
19995A0174197J30575J35895K0017L5867M5230j36818k1152J47017j19713k7607
$$ 10174197 10304772 10440667 10460684 10496551 10541781 10404963 10383811 10530828 10411115 10383508
19985A0383508n3534R5610J62570R7708m7976j51478J78265J89932l1030J19257
$$ 10383508 10329974 10425584 10588154 10685862 10637886 10486408 10664673 10854605 10823575 10942832
19975A0942832K4972L2515L186k1997m5589j313Q1465K51293J67098p5658j09804
$$ 10942832 10967804 11000319 11003505 10981508 10935919 10934606 11016071 11267364 11434462 11358804 11249000
19964A1249000j94281O3321J18870J07403K53606L0382n3424P6838j11775p2314
$$ 11249000 11054719 11118040 11236910 11344313 11597919 11628301 11574877 11651715 11539940 11467626
19954A1467626M2220N1968r4240j28493o9312K5192O3347k1423j03060j30034
$$ 11467626 11509846 11561814 11467574 11339081 11269769 11294961 11358308 11336885 11233825 11103791
19944A1103791L2057M11192J93713K21828M9338m4951n0966n4306Q209J01673
$$ 11103791 11135848 11547040 11740753 11962581 12011919 11966968 11916002 11861696 11869905 11971578
19934A1971578p3983j93976K0795J21888J33152J71828p464j57521j21174M5336
$$ 11971578 11897595 11703619 11724414 11846302 11979454 12151282 12143818 11986297 11865123 11910459
19924A1910459J67844J66519O3917J05344J18758m2157k57420n1038K26095O9980
$$ 11910459 12078303 12244822 12308739 12414083 12532841 12490684 12233264 12182226 12408321 12478301
19914A2478301L6082j26842r2907o1809o0145l8277K66284J22607M8139R1062
$$ 12478301 12514383 12387541 12294634 12232825 12172680 12134403 12400687 12523294 12571433 12662495
19904A2662495n5318o1760J04509J51050J49012q2524j8864j45746n5042j8757
$$ 12662495 12607177 12545417 12649926 12800976 12949988 12867464 12848600 12702854 12647812 12629055
19894A2629055j45020l2621K47534K13463p0725j00900M2588L1320O133o0107
$$ 12629055 12484035 12451414 12698948 12912411 12841686 12740786 12783374 12814694 12820827 12760720
19884A2760720j01689K8648K4746Q4605R786l916J41666J89443J35855n225M8984
$$ 12760720 12659031 12687679 12712425 12797030 12806816 12802900 12944566 13134009 13269864 13264639 13313623
19873A3313623O8530L7914l7026Q1347O0493O877r7987Q8158q7635J32188O6196
$$ 13313623 13382153 13420067 13383041 13464388 13524881 13531758 13433771 13521929 13434294 13566482 13632678
19862A3632678k5101k32414K26394J98249n689k04032J33486p3913k8419R3052
$$ 13632678 13607577 13375163 13601557 13799806 13794117 13590085 13723571 13649658 13621239 13714291
19852A3714291J21337K7461P2814P4821k3084M2170l3360M9155k02432q5868K17096
$$ 13714291 13835628 13863089 13935903 14010724 13987640 14029810 13996450 14045605 13843173 13757305 13974401
19841A3974401K18365K3945q8105j42716J25055K57618K5644k24919J8999O5551
$$ 13974401 14192766 14216711 14128606 13985890 14110945 14368563 14394207 14169288 14188287 14253838
19831A4253838r1747K48536L2865M9813J11372j6285J494r6588P3395J55822J51428
$$ 14253838 14162091 14410627 14443492 14493305 14604677 14588392 14589886 14493298 14566693 14722515 14873943
19820A4873943p7767M4541K9240J62714R4787p944j0661k4785p1298q8320K5788
$$ 14873943 14796176 14840717 14869957 15032671 15127458 15119514 15108853 15084068 15012770 14924450 14950238
19809A4950238J43056J15107J24336L8042O0930P5442p657j51998j8312n431p6281
$$ 14950238 15093294 15208401 15332737 15370779 15431709 15507151 15499494 15347496 15329184 15323753 15247472
19798A5247472P7685p0548M0537K63616L23927P7927l9096j4139Q4074p138n0888
$$ 15247472 15325157 15254609 15295146 15558762 15882689 15960616 15921520 15907381 15991455 15984317 15933429
19787A5933429P6291k2044J8608p8951J76278M4654j3716L5494K72322Q1004n5182
$$ 15933429 16009720 15987676 16006284 15927333 16103611 16148265 16134549 16170043 16442365 16523369 16468187
19776A6468187J65555N596j52426j6879K14515K12050l6076j45930j12405L2240
$$ 16468187 16633742 16639338 16486912 16470033 16684548 16896598 16860522 16714592 16602187 16634427
19766A6634427n2289P4944M23729P9408j89797n734K07515O2594q0180J24161
$$ 16634427 16582138 16657082 17080811 17160219 16970422 16964688 17172203 17234797 17154617 17278778
19756A7278778K38063K4604q5294J17805j00251R8287N9542O6538O5490J06098
$$ 17278778 17516841 17541445 17456151 17573956 17473705 17571992 17631534 17698072 17763562 17869660
19746A7869660r2823j2706J63784P0036J9175j05939p4441J10756K26343M4325
$$ 17869660 17776837 17764131 17927915 17997951 18017126 17911187 17836746 17947502 18173845 18218170
19736A8218170K60977O6254m4820p1639n7759J99044J13574L16854l817j94310
$$ 18218170 18479147 18545401 18500581 18428942 18371183 18570227 18683801 19000655 18996838 18802528
19726A8802528J25743J87646q3559Q7555J42479j04373J21124o2095J86315K32116
$$ 18802528 18928271 19115917 19032358 19119913 19262392 19158019 19279143 19217048 19403363 19635479
19716A9635479L87689J0183l1287P8493J1238O6327R3350K14813J56291j01968
$$ 19635479 20023168 20033351 20002064 20080557 20091795 20158122 20251472 20466285 20622576 20520608
19706B0520608j17970P2110Q8978Q1120Q6203O7169K16866M9070O1048J44437
$$ 20520608 20402638 20474748 20563726 20644846 20731049 20798218 21015084 21064154 21125202 21269639
19696B1269639K9430J37945J01838J51707K74039K45843j64126K11r3473J15858
$$ 21269639 21299069 21437014 21538852 21690559 21964598 22210441 22046315 22046526 21953053 22068911
19686B2068911J76016K19566R9858J44132N4436K5283Q3560j0853R6707K43775
$$ 22068911 22244927 22464493 22564351 22708483 22762919 22788202 22871762 22860909 22957616 23201391
19676B3201391J35352J79273K10171K9873J17978P1319r204J18924L44106J24155
$$ 23201391 23336743 23516016 23726187 23756060 23874038 23945357 23936153 24055077 24399183 24523338
19666B4523338J7677J77809J79950J24230J47032N4563J34457K20565R1319J53810
$$ 24523338 24541015 24718824 24898774 25023004 25170036 25224599 25359056 25579621 25670940 25824750
19656B5824750L81002J66867K18241K81285J83724J36186J87577q6787P2725J73792
$$ 25824750 26205752 26372619 26590860 26872145 27055869 27192055 27379632 27292845 27365570 27539362
19646B7539362K06566J67180O8983P8947L10266J32689N8775O5910K14773L02770
$$ 27539362 27745928 27913108 27982091 28061038 28371304 28503993 28562768 28628678 28843451 29146221
19636B9146221M22484K92749J2695K06858K03914K07795K3620J85342L74030K85197
$$ 29146221 29568705 29861454 29874149 30081007 30284921 30492716 30516336 30701678 31075708 31360905
19626C1360905L73529J08347L09484L37484J77296K32593M00603J96142K44965
$$ 31360905 31734434 31842781 32152265 32489749 32667045 32899638 33300241 33496383 33741348
19617C3741348L15037M80949M56272K77598K83920K66333J25019L45257L85489
$$ 33741348 34056385 34537334 34993606 35271204 35555124 35821457 35946476 36291733 36677222
19608C6677222N34745M63669L42778K48535K74905M71758K50718N49696M27336
$$ 36677222 37211967 37675636 38018414 38266949 38541854 39013612 39264330 39814026 40241362
19599D0241362M95721O47896O29242N17746M61128N40469N67702P01422O44035
$$ 40241362 40737083 41384979 42014221 42531967 42993095 43533564 44101266 44802688 45446723
19590D5446723N52679O72677Q25054O19638N62231J019944R08615R00359J127289
$$ 45446723 45999402 46672079 47497133 48116771 48679002 49698946 50607561 51507920 52635209
19581E2635209R68492Q36354R88211J170312J183203J238854J351608J390994
$$ 52635209 53603701 54440055 55428266 56598578 57781781 59020635 60372243 61763237
19573F1763237J690949J903643J598631J411826J556121J945895K366203K675522
$$ 61763237 63454186 65357829 66956460 68368286 69924407 71870302 74236505 76912027
19565G6912027L050851L446548L606878M175395M737206M906227K364845l571684
$$ 76912027 79962878 83409426 87016304 91191699 95928905 100835132 103199977 99628293
19557I9628293n704533k338960K764338O976110R707764J1823802J4024742J7084359
$$ 99628293 93923760 91584800 94349138 101325248 111033012 122856814 136881556 153965915
19549A53965915K1378631K5064574K0476650j5694020p1244893p1644088n3613614
$$ 153965915 175344546 200409120 220885770 205191750 133946857 62302769 8689155
19542H689155m1012383k8822597j3543134J485018J2687125J7178180J7151904
$$ 8689155 -32323228 -61145825 -74688959 -73203941 -60516816 -43338636 -26186732
19535b6186732J4643280Q174657o867673k0631276j8412153q681736J287514P247741
$$ -26186732 -11543452 -3368795 -10236468 -30867744 -49279897 -57961633 -56674119 -49426378
19527d9426378Q307386P748466O917524O156851N769411N247012M478472M141806
$$ -49426378 -41118992 -33370526 -26453002 -20296151 -14526740 -9279728 -4801256 -659450
19519f59450M031936M081280M235727M069934L805641L867099M219902M936995
$$ -659450 3372486 7453766 11689493 15759427 19565068 23432167 27652069 32589064
19511C2589064N778772O471440P030475P731204Q726221R844536J0233785P323534
$$ 32589064 38367836 44839276 51869751 59600955 68327176 78171712 88405497 95729031
19503I5729031n399318k0707845j9748578r068823M080509J3684639J8975718
$$ 95729031 90329713 69621868 49873290 40804467 44884976 58569615 77545333
19496G7545333K2322916K4239881J9644860J274086j8778928k7059402n5825577
$$ 77545333 99868249 124108130 143752990 145027076 126248148 99188746 43363169
19489D3363169j03003069q7486203m6836206o065559J7459155K2261517J9817147
$$ 43363169 -59639900 -147126103 -193962309 -200027868 -182568713 -160307196 -140490049
19482a40490049J6064422J3149409J1523084R870014M987119m232259p900950
$$ -140490049 -124425627 -111276218 -99753134 -89883120 -84896001 -89128260 -97029210
19475i7029210m359242N34661M462184N531474N600475M999113M125408L383616
$$ -97029210 -101388452 -100853791 -96391607 -90860133 -85259658 -80260545 -76135137 -72751521
19467g2751521L036365K910402K460210J991512K022902J946318K006532K133843
$$ -72751521 -69715156 -66804754 -64344544 -62353032 -60330130 -58383812 -56377280 -54243437
19459e4243437J987657J779246J566708J555658J525841J447849J151695J178867
$$ -54243437 -52255780 -50476534 -48909826 -47354168 -45828327 -44380478 -43228783 -42049916
19451d2049916J211893J276954J095216R18742J135295J063854Q56537Q12611
$$ -42049916 -40838023 -39561069 -38465853 -37547111 -36411816 -35347962 -34491425 -33678814
19443c3678814O54580L95230O86012R40828R51309Q99133P23592N64707N56158
$$ -33678814 -33024234 -32629004 -31942992 -31002164 -30050855 -29151722 -28428130 -27863423 -27307265
19434b7307265L74453O17397P71060M27418M76943O31333N63992M87782N69100
$$ -27307265 -26932812 -26315415 -25544355 -25116937 -24639994 -24008661 -23444669 -22956887 -22387787
19425b2387787N51377N84581N17779L09319M12441M10189L98006K66479J12794
$$ -22387787 -21836410 -21251829 -20734050 -20424731 -20012290 -19602101 -19204095 -18937616 -18824822
19416a8824822L66626L39977K56250J75329K42861J89817K69059N07708L62975
$$ -18824822 -18458196 -18118219 -17861969 -17686640 -17443779 -17253962 -16984903 -16477195 -16114220
19407a6114220L37395L28319K32981K19132M08572L14576M15247L78891J75712
$$ -16114220 -15776825 -15448506 -15215525 -14996393 -14587821 -14273245 -13857998 -13479107 -13303395
19398a3303395K47294M25796L62226M45446N41714L42357J51044K05397l3536
$$ -13303395 -13056101 -12630305 -12268079 -11822633 -11280919 -10938562 -10787518 -10582121 -10615657
19389a0615657k86233k0658M6997J31816J60074L35278J95690L16734M34633K17115
$$ -10615657 -10901890 -10922548 -10875551 -10743735 -10583661 -10248383 -10052693 -9735959 -9301326 -9084211
19379i084211L59962R6871j59108k14003K8693K14066K21151J84550K62754N2203
$$ -9084211 -8724249 -8627378 -8786486 -9000489 -8971796 -8757730 -8536579 -8352029 -8089275 -8037072
19369h037072o2990Q9117K40018J05688L37m9854j1798J87781J23359O0464J7334
$$ -8037072 -8100062 -8010945 -7770927 -7665239 -7664902 -7714756 -7726554 -7538773 -7415414 -7354950 -7337616
19358g337616K34235M89723L57057J06750J16075J79652J79108J33858J45458
$$ -7337616 -7103381 -6613658 -6256601 -6149851 -6033776 -5854124 -5675016 -5541158 -5395700
19349e395700J21795J07500J40883R0361J49281N7931P5700K69819K89159K79957
$$ -5395700 -5273905 -5166405 -5025522 -4935161 -4785880 -4727949 -4652249 -4382430 -4093271 -3813314
19339c813314K06672J64459K78887P9459r8171r673o4306l9658O9966Q7392m2519
$$ -3813314 -3606642 -3442183 -3163296 -3083837 -3182008 -3191681 -3255987 -3295645 -3225679 -3138287 -3180806
19328c180806Q1010J6061J85748J52601J04494J09952J89849J57243l4302j9999
$$ -3180806 -3099796 -3083735 -2897987 -2745386 -2640892 -2530940 -2341091 -2183848 -2218150 -2238149
19318b238149j09332Q2510L42894L3168r8460m9470k5758Q950J21550M36057M00000
$$ -2238149 -2347481 -2264971 -1922077 -1888909 -1987369 -2036839 -2062597 -2053647 -1932097 -1496040 -1096040
19307a096040R9329M0951J51602L87703K35273j13553l61806l60597j45864L4954
$$ -1096040 -996711 -955760 -804158 -416455 -181182 -294735 -656541 -1017138 -1163002 -1128048
19297a128048R6499J32820K61259K52477Q0807J28684J24678N0532Q7803n3976
$$ -1128048 -1031549 -898729 -637470 -384993 -304186 -175502 -50824 -292 87511 33535
19287C3535p2781J83898K0036m4953p7311L10124J38674j69530J49735J13010
$$ 33535 -39246 144652 164688 119735 42424 352548 491222 321692 471427 584437
19277E84437j38555J00511K27561K26625P5493J25682J29210K4185J24838J9569
$$ 584437 445882 546393 773954 1000579 1076072 1201754 1330964 1355149 1479987 1499556
19267A499556J09653J81719J65611O0945J02971J20058n4776n1093J43672K25649
$$ 1499556 1609209 1790928 1956539 2017484 2120455 2240513 2185737 2134644 2278316 2503965
19257B503965Q2490j07715K9602L2927n4769j5429J04484m1989K32600K20241
$$ 2503965 2586455 2478740 2508342 2541269 2486500 2471071 2575555 2533566 2766166 2986407
19247B986407L7196J89278N7598J1730R6057Q1622J34153K6325r0927j94073m2234
$$ 2986407 3023603 3212881 3270479 3282209 3378266 3459888 3594041 3620366 3529439 3335366 3293132
19236C293132J26655K16648J67903l5469j16449J19068L72271K14830J34307R3534
$$ 3293132 3419787 3636435 3804338 3768869 3652420 3771488 4143759 4358589 4492896 4586430
19226D586430J07836R3907J75773k7592p679P3049l1283L0595J37132J03748l2106
$$ 4586430 4694266 4788173 4963946 4936354 4928675 5001724 4970441 5001036 5138168 5241916 5209810
19215E209810j59548J87315K21439Q9092O828J0533M6376R3983K5251J94396R9601
$$ 5209810 5050262 5237577 5459016 5548108 5554936 5565469 5611845 5705828 5731079 5925475 6025076
19204F025076j5652L4113L7710O9463N6923J36822R9919O3289J18924r4896q2191
$$ 6025076 6009424 6043537 6081247 6150710 6207633 6344455 6444374 6507663 6626587 6531691 6449500
19193F449500j28746l2942j3803J50975J51526K0516J70772K94631o7858j45037
$$ 6449500 6320754 6287812 6274009 6424984 6576510 6597026 6767798 7062429 6994571 6849534
19183F849534J96895J74249J22965q1492K4792o6350K33165L7375j88874N0472
$$ 6849534 7046429 7220678 7343643 7262151 7286943 7220593 7453758 7491133 7302259 7352731
19173G352731P820J1112J07738J77037J89244K32768O2371m8831r2705J03836
$$ 7352731 7360551 7371663 7479401 7656438 7845682 8078450 8140821 8091990 7999285 8103121
19163H103121J93301Q4451J10255J47208n8112n3815Q9342J9355J15928J2033
$$ 8103121 8296422 8380873 8491128 8638336 8580224 8526409 8615751 8635106 8751034 8763067
19153H763067N3991J81288J94836p1788J01248L45745R0907l0173K04526J40018
$$ 8763067 8817058 8998346 9193182 9121394 9222642 9568387 9659294 9629121 9833647 9973665
19143I973665J08359J37752Q0817k2139j8629N8231k2044O881p1584J4409J26767
$$ 9973665 10082024 10219776 10300593 10278454 10259825 10318056 10296012 10302893 10231309 10245718 10372485
19132A0372485j12304m2476J39245J82681j9737Q3389J09651O4906k8405K6235
$$ 10372485 10260181 10217705 10356950 10539631 10519894 10603283 10712934 10777840 10749435 10775670
19122A0775670J22372M3544J14614J78836J88761N3506M5938J61078J45377J9487
$$ 10775670 10898042 10941586 11056200 11235036 11423797 11477303 11523241 11684319 11829696 11849183
19112A1849183M8769r095n8396J21313Q472R0655J89381P8602J68790O0303l8239
$$ 11849183 11897952 11888857 11830461 11951774 11960246 12050901 12240282 12318884 12487674 12547977 12509738
19101A2509738m4405J31254J31003n802M8588K31977K78052O0944K69602M0224
$$ 12509738 12465333 12596587 12727590 12721788 12770376 13002353 13280405 13341349 13610951 13651175
19091A3651175n5626j8769j34957J26749k2245N8690J84303O3599J49192K61999
$$ 13651175 13595549 13576780 13441823 13568572 13546327 13605017 13789320 13852919 14002111 14264110
19081A4264110k8221p2795o0807Q4939J19458N9364P4374K00662r8272K6941J23890
$$ 14264110 14235889 14163094 14102287 14187226 14306684 14366048 14440422 14641084 14542812 14569753 14693643
19070A4693643K10822J28662J42331K00792l8670j4447K5442N1160l0336J09512
$$ 14693643 14904465 15033127 15175458 15376250 15337580 15323133 15348575 15399735 15369399 15478911
19060A5478911K10908J62987J11660J36633J05220j5906L07946L39191K2334J38309
$$ 15478911 15689819 15852806 15964466 16101099 16206319 16190413 16498359 16837550 16859884 16998193
19050A6998193N7536J12399R3636Q3265K34029O0490J2699K43604M9094k1350
$$ 16998193 17055729 17168128 17261764 17345029 17579058 17639548 17652247 17895851 17944945 17923595
19040A7923595R7980J33983K40617L36701K89354Q3567k6523J876j98745j8477
$$ 17923595 18021575 18155558 18396175 18732876 19022230 19105797 19079274 19081150 18882405 18863928
19030A8863928R9313J86779K14524J76387J00715M7313J56250n6575J38311M46925
$$ 18863928 18963241 19150020 19364544 19540931 19641646 19688959 19845209 19788634 19926945 20373870
19020B0373870K43705l0050k0318N7680Q3976q3165j65471P9430K46926J77399
$$ 20373870 20617575 20587525 20567207 20624887 20708863 20625698 20460227 20539657 20786583 20963982
19010B0963982Q6060L25544J81497K54055L51630M13926M46117M03315O1096j74492
$$ 20963982 21050042 21375586 21557083 21811138 22162768 22576694 23022811 23426126 23487222 23312730
19000B3312730q9670j13633J24012K89724J08862J59681K55755J99550K64983
$$ 23312730 23223060 23109427 23233439 23523163 23632025 23791706 24047461 24247011 24511994
18991B4511994K01676M29586L66935M02293L49980L19090J66060J15321R3095
$$ 24511994 24713670 25143256 25510191 25912484 26262464 26581554 26747614 26862935 26956030
18982B6956030q1909j52013m6109R8777J72706L57534K30991p9689J33122L75007
$$ 26956030 26874121 26722108 26675999 26774776 26947482 27305016 27536007 27456318 27589440 27964447
18972B7964447K53392K98437K62138L76525M30393M30854L85948M34328L56254
$$ 27964447 28217839 28516276 28778414 29154939 29585332 30016186 30402134 30836462 31192716
18963C1192716q5223k84683k85862q4648N2400K86712N29826N29919M35402L88417
$$ 31192716 31107493 30822810 30536948 30452300 30504700 30791412 31321238 31851157 32286559 32674976
18953C2674976J84176J61922K13218M49753M13797M30729M08214N56938N61882
$$ 32674976 32859152 33021074 33234292 33684045 34097842 34528571 34936785 35493723 36055605
18944C6055605M76082L45095L29479M87863N18357O32644Q26896M94711M09791
$$ 36055605 36531687 36876782 37206261 37694124 38212481 38845125 39672021 40166732 40576523
18935D0576523O27578N55508O96726P70862O99017N99393L64963M94893O95556
$$ 40576523 41204101 41759609 42456335 43227197 43926214 44525607 44890570 45385463 46081019
18926D6081019O59465Q68809R50093P37827Q33836P19834O60154N85593Q66482
$$ 46081019 46740484 47609293 48559386 49297213 50131049 50850883 51511037 52096630 52963112
18917E2963112J158968R96620J069185J188821J178507J213124J473071J840974
$$ 52963112 54122080 55118700 56187885 57376706 58555213 59768337 61241408 63082382
18909F3082382J897840J852070J914665J766219J718815J671515J827135K197964
$$ 63082382 64980222 66832292 68746957 70513176 72231991 73903506 75730641 77928605
18901G7928605K572051L053745L239350L690331M474832N137477N875486O368610
$$ 77928605 80500656 83554401 86793751 90484082 94958914 100096391 105971877 112340487
18893A12340487O046366J191458o757304o817253j459800M706422R635323J2639124
$$ 112340487 118386853 119578311 112821007 106003754 104543954 109250376 118885699 131524823
18885A31524823J5340899J8363697K2369009K7703253K9144596Q519336n6280155
$$ 131524823 146865722 165229419 187598428 215301681 244446277 252965613 196685458
18878A96685458r1971798p6098023o0346059m3505297k3168534l688857J1292781
$$ 196685458 104713660 28615637 -31730422 -75235719 -98404253 -102093110 -90800329
18871i0800329J8608881J9602088J8053295J4679037N925993j1844855k2906969
$$ -90800329 -72191448 -52589360 -34536065 -19857028 -13931035 -25775890 -48682859
18864d8682859j7599365o817440L069889P823671Q541754Q110293P441048O446441
$$ -48682859 -66282224 -73099664 -70029775 -62206104 -53664350 -45554057 -38113009 -31666568
18856c1666568N973824N771561N248490M582192M194714L766149L809950L996348
$$ -31666568 -25692744 -19921183 -14672693 -10090501 -5895787 -2129638 1680312 5676660
18848E676660M110807M293878M836326N356885N734065O224321P028486P999455
$$ 5676660 9787467 14081345 18917671 24274556 30008621 36232942 43261428 51260883
18840E1260883Q854296R751154R897687N029213r321289k0617673j6323813m897712
$$ 51260883 60115179 69866333 79764020 84793233 75471944 54854271 38530458 33632746
18832C3632746P158399J4755610J9143189K1430990J9049750L549049j5075126
$$ 33632746 40791145 55546755 74689944 96120934 115170684 118719733 103644607
18825A03644607j8133812k4776156o6828672q4960112n6644248k1736942P190497
$$ 103644607 85510795 60734639 -6094033 -91054145 -147698393 -169435335 -162244838
18818a62244838J7725560J7623219J4658050J2398206J0492773R253520P621914
$$ -162244838 -144519278 -126896059 -112238009 -99839803 -89347030 -80093510 -72471596
18811g2471596K939993m188427n253155k107122J600557M459850N196487M788298
$$ -72471596 -69531603 -73720030 -78973185 -81080307 -79479750 -75019900 -69823413 -65035115
18803f5035115M129081L665035L392457L229461K653315K171558J967137J763847
$$ -65035115 -60906034 -57240999 -53848542 -50619081 -47965766 -45794208 -43827071 -42063224
18795d2063224J748895K131702J969567J965086J976639J911520J474499J580845
$$ -42063224 -40314329 -38182627 -36213060 -34247974 -32271335 -30359815 -28885316 -27304471
18787b7304471J733445J759889J350671J036964J257931J387046J317709J523200
$$ -27304471 -25571026 -23811137 -22460466 -21423502 -20165571 -18778525 -17460816 -15937616
18779a5937616J366184J263690J155954J443252J373813J363862J319051J295179
$$ -15937616 -14571432 -13307742 -12151788 -10708536 -9334723 -7970861 -6651810 -5356631
18771e356631J373787J223785J141606J475222J296801J262958J295989J025319
$$ -5356631 -3982844 -2759059 -1617453 -142231 1154570 2417528 3713517 4738836
18763D738836P11115J159712J431669J802134J881399J592730J028769Q61171
$$ 4738836 5449951 6609663 8041332 9843466 11724865 13317595 14346364 15207535
18755A5207535J221780J831584K451668K759014K856706L286133L501972L437908
$$ 15207535 16429315 18260899 20712567 23471581 26328287 29614420 33116392 36554300
18747C6554300L495817M007109N199009O847902Q604474J0801368J2519624R323934
$$ 36554300 40050117 44057226 49256235 56104137 64708611 75509979 88029603 97353537
18739I7353537j1050259l7861721l5483033j9410505j217482R849596J2976569
$$ 97353537 86303278 48441557 12958524 -6451981 -7669463 2180133 15156702
18732A5156702J3146499J3634775J4944592J7427999J9340192J4020368q574702
$$ 15156702 28303201 41937976 56882568 74310567 93650759 107671127 99096425
18725I9096425l5561656o0887243o7107938l8486895j0335368R763083J6675679
$$ 99096425 63534769 2647526 -64460412 -102947307 -113282675 -103519592 -86843913
18718h6843913J6488619J4908320J4105868J4450688J5384487J4056032n01099
$$ -86843913 -70355294 -55446974 -41341106 -26890418 -11505931 2550101 2049002
18711B049002l5891806m8808510l3080917j1935136M779709J0763482J0360088
$$ 2049002 -33842804 -82651314 -115732231 -127667367 -122887658 -112124176 -101764088
18704a01764088Q439524O376176M875652M015780L431253L231382L026893K914248
$$ -101764088 -93324564 -86948388 -82072736 -78056956 -74625703 -71394321 -68367428 -65453180
18696f5453180K943608K969993K644392K150567Q11844J73373M69996J293297
$$ -65453180 -62509572 -59539579 -56895187 -54744620 -53932776 -53759403 -53289407 -51996110
18688e1996110J606359J706930J628073J446350J365567J078533J085252J054349
$$ -51996110 -50389751 -48682821 -47054748 -45608398 -44242831 -43164298 -42079046 -41024697
18680d1024697J052756R80198Q12672P41685P66117R93280Q94132Q15062P76908
$$ -41024697 -39971941 -38991743 -38179071 -37437386 -36671269 -35677989 -34783857 -33968795 -33191887
18671c3191887O83003N88383N54194N85725Q62117O84639L92787N35955N15180
$$ -33191887 -32508884 -31920501 -31366307 -30780582 -29918465 -29233826 -28841039 -28305084 -27789904
18662b7789904M79893M97476O48176N57480N00987M38227O88732L73688J18418
$$ -27789904 -27310011 -26812535 -26164359 -25606879 -25105892 -24667665 -23978933 -23605245 -23486827
18653b3486827M21690O06035N73276K17703K35741L09775L11810M41015L14407
$$ -23486827 -23065137 -22459102 -21885826 -21668123 -21432382 -21122607 -20810797 -20369782 -20055375
18644b0055375M35985N13491L60816K77179M08551L20488K29963J73077J36013
$$ -20055375 -19619390 -19105899 -18745083 -18467904 -18059353 -17738865 -17508902 -17335825 -17199812
18635a7199812J81379K87685K32691K33411N12337L84684L06364J76858J55739
$$ -17199812 -17018433 -16730748 -16498057 -16264646 -15752309 -15367625 -15061261 -14884403 -14728664
18626a4728664M40143L01225L21612K35870L43974L15896K51024L28067K53963
$$ -14728664 -14288521 -13987296 -13665684 -13429814 -13085840 -12769944 -12518920 -12190853 -11936890
18617a1936890K25008K48551L7269R7895K92539K32379K92996J54083K15206K54490
$$ -11936890 -11711882 -11463331 -11426062 -11328167 -11035628 -10803249 -10510253 -10356170 -10140964 -9886474
18607i886474J72143L08793M40245K25602J0549O3278K28371L84994K12810J04469
$$ -9886474 -9714331 -9405538 -8965293 -8739691 -8729142 -8665864 -8437493 -8052499 -7839689 -7735220
18597g735220j83745Q3160M24997L81631L50753J76833K50575K68046J70027M16719
$$ -7735220 -7918965 -7835805 -7410808 -7029177 -6678424 -6501591 -6251016 -5982970 -5812943 -5396224
18587e396224L04788J28831R095R6710R9950L21605K64197J59154K27217p034
$$ -5396224 -5091436 -4962605 -4953510 -4856800 -4756850 -4435245 -4171048 -4011894 -3784677 -3791711
18577c791711J36027L02364K30969K23106K23566R8582K89141L16582J84173K63311
$$ -3791711 -3655684 -3353320 -3122351 -2899245 -2675679 -2577097 -2287956 -1971374 -1787201 -1523890
18567a523890J63199L63287q4916M0146K64896K68117K12396R6046J33250K82155
$$ -1523890 -1360691 -997404 -1082320 -1042174 -777278 -509161 -296765 -200719 -67469 214686
18557B14686L29768L44965J16853n9371R4092L37058N68914O09125K06843K15222
$$ 214686 544454 889419 1006272 946901 1040993 1378051 1946965 2556090 2762933 2978155
18547B978155K03566Q414J04907K26562K40429O4474K51398L39354K39096L15811
$$ 2978155 3181721 3190135 3295042 3521604 3762033 3826507 4077905 4417259 4656355 4972166
18537D972166K90526M33949M03426L32389L14104O5358J22453M54672L41814Q3528
$$ 4972166 5262692 5696641 6100067 6432456 6746560 6811918 6934371 7389043 7730857 7814385
18527G814385J96109J69258K37079L25629M81587J78313J62775K39257L75336
$$ 7814385 8010494 8179752 8416831 8742460 9224047 9402360 9565135 9804392 10179728
18518A0179728M34169M76370K16997J72948M70088M43399L55358K39130M31645
$$ 10179728 10613897 11090267 11307264 11480212 11950300 12393699 12749057 12988187 13419832
18509A3419832N52431M46600M98070J66419J76517K72062M41362K45439M03847
$$ 13419832 13972263 14418863 14916933 15083352 15259869 15531931 15973293 16218732 16622579
18500A6622579O64595N16867M54394M83162L59946M02222L63202L61469N90756
$$ 16622579 17287174 17804041 18258435 18741597 19101543 19503765 19866967 20228436 20819192
18491B0819192N75945N74646O24128N32127O26511O68050N79905M60137N79365
$$ 20819192 21395137 21969783 22593911 23126038 23752549 24420599 25000504 25460641 26040006
18482B6040006N74214P48881Q92047O33496N84290Q38604Q69860Q67168J059921
$$ 26040006 26614220 27363101 28255148 28888644 29472934 30311538 31181398 32048566 33108487
18473C3108487Q12281P85511R68437J122575J149717R17579Q37245J106554J402143
$$ 33108487 33920768 34706279 35674716 36797291 37947008 38864587 39701832 40808386 42210529
18464D2210529J369676J517644K003958K247578K279232K115518P82151j053694
$$ 42210529 43580205 45097849 47101807 49349385 51628617 53744135 54526286 53472592
18456E3472592o82721N90310J694775K267329K180197K361445K582796K991856
$$ 53472592 52789871 53380181 55074956 57342285 59522482 61883927 64466723 67458579
18448F7458579L481482L286649K718951K507137K962769L595729M011578M754821
$$ 67458579 70940061 74226710 76945661 79452798 82415567 86011296 90022874 94777695
18440I4777695N361786O124916P133934Q127632R219165J0373759J1736490J3493311
$$ 94777695 100139481 106264397 113398331 121525963 130745128 141118887 152855377 166348688
18432A66348688J6249849K0208079K5398083L2807320M1191514M2383988N323938
$$ 166348688 182598537 202806616 228204699 261012019 302203533 344587521 349911459
18425C49911459p9181768j43095829j56627295r3751896k6242900K0216935L8061793
$$ 349911459 270729691 127633862 -28993433 -122745329 -148988229 -128771294 -90709501
18418i0709501L9867247L8148927L8131988M0945065M6663349N0449299K1897606
$$ -90709501 -50842254 -12693327 25438661 66383726 113047075 163496374 185393980
18411A85393980j05077186j95133623j43954847o8115163L202457L1957764L3348823
$$ 185393980 80316794 -114816829 -258771676 -326886839 -323684382 -291726618 -258377795
18404b58377795K7153759K0701088J5802842J1790722R389586Q934999Q550652
$$ -258377795 -231224036 -210522948 -194720106 -182929384 -173539798 -164604799 -156054147
18397a56054147P964274P551386P433420P302845O662396M864199K815406K186668
$$ -156054147 -148089873 -140538487 -133105067 -125802222 -119139826 -114275627 -111460221 -109273553
18389a09273553K410789K775768K903505K734662K800115K795095K861009K929333
$$ -109273553 -106862764 -104086996 -101183491 -98448829 -95648714 -92853619 -89992610 -87063277
18381h7063277K317425J892252K042174K097482K122310J856047K047902J928642
$$ -87063277 -84745852 -82853600 -80811426 -78713944 -76591634 -74735587 -72687685 -70759043
18373g0759043J561703J122421Q92605J063000J269660J277732J219336J179759
$$ -70759043 -69197340 -68074919 -67182314 -66119314 -64849654 -63571922 -62352586 -61172827
18365f1172827Q98565J028371J009942J068806R67310O50112M20325P56810R81544
$$ -61172827 -60274262 -59245891 -58235949 -57167143 -56199833 -55549721 -55129396 -54372586 -53391042
18356e3391042R09999P51585R17513O34818P96836Q21692N01261O69543Q19178
$$ -53391042 -52481043 -51729458 -50811945 -50177127 -49380291 -48558599 -48057338 -47387795 -46568617
18347d6568617O20679N29454N77253N90876N23048N47087O02432N91473N92607
$$ -46568617 -45947938 -45418484 -44841231 -44250355 -43727307 -43180220 -42577788 -41986315 -41393708
18338d1393708N42353M11845M59492O47010M59768N62949M63447K23435M65723
$$ -41393708 -40851355 -40439510 -39980018 -39333008 -38873240 -38310291 -37846844 -37623409 -37157686
18329c7157686N63432N38743L60665L27806L59037O54287M77280Q7500P8922K74265
$$ -37157686 -36594254 -36055511 -35694846 -35367040 -35008003 -34353716 -33876436 -33788936 -33710014 -33435749
18319c3435749N22626M32388M27170J28603J21974J41112J44825J84063K24888
$$ -33435749 -32913123 -32480735 -32053565 -31924962 -31802988 -31661876 -31517051 -31332988 -31108100
18310c1108100M55925L38786L56861L49403N04636M34233K65573K92503K66573
$$ -31108100 -30652175 -30313389 -29956528 -29607125 -29102489 -28668256 -28402683 -28110180 -27843607
18301b7843607k46658o858p5857K68504K37135J08305J53600L4615L38900M82245
$$ -27843607 -28090265 -28097123 -28172980 -27904476 -27667341 -27559036 -27405436 -27370821 -27031921 -26549676
18291b6549676K99432J71997K97998M17313J86287O0481J31068J21914J3042J71636
$$ -26549676 -26250244 -26078247 -25780249 -25362936 -25176649 -25116168 -24985100 -24863186 -24850144 -24678508
18281b4678508M7645O1628K00125K81442K84286K21453K13431L04077K83583J09532
$$ -24678508 -24630863 -24569235 -24369110 -24087668 -23803382 -23581929 -23368498 -23064421 -22780838 -22671306
18271b2671306K28592K22818O5886K21802K77055n3012J57450J47516P6101K08549
$$ -22671306 -22442714 -22219896 -22154010 -21932208 -21655153 -21708165 -21550715 -21403199 -21327098 -21118549
18261b1118549M63798J76873l5662Q1246m5241K31601L08289J05820J41443K61318
$$ -21118549 -20654751 -20477878 -20513540 -20432294 -20477535 -20245934 -19937645 -19831825 -19690382 -19429064
18251a9429064R4400R1737K83833M25484L79975J02235q3675R2057J69945J18636
$$ -19429064 -19334664 -19242927 -18959094 -18533610 -18153635 -18051400 -18135075 -18043018 -17873073 -17754437
18241a7754437J00028J71034N4374l24227J61441K32627J41120O0123L32386L00037
$$ -17754437 -17654409 -17483375 -17429001 -17753228 -17591787 -17359160 -17218040 -17157917 -16825531 -16525494
18231a6525494K23508K35914K60264K24978J13759J38690Q7961q5238Q9962K6230
$$ -16525494 -16301986 -16066072 -15805808 -15580830 -15467071 -15328381 -15240420 -15325658 -15235696 -15209466
18221a5209466N5684J76389K2577O4650K16165L11958K14334J81362L41778N9464
$$ -15209466 -15153782 -14977393 -14954816 -14890166 -14674001 -14362043 -14147709 -13966347 -13624569 -13565105
18211a3565105P7414K42456L60674J93843J559J5386K53019L09445J89122m6716
$$ -13565105 -13487691 -13245235 -12884561 -12690718 -12689159 -12673773 -12420754 -12111309 -11922187 -11968903
18201a1968903j03293l7575J96385K95115L27219Q8980l0747J45105L28421J05006
$$ -11968903 -12072196 -12109771 -11913386 -11618271 -11291052 -11202072 -11232819 -11087714 -10759293 -10654287
18191a0654287K10317J74849K35701J22013L07698O9480K11784K35499J84789
$$ -10654287 -10443970 -10269121 -10033420 -9911407 -9603709 -9534229 -9322445 -9086946 -8902157
18182h902157K48619k477K41529K98158J32923L53940K94888J23441K08271L26927
$$ -8902157 -8653538 -8656015 -8414486 -8116328 -7983405 -7629465 -7334577 -7211136 -7002865 -6675938
18172f675938L24523L57445L63286K77372J50483Q5919M17642M39529M19339J85108
$$ -6675938 -6351415 -5993970 -5630684 -5353312 -5202829 -5116910 -4699268 -4259739 -3840400 -3655292
18162c655292K57227K98458J40842J87716L66419M46710M77720M21683L5392j96637
$$ -3655292 -3398065 -3099607 -2958765 -2771049 -2404630 -1957920 -1480200 -1058517 -1023125 -1219762
18152a219762O0178K20114K40088L94414O05554M40727L92584N21351O79738P23570
$$ -1219762 -1159584 -939470 -699382 -304968 300586 741313 1133897 1655248 2334986 3058556
18142C058556M86196M17870M41248M97625P66761O89860M55164P19560Q68623
$$ 3058556 3544752 3962622 4403870 4901495 5668256 6358116 6813280 7532840 8401463
18133H401463Q55669J005854J275604J232376J446912J288382J499820J428934
$$ 8401463 9257132 10262986 11538590 12770966 14217878 15506260 17006080 18435014
18125A8435014J361826J608973K097119K241742K660250K815855L162636L811377
$$ 18435014 19796840 21405813 23502932 25744674 28404924 31220779 34383415 38194792
18117C8194792M463138N205364O273059P330275Q431843J0800754J4385355J9051026
$$ 38194792 42657930 47863294 54136353 61466628 69898471 80699225 95084580 114135606
18109A14135606K5291095L1680704K3346754n5476620j41260367j09981868n8253004
$$ 114135606 139426701 171107405 194454159 138977539 -2282828 -112264696 -170517700
18102a70517700m178378J9511550K0670956J6310706J1679780Q029512O193465
$$ -170517700 -174696078 -155184528 -134513572 -118202866 -106523086 -98493574 -92300109
18095i2300109N076926M849521M579563M196008L796057L395357L154284K924889
$$ -92300109 -87223183 -82373662 -77794099 -73598091 -69802034 -66406677 -63252393 -60327504
18087f0327504K828263K366996J846175J841110J822313J698457J644672J229699
$$ -60327504 -57499241 -55132245 -53286070 -51444960 -49622647 -47924190 -46279518 -45049819
18079d5049819J092476J206843J071329J111134J133839R86804J028194J035680
$$ -45049819 -43957343 -42750500 -41679171 -40568037 -39434198 -38447394 -37419200 -36383520
18071c6383520Q73429Q37191R06451O47954O42398O77777N98419J85587r1529
$$ -36383520 -35510091 -34672900 -33766449 -33118495 -32476097 -31798320 -31199901 -31014314 -31105843
18062c1105843j14108o8636J65928K01863K4253J01570P3513J58275J79386L55287
$$ -31105843 -31219951 -31288587 -31122659 -30920796 -30896543 -30794973 -30721460 -30563185 -30383799 -30028512
18052c0028512L23948L23200K61545L64910L39788M11606N16029K55659J39597
$$ -30028512 -29704564 -29381364 -29119819 -28754909 -28415121 -28003515 -27487486 -27231827 -27092230
18043b7092230M64178L26974K50610J75145L52067L51487K36461L91456K56186
$$ -27092230 -26628052 -26301078 -26050468 -25875323 -25523256 -25171769 -24935308 -24543852 -24287666
18034b4287666L14335K96362K58930Q3521K94108K12047J63395L86614K91184
$$ -24287666 -23973331 -23676969 -23418039 -23334518 -23040410 -22828363 -22664968 -22278354 -21987170
18025b1987170M7581J40433K66534K11933K56810K59061K82711K90615K27482
$$ -21987170 -21939589 -21799156 -21532622 -21320689 -21063879 -20804818 -20522107 -20231492 -20004010
18016b0004010K15618J77661R9677N9565J55639K75006L51430L46105K66368K98920
$$ -20004010 -19788392 -19610731 -19511054 -19451489 -19295850 -19020844 -18669414 -18323309 -18056941 -17758021
18006a7758021M93738K32796k7533K646J436j7482l2016J11265K6053j77344k76361
$$ -17758021 -17264283 -17031487 -17059020 -17056374 -17054938 -17072420 -17104436 -16993171 -16967118 -17144462 -17420823
17995a7420823k71238n47635m60535l49592n55175n08788m81757k31265j84229
$$ -17420823 -17692061 -18239696 -18700231 -19049823 -19604998 -20113786 -20595543 -20826808 -21011037
17986b1011037j32136O5191M7548J80727K65756J14561N7918J82807J97832P6464
$$ -21011037 -21143173 -21077982 -21030434 -20849707 -20583951 -20469390 -20411472 -20228665 -20030833 -19954369
17976a9954369K98164K19444K43352K05345K15764Q8380N7467L04606K10954J03397
$$ -19954369 -19656205 -19436761 -19193409 -18988064 -18772300 -18683920 -18626453 -18321847 -18110893 -18007496
17966a8007496K42019K56811J43771K53829L80627J23485j00210k03327p8395
$$ -18007496 -17765477 -17508666 -17364895 -17111066 -16730439 -16606954 -16707164 -16910491 -16988886
17957a6988886N7081N0387J13786R0425j62661q056P9110P1465j18418J4096J31967
$$ -16988886 -16931805 -16881418 -16767632 -16677207 -16839868 -16847924 -16768814 -16697349 -16815767 -16801671 -16669704
17946a6669704j86208j80742j87075l89877k76533l9450N9574o3343j66090k03448
$$ -16669704 -16855912 -17036654 -17223729 -17613606 -17890139 -17929589 -17870015 -17933358 -18099448 -18302896
17936a8302896j92223R0448J85189J11597L71384K47025R1482J65439N3259r0386
$$ -18302896 -18495119 -18404671 -18219482 -18107885 -17736501 -17489476 -17397994 -17232555 -17179296 -17269682
17926a7269682J0789K49689K70880n0258r7302J14434J85655J41897O7354O5657
$$ -17269682 -17258893 -17009204 -16738324 -16788582 -16885884 -16771450 -16585795 -16443898 -16376544 -16310887
17916a6310887P0039j42874J32214J28658J52674L38977K31262M5533O0627O974
$$ -16310887 -16240848 -16383722 -16251508 -16122850 -15970176 -15631199 -15399937 -15354404 -15293777 -15286803
17906a5286803q5376P64Q0145j1540k74965p4388j4331o5714n2348J10910K12758
$$ -15286803 -15372179 -15371415 -15291270 -15302810 -15577775 -15652163 -15666494 -15732208 -15784556 -15673646 -15460888
17895a5460888J49250m1050k00328j89218p2923J43743J48111J42594p4237M5801
$$ -15460888 -15311638 -15352688 -15553016 -15742234 -15815157 -15671414 -15523303 -15380709 -15454946 -15409145
17885a5409145J87429M6188M5145J91119J24473Q019J52476L88187L8700k0296
$$ -15409145 -15221716 -15175528 -15130383 -14939264 -14814791 -14806772 -14654296 -14266109 -14227409 -14247705
17875a4247705Q2203k9824L5072p5449j85760k01628M8168K08794N3607J83211
$$ -14247705 -14165502 -14195326 -14160254 -14235703 -14421463 -14623091 -14574923 -14366129 -14312522 -14129311
17865a4129311J55410p7141k05407l09191j85716M0760J21184R0836L3546J57328
$$ -14129311 -13973901 -14051042 -14256449 -14565640 -14751356 -14710596 -14589412 -14498576 -14465030 -14307702
17855a4307702J08028J06037M7543J53601l3209j95421l1674j26233R5423J07190
$$ -14307702 -14199674 -14093637 -14046094 -13892493 -13925702 -14121123 -14152797 -14279030 -14183607 -14076417
17845a4076417q9732O515K85401K93663r7336l4001J47645p66j10210J25238L11062
$$ -14076417 -14166149 -14159634 -13874233 -13580570 -13677906 -13711907 -13564262 -13565028 -13675238 -13550000 -13238938
17834a3238938M18455J01628j45371k63035p0492p4143k30773K3043R3531k4361
$$ -13238938 -12820483 -12718855 -12864226 -13127261 -13197753 -13271896 -13502669 -13479626 -13386095 -13410456
17824a3410456l9905K1361K34766K57330J69824J34268j67101l61382r0341l2912
$$ -13410456 -13450361 -13429000 -13194234 -12936904 -12767080 -12632812 -12799913 -13161295 -13251636 -13284548
17814a3284548K8223J68391L9362j8199j5662O9685Q5447P3778M1384J74301J51624
$$ -13284548 -13256325 -13087934 -13048572 -13066771 -13082433 -13012748 -12927301 -12853523 -12812139 -12637838 -12486214
17803a2486214p82R5103p2032l48732k17532m178j67008K0096k0015J50267K14986
$$ -12486214 -12486996 -12391893 -12463925 -12812657 -13030189 -13034367 -13201375 -13181279 -13201294 -13051027 -12836041
17792a2836041J27846N5734J58903J84586p2821j69149O0727j59071r5933N0585
$$ -12836041 -12708195 -12652461 -12493558 -12308972 -12381793 -12550942 -12490215 -12649286 -12745219 -12694634
17782a2694634L9181J57017J45286J4417p1548j2320k043M8307J49891M4908p652
$$ -12694634 -12655453 -12498436 -12353150 -12338733 -12410281 -12422601 -12424644 -12376337 -12226446 -12181538 -12189190
17771a2189190R3514O7297J4199K9131L5537l8507L3617Q3492P8053Q6336k4941
$$ -12189190 -12095676 -12028379 -12014180 -11985049 -11949512 -11988019 -11954402 -11870910 -11792857 -11706521 -11731462
17760a1731462j26487n0247K4289J02712m1096N5583J21035J05619n3317R5769
$$ -11731462 -11857949 -11908196 -11883907 -11781195 -11822291 -11766708 -11645673 -11540054 -11593371 -11497602
17750a1497602m173r44K1877k2191j45772R4246R51j65639n4255j02914K32645
$$ -11497602 -11501775 -11502719 -11480842 -11503033 -11648805 -11554559 -11553608 -11719247 -11773502 -11876416 -11643771
17739a1643771J00130p1193l3420J93928K95276L708p9440m9966o9377l6510K54014
$$ -11643771 -11543641 -11614834 -11648254 -11454326 -11159050 -11155342 -11234782 -11284748 -11354125 -11390635 -11136621
17728a1136621J41967r7555j25841k3936r242J56172K20r6974Q6800J25343j79086
$$ -11136621 -10994654 -11092209 -11218050 -11241986 -11251228 -11095056 -11094836 -11191810 -11105010 -10979667 -11158753
17717a1158753j16605L9176m3080m3037N2973K14387j71663j25140L35919Q9540
$$ -11158753 -11275358 -11236182 -11279262 -11322299 -11269326 -11054939 -11226602 -11351742 -11015823 -10926283
17707a0926283k6937M9033J9406N7235m2996p0557J69685l36r2774P018M9273
$$ -10926283 -10953220 -10904187 -10884781 -10827546 -10870542 -10941099 -10771414 -10771750 -10864524 -10857506 -10808233
17696a0808233M2696r5932O2213J32141k1300R2446j2733o3999L7426l7318O4288
$$ -10808233 -10765537 -10861469 -10799256 -10667115 -10688415 -10595969 -10608702 -10672701 -10635275 -10672593 -10608305
17685a0608305j709J51891M9313j80058k4415k9737L810K00451Q3638j28263k1834
$$ -10608305 -10610014 -10458123 -10408810 -10588868 -10613283 -10643020 -10639210 -10438759 -10355121 -10483384 -10505218
17674a0505218R9697j398o2843K11090K6552N3413j33830j89479l320J1369J03461
$$ -10505218 -10405521 -10406919 -10469762 -10258672 -10232120 -10178707 -10312537 -10502016 -10505336 -10493967 -10390506
17663a0390506O6426P8690K16622M3578j80918o6590J12233J48867N6291j37474
$$ -10390506 -10324080 -10245390 -10028768 -9985190 -10166108 -10232698 -10120465 -9971598 -9915307 -10052781
17653a0052781O4022J99958q7746j27660m6879j998J43474Q9739o8463P2256j8926
$$ -10052781 -9988759 -9788801 -9876547 -10004207 -10051086 -10053084 -9909610 -9819871 -9888334 -9816078 -9835004
17642i835004r1397o4841l7291K23749N7433k6287L957m8565R8145m9146n8326
$$ -9835004 -9926401 -9991242 -10028533 -9804784 -9747351 -9773638 -9769681 -9818246 -9720101 -9769247 -9827573
17631i827573o9747k58163J2791K67713K09885J32690N3868J01425l325j15349
$$ -9827573 -9897320 -10155483 -10142692 -9874979 -9665094 -9532404 -9478536 -9377111 -9380436 -9495785
17621i495785j59329j88869K13247J45395j9631j42922N8566L5985N7740m3897
$$ -9495785 -9655114 -9843983 -9630736 -9485341 -9504972 -9647894 -9589328 -9553343 -9495603 -9539500
17611i539500R8427p9036k10530J13055J72322R8851K9030J47580j59623j5723
$$ -9539500 -9441073 -9520109 -9730639 -9617584 -9445262 -9346411 -9317381 -9169801 -9329424 -9345147
17601i345147j1052K2307l0735K0095n3360R7761m180K0840P9582j47260Q5259
$$ -9345147 -9356199 -9333892 -9364627 -9344532 -9397892 -9300131 -9304311 -9283471 -9203889 -9351149 -9265890
17590i265890J3770m8275J8939P1460J44815N1279j56718j67747l6601j30141
$$ -9265890 -9252120 -9300395 -9281456 -9209996 -9065181 -9013902 -9170620 -9338367 -9374968 -9505109
17580i505109K1795P2660J00953K3179K6213p5435J44114l8761P229l3182m9662
$$ -9505109 -9483314 -9410654 -9309701 -9286522 -9260309 -9335744 -9191630 -9230391 -9223162 -9256344 -9306006
17569i306006l2877J20975J60637P2262K7546j5732k13094J56968j40801O7541
$$ -9306006 -9338883 -9217908 -9057271 -8985009 -8957463 -8973195 -9186289 -9029321 -9170122 -9102581
17559i102581J49994m8580R7730K6869n9159o1117n1115j1175J6750J193P5625
$$ -9102581 -8952587 -9001167 -8903437 -8876568 -8935727 -8996844 -9047959 -9059134 -9042384 -9041191 -8965566
17548h965566R6552K04769K53486j70316j1547p2390j17744J21967r2342j20797
$$ -8965566 -8869014 -8664245 -8410759 -8581075 -8592622 -8665012 -8782756 -8660789 -8753131 -8873928
17538h873928j04728j60370q9435J64385L15865J51941j54514j85458N3884R4081
$$ -8873928 -8978656 -9139026 -9228461 -9064076 -8748211 -8596270 -8750784 -8936242 -8882358 -8788277
17528h788277O2577P0569J80568N0945k35292K8620q817j54514K5585n7398k7887
$$ -8788277 -8725700 -8655131 -8474563 -8423618 -8658910 -8630290 -8639107 -8793621 -8768036 -8825434 -8853321
17517h853321J11341Q4273J92212J22123L0614m6520J6682j85569j63935R9228
$$ -8853321 -8741980 -8657707 -8465495 -8343372 -8312758 -8359278 -8342596 -8528165 -8692100 -8592872
17507h592872R5854j10975l1957K15810N9584L1169K8395J20775j8134o6454k37647
$$ -8592872 -8497018 -8607993 -8639950 -8424140 -8364556 -8333387 -8304992 -8184217 -8202351 -8268805 -8506452
17496h506452l1744L7360J27978K75722j17246k42924J05310K42925P4217o2998
$$ -8506452 -8538196 -8500836 -8372858 -8097136 -8214382 -8457306 -8351996 -8109071 -8034854 -8097852
17486h097852l1351j92744k33980o2127J77559J03028J6772O7276r1703N6220
$$ -8097852 -8129203 -8321947 -8555927 -8618054 -8440495 -8337467 -8320695 -8253419 -8345122 -8288902
17476h288902J34033J34537p0879j25558P1961R8755j5825n384j41320j84635
$$ -8288902 -8154869 -8020332 -8091211 -8216769 -8144808 -8046053 -8061878 -8067262 -8208582 -8393217
17466h393217o3168K48276K40773k28995l07J33363J23938o1686K68J42523r49
$$ -8393217 -8456385 -8208109 -7967336 -8196331 -8196638 -8063275 -7939337 -8001023 -8000755 -7858232 -7859181
17455g859181J03753P6884n1288j46166j98376l6500K64332P6008N6893m7691
$$ -7859181 -7755428 -7678544 -7729832 -7875998 -8074374 -8110874 -7846542 -7770534 -7713641 -7761332
17445g761332N9281J0629J89275K87303L10254K1303o88828p94872l26510m4840
$$ -7761332 -7702051 -7691422 -7502147 -7214844 -6904590 -6883287 -7572115 -8366987 -8693497 -8738337
17435h738337J31493K45618Q7172L2139K3853J5438n6687j1437O2259k1941l8679
$$ -8738337 -8606844 -8361226 -8274054 -8241915 -8218062 -8202624 -8259311 -8270748 -8208489 -8230430 -8269109
17424h269109J22727O6873O9439Q4780k4146P3382J47602O8925r8611j71709j62271
$$ -8269109 -8146382 -8079509 -8010070 -7925290 -7949436 -7876054 -7728452 -7659527 -7758138 -7929847 -8092118
17413h092118L7349J66247J40199M1375j90110j702M4498m8686R3559L6007J62802
$$ -8092118 -8054769 -7888522 -7748323 -7706948 -7897058 -7898760 -7854262 -7902948 -7809389 -7773382 -7610580
17402g610580p5619l0034o7871R546p5662q2138Q9648J55248P2355J7734j70285
$$ -7610580 -7686199 -7716233 -7784104 -7774558 -7850220 -7932358 -7842710 -7687462 -7615107 -7597373 -7767658
17391g767658q4253N411k25156L1488K26330P3370q9094j6125Q1885q2811o3241
$$ -7767658 -7851911 -7846500 -8071656 -8040168 -7813838 -7740468 -7829562 -7845687 -7763802 -7846613 -7909854
17380g909854M5224J52935J02277J50841q8571j97206n457L6064J32928m371q8209
$$ -7909854 -7864630 -7711695 -7609418 -7458577 -7547148 -7744354 -7749811 -7713747 -7580819 -7585190 -7673399
17369g673399o233J89919o1702q2130L7393o5475J29155K3176j27713l0458J91359
$$ -7673399 -7679632 -7489713 -7551415 -7633545 -7596152 -7661627 -7532472 -7509296 -7637009 -7667467 -7476108
17358g476108J04784j37724q8230J34718M6890O6438N4014M9726K9694M9664j06696
$$ -7476108 -7371324 -7509048 -7597278 -7462560 -7415670 -7349232 -7295218 -7245492 -7215798 -7166134 -7272830
17347g272830j46953j94532j34072M507N6258M3685J74547N0329j00932Q3152
$$ -7272830 -7419783 -7614315 -7748387 -7743880 -7687622 -7643937 -7469390 -7419061 -7519993 -7436841
17337g436841m0323J9481J37976K086R2274q8737p7270J09703n805r6844n3487
$$ -7436841 -7477164 -7457683 -7319707 -7317621 -7225347 -7314084 -7391354 -7281651 -7287456 -7384300 -7437787
17326g437787N8015P6778J37474j23912K0812J82868L292J8617j38111l74362
$$ -7437787 -7379772 -7302994 -7165520 -7289432 -7268620 -7085752 -7082460 -7063843 -7201954 -7576316
17316g576316o5739K14037L18663J87177K06143j15517l21442j42342K1561m5906
$$ -7576316 -7642055 -7428018 -7109355 -6922178 -6716035 -6831552 -7152994 -7295336 -7273775 -7319681
17306g319681J35217P8368J09080k9691r0229L4299k24157m1051N1758J10523
$$ -7319681 -7184464 -7106096 -6997016 -7026707 -7116936 -7082637 -7306794 -7347845 -7296087 -7185564
17296g185564j34835k4095K64085J24448N0940K4462j21476j59990k07253j1511
$$ -7185564 -7320399 -7344494 -7080409 -6955961 -6905021 -6880559 -7002035 -7162025 -7369278 -7380789
17286g380789K7705p5920Q8385Q1616P8298k915L8812M6692q8377r2773Q0519
$$ -7380789 -7353084 -7429004 -7340619 -7259003 -7180705 -7183620 -7144808 -7098116 -7186493 -7279266 -7198747
17275g198747K50161N5313m1470n1153J07875J8615q0058m3603j12596j580J04359
$$ -7198747 -6948586 -6893273 -6934743 -6985896 -6878021 -6859406 -6939464 -6983067 -7095663 -7097243 -6992884
17264f992884N636p27J19511R9626O26m5191R7441K41188M5864k9371m9499r1751
$$ -6992884 -6987248 -6987975 -6868464 -6768838 -6768212 -6813403 -6715962 -6474774 -6428910 -6458281 -6507780 -6599531
17252f599531J9675j22881j75835N9625N8755J33864n5142o2708J62752J54616
$$ -6599531 -6579856 -6702737 -6878572 -6818947 -6760192 -6626328 -6681470 -6744178 -6581426 -6426810
17242f426810J2700j54369m5341J30026K3992J3246j32760j42414M9582J08413
$$ -6426810 -6414110 -6568479 -6613820 -6483794 -6459802 -6446556 -6579316 -6721730 -6672148 -6563735
17232f563735L7091k51012p7489J87815J23561p0475N7628J32209l2740m8589
$$ -6563735 -6526644 -6777656 -6855145 -6667330 -6543769 -6614244 -6556616 -6424407 -6457147 -6505736
17222f505736j00599k3661P9807N9097o7196j34745M2275K11407n4329J9917Q6139
$$ -6505736 -6606335 -6629996 -6550189 -6491092 -6558288 -6693033 -6650758 -6439351 -6493680 -6473763 -6387624
17211f387624j4893N1338J76017q2126o963P6231K2156j0926j38969O5943L5747
$$ -6387624 -6402517 -6351179 -6175162 -6257288 -6264251 -6188020 -6165864 -6176790 -6315759 -6249816 -6214069
17200f214069k7260j13163m2221m2575L4910R3812K8582J1103l0695k5573J559
$$ -6214069 -6241329 -6354492 -6396713 -6439288 -6404378 -6310566 -6281984 -6270881 -6301576 -6327149 -6325590
17189f325590J9932M9380O4179j25191P059j13376j52665J32744k3531J12531
$$ -6325590 -6305658 -6256278 -6192099 -6317290 -6310231 -6423607 -6576272 -6443528 -6467059 -6354528
17179f354528O1145j33031r1121j12036Q5938J79185l3815m316j810L4789j931
$$ -6354528 -6293383 -6426414 -6517535 -6629571 -6543633 -6364448 -6398263 -6402579 -6404389 -6369600 -6371531
17168f371531j56731O4395M5191n7994j6649O3976j2438J313J43317J76587P7928
$$ -6371531 -6528262 -6463867 -6418676 -6476670 -6493319 -6429343 -6441781 -6440468 -6297151 -6120564 -6042636
17157f042636J4883p6857K085n5972q1289j93628r8717P9883N9426J50070L1556
$$ -6042636 -6027753 -6104610 -6102525 -6158497 -6239786 -6433414 -6532131 -6452248 -6392822 -6242752 -6211196
17146f211196k23321r0517o3178K1973K24540K69105J9386k09447j58691L0117
$$ -6211196 -6434517 -6525034 -6588212 -6566239 -6341699 -6072594 -6053208 -6262655 -6421346 -6391229
17136f391229q8029L3230P5506N6530J26366R3154k6422j09780J33772m8979j14191
$$ -6391229 -6479258 -6446028 -6370522 -6313992 -6187626 -6094472 -6120894 -6230674 -6096902 -6145881 -6260072
17125f260072j8655l9559m5469p7661L1516K21255J36627p55L4908j65723O7023
$$ -6260072 -6278727 -6318286 -6363755 -6441416 -6409900 -6188645 -6052018 -6052773 -6017865 -6183588 -6116565
17114f116565J43272q2739k4205P539q5365j9380K2612j07767J31140o074o2029
$$ -6116565 -5973293 -6056032 -6080237 -6072698 -6158063 -6177443 -6154831 -6262598 -6131458 -6137532 -6199561
17103f199561K13828J76921L1026Q145j1491j35883j79713L2804q4312J17743
$$ -6199561 -5985733 -5808812 -5777786 -5769641 -5781132 -5917015 -6096728 -6063924 -6148236 -6030493
17093f030493K64907j20410j26777q887N4760m621k3408O216k8919K024R9699
$$ -6030493 -5765586 -5885996 -6012773 -6021660 -5966900 -5971521 -5994929 -5988713 -6017632 -6015608 -5915909
17082e915909j10459j57831p151J41549Q1942R3357j60772r9560O8960N0482J34912
$$ -5915909 -6026368 -6184199 -6191350 -6049801 -5967859 -5874502 -6035274 -6134834 -6065874 -6015392 -5880480
17071e880480Q1947M2254l877R4479P6489N1726J436J3325j22003m1421l1881
$$ -5880480 -5798533 -5756279 -5760156 -5665677 -5589188 -5537462 -5536026 -5522701 -5644704 -5686125 -5718006
17060e718006k51898k39345J61672N2122l4159k7266J41746M2513l9842L02527
$$ -5718006 -5969904 -6209249 -6047577 -5995455 -6029614 -6056880 -5915134 -5872621 -5912463 -5609936
17050e609936J99661j98287j39306M5843j79904k6325J85002K9080m1655M3318
$$ -5609936 -5410275 -5608562 -5747868 -5702025 -5881929 -5908254 -5723252 -5694172 -5735827 -5692509
17040e692509k65795J44334K22466l0593j52130J24551Q1999j03017j4867n110
$$ -5692509 -5958304 -5813970 -5591504 -5622097 -5774227 -5649676 -5567677 -5670694 -5685561 -5690671
17030e690671J22523M9147J32501K21984j41284j77343k34144P394J50102p0970
$$ -5690671 -5568148 -5519001 -5386500 -5164516 -5305800 -5483143 -5717287 -5709893 -5559791 -5630761
17020e630761r6652J14155J59464r1867j68402m0188r2199j31663O4620J29675
$$ -5630761 -5727413 -5613258 -5453794 -5545661 -5714063 -5754251 -5846450 -5978113 -5913493 -5783818
17010e783818J17264J031J16257l8902O0633r6427j261n4011J8672k3068o5076
$$ -5783818 -5666554 -5665523 -5549266 -5588168 -5527535 -5623962 -5625223 -5679234 -5660562 -5683630 -5748706
16999e748706p4784j47031Q3837J87773J2151n56j8634q2645P2996J04141J73838
$$ -5748706 -5823490 -5970521 -5886684 -5698911 -5686760 -5687316 -5705950 -5788595 -5715599 -5611458 -5437620
16988e437620j82908l5472k5124j15272J1811m9772j58937M1129J26299J09411
$$ -5437620 -5620528 -5656000 -5681124 -5796396 -5784585 -5834357 -5993294 -5952165 -5825866 -5716455
16978e716455J19483k7735p2110K6720J61713N8800m5701m5670j42908J07406
$$ -5716455 -5596972 -5624707 -5696817 -5670097 -5508384 -5449584 -5495285 -5540955 -5683863 -5576457
16968e576457P9217p5306n4685o5082J41034K21818O7589Q0384j03526J5894J09163
$$ -5576457 -5497240 -5572546 -5627231 -5692313 -5551279 -5329461 -5261872 -5181488 -5285014 -5269120 -5159957
16957e159957Q2233Q0340o5661n500J31968o7288k16989l28281j08358J18762
$$ -5159957 -5077724 -4997384 -5063045 -5068545 -4936577 -5003865 -5220854 -5549135 -5657493 -5538731
16947e538731J13016l0650k7286P4785j23162n3710Q2241M1062j10910k3778j60005
$$ -5538731 -5425715 -5456365 -5483651 -5408866 -5532028 -5585738 -5503497 -5462435 -5573345 -5597123 -5757128
16936e757128l9132K4759J76289J36389m936K7041K5129J41047J97971q0466l3692
$$ -5757128 -5796260 -5771501 -5595212 -5458823 -5463759 -5436718 -5411589 -5270542 -5072571 -5153037 -5186729
16925e186729J57969L3320N8831L9185k00711q7153j35972o7528j39986M6264
$$ -5186729 -5028760 -4995440 -4936609 -4897424 -5098135 -5185288 -5321260 -5388788 -5528774 -5482510
16915e482510P519k8030m1626M8966R4956o1655p4403j23011l4008J48344J39662
$$ -5482510 -5474991 -5503021 -5544647 -5495681 -5400725 -5462380 -5536783 -5659794 -5693802 -5545458 -5405796
16904e405796N3871p1364J01179P9359o7874j58416j8028l2080m0666M1751L4932
$$ -5405796 -5351925 -5423289 -5322110 -5242751 -5310625 -5469041 -5487069 -5519149 -5559815 -5518064 -5483132
16893e483132K5845K09955J38718n6281j99816K1497K51199k664j84783j87061
$$ -5483132 -5457287 -5247332 -5108614 -5164895 -5364711 -5343214 -5092015 -5094679 -5279462 -5466523
16883e466523k8618J74611K27251Q8195j08277K0947j4995J24751J8182j21917
$$ -5466523 -5495141 -5320530 -5093279 -5005084 -5113361 -5092414 -5107409 -4982658 -4964476 -5086393
16873e086393j24935M603j11384j82825J32417L0821j17334J48339L796j42680
$$ -5086393 -5211328 -5206725 -5318109 -5500934 -5368517 -5337696 -5455030 -5306691 -5302895 -5445575
16863e445575k0863p2390N0229L0542j471J48711Q6413j2811J2418j13083l7647
$$ -5445575 -5466438 -5538828 -5488599 -5458057 -5459528 -5310817 -5224404 -5237215 -5224797 -5337880 -5375527
16852e375527l7175J797J29285n1171K1592K92962l72j08099J44564j56271j49599
$$ -5375527 -5412702 -5410905 -5281620 -5332791 -5311199 -5018237 -5018609 -5126708 -4982144 -5138415 -5288014
16841e288014N7022K40232J17277j9887k20922k1090P2025p070j24543J37598
$$ -5288014 -5230992 -4990760 -4873483 -4893370 -5114292 -5135382 -5063357 -5070427 -5194970 -5057372
16831e057372j34998j76869M0667R6107M249J63247J92032O5086j8653m9446Q3724
$$ -5057372 -5192370 -5369239 -5328572 -5232465 -5228216 -5064969 -4872937 -4807851 -4826504 -4875950 -4792226
16820d792226K8689q585k51373N8268q15j26984l3516P2938J45291q7938k08519
$$ -4792226 -4763537 -4772122 -5023495 -4965227 -4966042 -5093026 -5126542 -5053604 -4908313 -4996251 -5204770
16809e204770J34400n3070r2387J57174P8507n3521k0419j57692j9054J86200
$$ -5204770 -5070370 -5123440 -5215827 -5058653 -4980146 -5033667 -5054086 -5211778 -5230832 -5044632
16799e044632K73560j37942Q5001J07727j00775n7046j20422N5359J85094r8629
$$ -5044632 -4771072 -4909014 -4824013 -4716286 -4817061 -4874107 -4994529 -4939170 -4754076 -4852705
16789d852705j57768R9950m6190j39371M7542J57227k4729J02824J23929J8124
$$ -4852705 -5010473 -4910523 -4956713 -5096084 -5048542 -4891315 -4916044 -4813220 -4689291 -4671167
16779d671167q8549j91292l2059r5168j21547j04892K24919J63027R0566k7468
$$ -4671167 -4759716 -4951008 -4983067 -5078235 -5199782 -5304674 -5079755 -4916728 -4826162 -4853630
16769d853630j33540Q8301J63974j11806R8367q4151j4480R5515p6104j90168
$$ -4853630 -4987170 -4898869 -4734895 -4846701 -4748334 -4832485 -4846965 -4751450 -4827554 -5017722
16759e017722n6122J65688o350R9497N1029n2458j56422M9747J37596J64356l062
$$ -5017722 -5073844 -4908156 -4914506 -4815009 -4763980 -4816438 -4972860 -4923113 -4785517 -4621161 -4624223
16748d624223l8360L3911m5355j22302o1782p6368Q5842J89693K40915j39255
$$ -4624223 -4662583 -4628672 -4674027 -4796329 -4858111 -4934479 -4848637 -4658944 -4418029 -4557284
16738d557284j93560o0068M2216J52942J4374r3262j31350q9308J36941O3342
$$ -4557284 -4750844 -4810912 -4768696 -4615754 -4601380 -4694642 -4825992 -4915300 -4778359 -4715017
16728d715017p3797j48747J0838O1357l8550R1458K8341J74289O7565p6244k43481
$$ -4715017 -4788814 -4937561 -4926723 -4865366 -4903916 -4812458 -4784117 -4609828 -4542263 -4618507 -4861988
16717d861988q5443j35285n4216J00296J90070J44507J15062j01989r6148r7224
$$ -4861988 -4947431 -5082716 -5136932 -5036636 -4846566 -4702059 -4586997 -4688986 -4785134 -4882358
16707d882358j02398N2172J11128Q4758p3003J26949J02958k30392o310J84871
$$ -4882358 -4984756 -4932584 -4821456 -4736698 -4809701 -4682752 -4579794 -4810186 -4816496 -4631625
16697d631625K9330j00930O7014k9158n1054k22109m8993r886l068L996j90026
$$ -4631625 -4602295 -4703225 -4636211 -4665369 -4716423 -4938532 -4987525 -4997411 -5000479 -4996483 -5186509
16686e186509r3006L30174J1837j36966M1843O5508J24514r841q7363q1836O8428
$$ -5186509 -5279515 -4949341 -4937504 -5074470 -5032627 -4967119 -4842605 -4852446 -4939809 -5021645 -4953217
16675d953217K57312J73050o1528k23378j19146P4928Q9528K52733J31548q9714
$$ -4953217 -4695905 -4522855 -4584383 -4807761 -4926907 -4851979 -4762451 -4509718 -4378170 -4467884
16665d467884o8107J59762L7526Q6231j99176q1652L2123k10114j77875L8079
$$ -4467884 -4535991 -4376229 -4338703 -4252472 -4451648 -4533300 -4501177 -4711291 -4889166 -4851087
16655d851087Q9728J89131J34200P0253j90777j37096l9499J97214J62551j70292
$$ -4851087 -4761359 -4572228 -4438028 -4367775 -4558552 -4695648 -4735147 -4537933 -4375382 -4545674
16645d545674r5338J09957L8476n7111O150j16131j1254M5479q0098j24899R4268
$$ -4545674 -4641012 -4531055 -4492579 -4549690 -4543540 -4659671 -4670925 -4625446 -4705544 -4830443 -4736175
16634d736175R2931j6681q7292J12420M8722p334j2083l7053k367J61243p7392
$$ -4736175 -4643244 -4659925 -4747217 -4634797 -4586075 -4593409 -4605492 -4642545 -4644912 -4483669 -4561061
16623d561061j58050r6846O861K17902R3143j18577l5986q3990J09477K8574M3747
$$ -4561061 -4719111 -4815957 -4809096 -4591194 -4498051 -4616628 -4652614 -4736604 -4627127 -4598553 -4554806
16612d554806k6465J07464L4741j09364K9280N8110j1321N3899m0220j07015q0993
$$ -4554806 -4581271 -4473807 -4439066 -4548430 -4519150 -4461040 -4472361 -4418462 -4458682 -4565697 -4646690
16601d646690R1678J94612M149j2863j40145o5941Q3000N7921o749M1260j10615
$$ -4646690 -4555012 -4360400 -4356251 -4369114 -4509259 -4575200 -4492200 -4434279 -4441028 -4399768 -4510383
16590d510383l9286O163L6070M7818J832K4797p3964R7027J02036j85452P8657
$$ -4510383 -4549669 -4543506 -4507436 -4459618 -4457786 -4432989 -4506953 -4409926 -4307890 -4493342 -4414685
16579d414685J63029Q247J9344k9664j03255J5483r3079J69006J1070j59297Q7321
$$ -4414685 -4251656 -4243409 -4224065 -4253729 -4356984 -4341501 -4434580 -4265574 -4254504 -4413801 -4326480
16568d326480J6793n6814r9471m9949k4179q7603n8390J20672K51848l2916j47139
$$ -4326480 -4309687 -4366501 -4465972 -4515921 -4540100 -4627703 -4686093 -4565421 -4313573 -4346489 -4493628
16557d493628n0795P358O83J3438L5875J46668j09542j2987l76J08327l7402k05417
$$ -4493628 -4544423 -4537065 -4536382 -4522944 -4487069 -4340401 -4449943 -4462930 -4463306 -4354979 -4392381 -4597798
16545d597798n6378K18422N9273m0551Q697J06748j64955j01327K3510J04879
$$ -4597798 -4654176 -4435754 -4376481 -4417032 -4408335 -4301587 -4466542 -4567869 -4544359 -4439480
16535d439480J88115k1656j88994n9631N9883J58833O9087m4078l2574J42935
$$ -4439480 -4251365 -4273021 -4462015 -4521646 -4461763 -4302930 -4233843 -4277921 -4310495 -4167560
16525d167560J68792P8329k90230j92764k0227J4913j5086k8742P7691j0976L768
$$ -4167560 -3998768 -3920439 -4210669 -4403433 -4423660 -4408747 -4423833 -4452575 -4374884 -4385860 -4382092
16514d382092J79538R0195o1347j12810k5495q9244O7629m7398Q6851J01263r4631
$$ -4382092 -4202554 -4112359 -4173706 -4286516 -4312011 -4401255 -4333626 -4381024 -4294173 -4192910 -4287541
16503d287541k3222J21773r0333j31299j19890O6842q7342j2376m8631K04731
$$ -4287541 -4310763 -4188990 -4279323 -4410622 -4530512 -4463670 -4551012 -4563388 -4612019 -4407288
16493d407288J87505R966N1472L310N070k1359m330O8586j8695K0953o8967P0652
$$ -4407288 -4219783 -4209817 -4158345 -4155035 -4149965 -4171324 -4175654 -4107068 -4125763 -4104810 -4173777 -4103125
16481d103125j00772m2681m0982M7832Q7206N7047n4772l002M0244Q8025p8051
$$ -4103125 -4203897 -4246578 -4287560 -4239728 -4152522 -4095475 -4150247 -4153249 -4113005 -4024980 -4103031
16470d103031q7550n5419o9575q6564J23741J76127m4410J3985q7320M7801M6935
$$ -4103031 -4190581 -4246000 -4315575 -4402139 -4278398 -4102271 -4146681 -4132696 -4220016 -4172215 -4125280
16459d125280l2915k33093k27466k07959O0162K45894J05000k3742Q5344K2735
$$ -4125280 -4158195 -4391288 -4618754 -4826713 -4766551 -4520657 -4415657 -4439399 -4354055 -4331320
16449d331320n865m3763J91609K0010j10487P746N4020j03534o533K888N0322
$$ -4331320 -4337185 -4380948 -4189339 -4169329 -4279816 -4272070 -4218050 -4321584 -4328117 -4325229 -4274907
16438d274907J7095J16317K70301M1725o1465j52373j01960P3824M0001l4267
$$ -4274907 -4257812 -4141495 -3871194 -3829469 -3890934 -4043307 -4145267 -4071443 -4031442 -4065709
16428d065709J8125L8233k56238r6878M3875J35574L27664o8601j63359r8381
$$ -4065709 -4047584 -4009351 -4265589 -4362467 -4318592 -4183018 -3855354 -3923955 -4087314 -4185695
16418d185695j75922k953R6995N1345N1317J65190j36038o6908J52522J44361
$$ -4185695 -4361617 -4364570 -4267575 -4216230 -4164913 -3999723 -4135761 -4202669 -4050147 -3905786
16408c905786n2747o4932j11473M6233R7458P5316r0015k18157k26879R3524L18059
$$ -3905786 -3958533 -4023465 -4134938 -4088705 -3991247 -3915931 -4005946 -4224103 -4450982 -4357458 -4039399
16397d039399J00971J01109j44277j65299Q6834J03795l0114o8876q6598Q3308
$$ -4039399 -3938428 -3837319 -3981596 -4146895 -4060061 -3956266 -3986380 -4055256 -4141854 -4058546
16387d058546K7204j10060o6806P867j01191L8228J17325K21649L9271l7157J50487
$$ -4058546 -4031342 -4141402 -4208208 -4200341 -4301532 -4263304 -4145979 -3924330 -3885059 -3922216 -3771729
16376c771729K8296J71012m0694n2551p5187r3981m4734K1158k5408m4424j2041
$$ -3771729 -3743433 -3572421 -3613115 -3665666 -3740853 -3834834 -3879568 -3858410 -3883818 -3928242 -3940283
16365c940283J74880N2084l11545l24163N2287K37782K30360p5287k89291j67960
$$ -3940283 -3765403 -3713319 -4024864 -4349027 -4296740 -4058958 -3828598 -3903885 -4193176 -4361136
16355d361136J03602K23660k8880j40326R7443K37317K9315m2832L2054M4439
$$ -4361136 -4257534 -4033874 -4062754 -4203080 -4105637 -3868320 -3839005 -3881837 -3849783 -3805344
16345c805344j46611p5324J7528J64500M7089j57812q7223r2962j08586Q7658
$$ -3805344 -3951955 -4027279 -4009751 -3845251 -3798162 -3955974 -4043197 -4136159 -4244745 -4157087
16335d157087m4043J35156l0266r2679l8180J6688J98568K29637j28755J2760
$$ -4157087 -4201130 -4065974 -4096240 -4188919 -4227099 -4210411 -4011843 -3782206 -3910961 -3898201
16325c898201q6948r3255J75216J17359K7564O168J40499q0394j40460K857n5567
$$ -3898201 -3985149 -4078404 -3903188 -3785829 -3758265 -3752097 -3611598 -3691992 -3832452 -3829595 -3885162
16314c885162J812J35652j9588r3789l7644p4189R511P2679j4855R9692O1591
$$ -3885162 -3883350 -3747698 -3767286 -3861075 -3898719 -3972908 -3963397 -3890718 -3905573 -3805881 -3744290
16303c744290K38958m2446q1425j00575j27373o8556L3657K2202K9863Q0199k9811
$$ -3744290 -3505332 -3547778 -3629203 -3729778 -3857151 -3925707 -3892050 -3869848 -3839985 -3759786 -3789597
16292c789597Q6176Q5197K1129j8351O4648j4947j02201j12086r1887J04952J93619
$$ -3789597 -3703421 -3618224 -3597095 -3615446 -3550798 -3565745 -3667946 -3780032 -3871919 -3766967 -3573348
16281c573348K04160k47743Q4618n498p3749J8416l1838j20494r5419K22277M810
$$ -3573348 -3369188 -3616931 -3532313 -3537811 -3611560 -3593144 -3624982 -3745476 -3840895 -3618618 -3613808
16270c613808k8573K4685n3061p3443m734o1438K0944L7516m5425l5470o2590
$$ -3613808 -3642381 -3617696 -3670757 -3744200 -3748934 -3810372 -3789428 -3751912 -3797337 -3832807 -3895397
16259c895397M7515L278M5254J4803R9245k14910j46341K16562K67725j20294
$$ -3895397 -3847882 -3844604 -3799350 -3784547 -3685302 -3900212 -4046553 -3829991 -3562266 -3682560
16249c682560k57970K7678J60408J27841K3560o6639k7980j22915m3709L035j08348
$$ -3682560 -3940530 -3912852 -3752444 -3624603 -3601043 -3667682 -3695662 -3818577 -3862286 -3859251 -3967599
16238c967599J69261L8779q9911m155Q0052K27656K0511J41099K352j39981l02267
$$ -3967599 -3798338 -3759559 -3849470 -3853625 -3773573 -3545917 -3525406 -3384307 -3381955 -3521936 -3824203
16227c824203l12784K02007Q3956r9274P2520R6830q8701j21017R0956J15767
$$ -3824203 -4136987 -3934980 -3851024 -3950298 -3877778 -3780948 -3869649 -3990666 -3899710 -3783943
16217c783943O2749k1095K4770Q8734j09396j49219m2979J28048J25516j49567
$$ -3783943 -3721194 -3742289 -3717519 -3628785 -3738181 -3887400 -3930379 -3802331 -3676815 -3826382
16207c826382M9944M6970J661R0220J46700j51652k48069N768o1998J52521K18011
$$ -3826382 -3776438 -3729468 -3727807 -3637587 -3490887 -3642539 -3890608 -3884840 -3946838 -3794317 -3576306
16196c576306J23345j81916J4398n6114j30458p580j1476N3632K69648k0600j27956
$$ -3576306 -3452961 -3634877 -3620479 -3676593 -3807051 -3814631 -3826107 -3772475 -3502827 -3523427 -3651383
16185c651383J83741j20698j29933K7439Q9651L5573p9051o4979J02474L30455
$$ -3651383 -3467642 -3588340 -3718273 -3690834 -3601183 -3565610 -3644661 -3709640 -3607166 -3276711
16175c276711j34425k10478q9690j20031J2898j00996P9004Q3826j38704n9244
$$ -3276711 -3411136 -3621614 -3711304 -3831335 -3818437 -3919433 -3840429 -3756603 -3895307 -3954551
16165c954551O4038L0904J59649J1322n5937l7008J44696K42873Q6841P086o4151
$$ -3954551 -3890513 -3859609 -3699960 -3688638 -3744575 -3781583 -3636887 -3394014 -3307173 -3300087 -3364238
16154c364238k7017k68096j73333K21547n131J6623L821p6911J01810k2448K85
$$ -3364238 -3391255 -3659351 -3832684 -3611137 -3616268 -3599645 -3595824 -3672735 -3570925 -3593373 -3593088
16143c593088J19368N6261l1950q20Q5495K3329j9479p7982N895j24852k70045
$$ -3593088 -3473720 -3417459 -3449409 -3450229 -3364734 -3341405 -3360884 -3438866 -3432971 -3557823 -3827868
16132c827868p6624J40355O3965J75347K4016r4509P588Q0659n8593L7087K6774
$$ -3827868 -3904492 -3764137 -3700172 -3524825 -3500809 -3595318 -3587730 -3507071 -3565664 -3528577 -3501803
16121c501803L3476Q3582l9368j5659M7990J17429k03653j207k0346J48004K7434
$$ -3501803 -3468327 -3384745 -3424113 -3439772 -3391782 -3274353 -3478006 -3479213 -3499559 -3351555 -3324121
16110c324121P429k25970j60319j00887k769j02249O5100J65154k07424j2247
$$ -3324121 -3316692 -3542662 -3702981 -3803868 -3806637 -3908886 -3843786 -3678632 -3886056 -3898303
16100c898303j3968J24366J667K1180o6300J8814L2939K15248J62316J46480j24900
$$ -3898303 -3912271 -3787905 -3786238 -3765058 -3831358 -3812544 -3779605 -3564357 -3402041 -3255561 -3380461
16089c380461p9287n9407K1630M5730N7093K4333J3418J57266j4450m9118m0158
$$ -3380461 -3459748 -3519155 -3497525 -3451795 -3394702 -3370369 -3356951 -3199685 -3214135 -3263253 -3303411
16078c303411j32931N1649m71j96148q7200J08612J40267n2802O6266r1864j2462
$$ -3303411 -3436342 -3384693 -3385164 -3581312 -3668512 -3559900 -3419633 -3472435 -3406169 -3498033 -3510495
16067c510495K26855J49686j25346j83667m9740P5941r0929j65395K1400P9771
$$ -3510495 -3283640 -3133954 -3259300 -3442967 -3492707 -3416766 -3507695 -3673090 -3651690 -3571919
16057c571919q1103K03946J50024K5996j92524l5268R8825q421M8296J63796k0037
$$ -3571919 -3653022 -3449076 -3299052 -3273056 -3465580 -3500848 -3402023 -3410444 -3362148 -3198352 -3218389
16046c218389j61891j16300j43896K6402M5748J77652q937O7548L7290j92168
$$ -3218389 -3380280 -3496580 -3640476 -3614074 -3568326 -3390674 -3399611 -3332063 -3294773 -3486941
16036c486941J03770J26302o4544K23871J24283j48649j17582j70463k77151j9629
$$ -3486941 -3383171 -3256869 -3321413 -3097542 -2973259 -3121908 -3239490 -3409953 -3687104 -3706733
16026c706733J25461J51397l6994J6750O8756J28750J2322j21678j37195J1380
$$ -3706733 -3581272 -3429875 -3466869 -3450119 -3381363 -3252613 -3240291 -3361969 -3499164 -3487784
16016c487784J94309r127M5657L2417k14932J874L5119M5533N0246J42729o9814
$$ -3487784 -3293475 -3302602 -3256945 -3224528 -3439460 -3437586 -3402467 -3356934 -3306688 -3163959 -3233773
16005c233773q0879j81750j07379K60682N0438n3450k0128r069k8329k3524R5230
$$ -3233773 -3314652 -3496402 -3603781 -3343099 -3292661 -3346111 -3366239 -3375308 -3403637 -3427161 -3331931
15994c331931l0533q5579J1263J07477K4327l3288r496R5702l5708l3806j64306
$$ -3331931 -3362464 -3448043 -3436780 -3329303 -3304976 -3338264 -3347760 -3252058 -3287766 -3321572 -3485878
15983c485878n7383M1048O7627Q4793J01630j12194o8222N7032k9527J15631Q4867
$$ -3485878 -3543261 -3502213 -3434586 -3349793 -3248163 -3360357 -3428579 -3371547 -3401074 -3285443 -3200576
15972c200576p2992l2796l1644J8818J0868j28529m36k6079q1049J44874K032
$$ -3200576 -3273568 -3306364 -3338008 -3319190 -3308322 -3436851 -3437287 -3463366 -3544415 -3399541 -3397509
15961c397509J4824O5675r4325J3766j1678l2635R7244R2202O570j08942j15772
$$ -3397509 -3382685 -3317010 -3411335 -3397569 -3409247 -3441882 -3344638 -3252436 -3245866 -3354808 -3470580
15950c470580j05131j94642J9848J17433J65641p705N6361m8079Q8472l0446J18920
$$ -3470580 -3575711 -3770353 -3750505 -3633072 -3467431 -3475136 -3418775 -3466854 -3378382 -3408828 -3289908
15939c289908p8779r2253J90785L088M5699J75565P8664O726j34972p3933r5758
$$ -3289908 -3368687 -3460940 -3270155 -3267067 -3221368 -3045803 -2967139 -2960413 -3095385 -3169318 -3265076
15928c265076l2710m210J2200O3579j97045r8843J73946J91921m2669r6216l1636
$$ -3265076 -3297786 -3301996 -3289796 -3226217 -3423262 -3522105 -3348159 -3156238 -3198907 -3295123 -3326759
15917c326759J05366j69717l553n2227Q988j42325K07838J46576o1865Q230J24996
$$ -3326759 -3221393 -3391110 -3394663 -3446890 -3437902 -3580227 -3372389 -3225813 -3287678 -3279448 -3154452
15906c154452j76758j31157k9653Q3082k0484l2675N4839j9032o8991r8494l5412
$$ -3154452 -3331210 -3462367 -3492020 -3408938 -3429422 -3462097 -3407258 -3426290 -3495281 -3593775 -3629187
15895c629187l270K07303J21303M1259q51l5888K3547j08361j23195J54648J46917
$$ -3629187 -3632457 -3425154 -3303851 -3262592 -3263443 -3299331 -3275784 -3384145 -3507340 -3352692 -3205775
15884c205775p3347n8447Q7536M4203j03463K2421Q8809O312K0239L0971K9722
$$ -3205775 -3279122 -3337569 -3250033 -3205830 -3309293 -3286872 -3198063 -3191751 -3171512 -3140541 -3110819
15873c110819k72033J08863J21767J15796q6372m323M6342k77500j27818K8489
$$ -3110819 -3382852 -3273989 -3152222 -3036426 -3122798 -3127121 -3080779 -3358279 -3486097 -3457608
15863c457608L1760J9111L2109p4448j1R3559L900J03211J35421J9086l9953J1315
$$ -3457608 -3425848 -3406737 -3374628 -3449076 -3449087 -3355528 -3351628 -3248417 -3112996 -3093910 -3133863 -3122548
15851c122548n1419N1714J5488j49391P9442r3292k5141j05532L203j9276n1978
$$ -3122548 -3173967 -3122253 -3106765 -3256156 -3176714 -3270006 -3295147 -3400679 -3397476 -3416752 -3468730
15840c468730O3642R7404p0599m877m8241P2780L1276j35589m3780L13641j8937
$$ -3468730 -3405088 -3307684 -3378283 -3383160 -3431401 -3358621 -3327345 -3462934 -3506714 -3193073 -3212010
15829c212010R3484Q5959m2039j32922j91509j65814J41821L26669k425k12375
$$ -3212010 -3118526 -3032567 -3074606 -3207528 -3399037 -3564851 -3423030 -3096361 -3098786 -3311161
15819c311161o5641O4516p6919j0487K2023J1368J56791O033p5282j35799K399
$$ -3311161 -3376802 -3312286 -3389205 -3399692 -3377669 -3366301 -3209510 -3203477 -3278759 -3414558 -3412159
15808c412159r3532m5448R5489K17542K29218O8509Q263k3404j40739j79976J7485
$$ -3412159 -3505691 -3551139 -3455650 -3238108 -3008890 -2940381 -2932118 -2955522 -3096261 -3276237 -3258752
15797c258752J157o2726j01753j31904R9161Q8665k337J8053l8434J13428J65693
$$ -3258752 -3257595 -3320321 -3422074 -3553978 -3454817 -3366152 -3368489 -3350436 -3388870 -3275442 -3109749
15786c109749r4755o9320K9915Q4132P0834k689J41473j13240m4360N1181k989
$$ -3109749 -3204504 -3273824 -3243909 -3159777 -3088943 -3091632 -2950159 -3063399 -3107759 -3056578 -3059567
15775c059567j67820j66410N373K8102K15178J95707J16272j1442n4006j37792
$$ -3059567 -3227387 -3393797 -3388424 -3360322 -3145144 -2949437 -2833165 -2844607 -2898613 -3036405
15765c036405j22477q6364J05715J02818o9266O1554p6668j84219j6568K36225
$$ -3036405 -3158882 -3245246 -3139531 -3036713 -3105979 -3044425 -3121093 -3305312 -3321880 -3085655
15755c085655K06662j72723l6693N5624J792q5034o8871L5029j95706l8599Q9569
$$ -3085655 -2878993 -3051716 -3088409 -3032785 -3030993 -3116027 -3184898 -3149869 -3345575 -3384174 -3294605
15744c294605J12367j13229j28016K3801J79216L4135J5495m0352K2068q9911
$$ -3294605 -3182238 -3295467 -3423483 -3399682 -3220466 -3186331 -3170836 -3211188 -3189120 -3279031
15734c279031P4590K9236m0706o4212J50175P1095L1970j00532l2452n4262l6129
$$ -3279031 -3204441 -3175205 -3215911 -3280123 -3129948 -3058853 -3026883 -3127415 -3159867 -3214129 -3250258
15723c250258R6965N4940N8675j75100n0998P9841J93676r541m5499k8948p3773
$$ -3250258 -3153293 -3098353 -3039678 -3214778 -3265776 -3185935 -2992259 -3001800 -3047299 -3076247 -3150020
15712c150020J8087P8238j05262J70238K346R207p8659q4429J06241J37739J05432
$$ -3150020 -3131933 -3053695 -3158957 -2988719 -2986373 -2977166 -3055825 -3140254 -3034013 -2896274 -2790842
15701b790842k8696j939M5040j31620j95934k45239j44078K68816P2304L9906
$$ -2790842 -2819538 -2821477 -2776437 -2908057 -3103991 -3349230 -3493308 -3224492 -3152188 -3112282
15691c112282J25023j61045j11826J42243O4729L1148o6988M1892r6941K24563
$$ -3112282 -2987259 -3148304 -3260130 -3117887 -3053158 -3022010 -3088998 -3047106 -3144047 -2919484
15681b919484M428j67076o8670p1242Q9527j02431J22295o7278L0015p7981M1676
$$ -2919484 -2915056 -3082132 -3150802 -3222044 -3132517 -3234948 -3112653 -3179931 -3149916 -3227897 -3186221
15670c186221J16319o1297o168j10682l7675K1039N0896L0122J9162J26103J39238
$$ -3186221 -3069902 -3131199 -3137367 -3248049 -3285724 -3264685 -3213789 -3183667 -3164505 -3038402 -2899164
15659b899164N9559m7085k8923m6350p55J55496k14627R3306J99750m1464j11019
$$ -2899164 -2839605 -2886690 -2915613 -2961963 -2962718 -2807222 -3021849 -2928543 -2728793 -2770257 -2881276
15648b881276j97412J333L0784P4487Q0392o8953q6006P941N7319J35771N1418
$$ -2881276 -3078688 -3077355 -3046571 -2972084 -2891692 -2960645 -3046651 -3038710 -2981391 -2845620 -2794202
15637b794202m9548j62277j46703j98556O0378K56639q8388j30932N6822j67693
$$ -2794202 -2843750 -3006027 -3152730 -3351286 -3290908 -3034269 -3122657 -3253589 -3196767 -3364460
15627c364460M7612k1074J54071J94097j68983P3233J88579k8279n5474J8463
$$ -3364460 -3316848 -3337922 -3183851 -2989754 -3158737 -3085504 -2896925 -2925204 -2980678 -2962215
15617b962215j9646J48568j7840j47385j54974J36874n2611o6239K16556K6056
$$ -2962215 -2981861 -2833293 -2851133 -2998518 -3153492 -3016618 -3069229 -3135468 -2918912 -2892856
15607b892856q3040j30874J45603Q3072j7757R7786l6036Q5428J07681j40883
$$ -2892856 -2975896 -3106770 -2961167 -2878095 -2895852 -2798066 -2834102 -2748674 -2640993 -2781876
15597b781876k1968j0646Q8470k21570r0853k38950j24322M5040J76028J23447
$$ -2781876 -2803844 -2814490 -2726020 -2947590 -3038443 -3277393 -3401715 -3356675 -3180647 -3057200
15587c057200p9945k8246J9095P0999n3562k9600j26251n1202K14520N2754N2252
$$ -3057200 -3137145 -3165391 -3146296 -3075297 -3128859 -3158459 -3284710 -3335912 -3121392 -3068638 -3016386
15576c016386l9150L0233K7584L4250L0681q3340L8372J23141J64828L2555o9336
$$ -3016386 -3055536 -3025303 -2997719 -2963469 -2932788 -3016128 -2977756 -2854615 -2689787 -2657232 -2726568
15565b726568K0434j15226L8347J43333l499j16522N9459J07457o137k20798p3829
$$ -2726568 -2706134 -2821360 -2783013 -2639680 -2643179 -2759701 -2700242 -2592785 -2598922 -2819720 -2893549
15554b893549p9686K2485O6062j12925N98J0787p1391o2894J86910O4834o118
$$ -2893549 -2973235 -2950750 -2884688 -2997613 -2997015 -2986228 -3057619 -3120513 -2933603 -2868769 -2874887
15543b874887Q7688J42330r7703m3176j20885j00744J7469P9105k1132j34516
$$ -2874887 -2787199 -2644869 -2742572 -2785748 -2906633 -3007377 -2989908 -2910803 -2931935 -3066451
15533c066451R0002K464j5336K10720R9063k36845j00618O1678L7858j29986L5078
$$ -3066451 -2976449 -2973985 -2989321 -2778601 -2679538 -2916383 -3017001 -2955323 -2917465 -3047451 -3012373
15522c012373J79913J9423n9004j41112l3435j02416j1854J07826J69570J42913
$$ -3012373 -2832460 -2813037 -2872041 -3013153 -3046588 -3149004 -3160858 -3053032 -2883462 -2740549
15512b740549m8370k09584j38997J11104J13389p0006k5272M3648k4730j0448
$$ -2740549 -2788919 -2998503 -3137500 -3026396 -2913007 -2983013 -3008285 -2964637 -2989367 -2999815
15502b999815k4420l2837J50987J358N9518j4864M7496m8043q6758J50080J62830
$$ -2999815 -3024235 -3057072 -2906085 -2904727 -2845209 -2860073 -2812577 -2860620 -2947378 -2797298 -2634468
15491b634468k7347O8299q2223L7467k6463o4808k36439q6529o0658k87J95308
$$ -2634468 -2661815 -2593516 -2675739 -2638272 -2664735 -2729543 -2965982 -3052511 -3113169 -3113456 -2918148
15480b918148O8465j58241o3557k8894J44260J24883n0855J17590N6005j19959
$$ -2918148 -2849683 -3007924 -3071481 -3100375 -2956115 -2831232 -2882087 -2764497 -2708492 -2828451
15470b828451J98136j46987k79091P689L30900K0088r0887o8172n4519r4811M5803
$$ -2828451 -2630315 -2777302 -3056393 -3048704 -2717804 -2697716 -2788603 -2856775 -2911294 -3006105 -2960302
15459b960302R1619M610p6202j29931N9356J16835Q45m8103J4918k2441J34502
$$ -2960302 -2868683 -2864073 -2940275 -3070206 -3010850 -2894015 -2893170 -2941273 -2926355 -2948796 -2814294
15448b814294M5847q5165k4628P5716O1965K8441o0217j55131J24002k701K0052
$$ -2814294 -2768447 -2853612 -2878240 -2802524 -2740559 -2712118 -2772335 -2927466 -2803464 -2806165 -2786113
15437b786113L5045j1394K01791J72963j07189l2702j12844k41107k5059J4795
$$ -2786113 -2751068 -2762462 -2560671 -2387708 -2494897 -2527599 -2640443 -2881550 -2906609 -2891814
15427b891814l5325l4530M7146N4549L4450P2192q0827j29420L5692J46037J80837
$$ -2891814 -2927139 -2961669 -2914523 -2859974 -2825524 -2753332 -2834159 -2963579 -2927887 -2781850 -2601013
15416b601013j6406o4392l25702Q1941J59000l5375j75804k3446j222K86092K38595
$$ -2601013 -2617419 -2681811 -3007513 -2925572 -2766572 -2801947 -2977751 -3001197 -3002419 -2716327 -2477732
15405b477732j66015q7688J21364K75724n5469k62759k40898p0987J14104l8055
$$ -2477732 -2643747 -2731435 -2610071 -2334347 -2389816 -2652575 -2893473 -2964460 -2850356 -2888411
15395b888411O9549J43133l0422L9430J8540k4311j54892j22959j8677j70662
$$ -2888411 -2818862 -2675729 -2706151 -2666721 -2648181 -2672492 -2827384 -2950343 -2969020 -3139682
15385c139682O7528l3594O7793K16521M3585j18309N7856P4929K7282J16500N6852
$$ -3139682 -3072154 -3105748 -3037955 -2821434 -2777849 -2896158 -2838302 -2763373 -2736091 -2619591 -2562739
15374b562739j33575j39973q0983L0521K5769j12954K37281J71991R612j27069
$$ -2562739 -2696314 -2836287 -2917270 -2886749 -2860980 -2973934 -2736653 -2564662 -2555050 -2682119
15364b682119J17868J47426Q3103j46246k03986k97577r7361m5644j31241L3661
$$ -2682119 -2564251 -2416825 -2333722 -2479968 -2683954 -2981531 -3078892 -3124536 -3255777 -3222116
15354c222116Q0883K78750J36948o4017J84614l005R5468L3501k28957j88269
$$ -3222116 -3141233 -2862483 -2725535 -2789552 -2604938 -2607943 -2512475 -2478974 -2707931 -2896200
15344b896200Q5426J17213J83536J79822k67651l2422M564O3629k4786L7194j1209
$$ -2896200 -2810774 -2693561 -2510025 -2330203 -2597854 -2630276 -2625712 -2562083 -2586869 -2549675 -2560884
15333b560884m0771L4846l9698L0949J9110j61741q0871J43546K21678K7476M0386
$$ -2560884 -2601655 -2566809 -2606507 -2575558 -2556448 -2718189 -2799060 -2655514 -2433836 -2406360 -2365974
15322b365974j26664l03611j34485J31251Q0028K3186Q5573K08188O4415j21595
$$ -2365974 -2492638 -2796249 -2930734 -2799483 -2719455 -2696269 -2610696 -2402508 -2338093 -2459688
15312b459688j83167k5582M4777J30754N0905q6036J9839J1359k5723n5823k0482
$$ -2459688 -2642855 -2668437 -2623660 -2492906 -2442001 -2528037 -2508198 -2496839 -2522562 -2578385 -2598867
15301b598867r8459j40517m7062J21370O2426o9486j08894J9326m2085J64815
$$ -2598867 -2697326 -2837843 -2884905 -2763535 -2701109 -2770595 -2879489 -2860163 -2902248 -2737433
15291b737433M193j43844j56579K16183J51350k0409J01805J03267p3313P1627
$$ -2737433 -2733240 -2877084 -3033663 -2817480 -2666130 -2686539 -2584734 -2481467 -2554780 -2483153
15281b483153J11417K9259m1554o4852K7327o6527n8163n5027l3917J5332J8022
$$ -2483153 -2371736 -2342477 -2384031 -2448883 -2421556 -2488083 -2546246 -2601273 -2635190 -2619858 -2601836
15270b601836M709O3978J8340l54971k543J68150Q7928n8213M6813J08417j72504
$$ -2601836 -2597127 -2533149 -2514809 -2869780 -2872323 -2704173 -2616245 -2674458 -2627645 -2519228 -2691732
15259b691732K2544J93938K03736j71111k77407m1938K4973R2427R523p590l9667
$$ -2691732 -2669188 -2475250 -2271514 -2442625 -2720032 -2761970 -2736997 -2644570 -2635047 -2642637 -2682304
15248b682304K6902P8993N3184O3976k04822k6841o3465j59141K0425P3752J26760
$$ -2682304 -2655402 -2576409 -2523225 -2459249 -2664071 -2690912 -2754377 -2913518 -2893093 -2819341 -2692581
15237b692581J09567o8783j92230o8437Q1496J88280J57121l97J09329O5792Q4472
$$ -2692581 -2583014 -2651797 -2844027 -2912464 -2830968 -2642688 -2485567 -2485964 -2376635 -2310843 -2226371
15226b226371N9016r0131m05016j24603M8155J19508J70545N2078j17455m0195
$$ -2226371 -2167355 -2257486 -2662502 -2787105 -2738950 -2619442 -2448897 -2396819 -2514274 -2554469
15216b554469n2909k5760R573j10012J24534J43644q6308p2405n5404p6542K1379
$$ -2554469 -2607378 -2633138 -2623565 -2733577 -2609043 -2465399 -2551707 -2624112 -2679516 -2756058 -2734679
15205b734679o9126M6722J96456M9716k1967j17080J3578l2129o1100o4567N6765
$$ -2734679 -2803805 -2757083 -2560627 -2510911 -2532878 -2649958 -2636380 -2668509 -2729609 -2794176 -2737411
15194b737411o5746k31020J78749K48840K64696J11820o2525j42931j19650J07333
$$ -2737411 -2803157 -3034177 -2855428 -2606588 -2341892 -2230072 -2292597 -2435528 -2555178 -2447845
15184b447845N4385o8549k4018p8711k7076j15468j15703l3592L3619J02616Q1495
$$ -2447845 -2393460 -2462009 -2486027 -2564738 -2591814 -2707282 -2822985 -2856577 -2822958 -2720342 -2638847
15173b638847R9942p5123q8479N8585j19172j39171m1220j9296J70941J86728
$$ -2638847 -2538905 -2614028 -2702507 -2643922 -2763094 -2902265 -2943485 -2962781 -2791840 -2605112
15163b605112j46661j43373J89442L13504N7517O4137j73869j65551K16753L947
$$ -2605112 -2751773 -2895146 -2705704 -2392200 -2334683 -2270546 -2444415 -2609966 -2393213 -2389266
15153b389266q7300j33234r0857M0299J5735K22071j2615m5107K7876j6028R697
$$ -2389266 -2476566 -2609800 -2700657 -2660358 -2644623 -2422552 -2435167 -2480274 -2452398 -2468426 -2458729
15142b458729o5865r7897l1193J00391K62937j14021k1539J6127o7568J6919l2112
$$ -2458729 -2524594 -2622491 -2653684 -2553293 -2290356 -2404377 -2425916 -2409789 -2477357 -2460438 -2492550
15131b492550q4500K0676J32200j44101p7688J43884m7157L3877J25131L9994
$$ -2492550 -2577050 -2556374 -2424174 -2568275 -2645963 -2502079 -2549236 -2515359 -2390228 -2350234
15121b350234j06834P4112J7698L690j8079r2189l9377j10451j10876Q1171J53940
$$ -2350234 -2457068 -2382956 -2365258 -2361568 -2379647 -2471836 -2511213 -2621664 -2732540 -2651369 -2497429
15110b497429j00274o4145o9337N9676p751J4516l9060k5968m9754o2956k5506
$$ -2497429 -2597703 -2661848 -2731185 -2671509 -2679260 -2664744 -2703804 -2729772 -2779526 -2842482 -2867988
15099b867988j98210J27934P9928M8369L32514J18781P2291j01987o9125J5909
$$ -2867988 -3066198 -2938264 -2858336 -2809967 -2477453 -2358672 -2286381 -2388368 -2457493 -2441584
15089b441584p9690P4555J86712j4332j04165J30867j04718k99096j77114j15467
$$ -2441584 -2521274 -2446719 -2260007 -2274339 -2378504 -2247637 -2352355 -2651451 -2828565 -2944032
15079b944032J68632J20240J03526j00246j09959L1502J07316O5972k9645o805
$$ -2944032 -2775400 -2655160 -2551634 -2651880 -2761839 -2730337 -2623021 -2557049 -2586694 -2593499
15069b593499m7078k3187j43923k335Q9942Q7689q3587n1660L3280J20870Q0304
$$ -2593499 -2640577 -2663764 -2807687 -2810022 -2720080 -2632391 -2715978 -2767638 -2734358 -2613488 -2533184
15058b533184o462j20803N7725L13896K4409j49253l58860j15481L0308K77023
$$ -2533184 -2539646 -2660449 -2602724 -2288828 -2264419 -2413672 -2772532 -2888013 -2857705 -2580682
15048b580682J69037O5248j75424k06908j41079M8169K11438J68532n4343N7277
$$ -2580682 -2411645 -2346397 -2521821 -2728729 -2869808 -2821639 -2610201 -2441669 -2496012 -2438735
15038b438735J56419j7731L6376m1851O2272J18788r5173j52517m1713j6486m6032
$$ -2438735 -2282316 -2300047 -2263671 -2305522 -2243250 -2124462 -2219635 -2372152 -2413865 -2430351 -2476383
15027b476383Q2278K1154j64164o7678l6565j51356M7429J88033Q409m2495j46563
$$ -2476383 -2394105 -2372951 -2537115 -2604793 -2641358 -2792714 -2745285 -2557252 -2548843 -2591338 -2737901
15016b737901J49932K3437m9673J33327J9795J87826J23751K9360k7724j59173
$$ -2737901 -2587969 -2564532 -2614205 -2480878 -2461083 -2273257 -2149506 -2120146 -2147870 -2307043
15006b307043J8383n0607m9103q2487j06171m1111J90449J86969j54224j23300
$$ -2307043 -2288660 -2339267 -2388370 -2470857 -2577028 -2618139 -2427690 -2240721 -2394945 -2518245
14996b518245j54594j20489K9936J27281O0826N7580K2672k4389l9404L41492
$$ -2518245 -2672839 -2793328 -2763392 -2636111 -2575285 -2517705 -2495033 -2519422 -2558826 -2217334
14986b217334O0477r9058k67402k4929m677p3746J9885J22362O985O0752n4725
$$ -2217334 -2156857 -2255915 -2523317 -2548246 -2552923 -2626669 -2606784 -2484422 -2477437 -2416685 -2471410
14975b471410j14949k20336j18923k5148J5460M9000P1267M965J56288J90178
$$ -2471410 -2586359 -2806695 -2925618 -2950766 -2935306 -2886306 -2815039 -2810074 -2653786 -2463608
14965b463608j4579j62942k05612j71602L3446J80639r4686L5525Q7065L8681
$$ -2463608 -2478187 -2641129 -2846741 -3018343 -2984897 -2804258 -2898944 -2863419 -2776354 -2737673
14955b737673k80J20600J0308m3529R4639O5700K992J03224K7918J7029o5947
$$ -2737673 -2737953 -2617353 -2607045 -2650574 -2555935 -2490235 -2487243 -2384019 -2356101 -2339072 -2405019
14944b405019j42593J39476M0776l9886q2652l7918r4323P8664K29192J14689
$$ -2405019 -2547612 -2408136 -2367360 -2407246 -2489898 -2527816 -2622139 -2543475 -2314283 -2199594
14934b199594O4465n974k07693j43573K27612J80376j19324k47626M7092L5979
$$ -2199594 -2135129 -2141103 -2348796 -2492369 -2264757 -2084381 -2203705 -2451331 -2404239 -2368260
14924b368260J27099j93864k81114k0763L30562J8899m9451J7445O3814J02975
$$ -2368260 -2241161 -2435025 -2716139 -2736902 -2406340 -2387441 -2436892 -2419447 -2355633 -2252658
14914b252658r5234j65820Q7264Q9182N3951p7389n4935L647L5215k5973k1935
$$ -2252658 -2347892 -2513712 -2426448 -2337266 -2283315 -2360704 -2415639 -2411992 -2376777 -2402750 -2424685
14903b424685j96196l6906Q6092Q1195N9878j1746J6493R7617O3699q5933j48957
$$ -2424685 -2620881 -2657787 -2571695 -2490500 -2430622 -2442368 -2425875 -2328258 -2264559 -2350492 -2499449
14892b499449J70495K3930j65494N0873o1691M5888M0091Q2231q3818j26338J65531
$$ -2499449 -2328954 -2305024 -2470518 -2419645 -2481336 -2435448 -2395357 -2313126 -2396944 -2523282 -2357751
14881b357751K47910p9618K9323J45004M5448j2291k54803l08226p7223J46383
$$ -2357751 -2109841 -2189459 -2160136 -2015132 -1969684 -1981975 -2236778 -2545004 -2622227 -2475844
14871b475844K86385R6359j4921J04892q3582j32381q5333n5080j6400j156j76776
$$ -2475844 -2189459 -2093100 -2108021 -2003129 -2086711 -2219092 -2304425 -2359505 -2375905 -2377061 -2553837
14860b553837j20067k4322J93599K03728r5873M5641j8134k6393Q5j1456J07628
$$ -2553837 -2673904 -2698226 -2504627 -2300899 -2396772 -2351131 -2369265 -2395658 -2395573 -2407029 -2299401
14849b299401K0547p5362J08051J810L3310L3123k37095r7513R7968J12614p438
$$ -2299401 -2278854 -2354216 -2246165 -2244355 -2211045 -2177922 -2415017 -2512530 -2414562 -2301948 -2309386
14838b309386j87722j56885r6109l6995J85930J94433p9124K6549n2317M613L8817
$$ -2309386 -2497108 -2653993 -2750102 -2787097 -2601167 -2406734 -2485858 -2459309 -2511626 -2507013 -2468196
14827b468196n7141R5131J41701J57951J15659k13922k70697j68079P4326L7083
$$ -2468196 -2525337 -2430206 -2288505 -2130554 -2014895 -2228817 -2499514 -2667593 -2593267 -2556184
14817b556184J11298P1772j579m8467j39492O7315M6204m0797Q563M5881R6959
$$ -2556184 -2444886 -2373114 -2374693 -2423160 -2562652 -2495337 -2449133 -2489930 -2481367 -2435486 -2338527
14806b338527l8160j29094j26097J51570M8340k4921N554J54025l4740n6061j39653
$$ -2338527 -2376687 -2505781 -2631878 -2480308 -2431968 -2456889 -2451335 -2297310 -2332050 -2388111 -2527764
14795b527764R0236m851j05797L0811K56468J97410n0401k98263k66214J9617
$$ -2527764 -2437528 -2442379 -2548176 -2517365 -2260897 -2063487 -2113888 -2412151 -2678365 -2658748
14785b658748K28739J44914R6475M2389O1337K22327r2455r2762J31542j08272
$$ -2658748 -2430009 -2285095 -2188620 -2146231 -2084894 -1862567 -1955022 -2047784 -1916242 -2024514
14775b024514k09761J06381J17011j24329j23432k0080P8331n2719r2588k91662
$$ -2024514 -2234275 -2127894 -2010883 -2135212 -2258644 -2278724 -2200393 -2253112 -2345700 -2637362
14765b637362N936R7653R1455J71813J39334L5036l1128M9573J50008j21871j49946
$$ -2637362 -2631426 -2533773 -2442318 -2270505 -2131171 -2096135 -2127263 -2077690 -1927682 -2049553 -2199499
14754b199499l25334k7424J37960O5540j35604J60748P9379Q3709J5596j61792
$$ -2199499 -2524833 -2552257 -2414297 -2348757 -2484361 -2323613 -2244234 -2160525 -2144929 -2306721
14744b306721j08130N3964J50170J4297m6005o0751J51369J70576j04685j03672
$$ -2306721 -2414851 -2360887 -2210717 -2196420 -2242425 -2303176 -2151807 -1981231 -2085916 -2189588
14734b189588O6862j0282j68702L431O7764Q3103J608p8075q6642o7766L1868
$$ -2189588 -2122726 -2133008 -2301710 -2298279 -2230515 -2147412 -2145804 -2223879 -2310521 -2378287 -2346419
14723b346419n5889o9015J3422M3554R2522J37322q0230o2918K9990O3083P5930
$$ -2346419 -2402308 -2471323 -2457901 -2414347 -2321825 -2184503 -2264733 -2327651 -2297661 -2234578 -2158648
14712b158648j17186j0832R4485j0942j66992j68894m0965J72590K87373L5872
$$ -2158648 -2275834 -2286666 -2192181 -2203123 -2370115 -2539009 -2579974 -2407384 -2120011 -2084139
14702b084139j15608m9639J2400O9357r3500j84569R035N3714j011M1988j5099
$$ -2084139 -2199747 -2249386 -2236986 -2167629 -2261129 -2445698 -2436663 -2382949 -2383960 -2341972 -2357071
14691b357071p4059k2417N6805Q3257J27447j08671j50266j51137J68218J19673
$$ -2357071 -2431130 -2453547 -2396742 -2313485 -2186038 -2294709 -2444975 -2596112 -2427894 -2308221
14681b308221J61109j2862K9691r5232J1080J84838R4736K8984j19726j62031
$$ -2308221 -2147112 -2159974 -2130283 -2225515 -2214435 -2029597 -1934861 -1905877 -2025603 -2187634
14671b187634l5658O629O4733J48218o9177J0604J53810q8260j03155p0312j7326
$$ -2187634 -2223292 -2216663 -2151930 -2003712 -2072889 -2062285 -1908475 -1996735 -2099890 -2170202 -2187528
14660b187528J39630n8360k04936q7722o1392M263K4706j28188p8679J86785R4534
$$ -2187528 -2047898 -2106258 -2311194 -2398916 -2460308 -2456045 -2431339 -2559527 -2638206 -2451421 -2356887
14649b356887J1466P5224J2779Q177j7797M7474l9856M4044j75694J25408J40054
$$ -2356887 -2345421 -2270197 -2257418 -2249241 -2267038 -2219564 -2259420 -2215376 -2391070 -2265662 -2125608
14638b125608J44833j31366l38474j45020K2708R3342R0812J58262K13978K1295
$$ -2125608 -1980775 -2112141 -2450615 -2595635 -2572927 -2479585 -2388773 -2230511 -2016533 -1995238
14628a995238p3545r8477j07763j87466J58989J44807K17228q0270n0789m5558
$$ -1995238 -2068783 -2167260 -2275023 -2462489 -2303500 -2158693 -1941465 -2021735 -2072524 -2118082
14618b118082k19760J4012O1044j9098q443J30716J0240O1254Q3581K2689r8030
$$ -2118082 -2337842 -2323830 -2262786 -2281884 -2290327 -2159611 -2149371 -2088117 -2004536 -1981847 -2079877
14607b079877k43467j10663p9436K4653O8444q6296o3729J21484k2401J05975
$$ -2079877 -2323344 -2434007 -2513443 -2488790 -2420346 -2506642 -2570371 -2448887 -2471288 -2365313
14597b365313N9193j50134l8290Q7244K71229J20605r1915k08684j44642Q5356
$$ -2365313 -2306120 -2456254 -2494544 -2407300 -2136071 -2015466 -2107381 -2316065 -2460707 -2375351
14587b375351K24897j17635j73501j4075n9490k16443J68102K61355O031L0968
$$ -2375351 -2150454 -2268089 -2441590 -2455665 -2515155 -2731598 -2563496 -2302141 -2296110 -2265142
14577b265142m5743L4096o6093r720J0358k4791J07931j18655j11904K26603K31724
$$ -2265142 -2310885 -2276789 -2342882 -2352602 -2342244 -2367035 -2259104 -2377759 -2489663 -2263060 -2031336
14566b031336M97L8893k36071j17392R5009o962N0379o4642l2322r6593o3397
$$ -2031336 -2030839 -1991946 -2228017 -2345409 -2250400 -2257362 -2206983 -2271625 -2303947 -2400540 -2463937
14555b463937J45810J79381M5680r2077j51036p9198Q9276J07167O7509M4810
$$ -2463937 -2318127 -2138746 -2093066 -2185143 -2336179 -2415377 -2326101 -2218934 -2151425 -2106615
14545b106615K192o0648n1067L4045j04906N3318M8084j70287k16738J7273R6635
$$ -2106615 -2104423 -2165071 -2216138 -2182093 -2286999 -2233681 -2185597 -2355884 -2572622 -2555349 -2458714
14534b458714k1657j709M8674j26895k2393J51998J41770M8506J20244q073o5163
$$ -2458714 -2480371 -2482080 -2433406 -2560301 -2582694 -2430696 -2288926 -2240420 -2120176 -2128249 -2193412
14523b193412l7219n8134n1276K1455M8724L8027r1960M9060J88319r5622k16267
$$ -2193412 -2230631 -2288765 -2340041 -2318586 -2269862 -2231835 -2323795 -2274735 -2086416 -2182038 -2398305
14512b398305l3052o8832j23479J05845K92202J61822j9760R431p1171j60847
$$ -2398305 -2431357 -2500189 -2623668 -2517823 -2225621 -2063799 -2083559 -2074128 -2145299 -2306146
14502b306146o0277j00505R4367J23301k7920J38113J32919L6598J03822k494
$$ -2306146 -2366423 -2466928 -2372561 -2249260 -2277180 -2139067 -2006148 -1969550 -1865728 -1868222
14492a868222j82254N586R3211p91j17685m0263P7274o7437n4057m8343j25796
$$ -1868222 -2050476 -2044890 -1951679 -1952470 -2070155 -2110418 -2033144 -2100581 -2154638 -2202981 -2328777
14481b328777Q5020J23386j0224Q7789j24242l7149K2865o9649j52919J71369
$$ -2328777 -2243757 -2120371 -2130595 -2042806 -2167048 -2204197 -2181332 -2250981 -2403900 -2232531
14471b232531N9289l2125j15995J1804j46305r1237L30282K2776L9908l3037J00379
$$ -2232531 -2173242 -2205367 -2321362 -2309558 -2455863 -2547100 -2216818 -2194042 -2154134 -2187171 -2086792
14460b086792K29058r0834l05894n0827k3431M2758o0822J9197R4538j40766j79596
$$ -2086792 -1857734 -1948568 -2254462 -2305289 -2328720 -2285962 -2346784 -2327587 -2233049 -2373815 -2553411
14449b553411R7107J51266L2270l8593P9226k0341q6197J79518J85200J33912
$$ -2553411 -2456304 -2305038 -2272768 -2311361 -2232135 -2252476 -2338673 -2159155 -1973955 -1840043
14439a840043n2434o5560l2281N2014j18387O1503r6242j87016j0629N7781K21554
$$ -1840043 -1892477 -1958037 -1990318 -1938304 -2056691 -1995188 -2091430 -2278446 -2289075 -2231294 -2009740
14428b009740J38119j26632j90488P1310N6600K987O439M390q0785P9382o7696
$$ -2009740 -1871621 -1998253 -2188741 -2117431 -2060831 -2057844 -2051405 -2047015 -2127800 -2048418 -2116114
14417b116114J42417K0407m4895l8049O6669K5958K3251J02437L6685j5091L3384
$$ -2116114 -1973697 -1953290 -1998185 -2036234 -1969565 -1943607 -1920356 -1817919 -1781234 -1796325 -1762941
14406a762941n6917o4643j10553k07484k42746r1960L3233P7413J27318o7589
$$ -1762941 -1819858 -1884501 -1995054 -2202538 -2445284 -2537244 -2504011 -2426598 -2299280 -2366869
14396b366869P2365O7065m5319O0276J3387J7924R1160o8025K2366l7107j7033
$$ -2366869 -2294504 -2227439 -2272758 -2212482 -2199095 -2181171 -2090011 -2158036 -2135670 -2172777 -2189810
14385b189810j15614L7609j02024L7296J0105J79458L11999j52753k98206r1553
$$ -2189810 -2305424 -2267815 -2369839 -2332543 -2322438 -2142980 -1830981 -1983734 -2281940 -2373493
14375b373493R6876J19024R405p751j85795J59145P871k3349L1974r9470k5686
$$ -2373493 -2276617 -2157593 -2148188 -2155939 -2341734 -2182589 -2174718 -2198067 -2166093 -2265563 -2291249
14364b291249j55776R0330M5095K3368j02882J63775K25009Q242n2104k1099m5330
$$ -2291249 -2447025 -2356695 -2311600 -2288232 -2391114 -2227339 -2002330 -1994088 -2046192 -2067291 -2112621
14353b112621R4474J7443l15167j55640J02462Q8210J19246p2753J3026J00649
$$ -2112621 -2018147 -2000704 -2315871 -2471511 -2369049 -2280839 -2161593 -2234346 -2221320 -2120671
14343b120671n1199m5057M8500J26817q1670j27019P5307J42793j633O964q7267
$$ -2120671 -2171870 -2216927 -2168427 -2041610 -2123280 -2250299 -2174992 -2032199 -2033832 -2026868 -2114135
14332b114135o6710N4968J13839n3305P2953O6288n1255J06133m7676k01901q0657
$$ -2114135 -2180845 -2125877 -2012038 -2065343 -1992390 -1926102 -1977357 -1871224 -1918900 -2120801 -2201458
14321b201458j3557N7288R9518L06300l770j61278J24175J20791j81470q5803
$$ -2201458 -2215015 -2157727 -2058209 -1751909 -1755679 -1916957 -1792782 -1671991 -1853461 -1939264
14311a939264M5693j28329j14039J26027K66708J32209j31196k68453k05584K8686
$$ -1939264 -1893571 -2021900 -2135939 -2009912 -1743204 -1610995 -1742191 -2010644 -2216228 -2187542
14301b187542l8947J4419K24620J67392O1609k23125j45077o8039l6139J58532
$$ -2187542 -2226489 -2212070 -1987450 -1820058 -1758449 -1981574 -2126651 -2194690 -2230829 -2072297
14291b072297q6224k50564k04693K0653K41522J17990p0076J16300K68677m3333
$$ -2072297 -2158521 -2409085 -2613778 -2593125 -2351603 -2233613 -2303689 -2187389 -1918712 -1962045
14281a962045l245M4815o7480j12393l4788J83860N6462L5137K084j1474p7167
$$ -1962045 -1965290 -1920475 -1987955 -2100348 -2135136 -1951276 -1894814 -1859677 -1857593 -1869067 -1946234
14270a946234j19521K6903J6496O1298L118L4910k054k22565k4325K14175J43995
$$ -1946234 -2065755 -2038852 -2022356 -1961058 -1957940 -1923030 -1925084 -2147649 -2171974 -1957799 -1813804
14259a813804Q5297p0206p6322j64659j80573k2102K1894l8382J37624L9731N3382
$$ -1813804 -1728507 -1798713 -1875035 -2039694 -2220267 -2242369 -2220475 -2258857 -2121233 -2081502 -2028120
14248b028120n8395K6574p8243j36511N5721J14706J36585L0821J19901M269j78026
$$ -2028120 -2086515 -2059941 -2138184 -2274695 -2218974 -2104268 -1967683 -1936862 -1816961 -1812692 -1990718
14237a990718j81955N6734J18998J31085J23595L6857J24591J65039n5465l40695
$$ -1990718 -2172673 -2115939 -1996941 -1865856 -1742261 -1705404 -1580813 -1415774 -1471239 -1811934
14227a811934j4342j16562P0956L6206R0427J02497K5405k87644j52263P3235
$$ -1811934 -1826276 -1942838 -1871882 -1835676 -1745249 -1642752 -1617347 -1904991 -2057254 -1984019
14217a984019P6575j9562j2192m9664k11360n6253J89029R772j578J47246K30832
$$ -1984019 -1907444 -1927006 -1939198 -1988862 -2200222 -2256475 -2067446 -2057674 -2059252 -1912006 -1681174
14206a681174J5071q41k10939j05364R354o7979M4837p5136j28085J9632P2433
$$ -1681174 -1666103 -1666944 -1877883 -1983247 -1973893 -2041872 -1997035 -2072171 -2200256 -2180624 -2108191
14195b108191J46429m8278n2678J711j32190j61781j43667J38434J07168l1690
$$ -2108191 -1961762 -2010040 -2062718 -2061007 -2193197 -2354978 -2498645 -2360211 -2253043 -2284733
14185b284733R0932N4538K9897J39688j9263j7710j28975Q8351P7816K7849j43837
$$ -2284733 -2193801 -2139263 -2109366 -1969678 -1988941 -2006651 -2135626 -2047275 -1969459 -1941610 -2085447
14174b085447k2193O187J13235J30909K7819q7584k6489k42787K34985J32273
$$ -2085447 -2107640 -2101453 -1988218 -1857309 -1829490 -1917074 -1943563 -2186350 -1951365 -1819092
14164a819092J03761j30274k01362J3253j4829R1227R4132Q5140j58790k03681
$$ -1819092 -1715331 -1845605 -2046967 -2033714 -2048543 -1957316 -1863184 -1778044 -1936834 -2140515
14154b140515q798M8539q351M096j35789J33206Q7958q9079J14803N4341n8009
$$ -2140515 -2149313 -2100774 -2109125 -2105029 -2240818 -2107612 -2019654 -2108733 -1993930 -1939589 -1997598
14143a997598o9363m868m5091P5099J67893r6688j05647K3074j9501m8358k6568
$$ -1997598 -2066961 -2071829 -2116920 -2041821 -1873928 -1970616 -2076263 -2053189 -2072690 -2121048 -2147616
14132b147616R1960R2933Q6847j05404j31122l8625m1314q4778L3991P7849Q4854
$$ -2147616 -2055656 -1962723 -1875876 -1981280 -2112402 -2151027 -2192341 -2277119 -2243128 -2165279 -2080425
14121b080425J56074Q8176j12778J9156M2485J24326L8667p1249j33168j21908
$$ -2080425 -1924351 -1836175 -1948953 -1929797 -1887312 -1762986 -1724319 -1795568 -1928736 -2050644
14111b050644k9840L6869l7783J6775O7564K62568O7564k16961q9466N1196O2865
$$ -2050644 -2080484 -2043615 -2081398 -2064623 -1997059 -1734491 -1666927 -1883888 -1973354 -1922158 -1859293
14100a859293J25825n122Q1973j49257j90217j4570M0116o7181K2543P5805o2698
$$ -1859293 -1733468 -1738590 -1656617 -1805874 -1996091 -2010661 -1970545 -2037726 -2015183 -1939378 -2002076
14089b002076J0462j01264l0541J2958J60268R3241l673J44023m0059j46255q8029
$$ -2002076 -1991614 -2092878 -2123419 -2110461 -1950193 -1856952 -1860625 -1716602 -1756661 -1902916 -1990945
14078a990945j60884J10609J70899o8059q5117P5007K95989k3670k30701o2129
$$ -1990945 -2151829 -2041220 -1870321 -1938380 -2023497 -1948490 -1652501 -1676171 -1906872 -1969001
14068a969001J76111K20305r9205m9056j21819r3488j62884J17848K1487k13328
$$ -1969001 -1792890 -1572585 -1671790 -1720846 -1842665 -1936153 -2099037 -1981189 -1959702 -2173030
14058b173030j5630K61752J7029j4047J00005l7479j85159j9226K3776K2879k11304
$$ -2173030 -2188660 -1926908 -1909879 -1923926 -1823921 -1861400 -2046559 -2065785 -2042009 -2019130 -2230434
14047b230434m0426O8897J15645P2939o4525N4897k0481q1459k4145Q0535J47170
$$ -2230434 -2270860 -2201963 -2086318 -2013379 -2077904 -2023007 -2043488 -2124947 -2149092 -2068557 -1921387
14036a921387q4226r9783J00801J11194j768J3058j48102o273n0896l2407L5936
$$ -1921387 -2005613 -2105396 -2004595 -1893401 -1895169 -1882111 -2030213 -2036486 -2087382 -2119789 -2083853
14025b083853M8582r5165J43777l6443n1237l1691r713R4195O1780P4957R4806
$$ -2083853 -2035271 -2130436 -1986659 -2023102 -2074339 -2106030 -2115743 -2021548 -1959768 -1884811 -1790005
14014a790005M5041j19748j0131O6357j61513j99926r0295L21889J12907p182
$$ -1790005 -1744964 -1864712 -1874843 -1808486 -1969999 -2169925 -2260220 -1938331 -1825424 -1832606
14004a832606j41276l3295m1058n1902J16540j0828j54941n4996j7692K62384
$$ -1832606 -1973882 -2007177 -2048235 -2100137 -1983597 -1994425 -2149366 -2204362 -2222054 -1959670
13994a959670O1578J297j3367r3841J08086J24996n770Q6470P2621j42660N660
$$ -1959670 -1898092 -1896795 -1910162 -2004003 -1895917 -1770921 -1776691 -1690221 -1617600 -1760260 -1754600
13983a754600J8403K0712j24094k5162k8820Q4841J61533O2379j06283r3069j80123
$$ -1754600 -1736197 -1715485 -1839579 -1864741 -1893561 -1808720 -1647187 -1584808 -1691091 -1784160 -1964283
13972a964283M5841L3085r9777p5701L7354n1251N4829j14316J54229K37781N6649
$$ -1964283 -1918442 -1885357 -1985134 -2060835 -2023481 -2074732 -2019903 -2134219 -1979990 -1742209 -1685560
13961a685560j39666j85832k2275J62956m4127K6336N2316K6840R9287j06255
$$ -1685560 -1825226 -2011058 -2033333 -1870377 -1914504 -1888168 -1835852 -1809012 -1709725 -1815980
13951a815980j14470r1733r4922l6561l7124K05702K69797q5058p6627o2680R6556
$$ -1815980 -1930450 -2022183 -2117105 -2153666 -2190790 -1985088 -1715291 -1800349 -1876976 -1939656 -1843100
13940a843100k2186J21646l2424K5395O4566k6648L162m7263j27519j21356L1741
$$ -1843100 -1865286 -1743640 -1776064 -1750669 -1686103 -1712751 -1709589 -1756852 -1884371 -2005727 -1973986
13929a973986l6011J12243n5311L5933Q4240J19499j9622r6936R1513Q2272j75591
$$ -1973986 -2009997 -1897754 -1953065 -1917132 -1832892 -1713393 -1733015 -1829951 -1738438 -1656166 -1831757
13918a831757p4648k1965O3178r4373J19019P6134j4031j64463j40119L8268J22938
$$ -1831757 -1906405 -1928370 -1865192 -1959565 -1840546 -1764412 -1778443 -1942906 -2083025 -2044757 -1921819
13907a921819J07128j0850Q9958L9617o1097j45076k02209q989J35119n5978l0419
$$ -1921819 -1814691 -1825541 -1735583 -1695966 -1757063 -1902139 -2104348 -2113337 -1978218 -2034196 -2064615
13896b064615J79379J85771p7461j11930J39691p814j74157p3219L9064K0344
$$ -2064615 -1885236 -1699465 -1776926 -1888856 -1749165 -1756979 -1931136 -2004355 -1965291 -1944947
13886a944947n7564J16491n9729R8222J27308m9333j14707k7089L00636J61258
$$ -1944947 -2002511 -1886020 -1945749 -1847527 -1720219 -1769552 -1884259 -1911348 -1610712 -1449454
13876a449454j20454l07534q9102q260l417O2612J42673N0042m2498k5440l7079
$$ -1449454 -1569908 -1877442 -1966544 -1974804 -1978221 -1915609 -1772936 -1722894 -1765392 -1790832 -1827911
13865a827911P0214j24509K9707J21736j32468p8610O3322j70543k46281J58076
$$ -1827911 -1757697 -1882206 -1852499 -1730763 -1863231 -1941841 -1878519 -2049062 -2295343 -2137267
13855b137267J56785n2384Q5789P5398j8769j26J22779O1117k3049j47185r3154
$$ -2137267 -1980482 -2032866 -1947077 -1871679 -1890448 -1890574 -1767795 -1706678 -1729727 -1876912 -1970066
13844a970066R4737n4132k59267J73500l426j57238n0276K8912L6998J28379J37632
$$ -1970066 -1875329 -1929461 -2188728 -2015228 -2018654 -2175892 -2226168 -2197256 -2160258 -2031879 -1894247
13833a894247p6313j35923L872J28606J04956J01114k2237j0094j57480p7150
$$ -1894247 -1970560 -2106483 -2102611 -1974005 -1869049 -1767935 -1790172 -1800266 -1957746 -2034896
13823b034896j01614m3083K9390J08128J17591n6147j82900J8851J58763M4648
$$ -2034896 -2136510 -2179593 -2150203 -2042075 -1924484 -1980631 -2163531 -2144680 -1985917 -1941269
$$ [...]
##END NTUPLES=NMR SPECTRUM
##END=
