##TITLE=Analysis number 317523
Compound Code cc 48704
Book Reference 472/15
Project Code qc-cat
Chemist Name victoriam
##JCAMPDX= 6.0         $$ Bruker NMR JCAMP-DX V2.0
##DATA TYPE= NMR SPECTRUM
##DATA CLASS= NTUPLES
##ORIGIN= Bruker BioSpin GmbH
##OWNER= nmr
$$ XWIN-NMR		Version 3.5
$$ Wed Feb 22 12:22:48 2006 GMT Standard Time (UT+0h)  MAYBRIDGE\nmr@NMR_250MHZ
##.OBSERVE FREQUENCY= 250.131544655141
##.OBSERVE NUCLEUS= ^1H
##.ACQUISITION MODE= SIMULTANEOUS (DQD)
##.ACQUISITION SCHEME= undefined
##.AVERAGES= 16
##.DIGITISER RES= 18
##SPECTROMETER/DATA SYSTEM= dpx250
##.PULSE SEQUENCE= zg30
##.SOLVENT NAME= CDCl3
##.SHIFT REFERENCE= (INTERNAL, CDCl3, 0, 16.522)
##AUDIT TRAIL= $$ (NUMBER, WHEN, WHO, WHERE, WHAT)
$$ ##TITLE= Audit trail, XWIN-NMR		Version 3.5
$$ ##JCAMPDX= 5.01
$$ ##ORIGIN= Bruker BioSpin GmbH
$$ ##OWNER= nmr
$$ C:\u/data/dgb/nmr/ADRS/16660/pdata/1/auditp.txt
$$ ##AUDIT TRAIL=  $$ (NUMBER, WHEN, WHO, WHERE, WHAT)
(   1,<2006-02-22 12:22:12.01 +000>,<MAYBRIDGE\nmr>,<NMR_250MHZ>,
      <created by zg, POWCHK disabled, PULCHK disabled
       configuration hash MD5:
       84 BC 41 DB A1 6E 1D 46 DA 25 12 A5 C1 ED C5 3A
       data hash MD5: 64K
       4D BF 8E 82 95 75 65 43 2F 9F 13 25 DD 6E BB 75>)
(   2,<2006-02-22 12:22:27.81 +000>,<MAYBRIDGE\nmr>,<NMR_250MHZ>,
      <Start of raw data processing
       ef LB = 0.3 FT_mod = 6 PKNL = 1 SI = 32K 
       data hash MD5: 32K
       E7 51 4E 82 73 60 A9 E2 52 4D C6 93 25 7C F3 95>)
(   3,<2006-02-22 12:22:29.84 +000>,<MAYBRIDGE\nmr>,<NMR_250MHZ>,
      <apk 
       data hash MD5: 32K
       96 D9 37 29 2A 03 87 5B 26 F7 BA 3E 2A 85 11 66>)
(   4,<2006-02-22 12:22:30.82 +000>,<MAYBRIDGE\nmr>,<NMR_250MHZ>,
      <abs ABSG = 5 
       data hash MD5: 32K
       AB 38 7E 9F B8 D6 B2 5A 80 C4 98 6C F6 E8 47 D4>)
$$ ##END=
$$ 
$$ hash MD5
$$ 30 F8 48 8E 6F 80 A4 35 5A 49 A6 CB E7 56 55 23
##$RELAX= 
##$RELAX= 
##$RELAX= 
##$RELAX= 
##$RELAX= 
##$RELAX= 
##$RELAX= 
$$ Bruker specific parameters
$$ --------------------------
##$DU= <C:\u>
##$EXPNO= 16660
##$NAME= <ADRS>
##$PROCNO= 1
##$TYPE= <nmr>
##$USER= <dgb>
##$AMP= (0..31)
100 100 100 100 100 100 100 100 100 100 100 100 100 100 100 100 100 100 
100 100 100 100 100 100 100 100 100 100 100 100 100 100 
##$AQSEQ= 0
##$AQ_mod= 3
##$AUNM= <au_zg>
##$AUTOPOS= <26 >
##$BF1= 250.13
##$BF2= 250.13
##$BF3= 250.13
##$BF4= 250.13
##$BF5= 500.13
##$BF6= 500.13
##$BF7= 500.13
##$BF8= 500.13
##$BYTORDA= 1
##$CFDGTYP= 0
##$CFRGTYP= 5
##$CHEMSTR= <none>
##$CNST= (0..31)
1 1 145 1 1 1 1 1 1 1 1 1 1 1 1 1 1 1 1 1 1 1 1 1 1 1 1 1 1 1 1 1 
##$CPDPRG= <>
##$CPDPRG1= <>
##$CPDPRG2= <>
##$CPDPRG3= <>
##$CPDPRG4= <mlev>
##$CPDPRG5= <mlev>
##$CPDPRG6= <mlev>
##$CPDPRG7= <mlev>
##$CPDPRG8= <mlev>
##$CPDPRGB= <>
##$CPDPRGT= <>
##$D= (0..31)
0 1 0 0 0 0 0 0 0 0.06 0 0 0 0 0 0 0.0002 0 0 0 0 0 0 0 0 0 0 0 0 0 0 
0 
##$DATE= 1140610930
##$DBL= (0..7)
120 120 120 120 120 120 120 120 
##$DBP= (0..7)
150 150 150 150 150 150 150 150 
##$DBP07= 0
##$DBPNAM0= <>
$$ [...]
##$SUBNAM7= <"">
##$SUBNAM8= <"">
##$SUBNAM9= <"">
##$SW= 20.6930455092707
##$SWIBOX= (0..15)
0 0 3 0 0 0 0 0 0 0 0 0 0 0 0 0 
##$SW_h= 5175.983436853
##$TD= 65536
##$TD0= 1
##$TE= 293.16
##$TE2= 300
##$TE3= 300
##$TEG= 300
##$TL= (0..7)
0 120 120 120 120 120 120 120 
##$TP= (0..7)
150 150 150 150 150 150 150 150 
##$TP07= 0
##$TPNAME0= <>
##$TPNAME1= <>
##$TPNAME2= <>
##$TPNAME3= <>
##$TPNAME4= <>
##$TPNAME5= <>
##$TPNAME6= <>
##$TPNAME7= <>
##$TPOAL= (0..7)
0.5 0.5 0.5 0.5 0.5 0.5 0.5 0.5 
##$TPOFFS= (0..7)
0 0 0 0 0 0 0 0 
##$TUNHIN= 0
##$TUNHOUT= 0
##$TUNXOUT= 0
##$USERA1= <user>
##$USERA2= <user>
##$USERA3= <user>
##$USERA4= <user>
##$USERA5= <user>
##$V9= 5
##$VALIST= <valist>
##$VCLIST= <CCCCCCCCCCCCCCC>
##$VD= 0
##$VDLIST= <DDDDDDDDDDDDDDD>
##$VPLIST= <PPPPPPPPPPPPPPP>
##$VTLIST= <TTTTTTTTTTTTTTT>
##$WBST= 1024
##$WBSW= 4
##$XGAIN= (0..3)
0 0 0 0 
##$XL= 0
##$YL= 0
##$YMAX_a= 544874
##$YMIN_a= -612167
##$ZGOPTNS= <>
##$ZL1= 120
##$ZL2= 120
##$ZL3= 120
##$ZL4= 120
##$ABSF1= 16.522
##$ABSF2= -4.171173
##$ABSG= 5
##$ABSL= 3
##$ALPHA= 0
##$AQORDER= 0
##$ASSFAC= 0
##$ASSFACI= 0
##$ASSFACX= 0
##$ASSWID= 0
##$AUNMP= <proc_1d>
##$AZFE= 0.1
##$AZFW= 0.1
##$BCFW= 0
##$BC_mod= 0
##$BYTORDP= 0
##$COROFFS= 0
##$CY= 12.5
##$DATMOD= 1
##$DC= 0
##$DFILT= <>
##$DTYPP= 0
##$F1P= 14.0000005364418
##$F2P= -0.99999901652339
##$FCOR= 0.5
##$FTSIZE= 32768
##$FT_mod= 6
##$GAMMA= 0
##$GB= 0
##$INTBC= 1
##$INTSCL= 1
##$ISEN= 128
##$LB= 0.3
##$LEV0= 0
##$LPBIN= 0
##$MAXI= 10000
##$MC2= 0
##$MEAN= 0
##$ME_mod= 0
##$MI= 0
##$NCOEF= 0
##$NC_proc= -3
##$NLEV= 6
##$NOISF1= 0
##$NOISF2= 0
##$NSP= 0
##$NTH_PI= 0
##$NZP= 0
##$OFFSET= 16.522
##$PC= 1
##$PHC0= 244.5965
##$PHC1= 3.846952
##$PH_mod= 1
##$PKNL= yes
##$PPARMOD= 0
##$PSCAL= 4
##$PSIGN= 0
##$REVERSE= no
##$SF= 250.13
##$SI= 32768
##$SIGF1= 0
##$SIGF2= 0
##$SINO= 400
##$SIOLD= 32768
##$SREGLST= <1H.CDCl3>
##$SSB= 0
##$STSI= 32768
##$STSR= 0
##$SW_p= 5175.98343685301
##$SYMM= 0
##$S_DEV= 0
##$TDeff= 65536
##$TDoff= 0
##$TI= <Analysis number 999999
Compound Code 99
Book Reference 9
Project Code 9>
##$TILT= no
##$TM1= 0
##$TM2= 0
##$TOPLEV= 0
##$USERP1= <user>
##$USERP2= <user>
##$USERP3= <user>
##$USERP4= <user>
##$USERP5= <user>
##$WDW= 1
##$XDIM= 32768
##$YMAX_p= 323320094
##$YMIN_p= -107762
$$ End of Bruker specific parameters
$$ ---------------------------------
##NTUPLES= NMR SPECTRUM
##VAR_NAME=  FREQUENCY,     SPECTRUM/REAL,   SPECTRUM/IMAG
##SYMBOL=    X,             R,               I
##VAR_TYPE=  INDEPENDENT,   DEPENDENT,       DEPENDENT
##VAR_FORM=  AFFN,          ASDF,            ASDF
##VAR_DIM=   32768,         32768,           32768
##UNITS=     HZ,            ARBITRARY UNITS, ARBITRARY UNITS
##FACTOR=    0.157963299565203, 1,           1
##FIRST=     4132.6476996994, 0,             0
##LAST=      -1043.33573715361, 0,           0
##MIN=       -1043.33573715361, -107762,     0
##MAX=       4132.6476996994, 323320094,     0
$$ Real data points
##PAGE= N=1
##DATA TABLE= (X++(R..R)), XYDATA
$$ [...]
24239A2128J5533J8144J1495R422j2686l4071n946j184P150Q919K0139J344k6721
24226B3666j1549j6940j8283j3848N434k1662O659J5492K0105R239n525L922J136
24213b154m674q325J733q269J7061j2003j3932P764M403l218p065K2154J9619
24200A3094r539j8930k4952j1962M6263J7590J55j7227m069n544L6478J4033p531
24187B7859L152m759K637M287j0818j644R104J8716j9226P177J1007n808o259
24174C5425n515m424J446J878j0569k7175j8753J9038J3529j7907J3919Q012j7744
24161h840L079J5831m757r763K936O395R585K941k729N583k805j5519M094m635
24147A396p49K983L7980N671k443j8007p998n279j6752L282J1354L598N206j7177
$$ plain form
24239 12128 27661 45805 57300 66722 54036 19965 14019 12835 19985 28904 49043 50387 23666
24226 23666 12117 -4823 -23106 -36954 -31520 -53182 -46523 -31031 -10926 -1687 -7212 -3290 -2154
24213 -2154 -6828 -15153 -13420 -21689 -4628 -16631 -30563 -22799 -18396 -21614 -28679 -6525 13094
24200 13094 3555 -15375 -40327 -52289 -6026 11564 11719 -5508 -9577 -15121 21357 35390 27859
24187 27859 31011 26252 28889 33176 22358 20714 29818 48534 29308 36485 47492 41684 35425
24174 35425 29910 25486 26932 28810 18241 -8934 -27687 -8649 4880 -13027 892 8904 -8840
24161 -8840 -5761 10070 5313 -4450 -1514 4881 14466 17407 14678 20261 17456 1937 6031 1396
24147 1396 647 3630 41610 47281 44838 26831 18833 13554 -3198 84 11438 15036 20242 3065
24133C065j8412J0717Q558o094J9205r038k0231J1292K3751J19k5570l2368N535
24120b9471K0223m791l650J6505Q510m97m0692q393O982J1453o508P437k59q762
24106c1913K119q079Q600l057J49J4389O504K8197j950j4431j3494K9523k251
24093A4306j2495Q466J4015j6864j4930J3063j4868n539K5994J2974j4923l1726
24081b2527j6029Q537K6827j0068o181Q671O051J0627K0452l126j5436j4492J200
24068e494J4376K1937m82k4623j9355O02o212M106K9105j4796L958N199j5065
24055f744o028J2356R55J6034K7905J69r618q226j5468j7438r473J3618J6298
24042A4340Q726R58k818l2965k5083L336n84L1178K1313o892r040L655p65o985
$$ plain form
24133 3065 -15347 -4630 3928 -2166 17039 8001 -12230 -938 22813 22932 -2638 -35006 -29471
24120 -29471 -9248 -14039 -17689 -1184 7326 6829 -33863 -42256 -35274 -23821 -30329 -22892 -23151 -31913
24106 -31913 -29794 -37873 -29273 -32330 -32181 -17792 -11288 16909 14959 528 -12966 16557 14306
24093 14306 1811 10277 24292 7428 -7502 5561 -9307 -14846 11148 24122 9199 -22527
24081 -22527 -38556 -30019 -3192 -13260 -19441 -10770 -4719 5908 26360 23234 7798 -6694 -5494
24068 -5494 8882 30819 30337 5714 -13641 -13039 -19251 -15145 13960 -836 3122 8321 -6744
24055 -6744 -12772 -416 539 16573 44478 44647 35029 26803 11335 -6103 -15576 -1958 14340
24042 14340 23066 24024 21206 -11759 -36842 -33506 -34090 -2912 18401 11509 2469 6124 5359 -1626
24028a626j7005o403k1790o1l2529j2013K6869L9103J7236K0741n812n160L370
24015D920k9861M422L2321N914J137j2247l091O706q336k1528k718K2864l032
24002b529k8706j3453L6732L0756K2697j140k5936j2805j3372j2444l447J2778
23990a0869Q531J1667K596J2877j4266k080J9048m26J5103K346k5450m790j7955
23977c668K596j473o322J505K1567M272j7080j3376J4204j5734o931K401J2562
23964e477n390j9585l1573j81K8223J090Q864k07J6119K6042J9338l2860j9461
23951a5058J1022k0664o592K6055J3899M03N455J2433N345n506j2986j1018p171
23938d383r417J4024R569k7828j0907L257J8286Q62P86J6514j2971r456J5975
$$ plain form
24028 -1626 -18631 -25034 -46824 -46885 -79414 -91427 -64558 -25455 -8219 12522 6710 1550 4920
24015 4920 -24941 -20519 11802 17716 18853 6606 3515 10221 1885 -19643 -22361 503 -2529
24002 -2529 -31235 -44688 -7956 22800 45497 44357 18421 5616 -7756 -20200 -23647 -10869
23990 -10869 -2338 9329 11925 24802 10536 8456 27504 27078 42181 44527 19077 14287 -3668
23977 -3668 -1072 -2545 -8867 -7362 14205 18477 1397 -11979 2225 -13509 -20440 -18039 -5477
23964 -5477 -10867 -30452 -62025 -62206 -33983 -32893 -24029 -24236 -8117 17925 37263 4403 -15058
23951 -15058 -4036 -24700 -31292 -5237 8662 9065 14520 26953 32298 26792 13806 2788 -4383
23938 -4383 -13800 224 9793 -18035 -28942 -25685 -7399 -6537 -5751 10763 -2208 -11664 4311
23925D311O610o973j6663k7393K923K5207O767L342O255q823j6292k3190K067
23912d1852K4770K4783K2623l957n5662k0895Q285M647K596L0582M633k1206J211
23899a9442J8626Q89M703Q82k7796m624M3329Q231J1493m534k8899j3934m204
23886a5280J7265J1214j9254j6038J4297k611k0379J0612J320J8161L6870P259
23874D3436j6402p463q761r259j4778j463j1301J0008l759r969o759O735J3652
23861a6083J3528k7873k0369K0579R17q892j0066K499J9299J7858N417J1719k344
23848F189j2571k3400K0300K9896m290J6953r661r848j7O748P265R696k989n557
23834B8714L214j4397K642J9437j7358l7323n340Q419K8080j0143l223j9901j718
$$ plain form
23925 4311 10921 3948 -12715 -40108 -37185 -11978 -5211 -1869 4386 -4437 -20729 -43919 -41852
23912 -41852 -17082 7701 30324 26367 -29295 -50190 -41905 -37258 -34662 -4080 553 -20653 -19442
23899 -19442 -816 73 4776 5658 -22138 -26762 16567 24798 36291 31757 2858 -11076 -15280
23886 -15280 1985 13199 -6055 -22093 -7796 -10407 -30786 -20174 -18854 -693 36177 43436
23874 43436 27034 19571 10810 1551 -13227 -14690 -25991 -15983 -19742 -29711 -36470 -29735 -16083
23861 -16083 -2555 -30428 -50797 -30218 -29301 -38193 -48259 -45760 -26461 -8603 -3186 8533 6189
23848 6189 -6382 -29782 -9482 20414 16124 33077 23416 13568 13551 20299 27564 37260 34271 28714
23834 28714 31928 17531 20173 39610 22252 -15071 -20411 -11992 16088 5945 2722 -17179 -18897
23821a8897M2693L8645r244k159O312j7780l8618L71J9808K344n065j5317q220
23808e127L454J3195j511q466j4739l7988J4588K7140O899K835J040l2335j1375
23795d2390J6994L805J9370l839o162l4815j6963R295M230R834J8790K3580o158
23782d429l233J8480L108j9384l463m048r347k233J621j1848k107j6026R135K1594
23768b2180K0038K4353j5309r060p357q574N910J6056j4153j9559n451L919j955
23755c3322L4227L7544P956p912l0279M981k379P24p117L105N998J2640L578j6924
23741A2820q894m501m00m0811k3768K1918J9908K1534J3828Q448O495k8575j5974
23728a7972k712k463P5J4476n123Q362P245p750J30r099n180P499J6849K3808
$$ plain form
23821 -18897 23796 62441 53197 51038 57350 39570 952 1323 21131 23475 18410 3093 -5127
23808 -5127 -1673 11522 10011 1545 -13194 -51182 -36594 -9454 -2555 280 1320 -31015 -42390
23795 -42390 -25396 -21591 -2221 -6060 -12222 -47037 -64000 -54705 -50475 -40641 -21851 1729 -4429
23782 -4429 -7662 10818 13926 -5458 -8921 -12969 -22316 -24549 -22928 -34776 -36883 -52909 -43774 -22180
23768 -22180 -2142 22211 6902 -2158 -9515 -18089 -12179 3877 -10276 -29835 -35286 -31367 -33322
23755 -33322 905 38449 46405 38493 8214 13195 10816 11540 4423 7528 13526 26166 29744 12820
23741 12820 3926 -575 -975 -41786 -65554 -43636 -23728 -2194 11634 20082 26577 -1998 -17972
23728 -17972 -20684 -23147 -23072 -8596 -13719 -5357 1888 -5862 -5732 -14831 -20011 -12512 4337 28145
23714B8145r80k2892k736r736R530j5141l453q443L952J3273m67k580J906N80
23700i042L536P20M555J31l342O930J482K4942j0217j8971J4810J71l3864r307
23686b7466J0766K5981P77r536n504K473K1817N655j5119k398J3282n174l064
23673A2490J1434k388j4785k6787j2280k4052j1299L7965J8892K326Q661k7840
23661b7663p450J1409J2868q939k2444J605q730j293L891m324K2299Q613J7507
23648b651R361J2860J9967m320l0905M401L1585k091p054J0917n501j1663k5233
23635c27j2864o013O746J9891J5935J1492q742j6968l0569j959M404J6047J0614
23622G687k3839j3596K7342K0162j6849m624J4431p710J1532L992L367k659j5217
$$ plain form
23714 28145 27165 4273 1537 -8199 1331 -13810 -17263 -25706 -21754 -8481 -8948 -11528 -9622 -9042
23700 -9042 -5506 -4786 -231 -100 -3442 3488 4970 29912 19695 724 15534 15705 -18159 -27466
23686 -27466 -16700 9281 10058 522 -4982 -2509 19308 24963 9844 7446 20728 15554 12490
23673 12490 23924 21536 6751 -20036 -32316 -56368 -67667 -29702 -10810 -8484 177 -27663
23661 -27663 -35113 -23704 -10836 -19775 -42219 -40614 -49344 -50637 -46746 -51070 -28771 -20158 -2651
23648 -2651 6710 19570 39537 35217 4312 8713 40298 38207 31153 42070 36569 24906 -327
23635 -327 -13191 -19204 -12458 7433 23368 34860 26118 9150 -21419 -23378 -18974 -2927 7687
23622 7687 -16152 -29748 -2406 17756 907 -3717 10714 3004 14536 18528 21895 19236 4019
23609D019Q383j3642n920L98j0431N60J2829l648j0997P53L056j0075J000k256
23595b5971j1316j0409N754j2129J5613J4516L341J0852K7175j8616l1854K0507
23583a2537L0079j0396j2702R331j1029L7807J4050k1471n189J9557j1028q158
23571A8314J3129l7080r970K1688L4379r670l0274J0138L20l8805k5123K5203
23559b7751L8323M259L696p011O935n958O054J5846j6507o971l803j7232j225
23546a1345K642j7960J368Q171J1609O074j4116j1084j9162n431J8314J4602J4661
23533a657Q218L40k524o750j3822n863k2764N370K577J7911m490J1798L1941J4177
23519C4462k6639j3304j2812j1240q83K3941J8966J9780N559r356J2549l2792
$$ plain form
23609 4019 12402 -1240 -7160 -6762 -17193 -16633 -3804 -7452 -18449 -17696 -14640 -24715 -23715 -25971
23595 -25971 -37287 -47696 -41942 -54071 -38458 -23942 -20601 -9749 17426 -1190 -33044 -12537
23583 -12537 17542 7146 -5556 3775 -7254 30553 44603 23132 17943 37500 26472 18314
23571 18314 31443 -5637 -15607 6081 40460 30790 516 10654 10974 -27831 -52954 -27751
23559 -27751 10572 14831 18527 11516 18451 12493 18547 34393 17886 10915 7112 -10120 -11345
23546 -11345 -8703 -26663 -25295 -17124 -5515 559 -13557 -24641 -43803 -49234 -30920 -16318 -1657
23533 -1657 6561 6901 4377 -2373 -16195 -22058 -44822 -39452 -36875 -18964 -23454 -11656 20285 34462
23519 34462 7823 -5481 -18293 -29533 -30416 -6475 12491 32271 37830 28474 41023 8231
23507H231n440j0154N567J5471j092j1232J0726q418M271J1657P941m737r611
23494A3180J548M362k8909M213J039j7237L676N624p597j0579k1874P66J2954
23481c8834M9905J0777j6284J4508n981M221j0691j0062M851J5040O26M230l5039
23468a2733j7371K7580J9765n683l2837L962q042j3231o199m364J6505J2266m147
23455b4529J6036K0101m932l7896j4504L6808J4158j9687j7298m721J5410J7172
23443c882L821P001q31j2820j6235l4785R923M0224j80k4726j638k114m1377l0143
23429a07762L6307L4787K4181m733J082R645j5725J1570J4063O783k874j306M081
23416A0099j1971K0588J0331M009N533p925j5623l146Q194J1512J0198Q862j9885
$$ plain form
23507 8231 2791 -7363 -1796 13675 12583 1351 12077 3659 7930 19587 27528 22791 13180
23494 13180 14728 19090 -9819 -5606 -4567 -21804 -18128 -12504 -20101 -30680 -52554 -51788 -38834
23481 -38834 11071 21848 5564 20072 14091 18312 7621 -2441 2410 17450 18076 22306 -12733
23468 -12733 -30104 -2524 17241 11558 -21279 -17317 -25359 -38590 -44789 -49153 -32648 -20382 -24529
23455 -24529 -8493 11608 6676 -31220 -45724 -8916 5242 -14445 -31743 -36464 -21054 -3882
23443 -3882 -61 6940 6109 -6711 -22946 -57731 -47808 -7584 -7764 -32490 -34128 -36242 -77619 -107762
23429 -107762 -71455 -36668 -12487 -17220 -16138 -6493 -22218 -10648 3415 10198 7324 6018 10099
23416 10099 -1872 18716 29047 33056 38589 30664 15041 11895 20089 31601 41799 50661 30776
23403C0776K133O516k8765j4565q274l0068j4509o535j4852L1137J7253K2591
23391g162N315m352J562O003K310J2849j1818j8829j5900K2854m541k014N510
23378h213k1871l2085J6499Q328J3624K765o071o58j8195J340K9291N411J209
23365h626J7175K4452j6755k9673J5977L1792L1633k1266j3520k2202N547J0793
23353B5327j2748j2960j5036k3173k2477K6072L2949J7737m385m339j5907J2195
23341C255R516P59m054n615j6790j2741n977P416m779J5978K1803n483l0149j9702
23327d6563j473M2936K0929j7659K8311p191l4030K674K2702m358p970o562J1894
23314C640R255J7396j6997j8683p309j4597O560J5092K3072q130M465K510k2114
$$ plain form
23403 30776 32909 39425 10660 -3905 -12179 -42247 -56756 -63291 -78143 -47006 -29753 -7162
23391 -7162 -1847 -6199 -4637 1366 3676 16525 4707 -14122 -30022 -7168 -11709 -13723 -8213
23378 -8213 -30084 -62169 -45670 -37342 -23718 -20953 -27024 -27682 -45877 -44537 -15246 -9835 -8626
23365 -8626 8549 33001 16246 -13427 2550 34342 65975 44709 31189 8987 14534 25327
23353 25327 12579 -381 -15417 -38590 -61067 -34995 -2046 15691 11306 6967 -8940 3255
23341 3255 12771 13530 9476 3861 -12929 -25670 -31647 -24231 -29010 -13032 8771 3288 -26861 -46563
23327 -46563 -48036 -5100 15829 -1830 26481 19290 -14740 -12066 10636 6278 -1692 -8254 3640
23314 3640 12895 30291 13294 -5389 -12698 -27295 -20735 -5643 17429 9299 13764 16274 -5840
23301e840l763m131k6629r516J9064R582M764j1835L71K3192J6005j1164J499
23288A599r72j5758M417j0234P486q280j4085L3394K7974l187k627L027k2042
23275G12M663m065j6181m964N551j1294n070J6324P072j5170O65J8624M897j8712
23261a6948l749p013j8556q929J1646m318j292K2574K6069j1213r346j6906m014
23248d1995J0638k433J1423r608J1473J0588j8884R057K9116L034J8556j4678
23236A6287j0685L584o630l263j7505n283P907O536Q623n76j1881P925p048L163
23222h846O133J5489O162j9920j2393L7416K3776j458m46j5490o596J1201Q749
23209D3777P39m0290l6087Q473L620n20K8336L4906J5497l365l0315j2436o417
$$ plain form
23301 -5840 -9603 -13734 -40363 -49879 -30815 -21233 -16469 -28304 -27933 -4741 11264 100 1599
23288 1599 627 -15131 -10714 -20948 -13462 -21742 -35827 -2433 25541 22354 19727 22754 712
23275 712 5375 1310 -14871 -19835 -14284 -25578 -30648 -14324 -7252 -22422 -21757 -3133 1764 -16948
23261 -16948 -20697 -27710 -46266 -55195 -43549 -47867 -49159 -26585 -516 -11729 -21075 -37981 -41995
23248 -41995 -31357 -33790 -22367 -31975 -20502 -9914 -28798 -19741 9375 12409 30965 16287
23236 16287 5602 9186 2556 -707 -18212 -23495 -15588 -9052 -429 -1005 -12886 -4961 -12009 -8846
23222 -8846 -2713 12776 18938 -982 -13375 24041 47817 46359 45913 30423 23827 35028 43777
23209 43777 44516 4226 -31861 -23388 -19768 -20288 8048 42954 58451 55086 24771 12335 5918
23196E918k1190j0003K928J5092J9953L0822j147j4508j7826J2953J5387k0903
23184A7476j6702j6936M032O135M909L644K3175j3710J379Q985O336K260k854
23171B8129j791O965k7756N472J4813R20P871N211l2936k1515M932M873q787l387
23157a6986L1899O201P854j9918m503J2132j551J902j871k3433k8730o980J0319
23144c3665n696J2976L0465n229r757Q721l646m0308l093L129L1348N2038J4598
23131E1881j4069j0083q31J91O520q559j3385M524L68k8842k0919j0423k638k814
23117d9079R931p308K4929L075n749j85J6415J2575J807j7315j1201K0609j4847
23104a6343k0853J2263J1952m248n975J2399k8876R14M6524K4053o797r01p773
$$ plain form
23196 5918 -15272 -25275 -22347 -7255 12698 43520 42373 27865 10039 22992 38379 17476
23184 17476 774 -16162 -12130 -5995 -1086 2558 25733 12023 13402 22387 28723 30983 28129
23171 28129 26338 33303 5547 11019 25832 26752 34623 39834 6898 -14617 -9685 -4812 -13599 -16986
23157 -16986 14913 21114 28968 9050 4547 16679 15128 17030 15159 -8274 -37004 -43984 -33665
23144 -33665 -39361 -26385 4080 -1149 -10906 -2185 -5831 -46139 -49232 -46103 -14755 37283 51881
23131 51881 37812 27729 26898 27089 33609 25050 11665 16189 16557 -12285 -33204 -43627 -46265 -49079
23117 -49079 -39148 -46456 -21527 -18452 -24201 -24386 -7971 4604 6411 -10904 -22105 -1496 -16343
23104 -16343 -37196 -24933 -12981 -17229 -23204 -10805 -39681 -38767 7757 31810 25013 24112 16339
23091A6339j3808n341P011k4853j4711Q082J89L6883K2783l5692n603L8709J3362
23078D3350j2664k7832K8704J1214k0618M331o657k5929R460J7771J8053l089
23066C6094j15j9338k1266J0102J5576j0172j1159Q279J804n72l868J9983J1104
23053C6452n660Q775o133k6385o552k74j7204j9117m215j2371k0428L4038J8896
23040b0178K5830M504p811q81J8089k469J6626l371N981j1672j997O854J1815
23027D1320K1052K9852J4843J2913j757N0768J06030J57771K11986K45827K41667
23016A132272J81049O4570m2115j62394k23777k33568k03707j61805p8069m1302
23006B31154m5404l5596l4700j1784j8524m683q021m551m859j426j4946j0509
$$ plain form
23091 16339 2531 -2810 4201 -20652 -35363 -27281 -27092 9791 32574 -3118 -8721 29988 43350
23078 43350 30686 2854 31558 42772 22154 26485 19828 -6101 3359 21130 39183 36094
23066 36094 35979 16641 -4625 5477 21053 10881 -278 8001 9805 9233 5365 25348 36452
23053 36452 30792 39567 33434 7049 497 223 -16981 -36098 -40313 -52684 -73112 -39074 -20178
23040 -20178 5652 10156 2345 1464 19553 17084 33710 30339 36320 24648 22651 29505 41320
23027 41320 62372 92224 107067 119980 118223 168991 275021 432792 644778 890605 1132272
23016 1132272 1313321 1377891 1335776 1173382 949605 716037 512330 350525 272456 231154
23006 231154 185750 150154 115454 103670 85146 80463 72442 67891 63032 61606 46660 36151
22994C6151J1025j1075M853j0438j6802o674k9303j3859K2558J5832J4733J9196
22982C6197J5223q574O445J9290n069j3031j6365j7695j1354p764K2868m065P276
22969B3382k2388r139J661M374j0570k0456K829J4509Q156N687J22l271J6190
22956A1086M318K257l0217l0047L2605J9171j0433Q603M234o704P731P186J0829
22943C0619j2745K21K1207J7990p446J881J7081k420j605k2617m988J4045k5601
22930B5622N425K0698m967p317j3447j1862J3760O400j9488p485O029k2024M958
22917c698j0080p998M27j2521K3762J5896j47q705R735J8974K2991J1073k9770
22904B9939K8L409J0394j1188k5076j8602N202n162K627l49j6954J0596K3489
$$ plain form
22994 36151 47176 36101 40954 30516 13714 7040 -22263 -36122 -13564 2268 17001 36197
22982 36197 51420 42846 49291 68581 63512 50481 34116 16421 5067 -2697 20171 16106 23382
22969 23382 994 -8145 -6484 -2110 -12680 -33136 -30307 -15798 -7642 -1955 -1833 -5104 11086
22956 11086 15404 17661 -12556 -42603 -9998 9173 -1260 7343 11577 4873 12604 19790 30619
22943 30619 17874 18095 39302 57292 49846 51727 68808 66388 64783 42166 37178 51223 25622
22930 25622 31047 51745 46778 39461 26014 14152 27912 34312 14824 7339 13368 -8656 -3698
22917 -3698 -13778 -21776 -21349 -33870 -10108 5788 5641 -3064 6671 25645 48636 59709 29939
22904 29939 29967 33376 43770 32582 7506 -11096 -5894 -11056 -8429 -8778 -25732 -15136 8353
22891H353J1155O535j0723N656J8303j3461l2856J1726J0712j051R270j137l5197
22878a2715j2426L8801K6380K591k6356l271R388K57j815R805L12k3921p444o291
22864f705K3001L8726j558j2196l939p502j3458j3836J8385K3707O435J4178j2026
22851E3212k2326M936o804j649K3294m121j8015j5656O205k837L7077Q093j3423
22838D7986j5321K828n62J9310L633k8489l702P21j514L564K0224j5619K081k5830
22824I310j2960J0972J7364J3223j6237J048j901L962Q113l3409j3008J5888J3359
22811A5724J7335J3994J2170q693j6486l1691k410p62J1877M581j3807j7230j850
22798a7248L3935K9124j2018j5262j9667J3925J1543K2635j1194R725K763j0556
$$ plain form
22891 8353 19508 26043 15320 20976 39279 25818 -7038 4688 15400 14349 23619 22482 -12715
22878 -12715 -25141 13660 40040 42631 16275 13004 22392 22649 20834 30639 30951 7030 -414 -6705
22864 -6705 16296 55022 53464 41268 37329 29827 16369 2533 20918 44625 51060 65238 53212
22851 53212 30886 35822 29018 27369 50663 46542 28527 12871 19076 16239 53316 61409 47986
22838 47986 32665 35493 34931 54241 57874 29385 25683 26404 24890 28454 48678 33059 35140 9310
22824 9310 -3650 7322 24686 37909 21672 22720 20819 24781 32894 -515 -13523 2365 15724
22811 15724 33059 47053 59223 50530 34044 2353 -57 -819 11058 15639 1832 -15398 -17248
22798 -17248 16687 45811 33793 18531 -1136 12789 24332 46967 35773 45498 48261 37705
22786C7705M542J4742l1288j8998k0776k5488j852J3289n887J2166P216R290J0944
22773E605M389m37J6840P237K29l922j647K351j7164N674P524p626j5496Q74J0125
22758A4556K2125J6732j9230Q41K1696k7633m8427j5292J7222L341J6660K554
22746E145J3044N499J5253K5365J4541j3808l3931p055P913n865J712L943J6674
22733D8430K6263J0798K5261L5134J092j5346m0550k0626M641M3603K8721J8546
22721A65967j8021k0222k4577k6505P671K5667R502k6093l2701j8432o495J7128
22709E2889M6889j4081k8848k332j002l7569l1197K0657M5017k1094j6096N241
22697A8474J2230J6006m058j1825r726l0832K153K2938P478l1668p368J8677J4206
$$ plain form
22786 37705 42247 56989 25701 6703 -14073 -39561 -41413 -28124 -34011 -21845 -14629 -5339 5605
22773 5605 9994 9557 26397 33634 33863 29941 28294 30645 13481 19155 26679 19053 3557 4431 14556
22758 14556 36681 53413 34183 35024 56720 29087 -19340 -34632 -17410 -14069 2591 5145
22746 5145 18189 23688 38941 64306 78847 65039 31108 24053 31966 26101 27813 31756 48430
22733 48430 74693 85491 110752 145886 146978 131632 91082 70456 75097 118700 147421 165967
22721 165967 147946 127724 103147 76642 84313 109980 119482 93389 60688 42256 35761 52889
22709 52889 99778 85697 56849 54517 53515 15946 -15251 5406 50423 29329 13233 18474
22697 18474 30704 46710 42652 30827 21101 -9731 -7578 15360 22838 -8830 -16198 2479 16685
22684A6685j342J5918j4314Q819p614q416K6309J4196J8838L585L5503J6823n175
22671A19815r407p206J8210K4062K332j5293o383o46k2450k3229j9308k9081k7309
22658D107k5223K702P992J266q620O262J2408l827J248m812j28j9057K3596L5724
22644C3638o251J5337n33O584K773p804l0252j1462j6829j9952o176J615j7982
22631e7294P920K105O217l1298k5209L425J2840K6520L6623M9835J5251O578m515
22618D8998j4275k71M790n617L1662K4347j519j3051Q548R310Q133K485l083M188
22604A04645Q289J9421j0453k2908n26M72o972l2697j8162o73K495p770L212k4697
22590A3676n166L5016J2275K4060N3390R393k071k6778j6193k2429k7081m745
$$ plain form
22684 16685 15343 31261 16947 25766 18152 9736 36045 50241 69079 72664 108167 124990 119815
22671 119815 110408 103202 121412 145474 147806 132513 126130 125484 103034 79805 60497 31416 4107
22658 4107 -21116 -18414 -10422 -9156 -17776 -11514 894 -2933 -1685 -6497 -6625 -25682 -2086 33638
22644 33638 27387 42724 42191 48775 51548 43744 13492 2030 -14799 -34751 -40927 -39312 -57294
22631 -57294 -49374 -47269 -41052 -72350 -97559 -94134 -81294 -54774 -18151 31684 46935 53513 48998
22618 48998 34723 34452 39242 33625 65287 89634 88115 75064 83612 92922 101055 103540 100457 104645
22604 104645 112934 132355 121902 98994 98468 98940 91968 59271 41109 40436 42931 35161 38373 13676
22590 13676 8510 43526 55801 79861 133251 142644 140573 113795 97602 75173 48092 43347
22578D3347J6185J5685J5463q983k7974j1279j3589J7552L2189K4684P840J2434
22566A23554m8285k1411o323j3904R764K4952K7580K7378N045J2347R750J5505
22554A65952L2785J6894P5654P8357J17181K15916K45831K70504K67741J49081
22544A635896l839j22172k42743k59001k14372j94655j23431p6170k8965j9597
22534C50951k1386l1961k0385K0990j0372j5681K3153K4001L5663K9279l1418
22523C52834J0036n366J0198j8174J8845J7929L0154J9790K7465L4835Q682j2647
22511D94581J1177M1707M5458L0272N4083O9929N7158P3675M5123L8387K2240
22500I83790M5898P7303J09020J31757J61085K03720K32378K33074K35004K43196
$$ plain form
22578 43347 59532 75217 90680 81697 53723 42444 28855 46407 78596 103280 111120 123554
22566 123554 75269 53858 47535 33631 43395 68347 95927 123305 128350 140697 150447 165952
22554 165952 198737 215631 291285 369642 486823 702739 948570 1219074 1486815 1635896
22544 1635896 1632057 1509885 1267142 1008141 793769 599114 475683 399513 370548 350951
22534 350951 329565 297604 277219 298209 287837 272156 295309 319310 354973 384252 352834
22523 352834 362870 357504 367702 349528 368373 386302 416456 436246 463711 498546 507228 494581
22511 494581 505758 547465 592923 623195 677278 747207 804365 878040 923163 961550 983790
22500 983790 1029688 1106991 1216011 1347768 1508853 1712573 1944951 2178025 2413029 2656225
22490B656225K62414K88671L18898L54544M54372O14799Q45318J179932J732760
22481H707933K400663L136031M213567N808110Q647775J4432418K4986871L7186034
22473A09519402M4995788M8617260M0979225J9153739m436033k6934388m3880273
22466A88014720m7322344m1754384l1853320k0747756j2491393p739696n186742
22459B0919085l703125k741310k073832j642939j356667j147910r69856q07300
22451F476146p26940o21483m83094l90674l05571k38686k00187j46223r4263q6966
22441C182059o9646n8719j57306k05861k40075k87631k64895k56369k07242j37100
22431A297215q7936p8111j18673p2839n1461n3322o5966l7139J6462K1564j4467
$$ plain form
22490 2656225 2918639 3207310 3526208 3880752 4335124 4949923 5795241 6975173 8707933
22481 8707933 11108596 14244627 18458194 24266304 32914079 47346497 72333368 109519402
22473 109519402 154515190 203132450 244111675 263265414 258829381 231894993 188014720
22466 188014720 140692376 98937992 67084672 46336916 33845523 26105827 20919085
22459 20919085 17215960 14474650 12400818 10757879 9401212 8253302 7283446 6476146
22451 6476146 5749206 5127723 4644629 4253955 3948384 3709698 3509511 3363288 3269025 3182059
22441 3182059 3112413 3053694 2896388 2690527 2450452 2162821 1897926 1641557 1434315 1297215
22431 1297215 1209279 1131168 1012495 939656 888195 834873 768907 731768 748230 769794 755327
22420G55327l2392m9176m0082l4793m1587n0756l8895k4873j5260J3684J361k194
22408D40364j4473j5355N328K9161K318j7121q77L6130L7257P4640J82592K19754
22396I79718K49248K44165J62544L2559r1557k07720k47733k59569j94779j19460
22386E47416q8223m4249k5953l6236j3234L536k3741j6596k5946J2973J291k2389
22374B68649l1718l2318k1126N247j038k0914O547J6206j7246q257Q947O877k7457
22361A52399K941p780k3591m869N623k674n435n540J3579J1530j1766R368P733
22348A41518J0280K0714K9594j7010j6618j6143J5081k3310k9352j3723l5067
22337F5964q330k203p002R783J805j9761M816J558R214J2716L642J6135O600J4783
$$ plain form
22420 755327 722935 673759 633677 598884 557297 506541 467646 442773 427513 441197 442558 440364
22408 440364 425891 410536 415864 445025 447343 430222 429345 465475 502732 577372 759964 979718
22396 979718 1228966 1473131 1635675 1668234 1576677 1368957 1121224 861655 666876 547416
22386 547416 459193 414944 388991 352755 339521 343057 319316 302720 276774 289747 291038 268649
22374 268649 236931 204613 183487 188734 187696 166782 173329 189535 172289 164032 172979 179856 152399
22361 152399 155340 147560 123969 119100 124723 122049 116614 111074 124653 136183 124417 133785 141518
22348 141518 151798 172512 202106 185096 168478 152335 167416 144106 114754 101031 65964
22337 65964 57634 55431 48429 58212 60017 40256 45072 46630 55844 68560 72202 88337 94937 109720
22323A09720K6158p763l620l1984r309r317n176O1585J3302M777K6266r067N161
22310A70733r266k2011p931l8108r211n681j2569K045l440K8471n573m3945j1806
22297C1708J1706K6324K8051J7365j2905K2581J1428r402j1360o18p256j6964
22285I0658K3219K2422j5011k1170k046k5920j2766j3154l1873l0813K4446P778
22273A5770n773n373P49j220J0194L413k3407j5686R775K3115q513j2240J6687
22260G491M314J0857J5352r920k1835n366l258K0002k6629m38J7274J6651k1949
22247B546k8562j3558k760n081P656K679J8388K3488j177k2280o940J0881J7172
22234B452J9965j426n563R713j2668j0825J6516l009J1387K1281L1564Q291j4363
$$ plain form
22323 109720 135878 128115 124495 92511 83202 73885 68709 130294 143596 148373 174639 165572 170733
22310 170733 161467 139456 131525 93417 84206 78525 65956 68001 64561 93032 87459 43514 31708
22297 31708 43414 69738 97789 115154 102249 124830 136258 126856 115496 114878 107622 90658
22285 90658 113877 136299 121288 100118 98072 72152 59386 46232 14359 -16454 7992 15770
22273 15770 9997 4624 5373 4153 14347 17760 -5647 -21333 -11558 11557 3044 -9196 7491
22260 7491 11805 22662 38014 28094 6259 893 -2365 17637 -8992 -9430 7844 24495 2546
22247 2546 -26016 -39574 -42334 -47415 -39759 -37080 -18692 4796 3619 -18661 -25601 -14720 2452
22234 2452 22417 20991 15428 25141 12473 1648 18164 15155 26542 47823 79387 87678 73315
22221G3315k935k358k239j2275J9042j5265l7916j8896K1958L1928j5050k5212
22209A4097k2428m783O261L3838k0546N66r98j1601%J8380J4449J8131J4338J3992
22195G3696K05k9856k3384M083J8866J2238p487l639j7164R33J6165m107Q349
22182D8898K2791j7228k6850j8621J5190J4464Q849j0985j0374j1360R752m529
22170A9997p001R252P344p108j7800J2474P347J6221p554j488K016j4479j338
22157A7883k44r119r581J957Q453J2014o931L903J2349l0093M583K5285Q727J0364
22143D9550J521j1291k4187j1925n265P355J1001k2458r969J0511J8475M310o413
22130A1215k1935q304J6594q20K327J3098j6456j8250j0436j740J7457L950M941
$$ plain form
22221 73315 70380 68022 65783 53508 72550 57285 19369 473 22431 54359 39309 14097
22209 14097 -8331 -13114 -6853 26985 6439 7005 6007 -5594 -5594 12786 27235 45366 59704 73696
22195 73696 73901 44045 20661 24744 43610 55848 48361 44722 27558 28491 44656 40549 48898
22182 48898 71689 54461 27611 8990 24180 38644 47493 36508 26134 14774 24526 19997
22170 19997 12996 22248 29592 22484 4684 17158 24505 40726 33172 31684 33700 19221 17883
22157 17883 17639 8520 -1061 896 9349 21363 14432 18335 30684 591 5174 30459 39186 49550
22143 49550 51071 39780 15593 3668 -1597 5758 16759 -5699 -15668 -5157 13318 17628 11215
22130 11215 -10720 -19024 -2430 -3250 -923 12175 -4281 -22531 -32967 -34707 -17250 -13300 -8359
22117h359r857J2917M258j1367N281K7779O256j50j4680k9465j1172K5778J8799
22104A6018R097k456k2119k2788j1891L387K2419J1194j054j6433r033j4893K6052
22091a2500K5579J0479l7794j1207j6881j4810R042J5296K8620M8166J4924k3603
22079C5311k8982l0189m621J6530l785J6284M43j1038l195k28K6448J1023j330
22066B2671j0968j892j185m613M187P004Q530j7461j9050j9796j895R010R242
22053a6216k014l156J1772M003J5985j0323L2132K974j1518m907j2589m163k3537
22040b1557R428J382k7669O058K2576L665r727j2124K2165J6676J7215J1526j0402
22027B9212k8159l317n818M416J0131j4339r470J9161K8099j1549k0339j7657
$$ plain form
22117 -8359 -18216 -5299 -1041 -12408 -7127 20652 26908 26758 12078 -17387 -28559 -2781 16018
22104 16018 25115 22659 540 -22248 -34139 -30752 -8333 2861 1807 -14626 -23659 -38552 -12500
22091 -12500 13079 23558 -14236 -25443 -42324 -57134 -48092 -32796 -4176 43990 58914 35311
22079 35311 6329 -23860 -28481 -11951 -15736 548 991 -10047 -13242 -13470 12978 24001 22671
22066 22671 11703 9811 8626 4013 8200 15204 23734 6273 -12777 -32573 -34468 -25458 -16216
22053 -16216 -18230 -21386 -9614 -5611 10374 51 32183 35157 23639 18732 6143 1980 -21557
22040 -21557 -12129 -10747 -38416 -32358 -9782 -6117 -15844 -27968 -5803 10873 28088 39614 29212
22027 29212 1053 -2264 -8082 -3666 6465 -7874 -17344 1817 29916 18367 -1972 -19629
22015a9629j3519Q756J1601o009L74L6436j2559l5222J8759o51m925o841j0264
22002c3693j9029o778J2147J3343J1327J6903N565J2698J4289J6086O284k4471
21990B4671j0051j2912J88K1030J7758j6764J0852K733j8991k4223J699P594L922
21977G506k6136j0299j2673J3497Q737K1505J3706r681P163J619J5150j4540j5002
21964E52j6387j0618L2194J6008K127Q960n427k3423l1563K899K5954K0520k3038
21951a242k0082J2724P028q829P103Q707J0731R146j6146k4940J3239J8983J7735
21938C4157o31k129O683J1687O77n201K1264J5012p270j3812R960K176L587L5034
21924A11194J3171L2285O4746J01348J68582K11519K43762K39463J66413M1375
$$ plain form
22015 -19629 -33148 -24392 -12791 -18800 -18426 18010 5451 -29771 -11012 -11663 -16588 -23429 -33693
22002 -33693 -52722 -59500 -47353 -34010 -22683 -5780 -215 12483 26772 42858 49142 24671
21990 24671 14620 1708 1896 22926 40684 23920 34772 37505 18514 -5709 -4010 3584 7506
21977 7506 -18630 -28929 -41602 -28105 -19368 2137 15843 6162 13325 14944 30094 15554 552
21964 552 -15835 -26453 5741 21749 23876 32836 27409 3986 -27577 -24678 1276 21796 -1242
21951 -1242 -21324 -8600 -1572 -10401 -3298 5409 16140 25286 9140 -15800 -2561 16422 34157
21938 34157 33526 31397 38080 49767 50444 45243 66507 81519 74249 60437 70397 72573 76160 111194
21924 111194 124365 156650 221396 322744 491326 702845 946607 1186070 1352483 1393858
21914A393858p2497k04371k49583k33145j66531j31799j14711p9095l9401r222
21904I3503j230k1149l3984k7835j1482L5034K7987k939l8499j5847J0272O283
21892B0114k6794N067K5772R728M192J3286P666k6306o399N69k2967K247k9305
21879b3130N997M6068K2874j0434j8419j8750r933q353J4019m407j5440P940M328
21866g640J7118j0208j6908Q274N082j0351p663j010J2324p720k3142J3884J9295
21853h665q637k4796K978j673L416l27R19K4676M797J5747j378k47R660J3528
21839B9998p148k0308k0855k7834M279J4978l855O372J7751J0227K4783p015j3388
21826G985J4457J167j4659r16J6344R53n928j4645k6385k9666N177J7366J7403
$$ plain form
21914 1393858 1321361 1116990 867407 634262 467731 335932 221221 142126 102725 93503
21904 93503 92273 71124 37140 9305 -2177 32857 60844 57905 19406 3559 13831 20114
21892 20114 -6680 -1613 24159 33887 38079 51365 59031 32725 26326 26895 3928 6175 -23130
21879 -23130 -17133 28935 51809 41375 22956 4206 -5727 -14080 -61 -4468 -19908 -11968 -7640
21866 -7640 9478 -730 -17638 -9364 -4282 -14633 -22296 -23306 -10982 -18702 -41844 -27960 -8665
21853 -8665 -17302 -42098 -39120 -40793 -37377 -37704 -36785 -12109 -7312 8435 7057 6810 16470 29998
21839 29998 22850 2542 -18313 -46147 -41868 -26890 -30745 -24373 -6622 3605 28388 21373 7985
21826 7985 22442 23609 8950 8034 24378 25331 19403 4758 -21627 -51293 -46116 -28750 -11347
21813a1347J4070r790Q364K8183J477J4863l0638p172j8439J7840J6367j2825
21801A0953j9231k9583L0171K8804k593j344j1855O122J1340O460n513j6304J9609
21788B7036K7268J2396k1461j622j9564m417p135j8010o538J0410r53Q92M727
21775C029j596j1226j6217R987Q46L540L390J041K2598J3060J496j1247K1535
21762D0236k1344l5703j1708P919k850L794K9254R622j929L559j802l1989m3052
21749e5993J4484J4394J1387L4094O641j7858M771j2551j5558k4983j866K9999
21737a3039P665M104K2891Q517l4648k4828J7450P413L0134K7555j9229j5573
21725A8412j6297k470J0116R452j7659k3588J7711J90k5396L606K1683J1286m364
$$ plain form
21813 -11347 2723 -7067 1297 29480 30957 45820 15182 8010 -10429 7411 23778 10953
21801 10953 -8278 -37861 -7690 21114 18521 17177 5322 11444 22784 29244 23731 7427 27036
21788 27036 54304 66700 45239 43617 24053 19636 12501 -5509 -12047 -1637 -2590 -1698 3029
21775 3029 1433 -9793 -26010 -16023 -15177 -11637 -8247 -7206 15392 28452 29948 18701 40236
21762 40236 18892 -16811 -28519 -20600 -23450 -19656 9598 19220 17291 20850 19048 -12941 -55993
21749 -55993 -41509 -27115 -15728 18366 25007 7149 11920 -631 -16189 -41172 -43038 -13039
21737 -13039 -5374 -1270 21621 30138 -4510 -29338 -11888 -4475 25659 53214 33985 18412
21725 18412 2115 -355 9761 19213 1554 -22034 -4323 -4133 -29529 -25923 -4240 7046 2682
21712B682J8341j2535L829O47j8443k7646j7644J4392M4026N682k1325M504J3655
21699A0165P968j5968o328L695J1267K8735o89j5409k2093K560r359n180J4449
21686C813j5664k8671J51J0160k316j3221L765j0801O019M24O658J4495J3985
21673a1203n685l889j2044l9J5840J9181J331J911J1142R24k862m529j285P768
21659A6561k8407j1494M950J6407K212k7869o941j548J9131J4643k025j3061J8722
21646A281m00J4751k2806o132j6982R893K5934N274j2207J514J2743o429j2622
21633f188k311P2k3306R281K2971M30J9578j4355q523J207q026j2731k7839J8309
21619c1431M7321J5326k8707j4780J6182r668K5402r775k1836p17J4668J2148
$$ plain form
21712 2682 21023 8488 12317 12964 -5479 -33125 -50769 -36377 7649 13331 -7994 -3490 10165
21699 10165 18133 2165 -4163 -468 10799 39534 38845 23436 1343 3903 -5456 -10636 3813
21686 3813 -11851 -40522 -40371 -30211 -32527 -45748 -41983 -52784 -46765 -46341 -39683 -25188 -11203
21673 -11203 -16888 -20777 -32821 -32860 -17020 2161 3492 5403 16545 17469 14607 10078 8793 16561
21659 16561 -11846 -23340 -18390 -1983 229 -27640 -34581 -36129 -16998 -2355 -4380 -17441 1281
21646 1281 881 15632 -7174 -13306 -30288 -20395 5539 10813 -1394 120 12863 6434 -6188
21633 -6188 -8499 -8427 -31733 -22452 519 949 20527 6172 -2351 -1144 -9170 -21901 -49740 -31431
21619 -31431 15890 31216 2509 -12271 3911 -5757 19645 9870 -11966 -12683 1985 14133
21607A4133l2316K680J3790M458J0216J3313K284K269N101J324n534j2302K70
21594A9686K1698o212q969k134p398o148J328J654K2506L173P862K2181k145k0891
21580D6191j8180O582J4646j1694r375j3428J4975J5260k076j1612k0803k6972
21568a6486M609J9836q062q715q351j5122o749o649J4031L0866O728k871M61k16
21554C310Q905j3879j8212O608r743J2654P503J7360J8257k0470k1341J4437J7608
21541B2997j6112q504N777M547k4267K4059J0767n355j0115j1494L2960K6053
21529E1313p430j3924l6109q592M784j2493j3090N220Q232K9113j1058J1973K4691
21516C2630j9575j4211J1894l769m62m4606l0496R209M1905K0102l769j809j334
$$ plain form
21607 14133 -18183 -15503 -1713 2745 12961 26274 28558 30827 35928 37252 31718 19416 19686
21594 19686 41384 35172 26203 24069 16671 10523 11851 13505 36011 39184 47046 69227 67082 46191
21580 46191 28011 34593 49239 37545 28170 14742 29717 44977 42901 31289 10486 -16486
21568 -16486 -11877 7959 -103 -8818 -17169 -32291 -39040 -45689 -31658 -792 5936 3065 3526 3310
21554 3310 12215 -1664 -19876 -13268 -23011 -10357 -2854 14506 32763 12293 -9048 5389 22997
21541 22997 6885 -1619 4158 8705 -15562 8497 19264 13909 3794 -7700 25260 51313
21529 51313 43883 29959 -6150 -14742 -9958 -22451 -35541 -30321 -22089 7024 -4034 7939 32630
21516 32630 13055 -1156 10738 6969 6507 -38099 -68595 -59386 -17481 2621 -1148 -2957 -4291
21503d291j2145N541N582j5615k757J3567o719n798p501k197k803J3458M0048
21490A8370J4158R268j7501m1366k6888R141N1777J0352k348k594k0919l3571
21478c2121k803L162o597m647J563k6517L370L8940K4164k754M100J4677J3805
21465B8342j5471M077p774k7084O821J7472M70J3774m021o47j8704J7552J3948
21452B8755J5710J3447l5508j8483J1065M500n021j7307q774R236J8113J5823
21440C1556K243k7009m3119o955L2366K238j5797J349P76K385n083L75P147P79
21426a6749n371k7932k562L6006J7479j1247l170M636pK757J6331p641o080j3098
21412a6648Q573P977j1056L280J29J2874q088r559p246J5585K5652J6307J524
$$ plain form
21503 -4291 -16436 -10895 -5313 -20928 -23685 -10118 -16837 -22635 -30136 -32333 -35136 -21678 18370
21490 18370 32528 41796 24295 -17071 -43959 -34818 16959 27311 24963 22369 1450 -32121
21478 -32121 -34924 -31762 -38359 -43006 -41443 -67960 -64590 -25650 -1486 -4240 -140 14537 28342
21465 28342 12871 16948 9174 -17910 -11089 6383 6853 20627 16606 15959 -2745 14807 28755
21452 28755 44465 57912 22404 3921 14986 19486 14465 -2842 -11616 -2380 15733 31556
21440 31556 33799 6790 -36329 -43284 -10918 -8680 -24477 -23128 -22352 -19967 -25050 -24675 -17528 -16749
21426 -16749 -22120 -50052 -52614 -16608 871 -10376 -13546 -8910 -8917 -6160 10171 2530 -3550 -16648
21412 -16648 -8075 -98 -11154 -7874 -7745 5129 -2959 -12518 -19764 -4179 21473 37780 39304
21399C9304l4147j0250k2911j0420L7956J4871q86l521k0604j7358o384L0690
21387c660K4060k8396K990k2256J6357J8422J8881P314j8450j7943j2142K1291
21375F468K5206o828k9847J5705J2099j2906m002l040P902k0257m304R627n747
21362i924r406L357J2707Q00j1272Q391K528R90K4936K4648J4802l9273m0251
21349a6967k9653o197L660J9991K8632J0345j4467j4909J0004j4364n840K5887
21337c878K1537k4601k9596l2305J7034L5688J7582P218o099j7776Q136k1912
21325b8972r751j352J5354L843l179l647M743J640j1201K4451L5289N233q732
21312B3719l2301j5962k737k5408j251L3816K9415O379J9360l8352j0061J2251
$$ plain form
21399 39304 5157 -5093 -28004 -38424 -468 14403 13517 9996 -10608 -27966 -34350 -3660
21387 -3660 20400 -7996 -5006 -27262 -10905 7517 26398 33712 15262 -2681 -14823 6468
21375 6468 31674 24846 -5001 10704 22803 9897 5895 2855 10757 -9500 -13804 -4177 -9924
21362 -9924 -19330 -15973 -3266 -2466 -13738 -5347 -2819 -1829 23107 47755 62557 23284 -16967
21349 -16967 -46620 -52817 -49157 -29166 -534 9811 -4656 -19565 -9561 -23925 -29765 -3878
21337 -3878 17659 -6942 -36538 -68843 -51809 -16121 1461 8679 2580 -15196 -7060 -28972
21325 -28972 -38723 -40075 -24721 -20878 -24057 -27704 -22961 -21321 -32522 -8071 27218 32451 23719
21312 23719 -8582 -24544 -27281 -52689 -53940 -20124 9291 15670 35030 -3322 -13383 -1132
21300a132K1369J0224n601K747n700k6080q654J7505l195l43j5048j488n22L787
21286a2131p66J0917J01j3100j106O53P348j9274j14Q814k49J0437k2525L1930
21272I35J0908m630j6093N381J7841j5343r297O062n010K6417j1051k1157J0370
21259d667j4756P3K1564l182oJ004k1612K9977O087k1836n686J8564J073J6736
21245B3333J909j4071j816K7878K0815J60j1831j1011J2143J98L483k0276l5092
21232d178R995J3101k608j2328j075J753n70M877o927n026J3362K608n387k6359
21218a8762j6206N575P998o09K0480K2641l2007j2814o598J1855Q196j2473Q430
21205a4294P260l796J1090J2936q785j7297p179J2458J2372K395k49J009k7451
$$ plain form
21300 -1132 20237 30461 24860 27607 21907 -4173 -12827 4678 1483 1140 -13908 -15396 -15918 -12131
21286 -12131 -12897 -1980 -1879 -14979 -16085 -15432 -8084 -27358 -27472 -18658 -18907 -8470 -30995 935
21272 935 11843 7213 -8880 -3499 14342 -1001 -10298 -4236 -9246 17171 6120 -15037 -4667
21259 -4667 -19423 -19350 2214 -968 -974 30 -21582 8395 14482 -7354 -13040 5524 6597 23333
21245 23333 25242 11171 9355 37233 58048 58208 46377 35366 47509 47707 51190 30914 -4178
21232 -4178 5817 18918 16310 3982 2907 4660 4090 8967 2040 -2986 10376 12984 7597 -18762
21218 -18762 -34968 -29393 -21395 -22004 -1524 21117 -10890 -23704 -30302 -18447 -10251 -22724 -14294
21205 -14294 -7034 -10830 260 13196 4411 -12886 -20065 -7607 4765 7160 6911 7920 -19531
21192a9531J2468q037j6108M781M649n599o26L7262K5560J0650l2285r339J1187
21179A5032J248J3035j5319J3750j107n166M618j9146l1220p291j550L669r87
21166c0434J8098J9201P014p229j6633q787J7226J9960o30J806k1712j0212n736
21153a8068J1085j505o56R948K0941L151j6791Q20K440K1354j4824q57j7375j4706
21139a5043J7466J269J1680K122K2724l179r149r507O088R540L0129M626k9125
21126C9641j2559k2063N363n808J811L5565j954J0768L160l3664k5452n543L1649
21113B0914p827j3096q960j5336l259P442J5521m93j67M875j9413j1789r136j964
21099d2688R328K1116j294K0650J6449K872j72O222J6619p07j0392j8578j0434
$$ plain form
21192 -19531 -7063 -15100 -31208 -26427 -21778 -27377 -28003 9259 34819 45469 13184 3845 15032
21179 15032 16280 29315 13996 27746 26639 21473 26091 6945 -24275 -31566 -33116 -29447 -30434
21166 -30434 -12336 6865 13879 6650 -9983 -18770 -1544 18416 17786 19592 -2120 -12332 -18068
21153 -18068 -6983 -8488 -9144 804 21745 24896 8105 8925 11365 32719 17895 17038 -337 -15043
21139 -15043 2423 3692 15372 17494 40218 37039 27890 18383 24471 34011 64140 68766 39641
21126 39641 27082 5019 10382 4574 6385 41950 39996 50764 53924 20260 -5192 -10735 20914
21113 20914 13087 -9 -8969 -24305 -27564 -20122 -4601 -5094 -5261 -386 -19799 -31588 -40724 -42688
21099 -42688 -33360 -12244 -13538 7112 23561 26433 26261 32483 49102 48395 38003 19425 8991
21086H991J4289j1120k3204j6804K0480OJ1978L2198J7658k784K647l746l0306
21073B0283j3366m092J6144K513j1453K3965P468k0449L620L869j3507j8508j0204
21060a3717k802l050r14O624J4532K4869Q038j838j772M477q025j8762j2967k1729
21046b7036m450R418R748l361J4243j429j88J5749J8154n052p62k3779l519q198
21032a0462o923J1749K996k1398k549J0883j0680K2791K1248J1536Q89k5806j6439
21019a2165n263q787J6627K1934R780j7014j4256k881l784J6841J0437J8014q280
21006B1203l3182k1806J979R111K011j5796M469L2965J5219j2o144j809P055j5591
20992c28q27o097j2309j7590J2095J2706J0395j1384k5550R107K3373K0632K5460
$$ plain form
21086 8991 23280 12160 -11044 -27848 -7368 -7362 4616 36814 54472 51688 54335 50589 20283
21073 20283 6917 2825 18969 21482 10029 33994 41462 21013 24633 28502 14995 -3513 -13717
21060 -13717 -16519 -19569 -20483 -13859 673 25542 33580 31742 29970 34447 26422 7660 -5307 -27036
21046 -27036 -31486 -22068 -12320 -15681 -1438 -2867 -3055 12694 30848 25796 25034 1255 -2264 -10462
21032 -10462 -17385 -5636 -2640 -24038 -26587 -15704 -26384 -3593 17655 29191 30080 4274 -12165
21019 -12165 -17428 -26215 -9588 12346 22126 5112 -9144 -12025 -15809 1032 11469 29483 21203
21006 21203 -11979 -33785 -31806 -22695 -20684 -36480 -32011 954 16173 16161 10017 8208 15263 -328
20992 -328 -1155 -7252 -19561 -37151 -25056 -12350 -1955 -13339 -38889 -29782 -6409 14223 39683
20979C9683k1820j8689j1836j6471k934M1046K7677O248p446j2096j2945J2338
20967B2755r616r167N046j5704l022K0924K1348r28m4919m4816j2972L1690L1137
20954h244O816J0785k4180k092J4341k0964k3618N561K0269m074l5904j5948L0319
20941d6933J9247J5604K694j1658r788J0787J9419K635j8295L451J76O520J4590
20928H449r331m148J3795J82j0503j8362J7135K4737L728J5270j5355l0486o57
20915e546q609j617j8795J2511J4554J6588K965n736k059m538P95K069R979K1330
20901C3891p617k4932o861j82j4954P746K0087J7564n840Q62O436J547J2982j7595
20887B3134l163l2170p721O681K7926K321K09J3631q733k7667j8976J7424K0184
$$ plain form
20979 39683 17863 -826 -12662 -29133 -32067 8979 36656 42904 35458 23362 10417 22755
20967 22755 13139 3972 9018 -6686 -9708 11216 32564 31636 -13283 -58099 -71071 -39381 -8244
20954 -8244 -1428 9357 -14823 -16915 -2574 -23538 -47156 -41595 -21326 -25400 -61304 -77252 -46933
20941 -46933 -27686 -12082 -9388 -21046 -30834 -20047 -628 2007 -16288 -12837 -12661 -6141 8449
20928 8449 -882 -5030 8765 8947 -1556 -19918 -2783 21954 25682 40952 25597 -4889 -5546
20915 -5546 -14155 -15772 -34567 -22056 -7502 9086 12051 6315 4256 -282 513 2582 12561 33891
20901 33891 26274 1342 -5519 -5701 -20655 -12909 7178 24742 18902 19764 26200 27747 40729 23134
20887 23134 19971 -12199 -19920 -13239 14687 17008 17217 30848 22115 -5552 -24528 -7104 13080
20874A3080n566R652M828J2666l584m955k824k575j2871m090J4646j4202M806
20861I011j6259k9225j4709J7305L0832K0769k685q627J3227j315k6382j3514
20849b1572L584O783K6258R206j7992k1065n57O252k2480l054K1515o90j1273
20836b5085j5001J321K4057K8986J5065J1003K0988k4142l2303k3080J5130J0819
20824G758l619l2361P097K4126n27R605l882p601n740Q141p490l039R433Q966
20810A0867P793J231J1072J5829R517J8682j9132k6926j2193q711K7q78l878j3332
20796a0032L3317J8242k0603k7969P164J6541N249O519J703Q568J7279k7210l5022
20783f254j4131j3073K0564K2422k056k1101j0897n115l566J6279j1636j8471
$$ plain form
20874 13080 7514 17166 21994 34660 31076 26121 23297 20722 7851 3761 18407 4205 9011
20861 9011 -7248 -36473 -51182 -33877 -3045 17724 15039 6412 19639 18324 -8058 -21572
20849 -21572 -17988 -11205 15053 24259 6267 -14798 -15355 -9103 -31583 -34637 -13122 -13812 -25085
20836 -25085 -40086 -38765 -14708 14278 29343 40346 61334 37192 4889 -18191 -3061 7758
20824 7758 4139 -28222 -21125 3001 2474 12079 8197 596 -5144 2997 -4493 -7532 1901 10867
20810 10867 18660 19891 30963 46792 56309 74991 55859 28933 16740 8029 8056 7178 3300 -10032
20796 -10032 23285 41527 20924 -7045 119 16660 21909 28428 30131 38699 55978 28768 -6254
20783 -6254 -20385 -33458 -12894 9528 7472 -13629 -24526 -29641 -33207 -16928 -28564 -47035
20771d7035m120M135J73K4715M0480J3216J180N49j6887j3471O704M9575J9858
20758G9072m2861k7683l550l7892K384K3563J4241O238O929N562J0609L461k4149
20745A5924l0754L202O272K8508N440r791k821P97j9775j5821P724K1730m911
20732E724n222K8729J0518j416N726j2466M645J3334j9022j2617Q446p613q12
20719A7954K42O340J8646J4239j6858l3725m82J9907j3231n59k871p494j4256
20706a2148K6106J2142l2409j1606R580o185m775J4470R533J0990J9415M4531
20694G9644Q801k4558j2610k0837q919J0402m634o688j8852Q047j519o682N708
20681G303M800J9071P921j3778l3243j9799Q159J2995J4784J4666K8250r806j4164
$$ plain form
20771 -47035 -51155 -47020 -46847 -22132 18348 31564 32744 33293 16406 2935 9639 59214 79072
20758 79072 36211 8528 4978 -32914 -30530 -6967 7274 13512 20441 26003 36612 40073 15924
20745 15924 -14830 -11628 -5356 23152 28592 18801 15980 16777 -2998 -18819 -11095 10635 5724
20732 5724 502 29231 39749 38333 44059 31593 36238 49572 30550 17933 26379 18766 17954
20719 17954 18196 24536 43182 57421 40563 6838 6356 26263 13032 12473 9602 2108 -12148
20706 -12148 13958 26100 -6309 -17915 -8335 -14520 -19295 -4825 4708 15698 35113 79644
20694 79644 88445 63887 51277 30440 21521 31923 27289 20601 1749 9796 8277 1595 7303
20681 7303 12103 31174 39095 25317 -7926 -27725 -19566 -6571 8213 22879 51129 41323 27159
20668B7159j9388k7016k039j9564O846j0272K4400J8485j0978r547R10J8539J851
20655f14k3050p053J3394N2344K1816j6137j0694J2739j8498k1085K024o967q654
20642a0435o24j5273m324J8535Q51l2907j261J9854J9806K9064k895l7861P767
20629i703K2955J3315j3230j0670Q454K632k2732j3504O485J3643J5159L6003
20617D8807l6593L556K3078k4729l0774l217Q948J2754K2163M105n946j6077j7311
20604a1236K024M567j2020m495J3357J937K3293j289j9429j0137J3898J2228L335
20591A6033p241q412P092K6898L080J5413l129m4747P5j306J5288M736N722j367
20577B8135K14k0315j2645m252L1636K2487P639n573k0856o838R730j0995p614
$$ plain form
20668 27159 7771 -19245 -21284 -40848 -34002 -44274 -19874 -1389 -12367 -21914 -21004 -2465 -614
20655 -614 -23664 -30717 -17323 35021 56837 40700 30006 42745 24247 3162 5186 -1781 -10435
20642 -10435 -11059 -26332 -30656 -12121 -11270 -44177 -45438 -25584 -5778 23286 20391 -17470 -9703
20629 -9703 13252 26567 13337 2667 11121 13753 -8979 -22483 -15998 -2355 12804 48807
20617 48807 12214 15770 38848 14119 -16655 -19872 -10924 1830 23993 28098 22152 6075 -11236
20604 -11236 -9212 -4645 -16665 -21160 -7803 -5866 17427 16138 -3291 -13428 470 12698 16033
20591 16033 8792 380 7472 34370 37450 52863 49734 4987 5062 3756 19044 23780 29502 28135
20577 28135 28349 8034 -4611 -8863 22773 45260 52899 47326 26470 19632 29362 18367 10753
20564A0753q265Q344n044j8936J0486j173r487q12n981K5702j2551m685J061L974
20550f614K6869P409M028l101o702l776K061j3786J708q897K355J3919J1000P336
20536C3809p410J2998R802k6837k1320K0212Q36n669J2149j2450k5308o538K669
20523a3057m745J7855J5449j4902j7190p985l689j007j2534j964J4686K2120J5770
20510H807Q115l769J0794o87J0183Q303j8555l4481J2028K1499j3956J9451r605
20497A8127n866J4657K0060N692q515j435j1213j6421P568j3734J1446l1106k7522
20484c8262J7989K7668K5583j125q652j1732n681j691L664K8924k2199k5388J3092
20471B190L1330J4507J182j5745q684q87j7999r091P77j0116j6507l965R708K1585
$$ plain form
20564 10753 2488 10832 5788 -13148 -2662 -3835 -13322 -14134 -20115 5587 -6964 -11649 -10588 -6614
20550 -6614 20255 27664 31692 28591 21889 18113 20174 6388 8096 -801 1554 15473 26473 33809
20536 33809 26399 39397 49199 22362 1042 21254 22090 16421 28570 16120 -9188 -15726 -13057
20523 -13057 -17802 53 15502 600 -16590 -24575 -28264 -29271 -41805 -43769 -29083 -6963 8807
20510 8807 16922 13153 23947 23260 33443 41746 23191 -11290 738 22237 8281 27732 18127
20497 18127 12261 26918 46978 52670 44155 42720 31507 15086 22654 8920 20366 -10740 -38262
20484 -38262 -20273 7395 32978 31853 23201 11469 5788 4097 7761 36685 14486 -10902 2190
20471 2190 33520 48027 49209 33464 24780 23893 5894 -3197 -2420 -12536 -29043 -33008 -23300 -1715
20457a715K298j491K6715M420j4469j3583l1918j751l225k71m471J8549L2393
20444A1481J2404K202N892m4085j2624K4549J8175M093k5973k5047k0314K6740
20432b2507K4288J616J289J8748J0794J460M341m750Q900J340n443n78l96J3432
20418E2534J2793j8370p874m835l7570j4953J6554p239O537K9560k7426k0501
20406b0790K6370K2634j3991q499L6921l0163l5446k232K2017r939P423J821N234
20393A360L0488J2603r95k389p358K406j4771J7967J463k9586J5207P49n293R313
20379C1164n018J8211j4419k4545M195O406p262k0315L64J4086J5002J2906j0310
20366B0465r541q602K951k1864K320Q919J0055M370K0286P062N824N693o380J1246
$$ plain form
20457 -1715 583 -908 25807 30227 15758 2175 -29743 -31494 -34719 -34990 -39461 -20912 11481
20444 11481 23885 26087 31979 -12106 -24730 -181 17994 22087 -3886 -28933 -49247 -22507
20432 -22507 1781 3397 4686 23434 34228 35688 40029 35279 44179 45519 40076 39498 39102 52534
20418 52534 65327 46957 39083 34248 -3322 -18275 -1721 -8960 -2423 27137 -289 -20790
20406 -20790 5580 28214 14223 5724 42645 12482 -22964 -25196 -3179 -13118 -5695 -3874 1360
20393 1360 31848 44451 43456 41067 33709 36115 21344 39311 40774 11188 26395 27144 21851 31164
20379 31164 26146 44357 29938 5393 9588 15994 8732 -11583 -11219 2867 17869 30775 20465
20366 20465 10924 2322 5273 -16591 -14271 -5352 4703 9073 29359 36421 42245 47938 41558 52804
20352E2804j4071l8963N729K2256M0410k6559q945j891m732j2927j2336n788m899
20339i912J7814j086K617j439k0775R020J3060L9726n844m624k1070J3506K344
20326C3337j3633O835Q74j0570J3180K896n827k89p360J1090k1371j4569j6104
20313b1511K062J646k908Q55J7029N417J1602r220L575O718J4361J3432J1727
20300E4785k276r757j6592q308m772j2394M426M625N853m257K4630K5598k342
20287E9219M272Q944o780k2895j437j7418J4268J6185j643m1042n067k856j104
20274B646j2854Q950O204k47n74k0225K5984J8558k7989k8386P00K6070J2094
20261A0931N0472K6518l3799m4927n634K1947K446L288N196n842K721l709k0182
$$ plain form
20352 52804 38733 -230 5499 27755 68165 41606 32661 30770 26038 13111 775 -5013 -9912
20339 -9912 7902 6816 9433 7994 -12781 -3761 9299 49025 43181 38557 17487 30993 33337
20326 33337 19704 26539 27413 16843 30023 32919 27092 26803 19443 30533 9162 -5407 -21511
20313 -21511 -19449 -17803 -20711 -19856 -2827 2590 14192 4972 8547 15265 29626 43058 54785
20300 54785 52509 42752 26160 17852 13080 686 5112 9737 15590 11333 35963 61561 59219
20287 59219 63491 72435 65655 42760 41323 23905 38173 54358 52715 11673 6606 3750 2646
20274 2646 -10208 -1258 4946 4699 4125 -16100 9884 28442 453 -27933 -27233 -1163 10931
20261 10931 61403 87921 54122 9195 3561 25508 27954 31242 36438 30596 33317 29608 9426
20248I426j9251l310K0792K1010J6847l240j3265k2063o950O800J5657L771j3122
20235A3102k947j9818j3137L4042J8666o066r823j6094m777K8444K0542l732q509
20222B9893Q932l543q965j6889J4274K1369Q563j1366j2684M351M761K6281Q180
20209G3157l3909n090K465k904Q352N283N384J2850k3188l4125o822J3925J1787
20196B7165k1433K2086N61K83l238n930q730J5446L3174j0967j6759k2953n203
20183C502J5844j211Q783p657j1601J1090n32L231j339o926j1711J1704j2362
20170H15M828J5098p523J0232R647m403R48k7004j0747K4662J0718j066m130R348
20156C1423k336N751L875J748j6768p278j4979j2605J3836J5204J4360k553J0110
$$ plain form
20248 9426 -9825 -13135 7657 28667 45514 42274 29009 6946 -4 6796 22453 26224 13102
20235 13102 10155 -9663 -22800 11242 29908 23842 14019 -2075 -6852 21592 42134 38402 29893
20222 29893 38825 35282 26317 9428 23702 45071 53634 42268 29584 33935 38696 64977 73157
20209 73157 39248 34158 36623 33719 42071 47354 52738 65588 42400 8275 1453 15378 27165
20196 27165 5732 27818 28379 28662 25424 19494 10764 26210 59384 48417 31658 8705 3502
20183 3502 19346 18135 26918 19261 7660 18750 18218 21449 20110 13184 1473 13177 815
20170 815 5643 20741 13218 23450 33097 28694 29642 2638 -8109 16553 27271 26205 22075 31423
20156 31423 29087 34838 38713 40461 23693 16415 1436 -11169 2667 17871 32231 29678 39788
20143C9788j0704j8771P992Q781P111K702J0354l853j6716j1384K768K6280K515
20130D6863l2662j1257K0475O733k6922j4998J583j976j5143j81L6777K0420J3880
20117D3592r529j0900m886j1683j0428L0354L0862j2701M742j3622R025j3168
20105C1658j2507Q155R051K920k0138J2791o638k3742J9311m826K2742K0792p988
20092E1581k0651o071L1433k0927j3577J8382l412j0215j815j0797p705O787J0858
20079B3871j166K5604l483p281J070j7766l0127L287K9078j2581O526m639J5924
20066B8317K0269J4405L763r37k0798q065Q22j9728j2753K1415M975k7477j8189
20053a3981K2941L6917J2444k3233r513K5425k270j0760q817m182J0002J3457
$$ plain form
20143 39788 29084 10313 18305 27086 34197 36899 47253 43400 26684 15300 18068 44348 46863
20130 46863 14201 2944 23419 30152 3230 -11768 -10185 -12161 -27304 -27485 9292 29712 43592
20117 43592 34063 23163 18277 6594 -3834 26520 57382 44681 49423 35801 44826 31658
20105 31658 19151 27306 36357 39277 19139 31930 25292 1550 20861 16035 38777 59569 51581
20092 51581 30930 24859 56292 35365 21788 40170 36758 26543 24728 13931 6226 13013 23871
20079 23871 22705 48309 44826 37545 38615 20849 -9278 -5991 23087 10506 17032 12393 28317
20066 28317 48586 62991 66754 65817 45019 36954 37776 18048 5295 26710 31685 4208 -13981
20053 -13981 8960 45877 58321 35088 25575 51000 48730 37970 29153 24971 34973 48430
20041D8430J2622j1103l8633j1632L2695J3655j8863l8767l0499j6563J0453J2710
20029c5495J3298J5727J9916j50M906M215j0113j0475R156K9206o4k972K9044
20016F6199J661j887M445M785l0968k7777L509J8338J8857L875J482K268j0431
20003E4356j7545m958n922J1386J5348K6076k860j4397J958K3061N484k5723j7592
19990D8672p768J4693n726r901n536j277J4299j230o353J1210m476q306J4939
19977E3240Q322n809O298K181J6233j5883j6435O196j314o835n824j8322j7254
19964D794N628L704K475L2751K0340j3134O51L53N963m194M400j8550L261J5218
19950F3660L6299k230k1051o080j1910l4160O594K9221n045l6328p650K398N37
$$ plain form
20041 48430 61052 49949 11316 -316 32379 46034 27171 -11596 -42095 -58658 -48205 -35495
20029 -35495 -22197 -6470 13446 13296 18202 22417 12304 1829 10985 40191 40127 37155 66199
20016 66199 67860 65973 70418 75203 44235 16458 19967 38305 57162 61037 62519 64787 54356
20003 54356 36811 31853 25931 37317 52665 78741 75881 61484 63442 86503 91987 66264 48672
19990 48672 40904 55597 49871 39970 34434 33157 47456 46226 39873 51083 46607 38301 53240
19977 53240 61562 55753 62051 64232 80465 64582 48147 54343 53029 46194 40370 22048 4794
19964 4794 10422 14126 16601 49352 69692 56558 57209 57562 63525 59331 63731 45181 48442 63660
19950 63660 99959 97729 76678 70598 58688 24528 31122 60343 55298 18970 11320 13718 14255
19937A4255l413J562N719P327q484J1598j952j6616p949L137L0107K5356q246
19924E2401m209j3312J1488J345J0704j8019P301J4953J4079P821k6429Q994K910
19911G0027p925N772J7322r330l9237k5005J9349n629L1445L2704k7140j8221
19899D4132j596l0125J1824R241k65m174Q540J9249P38j570j0468K0347J0729
19886G6602J0087p600r338K6451J918k0821p824l3128N895M344M683q957j9574
19873B2738J0907K2798l929j2695L591k5203J4160L4912k183k5184j7770m378
19861A7764P752K91k5862r628J5356J9103Q050L3353R860N342j4187j8529j045
19848D7620j7118j2600k45J5769J7218J1057j5506k150o518j2423R781j539k6984
$$ plain form
19937 14255 10842 12404 18123 25450 16966 28564 26612 9996 2047 5184 35291 60647 52401
19924 52401 48192 34880 46368 47713 58417 40398 47699 62652 76731 84552 58123 67117 70027
19911 70027 62102 67874 85196 75866 36629 11624 30973 25344 56789 89493 62353 44132
19899 44132 42536 12411 24235 33476 33211 29037 37577 56826 57564 55994 45526 65873 76602
19886 76602 86689 79089 69751 96202 98120 77299 69475 36347 42242 46586 51269 42312 22738
19873 22738 33645 56443 52514 39819 43410 18207 32367 67279 65096 39912 22142 17764
19861 17764 25516 25807 -55 -9683 5673 24776 32826 66179 76039 81381 67194 48665 47620
19848 47620 30502 17902 17657 33426 50644 61701 46195 44045 37527 25104 34885 33346 6362
19835F362K224K1756N796p347K4822Q081L4182r401j2880j3757M58k94k90J2204
19821G1916j4854r009j6772K2710J2374k3430l0093J1462K636k606N536J6350
19809D6220J905N711K5116k214k2016P357R928n732q788R333M982o446k0012j7751
19795B7593Q60kj2878P433K6391O684l210j8610k1748j1599R229J3888J7747m526
19781C7252J3885K1110J0090j0966j7594r026K4178K4826J1798k120j8760k2528
19769F2145k2847o099K0164m645p054Q693Q743O476j0407n831J5686j8897N99
19756D6726K4119J0405K0400n877k1407k3027K784K3633j1373q928l248l243M0624
19743I1588j99k1772p978N937J3954Q714L209o229J6013l7040k8739l299R672
$$ plain form
19835 6362 8586 30342 36138 28791 53613 61694 95876 86475 73595 59838 60296 60002 59712 71916
19821 71916 57062 48053 31281 53991 66365 42935 12842 24304 26940 24334 29870 46220
19809 46220 48125 53836 78952 76738 54722 62079 72007 66275 57487 66820 71802 65356 45344 27593
19795 27593 28453 28451 15573 23006 49397 56081 52871 34261 12513 914 10143 24031 41778 37252
19781 37252 51137 72247 82337 71371 53777 44751 68929 93755 105553 103433 84673 62145
19769 62145 39298 33199 53363 48718 41664 50357 59100 65576 55169 49338 65024 46127 46726
19756 46726 70845 81250 101650 95773 74366 51339 54123 77756 66383 57455 54207 50964 91588
19743 91588 91389 69617 61639 67576 81530 90244 93453 87224 103237 66197 37458 34159 43831
19730D3831j5287K5435J8683Q493r16j5176k0551Q276m639n476m973J0780K3019
19717G1499K034j7726j568K9456J1450M835K466j6782k1323j1112O822k0149k279
19704C7623J0735K8452p192P204J9276k624k8561k8566N394m154K1255L4021J7089
19691A09952J500r475j695k570J7814j723p287J97L0341Q712J1975J4958O2161
19678B34860J12105J43499J46506N9824j2146p9151j23813r4213m8575j58L7450
19667C76188m004K4519P9055J18159P5641L851m5900o7586j4735q825j0271n0087
19655D76005p3505q9715j02579m0999j2581o32p613j3836k3274j7624J9837Q05
19643A14289J0312J391O423J1409o249j3705K8242L6416K4424L7710L5858K1321
$$ plain form
19730 43831 28544 53979 72662 81155 80239 65063 44512 52788 48149 42673 37700 48480 71499
19717 71499 73533 55807 54239 83695 95145 99980 102446 85664 64341 53229 60051 39902 37623
19704 37623 48358 76810 69618 76822 96098 93474 64913 36347 41741 37587 58842 92863 109952
19691 109952 111452 101977 100282 97712 115526 113803 106516 106713 137054 145766 157741 172699 234860
19678 234860 346965 490464 636970 696794 684648 605497 481684 387471 338896 338738 376188
19667 376188 372184 396703 475758 593917 669558 673409 627509 559923 545188 536363 526092 476005
19655 476005 402500 312785 210206 169207 156626 155994 148381 134545 111271 93647 113484 114289
19643 114289 124601 125992 132415 143824 137575 123870 152112 188528 212952 250662 286520 307841
19631C07841j2984n1403n8107j2657K6173M5742L4551N5474J11925J43152J57804
19620G47511J15138J9426l9108o7478m6828l4100l3382o1181l9628J241M2225
19609F03836Q925j9663m1180j06048r3505n2234n4040k5740K4294J1915k3306
19598B33254k7110k567j5707j9636j3299k5677Q661j087o964q441P14L399k4411
19585A01129m2356L2147J7747J7711q783K3019R124n777j7824m588j2532j8268
19573I0749j707P198j0717L805K867l611J6925L1409J583k9903r567o381o872
19560H5778Q356k53j141N956k3977k1413K4374J4269o454K4047l900rj046j358
19546A03229K3361j5379k6909k2320j4943J8152K71K0487J2160o268j2627j2885
$$ plain form
19631 307841 294857 243454 185347 172690 198863 244605 279156 334630 446555 589707 747511
19620 747511 862649 882075 842967 775489 728661 694561 661179 599998 560370 561611 603836
19609 603836 612761 593098 551918 445870 352365 300131 246091 220351 244645 256560 233254
19598 233254 206144 203577 187870 168234 154935 129258 137919 136832 129868 121427 122141 125540 101129
19585 101129 58773 90920 108667 126378 117595 140614 149738 143961 126137 121549 109017 90749
19573 90749 89042 96240 85523 89328 92195 88584 105509 136918 138501 108598 99031 92650 85778
19560 85778 94134 93881 92740 98696 74719 53306 77680 91949 85495 109542 105642 105633 104587 103229
19546 103229 126590 111211 84302 61982 47039 65191 65462 85949 98109 91841 79214 66329
19534F6329m816j500J0327J7915m638O990L4102J6805k7333k7677j9391r755K625
19521E9983K5832N799P465o025l909J852O231P372J2836l5716k7812K1042K0773
19508I5723K692K1160J9363K1574N410k6165k0691r717K1368L093k3447Q82o3
19495A11182q407o000J5440J3162K917R28j671j0864j0457n234J4037n717Q578
19482A17894R325j9329j2465J6631J834M334j89j6824j7853n518J95K78R26L475
19468H2714M3180M1866k020j1975k8618j1395j1680P793J9873j1423j2268R369
19456A15416J2830Q831O146j3782J0261J2910m130m0745j3343J2047m307j2K2639
19443A24761J1161J9939k371r434j815o792k1490K2274L3642N3394N7597M7280
$$ plain form
19534 66329 61513 60013 70340 88255 83617 90607 124709 141514 114181 86504 67113 57358 59983
19521 59983 85815 91614 99079 93054 89145 90997 97228 104600 117436 81720 53908 74950 95723
19508 95723 98415 119575 138938 160512 165922 139757 119066 109349 130717 133810 110363 111245 111182
19495 111182 102775 96775 112215 125377 128294 129222 127551 116687 106230 100996 115033 109316 117894
19482 117894 127219 107890 95425 112056 113890 118224 118035 101211 83358 77840 78035 78313 79239 82714
19468 82714 125894 167760 165740 153765 125147 113752 102072 109865 129738 118315 106047 115416
19456 115416 128246 137077 143223 129441 139702 152612 148482 107737 94394 106441 102134 102122 124761
19443 124761 135922 155861 153490 144056 142241 135449 113959 136233 169875 223269 280866 328146
19431C28146R9885O8781K9416J0038l0165l2527l1373L780K2950N3200Q9742Q3925
19419F95798N2014J7150l2170n6719q1669n8314n8865n4439j1926R575P324j1317
19407D16442m0188l5569L414j5160m1943k7573o995J8573n278j6967m552j6169
19395B28035q108q433M119J160j8192J0350L3126M8133J3248J651L9291N1616
19383C95996N7746P2072J0770k4646K8033M9871P3609R7177Q8850J12307Q3059
19372A044844J7260m941p8729j04564q6264n1395j4891M4130P7276Q1751O3088
19361I87565o032r4614j23951j16313p4419o1976p2850p9269l5764N276m614k7423
19349B95616o999k3933l5435j1791j4807l701O204r407R67J4352J1153j2993j562
$$ plain form
19431 328146 428031 496812 526228 536266 506101 473574 442201 445981 468931 522131 611873 695798
19419 695798 747812 764962 732792 676073 594404 536090 477225 422786 410860 420435 427759 416442
19407 416442 376254 340685 344099 328939 286996 259423 252428 271001 265723 248756 244204 228035
19395 228035 219927 211494 215613 216773 198581 208931 242057 290190 303438 305089 344380 395996
19383 395996 453742 525814 536584 511938 539971 589842 663451 760628 849478 961785 1044844
19372 1044844 1062104 1057163 978434 873870 787606 736211 721320 765450 842726 924477 987565
19361 987565 981533 886919 762968 646655 572236 510260 437410 358141 322377 327653 323039 295616
19349 295616 288617 264684 229249 217458 202651 198950 205154 195747 196714 211066 222219 209226 207664
19336B07664k8184j3292j3640k595L4621j451j8554p0J4932J3447J2924P910j639
19323B12073j9800k4203P79J0003L696Q297K4905K4976l357k0109J6540J2275
19311B46075p504j7073Q444L7643J9151q635P453J5736L947j1090k2184j2962
19299B59001j4962j6715l088k27l0365K025J1756J1271j4281k1278m529Q639O130
19286A93377L643J413M476P653K0198Q773j0246p425k3605m91N787R748M834j8486
19272A99649K183L192n174j2717j0700k666J3784K6752L0726K6733K6276O927
19260C04965m926J8930L9381N840n181K2158O2480R8494J25664J04591M0282m1170
19248G71508j08656q2412l0247p068J5022M8958J34231J30158L5242l5152n9124
$$ plain form
19336 207664 179480 166188 152548 149953 184574 183123 164569 164499 179431 192878 205802 213712 212073
19323 212073 192273 168070 168849 178852 182548 190845 215750 240726 237369 217260 233800 246075
19311 246075 238571 221498 229942 267585 286736 278101 285554 301290 305237 294147 271963 259001
19299 259001 244039 227324 224236 224009 193644 195669 207425 218696 204415 183137 178608 187247 193377
19286 193377 197020 198433 202909 210562 230760 239533 229287 221862 198257 197766 203553 213301 218135 199649
19272 199649 201832 205024 199850 187133 176433 173767 187551 214303 245029 271762 298038 304965
19260 304965 300039 318969 358350 364190 359009 381167 443647 542141 667805 772396 812678 771508
19248 771508 662852 580440 550193 543125 558147 607105 741336 871494 906736 871584 812460
19237H12460l3839O841M2426O0106K0666m0750q5754o0412l2943k8417J5340O2658
19225G38382J11834J01108L0208n2782r1556j04903n3813j8017n125k4031k1808
19214F09497K2076J6849J0797K2803K0693K3235K5143K4959L3358K9604J7724
19203H56738M5967N9469O0508Q5743J05223J03018O3213M7885P2352J06815J56669
19192A763600K48432L21092L82446L44616K36198J79021J89338K77589L39768
19183D282100L84340N47215Q30451J152926J592873K482765L919554M639649L136535
19174B2968408Q51363r47241j349745K3777K529851N996124J1683877K1959578
19166F3715992L4836900L4526046J7498336J070090q676500j3491346j6320544
$$ plain form
19237 812460 778621 785462 827888 887994 908660 867910 782156 721744 688801 660384 675724 738382
19225 738382 850216 951324 981532 928750 837194 732291 678478 660461 655336 631305 609497
19214 609497 631573 648422 659219 682022 702715 725950 751093 776052 809410 839014 856738
19203 856738 902705 962174 1022682 1108425 1213648 1316666 1379879 1427764 1500116 1606931 1763600
19192 1763600 2012032 2333124 2715570 3060186 3296384 3475405 3664743 3942332 4282100
19183 4282100 4666440 5213655 6044106 7197032 8789905 11272670 15192224 19831873 22968408
19174 22968408 23819771 22872530 21522785 21546562 24076413 30072537 41756414 63715992
19166 63715992 98552892 133078938 150577274 151647364 142970864 129479518 113158974
19159A13158974j8488711k0469657j7859583j0327993k104855M881941P627821
19152E6417937L639827l097871q757638j1261805r653161o616480m275704k720129
19144A3674976j746269j118153o52926k93419o2850R6224J82990J72260J43076
19135A0395909Q3267P609P6576K76061O08967J139024J839822K824196M585778
19126B1837209P632646J2086446J4949975J1119569K767060m819949q764581p082882
19118D9725493j699020N134427J4102653K6591829L6673762L6662006L6575699
19111B03766849L4566880J2942451j6483661l9013937n1015841m5438110l0014787
19104F9309844j6848775q044063j493580K644906J745631k295844o038451p990733
$$ plain form
19159 113158974 94670263 74200606 56341023 46013030 43908175 48790116 56417937
19152 56417937 60057764 56959893 48202255 36940450 27287289 20670809 16395105 13674976
19144 13674976 11928707 10810554 10157628 9864209 9801359 9897583 10080573 10252833 10395909
19135 10395909 10479176 10486785 10563361 10839422 11448389 12587413 14427235 17251431 21837209
19126 21837209 29469855 41556301 56506276 67625845 70392905 65572956 56808375 49725493
19118 49725493 48026473 53160900 67263553 93855382 130529144 167191150 203766849
19111 203766849 238333729 251276180 234792519 195778582 144762741 99324631 69309844
19104 69309844 52461069 44417006 42923426 45568332 47313963 45018119 38979668 30988935
19096C0988935p123363n011468l396008k446613j915876j486792j045772p28363
19088G834680m75122k85963k33192k75061m01371n16959n75955n59923m67714
19079D043420l85021l70667l19185k40102k03897j66285j22463j06997n8512n7530
19069B012761l6863r01j1447q6208j24277j49906j45561j15796q6321o1391k8784
19058A165306l9350o1593k8995j6079m9556j3700l8091l6551l9273l4928n1687
19047G55503m2532k7648j5108k4408Q477Q635k974o175n125m4759l6549O075P523
19034E80935k8367m7526O392J6904J7206L510j9652j332r409k5488j6478p259
19022D69436j3764J2695k313P600K7561J539q330j6153J6947K9639J1235k880
$$ plain form
19096 30988935 23865572 18854104 15458096 13011483 11095607 9608815 8563043 7834680
19088 7834680 7359558 7073595 6840403 6565342 6163971 5647012 5071057 4511134 4043420
19079 4043420 3658399 3287732 2968547 2728445 2524548 2358263 2235800 2128803 2070291 2012761
19069 2012761 1975898 1974997 1963550 1877342 1753065 1603159 1457598 1341802 1255481 1194090 1165306
19058 1165306 1125956 1064363 1035368 1019289 969733 956033 917942 881391 842118 807190 755503
19047 755503 712971 685323 670215 645807 654284 662919 659945 653770 648645 603886 567337 573412 580935
19034 580935 552568 505042 511434 528338 545544 549054 529402 528070 518661 493173 476695 469436
19022 469436 455672 468367 466054 473654 501215 502754 494424 478271 495218 524857 536092 533212
19010E33212K7158J4651P328K3646L4264K1478L3912P9706J09054N8898m906k4014
18998I14387q0192j13645p4364l4146J1427L8410K1074J4030J7150K8378J5657
18987G58166R668L2488K8527O3767J14303N3707j18l7087j13054j00862n2115
18976G57390k1742l266J1472K5302M5487R0706J36838J04642M3588k1217q8355
18965A080845p4983m6448l6793m20K4047L3956K0075M1382Q1132P4711R8952J05648
18953A402104J47386K31369L24636K39944J08895k3656p5877J1626P9113J34466
18943B580006K33907L19042K85391K60343L53033L93153M01489M28173M55992
18934E710529M56369M79813N55578P24905J030349J531144K399104L773897N772815
$$ plain form
19010 533212 560370 575021 582349 605995 640259 661737 695649 775355 884409 943307 938401 914387
18998 914387 834195 720550 646186 612040 623467 661877 682951 696981 714131 742509 758166
18987 758166 767834 800322 828849 892616 1006919 1060626 1060508 1023421 910367 809505 757390
18976 757390 735648 732382 743854 769156 814643 905349 1042187 1146829 1190417 1169200 1080845
18965 1080845 1005862 959414 922621 922201 946248 980204 1000279 1041661 1122793 1197504 1296456 1402104
18953 1402104 1549490 1780859 2105495 2345439 2454334 2430678 2354801 2366427 2445540 2580006
18943 2580006 2813913 3132955 3418346 3678689 4031722 4424875 4826364 5254537 5710529
18934 5710529 6166898 6646711 7202289 7927194 8957543 10488687 12887791 16661688 22434503
18925B2434503O591809N813652M947600K366589M33839Q76527L494311R804586
18917E6763416K0728428L4158404L9091905L5806321L1674038J2810753r643099
18910B21390166k1258564l2159073l5427047k9798474k3951502j5886164o430123
18903E6479219J330295M707429M037875J679359l757267q491573j0489677j0582567
18895C4913093q493724n695104l619594k330399j532288j016993p33813n22642
18887A0968536l55302k68766j47293j07516l1427M3327R8502J97572M04665Q21778
18877A1624076J487317K637586M593043P349668R069906Q086313O465791K672751
18869E3986451j609490k887741j461938L822132J0808715J3480524J6013345J9455638
$$ plain form
18925 22434503 29026312 34839964 39787564 42154153 42587992 43464519 46958830 56763416
18917 56763416 77491844 111650248 150742153 186548474 218222512 231033265 221390166
18910 221390166 200131602 167972529 132545482 102747008 78795506 62909342 56479219
18903 56479219 57809514 62516943 66554818 68234177 64476910 55985337 45495660 34913093
18895 34913093 26419369 20724265 17104671 14774272 13241984 12224991 11491178 10968536
18887 10968536 10613234 10344468 10197175 10089659 10058232 10101559 10200061 10397633 10802298 11624076
18877 11624076 13111393 15748979 20342022 27691690 36761596 44847909 51313700 53986451
18869 53986451 52376961 49489220 48027282 51849414 62658129 76138653 92151998 111607636
18861A11607636J8411907J1473838L962396n004791j8264286k3630082k4859745
18854G3696873k1774865j4475480p797778l259016p71252j88419k04143j295647
18846B3930273k772298l366261l472613k972972k112142j421048r72090o57357
18838F183492m90218m26966l64006l51659l72125l42305l57282l33559k78064
18829B867308k73085k64546j94039j65153j38689j22734j05865q0743q9852j06136
18819A326466j09930q0391m9809m4441o6609q2059l0618J106j739l4550j6421
18808H11005j4225k2871l3338m6773l0659J8625O178k4763j6327k3679k1765n939
18796E95469R241k2294k8591j7472K8956J066m554R21j0566J2747N705k3082l1395
$$ plain form
18861 111607636 130019543 141493381 145455777 140450986 122186700 98556618 73696873
18854 73696873 51922008 37446528 29648750 26389734 25618482 25430063 25225920 23930273
18846 23930273 21157975 17791714 14319101 11346129 9233987 7812939 6840849 6183492
18838 6183492 5693274 5266308 4902302 4550643 4178518 3836213 3478931 3145372 2867308
18829 2867308 2594223 2329677 2135638 1970485 1831796 1709062 1603197 1522454 1432602 1326466
18819 1326466 1216536 1136145 1086336 1041895 975286 893227 862609 863715 861976 827426 811005
18808 811005 796780 773909 740571 693798 663139 681764 687942 663179 646852 623173 601408 595469
18796 595469 604710 582416 553825 536353 565309 566375 561821 562742 552176 564923 570628 547546 516151
18783E16151j5861k43k4833L954O728L5837j0021j8945k8050r736N236l2731j2353
18770D15133N873j027J9814M1295J8990N2721P8272K7858j3030l1333m0769n7094
18758E16703m0218N944K6588K6792J1990j7611l1738K709r802r87r532k5074n440
18745D50324p843j3686j018K4754p563K844N370J081J0475N179r69j8279m584
18732D46085K7635L4736L99k1549r800k0700J983Q073J5942q393j0595k761N777
18719D66832L5403K0689J2648L5958M877n611J1953K5341K7307K1865L8406N3654
18707G49322M5547M5531Q1945J77197K15337J60446J19399J24680K25193L21603
18697B266200K31897J16380N4351Q852M4494M5683k5870n2845J2866J56809L36763
$$ plain form
18783 516151 500290 500047 475214 479168 485896 521733 511712 492767 464717 454981 460217 427486 415133
18770 415133 421006 419979 439793 481088 500078 552799 631071 658929 645899 614566 573797 516703
18758 516703 476485 482429 509017 535809 547799 530188 498450 501159 491357 490370 480838 455764 450324
18745 450324 442481 428795 427777 452531 444968 447812 453182 454263 464738 469917 468948 450669 446085
18732 446085 473720 508456 508855 487306 477506 456806 458789 466862 482804 474411 463816 461055 466832
18719 466832 502235 522924 535572 571530 576407 570796 582749 608090 635397 657262 695668 749322
18707 749322 794869 840400 922345 1099542 1314879 1475325 1594724 1719404 1944597 2266200
18697 2266200 2498097 2614477 2668828 2677680 2722174 2767857 2741987 2689142 2702008 2858817 3195580
18686C195580N88776R07011J098274J094878J057508J237175J870988L348563
18678A4398753O349295J2364505K1288975K0330983N649206o280351j5978174
18671E8123192j6631379j0328307m582231o66277K838047P757437J6600149K7742716
18663H0853347K2699084R156444L361235R04450l078994r962994j6602366k1473027
18655F5857179j8103607j0802082n008050r53309K978890R107431J9282729K6073753
18647H8432934J2370154m533579j8092038k4453412j8875005j0979667o152615
18640A7716772l634500k311185j600053j195993r63735q05127p25589o33810n44470
18631E302310l53514j94621j21226j35927q0495L9090K9253j81867l78274n19842
$$ plain form
18686 3195580 3784356 4691367 5789641 6884519 7942027 9179202 11050190 14398753
18678 14398753 20748048 33112553 54401528 74732511 80381717 74101366 58123192
18671 58123192 41491813 31163506 26581275 25914998 28753045 36510482 53110631 80853347
18663 80853347 103552431 112708875 116070110 116974560 113895566 103932572 87330206 65857179
18655 65857179 47753572 36951490 31943440 30990131 33969021 43076452 62359181 88432934
18647 88432934 100803088 96269509 78177471 53724059 34849054 23869387 17716772
18640 17716772 14082272 11771087 10171034 8975041 8011306 7206179 6480590 5846780 5302310
18631 5302310 4948796 4754175 4632949 4497022 4416527 4455617 4484870 4303003 3924729 3404887
18621C404887m55004k88996k40399k21039k51704k36759j83947j48641r8422n4935
18611A225041n2625l1563m0004r346j2313J383k1081j7708L385j8796j2179J8089
18599A032283L5751M6629L6563K0235o9323j10573q7961j07903p9819n0798K558
18588F67642O9950J33510P6814O569o4641j43060j25484q7751o0295l8598k8651
18577D06005m1035k3310k5533j3021j5716O259o930j6993j0540M17J4945j807
18565B72741q864k6530k0617R806j5958k8686j1524J6828N1548L8452K5624K5272
18553C28092j2841k9135k5110m4270k6297O289j7802K87M7511K3130l1830r649
18541B08375K1812Q543M2596L2822L7332L16k6082j5450M135O651L763n037j3810
$$ plain form
18621 3404887 2949883 2660887 2420488 2199449 1947745 1710986 1527039 1378398 1279976 1225041
18611 1225041 1172416 1140853 1100849 1091503 1079190 1080573 1059492 1041784 1045169 1026373 1014194 1032283
18599 1032283 1068034 1114663 1151226 1171461 1102138 991565 903604 795701 715882 665084 667642
18588 667642 737592 871102 947916 954485 889844 746784 621300 533549 473254 434656 406005
18577 406005 364970 341660 316127 303106 287390 293649 286719 269726 259186 259603 274548 272741
18565 272741 263877 237347 216730 226536 210578 181892 170368 187196 238744 277196 302820 328092
18553 328092 315251 286116 261006 216736 190439 196728 178926 179213 226724 249854 218024 208375
18541 208375 230187 238730 281326 314148 351480 351796 325714 310264 314399 321050 324813 319776 305966
18528C05966j3299j1492j865n26J2025J9270L5924J9388K2161j2984n4373j8238
18516C01957n943j2969j2461k7869k1902n656L1930N7662M2217P242j761j6680
18504C35767j2315L195L5125K448N622l1121j9353j5014R62p781R366L3397K1594
18491C61892K2836k9670r493K2551M968R246k376n666k53K7321N1243M1277j1569
18478D82307n433q897k1877J387l50J9879K3415Q83J6337J8780J1090K541K255
18465E42317J703J7572J5846N6001R4663N7646M2970n301L722N226k4805j2886
18453G94674N1139O5021J25610J30662J23157R2284R5986J78268K52645K10131
18443B119577R1897J09782J49671L01284O39229J241666J745862R50700M203p36237
$$ plain form
18528 305966 292667 281175 279310 278784 290809 310079 346003 365391 387552 374568 320195 301957
18516 301957 296014 283045 270584 242715 220813 215157 247087 304749 346966 354208 352447 335767
18504 335767 323452 326647 361772 364220 369842 338721 319368 304354 305316 297535 306901 340298 361892
18491 361892 384728 355058 345565 368116 373084 382330 379954 374288 374035 401356 452599 493876 482307
18478 482307 476874 467977 446100 447487 447137 467016 490431 491314 507651 526431 537521 540062 542317
18465 542317 544020 561592 577438 633439 728102 785748 828718 823417 827139 832365 807560 794674
18453 794674 845813 910834 1036444 1167106 1290263 1382547 1478533 1656801 1909446 2119577
18443 2119577 2211474 2321256 2470927 2772211 3411440 4653106 6398968 7349668 7353871 6617634
18433F617634j050450o56072j7873N59696J103978J761909K944384M647020M637637
18424B0547863J252949j414619l457386l605119k088747q51404k66879J02057
18416A0218715N33916J191883K054738L034327L741336M367436N767556Q562135
18408C9472042J4157912K5295986M7058822P1462758O5977321N1201062Q694191
18401C23320094m1482217n9887683o3217525m6619840k3629987n867523J0739151
18394I3354470L1197137L9713310J6186358n548563k1781718k0259462M696627
18387A37558159K6991620J1376839j1875597l0846575m0170359l0829013j8393814
18380D3811260j0832383o850677m459150k829835j716000j213890r80051q13084
$$ plain form
18433 6617634 5567184 4911112 4893239 5452935 6556913 8318822 11263206 15910226 20547863
18424 20547863 21800812 20386193 16928807 13323688 11234941 10383537 10116658 10218715
18416 10218715 10752631 11944514 13999252 17033579 20774915 25142351 30909907 39472042
18408 39472042 53629954 78925940 125984762 197447520 263424841 314625903 323320094
18401 323320094 281837877 221950194 158732669 112112829 88482842 82615319 93354470
18394 93354470 124551607 164264917 180451275 174902712 153120994 132861532 137558159
18387 137558159 164549779 175926618 164051021 133204446 93034087 62205074 43811260
18380 43811260 32978877 26128200 21669050 18839215 17123215 15909325 14929274 14116190
18372A4116190k41004P47945P44654l00977j188162k034746j971954j417580r37149
18363G517217o06669l35711j20581L3900K51283N23508J096857K448125L804672
18354A4612601J867660p03101k663791l775537k893749j599362q13285m13130
18346C618306k27103j64070j30965k04518k82081l24770l21094k27020j60172
18337A576513p8861o9508q3332j08876q3803p4007n6058p4564n6858p565J617
18326H84698l956l5795n7211p6508l2319l0315k9055j8962k8437J2264j1867r774
18314E62763K2667N3450O2412l391j0605l5291l8299o47J1568M0265J6933P741
18302F89566l258J5501J0919j3042o8811p2676l0843O338l8052k4447Q426N4893
$$ plain form
18372 14116190 13875186 14623131 15367785 15066808 13878646 11843900 9871946 8454366 7517217
18363 7517217 6910548 6574837 6454256 6488156 6739439 7262947 8359804 10807929 14612601
18354 14612601 16480261 15777160 13113369 9337832 6444083 4844721 4031436 3618306
18346 3618306 3391203 3227133 3096168 2891650 2609569 2284799 1963705 1736685 1576513
18337 1576513 1497652 1428144 1344812 1235936 1152133 1078126 1022068 947504 890646 883081 884698
18326 884698 880742 844947 787736 711228 678909 648594 619539 600577 572140 584404 572537 562763
18314 562763 585430 638880 701292 697901 687296 652005 613706 613059 624627 664892 681825 689566
18302 689566 686308 701809 712728 699686 630875 558199 527356 533694 495642 471195 479621 534514
18290E34514L5103J6571m6528o3486k6113O9268J32926J26902K9184m9790p6420
18279F82131p8011l8925k9631N257N4704J02778J34248Q1249k0486r5587j48583
18268F49144j23787j16565r1850k1031k5542m5487K914J4289L4433J1895j3377
18257B75036l0974r677l926k5216l0869p965m493J9270P0027L9826M5970L9962
18245C76971J1923K3888K1331L0818J14073K39977K25455Q5602o6667j70125j82864
18234G10382j35449j3493N2838J54777J99057Q5352l9886j47650j82823r7674
18224E85431p169J16525J79316J68132J56902l7763j54592k00399j90376j25868
18214D90139j13457r5167o6413l7537l8527r740R902j8662m684l465l477P26k0931
$$ plain form
18290 534514 569617 586188 539660 476174 450061 519329 652255 779157 808341 758551 682131
18279 682131 604120 565195 535564 540821 595525 698303 832551 913800 893314 797727 649144
18268 649144 525357 408792 316942 295911 270369 224882 227796 242085 276518 288413 275036
18257 275036 244062 234385 230459 205243 174374 166409 161916 181186 251213 291039 337009 376971
18245 376971 388894 412782 434113 464931 579004 818981 1044436 1130038 1063371 893246 710382
18234 710382 574933 561440 614278 769055 968112 1053464 1013578 865928 683105 585431
18224 585431 578262 694787 874103 1042235 1199137 1161374 1006782 806383 616007 490139
18214 490139 376682 281515 215102 177565 139038 129298 139200 120538 115854 112389 108912 109638 88707
18201H8707m072L8305N6975L9939j3028n6233m1524k6784j1478k169l590J9385
18189H4433Q554j6067j0336K27L759K5856m1761j1152O630j5976j6874k732j237
18176A3324m615J6905J2934J2558r672J6548m464j7934K7660J4649oM761l9717
18163D2931k5521J0814N844m18m878k3458r8L0679J5239j8501L0309N3318R69
18150A17229M301J2448M229j8172n053j234K1748R783l829m787j2754J409J4350
18137A39668M153J8851O369j9419O487O7915K0705J0707K0621J7339M0101J5992
18125C49489L5875K6310M9762L1686L0921O7146N2587P3837J20050J85860K44981
18114A268504L16346L96570N09158P32639J119804J790594L278494O684205J3240103
$$ plain form
18201 88707 84635 122940 179915 219854 206826 150593 109069 82285 70807 68638 65048 84433
18189 84433 92987 76920 66584 66811 70570 96426 54665 43513 50143 34167 17293 14561 13324
18176 13324 8709 25614 38548 51106 41434 57982 53518 35584 63244 77893 77887 82648 42931
18163 42931 17410 28224 34068 33650 28772 5314 5216 35895 51134 32633 62942 116260 117229
18150 117229 121530 133978 138207 120035 114982 113748 135496 145279 141450 136663 123909 125318 139668
18137 139668 143821 162672 169041 149622 156109 224024 244729 255436 276057 293396 333497 349489
18125 349489 385364 411674 461436 493122 524043 591189 643776 717613 837663 1023523 1268504
18114 1268504 1584850 1981420 2490578 3223217 4343021 6133615 9412109 16096314 29336417
18105B9336417J3772707K585435m490910j1471249j1916703p152061l685513k045445
18097D932678j240302p97682n13666l21155k04182j15037m6982m5136j25502j89442
18087A333592k13111j88264j39082q0440l0357l3495k1682K6905R5148J53626
18077I02840J77010J09496l5133j58711k00092j73513j52379j16022l9525m612
18067C09359J2244R673M8247O3100Q3981J8525k5663q1181q4727p2529n0485n1758
18055A78786l1177r933J7775o587l2532j2729l8007L212K427o005l0792M391M412
18042D3241k277k1010n433J6416J0589j587J174J060m896l529Q59J6040r122r139
18028C2386M935m644k3575O575p009j8011n226L011N238J0450o15J4013n103k29
$$ plain form
18105 29336417 43109124 45694559 41203649 29732400 17815697 10663636 6978123 4932678
18097 4932678 3692376 2894694 2381028 2059873 1855691 1740654 1693672 1648536 1523034 1333592
18087 1333592 1120481 932217 793135 712695 682338 648843 627161 654066 749214 902840
18077 902840 1079850 1189346 1154213 995502 795410 621897 469518 353496 313971 309359
18067 309359 321603 331276 379523 442623 526604 545129 519466 438285 353558 281029 230544 178786
18055 178786 147609 137676 155451 148864 116332 103603 65596 68808 71235 65230 34438 38829 43241
18042 43241 40964 19954 14521 30937 41526 39939 41113 42173 37277 33748 34607 50647 41525 32386
18028 32386 37321 32677 9102 15677 8668 -9343 -14569 -11558 -6320 4130 3515 17528 12425 12196
18014A2196j7394J6298P777J4656K1719k951j2882j3758j1890j1396j5683k0986
18002c4294J0662J5232o78j1617J7333Q560L685j5278k8288j7442K5715J6466
17990i944J4267Q707n289o301j0224J912J3030P495P842J5329j1935j1904J1744
17977B4729j656j5650l919O934K321j8707R107J4187o199k0177j3669N295R220
17964h184K3581k5211j5341j55J9783Q015J7888K7030K734N846J1837p783k567
17951E7473j3179N092l0558j2475r080K533r528k5816m05o293L9294K6361L755
17938B7174l2792m2345p621L6540N5904Q3838O9463L2979o333l8160l2822m6006
17926I9819m3063l964J257j0243k3330o363m623m973l066K4923j7145J335M842
$$ plain form
18014 12196 -5198 11100 18877 33533 55252 52301 39419 25661 13771 2375 -13308 -34294
18002 -34294 -23632 -8400 -9078 -20695 -3362 5198 8883 -6395 -34683 -52125 -26410 -9944
17990 -9944 4323 13030 7741 1440 -8784 -6872 6158 13653 21495 36824 24889 12985 24729
17977 24729 23073 7423 3504 10438 12759 -5948 3159 17346 11147 -9030 -22699 -17404 -8184
17964 -8184 15397 -9814 -25155 -25310 -5527 2488 20376 47406 50140 55986 67823 60040 57473
17951 57473 44294 49386 18828 6353 -2727 -194 -9722 -35538 -35943 -42236 -2942 23419 27174
17938 27174 -5618 -47963 -55584 -19044 36860 120698 190161 223140 216807 178647 145825 99819
17926 99819 56756 52792 54049 43806 20476 14113 9490 4517 1451 26374 9229 10564 15406
17913A5406L314L3302M0850N0048N4095J5715j1422m9959m2387J19L6453K5116
17901A70650n558M9597M2608K8781K8234k28M8283J03249M5932m173n9554j21187
17889C26634p9857N34L4489J18029R0705K9219n4315j09788q6440q0849m5733
17878A42628K370M3857K3106j6805l1616l4565j2814o347k3041m0605K819L3229
17866H2216L4136M3646K4274O4484J11157Q0506k662q1939j12158n3522J4880
17855B05018M0824O8324Q4815K7951m0059p1821r3947r7536l0612n586l595l217
17843H0559r770m2209k0462J304J4700K6418k3717J247k084M253q467o936J514
17830A6350J0285j7148j0977O630J6745K5412N785K1130L0974R8296J18350J19642
$$ plain form
17913 15406 18720 52022 92872 142920 197015 212730 201308 151349 108962 109081 145534 170650
17901 170650 165092 214689 257297 286078 314312 314084 362367 465616 511548 507375 447821 326634
17889 326634 246777 247311 281800 399829 490534 519753 465438 355650 269210 188361 142628
17878 142628 144998 188855 211961 195156 163540 128975 116161 109814 86773 46168 48987 82216
17866 82216 116352 159998 184272 248756 359913 440419 437757 355818 243660 190138 205018
17855 205018 245842 314166 398981 426932 386873 315052 221105 123569 92957 87371 83776 80559
17843 80559 70789 28580 8118 9422 24122 50540 26823 28070 25986 30239 21772 14836 16350
17830 16350 26635 9487 -1490 5140 21885 47297 53082 74212 105186 203482 321832 441474
17818D41474N8905o7585j06312j16139p9727m9604l5043j756j4601r195j5477
17807D940J028L8314L7342M4011N3841P2899J44508R5751j8990p9450j21137q8954
17795A84103n0429l1795k0195q167K414K7603M8947R2930J13545J8704l7549n7108
17783B83003q2036q4502l5234k1630k2041Q512P449J981K7697J2010J7600J4323
17771A27132L0642P8328R1996R0317k6291l9353o9755j04360o1627k4139l7339
17760E5551j6936j9981R29K8881j009O723O514o379l190n669k8463p201K3537
17747C3307k304l2762L388J0783K2130J0628k1970J0837o247j2308J1437K790
17735B9709o397q676l3553m146J3205j8154p325R165q043J7592j3545k0329J3076
$$ plain form
17818 441474 500379 432794 326482 210343 130616 81012 45969 44213 29612 20417 4940
17807 4940 5968 44282 81624 125635 179476 252375 396883 492634 473644 394194 273057 184103
17795 184103 133674 101879 81684 73517 75931 103534 152481 245411 358956 377660 340111 283003
17783 283003 200967 116465 81231 59601 37560 46072 53521 55502 83199 95209 112809 127132
17771 127132 157774 236102 328098 418415 392124 352771 283016 178656 117029 92890 55551
17760 55551 38615 18634 19563 48444 47435 54158 60672 54293 51103 45434 16971 9770 33307
17747 33307 31003 -1759 1629 12412 34542 45170 23200 34037 27790 15482 26919 29709
17735 29709 23312 14636 -18917 -23063 -9858 -28012 -35337 -26172 -34215 -16623 -30168 -50497 -37421
17722c7421J478j5526Q777q29o099L3774P175p847k261J6073k4108j5148J4058
17709b7904J9554k2450K3768K8525o22l2783J8808l378j8211l60K1081j3564L772
17696c764J8127j1539L5k486P567l217j9136n845R951L003J4532P240m706j2951
17682c189j6160p190J5723L9414o907j7248q840j4530j2331J895K5082J6670j578
17669A0811l044k3969M864j068n895j7965J7742r337P25J0972J7835K4433J9102
17656D5206R87n611k7578l3972q251Q187K37j1077j8885Q79m676J230R340P591
17642c6393J584J6904M673j9449q133J5807L3976J3532l6190l540J9600m522o839
17629h990M014k2121k1742K3484K9938p232m98Q545k4503k1728R651J1176q109
$$ plain form
17722 -37421 -35943 -51469 -42692 -43521 -49620 -15846 -8671 -16518 -18779 -2706 -26814 -41962 -27904
17709 -27904 -8350 -30800 -7032 21493 20871 -11912 6896 3518 -14693 -15053 6028 -7536 -3764
17696 -3764 14363 2824 2859 373 7940 4723 -14413 -20258 -10307 -7304 7228 14468 9762 -3189
17682 -3189 -19349 -26539 -10816 28598 21691 4443 -4397 -18927 -31258 -29363 -4281 12389 10811
17669 10811 7767 -16202 -11338 -12406 -18301 -36266 -18524 -27861 -27136 -16164 1671 26104 45206
17656 45206 46193 40582 13004 -20968 -29219 -21032 -20795 -31872 -50757 -49878 -54554 -53324 -43984 -36393
17642 -36393 -34809 -17905 -13232 -32681 -40814 -25007 8969 22501 -13689 -17229 2371 -2151 -8990
17629 -8990 -4976 -27097 -48839 -25355 4583 -2649 -3147 5398 -19105 -40833 -31182 -20006 -28115
17616b8115O458m574m046L890R29M013J7864j2730J0731J6442p116j3562N111
17603d705R85P401M685j31k1653j395J4367q911K8729j5262l0467K945J8220k6196
17589c1388p694K0114n423j5615j0643K6955L0455R036r527m390j679m899r961
17576a4659J9314o150O509K3386k0650J986n561m024j8282k1233k008J4914K0006
17563f452J5062j7424O192J3292r055n185J714O796j7521K0432J3756J7689K047
17550D1343j9170j3106j9252j8342k1646j2984N233K1263J1161J4348J0120m437
17538e469r85K1922p686k4440n251k871J5815O826r007J291j4640o737J3144l777
17524b1865q686M281K3322M12j2599R875M566l343r220O265K60J5278J8372J5160
$$ plain form
17616 -28115 -21657 -26231 -30277 -26387 -25458 -21445 -3581 -16311 -5580 10862 3746 -9816 -4705
17603 -4705 -3720 3681 8366 8235 -13418 -14813 -446 -9357 19372 4110 -26357 -23412 -5192 -31388
17589 -31388 -39082 -18968 -24391 -40006 -50649 -23694 6761 15797 6270 1880 201 -4698 -14659
17576 -14659 4655 -1495 5014 28400 7750 9736 4175 151 -18131 -39364 -41372 -26458 -6452
17563 -6452 8610 -8814 -2622 10670 1615 -3570 -1856 4940 -12581 7851 21607 39296 41343
17550 41343 22173 9067 -10185 -28527 -50173 -63157 -57924 -36661 -25500 -11152 -1032 -5469
17538 -5469 -6454 15468 7782 -16658 -21909 -24780 -8965 -2139 -11146 -9855 -24495 -31232 -18088 -21865
17524 -21865 -30551 -26270 -2948 -2536 -15135 -5260 -694 -4037 -13257 -6992 -6732 8546 26918 42078
17510D2078r637n0448j7844J26q399M877k2842P859Q263K3450k385l398J6164
17497a2136k1646p347j0465J183R278L9764K0340j523j3420k0091j7845k714n332
17484d1954J7849J4658j6470l2346J5750L7527M164j3956P569R22k8658q308R136
17471c4117r352j4763J4741k4628k239J4887J1697L0373M160j7289k598O776o6
17458b2418J1518j0404j9925p75J9769L128p580N257J8362p350k4505j970J4643
17445b2250m1M623J1875M0595K1113J5388Q9260N4331o593l1323m7722p3942k2561
17432C2753M140L613k8072j0234J0846r644j6118n677k2562j3224J9299J8032
17420a6848p225j726K923J5631N244K630o596o15M800r19j6268p904J5644L2050
$$ plain form
17510 42078 32441 -18007 -35851 -35725 -44124 -39247 -62089 -54230 -45967 -22517 -24902 -28300 -12136
17497 -12136 -33782 -41129 -51594 -50411 -41133 -1369 18971 17448 4028 -16063 -33908 -36622 -41954
17484 -41954 -24105 -9447 -25917 -58263 -42513 -4986 -822 -14778 -7209 -6287 -34945 -43253 -34117
17471 -34117 -43469 -58232 -43491 -68119 -70358 -55471 -43774 -13401 -9241 -26530 -29128 -22352 -22418
17458 -22418 -10900 -21304 -41229 -42004 -22235 -19107 -26687 -21430 -3068 -10418 -34923 -36893 -22250
17445 -22250 -22291 -17668 -5793 34802 55915 71303 160563 214894 208301 176978 129256 55314 32753
17432 32753 36893 40506 12434 2200 13046 3402 -12716 -18393 -40955 -54179 -34880 -16848
17420 -16848 -24073 -25799 -22876 -7245 -2001 629 -5967 -6582 -1782 -2701 -18969 -26873 -11229 20821
17406B0821k2105j8096j3376K6613J7729k2647n866q811P146P353Q859n856l4011
17393d2247J419K2859P154O803J2562L092l615L431q458J918q497r196j0719j9194
17379d2688J6518K297J5748K849k5894j2433p4P337Q687J438r280K0083j3801
17366b9213p182J7519K3436j413k4067o932K4843J4852k3081q731J8047k129j8002
17353b2053j2757J2343m519k769J8169L597J3159j3055O186N534K761j0581j7500
17340b1485l090J1453K8979J777q702o560k839j349n682j5588P082N411K018J2746
17326D171P397Q626k6765n639l700l530m55j2661j6178K2441J6577k3655l178
17313c6549J7770N862L2458J8996O609M443J2909j2417k1234l7944j1159j8335
$$ plain form
17406 20821 -1284 -19380 -32756 -6143 11586 -11061 -16927 -25738 -18592 -11239 -2380 -8236 -42247
17393 -42247 -40828 -17969 -10815 -4012 8550 11642 8027 11458 3000 4918 -3579 -12775 -23494 -42688
17379 -42688 -26170 -23873 -8125 -5276 -31170 -43603 -43677 -36340 -27653 -26215 -35495 -15412 -29213
17366 -29213 -36395 -18876 4560 3147 -20920 -27852 -3009 11843 -11238 -19969 -1922 -4051 -22053
17353 -22053 -34810 -22467 -26986 -29755 -11586 -7989 5170 -7885 -1699 3835 6596 -3985 -21485
17340 -21485 -24575 -13122 15857 17634 8932 2372 -467 -1816 -7498 -23086 -16004 -10593 -8575 4171
17326 4171 11568 20194 -6571 -12210 -15910 -19440 -19895 -32556 -48734 -26293 -9716 -33371 -36549
17313 -36549 -18779 -12917 19541 38537 45146 49589 62498 50081 28847 -9097 -20256 -38591
17301c8591L0456K0157Q128O571P28m073o742k735N2p045j4965q115R70K424R306
17286c474J233l658j8342M782K3946K0527m708J209j0661n394R512M008P057j1546
17272A4491k1658r703M570R663M096j8012N86L4706J638k286j9297j8387O61N130
17258a3802o296k0689l850l954P833O590k0867n972K3670R996m74p183j0261K9839
17244a5420J5067j7134o808J1212K729j7816J848K623k73n773l316j2133O98L199
17230d1297M742O986N569J614K2637r860l0152J1278J866K498M633J2848K0065
17217A3427N385r006n053J9694K467j5199j7402p777J5013p543J8641p161l6724
17204c1238k0814L1903K4082M705j7242L696n692K1673j4750o100N452L6946P876
$$ plain form
17301 -38591 -8135 12022 20150 26721 27449 23376 16634 13899 13951 6906 -8059 -16174 -15204 -12780 -3474
17286 -3474 -2241 -5899 -24241 -19459 4487 25014 20306 21515 10854 5460 14972 18980 26037 14491
17272 14491 -7167 -16870 -12300 -2637 1459 -16553 -15967 18739 20377 18091 -1206 -19593 -18932 -13802
17258 -13802 -20098 -40787 -44637 -48591 -40758 -34168 -55035 -61007 -37337 -27341 -27815 -34998 -45259 -15420
17244 -15420 -353 -17487 -24295 -13083 -10354 -28170 -26322 -23699 -23972 -29745 -33061 -45194 -44496 -41297
17230 -41297 -36555 -29569 -24000 -22386 251 -9609 -39761 -28483 -26617 -24119 -19486 -6638 13427
17217 13427 18812 9806 4753 24447 26914 11715 -5687 -13464 1549 -5994 12647 5486 -31238
17204 -31238 -52052 -20149 3933 8638 -8604 -4908 -10600 11073 -3677 -9777 -4325 32621 40497
17191D0497k4703j1244J5940n932j3902j7002j6771k408N267P924K6049P452K1609
17178C2776O220p871j8684k5449j742j080j1447Q055p206K046k320r596k326K700
17164c5924l028J5284j022O503m71q278K865r871j7103P138K7721J3330O492l023
17150F13j4274k7912J0161R067Q484J582j0285P008J6433K967p813N146q083j159
17136h065k2705o376Q922J2268l040K1716R693J6341j8656l1511n012O511K5617
17123E703J6373p519J5436l862j5483m97J4269P020j8128j9107J1115Q518k5771
17110a1933o950l852j4832m927L858K4472P270J3862K8381j7931l4953L2408J5994
17097C0867k9391J4934j454j4873r164l770K1216L506M427J7599L3355k3029k9086
$$ plain form
17191 40497 15794 4550 20490 14558 656 -16346 -33117 -35525 -30258 -22334 3715 11167 32776
17178 32776 38996 31125 12441 -13008 -14750 -15830 -27277 -19222 -26428 -24382 -26702 -36298 -38624 -35924
17164 -35924 -38952 -23668 -24690 -18187 -18658 -26936 -24071 -33942 -51045 -43907 -16186 -2856 3636 613
17150 613 -13661 -41573 -31412 -22345 -13861 -12279 -22564 -15556 877 3844 -3969 1177 -6906 -8065
17136 -8065 -30770 -37146 -28224 -15956 -18996 2720 12413 28754 10098 -21413 -26425 -19914 5703
17123 5703 22076 14557 29993 26131 10648 10151 24420 31440 13312 -5795 5320 13838 -11933
17110 -11933 -18883 -22735 -37567 -42494 -38636 -14164 -6894 6968 35349 17418 -17535 14873 30867
17097 30867 1476 16410 14956 83 -9081 -12851 8365 11871 16298 33897 67252 44223 15137
17084A5137P563j481j303K491J2046j1062k4465p058J4868o537j0091J7994N176
17071A3278n608j678M774J898K9030j1343l7394j5448J3571J067L360l291K783
17058e001o548q335J5247M681m002J3331q229N58o877r625j0149K7321L3988J299
17044C7659j5271j3264j0722K0218J994j8459n204k282J508o131j4438K0729J3282
17031I619k2971k546r986l914L6569N098j4410J412L691m0403l987L72L500L8745
17017G89J8333j7984K25j0581j2115J7652j4351l785J1286L351J5985p791k083
17004a069r392J7540M759j8916q129j8501o866J707j1831J6705J5504N354j3040
16991b6175r825P846J2629j2972L03K2295M936j2044o491M74l629O213K2548m132
$$ plain form
17084 15137 22700 21219 19916 22407 34453 23391 -1074 -8132 6736 199 -9892 8102 13278
17071 13278 7670 5992 10766 12664 41694 30351 -7043 -22491 -8920 -7853 -4493 -7784 -5001
17058 -5001 -11549 -19884 -4637 44 -3958 9373 1144 1702 -5175 -14800 -24949 2372 36360 37659
17044 37659 22388 9124 -1598 18620 20614 2155 -3049 -5331 -3823 -9954 -24392 -3663 9619
17031 9619 -13352 -15898 -25884 -29798 6771 11869 -2541 -1129 2562 -37841 -41828 -41456 -37956 789
17017 789 19122 1138 1363 -9218 -21333 -3681 -18032 -21817 -10531 -7180 8805 1014 -1069
17004 -1069 -10461 7079 11838 -7078 -15207 -33708 -40574 -38867 -50698 -33993 -18489 -13135 -26175
16991 -26175 -36000 -28154 -15525 -28497 -28194 -5899 -963 -13007 -19498 -19024 -22653 -16440 6108 1976
16977A976k00P464j8968k1802j318P808J5878N359q202M608R659k221j6315k850
16963a9124N767K060J9911K3685r401j9234L318m543J5049m703j2056P072N02
16950H303O163o028r379p6j488Q887L4951J1149k5304j7548r37j0550j5593r820
16936b7270L203K2100K175R176J521k62N11k5768j9117j4335L3679K6366l1726
16923a9747J6943N437k639j1228j0515M001J7566Q958k3057k4469N271J6457K9796
16910A2774J1628N795p768k524j66N396k0079k6569M211Q723j146j6998j2941
16897c9664J078K222j686k23J6724L4421M978j0146L011J0550k816l136l464j87
16883A1662k832j1487m635m510l9109k619K0801o97l2465O173K1500L821p983
$$ plain form
16977 1976 1776 9240 -9728 -31530 -32848 -25040 -9162 -3803 -12005 -7397 2262 41 -16274 -19124
16963 -19124 -13357 -11297 8614 32299 22898 3664 6982 2439 17488 12785 729 7801 8303
16950 8303 14466 8438 -941 -1017 -2505 6382 41333 52482 27178 9630 8693 -1857 -17450 -27270
16936 -27270 -24067 -1967 208 9384 10905 10643 11154 -14614 -33731 -48066 -14387 11979 -19747
16923 -19747 -2804 2633 -6 -11234 -21749 -17748 -182 8776 -14281 -38750 -33479 -17022 12774
16910 12774 24402 30197 22429 19905 19739 25135 5056 -21513 -17302 -8579 -9725 -26723 -39664
16897 -39664 -38586 -36364 -38050 -38273 -21549 12872 17850 7704 10715 21265 18449 15313 11849 11662
16883 11662 8830 -2657 -7292 -11802 -50911 -53530 -32729 -33426 -65891 -59718 -38218 -34397 -42380
16870d2380J346Q886L513o652j1589K7089J5006q570r88m833J9747J375j051M072
16856D971j955j8120Q750N147o188P464q572M712j0184r050p033J005j4015J4786
16842b8282J9863j6229o199R062J1889q885j9993K931k1619m181P414P11J7938
16829c5580J7840L1920J7889j9222j6432O514j0228l260L145j5485l222M0980
16817A4859L782J1287n099k4659K202j6189k0725q251J2917K1152J154q987q475
16804b5032r947j4987L898L1599Q759J0209r965N083J791p527j5613k1777O790
16791c6719J5253J4706J2524K2894J9664j7436j8781N361j3692j8125n304j4381
16779c4036n483K287J9682k2376m206J4072J0649J6219j4724K046O136J4945j3897
$$ plain form
16870 -42380 -41034 -32148 -28635 -35287 -46876 -19787 -4781 -13351 -14339 -19172 575 1950 899 4971
16856 4971 3016 -15104 -6354 -1207 -7395 69 -8503 -3791 -13975 -23025 -30058 -29053 -43068 -28282
16842 -28282 -8419 -24648 -30847 -21785 -9896 -18781 -38774 -35843 -57462 -61643 -54229 -53518 -35580
16829 -35580 -17740 14180 32069 12847 -3585 2929 -7299 -10559 -7414 -22899 -26121 14859
16817 14859 18641 29928 24829 170 2372 -13817 -34542 -42793 -29876 -8724 -7570 -16557 -25032
16804 -25032 -34979 -49966 -46068 -14469 -5710 4499 -5466 -383 1408 -6119 -21732 -43509 -36719
16791 -36719 -21466 -6760 5764 28658 48322 30886 12105 17466 3774 -14351 -19655 -34036
16779 -34036 -39519 -37232 -17550 -39926 -44132 -30060 -19411 -3192 -17916 -15870 -9734 5211 -8686
16766h686Q423M34l1786J075K1836Q651K0454J7775j7107j2690M030Q285M120
16753B4814k0264j7250n833k043L96j0177j6510o078L985K1090J4777J5448j4725
16740a2370o135j2917K3398J2261k2233J8112M212j0537J0475K1406J5589p559
16728C3702j3985k1887p777o277J1089n201k2221M591K4234j900j0014O759L52
16715h535j5729j5245K505o629n784J0774j2142J1019K9153K3076N49n284m1079
16702c3351o937K5897J5987J2180n113k4212j7293J6445K1536r998k6394R315
16690b1938K4959j2619L903J0696J874Q362P58p477k6242p758L006J2158j373
16677a1691j1677k671R930m640n05m643l762j2438J6043K3831P695k4133l7987
$$ plain form
16766 -8686 -263 171 -31615 -30540 -8704 -53 20401 38176 21069 8379 12409 20694 24814
16753 24814 4550 -12700 -18533 -20576 -20180 -30357 -46867 -52945 -48960 -27870 -13093 2355 -12370
16740 -12370 -18505 -31422 -8024 4237 -17996 116 4328 -6209 4266 25672 41261 33702
16728 33702 19717 -2170 -9947 -16224 -5135 -10336 -32557 -27966 -3732 -5632 -15646 -8887 -8535
16715 -8535 -24264 -39509 -37004 -43633 -49417 -38643 -50785 -39766 -10613 12463 13012 7728 -33351
16702 -33351 -40288 -14391 1596 13776 8663 -15549 -32842 -16397 5139 -4859 -31253 -21938
16690 -21938 3021 -9598 -5695 5001 6875 15237 15995 8518 -17724 -25482 -22476 -10318 -11691
16677 -11691 -23368 -26039 -16109 -20749 -21254 -25897 -29659 -42097 -26054 -2223 5472 -18661 -56648
16664e6648L094K0904R828J5957K0382K4839j3294l5120r29j4662j5039N098K1373
16651a4217j2714j92N569J4330o605K630j9446R198J7971M673n79j0169k1471
16638c1022k143n596l175P071M366p23m912N56p579J1633K8527Q043l123O886
16624H809o998k335k613n724k4272K935L3612m319k4657O88R579J013J5794J7652
16610A9164J426l2438j0340L1238N301m014n914j2495j7491J438K3936n552k0206
16597b5947K682K933J9701J3325J7076J1615j627j6514l2033j5456M26J5852m332
16584a2299P006m478N257J6849j1438K913l888k3318l8780j9463L6846Q152j349
16571c7990P001J2739K347K611q782k413J3008P315j4454O672K8835j2535l804
$$ plain form
16664 -56648 -53554 -32650 -22822 -6865 13517 38356 25062 -10058 -10987 -25649 -40688 -35590 -14217
16651 -14217 -26931 -27123 -21554 -7224 -13829 -11199 -30645 -21447 -3476 1197 618 -9551 -31022
16638 -31022 -33165 -38761 -41936 -34865 -30499 -31222 -36134 -35578 -43157 -31524 -2997 5046 1923 8809
16624 8809 1811 -524 -3137 -8861 -33133 -30198 3414 -905 -25562 -24874 -15295 -14282 1512 19164
16610 19164 20590 -11848 -22188 9050 14351 10337 4423 -8072 -25563 -24125 -189 -5741 -25947
16597 -25947 -23265 -20332 -631 12694 29770 41385 39758 23244 -8789 -24245 -23819 -7967 -12299
16584 -12299 -5293 -9771 -4514 12335 897 3810 -78 -23396 -62176 -81639 -44793 -36641 -37990
16571 -37990 -30989 -18250 -15903 -13292 -22074 -24487 -11479 -4164 -18618 -11946 16889 4354 550
16558E50j2325L609K3382O125r905r178j2054R356n517M056J1685j2521l031o758
16544a2526P678J9954M704p775m351L657O01j1315k249j1479k4260j2592J8352
16531c1601J1440o49j0387Q041K2617m41r039K561M313O498M533j5792k3181O121
16517b4966J4557Q942o020Q954j982r841k529Q786J0226L899j6903r251j0356
16504b6484J149Q756P441K3173K5554L462j8332m2496m0979j2606J1626J2717
16492d7019J0580K4909n366r398K844J3055n576J7893R295j3970j7233k041K5722
16479C695K4079p213M501k2254k1158J5019j4132l231J6140J0147L636l407l1365
16466b5543r88o611o218K1810L534m374R810P50Q780L1358l022j7418j8893j9045
$$ plain form
16558 550 -11775 -8166 15216 21341 11436 2258 -9796 -440 -5957 -1901 9784 -2737 -5768 -12526
16544 -12526 -4848 15106 19810 12035 7684 11341 11942 627 -1622 -13101 -37361 -49953 -31601
16531 -31601 -20161 -20810 -31197 -23156 -539 -980 -10019 -7458 -3145 3353 7886 -7906 -31087 -24966
16517 -24966 -10409 -1467 -7487 1467 -515 -10356 -12885 -4099 6127 10026 -6877 -16128 -26484
16504 -26484 -25335 -16579 -9138 14035 39589 43051 24719 -17777 -58756 -71362 -59736 -47019
16492 -47019 -36439 -11530 -16896 -26294 -23450 -10395 -15971 1922 11217 -2753 -19986 -22027 3695
16479 3695 27774 20561 25062 2808 -18350 -3331 -17463 -20694 -4554 5593 9229 5822 -25543
16466 -25543 -26531 -33142 -39360 -17550 -14016 -18390 -8580 -7830 950 32308 29286 11868 -7025 -26070
16452b6070J2343K1451l546q961N701p454k6662j7199m5J2866L3956r417p350
16439b0387L261l429k932o328Q798o599Q473K6768N564k498n612k495j6344j0396
16425b4156n599M044l767K7047k0973M902M4262P3r747K036q301J7685M085j5933
16411A5658J37l95K4742J5100l0527l0913p012k4435J2599J4000J0400L2461L351
16398C5166j2878k1729m28o745k8279J6028Pp671j3787J2107J3240K338k8740
16385d1371q522K5145K4704J0106j5506L94j5355J878K4048K540n016o033j1258
16372a4246M703J0710J79M119J2437J427j4317j5092k2618K033Q373k3044j5428
16359f0764J8846J1635r774J3724l284k0245M3619J8733P136J9559j4514p091
$$ plain form
16452 -26070 -13727 7724 4178 -4783 918 -6536 -33198 -50397 -50442 -37576 -3620 -13037 -20387
16439 -20387 -17126 -20555 -23487 -29815 -21017 -27616 -19143 7625 13189 10691 5079 2584 -13760 -24156
16425 -24156 -29755 -25711 -29478 -2431 -23404 -18502 25760 25833 16086 18122 9821 27506 31591 15658
16411 15658 15795 15400 40142 55242 24715 -6198 -13210 -37645 -25046 -11046 -646 31815 35166
16398 35166 22288 559 131 -6614 -34893 -18865 -18858 -26529 -40316 -28209 -14969 -12631 -41371
16385 -41371 -49893 -24748 -44 10062 -5444 -5050 -20405 -18527 5521 8061 3045 -2988 -14246
16372 -14246 -9543 1167 1346 5465 17902 19329 5012 -10080 -32698 -30665 -22292 -45336 -60764
16359 -60764 -41918 -30283 -40057 -26333 -29617 -49862 -6243 12490 19626 39185 24671 17580
16347A7580j465k7156j6782o507K4117L0671K5141m964j636j5192j7985r897j8523
16334b2598K1319J2295J6738m702j3031r027j2718K1451l794J0046m768j8799
16322g588L8930K543j2356j845K107j4228j9839O582l629k2046j4133L107K238
16309d0157L809J7790J0391J5413L313M293k9770q346J964K457j2695l327J2561
16296b2304J7897L58n937l311m778P666J3288j7810R46n249p028J0261m140J3750
16282f391J0685J3598J0713j1134q990r839p053j8390j8182j1988o17L4010J8330
16269e248o067O783M622O274r001J8795j9768J443K521M887K470k2683J0489O791
16255B308j4525j1035o974n81l019l280J6923J8845Q999N614k512m986J8092o544
$$ plain form
16347 17580 16115 -11041 -27823 -34330 -10213 20458 45599 40635 38999 23807 5822 -4075 -22598
16334 -22598 -1279 11016 27754 23052 10021 994 -11724 9727 5933 15979 11211 -7588
16322 -7588 31342 33885 21529 19684 21791 7563 -12276 -5694 -9323 -31369 -45502 -42395 -40157
16309 -40157 -36348 -18558 -8167 7246 10559 14852 -14918 -23264 -21300 -18843 -31538 -34865 -22304
16296 -22304 -4407 -4049 -9986 -13297 -18075 -10409 2879 -14931 -13985 -19234 -26262 -16001 -20141 -6391
16282 -6391 4294 17892 28605 17471 8481 -1358 -8411 -26801 -44983 -56971 -57588 -23578 -5248
16269 -5248 -11315 -4532 90 6364 -2637 16158 -3610 -2167 354 5241 7711 -14972 -4483 2308
16255 2308 -12217 -23252 -30226 -30807 -33826 -37106 -20183 -1338 7661 13275 10763 5777 23869 17325
16241A7325q921n025N383K8606j1955j7384l703J6962n117r384n485O899J332
16228I533l051K984j8976K460J9809K360j9828k0786Q794M586k244K3519q889
16215B71k268n001K0803j1134k6127J186J8352l458J931O115N042k709j7513j3167
16201b7677K9796m791n144q742r828Q331K3062m502j7760O277P901m911j3075
16188b1063j5145K989J1751J46J0855J4401L5229P708j6217k0090k2854j1443
16176b3733K0654Q221R325K7189K3938n403k1673k3704k5512K44K1634J2409k3325
16163B64Q813K1719O088k7861j8964K182Q821J888K1744k725j1174j9767o188
16150a5160j2448o370L600j934k2936k2692L0740K9610K3876K588o021m883k094
$$ plain form
16241 17325 8404 3379 8762 37368 25413 8029 4326 21288 16171 6787 1302 8201 9533
16228 9533 6482 9466 -9510 -7050 12759 15119 -4709 -25495 -16701 -12115 -14359 9160 271
16215 271 -1997 -6998 13805 2671 -23456 -22270 -3918 -7376 -5445 670 5712 3003 -14510 -27677
16201 -27677 2119 -2672 -7816 -16558 -26386 -18055 5007 505 -17255 -10978 -3077 -7988 -21063
16188 -21063 -36208 -33219 -21468 -21322 -10467 3934 39163 46871 30654 10564 -12290 -23733
16176 -23733 -3079 5142 14467 41656 65594 60191 38518 14814 -10698 -10454 11180 23589 264
16163 264 9077 30796 36884 9023 -9941 -7759 1062 2950 24694 21969 10795 -8972 -15160
16150 -15160 -27608 -33978 -30378 -32312 -55248 -77940 -47200 -17590 6286 8874 2853 -2030 -4124
16137d124j4055M724N445J0820K907j5725N347k3943J9147Q049j8989k057k063
16124b4517L351j3716P989L3205K6693R972k1848j490j2452q031o491J7329J9297
16111B9291J3672m340p182p662Q365n113R878R484O700k3510j0714k6882j2896
16098b0909O775R741J2601j5893k2586J7625K8830l36j2851J139J4563L2893J6891
16085F8483k2045j2852k5118k752J5274l9882l337m63J6044J8514q98N37q021
16072C484k3651n625R254J1476j7457n011l200N1174K4720k7996k1767J880J1224
16059H505K111j3327j0335p340lj5496K423J2603J6264O272j1774n966L8704n610
16045A7031l6194k0906n053K2134M1253k1300k0430M104m126N195o744J4601K566
$$ plain form
16137 -4124 -18179 -13455 -8010 2810 5717 -10008 -4661 -28604 -9457 -1408 -20397 -22454 -24517
16124 -24517 -21166 -34882 -26893 6312 33005 42977 21129 19639 7187 -844 -7335 9994 29291
16111 29291 42963 38623 31441 23779 32144 27031 36909 46393 53093 29583 18869 -8013 -20909
16098 -20909 -14134 -4393 8208 -7685 -30271 -12646 16184 15848 2997 4136 18699 51592 68483
16085 68483 46438 33586 8468 5716 20990 -18892 -22229 -22692 -6648 11866 10968 11505 3484
16072 3484 -20167 -25792 -16538 -5062 -22519 -27530 -30730 20444 45164 17168 -4599 -2719 8505
16059 8505 10616 -2711 -13046 -20386 -20389 -35885 -33462 -20859 -4595 1677 -10097 -16063 22641 17031
16045 17031 -19163 -40069 -45122 -22988 18265 -3035 -23465 -19361 -23487 -18292 -25036 -10435 -7869
16032g869J0650Q248O159o423k2614r317K341J2200L0162K7239k6974k4842j6088
16019a7128N788L7158m653k0127k0918k1818j4262q579J8834J2480p294k392J0974
16006c1937J8601j370j4912j8247j0968L3826K9432M433M181l785J1870k1614
15994d90k246J1979j3806j8079O230j8448j3708J6029j1249J7298J7079P427J4318
15981A2334K4827k4445k7520K5310m408J298p500m271J2358J8548j0098M226k170
15968A8489j8355p53n643j7643K914K9844N219j0443P297m413j7261n49R355k221
15954d163p179j7841j0189J6218J47J3993K0009k0996K27L4389J117m8265j6647
15941c9180j1088q39J097L3362N01j9597l077K2678K3727k602L564j412J1872
$$ plain form
16032 -7869 2781 11029 17188 10765 -11849 -21166 -18825 -6625 23537 50776 23802 -1040 -17128
16019 -17128 -11340 25818 21165 1038 -19880 -41698 -55960 -64539 -45705 -33225 -40519 -42911 -31937
16006 -31937 -13336 -14706 -29618 -47865 -58833 -25007 4425 8858 13039 9254 21124 -490
15994 -490 -2736 9243 -4563 -22642 -16412 -34860 -48568 -32539 -43788 -26490 -9411 -1984 12334
15981 12334 37161 12716 -14804 10506 6098 7396 -104 -4375 7983 26531 16433 20659 18489
15968 18489 134 -619 -6262 -23905 -20991 8853 14072 3629 10926 6513 -10748 -11297 -1942 -4163
15954 -4163 -11342 -29183 -39372 -23154 -23007 -9014 10995 -10001 -9774 24615 25732 -22533 -39180
15941 -39180 -50268 -51107 -50010 -16648 -16147 -35744 -38821 -16143 7584 4982 8546 7134 19006
15928A9006n602q702J8524M621p072J250n034p043j556N031j1944K073m106k1258
15914b1812J0331j2521J5717k231l640j0203j070J3883o384p610J0375Q190p609
15901a4584q467L32J7193J0138j6979J5781O612m832N951L889r193l010J5458
15888A8289j5341o402N27J5072k023l361q198L093L228k0432j8449J468Q210P
15874b4312J455k5160K1063R331j7378Q891j438r975j3293J4830P680K5585R786
15861G065j1009n053j7742K2781j609L160R113j0194j5831j7318m365k0186j624
15848f2812J2036K534J1483J7999M032k176Q120K4287P386k6706L077j5351l8214
15835e4305J3316P368P287q080r614j0929K6251j886k3243K1408K7849j5903k966
$$ plain form
15928 19006 13404 4702 23226 27847 20775 22025 16991 9948 8392 13423 1479 3552 -554 -21812
15914 -21812 -11481 -24002 -8285 -10516 -14156 -24359 -25429 -11546 -17930 -25540 -15165 -6975 -14584
15901 -14584 -23051 -22719 -5526 4612 -12367 3414 10026 5194 11145 15034 5841 2831 18289
15888 18289 2948 -3454 -2927 12145 10122 6761 -1437 1656 4884 -15548 -33997 -32529 -24319 -24312
15874 -24312 -22857 -48017 -26954 -17623 -35001 -26110 -27548 -37523 -50816 -35986 -28306 -2721 7065
15861 7065 -3944 -8997 -26739 -3958 -5567 -2407 6706 -3488 -19319 -36637 -41002 -61188 -62812
15848 -62812 -50776 -48242 -36759 -18760 -14728 -16904 -8784 15503 22889 -3817 -740 -16091 -54305
15835 -54305 -40989 -33621 -26334 -34414 -44028 -54957 -28706 -30592 -53835 -32427 -4578 -20481 -23447
15822b3447k1599k2221L407Q359J6171K3156m842p723J9658q615K352P292R103
15809A051K0880J768L033r641j2711j369J5543J401J4694k1922j6479j7817R103
15796a2466N881l092k315j9287o117j111J2670K0289K8491K1357P410j6583k3292
15783A1835j132n794M775j7508J748K4197j046p887m185Q88R36J8284k0812k3210
15769a8911j0542j2260L635K2208J3767j9958j8356j522L2152J9167p210K0465
15757B2635J2895k976r891k0169j5684J7124k075J4181o405j3709N658J3706j05
15744A5185k3542j0737J6174q797j3501K580J4901P280K449N670P91N548l2833
15731a8832N4Q809R734j6640k1908k0407J6239L0418J0919j9134j3803K0847J9115
$$ plain form
15822 -23447 -45046 -67267 -63860 -55501 -39330 -16174 -21016 -28739 -9081 -17696 -15344 -8052 1051
15809 1051 21931 23699 26732 17091 4380 3011 18554 19955 34649 12727 -3752 -21569 -12466
15796 -12466 -6585 -9677 -11992 -31279 -37396 -38507 -25837 -5548 22943 44300 51710 35127 11835
15783 11835 10703 4909 9684 -7824 -6076 18121 17075 9188 5003 5891 6827 25111 4299 -18911
15769 -18911 -29453 -41713 -38078 -15870 -2103 -22061 -40417 -41939 -9787 9380 2170 22635
15757 22635 35530 32554 22663 2494 -13190 3934 1859 16040 9635 -4074 1584 15290 15185
15744 15185 -8357 -19094 -2920 -11717 -25218 -22638 -7737 -457 1992 7662 8453 14001 -18832
15731 -18832 -18778 -9969 -235 -16875 -38783 -59190 -42951 -12533 -1614 -20748 -34551 -13704 5411
15718E411j1342j9256L47O10P806j2692J1347m447J0479L0000M854l8152N57L3716
15704A9238J5214N178R86k9880j5392P444j0643j3446K3064r07J4555L203r03
15691A7711O141j969j2823R03q827j3416L2272j2423n4864J1507K4969K4616J1587
15678B5384o99J882J0649r091J6396K287l7286j5515k6252o557K1574J9410N617
15665G799l130J4007R329K221j1500l4283j9914J2544O02J418j2406q134J3851
15652b7596J440p370N89J4659J3257J2368j2607Q673M704j3401m347J4388J1749
15639A6506J3884k016J2364p249K520J4826M958l4834k2926m597q42q55j1745
15626b0006j5388J2390P02R422p43q792M705K5157n620R934J5930k9799o849K008
$$ plain form
15718 5411 -5931 -25187 -24840 -24230 -16424 -29116 -17769 -22216 -11737 18263 23117 -15035 -14478 19238
15704 19238 34452 39630 40616 10736 -4656 2788 -7855 -21301 1763 856 15411 18614 17711
15691 17711 23852 21883 9060 9963 1136 -12280 19992 7569 -47295 -35788 -10819 13797 25384
15678 25384 24685 26567 37216 28125 44521 46808 9522 -5993 -32245 -38802 -17228 2182 7799
15665 7799 4669 18676 28005 30226 18726 -15557 -35471 -22927 -22325 -20907 -33313 -41447 -27596
15652 -27596 -26156 -33526 -32937 -18278 -5021 7347 -5260 3413 8117 -5284 -9631 4757 16506
15639 16506 30390 28374 40738 33489 36009 50835 55793 20959 -1967 -6564 -7406 -8261 -20006
15626 -20006 -35394 -23004 -22302 -12880 -13623 -22415 -17710 7447 1827 11761 27691 -2108 -8957 -6949
15612f949j5147Q020q309J8545P723O55j3204j4255J4855Q748R446j0261j9720
15599a9853n337K654J4341j4528o321K3470M0491J9086k9328j5309L7627O696
15587E3689k6312M768j6927j8831m134k0252P004K4429J0229Q057m941k6968j4949
15574b5138k398N65K5168J8468M841n567j2841m050P799o91J381q73k8350r822
15560c1508J148J3461J3578n348o280N2996J0759m1606j4267J2121K2649J7486
15548D5189j3647J1755j218l0004j5602J1733k5715M50N964m09j6725j0457P116
15535c1570L401k69o864j642K0073L0245j2318J4005j6718J3658j521k0582P187
15522b915o729j4001J2513J3845o205J42j2180l568P383J7003j0946n225R922
$$ plain form
15612 -6949 -22096 -14076 -22385 -3840 3883 4538 -8666 -22921 -8066 682 10128 -133 -19853
15599 -19853 -25190 -22536 -8195 -22723 -29044 -5574 34917 54003 24675 9366 46993 53689
15587 53689 27377 32145 15218 -3613 -7747 -27999 -20995 3434 13663 21720 16779 -10189 -25138
15574 -25138 -27536 -26971 -1803 16665 21506 15939 3098 -952 6847 6156 7537 6664 -21686 -31508
15560 -31508 -30360 -16899 -3321 -8669 -14949 38047 48806 7200 -7067 5054 27703 45189
15548 45189 31542 43297 42079 12075 -3527 8206 -17509 -17059 -11095 -11504 -28229 -38686 -31570
15535 -31570 -28169 -28438 -35302 -36944 -16871 13374 1056 15061 -1657 12001 10480 -10102 -2915
15522 -2915 -9644 -23645 -11132 2713 -3492 -3350 -15530 -19098 -11715 5288 -5658 -10883 -961
15509i61k4083j2028K6630L1086J4251k3578k6433k0595J58j8171K1481J0256
15497b1987K963K5932Q072k7664j2629q693j0678J9296N758j38o416J5146N903
15484e135j3495R341n736J1357K4695j5697J6375p66k2969K5398o147k0447q276
15471a1502l30j620j4958K9966K9085Q47p901m803L491j6366J3544L846k7284
15458c985L77j1593j6314K2166j0470r786L7750K1333k1202k687n067k3687J0882
15445a2283K2272K8456J3380q916j8716k5568k1869J0685L7746o410k4483l939
15433i645k5444q622J4314q785j288J5572K9652p5j8137N356o705J5771K2489
15420B4453l345k8352m467l993j6511k2971J0916N451L0171J3976l3541k1180
$$ plain form
15509 -961 -25044 -37072 -10442 20644 34895 11317 -15116 -35711 -35553 -53724 -32243 -21987
15497 -21987 -19024 6908 14980 -12684 -25313 -34006 -44684 -25388 -19630 -19768 -26184 -11038 -5135
15484 -5135 -18630 -9289 -15025 -3668 21027 5330 21705 20939 -2030 23368 17221 -3226 -11502
15471 -11502 -11832 -13452 -28410 1556 30641 31488 23587 18784 22275 5909 19453 23299 -3985
15458 -3985 -3608 -15201 -31515 -9349 -19819 -29605 8145 29478 8276 5589 522 -23165 -12283
15445 -12283 9989 38445 51825 42909 24193 -1375 -23244 -12559 25187 18777 -5706 -9645
15433 -9645 -35089 -43711 -29397 -38182 -39470 -23898 5754 5679 -12458 -7102 -13807 1964 24453
15420 24453 21108 -7244 -11711 -15704 -32215 -55186 -44270 -38819 -8648 5328 -28213 -49393
15408d9393l312J5221L5140J7026L800j160l988J8862Q093j9309J4819r518k4300
15395A981P057P166J9611O856j2249p510n267k3829O669K4664l151j1066r990
15382I42j3395r353j719J735J5149J1992J1484N087k5158j0328M286L66l397j2546
15368b4855P372R980l099k5155J420L3378K3937R471j3154O786k5213l3870M644
15355b8358K6228k0022J441l630K0298j7863J4830K8139j6804p246L585J3367
15343A3965K1229o080k0021O108O253R299l5J3190l948r318q669j6056j5441Q596
15329i28J5059M404P523k0388p810J0130j758n57j0605r153l793N324j6435q243
15315c7230J8633J8637q651j7781J6420J4856K0947k9418j2770O686M71J4384
$$ plain form
15408 -49393 -52705 -37484 -2344 14682 18482 17322 13334 32196 40289 20980 35799 26281 1981
15395 1981 9038 16204 35815 42671 30422 22912 17645 -6184 485 25149 21998 10932 942
15382 942 -12453 -21806 -23525 -21790 -6641 5351 16835 21922 -3236 -13564 -9278 -8912 -12309 -24855
15368 -24855 -17483 -7503 -10602 -35757 -34337 -959 22978 32449 19295 26081 868 -33002 -28358
15355 -28358 -2130 -22152 -20711 -24341 -4043 -21906 -7076 21063 4259 -2987 598 13965
15343 13965 35194 29114 9093 15201 21454 30753 30718 43908 39960 30642 21973 5917 -9524 -928
15329 -928 14131 18535 26058 5670 -2140 7990 6232 5675 -4930 -14083 -17876 -12552 -28987 -37230
15315 -37230 -18597 40 -8611 -26392 -9972 4884 25831 -3587 -16357 -9671 -9200 5184
15303E184K2615l008L153M900j3404l5614j9930K0883Q630J0668M048k2234J8630
15290D521L6178j1623n7O282N483J192K836k6650q475p052O333J723q672O001
15276H020n136J5235J4313k3071K272P233j9451n287P751j705m95l423j148j7680
15262b2572k8583N368L0424M9536j0092l5782n380q794N355J6671o158n707O203
15249i511L9617Q119l4078r337P332n512K5180j2763l3282q448K4054j079k1729
15236c1437N571J0761J0586J1885N337J5365j5058q10J2461J984j956J3604P884
15223D6177j4760o902j8604m2368j5352K6177J9916J8005k2069K1347J8401l1683
15211a715R007O67O92j891p758n628j6137O280L007N189K8602k715M300J0254
$$ plain form
15303 5184 27799 24791 27944 32844 19440 -16174 -36104 -15221 -6591 4077 8125 -14109 4521
15290 4521 40699 29076 29019 35301 40784 41976 44812 18162 9687 2635 8968 10691 2019 8020
15276 8020 2884 18119 32432 9361 11633 18866 -585 -5872 1879 174 -321 -3744 -4892 -22572
15262 -22572 -51155 -45787 -15363 34173 24081 -11701 -17081 -25875 -20520 -3849 -10007 -15714 -9511
15249 -9511 30106 38225 4147 -5190 2142 -3370 21810 9047 -24235 -32683 -8629 -9708 -31437
15236 -31437 -25866 -15105 -4519 7366 12703 28068 13010 12200 24661 26645 24689 38293 46177
15223 46177 31417 24515 5911 -36457 -51809 -25632 -5716 12289 -9780 11567 29968 -1715
15211 -1715 7292 7959 8651 6760 -998 -6626 -22763 -16483 -13476 -8287 20315 17600 21900 32154
15197C2154l4256j0092q577k304o52k7747J4387L8282R259J770K218l2716j8788
15184c7062L567P478P887o39J4960L6826R335m4958k4365O991K4968j2926k1126
15171b9064j6623k5390l564K5535K5570J2568J528M112P663j7944j3130J0800
15159a7939J0459J2919k639k2259p522n275L642J292K0589R247r637L15j2797
15146a9605k4114P039J1888q218J808K8504K2792q825n687j8651o429j6029n375
15133d0902j518L007K336J716n825L2899J4308j9989j0919m719j682O777k598
15120b7109P739k0435J3477K8222j0864q015M062j1494L634K779p126j262Q459
15107a7933J2433k663k3919J1788K7688K0631j656n232j8323j2950J1762m534
$$ plain form
15197 32154 -2102 -12194 -20771 -23075 -23727 -51474 -37087 1195 10454 12224 14442 -18274 -37062
15184 -37062 -33495 -26017 -18130 -18769 -3809 33017 42352 -2606 -26971 -19980 4988 -7938 -29064
15171 -29064 -45687 -71077 -74641 -49106 -23536 -10968 -9440 -5328 2335 -15609 -28739 -17939
15159 -17939 -7480 5439 2800 -19459 -26981 -32256 -28614 -27322 -6733 2514 -7123 -6808 -19605
15146 -19605 -43719 -36680 -24792 -33010 -31202 -2698 20094 11269 5582 -13069 -19498 -35527 -40902
15133 -40902 -42420 -39413 -37077 -35361 -41186 -8287 6021 -13968 -24887 -29606 -31288 -24511 -27109
15120 -27109 -19370 -39805 -26328 1894 -8970 -16985 -12923 -24417 -20783 -18004 -25130 -26392 -17933
15107 -17933 -5500 -8163 -32082 -20294 7394 28025 26369 21137 2814 -10136 1626 -2908
15095b908M331j0650l802J9796K0940J9030J2654m741k559o611k123J9097l7549
15082B4905k8051O700j0386J7982J8792j5049k8509k558j828q793O853q72K0160
15069f54L0410j7514P934K3405n174k0025p602k3156j6802p289J3941N6p586l320
15055c3376K0647L3849j8866N775J4296j6499j0667j3406j6833m630J9260L0937
15043A0487J4063r321P462j1047r796L587P453j5676J962J3520K9038K2593o398
15030E7927j3124l9086l2511q449J0190j2268p197m823J2205L6934L4843j4415
15018B0226j0687j8566k2965J8221J9720J0501l869L972M169J761M826j050j6240
15005A0019k058J1790M038j5672J655n735j7475J6790K9476r587j9202l3124k164
$$ plain form
15095 -2908 1423 -9227 -13029 6767 27707 46737 59391 54650 52091 45480 43357 62454 24905
15082 24905 -3146 3554 -6832 11150 29942 14893 -13616 -16174 -18002 -26795 -19942 -20814 -654
15069 -654 29756 12242 20176 43581 38407 18382 10780 -12376 -29178 -36467 -22526 -22470 -30056 -33376
15055 -33376 -12729 21120 2254 8029 22325 5826 -4841 -18247 -35080 -39710 -20450 10487
15043 10487 24550 15229 22691 11644 1848 5435 12888 -2788 -826 12694 41732 64325 57927
15030 57927 44803 5717 -26794 -35243 -25053 -37321 -44518 -49341 -37136 -202 34641 20226
15018 20226 9539 -9027 -31992 -13771 5949 16450 12581 16553 20722 22483 27309 26259 10019
15005 10019 7961 19751 23789 8117 9772 4037 -13438 3352 32828 23241 4039 -29085 -31249
14992c1249O852J7089J9497J1474N38J1729r695k0086j6883j2585O431R648N3
14979g187j3998l595M596R810K3500l026j5532j27j0621J388K2293M699j377l718
14965G105q372j94r293J153K1725K779j5298O522k4866J0519K9213j3226k1059
14952a3292J935Q695P964r555j4570J0275r60j2348J100P273m529K616l409J714
14938a7091J2000j2814j0881m030K1783Q765M865k079r145r06Q055J590J8391
14925A8503K9168J738j877j3563J3141j242j6982M495j9244k8822J2240n804l447
14912a1696K8883K0067j0269j283k4292k5952j8284k489Q466J1182J0828Q564
14900f275o664O29O137j274o445R323P93j5042N433K281j2445k4454j077L0188
$$ plain form
14992 -31249 -24397 -7308 12189 23663 24201 35930 26235 6149 -10734 -23319 -16888 -7240 -7187
14979 -7187 -21185 -24780 -20184 -10374 13126 10100 -5432 -5559 -16180 -14792 7501 12200 10823 7105
14965 7105 -1267 -1461 -10754 -9601 12124 14903 -395 6127 -18739 -8220 20993 7767 -13292
14952 -13292 -11357 -2662 5302 -4253 -18823 -8548 -9508 -21856 -20756 -13483 -18012 -15396 -18805 -17091
14938 -17091 -5091 -17905 -28786 -32816 -11033 -2268 2597 518 -8627 -9533 -1478 112 18503
14925 18503 47671 49409 47532 33969 47110 45868 28886 33381 14137 -14685 -2445 -8249 -11696
14912 -11696 17187 37254 26985 25702 1410 -24542 -42826 -45315 -36849 -25667 -14839 -6275
14900 -6275 -12939 -12310 -6173 -7447 -13892 -4569 -3776 -18818 -13385 -11104 -23549 -48003 -49080 -18892
14886a8892N0019J3882K4302j5776k4010m358R188J0030m493j1388k4703j2678
14874h877o82J3378J5032q160J2530K3029j5123j1776M1k0444J034O893l772K574
14860E677p757L132k4754j2089P274O398L670m619K851r914k1821L2334M372J3899
14846a347J9644j1409K190j6222m435N905R170m03L6471j0738J145j8212k4915
14833a3156O136p261J1540J3506L458K3604K5888r205Q17j3922j9408J8383O771
14820D7151P62q17j6618j4364K140J2888J0779R101j9829j6418j1896J2669K4972
14807D0520n862J545p234n823N322N567k7857j1297n124J7236j7368l8873j2317
14794f1565J8349J6077J4238K7458n99M053M671j0313N129K5490k5981p036m7
$$ plain form
14886 -18892 31127 45009 69311 53535 29525 25167 34355 44385 39892 28504 3801 -8877
14874 -8877 -9559 3819 18851 10691 23221 46250 31127 19351 19392 -1052 -18 6875 3103 5677
14860 5677 -2080 1052 -23702 -35791 -28517 -22119 -18449 -23068 -20217 -30131 -51952 -19618 -15246 -1347
14846 -1347 18297 6888 9078 -7144 -11579 -5674 3496 3093 39564 28826 29971 11759 -13156
14833 -13156 -7020 -14281 -2741 10765 14223 37827 63715 54510 55327 41405 21997 40380 47151
14820 47151 47913 47096 30478 16114 18254 31142 41921 51022 31193 14775 2879 15548 40520
14807 40520 34658 36203 28969 23146 28468 34035 6178 -5119 -10243 6993 -10375 -49248 -61565
14794 -61565 -43216 -27139 -12901 14557 13958 18011 22682 12369 17498 42988 17007 9971 9924
14781I924k8445K473J3895J5201j55k311o637J3497K1323R587m4821q384o357
14768a1210M603O391O196J078J1713r619m1798o048L6680P89o806J918O871m36
14754C22N822j8152J799P153J4018j3191l368j0152J0780Q882j3752J334N516
14741b989M727J0745P342P799M725k912l0407j7968j0927K9911K1566r148L151
14728A5615J9284q971J532k9108j6562M615J2028J3078J2653J2677j6595l2475
14716a2229n169j990j0253J9403l774M590j8181o193J4083P264O981J5412m950
14703D994N46j4331m031J047m872J6630J5079k7971M340Q871L135k5696L0147
14690G888K116j1126m078r918j690K8831J443J076o12j5875k0485J5189Q998j4073
$$ plain form
14781 9924 -18521 -16048 -2153 13048 12893 10582 3945 17442 38765 48352 3531 -4853 -11210
14768 -11210 -6607 -216 5980 7058 18771 9152 -32646 -38694 -2014 -1225 -8031 -6113 758 322
14754 322 6144 -12008 -10209 -3056 10962 -2229 -5597 -15749 -4969 3913 -9839 -8505 -2989
14741 -2989 1738 12483 19825 27624 32349 29437 -970 -18938 -29865 46 21612 12464 15615
14728 15615 34899 25928 27460 -1648 -18210 -13595 -1567 11511 24164 36841 20246 -12229
14716 -12229 -17398 -19388 -29641 -10238 -14012 -9422 -27603 -33796 -19713 -12449 -5468 9944 4994
14703 4994 5540 -8791 -12822 -11775 -16647 -17 15062 -12909 -8569 302 3437 -22259 7888
14690 7888 10004 -1122 -5200 -15118 -16808 12023 13466 14542 13930 -1945 -22430 -7241 1757 -12316
14676a2316Q058J2484K684N38m526r121k4931M740R516J9471j7296j5543O006
14663b0236j0918J5901N845q780j3651Q85Q821O922K371Q394j4918K2360M051
14650G047O759L258m113J4340R086l046r816J1601k1814j4726j3288J4853L773
14637C914O262k729r929j1859k1252n127M803K22J9936J7137m471j4636K82J503
14623a5944K084P55m665j5107k8559r984L8263K7295K0076k107q531M808O013
14610A4397j6189J147J7270j4627j5076Q790j0440j5499M449J2561k270K1058
14598E571M149o432J7068R025J7032J3042k903j5446p20j1923k0749m267p518
14585d071j7507L7292L1900J9185m8089l4866P140K3603J3176R77l3872o154J4160
$$ plain form
14676 -12316 -4258 8226 10910 11448 6922 -2199 -27130 -22390 -12874 6597 -10699 -26242 -20236
14663 -20236 -31154 -15253 -9408 -18188 -31839 -30954 -22133 -15211 -12840 -4446 -19364 2996 7047
14650 7047 13806 17064 12951 27291 36377 33331 23515 35116 13302 -1424 -14712 141 3914
14637 3914 10176 7447 -2482 -14341 -35593 -40720 -35917 -35695 -15759 1378 -3093 -17729 -17447 -15944
14623 -15944 -13860 -13105 -17770 -32877 -61436 -71420 -33157 -5862 14214 12107 3576 8384 14397
14610 14397 -1792 -645 16625 1998 -13078 -4288 -14728 -30227 -25778 -13217 -15487 5571
14598 5571 9720 3288 20356 29381 46413 59455 56552 41106 40386 28463 7714 3447 -4071
14585 -4071 -21578 15714 47614 66799 18710 -16156 -9016 14587 27763 28740 -5132 -11286 2874
14572B874j7463r512m426K5420J8663j2626m4221K102K3846K5663R13j5781M379
14559a69R298K3489O402K945j6770l2630l688K6091J5334k0259j2261j9926R615
14546a2529L3551r747k5505k0439j1153n617J3284P460M077J2205J5133j0208
14534i488O874r858J0688l643N79J8079K3647O799j619j5565k5630L635M966K540
14520A2004M160j1042m733j6033J1275J2900j140k7614J5634J5569j3227p549
14508i796L360J3634j2332k6128P059Q195p563J6207M639r565j794J4968j1252
14495a0368J9015J6320j2286N756K5700l730k7228k1314q352K4044l1610l021
14483b7074R855K2531M0576j8470r484j2202k2233m569J6828j818j1837j9746
$$ plain form
14572 2874 -14589 -24101 -28527 -3107 15556 2930 -41291 -39189 -15343 10320 11233 -4548 -169
14559 -169 9129 32618 39020 41965 25195 -7435 -11123 14968 30302 10043 -2218 -22144 -12529
14546 -12529 21022 11275 -14230 -34669 -45822 -51439 -38155 -30695 -26618 -14413 720 -9488
14534 -9488 -2614 -12472 -1784 -5427 -4848 13231 36878 43677 42058 26493 863 4498 9464 12004
14520 12004 16164 5122 389 -15644 -4369 8531 7391 -20223 -4589 10980 -2247 -9796
14508 -9796 -6436 7198 -5134 -31262 -24203 -16008 -23571 -7364 -2725 -12290 -14084 884 -10368
14495 -10368 8647 24967 12681 18437 44137 40407 13179 -8135 -16487 7557 -24053 -27074
14483 -27074 -17219 5312 45888 27418 17934 5732 -16501 -21070 -4242 -6060 -17897 -37643
14471c7643q194m720o398J6500J3750R639m9L4395m998P69J9909m3k8119k7266
14457b2468j8725J6410M909o367L7922R919k4478L801J3989K3505j1131k0524
14445F762Q18O234j7204k9139J3398J5322k4912j52J2478O712J2063K584k8453
14432b3489k0608j7021k090J19M3861K4207m918k2679Q268k3210Q983K1506m909
14419a1980J6023M719j2729j3696j9142l059L85K2104n139o998J9973R932n448
14406e055J1350R231k8342Q717K3829N094k909j7970J3633J5330M827j0089L254
14393C0900M465j0773k4206j4129j241o103p958R985J0951K1466k358R152l812
14380A6339J0799j6149o667k4629R893m377J0217J2305K642K0385Q869m6046l9809
$$ plain form
14471 -37643 -45837 -50557 -56955 -40455 -26705 -17066 -17115 17280 12282 13051 32960 32917 4798 -22468
14457 -22468 -41193 -24783 -19874 -26241 11681 21600 -2878 923 14912 38417 27286 6762
14445 6762 7580 13814 -3390 -32529 -19131 -3809 -28721 -28873 -16395 -9683 2380 4964 -23489
14432 -23489 -44097 -61118 -63208 -63089 -19228 4979 61 -22618 -14350 -37560 -28577 -7071 -11980
14419 -11980 4043 8762 -3967 -17663 -36805 -39864 -39479 -17375 -22514 -29512 -9539 393 -5055
14406 -5055 6295 15526 -12816 -4099 19730 24824 21915 3945 17578 32908 37735 27646 30900
14393 30900 35365 24592 386 -13743 -14984 -21087 -29045 -19060 -8109 13357 10999 20151 16339
14380 16339 27138 10989 4322 -20307 -10414 -14791 -4574 7731 10373 30758 39627 -6419 -46228
14367d6228Q128N088J3551K3545L896q685J1654K247o668M509p677N498n862K6116
14353B9112K9291l0496j0566K3585j4592j4916N948k8428p409p445Q491r528j2958
14340c9911K2390m167N348N934M709K2049J4793j1824m2233k4227K4803L0837
14328H501K550N97N911J3768k4791k9732j2095J6216L2280M3433L818k3154j6385
14315B0917r180j1705p573j2612K3459K2192K2779j1685j7655j5286J0648R264
14303B3563Q499r566j4094J2192O82j5310P403j1779l490N042j6119O300J9401
14290A2724N551J4600L671k706k62m5940l3193J1438L6816o945m2201J2951Q993
14277b4503l134J2355M4435m030j4614J3950j0970j9540J2081j8357M369r7j7957
$$ plain form
14367 -46228 -38100 -33012 -19461 4084 7980 -705 10949 13196 6528 11037 3360 8858 2996 29112
14353 29112 58403 27907 17341 40926 26334 11418 17366 -11062 -18471 -25916 -17425 -26953 -39911
14340 -39911 -17521 -21688 -16340 -10406 -5697 16352 31145 19321 -22912 -47139 -22336 8501
14328 8501 11051 11648 17559 31327 6536 -23196 -35291 -19075 13205 56638 60456 37302 20917
14315 20917 11737 32 -7541 -20153 3306 25498 48277 36592 18937 3651 14299 23563
14303 23563 32062 22496 8402 20594 21276 5966 13369 1590 -1900 3142 -12977 -6677 12724
14290 12724 18275 32875 36546 33840 33578 -12362 -45555 -34117 2699 -4246 -46447 -33496 -24503
14277 -24503 -27637 -15282 29153 25123 10509 24459 13489 -6051 6030 -12327 -7958 -8055 -26012
14264b6012P446N532J13J2674J2750j366p060O970l1433l2518k1545J9577K2127
14251c2745J0974k8832J6935K0589K0913J216j4890j4249j9242J4078J9439j2601
14239a8415J1992J8515q180K953j4870o494n468K2893K0608J3018K811J19J1973
14226E1455p153p117j0439j0896Q048K8454J6714l1036j4021q186j2633j0145
14214f955L888J3791j7735L328l340J2137J8144L429j5081m979P587n347n890
14201B977J8819q806j5688N651N804J8070j788O82j1789Q47o088J5771K3951r5
14187D8318q308L125k9892j1025M354K0854M916k1287m1719K931K1213m86r906
14174a6912l799J9346J2527k0178J1632K8566k4361q911k4237j9533Q776k85Q302
$$ plain form
14264 -26012 -18566 -13034 -12921 -247 12503 11137 4077 11047 -20386 -52904 -74449 -54872 -32745
14251 -32745 -21771 -50603 -33668 -13079 7834 9050 -5840 -20089 -39331 -25253 -5814 -18415
14239 -18415 -6423 12092 3912 6865 -8005 -14499 -19967 2926 23534 36552 39363 39482 51455
14226 51455 44302 37185 26746 15850 23898 52352 69066 38030 24009 15823 3190 -6955
14214 -6955 -3067 10724 -7011 -3683 -7023 5114 23258 26687 11606 6627 14214 8867 2977
14201 2977 21796 12990 -2698 2953 8757 26827 25039 25721 13932 14779 8691 24462 48413 48318
14187 48318 40010 43135 13243 2218 6572 27426 32342 11055 -30664 -27733 -6520 -7006 -16912
14174 -16912 -20711 -1365 11162 -9016 2616 31182 6821 -2090 -26327 -45860 -37084 -37369 -29067
14161b9067R875J0145n984M001j4726j1805K1434o666j7929J226n754k634J3078
14148c4806J6464O798k336n133K2203K1769Q706j950Q0j725k6935j4844L849M0013
14134C2153L0838m257j7924k8801k5093M937q045q403K1703R044j9098q641J6817
14121d770R013j8069j3240K6213o959n205M7339k854k57j0879j0375o112n674
14108a829r305j125q987R768J1636j1630j657K8512l776j2354j5029l564j8436
14095c7776n662M1710Q788m777j0622q827J0299j384j0959P55M964r9j0211J9427
14081d374J6331p594L636j7548K2196k618r325O050K264m903R56j2430P081N982
14067E704j692j088k0149J892K2337p114J360Q091J0655J2851j1969N195o578
$$ plain form
14161 -29067 -19192 -9047 -15031 -11030 -25756 -37561 -16127 -22793 -40722 -39496 -45250 -47884 -34806
14148 -34806 -18342 -11544 -13880 -19013 3190 24959 33665 31715 31795 30070 3135 -11709 -7860 32153
14134 32153 62991 58734 40810 12009 -13084 -8147 -16192 -24595 -2892 6152 -12946 -21587 -4770
14121 -4770 4243 -13826 -27066 -853 -7812 -13017 34322 31468 31211 20332 9957 3845 -1829
14108 -1829 -11134 -12259 -21246 -11478 158 -11472 -13129 15383 11607 -747 -15776 -19340 -37776
14095 -37776 -43438 -1728 7060 2283 -8339 -17166 -6867 -8251 -19210 -18455 -13491 -13590 -23801 -4374
14081 -4374 11957 4363 7999 -9549 12647 10029 704 6754 9018 4115 5071 -7359 -278 5704
14067 5704 4012 2924 -17225 -15333 7004 -110 1250 9341 19996 32847 20878 26073 19495
14054A9495j4432j4960R478j9096k647K6617J8861l487j7208n626j9152k1915
14042d4072K1221L2335n792q52K8351Q16k2398R63L291q513k0281j0666p771J4572
14028a8796J9877L3216j590l447J1236J1800j0637k8194N383l605j2406q335n634
14015a1132K77p640J994K780k145J8739J6335K3173J9247k0772j3565K4546j5386
14002C6451j0429k088k0787K302R615k0937K0561R360r447p711l898j9093k1304
13989c7405J2558j1001j8674J6636J9084K3664l152j7350j8481J7042J8142j9189
13977a8126j5250M970J3121O498K1854J1005n614k0335L540N000p803o997j4788
13964b2925k1172L3911L8335J6587j0606m091J5743j1293l5825k6856J7285J4
$$ plain form
14054 19495 5063 -9897 -419 -19515 -22162 4455 23316 19829 2621 -3005 -22157 -44072
14042 -44072 -22851 9484 3692 2840 31191 32007 9609 10572 13863 5350 -14931 -25597 -33368 -18796
14028 -18796 1081 34297 32707 29260 40496 52296 41659 13465 18848 15243 2837 -5498 -11132
14015 -11132 -10855 -18495 -16501 -13721 -15866 2873 19208 42381 61628 40856 27291 51837 36451
14002 36451 26022 23934 3147 5449 15064 -5873 14688 24048 14601 6890 2992 -16101 -37405
13989 -37405 -24847 -35848 -54522 -37886 -18802 4862 1710 -15640 -34121 -17079 1063 -18126
13977 -18126 -33376 -28406 -15285 -8787 13067 24072 18458 -1877 1663 6663 -1140 -8137 -22925
13964 -22925 -44097 -10186 28149 44736 34130 30039 45782 34489 -1336 -28192 -10907 -10893
13952a0893J288J2969J818J6343M163j7274j4879K224K4384J28j8596J5962J3778
13939C1415J1676r872O374k5637p911M216k299j3819j7059N982J2697R555L7588
13926D2906n07m2154p794J3353k845J1898M654j7511j77O809o496j5912p681L376
13912a8081N742j0306m737K2037J8265J1676M372k718j4147M202J970l3019L220
13899a1524K4631r292j4704j9124m480j1835j823j1099P033K5219K3158K806o084
13886g118j0192K021K565J1122o948n751k1206j1825J1375K8207M353k7409N314
13873b5492J5991J2696j5243K473M846K0377J5395J3307L643J4268j4061l504
13861D4696l9319j38O884R127l87p885k6775j2123K2040J7102O705j4808J0660
$$ plain form
13952 -10893 -9605 3364 5182 21525 25688 8414 -6465 -4241 20143 20271 1675 17637 31415
13939 31415 43091 33219 39593 13956 6045 10261 7962 -5857 -22916 -16934 -4237 5318 42906
13926 42906 42399 245 -7549 5804 2959 14857 19511 2000 1823 8632 2136 -13776 -21457 -18081
13912 -18081 -12339 -22645 -27382 -5345 12920 24596 28968 26250 12103 16305 18275 -14744 -11524
13899 -11524 13107 3815 -10889 -30013 -34493 -46328 -48151 -59250 -52217 -26998 -3840 -1034 -7118
13886 -7118 -17310 -15289 -12724 -1602 -8550 -14301 -35507 -47332 -35957 -7750 -3397 -30806 -25492
13873 -25492 -9501 3195 -12048 -9575 -4729 15648 31043 44350 47993 62261 48200 44696
13861 44696 5377 5239 12123 21250 20863 12978 -13797 -25920 -3880 13222 19927 5119 15779
13848A5779K0439J3811j0440P187j5741j5067PJ4283K659k325Q075M218j971m563
13834C6351k3905j4497R836j2112M774N613l84O02j3182M975M947n000j0144M449
13820g677j326j1929K8448J4359p718P12K2375m66j9520K052j7639M218p230n051
13806f392l271J3824J5968N862R20N330J1869j5390j4854j5322K614O239O788
13793A4185K0862J72k0782J5996M812K590r517K231n228j9326j2562j8773q83
13780b6223J425K7072K2882R391r381j9456L12o984j699p390K199K2808J8368
13767C3324K700m2089k413K3545J8029K072K4601j6107j1356j2660k477P133k4467
13754a65n730r324o786J113j4286m955M2932K1931j467k5699j6560j1144R719
$$ plain form
13848 15779 36218 50029 39589 46776 31035 15968 15975 30258 32917 30592 38667 42885 40914 36351
13834 36351 12446 -2051 7785 -4327 447 6060 5676 6278 -6904 -1929 3018 -1982 -12126 -7677
13820 -7677 -9003 -20932 7516 21875 14157 14869 37244 36778 17258 19310 1671 5889 -1341 -6392
13806 -6392 -9663 4161 20129 25991 26911 32241 44110 28720 13866 -1456 1158 7397 14185
13793 14185 35047 35219 14437 30433 35245 37835 28318 30549 25321 5995 -6567 -25340 -26223
13780 -26223 -24798 2274 25156 34547 25166 5710 6022 -962 -2661 -10051 -7852 14956 33324
13767 33324 36024 -6065 -8478 15067 33096 35168 59769 43662 32306 19646 17169 24302 -165
13754 -165 -5895 -15219 -22005 -20892 -35178 -40133 2799 24730 23263 -2436 -18996 -30140 -20421
13741b0421j0018k8323L0431M2461q075j337J8701j3982o047j5629K041j4117
13729b4315J200M632q78J2625K1818j624J1220j5355k280J1513J827J0579j764
13716B9198j2967m2093j61J7846m508J4110J1737n130J0075k973j7073j0528J1869
13703e98J4212P52m3797j8239L1749J6075j1371J4121m67o162J4238j7742l271
13690a0500J7583n5l0651N70p876J2082M959l248J5184j186J535K1422N753l4002
13676h430k5364m715L072P927J7721K9674J0784n248j1796m920R961N91r31k955
13662A5371P471r390m8J1198L248j2017J2681m035L534L815p67j6827l792K1174
13648C1616p799O189k5356j7200r351Q584K4501J901l4094P663J8547R288k4449
$$ plain form
13741 -20421 -30439 -58762 -28331 14130 6055 4718 23419 9437 3390 -12239 -10198 -24315
13729 -24315 -23115 -18483 -19361 -6736 15082 13458 24678 9323 7043 18556 20383 30962 29198
13716 29198 16231 -25862 -26023 -8177 -12685 1425 13162 8032 18107 15134 -1939 -12467 -598
13703 -598 13614 14366 -29431 -47670 -15921 154 -11217 2904 2437 -3725 10513 -7229 -10500
13690 -10500 7083 7028 -23623 -23053 -30929 -18847 -13888 -17136 -1952 -3138 -1603 19819 25572 -8430
13676 -8430 -33794 -38509 -35437 -27510 -9789 19885 30669 25421 13625 8705 18666 19257 18326 15371
13662 15371 22842 13452 13404 24602 27850 15833 28514 24479 28013 31828 31061 14234 10442 31616
13648 31616 23817 30006 4650 -12550 -21901 -13317 11184 13085 -21009 -13346 5201 14489 -9960
13635i960j0271K6265K8188j2105k4524j003J6878n718o550K2811J1116j393n253
13622B8481J0870P031r429J6039j5119m0365j8817j485K194K8762j6288n98j6959
13609b5683j5085J554K7285L2708p01m7855k1368j6043J4309L5798L9596J8825
13597D3340k9708m321P530j7680J0532k661j9551k1654J5185J1233K6876Q79j3162
13584F838n747j74p093j6274K346L9075K5633L95j9025k6756l2881j6779J3498
13571c6944K370J4637K320J801l170N444L255K701o218k540J132j4841N947O487
13557a7619L676J5794N201l908M255R733m356M687J6316j893l3379j0250R128
13544b615K7390k785R219J1983j5356j8525p263J8080j353K567J880j6245l7374
$$ plain form
13635 -9960 -20231 6034 34222 22117 -2407 -3410 13468 7750 1200 24011 35127 33734 28481
13622 28481 39351 46382 36953 52992 37873 -2492 -21309 -22794 -20600 8162 -8126 -8724 -25683
13609 -25683 -40768 -39214 -11929 20779 20078 -27777 -49145 -65188 -50879 -15081 24515 43340
13597 43340 13632 9311 16841 -839 9693 7032 -12519 -34173 -18988 -7755 19121 20000 6838
13584 6838 1091 917 -6176 -22450 -20104 18971 44604 44999 25974 -782 -33663 -50442 -36944
13571 -36944 -34574 -19937 -17617 -15816 -18986 -13542 -10287 -7586 -13804 -16344 -15212 -30053 -24106 -17619
13557 -17619 -13943 1851 7052 3144 7399 17132 12776 17463 33779 31886 -1493 -11743 -2615
13544 -2615 24775 21990 31209 43192 27836 9311 2048 20128 18775 21342 23222 6977 -30397
13531c0397Q806K7550R880O427k124j4041j2076j2627J7289J014j7636R163m463
13518a3235J6571j8014l0522Q720K9149P678J554L621k5487k6103m747J2136J8284
13505b0395J0942J3078l185k8219K052K1549J2149n611j2663j0659J3064k0352
13493b8250j8731K1623J3975K8039J1358R314q436l0422O280J043l883J8041J5041
13480C4992J0515l245j6967m0820j0955k427J2678M1543j1996l6003J3675J6816
13468G806j9216k0364o99J043m361j3148R714L3996O668Q420j0361j0887r62o379
13454a8730O612J0387k21l11R743R360p203N838k1178j093j9481j094J5683P26
13440a0962K503R127r977K4484k4647j873n619K153L2583M0981o943k1063r473
$$ plain form
13531 -30397 -21591 5959 15839 22266 20142 6101 -5975 -18602 -1313 -299 -17935 -8772 -13235
13518 -13235 3336 -14678 -45200 -36480 -7331 347 1901 5522 -19965 -46068 -50815 -38679 -20395
13505 -20395 -9453 3625 440 -27779 -25727 -4178 7971 2360 -10303 -20962 -7898 -28250
13493 -28250 -46981 -25358 -11383 16656 28014 37328 28892 -1530 4750 5793 1910 19951 34992
13480 34992 45507 42262 25295 -15525 -26480 -28907 -16229 25314 13318 -22685 -9010 7806
13468 7806 -11410 -31774 -32473 -31430 -35791 -48939 -39225 -5229 1439 9859 -502 -11389 -12351 -18730
13454 -18730 -12118 -1731 -1952 -2263 7480 16840 9637 15475 -5703 -6796 -26277 -27371 -11688 -10962
13440 -10962 -8459 668 -9309 15175 -9472 -11345 -16964 -14811 17772 58753 51810 30747 21274
13427B1274r252J5745K587j3189m487M633m841J4549j3754k2955j2405L1405J6351
13414B5661k3149k6708N864J8631J9191j3861j8888K6625K3410j1661k7042l0199
13402c2126N33J3085K2780l498l3364P231L1480j517o040J1829P782k8561k372
13389a2758J9647q112j2089J0572J0116J4043R470j9464p907l0441l0987J0443
13377d7467K2636J1306n875p64J3020K7339J1506J0997N639r960q659k6572k806
13364C40J8125o629j7360J3053j8129j466K9293K7871j3256q358J138k4358k2702
13351b2438q749k1971J4119K5510K5796r005J035j3462O678K1260J35j1890k0832
13338a3814K596K0785L731o517o597L1310j6657j3397P31P798n589o621n176J1434
$$ plain form
13427 21274 12022 27767 30354 17165 12678 17311 12470 27019 13265 -9690 -22095 9310 25661
13414 25661 2512 -24196 -18332 299 19490 5629 -13259 13366 36776 25115 -1927 -32126
13402 -32126 -31593 -18508 4272 774 -32590 -25359 6121 4604 -1436 10393 18175 -10386 -12758
13389 -12758 6889 -1223 -13312 -2740 7376 21419 30889 11425 3518 -26923 -57910 -47467
13377 -47467 -24831 -13525 -19400 -20164 -7144 20195 31701 42698 48337 38377 29718 3146 340
13364 340 18465 11836 -5524 7529 -10600 -12066 17227 45098 31842 23484 24622 264 -22438
13351 -22438 -31187 -53158 -39039 -13529 12267 3262 4297 -9165 -2487 18773 18908 7018 -13814
13338 -13814 -11218 9567 13298 6781 184 31494 14837 1440 2171 9969 4380 -2241 -7417 4017
13324D017Q01j3044j0068P210K7849R005j025Q643j0268q816k6841k407J5575
13311F31m709k784J5794Q001J8190j2019l1863J9417K3134k9798k3109J2250K3743
13298A6878l450m430j190R128M465j0235k3383R539J1657K784o638K49n544k5877
13284b6047M359L3653k864j9605O073l081R472J8995j7835l6310N568L000N954
13271a8668K8741M654j9317m1809j5723K0253P27Q845N221j5543K10K3911K0836
13258B338Q507k312K5155J351R529L887j8436j9809J959k0711p852Q0R339J8165
13244A1190K286j4187j1148j4410j3515m821J5164K7221j0140j0828j4701J4671
13232b3218P534P27P242j1612k7147q857J2066J7130O565m462l1173r666K5348
$$ plain form
13324 4017 4818 -8226 -18294 -11084 16765 25770 24745 33388 23120 14304 -12537 -14944 631
13311 631 -4078 -6862 8932 16933 35123 23104 -8759 10658 33792 3994 -19115 -6865 16878
13298 16878 13428 8998 7808 16936 21401 11166 -12217 -2678 8979 11763 5125 5374 -170 -26047
13284 -26047 -21688 11965 9101 -10504 -4431 -7512 1960 20955 3120 -33190 -27622 -24622 -18668
13271 -18668 10073 14727 -4590 -46399 -62122 -41869 -41142 -32297 -27076 -42619 -42409 -18498 2338
13258 2338 10845 8533 33688 35039 44568 48455 30019 10210 12169 -8542 -16394 -16314 -6975 11190
13244 11190 13476 -711 -11859 -26269 -39784 -44605 -29441 -2220 -12360 -23188 -37889 -23218
13232 -23218 -15684 -14957 -7715 -19327 -46474 -55331 -43265 -26135 -19570 -24032 -55205 -64871 -39523
13219c9523K0429n138J0864n014m669J8423L645J6256K1484K4701n195m1438R963
13206B4788R74m96j2971j3832J4744Q10k2980O755J1154J490l0241j3626M61K6706
13192f264J8089j0066j4693J3827J0365n124j7472Q834l682R105J038j7940L862
13179a0121J0061o249m166J7051j0103j6391K243J8277J9512j2177j9956k7625
13167c9644K2147n743n42o072q090J2352K2223Q71J6910q91n202J1688j4518q44
13153D645o10q134j3510j3108j2032m544O568j080L6246K5658p180j3605K081
13140A395J1240k2891k4242K470J0171J2775N74k1226n756P333Q148P710m428
13127a6727o597J2329K3648M018K804K2909o204k9580K0680J5061L737j2084j3410
$$ plain form
13219 -39523 -19094 -24232 -13368 -18382 -23051 -4628 -983 15273 36757 61458 56263 14825 24788
13206 24788 25762 25266 12295 -1537 13207 14017 -8963 -2208 8946 10436 -19805 -33431 -32970 -6264
13192 -6264 11825 1759 -12934 893 11258 6134 -11338 -2504 -6186 2919 3957 -13983 -10121
13179 -10121 -60 -6309 -10475 6576 -3527 -19918 -17675 602 20114 7937 -12019 -39644
13167 -39644 -17497 -23240 -23782 -29854 -37944 -25592 -3369 -2498 14412 13521 8319 20007 5489 4645
13153 4645 4035 -4099 -17609 -30717 -42749 -47293 -40725 -41805 -5559 20099 12919 -686 1395
13140 1395 12635 -10256 -34498 -32028 -21857 -9082 -8508 -29734 -35490 -28157 -20009 -12299 -16727
13127 -16727 -23324 -10995 12653 16671 19475 42384 36180 6600 27280 42341 46078 33994 20584
13114B0584r945J2699K9167j3137j3319j768j3912k1863J121n153l49J0581j8765
13101b4059o765J5825J9948m044l924r484j7403j2125p754J9189J7531P707q163
13088a3521M517K6325N564j9595J47R980O369r130Q732k1394J0183K7944K91l463
13074C2949N18l805Q550Q441J5863J0355j5186j7333j2109n714j2780L489j8572
13061e334J1977M337r510k5182J0311Q419M2651j257l2907j4680j7337j6026q166
13048e2704J6734L3142K7859K558j3138J120M93J1348Q448l0733j7220n251K2905
13035E561J5169n772N854j5080k3179J1941J1435M613j3194M976l465k4999q979
13022c5119r229R611J505K69J8942N122q357O421j1095M806N486J1633p381j4471
$$ plain form
13114 20584 10639 23338 52505 39368 26049 24281 10369 -11494 -10373 -15526 -15875 -5294 -24059
13101 -24059 -30824 -14999 4949 905 -3019 -12503 -29906 -42031 -49785 -30596 -13065 -5358 -13521
13088 -13521 -9004 17321 22885 3290 3437 13417 19786 10656 19388 -2006 8177 36121 36412 32949
13074 32949 33467 29662 38212 46653 62516 72871 57685 40352 28243 22529 9749 13238 -5334
13061 -5334 6643 10980 1470 -23712 -13401 -4982 37669 36412 3505 -11175 -28512 -44538 -52704
13048 -52704 -35970 -2828 25031 27589 14451 15571 16064 27412 35860 5127 -12093 -17344 5561
13035 5561 20730 14958 20812 5732 -17447 -5506 5929 10542 -2652 2324 -1141 -26140 -35119
13022 -35119 -44348 -34737 -33232 -32963 -14021 -8899 -17256 -10835 -21930 -17124 -11638 -5 -7386 -21857
13008b1857K342J0748o731J334J6347L4584j0072j4027J8885m982N846j7267r999
12995E151j9781n12L2912j3618k0210j0845jK491j3768p139K7789M695j2385R409
12981a5812J6240N681k1695k989L097Q056R416l5261l927J3128R423R667P917
12968B941K2241j7474j6221J8215J5929J8617k5484k86K2927J74k4038p362q526
12955A653R416O443p249K415J3897K7113n220l4469j0322K2332j0048p073l345
12942E543j7179R263J1784J0097J0401k2522k7368j6749j410Q045J4309o935j6209
12929c8930J4965L1862L780l6096l3366M81J7743O47J4835Q88Q756k944k309J2472
12915g216j6715j2333J6112n323r226K5334K4258M183m212M581l2363k2208l805
$$ plain form
13008 -21857 -19515 -8767 -15498 -14164 2183 36767 26695 12668 31553 26571 32417 15150 5151
12995 5151 -14630 -15142 17770 4152 -16058 -26903 -26904 -24413 -38181 -45320 -17531 -12836 -25221 -15812
12981 -15812 428 6109 -15586 -18575 -15478 -7422 1994 -33267 -37194 -24066 -14643 -4976 2941
12968 2941 25182 7708 -8513 9702 25631 44248 18764 18478 41405 41579 17541 10179 1653
12955 1653 11069 17512 10263 12678 26575 53688 48468 13999 3677 26009 15961 8888 5543
12942 5543 -11636 -2373 9411 19508 29909 7387 -19981 -36730 -38140 -30095 -15786 -22721 -38930
12929 -38930 -23965 7897 11677 -24419 -57785 -57304 -39561 -38914 -24079 -23191 -14435 -17379 -19688 -7216
12915 -7216 -23931 -36264 -20152 -25475 -34701 -9367 14891 19074 14862 19443 -12920 -35128 -38933
12902c8933K3915K7894J9808l920l68k2228K952J3714o360o926r049J3723M943
12889A9165j7896p659N942O655J5321R571J7718j6823k9717j2144o134j6638o640
12876c9279j4421P130J1566K9853K147q899m445L14Q639J6650J0231j1322L83
12863H547p840J1075j3862k4826k0150M552K0802l531J9270Q922L115r834j3588
12850a7348l240M757j5324K539M454o593K0921k1705l794M2914M5945j7411l1769
12837D346k7744L3241J1184l0253n205K464n303N059J4115j5256j2350L925J3634
12824h143J0732o579J500j4279J7085j1936k5890J3153K4696Q850m734J3732N862
12811B4049R609K5934r797j7005k6666j2032n615J686J3396K4601J7418m594k4522
$$ plain form
12902 -38933 -15018 12876 32684 28764 28396 6168 9120 22834 16474 9548 499 14222 19165
12889 19165 1269 -6390 -448 6207 21528 31099 48817 31994 2277 -9867 -16001 -32639 -39279
12876 -39279 -53700 -46570 -35004 -5151 -3004 -11903 -16348 -16034 -7395 9255 19486 8164 8547
12863 8547 707 11782 -2080 -26906 -47056 -42504 -21702 -25233 -5963 2959 6074 -3760 -17348
12850 -17348 -20588 -15831 -31155 -28616 -24162 -30755 -9834 -31539 -35333 7581 53526 36115 4346
12837 4346 -23398 9843 21027 -9226 -14431 -11967 -17270 -12211 1904 -13352 -25702 -21777 -8143
12824 -8143 2589 -3990 -2490 -16769 316 -11620 -37510 -24357 339 9189 4455 18187 24049
12811 24049 33658 59592 49795 32790 6124 -5908 -11523 -9837 3559 28160 45578 40984 16462
12798A6462k2921J1414K7151k04j8483j2079L274k0198j0266j015j3681K7369
12786a3177J3900J56K0103J1432q82j6605Q000J2672j790k2222j5761P555J87
12773C568q974j0720O469R154L044j1466J3917J2315N217o459J4215J765j6167
12760A5878j7834o969l929k73r591K769J330J3269p488M72K486j8991j5702oQ287
12745c6292N352J5859K4479K2195j286j9078l154J0374m693p382j7508L379K3735
12732A5980q988j5664K659k783J4957K933l1745j1042R703p168k7001O448K5459
12719b6252o362Q804Q715J2574o581k4649Q210L3641k168k128K4407K9761n985
12706E1987n381J8029j2566l590m795k1661J191j967j6711J7163j0778K232o146
$$ plain form
12798 16462 -6459 4955 32106 31902 13419 1340 4614 -15584 -25850 -26865 -40546 -13177
12786 -13177 723 879 20982 32414 31532 14927 22927 35599 33809 11587 -4174 3381 3568
12773 3568 -5406 -16126 -9657 -503 2541 -8925 4992 17307 22524 16065 30280 32045 15878
12760 15878 -1956 -8925 -12854 -13127 -22718 -19949 -18619 -5350 -12838 -12366 -9880 -28871 -44573 -44579 -36292
12745 -36292 -30940 -15081 9398 31593 30307 11229 8075 18449 13756 6374 -11134 -7755 15980
12732 15980 6992 -8672 -6013 -8796 6161 9094 -22651 -33693 -23990 -31158 -58159 -51711 -26252
12719 -26252 -32614 -23810 -15095 -2521 -9102 -33751 -25541 8100 5932 3804 28211 57972 51987
12706 51987 46606 64635 52069 48479 43684 22023 23214 21247 4536 21699 10921 13153 7007
12693G007j7171R888N678j9122O345j3137m697R589J0237L9732j847j2338k533
12680A7631R948O83r237k6757O789k407q714n689J8596J8293l200j2151j1330
12667g545o358J4754k967L560n532K508n671J6404K0431j7157j2005j957J931
12654C96K3342K9204o702j5969j464O011k7832j5982K3260J6846l3860l518M877
12641a391J3664k1275j4811k517K1105J4645j1424j5752m646K3556J0372L63R782
12628B1671N965q004j2204j2722j3145J2853J1259M136j7779n679K6331R179j9703
12615B158Q11M484M818k7218J3848J8154M338L095J8251j1984j6851k1303l834
12602a1233k230K0735M474j6042j3248k0719J5500O382l742p97r870l5351M862
$$ plain form
12693 7007 -10164 -276 5402 -13720 -7375 -20512 -25209 -15620 -5383 34349 32502 20164 17631
12680 17631 27579 28262 19025 -7732 -943 -3350 -12064 -17753 843 19136 15936 3785 -7545
12667 -7545 -13903 851 -2116 1444 -4088 -1580 -7251 9153 29584 12427 422 -1535 396
12654 396 23738 52942 46240 30271 28807 34818 6986 -8996 14264 31110 -2750 -6268 -1391
12641 -1391 12273 -9002 -23813 -26330 -5225 9420 -2004 -17756 -22402 1154 11526 11889 21671
12628 21671 27636 19632 7428 -5294 -18439 -5586 5673 9809 -7970 -13649 12682 21861 2158
12615 2158 2969 7453 12271 -14947 -1099 17055 21393 24488 42739 30755 13904 -7399 -11233
12602 -11233 -13463 7272 11746 -4296 -17544 -38263 -22763 -16381 -20123 -20920 -30790 -66141 -61279
12589f1279J0152L6548K8231j2989n042o539p26J2245R03q44J0357J7895J4331
12576D3243j4727j9198j3328j1235J442P661j118J1579J280K2044P749o113j9271
12563A0008J131J552J207K031q57j7644j7138j515j3707M766O77J9461m653K706
12549a1975M073J004k0569o982L8899O710n619p579O452j0602k2952k978L3478
12536A360J4113j3664R707K2413k4289j7927K3977M728R813j0243l012j3250N982
12523I708o494p948R328K1155M940k6055o959m173j0233K942P912j8648j3747
12510c8272O560J961J422K802L0486J9709p541j7721J1162K2102L624l824o902
12497B5568j0691j2639p727O025O207k437K984q549J6792k838N526K4078J2361
$$ plain form
12589 -61279 -51127 -14579 13652 663 -4379 -10918 -11644 601 1504 660 11017 28912 43243
12576 43243 28516 9318 -4010 -15245 -13803 -6142 -7260 4319 5599 27643 35392 29279 10008
12563 10008 11139 12691 13898 15929 15072 -2572 -19710 -21225 -34932 -30166 -29489 -10028 -14681 -11975
12549 -11975 -7902 -6898 -27467 -34449 4450 11160 5541 -2038 4414 -6188 -29140 -32118 1360
12536 1360 15473 1809 11516 33929 9640 -8287 15690 20418 30231 19988 16976 3726 9708
12523 9708 3214 -4734 4594 25749 30689 4634 -2325 -6498 -16731 -13789 -5877 -24525 -38272
12510 -38272 -31712 -29751 -28329 -25527 4959 24668 17127 -594 10568 32670 36294 32470 25568
12497 25568 14877 2238 -5489 536 6743 4306 7290 -1259 15533 12695 18221 42299 54660
12484E4660j5183k5869o554R162O826M026l0015m034K5094p979J8887j156l160
12471B4705o291j1710J3783j058k6203o128Q995l099L6027n015l9934R81J1784
12458c163O352J2987k653p108k4170P167J0670J7866M41K314P339j7697m2747
12445c2402J4387j926M790j563L93J1607J2277J4016m492p632k7346j4955o926
12432c9772L9365j724m641M823k4830o679J6568J4836P987l8068q504J9348j8386
12419c9677j2781J2592J4620L6378K4133K1596J970q23j9841K1521l566n736l570
12406D6816j122Q067k2365j1350k8622L628K5921j2810p322k1667j1729K227P820
12393b2508J8061J0686n222R792j541l819j2386o857j9216M529O351J057M350
$$ plain form
12484 54660 39477 13608 7054 16216 23042 27068 -2947 -6981 18113 10134 29021 27865 24705
12471 24705 18414 6704 20487 19429 -6774 -12902 -3907 -7006 29021 24006 -15928 -14947 -3163
12458 -3163 3189 16176 13523 6415 -17755 -10588 82 17948 18389 20703 28042 10345 -32402
12445 -32402 -18015 -19941 -15151 -16714 -16321 -4714 7563 21579 17087 9455 -17891 -32846 -39772
12432 -39772 -407 -2131 -6772 -1949 -26779 -33458 -16890 -2054 5933 -32135 -40639 -21291 -39677
12419 -39677 -52458 -39866 -25246 11132 35265 56861 58831 58008 38167 59688 56122 50386 46816
12406 46816 45694 53761 31396 20046 -8576 -4948 20973 8163 841 -20826 -32555 -30328 -22508
12393 -22508 -4447 6239 1017 10809 9268 5449 -6937 -13794 -33010 -28481 -22130 -21073 -16723
12380a6723J454J8105j5496L554o300o358J6276l612J3302p024k4293o071J4425
12367a8761K0846J2134M854p852k2786P779R788l1702J2637J1158j1602J5261
12355A754O417j0858k1656J2623K5859m789j2057J8274j551o425n592L644Q817
12342A4460R02q947j0072J5087K3783o265j70j790Q661k4105l8214Q411J8208
12329e1q23j5686j5002L863J8564K0818q296l918P676K3986j0875k0296j5777
12316a5817N911J5749q053O61P090O339n123j4000o64M597j4290o263L335J4694
12302e834K1481n137k4189J0292k6482k1956J8167P212m339J2114L0775N261o948
12289A0417j8641r980K1404m195k7461L119L1134P948m008j3611j062K4704j1688
$$ plain form
12380 -16723 -15269 2836 -12660 -9106 -15406 -21764 -5488 -9100 4202 -2822 -27115 -33186 -18761
12367 -18761 2085 14219 19073 11221 -11565 -3786 6002 -25700 -13063 -1905 -13507 1754
12355 1754 8171 -2687 -24343 -11720 14139 9350 -2707 15567 14016 7591 1999 5643 14460
12342 14460 15362 6415 -3657 11430 35213 28948 28778 26988 35649 11544 -26670 -18259 -51
12329 -51 -874 -16560 -31562 -27699 -9135 11683 3387 -531 7145 31131 20256 -40 -15817
12316 -15817 -9906 5843 -2210 -1549 5541 11880 6757 -7243 -7907 -3310 -17600 -23863 -20528 -5834
12302 -5834 15647 10510 -13679 -3387 -29869 -51825 -33658 -26446 -30785 -18671 12104 17365 10417
12289 10417 -8224 -18204 3200 -995 -28456 -25337 5797 13745 9737 -3874 -4936 19768 8080
12276H080q926l044k5744j0296L896L728K2648P494m904J1126k595L309k355q052
12262e635J4655R549J5971L357l2648N393l117q696m317J9192j2746k3494j516
$$ plain form
12276 8080 -846 -3890 -29634 -39930 -36034 -32306 -9658 -2164 -7068 4058 1463 4772 2417 -5635
12262 -5635 9020 18569 34540 37897 5249 10642 7525 -1171 -5488 13704 958 -22536 -24052
$$ [...]
##END NTUPLES=NMR SPECTRUM
##END=
