##TITLE=Analysis number 318634
Compound Code cc 48709
Book Reference 475/40/5
Project Code adrs
Chemist Name anns
##JCAMPDX= 6.0         $$ Bruker NMR JCAMP-DX V2.0
##DATA TYPE= NMR SPECTRUM
##DATA CLASS= NTUPLES
##ORIGIN= Bruker BioSpin GmbH
##OWNER= nmr
$$ XWIN-NMR		Version 3.5
$$ Thu Apr  6 11:58:57 2006 GMT Daylight Time (UT+1h)  MAYBRIDGE\nmr@NMR_250MHZ
##.OBSERVE FREQUENCY= 250.131544655141
##.OBSERVE NUCLEUS= ^1H
##.ACQUISITION MODE= SIMULTANEOUS (DQD)
##.ACQUISITION SCHEME= undefined
##.AVERAGES= 16
##.DIGITISER RES= 18
##SPECTROMETER/DATA SYSTEM= dpx250
##.PULSE SEQUENCE= zg30
##.SOLVENT NAME= DMSO
##.SHIFT REFERENCE= (INTERNAL, DMSO, 0, 16.522)
##AUDIT TRAIL= $$ (NUMBER, WHEN, WHO, WHERE, WHAT)
$$ ##TITLE= Audit trail, XWIN-NMR		Version 3.5
$$ ##JCAMPDX= 5.01
$$ ##ORIGIN= Bruker BioSpin GmbH
$$ ##OWNER= nmr
$$ C:\u/data/dgb/nmr/ADRS/2290/pdata/1/auditp.txt
$$ ##AUDIT TRAIL=  $$ (NUMBER, WHEN, WHO, WHERE, WHAT)
(   1,<2006-04-06 11:58:31.23 +100>,<MAYBRIDGE\nmr>,<NMR_250MHZ>,
      <created by zg, POWCHK disabled, PULCHK disabled
       configuration hash MD5:
       84 BC 41 DB A1 6E 1D 46 DA 25 12 A5 C1 ED C5 3A
       data hash MD5: 64K
       26 DA 36 27 29 E5 C9 D2 9E 85 98 D0 FC 08 18 54>)
(   2,<2006-04-06 11:58:46.45 +100>,<MAYBRIDGE\nmr>,<NMR_250MHZ>,
      <Start of raw data processing
       ef LB = 0.3 FT_mod = 6 PKNL = 1 SI = 32K 
       data hash MD5: 32K
       EB 10 68 07 52 0E 9C D9 8B A0 C7 4E B8 11 57 2D>)
(   3,<2006-04-06 11:58:48.04 +100>,<MAYBRIDGE\nmr>,<NMR_250MHZ>,
      <apk 
       data hash MD5: 32K
       E9 89 64 9A F5 9F A2 59 CA FE B3 66 53 93 BF 42>)
(   4,<2006-04-06 11:58:49.05 +100>,<MAYBRIDGE\nmr>,<NMR_250MHZ>,
      <abs ABSG = 5 
       data hash MD5: 32K
       FD 19 EA 99 66 59 23 07 92 01 FA AA B7 10 E1 87>)
$$ ##END=
$$ 
$$ hash MD5
$$ 13 1A B5 B7 03 7A C2 8A 4C 59 FB 10 C5 33 65 E9
##$RELAX= 
##$RELAX= 
##$RELAX= 
##$RELAX= 
##$RELAX= 
##$RELAX= 
##$RELAX= 
$$ Bruker specific parameters
$$ --------------------------
##$DU= <C:\u>
##$EXPNO= 2290
##$NAME= <ADRS>
##$PROCNO= 1
##$TYPE= <nmr>
##$USER= <dgb>
##$AMP= (0..31)
100 100 100 100 100 100 100 100 100 100 100 100 100 100 100 100 100 100 
100 100 100 100 100 100 100 100 100 100 100 100 100 100 
##$AQSEQ= 0
##$AQ_mod= 3
##$AUNM= <au_zg>
##$AUTOPOS= <22 >
##$BF1= 250.13
##$BF2= 250.13
##$BF3= 250.13
##$BF4= 250.13
##$BF5= 500.13
##$BF6= 500.13
##$BF7= 500.13
##$BF8= 500.13
##$BYTORDA= 1
##$CFDGTYP= 0
##$CFRGTYP= 5
##$CHEMSTR= <none>
##$CNST= (0..31)
1 1 145 1 1 1 1 1 1 1 1 1 1 1 1 1 1 1 1 1 1 1 1 1 1 1 1 1 1 1 1 1 
##$CPDPRG= <>
##$CPDPRG1= <>
##$CPDPRG2= <>
##$CPDPRG3= <>
##$CPDPRG4= <mlev>
##$CPDPRG5= <mlev>
##$CPDPRG6= <mlev>
##$CPDPRG7= <mlev>
##$CPDPRG8= <mlev>
##$CPDPRGB= <>
##$CPDPRGT= <>
##$D= (0..31)
0 1 0 0 0 0 0 0 0 0.06 0 0 0 0 0 0 0.0002 0 0 0 0 0 0 0 0 0 0 0 0 0 0 
0 
##$DATE= 1144321109
##$DBL= (0..7)
120 120 120 120 120 120 120 120 
##$DBP= (0..7)
150 150 150 150 150 150 150 150 
##$DBP07= 0
##$DBPNAM0= <>
##$DBPNAM1= <>
$$ [...]
##$SUBNAM7= <"">
##$SUBNAM8= <"">
##$SUBNAM9= <"">
##$SW= 20.6930455092707
##$SWIBOX= (0..15)
0 0 3 0 0 0 0 0 0 0 0 0 0 0 0 0 
##$SW_h= 5175.983436853
##$TD= 65536
##$TD0= 1
##$TE= 294.16
##$TE2= 300
##$TE3= 300
##$TEG= 300
##$TL= (0..7)
0 120 120 120 120 120 120 120 
##$TP= (0..7)
150 150 150 150 150 150 150 150 
##$TP07= 0
##$TPNAME0= <>
##$TPNAME1= <>
##$TPNAME2= <>
##$TPNAME3= <>
##$TPNAME4= <>
##$TPNAME5= <>
##$TPNAME6= <>
##$TPNAME7= <>
##$TPOAL= (0..7)
0.5 0.5 0.5 0.5 0.5 0.5 0.5 0.5 
##$TPOFFS= (0..7)
0 0 0 0 0 0 0 0 
##$TUNHIN= 0
##$TUNHOUT= 0
##$TUNXOUT= 0
##$USERA1= <user>
##$USERA2= <user>
##$USERA3= <user>
##$USERA4= <user>
##$USERA5= <user>
##$V9= 5
##$VALIST= <valist>
##$VCLIST= <CCCCCCCCCCCCCCC>
##$VD= 0
##$VDLIST= <DDDDDDDDDDDDDDD>
##$VPLIST= <PPPPPPPPPPPPPPP>
##$VTLIST= <TTTTTTTTTTTTTTT>
##$WBST= 1024
##$WBSW= 4
##$XGAIN= (0..3)
0 0 0 0 
##$XL= 0
##$YL= 0
##$YMAX_a= 307698
##$YMIN_a= -493706
##$ZGOPTNS= <>
##$ZL1= 120
##$ZL2= 120
##$ZL3= 120
##$ZL4= 120
##$ABSF1= 16.522
##$ABSF2= -4.171173
##$ABSG= 5
##$ABSL= 3
##$ALPHA= 0
##$AQORDER= 0
##$ASSFAC= 0
##$ASSFACI= 0
##$ASSFACX= 0
##$ASSWID= 0
##$AUNMP= <proc_1d>
##$AZFE= 0.1
##$AZFW= 0.1
##$BCFW= 0
##$BC_mod= 0
##$BYTORDP= 0
##$COROFFS= 0
##$CY= 12.5
##$DATMOD= 1
##$DC= 0
##$DFILT= <>
##$DTYPP= 0
##$F1P= 14.0000005364418
##$F2P= -0.99999901652339
##$FCOR= 0.5
##$FTSIZE= 32768
##$FT_mod= 6
##$GAMMA= 0
##$GB= 0
##$INTBC= 1
##$INTSCL= 1
##$ISEN= 128
##$LB= 0.3
##$LEV0= 0
##$LPBIN= 0
##$MAXI= 10000
##$MC2= 0
##$MEAN= 0
##$ME_mod= 0
##$MI= 0
##$NCOEF= 0
##$NC_proc= -6
##$NLEV= 6
##$NOISF1= 0
##$NOISF2= 0
##$NSP= 0
##$NTH_PI= 0
##$NZP= 0
##$OFFSET= 16.522
##$PC= 1
##$PHC0= 166.4572
##$PHC1= 8.884116
##$PH_mod= 1
##$PKNL= yes
##$PPARMOD= 0
##$PSCAL= 4
##$PSIGN= 0
##$REVERSE= no
##$SF= 250.13
##$SI= 32768
##$SIGF1= 0
##$SIGF2= 0
##$SINO= 400
##$SIOLD= 32768
##$SREGLST= <1H.DMSO>
##$SSB= 0
##$STSI= 32768
##$STSR= 0
##$SW_p= 5175.98343685301
##$SYMM= 0
##$S_DEV= 0
##$TDeff= 65536
##$TDoff= 0
##$TI= <Analysis number 999999
Compound Code 99
Book Reference 9
Project Code 9>
##$TILT= no
##$TM1= 0
##$TM2= 0
##$TOPLEV= 0
##$USERP1= <user>
##$USERP2= <user>
##$USERP3= <user>
##$USERP4= <user>
##$USERP5= <user>
##$WDW= 1
##$XDIM= 32768
##$YMAX_p= 534685336
##$YMIN_p= -1997802
$$ End of Bruker specific parameters
$$ ---------------------------------
##NTUPLES= NMR SPECTRUM
##VAR_NAME=  FREQUENCY,     SPECTRUM/REAL,   SPECTRUM/IMAG
##SYMBOL=    X,             R,               I
##VAR_TYPE=  INDEPENDENT,   DEPENDENT,       DEPENDENT
##VAR_FORM=  AFFN,          ASDF,            ASDF
##VAR_DIM=   32768,         32768,           32768
##UNITS=     HZ,            ARBITRARY UNITS, ARBITRARY UNITS
##FACTOR=    0.157963299565203, 1,           1
##FIRST=     4132.6476996994, 0,             0
##LAST=      -1043.33573715361, 0,           0
##MIN=       -1043.33573715361, -1997802,    0
##MAX=       4132.6476996994, 534685336,     0
$$ Real data points
##PAGE= N=1
##DATA TABLE= (X++(R..R)), XYDATA
$$ [...]
15393f58676K56489J7532J55427J55148J75242l41000l76380m2594N54141K75775
15383A71104j44631L7477L54822k34057l02965J81749j88991n27699o8204j86693
15373i08088j03039M33884J14706r6996O7727K2670m6881J93944L11077L06812
15363B95816J67968Q1656l63921o863j25730j76532j96100j03448K20610m1726
15353b48270M3896m09751K32391k2637q8899L34417n2846m8387j97104K20963
15343b36227L85927K74233k10177k57911j9447j94485L10800R5148k62732L31925
15333B17054K85933k98225j9036j56796m9014q9438L39576K84955k0974k53541
15323B40494j09498m9935R6981K47174J07336r690J99883l67735J19871j13732
$$ y = [-658676, -402187, -384655, -229228, -74080, 101162, -239838, -616218, -658812, -104671, 171104, 26473, 63950, 418772, 184715, -118250, 63499, -125492, -653191, -721395, -908088, -1011127, -577243, -462537, -559533, -491806, -469136, -516017, -322073, -10996, 295816, 463784, 545440, 181519, 174656, 48926, -127606, -323706, -427154, -206544, -248270, -204374, -614125, -381734, -404371, -493270, -158853, -211699, -260086, -457190, -236227, 149700, 423933, 213756, -44155, -63602, -258087, 52713, 147861, -114871, 217054, 502987, 204762, 185726, 28930, -20084, -109522, 230054, 515009, 494035, 240494, 130996, 81061, 178042, 425216, 532552, 522862, 722745, 355010, 474881, 361149]
15313C61149n37803k38036P5883K07093o8326j76045J33128J97378M13001K98468
15303F65890K01056j97265K5763L31514q76318m78595o3513L97713K82430n0636
15293B38039R4517k56572j56700k22790M3271K7497P650k30146N4208L98621K65655
15282B63250j3391J14847l87769k4348N51338k79419k55969N7322j43836l28268
15272d46243M9466M7347m75359q0549J59507r6436J4823O97950M23235j74761
15262A18980j59147O51328j39044k90532L44510M2244j66826m5500j5202j19354
15252B21457J16479l54633n5447j25247N490L47337J42940r6412l98702k39586
15242d36324K67463J01053K70133m27166l33731J13825J13670k84083k17333L69256
$$ y = [361149, -176654, -414690, -338807, -131714, -200040, -376085, -242957, -45579, 367422, 665890, 866946, 669681, 695444, 1026958, 150640, -327955, -391468, 6245, 288675, 238039, 332556, 75984, -80716, -303506, -260235, -232738, -225088, -455234, -401026, -2405, 263250, 249859, 364706, -23063, -47411, 503927, 224508, -31461, 25861, -117975, -446243, -396777, -349430, -824789, -905338, -745831, -842267, -827444, -129494, 293741, 118980, -40167, 611161, 472117, 181585, 526095, 568339, 401513, 356013, 340811, 221457, 337936, -16697, -72144, -197391, -191901, 155436, 298376, 201964, -196738, -436324, -168861, -67808, 202325, -224841, -558572, -444747, -331077, -615160, -832493, -463237]
15232d63237K14239M82000O76020j69108j04404j06373R8305q9104k73470m74271
15222b09403m15293R5711N01950K16599j88196O2616K25527Q0805j58567L879
15212B15628Q5062m0852j4061L3724j04307k82231J33974m0700k34339L95851
15202A47749J57193k62994k90089N3008k1925k22051k52501J57111J48250L6276
15192c49973K1709k48202J33379L33368k57656l07322p0782K67140o3082O6607
15182d74814j3555p1850K77957O06559R9015q5153o8015L13900N60130j36681
15172A007493m09752p1460j13961K3468L2705j06184R4501K02144n82804n51364
15162d75214k69768P83420M65166n0352R9923j19660R6097m15616O8947K81665
$$ y = [-463237, -248998, 233002, 909022, 739914, 635510, 529137, 627442, 538338, 264868, -209403, -624696, -528985, -27035, 189564, 1368, 63984, 289511, 370316, 211749, 215628, 300690, 259838, 245777, 279501, 175194, -107037, 26937, -13763, -248102, 147749, 304942, 41948, -248141, -195133, -217058, -439109, -691610, -534499, -386249, -349973, -328264, -576466, -443087, -109719, -367375, -674697, -745479, -478339, -541421, -474814, -488369, -560219, -282262, 324297, 423312, 338159, 270144, 584044, 1144174, 1007493, 597741, 526281, 412320, 435788, 468493, 362309, 456810, 658954, 76150, -475214, -744982, 38438, 503604, 453252, 553175, 433515, 529612, 113996, 182943, 464608]
15152D64608j23446k2601l93881k55601m3258L2243K1439N34269L2497l05065
15142e8796k27663k11550K19630M46240M59969J48478o94541l92367k93915l48835
15132i53350R8019M40731K67689J6970k21500L7614N36244j94983k46095J31552
15122h7109L41193J40891J07285k79447k73391J24731j23777k60227m69742J79102
15112f00491J80779J74291r8207K53060k59465K964K77470k21274l33930L52876
15102b71927J03228K1785J05803R3797M43469j51659l42482L48426K98914o9869
15092E79485k01522J14229L88548k2822n27237l58747m33803M01515L50697l49724
15082e9381L9526J08577l90062J42753J22438n5678L15899J34467J2853m08273
$$ y = [464608, 341162, 318561, -75320, -330921, -374179, -341936, -320497, 213772, 246269, -58796, -286459, -498009, -278379, 167861, 627830, 776308, 81767, -310600, -604515, -953350, -855331, -414600, -146911, -129941, -351441, -313827, 222417, 27434, -218661, -87109, 254084, 394975, 502260, 222813, -50578, 74153, -49624, -309851, -779593, -600491, -419712, -245421, -343628, -90568, -350033, -347069, -69599, -290873, -624803, -271927, -168699, -146914, -41111, 52686, 496155, 344496, 2014, 350440, 649354, 579485, 377963, 492192, 880740, 857918, 330681, -28066, -461869, -60354, 290343, -59381, -19855, 88722, -301340, -158587, -36149, -91827, 224072, 358539, 371392, -36881]
15072c6881l09979J51134K34473J20983o2271O2762J06320n9452n75149o0138
15062d28198j43827r3319L53746J22900j96272l62383J09911j58123K47461M37173
15052a10931p4750j7382k02849L54398J66404J39509m88016m52807N3343L43143
15042b89938L20675K74264P8244l02507q7273k14806M23185J54282J19377J96298
15032F71801K49213L21388P8142j15349k16204j82584j70245l25110k70094J95378
15022B36336J42507j12368M55012M53440n54710k76304J75674P8051J57303R6634
15012H51575L63463J81655l43965m67948p4507K0584j87272n27103J73344K58534
15002B48360P5782L66559M19808K58089K16031M74493j73923L67536N42977R3683
$$ y = [-36881, -346860, -195726, 38747, 159730, 97459, 160221, 266541, 207089, -368060, -428198, -572025, -665344, -311598, -188698, -384970, -747353, -637442, -795565, -548104, -110931, -185681, -203063, -405912, -51514, 114890, 254399, -233617, -686424, -633081, -289938, 30737, 305001, 383245, 80738, -6535, -221341, 201844, 356126, 475503, 671801, 921014, 1242402, 1320544, 1205195, 988991, 806407, 636162, 311052, 40958, 236336, 378843, 266475, 721487, 1174927, 620217, 343913, 519587, 597638, 754941, 851575, 1215038, 1396693, 1052728, 584780, 510273, 530857, 343585, -183518, -10174, 248360, 324142, 690701, 1110509, 1368598, 1584629, 2059122, 1885199, 2252735, 2795712, 2889395]
14992B889395m70041k58831Q6559l68592l41890j91354K18734J12003l48316j42486
14982A185181k00353K52102K67639R7525L09210m43864n12045k72031J99346j67494
14972G15216J15620J17102K73521L18195l8822R6643l2902j56612K781k56989
14962A153753k20796J19054P94888J34545m16239j66523j56875j56847J4953j13584
14952I86329k437K82800N34208j70494n13912J45453J78501L51477K76513K57828
14942B326266J16306K756L6970l87952j44149N96633j01503k61702j06833Q2786
14932B159578k29956P7716N33200L91600K78669l7531L62811M54395K63301N18908
14922D772691R44243P69598R26563P86973J361962J571808K232477K990093L665889
$$ y = [2889395, 2419354, 2160523, 2247082, 1878490, 1536600, 1345246, 1563980, 1675983, 1327667, 1185181, 984828, 1236930, 1504569, 1602094, 1911304, 1467440, 955395, 683364, 882710, 715216, 830836, 947938, 1221459, 1539654, 1500832, 1597475, 1564573, 1407961, 1410742, 1153753, 932957, 1052011, 1846899, 1981444, 1565205, 1398682, 1241807, 1084960, 1099913, 986329, 983892, 1266692, 1800900, 1630406, 1116494, 1261947, 1440448, 1791925, 2068438, 2326266, 2442572, 2445328, 2482298, 2094346, 1950197, 2546830, 2445327, 2183625, 2076792, 2159578, 1929622, 2007338, 2540538, 2932138, 3210807, 3173276, 3536087, 3990482, 4253783, 4772691, 5716934, 6486532, 7413095, 8200068, 9562030, 11133838, 13366315, 16356408, 20022297]
14913B0022297N277624P529501J1790085J6528309K0002263K0559557J8890111
14906A20599747J7266113J4253881Q40451k1581672l1052088k5363802j6302409
14899E8660221j0860434p145185m408781l446503k579653k333468j564986j592899
14891B4728312p61954o41250o63169k72106J3566L05384O66000P52689J609166
14882B5736638K308821L091470L540009M864371O676840R143016J4288520K2001579
14874I1651264L1561739M1829728M7275951M5240958L9194271L4036338K1178215
14867C51968464k1139231p4612735p6698175m9249781k8300257j6232010j0648973
14860G5087302p560778o059009n589216m117219l009357k746693k603124k343323
$$ y = [20022297, 25299921, 32829422, 44619507, 61147816, 81150079, 101709636, 120599747, 137865860, 152119741, 152960192, 131378520, 100326432, 74962630, 58660221, 47799787, 40654602, 36245821, 32799318, 30219665, 27886197, 26321211, 24728312, 23966358, 23325108, 22661939, 22389833, 22403399, 22708783, 23374783, 24127472, 25736638, 28045459, 31136929, 34676938, 39541309, 46218149, 55361165, 69649685, 91651264, 123213003, 165042731, 212318682, 257559640, 296753911, 330790249, 351968464, 330829233, 256216498, 179518323, 130268542, 101968285, 85736275, 75087302, 67526524, 61467515, 55878299, 51761080, 48751723, 46005030, 43401906, 41058583]
14852D1058583j726287j214073j313163q78356l53547J77147N5580O07636J828193
14843C8241713K037944K735991M201078O697605R840923J4325907J9824705K2908393
14835A20814259K1391844J8447937J7013061J1694298q349084l2137647l6006597
14828A12868071k6560501j6845433j0605213p048787n957478m135826l321041
14821C8393792k350441j722847j762876j938082j675104j337833j364538j186724
14813B5055347j367889p62873n97388j123409p27152n89536n13046k99639o03640
14804A8470775n36976k04062n59994r77253p54167k40606j30100j37378n60110
14795A4370129j089561j20671J37104K83246k04559k41246p36870m61179j22675
$$ y = [41058583, 39332296, 38118223, 36805060, 35926704, 35573157, 35750304, 35805884, 36413520, 38241713, 40279657, 43015648, 47216726, 53914331, 63755254, 78081161, 97905866, 120814259, 142206103, 160654040, 177667101, 189361399, 181012315, 148874668, 112868071, 86307570, 69462137, 58856924, 51808137, 45850659, 41714833, 38393792, 36043351, 34320504, 32557628, 30619546, 28944442, 27606609, 26242071, 25055347, 23687458, 22924585, 22327197, 21203788, 20476636, 19887100, 19374054, 19074415, 18470775, 17933799, 17729737, 17169743, 16192490, 15438323, 15197717, 15067617, 14930239, 14370129, 13280568, 13159897, 13297001, 13580247, 13375688, 13134442, 12397572, 11936393, 11813718]
14786A1813718o431k76695k36501m96230k47192k323l61532j23776J13115m92705
14776I683448k70246j22084m81881J36782j66564o85390K9421K63276j46071k30091
14766H010600j73967P1547k05607l35010l08584m51535l4068m21569o85484n37372
14756D928951m31327L22102O29851R9584k6928N3061k10373q5858K09591L41177
14746E829831L24686Q2643L01039L9509k66774j35756n71324l99690l17934J01118
14736D987348k9981l71310o16833k01638M31938P8378l6661J1383p2689L04228
14726D484163J45257l58681j45215j105j86200q0002l7903o3351K44895m52301
14716C549557k66028M8986L25715J13788L4165P3504j15576k05686Q6324P8295
$$ y = [11813718, 11807287, 11530592, 11294091, 10797861, 10550669, 10548346, 10186814, 10063038, 10176153, 9683448, 9413202, 9291118, 8809237, 8946019, 8779455, 8094065, 8123486, 8386762, 8240691, 8010600, 7836633, 7908180, 7702573, 7367563, 7058979, 6607444, 6573376, 6151807, 5466323, 4928951, 4497624, 4819726, 5449577, 5549161, 5522233, 5575294, 5364921, 5279063, 5488654, 5829831, 6154517, 6237160, 6538199, 6577708, 6310934, 6175178, 5603854, 5204164, 4886230, 4987348, 4957367, 4586057, 3969224, 3767586, 4199524, 4277902, 4241241, 4252624, 4179935, 4484163, 4629420, 4270739, 4125524, 4124419, 3938219, 3858217, 3820314, 3756963, 4001858, 3549557, 3283529, 3332515, 3658230, 3772018, 3806183, 3879687, 3764111, 3558425, 3644749, 3723044]
14706C723044J12364k80323l95805K72754j12238l54598m41262M5047M2131L19264
14696B930378P9474J57861J62196k54246k70564K88625j04903M31425J59613L80345
14686C960204K24472P66638J045131O30016P66917J270631J357267J666834J060839
14677A2748949J368969O66406K77765k83252n62459j233177j519293j410532j071619
14668H981757j182213r45348o72914o84457o61441m07558n88085K19720J73631
14659D233092Q960n11099n84796j66088J06613j01196j10724n3887j89906k2508
14649B608461j51324j62819j0372L03768j34531m6920j19756n26211l56045K54808
14639A659059P3250m874j29059J12690q8288k81257j37310l82884j27638N15456
$$ y = [3723044, 3835408, 3555085, 3159280, 3432034, 3319796, 2965198, 2523936, 2568983, 2611114, 2930378, 3009852, 3167713, 3329909, 3075663, 2805099, 3093724, 2988821, 3420246, 3579859, 3960204, 4184676, 4951314, 5996445, 6626461, 7393378, 8664009, 10021276, 11688110, 12748949, 14117918, 14784324, 15062089, 14778837, 14216378, 12983201, 11463908, 10053376, 8981757, 7799544, 6854196, 6181282, 5496825, 4835384, 4427826, 3839741, 4059461, 4233092, 4242052, 3730953, 3146157, 2980069, 3086682, 2985486, 2874762, 2820875, 2630969, 2608461, 2457137, 2294318, 2283946, 2587714, 2453183, 2406263, 2286507, 1760296, 1404251, 1659059, 1732309, 1727435, 1598376, 1711066, 1622778, 1341521, 1204211, 821327, 693689, 1209145]
14629A209145L25924J52092n09952k12840J99814K34870j65091l82452n4665j66001
14619F30844J11942j1511l47934K53126K71768J26311O07634o748k61631k24492
14609A149309k87953M5237K71227l53236k77616m3989J37598L1346N2859n14379
14599B10403l015o2814J62679M07400m28461P5595q8611J58965K1779K76022O75229
14588A405171P873l67638l13588j80434J65111l0413J78757O07535o1414l19972
14578A090988J72468k61811n81731R2839K00007K35919j78812p0896j93063J2460
14568E18368M54379M4427l53333l62637J70647J14529o68397k7188L87993J8869
14558B97657Q9722r1102M40045M88979O7024K16413M2221k13713q61535j12312
$$ y = [1209145, 1535069, 1687161, 1177209, 964369, 1164183, 1399053, 1233962, 851510, 796845, 630844, 742786, 731275, 383341, 636467, 908235, 1034546, 1642180, 1635432, 1373801, 1149309, 861356, 906593, 1177820, 824584, 546968, 502979, 640577, 671923, 724782, 210403, 207388, 144574, 307253, 714653, 286192, 361787, 273176, 432141, 453920, 729942, 1405171, 1413044, 1045406, 731818, 551384, 716495, 686082, 864839, 1472374, 1410960, 1090988, 1263456, 1001645, 419914, 512753, 712760, 948679, 769867, 698971, 505908, 518368, 972747, 1017174, 663841, 301204, 471851, 586380, -82017, -109205, 278788, 297657, 387379, 296277, 736322, 1225301, 1292325, 1508738, 1550959, 1337246, 475711, 363399]
14548C63399M03905K02964j59147l23406n03752J52450L20951M85476P6903k62778
14538G56965k22313K95983J49260J5875k49697j1597J41541l75370k27049K935
14528B76533J7927k2214K47207P76609K85795k40686m68796p72878k16025J83840
14518F7312K38931j62030l01617l04333j7780K20677k38851k1732K67268J10268
14508a41887R7576J99752J18915o2923q9024J79979l1742k45616J093J16390Q1961
14497B24474K21220l91106r17399o0232L32728J22830L31860J39915j24261k04460
14487c24431j65016M55749K03703q413L59437l8396l05475L93658N02373L75824
14477A449013L9928l20531o43874k15541J43860k25964k52128K30076O7537j93682
$$ y = [363399, 767304, 970268, 811121, 487715, -16037, 136413, 457364, 942840, 1019743, 756965, 534652, 830635, 979895, 995770, 746073, 734476, 876017, 500647, 273598, 276533, 294460, 272246, 519453, 1296062, 1581857, 1341171, 872375, 99497, -116528, 67312, 306243, 144213, -157404, -461737, -479517, -258840, -497691, -519423, -252155, -141887, -44311, 155441, 274356, 211433, 122409, 302388, 270646, 25030, 26123, 142513, 224474, 445694, 54588, -862811, -923043, -590315, -467485, -135625, 4290, -119971, -324431, -489447, -33698, 170005, 161592, 521029, 482633, 177158, 570816, 1073189, 1449013, 1488941, 1168410, 524536, 308995, 452855, 226891, -25237, 204839, 272376, 78694]
14467G8694J45322P9282k28394p9963k12926r8671K40827l8406m5448O8195q1897
14456a73385K79147J45358l5156Q4434K11791J65269m4857j89516K25774M9034
14446G17893J10733j45899M38276K14612j55301p2306k21226j32505k0466j36233
14436E97578m7546m6134l88790j14784K79356N5887j95625K6552L42225r9833
14426D08886m03863k37165J31957O8647O2179l773R0879J44618J50658J39658
14416E52681j42962j94681j89829K81105j58034l08748o5263J35742J69590M4316
14406A23917j00814L18319j12213j18676J85458N3991n23991K9810O6615j12994
14396a90578N375J49972n3604k31659K13745M50537R6882J43603q9268j97718
$$ y = [78694, 224016, 303298, 74904, -5059, -217985, -316656, -75829, -114235, -159683, -91488, -173385, 105762, 251120, 215964, 300398, 512189, 677458, 632601, 443085, 668859, 717893, 828626, 682727, 1121003, 1335615, 1180314, 1108008, 886782, 754277, 733811, 597578, 550032, 503898, 115108, 324, 279680, 335567, 139942, 166494, 508719, 408886, 5023, -232142, -100185, -31538, 30641, 26868, 117747, 262365, 413023, 552681, 409719, 215038, 25209, 306314, 148280, -160468, -225731, -89989, 79601, 123917, 23103, 341422, 229209, 110533, 295991, 349982, -174009, -144199, -77584, -190578, -185203, -35231, -88835, -320494, -106749, 343788, 440670, 584273, 495005, 297287]
14386B97287J88637K50022k37975o19079J11573J54429j9360j70069J40090K00530
14376B96085j50741r5630l40299n6544j78387J17434L69738K92521J06598M04905
14366G65680K70426m69923m13590K65991P71608k03938j53714n60044r5240P03995
14356H81251J08931l53519j5765L33345J60600l73318m26836j50249L851M01491
14346E69782K12846l55785j0070L32536j60633n57430L3255P3663P1357p6374
14336A33147l01323k20837n0641N06398J16933M7178q748k2608N1685L0384R280
14325B90848k54196j55001n1148O9817L43349K88956l03915k91217J96632l5530
14315I8595m42427j3326O24831J55913l28006k03143K32662L48053l24238o38081
$$ y = [297287, 485924, 735946, 497971, -121108, -9535, 144894, 125534, -44535, 95555, 296085, 145344, 49714, -290585, -347129, -525516, -408082, -38344, 254177, 360775, 765680, 1036106, 566183, 152593, 418584, 1190192, 986254, 832540, 272496, 177256, 881251, 990182, 636663, 620898, 954243, 1114843, 741525, 314689, 164440, 168291, 569782, 782628, 426843, 416773, 749309, 588676, 31246, 64501, 138164, 209521, 133147, -168176, -389013, -439654, 66744, 183677, 230855, 222107, 199499, 251184, 281568, 290848, 36652, -118349, -169497, -99680, 243669, 532625, 228710, -62507, 134125, 98595, -343832, -357158, 267673, 423586, 95580, -107563, 125099, 473152, 148914, -489167]
14305d89167j0791P7210J76934p5968J6923K2637k0137K35710j00849J8210K01026
14294E1738J27381j24571R6015J58656K09421j87819j9896J7441m7269K95065
14284E76162K19382l52680p7700K73674k73888k80449J59314R4403N303K09215
14274E52736k58581m26906p7717J46330j61837N7537K32614J27236L02241J64577
14264F58230n5924J91240j81696l76415k27696l7002J15262L28875R6830m1102
14254D70602j34573k67710N647L97120K9680k10493J05134j05163j82919l01150
14244a93825r2914J29471M71404M03910K61708N7887k27920m00140m6254K65865
14234F29192L53692L12858L71053j7036j10822J35653Q38613N97355j05107m62661
$$ y = [-489167, -499958, -422748, -245814, -321782, -304859, -282222, -302359, -66649, -167498, -149288, 51738, 179119, 54548, 150563, 309219, 518640, 330821, 310925, 328366, 281097, 576162, 795544, 442864, 365164, 638838, 364950, 84501, 243815, 338218, 343521, 552736, 294155, -132751, -210468, -64138, -225975, -168438, 64176, 191412, 493653, 658230, 602306, 793546, 611850, 235435, 7739, -29263, 85999, 414874, 511704, 470602, 336029, 68319, 73966, 471086, 500766, 290273, 395407, 290244, 107325, -193825, -286739, -157268, 314136, 718046, 979754, 1037641, 809721, 409581, 363327, 629192, 982884, 1295742, 1666795, 1649759, 1538937, 1674590, 2513203, 3110558, 3005451, 2542790]
14224B542790K24351j21048k58282r6083n21671l64255M94233K34705k67518j58351
14214A708871n5507j71258J00468J72697k9835L25673K05339M07835L39953j71890
14204B832346l41078j15656K60528R55210J103486J64101J02690k04343m00180
14195D357104j15773j70550P2824j04199l82323m48391l01946k10507j26304k92983
14185B276952J62432m32160L66891L45388m96108l37956j84990l01965n6177j05861
14175A236446k36037j84766k83975J05161j99350k72192K62786L66468J29642
14166I24183J74617J37372j58260K00919Q5248n36935k77981N7426K09897o4670
14156G51816l2935O80914J29017j59375m44357k51754l64093j39160p0225K50970
$$ y = [2542790, 2767141, 2646093, 2387811, 2291728, 1770057, 1405802, 1900035, 2134740, 1867222, 1708871, 1653364, 1482106, 1582574, 1755271, 1725436, 2051109, 2256448, 2664283, 3004236, 2832346, 2491268, 2375612, 2636140, 3591350, 4694836, 4858937, 4961627, 4757284, 4357104, 4241331, 4070781, 4143605, 4039406, 3657083, 3208692, 2906746, 2696239, 2569935, 2276952, 2439384, 2007224, 2374115, 2719503, 2223395, 1885439, 1700449, 1398484, 1342307, 1236446, 1000409, 815643, 531668, 636829, 437479, 165287, 428073, 794541, 924183, 1098800, 1236172, 1077912, 1278831, 1364079, 827144, 549163, 606589, 816486, 751816, 718881, 1399795, 1528812, 1369437, 925080, 673326, 309233, 170073, 99848, 350818]
14146C50818j1864n1071J56754M13525K07999J11849M7698m76086l55584k6375
14136C67663l15285r1990J89575M66657J56799l42245M78121M87319r4633m72385
14126H29596j81675j3646n3496M5731j30025k34002j24397j26483K20306L51528
14116E83437k63697j41318K21978K10714M13485j02086k56779j71857n2021J9742
14106D61598q9152q5417L7287m72706o86613Q4923L45391J55534J89347M7661
14096a2147M68030R9635N2268k481l00307K60824r07k06468p3003M07060j04184
14085E88320o79653q5123L12358K55961O4339j14165J42402J67157j11099N760
14075E46257k52824n97485J49807O56300j06097K4221j37890k09760J09441O9028
$$ y = [350818, 338954, 287883, 444637, 858162, 1066161, 1178010, 1225708, 749622, 394038, 367663, 52378, -39612, 149963, 616620, 773419, 431174, 909295, 1396614, 1301981, 829596, 647921, 634275, 580779, 626510, 496485, 262483, 138086, 11603, 231909, 583437, 319740, 178422, 400400, 611114, 1024599, 922513, 665734, 493877, 441856, 461598, 372446, 287029, 324316, -148390, -835003, -750080, -404689, -249155, -59808, -12147, 455883, 555518, 607786, 605305, 304998, 565822, 564915, 358447, 285444, 692504, 588320, -91333, -176456, 135902, 391863, 456202, 342037, 484439, 651596, 540497, 546257, 293433, -304052, -154245, 502055, 395958, 420179, 282289, 72529, 181970, 250998]
14065B50998m29952J16426j73414O7219M36129N42970j22117m66737L41361K6336
14055E89219j38488L5761l6559r484J89182J09069j5517k63952l92661j92212
14045a25642J98462O9909L31529j95453k65076K5307j2585J99109J93153j47423
14035B71290n6369L95112M32865O13942m20997m58744P6736p7482j8491r1199
14025F66663m59774m7786Q8395r9481n29957j59150j72118J85453O65871N96002
14015G34118L9730M57333J71751j45885j59678k55684j52389k38018k58181N2834
14005B45931J43109m3152p2499L02838o2983K1123M38748J36047l89924n62052
13995A57186K57051J94518l96827L45692J12907k83752j272j93588k41839p0126
$$ y = [250998, -178954, -62528, -235942, -168723, 267406, 810376, 688259, 221522, 562883, 589219, 450731, 486492, 449933, 440449, 629631, 738700, 723183, 459231, 66570, -125642, 72820, 142729, 474258, 278805, 13729, 39036, 26451, 225560, 418713, 271290, 214921, 610033, 1042898, 1656840, 1235843, 777099, 853835, 776353, 757862, 666663, 206889, 159103, 247498, 148017, -381940, -541090, -713208, -527755, 138116, 734118, 773848, 1231181, 1402932, 1257047, 1097369, 841685, 689296, 451278, 193097, 245931, 389040, 345888, 273389, 576227, 513244, 534367, 973115, 1109162, 719238, 157186, 414237, 608755, 211928, 557620, 670527, 386775, 385503, 191915, -49924, -120050]
13985a20050K30479J65825l20450J69637J81819O0005j72860J61189L4730q0981
13975C09343K16302J07299j80460J4819L90230k08636j49726J63536l43201L3011
13965C52517j22989l5765J56093J305P5304L1304l24864L28664K84900M5237j55360
13954F36346k64657K25926J42659l65818J82532L05884K77335k76231l10879m04698
13944A48399k84147R1457K42965J65946K74879k70397L99905M2035j93586j04913
13934E12543P7027j31806K23096J56888J10112j36758L5872J8812J38520l57827
13924F46479l14877L55137J29891L28046K44773O5697L31056J53871J40787j76459
13914A904401L13366k050L80341O14229j22765Q9455j15295j02537m63959l0514
$$ y = [-120050, 110429, 276254, -44196, 125441, 307260, 367265, 194405, 355594, 390324, 309343, 525645, 632944, 452484, 467303, 857533, 648897, 499171, 662707, 319506, 352517, 229528, 193763, 349856, 351161, 426465, 457769, 132905, 461569, 746469, 791706, 636346, 371689, 597615, 740274, 374456, 556988, 862872, 1140207, 863976, 553097, 148399, -135748, -44291, 198674, 364620, 639499, 369102, 769007, 811042, 617456, 512543, 589570, 457764, 680860, 837748, 947860, 811102, 846974, 865786, 1004306, 646479, 331602, 686739, 816630, 1144676, 1389449, 1455146, 1786202, 1940073, 2080860, 1904401, 2217767, 2215717, 2596058, 3210287, 3087522, 3176977, 3061682, 2959145, 2495186, 2464672]
13904B464672j44245n7947J2830k4126r5040M2264P2810m4946p1950k41443l43249
13893A569630l1111m2388Q0552N1516J29349n3198P5664K74101M98085K27595
13883B779795l03039J87865N6351K59824L57065J21893O81937J39489m55145L18903
13873D144938l04313J34578K30775k50399J25489l04605J91398r5942j49985m90010
13863C231924n62918R6308K28738j7599j26585J06511L75980K08238k9133j19795
13853C391669k36632l15631N24228K43941Q8611M24142k2830l78929K7969K48702
13843C995240k31069Q7227j5543J97742K95456M64057o3207o7395q959j62267
13833D491282Q3313j09945m05985N85869M72478j14299K45995P5798L25682rk82970
$$ y = [2464672, 2320427, 2262480, 2275310, 2251184, 2156144, 2198408, 2271218, 2226272, 2154322, 1912879, 1569630, 1538519, 1496131, 1576683, 1628199, 1757548, 1704350, 1780014, 2054115, 2552200, 2779795, 2476756, 2664621, 2720972, 2980796, 3337861, 3459754, 4141691, 4281180, 3826035, 4144938, 3840625, 3975203, 4205978, 3955579, 4081068, 3776463, 3967861, 3871919, 3721934, 3231924, 2669006, 2765314, 2994052, 2976453, 2849868, 2956379, 3332359, 3540597, 3511464, 3391669, 3155037, 2839406, 3363634, 3607575, 3696186, 4120328, 4097498, 3718569, 3746538, 3995240, 3764171, 3851398, 3835855, 4033597, 4329053, 4793110, 4729903, 4662508, 4653549, 4491282, 4574595, 4464650, 4058665, 4644534, 5117012, 5002713, 5248708, 5324506, 5650188, 5650179, 5367209]
13822E367209J55277M01389P36027M62147L78965N80715P77486J016963N41405
13813A0417583O13297Q63820Q46670N73557P66188R72643J581079K317648J960220
13804B0912705K454233L133876L747200M157677N248979O485080P970646J0678325
13796F4788721J4162888J8091301K2986865K8681606L4567790L9849071M3025177
13789B66153419M3145346M0918609L5674700K7281393J7441958O045114o329885
13782D30330654j8195456k8275644l4265018l6940248l7795681l6621450l3363693
13775B04873464k8567357k3111384j7646122j3029958q697661o514744m992672
13768A02313566l206594k149523j060061N38154K333258L380514N626960Q142250
$$ y = [5367209, 5522486, 5923875, 6659902, 7122049, 7501014, 8081729, 8859215, 9876178, 10417583, 11030880, 11894700, 12741370, 13314927, 14081115, 15053758, 16634837, 18952485, 20912705, 23366938, 26500814, 30248014, 34405691, 39654670, 46139750, 54110396, 64788721, 78951609, 97042910, 120029775, 148711381, 183279171, 223128242, 266153419, 309298765, 350217374, 385892074, 413173467, 430615425, 436660539, 430330654, 412135198, 383859554, 349594536, 312654288, 274858607, 238237157, 204873464, 176306107, 153194723, 135548601, 122518643, 113820982, 107306238, 102313566, 99106972, 96957449, 95897388, 96435542, 98768800, 102149314, 107776274, 115918524]
13760A15918524J1554364J5743290J9887460K4394939K9363395L5047303L8847520
13753B90756795L9066243L6895933L2295317K5930760J7010707O674319n183102
13746D43446972j7197046k6654976l3412647l7130771l7932260l6453755l3987789
13739B20677728l0263340k5347981j9632936j5247252j1968915r645399p696655
13732A00875250o637442n907154n438616m314312l796907l865617l013549k591884
13724F5309769k629869k729955k383793k325156j560630j656080k057668j673010
13716D8293608j548770j353925j278227j385599j024649j666704j125771p94965
13708C8114998j297800j254752q56324r79560r16332p85219k67289m95060n93582
$$ y = [115918524, 127472888, 143216178, 163103638, 187498577, 216861972, 251909275, 290756795, 329823038, 366718971, 399014288, 424945048, 441955755, 448630074, 443446972, 426249926, 399594950, 366182303, 329051532, 291119272, 254665517, 220677728, 190414388, 165066407, 145433471, 130186219, 118217304, 108571905, 100875250, 94237808, 88330654, 82892038, 78577726, 74780819, 70915202, 67901653, 65309769, 62679900, 59949945, 57566152, 55240996, 53680366, 52024286, 49966618, 48293608, 46744838, 45390913, 44112686, 42727087, 41702438, 40035734, 38909963, 38114998, 36817198, 35562446, 34706122, 33726562, 32810230, 32025011, 31757722, 31262662, 30669080]
13699C0669080l85240o43153r77233p95377n71041q99965q80391n03639n16858
13690B4496183p95588o52419n20264o36916o45596j91115o84649l10924j89102
13681A9869610m08257l45820k75992q7237o8882m99759p76561m96357l05593n44487
13671A6060665k97791J69310K93665J24659k92353J94351l41539l10520j70662
13662A5429785j57662j65649m85941l6272K34772m02250n83805k23843o6865n60825
13652A2981445n3913o74261k71224k07688l81417l32269M112k33494n32083j26721
13642A0172487N6321R2320m77978k78555j25243K29435K9937n0639j00734k29188
13632I318163p8401L5350Q9542O4840J95998J08644m4000n03474j40457m851J24321
$$ y = [30669080, 30283840, 29640687, 28663454, 27868077, 27297036, 26397071, 25516680, 25013041, 24496183, 23700595, 23048176, 22527912, 21890996, 21245400, 21054285, 20369636, 20058712, 19869610, 19461353, 19115533, 18839541, 18752304, 18683422, 18183663, 17407102, 16910745, 16605152, 16060665, 15762874, 15932184, 16225849, 16350508, 16058155, 16252506, 15910967, 15600447, 15429785, 15272123, 15106474, 14620533, 14584261, 14819033, 14416783, 13832978, 13609135, 13542270, 12981445, 12927532, 12253271, 11982047, 11774359, 11392942, 11060673, 11064785, 10831291, 10299208, 10172487, 10228808, 10321128, 9843150, 9564595, 9439352, 9668787, 9698724, 9648085, 9547351, 9318163, 9239762, 9275112, 9364654, 9429494, 9625492, 9734136, 9690136, 9186662, 9046205, 9041354, 9165675]
13621I165675m84396J1637N587j99396l79751k22539j29560l19765j30676k50378
13611G066438m67904n31079O3344K24224J25679j44772o0096l95654K32161L41637
13601F453978n58177k96899k43144n4595l5548O3871J07719J35111J25799k47619
13591E450496l89514q4943l85808k57864J88146R0726K0052k27378N2090n41q1025
13580D374437m3938J7966L46037K44328k2769l84780l66973n01866r9961O17399
13570D179880M48875J10372m46060k26975l27684j99355K05723j42355j56518
13561C445903r5143L6248n8590l39106J73467p4861j85496K4340J69302O2839
13551C158903l45083l1677J08751K64719R4567l1475k02635K58617J65733l70816
$$ y = [9165675, 8681279, 8692916, 8698503, 8499107, 8119356, 7896817, 7767257, 7447492, 7316816, 7066438, 6598534, 6067455, 6130799, 6355023, 6480702, 6335930, 6275834, 5880180, 6112341, 6453978, 5895801, 5598902, 5355758, 5301163, 5265615, 5329486, 5437205, 5572316, 5698115, 5450496, 5060982, 4976039, 4590231, 4332367, 4520513, 4611239, 4631291, 4403913, 4456003, 4455462, 4374437, 4330499, 4348465, 4694502, 4938830, 4916061, 4531281, 4164308, 3662442, 3562481, 4179880, 4628755, 4739127, 4293067, 4066092, 3738408, 3539053, 3744776, 3602421, 3445903, 3350760, 3387008, 3328418, 2989312, 3162779, 3087918, 2902422, 2926762, 3096064, 3158903, 2813820, 2782143, 2890894, 3155613, 3250180, 3218705, 3016070, 3274687, 3440420, 3069604]
13541C069604J0761K1194l43820m97491l24993r0419N71579m8003k70155n4035
13531B044222k21658J9537J14612L16422J56758P6804j26062k07119j96667k19417
13521A757432K16458J33109N4452j90369J25471K82915J55942N8793L37974k68459
13511B663718j67271l5465k06180k64530j16691j43877l20648j9940N9263N32294
13501A980673K05607l38268q57019m02668J32816P2640K96201J53509j84457N7946
13491A116980r3541n86167P1983P1209J39187k6008j12180j61066M6246R6678
13481E63321j7465O04281j52837m91748j9018N45380L16357n0708l64578J30915
13471A063900P218m68619l32986J89508j18058k1086J74408M80451j00630l40516
$$ y = [3069604, 3080365, 3101559, 2757739, 2260248, 1935255, 1844836, 2416415, 2368412, 2098257, 2044222, 1822564, 1842101, 1956713, 2273135, 2429893, 2506697, 2380635, 2173516, 1976849, 1757432, 1973890, 2106999, 2161451, 1971082, 2096553, 2379468, 2535410, 2594203, 2932177, 2663718, 2496447, 2460982, 2254802, 1990272, 1873581, 1729704, 1409056, 1389116, 1448379, 1980673, 2186280, 1848012, 990993, 588325, 721141, 793781, 1089982, 1243491, 1059034, 1116980, 1023439, 437272, 509255, 580464, 719651, 693643, 581463, 420397, 466643, 563321, 545856, 1150137, 997300, 505552, 486534, 1031914, 1348271, 1297563, 932985, 1063900, 1071118, 602499, 269513, 459021, 340963, 319877, 494285, 974736, 874106, 533590]
13461E33590J75712K18966O3490m3239l2237l82819n7693k2366k7622N5745L05088
13450G86615r899n034l11585k3777k2994M1394M98221L76966r2274m90910n44674
13439B02049j61809M41580M61758q3831M0693j71664M35198L63328k31380l88861
13429I07061N0956K51521j93039J3412K1849K98227L14591l39003k65836m70132
13419E89607k24466J69322l0748J0076J91855l31293m18346J74061J84352k16801
13409I7619O704J46907l58018K60981N60653j89918m72302l29269j32758j87264
13399e96665M14682J22887k15362K8720q1659n7928J10132N59539j09402k63380
13389h8436k1908j14010l02551k36054L25153L33305L15221K68625K64695m0216
$$ y = [533590, 709302, 928268, 991758, 948519, 916282, 533463, 475770, 453404, 425782, 481527, 786615, 776716, 771682, 460097, 436320, 413326, 454720, 952941, 1329907, 1237633, 746723, 202049, 40240, 481820, 943578, 859747, 900440, 728776, 1163974, 1527302, 1295922, 907061, 958017, 1209538, 1016499, 1029911, 1051760, 1349987, 1664578, 1325575, 1059739, 589607, 365141, 534463, 503715, 513791, 705646, 374353, -43993, 130068, 314420, 97619, 104323, 251230, -106788, 154193, 714846, 524928, 52626, -276643, -409401, -596665, -181983, -59096, -274458, -245738, -327397, -385325, -275193, 284346, 174944, -88436, -110344, -224354, -526905, -762959, -437806, -104501, 210720, 479345, 744040, 703824]
13379G03824n7547j40454m08942J92467K77015j98056m00697j13539J01467J88302
13369A43840M91603J30057j76460q02521o80170K06040P19396Q3222m70539j31602
13359d87134L72378J49209L92896Q0292k03607m1988l83136l39465J95325M53067
13349A87837K04261j05536O1202P92834P06270Q9112J25818j36474k24313j79606
13339A521405K80283M22743J59791j16986k46764l3452m52499Q2177j10868n67069
13329I38761l32127j84085j60087K72509R6803k07083K30958K2173M0536K69801
13319I88159J25095j39684M37907j18888m33443j54470J39253M0643J06166k39222
13309G51516q1487k13279M40419L77865N70729Q32796M5043p00657n0579m28636
$$ y = [703824, 646277, 505823, 96881, 289348, 566363, 368307, -32390, -145929, -44462, 143840, 635443, 765500, 589040, -213481, -893651, -687611, 31785, 115007, -355532, -487134, -114756, 34453, 427349, 507641, 304034, 262046, -121090, -460555, -265230, 187837, 392098, 286562, 347764, 1140598, 1846868, 1935980, 2061798, 1925324, 1701011, 1521405, 1801688, 2224431, 2384222, 2267236, 2020472, 1987020, 1534521, 1616698, 1505830, 938761, 606634, 422549, 262462, 534971, 631774, 424691, 655649, 677822, 718358, 988159, 1113254, 973570, 1411477, 1292589, 859146, 704676, 843929, 884572, 990738, 751516, 670029, 456750, 897169, 1275034, 1845763, 2678559, 2723602, 2022945, 1972366, 1543730]
13299A543730k55222q4132J18375K27622j23398l17740j04082K31415j45623m74936
13289F16009l93955J80970K65048K19720n8878m95226k13756K25137j26489n9646
13279A58934k0685l44152j57124J59176L30396M43903m4318J48888q9500K96515
13269H82033P927K5672P0323n55276J08904j80006m01071l90092N28318Q5913
13259A82645o4597K5915j54934L2597k14851K56068K42420N5561K43518k96912
13249C07430l18187J98326o5958k06820k7021Q5852l7416K30316Q45417O8912
13239A080851k65021o7815N3145o04427j38063K73276L27352n08144m8361J54276
13229B57069N51752Q4793m19978o24495m86529p5444K93956J46009j27061j04299
$$ y = [1543730, 1288508, 1204376, 1322751, 1550373, 1426975, 1109235, 1005153, 1236568, 1090945, 616009, 222054, 403024, 668072, 887792, 828914, 333688, 119932, 345069, 218580, 158934, 138249, -205903, -363027, -203851, 126545, 570448, 526130, 675018, 585518, 882033, 889960, 915632, 985955, 430679, 539583, 359577, -41494, -431586, 96732, 182645, 118048, 143963, -10971, 21626, -193225, 62843, 305263, 360824, 604342, 307430, -10757, 187569, 121611, -85209, -112230, -26378, -63794, 166522, 1011939, 1080851, 815830, 748015, 801160, 196733, 58670, 331946, 659298, 151154, 102793, 257069, 808821, 893614, 473636, -150859, -637388, -712832, -418876, -272867, -399928, -504227]
13219e04227J33929Q8837O25716K25598n92259k55518n3303K85194K58343K30838
13209D43148M7575l4632K5394k00016q3359j8353N74718k71540m52144l78480
13199c47689K71907j01169J28400N1232n2474m43640k39465J17326K35707M56489
13189G6624J43250j22188J05575L89636J09675J47258j7009J2448j62929o61938
13179B0402m80911J02320J19492O1095k5616R2793P1772O8220J07084K35416j8212
13168C53855l92063O7606j89587J4766K08801L47296k93828j78664p3036M3303
13158i1551k36509k7707L28794M37926j37830m15340j44052M98424J44978o39842
13148b82709r9169J77294n4884j09873j93929K01199l30338k23974K83826J45163
$$ y = [-504227, -370298, -281461, 344255, 569853, -22406, -277924, -331227, -46033, 212310, 443148, 490723, 456091, 481485, 281469, 198110, 179757, 754475, 482935, 30791, -347689, -75782, -176951, -48551, 2681, -49793, -493433, -732898, -615572, -379865, 76624, 219874, 97686, 203261, 592897, 702572, 849830, 832821, 845269, 682340, 20402, -460509, -358189, -238697, -177602, -203218, -110425, -38653, 29567, 136651, 372067, 353855, -38208, 29398, -160189, -145423, 63378, 410674, 116846, -61818, -134854, -91551, -328060, -355767, -26973, 410953, 273123, -142217, -286269, 212155, 357133, -282709, -381878, -204584, -259468, -369341, -563270, -362071, -692409, -916383, -632557, -487394]
13138d87394J97898k36270J12793K24785L19781L14600l79744m58979J058L62925
13128b8547M27625L99286k64182r50979j95466k14936m0452L48530J83345M44105
13118A08329J11097q0957k64392L06002J1367m22396p726N106K38651J65574J9105
13107A89760n597J90970J37636q2431l56285m70100O6197J73886k86161J08449
13097c33676j88589K02312K7189K60285K23053O7660j06325k66571k12974N1250
13087b76386l3193J74409M66460J46169N523k88540k26760n4842O9414j10099
13077a27845m02445P2850K96343L12189j04702j55979M9087L74229j5538j52895
13067A45294P7464l05194j03918J52785L83904K55580m709n78087n12294M99933
$$ y = [-487394, -289496, -525766, -412973, -188188, 131593, 446193, 66449, -392530, -391472, -28547, 399078, 798364, 534182, -416797, -612263, -827199, -867651, -519121, -335776, 108329, 219426, 138469, -125923, 180079, 191446, -230950, -238676, -233570, 5081, 170655, 189760, 184163, 375133, 512769, 430338, 74053, -396047, -329850, -155964, -442125, -333676, -522265, -319953, -292764, -32479, 190574, 258234, 151909, -114662, -327636, -276386, -309579, -135170, 331290, 477459, 482982, 194442, -32318, -87160, -17746, -127845, -530290, -457440, -161097, 151092, 46390, -109589, -60502, 313727, 298189, 145294, 222758, -82436, -186354, -33569, 350335, 605915, 601206, 23119, -489175, 10758]
13057A0758K69705J71513J25559L2684l45380J5457j76045n36158l06832K8274
13047g10465R6152P14516L88374j51478m61216j06144j12492l79293p1077K37239
13037e55884J77516M40286P970N02839K37289J68828L54277L17546K41696K15000
13027B107363J52132m58141n28581l40728n61705j04406J67500q859K4289L41743
13017G90607l1779j30891l44908m29149k03608O8840O95239L64630k4474j12103
13007F42404l97867k17437J07485J21388r3183J54696l58461J10466O5038j16875
12997A7654n8208k59288m00807K94856K76779N1569j00530J10417P61330M74692
12987A168464q4742K36966l49290L41212R29407j43053m63730l24818m78796k83977
$$ y = [10758, 280463, 451976, 577535, 610219, 264839, 280296, 104251, -431907, -738739, -710465, -614313, 100203, 488577, 337099, -124117, -230261, -342753, -722046, -793123, -555884, -378368, 61918, 69888, 572727, 810016, 978844, 1333121, 1650667, 1892363, 2107363, 2259495, 1801354, 1272773, 932045, 370340, 265934, 433434, 424575, 448864, 790607, 758828, 627937, 283029, -146120, -349728, -280888, 414351, 778981, 754507, 642404, 244537, 27100, 134585, 255973, 162790, 317486, -40975, 69491, 134529, 17654, -40554, -299842, -700649, -405793, -129014, -77445, -177975, -67558, 693772, 1168464, 1083722, 1320688, 971398, 1312610, 2242017, 2098964, 1635234, 1310416, 831620, 547643]
12977E47643K41761J30118k23517k41183l07242l88869j0360M75401L23185l17866
12967B29071j25635J28354L0194q0388o3864J50926P5055l07038J72285J76137
12957C85097K17144M0327l56391j65200K49249R5652J01620J06109k69507n58138
12947a54038l09313J34865R2601K61785J87572L46999K11459l02005M461K81897
12937G56283q9101n26653q6713K31717j80906j32081K53171k68587k8784p1258
12927a42912q7208j28517J14334J03420p8229o3206K9220j0034J7987J29276N1718
12916f4151p4317p7424K25248M77900j5607m99025k0438N03873L09945j77110
12906E88894m15017n27855k62535M51366M27392j20382J2588J40118J60844k20637
$$ y = [547643, 789404, 919522, 696005, 454822, 147580, -241289, -251649, 223752, 546937, 229071, 103436, 231790, 261984, 181596, 117732, 268658, 343713, 36675, 208960, 385097, 602241, 642568, 286177, 120977, 370226, 465878, 567498, 673607, 404100, -154038, -463351, -328486, -235885, 25900, 213472, 560471, 771930, 469925, 474386, 756283, 667182, 140529, 53816, 285533, 104627, -27454, 225717, -42870, -71654, -142912, -230120, -358637, -244303, -140883, -219112, -282318, -253098, -263132, -245145, -115869, -64151, -138468, -215892, 9356, 487256, 471649, -27376, -47814, 456059, 766004, 588894, 173877, -353978, -616513, -165147, 262245, 141863, 154451, 294569, 455413, 234776]
12896B34776n03571o8499K99519r4149K15922K66724l07167k67966K8406K15897
12886A9892n8137l7476j62436o9300K05234O7419N04917j59597k91507l50009
12876c31000k55745q6413K54690K29834r163p8155j35196Q2867q092M08380m7866
12865B4141m80738k10665J57317J24808J42303K08477P7543L17215j02476j71283
12855H6642Q4292L76209r0035n58485J92439k00369k84028K41747p1922J71297
12845e2213q3036l581N51258o2388N9951j4411j60924K0386J0289l25601k64258
12834c24528q8169j78076M94923J91363q1733j39066k92142J11042P3112L9262
12824a94012K99324L01872k10563K38086l39309l86362l18128J59333O46261j25474
$$ y = [234776, -268795, -337294, -37775, -131924, 83998, 350722, 43555, -224411, -196005, 19892, -38245, -75721, -238157, -307457, -102223, -34804, 470113, 310516, 19009, -331000, -586745, -673158, -418468, -188634, -197797, -275952, -411148, -328281, -336373, 72007, 24141, -456597, -667262, -509945, -385137, -242834, -34357, 43186, 360401, 257925, 86642, 170934, 547143, 457108, -101377, 91062, -109307, -393335, -151588, -223510, -52213, -135249, -138830, 412428, 350040, 409991, 395580, 234656, 255042, 265331, -60270, -324528, -412697, -590773, -95850, 95513, 13780, -125286, -417428, -306386, -233274, -194012, 105312, 407184, 196621, 434707, 95398, -290964, -609092, -449759, 196502, 71028]
12814G1028l23168K94268L49008l10428l96480k80631L36653j5876o6816p71483
12804a113925l26726N31435L83675k08307J50098l3688q6535j20771M36418L50277
12794c8049j85377j66584m4568j96779k64030L32798K64739j13949j95361j32946
12784g40106K55333P63497l14252p51305k01137o5125N1714O21463L33886k9950
12774g5982p6005J12918L61735J293k26510k38737J47012J63622q6344J07999
12764A91001j00634k03296j17375k14553K65426k21581k29188N6Q6427K42671
12754c01046K22991M74737l36418l96206J57489L16918l2264N00551J11895m67370
12744B51277k0136J40253M66106K0067j94709k77764l03735l14492N6256L01026
$$ y = [71028, -252140, 42128, 391136, 80708, -315772, -596403, -259750, -275626, -342442, -1113925, -1440651, -909216, -525541, -733848, -583750, -617438, -703973, -824744, -388326, -38049, -223426, -390010, -434578, -631357, -895387, -562589, -297850, -411799, -607160, -740106, -484773, 278724, -35528, -786833, -987970, -1053095, -1001381, -379918, -46032, -75982, -151987, -39069, 322666, 323959, 97449, -141288, 5724, 169346, 83002, 191001, 90367, -112929, -230304, -444857, -179431, -401012, -630200, -630144, -543717, -301046, -78055, 396682, 60264, -335942, -178453, 138465, 106201, 606752, 718647, 251277, 231141, 371394, 837500, 857567, 662858, 385094, 81359, -233133, -176877, 124149]
12734A24149K52129j95663k42668K49096J92400j71254K7196m9193L1756L2185
12724B50133m66043L85167P18767Q8914n75497j012587k57456K22153K47384L92051
12714g014L05743j56820l6987p4576l03460M8478K223k83890J07137J26212K72628
12703c26n5640K04097J85294k5935m99514r3539J71907L1681J06036L6072J26266
12692A86399Q339l2063K61266j17575J26112j28206k65561m02395R0834M27910
12682A55060K4207R4123m00280m3031L67910J73994L9854p5801l70705p76196
12672h10865j85080N25068K78917J0992L825J11879K40786p4428P3178L9270p7032
12661A36510K34213J10682J10094J41505k54157r0135p1877k82038O8925J9746
$$ y = [124149, 376278, 180615, -62053, 187043, 379443, 208189, 235385, 186192, 217948, 250133, -215910, 169257, 888024, 976938, 401441, -611146, -868602, -646449, -399065, -7014, 298729, 141909, 104922, 30346, -273114, -224636, -222413, -506303, -399166, -272954, -326, -55966, 148131, 333425, 307490, -192024, -285563, -113656, -81975, 24061, 60133, 186399, 194738, 162675, 423941, 306366, 432478, 304272, 38711, -363684, -272850, 155060, 179267, 273390, -126890, -169921, 197989, 371983, 411837, 336036, -34669, -810865, -995945, -470877, -191960, -180968, -177143, -65264, 175522, 101094, 174272, 213542, 136510, 370723, 481405, 591499, 733004, 478847, 388712, 316835, 34797, 103722, 123468]
12651A23468l47433K19863J72165K54053m5788q50682l58745M73129N7558q59103
12641a161515o4433L55543L0683M03690M195j39495L44037K69744J51015K83636
12631D77100r6071r7743j43637J32346K17816K52020M7369m14442n91253m22303
12621f38798K35165J00189n5027q860K49557L81038M8491Q921J96071Q6051p8083
12610E24715o9113J35781j19114l38595J43596L16103k77991o85885k53549l61764
12600i85816P4813M10987K63845J30882P0568m06025m0698P01597J97238m31657
12590a4266J6091Q1096Q1679K11278N4473P9747j73378n70138m02949O34449J19919
12579A18001N1024J04184l69411J40954P82210j9618m4242k85543k67238j54751
$$ y = [123468, -223965, -4102, 168063, 422116, 376328, -474354, -833099, -359970, -302412, -1161515, -1225948, -870405, -839722, -436032, -431837, -571332, -227295, 42449, 193464, 477100, 381029, 283286, 139649, 271995, 489811, 741831, 789200, 374758, -216495, -638798, -403633, -303444, -358471, -367331, -117774, 263264, 311755, 320676, 516747, 602798, 524715, 455602, 591383, 472269, 133674, 277270, 593373, 315382, -370503, -624052, -985816, -911003, -500016, -236171, -105289, -34721, -440746, -481444, 220153, 417391, -14266, 1825, 82921, 164600, 375878, 430351, 510098, 336720, -233418, -636367, -1918, 118001, 169025, 273209, -96202, 44752, 826962, 807344, 763102, 477559, 210321, 55570]
12569E5570J76595J29413L25353L41893K65558m53296j52723L83J37935k92341
12559E34340K21651m83832k12256j92938O9529K3488k3381J04788j35981m6813
12549a41405P8435K05509O6978K19913q7305l19844K57855m3928j04897L7110
12539A68421N8672K1067L31242J38519J53342J05216o08560j1598K29072l55856
12529B29537j24959j7360k08364J1042J86189M26557k95984o33223j51912M56950
12519a21527P0068L9404L30466J62853k65527l67714M5540J75814K54224k69813
12509E3788k09828M3466j94388J57042j56857M77305j89k83676P7210J68986l462
12498A29397j33087P5118k55387j44156L0329K39829L39294N32799J9231k22252
$$ y = [55570, 232165, 361578, 686931, 1028824, 1294382, 841086, 688363, 688746, 826681, 534340, 755991, 272159, 59903, -133035, -63506, -40018, -63399, 41389, -94592, -141405, -62970, 142539, 209517, 429430, 342125, 22281, 280136, 236208, 131311, 168421, 227093, 248160, 579402, 717921, 871263, 976479, 367919, 356321, 585393, 229537, 104578, 87218, -121146, -110104, 76085, 502642, 206658, -426565, -578477, -121527, -51459, -12055, 318411, 481264, 215737, -151977, -106437, 69377, 323601, 53788, -156040, -112574, -306962, -149920, -306777, 170528, 170339, -113337, -36127, 132859, 129397, -3690, 71428, -183959, -328115, -297786, -57957, 281337, 814136, 833367, 611115]
12488F11115j41846l62455r6419L70205J28106m81017l08703N0620J97380j19324
12478a52338J55062J34950k44002j66492o5512L91155L09265k69178R2795K1592
12468B07297M3724k61643K26695O58566J94113j50182n20856m87409j55573K42279
12458b989k41602k94815M32378M06949J73177J16437k62698l70992k98766o2599
12448d05520J12891K86511M20054J52625r6395K6265j25417l22321k74569M10084
12438A84208M4045k23012k58615K55704Q0197K5174j02187K65126J59458p634
12428D22464j21024n72147n18712Q2660L42652L50978m98838M05551K96720r1637
12418I8667k54080k43280N7280J62422Q0419j27574k1399L20254J23879P3262
$$ y = [611115, 469269, 106814, 10395, 380600, 508706, 27689, -281014, -230394, -33014, -152338, 2724, 137674, -106328, -272820, -338332, 52823, 362088, 92910, 185705, 207297, 251021, -10622, 216073, 874639, 1068752, 918570, 397714, -89695, -245268, -2989, -244591, -539406, -107028, 299921, 473098, 589535, 326837, -44155, -342921, -405520, -292629, -6118, 413936, 566561, 470166, 496431, 371014, 48693, -225876, 184208, 228253, 5241, -253374, 2330, 82527, 107701, 5514, 270640, 430098, 422464, 301440, -270707, -789419, -706759, -364107, -13129, -511967, -106416, 190304, 98667, -155413, -398693, -341413, -178991, -98572, -226146, -247545, 72709, 196588, 269850]
12408B69850l01618J96521P8638l28091j83869L56919M9689p1708m98881n68935
12398a001485J93371M23269r4202J5259N70098L18257j25735K41468M6705l91609
12388A95396n53656k27724K30907J22498K10096K42393l61614q9620P2602m73545
12378f32267J49820O19786k98949l45246k57455K54910K30567J4534R1474P0526
12368a02300r6320l75817J79737K86795M3969K28614j35248o25476K7753K26547
12358c41746j20061J695M5716P69501K96340j21605l1482p182j12578O6867j07853
12347C37612k09425R8388j96874l78149M2959n19Q8923j13458j15835o7149K26297
12336b87230m0717J11891M43105L16228J53313l63524n03437n80573l94104q1873
$$ y = [269850, -31768, 164753, 243391, -84700, -268569, 88350, 138039, 66331, -432550, -1001485, -808114, -384845, -479047, -463788, 106310, 424567, 298832, 540300, 587005, 195396, -358260, -585984, -355077, -232579, -22483, 219910, -141704, -231324, -158722, -632267, -482447, 137339, -161610, -506856, -764311, -509401, -278834, -264300, -172826, -102300, -198620, -574437, -394700, -107905, -63936, 164678, 29430, -596046, -568293, -341746, -461807, -460112, -414396, 355105, 651445, 529840, 498358, 491176, 378598, 445465, 337612, 128187, 226575, 29701, -348448, -305489, -306008, -217085, -330543, -446378, -513527, -287230, -327947, -216056, 227049, 543277, 696590, 333066, -170371, -750944, -1145048, -1226921]
12326a226921N51693L99869k01698l07284O447J86281N1139K42646K16317M0756
12316d0755l0535K68959j87738k00903J38286j73285k5759K55049R6499J05254
12306B05072R4275q6020L17630P7022j75371k57701J02065R0731j78250K28939
12296D18392m5273n40084j17521J90315J33923q7239J5241N33695K24129q4449
12286F41129j92590j40761j28932k46128j93094l75471O63681M54684k26264K05980
12276D62234k17813l66662K66384o3604j54550j1124J89988J8910l22656K3810
12266a75083j5890r6247M7571Q0428l13947m0275n8864K15428L20374l0047l30559
12255c97111K60197j49964J8515K713J75146J03638N60337Q4582m36267k61638
$$ y = [-1226921, -675228, -275359, -477057, -784341, -777894, -591613, -540474, -297828, -81511, -40755, -71290, 197669, 9931, -190972, -52686, -225971, -251730, 3319, 99818, 205072, 299347, 213327, 530957, 607979, 432608, 174907, 276972, 367703, 189453, 418392, 373119, -166965, -284486, -94171, 39752, -47487, -32246, 501449, 725578, 641129, 448539, 307778, 178846, -67282, -260376, -635847, 27834, 482518, 256254, 462234, 244421, -122241, 144143, 80539, -74011, -85135, 104853, 123763, -198893, -175083, -190973, -287220, -239649, -159221, -473168, -513443, -572307, -356879, -36505, -66552, -397111, -136914, -286878, -268363, -265650, -90504, 13134, 573471, 658053, 221786, -39852]
12245c9852o8264l15382k39207N58323K10881J31512j33756p213P8584O5061j07214
12234A33473k06629P8112l42268L12630Q0333R7044K31933k88909l17056j14845
12224c36182O14980r0029m11773j9824n7625J14090O5774l7087l3182N6161K11034
12213G6337j33763J79688K48196M69450l4982k70760m58749K8307J23484J09726
12203C36934K40590L14388M7682m97919m09332l66126l93285J50001M91708o9866
12193a55225K25547K31879j47631k2578k92441P6096N02786K01844J4658K2726
12183F57661l50398j85710K44724K46394L0082O0760m0056k26966j61207L65685
12173F40969K41077O7146K03980l37797k92611p36250j92056K07721Q2186J69755
$$ y = [-39852, -108116, -423498, -662705, -104382, 106499, 238011, 104255, 97042, 175626, 240687, 133473, -73156, 4956, -337312, -24682, 55651, 152695, 384628, 95719, -221337, -336182, 278798, 188769, -223004, -242828, -300453, -186363, -120589, -157676, -190858, -134697, 76337, -57426, 122262, 370458, 839908, 804926, 534166, 75417, 103724, 227208, 336934, 577524, 891912, 939594, 441675, 32343, -333783, -727068, -577067, -85359, -155225, 70322, 302201, 154570, 131992, -160449, -84353, 418433, 620277, 634935, 657661, 307263, 121553, 366277, 612671, 642753, 703513, 663457, 436491, 275284, 640969, 882046, 949192, 1153172, 815375, 522764, -213486, -405542, -197821, -115635, 54120]
12163E4120K94749J8995K74082l05651K2513K02281k74695l89660n30266L32688
12153c00844L69280p7088k8276j21613J03684J6256J06591l63174j93190q5685
12143e74059o9571J49585K4299J68160O3734q8185J56716J95235j698J69557J3599
12132B07372J78428L44398k00735m75538J63789l13565J14108L85726J76640k0953
12122E59670k96525j88291J22848M80973M56835L52447j89063L9011o5836k71349
12112A000720l56578N76444l33722r73180k45268L25778K80548j73229r5504J41187
12102A47196j696Q9570j81560k66269K93474J06651K69583m32822n70102K58617
12092b87358L55143K46358J05419k73258J10064K35557p9887J77967J61834k10350
$$ y = [54120, 348869, 367864, 641946, 336295, 358808, 561089, 286394, -103266, -633532, -300844, 68436, -8652, -36928, -158541, -54857, -38601, 67990, -295184, -488374, -574059, -643630, -494045, -469746, -301586, -237852, -326037, -169321, 25914, 24216, 193773, 207372, 385800, 730198, 529463, 53925, 217714, -95851, 18257, 403983, 580623, 559670, 263145, 74854, 197702, 678675, 1135510, 1487957, 1298894, 1337905, 1272069, 1000720, 644142, 1220586, 886864, -86316, -331584, -5806, 274742, 101513, 6009, 147196, 145500, 235070, 53510, -212759, 80715, 187366, 456949, 24127, -545975, -287358, 67785, 314143, 419562, 146304, 256368, 491925, 412038, 590005, 751839, 541489]
12082E41489j34108K61732N7795k84402J35990k600J43360J65621j9632r1853
12072G73392J25437k78350K2158L77529j52976j64741K59286r9517n20725j07277
12062B34216J52934J70721k6304J37881L31786O68259L83488K63517N48913L47209
12052C212620L71318L24198L01528J84056Q6476l21883l61012n51047j60778L5930
12042C121406K01742r4249k77596j06387m32318m2797Q3201m14846o06347j18290
12032A313519o2675p6673M49713j22615O5454P2590L26246L9082l53357k64818
12022A386466k93271J1211P4256J96155r8752r7700k09703o0279K04046L43489
12012A455918J88473O3568L9585j0389j87144M69589K01228m1977M63501J90997
$$ y = [541489, 407381, 669113, 726908, 442506, 578496, 575896, 719256, 884877, 865245, 773392, 898829, 620479, 642637, 1020166, 867190, 702449, 961735, 862218, 341493, 234216, 387150, 557871, 531567, 669448, 1001234, 1669493, 2052981, 2316498, 2865411, 3212620, 3583938, 3908136, 4209664, 4393720, 4480196, 4158313, 3797301, 3246254, 3085476, 3121406, 3323148, 3228899, 2951303, 2844916, 2412598, 2369801, 2453002, 2038156, 1431809, 1313519, 1250844, 1174171, 1623884, 1501269, 1566723, 1639313, 1965559, 2004641, 1651284, 1386466, 1093195, 1104406, 1178662, 1374817, 1276065, 1178365, 968662, 908383, 1112429, 1455918, 1644391, 1707959, 1747544, 1737155, 1550011, 2019600, 2220828, 2178851, 2642352, 2833349]
12002B833349k74620k31566k55877k93968n21244k42839j65481L54922N78399
11993A781075M58629r2172l40538k03648J10791K04337m72640k35261l4012M41621
11983A618182J55498K60947K71443J05082K76863m0163j10366J28164L42963J22849
11973C131462m72655j74503K92004j8548J38806k77471p5319J82647J74407L52141
11963C252971N45000N69533N23542L31433J066422L46915l19749K13585Q9104
11954F618756J05241R0933N8603L95146J077228N92831P35568Q87874L16016R47614
11944A1825810J211362J087804J429631J708737K811361L435132L449961M333937
11936C1293735N469574O833070R361601J2625099J7030200K3908764L4059433
$$ y = [2833349, 2558729, 2327163, 2071286, 1777318, 1256074, 1013235, 847754, 1202676, 1781075, 2239704, 2147532, 1806994, 1603346, 1714137, 1918474, 1445834, 1210573, 1176561, 1618182, 1773680, 2034627, 2306070, 2411152, 2688015, 2647852, 2537486, 2665650, 3008613, 3131462, 2658807, 2484304, 2776308, 2757760, 2896566, 2619095, 2543776, 2726423, 2900830, 3252971, 3797971, 4367504, 4891046, 5222479, 6288901, 6635816, 6316067, 6529652, 6618756, 6723997, 6814930, 6873533, 7268679, 8345907, 8938738, 9674306, 10562180, 10878196, 11825810, 13037172, 14124976, 15554607, 17263344, 20074705, 23509837, 26959798, 31293735, 36763309, 43596379, 52957980, 65583079, 82613279, 106522043, 140581476]
11929A40581476M8910687O3241562P0795482O8550575O0528227N2331558K9030681
11922E33970248k7196267q5772775r8216958p7221868n2614444l5789000k4586556
11915A32572380j8305541j3679075j0173640q017949p093785n911766m965261
11908F4425363m250112m034191l440167k935578k188278k244584k176477j436536
11900D1719440j160794j566047j097377j006106p85851m88736n00669n34743n61109
11891C4018008p06168k94336o25168m8852j51366n71440o05520p27010j095912
11882B9192236j508451j521940j242993j048352j064224r47036p20896q21201
11874B0317143n62526p45063o86750p42835n85304q82408p71933j72595k77373
$$ y = [140581476, 189492163, 252733725, 323529207, 392079782, 452608009, 504939567, 533970248, 506773981, 421001206, 322784248, 245562380, 192947936, 157158936, 132572380, 114266839, 100587764, 90414124, 82396175, 75302390, 69390624, 64425363, 60175251, 56141060, 52700893, 49765315, 47577037, 45332453, 43155976, 41719440, 40558646, 38992599, 37895222, 36889116, 36103265, 35614529, 35113860, 34579117, 34018008, 33311840, 33017504, 32392336, 32343484, 32192118, 31620678, 31015158, 30288148, 29192236, 27683785, 26161845, 24918852, 23870500, 22806276, 21859240, 21138344, 20317143, 19754617, 19009554, 18322804, 17579969, 16994665, 16112257, 15340324, 15167729, 14890356]
11865A4890356K84415l43094o90982l02762k77231k1961o2420o75947o01740M3933
11855A2242567p9632l95958k40334n29968o88763n73203k11295K65547Q8622k07169
11845I670414j43814l67453k3836O3729m46466l18928k92863m47478j85724j88201
11835G319380k230j15502q9800J18427J97056j36915k71245k97777J67326k45887
11825F642833l52518l57441k1074j26930m5157p6613o7949k98416k62390m6537
11815D987808k8871p7285K28302J42685o0902j2950k27183Q7072j41966l20194
11805D576516m97109K262P91331N93666m5860k01871K24304N54420K05767K56390
11795F459816K68235n03661p71931m43913r7165K03862l90773q63097j72937K85848
$$ y = [14890356, 15174771, 14831677, 14140695, 13837933, 13560702, 13538741, 13476321, 12800374, 12198634, 12242567, 12162935, 11766977, 11526643, 10996675, 10307912, 9734709, 9523414, 9788961, 9877583, 9670414, 9526600, 9159147, 9135311, 9199040, 8752574, 8433646, 8140783, 7693305, 7507581, 7319380, 7317150, 7201648, 7111848, 7230275, 7427331, 7290416, 7019171, 6721394, 6888720, 6642833, 6290315, 5932874, 5911800, 5784870, 5739713, 5663100, 5595151, 5296735, 5034345, 4987808, 4958937, 4881652, 5109954, 5252639, 5191737, 5178787, 4951604, 5038676, 4896710, 4576516, 4079407, 4081669, 4873000, 5466666, 5420806, 5218935, 5443239, 5997659, 6203426, 6459816, 6728051, 6224390, 5452459, 5008546, 4911381, 5115243, 4724470, 3861373, 3688436, 3974284]
11785C974284L4073M0796K29858k20381J8116q907P6988J91573J86253j0743l90361
11774D121549k47061n29463K9987L18295p7890k17445j78885j02933j6765J29698
11764C229087n5922r7118p64290k90116K49250L73922j10070m83934k14438Q3122
11754A919493K39823J13552J52343l734j99155j58553j69828p08N3101j05357
11744A840977m3480J56064j9576p0223J19123J3016P5441l15302K7838J62484
11734A946362L54009j55082j09843m19990k39248L06548j48508j76389j74891
11725A182968J23136M29981o3562n24785l856K3365n9900j64341Q7021L5086J3764
11714A078877j72173l40437K30371O7412J68510L0981K36672Q7860J74815j52174
$$ y = [3974284, 4008357, 4049153, 4279011, 4058630, 4076746, 4067839, 4144827, 4336400, 4522653, 4511910, 4121549, 3874488, 3345025, 3375012, 3693307, 3615417, 3397972, 3219087, 3116154, 3099389, 3229087, 3173165, 3076047, 2311757, 2021641, 2270891, 2644813, 2534743, 2050809, 1836371, 1919493, 2159316, 2272868, 2425211, 2421477, 2222322, 2063769, 1893941, 1893233, 1946334, 1840977, 1797497, 1953561, 1933985, 1863762, 1982885, 1995901, 2071342, 1756040, 1783878, 1946362, 2300371, 2145289, 2035446, 1615456, 1376208, 1682756, 1534248, 1357859, 1182968, 1306104, 1736085, 1672523, 1147738, 1143882, 1167247, 1107347, 943006, 1030027, 1065113, 1078877, 906704, 566267, 796638, 864050, 1032560, 1063541, 1300213, 1388073, 1562888, 1410714]
11704A410714k87820m9395K17225k085k09188j48399K33806j14897l39357Q8913
11694G99517L61795N65618k14937j004k81780q6760n4154k49711q8117J70675
11684I21142m04287l27245j05092M05167L40576j798r691J22820N4120Q3024J41432
11673A220168O9894m30704l24292N8726P1639J70492R7176l16645l31211O32422
11663I17665l48142r8110j51027j08851J46012q8008J14465L48078J20658j13243
11653G39497J31230r6201m30998J79565l2346r5363l0674l8827j78237J31199
11643B78845K67024L12675j62752k12328l67864l85821K37387l4656k35771J72058
11633a31203M76470M36496l25663k98633J38362P371l27567p3851K09433K19863
$$ y = [1410714, 1122894, 1073499, 1290724, 1288639, 1079451, 931052, 1164858, 1049961, 710604, 799517, 1161312, 1726930, 1511993, 1510989, 1229209, 1142449, 1088295, 838584, 750467, 921142, 516855, 189610, 84518, 489685, 830261, 828463, 818772, 941592, 995712, 1078736, 1220168, 1290062, 859358, 535066, 593792, 665431, 835923, 933099, 616454, 285243, 917665, 569523, 471413, 320386, 211535, 357547, 269539, 384004, 732082, 852740, 739497, 870727, 774526, 343528, 523093, 490747, 395384, 364710, 325883, 147646, 278845, 545869, 858544, 695792, 483464, 115600, -270221, -32834, -67490, -303261, -131203, 345267, 781763, 456100, 157467, 295829, 303200, -24367, -98218, 111215, 331078]
11623C31078K57862K12949Q3996L2529l00905n00043J42790L89152j96951k44498
11613B07959k24773m9685l84437N6469N69263J18787k04796L11721K7118o3329
11603C64297l01793j69211K81991J79879j83323p6733L84723R8798J3832k9925
11593E62535J25247K00168k60115l35898l64993J71471J84605J40283J18981k04253
11583C38031j19208J94399j04032k81468L25039K03094j69152m90797l63480J45515
11573c22059M89996M36082k79346j82709J76274k04249k75408j92388m15523J47704
11563f21626L8034J74831L36133j77394j78821O6212J49740o2969L56815M43817
11553E24772j6689o51098n49523j1395L19166J2293Q6130n8436J09638K93207
$$ y = [331078, 588940, 801889, 885885, 918414, 617509, 117466, 260256, 649408, 452457, 207959, -16814, -66499, -450936, -394467, 174796, 293583, 88787, 400508, 427626, 364297, 62504, -106707, 175284, 355163, 171840, 95107, 479830, 578628, 592460, 562535, 687782, 887950, 627835, 291937, -73056, 98415, 283020, 423303, 542284, 338031, 218823, 413222, 309190, 27722, 352761, 555855, 386703, -104094, -467574, -322059, 167937, 604019, 324673, 141964, 318238, 113989, -161419, -353807, -769330, -621626, -583592, -408761, -72628, -250022, -428843, -362631, -212891, -275860, 80955, 524772, 508083, -143015, -692538, -703933, -384767, -372474, -286344, -344780, -235142, 58065]
11543E8065J54701K13441j21748J1212k57947j40467O296j09481L74084K54553
11533D42709m92250j7717M43268j04244k79841J04167J03368R9098J68895j29127
11523C38326J53227K906l75275p8670K1229L96091K94374K70174p4549o76190
11513B71643M8575q3736l01312K31183j84833k65513K65722J12879K28382k85018
11503C7972j87933k97404J60449l20590J26187L35714J95835j9773j63740k28844
11493c62127k19943j83540J24120L46376J85963K34250j10814k57504j07205j56160
11483e06584M86165o7220M0483J8156j19321N14894Q5587m73349J99703J68920
11473C47434m62858N6708L61420r6754o10442P3975L41886k15026J13664L60701
$$ y = [58065, 212766, 426207, 304459, 315671, 57724, -82743, -76447, -185928, 188156, 442709, -49541, -67258, 376010, 271766, -8075, 96092, 199460, 298558, 467453, 338326, 491553, 494459, 119184, 40514, 61743, 457834, 752208, 1022382, 947833, 271643, 320218, 236482, -64830, 166353, -18480, -283993, -18271, 94608, 322990, 37972, -149961, -447365, -286916, -607506, -481319, -145605, 50230, 30457, -133283, -362127, -582070, -765610, -641490, -295114, -109151, 125099, 14285, -243219, -350424, -506584, -20419, -87639, -47156, -29000, -148321, 366573, 452160, -21189, 178514, 347434, -115424, -58716, 302704, 205950, -404492, -330517, 11369, -203657, -89993, 270708]
11463B70708K2740k58218m91195L71043R1169J01835k20439k26431K19999J36957
11453A8168n016q6426m3392j81960L36008L75292J67000L5348k42264k57452K4078
11442A39384K11093j11412q8763q5441j40804k29535K94040J81360J26428j20634
11432A75716p3106k44750P3994M4120J18492l7939J74199J31289J4589M2997k34181
11421A85420j10982O1035K81867N21813J89123l73651o10314j42398j50249j99692
11411c48028K59073j01430n57887k8325N00508O1002M41560L55461q7510j28582
11401C65842j55633K64073L41175l77376j24834k55647j56864O7337L5191j78433
11391a75169L45429K11250m02787n4177n8714l3098J53549K20308k08156l64712
$$ y = [270708, 293448, 35230, -455965, -84922, 6247, 108082, -112357, -338788, -118789, 18168, 13152, -73274, -116666, -298626, 37382, 412674, 579674, 615022, 372758, 115306, 139384, 350477, 239065, 150302, 64861, -75943, -305478, -11438, 169922, 296350, 175716, 102610, -142140, -68146, -24026, 94466, 56527, 230726, 362015, 376604, 419601, 185420, 74438, 135473, 417340, 939153, 1128276, 754625, 144311, 1913, -148336, -348028, -88955, -190385, -748272, -776597, -276089, -215087, 226473, 581934, 494424, 365842, 210209, 474282, 815457, 438081, 313247, 57600, -99264, -31927, 3264, -175169, 170260, 381510, -21277, -75454, -134168, -167266, -13717, 206591, -1565, -366277]
11381c66277L48637l468l06133J05229J11048m1876j21841J10347J61248o4128
11371f7214J42826q4543k5239j70427J37563L25878J67061k84804p9232n56339
11361d94470l56811q1255Q9543O29146M34284q2314J11619N9707o0985k52770
11351d306J5371J41225K48758j84859m87076J12220n6687l6170m49980N70190
11341a31314M90982j64257j83346J9877j39121j27859m3190j78787j39147J26288
11331d69874L72920J34038k84124l7422J38173k00377R6701L33514L39179J4910
11321D37638J25451o1496k26344k79307j62169J21981M99250J80524j63372l10157
11311A61999N2665j96729q9595l6179j64816m3469l01395l40191m3455O84747
$$ y = [-366277, -17640, -21108, -327241, -222012, -110964, -152840, -274681, -164334, -3086, -67214, 75612, -8931, -34170, -204597, -67034, 258844, 425905, 141101, 61869, -494470, -851281, -932536, -842993, -213847, 220437, 138123, 249742, 309449, 248464, -4306, 11065, 152290, 401048, 216189, -270887, -158667, -215354, -251524, -701504, -131314, 359668, 195411, 12065, 31942, -107179, -235038, -278228, -457015, -596162, -469874, -96954, 37084, -247040, -284462, -146289, -346666, -249965, 83549, 422728, 437638, 563089, 501593, 275249, -4058, -166227, -44246, 455004, 635528, 472156, 161999, 214664, 17935, -71660, -107839, -272655, -316124, -617519, -957710, -1001165, -316418]
11301c16418N19410L08078q5502j85089L776j83459K1032J1303j16486j96870
11291b20225P6027J76953K44058j87075K86999o9244k8599j93661j61526J64684
11281H8391l7249R9601J75724R6841O6977J17181k90506l10800l07637M2119n6281
11270c15639M312q9836L74739k1j27107K20111j03242Q1896J06083k05329k20062
11259b74095K02802J73205j2930j27712J51370J4994J64814k58257l7956Q7876
11249H4111j15913j97128J79510J03852L97061k61902k09809j86117R838K89948
11239I3451J99558p0235J53874k68914k4610K30015L62445J04206p5190J69862
11229H74462m09388j48508N464l0418l23691O5973K82355n0215l2297K11229K32243
$$ y = [-316418, 202992, 511070, 425568, 240479, 244255, 60796, 81828, 93131, -23355, -220225, -144198, 32755, 276813, 89738, 376737, 307493, 278894, 85233, -76293, 88391, 51142, 150743, 326467, 423308, 490285, 607466, 316960, 6160, -301477, -259358, -315639, -311327, -401163, -26424, -26445, -153552, 66559, -36683, 45213, 151296, -54033, -274095, -71293, 101912, 88982, -38730, 112640, 127634, 292448, 34191, -3765, 84111, -31802, -228930, -49420, 54432, 451493, 189591, -20218, -206335, -196497, 93451, 293009, 222774, 376648, 107734, 83124, 313139, 675584, 779790, 704600, 874462, 465074, 316566, 322030, 291612, -32079, 33894, 316249, 266034, 233737, 444966, 677209]
11218F77209l62542O9260j50664n3510J53060j82175j2837N85292j95042k74151
11208B53900p0343K55996J40819n53888m65259m7321J24702J09184K19361O6223
11198C3374j40153j98571K03707Q4386p5417j56524K9355L73870O5945k564k10404
11187G004Q4941k51771j99212N1547K67452n6922J36192K17619K09025l20678
11177A45197m50263n2205K67522n2795j94342l5288K0102K25724P5202K66155
11167B15009p8874j03039K83959M62321n89596j93792j278k39341K39558L16702
11157C11629m6331R0522K82969K5193l54690l5634l37629p2778O5780K43907j52224
11146B0714j01924k4742P113l5365J06935j8713k38773Q8338r1798J24712L08789
$$ y = [677209, 314667, 383927, 233263, 179753, 332813, 150638, 137801, 723093, 528051, 253900, 183557, 439553, 580372, 26484, -438775, -486096, -361394, -252210, -32849, 33374, -106779, -305350, -101643, -17257, -92674, -249198, -219843, 154027, 219972, 217408, 7004, 91945, -159826, -359038, -307491, -40039, -96961, 39231, 256850, 465875, 145197, -305066, -357271, -89749, -142544, -336886, -372174, -352072, -126348, -51146, 215009, 136135, 33096, 317055, 779376, 189780, -4012, -5290, -244631, -5073, 311629, 265298, 355820, 638789, 663982, 309292, 273658, -63971, -136749, -70969, 172938, 20714, -81210, -105952, -98839, -134204, -27269, -45982, -284755, -196417, -288215, -163503, 145286]
11135A45286r2052L45112j04l59246j66411K21606J39323K69090j23818Q8246
11125D67032j29206J04066m6171n14599J59297p677j70775l66630J733K84490
11115b18440j04947l43868j33065J62619N22032J08868J00920j75427J61384M13195
11105D93271j91203m05532j90772J59735q4580l55657J37566J73555J23308K75286
11095A34977M0555K42914m2450N9332K15844n34015j96590L78887l650l13043
11085a7239L1983K97044j0062k47339M1371J16940j03346k65244m7650R3646q3224
11074a93120J65993j45885Q1468K20232k01329j05104J2227j59941n2884p9305
11064d57648J83105J39174l36585j52859J13576L23611L78481J59759P3784l4313
$$ y = [145286, 53234, 398346, 398242, 38996, -127415, 94191, 233514, 502604, 378786, 467032, 337826, 441892, 395721, -118878, 40419, 32742, -138033, -504663, -502930, -218440, -323387, -667255, -800320, -637701, -115669, -6801, 94119, -81308, 80076, 493271, 302068, -103464, -294236, -134501, -219081, -574738, -437172, -263617, -140309, 134977, 175532, 418446, 375996, 435328, 651172, 117157, -79433, 299454, 295804, -17239, 14744, 311788, 301726, 54387, 95758, 212698, 109352, -155892, -203542, -109896, -193120, -27127, -173012, -91544, 128688, -72641, -177745, -165518, -325459, -378343, -457648, -274543, -135369, -471954, -624813, -511237, -187626, 190855, 350614, 424398, 390085]
11054C90085k4684k4235J53352J08858K082O6743m388k40799K65710M62945l69643
11043G86026l7128K4008n0883L12573O7119K89111P7829j03387j38844K88988
11033A515412L76837L79720K12370k77753N3221J64453k01150j78781J10667j00975
11023B054021k61838M03893O53389L06787o1604j09152m60864p13130l23347O74554
11013B162709q3543l04024l11718k35013M07711K27699j25753j76450L07045N0666
11003A919329m37858j1654J62662J31060k07843l50454o52306O0711L98476q6161
10993I25962m22292l25739j89115j97570M06368P23306j65850l98463r8691J22475
10983C80391k71813n13974M40065M32781j9121k92109j56391l81277J52619N20861
$$ y = [390085, 365401, 341166, 494518, 603376, 605458, 672201, 667813, 427014, 692724, 1155669, 786026, 748898, 772906, 722023, 1034596, 1101715, 1390826, 1468655, 1365268, 1226424, 1515412, 1892249, 2271969, 2484339, 2206586, 2259807, 2424260, 2223110, 2044329, 2154996, 2054021, 1792183, 2196076, 2849465, 3156252, 3094648, 2985496, 2524632, 1811502, 1488155, 2162709, 2079166, 1775142, 1463424, 1228411, 1636122, 1863821, 1738068, 1561618, 1868663, 1919329, 1481471, 1469817, 1632479, 1763539, 1555696, 1205242, 552936, 613647, 1012123, 925962, 503670, 177931, -11184, -208754, 197614, 920920, 755070, 356607, 257916, 380391, 108578, -405396, 34669, 467450, 448329, 156220, -171, -381448, -228829, 292032]
10973B92032N32993L25133J60958m89234m46502K90336k02121m72477J47696K98410
10963D37224J84702m31519k97294J8343K62187j91016J16800M08132j52095l16585
10953C8879j95620m2065r2559j59601j64411M99366o5932m28723Q7429J39498
10943c83739O3646J22266J06990P0725J42140O7226J12144k47153k67743K41621
10933B8123N40370N07165O9453j7983m71064l61685J26926l58709L87505M25709
10923H75810j55234k45135n26677l5002M3999k64328o557K35951J28380l95j59472
10912a08660K8915R3096j90541j97252K98109M6506R5398k90909j38606M01789
10902C7845N07669N3117j48746J48956l50387O6028L93981o2224l24001J33836
$$ y = [292032, 825025, 1150158, 1311116, 821882, 375380, 665716, 463595, -8882, 138814, 437224, 621926, 190407, -106887, -88544, 173643, -17373, 99427, 507559, 355464, 38879, -156741, -198806, -291365, -450966, -615377, -116011, -181943, -610666, -523237, -383739, -320093, -197827, -90837, -20112, 122028, 189254, 301398, 54245, -213498, 28123, 568493, 1075658, 1145111, 1127128, 656064, 294379, 421305, 62596, 450101, 875810, 720576, 475441, -51236, -86238, -42239, -306567, -313124, -77173, 51207, 50812, -108660, -79745, 13351, -177190, -374442, -76333, -29827, 65571, -225338, -363944, 37845, 545514, 598631, 449885, 598841, 248454, 314482, 708463, 646239, 322238, 456074]
10892D56074P9562p5213l82599k67007K92114R2910J07579n5325L7437N82123
10882H67655l21824l82421p3838j33325R4418J32596j15197j5541J59548K3807
10872B35878m53589j4551N82692J1602m97650j13985J6640K55968r9838k56310
10862c33143k25824J40511O7889J23761P5678N27613K93615k14904k29481K42387
10852D68102K88770m5993j56828J38857N4685M2664q4390J95083J41415J1115
10842A053480l00031r5661J59465N3462o4922K36282j16981k87659k42219L8312
10832D33528Q7933j23638N4027K35337L4989l05042l45746N0866M933O31232M65044
10821A223463q4318n75897j40979n5815j48781J3093n3238K22434j419j87285
$$ y = [456074, 535636, 460423, 77824, -189183, 102931, 195841, 303420, 248095, 285532, 867655, 545831, 163410, 89572, -43753, 50665, 183261, 68064, 52523, 212071, 235878, -217711, -232262, 350430, 362032, -135618, -249603, -232963, 23005, -76833, -333143, -558967, -418456, -350567, -226806, -151128, 376485, 670100, 455196, 225715, 468102, 756872, 710879, 554051, 692908, 747593, 790257, 705867, 900950, 1042365, 1053480, 753449, 657788, 817253, 870715, 805793, 1042075, 925094, 637435, 395216, 433528, 521461, 397823, 451850, 687187, 722176, 417134, 71388, 122254, 127187, 758419, 1223463, 1139145, 563248, 422269, 366454, 217673, 230766, 177528, 399962, 398543, 211258]
10811B11258l43968K53563k81854K07529M78004M81444J09219p48199l15317N14574
10801E66253Q6079l0014L87351L41899m39763m50344p9614m3321p6107j6273J00708
10790C46854P4631k10329k53304N9850J29994J24949K60481R0431n47295l33707
10780b57445r5911J11605k00652J42592Q277K82706Q4669k96068j78722K09180
10770a89769J92378K42654j39153j58230m22036l52554k76954K15354J87622j95348
10760h96036K21401j55932P5688J98859Q2405l8836J91180K08369Q8571j43422
10750a67753m5766j131K982K06136p3908M39608M6389m7744K3786M8312j97304
10739B33607l5609K34302j66886K66654O12997J1502j04541R7528J77957N21377
$$ y = [211258, -132710, 120853, -161001, 46528, 524532, 1005976, 1115195, 366996, 51679, 566253, 652332, 622318, 1009669, 1351568, 911805, 461461, 381847, 338526, 262419, 246146, 346854, 421485, 211156, -42148, 17702, 147696, 272645, 533126, 623557, 76262, -257445, -353356, -241751, -442403, -299811, -291534, -8828, 75841, -220227, -398949, -189769, 2609, 245263, 106110, -52120, -474156, -826710, -1103664, -888310, -700688, -896036, -674635, -830567, -754879, -556020, -473615, -512451, -321271, -112902, -24331, -167753, -213519, -214650, -211668, -5532, -79440, 360168, 406557, 358813, 382599, 430911, 233607, 197998, 432300, 265414, 532068, 1145065, 1156567, 1052026, 1149554, 1327511, 1848888]
10729A848888M11452J27292M63210J27580n86243k20244J6378j08832K51950K00291
10719B531722L44957J05497J40789N80763N10612l74103l53327K67426K23781
10710C978117j14085j35427j18833p8872L0264j32709Q8162L91692J81238j72693
10700C916854j65282l62053k58860N58617k9437k44393m0747K45003O7450j97415
10690C489737j51359n2557o595l8489N6593l64762j44064j52005m94127j90297
10680A952075p8978M18822k46010k01853J77366m1118J52967Q1376J08862l3113
10670B290396J09610L56896N79749j49464k85998k10051M1175J58037L36322R6035
10660C322707j37218J39593j70336L42082O18504L48406K01557L04820M48869
$$ y = [1848888, 2260340, 2387632, 2850842, 2978422, 2392179, 2171935, 2188313, 2079481, 2331431, 2531722, 2876679, 2982176, 3122965, 3703728, 4214340, 3840237, 3486910, 3754336, 3978117, 3864032, 3728605, 3609772, 3530900, 3561164, 3428455, 3516617, 3908309, 4089547, 3916854, 3751572, 3389519, 3130659, 3689276, 3659839, 3415446, 3374699, 3619702, 3687152, 3489737, 3338378, 3285821, 3279226, 3240737, 3297330, 2932568, 2788504, 2636499, 2142372, 1952075, 1873097, 2291919, 2045909, 1844056, 2021422, 1980304, 2133271, 2214647, 2323509, 2290396, 2400006, 2756902, 3336651, 3187187, 2901189, 2691138, 2732313, 2890350, 3226672, 3322707, 3185489, 3325082, 3154746, 3496828, 4115332, 4463738, 4665295, 4970115, 5418984]
10651E418984Q75155K56342p20096n48185n57j36894M07798J06767n54517o6558
10641E038239L02879L35893M20272K54856P73833P56720R99716J032865J010818
10632A0926091P28424J721998J672227J064704J242224J457399J686355J908168
10624B2407590K884867M629548O144862P319430J0004034J2807042J5882687J7989524
10616A00069584J8755531J8906880J7332121J3583257Q044034J659153o36665
10609A77713895J638445Q249316J6339112K5310482L1514307L4322822L3706472
10602C28794851K9854647J9846015L234364j3229526j9713404j4255742p64982
10595C33766223J5345797K8808416L7386673M0224633L7373984K9075945J2703665
$$ y = [5418984, 6294139, 6550481, 5830385, 5282200, 5281643, 5144749, 5552547, 5659314, 5104797, 5038239, 5341118, 5677011, 6097283, 6352139, 7125972, 7882692, 8882408, 9915273, 10926091, 11654515, 13376513, 15048740, 16113444, 17355668, 18813067, 20499422, 22407590, 25292457, 29922005, 36066867, 43386297, 53390331, 66197373, 82080060, 100069584, 118825115, 137731995, 155064116, 168647373, 176691407, 178350560, 177713895, 179352340, 187601656, 203940768, 229251250, 260765557, 295088379, 328794851, 358649498, 378495513, 381729877, 368500351, 348786947, 334531205, 333766223, 349112020, 377920436, 415307109, 455531742, 492905726, 521981671, 534685336]
10588E34685336j3760990l8583533m7168380l9240359k4176124p608533N654014
10581C69801431J3153808J5811852J3751529P852476l544124k1638194l7400637
10574C57788141m0515270l3303605k3029880j3022983n778603j407244L059m29713
10566B40303902l603124r348696j6251929k1804947k2638860k0097109j6102416
10559A30456821j2537887j0121286q016313o423120m972796m310451l597549l252498
10551G7224921l064403k860784k888369k831491k401445k201670k218331j850091
10543E6908337j266535j283738j466322j740515j475037j482979j228683p37454
10535D6227074o78831j066185j264201j343712j015272j178647r74824j035215
$$ y = [534685336, 520924346, 482340813, 435172433, 395932074, 371755950, 364147417, 369801431, 382955239, 398767091, 412518620, 420371096, 416826972, 395188778, 357788141, 317272871, 283969266, 260939386, 247916403, 242137800, 240730556, 240733615, 240303902, 236700778, 227352082, 211100153, 189295206, 166656346, 146559237, 130456821, 117918934, 107797648, 99781335, 93358215, 88385419, 84074968, 80477419, 77224921, 74160518, 71299734, 68411365, 65579874, 63178429, 60976759, 58758428, 56908337, 55641802, 54358064, 52891742, 51151227, 49676190, 48193211, 46964528, 46227074, 45548243, 44482058, 43217857, 41874145, 40858873, 39680226, 38705402, 37670187]
10527C7670187r26107j417506r34462p04450r46141n32174n41943n18901o30844
10518C0517659m63987p13708o48598q29458p99774l90678n07022m95993l50247
10509B5318194k99972n01368p49157n80613m35365m71379m39476m29082o87964
10500B0723818m38597l95347j53042j7396m05191q20174M529J24338o09136o73709
10490A7340093M9898J04211l37025j47435k40523o40066l74201k50418k0763K53092
10480A5736863m41512J32867j68240j76983m72309m96914r6605L9871j89191K08840
10470A4076687J66878l58810m29585j39888M0489K68558k19319j47778Q716k997
10460A3262951j53297k17654l20848m88572J03659L92830l34552m04715m75345
$$ y = [37670187, 36744080, 35326574, 34392112, 33687662, 32741521, 32209347, 31667404, 31148503, 30517659, 30053672, 29339964, 28691366, 27861908, 27062134, 26671456, 26164434, 25668441, 25318194, 25018222, 24516854, 23767697, 23187084, 22751719, 22280340, 21840864, 21411782, 20723818, 20285221, 19889874, 19736832, 19719436, 19314245, 18494071, 18498600, 18622938, 18013802, 17340093, 17389991, 17494202, 17157177, 17009742, 16769219, 16129153, 15754952, 15504534, 15483771, 15736863, 15295351, 15428218, 15259978, 15082995, 14610686, 14113772, 14017167, 14057038, 13867847, 14076687, 14243565, 13884755, 13455170, 13315282, 13355771, 13624329, 13405010, 13257232, 13265948, 13262951, 13109654, 12892000, 12571152, 12082580, 12186239, 12579069, 12244517, 11839802, 11364457]
10451A1364457M6775J7439n70289l41258J33347j37562j30296o26587m38424l6271
10441I281331J18079j33093J08676J95532m41118n03681j77794j83205o942Q709
10431H266494j86807l20597m9215J55055n7270n1612m88351j83984L248l2802
10421G054159j84088n91988o13374o1242K60988j02865J40706m60559j79382J69622
10411E431977K07137j03443j31616K45066k14305l39424J17491m3796j88026J42694
10401E123755Q7669k84772R1621l6j22801l5440m08699j30113L24843k16649k0257
10390D409121J59514k07199j85489R4932j56799J0273J14526l70138k28725k14408
10380C425608L46360K04006J54424r43688l8678O09761l84813j37665J35986J28923
$$ y = [11364457, 11411232, 11428671, 10858382, 10517124, 10650471, 10512909, 10382613, 9756026, 9317602, 9281331, 9399410, 9266317, 9374993, 9570525, 9129407, 8625726, 8447932, 8264727, 8257785, 8266494, 8079687, 7759090, 7709875, 7864930, 7807660, 7756048, 7267697, 7083713, 7086961, 7054159, 6870071, 6278083, 5664709, 5603467, 5864455, 5761590, 5902296, 5441737, 5262355, 5431977, 5639114, 5535671, 5404055, 5649121, 5434816, 5095392, 5212883, 5169087, 4981061, 5123755, 5211424, 4926652, 5018273, 5018237, 4895436, 4859996, 4451297, 4321184, 4646027, 4429378, 4409121, 4568635, 4361436, 4175947, 4270879, 4114080, 4124353, 4238879, 3868741, 3640016, 3425608, 3771968, 3975974, 4130398, 3186710, 3148032, 3757793, 3372980, 3235315, 3371301, 3500224]
10370C500224R7051n67330j72063J39354K22750j18463k32669P6882q5224j59599
10360B700913k40423p9034j54948l547n557j05648j51119P6870j45402O8326o3460
10349A896971M8351m06811K80588Q1543J61568L8028p8835j64665j17284J36183
10339A875637j81475J21940J5726K89784N9212k55549j70891j91441l3769k0370
10329A508804j70177J15950j68043k12815J90404J66823K9686L43296K23394N91989
10319B619311K14659j31015m13916p78803m04984M8017J32291l22752k58580j49382
10309E54846L33899j22091J33535L78597n2965O7893k12849m57260K30894q3933
10299G70566J95143j40568j31502M33050j5716k53974J43670K38400j49859K33493
$$ y = [3500224, 3597275, 3029945, 2857882, 2997236, 3219986, 3101523, 2868854, 2945736, 2860512, 2700913, 2460490, 2381456, 2226508, 2222961, 2217404, 2111756, 1960637, 2037507, 1892105, 1960431, 1896971, 1945322, 1538511, 1819099, 1900642, 2062210, 2100238, 2021403, 1856738, 1739454, 1875637, 1694162, 1816102, 1831828, 2121612, 2180824, 1925275, 1754384, 1562943, 1529174, 1508804, 1338627, 1454577, 1286534, 1073719, 1264123, 1430946, 1460632, 1803928, 2027322, 2619311, 2833970, 2702955, 2289039, 1510236, 1105252, 1153269, 1285560, 962808, 704228, 554846, 888745, 766654, 900189, 1278786, 1225821, 1293714, 1080865, 623605, 854499, 770566, 965709, 825141, 693639, 1126689, 1110973, 856999, 1000669, 1239069, 1089210, 1322703]
10289A322703p5442Q506r3265K43117l06305l49764O86K7003l69464j99343J56003
10278C64435L40141M07335m9050k9142J47760M23900k62442k77809O2785j96530
10268I31383r6350k26407J90750j83176m79477K70965L17108K9685J4738j63562
10258F05657L2365J22199o4868k73492n69906l82095L20902P0689O6272K13570
10248A41293N99162J30895M28807k93330q547K35406j90242j6672M56885j94997
10238A288660n7691p9437l89095m0476K48142O978j07137j95708j96336j65185
10228C12715k90450j40499j7433l37256l1468O44975L88882n3312M57144R3786
10218A027084j49450J91743k8118l15326l02103l1567R7276k38249Q5708Q1174
$$ y = [1322703, 1247261, 1255767, 1162502, 1405619, 1099314, 749550, 750236, 777239, 407775, 208432, 364435, 704576, 1111911, 1062861, 1033719, 1181479, 1605379, 1342937, 1065128, 1127913, 931383, 835033, 608626, 799376, 616200, 136723, 407688, 724796, 754481, 769219, 605657, 638022, 760221, 695353, 421861, -148045, -530140, -209238, -138549, -72277, 141293, 740455, 871350, 1300157, 1006827, 998280, 1233686, 1043444, 1026772, 1483657, 1288660, 1230969, 1151532, 762437, 721961, 970103, 977081, 869944, 674236, 477900, 312715, 22265, -118234, -135667, -472923, -504391, 140584, 529466, 476154, 933298, 1027084, 877634, 1069377, 1041259, 725933, 423830, 392263, 489539, 251290, 336998, 418172]
10208D18172p5381k71275o8848o2471J89784L59947l48792k13166j53632k04887
10198d30549p1301K62830J48704J9344o1416j97686K10733L15625k78020j68811
10188b50547N4529R5611K63941n8329K23013K54835J6463J84175K9481J08260
10178I21432J82958l18005k99461P3392J87341J82030Q8835L53335J72865j70835
10168A373887K81904N47389k4735J47481L20679j04037k05752o55821p55070M21611
10158A347536L08697J8871Q5577M83669R25978P27891j85840o46012m96927o9497
10148B499943l25882j35922N4046L3480K36320O42216J2535p5394L50431n05008
10138B786765m73279l38625l54926K041k83520l94322k76223N24973L92398l69619
$$ y = [418172, 342791, 71516, 2668, -59803, 129981, 489928, 141136, -72030, -225662, -430549, -501850, -239020, -90316, -70972, -132388, -330074, -119341, 196284, -81736, -250547, -196018, -100407, 163534, 105205, 328218, 583053, 599516, 783691, 813172, 921432, 1104390, 786385, 486924, 560316, 747657, 929687, 1018522, 1371857, 1544722, 1373887, 1655791, 2203180, 2178445, 2325926, 2646605, 2542568, 2336816, 1680995, 925925, 1347536, 1656233, 1675104, 1760681, 2244350, 3170328, 3898219, 3712379, 3066367, 2569440, 2499943, 2174061, 2038139, 2092185, 2125665, 2361985, 3004201, 3016736, 2941342, 3291773, 2786765, 2313486, 1974861, 1619935, 1621976, 1338456, 944134, 667911, 1192884, 1585282, 1215663]
10128A215663o23365K33062N13064M8671J57546m21943n93577l72211O39190K24638
10118A020738k60891m4619M1621o6456k62834q6206l2502J17844L58071m1070
10108G43696k26895K2398K04491J12682m53906k25995J11742n6634k27046n41399
10098e36866J73580L13851l9672K34377K6012j71597m28082m02370j31164J01863
10088h60068J43326R2371J53871P49614L32680l25500J20113J2054j55730J12855
10078C75586K69158O6188r8647J13238j24400m02924m17012j03131J36613M31696
10068B46365Q1320o0669j00628J51011k31006j68604J49082j63842j61386J56066
10058a02291o1309J5604M13466m9545j82300k03108p7396m6247J97044J13893
$$ y = [1215663, 592298, 825360, 1338424, 1387095, 1544641, 1122698, 529121, 156910, 796100, 1020738, 759847, 715228, 756849, 690393, 427559, 341353, 308851, 426695, 784766, 743696, 516801, 539199, 743690, 856372, 402466, 176471, 288213, 231579, 4533, -536866, -363286, -49435, -89107, 145270, 171282, -315, -428397, -830767, -961931, -860068, -716742, -624371, -470500, 279114, 611794, 286294, 406407, 418461, 262731, 375586, 644744, 710932, 612285, 725523, 601123, 198199, -218813, -321944, -185331, 246365, 327685, 267016, 166388, 317399, 86393, -82211, 66871, -96971, -258357, -102291, -163600, -147996, 265470, 215925, 33625, -169483, -246879, -293126, -96082, 17811]
10048A7811M11770J30386k70645L2806l20156J41030Q1619K29593l8977N2335
10038D67572J11550j3136k86572j42242o6077l34248j28730j42132J28862J00105
10028c05048k61927L5224L3527M01338O72214M10918q3095n29281l27700k10478
10018a64308J76334O95921Q8632l57075r6695J6357k89353k70301J7221L48512
10008A65245N9130k93457k94950J6621N27436J85957l27484j43260O73871L17503
9998H86612l85651m79477j4866M440J92452o5738o3982M74121K41637k5328j73673
9987E90547k2423k67001k37918M07417K71959k80636k27884R5425K38156n71526
9977c884j09796J01714j3973L14978J21912k70575R5214N96322L12692m70468
$$ y = [17811, 429581, 559967, 289322, 322128, 1972, 143002, 224621, 454214, 415237, 467572, 579122, 565986, 279414, 137172, 71095, -263153, -391883, -534015, -405153, -305048, -566975, -531751, -498224, -96886, 575328, 986246, 903151, 373870, 46170, -164308, 12026, 707947, 796579, 439504, 342809, 359166, 69813, -200488, -183267, 165245, 224375, -69082, -364032, -347411, 180025, 365982, 38498, -104762, 569109, 886612, 500961, 21484, 6618, 11058, 203510, 137772, 73790, 547911, 789548, 764220, 590547, 568124, 301123, 63205, 470622, 742581, 461945, 234061, 329486, 567642, -3884, -113680, -11966, -25939, 289039, 410951, 140376, 235590, 831912, 1144604, 674136]
9967F74136p32077k01825K46934J98578K50914j22614q0158N39961J28424m19371
9957D82902J87142M13721r1412k39776O3984j11097L5976m33430k09876j67379
9947f9245j82397J29748J07189k94084J07735Q2973k14145Q810N22729L4090J0323
9936B43726L27562K18161P5842J37949k86136j65710J7335J07692L03782O1277
9926A041480L63595J32759K88342j40366P62885Q35263J053507K062274K717061
9917I116800L747568M614912M307185L458090L353029J536842l550499o875165
9909A9708762n974697l947804k647121j316797q9718n23337r62509o47342j70728
9900C428709m3916l20468k27440j97358m67790k34789m62038l68428n8093J36784
$$ y = [674136, -57941, -259766, -12832, 185746, 436660, 314046, 233888, 773849, 902273, 482902, 670044, 1083765, 992353, 752577, 816561, 705464, 741440, 308010, 98134, -69245, -251642, -121894, -14705, -308789, -201054, -118081, -332226, -323416, 199313, 233403, 243726, 571288, 789449, 865291, 1003240, 717104, 551394, 568729, 676421, 980203, 1041480, 1405075, 1537834, 1826176, 1685810, 2448695, 3283958, 4337465, 6399739, 9116800, 12864368, 17479280, 21786465, 25244555, 28597584, 30134426, 26583927, 19708762, 13734065, 9786261, 7139140, 5822343, 5732625, 5209288, 4246779, 3599437, 3428709, 3384793, 3064325, 2836885, 2639527, 2171737, 1936948, 1474910, 1106482, 1048389, 1185173]
9890A185173K57092K98877L78982N0192r1928J50250l37575k63373j38194R2288
9880A581784J51914n51409m56243J32000J44602K19387J52423j2827j72922R0431
9870A279140L56040O8064k45472j39099k86125L5224J2740N249n12389J15339
9860F88711O968k894K43458j61587o5071J65433Q1239J84776j5666j74339j1470
9849I39558j94807M18158j56403m67561l73089l76528l43293P48528P18426k1726
9839H91263k85301n4841j80279M6086L84035Q9524j54019l50739k03348J80293
9829C62674J90548M16186P6214k17126j83289l197k39719l83989j43080K01938
9819G7160N66087K05250j56906r9300l15248n24945K72229L53341J29071k16922
$$ y = [1185173, 1442265, 1741142, 2120124, 2170316, 2078388, 2228638, 1891063, 1627690, 1489496, 1581784, 1733698, 1182289, 726046, 858046, 1002648, 1222035, 1374458, 1361631, 1188709, 1279140, 1635180, 1703244, 1457772, 1318673, 1032548, 1067772, 1080512, 1085761, 573372, 688711, 695679, 692785, 936243, 774656, 709585, 875018, 956257, 1141033, 1125367, 951028, 939558, 744751, 1162909, 1006506, 538945, 165856, -210672, -553965, 194563, 912989, 891263, 605962, 551121, 370842, 416928, 800963, 890487, 736468, 385729, 182381, 362674, 553222, 969408, 1045622, 828496, 645207, 642010, 402291, 18302, -124778, 77160, 643247, 848497, 691591, 592291, 277043, -247902, 24327, 377668, 506739, 289817]
9809B89817k29229L78072R083n229r4292J58789R4108k73561N4147r1418m2165
9798B48122K47212j75968K9020n0267J46398L07937M15616k36097k41779J11452
9788H01646O5130J86740L23435J78532K26104Q52624J174539J113149O37875O82065
9778F241839P63173j14540p81416j603376j519317p98954o00164j91587l23042
9769A072616k47686J17165K7324M6141p6087M4304k17102K44214L79842l94948
9759I95783o66337q7117M7659K08965l61845j85264L07302K18229j7053n5646
9749D04676N3996m54866K00583L10810K63510l20481k74466J81345n1717N5618
9739C69008j95200l64294j22567J47447J55224j15832l48543j83592O42836L05751
$$ y = [289817, 60588, 438660, 447743, 442514, 348222, 507011, 601119, 327558, 381705, 290287, 248122, 495334, 319366, 348386, 298119, 444517, 752454, 1168070, 931973, 690194, 801646, 866776, 1053516, 1376951, 1555483, 1781587, 2634211, 3808750, 4921899, 5559774, 6241839, 7005012, 6890472, 6109056, 4505680, 2986363, 2187409, 1587245, 1395658, 1072616, 824930, 942095, 969419, 1015560, 939473, 983777, 766675, 1010889, 1390731, 995783, 329446, 242329, 289988, 498953, 137108, -48156, 259146, 477375, 460322, 404676, 458672, 3806, 204389, 515199, 778709, 458228, 183762, 365107, 313390, 369008, 173808, -190486, -313053, -165606, -10382, -126214, -474757, -658349, -15513, 290238]
9729B90238K6919K46951J3798k08251j72936J32880q4664O3843M82073Q9902J31823
9718A012576K42544j62392r4787n05037k05637O8933l74112J34231N91368p1495
9708F36192m37697J27334J88070N3925j8424r9060j07362k78991l27062Q9842
9698a73233j4092L43865K23708k24743j32769j34992K38522K19612R4322J30399
9688E70599n12175l00522J81735O14062k32530j72312j47559M76428L26332J39601
9678I43659m27175k57337k13334M16309j51477m17368N7427J29010j41975k99807
9668c62068J06826p6684l00009L16421L06472q1598m07631j27966J65601k5540
9658d86176r4140K39346J62392n9480j76322j48379K96575M97946K75521l14712
$$ y = [290238, 317157, 564108, 577906, 369655, 196719, 329599, 244935, 308778, 790851, 880753, 1012576, 1255120, 1092728, 997941, 492904, 287267, 356200, -17912, 116319, 707687, 636192, 198495, 325829, 513899, 567824, 549400, 450340, 342978, 63987, -263075, -173233, -187325, 156540, 380248, 155505, 22736, -112256, 126266, 345878, 440200, 570599, 58424, -242098, -60363, 553699, 321169, 148857, 1298, 477726, 804058, 943659, 516484, 259147, 45813, 462122, 310645, -106723, -49296, 79714, -62261, -362068, -255242, -331926, -631935, -315514, -9042, -90640, -498271, -626237, -460636, -486176, -580316, -340970, -178578, -238058, -414380, -562759, -266184, 231762, 507283, 192571]
9648A92571k20033N63102K83516L9242l34529k6164j18676k46905M53309J98963
9638G84396r6601l58208l51579R323r4861j03514Q0629M52919K32885M63673j71372
9627H47690k40484j61138r1113R6814m77316L9114M8618L37312k80290q851n4622
9616E5734R8223M694J0678J45369N8123K31620p5225K08406k31382m44103j05396
9605d3259L4879k24361N4230K02176K60510j15794j33552q323M08633J71119k7917
9594E78341k16618n60600j35102K23469K24656K6254l901P7549n78524m64830
9584h29306L47126J03208l19960L14156O88144J95089M2714k8139R4679k64545
9574C43166l6856K91003N6870J31805j40484k04059r0983N0500k8514k57483M02726
$$ y = [192571, -27462, 535640, 819156, 858398, 523869, 497705, 379029, 132124, 585433, 784396, 687795, 329587, -21992, -12669, -107530, -211044, -130415, 322504, 555389, 1019062, 847690, 607206, 446068, 354955, 451769, -25547, 13567, 62185, 399497, 119207, 110356, 55734, 153957, 158651, 169329, 314698, 372821, 604441, 529216, 737622, 506240, 62137, -43259, -8380, -232741, -178511, 23665, 284175, 168381, 34829, 26506, 435139, 606258, 578341, 361723, -198877, -333979, -110510, 114146, 140400, 136499, 214048, -364476, -829306, -482180, -378972, -698932, -384776, 303368, 498457, 541171, 513032, 607711, 343166, 306310, 597313, 654183, 785988, 645504, 441445, 350462, 400962, 372448, 114965, 517691]
9563E17691M7341k4844k63927j80022K67512K83172l52948k24335R0232J56774
9553C16646M6454l20603K87983L59545j05405p4854l14206j39129K17498L6647
9543C10576m41883k68958M6475Q2857N81866J56655P0673N15528n8168l67720
9533F27901j87487k25154k01383J01018R4082j27007j61264m0355J35605N9683
9523G5639J55351L9783J34242K86153k8553L89653j78961l43140n38753k06994
9513b15580l3950J19382J94326k4555K20629L36552J44112k81258J37933k01399
9503C96192k8628j23373m9999n9957p5798m3719m01875J26309k55058q4912L14155
9492b86663J85581K0164K83693J50387j7629K14167J69383L9227q0318k91292
$$ y = [517691, 565032, 540188, 276261, 96239, 363751, 646923, 293975, 69640, 159872, 316646, 363100, 42497, 330480, 690025, 584620, 509766, 195560, 56431, 273929, 310576, -131307, -400265, -353790, -270933, 310933, 467588, 538261, 1053789, 995621, 627901, 440414, 215260, 13877, 114895, 208977, 81970, -79294, -119649, 15956, 75639, 230990, 270773, 405015, 691168, 662615, 1052268, 873307, 530167, -8586, -215580, -249530, -130148, 64178, 39623, 260252, 596804, 740916, 459658, 597591, 396192, 367564, 244191, 194192, 134235, 58437, 14718, -387157, -260848, -515906, -600818, -286663, -101082, -80918, 202775, 353162, 335533, 549700, 719083, 758310, 677992, 386700]
9482C86700l94509J6122j05374k03174Q7297o2187m32358J83910K91701J47076
9472h4796j32851k494J37763O4614j39623l9517N377j3379L12715J70750k8043
9461B50516n0251o1932j82001K7814k7123k24272Q9416j44119r2994K74394j08597
9450b49149J29423l90781j89899K37960K61454j3019k8529L39464Q9270l79655
9440a93461L61054L61596k24982k00854j4809j76860K50361L78863N1379k30133
9430C62154k46151R8298l9827k6232J47527K01319o4295l57643J77295p9329n76234
9419d03118j30889J10701K44757P7537J68009J49402K52512k08048l21004l78877
9409d39018j73414j45529Q1365r1618K75167J75818J9437N05270m01946k50205
$$ y = [386700, -7809, 8313, -97061, -300235, -212938, -275125, -707483, -523573, -231872, -84796, -217647, -220141, -82378, -17764, -157387, -196904, -191527, -204906, 107809, 278559, 250516, 200265, 138333, -43668, -15854, -42977, -267249, -177833, -321952, -414946, -140552, -249149, -119726, -510507, -700406, -462446, -200992, -214011, -242540, 96924, 186194, -193461, 167593, 529189, 304207, 103353, 88544, -88316, 162045, 540908, 592287, 362154, 116003, 214301, 174474, 148242, 295769, 497088, 432793, 75150, 252445, 173116, -403118, -534007, -423306, -178549, -101012, 66997, 216399, 468911, 260863, -60141, -439018, -612432, -757961, -676596, -768214, -493047, -317229, -297792, 207478, -194468, -444673]
9399d44673m11999N1943N39613K13671J45590j71389K62764N02729o9821k94086
9389C24342n3576m3953M18520j6709l43123j94391k35661n39833K38767M32088
9379a3529J28135J80815O3806k96921k23509J70139l76203j34975L81472O47111
9369E26341L73596k07448n39381m635j0878J172p1365k65452P869K06267M7632
9358F3718M8604l53857q3634N92089J67716l36976j48067L81165j24153r5569
9348A11036J37670J24403k15723l59659j92045N04230j98301k04675l96428J34264
9338e55228K79815J38843K37649L8931J17829L41863L09318k92072k85932k76510
9328E4506j73040K54068L4948j50072K35920K29882j20907l08450l53622m92919
$$ y = [-444673, -856672, -804729, -265116, -51445, 94145, -77244, 185520, 688249, 618428, 324342, 270766, 226813, 645333, 628624, 285501, 91110, -144551, -684384, -445617, -13529, 114606, 295421, 359227, 62306, -161203, 8936, -367267, -502242, -120770, 526341, 899937, 692489, 153108, 148473, 137595, 138767, 67402, -198050, -190181, 16086, 63718, 112322, -241535, -325169, 266920, 434636, 97660, -50407, 330758, 206605, 111036, 248706, 373109, 157386, -202273, -394318, 109912, -88389, -293064, -689492, -555228, -275413, -136570, 101079, 140010, 257839, 599702, 909020, 616948, 331016, 54506, -118534, 135534, 170482, 20410, 256330, 486212, 365305, 56855, -296767, -789686]
9318g89686o7991K28267J51328N34181M2422m6075N50986K2045k27042l98624
9308a89k88422M12228M63324L99202n23983l41593k94094j98938J88221K77437
9298I3193k11902k82171k2281j91353K69815M9795j04621K94580L11762l68023
9288a61206J25919P96117n4716k98105K44633j66296J3987l50359j45121j26191
9278a21338M6129M44299K97981l70685k38690j12442k62099L21834K52994M22327
9268F80310j63973m92403K64322Q9740m2637m6177l8106L2229l2063l51401q0431
9257a80590K62750P0628l6969j04464K98831L8716k30863M0839o9321n6408J67072
9246B00221n63719k03291j21615K66888K19452N5104m3021Q9384K60811j12116
$$ y = [-789686, -857677, -629410, -478082, 56099, 98521, 52446, 603432, 625477, 398435, -189, -288611, 123617, 586941, 986143, 462160, 120567, -173527, -372465, -184244, 93193, -118709, -400880, -423161, -614514, -344699, -294904, -399525, -104945, 206817, -161206, -35287, 760830, 706114, 408009, 652642, 486346, 500333, 149974, 4853, -121338, -75209, 369090, 667071, 296386, 57696, -54746, -316845, 4989, 257983, 680310, 516337, 23934, 288256, 377996, 335359, 289182, 251076, 283305, 251242, -100159, -180590, 82160, 152788, 115819, 11355, 310186, 348902, 118039, 158878, 89557, 33149, 200221, -363498, -566789, -688404, -421516, -202064, -146960, -189981, -100597, 160214, 48098]
9236D8098r5601J44123J71188k71721k33077J882J19634q5012J09832p8047J2452
9225a56249N6870L60585m11673J04400o816j63359J53410p1724r3859l43692j98353
9214g70460K2009O06931M22123j11401k06381j22008k20852P5149N65133M7453
9204C07696O6640k86743J47761j43495o23783K74259L28461m13667l5718j9871
9194c98460k4277j32041K14187r0925K36780K9115q038j46473Q0803N1473k90347
9183d78203M214K2648J82835K67725J0692k52654K69760M12148q3515o452j51127
9172A98071m05652j89653O5030M6048J03667J76256J64556J64481k02921n05902
9162c86019k60193L45855L05713n5472l20934j40850K7790P16906J51220j04242
$$ y = [48098, -47503, 96620, 267808, -3913, -236990, -235108, -115474, -200486, -90654, -168701, -156249, -99379, 261206, -150467, -46067, -52883, -216242, -62832, -134556, -228415, -572107, -770460, -748451, -141520, 280603, 169202, -37179, -159187, -380039, -304890, 260243, 307696, 374336, 87593, 235354, 91859, -531924, -257665, 70796, -342871, -378589, -398460, -422737, -554778, -340591, -431516, -194736, -165621, -173659, -320132, -239329, -187856, -478203, -473989, -451341, -268506, -781, 9911, -242743, 27017, 439165, 355650, 349198, 198071, -207581, -397234, -332204, -286156, -182489, -6233, 158323, 322804, 119883, -386019, -646212, -300357, 5356, -50116, -371050, -511900, -484110, 232796, 384016, 279774]
9152B79774l2874k80860n8584J00655J7977J73424j74981l05817q7890N54720
9142A85544k68028k53272K96150l26835k77236J29947M60831m6132J39824n52476
9132e11683m40439J51712O7131M58967K54623M88919M16303p1556l61246k52014
9122B00717r3589j26618P9209k350L36864N6583l45607j31212l46467J43031O0892
9111a68547j69732M2033K11296l9608N0924L73377k94070k04097k24709K08540
9101b14593K85295K70426Q8843n78531l09871M70416K23152J01182K69082Q0902
9091F86303k49568j81622P416J41280J28914l38674j04015j20388p9165J28402
9081A8883M39041N99089k2126m91194o5059j23046P6956k98209O0155R5087o6619
$$ y = [279774, 246900, -33960, -92544, 8111, 26088, 199512, 24531, -281286, -369176, 185544, -82484, -335756, -39606, -366441, -643677, -513730, -52899, -99031, 40793, -511683, -952122, -800410, -733279, -274312, -19689, 469230, 885533, 813977, 452731, 200717, 107128, -19490, 59719, 57369, 394233, 450816, 105209, -26003, -372470, -229439, -168547, -338279, -296246, -84950, -124558, -73634, 299743, 5673, -198424, -423133, -214593, 70702, 341128, 429971, -148560, -458431, 11985, 235137, 336319, 605401, 686303, 436735, 255113, 262529, 403809, 532723, 194049, 90034, -30354, -109519, 18883, 457924, 1057013, 1034887, 543693, 478634, 355588, 432544, 134335, 194490, 289577, 222958]
9070B22958M05824J69629k38230Q0256J10190R2043n93346k59980k34128J07777
9060a37007K85996Q9674m7939k56693k6708K65297j05514l63513j38974p2000
9050e07381j79447L03393o4997k12069L30836N42788j63329m83247J88578K67864
9040B2989l17133j92163j18803j13112J43062p0912J35061L94211o6317l12719
9030d95836K94498k97574l4095K66282j4926K85550J52250J41954J95679L6981
9020E30763j87300q5109k41770L33416M39141j21275j06118J42519j96339J15910
9010F23838k84090k2129j52917q8524q2265j77979n9569k66830J57100J68108
9000a85257O59950K77689k57991l78233o5407J32766P2306J43387m06514l15677
$$ y = [222958, 628782, 798411, 560181, 640437, 750627, 842670, 249324, -10656, -244784, -137007, 148989, 238663, 190724, -65969, -92677, 172620, 67106, -296407, -435381, -507381, -686828, -383435, -448432, -660501, -329665, 213123, 49794, -433453, -244875, 22989, -294144, -486307, -605110, -718222, -575160, -646072, -511011, -116800, -183117, -495836, -201338, -498912, -533007, -266725, -281651, 3899, 156149, 298103, 493782, 530763, 343463, 258354, 16584, 350000, 789141, 667866, 561748, 704267, 507928, 623838, 339748, 317619, 164702, 76178, -6087, -184066, -243635, -510465, -353365, -185257, 474693, 752382, 494391, 116158, 50751, 183517, 255823, 399210, -7304, -322981]
8990c22981K81847K97217q9706K53608j2651O6884P0858k80801j52068K28492
8980C40699l11848l54165o2883J60969K49857m72198k52033O47506N02560L24651
8970G73115m60945l57247l60006o2924R4164n74387k45619j8701J75373N71055
8960d66122M13237j87981N49364J20474m39286k20175J1016N52918K6434L25985
8950F85864m71343m12047J27208j47941J80727L69788m6798l25699J08535J27796
8940A96090J84782k32945j02463j66060k08801J17751L49580K06806L9335k18829
8930A65246r9483k25164l8510L04218j31875K02961N7551K8488R371k34022k37986
8919a99205P7259K52647P41933j07412j33107j82180j34918l1899k69009j03449
$$ y = [-322981, -41134, 256083, 166377, 419985, 407334, 474218, 545076, 264275, 112207, 340699, 28851, -325314, -388197, -227228, 22629, -449569, -701602, -54096, 448464, 773115, 312170, -45077, -405083, -468007, -373843, -948230, -1193849, -1212550, -1037177, -466122, -52885, -240866, 308498, 428972, -10314, -230489, -219473, 333445, 359879, 685864, 214521, -197526, -70318, -218259, -37532, 332256, 285458, -40241, 68294, 196090, 380872, 147927, 45464, -120596, -329397, -211646, 137934, 344740, 384075, 165246, 65763, -159401, -197911, 106307, -25568, 177393, 234944, 263432, 272803, 38781, -199205, -121946, 130701, 872634, 765222, 632115, 449935, 315017, 283118, 14109, -89340]
8909h9340m09822k64592J85652J31853k22556J9610L6559k54904m0078J99353
8899g08265K23053L88988m48423M7824J44114K18423l28649n94337L70188M55282
8889b31802m8005j65955J29123J15428P7089j6930J03303Q8538L0339l02386m1776
8878b63034M03206l67039l11447J3155L07692K3556o25155J54480Q30964J58611
8868C24989k23141k87305j55108k94756o3772K27454O33599J63621l93415o1952
8858a29786J83696N6167J61115K36005j04997m55868m40428N4416M00940K89164
8848B50424q5994j46421J32366l0254j08779K06773J02832J44139j58246m08214
8838a01374K3677o3064J24711j1094j97556j46838j87799L25738j95549M1946
$$ y = [-89340, -499162, -763754, -578102, -446249, -668805, -649195, -612636, -867540, -907618, -708265, -485212, -96224, -544647, -496823, -352709, -134286, -462935, -1057272, -687084, -231802, -279807, -445762, -316639, -201211, -124122, -141052, -37749, 50789, 81128, -221258, -263034, 140172, -226867, -538314, -525159, -217467, -193911, -819066, -664586, 166378, 324989, 101848, -185457, -340565, -635321, -699093, -471639, 161960, 325581, -67834, -129786, 53910, 110077, 271192, 507197, 402200, -53668, -494096, -439680, -38740, 250424, 164430, 18009, 150375, 120121, 11342, 218115, 320947, 465086, 306840, -101374, -77697, -140761, -16050, -27144, -224700, -371538, -559337, -233599, -429148, -387202]
8828c87202l3503K1154L39924O0367l37871L607M22954J37518k12875q8947K11247
8817A36373O5890K24082p3740K31231r131l77749r5283J44203k70895j96833M46325
8806B24473M55751n32515o47226M02635J38664K62292k09401m25447k74265l33469
8796i38508K10240P31749L73928j04543n00413k93476j1172K64535k88330m14631
8786i70621j83208L09231M50879K30043j45195j54325P325K31124J76925R8547
8776E0725j4868l33339j68627o7385L9463K40882k4783K5676J51732Q5264J96252
8765A80992O00937K11241m19549j44135l35146k14330K44997J94787l4715k11397
8755G3682M114K0593J3323r5254K23215L95455J31013J57507l2773m76421l28334
$$ y = [-387202, -420705, -399551, -59627, 740, -337131, -333524, 89430, 226948, 14073, -74874, 136373, 202263, 426345, 352605, 583836, 574705, 196956, 101673, 245876, -25019, -221852, 224473, 680224, 147709, -499517, -96882, 41782, 304074, 94673, -330774, -605039, -938508, -728268, 3481, 377409, 272866, -227547, -521023, -532195, -267660, -555990, -970621, -1153829, -844598, -393719, -163676, -308871, -463196, -455871, -224747, -47822, 50725, 35857, -297482, -466109, -533494, -494031, -253149, -277932, -252256, -100524, -15260, 180992, 781929, 993170, 573621, 429486, 94340, -119990, 125007, 319794, 285079, 73682, 77796, 98389, 111712, 16458, 239673, 635128, 766141, 923648, 890875, 414454, 86120]
8744H6120j61199m46162l34191J67979O70831k11302l26558m9870R4560K50639
8734b59153j19891o9381K95359J70848R8381P0549j03083j01717q58J33978r2295
8723B2737J8734L52956n4861L9509J3524l85646j64420j30131l99842L3457J53976
8712e00007J78657K80880j86333k41768J21537o217J04728K31250L88523P1869
8702D43119k2678p8013k66266J42798L30649l60949m4936j82694J47199m32391
8692c24162q7348l338M1941L2877P1247k36904J71185o1779M0216p4156P218N7368
8680c65635K96114l8617j21923P9258r9637J51212k9442l33350O6397M30604m03301
8669c68320j17660R6460K91750K57373J05234N9251m3477J59559O0972k63948
$$ y = [86120, -75079, -521241, -855432, -687453, -16622, -227924, -554482, -604352, -509792, -259153, -379044, -448425, -153066, 17782, 116163, 186712, 83629, -18088, -18946, 115032, 22737, 41471, 394427, 339566, 379075, 392599, 6953, -157467, -287598, -687440, -653983, -500007, -321350, -40470, -226803, -468571, -347034, -353251, -248523, -17273, 371250, 443119, 420441, 342428, 76162, 218960, 549609, 188660, 143724, -38970, 108229, -324162, -411510, -414848, -372907, -340030, -268783, -505687, -334502, -396281, -356065, -430221, -423003, -365635, -69521, -108138, -230061, -150803, -250440, -99228, -128670, -462020, -395623, 34981, -368320, -485980, -389520, -97770, 159603, 264837, 324088, 280611, 440170, 501142, 237194]
8659B37194n64036p7109O83462L08154m60484l53535k4724K40706l06851j62219
8649d79442j55608m01800L74696P98530J22230J80284l3690q8263l46433k40169
8639b69665J36905K65242J4342Q1140J64240m75198m50609J18812L43366j95004
8629b66429l48122J76897M27448j66803K54913M71646O31693m54618o60288p9990
8619a3653j40427k64330J82261k443R1295n1788K50673J86643k02625n1557J7693
8608A742j82833k08568L53237j3177k46574l23394J697M01840K9855J07641J39525
8597F0991n1775l86087l2976J16016K85900J86269r7994l33848j02631q1595j27493
8586e65223J22322l976M9815J02068M30052l3742l35827j46921K18263L25636
$$ y = [237194, -326842, -403951, 279511, 587665, 127181, -226354, -251078, -10372, -317223, -479442, -635050, -1036850, -662154, 136376, 258606, 438890, 405200, 316937, -29496, -269665, -132760, 132482, 146824, 227964, 392204, -82994, -533603, -414791, -71425, -266429, -614551, -437654, -10206, -177009, 77904, 549550, 1181243, 726625, 66337, -13653, -154080, -418410, -236149, -238592, -147297, -199085, 51588, 238231, 35606, -15951, 1742, -181091, -389659, -36422, -49599, -296173, -619567, -617870, -216030, -186175, -78534, 60991, 9216, -376871, -409847, -293831, -7931, 178338, 80344, -253504, -356135, -437730, -565223, -442901, -446877, -397062, -294994, 135058, 101316, -234511, -381432, -163169, 162467]
8576A62467J87625j46712j72976J93306k65485K68285L97193j79491O8434k947
8566E09699l17925j2371J43117o4313J56791J84824k90146m47318j90072K6669
8556c01045J20327J889K85155K5527K36778P6680l86292p857p648L73738M08694
8545H25946p5421k13472m81141o11467K64148P06902j81953m5730K9348L17311
8535E34471L04315J39347J22182N20620J40660J87094m67984p80717m77595L99907
8525F22300j40785l64984j39769R5240K46886N02824N6343l45819k70861j92348
8515F9027M35025J20506n4752K3451j01233k97499j98829k3027J73098J95516
8505C41283j42916j78513K00232N64852j73404m47123p6179J71545J5176J21083
$$ y = [162467, 350092, 203380, 30404, 223710, -41775, 226510, 623703, 444212, 512646, 509699, 191774, 179403, 322520, 258207, 414998, 599822, 309676, -137642, -327714, -301045, -180718, -178829, 106326, 131853, 368631, 445311, 59019, 51162, 43514, 417252, 825946, 750525, 537053, 55912, -555555, -291407, 415495, 233542, 187812, 217160, 534471, 838786, 978133, 1100315, 1620935, 1761595, 1948689, 1480705, 699988, 222393, 622300, 481515, 116531, -23238, 72002, 318888, 821712, 878055, 532236, 261375, 69027, 504052, 624558, 569806, 593257, 492024, 194525, -4304, -27331, 145767, 341283, 198367, 19854, 220086, 784938, 611534, 164411, 88232, 259777, 274953, 396036]
8495C96036j74552k45804j48793N36745K66489K69518O33139N75451K29150M29001
8485B766380O19131L97892r78549p61317n13844l27454j72328L342l93370k50340
8475C89543N4004k4553J67638K48549k15872k57850j02730j0074K79190l15882
8465B11963k48545l38419N5565K73113K91415J65231n821m59043k20241j61618
8455d36400L1160M8302j42146J50072M32857L71416q1477K49048j59951l80989
8445H1892M34689P32472R9258o2081M40596R2473k89854l16163l24203j69341
8435G19738m0495m55575k70845K93677M72255K45714J08142j15190l86289m21470
8425A49662m33774L16483J1644m44643j37785M95347M65131O5392k04881L95403
$$ y = [396036, 221484, -24320, -173113, 363632, 630121, 899639, 1532778, 2108229, 2337379, 2766380, 3385511, 3783403, 2804854, 2043537, 1529693, 1202239, 1029911, 1033253, 639883, 389543, 443547, 418994, 586632, 835181, 619309, 361459, 258729, 248655, 527845, 211963, -36582, -375001, -319436, -46323, 245092, 410323, 404502, -54541, -274782, -436400, -405240, -356938, -499084, -349012, 83845, 455261, 373784, 622832, 462881, 81892, 516581, 1249053, 1348311, 1286230, 1726826, 1819299, 1529445, 1213282, 889079, 719738, 679243, 223668, -47177, 246500, 718755, 964469, 1072611, 957421, 571132, 149662, -284112, 32371, 44015, -400628, -538413, -43066, 422065, 487457, 282576, 677979]
8415F77979K12298j51063K23487n35470k09075J27525l74659k4798L46138L19676
8405F12038n10763n06228P3724L27125M45945K81508J59520K0374L08043J93308
8395A404594l07149l7169j67789k67588o1564k16299K16566J36523M69046k01576
8385I67595n95286o71844N6785N10963P1875N369r4162L8343L69147J52115k09545
8374F01355j6302Q6278m2799O4979m8517j13250j4929k4804N25550j34464l29573
8363E53524l45275p9147J45391r8340L30482L78919M02603N89741K73655K60620
8353B412173M31072l85238o86235k31032j65943m89287N1005M81264j13692J52988
8343A457075K07126k9860m76596j23635m44041j82872J28231M8749n0607l31046
$$ y = [677979, 890277, 739214, 962701, 427231, 218156, 345681, -28978, -53776, 292362, 612038, 101275, -404953, -331229, -4104, 441841, 723349, 882869, 903243, 1211286, 1404594, 1097445, 1060276, 892487, 624899, 563335, 347036, 563602, 700125, 1169171, 967595, 372309, -299535, -242750, 268213, 340088, 345457, 251295, 289638, 658785, 810900, 601355, 585053, 671331, 628532, 693511, 644994, 531744, 516815, 492011, 1017561, 883097, 553524, 208249, 129102, 274493, 176153, 506635, 885554, 1288157, 1877898, 2151553, 2412173, 2843245, 2458007, 1771772, 1540740, 1374797, 885510, 936515, 1417779, 1304087, 1457075, 1664201, 1634341, 1157745, 1034110, 590069, 407197, 535428, 584177, 533570, 202524]
8333B02524l95156M77711M03602L3411j60401j11958k10110L6186L53094L51105
8323I80008M8482j06157J88628j68766j5933N3834k59662q2310k05586l48235
8313H4303K96997N31216J97219j30483k15860j07839K66639J95933L53527J64218
8303A635870L76530L96134K38790K64481P52037M04587l74361j171100p38089
8294A784879l0597m30691n88018j99949k54886J71956k68K7823J7654J61930m7184
8283F12649m5352L34859j32364m02826N64117k686k77670J56708k63062l01018
8273B43355l70674K1940L04342j91900l09244J02599K9366K25212K66731m5977
8263B75750J93890P438k53107L14007M18323J66293R6352M10488M52478j92080
$$ y = [202524, -192632, 285079, 688681, 722092, 561691, 449733, 239623, 275809, 628903, 980008, 1028490, 922333, 1110961, 942195, 926262, 980096, 720434, 638124, 432538, 84303, 381300, 912516, 1109735, 979252, 763392, 655553, 922192, 1118125, 1471652, 1635870, 2012400, 2408534, 2647324, 2911805, 3663842, 4068429, 3694068, 2522968, 1784879, 1754282, 1323591, 735573, 535624, 280738, 452694, 452426, 480249, 497903, 659833, 612649, 567297, 902156, 769792, 366966, 931083, 928397, 650727, 807435, 544373, 243355, -127319, -105379, 198963, 7063, -302181, -199582, -170216, 54996, 321727, 275750, 469640, 477078, 223971, 537978, 956301, 1122594, 1218946, 1629434, 2081912, 1889832]
8253A889832n1693N603l44465n27379P337o1131J72844J29890m3655m20586Q7794
8242H44391K06409J00826J4760k48707P9998J88551k89174n68742o6568M1071
8232C02815J48076K66545k67143k69183L42274J15570q03288R9120J80069o893
8222A07962k45445R7454L07007l39762l258j16966m14560K0716K61211J71969
8212a53672k34943l4935O71430L20057k9496k74922l57843n7030J32260m42397
8202d61491K18205J54110J6916J56879k20246m42854L07436J06883K06965l17740
8192b74937m71395m256K05858j14976J26394k0665M79868P566j7003K82486J11875
8181C10815k85206q5821J44447k36357M3690K0633j4081K09054k84094k4659K56033
$$ y = [1889832, 1838139, 1843742, 1499277, 971898, 979235, 918104, 1090948, 1220838, 1177183, 756597, 844391, 1050800, 1151626, 1166386, 917679, 997677, 1186228, 897054, 328312, 261744, 302815, 450891, 717436, 450293, 181110, 523384, 638954, -164334, -65214, 114855, 107962, -137483, -40029, 266978, -72784, -76042, -193008, -607568, -586852, -325641, -153672, -388615, -423550, 247880, 567937, 538441, 263519, -94324, -151354, -19094, -461491, -243286, -89176, -72260, 84619, -135627, -578481, -271045, -164162, 42803, -274937, -746332, -750588, -544730, -659706, -533312, -553977, -74109, -66543, -83546, 198940, 310815, 25609, -60212, 84235, -152122, -108432, -87799, -101880, 107174, -176920, -201579, 54454]
8170E4454J35261N5410R672j60011l66613j35897k2342M3361k61853j95520R0381
8159g53697K70583K19250J76765M81070o3766k05027J8599R0583L3459j04294
8149A63525P0193j08337m24843J56534m8029N1696l75855l80500M49845L85694
8139f0077j15079l15310l9244J03854K13201L52725J68400J63892O6386O7650
8129F06398k00854l76575j97712J58713j7775J05976J23270P4545Q7769k81140
8119H2615k04595m78725j04980M35737K7140l1263K61474k57018q1817M02203
8109E0771L3542j91577M5242j48780k22751l31883K18748J52405j96135m6118
8099f36536k60088m13950L81523L98500K80164O3482L90578K76368L853k15341
$$ y = [54454, 189715, 245125, 254797, 94786, -271827, -407724, -430066, -386705, -648558, -844078, -753697, -483114, -263864, -87099, 393971, 330205, 125178, 143777, 234360, 267819, 163525, 233718, 125381, -299462, -142928, -190957, -139261, -515116, -895616, -445771, -60077, -175156, -490466, -529710, -425856, -212655, 140070, 308470, 472362, 538748, 606398, 405544, 28969, -168743, -10030, -27805, 78171, 201441, 275986, 363755, 82615, -121980, -600705, -705685, -269948, -242808, -274071, -12597, -269615, -351432, 50771, 84313, -107264, -62022, -210802, -433553, -765436, -546688, -394283, -590418, -636536, -896624, -1310574, -929051, -530551, -250387, -186905, 203673, 480041, 483894, 268553]
8089B68553k48160l01177K32459J10141l50590m7117M3882K53468k71149j09859
8079d19549k27216k851K68368L55867J56846K57133j5356l23207m24085O4350
8069c09700q9357j53000L23396J71172O9547N8905j07543K49726K7634R0449J16527
8058D47756k23526l97824k11022j61887L7807j33143L67745J01667K58892j05509
8048a9044l11002J87698M84444J00368J19151m94789j83519o7002j04290l4265
8038c22250j08998j6362O26912N29688K26345n42252j34959j30754k59144m95262
8028f27036J69542K51215K98495J98424l06497M0671O6790k02528j52251k48086
8018e11261K88781J46643k83733j6510L2980r344n0854K61103L87643k47208J13588
$$ y = [268553, 20393, -280784, -48325, 61816, -288774, -335891, -292009, -38541, -309690, -419549, -646765, -649616, -381248, -25381, 131465, 388598, 373242, 50035, -374050, -309700, -399057, -552057, -228661, -57489, 12058, 70963, -36580, 213146, 240780, 331229, 447756, 224230, -173594, -384616, -546503, -508696, -641839, -274094, -172427, 86465, -19044, -330046, -142348, 342096, 442464, 561615, 66826, -116693, -183695, -287985, -322250, -431248, -447610, 179302, 708990, 935335, 393083, 258124, 127370, -131774, -627036, -457494, -206279, 92216, 290640, -15857, 24814, 91604, -110924, -263175, -511261, -222480, -75837, -359570, -376080, -343100, -352444, -403298, -142195, 245448, -1760, 111828]
8007A11828j74555J46284k18856k97746j57096k05352q1515J61700k6657k45653
7997i87618L80266O62240K78093J61107L79759j15152m20242j37188l84681K27895
7987D4479j19907l3901J30019N05149K34941J42811j17427m73281j26371K600
7977A89112j11707J13302L31815m16569P3418L02022K30517l78299n35824J49771
7967e2442K03864Q4692K61687l31713k24516m07981j52351L48839J78196N6714
7957c5011j5466K6380j00804n2252k27837o2892k75052J26711L62159J24813L12100
7946A82849O3522J39267M8516l95214k73826M66446M45075N2558j13341r4509
7936E21343n04278l7901O6684j07120k89320J58441J81460K99084m7478M09806
$$ y = [111828, -62727, 83557, -135299, -433045, -590141, -795493, -877008, -715308, -741965, -987618, -607352, 54888, 332981, 494088, 873847, 758695, 338453, 201265, -183416, 44479, -75428, -109329, 20690, 525839, 760780, 903591, 786164, 312883, 186512, 189112, 77405, 190707, 522522, 105953, 179371, 481393, 711910, 333611, -202213, -52442, 151422, 236114, 497801, 166088, -58428, -466409, -618760, -269921, -91725, -35011, -50477, -24097, -124901, -177153, -404990, -467882, -742934, -616223, -254064, -129251, 182849, 246371, 385638, 434154, 38940, -234886, 231560, 676635, 729193, 615852, 521343, 17065, -20836, 45848, -61272, -350592, -192151, -10691, 288393, 240915, 650721]
7926F50721K81047l59907J98194r6431J55606j84538k39014n46467o196q6420
7916b33405J08878k02854p5978K43893r60l48282M37584J26696n30082P11K04076
7905b69723J04129k61956l35128K26341R8731j00222m21651k69602L80859M46419
7895d01803J17271K90479J70621l67392n62314q1330J39350M66515J26019k26250
7885c28834l75330k54147j60750N35401O13654J91610l59411k70162M2214L09093
7875e6662k85283k08450k33293m2781N92747K79315j85622P8704K40386j56579
7865B2482K0670L14021q8455N6479K87422j93033P6132L23635j85104K35178P6267
7854I45694l47030j84012m3972k33171K82455j51665k45810k51483o987J11650
$$ y = [650721, 931768, 571861, 770055, 673624, 829230, 644692, 405678, -140789, -146985, -233405, -124527, -327381, -403359, -159466, -160426, -508708, -71124, 55572, -474510, -473799, -269723, -165594, -427550, -762678, -536337, -437606, -537828, -959479, -1229081, -848222, -401803, -284532, 5947, 176568, -190824, -753138, -834468, -695118, -228603, -102584, -328834, -704164, -958311, -1119061, -583660, 29994, 221604, -137807, -407969, -365755, -56662, -341945, -550395, -783688, -826469, -233722, 45593, -140029, -61325, 179061, 22482, 43152, 357173, 268718, 325197, 612619, 419586, 495718, 819353, 634249, 869427, 945694, 598664, 414652, 370680, 137509, 419964, 268299, 22489, -228994, -235981, -124331]
7844a24331J495J19751J56570J90659q9329l68424k12492L1511L61699j01118
7834c4009j76054j29737l35982J39782J5157k03726L63728J65291N9469k32907
7824c68988J99220L84248j21651L11548J33881m361k30333j90933l42333L92551
7814A62849Q44281l27638p11061j73164l12577n58969j11166J40787L68893L24351
7804c53414j45023k55616j52444R9668K60219O5329L143J84462k45971M05029
7794a34618N43698m56071n36756N9440N8129L6903P0903j01992N9135j35287R6251
7783d40265L96950M11280K24433k93435n39942P4929M37746L98o17121j71913
7773e16940m39055O5937O7190J52257k7426L1530K68028J0430K12898l00273m12138
$$ y = [-124331, -122836, -3085, 153485, 344144, 254815, -113609, -326101, -294590, 67109, -34009, -210063, -339800, -675782, -536000, -520843, -724569, -360841, -195550, -136081, -368988, -169768, 214480, 92829, 404377, 538258, 533897, 303564, 112631, -229702, 162849, 1007130, 679492, -31569, -204733, -517310, -1076279, -1187445, -1046658, -677765, -353414, -498437, -754053, -906497, -806829, -546610, -481281, -478138, -293676, -539647, -134618, 409080, -46991, -583747, -524307, -466178, -429275, -358372, -460364, -401229, -536516, -440265, -43315, 367965, 592398, 298963, -240979, -166050, 271696, 272094, -345027, -516940, -955995, -890058, -822868, -670611, -698037, -666507, -398479, -388049, -175151, -475424, -887562]
7762h87562J69336j11528K06940M52907N0431l9457K47739k4512l93274L21774
7752g206l35976k66155K17063L22382L66709l05482m894k81351n1559n3349m3573
7741d43391J15429N5075L06930J90905j63376O2861m39009k5905m4446q7656M89747
7730A7164M18337q2339m70319m9726J13441r4852R68K58934J54206m43365m92560
7719f70111J4358L44671J7477K68527J20625k06473q8652L56996K3153j73845
7709F726L9197K13681J61499l42777p25347L2599L1362K4704O79404O48282k62723
7698E06607k6423m2477j07867K6606K73023j25793k78120l11943j84787K18824
7688e2350K74491j57830L7934P8579k21568l39140j4535K22579N9116m0559k05408
$$ y = [-887562, -718226, -829754, -622814, -169907, -119476, -158933, 88806, 64294, -328980, -7206, -343182, -609337, -392274, -69892, 296817, -8665, -13559, -294910, -346469, -399818, -443391, -327962, -272887, 34043, 224948, 61572, 124433, -314576, -340481, -384927, -472583, 17164, 435501, 353162, -117157, -166883, -53442, -148294, -147326, 111608, 265814, -177551, -670111, -655753, -311082, -293605, -25078, 95547, -110926, -199578, 157418, 180571, 6726, 45923, 259604, 421103, 78326, -647021, -614422, -583060, -558356, 121048, 769330, 506607, 480184, 437707, 329840, 356446, 629469, 503676, 225556, -86387, -271174, -52350, 222141, 64311, 102245, 180824, -40744, -379884, -394419, -171840, -112724, -153283, -358691]
7677c58691o1348J88528j08576K46557O2688J69580l84960K07721J26365l92025
7667c04161l73455l3243L43249J86226Q0975l58296K70208L05708N8365l03352
7657a27776J0674Q6378K3332L08626Q2176m12794K6349K35915j24476O7344n87923
7646d12175Q2486M63459M7788k66271k05601J74332k75614L34995M9052J21151
7636A13602J05881j13956j64831k334r8971k09365O4106M7046P195o10774k14036
7625a076437O58581K36528k76361j09320M8622m16596P8115K03675M41868J72031
7615c9294L20661L06626J0232k75381o8416K9992k37673j24493k31572J96186
7605a13132J42209K4606m18454l46953Q1222N18852M02437j2199l45824M00108
$$ y = [-358691, -420039, -231511, -340087, -93530, -30842, 138738, -246222, -38501, 87864, -304161, -677616, -710859, -367610, -181384, -100409, -458705, -188497, 117211, 175576, -127776, -117102, -30724, -7392, 301234, 383410, -29384, -3035, 232880, 108404, 175748, -412175, -329689, 133770, 181558, -84713, -290314, -115982, -391596, -56601, -7549, 113602, 219483, 105527, -59304, -61638, -160609, -369974, -305868, -258822, -251627, -862401, -1076437, -417856, -181328, -457689, -567009, -518387, -934983, -856868, -653193, -211325, -39294, 281367, 587993, 598225, 322844, 254428, 284420, 46747, -77746, -309318, -113132, 29077, 53683, -364771, -711724, -630502, -111650, 290787, 278588, -67236, 332872]
7595C32872L31711l10498k59775k71865l3340r7955j70589k94596K18246O33040
7585G7251J00418q4335j84459j54370k44639o34925q3688L15219j37285j52691
7575a183504J35749M51859L33467J14553L09822J49759M9032n4538l86537n32890
7565f13228m4999K7333j6519K52970J25306l42733L67549J76241J18217j4670
7555C5467m808J41107j61073l6710j91740l53253K13279L587k95599K29551j03031
7544e23223l07410j46027n05599K51213M54125k53147J27174M35534O62846J27332
7534C22818o37873j15234M73002J34785j82742j47810r1412J4339r8101P38965
7524D10737O19962k57221k73684m18384j9572M13212j84678n090k26982J73130
$$ y = [332872, 664583, 354085, 94310, -177555, -210895, -308850, -479439, -774035, -555789, 77251, 177669, 93334, -91125, -245495, -490134, -1125059, -1208747, -893528, -1030813, -1183504, -1047755, -595896, -262429, -147876, 161946, 311705, 360737, 306199, -80338, -613228, -658227, -630894, -647413, -394443, -269137, -611870, -244321, -68080, 50137, 35467, 30659, 171766, 10693, -26017, -217757, -571010, -357731, -354144, -649743, -420192, -523223, -830633, -976660, -1482259, -1231046, -776921, -1030068, -902894, -467360, 195486, 322818, -315055, -430289, 42713, 177498, -5244, -153054, -244466, -230127, -328228, 410737, 1030699, 773478, 499794, 81410, 61838, 475050, 290372, 285282, 58300, 231430]
7514B31430j12267k10683j22805j7313K97192J64773J12995k75816j99593j54972
7504b87059J56304l26176k38658K57863j53110J81193J9273j06019J47611o4705
7494d13483M73483K8961J56889l814k48140k60368J815j49188q15J30791K726
7483b81143L3485M3642J62462l25102l03741l80051J09815L15645j47251K31736
7473e40503N42853N20654k1693k23636n42157j01437M23327P8414J16631J76046
7463D28499P092o20071m58459L31479K40054J88584Q9277n5542M0705j26660q1754
7452a6796l17425J46629J32838l61498J04991L20820j58130k0786k61691L16707
7442a14341K68144J42897j53517m1112K0700j00470l29827K92235l96191J84288
$$ y = [231430, 119163, -91520, -214325, -231638, 65554, 230327, 343322, 67506, -132087, -287059, -130755, -456931, -695589, -437726, -590836, -409643, -390370, -496389, -348778, -413483, 60000, 88961, 245850, 242036, -6104, -266472, -264657, -413845, -414660, -283869, -281143, -247658, -204016, -41554, -366656, -670397, -1050448, -940633, -624988, -772239, -540503, 2350, 523004, 501311, 277675, -264482, -365919, 57408, 135822, 252453, 428499, 435591, -184480, -642939, -311460, -71406, 117178, 206455, 150913, 191618, 64958, -16796, -334221, -187592, -54754, -416252, -311261, 9559, -148571, -169357, -431048, -114341, 153803, 296700, 143183, 102071, 122771, 22301, -307526, -15291, -411482, -227194]
7432b27194N99971l9640k25806l24916j26836M64532j94791k12220k82841j2677
7422e82418R6267J42036K24272j04885j68900n7225k26604K95573K47077k47612
7412c82419j59336L53951J63857J94596l6996J84479J37813J02934j37628j4604
7402D06647j28558k49270j79815O078m1375m4055R4342K74320j46029n28832J95934
7391c40613J23263L6908L36240k48654m03854K11810j3273Q752M93550O5789l25540
7380e5622P980k22542Q8694N6373l28016l29568K18624J76218j1694j89523N0545
7369e38531K43425K58801L30350N15772q2379r31728K7418Q1577K02091K3751
7359A30547k754m9389j13395J83196K11711k74261l60342j77115K27392K84213
$$ y = [-227194, 372777, 333137, 107331, -217585, -344421, 120111, -74680, -286900, -569741, -582418, -486151, -344115, -119843, -224728, -393628, -450853, -677457, -381884, -134807, -382419, -541755, -187804, -23947, 170649, 133653, 318132, 455945, 558879, 421251, 406647, 278089, 28819, -150996, -144918, -186293, -230348, -136006, 138314, -7715, -536547, -340613, -217350, -180442, 155798, -92856, -496710, -284900, -298173, -289421, 204129, 269918, -55622, -47642, -270184, -181490, -125117, -453133, -782701, -564077, -387859, -399553, -589076, -538531, -295106, -36305, 294045, 809817, 727438, -204290, -176872, -95295, 106796, 130547, 127793, 78404, -34991, 148205, 359916, 85655, -274687, -451802, -224410, 59803]
7349E9803J69698j56258m76773j76981k4194M4752K73399L26812J70970J963J12354
7338C25545k85432k19088j59308j44473Q7342k87180j86094K50882j30389J23350
7328f24845m49045J52598M60825Q7464K90765J2340K67432K69029K57048k2098
7318G01513k81141R0940k03447m5530k08751j27174k48516n77249Q4070K9769
7308g85516L57149J72474j66395k0178j54168J29133j79969j53972L42982n4334
7298e12794L9623j37757M25529M53520J4910l092K81503j73925l95354k99540
7288c07377J71626J21119j18188J10033j04247j02647M99994P38438M5196l26665
7278G27282p56408k4357j78238k64774L57112k29013l28433N23474N33224j58269
$$ y = [59803, 229501, 73243, -403530, -580511, -604705, -559953, -286554, 40258, 211228, 213191, 325545, 40113, -178975, -338283, -482756, -395414, -682594, -868688, -617806, -748195, -624845, -1073890, -921292, -460467, -373003, -82238, -69898, 197534, 466563, 723611, 701513, 420372, 511312, 307865, 262335, 53584, -73590, -322106, -899355, -815285, -785516, -428367, -255893, -422288, -442466, -596634, -467501, -647470, -801442, -458460, -512794, -473171, -610928, -185399, 268121, 283031, 279939, 561442, 387517, -7837, -307377, -135751, -14632, -132820, -22787, -127034, -229681, 270313, 1008751, 1053947, 727282, -29126, -53483, -231721, -496495, -139383, -368396, -696829, -173355, 359869, 201600]
7268B01600n96901K17781M05292j18583J93440j87876m00494l63571O0034J86719
7258d02559O7399M7707J0542J58484J90006k0719J82639L0788Q9013K91490n7244
7247E87546l73021l98968J47443J87569o12756j96071L47365L09093m8629M945
7237d5484l90278j07669O98538K30887J40768p6028k17891j03568m58984K3649
7227c06060J57509l6462L9133q1670J5132N7102K98682k59606j39742r2965j59824
7216e08771J79889J41834N82656j62056k40301J95898M48645k73068j25333k75847
7206c6454k26992L1095j65528O3316L77719K03315k41296L24443J62383m31712
7196F0289j19019J67677k47370l11294Q8695j72753k86557J99950K55895L06839
$$ y = [201600, -395301, -177520, 227772, 109189, 302629, 114753, -285741, -649312, -589278, -402559, -335160, -287453, -276911, -118427, 71579, 50860, 233499, 264287, 353300, 644790, 587546, 214525, -184443, -37000, 150569, -462187, -658258, -310893, -1800, -50429, -45484, -435762, -543431, 155107, 385994, 526762, 450734, 232843, 129275, -329709, -306060, -148551, -185013, -145880, -227550, -212418, -155316, 143366, -116240, -255982, -348947, -508771, -328882, -187048, 395608, 233552, -6749, 189149, 637794, 364726, 239393, -36454, -263446, -232351, -397879, -334563, 43156, 246471, 5175, 329618, 492001, 60289, -58730, 108947, -138423, -449717, -361022, -533775, -820332, -620382, -364487, -57648]
7186e7648K15322k25501k32822m29352R5528R4083k31287J57762L7805L5845P5999
7175d64266j49190M92946J42849j10276L5094m7330L0312K00718k24029k27015
7165c20187P7611j46052O503M58323K05134j99655j25155L05884J83564j00219
7155C45751p328l10185l47128k11725q0093L20048N3763J47591P2067N7759j66697
7144a26177m1554k56058M72172K28682j8635k22535j9369j08057L0321n16K33159
7133A71433J01556L23746K96746j17133o38493j57557j89331J57101j13814q213
7123a73959J47155k50589l05890K39621O47434L90582K14353m60459m13888l39650
7113c05290j59250M4206n0770J8389L2563K86643O0461P85644M4279o37787J22933
$$ y = [-57648, 157674, -67827, -300649, -730001, -634473, -540390, -771677, -613915, -576110, -540265, -464266, -613456, -120510, 22339, -87937, -52843, -100173, -69861, 130857, -93172, -320187, -242576, -388628, -382125, 76198, 281332, 81677, -43478, 262406, 445970, 345751, 338423, 28238, -318890, -530615, -610708, -290660, -236897, -89306, -17239, 40520, -126177, -167731, -423789, 48383, 277065, 258430, 35895, 16526, -91531, -61210, -61726, 171433, 272989, 596735, 893481, 776348, 137855, -19702, -209033, -51932, -165746, -173959, -26804, -277393, -583283, -343662, 303772, 694354, 908707, 448248, 34360, -305290, -464540, -420334, -471104, -452715, -420152, -133509, -73048, 712596, 756875, 119088, 242021]
7102B42021J46487m05458J35451J19108O1043J7256j69257j7537N9300m11868
7092b23454J37298p9479p9930n9530o5634J4072L44842K6035r4765J54462m47396
7081c73479n6006J49106r1754J92649J38524r1414m3334R999K44663n0385K18917
7070B47486m13546m07339J05330Q5099L91049N73056J67522n35275p18440l43296
7060h48354K62135K35618N2787l1090k37383K13598J63867m4538M0041M2546j45058
7049b95831n8429n3065M31340Q7570J00005P1528P0209l13818L8920J34724k35950
7038b2797k88757j08860K43976O7710M8048R5566m45933p7564M45007J77902k03156
7027f8858j15778r020r2241m0408M1454L14914J192m41364r2764J70882Q418K36213
$$ y = [242021, 388508, -16950, 118501, 237609, 298652, 315908, 146651, 129114, 188414, -223454, -86156, -165635, -245565, -305095, -370729, -356657, -11815, 14220, -80545, 73917, -373479, -429485, -280379, -372133, -179484, -40960, -132374, -175708, -165709, 78954, 28569, 247486, -166060, -573399, -468069, -382970, 8079, 581135, 748657, 213382, -505058, -848354, -586219, -350601, -297814, -328904, -566287, -352689, -188822, -233360, -193319, -150773, -295831, -354260, -407325, 24015, 111585, 211590, 283118, 353327, 39509, 78429, 213153, -22797, -311554, -420414, -176438, -108728, -60680, 34886, -411047, -488611, -43604, 134298, -68858, -184636, -193656, -285897, -326305, -284851, 30063, 31255, -410109, -502873, -331991, -323573, -87360]
7015h7360j58226o7019j49316L78302J40863K37568J6660N65829K41745n88292
7005E30754l80268r1447r1377n2198K89074J19379k69787k71629J40363k6045
6995a03181l41185j26058L88649N85107k21150m98079L0587L71168Q0007j8390
6985A47475M37896J36221k13960J279k68641J10632Q2292j88242Q6615l09606
6975B1961N7422j55468j42056p6762j03875k0721J09025l0996l48459J63441N84638
6964E8150J13310j41452k75959j40390J31638K23969j15533n1957k46432k00659
6954f45315Q0197J75347J48893r3801l07310j63686J92661j0210J81876J07055
6944c34293J82676N86421k5669j06052l34335J94442l13849K77214K51569j04321
$$ y = [-87360, -245586, -312605, -461921, -83619, 57244, 294812, 311472, 877301, 1119046, 530754, 150486, 59039, -32338, -84536, 204538, 323917, 54130, -217499, -77136, -103181, -444366, -570424, -181775, 403332, 182182, -315897, -285310, 85858, 165865, 147475, 585371, 721592, 507632, 508911, 240270, 350902, 433194, 244952, 331567, 21961, 79383, -76085, -218141, -294903, -398778, -419499, -310474, -341470, -689929, -526488, 58150, 171460, 30008, -245951, -386341, -254703, -30734, -146267, -198224, -444656, -645315, -565118, -389771, -240878, -334679, -641989, -805675, -613014, -623224, -441348, -334293, -151617, 434804, 409135, 303083, -31252, 163190, -150659, 126555, 378124, 273803]
6934B73803l67101m71407k09012L855P411K47225M9774N1443j80032q0651L43195
6923c31497J34259L63084m9311j60683J70935L06530K11400m23303k45984m7050
6913g1620L75485J2562m09226r889k7157k30628q1795L39727K37433j14157j72400
6902a51665K90369j57816O8691N37196L78780J55926m79461n18630J21428k92409
6892d7591n47442M07878j2331j78334J90682l06415j92097L0116J24988k59283
6882g89829J62344L12369M0230k49104n9722N2752K63817J32866J29464J86904
6872A82091N4663l12021k80591o8889j02441K09482L66536K60952l61285j26252
6862a77755J84548m4163l03560L498k09720j41702N98311J91896j75261J27565
$$ y = [273803, -93298, -564705, -773717, -769862, -762451, -515226, -465452, -414009, -594041, -674692, -331497, -197238, 165846, 116535, -44148, 126787, 433317, 644717, 221414, -24570, -71620, 303865, 316427, -92799, -102688, -129845, -360473, -442268, -102541, 134892, 20735, -151665, 138704, -19112, 49579, 586775, 965555, 1121481, 642020, 123390, 244818, -47591, -595033, -187155, -199486, -377820, -187138, -493553, -685650, -655534, -530546, -789829, -627485, -315116, -274886, -523990, -583712, -530960, -267143, -134277, -4813, 182091, 236754, -75267, -355858, -424747, -527188, -317706, 48830, 309782, -51503, -177755, 6793, -37370, -340930, -337432, -547152, -688854, -90543, 101353, -73908, 53657]
6852E3657M1605L29817K35996k71266M7831l51181n26716j07902k5638Q2981J37524
6841c53292k41396O5709N81745K41230k78117N5617L22177K2933l52371k58254
6831a94019j14721K90786K93394l56601R6832l35926k56694K13926O93988K44945
6821E75910k77201m57122l52849J71155J5777P383R5419L14853J96967m3299j51417
6810I5576q1076J15832n24554k8387k7303J92091j42944n8565Q7416R1495P05985
6799D25566j58080l18252j39630N4806j74894M0982L09252L56424L17036K5128
6789G38338o62340l78019j92749J04318L84374L9570o68700k34115N98553K2842
6779b47928L52740K12776j06851m3995J24141k67749j50851j30183k3985k44751
$$ y = [53657, 95262, 425079, 661075, 389809, 437640, 86459, -440257, -548159, -573797, -490816, -353292, -594688, -528979, 52766, 293996, 15879, 71496, 393673, 416606, 64235, -194019, -308740, -17954, 275440, -81161, 15671, -320255, -576949, -363023, 330965, 575910, 298709, -158413, -511262, -340107, -324330, -316947, -221528, 93325, 290292, 246993, 95576, 14500, 130332, -394222, -422609, -449912, -257821, -400765, -459330, -371914, -280419, 425566, 267486, -50766, -190396, -135590, -310484, -269502, 39750, 396174, 713210, 738338, 75998, -302021, -494770, -390452, -6078, 33492, -635208, -869323, -270770, -247928, 104812, 317588, 210737, 166742, 290883, 23134, -127717, -257900, -281885, -526636]
6769e26636J65743N05738M3643j132L8691j25711l13970n28828L09427q7908N448
6758e15495M79971N94182J42751n29861k37002J99988n3027k404j67727o5057
6748a53681J11575J65570K68615p6255K62944k6644K156Q578k80210k93624n4045
6737f5021L0594l20957n61471j9525L56251L07478j66315j43697K57870J56436
6727a68357R6161k25412k34224j6272R6102K06434K71280J17608K36696j98335
6717A81681j9532j08916O6630L2202m0076o9775J3099M5361n41759n36512n2199
6706a029796M37439P73596J61739k70225r4739L34763Q4726l03242L7797L78986
6696E11044j7961k80335Q340J23471L03568K23437P4310k89763l62889L4641K75789
$$ y = [-526636, -360893, 144845, 188488, 187356, 226047, 100336, -213634, -742462, -433035, -520943, -515495, -35524, 558658, 701409, 171548, -65454, 134534, 81507, 79103, -88624, -153681, -42106, 123464, 392079, 315824, 578768, 552124, 554280, 562858, 282648, -10976, -65021, -34427, -355384, -916855, -936380, -580129, -272651, -438966, -582663, -324793, -168357, -72196, -297608, -531832, -548104, -452002, -245568, 25712, 143320, 380016, 181681, 162149, 53233, 119863, 152065, 111989, 42214, 55313, 100674, -441085, -977597, -1029796, -592357, 181239, 342978, 72753, -21986, 312777, 397503, 94261, 132058, 511044, 493083, 212748, 221088, 344559, 648127, 871564, 945874, 656111, 293222, 327863, 603652]
6685F03652J76975l00327k01487q2663L07801l4995R3832q0992k54685M213L50151
6674E81475J37498J47039l57884l3990l05538k80475n642K26817n4211k45897
6664a90808j12846M85212K58755p0021j80819m48263J70355N3161Q1521J12637
6654A58884J87858n79151j42337L67646J58022J03077r3067O4690k28428m77942
6644d80748j82017j37694M16289K59484L21100k62805k25696j41527q6076j35033
6634f54723J37740N20770L43681M25559j69571k76001j71089o9806p0645J77043
6624A92958J29684k01927r0000J21051M3902k9417J37707O2625p3211k73361L54622
6613C74633J90496k65825m1516J98844J46576l05470r2432j466N5271Q9343k68070
$$ y = [603652, 780627, 480300, 278813, 196150, 503951, 468956, 562788, 481796, 227111, 231324, 581475, 718973, 866012, 508128, 474138, 168600, -111875, -117517, 109300, 55089, -190808, -303654, 181558, 440313, 370292, 189473, -258790, -88435, -35274, 46247, 158884, 346742, -232409, -374746, -7100, 150922, 253999, 160932, 225622, -2806, -480748, -662765, -800459, -384170, -124686, 196414, -66391, -292087, -433614, -519690, -654723, -516983, 3787, 347468, 773027, 603456, 327455, 156366, 86560, 15915, 192958, 322642, 120715, 30715, 151766, 195668, 166251, 303958, 366583, 293372, 20011, 374633, 565129, 299304, 257788, 456632, 603208, 297738, 205306, 203840, 259111, 348454, 80384]
6602H0384k50785M9239K91449r5181j64335p8123L93550M6801m45960N8150l31853
6591d46664P9727L94210Q9327K90334j26293K2641j9763j78563n7009l377K0002
6580F4572j48852J07752J15147Q3711k35163j63590Q5036k84981k72691j61609
6570h10668j86742O28266M48859L09326J17803K2696m88719j21400K0604m38338
6560d98313L3230P8558R1855K31480k15519l15719m57891L41702p3761j48035
6550i32413J70281M72764O87075J74731l31306j04920K44023J22563k76769k25565
6540D64L72241J09952J92165j4668r7714L13808J76759R5099j78417k36459l54510
6529C78720l56964j87841n03187J52192J30897K42314j05949K2666j56727K10470
$$ y = [80384, -170401, -121162, 170287, 75106, -89229, -167352, 226198, 272999, -172961, -114811, -446664, -366937, 27273, 116600, 406934, 280641, 303282, 283519, 104956, 47947, 44570, 64572, -84280, 23472, 138619, 222330, -12833, -176423, -91387, -376368, -649059, -810668, -997410, -369144, 79715, 389041, 506844, 529540, 40821, -80579, -59975, -498313, -465083, -386525, -294670, -63190, -278709, -594428, -1052319, -710617, -784378, -932413, -762132, -289368, 397707, 572438, 241132, 136212, 380235, 502798, 226029, 464, 372705, 482657, 674822, 660154, 562440, 876248, 1053007, 1148106, 969689, 733230, 378720, 21756, -166085, -669272, -517080, -386183, -143869, -249818, -227152, -383879, -173409]
6519a73409N50313J67598n74174k29579P8921K12886J7178j34218k23987k86498
6509e94969L61689M40634N7445n88192l0371J14384J20287R6678J05484J53352
6499B36421J12256m11466k46008J63822K27211R8220k77337J9976J27597m4411
6489F281k49025j05538o7178R6175O9052K07383M47290J79131l44864m18252k11874
6478c91419J49621M89156k50275l95667m8594N72440J88995K21801r5841O167
6468D46384k80222m60140N5361q5905q772K57027K42964m03892k42713K61015
6458b18893L27955J70878k63814k16747l4291j76692o7176j1074J27336L55999
6448f519j28655j48031k00987K17836J21884l65817K6044L77390p1786k26164
$$ y = [-173409, 376904, 544502, -29672, -259251, -180330, 32556, 49734, -84484, -308471, -594969, -233280, 207354, 264799, -323393, -353764, -239380, -119093, -22415, 83069, 236421, 348677, -62789, -308797, -144975, 82236, 180456, -96881, -76905, 50692, 6281, -242744, -348282, -415460, -319285, -250233, -42850, 404440, 583571, 238707, -179545, -391419, -241798, 247358, -2917, -398584, -447178, 125262, 314257, 536058, 440217, 446384, 166162, -293978, -238617, -324522, -333294, -76267, 166697, -237195, -479908, -218893, 109062, 279940, 16126, -200621, -234912, -411604, -478780, -489854, -362518, -6519, -135174, -283205, -484192, -266356, -144472, -510289, -484245, -106855, -178641, -404805]
6438d04805l5490M88687O42150R4679l53295l99380L4069l85089j85835K02282
6428c02027J02181j51536k93706L21686J87769j21449J06035j2647L34517R1135
6418B61958j20209k55505n20772k02289M12670N31594L86124k1526j41907j37196
6408A92942m22422l28132J43808N01147L645j06008K2096l81550j42816k8672
6398e45962o067R8609O3226j58687N90842L7103l13773L99K01486K0394o70653
6387f83083n8464J03080J52077L07171M84995L97803j14210j78892m63456l48661
6377d01640L06888K20655k00463K94577K54306l48776N7770J88926Q751k9990
6367C51004m58306k04237j54033M5358L04023k90930J08000q0821K43639J4931
$$ y = [-404805, -440295, 48392, 690542, 785221, 431926, 32546, 66615, -318474, -504309, -302027, -199846, -351382, -645088, -323402, -135633, -257082, -151047, -163694, 170823, 261958, 141749, -113756, -634528, -836817, -424147, 107447, 493571, 472045, 330138, 192942, -229480, -557612, -413804, 87343, 90988, -15020, 7076, -374474, -517290, -545962, -552029, -453420, -390194, -548881, 41961, 79064, -234709, -234310, -32824, -12430, -683083, -741547, -638467, -486390, -179219, 305776, 703579, 589369, 410477, -52979, -401640, -94752, 125903, -74560, 220017, 474323, 125547, 183317, 372243, 380994, 351004, -107302, -311539, -465572, -420214, -116191, -407121, -299121, -379942, -136303, -121372]
6357a21372k72484K78339J34499m02610l46274r0546J29505L78129Q9865L81045
6347A58096J17034j748j2263K28998r7015n85316p5546j72328L1244j86785J55234
6336d40395M44280k1592j16680L7357j89086r9206j84602k55072r65M8997M06133
6325c70831K23867k53523p1872N30367K04002j23267l12729J86940k0652J70249
6315A62551L72542j23161q2989k05140m362K05633j82426R2420L74532j25982
6305D83618j80321j75961j87044q9439J40691L3252m0648j74065j57508P4624
6295b72801K78578j14863m35827p3911K99206L11197k91380L36875M22158k56040
6285B03192j82973k35039k26559M51180J49961j08948r2537j39980l74180M3647
$$ y = [-121372, -393856, -115517, 18982, -383628, -729902, -820448, -690943, -312814, -222949, 158096, 275130, 273382, 261119, 490117, 393102, -192214, -267760, -440088, -408844, -595629, -440395, 3885, -17707, -134387, -97030, -286116, -385322, -569924, -824996, -825961, -776964, -370831, -146964, -400487, -472359, 58008, 262010, 138743, -173986, 12954, -7698, 162551, 535093, 411932, 328943, 123803, 119441, 325074, 142648, 235068, 609600, 483618, 303297, 127336, -59708, -149147, -8456, 24796, -15852, -189917, -347425, -272801, 5777, -109086, -544913, -618824, -319618, -8421, -299801, 37074, 459232, 203192, 20219, -214820, -441379, 9801, 159762, 50814, -41723, -181703, -555883, -512236]
6275e12236M14346k98978J33837r954L8276l7302L45914M89046p7113m29490L2355
6264H8701J70561j84356L16264M16912j48002m55421j77722P8517J46227k30750
6254B0931n3250j74739M0044q4076J41670k6485q799K2369L20830K09111m3574
6243C64032k18073J5050k02259j50088O2221J79042J91204k51007M4793K40915
6233B75830r0759J81789q6114l44438J80356J18799j95706k00435K32360Q4155
6223A55837K18649k96241k79664m97665K35953O19167j51120p6075j58654l84260
6213f14073L29548P0465J23298L36800J99198o0549j06305L9199R7177J50790
6203E65548k9719j70606o09660k19921L89738J85825q5000K03213J63767j42388
$$ y = [-512236, -97890, -396868, -263031, -272985, -234709, -272011, 73903, 562949, 485836, 56346, 88701, 259262, 74906, 391170, 808082, 660080, 204659, 26937, 105454, 251681, 20931, -32319, -207058, -167014, -251090, -109420, -135905, -144704, -122335, 198495, 407606, 364032, 145959, 161009, -41250, -191338, -129117, 49925, 241129, -9878, 34915, 275830, 185071, 366860, 280746, -63692, 116664, 235463, 39757, -160678, 71682, 155837, 374486, 78245, -201419, -699084, -463131, 156036, 4916, -71159, -229813, -614073, -284525, -214060, -90762, 246038, 445236, 384687, 278382, 317581, 414758, 565548, 535829, 365223, -244437, -464358, -74620, 111205, 26205, 229418, 393185, 250797]
6193B50797k14255p8524k42154J33376j83779K46764J209j17593l47924J7474
6183e34609K23622j29388n03776j89533j63306K83854M80135K7027k76294J31464
6173f50804M2949q9049j34882L40312J1382K37967N68915P7681j08584K36405
6163E32292j91221l36137n63420j04225M87276k2032m1048j57767j95736L05908
6153b86110L14962K21184J23533l62323j26463k3069L68537L48386n90366j46836
6143a58565j05366l20258J86401N27156N63369Q2881l91029k85893n23132J63416
6133b61020J4431j0136P605j79514j15883R6539J90511l08443j02742P52601k8519
6122E5430o17077k70681J28720L43608J19993k5034p9421j58838L68029l5256
$$ y = [250797, 36542, -41982, -284136, -150760, -334539, -87775, -86566, -204159, -552083, -534609, -310987, -440375, -944151, -1133684, -1296990, -1013136, -533001, -505974, -782268, -650804, -607855, -696904, -831786, -491474, -480092, -242125, 326790, 404471, 295887, 532292, 341071, 4934, -558486, -662711, -175435, -197467, -238515, -396282, -592018, -286110, 28852, 250036, 373569, 11246, -115217, -138286, 230251, 578637, -11729, -158565, -263931, -584189, -397788, 129368, 692737, 775618, 384589, 98696, -424436, -261020, -246589, -256725, -249120, -428634, -544517, -447978, -257467, -565910, -668652, 83949, 55430, -561647, -832328, -703608, -360000, -240007, -265041, -344462, -503300, -135271, -170527]
6112a70527j58530j16708p5790k38810K06181K24219J25874K21548o5440K2633
6102b5350j33151j40465l32452k53522J7777J03341K75178J46813M23953O9799
6092A51921m16980Q7347m11920j23102j47418n0517L36177N75223J2439K82886
6082B96056K39224k2950m02270J27943K63831M34070n1402m39197m15136N3250
6072H3419l01702K568J92581L3122j07715L69072j43628l43658j50764Q3151k15459
6061d99013k5103k68359O7098J92897O8299R8566q0608j71106N31182M00897j35580
6050A79170J27732K44758N4855j94711R4050k31468l80210R921k6306K15828k90281
6039a96662J48893k9150j59391M8532J30085J16712K36529J39481K442k01403
$$ y = [-170527, -329057, -445765, -521555, -760365, -554184, -329965, -204091, 17457, -47983, -25350, -158501, -298966, -631418, -884940, -867163, -763822, -488644, -341831, 82122, 151921, -265059, -177712, -589632, -712734, -860152, -910669, -574492, 731, 13170, 296056, 535280, 512330, 110060, 238003, 501834, 935904, 884502, 445305, 30169, 83419, -218283, -215715, -23134, 9988, -97727, 271345, 127717, -215941, -366705, -283554, -499013, -524116, -792475, -725377, -532480, -464181, -365615, -446223, -617329, -86147, 314750, 179170, 306902, 551660, 606515, 411804, 505854, 274386, -105824, -95903, -122209, 93619, -196662, -47769, -76919, -236310, -187778, -57693, 59019, 295548, 435029, 437471, 236068]
6029B36068m18636M9210J88211J59999j40245j71311k17887K32461P9166q622
6019a1586q5619l60244M03609L84081m5589J59688k27607j35587n88442m8947
6009e56243r6089k8355K44978K10708L04845J37533P4372k07105r1767R8057j87981
5998i7047k04579L22842K56347j17373k24042j96515O5147J67830K63506j14318
5988A21798J74256J01212K75683J6811m74178j48872J87872m52340j92622j53524
5978e43904K14129K60603J72025k16804m64550O9725N19793N77690J07328k00099
5968D95936M0399j51179J81096J89343k5673l49633l12786m23485j86757o4755
5958f07494j51577N5051J0045K64119L5991n0082J2499J14629K13461N0126m89477
$$ y = [236068, -182568, -133358, 54853, 214852, 74607, -96704, -314591, -82130, -2964, -11586, -97205, -457449, -53840, 330241, 284652, 444340, 216733, 81146, -507296, -556243, -652332, -680687, -435709, -225001, 79844, 217377, 291749, 84644, -7123, 90934, -97047, -301626, 21216, 277563, 160190, -63852, -260367, -195220, -27390, 236116, 121798, 296054, 397266, 672949, 689760, 215582, 66710, 254582, -197758, -390380, -543904, -329775, -69172, 102853, -113951, -578501, -508776, 11017, 588707, 696035, 495936, 536335, 385156, 566252, 755595, 729922, 380289, 67503, -355982, -542739, -607494, -759071, -704020, -693975, -429856, -393865, -443947, -431448, -316819, -103358, -53232, -542709]
5947e42709k9184k7502j7754O2894O11631l44168q7569l3688j42759J94893j37327
5936d93242j0720M25246R9142j5569J07965N0704l00634j32280K85579L33124
5926C49315l81089l53139k63023j52248L98253L90452K11529m207J07882o986
5916B96739k7280p9938M6439l24465J47405K31095j40156k0427K0900l58330J98191
5905i827j49526j79389K62277J36309k35545K5336M08474P6145l57901l70757
5895c94404p200J06544N7540k57096j95846k85649J66569P25017O02053K33933
5885G51461q9365l87853k81221j25916L42201j55729K64635J49130m6696q3587
5875C37060m70708k64758k07488K00381K05458l64861l15515K3770M44720K52761
$$ y = [-542709, -571893, -599395, -617149, -554255, 57376, -286792, -374361, -408049, -550808, -355915, -493242, -503962, -78716, 20426, 4857, 112822, 163526, -137108, -269388, 16191, 349315, -31774, -384913, -647936, -800184, -401931, -11479, 200050, 195843, 303725, 296739, 269459, 189521, 235960, -88505, 58900, 289995, 149839, 129412, 150312, -208018, -9827, -159353, -338742, -76465, 59844, -175701, -150365, 258109, 334254, -23647, -394404, -401604, -295060, -237520, -494616, -690462, -976111, -809542, -84525, 517528, 751461, 662096, 274243, -6978, -132894, 209307, 53578, 318213, 467343, 420647, 337060, -133648, -398406, -605894, -405513, -200055, -564916, -880431, -856661, -411941, -159180]
5865a59180K24126k15404l75148k83794L2377J08841j33083J03339K89000J05886
5855c03040j86865L57218N01377j90047j1862M17382k32529l42626K74256L41697
5845F24961l8126p69691P8952K95290L28879o8165k08774j07623k20811j05320
5835a90428q9351j84443j34928k0022l89370L45731K41247m2536J3719M90535
5825D0154L76521l06110m90560j62146L05890P5502J81499J5406j35667j57497
5815b57008k61954k2241L93670k6655R4728L9647K19999P3494k8364L5269L8616
5804B99201l95037j72333L37646J26616k02814k72342L2963Q4349n84536r3902
5794h40189M25543N18726Q2381l35433l8041L41897J75399j87599o2168K4122
$$ y = [-159180, 64946, -150458, -525606, -809400, -777023, -668182, -801265, -697926, -408926, -303040, -489905, -132687, 368690, 178643, 166781, 584163, 351634, 9008, 283264, 624961, 586835, -182856, -103904, 191386, 520265, 452100, 243326, 135703, -85108, -190428, -279779, -464222, -599150, -619172, -1008542, -662811, -421564, -464100, -450381, 40154, 416675, 110565, -379995, -542141, -236251, -160749, 20750, 36156, -99511, -257008, -518962, -541203, -147533, -174188, -79460, -39813, 180186, 253680, 225316, 260585, 299201, -95836, -268169, 69477, 196093, -6721, -279063, -246100, -161751, -746287, -840189, -414646, 104080, 186461, -148972, -187013, 154884, 330283, 142684, 80516, 104638]
5784A04638n42109J80509k11179K67067K41950O0529o7040J14741K78975K68241
5774F96322l46102r6749j60955J30486k7521r4358K22875j22811m5674o16164
5764d60651L17012L14851R4556n07654r0808N32642J12159j91721m10387p395
5754b97396j21618k6118k63126M167Q1422k11662j54542J25413M80232N63758
5744A80530k6294k82949j83655Q0381J09952p3585N9449m3746J04036p3905R3808
5733e5978m4828K1348J88459l45704K60258M30819k68187L9121O3048j61849l66206
5722b39699j82708K45506M46022K55359m20846j97739J47248J00180K17q6088
5712F7452L6965L17391l9635J06231J01761k59509j45658l3531k1617m6406K59049
$$ y = [104638, -437471, -256962, -468141, -201074, 40876, 101405, 34365, 149106, 428081, 696322, 350220, 253471, 92516, 223002, 195481, 101123, 323998, 201187, 155513, -460651, -143639, 171212, 265768, -241886, -332694, 199948, 312107, 120386, -290001, -297396, -419014, -445132, -708258, -704091, -622669, -834331, -988873, -863460, -383228, 180530, 154236, -128713, -312368, -231987, -122035, -195620, -136171, -179917, -75881, -149786, -55978, -100806, -79458, 109001, -236703, 23555, 454374, 186187, 225308, 288356, 126507, -239699, -422407, -176901, 269121, 524480, 103634, -94105, 53143, 153323, 153540, 67452, 104417, 421808, 382173, 488404, 590165, 330656, 184998, 151467, 129850, 83444, 342493]
5701C42493K03815J59739j48757m20579m27451l44971L59608J99927l553j49142
5691b28871k97650J05745M87653j20511j52429K4958l5344P4075N0790j64883
5681b56467L74830J85631m40529l80514N5591o9628k17510l90080m6774J34188
5671a051262J33748K64189K12273L81169L85282j08532p4641m44012j88648L19786
5661a70648L37677l44872j75561j98307J12969M46304J29570j57212m035j73690
5651a97805j91551j53315M2862K06606L14872k10510l62900l11616J53059M6636
5641f63662K34334L16521J63493n8399l51747k12050J55721K48180J80057k91488
5631b79040m92201m8814L62280K51478l2321p7805K24304M78699N2667k93686
$$ y = [342493, 546308, 706047, 557290, 136711, -290740, -635711, -276103, -76176, -79729, -228871, -526521, -420776, 66877, -53634, -206063, -181105, -216449, -142374, -91584, -256467, 118363, 303994, -136535, -517049, -461458, -531086, -748596, -1138676, -1185450, -1051262, -917514, -653325, -441052, -59883, 325399, 216867, 142226, -301786, -490434, -170648, 167029, -177843, -353404, -551711, -438742, 7562, 137132, -20080, -24115, -197805, -389356, -542671, -499809, -293203, 21669, -188841, -551741, -863357, -710298, -663662, -429328, -112807, 50686, -7713, -359460, -571510, -415789, -167609, 12448, -279040, -771241, -820055, -457775, -206297, -238618, -316423, -92119, 386580, 439247, 145561]
5621A45561k99030r7428n4282N32035L7140K76503K43242l14411o2470p7311K43096
5610E72645p2606j94115l74822k5211k8048k56344r6689J49787K5638J00360k63959
$$ y = [145561, -153469, -250897, -305179, 226856, 263996, 540499, 783741, 469330, 406860, 329549, 572645, 500039, 305924, -68898, -94109, -122157, -378501, -475190, -325403, -299765, -199405, -463364]
$$ [...]
##END NTUPLES=NMR SPECTRUM
##END=
