##TITLE=Analysis number 316626
Compound Code cc 48716
Book Reference 433/193/5
Project Code adrs
Chemist Name victoriam
##JCAMPDX= 6.0         $$ Bruker NMR JCAMP-DX V2.0
##DATA TYPE= NMR SPECTRUM
##DATA CLASS= NTUPLES
##ORIGIN= Bruker BioSpin GmbH
##OWNER= nmr
$$ XWIN-NMR		Version 3.5
$$ Fri Jan 20 14:49:43 2006 GMT Standard Time (UT+0h)  MAYBRIDGE\nmr@NMR_250MHZ
##.OBSERVE FREQUENCY= 250.131544655141
##.OBSERVE NUCLEUS= ^1H
##.ACQUISITION MODE= SIMULTANEOUS (DQD)
##.ACQUISITION SCHEME= undefined
##.AVERAGES= 16
##.DIGITISER RES= 18
##SPECTROMETER/DATA SYSTEM= dpx250
##.PULSE SEQUENCE= zg30
##.SOLVENT NAME= CDCl3
##.SHIFT REFERENCE= (INTERNAL, CDCl3, 0, 16.522)
##AUDIT TRAIL= $$ (NUMBER, WHEN, WHO, WHERE, WHAT)
$$ ##TITLE= Audit trail, XWIN-NMR		Version 3.5
$$ ##JCAMPDX= 5.01
$$ ##ORIGIN= Bruker BioSpin GmbH
$$ ##OWNER= nmr
$$ C:\u/data/dgb/nmr/ADRS/15060/pdata/1/auditp.txt
$$ ##AUDIT TRAIL=  $$ (NUMBER, WHEN, WHO, WHERE, WHAT)
(   1,<2006-01-20 14:48:53.54 +000>,<MAYBRIDGE\nmr>,<NMR_250MHZ>,
      <created by zg, POWCHK disabled, PULCHK disabled
       configuration hash MD5:
       62 19 C7 07 E1 42 D1 B7 37 6C 3D D0 77 39 F9 E6
       data hash MD5: 64K
       F2 BD 89 76 C5 AA 74 A1 C5 8B B4 BA 10 39 65 00>)
(   2,<2006-01-20 14:49:15.43 +000>,<MAYBRIDGE\nmr>,<NMR_250MHZ>,
      <Start of raw data processing
       ef LB = 0.3 FT_mod = 6 PKNL = 1 SI = 32K 
       data hash MD5: 32K
       1A 8A 9E 52 16 DC 2B 21 D2 E1 4C 5A 14 83 EB 02>)
(   3,<2006-01-20 14:49:21.27 +000>,<MAYBRIDGE\nmr>,<NMR_250MHZ>,
      <apk 
       data hash MD5: 32K
       3D B4 F1 10 07 D8 89 AD C7 6D 2F CD 14 7D A7 9F>)
(   4,<2006-01-20 14:49:23.45 +000>,<MAYBRIDGE\nmr>,<NMR_250MHZ>,
      <abs ABSG = 5 
       data hash MD5: 32K
       CC F1 1A BC A8 5D 7B 61 C4 5C 2A 26 AD 11 4C 5D>)
$$ ##END=
$$ 
$$ hash MD5
$$ 22 E4 2B 27 D6 C0 45 DF 06 A8 1B 43 99 BC 54 1D
##$RELAX= 
##$RELAX= 
##$RELAX= 
##$RELAX= 
##$RELAX= 
##$RELAX= 
##$RELAX= 
$$ Bruker specific parameters
$$ --------------------------
##$DU= <C:\u>
##$EXPNO= 15060
##$NAME= <ADRS>
##$PROCNO= 1
##$TYPE= <nmr>
##$USER= <dgb>
##$AMP= (0..31)
100 100 100 100 100 100 100 100 100 100 100 100 100 100 100 100 100 100 
100 100 100 100 100 100 100 100 100 100 100 100 100 100 
##$AQSEQ= 0
##$AQ_mod= 3
##$AUNM= <au_zg>
##$AUTOPOS= <3 >
##$BF1= 250.13
##$BF2= 250.13
##$BF3= 250.13
##$BF4= 250.13
##$BF5= 500.13
##$BF6= 500.13
##$BF7= 500.13
##$BF8= 500.13
##$BYTORDA= 1
##$CFDGTYP= 0
##$CFRGTYP= 5
##$CHEMSTR= <none>
##$CNST= (0..31)
1 1 145 1 1 1 1 1 1 1 1 1 1 1 1 1 1 1 1 1 1 1 1 1 1 1 1 1 1 1 1 1 
##$CPDPRG= <>
##$CPDPRG1= <>
##$CPDPRG2= <>
##$CPDPRG3= <>
##$CPDPRG4= <mlev>
##$CPDPRG5= <mlev>
##$CPDPRG6= <mlev>
##$CPDPRG7= <mlev>
##$CPDPRG8= <mlev>
##$CPDPRGB= <>
##$CPDPRGT= <>
##$D= (0..31)
0 1 0 0 0 0 0 0 0 0.06 0 0 0 0 0 0 0.0002 0 0 0 0 0 0 0 0 0 0 0 0 0 0 
0 
##$DATE= 1137768530
##$DBL= (0..7)
120 120 120 120 120 120 120 120 
##$DBP= (0..7)
150 150 150 150 150 150 150 150 
##$DBP07= 0
##$DBPNAM0= <>
$$ [...]
##$SUBNAM6= <"">
##$SUBNAM7= <"">
##$SUBNAM8= <"">
##$SUBNAM9= <"">
##$SW= 20.6930455092707
##$SWIBOX= (0..15)
0 0 3 0 0 0 0 0 0 0 0 0 0 0 0 0 
##$SW_h= 5175.983436853
##$TD= 65536
##$TD0= 1
##$TE= 294.16
##$TE2= 300
##$TE3= 300
##$TEG= 300
##$TL= (0..7)
0 120 120 120 120 120 120 120 
##$TP= (0..7)
150 150 150 150 150 150 150 150 
##$TP07= 0
##$TPNAME0= <>
##$TPNAME1= <>
##$TPNAME2= <>
##$TPNAME3= <>
##$TPNAME4= <>
##$TPNAME5= <>
##$TPNAME6= <>
##$TPNAME7= <>
##$TPOAL= (0..7)
0.5 0.5 0.5 0.5 0.5 0.5 0.5 0.5 
##$TPOFFS= (0..7)
0 0 0 0 0 0 0 0 
##$TUNHIN= 0
##$TUNHOUT= 0
##$TUNXOUT= 0
##$USERA1= <user>
##$USERA2= <user>
##$USERA3= <user>
##$USERA4= <user>
##$USERA5= <user>
##$V9= 5
##$VALIST= <valist>
##$VCLIST= <CCCCCCCCCCCCCCC>
##$VD= 0
##$VDLIST= <DDDDDDDDDDDDDDD>
##$VPLIST= <PPPPPPPPPPPPPPP>
##$VTLIST= <TTTTTTTTTTTTTTT>
##$WBST= 1024
##$WBSW= 4
##$XGAIN= (0..3)
0 0 0 0 
##$XL= 0
##$YL= 0
##$YMAX_a= 579806
##$YMIN_a= -596189
##$ZGOPTNS= <>
##$ZL1= 120
##$ZL2= 120
##$ZL3= 120
##$ZL4= 120
##$ABSF1= 16.522
##$ABSF2= -4.171173
##$ABSG= 5
##$ABSL= 3
##$ALPHA= 0
##$AQORDER= 0
##$ASSFAC= 0
##$ASSFACI= 0
##$ASSFACX= 0
##$ASSWID= 0
##$AUNMP= <proc_1d>
##$AZFE= 0.1
##$AZFW= 0.1
##$BCFW= 0
##$BC_mod= 0
##$BYTORDP= 0
##$COROFFS= 0
##$CY= 12.5
##$DATMOD= 1
##$DC= 0
##$DFILT= <>
##$DTYPP= 0
##$F1P= 14.0000005364418
##$F2P= -0.99999901652339
##$FCOR= 0.5
##$FTSIZE= 32768
##$FT_mod= 6
##$GAMMA= 0
##$GB= 0
##$INTBC= 1
##$INTSCL= 1
##$ISEN= 128
##$LB= 0.3
##$LEV0= 0
##$LPBIN= 0
##$MAXI= 10000
##$MC2= 0
##$MEAN= 0
##$ME_mod= 0
##$MI= 0
##$NCOEF= 0
##$NC_proc= -1
##$NLEV= 6
##$NOISF1= 0
##$NOISF2= 0
##$NSP= 0
##$NTH_PI= 0
##$NZP= 0
##$OFFSET= 16.522
##$PC= 1
##$PHC0= 243.759
##$PHC1= 4.216718
##$PH_mod= 1
##$PKNL= yes
##$PPARMOD= 0
##$PSCAL= 4
##$PSIGN= 0
##$REVERSE= no
##$SF= 250.13
##$SI= 32768
##$SIGF1= 0
##$SIGF2= 0
##$SINO= 400
##$SIOLD= 32768
##$SREGLST= <1H.CDCl3>
##$SSB= 0
##$STSI= 32768
##$STSR= 0
##$SW_p= 5175.98343685301
##$SYMM= 0
##$S_DEV= 0
##$TDeff= 65536
##$TDoff= 0
##$TI= <Analysis number 999999
Compound Code 99
Book Reference 9
Project Code 9>
##$TILT= no
##$TM1= 0
##$TM2= 0
##$TOPLEV= 0
##$USERP1= <user>
##$USERP2= <user>
##$USERP3= <user>
##$USERP4= <user>
##$USERP5= <user>
##$WDW= 1
##$XDIM= 32768
##$YMAX_p= 333495062
##$YMIN_p= -41670
$$ End of Bruker specific parameters
$$ ---------------------------------
##NTUPLES= NMR SPECTRUM
##VAR_NAME=  FREQUENCY,     SPECTRUM/REAL,   SPECTRUM/IMAG
##SYMBOL=    X,             R,               I
##VAR_TYPE=  INDEPENDENT,   DEPENDENT,       DEPENDENT
##VAR_FORM=  AFFN,          ASDF,            ASDF
##VAR_DIM=   32768,         32768,           32768
##UNITS=     HZ,            ARBITRARY UNITS, ARBITRARY UNITS
##FACTOR=    0.157963299565203, 1,           1
##FIRST=     4132.6476996994, 0,             0
##LAST=      -1043.33573715361, 0,           0
##MIN=       -1043.33573715361, -41670,      0
##MAX=       4132.6476996994, 333495062,     0
$$ Real data points
##PAGE= N=1
##DATA TABLE= (X++(R..R)), XYDATA
$$ [...]
##PAGE= N=2
##DATA TABLE= (X++(I..I)), XYDATA
24428B77734J621L97K703Q25j397j0753j016J2721r315k461M360k307P116p458
24414B72770J95Q148o21n012q600j7001R771J4092J0857l980l062K693M469L979
24400B88698j3842r357M803J1127M683k387L12P841j883m54l528J224Q489n199
24386B90527p546J06M894R29M259L580L3n942l117l578j85n083M705m149j4974
24371B64459J945P187R898J3497o864L202m494p323l92m929Q791O49n340n73M175
24356B83888j1799k598J0021L396j539k075M466Q451K478j4336q031l470L964
24343B72816L067k363j2238J78J0753J424l323O502J4072m616l710m398n34o541
24329B71089L9J972K165Q391J426l323o391K499M899P58O040k600K55L135J4529
$$ plain form
24428 277734 279355 279752 282455 283280 281883 271130 270114 282835 273520 271059 275419 273112 280228 272770
24414 272770 272965 281113 280492 275480 266880 249879 259650 273742 284599 280619 277557 280250 284719 288698
24400 288698 274856 265499 270302 281429 286112 283725 284037 291878 289995 289541 286013 287237 295726 290527
24386 290527 282981 283087 287981 288910 293169 296749 296782 290840 287723 284145 283960 278877 283582 279433 264459
24371 264459 266404 273591 283489 296986 290122 293324 288830 281507 281115 276186 284977 285626 280286 279713 283888
24356 283888 272089 269491 279512 282908 281369 279294 283760 292211 294689 280353 272322 268852 272816
24343 272816 275883 273520 261282 261460 272213 273637 270314 276816 290888 286272 282562 278164 277630 271089
24329 271089 271128 273100 275265 283656 285082 281759 275368 277867 282766 283524 289564 286964 287219 290354 304883
24314C04883q449j3492K029K118n354r243O606n37J818l411k700l17O044n267
24300B74728P909O166j618n333m282m407N991R036N530o010j368r749L679L290
24286B83562K935O542M64L576q47o696J3903N34j2123j2209j513r012M795O519
24272B80430L836J912R724j103J79Q850k861j3377j1975q149P638J5503K767o401
24258B86973o072j886n07N505J2109L10r753j0093p893n457l10Q330J9043N126
24244B95425o248q610N135J2648O96r487M077k887K11R046j444l102m395m867
24230B86198O651L535o400m237L287l242P807J0545M154o178l752k996j0936P878
24216B92314Q728l470l279j70K35L297N877p145j7638j723P509J1860J0101l240
$$ plain form
24314 304883 296434 282942 284971 287089 281735 272492 279098 278561 280379 276968 274268 273951 279995 274728
24300 274728 282637 288803 287185 281852 277570 273163 279154 288190 293720 287710 286342 276593 280272 283562
24286 283562 286497 293039 293503 297079 296232 289536 303439 303973 291850 279641 278128 269116 273911 280430
24272 280430 284266 286178 295902 294799 294978 303828 300967 287590 275615 267466 275104 290607 293374 286973
24258 286973 280901 279015 278508 284013 296122 296432 286679 276586 268693 263236 262926 271256 290299 295425
24244 295425 289177 280567 285702 298350 299046 289559 293636 290749 290960 300006 298562 295460 291065 286198
24230 286198 292849 296384 289984 285747 289034 285792 293599 304144 308298 302120 298368 295372 284436 292314
24216 292314 301042 297572 294293 294123 294358 297655 303532 296387 278749 277026 284535 296395 306496 303256
24202C03256k266K325p900l768M179J0738N722J037o861J255k634p270l570j080
24188B93163n227K082J5519m718j3592n943P532J4000O06p135l313j4080j5667
24175B63227l618R866J5512k475m977k158Q962P425J0817k797o318q43l944l523
24161B85156n266o033J3323J1199m089M29N048M05o917n422P03Q102M916M809
24147C06363n786p180m91j973J023k351n426l468k171R152K60j1821k551J111
24133B74691M779j795M451J2852o33m90M404j4980o248J088O807N154L713N489
24119B99282O641J654j4121K258l21j0496M389P67m746m232P678P943Q001j803
24105C02894R75j2808J194P250J93j1769q439J1496N050l885k883n443o557P695
$$ plain form
24202 303256 300990 303315 295415 291647 295826 306564 312286 313323 306462 307717 305083 297813 294243 293163
24188 293163 287936 290018 305537 300819 287227 281284 288816 302816 303422 296287 292974 278894 263227
24175 263227 259609 269475 284987 282512 277535 275377 284339 291764 302581 299784 293466 292623 288679 285156
24161 285156 279890 273857 287180 298379 294290 294719 299767 300172 293255 287833 288536 296638 301554 306363
24147 306363 300577 293397 292906 290933 291956 289605 284179 280711 278540 287692 287952 276131 273580 274691
24133 274691 279470 277675 282126 294978 294345 293855 298259 283279 277031 278119 284926 290080 293793 299282
24119 299282 305923 307577 293456 295714 295393 284897 289286 290053 285307 281075 288753 296696 304697 302894
24105 302894 303869 291061 292255 299505 299698 287929 279490 290986 296036 292151 289268 283825 277268 284963
24091B84963P414R801J022k690q180r211J898j848N663J339M842n685j4083j10
24077B75135J601M386j830M698J4167n693l879J8215N871j5695K519P858N470
24064C12823r168q432j759l253k065O403Q989l299p318j566O467p85j995N13M315
24049B99870P642O352n60q870j4032m301O685Q601k987j095P555K758P380o264
24035C08734k097n408l699r429o635n34Q311r78N014M700N547N609l017q985K884
24020C00017J899j1470L548R229l420j260M462r346j1671j558k878K06L770J2435
24006B93963P713M893p585m269R549P759o449p644m038n427N921O308j95J172
23992C01671j283O127M628J356M709j1761k0096m20K898M139k77j729M937J636
$$ plain form
24091 284963 292377 302178 303200 300510 292330 283119 285017 283169 288832 290171 295013 289328 275245 275135
24077 275135 276736 281122 279292 283990 298157 292464 288585 306800 312671 296976 299495 307353 312823
24064 312823 303655 295223 293464 290211 288146 294549 303538 300239 292921 291355 297822 297037 295042 295555 299870
24049 299870 307512 313864 313304 304434 290402 286101 292786 301387 298400 297305 304860 307618 314998 308734
24035 308734 306637 301229 297530 288101 281466 280932 289243 288265 293279 297979 303526 309135 306118 297133 300017
24020 300017 301916 290446 293994 303223 299803 298543 303005 293659 281988 280430 277552 277758 281528 293963
24006 293963 301676 306569 298984 294715 304264 312023 305574 297930 293892 288465 294386 300694 300499 301671
23992 301671 300388 306515 311143 312499 317208 305447 285351 284931 287829 291968 291691 289962 294899 296535
23978B96535J138R43n676j0002L275J0774o46J569j439l584N835P788K13L352
23964C10075p313L202P223P161L767J135m709q788r737k819K479k398N657N402
23950C10337k22k893m391q795n367l283l921o334q90P335J0480L597N376m498
23936B96531q605r885J932J6313J132K104k380Q933Q020l572j4721r273J0707
23923B97236K648N979N940J985M805n039j9146K760K159P301j162m879O968J297
23909C08852j568l894r102N570J413J982J0980J975K305M243r367q159J871Q632
23895C15733N42J161K227j713q986p394O891J4989j4505j1976m27L449P795m299
23881C03487k543M90M086K075Q667j12o160P106R279j158m208J046N417r362j3222
$$ plain form
23978 296535 297673 298616 292940 282938 286213 296987 296341 297910 296471 292887 298722 306510 306723 310075
23964 310075 302762 305964 313187 320348 324115 325250 320541 311753 302016 299197 301676 299278 304935 310337
23950 310337 310115 307222 302831 294036 288669 285386 281465 275131 274241 281576 292056 295653 301029 296531
23936 296531 287926 278041 279973 296286 297418 299522 297142 306075 314095 310523 295802 286529 297236
23923 297236 299884 305863 311803 313788 318593 313554 294408 297168 299327 306628 305466 300587 307555 308852
23909 308852 307284 303390 294288 299858 301271 303253 314233 316208 318513 322756 313389 305230 307101 315733
23895 315733 316275 317436 319663 317950 308964 301570 308461 323450 308945 296969 296542 299991 307786 303487
23881 303487 300944 301434 305520 307595 316262 316150 309990 317096 326375 325217 321009 322055 327472 318110 304888
23866C04888q170Q188O961J2667N489r289j0407k480P250j0571j0471K277N009
23853C01341r078L734J721j847O38p390J5066M390n916q42J25P817M826L295k76
23838C17604k588J4052K778k743q986Q68j4600p255N578j312N864M261o590q184
23824B98747L922M005J497P550j974o021J594K728j705m377m239p136l063J1136
23810C02664P493J93K44o717J0528J3321k754j2728m529j467M418N1O703O366
23796C23786l448m546j62l048n408p310N404P356n211r520r640K403K2M924J7666
23781C13268p68J42N574K326O982m564p763p252l435j351R176q77p631j712J069
23766C03184O982j865m200Q06R29L524q71n834n729j167L719O143j047P591K699
$$ plain form
23866 304888 296718 304906 311867 324534 330023 320734 310327 307847 315097 304526 294055 296332 301341
23853 301341 292263 295997 297718 295871 296509 289119 304185 308575 302659 301817 301942 309759 314585 317880 317604
23838 317604 315016 329068 331846 329103 320117 320985 306385 299130 304708 303396 309260 313521 306931 298747
23824 298747 302669 306674 308171 315721 313747 307726 309320 312048 310343 305966 301727 294591 291528 302664
23810 302664 310157 310350 310594 303877 314405 327726 324972 312244 307715 306248 310666 310717 317420 323786
23796 323786 320338 315792 315630 312582 307174 299864 305268 312624 307413 297893 288253 290656 290678 295602 313268
23781 313268 312500 312642 318216 320542 327524 322960 315197 307945 304510 303159 312335 311458 303827 302115 303184
23766 303184 310166 308301 304101 304907 305836 309360 308489 302655 296926 295759 299478 305621 304574 312165 314864
23751C14864j3281r9L148m084O521l017n689J984J3155K169R19L755L004q738
23737C14611k89r875m03k876L291n73q525m437J1508J420J653n990L609J4608
23723C17732R540N125j0824k967l002M179L120J606n154n08m443n618K537l749
23709C07574j0694j974P325P296O931J1475k776n782M20j3460k872k420P774J4285
23695C23102O27j0682r143Q657J4617M739M77p533K76k82M339j2802j467L663
23681C18588m631l196L79N005R525J784L40o616j5981j0153M408Q394L80l741
23667C04485m64L376p62P516J4248O631O847k55j4108j4891n538M215M223n571
23653C09952n095J0921Q758l689o093m602N861N599M041k271j2897o968n67M897
$$ plain form
23751 314864 301583 301484 304632 300548 307069 304052 298363 300347 313502 315671 316590 320345 323349 314611
23737 314611 314322 304447 304044 301168 304459 303886 295361 290924 302432 303852 305505 299515 303124 317732
23723 317732 327272 332397 321573 318606 315604 319783 322903 324509 319355 318847 314404 308786 311323 307574
23709 307574 296880 294906 302231 309527 316458 327933 325157 319375 319795 306335 303463 301043 308817 323102
23695 323102 323729 313047 303904 312561 327178 331917 332394 324861 325137 324855 329194 316392 314925 318588
23681 318588 313957 310761 311140 316145 325670 327454 327794 321178 305197 295044 299452 307846 308226 304485
23667 304485 304021 307397 306635 314151 328399 335030 341877 341622 327514 312623 307085 311300 315523 309952
23653 309952 304857 315778 324536 320847 314754 310152 316013 321612 325653 323382 310485 303517 302950 307847
23639C07847N561q887p935M31K452P17L83J876J0153R891L271o192j7882L615
23625C05301N135m445R981P159J1739j890q214L890P811l267l530n969K349o197
23611C19853l894j231N239N359K572r683n459J632K427M732N311k092N605K891
23597C33262j776J841k509j692N093l260j411P720K473o511j742N465j2968q66
23583C23119P381m925L540r00K798j81j0589j1895l126P779M801k239J1959J89
23569C27711m757L723l513o529k044L943K947n89n618M724j0301K275N926J1460
23555C29358p89K69K344N683P53r84q700k998k571n304p63O002R874K661m975
23540C29860J363K309N962L788K535k998k858m769J1556m099n472o289j727k274
$$ plain form
23639 307847 313408 304521 296586 297017 299469 300186 300569 302445 312598 322489 325760 319568 301686 305301
23625 305301 310436 305991 315972 323131 334870 332980 324766 328656 336467 333200 329670 323701 326050 319853
23611 319853 315959 314728 319967 325326 327898 318215 312756 314388 316815 321547 326858 324766 330371 333262
23597 333262 331486 333327 330818 329126 334219 330959 329548 337268 339741 333230 331488 336953 323985 323119
23583 323119 330500 325575 329115 328215 331013 330832 320243 308348 305222 313001 317802 315563 327522 327711
23569 327711 322954 326677 323164 316635 314591 318534 321481 320892 315274 319998 309697 311972 317898 329358
23555 329358 328569 328838 331182 336865 337618 336634 327934 324936 322365 317061 316298 322300 332174 334835 329860
23540 329860 331223 333532 339494 343282 345817 342819 339961 335192 346748 342649 337177 330888 329161 326887
23526C26887O13J106n09R218M541M417J556o420L874P194o06o005o938l011m245
23511C31672o805l033K414M75M977p2m678J596K228K262N963m001j3281O835L653
23496C30205N04J626Q235R8O559p539j2160o860N905Q449j779j2735J025l546
23482C17987J1023j198j2739J196K951l590R793J2060m932n165j2026k577R07
23469C13690R710J0813p9j2892N629Q003L657m645L641j357L507Q803J422n530
23455C44372l732q330j1234N65P211J1330N652j0589P320r007j2003M782J1729
23442C38066L433j3020K04M826k1O668j959J866k884O459n001k798J1101J3997
23428C60937p81O20L419o587j1467j2913n434j821K80n5N738j266O296J0426K804
$$ plain form
23526 326887 327500 328606 328097 337315 341856 346273 347829 341409 345283 352477 351871 345866 338928 335917 331672
23511 331672 324867 321834 324248 324723 329700 329628 324950 326546 328774 331036 336999 332998 319717 326552 330205
23496 330205 330709 332335 340570 340668 347227 339688 327528 320668 326573 335022 333243 320508 321533 317987
23482 317987 329010 327812 315073 316269 319220 315630 325423 337483 332551 327386 315360 312783 313690
23469 313690 323400 334213 334134 321242 326871 334874 338531 333886 337527 336170 339677 348480 349902 344372
23455 344372 340640 332310 321076 321641 328852 340182 345834 335245 342565 333558 321555 326337 338066
23442 338066 341499 328479 328683 333509 333488 340156 338197 340063 337179 343638 338637 335839 346940 360937
23428 360937 360156 360776 364195 357608 346141 333228 327794 325973 326253 326198 331936 330670 336966 347392 350196
23413C50196o346M101M749n858L361N934j1544j2150l035J0214J685m105m899
23400C32303l148o467M912P425N879k973j1999M228J5168r050q572k53J3196M367
23386C45016j0488j2201n619M506j546n549Q019P341L246l403j25k467l854N813
23372C28689Q596N535j2767J415R153l80q769p3J1674J265J998J1163p893j6700
23358C32906r639N760N227J4311N375j7239n994K995j3222k448L643p109J865
23345C16431J5790n941j054n419J1335J8099n741j6851j2167M653J4599J6100
23333C49834K463P604j101k648J144l438j3494j4303K438Q870K056l747J061N245
23319C41984N891j5433l113J0122m200M671j885k303P976l829O792k396j231R539
$$ plain form
23413 350196 343850 347951 352700 346842 350203 356137 344593 332443 329408 339622 341307 337202 332303
23400 332303 329155 322688 327600 335025 340904 337931 325932 330160 345328 336278 327706 327453 340649 345016
23386 345016 334528 322327 316708 321214 319668 314119 322138 329479 332725 329322 329197 326730 322876 328689
23372 328689 337285 342820 330053 331468 340621 340241 331472 331399 343073 344338 346336 357499 349606 332906
23358 332906 323267 329027 334254 348565 353940 336701 330707 333702 320480 318032 321675 314566 316431
23345 316431 332221 326280 325226 319807 331142 349241 343500 326649 314482 319135 333734 349834
23333 349834 352297 359901 358800 356152 357296 353858 340364 326061 328499 337369 339425 335678 336739 341984
23319 341984 347875 332442 329329 339451 335251 339922 338037 335734 343710 339881 346673 344277 343046 352585
23305C52585J896j374K780j2668l930J379M38Q701K955J981o316K120R63n103
23291C46407q490R356K998j54n650N82m190n759L606O340m751n720M524J6136
23277C55235L427j1092j4335k968l065O431n135j589j788K455R249J5043J0680
23264C62548r715p940m896J070Q31l264p528j66R704O613j375L432P466K553j3496
23249C45837n248J233j5029N372J2032J676p183J96J0818Q6P511q99r828l359
23235C43215J519M554M30n682j2645k440k354r794Q248K4658R960m199n967O568
23221C56071P481l949Q05n59j134J0266q6j3668l538O99N260M434l818R29M931
23206C64124Q23j0806j1889J401q321m463O818R215k441L04j011k68J040L420
$$ plain form
23305 352585 354481 353107 355887 343219 339289 340668 341106 349807 352762 354743 348427 350547 351510 346407
23291 346407 337917 347273 350271 350117 344467 345049 340859 335100 338706 345046 340295 334575 339099 355235
23277 355235 358662 347570 333235 330267 327202 333633 328498 326909 325121 327576 336825 351868 362548
23264 362548 352833 344893 339997 341067 341898 338634 331106 330940 340644 347257 345882 349314 356780 359333 345837
23249 345837 340589 341822 326793 332165 344197 345873 338690 338886 349704 349790 357301 356402 346574 343215
23235 343215 344734 349288 349718 344036 331391 328951 326597 316803 325051 349709 359669 355470 349503 356071
23221 356071 363552 359603 360408 359849 358715 368981 368895 355227 351689 352388 357648 362082 358264 359193 364124
23206 364124 364947 354141 342252 343653 335332 330869 337687 346902 344461 344765 343754 343486 344526 347946
23192C47946L541Q116M407q66n555l625Q076k169J063l644M47L799J190k604m468
23177C55654o370n416P085M652O60j925O8J626o334Q813M564j4980m080O445m489
23162C45973m375M080J2490m836o051M61R392R886j456l823m867j625O051K156
23148C63456R160j5142j134O771J689r220j4389Q409J4601Q408l888n752p474
23135C55495L795p401l923m42Q738L137j974l773R136J2294l569k863r242q538
23121C50870O201l452k276J0049P438K618k554l149J268L191O653m07M574j3462
23107C67562n509j817m833o456m848k852o799Q218M863RK43P37N817J0044j953
23092C62426j4305J289N535l319P345O442K110J236p399k999R637M27n113n670
$$ plain form
23192 347946 351487 359603 364010 363144 357589 353964 362040 359871 360934 357290 357737 361536 362726 360122 355654
23177 355654 349284 343868 350953 355605 356265 354340 354408 356034 349700 358513 363077 348097 344017 350462 345973
23162 345973 341598 345678 358168 353332 347281 347742 357134 367020 365564 361741 356874 355249 361300 363456
23148 363456 372616 357474 356340 363111 364800 355580 341191 349600 364201 372609 368721 362969 355495
23135 355495 359290 351889 347966 347524 356262 359399 357425 353652 362788 375082 371513 368650 359408 350870
23121 350870 357071 353619 351343 361392 368830 371448 368894 365745 367013 370204 376857 376450 381024 367562
23107 367562 362053 360236 355403 348947 344099 341247 334448 342666 347529 347538 347781 348518 354335 364379 362426
23092 362426 348121 349410 354945 351626 358971 365413 367523 368759 361360 358361 367998 368425 363312 357642
23078C57642j0050M170J1677R075n624j665L080l759p818M774k73j0372j25R909
23064C60641q181N797L144K678N338j1841j0763J3260J1324K128p437j1069Q430
23051C63449K906m030m93J0100J419j3049l014O333J90k11J2951J2423p015j3027
23037C68932j2364n361l055l889P202Q418m548k86N847l775j521L395L529M429
23023C66953l816m435J796l359j101J321O968l627j81M813M916n314m600O689
23009C67023M099M831l748j4813O9P912j379O144Q314m119j6411n771j211L4J438
22994C52412N069l868K85O944J2566J615r776j5502q419M193P30J2941P438M172
22980C70800O814L282Q39k251j473O773J934j407j2720j6959j3428O71o65J2026
$$ plain form
23078 357642 347592 351762 363439 372514 366890 365225 368305 364546 356728 361502 361229 350857 350732 360641
23064 360641 352460 358257 361401 364079 369417 357576 346813 360073 371397 373525 366088 355019 363449
23051 363449 366355 362325 361832 371932 373351 360302 357288 363621 363811 363600 376551 388974 381959 368932
23037 368932 356568 351207 348152 344263 351465 359883 355335 355049 360896 357121 355600 358995 362524 366953
23023 366953 363137 358702 360498 357139 356038 357359 364327 360700 360519 365332 370248 364934 360334 367023
23009 367023 371122 375953 372205 357392 357461 365373 363994 370138 378452 374333 357922 352151 350940 350974 352412
22994 352412 357481 353613 353898 360842 373408 375023 365247 349745 341326 345519 346249 359190 366628 370800
22980 370800 377614 380896 381735 379484 378011 384784 386718 385311 372591 355632 342204 342875 342210 354236
22966C54236P623l064j991K128k070j167p73l210L485J673K919N614Q869l977
22952C70295j0553J3248R25p459n580r69J468l51j999L861k367o489J0578K623
22938C67231j108J870p431j359k154m642m299N384J0748Q502J1331N667l012k28
22924C86500p367j964l803M228J2691N936o286j1353j1470m818o850J2018M416
22911C71878L209M550K902O10n547j0275n605L113J2052O24m553n492O019J634
22897C75119o841p027J183J0174J0446J259o476j3670J1496j882p016N334Q575
22884C80674R562l617q797o536j2906k32K5492M287p194n869k863L930k189j41
22870C73601q505q116j679N719q249O511K2240J1717Q096o352j9432q993l576
$$ plain form
22966 354236 361859 358795 356804 358932 356862 355695 354922 351712 355197 356870 359789 365403 374272 370295
22952 370295 359742 372990 373915 366456 360876 359907 361375 361024 359025 362886 360519 354030 364608 367231
22938 367231 366123 367993 360562 359203 357049 352407 348108 353492 364240 372742 384073 389740 386728 386500
22924 386500 379133 377169 373366 377594 390285 396221 389935 378582 367112 362294 355444 367462 371878
22911 371878 375087 379637 382539 383149 377602 367327 361722 364835 376887 377511 372958 367466 373485 375119
22897 375119 368278 361251 362434 372608 383054 384313 377837 364167 375663 373781 366765 372099 380674
22884 380674 390236 386619 377822 371286 358380 358148 383640 387927 380733 374864 372001 375931 373742 373601
22870 373601 365096 356980 355301 361020 352771 359282 381522 393239 401335 394983 375551 366558 362982
22857C62982N173R059P78m782M8N790M343k620l449N697R10o19q364M355m203
22842C75098j2553j4100J6781J1605o235M381J6489j2133r377O380J2388Q553
22830C97277L853Q22m755M107N494p274p077p752k425l374N726Q946N389J201
22816D00158l883L352l358J350q052r288p974k190L308J731L716N0J443L156O430
22801C89949k074j0018j392L790N505q701n005J2135Q871j07r175O448k24o030
22787C83972Q37J1207J1186K170j457q888j4109n382r64P76o775n494J0829r56
22773C76952j0976R091J0674P291n152m506K40k024K095Q829m128m816L596N171
22759C92337q318K095j748j911o111P796N860o8n12J513l454n777K618P704j898
$$ plain form
22857 362982 368155 377214 377992 373210 373258 379048 383391 380771 377322 383019 383929 383310 374946 379301 375098
22842 375098 362545 348445 365226 376831 370596 374977 391466 379333 369956 376336 388724 397277
22830 397277 401130 401952 397197 401304 406798 399524 392447 384695 382270 378896 384622 393568 398957 400158
22816 400158 396275 399627 396269 397619 389567 380279 372305 370115 373423 375154 378870 378920 380363 383519 389949
22801 389949 387875 377857 376465 380255 385760 377059 372054 384189 393060 392953 383778 390226 390002 383972
22787 383972 384809 396016 407202 409372 407915 399027 384918 379536 378572 379348 372573 367079 377908 376952
22773 376952 365976 375067 385741 393032 387880 383374 383614 381590 383685 392514 388386 383570 387166 392337
22759 392337 384019 386114 384366 382455 376344 384140 390000 389932 389420 390933 387479 381702 384320 392024 390126
22744C90126j690K825L125j19l806O253J207k181P039J542j7647l310K342K41
22730C85947J476p824n829K556R446O219K199J34p769o707M710O5j331J5216k76
22715C98232p359N930k347P254O017j306n444o621L934K072N979o819p684L62
22701C92200j1417m72L93K034M474O946r78J042l05j684J2019J2173K116m396
22687D14145p274o774j2017J623P807l915K265o532r138J842K910K459m630P026
22673C89797L163P075J4021J1593n922j4996j3377L209j177L118J559p882r85
22660C89196J381k781P104J65L298K388n347K503Q727p811p422k54K794M085m384
22645C93642n912N020R354p699j696J842l964N989P305R619R143k1r640q790Q074
$$ plain form
22744 390126 388436 391261 394386 394267 390461 396714 397921 395740 402779 404321 386674 383364 385706 385947
22730 385947 387423 379599 373770 376326 385772 391991 394190 394324 386555 379848 384558 384623 383292 398508 398232
22715 398232 390873 396803 394456 401710 407727 406421 400977 394356 398290 400362 406341 399522 391838 392200
22701 392200 380783 380311 380704 382738 387212 394158 393180 394222 393917 392233 404252 416425 418541 414145
22687 414145 406871 400097 388080 389703 397510 393595 395860 389328 380190 382032 384942 387401 382771 389797
22673 389797 392960 400035 414056 425649 419727 404731 391354 394563 393386 396504 398063 390181 389196
22660 389196 390577 387796 394900 395065 398363 400751 395404 397907 406634 398823 391401 391147 393941 398026 393642
22645 393642 387730 392750 402104 394405 392709 394551 390587 396576 403881 413500 422643 422622 412982 404192 412266
22630D12266K168n653j2632o612l902Q314O207m801p817O634N719R173N361J827
22616D16252k670J615J825k727P52p390j7824j895L066M366J0774m190m078L503
22602D01379P686m78l204j485o646J3077K676q724L623Q523m580p264K913n183
22588D02313j0457M649R130o377q419K261j385n544K780K600l206J2254J2720
22575D13319K650p467O28M746j194j2174m250P301K811N160m887K384N24R7M654
22560D14302K236j2116k973r94M362J271J416M769n16K282J804j1856n652r14
22546C97421L406J923n219l611M273k301K839J248K521O375L571J247k925p549
22532D03219M795J2137r02j175m277j4662L35O677k922K402J1447k791O011j001
$$ plain form
22630 412266 414434 408781 396149 389537 385635 393949 400156 395355 387538 394172 399891 409064 414425 416252
22616 416252 413582 415197 417022 414295 415047 407657 389833 387938 391004 395370 406144 401954 397876 401379
22602 401379 409065 408587 405383 403898 397252 410329 413005 404281 407904 416427 411847 404583 407496 402313
22588 402313 391856 396505 405635 399258 390839 393100 391715 386171 388951 391551 388345 400599 413319
22575 413319 415969 408502 409130 413876 412682 400508 396258 403559 406370 411530 406643 409027 409551 409648 414302
22560 414302 416538 404422 401449 400455 404817 406088 407504 412273 411757 414039 415843 403987 398335 397421
22546 397421 400827 402750 397531 393920 398193 395892 398731 399979 402500 408875 412446 413693 410768 403219
22532 403219 408014 420151 419249 418074 413797 399135 399470 406147 403225 405627 417074 414283 420294 419293
22518D19293j704R45m672n581p6L198M636O805j683J178J183n157J1126o483M575
22503D27583L015k910j0740O603J276K64n889J564j3239L239J3849M666o912r290
22489D13079k334J356J387l30N266m976o546n38L670K719j1288M589M031O164
22475D16249o331m062n114O878J3577J020m539j9250p876J914Q395N761P797P193
22461D21612P212j09m382n550l823R640K015m442k677r824k287K610J756M113
22447D15864K302L266L940p063m564Q591N927O029k495j0640R421k512j3660L5
22433D14441l579k948O082O964O789K711m791J762K618K319O222J287q862o992
22419D24023p692J572M708K251k408K2J734L731L951k468p056k677o864L919J235
$$ plain form
22518 419293 417589 418534 413862 408281 408205 411403 416039 422844 421161 422339 423522 418365 429491 423008 427583
22503 427583 430598 427688 416948 423551 424827 425091 419202 420766 407527 410766 424615 429281 422369 413079
22489 413079 410745 412101 413488 413158 418424 413448 406902 406364 410034 412753 401465 406054 410085 416249
22475 416249 409918 405856 400742 407620 421197 422217 417678 398428 390552 392466 400861 406622 414419 421612
22461 421612 428824 428715 424333 418783 414960 424600 426615 422173 419496 409672 407385 409995 411751 415864
22447 415864 418166 421432 425372 418309 413745 422336 428263 434292 431797 421157 430578 428066 414406 414441
22433 414441 410862 407914 413996 420960 427749 430460 425669 427431 430049 432368 438590 439877 431015 424023
22419 424023 416331 417903 422611 424862 422454 422476 424210 427941 431892 429424 422368 419691 412827 416746 417981
22404D17981J2557R918j0704q373m751K807M695N813Q859m982n797q672k12R555
22390D28694J106L002n61l119o08o756K894l854o138N655R117l165N82N923n647
22375D27125k278K057P671j356K64l840k402Q91K104j227k12O576o860r817J939
22360D20635n464R602L033Q619O128q963m319N136Q77j394o497k537M588O702
22346D36146J8146k357j0471K2j430o771j234Q258m915k905k900l459l060J4366
22332D37436Q171K294L879o611n532k859p403j1382J0163P433R961J3910q729
22319D50731n531o78K27O083r256j0590N807O470J3748P42j4239o972r600k112
22305D24830M479K037Q730K046j4301j0060M950J2995N319r30j638q0j855o760
$$ plain form
22404 417981 430538 440456 429752 421379 416628 419435 424130 429943 438802 433820 428023 419351 419139 428694
22390 428694 429800 432802 432241 429122 428514 421758 424652 420798 414660 420315 429432 426267 426849 432772 427125
22375 427125 424847 426904 434575 433219 433483 429643 427241 428132 430236 429009 428797 435373 428513 418696 420635
22360 420635 415171 424773 427806 436425 442553 433590 429271 434407 435284 433890 427393 424856 429444 436146
22346 436146 454292 451935 441464 441486 440056 433285 432051 440309 435394 432489 429589 426130 423070 437436
22332 437436 445607 447901 451780 445169 439637 436778 429375 417993 428156 435589 445550 459460 450731
22319 450731 445200 444522 444749 450832 441576 430986 436793 443263 457011 457753 443514 436542 426942 424830
22305 424830 429309 431346 440076 442122 427821 417761 422711 435706 441025 440095 438457 438377 436522 429762
22291D29762J273k795J0326J4641R51k0293j5001j3271J0332o57l536R075R88
22278D21795L59M232L84m923m538L961O318J6342O271O344k816j6259p982m028
22264D25460nJ3529O588m962q420n599K883Q022J558o565J135J979l431o283J220
22249D27109N736J2544n265n342J203J3029n833N08Q439N127j1148r853p319l501
22235D25434N293Q980K675j0240o358J0705j265m488o819J240Q816R134n032o333
22221D31742J330k102L225p687k755N046l241m233J0693R094K560K528J732j856
22207D46076m696n494m925j994Q14J1681n1L203R721R11J459Q709j1988j1052
22193D42374J6746O947J48j1933n800j844q550L517l284L011M166k066p6m367
$$ plain form
22291 429762 431035 428240 438566 453207 454158 433865 418864 405593 415925 415268 411732 420807 421795
22278 421795 422154 426386 426770 421847 417309 421270 427588 443930 450201 456545 453729 437470 429488 425460
22264 425460 425455 438984 445572 440610 432190 426591 429474 437496 439054 432489 433624 435603 432172 425889 427109
22249 427109 432845 445389 440124 434782 435985 449014 443181 443689 452128 457255 446107 436254 428935 425434
22235 425434 430727 439707 442382 432142 425784 436489 435224 430736 423917 425157 433973 443107 438075 431742
22221 431742 433072 430970 434195 426508 423753 428799 425558 421325 432018 441112 443672 446200 447932 446076
22207 446076 441380 435886 430961 428967 429781 441462 441411 444614 454335 455246 456705 465414 453426 442374
22193 442374 459120 466067 466215 454282 448482 446638 438088 441605 438321 441332 445498 443432 443356 438989
22179D38989k938Q056P737Q593k334J672m382m226J2962k661j2051q011O853Q244
22165D56503o968k944j867M350J64P007J4666j1218k2440K641J4537J264r511
22152D46184K522J868N551N980P95j737k732L90k67L207q53l212J30j050K194
22137D58970j4082q715P007M669R928P258m073j274M620j783o827q657k649J624
22123D46016l168M632J394o449L125O615Q8J731M107j646j1524m217m409O2J6966
22108D53323O207j384m986m150P76P390M430K219J0559j278p652r213q48R999
22094D65392O363j6429l525O955O745M103L444J319J791n936l966J978j296m178
22080D62760k096P439O233q151j051l75J2496O17K374j2305o531J839R172J614
$$ plain form
22179 438989 436051 444107 451844 460437 458103 459775 455393 451167 464129 461468 449417 441406 448259 456503
22165 456503 449535 446591 444724 449074 449238 456245 470911 459693 437253 439894 454431 455695 446184
22152 446184 448706 450574 456125 462105 462900 461163 458431 458821 458554 461761 460908 457696 457826 456776 458970
22137 458970 444888 436173 443180 447849 457777 465035 460962 459688 464308 462525 455698 447041 444392 446016
22123 446016 442848 447480 448874 442425 445550 452165 452253 453984 458091 456445 444921 440704 436295 436357 453323
22108 453323 459530 458146 453160 449010 449786 457176 461606 463825 474384 473106 465454 456241 455393 465392
22094 465392 471755 455326 451801 458756 465501 469604 473048 474367 476158 470222 466256 468234 466938 462760
22080 462760 460664 468103 474336 466185 465134 464759 477255 477872 480246 467941 461410 463249 472421 474035
22066D74035o025r005j2025R53M710J431j577n307R58L355k63m618k982K67l827
22051D40080J0239L064m52R287K734q687l085m812J0571M45M749O562jJ940q918
22036D63716M595j434k553k59l644N916M871l775l911N6J687p704l174K980O897
22021D64264m754J224R688j446o900N60Q49k442M808J914l627J441j324k33N083
22006D69105L614Q011Q60j1769r291J91M474J5110p361o464j978o191n659M597
21992D57249J1774l285k709j812q29J6258J0322o01p203k992L720L443o249j2794
21978D64292L340O889K631J544l150o448l445M340m49L824Q704K850l490k643
21964D78789L181n616J392J629j623O687M513J986m382p327j0299o140K84J5376
$$ plain form
22066 474035 468010 459005 446980 447933 452643 454074 452497 447190 448148 451503 451240 446622 443640 443907 440080
22051 440080 450319 453383 452931 462218 464952 456265 453180 448368 458939 459384 464133 470695 470694 472634 463716
22036 463716 468311 466877 464324 464065 460421 466337 471208 467433 463522 463578 465265 457561 454387 457367 464264
22021 464264 459510 460734 470422 468976 462076 462636 463485 461043 465851 467765 464138 465579 464255 464022 469105
22006 469105 472719 480730 481590 469821 460530 460721 465195 480305 472944 466480 464502 458311 452652 457249
21992 457249 469023 465738 463029 461217 460388 476646 486968 486367 479164 476172 479892 483335 477086 464292
21978 464292 467632 474521 477152 478696 475546 469098 465653 469993 469544 473368 482072 484922 481432 478789
21964 478789 481970 476354 477746 479375 477752 484439 488952 490938 486556 479229 468930 462790 463074 478450
21950D78450L724p257q853k980K73J0331P449o10N90l753L236L443k162j030O791
21935D87642K428L392o619k906m165J928l048K618k03o837q935m97l912J1611
21921D72497M851K780j884P883r15m022q9j0003j475M67J4699N987O613p974p896
21906D81519p764o962j731R744J8138J448n221p720j9J3320k468m655j1664K351
21892D78316O33j0373p863n65P052J6700R599L06n976P812r230r219l782J049
21878D74459Q085Q862k339j9154N183O263n509K98K615N771J2384j2823o322j5128
21864D62645r366J2345J0207n068N703j683j531Q316J5300Q160k452n07K049n433
21850D98685R33j1316r948l967J3961R50o477M038P463L98j4189n951J2500O452
$$ plain form
21950 478450 482174 474917 466064 463084 463357 473688 481137 480527 481117 477364 480600 484043 481881 480851 487642
21935 487642 490070 493462 486843 483937 479772 481700 478652 481270 481067 474230 465295 464798 460886 472497
21921 472497 477348 480128 478244 486127 485212 481190 481101 471098 469623 470090 484789 490776 497389 489415 481519
21906 481519 473755 466793 465062 474806 492944 494392 489171 481451 481432 494752 492284 487629 475965 478316
21892 478316 478949 468576 460713 460148 467200 483900 493499 493805 487829 495641 486411 477192 473410 474459
21878 474459 482544 491406 489067 469913 475096 481359 475850 476148 478763 484534 496918 484095 477773 462645
21864 462645 453279 465624 475831 470763 476466 474783 473252 481568 496868 505028 502576 502069 504118 498685
21850 498685 499618 488302 478354 474387 488348 489298 482821 486859 494322 494720 480531 474580 487080 493532
21836D93532J0141M388j668j213m449J329m395M423J30o022M282O20q376o073
21822D86649l845Q37Q313q400L353J2514Q502j1523K362J0326j215J43j007k413
21808E04596K643k228M224R167k929k728J093l614p815o777J584M58L566m446
21794D96794j1128N348K49M921m311J112N322n57O761o893j0640N717J5706L613
21780E12014n340l547Q066J175m763q814m108M424O353J826k726n687K16P335
21766E06424J172k182n049l222J781M670K339r43R750N689J064Q981k679j1846
21752E15949n449l887O865O878j123j2310j0821K80M332k17J2m27M867j2825n112
21737D87012L800J3947K1385M570o780r396o98j462p300J48o50P522o09Q9L465
$$ plain form
21836 493532 503673 508061 506393 505180 500731 502060 497665 502088 502218 496196 500478 501098 492722 486649
21822 486649 482804 483641 491954 483554 486907 499421 507923 496400 498762 509088 507873 508016 507009 504596
21808 504596 507239 505011 509235 518402 515473 512745 513838 510224 502409 495632 497216 497674 501240 496794
21794 496794 485666 491014 491263 496184 491873 492985 498307 497750 504511 497618 486978 492695 508401 512014
21780 512014 506674 503127 511193 512368 507605 498791 494683 499107 505460 507286 504560 498873 499089 506424
21766 506424 507596 505414 500365 497143 498924 503594 505933 504990 514740 520429 521493 530474 527795 515949
21752 515949 510500 506613 513478 520356 519233 506923 496102 496382 500714 500497 500509 500082 504949 492124 487012
21737 487012 490812 504759 526144 530714 523934 514538 513840 512378 505078 505226 504576 512098 511489 511578 515043
21722E15043L053L903J2114l661k534R43o644p061J089J041j0180l370L302J3962
21708E21000j3j4519p683J1050J0053j769j632l985K220q72M556q28q933p594
21694E01051P679J1212M068m516N603L150k097q202j778j009J724p96l419M493
21680E17163N243O008n68j1848k279l891J437O007J5142p78l833j1427k682N329
21666E19023K347o834K345L189m247m374K167J4542N015m506j845n847K59K033
21652E23267M112j3336k229m215p365n38L62J1840J0158K015O809K585j447j2709
21638E19309j1426Q738P514m345n812K117M893J0623k62N428n655n836L818Q414
21624E37518l729n353N38n656j2945j1500K1930O568N67l679L931k456l440Q45
$$ plain form
21722 515043 518096 521999 534113 530452 527918 528861 522217 515156 516245 517286 507106 503736 507038 521000
21708 521000 520987 506468 498785 509835 519888 518119 516487 512502 514722 513850 518406 517578 508645 501051
21694 501051 508730 519942 524010 519494 525097 528247 526150 517948 516170 515161 516885 516089 512670 517163
21680 517163 522406 528414 527846 515998 513719 509828 511265 517272 532414 531636 527803 516376 513694 519023
21666 519023 521370 514536 516881 520070 515823 511449 513616 528158 533173 528667 526822 520975 521234 523267
21652 523267 527379 514043 511814 507599 500234 499696 500058 511898 522056 524071 530880 533465 532018 519309
21638 519309 507883 516621 524135 519790 513978 516095 520988 531611 531349 536777 531122 525286 529104 537518
21624 537518 533789 528436 528974 523318 510373 498873 520803 527371 527938 524259 528190 525734 522294 523139
21610E23139N857L590J863j3440l661J0334J0931R360N61k118j039q878n513j118
21596E29868j3N629N909q1J561Po876J0199n57j819l393n427J0643o700o796L464
21580E35618m512r80Q13K984M433j585O24n87R67K238L485j1045o305J3399J2420
21565E51967M257l862J270Q34m294Q891j237j0703q658o40J2588j491q729q52
21551E39341K808N055j231m140k882j952l387J479j989J760R269L591n955J167
21537E42934K946Q450J321j6665r302J874J7048O994k103J712k139o931N322O652
21523E58113j683n025M751R839M869k897p832K263k870l090N412j0767r600l080
21509E38403l967L805L573R534k93R249J064K947q01j5423j0320J1304J4648J04
$$ plain form
21610 523139 528996 532586 534449 521009 517348 527682 538613 547973 548534 546416 545377 536499 530986 529868
21596 529868 529855 535484 541393 541312 542873 542880 536004 546203 545646 543827 540434 535007 545650 538950 532154 535618
21580 535618 531106 530126 530939 533923 538356 536771 537395 536808 537775 540013 543498 532453 526148 539547 551967
21565 551967 556224 552362 553632 554466 550172 559063 557826 547123 538465 537825 550413 548922 540193 539341
21551 539341 542149 547204 545973 541833 538951 536999 533612 535091 533102 534862 544131 547722 541767 542934
21537 542934 545880 554330 555651 538986 529684 531558 548606 555600 553497 555209 553070 546139 551461 558113
21523 558113 556430 551405 556156 565995 570864 567967 560135 562398 559528 556438 561850 551083 541483 538403
21509 538403 534436 538241 541814 551348 551055 560304 561368 564315 563514 548091 537771 549075 563723 563827
21495E63827l428p589j018R896L027j0070k229L128L666Q868n389r420m831K905
21481E51343j136K258J049J235r714K562J8929L90n018k909m673K02j285K286
21467E55519k125n557r490R07O891J5091P960j025q103m594j106j0451j271n807
21453E36839M576J1540O297k645n996K434n383m295K44O476J4335k686m230O32
21439E58138p014M485J0337q331l565J0434m993Q8K869M644J0979j850m582j193
21425E70446k996j1105p499k924P622Q560J0872N435l241L039r479l561L39M463
21411E69971k103L802K923j1787j4783n868P03J8903R243J150P268L43o297p647
21397E65821L90P11J634J0687o37J928j663l361j0362m092P554J0619M529j50
$$ plain form
21495 563827 560399 552810 551792 561688 564715 554645 552416 555544 559210 568078 562689 553269 548438 551343
21481 551343 550207 552465 553514 554749 545035 547597 566526 566916 561898 558989 554316 554518 553233 555519
21467 555519 553394 547837 538347 539254 546145 561236 569196 568171 560068 555474 554368 543917 542646 536839
21453 536839 541415 552955 559252 556607 550611 553045 547662 543367 543611 550087 564422 561736 557506 558138
21439 558138 551124 555609 565946 557615 554050 564484 559491 559579 562448 567092 578071 576221 571639 570446
21425 570446 567450 556345 548846 545922 553544 562104 572976 578411 575170 578209 568730 565169 565508 569971
21411 569971 567868 571670 574593 562806 548023 542155 542858 561761 571004 572154 579422 579765 573468 565821
21397 565821 566211 566922 568556 579243 578606 580534 578871 575510 565148 561056 568610 579229 583758 583608
21383E83608K767l968j018k437m572O278P373n98k301j2920m21L663M712j022
21369E79144o524o623k209J1065N174m189J916L154o033q79J646J4396o401q108
21355E75529k224P51J4343M268j284K157J223n573p353N879k04k679K368j442
21341E85759R88L003m730J336J898N92L778n237M158M401p154n79l839N022L526
21326E92922k177p41l535N318M336q59n035O524n93j0880n10M087R651j0222o318
21311E81968l619N242N924K712L169l314M719J1477M333j3034r046Q102k219m009
21297E92405p024q994Q214J7505K869j1172n773O254M76M6L337j0688j1053O208
21283E82610l765M501L48r114J1037J1026J1905M052r749L878q044m064o429J552
$$ plain form
21383 583608 586375 582407 581389 578952 574380 580658 588031 587433 585132 572212 571791 575454 580166 579144
21369 579144 572620 565997 563788 574853 580027 575838 577754 580908 574875 573996 575642 590038 583637 575529
21355 575529 573305 574056 588399 592667 591383 593540 594763 589190 581837 587716 587512 584833 587201 585759
21341 585759 586747 589750 585020 586356 588254 588846 592624 587387 591545 595946 588792 588213 584374 589396 592922
21326 592922 590745 590004 586469 591787 596123 595264 590229 596753 596160 585280 584770 588857 598508 588286 581968
21311 581968 578349 583591 589515 592227 595396 592082 596801 608278 612611 599577 590531 598633 596414 592405
21297 592405 585381 576387 584601 602106 604975 593803 588030 594284 594760 594806 598143 587455 576402 582610
21283 582610 578845 583346 583694 574580 585617 596643 608548 612600 602851 606729 598685 594621 588192 589744
21269E89744J8694O806o791j0542o776K080M290N879J3146J810J846j3530j3850
21256E92806j548n876j0726O846P527O012O313J1641j483j1108n222J389N943
21243F02514N678j478P542P237m672k501N739j887l868m974o974M297J3981J491
21229F22125j0366l090J07l04O196m62j867j3913l484P300J0368l887j453O062
21215F13332R25R29N212M898n188J225K409k584l439K571m737j468M090Q090j4664
21200F11601L018J4713N319q934p502j3148k269N437K306m48l431n709N948M850
21186F11751R677O481l878N476K713R91o739j9239k367J3007j910K183Q064P55
21172F26965r49N879j017J037j1527j4867n391P590Q053R251M101n692n502p411
$$ plain form
21269 589744 608438 615244 608453 597911 591135 593215 597505 603384 616530 618340 620186 606656 592806
21256 592806 591258 585382 574656 581502 589029 595041 601354 612995 611512 600404 595182 596571 602514
21243 602514 608192 606714 614256 621493 616821 614320 620059 618172 614304 609330 602356 606653 620634 622125
21229 622125 611759 608669 608776 608472 614668 614206 612339 598426 594942 602242 612610 608723 607270 613332
21215 613332 614257 615186 620398 625296 620108 621333 623742 621158 617719 620290 615553 614085 618175 626265 611601
21200 611601 614619 629332 634651 625717 618215 605067 602798 608235 610541 610093 606662 600953 606901 611751
21186 611751 621428 627909 624031 629507 632220 633211 626472 607233 604866 617873 615963 618146 626210 626965
21172 626965 626016 631895 630878 631915 620388 605521 600130 607720 615773 625024 629125 623433 617931 610520
21158F10520K907m059O640N763J809j2345l354O140J3342M821j1076M008m242
21145F20874L728J232R648J2201k836n174l41Q187q12o472L488l074L661K069
21131F46379p63o446j078k428p491O514j288m16p923Q165N356o840M175J330k428
21116F34818l80q342j673N920N798r26L790R418K003m078k217p333n936m613j250
21101F24999R263J0351M466M61M70n834O354q008j2306J606L636J0190n708r55
21087F38985j149j698M673J1891N339n951p285M867M875L251M29j325k467j035
21073F53400j0227m489R459Q850J383O132p811j1081P674N188r071O52O183Q192
21059F64434m972j707k748r231k075j362q213M576Q022N66K25J6167q0j0360J987
$$ plain form
21158 610520 613427 609368 616008 621771 623580 611235 607881 614021 627363 632184 621108 625116 620874
21145 620874 624602 625834 635482 647683 644847 639673 639332 647519 646707 640235 643723 640649 644310 646379
21131 646379 645616 639170 638092 635664 628173 634687 633399 632983 625060 633225 638581 631741 635916 637246 634818
21116 634818 634438 626096 624423 630343 636141 635215 639005 648423 650426 646348 644131 636798 630862 626249 624999
21101 624999 634262 644613 649079 649540 650010 644176 650530 642522 630216 631822 635458 645648 639940 638985
21087 638985 637836 636138 640811 652702 658041 652090 644805 649672 654547 657798 658227 656902 654435 653400
21073 653400 643173 638684 648143 656993 658376 664508 656697 645616 653290 658478 649407 650059 656242 664434
21059 664434 659462 657755 655007 645776 643701 642339 634126 638702 646724 647290 647515 663682 663602 653242 655229
21044F55229K847k247j7496m42R835J1088r54P482j0724n403k107J0405J0155
21031F67668o772j6420j450J4593J1340l362q833m082n61N477m303L103J0053
21018F66451l52M406p802j0549o279k374p41P47N308J4248O448r813j367j447
21004F56884J42n82J4359J502L253J600l381r144q39R048n586p494J431M238P73
20989F66204J556J506M138r306J635K578J820L354l964r303M176P461k869J0638
20975F79624O596o183K163j802P54K802Q516p025K58M986J557J0k612j974q798
20960F78872j0278l404R354M46j081O142o433n236L106O52L340K541j957n862
20946F70202j1235m582K679R311K346Q15m50N524L479o264k003M95Q620J6013
$$ plain form
21044 655229 658076 655829 638333 637891 647726 658814 657860 665342 654618 649215 647108 657513 667668
21031 667668 660896 644476 643026 657619 668959 665597 656764 652682 652121 657598 653295 656398 666451
21018 666451 666099 670505 662703 652154 645875 643501 642760 643507 648815 663063 669511 659698 658331 656884
21004 656884 657026 656444 670803 672305 675558 677158 673777 664633 663794 672842 667256 659762 661193 665431 666204
20989 666204 667760 669266 673404 664098 665733 668311 670131 673485 669521 660218 664394 671855 668986 679624
20975 679624 686220 680037 682200 680398 681152 683954 692470 685445 685703 690689 692246 692256 689644 687670 678872
20960 678872 668594 665190 674544 674990 673909 680051 673618 668382 671488 672140 675480 678021 676064 670202
20946 670202 658967 654385 657064 666375 668721 669536 669086 674610 678089 671825 669822 670317 678937 694950
20932F94950l110l923K73L158n127j060K872J713M827j715m475K35N549j258o11
20917F92298N480M543Q144m298j0828j1483j435L35J962Q952r74K584P147l268
20903F99159J61l673n628l439N16O189K358Q71N182l610M185L374J0008n043p688
20888G02922n492J703J1739N088j5459q2k531J766j580l511J250O660P14K437
20874G05624K025K039j505j1466k441k582m432N092Q921M829k961l204O864Q831
20860G15634L593l731l070p370l406l464k406L826Q024l987j00M145k605M268
20846G09351m247j0236q620L529L135M615J7148o77N539j3358j1961l080R146
20833G00284J6887J273k328Q397K565m813L885K095n356p426m86m433L149K526
$$ plain form
20932 694950 691840 687917 688190 691348 686221 685161 688033 689746 694573 692858 688383 688618 694167 692909 692298
20917 692298 697778 702321 710465 706167 695339 683856 682421 682756 684718 693670 692696 695280 702427 699159
20903 699159 699320 695647 690019 686580 687096 693285 695643 696514 701696 698086 702271 705645 715653 710610 702922
20888 702922 697430 699133 710872 715960 700501 700419 697888 699654 698074 694563 695813 702473 703187 705624
20874 705624 707649 709688 708183 696717 694276 691694 687262 692354 701275 706104 703143 699939 706803 715634
20860 715634 719227 715496 712426 705056 701650 698186 695780 699606 707630 703643 703543 707688 705083 709351
20846 709351 705104 694868 686248 689777 692912 697527 714675 713998 719537 706179 694218 691138 700284
20833 700284 717171 718444 716116 724513 727078 722265 726150 728245 722889 715463 714977 710544 713693 716219
20819G16219M823N867L418r727m322k543R369p857k370n094j031J1084k641o342
20805G08853Q000m425o960k75J1867J0453P199R348J415K209k752q690m19K094
20791G37917r039j1608L942p618L698J8490k510P324K791o113k215k957L756j854
20777G34004P44R269k669j0858K507j988m923J349J1554j340l832R683l41o462
20763G36697R92J723j542n620o946J055Q311N689l240K014N365L593l650M620
20749G49061J0832p06K304R07j1072m104J169k187M759Q155L818m84J214K628
20735G66294l000n839k538J219q214O29l26J899L797K380j543N889q645n393P37
20720G47346l979J630M648o029j0553j149J1627J0475L53R533q697K383k816p452
$$ plain form
20819 716219 721042 726909 730327 720600 716278 713735 723104 715247 712877 707783 706752 717836 715195 708853
20805 708853 716853 712428 705468 705193 717060 727513 734712 744060 745475 747684 744932 736242 735823 737917
20791 737917 728878 717270 721212 713594 717292 735782 733272 740596 743387 737274 735059 732102 735858 734004
20777 734004 734748 744017 741348 730490 732997 731009 726086 727435 738989 737649 733817 743500 743159 736697
20763 736697 737689 739412 737870 732250 725304 726359 734670 740359 737119 739133 744498 748091 744441 749061
20749 749061 759893 759187 761491 762398 751326 747222 748391 746204 750963 759118 762936 762452 763666 766294
20735 766294 763294 757455 754917 756136 747922 748551 748225 750124 753921 756301 754758 760647 752002 746609 747346
20720 747346 743367 744997 749645 743616 733063 731914 743541 754016 754369 763902 755205 757588 754772 747320
20706G47320j258j921L369P930Q904M077j1939q177J1521R352M781L010N622m709
20692G77882r668J270o122o117O533n567O174O60J773k699J1892P753j0286n884
20678G67594J418L50M526J2628K537j2676j1562J151l159K899L251l977L794L807
20664G72581P024l749J624n02P682j3119k713q57J388K184J1373J32m375m134
20650G74539o166K839j876j466M81J4539O411Q604P400p09m115j3450l552O852
20636G90331R369k273j4669K546n65O151K797K062J515j507J717J0393O666N654
20622H20187n763q613p190N817m121M464L213m729L517l605j1105j131j673K771
20608G92039J0235J0982j0539j3184m399O571Q233O790J328n268n386J3099N380
$$ plain form
20706 747320 746062 744141 747510 755440 764344 768421 756482 748305 759826 769178 773959 776969 782591 777882
20692 777882 768214 769484 763362 757245 763778 758211 764385 765045 766818 764119 776011 783764 773478 767594
20678 767594 769012 769362 773888 786516 789053 776377 764815 765966 762807 765706 768957 764980 768774 772581
20664 772581 779605 775856 777480 776978 784660 771541 768828 767971 769359 771543 782916 783048 778673 774539
20650 774539 768373 771212 769336 767870 768351 782890 789301 797905 805305 804596 800481 787031 783479 790331
20636 790331 799700 797427 782758 785304 784739 790890 793687 795749 797264 795757 797474 807867 814533 820187
20622 820187 814424 805811 798621 804438 800317 804781 807994 803265 806782 803177 792072 790941 789268 792039
20608 792039 802274 813256 802717 789533 785134 791705 799938 806728 808056 802788 797402 810501 815881
20595H15881q005k1446n372O610O965J478O790M196O659P976j5970j0480K934
20582G98216L642q024K2199O256J076n482M377P589L099m872p45j3637r099J805
20568H06400O192m138q193j406J7945k062l363k419k852O120r2J229k862O946
20554H17445P925K81k155l980n767o331m826R347M556R438j738j0930K840j337
20540H14768j889m77m20l678O167M119k774j237J1533J970j2792m642M23N046
20526H16117M926m376k418P594K343J042J1726J638K444R497j0970j6658k569
20513H20336M447O448N305J1797K725p791n11Q037l794q863j972k123m263Q178
20499H37956J0076M638r102k105O393O490k519q73P56o51o87j3828q506N621K806
$$ plain form
20595 815881 807876 786430 781058 787668 794633 796111 802901 807097 813756 821732 805762 795282 798216
20582 798216 801858 793834 816033 822289 823365 817883 822260 829849 832948 828076 827331 813694 804595 806400
20568 806400 812592 808454 800261 798855 816800 814738 811375 808956 806104 812224 812132 813361 810499 817445
20554 817445 825370 825651 823496 819516 813749 807418 802592 811939 816495 825933 824195 813265 816105 814768
20540 814768 812879 812402 811982 808304 814471 818590 815816 814579 826112 828082 815290 810648 811071 816117
20526 816117 821043 816667 814249 821843 824186 825228 836954 838592 841036 850533 839563 822905 820336
20513 820336 824783 831231 836536 848333 851058 843267 842756 850793 846999 838136 836164 834041 829778 837956
20499 837956 848032 852670 843568 841463 847856 854346 851827 850954 851710 851059 850372 836544 828038 833659 836465
20484H36465J9471J1754N729r86j1370J683K320m647j375m067k642K671J2856
20471H67862M327N577n19j1174j816O060k698q406O038m20o32o601K512J572R65
20456H62647j363J613N303Q618n608j1136P161Q597L49k384K050j1153M15J0984
20442H76093k925n932l049j97m832k051J2698J0144p876j3885J1303J3766q34
20429H82423O128m533M663M809k773j1618K144L122k555K519L53l611L960j0213
20415H74818N345n606j0446l815O365M681J2155l05n225J0469Q680J19m013o721
20401H86501M395l65l809n233N030J1942j200K174Q630p80q758j6906m700J1116
20387H88037Q771n137J0064J3142k659R84j992j3268j1471k930M894P492O107
$$ plain form
20484 836465 855936 867690 873419 872433 861063 862746 865066 860419 859044 854977 852335 855006 867862
20471 867862 872189 877766 877247 866073 864257 870317 867619 859213 865251 864831 864199 857598 860110 861682 862647
20456 862647 861284 862897 868200 876818 871210 860074 867235 875832 876181 873797 875847 864694 865109 876093
20442 876093 873168 867236 864187 863990 859158 857107 869805 879949 872073 858188 869491 883257 882423
20429 882423 888551 884018 888681 893490 890717 879099 881243 884365 881810 884329 884682 881071 885031 874818
20415 874818 880163 874557 864111 860296 866661 871342 883497 883192 877967 888436 897116 897235 893222 886501
20401 886501 890896 890531 886722 881489 886519 898461 897261 899435 908065 907285 898527 881621 876921 888037
20387 888037 896808 891671 901735 914877 912218 913202 911210 897942 886471 883541 888435 895927 902034
20374I02034L525K634l973q630m646Q571j638o216J1471r43O749j2698l403M589
20360H97426P346m383j543M5l845l360K035M964L208J171n049J630M828M990J4402
20345I23865l26Q037Q778p7k582m314p83m756m100P13M801O499q621n056K608
20330I24686Q117J523M03k997j194N124N465J4118J4145k2547k2016q881O483
20317I22429J2603J0215L414l980r399k731O699N698m446k913p044q225O485M071
20303I32876P037j0985N63L691m046J0415L626N967M856j794N744k818j0636L82
20289I44878R944l010l327J897j090J305p989k525R258N816J200P373K761M60
20275I66951J393P322R83n426j9017k558m466l575L785J0900M072M877k34p659
$$ plain form
20374 902034 905559 908193 904220 895590 890944 899515 897877 891661 903132 902189 908938 896240 892837 897426
20360 897426 904772 900389 898846 898891 895046 891686 893721 898685 901893 903064 898015 899645 904473 909463 923865
20345 923865 923539 931576 940354 940277 937695 933381 932598 927842 923742 924455 929256 935755 927134 922078 924686
20330 924686 932803 934326 934729 931732 930538 935662 941127 955245 969390 946843 924827 915946 922429
20317 922429 935032 945247 948661 944681 935282 932551 939250 944948 940502 937589 930545 922320 928805 932876
20303 932876 939913 928928 929491 933182 929136 939551 943177 949144 954000 952206 957950 955132 944496 944878
20289 944878 954822 951812 948485 950382 949292 950597 942608 940083 949341 955157 956357 963730 966491 966951
20275 966951 968344 975666 976649 971223 952206 949648 945182 941607 945392 956292 960364 965241 965007 957348
20261I57348j4879J2500R968l579j0722k975O872R687N68r531q845R451Q929N78
20247I65370Q9o72p940q771N912P762j65M621N660J2362P386l085k303j032L205
20232I88399m22m096n89N040m339m562k288k965M836J5621r728k638L808m915
20218I81162m210O768J565j0950J1031J6460O449J433J197j044K82m47k051n182
20204A002463M859K011m580o239n553J2508P542k572p318L223K414O21j392J842
20190A009829J2021R543M337j2524j2178J586p13k259K805j052N094Q286J73n005
20176A019943L678J178k404M077R348O379N121k629J389o983n151O645N824j1307
20162A035108j0801m822O447O838K813m977j396O573N247j5922L811J7706O068
$$ plain form
20261 957348 942469 954969 964937 961358 950636 947661 954533 964220 964788 955257 946412 955863 964792 965370
20247 965370 965459 964787 956847 948076 953988 961750 961585 966206 971866 984228 991614 988529 986226 985194 988399
20232 988399 987977 983881 983292 988332 983993 979431 977143 974178 979014 994635 984907 982269 986077 981162
20218 981162 976952 983720 985285 974335 985366 1001826 1008275 1009708 1010905 1009861 1010143 1009696 1007645 1002463
20204 1002463 1007322 1009333 1004753 998514 992961 1005469 1013011 1010439 1003121 1006344 1008758 1009379 1007987 1009829
20190 1009829 1021850 1031393 1035730 1023206 1011028 1012614 1011901 1009642 1012447 1011395 1016489 1024775 1024948 1019943
20176 1019943 1023621 1024799 1022395 1026472 1035820 1042199 1047320 1044691 1046080 1039097 1033946 1040591 1046415 1035108
20162 1035108 1024307 1019485 1025932 1032770 1035583 1030606 1029210 1035783 1041030 1025108 1028919 1046625 1052693
20149A052693Q370M744j1463j2313Q628n945n158k978k036P149Q995p36m572K699
20135A048077L42J092J652m285R214p38j1469k128J4492L289L506K645n322k3054
20121A037313l24P867p9K86L154R995O428R541j1591p82j47n285j736R887l53
20106A064174q201K971l391l838O473J3638K397K649n534J1744N374j788P699
20093A094367o756n332j026j755N574M724l412J822J745m218p737J759L649P293
20079A090697m90O335j645m354k812k003R446J2284K527j1315l307J780J3645
20066A110788M505j3171j3785n387N617P382M445J9767m283J64R965J038n669
20053A121376j8426j231K502K094J1711P101m876K50K575p668k860K117l180J002
$$ plain form
20149 1052693 1061063 1065807 1054344 1042031 1050659 1044714 1039556 1036578 1034542 1041691 1050686 1049950 1045378 1048077
20135 1048077 1048419 1049511 1051163 1046878 1056092 1055354 1043885 1041757 1056249 1059538 1063044 1065689 1060367 1037313
20121 1037313 1036989 1044856 1044777 1045063 1048217 1058212 1064640 1074181 1062590 1061808 1061661 1056376 1054640 1064527 1064174
20106 1064174 1055973 1058944 1055553 1051715 1058188 1071826 1074223 1076872 1071338 1083082 1088456 1086668 1094367
20093 1094367 1087611 1082279 1081253 1079498 1085072 1089796 1086384 1088206 1089951 1085733 1077996 1079755 1083404 1090697
20079 1090697 1090207 1096542 1094897 1090543 1087731 1085728 1095174 1107458 1109985 1098670 1095363 1097143 1110788
20066 1110788 1115293 1102122 1088337 1082950 1088567 1095949 1100394 1120161 1115878 1116042 1126007 1127045 1121376
20053 1121376 1102950 1101719 1104221 1106315 1118026 1125127 1120251 1120501 1123076 1115408 1112548 1114665 1111485 1112487
20039A112487P291K958o874k056Q331M846j554m207n29k685P947J0526K049m826
20025A133704l724l954l701R63R282J415j983R49k673k422j3120m629K866M254
20011A117227N530L833P878N659m805o012P639M131R22Q602Q660o368m980Q836
19997A156752k58r95L091N653K231J71n664j64M662J656R38j0704K989N372O03
19982A166333O021N680R209j0163r021O477J034r462l188N70n010j318J1568J7231
19968A185961L500L134N02j6428K277J3867J5622j476q42j2435k2069k460J8917
19955A188070J2538K321q053m825Q994M172P809j293k295J0109m84n810m374m173
19941A202706p48l179L834l842k000m887k927J9640j30o492L710M082P722P384
$$ plain form
20039 1112487 1119778 1122736 1115862 1113806 1122137 1126983 1125429 1121222 1120693 1118008 1125955 1136481 1138530 1133704
20025 1133704 1129980 1126026 1122325 1123288 1132570 1133985 1132002 1132951 1130278 1127856 1114736 1110107 1112973 1117227
20011 1117227 1122757 1126590 1134468 1140127 1135322 1129310 1136949 1141080 1142002 1150604 1159264 1152896 1147916 1156752
19997 1156752 1156494 1155499 1158590 1164243 1166474 1166645 1160981 1160817 1165479 1167135 1168073 1157369 1160358 1165730 1166333
19982 1166333 1172354 1178034 1187243 1177080 1168059 1174536 1175570 1166108 1162920 1163490 1158480 1157162 1168730 1185961
19968 1185961 1189461 1192595 1193097 1176669 1178946 1192813 1208435 1206959 1206117 1193682 1171613 1169153 1188070
19955 1188070 1200608 1202929 1194876 1190051 1199045 1203217 1211026 1209733 1207438 1217547 1217063 1211253 1206879 1202706
19941 1202706 1201958 1198779 1202613 1198771 1196771 1191884 1188957 1208597 1208467 1201975 1205685 1209767 1217489 1224873
19927A224873n990m482r67n924J2032K1709m436k70m068l298J326J87J18J208
19913A232018K382O13j762M756m097Q622K901k554k129K047r19L720J1043P199
19899A263840j1785j3412n809k055o30n327J0923J1141O000J006K330k441j0119
19886A243662j620M0M09R098O253m027o366j695J311R812K0824J547K663L342
19872A285253l538o866m194p089K389O434K898J0000j0163p044M755K92M863J0801
19858A288791O437K620O35o011r349J040k754k971P229J2555J043j0092k879K136
19844A288430q22J0421R521r056q247k480j373l597J3018M256M917Q969N379j156
19830A318180j101J0255J3583k619j1882k962K084J0195n288J418Q728j624j0481
$$ plain form
19927 1224873 1218883 1214401 1213434 1207510 1219542 1241251 1236815 1236545 1232477 1229179 1230505 1230692 1230810 1232018
19913 1232018 1234400 1235013 1233251 1238007 1233910 1242532 1245433 1242879 1240750 1242797 1241878 1245598 1256641 1263840
19899 1263840 1252055 1238643 1232834 1230779 1230149 1224822 1235745 1246886 1252886 1253892 1256222 1253781 1243662
19886 1243662 1242042 1242082 1242491 1251589 1257842 1253815 1247449 1245754 1247065 1256877 1277701 1279248 1281911 1285253
19872 1285253 1281715 1274849 1270655 1263566 1265955 1272389 1275287 1285287 1275124 1268080 1272835 1273127 1277990 1288791
19858 1288791 1295228 1297848 1298483 1292472 1283123 1284163 1281409 1278438 1285667 1298222 1299265 1289173 1286294 1288430
19844 1288430 1287608 1298029 1307550 1298494 1290247 1287767 1286394 1282797 1295815 1300071 1304988 1313957 1319336 1318180
19830 1318180 1317079 1327334 1340917 1338298 1326416 1323454 1325538 1335733 1330445 1331863 1340591 1338967 1328486
19817A328486l357M020M02Q466M476n228J441o028j3495Q731J1791N437l646m414
19803A337082J2158R153M837j607j2963l596l989J968j989O966M488j105R892
19790A361295J4433L367P593P68m819j2772n37m343N064n045J595Q534J3627P867
19776A396627j083q24O44m792j361r222K508N134m182n271m065J1866J7106J4712
19762A417797K307j3818L569N149j93J048o680o085Q505M775N051J24l909N840
19748A423480l441l77P855P156p345K47k205m260L27Q883N403j235j091M790j479
19733A436708j2834r612Q151P945k589n972P878J3486Q010L547O038N114j1090
19720A454780q199R897O114L019p348q485j947M028N436m250j147N904P523K780
$$ plain form
19817 1328486 1325129 1329149 1329551 1338017 1342493 1337265 1338706 1332678 1319183 1327914 1339705 1345142 1341496 1337082
19803 1337082 1349240 1358393 1363230 1361623 1348660 1345064 1341075 1343043 1341054 1348020 1352508 1351403 1361295
19790 1361295 1375728 1379095 1386688 1387456 1382637 1369865 1369328 1364985 1370049 1365004 1366599 1375133 1388760 1396627
19776 1396627 1395544 1394720 1395364 1390572 1389211 1379989 1382497 1387631 1383449 1378178 1374113 1385979 1403085 1417797
19762 1417797 1420104 1406286 1409855 1415004 1414811 1415859 1409179 1403094 1411599 1416374 1421425 1421549 1417640 1423480
19748 1423480 1420039 1419662 1427517 1434673 1427328 1427575 1425370 1421110 1421437 1430320 1435723 1434488 1433397 1438187 1436708
19733 1436708 1423874 1414262 1422413 1430358 1427769 1421797 1429675 1443161 1451171 1454718 1460756 1465870 1454780
19720 1454780 1446581 1456478 1462592 1465611 1458263 1449778 1447831 1451859 1457295 1453045 1451898 1457802 1465325 1468105
19706A468105L022J5464j159q445P092n140p170R604J0440m98j303O298N277N56
19692A502143M843N695k913N608l928l384O421m114l243P779Q011K515L604n934
19678A523103j3307j119m180R777P256R322j677j3483M651R716Q559J130j0851
19665A528897j384M941O723q836Q493N659k260J2121M496M578j233l366n77k48
19651A558004r877J2145K488n360l226m230l304L591P370K1407Q394q557l790
19638A575055O783L444k346j850Q532L054J503O470M215k619l821M457J59j2968
19624A590068o649N387Q722J3204J0206N22k05K551n679N66J5076j610l211n844
19610A623104J2812J0425o439N807r102j0640o313p394J7712O923J963M515m269
$$ plain form
19706 1468105 1471127 1486591 1485432 1476987 1484079 1478939 1471769 1481373 1491813 1491315 1490012 1496310 1501587 1502143
19692 1502143 1506986 1512681 1509768 1515376 1511448 1508064 1514485 1510371 1507128 1514907 1522918 1525433 1529037 1523103
19678 1523103 1509796 1508677 1504497 1514274 1521530 1530852 1529175 1515692 1520343 1530059 1538618 1539748 1528897
19665 1528897 1527513 1532454 1539177 1530341 1538834 1544493 1542233 1554354 1558850 1563428 1562195 1558829 1558252 1558004
19651 1558004 1548127 1560272 1562760 1557400 1554174 1549944 1546640 1550231 1557601 1579008 1587402 1578845 1575055
19638 1575055 1581838 1585282 1582936 1581086 1589618 1592672 1594175 1600645 1604860 1602241 1598420 1602877 1603036 1590068
19624 1590068 1583419 1588806 1597528 1610732 1620938 1621460 1621255 1623806 1618127 1618693 1633769 1632159 1628948 1623104
19610 1623104 1635916 1646341 1639902 1645709 1636607 1625967 1619654 1612260 1629972 1636895 1638858 1643373 1639104
19597A639104Q675Q20k222J229j641R219Q762k340l758N516M623m67J0083J4617
19583A692220n365M695j528j0686N254J350K727Q72O172Q132K856O12l221r047
19569A695043P343J0784P381l590j947p750l489P455P720j258M312O926r222k168
19555A717540N761m884J097J283J0983P823q00m675M510J7347J3777n862r126
19542A754774k569O489j164L193r63J853j090L915N876R411P073p174K3K710K602
19527A784959K764Q183L72p863K007J5460J4425j4651N412J714r495l650R566
19514A809203J6359Q558p884k198N39p695K204P351n747j014O320p970J0867M832
19500A833725K341K752Q924J5581J4756l85m23n6n807nJ1883J962o667j0627P493
$$ plain form
19597 1639104 1647779 1648599 1646377 1647606 1645965 1655184 1663946 1661606 1657848 1663364 1667987 1667520 1677603 1692220
19583 1692220 1686855 1691550 1690022 1679336 1684590 1685940 1688667 1689539 1695711 1703843 1706699 1707311 1704090 1695043
19569 1695043 1702386 1713170 1720551 1716961 1715014 1707264 1703775 1711230 1718950 1717692 1722004 1728930 1719708 1717540
19555 1717540 1723301 1718417 1719514 1720797 1731780 1739603 1738803 1734128 1738638 1755985 1769762 1763900 1754774
19542 1754774 1752205 1758694 1757530 1760723 1759760 1761613 1760523 1764438 1770314 1779725 1786798 1779624 1779647 1782357 1784959
19527 1784959 1787723 1795906 1796278 1788415 1790422 1805882 1820307 1805656 1811068 1812782 1803287 1799637 1809203
19514 1809203 1825562 1834120 1826236 1824038 1824577 1816882 1819086 1826437 1820690 1819676 1825996 1818026 1828893 1833725
19500 1833725 1836066 1838818 1847742 1863323 1878079 1877694 1877271 1877215 1871408 1871403 1883286 1885248 1878581 1867954 1875447
19485A875447k653L006Q025L388Q288O827k411O444m582j017M857O035Q020k352
19471A917322L405Q439J1578l490m603L456O542o374j345K692Q345N176N232l15
19457A956060l451p68L86n7N01J0250M003k732j0307R208J6874O692j41R977Q375
19442B004870l169P596J4036J456n319j0474P113O890m31p31N179J3705M869Q1
19428B045671j2589r73J0145l58K364L013k963R502P87m792L714J5993J4412L195
19414B087121L058l931k497N532R448Q278j709k575j802J278M603J9937O973P263
19400B140977J744l120R91r03M159K660K907m72N242P973P386R652Q91j2303O913
19385B174697L944P96l576K555J3082J2607L032P712o87k548j600J773J1858J826
$$ plain form
19485 1875447 1872794 1875800 1883825 1887213 1895501 1902328 1899917 1906361 1901779 1900762 1905619 1911654 1919674 1917322
19471 1917322 1920727 1929166 1940744 1937254 1932651 1936107 1942649 1936275 1934930 1937622 1945967 1951143 1956375 1956060
19457 1956060 1952609 1951841 1952227 1952170 1952671 1962921 1966924 1964192 1953885 1963093 1979967 1986659 1986518 1996495 2004870
19442 2004870 2001701 2009297 2023333 2024789 2019470 2008996 2016109 2022999 2022568 2021837 2027016 2040721 2045590 2045671
19428 2045671 2033082 2032109 2042254 2041896 2044260 2047273 2044310 2053812 2054599 2049807 2053521 2069514 2083926 2087121
19414 2087121 2090179 2086248 2083751 2089283 2098731 2107009 2105300 2102725 2100923 2102201 2106804 2126741 2133714 2140977
19400 2140977 2142721 2139601 2140592 2139689 2143848 2146508 2149415 2148943 2154185 2162158 2169544 2179196 2180087 2167784 2174697
19385 2174697 2178641 2179437 2175861 2178416 2191498 2204105 2207137 2214849 2214162 2211614 2210014 2211787 2223645 2225471
19371B225471k52j18J5494J0161l34P399J1J452m206J2740J1466n367j473N415
19357B277859J4404L151Q726J0269L536K1876N937Q829J0077L989Q901P506K594
19344B387654N258K3139J0684R64Q712j939J304N179J5944J8381J2266N425J9679
19331B512650J2203J1451J7424K068n434P717m294m8494m2408l1784p872q259
19319B414968j8203r751RO62l848l2969l2805k1004K300K2741K9783L2323K1009
19306B405215J4437N577P790r913L563M627m454k943j3221j3006N662J8030K5062
19293B446426J0362L937Q868J3211R997J1862J5809J9518J3646N240Q108J2412
19281B579396R243J0976J2781K1768K2808L4768K6523J3238m317m460p288k8073
$$ plain form
19371 2225471 2225219 2225101 2240595 2250756 2250422 2257821 2257832 2259284 2255078 2267818 2279284 2273917 2272444 2277859
19357 2277859 2292263 2295414 2304140 2314409 2317945 2339821 2345758 2354587 2364664 2368653 2377554 2385060 2387654
19344 2387654 2392912 2416051 2426735 2427699 2436411 2434472 2435776 2440955 2456899 2475280 2487546 2492971 2512650
19331 2512650 2524853 2536304 2553728 2555796 2550362 2558079 2553785 2505291 2462883 2431099 2423227 2414968
19319 2414968 2396765 2387014 2387023 2387685 2383837 2350868 2318063 2297059 2299359 2322100 2351883 2384206 2405215
19306 2405215 2419652 2425229 2433019 2423106 2426669 2431296 2426842 2423899 2410678 2397672 2403334 2421364 2446426
19293 2446426 2456788 2460725 2469593 2482804 2492801 2504663 2520472 2539990 2553636 2558876 2566984 2579396
19281 2579396 2588639 2599615 2612396 2634164 2656972 2691740 2718263 2731501 2727184 2722724 2715436 2687363
19269B687363k0403l6485n6961l3205J004P461j4503k2412l0208l0817n031j0599
19257B435204l0043l1841L177J9517K8311L0850K9245N598K2440Q653K2383M3468
19245B586962L2955P81m1157j6623j0821m712J6223N626J594J0157P036J7773
19233B605794N473k378J0620J2003J2627Q850J9180R109O670J6664L701O140J3239
19220B727692J9826J6871J3525J3556l661j103N856K864l616J4160J7690K1544
19208B845204L953J0419O201J1724J5788J3767K3526L080K274j0067k1436n445
19196B898988j639Q600J2940K0906O830J0457Q508j5143q135O288J5092N422J4887
19183B984001J4187j172k4114k2938L998M363J6306K1752J6527J1167O877k83
$$ plain form
19269 2687363 2666960 2630475 2573514 2540309 2541313 2548774 2534271 2511859 2481651 2450834 2445803 2435204
19257 2435204 2405161 2373320 2376497 2396014 2424325 2455175 2484420 2490018 2512458 2521111 2543494 2586962
19245 2586962 2619917 2620698 2579541 2562918 2552097 2547385 2563608 2569234 2570828 2580985 2588021 2605794
19233 2605794 2611267 2608889 2619509 2631512 2644139 2652989 2672169 2681278 2687948 2704612 2708313 2714453 2727692
19220 2727692 2747518 2764389 2777914 2791470 2787809 2786706 2792562 2795426 2791810 2805970 2823660 2845204
19208 2845204 2849157 2859576 2865777 2877501 2893289 2907056 2930582 2933662 2935936 2925869 2904433 2898988
19196 2898988 2897349 2905949 2918889 2939795 2946625 2957082 2965590 2950447 2942312 2948600 2963692 2969114 2984001
19183 2984001 2998188 2997016 2972902 2949964 2953962 2958325 2974631 2996383 3012910 3024077 3030954 3030671
19171C030671k5485k3474O03L148O556J0174K3762K9334J1126N35K275J3026O818
19158C089069k559J8005P229O521J5943J4630O187J3815J2733J5982R439J3374
19146C220368J6613O017n589J15Q411J9693J6290M398J8625J0386J0671L270j780
19133C327488P950M569K3457J2814J1167J3526J1631J712R292K828P153J2725
19121C446312R435M535J0673P922Q006P674L621K0008J5391P680pJ2107J5500
19108C568857K145k03j626R269K8546K2643N807J1285J1724J0603P817Q858J5445
19095C701170K1928R682l676o3M782J9565P816K2842J5190n41P06J8369L0065
19082C847835N361J0208J1992Q85K1691J9702J1919J5081J9254j292j603M040
$$ plain form
19171 3030671 3005186 2981712 2982315 2985463 2992019 3002193 3025955 3055289 3066415 3066950 3069225 3082251 3089069
19158 3089069 3086510 3104515 3111744 3118265 3134208 3148838 3155025 3168840 3181573 3197555 3206994 3220368
19146 3220368 3236981 3242998 3237409 3237524 3245935 3265628 3281918 3286316 3304941 3315327 3325998 3329268 3327488
19133 3327488 3335438 3340007 3363464 3376278 3387445 3400971 3412602 3414314 3423606 3426434 3433587 3446312
19121 3446312 3455747 3460282 3470955 3478877 3486883 3494557 3498178 3518186 3533577 3541257 3541250 3553357 3568857
19108 3568857 3571002 3570799 3569173 3578442 3606988 3629631 3635438 3646723 3658447 3669050 3676867 3685725 3701170
19095 3701170 3723098 3732780 3729104 3729041 3733823 3753388 3761204 3784046 3799236 3798695 3799401 3817770 3847835
19082 3847835 3853196 3863404 3875396 3876281 3897972 3917674 3929593 3944674 3963928 3962636 3961033 3965073
19070C965073L765O773K0381Q832M915J6399J2459J5763K3709Q278Q135J2252
19058D106734R256N756J0462J8052J4720J9119Q919R876R542J3448K1817J3986
19046D261687M388J5337J6787J1209J7062M833J1675J4220J2598J2278L1193K9249
19034D442516N219M037J8876L1527J1606N624J3741K3607N475J8512J827J512
19022D584079K691J2808J4393J0351J8232K8004L0354K6471K3483J9053l473k475
19010D763971R895J7682K0738K5146J5203J9132J7886L0705L0627K5236K6013
18999E002234K5811K9113K6066K0033l930r705q582J2136J8931J9030M5574M2102
18987E218813K3058K9827K7944K1673L0406K9241K5576J1027J666K4347N0857
$$ plain form
19070 3965073 3968838 3975611 3995992 4004824 4009739 4026138 4038597 4054360 4078069 4086347 4094482 4106734
19058 4106734 4115990 4121746 4132208 4150260 4164980 4184099 4193018 4202894 4212436 4225884 4247701 4261687
19046 4261687 4266075 4281412 4298199 4309408 4326470 4331303 4342978 4357198 4369796 4382074 4413267 4442516
19034 4442516 4447735 4451772 4470648 4502175 4513781 4519405 4533146 4556753 4562228 4580740 4582567 4584079
19022 4584079 4586770 4599578 4613971 4624322 4642554 4670558 4700912 4727383 4750866 4769919 4766446 4763971
19010 4763971 4773866 4791548 4812286 4837432 4852635 4871767 4889653 4920358 4950985 4976221 5002234
18999 5002234 5028045 5057158 5083224 5103257 5099327 5089622 5081040 5093176 5112107 5131137 5176711 5218813
18987 5218813 5241871 5271698 5299642 5321315 5351721 5380962 5406538 5417565 5419231 5443578 5494435
18976E494435M7690L8006J5484K2340L5107N9079P5268N3420j04603l58212k62384
18965E115630m1471J8462R3847J11861Q2619P9486Q1982N5267M0496L9225N8031
18954E735435N7320L9436L9435M3572M9398M2620M5142M6378M8877M8404M5456
18943F241473N1745N7805L7429M4226O0881N3816N3010M1670M7906M6897j5117
18932F721741q7978l5171m493K3685M8097N8760P4575P2170P0272M1442M1912
18921G025012M4101M3652M2962N4184O8250N3210M0802M3096M7966M0964L1372
18910G535571L3584M9614P5028R1972O9033L0168M4880M6454M2492P1142P4252
18899H164190M2541N6759O2593O9931N8953N8675O5308N8951N7102Q3395O7890
$$ plain form
18976 5494435 5542125 5580131 5595615 5617955 5653062 5712141 5787409 5840829 5736226 5378014 5115630
18965 5115630 5074159 5092621 5186468 5298329 5380948 5460434 5542416 5597683 5638179 5677404 5735435
18954 5735435 5792755 5832191 5871626 5915198 5964596 6007216 6052358 6098736 6147613 6196017 6241473
18943 6241473 6293218 6351023 6388452 6432678 6493559 6547375 6600385 6642055 6689961 6736858 6721741
18932 6721741 6633763 6598592 6594099 6617784 6665881 6724641 6799216 6871386 6941658 6983100 7025012
18921 7025012 7069113 7112765 7155727 7209911 7278161 7331371 7372173 7415269 7463235 7504199 7535571
18910 7535571 7569155 7618769 7693797 7785769 7854802 7884970 7929850 7976304 8018796 8089938 8164190
18899 8164190 8206731 8263490 8326083 8396014 8454967 8513642 8578950 8637901 8695003 8778398 8846288
18888H846288O8024P4569P3854P3234P2108P8331R4434J02769J07087Q7996O5222
18877I743916P8968Q2201Q3892Q0436Q5117J05612J13457Q9199M7047P5738J12302
18866A0697885J30246J26792J29043J34107J51580J21748J05923J18589J28909
18857A1844822J30907J15113J24133J43048J61252J64249J29709J47812J89995
18848A3151040J89808J74511J39062J35242J71523K00312K06191K04468K10574
18839A4782731K34342K28611J99578K46925K93238K91895J58689Q2346J62159
18830A6680514K20262K73954L23765L59069L50586L15608L56450L96920M13326
18821A9690454M11342M26492M48745M63600M91385N11167N50813O17992O39789
$$ plain form
18888 8846288 8914312 8988881 9062735 9135969 9208077 9286408 9380842 9483611 9590698 9678694 9743916
18877 9743916 9822884 9905085 9988977 10069413 10154530 10260142 10373599 10462798 10509845 10585583 10697885
18866 10697885 10828131 10954923 11083966 11218073 11369653 11491401 11597324 11715913 11844822
18857 11844822 11975729 12090842 12214975 12358023 12519275 12683524 12813233 12961045 13151040
18848 13151040 13340848 13515359 13654421 13789663 13961186 14161498 14367689 14572157 14782731
18839 14782731 15017073 15245684 15445262 15692187 15985425 16277320 16436009 16518355 16680514
18830 16680514 16900776 17174730 17498495 17857564 18208150 18523758 18880208 19277128 19690454
18821 19690454 20101796 20528288 20977033 21440633 21932018 22443185 22993998 23611990 24251779
18812B4251779O84902O76077N92902N94976P09496Q37831R25223R94339J080256
18803C1347781J216158J280837J275637J412316J581390J708036J734364J759357
18795D3315876J809754J994765K471104K996107L269891L542424L986736M512107
18787F7898764M742195N233810O541672Q178026J0858438J4530174J8795531K3119795
18779A59898405K2645130q487483j09422788j28626812n5627377k9513248j0026678
18772a59160851J1901685J9034569J7501194J3965896J1174928Q811956P096401
18765f9674222N911059M945191M153811L503561K945142K545193K443039K292711
18757d0934515K178570K090324J885319J719028J602184J423901J273845J148404
$$ plain form
18812 24251779 24936681 25612758 26205660 26800636 27510132 28347963 29273186 30267525 31347781
18803 31347781 32563939 33844776 35120413 36532729 38114119 39822155 41556519 43315876
18795 43315876 45125630 47120395 49591499 52587606 55857497 59399921 63386657 67898764
18787 67898764 72640959 77874769 84416441 92594467 103452905 117983079 136778610 159898405
18779 159898405 182543535 174056052 64633264 -63993548 -119620925 -149134173 -159160851
18772 -159160851 -147259166 -128224597 -110723403 -96757507 -85582579 -76770623 -69674222
18765 -69674222 -63763163 -58817972 -54664161 -51160600 -48215458 -45670265 -43227226 -40934515
18757 -40934515 -38755945 -36665621 -34780302 -33061274 -31459090 -30035189 -28761344 -27612940
18749b7612940J065450R25696Q81142Q59731P78510O44089O10465O46363O14186
18740b0587308O10805O29323O55534O14859N67239N58358N75447N53515N20323
18731a5301905M55083L46924K33580K21542K97886L31420L69784L90354L82677
18722a2272655L10102J38133J32908J98736K29542K54853K75486K67520K71812
18713a0193563K80623K68466K35968K18518K19926K19185K30073K00117J51707
18704h168980J30829J54481J69207J80262J97790J92991J88833J99155J80384
18695f575048J70808J62829J59564J50525J35158J19877J30645J05428J36904
18686e303310J39940J46710J45774J28127J38651J42944J46882J40178J42278
$$ plain form
18749 -27612940 -26547490 -25621794 -24740652 -23880921 -23102411 -22458322 -21847857 -21201494 -20587308
18740 -20587308 -19976503 -19347180 -18691646 -18076787 -17509548 -16951190 -16375743 -15822228 -15301905
18731 -15301905 -14846822 -14499898 -14266318 -14044776 -13746890 -13415470 -13045686 -12655332 -12272655
18722 -12272655 -11962553 -11824420 -11691512 -11492776 -11263234 -11008381 -10732895 -10465375 -10193563
18713 -10193563 -9912940 -9644474 -9408506 -9189988 -8970062 -8750877 -8520804 -8320687 -8168980
18704 -8168980 -8038151 -7883670 -7714463 -7534201 -7336411 -7143420 -6954587 -6755432 -6575048
18695 -6575048 -6404240 -6241411 -6081847 -5931322 -5796164 -5676287 -5545642 -5440214 -5303310
18686 -5303310 -5163370 -5016660 -4870886 -4742759 -4604108 -4461164 -4314282 -4174104 -4031826
18677d031826J39451J27323J23070J21745J35899J27955J32430J30925J31366
18668b861662J39586J53185J29600J24471J26844J61911J76946J59329J55679
18659a534111J67983J74499J61487J42314J56776J88508J67010J64201J46713
18650f4620J62933J89414K02898J99529K11883K43288K70256K72065K66200K52029
18640B205875K68825K96157L38517L85223M39211M86900N34057N59176N60866
18631F074807N84374P20385R21436J166445J432411J717629J790991M27634m538713
18622A0297399o669407k876881r12417M01519J849618K579321K640861J262960
18614H572973l587394o704199l123622q52643N17748K078152K988586L232797
$$ plain form
18677 -4031826 -3892375 -3765052 -3641982 -3520237 -3384338 -3256383 -3123953 -2993028 -2861662
18668 -2861662 -2722076 -2568891 -2439291 -2314820 -2187976 -2026065 -1849119 -1689790 -1534111
18659 -1534111 -1366128 -1191629 -1030142 -887828 -731052 -542544 -375534 -211333 -64620
18650 -64620 98313 287727 490625 690154 902037 1145325 1415581 1687646 1953846 2205875
18640 2205875 2474700 2770857 3109374 3494597 3933808 4420708 4954765 5513941 6074807
18631 6074807 6659181 7379566 8301002 9467447 10899858 12617487 14408478 14836112 10297399
18622 10297399 3627992 751111 -161306 240213 2089831 4669152 7310013 8572973
18614 8572973 4985579 -1718620 -4842242 -5694885 -5177137 -3098985 -110399 3122398
18606C122398K389768k242619q395041m905234j505982j16011J645157K820214
18598g187350L079223K249841j960065q549792o165198k419406j081760M59066
18590b1575441J516759J634448J443212J423563J389837J045920Q24645O63982
18582a1633075N43375M94152M70359M49685M04978L12224K35957K34967K32162
18573h255216K28424K39160K46509K27866J99831J58198J22889J40629J42031
18564f549679J45317J57008J41410J35296J42859J41905J43302J45461J17753
18555e279368J06202J13618J24793J18638R2716Q6276R7789Q6584Q6535R3976
18545d272241R4491R5418R9087R9219P0839N1249L0414M1477O8927P5163P9228
$$ plain form
18606 3122398 5512166 3269547 -5125494 -10030728 -11536710 -11652721 -10007564 -7187350
18598 -7187350 -4108127 -1858286 -3818351 -12368143 -18533341 -20952747 -22034507 -21575441
18590 -21575441 -20058682 -18424234 -16981022 -15557459 -14167622 -13121702 -12297057 -11633075
18582 -11633075 -11089700 -10595548 -10125189 -9675504 -9270526 -8958302 -8722345 -8487378 -8255216
18573 -8255216 -8026792 -7787632 -7541123 -7313257 -7113426 -6955228 -6832339 -6691710 -6549679
18564 -6549679 -6404362 -6247354 -6105944 -5970648 -5827789 -5685884 -5542582 -5397121 -5279368
18555 -5279368 -5173166 -5059548 -4934755 -4816117 -4723401 -4637125 -4539336 -4452752 -4366217 -4272241
18545 -4272241 -4177750 -4082332 -3983245 -3884026 -3813187 -3761938 -3731524 -3690047 -3621120 -3545957 -3466729
18534c466729P6114P6362P0200N5610M2384N0349N8857O8956Q5955O4032O3801
18523b754109P1772Q6049P8500N5287M8667L8674L7894N0026N0451N9672O9949
18512b107168P7224O9759O3074N9816M9114N1995O0046O2351N4971O5363O2463
18501a430992P3656P5560N5474M7809M9264M4185M6020M9818N2313O5717N9773
18490h11403M9469N4620P0933N0831P0225R0186O9072N1135O0754O9010O6229
18479a08939O6245O7080O8832P2897O2157P6327Q4551O5118P4602N9534N6227
18468F44631P9941Q0554R3369J09082Q4100O8570R7766R9842J10680J13523R8293
18457A680351O5244Q0767J20030J14632J24100J41015J53285J54413J72723J90386
$$ plain form
18534 -3466729 -3390615 -3314253 -3244053 -3188443 -3146059 -3095710 -3036853 -2967897 -2881942 -2817910 -2754109
18523 -2754109 -2682337 -2596288 -2517788 -2462501 -2413834 -2375160 -2337266 -2287240 -2236789 -2177117 -2107168
18512 -2107168 -2029944 -1960185 -1897111 -1837295 -1788181 -1736186 -1676140 -1613789 -1558818 -1493455 -1430992
18501 -1430992 -1357336 -1281776 -1226302 -1178493 -1129229 -1085044 -1039024 -989206 -936893 -871176 -811403
18490 -811403 -761934 -707314 -636381 -585550 -515325 -425139 -356067 -304932 -244178 -175168 -108939
18479 -108939 -42694 24386 93218 166115 228272 304599 389150 454268 528870 588404 644631
18468 644631 724572 805126 898495 1007577 1091677 1160247 1258013 1357855 1468535 1582058 1680351
18457 1680351 1745595 1826362 1946392 2061024 2185124 2326139 2479424 2633837 2806560 2996946
18447B996946J79050J78693J80743J94286K08709K26754K50504K98236L14419
18438E028340L20526L25336L71982M45374N60737P41705R25315J106633J171436
18429A0997384M49201k902740n622146k963139j358687m93259N30278J018847
18421c44261J098796J021212R22227Q17174P89626Q18149R01870J010428J096724
18412H131945J163027R42792o59337l674397k654558p81972n4342P49656J362114
18403D524928J617234J782502J977200K253136K569961K603558R67449o177741
18395A2118227j2647155p261035l257086j339789Q80125K082943K255584K119549
18387e048637J922825J737240J652970J673388J772834J933233K190265K343630
$$ plain form
18447 2996946 3175996 3354689 3535432 3729718 3938427 4165181 4415685 4713921 5028340
18438 5028340 5348866 5674202 6046184 6491558 7052295 7794000 8719315 9825948 10997384
18429 10997384 11446585 8543845 2921699 -41440 -1400127 -1893386 -1363108 -344261
18421 -344261 754535 1775747 2697974 3515148 4304774 5122923 6024793 7035221 8131945
18412 8131945 9294972 10237764 9578427 5904030 3249472 2467500 2413158 3162814 4524928
18403 4524928 6142162 7924664 9901864 12155000 14724961 17328519 18295968 12118227
18395 12118227 -528928 -7789963 -11047049 -12386838 -11506713 -9423770 -7168186 -5048637
18387 -5048637 -3125812 -1388572 264398 1937786 3710620 5643853 7834118 10177748
18379A0177748J743973k375710j0402848q683791l698166j768135J46028J610460
18371a3250441J965643J891462J669735J439809J206705J019709R28397Q70763
18363b258218Q50852Q61458R04713R79746J055758J124697J243314J419575J680444
18354G862339K019106K401920K690201J977063k961295j1115539q439152l286110
18346h851467j043293J257613L015187L637315L010742j286574r674441q614543
18338a8549461l413068j443664L56406J841524K198756K005747J668938J404173
18330a3930649J220259J107431J044494J006970R77151R87536R88344R55085R63306
18321d680073J101638J294238J110962p61850m461131l587768j222260l19455
$$ plain form
18379 10177748 11921721 9546011 -856837 -9540628 -13238794 -15006929 -14860901 -13250441
18371 -13250441 -11284798 -9393336 -7723601 -6283792 -5077087 -4057378 -3128981 -2258218
18363 -2258218 -1407366 -545908 358805 1338551 2394309 3519006 4762320 6181895 7862339
18354 7862339 9881445 12283365 14973566 16950629 13989334 2873795 -5565357 -8851467
18346 -8851467 -9894760 -8637147 -5621960 -1984645 1026097 -260477 -9934918 -18549461
18338 -18549461 -21962529 -23406193 -23049787 -21208263 -19009507 -17003760 -15334822 -13930649
18330 -13930649 -12710390 -11602959 -10558465 -9551495 -8574344 -7586808 -6598464 -5643379 -4680073
18321 -4680073 -3578435 -2284197 -1173235 -1935085 -6396216 -9983984 -11206244 -11525699
18313a1525699N70323J332808J616749J461914n9642l549300l449095j312278
18305a4914220n83948J41354P88223R47115Q96705P74286O47847N23551M18021
18296a0361066L06550K20355K47120K90664K68544K32758J81184N7730o5733j4177
18286h636071J14617J71580K42426K82232K87475K56970J99281j3313k44424k51264
18276g590491j31764J4786R2908J08886J30685J61079J63157J67215J59665J29257
18266f594617J16477J10924R3128Q4443R4072J00915Q9565R0036J03711J13193
18256e598153J36561J35902J25552J23712J32483J31083J11673J35247J70971
18247d394969J48119o9436m73820l81529j39964j1395R4941J67860K22757K56747
$$ plain form
18313 -11525699 -10955376 -9622568 -8005819 -6543905 -6603547 -10152847 -13601942 -14914220
18305 -14914220 -15498168 -15356814 -14568591 -13621476 -12724771 -11950485 -11302638 -10779087 -10361066
18296 -10361066 -10054516 -9834161 -9587041 -9296377 -9027833 -8795075 -8613891 -8556161 -8621894 -8636071
18286 -8636071 -8521454 -8349874 -8107448 -7825216 -7537741 -7280771 -7081490 -7094803 -7339227 -7590491
18276 -7590491 -7722255 -7707469 -7614561 -7505675 -7374990 -7213911 -7050754 -6883539 -6723874 -6594617
18266 -6594617 -6478140 -6367216 -6274088 -6189645 -6095573 -5994658 -5905093 -5815057 -5711346 -5598153
18256 -5598153 -5461592 -5325690 -5200138 -5076426 -4943943 -4812860 -4701187 -4565940 -4394969
18247 -4394969 -4246850 -4316286 -4790106 -5171635 -5311599 -5322994 -5228053 -5060193 -4837436 -4580689
18237d580689K24098P8874k95808l97054j56050k8292R1904K04524J85684j3637
18227d686446j52836j12621l21001l62616j28010l0155K6062R3277J09496J05436
18217e459414Q9744P6408O6132M4988L7130L1258L0970N6254N3404O648k466K0234
18205d948710K4219n2508q6745l9771k36J4404O0660R1820R1300O3136M9787L4611
18193d698033N028P985Q282Q976J7837M3076Q2233R5301P1667O6108M7215L9553
18181d204772M0603L0085K8942L8114J9412K6735M1950N1285M6161N4996M2023
18170c784466M3862M2808L0262K8717L8419K9957K5086J6318Q593K090j7695J1548
18158c524501J3936J3504M0758M3634N2327M1996L4862L8392O0888N4687L7185
$$ plain form
18237 -4580689 -4356591 -4277717 -4573525 -4970579 -5126629 -5154921 -5063017 -4858493 -4672809 -4686446
18227 -4686446 -4839282 -4951903 -5272904 -5635520 -5763530 -5793685 -5767623 -5674346 -5564850 -5459414
18217 -5459414 -5369670 -5293262 -5227130 -5182142 -5145012 -5113754 -5082784 -5026530 -4973126 -4966478 -4968944 -4948710
18205 -4948710 -4924491 -4976999 -5063744 -5103515 -5103751 -5089347 -5028687 -4936867 -4845567 -4782431 -4732644 -4698033
18193 -4698033 -4693005 -4685020 -4676738 -4667762 -4649925 -4606849 -4524616 -4429315 -4357648 -4291540 -4244325 -4204772
18181 -4204772 -4164169 -4134084 -4105142 -4067028 -4047616 -4020881 -3978931 -3927646 -3881485 -3826489 -3784466
18170 -3784466 -3740604 -3697796 -3667534 -3638817 -3600398 -3570441 -3545355 -3529037 -3520444 -3518354 -3536049 -3524501
18158 -3524501 -3510565 -3497061 -3456303 -3412669 -3360342 -3318346 -3283484 -3245092 -3184204 -3129517 -3092332
18147c092332M1980L8013M0710N4640M0897K7921R244L2766M9256N2414O4241
18136b640250O9789P5846Q0111P1494O9971O9586P1343Q2436R8976J07091R3733
18125a749874R7824J15404J28092J23954J31031J52326J91503K23310K69816K97323
18115a9291L33552L73976M32895N04285O40379Q54575J087856J387977J631310
18106G227514Q18506m827584r509651m298183j954243r22581N95574J208514J154164
18097a0507970R50875P57259N97222M84523L90158L41238K84397K39070K15265
18088f247963J93584J75330J53784J42179J33141J14779J01018J03976Q8451Q6154
18078d955567P7190O9081P0455N9881M9401N6496N7038M6342M9283M0577L3841
$$ plain form
18147 -3092332 -3050352 -3012339 -2971629 -2916989 -2876092 -2848171 -2838927 -2806161 -2756905 -2704491 -2640250
18136 -2640250 -2570461 -2494615 -2414504 -2343010 -2273039 -2203453 -2132110 -2049674 -1950698 -1843607 -1749874
18125 -1749874 -1652050 -1536646 -1408554 -1284600 -1153569 -1001243 -809740 -586430 -316614 -19291
18115 -19291 314261 688237 1121132 1625417 2265796 3120371 4208227 5596204 7227514
18106 7227514 8046020 3218436 -6291215 -10589398 -12543641 -13466222 -12870648 -11662134 -10507970
18097 -10507970 -9557095 -8799836 -8202614 -7718091 -7327933 -6986695 -6702298 -6463228 -6247963
18088 -6247963 -6054379 -5879049 -5725265 -5583086 -5449945 -5335166 -5234148 -5130172 -5041721 -4955567
18078 -4955567 -4878377 -4809296 -4738841 -4678960 -4629559 -4573063 -4516025 -4469683 -4420400 -4379823 -4345982
18067d345982M3966L2694L8459N0970M9372L2665K3848L3233L5808K2400K1565
18056c961002K1039K0350L5244K7542L1213L4136K7236J4202K1650L8398K8199
18045c661793K5239K5449J8755K2514L2220K8222O474j4996k1677k225J0114K0794
18033c510910K5005M4893L6061K1190k89k1837j4J1206J3648J9303K2185K5869
18021c313690K1329m921l3125j0878P580J1693J5371K9101K9972K2903n695j9642
18009c250002O07j352r673K1380K0393J8698Q325J3121K1977K2376K0759K4962
17997c088429J306j850k648R290J4078J1522J3120J8680Q019L854O575Q420N333
17984b992730Q735J704K254K453K1678J8439J6710J8876J4749J050M039O169J0448
$$ plain form
18067 -4345982 -4302016 -4269322 -4230863 -4179893 -4130521 -4097856 -4074008 -4040775 -4004967 -3982567 -3961002
18056 -3961002 -3939963 -3919613 -3884369 -3856827 -3825614 -3791478 -3764242 -3750040 -3728390 -3689992 -3661793
18045 -3661793 -3636554 -3611105 -3592350 -3569836 -3537616 -3509394 -3502920 -3517916 -3539593 -3541818 -3531704 -3510910
18033 -3510910 -3485905 -3441012 -3404951 -3383761 -3384050 -3405887 -3405901 -3394695 -3381047 -3361744 -3339559 -3313690
18021 -3313690 -3292361 -3297282 -3330407 -3341285 -3333705 -3322012 -3306641 -3277540 -3247568 -3224665 -3230360 -3250002
18009 -3250002 -3249395 -3250747 -3260420 -3239040 -3218647 -3199949 -3191624 -3178503 -3156526 -3134150 -3113391 -3088429
17997 -3088429 -3087123 -3088973 -3091621 -3082331 -3068253 -3056731 -3043611 -3024931 -3016912 -3013058 -3006483 -2998063 -2992730
17984 -2992730 -2983995 -2982291 -2980037 -2977584 -2955906 -2937467 -2920757 -2901881 -2887132 -2886082 -2882043 -2875874 -2865426
17971b865426Q946J0367M216J5246J9461Q754K638O05M816Q890K727r105M79O587
17957b780799K3664Q893k868n153J1109J1512J6790J2374N024Q219J3758J9241
17945b658236J9800J5290K87N966J5307L927J911n489K29J0515J7778K4885J7202
17932b530628K6269L417k5108n4134k4698j2215n519P363O624J7350P773M855
17920b578651J7808J0644Q231P501K753O465M3043K2892J3987J5063K6906K3027
17908b380331J7006o385m2686l0586j6250J681R509J4691K1572J0748j7636m2035
17896b460702k7937L346K0637J1032Q985K0350P701Q594N717K48N096J8472J5341
17883b363120M104J1732J1030J6046J8806J3405M755R658o066k4902l2799j0155
$$ plain form
17971 -2865426 -2856480 -2846113 -2841897 -2826651 -2807190 -2798436 -2795798 -2795193 -2790377 -2781487 -2778760 -2787865 -2787386 -2780799
17957 -2780799 -2757135 -2748242 -2751110 -2756263 -2745154 -2733642 -2716852 -2704478 -2699454 -2691235 -2677477 -2658236
17945 -2658236 -2638436 -2623146 -2622859 -2616893 -2601586 -2597659 -2595748 -2601237 -2601008 -2590493 -2572715 -2547830 -2530628
17932 -2530628 -2504359 -2500942 -2526050 -2580184 -2604882 -2617097 -2622616 -2615253 -2608629 -2591279 -2583506 -2578651
17920 -2578651 -2560843 -2550199 -2541968 -2534467 -2531714 -2525249 -2482206 -2459314 -2445327 -2430264 -2403358 -2380331
17908 -2380331 -2363325 -2369710 -2412396 -2442982 -2459232 -2457551 -2448042 -2433351 -2411779 -2401031 -2418667 -2460702
17896 -2460702 -2488639 -2485293 -2464656 -2453624 -2444639 -2424289 -2416588 -2407994 -2402277 -2402029 -2396933 -2378461 -2363120
17883 -2363120 -2359016 -2347284 -2336254 -2320208 -2301402 -2287997 -2283242 -2273584 -2279650 -2304552 -2337351 -2347506
17871b347506L374K254N022P004M861J0861R280K2955J2195J280L193J5468M87
17858b249272M228J422j345N04m90J0259J6498N361O823J0874Q859K2517J5997
17845b147765J477q911j1538m28J8223P198N189J0399K159r27K1851K2427J6948
17832b063698J1046J5342M401k1617l1919j4120J72k038K6959K5890K750l9384
17820b086216l3057N363O312J2645J4916K3901L1233R928l1258n0452l7593k5956
17808b160234p406N066P540J0675J8215K3462J6304K5646J2767J2908R318j8397
17796b044136k4108j1208O233J6847J8844J0298m450j9804j0652o563N327M339
17784b059033J2154J3924K1542K490k1451j5937m1514l8333j5742R298J6064K3637
$$ plain form
17871 -2347506 -2344132 -2341878 -2336856 -2329852 -2324991 -2314130 -2304850 -2281895 -2269700 -2268420 -2265227 -2249759 -2249272
17858 -2249272 -2245044 -2243622 -2244967 -2244463 -2244953 -2234694 -2218196 -2212835 -2206012 -2195138 -2186279 -2163762 -2147765
17845 -2147765 -2146288 -2155199 -2166737 -2167165 -2148942 -2141744 -2136555 -2126156 -2123997 -2124924 -2103073 -2080646 -2063698
17832 -2063698 -2052652 -2037310 -2032909 -2054526 -2086445 -2100565 -2100393 -2102431 -2075472 -2049582 -2046832 -2086216
17820 -2086216 -2119273 -2113910 -2107598 -2094953 -2080037 -2056136 -2024903 -2014975 -2046233 -2096685 -2134278 -2160234
17808 -2160234 -2167640 -2162574 -2155034 -2144359 -2126144 -2102682 -2086378 -2060732 -2047965 -2035057 -2025739 -2044136
17796 -2044136 -2068244 -2079452 -2073219 -2056372 -2037528 -2027230 -2031680 -2051484 -2062136 -2068699 -2063372 -2059033
17784 -2059033 -2046879 -2032955 -2011413 -2008923 -2030374 -2046311 -2087825 -2126158 -2141900 -2132602 -2116538 -2092901
17772b092901Q873P509J155J1607L372J993J0907J5620J5574R779N040l914K478
17759b002908J2938J5616L391j0310q510L212K0852o27r444j6732J6365J9022
17747a957135N521j262L515N969K731j253M568J2205P348M421j313m260J193R982
17733a907770P737P011q27l324Q45j7118J4180K7877J1558n015L348R864P814
17720a843820K254l389m090M377m068J367Q542Q362N980o103m149p721k328N326
17706a839460N491P613R238j165n012N050R548N885N664L520j2778r64M52M007
17692a802911k834K575J3072J1491k003k994M022k568J05R338J300M321L397M111
17678a759578M57L858O985J0627L117M31J0666R184J0455n486r433o372m125N31
$$ plain form
17772 -2092901 -2084028 -2076519 -2075364 -2063757 -2060385 -2058392 -2047485 -2031865 -2016291 -2006512 -2001472 -2005386 -2002908
17759 -2002908 -1989970 -1974354 -1970963 -1981273 -1989783 -1986571 -1965719 -1966346 -1975790 -1992522 -1976157 -1957135
17747 -1957135 -1951614 -1952876 -1949361 -1943392 -1940661 -1941914 -1937346 -1925141 -1917793 -1913372 -1914685 -1918945 -1917752 -1907770
17733 -1907770 -1900033 -1893022 -1893849 -1897173 -1896328 -1913446 -1899266 -1871389 -1859831 -1864846 -1861498 -1851634 -1843820
17720 -1843820 -1841566 -1844955 -1849045 -1844668 -1848736 -1847369 -1838827 -1830465 -1824485 -1830588 -1834737 -1842458 -1844786 -1839460
17706 -1839460 -1833969 -1826356 -1817118 -1818283 -1823295 -1818245 -1808697 -1802812 -1797148 -1793628 -1806406 -1807370 -1806918 -1802911
17692 -1802911 -1805745 -1803170 -1790098 -1778607 -1780610 -1783604 -1779582 -1782150 -1782045 -1772707 -1771407 -1767086 -1763689 -1759578
17678 -1759578 -1759121 -1755263 -1748278 -1737651 -1734534 -1734103 -1723437 -1714253 -1703798 -1709284 -1718717 -1725089 -1729214 -1728683
17664a728683M436k605L366Q203K0313Q389k205o031P66l061L353l145n796n425
17650a708125L1K236J4081K411o908l804n036J1178J4805M307n913j506J0432
17637a671811R239J090J655o207q47k389o066L597K015j352p383N481L735K445
17623a666798M508k588N4p486J6930J7045j334j900P169R333L539m685L925k236
17609a624524M928K664k05Q331K567r438p536l754J860R273P457j551J736M130
17595a604062L032L177l368M94l013O657Q669N738k770l427R285R364l147p060
17581a580431r121K467P570R795J73N209O161o012j20O761J322J0137J5508Q740
17567a521841j3117j5194N920m192M11O067J2595J2703j3813r811j267Q89L997
$$ plain form
17664 -1728683 -1724247 -1726852 -1723486 -1715283 -1694970 -1686581 -1688786 -1694817 -1694051 -1697112 -1693759 -1696904 -1702700 -1708125
17650 -1708125 -1708094 -1705858 -1691777 -1689366 -1696274 -1700078 -1705114 -1693936 -1679131 -1674824 -1680737 -1682243 -1671811
17637 -1671811 -1662572 -1661482 -1659827 -1666034 -1666881 -1669270 -1675336 -1671739 -1669724 -1671076 -1678459 -1672978 -1669243 -1666798
17623 -1666798 -1662290 -1664878 -1664824 -1672310 -1655380 -1638335 -1639669 -1641569 -1634400 -1625067 -1621528 -1626213 -1622288 -1624524
17609 -1624524 -1619596 -1616932 -1617137 -1608806 -1606239 -1615677 -1623213 -1626967 -1625107 -1615834 -1608377 -1609928 -1608192 -1604062
17595 -1604062 -1601030 -1597853 -1601221 -1600727 -1603740 -1597083 -1588414 -1582676 -1585446 -1588873 -1579588 -1570224 -1573371 -1580431
17581 -1580431 -1589552 -1587085 -1579515 -1569720 -1569547 -1564338 -1558177 -1564189 -1564309 -1557548 -1556226 -1546089 -1530581 -1521841
17567 -1521841 -1534958 -1550152 -1544232 -1548424 -1548013 -1541946 -1529351 -1516648 -1530461 -1540272 -1541539 -1540650 -1536653
17554a536653P346J3134n17j0994K253j241N318l533P440J9838L524k896l952
17541a500933n69N282j571p151j883J1936J992n439j70p097L607R938L106m634
17527a493586J181L921p741J2279L418J484Q955o854m041Q969J5590J018q784
17514a464191J714o069l473N618L857O633K033m979L194N963N670N252J798L477
17500a433503R114J606j3378l016J242k695N496O267O722O324N654J018Q88l808
17486a412069j3475R25O43J6836Q588j00l348o263J0212K806R76k866j420l952
17472a402507l182J675J091j054m659J4038q38L578r96N325L559l489r2J200J698
17457a384653P723J0074J0574P161k042j198k617Q950J3202o863m996L749L36
$$ plain form
17554 -1536653 -1529307 -1516173 -1516690 -1527684 -1525431 -1526672 -1521354 -1524887 -1517447 -1497609 -1494085 -1496981 -1500933
17541 -1500933 -1501502 -1496220 -1497791 -1504942 -1506825 -1494889 -1492897 -1498336 -1498506 -1505603 -1501996 -1492058 -1488952 -1493586
17527 -1493586 -1492405 -1488484 -1496225 -1483946 -1480528 -1479044 -1470089 -1476943 -1480984 -1472015 -1456425 -1455407 -1464191
17514 -1464191 -1462477 -1468546 -1472019 -1466401 -1462544 -1455911 -1453878 -1458857 -1455663 -1449700 -1444030 -1438778 -1436980 -1433503
17500 -1433503 -1424389 -1422783 -1436161 -1439177 -1437935 -1440630 -1435134 -1428867 -1422145 -1415821 -1410167 -1409149 -1408261 -1412069
17486 -1412069 -1425544 -1424619 -1423976 -1407140 -1398552 -1398652 -1402000 -1408263 -1398051 -1395245 -1394269 -1397135 -1398555 -1402507
17472 -1402507 -1405689 -1404014 -1402923 -1403977 -1408636 -1394598 -1395436 -1391858 -1392854 -1387529 -1383970 -1387459 -1387551 -1386351 -1384653
17457 -1384653 -1376930 -1366856 -1356282 -1349121 -1351163 -1352361 -1354978 -1346028 -1332826 -1339689 -1344685 -1340936 -1340600
17444a340600l857M309J3820J2176O691N440m0241m0406k1197p245K666M209J3739
17431a390496J3643Q202L748m345N515N494O105M951O206k581r619K994p4J5945
17417a334312k672J364J0576L750r34o900K838O924L051n90k600o262j866O044
17403a321589Q137L132l50j779M65m299K347j851l886K819J1540R694J216P16
17389a293688n976J763J748O800J5550J584j001j2923l939J751K408J380R912
17376a274631J5262n881j4731p106L511R486K242p76k582o724j120J021K101M74
17362a279454J8952J4194m291J151M001O780k122k324q92n150L066k964J23K070
17348a246860L43J0270K064m680l834K080j772M868J5942p617M18o078p657r867
$$ plain form
17444 -1340600 -1344457 -1340148 -1326328 -1314152 -1307461 -1302021 -1342262 -1382668 -1403865 -1411110 -1408444 -1404235 -1390496
17431 -1390496 -1376853 -1368651 -1364903 -1369248 -1363733 -1358239 -1352134 -1347183 -1340977 -1343558 -1353177 -1350183 -1350257 -1334312
17417 -1334312 -1336984 -1335620 -1325044 -1321294 -1322228 -1329128 -1326290 -1319366 -1316315 -1316905 -1319505 -1325767 -1327633 -1321589
17403 -1321589 -1313452 -1310320 -1310670 -1312449 -1311984 -1316283 -1313936 -1315787 -1319673 -1316854 -1305314 -1295620 -1294404 -1293688
17389 -1293688 -1299664 -1297901 -1296153 -1289353 -1273803 -1272219 -1273220 -1286143 -1290082 -1288331 -1285923 -1284543 -1274631
17376 -1274631 -1259369 -1265250 -1279981 -1287087 -1283576 -1274090 -1271848 -1272624 -1275206 -1281930 -1283050 -1282029 -1279928 -1279454
17362 -1279454 -1260502 -1246308 -1250599 -1249448 -1245447 -1238667 -1240789 -1243113 -1244005 -1249155 -1246089 -1249053 -1248930 -1246860
17348 -1246860 -1246517 -1236247 -1234183 -1238863 -1242697 -1240617 -1242389 -1237521 -1221579 -1229196 -1228778 -1234856 -1242513 -1252380
17334a252380Q570O510j685j05L855N359l728j3764N485J1536l622n198K059k666
17320a239774J6121J0453m386L823P753M624m68m952j0565J0531P214k916j023
17307a203565m77j1066l0k293l065L413L710K672K340P339M404j276k44Q998q087
17292a197227o974L032M381P29k756J0114r08m472q626M767J3525P20k40O048
17278a177887J1232R604n268J029M68r628j1458j2247k568J0510Q908j2907j1304
17265a201516j621L803o64K1394N040K325M165J0910P375n052j4184M37R870K246
17251a155472p324O633J548l478L925r49P32J0503Q068k242m629m305K355L437
17237a141198J974L985J1257j1721K72j816J1240l743k708p177p933o625R85P634
$$ plain form
17334 -1252380 -1243810 -1237300 -1238985 -1239090 -1235235 -1229876 -1233604 -1247368 -1241883 -1230347 -1233969 -1239167 -1237108 -1239774
17320 -1239774 -1223653 -1213200 -1217586 -1213763 -1206010 -1201386 -1201854 -1206806 -1217371 -1206840 -1199626 -1202542 -1203565
17307 -1203565 -1204042 -1215108 -1215138 -1217431 -1220496 -1217083 -1213373 -1210701 -1208361 -1201022 -1196618 -1197894 -1198138 -1189140 -1197227
17292 -1197227 -1204201 -1201169 -1196788 -1196059 -1198815 -1188701 -1189609 -1194081 -1202707 -1197940 -1184415 -1183695 -1183935 -1177887
17278 -1177887 -1166655 -1157051 -1162319 -1161290 -1160822 -1170450 -1181908 -1194155 -1196723 -1186213 -1177305 -1190212 -1201516
17265 -1201516 -1203137 -1199334 -1199998 -1178604 -1173564 -1171239 -1167074 -1156164 -1148789 -1153841 -1168025 -1167588 -1157718 -1155472
17251 -1155472 -1162796 -1156163 -1154615 -1158093 -1154168 -1155117 -1154385 -1143882 -1135814 -1138056 -1142685 -1146990 -1144635 -1141198
17237 -1141198 -1139224 -1135239 -1123982 -1135703 -1135431 -1137247 -1126007 -1129750 -1132458 -1139635 -1147568 -1154193 -1153208 -1145574
17223a145574N06J2719K334q854j092J306N276Q498M96Q98J009N093J182q337
17209a124540J308l988j406J3101l889j5129J1523L598l28P993M336p693l816
17196a118930n04J419J0668R395N279J0522k133r718p407p090k0089L754M775
17183a120059J7763J9464k783n757P841l852M087k645q986L133O541J5668K123
17170a067462j1908J53N020J2532p332j1121k123J1563J3441Q47q438k0602J483
17157a083947N406J1481J184K37J913J696l550J0029O426l20J926k762q988l703
17143a062972p168m343j251R371J964Q224J0125M970K914n376r344q784j707K82
17129a063095N781R534j328K981J220k685q174k610J0845J0223K827r150o93j43
$$ plain form
17223 -1145574 -1145068 -1132349 -1130015 -1138869 -1139961 -1138655 -1133379 -1124881 -1124385 -1123487 -1122478 -1117385 -1116203 -1124540
17209 -1124540 -1123232 -1127220 -1128626 -1115525 -1119414 -1134543 -1123020 -1119422 -1119750 -1111757 -1107421 -1115114 -1118930
17196 -1118930 -1119434 -1118015 -1107347 -1097952 -1092673 -1082151 -1084284 -1094002 -1101409 -1108499 -1128588 -1124834 -1120059
17183 -1120059 -1102296 -1082832 -1085615 -1091372 -1083531 -1087383 -1083296 -1085941 -1094927 -1091794 -1085253 -1069585 -1067462
17170 -1067462 -1079370 -1079217 -1074197 -1061665 -1068997 -1080118 -1082241 -1070678 -1057237 -1056390 -1064828 -1085430 -1083947
17157 -1083947 -1078541 -1067060 -1065876 -1065639 -1063726 -1062030 -1065580 -1055551 -1049125 -1049445 -1047519 -1050281 -1059269 -1062972
17143 -1062972 -1070140 -1074483 -1075734 -1066363 -1064399 -1056175 -1046050 -1041080 -1038166 -1043542 -1052886 -1061670 -1063377 -1063095
17129 -1063095 -1057314 -1047780 -1049108 -1046127 -1044907 -1047592 -1055766 -1058376 -1047531 -1037308 -1034481 -1043631 -1044324 -1044467
17115a044467L471J304j975O253R364k433R440k965r830m46Q371k49q94k558K431
17100a025183j8399R60N1K756J0687J2807K379J38N079P481j0104p377j196K082
17086a017839L622j252p21L74K17N064N426o71p16Q935L744j0849j2104k909Q882
17071a010797Q171m753N786n00m755k496R631J301K233P715j184r907J064R114
17057i89377K003Q280N489m322l223k525j3184j0301p814J5796J8231L653n65
17044i77859R4n290r623j167O017O747l020k48Q499Q61M65K790j3732j355L237
17029i83584O009Q533L464k757J591m241l474M43L035L689n192M25N44r408l374
17014i84297M558Q646O104j546O483j312R693J232l780R28J135K748j401m224
$$ plain form
17115 -1044467 -1040996 -1039692 -1041667 -1035414 -1026050 -1028483 -1019043 -1022008 -1031838 -1032284 -1023913 -1024162 -1025056 -1027614 -1025183
17100 -1025183 -1043582 -1042622 -1042571 -1039815 -1029128 -1016321 -1013942 -1013804 -1008725 -1001244 -1011348 -1018725 -1019921 -1017839
17086 -1017839 -1014217 -1015469 -1016190 -1015816 -1015599 -1010535 -1005109 -1005780 -1006496 -997561 -993817 -1004666 -1016770 -1019679 -1010797
17071 -1010797 -1002626 -1007379 -1001593 -1002093 -1006848 -1009344 -999713 -998412 -996179 -988464 -989648 -999555 -998491 -989377
17057 -989377 -987374 -979094 -973605 -977927 -981150 -983675 -996859 -1007160 -1014974 -999178 -980947 -977294 -977859
17044 -977859 -977765 -983055 -992678 -993845 -987828 -981081 -984101 -984349 -975850 -974989 -974524 -971734 -985466 -986821 -983584
17029 -983584 -977575 -969042 -965578 -968335 -966744 -970985 -974459 -974016 -970981 -967292 -972484 -972059 -971515 -980923 -984297
17014 -984297 -979739 -971093 -964989 -966535 -960052 -961364 -951671 -950439 -954219 -953291 -952156 -949408 -950809 -955033
17000i55033L499M910O186O54r69j3088j123J1479P880J32r408m514n026n008
16986i59429J055K4669o144o531k666j249N741J076o389L508O951K130n522L932
16972i38868Q233k040k459j1261j0044M840K3048J3391k869k067k468j45k441
16959i25150R805N72n801n691o053n315o933L720L426P143j675j2260M359J0445
16945i29408L142j4145L828K343J449J0704R072j3408j3843r591M240N158N460
16932i34999K471J0185K382M5j537j70P205o406q998m437J6511N817J940j918
16918i11909L80M26L56j3m724P538M805n576J820M099R259p912p281k536J66O223
16902i04879J1512p143n955J269P406k07l095J568k990N633n478r473M700N44
$$ plain form
17000 -955033 -951534 -946624 -940438 -939784 -940753 -953841 -954964 -943485 -935605 -935473 -944881 -949395 -954421 -959429
16986 -959429 -958374 -933705 -939849 -946380 -949046 -950295 -944554 -943478 -949867 -946359 -939408 -937278 -942800 -938868
16972 -938868 -930635 -932675 -935134 -946395 -956439 -951599 -928551 -915160 -918029 -920096 -922564 -922709 -925150
16959 -925150 -915345 -914773 -920574 -926265 -932318 -937633 -944566 -940846 -937420 -930277 -931952 -944212 -939853 -929408
16945 -929408 -926266 -940411 -936583 -934240 -932791 -922087 -913015 -926423 -940266 -949857 -945617 -940459 -934999
16932 -934999 -932528 -922343 -919961 -919916 -921453 -921623 -914418 -920824 -929822 -934259 -917748 -911931 -909991 -911909
16918 -911909 -911529 -911103 -910747 -910760 -915484 -907946 -903141 -908717 -906897 -902798 -893539 -901451 -908732 -911268 -911102 -904879
16902 -904879 -893367 -900510 -906465 -905196 -897790 -897997 -901092 -899524 -902514 -896881 -902359 -911832 -907132 -906588
16888i06588N494j127K842Q158J4311n389l721k881K167K535n262m914l66k577
16874h97318O419O65R519J0724m232P840J083j1482J730j669q303j1209O327N019
16860h84887j1399o245J5444M598o0q366K348O66M083k8N39m124l82P086R304
16845h71423J4313L657p520j2069J326J635O79K690K011K881M123P417r610r324
16831h69214l014k672j31p448M29J8968l132M503R096P53K073M439J205m493q781
16816h57419j287Q651K782q417q912o322j734N687Q786P848o325k735J6702j165
16802h43860J190j0505p442J5358R80j196Q012j608q54o095k304J905j719j1893
16788h60031M140J201l563N848N39m332K931J9142j555q705l429J3595J893J6
$$ plain form
16888 -906588 -901094 -902221 -899379 -891221 -876910 -882299 -886020 -888901 -886734 -884199 -889461 -894375 -894741 -897318
16874 -897318 -890899 -890234 -880715 -869991 -874223 -866383 -865300 -876782 -875052 -876721 -885024 -896233 -889906 -884887
16860 -884887 -896286 -902531 -887087 -882489 -882549 -890915 -888567 -887901 -883818 -883846 -883307 -887431 -887813 -880727 -871423
16845 -871423 -857110 -853453 -860973 -873042 -871716 -870081 -869402 -866712 -864701 -861820 -857697 -850280 -859890 -869214
16831 -869214 -872228 -874900 -875031 -882479 -882050 -863082 -866214 -861711 -852615 -851862 -849789 -845350 -844145 -848638 -857419
16816 -857419 -858706 -850055 -847273 -855690 -864602 -870924 -872658 -866971 -858185 -850337 -856662 -859397 -842695 -843860
16802 -843860 -842670 -853175 -860617 -845259 -844279 -845475 -837463 -839071 -839925 -846020 -848324 -846419 -848138 -860031
16788 -860031 -855891 -854690 -858253 -852405 -851866 -856198 -853267 -834125 -835680 -844385 -847814 -834219 -832326 -832310
16774h32310q337k936M916j898O121M755n211M159M753M15K330q933J51J173J0916
16759h19936M347j906o167j3458o41j403l909n715N615J4024J3649J699J324R431
16745h03046l741j4434j0215L942Q682k405o877J059N685K976j6152N437O389
16732h22700o460P696L585j020k152o116J3138J4048n083k565M187p486p11N47
16718h11092q818p157J726Q350J4804L275j0387r615J0693J2536m259j177j2433
16705h13554M11P176O82l420N368M197l221L967K908L366J656n177n769j197j1358
16690h13965R306P909J440O310j068j0626O865O728q891l557j944l37J2376M54
16676g89000j0192o873j998k792R69m724J546K0731Q792L269M04n507K890R537
$$ plain form
16774 -832310 -840647 -843583 -838667 -840565 -834444 -829689 -834900 -830741 -825988 -825573 -823243 -832176 -832025 -830852 -819936
16759 -819936 -815589 -817495 -823662 -837120 -837761 -839164 -843073 -848788 -843173 -829149 -815500 -813801 -812477 -803046
16745 -803046 -806787 -821221 -831436 -827494 -818812 -821217 -828094 -827035 -821350 -818374 -834526 -829089 -822700
16732 -822700 -829160 -821464 -817879 -818899 -821051 -827167 -814029 -799981 -805064 -807629 -803442 -810928 -811639 -811092
16718 -811092 -819910 -827067 -825341 -816991 -802187 -798912 -809299 -818914 -808221 -795685 -799944 -801121 -813554
16705 -813554 -813143 -805967 -805285 -808705 -803337 -799140 -802361 -798394 -795486 -792120 -790464 -795641 -801410 -802607 -813965
16690 -813965 -804659 -796750 -795310 -789000 -790068 -800694 -793829 -787101 -795992 -799549 -801493 -801830 -789454 -789000
16676 -789000 -799192 -806065 -808063 -810855 -809886 -814610 -813064 -792333 -783541 -780272 -779868 -785375 -782485 -772948
16662g72948N668p146l087P811J827m809k966N041p175k622J0179k236k400l176
16648g78039k770Q848l302j0468L976O296j4306j447J1842M246n657l378J1010
16635g73149M376r136j73m69n156K723j579M878N958O712m514K081N469J643l575
16620g63911L604j4522r217N898Q492M820l221q047o72J628j0401K876O901k408
16606g78180R43M487J0641L984j731n679L434M604k469M804J421r872r690l613
16592g76916l486J4385J2101o160m751M154P91j54j0402O879J1216K805p288k157
16578g58983k544O829K459N971q149j435O679j41R691P330q03k934j7924q707
16564g62661M343R827L674P766J1410o15K142j4825j1749J1725N484r80m695l948
$$ plain form
16662 -772948 -767280 -774426 -777513 -769702 -767875 -772684 -775650 -770609 -777784 -780406 -770227 -772463 -774863 -778039
16648 -778039 -780809 -771961 -775263 -785731 -781755 -775459 -789765 -791212 -779370 -775124 -780781 -784159 -773149
16635 -773149 -768773 -777909 -778082 -778551 -783707 -780984 -782563 -777685 -771727 -765015 -769529 -767448 -761979 -760336 -763911
16620 -763911 -760307 -774829 -784046 -778148 -769656 -764836 -768057 -776104 -776776 -775148 -785549 -782673 -775772 -778180
16606 -778180 -777237 -772750 -762109 -758125 -759856 -765535 -762101 -757497 -759966 -755162 -753741 -763613 -773303 -776916
16592 -776916 -780402 -766017 -753916 -760076 -764827 -760673 -759882 -760036 -770438 -763559 -752343 -749538 -756826 -758983
16578 -758983 -761527 -754698 -752239 -746268 -754417 -755852 -749173 -749314 -739623 -732293 -733096 -736030 -753954 -762661
16564 -762661 -758318 -748491 -744817 -737051 -725641 -726256 -724114 -738939 -750688 -738963 -733479 -734459 -739154 -743102
16550g43102M657n861K211K885k277k008m062J875N819Q543O119n560m824o577
16536g42162r225L121J134J1352J638l187j514M816L930K613j5496j0256Q554
16523g44682K3150J4250R165l460q046j3181j0210K03J978J0168M079K687P338
16510g06561l585k635m089q893P745J1511l152n422o760j3129r482N20J0301N669
16496g27962J0628M182r70j307k393K548n198n949p442j0598J976Q409J5709j659
16482g20026r940J2750K776M056N252J837o882m24l319m682m217R715J777n994
16468g17321N383N779K26m71n512j2982p692Q699J3803o556o746K178L559Q437
16454g09216K856j2098k43N325l769k88m413O827P696Q689q864j0208L530l791
$$ plain form
16550 -743102 -738445 -744306 -742095 -739210 -741487 -743495 -747557 -745682 -739863 -731320 -725201 -730761 -735585 -742162
16536 -742162 -751387 -748266 -747132 -735780 -734142 -737329 -738843 -734027 -730097 -727484 -742980 -753236 -744682
16523 -744682 -721532 -707282 -698117 -701577 -709623 -722804 -733014 -732811 -730833 -720665 -716586 -713899 -706561
16510 -706561 -710146 -712781 -716870 -725763 -718018 -706507 -709659 -715081 -721841 -734970 -744452 -743932 -733631 -727962
16496 -727962 -717334 -713152 -714122 -715429 -717822 -715274 -720472 -726421 -733863 -744461 -742485 -734076 -718367 -720026
16482 -720026 -729966 -717216 -714440 -710384 -705132 -703295 -710177 -710601 -713920 -718602 -722819 -713104 -711327 -717321
16468 -717321 -711938 -706159 -705933 -706404 -711916 -724898 -732590 -723891 -710088 -716644 -723390 -721212 -717653 -709216
16454 -709216 -706360 -718458 -718701 -713376 -717145 -717433 -721846 -715019 -707323 -698634 -707498 -717706 -714176 -717967
16440g17967P46O695K175k297R132K968l67R568l797p790L51j2816j7659k922
16426g33980J7981J011L633m551M668N410p121m163k016J1516j870q718N218o408
16412g19390p564L043R722J3039Q161k637j4194n583J3171k437Q976J4070L91
16399f81232j018J113N373K723k393l688n292n933K329j601P588r30j1103M237
16385f89827P946j107j1706j1858j505k551P613J583K081K350L65L975L460Q259
16371f80922J417M703j057q558l940M779N040M187L41j269p656r36j5k940K101
16356f84725J2202N40j6140l437J261J4242L365j0867k242m636p109R833J1704
16343f76009K84Q272K255J248j1J2017j0390j3759L547M445q479q026N281P703
$$ plain form
16440 -717967 -717221 -710526 -708351 -710648 -701516 -698548 -698915 -689347 -693144 -700934 -700583 -713399 -731058 -733980
16426 -733980 -715999 -714988 -711355 -715906 -711238 -705828 -712949 -717112 -719128 -707612 -709482 -718200 -712982 -719390
16412 -719390 -726954 -723911 -714189 -701150 -692989 -695626 -709820 -715403 -702232 -704669 -695693 -681623 -681232
16399 -681232 -682250 -681137 -675764 -673041 -675434 -679122 -684414 -690347 -688018 -689619 -682031 -682961 -694064 -689827
16385 -689827 -681881 -682988 -694694 -706552 -708057 -710608 -702995 -701412 -699331 -696981 -696616 -692641 -689181 -680922
16371 -680922 -679505 -674802 -675859 -684417 -688357 -683578 -678538 -674351 -674010 -675279 -682935 -683871 -683886 -686826 -684725
16356 -684725 -672523 -671983 -688123 -691560 -690299 -676057 -672692 -683559 -685801 -690437 -697546 -687713 -676009
16343 -676009 -675725 -667453 -665198 -663950 -663961 -651944 -662334 -676093 -672546 -668101 -676580 -684606 -679325 -671622
16329f71622L311M306l260k269N94l32J014r33j1012P017k84j182Q809k541m513
16314f72897L138R97q419N125J2612O918J0544L816n309o706j9058M815J042N354
16300f58028J982k809k3L99m792l649R255J0349k158r92m772r164k816R126L541
16285f54551J89l448l362j563J0234k418j820R113o92k861o110L081N376m370
16271f53202k565k190K190l45N859N672k614k839l017k622K266M966L814J989
16257f42638O007j106o682P302p368j3830J911L892N714P409q535k61k154k753
16243f53092P902o47n077p877P795R427P217q419k748M647K858L953M888k268
16229f31441N39n400j6190O398P974q107L373j121J5683J485l51m699k896L493
$$ plain form
16329 -671622 -668311 -664005 -667265 -669534 -668940 -669272 -668258 -669191 -680203 -673186 -673470 -674652 -665843 -668384 -672897
16314 -672897 -669759 -668762 -677181 -672056 -659444 -652526 -641982 -638166 -643475 -650181 -669239 -664424 -663382 -658028
16300 -658028 -656046 -658855 -658878 -658479 -663271 -666920 -657665 -647316 -649474 -650466 -655238 -664402 -667218 -658092 -654551
16285 -654551 -654362 -657810 -661172 -662735 -652501 -654919 -656739 -647626 -648318 -651179 -657289 -654208 -648832 -653202
16271 -653202 -655767 -657957 -655767 -656112 -650253 -644581 -647195 -650034 -653051 -655673 -653407 -648441 -644627 -642638
16257 -642638 -636631 -637737 -644419 -637117 -644485 -658315 -656404 -652512 -646798 -639389 -647924 -648185 -650339 -653092
16243 -653092 -645190 -645837 -650914 -658791 -650996 -641569 -634352 -642771 -645519 -640872 -638014 -634061 -629173 -631441
16229 -631441 -630902 -636302 -652492 -646094 -638120 -646227 -642854 -643975 -628292 -626807 -627158 -631857 -634753 -631260
16215f31260P214o552j584O852k99o244n601l920l103N555N164J438N791M125
16201f22424o381j4428j208R36J075N477j210J352L037o261O64J6900O218l959
16187f20212N108o58J972J400l716k02L802j3629p314k688k100m735K235n382
16173f46119o679P846o782N76Q603O395Q636M337N863l811m29m935o195K764J046
16158f28884l917J1961J001K14l91P30k539M544K745j92n070j379K517J1339o210
16143f13531o574M228p97n884N959J37O017P679l277l461m231O969J8030L308
16129e85428n226k870L010m66n701k783m587J728l803k220k921j2679j802j440
16115f27188J0822J0660M397j640o760p136N264o16N471O767l249n537r002L70
$$ plain form
16215 -631260 -624046 -630598 -632182 -625330 -625629 -631873 -637474 -641394 -644497 -638942 -633778 -632340 -626549 -622424
16201 -622424 -628805 -643233 -644441 -643505 -642430 -636953 -638163 -636811 -633774 -640035 -639371 -622471 -616253 -620212
16187 -620212 -615104 -615762 -613790 -612390 -616106 -616308 -612506 -626135 -633449 -636137 -638237 -642972 -640737 -646119
16173 -646119 -652798 -644952 -651734 -651158 -642555 -636160 -627524 -623187 -617324 -621135 -621564 -626499 -632694 -629930 -628884
16158 -628884 -632801 -620840 -619839 -619625 -620016 -619286 -621825 -617281 -614536 -614728 -619798 -621177 -618660 -607321 -613531
16143 -613531 -620105 -615877 -616674 -622558 -616599 -616462 -610445 -602766 -606043 -609504 -613735 -606766 -588736 -585428
16129 -585428 -590654 -593524 -590514 -590980 -596681 -599464 -604051 -602323 -606126 -608346 -611267 -623946 -625748 -627188
16115 -627188 -616366 -605706 -601309 -602949 -609709 -616845 -611581 -612197 -606726 -599959 -603208 -608745 -617747 -617377
16101f17377M104k487L320N085J2878M879m42j2686m541P902M761j392L670n133
16087e97459k023l081l642j754P130P339r79q457o842Q892O550N008K00j282k10
16072e90610j2434o185O354J190Q44N545L921n577r04L977P340j488l724j566
16058e93317l106P378J2706Q373p28j0097j1158K4k21j0038o181j480J2830N002
16044e90013j65m605p318j609K037N010o78l193K909m80N660K805j723o924k761
16029f01048J0252M206k593M582j235o410J296J4632l297p866R12j0043l327J4579
16015e85360Q369O208q690j2252m432r256L875Q59P525L179K984L814P177K135
16001e73865k022M55N885J269K553m612l065L82j295j436r48J0663O148J854m286
$$ plain form
16101 -617377 -613273 -615760 -612440 -607355 -594477 -589598 -590040 -602726 -607267 -599365 -594604 -595996 -592326 -597459
16087 -597459 -599482 -602563 -606205 -607959 -600829 -593490 -594469 -602926 -609768 -600876 -594326 -589318 -589118 -590400 -590610
16072 -590610 -603044 -609229 -602875 -601685 -600841 -595296 -591375 -596952 -597856 -593879 -586539 -588027 -591751 -593317
16058 -593317 -596423 -589045 -576339 -567966 -568694 -578791 -589949 -589925 -590146 -600184 -606365 -607845 -595015 -590013
16044 -590013 -590178 -594783 -602101 -603710 -601673 -596663 -597341 -600534 -597625 -598105 -592445 -589640 -591363 -598287 -601048
16029 -601048 -590796 -586590 -589183 -584601 -585836 -592246 -590950 -576318 -579615 -587481 -586569 -596612 -599939 -585360
16015 -585360 -576991 -570783 -579473 -591725 -596157 -605413 -601538 -600679 -593154 -589975 -586991 -583177 -576000 -573865
16001 -573865 -575887 -575432 -569547 -568278 -565725 -570337 -573402 -573020 -574315 -575751 -576699 -566036 -559888 -558034 -562320
15986e62320K916J969n727o492P16k311J969P87M550Q421j668k4155m533K899
15972e82979J893O310J2935r758r441k207K71K440M446K742R26J165k559n023
15958e78839J83L282M525j1760r181L794J0573l92l910m16J2573K699q684j051
15944e76604Q526K783J968r094J104L821n162r382O073N995j78l881m4j336P305
15929e68106k518j426J149J2224l048O418R311q72K324Q29l253O721n915p162
15915e53324m714O038m454K218j791j0783K076K424L849K088n50K184N901M865
15901e43973j045l112o269p55L331M775r46q594p726n144o904Q409M851m564k655
15886e70321R066O505P599l495j1675j0206j954P309J0504J515r981J0985J2590
$$ plain form
15986 -562320 -559404 -557435 -563162 -569654 -568938 -571249 -569280 -568493 -563943 -555522 -557190 -581345 -585878 -582979
15972 -582979 -581086 -574776 -561841 -571599 -581040 -583247 -582976 -580536 -576090 -573348 -572422 -571257 -573816 -578839
15958 -578839 -578656 -575374 -570849 -582609 -591790 -587996 -577423 -577815 -581725 -582141 -569568 -566869 -575553 -576604
15944 -576604 -568078 -565295 -563327 -572421 -571317 -567496 -572658 -582040 -575967 -569972 -570150 -574031 -574075 -575411 -568106
15929 -568106 -570624 -572050 -570901 -558677 -561725 -555307 -545996 -546868 -544544 -543715 -546968 -540247 -546162 -553324
15915 -553324 -558038 -552000 -556454 -554236 -556027 -566810 -564734 -562310 -558461 -556373 -556923 -554739 -548838 -543973
15901 -543973 -545018 -548130 -554399 -555154 -551823 -547048 -547994 -556588 -564314 -569458 -576362 -567953 -563102 -567666 -570321
15886 -570321 -561255 -554750 -547151 -550646 -562321 -572527 -574481 -567172 -556668 -555153 -565134 -554149 -541559
15873e41559l111J565j2788N978m55j5603l662N240J0398J457k633l155k640k393
15859e63361J0901P465J3501M603j1749j1362n145O02k395j890Q804j1169o93
15846e61888r91j683N998Q772J5034m243q44J798K627n436o028J4591J272k022
15832e33043j468O881n281k2728l311o5k246J3191J2314m421j5292M015L74K56
15818e50824L557M293N822j81j902q2n903N119M616l277q73P83j924j418p667
15803e49861J696Q358M394o517N243P139J147R564J402j0408M463N010k922k239
15789e23531k508k372o325o885j0243L841N698R907L899O58j508k507q113L129
15775e36860J2655O41p030K44p972q460O599o069o900J4302N229j131p366o917
$$ plain form
15873 -541559 -544670 -543105 -555893 -549915 -550370 -565973 -569635 -564395 -553997 -552540 -555173 -558328 -560968 -563361
15859 -563361 -552460 -544995 -531494 -526891 -538640 -550002 -555147 -554545 -556940 -558830 -550026 -561195 -561888
15846 -561888 -562879 -564562 -558564 -549792 -534758 -539001 -539845 -538047 -535420 -540856 -546884 -532293 -531021 -533043
15832 -533043 -534511 -527630 -532911 -555639 -558950 -559015 -561261 -548070 -535756 -540177 -555469 -551454 -551080 -550824
15818 -550824 -547267 -542974 -537152 -537333 -539235 -539317 -545220 -540101 -535485 -538762 -539635 -538852 -540776 -542194 -549861
15803 -549861 -548165 -539807 -535413 -541930 -536687 -529548 -528401 -518837 -517435 -527843 -523380 -518370 -521292 -523531
15789 -523531 -526039 -528411 -534736 -541621 -551864 -548023 -542325 -532418 -528519 -527861 -529369 -531876 -539989 -536860
15775 -536860 -524205 -523564 -530594 -530350 -538322 -546782 -540183 -546252 -553152 -538850 -533621 -534752 -542118 -549035
15761e49035N537P979N29k20J163N86R77J727K441n12q521j407J629R415Q972
15746e18740l202J894J3455j838j6030p446j15j334J875R923J1761r82j9465r886
15732e40130j277N037l119R111J4573O452j724n202l810O689J844P383k02j3928
15718e18303j5440r04J6357m263j0772o797Q434l403k673P830J1400O960O448
15705e05126p23K13r271k91j482K343J85j1176N945J7833N803L010m977J688J961
15690d94065j8446q651L192P406k821k092o041P955J0903R217n961N374j0233
15677e04263j691m375N64Q427J110r728K224K698q80q17N346J634o510k185J6992
15662d91454Q862K474j0802j5976K50j1928j5961p874n148J1113K343L674R758
$$ plain form
15761 -549035 -543498 -535519 -534990 -535210 -534047 -533461 -532484 -530757 -528316 -528828 -537349 -538756 -537127 -527712 -518740
15746 -518740 -521942 -520048 -506593 -508431 -524461 -531907 -532022 -533356 -531481 -521558 -509797 -510779 -530244 -540130
15732 -540130 -541407 -536370 -539489 -530378 -515805 -509353 -511077 -516279 -520089 -513400 -511556 -504173 -504375 -518303
15718 -518303 -533743 -534647 -518290 -522553 -533325 -540122 -531688 -535091 -537764 -529934 -518534 -511574 -505126
15705 -505126 -505849 -505636 -514907 -515198 -516680 -514337 -514152 -525328 -519383 -501550 -495747 -492737 -497714 -496026 -494065
15690 -494065 -512511 -521162 -517970 -510564 -513385 -515477 -521518 -513563 -502660 -493443 -499404 -494030 -504263
15677 -504263 -505954 -510329 -509765 -501338 -500228 -509956 -507732 -505034 -505914 -506731 -501385 -499751 -506261 -508446 -491454
15662 -491454 -482592 -480118 -490920 -506896 -506646 -518574 -534535 -542409 -547557 -536444 -534101 -530427 -520669
15649e20669N98M643J875J657n669j046N759m13p160p336P041J1631l616o039
15635e18744k775J1853N878r618o407P259N419K405n948K33J1425j959m150j780
15621e06909N024n406O032P720o78m212p668k776M434P01R54O23L119J2076P40
15606d86226K932p752r956p040P430j452j5518N78l051P889O976o597m682P022
15592e09447J2525L175R92m255l729N525J77k840n592j685l343M397m35q32K252
15577e03115P435K034k754r493o125o286j274P621J2863J1976O982p063n465L094
15563d89570o05p381L680p447p452J767N193J032n555M104K650P486L317K209
15549d86572O66L690j279p511J276j831m342l305l833L803O628O145p381j3831
$$ plain form
15649 -520669 -520071 -515428 -513553 -511896 -517565 -518611 -512852 -513265 -520425 -527761 -520720 -509089 -512705 -518744
15635 -518744 -521519 -509666 -503788 -513406 -519813 -512554 -507135 -504730 -510678 -510445 -499020 -500979 -505129 -506909
15621 -506909 -501885 -507291 -501259 -493539 -494217 -498429 -506097 -508873 -504439 -503738 -502784 -502161 -499042 -486966 -486226
15606 -486226 -483294 -491046 -501002 -508042 -500612 -502064 -517582 -517004 -520055 -512166 -505190 -511787 -516469 -509447
15592 -509447 -496922 -493747 -492755 -497010 -500739 -495214 -495037 -497877 -503469 -505154 -508497 -504100 -504535 -505367 -503115
15577 -503115 -495680 -493646 -496400 -505893 -512018 -518304 -519578 -511957 -499094 -487118 -480136 -487199 -492664 -489570
15563 -489570 -490175 -497556 -493876 -501323 -508775 -507008 -501815 -500783 -506338 -502234 -499584 -492098 -488781 -486572
15549 -486572 -485906 -482216 -483495 -491006 -489730 -491561 -495903 -499208 -503041 -499238 -492610 -486465 -493846 -507677
15535e07677o520j138p621L70M433J3512M068R21j920j883J499L17O804J0867
15521d83968J877O264J768k781j7385o22J1348Q647p222j780R590O525k226j1498
15507d81463j2224J888J690M009M253j1411l456j630K926K382M180k184M635Q519
15493d77886M805J203P594r556j1237o9L058m574p67O201N683L569l574m721n313
15478d85584l495J387P790j0259M72J4373m467j124O786K779L518m411q561J589
15464d79207J0900N582m049L968J526J180j364n603n257j910o051N201N192j130
15450d71022m399J0142N949m245j6779m580R54m782l105p854k534L651j060O192
15436d93472N650N917O793p118L314N959q130k807o435M384Q728O256m61m327
$$ plain form
15535 -507677 -514197 -515335 -522956 -522586 -518153 -504641 -500573 -499652 -501572 -503455 -501956 -501639 -494835 -483968
15521 -483968 -482091 -475827 -474059 -476840 -494225 -494847 -483499 -474852 -482074 -483854 -474264 -467739 -469965 -481463
15507 -481463 -493687 -491799 -490109 -486100 -481847 -493258 -496714 -498344 -495418 -493036 -488856 -491040 -486405 -477886
15493 -477886 -473081 -471878 -464284 -473840 -485077 -485146 -482088 -486662 -487429 -481228 -475545 -471976 -475550 -480271 -485584
15478 -485584 -489079 -487692 -479902 -490161 -489689 -475316 -479783 -480907 -474121 -471342 -467824 -472235 -480796 -479207
15464 -479207 -468307 -462725 -466774 -462806 -461280 -460100 -461464 -467067 -472324 -474234 -480285 -475084 -469892 -471022
15450 -471022 -475421 -465279 -459330 -463575 -480354 -484934 -483980 -488762 -491867 -499721 -502255 -498604 -499664 -493472
15436 -493472 -487822 -481905 -475112 -482230 -478916 -472957 -481087 -483894 -490329 -485945 -477217 -470961 -471422 -475749
15422d75749R753K07j0890L480J0968J5036J136j6865n399r52K092k156Q546O267
15408d54526L532m943j3168O686j193j2849k857J55N449O849k047j2217J083R697
15394d70349l385p024K405q463J640O549K801J68J647M716R977L840r892l47j843
15379d67560l225P164M312L220p960L526j0107K094M056P756q943l750L967L102
15365d62348M093O93M10r25q534j2518O000L350n939P291J1145L71k037j1086
15351d70034m094O242L131R557J781m925m424j960q87m805N356K392O758j79J968
15336d54123R963L195L922J551K410k683j8317j7146P092L039k320j106R220l604
15322d58907n184R08J2169q43j0071n186J1610J1470j5496l511N370K1050Q46
$$ plain form
15422 -475749 -465996 -465789 -476679 -473199 -462231 -447195 -446059 -462924 -468323 -469275 -467183 -469339 -460793 -454526
15408 -454526 -450994 -455937 -469105 -462419 -463612 -476461 -479318 -479163 -473714 -466865 -468912 -481129 -480046 -470349
15394 -470349 -473734 -480758 -478353 -486816 -485176 -478627 -475826 -475658 -474011 -469295 -459318 -455478 -465370 -465717 -467560
15379 -467560 -470785 -463621 -459309 -456089 -464049 -460523 -470630 -468536 -464480 -456724 -465667 -469417 -465450 -462348
15365 -462348 -458255 -457562 -457152 -458077 -466611 -479129 -473129 -469779 -475718 -468427 -457282 -456911 -458948 -470034
15351 -470034 -474128 -467886 -464755 -455198 -453417 -458342 -462766 -464726 -465613 -470418 -465062 -462670 -455912 -456091 -454123
15336 -454123 -444160 -440965 -437043 -435492 -433082 -435765 -454082 -471228 -464136 -461097 -463417 -464523 -455303 -458907
15322 -458907 -464091 -463183 -451014 -451857 -461928 -467114 -455504 -444034 -459530 -463041 -457671 -436621 -435775
15309d35775j8o422j0532q859M843L029R45J516q229J486J942k145J2265k308
15295d48262q040n672P457O624P642j489j3437j6390j280Q075P192n067l513Q900
15281d57260P431m826o957p467n062k082N805P365J974J2125n169Q086J817n516
15267d49736j046j554J437M218L054m77J21p606j3811r766K62O567J931J1479
15253d54927J3404R067j1044j3303R15m707p032Q305N581R755N176J539J863k940
15239d38348k648L377k086M254R042J788j811j4046j775M442j454n73r976K567
15225d47247J2785L721n755L935J0399j254p499q929j416L153n41j0504L547k761
15211d48366N268R289O046j1104o245O19M040K717q436j006M163O803N290P037
$$ plain form
15309 -435775 -435793 -442215 -452747 -461606 -456763 -453734 -452789 -451273 -459502 -458016 -456074 -458219 -445954 -448262
15295 -448262 -456302 -461974 -454517 -447893 -440251 -441740 -455177 -471567 -472847 -464772 -457580 -462647 -466160 -457260
15281 -457260 -449829 -454655 -461612 -469079 -474141 -476223 -470418 -463053 -461079 -448954 -454123 -446037 -444220 -449736
15267 -449736 -450782 -452336 -450899 -446681 -443627 -444104 -443983 -451589 -465400 -475166 -474904 -468337 -466406 -454927
15253 -454927 -441523 -432456 -443500 -456803 -455888 -460595 -467627 -459322 -453741 -443986 -438810 -437271 -435408 -438348
15239 -438348 -440996 -437619 -439705 -435451 -426409 -424621 -426432 -440478 -442253 -437811 -439265 -439838 -449814 -447247
15225 -447247 -434462 -430741 -436496 -432561 -422162 -423416 -430915 -439844 -441260 -438107 -438648 -449152 -445605 -448366
15211 -448366 -443098 -433809 -427763 -438867 -445112 -444493 -440453 -437736 -446172 -447178 -443015 -436212 -430922 -423885
15197d23885j853l113p643o844m62R092J293P63R53N234p313j935p219j646o226
15182d50804j0150L864M451Q473J473P986K005p366j0058j012J4444l172n690
15169d45556Q004J5355J0749j2316n824o236J0599L579r55r776r670j711k880
15156d46638Q755K681j203n277Q302K539l364n430n680k365J3496L503n017o518
15142d42216K238L076j766N855R119j576m189l91N125L267k828m512j541K890
15128d27449j487j102j0150J46J0226L713r430P239l610k153Q753O012m073K25
15114d23140o184p432m213R422J3134j038k913J28l438j383O440l863M972k216
15100d21724M87l806k918q19P704j0805j2806J3172k329n014q544O101P042M460
$$ plain form
15197 -423885 -425738 -428851 -436494 -443338 -443800 -434708 -433415 -432652 -431699 -426465 -433778 -435713 -442932 -444578 -450804
15182 -450804 -460954 -457090 -452639 -444166 -442693 -434707 -432702 -440068 -450126 -451138 -436694 -439866 -445556
15169 -445556 -437552 -422197 -411448 -423764 -429588 -435824 -425225 -421646 -422601 -432377 -442047 -443758 -446638
15156 -446638 -437883 -435202 -436405 -441682 -433380 -430841 -434205 -439635 -445315 -447680 -434184 -430681 -435698 -442216
15142 -442216 -439978 -436902 -438668 -432813 -423694 -425270 -429459 -429850 -424725 -421458 -424286 -428798 -430339 -427449
15128 -427449 -428936 -430038 -440188 -440042 -429816 -426103 -435533 -428294 -431904 -434057 -425304 -419292 -423365 -423140
15114 -423140 -429324 -436756 -440969 -431547 -418413 -419451 -422364 -422236 -425674 -427057 -420617 -424480 -419508 -421724
15100 -421724 -421237 -425043 -427961 -428780 -421076 -431881 -444687 -431515 -433844 -438858 -447402 -441301 -434259 -429799
15086d29799p65j925q28Q31j747M564N824O456k718j5367j2009k939Q028J6619
15072d25775J6785N251l963k106L416m623j83K678r665n717L269l953J517M150
15058d18919J37N354l432j0922n927n132J6062R480M428r58k357j3988j034N564
15044d21644M749l015J467N520O086L620l519k337N071P044K201r245p809l998
15030d15809J2935Q154l904l176K481P754l102m478O503J4028N90j0890m573J926
15016c91561j382K687r14O125N047m453Q386M474J1734R069L966N148J5783J8905
15002c06986K5080J3834m8701j15176o0743l3714j5786P153K4730K2866M372J5634
14990d67437L089l120k973P431J5383M377N966N218l653L851j3319o802J440L189
$$ plain form
15086 -429799 -430564 -432489 -433317 -432486 -434233 -429669 -423845 -417389 -420107 -435474 -447483 -450422 -442394 -425775
15072 -425775 -408990 -403739 -407702 -409808 -406392 -411015 -411198 -408520 -418185 -423902 -420633 -424586 -423069 -418919
15058 -418919 -418782 -413428 -416860 -427782 -433709 -438841 -422779 -413299 -408871 -409829 -412186 -426174 -427208 -421644
15044 -421644 -416895 -419910 -418443 -412923 -406837 -403217 -406736 -409073 -404002 -396958 -394757 -404002 -411811 -415809
15030 -415809 -402874 -394720 -398624 -401800 -399319 -391565 -394667 -399145 -392642 -378614 -378024 -388914 -393487 -391561
15016 -391561 -392943 -390256 -391170 -385045 -379998 -384451 -376065 -371591 -359857 -350788 -346822 -341674 -325891 -306986
15002 -306986 -281906 -268072 -316773 -431949 -492692 -526406 -542192 -535039 -510309 -487443 -483071 -467437
14990 -467437 -464348 -467468 -470441 -463010 -447627 -443250 -437284 -432066 -435719 -431868 -445187 -451989 -450549 -447360
14976d47360J5573J60m702N250O666J2495n672j1992o274O663l77q880n218J07
14962d43561N832P75Q512J1370p287q43j521O5M588p682L424R487J2341J846o873
14947d09527q537L898Q263O165j846l433k23Q505j28o388k280N455j823q070j1102
14932d21071n683J1563q54p926l416N809P967J1372j502m945l834p76k92J154
14918d12434k278p855j31l016O605R064r223j2595p044N271J802P831Q448J772
14904d13783q36O91M336l864R57K874R97j6175j9553Q145J4011K0214k048J902
14890d02132P300n459j3603n55M299J312m249n401K10J3611Q79o066M471q651
14876d14034j1544j1135k116J2739J0641J0661p14L62m748J784K0062J0627n346
$$ plain form
14976 -447360 -431787 -431627 -436329 -431079 -424413 -411918 -417590 -429582 -435856 -429193 -429570 -438450 -443668 -443561
14962 -443561 -437729 -436954 -428442 -417072 -424359 -425202 -426723 -426658 -422070 -429752 -426328 -416841 -404500 -402654 -409527
14947 -409527 -418064 -414166 -405903 -399738 -401584 -405017 -405240 -396735 -396863 -403251 -405531 -400076 -401899 -409969 -421071
14932 -421071 -426754 -415191 -416045 -423971 -427387 -421578 -413611 -402239 -403741 -408686 -412520 -413296 -413588 -412434
14918 -412434 -414712 -422567 -422698 -425714 -419109 -410045 -419268 -431863 -438907 -433636 -431834 -424003 -415555 -413783
14904 -413783 -414619 -413928 -409592 -413456 -412499 -409625 -408628 -424803 -444356 -436211 -422200 -401986 -404034 -402132
14890 -402132 -394832 -400291 -413894 -414449 -410150 -408838 -413087 -418488 -418278 -404667 -403788 -409854 -405383 -414034
14876 -414034 -425578 -436713 -438829 -426090 -415449 -404788 -405502 -405140 -409888 -408104 -388042 -377415 -382761
14863c82761p841r140J89j1187j3935p74J1161K442M895N008K599o582j2253J1238
14849d06941J4996M921j0781m065j1050O80J0811J037j448k732N835q27p480L686
14835d03358k225q16n192j1P795k872p948L241P317M746K130j3297M115N728o375
14820d07022M971L673M662M36J090k675j497M044q887j1818n354R82M365J958
14806d11072k570J3280o119K202J0914O55J393o946K994L621K948j599o472q409
14792d05180k412N125L432L680K727O970l166O196J0369p979k890K113q649J188
14778c88476j677l818J918n176o714J3740J15j0087j1767j332J7898K1065O299
14765c68012p977k8065q991N336P545L148k155q23n76j042N703K461K337N751
$$ plain form
14863 -382761 -390602 -399742 -399553 -410740 -424675 -425449 -414288 -411846 -406951 -401943 -399344 -405926 -418179 -406941
14849 -406941 -391945 -387024 -397805 -401870 -412920 -412240 -401429 -400392 -401840 -404572 -398737 -399564 -407044 -403358
14835 -403358 -405583 -406399 -411591 -411602 -403807 -406679 -414627 -411386 -404069 -399323 -397193 -410490 -406375 -400647 -407022
14820 -407022 -402051 -398378 -393716 -393280 -392190 -394865 -396362 -392318 -401205 -413023 -418377 -417395 -413030 -411072
14806 -411072 -413642 -400362 -406481 -404279 -393365 -392710 -391317 -398263 -395269 -391648 -388700 -390299 -396771 -405180
14792 -405180 -407592 -402467 -399035 -395355 -392628 -385658 -388824 -382628 -372259 -380238 -383128 -381015 -389664 -388476
14778 -388476 -390153 -393971 -392053 -397229 -403943 -390203 -390088 -400175 -411942 -413274 -395376 -374311 -368012
14765 -368012 -375989 -404054 -413045 -407709 -400164 -397016 -399171 -399994 -400570 -401612 -395909 -393448 -391111 -385360
14751c85360q173o86J1458k431J519m906j1965k120m81p01Q205M292O46J742p757
14736c96718J834k070M548Q319l319n094J1457J0817l072j1114L281P107n505
14723c79529j983O543n370Q5j171N029m419r711J825L11k657k624M940N972J681
14708c81078K77k359K59q518L273O006K119O153J0074o362j2689m580L674O704
14694c77047J47L11K883p698l008k028o955m824J0182J0255m41k276N376K234
14680c72889J910j950l046o132L77M402j304N74M173m572J086O483M171k621q64
14665c70202o675p370j524m409M694J0403l076m624j1058p253O128N526p85O547
14651c83678m886j145K171N727k287m653P992M728o261L733J0524m46N737p315
$$ plain form
14751 -385360 -393533 -394219 -382761 -385192 -383673 -388579 -400544 -402664 -403145 -403846 -395641 -391349 -390703 -388961 -396718
14736 -396718 -394884 -396954 -392406 -384087 -387406 -392500 -381043 -370226 -373298 -384412 -381131 -374024 -379529
14723 -379529 -381512 -374969 -380339 -380254 -381425 -376396 -380815 -390526 -388701 -388390 -391047 -393671 -388731 -382759 -381078
14708 -381078 -380801 -383160 -382901 -391419 -388146 -382140 -380021 -373868 -363794 -370156 -382845 -387425 -383751 -377047
14694 -377047 -376900 -376589 -373706 -381404 -384412 -386440 -393395 -398219 -388037 -377782 -378223 -380499 -375123 -372889
14680 -372889 -370979 -372929 -375975 -382107 -381730 -377328 -378632 -378058 -373885 -378457 -377371 -370888 -366717 -369338 -370202
14665 -370202 -376877 -384247 -385771 -390180 -385486 -375083 -378159 -382783 -393841 -401094 -394966 -389440 -390225 -383678
14651 -383678 -388564 -389709 -387538 -381811 -384098 -388751 -380759 -376031 -382292 -378559 -368035 -368481 -362744 -370059
14637c70059J022n934o561p710n913r51J096J035m071l047m877J0519Q105p961
14623c95307L453M67n63O32M198J2855Q326k446j7073m879L320J350N992L532
14609c76143Q119K641j526p709r585j1813R71P173j570N464P003n45q413O703
14595c79230N318n414l929P3N360K441J354p528k922J0356K302j318j2612L17
14581c85432J7563M956j488L437r487q182l36k953O092K425q65j147K225J825
14567c71367k1j619k950K530k113r324j425j612M341L856J0534J352R00L959k067
14552c65026l383j65j8705m409J3132J1019j394o413M335o740n833K880K676L736
14538c74290k408k790N312J736M591P225K171j290j5528k941n324P66J5130R625
$$ plain form
14637 -370059 -369037 -374971 -381532 -389242 -395155 -396106 -395010 -393975 -398046 -401093 -405970 -395451 -387346 -395307
14623 -395307 -391854 -391387 -391950 -391318 -387120 -374265 -365939 -368385 -385458 -390337 -387017 -385667 -379675 -376143
14609 -376143 -368024 -365383 -366909 -374618 -384203 -396016 -395045 -387872 -389442 -383978 -376975 -377520 -385933 -379230
14595 -379230 -373912 -379326 -383255 -383182 -377822 -375381 -374027 -381555 -384477 -374121 -371819 -373137 -385749 -385432
14581 -385432 -367869 -362913 -364401 -360964 -370451 -378633 -378969 -381922 -375830 -373405 -374270 -375417 -373192 -371367
14567 -371367 -371388 -373007 -375957 -373427 -375540 -384864 -386289 -387901 -383560 -379704 -369170 -367818 -366918 -362959 -365026
14552 -365026 -368409 -368574 -387279 -391688 -378556 -367537 -368931 -375344 -371009 -377749 -383582 -380702 -378026 -374290
14538 -374290 -376698 -379488 -374176 -372440 -367849 -360624 -358453 -359743 -375271 -378212 -383536 -382770 -367640 -358015
14524c58015j270m438k0181q921J3293R447M52N921O574J2972n10j2943n31J5196
14510c42954M829r164j5421j6183J0732J5684M137j0705j056m621J840J1299k831
14497c54414k1083j2014L776M025K326n80j419k068Q664K855M48Q071M775j083
14483c57721j098j3630j6887J78Q268J7459Q683P67j0679n036R307J2494l714
14470c51609r552N015j2322o150J1574P858q762j8889j69J7099J2419J0569p056
14457c49975l755J1146n815n664q897m346l577J0373J0544k22j743m039p905M976
14443c58899m021o58N975M792m645o126n878P298L372K172j1615q321n128M879
14429c76803O488K634J2763N234J961J3183n503k3372J951N071Q46L213q60K207
$$ plain form
14524 -358015 -359285 -363723 -383904 -392825 -379532 -370085 -369633 -363712 -357138 -344166 -344676 -357619 -358150 -342954
14510 -342954 -338125 -347289 -362710 -378893 -368161 -352477 -348340 -359045 -360101 -364722 -362882 -351583 -354414
14497 -354414 -375497 -387511 -383735 -379710 -377384 -377964 -379383 -381451 -372787 -369932 -369484 -361413 -356638 -357721
14483 -357721 -358819 -372449 -389336 -389158 -380890 -363431 -354748 -353981 -364660 -369696 -360389 -347895 -351609
14470 -351609 -361161 -356146 -368468 -374618 -363044 -355186 -363948 -382837 -383006 -365907 -353488 -342919 -349975
14457 -349975 -353730 -342584 -348399 -354063 -362960 -367306 -370883 -360510 -349966 -350188 -351931 -355970 -363875 -358899
14443 -358899 -362920 -363578 -357603 -352811 -357456 -363582 -369460 -362162 -358790 -356618 -368233 -376554 -381682 -376803
14429 -376803 -370315 -367681 -354918 -349684 -347723 -334540 -340043 -363415 -361464 -356393 -355547 -352334 -353194 -350987
14415c50987L53N177K252j0735r821p085m327l472O332M554P082N061L196m201
14401c56621L093L620j1880m809k190N894P046P560j1389q601M337J5647K811
14388c45482m844m16l284l177j0073p341L058R559R23M700M30m907j830K241P83
14373c59660K540J0682k147q930M363q392o13M661j021m865j1931n534M799J2829
14359c63219J892O128M2N087l524L154J6293j458j223q04m47q979j4832r837r8
14344c71825J4597J0510q931K902Q221m497P242Q772o515j0681L897m824n175
14331c56307q061j173k097M996R47r150Q49K604O395N460L76N843J3232m845k570
14316c43501M544j0630l413K384n011L879r1k098J477n136k825n336j567N91R633
$$ plain form
14415 -350987 -350634 -345457 -343205 -353940 -363761 -370846 -375173 -378645 -372313 -367759 -360677 -355616 -352420 -356621
14401 -356621 -353528 -349908 -361788 -366597 -368787 -362893 -355847 -348287 -359676 -368277 -363940 -348293 -345482
14388 -345482 -350326 -350742 -354026 -357203 -367276 -374617 -371559 -362000 -361077 -356377 -355947 -360854 -362684 -360443 -359660
14373 -359660 -357120 -346438 -348585 -357515 -353152 -361544 -362157 -357496 -358517 -363382 -375313 -380847 -376048 -363219
14359 -363219 -361327 -355199 -355157 -350070 -353594 -350440 -334147 -335605 -336828 -337632 -338079 -347058 -361890 -371727 -371825
14344 -371825 -357228 -346718 -355649 -352747 -344526 -349023 -341781 -333009 -339524 -350205 -346308 -351132 -356307
14331 -356307 -364368 -365541 -367638 -362642 -361695 -370845 -369996 -367392 -360997 -355537 -355161 -349318 -336086 -340931 -343501
14316 -343501 -338957 -349587 -353000 -350616 -355627 -351748 -351839 -353937 -352460 -357596 -360421 -365757 -367324 -366733 -357100
14301c57100J14q899P787O604M604n179n381J781O96J2256K441n500l271J041
14287c48006r410K368R337O620J251o221r648k33Q596L233m705q310p04j0401
14273c66233k060J42m136O449L919J1943L601l498L2J6018o248j2873K545O872
14259c43527m977n293J897J1073J2555K879l424j1153K058m100n010j2339J330
14246c58031Q761P706M235J308p406m574o223n856K483K48J8652M969Q53L276
14232c29599N113q120r869O925k602o805J0418l001j4246M844R891J468J778n171
14218c38976q242o788j205Q249J2753J475M426j253q20l136j292P08O804l947
14204c31244q761r191k095N75J1512k137j4943m54R170L242J3865P912j1482k762
$$ plain form
14301 -357100 -356986 -365885 -358098 -351494 -346890 -352069 -357450 -355669 -354973 -342717 -340276 -345776 -349047 -348006
14287 -348006 -357416 -355048 -345711 -339091 -337840 -344061 -353709 -353942 -345346 -342113 -346818 -355128 -355832 -366233
14273 -366233 -368293 -368151 -372287 -365838 -361919 -349976 -346375 -349873 -349841 -333823 -340071 -352944 -350399 -343527
14259 -343527 -348504 -353797 -351900 -340827 -328272 -325393 -328817 -339970 -337912 -342012 -347022 -359361 -358031
14246 -358031 -349270 -341564 -337329 -336021 -343427 -348001 -354224 -360080 -357597 -357349 -338697 -333728 -332875 -329599
14232 -329599 -324486 -332606 -342475 -335550 -338152 -344957 -334539 -337540 -351786 -346942 -337051 -335583 -333805 -338976
14218 -338976 -347218 -354006 -355211 -346962 -334209 -332734 -328308 -329561 -330381 -333517 -334809 -334101 -327297 -331244
14204 -331244 -340005 -349196 -351291 -350716 -339204 -341341 -356284 -356738 -347568 -344326 -330461 -322549 -334031 -336793
14190c36793L384r429l919l616P748J2200N601n311m915k271R117N18j1779l203
14176c42668N458O630j0150k671J2036p407n308N248j524O074l479j2698K601
14163c47858N622j0057p180R279N456L143J96m874K354J5556l069N595l438l329
14149c32604m900K891R23q966P216P948k526q720J039N445p548L200j255L363
14135c34494M742j228M46m534p365J975J4088Q691n471j4342J03J5434L758l130
14121c21327r825l857J0194M957m636q573j321K880J847Q117N459k746q477n547
14107c32855j67M280M75l598l069k147L821k163r433k191j621o658j55j308L174
14092c53615J632l606J8043J6633m135n975q264J637O278O695O807j0509m688
$$ plain form
14190 -336793 -333409 -342838 -346757 -350373 -342625 -330425 -324824 -330135 -335050 -337321 -328204 -327686 -339465 -342668
14176 -342668 -337210 -330580 -340730 -343401 -331365 -338772 -344080 -338832 -340356 -334282 -337761 -350459 -347858
14163 -347858 -342236 -352293 -359473 -350194 -344738 -341595 -341399 -346273 -343919 -328363 -331432 -325837 -329275 -332604
14149 -332604 -337504 -334613 -333690 -342656 -335440 -327492 -330018 -338738 -337699 -332254 -339802 -336602 -337857 -334494
14135 -334494 -329752 -330980 -330534 -335068 -342433 -340458 -326370 -317679 -323150 -337492 -337389 -321955 -318197 -321327
14121 -321327 -331152 -335009 -324815 -319858 -324494 -333067 -334388 -331508 -329661 -321544 -316085 -318831 -327308 -332855
14107 -332855 -333022 -328742 -328267 -331865 -334934 -337081 -333260 -335423 -344856 -347047 -348668 -355326 -355481 -356789 -353615
14092 -353615 -351983 -355589 -337546 -320913 -325048 -331023 -339287 -337650 -331372 -324677 -317870 -328379 -333067
14079c33067n773m876l119N247N708j1107O325J4525O243J900j2189j1436l388
14066c45007J647O327Q768J5237q098q085m623j484Q227J076Q585O540m746o126
14052c21762L47j92k52Q09K348j4268j3489J944O038J0786K941n639r620n173
14038c45182j588M708M617k136k050P072r40j0626j931J740P603j999p25p394
14024c48831J98J0016P480N345n59n170m59N227o413K771J3732k632q588o986
14010c34869k490k87n71N104J3347o881m080L649R269l07j3939n530k276K498
13996c37363J2082o193p389J367O712R96K706r4K037L403m734q045k007O372M38
13981c29712M755j152j201q404L979K619n73j850J314m107l203J2006K403L240
$$ plain form
14079 -333067 -338840 -343716 -346835 -341588 -335880 -346987 -340662 -326137 -319894 -317994 -330183 -341619 -345007
14066 -345007 -343360 -337033 -328265 -313028 -321126 -329211 -333834 -335318 -327091 -326015 -317430 -310890 -315636 -321762
14052 -321762 -321415 -321607 -321859 -321050 -318702 -332970 -346459 -344515 -338477 -327691 -324750 -330389 -340009 -345182
14038 -345182 -346770 -342062 -337445 -339581 -341631 -334559 -335499 -346125 -348056 -346316 -338713 -340712 -341437 -348831
14024 -348831 -348633 -338617 -331137 -325792 -326351 -331521 -331980 -326753 -333166 -330395 -316663 -319295 -327883 -334869
14010 -334869 -337359 -337646 -338217 -333113 -319766 -326647 -330727 -327078 -317809 -318116 -332055 -337585 -339861 -337363
13996 -337363 -325281 -331474 -338863 -337496 -330784 -329788 -327082 -327176 -325139 -321736 -326470 -334515 -336522 -330150 -329712
13981 -329712 -324957 -326109 -327310 -335714 -331735 -329116 -329689 -331539 -330225 -334332 -337535 -325529 -323126 -319886
13967c19886K284J0208K654j4148r812L776o38M960l811l581j108l442J934K596
13953c28014N886O02Q2O232L988q135l666n405N443J1392J770N710l371q291q479
13938c24256N20j962n075P930M048R639k84m299O271l503j1567l116k132o144
13924c33930P713R341K127M807m13l107L604p440j7213N118k936r392L443J0857
13910c27421R656K61j518j2906j5224M206N784O708K450J0063O824j195j7110
13897c29422k440J535J0148R329Q776j3943k5950M03J2533M154l33J105p615l440
13883c35160J0013R214N336j0368o378r296M360J0695L476n827R504J66j2015
13870c26280j994K888l933m714J588o745k400K241J2186O132Q724R15L166M705
$$ plain form
13967 -319886 -317602 -307394 -304740 -318888 -328700 -324924 -325562 -320602 -324413 -327994 -329102 -332544 -330610 -328014
13953 -328014 -322128 -321526 -321444 -315212 -311224 -319359 -323025 -328430 -322987 -311595 -309825 -304115 -307486 -315777 -324256
13938 -324256 -323736 -325698 -330773 -322843 -318795 -309156 -309440 -313739 -307468 -310971 -322538 -325654 -327786 -333930
13924 -333930 -326217 -316876 -314749 -309942 -310355 -313462 -309858 -317298 -334511 -329393 -332329 -341721 -338278 -327421
13910 -327421 -317765 -317504 -319022 -331928 -347152 -342946 -337162 -330454 -328004 -317941 -311117 -312312 -329422
13897 -329422 -331862 -330327 -320179 -310850 -302074 -316017 -341967 -341564 -329031 -324877 -325210 -324105 -331720 -335160
13883 -335160 -325147 -315933 -310597 -320965 -327343 -336639 -332279 -321584 -318108 -323935 -314431 -314265 -326280
13870 -326280 -328274 -325386 -329319 -334033 -332445 -339190 -341590 -339349 -327163 -321031 -312307 -311392 -308226 -303521
13856c03521N118J517k159q375o664K933K936o752j1055J1623q63O59r779J1911
13842c12471K966j0612j0095O13Q425Q337j467p235n222j38K076J805o701m255
13828c33974K601k285k945J0369J526M07p90l873m243P599m310J911m863R89L363
13813c28518q761L584J2014L161r641j994j310l437J498Q758n37K81P629J3550
13799c03723P596r301L0M293q60j2200r179m253J589R637P411l250o116m521J0397
13784c12450J0652J411l300m711m250n353Q6j746m839N62L372J295L790K968K705
13769c09808l407j7367p46O833R594R556m73p313n670J0552m025j3465K29N979
13755c19531R471J186L894O517j2829m432J405r880N274N781k819K505k192q000
$$ plain form
13856 -303521 -298403 -296886 -299045 -307420 -314084 -311151 -308215 -314967 -326022 -314399 -315262 -314603 -324382 -312471
13842 -312471 -309505 -320117 -330212 -329599 -321174 -312837 -314304 -321539 -326761 -326899 -324823 -323018 -329719 -333974
13828 -333974 -331373 -333658 -336603 -326234 -324708 -324301 -325091 -328964 -333207 -325608 -329918 -328007 -332870 -331881 -328518
13813 -328518 -337279 -333695 -321681 -318520 -328161 -330155 -331465 -334902 -333404 -324646 -325183 -324902 -317273 -303723
13799 -303723 -296127 -305428 -305398 -301105 -301965 -314165 -323344 -327597 -326008 -316371 -308960 -312210 -318326 -322847 -312450
13784 -312450 -301798 -300387 -303687 -308398 -312648 -318001 -317915 -319661 -324500 -323938 -320566 -319271 -315481 -312513 -309808
13769 -309808 -313215 -330582 -331328 -324495 -314901 -305345 -305818 -313131 -318801 -308249 -312274 -325739 -325510 -319531
13755 -319531 -310060 -308874 -304980 -298463 -311292 -315724 -314319 -324199 -318925 -313144 -315963 -313458 -315650 -323650
13741c23650j713k649J2007N943P37K285m695j0113o153m076N317J174N598J364
13727c18624o453J021J314K145J437K661K73K965L356o50m79l21L9q12l259J0337
13711c05050P241p24l45j0757m495P672N387K247o597j3216L662J2973N192L51
13697b96459o128k970r92r86j0825j803P71J0135k055q318m628j15R71l955j506
13682c28863J3349R518K581r116L413J0535m166j5671p38Q954p399L521m304R043
13668c09343M880N151p449L70Jn530K382l409j192m391n86K816J0235O435M445
13653b95185j0710k846K078N599k024N58n854l831P194L34K473L352j046o407
13639c06315k122n581m599J6672J0485k130j2536j4295j073k45k394J068Q401
$$ plain form
13741 -323650 -325363 -328012 -316005 -310062 -309325 -307040 -311735 -321848 -328001 -332077 -326760 -325586 -319988 -318624
13727 -318624 -325077 -324056 -322742 -320597 -319160 -316499 -316226 -313261 -309905 -310555 -311034 -311355 -311316 -312128 -315387 -305050
13711 -305050 -297809 -298533 -298878 -309635 -314130 -306458 -301071 -298824 -305421 -318637 -314975 -302002 -296810 -296459
13697 -296459 -302587 -305557 -306549 -307535 -318360 -320163 -319392 -309257 -311312 -319630 -324258 -324373 -323402 -327357 -328863
13682 -328863 -315514 -305996 -303415 -312531 -309118 -298583 -302749 -318420 -319158 -310204 -317603 -314082 -318386 -309343
13668 -309343 -304463 -299312 -306761 -306391 -306390 -311920 -309538 -312947 -314139 -318530 -319116 -316300 -306065 -299630 -295185
13653 -295185 -305895 -308741 -306663 -301064 -303088 -302530 -308384 -312215 -305021 -304687 -302214 -298862 -299908 -306315
13639 -306315 -308437 -314018 -318617 -301945 -291460 -293590 -306126 -320421 -321494 -321739 -324133 -323065 -314664
13626c14664P275k770O065k019j495Q375P020L966r147l510o986k105k913j331
13612c14239K078k017N523J9804N9l267j1100q320j961R43J3920O513j829K938
13598b90955O560n912k197J671o591j0923m628j3865J338J0521L396o397K973
13585c15009j702N488P996L964j174R257P373j507j5830n105Q759K630k92p558
13571c02710q500J2109Q466n701K360J4729p693j067M134n721j984l119O88k155
13557b96164L884j77L013j427o477n930l479K831j294m106L823j532j199k54L075
13542c05413J141N104P45j115o965p338Q60N807m301k795L707J0600N81R565L238
13527b86579K710j427p622j2302l106m202n194q59J8132P646l784q17Q239p127
$$ plain form
13626 -314664 -307389 -310159 -304094 -306113 -307608 -299233 -292213 -288247 -297394 -300904 -307890 -309995 -312908 -314239
13612 -314239 -312161 -314178 -308655 -288851 -288792 -292059 -303159 -311479 -313440 -312497 -298577 -292064 -293893 -290955
13598 -290955 -284395 -290307 -292504 -290833 -297424 -308347 -312975 -326840 -325502 -314981 -311585 -317982 -315009
13585 -315009 -316711 -311223 -303227 -299263 -300437 -291180 -283807 -285314 -301144 -306249 -297490 -294860 -295152 -302710
13571 -302710 -311210 -299101 -290635 -296336 -293976 -279247 -286940 -288007 -283873 -289594 -291578 -294697 -294009 -296164
13557 -296164 -292280 -292457 -289444 -290871 -297348 -303278 -306757 -303926 -305220 -309326 -305503 -307035 -308234 -308488 -305413
13542 -305413 -304272 -299168 -298423 -299538 -306503 -313841 -312981 -307174 -311475 -314270 -310563 -299963 -299382 -289817 -286579
13527 -286579 -283869 -285296 -292918 -305220 -308326 -312528 -317722 -318581 -300449 -292803 -296587 -297404 -289165 -296292
13513b96292k298l861j786j5098N577J7171Q808o490m963m357j800K833m396P061
13499b99891O517J775j2592o523M215M923J079L900O122k083j0146j930k329o19
13485c07582k886P186J547n884j640N975P688j749K339r8l076M69K714r159j4745
13470c18901M564J0597n218J1990M94R630J234r256j869l337l144P693O253K883
13456b86387j645j2124q063n533K961N258J4749J3089l825o649J62l270l651J807
13442b93121K255J501J05j2343l974O157Q253K314j1252M07N663o766o311L525
13428c03587L405Q37k67K028M458k046J22j070N713k093q556L07m88j1181P19
13413c11699R695Q430p94j506J1106J0949P419j0144J800p163j6721L540J3570
$$ plain form
13513 -296292 -298590 -302451 -304237 -319335 -313758 -296587 -287779 -294269 -299232 -303589 -305389 -302556 -306952 -299891
13499 -299891 -293374 -291599 -304191 -310714 -306499 -301576 -300497 -296597 -290475 -292558 -302704 -304634 -306963 -307582
13485 -307582 -310468 -303282 -301735 -307619 -309259 -303284 -295596 -297345 -295006 -295104 -298180 -297711 -294997 -304156 -318901
13470 -318901 -314337 -303740 -308958 -296968 -296474 -286844 -285610 -294866 -296735 -300072 -303216 -295523 -289270 -286387
13456 -286387 -288032 -300156 -308219 -313752 -310791 -305533 -290784 -277695 -281520 -288169 -288007 -291277 -294928 -293121
13442 -293121 -290866 -289365 -289260 -301603 -305577 -299420 -291167 -288853 -300105 -299698 -294035 -300801 -307112 -303587
13428 -303587 -300182 -299345 -299612 -297584 -293126 -295172 -295050 -296120 -290407 -292500 -301056 -300749 -301237 -312418 -311699
13413 -311699 -302004 -293574 -294368 -295874 -284768 -273819 -266400 -276544 -274744 -281907 -298628 -295088 -281518
13400b81518J2952O065Q900j269j0019j0965Q78j6668q370r205j651J2071K919
13387b95880M514N003m165m476J1403L750j0152M037N609M191J1136l862j3242
$$ plain form
13400 -281518 -268566 -262501 -253601 -254870 -264889 -275854 -274976 -291644 -300014 -309219 -310870 -298799 -295880
13387 -295880 -291366 -286363 -290528 -295004 -283601 -279851 -290003 -285966 -280357 -276166 -265030 -268892 -282134
$$ [...]
##END NTUPLES=NMR SPECTRUM
##END=
