##TITLE=Analysis number 317969
Compound Code cc 48746
Book Reference 473/77
Project Code adrs
Chemist Name janea
##JCAMPDX= 6.0         $$ Bruker NMR JCAMP-DX V2.0
##DATA TYPE= NMR SPECTRUM
##DATA CLASS= NTUPLES
##ORIGIN= Bruker BioSpin GmbH
##OWNER= nmr
$$ XWIN-NMR		Version 3.5
$$ Thu Mar  9 10:02:13 2006 GMT Standard Time (UT+0h)  MAYBRIDGE\nmr@NMR_250MHZ
##.OBSERVE FREQUENCY= 250.131544655141
##.OBSERVE NUCLEUS= ^1H
##.ACQUISITION MODE= SIMULTANEOUS (DQD)
##.ACQUISITION SCHEME= undefined
##.AVERAGES= 16
##.DIGITISER RES= 18
##SPECTROMETER/DATA SYSTEM= dpx250
##.PULSE SEQUENCE= zg30
##.SOLVENT NAME= CDCl3
##.SHIFT REFERENCE= (INTERNAL, CDCl3, 0, 16.522)
##AUDIT TRAIL= $$ (NUMBER, WHEN, WHO, WHERE, WHAT)
$$ ##TITLE= Audit trail, XWIN-NMR		Version 3.5
$$ ##JCAMPDX= 5.01
$$ ##ORIGIN= Bruker BioSpin GmbH
$$ ##OWNER= nmr
$$ C:\u/data/dgb/nmr/ADRS/380/pdata/1/auditp.txt
$$ ##AUDIT TRAIL=  $$ (NUMBER, WHEN, WHO, WHERE, WHAT)
(   1,<2006-03-09 10:01:51.91 +000>,<MAYBRIDGE\nmr>,<NMR_250MHZ>,
      <created by zg, POWCHK disabled, PULCHK disabled
       configuration hash MD5:
       84 BC 41 DB A1 6E 1D 46 DA 25 12 A5 C1 ED C5 3A
       data hash MD5: 64K
       6C 86 C8 E8 C5 C8 A0 5E 11 3F D0 2F DD 45 84 D6>)
(   2,<2006-03-09 10:02:04.82 +000>,<MAYBRIDGE\nmr>,<NMR_250MHZ>,
      <Start of raw data processing
       ef LB = 0.3 FT_mod = 6 PKNL = 1 SI = 32K 
       data hash MD5: 32K
       A2 8C 56 62 BD B4 EB FB C4 BD 83 3C 3B 02 96 76>)
(   3,<2006-03-09 10:02:06.41 +000>,<MAYBRIDGE\nmr>,<NMR_250MHZ>,
      <apk 
       data hash MD5: 32K
       08 B3 2C B9 B1 C6 1B AC 8B 90 02 7C 0D 49 EE C7>)
(   4,<2006-03-09 10:02:07.15 +000>,<MAYBRIDGE\nmr>,<NMR_250MHZ>,
      <abs ABSG = 5 
       data hash MD5: 32K
       31 E9 3F 77 AC 58 A7 19 9E 05 37 47 1A 5C 6A F2>)
$$ ##END=
$$ 
$$ hash MD5
$$ E7 7F 68 23 63 73 66 3F B3 C2 07 E4 07 AB 7B FA
##$RELAX= 
##$RELAX= 
##$RELAX= 
##$RELAX= 
##$RELAX= 
##$RELAX= 
##$RELAX= 
$$ Bruker specific parameters
$$ --------------------------
##$DU= <C:\u>
##$EXPNO= 380
##$NAME= <ADRS>
##$PROCNO= 1
##$TYPE= <nmr>
##$USER= <dgb>
##$AMP= (0..31)
100 100 100 100 100 100 100 100 100 100 100 100 100 100 100 100 100 100 
100 100 100 100 100 100 100 100 100 100 100 100 100 100 
##$AQSEQ= 0
##$AQ_mod= 3
##$AUNM= <au_zg>
##$AUTOPOS= <10 >
##$BF1= 250.13
##$BF2= 250.13
##$BF3= 250.13
##$BF4= 250.13
##$BF5= 500.13
##$BF6= 500.13
##$BF7= 500.13
##$BF8= 500.13
##$BYTORDA= 1
##$CFDGTYP= 0
##$CFRGTYP= 5
##$CHEMSTR= <none>
##$CNST= (0..31)
1 1 145 1 1 1 1 1 1 1 1 1 1 1 1 1 1 1 1 1 1 1 1 1 1 1 1 1 1 1 1 1 
##$CPDPRG= <>
##$CPDPRG1= <>
##$CPDPRG2= <>
##$CPDPRG3= <>
##$CPDPRG4= <mlev>
##$CPDPRG5= <mlev>
##$CPDPRG6= <mlev>
##$CPDPRG7= <mlev>
##$CPDPRG8= <mlev>
##$CPDPRGB= <>
##$CPDPRGT= <>
##$D= (0..31)
0 1 0 0 0 0 0 0 0 0.06 0 0 0 0 0 0 0.0002 0 0 0 0 0 0 0 0 0 0 0 0 0 0 
0 
##$DATE= 1141898510
##$DBL= (0..7)
120 120 120 120 120 120 120 120 
##$DBP= (0..7)
150 150 150 150 150 150 150 150 
##$DBP07= 0
##$DBPNAM0= <>
##$DBPNAM1= <>
$$ [...]
##$SUBNAM7= <"">
##$SUBNAM8= <"">
##$SUBNAM9= <"">
##$SW= 20.6930455092707
##$SWIBOX= (0..15)
0 0 3 0 0 0 0 0 0 0 0 0 0 0 0 0 
##$SW_h= 5175.983436853
##$TD= 65536
##$TD0= 1
##$TE= 294.16
##$TE2= 300
##$TE3= 300
##$TEG= 300
##$TL= (0..7)
0 120 120 120 120 120 120 120 
##$TP= (0..7)
150 150 150 150 150 150 150 150 
##$TP07= 0
##$TPNAME0= <>
##$TPNAME1= <>
##$TPNAME2= <>
##$TPNAME3= <>
##$TPNAME4= <>
##$TPNAME5= <>
##$TPNAME6= <>
##$TPNAME7= <>
##$TPOAL= (0..7)
0.5 0.5 0.5 0.5 0.5 0.5 0.5 0.5 
##$TPOFFS= (0..7)
0 0 0 0 0 0 0 0 
##$TUNHIN= 0
##$TUNHOUT= 0
##$TUNXOUT= 0
##$USERA1= <user>
##$USERA2= <user>
##$USERA3= <user>
##$USERA4= <user>
##$USERA5= <user>
##$V9= 5
##$VALIST= <valist>
##$VCLIST= <CCCCCCCCCCCCCCC>
##$VD= 0
##$VDLIST= <DDDDDDDDDDDDDDD>
##$VPLIST= <PPPPPPPPPPPPPPP>
##$VTLIST= <TTTTTTTTTTTTTTT>
##$WBST= 1024
##$WBSW= 4
##$XGAIN= (0..3)
0 0 0 0 
##$XL= 0
##$YL= 0
##$YMAX_a= 356333
##$YMIN_a= -500958
##$ZGOPTNS= <>
##$ZL1= 120
##$ZL2= 120
##$ZL3= 120
##$ZL4= 120
##$ABSF1= 16.522
##$ABSF2= -4.171173
##$ABSG= 5
##$ABSL= 3
##$ALPHA= 0
##$AQORDER= 0
##$ASSFAC= 0
##$ASSFACI= 0
##$ASSFACX= 0
##$ASSWID= 0
##$AUNMP= <proc_1d>
##$AZFE= 0.1
##$AZFW= 0.1
##$BCFW= 0
##$BC_mod= 0
##$BYTORDP= 0
##$COROFFS= 0
##$CY= 12.5
##$DATMOD= 1
##$DC= 0
##$DFILT= <>
##$DTYPP= 0
##$F1P= 14.0000005364418
##$F2P= -0.99999901652339
##$FCOR= 0.5
##$FTSIZE= 32768
##$FT_mod= 6
##$GAMMA= 0
##$GB= 0
##$INTBC= 1
##$INTSCL= 1
##$ISEN= 128
##$LB= 0.3
##$LEV0= 0
##$LPBIN= 0
##$MAXI= 10000
##$MC2= 0
##$MEAN= 0
##$ME_mod= 0
##$MI= 0
##$NCOEF= 0
##$NC_proc= -3
##$NLEV= 6
##$NOISF1= 0
##$NOISF2= 0
##$NSP= 0
##$NTH_PI= 0
##$NZP= 0
##$OFFSET= 16.522
##$PC= 1
##$PHC0= 169.7623
##$PHC1= 7.502528
##$PH_mod= 1
##$PKNL= yes
##$PPARMOD= 0
##$PSCAL= 4
##$PSIGN= 0
##$REVERSE= no
##$SF= 250.13
##$SI= 32768
##$SIGF1= 0
##$SIGF2= 0
##$SINO= 400
##$SIOLD= 32768
##$SREGLST= <1H.CDCl3>
##$SSB= 0
##$STSI= 32768
##$STSR= 0
##$SW_p= 5175.98343685301
##$SYMM= 0
##$S_DEV= 0
##$TDeff= 65536
##$TDoff= 0
##$TI= <Analysis number 999999
Compound Code 99
Book Reference 9
Project Code 9>
##$TILT= no
##$TM1= 0
##$TM2= 0
##$TOPLEV= 0
##$USERP1= <user>
##$USERP2= <user>
##$USERP3= <user>
##$USERP4= <user>
##$USERP5= <user>
##$WDW= 1
##$XDIM= 32768
##$YMAX_p= 461359184
##$YMIN_p= -169536
$$ End of Bruker specific parameters
$$ ---------------------------------
##NTUPLES= NMR SPECTRUM
##VAR_NAME=  FREQUENCY,     SPECTRUM/REAL,   SPECTRUM/IMAG
##SYMBOL=    X,             R,               I
##VAR_TYPE=  INDEPENDENT,   DEPENDENT,       DEPENDENT
##VAR_FORM=  AFFN,          ASDF,            ASDF
##VAR_DIM=   32768,         32768,           32768
##UNITS=     HZ,            ARBITRARY UNITS, ARBITRARY UNITS
##FACTOR=    0.157963299565203, 1,           1
##FIRST=     4132.6476996994, 0,             0
##LAST=      -1043.33573715361, 0,           0
##MIN=       -1043.33573715361, -169536,     0
##MAX=       4132.6476996994, 461359184,     0
$$ Real data points
##PAGE= N=1
##DATA TABLE= (X++(R..R)), XYDATA
$$ [...]
16508e9375M2167K2200j3674Q663n32l2661J0687l4700j452r883J6987L749K4327
$$ -59375 -17208 4992 -8682 -19 -551 -33212 -22525 -57225 -58677 -68560 -51573 -47824 -23497
16495b3497K3467k2978j6593J3887m80j2074K2015j2784Q048k6275l0262M1737
$$ -23497 -30 -23008 -39601 -25714 -26194 -38268 -16253 -29037 -20989 -47264 -77526 -35789
16483c5789M0937N357K6493J9783r827k9147l3092J532L522K0804q79p795J2859
$$ -35789 5148 10505 36998 56781 46954 17807 -15285 -13753 -10231 10573 9694 1899 14758
16470A4758j4932K044J4627j6613p607k3482O12N636J5268q536l620j043l2660
$$ 14758 -174 1870 16497 -116 -7723 -31205 -30593 -24957 -9689 -18225 -21845 -22888 -55548
16457e5548J1656L5801M1444N559r059M15j18p042K0807o277j8602J4972j8348
$$ -55548 -43892 -8091 33353 38912 29853 30268 30150 23108 43915 37638 19036 34008 15660
16444A5660M411R080j6589j224m261j703j342O392j5006o778j2088M921j9461
$$ 15660 20071 29151 12562 11338 7077 5374 4032 10424 -4582 -11360 -23448 -18527 -37988
16431c7988r728J2753K1609O373o248M048l753N682l897j663M711K5829K0375
$$ -37988 -47716 -34963 -13354 -6981 -13229 -9181 -12934 -7252 -11149 -12812 -8101 17728 38103
16418C8103l864K7103j2145R523o495k1689k6105o93j092j1358J4349j3241N699
$$ 38103 34239 61342 49197 58720 52225 30536 4431 3738 2646 -8712 5637 -7604 -1905
16405a905j6532l3542K6204K7894l0604j6691L409K7859K7623K133k3579k6595
$$ -1905 -18437 -51979 -25775 2119 -28485 -45176 -41767 -13908 13715 15848 -7731 -34326
16393c4326j7075p022J3675P680N980L354J8789O390N895o253j1989p333N668
$$ -34326 -51401 -58423 -44748 -37068 -31088 -27734 -8945 -2555 3340 -2913 -14902 -22235 -16567
16380a6567J5435J380j4637j2294k0967J8565Q30n741M668K6946L8082P122k7103
$$ -16567 -1132 248 -14389 -26683 -47650 -29085 -28255 -33996 -29328 -2382 35700 42822 15719
16367A5719j4226K4k5465j5519J5723M208K4139p922l573M1937J875j349j4593
$$ 15719 1493 1517 -23948 -39467 -23744 -19536 4603 -3319 -6892 35045 36920 35571 20978
16354B0978n64j5933J5793k5483j5046K8434j5434k1728K1050K8259J5328J6654
$$ 20978 20414 4481 20274 -5209 -20255 8179 -7255 -28983 -7933 20326 35654 52308
16342E2308M2223k0774m1639p996p827k7153K7448L6629q12q384j4623J2224j1533
$$ 52308 94531 73757 32118 24122 16295 -10858 16590 53219 52407 44023 29400 41624 30091
16329C0091l6131J0079J108k1831J410m279J500j1902k270K6053m572K754J8915
$$ 30091 -6040 4039 5147 -16684 -15274 -19553 -18053 -29955 -32225 -6172 -10744 -7990 10925
16316A0925j1137p447L4555k2395k0770L612j1029j0055K1501K0737J6095k5897
$$ 10925 -212 -7659 26896 4501 -16269 -12657 -23686 -33741 -12240 8497 24592 -1305
16304a305j2611m457r287N149J3610L577m213k817M704K531n634K3435Q586q74
$$ -1305 -13916 -18373 -27660 -22511 -8901 -5324 -9537 -12354 -7650 -5119 -10753 12682 21268 20394
16290B0394k6316j8864R270K2280k6047q545J7787J8824J2149o879k9187l068
$$ 20394 -5922 -24786 -15516 6764 -19283 -27828 -10041 8783 20932 14053 -15134 -18202
16278a8202M510R186J7496J3148J4035K4718l1541m3494j4276M187K0773J6940
$$ -18202 -13692 -4506 12990 26138 40173 64891 33350 -10144 -24420 -20233 540 17480
16266A7480K3357k62J3696p635k8670J871j8538k9312J146J9346J2301J2103j1495
$$ 17480 40837 40575 54271 46636 17966 19837 1299 -28013 -26867 -7521 4780 16883 5388
16253E388J7887q167l1612q54K6508R96O499j6034o073m5648L957O8081p253m709
$$ 5388 23275 15108 -16504 -17358 9150 10146 16645 611 -5462 -51110 -47153 20928 13675 8966
16239H966K9734P328j7376m1522J499L446K7907J9942l6074l2096K4513j272J5365
$$ 8966 38700 46028 28652 -12870 -11371 -7925 19982 39924 3850 -28246 -3733 -5005 10360
16226A0360J3962l5597p437J6134R966j9591K3064l437j403K9144O170j2688j4343
$$ 10360 24322 -11275 -18712 -2578 7388 -12203 10861 7424 6021 35165 41335 28647 14304
16213A4304k5337l8107J7628P118k321J7224k314n618K650K2215m591j0747l626
$$ 14304 -11033 -49140 -31512 -24394 -26715 -9491 -11805 -17423 -14773 7442 2851 -7896 -11522
16200a1522J1286k0778j8978r213J7160K5549j4525j4451lJ0053r02R294Q818
$$ -11522 -236 -21014 -39992 -49205 -32045 -6496 -21021 -35472 -35475 -25422 -26324 -17030 -8212
16187h212J9557R970J083k6472j1571P184J3216p48R332K6808J185m6461l3372
$$ -8212 11345 21315 22398 -4074 -15645 -8461 4755 4007 13339 40147 41332 -5129 -38501
16174c8501r888Q184J8918N049N885j839M295J7442N1160J5062n2415l5027k11
$$ -38501 -48389 -40205 -21287 -16238 -10353 -12192 -7897 9545 60705 75767 23352 -11675 -11886
16161a1886J6874R172j5366k0747p830k6719r367l704r446k809K4579J0786K4237
$$ -11886 4988 14160 -1206 -21953 -29783 -56502 -65869 -69573 -79019 -81828 -57249 -46463 -22226
16148b2226L3069J5816m3020m7956J668P172L7964K3224o473J484K407K3989K3526
$$ -22226 10843 26659 -16361 -64317 -62649 -55477 -17513 5711 -762 722 3129 27118 50644
16135E0644Q491m875k5521j6420J1428J5609p853j5632K6967J1337k6417j9002
$$ 50644 59135 54260 28739 12319 23747 39356 31503 15871 42838 54175 27758 8756
16123H756l0752l0905j5839J6023M6448L443R044K0941k3864l8635n375K5202
$$ 8756 -21996 -52901 -68740 -52717 -6269 -2826 6218 27159 3295 -35340 -40715 -15513
16111a5513K4664j6498n704J6592k0029l7612J2401L2043L5855j9732j8606N478
$$ -15513 9151 -7347 -13051 3541 -16488 -54100 -41699 -9656 26199 6467 -12139 -6661
16099f661l7k8367N203J5403J3145j2658m374J8774J6200j2795l966o483J3239
$$ -6661 -6698 -35065 -29862 -14459 -1314 -13972 -18346 428 16628 3833 -133 -6616 6623
16086F623K8805m279k2465o613L1305j3129k8101J7722P714k2745j5504k42Q518
$$ 6623 35428 31149 8684 2071 33376 20247 -7854 9868 17582 -5163 -20667 -20909 -12391
16073a2391J7027J1191n575p997O716O536N075N786J3820j924l0538k0747j1310
$$ -12391 4636 15827 10252 2255 8971 15507 20582 26368 40188 38264 7726 -13021 -24331
16060b4331j0133J2779K0312K1205L6334k6357m0731J1015n871M646J8830K9869
$$ -24331 -34464 -21685 -1373 19832 56166 29809 -10922 93 -5778 -1132 17698 47567
16048D7567J3902k1092k0434j6025K09m441J8804j4003j7660J3610r229m642k350
$$ 47567 61469 40377 19943 3918 4127 -314 18490 4487 -13173 437 -8792 -13434 -15784
16035a5784R650L4361L3037J4396k9536l3378k086M816l5853Q613L0617J1566
$$ -15784 -6134 28227 61264 75660 46124 12746 10660 15476 -20377 -11764 18853 30419
16023C0419j5238k4775M323j619O639j313j41O726M171P569J2562k3202l3553
$$ 30419 15181 -9594 -5271 -6890 -251 -1564 -1705 5021 9192 16761 29323 6121 -27432
16010b7432J103K9529o142r163o78O753O406j6817J8572R478j2526k4291k8187
$$ -27432 -26329 3200 -2942 -12105 -12783 -6030 376 -16441 2131 11609 -917 -25208 -53395
15997e3395N344J9683L6312J8910r32r466M113l5098k3004j3953q940K3755Q377
$$ -53395 -48051 -28368 7944 26854 25922 16456 20569 -14529 -37533 -51486 -60426 -36671 -28294
15984b8294J2050j2734J382L7288K2565M466k3823j093j1566j1731j824J8210
$$ -28294 -16244 -28978 -27596 9692 32257 36723 12900 11807 241 -11490 -13314 4896
15972D896n855N782k365k4157j0966j6393o440J8176R719J7115j0607q702L7151
$$ 4896 -959 4823 2458 -21699 -32665 -49058 -55498 -37322 -27603 -10488 -21095 -29797 7354
15959G354Q418k4636j2763K1698N209j6919k6471J6174J1504k0275n218o131J9247
$$ 7354 15772 -8864 -21627 71 5280 -11639 -38110 -21936 -10432 -30707 -35925 -42056 -22809
15946b2809N077K2696J4482j9919o871O34K088j8340Q689l47M92Q81P391j8845
$$ -22809 -17732 4964 19446 -473 -7344 -6710 -4622 -22962 -14273 -14620 -14128 -13247 -5856 -24701
15932b4701J8015J4948k9671O943k0341l2345J8716L3926l239r936P896j4276
$$ -24701 -6686 8262 -21409 -14466 -34807 -67152 -48436 -14510 -17749 -27685 -19789 -34065
15920c4065J7725L0420n907l1133K4968m035l8534J0096l353o320L023l146N34
$$ -34065 -16340 14080 8173 -22960 2008 -2027 -40561 -30465 -33818 -40138 -37115 -40261 -39727
15907c9727L1112L7773J2641o055n258R106j9963l2603o874J0662M410p71J0646
$$ -39727 -8615 29158 41799 35744 30486 39592 19629 -12974 -19848 -9186 -4776 -5547 5099
15894E099j193l2019n992M2316K2731K1458K8539m90j4508l1209k6856m11l2286
$$ 5099 3906 -28113 -34105 8211 30942 52400 80939 80449 65941 34732 7876 7465 -24821
15881b4821o522J2464O571m556J6653P063J4877k3018J2167O080q272k2251q735
$$ -24821 -31343 -18879 -12308 -16864 -211 6852 21729 -1289 10878 16958 8686 -13565 -22300
15868b2300O749K9724K2087l2324k0277j3584p659P795K563k478J0319J7533N485
$$ -22300 -15551 14173 36260 3936 -16341 -29925 -37584 -29789 -27226 -29704 -19385 -1852 3633
15855C633Q93p786n08k2100p218M841j548Q316M495K44k316K7671m974J1422K8525
$$ 3633 4526 -3260 -3768 -25868 -33086 -28245 -29793 -21477 -16982 -16738 -19054 8617 3643 15065 43590
15840D3590J0248l423K3865j1135O445r593L78m276p103r172J9297j1674j5447
$$ 43590 53838 50415 74280 63145 69590 59997 60375 56099 48996 39824 59121 47447 32000
15827C2000j6593k600j338J0835J0823K5037m1480j9670k840K438L5164J5889
$$ 32000 15407 12807 11469 22304 33127 58164 16684 -2986 -5826 -3388 31776 47665
15815D7665k2542k1356j8625j1051N098j1477L876j2022J4371J390J5068K0416
$$ 47665 25123 3767 -14858 -25909 -20811 -32288 -28412 -40434 -26063 -24673 -9605 10811
15803A0811L0279k002m7957j059K3091p358k6539l661k346k5281O948K6108P894
$$ 10811 41090 39088 -8869 -9928 13163 5805 -20734 -24395 -26741 -52022 -45074 -18966 -11072
15790a1072K2161k5498l5970K847J5061k743O533J6076L9766K0541r973p7355
$$ -11072 11089 -14409 -50379 -47532 -32471 -35214 -28681 -12605 27161 47702 37729 -39626
15778c9626K626L322m509M0023M0020n093l1343j0740o914k1046O049M0683J4597
$$ -39626 -37000 -33678 -38187 1836 41856 36763 5420 -5320 -12234 -33280 -27231 13452 28049
15765B8049k7817O967K58N5386l2440j5929r676j0652P835J7971k4494J6310o049
$$ 28049 232 7199 7457 62843 30403 14474 4798 -5854 1981 19952 -4542 11768 5719
15752E719k1714l077M098o223R752J6244m071j4264k778k2219J7934J2161o001
$$ 5719 -15995 -19072 -14974 -21197 -11445 4799 728 -13536 -16314 -38533 -20599 -8438 -14439
15739a4439q929J5716o572M096N812K0075l924k3095j6847J4664L6233k3315j0441
$$ -14439 -23368 -7652 -14224 -10128 -4316 15759 11835 -11260 -28107 -13443 22790 -525 -10966
15726a0966j6189K3645o129k5853o56J5617N300k2457l149J1727K499O943J7591
$$ -10966 -27155 -3510 -9639 -35492 -36148 -20531 -15231 -37688 -40837 -29110 -26611 -19668 -2077
15713b077l315J972N237k115j8484k8518K3119N6619j6601j059o558l7061j6099
$$ -2077 -5392 -3420 1817 -298 -18782 -47300 -24181 32438 15837 14778 8220 -28841 -44940
15700d4940M17O585O257M3074K8397p350j4925k8384K3709N24k0598K907l905
$$ -44940 -44523 -37938 -31681 11393 39790 32440 17515 -10869 12840 13364 -7234 -4327 -8232
15687h232L694K6902J3389k8726l126q233o360k2617j8226P716K721m274n270
$$ -8232 -4538 22364 35753 7027 3901 -4332 -10692 -33309 -51535 -43819 -41098 -45372 -50642
15674e0642r13K7123Q242j5926J3587M0682N775L584j8065p085K1779J3356j9255
$$ -50642 -51555 -24432 -16190 -32116 -18529 22153 27928 31512 13447 6362 28141 41497 22242
15661B2242l2131K908J0324j2915R157Q771k1304k2592k3400j4902K6491J1709
$$ 22242 -9889 -6981 3343 -9572 -415 8356 -12948 -35540 -58940 -73842 -47351 -35642
15649c5642J593l3476l1658L7560N6138l71p496k4901k574K0940k0721R884N448
$$ -35642 -34049 -67525 -99183 -61623 -5485 -5856 -13352 -38253 -40827 -19887 -40608 -30724 -25276
15636b5276o216J9127k015j5448J0428L2820J6174l2911m3032p395Q202o084K5100
$$ -25276 -31492 -12365 -14380 -29828 -19400 13420 29594 -3317 -46349 -53744 -45542 -51626 -26526
15623b6526o904j9876K9344R996Q925o777M986J2270j5206j5453j8375o314j4762
$$ -26526 -33430 -53306 -23962 -13966 -5041 -11818 -6832 5438 -9768 -25221 -43596 -49910 -64672
15610f4672K0887K3717J6048j2918q247J1588J2162Q459p820Q48j372l1696j5612
$$ -64672 -43785 -20068 -4020 -16938 -25185 -13597 -1435 7024 -796 52 -1320 -33016 -48628
15597d8628k6603L3366M1416o244L98K0611j6141j516n059k9854K0553O216J6553
$$ -48628 -75231 -41865 -449 -6693 -6295 14316 -1825 -3341 -8400 -38254 -17701 -11485 5068
15584E068K597l519k6206k9118k9246N280N5807j8652j1133P567K285Q075K7824
$$ 5068 7665 4146 -22060 -51178 -80424 -75144 -19337 -37989 -49122 -41555 -39270 -31195 -3371
15571c371j7721M3M133j5444J3744L599K2846J2246J090j8186L491j0461l4206
$$ -3371 -21092 -21049 -16916 -32360 -18616 -15017 7829 20075 21165 2979 6470 -3991 -38197
15558c8197M015K874o292q696Q760K6988M280j8082L726J6870J7718O093l1234
$$ -38197 -34182 -31308 -37600 -46296 -37536 -10548 -6268 -24350 -20624 -3754 13964 20057 -11177
15545a1177Q670L603m0266j4576K1869J6935K4607K0238P208k709k042Q920P767
$$ -11177 -2507 1096 -39170 -53746 -31877 -14942 9665 29903 37111 34402 32360 41280 49047
15532D9047J4937j4485k7874q19m3497j1994l304J5487K926L7761L1422P748j4765
$$ 49047 63984 49499 21625 20806 -22691 -34685 -37989 -22502 -19576 18185 49607 57355 42590
15519D2590m7548L137K3800l4396k9737j086M8762L882j514J9757j909l9992K257
$$ 42590 -4958 -1821 21979 -12417 -42154 -43240 5522 9404 7890 27647 25738 -14254 -11997
15506a1997n586r92R217m1093o743K1972p325K0443L5911j5249j3297N815o394
$$ -11997 -17583 -18575 -9358 -50451 -57194 -35222 -42547 -22104 13807 -1442 -14739 -8924 -15318
15493a5318K1880p748k1091m4943m831L2409J6131j0095J5432M721j2407j800
$$ -15318 6562 -1186 -22277 -67220 -72051 -39642 -23511 -33606 -18174 -13453 -25860 -27660
15481b7660R520O94K7907L2482J3649j601j0775p021l1516j618L0845k4719l2101
$$ -27660 -18140 -17446 10461 42943 56592 54991 44216 37195 5679 4061 34906 10187 -21914
15468b1914k9280j7020L9437L8437q825K574K1105L427j1712M543j0802l1171
$$ -21914 -51194 -68214 -28777 9660 835 3409 24514 27941 16229 20772 9970 -21201
15456b1201m47j0251P921O505m239p452j8242k127K4409K3889q213k9513k6005
$$ -21201 -21648 -31899 -23978 -17473 -21712 -29164 -47406 -49533 -25124 -1235 -9448 -38961 -64966
15443f4966J2192M3654K8439P458m1782m1572l3938O662L7265K1886P283j0109
$$ -64966 -52774 -9120 19319 26777 -15005 -56577 -90515 -83853 -46588 -24702 -17419 -27528
15431b7528k7248J6735J5950k627M473j420J4200j1547Q331K6820J4868j4131
$$ -27528 -54776 -38041 -22091 -24718 -20245 -21665 -7465 -19012 -10681 16139 31007 16876
15419A6876m340J889k2125k6600R268J0223o776M394K4509J4257l6382k1323j1447
$$ 16876 12536 14425 -7700 -34300 -25032 -14809 -21585 -17191 7318 21575 -14807 -36130 -47577
15406d7577n231K2471M7060P667j0636j6981j1751R653K5415j4339j2737n130
$$ -47577 -52808 -30337 16723 24390 13754 -3227 -14978 -5325 20090 5751 -6986 -12116
15394a2116O756K7175j6969r321J2840r671l7131n66K0076q986o099J7969J4418
$$ -12116 -5360 21815 4846 -4475 8365 -1306 -38437 -39003 -18927 -27913 -34012 -16043 -1625
15381a625J4762K2604k5474k5601q448R019K5978K7998J095k8819j5078J3743
$$ -1625 13137 35741 10267 -15334 -23782 -14763 11215 39213 40308 11489 -3589 10154
15369A0154j7329j6179R073L2505k1606q688k2157M454J3685J594j0970K827M0307
$$ 10154 -7175 -23354 -14281 18224 -3382 -12070 -34227 -29773 -16088 -14494 -25464 -22637 17670
15356A7670K47L150k5778l4429P940L4831j0250k9982m646K2596R209J5420j7893
$$ 17670 17917 21067 -4711 -39140 -31200 3631 -6619 -36601 -41247 -18651 -9442 5978 -11915
15343a1915j2897K5770N803M475j7945j240P298n374Q460j5849k623K4217J7115
$$ -11915 -24812 958 6761 11236 -6709 -7949 -651 -6025 2435 -13414 -16037 8180 25295
15330B5295j9941m569L732L0580n335l2897o087j2184L678q165j9377j2092P950
$$ 25295 5354 785 4517 35097 29762 -3135 -9222 -21406 -17728 -25893 -45270 -57362 -49412
15317d9412J5557J506J4280r72J334j5500j23L817M5665p302P830j4958J4756
$$ -49412 -33855 -32349 -18069 -19041 -17707 -33207 -33330 -29513 16152 8850 16680 1722 16478
15304A6478l431j6992o141L499J0096j7225j5493J2174J0548P901J336k9859m201
$$ 16478 13047 -3945 -10086 -6587 3509 -13716 -29209 -17035 -6487 1414 2750 -27109 -31310
15291c1310J5626j7941m906M6271J3784N547l361q888j1664k4389n730L588j208
$$ -31310 -15684 -33625 -38531 7740 21524 27071 23710 14822 3158 -21231 -26961 -23373 -24581
15278b4581L5423L4027J9617L571N567l119l6672j0355K6956n5448m3184J120
$$ -24581 10842 44869 64486 68057 73624 70505 33833 23478 50434 -5014 -48198 -47078
15266d7078K6519K3586k534o156j0698J7977L7415j2698M786M122j6879j2727
$$ -47078 -20559 3027 493 -5663 -16361 1616 39031 26333 31119 35241 18362 5635
15254E635j0099J1371k3519k8230q429L6055J0433N0M070q448m104M7195J876
$$ 5635 -4464 6907 -16612 -44842 -53271 -17216 -6783 -6733 -2663 -11111 -15215 31980 33856
15241C3856r301o771m1432k3995P56j2344J9690K7799l1492j4125J5925R728J9546
$$ 33856 24555 17784 -23648 -47643 -46887 -59231 -39541 -11742 -43234 -57359 -41434 -31706 -12160
15228a2160K6207J3447l1561k8629k7974Q709M6689J8950K926k7044l641K185
$$ -12160 14047 27494 -4067 -32696 -60670 -51961 -5272 13678 16604 -10440 -14081 -11896
15216a1896J8814o98J2126J4262j0206j2292J2046j8173m753Q06n067o574J7522
$$ -11896 6918 6220 18346 32608 22402 10110 22156 3983 -770 36 -5031 -11605 5917
15203E917Q088k9318J4374K5149L2054k8899j9166k1612q68P800J6968K3118J909
$$ 5917 14005 -15313 -939 24210 56264 27365 8199 -13413 -14281 -6481 10487 33605 35514
15190C5514q680q943J2642j35j443L565j8004j3201J3142N342j4033l059k3712
$$ 35514 26834 17891 30533 30398 28955 32520 14516 1315 14457 19799 5766 2707 -21005
15177b1005o895J7256J4032N398k0599M3904K1242k5271j8675j2854L056p487
$$ -21005 -27900 -10644 3388 8786 -11813 32091 53333 28062 9387 -3467 -411 -7898
15165g898j8775j3970J9900n709P559P782k4633J3573K0727j7919K261J7344N175
$$ -7898 -26673 -40643 -20743 -26452 -18893 -11111 -35744 -22171 -1444 -19363 -17102 242 5417
15152E417j7194o44P907j9543q097K626J5525J577J9070J6640K0520N639j4600
$$ 5417 -11777 -12421 -4514 -24057 -32154 -29528 -14003 -12426 6644 23284 43804 49443 34843
15139C4843r482k4233m817J2520J1089j3196q807j4000j923k5199Q024M0101M1962
$$ 34843 25361 1128 -3689 8831 19920 6724 -2083 -16083 -18006 -43205 -35181 4920 46882
15126D6882M589j2552p974k2022l3985l0779M691K1216K7832J0780j6571L671
$$ 46882 51471 38919 30945 8923 -25062 -55841 -51150 -29934 -2102 8678 -7893 -4222
15114d222j416j0167j9515K3207K5045J079P39l2084k0225M761J2692K1487L5589
$$ -4222 -5638 -15805 -35320 -12113 12932 14011 14750 -17334 -37559 -32798 -20106 1381 36970
15101C6970K3095j9981k479k572q03n428L338L815k0905k5874n880K299K2200
$$ 36970 60065 40084 37605 35033 34230 28802 32140 35955 15050 -10824 -16704 -14405 7795
15088G795l26o850k3833m6496M0031N3068j577L52k251j5113O099l318k0168N953
$$ 7795 7469 619 -23214 -69710 -29679 23389 21812 22164 19913 4800 10899 7581 -12587 -6634
15074f634J4858K3215K8871m156k1185k1215j3686l3585k5213R666J5015k0793
$$ -6634 8224 31439 60310 56154 34969 13754 68 -33517 -58730 -49064 -34049 -54842
15062e4842k750K218J0830L925J8214K7398L7709q680j9620K381n225K3049J7465
$$ -54842 -57592 -55374 -44544 -40619 -22405 4993 42702 34022 14402 16783 11558 34607 52072
15049E2072j574m5718J0670j3616m052L91j9030K9168J062l686J8502J5053l8474
$$ 52072 50498 4780 15450 1834 -2218 -1827 -20857 8311 9373 5687 24189 39242 768
15036G68O346J072J959j5336O534O196k8182k6696K4255K6829L162K8157J0931
$$ 768 7114 8186 10145 -5191 1343 7539 -20643 -47339 -23084 3745 6907 35064 45995
15023D5995j7361k0619m838j5653K1511k3610l820j4221p354J8873P000K7718
$$ 45995 28634 8015 3177 -12476 9035 -14575 -18395 -32616 -39970 -21097 -14097 13621
15011A3621k1574n3681j3134J1043K2217K1373L190P498j9987k0366J1524J6801
$$ 13621 -7953 -61634 -74768 -63725 -41508 -20135 -16945 -9447 -29434 -49800 -38276 -21475
14999b1475K612n645j8192m768K235P334K3820L2763J590o009q623j3353k7750
$$ -21475 -18863 -24508 -42700 -47468 -45233 -37899 -14079 18684 20274 14265 5642 -7711 -35461
14986c5461j5369j0252K5172J7331j5168j6591K305K0929J9191J5966J0169J1735
$$ -35461 -50830 -61082 -35910 -18579 -33747 -50338 -48033 -27104 -7913 8053 18222 29957
14974B9957j7757R823l242k6341P63L0023P898k0631R214J5143J1113j0906p318
$$ 29957 12200 22023 18781 -7560 -6797 23226 31124 10493 19707 34850 45963 35057 27739
14961B7739l984k2l7064k6975N460L50K7345r611l203K3627O834N332J245k2144
$$ 27739 23755 23733 -13331 -40306 -34846 -34496 -7151 -16762 -19965 3662 10496 15828 17073 -5071
14947e071k0387J2922J5049L4571j3829J0936O440k145j0931k5358j3649J0713
$$ -5071 -25458 -12536 2513 37084 23255 34191 40631 38486 27555 2197 -11452 -739
14935g39p505k8981J1736J9593j272R07K5478o495j0809K3457j7011j9209j5388
$$ -739 -8244 -37225 -25489 -5896 -7168 -6261 19217 12722 1913 25370 8359 -10850 -26238
14922b6238J972j9040K1095j1857J7919J4481P717q611j606j1466j8587k5565
$$ -26238 -24266 -43306 -22211 -34068 -16149 -1668 6049 -2562 -4168 -15634 -34221 -59786
14910e9786L0639M6167K3979P704k2581k8893N751L1331L037k2648J8971k5383
$$ -59786 -29147 17020 40999 48703 26122 -2771 2980 34311 37348 14700 33671 8288
14898H288K82R928M0517m1008m773P346O784k1212J4827J7094n3l6791P59K0425
$$ 8288 8570 18498 59015 18007 13234 20580 27364 6152 20979 38073 38020 1229 1988 22413
14884B2413O050r573J5498k118q850J0268j3748j6007m876j3940m23J2241K919
$$ 22413 28463 18890 34388 32270 23420 33688 19940 3933 -943 -14883 -15306 -3065 -146
14871a46j827r891k206J0643j2811J5837K8771p055k0185p936p900j5155J2910
$$ -146 -1973 -11864 -14070 -3427 -16238 -401 28370 21315 1130 -6806 -14706 -29861 -16951
14858a6951J8838J3314j7687j9276K069k3527J0728J7410J8337K4574k5148P20
$$ -16951 1887 15201 -2486 -21762 -19693 -43220 -32492 -15082 3255 27829 2681 3401
14846C401J9047m691j5728n869j4645M426M7725N798l380j7361j8918R667j0879
$$ 3401 22448 17757 2029 -3840 -18485 -14059 33666 39464 36084 18723 -195 9472 -1407
14833a407L0652N930j5194j7144k6935o862O829M4120j4183o683j380p596k1806
$$ -1407 29245 35175 19981 2837 -24098 -30960 -24131 19989 5806 -877 -2257 -9853 -31659
14820c1659j2464J6514K2389J9886k793M0771K0025q729k4143j3666r711K0883
$$ -31659 -44123 -27609 -5220 14666 11873 52644 72669 63940 39797 26131 16420 37303
14808C7303K3157j7053k6377M397j1830L126m996j3746M511L8995n1763j5786
$$ 37303 60460 43407 17030 21427 9597 12723 7727 -6019 -1508 37487 -14276 -30062
14796c0062K2210K014m507N0K0644p378k9354L6667n90j8194R310j645P214J1433
$$ -30062 -7852 -5838 -10345 -10295 10349 2971 -26383 10284 9694 -8500 810 -835 6379 17812
14782A7812j8347j3014M328O95k4598J8295N511l7408p249r57Q771J6385J9545
$$ 17812 -535 -13549 -9221 -8526 -33124 -14829 -9318 -46726 -53975 -54932 -46161 -29776 -10231
14769a0231N1548L913m4582k7862J3173J1789K3508Q983j8416l3472n893J4872
$$ -10231 41317 45230 648 -27214 -14041 -2252 21256 30239 11823 -21649 -27542 -12670
14757a2670J3986K9417K6461l3721l6406P505K3953J4451M487P942j7178K6487
$$ -12670 1316 30733 57194 23473 -12933 -5428 18525 32976 37463 45405 28227 54714
14745E4714j8886n4510j7918r553N192J2584J3122K2310j0016K764J2658o128
$$ 54714 35828 -18682 -36600 -46153 -40961 -28377 -15255 7055 -2961 -197 12461 6333
14733F333k6521k1768O417M1902K3484K6779R163p448k1924L195j9803j1665k1738
$$ 6333 -20188 -41956 -35539 6363 29847 56626 65789 58341 36417 39612 19809 8144 -13594
14720a3594J4538J2825r851k4497L983J1195P287j2092M064J2686p106p412k0680
$$ -13594 944 13769 3918 -20579 -16596 -5401 1886 -10206 -6142 6544 -562 -7974 -28654
14707b8654K1468L0275L55k8654k4401j1759K7159L6764q788k7375L33L1474K649
$$ -28654 -7186 23089 23444 -5210 -29611 -41370 -14211 22553 13765 -13610 -13277 18197 20846
14694B0846K86l3221j1014K0774k3647k3895L606J6929Q885J4674k9086J5910
$$ 20846 21132 -12089 -23103 -2329 -25976 -49871 -46265 -29336 -20451 -5777 -34863 -18953
14682a8953K8045R065k7612l7311J4167K2945K8170K995K195K119j4288j2077
$$ -18953 9092 18157 -9455 -46766 -32599 -9654 18516 21511 23706 25825 11537 -540
14670e40j2029J027K6498q373k94J0955M0565q59k1146O539j7353j2158p819K3110
$$ -540 -12569 -11542 14956 6583 6289 17244 57809 56950 35804 42343 24990 12832 5013 28123
14656B8123j2438k34m177M268K5359j5308k5710L8454o334j9800k2149k0293j2118
$$ 28123 15685 15451 11274 15542 40901 25593 -117 38337 32003 12203 -9946 -30239 -42357
14643d2357o112N039L4000n597N298J0230j9308J0153j4489R185P556j6187j4900
$$ -42357 -48469 -43430 -9430 -15027 -9729 501 -18807 -8654 -23143 -13958 -6402 -22589 -37489
14630c7489j1340P129L401Q109K7325K9184j1033J3833j391k2158l7709J1995
$$ -37489 -48829 -41700 -38299 -30190 -2865 26319 15286 29119 27728 5570 -32139 -20144
14618b0144l240N965K4370O164k6428q009L8575K6882k3734m877k6485N42R251
$$ -20144 -23384 -17419 6951 13115 -13313 -21322 17253 44135 20401 15524 -10961 -10419 -1168
14605a168j1999P486l827K319M0766L0367J1283O809k2474m9548j0547p428L4634
$$ -1168 -13167 -5681 -9508 -7189 33577 63944 75227 82036 59562 10014 -533 -7961 26673
14592B6673j8665p700k451J2629j0405m5538q461J6542j2593J321L0606j966L2305
$$ 26673 8008 308 -2143 10486 81 -45457 -53918 -37376 -49969 -48648 -18042 -20008 12297
14579A2297L4609J5309j3973m0872l8840j3535m114j807J507K1730k061K6173
$$ 12297 46906 62215 48242 7370 -31470 -45005 -49119 -50926 -49419 -27689 -29750 -3577
14567c577J7390J037K325k69j7206k032O704j0572j1228J2536l3003j5828J2254
$$ -3577 13813 14850 17175 16906 -300 -2332 4372 -6200 -17428 -4892 -37895 -53723 -41469
14554d1469J0795J1473J2473J5261l8522l1373K3792M6261r858j1686m40o627
$$ -41469 -30674 -19201 -6728 8533 -29989 -61362 -37570 8691 -1167 -12853 -13293 -19920
14542a9920J4962p90J5424k0105Q677k6158l8555Q359L4037J8787j7084k8019
$$ -19920 -4958 -5748 9676 -10429 -1752 -27910 -66465 -58106 -24069 -5282 -22366 -50385
14530e0385J6467P783j6899n721K2789k1923M249L4185p995J7506m400J3260J4263
$$ -50385 -33918 -26135 -43034 -48755 -25966 -47889 -43640 -9455 -17450 56 -4344 8916 23179
14517B3179k109m842j7623M76J5070n653k0218P725K4503J8839J3184L53j3839
$$ 23179 21070 16228 -1395 -919 14151 8498 -11720 -3995 20508 39347 52531 52884 39045
14504C9045j7879Q980k0661j7737j1625l0125M685n619k8326l249l257J198K4830
$$ 39045 21166 30146 9485 -8252 -19877 -50002 -45317 -50936 -79262 -82511 -85768 -84570 -59740
14491e9740K9863J0724O230O483K0037m753j169n328j1689J8393q345k5305k4306
$$ -59740 -29877 -19153 -12923 -6440 13597 8844 7675 2347 -9342 9051 706 -24599 -48905
14478d8905Q375P052l475J7623K6730K5002R45k8682j2638L2078L3586k3684q516
$$ -48905 -40530 -33478 -36953 -19330 7400 32402 33347 4665 -7973 24105 57691 34007 25491
14465B5491J3599O30k0960k7868r594j1981j2878K0739J9161j0481p288J3192
$$ 25491 39090 39720 18760 -9108 -18702 -30683 -43561 -22822 -3661 -14142 -21430 -8238
14453h238M9630j9613l7904k2094k5900L3051k14j2952K8941k093j2246J1291
$$ -8238 41392 21779 -16125 -38219 -64119 -31068 -31282 -44234 -15293 -17386 -29632 -18341
14441a8341J1217K2877J33p974j4921j0793P500M165j0618j465k584K2416L4168
$$ -18341 -7124 15753 15886 7912 -7009 -17802 -10302 -6137 -16755 -18220 -20804 1612 35780
14428C5780j6071o927l4930r714K6563L1538j6957l7796n19K3555k428j3433j8046
$$ 35780 19709 12782 -22148 -31862 -5299 26239 9282 -28514 -29033 -5478 -7906 -21339 -39385
14415c9385j8192m24K6914J2809J5608K6921J35j1131j9351n14K5473j352j2545
$$ -39385 -57577 -58001 -31087 -18278 -2670 24251 24386 13255 -6096 -6610 18863 17511 4966
14402D966l3669j0726J1012K6333L0920k4332J855j3482j2091m664N9049J5742
$$ 4966 -28703 -39429 -28417 -2084 28836 4504 6359 -7123 -19214 -23878 35171 50913
14390E0913k5459p324k6913m0193J698J7613J2704k0811k439L1903k8491J1472
$$ 50913 25454 18130 -8783 -48976 -47278 -29665 -16961 -37772 -40211 -8308 -36799 -25327
14378b5327J8526L3602K8068Q346p164m3583k5512J4668R120k1366o825j201k2125
$$ -25327 -6801 26801 54869 63215 56051 12468 -13044 1624 10744 -10622 -17447 -18648 -40773
14365d0773J034N065J8514K8309K8145j5141r282K9045Q359m4371l3077M979n88
$$ -40773 -39739 -34674 -16160 12149 40294 25153 15871 44916 53275 8904 -24173 -19194 -19782
14352a9782K1364J7503m290l345j6927K0980J1001L182N965j4371J5679K2689
$$ -19782 1582 19085 14795 11450 -5477 15503 26504 29686 35651 21280 36959 59648
14340E9648k2390m4221l4350m475P01K5833K5713P304L464J7907m893l7445J5865
$$ 59648 37258 -6963 -41313 -45788 -45087 -19254 6459 13763 17227 35134 30241 -7204 8661
14327H661m429o306l485l488l3660R07p874p384j776k258K65k313k4549L3176
$$ 8661 4232 -2074 -5559 -9047 -42707 -41800 -49674 -57058 -58834 -61092 -60827 -63140 -87689 -54513
14313e4513N4152Q822R777k3527k9460J1725J2189j2765R625J0455j1649J04j588
$$ -54513 -361 8461 18238 -5289 -34749 -23024 -10835 -23600 -13975 -3520 -15169 -15065 -16653
14300a6653P054K4871l40k5307J4313r277K6027j3386j1014l3761k3721K2068
$$ -16653 -9599 15272 14932 -10375 3938 -5339 20688 7302 -3712 -37473 -61194 -39126
14288c9126J9755J729q485K8899N722j0007j771j1280j451J9975L430j1747o403
$$ -39126 -19371 -17642 -26127 2772 8494 -1513 -3284 -14564 -16015 3960 7390 -4357 -10760
14275a0760k1342J7653J6384k8280j9249r039M2583K060n8754k2524K3186J8709
$$ -10760 -32102 -14449 1935 -26345 -45594 -54633 -12050 -9990 -68744 -91268 -68082 -49373
14263d9373J8443r344j9945k338M570Q110R215J7904K9097J4214l1459n563K0589
$$ -49373 -30930 -40274 -60219 -62557 -57987 -49877 -40662 -22758 6339 20553 -10906 -16469 4120
14250D120n046l649j587o625o058k3073K2626K2470K330J2855r957K3785L227
$$ 4120 -926 -4575 -6162 -12787 -18845 -41918 -19292 3178 5508 18363 8406 32191 35418
14237C5418k6206j7857Q28p698k9929J7942L463m80o82j491L963n823Q87J0529
$$ 35418 9212 -8645 -7817 -15515 -45444 -27502 -24039 -24519 -25201 -26692 -22729 -28552 -27665 -17136
14223a7136J1128L521K2604k923J7576R070O69j8217l3529k1772J2345O645j3984
$$ -17136 -6008 -2487 20117 17194 34770 43840 44509 26292 -7237 -29009 -16664 -10019 -24003
14210b4003k7137L928n300J8150J6008n63q982j696O676J7428Q478j5531q986
$$ -24003 -51140 -47212 -52512 -34362 -18354 -18917 -27899 -29595 -22919 -5491 2987 -12544 -21530
14197b1530Q092j1876l10l42Q115n063m046J7584K0268R209j7327q671J3450L4622
$$ -21530 -13438 -25314 -25624 -25966 -17851 -22914 -26960 -9376 10892 20101 2774 -5897 7553 42175
14183D2175k8959r831J1686p516k4128m515k932K3735O330k6946j2727K499J2815
$$ 42175 13216 3385 15071 7555 -16573 -21088 -24020 -285 6045 -20901 -33628 -31129 -18314
14170a8314r930K3115L309q26k6076J654p334k3614L3345r909k4563K9926J5039
$$ -18314 -28244 -5129 -1820 -2646 -28722 -27068 -34402 -58016 -24671 -34580 -59143 -29217 -14178
14157a4178j1245r1j2298N231k0052R928p23m680O144J9073l856L8401n350R938
$$ -14178 -25423 -25514 -37812 -32581 -52633 -42705 -43428 -48108 -41964 -22891 -26747 11654 6304 16242
14143A6242q843k2839j2289k41M210Q060L2076K7051j1041j4506j4089J287j7307
$$ 16242 7399 -15440 -27729 -27970 -23760 -15700 16376 43427 32386 17880 3791 5078 -12229
14130a2229J20J4075K5780K2330k0484k0687k828j2500j533k5948j116j3971j1653
$$ -12229 -12109 1966 27746 50076 29592 8905 6077 -6423 -7956 -33904 -35020 -48991 -60644
14117f0644L26K0219J0243J9716P612M330P889J928J647j4616l3275n254K1813
$$ -60644 -60318 -40099 -29856 -10140 -2528 1802 9691 11619 13266 -1350 -34625 -39879 -18066
14104a8066M243N674J0972p411L5815L2082k7543k9614j3537j1278L0786K586
$$ -18066 -13823 -8149 2823 -4588 31227 63309 35766 6152 -7385 -18663 12123 14709
14092A4709J9579n614j3340j3555l92L4008p293j9335P050m164K6535K5775j0289
$$ 14709 34288 28674 15334 1779 1387 35395 28102 8767 15817 11653 38188 63963 53674
14079E3674O795j6413J9785R89J6322K3328J6947L8739O0687N1987O0102J29749
$$ 53674 60469 44056 63841 64830 81152 104480 121427 160166 220853 272840 332942 462691
14067D62691J41745J84644J97081J78320J37733Q7844K3356j7056r4536j33722
$$ 462691 604436 789080 986161 1164481 1302214 1390058 1413414 1396358 1301822 1168100
14057A168100j64036j80444j49268j55886j26409p8214m0086n0971k8111j570
$$ 1168100 1004064 823620 674352 518466 392057 313843 273757 222786 194675 193105
14047A93105l4990n3975j3201r257n167O103K373r965j0416k8444j781j3338j3623
$$ 193105 158115 104140 90939 81682 76515 82618 84991 75026 64610 36166 34385 21047 7424
14034G424Q296J3870J6469k8158j4000J8957J5028l1509k0716K9645J9912k3323
$$ 7424 15720 29590 46059 17901 3901 22858 37886 6377 -14339 15306 35218 11895
14022A1895l2705j5663J8494L0230k3100k8740K2549J2668K217K0130K2574o268
$$ 11895 -20810 -36473 -17979 12251 -10849 -39589 -17040 -4372 -2155 17975 40549 34281
14010C4281P136J2415K881K0388j6538p094j5118r637k11J3007k2452j1431P523
$$ 34281 41417 53832 56713 77101 60563 53469 38351 28714 28503 41510 19058 7627 15150
13997A5150Q091K707k6852j4243J4507o432k297K4746K0483m590m7815m7351k1371
$$ 15150 23241 25948 -904 -15147 -640 -7072 -9369 15377 35860 31270 -16545 -63896 -85267
13984h5267K4372J4262L4505K4881O946k1014Q025J3351j5101j7504J0867j6453
$$ -85267 -60895 -46633 -12128 12753 19699 -1315 6710 20061 4960 -12544 -1677 -18130
13972a8130K4761L8782K75p726k1803j1043l8663l815J6092J9171k0140j7298
$$ -18130 6631 45413 45688 37962 16159 5116 -33547 -37362 -21270 -2099 -22239 -39537
13960c9537m0510L1591K6855P047J7090j3316L0972J4009j3653K331K0838m22
$$ -39537 -80047 -48456 -21601 -14554 2536 -10780 20192 34201 20548 22879 43717 43295
13948D3295m0810l4853K4243P571R174J9808R398p07j2582j0751R967n461j0308
$$ 43295 2485 -32368 -8125 -554 8620 28428 37826 37119 24537 13786 23753 18292 7984
13935G984q854J5947k6886j6348j8377j165O680K227M178k2544P202J801K9088
$$ 7984 -870 15077 -11809 -28157 -46534 -47699 -41019 -38792 -34614 -57158 -49956 -48155 -19067
13922a9067J6354j050K6806n007j6082P961M804j7428j2410j0451O798K4924J1596
$$ -19067 -2713 -3763 23043 18036 1954 9915 14719 -2709 -15119 -25570 -18772 6152 17748
13909A7748j3443l9340P242L1128L573K5512p405j012j6151m1810l4493L431m739
$$ 17748 4305 -35035 -27793 3335 6908 32420 25015 24003 7852 -33958 -68451 -65020 -69759
13896f9759L853J5624J0074J2280K4595R47j0745k0371p238J2577K953M071k995
$$ -69759 -65906 -50282 -40208 -27928 -3333 -2386 -13131 -33502 -40740 -28163 -25210 -21139 -24134
13883b4134k7443j5683M1051K9536L325K0536R435k7353o832n541j3176K82K4111
$$ -24134 -51577 -67260 -26209 3327 6652 27188 36623 9270 2438 -3103 -16279 -15997 8114
13870H114r221n276j8226j6898R327M7384J566l8826q45k1092q240J4724O226
$$ 8114 -1107 -6383 -24609 -41507 -32180 15204 16770 -22056 -22901 -43993 -52233 -37509 -31283
13857c1283O946J0778r534m893L9398J1439j0030j6878K6686N22l0635j880j5601
$$ -31283 -24337 -13559 -23093 -27986 11412 22851 12821 -4057 22629 23151 -7484 -9364 -24965
13844b4965K7530L407j1941L6851k9697j1134k2506k4374L2037J7571q612K4830
$$ -24965 2565 5972 -5969 30882 1185 -9949 -32455 -56829 -24792 -7221 -15833 8997
13832H997j474l3140K7438N2499j2937l5396k6926M366q420k9936j3048R253P371
$$ 8997 7523 -25617 1821 54320 41383 5987 -20939 -16573 -24993 -54929 -67977 -58724 -51353
13819e1353M9383M1925j7208o0136k5699J9122P3354L3797k9365j4932Q732M155
$$ -51353 -1970 39955 22747 -37389 -63088 -43966 29388 63185 33820 18888 27620 31775
13807C1775M966j4108k1033N626J4797j47n16o739n217J2432K9197n079m6613
$$ 31775 36741 22633 1600 7226 22023 21876 21360 14621 9404 21836 51033 45954 -659
13794f59j0085L4579m10l3130m595J0803M190k2628k7397P618L237J1547J2957
$$ -659 -10744 23835 23425 -9705 -14300 -3497 693 -21935 -49332 -41714 -38477 -26930 -13973
13781a3973l3449r278K9477n950n060k487j2631P19J7647k214n660K9857J8224
$$ -13973 -47422 -56700 -27223 -33173 -38233 -40720 -53351 -52632 -34985 -37199 -42859 -13002 5222
13768E222P032Q433Q603k6242m0331j7998J7217J7061J1394l513N084J7031Q071
$$ 5222 12254 20687 29290 3048 -37283 -55281 -38064 -21003 -9609 -13122 -8038 8993 17064
13755A7064r730j5097k2945j2575K7310J6913L2241o71j1754R234J5897o992k0459
$$ 17064 7334 -7763 -30708 -43283 -15973 940 33181 32510 20756 29990 45887 38895 18436
13742A8436p659k832j3606p713l81n116j1384j6795k3086J1102K9441L2036j1038
$$ 18436 10777 7945 -5661 -13374 -13755 -18871 -30255 -47050 -70136 -59034 -29593 2443 -8595
13729h595j1865J8914m028j3520K1370L116m319m565J0431N375J3730j9654m00
$$ -8595 -20460 -1546 -5574 -19094 2276 5392 1073 -3492 6939 12314 26044 6390 5990
13716E990k138P486q211r479l636k307J4604J5735J4724r003M521L0179j0629
$$ 5990 3852 11338 3127 -6352 -9988 -12295 2309 18044 32768 23765 28286 58465 47836
13703D7836l4855j3937N051r387p639r605l610J2506k1066p384L2398j5195K2035
$$ 47836 12981 -956 4095 -5292 -12931 -22536 -26146 -13640 -34706 -42090 -9692 -24887 -2852
13690b852L4843P510K3558k394m5968m9535q856K9543J9233Q191K615L659k8110
$$ -2852 31991 39501 63059 60665 14697 -34838 -43694 -14151 5082 13273 15888 19547 -8563
13677h563m1276L2464K5879J8905k4755k5679N802J2562K4040n119j0709n330
$$ -8563 -49839 -17375 8504 27409 2654 -23025 -17223 -4661 19379 14260 3551 -1779
13665a779m726K2730L7283J2658j0859j7991n491J6769J0484K994j3170j9372
$$ -1779 -6505 16225 53508 66166 55307 37316 31825 48594 59078 62072 48902 29530
13653B9530l6988l5476l0117n412K4084N015K3445L5054P395m729J4296K3875
$$ 29530 -7458 -42934 -73051 -78463 -54379 -49364 -25919 9135 16530 11801 26097 49972
13641D9972O866k4680J0702l629k2278J0767L311j4680l4221R154J588k9J5410
$$ 49972 56838 32158 42860 39231 16953 27720 31031 16351 -17870 -8716 -7128 -7157 8253
13628H253J897j4783J9923L2364k3302m0513l681N191O24j9905k900L235p495
$$ 8253 10150 -4633 15290 47654 24352 -16161 -19842 -14651 -14027 -33932 -36832 -33597 -41092
13615d1092J5856J2094r316J2399J3398J4044j4008k2954l703L7221R709k0736
$$ -41092 -25236 -13142 -22458 -10059 3339 17383 3375 -19579 -23282 13939 23648 2912
13603B912j4260J593j3524n232K8378K2883J5919m1455k4558L7315J2489k9904
$$ 2912 -11348 -9755 -23279 -28511 -133 22750 38669 -2786 -27344 9971 22460 -7444
13591g444m0228k6437J4608P047J6163R405n431k7555R612M4266K0669j5381j3077
$$ -7444 -47672 -74109 -59501 -52454 -36291 -26886 -32317 -59872 -50260 -5994 14675 -706 -13783
13578a3783p553k7297k549M3414L5666l5633m5004J474O522q718j894J417q216
$$ -13783 -21336 -48633 -51182 -7768 27898 -7735 -52739 -51265 -44743 -53461 -55355 -53938 -62154
13565f2154J994q643M388Q117M097R535K5729K8075J0079j6837n0926J6624J0621
$$ -62154 -60160 -68803 -64415 -56298 -52201 -42666 -16937 11138 21217 4380 -46546 -29922 -19301
13552a9301N545J5820m998R21p08k3740j1689L2856r856K1578L1393J6730L172
$$ -19301 -13756 2064 -2934 -2013 -2721 -26461 -38150 -5294 -15150 6428 37821 54551 57723
13539E7723j9735m6317J1558N401j686k073m915j286O886L025j3738j0621m795
$$ 57723 37988 -8329 3229 8630 6944 4871 -44 -1330 5556 8581 -5157 -15778 -20573
13526b0573n193K7348M291j3360R19O756L408J8024J0786k9777k7615J0437p020
$$ -20573 -25766 1582 5873 -7487 -6568 188 3596 21620 32406 2629 -24986 -14549 -21569
13513b1569K187J3774j8387j3898L1338K5557j5439l9425L633j782Q366L6668
$$ -21569 -19382 -5608 -23995 -37893 -6555 19002 3563 -35862 -32229 -34011 -25645 11023
13501A1023k1431J367J8842K3278j3432j0822K2402j1681j294M347j8749p760
$$ 11023 -10408 -9041 9801 33079 19647 8825 31227 19546 18252 22599 3850 -3910
13489c910j2989K6677j628l4813J9790O393P458j2637j2114m785j584N268J2777
$$ -3910 -16899 9778 8150 -26663 -6873 -480 6978 -5659 -17773 -22558 -24142 -18874 -6097
13476f097k239k5228K219K9236P943j1976k1735j8484J364M2638K0198J2734j367
$$ -6097 -8336 -33564 -31345 -2109 5834 -6142 -27877 -46361 -44997 -2359 17839 30573 29206
13463B9206k8005k5123K0841j1132N281j8079j0880q460L5716j8476k015K5605
$$ 29206 1201 -23922 -3081 -14213 -8932 -27011 -37891 -46351 -10635 -29111 -31126 -5521
13451e521q243j0114j270K2925K3076P083k5088J7125J2676M685k080R439j325
$$ -5521 -13764 -23878 -25148 -2223 20853 27936 2848 19973 32649 37334 35254 44693 43368
13438D3368k6926K0470K0241l0595j2473j715L014L624J622K3350K7757j8411
$$ 43368 16442 36912 57153 26558 14085 12370 15384 19008 20630 43980 71737 53326
13426E3326j3073J3362k505j3861r834k3558k9070l781J5914K6678M276K9747
$$ 53326 40253 53615 51110 37249 27415 3857 -25213 -28994 -13080 13598 17874 47621
13414D7621N27o648l301l5286k4335K2319K2941j7352R903r296l287R266J1847
$$ 47621 48148 41500 38199 2913 -21422 897 23838 6486 16389 7093 3806 13072 24919
13401B4919Q638J3411m0320k0300j4147P32K7359o200k599M1349r189j0252k19
$$ 24919 33557 46968 6648 -13652 -27799 -27067 292 -5908 -8507 32842 23653 13401 13182
13388A3182k1640n671j1196M290j66j3994j8923M03Q34J3958L1622L2130l7575
$$ 13182 -8458 -14129 -25325 -21035 -21201 -35195 -54118 -53715 -52881 -38923 -7301 24829 -12746
13375a2746l6661K1310K4406K6423K0684N27j9669k0744j2795J8948m239j424
$$ -12746 -49407 -28097 -3691 22732 43416 43943 24274 3530 -9265 9683 5444 4020
13363D020q557J1567j9397o18J130K35K6848O0334J4604m8075j7249J0839k1165
$$ 4020 -4537 7030 -12367 -12985 -11855 -11620 15228 75562 90166 42091 24842 35681 14516
13350A4516J9036P095L883O616L9276J7678k1664j6507O483K2741n272j9475k5904
$$ 14516 33552 40647 44530 51146 90422 108100 86436 69929 76412 99153 93881 74406 48502
13337D8502N044O11J855q156m749j8086R413L0292J9447m0029L87j0313P756J7426
$$ 48502 53546 54157 56012 47856 43107 25021 34434 64726 84173 44144 44531 34218 41974 59400
13323E9400O82R461j4469n7937j3296j2646l801O547J5834q095p391R744M817
$$ 59400 60082 69543 55074 -2863 -16159 -28805 -32606 -26059 -10225 -18320 -25711 -15967 -11150
13310a1150l221k0199L3646P079k7276l354K3942J4854k713q700J3687k0466j784
$$ -11150 -14371 -34570 -924 6155 -21121 -24475 -533 14321 11608 2908 16595 -3871 -5655
13297e655P48M321L6519M118k1650L979l531j3670K3228J8692k9958j9796l3266
$$ -5655 -4907 -586 35933 40051 18401 22380 18849 5179 28407 47099 17141 -2655 -35921
13284c5921J1086p479j3996J9590K7972j0165j5504J6723L7221j5369l7540j6766
$$ -35921 -24835 -32314 -46310 -26720 1252 -8913 -24417 -7694 29527 14158 -23382 -40148
13272d0148J8112j649j906J9576K7541J7615p837j5935j7005K3894J7962n1940
$$ -40148 -22036 -23685 -25591 -6015 21526 39141 31304 15369 -1636 22258 40220 -11720
13260a1720j3086L0795k609j6040j0249R523K0522k4391l639j4996q061K3942
$$ -11720 -24806 5989 3380 -12660 -22909 -13386 7136 -17255 -20894 -35890 -43951 -20009
13248b0009K1978J0309q510p53j8860j3677J7440K4735j1653l1164j2940j6782
$$ -20009 1969 12278 3768 3015 -15845 -29522 -12082 12653 1000 -30164 -43104 -59886
13236e9886L5723J4678J5641j5269m711J133k331k5229K680K6742j1441k132n648
$$ -59886 -24163 -9485 6156 -9113 -13824 -12691 -15022 -40251 -37571 -10829 -22270 -24402 -30050
13223c0050J5002L226k1471j2939J9776N039j5764J1306K5251l625K79r189Q08
$$ -30050 -15048 -11822 -33293 -46232 -26456 -21417 -37181 -25875 -624 -4249 -3970 -13159 -12351
13210a2351K2512k8774M034K6328N201P693J3567j9236k781o629j5263k6782J624
$$ -12351 10161 -18613 -14579 11749 16950 24643 38210 18974 16193 9564 -5699 -32481 -30857
13197c0857R640k947K0548r278Q647L174j2924K4491J8255j2539J0337l80k4645
$$ -30857 -21217 -24164 -3616 -12894 -4247 -1073 -13997 10494 28749 16210 26547 26167 1522
13184A522K3603j5571j4J8470j3147K1209O093m6701p522k3295J0431J5540P424
$$ 1522 25125 9554 9540 28010 14863 36072 42165 -4536 -12058 -35353 -24922 -9382 -1958
13171a958J7572M094m2275Q07M7160K643j6059J0042P477N5471j913r870k342
$$ -1958 15614 19708 -22567 -21760 25400 28043 11984 22026 29503 84974 83061 73191 70849
13158G0849j2373j8387l6991K8039J2357j7964l1924m2205J5418j4614L7443M5607
$$ 70849 58476 40089 3098 31137 43494 25530 -6394 -48599 -33181 -47795 -10352 35255
13146C5255j6251l4758j6061n420Q151J0410l77J4919K9806j1821j9610r838L434
$$ 35255 19004 -15754 -31815 -37235 -29084 -18674 -19051 -4132 25674 13853 -5757 -15595 -12161
13133a2161O584k3550k6904J1857k987J9070J3499K5913k6768o690m799K783k0499
$$ -12161 -5577 -29127 -56031 -44174 -47161 -28091 -14592 11321 -15447 -22137 -26936 -24153 -44652
13120d4652J2488M6093L2900L2948J6775j7621k7748M719j8614j5922k3129k43
$$ -44652 -32164 13929 46829 79777 96552 78931 51183 55902 37288 21366 -1763 -2006
13108b006J2015k2818J258K7012Q361q487M648M128N86n279J5067P287j9628j8146
$$ -2006 10009 -12809 -11551 15461 23822 15335 19983 24111 24697 19418 34485 41772 22144 3998
13094C998j3129K3656K1929J2127k1880k2500K3105J4427K3968k1865l0791Q695
$$ 3998 -9131 14525 36454 48581 26701 4201 27306 41733 65701 43836 13045 21740
13082B1740j7611R496K512O487j2701k5169M577P471Q846j0065J6368L143L0459
$$ 21740 4129 13625 16137 22624 9923 -15246 -10669 -3198 5648 -4417 11951 15094 45553
13069D5553M134j8985r310k0695m7402o743J9021J8312J2938K0055m445j6578
$$ 45553 49687 30702 21392 697 -46705 -53448 -34427 -16115 -3177 16878 12433 -4145
13057d145J6353P650J298J8580Q295k3317j1648j714p663P084r388N900r607l286
$$ -4145 12208 19858 21156 39736 48031 24714 13066 11352 3689 10773 1385 7285 -2322 -5608
13043e608o852j9310j3602j9737J0160L4907p749k945J2171J0652J7631Q061j3266
$$ -5608 -12460 -31770 -45372 -65109 -54949 -20042 -27791 -30736 -18565 -7913 9718 17779 4513
13030D513K7145J1389J1774n926O106k762k4857j3245P106L4127J1478J1252j5936
$$ 4513 31658 43047 54821 48895 55001 52239 27382 14137 21243 55370 66848 78100 62164
13017F2164j725J2688L3320L9965L6002M0894L6189Q4566J22439Q4842P8783R5437
$$ 62164 60439 73127 106447 146412 182414 223308 259497 344063 466502 551344 630127 725564
13005G25564J16029Q1570K9413n3444p1104j22365r8630q1501q8197p2610n5194
$$ 725564 841593 923163 952576 899132 828028 705663 607033 525532 437335 364725 309531
12994C09531m1971n0433l9007k2243m551j3659l0123k6451J2160j1740l5480j0905
$$ 309531 267560 217127 178120 155877 151326 137667 107544 81093 93253 81513 46033 35128
12982C5128J7966O873J1054k4767q758O854R562j2896k1271k5478l851J3672J0239
$$ 35128 53094 59967 71021 46254 37496 44350 53912 41016 19745 -5733 -9584 4088 14327
12969A4327n376j7606l266j0789K1189M5917q7P432j5214J8176L391l1996k4075
$$ 14327 8951 -8655 -11921 -22710 -1521 44396 44309 51741 36527 54703 58094 26098 2023
12956B023K668J2239o10R500J697O527k4799j2019K0325K7832P792l718J05j0155
$$ 2023 4691 16930 16320 25820 27517 34044 9245 -2774 17551 45383 53175 49457 49562 39407
12942C9407J771J8457j6995j1712J1118k1791l0978j3099J7697K6935L0033J1098
$$ 39407 41178 59635 42640 30928 42046 20255 -10723 -23822 -6125 20810 50843 61941
12930F1941j8527o386N206j7647l923N608Q814j9682J0736J5647L723k318n368
$$ 61941 43414 37028 42234 24587 20664 26272 35086 15404 26140 41787 45510 43192 37824
12917C7824j4263k365K9422k0887k6427Q818L1911J7082j90J0493J8756j7584
$$ 37824 23561 21196 50618 29731 3304 12122 44033 61115 60925 71418 90174 72590
12905G2590m4877K837J7746k7005M041M0613L7921k0373j5238j5088n688o672
$$ 72590 27713 30550 48296 21291 25332 65945 103866 83493 68255 53167 47479 40807
12893D0807l599R797J2157J3228k5578J9540R98l1369J6363K4314J7416K708k5824
$$ 40807 37208 47005 59162 72390 46812 66352 67350 35981 52344 76658 94074 96782 70958
12880G0958j2613k607k2167p796J4022q157l4081m503K3078m897j6721K284L5772
$$ 70958 58345 55738 33571 25775 39797 31640 -2441 -6944 16134 11237 -5484 -3200 32572
12867C2572J8999l326L708J8023p45j4149k9543K3760P596Q604J3228n0972j6677
$$ 32572 51571 48245 51953 69976 69231 55082 25539 49299 56895 65499 78727 27755 11078
12854A1078J4056n693j9353j3154K9820L0631j4583p353J0791N3910J5986r935
$$ 11078 25134 19441 88 -13066 16754 47385 32802 25449 36240 90150 106136 96201
12842I6201J1288l550k276J135J3267K910j0534l38R700j4008Q44K3350j3609
$$ 96201 107489 103939 101663 102798 116065 118975 108441 108103 117803 103795 104639 127989 114380
12829A14380k9115k7646l1755r180K0276Q518j723m425K6934J3788K4517j8647
$$ 114380 85265 57619 25864 16684 36960 45478 43755 39330 66264 80052 104569 85922
12817H5922l2304m0320j850R065J2613Q007n036Q282m988Q504l940K4369k362
$$ 85922 53618 13298 11448 20513 33126 41133 36097 44379 39391 47895 43955 68324 65962
12804F5962o340r179J1143K689L3507K8338R073l2703l4752N805p852k4405m8692
$$ 65962 59622 50443 61586 64275 97782 126120 135193 102490 67738 73543 65691 41286 -7406
12791g406K098J6867J7131K998K3728l310J443J2524K7704j2950Q611j7534J0377
$$ -7406 -5308 11559 28690 31688 55416 52106 53549 66073 93777 80827 89438 71904 82281
12778H2281M3596N046j6578K2549M1176r210j9708o900k5656k5844q981j8588
$$ 82281 125877 130923 114345 136894 178070 168860 149152 142252 116596 90752 81771 63183
12766F3183k706o600N872j935O602j1419j4737N824j6587J6057L325j962m596
$$ 63183 60477 53877 59749 57814 64416 52997 38260 44084 27497 43554 46879 44917 40321
12753D0321p317j4867m108k2468J4194J0276K2202n505K1118K2493M2935K1203
$$ 40321 33004 18137 14029 -8439 5755 16031 38233 32728 53846 76339 119274 140477
12741A40477K4578j5164J3012L5311J071q906j3856j6130N606J5590j4012j9015
$$ 140477 165055 149891 162903 198214 199285 190379 176523 160393 165999 181589 167577 148562
12729A48562k4531o286j1604o182k3049m9851j2421J3163p602k0292P716L4032
$$ 148562 124031 117745 106141 99959 76910 27059 14638 27801 20199 -93 7623 41655
12717D1655j4415L3276N7922J8855J09J165k5083L5886M7902k0221j2695K2529
$$ 41655 27240 60516 118438 137293 137402 138567 113484 149370 197272 177051 164356 186885
12705A86885L6726j7830j6890J2680j6889j2724L696R947M83q221R614j5851j452
$$ 186885 223611 205781 188891 201571 184682 171958 175654 185601 186084 177863 187477 171626 170174
12692A70174N65P204N035J5648N046k696O927J7195P862j5804O743J345O539J0350
$$ 170174 170739 177943 182978 198626 203672 200976 207903 225098 232960 217156 223899 225244 231783 242133
12678B42133K5656p776r597K7559l0126j7086K4262m900j2818Q112J7874j1460
$$ 242133 267789 260013 250416 277975 247849 230763 255025 250125 237307 245419 263293 251833
12666B51833j488M3072L9424L232k4658L6886K4313l3648n425R616R502k1011
$$ 251833 250345 293417 332841 336073 311415 348301 372614 338966 333541 343157 352659 331648
12654C31648K3647K9314J8982j8722R715L7661L3354K29l2495k5086Q772M6255
$$ 331648 355295 384609 403591 384869 394584 432245 465599 465828 433333 408247 417019 463274
12642D63274M1874q557K4744K9910k847j9747J4051M0209L7022N0231o366L2492
$$ 463274 505148 496591 521335 551245 548398 528651 542702 582911 619933 670164 663798 696290
12630F96290K9215J8924N0655N1107M2351M9696Q5023J5092K0916N7613O2861
$$ 696290 725505 744429 795084 846191 888542 938238 1023261 1038353 1059269 1116882 1179743
12619A179743P6456R6992J01461J24635J12963J05574J35729J41657J63141K21029
$$ 1179743 1256199 1353191 1454652 1579287 1692250 1797824 1933553 2075210 2238351 2459380
12609B459380K68692L19082M00666M98625O00449P42154Q95585J009123J124592
$$ 2459380 2728072 3047154 3447820 3946445 4546894 5289048 6184633 7193756 8318348
12600H318348J197470J288922J372647J515863J794794K387954L454083N310717
$$ 8318348 9515818 10804740 12177387 13693250 15488044 17875998 21330081 26640798
12592B6640798Q223801J2331238J6897386K0544016K2513089K2605170K0869780
$$ 26640798 34864599 47195837 64093223 84637239 107150328 129755498 150625278
12585A50625278J6826136J0060944J193325p482066j4281139j8564827k0810598
$$ 150625278 167451414 177512358 178705683 171223617 156942478 138377651 117567053
12578A17567053k1309568j9860592j6585601j2495723q884600o201447m449464
$$ 117567053 96257485 76396893 59811292 47315569 38430969 32229522 27780058
12571B7780058l324571k609640k160275j947928j814807j685555j572924j418709
$$ 27780058 24455487 21845847 19685572 17737644 15922837 14237282 12664358 11245649
12563A1245649j289671j133979r60398p75194o39434n60730n17167m15455l46514
$$ 11245649 9955978 8821999 7861601 7086407 6446973 5886243 5369076 4953621 4607107
12554D607107l03528k96772k53358k27154k47781j92298j60942j63973j64501
$$ 4607107 4303579 4006807 3753449 3526295 3278514 3086216 2925274 2761301 2596800
12545B596800j62286j37838j36131j41690j01551p7190j01854q9300p0862r3096
$$ 2596800 2434514 2296676 2160545 2018855 1917304 1840114 1738260 1648960 1578098 1485002
12535A485002l0896l2337o7505o9310o1796n2990r1715q9315r2396n9455l3709
$$ 1485002 1454106 1421769 1354264 1284954 1223158 1170168 1078453 989138 896742 837287 803578
12524H03578l5853l5433n9518p0512n0025n533Q536k2293l4489n5945L778J0802
$$ 803578 767725 732292 672774 602262 552237 546704 555240 532947 498458 442513 446291 457093
12512D57093j2243j7790j4826k4591k1397k8514Q35P283O912j6429k9882L410
$$ 457093 444850 427060 412234 387643 366246 337732 338567 345850 352762 336333 306451 309861
12500C09861j1349j9061j0407l986l4565p527l6055J1887K3510J8057J013m3577
$$ 309861 298512 279451 269044 265058 230493 222966 186911 198798 222308 240365 241378 197801
12488A97801q452n402M532K2183O309J327l8693m0252m532K952n629j0421l653
$$ 197801 189349 183947 188479 210662 216971 218298 179605 139353 134821 137773 132144 121723 118070
12475A18070j4409J376L307m588M964l2142j7498m487L2473P787k3576L1478L5163
$$ 118070 103661 105037 108344 103756 108720 76578 59080 54593 87066 94853 71277 102755 137918
12462A37918L2516j2568j5477k6006j097J4983K7147J41J5169J9988J0730j3405
$$ 137918 170434 157866 142389 116383 115286 130269 157416 157557 172726 192714 203444 190039
12450A90039k8694J1780j7858k0690J9883L1665k9154j4825j982l0110l8220L927
$$ 190039 161345 173125 155267 134577 154460 186125 156971 142146 140164 110054 71834 75761
12438G5761K508K7874j0681o003M5l5845l3432j1637j4968J1836L1544K0806N5716
$$ 75761 78269 106143 95462 89459 89504 53659 20227 8590 -6378 5458 37002 57808 113524
12425A13524N0028J5747j1818j0641J1767N0757N5912L4819K1466K4821J1064
$$ 113524 163552 179299 167481 156840 168607 219364 275276 310095 331561 356382 367446
12414C67446K4750N6087J02355J13651J62710J37573J04467Q1140J05574P6809
$$ 367446 392196 448283 550638 664289 826999 964572 1069039 1150179 1255753 1332562
12404A332562L5949j8052o3807q8697j14737j10308j04404j21383p1102j22785
$$ 1332562 1368511 1350459 1286652 1197955 1083218 972910 868506 747123 676021 553236
12394E53236r6199n2961p4181o0391j2527p197l951j4293k4063j2360j8230k8312
$$ 553236 457037 404076 329895 269504 256977 249780 245829 231536 207473 195113 176883 148571
12382A48571j4228j5714j8881j0518j4775L784K0476q37n701O310j6180k0142
$$ 148571 134343 118629 99748 89230 74455 78239 98715 97878 92177 98487 82307 62165
12370F2165o415q719J1818k1144j8284M46k1381O231L2929J1208m2739l6887L536
$$ 62165 55750 47031 58849 37705 19421 19867 -1514 4717 37646 48854 6115 -30772 -27236
12357b7236K8014L8708k413J2197L3q288o002K0675J8543j704r003K0268K8109
$$ -27236 778 39486 37073 49270 49303 41015 35013 55688 74231 72527 63524 83792 111901
12344A11901j5437q155N75k1061k2056n1625k3243N1463O5531J2115N0820J8128
$$ 111901 96464 88309 88884 67823 45767 -5858 -29101 22362 87893 100008 150828 168956
12332A68956k9427q0763J493J8443k8483n261j7457K9596K1986J2756R028m2670
$$ 168956 139529 58766 60259 78702 50219 44958 27501 57097 79083 91839 100867 58197
12320E8197l3862l5599J8971j4582K659J7776j896J0284j9602j3274J2844R286
$$ 58197 24335 -11264 7707 -6875 -4216 13560 11664 21948 2346 -10928 1916 11202
12308A1202k5693M391M4360M2497k2228k5869k6568M746J1270j300J061r871K104
$$ 11202 -14491 -10100 34260 76757 54529 28660 2092 6838 18108 16808 17869 7998 10102
12295A0102J0181M1067N803k4847J3932j3093Q491K3248k2122k7977K0186J9452
$$ 10102 20283 61350 67153 42306 56238 43145 51636 74884 52762 24785 44971 64423
12283F4423k7649l0590l8157M740J3457L169J8890K9076O13J1053N460p823K9105
$$ 64423 36774 6184 -31973 -27233 -13776 -10607 8283 37359 37972 49025 54485 46662 75767
12270G5767O743o889k0604r255l834J3520L9579K0335l244Q837r305K8205K406
$$ 75767 82510 75621 55017 45762 41928 55448 95027 115362 112118 120955 111650 139855 142261
12257A42261j3904q16K3336J5651n176Q49J6974R761L98J0417L4702M3551K1231
$$ 142261 128357 127541 150877 166528 161352 162201 179175 188936 189334 199751 234453 278004 299235
12244B99235K6770L0069L5560L908k9083n7712m3938l5916l7998l0698j8897k8008
$$ 299235 326005 356074 391634 395542 366459 308747 264809 228893 190895 160197 141300 113292
12232A13292j0668q667l6033J0617q382n326J3583K5146J1130q209l1755r400
$$ 113292 102624 93957 57924 68541 60159 54833 68416 93562 104692 96483 64728 55328
12220E5328J6421M247j523R521K5029M217k5503j6352j4915n33K4759M90M348
$$ 55328 71749 75996 74473 83994 109023 113240 87737 71385 56470 55937 80696 81186 85534
12207H5534K7245N836k2561k2970k270j8422o488K2583L321P593o468J0054l537
$$ 85534 112779 118615 96054 73084 70814 52392 45904 68487 71808 79401 72933 82987 79450
12194G9450j5693J340J0877J5844l273j2870j6457N058l081o365k4287l4908j5771
$$ 79450 63757 65097 75974 91818 88545 75675 59218 64276 61195 54830 30543 -4365 -20136
12181b0136P703K3098L1897k719l399J6387L8242o623k35N727K9774K9519J6945
$$ -20136 -12433 10665 42562 39843 36444 52831 91073 84450 84215 89942 119716 149235 166180
12168A66180M3659J1313L3248J00848J11663O9036M5494R2753J09761R2400N7099
$$ 166180 209839 221152 254400 355248 466911 535947 581441 674194 783955 876355 933454
12157I33454J7823l0484o7447q1812q6518r6601j23501j12521p7920n4349q881
$$ 933454 951277 920793 853346 771534 685016 588415 464914 352393 274473 220124 211243
12146B11243j7988j3912j0509m4029l7386m7698J4496J1128l1920j9614o573k9750
$$ 211243 193255 179343 168834 124805 87419 39721 54217 65345 33425 13811 7238 -22512
12134b2512M301J9245L2569M793R018r498j099j6345N822k7973J413n523o915
$$ -22512 -18211 1034 33603 38396 47414 37916 36817 20472 26294 -1679 -266 -5789 -12704
12121a2704L4848P207o236J0112l771j8619l4518j0451L4277J9151J04O702L2038
$$ -12704 22144 29351 23115 33227 29456 10837 -23681 -34132 145 19296 19400 26102 58140
12108E8140J6210k7867k4950m499J6617J5951l0260k5326j1687K0615O680m974
$$ 58140 74350 46483 21533 17034 33651 49602 19342 -5984 -17671 2944 9624 4650
12096D650q989r296m2081R775L2964J6947p63o000K4659j2564J0550K776j4629
$$ 4650 -4339 -13635 -55716 -45941 -12977 3970 3207 -2793 21866 9302 19852 22628 7999
12083G999n5781j7178N390j4987K1077Q903P546K9870K0153j5630L829J3280j4289
$$ 7999 -47782 -64960 -59570 -74557 -53480 -44577 -37031 -7161 12992 -2638 1191 14471 182
12070A82j9791q381O560j2763J8535N0967K7010q017k7410O237L5580J2495K246
$$ 182 -19609 -27990 -21430 -34193 -15658 35309 62319 54302 26892 33129 68709 81204 83450
12057H3450l2166L1308N5003j4106j7998j2431k3092L4658N786j7437p061j3279
$$ 83450 51284 82592 137595 123489 105491 93060 69968 104626 110412 92975 85914 72635
12045G2635m2750p508J5143j9390J1867q793j914J4553j5995o43L8941l814j6959
$$ 72635 29885 22377 37520 18130 29997 21204 19290 33843 17848 17205 56146 52332 35373
12032C5373j5733k1488k2627j2908L0748L1626k2360R084P414J6398J6595j9249
$$ 35373 19640 -1848 -24475 -37383 -6635 24991 2631 11715 19129 35527 52122 32873
12020C2873l9797p616r710O103L535Q643J2592k039j1849k7646n987m60l635J3144
$$ 32873 -6924 -14540 -24250 -18147 -14612 -5969 6623 4584 -7265 -34911 -40898 -41358 -44993 -31849
12006c1849J5839Q968O189k7556J02R577K1734M0235J0981K451k2805l3306j6869
$$ -31849 -16010 -7042 -853 -28409 -28307 -18730 3004 43239 54220 56671 33866 560 -16309
11993a6309K2541r735j796j0586O4J3592L2607L211m7707j5104j9035o211J6273
$$ -16309 6232 -3503 -5299 -15885 -15821 -2229 30378 33589 -14118 -29222 -48257 -54468 -38195
11980c8195J6672k4655k5948K5496O458J0858j5449j0249J7702L636m469j2782
$$ -38195 -21523 -46178 -72126 -46630 -40172 -29314 -44763 -55012 -37310 -33674 -38143 -50925
11968e0925p747J812J4010K427L2058K4556Q184K09r790P243K7513n431r095k4778
$$ -50925 -58672 -56860 -42850 -40423 -8365 16191 24375 24584 14794 22037 49550 44119 35024 10246
11954A0246J3253M3446j3848m4513j2828L6421l607j2313q736Q104O417J1561
$$ 10246 23499 66945 53097 8584 -4244 32177 28570 16257 7521 15625 22042 33603
11942C3603j2600j3888j9399N752j1140l7643P842K3709j1936Q67j0225J130M2082
$$ 33603 21003 7115 -12284 -6532 -17672 -55315 -47473 -23764 -35700 -34833 -45058 -43928 -1846
11929a846L0268J069O958l1340l2140P964Q324M0061j1021l3877j2802J1698n558
$$ -1846 28422 29491 36449 5109 -27031 -19067 -10743 29318 18297 -15580 -28382 -16684 -22242
11916b2242j322L626J243J2227M361j8861o168Q69J7200j3065R073n879l947q557
$$ -22242 -23564 -19938 -18695 -6468 -2107 -20968 -27136 -26267 -9067 -22132 -13059 -18938 -22885 -31442
11902c1442k2008J367L2780m047j2900K5476q443j5175J7888r049m274K4682k3397
$$ -31442 -53450 -52083 -19303 -23350 -36250 -10774 -19217 -34392 -16504 -25553 -29827 -5145 -28542
11889b8542J7955K6177m894J1892K3727j0925n840Q50N724K6230l893m2987j6767
$$ -28542 -10587 15590 10696 22588 46315 35390 29550 30400 36124 62354 58461 15474 -1293
11876a293K1060k9294m5190R854N4923j4582q765J3616o378R955j2331J2974j2084
$$ -1293 19767 -9527 -54717 -44863 10060 -4522 -13287 329 -6049 3906 -8425 4549 -7535
11863g535j9183m191J9512K7345J8675j2017n131K233j2754k2165P570l960k788
$$ -7535 -26718 -30909 -11397 15948 34623 22606 17475 19708 6954 -15211 -7641 -11601 -14389
11850a4389J3688K883k6420j029k139P742J4139N048L594J3411K0758J068k7819
$$ -14389 -701 2182 -24238 -25267 -27406 -19664 -5525 -477 3117 16528 37286 38354 10535
11837A0535n481K1880j3897j8125N181L6605K4537j3493k6883j9208N013j1321
$$ 10535 5054 26934 13037 -5088 93 36698 61235 47742 20859 1651 6664 -4657
11825d657J687m522m054J2712N210J6987J1925J2076l8385k7293n383j0902N051
$$ -4657 -2970 -7492 -11546 1166 6376 23363 35288 47364 8979 -18314 -23697 -34599 -29548
11812b9548N6476K8187k5394n3556K2500K5215j1881Q199Q970q775P059m136o442
$$ -29548 26928 55115 29721 -23835 -1335 23880 11999 20198 29168 20393 27452 23316 16874
11799A6874l2481l8548j5695P796K3900N930k53K652j737k3922l1425M6090J4805
$$ 16874 -15607 -54155 -69850 -62054 -38154 -32224 -32477 -29825 -31562 -55484 -86909 -40819 -26014
11786b6014j2978m988p001L9205J6532j7183k4257K2451L1298l6155Q57K7070
$$ -26014 -38992 -43980 -50981 -11776 4756 -12427 -36684 -14233 17065 -19090 -18233 8837
11774H837K51j1943k1625R700J3843k6609j5244J7638J4085N119J4457j6694j6908
$$ 8837 9088 -2855 -24480 -14780 -937 -27546 -42790 -25152 -11067 -5948 8509 -8185 -25093
11761b5093m53J1027j611J7479P354L724J0105J6039J2958p800j5366j5079n473
$$ -25093 -25546 -14519 -16130 1349 8703 12427 22532 38571 51529 43729 28363 13284 7811
11748G811K3288q201j6072k3250K709L2387L523P39M197K6906j5625l3765k7239
$$ 7811 31099 22898 6826 -16424 -13715 18672 22195 22934 27131 54037 38412 4647 -22592
11735b2592L9726J9619l0256j7058J719m195l869J3633J1004K663M385K4753K1865
$$ -22592 17134 36753 6497 -10561 -8842 -13037 -16906 -3273 7731 10394 14779 39532 61397
11722F1397j5709k665k3947j3980k1223p302k962P176J9770L6994J0188k2723
$$ 61397 45688 43023 19076 5096 -16127 -23429 -26391 -19215 555 37549 47737 25014
11710B5014n1446k5294K7215K1768K328R321j0675l4521j5728l783L8546K5872
$$ 25014 -26432 -51726 -24511 -2743 -415 8906 -1769 -36290 -52018 -55801 -17255 8617
11698H617M190M778j8013L421K1807j573j9650J7161L904J875j74j3345R011R168
$$ 8617 12807 17585 -428 2993 24800 23227 3577 20738 24642 26517 26343 12998 22009 31177
11684C1177J1015m198M08j8163n88J2963k6197j0644O788n066M5695M6201J0748
$$ 31177 42192 37994 38402 20239 19651 32614 6417 -4227 2561 -2505 43190 89391 100139
11671A00139o3632k1346m567m0934j0147K1367K516n597q348K692J2440O178k443
$$ 100139 36507 15161 10594 -30340 -40487 -19120 -16604 -22201 -30549 -27857 -15417 -9239 -11682
11658a1682j6637J3635M5721KJ1011o693j5992k7267k3142J0217M4134J6526l916
$$ -11682 -28319 -14684 31037 31039 42050 35357 19365 -7902 -31044 -20827 23307 39833 35917
11645C5917K1178K3254J3541l8970l6293J9669p748j2708k631P662j5930j4957
$$ 35917 57095 80349 93890 54920 18627 38296 30548 17840 15209 22871 6941 -8016
11633h016J0154j2062r93J1893L0662J2296J6276q532l7933n056N055k4705j5199
$$ -8016 2138 -9924 -10917 976 31638 43934 60210 51678 13745 8689 13744 -10961 -26160
11620b6160q276K161K9396M431J0936K1947o587k9476n6627j281J7265L4053L3622
$$ -26160 -34436 -32275 -2879 1552 12488 34435 27848 -1628 -58255 -59536 -42271 -8218 25404
11607B5404j6724J9j2185J6447J2955J2080o917j7429j6842k5010J8448N2425
$$ 25404 8680 8699 -3486 12961 25916 37996 31079 13650 -3192 -28202 -9754 42671
11595D2671n493j1241M930l2876m7048j0230J6015K6901o410j5327O100K4507
$$ 42671 37178 25937 30867 -2009 -49057 -59287 -43272 -16371 -22781 -38108 -32008 -7501
11583g501j1464J6599o095n564J0233j1570l049j6568l1446j0816J8907J5126
$$ -7501 -18965 -2366 -8461 -14025 -3792 -15362 -18411 -34979 -66425 -77241 -58334 -43208
11571d3208K5145J8709M907j8695k6915M285j0460j4247M631P477O03K9041Q671
$$ -43208 -18063 646 5553 -13142 -40057 -35772 -46232 -60479 -55848 -48371 -47768 -18727 -10056
11558a0056j3259j6093N471k700j506K0974J4305J7915q883m4212k4311J5174
$$ -10056 -23315 -39408 -33937 -36637 -38143 -17169 -2864 15051 6168 -38044 -62355 -47181
11546d7181J3561K4145N0115j6829m5521k1927J2152K8713R064J8633j8569r973
$$ -47181 -33620 -9475 40640 23811 -21710 -43637 -31485 -2772 6292 24925 6356 -3617
11534c617q572n02O610R087j691j2692N526j990o48J1375k3576j5252J0768J7870
$$ -3617 -12189 -12691 -6081 3006 1315 -11377 -5851 -7841 -8489 2886 -20690 -35942 -25174 -7304
11520g304K9993J6753l0921j8957J3643k1000j7822K4959n349j9781J6143j0663
$$ -7304 22689 39442 8521 -10436 3207 -17793 -35615 -10656 -16005 -35786 -19643 -30306
11508c0306q319n950j0898L5309P515K341N968j3301K624o13K5380j934j2136
$$ -30306 -38625 -44575 -55473 -20164 -12649 -10308 -4340 -17641 -15017 -15630 9750 7816 -4320
11495d320O232j9637L29L5411O050k839j5005q766k8526k359L6727J2447M113
$$ -4320 1912 -17725 -17396 18015 24065 21226 6221 -2545 -31071 -33430 3297 15744 19857
11482A9857Q612J4131o462k7290j9957k1949J8154L977O828J0203Q471J1208q448
$$ 19857 28469 42600 36138 8848 -11109 -33058 -14904 -10927 -4099 6104 14575 25783 17335
11469A7335k4302o634M5717K1202Q781K256K823j467K5661K8726L4059M4720K5280
$$ 17335 -6967 -13601 32116 53318 62099 64355 67178 65711 91372 120098 154157 198877 224157
11456B24157N1122P7301J04489J30597J64972J16780K5752o7982j25730j48443
$$ 224157 275279 352580 457069 587666 752638 869418 895170 827188 701458 553015
11446E53015q6446o7230o5040n3655k0437j9352k1859j2174n3596j4714j1676
$$ 553015 466569 399339 334299 280644 260207 240855 218996 206822 153226 138512 126836
11435A26836l0501j4478j9249P941j4399P846l4560j0203L4786J3805r016O458
$$ 126836 96335 81857 62608 70549 56150 63996 29436 19233 54019 67824 58808 65266
11423F5266L570k9507k5896j667J8206P220l017j5462k2698L98M0679l13j1841
$$ 65266 68836 39329 13433 11766 29972 37192 34175 18713 -3985 -3587 37092 36779 24938
11410B4938m7489N419J569q814j6384J6126J9914L4077L451n253j4841J443o978
$$ 24938 -22551 -17132 -15563 -24377 -40761 -24635 -4721 29356 32807 27554 12713 14156 7178
11397G178k2227j3600l6864n909K5428L6254L4480N181m4231p47J2170j1161j2122
$$ 7178 -15049 -28649 -65513 -71422 -45994 -9740 24740 29921 -14310 -15057 -2887 -14048 -26170
11384b6170J8467O954k5515l1259K8653L9131K8894l271l3713j9736J8253N450
$$ -26170 -7703 -749 -26264 -57523 -28870 10261 39155 35884 2171 -17565 688 6138
11372F138p878K139J0389L799p004m0857k136K6490K950N828k1216L567K2768
$$ 6138 -1740 399 10788 14587 7583 -33274 -35410 -8920 -5970 -142 -21358 -17791 4977
11359D977k1356j8594J0805j8101j0120m2181L3373L5543K1428J8786J4709J7287
$$ 4977 -16379 -34973 -24168 -42269 -52389 -94570 -61197 -25654 -4226 14560 29269 46556
11347D6556m1652J587R464r345n339j4415j3967K4154o458k4870m5455k7167L4205
$$ 46556 4904 6491 15955 6610 1271 -13144 -27111 -2957 -9415 -34285 -79740 -106907 -72702
11334g2702M6326L6508L3012k7775M216J4226k9569l820J2488k9183j3960j4455
$$ -72702 -26376 10132 43144 15369 19585 33811 4242 422 12910 -16273 -30233 -44688
11322d4688P526j0242J364K1313J6882K747O33k6117m0100P74L2044L114j3734
$$ -44688 -37162 -47404 -46040 -24727 -7845 -5098 -4465 -30582 -70682 -69908 -37864 -34750 -48484
11309d8484K7022M469j9101j6629L1846M7697K2968k043k887j2792l518k4856
$$ -48484 -21462 -16993 -36094 -52723 -20877 26820 49788 47745 44858 32066 28548 3692
11297C692k5704j0844j9738Q220K7417j5859J9565J4752j2776o010K976n226k1341
$$ 3692 -22012 -32856 -52594 -44374 -16957 -32816 -13251 1501 -11275 -17285 -14309 -19535 -40876
11284d0876J3867M2785K2126l0580o880r060j3456J4889J0679o498j2079N4170
$$ -40876 -27009 15776 37902 7322 442 -8618 -22074 -7185 3494 -3004 -15083 39087
11272C9087J2848l3069k0660J9881J2729k9617j7286K8321K302l0918q690k20
$$ 39087 51935 18866 -1794 18087 30816 1199 -16087 12234 14536 -16382 -25072 -25292
11260b5292m760K5879L313M560o786m559K6325J3307j3390r812k9287J2669K3269
$$ -25292 -30052 -4173 -860 3700 -3086 -7645 18680 31987 18597 8785 -20502 -7833 15436
11247A5436n381j4150J1244j7160p571j2232K7791L1581k1174q106k7691j4813
$$ 15436 10055 -4095 7149 -10011 -17582 -29814 -2023 29558 8384 278 -27413 -42226
11235d2226J5729P47r207K6697L4823k6632k785J0021K6066N01K663J122j1942
$$ -42226 -26497 -25750 -34957 -8260 26563 -69 -2854 7167 33233 33734 36397 37519 25577
11222B5577p889j5418N44m044j0659l645K7761j6562J0855L0595k4751k0256P340
$$ 25577 17688 2270 2814 -1230 -11889 -15534 12227 -4335 6520 37115 12364 -7892 -552
11209e52l619M206O304m447K1337k3623K0439M2378K2015j4743l0172j1311O76
$$ -552 -4171 35 6339 1892 23229 -394 20045 62423 84438 69695 39523 28212 28888
11196B8888o41K540k2405Q572K8626j5371j6240L1106P900l6551q282N1599l0689
$$ 28888 28247 30787 8382 16954 45580 30209 13969 45075 52975 16424 8142 59741 29052
11183B9052q850L850m591l607R525p796l065L8369k186J8088J463j0089j0192
$$ 29052 20202 24052 19461 15854 25379 17583 14518 52887 50701 68789 70252 60163 49971
11170D9971m4189j6983P565L0928M7649N976k6095m4402n506P820j8838Q284M480
$$ 49971 5782 -11201 -3636 27292 74941 80917 54822 10420 4914 12734 -6104 2180 6660
11157F660n19K1659j894j4654L23R609r718j1990P994N089N599O042m2463l3897
$$ 6660 6141 27800 25906 11252 11575 21184 11466 -524 7470 12559 18158 24200 -18263 -52160
11143e2160M1451k083L554j496J4727K0713P875j1458K8277O845j4875o985j2517
$$ -52160 -10709 -12792 -9238 -10734 3993 24706 32581 21123 49400 56245 41370 34385 21868
11130B1868l1654k6932o115N336J8827K1401k6960k4616m119K5515N8198k666
$$ 21868 -9786 -36718 -42833 -37497 -18670 2731 -24229 -48845 -52964 -27449 30749 28083
11118B8083N093j3137J6100q832m949k4929j5048n072J9245J7501k2524k5451
$$ 28083 33176 20039 36139 27307 22358 -2571 -17619 -22691 -3446 14055 -8469 -33920
11106c3920J5164N2318m1387j8983M0809K9157M0392Q575j9838m6391m1563Q707
$$ -33920 -18756 33562 -7825 -26808 14001 43158 83550 92125 72287 25896 -15667 -6960
11094f960L0091J9149j2363j0036r527K317j3394J0714J5621O382l2434l2723
$$ -6960 23131 42280 29917 19881 10354 12671 -723 9991 25612 31994 -440 -33163
11082c3163k2270J647M2482L325O432J2714L1149J1723K61j4317j8999j992J390
$$ -33163 -55433 -53786 -11304 -7979 -1547 11167 42316 54039 54300 39983 20984 18992 20382
11069B0382l498L578J5326K5480L6581M161M2073L0998J6584N4545p146j6454
$$ 20382 16884 20462 35788 61268 97849 102010 144083 175081 191665 246210 239064 222610
11057B22610L65m518l8139n2745l098P243J544k5532k6896K3473k6744l6772P924
$$ 222610 222975 218457 180318 127573 124475 131718 133262 107730 80834 104307 77563 40791 48715
11044D8715j1795k5856K358R307P329Q944J1768j432o077k80j986M6046L9172
$$ 48715 36920 11064 13422 22729 30058 39002 50770 49338 43261 42981 40995 87041 126213
11031A26213K885M0545M4463J6653j1411l4958n4187l1251l9057k5206k6007m659
$$ 126213 129098 169643 214106 230759 219348 184390 130203 98952 59895 34689 8682 4023
11019D023N6132J3678j8116m9957m294M2769K0500J5246Q165k0516J9469r115
$$ 4023 60155 73833 55717 5760 1466 44235 64735 79981 88146 67630 87099 77984
11007G7984k4021J388L5923k150p338k6514J3809l144k6583O464J1410L495k8120
$$ 77984 53963 55351 91274 89124 81786 55272 69081 65937 39354 45818 57228 60723 32603
10994C2603K6238k595n901j8236l0683j7269k58J1739P093o722N052Q867N949
$$ 32603 58841 56246 50345 32109 1426 -15843 -16101 -4362 2731 -3991 1061 9928 15877
10981A5877r587j0054J0097M905K1319K7760o325m7748n955J0682M0650j3638
$$ 15877 6290 -3764 6333 11238 32557 60317 53992 6244 289 10971 51621 37983
10969C7983J5469j7736l0807j3938K8861N2992L4604M4353P526J8460L7075P8420
$$ 37983 53452 35716 4909 -9029 19832 72824 107428 151781 159307 177767 214842 293262
10957B93262R2222J61459K54353M14456N82560N06513N6007l74837n04213l91685
$$ 293262 385484 546943 801296 1215752 1798312 2304825 2360832 1985995 1481782 1090097
10947A090097k71677j80950j56373j15212q0485m6199l6766o233M90k2587k6653
$$ 1090097 818420 637470 481097 365885 285400 239201 202435 196202 196692 174105 147452
10936A47452j1059J182N663l1769n2352J1558K3016o86j7373l6368k0399M971
$$ 147452 136393 137575 143238 111469 59117 70675 93691 93005 75632 39264 18865 23836
10924B3836L173k1003p767L483L6358M0784j2855J1349k962o306j9785k0119n885
$$ 23836 27009 6006 -1761 1722 38080 78864 66009 77358 74396 68090 48305 28186 22301
10911B2301J1737J4191p40l544L5320J8956j1911k1963n6254j8974J3298J3610
$$ 22301 34038 48229 47489 43945 79265 98221 86310 64347 8093 -10881 2417 16027
10899A6027k5878Q007q980P944j9950m239J8745L7545J3529m595p588O665q409
$$ 16027 -9851 -1844 -10824 -2880 -22830 -27069 -8324 29221 42750 38155 30567 37232 28823
10886B8823K6230j6110n183K5767J4247N453L5200P272j8785m8606m1152k2390
$$ 28823 55053 38943 33760 59527 73774 79227 114427 121699 102914 54308 13156 -9234
10874i234j0098J7854J0667K8978j8131j2191j7598J0937k004j9177K069J5342
$$ -9234 -19332 -1478 9189 38167 20036 7845 -9753 1184 -820 -19997 -17928 -2586
10862b586K6861j0144M141J6877j1821R972J468n768J1153j8941k7091K3758K8271
$$ -2586 24275 14131 18272 35149 23328 33300 34768 29000 40153 21212 -5879 17879 46150
10849D6150J7235l1963m2779q228r413M351J1675j0355j3783k822M6606P7969
$$ 46150 63385 31422 -11357 -19585 -28998 -24647 -12972 -23327 -37110 -39932 6674 84643
10837H4643m134k1919m077m257j4658j8326J2469O501m015m601L5756K3506q381
$$ 84643 80509 58590 54513 50256 35598 17272 29741 36242 32227 27626 63382 86888 78507
10824G8507r966r638r652K0070O459k4342Qq180N230K9419j8363j5267Q635j3313
$$ 78507 68541 58903 49251 69321 75780 51438 51446 43266 48496 77915 59552 44285 52920 39607
10810C9607p639K293m985J3511J1795j4568J5249K0149K9660j3599j8536n877
$$ 39607 31968 34261 29276 42787 54582 40014 55263 75412 105072 91473 72937 67060
10798F7060K0610L401q090m240L1676O862l055Q552N2340K5609Q382L384j7909
$$ 67060 87670 91071 82981 78741 110417 117279 114224 122776 175116 200725 209107 212491 194582
10785A94582m5326j464J9362l0536j0659K24k3232k2944j9533k1626k4451r265
$$ 194582 149256 147792 167154 136618 125959 126183 102951 80007 60474 38848 14397 5132
10773E132n073K1848K3314j78p500J7191M530j1348P135j6145k5441j9749k527
$$ 5132 59 21907 45221 45043 37543 54734 59264 47916 55051 38906 13465 -6284 -8811
10760h811O713N1676N7252J4160m8381k7167j2669k086O938J9555L3342j8536
$$ -8811 -2098 49578 106830 120990 72609 45442 32773 30687 37625 57180 90522 71986
10748G1986j0516K7823R279n850o057j2012l390m299l631J6720K4461J106K0704
$$ 71986 61470 89293 98572 92722 86665 74653 71263 66964 63333 80053 104514 105620 126324
10735A26324J0758l1739q242j1686k3442j2342k0120n560M3772L4610L9838K9855
$$ 126324 137082 105343 97101 85415 61973 49631 29511 23951 67723 102333 142171 172026
10723A72026J4467O263m2291n1923m4692l3732p353K3221L5492J5905J3986l4652
$$ 172026 186493 192756 150465 98542 53850 20118 12765 35986 71478 87383 101369 66717
10711F6717k1962M111L1233J3515m1991k8933O278J0964J6611M533l754j1471
$$ 66717 44755 48866 80099 93614 51623 22690 28968 39932 56543 61076 57322 45851
10699D5851N5701M4568o790j2797k3821k7136k6124Q490O7389J17534P6678L3902
$$ 45851 101552 146120 139330 126533 102712 75576 49452 57942 125331 242865 319543 353445
10687C53445P929k1959o4527k9443k9603k9292k0656o329K2874k8226k2447k3690
$$ 353445 361374 339415 274888 245445 215842 186550 165894 159565 182439 154213 131766 108076
10675A08076k1536J7526Q07R140J0529j4693k3571l7267k3610J3790L852K0512
$$ 108076 86540 104066 104873 114013 124542 109849 86278 49011 25401 39191 43043 63555
10663F3555l696N9166J07821J11793K8612m5382p1032p511q099o121K800m746
$$ 63555 59859 119025 226846 338639 367251 321869 250837 243326 235227 229106 231906 227160
10651B27160L354Q907R043J823J4135J5116J2200p643J9068K536m9857J8526J861
$$ 227160 230514 239421 248464 250287 264422 279538 291738 284095 303163 305699 255842 274368 276229
10638B76229K78J9520J3083L2466j8346k4149L4466K46p898q226O958l9442j9311
$$ 276229 276507 296027 309110 341576 323230 299081 333547 333793 325895 317669 324627 285185 265874
10625B65874q294K4494L1651J7093K0554L9700m7267r499J3091J8739p176j2816
$$ 265874 257580 282074 313725 330818 351372 391072 343805 334306 347397 366136 358960 346144
10613C46144M827K2979N913j7533p324N092K0578J1044K241M3528L7001j9290
$$ 346144 350971 373950 379863 362330 355006 360098 380676 391720 393961 437489 474490 455200
10601D55200J473N1818M6899N3092M0421L7562M605K3583K04k0311m666J9357
$$ 455200 456673 508491 555390 608482 648903 686465 691070 714653 714857 694546 689880 709237
10589G09237M4100M1736J2566m0433m7230j3787J9248L4560M7332R7564J27088
$$ 709237 753337 795073 807639 767206 719976 706189 725437 759997 807329 904893 1031981
10578A031981J11492O8475M0947O159J0494L6937L4842L6159R1063J37848R7365
$$ 1031981 1143473 1211948 1252895 1259054 1269548 1306485 1341327 1377486 1468549 1606397 1703762
10567A703762R2868R8393J59579J99131J75779J47915J68492K04559J88717L06339
$$ 1703762 1796630 1895023 2054602 2253733 2429512 2577427 2745919 2950478 3139195 3445534
10557C445534M49302N69008O49217P11733R12713J202854J282032R90375O63423
$$ 3445534 3894836 4463844 5113061 5824794 6737507 7940361 9222393 10212768 10876191
10548A0876191N95601Q30605J261114J822483K496651L397211M596809O329039
$$ 10876191 11471792 12302397 13563511 15385994 17882645 21279856 25876665 32205704
10540C2205704Q856857J2897839K0075466L3227597N7048169R4591445J23374167
$$ 32205704 41062561 53960400 74035866 107263463 164311632 258903077 382277244
10533C82277244P9081940k8138661r4852111r5943165o9900951m5982418l0033485
$$ 382277244 461359184 433220523 338368412 242425247 172524296 126541878 96508393
10526I6508393k0150553j4066493j0286517p913921o320763n147760m202082l392854
$$ 96508393 76357840 62291347 52004830 44090909 37770146 32622386 28420304 25027450
10518B5027450k613727j906955j406955j387797j672631j758912j609398j277923
$$ 25027450 22413723 20506768 19099813 17712016 16039385 14280473 12671075 11393152
10510A1393152r84195p69367o96813o87294o01242n40330m75844m43644l89371
$$ 11393152 10408957 9639590 8942777 8255483 7654241 7113911 6638067 6194423 5805052
10501E805052l61962l40418k99935k53655k61628k19935j71592k04553k04606
$$ 5805052 5443090 5102672 4802737 4549082 4287454 4067519 3895927 3691374 3486768
10492C486768k20329k26562j82635j29146p8409n8160o7858p8012p4330n3836
$$ 3486768 3266439 3039877 2857242 2728096 2649687 2591527 2523669 2445657 2371327 2317491
10482B317491o9937r9264j08592j60980j11025o9010q4587j02287j03982j16006
$$ 2317491 2247554 2148290 2039698 1878718 1767693 1698683 1614096 1511809 1407827 1291821
10472A291821j57882q0430l0419l1698o0960o8277o4664l6474l6535m8112m2118
$$ 1291821 1133939 1053509 1023090 991392 930432 862155 797491 761017 724482 676370 634252
10461F34252l0237k1624j3520p291n65l18J4793m4762m2253j5851J8819K6404
$$ 634252 604015 582391 568871 561580 561015 560697 575490 530728 488475 472624 491443 517847
10449E17847n173k0144k1707j6206q523k9650k8198r876K220M323k3803k5064
$$ 517847 512674 492530 470823 454617 446094 416444 388246 378370 380590 384913 361110 336046
10437C36046l0762o697P993M1168N877k1958m3875k0631J2141J7525J4027k0397
$$ 336046 305284 298587 306580 347748 353625 331667 287792 267161 279302 296827 310854 290457
10425B90457l1885n0651l8460O049k826p040R662K0963j5616l722J0652j361o923
$$ 290457 258572 207921 169461 175510 172684 165644 175306 196269 180653 176931 187583 186222 179299
10412A79299M5792L4785R737K2616m8645j31393n4516O0051J00797R9533N8069
$$ 179299 225091 259876 269613 292229 243584 112191 57675 117726 218523 318056 376125
10401C76125j0484l3280k3341m38k1761k1425k8605m497J791j0645j0307l4979
$$ 376125 365641 332361 309020 308582 286821 265396 236791 232294 234085 223440 213133 178154
10389A78154j2463J5502m89k2132m6937l8055n8774k9233l6907l4016n0311k3657
$$ 178154 165691 181193 180704 158572 111635 73580 14806 -14427 -51334 -85350 -135661 -159318
10377a59318j0218O4487J38716R2246M6403J7807J0832k1805j958L472j5588l653
$$ -159318 -169536 -105049 33667 125913 172316 190123 200955 179150 177192 180664 165076 161423
10365A61423J6452l7815m0525K1267M0286l1871q60R383m787J963j4638K5414
$$ 161423 177875 140060 99535 120802 161088 129217 128357 137740 132953 134916 120278 145692
10353A45692O381O871j4510j8959k4779k297r300m1311j3462l0173k5183k3896
$$ 145692 152073 158944 144434 125475 100696 98399 89099 47788 34326 4153 -21030 -44926
10341d4926L5067P1178L3312K2451k0135o2493q193L0142l450j8854j4058L3571
$$ -44926 -9859 61319 94631 117082 96947 34454 26261 56403 52953 34099 20041 53612
10329E3612K0333L3790L119Q152R821j0626l8530n042M387j1261k2625M127p533
$$ 53612 73945 107735 110854 119006 128827 118201 79671 74629 79016 67755 45130 49257 41724
10316D1724M243Q123K5622j8835m2044n829k0459L8487L9083j1524k011L0475
$$ 41724 45967 54090 79712 60877 18833 13004 -7455 31032 70115 58591 56580 87055
10304H7055L9671J9344j4097o4339j4433J7615l9325j0551J5339M3761m868K200
$$ 87055 126726 146070 131973 67634 53201 70816 31491 20940 36279 80040 75172 77372
10292G7372q943o540N589K8111j1190m1984p412j090K6589M4422J2852L331n159
$$ 77372 68429 61889 67478 95589 84399 42415 35003 33913 60502 104924 117776 121107 115948
10279A15948M272J6666N580j5084o9272k9273J5613j9071J6534L8273j1569k9644
$$ 115948 120220 136886 142466 127382 58110 28837 44450 25379 41913 80186 68617 38973
10267C8973l3988J7847J3653m904J0296J3018k6144o466K0154J1571J00l020J4075
$$ 38973 4985 22832 36485 31581 41877 54895 28751 22285 42439 54010 54110 51090 65165
10254F5165J7123j920k4482L24m927L206L673k9839k3099J5015K0241J3800n342
$$ 65165 82288 80368 55886 56210 51283 54489 58162 28323 5224 20239 40480 54280 48938
10241D8938J8630K0128N649N20k4348k6331P713L3558K8585O5382J7635m4827
$$ 48938 67568 87696 93345 93865 69517 43186 50899 84457 113042 178424 196059 151232
10229A51232m6639m090k386K4499n853O768K3695L239l0310J2947J2921j4520
$$ 151232 104593 100503 98117 122616 116763 123531 147226 150465 120155 133102 146023 131503
10217A31503k4697j1262K177J6162L8561J4228n953o029J9323K1727J0015L8987
$$ 131503 106806 95544 97721 113883 152444 166672 160719 154690 174013 195740 205755 244742
10205B44742J811J0562L2284Q5948Q0031J03922J47960J79419K70240L39463L87230
$$ 244742 246553 257115 289399 375347 455378 559300 707260 886679 1156919 1496382 1883612
10194A883612M72743M02625J95260o6664k73932m12654l94341l59964k65285k15862
$$ 1883612 2356355 2758980 2954240 2887576 2613644 2200990 1806649 1446685 1181400 965538
10184I65538j88986j44326j18558n6675n7548k9382k6774k3976P648j5579m9970
$$ 965538 776552 632226 513668 456993 399445 370063 343289 319313 326961 311382 261412
10173B61412m4548k6957l2121K05K4884q43k1569j7029j3863m7852J147K0419
$$ 261412 216864 189907 157786 157991 182875 182032 160463 143434 129571 81719 82866 103285
10161A03285K6333J5817k1371k8998l26k104L41j3031K632k1418n666J7952K1117
$$ 103285 129618 145435 124064 95066 94740 92636 92977 79946 82578 61160 55494 73446 94563
10148I4563K979J2331J2691J608K7600N4792O6076M7500O9946O426j9743k8480
$$ 94563 97542 109873 122564 124172 151772 206564 272640 320140 390086 396512 376769 348289
10136C48289n7632l4016j2486j9041o7033k9769j4041M5810N484k770j7176p579
$$ 348289 290657 256641 244155 225114 158081 128312 114271 160081 165565 162795 145619 138040
10124A38040j2933j2844k887L8167M5196L1007K2358p524N569M0898Q5225J42954
$$ 138040 125107 112263 109376 147543 192739 223746 246104 238580 244149 285047 370272 513226
10112E13226J70989K63519M36902N98713M01671r9084m56893n00992l72402k26070
$$ 513226 684215 947734 1384636 1983349 2385020 2285936 1829043 1328051 955649 729579
10102G29579j53324j20216o5900q4143o5847k7496j9536k6990k8893k3960K8048
$$ 729579 576255 456039 390139 305996 240149 212653 193117 166127 137234 113274 141322
10091A41322j4084m511m501k8543k3362j4125L8156j6197l7293K2961L8301J4615
$$ 141322 127238 122727 118226 89683 66321 52196 90352 74155 36862 59823 98124 112739
10079A12739R563k0500j2280j6500L908J990m0206k5816L5458J8522k9760j5912
$$ 112739 122302 101802 89522 73022 76930 78920 38714 12898 48356 66878 37118 21206
10067B1206P836M5271j3094k6916j1713K637N230l1419K2304J1656M957P902J4782
$$ 21206 29042 74313 61219 34303 22590 25227 30457 -962 21342 32998 37955 45857 60639
10054F0639J1363j4154J4885R091k0748j1856j8034k3502J1470J7053K3313k8778
$$ 60639 72002 57848 72733 81824 61076 49220 31186 7684 19154 36207 59520 30742
10042C0742j0590j6813J8404m303J8716M9850j8970m8574k5158j210K3136L2614
$$ 30742 20152 3339 21743 17440 36156 86006 67036 18462 -6696 -7906 15230 47844
10030D7844Q168j2394k0443j0993P593L102q62L991J3314O035l702o894m499J9284
$$ 47844 56012 43618 23175 12182 19775 22877 22015 26006 39320 45355 41653 34759 30260 49544
10016D9544j9501r104j2872o691k098O690K301N787J5890J8084o37j0574l108
$$ 49544 30043 20939 8067 1376 -722 5968 8269 14056 29946 48030 47393 36819 33711
10003C3711j9006l0197j419m115L6521J4379J0803K4259Q417L8009L4945M9285
$$ 33711 14705 -15492 -16911 -21026 15495 29874 40677 64936 73353 111362 146307 195592
9991A95592M8597M026m227l2641j7060m4612m2739l4628k3270k5136o379L2546
$$ 195592 244189 248215 243988 211347 194287 149675 106936 72308 49038 23902 17523 50069
9979E0069L0010k0022k2379J3734j3244j6604p697q329j8506j6273j512L9953
$$ 50069 80079 60057 37678 51412 38168 21564 13867 5538 -12968 -29241 -30753 9200
9967I200J5363L849k2295o967J9716K9975J2705n666j6308J7304K7128K3715j6441
$$ 9200 24563 28412 6117 -850 18866 48841 61546 55880 39572 56876 84004 107719 91278
9954I1278j6505J424l712J458m6158k9261m713J2071L4264K1926K0776k631k2602
$$ 91278 74773 76197 72485 73943 27785 -1476 -6189 5882 40146 62072 82848 80217 57615
9941E7615l9744k2888L3248K543j0165j4397K3612L5893J9523r140n4796j3063
$$ 57615 17871 -5017 28231 30774 20609 6212 29824 65717 85240 76100 21304 8241
9929H241Q110K7493K5502m1904K111J7257J3231K9221m1895l2051j6578o777J3784
$$ 8241 16351 43844 69346 27442 29553 46810 60041 89262 47367 15316 -1262 -8039 5745
9916E745q917L4117L550j8794j2536p383O280N640J7518M3945j1244k1124N779
$$ 5745 -3172 30945 34495 15701 3165 -4218 2062 7702 25220 69165 57921 36797 42576
9903D2576J7174K3063m339k9324k9805R088J0067p998J9676J5080J8571j0360
$$ 42576 59750 82813 78474 49150 19345 28433 38500 30502 50178 65258 83829 73469
9891G3469k9862j9989K111L0272l0552j0838j7707l9677r953n199K6174J8799
$$ 73469 43607 23618 25729 56001 25449 14611 -3096 -42773 -52726 -57925 -31751 -12952
9879a2952k7451K4151P780L449J2733j7090R241J5619M0213j9897j8076K4532
$$ -12952 -40403 -16252 -8472 -5023 7710 -9380 -139 15480 55693 35796 17720 42252
9867D2252p753k4936N234L119J111j256K6295L7961K2932J1989j1847k9583K5827
$$ 42252 34499 9563 14797 17916 19027 17771 44066 82027 104959 116948 105101 75518 101345
9854A01345Q4731M8504M4661k2759q5139n9465l2463m0719n285J8040J0603n42
$$ 101345 186076 234580 279241 256482 171343 111878 79415 38696 33411 51451 62054 61512
9842F1512K364l677k6252r707J2622J6353l1304p206o36r733p21K7119j4555k017
$$ 61512 63876 60199 33947 24240 36862 53215 21911 14705 14069 4336 3615 30734 16179 14162
9828A4162r808r438K5929J1837n048j5808J5207K1742M189o534j5744j0949j9079
$$ 14162 4354 -5084 20845 32682 27634 11826 27033 48775 52964 46430 30686 19737 658
9815F58j0795J7200M148L032J2974j378k4569K466M181r168l0566o988j8198K8926
$$ 658 -10137 7063 11211 14243 27217 25839 1270 3736 7917 -1251 -31817 -38805 -57003 -28077
9801b8077J7900P721j1148r032K2332L4820k3709j7708j5793K1943j235p807n410
$$ -28077 -10177 -2456 -13604 -22636 -304 34516 10807 -6901 -22694 -751 -1986 -9793 -15203
9788a5203K9980J4534j9864j2077K186K9451J8314j7692O74J9174L289K3084K277
$$ -15203 14777 29311 9447 -2630 -444 29007 47321 29629 30303 49477 52766 75850 78127
9775G8127k2526m0228m5827J0402M4737K7660o406l552j5022j2854P525Q389L8617
$$ 78127 55601 15373 -30454 -20052 24685 52345 45939 42387 27365 14511 22036 30425 69042
9762F9042L3231J7685n977j9475l3111j8508j8039m51p276l256m188j0261p056
$$ 69042 102273 119958 113981 94506 61395 42887 24848 24397 17121 13865 9677 -584 -7640
9749g640M1838K309K0473n266j8032K1685J9910M0019O3784O6584N0655L6197
$$ -7640 34198 36507 56980 51714 33682 55367 75277 115296 179080 245664 296319 332516
9737C32516L4239L3262J0406k8656p6617p3223l7534k2912n1785n2963j3236J437
$$ 332516 366755 400017 410423 381767 305150 231927 194393 171481 119696 66733 53497 54934
9725E4934L046j0470m556K6853L515J286K2158K019l556m2249k1731p935J1386
$$ 54934 57980 47510 42954 69807 73322 74608 96766 98785 95229 52980 31249 23314 34700
9712C4700K3911J2057l574j2889k3598J7056j5435m344K0395r029k4630l759J59
$$ 34700 58611 70668 67094 54205 30607 47663 32228 27884 48279 39250 14620 10861 11020
9699A1020k0954j8575q082K9874J6954k231O193Q074k193O213K2834K4454j4936
$$ 11020 -9934 -28509 -36591 -6717 10237 8006 14199 22273 20080 26293 49127 73581 58645
9686E8645l8195l5939o814K2446j9291k3167L7995P264p15P340L1243K1764p983
$$ 58645 20450 -15489 -22303 143 -19148 -42315 -4320 2944 2229 9569 40812 62576 54593
9673E4593o211j1733j2804q043k7226J62J0084m649J5429k471p260r272l408j6495
$$ 54593 48382 36649 23845 15802 -11424 -11262 -1178 -5827 9602 7131 -129 -9401 -12809 -29304
9659b9304K2667K72j9872K7323q413r5J4942N220r197j5701j2508J2695J7246
$$ -29304 -6637 -6365 -26237 1086 -7327 -7422 7520 12740 3543 -12158 -24666 -11971 5275
9646E275j0782r667K1193L261j2776j9522J1921J4922K4378m724j5758j4854j6067
$$ 5275 -5507 -15174 6019 9280 -3496 -23018 -11097 3825 28203 23479 7721 -7133 -23200
9633b3200j8969r334N1706M213j1556O851k742k9054J2138J0501J0349J3809J4876
$$ -23200 -42169 -51503 203 4416 -7140 -289 -3031 -32085 -19947 -9446 903 14712 29588
9620B9588l878N406k433j4247J194Q900j1151j6839m979q58J0193K5900Q896l9297
$$ 29588 25710 31116 28683 14436 15630 24530 13379 -3460 -8439 -9297 896 26796 35692 -3605
9606c605j9706q097J1113L8475j4963k7450J0845m13K2480J3441k0270n1136k33
$$ -3605 -23311 -31408 -20295 18180 3217 -24233 -13388 -13801 8679 22120 1850 -49286 -49519
9593d9519K9879k752j4066k292J6716r01M765L734k6735J3646j638J7401o122
$$ -49519 -19640 -22392 -36458 -38750 -22034 -22935 -18170 -14436 -41171 -27525 -29163 -11762 -17884
9580a7884j0647q056J9955P648j0787J2132K3047R461J5337j9093k161n0876j1121
$$ -17884 -28531 -36587 -16632 -8984 -19771 -7639 15408 24869 40206 21113 18952 -31924 -43045
9567d3045K5796N207J8875P151J4606l92O568l200j3825N252J5959m69N249K0172
$$ -43045 -17249 -12042 6833 13984 28590 28198 34766 31566 17741 22993 38952 38483 43732 63904
9553F3904k6046j5423J7k977R526K160O491q30j442j7656r970K1979M798k6590
$$ 63904 37858 22435 22452 19475 29001 31161 37652 36822 35380 17724 7754 29733 34531 7941
9539G941m7258J284j3642j919N2625K0899o202j0613L1242J3270J929J8969k629
$$ 7941 -39317 -38033 -51675 -53594 -969 19930 13728 3115 34357 47627 49556 68525 65896
9526F5896n3720j7600m167o736K0304J5098j1219p551l3811j3511K908J3189K1830
$$ 65896 12176 -5424 -9591 -16327 3977 19075 7856 305 -33506 -47017 -44109 -30920 -9090
9513i090N871L769m2027j6625Q273J1165N333l742k141N855Q20Q450M1236J3331
$$ -9090 -3219 550 -41477 -58102 -49829 -38664 -33331 -37073 -39214 -33359 -32539 -24089 17147 30478
9499C0478M833j886M974J042K93J0089L986l806l6745j470K8352O4598j7284l7081
$$ 30478 35311 33425 38399 39441 39734 49823 53809 50003 13258 11788 40140 104738 87454 50373
9485E0373m9640J8995M388j0405J6360Q20j4550j314j1105J5747k4228m1053L3076
$$ 50373 733 19728 24116 13711 30071 30891 16341 15027 3922 19669 -4559 -45612 -12536
9472a2536O4645J1587R941P108k3048k3814n373j2844J1315K246j0480k0843m159
$$ -12536 52109 63696 73637 80745 57697 33883 28510 15666 26981 29227 18747 -2096 -6255
9459f255N943K811p408j6638K5414K6635m909L469k0096k9294q993N128L2850
$$ -6255 -312 2499 -4909 -21547 3867 30502 25593 29062 8966 -20328 -29321 -24193 8657
9446H657O987J8246J1916k1583k1363n972r010J4103J4525o651p737k8099j6117
$$ 8657 15644 33890 45806 24223 2860 -3112 -12122 1981 16506 9855 2118 -25981 -42098
9433d2098K6299L4598J9844K5187l816k2696k1574k9787n07M1010q2p242R966
$$ -42098 -15799 18799 38643 63830 60014 37318 15744 -14043 -14550 26460 26378 19136 29102
9420B9102o602r203n229j2555j7390P869J9079K0168M883j149Q470J3242k5838
$$ 29102 22500 13297 8068 -4487 -21877 -14008 5071 25239 30122 28973 37443 50685 24847
9407B4847j2370k3919j6968K5379O190j5458l3481j7637J2922J9884N3514L1178
$$ 24847 12477 -11442 -28410 -3031 3159 -12299 -45780 -63417 -50495 -30611 22903 54081
9395E4081O004L3926j7717m2581k1505M18n9n36J0796J5915j1456l310L214J0394
$$ 54081 60085 94011 76294 33713 12208 12626 12567 12031 22827 38742 27286 23976 27190 37584
9381C7584K079M408l2386p269J8879k514l2991K51J7613J9755K2687k5343j8376
$$ 37584 39663 44071 11685 4416 23295 20781 -12210 -11959 5654 25409 48096 22753 4377
9368D377M2153M492l062p595L904l8060l5564J3632k5724l736Q224R075l159q659
$$ 4377 46530 51022 47960 40365 44269 6209 -29355 -15723 -41447 -45183 -36959 -27884 -31043 -39702
9354c9702K8766k6565R581M4140j6719p689j4824L0752K967k5340J1783K3044
$$ -39702 -10936 -37501 -27920 16220 -499 -8188 -23012 7740 10707 -14633 -2850 20194
9342B0194L1513l975j8790j0116L6926k726j4209j6177K5762j8733q950k2165
$$ 20194 51707 47732 28942 18826 55752 53026 38817 22640 48402 29669 20719 -1446
9330a446k7298R75j1419n497j0995L6728N8352j3986j8644R243m759K057K97J982
$$ -1446 -28744 -27769 -39188 -44685 -55680 -18952 39400 25414 6770 16013 11254 13311 13608 15590
9316A5590K3744J9467j803k4682N061l632l0773r912j330R460j6899j1543m000
$$ 15590 39334 58801 56998 32316 37377 33745 2972 -6940 -8270 1190 -15709 -27252 -31252
9303c1252K515J5751o918J2120j2405J3816K7505M045J226M497M763k6240N722
$$ -31252 -28737 -12986 -19904 -7784 -20189 -6373 21132 25177 26403 30900 35663 9423 15145
9290A5145K6017J1307k756l6995k0056k790k498L7403J5124j7901k9991r184J673
$$ 15145 41162 52469 49713 12718 -7338 -10128 -12626 24777 39901 22000 -7991 -17175 -15502
9277a5502K0608q039j0289L7499r5m0063k583J8281K0791J3651j4249j2322j708
$$ -15502 5106 -2933 -13222 24277 24182 -15881 -18464 -183 20608 34259 20010 7688 5980
9264E980J6504O646q778L1004j5347j9142J0037K0962j4861k6365P330J52l5126
$$ 5980 22484 29130 20352 51356 36009 16867 26904 47866 33005 6640 13970 14122 -21004
9251b1004K3966O1486J7396k701k2507l7998L0046n416k9456J1649j1654J122
$$ -21004 2962 64448 81844 79143 56636 18638 48684 43268 13812 25461 13807 14929
9239A4929J1003K0871L375N172Q763K9449n513l6090l4000O99K7694q39p76J1514
$$ 14929 25932 46803 50178 55350 64113 93562 88049 51959 17959 18658 46352 45513 44737 56251
9225E6251m9706p960L1846N789l5738j4074L4236J4081M0060P495n386k9981r535
$$ 56251 6545 -1415 30431 36220 482 -13592 20644 34725 74785 82280 76894 46913 37378
9212C7378J8080m3060k9130J9658J8796J311K620m569m054j4624J9854L1797K9511
$$ 37378 55458 12398 -16732 2926 21722 23033 25653 21084 17030 2406 22260 54057 83568
9199H3568k4002j3163j2222N919P018or146k37J0014j0021k6488p949M149R996
$$ 83568 59566 46403 34181 40100 47118 47112 37966 37729 47743 37722 11234 3285 7434 17430
9185A7430J6205j3438j5113K8690K2331j5887k4043N876M67M829q020K077q677
$$ 17430 33635 20197 5084 33774 56105 40218 16175 22051 22518 27347 19327 21404 12727
9172A2727M761L5146M899j9745P24Q732K8785r210K729j0764l186j5778K789K3699
$$ 12727 17488 52634 57533 37788 38512 47244 76029 66819 69548 58784 55598 39820 42609 66308
9158F6308J3708J4374r608q939j4908k4093j8298k822O042O797K3890k131j02
$$ 66308 80016 94390 84782 75843 60935 36842 18544 15722 21764 28561 52451 50320 50218
9145E0218r936q850k378j6993J993K8345J6192Q191p43J505J0521j0408n567j362
$$ 50218 40282 31432 29054 12061 14054 42399 58591 66782 66039 67544 78065 67657 62090 60728
9131F0728L295n391J472n256K2856q312k2374M918m480J7156L1804K136k0020
$$ 60728 64023 58632 60104 54848 77704 69392 47018 51936 47456 64612 96416 98552 78532
9118G8532K6536K8574N689k2804m3696m643J4970K0412J5581k0903l620r673R78
$$ 78532 105068 133642 139331 116527 72831 68188 83158 103570 119151 98248 94628 84955 85933
9105H5933j1856k6799L0480J5404o870J2711Q013J9174k3510k7978k448n959J8293
$$ 85933 74077 47278 77758 93162 86292 99003 107016 126190 102680 74702 72254 66295 84588
9092H4588K8559m780j3096P55j2748J380J1923l2795p703J8005Q142J4556n988
$$ 84588 113147 108367 95271 96026 83278 84658 96581 63786 56083 74088 82230 96786 90798
9079I0798j2071j5892n456l301J5077K9149R926L1783K3130J4698j8250J4644
$$ 90798 78727 62835 57379 54078 69155 98304 108230 140013 163143 177841 159591 174235
9067A74235L4080j8704k6294P824r814m0432j4996K7330J2952L7880J4229l9891
$$ 174235 208315 189611 163317 171141 161327 120895 105899 133229 146181 184061 198290 158399
9055A58399j0321N17m499j8719m2729l963K9385L6249j6128k7926J4364K4161
$$ 158399 148078 148595 144096 125377 82648 78685 108070 144319 128191 100265 114629 138790
9043A38790o92J820K197J8803l664j6949l057J4863m269M641k3164m38J5346J4357
$$ 138790 138098 139918 142115 160918 157254 140305 137248 152111 147842 152483 129319 128881 144227 158584
9029A58584N218M781M84k4875n522L6492L2249j206K5822J514m658m5340p822
$$ 158584 163802 168583 169067 144192 138670 175162 207411 206205 232027 233541 228883 183543 175721
9016A75721m578k3276m106j0628j5328Q621j1111N414J5484J7963K5905L0459
$$ 175721 171143 147867 143761 133133 117805 126426 115315 120729 136213 154176 180081 210540
9004B10540q215J5974K1458K0334K9920J7305j2344M592j9657k1499o290J0480
$$ 210540 202325 218299 239757 260091 290011 307316 294972 299564 279907 258408 252118 262598
8992B62598J0280R989M416p671J464k1150m914J4032q006L2621L3914N45j9867
$$ 262598 272878 282867 287283 279612 281076 259926 255012 269044 261038 293659 327573 328118 308251
8979C08251k508L1831R320O091J4309K4343K956R338k6305K6046L2724J1878k3647
$$ 308251 305743 337574 346894 352985 367294 391637 394593 403931 377626 403672 436396 448274 424627
8966D24627K84K5235m680j1415J4177L567K9874L5895K3474Q491j544q763m910
$$ 424627 424911 450146 445466 434051 448228 451795 481669 517564 541038 549529 547985 539222 534312
8953E34312j3914P269N6106L5463N232k2972j9266J3612L6833J8270M1812K3404
$$ 534312 520398 527667 583773 619236 624468 601496 582230 595842 632675 650945 692757 716161
8941G16161L5052M3650L0955R144N192N0210K0596J0418L0220J3450L1444K2708
$$ 716161 751213 794863 825818 834962 840154 890364 910960 921378 951598 965048 996492 1019200
8929A019200R988J7343N3547N5116O3257M3729L0386M6410N9243K7464N7333O6389
$$ 1019200 1029188 1046531 1100078 1155194 1218451 1262180 1292566 1338976 1398219 1425683 1483016 1549405
8917A549405P5537P5614R5493Q1097P5206R8893P1128P3476J31244J56570J37344
$$ 1549405 1624942 1700556 1796049 1877146 1952352 2051245 2122373 2195849 2327093 2483663 2621007
8906B621007J07391J53491K00397J95763K18699K18853K43788K90448L49845L39185
$$ 2621007 2728398 2881889 3082286 3278049 3496748 3715601 3959389 4249837 4599682 4938867
8896D938867L65845M26741M98809N62118N80070O88354Q23491R12441R81298J131720
$$ 4938867 5304712 5731453 6230262 6792380 7372450 8060804 8884295 9796736 10778034 11909754
8886A1909754J357655J558934J782390K096984K491024K833415L257657L740805
$$ 11909754 13267409 14826343 16608733 18705717 21196741 24030156 27287813 31028618
8878C1028618M163166M505115M654063M492621L968750K928170J529994m9670
$$ 31028618 35191784 39696899 44350962 48843583 52812333 55740503 57270497 57220827
8870E7220827j510385k769340l622223m035685m098798l971728l692867l371949
$$ 57220827 55710442 52941102 49318879 45283194 41184396 37212668 33519801 30147852
8862C0147852l020696k709027k388639k115431j878166j639476j451423j292015
$$ 30147852 27127156 24418129 22029490 19914059 18035893 16396417 14944994 13652979
8854A3652979j139363j034015r31723q21037p09978o44844o18945n35013m65755
$$ 13652979 12513616 11479601 10547878 9726841 9016863 8372019 7753074 7218061 6752306
8845F752306m41284m22911l58783l16269k96417k66495k57444k55204k11512k14278
$$ 6752306 6311022 5888111 5529328 5213059 4916642 4650147 4392703 4137499 3925987 3711709
8835C711709j73718j71446j60086j66620j63022j28072j23684j07274j20179q5467
$$ 3711709 3537991 3366545 3206459 3039839 2876817 2748745 2625061 2517787 2397608 2312141
8825B312141o7833p3611r2069r8332r0090j20571q5605l7364n7786m2175o9473
$$ 2312141 2244308 2170697 2078628 1980296 1890206 1769635 1684030 1646666 1588880 1546705 1477232
8814A477232o5032p4934n2616k7205l9607l4599l2693n0998o4236m8515n6347
$$ 1477232 1412200 1337266 1284650 1257445 1217838 1183239 1150546 1099548 1035312 986797 930450
8803I30450k5251p602l872j1934k0894l7967l2773o061l2871k9411m6133m5287
$$ 930450 905199 897597 893725 881791 860897 822930 790157 784096 751225 721814 675681 630394
8791F30394r362L518l4128k7822p115j3484r328j6926N061j8198k3072j8693O769
$$ 630394 621032 624550 590422 562600 555485 542001 532673 515747 520808 502610 479538 460845 467614
8778D67614o003j7266k8758J1355K3040N922r428j4502l7130j433J8667J396K0356
$$ 467614 461611 444345 415587 426942 449982 455904 446476 431974 394844 393411 412078 413474 433830
8765D33830J3627m2793o6742o1954J3260M0405R457n144o595k0934m4457K2107
$$ 433830 447457 404664 337922 275968 289228 329633 339090 333946 327351 306417 261960 284067
8753B84067M1528k249k5211o244j6683j0991K2437J2055n209k3592k8606p433
$$ 284067 325595 323346 298135 291891 275208 264217 286654 298709 293500 269908 241302 233869
8741B33869n748j5347J4542J8349J4184J715p353J8169K509j4036k6629k7024
$$ 233869 228121 212774 227316 245665 259849 261564 254211 272380 274889 260853 234224 207200
8729B07200j6075K2115j4822P54j9651j2466k0179K2547K0400o005J510j9819
$$ 207200 191125 213240 198418 199172 179521 167055 146876 169423 189823 183818 185328 165509
8717A65509n991j9092n900l0854o894K2337L711n965M2821J56j3160m0693j0367
$$ 165509 159518 140426 134526 103672 96778 119115 122826 116861 159682 159838 146678 105985 95618
8704I5618K5219K4585p216J845L1942J2979k2520n0953r843J3410M012j1122M314
$$ 95618 120837 145422 138206 140051 171993 184972 162452 111499 101656 115066 119078 107956 112270
8691A12270J0079j8139Q184J8648L4604P720l7167m3052O447K1157j2716j4533
$$ 112270 122349 104210 112394 131042 165646 173366 136199 93147 99594 120751 108035 93502
8679I3502j0593L3417K0379j2134k1541j9895J406J4069j4138J3833K2357j8762
$$ 93502 82909 116326 136705 124571 103030 83135 84541 98610 84472 98305 120662 101900
8667A01900j3244o021J2068p378J065K5483n968p46Q337m66j0856J8722P039K3148
$$ 101900 88656 82635 94703 87325 88390 113873 107905 107159 115496 115030 104174 122896 129935 153083
8653A53083L1809J0263J3864j7581l1382j8828j581K1584J321M683l321j4833
$$ 153083 184892 195155 209019 191438 160056 141228 139647 161231 162552 167235 163914 149081
8641A49081m793k0153j8509K0220N978j6246Q455J6478J0456l5874j6917j9355
$$ 149081 144288 124135 105626 125846 131824 115578 124033 140511 150967 115093 98176 78821
8629G8821q950n44K674j3269J4525P342K3433P858j5367K045j8597L0611K2334
$$ 78821 69871 69327 72001 58732 73257 80599 104032 111890 96523 98568 79971 110582 132916
8616A32916Q784r684j9404j0538K7195M2847L492j0966L3493K1047M5077j0348
$$ 132916 141700 132016 112612 102074 129269 172116 175608 164642 198135 219182 264259 253911
8604B53911J0424M974j7902P16k4587k2830q569o603J6424M3060m2104n2029j4570
$$ 253911 264335 269309 251407 252123 227536 204706 196137 189534 205958 249018 206914 154885 140315
8591A40315q945m48q418j5576j4653j1734j822J8745J3393J2853l8436m8037p337
$$ 140315 131370 130922 122504 106928 92275 80541 78719 97464 110857 123710 85274 37237 29900
8578B9900L4777L1365K1407J428k7430J5293M607l7819K038N46K2959j0497k2525
$$ 29900 64677 96042 117449 118877 91447 106740 111347 73528 75566 76112 99071 88574 66049
8565F6049k9882P106M7054N8124L1404J721l3470l4121j0591r327J8403J885l7139
$$ 66049 36167 43273 90327 148451 179855 181576 148106 113985 103394 94067 112470 114355 77216
8552G7216q846l6250j635J5528K5828J7620j9810k5648j895K4991l4067j6016
$$ 77216 68370 32120 30485 46013 71841 89461 69651 44003 42108 67099 33032 17016
8540A7016M0374K0305k1752j8600k4112J1504N374j2616r848k204N199K4733J0990
$$ 17016 57390 77695 55943 37343 13231 24735 30109 17493 7645 5441 10640 35373 46363
8527D6363j87O259J1747k6511j5707p399n001j4038J4849J314j5236J7187O94
$$ 46363 46176 52435 64182 37671 21964 14565 9564 -4474 10375 11689 -3547 13640 14334
8514A4334L8978k701k8232l4610j4558J7741R325J5809L38J0009J4724J9799N72
$$ 14334 53312 50611 22379 -12231 -26789 -9048 277 16086 16424 26433 41157 60956 61528
8501F1528k5670n113K9096l0434l4757o205p351J4751J5357j6447K6408P466j6995
$$ 61528 35858 30745 59841 29407 -5350 -11555 -18906 -4155 11202 -5245 21163 28629 11634
8488A1634j6556N157K6465L2261R461m927j3070l808j6235K2095Q568k9790j5201
$$ 11634 -4922 235 26700 58961 68422 63495 50425 46617 30382 52477 61045 31255 16054
8475A6054P332k638J5293M073n685j8677q258l0482l0081R5M0552N3658L3370
$$ 16054 23386 20748 36041 40114 34429 15752 7494 -22988 -53069 -52974 -12422 41236 74606
8462G4606K428l1205j0825l216j5406j5268m3117K805K4365J7682j5557J3778
$$ 74606 77034 45829 35004 31788 16382 1114 -42003 -39198 -14833 2849 -12708 1070
8450A070J8290k4498J3064N285K4562K4546K1055k1876q002O713Q218l3022m3695
$$ 1070 19360 -5138 7926 13211 37773 62319 83374 61498 53496 60209 68427 35405 -8290
8437h290j1559J0103R337J3415j8233L891j1849Q896K07N59O9739K0732j8696
$$ -8290 -19849 -9746 -409 13006 -5227 -1336 -13185 -4289 -4082 -3523 66216 86948 68252
8424F8252l453K066j6745l1179k976L6502L5301J1544N634m076j1999m8416k8976
$$ 68252 64799 66865 50120 18941 15965 52467 87768 99312 104946 100870 88871 40455 11479
8411A1479k1676j406Q322M5575m389m0763j7423J8548K4905l342j759L047n272
$$ 11479 -10197 -11603 -3281 42294 37905 -2858 -20281 -1733 23172 19830 18071 21118 15846
8398A5846P592L1438K3692j4423j0360K7371j8302m2409j7728J0337K7068K4065
$$ 15846 23438 54876 78568 64145 53785 81156 62854 20445 2717 13054 40122 64187
8386F4187j7121l3128j6183L8472K8709k4370l6219J4773q447j100j1786k205
$$ 64187 47066 13938 -2245 36227 64936 40566 4347 19120 10673 9573 -2213 -4418
8374d418M8108J3992k898l6767k8910k997L215j3718J7321M3767j2225P566k9534
$$ -4418 43690 57682 54784 18017 -10893 -13890 -10675 -24393 -7072 36695 24470 32036 2502
8361B502j2242J5943J6036J7434M174j1299r728J4653J0828k5433j4405K1879
$$ 2502 -9740 6203 22239 39673 43847 32548 22820 37473 48301 22868 8463 30342
8349C0342J0228j6049l1133k7370K7524J5206j0443j1059J6534K8306j655n191
$$ 30342 40570 24521 -6612 -33982 -6458 8748 -1695 -12754 3780 32086 30431 25240
8337B5240K1502J6781k2111m4670o940J8634L3023N1306j8582j8979j5024p07
$$ 25240 46742 63523 41412 -3258 -10198 8436 41459 92765 74183 55204 40180 39473
8325C9473N301j6102p311m1380J1804j7235m672K1818K2077K8836R964k3579j9265
$$ 39473 44774 28672 21361 -20019 -8215 -25450 -30122 -8304 13773 42609 52573 28994 9729
8312I729k6518L3680K4260k249j0008n598J573J1582J1864k3859k1098n744L1516
$$ 9729 -16789 16891 41151 38902 28894 23296 24869 36451 48315 24456 3358 -2386 29130
8299B9130J4107K864N773m98L8055K040k8141l1477M007O226J23p932k6374M569
$$ 29130 43237 46101 51874 51376 89431 91471 63330 31853 35860 42086 42209 34277 7903 12472
8285A2472j0886j5252K347K7398K7731m703j4398j0592R417j425m965l9628j0255
$$ 12472 1586 -13666 -11319 16079 43810 39107 24709 14117 23534 22109 17144 -22484 -32739
8272c2739J4595K2817l717J0591n722P527M070j4390J3168K6899l8627r244K0327
$$ -32739 -18144 4673 956 11547 5825 13352 17422 3032 16200 43099 4472 -4772 15555
8259A5555R552k3374J880p703M908L3296J3242j5368j2897p742j347M2823J0531
$$ 15555 25107 1733 3613 -4090 818 34114 47356 31988 19091 11349 10002 52825 63356
8246F3356j3146j4408k5146o412N18J048J521k8624L568J0522L0408J5686j4614
$$ 63356 50210 35802 10656 4244 4762 5810 7331 -21293 -17725 -7203 23205 38891 24277
8233B4277M922k6464j9245K3667j1206k559L5460j7886o841l220k9788j0202l23
$$ 24277 29199 2735 -16510 7157 -4049 -6608 28852 10966 4125 905 -28883 -39085 -39408
8220c9408K4015J3596j9167j4803J3925L392K8589R195j2737k8592j0287J635
$$ -39408 -15393 -1797 -20964 -35767 -21842 -18450 10139 19334 6597 -21995 -32282 -30647
8208c0647J5648L758J7691J6440J5736j124R054q102j4395k8186j8061j1167Q536
$$ -30647 -14999 -11241 6450 22890 38626 37502 46556 38454 24059 -4127 -22188 -33355 -24819
8195b4819m837M050J5282O464j9937l780R377J1784J3166K2679J192J2111j6836
$$ -24819 -29656 -25606 -10324 -3860 -23797 -27577 -18200 -6416 6750 29429 30621 42732 25896
8182B5896j7172k3278j9805j8355M1126M747j9685K4696k0955N710J1284N397
$$ 25896 8724 -14554 -34359 -52714 -11588 -6841 -26526 -1830 -22785 -17075 -5791 -394
8170c94k9646L0278K6899J2967R247m475j0392p121r672r822N18J6282m29R583
$$ -394 -30040 238 27137 40104 49351 44876 34484 27363 17691 7869 8387 24669 24240 33823
8156C3823N689j6541j4906j4359N104K7879k1837j6501n040J4045K035K2584J221
$$ 33823 39512 22971 8065 -6294 -1190 26689 4852 -11649 -16689 -2644 -609 21975 23196
8143B3196j7807N341j124k3438J8837K7227k0167l0056K907J2459P823J6221J8348
$$ 23196 5389 10730 9606 -13832 5005 32232 12065 -17991 -15084 -2625 5198 21419 39767
8130C9767j1360o929k9620J6406K0234J100K5303K988j2717k9197k45O231m3550
$$ 39767 28407 21478 -8142 8264 28498 29598 54901 57889 45172 15975 15730 21961 -21589
8117b1589j2325j5508k2697J1930K4175J2972J0432J0261J7714L6469L7312k1544
$$ -21589 -33914 -49422 -72119 -60189 -36014 -23042 -12610 -2349 15365 51834 89146 67602
8105F7602l7825j7779j9587o869O63K2876k5371l1980Q204J6726N62L014K024
$$ 67602 29777 11998 -7589 -14458 -13795 9081 -16290 -48270 -40066 -23340 -22778 -19764 -17740
8092a7740J7772K1989J7920l2412j7692k8786O484L9655R35K3090Q32n231l2981
$$ -17740 32 22021 39941 7529 -10163 -38949 -32465 7190 8125 31215 32047 26816 -6165
8079f165p64L2235R980k1635j1067j8863L05J3096j2336J6198M000r336j8361
$$ -6165 -6929 25306 35286 13651 2584 -16279 -15974 -2878 -15214 984 4984 -4352 -22713
8066b2713m191K5787N8922k795k2117j5142k588R227j1494k9373J0126Q8j2405
$$ -22713 -26904 -1117 57805 55010 32893 17751 15163 24390 12896 -16477 -6351 -6263 -18668
8053a8668J5513j8305j8635n942J0850J4375p052j5924m970n340J1337J5471J8739
$$ -18668 -3155 -21460 -40095 -46037 -35187 -20812 -27864 -43788 -48758 -54098 -42761 -27290 -8551
8040h551K1949j5379p073J3784J8278j2278k2846J6845N14Q202J2744k2954j5899
$$ -8551 13398 -1981 -9054 4730 23008 10730 -12116 4729 5243 13445 26189 3235 -12664
8027a2664M261K2963k1186n493M525p341q041p38M055P090O591J55j3064j7489
$$ -12664 -8403 14560 -6626 -12119 -7594 -14935 -22976 -23714 -19659 -12569 -5978 -5823 -18887 -36376
8013c6376j7904P699J0779J3824J1792J4349K9689J1903j1009K739K276j356k0401
$$ -36376 -54280 -46581 -35802 -21978 -10186 4163 33852 45755 34746 37485 39761 38405 18004
8000A8004K1382N866M769k3369j3711P560j1764k2580l1859J1173L0001m4J0390
$$ 18004 39386 45252 50021 26652 12941 20501 8737 -13843 -45702 -34529 -4528 -4572 5818
7987E818O719J617K633K3784P491k3979j4374L440J8655l497n947P960n492j3035
$$ 5818 12537 14154 16787 40571 48062 24083 9709 13149 31804 28307 22360 30320 24828 11793
7973A1793M484J792j4098J0423Q332q354j9912j4395Q753j1299m46J7894N384
$$ 11793 16277 18069 3971 14394 22726 14372 -5540 -19935 -11182 -22481 -22927 -5033 351
7960C51J3190L830k245p227J2067L0778n446r36k9838j0096K4439l833K41j465
$$ 351 13541 17371 15126 7899 19966 50744 45298 44362 14524 4428 28867 25034 25275 23810
7946B3810q149L501L8329J347l9930j7940R605p147r78k3803k965O097K1026L9305
$$ 23810 15661 19162 57491 58838 18908 968 10573 3426 2448 -21355 -24320 -18223 2803 42108
7932D2108K5100j2919j7613n496l4717j058K2524j3941M443j1602q204K8516M240
$$ 42108 67208 54289 36676 31180 -3537 -4595 17929 3988 8431 -3171 -11375 17141 21381
7919B1381j3959l749m648O249j4906J8812Q611J0301R133j6003k833O7m490K3388
$$ 21381 7422 3673 -975 5274 -9632 9180 17791 28092 37225 21222 18389 18456 13966 37354
7905C7354l1523j040M5306J9970P786m0322j5101K94k0350Q494R359k042j2921
$$ 37354 5831 4791 50097 70067 77853 37531 22430 22724 2374 10868 20227 18185 5264
7892E264j2030qk0892J2446K4160K2980l401J4856k0720l2542L822L0127K187
$$ 5264 -6766 -6774 -27666 -15220 8940 31920 28519 43375 22655 -9887 -6065 24062 26249
7879B6249N888o010j2755n649k8042O109P869j2949j2538r07j543L5895J5602
$$ 26249 32137 26127 13372 7723 -20319 -14210 -6341 -19290 -31828 -32735 -34278 1617 17219
7866A7219p713k0988J4944J739m428M485j514j4250k740j1512J4558J1990J3788
$$ 17219 9506 -11482 3462 5201 773 5258 3744 -10506 -13246 -24758 -10200 1790 15578
7853A5578q227k7345k0656J551J0858n480J0969K6255Q336j7414J996P870j0779
$$ 15578 7351 -19994 -40650 -39099 -28241 -33721 -22752 3503 11839 -5575 -3579 4291 -6488
7840f488j4764N637J0676J367J0684M409L3443K5872k9262k9287m2122L670R414
$$ -6488 -21252 -15615 -4939 -3572 7112 11521 44964 70836 41574 12287 -29835 -26165 -16751
7827a6751M3572j752m0406j3075L2214k216J4343L837M42k7950k3879o078L442
$$ -16751 26821 25069 -15337 -28412 3802 1586 15929 19766 20208 -7742 -31621 -37699 -34257
7814c4257J6931K3429M5143J2106J6686l841J3632J8292l4739r413L089Q614k9761
$$ -34257 -17326 6103 51246 63352 80038 76197 89829 108121 73382 63969 67058 75672 45911
7801D5911m3073K414L4396j0239k8006j7545k1910j3825k074P876K7254J3958
$$ 45911 2838 5252 39648 29409 1403 -16142 -38052 -51877 -53951 -46075 -18821 -4863
7789d863J7154o356K2662K490l7581l0662K484J1211J7297n067j8711J4698j6340
$$ -4863 12291 5935 28597 31087 -6494 -37156 -34672 -23461 -6164 -11231 -29942 -15244 -31584
7776c1584J163j6763J5256L8925R053o319l07j502j2823J5333j2339p379P60j2992
$$ -31584 -30421 -47184 -31928 6997 16050 9731 9424 7922 -4901 10432 -1907 -9286 -8526 -21518
7762b1518m636R362J1534o872J2398K5522k5083l2467k298K1795L1974k548L485
$$ -21518 -26154 -16792 -5258 -12130 268 25790 707 -31760 -34058 -12263 19711 17163 20648
7749B0648J8727k5149r63j280k4670j1076K919M053J5259l0128k5094L1108J4381
$$ 20648 39375 14226 13263 11983 -12687 -23763 -20844 -16791 -1532 -31660 -56754 -25646 -11265
7736a1265J100j2295J1048O93m777J1356k4257J0272m414J2911K7414k295k5769
$$ -11265 -10165 -22460 -11412 -10719 -15496 -4140 -28397 -18125 -22539 -9628 17786 15491 -10278
7723a0278k5931o029j3159j3536j10L957J0717K7251L5336l530o891J0202L240
$$ -10278 -36209 -42238 -55397 -68933 -69043 -65086 -54369 -27118 8218 4688 -2203 7999 11239
7710A1239J3816K713j9991p187k6193l8580k305M1145J0006j6108K787J3262j6250
$$ 11239 25055 27768 7777 590 -25603 -64183 -66488 -25343 -15337 -31445 -28658 -15396 -31646
7697c1646J039j376j2074j5058J631P404k7746K0286K1083j6232j42j01K1918
$$ -31646 -30607 -31983 -44057 -59115 -57484 -50080 -77826 -57540 -36457 -52689 -52831 -52932 -31014
7684c1014J2433K988j9933K206j6929J2047M5772O084j4232L334j4687j6430m422
$$ -31014 -18581 -15593 -35526 -33320 -50249 -38202 7570 13654 -578 2756 -11931 -28361 -32783
7671c2783L920J609J7725K3660j4270l3589J1712J2875K9069R702k2869k8015
$$ -32783 -28863 -27254 -9529 14131 -139 -33728 -22016 -9141 19928 29630 6761 -21254
7659b1254J7653J2352j7768J0209J2987k0677r069J5726K539o203k964k4084m97
$$ -21254 -3601 8751 -9017 1192 14179 -6498 -15567 159 2698 -3505 -6469 -30553 -31050
7646c1050K8481K0576q820k0716R487J1710j723O378J3514J0247m099j3414N0287
$$ -31050 -2569 18007 9187 -11529 -2042 9668 7945 14323 27837 38084 33985 20571 70858
7633G0858L5576k2258l4022l0707j7744k0459P648Q424n1807N202L2307Q746r159
$$ 70858 106434 84176 50154 19447 1703 -18756 -11108 -2684 -54491 -49289 -16982 -8236 -17395
7620a7395j1339j583o934k4794k5661L9867K7284P420q580m75L5516K8463j5874
$$ -17395 -28734 -30317 -37251 -62045 -87706 -47839 -20555 -13135 -21715 -22190 13326 41789 25915
7607B5915m9079n0258j272M0797q448r516J371J4590j1981J334K8463J9564l921
$$ 25915 -23164 -73422 -74694 -33897 -42345 -51861 -50490 -35900 -47881 -46547 -18084 1480 -2441
7594b441j0108O094k7713M776k1074N047R821j0476m717K6177M5459K5861j5841
$$ -2441 -12549 -6455 -34168 -29392 -50466 -45419 -35598 -46074 -50791 -24614 20845 46706 30865
7581C0865J7151j1612k9911k3953J4914j3420J5094L3297k1003L606J0491m434
$$ 30865 48016 36404 6493 -17460 -2546 -15966 -872 32425 11422 15028 25519 21085
7569B1085j990m732K1292J585k7802o369L3254n528j6601k998R178j3754N792
$$ 21085 19095 14363 35655 37240 9438 3069 36323 30795 14194 11196 20374 6620 12412
7556A2412K7930j2869k1579l196o944L697j3227N206J6426R376Q645K6579j3950
$$ 12412 40342 27473 5894 2698 -4246 -549 -13776 -8570 7856 17232 25877 52456 38506
7543C8506k5397j7369o615m31N043j898L365K1994Q410q906J0427k4498q945J9299
$$ 38506 13109 -4260 -10875 -11306 -6263 -8161 -4796 17198 25608 16702 27129 2631 -6314 12985
7529A2985L1452j1904l2371j3742j1538j37j2218L6596N530n105O448j7303P710
$$ 12985 44437 32533 162 -13580 -25118 -25255 -37473 -877 4653 -452 5996 -11307 -3597
7516c597L7881K3162K2321l9842m1730l0220o111R520K1143j755L0558k4952j2746
$$ -3597 34284 57446 79767 39925 -1805 -32025 -38136 -28616 -7473 -9228 21330 -3622 -16368
7503a6368j224l2812k3523M6349L5880O41j0713j2945m743L3022J1691k2542l6585
$$ -16368 -17592 -50404 -73927 -27578 8302 8943 -1770 -14715 -19458 13564 25255 2713 -33872
7490c3872K9710J7611k9311J1564Q514j822M428j1798j6324L271N830m715J6034
$$ -33872 -4162 13449 -15862 -4298 4216 2394 6822 -4976 -21300 -18029 -12199 -16914 -880
7477h80K7120r054P110j1091j4771J5725p315j8343p63J6057N596j8756K6298
$$ -880 26240 17186 24296 13205 -1566 14159 6844 -11499 -12262 3795 9391 -9365 16933
7464A6933L3708j0118k9900n055k6719K80J2069Q276r979O384L752j0735J5594
$$ 16933 50641 40523 10623 5568 -21151 -20871 -8802 -526 -10505 -4121 -369 -11104 4490
7451D490J5907O736J6224j3345j3568j2948l0781K7766M3064o334l5530j7781
$$ 4490 20397 27133 43357 30012 16444 3496 -27285 481 43545 37211 1681 -16100
7439a6100L2689j934Q976j1324J256p217J0659J5616o702k1672N021N462k7884
$$ -16100 16589 14655 23631 12307 13563 6346 17005 32621 25919 4247 9268 14730 -13154
7426a3154R384J2142N042J1347j4648M2335J5975k0884n5407j2513L5126Q442
$$ -13154 -3770 8372 13414 24761 10113 52448 68423 47539 -7868 -20381 14745 23187
7414B3187Q08j8170J8344J2347j4635p704o345J7897k1777O380j2831j055R231
$$ 23187 23995 5825 24169 36516 21881 14177 7832 25729 3952 10332 -2499 -3554 5677
7401E677n184Q949Q687j8373j0647n421L006K4534l096J2475p327P678k623l9250
$$ 5677 493 9442 18129 -244 -10891 -16312 -13306 11228 8132 20607 13280 20958 18335 -20915
7387b0915J172L3673m567n553J5460P303N568L803l6611K665j4655k2200O170
$$ -20915 -19743 13930 9363 3810 19270 26573 32141 35944 -667 1998 -12657 -34857 -28687
7374b8687n493K3768J3263l783N114j3420M89K8630J3663j0774l3394J2685M0140
$$ -28687 -34180 -10412 2851 -932 4182 -9238 -8749 19881 33544 22770 -10624 2061 42201
7361D2201R504k6702j8786j1648L011K71J2151j917J2274J6259n267N542m278
$$ 42201 51705 25003 6217 -5431 -2420 -2149 10002 8085 20359 36618 31351 36893 32615
7348C2615k3250k726p959j3241K5820Q745l3769j2036J061k3578K2416K1771K7082
$$ 32615 9365 6639 -1320 -14561 11259 20004 -13765 -25801 -24740 -48318 -25902 -4131 22951
7335B2951Q816j059k6634n065j0286J7841L0109j8224p621l5879l0438l2199J9243
$$ 22951 31767 30708 4074 -991 -11277 6564 36673 18449 10828 -25051 -55489 -87688 -68445
7322f8445L5313K0123N579K9427N144j605j881Q830j0789j2423l8284K312K3098
$$ -68445 -33132 -13009 -7430 21997 27141 25536 23655 32485 21696 9273 -29011 -26699 -3601
7309c601L7720k019j9609j2511j2710o879K384o001J1599M836J6031J8104k2404
$$ -3601 34119 32100 12491 -20 -12730 -19609 -17225 -23226 -11627 -6791 9240 27344 4940
7296D940k8938p229O778J8675k306l5902J4226K0682L0558j133J329o948n590
$$ 4940 -23998 -31227 -24449 -5774 -8080 -43982 -29756 -9074 21484 20351 21680 14732 9142
7283I142j5032K8416K2866k3270k3649q476j3671l002k5468L349J1969k62K4536
$$ 9142 -5890 22526 45392 22122 -1527 -10003 -23674 -26676 -52144 -48795 -36826 -37088 -12552
7270a2552K039J926j1173J4317J4865P035K0683k1137J972m882J4189l0060J4190
$$ -12552 -10513 -8587 -19760 -5443 9422 16457 37140 16003 17975 13093 27282 -2778 11412
7257A1412K8702M208K1357j1027P237j9530l1413m393j6178l1214J8026L1665
$$ 11412 40114 44322 65679 54652 61889 42359 10946 6553 -9625 -40839 -22813 8852
7245H852K5087J142k3640P957P55k6231P01m067R069j3206k9335j8755J5480L1169
$$ 8852 33939 35081 11441 19398 20153 -6078 -5377 -9444 -375 -13581 -42916 -61671 -46191 -15022
7231a5022J5304J4262J0614m019k2707k0801k0270j4433J6736J9158p283k376
$$ -15022 282 14544 25158 21139 -1568 -22369 -42639 -57072 -40336 -21178 -28461 -30837
7219c0837q887P838K8666k936j8694o463R031p678j167J8937o129L556K3071J2958
$$ -30837 -39724 -31886 -3220 -6156 -24850 -31313 -22282 -29960 -31127 -12190 -18319 -14763 8308 21266
7205B1266K631k2740J6709k1724l6329m417J440K0593J5171j8591R884j0785K802
$$ 21266 23897 1157 17866 -3858 -40187 -44604 -43164 -22571 -7400 -25991 -16107 -26892 -24090
7192b4090Q345M724J0859M185j1730j1076q526N363J8626j773M4307J2021k5218
$$ -24090 -15745 -11021 -162 4023 -7707 -18783 -27309 -21946 -3320 -5093 39214 51235 26017
7179B6017r742j5227j440j575J0308j2601j7002J0373m330n228j046J8845R451
$$ 26017 16275 1048 -392 -1967 8341 -4260 -21262 -10889 -15219 -20447 -21493 -2648 6803
7166F803j8301k875l917O628K0397J8397K5502J310k3346l8190k5484K1764J2719
$$ 6803 -11498 -14373 -18290 -11662 8735 27132 52634 53944 30598 -7592 -33076 -11312 1407
7153A407Q083q325j253k5326l9175q729Q962O427J2775j8684m806M9240J8537
$$ 1407 9490 1165 -88 -25414 -64589 -73318 -64356 -57929 -45154 -63838 -68644 -19404 -867
7140h67l2506q63J7657L1162R712j6999o351J7890J1613K8142j4870k7676o020
$$ -867 -33373 -34236 -16579 14583 24295 7296 945 18835 30448 58590 43720 16044 10024
7127A0024k8280Q788J0740m105P308p415m27k9121k0514L3848O0273K0610o128
$$ 10024 -18256 -9468 1272 -2833 4475 -2940 -3367 -32488 -53002 -19154 41119 61729 55601
7114E5601k6781l2478o521P357m682K16J3777k2992l629l7772l220j0634O056
$$ 55601 28820 -3658 -10179 -2822 -7504 -7288 6489 -16503 -20132 -57904 -61124 -71758 -65702
7101f5702K2308n360o757J5557J3483K0150J4349j847k9949Q402J8984J0388r630
$$ -65702 -43394 -48754 -55511 -39954 -26471 -6321 8028 6181 -23768 -15366 3618 14006 4376
7088D376m2622k0271J1783O571k949j818J0586M498L0209J1397j8512j0087k5331
$$ 4376 -38246 -58517 -46734 -40163 -43112 -44930 -34344 -29846 363 11760 -6752 -16839 -42170
7075d2170J285M0041K0657l7598L313M822J2289O876P18l1742k1419P262J5452
$$ -42170 -40885 -844 19813 -17785 -14472 -9650 2639 9515 10233 -21509 -42928 -35666 -20214
7062b0214N492J2901J9707j7881j6813k7865J0777N135L8831K7385j0314k9754
$$ -20214 -14722 -1821 17886 5 -16808 -44673 -33896 -28761 10070 37455 27141 -2613
7050b613n848J2068j7842o1259K8576K0214K941M0183M7845K985l5912j2696J0932
$$ -2613 -8461 3607 -14235 -75494 -46918 -26704 -23763 16420 64265 67250 31338 18642 29574
7037B9574n1027j1847J745j3423J2131K0357Q54l9952O295O252J8858J8779J8717
$$ 29574 -21453 -33300 -31555 -44978 -32847 -12490 -11636 -51588 -45293 -39041 -20183 -1404 17313
7024A7313l6045j8188L7593K1635J936J3920K895j9969o448k478k1901k9292J1355
$$ 17313 -18732 -36920 673 22308 24244 38164 41059 21090 14642 12164 -9737 -39029 -27674
7011b7674K0079K0570j101P745j7769k4903j1492j5531P686O455J1193L5119r207
$$ -27674 -7595 12975 11874 19619 1850 -23053 -34545 -50076 -42390 -35935 -24742 10377 1170
6998A170q652J1263N481N761j3753l529J9905K6827j021m2289l935k3202J1968
$$ 1170 -7482 3781 9262 15023 1270 -2259 17646 44473 43452 1163 -2772 -25974 -14006
6985a4006N511M446J2867R580O724M4206L7605K8455p919m6509p6395j5954n514
$$ -14006 -8495 -4049 8818 18398 25122 69328 106933 135388 127469 80960 4565 -11389 -16903
6972a6903J7479R102j5677J7757J3674q985J7387k542P748J4882r406J834l418
$$ -16903 576 9678 -5999 11758 25432 16447 33834 31292 39040 53922 44516 46350 42932
6959D2932m020k721L5269r256k6074l545l3433k0199k1164J46L7314l77l6716
$$ 42932 38912 36191 71460 62204 36130 32585 -848 -21047 -42211 -42065 -4751 -5128 -41844
6946d1844j4348N926K0143L1575J1903k5466O358k267K8077q359r586M2088J7326
$$ -41844 -56192 -50266 -30123 1452 13355 -12111 -5753 -8020 20057 11698 2112 44200 61526
6933F1526j4444m9518k0328j5509k1885j558L3587K8667K7502k9377Q720J6023
$$ 61526 47082 -2436 -22764 -38273 -60158 -61716 -28129 538 28040 -1337 7383 23406
6921B3406k0596l1915j6003r326J6756L6829K4402r703l2472j546j4896j1169
$$ 23406 2810 -29105 -45108 -54434 -37678 -849 23553 13850 -18622 -20168 -35064 -46233
6909d6233L8016P186j1559M497k284J9488K3645j1096r488k0793m584K6431L0987
$$ -46233 -8217 -1031 -12590 -8093 -10377 9111 32756 21660 12172 -8621 -13205 13226 44213
6896D4213j3329l534k4743l3299l1633j1967K1471L0456M329j9556l0673K1233
$$ 44213 30884 27350 2607 -30692 -62325 -74292 -52821 -22365 -18036 -37592 -68265 -47032
6884d7032M0086J5078j422j8375p130J0324K6903o215j4023k1273J0633J6300
$$ -47032 -6946 8132 6710 -11665 -18795 -8471 18432 12217 -1806 -23079 -12446 3854
6872C854J2110j8009J2954P63l1003j3222M119J4581J8989K3604j2196k6280p07
$$ 3854 15964 -2045 10909 11672 -19331 -32553 -28434 -13853 5136 28740 16544 -9736 -10443
6859a0443j5195m359P804q860o902J7190L479k3662J2914l8228k869J4393J3345
$$ -10443 -25638 -29997 -22193 -31053 -37955 -20765 -17286 -40948 -28034 -66262 -69131 -54738 -41393
6846d1393k1375K4239K4221r874j6505J6322J1806r395O36o9Q697j936j7297K0671
$$ -41393 -62768 -38529 -14308 -24182 -40687 -24365 -12559 -21954 -21318 -21387 -12690 -14626 -31923 -11252
6832a1252j7180m1764M2268K0316J4872j1840k5157J4586M0220K8329J9234j6291
$$ -11252 -28432 -70196 -27928 -7612 7260 -4580 -29737 -15151 25069 53398 72632 56341
6820E6341j9297o977k6684j5958J368O175M1142J5154J0031l3397n3277j7284
$$ 56341 37044 30067 3383 -12575 -11207 -5032 36110 51264 61295 27898 -25379 -42663
6808d2663K0863j2688q964j6206j8995R754K4135L0118P234J8141K2621k5593
$$ -42663 -21800 -34488 -43452 -59658 -78653 -68899 -44764 -14646 -7412 10729 33350 7757
6796G757j239m866J3363p623j5085J1318j81j4046L49r817j7864M402K8285Q897
$$ 7757 6518 1652 15015 7392 -7693 3625 3444 -10602 -10253 -20070 -37934 -33532 -5247 3650
6782C650m322J6601n514k4954M652l3Q454j9332n468n373P879J9285P88k0166
$$ 3650 -672 15929 10415 -14539 -9887 -9920 -1466 -20798 -26266 -31639 -23760 -4475 -3687 -23853
6768b3853m2486j5319K0890M3310M500j3870k4093J5824M450J0405J7659Q598
$$ -23853 -66339 -81658 -60768 -17458 -12958 -26828 -50921 -35097 -30647 -20242 -2583 6015
6756F015J2962k3930j3466J18k916n284K9824j1864n717J3083K6587o455K605
$$ 6015 18977 -4953 -18419 -18301 -21217 -26501 3323 -8541 -14258 -1175 25412 18957 21562
6743B1562j7546J4945n827r630k0024j6836j0148O988K252J1141L1557K8445J0734
$$ 21562 4016 18961 13134 3504 -16520 -33356 -43504 -36516 -34264 -23123 8434 36879 47613
6730D7613J4432L8536N8560L3080l2351l6264j2059k1870j9802j0082o8576J3134
$$ 47613 62045 100581 159141 192221 159870 123606 111547 89677 69875 59793 -8783 4351
6718D351K3913j6355n3559p125M2142l0120k2410K8259N169R075J4185J7137J4526
$$ 4351 28264 11909 -41650 -48775 -6633 -36753 -59163 -30904 -25735 -16660 -2475 14662 29188
6705B9188k5794j9416k2707q706j4477K4163M229L5148M7603j1459L137J5257
$$ 29188 3394 -16022 -38729 -47435 -61912 -37749 -33520 1628 49231 37772 40909 56166
6693E6166k0628j0863M0003k6913m2732N564J4582j5364j9156K1447J7555K1540
$$ 56166 35538 24675 64678 37765 -4967 597 15179 -185 -19341 2106 19661 41201
6681D1201J6278j9650l4405l2156R282J099p382r451k5489K1106M2941J3320p400
$$ 41201 57479 37829 3424 -28732 -19450 -18351 -25733 -35184 -60673 -39567 3374 16694 9294
6668I294j7401l6075J6294K0902m397l6906l58K0068r454R183K2452J4523n905
$$ 9294 -8107 -44182 -27888 -6986 -11383 -48289 -48647 -28579 -38033 -28850 -6398 8125 2220
6655B220k0344j949l61p527K9562K1289m1513j4214R121j0916K1811J6591J3876
$$ 2220 -18124 -20073 -20434 -27961 1601 22890 -18623 -32837 -23716 -34632 -12821 3770 17646
6642A7646l7226l0207M4554L0149j396M668k997l0603q218k5473j1462N529J5532
$$ 17646 -19580 -49787 -5233 24916 23520 28188 25191 -5412 -13630 -39103 -50565 -45036 -29504
6629b9504K7681l670K7315K0625j3974j9844r105l0089k1351P785j9038J121K3229
$$ -29504 -1823 -5493 21822 42447 28473 8629 -476 -30565 -51916 -44131 -63169 -62048 -38819
6616c8819j8021k0949K4153M846M244M1913o653K446M945k2163n782l752j8588
$$ -38819 -56840 -77789 -53636 -48790 -44546 -2633 -9286 -6840 -1895 -24058 -29840 -33592 -52180
6603e2180J5245N8590o048L32J2784J2466J5518k1556j8058J3798r285l5435l450
$$ -52180 -36935 21655 15607 15939 28723 41189 56707 35151 17093 30891 21606 -13829 -17279
6590a7279o326k4680j6273m918J9166K4957R506J7643j3655j8856L46j550J3960
$$ -17279 -23605 -48285 -64558 -69476 -50310 -25353 -15847 1796 -11859 -30715 -30369 -31919 -17959
6577a7959q351o164J3916j5425K1429J4001J4495R828m0145k0647J035j1592k1981
$$ -17959 -26310 -32474 -18558 -33983 -12554 1447 15942 25770 -14375 -35022 -33987 -45579 -67560
6564f7560P760L6763Q710J4438J4876K112k0620j7467n149L7205L0462q48k1653
$$ -67560 -59800 -23037 -14327 111 14987 17099 -3521 -20988 -26137 11068 41530 40682 19029
6551A9029R753o325j2116k1002j9073j643J5582k0940l955m703p91L387L1696
$$ 19029 28782 22457 10341 -10661 -29734 -31377 -15795 -36735 -40690 -45393 -46184 -42797 -11101
6538a1101J0276L77J0889p878j3260k1240j7050l350L5930N3050K2486k3004r684
$$ -11101 -825 -448 10441 2563 -10697 -31937 -48987 -52337 -16407 36643 59129 36125 26441
6525B6441j4817j0348j7912j2529K424K5399M179r701R202L6466K7914m0118n44
$$ 26441 11624 1276 -16636 -29165 -26741 -1342 2837 -6864 2338 38804 66718 26600 26056
6512B6056Q764j7454M744l092m0711J0917r406k5532j8198K6818R500l497M91
$$ 26056 34820 17366 22110 19018 -21693 -10776 -20182 -45714 -63912 -37094 -27594 -31091 -30600
6499c0600l0349R088Q578L6513J7986j3399M353j5623K671K9809J0411j7488k4392
$$ -30600 -60949 -51861 -43283 -6770 11216 -2183 2170 -13453 -10782 19027 29438 11950 -12442
6486a2442O706m037m673r375j5438j9827P371p561O072k017L3967L9544K1344
$$ -12442 -5736 -9773 -14446 -23821 -39259 -59086 -51715 -59276 -53204 -55221 -21254 18290 39634
6473C9634m1701K676r895J9572J9548J0325k9287l42M627k0193q58L973j444J5113
$$ 39634 -2067 609 -9286 10286 29834 40159 10872 10530 15157 -5036 -5894 -1921 -3365 11748
6459A1748K0103M499k8043k8453j8455Q350J1979K3975J5401j8957M938m822j4909
$$ 11748 31851 36350 8307 -20146 -38601 -30251 -18272 5703 21104 2147 7085 2263 -12646
6446a2646n517r682j0924J9681p286n202P427N289J3977P43k3767O455L4003K9808
$$ -12646 -18163 -27845 -38769 -19088 -26374 -31576 -24149 -18860 -4883 -4140 -27907 -21452 12551 42359
6432D2359j3406k3494L747l406j1688J0751J7549L811J4855J0642l5692o090J0354
$$ 42359 28953 5459 9206 5800 -5888 4863 22412 26223 41078 51720 16028 9938 20292
6419B0292J24J8825r809j0289k3567k3970r925m371J8765K3379J6828j2647K9117
$$ 20292 20416 39241 29432 19143 -4424 -28394 -38319 -42690 -23925 -546 16282 3635 32752
6406C2752p354o29l4766p515P083l545k9982m543M527M93K5057J3443J934J8242
$$ 32752 25398 24769 -9997 -17512 -10429 -13974 -43956 -48499 -43972 -43479 -18422 -4979 -3045 15197
6392A5197j4796K1593J4332K857j5590j6154j5493O728P201j4140j8458p034L4355
$$ 15197 401 21994 36326 39183 23593 7439 -8054 -1326 5875 -8265 -26723 -33757 598
6379E98k0294l1014M236j443J2539K1815q884j608P832J0325L0819J9194j5663
$$ 598 -19696 -50710 -46474 -47917 -35378 -13563 -22447 -24055 -16223 -5898 24921 44115 28452
6366B8452n541K610k0858j9r176M275j4834m62J4930K5236k7491k8679k1117j721
$$ 28452 22911 25521 4663 4644 -4532 -257 -15091 -15553 -623 24613 -2878 -31557 -52674 -54395
6352e4395K2681J3961j2031O285k559L500j7846K9367M0038k295k3031J0316K3615
$$ -54395 -31714 -17753 -29784 -23499 -26058 -22558 -40404 -11037 29001 26706 3675 13991 37606
6339C7606j0121m578p142j3030J2730J798L962p495N159j9373Q658k0598l477
$$ 37606 27485 22907 15765 2735 15465 17263 21225 13730 18889 -484 8174 -12424 -15901
6326a5901J0525j1751R724j5012J5217L982j135n166K148N967p678l5450J7735
$$ -15901 -5376 -17127 -7403 -22415 -7198 -3216 -4351 -9517 -7369 -1402 -9080 -44530 -26795
6313b6795M4849p706j5606J720l5717l3921K174L2577K1238m138P592J3965R217
$$ -26795 18054 10348 -5258 -3538 -39255 -73176 -71002 -38425 -17187 -21325 -13733 232 9449
6300I449n166J91j000q061N766J87r404q036J1704K4695P2l6304k5585j9166L071
$$ 9449 4283 4474 3474 -4587 1179 1366 -8038 -16074 -4370 20325 20397 -15907 -41492 -60658 -57587
6285e7587p193J9521K1898J2089n735r549j0505K193J1120L8772K0738j7527j6739
$$ -57587 -64780 -45259 -23361 -11272 -17007 -26556 -37061 -34868 -23748 15024 35762 18235 1496
6272A496K2169L0962j6533l0401j4393J6253m4623k3386J1192M784K9611J1138
$$ 1496 23665 54627 38094 7693 -6700 9553 -35070 -58456 -47264 -42480 -12869 -1731
6260a731m3428j5566J5708q39r208Q668K5906L5299r158J002o598r954J5627M0369
$$ -1731 -45159 -60725 -45017 -45856 -55064 -46396 -20490 14809 5651 6653 55 -9899 5728 46097
6246D6097Q611k6485l7160k5383k5368J7292O607K082J1223J0880P655j2511j6073
$$ 46097 54708 28223 -8937 -34320 -59688 -42396 -35789 -33707 -22484 -11604 -3949 -16460 -32533
6233c2533k4230P826P184O376O358K2536K4214j1986k4040R434M045q01j303j8001
$$ -32533 -56763 -48937 -41753 -35377 -29019 -6483 17731 5745 -18295 -8861 -4816 -5617 -6920 -24921
6219b4921J7987J5278j2910j4788O378R481P706p398L127L1950l1048n673Q473
$$ -24921 -6934 8344 -4566 -19354 -12976 -3495 4211 -3187 -60 31890 842 -4831 3642
6206C642j3444j3420J9981r647o443j7356j8686K8134k526K2718L5130L462M195
$$ 3642 -9802 -23222 -3241 -12888 -19331 -36687 -55373 -27239 -29765 -7047 28083 31545 35740
6193C5740r34L363j0122k5428k7945n49n890J0367K4720K194l7128r374K1422
$$ 35740 34806 38169 28047 2619 -25326 -25875 -31765 -21398 3322 5516 -31612 -40986 -19564
6180a9564l771K8251J0861J1922j3070j7240j141K3872n608j8508k4098j1461
$$ -19564 -23335 4916 15777 27699 14629 -2611 -3752 20120 14512 -3996 -28094 -39555
6168c9555J8196M625R174K111M90L0034q902j0537L868j6670k1665n309R316o812
$$ -39555 -21359 -16734 -7560 -5449 -4959 25075 16173 5636 9504 -7166 -28831 -34140 -24824 -31636
6154c1636q761K5746j9897J7180K0516K0874J568l1720J7306j2839j3085J6653
$$ -31636 -40397 -14651 -34548 -17368 3148 24022 25590 -6130 11176 -1663 -14748 1905
6142A905j3920j0075J9439L048j0476n714J8240j1761q18j0801Q262J5465O616
$$ 1905 -12015 -22090 -2651 397 -10079 -15793 2447 -9314 -10132 -20933 -12671 2794 9410
6129I410j2623k6020j9452K2991P448J8701J4605j4116l7531j4880j372N91J7818
$$ 9410 -3213 -29233 -48685 -25694 -18246 455 15060 944 -36587 -51467 -52839 -52248 -34430
6116c4430K6307Q007L379j8118j0989j0423K3801L1361j0283m1474K2548K9444
$$ -34430 -8123 -116 3263 -14855 -25844 -36267 -12466 18895 8612 -32862 -10314 19130
6104A9130j2360l0228q352J7335j281m176n000K9089K7377q560p78p998m0119
$$ 19130 6770 -23458 -31810 -14475 -15756 -19932 -24932 4157 31534 22974 22196 14198 -25921
6091b5921j9210M3681K7485j5864p839J1190K3704M606l235j5574m872j5646N068
$$ -25921 -45131 -1450 26035 10171 2332 13522 37226 41832 38597 23023 18151 2505 7573
6078G573R031n40N106j9579k9029n801M1579Q224l83j7619l4289J6533J9105J1211
$$ 7573 16604 16064 21170 1591 -27438 -33239 8340 16564 16181 -1438 -35727 -19194 -89 11122
6064A1122l6577k9002n618L4033R167j2116j6640k7746K8128L2606N953j2302
$$ 11122 -25455 -54457 -60075 -26042 -16875 -28991 -45631 -73377 -45249 -12643 -6690 -18992
6052a8992p036j0904K6185K4789j9859k1974k9007L1412J6831j3495o791k2554
$$ -18992 -26028 -36932 -10747 14042 -5817 -27791 -56798 -25386 -8555 -22050 -28841 -51395
6040e1395M402J3191N943J1103J3559P602J9371l25K2455N834j3147j8310l8230
$$ -51395 -46993 -33802 -27859 -16756 -3197 4405 23776 23451 45906 51740 38593 20283 -17947
6027a7947J3282j0809k871K0309j5536J9246L3471L569l3208k3327R743J925K1261
$$ -17947 -4665 -15474 -18345 1964 -13572 5674 39145 42714 9506 -13821 -4078 -2153 19108
6014A9108k0363j4446l260N788J0244Q875O750J9504n906m579L0778j132J0042
$$ 19108 -1255 -15701 -18961 -13173 -2929 5946 12696 32200 26294 21715 52493 51361 61403
6001F1403k7831n5783l1748K0780K3541J0059J9574K9522j5608k4674j5450p188
$$ 61403 33572 -22211 -53959 -33179 -9638 421 19995 49517 33909 9235 -6215 -13403
5989a3403o686j5630J3283o979l73l428L5843J0380O333O540J5436j6579n5971
$$ -13403 -20089 -35719 -22436 -29415 -29788 -33216 2627 13007 19340 25880 41316 24737 -31234
5976c1234P438M2080k2240j3520k2737k3319j9038J2475Q519J8858L3579j904
$$ -31234 -23796 18284 -3956 -17476 -40213 -63532 -82570 -70095 -61576 -42718 -9139 -11043
5964a1043J3504j9136J0709J8006j9675L183l982K8848J8406m2515l5091L5585
$$ -11043 2461 -16675 -5966 12040 -7635 -4452 -8434 20414 38820 -3695 -38786 -3201
5952c201M3260j9571j1622l522n641k0870r729j6336J6194K8742O236r311J1369
$$ -3201 40059 20488 8866 5344 -297 -21167 -30896 -47232 -31038 -2296 3940 -5371 5998
5939E998j7169N922K8641J9631k7717l858j1218p037R909L259q84J9525Q718l8406
$$ 5998 -11171 -5249 23392 43023 15306 11448 230 -6807 3102 6361 5477 25002 33720 -4686
5925d686l6117j601N0928N763k9935r561k1750j0220Q282j9695j973M8624M0753
$$ -4686 -40803 -42404 8524 14287 -15648 -25209 -46959 -57179 -48897 -68592 -70565 -21941 18812
5912A8812j3705j3468K2129n567P884K057J1545j3745j9708j8904l8210o876k621
$$ 18812 5107 -8361 13768 8201 16085 18142 29687 15942 -3766 -22670 -60880 -67756 -70377
5899g0377J9049J7834P169k1552K738K4265k2529J771O628J153j7101J115L7387
$$ -70377 -51328 -33494 -26325 -47877 -45139 -20874 -43403 -41632 -35004 -33851 -50952 -49837 -12450
5886a2450K6436J0390o956j4234M590J5588l3481j5515j7439j3522M5794j1486
$$ -12450 13986 24376 17420 3186 7776 23364 -10117 -25632 -43071 -56593 -10799 -22285
5874b2285j4320P993o886j4796L4311Q723k3017N384k855j6179R971K6093r775
$$ -22285 -36605 -28612 -35498 -50294 -15983 -7260 -30277 -24893 -27748 -43927 -33956 -7863 -17638
5861a7638j3222L2427K2051J750k874k073j7904j4113q038j4840K0117J1444r200
$$ -17638 -30860 1567 23618 25368 22494 20421 2517 -11596 -19634 -34474 -14357 -2913 -12113
5848a2113k9558R271K4151J9294J598R562k9401J3178J4181j3455m982o645M205
$$ -12113 -41671 -32400 -8249 11045 12643 22205 -7196 5982 20163 6708 1726 -4919 -714
5835g14N750K5097p108o980N649J2026l065j5955l0256l6175k566L3307k6152
$$ -714 5036 30133 23025 16045 21694 33720 30655 14700 -15556 -51731 -54297 -20990 -47142
5822d7142j6407M9233N46J5969o236n081J9734M9j3024j3070j6141o733r051Q511
$$ -47142 -63549 -14316 -13770 2199 -4037 -9118 10616 10665 -2359 -15429 -31570 -38303 -47354 -38843
5808c8843O273O535J4308O616N76k3144J581P462j4269j825J5706K5578o938j2073
$$ -38843 -32570 -26035 -11727 -5111 -4535 -27679 -26098 -18636 -32905 -34730 -19024 6554 -384 -12457
5794a2457L359j6297l033K6361L0697k106j5782m555j4285K661N421k4310j7479
$$ -12457 -9098 -25395 -28428 -2067 28630 26524 10742 6187 -8098 -5437 -16 -24326 -41805
5781d1805L1340L406J0086K6374p272j4873j9835m834l3948L255R61j894L8688
$$ -41805 -10465 -7059 3027 29401 22129 7256 -12579 -17413 -51361 -48106 -47145 -49039 -10351
5768a0351K5469k3364m8695q78J1709K2544l216o548K802K1385K2653J7239O325
$$ -10351 15118 -8246 -56941 -57819 -46110 -23566 -26782 -33330 -30528 -9143 13510 30749 37074
5755C7074k1177l3802j7190j8286k2887j5692K5855L2079N4629K6473J0304j8558
$$ 37074 15897 -17905 -35095 -53381 -76268 -91960 -66105 -34026 20603 47076 57380 38822
5743C8822l8845l2176l2708J6474j9996k1576M6155K742k6922p42M935m320J964
$$ 38822 -23 -32199 -64907 -48433 -68429 -90005 -43850 -41108 -68030 -68772 -63837 -68157 -66193
5730f6193J3426K4791K3874K3435k3013j9239P657j8009j0116N494j4065n633
$$ -66193 -52767 -27976 -4102 19333 -3680 -22919 -15262 -33271 -43387 -37893 -51958 -57591
5718e7591k163N558O425L6084N937J8194R363j1275L493M508k1979j9053j2748
$$ -57591 -59754 -54196 -47771 -11687 -5750 12444 21807 10532 14025 18533 -3446 -22499 -35247
5705c5247J5875j1324r204K4898m142k782J3184m6523m339J28J481N1362M0962
$$ -35247 -19372 -30696 -39900 -15002 -19144 -21926 -8742 -55265 -59604 -59476 -57995 -6633 34329
5692C4329j528k0700j0879j1381r517m256L1005r541j6321q310J434j1097j7p208
$$ 34329 32801 12101 1222 -10159 -19676 -23932 7073 -2468 -18789 -27099 -25665 -36762 -36779 -43987
5678d3987k0331K8364j8694K0370M0079J7224m761l0971j119j907j9785J9156
$$ -43987 -64318 -35954 -54648 -34278 5801 23025 18264 -12707 -13826 -15733 -35518 -16362
5666a6362L8718J3492l2915k6469j3706O041J3435J8848J014m952j4693K879Q650
$$ -16362 22356 35848 2933 -23536 -37242 -31201 -17766 1082 2096 -2856 -17549 -14670 -6020
5653f020p546N917K54O443k3163q623K490P244Q882J0019q295O892K7216o090
$$ -6020 -13566 -7649 -7395 -952 -24115 -32738 -30248 -23004 -14122 -4103 -12398 -5506 21710 15620
5639A5620j3258l3784k67O1177K5564n99j8783l4655k4788j8918J2644N331n324
$$ 15620 2362 -31422 -31689 29488 55052 54453 35670 1015 -23773 -42691 -30047 -24716 -30040
5626c0040m112l583K7308M422J6353N66J0475p492k1918p39J5245K223j1373m3333
$$ -30040 -34152 -37735 -10427 -6005 10348 10914 21389 13897 -8021 -8760 6485 8708 -2665 -45998
5612d5998k0490K1836L0026K2266J8469j1116m8085j1392M0316r017r546k9354
$$ -45998 -66488 -44652 -14626 7640 26109 14993 -33092 -44484 -4168 -13185 -22731 -52085
5600e2085k663P393K4292J4946j6021j5439P477Q977L2609J3624j7854j075p146
$$ -52085 -54748 -47355 -23063 -8117 -24138 -39577 -32100 -23123 9486 23110 5256 4181 -2965
5587b965k7428j1462m874J1249O631n313J7549J2284j0336o031q723L0433p493
$$ -2965 -30393 -41855 -46729 -35480 -28849 -34162 -16613 -4329 -14665 -20696 -29419 1014 -6479
5574f479j4098o886n881O613J2336j0201k0600L9741K3925j1113O522l981l8724
$$ -6479 -20577 -27463 -33344 -26731 -14395 -24596 -45196 -5455 18470 7357 13879 9898 -28826
5561b8826O769K8404k6989j1085J3519M7199J3578k0038m0592k7326J1568o824
$$ -28826 -22057 6347 -20642 -31727 -18208 28991 42569 22531 -18061 -45387 -33819 -40643
5549d0643M72L2811J8619j8163m582K0909k9784r085k532p538N999K1723o971
$$ -40643 -40171 -7360 11259 -6904 -11486 9423 -20361 -29446 -31978 -39516 -33517 -11794 -18765
5536a8765j1173L99M2576K5078j6919R327k097j2548R895j5247L34J2986n432
$$ -18765 -29938 -29539 13037 38115 21196 30523 28426 15878 25773 10526 10860 23846 18414
5523A8414k8821k72L0990J901j1354k8912O899m446k2355L437K0946o041N046
$$ 18414 -10407 -10679 20311 22212 10858 -18054 -11155 -15601 -37956 -34519 -13573 -19614 -14568
5510a4568j2837k1980n66J5306j4328j0993n30K0725K9053m732p922J9772p852
$$ -14568 -27405 -49385 -49951 -34645 -48973 -59966 -60496 -39771 -10718 -15450 -23372 -3600 -11452
5497a1452N5549P217j8385k4383m2601k2911j924j1965L667O8446N0713j2288
$$ -11452 44097 51314 32929 8546 -34055 -56966 -58890 -70855 -67188 1258 51971 39683
5485C9683n0047k4814J0236L3627J5166p765j0412m809k520N197l690j5403K2173
$$ 39683 -10364 -35178 -24942 8685 23851 16086 5674 865 -1655 3542 -148 -15551 6622
5472F622Q4j8591k2644L5298J9485l0706J1893P236M530J6642J3044j6917m3321
$$ 6622 6706 -11885 -34529 769 20254 -10452 1441 8677 13207 29849 42893 25976 -17345
5459a7345l0476K4512L1827m962j4865j2412R006r981K240n172M145o25K5539
$$ -17345 -47821 -23309 8518 3556 -11309 -23721 -14715 -24696 -22456 -27628 -23483 -24108 1431
5446A431K7953j2027m7304M556J6999N788j2282j814j4469J9654o977m633n589
$$ 1431 29384 17357 -29947 -25391 -8392 -2604 -14886 -16700 -31169 -11515 -18492 -23125 -28714
5433b8714j8075l095J4127J3288j3846L451K0039P016M409K1581k611l2383P910
$$ -28714 -46789 -49884 -35757 -22469 -36315 -32864 -12825 -5809 -1400 20181 17570 -14813 -6903
5420f903J8436j0066J6553K566o554k134K8062K6688j7773j7025j1011k3641R569
$$ -6903 11533 1467 18020 20586 14032 11898 39960 66648 48875 31850 20839 -2802 6767
5407F767k3692j6149O464Q718J0752k3596J083J6383k9264p315m440L293M5426
$$ 6767 -16925 -33074 -26610 -17892 -7140 -30736 -29653 -13270 -42534 -49849 -54289 -50996 -5570
5394e570o529J2801J1996J5699j4583j6139k4479P084K2548N069q417j3801J6230
$$ -5570 -12099 702 12698 28397 13814 -2325 -26804 -19720 2828 7897 -520 -14321 1909
5381A909L493k5020o009j4236p338N767l919n5324n291L9723J8906M175J7062
$$ 1909 5402 -19618 -25627 -39863 -47201 -41434 -45353 -100677 -105968 -66245 -47339 -43164 -26102
5368b6102J7613j7920J3485M0755J4438k876j3495q59k3705m0942J3944Q988K6063
$$ -26102 -8489 -26409 -12924 27831 42269 39393 25898 25039 1334 -39608 -25664 -16676 9387
5355I387N195J0772k3994j8747J0801L2250P740l5182l9269r281K4050P661K0990
$$ 9387 14582 25354 1360 -17387 -6586 25664 33404 -1778 -41047 -50328 -26278 -18617 2373
5342B373m26j9392j0232o277j4498r787l619K4280J0505J3463P774o109J1292
$$ 2373 1947 -17445 -27677 -33954 -48452 -58239 -61858 -37578 -27073 -13610 -5836 -11945 -653
5329f53Q47k0480l924K2669J5098L4381j1992j9814J6080o457k9314l467m848
$$ -653 194 -20286 -24210 -1541 13557 47938 35946 16132 32212 25755 -3559 -7026 -11874
5316a1874J1810k32J4778Q583K639k5283k9355J9205J0570m49k1021j0694K8971
$$ -11874 -64 -296 14482 23065 25704 421 -28934 -9729 841 392 -20629 -31323 -2352
5303b352l764j3345M790Q085k423K49R28M900p736n515J9679Q731K7848J0412
$$ -2352 -6116 -19461 -14671 -6586 -9009 -8760 -7832 -2932 -10668 -16183 3496 12227 40075 50487
5289E0487K0688j5950k1660l3321j6656J5458M7444L3385r448j3250j3222j6961
$$ 50487 71175 55225 33565 244 -16412 -954 46490 79875 70427 57177 43955 26994
5277B6994l825Q377r843j0645o202k9698k516j7364l5697J1708K3780k1229R546
$$ 26994 23169 31546 21703 11058 4856 -24842 -27358 -44722 -80419 -68711 -44931 -66160 -56614
5264e6614N347k5196j654K1029J2403K5034J4836L034q491M348k3363k1581l50
$$ -56614 -51267 -76463 -78117 -57088 -44685 -19651 -4815 -1781 -10272 -5924 -29287 -50868 -51218
5251e1218P703L2474L7788P203k4927R09k1779l9513l3400K1674L2829J7552P467
$$ -51218 -43515 -11041 26747 33950 9023 9932 -11847 -51360 -84760 -63086 -30257 -12705 -5238
5238e238p071L060k112o702p068N779K9479L538p415k3992r010j5673M200n417
$$ -5238 -12309 -9249 -11361 -18063 -25131 -19352 10127 13665 6250 -17742 -26752 -42425 -38225 -43642
5224d3642K076N127j7519o95j8594k0364R497L3463K081J1509J7441M540J2159
$$ -43642 -41566 -36439 -53958 -54653 -73247 -93611 -84114 -50651 -48570 -37061 -19620 -15080 -2921
5211b921k1613r209J1743K522n914j5246K4944L889Q314Q29j8517K2709J8367
$$ -2921 -24534 -33743 -22000 -19478 -25392 -40638 -15694 -11805 -3491 -2662 -21179 1530 19897
5198A9897p509O581j7414l0628J0419J3351J8451k3819J4982j5134J3207K959
$$ 19897 12388 18969 1555 -29073 -18654 -5303 13148 -10671 4311 -10823 2384 5343
5186E343L746O688J3087p415k8653J7260J846Q147r554j587j7861J5477J5111
$$ 5343 9089 15777 28864 21449 -7204 10056 11902 20049 10495 8908 -8953 6524 21635
5173B1635L1363r512k4967j8650R368o708k2658j3365R599O783J8141K3097r979
$$ 21635 52998 43486 18519 -131 9237 2529 -20129 -33494 -23895 -17112 1029 24126 14147
5160A4147Q341L3264l120n733Q246j6121J390n172J3405o971j8156N961l664k0023
$$ 14147 22488 55752 52632 46899 55145 39024 40414 35242 48647 41676 23520 29481 25817 5794
5146E794J4211j1410j8059k3495n673Q986O48J8552P775r187j5531M791Q250J3688
$$ 5794 20005 8595 -9464 -32959 -38632 -29646 -28998 -10446 -2671 -11858 -27389 -22598 -14348 -660
5132f60k967Q154k5891j7090j1655l76R220J8609J4029K4424K193r595l8760j1530
$$ -660 -3627 4527 -21364 -38454 -50109 -50485 -41265 -22656 -8627 15797 17990 8395 -30365 -41895
5118d1895J9012M528l052j8835R989L475J2220K0345j5588j0965l756m303Q024
$$ -41895 -22883 -18355 -21407 -40242 -30253 -26778 -14558 5787 -9801 -20766 -24522 -28825 -20801
5105b0801K5403p401Q087j5520k4296m138n593r147L62N4234K0659Q667m518j0004
$$ -20801 4602 -2799 5288 -10232 -34528 -38666 -44259 -53406 -53044 1190 21849 30516 25998 15994
5091A5994J502j8707J1007j5679n331m85j589L694R266O697j6582K418O581j079
$$ 15994 17496 -1211 9796 -5883 -11214 -11699 -13288 -9594 -328 6369 -10213 -7795 -1214 -2293
5077b293o654j970j53R073N627l232j8169n943K8086M968K3488L509K0522m013
$$ -2293 -8947 -10917 -11070 -1997 3630 398 -17771 -23714 4372 9340 32828 36337 56859 52846
5063E2846m4676k2447Q751n004l4580J0019k734K817O339J6193N375k5675M014
$$ 52846 8170 -14277 -5526 -10530 -45110 -35091 -37825 -35008 -28669 -12476 -7101 -32776 -28762
5050b8762l725J1385K1670M682r055o03J7812J1576K527J547Q246K6389j7351
$$ -28762 -32487 -21102 568 5250 -3805 -4408 13404 24980 27507 29054 37300 63689 46338
5037D6338l6590o276l314J1429M0485O57O5k4663p965P983J4942l7999o081K6210
$$ 46338 9748 3472 158 11587 52072 52729 52794 28131 20166 28149 43091 5092 -989 25221
5023B5221K052k9438J2210p002J7012n556j7853J0104M706J9402M436n784q98
$$ 25221 27273 -2165 10045 3043 20055 14499 -3354 6750 11456 30858 35294 29510 28612
5010B8612l1984n575J1763J8595l884J2813Q657k0640l781K847j6139M17p573
$$ 28612 -3372 -8947 2816 21411 17527 30340 38997 18357 14576 17423 1284 1701 -5872
4997e872K5078j6430j3362K4043L355k2151k831j9189K5605Q519L128Q561Q120
$$ -5872 19206 2776 -10586 13457 16812 -5339 -8170 -27359 -1754 6765 9893 18454 26574
4984B6574k3150L10K174J0949Q835J0625J8254j7897M077K531k1549r519M1506
$$ 26574 3424 3734 5908 16857 25692 36317 54571 36674 40751 43282 21733 12214 53720
4971E3720j434j8704k2928J2914k4749j5210K2923J6399j4415J659J7138Q305
$$ 53720 52286 33582 10654 23568 -1181 -16391 6532 22931 8516 10175 27313 35618
4959C5618j4496o787l5252j0092K631j8305o200j4162j2270L1548M5212J0825
$$ 35618 21122 14335 -20917 -31009 -28378 -46683 -52883 -67045 -79315 -47767 -2555 8270
4947H270P831j300L2465l131k9596J6268J0188J8133J6639m479n01k6949l4951
$$ 8270 16101 14801 47266 44135 14539 30807 40995 59128 75767 71288 70787 43838 8887
4934H887j780L2413J0951l2464j1453L880j0601J768k3964p469K1622j161K7193
$$ 8887 7107 39520 50471 18007 6554 10434 -167 1601 -22363 -29832 -8210 -9371 17822
4921A7822N249j5711m602j6248J0966N731l523J4455K1034l7312l2488q132J4842
$$ 17822 23071 7360 2758 -13490 -2524 3207 -316 14139 35173 -2139 -34627 -42759 -27917
4908b7917L7337J5571j8116k2238R343J7795o234j0376j6250l5196J1403M3723
$$ -27917 9420 24991 6875 -15363 -6020 11775 5541 -4835 -21085 -56281 -44878 -1155
4896a155j3966J869J0891p825m347M769j6175j9542m910J6291K3607J435K3421
$$ -1155 -15121 -13252 -2361 -10186 -14533 -9764 -25939 -45481 -50391 -34100 -10493 -9058 14363
4883A4363L701m5670j0296K0087J4390O912k323J3185l021N589J1371k0309j5576
$$ 14363 18064 -27606 -37902 -17815 -3425 3487 1164 14349 11328 16917 28288 7979 -7597
4870g597p397q781J0020R019j7920q239l732O802N330L2762L669m839j1553l35
$$ -7597 -14994 -23775 -13755 -4736 -22656 -30895 -34627 -27825 -22495 10267 13936 9097 -2456 -2791
4856b791J412j743j0611M515r270j6869j0009P934L1161K9539J1344j0052m3485
$$ -2791 -1379 -3122 -13733 -9218 -18488 -35357 -45366 -37432 -6271 23268 34612 24560 -18925
4843a8925L0745N602j1791k9484J5845mO735q80J5210R919j1325r692j5109K4167
$$ -18925 11820 17422 5631 -23853 -8008 -8012 -1277 -2157 13053 22972 11647 1955 -13154 11013
4829A1013J4531K4823o317m8426l4965M756N443K8358J7933k521j9936K9514j5858
$$ 11013 25544 50367 44050 -4376 -39341 -34585 -29142 -784 17149 14628 -5308 24206 8348
4816H348k4696k0457R286J4894R72j320L024r417l264N8571L0556m4067n533k1654
$$ 8348 -16348 -36805 -27519 -12625 -11653 -12973 -9949 -19366 -22630 35941 66497 22430 16897 -4757
4802d757k6357N690K0587Q268J7506J5314O010o762L859J6861n8053j0047m270
$$ -4757 -31114 -25424 -4837 3431 20937 36251 42261 35499 39358 56219 -1834 -11881 -16151
4789a6151q926Q290K9753j3982k1384m780j9801R154K2231M775k2123j637K6390
$$ -16151 -25077 -16787 12966 -1016 -22400 -27180 -46981 -37827 -15596 -10821 -32944 -34581 -8191
4776h191J6773J7432j4151m4516j4079K4198K904j0859l2581J3647J1233k1001
$$ -8191 8582 26014 11863 -32653 -46732 -22534 -19630 -30489 -63070 -49423 -38190 -59191
4764e9191p896N823n273M956N278M3308J1093P12N540K1591O437l6611k2359j0673
$$ -59191 -67087 -61264 -66537 -61581 -56303 -12995 -1902 -1190 4350 25941 32378 -4233 -26592 -37265
4750c7265L45N256j1876o96J3200r12K1560K0254L0122N831l1994l2120K3364
$$ -37265 -36920 -31664 -43540 -44236 -31036 -31948 -10388 9866 39988 45819 13825 -18295 5069
4737E069J7015j2943o35J3962K4093k4467l7742j5931l503j0139l3682k6766J8419
$$ 5069 22084 9141 8506 22468 46561 22094 -15648 -31579 -35082 -45221 -78903 -105669 -87250
4724h7250K981N304K2584q367q463n053M2430K4056M746k1978k7299J95L3335
$$ -87250 -84269 -78965 -56381 -64748 -73211 -78264 -35834 -11778 -7032 -29010 -56309 -56114 -22779
4711b2779L1835P768Q282J3716l449l1628q54J8267L97j2591k1699o128m31n212
$$ -22779 9056 16824 25106 38822 35373 3745 2891 21158 21555 8964 -12735 -18863 -19294 -24506
4697b4506l2960O5K0307L3540j6225q095J3149R779K1650K789n8432O615K1384
$$ -24506 -57466 -57401 -37094 -3554 -19779 -27874 -14725 -4946 16704 19493 -38939 -32324 -10940
4684a0940K3689k4465j2127j290K399k0664R38J2129N816j6681n672k4924L824
$$ -10940 12749 -11716 -23843 -25133 -22734 -43398 -42460 -30331 -24515 -41196 -46868 -71792 -67968
4671f7968J5537K4484k948n409j0294J0426J3880j6739J4419R173K3793L9512
$$ -67968 -52431 -27947 -30895 -36304 -46598 -36172 -22292 -39031 -24612 -15439 8354 47866
4659D7866j9391k8502N771L14j7238j1396J2337M241R71k7446j7758k1311J1840
$$ 47866 28475 -27 5744 6058 -11180 -22576 -10239 -5998 -5027 -32473 -50231 -71542 -59702
4646e9702L0709J9916k0282j3928Q236K3932j1509j3015p07J845K329L0773j0041
$$ -59702 -28993 -9077 -29359 -43287 -35051 -11119 -22628 -35643 -36350 -34505 -32176 -1403 -11444
4633a1444K413j2226l270o371k5846J3421N993Q36K92l3912q802Q28J4388J3574
$$ -11444 -9031 -21257 -24527 -30898 -56744 -43323 -37330 -36494 -36202 -70114 -78916 -78088 -63700 -50126
4619e0126J2066n122j5540k6607o380L9657K8434k054j8272R494L1797j544j424
$$ -50126 -38060 -43182 -58722 -85329 -91709 -52052 -23618 -25672 -43944 -34450 -2653 -4197 -5621
4606e621k6995q87p744K0240J3632q384j9837J1476K3541R490N9R19j6535m2822
$$ -5621 -32616 -33503 -41247 -21007 -7375 -15759 -35596 -24120 -579 8911 8970 9889 -6646 -49468
4592d9468n774M6970M3058R526j8658k6167N685L7161L7034R757K6976j8721n2027
$$ -49468 -55242 -8272 34786 44312 25654 -513 5172 42333 79367 89124 116100 97379 45352
4579D5352l7171M748k58J2745p064j6571j9134p737J8217L294Q085K0932k762
$$ 45352 8181 12929 12671 25416 18352 1781 -17353 -25090 -6873 -3579 4506 25438 22676
4566B2676j4688n284j3288j4037K5841L0176J7339j986k9201K3511J2393K056
$$ 22676 7988 2704 -10584 -24621 1220 31396 48735 46749 17548 41059 53452 55508
4554E5508k0357n916J2000N905L0991k6550M338j7894k3573j9784o790R829K8784
$$ 55508 35151 29235 41235 47140 78131 51581 55919 38025 14452 -5332 -12122 -2293 26491
4541B6491P400k003r249l831J8258o342J2486l163m2297j2634l6858L3897L4088
$$ 26491 33891 31888 22639 18808 37066 30724 43210 40047 -2250 -14884 -51742 -17845 16243
4528A6243K1668k7939l0755O304j458k6167J7286j4272k420L3204m483K984j3039
$$ 16243 37911 9972 -20783 -14479 -15937 -42104 -24818 -39090 -41510 -8306 -12789 -9805 -22844
4515b2844P140k2687K3604k0902m4432J935L6949L4207L775j0331p516l8473N491
$$ -22844 -15704 -38391 -14787 -35689 -80121 -78186 -41237 -7030 -3255 -13586 -21102 -59575 -54084
4502e4084L9081j4185K2816Q347j6916L0904J7156j957J089Q003j7073l692k2734
$$ -54084 -15003 -29188 -6372 1975 -14941 15963 33119 31162 32251 40254 23181 19489 -3245
4489c245p040n486j8176k8590K2102o57O386R253m5532N783K1733O91p712J7061
$$ -3245 -10285 -15771 -33947 -62537 -40435 -41092 -34706 -25453 -70985 -65202 -43469 -42778 -50490 -33429
4475c3429K5788L967K6410O867l3743m497J2806k309j7740l0794K482O160L8041
$$ -33429 -7641 -3674 22736 29603 -4140 -8637 4169 1860 -15880 -46674 -44192 -38032 9
4462IJ1843j5470M814K1345M5563k5630m5656N065K6261J3531j1909j0272q153
$$ 9 11852 -3618 1196 22541 68104 42474 -3182 1883 28144 41675 29766 19494 11341
4449A1341N189J0747J6564j9093l0259m9889l4925J2373J7322K5520P316K9074
$$ 11341 16530 27277 43841 24748 -5511 -55400 -90325 -77952 -60630 -35110 -27794 1280
$$ [...]
##END NTUPLES=NMR SPECTRUM
##END=
