##TITLE=Analysis number 319243
Compound Code cc 48901
Book Reference 468/69
Project Code adrs
Chemist Name colinb
##JCAMPDX= 6.0         $$ Bruker NMR JCAMP-DX V2.0
##DATA TYPE= NMR SPECTRUM
##DATA CLASS= NTUPLES
##ORIGIN= Bruker BioSpin GmbH
##OWNER= nmr
$$ XWIN-NMR		Version 3.5
$$ Mon May  8 08:51:14 2006 GMT Daylight Time (UT+1h)  MAYBRIDGE\nmr@NMR_250MHZ
##.OBSERVE FREQUENCY= 250.131544655141
##.OBSERVE NUCLEUS= ^1H
##.ACQUISITION MODE= SIMULTANEOUS (DQD)
##.ACQUISITION SCHEME= undefined
##.AVERAGES= 16
##.DIGITISER RES= 18
##SPECTROMETER/DATA SYSTEM= dpx250
##.PULSE SEQUENCE= zg30
##.SOLVENT NAME= DMSO
##.SHIFT REFERENCE= (INTERNAL, DMSO, 0, 16.522)
##AUDIT TRAIL= $$ (NUMBER, WHEN, WHO, WHERE, WHAT)
$$ ##TITLE= Audit trail, XWIN-NMR		Version 3.5
$$ ##JCAMPDX= 5.01
$$ ##ORIGIN= Bruker BioSpin GmbH
$$ ##OWNER= nmr
$$ C:\u/data/dgb/nmr/ADRS/3830/pdata/1/auditp.txt
$$ ##AUDIT TRAIL=  $$ (NUMBER, WHEN, WHO, WHERE, WHAT)
(   1,<2006-05-08 08:50:20.34 +100>,<MAYBRIDGE\nmr>,<NMR_250MHZ>,
      <created by zg, POWCHK disabled, PULCHK disabled
       configuration hash MD5:
       84 BC 41 DB A1 6E 1D 46 DA 25 12 A5 C1 ED C5 3A
       data hash MD5: 64K
       AF 89 72 0F E0 E9 43 7A 1E 4B A5 C0 A4 73 F2 80>)
(   2,<2006-05-08 08:50:45.60 +100>,<MAYBRIDGE\nmr>,<NMR_250MHZ>,
      <Start of raw data processing
       ef LB = 0.3 FT_mod = 6 PKNL = 1 SI = 32K 
       data hash MD5: 32K
       E6 7C 14 00 51 4E 72 6C BF 81 F5 AC E2 6D A7 9D>)
(   3,<2006-05-08 08:50:50.18 +100>,<MAYBRIDGE\nmr>,<NMR_250MHZ>,
      <apk 
       data hash MD5: 32K
       FD D0 0B E8 7C 4D C4 13 FA B5 CD 27 DF FB 45 BD>)
(   4,<2006-05-08 08:50:51.79 +100>,<MAYBRIDGE\nmr>,<NMR_250MHZ>,
      <abs ABSG = 5 
       data hash MD5: 32K
       3D 99 21 A4 97 CC 56 FB D5 3D D2 FB 30 24 DA E8>)
$$ ##END=
$$ 
$$ hash MD5
$$ CA A0 36 D8 B4 E2 9D 24 D3 AE 2D 12 A7 3A 36 4A
##$RELAX= 
##$RELAX= 
##$RELAX= 
##$RELAX= 
##$RELAX= 
##$RELAX= 
##$RELAX= 
$$ Bruker specific parameters
$$ --------------------------
##$DU= <C:\u>
##$EXPNO= 3830
##$NAME= <ADRS>
##$PROCNO= 1
##$TYPE= <nmr>
##$USER= <dgb>
##$AMP= (0..31)
100 100 100 100 100 100 100 100 100 100 100 100 100 100 100 100 100 100 
100 100 100 100 100 100 100 100 100 100 100 100 100 100 
##$AQSEQ= 0
##$AQ_mod= 3
##$AUNM= <au_zg>
##$AUTOPOS= <4 >
##$BF1= 250.13
##$BF2= 250.13
##$BF3= 250.13
##$BF4= 250.13
##$BF5= 500.13
##$BF6= 500.13
##$BF7= 500.13
##$BF8= 500.13
##$BYTORDA= 1
##$CFDGTYP= 0
##$CFRGTYP= 5
##$CHEMSTR= <none>
##$CNST= (0..31)
1 1 145 1 1 1 1 1 1 1 1 1 1 1 1 1 1 1 1 1 1 1 1 1 1 1 1 1 1 1 1 1 
##$CPDPRG= <>
##$CPDPRG1= <>
##$CPDPRG2= <>
##$CPDPRG3= <>
##$CPDPRG4= <mlev>
##$CPDPRG5= <mlev>
##$CPDPRG6= <mlev>
##$CPDPRG7= <mlev>
##$CPDPRG8= <mlev>
##$CPDPRGB= <>
##$CPDPRGT= <>
##$D= (0..31)
0 1 0 0 0 0 0 0 0 0.06 0 0 0 0 0 0 0.0002 0 0 0 0 0 0 0 0 0 0 0 0 0 0 
0 
##$DATE= 1147074617
##$DBL= (0..7)
120 120 120 120 120 120 120 120 
##$DBP= (0..7)
150 150 150 150 150 150 150 150 
##$DBP07= 0
##$DBPNAM0= <>
##$DBPNAM1= <>
$$ [...]
##$SUBNAM7= <"">
##$SUBNAM8= <"">
##$SUBNAM9= <"">
##$SW= 20.6930455092707
##$SWIBOX= (0..15)
0 0 3 0 0 0 0 0 0 0 0 0 0 0 0 0 
##$SW_h= 5175.983436853
##$TD= 65536
##$TD0= 1
##$TE= 294.16
##$TE2= 300
##$TE3= 300
##$TEG= 300
##$TL= (0..7)
0 120 120 120 120 120 120 120 
##$TP= (0..7)
150 150 150 150 150 150 150 150 
##$TP07= 0
##$TPNAME0= <>
##$TPNAME1= <>
##$TPNAME2= <>
##$TPNAME3= <>
##$TPNAME4= <>
##$TPNAME5= <>
##$TPNAME6= <>
##$TPNAME7= <>
##$TPOAL= (0..7)
0.5 0.5 0.5 0.5 0.5 0.5 0.5 0.5 
##$TPOFFS= (0..7)
0 0 0 0 0 0 0 0 
##$TUNHIN= 0
##$TUNHOUT= 0
##$TUNXOUT= 0
##$USERA1= <user>
##$USERA2= <user>
##$USERA3= <user>
##$USERA4= <user>
##$USERA5= <user>
##$V9= 5
##$VALIST= <valist>
##$VCLIST= <CCCCCCCCCCCCCCC>
##$VD= 0
##$VDLIST= <DDDDDDDDDDDDDDD>
##$VPLIST= <PPPPPPPPPPPPPPP>
##$VTLIST= <TTTTTTTTTTTTTTT>
##$WBST= 1024
##$WBSW= 4
##$XGAIN= (0..3)
0 0 0 0 
##$XL= 0
##$YL= 0
##$YMAX_a= 344997
##$YMIN_a= -497143
##$ZGOPTNS= <>
##$ZL1= 120
##$ZL2= 120
##$ZL3= 120
##$ZL4= 120
##$ABSF1= 16.522
##$ABSF2= -4.171173
##$ABSG= 5
##$ABSL= 3
##$ALPHA= 0
##$AQORDER= 0
##$ASSFAC= 0
##$ASSFACI= 0
##$ASSFACX= 0
##$ASSWID= 0
##$AUNMP= <proc_1d>
##$AZFE= 0.1
##$AZFW= 0.1
##$BCFW= 0
##$BC_mod= 0
##$BYTORDP= 0
##$COROFFS= 0
##$CY= 12.5
##$DATMOD= 1
##$DC= 0
##$DFILT= <>
##$DTYPP= 0
##$F1P= 14.0000005364418
##$F2P= -0.99999901652339
##$FCOR= 0.5
##$FTSIZE= 32768
##$FT_mod= 6
##$GAMMA= 0
##$GB= 0
##$INTBC= 1
##$INTSCL= 1
##$ISEN= 128
##$LB= 0.3
##$LEV0= 0
##$LPBIN= 0
##$MAXI= 10000
##$MC2= 0
##$MEAN= 0
##$ME_mod= 0
##$MI= 0
##$NCOEF= 0
##$NC_proc= -5
##$NLEV= 6
##$NOISF1= 0
##$NOISF2= 0
##$NSP= 0
##$NTH_PI= 0
##$NZP= 0
##$OFFSET= 16.522
##$PC= 1
##$PHC0= 158.5339
##$PHC1= 10.24083
##$PH_mod= 1
##$PKNL= yes
##$PPARMOD= 0
##$PSCAL= 4
##$PSIGN= 0
##$REVERSE= no
##$SF= 250.13
##$SI= 32768
##$SIGF1= 0
##$SIGF2= 0
##$SINO= 400
##$SIOLD= 32768
##$SREGLST= <1H.DMSO>
##$SSB= 0
##$STSI= 32768
##$STSR= 0
##$SW_p= 5175.98343685301
##$SYMM= 0
##$S_DEV= 0
##$TDeff= 65536
##$TDoff= 0
##$TI= <Analysis number 999999
Compound Code 99
Book Reference 9
Project Code 9>
##$TILT= no
##$TM1= 0
##$TM2= 0
##$TOPLEV= 0
##$USERP1= <user>
##$USERP2= <user>
##$USERP3= <user>
##$USERP4= <user>
##$USERP5= <user>
##$WDW= 1
##$XDIM= 32768
##$YMAX_p= 388545415
##$YMIN_p= -453691
$$ End of Bruker specific parameters
$$ ---------------------------------
##NTUPLES= NMR SPECTRUM
##VAR_NAME=  FREQUENCY,     SPECTRUM/REAL,   SPECTRUM/IMAG
##SYMBOL=    X,             R,               I
##VAR_TYPE=  INDEPENDENT,   DEPENDENT,       DEPENDENT
##VAR_FORM=  AFFN,          ASDF,            ASDF
##VAR_DIM=   32768,         32768,           32768
##UNITS=     HZ,            ARBITRARY UNITS, ARBITRARY UNITS
##FACTOR=    0.157963299565203, 1,           1
##FIRST=     4132.6476996994, 0,             0
##LAST=      -1043.33573715361, 0,           0
##MIN=       -1043.33573715361, -453691,     0
##MAX=       4132.6476996994, 388545415,     0
$$ Real data points
##PAGE= N=1
##DATA TABLE= (X++(R..R)), XYDATA
$$ [...]
23270B4859N7110J9157M344o6709j0673L9685N654q7026j26989j15760P0831J53340
23258c2177o2247o9100k3267M7487J9334r3242J4481m1661j0145j8366R3738J08824
23246f6341o371j25422Q0912k302K6975L0859O5995o7933n6746M2667R5296M8156
23234F5745O0825Q2937K3818m6705j3962p6128n4357j5155k2402n1472j0546j02765
23222a60167k0259Q4932Q2334l9970l8714N2757n7356p1323J9967J9534R9186
23211b9079L6449K4429o3861j66237J15J19923M5149M4905M9394o9942m1049J1154
23199c8650N9964n6602l2352O9591q2777j22984R7872J36244j4724j15200j6104
23188a15722L6613J13578l634m9410L0811n22J3250j5199j5854j1663K62j00652
$$ plain form
23270 24859 81969 101126 105470 38761 28088 67773 73427 -13599 -140588 -256348 -185517 -32177
23258 -32177 -94424 -163524 -186791 -139304 -119970 -213212 -198731 -240392 -250537 -268903 -175165 -66341
23246 -66341 -72712 -198134 -117222 -119524 -92549 -61690 4305 -63628 -120374 -77707 17589 65745
23234 65745 126570 209507 233325 186620 172658 96530 42173 27018 4616 -46856 -57402 -160167
23222 -160167 -180426 -95494 -13160 -53130 -91844 -39087 -96443 -167766 -147799 -128265 -29079
23211 -29079 7370 31799 -32062 -198299 -198184 -78261 -33112 11793 61187 -8755 -49804 -38650
23199 -38650 21314 -35288 -67640 1951 -80826 -203810 -105938 30306 15582 -99618 -115722
23188 -115722 -79109 34469 30835 -18575 12236 11714 24964 9765 -6089 -17752 -17490 -118142
23176a18142Q605L3665q8954Q4235N4500o3262j1838J2743l546N3901Q2930r7535
23164e2698K6775M5376J27626m0770n4220J1429R5364J2673l3534m8934m0630
23153D8457N7991n8485r6658k0738L0229Q9102J2752j13775P7190K1840j74582
23142a26677j06258J72498J27175R9441j29474j36878L4649J66573Q0456o0614
23132A20891m5588J10582O0195j08206k7040o0706n7295n3767J6941k0j962j58525
23120b04500N9196J43822Q0175n3525o9742n3595m7889Q6312r2107P5047O0447
23109a6359m7652j5533O818J2725o0123j1216J48150M4152j04822q9468J28512
23098d816j7941p9465n6680q1685k0284R2504J44651J7230q3301J27404R756J9330
$$ plain form
23176 -118142 -109537 -75872 -164826 -80591 -26091 -89353 -101191 -88448 -91994 -38093 44837 -52698
23164 -52698 -25923 19453 147079 106309 52089 63518 158882 171555 138021 89087 48457
23153 48457 106448 47963 -48695 -69433 -39204 49898 62650 -51125 26065 47905 -126677
23142 -126677 -232935 -60437 66738 166179 36705 -100173 -65524 101049 181505 120891
23132 120891 75303 185885 246080 137874 110834 50128 -7167 -60934 -43993 -44013 -45975 -204500
23120 -204500 -145304 -1482 78693 25168 -44574 -98169 -146058 -59746 -151853 -76806 -16359
23109 -16359 -64011 -79544 -72726 -60001 -120124 -131340 16810 60962 -43860 -133328 -4816
23098 -4816 -22757 -102222 -158902 -240587 -260871 -168367 -23716 -6486 -89787 37617 47373 66703
23086F6703n1871J611p9105j28027q560N6341L340J26113K6062j24335j59716
23075b71444N3280J06780Q6505O5351n1942l5903k2757n4086K8163k6370p6144
23064a98567O067L8288k3366N4473O6735Q1826J20600N017o8262P1331k943p5934
23052G5265j31840K580K3136K3887j31482q5413Q4842O4595J1033J54387J60899
23041B51889l1598j6971k0485p7500l5265J2903R9321m545j75511j16047L3399
23030h0410j16186N7134L8317n6434R7024K2433n6018o6574L8652J79032R2030
23019A49000j27004k1799j11221j29699m9328o8564J41515Q0651N8734M5294O8576
23008C6155L8311N827L7860N5996N6771o6345L6346l8656j16113p6358l4321M4209
$$ plain form
23086 66703 14832 16443 -62662 -190689 -199249 -142908 -139568 -13455 12607 -111728 -271444
23075 -271444 -218164 -111384 -24879 40472 -11470 -47373 -70130 -124216 -96053 -122423 -198567
23064 -198567 -192500 -154212 -177578 -123105 -56370 25456 146056 151073 82811 154142 151199 75265
23052 75265 -56575 -53995 -30859 -6972 -138454 -223867 -139025 -74430 -63397 90990 251889
23041 251889 220291 203320 182835 105335 70070 82973 182294 177749 2238 -113809 -80410
23030 -80410 -196596 -139462 -101145 -157579 -60555 -38122 -94140 -160714 -122062 56970 149000
23019 149000 21996 197 -111024 -240723 -290051 -358615 -217100 -136449 -77715 -32421 36155
23008 36155 74466 80293 118153 174149 230920 164575 200921 162265 46152 -30206 -64527 -20318
22996b0318Q3505j8235k8230q2338j1379l8842Q4099j04404q1824K345Q0233Q6389
22984d8999j4213P5264K7546j14694K8743J17590l3092k256L3058q165j6467l6983
22972G332K4966J7919l6865j1380J02029m5790j12812P1691R8841k0879j6502
22961G8550P0679M2655n5949p0272j2537m4346O9211O853l0329Q005j02219k6300
22949f5999k7347P9436L7155j03899l1576o2384L4450N0594Q2128m0875O463k6449
22937f8303n2400l1748m9384K6424J12415L0025q4054l8535J53636J57816j4350
22926A41542j28645j41211q2568L8381J55223k4700j00934j6531J11016K50871
22916B02444K08862j5920p1672j60779k0355j7985j38233j48052L0574Q984J45122
$$ plain form
22996 -20318 63187 44952 16722 -65616 -76995 -115837 -31738 -136142 -217966 -215621 -135388 -48999
22984 -48999 -63212 12052 39598 -75096 -46353 71237 38145 35889 68947 60782 44315 7332
22972 7332 32298 50217 13352 1972 104001 58211 -54601 17090 115931 95052 78550
22961 78550 149229 191884 135935 65663 53126 8780 77991 84844 54515 62520 -39699 -65999
22949 -65999 -93346 -13910 23245 -80654 -112230 -174614 -140164 -89570 -7442 -48317 -41854 -68303
22937 -68303 -120703 -152451 -201835 -175411 -62996 -32971 -117025 -155560 -1924 155892 141542
22926 141542 12897 -128314 -210882 -172501 -17278 -41978 -142912 -159443 -48427 202444
22916 202444 411306 395386 323714 162935 142580 124595 -13638 -161690 -131116 -122132 22990
22905B2990P2637P6801k8324n9279j24130l7434p1389m4033M857p9630J30011
22894a36923J94445K9644K4172q3548m8627K5343k3384N9927N4155l6845o8143
22883i784r3421O8503K5157k8015r3493N2664J32570p06J6293q1606o3923N0157
22871b5604j3846O4378n7609m664N9904r435Q030N0284k6702l4785n5845k25359
22859b71253m0164K5653Q5843M8656L5906M3686Q1343N6353P1943j7659l1559
22848H8748j10596m1581K183J01502Q9734k646q4913k7735l8860j9764J38381
22837I4453n80j83264J01880J05517r0298k6289J0889j8257o4775p2355J39309
22826c770P8729l2477k81r352r8042j6979O6094n8832O6828o0126J7860J32670
$$ plain form
22905 22990 95627 172428 144104 84825 -39305 -76739 -148128 -192161 -187304 -266934 -136923
22894 -136923 57522 87166 111338 27790 -20837 4506 -18878 41049 95204 58359 -9784
22883 -9784 -103205 -34702 -9545 -37560 -131053 -78389 54181 53475 69768 -11838 -75761 -25604
22871 -25604 -39450 24928 -32681 -37345 22559 13124 21154 71438 44736 9951 -45894 -271253
22859 -271253 -311417 -285764 -199921 -151265 -115359 -71673 9670 66023 137966 120307 88748
22848 88748 -21848 -63429 -61246 40256 129990 127344 42431 14696 -24164 -43928 94453
22837 94453 93873 -89391 12489 118006 27708 1419 12308 -5949 -70724 -143079 -3770
22826 -3770 74959 42482 42201 32849 -65193 -82172 -16078 -74910 -8082 -68208 -50348 82322
22814H2322o0783j6966P3393P0375n4891j56406r4509m6743J42509M330n3914
22803a11283P4762O8478L3217N767r476k9959j987o77n2102o2985R1054n6692
22791e1883r8074O4542J13556J16886O0203q1065n8342N857q9461p3625P4965
22780a6441P7888n8660n3324o1459j08500n7229j7354Q0469J50475J27882J5176
22769G8923j15j6548K3540m695n8696o9442O8635K1879l4086j28721k0677j08927
22757b48930l2503J0973J01173J44580R0292L905k1549l5211j12872m9595J16557
22746c3180q658N0893M8047j30752M4207K207n5398L147o6083M2651K7261o3156
22734a38814O0486O8066m4792k1287M6367M8235r7672j44695o4894R2633J31332
$$ plain form
22814 82322 21539 4573 77966 148341 93450 -62956 -157465 -204208 -61699 -57369 -111283
22803 -111283 -36521 31957 65174 70941 61465 31506 29519 28842 -23260 -86245 4809 -51883
22791 -51883 -149957 -85415 28141 145027 205230 124165 65823 71680 -17781 -91406 -16441
22780 -16441 61447 2787 -50537 -111996 -220496 -277725 -295079 -214610 -64135 63747 78923
22769 78923 78808 62260 85800 81105 22409 -47033 21602 43481 9395 -119326 -140003 -248930
22757 -248930 -281433 -270460 -169287 -24707 65585 69490 47941 12730 -100142 -149737 -33180
22746 -33180 -41838 9055 57102 -73650 -29443 -27236 -82634 -79487 -145570 -102919 -75658 -138814
22734 -138814 -78328 -10262 -55054 -76341 -29974 18261 -79411 -224106 -289000 -196367 -65035
22723f5035M479P1722N9335Q2853j13607L0869J05548J0837r2244j50745l5240
22712i1228K4546r3394N5900J10055J26004L5995k36898r6870m382k3415m2556
22701b36243Q4162k4850R0873J34328P3780q1797j13735j27844n52n2720l0263
22690b84861m3807O3090K31736M0097j33196k7676R3579o8387j80979Q4126J99634
22679b6644P820k4478n597j11813N7706P1007l0110o5313N6486M4853J49642L3845
22667A57404K4286j03038q7505L7662L7798o3753j680l7679L4840q4717O166n1720
22655a31936m1914P5351o1440J2302K05112Q0543k7175l2559n6776n7936K5994
22644a0434J3874k7954m2212O0242P8247J527m0310l0148o2717K3052M5606j227
$$ plain form
22723 -65035 -60556 11166 70501 153354 39747 70616 176164 187001 94757 -55988 -91228
22712 -91228 -66682 -160076 -104176 5879 131883 167878 -69020 -165890 -170272 -193687 -236243
22701 -236243 -152081 -176931 -86058 48270 122050 40253 -73482 -201326 -201878 -254598 -284861
22690 -284861 -328668 -265578 -33842 6255 -126941 -154617 -61038 -129425 -310404 -226278 -26644
22679 -26644 -18824 -43302 -48899 -160712 -103006 -31999 -62109 -127422 -70936 -26083 123559 157404
22667 157404 181690 78652 -8853 28809 66607 2854 1174 -36505 -1665 -86382 -80216 -131936
22655 -131936 -173850 -98499 -159939 -147637 57475 138018 110843 78284 21508 -36428 -10434
22644 -10434 3440 -24514 -66726 -6484 71763 73290 32980 2832 -59885 -36833 8773 7546
22632G546o8232R4517J22309P192K2895n1859k0026K2026l6183J7854J4291K305
22620A34635J7015q8202p9953L5448j43086j9539K8397O9304J72898n4338k8156
22609D4423j02543K8814K6557L3264P0186k4906l9214M4103N7957O162k05248
22598f0445j11293N9388R4135n4915l141o8114L0349R3449P6416J32694Q7340
22587B75863j07083m5298N5132K5070r7382j20659N6728R4907J07346j7826n9052
22576A67746j2385n0318j54391n5027L1681J4553J9495J10924k6788l1275J25205
22565A39420l4591L894r9424j19501M6253K180n8217N7316j13035o9605J56129
22554h9181O7059m1710m3564p9346l930J00394P0322M5811P0901J7903r5471p9330
$$ plain form
22632 7546 -60686 33831 156140 163332 186227 134368 114342 136368 100185 118039 132330 134635
22620 134635 151650 63448 -16505 18943 -124143 -143682 -115285 -45981 126917 72579 44423
22609 44423 -58120 -29306 -2749 30515 100701 75795 36581 80684 138641 144803 -60445
22598 -60445 -171738 -112350 -18215 -73130 -76271 -144385 -114036 -20587 55829 188523 275863
22587 275863 168780 123482 178614 203684 106302 -14357 42371 137278 244624 226798 167746
22576 167746 155361 105043 -49348 -104375 -72694 -58141 -38646 72278 45490 14215 139420
22565 139420 104829 108723 9299 -110202 -63949 -61769 -119986 -62670 -175705 -245310 -89181
22554 -89181 -22122 -63832 -107396 -186742 -190672 -90278 -19956 25855 96756 114659 19188 -60142
22542f0142O8222J16826m1411k5780j22158p0077R2277q729l2551L9716O9433
22531B5626l2853l0494j05704j38034J23120J4538q638O3359J51077q295o6577
22520a2875o8880j7346n9161L3825P8245l6162j01204q858L6424K8258M6203K4495
22508e7036M6819l339O2538p0099o8200N837M0384J26475O7617j30844p9718L2725
22496b6841J7214p6995J7384N8453j8710q8758N1449P5721j3125N4026j04249
22485e4431j07779P8926R4725N4537L8556l7463j23638p4834N7274o8555q0447
22474b23129Q1571R4124P2085j03278j24602R1588J5983N9202N0086r6304l4894
22463a17568Q8318L1228K0767o6267L4053Q1198o9380N7403n9126o0471J8763
$$ plain form
22542 -60142 8080 124906 83495 57715 -64443 -134520 -42243 -50972 -83523 -43807 25626
22531 25626 -7227 -37721 -143425 -281459 -158339 -143801 -152439 -89080 61997 53702 -12875
22520 -12875 -81755 -99101 -158262 -124437 -46192 -82354 -183558 -192416 -155992 -127734 -81531 -57036
22508 -57036 -10217 -13556 48982 -21117 -89317 -83480 -43096 83379 150996 20152 -59566 -26841
22496 -26841 -9627 -86622 -69238 -10785 -29495 -118253 -66804 8917 -4208 49818 -54431
22485 -54431 -162210 -83284 11441 65978 104534 67071 -56567 -131401 -74127 -142682 -223129
22474 -223129 -141558 -47434 24651 -78627 -203229 -111641 -95658 -36456 13630 -82674 -117568
22463 -117568 -29250 1978 22745 -43522 -9469 71729 2349 59752 626 -59845 -41082
22452d1082J02078k2599k5594l5586N5555O6580P0112J6419N606N247r7203j09727
22440a0194m3091m998m1748o0m2946k1257R3288O5784l0682M079l8614q6457N3632
22427a03264M6767J8029L844J3447J07234M9723L7890o5408p9421j1086j0135
22416G620R5275O1658M171J7965j37851j58641n7443q4092o3867K6758J86595
22405a01852J76307J39272p2475n1478M9281O0626Q5346p2486m1360K7784O187
22394B05152j00137k3331k6983O5152m9063J4235N0769k2362o760j10627o9946
22383g3901N3507J27408j7834J7245k1629j12216q7318J75176k2128p0945L1002
22372a633J3874k1342J2003m9613l9754r1771j1582m4042R3683l8776q8997J21784
$$ plain form
22452 -41082 60996 38397 12803 -22783 32772 99352 169464 185883 191489 196736 99533 -10194
22440 -10194 -53285 -58283 -100031 -100091 -143037 -164294 -71006 -5222 -35904 -31825 -70439 -156896 -103264
22427 -103264 -56497 -38468 -34624 -21177 86057 135780 173670 108262 28841 17755 7620
22416 7620 102895 164553 168724 186689 48838 -109803 -167246 -251338 -315205 -288447 -101852
22405 -101852 74455 213727 141252 89774 139055 199681 285027 212541 171181 198965 205152
22394 205152 105015 81684 54701 119853 70790 85025 135794 113432 106672 -3955 -73901
22383 -73901 -20394 107014 89180 106425 84796 -27420 -114738 60438 38310 -32635 -1633
22372 -1633 12241 -9101 2902 -46711 -86465 -178236 -189818 -233860 -140177 -178953 -267950 -146166
22360a46166L312N4307J09665J6124j1768L1493O6506j27830m8491P5711l0519
22349g656j23864j1625Q4056k2450M2254k4524O6929L8468j9118J06728O0552
22338A89750o6350j70251J07730J53469m6782j8216o9918p7809N0442Q9697R617
22327A51379M1835j9927j04829P647k3125j38135o599J55680j2856o7004j00756
22316a16690J1451K8593j11222L3666J28560L1975J3839j5817N4909j26740j26773
22305a94249Q0074N3599M5945N188M7217J19036j22889k11814n1215Q5065J9730
22294a24313O8845O8977N3638J23484J67023j56809j78689l3952k3890j9655k9680
22283h5021O9606J16232m9995j39647k6935J79463J44087j15872j95751j9601
$$ plain form
22360 -146166 -142854 -88547 21118 37242 25474 56967 123473 -4357 -52848 22863 -7656
22349 -7656 -131520 -143145 -59089 -81539 -39285 -63809 3120 41588 22470 129198 189750
22338 189750 123400 -46851 60879 214348 167566 149350 79432 1623 52065 141762 151379
22327 151379 193214 173287 68458 76105 52980 -85155 -91754 63926 51070 -15934 -116690
22316 -116690 -105239 -76646 -187868 -154202 -25642 6333 20172 4355 59264 -67476 -194249
22305 -194249 -114175 -60576 -14631 -9443 37774 156810 33921 -177893 -229108 -144043 -124313
22294 -124313 -55468 13509 67147 190631 357654 200845 22156 -11796 -35686 -55341 -85021
22283 -85021 -15415 100817 50822 -88825 -115760 63703 207790 91918 -103833 -123434
22273a23434N7929O5431j8550J4763L5479k3875M7898N8802L9658O9279k0441
22262B02939j26316K8161Q4335k7492N2274j10497k1546n3676M1024K0057m7264
22251D1999R4035J7174n5227j28547q1431K0633Q2537j9190L0130J48892q13l5005
22239A15187q0438P2500O890l195j20596j41852m552l3769j4814L5653N7573m828
22227a16241q4289L2403P8340J372j2054J5940q6058J38106J51250j12229j06536
22216i9996N9051K9751j56691j24825N5029M7245K6380l7972L0208J92331N5143
22205G5654n5737J5005j24407o9461m0587L8546J10018J4616p2175O6903J11206
22194F9581j4366j00787q5265M2525P0700R3216j6739M2142J00238j70792r2890
$$ plain form
22273 -123434 -65505 -74 -18624 -3861 31618 7743 55641 114443 154101 223380 202939
22262 202939 76623 104784 189119 161627 213901 103404 81858 28182 69206 89263 41999
22251 41999 136034 153208 97981 -30566 -111997 -91364 -8827 -28017 2113 151005 150192 115187
22239 115187 34749 107249 114139 110944 -9652 -151504 -156056 -189825 -204639 -168986 -111413 -116241
22227 -116241 -200530 -168127 -89787 -88415 -100469 -84529 -170587 -32481 118769 6540 -99996
22216 -99996 -40945 -11194 -167885 -292710 -237681 -190436 -164056 -202028 -171820 20511 75654
22205 75654 19917 34922 -89485 -158946 -199533 -160987 -50969 -36353 -108528 -41625 69581
22194 69581 55215 -45572 -130837 -88312 -17612 75604 58865 101007 201245 30453 -62437
22183f2437K1820M0445K7185M3802j03835n7189j7880O6331J31548Q870L1433
22172A30093M4225M3517M792j45583j48406K6794K0036L7035j28270j6419Q269
22161a23917N7892k3988K9638J02898j10050j58434l69N679P9173J32356Q1764
22150G2642j12007J56314J38736l2187l1812j01742j00000o1220M8790J08516
22140H6030n655L1883j70189j05267J14672J81468o2240k48430m610J64076N1079
22129C2817r8276m7830R1076P6487M2708j22605j67301M6362R2346l8902l0195
22118a23313M886p8024k8429J26377L9656M8901M9364K6021k4271j2440q7431
22107e8703l628K6163l0095j66325j24191P6452J49242J9109Q406j22443r3247
$$ plain form
22183 -62437 -40617 -172 27013 70815 -33020 -90209 -108089 -41758 89790 98660 130093
22172 130093 174318 217835 222627 77044 -71362 -44568 -24532 12503 -115767 -132186 -123917
22161 -123917 -66025 -90013 -60375 42523 -67527 -225961 -226330 -220651 -141478 -9122 72642
22150 72642 -39365 116949 255685 223498 191686 89944 -10056 -71276 -22486 86030
22140 86030 80375 112258 -57931 -163198 -48526 132942 70702 -177728 -182338 -18262 32817
22129 32817 -65459 -113289 -22213 54274 96982 -25623 -192924 -146562 -54216 -93118 -123313
22118 -123313 -118427 -196451 -224880 -98503 -58847 -9946 39418 65439 41168 28728 -58703
22107 -58703 -62331 -36168 -66263 -232588 -356779 -280327 -131085 -111976 -103570 -226013 -319260
22096c19260P4747Q1828K2443L5098M5151o8478o602K7349j8567M9663k6532j52281
22084b55441j03031Q2514L4116P6764o0246J8677j2962J4562Q237M325L949L8282
22072a50254P7396r5312N2037K9736O2986N9184j0767L6078p1834q6395O6231
22061c0914P9609J3903J8053o3544o4823j8538K9765N5969m1292p9616N4720K8877
22049a7831j05290J1743J44842N0578O8587k9492m6879k3417k5724k104Q1123
22038A06136K65o3264r9536r863p37J3110q555o710p4113J2158L3722N0808J63859
22025A17280J5260j05470n0267r9601p2665l7910l5340k731L5328J15745J46084
22014B5713l1953m3708o4456J06027Q3859p4k483K6000K2151Q4622n5648o7275
$$ plain form
22096 -319260 -244513 -162685 -140242 -105144 -59993 -128471 -135073 -107724 -126291 -76628 -103160 -255441
22084 -255441 -358472 -275958 -241842 -165078 -225324 -206647 -219609 -205047 -196810 -192485 -188536 -150254
22072 -150254 -72858 -168170 -116133 -86397 -23411 35773 25006 61084 -10750 -97145 -30914
22061 -30914 48695 62598 80651 17107 -47716 -66254 -36489 19480 -21812 -101428 -46708 -17831
22049 -17831 -123121 -111378 33464 84042 152629 123137 76258 52841 27117 25013 106136
22038 106136 106401 43137 -56399 -66262 -66999 -53889 -62444 -69154 -143267 -131109 -97387 -46579 117280
22025 117280 132540 27070 -23197 -122798 -195463 -233373 -268713 -271444 -236116 -120371 25713
22014 25713 -6240 -49948 -114404 -8377 75482 75408 72925 98925 121076 205698 150050 82775
22002H2775k5046o1126N4579J1791P643k1771j14053q7798M8317J9799m7690j4945
21990a47525J17832J26318n1814p9927j7025K51628J55587j69245j91629o3572
21980f9372o5766l8706L6628P8537j02157o60M4681n8704O4550J01800M3867n5648
21968b0950k07830n1512O0315j491k9679M4068J78354O735j24951l2537J7571
21957a61907m6391j0286j8268N6180J15756q493q4327p3083J0887J68246J8426
21946c3260l293L8599M6407J41211l1097j34402L5659l634M2449k4104j1561l7458
21934B5516p0359j7368o5714P6445M2842o0069R035O5216J00167m7399r8543k770
21922d3001j33888j35193P3684J35306p5025j01966N8739n7833J7980J13135R2158
$$ plain form
22002 82775 57729 -3397 51182 62973 70616 48845 -65208 -153006 -104689 -84890 -132580 -147525
21990 -147525 -29693 96625 44811 -35116 -52141 199487 355074 185829 -5800 -69372
21980 -69372 -135138 -173844 -137216 -58679 -160836 -161496 -116815 -175519 -110969 -9169 34698 -20950
21968 -20950 -228780 -280292 -219977 -221468 -251147 -207079 -28725 -21990 -146941 -179478 -161907
21957 -161907 -208298 -218584 -236852 -180672 -64916 -73409 -157736 -230819 -219932 -51686 -33260
21946 -33260 -36553 2046 48453 189664 158567 24165 59824 56190 98639 74535 62974 25516
21934 25516 -44843 -62211 -127925 -51480 -8638 -68707 -59672 5544 105711 58312 -40231 -43001
21922 -43001 -176889 -312082 -238398 -103092 -178117 -280083 -221344 -279177 -261197 -148062 -55904
21911e5904p8360J8704J89P6375q5743M9183J24910o1537l7193k3432L6411L4895
21899a502L3915p0209M6819P9809l5183k4224p9596k4057j5427R477M1568J1538
21887b7072J7251l7298m7642j4276o7639J1883o4658K9335J19417m9183N4428
21876g5454J9046M2808l4587q7961k4718P7435J26648J20923j16186r607O1615
21865I9962o044j6821o1932J890j13146J6596K7650J0997M5554J20400m1829j1346
21853G1931r879q4450J8415K9279l8953N360J0479o3432M8618j11528l5576L1609
21841a28127J29424L5154J7349P1027O588k0845p5987o9266l3665J12477L9512
21830H3641k2159j01246J4870P5338n7838J7739q018J10290L5449P0968L2520
$$ plain form
21911 -55904 -134264 -115560 -115371 -38996 -124739 -75556 49354 -12183 -49376 -72808 -36397 -1502
21899 -1502 32413 -37796 9023 88832 53649 29425 -50171 -74228 -89655 -80178 -38610 -27072
21887 -27072 -9821 -47119 -94761 -109037 -176676 -164793 -229451 -200116 -80699 -129882 -75454
21876 -75454 -56408 -13600 -48187 -136148 -160866 -83431 43217 164140 47954 38347 99962
21865 99962 93918 77097 15165 17055 -96091 -79495 -51845 -40848 4706 125106 83277 71931
21853 71931 62052 -22398 -3983 25296 -13657 -8297 2182 -61250 -12632 -124160 -159736 -128127
21841 -128127 1297 36451 53800 124827 131415 110570 34583 -34683 -68348 44129 83641
21830 83641 61482 -39764 -24894 50444 -7394 10345 2327 112617 148066 219034 251554
21819B51554j13322k5988p9603j28128P7398Q9588n2714j67112K05537K5486j35077
21808e2381q67P3582m7223l5150Q040k3351M0618J43119O6463p2291q4333j38290
21796a22064L119L2873P751R4160O3123M4443m5940k505j58769k3633q666L254
21784a12854J09571J20643L7689M9288K0886j13949j02177l8921o408l3309m2973
21773a12514n9122P4460J86824l1973j42349j2414M4778k7775k251Q866l3365
21762a06835Q7281J21540M3732j75205m9506n8015p5231O0084J4769p5723j0613
21751b23722J3098J37435P8574Q288o8272R1930L0429j0725L8122J418m3138p0434
21739a6997j03916p5354k3443J44205M4861N1538m731m6645l3149L3003K1848
$$ plain form
21819 251554 138232 112244 32641 -95487 -18089 71499 18785 -148327 57210 82696 -52381
21808 -52381 -53248 20334 -26889 -62039 -53999 -77350 -36732 106387 172850 100559 16226 -122064
21796 -122064 -118945 -86072 -78321 15839 78962 123405 77465 74960 -83809 -107442 -116108 -112854
21784 -112854 -3283 117360 155049 204337 225223 111274 9097 -29824 -36232 -69541 -112514
21773 -112514 -171636 -97176 89648 57675 -84674 -97088 -52310 -80085 -82336 -73470 -106835
21762 -106835 -19554 101986 145718 -29487 -78993 -137008 -212239 -152155 -137386 -213109 -223722
21751 -223722 -210624 -73189 5385 13673 -54599 37331 67760 57035 95157 96575 53437 -16997
21739 -16997 -120913 -196267 -219710 -75505 -30644 20894 16163 -30482 -63631 -30628 -8780
21728h780L9453k1049q4785r7728q7133J1277J52008j27955K1284J74997M3423
21717A5012J6114J18576Q579j15719j77329o0824P050Q9906N9760j4704O7023
21706A3444l9674j68785O8049N9892j00065k9281J62244M2061k1260N8633Q5253
21695A30511O898j43200L3775K0232L2663K1215o2718K5947o0085K5243l7980
21684g499j6014K8673m8083L1654N4142q5484N1266k1115q8245j8691p260J19647
21672g009k2375J5006j2533p3161R4405P6263j40771j02935o684N9363O4097N2181
21660d153r9742n0119J07822Q5170O4945M1558j44098J283k604r293R584q7286
21648h6933k8438m4715k9545M1415M2089N1437O6880Q5137n4519L2608N76j01992
$$ plain form
21728 -8780 30673 9624 -75161 -172889 -260022 -248745 -96737 -224692 -203408 -28411 15012
21717 15012 31126 149702 158281 42562 -134767 -195591 -188541 -98635 -38875 -53579 13444
21706 13444 -26230 -195015 -126966 -67074 -167139 -196420 -34176 7885 -13375 45258 130511
21695 130511 137409 -5791 27984 48216 80879 102094 39376 65323 5238 30481 -7499
21684 -7499 -23513 5160 -42923 -11269 42873 -42611 8655 -12460 -100705 -119396 -126656 -7009
21672 -7009 -29384 -14378 -26911 -100072 -5667 70596 -70175 -173110 -179794 -120431 -56334 -4153
21660 -4153 -103895 -154014 -46192 38978 103923 145481 1383 2666 62 -9231 353 -86933
21648 -86933 -115371 -160086 -189631 -148216 -106127 -54690 12190 97327 42808 75416 75992 -26000
21636b6000K9023P1963n4191n0018j9863j15881n9055L6619M1088k0006J713K1323
21624a43285P7854K461j0932L2437q9948j45688O1055J87971J3481k8221J91451
21613A48636J37406K6291m2664M921j85585j07336R4001Q7162m3505p895o2751
21602D8681q2009Q8901O3441j75537o4407l5099O6999M2517J26118M9681j40481
21591a1195p8781k9813L8886R8487j8516j47769n7099J07959M7401L415M8521
21580A496o6956Q3673J95140p1528k774o1024j06258j1915o0224L5904K7968J70153
21568A33655M2457j49467n6874Q8356P1922p4676p2986k1020l9172j8090J35761
21557C9866Q794n1298k4296L9357k0623o8649K270L0024j8121K1207R2281j03149
$$ plain form
21636 -26000 3023 74986 20795 -29223 -49086 -164967 -224022 -187403 -146315 -166321 -164608 -143285
21624 -143285 -65431 -62970 -73902 -41465 -131413 -277101 -216046 -28075 -14594 -42815 148636
21613 148636 286042 312333 269669 274590 89005 -18331 75670 162832 119327 111432 48681
21602 48681 -33328 55573 119014 -56523 -120930 -156029 -89030 -46513 79605 129286 -11195
21591 -11195 -89976 -119789 -80903 17584 -932 -148701 -205800 -97841 -50440 -47025 1496
21580 1496 -65460 18213 213353 141825 139051 78027 -28231 -40146 -100370 -64466 -36498 133655
21568 133655 176112 26645 -30229 58127 130049 55373 -17613 -38633 -77805 -95895 39866
21557 39866 48660 -2638 -26934 12423 -8200 -76849 -74579 -44555 -62676 -41469 50812 -52337
21545e2337n6311L8540J09140N8896R4045k6220K4665L1518M7954L9170q9621
21534B19439q9017R9644K2083j43640p1118R2809q2047q7209l4374Q9848Q7679
21523A04097M5688K6611k2027j14627K0798L3425p0541k3619j8849J0946l1182
21512c9280L2502K4722P2532N820j74020l5215L2123K7079j67017J03968M9331
21501f7455m7803m8381l0750P6461J44279k9139n3979R3546j41427L8911Q0937
21490A5200n5061r169q6707J8981P0341N2102K8130J20n5551P1323o6003j10158
21478a26452L8762J11297R5284P4006l683q5648j31553j0088M6096j2782j6352
21467b1113O1536J30065K7048j79231j3927K6483m5310l9025N2130o599q7689
$$ plain form
21545 -52337 -108648 -70108 39032 97928 191973 165753 190418 221936 269890 309060 219439
21534 219439 130422 230066 252149 108509 37391 130200 48153 -39056 -73430 16418 104097
21523 104097 149785 176396 154369 39742 60540 93965 23424 -195 -19044 -8098 -39280
21512 -39280 -6778 17944 90476 96296 -77724 -112939 -80816 -53737 -220754 -116786 -67455
21501 -67455 -115258 -163639 -194389 -117928 26351 -2788 -56767 36779 -104648 -65737 15200
21490 15200 -39861 -49030 -135737 -116756 -46415 5687 33817 33937 -21614 49709 -16294 -126452
21478 -126452 -87690 23607 118891 192897 189214 103566 -27987 -38075 8021 -4761 -21113
21467 -21113 40423 170488 197536 18305 4378 30861 -14449 -53474 -1344 -7943 -95632
21456i5632o4042J1406P5177J23932M3730r8046K713o5578j7218R9378J9928m0185
21444d437L008m1457O9525P9828Q2210k45758m3300R4229J12369P1468J5932q1967
21432A11650j19287l5727j01953k7871M1320J47749J1363j08357n914P9517P2810
21421F5300m2047P8171J41482k1997r7652j4644k0769k6075J80167j4830j06241
21410A20865j41890J0522L0580Q8568l8167n7008J13431q6139j34696m4795M4375
21399i4354Q666j3193n1201q2991J16464O5437q926m1472r3092Q3314L8226K8529
21387d4593Q5253p248j4468m8118m6888J07997K2506j6179q669K3794q3503p190
21375c7306r891m3176J3548J0798J612K8448L4386K5606M0663M0032J1125j21248
$$ plain form
21456 -95632 -159674 -148268 -73091 50841 94571 -3475 -762 -66340 -83558 15820 35748 -4437
21444 -4437 -1429 -42886 26639 106467 188677 -57081 -100381 -6152 106217 177685 193617 111650
21432 111650 -7637 -43364 -145317 -173188 -131868 15881 27244 -81113 -87027 -7510 65300
21421 65300 23253 101424 242906 220909 123257 108613 87844 61769 241936 227106 120865
21410 120865 -21025 -10503 20077 108645 70478 13470 126901 40762 -93934 -138729 -94354
21399 -94354 -85688 -98881 -150082 -233073 -116609 -51172 -60098 -101570 -194662 -111348 -73122 -44593
21387 -44593 40660 33412 18944 -29174 -76062 31935 54441 38262 29593 53387 -30116 -37306
21375 -37306 -47197 -90373 -76825 -66027 -64415 -35967 -1581 24025 64688 104720 115845 -5403
21363e403l1824j34958R427N8077J8481O8285q2102j0547K0383J25609P5779k622
21351A08585j09098j8349M3294j04292m1699j3160k3703J57143L2432n0591o6823
21340h6261K7093J12926O3013q3010n4128R654r9680J4672m4681j08380O651N4507
21328a87624J13022J74650l1061l3012N4208J8536o6076k2816K9085N1227q3068
21317A7071P917m5049k0864n2052n4311R9385J68263n721K469j262m9707m2855
21305B3284P0100O317L7713J3143j14281j57534j31471M8847P9413m3208m900
21294a72577R6598N9365p9219j4396N0999L212J12177j7073L3217N9963q0659
21283E1607K194l8737l1119N9441m533M8912l6397m5492N8020O964j2482o8983
$$ plain form
21363 -5403 -37227 -172185 -162758 -104681 -86200 -17915 -100017 -110564 -90181 35428 111207 108585
21351 108585 -513 -18862 24432 -79860 -121559 -134719 -158422 -1279 31153 -19438 -86261
21340 -86261 -59168 53758 116771 33761 -20367 -10713 -110393 -95721 -140402 -248782 -242131 -187624
21328 -187624 -74602 100048 68987 35975 90183 108719 42643 19827 48912 100139 17071
21317 17071 24988 -20061 -40925 -92977 -147288 -47903 120360 114639 117108 115846 66139 23284
21305 23284 93384 99701 137414 150557 36276 -121258 -252729 -203882 -124469 -167677 -172577
21294 -172577 -75979 -16614 -95833 -110229 -59230 -56018 56159 39086 72303 132266 51607
21283 51607 53801 15064 -16055 43386 38853 87765 51368 5876 63896 70860 58378 -10605
21271a0605r5935l8513L2689P7908k3984j01662M8998J46051N9207K6057j61423
21260d1212j04739N1506j3532J6595q8837n2798n6388M2786J09630M5722k6227
21249a17494l8828L5620L4957o0672K1127q0353L6517Q6674m6543L6447O6879
21238b5669L5783l1415J7342J27810L6325o0862j7692R6321n7889q7448k3613
21227H993n6003L1675P0415Q0040k5274M1799K2094k750q0835j28884m0850P6721
21215b859J37965N1904m1315j67250L5719o7440o2681o5391o1249R7053m4755
21204a90299L143k2576k4438Q2608J49103j1422q241n2464n6492l1070J01007
21193f1141Q4919J23104p600k2679n1913l5527o6200m9489N0488O0696K6695j09891
$$ plain form
21271 -10605 -106540 -145053 -112364 -34456 -58440 -160102 -111104 34947 94154 120211 -41212
21260 -41212 -145951 -94445 -107977 -91382 -180219 -233017 -289405 -246619 -136989 -91267 -117494
21249 -117494 -156322 -120702 -85745 -146417 -125290 -205643 -169126 -82452 -128995 -92548 -25669
21238 -25669 10114 -21301 -3959 123851 160176 99314 81622 177943 120054 32606 8993
21227 8993 -47010 -15335 55080 135120 109846 151645 173739 170989 90154 -38730 -79580 -2859
21215 -2859 135106 187010 145695 -21555 14164 -53276 -115957 -181348 -242597 -145544 -190299
21204 -190299 -187156 -209732 -234170 -151562 -2459 -13881 -22122 -74586 -131078 -162148 -61141
21193 -61141 23778 146882 139282 116603 64690 29163 -37037 -86526 -36038 24658 51353 -58538
21181e8538k1407R672M1842P1502o1520j75396M4181Q7103l2068o398K6807Q6093
21169A1873r5316r5063P0897n941p6168l3362j30971K6836J96194R9158l8855
21158g0718J30038J11720m6046j53720l0679J06817J5373o2705Q8281M6239j8778
21147A15822o797n9173r5772N5263K1778O3660q9160q148M654j63951j51453K4041
21135b89236P8251P1422Q431P8024M6952R5791k0029m8124J6796O9124j22164
21124a4762q706j0294L3352p5018m7836N3806O1445n129P4164N5223l4014n2798
21112B9433N2441M4126N564q2960l0104j8563Q2973J7999p0242N39M5716j31719
21100e4797j71376Q1097L5273q147j3708Q6114J08808k5210J9946m7992m9931
$$ plain form
21181 -58538 -79945 -70273 -28431 43071 -18449 -193845 -149664 -62561 -94629 -101027 -74220 11873
21169 11873 -83443 -178506 -107609 -113550 -189718 -223080 -354051 -327215 -131021 -31863 -70718
21158 -70718 59320 171040 124994 -28726 -59405 47412 62785 80 88361 134600 115822
21147 115822 109025 49852 -45920 9343 31121 94781 5621 -2527 2127 -161824 -313277 -289236
21135 -289236 -210985 -139563 -131132 -53108 -6156 89635 69606 21482 38278 107402 -14762
21124 -14762 -23468 -33762 -410 -75428 -123264 -69458 -8013 -13142 61022 116245 82231 29433
21112 29433 81874 126000 131564 48604 18500 -63 82910 100909 30667 31206 76922 -54797
21100 -54797 -226173 -145076 -109803 -117950 -131658 -45544 63264 38054 58000 10008 -39923
21089c9923j14273j01625k8362J02513P1110j02054l185J10656J37299m3220j8777
21078b9841n6478p2315K813L3609J24937J47750l3282q6021J3300J31186l4653
21067A41005j15003m3719j38435q5388J21606J83197J05160r1544j5058P6642
21057A38463O3286q6486r6060j38174r7110K3097K19538R9849Q4309l8681j64392
21046G639n3999M788Q6302j9354N334j2725R2053j1609n1417j33441J46620M2691
21034A02882m8463O4754J32328P574o0489j70294l5369m863q4198N2315Q8738
21023D4915m3879O739L7539K3004J9316j1634o6828j15077j0783Q428J31160Q4647
21011A07547J03289K3671R496q7158j03416o0548Q3501N1354j29194j9984K1062
$$ plain form
21089 -39923 -154196 -255821 -284183 -181670 -110560 -212614 -215799 -105143 32156 -11064 -29841
21078 -29841 -86319 -158634 -155821 -122212 2725 150475 117193 31172 44472 175658 141005
21067 141005 26002 -17717 -156152 -241540 -119934 63263 168423 76879 61821 138463
21057 138463 201749 115263 19203 -118971 -216081 -192984 26554 126403 210712 172031 7639
21046 7639 -46360 -41572 44730 25376 30710 17985 110038 98429 47012 -86429 60191 102882
21034 102882 54419 119173 251501 259075 198586 28292 -7077 -11940 -96138 -43823 44915
21023 44915 1036 7775 45314 68318 87634 76000 9172 -105905 -116688 -108260 22900 107547
21011 107547 210836 234507 244003 156845 53429 -7119 76382 127736 -1458 -21442 -380
21000c80J068q2179P209M6670J673k4978J0653K1858O8064q2284R9018n4247k8102
20987a5957M401j7605M4249m0318J13437P5849l9378k6350L2487J5065j85227
20976c9347m3106P8861P9011l7912M8337J6668m6013K7736p7914n7661l3955j51912
20964b37207K5643o996Q9369l6917K3325N9502r3149J21628J09898o013j88734
20953a39651p4383Q246K04181J02682q6132J4972R500r2133L2002P6558j6480
20942C9362J6124O4784j2805j7079J22780k5473M812Q429L1808o1270j27017j21913
20930g7458R1018J14689K0786n3223L6312o1307p509L0638L1526K2309N6627L4523
20918B38931l6428k7865n8670m1333k2553M0029l7326l5966m8559j17850j23215
$$ plain form
21000 -380 688 -81491 -74282 -27612 -25939 -50917 -40264 -18406 49658 -32626 66392 12145 -15957
20987 -15957 -11556 -29161 15088 -25230 88207 164056 124678 98328 130815 145880 -39347
20976 -39347 -82453 -3592 75419 37507 85844 102512 56499 84235 6321 -51340 -85295 -237207
20964 -237207 -211564 -218560 -129191 -166108 -142783 -83281 -176430 -54802 55096 49083 -139651
20953 -139651 -214034 -205788 -1607 101075 14943 29915 39415 -52718 -20716 55842 39362
20942 39362 55486 120270 107465 90386 213166 187693 192505 200934 232742 171472 44455 -77458
20930 -77458 13560 128249 149035 95812 132124 70817 63308 93946 125472 147781 204408 238931
20918 238931 202503 174638 115968 74635 52082 92111 54785 18819 -29740 -147590 -270805
20907b70805m0611J00284L5999M9810K6838n9522N9650K0578m6642J15036P2438
20896F3053l2716L7059M3145J7551Q544l010o6784K3133M0064m9513j83217o8387
20884a71078o9363J63489J68356J717L3801K7534r6088L0077p2522j49470l4141
20873a67688J03856J27320K1964K555k7737P3631n021L5341o1026o2685J2878
20862E3388M317Q526n9861O3908P4722o9058k7544J8741o3751k3916Q3093o4427
20850a862m973m9387o3713O8932p2157l0379Q9090N1636N700R0609l1643n9584
20838g731Q8318j3768N3025l4938j17682j10339L4498N3874K6175k806p3357p0001
20826a74732J5015L4106M7971j03068J30209J54124j14575J5848J37507J75176
$$ plain form
20907 -270805 -311416 -211132 -175133 -125323 -98485 -158007 -98357 -77779 -124421 -9385 63053
20896 63053 30337 67396 110541 128092 136636 133626 66842 89975 130039 80526 -102691 -171078
20884 -171078 -240441 -76952 91404 93121 126922 154456 58368 88445 15923 -133547 -167688
20873 -167688 -63832 63488 85452 88007 60270 133901 128880 164221 103195 40510 53388
20862 53388 57705 66231 6370 70278 145000 75942 48398 67139 3388 -20528 62565 -1862
20850 -1862 -6835 -56222 -119935 -51003 -123160 -153539 -64449 -12813 -7113 83496 51853 -7731
20838 -7731 80587 66819 119844 84906 -32776 -143115 -108617 -54743 -28568 -31374 -104731 -174732
20826 -174732 -159717 -125611 -77640 -180708 -50499 103625 -10950 4898 142405 317581
20816C17581p1244j29608p1148p9941j1956Q8628L0032J6967J8714n2814m229
20805E0982L5199l6136k6987j6022Q3693O6055K4313J8437n0384J2482r0747j8414
20793E2471K3817P6025p8903j12648k5750p3252j3293J74115j8681o1730K6035
20782c1794k7315M8972J22371k0795o607o2512j40371m7067N0865M1221K1161
20771e1871R1265N326K1133R0403l7247j4975R7613j13439p7944Q5693P560j22015
20759a8498r7893P1583M1226K5193J1727J22947l3904K2586n0326l3613J8416
20748G9444j8094o4641K0076J0129Q8174q3592L0607R954L8358j7382J7895R0194
20736B01122q2388p4551J05293J75300J14664j04612k06537q9902r0794m6462
$$ plain form
20816 317581 246337 116729 45581 -34360 -46316 42312 72344 89311 108025 55211 50982
20805 50982 86181 50045 23058 7036 90729 156784 181097 199534 149150 161632 70885 52471
20793 52471 76288 152313 73410 -39238 -64988 -138240 -151533 22582 3901 -57829 -31794
20782 -31794 -59109 -10137 112234 91439 84832 22320 -118051 -165118 -114253 -73032 -51871
20771 -51871 39394 44720 65853 156256 119009 104034 201647 88208 10264 95957 103517 -18498
20759 -18498 -116391 -44808 -3582 21611 33338 156285 122381 144967 94641 61028 79444
20748 79444 61350 -3291 16785 26914 115088 31496 62103 72057 110415 93033 110928 201122
20736 201122 118734 44183 149476 324776 439440 334828 128291 38389 -52405 -98867
20726i8867R3250R830j35726q5198J30028J16630J09239j2824o2732L5840k0568
20715G8902n6662r1657M2594p3165o6066J5559P9702j4138O3142l5545p7330P2889
20703f1775L1716q19M1976J14132P8095o7827k16060p3919K0564J27827N4071
20692D7981n7023n9043J20688N8163J34351R1628m0030k32849m3558O5853j48106
20681f1945n4910J79362L0435M827p7575j22422q7046j8017l0185O709K0580M7106
20669a63081J0061J15111N4969R5430J71303o1026o4903P0581j04688j29475q0074
20658h5792P9210j9167r697N0215r1567m7810m4183L3387M2857J3608q0916N1223
20646a08632J2724J54971J8922m8734J17284O6288O6215j80395p7890K1574k2745
$$ plain form
20726 -98867 -5617 4213 -131513 -216711 -86683 29947 139186 126362 63630 99470 78902
20715 78902 22240 -69417 -26823 -99988 -166054 -150495 -70793 -84931 -21789 -57334 -134664 -61775
20703 -61775 -30059 -30878 11098 125230 203325 135498 -80562 -154481 -133917 -6090 47981
20692 47981 -9042 -68085 52603 110766 245117 336745 296715 63866 20308 86161 -61945
20681 -61945 -116855 62507 92942 97769 20194 -102228 -189274 -207291 -237476 -230767 -210187 -163081
20669 -163081 -153020 -37909 17060 112490 283793 222767 157864 228445 123757 -5718 -85792
20658 -85792 -6582 -25749 -35446 14769 -76798 -124608 -168791 -135404 -92547 -78939 -159855 -108632
20646 -108632 -95908 59063 77985 29251 146535 212823 279038 98643 20753 42327 19582
20635A9582j51669j6944J4170k0898Q7184Q6956M9718n1148q5170k4315J8337
20624g4197J30065O8630L2352p2680k6702M8004l3520k1134n4865L2884P5454
20613A04291j02922J0767J15772J66393r6313L6528k1357m5612l04703p7599P9316
20602a35439J11332R2684P9054J0k19880n1557q4935O2555J25536K4291O8420
20591G2071j52930p1246N3688m5836J3541m3567L5246M185P1288K6975J10471
20580G3886Q7304O13N8334K9342r1539q4046r3829m1659O240O5859M2598p2953
20568a9850L6057n365r637j34075m5093J02483L4854l0852K7078J20517R175k6215
20556E9077m5392P7102J05153K2958n3568n5516M5255J0982q9860K6372j7714
$$ plain form
20635 19582 -132087 -149031 -134861 -155759 -68575 18381 68099 16951 -68219 -92534 -74197
20624 -74197 55868 124498 156850 84170 57468 105472 71952 50818 -4047 28837 104291
20613 104291 1369 12136 127908 294301 197988 234516 213159 167547 -137156 -214755 -135439
20602 -135439 -24107 68577 147631 147641 -72239 -123796 -208731 -146176 -20640 3651 72071
20591 72071 -80859 -152105 -98417 -144253 -130712 -174279 -139033 -134848 -63560 -36585 73886
20580 73886 161190 161803 220137 249479 157940 73894 -19935 -61594 -55354 10505 53103 -19850
20568 -19850 16207 10842 1205 -132870 -177963 -75480 -40626 -71478 -44400 76117 85292 59077
20556 59077 13685 90787 195940 218898 165330 109814 155069 166051 76191 102563 84849
20545H4849K03379j2588j23922Q9496M340l1939j40179p3417j0950K7479R810
20534B6358N9166m932M4168O2737j4443l1187q3154j22243m5492L4534P9320M8904
20522E3736P657L4158l9602O5574J03872R9432k4325j58509J2777n0612J8410
20511A22568j581m0606j21836j8200o1575N3736N4865n6374L9372l006k156J25469
20499I0676k6254m8933l7141J3374K2612O0421R4152J0066J0448K1741J1074o9361
20487A52875o3401K5379r9699q5640K8266k8729J40121J5941N5917P5050J6833
20476B32913q745j14636p6842P6138J74476j4016j74572m6177j0817Q097j2652
20465C3167p4700Q9163K8251K0265K1009Q5069p1498m7609K5048j0136q992j1224
$$ plain form
20545 84849 288228 275640 151718 241214 245554 213615 73436 19 -10931 16548 26358
20534 26358 85524 80592 124760 187497 173054 141867 58713 -63530 -109022 -74488 4832 53736
20522 53736 61393 95551 55949 121523 225395 324827 300502 141993 154770 104158 122568
20511 122568 120987 80381 -41455 -59655 -121230 -67494 -12629 -69003 -29631 -32637 -34793 90676
20499 90676 64422 15489 -21652 -8278 14334 74755 168907 178973 189421 211162 222236 152875
20487 152875 89474 114853 15154 -70486 -42220 -70949 69172 85113 141030 216080 232913
20476 232913 224168 109532 32690 108828 283304 269288 94716 48539 37722 45819 33167
20465 33167 -41533 47630 75881 96146 117155 202224 130726 83117 108165 98029 89037 77813
20453G7813N0073N7804k6549q7945K5143P990j08207r3215J0796N6657O779l9128
20441f1989O3500J40130m1603J8915q909N408J7167o4488l7209K8343R9251K0361
20429A78877m9604l4589l9166r1204j33591J18196J00902P4297J925k3835n0507
20418E1701j19860O790Q6063L5032k0955J6316M3122l071L7238J8278L3392J4604
20406A98650j5886r0132k5631o5242m082n4081L4563j5009j9782j10524J44776
20395b2380K25862J18070o5282j08423j30073j99842M1914N4031j4610p817P1445
20384c7105j33896j8919J69797N3133O1777L9734k8888M166o7870M2059n7033
20373B6955k2528J08875j2616j0224R044q5534j34410J885R7787R7361L988m6136
$$ plain form
20453 77813 127886 185690 159141 71196 96339 104329 -3878 -97093 -86297 -29640 -22861 -61989
20441 -61989 1511 141641 100038 118953 110044 115452 132619 68131 30922 59265 158516 178877
20429 178877 129273 94684 55518 -35686 -169277 -51081 49821 124118 126043 102208 51701
20418 51701 -68159 -61369 24694 59726 38771 55087 98209 95138 132376 150654 184046 198650
20406 198650 182764 92632 67001 1759 -2323 -56404 -21841 -36850 -56632 -167156 -22380
20395 -22380 203482 321552 256270 147847 17774 -182068 -140154 -86123 -100733 -108550 -37105
20384 -37105 -171001 -189920 -20123 33010 94787 134521 105633 109799 41929 83988 26955
20373 26955 4427 113302 100686 90462 99506 13972 -120438 -118553 -20766 76595 80583 34447
20361C4447O554j5411k1858P6869k1341l1567P3580J02495r076N4245j51241j63315
20349f5619n3454Q2621J4836n8139o9596k8123o204P5479N7006l4719N8123J06896
20337G9107J14895j8432q8897N9619J59009k791q9124L6473J44244m0582k21201
20326A32320l415l1740J4234j0169L5189O5657j13890J3017R7789L5874l648q5854
20314A45364J5973M7741M4212o736K3774Q8344L8852N4394j05235q4452j64099
20303I8132j49126K8195P3275J54807R1249r4604j70408n9865Q7962J50580k0856
20292A89341j06023m8988k9714l1050L4670l752J55378J47936Q9753l8439j77511
20281A81601k38466p254P1010Q0496m3802l967p4256N4650J20952K8942N6845
$$ plain form
20361 34447 41001 25590 3732 80601 59260 27693 101273 203768 194692 248937 97696 -65619
20349 -65619 -119073 -36452 -21616 -79755 -149351 -177474 -183678 -108199 -51193 -85912 -27789 79107
20337 79107 194002 175570 86673 146292 305301 302510 213386 249859 394103 353521 132320
20326 132320 128905 97165 111399 101230 136419 202076 88186 101203 198992 234866 231218 145364
20314 145364 161337 209078 253290 246554 270328 358672 397524 451918 346683 262231 98132
20303 98132 -50994 -22799 50476 205283 296532 201928 31520 -28345 59617 210197 189341
20292 189341 83318 34330 4616 -26434 8236 4484 159862 307798 397551 359112 181601
20281 181601 -56865 -64119 6891 87387 43585 39618 -34638 20012 140964 169906 226751
20270B26751K1637r0742j17658J596J74773P7355m1128n8592m0893O3550O0276
20259B76925N9451p5571j19534o1715m7622P3067O2871r8640Q202N7251L1293
20248A65978j714K7170M0553q2092J00636P3016p686o0748o5163r359L4855j06531
20236A08915j42761N3619M2263k2000K1023j9272O5378Q7736Q114j6877k8658
20225A57480l0142n742k2132o182R504K968J06376l9102L3781Q029o2405M5724
20213A98157j9184L675J9392O2924M13j1318p7971K7500Q8502r162k3919k9144
20201B29865L2552K09086K22812m9386j29755l9645Q9208R1243J6868r0674J4600
20190E96774j4090m4041L0447O1022N8146N691J1337m35O7419O9157M775p857
$$ plain form
20270 226751 248388 157646 39988 41584 216357 293712 252584 193992 153099 216649 276925
20259 276925 336376 260805 141271 79556 31934 105001 167872 69232 77434 134685 165978
20248 165978 164264 191434 231987 149895 250531 323547 315861 255113 189950 180591 215446 108915
20236 108915 -33846 19773 62036 40036 61059 41787 107165 194901 203015 186138 157480
20225 157480 127338 121596 99464 93282 102786 105754 212130 173028 206809 214838 152433 198157
20213 198157 178973 182648 202040 264964 265377 254059 176088 203588 292090 282928 259009 229865
20201 229865 262417 471503 694315 644929 515174 475529 564737 655980 672848 582174 596774
20190 596774 582684 538643 569090 630112 688258 693949 705286 704851 772270 841427 846202 838345
20178H38345q0663n7870L2764j07872k00670j15245l292J23779J83322J06311
20168G18909j0013n4568m3556O1429O9084O865L3391K7317J9057l5969j28143
20157F63803r3446k8716L3941J04380Q4023P8985r5736j6229O19r6328P878j3316
20145F29858n8796j40798o3832j32843P6739j2314k2817K3264j6154M6773n8160
20134B70920r3405j07063j08603R6486K2582J4299m0973Q3713K3889M1744l77
20123B03212m63l4662K8217j9803k2315p2162J0622K3205q9593n849L2425p002
20111D5832P8719P9040o6776n0830P2555O8844J9777m3204j4537L9975j60394
20100F9001j72046J56623L7145N1933J22949J8766l3567k286K154o3277j0340
$$ plain form
20178 838345 757682 699812 732576 624704 424034 308789 305497 429276 612598 718909
20168 718909 708896 654328 610772 672201 741285 748150 781541 808858 827915 791946 663803
20157 663803 570357 541641 575582 679962 763985 842970 747234 731005 731624 635296 643174 629858
20145 629858 571062 430264 366432 233589 310328 298014 275197 298461 282307 329080 270920
20134 270920 177515 70452 -38151 58335 80917 95216 54243 137956 161845 203589 203212
20123 203212 202749 168087 196304 176501 154186 82024 92646 115851 26258 20409 52834 45832
20111 45832 124551 203591 136815 85985 158540 227384 247161 203957 189420 229395 69001
20100 69001 -103045 53578 90723 142656 265605 284371 250804 248518 250672 187395 177055
20089A77055L0027k398R3206j04488k05466j24841J12492O7803J04103m0200Q2096
20078A89389k3036J26654p3847q9355J7791J09390N8554k5740J0276j0250l179
20067B86647j25173J9368J51741k948j33617l6695P0606M128k7042p9169k9840
20056I8006J41743Q2911j20225J944R4443q8737L2665M5651m2103q8985N0175
20045B07488Q0986q6766m4445o6516m0160K4531j04368o2494O0984L8709j180
20034F769J26293K07278L7867m0018p545p1123r1194O31O1952M8674j1348L103
20022B71339N0357M677K6875P5595p2024r1009Q2821l7754j08338q6538L0710
20011A46711N5996Q4139j18358q0185j6903m1506o1933R2552J20654r2330o2412
$$ plain form
20089 177055 207082 204684 297890 193402 -12064 -136905 -24413 43390 147493 107293 189389
20078 189389 166353 293007 219160 129805 147596 256986 315540 289800 300076 289826 286647
20067 286647 161474 180842 332583 329635 196018 159323 229929 234057 207015 127846 98006
20056 98006 239749 322660 202435 204379 298822 210085 242750 288401 246298 157313 207488
20045 207488 288474 201708 157263 90747 50587 75118 -29250 -91744 -30760 7949 6769
20034 6769 133062 340340 378207 338189 330644 259521 168327 168958 230910 279584 268236 271339
20022 271339 321696 326373 353248 428843 356819 265810 348631 310877 202539 116001 146711
20011 146711 202707 286846 168488 88303 71400 29894 -32039 60513 181167 88837 26425
20000B6425k851Q5478J7041L5453j1543j17562j712O68J9725N7054Q2165l3347
19988A56994o5595j5991J4340J20567K4910Q017O4299O521q7038l6412O4684n1705
19976B03591j06172o5822o3211k888J6776M6861J60260N2672n8847j6894J1982
19965A78308O5804R6781L7362N2328m2976K3451O5490L9998o0185j64148r2075
19954B00138m288M6437O4368o2663l6450J23883M2259q4322j9709M9167j22280
19943A96540j62241n7624R8093J06694N4918N6835m6052l9706o4981p2269R0334
19932A60541R8388K1292n6198j05154M1594O3096J31052N1066p7289l5067J3883
19921C07204Q9470k3189j04429o691j1871R8036l1032O805J18721m7016o6334
$$ plain form
20000 26425 23574 109052 126093 161546 150003 32441 30729 31397 51122 108176 190341 156994
19988 156994 91399 75408 89748 210315 235225 243242 307541 314062 227024 190612 255296 203591
19976 203591 97419 31597 -31614 -34502 -17726 29135 189395 242067 183220 166326 178308
19965 178308 244112 340893 378255 430583 387607 411058 476548 516546 456361 292213 200138
19954 200138 195850 242287 306655 243992 207542 331425 373684 289362 269653 318820 196540
19943 196540 34299 -23325 74768 181462 236380 293215 247163 207457 142476 70207 160541
19932 160541 258929 280221 224023 118869 160463 223559 354611 405677 328388 293321 307204
19921 307204 396674 373485 269056 262365 250494 348530 317498 324303 443024 396008 329674
19910C29674j0681M663j06223k4405L3519P6086L7728j946p5728M6276O6953K791
19898C78707r67p6063j6264k6645l112m1981m0037J08033J00496n9013L6537P3895
19886D33586k2763r876N6673m2241r2929r4157L4876Q6477J6072j17128j04829
19875A43761K1711O286o2357J30064P2724l694K5029Q2067M2359K1700o1812q3993
19863C33845j16501k3154Q3527M5901r6596j25926P4398m5150Q8264J46227L2085
19852C96920j09415K5763J09680O0729j7038l5026K2749P6727j26149j47736N5438
19841C12642J96870p9413n4277l3068M5058L8148o2683O7946P842n7158l2342
19830C49565O748J25162K594j12544o7827J8844P5318m3892m5316m1936J53472
$$ plain form
19910 329674 318993 323656 217433 193028 226547 302633 340361 338415 262687 308963 375916 378707
19898 378707 377740 301677 285413 258768 255656 213675 173638 281671 382167 323154 359691 433586
19886 433586 410823 400947 457620 415379 322450 228293 263169 349646 365718 248590 143761
19875 143761 165472 171758 109401 239465 312189 308495 333524 415591 457950 479650 417838 333845
19863 333845 217344 194190 277717 323618 227022 101096 175494 130344 218608 364835 396920
19852 396920 287505 313268 422948 483677 466639 431613 454362 531089 404940 257204 312642
19841 312642 509512 430099 375822 342754 387812 425960 363277 431223 439065 381907 349565
19830 349565 356313 481475 484069 371525 303698 322542 397860 353968 308652 266716 420188
19819D20188J92826J08899P1995m0733q8540L4722N5648J96146N4562j2234J01941
19808A095420J19288l7906r4291l9719N0734Q106l8703k7926J16002J3957n2818
19797A112144K7779J09991k8846j03976P619l0476q2651P0340O455j07579R5254
19786A076054M4273K2822q3856J990o134j38684n7812j1849n3587q3252j45358
19775E64607m2684J01671Q2612J38145N1362l9348P6956l4181j03595k0531K5205
19764H00219J45953m4156m2848M9802n1202q3091J94609L54818J36595k6790L6109
19753A470018J06439N1075P3513J5882R3098o4424p9350q8946k9016j80670M9827
19742A417446P3964L4247K1333N9077j35527p3119p2685p1665o6908m0425M7261
$$ plain form
19819 420188 613014 721913 793908 753175 664635 699357 755005 951151 1005713 993479 1095420
19808 1095420 1214708 1176802 1082511 1042792 1093526 1101632 1062929 1035003 1151005 1164962 1112144
19797 1112144 1139923 1249914 1221068 1117092 1124711 1094235 1011584 1081924 1088379 980800 1076054
19786 1076054 1120327 1143149 1059293 1061283 1055149 916465 858653 846804 793217 709965 564607
19775 564607 521923 623594 706206 844351 895713 856365 933321 899140 795545 775014 800219
19764 800219 946172 902016 859168 908970 857768 774677 969286 1324104 1460699 1433909 1470018
19753 1470018 1576457 1627532 1701045 1716927 1810025 1745601 1666251 1577305 1548289 1367619 1417446
19742 1417446 1491410 1525657 1546990 1606067 1470540 1397421 1324736 1253071 1186163 1145738 1192999
19731A192999Q5178K5444j10626j15833m2254m3502N061N9729K609P8928j2651
19720A125082j10308J8486O9613J24908R7842j32691l4380J2885M1613k2663J05170
19709A295557l6210n9115n2490R7229K9551O9472M6382J918K3781K2831M3793
19698A482699Q1248l0850p0872m7560P4954m0644m9637p9029o1706m9320J82551
19687A391834N9793n103k1748l0313O9652J39072J28044K2667l250O8535N7334
19676A876517K6559M5716K1786J37211K08766J82415J21811R6223J04598J60010
19666B981612J72796N4024K7530Q7753J60472J12508K07877K20004P1089J98227
19656D293892L79704K82441L23089K16179J09585L23130J77360J22070J89267
$$ plain form
19731 1192999 1278177 1303621 1192995 1077162 1034908 991406 996467 1056196 1058805 1137733 1125082
19720 1125082 1014774 1033260 1102873 1227781 1325623 1192932 1158552 1171437 1213050 1190387 1295557
19709 1295557 1259347 1200232 1147742 1244971 1274522 1343994 1390376 1392294 1416075 1438906 1482699
19698 1482699 1563947 1533097 1462225 1414665 1489619 1448975 1399338 1320309 1258603 1209283 1391834
19687 1391834 1451627 1446524 1424776 1394463 1464115 1603187 1731231 1753898 1750648 1819183 1876517
19676 1876517 1903076 1948792 1970578 2107789 2316555 2498970 2620781 2717004 2821602 2981612
19666 2981612 3154408 3208432 3235962 3323715 3484187 3596695 3804572 4024576 4095665 4293892
19656 4293892 4673596 4956037 5279126 5495305 5604890 5928020 6105380 6227450 6416717
19647F416717L01319M96582M81907N23159N50941Q44106R06567J138244J521968
19638A3181510J903203K596026L707194N072169O973120Q723785Q757723Q028043
19630E8942773Q562167R523723P219273J351013k718330j736069P17823M73118
19622H2335491k784350l263451M75615L078795L908813N708339P358801M559806
19614A01377859k559440o200929m447820k268509m179414r147799j0728511p799081
19606E4046356m173643j194074J633827M343636O971679P773414P099633P540055
19598H4040883Q845089P949863K356062l188777l145455j16221L75744l318686
19590I3798502n382302j938307J737847K962617M547150O588627N040407j354124
$$ plain form
19647 6416717 6718036 7214618 7696525 8219684 8770625 9614731 10521298 11659542 13181510
19638 13181510 15084713 17680739 21387933 26460102 33433222 42157007 50914730 58942773
19630 58942773 67504940 77028663 84247936 85598949 82880619 81144550 81862373 82335491
19622 82335491 79551141 76287690 76763305 79842100 83750913 89459252 96818053 101377859
19614 101377859 98818419 92617490 88169670 85901161 81721747 72573948 61845437 54046356
19606 54046356 49872713 48678639 50312466 54656102 61627781 69401195 76500828 84040883
19598 84040883 92885972 100835835 103191897 100003120 96857665 96741444 97117188 93798502
19590 93798502 88416200 86477893 88215740 91178357 95725507 102314134 107354541 106000417
19582A06000417o555612o086442l576011m555298r638412j2913921j1193218p750474
19574D3731029n139066l544796k771160k201732j780394j475724j275373j321264
19566B4221520j019397q34550p28124o83109o78853o24071n38894m00017n49108
19557A8165397o55695n51930l56202m07268n91602n03082m28268m00766l96568
19548A3874016k78386l04167l64264k42872l19929m08468k16792k12613k60057
19539A1266468l93493m47768k90751k90872l13809k38863k09354j62447k76908
19530H642203k20991j04336j23824j33454j61688k76632k22359j13190j11754
19521G173975r8883j48784j22429o2927j04623j36206j74532j14216j11912j01050
$$ plain form
19582 106000417 99444805 93358363 89782352 85227054 75588642 62674721 51481503 43731029
19574 43731029 38591963 35047167 32276007 30074275 28293881 26818157 25542784 24221520
19566 24221520 23202123 22367573 21639449 20956340 20277487 19653416 19114522 18714505 18165397
19557 18165397 17509702 16957772 16601570 16194302 15602700 15099618 14671350 14270584 13874016
19548 13874016 13595630 13291463 12927199 12684327 12364398 11955930 11739138 11526525 11266468
19539 11266468 10872975 10425207 10134456 9843584 9529775 9290912 9081558 8919111 8642203
19530 8642203 8421212 8316876 8193052 8059598 7897910 7621278 7398919 7285729 7173975
19521 7173975 7075092 6926308 6803879 6740952 6636329 6500123 6325591 6211375 6099463 5998413
19511E998413q7054m0617j20326q8547K763j09442k39935j13773j00380l4258
19501E066844j13785j12756j56296K1607o2651p8502p6034k10325k13926j07847
19491C956329N4633J29156m1781p9658j40775J414j03489j29298l0313m1592Q698
19480C583324M1556l443j33801o4324J03878k1611k25939l7414J65241j02574
19470C304893o8673p8135j02804R1447J22812m8285n0643m3767j14197j13705
19460B898943K0581j99576k21275p3182k6690M5322J30548r0225q0208q564l0662
19449B365012l4077l5760l2102M9295K4285M8147j13550m5777N975L5905L4434
19438B301787j35717n2504k5198n5725N0669Q747p7511L4759M6935P1351Q807
$$ plain form
19511 5998413 5911359 5870742 5750416 5661869 5664632 5555190 5315255 5201482 5101102 5066844
19501 5066844 4953059 4840303 4684007 4705614 4642963 4564461 4488427 4278102 4064176 3956329
19491 3956329 4010962 4140118 4098337 4018679 3877904 3879318 3775829 3646531 3616218 3574626 3583324
19480 3583324 3624880 3621437 3487636 3423312 3527190 3505579 3279640 3242226 3407467 3304893
19470 3304893 3236220 3158085 3055281 3146728 3269540 3221255 3170612 3126845 3012648 2898943
19460 2898943 2919524 2719948 2498673 2425491 2398801 2444123 2574671 2484446 2404238 2395674 2365012
19449 2365012 2330935 2295175 2263073 2312368 2336653 2384800 2271250 2225473 2231448 2267353 2301787
19438 2301787 2166070 2113566 2088368 2032643 2083312 2092059 2014548 2049307 2096242 2167593 2176400
19427B176400j25212j40366j50327j0340K4100J3019Q4316j0040M3603J27683
19417B032836M7572Q7784M1740L2626m4723O2984N0687M9782k7625k6364j28172
19406B179127j26715q1883o5615L0343R3510J66621N8200q0291j26331k0166j0027
19395B016773k7153J7349m692o8622l0324r0590L4616L1892J03771J33734J66645
19384B283399r9449j52292j55071j14236o8425Q434Q7138J39694P8901j52023
19374A856070q975K27616J26684j536m6651M2629n8127J0329P3531L5252L5803
19363B292625J46409J01427N8076J3707n1807l849J45870Q7709M3652J07736k6111
19352B915444k37285m7360J19O1828M91N4607P1313J05624R8778J14048J05313
$$ plain form
19427 2176400 2051188 1910822 1760495 1750155 1774255 1787274 1871590 1861550 1905153 2032836
19417 2032836 2080408 2168192 2209932 2242558 2197835 2260819 2311506 2361288 2333663 2307299 2179127
19406 2179127 2052412 1970529 1904914 1935257 2028767 2195388 2253588 2173297 2046966 2026800 2016773
19395 2016773 1989620 2006969 2002277 1933655 1903331 1812741 1847357 1879249 1983020 2116754 2283399
19384 2283399 2183950 2031658 1876587 1762351 1693926 1702360 1789498 1929192 2008093 1856070
19374 1856070 1847095 2074711 2201395 2199859 2153208 2195837 2137710 2148039 2221570 2256822 2292625
19363 2292625 2439034 2540461 2598537 2612244 2560437 2556588 2702458 2790167 2833819 2941555 2915444
19352 2915444 2678159 2630799 2630918 2692746 2693237 2747844 2819157 2924781 3023559 3137607 3242920
19341C242920R3116J84137J69232P7388L7272L5650J57617J67187J95884K8903
19331D389306K06170J54167K39146L09197O7752K15432M35956L83115N04479N35564
19321G440284N24509N46652N02357L30159L70262M33036N82963P01533J008473
19312A2440228J254456J671847K193441L034494L687479L914368L544726L219329
19304C4960368K878632J879972K9868r16799n92731P57652K445638M057380O195319
19295E1695299R198914J3539666J9873987K8071630L5135445L5498702L1131865
19288B24145508K8918882K3640439N248558k0315652l3007836l3103766l0802423
19281A64723710k6426763j7898867q977589k379177J294867J698119Q27784j79505
$$ plain form
19341 3242920 3336036 3520173 3689405 3766793 3804065 3839715 3997332 4164519 4360403 4389306
19331 4389306 4595476 4749643 4988789 5297986 5365738 5581170 6017126 6400241 6904720 7440284
19321 7440284 7964793 8511445 9013802 9343961 9714223 10147259 10730222 11431755 12440228
19312 12440228 13694684 15366531 17559972 20594466 24281945 28196313 31741039 34960368
19304 34960368 37839000 39718972 39748840 38832041 38239310 38996962 41442600 45499980 51695299
19295 51695299 60894213 74433879 94307866 122379496 157514941 193013643 224145508
19288 224145508 253064390 276704829 281953387 261637735 228629899 195526133 164723710
19281 164723710 138296947 120398080 111420491 109041314 110336181 112034300 112862084 112682579
19273A12682579l061619q216099j2339280j2379060r895988p080033m934720l577563
19265E1198217k545394j846704j440784j044690q91331o03837l30942j84022J35664
19256D2446177O45840J006578J499830K164659L244904M668302O645534Q886069
19248G1207893J0409462J0478082R274886Q014374O395712K481839j918538k662755
19240A13680955J402795Q590683J7189879K4891161L1253406L6905404L7992314
19233B71906597K8201754J2188050J51669j1597292l2002804n0200835m8372563
19226A70274576l4698686k2787750j4974393r998350o579168m231377k454402
19219G4550450q45050L74078M11241N1403m38542q85957k083283m421880n496645
$$ plain form
19273 112682579 109620960 101404861 89065581 76686521 66790533 59710500 54775780 51198217
19265 51198217 48652823 46806119 45365335 44320645 43429314 42825477 42494535 42310513 42446177
19256 42446177 43092017 44098595 45598425 47763084 51007988 55676290 62321824 71207893
19248 71207893 81617355 92095437 101370323 109384697 115780409 118262248 116343710 113680955
19240 113680955 115083750 123674433 140864312 165755473 197008879 233914283 271906597
19233 271906597 300108351 312296401 312448070 300850778 268847974 218647139 170274576
19226 170274576 135575890 112788140 97813747 87815397 81236229 77004852 74550450
19219 74550450 73705400 74079478 74490719 74542122 74103580 73217623 71134340 66712460 61215815
19210F1215815m759416l497183k077427r58563K55358J820628L783953O004987
19202F1788152P102245N528691L585044L397325K269195l570679j0007993j0049517
19194F0042463o286440k869295k89710K247336M816871O142950M587122K765930
19186G1157227K846384J515673m940832j0878093r983416o665860m305929l079280
19178C5665874k120601j454260j177868j070514p65917o12317m42718m20453k98912
19169B7302314k30115q7096J701P2245L32862N87451Q88994J201868J757361K825155
19159C4652740M189970O142872Q547307R651433P782385O551944P739833P283429
19151I2541913K489888k252847k357063k67120K548715M333058J868707k514652
$$ plain form
19210 61215815 56456399 52959216 50881789 49923226 50178584 51999212 55783165 61788152
19202 61788152 68890397 74419088 78004132 81401457 83670652 80099973 70091980 60042463
19194 60042463 53756023 50886728 50597018 52844354 57661225 63804175 68391297 71157227
19186 71157227 74003611 75519284 70578452 59700359 49716943 43051083 38745154 35665874
19178 35665874 33545273 32091013 30913145 29842631 29076714 28464397 28021679 27601226 27302314
19169 27302314 27072199 26985103 26986804 27059049 27391911 27979362 28868356 30070224 31827585 34652740
19159 34652740 38842710 44985582 53532889 63184322 70966707 77518651 85258484 92541913
19151 92541913 95031801 92778954 90421891 90154771 92703486 97036544 98905251 96390599
19143I6390599l407267j870897K91555K924013L051481o35819l702795l957155
19135H9083715k923554q69890n58604n385998j1811303j2277798q607179n448408
19127D1200981l727341k594653j932202j685278j378824r81220p93393q37416
19119B7270654o76325n85601n64357l72587l07561n2532J90936J99819M53541
19110B5555987Q68823J324525K109626L465038N285082P931255R506381P647738
19102F3694455M970239M864720L874417k989863j1332919j1724150p196207k968844
19094D1191848Q9347L015844N902391P450986N775142L543155L440071K029836
19086G2438620m766347j2154394j2081479q123905m973997l344849k277167j803092
$$ plain form
19143 96390599 92983332 91112435 91403990 94328003 97379484 96743665 93040870 89083715
19135 89083715 86160161 85290271 84731667 79345669 67534366 55256568 46649389 41200981
19127 41200981 37473640 34878987 32946785 31261507 29882683 28901463 28108070 27270654
19119 27270654 26594329 26008728 25444371 25071784 24764223 24711691 24902627 25102446 25555987
19110 25555987 26424810 27749335 29858961 33323999 38609081 46540336 56046717 63694455
19102 63694455 68664694 73529414 77403831 74413968 63081049 51356899 44160692 41191848
19094 41191848 41281195 44297039 50199430 57650416 63425558 66968713 70408784 72438620
19086 72438620 67672273 55517879 43436400 35312495 30338498 26993649 24716482 22913390
19078B2913390j553363j206572r52418q48905p34610m47736m70468n12789m91537
19069A5694992m91016o01441m30826l16241l29414m48141k77364k83056l18478
19060A2199015k53975k61969k62480j40914k10465k40726l28100k78058l42198
19051I880130j68801q4666j41097j71638j46906j92233k73738k47364k07288j87289
19041H059110r5549j71539k13156j25104j44744o7638l0598m0974j55642j46041
19031F868125k13856j21329m0466l6217j31753k3347j55167j61896K2974K4626
19021F031694j12414j61824j38411o4745q3242r9581p2665l6366j2232j42781
19011E107433o2746k7929j20804j26713q0616j44548q9052r305O771j91051k68403
$$ plain form
19078 22913390 21360027 20153455 19201037 18352132 17617522 17169786 16699318 16186529 15694992
19069 15694992 15203976 14602535 14171709 13855468 13526054 13077913 12800549 12517493 12199015
19060 12199015 11945040 11683071 11420591 11279677 11069212 10828486 10500386 10222328 9880130
19051 9880130 9711329 9626663 9485566 9313928 9167022 8974789 8701051 8453687 8246399 8059110
19041 8059110 7963561 7792022 7578866 7453762 7309018 7241380 7210782 7169808 7014166 6868125
19031 6868125 6654269 6532940 6492474 6456257 6324504 6301157 6145990 5984094 6007068 6031694
19021 6031694 5919280 5757456 5619045 5554300 5471058 5371477 5298812 5262446 5250214 5107433
19011 5107433 5044687 5016758 4895954 4769241 4688625 4544077 4455025 4445720 4452491 4261440 3993037
19000C993037j048p284n0495j17181n1587j19823k0779n2520j50701j43466K8364
18989C306517J01464q4010j38216j79748j16300m6221r110R5481k5350j57684
18979B746823L7428J27197L641m4476n3198M9231J2772j11837k47300j67237P7461
18968B430505P5921j42765K291q1958j32893o9120o9552J41248J30833K809n4521
18957B232798j10468j8042q7592j62294L51L8734j6808k1499o2916M7724j4465
18946A825523L3033o0969Q2340L3919k64p306L653j7940O7996p9719j42745r7463
18934A640058N7156r706j29578J6335K8660l8867q0441j31233j51657K3962o3378
18923A161311M4498N1638O3815o6286O0149k7687m2326j44957l0463o873p0766
$$ plain form
19000 3993037 3991989 3984705 3934210 3817029 3765442 3645619 3624840 3572320 3421619 3278153 3306517
18989 3306517 3407981 3323971 3185755 3006007 2889707 2843486 2834376 2929857 2904507 2746823
18979 2746823 2784251 2911448 2915089 2870613 2817415 2866646 2879418 2767581 2520281 2353044 2430505
18968 2430505 2506426 2363661 2365952 2283994 2151101 2081981 2012429 2153677 2284510 2287319 2232798
18957 2232798 2122330 2104288 2016696 1854402 1854753 1893487 1876679 1855180 1792264 1839988 1825523
18946 1825523 1858556 1797587 1879927 1913846 1913582 1906276 1909929 1891989 1959985 1880266 1737521 1640058
18934 1640058 1697214 1687508 1557930 1574265 1602925 1564058 1483617 1352384 1200727 1224689 1161311
18923 1161311 1205809 1257447 1321262 1254976 1315125 1287438 1245112 1100155 1069692 1062819 992053
18912I92053N7182L0578j47063k6260J2090N9858K13958Q6584m1486k2023q6988
18901A128483j0809l8307r4147r6787j889k3227L6627j447J795R5604L6729O4494
18889A097119l7363q2541k6625P526J6591q5656p6500j221K07817K8442p8164
18878I69425r1615r9709o5406J43339Q2182p1801J5179m2440K6548l9876j24957
18867G00869R0117r7945k46035K1924m1272q1194O0360J03549j7534J56607J61417
18856H10863O599j8389j64397k1850L695m6303p7820J2005K4859K6101N9632o2752
18844E52243N5879J29960m9631J735N5515p3850l8345j21187J0428J54933o7781
18833F09899q3992o9838p2784J3942O4072J26266j83907j32959l0843J01446K56389
$$ plain form
18912 992053 1049235 1079813 932750 906490 918580 978438 1192396 1278980 1237494 1215471 1128483
18901 1128483 1117674 1079367 985220 888433 886544 863317 899944 898497 900292 995896 1032625 1097119
18889 1097119 1059756 977215 950590 958116 974707 889051 812551 811330 1019147 1047589 969425
18878 969425 877810 778101 712695 856034 938216 866415 881594 839154 865702 825826 700869
18867 700869 790986 693041 447006 468930 427658 346464 406824 510373 492839 649446 810863
18856 810863 817462 799073 634676 612826 616521 570218 492398 504403 529262 555363 614995 552243
18844 552243 608122 738082 688451 690186 745701 671851 633506 512319 522747 677680 609899
18833 609899 525907 456069 383285 397227 461299 587565 403658 270699 239856 341302 597691
18822E97691R9237n4462m2706j13750o7187J09712J0040n3425n382N2744j26811
18811D05701l9067P122K6510k2517P8763m7881k8244O5693r7142q0965R9512j4904
18799C52581p5366M1688o1123M5799M3490O7831K6994J49690J7913q7943Q1610
18788F03164m1369p1294q2248p4784k7224J65785J07749m7594P4146J169J55206
18777G62706R1645L0346k2988o9602r7588p393R7952J11749p259k3776K7465Q0716
18765I73973P927L1804L4730l1385j37219j5171Q5346k6582k4096M0530p2166
18754H67691k8198k4462M3712j01926j02377N5114N7622q7198q391j00401R645
18743E80831P1480j25634n3284K0618J09186J89201j11179r3241M8533J07740
$$ plain form
18822 597691 696928 642466 599760 486010 418823 528535 538575 485150 479768 532512 405701
18811 405701 366634 373756 400266 377749 456512 408631 380387 446080 348938 267973 367485 352581
18799 352581 277215 318903 257780 303579 347069 414900 441894 591584 609497 521554 603164
18788 603164 561795 490501 408253 333469 306245 472030 579779 532185 606331 607500 762706
18777 762706 854351 884697 861709 792107 694519 687126 785078 896827 889568 865792 893257 973973
18765 973973 981900 1013704 1048434 1017049 879830 864659 950005 923423 899327 939857 867691
18754 867691 839493 815031 858743 756817 654440 709554 767176 679978 671587 571186 580831
18743 580831 652311 526677 473393 494011 603197 792398 681219 587978 636511 744251
18733G44251r339l406o2490N8024K3847p0540J45459Q0026j1744k152n8282M6072
18721H79726L4602N5329J08483K40452O9626o2209o6088l7393j70227r6446j65980
18710G89875m3822R3646L1071O6215Q4288J68504J57610p5928j48692j56969j1482
18699I54316N5205M5018o4374k49116q4940L3225o7848p3293j9188l7003p9604
18688D12398P2047j01889m1276K6357N7487J96857L9707p9362m0267J07271P4228
18677G23558j07378k7291m9019R403j4831k9828O4205n4703r3040l8364M0497
18666D23209J492N1394L0413J5917P1439l1386J92r3835j23222r976p9917o2468
18654A93252N6285O2360n277l5832n0417l1827j996K9901J53269Q1129J2795j11974
$$ plain form
18733 744251 734912 731506 669016 727040 750887 680347 825806 905832 894088 891936 833654 879726
18721 879726 914328 969657 1078140 1318592 1388218 1326009 1259921 1222528 1052301 955855 789875
18710 789875 746053 839699 870770 936985 1021273 1189777 1347387 1271459 1122767 965798 954316
18699 954316 1009521 1054539 990165 741049 656109 689334 621486 548193 529005 492002 412398
18688 412398 484445 382556 341280 367637 425124 621981 661688 582326 542059 649330 723558
18677 723558 616180 588889 539870 549273 534442 504614 568819 514116 421076 382712 423209
18666 423209 424701 476095 506508 522425 593864 562478 562670 468835 345613 335637 255720 193252
18654 193252 249537 311897 306620 270788 220371 188544 186548 216449 369718 450847 463642 351668
18642C51668j2641M5238Q0369L6304J7860m1173j0551n6006j36849k0312J96449
18631D50356L6021J197J53322R0914L7997o3750q6893m0192M5198Q4958j14403
18620E94725j09021n0300M0253Q4846P7716J841J4000j39224m9101m0902J1987
18609D36820R1837J34076m0238l6464n0282M0987O3961p8626m4477o7577N803
18598D55820L3260Q283J42581n8099r232J8600P0606J18710J52742N9840J19636
18587A112747K17735M5677M6380R4323L1269P2212M460k0517L2148m4252p0017
18576A522165L6507m0821L2174L747p507p3906P135L0552L2705N0565m430M5479
18564A634365p6572j85203r7951j54114R797N3409n8247r6190n1307Q910l577
$$ plain form
18642 351668 339027 384265 464634 500938 518798 477625 467074 411068 274219 253907 450356
18631 450356 486377 487574 640896 731810 769807 706057 619164 578972 624170 709128 594725
18620 594725 485704 435404 475657 560503 638219 640060 654060 514836 465735 424833 436820
18609 436820 528657 662733 622495 586031 535749 576736 640697 562071 517594 450017 455820
18598 455820 489080 497363 639944 581845 572613 591213 661819 780529 933271 993111 1112747
18587 1112747 1330482 1376159 1422539 1516862 1548131 1620343 1624803 1604286 1636434 1592182 1522165
18576 1522165 1558672 1517851 1550025 1553772 1546265 1472359 1479494 1510046 1542751 1593316 1588886 1634365
18564 1634365 1557793 1372590 1274639 1120525 1130322 1183731 1125484 1029294 977987 986897 983320
18553I83320J04908Q9679j50121l2231k5737n2254j8180L6293O6771K5882j30104
18542H98226k900Q3960L5838j3075K7523N0189M1766J23628j6946k2277q7960
18531A117972J04914J05359j03023J39002J58815j00087r3569q7352j7607K9637
18521A254061r9915p76m0053P442J6450n1107k28677N8711J29947Q8457l6447
18510A098093j9544p1321m5066k2777q3989l9171J7020P1800K4563q2244M0516
18499H87880m7569j21074o7499o9874m8871J39041K8048j0564j21881r5825n8
18488D71754P9753o9987n3821Q8381P7668n5882j14695m1375K896p7738J18370
18477D25324M5790O598l8482K324J3366P8434N9169k2700n4265J12219j7804Q4670
$$ plain form
18553 983320 1088228 1177907 1027786 995555 969818 917564 899384 935677 1002448 1028330 898226
18542 898226 895326 979286 1015124 1002049 1029572 1079761 1121527 1245155 1228209 1205932 1117972
18531 1117972 1222886 1328245 1225222 1364224 1523039 1422952 1329383 1242031 1224424 1254061
18521 1254061 1154146 1153370 1113317 1120759 1137209 1086102 857425 916136 1046083 1134540 1098093
18510 1098093 1078549 1007228 962162 939385 855396 816225 833245 905045 929608 847364 887880
18499 887880 840311 719237 651738 581864 532993 672034 700082 689518 567637 471812 471754
18488 471754 551507 481520 427699 516080 593748 537866 423171 381796 384692 306954 425324
18477 425324 471114 477712 439230 441554 454920 533354 592523 569823 515558 627777 609973 694643
18465F94643P7287J4752J71646J22446q7413q4980J03406J46213K2980q7426r9593
18454I93961J3825j35279j60377p1644M19o1475n5727j4092L8950K47K190K0906
18442E71904J9619L0655q2350j67347j69883l9122M0081J10448J93241M6717N8345
18431F12308P7497n1820j9829m2479j82740M8572J9088M5854J31330r0370p0319
18420D77092N042n0963Q2506Q8555N3161J02638Q9386L1731r747N3763J18367
18409A041531O7637k9397j12248j19073n1178R2950j00272j35242j35601p5025
18399D44082N7944j52036O6641J81899r163j14627q4087K692m2179M0220P4849
18388D66235J11459O3205J7847M3893j13171k2354j43277r6204r4922K9867O9971
$$ plain form
18465 694643 771930 786682 958328 1080774 993361 908381 1011787 1158000 1180980 1093554 993961
18454 993961 1007786 872507 712130 640486 640905 579430 523703 509611 548561 548808 550998 571904
18442 571904 591523 622178 539828 372481 202598 163476 203557 314005 507246 553963 612308
18431 612308 689805 637985 618156 575677 392937 441509 460597 506451 637781 547411 477092
18420 477092 482134 431171 513677 602232 655393 758031 847417 879148 869401 923164 1041531
18409 1041531 1109168 1079771 967523 848450 797272 890222 789950 654708 519107 444082
18399 444082 502026 349990 416631 598530 589367 474740 390653 393345 351166 391386 466235
18388 466235 577694 640899 658746 702639 589468 567114 423837 327633 232711 262578 332549
18377C32549m3295o3781L0142N8702J8702R3944K1637j24731j53846L5931M7275
18366B53229j316J14964Q496p7146j0813K3124j6717K3815R3417Q6451m8477m7720
18354D01307J387J7258o2437m0555r873J26684m759n2191j6899j59912J6491R1094
18342C07595O4834J01245m3990p2852J6747P1148K2406n8921J4369j12059o3927
18331B46595L2318M8468N8839m2937K8726O4402J6261n1787P7008J6021j4872
18320D79042O7531k4096p4677o7526n161r73M0282Q523o0260R5776N0141p7095
18308D31507J22039p1628j48239r875M4101L410L3721J18067L9420J2113m3795
18297E30841n649l5145P6690p3813l6886K6971k3339n5306p1821q4718O1215J26318
$$ plain form
18377 332549 289254 225473 255615 314317 333019 426963 448600 323869 170023 205954 253229
18366 253229 251913 366877 375373 298227 287414 310538 293821 317636 411053 497504 449027 401307
18354 401307 402694 419952 357515 316960 307087 433771 429012 376821 359922 200010 216501 307595
18342 307595 372429 473674 429684 356832 373579 444727 467133 408212 422581 310522 246595
18331 246595 278913 327381 386220 343283 372009 436411 452672 400885 477893 493914 479042
18320 479042 546573 522477 447800 380274 375113 374140 414422 422945 362685 458461 508602 431507
18308 431507 553546 481918 333679 323804 367905 371315 405036 523103 562523 574636 530841
18297 530841 525192 490047 566737 492924 456038 483009 459670 404364 332543 247825 309040 435358
18285D35358Q5688j8912P1937o1500j40867p2224R9975M6401r1582j26219Q8854
18274C16909J21817Q2824k2381O2273m8385o5178O6352J04911j0294j58051j56623
18263B94174J3569k30o4490M5313P3676O2378O808j16080R0035K5876p2221O9720
18251D28528m9419J01046J15154K9800l7141O0106L1230p8163j41183j3639J60733
18240F07052J43394R8610o327m3962n1856K4927j09239K711r3316k7720M866o5050
18228D84090k4804J11816N5277O3078J4039N6514L6686o5126q4088k3243L4003
18217F58242N2395j8023L0891J9638o2217o3200J18375k9217q4403n0445L6005
18206F08041R7692J00296j19677o7267J10423J45255M5398L5596R9876j19107
$$ plain form
18285 435358 521046 502134 574071 512571 371704 299480 399455 445856 354274 228055 316909
18274 316909 438726 521550 499169 561442 513057 447879 514231 619142 608848 450797 294174
18263 294174 307743 307513 243023 288336 362012 424390 431198 315118 405153 431029 358808 428528
18251 428528 379109 480155 595309 625109 587968 648074 679304 601141 459958 446319 607052
18240 607052 750446 849056 842729 798767 746911 771838 662599 665310 571994 544274 549140 484090
18228 484090 459286 571102 626379 689457 703496 760010 796696 731570 647482 624239 658242
18217 658242 710637 692614 723505 743143 680926 617726 736101 706884 622481 572036 608041
18206 608041 705733 806029 686352 619085 729508 874763 920161 955757 1055633 936526
18196I36526o9592J38338M7354j12257M5204O773j7130P4492J14689J95328R0667
18185A450392J34928J5641l294q9733k00388j40597R6887R2178j21796r6774J08085
18174A245529K9575j596Q2830L4146p549Q6458j7703j42886o0093K0894Q6765
18163A356370J07470R3605k9176p692p2100q4204l4845L0800J28792P3414o226
18152A556208M9192L1469L337M1852M5780K4237o119k9626J6967P9124L7188O3472
18140A913081P8273O74r0874L1099P9310K43081K10348P6037p5194l4224J08312
18129B539923M0054Q8828j0025P078l892J95076N9586m5653O0887J04740k990
18118C033612J67944P4023K14974K41777J73343J79735j027j23866j22P3218J09725
$$ plain form
18196 936526 866934 1005272 1052626 940369 985573 992346 975216 1049708 1164397 1359725 1450392
18185 1450392 1585320 1600961 1597667 1507934 1307546 1166949 1263836 1356014 1234218 1137444 1245529
18174 1245529 1275104 1273508 1356338 1390484 1382935 1469393 1451690 1308804 1248711 1269605 1356370
18163 1356370 1463840 1557445 1528269 1520577 1448477 1364273 1329428 1360228 1489020 1562434 1556208
18152 1556208 1605400 1636869 1640206 1682058 1727838 1752075 1745956 1716330 1733297 1812421 1849609 1913081
18140 1913081 1991354 1992028 1901154 1932253 2011563 2254644 2464992 2541029 2465835 2431611 2539923
18129 2539923 2579977 2668805 2658780 2665858 2661966 2857042 2916628 2870975 2931862 3036602 3033612
18118 3033612 3201556 3275579 3490553 3732330 3905673 4085408 4084381 3960515 3960393 4033611 4143336
18107D143336J53473J82247K46479K14030J26741J23330J84735J64260L03090
18098E841721L28727L25452K97279M12709M89957M75178N12717O21801O58641
18089I964182P84832J249183J296588J484678J696481J954514K511597K984594
18081B3926649L609300M389233M442036L956077L900831L593645K303777L44815
18073E0466363l13873J006990L027388N405712Q280977J2017534J7422816K4897909
18065A22211816L3949892M1916190M7013332M6551371M2214724L4816197J9871893
18058C88545415n781034l0441935l8653233l8419217m0538915l9118316k8234726
18051A67358039j5572352o781077k276054q57838j022717j910065m897458r758445
$$ plain form
18107 4143336 4296809 4479056 4725535 4939565 5066306 5189636 5374371 5538631 5841721
18098 5841721 6170448 6495900 6793179 7205888 7695845 8171023 8683740 9305541 9964182
18089 9964182 10749014 11998197 13294785 14779463 16475944 18430458 20942055 23926649
18081 23926649 27535949 31925182 36367218 40323295 44224126 47817771 50121548 50466363
18073 50466363 50152490 51159480 54186868 59592580 67873557 79891091 97313907 122211816
18065 122211816 156161708 198077898 245091230 291642601 333857325 368673522 388545415
18058 388545415 382764381 352322446 313669213 275249996 234711081 195592765 167358039
18051 167358039 151785687 145004610 142728556 141870718 140848001 138937936 134040478 124282033
18043A24282033j3074025j2275997r061904n842886l359288j373965N39505K978395
18035H2811868N598169P475957P186618O065784O970071Q411970O407594J599889
18027A32527920j135508q2306L101753M661164J349206k312362J514595R054736
18019A48679198J2771823J2198793J1641368J1773379Q181617K1344n059371j527108
18011A98681043P054205J6298460K1598910K1506539K1543826K1219748J3390581
18004C21293312K594861n869886j8201227l6981749m8267665m1481976k8585105
17997A44500565j8635626j2175976p934202m998504k853012o88204J808818M356007
17989A03379866O703499P840352O648101M767950M676952L515652q61671o346688
$$ plain form
18043 124282033 111208008 98932011 89870107 84027221 80667933 79293968 79833473 82811868
18035 82811868 88410037 95885994 103072612 109138396 116108467 124520437 130928031 132527920
18027 132527920 131392412 131310106 134411859 139073023 140422229 138109867 139624462 148679198
18019 148679198 161451021 173649814 185291182 197064561 205246178 205267522 200208151 198681043
18011 198681043 205735248 222033708 243632618 265139157 286682983 307902731 321293312
18004 321293312 323888173 318018287 299817060 262835311 214567646 173085670 144500565
17997 144500565 125864939 113688963 105754761 100756257 97903245 97215041 99023859 103379866
17989 103379866 110083365 117923717 124571818 129339768 134016720 137532372 136670701 130324013
17981A30324013p701125n811983k814108k414589p783611j3911800j3188345r217171
17973F7481281o292595m521619l305656k634256k306611j829055j436547j425088
17965D3729854j257869j099164r75526q84249r14545o89126o71051n75603m77132
17956C6185589m60997k94276l37825j94550q943L0410Q4589K51862N04723Q47352
17946C6607934J248002K035478K964508M347272O597422R549612J1702334J1722521
17938H6775083J1362772J3899783J7075314J5218646Q084574K609049L567050
17931A58592271P085329M041538q615272j9047031j7881215j1109389p019268
17924A06046963r350787j4142164j3968034j0146569o531938m454195l351990
$$ plain form
17981 130324013 122622888 116810905 113996797 111582208 103798597 89886797 76698452 67481281
17973 67481281 61188686 56667067 53361411 50727155 48420544 46591489 45154942 43729854
17965 43729854 42471985 41372821 40397295 39513046 38598501 37909375 37238324 36662721 36185589
17956 36185589 35724592 35430316 35092491 34897941 34888998 34919408 35003997 35255859 35760582 36607934
17946 36607934 37855936 39891414 42855922 47203194 53800616 63350228 75052562 86775083
17938 86775083 98137855 112037638 129112952 144331598 152416172 155025221 158592271
17931 158592271 165677600 169719138 161103866 142056835 124175620 113066231 106046963
17924 106046963 96696176 82554012 68585978 58439409 51907471 47453276 44101286
17917D4101286k663935k099404j702051j480521j254043j228805r57259p92697
17909C1922571o74818q25015q48412n70645m10092l86361l80517k23305j78817
17900B7424589K2184l0002M2412L35852N31485Q17936J287581J637597K443362
17891C4512996L762068N629233Q225147J0744935J1120142J0161364J1995336
17884I6151221J5480535J5101790Q817120K680094K560380O225668N173908n758141
17876A46432575j6560507j6982232j1159683o438362p476291j2334065j3611916
17869F1869519j0264804o670425m570321l437963k645956j992197j497753j373530
17861B9416570j305639j043217q70534r50021p87576p75324r37034q51436p06076
$$ plain form
17917 44101286 41437351 39337947 37635896 36155375 34901332 33672527 32715268 31922571
17909 31922571 31247753 30422738 29574326 29003681 28593589 28207228 27826711 27603406 27424589
17900 27424589 27446773 27416771 27459183 27795035 28326520 29144456 30432037 32069634 34512996
17891 34512996 38275064 43904297 52129444 62874379 73994521 84155885 96151221
17884 96151221 111631756 126733546 135550666 138230760 140791140 147016808 152190716 146432575
17876 146432575 129872068 112889836 101730153 95291791 87815500 75481435 61869519
17869 61869519 51604715 44934290 40363969 36926006 34280050 32287853 30790100 29416570
17861 29416570 28110931 27067714 26197180 25247159 24459583 23684259 22747225 21895789 21189713
17852B1189713p41901p45314o40459m32852m46790n05212m99841l83633m61425
17843A6332286m12802m79541n38317l93662l20920k48755l46346k49343k34187
17834A3108413l28634l50539k63971j63069k89943k94315j10938j51837j73305
17825A0981862q5083k93226l06439l01311k72077j16115n4151r7694j68425k17704
17815I069637p6068k07154j76702j26144j14020j44528q8544j69786j98461j69534
17805G598696q4271l4334j25259j98586k31617j98198p0021j720p8822k33463
17795F342405j55942j01777j02777q3213j26249n0179j79929j05028j6823m8772
17785E371716o0853p9263P1281j36147q4234m7153j22672j06005r3332m3401j84839
$$ plain form
17852 21189713 20447812 19702498 19062039 18629187 18182397 17677185 17177344 16793711 16332286
17843 16332286 15919484 15439943 14901626 14507964 14187044 13938289 13591943 13342600 13108413
17834 13108413 12779779 12429240 12165269 12002200 11712257 11417942 11307004 11155167 10981862
17825 10981862 10896779 10603553 10297114 9995803 9723726 9607611 9553460 9455766 9287341 9069637
17815 9069637 8993569 8786415 8609713 8483569 8369549 8225021 8136477 7966691 7768230 7598696
17805 7598696 7514425 7480091 7354832 7156246 6924629 6726431 6656410 6654690 6575868 6342405
17795 6342405 6186463 6084686 5981909 5898696 5772447 5722268 5542339 5437311 5420488 5371716
17785 5371716 5310863 5231600 5302881 5166734 5082500 5035347 4912675 4806670 4713338 4669937 4485098
17774D485098k7258r2906k51018q7883j3316M1391m5872j6547l3632k2334k3679
17763C912044j00825j24390q2391q022Q314N808l3718j71471j11496n1774r4559
17752C147520J567j4946j0847L3665r2440k8989j15314k16705l5915Q6174J50106
17741B903876p9689r3320r3289q8659m9584P3820o661J2144p6764k8135r9647
17730B374092j7693m78R0914j27503j53358l1765m1559J02641J13991q7420j44636
17719B077226m2588M7930P5575Q0381j0486o1839p3684j32814j06442m8894J8259
17708A822624M4250n0084j9948q1568o544p4798j63067j59651O8575J50656k5571
17697A504874p5035M9291R3482j13823j39892P674J21815J0454J1124k9827K6030
$$ plain form
17774 4485098 4457840 4364934 4113916 4026033 4012717 4054108 4008236 3991689 3958057 3935723 3912044
17763 3912044 3811219 3686829 3604438 3596416 3604730 3610538 3576820 3405349 3293853 3242079 3147520
17752 3147520 3149087 3134141 3123294 3156959 3064519 3035530 2920216 2703511 2667596 2753770 2903876
17741 2903876 2824187 2730867 2637578 2548919 2499335 2573155 2566494 2578638 2501874 2473739 2374092
17730 2374092 2356399 2355921 2446835 2319332 2165974 2134209 2092650 2195291 2309282 2221862 2077226
17719 2077226 2034638 2082568 2158143 2238524 2228038 2166199 2092515 1959701 1853259 1804365 1822624
17708 1822624 1866874 1816790 1796842 1715274 1708730 1633932 1470865 1311214 1379789 1530445 1504874
17697 1504874 1429839 1479130 1572612 1458789 1318897 1326571 1448386 1458840 1469964 1440137 1466167
17686A466167j45095N64k7418p3818j5526J17868L4553o5046K2709J1677M4752
17675A371387j30932o6498q562j4514o9129p292J3790N016l7251Q6739R6400P8706
17663A317860m6444o5933n2055j88061j84376k0002J20810N1201P5959j08797
17653I00162j81415K2193J0848M0897M7230j8264q177R423L4573o0375M8197m0034
17641H05258q6210j01991J4439L3386Q8856l0045k2263q1105n7881J25643R4651
17630G82738N2343k6287j06611j8201p5994j14094O443M1925O4904m8487n1758
17619E06921M3808M1797K08109M6656o4300j72845q6531J48193j9837j14852n5808
17608D81311K5798k7096Q9840m182n6740j70220N6545K9258K5447N5411m304j3005
$$ plain form
17686 1466167 1321072 1321636 1294218 1220400 1204874 1322742 1357295 1292249 1314958 1326635 1371387
17675 1371387 1240455 1173957 1165395 1150881 1081752 1074460 1088250 1093266 1056015 1142754 1239154 1317860
17663 1317860 1271416 1205483 1153428 965367 780991 760989 881799 933000 1008959 900162
17653 900162 718747 740940 751788 792685 839915 821651 813474 822897 857470 797095 845292 805258
17641 805258 719048 617057 631496 664882 753738 723693 701430 620325 562444 688087 782738
17630 782738 835081 808794 702183 683982 607988 493894 500337 542262 607166 558679 506921
17619 506921 550729 592526 800635 847291 782991 610146 523615 671808 651971 537119 481311
17608 481311 507109 480013 569853 565671 508931 338711 395256 424514 449961 505372 501068 488063
17596D88063Q736J8171O0225M2229j47126L0470N6278j51162n3983n8118J19066
17585D12849J53438K2110n8440j93824j86353O4498P8563J25489P7478O1970J7217
17574E74995j16517k4688J0095K2176m1728j6039R229M9551O1819J765j06526
17563D24132j32066j6785O2061N4785L8370M3671n4698Q738R4723J31583j0837
17552F43677o2095M8172J32360M7028P0957J8251J7457P9192Q1738J14444k9897
17541A161284j44083N0432l537Q2747q396o4849O8529J17864J41109R9763M3746
17530A544609j9102r0686j65622j37758j98464q2866K4898M9462j3585q6098j40765
17519F84023m6963j24729r2839M5811J05609O7187M255M5795P6766L5723L7563
$$ plain form
17596 488063 496799 514970 575195 617424 470298 500768 557046 405884 351901 293783 412849
17585 412849 566287 588397 529957 336133 149780 214278 292841 418330 495808 557778 574995
17574 574995 458478 433790 443885 466061 424333 408294 417523 467074 528893 530658 424132
17563 424132 292066 275281 337342 392127 430497 474168 419470 428208 522931 654514 643677
17552 643677 581582 629754 762114 809142 880099 898350 915807 994999 1076737 1191181 1161284
17541 1161284 1017201 1067633 1064096 1146843 1138447 1073598 1142127 1259991 1401100 1500863 1544609
17530 1544609 1525507 1434821 1269199 1131441 932977 850111 875009 924471 910886 824788 684023
17519 684023 637060 512331 419492 465303 570912 638099 642354 688149 764915 800638 838201
17508H38201p8579p1730m2390K08818J53719J9284J680P5404K0372k270N2534
17497A175043Q5554P7337k8969M5070M0823J06748M7050L2904j10926m9652N9042
17486A480024M5319j00172r5979n3132n5442j45896l2886N9135N5883N4951l0187
17475A181618j6527M2209N2512n5180o9082O650m0765N5684m5839j07281j48278
17464H55721K3849R0849n8360j67195P4893q4462L9560j8773n7411J01803Q2491
17453H82965Q5904J52514o2389o3113l4270j21587o8690M9357l1588o3018r660
17442G16425J1688k267r3218j6537Q2629N3816K5320j12797j08105K2608k6470
17431E53092l7379K0610R5237j27246j27755l3950J42324k9275l4245Q8440j4245
$$ plain form
17508 838201 759622 687892 645502 854320 1008039 1027323 1029003 1104407 1124779 1122509 1175043
17497 1175043 1260597 1337934 1308965 1354035 1394858 1501606 1548656 1581560 1470634 1420982 1480024
17486 1480024 1525343 1425171 1329192 1276060 1220618 1074722 1041836 1100971 1156854 1211805 1181618
17475 1181618 1165091 1207300 1259812 1204632 1135550 1142200 1101435 1157119 1111280 1003999 855721
17464 855721 879570 970419 912059 744864 819757 735295 774855 756082 698671 800474 882965
17453 882965 968869 1121383 1058994 995881 961611 840024 771334 820691 789103 726085 716425
17442 716425 728113 725846 632628 616091 698720 752536 777856 665059 556954 579562 553092
17431 553092 515713 536323 631560 504314 376559 342609 484933 455658 421413 509853 495608
17420D95608j57692j16117J08571J20712j2689J0612n6814k6367j7732P1440N6236
17409D75768N1385Q557Q011Q6411J34869J31792k299m9749M7437J11629r3489
17398I10322j3203L7974L3061k0759j85724l6923j42338k3746R3816K6504j35463
17387E43521K4055m1809m3036L8440o6274j56385M5070j0092j05089P3272N1763
17376C53436L4739r6767l408J35827k453j96500Q8700Q5184K1060k3672q8753
17365C07393q4423J0339R7400j2041j4120j55116j4419R5348O4040J16787j2721
17354C98467p1221J50515O9688j8594J75342O1341l5776l4553p219J58126K4121
17343H70237n0830k4410k0981j38612j31971p3149pq6036J511l3880m1541o7351
$$ plain form
17420 495608 337916 221799 330370 451082 438393 449005 392191 365824 348092 419532 475768
17409 475768 527153 535710 543721 630132 765001 896793 894494 844745 892182 1003811 910322
17398 910322 897119 935093 968154 947395 761671 724748 582410 558664 652480 678984 543521
17387 543521 567576 525767 482731 521171 454897 298512 343582 333490 228401 301673 353436
17376 353436 388175 291408 288000 423827 421374 224874 313574 398758 419818 396146 307393
17365 307393 222970 233309 330709 318668 304548 149432 135013 230361 294401 411188 398467
17354 398467 327246 477761 547449 528855 704197 765538 729762 695209 687990 846116 870237
17343 870237 819407 794997 774016 635404 503433 430284 430277 344241 345752 311872 270331 202980
17331B02980L1047P9690p1844k7754O5377j02145n4933J07765j4631O24Q6149
17320C02325R910k5630j06821q8756O8403J94263j4317j14362L3433o1838N005
17309B01615l1017j5693Q3572J7670K0275r3828q0848l3224N3904q0529j85967
17298a44070n8020K8423R7150O7011j6473M158K9801o7254J10150J05648M1474
17287A97998j873j49753j20278L039L7594K2241J8505j2741R1909j2326l0673
17276D3642l5988n2084j1760J25581m5970j34091m1659J19734J19727M071R2878
17265A84081M3381k0692J5460J02271J0494j71519k12784k5684J95093P0548L9010
17254B29659o4941j8219o0445j57398L2047M3924O97J16419Q0299j6899R5855
$$ plain form
17331 202980 234027 313717 241873 214119 279496 177351 122418 230183 215552 216176 302325
17320 302325 312235 286605 179784 91028 159431 353694 339377 225015 258448 196610 201615
17309 201615 170598 154905 238477 256147 276422 182594 101746 68522 122426 41897 -144070
17298 -144070 -202090 -173667 -76517 -9506 -25979 -21821 7980 -59274 50876 156524 197998
17287 197998 196125 46372 -73906 -70867 -33273 -11032 7473 -5268 86641 74315 43642
17276 43642 7654 -44430 -56190 69391 23421 -110670 -152329 -32595 87132 91203 184081
17265 184081 227462 206770 222230 324501 334995 163476 -49308 -74992 120101 190649 229659
17254 229659 164718 146499 86054 -71344 -39297 4627 5324 121743 202042 185143 280998
17243B80998J4115M6158Q0702m6149o0117M1622j72332o4259J19894j14074j82710
17232e6152j08731q320M3810p763j3490N7389Q9655j3720M0301J889l3624q8626
17220i7382l6609J70692J14089j01403j56814j71696J1343J35385L1653L7126
17210f3616L0504r243Q9440k8866O5008K05164J4919r2301n7765M8362j34410
17199F7196j55539O948k3485P3157K2756n3244p3410m7420k0338k1807J02079
17188a23107J35484P796r4042L5650j8419Q3002r7385k0833j3819L2117J68286
17177I4730N8800p1175k0327l1197j02097o1037L1550N2097o6888K6798O541n2015
17165a34220J3290k8383P8598O5502m8082k284P5393J51357P9432L220m060k7854
$$ plain form
17243 280998 295113 341271 421973 375824 315707 357329 184997 120738 240632 126558 -56152
17232 -56152 -164883 -173203 -129393 -137156 -150646 -93257 -3602 -17322 22979 24868 -8756 -97382
17220 -97382 -133991 36701 150790 49387 -107427 -279123 -267780 -132395 -100742 -63616
17210 -63616 -33112 -42355 47085 18219 83227 288391 303310 211009 153244 201606 67196
17199 67196 -88343 -81395 -104880 -31723 -8967 -62211 -135621 -183041 -203379 -225186 -123107
17188 -123107 12377 20173 -73869 -38219 -56638 26364 -71021 -91854 -105673 -73556 94730
17177 94730 153530 82355 62028 30831 -71266 -132303 -100753 -48656 -115544 -88746 -82205 -134220
17165 -134220 -120930 -149313 -70715 -5213 -53295 -55579 19814 171171 250603 253823 249763 221909
17153B21909J6280o1313q3001J2077M0338j9053o4888J4552n7975N5843Q912M348
17141H8029j7766M8842M6022O3963J509n6366j278k2191m3549L7288O9682l9592
17129A74593r2769l5227r9432j25607k8781J22981N1797J3652K3010l7744N9084
17118B5557O0509r5477J6605k7131l9993p0848L1247N3379M97O8083K6166m0887
17106G707Q781N9848r4251M3374N2929k2602J8128R292l0241m8907M983j0154
17094a113j22080K5379Q8922P7436k6266o2601M6116M8576j8316q1521j21288
17083a46756K4133J8769k7392J45310O8460m2175j49988q1749l0788M6319L5514
17072a40343L351O8500J5950J06284k7915m5736m0611n3073J2111L2311P6971
$$ plain form
17153 221909 238189 176876 93875 105952 146290 127237 62349 76901 18926 74769 83681 88029
17141 88029 70263 119105 165127 229090 230599 174233 172955 150764 107215 144503 214185 174593
17129 174593 81824 46597 -52835 -178442 -207223 -84242 -32445 -18793 4217 -33527 25557
17118 25557 86066 -9411 7194 -19937 -59930 -130778 -99531 -46152 -45655 22428 48594 7707
17106 7707 16488 76336 -17915 25459 78388 55786 73914 83206 52965 4058 9041 -1113
17094 -1113 -123193 -97814 -8892 68544 42278 -20323 25793 74369 56053 -25468 -146756
17083 -146756 -122623 -103854 -131246 14064 82524 40349 -109639 -191388 -222176 -175857 -140343
17072 -140343 -136992 -68492 -52542 53742 25827 -19909 -60520 -113593 -101482 -69171 7800
17061G800p9115N861L0821m1982M9200O1061o7796q2056p4376j812k7163K0147
17049a99410J28478J3637j40496N8675O2912J50773n586q0760J6827J1221k4565
17038h294m1253r4945M2603L2087L7038N7092Q7255N0131j6858l1219O1427l6640
17026A38424n1687q3269m4001M8228J4268O7419J2741o4457l9839J4645P0857
17015H3329L659O6839j444n0003J40618q1630k07682K7308O7097l6139l6351l211
17003b7610k0861l6238N5919L2979J00315L7225r8910p9048J1104N1525N7737
16992H4137o2396q4534p3172Q470Q435M0760Q635Q1130n8407J1213J16216r8220
16980a7733j16007J14993J75855N4501j28773j25030K01351M6998j65498j05131
$$ plain form
17061 7800 -71315 -65454 -34633 -76615 -27415 33646 -34150 -116206 -190582 -192394 -219557 -199410
17049 -199410 -70932 -57295 -197791 -139116 -76204 74569 68983 -11777 5050 16271 -8294
17038 -8294 -49547 -144492 -101889 -69802 -32764 24328 111583 161714 144856 113637 175064 138424
17026 138424 86737 3468 -40533 7695 21963 89382 102123 37666 -2173 12472 83329
17015 83329 86988 153827 152383 102380 242998 161368 -46314 -19006 48091 11952 -24399 -27610
17003 -27610 -48471 -84709 -28790 4189 104504 141729 42819 -36229 -25125 26400 84137
16992 84137 21741 -62793 -135965 -127495 -119060 -78300 -69665 11465 -46942 -35729 80487 -17733
16980 -17733 -133740 -18747 157108 211609 82836 -42194 159157 206155 40657 -64474
16970f4474P168n236J9463J16963m2791K6086q343K7734M101j3044O3279o4833
16958F6073j20155p4735N7167N4136L7994n2464j7190Q9703j5338q6580O3707
16947B318Q1266o6425k1436Q4369L9712n9534r4621J23764q887j05930o7204J33672
16935D1064R5690k3366k8440M8599P0206p2908j8203r6706k6180Q2249J49984
16924B21989o9190j06397r306P2734n6271m3037P902N3159L1579q8376r9497J5970
16912f8741K1963k361J9565L6429K3885m2092L7631j71898P1934j2969L613j1492
16900i4533k8328k8461L6547J22476J11659K817L7823M3464n1495j19517q5554
16889e3102k9503N6776J8810n5171p7914R7870L8680j660K2388Q6643m5602l33
$$ plain form
16970 -64474 -57306 -62542 -43079 73884 31093 57179 48836 76570 80671 67627 130906 66073
16958 66073 -54082 -128817 -71650 -17514 20480 -31984 -49174 40529 25191 -61389 2318
16947 2318 83584 17159 -4277 80092 119804 60270 -34351 89413 80526 -25404 -92608 41064
16935 41064 136754 113388 84948 133547 203753 130845 112642 15936 -10244 72005 221989
16924 221989 152799 46402 37096 109830 53559 10522 18424 71583 103162 14786 -84711 -68741
16912 -68741 -46778 -49139 -29574 6855 30740 -11352 26279 -145619 -73685 -86654 -83041 -94533
16900 -94533 -122861 -151322 -114775 7701 119360 122177 160000 203464 151969 32452 -53102
16889 -53102 -82605 -25829 -7019 -62190 -140104 -42234 -3554 -5214 17174 103817 58215 57882
16877E7882J0046k346J2664r004J4542M2293p7948j13347k8306r3179j2633L1746
16865a67590K1470K6353m1974l2093j9625O4099R9099J10712l6662p4825n962
16854e6998k2091J39153P7595M8163j16563o7655n224P099p1728O0921J01776
16843I4448k5318q0902l5200N9991J0060m6808M6884m9654N781J141p374p067
16831c4018K2772O7874o3400p9147p1358Q5276M7450m5845J6861K2351J40321
16820A09137n0701r3640k1297k2318K9996k8706o6106L5044L8082j8148P2105
16809a6552O4734r3019J4147R1099L0149o2014O617j29194j5743j7827J1575n184
16797a21212n3262M0839J74171N5687j17752l9022K6859R6251k141o2938k2905
$$ plain form
16877 57882 67928 65582 78246 69242 83784 126077 48129 -65218 -93524 -186703 -199336 -167590
16865 -167590 -146120 -119767 -161741 -193834 -213459 -149360 -50261 60451 23789 -51036 -56998
16854 -56998 -79089 60064 137659 185822 69259 1604 -3620 3479 -68249 -7328 94448
16843 94448 69130 -11772 -46972 13019 23079 -23729 23155 -26499 -20718 -19577 -26951 -34018
16831 -34018 -11246 56628 -6772 -85919 -157277 -72001 -24551 -70396 -53535 -31184 109137
16820 109137 58436 -35204 -56501 -78819 -48823 -77529 -143635 -108591 -70509 -88657 -16552
16809 -16552 48182 -44837 -30690 60409 90558 28544 35161 -94033 -109776 -127603 -116028 -121212
16797 -121212 -174474 -133635 40536 96223 -21529 -60551 -33692 62559 60418 -2520 -25425
16786b5425O8502R9771p8632R2076K3230j11864q7733J15205k4862n2572k97l2652
16774a5253m5456j941Q1308O2082L0766j6737j88502r0214j7094Q1393J8158J339
16762a00151p1027R4150J64830j0264j00965n538p4111j45242j1819J55459R0225
16751a4453K16578j01326j60366j42305N6653K7929M5236k7760R400m6643J28454
16740h603M5493n5333q4800R57l3246N7874O2517m6678j7138m7587j43425L6221
16728b33748R3361R2556K0421J41016j0112k99M1182R0114n8466j68279J19415
16717A27161K917j51284J4880k7776j302k7084j01574l9293M5320J15876K8579
16706a3580p6257r5515N8046j3847l7893J38517J14793r6923j2110J3372K2737
$$ plain form
16786 -25425 43077 142848 64216 156292 179522 67658 -20075 95130 70268 17696 17399 -15253
16774 -15253 -60709 -62650 18658 80740 111506 94769 -93733 -183947 -201041 -119648 -101490 -100151
16762 -100151 -171178 -77028 87802 77538 -23427 -28965 -103076 -248318 -260137 -104678 -14453
16751 -14453 202125 100799 -59567 -201872 -145219 -117290 -72054 -99814 -90414 -137057 -8603
16740 -8603 36890 -18443 -103243 -102286 -135532 -77658 -15141 -61819 -78957 -126544 -269969 -233748
16728 -233748 -140387 -47831 -27410 113606 103494 103195 144377 234491 176025 7746 127161
16717 127161 130078 -21206 -6326 -34102 -35404 -62488 -164062 -203355 -158035 -42159 -13580
16706 -13580 -89837 -185352 -127306 -141153 -179046 -40529 74264 -22659 -34769 -21397 1340
16695A340K5753j55914L6589N4476j9061r0986j80353P4560J64980N6644M2473
16684A0501L065j2509q0752q1858l4392J09364O2057R065J04289J11600j9228
16673A81202j4130k9482R727Q2326L0148m1558o6286j19101j6100r818o4774q2559
16661a40405M977M9822Q0595P6345k9239o4153m3340k2160J84390J25251L7639
16650B59722p0691o4491J8500j34522K770Q4768j07836j70345L3897M7100m5581
16639a46709o5585j1493J26194N4467o7291p5998M8283R9109O7562K3730K4701
16628G6970k6445J05872p0663j1555p7831l3642J04034l2997J9120j18042j12949
16617a78128K4859J03799Q2702K2422K8029J8216j01744j59439K5189J21547J34858
$$ plain form
16695 1340 27093 -128821 -92232 -37756 -56817 -147803 -328156 -253596 -88616 -31972 10501
16684 10501 13566 1057 -79695 -161553 -195945 -86581 -24524 -15459 88830 200430 181202
16673 181202 167072 137590 147317 229643 259791 218233 151947 32846 16746 6928 -57846 -140405
16661 -140405 -135428 -85606 -5011 71334 42095 -22058 -65398 -87558 96832 222083 259722
16650 259722 189031 124540 143040 8518 11288 96056 -11780 -182125 -148228 -101128 -146709
16639 -146709 -212294 -223787 -97593 -43126 -110417 -186415 -138132 -39023 28539 52269 76970
16628 76970 50525 156397 85734 74179 -3652 -37294 66740 33743 52863 -65179 -178128
16617 -178128 -153269 -49470 33232 55654 83683 101899 155 -159284 -134095 -12548 122310
16606A22310n4217q94N3162r9849j29869o7051l5110K5968J82300P2388j08695
16595c9557j34928p3652P3341K9545m3821p2393P1414M7612K352j11538R124L7557
16583b04944N8198M3990k3344J51025J2372J7841k4762r1182K9296r1701R2801
16572c0410K9371J6006L0922O7077M8998r5660q1272k2328l27j0366j4507P753
16560e4743J7386M3282q5028r8800J73806J10524o9266j56857j81176j49220R1866
16549c58226J24658J26170m6676J05580l1579r8464Q3172P718o9798L5471m5260
16538a67234J2210O814K3636L3067J29957O5160j11491q4492k4104q5800O5056
16527a37221K4590l168o8595j4613j311J7088R8214K1908r7653M2113M3656J9275
$$ plain form
16606 122310 68093 67199 120361 20512 -109357 -176408 -211518 -185550 -3250 69138 -39557
16595 -39557 -174485 -248137 -174796 -145251 -189072 -261465 -190051 -142439 -140087 -251625 -242501 -204944
16583 -204944 -146746 -102756 -126100 24925 37297 55138 30376 -60806 -31510 -123211 -30410
16572 -30410 -1039 14967 45889 112966 161964 66304 -14968 -37296 -37623 -47989 -62496 -54743
16560 -54743 -37357 5925 -79103 -177903 -4097 106427 37161 -119696 -300872 -450092 -358226
16549 -358226 -233568 -107398 -154074 -48494 -80073 -178537 -95365 -87647 -157445 -121974 -167234
16538 -167234 -155024 -148210 -124574 -91507 38450 103610 -7881 -92373 -116477 -202277 -137221
16527 -137221 -112631 -115799 -184394 -199007 -200318 -183230 -85016 -63108 -160761 -118648 -74992 -55717
16515e5717o228Q3868N8960J4601q2302r0127o7582J0060M5232L5903K3720R3679
16503F4067L9517L2167n0527j09684j58791N6585M1979m4715k0697N8041L8893
16492e3165m5300J6564P7596m0097q7980K6290l5940k3397J1292K0741M8077j08121
16480a93440n9670n6755N7758J98414J5979m4950m662q2120J2240p069M2445J02511
16468a9319n1548l6297o106P7632J05511N6150q4799m9468p9720M8473J657m6714
16456h4548M227J58757M2765j27230j4901L0399q341M9630j8246l4893r9695K9959
16444g2117K06897M2212m6417r0755j09274j1823J17751J5352J9327p738O036
16433F9451Q8590L81P3465n2216k28570j18635Q9119R8760J25417l1782o4401
$$ plain form
16515 -55717 -61945 21923 80883 95484 13182 -76945 -144527 -134467 -89235 -53332 -29612 64067
16503 64067 103584 135751 85224 -24460 -183251 -126666 -84687 -129402 -150099 -92058 -53165
16492 -53165 -98465 -81901 -4305 -44402 -132382 -106092 -142032 -165429 -154137 -133396 -85319 -193440
16480 -193440 -253110 -309865 -252107 -53693 -37714 -82664 -87326 -169446 -157206 -164275 -121830 -19319
16468 -19319 -70867 -107164 -113270 -35638 69873 126023 41224 -8244 -87964 -39491 -37834 -84548
16456 -84548 -80321 78436 121201 -6029 -20930 9469 1128 50758 32512 -2381 -102076 -72117
16444 -72117 134780 176992 130575 39820 -69454 -81277 36474 51826 71153 63415 69451
16433 69451 158041 158422 231887 179671 -48899 -167534 -78415 20345 145762 113980 49579
16422D9579p6860p0579R1520J06690N1844j5059o6427l9925n2449k2180M5646
16411A800j5392R6719J3775o3263m6418r4795K848J7931n5030L391n8402n801
16399b02637m6681l1976K13206J54196J13304M7817q8747q2847l3528o7501Q7201
16388F1807Q1320p8327m1146m3852J48363p8525n5263L5627J07324K05182j66526
16377A75984j46542o3061j2283J00468j3556n1282r9600n7286N6897R1251L7237
16366A8227K1428n4747o7792K4357J6045Q3039J16074k15788j54755k9600P7579
16355a65933M8899p689L2261J85065K5716M9765k0329j23709m103P3689n3407
16344D0225j11799P0754P049j31028N7042M2025Q9967K4841k3804j46175k5129
$$ plain form
16422 49579 -27281 -97860 -6340 100350 152194 137135 70708 30783 -21666 -43846 1800
16411 1800 -13592 83127 96902 33639 -12779 -107574 -104726 -86795 -141825 -138434 -196836 -202637
16399 -202637 -249318 -281294 -68088 86108 199412 247229 158482 75635 42107 -25394 61807
16388 61807 143127 64800 23654 -20198 128165 49640 -5623 30004 137328 342510 175984
16377 175984 29442 -33619 -45902 54566 41010 -10272 -109872 -167158 -110261 -19010 18227
16366 18227 39655 -15092 -82884 -58527 -42482 40557 156631 -59157 -213912 -243512 -165933
16355 -165933 -117034 -124723 -92462 92603 118319 168084 147755 24046 19943 93632 40225
16344 40225 -71574 -820 6229 -124799 -67757 -25732 64235 89076 65272 -80903 -106032
16333a06032M854O2475O8961j05642n7962N0562L09497J15355j13870j83782l0326
16322A4090K4494j5696L3028p7618j30006L8851n3921m3872k2474M7276K3388
16311a62460k4917P4323N2557J4732J4028Q3509l6430j33104j15262M1471L1134
16300a60419N6822Q4680j35795k6194J3806L1272Q9510N4097J1904o9509J00758
16289E0932N3241l8240J0671R2488j14492j79970j64598N1693J91550J41168k08732
16278a14289j58897J00446J47660L0562K0593q826m2884Q3966P4328o7155m9371
16267A6133l8812n8261N4349K7243p7210J06862q8731p1094l3947P9924J30964
16256D7420J01410j00070j42703R803J35447N8896q3476j10198l4022m7357O1566
$$ plain form
16333 -106032 -101178 -38703 30258 -75384 -133346 -82784 226713 342068 228198 44416 14090
16322 14090 38584 22888 55916 -21702 -151708 -112857 -166778 -210650 -233124 -185848 -162460
16311 -162460 -187377 -113054 -60497 -45765 -31737 51772 15342 -117762 -233024 -191553 -160419
16300 -160419 -103597 -18917 -154712 -180906 -167100 -135828 -46318 7779 19683 -49826 50932
16289 50932 104173 65933 76604 169092 54600 -125370 -289968 -238275 -46725 94443 -114289
16278 -114289 -273186 -172740 -25080 5482 26075 17249 -25635 58331 132659 65504 16133
16267 16133 -22679 -80940 -26591 652 -76558 30304 -58427 -129521 -163468 -83544 47420
16256 47420 148830 48760 -93943 -84140 51307 110203 26727 -83471 -117493 -164850 -103284
16245a03284k2962o0186n3275Q0428J21520K1897j52107M549R9085L5217P8688
16234D9570n9300o7019O3525m6977k5936o3231j793N8171L8478L4795l0673J03391
16222E3001L8103j91243J16782J20587n016M8283p6730j84109j67947j01844L5752
16211c14381N4417M027P3462L4396L3282J29440l6315N5227n8141o80M2679O0995
16199G8408J15703J0956R096k7707m2657j27069r9120O184l1646N6504J1351p7482
16187a17479J49573P7461N1929l0733j3497Q8652o0311j93558k0055M1506J07580
16176H1068J8862m9342j21607N4822R443j0657J7873o3096L849N7451N9581j7172
16164D1075l3732m9408N0745o8764j02242j2969Q650J47496N282m5208K4427k5726
$$ plain form
16245 -103284 -126246 -186432 -239707 -159279 -37759 -15862 -167969 -163420 -64335 -29118 49570
16234 49570 -9730 -76749 -13224 -60201 -86137 -149368 -151161 -92990 -54512 -19717 -50390 53001
16222 53001 91104 -100139 16643 137230 132214 180497 103767 -80342 -248289 -350133 -314381
16211 -314381 -259964 -255937 -182475 -148079 -114797 14643 -21672 33555 -24586 -25266 17413 78408
16199 78408 194111 205067 214163 186456 143799 16730 -82390 -76206 -107852 -51348 -39997 -117479
16187 -117479 32094 109555 161484 130751 117254 205906 145595 -47963 -68018 -26512 81068
16176 81068 99930 50588 -71019 -16197 -6754 -17411 462 -62634 -58785 -1334 58247 41075
16164 41075 7343 -42065 8680 -60084 -162326 -175295 -166645 -19149 -13867 -59075 -34648 -60374
16152f0374m2133M4769N9144K8925J26511J13144o5585m2194m4512m5989j07104
16141c5398J7438J18187j9510J516j08013k459m8761k4644L267l4352j22797j20349
16129c75875Q30P2120M1513P6113K498K8457M4212R6265K7856J0234r0668M1147
16117b5298j8671m3399K5935L0230K7360K5930k0373N8441J68241J0624m0029
16106A98991j66081p9208j8831l8083r251J7037Q5521N514j25174k7197m6654
16095b03416K3950N0392L3192J56501J09077l1428q532O6252K944p122o4865p950
16083A18995j12372q2858R3826L9149j3160J36094l5726j41537o4533P9882k8803
16072a1043q0290N3128Q643m1389n1923J6682j03385J0351J81113L1125j8496
$$ plain form
16152 -60374 -102507 -57738 1406 30331 156842 269986 204401 162207 117695 71706 -35398
16141 -35398 -17960 100227 80717 82233 -25780 -28239 -77000 -101644 -98377 -132729 -255526 -375875
16129 -375875 -375045 -302925 -261412 -185299 -182801 -154344 -110132 -13867 13989 24223 -66445 -25298
16117 -25298 -43969 -87368 -61433 -31203 -3843 22087 1714 60155 228396 239020 198991
16106 198991 32910 -46298 -65129 -103212 -112463 -95426 -9905 -4391 -129565 -156762 -203416
16095 -203416 -179466 -129074 -95882 60619 169696 138268 129736 195988 198932 191810 126945 118995
16083 118995 6623 -76235 17591 56740 43580 179674 143948 2411 -62122 17760 -11043
16072 -11043 -91333 -38205 -29562 -70951 -122874 -106192 -209577 -199226 -18113 13012 -5484
16061e484o797J2140o8203j39974R5633N1209K3528p033j7248j9425M3733O9122
16049C1201n5838j905M3144n203K0094m4898M4305P5484k9979l8855M7066l1761
16037E2855M519j7231J11225O137j11351j10436l2775j15005O8803Q561N4522
16026h0176K38143K283j00934J03p4057l3880p3468K7563N6147K6172Q5009k3109
16014D9796R563j3170k1838K6026j1516M1543P1814K0966j1874n8081K3896k3095
16002A04030o478n5598j08892m1027r8864N1000J35312K4226l2957J2091p3373
15991i0530J6795j9676r171J17861m14N4793p3663k3078N2592K9934k3091k231
15979C0121J21999n116k21339P091J31458K7169N1212p9479Q3519n7585r5185
$$ plain form
16061 -5484 -12281 -141 -68344 -208318 -112685 -61476 -37948 -44981 -62229 -81654 -37921 31201
16049 31201 -24637 -26542 16602 11399 31493 -13405 30900 106384 76405 37550 84616 52855
16037 52855 57374 40143 151368 157505 46154 -64282 -97057 -212062 -143259 -134698 -80176
16026 -80176 157967 160250 59316 59419 -14638 -48518 -121986 -94423 -38276 -12104 72905 49796
16014 49796 59359 46189 24351 50377 38861 80404 152218 173184 161310 103229 127125 104030
16002 104030 97552 41954 -66938 -107965 -206829 -155829 -20517 3709 -29248 -17157 -90530
15991 -90530 -73735 -93411 -102582 15279 14865 69658 -4005 -27083 25509 55443 32352 30121
15979 30121 152120 147004 -74335 -67244 64214 91383 142595 63116 146635 89050 -6135
15968f135m2554j05572M0654L5256j0004r6634R2650N3312M0055p2226n3636N9720
15956f5114Q1836O1187K8651P2423j8155n9051O3463j0289k2085j30919o1450
15945e9503O5099M1085l3927M0977K6986k9298n2258j43725m646J2828j306R3107
15933d4581M8550J01011M3255o7030j03405q1805n8945k526N9037J41334p2638
15922c7743m8761o6163r8890Q8858J86809R8714j13579p157J14930N063j5774
15911A06307o9662M4122P3225O1547R4670r9005p7340o8013m8466m3846O9283
15900D2822K4569o6145j03635r5771J14829j5829j43837J61521K44096L7633l8728
15889A61525q9979p3030p9999p1266J6687J14835P8559j4513k9367j03212M6137
$$ plain form
15968 -6135 -48689 -154261 -113607 -78351 -88355 -184989 -92339 -39027 1028 -71198 -124834 -65114
15956 -65114 16722 77909 106560 178983 160828 101777 165240 154951 132866 1947 -59503
15945 -59503 5596 46681 12754 53731 80717 51419 -839 -144564 -149210 -136382 -137688 -44581
15933 -44581 3969 104980 148235 81205 -22200 -104005 -162950 -165476 -106439 34895 -37743
15922 -37743 -86504 -152667 -251557 -162699 24110 122824 9245 2088 117018 122081 106307
15911 106307 36645 80767 153992 215539 310209 211204 133864 65851 17385 -26461 42822
15900 42822 67391 1246 -102389 -198160 -83331 -99160 -242997 -81476 162620 200253 161525
15889 161525 71546 -1484 -81483 -152749 -136062 -21227 57332 42819 13452 -89760 -43623
15878d3623P3463j53875j03878J11333J27001P376p2116l2150j907L9257p1071
15867a20190M8124R154o8980L2241m3421K7815Q2867l4561o882J9597l6934P3087
15855a8083Q6811o429J7024p7096M0043R7638o4223j6399l5583N6497K1211O8591
15843A70002p8308r5217R085l8803m0948m553J07980m4522M1657K362l1132n5778
15831e8175J6864o1922K2649l8098q9763K4001J00496J64369J53309q2721j29415
15820B1594m1253O4148L9392L1571q2850l9496q2434k5447K6653l6940J13523
15809a1539n0177R2641K9753q9185L1137K9305k6810R2165m0297q2841n4555L4604
15797d5799j9252Q652L4346k903N6753n5505m3551q7298o1570Q4976O6300M4245
$$ plain form
15878 -43623 29840 -124035 -227913 -116580 10421 17797 -54319 -86469 -88376 -49119 -120190
15867 -120190 -72066 -62912 -131892 -99651 -143072 -115257 -32390 -66951 -73833 -54236 -91170 -18083
15855 -18083 68728 62299 79323 2227 42270 139908 75685 59286 23703 80200 101411 170002
15843 170002 91694 -3523 5562 -33241 -74189 -78742 29238 -15284 26373 28735 -2397 -58175
15831 -58175 -41311 -103233 -80584 -118682 -208445 -184444 -83948 80421 233730 151009 21594
15820 21594 -19659 44489 83881 115452 32602 -6894 -89328 -114775 -88122 -125062 -11539
15809 -11539 -61716 30925 60678 -28507 2630 31935 5125 97290 56993 -25848 -80403 -45799
15797 -45799 -65051 -56399 -22053 -24956 31797 -23708 -67259 -154557 -216127 -131151 -64851 -20606
15785b0606j24435o1014R8145m7941R7790J11885j6494K6321j1447p2527p6326
15774i6649r3435k5650P5304n471J23113n4213l8428K7816K2070o8033q91R0770
15762d3697K933j0637L9081j8279j9819J16666N6994K8233q1347l7410P063n7856
15750a8075j1348M904j9999J9563N7261J06697j43286j51880R0272P3114K5413
15739C2636N269M222J2422L7994j7029j09359j09689l5161m7084k4907O5776J36063
15727d8847J30221o8250k6039O7730o4007j04532J20709m9612K3423J4932l7710
15716d1982o2869O9585j04611Q707J12842o0772j26912n6981N3597O1536j2419
15705a60279J0644N6544O5265j7477l7873L7956r7360j20331M0576Q8561k6537
$$ plain form
15785 -20606 -145041 -206055 -107910 -155851 -58061 53824 37330 63651 52204 -20323 -96649
15774 -96649 -190084 -215734 -140430 -145901 -22788 -77001 -115429 -87613 -65543 -133576 -134467 -43697
15762 -43697 -40764 -51401 -12320 -30599 -50418 66248 123242 151475 70128 32718 39781 -18075
15750 -18075 -29423 -24519 -44518 -24955 32306 139003 -4283 -156163 -65891 7223 32636
15739 32636 37905 42127 54549 92543 75514 -33845 -143534 -178695 -225779 -250686 -184910 -48847
15727 -48847 81374 13124 -12915 54815 -9192 -113724 6985 -42627 -19204 -4272 -41982
15716 -41982 -104851 -35266 -139877 -131170 -18328 -79100 -206012 -262993 -209396 -147860 -160279
15705 -160279 -149635 -93091 -27826 -45303 -83176 -45220 -142580 -262911 -222335 -133774 -160311
15694a60311O498J01454J65720l8574n5297o0216o1439O1095J29946p6410k0162
15683g696J227L8153J37325q194j52389o2472N61n1710L2568j90583l2625J22603
15671a73232l3613m7223J39355O9433K3318O4102l7391j17865o1597j5209K4685
15660a65237Q3421j5422J3945L9600p6581n0707r7920k5925J46118K69974j9720
15649A01546o8450N9148k0796J7595M7375J9188j28900r9654p267P0516k3883
15638c3582j6039K9210L8220J07262l8087L0086O4525R138j1274k30402j09210
15627a60153O4944N4369J76478k1409n2041m3247n871m0355R505M0657L3793p5951
15615a9281m2870L6909M6682K8229L8179j891j48851j99229Q3339k2335M2104
$$ plain form
15694 -160311 -153813 -52359 113361 74787 19490 -40726 -102165 -41070 88876 12466 -7696
15683 -7696 -6469 31684 169009 160815 8426 -54046 -53485 -105195 -72627 -263210 -295835 -173232
15671 -173232 -206845 -254068 -114713 -45280 -21962 42140 4749 -113116 -174713 -189922 -165237
15660 -165237 -81816 -97238 -83293 -43693 -120274 -170981 -268901 -294826 -148708 121266 101546
15649 101546 33096 92244 71448 89043 136418 155606 26706 -72948 -80215 -9699 -33582
15638 -33582 -49621 -20411 17809 125071 86984 117070 181595 190733 179459 -50943 -160153
15627 -160153 -95209 -40840 135638 114229 62188 18941 13070 -27285 -17780 22877 56670 -19281
15615 -19281 -62151 -25242 21440 49669 87848 85957 -62894 -262123 -178784 -201119 -159015
15604a59015J57572M4279r612m2437Q5988M1562n8728q2811J4198N5710M252m8981
15592A977p2898k806O2404J26630o4733j05257j9558q421l8182P8770J6145J31646
15580A05717j5039j02024l937K629K5252m5188l0502L6157r4134M0719j8154j4704
15568a13208P5491j1090L3216M320l235k8694o998q22O0264j8373O80j2939P8624
15555E7236J6568p8300r8235O7822r936M1280r7282N6928J37187J09620M7434
15544B50322r6694p1070j07103J01751L0157j7529n8127p6787j18426j7364j7906
15533a98776L3080N6543j75n247O907L2313k8331j35385J28712O0375O7036o0458
15521d3406M923m8508l3114L3060O9884l0205p5703k0099K1892O923P696q5428
$$ plain form
15604 -159015 -1443 42836 33224 -9213 76775 118337 59609 -23202 -9004 46706 50958 1977
15592 1977 -70921 -73727 -11323 115307 50574 -54683 -74241 -82662 -120844 -42074 -25929 105717
15580 105717 90678 -11346 -15283 -12654 12598 -32590 -63092 -26935 -121069 -80350 -98504 -113208
15568 -113208 -37717 -48807 -15591 -11271 -14506 -43200 -50198 -51020 9244 -9129 -8449 -21388 57236
15555 57236 73804 -4496 -102731 -34909 -44845 -3565 -100847 -43919 93268 202888 250322
15544 250322 153628 82558 -24545 77206 107363 89834 31707 -45080 -163506 -180870 -198776
15533 -198776 -165696 -109153 -109328 -114575 -107668 -75355 -103686 -239071 -110359 -49984 17052 -43406
15521 -43406 -38483 -86991 -120105 -87045 -17161 -47366 -123069 -143168 -121276 -114353 -106657 -192085
15509a92085J2913J38169M249o3128p450K7703l3902N5418P2823M6689o5685M1692
15497C7406k6798k6677j8653K9642k5930K8284j1908O0700r848L6965K7001o5828
15485C4356K1629p2171r2288m2899r7836J70633J23545k0431p5682l7645j58187
15474b46976R1479J50757P6992K7946P8583n1046p1376N6983j0884q5244j20919
15463a03705N7702J9419k0219J54321j25727j88939K4641J68973Q9668j929L0410
15452A04615O0521l3094p0392p4411j19653l7679K34320O16j05515p5868O9036
15441d7504j60539L573J51448N3409j07157q8789J27862J8910l2948k9130Q1211
15430b9654r546N2761r2245q9850P9533J15677n2746q7557j8934l0603J6340K8288
$$ plain form
15509 -192085 -179172 -41003 -36754 -99882 -107332 -79629 -113531 -58113 14710 61399 -4286 37406
15497 37406 10608 -16069 -34722 -5080 -31010 -2726 -14634 46066 36218 73183 100184 34356
15485 34356 55985 -16186 -108474 -151373 -249209 -78576 44969 24538 -51144 -88789 -246976
15474 -246976 -155497 -4740 72252 100198 178781 127735 56359 113342 102458 17214 -103705
15463 -103705 -46003 -26584 -46803 107518 -18209 -207148 -182507 -13534 76134 74205 104615
15452 104615 165136 132042 61650 -12761 -132414 -170093 64227 64843 -40672 -116540 -47504
15441 -47504 -208043 -204470 -53022 387 -106770 -195559 -67697 -48787 -81735 -110865 -29654
15430 -29654 -39200 13561 -78684 -168534 -89001 26676 -26070 -113627 -132561 -163164 -146824 -118536
15418a18536P7701M5247O1356o9760l9390j67937j27966K7127K2040m8776Q0338
15407b58556J01456o2756N6016J08942N8476j9888o078j15377N4286o8319P5587
15396g6211J05762q0159k8962P4777p0533R7046R8805o2409q5508L577p7681j35833
15384b37329j08025P1611J57184J7896o1197J6202l1857J23567J3729l0510j4318
15373h3047L7241J9943l0527m6101M7038J14727J23870q0752j25048j24486j14319
15362b61461N9870O0198l2390M1796R0899l3436p509O8706o4657M289J11969j10838
15350g2564j41417n2321R9520J58364m2693j1695R5819R1898o5808p1155n7612
15339f9664j04392K2407J21116L4388r1811L5991N2394m7211O615K5489O2372
$$ plain form
15418 -118536 -40835 4412 65768 -3992 -43382 -211319 -339285 -312158 -290118 -338894 -258556
15407 -258556 -157100 -219856 -163840 -54898 3578 -16310 -22388 -137765 -83479 -151798 -76211
15396 -76211 29551 -50608 -79570 -4793 -75326 21720 120525 58116 -27392 -23815 -101496 -237329
15384 -237329 -345354 -273743 -116559 -98663 -159860 -143658 -175515 -51948 -38219 -68729 -83047
15373 -83047 -45806 -25863 -56390 -102491 -55453 59274 183144 102392 -22656 -147142 -261461
15362 -261461 -201591 -141393 -173783 -131987 -41088 -74524 -82033 -13327 -77984 -73695 38274 -72564
15350 -72564 -213981 -266302 -166782 -8418 -51111 -62806 33013 124911 59103 -12052 -69664
15339 -69664 -174056 -151649 -30533 3855 -87956 -51965 429 -46782 -40167 -14678 47694
15328D7694k1282J2762m3796L6212J52548l0897j54216r8132j1407p5337j18488
15317c04339O1180o53O4337O8992O3119j7827N9240P2368p6710o0955J4653l4666
15305i1261j07937j2278r783R3000R9125K3786j018j1070J17924r9675j19870
15294a19057p3460n0334J26358O9364N9364Q3238j7333n1867N0428j6293j32618
15283g2210j1169k2413K2977O9069K792Q990k9168J63769j2422j36234q2049N9879
15271c8189L2263L0363J4946P7622n9729j05521P1204J31512J1733p8562j9795
15260F7847r0274j21843J01190p2672N8058J19278J02087k9048j65439j25194
15250a56010p9040J11432P3361K6668L7438j5412N999r3747l43P9845N0612k4762
$$ plain form
15328 47694 26412 39174 -4622 31590 184138 153241 -975 -99107 -110514 -185851 -304339
15317 -304339 -243159 -243812 -179475 -110483 -47364 -65191 -5951 66417 -10293 -71248 -56595 -91261
15305 -91261 -199198 -211476 -221259 -128259 -29134 -5348 -6366 -17436 100488 813 -119057
15294 -119057 -192517 -242851 -116493 -47129 12235 95473 78140 26273 76701 60408 -72210
15283 -72210 -83379 -105792 -82815 -13746 -10954 -1964 -31132 132637 120215 -16019 -98068 -38189
15271 -38189 -5926 24437 39383 117005 57276 -48245 22959 154471 166204 87642 67847
15260 67847 -22427 -144270 -43080 -115752 -57694 61584 163671 134623 -30816 -156010
15250 -156010 -235050 -123618 -50257 -23589 13849 -1563 4436 -89311 -89654 -9809 40803 16041
15238A6041r7370j14003O3253O0858m5338J7194J26363j9289m6571P404N5077
15227B3619M7787l7637l3047J39328Q7938j5956m2315q5329J5057j8920K1590
15216A02115J4025j99289j23972l9930J56348N5048o7427M5524P346j07654k6061
15205a83927o4898J08778O8414J14728l807K8040l7219p5036K4150j7230n3218
15194i1225J5313N8074J33496P0334p4063j20922l9066R2811P2545N9719j36493
15183D0523p3467l5687j0314r4546P4613n013p6752j2121Q563O4416J6079P71
15171a02935m8810K2488P2679N0043j35919m4267P4299J32350P3844n3985J3522
15160E3309p4429k9936n2707O1991k841N372J9522k9481K7852n4588m0653L6227
$$ plain form
15238 16041 -81329 -195332 -132079 -71221 -116559 -99365 26998 7709 -38862 -31458 23619
15227 23619 71406 33769 722 140050 227988 212032 169717 84388 99445 80525 102115
15216 102115 116140 -83149 -207121 -247051 -90703 -35655 -103082 -57558 -50212 -157866 -183927
15205 -183927 -248825 -140047 -71633 43095 39288 67328 30109 -44927 -20777 -38007 -91225
15194 -91225 -75912 -17838 115658 185992 111929 -8993 -48059 44752 117297 177016 40523
15183 40523 -32944 -68631 -78945 -173491 -98878 -103891 -180643 -192764 -184201 -119785 -103706 -102935
15171 -102935 -151745 -129257 -56578 -6535 -142454 -186721 -112422 19928 93772 39787 53309
15160 53309 -21120 -51056 -103763 -41772 -44613 -39241 -19719 -49200 -21348 -75936 -116589 -80362
15148h0362J7212m4580m0849J4206l076O1527J28992J18378O0168j17443k54689
15137a40516j09290J52164J43180q7717J9896J92237Q6848p2727j10878j22892
15127d9695K0094N2907l8846j50468j6385n5498k188P3530J17609J9878j21691
15116a50753q2540R3522L7546L720n581J9086L7925O7240q8567K7522J8271R2924
15104G0315m9231K6496N7186j09337l1242k5895L2367K8081q048l0625l0587J8714
15092e1806o4001j5935P2702q891O482n2600P7759n2449n4375o1219j1941J09644
15080a06630J02100J792k7750K8682M795j2595m450j5046M5846o8680o8633o4768
15068a85337O889P7462l6158L7880M5379K9285M2171n0112N4956M195l8834J23277
$$ plain form
15148 -80362 -63150 -107730 -148579 -134373 -137449 -75922 53070 171448 231616 114173 -140516
15137 -140516 -249806 -97642 45538 -42179 -22283 169954 256802 184075 73197 -49695
15127 -49695 -29601 23306 -15540 -166008 -182393 -237891 -240079 -166549 -48940 -29062 -150753
15116 -150753 -233293 -139771 -102225 -98505 -104086 -85000 -47075 20165 -68402 -40880 -22609 70315
15104 70315 21084 47580 104766 -4571 -35813 -61708 -29341 -1260 -9308 -39933 -70520 -51806
15092 -51806 -115807 -131742 -59040 -67931 -61449 -114049 -36290 -88739 -143114 -204333 -216274 -106630
15080 -106630 -4530 -2738 -30488 -1806 2989 -9606 -14056 -29102 16744 -51936 -120569 -185337
15068 -185337 -178448 -100986 -137144 -99264 -53885 -24600 17571 -32541 22415 26610 -12224 111053
15056A11053j8771l5864m3758m864J9803N9159R339l3061Q751p462j4020q037
15044D2268q035K1789j71034j24570L4389O9205J01590J19714P3011n5593j35828
15033c3094k9155K0565O6058P3882k0044j24398M5717P8842J28982j1894l0566
15022A64895j7574l2727n6025q5081j6577K5827N793N0002q0890J1287l3525L912
15010f0683N2751M9506J05464O0000j19961p3566N527l8923O3635O836j46473
14999i5887m8202N3351L5992o1173j06900l7622J15481J66671o7513q5500n6016
14988a87318j49918M1692R6689j103R1550R303L0494K6463J05463K1018J9867
14977A04200l8150p3219K3752m182Q6743m5213k4919N7245o2714L8162K2804k4266
$$ plain form
15056 111053 92282 56418 12660 7796 27599 86758 96097 63036 71787 64325 50305 42268
15044 42268 34233 56022 -115012 -239582 -205193 -135988 -34398 85316 158327 102734 -33094
15033 -33094 -62249 -41684 24374 98256 78212 -46186 -469 78373 207355 195461 164895
15022 164895 147321 114594 58569 -26512 -43089 -17262 -11469 38533 -42357 -31070 -64595 -60683
15010 -60683 -7932 41574 147038 207038 87077 13511 19038 -19885 43750 50586 -95887
14999 -95887 -144089 -90738 -54746 -115919 -222819 -260441 -144960 21711 -45802 -131302 -187318
14988 -187318 -337236 -295544 -198855 -199958 -108408 -99105 -68611 -42148 63315 84333 104200
14977 104200 66050 -7169 16583 12401 99144 53931 29012 86257 23543 61705 84509 60243
14965F0243m3922q1558K9182j0892j78485J20517J66563P9245j0015j5159n9945
14954E5774k2804K5033J09908o9688N3045p3689j4725L4689P6299j33196p0404
14943b9758N5339l2870p8982r7306R6478Q5454q3382k8331J99742P0099q7281
14932F9202q0153J48631J79530j42884l9287L719q380j11769m8319k050q0600
14921a12360l4918q6549R2143Q6809j26989o8377O7747j0284J14758P2944Q680
14910C604j3773j00865r3643M8749M2400j15760l5607Q3901O589p5452P8885J03815
14898f7157k4920J5767K4083n9650J7986N7407K2476K313N3135l0641l1620M348
14886a6473q046j09960p515J06779P2403J0426j37716J3231R9330J28697r003
$$ plain form
14965 60243 16321 -65237 -36055 -46947 -225432 -104915 61648 140893 130878 115719 55774
14954 55774 32970 58003 167911 98223 151268 77579 62854 97543 173842 40646 -29758
14943 -29758 25581 -7289 -86271 -183577 -87099 -1645 -85027 -113358 86384 156483 69202
14932 69202 -10951 137680 317210 174326 135039 138758 130378 18609 -29710 -31760 -112360
14921 -112360 -147278 -233827 -141684 -54875 -181864 -250241 -182494 -192778 -78020 -5076 3604
14910 3604 -10169 -111034 -204677 -155928 -113528 -229288 -264895 -180994 -174405 -249857 -170972 -67157
14898 -67157 -92077 -76310 -52227 -111877 -93891 -36484 -14008 -11695 41440 10799 -20821 -16473
14886 -16473 -24519 -134479 -141994 -35215 37188 47614 -90102 -76871 22459 151156 142153
14875A42153j3870r7566l9292K3254N0285J9216K1253q2105l6108J316k9541J35812
14863I4807L9972k0548k5412q4525O9528M9472K6220J0606n0101n3447p4844m0306
14851e8578P415m6747J432l4824m0993M5412J8479Q4029j4759n4849P0614j6399
14839c9768l6554P5872M6657j3824K207N3407j5047J2734O8384R5056L8736j58481
14827A29379j74072j1158O5466J78019l8176j30853k546M1219p179L1370L6364
14816A17833m2805j16906j4074j9626O912L3400J12226l5777j4092r0471l8091
14805a01471K0331J02379j39907j17501r1513J9471K43045J31309o8236r5886
14795i7979M9688L45k4713J9627p9845P1207o396q28j00814j10217K9021o8729
$$ plain form
14875 142153 128283 30717 -8575 14679 64964 84180 105433 23328 -12780 -11464 -41005 94807
14863 94807 134779 114231 88819 4294 73822 123294 149514 160120 110019 56572 -18272 -58578
14851 -58578 -51163 -97910 -96478 -131302 -172295 -126883 -108404 -24375 -39134 -93983 -23369 -39768
14839 -39768 -76322 -450 46207 32383 34590 87997 72950 85684 154068 249124 287860 129379
14827 129379 -44693 -55851 9615 187634 149458 18605 16059 57278 50099 81469 117833
14816 117833 75028 -41878 -55952 -75578 -68666 -35266 76960 41183 27091 -63380 -101471
14805 -101471 -81140 21239 -118668 -236169 -327682 -308211 -65166 66143 -2093 -97979
14795 -97979 -48291 -47946 -72659 -53032 -132877 -61670 -68066 -68894 -169708 -279925 -250904 -319633
14783c19633N814J86019L9252j9317N5931J18254K033p2182j0442k73L2168m5993
14771b8369j29904M1158j1616l5143O1467j7625q4744N177J12774N1401M7732
14760A2308l0631N1194R0454q390n7223j20559j88015j16361L0618K06765R5886
14749c3954R3925O2156k6946k13968l4738M9364K07095J0413l1638r4896n1868
14738f5055O2223J16058J05059p9434k0009m4884j04367p4919O2401j0685M6102
14727g510N3799p9145K5649K2573l0767O8384K7719O2458p2766r9478j71011q655
14715b08750J98940O3102n9783L046L533j46243j08070l1529L5140N7647R6816
14704i6151K0231p8204L0493J33276j1686j5271J00925q639J49798p2105k55782
$$ plain form
14783 -319633 -313819 -127800 -88548 -107865 -51934 66320 68353 -3829 -14271 -14544 17624 -28369
14771 -28369 -158273 -117115 -128731 -163874 -102407 -120032 -204776 -199599 -86825 -35424 12308
14760 12308 -18323 32871 123325 114935 57712 -62847 -250862 -367223 -336605 -129840 -33954
14749 -33954 59971 122127 95181 -118787 -153525 -104161 102934 113347 81709 -13187 -65055
14738 -65055 -2832 113226 218285 138851 118842 73958 -30409 -105328 -42927 -53612 -7510
14727 -7510 46289 -32856 -7207 15366 -15401 52983 80702 143160 70394 -29084 -200095 -208750
14715 -208750 -9810 53292 -6491 -3445 88 -146155 -254225 -285754 -250614 -192967 -96151
14704 -96151 -75920 -154124 -123631 9645 -2041 -17312 83613 74974 224772 152667 -103115
14693a03115j03956m739J86528N3239M2513M028j33710j60679J00785R4383M6221
14682B1498k6064j8398r8001n1173N020O34m6134P6470K9643k9760N7164L9632
14670c9469o9523N0503P8904j23003q7568N714o9421P5185J7063N726O0777J18839
14658B3727j01123J852J2039N7444l1760M2600L6182m2947o355j30156m4834k0382
14646b03713N319m3361J17812P0832J2734n233P4167k480n766K6175l5616j34435
14634a23565p8799k4098P1912k7362o457J01448M7431N8817J0539q4417q0209
14623a34760N1996O9739m933N7824j22619n1950J49556o498r5291L3076J5264
14612c8596R9413K4496m7673M5140l7807m9648K9089P7305P6633m16m4030j09580
$$ plain form
14693 -103115 -207071 -211810 -25282 27957 70470 74498 -59212 -219891 -119106 -24723 21498
14682 21498 -4566 -22964 -120965 -172138 -167118 -166484 -212618 -136148 -106505 -136265 -79101 -39469
14670 -39469 -108992 -58489 20415 -102588 -190156 -184442 -253863 -178678 -161615 -155889 -95112 23727
14658 23727 -77396 -75544 -63505 -6061 -37821 4779 40961 -1986 -8341 -138497 -183331 -203713
14646 -203713 -198394 -241755 -123943 -53111 -40377 -45610 28557 26077 20311 46486 10870 -123565
14634 -123565 -202364 -226462 -154550 -181912 -188369 -86921 -39490 19327 29866 -54551 -134760
14623 -134760 -82764 -13025 -17958 39866 -82753 -134703 14853 8355 -86936 -53860 -38596
14612 -38596 60817 85313 37640 82780 44973 -4675 24414 101719 178352 177936 133906 24326
14600B4326l7587k8305k3824r2205M1597Q8495o5624q9019r172j705J02365J0798
14588g9860J04629Q2484J2160n3452o9541K5509O2583p8499O0376O5215N5165
14577A86769p8244j82998j12756O3391M5497J6261l042J15485J28487j39916p9842
14566d0908k3321j94047J54407q634P363L374j7553M8517J58063N2576n3547m5058
14554D1232R4474m8528j76212j11478K4383N290O6759R9290N2961N750L0135O2317
14542A46373p0249m0519M9617J57264l6789k59861j53453J52521N7467m1871R2369
14531E2869J20392q8397n2664L3459K1595j34391m6250p9613Q6029K17539m8465
14520H2103j01118M0339J7344m6884j14354M7901Q0557O2229l2857j21624o4251
$$ plain form
14600 24326 -13261 -41566 -65390 -157595 -115998 -27503 -93127 -182146 -191318 -193023 -90658 -79860
14588 -79860 24769 107253 119413 65961 -3580 21929 84512 6013 66389 131604 186769
14577 186769 108525 -74473 -187229 -123838 -78341 -62080 -65122 50363 178850 38934 -40908
14566 -40908 -64229 -258276 -103869 -112503 -105140 -101766 -119319 -70802 87261 139837 86290 41232
14554 41232 135706 87178 -89034 -200512 -176129 -170839 -104080 -4790 48171 53921 84056 146373
14542 146373 76124 35605 85222 242486 205697 -54164 -207617 -55096 2371 -39500 52869
14531 52869 173261 84864 32200 65659 87254 -47137 -93387 -173000 -86971 130568 82103
14520 82103 -19015 21324 38668 -8216 -122570 -74669 5888 68117 35260 -86364 -150615
14509a50615o9420J11416l8593K0021O2254q0480J88524R6378K5506Q9582k8902
14498B25671m3712j36698J0198l8569m546q4566j03755M7653J3551q6569m5652
14487b46994Q4375O4547m788n3517o2836Q4381Q2525R2600O2910O2272n9502j7551
14475H8422J903R6630n1244J8727Q4587l725O4597j5760j46824l1792l756j06877
14463e112L0161M3946q0996l1386N3262n5003l414j9223j15741l5629l1398J8684
14451b31849N2327P6405J56661K12892M5638j20492j65212j69373J01440J17239
14441G5676P830K4187P3008K1242N8787l9155o9741n5793L9370P2111k1247j08419
14429G7856K0772o225n1336O3769m3289n2160L7512l7869l3821r3832j30062R4187
$$ plain form
14509 -150615 -220035 -108619 -147212 -127191 -64937 -145417 43107 139485 164991 254573 225671
14498 225671 181959 45261 55459 16890 12344 -72222 -175977 -128324 -114773 -201342 -246994
14487 -246994 -162619 -98072 -102860 -156377 -219213 -134832 -52307 40293 103203 165475 105973 88422
14475 88422 90325 186955 135711 154438 239025 235300 299897 284137 137313 105521 101765 -5112
14463 -5112 25049 68995 -12001 -43387 9875 -45128 -48542 -67765 -183506 -219135 -250533 -231849
14451 -231849 -179522 -103117 53544 266436 312074 191582 26370 -143003 -41563 75676
14441 75676 83506 107693 180701 201943 260730 221575 151834 96041 135411 207522 186275 77856
14429 77856 98628 92403 41067 104836 61547 9387 46899 9030 -24791 -118623 -248685 -154498
14417a54498P7544p9767M030J1883L4546P2943Q5767L5486r4690j06348j7902
14406a31006j7823L6264o739M2742j3700K4267O6088l3211L8117R4761l4417K7276
14394I2619J26893O1926k8652J6419m2311q9708q2959r3850j5797Q8823J46951
14383A80354r157q7343j58935l4796r4305k0502R5640O8949o585l4398L8075P8956
14371A5953Q4274J16315K5258o4313j6761j38905j34609P039J41558O6618N0766
14360A53193M5711M4990q218r8993m2567J55924n5266k2212j79732p6653r3969
14349a77792q9741o2584J02860O9743N8552J4311k0324m1981L5915J13037L6648
14338C8644K0033L5831J5012j36214o4858k3368j5136j1843K6902J734M6241R0272
$$ plain form
14417 -154498 -76954 -156721 -152691 -140808 -106262 -33319 52448 87934 -6756 -113104 -131006
14406 -131006 -148829 -112565 -119304 -76562 -90262 -65995 93 -33118 4999 99760 65343 92619
14394 92619 219512 281438 252786 269205 226894 137186 54227 -39623 -55420 33403 180354
14383 180354 171197 83854 -75081 -109877 -204182 -224684 -129044 -60095 -66680 -101078 -63003 15953
14371 15953 100227 216542 241800 177487 160726 21821 -112788 -105749 35809 102427 153193
14360 153193 198904 243894 235676 136683 94116 250040 194774 172562 -7170 -83823 -177792
14349 -177792 -267533 -330117 -227257 -157514 -98962 -84651 -104975 -146956 -111041 1996 38644
14338 38644 58677 94508 109520 -26694 -91552 -114920 -130056 -141899 -114997 -113263 -67022 23250
14326B3250r1700j83990l1310K21645l24j58222k8640J26641R3998q8265K4979
14315i1938l8356N4K5620L1234l1873K5822r0298L5814K8704k7541L890O2598
14303f6270r7760p169K0650n8169K6642N7384J20480p7017J0579Q4913J75741
14292A90004J16682o5186j26499M757O1629M6330j81289m4258j3710l7576k1385
14281g0501J17843R9534n6280q8976k8781q0216M2818J82235J07877m7701n1719
14270A26133o6157j38056O3581m5503j73956J53125K10102n9774j84180K3041
14260i1644J50146L3885l413O1703n1490j6801o1122n2330P009N6102n3294M0371
14248A9122K8562j18098O0980O8521m2608L1705j10594j04532r0976k7691O7695
$$ plain form
14326 23250 -68450 -252440 -283750 -62105 -62429 -220651 -249291 -122650 -28652 -116917 -91938
14315 -91938 -130294 -130240 -104620 -73386 -105259 -79437 -169735 -133921 -105217 -132758 -128868 -66270
14303 -66270 -164030 -171199 -150549 -208718 -182076 -124692 -4212 -81229 -70650 14263 190004
14292 190004 306686 241500 115001 119758 181387 227717 46428 2170 -11540 -49116 -70501
14281 -70501 47342 146876 90596 1620 -27161 -107377 -64559 117676 225553 177852 126133
14270 126133 59976 -78080 -14499 -60002 -233958 -80833 129269 69495 -114685 -91644
14260 -91644 58502 92387 88974 150677 99187 82386 21264 -31066 -24057 32045 -21249 19122
14248 19122 47684 -70414 -9434 59087 16479 48184 -62410 -166942 -257918 -285609 -217914
14237b17914P5177K5996J00798n9032j3920J10834j9419j01730n815J67181j7472
14226D4684o3762j2367J37904J55282q4563k23201l5302J08189N9340r9104L640
14215i260K0429n621l8533n6615m4457J57239j0228q671k1001m0944l7997k4484
14203a20143K3575M6652r8167q6998J79763J44209l7434p1958m8207m055J01470
14192B8707j10846j7224M115n7330o9431J20028Q8556q7013J4096R1139j74618
14181a69821q7928j3046N7531J13421Q1864J2827O123K2868o0403k7222l1142
14170i4928R7933o2206p6180R6658j28257O9354J47699n2453q2614k2733P6669
14159c1058R6025P4519j33969o3944n8026J20109N5890j3009j0927o6530q6798
$$ plain form
14237 -217914 -142737 -116741 -15943 -74975 -88895 21939 2520 -99210 -105025 62156 44684
14226 44684 -19078 -31445 106459 261741 177178 -46023 -81325 26864 86204 -12900 -9260
14215 -9260 11169 5548 -32985 -89600 -134057 23182 12954 4283 -16718 -57662 -95659 -120143
14203 -120143 -96568 -49916 -148083 -235081 -55318 88891 51457 -20501 -68708 -72763 28707
14192 28707 -82139 -99363 -95248 -152578 -222009 -101981 -13425 -100438 -86342 4797 -169821
14181 -169821 -257749 -270795 -213264 -99843 -17979 -5152 971 23839 -36564 -63786 -94928
14170 -94928 3005 -59201 -135381 -38723 -166980 -97626 50073 -2380 -84994 -107727 -31058
14159 -31058 64967 139486 5517 -58427 -116453 3656 59546 46537 35610 -30920 -117718
14148a17718J3849R3858J87323j4016p4410j15104q6624k180n4055j7489j6550
14137b03116J1862K4803Q0402k1789r9892N6702J4247M6700J7228R9741P5871
14126A02759l5327P6455R3375k1456O717p9622p6358m5909j13043J5693J9121
14115e7595K0786p5598p4537O3074J1948j0481k7083L6096J1684p4891q3407O245
14103b53759Q8149j6817k9651L6160K530P8033J9513L7193m1164o0946j12110
14092b52869n8607K9838N2082Q8070R6128q8894k900R6357P3550O0860m1753j3592
14080C8270r4693q8919j04978J12046m134k4420J48169K61852j8579q9041K6494
14069A62067L1053J8872o9364q6514O7015K5736n3459j39533j77332Q6305L2824
$$ plain form
14148 -117718 -103869 -10011 177312 163296 88886 -26218 -112842 -115022 -169077 -186566 -203116
14137 -203116 -191254 -166451 -86049 -107838 -207730 -151028 -136781 -90081 -72853 26888 102759
14126 102759 67432 143887 237262 215806 222523 142901 66543 20634 -92409 -76716 -57595
14115 -57595 -36809 -112407 -186944 -123870 -111922 -122403 -149486 -113390 -101706 -176597 -260004 -253759
14103 -253759 -165610 -182427 -212078 -175918 -173388 -95355 -75842 -38649 -79813 -140759 -252869
14092 -252869 -311476 -281638 -229556 -141486 -45358 -134252 -137152 -40795 32755 93615 51862 38270
14080 38270 -56423 -145342 -250320 -138274 -142408 -166828 -18659 243193 224614 135573 162067
14069 162067 193120 211992 142628 56114 123129 148865 95406 -44127 -221459 -135154 -102330
14058a02330O5627Q8463N1583j03309j37716k7310P4452K7866r094p6295J2950
14047a35113J5089J3196j07737J12781J62770q6863q7513p7956j34097L0935J39641
14036a54867O6104l2963K346L6225J02771N2302N3790p1080k9472k0486j18828
14025a14158l3477R0625O4461j7906j22103M9595J16299j2651q9198k7192n2537
14014a48242q928q2581O9597O5081n0822N5409O2721m2960r0625n9570l9654J75616
14002i4958K79863j2804j22710o7559j5911l1099K0286k034P340J3238q2168m6409
13990a54925j57180l9001J35112K08272O5262o0123l1995n7690P1490Q4574j571
13979F2225J5922J17147m2717n0705j3849p8098O7577Q818k0558l3401r8707K5823
$$ plain form
14058 -102330 -36703 51760 103343 34 -137682 -164992 -90540 -62674 -71768 -148063 -135113
14047 -135113 -120024 -106828 -214565 -101784 60986 -25877 -113390 -191346 -325443 -294508 -154867
14036 -154867 -88763 -121726 -119380 -83155 19616 71918 125708 54628 25156 4670 -114158
14025 -114158 -147635 -57010 7451 -10455 -132558 -82963 33336 20685 -68513 -95705 -148242
14014 -148242 -157170 -239751 -170154 -105073 -155895 -100486 -37765 -80725 -171350 -230920 -270574 -94958
14002 -94958 184905 172101 49391 -18168 -34079 -65178 -44892 -46926 -39586 -26348 -108516 -154925
13990 -154925 -312105 -351106 -215994 -7722 57540 -2583 -34578 -92268 -20778 63796 62225
13979 62225 78147 195294 152577 101872 88023 9925 77502 86320 65762 32361 -66346 -40523
13967d0523k0185k5292m3851N3722M5776L4236N3006J3531j04032o9887L8094
13956f5405P5448k8377K228q8486j3516j24083P9474R0469L4227n0249r5156J48092
13944c5334Q8146j9731m294J9293o0467J3517J5611L8433p1288p6067J3665J03956
13932B5440K0343m8768m3271N2260j0755l8599J08317N6796k8770k8863m3619
13921B0511k8667j37493K4638R8013M9393O4885K5496j13376o0637J9954j20620
13910a57903k770J66052m888r2995r667k5606L1503J09172N6680n6594q9447N2762
13898b3701j2049Q2841J01194N0732k9868j3418o5001n4718q400P7703P6278j13868
13886F7725K8082O4369o9501j39083n9892o5966m8081P1582Q9231M9301q4338
$$ plain form
13967 -40523 -60708 -86000 -129851 -76129 -30353 3883 56889 70420 -33612 -103499 -65405
13956 -65405 10043 -18334 -16106 -104592 -118108 -242191 -162717 -72248 -38021 -88270 -183426 -35334
13944 -35334 52812 33081 28787 48080 -12387 1130 16741 55174 -16114 -92181 -78516 25440
13932 25440 45783 -2985 -46256 6004 -4751 -43350 64967 121763 92993 64130 20511
13921 20511 -8156 -145649 -121011 -22998 26395 91280 116776 3400 -57237 -37283 -157903
13910 -157903 -160673 5379 491 -92504 -102171 -127777 -96274 12898 69578 12984 -76463 -23701
13898 -23701 -35750 47091 148285 199017 169149 155731 90730 36012 27612 105315 181593 67725
13886 67725 95807 160176 90675 -48408 -108300 -174266 -222347 -150765 -61534 -12233 -96571
13875i6571q3842R8623Q9619M7143J2409m6491M0058r9453o2686N4896O2954K7336
13863D3995J8630p4300l4707R4029o167j07066q3420r246O5564M1560l461L7971
13851a6618Q136N4106p471k1290r5121j15294q7149J13181Q8446p1172r3823J17625
13839a26444J13650M8989N4677m499j07687M6196P2803k1803q6338k8775J45953
13828A06722L5763o9757m864m4694o0383k317N5327P0273n1808j45667l6868m0636
13816a88909L7439K4776m7592Q4531P9466k1823p755P9296N7631n1103N4765m335
13804I6387l4157j15888j06883r254L9143n7403J1483N7430K2206M7201n1732
13793a01467K1552J00846p7032l9494j3741L7949j26033M1933O8865N8829R8877
$$ plain form
13875 -96571 -180413 -81790 7829 54972 67381 20890 60948 -38505 -101191 -46295 16659 43995
13863 43995 62625 -11675 -46382 47647 41480 -65586 -149006 -158252 -92688 -51128 -54589 -16618
13851 -16618 -8482 45624 38153 16863 -78258 -193552 -280701 -167520 -79074 -150246 -244069 -126444
13839 -126444 -12794 36195 90872 86373 -21314 24882 97685 75882 -10456 -39231 106722
13828 106722 142485 72728 67864 23170 -37213 -39530 15797 86070 34262 -111405 -148273 -188909
13816 -188909 -151470 -126694 -174286 -89755 -10289 -32112 -39867 39429 97060 45957 100722 96387
13804 96387 62230 -53658 -160541 -169795 -130652 -188055 -176572 -119142 -96936 -49735 -101467
13793 -101467 -79915 20931 -56101 -95595 -109336 -71387 -197420 -155487 -86622 -27793 71084
13782G1084M6377L0414o3531p0292M9321n6595p0702K2706R4540M4802j3933L172
13770H7363J17288K7103n9015k43952j01604N2037J22864K511j54069o1813L9922
13759a71365n9719N9083J19701N7598J2421M4874K2487q4653p2390J3107L2978
13748b5878m1019r2256R839l050M3507N1078p2190p4356J00269J5958K8830Q1873
13736B2605P7330L2032J31n8310n3801M9235j5119l8063R74N253L346P5985j2025
13723H9573j24688K7867J24175l5823j18695k8754N6178R4017P7370L2621n073
13712A88768N2086k46647j64035P603Q0121J1693j07219k8911J4931N6216N5731
13701g9663R3641J43430Q053j25577j03658m0155J5545J01956J06342J7052q6677
$$ plain form
13782 71084 117461 147875 84344 14052 63373 6778 -63924 -41218 53322 98124 84191 87363
13770 87363 204651 231754 172739 -71213 -172817 -120780 2084 4595 -149474 -211287 -171365
13759 -171365 -231084 -172001 -52300 5298 17719 62593 85080 427 -71963 -58856 -25878
13748 -25878 -66897 -159153 -149314 -152364 -108857 -57779 -129969 -204325 -104056 -88098 -59268 22605
13736 22605 99935 131967 132098 73788 19987 69222 54103 16040 17014 22267 25613 101598 89573
13723 89573 -35115 -7248 116927 81104 -37591 -66345 -10167 83850 161220 193841 188768
13712 188768 240854 -5793 -169828 -162225 -82104 -70411 -177630 -206541 -191610 -135394 -79663
13701 -79663 13978 157408 165461 39884 -63774 -103929 -88384 13572 119914 136966 50289
13690E0289J2216K6238K1131n6684j71773j38980L0427P9482P4220J1985J24347
13679F2898J25518q6754j54371k8767k2055Q6817N142L7556p2222p336K0303P077
13667b6194L4132j5033J401l2574R4000J44735r8153p0049M8082j5637j06686
13656d1976J4607L0468J29852K9125l8084k2903k1238n1403j13703p7816j2355
13645a75426K2606m829J04364J77365j0170q2956L3794k7391M695O1041P541K0290
13633A30924q466q6333j06193l1871o9423m0523J39497M4828l0266J38747K6000
13622A06921r9052J7578O6222O2083m1630r05J4562k7816j83146m9839n144J3325
13610a26841p0532M3002P5747q5964l4246N9934O6885J05548M4104K8700j39205
$$ plain form
13690 50289 62505 88743 109874 53190 -118583 -257563 -227136 -147654 -73434 -61449 62898
13679 62898 188416 101662 -52709 -81476 -103531 -16714 -11572 25984 -46238 -53574 -33271 -26194
13667 -26194 7938 -7095 -5694 -38268 55732 200467 102314 32265 80347 64710 -41976
13656 -41976 -27369 3099 132951 162076 123992 101089 79851 28448 -85255 -163071 -175426
13645 -175426 -152820 -157649 -53285 124080 113910 30954 64748 37357 42052 103093 110634 130924
13633 130924 122458 36125 -70068 -101939 -171362 -211885 -72388 -27560 -57826 80921 106921
13622 106921 7869 25447 91669 153752 112122 111217 125779 97963 -85183 -135022 -140166 -126841
13610 -126841 -197373 -154371 -78624 -164588 -198834 -138900 -72015 33533 77637 106337 -32868
13599c2868o9638K2478J25677q0148J03556L6178L9951n8929Q7268K783j57446
13588A8862p9541m4475p3218N5302N5895P5688k2668Q1913n6145n3311N9664O0485
13576G8451m2113L9303Q6531N840q847M4341q6539k6930P495n3643k2595j7433
13564C861l1207Q0620l8717j31222K3445J28226P3657k593L0211j21097l8197
13553b3013L9848j3451K0644p1919k6621k436J8879Q9363J22546R4660o9847k38311
13541e9658m4497J47100J22770j69859j0931k0487K5237R1507j8797K4334R042
13530I5761n7087J04357O06p4422r5096J3423M9922J7521q7769K7677n1122M1652
13518a4577R611q962J4757M576J42665n1943o3898n6154p8655o0850k0772O8519
$$ plain form
13599 -32868 -102506 -80028 45649 -34499 69057 105235 145186 86257 173525 176308 18862
13588 18862 -60679 -105154 -178372 -123070 -67175 8513 -14155 67758 11613 -41698 17966 78451
13576 78451 36338 75641 162172 168012 159165 203506 116967 90037 97532 43889 21294 3861
13564 3861 -27346 53274 14557 -116665 -93220 35006 108663 106070 136281 15184 -23013
13553 -23013 16835 3384 24028 -47891 -74512 -76948 -58069 31294 153840 248500 178653 -59658
13541 -59658 -104155 42945 165715 -4144 -15075 -35562 -10325 81182 62385 86719 95761
13530 95761 38674 143031 143637 69215 -25881 -12458 37464 54985 -32784 -5107 -56229 -14577
13518 -14577 -4966 -13928 829 5405 148070 96127 32229 -23925 -102580 -163430 -184202 -115683
13506a15683M6066n0595k1840R5202k6881M392j3661j7008K5751J88156J41931
13495B55830j10256j62711q2363m8952J06130p9979k0374J19928M0363l1173j08700
13484a22257k0528J14593J13420l1438m8228j3719J21665P107M0211o0607n0126
13473E0093o4992j1807O6830J3912M3050N1233m5052p6860j90843J13761J24170
13462G3495j3424m3505m4191P8261K8020N099j01575m9299J1821M7712m435m9231
13450f1252q3950M6770k1000P9378J03791n6219Q2455R1436K16q9022P4203M1327
13438B08133j84139m4240P300j4944q6243j416N5671r483j3328J39614K6099m9782
13426C3242N0783p7488o9500n2767J59497L4713k33725J9346R8582J82004L0114
$$ plain form
13506 -115683 -69617 -120212 -142052 -46850 -73731 -69339 -83000 -100008 -74257 113899 255830
13495 255830 145574 -17137 -99500 -148452 -42322 -122301 -142675 -22747 17616 -13557 -122257
13484 -122257 -142785 -28192 85228 53790 5562 -8157 113508 120615 160826 100219 50093
13473 50093 -14899 -26706 40124 54036 97086 148319 103267 26407 -164436 -50675 73495
13462 73495 60071 16566 -27625 50636 78656 83755 -17820 -67119 -55298 -7586 -12021 -61252
13450 -61252 -145202 -98432 -119432 -40054 63737 7518 89973 181409 181625 92603 166806 208133
13438 208133 23994 -20246 -12946 -27890 -114133 -115549 -59878 -69361 -82689 56925 83024 33242
13426 33242 84025 6537 -62963 -115730 43767 78480 -155245 -135899 -37317 144687 174801
13415A74801j02211n4707j6306o1313m7789O8925N8049j61154j08189J47087j6295
13404a19102j3573L2651J21877o673k896m7789J8911K2926Q930J2087q370r9313
13392h0334J6202q4667J30346j1581r1739l2643q9484J27730K3667k1841j7873
13381a32217q150j0701J03960J00396O4068j03228k5157l1775p4912p9572J3198
13370a84090O7274J2662p8340m9182J57260P6042j6732Q310J8251k2120j854J7587
13358E068j01229L1202Q4372k4352r4763R4671Q1546K3588M885n9283m0943K772
13346G534n6832O8685m078p1497J21043J9129j01708j73467L6867O2923J46718
13335E5317J22823l5906n6719M9234N5847K0308K4513j44293j55775n2988n6782
$$ plain form
13415 174801 72590 17883 1577 -59736 -107525 -38600 19449 -141705 -249894 -102807 -119102
13404 -119102 -132675 -100024 21853 15180 12284 -35505 -16594 6332 15262 27349 18979 -80334
13392 -80334 -64132 -148799 -18453 -30034 -121773 -154416 -243900 -116170 -92503 -114344 -132217
13381 -132217 -140367 -151068 -47108 53288 117356 14128 -11029 -42804 -117716 -197288 -184090
13370 -184090 -116816 -104154 -182494 -231676 -74416 1626 -15106 -6796 11455 -10665 -12519 5068
13358 5068 -96161 -64959 19413 -4939 -99702 -5031 76515 100103 104988 45705 4762 7534
13346 7534 -49298 19387 15309 -56188 64855 83984 -17724 -191191 -154324 -91401 55317
13335 55317 178140 142234 85515 134749 190596 210904 235417 91124 -64651 -117639 -174421
13324a74421n2775K04869J47502J14820j37509J9291p5101l658N3973L0034j19085
13313G940p7075L0953j2688J09350l512O3233n952j26644p9074j9596R6955m1419
13301e7529j09256P5894o704j8575n5702o4138J13519P2393j3467l0197m6097
13290a39859P2820l6837P0033J07855p2528j27125J1441L6600O861J8427P859
13279d4453l3562N9898L764m8304n3098O3484R1650l0654O5141J08759o4112j25431
13267f918k4578M4925O34J37199Q981j38962j9769J4801J18099J39779j00829
13256A73362p1279J6992n6785J722n1807j1606k8430j9768J13028J53108r0519
13245A28018n8157j08964l0843P3890o1289O5218L2194o1838L3541n2039M5799
$$ plain form
13324 -174421 -227196 -22327 125175 239995 102486 121777 46676 43018 96991 127025 7940
13313 7940 -69135 -38182 -50870 58480 54968 118201 112249 -14395 -93469 -113065 -16110 -57529
13301 -57529 -166785 -90891 -97595 -116170 -171872 -236010 -122491 -50098 -63565 -93762 -139859
13290 -139859 -67039 -103876 -33843 74012 1484 -125641 -114200 -77600 -70739 -52312 -44453
13279 -44453 -78015 -18117 -14353 -62657 -115755 -52271 39379 8725 73866 182625 118513 -6918
13267 -6918 -31496 13429 14063 151262 160243 21281 1512 16313 134412 274191 173362
13256 173362 102083 119075 62290 64012 12205 599 -27831 -47599 65429 218537 128018
13245 128018 69861 -39103 -69946 3944 -57345 7873 40067 -21771 11770 -40269 5530
13234E530J01679r2766J8275P450N131r3515l0648J76005R7193j46125j02873
13223e4664n2219N6156o732J02440R5935m5517n873J698n7496j07751k7449p3914
13211a75386j8083K29016J9612o4596P8331M2296j63512l6649K7991o4295l5060
13200a60335R5045R6557J57907j25229j29342n0144O1973L6435R2597M3064j8585
13189I9943k125k3086l0660J1773Q0960p6436M3532l942r071o6386j17450O0070
13177c2878Q8443R3334M7588j6869j548j24521j39854R154M2902Q3016L4Q2343
13165A31144Q396J5553o99k6981p0957k9623j26950m6237l5202J00646N7434M9852
13153B6376p8760n4792q6794l9104J23481j8723M2937K6543o4220O8506j7910
$$ plain form
13234 5530 107209 14443 32718 40168 45299 -48216 -78864 97141 194334 48209 -54664
13223 -54664 -106883 -50727 -57459 44981 140916 95399 89526 91224 33728 -74023 -101472 -175386
13211 -175386 -193469 35547 55159 -9437 68894 111190 -52322 -88971 -60980 -125275 -160335
13200 -160335 -65290 31267 189174 63945 -65397 -115541 -53568 -17133 75464 118528 99943
13189 99943 97818 74732 44072 55845 136805 60369 103901 99959 90888 24502 -92948 -32878
13177 -32878 55565 148899 196487 179618 178070 53549 -86305 -77151 -34249 48767 48801 131144
13165 131144 139540 155093 154394 127413 56456 26833 -100117 -146354 -181556 -80910 -23476 26376
13153 26376 -52384 -107176 -193970 -233074 -109593 -128316 -85379 -58836 -123056 -54550 -72460
13142g2460M1532m1825m1212K8395L2929L2581j08091J3923M0095P2240L0840
13131B8947Q916o9617J18723K9851M9098r3917j33470l5430L1892J44498M9479
13120A28970Q6279j4751j20087m3390o0717q391J33511J42083p763L5270l9041
13109B31973j92533K09l0296l7857n277l7624j1740J5521o8489l6782P9969J61770
13097F8844J235n445k606k3187R18N974n6645q5272m0832k4333J18247J87477
13085A44375p865j20535k6996l0464K5258l4368L7094j6733n8617o8148k0541
13074a77540O5381N6058k9104P4948J5631J1858J13229L2926q9669P7934j31814
13063A9838o3145J0860J47950Q8183J11376K0198j81938j77588j44157J407n2386
$$ plain form
13142 -72460 -30928 -72753 -113965 -85570 -52641 -20060 -128151 -114228 -74133 -1893 28947
13131 28947 37863 -31754 86969 116820 165918 72001 -61469 -96899 -65007 79491 128970
13120 128970 215249 200498 80411 37021 -23696 -32087 101424 243507 235744 271014 231973
13109 231973 39440 39649 9353 -28504 -33781 -71405 -83145 -67624 -136113 -172895 -92926 68844
13097 68844 70079 64634 62028 38841 39759 45733 -10912 -96184 -137016 -161349 -43102 144375
13085 144375 136510 15975 -11021 -41485 -16227 -50595 -13501 -30234 -88851 -156999 -177540
13074 -177540 -112159 -56101 -85205 -10257 5374 17232 130461 163387 73718 151652 19838
13063 19838 -43307 -32447 115503 203686 315062 335260 153322 -24266 -168423 -167016 -219402
13052b19402M8913J67940P5850o9169j10355m9444M2669P251M9311k77P699m0201
13040h9215m3844K7051R8253R3463n9692p6975j13517k7495J91340j4852k6498
13029d1981Q195l5689k0512Q1013q2564J1364K4942P1632J7455J4217j14477J6196
13017e0209M6116L3967o946j29521J13654R0735j0049o5539k0342o8789K5589
13006d1334j7577j24838Q7604J36309M5637m4226p8083N7266o7395L7170K7524
12995A8057j31847n0124l3627R9360K4158L8696Q4007L8277P3485J8858j16873
12984F2427j01225k8124M1299M2094K9439j10756o0851j731R4157R7004R8425
12973A62158j9923J2508l4184j19484o9720O9870L6581O4178K6644j06637n3595
$$ plain form
13052 -219402 -170489 -2549 73301 4132 -106223 -155667 -112998 -105747 -56436 -56713 -49014 -89215
13040 -89215 -133059 -106008 -7755 85708 26016 -50959 -164476 -191971 -631 -15483 -41981
13029 -41981 -33786 -69475 -89987 -8974 -91538 -80174 -55232 16400 33855 48072 -66405 -50209
13017 -50209 -4093 29874 22928 -106593 7061 97796 87747 22208 1866 -66923 -41334
13006 -41334 -58911 -183749 -96145 40164 85801 41575 -36508 20758 -46637 -9467 18057
12995 18057 -113790 -163914 -197541 -98181 -74023 -35327 48680 86957 160442 179300 62427
12984 62427 -38798 -66922 -25623 16471 45910 -64846 -125697 -127428 -33271 63733 162158
12973 162158 142235 154743 120559 1075 -68645 1225 37806 101984 128628 21991 -31604
12962c1604Q5672L4681j33494N6639J30694q124k7781M0875N3461j9090o1363
12951A20566l5445r2844o8750m9327J119J41462J47718p0259k157L3252O134p7767
12939E3702L2267q5024j25407l4998L5293P7541j46p9932j04124J14756R9068
12928a7004P2595L5571n3622M8506R9215n6218j91123J41Q9994l1737p2789m009
12916h0480K6379m8368r664K3210k253J4042Q0597N1539o6774o7785J003J26309
12904D7755Q7958o7798k309Q70n1627N2090q4107l7311m3360R1945K8431N8556
12892H1093j1891L8121r507m0886r6631n1669L2406N7299M6174n2869O5295l1509
12880B5426j31392j25547K33241J42131n7820J9919O8020K7534q4685l0853p2181
$$ plain form
12962 -31604 54068 88749 -44745 11894 142588 134464 106683 147558 201019 181929 120566
12951 120566 85121 -7723 -76473 -125800 -124681 16781 164499 94240 92083 125335 131469 53702
12939 53702 85969 945 -124462 -159460 -124167 -46626 -46772 -126704 -230828 -116072 -17004
12928 -17004 55591 91162 37540 86046 185261 129043 -62080 -61939 28055 -3682 -76471 -80480
12916 -80480 -54101 -102469 -112133 -88923 -91176 -77134 3463 55002 -11772 -79557 -78554 47755
12904 47755 135713 67915 65606 66476 14849 66939 -17168 -54479 -97839 -5894 22537 81093
12892 81093 69202 107323 97816 56930 -39701 -91370 -58964 -1665 44509 -8360 56935 25426
12880 25426 -105966 -231513 1728 143859 86039 105958 173978 201512 116827 85974 13793
12869A3793p6494O4392R7721o1865p8288m075O0433O3413L0265j03648j28744
12858a23097K7128j15737K4116N4843K6708K3253N6540J24864O1239M5576k4830
12847A80603m2879j06379l16L7160K8425k4142j7781r8266R3273J18728q2037
12836H6389P1607o0585o8139n7492J6323m6801l3362Q7299l5982j05428O4779
12825h1392O8681O143N4023O6439o306q792o5336k0818J16438k3558j31161n4720
12813h0359J37253J19115R821j6697k7109n2279m4868P311M8995p8108r9304K5512
12801e0717K08154J26548J5559m2572p4408j561j18869p1017J718k4130O2996
12790C1701q516N1782K4005P207k9780o043N1728r9129m446L6341K0783l5461
$$ plain form
12869 13793 -62701 1691 99412 37547 -40741 -44816 15617 79030 109295 5647 -123097
12858 -123097 -95969 -211706 -187590 -132747 -106039 -82786 -26246 98618 159857 205433 180603
12847 180603 137724 31345 31029 68189 96614 72472 54691 -43575 49698 168426 86389
12836 86389 157996 97411 29272 -28220 -11897 -58698 -92060 -4761 -40743 -146171 -81392
12825 -81392 -12711 -6568 47455 113894 107588 98796 33460 12642 129080 105522 -25639 -80359
12813 -80359 56894 176009 185830 169133 142024 89745 44877 52188 101183 23075 -76229 -50717
12801 -50717 157437 283985 299544 256972 182564 181003 62134 -8883 -7165 -31295 31701
12790 31701 23185 74967 98972 106179 76399 70356 122084 22955 18509 54850 75633 40172
12778D0172q0340J4535o7259R6839K1406K1105n7153j861J0587p6916J17946O7616
12766A06677j2822r2938J6693J20953o0529r7717m5906m2346p2697L6810L4155
12755a09667J78605P433m6595m3722L9624J22784l5634q7671j16775j0874l7119
12744a39611p1870l772k1552N9792J542J29006M0779M2872K5581Q809j8368o0084
12732f876o855R913J02290p2138j07613k5299K8428l6879K10905J17801L5306
12721B48983m8972r5075J16743j3483P3758Q6152q2794k10202k3269m3088L6897
$$ plain form
12778 40172 -40168 -25633 -92892 3947 25353 46458 -10695 -12556 -1969 -78885 39061 106677
12766 106677 93855 917 17610 138563 78034 -19683 -65589 -107935 -180632 -143822 -109667
12755 -109667 68938 76371 29776 -13946 25678 148462 112828 25157 -91618 -102492 -139611
12744 -139611 -211481 -215253 -236805 -177013 -175471 -46465 -5686 37186 62767 71576 53208 -6876
12732 -6876 -13731 -3818 98472 26334 -81279 -106578 -78150 -115029 95876 213677 248983
12721 248983 200011 104936 221679 208196 281954 368106 285312 75110 51841 8753 45650
$$ [...]
##END NTUPLES=NMR SPECTRUM
##END=
