##TITLE=Analysis number 319382
Compound Code cc 48902
Book Reference 468/71
Project Code adrs
Chemist Name colinb
##JCAMPDX= 6.0         $$ Bruker NMR JCAMP-DX V2.0
##DATA TYPE= NMR SPECTRUM
##DATA CLASS= NTUPLES
##ORIGIN= Bruker BioSpin GmbH
##OWNER= nmr
$$ XWIN-NMR		Version 3.5
$$ Fri May 12 08:37:52 2006 GMT Daylight Time (UT+1h)  MAYBRIDGE\nmr@NMR_250MHZ
##.OBSERVE FREQUENCY= 250.131544655141
##.OBSERVE NUCLEUS= ^1H
##.ACQUISITION MODE= SIMULTANEOUS (DQD)
##.ACQUISITION SCHEME= undefined
##.AVERAGES= 16
##.DIGITISER RES= 18
##SPECTROMETER/DATA SYSTEM= dpx250
##.PULSE SEQUENCE= zg30
##.SOLVENT NAME= CDCl3
##.SHIFT REFERENCE= (INTERNAL, CDCl3, 0, 16.522)
##AUDIT TRAIL= $$ (NUMBER, WHEN, WHO, WHERE, WHAT)
$$ ##TITLE= Audit trail, XWIN-NMR		Version 3.5
$$ ##JCAMPDX= 5.01
$$ ##ORIGIN= Bruker BioSpin GmbH
$$ ##OWNER= nmr
$$ C:\u/data/dgb/nmr/ADRS/4190/pdata/1/auditp.txt
$$ ##AUDIT TRAIL=  $$ (NUMBER, WHEN, WHO, WHERE, WHAT)
(   1,<2006-05-12 08:37:29.82 +100>,<MAYBRIDGE\nmr>,<NMR_250MHZ>,
      <created by zg, POWCHK disabled, PULCHK disabled
       configuration hash MD5:
       84 BC 41 DB A1 6E 1D 46 DA 25 12 A5 C1 ED C5 3A
       data hash MD5: 64K
       0F 5A 68 AE 39 1C C9 7F FC 73 F5 5B 09 09 1C 4B>)
(   2,<2006-05-12 08:37:43.07 +100>,<MAYBRIDGE\nmr>,<NMR_250MHZ>,
      <Start of raw data processing
       ef LB = 0.3 FT_mod = 6 PKNL = 1 SI = 32K 
       data hash MD5: 32K
       69 34 AC 02 5D A3 33 5D BE 5A 07 B5 82 DB 96 10>)
(   3,<2006-05-12 08:37:44.85 +100>,<MAYBRIDGE\nmr>,<NMR_250MHZ>,
      <apk 
       data hash MD5: 32K
       D2 EB 72 CD C4 B8 EB 0D AD C1 1B 5C 78 04 71 0A>)
(   4,<2006-05-12 08:37:45.59 +100>,<MAYBRIDGE\nmr>,<NMR_250MHZ>,
      <abs ABSG = 5 
       data hash MD5: 32K
       8D 21 FA 51 3A 73 D4 25 D1 C0 B3 FB 36 C3 68 DA>)
$$ ##END=
$$ 
$$ hash MD5
$$ 5C 69 01 9C 48 FC 02 FD 72 43 FD D3 AF 29 ED A4
##$RELAX= 
##$RELAX= 
##$RELAX= 
##$RELAX= 
##$RELAX= 
##$RELAX= 
##$RELAX= 
$$ Bruker specific parameters
$$ --------------------------
##$DU= <C:\u>
##$EXPNO= 4190
##$NAME= <ADRS>
##$PROCNO= 1
##$TYPE= <nmr>
##$USER= <dgb>
##$AMP= (0..31)
100 100 100 100 100 100 100 100 100 100 100 100 100 100 100 100 100 100 
100 100 100 100 100 100 100 100 100 100 100 100 100 100 
##$AQSEQ= 0
##$AQ_mod= 3
##$AUNM= <au_zg>
##$AUTOPOS= <3 >
##$BF1= 250.13
##$BF2= 250.13
##$BF3= 250.13
##$BF4= 250.13
##$BF5= 500.13
##$BF6= 500.13
##$BF7= 500.13
##$BF8= 500.13
##$BYTORDA= 1
##$CFDGTYP= 0
##$CFRGTYP= 5
##$CHEMSTR= <none>
##$CNST= (0..31)
1 1 145 1 1 1 1 1 1 1 1 1 1 1 1 1 1 1 1 1 1 1 1 1 1 1 1 1 1 1 1 1 
##$CPDPRG= <>
##$CPDPRG1= <>
##$CPDPRG2= <>
##$CPDPRG3= <>
##$CPDPRG4= <mlev>
##$CPDPRG5= <mlev>
##$CPDPRG6= <mlev>
##$CPDPRG7= <mlev>
##$CPDPRG8= <mlev>
##$CPDPRGB= <>
##$CPDPRGT= <>
##$D= (0..31)
0 1 0 0 0 0 0 0 0 0.06 0 0 0 0 0 0 0.0002 0 0 0 0 0 0 0 0 0 0 0 0 0 0 
0 
##$DATE= 1147419448
##$DBL= (0..7)
120 120 120 120 120 120 120 120 
##$DBP= (0..7)
150 150 150 150 150 150 150 150 
##$DBP07= 0
##$DBPNAM0= <>
##$DBPNAM1= <>
$$ [...]
##$SUBNAM7= <"">
##$SUBNAM8= <"">
##$SUBNAM9= <"">
##$SW= 20.6930455092707
##$SWIBOX= (0..15)
0 0 3 0 0 0 0 0 0 0 0 0 0 0 0 0 
##$SW_h= 5175.983436853
##$TD= 65536
##$TD0= 1
##$TE= 295.16
##$TE2= 300
##$TE3= 300
##$TEG= 300
##$TL= (0..7)
0 120 120 120 120 120 120 120 
##$TP= (0..7)
150 150 150 150 150 150 150 150 
##$TP07= 0
##$TPNAME0= <>
##$TPNAME1= <>
##$TPNAME2= <>
##$TPNAME3= <>
##$TPNAME4= <>
##$TPNAME5= <>
##$TPNAME6= <>
##$TPNAME7= <>
##$TPOAL= (0..7)
0.5 0.5 0.5 0.5 0.5 0.5 0.5 0.5 
##$TPOFFS= (0..7)
0 0 0 0 0 0 0 0 
##$TUNHIN= 0
##$TUNHOUT= 0
##$TUNXOUT= 0
##$USERA1= <user>
##$USERA2= <user>
##$USERA3= <user>
##$USERA4= <user>
##$USERA5= <user>
##$V9= 5
##$VALIST= <valist>
##$VCLIST= <CCCCCCCCCCCCCCC>
##$VD= 0
##$VDLIST= <DDDDDDDDDDDDDDD>
##$VPLIST= <PPPPPPPPPPPPPPP>
##$VTLIST= <TTTTTTTTTTTTTTT>
##$WBST= 1024
##$WBSW= 4
##$XGAIN= (0..3)
0 0 0 0 
##$XL= 0
##$YL= 0
##$YMAX_a= 358286
##$YMIN_a= -498003
##$ZGOPTNS= <>
##$ZL1= 120
##$ZL2= 120
##$ZL3= 120
##$ZL4= 120
##$ABSF1= 16.522
##$ABSF2= -4.171173
##$ABSG= 5
##$ABSL= 3
##$ALPHA= 0
##$AQORDER= 0
##$ASSFAC= 0
##$ASSFACI= 0
##$ASSFACX= 0
##$ASSWID= 0
##$AUNMP= <proc_1d>
##$AZFE= 0.1
##$AZFW= 0.1
##$BCFW= 0
##$BC_mod= 0
##$BYTORDP= 0
##$COROFFS= 0
##$CY= 12.5
##$DATMOD= 1
##$DC= 0
##$DFILT= <>
##$DTYPP= 0
##$F1P= 14.0000005364418
##$F2P= -0.99999901652339
##$FCOR= 0.5
##$FTSIZE= 32768
##$FT_mod= 6
##$GAMMA= 0
##$GB= 0
##$INTBC= 1
##$INTSCL= 1
##$ISEN= 128
##$LB= 0.3
##$LEV0= 0
##$LPBIN= 0
##$MAXI= 10000
##$MC2= 0
##$MEAN= 0
##$ME_mod= 0
##$MI= 0
##$NCOEF= 0
##$NC_proc= -5
##$NLEV= 6
##$NOISF1= 0
##$NOISF2= 0
##$NSP= 0
##$NTH_PI= 0
##$NZP= 0
##$OFFSET= 16.522
##$PC= 1
##$PHC0= 188.2835
##$PHC1= -31.71201
##$PH_mod= 1
##$PKNL= yes
##$PPARMOD= 0
##$PSCAL= 4
##$PSIGN= 0
##$REVERSE= no
##$SF= 250.13
##$SI= 32768
##$SIGF1= 0
##$SIGF2= 0
##$SINO= 400
##$SIOLD= 32768
##$SREGLST= <1H.CDCl3>
##$SSB= 0
##$STSI= 32768
##$STSR= 0
##$SW_p= 5175.98343685301
##$SYMM= 0
##$S_DEV= 0
##$TDeff= 65536
##$TDoff= 0
##$TI= <Analysis number 999999
Compound Code 99
Book Reference 9
Project Code 9>
##$TILT= no
##$TM1= 0
##$TM2= 0
##$TOPLEV= 0
##$USERP1= <user>
##$USERP2= <user>
##$USERP3= <user>
##$USERP4= <user>
##$USERP5= <user>
##$WDW= 1
##$XDIM= 32768
##$YMAX_p= 459103667
##$YMIN_p= -765410
$$ End of Bruker specific parameters
$$ ---------------------------------
##NTUPLES= NMR SPECTRUM
##VAR_NAME=  FREQUENCY,     SPECTRUM/REAL,   SPECTRUM/IMAG
##SYMBOL=    X,             R,               I
##VAR_TYPE=  INDEPENDENT,   DEPENDENT,       DEPENDENT
##VAR_FORM=  AFFN,          ASDF,            ASDF
##VAR_DIM=   32768,         32768,           32768
##UNITS=     HZ,            ARBITRARY UNITS, ARBITRARY UNITS
##FACTOR=    0.157963299565203, 1,           1
##FIRST=     4132.6476996994, 0,             0
##LAST=      -1043.33573715361, 0,           0
##MIN=       -1043.33573715361, -765410,     0
##MAX=       4132.6476996994, 459103667,     0
$$ Real data points
##PAGE= N=1
##DATA TABLE= (X++(R..R)), XYDATA
$$ [...]
24640F6836Q5065p8026n6511n441L0327j07825j04434J18456l9179j58321O6787
24629a82266J46225R1587p96l171O5213l6733j06883q9305K8415J8457q057Q0000
24617B686j24647n337K88044M425l3804j3894k1607l4374O8488J2700n2861r4933
24605e114R009M6402j17317k28756k7572O6198J110K27609P0898k13420o472K34749
24593E7324P9391j19317k3450M144J69889J3518j46335l6809m4577o1565n4318
24582a62105J16684Q2894M7550k5680K0391M0042J7019J74329q0252r0257n4846
24571H5769j0305R134Q8885Q6621J13758o7568j04574j07292j64441l0188l8344
24560a38545m1850M2228J11366j34274o8369K17851K24230J11640j2002j5386
$$ y = [66836, 151901, 73875, 17364, 11923, 42250, -65575, -170009, -51553, -90732, -249053, -182266, -36041, 55546, 54750, 51579, 116792, 80059, -26824, -116129, -87714, -69257, -77314, 2686, -121961, -127298, 160746, 165171, 131367, 117473, 95866, 61492, 129980, 142680, 89819, -5114, 3895, 50297, -67020, -295776, -323348, -257150, -256040, -28431, 42467, -170953, -177425, 57324, 136715, 17398, -6052, -1908, 167981, 181499, 35164, -1645, -46222, -107787, -162105, -45421, 37473, 85023, 59343, 79734, 119776, 136795, 311124, 230872, 140615, 85769, 75464, 84598, 173483, 260104, 373862, 306294, 201720, 94428, -70013, -100201, -138545, -180395, -138167, -26801, -161075, -229444, -11593, 212637, 324277, 312275, 296889]
24550B96889r5903j85900k34576j24618J03641J21952J20912M1570o9379j75060
24540b00472J7833J54447Q3569N5422K3160m8274j88997j40146n5502Q075J1536
24529b79349p795k48008J9953K41540p946j09394R5706M2459M5129k2610J37250
24518i3065M5380j3984j00796r2436K8147n0710J9315M839n4996n0457J72126
24507a86637J63153l6818l6930k33K0139R1073J67922j62010k24602O0818J44420
24496B95J83462K51114L5209j75215j2583j20826j49733k6661O9617p2211o2218
24485g9750J4785o3262L2861J69064M5458n075j13606J59173N3202n7963j44240
24474A0647J72282j03574j12826Q5598p243j03459m8652K8143m6882K5827P6365
$$ y = [296889, 200986, 15086, -219490, -344108, -240467, -118515, 2397, 43967, -25412, -200472, -182639, -28192, 55377, 110799, 133959, 85685, -103312, -243458, -298960, -290885, -279349, -287144, -535152, -515199, -273659, -281605, -390999, -295293, -252834, -207705, -230315, -93065, -47685, -61669, -162465, -254901, -226754, -277464, -258149, -253310, -308306, -358763, -186637, -23484, -60302, -97232, -97465, -77326, 13747, 181669, 19659, -204943, -144125, 295, 183757, 434871, 470080, 294865, 282282, 161456, 11723, -14938, 54679, -17532, -79750, -64965, -128227, -95366, 73698, 119156, 114081, 475, 159648, 212850, 154887, 10647, 182929, 79355, -33471, 52127, 44884, -58575, -107227, -79084, -125966, -100139, -23774]
24463b3774Q7242J09196Q3693o2445k25590j51124R2814J38754p5228N3454o0797
24452c3805L8376J05655J3266o4634k8601P6595R0147N075j53026p0092o3383
24441h4427L259J56618J07519j28775L567o2220k2625j0409K5416k09673o4222
24430b85972J53627J02352J85548M4544j32354k19252K724K33976J93974Q4832
24420C63999q7830p5242K2598R5234J19863j66209l2332J2573M6749l045j29112
24409A67246o7894Q1438J30097J16746j27346k16921J2218J2227J262J5602O1808
24398A86483j08076j00543j08821J13680J06258K13O4329o0900j44067m0203Q8621
24387c026m7935j56907P7504O4193m145N5012M4501m1929j80221p1542J18123
$$ y = [-23774, 63468, 172664, 256357, 193912, -31678, -182802, -89988, 48766, -26462, 26992, -33805, 4571, 110226, 123492, 58858, 30257, 106852, 196999, 202074, 49048, -21044, -84427, -81168, 75450, 182969, 54194, 57761, -4459, -27084, -37493, -12077, -221750, -285972, -132345, -29993, 155555, 200099, 67745, -151507, -148783, 85193, 279167, 363999, 276169, 200927, 223525, 318759, 438622, 272413, 240081, 252654, 299403, 296358, 167246, 99352, 180790, 310887, 427633, 300287, 83366, 95584, 107811, 109073, 124675, 186483, 78407, -22136, -130957, -17277, 88981, 89194, 153523, 92623, -51444, -91647, -3026, -50961, -207868, -130364, -66171, -70316, -15304, 29197, -12732, -192953, -264495, -146372]
24376a46372J93685j7723K2255Q9235j22202j63194O6101R2288j40138o8506J09221
24365h5350K00949K4653j01677J27463M4927j54557o3076q4l3963j33171j2925
24354a86811P8673K46939O3297p3496j72581k16290r4008J55193j2413p8429m7228
24343c37154J02096J45329R6003K9865k13701j33614N2708J51053J43717l6272
24333C0k05003p1402j0643J42799J30702K4808L1139L9578K7074p0549J381R7012
24321A36926n737p0616N3635o7708j39378M9922J46692J40196k08205j40146j40745
24310b45164k2429P1733J21060J70976J7926j55087L5769n6318r1110l6496J34312
24299e4828J00538R2844N5946l5363q7897M5843n1353n5669q7965r1095N1213
$$ y = [-146372, 47313, 29590, 51845, 141080, 18878, -144316, -78215, 14073, -126065, -194571, -85350, 115599, 140252, 38575, 166038, 210965, 56408, -6668, -6752, -40715, -173886, -186811, -108138, 138801, 202098, 128602, -43979, -260269, -354277, -199084, -211497, -289926, -337154, -235058, -89729, 6274, 36139, -177562, -311176, -258468, -107415, 36302, 30, -204973, -276375, -287018, -144219, -13517, 11291, 42430, 82008, 109082, 38533, 39914, 136926, 131189, 60573, 114208, 46500, -92878, -42956, 103736, 243932, 35727, -104419, -245164, -267593, -195860, -74800, 96176, 114102, -40985, -5216, -61534, -152644, -189140, -54828, 45710, 138554, 194500, 159137, 71240, 117083, 65730, 10061, -77904, -168999, -117786]
24288a17786J20842K4399J68292P2168J80500j84272p3905o9918J11891L8212
24278B70423j94142q3159J0041m6373N1198J39135r5272K0366J97777j7150j7951
24267B34893Q00p2980r9609m4145J50194j28987l2662J38888Q0850m4602N9874
24256B42514n1002j6573l0265l36165l3021J69509L1740j66303P3458J62891O1559
24245A08342j69101l35048n5888K27976K05011J86582m827q4552L2423n3488N0514
24234A07944O1239j01217j42166Q487q782j22112J63664r574J55446K11215l14598
24223I546j64201J15594R5993N1444n9656j70738j31359J56628o6537j22148k696
24212b88130J47465J10479K638M5107m942j1647K04025N0674q5002p3067k1805
$$ y = [-117786, 3056, 27455, 195747, 267915, 448415, 264143, 190238, 120320, 232211, 270423, 76281, -6878, 3163, -43210, 7988, 147123, 51851, 72217, 269994, 252844, 234893, 235693, 162713, 63104, 18959, 169153, 40166, 7504, 146392, 227242, 182640, 242514, 191512, 174939, 144674, -191491, -224512, -55003, -23263, -189566, -116108, 46783, 108342, -60759, -395807, -451695, -223719, -18708, 167874, 163047, 78495, 110918, 57430, 107944, 169183, 67966, -74200, -65713, -74495, -196607, -32943, -42517, 112929, 324144, 9546, -154655, -39061, 56932, 108376, 48720, -122018, -253377, -96749, -163286, -285434, -288130, -140665, -30186, -27548, 17559, 12617, 970, 204995, 255669, 170667, 97600, 75795]
24201G5795k6770R5068J7835n4517l7425j69459j24228o6728K29846M51j99190
24190b59322J15190M8616j07338j9628J21757R0048q5406N2070l1517J26229J90941
24179B41640O5145j38613j44262p5383n1204M0916K28219r680R2132K2479k12576
24168E8813j90264j2666K6113J01523k35967o9613K12084J11753n9544p6789N654
24157a28903o6487j10931L0722K8638K23677K11006j62182j63758q9058K7301
24147a99975K56860O1201j11021J47930K04534p3492j57258n506J3185Q5853r0998
24136A31313L2248j2985M0032p1105j48875p2837J90191j5992j12771o8069J76254
24125F7404J19847j12192n5385J16162k6897m2324q9038j16521q9329M79K75082
$$ y = [75795, 49025, 144093, 161928, 107411, 69986, -99473, -223701, -290429, -60583, -60132, -259322, -144132, -95516, -202854, -222482, -100725, -10677, -96083, -44013, -75530, 50699, 241640, 306785, 168172, 23910, -51473, -102677, -61761, 166458, 156778, 248910, 271389, 58813, -131451, -144117, -118004, -16481, -252448, -322061, -109977, 1776, -57768, -134557, -128903, -195390, -306321, -275599, -246961, -23284, 187722, 25540, -138218, -227276, -199975, 56885, 118086, 7065, 154995, 359529, 286037, 128779, 123273, 136458, 222311, 131313, 163561, 150576, 190608, 119503, -29372, -102209, 87982, 71990, -40781, -108850, 67404, 187251, 75059, 19674, 135836, 108939, 66615, -22423, -138944, -228273, -227794, 47288]
24114D7288l8469n302J15277Q9303J25283N5672j04909k01612o7925J12385J05595
24103B32586j17959m1920q838p0412P1275k919j40505n7061m5439o5632O0916
24092a85908L2126K08124J04867q369n9625j42885k8888J38259J28338j38659
24082D7380K3035J20179j18733n8274J23572k9163k0784k4262j18308j62013p7034
24071b94405m7441O3657M0641n2104Q6715R8398J37859M5195N0583J31199P2894
24060C33191k47781j02373l1712J05919J28966J05983k16171j42692J7999p7945
24050a26616N6564j79801j1753K98183K50739q2670j57790n560o2242j24491j18098
24039b63535N0265K16034Q3529l5959k85762l9600K9425O9537K06359J66959L6789
$$ y = [47288, 8819, 3517, 118794, 208097, 333380, 389052, 284143, 82531, 14606, 126991, 232586, 114627, 72707, 63869, -6543, 64732, 61813, -78692, -135753, -181192, -246824, -185908, -153782, 54342, 159209, 150840, 91215, -51670, -80558, 57701, 186039, 47380, 70415, 190594, 71861, 13587, 137159, 107996, 87212, 62950, -55358, -217371, -294405, -341846, -278189, -237548, -289652, -202937, -104539, 33320, 78515, 129098, 260297, 333191, 85410, -16963, -48675, 57244, 186210, 292193, 76022, -66670, -48671, -126616, -70052, -249853, -261606, 36577, 287316, 204646, 46856, 41296, -20946, -145437, -263535, -213270, 2764, 86293, 50334, -235428, -275028, -245603, -176066, 30293, 197252, 234041]
24028B34041M5144j39578j37525J8538J60567m188P740j79351p1202K7952M519
24017c3343q6074L9302J75317n0521P1000j20783j72645j44609j00699J13522
24007c09533K40933J94163j8970r9639j26602l5026L8498M230j4324J10785L5694
23996B0209J37357P8467K9856J3512j2767j50148j10229r4468J3253k23806q169
23985c06933J87847O9217J34321J25212l4710l07158j47456R3669P3910J72948
23975F0867n5610j9054j4425P1186O9118J05967M987J12371o2132q6766P4476
23964B60985M7196j46861L077k759N4898j78090j11775l091j2n1421j27406J04576
23952a50683J51209K5335r8251O664J89428q351j21107j94667n9627p3304p3476
$$ y = [234041, 279185, 139607, 2082, 20620, 181187, 176999, 184739, 5388, -65814, -37862, -33343, -119417, -80115, 95202, 44681, 115681, -5102, -177747, -322356, -423055, -309533, -68600, 125563, 106593, 6954, -119648, -154674, -116176, -111946, -126270, -15485, 20209, 157566, 236033, 265889, 279401, 266634, 116486, 6257, -88211, -74958, -298764, -306933, -119086, -49869, 84452, 209664, 174954, -132204, -279660, -185991, -112081, 60867, 5257, -13797, -28222, 42964, 112082, 218049, 223036, 335407, 273275, 186509, 260985, 308181, 161320, 164397, 161638, 216536, 38446, -73329, -76420, -76432, -127853, -255259, -150683, 526, 25861, -72390, -65726, 123702, 115351, -5756, -200423, -260050, -333354, -406830]
23941d06830R414J77430n4032j3205J8187N7936J1373L486M2551J65215p694k33829
23929b29998m4714J49135J00040Q3945k59525o6235J37576J84259q1212L8402
23919A1673Q3271k2401q8784j88430j09492K538P7000J55487j02935K5537k21944
23908c78480j6805P4959J01571K8800O2173j01760L6269K7375J18238J22967J0749
23897H6056q8097O9257Q5135j37151J04790J40789m7759k05511m3331l4885j26038
23886a96745p9530p7134L0538J19370P4851L28418J24805j71400k3023r6411k1661
23875A2078J4894j86237k36260k6542K17766K09591O140j45544j845O3212J20161
23864D7414J02391o854l1200N1054J15822p4130j03599j06853r1134J18252o2156
$$ y = [-406830, -397416, -219986, -274018, -287223, -269036, -211100, -199727, -196241, -153690, 11525, 3831, -229998, -274712, -125577, -25537, 58408, -201117, -267352, -129776, 54483, -26729, 11673, 94944, 72543, -16241, -204671, -314163, -311625, -234625, -79138, -182073, -156536, -378480, -395285, -320326, -218755, -189955, -127782, -229542, -193273, -165898, -47660, 75307, 86056, -2041, 67216, 152351, 15200, 119990, 260779, 213020, 7509, -35822, -70707, -196745, -276275, -353409, -322871, -203501, -128650, 199768, 324573, 153173, 130150, 33739, 12078, 26972, -159265, -395525, -422067, -204301, 5290, 11430, -134114, -135959, -72747, 47414, 149805, 142951, 111751, 162805, 278627, 204497, 100898, -5955, -97089, 21163, -40993]
23853d0993o0908k9506m9292J35719j98533n7229J64696J28589N3718R7603J43373
23842B87237j47039o2045j64739r0654m7321J77969J48070J07523p2120j80208
23832d3327j85483j4169K60179j6530j10406o8810k31138q9107R2229R3902J22975
23821a89685K05646J35861n8428k08689N4185R2439M9201j29006l19709J1372
23811c56813Q4318J31221J45114J32237J0030R8035j5425j8105p4830m476n4057
23800G7249j10045p2508K3219n0768K3891L3061J24595J36414P3850n6295O0660
23789B63323r6586j72550k9505J03926j6142o9943K8883Q3840R3208j89325J0619
23778I748R0841j18705O4307J30613j03768J1694K7997K9287J4471j48353O352
$$ y = [-40993, -101901, -131407, -180699, -44980, -243513, -300742, -136046, -7457, 46261, 143864, 287237, 140198, 78153, -86586, -177240, -224561, -46592, 101478, 209001, 136881, -43327, -228810, -242979, 17200, 670, -109736, -178546, -409684, -498791, -406562, -312660, -189685, 15961, 151822, 93394, -115295, -61110, 31329, 80530, -48476, -368185, -356813, -272495, -141274, 3840, 136077, 146107, 244142, 228717, 210612, 135782, 131306, 77249, -32796, -105304, -82085, -132853, -108962, -75901, 48694, 185108, 258958, 202663, 263323, 166737, -5813, -35318, 68608, 52466, -17477, 11406, 95246, 188454, -871, 9748, 100589, -18116, 46191, 176804, 73036, 84730, 112727, 142014, 156485, 8132, 14484]
23767A4484Q7506K2019L6499j06815j11500P98j6757J13014M4846n4061k14955
23756a84922j03822N9240J14238P2007Q9015k7527k1769J21584J36863n3178J3855
23745B15584p5620k7940K878n7587j43003Q7503J34390L1668j4586j37479j10686
23734i4878j3112R3320l7936J48598j41308J8920J21238j560L0952P9707q8121
23723A15820j36727k44976k3011J05831J87557K2059J933Q9044L8676O0054J4014
23712B30274o7582O9965l9807j34604j95918p4706P1731p433m9275J69255R8471
23701G0371R4620J8055n6558j05003m7018Q6271p6551o4485j0487J8056K1402
23690e1327Q0839K09035J29254j47855k49553j12445R0959J06778O5887n9348
$$ y = [14484, 101990, 124009, 160508, 53693, -57807, -57009, -73766, 39248, 84094, 30033, -184922, -288744, -229504, -115266, -43259, 45756, 18229, -3540, 118044, 254907, 201729, 215584, 139964, 112024, 114902, 57315, -85688, 1815, 136205, 167873, 153287, 15808, -94878, -107990, -14670, -52606, 95992, -45316, -26396, 94842, 93282, 124234, 203941, 115820, -20907, -265883, -288894, -183063, 4494, 26553, 28486, 117530, 156206, 216260, 230274, 162692, 232657, 192850, 58246, -137672, -212378, -140647, -148080, -197355, -28100, 70371, 164991, 183046, 126488, 21485, -25533, 60738, -15813, -80298, -90785, -72729, -51327, 29512, 238547, 367801, 219946, -29607, -142052, -51093, 55685, 121572, 62224]
23680F2224j48157n3137n3670J08476J93873r9336k31315k6619J23232j17224
23670b41653p3052K19714M2779K5202N1037J89968j69966j87810Q4041J48716
23660H8976m0582q8324o0156r977J43183j36078J1336Q2019K0596M3796k5997
23649B8792L6691o2163J05355J06690J19437m7087j1495k55730j66119m4330J55513
23638c4446J81552N6559j34613j05698N865L0285N8448O2206j87661J0321J98042
23627A40860Q0733J0525k35717j78273J7318l0494p3240J7936N8821R3963L3842
23616f3726j20299j3174M2670J72364m2544j7322k04928o3623n5638k62721J015
23605f27926K60363J80450o4383m8369O1707Q6780p1373R1988r2055k934J42616
$$ y = [62224, -85933, -139070, -192740, -84264, 109609, 10273, -221042, -247661, -124429, -241653, -314705, -94991, -52212, -27010, 24027, 213995, 44029, -143781, -59740, 88976, 48394, -39930, -100086, -110063, 33120, -102958, -91622, -9603, 10993, 54789, 28792, 65483, 3320, 108675, 215365, 334802, 287715, 276220, 20490, -145629, -189959, -34446, 147106, 203665, 69052, -36646, -30781, -496, 57952, 120158, -67503, -57182, 140860, 221593, 232118, -3599, -181872, -164554, -195048, -268288, -250352, -191531, -97568, -63726, -184025, -197199, -154529, 17835, -24709, -42031, -246959, -310582, -366220, -628941, -627926, -367563, -187113, -251496, -299865, -238158, -151378, -222751, -130763, -222818, -225752, -83136]
23594h3136p1894R0330Q6918J23262j1323k0530j29146j64182R335R2060J40973
23583F2667L2196q1743m1141J49035j7112r4273k28139j6455J34242K32075m4319
23572H7033j34286j8159N0391r3326N6061P3020P7022K2862o2373j64118j56978
23561b62851j50603K01907J45069P4662J21099J06920j66337j18780m7920j2713
23551a09547n5473p934L4036R9805J57953O0897Q1101o5865l7563L4962l9549
23540A52823J7137p1896O9921N1013j8603n5511o7992j08432j36897P6964J48576
23529E7103K1145p7316m3159m8762m6135J3764Q8945J01206J13064P2170R3131
23518C45156j0746j8152j19004m9303Q2634o5942j27421j57616R926L57982j23935
$$ y = [-83136, -155030, -64700, 22218, 145480, 134157, 113627, -15519, -179701, -170366, -78306, 62667, 94863, 13120, -28021, 121014, 103902, 9629, -218510, -234965, -100723, 131352, 87033, -47253, -65412, -15021, -108347, -52286, 20734, 97756, 120618, 58245, -105873, -262851, -413454, -211547, -66478, 8184, 129283, 236203, 69866, -48914, -96834, -109547, -165020, -172954, -138918, -39113, 118840, 179737, 260838, 194973, 157410, 192372, 152823, 169960, 98064, 167985, 218998, 200395, 144884, 76892, -31540, -168437, -91473, 57103, 78248, 932, -42227, -90989, -137124, -123360, -34415, 66791, 179855, 252025, 345156, 334410, 316258, 197254, 147951, 230585, 164643, 37222, -120394, -110468, 247514, 123579]
23507A23579j51758M9070Q088n2066j48894J06965J7550j7422o1663J19853M1207
23496C4509N3832K11653l233q0950p7867j12897p0138J28182K6121j06623q5340
23485h2751J02982L18711J39462j07604o3773l8928o2048j19087N6214j79112
23475c5934P781k5758N88o2166L3397K0440J28126j05130Q5222K29490j5514k24736
23463C5806j79469J13062q9827j38654J8040J6442J5716R0273P0713J1230K1018
23452a5650K60169R4354j62693j38371P7956P1219m9156L1753J3607J5538M6242
23441B44968j22924o8091O2029O129j40390j74496m0428L4070K90050L5290R706
23430A35913p6087j8790k7466k7835j22479r1534O5665n2537K3296J43758m6204
$$ y = [123579, -28179, 20891, 28979, -23087, -171981, -65016, -47466, -64888, -126551, -6698, 34509, 88341, 299994, 296761, 215811, 137944, 25047, -45091, 83091, 109212, 2589, -82751, 20231, 338942, 478404, 370800, 307027, 268099, 206051, 86964, 143178, -35934, -28153, -53911, -53323, -115489, -82092, -61652, 66474, -38656, 46566, 276056, 260542, 35806, -143663, -30601, -120428, -259082, -241042, -224600, -208884, -118611, -47898, -36668, -15650, 244519, 338873, 176180, 37809, 115765, 186984, 137828, 169581, 183188, 198726, 244968, 122044, 53953, 115982, 122111, -18279, -192775, -233203, -199133, 90917, 126207, 135913, 59826, 41036, 13570, -14265, -136744, -228278, -162613, -215150, -191854, -48096, -94300]
23419i4300R107J35611j3815j11411n1467L220K75099m7141M7079J37609J6496
23408C06087j20821j37369k9683J28492j23455o6011p8592l279K56221K0941j12307
23397D0224r9792j42152j55084K72962M9069r7227Q3936J12083J6105L1015L3233
23386A44372k3763j34874p9884q8641m5834Q3124N8267J7270J64987R6784k8935
23375A62873r2140j79124q744J57706J98415j2214l8299j8256m5795j77904n1484
23364a04966o1945j28404J31316J37480Q6748l7293o8250K53156j30484j81360
23354a04002J9277n7684J8801J31056l5275q3285J82167J14205R1015l0431q7437
23343A58407N2574L4491J07805m7669m9978j9438r4061L3086J42193k22032k71332
$$ y = [-94300, -85193, 50418, 36603, -74808, -126275, -123055, 152044, 104903, 151982, 289591, 306087, 185266, 47897, 18214, 146706, 23251, -42760, -121352, -124631, 131590, 152531, 40224, -59568, -201720, -356804, -83842, -34773, -132000, -48064, 64019, 80124, 111139, 144372, 120609, -14265, -94149, -182790, -228624, -145500, -87233, -69963, 95024, 191808, 162873, 70733, -108391, -117135, 40571, 238986, 226772, 188473, 170217, 124422, -53482, -104966, -166911, -295315, -163999, -26519, 60229, 22936, -45314, 207842, 77358, -104002, -84725, -142409, -123608, 7448, -27827, -111112, 71055, 185260, 276275, 245844, 158407, 210981, 245472, 353277, 305608, 255630, 236192, 142131, 175217, 317410, 95378, -175954]
23332a75954j4551J39206N8593o6469m8408j45404L4519L2136o3816n6432J4518
23321b92062J46925K79835J08924j91283k04809k47189j09103J62142K63006K14833
23311A31219J2864M53n3081n1409j71350j21835O7965J03037M0445J56749m652
23300A10405o4910K2485J6190N2731j42093K423Q2039m3570J82875j886O9494
23289B86183k0352q5897q4694k37911j20365P0696M5482J65710N5496j26804k03781
23278b56237N2792J11165J41783J65538M8295j45039k42967m3784J31501m4283
23268h1236k04192j0796J44596o1566r2012L223J01957k6279L4469J46885O0082
23257A5131j34094P0077J24311R1726o784j6692L3525J03816n3047k38483J0836
$$ y = [-175954, -190505, -51299, 7294, -59175, -107583, -252987, -218468, -186332, -250148, -306580, -292062, -145137, 134698, 243622, 52339, -152470, -399659, -508762, -346620, -83614, 131219, 144083, 144536, 91455, 40046, -131304, -253139, -185174, -82137, -41692, 115057, 110405, 45495, 67980, 84170, 136901, -5192, -2769, 79270, 35700, 218575, 216689, 286183, 265831, 179934, 95240, -142671, -263036, -192340, -146858, 18852, 74348, -52456, -256237, -203445, -92280, 49503, 215041, 263336, 118297, -124670, -168454, -36953, -81236, -285428, -296224, -151628, -213194, -305206, -301983, -200026, -226305, -191836, -44951, 15131, -118963, -48886, 75425, 167151, 160367, 143675, 177200, 281016, 227969, -10514, 322]
23246C22M3667O7644O719J40500R2361J43988j12998l6900k1054j96295j61316
23235c3362p1100O3404N3412N7476J0516j62782O24o4985p5093J78368N0709l6583
23223b9396K6681m5999j52180P2260J01134J22938o577Q8547M3103j38444J7699
23212I9766r6709j02710j0642N1910O3011J26096L4875J10201L2407R9440L7409
23201D45054k07829l53746k8916K4274J0292J27121j68810p6506J51180J16699
23191C8813j164R728L537o4374n8203J06186J71159j02563m526R8370n4891q2386
23179E9686j9815l5656N2666o5898K6964M0080n1704j62306M9251J7285J8681
23168g0766m9165j30109p1218J70442q9234L4985J85002o1005j62381r4075l1542
$$ y = [322, 43989, 111633, 118352, 258852, 351213, 495201, 382203, 345303, 324249, 127954, -33362, -104462, -41058, 12354, 69830, 80346, -82436, -81812, -146797, -221890, -43522, 7187, -29396, -2715, -48714, -200894, -128634, -27500, 95438, 88861, 177408, 220511, 82067, 99766, 3057, -99653, -110295, -58385, 4626, 130722, 165597, 275798, 308205, 407645, 445054, 237225, -116521, -145437, -121163, -110871, 16250, -152560, -229066, -77886, 38813, 37649, 47377, 50914, -13460, -71663, 34523, 205682, 103119, 98593, 196963, 142072, 59686, 39871, 4215, 56881, -9017, 17947, 58027, 6323, -155983, -106732, -89447, -70766, -119931, -250040, -321258, -150816, -240050, -205065, -20063, -81068, -243449, -337524, -369066]
23157c69066N988L22463J61431q4560r9971K0709Q7838L3022n9744J02387j77785
23146e7288k9882J97397n6959j50946l6082O6110R7602K11181p1130k65355n4173
23135a49525Q5970J24797P0808P1829M7078k23467j26586J45852L8424R7726j74668
23124H238q5499m1908j21430m3734O5623K31262l1279j7663J53677O337p9344
23113D4280M829m0027o1422J04222q288j072O1011j02674J19151J14703r3308
23102A41405j18359L8892j43715M8127K54154k2724J0772q4141p7964k8267o1312
23091d3132K08121k3629j71588O3102K8348m5807O692j79807O2725K77011J36550
23080C18586j14204m5214P8754J35512L2352j64461j61736L6073R644l1925q2951
$$ y = [-369066, -363078, -40615, 120816, 36256, -63715, -43006, 44832, 77854, 18110, 120497, -57288, -87170, 110227, 53268, -97678, -133760, -67650, 29952, 241133, 170003, -95352, -149525, -63555, 61242, 132050, 203879, 250957, 27490, -99096, 46756, 85180, 182906, 8238, -77261, -119169, -240599, -284333, -218710, 12552, -18727, -36390, 117287, 123624, 44280, 49109, 9082, -52340, 51882, 43594, 42522, 103533, 859, 120010, 234713, 141405, 23046, 61938, -81777, -33650, 220504, 197780, 208552, 124411, 46447, 18180, -43132, 164989, 141360, -30228, 32874, 61222, 15415, 22107, -157700, -94975, 182036, 318586, 204382, 159168, 237922, 373434, 405786, 241325, 79589, 115662, 125306, 93381, 10430]
23069A0430k4795n7880j8589Q0986L0377N1653j01936J7353O6632J29025N9350
23058B42606L8k711j00053n5166J56319n391j74005q3455J06863K40679k25985
23047I9739j41539J56059j9659j07306j5785j42198j35830j5207J68909l2509
23037a85326m5514k8163Q3751N6193k6781J12552O0410J3004r2464k8123J7663
23026f2798k27896J42039J96962Q229P727n3697j61043j48756j69111p6083J23408
23015d21019L3696K5108P0555p7601k6031J05996L7204N1101m2048J29833J33478
23004B0272N6159r5007p3774p1487j38581k0551J51595k6999L4116M8641J47506
22993C1890K3480j84751j20423j1393q0928q615J35914R2679l0230n0055Q5651
$$ y = [10430, -14365, -72245, -90834, -9848, 20529, 72182, -29754, -12401, 54231, 183256, 242606, 242644, 239933, 139880, 84714, 241033, 235642, 61637, -21818, 85045, 325724, 99739, -41800, 114259, 94600, -12706, -28491, -170689, -306519, -321726, -152817, -185326, -230840, -259003, -175252, -119059, -145840, -33288, 27122, 40126, -52338, -80461, -62798, -290694, -148655, 48307, 56536, 64263, 10566, -150477, -299233, -468344, -544427, -421019, -387323, -362215, -291660, -369261, -395292, -289296, -252092, -200991, -243039, -113206, 20272, 76431, -18576, -92350, -163837, -302418, -322969, -171374, -198373, -164257, -115616, 31890, 55370, -129381, -249804, -261197, -342125, -350740, -214826, -122147, -152377, -202432, -116781]
22982a16781J97407J7434j93658N1090J10090M7974q7684m4503Q6946R1844n7436
22971A02723j47278J76503L2680r1313j73592N2603L6048K3006K943P3899j20850
22960c2628k6624J46134K42516k2531j26110J60897j3669n2639N1018M1843j31711
22949B36496k96829K2485N1415l5032P7650R0150J5301R059J67076O0104n7595
22938C40280o0294j91203j99528r7253P8752J00350n5700O6200J72044P4331P074
22927B35053j99990o4501l2643j76538n7505l8802M2202R2892O1298l394K19187
22916G7259R1251n4036j04496k2937J7842o044m5470Q029k4626M2469J24820j4365
22904H9696Q1855K996q8728r0780p5273J84157Q1424q6150l9797k01523m8475
$$ y = [-116781, 80626, 98060, -95598, -44508, 65582, 113556, 25872, -18631, 68315, 160159, 102723, -44555, 131948, 164628, 73315, -100277, -47674, -11626, 11380, 14323, 88222, -32628, -59252, 86882, 329398, 306867, 180757, 341654, 327985, 275346, 326364, 368207, 236496, -60333, -37848, 13567, -21465, 56185, 146335, 161636, 170695, 337771, 397875, 340280, 279986, 88783, -110745, -207998, -129246, -28896, -84596, -18396, 153648, 227979, 235053, 35063, -29438, -62081, -238619, -296124, -334926, -292724, -199832, -138534, -141928, 77259, 168510, 114474, 9978, -12959, 4883, -1161, -46631, -38602, -63228, -20759, 104061, 89696, 171551, 174547, 85819, -4961, -80234, 103923, 185347, 99197, 59400, -142123, -190598]
22893a90598K13967J32392p096k89j30394M8666r4801L1213q4816L6643K1638
22882b3475R4093k3245p5560j54755M21K8625N1759J07402J33931j12041K4925
22871E2080P5612j29388o205k6788O0253q1899l7994R1361o423k4047l349o7734
22859a04521o1408Q9539O4146J03329P9437j60603n2506M5561j4331m4907J7355
22848c8909O2397l3455l3530n9508L649K8081j1013O3740J41521N6874j28152
22837E1695j38129M7163R7018M4003L1859J16190j03843j32044J5002k3551j00759
22826i5396p067J59253J05476q2933N8796p6605r5973l8679k7365M1375l6776
22815i5894J60717J35656j77878k39658J4652K80014J94048N4731k48771j16062
$$ y = [-190598, 23369, 155761, 148665, 148376, 17982, 66648, -28153, 3060, -81756, -45113, -23475, 70618, 47373, -28187, -182942, -182521, -153896, -102137, 5265, 139196, 27155, 52080, 127692, -1696, -7901, -34689, 25564, -56335, -94329, -2968, -9391, -33438, -36787, -104521, -165929, -76390, -12244, 91085, 170522, 9919, -42587, 2974, -11357, -56264, -38909, 23488, -9967, -43497, -103005, -99356, -71275, -82288, -18548, 122973, 179847, 51695, -86434, -39271, 57747, 101750, 133609, 249799, 145956, 13912, 28914, 5363, -95396, -102463, 56790, 162266, 79333, 138129, 61524, -34449, -73128, -100493, -59118, -95894, 64823, 200479, 22601, -217057, -202405, 77609, 271657, 326388, 77617, -38445]
22805c8445J33450L2442k21727k4530r5180n0773O3868Q0394M8328M0166R801
22794b2206r9620q5534m974j8465m8228J29457J00280L1122M0299l6254M9796
22783C5673J36039j18056k77760j45065m6931J43351L71803J0290l29313m2309
22773b62278L31060J75327L0467j32813K8441J04420n3177l0257L1536R4938q9065
22762B28599j06619o9471n5655l3026K7667m5181J21061J96321k3950j71446j5947
22751E2353m8054p7101j4765J12034k8308k43304p1779M0545l610L0885J796J29146
22739a20162J08408P6117j18061K7010j69569p7219J06285J99165K5406M5032
22729A02412M8550j1898J7185p3498l8910j86394o9483R3473J06442k59987n0918
$$ y = [-38445, 95005, 127447, -94280, -118810, -213990, -264763, -200895, -120501, -72173, -32007, -22206, -121826, -207360, -212334, -230799, -279027, -149570, -49290, -18168, 22131, -14123, 35673, 171712, 53656, -224104, -369169, -416100, -272749, 99054, 109344, -219969, -262278, 68782, 244109, 274576, 141763, 170204, 274624, 221447, 191190, 222726, 317664, 228599, 121980, 52509, -3146, -36172, -8505, -53686, 67375, 263696, 239746, 68300, 52353, 4299, -72802, -87567, 24467, -3841, -247145, -318924, -278379, -281989, -251104, -249308, -120162, -11754, 64363, -53698, -26688, -196257, -273476, -167191, 31974, 57380, 102412, 150962, 139064, 156249, 82751, 43841, -142553, -212036, -118563, -12121, -272108, -323026]
22718c23026L7937J85094Q2511L9261j2399J6047Q7218k1713n229p7630K05136
22707B13207J3339r139k1550r4423j28312p5053N5463q9090r5677K1925J5373
22696a93937l3256M4855K70549M6823m9515j78445J47553N1058q6791J90344J84965
22685C94203j48379j74842j32077j0942J81127R4976q3054k38287j49631p0628
22675c37534J2429J69208J17857L1547o495O4043J09593j58582j38911j18495
22665b55340N5065j4633p6123R0095P3114K1652j93655o0224r8718j08866O1641
22654e05992J76475K95123P1609l8849K3974o0673K3235j27995n0071J4617J48287
22643c0260J40124R9582j39343j30901N267J7131l1653j30441J17334K60684j13721
$$ y = [-323026, -285089, -99995, -17484, 21777, 9378, 25425, 112643, 90930, 85701, 8071, 213207, 226546, 217407, 195857, 101434, -26878, -101931, -46468, -135558, -231235, -209310, -193937, -227193, -182338, 88211, 135034, 85519, -92926, 54627, 105685, 18894, 209238, 394203, 245824, 70982, -61095, -72037, 109090, 204066, 121012, -117275, -266906, -337534, -325105, -155897, -38040, -6493, -12988, 51055, 160648, 2066, -136845, -255340, -200275, -214908, -291031, -200936, -127822, -106170, -299825, -360049, -458767, -567633, -505992, -329517, -34394, 37215, -1634, 22340, -38333, -15098, -143093, -193164, -178547, -30260, 109864, 209446, 70103, -60798, -55531, -38400, -70053, -200494, -83160, 177524, 63803]
22632F3803j40106l1987J03767J51267j0626k36475Q194j1189K8358J35109q6723
22621b6608j48831l5825P1677l8857K1109J3549Q7765r53l6340k1687o6692m7005
22609b28698J58119J82948O225k09332n9652q1875Q0451l0746m2908Q5620J08570
22598c1278J5513j8649J67836k2987o4275Q0540J53132M3530K3534j02597q424
22587B35875j19208K9265j0903j87560O406J67766L9189k7842l8187k84642j06748
22576b96589m6521O9406J57170K20075J3133j53908j01681N5696N0354l5509p4012
22565a42386J98991L4942l4019R188l2548j6635q7332M3397K5225Q1603k83840
22554b03414n8257q4458J3185J80195l9142Q4445o0581M540j1092r122O0376O7723
$$ y = [63803, -76303, -108290, -4523, 146744, 136118, -100357, -92163, -103352, -74994, 60115, -26608, -175439, -211264, -139587, -178444, -157335, -143786, -56021, -56974, -93314, -115001, -181693, -228698, -70579, 112369, 118594, -90738, -150390, -232265, -151814, -182560, -225468, -139848, -31278, -15765, -34414, 133422, 110435, 46160, 126700, 279832, 323362, 346896, 244299, 235875, 116667, 145932, 135029, -52531, -46125, 121641, 160830, 132988, 94801, -189841, -296589, -343110, -273704, -116534, 103541, 116674, -37234, -138915, -83219, -32865, -68374, -142386, 56605, 91547, 57528, 66716, 34168, 17533, -69799, -26402, -1177, 80426, -203414, -261671, -346129, -332944, -152749, -191891, -107446, -168027, -163487, -174579, -183701, -123325, -55602]
22542e5602j19445o5459J23279P7457M5545J03869K1684j11067o7597k1502J84990
22531A16152Q4121N541k14824k80427M7302K71413J96408k12774k48108Q0418
22521a54778M3956Q4451J47279M171l122j09634m1186m6972j38322l2276k2183
22510b68616Q9705K9009J05281L5896j957m0006j03489M6438P0668J4197P7306
22499E4432K46748J23381j84498j44365j11247R6154p9223J8655j4242J1911M0941
22488E8647j35226J07935p3371J13544J00759k0284k16073j49850N4773j5099
22478a74245q6388J17454J13312P0658K3965L529m7152r4410n9692L3463J28577
22467B9071J087j39749j31985j9282j91682L0186K6849M5672K04293l5440K23047
$$ y = [-55602, -175047, -240506, -117227, -39770, 5775, 109644, 131328, 20261, -47336, -68838, 116152, 200273, 205814, -9010, -289437, -242135, 29278, 225686, 12912, -235196, -154778, -110822, -26371, 120908, 125079, 121957, 12323, -28863, -75835, -214157, -246433, -268616, -178911, -149902, -44621, -8725, -10682, -50688, -154177, -107739, -37071, -22874, 54432, 301180, 424561, 240063, 95698, -15549, 80605, 1382, 20037, 5795, 17706, 58647, -76579, 31356, -42015, 71529, 172288, 152004, -64069, -213919, -159146, -174245, -260633, -143179, -29867, 40791, 64756, 68285, 21133, -73277, -132969, -99506, 29071, 30158, -109591, -241576, -260858, -452540, -422354, -395505, -349833, -145540, -180980, 42067]
22456D2067p407O9M5765m0731O0835p8208o7772J34930P2354j6578R9580m0525
22444B04379j68291j00265J37459l9345r9976J0869J5164N613r9274p2985J72766
22433c3886M2326q9890l0510J25752M3259J21000K17277j40024r1101j21640k10788
22422a68225m6688Q3132J35496k2841j36888R3210J04511J02357q0987j84108
22412a21031M7535N6847O0610j6242j39401r2635J05179M4177O566J06590N207
22401F3402k38924l6589J02619Q838L3397P1072J2965j6098J58952J0572k11769
22390d1563j77582n1065J30368K37703j20267n7843K7211N615K2559P296N5827
22379C8259k569J86458j6368j81492l7563j89014j46381P1737L01390J7721n3922
$$ y = [42067, 34660, 34729, 80494, 39763, 100598, 22390, -45382, 89548, 161902, 145324, 244904, 204379, 36088, -64177, 73282, 33937, -66039, -55170, -40006, -34393, -133667, -206652, -33886, 8440, -81450, -111960, 13792, 57051, 178051, 395328, 255304, 164203, 42563, -168225, -214913, -131781, 3715, -19126, -156014, -62804, 41707, 144064, 63077, -121031, -73496, -16649, 43961, 27719, -111682, -204317, -99138, -54961, -48395, 58195, 63402, -175522, -212111, -109492, -100654, -67257, 3815, 16780, 682, 159634, 170206, -41563, -219145, -270210, -139842, 97861, -22406, -80249, -53038, -47423, -24864, -17568, 38259, 35690, 222148, 205780, 24288, -13275, -202289, -348670, -276933, 24457, 42178, -11744]
22368a1744R8265p7862k84219r8971K86325K7586q8037j89239j20349J87559J79691
22357i0995J64762o0926k98089j46239O6532Q4677J12033J46658R1185j46879
22347g7281j35960M7838M8754J9196r5574p1431R9453P1858J24215M0109k6204
22336D4973j17130J59514N9439j64038j67819N8803O1047J8259J94055P0816o0148
22325A57771j67679j59604P2877j026j0964J04943m913j42867P3756J55552J48455
22314B26301J26392m0492r0975j04327l9015J58887l0400j80758Q177q67j31023
22303i8100j8252J67379J94090j79125j28229m450J2276M450K6506P6278l0167
22292B2656j36797j25119R0537n814P5716n2633J79975Q3448q2558k6582O3878
$$ y = [-11744, 86521, 8659, -275560, -374531, -88206, -60620, -148657, -337896, -458245, -270686, -90995, 73767, 12841, -285248, -431487, -364955, -280278, -168245, -21587, 69598, -77281, -213241, -165403, -116649, -97453, -193027, -264458, -165005, -93147, 31068, 71177, 44973, -72157, 87357, 146796, -17242, -185061, -126258, -65211, -46952, 147103, 217919, 157771, -9908, -169512, -96635, -97661, -108625, -3682, -8595, -151462, -77706, 77846, 226301, 352693, 312201, 221226, 116899, 77884, 236771, 206371, 25613, 33790, 32923, -98100, -116352, 51027, 245117, 65992, -62237, -66687, -54411, -49961, -23455, 52823, 22656, -114141, -239260, -148723, -154537, -78821, -131454, 48521, 131969, 49411, 22829, 86707]
22281H6707q3020q3707n8323l4798K6664o129K41708J00902j25801p5330R2166
22270H1039q6880j10981M4153M4349L0150j01899L9760j4885O880j59078P1052
22259a56340J51127K43100L8585j90618j14683p4402J07086J27265K6291j52087
22249E324j16623n2078M0271L0672M6139K13214K02780J5164k28112j43462n0564
22238c7275Q2098k29700k7369J05426p146m1567r8073j47500k25057J28934K58712
22227b38517J56162k3059J01189R9796k66111J59109Q6039j57124l0252O5200
22217d7568L3942K4520o884j1923O7789L1700j37586j47068j8976j2191N8659
22206a65586k7289m01K03878J7984n3957p0945J2182l9721j63940J08323J28611
$$ y = [86707, 3687, -80020, -138343, -173141, -146477, -152606, 89102, 190004, 64203, -11127, 81039, -5841, -116822, -72669, -28320, 1830, -100069, -60309, -75194, -68314, -227392, -156340, -5213, 237887, 276472, 85854, -28829, -103231, 3855, 131120, 157411, 5324, -111299, -163377, -123106, -92434, -46295, 166919, 369699, 384863, 156751, 13289, -37275, 44823, -184877, -212246, -106820, -113966, -155533, -253606, -401106, -626163, -497229, -238517, -82355, -105414, -4225, 95571, -170540, -11431, 74608, -82516, -112768, -47568, -13626, 10894, 4010, -7913, 59876, 91576, -46010, -193078, -212054, -224245, -165586, -192875, -193276, 10602, 28586, -25371, -96316, -84134, -123855, -287795, -179472, -50861]
22195e0861J68459k7290p4444k6469j37492n5431J31141P9297j4576R0104o8823
22184A3615k09968j35160J5535j8989l4412p9407J1592K17530n4541R2211L8323
22173a43671J949k6941L6379q7918j40498J27094L19162k1530j10205K6207N7797
22162C7825R840k06114J8167J36574m1313j68905M1399K73899J46112j43513j85037
22151h1066L2313l7925J2054J1113k6108q5884n7449k3363J57101N9652k8765
22140f8327K5802r7295j2591Q9741j79620J3800J03901J09658J55451j91627l66646
22129d17753P8338K39254J53728R9816k3495r276o1561n9851j32579j39755j01326
22118c74460L83K26800l2304k2080J65026m791q2886J16717J07186j76331j54983
$$ y = [-50861, 117598, 90308, 15864, -10605, -148097, -203528, -72387, 6910, -7666, 82438, 13615, -196353, -331513, -315978, -334967, -369379, -448786, -437194, -219664, -274205, -181994, -143671, -141722, -168663, -132284, -220202, -360700, -233606, 85556, 64026, -46179, -19972, 37825, 47665, -158449, -140282, -3708, -45021, -213926, -172527, 101372, 247484, 103971, -81066, -48753, -86678, -74624, -63511, -89619, -175503, -232952, -256315, -99214, -39562, -68327, -42525, -139820, -152411, -62670, -242290, -228490, -124589, -14931, 140520, -51107, -417753, -339415, -100161, 53567, 153383, 129888, 120612, 59051, -800, -133379, -273134, -374460, -374077, -147277, -179581, -201661, -36635, -41426, -124312, -7595, 99591, -76740, -231723]
22107b31723j2408J83679k3116j02469q9182r6462M1039J51191K06017j19598
22097i3032j21415L5379J02664q6556l1313j12330K1855N3576N1338K2726J05426
22086e1682O5426j10224r3015M8350J58766n5205j41949O6007Q0959k6871m7009
22075a06447P2254J93856l2995Q1101O0359j03113j83786m283j07007l1294J12022
22064d9333J00561J11655p820j2847k75976j5197N4205Q1624l5272N6532k6272
22053a8140q1007j53193J07580j7996j01321O6946L6613M3587J23875j17781o007
22042a16844R9106K8958J05524p5685j4036K36039K6329Q201j17405j00048M2959
22031A23098j79007j95283J09634J32910k6202j86316j11847J22845K52198O3349
$$ y = [-231723, -244131, -60452, -83568, -186037, -275219, -371681, -330642, -179451, 26566, -93032, -214447, -179068, -76404, -162960, -194273, -306603, -284748, -231172, -179834, -157108, -51682, 13744, -96480, -189495, -141145, 17621, -37584, -179533, -113526, -32567, -59438, -106447, -34193, 159663, 126668, 207769, 268128, 165015, -18771, -23054, -130061, -161355, -49333, 51228, 162883, 155063, 142216, -133760, -148957, -94752, -13128, -48400, 8132, -18140, -99147, -252340, -144760, -162756, -264077, -197131, -160518, -116931, 6944, -110837, -116844, -17738, 11220, 116744, 41059, 27023, 263062, 289391, 297592, 180187, 80139, 123098, -55909, -251192, -141558, -8648, -34850, -221166, -333013, -210168, 42030, 105379]
22021A05379j83683k26436m1509R870l1998Q9670J84150K30020p8963r5104P6577
22010C7973m1198o9817m6515K26180J02369j1575k17048p0905j8076L5044J08417
21999C4849P3865M3047K7411L2118p437L4116l369P749r3813r8134l8483J03665
21987A15584k3222m8879q9882q8062J6705n6635m5736Q6580J76640l0532o3215
21976e0654N6326J40011l4196j26475k15666l1884N6322J92325N4918q3130M0497
21965a606J06516J29003P067p7973j56651j02635L4463J18530j49708K8822Q7699
21954B3527L8877M2555q4564j33891N9712R064m5324L02076J42486j76818r2142
21943H5558o8329q0408L8205J10499N5332J00971n4066j56651l5335J65060N2182
$$ y = [105379, -78304, -304740, -346249, -336379, -368377, -278707, -94557, 135463, 56500, -38604, 37973, -3225, -73042, -119557, 106623, 208992, 197417, -19631, -90536, -108612, -73568, 34849, 108714, 151761, 179172, 211290, 203853, 237969, 234600, 242349, 148536, 50402, 11919, 115584, 92362, 43483, -46399, -134461, -117756, -174391, -220127, -133547, 43093, 12561, -50654, 5672, 145683, 111487, -14988, -230654, -262538, -206216, -13891, 41027, -42103, -1606, 104910, 233913, 240980, 163007, 6356, -96279, -61816, 56714, -92994, -64172, 23527, 62404, 104959, 20395, -113496, -53784, -44720, -90044, 212032, 354518, 177700, 85558, 17229, -63179, -24974, 85525, 140857, 241828, 187762, 31111, -4224, 160836, 213018]
21932B13018N1291J24207j08480l23459l1753l339J0158q2377j36476L3748j19418
21921c72880N4622J48412K15585M3953J4541j52157j19949j10855K07633K97286
21911B26191l6051j7471p8330r7663k4870j0757Q1996J22576l7424j21692l5104
21900b8599K18197N4109J1649j15002j36534K5844J7595J05028N5889o2069r7490
21889D8617k37205o8331R0148J41647L7266j03616j32697L6719J11716K966k85919
21878c58689P2823J55397p2916j40588J74060L28641M8067k29972n5685L4455
21868d4407q7547n0222L5045Q724R8735J85729J00745k95871k96045j39779M2295
21857d42598K15699K50756J06877r5405r5589J97118J62043q4807r0226K9427
$$ y = [213018, 264309, 388516, 280036, -43423, -75176, -78515, -68357, -150734, -287210, -253462, -372880, -318258, -169846, 45739, 89692, 104233, -47924, -167873, -278728, -71095, 226191, 190140, 172669, 94339, -3324, -28194, -38951, 43045, 165621, 128197, 6505, -28599, 189598, 243707, 255356, 140354, 3820, 29664, 47259, 152287, 208176, 146107, 48617, -188588, -256919, -166771, -25124, 12142, -91474, -224171, -187452, -75736, -72770, -358689, -285866, -130469, -203385, -343973, -169913, 158728, 206795, -23177, -78862, -44407, -131954, -182176, -147131, -138407, -39672, 146057, 246802, -49069, -345114, -484893, -442598, -226899, 23857, 130734, 35329, -60260, 136858, 298901, 214094, 123868, 153295]
21847A53295m4711k37390R6120K32380K8684j41033r0579r3545N1378m4628Q4515
21836e514M1566P9366J02017P0010q0296o0016q5213r3902j34578J62432n72m4432
21824d9132J20448P3321N3216r5582j36222L2386o8693j87006o2373J04784K84330
21813F9477N7545m9749n8448r0562j09143N5561O7018l7882P8130J28514o8423
21802D2038k07031q2501O1448K02994p764k6618Q643k918N2501l8109K3563P4408
21790A00654q920j34740M4819J90589j17762j69928O6732M7285J32254l251p307
21779A40425p1071k06446n0106O7123R3402M4029J8038q7064J00925J80241k4637
21768B04859m235k06193j22144M9031J15308K9693j06569M0427K26931k38022
$$ y = [153295, 108584, -128806, -32686, 199694, 228378, 87345, -3234, -96779, -45401, -90029, -5514, 36052, 115418, 217435, 287445, 207149, 147133, 61920, -31982, -166560, -4128, -4700, -49132, 71316, 144637, 197853, 102271, -33951, -1565, -70258, -257264, -319637, -214853, 69477, 127022, 77273, 18825, -71737, -180880, -125319, -58301, -96183, -18053, 110461, 42038, -164993, -247494, -186046, 16948, 9184, -17434, -8791, -11709, 40792, 2683, 26246, 100654, 91734, -43006, 1813, 192402, 74640, -95288, -28556, 18729, 150983, 147732, 140425, 69354, -137092, -187198, -120075, -26673, 17356, 35394, -51670, 49255, 229496, 204859, 200624, -5569, -127713, -78682, 36626, 66319, -40250, 177, 227108, -10914]
21758a0914l1955R22J2906K21698J20605l9894L0298M5209m7807j87613k09782
21747i6327r7967o0363P7702J86925J68202l099o3121q0263J0891j73390o7871
21736a98681J3528J74852J06251m5700r6969j30993M3750R8379k4162j64517J2209
21725b12053j2J10717l869k5448l7026L5668J04548J3630k15549k32421q9223
21714e51038M2027J39986J76386K4523J40011n4646k04672J13223J16451L8417
21704a9332J91278m1930j79209j91526K9122J01415p0381n2659J90768K7078j43259
21693a58635K95845O7620j70776p5930j38465j90652m120M5254J02679o3406M664
21682b85922J97263p3265j0532j01129j37965J52293L6889j0872J82922K8516
$$ y = [-10914, -42869, -41947, -29041, 192657, 313262, 273368, 303666, 348875, 301068, 113455, -96327, -194294, -254657, -176955, 9970, 178172, 175073, 111952, 31689, 42580, -130810, -198681, -185153, -10301, 95950, 50250, -46719, -177712, -133962, -35583, -59745, -224262, -212053, -212065, -101348, -105217, -130665, -167691, -132023, -27475, -13845, -229394, -461815, -551038, -509011, -369025, -192639, -168116, -28105, -82751, -287423, -174200, -57749, -19332, 171946, 130016, -49193, -240719, -211597, -110182, -180563, -233222, -42454, -15376, -158635, 137210, 204830, 34054, -41876, -180341, -370993, -375113, -329859, -227180, -290586, -285922, -88659, -161924, -172456, -273585, -411550, -259257, -222368, -233240, -50318, -21802]
21672b1802k9312M249q2487o8978m9976N3225R1946K8026j4108K6948o0530J23524
21660G25M1987j0669L9642j22464m5882J7283R1644J6485j39370J16800J40287
21649A46468j68199j33184j18630P3434j05666l1080J34358R9k7816p1897M7923
21638b54190Q7894k2873J63652o8314m1585R1470m5412m8338j03031L9152Q5240
21627a16335J31625J54719k86187j07173l2162Q9418j0521J6484L0867R8750N0897
21616B0382k731m1460P1156j0036j39017q1896J15493J4272j81229L8798R2067
21605a04201P8842P264L6171N424o7721J5042j96399r0801R1353j3840j01218
21594c40084J97448J97917L6828J17926k8487j7602j73952j13744J30272Q6334
$$ y = [-21802, -51114, -46865, -129352, -198330, -248306, -195081, -103135, -75109, -89217, -62269, -122799, 725, 42712, 32043, 71685, -50779, -96661, -79378, 12266, 28751, -110619, 6181, 146468, -21731, -154915, -273545, -200111, -305777, -336857, -202499, -202400, -230216, -302113, -254190, -166296, -189169, -25517, -93831, -135416, -43946, -89358, -137696, -240727, -201575, -116335, 15290, 170009, -116178, -223351, -255513, -166095, -176616, -160132, -129265, -30515, 20382, 17651, -23809, 47347, 37311, -101706, -183602, -68109, -53837, -235066, -196268, -104201, -25359, -18095, 18076, 23500, -44221, -29179, -225578, -316379, -225026, -238866, -340084, -142636, 55281, 92109, 210035, 181548, 163946, -10006, -123750, 6522, 92856]
21584I2856q2682q4453K1092q1795k6018K03484j452j79775j4423J5061J9220
21573a18885m0943p4339P2822J57154K05023J89311o6734j26064o3375K0652M7152
21562B01774o8816J13151p0011m9519P0031j8778r1326q5455j897n4758J56491
21551A00887j39238j60115k0985J1376o1459m4268n8420j0861J6107L0786J69527
21540a66663k6975l2419P5134p9091J10787p277N0679Q6619K10929k3348k51130
21529e2755j11093J46639J27282Q2552p1198j77241m9313K6452O5037J30534J60871
21518B77767L2758o3952r0985k1874O3997q3777q7552j00863m5074M9748O9731
21507g6l3025k17976q0351K6084P8045p587j29237K9836J80155M7217M6818m5090
$$ y = [92856, 10174, -74279, -53187, -134982, -161000, 42484, 41032, -138743, -153166, -138105, -118885, -159828, -234167, -161345, -4191, 200832, 390143, 323409, 197345, 133970, 154622, 201774, 132958, 246109, 176098, 126579, 196610, 177832, 86506, 1051, -846, -55604, 100887, -38351, -198466, -219451, -208075, -269534, -313802, -372222, -383083, -366976, -336190, -166663, -193638, -226057, -150923, -230014, -119227, -126504, -75825, 10794, 221723, 198375, -52755, -163848, -17209, 110073, 192625, 121427, -55814, -105127, -78675, -13638, 116896, 277767, 310525, 246573, 155588, 133714, 197711, 113934, 26382, -74481, -119555, -69807, -76, -33101, -251077, -331428, -305344, -227299, -234886, -364123, -334287, -154132, -106915, -60097, -105187]
21495a05187K4439P5421M7389L6321n7846k21801k97968j03909K9499K82854J68590
21484a22198P4381m6239j37161N9064J00025P2424j992Q3744j41511p3232M5533
21473h7162o2630L7536K1581j09488O8713K24086K9478j04059o473K1575R1324
21462A24481k2453j6459j17064j36080L3860r4406M6440r1259j28301J09619K01991
21451h9631K15663J5008M5833n4773k16085N9152j86882J03725J08926j21468
21441a20532M5445P6140j34060q7595l3891Q6800M2678j75463j50157K42053K74584
21430F6002l8107j19110O3787J06659J20757j38753j4495N3865K2037j3648k4707
21419H4287k00173p4080J3981o2837p130J31606L2776j07283r8108p5457O6644
$$ y = [-105187, -80748, -5327, 42062, 78383, 20537, -201264, -499232, -603141, -573642, -290788, -122198, -47817, -94056, -231217, -172153, -72128, 296, -1696, 82048, -59463, -132695, -87162, -149792, -112256, -90675, -200163, -131450, 92636, 122114, 18055, 11582, 33157, 124481, 102028, 85569, -31495, -167575, -133715, -228121, -181681, -272940, -401241, -291622, -89631, 126032, 141040, 186873, 132100, -83985, -24833, -211715, -107990, 936, -120532, -75087, 1053, -133007, -220602, -254493, -167693, -125015, -300478, -450635, -208582, 66002, 27895, -91215, -27428, 79231, 199988, 61235, 46740, 100605, 122642, 108994, 84287, -115886, -189966, -175985, -238822, -245952, -114346, -81570, -188853, -286961, -362418, -295774]
21408b95774P0577P6173j8040l6139L2988J72438J7788r5643j02028Q5647n466
21397i7479k28726l2208J51277n5825j7022O3578J12643P0291r6565l0502J32732
21386b7806j8374j04861N1882l8140O4584R6905N2073O053j11075j4816O5101
21375B1526Q4872N9266j3240j23704K0253O6483j09552k36024j73999k13260j9633
21364f37012J09137K97108K00034J37878R1996k26122j89415M3114J25410J10256
21354F2384j06606o2181J08820J42167m4699q8165J0945l6468j4547L4976k6266
21343a9640o4028m6620J35594P4162n9724l6099O9417p3823j14752o7243q0307
21332b83063J07790K6302J8390J72289J37249J89593O6446k25271j93379m4413
$$ y = [-295774, -225197, -149024, -167064, -203203, -170215, 2223, 20011, -75632, -177660, -92013, -97479, -326205, -358413, -207136, -262961, -279983, -216405, -103762, -33471, -130036, -160538, -27806, -46180, -151041, -99159, -137299, -72715, 24190, 76263, 82316, -28759, -43575, 21526, 106398, 165664, 152424, 28720, 48973, 115456, 5904, -230120, -404119, -617379, -637012, -527875, -230767, -30733, 107145, 199141, -26981, -216396, -173282, -47872, 62384, -44222, -106403, 2417, 144584, 99885, 11720, 22665, -13803, -28350, 6626, -19640, -83668, -130288, 5306, 79468, 19744, -16355, 53062, -20761, -135513, -202756, -283063, -175273, -148971, -130581, 41708, 178957, 368550, 434996, 209725, 16346, -28067]
21322b8067k8770M0071J17309j11897O9787j5469J4219r7121m7945k6593J07290
21311g186P216l8177J96678J22743j38808j22610k04959N126K11033P0574n7427
21300D4203o4489L3578R8009r9085L549K25452M508j22172j23000r0327J652k2138
21288a10260p019j8589P1685N3483Q8040P0794j00172r682m1375n7623p523k25191
21276b93432o4443K95266K31113p769j60585j5956q3496j06978J34341O2110k41224
21265b51053o3843j3422L2950J41116J68941O6850o0059R377n4800K6033r9606
21254i7516n8312J97848J71318j38215k98268l7295J22284J48572J40489m1187
21244A09718j16460k2404p626j3380J5182n8098j76973p1700J88869J62798L4283
$$ y = [-28067, -56837, -16766, 100543, -11354, 58433, 42964, 57183, -39938, -87883, -114476, -7186, 30, -38147, 158531, 281274, 142466, 19856, -185103, -179977, 31056, 101630, 44203, -20286, 13292, 111301, 12216, 15765, 241217, 245725, 123553, 553, -89774, -88122, -110260, -117279, -135868, -64183, -10700, 77340, 148134, 47962, 38280, -3095, -60718, -68241, -293432, -357875, -62609, 168504, 160735, 150, -15806, -99302, -206280, -71939, -9829, -251053, -314896, -328318, -295368, -154252, 14689, 81539, 21480, 30857, -23943, 2090, -97516, -155828, 42020, 213338, 75123, -223145, -260440, -138156, 10416, 150905, 109718, -6742, -29146, -36772, -50152, -34970, -93068, -270041, -341741, -152872, 9926, 44209]
21233D4209k1128j0564n196q75J11561j3259j75134j17112N3581p0497j07703
21222c12117r329Q6795J58108n5044P9719m2261j68719j252n539L2998m1333N0523
21210b27451K61073J48918q8806M0322n8044n6374j01537k6264m9896P0435J27151
21199C9527M9567l7709R159l4798k1040r0479R0516J61993j04315k16521R3061
21188f1039l5352j48579N8946J48690J52995L8085r5311r4392K8825O2043M9532
21177A04443j62963q356o9627R786j08292Q7547J31093J22778L6056p6409l3996
21166C2060j02971N3828l4654m2973J22570J09498O1271j46483m6343j73448M5161
21155a22484J58621Q6990n1160j50537j47410m7597J10165P944L5591J04881j35090
$$ y = [44209, 23081, 12517, 7321, 6446, 118007, 104748, -70386, -187498, -133917, -204414, -312117, -321446, -234651, -76543, -131587, -51868, -94129, -262848, -264100, -269639, -236641, -277974, -227451, 33622, 182540, 93734, 134056, 76012, 19638, -81899, -108163, -158059, -87624, 39527, 89094, 51385, 60544, 25746, 4706, -85773, 4743, 166736, 62421, -154100, -61039, -96391, -244970, -186024, -37334, 115661, 153746, 58435, -35957, -7132, 54911, 104443, -58520, -66876, -136503, -126717, -235009, -147462, -16369, 106409, 142465, 66056, 32060, -70911, -17083, -51737, -94710, 27860, 137358, 198629, 52146, 5803, -167645, -122484, 36137, 123127, 71967, -78570, -225980, -273577, -163412, -155468, -119877, -14996, -150086]
21144a50086r8600O1134J73731J84027j48071q4334R3806j08870j67293k6631
21134b71187J72413K57183K89085l3570J6680j28736r9133q1771j03525R4966
21124A12405j19716j12927Q4778n6856M6756l810j13546n154J6316L4689J99230
21113H2165J02714P0434j43797j86214r1246P5976N0415o5522l9245O6658K2311
21102e5351J46346J20616Q2927q1710r7701r8298L3274j34462Q290J6727N4276
21091e066k06536k3994J45624J04685J3423Q7855m8665M8963k1817j31075m0796
21080g7399M7353J61294K35298N9231j19883k44439j8388J7996j35188p1330K1957
21069a23498J39634k1739J07318K3404j40738N0528J35763J8405j35928K3331
$$ y = [-150086, -248686, -187552, -13821, 170206, 22135, -62199, 31607, -77263, -244556, -271187, -98774, 158409, 447494, 413924, 430604, 301868, 202735, 120964, 17439, 112405, -7311, -120238, -35460, -92316, -45560, -49370, -162916, -168070, -151754, -117065, 82165, 184879, 255313, 111516, -74698, -165944, -89968, -39553, -105075, -144320, -77662, -55351, 90995, 211611, 294538, 212828, 115127, 16829, 50103, -84359, -76069, -59342, -5066, -211602, -235596, -89972, 14713, 28136, 115991, 67326, 116289, 94472, -36603, -77399, -30046, 131248, 366546, 425777, 305894, 61455, 43067, 61063, -74125, -145455, -123498, 16136, -5603, 101715, 125119, -15619, 34909, 170672, 189077, 53149, 76480]
21059G6480j23758j58527o1727P1797J38464J03409J3310L0222j01657M2597L7571
21048F8181q9014o3458J84789J92857l08131j83945J5741P1340J63780k4866r1543
21037f4269J1605L8432j6349j03876o027j0552Q7304k9475P6426j51057n3960
21026b21798j26894K56944K7959k14443J12045J14149J14477p3688k45637k5776
21016b82662R9896P3837j44745N0720J51882J75590J02678J41563m6214j30654
21006A91891j25968o0913j51981Q1261J62512m5453o1141p8957R659n3006O6401
20995f5695N6760j09432j3119J89116J14615j5768r4059j86123K633K8067j8627
20984a11632j2320J09093K3332n0282M5573J11067P5149j07996j52462p1592j3975
$$ y = [76480, -47278, -205805, -267532, -195735, -57271, 46138, 59448, 89670, -11987, 30610, 68181, -20833, -84291, 100498, 293355, -14776, -198721, -182980, -111640, 52140, 27274, -64269, -52664, -14232, -30581, -134457, -140484, -151036, -63732, -93207, -16781, -167838, -221798, -348692, -91748, -63789, -278232, -166187, -52038, 62439, -11249, -256886, -282662, -182766, -108929, -253674, -202954, -51072, 124518, 227196, 368759, 322545, 191891, 65923, 5010, -146971, -65710, 96802, 51349, -9792, -88749, -79090, -132096, -65695, -8935, -118367, -131486, 57630, 172245, 156477, 62418, -123705, -121072, -93005, -111632, -123952, -14859, 8473, -41809, 3764, 114831, 189980, 81984, -70478, -142070, -156045]
20973a56045J18567L7554j63263n378L8146j2412N0618l3087j410k7823J05012
20962d9521R5270m7608j82829K4761P0892O0150M0554J17569o1349N0152J19666
20951B37707N7761j21235j4663n5197r3691p360k0839j15178k7669j360J84171
20940B2447J51264M4078j56808J3414n9536M2996q9818j27846k10599q2065K01113
20929b51360O9760J91994J82843o2564m9921P2655j6219j23971k4737N8491k8614
20918A8357J49458p6094p3174n9691O9611j57164j5150p4909J52476K21003n8590
20907I6133r3006j9973k4827J4088m6014P3635J18823n6175l4860j25550j48098
20896b45824j9215p7763j8252J15042J49186O1562k3454k5262R2883n268P4478
$$ y = [-156045, -37478, 76, -163187, -168565, -130419, -142831, -92213, -125300, -126710, -154533, -49521, 45749, -1859, -184688, -159927, -89035, -28885, 11669, 129238, 67889, 118041, 237707, 295468, 174233, 159570, 104373, 10682, 3322, -17517, -132695, -160364, -161724, 22447, 173711, 217789, 60981, 74395, 14859, 57855, -31963, -159809, -370408, -452473, -251360, -181600, 10394, 193237, 130673, 80752, 153407, 137188, 13217, -11520, 46971, 18357, 167815, 91721, 18547, -41144, 28467, -128697, -143847, -218756, -66280, 154723, 96133, 3127, -16846, -41673, -27585, -73599, 36, 118859, 62684, 27824, -97726, -245824, -265039, -342802, -361054, -246012, -96826, -35264, -58718, -83980, 8903, 3635, 78113]
20885G8113K2229J5708J25312j58588R866L3625j68026j17240n4993M9606O6132
20874i8256J28530R3289m4894q1200j23404j71612j9123K0209J80908L1127o6815
20863a51241J32284M8654j15605k2424p9863j75063M5601j5979J34897P9167m5229
20852a64801k6720L9492J94255R5643m4520M2124j3853j24744n0277l1026J35526
20841E1099l5900j760q7418o1311Q0483J42910j08422q3531J49917J00626j52764
20830f071M4681o1001j28196J35077K35103l0596k28257q0311J27928O9131j65506
20819h8018M4624q4226J57963J24004J5090k45309M795K05501m5406K7322J1964
20808A28304J16508m7811r293n3234j5029k2803r3560n9172j33112j48019J27279
$$ y = [78113, 100342, 116050, 241362, 82774, 92640, 126265, -41761, -159001, -213994, -164388, -98256, 30274, 123563, 78669, -2531, -125935, -297547, -316670, -296461, -115553, -84426, -151241, -18957, 29697, -85908, -108332, -188195, -363258, -317657, -333636, -198739, -119572, -164801, -191521, -152029, 42226, 137869, 93349, 135473, 121620, -3124, -53401, -84427, 51099, 15199, 13439, -73979, -135290, -54807, 88103, -20319, -103850, 46067, 146693, -6071, 38610, -22391, -150587, -15510, 219593, 188997, -39260, -119571, 8357, 77488, -88018, -43394, -127620, 30343, 154347, 169437, -75872, -71077, 134424, 89018, 116340, 128304, 244812, 197001, 187708, 134474, 119445, 96642, 3082, -56090, -189202, -337221, -209942]
20797b09942J16201O4560o2086j1380m3985k39623M1980J31805K8242o729K17694
20786B6737K01386o4551j631P2116k9227r395K5683P7700r3975k60360l7787J0508
20774h2796o12J35663m1305j60328n1965P998l1459N5553q1491j62766J4946R1945
20762c06617J05856j1645K43649N5660j2788O2620l1373j3765O2882j70859r6124
20751a12504l5188j76283n2180J46160J50218J94933o5285k59840j11799M0852
20741b80916q0027M6281L18434O2026k5168j01191L05J76198l4934q4977o9365
20730g3334j24985o3572k6750J15174J29834l6072j39439j22741Q7567J36861
20720a17457J44751l8786P1064P7731K7640j83960l6632K7114J57602n2735j65131
$$ y = [-209942, -93741, -29181, -91267, -102647, -146632, -386255, -344275, -212470, -184228, -190957, 26737, 228123, 163572, 161941, 234057, 204830, 195435, 221118, 298818, 204843, -55517, -93304, -82796, -83408, 52255, 10950, -149378, -201343, -193345, -224804, -169251, -250742, -413508, -398562, -306617, -200761, -212406, 31243, 86903, 74115, 136735, 105362, 91597, 154479, -16380, -112504, -147692, -323975, -376155, -229995, -79777, 115156, 49871, -209969, -321768, -280916, -360943, -314662, 3772, 65798, 40630, -60561, -60256, 115942, 81008, -3969, -73334, -198319, -261891, -288641, -173467, -43633, -79705, -219144, -341885, -254318, -117457, 27294, -11492, 59572, 137303, 164943, -19017, -55649, -28535, 129067, 76332, -88799]
20709h8799p1990j5217J52122Q8665L611J0387q480r1180k36603j01362K47242
20698a11604K16403j10029r7039l5913k8332j52692J5678K44184j18517j34229
20688c12090O7654K11173q480j13197M6407m3246J7518N8144O5645n5367k29940
20677b95779p477J39371j2233o6149j6585J24134R2589l8781o2948Q0822K18284
20666A55248N6016r4197j8487m8533l2693r044L1240j7786j35414K812J54236
20655D3398l0524p7160J14861K1424m436j89720l3872o2056j45157m2963J31390
20644b74815R3959J38149M4768k11450j01090J48506Q3238J1969M0443j14060
20634a40383m3635J31615j03000M5214j61708K76519J01704j83065j09439r2753
$$ y = [-88799, -160789, -176006, -23884, 64781, 68392, 78779, 70299, -20881, -257484, -358846, -111604, 104799, -5230, -102269, -138182, -166514, -319206, -303528, -59344, -177861, -312090, -244436, -33263, -41743, -154940, -108533, -151779, -134261, -76117, -10472, -65839, -295779, -303256, -163885, -176118, -242267, -258852, -134718, -42129, -80910, -143858, -63036, 155248, 211264, 117067, 98580, 50047, 17354, 8310, 39550, 21764, -113650, -110838, 43398, 12874, -64286, 50575, 71999, 67563, -122157, -156029, -218085, -363242, -406205, -274815, -180856, -42707, 2061, -209389, -310479, -161973, -78735, -66766, -26323, -140383, -184018, -52403, -155403, -110189, -271897, 4622, 106326, -76739, -186178, -278931]
20624b78931K4091J8368O5567k9917M3981J39935J0581l9086J47180j64471n7756
20613a20458L4022J8967j41120j46810K16831J71277o9167j50265n1752J19023
20603a19452J01447o5392j72012j4677J67279L8012K8798J3782J73380N1188j78123
20592B4230M5672j16045j9310Q354p7180j17591j0971M6751J42673K14439K03346
20581C44368j44029k01226n5547K164m413J59301R6061j90679k11559N9162J73848
20570B7451n8860j04722j54382K8893J8691P4974K02495R1380Q2466j36341n7478
20559A4567O4833N3046j94948o3596q8108J76886P8225j14919Q6491k2755j69651
20548a79929n9847R691L08595R9718k40369J2157M7505j431j6283P3298j77354
$$ y = [-278931, -254840, -236472, -170905, -200822, -156841, -16906, -6325, -45411, 101769, -62702, -120458, -86436, -67469, -208589, -355399, -138568, 32709, -36458, -186723, -238475, -119452, -18005, -83397, -255409, -270086, -102807, -64795, -35997, -22215, 151165, 202353, 24230, 69902, -46143, -65453, -57099, -134279, -251870, -262841, -216090, -73417, 141022, 344368, 200339, -887, -56434, -54270, -58683, 100618, 196679, 6000, -205559, -146397, 27451, -31409, -136131, -290513, -261620, -242929, -167955, 34540, 125920, 208386, 72045, 14567, 79400, 132446, -62502, -126098, -214206, -37320, 40905, -74014, 12477, -10278, -179929, -239776, -230085, 78510, 178228, -62141, -49984, -2479, -3910, -20193, 53105, -124249]
20537a24249j7158J45638J8157l8004m4700K2826J36750N3164n6054n6285J1486
20526E1571n200J5315L2202J3701J06194O3890j96283j74766j29531Q1391K03512
20515F1996P9852P0395o0350j71942p6841P3341K1463M6355j12507l229J9622
20504e1845m1488l9661j8468n8516J63636k1716j14515l2222O3032N1460r4982
20493a95285Q5061J22994n2967p773J12021J17576L5366k37094q3759J65305M1700
20482A03145n8036j07987r8287j53725J8075J18203L2212K6222L7991J0629k5263
20471i6821N3072N9860j24918J5291J00504l8787p3169M5640k078j05252J08788
20460e7870J70875J1613k4689j25740n8508J22230O3836J70854j51625j65798
$$ y = [-124249, -141407, 4231, 22388, -15616, -60316, -37490, 99260, 152424, 96370, 40085, 51571, 46371, 61686, 93888, 107589, 213783, 277673, 81390, -93376, -222907, -141516, 61996, 141848, 212243, 151893, -20049, -96890, -23549, -2086, 44269, -68238, -71467, -51845, -93333, -132994, -151462, -209978, -46342, -68058, -182573, -214795, -151763, -100303, -195285, -110224, 12770, -40197, -47970, 64051, 181627, 216993, -20101, -103860, 61445, 103145, 45109, -62878, -161165, -314890, -296815, -178612, -146400, -120178, -82187, -71558, -96821, -43749, 16111, -108807, -93516, 6988, -31799, -104968, -59328, -61406, -166658, -57870, 113005, 124618, 99929, -25811, -84319, 37911, 101747, 272601, 120976, -44822]
20450d4822L3674J57369K14425j35876j28978o9669M1721L493p6856J19366K17636
20439C31483J8111k19939j82030J25658r5459j91209P7795J80006J02276M8909
20429A95601p0173r4774O3295k8464o6519o3535l4847J18796J59588J8824n2248
20418A45544j65958J1262k2491J72616O1263l11224n8616O3330N8391m4212K49154
20407A59059j20501j52845l2225O6239m8302M5740j620O1234j06370P828O9329
20396e2434L6412n2964m9500j11890O297K7570k9877N1244r684J1507q6588N2596
20384b07311K3316M794K445N0680k4495r1427K1291K14829k185j01304p8172L6034
20372a51505k4268J71443J36667n9878j55603k20193l3633K09963j4398N8371
$$ y = [-44822, -11148, 146221, 360646, 224770, 95792, 26123, 67844, 71337, -5519, 113847, 331483, 349594, 129655, -52375, 73283, -22176, -213385, -135590, 44416, 146692, 195601, 125428, 30654, 93949, 65485, -1034, -64569, -99416, 19380, 178968, 197792, 145544, -20414, -9152, -31643, 140973, 202236, -108988, -167604, -104274, -45883, -90095, 159059, 38558, -114287, -146512, -80273, -128575, -82835, -84455, -23221, -129591, -121763, -52434, -16022, -68986, -118486, -230376, -224079, -196509, -226386, -175142, -184826, -173319, -259907, -207311, -183995, -179201, -176756, -126076, -150571, -241998, -220707, -5878, -8063, -109367, -187539, -151505, -175773, -4330, 132337, 72459, -83144, -303337, -336970, -127007, -141405, -83034]
20362h3034K8525n0344R5979N6355k2606O6312j35472n1989J32504O8318J90R5299
20350B00037j62206j23523j4372O1909K27727o045j70218K6177J38492k31309
20340e3331k12353M9527K56642P4327j49422Q1816L9387k31624j38007j9890N0726
20329b52202J23904L2985j3228O7565L9348k1086J02085J11079R4786N8494j95700
20318A48030j55277R0299r9941k92421p6604J14945N2686q1310m600L03263m5933
20307d6863r9689O0262J05873m8707j11614k17648J3808J12841m4104O8929P6026
20296a30886m3005r0200k0663J51296J32644n7194j9394n9821m3580N8286j31042
20285b53559J72155K12087j47483j08515j12696Q2756m6981l5651J11177Q5573
$$ y = [-83034, -54509, -104853, -8874, 47481, 24875, 91187, -44285, -96274, 36230, 104548, 104738, 200037, 37831, -85692, -100064, -38155, 189572, 183527, 13309, 39486, 177978, -53331, -265684, -216157, 40485, 114812, -34610, 47206, 86593, -145031, -283038, -302928, -252202, -128298, -95313, -108541, -40976, -1628, -22714, 79371, 190450, 285236, 343730, 148030, -7247, 83052, -16889, -309310, -385914, -270969, -218283, -299593, -304193, -930, -46863, -146552, -86290, 19583, -29124, -140738, -358386, -344578, -231737, -275841, -206912, -130886, -173891, -264091, -284754, -133458, -814, -58008, -77402, -137223, -180803, -122517, -253559, -81404, 130683, -16800, -125315, -238011, -155255, -202236, -237887, -126710, -41137]
20275d1137k7540J81411J44215Q9294m4954j44314j87067R0445K31872J06774
20265C98999P7030j14785o7752l0783m6054m4623P8402N8983k6987m7530M1008
20254B75908K2064Q3517J66402o0254j9494J49929N3531Qk7173m5036j2106M1462
20242F28758M6245n0748J00386P883J3824K3383Q9366r5077j24831k52217k5423
20231C61549J61557q131r6283l1202Q3594L3634J25624L0139N4810j63088l8658
20220E13545L7428M6074J32426N0251P0807K2550j59753o0336M4754j11280j22678
20209D63788Q148p7840M3111J46761J00438r081j79788N1994Q5729j344K3071
20198F54987j092o911l0905j80422P0507Q1526k1501M9863J59568j92066m58234
$$ y = [-41137, -68677, 112734, 256949, 346243, 301289, 156975, -30092, 60353, 292225, 398999, 476029, 361244, 293492, 262709, 216655, 172032, 250434, 309417, 282430, 234900, 275908, 297972, 381489, 547891, 487637, 468143, 618072, 671603, 671611, 644438, 599402, 587296, 628758, 675003, 624255, 724641, 732524, 746348, 769731, 859097, 764020, 639189, 386972, 361549, 523106, 514975, 418692, 387490, 471084, 504718, 630342, 660481, 715291, 552203, 513545, 550973, 597047, 729473, 779724, 850531, 873081, 713328, 652992, 697746, 586466, 463788, 471936, 394096, 437207, 583968, 684406, 675325, 495537, 547531, 633260, 631916, 654987, 653895, 646984, 616079, 435657, 506164, 587690, 566189, 616052, 775620, 583554, 125320]
20187A25320o5071J53958P8370k055P5755J31142R3056j36909k44380k12775J07332
20176A03743J70846N4544o126j69127j25796J23697m5463j30636J0695J394O6612
20165E4383m484p4642R6526P4110R9667k0629j60080k8344r8837k192M3181p052
20153b8393O703J14574J0146l8321r2094j31283J09562M0391R0692N9861J31314
20142B73152l1654j47393J7032N7993k0804r2299k3266N6254O3606n4096p4579
20131B3946O1674J19017M9489j4139q6606l9907k1786K2449Q9619j0777j14070
20120G8909m2379o0823L4743l7666O5911J33297M1863L9679j43366n9007J94711
20109B45872L8644k51439k69716L8223K2018n6666K19809M9996J6173L4050J22028
$$ y = [125320, 60249, 214207, 292577, 290522, 366277, 497419, 590475, 453566, 209186, -3589, 103743, 274589, 329133, 323007, 153880, 28084, 151781, 106318, -24318, -13623, -12229, 54383, 49899, -24743, 71783, 145893, 245560, 224931, 64851, 36507, -62330, -64522, -21341, -28393, -21690, 92884, 103030, 64709, -27385, -158668, -49106, -8715, 81977, 141838, 273152, 241498, 94105, 111137, 169130, 148326, 56027, 32761, 89015, 152621, 98525, 23946, 85620, 204637, 254126, 239987, 153381, 113474, 91688, 114137, 203756, 192979, 78909, 36530, -24293, 10450, -27216, 38695, 171992, 213855, 253534, 110168, 51161, 245872, 284516, 33077, -236639, -198416, -176398, -233064, -13255, 36741, 52914, 86964, 208992]
20098B08992O0536O3350K27247J22149m6342N3140J44009J38660M9431j42024
20088H79148j58397Q2J28578J00245k8997j69619N020J14827J46597P9169j03905
20077I92748J04669J96048j1849m4747o6964o9025r5195m7728j46102L593j0881
20066H04567J06662o0640j20756j51176n5272N4363L0542k41550N9453M8651k18781
20055B56063M5100k1129o8661R0684l6748r4815J16808Q3627k9087J58568J0760
20044E11170j05944j58932K53781K09311p3011j96856r141j01304o3048M9427
20034C15453M37209L37767l0681j11092j07758o370J08907K91660J93705k51974
20024A176826k00923j05716n5115n1015P0641J22248J63498J33004m4325r0953
$$ y = [208992, 269528, 332878, 560125, 682274, 635932, 689072, 833081, 971741, 1021172, 879148, 720751, 720833, 849411, 949656, 920659, 751040, 756060, 870887, 1017484, 1096653, 992748, 1097417, 1293465, 1281616, 1236869, 1169905, 1100880, 1005685, 957957, 811855, 815448, 804567, 911229, 850589, 729833, 578657, 523385, 577748, 608290, 366740, 426193, 474844, 256063, 301163, 280034, 211373, 302057, 265309, 170494, 287302, 370929, 341842, 500410, 511170, 405226, 246294, 500075, 709386, 636375, 439519, 430378, 329074, 266026, 315453, 752662, 1090429, 1059748, 948656, 840898, 834528, 943435, 1235095, 1428800, 1176826, 975903, 870187, 815072, 764057, 834698, 956946, 1120444, 1253448, 1209123, 1118170]
20014A118170l03407k28253K5575J01890R6882j8654k48352j21620O9141J26787
20004F18159j7450j12111J72242L7035m487O4059k04465l4608m4731o6030M2415
19993D50028m3109L2002J7673m3524m7381J17721l6058j14415q8244N9679j1298
19982B93074r5666j20822L8064R7236q9780q352L0636J64211k0839j02297J15824
19971C01289N3940o300q4766l5337k8250J20565O8595j24877l8389P2016J09187
19960D07673Q6682l3376j65805j03239q3125j25090N2803J99663Q6695j18516
19950B04365m7037j2733n2740K8658K06773j2604j21971N4633L845r7045n9521
19939I4623j3689K8268o2755K6596J76218j27158r3650n2489L0192M4497K0512
$$ y = [1118170, 814763, 586510, 612085, 713975, 810857, 792203, 543851, 422231, 491372, 618159, 600709, 488598, 660840, 697875, 693388, 757447, 552982, 518374, 473643, 407613, 450028, 406919, 438921, 456594, 413070, 365689, 483410, 447352, 332937, 244693, 304372, 293074, 197408, 76586, 114650, 211886, 122106, 113754, 144390, 308601, 287762, 185465, 301289, 355229, 348929, 264163, 228826, 200576, 321141, 389736, 264859, 226470, 298486, 407673, 494355, 460979, 295174, 191935, 108810, -16280, 36523, 236186, 322881, 204365, 157328, 144595, 91855, 120513, 327286, 314682, 192711, 247344, 251189, 154144, 94623, 80934, 109202, 46447, 73043, 249261, 122103, 28453, -24036, 6156, 50653, 71165]
19928G1165J84402k6153q683n0043J15936L107q966p3567j0175n8109q3323J74657
19916B30248K89349o5592j68252l22M2790J22903n4305j63787k15688Q4432K11745
19905C13521j53229J9002j3474j13801k0883p0708K40359L9993p7417J58143o420
19894C15086p8125L2800J11652K5299j44783q5379l956J48784J44883k14124k00849
19883E1288n361o4603m7111J09794Q761J08570l1737k9379N1165N3067K9750l7042
19871A97162q6366j16838J2519P7851J03414P5540k5120j10144j14360k6849J68126
19860A54935N2884L8174j04701P2334N8966n0704j44669j8496K18650Q2895k01774
19849A58494k20031M6075J36845J06641K2191j46877l7880n250O4570P1573P8977
$$ y = [71165, 255567, 229414, 220731, 170688, 286624, 289731, 280765, 207198, 197023, 138914, 55591, 230248, 519597, 454005, 285753, 285431, 328221, 451124, 396819, 233032, 17344, 101776, 313521, 160292, 179294, 165820, 52019, 31136, -39572, 200787, 240780, 163363, 321506, 315086, 236961, 269761, 381413, 406712, 261929, 176550, 172594, 321378, 466261, 252137, 51288, 45927, -18676, -65787, 44007, 52768, 161338, 129601, 100222, 151387, 204454, 234204, 197162, 110796, -6042, 6477, 84328, 187742, 263282, 238162, 128018, 13658, -13191, 154935, 207819, 245993, 141292, 213626, 272592, 221888, 77219, 58723, 277373, 360268, 158494, -61537, -15462, 121383, 228024, 250215, 103338, 65458, 60208, 124778, 196351, 275328]
19838B75328j15502j09829J40241O9521m7044M1133P7332J81200j18535k11832
19828A82013K55251j98145j52352n5209J46572J99961Q9811q2203l6538J52110
19818E01271l446j24614Q3754P7996r5617m3233K1419N9541J46250j34195N8458
19807E47584O5163m0500j13238Q3604p558o3201j86308L2591J64443Q2997M2052
19796F07629j26482o9175l7624j44568m2341M5179J49950J74751J7603j41329
19786D33593l8210J38593K0237J87o6887O9747n8490j80008M8275Q5206K6040
19775D78283K23231N8898N5461K5035j84138j21225K1569J97636k9497J19993
19765H45246J88654k56214r8748Q9425K23136L06478O1598j14024m890j48966
$$ y = [275328, 159826, 49997, 190238, 259759, 212715, 253848, 331180, 512380, 393845, 182013, 437264, 239119, 86767, 31558, 178130, 378091, 467902, 385699, 349161, 501271, 497825, 373211, 456965, 534961, 439344, 396111, 417530, 477071, 623321, 489126, 547584, 612747, 572247, 459009, 542613, 535055, 471854, 285546, 318137, 482580, 565577, 607629, 481147, 411972, 374348, 229780, 187439, 232618, 382568, 557319, 574922, 433593, 395383, 533976, 554213, 554400, 487513, 557260, 498770, 318762, 367037, 452243, 478283, 701514, 760412, 815873, 840908, 656770, 535545, 557114, 754750, 725253, 845246, 1033900, 777686, 678938, 768363, 991499, 1297977, 1359575, 1245551, 1240661, 1091695]
19755A091695p6657p5089p5383Q485N0646J44815Q5613K3124p8361O181N6181
19744A161250j8696k0386J78731L5388n6549m237j29317l6786M7219J04544P8432
19733A339593P2352J05113L74363J83804n8775Q509N4350J03003J75208L29182
19723B686702K58271j2679J56490J04188J16400J71956J68678R0632K16424K19312
19713D176374L33354N29721L20928K54324J91878K02908K80621N62815L07131
19704G160054M16389L52953N37501N15323Q27996Q84204J110501J319787J672657
19695A4797365K032838K544816L071196L789832M847699O230414P607773R095157
19687E4017090R211812P684265N850037M466104M000608L563606K011231k48389
$$ y = [1091695, 1015038, 939949, 864566, 873051, 923697, 1068512, 1154125, 1177249, 1098888, 1105069, 1161250, 1142554, 1122168, 1300899, 1336287, 1279738, 1275501, 1146184, 1109398, 1156617, 1261161, 1339593, 1411945, 1517058, 1891421, 2075225, 2016450, 2024959, 2079309, 2182312, 2357520, 2686702, 2944973, 2932294, 3088784, 3192972, 3309372, 3481328, 3650006, 3740638, 3957062, 4176374, 4509728, 5039449, 5360377, 5614701, 5806579, 6009487, 6290108, 6852923, 7160054, 7576443, 7929396, 8466897, 8982220, 9810216, 10694420, 11804921, 13124708, 14797365, 16830203, 19375019, 22446215, 26236047, 31083746, 37314160, 44921933, 54017090, 63228902, 70913167, 76763204, 81229308, 85229916, 88793522, 90804753, 90556364]
19679I0556364j508775j236700L76926K456921L947977M304051L375024J686605
19671A03958393O44088N74827R1279j726118m227339o113737o518342n739076
19663H0943975m349245k959464j408722J51900K180498M112240O121552P214511
19655I2007245O856693N231185L364952K800058K884835J953798q9860k351933
19647A12656973l019174j809102R8779K487405L779402L484317J473053k58381
19639A18893272n90886n68380j827754m712908p092504q325482q272050p628608
19631G9874700o646476n723155m955698m074459l533683l141458k798384k186516
19623D6814871j778658j869776j793130j386524j058272r12207r98356j059100
$$ y = [90556364, 89047589, 87810889, 88187815, 90644736, 94592713, 98896764, 102271788, 103958393, 104602481, 105177308, 105268587, 103542469, 99315130, 93201393, 86683051, 80943975, 76594730, 73635266, 72226544, 72378444, 74558942, 78671182, 84792734, 92007245, 98863938, 104095123, 107460075, 110260133, 113144968, 115098766, 115008906, 112656973, 109637799, 107828697, 107927476, 110414881, 114194283, 117678600, 119151653, 118893272, 118302386, 117734006, 115906252, 111193344, 104100840, 95775358, 87503308, 79874700, 73228224, 67505069, 62549371, 58474912, 54941229, 51799771, 49001387, 46814871, 45036213, 43166437, 41373307, 39986783, 38928511, 38016304, 37017948, 35958848]
19615C5958848r55191q54596p67144n77860k45113l05594j66800K24919L52553
19606C2664022r4456n39983r23165r15824r00486p70832n38843k34353k36227
19597B7509853l08244J36K00259L77466k0637k67526j86039k75337m32045m48115
19587B6149771j51309L60907P74118J616667K901888M589032P287582R014881
19579E2543537N124404j739668m430023l835781k459476j451035j82041N86709
19571D4156626J165241K652274M629259P199474J2075162K0807513L6623287O3380817
19563A92689653R1504570Q1031947K3317734j2401845l4939456n0902761m8469782
19556B41830060l8004840k7919437j9707855j2634894n229615L982107J3598651
$$ y = [35958848, 35003657, 34149061, 33381917, 32804057, 32558944, 32253350, 32086550, 32311469, 32664022, 32569566, 32029583, 31106418, 30190594, 29290108, 28519276, 27980433, 27746080, 27509853, 27201609, 27201745, 27402004, 27779470, 27758833, 27491307, 27305268, 27029931, 26597886, 26149771, 25998462, 26359369, 27133487, 28750154, 31652042, 36241074, 43528656, 52543537, 57667941, 55928273, 51498250, 47662469, 45202993, 43751958, 43569917, 44156626, 45321867, 47974141, 52603400, 59802874, 71878036, 92685549, 129308836, 192689653, 284194223, 365226170, 388543904, 376142059, 341202603, 290299842, 241830060, 203825220, 175905783, 156197928, 143563034, 138333419, 142315526, 155914177]
19549A55914177J6927126N273557j2694206j9897617j8006563j3838410j0995530
19542A02682534r350885p502823o026022m817694l640135k555610k103338j936923
19534F4749104j613243j263218j147465q50897q42678p97032m58575j53797L15551
19525E7937750J003933K317566M147886P404269J2850625K0415059K6108336J9791945
19517A51977369L02077j2061517j2353279q119887l865544L86893O475632J6483084
19509A39224828L2948618N6565641P5227207P3351111O2738961J9047301n0337583
19502D08766084p2565938o0812483m4430129l4049703k7155967k1703976j6496027
19495A31551861j2013465r108251o483896m068982j828251P14315M038281O405496
$$ y = [155914177, 172841303, 178114860, 165420654, 145523037, 127516474, 113678064, 102682534, 93331649, 85828826, 79802804, 74985110, 71344975, 68789365, 66686027, 64749104, 63135861, 61872643, 60725178, 59874281, 59031603, 58234571, 57775996, 57622199, 57937750, 58941683, 61259249, 65407135, 72811404, 85662029, 106077088, 132185424, 151977369, 152279446, 140217929, 127864650, 119744763, 115879219, 116266112, 122741744, 139224828, 172173446, 228739087, 303966294, 377317405, 440056366, 459103667, 408766084, 336200146, 275387663, 230957534, 196907831, 169751864, 148047888, 131551861, 119538396, 110430145, 103946249, 99877267, 98049016, 98763331, 102801612, 109207108]
19487A09207108L308951m914429r090424q537572o797403n675021m572134l894194
19479F9034882l253770k827712k176296j527587j506363j520885j352861j215036
19471E3654372j508867j604147j452613j333841j126334r65536q98779r99762
19463D3764493r81246q96570p50511n97563o95309p72108o60173o49268p03789
19454C7057956q48134p05966o18519p81651o43179n57582n48493o47200o75702
19445C1031530o06433n90465n61890o40862o87020n11214m26976l37469l18871
19436B6350330k31472k76131k26301j50581m83235n79985m90812k43617k24138
19427B3444058m06740m43101n07245l43493l42815l44739k13206j97484j80827
$$ y = [109207108, 112516059, 107601630, 98511206, 89973634, 83176231, 77501210, 72929076, 69034882, 65781112, 62953400, 60777104, 59249517, 57743154, 56222269, 54869408, 53654372, 52145505, 50541358, 49088745, 47754904, 46628570, 45663034, 44764255, 43764493, 42783247, 41886677, 41136166, 40538603, 39843294, 39071186, 38411013, 37761745, 37057956, 36209822, 35503856, 34885337, 34103686, 33460507, 32902925, 32354432, 31707232, 31031530, 30425097, 29834632, 29272742, 28631880, 27944860, 27433646, 27006670, 26669201, 26350330, 26118858, 25842727, 25616426, 25465845, 24982610, 24402625, 23911813, 23668196, 23444058, 23037318, 22594217, 22086972, 21743479, 21400664, 21055925, 20842719, 20645235, 20464408]
19418B0464408N7207P7501K1963j00731k87332l42481l73343m05887o57063m15545
19408A8038697l73169n06115l23496j72238J51092j72114k16744j38187j53719
19399A6134007k08008k77873k47422l05655m78411l01531j06885k65725l99816
19390A3542681j95803q4526o8899j58216k61696j45421k23241k69363j73244j34816
19380A1827456j63641o5379k81437j84092K6834p8793l14140K5292J04190r3428
19370A0802862k54484k31637r520l0545r2623j31518j6226O8369j71553r6063
19360I837062J63352J44131J03316j21151m00514l98140l30076q1109j64030l13192
19350H439649j38070k44224k63611j50709j6578N7893j464j22432j25004O620
$$ y = [20464408, 20521615, 20599116, 20621079, 20520348, 20233016, 19890535, 19517192, 19111305, 18454242, 18038697, 17665528, 17159413, 16835917, 16663679, 16814771, 16642657, 16425913, 16287726, 16134007, 15925999, 15648126, 15400704, 15095049, 14616638, 14315107, 14208222, 13942497, 13542681, 13346878, 13262352, 13193453, 13035237, 12773541, 12628120, 12404879, 12135516, 11962272, 11827456, 11663815, 11598436, 11316999, 11132907, 11159741, 11080948, 10766808, 10792100, 10896290, 10802862, 10548378, 10316741, 10307221, 10276676, 10184053, 10052535, 10036309, 10104678, 9933125, 9837062, 10000414, 10144545, 10247861, 10126710, 9726196, 9328056, 8997980, 8916871, 8752841, 8439649, 8301579, 8057355, 7793744, 7643035, 7626457, 7684350, 7682886, 7560454, 7435450, 7442070]
19340G442070j14074j67807j22892M996k32919k64382M1780r2612m7012r5418
19330F351730K8211r0008j11444k52724j36634o6705r5054o4586j64098k64681
19320E134007K8221j736p9819O6250L1779r4638K9729J06031j29878l1305n6057
19309E002584n4017J13965p4001k89398k75324Q688Q9463r5061k39278j90130
19299C997491m3970j927r0371o5787k4388J8125n2612j42833j29017p768m0476
19288C416467m5015q274p2557j46618k9194J72728Q1716K0022N3582k1291l2540
19277C389026k17458j51139K4468J44083j64293j83411J02891J43720q2389n0243
19267B955255J25017l4217j03264j56109M0820q1580L7152J02900l8538j02316
$$ y = [7442070, 7327996, 7160189, 7037297, 7042293, 6809374, 6544992, 6586772, 6494160, 6447148, 6351730, 6379941, 6289933, 6178489, 5925765, 5789131, 5722426, 5627372, 5562786, 5398688, 5134007, 5162228, 5160492, 5080673, 5146923, 5178702, 5084064, 5113793, 5219824, 5089946, 5058641, 5002584, 4948567, 5062532, 4988531, 4699133, 4423809, 4432497, 4521960, 4426899, 4187621, 3997491, 3953521, 3951594, 3861223, 3795436, 3771048, 3789173, 3736561, 3593728, 3464711, 3456943, 3416467, 3371452, 3363178, 3290621, 3144003, 3114809, 3287537, 3369253, 3389275, 3442857, 3421566, 3389026, 3171568, 3020429, 3044897, 3188980, 3024687, 2841276, 2944167, 3087887, 3005498, 2955255, 3080272, 3046055, 2942791, 2786682, 2827502, 2745922, 2783074, 2885974, 2847436, 2745120]
19257B745120n4179O2584j91856J13513J65338o6652j2061o5808j6198J7017k1524
19246B675294p3791j15592k60927R444n4722J39240P0410j24564j66345K0656
19236B119103J92332O9446j78321p0147j2638j3462J14571r8873j55521L0471
19226A996961l2050K1285r0363p9208q8118k9412m1887O0495J49089J86756j446
19215B052102m8672j13690q4860n3520j04818J7107k07191k5884P6963r0608j6254
19204A400675P8259L437Q3983N0513J09803j06887k36515l0122K62055J2355k9225
19193A598331J7104J21996J82246r537k24856k11547m2044p8323J91203Q8140
19183A632713j63393n9241J72140R7835o4187p2422q4251O4422R5113m6890n765
$$ y = [2745120, 2690941, 2753525, 2561669, 2675182, 2840520, 2773868, 2761807, 2695999, 2679801, 2696818, 2675294, 2601503, 2485911, 2224984, 2234428, 2179706, 2318946, 2389356, 2264792, 2098447, 2119103, 2311435, 2380881, 2202560, 2132413, 2119775, 2106313, 2220884, 2122011, 1966490, 1996961, 1964911, 1986196, 1895833, 1816625, 1728507, 1699095, 1657208, 1717703, 1866792, 2053548, 2052102, 2003430, 1889740, 1804880, 1751360, 1646542, 1663649, 1456458, 1430574, 1507537, 1416929, 1400675, 1478934, 1482371, 1566354, 1616867, 1726670, 1619783, 1383268, 1353146, 1615201, 1627556, 1598331, 1615435, 1737431, 1919677, 1910140, 1685284, 1473737, 1431693, 1353370, 1544573, 1632713, 1469320, 1410079, 1582219, 1680054, 1615867, 1543445, 1459194, 1523616, 1618729, 1571839, 1566074]
19172A566074j03698K5137J38655J60204J537j53935j31078N0843q2188L05982
19162A777533L8946j70937j15257J14899m1110k06432M0669j05784Q2703q5427
19152A329803j37466J14965Q0872j04842j39072j19327n6567J89785K25836p7709
19142A306278n0533P9323r3667j48914l1230j08962J38589J71587n6137O1733
19132A268067M0851M3100k7685o1271Q8604Q0908k0213M4459M0687N887P2649
19121A576043j0651n3845K39750n889j12738j71382j13905J1442Q9410L3004K15288
19110A696527M9942K384J61531j56044j61335R8744J51277j01523n2330P5139
19100A764312J61446O421N1230l157K3772k8731j79911j60729K8341J4579k37896
$$ y = [1566074, 1462376, 1487513, 1626168, 1786372, 1787909, 1633974, 1502896, 1553739, 1471551, 1777533, 1816479, 1645542, 1530285, 1645184, 1604074, 1397642, 1438311, 1332527, 1415230, 1329803, 1192337, 1307302, 1388174, 1283332, 1144260, 1024933, 968366, 1158151, 1383987, 1306278, 1255745, 1335068, 1241401, 1092487, 1061257, 952295, 1090884, 1262471, 1206334, 1268067, 1308918, 1352018, 1324333, 1263062, 1351666, 1432574, 1412361, 1456820, 1497507, 1503394, 1576043, 1565392, 1511547, 1751297, 1745408, 1632670, 1461288, 1347383, 1358825, 1448235, 1481239, 1696527, 1746469, 1748853, 1910384, 1754340, 1593005, 1691749, 1843026, 1741503, 1689173, 1764312, 1925758, 1932179, 1983409, 1980252, 2004024, 1975293, 1795382, 1634653, 1662994, 1677573, 1439677]
19089A439677j3573O3940j02847J50178K47702k4865m6265j40865K7516K40199
19079A840797P5690J9394q1510j41732R2301N1260j01934q3713j3980J67011R0885
19068A914469r9431j70980J26412N0320n5708j43324p9959p788J7656Q7887Q4243
19057A723797r7835m4812N0821K8357J19545J8069m5594n0316J49774J58038R0391
19046B100235Q8103k0209J54091J22526M288j6100P606K6285M8412j5257K05214
19035B705194n2908J54771J44651m9695R0325J21323J9336K13384J06007j16873
19025C335515j17505J02812j3888m9497Q098m1351J71377L12453L14997J93897
19015D216908j8651L0873K30816L20409M36737M00522M29211O52982P24765Q86211
$$ y = [1439677, 1426104, 1490044, 1387197, 1537375, 1785077, 1760212, 1713947, 1573082, 1600598, 1840797, 1916487, 1935881, 1854371, 1712639, 1804940, 1856200, 1754266, 1670553, 1656573, 1823584, 1914469, 1815038, 1644058, 1770470, 1820790, 1765082, 1621758, 1541799, 1534011, 1551667, 1639554, 1723797, 1625962, 1581150, 1631971, 1660328, 1779873, 1797942, 1752348, 1702032, 1851806, 2009844, 2100235, 2188338, 2168129, 2322220, 2444746, 2449034, 2432934, 2440540, 2466825, 2515237, 2499980, 2705194, 2652286, 2807057, 2951708, 2902013, 2992338, 3113661, 3132997, 3346381, 3452388, 3335515, 3218010, 3320822, 3306934, 3257437, 3265535, 3224184, 3395561, 3708014, 4023011, 4216908, 4198257, 4229130, 4459946, 4780355, 5217092, 5617614, 6046825, 6699807, 7424572, 8310783]
19005H310783J650520K445609L797647O378438J0216244J4271013J4376313N714089
18997F7160656m805234q469715p403504n215061l738869k514829j034996J337480
18989C5315928M392715Q776237J2489851J0889443R66252p938179r730431q187486
18981D6974330o297121n004186m014383l388731k715664j825198j081103j103423
18973B1544521p75900l78931m10195l18092l59778l27889K303l9155l8152q2690
18963A8816042J81784P77800J148142J292416J682612K882023M590173P314973
18955C8685965J1540787J6338266J6989904Q420744j575541l063057J708373Q224902
18947I7270343J1249841M709745n237830p823559l735968K766675Q206452Q146109
$$ y = [8310783, 9961303, 12406912, 16204559, 22582997, 32799241, 47070254, 61446567, 67160656, 62355422, 53885707, 46482203, 41267142, 37528273, 35013444, 33978448, 35315928, 39708643, 48484880, 60974731, 71864174, 72830426, 64892247, 55161816, 46974330, 40677209, 35673023, 31658640, 28269909, 25554245, 23729047, 22647944, 21544521, 20768621, 20389690, 19979495, 19661403, 19301625, 18973736, 18976039, 18936884, 18898732, 18816042, 18997826, 19775626, 20923768, 22216184, 23898796, 26780819, 31370992, 38685965, 50226752, 66565018, 83554922, 91975666, 90400125, 87337068, 89045441, 97270343, 108520184, 113229929, 107992099, 100168540, 96432572, 99199247, 107405699, 115551808]
18939A15551808j41470p310214o482859l85427N856464O432997k080924j1194477
18931A00245898j3715847j1598022q798009o983641n652505m785313l861942l009451
18923D1841168k330561j789088j413792j541769j257306j225316q59907m02095
18915C1021334m75163l61073j78836n51204j34868J28438L09095P59713J399486
18906C1916922K384319L973426O507857J0584034J5620816J7258601Q298615n285882
18898I1258708j0743471r829445p438582n314659l458681j492790O06495M184992
18890E7772567Q860845J3392654J3030970K851631q485516j2238614j0633438
18883F4551099q050895o393822n490505m510941l540466k613614j874337j581053
$$ y = [115551808, 115410338, 108100124, 101617265, 101231838, 107088302, 113521299, 111440375, 100245898, 86530051, 74932029, 66134020, 59150379, 53497874, 48712561, 44850619, 41841168, 39510607, 37721519, 36307727, 34765958, 33508652, 32283336, 31423429, 31021334, 30546171, 30185098, 30006262, 29455058, 29320190, 29448628, 29757723, 30517436, 31916922, 34301241, 38274667, 44782524, 55366558, 70987374, 88245975, 96544590, 91258708, 80515237, 70685792, 63247210, 57932551, 54473870, 52981080, 53587575, 57772567, 66633412, 80026066, 93057036, 95908667, 87423151, 75184537, 64551099, 56500204, 50106382, 44615877, 40104936, 36564470, 33950856, 32076519, 30495466]
18875C0495466j377083j234811j274198j046133q73867q13662p99197n67944o75694
18866B1832877n72437n42196m52438l53265l34730m12286n49657l91602l83831
18857A7840435l54328m56127n59592l07500l05830l27922j77451l51017l49031
18848A4651637m54591l00953j02785k09911m38302l91768j05295l36890k51831
18839A2059311j26618r7600J2652j99012k79853k99155j18073j43022j40115j40858
18829A0527657j94723k55117j48130k51693j97033J7729k43890k95404r3235J4786
18819H880947k78310j84009K3797j20242m4401o6690j14359j10816k57037k97734
18809G431146j45072p7535k5940l9844j24597J68230k3472j85348q7258k47988
$$ y = [30495466, 29118383, 27883572, 26609374, 25563241, 24689374, 23875712, 23076515, 22508571, 21832877, 21260440, 20718244, 20265806, 19912541, 19577811, 19165525, 18615868, 18224266, 17840435, 17486107, 17029980, 16470388, 16162888, 15857058, 15529136, 15351685, 15000668, 14651637, 14197046, 13896093, 13793308, 13583397, 13145095, 12753327, 12648032, 12311142, 12059311, 11932693, 11835093, 11847745, 11648733, 11368880, 11069725, 10951652, 10808630, 10668515, 10527657, 10332934, 10077817, 9929687, 9677994, 9480961, 9498690, 9254800, 8959396, 8866161, 8880947, 8602637, 8418628, 8442425, 8322183, 8277782, 8211092, 8096733, 7985917, 7728880, 7431146, 7286074, 7208539, 7182599, 7142755, 7018158, 7186388, 7162916, 6977568, 6890310, 6642322]
18799F642322k49328M7318K6954l21403j92434j89139K6177j7771j14609j1405
18789E646682Q3092P205j07142j26063k13689j50751k06777o9732O9374K01743
18779E133942M4517n9772q3179j90808j91072k26574R9773M7280n0124j04983
18769D419000q4140Q9593J47813K24633J14512P8468n0327l75110j56286j38646
18759D269510j37447o4957r7447q5361l6545j5488j41081j58189p3223j44886
18749C314886o6892J29077J57985J6144K8604r8463j89080n9442p7091J01563
18739C257291j68287n7585N9831Q2626p381j02810k58271q4837j32271J26624
18729B714930J21072O3356j76824j06024k2311J42843J69626l1471l1684j96177
$$ y = [6642322, 6392994, 6440312, 6467266, 6145863, 5953429, 5764290, 5790467, 5772696, 5658087, 5646682, 5729774, 5736979, 5629837, 5503774, 5290085, 5139334, 4932557, 4862825, 4932199, 5133942, 5178459, 5118687, 5035508, 4844700, 4653628, 4427054, 4526827, 4574107, 4523983, 4419000, 4334860, 4424453, 4572266, 4796899, 4911411, 4989879, 4939552, 4564442, 4408156, 4269510, 4132063, 4067106, 3969659, 3884298, 3847753, 3832265, 3691184, 3532995, 3459772, 3314886, 3247994, 3377071, 3535056, 3551200, 3579804, 3481341, 3292261, 3232819, 3155728, 3257291, 3089004, 3031419, 3091250, 3173876, 3166495, 3063685, 2805414, 2720577, 2588306, 2714930, 2836002, 2899358, 2722534, 2616510, 2594199, 2737042, 2906668, 2875197, 2843513, 2647336]
18719B647336k33147j61025p7056J74683k2086J7899j35449l3826P6411J43440
18709B397180m6961k09967m0549K19529P1784O5557j86047r0984L6214N6420j30467
18698B141709o2447m8841Q0762J48666O8265j47032j62824O6841O0641j66549
18688A979191n5478m7344P4124r5094j94373j3971J4561K475R701M9469O0744
18677A784005N8542j37232j04177O0421m0976p4718m4088j6829j62743j7461K10931
18666A515675L6689N7656j0387O3411N123L6886Q4240j51449n7749m0377k8968
18655A510750o4669K2228R6643O8375o7516L3956J87445J60171O9097J34524r3598
18644B057406O9901L6849J12177j9489k04429j35017j67930j56803p456P7640
$$ y = [2647336, 2414189, 2253164, 2176108, 2350791, 2328705, 2346604, 2211155, 2177329, 2253740, 2397180, 2350219, 2140252, 2099703, 2319232, 2391016, 2456573, 2270526, 2179542, 2215756, 2272176, 2141709, 2079262, 2030421, 2111183, 2259849, 2328114, 2181082, 2018258, 2085099, 2145740, 1979191, 1923713, 1876369, 1950493, 1855399, 1661026, 1647055, 1661616, 1664091, 1673792, 1723261, 1784005, 1842547, 1705315, 1601138, 1661559, 1620583, 1545865, 1501777, 1484948, 1322205, 1304744, 1515675, 1552364, 1610020, 1599633, 1663044, 1668167, 1705053, 1789293, 1637844, 1580095, 1539718, 1510750, 1446081, 1468309, 1564952, 1633327, 1565811, 1599767, 1787212, 1947383, 2016480, 2151004, 2057406, 2127307, 2164156, 2276333, 2256844, 2052415, 1917398, 1749468, 1592665, 1585209, 1662849]
18634A662849L3161K39140O4777J39902K2799J89283L16673J14315j32502j34727
18624B515670j86174k05570O8766J22629M7055j88117j22732j69253j84826o9959
18614A627489K0560r3358J6385J26297o6522m4177p9326p6809M006O9243j27277
18603A376511r1345j31971J32212K64545M4122j61113Q7347J86702j0420k30537
18593A466053n8492K2640K7959r4214O3783R5843L08115K37591P2375r5646J34988
18582B180995J80835j63784j95470j26376o7643J4283o8077k04366K2873J18328
18572A691598K73857J28431J99056p3694k25079k31178j75954l7695k7806J43935
18562A665471L9266k52194j72806k0664K6950p3888n6726n319O7875K3832M0800
$$ y = [1662849, 1696010, 1935150, 1999927, 2139829, 2162628, 2351911, 2668584, 2782899, 2650397, 2515670, 2329496, 2123926, 2192692, 2315321, 2362376, 2174259, 2051527, 1882274, 1697448, 1627489, 1648049, 1554691, 1571076, 1697373, 1630851, 1586674, 1507348, 1430539, 1434545, 1503788, 1376511, 1285166, 1153195, 1285407, 1549952, 1594074, 1432961, 1520308, 1707010, 1696590, 1466053, 1407561, 1430201, 1458160, 1363946, 1427729, 1523572, 1831687, 2069278, 2141653, 2046007, 2180995, 2361830, 2198046, 2002576, 1876200, 1808557, 1822840, 1754763, 1550397, 1573270, 1691598, 1965455, 2093886, 2292942, 2219248, 1994169, 1762991, 1587037, 1549342, 1521536, 1665471, 1704737, 1452543, 1279737, 1259073, 1286023, 1212135, 1155409, 1150090, 1217965, 1241797, 1282597]
18551A282597K0524o0070k9641M1032n8683n0675P2814P0487J6310o1460m2160
18540A201075j536j3336k9733j9972K0575O2831o3322p3104J37502O0042R316
18529A290338j37038n3225m3306j4523q2820m8878N2053O1285r7096j80862R781
18518G55709K94922J22102O1126Q529j54768p6201J20685j22413q9933L0139j1211
18507I38686J23332K26439M4016n6409j58044n7575N7132Q6868J6753j47714k60339
18496H13145N0695J70653K48557j10854j43448l6564n5963j42743P7801K04329
18486A075608j32639j57954J98304R6962O4728K03175N9518k4685l7231O5055
18476A410841p2084k08600p7368Q897m8937O3388N8507k7803m2347N4979K15872
$$ y = [1282597, 1303121, 1243051, 1213410, 1254442, 1195759, 1145084, 1217898, 1288385, 1304695, 1243235, 1201075, 1199539, 1186203, 1156470, 1136498, 1157073, 1219904, 1156582, 1083478, 1220980, 1281022, 1290338, 1153300, 1100075, 1056769, 1042246, 959426, 910548, 962601, 1023886, 926790, 745928, 755709, 1050631, 1172733, 1233859, 1242388, 1087620, 1011419, 1132104, 1009691, 919758, 949897, 938686, 1062018, 1288457, 1332473, 1276064, 1118020, 1060445, 1117577, 1204445, 1221198, 1073484, 813145, 863840, 1034493, 1283050, 1172196, 1028748, 992184, 936221, 793478, 871279, 1075608, 942969, 785015, 983319, 1080281, 1145009, 1348184, 1407702, 1383017, 1345786, 1410841, 1338757, 1130157, 1052789, 1061686, 1012749, 1076137, 1134644, 1106841, 1064494, 1119473, 1335345]
18465A335345n572j120p5886K0895r0989o9304K36259N2454j33800j31547K9988
18454A166723J7695J40818M3857J18127J80057J36670l3101j06169k64877k5639
18444A374161K29747N1498O4848M4599r1819K8580j52119k3532k5829O2709P1641
18433A634484O4211m8639n7677j15914J13464J29325q6776k70901j8972L5498
18423A378103Q7974J7431P3927K14462J53004N7332O6163R0101l1508m2997n9030
18412B004962k7484q0502j35674p6465L6727o9780q7631L1204R7920j06136J77933
18401A765074J2402p7302J06658q6256p3159O1040M1995n0920K3479j2522j50890
18390A559599j21511R2931Q6627j26821k0967J11079J65121K1106o5058j95584
$$ y = [1335345, 1329773, 1328653, 1252767, 1273662, 1182673, 1113369, 1349628, 1402082, 1268282, 1136735, 1166723, 1184418, 1325236, 1369093, 1487220, 1667277, 1803947, 1770846, 1664677, 1399800, 1374161, 1603908, 1655406, 1720254, 1764853, 1673034, 1701614, 1549495, 1525963, 1500134, 1562843, 1634484, 1698695, 1650056, 1592379, 1476465, 1589929, 1719254, 1632478, 1361577, 1342605, 1378103, 1466077, 1483508, 1557435, 1771897, 1924901, 1982233, 2048396, 2138497, 2106989, 2063992, 2004962, 1977478, 1896976, 1761302, 1684837, 1721564, 1651784, 1564153, 1595357, 1693277, 1587141, 1765074, 1777476, 1700174, 1806832, 1720576, 1647417, 1708457, 1750452, 1699532, 1723011, 1710489, 1559599, 1438088, 1531019, 1617646, 1490825, 1469858, 1580937, 1746058, 1767164, 1702106, 1506522]
18380A506522l8176j17203q6922K13259o3594p8345K8551Q0824J14387J75343
18370A734646J68937J41480J72842j03777N6065p070j01167j878k07807n2718
18360A799553p6975o8920J19877n6928j16107j4712O6570q8981j9042J55766N4865
18349A754966j39585p9039j42766l5887J31160m8770k0339L2819j14137l8105
18339A300317M0138j18963N0676M8780K25J2967M4258J5117k3554m9337R1825
18328A412449J64774o8687M118Q0120P734O1654J06336P9665j1992O9739j56599
18317A749311j1386J08765m7936j48448R0825R5416J73165J00520K56654Q2746
18307B449632q5682j20888k95776J5748J40215k16279j49619J66029J38544p474
$$ y = [1506522, 1468346, 1351143, 1264221, 1477480, 1413886, 1335541, 1364092, 1444916, 1559303, 1734646, 1903583, 2045063, 2217905, 2114128, 2170193, 2163123, 2061956, 2060078, 1852271, 1799553, 1722578, 1653658, 1773535, 1716607, 1600500, 1585788, 1652358, 1563377, 1544335, 1700101, 1754966, 1615381, 1536342, 1393576, 1357689, 1488849, 1440079, 1419740, 1452559, 1338422, 1300317, 1340455, 1221492, 1272168, 1320948, 1321173, 1334140, 1378398, 1393515, 1369961, 1320624, 1412449, 1577223, 1508536, 1512654, 1592774, 1600508, 1662162, 1768498, 1848163, 1836171, 1905910, 1749311, 1737925, 1846690, 1798754, 1650306, 1741131, 1836547, 2009712, 2110232, 2366886, 2449632, 2363950, 2243062, 1947286, 1963034, 2103249, 1886970, 1737351, 1903380, 2041924, 2034450]
18297B034450o4282N8718O6936p414l21598j96056Q8167N3341r5362M189M9361
18286A670450k20488j52432P1838J63432J18276p0794m049J26209J8739j22144
18276A599037Q9111j22485j39068J6756j084L4488j0365P275K23460J10298J02603
18265A910026K52336m6405j96683R3691R5178J2617p1987j1155L44624j951l9080
18254B341211O3251J03162o1206o8359O3932M1379j31946j29687P4900m3155k8519
18243B224963n1247K510n0563J43776L2442N152J37528o5177j45279p4049L7457
18232B197513L6324J42848n8304K4516K3078J22195l0143k17686j05560o3269
18222B071512k6428K89572J15945K5946j60261o4418m3194O4046o103K04889k27918
$$ y = [2034450, 1970168, 2028886, 2095822, 2088408, 1766810, 1570754, 1658921, 1712262, 1616900, 1621089, 1670450, 1449962, 1297530, 1369368, 1532800, 1651076, 1580282, 1576233, 1702442, 1721181, 1599037, 1688148, 1565663, 1426595, 1443351, 1442267, 1476755, 1466390, 1473665, 1697125, 1807423, 1910026, 2162362, 2115957, 1919274, 2012965, 2108143, 2120760, 2048773, 2037618, 2382242, 2380291, 2341211, 2404462, 2507624, 2446418, 2378059, 2441991, 2483370, 2351424, 2221737, 2296637, 2253482, 2224963, 2173716, 2176226, 2125663, 2269439, 2301881, 2307033, 2444561, 2379384, 2234105, 2160056, 2197513, 2233837, 2376685, 2318381, 2342897, 2365975, 2488170, 2458027, 2240341, 2134781, 2071512, 2045084, 2334656, 2450601, 2476547, 2316286, 2251868, 2208674, 2272720, 2266617, 2471506, 2243588]
18211B243588j32565J20348J41456K33461j84397m0971l4286o0886K00197M6487
18201B532432l5567m3549P9148J22763r3131j35644K1657K35349J74819J09035
18191B967312j28073j42649Q0224J61757J71115J00586M565j41852J97345L05710
18181C576040K5379K2742J23911N5443j22854p7291Q1740K2446K47431J3229K66370
18170D234586J12152p770O2410P2720J01823J40008J25735k1218K69522K75178
18160E365146L26199K73849K59162M03574K66739M27J25629J95547L49713L21360
18150G887345M31733L56131L53596M59527N25417Q22501R62365J376371J791073
18141A4966059K052527J853818J451158J253874J512246K026022L653122O480962
$$ y = [2243588, 2111023, 2231371, 2372827, 2606288, 2421891, 2380920, 2346634, 2285748, 2485945, 2532432, 2496865, 2453316, 2532464, 2655227, 2562096, 2426452, 2448109, 2683458, 2858277, 2967312, 2839239, 2696590, 2776814, 2938571, 3109686, 3210272, 3214837, 3072985, 3270330, 3576040, 3601419, 3624161, 3748072, 3803515, 3680661, 3603370, 3685110, 3707556, 3954987, 3968216, 4234586, 4346738, 4338968, 4401378, 4474098, 4575921, 4715929, 4841664, 4820446, 5089968, 5365146, 5691345, 5965194, 6224356, 6627930, 6894669, 6895096, 7020725, 7216272, 7565985, 7887345, 8319078, 8675209, 9028805, 9488332, 10013749, 10836250, 11798615, 13174986, 14966059, 17018586, 18872404, 20323562, 21577436, 23089682, 25115704, 28768826, 35249788]
18133C5249788R317816Q145501J003919l937513m329914k300665m89152L85583
18125D3045363J513813K396525L378505N117060P853408J2273707K0378789L4046693
18117A30003863N8173001Q9979606R7601821M7125771l687254l0830061m9892697
18110C38474050m8029903l2034073r738170J6260716L2099331N214572k7209752
18103B75036771k3177366o751728k873306j6875390k7965403k7294811k1846630
18096A48252137j6703762j2999863j0513708q252564o287800m861642l740641
18089H4892157l025832k606907k128721j694209j338720r96611j027745j335078
18081G0738334j396571j068332n53665q4850J181035K927657N432595R142926
$$ y = [35249788, 44567604, 52713105, 53717024, 49779511, 45449597, 43148932, 42659780, 43045363, 44559176, 46955701, 50334206, 55451266, 63304674, 75578381, 95957170, 130003863, 188176864, 278156470, 375758291, 422884062, 419196808, 388366747, 338474050, 290444147, 258410074, 248671904, 264932620, 297031951, 302246523, 275036771, 251859405, 245107677, 242234371, 225358981, 197393578, 170098767, 148252137, 131548375, 118548512, 108034804, 99782240, 93494440, 88632798, 84892157, 81866325, 79259418, 77130697, 75436488, 74097768, 73101157, 72073412, 70738334, 69341763, 68273431, 67719766, 67634916, 68815951, 71743608, 77176203, 86319129]
18073H6319129J5804858K3084429K3174765Q636388p627065j2118095r030142
18066A28244267m642129r09243M507278J2348467K5501431M5223080O3919116
18059B74192267O5335376N7730761L4627493k7292267o4663710o1695037m6052208
18052B32182675l4084411k7008210k1518829j6757100j2573595r319173o827003
18045A04094354m713662l383118j461053J350545M037231M250471j045729o914409
18037I6214630q106604o589470m922759m056777l389046l109247k951107k616011
18029F0473609k450737j933569j826202j494871j263123j210358j260169j024313
18021D8010267j258589j096295j166881j025272p93841o48185q52672p76164o51960
$$ y = [86319129, 102123987, 125208416, 148383181, 157019569, 149392504, 137274409, 128244267, 123602138, 122692895, 127200173, 139548640, 165050071, 210273151, 274192267, 339527643, 397258404, 431885897, 404593630, 339929920, 278234883, 232182675, 198098264, 171090054, 149571225, 132814125, 120240530, 110921357, 104094354, 99380692, 95997574, 94536521, 95887066, 99924297, 104174768, 103129039, 96214630, 88108026, 81518556, 76595797, 72539020, 69149974, 66040727, 63089620, 60473609, 58022872, 56089303, 54263101, 52768230, 51505107, 50294749, 49034580, 48010267, 46751678, 45655383, 44488502, 43463230, 42669389, 42021204, 41168532, 40392368, 39740408]
18012C9740408o07063m89143o07380p68903p92106p77705n86754o77399p12028
18003C3721927k81840l84362l98234m78771l33679l90367m63492l62080j28722
17994C0500380n1175L1217j59982l01187r9182l29131k28168m5398L8806j55733
17984B9200447m19478m63949l60242m86888o31699o21723p44031n25966l89631
17975B4556840l91853n79060n19022k47919m4298j81678k17680M000j92485k76465
17965B1910380k78339m00847l22841k52916k43590k59784j64425k64541r2164
17956A9630933j67104p3847J80255N5505K19618L9066Q9189K17625N3379J71712
17946B0416331L09052K07488J73530L97940M09402K77788M35991P34964J051031
$$ y = [39740408, 39133345, 38644202, 38036822, 37267919, 36475813, 35698108, 35111354, 34433955, 33721927, 33440087, 33055725, 32657491, 32178720, 31845041, 31454674, 30991182, 30629102, 30500380, 30449205, 30480422, 30320440, 30019253, 29920071, 29590940, 29362772, 29317374, 29356180, 29200447, 28780969, 28317020, 27956778, 27469890, 26838191, 26216468, 25472437, 24946471, 24556840, 24164987, 23585927, 23066905, 22818986, 22774688, 22593010, 22375330, 22379330, 22186845, 21910380, 21632041, 21231194, 20908353, 20655437, 20411847, 20152063, 19987638, 19723097, 19630933, 19463829, 19389982, 19570237, 19625742, 19845360, 19884426, 19973615, 20191240, 20244619, 20416331, 20725383, 20932871, 21106401, 21504341, 21913743, 22191531, 22627522, 23362486, 24413517]
17937B4413517J327292J563087J992615K596753L381741M862923O744047Q914069
17929E5796044J0855679J0281309O324659K270517J128114K472765M479698L901600
17921I7510385o00516o067933q875126q977121p873987o492983n059535m254653
17913D9308531l408311k668300k086491j449543j046762l59355n0985J85621O24425
17904C9048830J169051J895809K374520L720141N456986P446585R504576J0427816
17896H1044314Q148328M014714J337901K111883M435988N499892L079323j894843
17888A07777500n835102o125979l804667r89632K374797N104978N527776K702250
17880A06731921p88009j630478K67794K423408K056819j623318o439460q970807
$$ y = [24413517, 25740809, 27303896, 29296511, 31893264, 35275005, 40137928, 46881975, 55796044, 66651723, 76933032, 83257691, 85528208, 86656322, 89129087, 93608785, 97510385, 96909869, 90841936, 81966810, 72989689, 65115702, 58622719, 53563184, 49308531, 45900220, 43231920, 41145429, 39695886, 38649124, 38289769, 38238784, 38424405, 39048830, 40217881, 42113690, 44488210, 48208351, 53665337, 61111922, 70616498, 81044314, 89192642, 93207356, 94545257, 96657140, 101093128, 106593020, 109672343, 107777500, 101942398, 95816419, 92011752, 91022120, 93396917, 98501895, 104029671, 106731921, 105943912, 104313434, 104581228, 107004636, 109061455, 107438137, 100998677, 92027870]
17872I2027870q998183p994290o558675n384435m413317l461188k863787k391656
17864D9962339j948431j410544r17771p29953l71155L0828M40310R89353J978299
17855D8023275L089561M602340O381538Q373488R301982P063115K806991J38078
17847H9780368L62145K402004L450498J127289l761414p678303q817706q015967
17839F8848914o710597n567429m697920l965341l246415k737126k267105j957643
17831C7699338j507131j149003j038232j068324q89010n18128n74452p99382o84125
17822B9471551n55660n96962o83198n54563m88099o18946m89477l45699m45968
17813B4692979l43145k80990k73414j62072j1610N1126m1540r8678L6915Q9298
$$ y = [92027870, 83029687, 75035397, 68476722, 63092287, 58678970, 55217782, 52353995, 49962339, 48013908, 46603364, 45685593, 44955640, 44584485, 44615313, 45055623, 46044976, 48023275, 51112836, 55715176, 62096714, 70470202, 79772184, 86835299, 89642290, 89780368, 90142513, 92544517, 95995015, 97122304, 93360890, 85682587, 76864881, 68848914, 62138317, 56570888, 51872968, 47907627, 44661212, 41924086, 39656981, 37699338, 36192207, 35043204, 34004972, 32936648, 32047638, 31529510, 30955058, 30155676, 29471551, 28915891, 28318929, 27635731, 27081168, 26593069, 25974123, 25484646, 25138947, 24692979, 24349834, 24068844, 23795430, 23633358, 23621748, 23672874, 23631334, 23532656, 23569571, 23658869]
17803B3658869J14629P2453K87137N08677O04784Q86197P59847Q91204J069629
17794B8853426J337893K012195K429517K989633M188619N516238P456163J0077405
17786F4861089J2676247J4196860J2939824J0449727R114795J0787481J2927814
17779A47953837J1374626M872714l093414p073101o774693n672760o326140r118446
17771A26142623j1792840j2225684j1113376r153990p569312o320360n240570
17764F2726491m437902l797166l028185k417374k280013k056142j718812j533367
17756D1457530j106059q66791j033947r11904q11924p59826o13142o19938k28909
17747C4505090j08705J06987K44718M39716N95748R59808J362502J706161K242361
$$ y = [23658869, 23773498, 23845951, 24133088, 24641765, 25246549, 26132746, 26892593, 27783797, 28853426, 30191319, 32203514, 34633031, 37622664, 41811283, 47327521, 54783684, 64861089, 77537336, 91734196, 104674020, 115123747, 124238542, 135026023, 147953837, 159328463, 164201177, 161107763, 154034662, 147259969, 141587209, 135261069, 126142623, 114349783, 102124099, 91010723, 81856733, 74287421, 67967061, 62726491, 58288589, 54491423, 51463238, 49045864, 46765851, 44709709, 42990897, 41457530, 40351471, 39484680, 38450733, 37538829, 36726905, 35967079, 35353937, 34733999, 34505090, 34396385, 34503372, 34748090, 35187806, 35783554, 36743362, 38105864, 39812025, 42054386]
17738D2054386L183290M540702O332555Q588146J1209189J2536459J2047247R547630
17730A10039604Q198603R640508J1527378J0750374N182273k143122o455026o620389
17722A40120203n268068n522249q376269j0821559j1421871j0512802r010918
17715G9186467p286575o009941n149047m383284l809718l025244k487574k344356
17707D4690728k144477j725880j663092j673029j440972j410342j463306j032049
17699C2137581q77694q46505j017078r57045q75749q04032o92973r59070o04147
17690B4503288n19557n08452n52174o38791n17808l10452k98869l88160l18450
17681B0450575m24016l47198l93838k30985l37346m72152m28956l39109l17871
$$ y = [42054386, 45237676, 49778378, 56110933, 64699079, 75908268, 88444727, 100491974, 110039604, 118238207, 127878715, 139406093, 150156467, 155338740, 153195618, 146740592, 140120203, 134852135, 129329886, 120953617, 110132058, 98710187, 88197385, 79186467, 71899892, 65889951, 60740904, 56357620, 52547902, 49522658, 47035084, 44690728, 42546251, 40820371, 39157279, 37484250, 36043278, 34632936, 33169630, 32137581, 31259887, 30413382, 29396304, 28439259, 27563510, 26759478, 26066505, 25107435, 24503288, 23983731, 23475279, 22923105, 22284314, 21766506, 21456054, 21157185, 20769025, 20450575, 20026559, 19679361, 19285523, 19054538, 18717192, 18245040, 17816084, 17476975, 17159104]
17672A7159104k52595m37906m92159k28242k11279k31227j77637l41278m17523
17663A4369258m12640l05967L459o1128k72502k24774O9022k21923k91316j83042
17653A2468447l61539k32463k59542j99882m760m4416j89410k04725k07583k02514
17643A0561613k08076k13786k71615k65518l08781k60687o642j61378l40422j37871
17633H386837j18217l9224N512p994j65059j88504p9311k43451k13812m7596j63822
17622G125359j93375J29652l31590j19705o4298q6379q1628J4799J10221l6168
17612F466888k52446p2128k1264j94128l40895J6875j33349p8165K6206N3378
17602E470972N3380L4418o1800Q7032K06456J33288K5456j39039n3187k1196k4343
$$ y = [17159104, 16906509, 16468603, 15976444, 15748202, 15536923, 15305696, 15128059, 14786781, 14369258, 13956618, 13650651, 13654110, 13592982, 13320480, 13095706, 13164728, 12942805, 12651489, 12468447, 12106908, 11874445, 11614903, 11415021, 11410261, 11365845, 11176435, 10971710, 10764127, 10561613, 10353537, 10139751, 9868136, 9602618, 9293837, 9033150, 9026508, 8865130, 8524708, 8386837, 8268620, 8229396, 8234908, 8226914, 8061855, 7873351, 7794040, 7550589, 7336777, 7289181, 7125359, 6931984, 7061636, 6730046, 6610341, 6546043, 6459664, 6378036, 6392835, 6503056, 6466888, 6214442, 6142314, 6121050, 5926922, 5586027, 5602902, 5469553, 5391388, 5417594, 5470972, 5524352, 5558770, 5496970, 5584002, 5790458, 5923746, 5949202, 5810163, 5756976, 5735780, 5711437]
17591E711437j71442j07160q4396K4535j64632K4814M9984j38627r5779L8806
17581E087540j16098r4696J0190k32466k33506o9038n717n3773k03463k83796
17571C805177r2538L8960N3887o0485k20550n5364k3423o2670R7858k0184j77305
17560C283363q2582j23524j32228l7275j2807R6035J04429k4447l49673j64869
17550B556422J63465P104o7692N2786P9501M3415M8057J1502n7244J16611J30089
17539C084016R8200M7168p6794j19555r990j78481j62598j87283j82760l6957
17529B274966J13899K3656j06635l8048O933J63776J22807O65J01371P8996k15790
17518B526596k71624l09386k58941M805P125k8167J06824K4132j09749K4860j31135
$$ y = [5711437, 5539995, 5432835, 5348439, 5372974, 5208342, 5233156, 5283140, 5144513, 5048734, 5087540, 4971442, 4876746, 4886936, 4654470, 4420964, 4351926, 4346209, 4292436, 4088973, 3805177, 3712639, 3751599, 3805486, 3745001, 3524451, 3469087, 3445664, 3382994, 3480852, 3460668, 3283363, 3200781, 3077257, 2945029, 2907754, 2894947, 2990982, 3095411, 3070964, 2721291, 2556422, 2719887, 2726991, 2659299, 2712085, 2791586, 2835001, 2883058, 2894560, 2837316, 2953927, 3084016, 3182216, 3229384, 3152590, 3033035, 3023045, 2844564, 2681966, 2494683, 2311923, 2274966, 2388865, 2412521, 2305886, 2267838, 2274771, 2438547, 2561354, 2562019, 2663390, 2742386, 2526596, 2254972, 1945586, 1686645, 1691450, 1698575, 1670408, 1777232, 1801364, 1691615, 1716475, 1585340]
17507A585340K9293J7731k22450j37299J814j8587K8410M4432P2053m5883j98407
17496A156447j36N2438m7912k8890Q133P4255m9627m0783R397N4458L9637L8773
17484A266190n4472j24649n8730l5052j3089j63641o0800k2637k42089j38855
17474C52176R7602J30085J63522J57153k1866j65302j84993M0105J10068N0282
17464G28832l38860q5178K01791J20635O5076j18547j5578Q0472J5856J01352
17454G55851l8527j05534l49j1094M1955J04976n4073M0408j9845J38043j5339
17443H36472l6840Q7182J19955K46261J53888j15610k53358k62790M2585Q301
17433H26046J65254p7774o4517j33843M3041K3487l3621j23087k9146P0004j479
$$ y = [1585340, 1614633, 1632364, 1409914, 1272615, 1274429, 1255842, 1284252, 1328684, 1400737, 1354854, 1156447, 1156311, 1208749, 1160837, 1131947, 1140080, 1214335, 1164708, 1123925, 1133322, 1187780, 1227417, 1266190, 1211718, 1087069, 1028339, 993287, 980198, 816557, 755757, 733120, 491031, 352176, 449778, 579863, 743385, 900538, 878672, 713370, 528377, 568482, 678550, 728832, 389972, 304794, 506585, 627220, 692296, 573749, 558171, 638643, 654499, 755851, 717324, 611790, 611441, 600347, 642302, 747278, 693205, 733613, 713768, 851811, 836472, 799632, 886814, 1006769, 1253030, 1406918, 1291308, 1037950, 775160, 817745, 826046, 991300, 913526, 849009, 715166, 758207, 781694, 748073, 624986, 595840, 665844, 664365]
17422F64365M4295J04558J32883j97611m8591q2650j27615L2865K0888K3380n7
17411E66710M9603L4585o7473N9295l7505p7571R3882j29373j11344O6167j070
17400D45906K6273J05030k1359j32081j4852J64223J29067m6207N0296j17990
17390E88306k04646j41907R1470l4555o6460J5428J19880j12441q0740J47048
17380C21383R5695J2617o6204j37724l6264l511J0538J72637n187J71471J25886
17369F61337o3101n654P6168O1115j27579l8360k8962L1782J12409k33548p5437
17358C70170j04469J16388L7198Q9535J18169N0196o2320L6033R6873q5370j68451
17347D93952q3357j20752K5252Q7462M9009o6846K55J2309m0084R0422R6660r0857
$$ y = [664365, 708660, 813218, 946101, 748490, 699899, 617249, 489634, 522499, 543387, 566767, 566710, 616313, 650898, 583425, 642720, 605215, 527644, 621526, 492153, 380809, 446976, 445906, 472179, 577209, 555850, 423769, 408917, 573140, 702207, 656000, 706296, 588306, 383660, 241753, 333223, 298668, 232208, 247636, 367516, 255075, 174335, 321383, 417078, 429695, 363491, 225767, 189503, 185992, 196530, 369167, 363980, 535451, 661337, 598236, 592582, 668750, 729865, 602286, 563926, 534964, 566746, 679155, 445607, 370170, 265701, 382089, 419287, 508822, 626991, 677187, 614867, 650900, 747773, 662403, 493952, 410595, 289843, 315095, 402557, 451566, 384720, 384975, 397284, 357200, 447622, 544282, 453425]
17335D53425n2359J45070j28810k12221j01049o5866o0602m7452m0376j2568K48998
17324A26190J36609J47864J50392p2403q0656J10923L5229J01894J26750k91698
17314D91094k7549j54739j91944j89521J31194J44704l4078m8374Q1722M1129
17304B43638j5148J07947j500j29507q806J193l6357P329l7534k23042n127M7324
17292d9590J8800M3145L7235q7632k2209J71327K17484M2863N4544j49417m9269
17281B27281p31j79734O6896J49341N3882j15517n6696J20175L16532N6911j57633
17270D80707q1657j19436n9658j17609q8324k43465K237J91469Q9794P857K0675
17259H2590J63576Q2034j56110J2809J34022Q0314J71841n682j67710q9276J52484
$$ y = [453425, 401066, 546136, 417326, 205105, 104056, 38190, -22412, -69864, -110240, -122808, 126190, 262799, 410663, 561055, 488652, 407996, 518919, 554148, 656042, 782792, 491094, 463545, 308806, 116862, -72659, 58535, 203239, 169161, 120787, 202509, 243638, 228490, 336437, 334937, 205430, 196624, 197817, 161460, 168789, 131255, -91787, -96914, -49590, -30790, 12355, 49590, -38042, -60251, 111076, 328560, 371423, 425967, 276550, 227281, 226550, 46816, 113712, 263053, 316935, 201418, 144722, 264897, 581429, 638340, 480707, 399050, 279614, 219956, 102347, 14023, -229442, -227205, -35736, 54058, 61915, 82590, 246166, 328200, 172090, 184899, 318921, 399235, 571076, 565394, 397684, 308408, 460892]
17248D60892P5292k6494R341J19400J00374Q1860r8904j56024j50202l1455Q1476
17237D65556P1479j07734j08695M0062k3907q4759q9160j81528k3455J6509K834
17226b2798k01245K08038N2347L574j47633o2336K67246L1243j58138j3897J82778
17215A39179J07522j54787q7686J2884R7560r0792l6748j709Q461O9005J30177
17204A93066J26021q7118R3663L9043j4963P7088J04624J29599P6890Q2242r7872
17193G22283j81651n3760m1467l4731K56621J45383j09093j99210k37556r2800
17183A74019k4289P8496M608J4272j01316m7J06088r949j5916J10994J07360j40583
17171C03737k27767q8989Q4612M2279O5961J04145J35746n3024j74534j23544
$$ y = [460892, 536184, 509690, 519031, 638431, 738805, 820665, 721761, 565737, 415535, 384080, 465556, 537035, 429301, 320606, 360668, 336761, 252002, 162842, -18686, -42141, -25632, -22798, -224043, -16005, 36342, 39916, -107717, -170053, 97193, 128436, -29702, -43599, 139179, 246701, 91914, 4228, 17112, 114672, 23880, -12868, -14577, -6116, 62889, 193066, 319087, 231969, 325632, 364675, 349712, 426800, 531424, 661023, 737913, 820155, 722283, 540632, 486872, 445405, 410674, 667295, 812678, 703585, 504375, 266819, 174019, 149730, 228226, 232834, 247106, 145790, 145743, 251831, 241882, 225966, 336960, 444320, 303737, 75970, -13019, 71593, 113872, 179833, 283978, 419724, 366700, 192166, 68622]
17161F8622m6932R3528k40020k02719n9420j18527J60121L46698Q9651k00743
17151a09741q7960N0457Q9847M969k7754R1410J12080l2753n8498j70694Q1160
17140e7477Q7202K906j54144k07115J01993K39342k8669m8515j9877j55048j38430
17129c77832O3812N6033J03258Q8849k27639P9129J74766k9522M4507K61794j31831
17118A05324j99694k39910k323J15998P9962M3428j80903K3003J70250K3466p7987
17107a39386o3367J98290J65927j521Q733j19371j13574m8108J82031p1723j66115
17096a68184j14970P610R0396R2485n4200q7769N8911M5070L9073j39804p8250
17085c09632N1560o0110J67952L8922N4474J60541n9029q1765L1179L1337K2053
$$ y = [68622, 21690, 115218, -124802, -327521, -386941, -505468, -345347, 1351, 91002, -109741, -197701, -147244, -57397, -52428, -80182, 11228, 123308, 90555, 32057, -138637, -57477, 29725, 32631, -121513, -328628, -226635, 12707, -15962, -64477, -84354, -239402, -377832, -314020, -257987, -154729, -65880, -293519, -214390, -39624, -69146, -24639, 237155, 105324, -94370, -334280, -336603, -220605, -140643, -97215, -278118, -255115, -84865, -61399, -139386, -202753, -4463, 161464, 159943, 168676, 49305, -64269, -112377, 69654, -2069, -168184, -283154, -275544, -185148, -92663, -146863, -234632, -175721, -130651, -91578, -231382, -309632, -258072, -318182, -150230, -111308, -56834, 103707, 44678, -37087, -5908, 25429, 47482]
17074D7482j23985j0100l8665l4292k6428O3755M3020k21990k33308J4822K22220
17063b97469K57121K40900J00753r7477k6008n176j43503m5532L8526P0179j22392
17052c0078N0814p6939R6271L7947k17922j19002r4566o6844J10873J46680k5771
17041a88537n9722J47047J34568j40254m3130O987m3089r9774J20545J10971j16667
17030a71055j70959L8962J37048K7047O253r3177N813J07301J17321K3790p0159
17019d1815K8119q4092J36866J95598p9813k31632r2881J2153j03400M0933M7307
17008a72657Q307M2840l6636j33513l238K2786O311Q2947n2948j63985J2484P9265
16996c08037P0556k2832q3928K12899R0969L6464o5849j72560Q4159p8670p7513
$$ y = [47482, -76503, -86603, -125268, -159560, -185988, -122233, -79213, -301203, -534511, -519689, -297469, -40348, 200552, 301305, 203828, 177820, 172644, 29141, -16391, 22135, 92314, -30078, 20736, -56203, 40068, 78015, -139907, -258909, -353475, -420319, -309446, -162766, -188537, -248259, -101212, 33356, -106898, -150028, -143041, -186130, -285904, -165359, -54388, -171055, -342014, -303052, -166004, -138957, -132704, -225881, -220068, -112767, 4554, 28344, -41815, -13696, -97788, 39078, 234676, 154863, -76769, -169650, -157497, -260897, -219964, -172657, -164350, -121510, -158146, -291659, -294897, -272111, -265800, -182853, -235801, -399786, -387302, -308037, -237481, -260313, -344241, -131342, -40373, -3909, -69758, -242318, -158159, -236829, -314342]
16985c14342J290M4856j85901p4666J00053J05422J35161P9042J1274Q3813M5621
16974C1623r1608q3538m0906k8977j04238l8898Q5940Q1522O180j38058l5151
16963c56109R7698k6927r930J2789J31651K3525p4527J19529J8622m9110M6024
16952f6765M7871N9972k48393j49564j02765l9007K43936m9362o3168J4578J05512
16941b47155O3312Q2731P6205L7553J67022r2066k67491p5444M556M1970O991
16930b01816k13985j62675J46188J96708j8610j05219N539j19580n3378J28066
16920c98762O4521L1085J45265K00596M5711o8833n1506k3519j28249L8842L5669
16909a09180j56692J08313M2597K0083N6639M1551m8175j52571r7327q8847J01665
$$ y = [-314342, -313052, -268196, -454097, -528763, -428710, -323288, -188127, -109085, -97811, -13998, 31623, -59985, -143523, -184429, -213406, -317644, -356542, -270602, -189080, -182900, -320958, -356109, -258411, -285338, -295268, -282479, -150828, -127303, -201830, -82301, -63679, -112789, -66765, -18894, 41078, -207315, -356879, -459644, -498651, -254715, -304077, -367245, -352667, -247155, -183843, -101112, -24907, 12646, 179668, 87602, -179889, -255333, -250777, -208807, -201816, -415801, -578476, -432288, -235580, -254190, -359409, -353870, -473450, -526828, -398762, -334241, -303156, -157891, 42705, 88416, 19583, -31923, -55442, -183691, -144849, -109180, -265872, -157559, -114962, -94879, -38240, 3311, -44864, -197435, -294762, -383609, -281944]
16898b81944J38615J3202K2573R570J435j5765P0958k2143k1323r3128j8513P2117
16886a24346L816p7017N9403m0663M9715q5095j09839Q6870J40985L1156o7271
16875a32286J01703k6076L3230j28823r8848p621k4144M0743J5007J25010p0009
16864a72114n2721J70685j28117l44003j36763J60000J54418L6342J42736l8107
16854b07644p6692l846L4035k9416j3922K8193l3854l4408N7887j7822J9557l9146
16842c17078M3196l3295r619n6077M8570J42997j4853q5829M7648P3990q8413
16831b48763j50426k57186J16677J18045N1533J27320j29891j232R6261K14516
16821f3146j19708j51824K4962J60418j2202J5078Q8138L995J02273J0535j15202
$$ y = [-281944, -143329, -130127, -107554, -97984, -96549, -112314, -41356, -63499, -84822, -177950, -196463, -124346, -120530, -197547, -138144, -178807, -129092, -214187, -324026, -237156, -96171, -65015, -132286, -30583, -56659, -23429, -152252, -251100, -258721, -282865, -242122, -227115, -102105, -172114, -224835, -54150, -182267, -526270, -663033, -503033, -348615, -312273, -169537, -207644, -284336, -288182, -254147, -283563, -297485, -269292, -303146, -337554, -279667, -297489, -277932, -317078, -273882, -307177, -316796, -372873, -324303, -181306, -196159, -281988, -234340, -160350, -248763, -399189, -656375, -539698, -421653, -370120, -242800, -372691, -373923, -277662, -63146, -182854, -334678, -309716, -149298, -161500, -146422, -58284, -54289, 47984, 58519, -56683]
16810e6683j06007p054q782N8185q2648J728K5409o7297n8106J69382J44467k9761
16798a7167j21056J24919n4602o2273o2353n2113J33151j8078j25228o7951O0463
16787b62288l1177l6672J05541J23140Q8308J37782R936j20215q9652j26642o5692
16776b67631J26637Q2102p4808k5841j08481m7685K0791m5678P9640J35909J5550
16765a09495p7630K1819J0466P668J939O2022q5319j32177N9743K5514J76543
16754c8907M6196j21765J14056k19635j46983Q8358J77789J874j5631k608p1804
16743a89060m5743o7997J28121J51667j56868k25997Q5817J60782J00169q4914
16733a44023j9067j624m14j3943J27517m1354L7811j54513R1736K4404o297j71182
$$ y = [-56683, -162690, -169744, -178526, -120341, -202989, -201261, -175852, -243149, -301255, -131873, 12594, -17167, -138223, -13304, -67906, -130179, -192532, -244645, -111494, -129572, -254800, -322751, -262288, -293465, -330137, -224596, -101456, -13148, 124634, 134570, 14355, -75297, -201939, -267631, -140994, -58892, -133700, -159541, -268022, -315707, -294916, -340594, -260954, -125045, -109495, -187125, -165306, -154840, -147172, -145233, -83211, -168530, -300707, -240964, -215450, -38907, 7289, -114476, -420, -220055, -367038, -278680, -100891, -99017, -114648, -117256, -189060, -234803, -302800, -174679, -23012, -179880, -405877, -320060, -159278, -59109, -144023, -163090, -164714, -165128, -179071, -51554, -92908, -55097, -209610, -117874, -93470, -99767, -270949]
16721b70949n4914O3103j01239J98032K26110J48204j53165k35801O697J30827
16711d3095J68383j8036k5191p3567m2197r3503l2078Q2535K52714J30684o8563
16700B38086j34833j38839n7558M8678J3283N0249j919p1308J49236m1986o7444
16689a4355l856j11375l5341j11616K2238J69618Q733o0156p0765n1903Q5529
16678a73249O3629q4212o4980J1295N4483N1101O7710R4546Q8131P5801j10561
16667G3694k40131j9454M1726j28705j10614J88166P4232N3384o4510j27546j54588
16656d14346J20848K57758L5685Q4514q6763n2504J87755j08416N2229P655j13717
16645b9302l1837J93846N4206j32650j82846p2081l4465M4357J10875j1776p852
$$ y = [-270949, -325863, -262760, -363999, -165967, 60143, 208347, 55182, -180619, -173922, -43095, 125288, 107252, 82061, 8494, -33703, -127206, -159284, -76749, 175965, 306649, 238086, 103253, -35586, -93144, -44466, -31183, 19066, 17147, -54161, 95075, 53089, -14355, -18211, -129586, -164927, -276543, -254305, -84687, -75954, -136110, -206875, -258778, -173249, -109620, -193832, -258812, -247517, -193034, -141933, -74223, 20323, 108454, 184255, 73694, -166437, -185891, -144165, -272870, -383484, -195318, -121086, -67702, -132212, -259758, -414346, -293498, -35740, -55, 84459, -2304, -54808, 132947, 24531, 76760, 84415, -29302, -61139, 132707, 186913, 54263, -128583, -200664, -235129, -190772, -79897, -91673, -99525]
16634i9525O7014P3536k071k1032m1874r5147N7494L2241n0080J8571R4892J76
16622C4195r2228k004p0309l99410J2880O3040J09335K14522J30715o0168M2705
16611a6727N1373j70099l68256M5271K71544L9707n6782j44717j27655N1309R2918
16600c32114J93785M0719L4122P5627p8655j60428k6136j2203J48618K47148n4808
16589G5675j90552m6707L9592M6472j46293N366J30970k0595o9864p9401l9941
16578b95278J1334N1735m6618j7410P7629J2621q5530j38146M5970J19251K45448
16567a8994N7108l8953n8621K3364J17846m6626k8199l1427P877J05199P8062
16556A66636j19485j41794R2036J43836N0417p9039j09885n6242j20020q0843
$$ y = [-99525, -32511, 41025, 38954, 17922, -23952, -119099, -61605, -29364, -79444, -60873, 34019, 34195, -58033, -60037, -130346, -529756, -516876, -453836, -344501, -129979, 736, -59432, -16727, 34646, -135453, -503709, -458438, -186894, -147187, -203969, -348686, -476341, -425032, -332114, -138329, -97610, -63488, 12139, -66516, -226944, -253080, -265283, -116665, 130483, 75675, -114877, -161584, -121992, -75520, -221813, -216447, -85477, -106072, -175936, -255337, -295278, -283944, -232209, -278827, -296237, -218608, -205987, -291517, -429663, -383693, -264442, -18994, 38114, -839, -59460, -36096, 81750, 35124, 6925, -24502, -16625, 88574, 166636, 47151, -94643, -2607, 141229, 191646, 112607, 2722, -53520, -173540, -254383]
16546b54383M3539n0455R719K060q415J01852J05818P4467N1830r8029k28890
16535b50887q5689J24107O7445j17029j04624J66963M0384j149R333J40578K0677
16524A0109j64224R840N0141N2477J205j9673q0752P3648J55071j07883L6889
16513A6848l7482j09588R7199J54192q9383K2760J18806j7560l8049j12107j04454
16502i8818n6658q5521J29951J56843j28522N9077J31802l3082j08927Q0628j7319
16491B9454L0388m7896j16797M980M697j59298j9860J00232J252j4428j76244
16480c63520q6893q9579J64706J36277P4426M5096q2072j39758q0853Q6883R203
16469c26084k05440j7650J13238Q4615J69067K39677R077j72988L9024l7977K591
$$ y = [-254383, -210844, -261299, -251580, -249520, -257935, -156083, -50265, 24202, 76032, -21997, -250887, -336576, -212469, -145024, -262053, -366677, -199714, -159330, -160479, -151146, -10568, 10109, -154115, -144275, -94134, -41657, -40452, -60125, -140877, -67229, 87842, -20041, 16848, -20634, -130222, -33023, 121169, 31786, 54546, 173352, 155792, 117743, 5636, -98818, -155476, -240997, -111046, 45797, -82725, -23648, 108154, 75072, -33855, 46773, 29454, 59842, 11946, -104851, -99871, -95174, -254472, -274332, -174100, -172848, -187276, -363520, -450413, -539992, -375286, -239009, -164583, -119487, -201559, -341317, -422170, -335287, -326084, -531524, -549174, -435936, -351321, -182254, 57423, 66500, -106488, -67464, -105441, -102850]
16458a02850P6096j33610j41317K18064J58601o5471r9922m7128M9215J04533
16448A6211Q8540r3106l9798r6117O2317M6043j24717j38285O2290J7383q1002
16437b80241R2182K39283J85239r6707o4910j94760j22971J45260j969N7195k4401
16426f6800m2890K68789O2836l013k28826j37686J43936j7559J03589o8381k05528
16415a91533k03146j17183K86194j03138N3791J2402M7865l8360m064j69247J7025
16404d09394J35709J08316j9433r1920M7343Q2912R896J14557P0211K2746n9375
16393A1568j884K09960r3160r4082j41620K6531J04137j07667j84704k3103J51633
16382a42391J7488J5217L3798J35060J8024j47281k51790J62458J13092q5250
$$ y = [-102850, -26754, -160364, -301681, -83617, 74984, 9513, -90409, -137537, -88322, 16211, 104751, 11645, -28153, -124270, -61953, -15910, -140627, -278912, -216622, -199239, -280241, -188059, 51224, 236463, 139756, 74846, -119914, -242885, -97625, -99594, -42399, -66800, -109690, 159099, 221935, 218922, -9904, -147590, -3654, -21213, 82376, 13995, -191533, -394679, -511862, -225668, -328806, -275015, -262613, -214748, -253108, -257172, -426419, -409394, -273685, -165369, -184802, -276722, -229379, -146467, -136571, -22014, 48197, 70943, 11568, 9684, 219644, 126484, 32402, -109218, -82687, 21450, -86217, -270921, -294024, -142391, -124903, -109686, -75888, 59172, 77196, -70085, -321875, -159417, -46325, -131575]
16372a31575j40719o7381m5668L8549k6841N4558r1257N2397J24582J30533M2655
16361f0167N3313p7260r0879p8619R9998j07781K0001J05450l9935j56076r1626
16350d23581J15252O4303o9433q1490J98751J73018P7751L7779o7825k53466j26615
16339c55556J70838J22381q8792j14691M6462N9367J50491n518M1010o03j17563
16328i2174k8620m6222o300N123p2978P2760N1910J11877J5352p2655j22093j9742
16316b03762Q4311l1645n0091O2381J05244l154l9453K0680L4436O9235J59925
16305B08107J30763m5964j25544N866L1425k8232L0349p85k30595j34032J31495
16294b7147m1321L8289j50892j37410L076M1372Q287M8853O3852P6984J8237O5538
$$ y = [-131575, -272294, -339675, -385343, -346794, -373635, -319077, -410334, -357937, -233355, -102822, -60167, -6854, -84114, -174993, -253612, -153614, -261395, -241394, -135944, -175879, -331955, -423581, -308329, -244026, -313459, -394949, -196198, -23180, 54571, 92350, 24525, -228941, -355556, -184718, -62337, -151129, -265820, -219358, -159991, -9500, -15018, 25992, 25389, -92174, -120794, -167016, -173316, -168193, -241171, -168411, -116501, -4624, 10728, -61927, -184020, -203762, -119451, -151096, -201187, -138806, -33562, -36716, -76169, -55489, -21053, 48182, 208107, 338870, 292906, 167362, 173228, 204653, 176421, 206770, 205985, -24610, -158642, -27147, -68468, -30179, -181071, -318481, -315405, -274033, -265746, -216893, -153041, -76057, -57820, 7718]
16282G718K16343L4237m2596k3057O7n0329l6261j33779N3166L1651j03668L8967
16270g541J00528l7145k43432r9761J4941K0225m2840k6792L3350j3371P9041
16259b22797O4888j19264J97975K5595N8441Q188r5234K14218P909j50689j41879
16248a52649q2353n920J36406J6197m0338O7273J15424q7956N565q9995j75301
16237b93647j0798J7578M7142N1170n7157L2444R9577p1178j71686r9241K16260
16226b39536J55187L4508O1469o0240J72665p3645j94367J49858p4701k56256
16216c25058O1825J85010j91822l51668q378J8184J04292L45267J62414r170K7555
16205A8451m6807o9062Q0943j57555q9637J09196J5731m9510M6406J04561n8004
$$ y = [7718, 224061, 258298, 215702, 192645, 192712, 142383, 106122, -27657, 25509, 57160, -46508, -7541, 92987, 55842, -187590, -287351, -272410, -252185, -295025, -321817, -288467, -301838, -222797, -157909, -277173, -79198, -53603, 4838, 13026, -82208, 132010, 139919, -10770, -152649, -235002, -240922, -104516, -88319, -128657, -61384, 54040, -33916, -28351, -118346, -293647, -304445, -286867, -239725, -188555, -245712, -213268, -113691, -184869, -356555, -455796, -239536, -84349, -49841, 11628, -48612, 124053, 50408, -143959, 5899, -68802, -325058, -263233, -78223, -270045, -621713, -630091, -611907, -507615, -162348, 66, -9104, 18451, -28356, -97418, -16475, -174030, -263667, -154471, -138740, -188250, -141844, -37283, -95287]
16194i5287m9685p4065k372n6895m8149k993J55477J42055M2382q0290j9449J19094
16182B9823n4063k6776N4465Q4462r1235j204k37824J173p7019q2870J59497J66537
16170g5034J97215j165j55713k9703j0123l1149N6007O1097J762q3043M1238O358
16158b2253j10415j25089j9745O7251J35555k4125P6443j1703j36690q1002J29999
16147a21774J0893p649O5740J73631J08412j84492j62398j00122n9432j42292
16137d19483O4219k8346J06596J41561n3035J06707J99009k0728n348K7873q8958
16126C0067n442J1017k2544q8510j7522N7218j02337l976P3108p4125j07247j06758
16114c57051P113J72356J2517o2133J1016k14020P1736K15369O4697l1460n8136
$$ y = [-95287, -144972, -219037, -221409, -278304, -326453, -329446, -173969, -31914, 10468, -69822, -89271, 29823, -24240, -51016, 3449, 87911, -3324, -4528, -242352, -241179, -318198, -401068, -241571, -75034, 122181, 121016, -34697, -64400, -74523, -105672, -49665, 11432, 13194, -69849, -28611, -22253, -132668, -257757, -277502, -210251, -74696, -98821, -22378, -34081, -170771, -251773, -121774, -110881, -118530, -52790, 120841, 229253, 44761, -117637, -217759, -277191, -419483, -355264, -383610, -277014, -135453, -188488, -81781, 117228, 96500, 91152, 119025, 30067, 24625, 35642, 13098, -75412, -92934, -35716, -138053, -142029, -68921, -143046, -250293, -357051, -349938, -177582, -165065, -227198, -216182, -430202, -358466, -143097, -78400, -109860, -167996]
16103a67996r1441j19483k8275L5276J49392J7940J14787O5081R817k8963p3320
16092a17185m0518p2856P1380m2606L402p0402j37344l9642R1380J26085l5313
16081b63619k0439J85001M3764M8957J7533R0971q9512k39524k1318J12576J17759
16070a7851O1807j16342J58247J40834k5335k1664L2434o7753r8854M0011k62269
16059a76735n792J32909K4309q7950n8770M0399J16959N7412J1245R561j08985
16048d5438j70838r0371O7792K33555N4180j96948L4222j39639j6753J48598L8068
16037h3572j93376r773Q0107M5155k7752J03388q38R5350Q5287M5657m3708N2423
16025A48348q8804J1059j01515j06404J5874N3479J9760p6432k3836l9629P0659
$$ y = [-167996, -259437, -378920, -407195, -371919, -222527, -204587, -89800, -24719, -14902, -43865, -117185, -157703, -230559, -159179, -201785, -198383, -268785, -406129, -445771, -354391, -228306, -263619, -284058, -99057, -55293, -6336, 11197, 102168, 12656, -226868, -248186, -135610, -17851, 43956, -72386, 85861, 226695, 201360, 179696, 212130, 144377, 45523, 85534, -176735, -182527, -49618, -25309, -113259, -172029, -131630, -14671, 42741, 53986, 63547, -45438, -216276, -306647, -238855, -5300, 48880, -148068, -113846, -253485, -270238, -121640, -83572, -276948, -286721, -206614, -161459, -189211, -85823, -86661, 8689, 93976, 139633, 95925, 148348, 59544, 70603, -30912, -137316, -121442, -67963, -48203, -124635, -148471, -188100, -117441]
16014a17441L6329J20253O9421j23654q5651K4494J749P5353J0448p7361J00798
16003C4738j09511j48768n7446L9955j22031r1656M3371J44709J79457K0008m8665
15992a15839L1451R1296M5309P1209m5147J8143L1030r6046j39122l8983R269
15981a37430p0177O0746M8323p8939R333Q0163J01843O4598j03746j06742n683
15970a37711K43567n3636J36771N7353j67585j48158M357k2285j26906j47823
15960c62056o6323j5821J28300K02350K054P0630P378M4161l6948J915J3171M7704
15948C6515n5101m3850K8648Q7813o5502M7829j5717p6954L0941j25339J38511
15937a2206o1597l4376N3096K03532k0634j41319k4292k78427j38402o7427k4256
$$ y = [-117441, -81112, 39141, 108562, -15092, -100743, -76249, -74500, 853, 11301, -66060, 34738, -74773, -223541, -280987, -241032, -363063, -454719, -411348, -266639, -87182, -67174, -115839, -84388, 6908, 52217, 123426, 78279, 96422, 127452, 31406, -107716, -146699, -137430, -207607, -146861, -98538, -177477, -168144, -87981, 13862, 78460, -25286, -132028, -137711, 105856, 52220, 188991, 246344, 78759, -69399, -65042, -87327, -214233, -362056, -428379, -444200, -315900, -113550, -111496, -40866, -33488, 10673, -26275, -24360, -11189, 36515, -18586, -62436, -33788, 54025, -11477, 36352, 20635, -56319, -25378, -150717, -12206, -73803, -108179, -55083, 148449, 127815, -13504, -37796, -316223, -454625, -522052, -546308]
15926e46308K83350J96605Q9974j6561J08412J21970j42505j94998J74077J14062
15916A88078J5477j07575j83503k5353J53N456M7167l7444o3543j9437J06522
15905g4002M4483r0188j22630J11298K4209K1973J64449j498j04323l7096J49868
15894H6543j60084j82743p2288P0323l748m6294M6423O0135J61204k036j30091
15883a72656K6632M7868Q3023O1231j14013j88260m6924j57355m725R248p617
15872d63548N783R499J30565R4350M5870J45650J00446M7593k1711p2033j9428
15861C036n508L6865P2907k8032k08101m1577L2306R3219Q4613r8840j23545j07514
15849b90171K14193k6987k40478P8635J78173J2941K6043j79654O3798N2900M8716
$$ y = [-546308, -262958, -66353, 23621, 7060, 115472, 237442, 94937, -100061, 74016, 188078, 203555, 95980, -87523, -112876, -112723, -107267, -60100, -97544, -161087, -180524, -74002, -29519, -119707, -242337, -131039, -106830, -84857, 79592, 78094, -26229, -63325, 86543, -73541, -256284, -328572, -258249, -261997, -308291, -261868, -201733, -40529, -42565, -172656, -146024, -98156, -15133, 46098, -67915, -256175, -303099, -460454, -465179, -455931, -463548, -457765, -448266, -317701, -223351, -177481, -31831, 68615, 116208, 94497, 22464, 3036, -2472, 34393, 107300, 79268, -128833, -170410, -138104, -44885, 39728, -59112, -182657, -290171, -75978, -102965, -343443, -264808, -86635, -73694, -47651, -227305, -163507, -110607, -61891]
15838f1891R5479q4812p2250L7802O7827j22428o9059p0348p8249r1402K9057
15827d20274J81899L9366J13908J24779K9583j08971q5721K36627m899r8765r7555
15816i0023r6706J3048O082J75699K6506j9635P9059J11727k7665r3797j19894
15805c5599n934l7642o2702J21503J76623j1899o2413J8303j57123k12197k2384
15794b91464J34958P8267j6446j43371m700J75474J44839p6178j05003k000l8652
15783a44276k2967n1696r9152j644J30624J01518q0735k03976j08293P798K28157
15772b44642K15370P7464K9178q7948j04247n4464J61933m2195M9690O8036j2591
15761E5584N4889n7301m8080l1635J6385q0578k6754O4261Q1383J12954p3444
$$ y = [-61891, 33588, -51224, -123474, -85672, -17845, -140273, -209332, -279680, -357929, -449331, -420274, -238375, -199009, -85101, 39678, 69261, -39710, -125431, 111196, 106297, 7532, -90023, -186729, -173681, -167599, 8100, 34606, 14971, 94030, 205757, 178092, 84295, -35599, -41533, -79175, -141877, -20374, 156249, 144350, 81937, 100240, -56883, -269080, -291464, -156506, -78239, -94685, -238056, -242756, -67282, 77557, 1379, -103624, -105624, -144276, -167243, -218939, -318091, -319735, -189111, -87593, -168328, -372304, -480597, -472799, -244642, -29272, 48192, 77370, -10578, -114825, -169289, -7356, -49551, 139, 68175, 55584, 110473, 53172, 5092, -26543, -10158, -90736, -117490, -53229, 28154, 141108, 67664]
15750F7664j65198j0905r7357m9343L559j16483N0563J66391K4230P3355K39135
15739A85611k9485k47671O8393L3399k9770p1789L7269J38469J2428R6592p0442
15728A23004p0249j21659r6074N2773J4683m3193J44952j12352J09747K38276
15718B39908j44143j07999k04109l5719K22166N0694r687p0430j12691l9766J25388
15707h6388K330r5968K3587j5067r7636P292L6535k9127O6050L7937N2001K162
15695i6292o0627M9235O6433k59598j94561J33867O649J4135Q2404J78972L9098
15684d0285q1214K3216Q6575o2480o8424n3386M5447J6211J0647M5678j11111
15673a89126k1709J35147l1794o5028O6494k29831j99280J27993Q2608J26211
$$ y = [67664, -97534, -108439, -205796, -255139, -251580, -368063, -317500, -151109, -126879, -53524, 185611, 156126, -91545, -23152, 10247, -19523, -91312, -54043, 84426, 96854, 193446, 123004, 52755, -68904, -164978, -112205, -97522, -140715, 4237, -108115, 1632, 239908, 95765, -12234, -216343, -252062, -29896, 20798, 11111, -59319, -172010, -211776, -86388, -84058, -180026, -156439, -171506, -269142, -261850, -225315, -254442, -188392, -150455, -98454, -96292, -156919, -107684, -41251, -300849, -495410, -361543, -354894, -340759, -258355, -79383, -40285, -121499, -98283, -11708, -74188, -142612, -195998, -150551, -134340, -123693, -78015, -189126, -210835, -75688, -107482, -172510, -106016, -335847, -535127, -407134, -324526, -198315]
15663a98315J28320M1609r6313m7605J05299k387j05376j88503p2758o050P6466
15652c65613J41736r804n9686N138R5711J85018M8779P0186K2115l8574l581j5301
15640G6124r2154J1588m5838j38018J5562r3598n7513J60940J26809O8602P8672
15629A11176r151r6959k7149r5703q5550M0817k787N0712j14533J27098O4320
15618c7709o7848n73R2740J04421m329N5149o5616m9890o4281J22306J14762n8859
15606A40273j27305j8735K5286J75987o5237j01315k2773o513P4718L5447j38227
15595b8394o9011j55328N4930L8536K1055n0649p1834O551k5544K208j0741P2246
15583b15975r961M3531O2849m8722J51123J27821j1328j22973j49759j9837l8418
$$ y = [-198315, -69995, -28386, -124699, -172304, -67005, -69392, -174768, -363271, -436029, -442079, -365613, -223877, -233681, -293367, -288229, -192518, -7500, 41279, 111465, 133580, 95006, 91425, 76124, -16030, -4442, -50280, -188298, -172736, -266334, -323847, -162907, -36098, 32504, 111176, 102025, 5066, -22083, -117786, -203336, -162519, -165306, -114594, -229127, -102029, -37709, -105557, -106130, -13390, 91031, 86702, 141851, 76235, 26345, -37936, 84370, 199132, 140273, 12968, -5767, 19519, 195506, 130269, 28954, 6181, -332, 74386, 109833, -28394, -97405, -252733, -197803, -159267, -138212, -188861, -260695, -254144, -279688, -277480, -288221, -215975, -225936, -182405, -119556, -168278, -17155, 110666, 99338, -23635, -173394, -193231, -231649]
15572b31649o3403o3944J41448O7831J35087R045k04003L900P4746r8299j00895
15561c30136R5048J4348l6303J65275J66944j26294r64K7586N7557P6347j00148
15550I260j9031R3212J00187p3762j56400j06160J13591J59420j6910J01534l4604
15539A70337j64282N2991p8824j01428M9114k5826K6645m2501Q8616J21669L5102
15528A31613j74308P6679k7202r7165M922r4250R6234J44646J69680j4298q060
15517B08491k09897M3848p0777P388k6353L0862j8215R8184J2913j62332k38511
15506c24399O1038q7064K8120J8248K237M8834J1906n3737J33708L8916J00551
15495b1642j71548o1767K17495J40029j37979M4855J13969j31149o8165o407N6107
$$ y = [-231649, -295052, -358996, -217548, -149717, -14630, -5585, -209588, -205688, -130942, -229241, -330136, -235088, -220740, -257043, -91768, 75176, -51118, -52082, -24496, 33061, 109408, 9260, -9771, 83441, 183628, 109866, -46534, -152694, -39103, 120317, 103407, 204941, 170337, 6055, 59046, -19778, -121206, -72092, -97918, -71273, -113774, -25158, 96511, 131613, -42695, 33984, 6782, -90383, -85461, -179711, -83477, 61169, 230849, 216551, 208491, -1406, 42442, -28335, -20947, -47300, -16438, -34653, 63531, 76444, -85888, -324399, -263361, -350425, -322305, -304057, -301820, -252986, -241080, -294817, -161109, -122193, -21642, -193190, -254957, -37462, 102567, -35412, 9443, 123412, -7737, -75902, -82309, -26202]
15484b6202J47056K8836k334l2395K4844j45423o8687J86704N202k4502K8241
15473A21340K6996l5036j56947r3910n6463k9045j31857J23685N3324J6221J63085
15462A393p7884k0798L3087k6037k3177O9744m241n141N0570J72139o6641M3612
15450A46626N0110K3615j16965p3418k3665j24992j19883o7805Q0642K37261J18484
15439A30010o1771l680J1519L4338j56938l5696q3300J59966K1201j13438n4213
15428a52002L0333j5805j08071p3556J50092L28683K686n9813J09034K4853j49873
15417H6561p1014q5087r6725r9744j24196m7637R4053K25551r4592O1794l4449
15406a85485m7198q8848m0082J25994J17019q2985P0987J93944J88m7844J0883
$$ y = [-26202, 120854, 149690, 147356, 114961, 139805, -5618, -74305, 112399, 117601, 93099, 121340, 148336, 113300, -43647, -137557, -194020, -223065, -354922, -231237, -177913, -161692, 1393, -76491, -97289, -64202, -90239, -113416, -43672, -47913, -53054, -2484, 169655, 103014, 146626, 196736, 220351, 103386, 29968, 6303, -118689, -238572, -306377, -225735, 11526, 130010, 68239, 64559, 76078, 110416, -46522, -82218, -165518, -5552, 15649, -97789, -152002, -121669, -137474, -245545, -319101, -169009, 159674, 162360, 102547, 211581, 236434, 86561, 15547, -69540, -166265, -266009, -390205, -437842, -343789, -118238, -212830, -151036, -185485, -232683, -321531, -361613, -235619, -118600, -201585, -130598, 63346, 63534, 15690, 26573]
15395B6573l0920o6748J88150o1478o5081K7463J10947o7608K0932J4266k6870
15384F9626q17k4149j81091r8436r0017L3456O9797J03590P1941J96620R4619
15373B45139j22859j62227j77948J63089N5915j41147j32362Q3192Q8453l5583
15363a36338k8106J98300J09656m9781k5167j49520j31817N0311n3575k3492P2744
15352a66785N6133O9925k6245P3823m0583n6756n3597j29287m9472J79127Q9513
15341e4204j5855p6388j2844o1273J23479K36439k51788q1221j1382J19248O8567
15330a7222j06728J9157k9838O1469K7266n1444o5469j64724n363J57262J62384
15319a3250k8494R821J05067j58222o0785j09395K23227J69519k06205j01294
$$ y = [26573, -4347, -71095, 117055, 55577, -9504, 17959, 128906, 61298, 82230, 96496, 69626, 68809, 44660, -136431, -234867, -324884, -291428, -221631, -118041, -46100, 150520, 245139, 122280, -39947, -217895, -54806, 1109, -140038, -272400, -189208, -100755, -136338, -164444, 33856, 143512, 93731, 68564, -80956, -212773, -162462, -216037, -239529, -166785, -110652, -40727, -66972, 6851, -33732, -90488, -144085, -273372, -322844, -143717, -54204, -70059, -146447, -159291, -220564, -97085, 139354, -112434, -193655, -205037, -85789, -17222, -123950, -104793, -134631, -73162, -45896, -97340, -162809, -327533, -332896, -175634, -13250, -41744, -31923, 73144, -85078, -145863, -255258, -32031, 137488, -68717, -170011]
15309a70011K1242Q4668J17433J225j41738k9634Q0988r7173p2830P8200M0657
15298h6973k03654M0565O8757R6967j34800j71789L5010L9735Q8210N663J082
15287b21227j07691Q6017o154q3883K08560k6252K2947N6936P0282M943j60633
15276a56155N8307l8414j19834r348l785j1610J38063K9310j23594J73891l7443
15265a00612O3042J05614j33096j68821j31429J2803K17483R0480J8809j16629
15255a42356M9622M2907O1905k0642r1437j58921K06985Q9910j82429q9134R3762
15244a39828R3578n1343j33050j3648k6583J8555J27046J52974j22120R5732P5872
15233G7185j11259M2933J99881j48125n4711j7769j95083j85094O3624R1712r1713
$$ y = [-170011, -148769, -64101, 53332, 54557, -87181, -116815, -35827, -133000, -205830, -127630, -86973, -290627, -250062, -181305, -84338, -219138, -390927, -355917, -316182, -227972, -222309, -221227, -328918, -242901, -249055, -332938, -124378, -150630, -127683, -70747, -465, 4478, -156155, -97848, -136262, -256096, -265444, -269229, -280839, -142776, -113466, -237060, -63169, -100612, -37570, 68044, -65052, -233873, -365302, -352499, -135016, -44536, -25727, -142356, -92734, -49827, 12078, -8564, -100001, -258922, -51937, 37973, -144456, -233590, -139828, -46250, -97593, -230643, -244291, -270874, -252319, -125273, 27701, -94419, 1313, 77185, -34074, 8859, 208740, 60615, 5904, -11865, -206948, -392042, -328418, -236706, -328419]
15222c28419Q9466N3918j04516N4958M1701k4115k61010j15120K68830K61390
15212f2917P7495r5418o8231k4347L3677J12341O4129n2587J16925M6915o8443
15201G9539O8719J12472J3882p6699m0739J44J7841K3475O3559q0113o8265r7236
15189A6579j00176P8270L8766L4039J64635Q6212m5592N319o9473q4101o6876
15178E7602J40234K30415p1897j10331q6383l1534k1618r3715m888N0709j09299
15167e0705J959k3128J6825r597q3936l8384Q4178j51472m224J25640N5276J09657
15155C2089j8383j0381j18474j13117l5727O1673P8385J27065J7717J40251L0203
15144A91301l6918k45054N1126O0972k1901j24572J67136N5292q5851N4040P700
$$ y = [-328419, -238953, -185035, -289551, -234593, -192892, -217007, -478017, -593137, -324307, -62917, 14578, -80840, -149071, -173418, -139741, -27400, 36729, -15858, 101067, 147982, 79539, 148258, 260730, 274612, 197913, 157174, 157318, 175159, 198634, 262193, 182080, 113815, 16579, -83597, -5327, 33439, 67478, 232113, 318325, 272733, 278052, 208579, 124478, 57602, 197836, 428251, 356354, 246023, 159640, 128106, 106488, 12773, 7885, 58594, -50705, -48746, -71874, -55049, -64646, -148582, -186966, -102788, -254260, -258484, -132844, -77568, 32089, 13706, 3325, -115149, -228266, -263993, -202320, -123935, 3130, 20847, 161098, 191301, 154383, -90671, -39545, 21427, -474, -125046, 42090, 97382, 11531, 65571, 73271]
15133G3271k7589K4666r1517L152J37784p1591j67291m0515P431O620P2571j8006
15121i1014R2441Q6434q4704J18244Q7247J61394o1373j08229l3880j29669j41291
15110a04400l7331M9469P6541P9511M6290O3480N5364q295l4209O9136J04766
15099C60322j64907j28824k8373Q5566K01171J2089j73919j0456O3746n4392j24117
15088C7906n3840L2602p0597r906J9335R0715J12349P5461o0062l3295m8005k595
15076I0068j9076r4292j36573O0206Q9733n4629j77688k2596J60616L5237p7796
15065a46790K12912K31167j4534j21501j7337J7425q7342L9600k00678m1193J36314
15054H043M5199k030P3281j75648o8585J68679M7524j2984J10788R3941Q1173
$$ y = [73271, 45682, 70348, -21169, -18017, 119767, 48176, -119115, -159630, -152199, -145579, -73008, -91014, 1427, 87861, 3157, 121401, 208648, 370042, 308669, 200440, 166560, 36891, -104400, -141731, -92262, -15721, 63790, 110080, 173560, 228924, 220629, 186420, 255556, 360322, 195415, 66591, 38218, 123784, 324955, 337044, 163125, 152669, 216415, 162023, 37906, -15934, 16668, -53929, -63835, -44500, 46215, 158564, 234025, 173963, 140668, 92663, 90068, 70992, -23300, -159873, -99667, -9934, -64563, -242251, -264847, -104231, -68994, -146790, 66122, 297289, 282755, 161254, 143917, 161342, 74000, 113600, -87078, -128271, 8043, 53242, 51212, 124493, -51155, -119740, 48939, 96463, 83479, 194267, 288208, 369381]
15043C69381j32386j52862k4107j61827n2824J57094K3940k0070q782R9859O9492
15032A66908J8085j70946Q0199L2752J5798l8337P1359n4625j85297o2758O5547
15021f1315R1716J74259j322m1622P5899M6909M991L462q1462J56894q215j53133
15009B07061L8878J759k30146k60879O3155J6953N3545j0165n3515K0882J21747
14998c0725M4300j31427j66715J7724R6771j41180J33614N3606J70735m3339k1993
14987a8629P8431j5968j23312q6869q9197k7041J56866L66200J38749L658r9700
14976B83188o7687k4742l6144k0446j93074m5901M9026K26676J63220k48188j25072
14965c9144j2848q2960K96753K56449k0596j41361j13377j30760j3390o9425K30232
$$ y = [369381, 236995, 84133, 60026, -101801, -154625, 2469, 26409, 6339, -2443, 97416, 166908, 184993, 14047, 94246, 126998, 142796, 104459, 175818, 121193, -64104, -126862, -61315, 30401, 204660, 203338, 161716, 237615, 284524, 289515, 292977, 211515, 368409, 360194, 207061, 245939, 247698, 17552, -243327, -180172, -163219, -109674, -119839, -173354, -152472, -30725, 13575, -117852, -284567, -266843, -170072, -311252, -177638, -124032, 46703, 3364, -18629, 59802, 43834, -79478, -166347, -255544, -282585, -125719, 240481, 379230, 382888, 283188, 215501, 190759, 154615, 134169, -58905, -104806, -55780, 170896, 334116, 85928, -39144, -51992, -134952, 161801, 418250, 397654, 256293, 142916, 12156, -1234, -70659, 159573]
14954A59573k59866j50593K66256J48141k15747k64427M1848P3861q2540J2731
14944b70763J83386M6912L9374K0292J3423m3327l0215M6745j1867o1978L9950
14933b8068Q9119K3321j98851r0120k0162j56117J10693O5860K66065Q9589q2440
14922F8889j36484n6664p608J35821P7752K4209j0411j21833R2457K5907j40636
14911d8601J4140J2382O7962J84227n294K9937p3326q7732j04254q2033O06Q6327
14899e659O1603O1165j8056j51658k27941j8630m1013L7778J28732m5783J55049
14888f4413M7955j98257j34749M163J48395l5886J44124N5546k2771J58003j14110
14877a2000R545J56185j48656j64349Q0546J1849J25051j654m1598r9572N9392
$$ y = [159573, -100293, -250886, 15370, 163511, -52236, -316663, -274815, -200954, -283494, -270763, -87377, -40465, -1091, 19201, 32624, -10703, -40918, 5827, -6040, -68018, -28068, 61051, 84372, -114479, -204599, -224761, -380878, -270185, -204325, 61740, 151329, 68889, -67595, -124259, -131867, 3954, 81706, 105915, 95504, -26329, 66128, 92035, -48601, -34461, -22079, 45883, 230110, 224816, 254753, 181427, 93695, -10559, -92592, -91986, -5659, 55944, 117109, 99053, -52605, -280546, -299176, -340189, -302411, -173679, -219462, -64413, -16458, -214715, -349464, -345301, -196906, -232792, -88668, -33122, -55893, 102110, -12000, -2455, 153730, 5074, -159275, -78729, -66880, 58171, 56517, 14919, -84653, -25261]
14866b5261k0512j25367n9376p3156N5730n8777K6258m3950p6283N4208O9640
14855b76846l488O5197J45382J9807o6998n2159J21118j03774m9675J44763P5225
14844A8552J7090J67723n8106l11780L6092J12218j9246p9926j96549J29185O0894
14833a23853q430J16400j51897j06462O488K18033m2639j52724k6208r537J27855
14822a52974Q8849j2263J11790J67801Q0075k2298k01073k35309O7001N5403k9280
14811h2278p3924n3296k8914M6969K18574K43463M3762p3477M570L6444J25760
14800D07653k355m8045k2655j19836q5040P4779R774P3904r554j88319q6099r8944
14788i4737L1189N5106Q64l6508O6758K088j23560m7116J25981L6665P2658P0928
$$ y = [-25261, -45773, -171140, -230516, -303672, -247942, -306719, -280461, -324411, -400694, -346486, -276846, -280334, -215137, -69755, -49948, -116946, -169105, -47987, -151761, -201436, -56673, 18552, 35642, 203365, 145259, -166521, -130429, -18211, -37457, -117383, -313932, -184747, -123853, -132283, -15883, -167780, -274242, -267754, -49721, -92360, -245084, -271292, -280829, -152974, -64125, -76388, 35402, 203203, 283278, 260980, 59907, -175402, -108401, -52998, -82278, -156202, -209498, -238412, -191443, 27131, 270594, 314356, 240879, 245449, 281893, 407653, 405298, 357253, 334598, 214762, 129722, 204501, 214275, 288179, 278625, 90306, 4207, -94737, -63548, -8442, -7578, -44086, 22672, 24760, -98800, -145916, -19935, 16730, 89388, 160316]
14776A60316n3561J46647J0259k07492q4083J17812K08897j65903p9668J80324
14766B33548M1994j04016p1627o5604Q22O8794J35355n2920m8861k3511O3319
14755A77293M5271N083j05851j49267l0356J76450P3066m7257j2284N4028n017
14744A81159k07365l8538M7255K4041p4503n4963J82223R6765j33602k79975j6174
14733b73677L36641l47m9269O514r1650p0847j2640J33151m4501N378Q6294q232
14721A6815R6260Q7156L7405l8332J6029m8418p4565j1935p3125m7538Q8289P8346
14709A26387K7100p843j59323j62221k3101K20263K09917L2533m8753n9484j93913
14698c8438M719J62935K8581j00799r4903j27453j33090K0427o6991J17528K4586
$$ y = [160316, 106755, 253402, 263661, 56169, -27914, 89898, 298795, 132892, 53224, 233548, 275542, 171526, 99899, 34295, 35117, 103911, 239266, 186346, 137485, 113974, 177293, 222564, 227647, 121796, -27471, -57827, 118623, 191689, 144432, 132148, 186176, 181159, -26206, -64744, -17489, 6552, -67951, -122914, 59309, 156074, 22472, -257503, -273677, 62964, 62617, 13348, 19862, -71788, -142635, -155275, -22124, -66625, -61247, 25047, 16815, 113075, 200231, 237636, 199304, 215333, 166915, 92350, 80415, 7290, -40248, 48041, 126387, 153487, 145644, -13679, -175900, -199001, 21262, 231179, 263712, 214959, 155475, -38438, -33719, 129216, 157797, 56998, -37905, -165358, -298448, -278021, -345012, -227484, -202898]
14687b02898O7093j8357L054K0368j30442J9109J43715J19902M218o6842n550
14676d6630m0154m1797P8886N6485J56436P4837N4691k53296p5483j2545N8883
14665A0313O4944m1457m8542j84609N8366k2448J12933J8786j65538N8933J27348
14654a0971N0949j08451k4204P1178P444n3422o2161J45998Q8095l8668l4201
14643C1586m4180n1624k6610j0462p3k019Q1748K6332k8348M8908n1813n1019
14631g7574j29812L1814O6390K41510P0322j20699k25722R537J5214J14781N7176
14620E2937J9026n9175Q6699j05811j5952O7080K50020k1581j69183P5832j64739
14609A5153k41540n4096m495O884J29589J3447k1121j43013o501L29934M967P4238
$$ y = [-202898, -135805, -154162, -151108, -130740, -261182, -242073, -98358, 21544, 25762, -41080, -46630, -86784, -128581, -49695, 6790, 163226, 238063, 292754, 39458, -36025, -48570, 10313, 75257, 33800, -14742, -199351, -140985, -163433, -50500, -31714, -197252, -138319, -10971, 39978, -68473, -92677, -21499, -14055, -67477, -129638, 16360, 104455, 65787, 31586, -12594, -64218, -90828, -101290, -101363, -103382, -21634, 4698, -23650, 25258, -26555, -77574, -207386, -175572, -109182, 132328, 202650, 81951, -143771, -134234, -119020, -4239, 52937, 71963, 12788, 99487, -6324, -22276, 44804, 294824, 273243, 104060, 179892, 15153, -226387, -280483, -284978, -278094, -148505, -135058, -156179, -299192, -305693, 24241, 29208, 103446]
14597A03446K04993N385l01857j66317r1045J43004J01137l1673M9603o5882p660
14586e6866j39238R9584P0295n8229Q0100N146J54368j9006m3152R7775o8893
14575A21884j11765k37838m6415o0627Q1744J33134q6314l9095J41591J20162
14565A6461M072K6806p5901J09024m6763j56376J54K4422J3120N0842J86959K26143
14553C78963l5646j69310k82750k48545p4991Q8552K4993o1275J45249J28601
$$ y = [103446, 308439, 313824, 11967, -154350, -245395, -102391, -1254, -32927, 16676, -49206, -56866, -196104, -96520, -26225, -84454, -4354, 792, 155160, 136154, 93002, 190777, 121884, 10119, -227719, -274134, -334761, -253017, -119883, -206197, -245292, -103701, 16461, 20533, 47339, -28562, 80462, 33699, -122677, -122523, -98101, -84981, -34139, 152820, 378963, 343317, 174007, -108743, -357288, -432279, -343727, -318734, -380009, -234760, -106159]
$$ [...]
##END NTUPLES=NMR SPECTRUM
##END=
