##TITLE=Analysis number 319093
Compound Code cc 48922
Book Reference 468/62
Project Code adrs
Chemist Name colinb
##JCAMPDX= 6.0         $$ Bruker NMR JCAMP-DX V2.0
##DATA TYPE= NMR SPECTRUM
##DATA CLASS= NTUPLES
##ORIGIN= Bruker BioSpin GmbH
##OWNER= nmr
$$ XWIN-NMR		Version 3.5
$$ Tue May  2 08:30:58 2006 GMT Daylight Time (UT+1h)  MAYBRIDGE\nmr@NMR_250MHZ
##.OBSERVE FREQUENCY= 250.131544655141
##.OBSERVE NUCLEUS= ^1H
##.ACQUISITION MODE= SIMULTANEOUS (DQD)
##.ACQUISITION SCHEME= undefined
##.AVERAGES= 16
##.DIGITISER RES= 18
##SPECTROMETER/DATA SYSTEM= dpx250
##.PULSE SEQUENCE= zg30
##.SOLVENT NAME= CDCl3
##.SHIFT REFERENCE= (INTERNAL, CDCl3, 0, 16.4496)
##AUDIT TRAIL= $$ (NUMBER, WHEN, WHO, WHERE, WHAT)
$$ ##TITLE= Audit trail, XWIN-NMR		Version 3.5
$$ ##JCAMPDX= 5.01
$$ ##ORIGIN= Bruker BioSpin GmbH
$$ ##OWNER= nmr
$$ C:\u/data/dgb/nmr/ADRS/3500/pdata/1/auditp.txt
$$ ##AUDIT TRAIL=  $$ (NUMBER, WHEN, WHO, WHERE, WHAT)
(   1,<2006-05-02 08:30:23.42 +100>,<MAYBRIDGE\nmr>,<NMR_250MHZ>,
      <created by zg, POWCHK disabled, PULCHK disabled
       configuration hash MD5:
       84 BC 41 DB A1 6E 1D 46 DA 25 12 A5 C1 ED C5 3A
       data hash MD5: 64K
       56 53 E4 8B A4 F6 33 09 99 C5 EE 1C 61 63 90 79>)
(   2,<2006-05-02 08:30:45.98 +100>,<MAYBRIDGE\nmr>,<NMR_250MHZ>,
      <Start of raw data processing
       ef LB = 0.3 FT_mod = 6 PKNL = 1 SI = 32K 
       data hash MD5: 32K
       5F 49 3D E4 B0 87 5F 13 66 8D AA E6 38 A1 07 20>)
(   3,<2006-05-02 08:30:48.24 +100>,<MAYBRIDGE\nmr>,<NMR_250MHZ>,
      <apk 
       data hash MD5: 32K
       E3 24 AA DF 52 2F E4 A8 E1 6D F7 E7 6C A9 13 C3>)
(   4,<2006-05-02 08:30:48.99 +100>,<MAYBRIDGE\nmr>,<NMR_250MHZ>,
      <abs ABSG = 5 
       data hash MD5: 32K
       54 99 A4 12 38 9D D3 B9 BD 49 07 48 6A 57 EE 64>)
$$ ##END=
$$ 
$$ hash MD5
$$ 45 AC F1 B7 16 2A 8C BE 8C 86 DC 09 D6 0A 20 3D
##$RELAX= 
##$RELAX= 
##$RELAX= 
##$RELAX= 
##$RELAX= 
##$RELAX= 
##$RELAX= 
$$ Bruker specific parameters
$$ --------------------------
##$DU= <C:\u>
##$EXPNO= 3500
##$NAME= <ADRS>
##$PROCNO= 1
##$TYPE= <nmr>
##$USER= <dgb>
##$AMP= (0..31)
100 100 100 100 100 100 100 100 100 100 100 100 100 100 100 100 100 100 
100 100 100 100 100 100 100 100 100 100 100 100 100 100 
##$AQSEQ= 0
##$AQ_mod= 3
##$AUNM= <au_zg>
##$AUTOPOS= <1 >
##$BF1= 250.13
##$BF2= 250.13
##$BF3= 250.13
##$BF4= 250.13
##$BF5= 500.13
##$BF6= 500.13
##$BF7= 500.13
##$BF8= 500.13
##$BYTORDA= 1
##$CFDGTYP= 0
##$CFRGTYP= 5
##$CHEMSTR= <none>
##$CNST= (0..31)
1 1 145 1 1 1 1 1 1 1 1 1 1 1 1 1 1 1 1 1 1 1 1 1 1 1 1 1 1 1 1 1 
##$CPDPRG= <>
##$CPDPRG1= <>
##$CPDPRG2= <>
##$CPDPRG3= <>
##$CPDPRG4= <mlev>
##$CPDPRG5= <mlev>
##$CPDPRG6= <mlev>
##$CPDPRG7= <mlev>
##$CPDPRG8= <mlev>
##$CPDPRGB= <>
##$CPDPRGT= <>
##$D= (0..31)
0 1 0 0 0 0 0 0 0 0.06 0 0 0 0 0 0 0.0002 0 0 0 0 0 0 0 0 0 0 0 0 0 0 
0 
##$DATE= 1146555020
##$DBL= (0..7)
120 120 120 120 120 120 120 120 
##$DBP= (0..7)
150 150 150 150 150 150 150 150 
##$DBP07= 0
##$DBPNAM0= <>
##$DBPNAM1= <>
$$ [...]
##$SUBNAM7= <"">
##$SUBNAM8= <"">
##$SUBNAM9= <"">
##$SW= 20.6930455092707
##$SWIBOX= (0..15)
0 0 3 0 0 0 0 0 0 0 0 0 0 0 0 0 
##$SW_h= 5175.983436853
##$TD= 65536
##$TD0= 1
##$TE= 294.16
##$TE2= 300
##$TE3= 300
##$TEG= 300
##$TL= (0..7)
0 120 120 120 120 120 120 120 
##$TP= (0..7)
150 150 150 150 150 150 150 150 
##$TP07= 0
##$TPNAME0= <>
##$TPNAME1= <>
##$TPNAME2= <>
##$TPNAME3= <>
##$TPNAME4= <>
##$TPNAME5= <>
##$TPNAME6= <>
##$TPNAME7= <>
##$TPOAL= (0..7)
0.5 0.5 0.5 0.5 0.5 0.5 0.5 0.5 
##$TPOFFS= (0..7)
0 0 0 0 0 0 0 0 
##$TUNHIN= 0
##$TUNHOUT= 0
##$TUNXOUT= 0
##$USERA1= <user>
##$USERA2= <user>
##$USERA3= <user>
##$USERA4= <user>
##$USERA5= <user>
##$V9= 5
##$VALIST= <valist>
##$VCLIST= <CCCCCCCCCCCCCCC>
##$VD= 0
##$VDLIST= <DDDDDDDDDDDDDDD>
##$VPLIST= <PPPPPPPPPPPPPPP>
##$VTLIST= <TTTTTTTTTTTTTTT>
##$WBST= 1024
##$WBSW= 4
##$XGAIN= (0..3)
0 0 0 0 
##$XL= 0
##$YL= 0
##$YMAX_a= 391465
##$YMIN_a= -504745
##$ZGOPTNS= <>
##$ZL1= 120
##$ZL2= 120
##$ZL3= 120
##$ZL4= 120
##$ABSF1= 16.44958
##$ABSF2= -4.243593
##$ABSG= 5
##$ABSL= 3
##$ALPHA= 0
##$AQORDER= 0
##$ASSFAC= 0
##$ASSFACI= 0
##$ASSFACX= 0
##$ASSWID= 0
##$AUNMP= <proc_1d>
##$AZFE= 0.1
##$AZFW= 0.1
##$BCFW= 0
##$BC_mod= 0
##$BYTORDP= 0
##$COROFFS= 0
##$CY= 12.5
##$DATMOD= 1
##$DC= 0
##$DFILT= <>
##$DTYPP= 0
##$F1P= 14.0000005364418
##$F2P= -0.99999901652339
##$FCOR= 0.5
##$FTSIZE= 32768
##$FT_mod= 6
##$GAMMA= 0
##$GB= 0
##$INTBC= 1
##$INTSCL= 1
##$ISEN= 128
##$LB= 0.3
##$LEV0= 0
##$LPBIN= 0
##$MAXI= 10000
##$MC2= 0
##$MEAN= 0
##$ME_mod= 0
##$MI= 0
##$NCOEF= 0
##$NC_proc= -3
##$NLEV= 6
##$NOISF1= 0
##$NOISF2= 0
##$NSP= 0
##$NTH_PI= 0
##$NZP= 0
##$OFFSET= 16.44958
##$PC= 1
##$PHC0= 169.8741
##$PHC1= 5.746469
##$PH_mod= 1
##$PKNL= yes
##$PPARMOD= 0
##$PSCAL= 4
##$PSIGN= 0
##$REVERSE= no
##$SF= 250.130018114361
##$SI= 32768
##$SIGF1= 0
##$SIGF2= 0
##$SINO= 400
##$SIOLD= 32768
##$SREGLST= <1H.CDCl3>
##$SSB= 0
##$STSI= 32768
##$STSR= 0
##$SW_p= 5175.98343685301
##$SYMM= 0
##$S_DEV= 0
##$TDeff= 65536
##$TDoff= 0
##$TI= <Analysis number 999999
Compound Code 99
Book Reference 9
Project Code 9>
##$TILT= no
##$TM1= 0
##$TM2= 0
##$TOPLEV= 0
##$USERP1= <user>
##$USERP2= <user>
##$USERP3= <user>
##$USERP4= <user>
##$USERP5= <user>
##$WDW= 1
##$XDIM= 32768
##$YMAX_p= 372364484
##$YMIN_p= -144449
$$ End of Bruker specific parameters
$$ ---------------------------------
##NTUPLES= NMR SPECTRUM
##VAR_NAME=  FREQUENCY,     SPECTRUM/REAL,   SPECTRUM/IMAG
##SYMBOL=    X,             R,               I
##VAR_TYPE=  INDEPENDENT,   DEPENDENT,       DEPENDENT
##VAR_FORM=  AFFN,          ASDF,            ASDF
##VAR_DIM=   32768,         32768,           32768
##UNITS=     HZ,            ARBITRARY UNITS, ARBITRARY UNITS
##FACTOR=    0.157963299565203, 1,           1
##FIRST=     4114.53355299757, 0,            0
##LAST=      -1061.44988385544, 0,           0
##MIN=       -1061.44988385544, -144449,     0
##MAX=       4114.53355299757, 372364484,    0
$$ Real data points
##PAGE= N=1
##DATA TABLE= (X++(R..R)), XYDATA
$$ [...]
$$ plain form
18606 155697 157316 193438 210300 232149 225336 193738 177437 183201 164425 160772 152649 138687
18594 138687 148283 146305 151688 158361 157710 159124 151637 153979 198986 211303 183280 163121 161460
18581 161460 184145 191318 192832 173322 140086 154293 168025 169757 167384 149735 142250 133115 136051
18568 136051 162953 172378 165973 173339 151179 171419 199652 171161 131036 126798 145150 165936
18556 165936 132869 120418 120946 154435 147189 154323 150220 156427 153918 142788 164790 158477 125292
18543 125292 130112 148321 152771 154933 156098 175596 163466 149178 176801 213731 231653 250400
18531 250400 257414 268782 295478 312266 313816 310909 325051 297066 290513 269333 236426 239586
18519 239586 220468 237181 256469 285164 309480 336609 344912 346643 364564 384934 372531 349402
$$ packed form
18606A55697J619L6122J6862K1849o813l1598j6301N764j8776l653q123j3962
18594A38687R596j978N383O673o51J414p487K342M5007J2317k8023k0159j661
18581A61460K2685P173J514j9510l3236J4207J3732J732k373j7649p485r135K936
18568A36051K6902R425o405P366k2160K0240K8233k8491m0125m238J8352K0786
18556A65936l3067j2451N28L3489p246P134m103O207k509j1130K2002o313l3185
18543A25292M820J8209M450K162J165J9498j2130j4288K7623L6930J7922J8747
18531B50400P014J1368K6696J6788J550k907J4142k7985o553k1180l2907L160
18519B39586j9118J6713J9288K8695K4316K7129Q303J731J7921K0370j2403k3129
$$ plain form
18507 349402 317911 306271 326996 315440 300320 293195 257668 221032 235909 241517 243547 222758
18495 222758 201031 196345 175968 166917 148996 129971 119470 110154 130001 124405 166265 179155
18483 179155 176385 198588 171591 148514 142326 146496 177736 201330 189416 207044 231867 260485
18471 260485 302702 304579 299893 302189 271459 271931 273983 260462 251555 267883 288118 264204 283747
18458 283747 287741 275862 260716 249975 278458 271145 223525 215416 217001 213689 214958 203600 188084
18445 188084 185463 180315 185936 165237 134096 118542 126523 156556 167160 164305 157856 153026 143447
18432 143447 129103 124326 136560 129417 97638 99821 95793 85927 100119 103517 94311 99379 109332
18419 109332 120824 106938 76611 79278 105756 115023 118977 103880 99478 89244 80612 89660 100929
$$ packed form
18507C49402l1491j1640K0725j1556j5120p125l5527l6636J4877N608K030k0789
18495B22758k1727m686k0377r051j7921j9025j0501r316J9847n596M1860J2890
18483A79155k770K2203k6997k3077o188M170L1240K3594j1914J7628K4823K8618
18471B60485M2217J877m686K296l0730M72K052j3521q907J6328K0235k3914J9543
18458B83747L994j1879j5146j0741K8483p313m7620q109J585l312J269j1358j5516
18445A88084k621n148N621k0699l1141j5554P981L0033J0604k855o449m830r579
18432A43447j4344m777J2234p143l1779K183m028r866J4192L398r206N068R953
18419A09332J1492j3886l0327K667K6478R267L954j5097m402j0234q632R048J1269
$$ plain form
18406 100929 124330 128040 113311 125380 158210 159985 124694 111363 138977 146199 115694 105263
18394 105263 113341 131687 126523 154688 194431 170232 144141 139839 138464 136397 161210 187967
18382 187967 182690 144165 124381 130701 99018 95937 105086 131522 108338 91199 87728 87187 73785
18369 73785 93488 78902 74241 101013 121782 95507 94774 90148 81363 98670 143673 162777 166135
18356 166135 153520 168547 192843 186573 187689 221782 277029 311084 288902 241990 224590 236786
18344 236786 250243 251936 257040 284797 272380 274664 267738 286498 260616 221419 195862 185702
18332 185702 174347 185338 194435 197602 194274 193296 202560 226090 210637 201463 207663 204580 201084
18319 201084 184553 173136 199700 209620 202070 158757 112206 135384 182555 209128 208036 201458
$$ packed form
18406A00929K3401L710j4729J2069L2830J775l5291j3331K7614P222l0505j0431
18394A05263Q078J8346n164K8165L9743k4199k6091m302j375k067K4813K6757
18382A87967n277l8525j9784O320l1683l081R149K6436k3184j7139l471n41j3402
18369G3785J9703j4586m661K6772K0769k6275p33m626q785J7307M5003J9104L358
18356A66135j2615J5027K4296o270J116L4093N5247L4055k2182m6912j7400J2196
18344B36786J3457J693N104K7757j2417K284o926J8760k5882l9197k5557j0160
18332A85702j1355J0991R097L167l328r78R264K3530j5453r174O200l083l496
18319B01084j6531j1417K6564R920p550m3313m6551K3178M7171K6573j092o578
$$ plain form
18307 201458 200313 227683 256063 225929 203389 195184 201439 211652 196222 192189 208357 196527
18295 196527 203515 199711 194007 199849 189154 189267 191454 216472 237198 242672 240529 204633 190088
18282 190088 200176 186313 158522 155520 162969 177534 186421 168425 159399 169963 158894 190243
18270 190243 181893 157834 172412 154662 154516 147549 166722 181933 190529 186030 175906 177543 194263
18257 194263 216558 261050 261371 230585 199245 200655 201692 186552 209933 227912 228745 228753 192595
18244 192595 187360 204139 205067 159402 131951 136244 156346 169778 189550 230585 287280 356759
18232 356759 417610 413837 402270 390638 363375 330869 265135 225104 212572 220246 244015 236431
18220 236431 220778 235213 240982 227874 245041 251980 265326 305620 294399 262466 275225 266984
$$ packed form
18307B01458j145K7370K8380l0134k2540q205O255J0213j5430m033J6168j1830
18295A96527O988l804n704N842j0695J13K187K5018K0726N474k143l5896j4545
18282A90088J0088j3863k7791l002P449J4565Q887j7996r026J0564j1069L1349
18270A90243q350k4059J4578j7750j46o967J9173J5211Q596m499j0124J637J6720
18257A94263K2295M4492L21l0786l1340J410J037j5140K3381J7979Q33Ql6158
18244A92595n235J6779R28m5665k7451M293K0102J3432J9772M1035N6695O9479
18232C56759O0851l773j1567j1632k7263l2506o5734m0031j2532P674K3769p584
18220B36431j5653J4435N769j3108J7167O939J3346M0294j1221l1933J2759q241
$$ plain form
18208 266984 261373 290262 290762 274268 245015 258034 278933 276156 246883 262167 285170 319481
18196 319481 337188 332548 334226 382277 433013 462771 502431 481375 421670 384848 340686 316242
18184 316242 321640 289618 291915 278595 270666 313472 331505 303730 281923 242880 212685 209109
18172 209109 238976 258600 248655 266880 272485 274834 261467 238127 228926 249628 252426 245524 229777
18159 229777 214763 228931 239741 272850 292748 305250 305317 303511 291494 301699 322423 336995
18147 336995 345927 384105 398683 388663 390620 411626 398483 465110 560916 627073 680229 747707
18135 747707 804060 812483 803722 831241 860933 945784 1023187 1111028 1187118 1186854 1122976 1072763
18123 1072763 1044323 1024791 1047321 1102988 1205087 1321390 1483319 1667641 1870893 2140125
$$ packed form
18208B66984n611K8889N00j6494k9253J3019K0899k777k9273J5284K3003L4311
18196C19481J7707m640J678M8051N0736K9758L9660k1056n9705l6822m4162k4444
18184C16242N398l2022K297j3320p929M2806J8033k7775k1807l9043l0195l576
18172B09109K9867J9624r945J8225N605K349j3367k3340r201K0702K798o902j5747
18159B29777j5014J4168J0810L3109J9898J2502O7j806j2017J0205K0724J4572
18147C36995Q932L8178J4578j0020J957K1006j3143O6627R5806O6157N3156O7478
18135G47707N6353Q423q761K7519K9692Q4851P7403Q7841P6090k64o3878n0213
18123A072763k8440j9532K2530N5667J02099J16303J61929J84322K03252K69232
$$ plain form
18113 2140125 2519662 3069843 3933132 5493646 8274867 12566695 18185453 24209499 29104233
18104 29104233 32504061 32954760 26697220 16847341 10928582 7958331 6327213 5331166
18096 5331166 4616413 4087125 3690083 3384212 3155982 3014027 2921808 2824734 2739867 2668021
18086 2668021 2581164 2505020 2439852 2379973 2323515 2290309 2221387 2175445 2143248 2157508 2125511
18075 2125511 2139966 2182741 2212009 2194064 2132368 2028106 1917395 1777115 1671591 1608912
18065 1608912 1573216 1557855 1524117 1492469 1481187 1458209 1429177 1393052 1380580 1391593 1381874
18054 1381874 1396561 1403255 1388987 1367203 1369866 1331894 1284578 1262591 1288047 1307299 1337861 1352344
18042 1352344 1375853 1393857 1424528 1445959 1468560 1513119 1562213 1627653 1688907 1781630 1887087
$$ packed form
18113B140125L79537N50181Q63289J560514K781221M291828N618758O024046M894734
18104B9104233L399828M50699o257540r849879n918759k970251j631118r96047
18096E331166p14753n29288l97042l05871k28230j41955r2219r7074q4867p1846
18086B668021q6857p6144o5168n9879n6458l3206o8922m5942l2197J4260l1997
18075B125511J4455M2775K9268j7945o1696j04262j10711j40280j05524o2679
18065A608912l5696j5361l3738l1648j1282k2978k9032l6125j2472J1013r719
18054A381874J4687O694j4268k1784K663l7972m7316k1987K5456J9252L0562J4483
18042A352344K3509J8004L0671K1431K2601M4559M9094O5440O1254R2723J05457
$$ plain form
18031 1887087 2050611 2238558 2472456 2748799 3047653 3364509 3767331 4266469 4948489
18022 4948489 5877553 7075306 8370347 9603764 10569618 11054059 10883955 10188476 9668755
18013 9668755 9717084 10221857 11181927 12679565 15020451 18614366 24186331 32352524 43178378
18004 43178378 55839047 68476606 79189217 85538015 84052703 74347097 62224618
17997 62224618 51137977 41812215 34939593 30804704 28874507 28539732 29290725 30481691
17989 30481691 31377953 31439131 30084256 27003455 23046717 19547077 17000643 15234623
17981 15234623 14022837 13185019 12535462 12024741 11581227 11190578 10845433 10584415 10422781
17972 10422781 10279078 10238295 10276365 10385481 10597194 10906991 11389293 12250900 13615803
$$ packed form
18031A887087J63524J87947K33898K76343K98854L16856M02822M99138O82020
18022D948489R29064J197753J295041J233417R65854M84441j70104o95479n19721
18013I668755M8329N04773R60070J497638K340886L593915N571965Q166193J0825854
18004D3178378J2660669J2637559J0712611O348798j485312r705606j2122479
17997F2224618j1086641r325762o872622m134889j930197l34775P50993J190966
17989C0481691Q96262O1178j354875l080801l956738l499640k546434j766020
17981A5234623j211786q37818o49557n10721m43514l90649l45145k61018j61634
17972A0422781j43703m0783L8070J09116K11713L09797M82302Q61607J364903
$$ plain form
17963 13615803 15571776 18159294 21205789 24307681 27021035 28837395 29217035 28135469
17955 28135469 26742983 26386752 27754556 31149285 36748834 44519431 54119539 64595410
17947 64595410 74027362 79887156 80933103 76861065 66968433 52550785 39850453 31393771
17939 31393771 26076368 22628079 20288956 18651227 17516232 16839464 16562210 16618419 16878631
17930 16878631 17111584 17162493 16853613 15972901 14498734 12944326 11770333 10916284 10250253
17921 10250253 9692837 9215237 8767428 8369957 8020424 7724550 7430951 7167891 6942209
17912 6942209 6704578 6483136 6333076 6199617 6023159 5869598 5751062 5615956 5472189
17903 5472189 5345360 5204689 5065105 4942450 4828751 4741282 4645684 4525422 4439975 4387905
$$ packed form
17963A3615803J955973K587518L046495L101892K713354J816360L79640j081566
17955B8135469j392486l56231J367804L394729N599549P770597R600108J0475871
17947F4595410R431952N859794J045947m072038r892632j4417648j2700332q456682
17939C1393771n317403l448289k339123j637729j134995o76768k77254N6209K60212
17930A6878631K32953N0909l08880q80712j474167j554408j173993q54049o66031
17921A0250253n57416m77600m47809l97471l49533k95874k93599k63060k25682
17912F942209k37631k21442j50060j33459j76458j53561j18536j35106j43767
17903E472189j26829j40671j39584j22655j13699q7469r5598j20262q5447n2070
$$ plain form
17893 4387905 4309470 4239644 4161529 4086429 4000672 3873121 3804997 3761972 3737456 3672711 3605605
17882 3605605 3566957 3542259 3553448 3625382 3718088 3784197 3847601 3860207 3824880 3773370 3698837
17871 3698837 3542648 3388090 3289588 3200232 3095898 3048005 3030473 3022845 3018804 3022057 3024801
17860 3024801 3045441 3044809 2965391 2931336 2954197 2994986 3029857 3061070 3087961 3144824 3247544
17849 3247544 3356125 3451369 3568583 3688953 3831748 4018372 4258662 4569247 4898330 5264552
17839 5264552 5705992 6233303 6856546 7605588 8467291 9498324 10563914 11615652 12655402
17830 12655402 13609442 14438058 15114400 15591257 15853995 15952134 15868977 15581818 15156803 14578405
17820 14578405 13876248 13129320 12364109 11659183 11054569 10567941 10203737 9955782 9807570
$$ packed form
17893D387905p8435o9826p8115p5100q5757j27551o8124m3025k4516o4745o7106
17882C605605l8648k4698J1189P1934R2706O6109O3404J2606l5327n1510p4533
17871C698837j56189j54558r8502q9356j04334m7893j7532p628m041L253K744
17860C024801K0640o32p9418l4055K2861M0789L4871L1213K6891N6863J02720
17849C247544J08581R5244J17214J20370J42795J86624K40290L10585L29083L66222
17839E264552M41440N27311O23243P49042Q61703J031033J065590J051738J039750
17830A2655402R54040Q28616O76342M76857K62738R8139q3157k87159m25015n78398
17820A4578405p02157p46928p65211p04926o04614m86628l64204k47955j48212
$$ plain form
17811 9807570 9746829 9768058 9895826 10136008 10472718 10944190 11512814 12199953 12985804 13815044
17801 13815044 14727580 15604003 16464379 17236605 17829857 18286647 18654271 18858254 18884669
17792 18884669 18810437 18679922 18526010 18380021 18295563 18280360 18404750 18615688 18827069 18964385
17782 18964385 19041081 19013446 18871666 18580925 18113463 17483326 16751540 15925781 15053091 14228029
17772 14228029 13462920 12759887 12172347 11665654 11249870 10967776 10760557 10642994 10618936
17763 10618936 10682496 10824944 11062250 11385446 11840081 12369047 12932213 13597535 14292766
17754 14292766 14932607 15492964 15952953 16263972 16370713 16295445 16021033 15610412 15059068
17745 15059068 14340395 13493945 12592370 11740096 10906770 10154469 9522050 9018570 8518906
$$ packed form
17811I807570o0741K1229J27768K40182L36710M71472N68624O87139P85851Q29240
17801A3815044R12536Q76423Q60376P72226N93252M56790L67624K03983K6415
17792A8884669p4232j30515j53912j45989q4458j5203J24390K10938K11381J37316
17782A8964385P6696k7635j41780k90741m67462o30137p31786q25759q72690q25062
17772A4228029p65109p03033n87540n06693m15784k82094k07219j17563k4058
17763A0618936O3560J42448K37306L23196M54635N28966N63166O65322O95231
17754A4292766O39841N60357M59989L11019J06741p5268k74412m10621n51344
17745A5059068p18673q46450r01575q52274q33326p52301o32419n03480m99664
$$ plain form
17736 8518906 8078891 7750312 7448689 7231469 7029379 6845492 6719983 6622293 6544121 6469094
17726 6469094 6438371 6407255 6401961 6437397 6479806 6510767 6565448 6652335 6752317 6861719 7007788
17715 7007788 7206152 7435177 7696581 8003421 8282791 8588973 8965516 9396840 9829979
17706 9829979 10303500 10852530 11452691 12073308 12687473 13340879 14036890 14697736 15332925
17697 15332925 15923619 16461161 16957615 17395659 17704898 17892982 18001589 18024500 17905313
17688 17905313 17671778 17342039 16942678 16489458 15961853 15434651 14910027 14344323 13773937
17679 13773937 13251595 12771278 12300395 11886352 11498885 11154703 10847090 10548377 10285368
17670 10285368 10057737 9891784 9748683 9662127 9570575 9510342 9482263 9498478 9524546 9619131
$$ packed form
17736H518906m40015l28579l01623k17220k02090j83887j25509r7690p8172p5027
17726F469094l0723l1116n294L5436M2409L0961N4681Q6887R9982J09402J46069
17715G007788J98364K29025K61404L06840K79370L06182L76543M31324M33139
17706I829979M73521N49030O00161O20617O14165O53406O96011O60846O35189
17697A5332925N90694N37542M96454M38044L09239J88084J08607K2911j19187
17688A7905313k33535l29739l99361m53220n27605n27202n24624n65704n70386
17679A3773937n22342m80317m70883m14043l87467l44182l07613k98713k63009
17670A0285368k27631j65953j43101q6556r1552o0233k8079J6215K6068R4585
$$ plain form
17660 9619131 9754468 9891152 10055702 10255092 10492906 10803050 11153760 11532655 11945999
17651 11945999 12378446 12862119 13383429 13913012 14428138 14944546 15434258 15922648 16337812
17642 16337812 16661133 16897714 17036795 17057777 16989047 16857393 16606960 16261990 15860551 15410557
17632 15410557 14896602 14327246 13709709 13120559 12536149 11960175 11409488 10912416 10464377
17623 10464377 10007461 9532772 9102626 8705700 8355867 8044775 7695634 7359406 7095480
17614 7095480 6824018 6531205 6295790 6097414 5904514 5693423 5478940 5275687 5063995
17605 5063995 4897854 4775128 4667743 4547719 4440506 4315363 4208555 4073826 3969607
17596 3969607 3915397 3836862 3725851 3620159 3533281 3446925 3381622 3303344 3232616 3136638 3077183
$$ packed form
17660I619131J35337J36684J64550J99390K37814L10144L50710L78895M13344
17651A1945999M32447M83673N21310N29583N15126N16408M89712M88390M15164
17642A6337812L23321K36581J39081K0982o8730j31654k50433l44970m01439m49994
17632A5410557n13955n69356o17537n89150n84410n75974n50687m97072m48039
17623A0464377m56916m74689m30146l96926l49833l11092l49141l36228k63926
17614G095480k71462k92813k35415j98376j92900k11091k14483k03253k11692
17605E063995j66141j22726j07385j20024j07213j25143j06808j34729j04219
17596C969607n4210p8535j11011j05692q6878q6356o5303p8278p0728r5978n9455
$$ plain form
17585 3077183 3028689 2975105 2912711 2861405 2749121 2677044 2606393 2542739 2537378 2531175 2481980
17574 2481980 2433144 2391622 2354772 2337395 2318958 2268140 2237619 2223665 2207758 2151362 2096160
17563 2096160 2002508 1930274 1913960 1910264 1901464 1904976 1868543 1810563 1783369 1731631 1657518 1605337
17551 1605337 1578469 1571955 1547135 1523652 1505440 1505039 1520914 1509403 1463156 1390237 1346034 1341244
17539 1341244 1339413 1335829 1316845 1314706 1283127 1220545 1184346 1178258 1195654 1204511 1201638 1172881
17527 1172881 1146329 1115855 1107831 1104033 1081036 1086196 1121995 1084947 1078150 1089596 1083012 1070769
17515 1070769 1087239 1069955 1065875 1035391 993297 963372 921067 898637 929591 952955 944764 939647
17503 939647 914912 898265 902343 918605 899460 864958 848165 845745 837156 836732 830059 822141 837180
$$ packed form
17585C077183m8494n3584o2394n1306j12284p2077p0651o3654n361o203m9195
17574B481980m8836m1522l6850j7377j8437n0818l0521j3954j5907n6396n5202
17563B096160r3652p2234j6314l696q800L512l6433n7980k7194n1738p4113n2181
17551A605337k6868o514k4820k3483j8212m01J5875j1511m6247p2919m4203m790
17539A341244j831l584j8984k139l1579o2582l6199o088J7396Q857k873k8757
17527A172881k6552l0474q024l798k2997N160L5799l7048o797J1446o584j2243
17515A070769J6470j7284m080l0484m2094k9925m2305k2430L0954K3364q191n117
17503I39647k4735j6647M078J6262j9145l4502j6793k420q589m24o673p918J5039
$$ plain form
17490 837180 852519 878561 897012 915545 891948 868990 872767 879290 850225 845216 830580 810971
17478 810971 806047 813926 833730 842198 822266 820222 796426 760906 707092 659620 650434 656269 639383
17465 639383 615664 604840 600546 579851 572605 600173 614914 608831 632498 599306 552506 571249
17453 571249 558283 533557 510926 491050 493296 514703 493402 474811 478726 495078 536357 571157
17441 571157 630586 691743 759724 788263 782725 797794 756195 712275 716115 702697 671253 633257
17429 633257 587083 565972 558919 533692 520864 538151 556100 561261 567767 578995 594521 605300
17417 605300 584930 572020 572628 581679 561456 532123 504095 468050 465530 429339 385868 378722
17405 378722 363870 365177 369611 374891 388457 401407 387875 343208 307620 285103 307382 339701
$$ packed form
17490H37180J5339K6042J8451J8533k3597k2958L777O523k9065n009j4636j9609
17478H10971m924P879J9804Q468j9932k044k3796l5520n3814m7472r186N835j6886
17465F39383k3719j0824m294k0695p246K7568J4741o083K3667l3192m6800J8743
17453E71249j2966k4726k2631j9876K246K1407k1301j8591L915J6352M1279L4800
17441E71157N9429O1157O7981K8539n538J5069m1599m3920L840j3418l1444l7996
17429F33257m6174k1111p053k5227j2828J7287J7949N161O506J1228J5526J0779
17417F05300k0370j2910O08R051k0223k9333k8028l6045k520l6191m3471p146
17405C78722j4852J307M434N280J3566J2950j3532m4667l5588k2517K2279L2319
$$ plain form
17393 339701 332868 296903 262654 258104 255476 265262 249036 261087 275243 263546 268826 271880 290456
17380 290456 321931 325391 352625 345286 328947 290711 244579 223300 234288 254629 257289 285592
17368 285592 262907 252529 284874 320231 276863 239754 227581 231966 268408 262963 241644 223491
17356 223491 213672 204104 230127 261185 261187 215292 186803 194608 187926 209457 217152 216604 172881 167483
17342 167483 157558 160358 173313 164498 175399 195807 170164 185255 174020 133365 139068 144391
17330 144391 163014 153713 202695 194520 194540 194039 173537 170362 172131 170598 152089 125471 108357
17317 108357 144327 180519 182108 167769 157999 150094 163931 181596 193876 217584 248717 221916
17305 221916 184830 182653 205197 233193 227978 212214 222908 253857 263075 238315 231800 206943
$$ packed form
17393C39701o833l5965l4249m550k628R786j6226J2051J4156j1697N280L054J8576
17380B90456L1475L460K7234p339j6339l8236m6132k1279J0988K0341K660K8303
17368B85592k2685j0378L2345L5357m3368l7109j2173M385L6442n445k1319j8153
17356B23491r819r568K6023L1058Km5895k8489P805o682K1531P695n48m3723n398
17342A67483r925K800J2955q815J0901K0408k5643J5091j1235m0655N703N323
17330A44391J8623r301M8982q175K0n01k0502l175J769j533j8509k6618j7114
17317A08357L5970L6192J589j4339r770p905J3837J7665J2280K3708L1133k6801
17305B21916l7086k177K2544K7996n215j5764J0694L0949R218k4760o515k4857
$$ plain form
17293 206943 194532 193764 197228 216499 243440 237697 214094 223380 202405 187614 188147 200429 228197
17280 228197 239171 235466 195971 150231 169206 173450 161999 150351 173814 191521 219346 234737
17268 234737 231536 217040 204238 220426 247829 226537 192263 184971 192890 187297 170804 186155
17256 186155 176162 178376 190639 191007 228938 252615 230393 243458 230060 217346 204166 189327
17244 189327 182024 194642 179160 142232 126953 143819 161701 180885 187004 216008 215142 204192
17232 204192 221082 217737 204809 189548 214056 242680 219369 175520 143716 138687 156647 185056
17220 185056 198187 194098 170220 140049 81252 94197 98087 108001 141060 177598 170198 151677
17208 151677 151540 154565 146855 137064 120623 96189 107850 130373 130479 132087 140334 121814 95364
$$ packed form
17293B06943j2411p68L464J9271K6941n743k3603R286k0975j4791N33J2282K7768
17280B28197J0974l705l9495m5740J8975M244j1451j1648K3463J7707K7825J5391
17268B34737l201j4496j2802J6188K7403k1292l4274p292P919n593j6493J5351
17256A86155r993K214J2263L68L7931K3677k2222J3065j3398j2714j3180j4839
17244A89327p303J2618j5482l6928j5279J6866J7882J9184O119K9004q66j0950
17232B04192J6890l345j2928j5261K4508K8624k3311m3849l1804n029J7960K8409
17220A85056J3131m089k3878l0171n8797J2945L890R914L3059L6538p400j8521
17208A51677j37L025p710r791j6441k4434J1661K2523J06J608Q247j8520k6450
$$ plain form
17195 95364 108835 121879 121060 114018 123660 115222 110619 97853 129373 117116 102539 95668 120440
17182 120440 136383 128069 121762 122803 95920 80528 90760 129812 132440 157627 174286 176009
17170 176009 188084 201365 194518 203012 202030 204264 173089 153017 178776 171959 166142 179664 183201
17157 183201 203450 197544 196224 223953 232024 197857 144489 151645 149771 115255 93678 97540 91764
17144 91764 107368 151456 149077 106856 79740 100017 130476 139257 127246 109584 107048 116479
17132 116479 142129 133080 124063 126226 125001 122882 104731 81670 90310 129394 137817 123456 142424
17119 142424 149424 145766 130875 134411 159375 165386 172214 167860 192167 202996 160295 135173 152063
17106 152063 174094 178260 167956 185816 199643 206058 190164 148890 146341 180304 172157 151311
$$ packed form
17195I5364J3471J3044q19p042R642q438m603j2766L1520j2257j4577o871K4772
17182A20440J5943q314o307J041k6883j5392J0232L9052K628K5187J6659J723
17170A76009J2075J3281o847Q494r82K234l1175k0072K5759o817n817J3522L537
17157A83201K0249n906j320K7729Q071l4167n3368P156j874l4516k1577L862n776
17144I1764J5604M4088k379m2221k7116K0277L0459Q781j2011j7662k536R431
17132A16479K5650r049r017K163j225k119j8151k3061Q640L9084Q423j4361J8968
17119A42424P000l658j4891L536K4964O011O828m354K4307J0829m2701k5122J6890
17106A52063K2031M166j0304J7860J3827O415j5894m1274k549L3963q147k0846
$$ plain form
17094 151311 98599 48258 65752 96585 105960 109957 79207 83175 90281 80300 76757 104096 135174
17081 135174 141589 87916 83928 126840 124800 96863 94151 127457 139223 123315 104772 110862
17069 110862 134178 115231 40722 35977 58576 70296 81051 84448 115250 139356 130414 116910
17057 116910 125574 156837 149740 123376 108494 70793 49475 46294 62242 76238 70197 70496 77277
17044 77277 79302 70017 35721 30568 44303 42210 67224 63100 54635 73843 94316 88565 96073
17031 96073 91809 69213 62821 39609 46083 66875 42166 16372 28086 38053 38333 6043 13962
17018 13962 36278 68530 98557 111712 125830 103043 76999 67238 55936 40315 635 -1533
17006 -1533 50814 61927 40665 -3301 -6748 23620 36581 42735 60348 54932 41584 29163
$$ packed form
17094A51311n2712n0341J7494L0833R375L997l0750L968P106r981l543K7339L1078
17081A35174O415n3673l988M2912k040k7937k712L3306J1766j5908j8543O090
17069A10862K3316j8947p4509m745K2599J1720J0755L397L0802K4106q942j3504
17057A16910Q664L1263p097k6364j4882l7701k1318l181J5948J3996o041K99O781
17044G7277K025r285l4296n153J3735k093K5014m124q465J9208K0473n751P508
17031I6073m264k2596o392k3212O474K0792k4709k5794J1714R967K80l2290P919
17018A3962K2316L2252L0027J3155J4118k2787k6044r761j1302j5621l9680k168
17006a533N2347J1113k1262m3966l447L0368J2961O154J7613n416j3348j2421
$$ plain form
16994 29163 34561 34657 57778 51311 26357 31475 41354 49993 35481 29667 -1387 -12515 3916
16981 3916 40167 73099 59749 59620 57921 89698 71584 46592 47957 32035 66440 104450 81501
16968 81501 57685 58631 41760 24722 26047 18321 -12228 -470 28396 53851 68217 55150
16956 55150 60411 68551 61112 56045 64104 121673 111623 80767 79580 51185 24573 26775 27143
16943 27143 27987 37756 45557 74291 71066 74488 76743 48883 25587 25392 34739 50576 35416 58768
16929 58768 50342 31013 40711 44987 53667 45013 36842 71494 94572 81232 53168 32437 793
16916 793 11223 64312 70672 42573 39915 83984 82597 65347 57788 54372 7300 -3661 18407
16903 18407 16141 -13356 -35797 -10531 7773 13605 21107 42216 47629 33029 23337 -6393 16132
$$ packed form
16994B9163N398R6K3121o467k4954N118R879Q639j4512n814l1054j1128J6431
16981C916L6251L2932j3350j29j699L1777j8114k4992J365j5922L4405L8010k2949
16968H1501k3816R46j6871j7038J325p726l0549J1758K8866K5455J4366j3067
16956E5150N261Q140p439n067Q059N7569j0050l0856j187k8395k6612K202L68
16943B7143Q44R769P801K8734l225L422K255k7860k3296j95R347J5837j5160K3352
16929E8768q426j9329R698M276Q680q654q171L4652K3078j3340k8064k0731l1644
16916G93J0430N3089O360k8099k658M4069j387j7250p559l416m7072j0961K2068
16903A8407k266k9497k2441K5266J8304N832P502K1109N413j4600r692k9730K2525
$$ plain form
16890 16132 17921 22907 69221 85220 90468 85951 71314 80725 78807 49946 29129 36626 58961
16877 58961 93768 73034 41725 19051 -8498 -10846 9723 43669 55780 60125 -2480 6113
16865 6113 32091 48260 83296 87295 87501 73350 40877 31212 33659 67306 50142 27916 11599
16852 11599 42576 58125 36581 46498 76515 62880 48336 41313 51573 43731 35220 19508
16840 19508 8000 18871 33110 45919 43591 40608 51480 51546 55894 40031 22063 35784 27324
16827 27324 6813 29197 41445 54524 51107 36225 16161 7071 344 3060 17941 32102
16815 32102 24980 -22104 -28789 -22696 -4985 24768 31816 52974 46423 52213 45352 25928 74445
16802 74445 86186 74933 72536 57661 67949 68108 44708 55766 54689 61343 77875 72610 68555
$$ packed form
16890A6132J789M986M6314J5999N248m517j4637R411j918k8861k0817P497K2335
16877E8961L4807k0734l1309k2674k7549k348K0569L3946J2111M345o2605Q593
16865F113K5978J6169L5036L999K06j4151l2473r665K447L3647j7164k2226j6317
16852A1599L0977J5549k1544R917L0017j3635j4544p023J0260p842q511j5712
16840A9508j1508J0871J4239J2809k328k983J0872O6M348j5863j7968J3721q460
16827B7324k0511K2384J2248J3079l417j4882k0064r090o727K716J4881J4161
16815C2102p122m7084o685O093J7711K9753P048K1158o551N790o861j9424M8517
16802G4445J1741j1253k397j4875J0288J59k3400J1058j077O654J6532n265m055
$$ plain form
16789 68555 45053 33536 28917 40733 41743 19462 13936 15974 10448 8739 43152 73787 51401
16776 51401 62419 99790 105952 89198 50234 39287 58243 63606 43886 37911 52911 53732 61238
16763 61238 55852 42569 53509 55427 61414 70676 62831 52979 47671 48774 8563 -1120 21217
16750 21217 21473 4906 28549 39188 29807 40024 26623 31394 59096 46869 40136 32461 8935
16737 8935 26892 67789 41932 26704 14943 40712 2546 -23485 -10678 -26545 -39159 -34511
16725 -34511 -20352 -16440 10303 22733 4187 4957 -8007 26310 47816 58331 75444 85729
16713 85729 61879 23201 19810 10861 22944 27050 -8273 -8832 2883 20150 28324 10827 17224
16700 17224 31836 18609 4922 -34371 -33075 -22127 -16401 15036 45808 53867 48238 38384 35181
$$ packed form
16789F8555k3502j1517m619J1816J010k2281n526K038n526j709L4413L0635k2386
16776E1401J1018L7371O162j6754l8964j0947J8956N363j9720n975J5000Q21P506
16763F1238n386j3283J0940J918N987R262p845r852n308J103m0211r683K2337
16750B1217K56j6567K3643J0639r381J0217j3401M771K7702j2227o733p675k3526
16737H935J7957M0897k5857j5228j1761K5769l8166k6031J2807j5867j2614M648
16725c4511J4159L912K6743J2430j8546P70j2964L4317K1506J0515J7113J0285
16713H5729k3850l8678l391q949J2083M106l5323n59J1715J7267Q174j7497O397
16700A7224J4612j3227j3687l9293J296J0948N726L1437L0772Q059n629r854l203
$$ plain form
16687 35181 34660 21264 19943 20640 19915 28781 19168 4462 661 -22497 -47138 -40233 12284 35447
16673 35447 19121 27480 12738 3825 10196 -7568 -4721 5109 15970 9604 17065 3326 -3084
16660 -3084 -12274 4546 -6274 4833 8376 10671 28470 39597 27012 27105 21301 13399 13345 23970
16646 23970 51809 32238 21565 30038 31937 53605 84566 78916 40042 2146 17067 7259
16634 7259 -4853 -4735 39403 40175 36842 9443 -12676 -1710 -6620 -18768 -7127 -19163 -3529
16621 -3529 22194 14204 32873 42720 65584 22160 12237 34296 -2342 6168 17766 -622 -1601
16608 -1601 24043 33156 26063 36403 50007 66084 72657 59859 47007 45966 40308 24455 41988
16595 41988 50627 75338 80552 81050 48745 6074 -8026 -7019 -6107 -16403 -25176 -11565 940
$$ packed form
16687C5181n21j3396j321O97p25Q866r613j4706l801k3158k4641O905N2517K3163
16673C5447j6326Q359j4742q913O371j7764K847R830J0861o366P461j3739o410
16660c084r190J6820j0820J1107L543K295J7799J1127j2585R3n804p902n4J0625
16646B3970K7839j9571j0673Q473J899K1668L0961n650l8874l7896J4921r808
16634G259j2112J18M4138P72l333k7399k2119J0966m910j2148J1641j2036J5634
16621c529K5723p990J8669R847K2864m3424r923K2059l6638Q510J1598j8388r79
16608a601K5644R113p093J0340J3604J6077O573j2798j2852j041n658j5853J7533
16595D1988Q639K4711N214M98l2305m2671j4100J007R12j0296q773J3611J2505
$$ plain form
16582 940 -17754 -10794 -13298 -22989 -10037 -9749 7810 41381 47346 20115 -13997 -28531 -14871
16569 -14871 2460 14687 30901 55611 50240 8217 4545 1969 -1457 28859 45556 29780
16557 29780 19114 -9295 -1613 16431 -14844 6194 51646 51230 58953 54427 68842 67385 62634
16544 62634 28078 1074 3768 1573 -1862 -11785 -4643 8461 27263 25206 17048 -9203 3167
16531 3167 10700 13570 38263 71616 58623 38755 25073 26078 37613 30040 51599 47352 31185
16518 31185 5686 1169 11228 9490 10219 21904 -3916 -22047 4879 40002 35483 41669 41642
16505 41642 23167 16555 -1281 -16026 2624 9650 10370 23544 39001 41412 36224 36636 21300
16492 21300 26129 61052 57931 33787 -542 -28227 -18810 15559 56526 44950 35922 18976
$$ packed form
16582I40j8694O960k504r691J2952K88J7559L3571N965k7231l4112j4534J3660
16569a4871J7331J2227J6214K4710n371m2023l672k576l426L0316J6697j5776
16557B9780j0666k8409P682J8044l1275K1038M5452m16P723m526J4415j457m751
16544F2634l4556k7004K694k195l435r923P142J3104J8802k057q158k6251J2370
16531C167P533K870K4693L3353j2993j9868j3682J005J1535p573K1559m247j6167
16518C1185k5499m517J0059j738P29J1685k5820j8131K6926L5123m519O186k7
16505D1642j8475o612j7836j4745J8650P026P20J3174J5457K411n188M12j5336
16492B1300M829L4923l121k4144l4329k7685R417L4369M0967j1576r028j6946
$$ plain form
16480 18976 35155 44209 38313 32325 14256 3039 19469 39047 41438 18598 17516 20963 4683
16467 4683 24326 45957 36843 41367 51630 66040 84336 97992 97770 74122 43774 23856 27026
16454 27026 20492 28928 48444 22515 -10439 17253 46717 49652 60167 61796 49099 46662 35602
16441 35602 30905 16408 19264 27267 23068 8741 27217 52677 28171 3806 8515 16264 15514
16428 15514 -13227 -28845 5394 20159 23756 19639 9740 13827 30975 43002 62752 72219 70490
16415 70490 62852 46961 27216 23187 62518 69413 66341 78872 52581 -5448 -17784 613
16403 613 -8441 4827 45019 40938 12151 -8229 4815 12135 20883 23026 30480 24876 41629
16390 41629 61111 40521 39057 29192 13035 19576 -1232 -22759 -11160 7590 -8066 -29055
$$ packed form
16480A8976J6179R054n896n988j8069j1217J6430J9578K391k2840j082L447j6280
16467D683J9643K1631r114M524J0263J4410J8296J3656k22k3648l0348j9918L170
16454B7026o534Q436J9516k5929l2954K7692K9464K935J0515J629j2697k437j1060
16441C5602m697j4497K856Q003m199j4327J8476K5460k4506k4365M709P749p50
16428A5514k8741j5618L4239J4765L597m117r899M087J7148J2027J9750R467j729
16415G0490p638j5891j9745m029L9331O895l072J2531k6291n8029j2336J8397
16403F13r054J3268M0192m081k8787k0380J3044P320Q748K143P454n604J6753
16390D1629J9482k0590j464r865j6157O541k0808k1527J1599J8750j5656k0989
$$ plain form
16378 -29055 -16413 -4750 -15955 3042 1925 -20387 -8784 10920 8376 20242 29568 58937
16366 58937 64482 26316 8236 25852 29859 -10075 -22443 -21158 -17212 27791 17501 7345
16354 7345 9699 25572 26586 30634 55029 35652 11099 1634 10407 40637 41599 36272 33418 26806
16340 26806 17316 32550 1526 9760 7356 42808 60396 76681 61885 9215 -18786 -14754
16328 -14754 -13750 -11395 -10819 -22536 -51643 -56966 -25075 17587 11391 -2307 -849 8466 31230
16315 31230 38236 -10148 -26770 6698 1729 -24928 -24618 13595 34265 37363 42689 30453 23336
16302 23336 21476 2558 -6225 4321 5591 3416 -26562 -40742 -6997 30827 51787 74787
16290 74787 67293 41001 40389 28086 6227 -9951 2846 -5992 -28839 -15853 -5113 -25154
$$ packed form
16378b9055J2642J1663j1205J8997j117k2312J1603J9704k544J1866R326K9369
16366E8937N545l8166j8080J7616M007l9934j2368J285L946M5003j0290j0156
16354G345K354J5873J014M048K4395j9377k4553r465Q773L0230R62n327k854o612
16340B6806r490J5234l1024Q234k404L5452J7588J6285j4796n2670k8001M032
16328a4754J004K355N76j1717k9107n323L1891M2662o196j3698J458R315K2764
16315C1230P006m8384j6622L3468m969k6657L10L8213K0670L098N326j2236p117
16302B3336j860j8918q783J0546J270k175k9978j4180L3745L7824K0960K3000
16290G4787p494k6292o12j2303k1859j6178J2797q838k2847J2986J0740k0041
$$ plain form
16278 -25154 -1775 14720 16787 27223 25135 10475 7274 -3285 -15696 -16862 -6539 20599
16266 20599 8974 -12232 -3024 -7271 -36310 -39259 -24923 -32622 1266 52212 21952 7750
16254 7750 647 15397 36794 37520 27690 16090 41820 58318 94885 93630 79640 85071 69722
16241 69722 56881 8912 -8707 -775 -7474 19807 11717 15734 6745 16147 39812 53679 33856
16228 33856 21867 30679 17264 33992 12302 -23199 12395 19176 4561 13735 17194 28585
16216 28585 19022 50180 34663 17572 37230 -4332 -15757 15686 44244 39782 44662 34115
16204 34115 44033 62422 50158 36635 46229 35891 2495 -14598 11029 35131 45117 27991
16192 27991 73446 85960 61292 54874 47372 50473 53335 13237 -22308 -13101 4109 13031 13618
$$ packed form
16278b5154K3379J6495K067J0436k088j4660l201j0559j2411j166J0323K7138
16266B0599j1625k1206R208m247k9039k949J4336p699L3888N0946l0260j4202
16254G750p103J4750K1397P26r830j1600K5730J6498L6567j255j3990N431j5349
16241F9722j2841m7969j7619P932o699K7281q090M017q989R402K3665J3867j9823
16228C3856j1989Q812j3415J6728k1690l5501L5594O781j4615R174L459J1391
16216B8585r563L1158j5517j7091J9658m1562j1425L1443K8558m462M880j0547
16204C4115R918J8389j2264j3523R594j0338l3396j7093K5627K4102R986j7126
16192B7991M5455J2514k4668o418p502L101K862m0098l5545R207J7210Q922N87
$$ plain form
16179 13618 732 -5596 -15898 -32722 21909 51355 48035 36343 -1786 -7473 10481 29881
16167 29881 13581 -11761 -2101 29571 24092 24371 7722 -13417 -54361 -25685 -35742 -49213
16155 -49213 -2923 19 11090 -8316 9220 46929 70800 72199 58224 23895 -4552 -4081
16143 -4081 -13760 -13098 -3069 832 -9096 -25227 -21461 -18874 -19998 -24245 -29911 -9364 4541 -7730
16129 -7730 -4767 -7750 5042 -4168 -6804 -2 2145 -10573 -43088 -37392 -27653 -48715 -28569
16116 -28569 15087 -9294 -51489 -58651 -56562 -59778 -55921 -36932 -19391 -22186 -15443 -13016 686
16103 686 6834 4936 9276 -15658 -28092 -35827 -664 -165 -9256 -7923 16911 33702 35978 11601
16089 11601 -10156 4183 30315 6793 -34862 -40788 -29985 -21071 10720 7324 5478 20891
$$ packed form
16179A3618j2886o328j0302j6824N4631K9446l320j1692l8129n687J7954J9400
16167B9881j6300k5342R660L1672n479K79j6649k1139m0944K8676j0057j3471
16155d9213M6290K942J1071j9406J7536L7709K3871J399j3975l4329k8447M71
16143d081r679O62J0029L901r928j6131L766K587j124m247n666K0547J3905j2271
16129g730K963k983J2792r210k636O802K147j2718l2515N696R739k1062K0146
16116b8569M3656k4381m2195p162K089l216L857J8989J7541k795O743K427J3702
16103F86O148j898M340k4934j2434p735L5163M99r091J333K4834J6791K276k4377
16089A1601k1757J4339K6132k3522m1655n926J0803Q914L1791l396j846J5413
$$ plain form
16077 20891 22339 19693 1490 1525 21615 -13350 -3865 -746 -19876 -22292 -17895 -14654 -16266 -33284
16063 -33284 -30151 -20755 -46011 -48478 -22524 -6349 7273 8843 -12927 7770 18819 18221 34578
16050 34578 38655 21259 -31030 -40207 -35174 -23286 13481 -628 -2139 -21356 -11992 8908 26705
16037 26705 22963 23877 32792 45977 3202 -21073 1927 21196 19512 10224 -1512 11477 33582
16024 33582 31903 37080 10796 -797 903 8745 30969 46735 32929 -4258 1056 -10930 -4793
16011 -4793 22233 754 -22378 -5101 -33894 -55448 -32699 -10884 -4881 -25896 4362 23119
15999 23119 7845 -36938 -65802 -62379 -27291 -27526 -15583 -21123 -34358 -31931 -31905 -13615 15182
15986 15182 29272 12506 14295 13837 -7278 -12792 22966 16166 9313 -15420 3001 40779 20717
$$ packed form
16077B0891J448k646j8203L5K0090l4965R485L119j9130k416M397L241j612j7018
16063c3284L133R396k5256k467K5954J6175J3622J570k1770K0697J1049n98J6357
16050C4578M077j7396n2289r177N033J1888L6767j4109j511j9217R364K0900J7797
16037B6705l742R14Q915J3185m2775k4275K3000J9269j684r288j1736J2989K2105
16024C3582j679N177k6284j1593J700P842K2224J5766j3806l7187N314j1986O137
16011d793K7026k1479k3132J7277k8793k1554K2749K1815O003k1015L0258J8757
15999B3119j5274m4783k8864L423L5088k35J1943n540j3235K427K6J8290K8797
15986A5182J4090j6766J789m58k1115n514L5758o800o853k4733J8421L7778k0062
$$ plain form
15973 20717 23218 -1870 -20200 25315 45701 60907 55580 36882 32873 37089 13968 2504
15961 2504 1952 14610 1271 8120 23450 14933 -4545 10219 12323 4131 -14515 -6134 1936
15948 1936 8100 4711 351 -45631 -54812 -30846 -26986 -13186 19394 27632 -8788 -29020 -23463
15935 -23463 25692 48541 31239 58840 71643 70872 53117 58050 62823 73230 49003 14887
15923 14887 12082 36852 75218 72643 10084 -34949 -41693 -29998 -3051 14690 -9930 -30248
15911 -30248 -34834 -20483 -65484 -36974 -14283 -3379 14685 -3700 -12420 -47497 -34763 -29324
15899 -29324 -4855 25973 22166 -10170 -4997 -15484 -4414 -25053 -44238 -27146 -31444 -30855 -28057
15886 -28057 -62419 -35361 -14403 -7596 4680 -17506 3443 11404 15111 28135 1075 -30872
$$ packed form
15973B0717K501k5088j8330M5515K0386J5206n327j8698m009M216k3121j1464
15961B504n52J2658j3339O849J5330q517j9478J4764K104q192j8646Q381Q070
15948A936O164l389m360m5982r181K3966L860J3800L2580Q238l6420k0232N557
15935b3463M9155K2849j7302K7601J2803p71j7755M933M773J0407k4227l4116
15923A4887k805K4770L8366k575o2559m5033o744J1695K6947J7741k4620k0318
15911c0248m586J4351m5001K8510K2691J0904J8064j8385q720l5077J2734N439
15899b9324K4469L0828l807l2336N173j0487J1070k0639j9185J7092m298N89K798
15886b8057l4362K7058K0958O807J2276k2186K0949P961L707J3024k7060l1947
$$ plain form
15874 -30872 -31323 -13935 -17028 -19195 -1824 -9739 -12854 6471 19037 6107 -3449 -41488 -50764
15861 -50764 -58818 -46235 -21159 -5551 -9319 11619 11836 -15098 -18778 -50715 -38224 -11316 -12175
15848 -12175 -21945 -15278 -3457 5443 -13889 -20550 -7948 7794 -4309 -53717 -27592 14255
15836 14255 -4745 -24007 -33418 -43473 -64279 -56518 -49162 -53966 -34530 -32002 -32046 -6586 -20899
15823 -20899 -25095 -10991 5997 -570 -30510 -42071 -46915 -45415 -42404 -11918 19965 15366 9766
15810 9766 -13565 -45469 -85567 -72826 -18434 29132 10860 -26091 -26325 -11120 2910 18912
15798 18912 35412 57263 42076 15714 2841 -15573 -32416 -16484 -13933 4774 14710 -13690
15786 -13690 16279 34124 29369 4357 3444 6970 -25723 -41577 -19086 -5263 -622 10961 30457
$$ packed form
15874c0872m51J7388l093k167J7371p915l115J9325J2566j2930r556l8039r276
15861e0764q054J2583K5076J5608l768K0938K17k6934l680l1937J2491K6908q59
15848a2175r770O667J1821Q900j9332o661J2602J5742j2103m9408K6125M1847
15836A4255j9000j9262r411j0055k0806P761P356m804J9436K528m4K5460j4313
15823b0899m196J4104J6988o567k9940j1561m844J500L011L0486L1883m599n600
15810I766k3331l1904m0098J2741N4392M7566j8272l6951k34J5205J4030J6002
15798A8912J6500K1851j5187k6362j2873j8414j6843J5932K551J8707R936k8400
15786a3690K9969J7845m755k5012r13L526l2693j5854K2491J3823M641J1583J9496
$$ plain form
15773 30457 9578 -1227 17885 14925 24470 42283 36854 -11398 -77921 -72687 -31326 -4353
15761 -4353 591 -2913 -7189 -15463 -8308 -21878 -41054 -38757 -2214 -3395 -64757 -71168 -71194 -40195
15747 -40195 -3022 -7288 -29167 -45795 -66706 -42970 -33474 -22156 -3793 -12128 -33340 -14488
15735 -14488 11697 -8899 -22255 -6749 7530 -6096 4711 18360 10764 6109 31585 50309
15723 50309 52783 42999 20026 11584 -8976 4747 25608 23416 28232 23598 -8508 -30867 -14260
15710 -14260 -11110 -26537 -16800 -5089 24233 27490 27230 7170 23682 -21070 -28237 -4479 -1862
15697 -1862 -3192 3367 -17131 -41063 -16388 -16852 -18734 -5853 18365 13813 28054 34021 50129
15684 50129 39571 18813 -1567 -23393 -17313 -11443 -1642 7526 11850 13721 -3442 22623 30281
$$ packed form
15773C0457k0879j0805J9112k960R545J7813n429m8252o6523N234M1361K6973
15761d353M944l504m276q274P155j3570j9176K297L6543j181o1362o411k6L0999
15747d0195L7173m266k1879j6628k0911K3736R496J1318J8363q335k1212J8852
15735a4488K6185k0596j3356J5506J4279j3626J0807J3649p596m655K5476J8724
15723E0309K474r784k2973q442k0560J3723K0861k192M816m634l2106k2359J6607
15710a4260L150j5427R737J1711K9322L257k60k0060J6512m4752p167K3758K617
15697a862j330O559k0498k3932K4675m64j882J2881K4218m552J4241N967J6108
15684E0129j0558k0758k0380k1826O080N870R801R168M324J871j7163K6065P658
$$ plain form
15671 30281 -996 -31064 -29396 -3150 10256 -3189 10121 20482 9583 815 -15499 6088
15659 6088 25455 23295 30776 42655 22207 19443 6490 10233 -15983 -47571 -59361 -61218 -34893
15646 -34893 -16644 -24958 -2586 24 -12430 -34374 -2372 14008 10059 -18341 -11364 -31668
15634 -31668 -53660 -70441 -74645 -76934 -51072 -18353 -30914 -54351 -57951 -46148 -44237 -70341
15622 -70341 -70266 -64704 -59951 -65268 -51204 -37629 -12825 29317 43280 26525 47075 35329 14388
15609 14388 -3829 26027 64338 51801 23350 22694 14833 8564 7464 -21919 -13063 -3503 -7782
15596 -7782 -11204 -19962 -26159 -46273 -31654 -6602 -9388 12386 13431 -5742 -17721 -41218 -20424
15583 -20424 -11872 -3928 10111 2937 -331 -14491 10550 7540 -9862 -22415 -17115 -6163 11775
$$ packed form
15671C0281l1277l0068J668K6246J3406j3445J3310J0361j0899q768j6314K1587
15659F088J9367k160P481J1879k0448k764j2953L743k6216l1588j1790j857K6325
15646c4893J8249q314K2372K610j2454k1944L2002J6380l949k8400O977k0304
15634c1668k1992j6781m204k289K5862L2719j2561k3437l600J1803J911k6104
15622g0341P5N562M753n317J4064J3575K4804M2142J3963j6755K0550j1746k0941
15609A4388j8217K9856L8311j2537k8451o56p861o269j100k9383Q856R560m279
15596g782l422q758o197k0114J4619K5052k786K1774J045j9173j1979k3497K0794
15583b0424Q552P944J4039p174l268j4160K5041l010j7402j2553N300J0952J7938
$$ plain form
15570 11775 -8267 -30680 -5179 10434 14350 24356 37605 44932 44102 45142 18376 -3122 11063
15557 11063 -5107 4492 34606 52651 46497 54120 51542 54020 27798 -1908 14615 29021 -10662
15544 -10662 -14814 -22564 -54609 -61192 -84925 -72609 -65364 -41151 -30998 -28769 -3835 44738 75833
15531 75833 81230 38178 28532 34725 11310 -13669 -19778 -6092 -5473 -13059 -27682 -14649 1530
15518 1530 2489 10748 23187 -5147 -1602 -13316 -44989 -19191 21079 43725 50311 58111 57662
15505 57662 48435 28702 40321 24289 20704 23538 23183 15778 -1734 1915 28498 27121 20161
15492 20161 11974 21969 34459 25843 1763 12501 17169 9250 7523 -297 -12839 -15414 -3196
15479 -3196 -7194 -17092 -28821 -38047 -41126 -33885 -9860 23189 48483 34618 4238 -8948 -12148
$$ packed form
15570A1775k0042k2413K5501J5613L916J0006J3249P327q30J040k6766k1498J4185
15557A1063j6170R599L0114J8045o154P623k578K478k6222k9706J6523J4406l9683
15544a0662m152p750l2045o583k3733J2316P245K4213J0153K229K4934M8573L1095
15531G5833N397m3052r646O193k3415k4979o109J3686O19p586j4623J3033J6179
15518A530R59Q259J2439k8334L545j1714l1673K5798M0270K2646O586P800m49
15505E7662r227j9733J1619j6032l585K834l55p405j7512L649K6583j377o960
15492B0161q187R995J2490q616k4080J0738M668p919j727p820j2542k575J2218
15479c196l998r898j1729r226l079P241K4025L3049K5294j3865l0380j3186l200
$$ plain form
15466 -12148 -13113 13072 11586 -1088 12852 22567 6254 -11882 -10556 -15482 -29973 -33032 -16522
15453 -16522 5053 -14002 -18238 -25243 -52173 -82888 -78903 -46027 -7337 7602 249 -12195
15441 -12195 -1112 -15165 -48328 -32834 -19189 -338 -14309 -46944 -52101 -42009 -8820 -15783
15429 -15783 -38934 -54852 -40895 -30950 -32624 -39287 -30083 -35633 -6604 -5759 -16320 6301 15909
15416 15909 -97 -2899 9741 11414 1476 3327 -4034 32733 50064 58024 31614 33113 31065
15403 31065 15232 -8193 -23124 -4888 68 7375 5058 4523 2325 6947 4811 -26923 -32798
15390 -32798 -33523 -52639 -72893 -53406 -20436 -1724 -19923 -3008 30718 56734 63060 68081
15378 68081 60485 56312 52687 24789 11275 3290 -3071 856 12964 -4954 -28966 -34450 -43528
$$ packed form
15466a2148r65K6185j486j2674J3940R715j6313j8136J326m926j4491l059J6510
15453a6522K1575j9055m236p005k6930l0715L985L2876L8690J4939p353j2444
15441a2195J1083j4053l3163J5494J3645J8851j3971l2635n157J0092L3189o963
15429a5783k3151j5918J3957R945j674o663R204n550K9029Q45j0561K2621R608
15416A5909j6006k802J2640J673r938J851p361L6767J7331P960k6410J499k048
15403C1065j5833k3425j4931J8236M956P307k317n35k198M622k136l1734n875
15390c2798p25j9116k0254J9487L2970J8712j8199J6915L3726K6016O326N021
15378F8081p596m173l625k7898j3514p985o361L927J2108j7918k4012n484r078
$$ plain form
15365 -43528 -34061 13983 7626 -55819 -48711 -22246 -19659 -16843 -6198 -151 11018 33581 35497
15352 35497 20798 29046 46511 14700 9635 3603 -627 -2535 -5592 28878 40862 27076 1026
15339 1026 -267 24140 15210 -2848 17167 29779 29164 21392 18840 -9123 -10130 -5838 -11103 2280
15325 2280 14452 11296 -29837 -10800 6719 12995 20479 14877 -5419 -26022 -11588 -20890 -31759
15312 -31759 -895 14163 55571 50027 18926 -6239 -41412 -59496 -41556 26374 421 -6999
15300 -6999 -10059 -24571 -11135 -7306 22217 46489 36695 15883 22935 -2863 -4059 14515 1730
15287 1730 10062 22481 26339 -2646 7289 -392 2150 50055 43769 39247 70918 73520 46262
15274 46262 38014 46779 28189 43109 71723 63356 26644 28643 34412 5050 -7150 -3071 -8050
$$ packed form
15365d3528R467M8044o357o3445P108K6465K587K816J0645O047J1169K2563J916
15352C5497j4699Q248J7465l1811n065o032m230j908l057L4470J1984j3786k6050
15339A026j293K4407q930j8058K0015J2612o15p772k552k7963j007M292n265J3383
15325B280J2172l156m1133J9037J7519O276P484n602k0296k0603J4434r302j0869
15312c1759L0864J5058M1408n544l1101k5165l5173j8084J7940O7930k5953p420
15300f999l060j4512J3436L829K9523K4272r794k0812P052k5798j196J8574j2785
15287A730Q332J2419L858k8985R935p681K542M7905o286m522L1671K602k7258
15274D6262q248Q765j8590J4920K8614q367l6712J999N769k9362j2200M079m979
$$ plain form
15261 -8050 -3959 -11583 -14074 -2231 -16697 -26064 -1127 7582 7468 3534 6037 16957 6467 -2749
15247 -2749 7591 10053 -27490 -22516 -21499 -30994 -51240 -48559 -19752 7917 -2994 -1975 18662
15234 18662 33668 18637 16921 28025 16318 5960 8053 -28736 -25178 157 7190 1325 -1883
15221 -1883 26014 34120 5204 -45666 -55764 -15332 6991 15320 19443 18683 8410 -11130 -56083
15208 -56083 -42102 755 28630 34438 -2514 10734 37558 36580 19362 17974 26953 49417 14799
15195 14799 -3056 -7094 -8364 -59 -43101 -55859 -40859 -10313 18634 28678 24890 18698 -2118
15182 -2118 3672 -14671 -18561 -2375 8984 -16069 10274 30200 19854 28094 32166 13516 -5253
15169 -5253 3197 -15845 -35688 -43507 -70865 -93269 -83409 -92491 -108754 -75306 -35872 -24068 -34692
$$ packed form
15261h050M091p624k491J1843j4466r367K4937Q709j14l934K503J0920j0490r216
15247b749J0340K462l7543M974J017r495k0246K681K8807K7669j0911J019K0637
15234A8662J5006j5031j716J1104j1707j0358K093l6789L558K5335P033n865l208
15221a883K7897Q106k8916n0870j0098M0432K2323Q329M123p60j0273j9540m4953
15208e6083J3981M2857K7875N808l6952J3248K6824r78j7218j388Q979K2464l4618
15195A4799j7855m038j270Q305m3042j2758J5000L0546K8947J0044l788o192k0816
15182b118N790j8343l890J6186J1359k5053K6343J9926j0346Q240M072j8650j8769
15169e253Q450j9042j9843p819k7358k2404R860r082j6263L3448L9434J1804j0624
$$ plain form
15156 -34692 -29151 -2438 27790 1600 -2216 19693 15131 -30725 -20662 17212 11814 4362 12990
15143 12990 2335 -23573 -7494 -3208 -42176 -39697 19237 47617 16443 -1749 -6446 -2227
15131 -2227 16756 22731 -1970 7184 35374 30251 12481 8353 -499 -5067 -15624 -8637 -2550
15118 -2550 -10641 -6740 11158 12278 -7552 -38156 -28361 -14655 -31540 -17465 1199 -4395 -3011
15105 -3011 19631 20859 -728 2043 -8447 -20568 -20032 -26806 -12996 25618 -1521 -26938 -32788
15092 -32788 -23185 -19358 6683 9367 6895 32415 34185 17424 40726 55739 48114 44746 19944
15079 19944 -8576 -16288 -13693 -12008 6336 -947 12210 19980 7907 -48031 -45638 -9724 -15419
15066 -15419 -20448 -3765 3278 3245 -10193 -13629 4067 12757 -1133 -2615 11797 35622 46329
$$ packed form
15156c4692N541K6713L0228k6190l816K1909m562m5856J0063L7874n398p452Q628
15143A2990j0655k5908J6079M286l8968K479N8934K8380l1174j8192m697M219
15131b227J8983N975k4701R154K8190n123j7770m128q852m568j0557O987O087
15118b550q091L901J7898J120j9830l0604R795J3706j6885J4075J8664n594J384
15105c011K2642J228k1587K771j0490j2121N36o774J3810L8614k7139k5417n850
15092c2788R603L827K6041K684k472K5520J770j6761K3302J5013p625l368k4802
15079A9944k8520p712K595J685J8344p283J3157P770j2073n5938K393L5914n695
15066a5419n029J6683P043l3j3438l436J7696Q690j3890j482J4412K3825J0707
$$ plain form
15053 46329 22985 -12315 -26635 -40164 -37969 -9174 1447 2022 -12651 -11645 25600 21341 3437
15040 3437 -25432 -16736 -598 14700 20116 37511 27148 16557 18741 22364 65650 68582 24384
15027 24384 31554 33682 13381 23489 13395 -4310 18086 53529 38268 15033 -8023 -5133
15015 -5133 10069 -1661 -7840 -4446 2521 13440 19098 23199 -12671 -30426 -13095 -20250 -11373
15002 -11373 25052 56322 71330 85239 146931 221859 382758 593252 845885 1069308 1228015
14991 1228015 1347905 1305253 905649 534619 365829 298290 250815 168743 147906 163111
14981 163111 158612 154078 139304 100705 90136 115954 120408 121781 119161 116961 90286 78755 69498
14968 69498 37903 25085 46066 45101 55487 71185 75424 76201 57082 40518 23149 36295 39186
$$ packed form
15053D6329k3344l5300j4320j3529K195K8795J0621N75j4673J006L7245m259j7904
15040C437k8869Q696J6138J5298N416J7395j0363j0591K184L623M3286K932m4198
15027B4384P170K128k0301J0108j0094j7705K2396L5443j5261k3235k3056K890
15015e133J5202j1730o179L394O967J0919N658M101l5870j7755J7331p155Q877
15002a1373L6425L1270J5008J3909O1692P4928J60899K10494K52633K23423J58707
14991A228015J19890m2652l99604l71030j68790o7539m7475q2072k0837J5205
14981A63111m499m534j4774l8599j0569K5818M454J373k620k200k6675j1531r257
14968F9498l1595j2818K0981r65J0386J5698M239P77j9119j6564j7369J3146K891
$$ plain form
14955 39186 -2311 -3388 -426 -380 20915 37013 15713 27474 50483 57640 43641 17987 27435
14942 27435 17581 -9021 -37181 -20840 10662 28545 32850 27668 26269 69621 59828 59801 80701
14929 80701 93606 58101 35185 10050 7660 16942 -7289 -12165 -14469 8024 20358 24831 22082
14916 22082 29850 18616 2058 11701 59883 89792 75898 34254 13421 -10243 -23055 -17801
14904 -17801 -10939 -16909 -27032 -11450 -17357 -13676 5416 -14269 -9403 10924 1767 16156 16211
14891 16211 29145 374 2099 -28192 -48277 -53663 -44939 -60350 -40153 -23752 -35933 -28453
14879 -28453 -13705 -5563 -4303 -28447 -32660 -35093 -13644 -18530 9267 28046 17418 -19367 -41117
14866 -41117 -36248 -13867 -11796 20466 21417 18853 26779 214 -29240 -32342 -23129 -40188 -31522
$$ packed form
14955C9186m1497j077K962M6K1295J6098k1300J1761K3009P157j3999k5654R448
14942B7435r854k6602k8160J6341L1502J7883M305n182j399M3352r793k7K0900
14929H0701J2905l5505k2916k5135k390R282k4231m876k304K2493J2334M473k749
14916B2082P768j1234j6558R643M8182K9909j3894m1644k0833k3664j2812N254
14904a7801O862n970j0123J5582n907L681J9092j9685M866K0327r157J4389N5
14891A6211J2934k8771J725l0291k0085n386Q724j5411K0197J6401j2181P480
14879b8453J4748Q142J260k4144m213k433K1449m886K7797J8779j0628l6785k1750
14866d1117M869K2381K071L2262R51k564P926k6565k9454l102R213j7059Q666
$$ plain form
14853 -31522 -21804 -15745 -4555 -20758 -18545 -12794 10904 -3331 -6639 -4994 -2016 18272 24312
14840 24312 14098 26881 10539 -19545 -8919 8253 18100 16722 7473 -18307 -39486 -19563
14828 -19563 -4538 6461 -4190 -28768 -12088 45361 43673 19854 52992 38276 10956 14847
14816 14847 8468 7373 -7161 -30940 -23340 -25845 17347 46339 65747 50353 -4015 -35073
14804 -35073 -28607 15095 5080 -9891 -55802 -55463 -31266 -10085 15786 8080 -1354 -32396 -56260
14791 -56260 -16364 -12671 -23349 -44094 -47728 -69563 -81763 -77029 -20669 3345 36040 56450
14779 56450 67946 33228 18642 20233 17143 39512 33025 29626 37537 7289 -19169 -30599 6299
14766 6299 30305 24513 8910 6766 -34211 -32848 -7881 -25857 -21734 5964 3821 -26847 5042
$$ packed form
14853c1522R718O059J1190j6203K213N751K3698j4235l308J645K978K0288O040
14840B4312j0214J2783j6342l0084J0626J7172R847j378r249k5780k1179J9923
14828a9563J5025J0999j0651k4578J6680N7449j688k3819L3138j4716k7320L891
14816A4847o379j095j4534k3779P600k505M3192K8992J9408j5394n4368l1058
14804c5073O466M3702j0015j4971m5911L39K4197K1181K5871p706r434l1042k3864
14791e6260L9896L693j0678k0745l634k1835j2200M734N6360K4014L2695K0410
14779E6450J1496l4718j4586J591l090K2369o487l399P911l0248k6458j1430L6898
14766F299K4006n792j5603k144m0977J363K4967j7976M123K7698k143l0668L1889
$$ plain form
14753 5042 22112 29366 55030 50861 10588 11604 1991 2775 -13614 -26105 -29776 15691 51240
14740 51240 60578 66024 44951 25317 11192 -2386 6096 25550 22494 -8654 -28282 -39460
14728 -39460 -30425 -20257 7550 4303 -5933 -38853 -52840 -46484 -16923 -3340 472 -15654
14716 -15654 -301 10195 15103 4935 1004 -4125 1515 -5330 -22873 4650 18694 28192 18523
14703 18523 -12797 -36623 -32653 -31598 -43858 -29228 -1825 -12076 -13844 -17074 7862 2553 -3318
14690 -3318 -13453 -44987 -19093 12853 -16415 -43491 -34411 -12028 -6761 -12272 -5835 -16810 -9722
14677 -9722 6000 -7698 -36223 -51168 -26218 45 -9580 -25019 -57466 -77328 -64527 -51286
14665 -51286 -56897 -43489 -37740 -34720 -6942 745 17574 40765 41794 22621 16021 22449 2707
$$ packed form
14753E042J7070P254K5664m169m0273J016r613P84j6389j2491l671M5467L5549
14740E1240R338N446k1073j9634j4125j3578Q482J9454l056l1148j9628j1178
14728c9460R035J0168K7807l247j0236l2920j3987O356K9561J3583L812j6126
14716a5654J5353J0496M908j0168l931n129N640o845j7543K7523J4044R498r669
14703A8523l1320k3826L970J055j2260J4630K7403j0251j768l230K4936n309n871
14690c318j0135l1534K5894L1946k9268k7076R080K2383N267n511O437j0975P088
14677i722J5722j3698k8525j4945K4950K6263r625j5439l2447j9862J2801J3241
14665e1286n611J3408N749L020K7778P687J6829K3191J029j9173o600O428j9742
$$ plain form
14652 2707 2200 27613 47812 43303 43756 8353 -13231 13185 20451 25819 28509 -5835 -25579
14639 -25579 -24654 15043 27247 5534 -3750 -4281 2408 88 9944 21828 17649 -4824 -34339
14626 -34339 -31047 -20288 -16427 16095 9027 24354 21973 -1979 28046 57204 39945 12610
14614 12610 -7932 -4457 22278 19695 -1349 -21230 -7388 16278 20617 61723 74822 48286
14602 48286 31480 15956 33158 39527 22070 10340 17816 23269 601 -32265 -27186 -24552 -34612
14589 -34612 -51067 -47415 -30151 -7076 -14201 14502 -18981 -16865 -5254 26308 43471 44689
14577 44689 32988 25859 34559 63308 41338 9429 21790 15175 -12681 -41628 -32404 -15984
14565 -15984 -2268 27463 -3812 -8457 -7850 4180 3985 -1037 -14605 -34392 -31761 -29962 -21274
$$ packed form
14652B707n07K5413K0199m509M53l5403k1584K6416P266N368K690l4344j9744
14639b5579R25L9697J2204k1713r284n31O689k320R856J1884m179k2473k9515
14626c4339L292J0759L861L2522p068J5327k381k3952L0025K9158j7259k7335
14614A2610k0542L475K6735k583k1044j9881J3842K3666M339M1106J3099k6536
14602D8286j6806j5524J7202O369j7457j1730P476N453k2668l2866N079K634j0060
14589c4612j6455L652J7264K3075p125K8703l3483K116J1611L1562J7163J218
14577D4689j1701p129Q700K8749k1970l1909J2361o615k7856k8947R224J6420
14565a5984J3716K9731l1275m645O07J2030j95n022j3568j9787K631J799Q688
$$ plain form
14552 -21274 -2039 -23984 -28830 -5579 10609 -5034 -45366 -72604 -65631 -46522 -28341 1362
14540 1362 2990 14788 23269 12132 6800 13442 20558 25628 4381 -4818 -32800 -43112 -9287
14527 -9287 -16580 968 20739 10892 -6686 8858 17882 31112 49406 28238 -7389 -21843
14515 -21843 7691 22481 31799 16218 -2056 4455 10451 12052 6840 35217 27978 38914 39662
14502 39662 35152 -6547 1274 20649 4586 7234 9842 -8112 -2505 -19204 -22646 -15625 -13677
14489 -13677 9773 14240 5489 -10789 14483 25531 10093 -13665 -10165 -6598 -21095 2021
14477 2021 7463 -16031 -29892 -16263 -13884 21345 45392 39399 5841 -20871 -15808 624 24364
14464 24364 2744 -20304 -2841 -327 -5986 -1465 -12500 -53049 -52041 -55620 -41248 -40787 -64351
$$ packed form
14552b1274J9235k1945m846K3251J6188j5643m0332k7238O973J9109J8181K9703
14540A362J628J1798Q481j1137n332O642P116N070k1247r199k7982j0312L3825
14527i287p293J7548J9771r847j7578J5544R024J3230J8294k1168l5627j4454
14515b1843K9534J4790R318j5581j8274O511N996J601n212K8377p239J0936P48
14502C9662m510m1699P821J9375j6063K648K608j7954N607j6699l442P021J948
14489a3677K3450M467q751j6278K5272J1048j5438k3758L500L567j4497K3116
14477B021N442k3494j3861J3629K379L5229K4047n993l3558k6712N063J6432K3740
14464B4364k1620k3048J7463K514n659M521j1035m0549J008l579J4372M61k3564
$$ plain form
14451 -64351 -69789 -27534 4921 2883 -16895 -15637 -11877 10744 7246 -1149 -18164 -32414 -16884
14438 -16884 -5854 -43321 -39393 -21591 -16120 -21650 -28490 4876 27642 48773 32453 1135
14426 1135 -20719 -15626 548 -8251 -15262 -12638 -10561 25685 34880 15147 7021 20708 -15520
14413 -15520 -20005 -3992 10061 15275 -14689 -30992 -53780 -65877 -45060 -6192 17551 14329
14401 14329 -22021 -31574 -20013 11767 1215 -23202 -52250 -65369 -71030 -72353 -76224 -42216
14389 -42216 -29803 -21579 -44813 -40458 -8472 -10106 -60889 -62144 -48350 -6128 -4374 -36145 -44042
14376 -44042 -45748 -22684 -16888 -31532 -31606 -6267 21346 2231 -24341 1643 3835 14381 20962
14363 20962 47395 46661 10102 -16167 15605 43907 59700 29353 -26537 -35386 -45919 -45446 -34419
$$ packed form
14451f4351n438M2255L2455k038j9778J258L760K2621l498q395j7015j4250J5530
14438a6884J1030l7467L928J7802N471n530o840L3366K2766K1131j6320l1318
14426A135k1854N093J6174q799p011K624K077L6246R195j9733q126J3687l6228
14413a5520m485J6013J4053N214k9964j6303k2788j2097K0817L8868K3743l222
14401A4329l6350r553J1561L1780j0552k4417k9048j3119n661j323l871L4008
14389d2216J2413Q224k3234M355L1986j634n0783j255J3794M2222J754l1771p897
14376d4042j706K3064N796j4644p4K5339K7613j9115k6572K5984K192J0546O581
14363B0962K6433p34l6559k6269L1772K8302J5793l0347n5890q849j0533M73J1027
$$ plain form
14350 -34419 -51658 -19841 8837 31277 34163 4377 5202 2201 -18727 -3880 420 8075 3387
14337 3387 -43781 -45087 -51888 -64076 -77887 -79964 -54413 -43440 -30058 4282 34859 49900
14325 49900 35017 3053 -1996 -899 -19515 -20498 -483 -17568 -33639 -49862 -35101 -54597
14313 -54597 -20876 36432 7586 -33064 -25431 -13460 -24540 -18727 -8658 4081 2646 -12963
14301 -12963 -16632 -7387 -8518 -19597 -5224 24299 10961 477 10065 -16000 -44240 -24298
14289 -24298 -58892 -74215 -51833 -33499 -14396 -14311 23101 33626 50352 24910 -5516 9999
14277 9999 15828 16967 -9260 -19160 -1241 26254 40289 51317 46316 37042 16098 7390 11419
14264 11419 24337 -7117 -12661 925 12784 23562 -9813 -15070 10602 8351 -16293 -41932
$$ packed form
14350c4419j7239L1817K8678K2440K886k9786Q25l001k0928J4847M300P655m688
14337C387m7168j306o801j2188j3811k077K5551J0973J3382L4340L0577J5041
14325D9900j4883l1964n049J097j8616r83K0015j7085j6071j6223J4761j9496
14313e4597L3721N7308k8846m0650P633J1971j1080N813J0069J2739j435j5609
14301a2963l669R245j131j1079J4373K9523j3338j0484R588k6065k8240J9942
14289b4298l4594j5323K2382J8334J9103Q5L7412J0525J6726k5442l0426J5515
14277I999N829J139k6227r900J7919K7495J4035J1028n001r274k0944q708M029
14264A1419J2918l1454n544J3586J1859J0778l3375n257K5672k251k4644k5639
$$ plain form
14252 -41932 -20412 -44921 -19325 15177 37622 34106 28021 12593 -938 10499 8421 9819
14240 9819 10782 15251 27528 32098 23586 19783 29737 29446 5148 -415 -8038 -22915 -35467 -21349
14226 -21349 -22292 -15374 -17253 -14284 3074 -1674 8193 -11191 30467 40457 28045 29019 10942 1686
14212 1686 -20000 -4949 528 -13662 -12803 -13288 -39142 -54867 -61595 -76209 -26162 14649 13102
14199 13102 -6711 18044 3514 -23847 -52012 -58672 -65523 -64446 -35422 -20847 19240 14894
14187 14894 -7707 -15172 -26495 -17455 2422 -4069 -34439 -56232 -39408 -32980 -51001 -81550
14175 -81550 -68864 -53494 -17095 -12112 -45928 -51003 -43906 12630 10137 9909 16212 11844 4109
14162 4109 -1430 -22729 9026 15877 -10648 4059 3573 -13878 -26175 -37337 -6690 2807 3434
$$ packed form
14252d1932K1520k4509K5596L4502K2445l516o085j5428j3531J1437k078J398
14240I819R63M469J2277M570q512l803R954k91k4298n563p623j4877j2552J4118
14226b1349r43O918j879K969J7358m748R867j9384M1658R990j2412R74j8077r256
14212A686k1686J5051N477j4190Q59m85k5854j5725o728j4614N0047M0811j547
14199A3102j9813K4755j4530k7361k8165o660o851J077K9024J4575M0087m346
14187A4894k2601p465j1323R040J9877o491l0370k1793J6824O428j8021l0549
14175h1550J2686J5370L6399M983l3816n075P097N6536k493k28O303m368p735
14162D109n539k1299L1755O851k6525J4707m86j7451j2297j1162L0647R497O27
$$ plain form
14149 3434 -41565 -54593 -35688 12783 3791 -6670 9001 32708 13814 -19324 -44302 -22801
14137 -22801 -24270 -42219 -42097 -36750 -7957 -13760 -17507 -24449 -52596 -83807 -73153 -42017 9589
14124 9589 25280 -5732 -36236 -47349 -61010 -57650 -61537 -69407 -72702 -60419 -36993 -9130 -4403
14111 -4403 -13826 -7789 -19498 -17701 -23067 -40976 -53009 -46950 -625 13007 22661 15509 23662
14098 23662 23123 14045 -20819 -18432 1507 -37558 -76643 -55720 -44055 -32024 6432 1490 20754
14085 20754 28450 -10115 -3131 6589 -1266 -39592 -40456 -38701 -39142 -50046 -53384 -81130 -96594 -82581
14071 -82581 -19451 -1988 2282 -4101 -1778 -17012 -16051 24243 40351 4692 -25453 -7356 -1961
14058 -1961 -1904 16967 34291 31211 22002 6716 9576 11462 6558 40582 62755 79151 76115 58251
$$ packed form
14149C434m4999j3028J8905M8471q992j0461J5671K3707j8894l3138k4978K1501
14137b2801j469j7949J22N347K8793n803l747o942k8147l1211J0654L1136N1606
14124I589J5691l1012l0504j1113j3661L360l887p870l295J2283K3426K7863M727
14111d403r423O037j1709J797n366j7909j2033O059M6325J3632R654p152Q153
14098B3662n39r078l4864K387J9939l9065l9085K0923J1665J2031L8456m942J9264
14085B0754P696l8565O984R720p855l8326q64J755m41j0904l338k7746j5464J4013
14071h2581O3130J7463M270o383K323j5234R61M0294J6108l5659l0145J8097N395
14058a961N7J8871J7324l080r209j5286K860J886m904L4024K2173J6396l036j7864
$$ plain form
14044 58251 32508 9778 -11522 5091 -2595 -7173 -8321 5869 33217 42529 43103 37430 21501
14031 21501 24332 26564 6670 3426 7672 -14316 -21713 -21103 -29343 7371 30178 46786 54249
14018 54249 50291 43356 21694 2992 913 3798 -8661 -23057 3560 40086 19461 44055
14006 44055 48640 28720 -15619 -43680 -27898 13248 40416 35565 33140 27275 859 11941
13994 11941 -2706 2846 -12640 -31953 -33504 -41303 -37428 -9815 2830 6538 -4339 -25566 -6698
13981 -6698 17478 25095 20103 8720 -22175 -36527 -33021 -23033 -34419 -25222 -29300 -49286 -31142
13968 -31142 -22199 -63626 -93909 -63171 -33213 -18114 3106 5721 -36256 -64425 -26737 23750
13956 23750 -804 -20867 -13973 -30633 -10323 -26144 11546 34656 3953 -23835 -13722 18
$$ packed form
14044E8251k5743k2730k1300J6613p686m578j148J4190K7348R312N74n673j5929
14031B1501K831K232j9894l244M246k1988p397O10q240L6714K2807J6608P463
14018E4249l958o935k1662j8702k079K885j2459j4396K6617L6526k0625K4594
14006D4055M585j9920m4339k8061J5782M1146K7168m851k425n865k6416J1082
13994A1941j4647N552j5486j9313j551p799L875K7613J2645L708j0877k1227J8868
13981f698K4176P617m992j1383l0895j4352L506R988j1386R197m078j9986J8144
13968c1142Q943m1427l0283L0738K9958J5099K1220K615m1977k8169L7688N0487
13956B3750k4554k0063O894j6660K0310j5821L7690K3110l0703k7788J0113J3740
$$ plain form
13944 18 -17439 -22257 9392 30373 49174 22161 -9505 -26089 -43259 -37036 -35648 -1639 32474
13931 32474 39394 18049 22207 45409 36013 -5928 -24007 -30840 -39400 -20555 -2588 -10597 -1199
13918 -1199 29023 12820 -5028 3501 23424 36118 54348 36640 -1407 -5990 -6567 3664 -14777
13905 -14777 1394 2066 10200 3856 1516 25273 5085 -16123 -23695 -396 19290 36802 36971
13892 36971 24616 -2752 206 8202 12235 -18931 -16652 -10730 3754 -5976 -6449 -6785 -17203 -33053
13878 -33053 -29949 21120 36281 10555 -12308 -28558 -27151 -17431 -416 26053 30483 -15338
13866 -15338 -31979 -26504 -29875 -24297 -45687 -66121 -40356 -47057 -38147 -7950 17967 6075 15378
13853 15378 17096 8159 390 -25031 -37154 -18980 -10055 -19809 -21908 -40565 -39372 -24614 -22537
$$ packed form
13944A8j7457m818L1649K0981J8801k7013l1666j6584j7170O223J388L4009L4113
13931C2474O920k1345M158K3202r396m1941j8079o833q560J8845J7967q009R398
13918a199L0222j6203j7848Q529J9923J2694J8230j7708l8047m583n77J0231j8441
13905a4777J6171O72Q134o344k340K3757k0188k1208p572K3299J9686J7512J69
13892C6971j2355k7368K958P996M033l1166K279N922J4484r730m73l36j0418j5850
13878c3053L104N1069J5161k5726k2863j6250J407R720J7015K6469M430m5821
13866a5338j6641N475l371N578k1390k0434K5765o701Q910L0197K5917j1892R303
13853A5378J718q937p769k5421j2123J8174Q925r754k099j8657J193J4758K077
$$ plain form
13840 -22537 -15624 -3005 -25439 -14264 -20301 -61466 -51708 -51689 -44574 -50044 -48256 -40912 -25498 -13678
13826 -13678 3652 7207 -19284 -21435 -36587 -34159 -21606 -50134 -61043 -57178 -31250 520
13814 520 30266 7799 3947 1562 10341 5704 -18101 -12534 -18085 11156 30904 34305 58560
13801 58560 68981 64352 59967 58332 19665 -26541 -7935 7345 -17724 -18690 -21847 -17434 -23429
13788 -23429 -42981 -36374 -19254 15562 6131 -8103 -32969 -47745 -50052 -51981 -22571 15862
13776 15862 -30768 -37244 -15292 13266 51402 23240 -11449 -7783 13911 27728 26378 1347
13764 1347 -3274 -1649 -35086 -59917 -54806 -55281 -26616 -17796 -37769 -51257 -76152 -63504 -52748
13751 -52748 -44732 -29938 -39030 -22095 3281 16949 -26077 -47819 -35189 -26016 -22897 -15877 18554
$$ packed form
13840b2537O913J2619k2434J1175o037m1165R758J9P115n470J788P344J5414J1820
13826a3678J7330L555k6491k151j5152K428J2553k8528j0909L865K5928L1770
13814E20K9746k2467l852k385Q779m637k3805N567n551K9241J9748L401K4255
13801E8560J0421m629m385j635l8667m6206J8606J5280k5069r66l157M413n995
13788b3429j9552O607J7120L4816r431j4234k4866j4776k307j929K9410L8433
13776A5862m6630o476K1952K8558L8136k8162l4689L666K1694J3817j350k5031
13764A347m621J625l3437k4831N111m75K8665Q820j9973j3488k4895J2648J0756
13751e2748Q016J4794r092J6935K5376J3668m3026k1742J2630R173L119P020L4431
$$ plain form
13738 18554 30870 22238 23289 52888 31469 -10656 -18702 -13484 -7265 -5190 -2698 -32442 -27817
13725 -27817 3841 -3671 -2734 14307 24539 14242 24387 -16909 7453 23566 18143 19396 23748
13712 23748 28157 26563 25083 39037 39202 24717 11397 7652 9207 20867 -963 -16210 -771
13699 -771 2986 -3265 -12231 -3913 -2592 4967 133 -3133 3906 4249 -24084 -47671 -36778 -17654
13685 -17654 -19953 -35977 -19060 5849 57643 58454 68719 64468 34865 35994 38437 42046 30502
13672 30502 11254 30608 68356 47424 5682 -13256 -25016 -43809 -49249 -58767 -36079 -1482
13660 -1482 23008 21728 7185 32276 15775 -24480 -21516 -6395 -5952 -13755 3770 -11294 -29064
13647 -29064 -3851 -9485 -29560 -40273 -37743 -19891 -4461 16940 9874 23555 50163 32782
$$ packed form
13738A8554J2316q632J051K9599k1419m2125q046N218O219K075K492k9744M625
13725b7817L1658p512R37J7041J0232j0297J0145m1296K4362J6113n423J253M352
13712B3748M409j594j480J3954J65j4485j3320l745J555J1660k1830j5247J5439
13699g71L757o251q966Q318J321P559m834l266P039L43k8333k3587J0893J9124
13685a7654k299j6024J6917K4909N1794Q11J0265m251k9603J129K443L609j1544
13672C0502j9248J9354L7748k0932m1742j8938j1760j8793n440r518K2688L4597
13660a482K4490j280j4543K5091j6501m0255K964J5121M43p803J7525j5064j7770
13647b9064K5213n634k0075j0713K530J7852J5430K1401p066J3681K6608j7381
$$ plain form
13635 32782 -26236 -39010 -2646 5222 -7470 -17510 611 27346 7375 8377 23257 46301
13623 46301 48554 31745 15014 3017 -19274 -17629 -5162 8496 11308 3578 -5564 -35977 -62650
13610 -62650 -45959 -60120 -23228 -20487 -14106 -17113 -24697 -23470 2587 14927 5559 12580 16548
13597 16548 18475 27137 37879 20140 -5981 9429 -12168 -39168 -18318 -22364 -23437 -16914 -12935
13584 -12935 -16427 -2396 14983 5813 15622 -3627 -10989 12291 18959 -16944 -15011 -2609 -16249
13571 -16249 9879 28984 29244 -7895 -30224 -22685 5335 16830 22261 16084 5766 -6327 -25551
13558 -25551 -13045 -10166 -18805 -19772 -4380 -2103 9718 11204 91 31065 57969 33568 -3661
13545 -3661 -30710 -30966 -33872 -42737 -54339 -41138 14897 32834 45773 43313 58027 57858 58794 62524
$$ packed form
13635C2782n9018j2774L6364P868j2692j0040J8121K6735j9971J002J4880K3044
13623D6301K253j6809j6731j1997k2291J645J2467J3658K812p730r142l0413k6673
13610f2650J6691j4161L6892K741O381l007p584J227K6057J2340r368P021L968
13597A6548J927Q662J0742j7739k6121J5410k1597k7000K0850m046j073O523L979
13584a2935l492J4031J7379r170R809j9249p362K3280O668l5903J933J2402j3640
13571a6249K6128J9105K60l7139k2329P539K8020J1495N431o177j0318j2093j9224
13558b5551J2506K879q639r67J5392K277J1821J486j1113L0974K6904k4401l7229
13545c661k7049k56k906q865j1602J3201N6035J7937J2939k460J4714j69R36L730
$$ plain form
13531 62524 62485 30301 33610 36111 30073 22268 31952 55329 61858 35568 9916 7335 8710 -5554
13517 -5554 -10050 -13637 -40264 -36165 -9142 648 -33869 -49701 -23908 -10399 19961 43643 50202
13504 50202 35960 3170 12787 6816 21215 28298 1743 5556 26145 33476 -3010 -19950 -17054
13491 -17054 -15370 -38903 -43226 -28210 -45619 -73354 -59859 -68888 -52429 -9791 6339 18150
13479 18150 61494 75362 26312 8099 -4101 -15512 -34026 -32389 -10190 -24996 -16528 23752
13467 23752 21346 21113 34085 32197 21008 17360 44782 38565 -2807 -17577 414 30538 34885
13454 34885 24155 13862 3057 16997 11338 -3109 4039 -8106 -9810 8078 18964 41491
13442 41491 51252 39632 32992 -5945 -2073 12293 33417 25840 -5051 -8328 447 -110 -7141
$$ packed form
13531F2524l9l2184L309K501o038p805R684K3377O529k6290k5652k581J375j4264
13517e554m496l587k6627M099K7023R790l4517j5832K5793J3509L0360K3682O559
13504E0202j4242l2790R617n971J4399P083k6555L813K0589P331l6486j6940K896
13491a7054J684k3533m323J5016j7409k7735J3495r029J6459M2638J6130J1811
13479A8150M3344J3868m9050j8213j2200j1411j8514J637K2199j4806Q468M0280
13467B3752k406k33J2972j888j1189l648K7422o217m1372j4770J7991L0124M347
13454C4885j0730j0293j0805J3940n659j4447P148j2145j704J7888J0886K2527
13442D1491R761j1620o640l8937L872J4366K1124p577l0891l277Q775n57p031
$$ plain form
13429 -7141 25451 24478 18371 23083 -7497 1670 30188 26721 30644 42361 19546 23206 37241
13416 37241 52250 13367 -12165 -11774 18303 14625 -13244 -8850 6008 29214 36762 19588 -9022
13403 -9022 -10010 14151 31749 38659 49843 72328 77984 73351 23373 1716 4124 841 547 6152
13389 6152 25838 62191 61333 43511 17211 30337 52633 33148 10349 16134 43226 55221
13377 55221 38323 42973 50713 67759 67772 46377 67493 40846 29693 11150 5166 4902 -15610
13364 -15610 -39491 -31557 2974 -1044 17996 23227 61850 73378 49279 46924 57599 18752
13352 18752 -1095 6997 3935 -15311 -27080 -14691 2840 30500 45732 16060 9186 -15553
13340 -15553 -15152 -27768 -4892 4829 -15563 -27543 -34881 -3806 341 29857 37199 20722 -718
$$ packed form
13429g141L2592r73o107M712l0580R167K8518l467L923J1717k2815L660J4035
13416C7241J5009l8883k5532L91L0077l678k7869M394J4858K3206P548j7174k8610
13403i022r88K4161J7598O910J1184K2485N656m633m9978k1657K408l283k94N605
13389F152J9686L6353q58j7822k6300J3126K2296j9485k2799N785K7092J1995
13377E5221j6898M650P740J7046J3k1395K1116k6647j1153j8543n984k64k0512
13364a5610k3881P934L4531m018J9040N231L8623J1528k4099k355J0675l8847
13352A8752j9847Q092l062j9246j1769J2389J7531K7660J5232k9672o874k4739
13340a5553M01j2616K2876R721k0392j1980p338L1075M147K9516P342j6477k1440
$$ plain form
13327 -718 -3866 -10090 -19311 -13377 -10112 12646 23721 29522 32301 -2291 -2120 3747 1888 -15979
13313 -15979 -32178 -34143 -26054 -19660 -5202 -14935 -25693 -9737 -12762 -13543 -18963 -2105 -3026 33126
13299 33126 62917 51868 41040 37464 54992 54217 14265 2281 19144 54046 51951 43444 27368
13286 27368 43938 24162 -5264 -8066 5211 43316 73768 61849 31389 12220 16053 16542
13274 16542 36913 64455 89902 106300 98183 108998 171304 231493 301588 377792 504876 700099
13262 700099 1001276 1351424 1648724 1867305 1977250 1871007 1502521 1085185 788505 601273
13252 601273 489480 400725 310640 252427 242074 221166 189374 180566 181961 191753 192293 213723
13240 213723 225672 211652 185590 142639 139105 131072 121519 124132 128821 149171 155873 125094 94180
$$ packed form
13327g18l148o224r221N934L265K2758J1075N801K779l4592J71N867j859j7867
13313a5979j6199j965Q089O394J4458r733j0758J5956l025p81n420J6858r21L6152
13299C3126K9791j1049j0828l576J7528p75l9952j1984J6863L4902k095q507j6076
13286B7368J6570j9776k9426k802J3277L8105L0452j1919l0460j9169L833M89
13274A6542K0371K7542K5447J6398q117J0815O2306O0189P0095P6204J27084J95223
13262G00099L01177L50148K97300K18581J09945j06243l68486m17336k96680j87232
13252F01273j11793q8755r0085n8213j0353k0908l1792q808J395R792N40K1430
13240B13723J1949j4020k6062m2951l534q033r553K613M689K0350O702l0779l0914
$$ plain form
13227 94180 73992 90469 98906 110650 113589 134616 119760 112150 102243 76072 41516 60455
13215 60455 79453 28727 47023 66915 53229 14701 -24502 -38370 -23526 38768 84074 92114
13203 92114 81804 89393 73297 66091 32787 26961 15645 6507 23482 35985 23366 15219 30363
13190 30363 23098 17198 23568 28193 33627 24622 23239 28504 29509 42948 26987 22736 20577 38690
13176 38690 22520 21402 43828 22865 -9775 697 1315 -7794 3412 18583 63687 102867
13164 102867 86787 68388 38594 18394 -15884 -10551 1868 675 6326 11331 30616 71806
13152 71806 93015 101135 70170 24267 10969 30805 45131 61731 50180 26611 34658 38046
13140 38046 10583 -5089 -13214 2639 25600 42297 46314 53380 50686 31210 9003 12488 -4065
$$ packed form
13227I4180k0188J6477Q437J1744K939K1027j4856p610r907k6171l4556J8939
13215F0455J8998n0726J8296J9892j3686l8528l9203j3868J4844O2294M5306Q040
13203I2114j0310P589j6096p206l3304n826j1316r138J6975J2503j2619q147J5144
13190C0363p265n900O370M625N434r005j383N265J005J3439j5961m251k159J8113
13176C8690j6170j118K2426k0963l2640J0472O18r109J1206J5171M5104L9180
13164A02867j6080j8399k9794k0200l4278N333J2419j193N651N005J9285M1190
13152G1806K1209Q120l0965m5903j3298J9836J4326J6600j1551k3569Q047L388
13140C8046k7463j5672q125J5853K2961J6697M017P066k694j9476k2207L485j6553
$$ plain form
13127 -4065 26586 21502 35178 22809 13719 25560 31221 7966 4676 -4923 -13610 7811 14605
13114 14605 17297 16702 4610 -57344 -50627 -40991 -30635 -2882 -1688 -15196 -21162 -5759 11823
13101 11823 30209 11741 -12608 -23949 -31054 -36353 -34391 -46956 -18412 -1201 -23266 -53271
13089 -53271 -31234 1459 25160 -7958 -5979 10440 27023 13968 -19892 -15696 4472 28115
13077 28115 39105 38455 2418 -8800 18674 38419 58960 53533 21458 -7599 9789 8402
13065 8402 -10681 -24313 -20979 -24374 8263 72529 108271 103538 102842 104523 153411 186042 247934
13052 247934 293047 299711 302302 312504 293451 252713 202225 178393 167237 134660 134598 141962 144647
13039 144647 146081 153717 128255 77023 64024 63616 38713 40553 46256 52850 68011 36476 28564
$$ packed form
13127d065L0651n084J3676j2369r090J1841N661k3255l290r599q687K1421O794
13114A4605K692n95j2092o1954O717R636J0356K7753J194j3508n966J5403J7582
13101A1823J8386j8468k4349j1341p105n299J962j2565K8544J7211k2065l0005
13089e3271K2037L2693K3701l3118J979J6419J6583j3055l3860M196K0168K3643
13077B8115J0990o50l6037j1218K7474J9745K0541n427l2075k9057J7388j387
13065H402j9083j3632L334l395L2637O4266L5742m733o96J681M8888L2631O1892
13052B47934M5113O664K591J0202j9053m0738n0488k3832j1156l2577o2P364K685
13039A44647J434P636k5462n1232j2999m08k4903J840N703O594J5161l1535p912
$$ plain form
13026 28564 46682 50613 41272 11859 20566 21230 20299 18797 10860 -22516 -13121 3763 64849 97695
13012 97695 87271 99299 74855 61134 48039 -20548 -55236 -48289 -48091 -36617 -53801 -25704
13000 -25704 9991 57255 65614 54946 44237 9452 -32633 -32451 -30418 -40181 -49115 59 25566
12987 25566 36127 10363 -12404 3910 18602 4373 5502 13680 18399 31626 21286 37824
12975 37824 44088 31798 38973 15830 -19692 -43822 -57744 -60621 -44999 -23761 -8147 3587
12963 3587 -7324 -21255 -39316 -42029 -5368 12668 34348 32719 28719 41717 77634 117233
12951 117233 118554 84490 38264 29425 50195 44937 39058 60278 79320 93054 112118 109119
12939 109119 138309 197933 243345 234053 194032 197513 219575 239265 311493 416447 541171
$$ packed form
13026B8564J8118L931r341k9413Q707O64r31j502p937l3376R395J6884O1086L2846
13012I7695j0424J2028k4444j3721j3095o8587l4688O947J98J1474j7184K8097
13000b5704L5695M7264Q359j0668j0709l4785m2085J82K033r763q934M9174K5507
12987B5566J0561k5764k2767J6314J4692j4229J129Q178M719J3227j0340J6538
12975C7824O264j2290P175k3143l5522k4130j3922k877J5622K1238J5614J1734
12963C587j0911j3931j8061k713L6661J8036K1680j629m000J2998L5917L9599
12951A17233J321l4064m6226q839K0770n258n879K1220J9042J3734J9064k999
12939A09119K9190N9624M5412r292m0021L481K2062J9690P2228J04954J24724
$$ plain form
12928 541171 771162 1195658 1860484 2578759 2962738 2910021 2617353 2356789 1853633 1295696
12918 1295696 1021492 874556 767454 723590 702056 690420 670052 619512 589987 569944 562748
12907 562748 569571 561249 528386 532636 502042 495738 505748 512214 513041 543092 559779 577989 579413
12894 579413 583367 584201 567718 545180 519820 535922 546757 554625 543265 539179 555260 534731
12882 534731 539382 538495 555929 567997 575779 605940 599635 641506 635545 576069 574294 583925 583766
12869 583766 596902 593288 589045 590005 579667 624516 644649 658729 688800 716386 748727 763187
12857 763187 781708 756268 754698 762061 744861 744652 778978 822961 871879 897206 923717 985122
12845 985122 1037693 1036124 1036526 1081275 1117786 1147293 1218152 1315804 1500415 1733066 1975600
$$ packed form
12928E41171K29991M24496O64826P18275L83979n2717k92668k60564n03156n57937
12918A295696k74204j46936j07102m3864k1534j1636k0368n0540k9525k0043p196
12907E62748O823q322l2863M250l0594o304J0010O466Q27L0051J6687J8210J424
12894E79413L954Q34j6483k2538k5360J6102J0835P868j1360m086J6081k0529
12882E34731M651q87J7434J2068P782L0161o305M1871n961n9476j775R631j59
12869E83766J3136l614m243R60j0338M4849K0133J4080L0071K7586L2341J4460
12857G63187J8521k5440j570P363j7200k09L4326M3983M8918K5327K6511O1405
12845I85122N2571j569M02M4749L6511K9507P0859R7652J84611K32651K42534
$$ plain form
12834 1975600 2197635 2428961 2575049 2625825 2667097 2700409 2769203 2861148 3012568 3226643
12824 3226643 3467720 3739462 4035567 4413672 4807864 5210052 5686376 6261546 6960434
12815 6960434 7889691 9077615 10580380 12418742 14639816 17251190 20317111 23961859
12807 23961859 28246156 33818028 42157662 55319759 76579787 110601973 159933708
12800 159933708 221696566 286042596 338602020 372261173 372364484 313370482 219086207
12793 219086207 150254639 110468308 86991037 71989268 61531131 53858800 48197895
12786 48197895 43993586 40823687 38379960 36152213 33876982 31730097 29849282 28212677
12778 28212677 26769019 25490107 24271455 23079851 21935559 20922626 20085816 19341899
$$ packed form
12834A975600K22035K31326J46088N0776M1272L3312O8794R1945J51420K14075
12824C226643K41077K71742K96105L78105L94192M02188M76324N75170O98888
12815F960434R29257J187924J502765J838362K221074K611374L065921L644748
12807B3961859M284297N571872Q339634J3162097K1260028L4022186M9331735
12800A59933708O1762858O4346030N2559424L3659153J03311n8994002r4284275
12793B19086207o8831568l9786331k3477271j5001769j0458137p672331n660905
12786D8197895m204309l169899k443727k227747k275231k146885j880815j636605
12778B8212677j443658j278912j218652j191604j144292j012933q36810p43917
$$ plain form
12770 19341899 18622374 18002745 17400887 16793484 16254800 15734796 15218165 14725902 14281954
12761 14281954 13877316 13501035 13164127 12858185 12550175 12237020 11909253 11572718 11217007
12752 11217007 10861752 10539408 10287656 10049543 9822699 9590542 9359821 9157774 9032121
12743 9032121 8873912 8698092 8536124 8333602 8139964 7919428 7699505 7539416 7419394
12734 7419394 7260909 7103542 6903371 6657661 6396352 6118530 5879447 5662578 5480735
12725 5480735 5323308 5169542 5040691 4932283 4850916 4749514 4590331 4449384 4353136 4283265
12715 4283265 4193404 4110123 4050461 3960082 3896836 3781281 3664416 3573751 3509863 3461147 3409682
12704 3409682 3345476 3262221 3179338 3093572 3018342 2980187 2966606 2932178 2890005 2814923 2755117
$$ packed form
12770A9341899p19525o19629o01858o07403n38684n20004n16631m92263m43948
12761A4281954m04638l76281l36908l05942l08010l13155l27767l36535l55711
12752A1217007l55255l22344k51752k38113k26844k32157k30721k02047j25653
12743I032121j58209j75820j61968k02522j93638k20536k19923j60089j20022
12734G419394j58485j57367k00171k45710k61309k77822k39083k16869j81843
12725E480735j57427j53766j28851j08408q1367j01402j59183j40947r6248o9871
12715D283265q9861q3281n9662r0379o3246j15555j16865r0665o3888m8716n1465
12704C409682o4206q3255q2883q5766p5230l8155j3581l4428m2173p5082n9806
$$ plain form
12693 2755117 2722452 2659932 2635299 2618099 2599552 2581903 2559214 2517939 2483469 2462825 2460278
12682 2460278 2470129 2453826 2446888 2478711 2558257 2699229 2918723 3171404 3560245 4147295 4763946
12671 4763946 5193545 5189441 4771820 4316070 3855249 3322574 2937017 2671029 2495629 2384385
12661 2384385 2252843 2125751 2029169 1972967 1929778 1848785 1755130 1729923 1727522 1720332 1693224
12650 1693224 1631718 1578163 1528048 1490011 1463823 1420389 1397987 1363052 1301896 1293853 1285017 1286560
12638 1286560 1293836 1268134 1254791 1224673 1178507 1139595 1128055 1110468 1091482 1101700 1110551 1108620
12626 1108620 1124338 1121181 1069601 1045372 1030893 1026145 988878 922525 900437 912893 918634 898849
12614 898849 899801 889908 834668 812050 783014 759909 726073 729154 714293 668286 638579 654453
$$ packed form
12693B755117l2665o2520k4633j7200j8547j7649k2689m1275l4470k0644k547
12682B460278R851j6303o938L1823P9546J40972K19494K52681L88841N87050O16651
12671D763946M29599m104m17621m55750m60821n32675l85557k65988j75400j11244
12661B384385j31542j27092r6582n6202m3189q0993r3655k5207k401p190k7108
12650A693224o1506n3555n0115l8037k6188m3434k2402l4935o1156q043q836J543
12638A286560P276k5702j3343l0118m6166l8912j1540j7587j8986J0218Q851j931
12626A108620J5718l157n1580k4229j4479m748l7267o6353k2088J2456N741j9785
12614H98849R52r893n5240k2618k9036k3105l3836L081j4861m6007k9707J5874
$$ plain form
12602 654453 680923 721598 733025 720503 683968 647847 599764 586280 573621 570328 589998 598472
12590 598472 634619 652099 626777 569695 533666 510842 488724 499286 503555 538685 564577 577362
12578 577362 565188 535331 513378 514699 480512 442865 396873 393785 440693 460986 460691 425542
12566 425542 410871 400409 351272 338430 322409 309813 341158 345204 315211 303335 298179 288327
12554 288327 289370 276685 294867 283199 290469 330615 331948 336252 346556 347209 337640 311311 312714
12541 312714 301892 257924 261563 294403 275880 275013 284435 303388 310244 298778 317221 310870 294610
12528 294610 295005 290776 284599 316051 300231 247881 238840 280968 292729 286470 247591 238317 262194
12515 262194 293262 278413 248209 245881 229173 200810 185683 210695 225985 196305 155707 114841
$$ packed form
12602F54453K6470M0675J1427j2522l6535l6121m8083j3484j2659l293J9670Q474
12590E98472L6147J7480k5322n7082l6029k2824k2118J0562M269L5130K5892J2785
12578E77362j2174k9857k1953J321l4187l7647m5992l088M6908K0293k95l5149
12566D25542j4671j0462m9137j2842j6021j2596L1345M046k9993j1876n156r852
12554B88327J043j2685J8182j1668P270M0146J333M304J0304O53r569k6329J403
12541C12714j0822m3968L639L2840j8523q67R422J8953O856j1466J8443o351j6260
12528B94610L95m229o177L1452j5820n2350r041M2128J1761o259l8879r274K3877
12515B62194L1068j4849l0204k328j6708k8363j5127K5012J5290k9680m0598m0866
$$ plain form
12503 114841 125697 174594 187298 171284 181999 189716 202997 197166 192951 198543 191115 183432 155627
12490 155627 134230 135646 165702 170657 197730 208870 217666 236737 223965 198087 171855 162146
12478 162146 175393 169333 163005 182365 211564 192035 176895 209635 189913 162179 141822 149362
12466 149362 146257 158568 162840 135774 120023 129506 124662 84180 76269 111028 134640 138748 153079
12453 153079 127499 141529 116025 103559 131711 152870 137149 139956 174487 157299 137359 122620
12441 122620 121141 115125 118768 116581 106918 96153 102780 116060 123431 113253 93446 99899 120562
12428 120562 111132 124998 134777 122597 106040 131914 117397 101951 88254 72907 75334 73181
12416 73181 49828 41845 15913 23653 67219 63559 42331 21207 35380 47466 50856 85114
$$ packed form
12503A14841J0856M8897J2704j6014J0715P717J3281n831m215N592p428p683k7805
12490A55627k1397J416L0056M955K7073J1140Q796J9071j2772k5878k6232r709
12478A62146J3247o060o328J9360K9199j9529j5140L2740j9722k7734k0357P540
12466A49362l105J2311M272k7066j5751R483m844m0482p911L4759K3612M108J4331
12453A53079k5580J4030k5504j2466K8152K1159j5721K807L4531j7188j9940j4739
12441A22620j479o016L643k187r663j0765O627J3280P371j0178j9807O453K0663
12428A20562r430J3866R779j2180j6557K5874j4517j5446j3697j5347K427k153
12416G3181k3353p983k5932P740M3566l660k1228k1124J4173J2086L390L4258
$$ plain form
12404 85114 75473 40298 31532 20377 24096 22413 26947 63433 85170 98052 80213 66685 56630
12391 56630 27798 21538 27478 31376 54748 68751 63378 54149 59177 46867 46866 44667 21860 23116
12377 23116 43297 77795 97238 88142 93120 90262 71078 46184 48456 70384 51425 45193 65819
12364 65819 69132 58243 81112 102246 133253 120484 104429 107891 80067 59665 72027 55351
12352 55351 54174 74154 43399 27418 56334 76412 50647 61835 111083 165067 176766 148163
12340 148163 139072 154366 206065 259885 274583 334335 485599 663274 875508 1147143 1428605
12329 1428605 1707106 1941246 2011285 1806519 1363972 978334 730661 582587 495042 428501
12319 428501 403218 355609 331574 329125 293074 277021 257373 209418 185229 179984 180491 186845
$$ packed form
12404H5114r641l5175q766j1155L719j683M534L6486K1737J2882j7839j3528j0055
12391E6630k8832o260N940L898K3372J4003n373r229N028j2310jk199k2807J256
12377B3116K0181L4498J9443r096M978k858j9184k4894K272K1928j8959o232K0626
12364F5819L313j0889K2869K1134L1007j2769j6055L462k7824k0402J2362j6676
12352E5351j177J9980l0755j5981K8916K0078k5765J1188M9248N3984J1699k8603
12340A48163r091J5294N1699N3820J4698N9752J51264J77675K12234K71635K81462
12329A428605K78501K34140P0039k04766m42547l85638k47673j48074q7545o6541
12319D28501k5283m7609k4035k449l6051j6053j9648m7955k4189n245N07O354
$$ plain form
12307 186845 185565 197301 184114 172523 175820 175500 177875 168199 149900 136994 156074 121667 114151
12294 114151 107888 111516 108709 76633 56280 93687 106496 113152 100265 54113 42834 73378
12282 73378 101231 98466 98770 111492 105974 94177 51545 50203 60106 59524 72747 69231 58706
12269 58706 51290 78875 93295 90218 68384 50415 20108 11321 19420 5025 37506 57451
12257 57451 63968 49898 31075 22005 21002 33839 65750 92074 80797 70594 75240 62630
12245 62630 43515 36132 46605 55776 50730 24640 13554 24428 18395 41132 53075 47827 30407
12232 30407 43316 35329 39708 41537 27792 29275 34439 35579 12873 -6648 -5615 5510 21999
12219 21999 20843 32488 39709 48480 52241 60605 38898 34839 34823 25011 -7563 -18442 -6002 7933
$$ packed form
12307A86845j280J1736j3187j1591L297l20K375r676j8299j2906J9080l4407p516
12294A14151o263L628k807l2076k0353L7407J2809O656j2887m6152j1279L0544
12282G3378K7853k765L04J2722n518j1797m2632j342R903n82J3223l516j0525
12269E8706p416K7585J4420l077k1834j7969l0307q787Q099j4395L2481J9945
12257E7451O517j4070j8823r070j003J2837L1911K6324j1277j0203M646j2610
12245F2630j9115p383J0473R171n046k6090j1086J0874o033K2737J1943n248j7420
12232C0407J2909p987M379J829j3745J483N164J140k2706j9521J033J1125J6489
12219B1999j156J1645P221Q771L761Q364k1707m059j6r812l2574j0879J2440J3935
$$ plain form
12205 7933 26092 5831 -1444 23108 40275 25852 12700 -11279 -4973 12291 39 -19361
12193 -19361 -17669 -4408 12437 16850 -976 23400 34361 23092 26497 37883 49545 27030
12181 27030 7166 1434 11496 9413 16364 27063 42562 22547 -8926 -23017 8289 14473
12169 14473 10193 34808 42134 47436 13281 -16213 -17657 -30790 -14203 -16138 3926 4507 9562
12156 9562 10173 14257 -6043 -15428 -20833 6470 30055 37650 26067 22200 9197 7239 21655
12143 21655 23739 12908 6439 -6362 -10124 -29027 -20083 -10607 7736 -6258 -2723 -13187 -26164
12130 -26164 -36600 -7392 1680 -23356 -25741 12835 16554 19321 13826 9810 46816 70340 56745
12117 56745 40928 31636 27640 5708 -6276 878 22946 34176 34472 24611 -8281 -1365 2889
$$ packed form
12205G933J8159k0261p275K4552J7167j4423j3152k3979O306J7264j2252j9400
12193a9361J692J3261J6845M413j7826K4376J0961j1269L405J1386J1662k2515
12181B7030j9864n732J0062k083O951J0699J5499k0015l1473j4091L1306O184
12169A4473m280K4615P326N302l4155k9494j444j3133J6587j935K0064N81N055
12156I562O11M084k0300r385n405K7303K3585P595j1583l867j3003j958J4416
12143B1655K084j0831o469j2801l762j8903Q944R476J8343j3994L535j0464j2977
12130b6164j0436K9208R072k5036k385L8576L719K767n495m016L7006K3524j3595
12117E6745j5817r292l996k1932j1984P154K2068J1230K96r861l2892O916M254
$$ plain form
12104 2889 17191 20598 34441 56243 35263 35905 11847 -5301 11921 26258 25389 10032 41426
12091 41426 50772 54119 56666 45446 26951 39991 46840 42959 66934 83231 48063 39502 36168
12078 36168 7523 28576 34797 35655 44107 24508 14147 30025 17187 27340 36242 45055 27596
12065 27596 19662 25893 33967 32923 46952 35260 62954 91398 51471 2984 -21876 -15397 1052
12052 1052 -6228 -34881 -53171 -37834 -14251 3890 12381 25989 24276 25962 15550 15329 23862
12039 23862 19901 30960 16356 1519 25531 47023 20618 44229 33004 17564 45610 48868
12027 48868 49148 23944 15893 27142 40956 29086 37408 24528 26405 20472 12593 -20211 -41796
12014 -41796 -808 21627 33360 42504 60844 52559 -2069 -27950 -15030 -16040 -41104 -36761
$$ packed form
12104B889J4302L407J3843K1802k0980O42k4058j7148J7222J4337q69j5357L1394
12091D1426R346L347K547j1220j8495J3040O849l881K3975J6297l5168q561l334
12078C6168k8645K1053O221Q58Q452j9599j0361J5878j2838J0153Q902Q813j7459
12065B7596p934O231Q074j044J4029j1692K7694K8444l9927m8487k4860O479J6449
12052A052p280k8653j8290J5337K3583J8141Q491J3608j713J686j0412k21Q533
12039B3862l961J1059j4604j4837K4012K1492k6405K3611j1225j5440K8046L258
12027D8868K80k5204q051J1249J3814j1870Q322j2880J877n933p879l2804k1585
12014d1796M0988K2435J1733R144J8340q285n4628k5881J2920j010k5064M343
$$ plain form
12002 -36761 -9993 -6167 11656 40236 20278 -10207 18890 46730 50022 43540 20786 12051
11990 12051 -716 13639 35441 38463 46778 47656 1783 4403 -217 -20234 -14180 16337 47199
11977 47199 55892 35012 26946 32292 -1353 -29892 -1603 23261 68095 79627 21453 8496
11965 8496 4812 37140 30325 -1356 23710 47314 21664 40109 37573 41052 33739 36135 67645
11952 67645 47339 33629 12295 -189 271 24425 14557 -7629 -33307 -44975 -32594 -7948
11940 -7948 -7377 24696 49080 26070 -9602 -14507 -16884 -7583 20653 28852 32841 31242 32847 11038
11926 11038 -2761 4220 18060 20454 9387 25654 45284 21856 8398 8964 17252 34018 46169
11913 46169 40412 39902 13936 4063 -879 3570 13528 4748 -5038 13304 34626 59097 39535
$$ packed form
12002c6761K6768L826J7823K8580j9958l0485K9097K7840L292o482k2754q735
11990A2051j2767J4355K1802L022Q315Q78m5873K620m620k0017O054L0517L0862
11977D7199Q693k0880q066N346l3645k8539K8289K4864M4834J1532n8174j2957
11965H496l684L2328o815l1681K5066K3604k5650J8445k536L479p313K396L1510
11952F7645k0306j3710k1334j2484M60K4154r868k2186k5678j1668J2381K4646
11940g948N71L2073K4384k3010l5672m905k377R301K8236Q199L989j599J605k1809
11926A1038j3799O981J3840K394j1067J6267J9630k3428j3458N66Q288J6766J2151
11913D6169n757n10k5966r873m942M449R958q780r786J8342K1322K4471j9562
$$ plain form
11900 39535 13387 9366 -61 12616 18053 21203 18583 29453 30475 31120 38144 26887 3355
11887 3355 3346 -12054 -20780 -7126 5113 1196 4174 -2390 -18140 10380 49456 42771 39180 41524
11873 41524 27615 4189 6194 31604 52147 50289 44192 26932 27197 47456 4684 -8707 46198
11860 46198 33782 1595 5991 -19508 11918 31790 21152 39066 42206 15566 8803 5746
11848 5746 -1976 30144 33268 24183 -7577 -30780 2070 7808 4818 25686 23702 8989 -10075
11835 -10075 7303 10248 676 -9538 -9477 -8564 3701 5548 -11721 14968 27523 7872 15638
11822 15638 -3692 -7010 40865 36435 6932 -13303 -33266 -24540 -4924 -21733 216 8810
11810 8810 166 -1167 18893 59147 72679 75855 86207 56171 57205 81709 85257 60227 21065
$$ packed form
11900C9535k6148m021r427J2677N437L150k620J0870J022O45P024j1257k3532
11887C355rj5400q726J3654J2239l917K978o564j5750K8520L9076o685l591K344
11873D1524j3909k3426K005K5410K0543j858o097j7260K65K0259m2772j3391N4905
11860D6198j2416l2187M396k5499L1426J9872j0638J7914L140k6640o763l057
11848E746p722L2120L124r085l1760k3203L2850N738k990K0868j984j4713j9064
11835a0075J7378K945r572j0214O1R13J2265J847j7269K6689J2555j9651P766
11822A5638j9330l318M7875m430k9503k0235j9963Q726J9616j6809K1949Q594
11810H810q644j333K0060M0254J3532L176J0352l0036J034K4504L548k5030l9162
$$ plain form
11797 21065 14136 8707 -10710 -14445 -25394 -1432 -8408 -12710 -6554 25881 43037 25705 11938
11784 11938 -1936 12084 33465 10384 -24252 -16493 -15549 -26317 -10184 6737 27227 38415
11772 38415 40476 41627 41154 15867 21931 35619 29835 33747 24726 15721 15721 21439 15502 -6304 -10510
11757 -10510 -12210 -11831 -33012 -77364 -84623 -45763 -32115 -38492 -32427 -37873 -25295 -2645 -32708
11744 -32708 -52166 -52581 -25847 -8690 -7736 -20617 -31657 -36477 -49298 -47057 -44560 -19037 5914
11731 5914 -3864 6402 1881 -6947 -5085 -5194 -3004 -1696 -30222 -19359 7142 22063 37771
11718 37771 40278 20130 -4729 8111 15397 9252 -14390 -29049 -29052 717 24695 15358 -14986
11705 -14986 -17721 16035 21476 20903 28650 8935 13230 18778 42955 37853 36031 18553 26908 9453
$$ packed form
11797B1065o929n429j9417l735j0949K3962o976m302O156L2435J7156j7332j3767
11784A1938j3874J4020K1381k3081l4636P759R44j0768J6133J6921K0490J1188
11772C8415K061J151m73k5287O064J3688n784L912r021r005%N718n937k1806m206
11757a0510j700L79k1181m4352p259L8860J3648o377O065n446J2578K2650l0063
11744c2708j9458m15K6734J7157R54j2881j1040m820j2821K241K497K5523K4951
11731E914r778J0266m521q828J862j09K190J308k8526J0863K6501J4921J5708
11718C7771K507k0148k4859J2840P286o145k3642j4659lK9769K3978r337l0344
11705a4986k735L3756N441n73P747j9715M295N548K4177n102j822j7478Q355j7455
$$ plain form
11691 9453 458 -15878 -29455 -12392 36433 58800 36835 35009 47021 47562 19401 27708 58693
11678 58693 38756 37360 31242 6113 -4396 -46013 -34589 -34306 -20018 -2136 -8272 3187 3480
11665 3480 -26775 -27224 -18371 -8691 9039 -14317 -23008 -17328 -12076 3801 -30672 -51847 -29016
11652 -29016 -9156 2100 -13706 -32969 -34798 -44291 -46396 -12606 3207 -30917 -37082 1605
11640 1605 23536 23314 -6961 -30240 816 23219 -3338 -16483 -18993 -36165 -12442 8368
11628 8368 14144 33657 27930 -3684 -21429 -24631 -24105 -23407 -22724 -39561 -59892 -62424 -35531 -17383
11614 -17383 -13958 -9056 7437 -2676 -4274 5719 6158 -8394 -6701 -16890 -10291 18063 37727
11601 37727 34125 27868 4908 -17160 -30038 -28746 2004 858 -35539 -79801 -61913 -9211
$$ packed form
11691I453q995j6336j3577J7063M8825K2367k1965j826J2012N41k8161Q307L0985
11678E8693j9937j396o118k5129j0509m1617J1424K83J4288J7882o136J1459K93
11665C480l0255m49Q853R680J7730k3356q691N680N252J5877l4473k1175K2831
11652b9016J9860J1256j5806j9263j829r493k105L3790J5813l4124o165L8687
11640A605K1931k22l0275k3279L1056K2403k6557j3145k510j7172K3723K0810
11628H368N776J9513n727l1614j7745l202N26O98O83j6837k0331k532K6893J8148
11614a7383L425M902J6493j0113j598R993M39j4552J693j0189O599K8354J9664
11601C7727l602o257k2960k2068j2878J292L0750j146l6397m4262J7888N2702
$$ plain form
11589 -9211 33642 31753 39014 33619 32464 -178 -16549 -10005 3430 -7516 -5220 -13591 -32010
11576 -32010 -25063 -26207 -3303 -15334 -11346 32446 39007 25671 46682 21687 3662 10372 3202
11563 3202 -448 13045 212 -6111 14587 27012 25706 29698 30001 42773 54795 66923 38272
11550 38272 31185 27269 -12748 -16488 11688 921 -24827 -43854 -53845 -49500 -24504 -17676 -24644
11537 -24644 -6037 13061 -31998 -52196 -28554 7293 31584 20890 27253 8184 3181 28584
11525 28584 46373 57618 46388 22276 1888 -15686 -34535 -33767 -26085 -6745 6636 2624
11513 2624 3279 -9310 3758 12289 46336 66392 40923 18286 14416 -4216 -28302 -35979 -30378
11500 -30378 -33870 -28453 18268 28000 23090 44293 39374 21257 8994 3606 -15539 -15228 -5
$$ packed form
11589i211M2853j889P261n395j155l2642j6371O544J3435j0946K296q371j8419
11576c2010O947j144K2904j2031L988M3792O561j3336K1011k4995j8025O710p170
11563C202l650J3493j2833o323K0698J2425j306L992L03J2772J2022J2128k8651
11550C8272p087l916m0017l740K8176j0767k5748j9027r991M345K4996O828o968
11537b4644J8607J9098m5059k0198K3642L5847K4291j0694O363j9069n003K5403
11525B8584J7789J1245j1230k4112k0388j7574j8849P68P682J9340J3381m012
11513B624O55j2589J3068Q531L4047K0056k5469k2637l870j8632k4086p677N601
11500c0378l492N417M6721R732m910K1203m919j8117j2263n388j9145L11J5223
$$ plain form
11487 -5 -4730 -2391 16043 28770 3953 -30054 -16404 4199 11439 13103 -1154 30743 10099
11474 10099 -1750 -15313 2685 10578 13931 -6188 12027 13566 14248 17039 9884 4347 13627
11461 13627 7186 -7679 -38287 -15144 20393 7651 -10094 -6754 -32432 -17068 -8342 13612
11449 13612 32499 12551 8168 18090 18355 17728 2167 -27711 -22453 -15902 -245 20095 15475
11436 15475 26466 27626 16517 -16192 -25876 -18013 -47397 -23936 21220 48935 54655 41025
11424 41025 23819 25724 61054 60957 27613 -11119 -14320 46963 66120 28438 -9712 -31774 -17779
11411 -17779 6434 8946 14718 21879 32822 36746 36016 19883 38166 70394 46368 10469 -49449
11398 -49449 -72333 -41702 -9847 -5149 -4106 -1567 24156 20886 -17157 -27312 -36944 -58898 -35556
$$ packed form
11487em725K339J8434J2727k4817l4007J3650K0603P240J664j4257L1897k0644
11474A0099j1849j3563J7998P893L353k0119J8215J539O82K791p155n537R280
11461A3627o441j4865l0608K3143L5537j2742j7745L340k5678J5364Q726K1954
11449A3612J8887j9948m383R922K65o27j5561k9878N258O551J5657K0340m620
11436A5475J0991J160j1109l2709r684P863k9384K3461M5156K7715N720j3630
11424D1025j7206J905L5330r7l3344l8732l201O1283J9157l7682l8150k2062J3995
11411a7779K4213K512N772P161J0943L924p30j6133J8283L2228k4026l5899n9918
11398d9449k2884L0631L1855M698J043K539K5723l270l8043j0155r632k1954K3342
$$ plain form
11385 -35556 1824 30979 5955 12487 20045 24853 2740 -19280 -16440 19960 42838 28860
11373 28860 26016 41912 64635 54789 28342 32161 36732 27515 30143 24882 19492 28174 7568
11360 7568 17821 8722 16330 37580 28485 41391 63252 46885 29801 1679 -11880 -1912 -6244
11347 -6244 -21806 -31103 -8534 466 -6146 -15044 -43693 -67269 -45139 -13356 -21118 -12387 2977
11334 2977 -1776 -13224 -40283 -58083 -62450 -18885 -10878 -28531 -41005 -80876 -64700 -37815
11322 -37815 -28380 -19189 2258 10713 -660 -16663 -7424 -15203 -1728 3713 9777 27018 28005
11309 28005 8334 9486 1654 -12216 -25406 -48775 -37547 -53055 -35240 -33439 -34098 -75168 -79327
11296 -79327 -74285 -74484 -47237 -28198 -41439 -63411 -63542 -36552 31706 57901 38287 -16027 -43193
$$ packed form
11385c5556L7380K9155k5024O532P558M808k2113k2020K840L6400K2878j3978
11373B8860k844J5896K2723r846k6447L819M571r217K628n261n390Q682k0606
11360G568J0253r099P608K1250r095J2906K1861j6367j7084k8122j3559R968m332
11347f244j5562r297K2569R000o612q898k8649k3576K2130L1783p762Q731J5364
11334B977m753j1448k7059j7800m367M3565Q007j7653j2474l9871J6176K6885
11322c7815R435R191K1447Q455j1373j6003R239p779J3475N441O064J7241R87
11309B8005j9671J152p832j3870j3190k3369J1228j5508J7815J801o59m1070m159
11296g9327N042j99K7247J9039j3241k1972j31K6990O8258K6195j9614n4314k7166
$$ plain form
11283 -43193 -39666 -23808 -52850 -61587 -40108 -13697 18019 28885 39163 42360 52061 35301
11271 35301 15923 22666 20632 -25357 -53787 -40987 -26186 -25967 -9330 -29300 -23474 -3944 10071
11258 10071 -950 -45127 -57579 -58049 -23308 11801 36242 57088 51449 24600 -8975 1152
11246 1152 -8940 -10193 -18192 -47950 -37071 -34236 -37459 -2881 1457 -4779 -6534 -18998 -42220
11233 -42220 -43495 1482 46305 68848 52749 30262 16816 32915 43267 43230 37072 35902 24670
11220 24670 11610 9011 24682 22851 22313 11291 13229 24166 48180 73049 71239 48811 13691
11207 13691 -5331 -2094 -9534 235 5205 11251 27675 36843 22909 -12582 -20959 1276 -660
11194 -660 -21129 -34839 -15342 -16526 -10339 -12523 -17048 -15167 -17316 -11935 -26875 -26229 20629 -1445
$$ packed form
11283d3193L527J5858k9042q737K1479K6411L1716J0866J0278L197R701j6760
11271C5301j9378O743k034m5989k8430J2800J4801K19J6637j9970N826J9530J4015
11258A0071j1021m4177j2452m70L4741L5109K4441K0846n639k6849l3575J0127
11246A152j0092j253p999k9758J0879K835l223L4578M338o236j755j2464k3222
11233d2220j275M4977M4823K2543j6099k2487j3446J6099J0352l7o158j170j1232
11220B4670j3060k599J5671j831n38j1022J938J0937K4014K4869j810k2428l5120
11207A3691j9022L237p440R769M970O046J6424R168j3934l5491q377K2235j936
11194f60k0469j3710J9497j184O187k184m525J881k149N381j4940O46M6858k2074
$$ plain form
11180 -1445 -47903 -58065 -49048 -23245 -18349 -22246 -31332 -35243 -31258 -23072 -21901 -54067 -9652
11167 -9652 27553 -3965 -32706 -20768 -14002 21102 29400 3743 -17003 -21562 -24561 -48415 -26625
11154 -26625 -6307 -15021 -18485 28053 30479 -9984 -41131 -17461 -26076 -54035 -50646 -22442 -16494
11141 -16494 -6314 11472 3691 -14223 -28313 -2015 1377 -10237 -13553 -16246 -40742 -57864
11129 -57864 -40606 -9323 -4021 -19664 -39693 -23794 -33815 -13000 14198 7879 13649 10528
11117 10528 13134 8567 1417 2548 -10362 -2079 14640 30914 45574 10157 -24351 -36723 1078
11104 1078 25202 15202 10938 18214 27023 10957 -14116 -28734 -32471 -27969 -25466 -19523 2321
11091 2321 -17656 -24395 -20925 -22734 -28677 -23459 -25753 -15446 -8490 -26495 -37586 -31479 -23242 -36133
$$ packed form
11180a445m6458j0162R017K5803M896l897r086l911L985Q186J171l2166M4415
11167i652L7205l1518k8741J1938O766L5104Q298k5657k0746m559k999k3854K1790
11154b6625K0318q714l464M6538K426m0463l1147K3670q615k7959L389K8204N948
11141a6494J0180J7786p781j7914j4090K6298L392j1614l316k693k4496j7122
11129e7864J7258L1283N302j5643k0029J5899j0021K0815K7198o319N770l121
11117A0528K606m567p150J131j2910Q283J6719J6274J4660l5417l4508j2372L7801
11104A078K4124j0000m264P276Q809j6066k5073j4618l737M502K503N943K1844
11091B321j9977o739L470j809n943N218k294J0307O956j8005j1091O107Q237j2891
$$ plain form
11077 -36133 -15049 6331 -2435 -20453 -23758 -17267 -4692 744 15259 8832 5829 -5169 -4442
11064 -4442 16710 -1766 6314 -10592 -4239 23601 37663 52376 42863 25821 13216 33834
11052 33834 28223 23431 33850 8876 -19876 -16543 -18263 -18389 -36962 -33571 -28733 -31681 -32443 -48719
11038 -48719 -69041 -29434 -7395 -9918 -5786 -25013 -21920 -17890 12062 28883 32123 15553 -11131
11025 -11131 -48539 -63107 -77614 -71894 -59189 -31862 -26783 -43514 -16791 9485 9685 -9366
11013 -9366 16749 36960 6090 -20254 -19186 13087 50440 26250 -23971 -55152 -58275 -44434
11001 -44434 -17479 -16634 -11013 34256 32608 -16288 -21479 -7089 -12061 -57472 -54017 -12769 -38805
10988 -38805 -43843 -38222 -51567 -67294 -67968 -71536 -73864 -67667 -45146 -15694 -30128 -34704 -7965
$$ packed form
11077c6133K1084K1380q766j8018l305O491J2575N436J4515o427l003j0998P27
11064d442K1152j8476Q080j6906O353K7840J4062J4713r513j7042j2605K0618
11052C3834n611m792J0419k4974k8752L333j720j26j8573L391M838k948p62j6276
11038d8719k0322L9607K2039k523M132j9227L093M030K9952J6821L240j6570k6684
11025a1131l7408j4568j4507N720J2705K7327N079j6731K6723K6276K00j9051
11013i366K6115K0211l0870k6344J068L2273L7353k4190n0221l1181l123J3841
11001d4434K6955Q45N621M5269j648m8896n191J4390m972m5411L455M1248k6036
10988c8805n038N621j3345j5727o74l568k328O197K2521K9452j4434m576K6739
$$ plain form
10975 -7965 2563 16838 12276 7029 6734 -12681 -25019 -21923 -16044 -12551 23259 40785 20868
10962 20868 11216 -12317 -42091 -45218 -23384 -29608 5515 -6768 3041 26218 44081 29426
10950 29426 -1887 -15866 3348 -15363 -46075 -37681 -12589 -905 -24442 -45060 -36926 -37901
10938 -37901 -47892 -47447 -20960 19184 10790 -5976 4154 1592 -8497 -54129 -50609 -17892 -9430
10925 -9430 -15110 -13114 -21937 -29391 -25242 -27459 -19575 -34452 -53174 -42465 -48916 -42217 -41918 -41833 -10751
10910 -10751 894 -31293 -20001 -7353 -18247 -16380 -33759 -30057 11304 37200 33309 25016
10898 25016 35935 27947 29397 30727 12528 10249 18301 20926 13587 1835 13930 16449 23801
10885 23801 22066 590 22114 11568 -2346 12659 29856 20334 26598 22522 25197 7208 -20914
$$ packed form
10975g965J0528J4275m562n247k95j9415j2338L096N879L493L5810J7526j9917
10962B0868r652k3533k9774l127K1834o224L5123j2283R809K3177J7863j4655
10950B9426l1313j3979J9214j8711l0712Q394K5092J1684k3537k0618Q134r75
10938c7901r991M45K6487M0144q394j6766J0130k562j0089m5632L520L2717Q462
10925i430n680J996q823p454M149k217P884j4877j8722J0709o451O699K99Q5L1082
10910a0751J1645l2187J1292J2648j0894J867j7379L702M1361K5896l891q293
10898B5016J0919p988J450J330j8199k279Q052K625p339j1752J2095K519P352
10885B3801j735k1476K1524j0546j3914J5005J7197r522O264m076K675j7989k8122
$$ plain form
10872 -20914 -23913 -4840 23053 -9623 -35337 -14524 9643 35547 32353 15630 -734 -25715
10860 -25715 -13269 9365 -8255 -35077 -32775 -25499 25026 49688 9216 6551 31677 42023
10848 42023 45296 40108 11772 199 19541 29587 19716 4051 -694 2694 -2093 7731 19015
10835 19015 14628 -8688 -41731 -26597 -7335 12102 7943 -18341 -43797 -42639 -26484 -5371
10823 -5371 -6469 -8196 3617 3812 8463 17247 36283 31905 44393 39095 36811 34157 22998 9900
10809 9900 -16412 -16389 5831 16287 -27367 -29234 -22360 -23767 -10520 20890 16552 16107 29973 17065
10795 17065 -21460 -7818 -3520 -7150 -17080 -12163 11071 16096 7744 -20987 -31032 -14648 37118
10782 37118 32549 23559 20936 -3647 -33825 -35696 -10535 -270 893 9866 18700 24498 38991
$$ packed form
10872b0914k999J9073K7893l2676k5714K0813K4167K5904l194j6723j6364k4981
10860b5715J2446K2634j7620k6822K302P276N0525K4662m0472k665K5126J0346
10848D2023L273n188k8336j1573J9342J0046r871j5665m745L388m787R824J1284
10835A9015m387k3316l3043J5134J9262J9437m159k6284k5456J158J6155K1113
10823e371j098j727J1813J95M651Q784J9036m378J2488n298k284k654j1159j3098
10809I900k6312K3K2220J0456m3654j867O874j407J3247L1410m338m45J3866j2908
10795A7065l8525J3642M298l630r930M917K3234N025q352k8731j0045J6384N1766
10782C7118m569q990k623k4583l0178j871K5161J0265J163Q973Q834N798J4493
$$ plain form
10769 38991 72410 75154 33980 23960 15050 13305 5586 2091 -5101 -18458 -6570 313 -3269
10756 -3269 -10765 -2342 5969 -23847 -16341 -28323 -4279 7874 16791 14542 19575 3550 2783 297
10742 297 -18616 -1039 5145 -13300 -19411 -52445 -64262 -46747 -36439 -33000 -3211 -26637 -54470
10729 -54470 -51541 -32131 -9370 -17497 -17744 7594 46267 50151 28136 -7844 4550 11084 -18921
10716 -18921 -35291 -9340 -4235 -23990 -39586 -9155 -4161 -5759 -2844 -5706 5536 -20289 -61119
10703 -61119 -31426 20603 38709 4635 -22771 -4013 -13356 -8630 -2534 -30839 -26926 3816
10691 3816 -8973 -27720 -12340 -20240 -7197 31453 25551 7292 -58744 -83050 -87476 -64332
10679 -64332 -41631 -21376 -31296 -24125 -8571 -27863 -10600 -8858 -26185 -50872 -22147 -14892
$$ packed form
10769C8991L3419K744m1174j0020q910j745p719l495p192j3357J1888O883l582
10756c269p496Q423Q311k9816P506j1982K4044J2153Q917k249N033j6025p67k486
10742B97j8913J7577O184j8445o111l3034j1817J7515J0308L439K9789k3426k7833
10729e4470K929J9410K2761q127k47K5338L8673L884k2015l5980J2394O534l0005
10716a8921j6370K5951N105j9755j5596L0431M994j598K915k862J1242k5825m0830
10703f1119K9693N2029J8106l4074k7406J8758r343M726O096k8305L913L0742
10691C816j2789j8747J5380p900J3043L8650n902j8259o6036k4306m426K3144
10679f4332K2701K0255r920P171J5554j9292J7263J742j7327k4687K8725P255
$$ plain form
10667 -14892 -25633 -21926 -32047 -692 898 -7711 1078 -7251 -9679 -23796 -21652 -25003 -46837
10654 -46837 -69166 -69119 -47827 -41561 -45645 -13819 -9282 -27032 -34791 -36366 -45493 -47513 -33691 -25045
10640 -25045 -60988 -68520 -32780 -19914 -23888 -20650 -19858 -16554 -9258 -9256 -1525 25882 31862 5332
10626 5332 -7219 -12007 -8678 -5213 -9984 -21091 2965 22994 10158 -2610 -15539 -16145 -10334
10613 -10334 7177 -23814 -1857 6684 -13786 -8421 -31800 -57326 -67543 -66738 -36819 -27599 -29782
10600 -29782 -9617 12990 -3681 -8160 -5550 -9647 -5269 10124 28835 18870 17712 25386 4631
10587 4631 -26628 -27968 15793 24235 5113 -12761 -29307 -18941 -18532 -15432 -50808 -44907 -19574
10574 -19574 -16761 -31579 -32850 -16531 8960 13017 943 -4331 -13245 -11234 -9153 -28483 -42440
$$ packed form
10667a4892j0741L707j0121L1355J590q609Q789q329k428j4117K144l351k1834
10654d6837k2329M7K1292O266m084L1826M537j7750p759j575r127k020J3822Q646
10640b5045l5943p532L5740J2866l974L238P92L304P296KP731K7407N980k6530
10626E332j2551m788L329L465m771j1107K4056K0029j2836j2768j2929o06N811
10613a0334J7511l0991K1957Q541k0470N365k3379k5526j0217Q05K9919R220k183
10600b9782K0165K2607j6671m479K610m097M378J5393J8711r965j158P674k0755
10587D631l1259j340M3761Q442j9122j7874j6546J0366M09L100l5376N901K5333
10574a9574K813j4818j271J6319K5491M057j2074n274q914K011K081j9330j3957
$$ plain form
10561 -42440 -34149 -29315 327 29494 22475 19348 28134 44123 34698 -6701 1125 34571 20992
10548 20992 16915 -4103 -32754 -44900 -26543 4495 37321 5427 -7673 -1431 -1726 -25596
10536 -25596 -53590 -43733 -24750 -153 1066 -18184 5865 6529 2820 -18943 11523 37313 58974
10523 58974 63723 39506 23242 -14635 -48224 -42382 -49763 -24841 -17997 -10155 -15822 -34012 -19609
10510 -19609 -18844 -31761 -37333 -19295 -20995 -15848 -5340 -20098 -21892 -19084 -33274 -17822 -14556
10497 -14556 -45479 -31077 9667 19687 -18311 -19490 1618 13046 -2404 -30273 -52001 -33576
10485 -33576 -3653 -20528 -13473 381 -18657 -51089 -46024 -27136 -8548 6057 -15856 -24963
10473 -24963 -37144 -49127 -58659 -67599 -51614 -38013 -29509 -48686 -70534 -52411 -44741 -64224
$$ packed form
10561d2440Q291M834K9642K9167p019l127Q786J5989r425m1399P826L3446j3579
10548B0992m077k1018k8651j2146J8357L1038L2826l1894j3100O242k95k3870
10536b5596k7994R857J8983K4597J219j9250K4049O64l709k1763L0466K5790K1661
10523E8974M749k4217j6264l7877l3589N842p381K4922O844P842n667j8190J4403
10510a9609P65j2917n572J8038j700N147J0508j4758j794K808j4190J5452L266
10497a4556l0923J4402M0744J0020l7998j179K1108J1428j5450k7869k1728J8425
10485c3576K9923j6875P055J3854j9038l2432N065J8888J8588J4605k1913r107
10473b4963j2181j1983r532q940J5985J3601Q504j9177k1848J8123P670j9483
$$ plain form
10461 -64224 -44518 -31588 -54876 -49244 -50491 -56957 -47682 -18310 -23375 -31506 -21481 1910 11525
10448 11525 14774 10893 -8774 -14382 -31217 -56047 -51339 -63586 -41671 -21346 13159 16107 12705
10435 12705 11152 -3869 3198 1746 7651 43027 30703 53360 59675 53784 24364 12206 29244
10422 29244 18514 -20240 -5009 -7141 -3269 14940 12884 -384 17554 27856 -9260 -1558
10410 -1558 14980 -22639 -37408 -29006 -9581 1403 6999 2747 23417 28546 37772 50186 40850
10397 40850 7420 -6587 -29664 -11149 -7175 17735 33214 32809 43906 12399 16254 20190 -1417
10384 -1417 -7824 -27126 -50523 -51186 -17259 -1503 42 8468 1176 -9509 -38723 -39612 -16951
10371 -16951 13173 18764 34811 17895 -1444 6419 15189 -1309 3053 -4587 -36448 -18653 19180
$$ packed form
10461f4224J9706J2930k3288N632j247o466R275K9372n065q131J0025K3391R615
10448A1525L249l881j9667n608j6835k4830M708j2247K1915K0325L4505K948l402
10435A2705j553j5021P067j452N905L5376j2324K2657O315n891k9420j2158J7038
10422B9244j0730l8754J5231k132L872J8209k056j3268J7938J0302l7116P702
10410a558J6538l7619j4769Q402J9425J0984N596m252K0670N129R226J2414r336
10397D0850l3430j4007k3077J8515L974K4910J5479m05J1097l1507L855L936k1607
10384a417o407j9302k3397o63L3927J5756J545Q426p292j0685k9214q89K2661
10371a6951L0124N591J6047j6916j9339P863Q770j6498M362p640l1861J7795L7833
$$ plain form
10358 19180 5207 3615 -12947 -40643 -18995 26430 40124 5577 -26981 -61084 -87687 -74791
10346 -74791 -55133 -29002 -13492 -6601 -38175 -50140 -12070 5375 7107 10237 -1831 12265
10334 12265 4395 -44796 -53528 -25101 9842 -17159 -43648 -43820 -26145 -17554 -50652 -34512 -54962
10321 -54962 -58722 -70547 -66510 -57985 -39905 -52171 -59787 -33471 -24239 -41641 -57586 -62376 -38983
10308 -38983 -8446 6344 23867 -15544 -23182 -15255 13787 40989 30310 45166 70032 57692
10296 57692 39307 48208 76029 54483 2735 -2487 13309 36906 62409 39035 27504 22732
10284 22732 16936 87 -13701 -25422 -36963 -31531 -25561 -131 4576 24607 22426 35186 16381
10271 16381 -1797 11429 33204 26017 6171 -20610 -46803 -59198 -60019 -34948 -16334 -24864
$$ packed form
10358A9180j3973j592j6562k7696K1648M5425J3694l4547l2558l4103k6603J2896
10346g4791J9658K6131J5510O891l1574j1965L8070J7445J732L130j2068J4096
10334A2265p870m9191q732K8427L4943k7001k6489j72J7675Q591l3098J6140k0450
10321e4962l760j1825M037Q525J8080j2266p616K6316R232j7402j5945m790K3393
10308c8983L0537J4790J7523l9411p638P927K9042K7202j0679J4856K4866j2340
10296E7692j8385Q901K7821k1546n1748n222J5796K3597K5503k3374j1531m772
10284B2732n796j6849j3788j1721j1541N432N970K5430M707K0031k181J2760j8805
10271A6381j8178J3226K1775p187j9846k6781k6193j2395q21K5071J8614q530
$$ plain form
10259 -24864 -41524 -5289 1397 -4070 -19882 -55967 -54922 -23123 9837 37010 23966 28978
10247 28978 21470 38880 32237 24837 31834 63418 33790 1238 -12345 -20415 -17658 -16587 -57333
10234 -57333 -84931 -51570 -16104 -25123 -22031 -7763 1172 -27380 -16343 -29173 -45992 -43600
10222 -43600 -5300 28017 30402 20785 36382 26665 -8350 9296 7394 430 -33389 -15362 3741
10209 3741 -27438 -53909 -45348 -38014 -1735 -7599 -37085 -17661 -31433 -56662 -38310 -12012
10197 -12012 5443 18569 784 14194 62562 68939 38540 14971 11870 7143 -1094 212 14095
10184 14095 4221 -11469 21634 18829 320 13561 27230 28682 26063 13638 -17742 -18077 -5518
10171 -5518 -29762 -34377 -50698 -45184 -22010 -5594 4147 -25499 -53485 -65087 -70529 -63597 -71698
$$ packed form
10259b4864j6660L6235O686n467j5812l6085J045L1799L2960K7173j3044N012
10247B8978p508J7410o643p400O997L1584k9628l2552j3583q070K757J071m0746
10234e7333k7598L3361L5466r019L092J4268Q935k8552J1037j2830j6819K392
10222d3600L8300L3317K385r617J5597r717l5015J7646j902o964l3819J8027J9103
10209C741l1179k6471Q561P334L6279n864k9486J9424j3772k5229J8352K6298
10197a2012J7455J3126j7785J3410M8368O377l0399k3569l101m727q237J306J3883
10184A4095r874j5690L3103k805j8509J3241J3669J452k619j2425l1380l35J2559
10171e518k4244m615j6321N514K3174J6416R741k9646k7986j1602n442O932q101
$$ plain form
10158 -71698 -68191 -59460 -63037 -46010 -49466 -13488 -3098 11244 10135 -20182 -56220 -41436 -24494
10145 -24494 -50123 -50378 -30164 15953 26343 -27022 -28476 -13943 -9066 -23098 -33345 -6362
10133 -6362 2184 18449 6356 -11068 -29752 -48808 -42538 -20519 -13939 -8256 -11272 -19832 -36460
10120 -36460 -36884 -32809 -22028 -6737 -22148 -10645 23901 40132 39074 13435 -2739 -6202 9243
10107 9243 19476 19258 3320 4981 6770 8280 5901 -12508 -28813 -58701 -87396 -77619 -66744
10094 -66744 -35781 -24797 -2743 10558 14715 8696 15428 33544 22708 32172 31134 20605 30414
10081 30414 23482 -9158 -5007 -2643 821 -22725 -39028 -58735 -48504 -36260 -29241 -17528 9844
10068 9844 16965 11450 5795 -13995 -11331 -452 -4954 -26401 -15856 -17410 -21966 5103 26659
$$ packed form
10158g1698L507Q731l577J7027l456L5978J0390J4342j109l0317l6038J4784J6942
10145b4494k5629k55K0214M6117J0390n3365j454J4533M877j4032j0247K6983
10133f362Q546J6265j2093j7424j8684j9056O270K2019O580N683l016q560j6628
10120c6460m24M075J0781J5291j5411J1503L4546J6231j058k5639j6174l463J5445
10107I243J0233k18j5938J661J789J510k379j8409j6305k9888k8695R777J0875
10094f6744L0963J0984K2054J3301M157o019O732J8116j0836R464j038j0529R809
10081C0414o932l2640M151K364L464k3546j6303j9707J0231J2244P019J1713K7372
10068I844P121n515n655j9790K664J0879m502k1447J0545j554m556K7069K1556
$$ plain form
10055 26659 40984 46985 10527 -8726 -6626 7009 -17264 -35399 -13798 5623 15873 12959
10043 12959 18454 -18 5537 -2564 -27120 -16276 -19420 -4730 4884 -11974 -25578 -37077 -22144
10030 -22144 -2275 -20461 -18830 4637 -1571 -11033 12338 -9771 -24547 -29568 -8716 13506
10018 13506 -31318 -39886 -17202 4879 13225 -5083 -5455 -18725 -50096 -37477 -11007 11395
10006 11395 -13845 -16760 -25796 -20747 -7609 19529 525 -9621 -3644 27763 14917 -1465
9994 -1465 1790 12127 -13989 -13740 -4080 -19940 -8056 -11034 -13589 -38627 -60671 -73117 -22846
9981 -22846 -6429 -28696 -42921 -68880 -47748 -24053 -30231 -26483 9628 32319 18384 19317 38617
9968 38617 72099 50326 21534 35211 37886 33577 22059 -1895 -20128 11593 7637 -40627
$$ packed form
10055B6659J4325O001l6458j9253K100J3635k4273j8135K1601J9421J0250k914
10043A2959N495j8472N555q101k4556J0844l144J4690R614j6858j3604j1499J4933
10030b2144J9869j8186J631K3467o208r462K3371k2109j4776n021K0852K2222
10018A3506m4824q568K2684K2081Q346j8308l72j3270l1371J2619K6470K2402
10006A1395k5240k915r036N049J3138K7138j9004j0146N977L1407j2846j6382
9994a465L255J0337k6116K49R660j5860J1884k978k555k5038k2044j2446N0271
9981b2846J6417k2267j4225k5959K1132K3695o178L748L6111K2691j3935R33J9300
9968C8617L3482k1773k8792J3677K675m309j1518k3954j8233L1721l956m8264
$$ plain form
9956 -40627 -34449 -38279 -46999 -23785 -11137 33798 22782 13679 37637 32943 28878 11071 19516
9943 19516 2027 -32 22340 43205 53129 18205 1679 -9897 -23337 -15373 8634 -15807
9931 -15807 -21833 -14124 25170 35114 4337 -672 17663 11597 -7190 -2014 -14144 -25635 23
9918 23 5410 1269 -19133 -32747 -33635 -16118 -37084 -4230 11826 9700 5038 9118 30261 42951
9904 42951 29477 15592 -22588 -32861 -35931 -12946 1008 -19554 -30564 -43377 -52286 -46687
9892 -46687 -36020 -7660 15362 25101 25117 27806 35584 38049 44848 29639 26658 46572 40461 -6189
9878 -6189 -33223 -27260 -23144 -53735 -59836 -54417 -41671 -28058 -25298 -13866 13170 6167 -7536
9865 -7536 -10913 -28459 -21719 -3697 11824 8185 -6071 -5493 23995 13763 8788 -11543 -51200
$$ packed form
9956d0627O178l830q720K3214J2648M4935j1016r103K3958m694m065j7807Q445
9943A9516j7489k059K2372K0865R924l4924j6526j1576j3440P964K4007k4441
9931a5807o026P709L9294R944l0777n009J8335o066j8787N176j2130j1491K5658
9918B3N387m141k0402j3614q88J7517k0966L2854J6056k126m662M080K1143J2690
9904D2951j3474j3885l8180j0273l070K2985J3954k0562j1010j2813q909N599
9892d6687J0667K8360K3022R739J6K689P778K465O799j5209k981J9914o111m6650
9878f189k7034N963M116l0591o101N419J2746J3613K760J1432K7036p003j3703
9865g536l377j7546O740J8022J5521l639j4256N78K9488j0232m975k0331l9657
$$ plain form
9852 -51200 -66625 -54056 -20766 6250 49390 37491 22380 9673 15213 4744 -24835 -11854
9840 -11854 -3330 -12095 -25307 -18886 -60 34684 42011 4405 11972 -13391 -46845 -49404 -49077
9827 -49077 -28957 -9786 -13508 -384 8250 -12789 -7349 15583 57567 44724 47977 33634 22019
9814 22019 21632 692 -31640 -21884 -16989 -18863 421 4700 23789 2305 -12627 -8430 -14096
9801 -14096 1928 -19917 -13250 -23144 -9463 -5231 -4182 -67 -12008 -15337 4900 -14944 -16938
9788 -16938 -6916 6204 -10532 -23211 -30568 -14271 28123 45968 27376 20555 -2434 -25868
9776 -25868 -39243 -33346 -66425 -71169 -45726 -21075 18868 -7606 -7733 -26545 -25588 3525 20259
9763 20259 18284 20070 14699 -6123 2901 -9112 -9795 3526 11970 8532 -17507 -45162 -36615 -35518
$$ packed form
9852e1200j5425J2569L3290K7016M3140j1899j5111j2707N540j0469k9579J2981
9840a1854Q524q765j3212O421J8826L4744P327l7606P567k5363l3454k559L27
9827d9077K0120J9171l722J3124Q634k1039N440K2932M1984j2843L253j4343j1615
9814B2019l87k0940l2332R756M895j874J9284M279J9089k1484j4932M197n666
9801a4096J6024k1845O667r894J3681M232J049M115j1941l329K0237j9844j994
9788a6938J0022J3120j6736j2679p357J6297M2394J7845j8592o821k2989k3434
9776b5868j3375N897l3079m744K5443K4651L9943k6474j27j8812R57K9113J6734
9763B0259j975J786n371k0822R024j2013o83J3321Q444l438k6039k7655Q547J097
$$ plain form
9749 -35518 -32658 -11418 14989 19425 1160 27976 26008 3869 -9711 -1277 -2101 -21973 -40211
9736 -40211 -33977 -2312 -8184 -18723 -20665 7959 30199 31426 34303 34765 33262 22920 28878 33347
9722 33347 30593 1392 -6021 8488 9762 -6400 -10703 11894 7968 -10649 -33637 -6586 3243
9709 3243 14952 9030 -9641 -23142 -32278 -19761 4179 -3213 -57283 -70005 -82269 -53229 -9243
9696 -9243 1242 3816 20383 2361 -13102 -14499 -21348 -4195 7864 7256 -3121 -16958 -19105
9683 -19105 -8788 -9541 -8523 3589 -3171 -8005 -6091 -26138 -21574 -29313 -37965 -38885 -39541 -22936
9669 -22936 27377 -2901 -26874 -24738 -2743 -7508 -17431 -28839 -40598 -14110 6446 -2490 -5428
9656 -5428 -12339 -8625 26382 47254 47396 26172 -1373 -21782 -3952 17408 4265 -19359 -31067
$$ packed form
9749c5518K860K1240K6407M436j8265K6816j968k2139j3580Q434q24j9872j8238
9736d0211O234L1665n872j0539j942K8624K2240J227K877M62j503j0342N958M469
9722C3347k754k9201p413J4509J274j6162m303K2597l926j8617k2988K7051R829
9709C243J1709n922j8671j3501r136J2517K3940p392n4070j2722j2264K9040M3986
9696i243J0485K574J6567j8022j5463j397o849J7153J2059o08j0377j3837k147
9683a9105J0317p53J018J2112o760m834J914k0047M564p739q652r20o56J6605
9669b2936N0313l0278k3973K136K1995m765r923j1408j1759K6488K0556q936k938
9656e428o911L714L5007K0872J42k1224k7545k0409J7830K1360j3143k3624j1708
$$ plain form
9643 -31067 -47240 -56843 -15462 12876 16135 5598 -23682 -39338 -27435 -32589 -55008 -60571 -55172
9630 -55172 -37401 -29425 2795 21328 5900 -4637 -11914 -26019 -17177 -10348 -8900 -478 11013
9617 11013 20781 -11891 -11918 23311 36870 48138 36932 27725 38243 38857 36419 17582 -19126
9604 -19126 -25844 -8631 7895 -7994 -23811 -18907 -15797 -30356 -39891 -39315 -22423 -4141 -15020
9591 -15020 -29520 -35586 -20243 -34087 -58709 -42824 -40023 -48264 -64299 -41688 -29771 -37272 -23025
9578 -23025 21856 12025 -1203 -19699 -29011 731 17591 2817 819 -18471 -31530 -7744
9566 -7744 5501 27810 13298 24882 7216 -33068 -44903 -50269 -26492 -1784 -2044 4121 -977
9553 -977 -8919 -20536 -30206 -46375 -37529 -24552 8546 50888 35560 8100 -5724 2438 12844
$$ packed form
9643c1067j6173r603M1381K8338L259j0537k9280j5656J1903n154k2419n563N399
9630e5172J7771P976L2220J8533j5428j0537p277j4105Q842O829J448Q422J1491
9617A1013R768l2672k7L5229J3559J1268j1206r207J0518O14k438j8837l6708
9604a9126o718J7213J6526j5889j5817M904L110j4559r535N76J6892J8282j0879
9591a5020j4500o066J5343j3844k4622J5885K801q241j6035K2611J1917p501J4247
9578b3025M4881r831j3228j8496r312K9742J6860j4774j998j9290j3059K3786
9566g744J3245K2309j4512J1584j7666m0284j1835n366K3777K4708k60O165n098
9553i77p942j1617r670j6169Q846J2977L3098M2342j5328k7460j3824Q162J0406
$$ plain form
9540 12844 17040 37219 35476 9407 7216 50205 25733 2951 -20597 -37690 14662 32072
9528 32072 40167 50711 46495 42166 42031 63113 26903 -4599 7512 -5460 -13079 -3510 2718
9515 2718 -2812 -8124 4749 10533 1335 -5123 33354 41743 27984 16096 3949 37206 28808
9502 28808 4278 19711 22510 20868 29456 15054 13923 6638 18187 36154 52455 26171 -21189
9489 -21189 -2895 19047 27279 8670 39842 51808 20065 193 -24649 -66895 -89041 -43206
9477 -43206 5939 -11230 -13729 -13607 -14059 14437 21242 20103 5250 -25579 -41865 -26605 -200
9464 -200 -7100 -4310 -126 14829 26785 16418 11246 11861 15411 16370 -14057 -28086 -7422 -5606
9450 -5606 -21815 -5732 16720 -2110 -13923 -20899 -31546 -37065 -19075 2364 5955 -27393 -31977
$$ packed form
9540A2844M196K0179j743k6069k191M2989k4472k2782k3548j7093N2352J7410
9528C2072Q095J0544m216m329j35K1082l6210l1502J2111j2972p619R569O228
9515B718n530n312J2873N784r198o458L8477Q389j3759j1888j2147L3257q398
9502B8808k4530J5433K799j642Q588j4402j131p285J1549J7967J6301k6284m7360
9489b1189J8294K1942Q232j8609L1172J1966l1743j9872k4842m2246k2146M5835
9477d3206M9145j7169k499J22m52K8496O805j139j4853l0829j6286J5260K6405
9464b00o900K790M184J4955J1956j0367n172O15L550R59l0427j4029K0664J816
9450e606j6209J6083K2452j8830j1813o976j0647n519J7990K1439L591l3348m584
$$ plain form
9437 -31977 -3040 14228 51835 70101 37996 -10932 -21515 -12292 -29626 -34782 -12616 -22001
9425 -22001 -70073 -33146 699 -32212 -35523 -12689 -9541 17570 35988 19326 9357 1209 4137
9412 4137 -6938 -2857 14467 22404 24265 -1708 2200 49113 50486 36768 30971 6241 -8089
9399 -8089 13500 14696 22248 27765 29709 9935 -417 8716 34805 55257 36670 18280 38955
9386 38955 62808 75818 77197 44596 -8274 -700 34015 18617 4741 3268 4704 9523 1352
9373 1352 -2763 9646 43043 80340 100568 113719 118140 83846 47864 29512 26822 22812 26730
9360 26730 10117 8953 20443 30310 4319 18757 26063 58023 39514 31221 20364 28139 29262
9347 29262 18245 42915 35340 22911 39051 20079 -11384 980 42824 40258 35179 28507 38091
$$ packed form
9437c1977K8937J7268L7607J8266l2105m8928j0583R223j7334n156K2166r385
9425b2001m8072L6927L3845l2911l311K2834L148K7111J8418j6662r969q148K928
9412D137j1075M081J7324P937J861k5973L908M6913J373j3718n797k4730j4330
9399h089K1589J196P552N517J944j9774j0352R133K6089K0452j8587j8390K0675
9386C8955K3853J3010J379l2601n2870P574L4715j5398j3876j473J436M819q171
9373A352m115J2409L3397L7297K0228J3151M421l4294l5982j8352k690m010L918
9360B6730j6613j164J1490R867k5991J4438P306L1960j8509q293j0857P775J123
9347B9262j1017K4670p575j2429J6140j8972l1463J2364M1844k566n079o672R584
$$ plain form
9334 38091 54069 76756 99714 97016 75196 71757 49477 21416 24336 47099 21409 32753
9322 32753 20180 5502 21753 36750 29901 47925 52809 49793 30266 38983 71816 104792 108745
9309 108745 90834 68090 45268 17286 36276 69860 79405 74599 89325 57938 43065 59840
9297 59840 90009 95913 78051 96562 108835 95397 84662 75530 97035 104991 106933 89715 85315
9284 85315 105169 98973 108949 119506 131204 110749 128426 139001 130961 142251 177108 189573
9272 189573 155178 139815 136322 117277 108500 133670 163199 168676 183670 144641 155582 184989
9260 184989 172207 157512 172396 187565 214706 222718 214134 180239 151004 159868 187012 199756
9248 199756 204375 200570 230442 253515 252839 242013 251592 276410 302230 317098 333278 350131 364993
$$ packed form
9334C8091J5978K2687K2958k698k1820l439k2280k8061K920K2763k5690J1344
9322C2753j2573j4678J6251J4997o849J8024M884l016j9527Q717L2833L2976L953
9309A08745j7911k2744k2822k7982J8990L3584R545m806J4726l1387j4873J6775
9297E9840L0169N904j7862J8511J2273j3438j0735r132K1505P956J942j7218m400
9284H5315J9854o196R976J0557J1698k0455J7677J0575q040J1290L4857J2465
9272A89573l4395j5363l493j9045q777K5170K9529N477J4994l9029J0941K9407
9260A84989j2782j4695J4884J5169K7141Q012q584l3895k9235Q864K7144J2744
9248A99756M619l805K9872K3073o76j0826R579K4818K5820J4868J6180J6853J4862
$$ plain form
9235 364993 369836 364384 334806 365781 383799 424612 440474 428098 445799 475457 468111 452805
9223 452805 459479 501156 525282 578562 641535 631663 610808 628336 618841 615614 632459 659194
9211 659194 674001 669318 700439 733783 775916 792263 794894 828993 872633 886164 865135 858806
9199 858806 833559 816638 818872 841188 855742 856901 833753 832602 823329 795580 774610 747228
9187 747228 767268 783329 777537 768351 751760 716216 687027 711221 712364 708138 701117 680694 621719
9174 621719 602215 586613 586432 560326 507326 507312 507305 500041 507981 485752 483018 481409 457961 448228
9160 448228 463994 468813 461406 447877 413631 383388 358407 370529 363981 363490 329884 271585 279471
9147 279471 271992 262433 265688 280727 290935 294586 283517 294609 289730 248552 235499 235371 243996
$$ packed form
9235C64993M843n452k9578L0975J8018M0813J5862j2376J7701K9658p346j5306
9223D52805O674M1677K4126N3280O2973r872k0855J7528r495l227J6845K6735
9211F59194J4807m683L1121L3344M2133J6347K631L4099M3640J3531k1029o329
9199H58806k5247j6921K234K2316J4554J159k3148j151r273k7749k0970k7382
9187G47228K0040J6061n792r186j6591l5544k9189K4194J143m226p021k0423n8975
9174F21719j9504j5602j81k6106n3000j4pp264P940k2229k734j609k3448r733
9160D48228J5766M819p407j3529l4246l0243k4981J2122o548m91l3606n8299P886
9147B79471p479r559L255J5039J0208L651j1069J1092m879m1178j3053j28Q625
$$ plain form
9134 243996 236250 230064 216981 211771 197374 195440 190691 194371 189864 205611 205675 212757 222802 210498
9120 210498 197012 168111 159811 138556 120423 122049 103045 94880 94199 92546 86943 110831 130731
9107 130731 148488 163465 141839 131414 145376 131263 118777 117429 143168 158483 144107 148726
9095 148726 175588 188623 162224 136748 142095 170109 175727 153786 126514 141804 155457 169005
9083 169005 160949 134243 100907 82515 78828 80666 103096 91757 92853 82603 68235 92861
9071 92861 119349 119670 90228 65474 39345 15560 38419 69293 93030 91326 70942 46261
9059 46261 40145 52623 60947 64444 65766 71377 54637 55871 73611 95748 80621 54252 59453
9046 59453 69197 92645 65937 14023 19910 45408 63021 64911 20039 24191 41036 30145 37417
$$ packed form
9134B43996p746o186j3083n210j4397j934m749L680m507J5747O4P082J0045j2304
9120B10498j3486k8901q300k1255j8133J626j9004q165o81j653n603K3888J9900
9107A30731J7757J4977k1626j0425J3962j4113j2486j348K5739J5315j4376M619
9095A48726K6862J3035k6399k5476N347K8014N618k1941k7272J5290J3653J3548
9083A69005q056k6706l3336j8392l687J838K2430j1339J096j0250j4368K4626
9071I2861K6488L21k9442k4754k6129k3785K2859L0874K3737j704k0384k4681
9059D6261o116J2478Q324L497J322N611j6740J234J7740K2137j5127k6369N201
9046E9453R744K3448k6708n1914N887K5498J7613J890m4872M152J6845j0891P272
$$ plain form
9033 37417 25292 -1926 67 -686 -8334 -19320 -8309 13151 27305 1704 -2576 3591 -9324
9020 -9324 -14559 -5140 13624 46822 46993 46007 41748 72472 47310 20939 25903 49133 53731 60887
9006 60887 23241 21693 31692 29369 15911 27442 38465 16251 -28418 -15323 5850 27093
8994 27093 24307 21355 38517 49853 61283 32506 29348 45831 74546 76406 46730 43257 45658
8981 45658 11152 -12480 9925 28350 37521 23935 26970 65561 87003 72135 58596 47030
8969 47030 24454 41341 14853 13112 22777 12869 -1052 9712 8514 21121 19628 4183 14629
8956 14629 43711 54493 56426 63731 48091 77958 82542 86823 45408 34086 53142 35734 19448
8943 19448 31830 46171 69555 73829 55940 14868 -16359 -6577 12718 7957 7267 25161 52056
$$ packed form
9033C7417j2125k7218J993p53p648j0986J1011K1460J4154k5601m280O167j2915
9020i324n235R419J8764L3198J71r86m259L0724k5162k6371M964K3230M598P156
9006F0887l7646j548R999k323j3458J1531J1023k2214m4669J3095K1173K1243
8994B7093k786k952J7162J1336J1430k8777l158J6483K8715J860k9676l473K401
8981D5658l4506k3632K2405J8425R171j3586L035L8591K1442j4868j3539j1566
8969D7030k2576J6887k6488j741R665r908j3921J0764j198J2607j493j5445J0446
8956A4629K9082J0782J933P305j5640K9867M584M281m1415j1322J9056j7408j6286
8943A9448J2382J4341K3384M274j7889m1072l1227R782J9295m761o90J7894K6895
$$ plain form
8930 52056 45729 53197 21674 28535 44868 58547 55286 63772 77234 58239 42950 24917 27467
8917 27467 25415 8250 22647 44538 10132 12920 46380 61614 28773 -5080 2797 10626 31022
8904 31022 7689 782 22438 35140 27408 5591 9422 12344 -3138 -3450 -16207 -10269 -25362
8891 -25362 -33257 -7162 5500 -6205 25244 32054 13830 5797 -3523 -915 22004 23787 31300
8878 31300 17411 18241 63621 45499 14666 -17810 -32609 -12213 19615 22853 8486 8956 21844
8865 21844 52603 58352 48108 15576 25190 30927 41841 81006 77973 87303 56053 11362 -32132
8852 -32132 -43449 8818 34099 49184 59421 45535 19351 12937 33171 39460 14781 8043
8840 8043 23873 57994 56709 36071 14153 17728 -9424 -40908 -45484 -48242 -30852 -12154 -23715
$$ packed form
8930E2056o327P468l1523O861J6333J3679l261Q486J3462j8995j5289j8033K550
8917B7467k052j7165J4397K1891l4406K788L3460J5234l2841l3853P877P829K0396
8904C1022k3333o907K1656J2702p732k1817L831K922j5482l12j2757N938j5093
8891b5362p895K6095J2662j1705L1449O810j8224q033r320K608K2919J783P513
8878C1300j3889Q30M5380j8122l0833l2476j4799K0396L1828L238j4367M70J2888
8865B1844L0759N749j0244l2532R614N737J0914L9165l033R330l1250m4691m3494
8852c2132j1317N2267K5281J5085J0237j3886k6184o414K0234O289k4679o738
8840H043J5830L4121j285k0638k1918L575k7152l1484m576k758J7390J8698j1561
$$ plain form
8827 -23715 -29958 -22483 -16236 -17904 -31949 -54838 -38854 -32436 -43612 -46420 -32613 -40158 -46632
8814 -46632 -29001 -8210 23426 19488 -10390 -29118 -38744 -9223 3784 24822 50835 59438
8802 59438 56188 55989 57910 41157 23581 21641 19121 -2614 -20523 -17005 -17675 33513 61162 38765
8788 38765 3097 -23863 -25409 -25267 -17953 -1312 11826 19941 38849 31588 28519 51012 55738
8775 55738 20364 29314 62415 25915 -19856 -9236 -6297 -833 9730 -1937 -687 15502 37810
8762 37810 15181 -2045 -1856 -40638 -52712 -40486 6023 34890 62841 40757 17498 37021
8750 37021 36170 8720 17021 12712 21729 9823 30428 29401 22234 14456 17422 13331 -9420 -14836
8736 -14836 -10227 -24013 -6587 20988 -10229 -22373 13429 5947 -11513 -24274 -6909 8087
$$ packed form
8827b3715o243P475O247j668j4045k2889J5984O418j1176k808J3807p545o474
8814d6632J7631K0791L1636l938k9878j8728r626K9521J3007K1038K6013Q603
8802E9438l250j99J921j6753j7576j940k520k1735j7909L518o70N1188K7649k2397
8788C8765l5668k6960j546J42P314J6641J3138Q115J8908p261l069K2493M726
8775E5738l5374Q950L3101l6500m5771J0620K939N464J0563j1667J250J6189K2308
8762C7810k2629j7226J89l8782j2074J2226M6509K8867K7951k2084k3259J9523
8750C7021q51k7450Q301m309R017j1906K0605j027p167p778K966m091k2751n416
8736a4836M609j3786J7426K7575l1217j2144L5802p482j7460j2761J7365J4996
$$ plain form
8724 8087 -3351 -7760 4823 12563 -10266 -27652 -35250 -27755 -12413 -24520 -16334 1719 -14259
8711 -14259 -40948 -10411 15333 12753 15325 14521 30069 12196 13692 -4732 5160 4496 -5777
8698 -5777 21611 14411 -913 4067 42526 51312 31714 40973 49793 39396 29554 42641 73046
8685 73046 96190 71935 11953 -18817 -19674 -12740 1442 -5714 7296 13318 518 5472 -16581
8672 -16581 -32956 -10010 -3533 -43178 -47521 -28379 -29205 -3101 37211 55912 20444 5914 -5049
8659 -5049 -16216 -11081 -27904 -17176 -15403 -22134 -7934 -7133 -2051 5616 -14 -19628 -15477 3653
8645 3653 31512 43185 39680 21214 41853 77461 44112 35359 45907 51837 46681 58402 38527
8632 38527 48122 54591 34910 38559 74094 70752 43629 34123 48246 43875 50550 56683 64637 71968
$$ packed form
8724H087j1438m409J2583P740k2829j7386p598P495J5342j2107Q186J8053j5978
8711a4259k6689L0537K5744k580K572q04J5548j7873J496j8424R892o64j0273
8698e777K7388p200j5324M980L8459Q786j9598R259Q820j0397r842J3087L0405
8685G3046K3144k4255n9982l0770q57O934J4182p156J3010O022j2800M954k2053
8672a6581j6375K2946O477l9645m343J9142q26K6104M0312J8701l5468j4530j0963
8659e049j1167N135j6823J0728J773o731J4200Q01N082P667n630j9614M151J9130
8645C653K7859J1673l505j8466K0639L5608l3349q753J0548N930n156J1721j9875
8632C8527R595O469j9681L649L5535l342k7123r506J4123m371O675O133P954P331
$$ plain form
8618 71968 52007 38166 14722 29015 53578 70620 55772 39204 21729 17869 29393 36184
8606 36184 58070 55381 72994 84533 84197 91783 86746 76818 79824 56256 46054 58943 63476
8593 63476 60287 49267 44452 30915 49331 96669 122903 109049 61220 34101 56424 68582
8581 68582 76248 75146 54017 45995 27604 26407 41303 45249 56065 34418 8182 2248 14720
8568 14720 23653 38479 21036 9137 2838 -4957 -13149 -25851 -7812 -3246 12368 14261 5940
8555 5940 -6992 -15041 16697 13204 -8912 -3759 13234 44597 49187 50371 46934 16857 14532
8542 14532 15674 -5417 -24831 -43590 -45875 -40864 6254 15776 -2104 891 37349 25572 9844
8529 9844 24825 16149 826 15229 12333 32807 39112 24270 20677 1143 -7946 -4099 13832
$$ packed form
8618G1968j9961j3841k3444J4293K4563J7042j4848j6568j7475l860J1524O791
8606C6184K1886k689J7613J1539l36P586n037r928L006k3568j0202J2889M533
8593F3476l189j1020m815j3537J8416M7338K6234j3854m7829k7119K2323J2158
8581F8582P666j102k1129q022j8391j197J4896L946J0816k1647k6236n934J2472
8568A4720Q933J4826j7443j1899o299p795q192j2702J8039M566J5614J893q321
8555E940j2932q049L1738l493k2116N153J6993L1363M590J184l437l0077k325
8542A4532J142k1091j9414j8759k285N011M7118R522j7880K995L6458j1777j5728
8529I844J4981q676j5323J4403k896K0474O305j4842l593j9534r089L847J7931
$$ plain form
8516 13832 17786 12614 13158 29839 51232 29605 3539 -15092 -11407 -2215 -20169 -24176 16455
8503 16455 5634 -9584 7818 790 31847 37579 27203 -234 -30523 -26729 2405 31272
8491 31272 38434 43707 38074 14076 17472 28574 11467 16617 3656 -11296 -21475 -24710 -19855
8478 -19855 -26277 -13569 17605 13357 9635 -7777 -9989 34706 34634 10951 16184 15866 25669 17355
8464 17355 9530 1583 2190 -26943 -38579 -37942 -50789 -48464 -49626 -42140 -45116 -59374 -14604 16841
8450 16841 29315 35598 57210 37427 13620 -2917 22516 24430 -767 -10607 -36846 -26675
8438 -26675 -7334 -19628 -24944 -40254 -30260 -20180 -7840 -3703 -41271 -43647 -21589 -8352 -24988
8425 -24988 -41966 -25546 -10738 -57266 -43835 -2719 16007 -1168 17992 47297 32747 21803
$$ packed form
8516A3832L954n172N44J6681K1393k1627k6066j8631L685R192j7954m007M0631
8503A6455j0821j5218J7402p028L1057N732j0376k7437l0289L794K9134K8867
8491C1272P162N273n633k3998L396J1102j7107N150j2961j4952j0179l235M855
8478a9855o422J2708L1174m248l722j7412k212M4695p2k3683N233l18R803q314
8464A7355p825p947O07k9133j1636O37j2847K325j162P486k976j4258M4770L1445
8450A6841J2474O283K1612j9783k3807j6537K5433J914k5197r840k6239J0171
8438b6675J9341j2294n316j5310R994J0080J2340M137l7568k376K2058J3237j6636
8425b4988j6978J6420J4808m6528J3431M1116J8726j7175J9160K9305j4550j0944
$$ plain form
8413 21803 33272 48968 42964 -4685 -6970 1330 -2937 7805 35275 44398 5402 -22788 -12084
8400 -12084 20473 2966 -10034 -17732 -11849 -21748 -3237 -12051 -33922 -19347 -12628 -13806 -22744
8387 -22744 -52374 -55125 -59850 -96383 -82905 -47310 9713 20320 3429 23758 28561 24365 7123
8374 7123 -33525 -44266 -40413 -39462 -29974 -14419 9966 43516 31135 -1151 -11435 -14175 -11779
8361 -11779 -21624 -30163 -29594 -38225 -31293 -13046 -43887 -27421 -6271 -2726 532 -24494 -27225 19292
8347 19292 25906 43519 32736 23329 -787 -19375 -40278 8185 28593 28189 20847 -4181 -9612
8334 -9612 -19031 -28458 -42628 -5601 -10514 -26888 -57504 -42540 -35083 -50666 -35948 444 13595
8321 13595 14235 -21664 -43100 -48971 -28399 15622 29879 20227 9858 3501 -19641 -6060 9252
$$ packed form
8413B1803J1469J5696o004m7649k285Q300m267J0742K7470R123l8996k8190J0704
8400a2084L2557j7507j3000p698N883r899J8511q814k1871J4575O719j178q938
8387b2744k9630k751m725l6533J3478L5595N7023J0607j6891K0329M803m196j7242
8374G123m0648j0741L853R51R488J5555K4385L3550j2381l2286j0284k740K396
8361a1779r845q539N69q631O932J8247l0841J6466K1150L545L258k5026k731M6517
8347A9292O614J7613j0783r407k4116j8588k0903M8463K0408m04p342k5028n431
8334i612r419r427j4170L7027m913j6374l0616J4964P457j5583J4718L6392J3151
8321A3595O40l5899k1436n871K0572M4021J4257r652j0369o357k3142J3581J5312
$$ plain form
8308 9252 10774 43514 21107 9633 11282 -10222 -15112 24521 18158 13159 -13958 -32223 -33777
8295 -33777 -32239 -11442 -9646 -15730 -48450 -63824 -31245 -12738 -9168 -3781 3468 -2642 11177
8282 11177 11455 4996 3098 -16853 -28478 -3876 15772 -6279 1862 31461 41694 7851 -14325
8269 -14325 -19721 -307 15437 -12735 -25500 -40173 -41106 -14820 18328 35462 52533 13452
8257 13452 -11023 -14847 -3454 -12585 -39531 -46775 -3742 16275 -11024 -55715 -57756 -29889 7899
8244 7899 29968 -2456 23969 56662 56160 38756 40446 46038 51510 63496 51514 22439 -8854
8231 -8854 -32031 -15927 -15272 -18975 -20363 -19568 -33271 -38469 -28638 -10319 -1164 3099 34519 43409
8217 43409 49454 37986 13837 11441 -39409 -46210 -31857 -24913 -27376 -41982 -57947 -31002 -23875
$$ packed form
8308I252J522L2740k2407j1474J649k1504m890L9633o363m999k7117j8265j554
8295c3777J538K0797J796o084l2720j5374L2579J8507L570N387P249o110J3819
8282A1177K78o459j898j9951j1625K4602J9648k2051Q141K9599J0233l3843k2176
8269a4325n396J9414J5744k8172j2765j4673r33K6286L3148J7134J7071l9081
8257A3452k4475l824J1393r131k6946p244M3033K0017k7299m4691k041K7867L7788
8244G899K2069l2424K6425L2693n02j7404J690N592N472J1986j1982k9075l1293
8231h854k3177J6104O55l703j388P95j3703n198R831J8319R155M263L1420Q890
8217D3409O045j1468k4149k396n0850o801J4353O944k463j4606j5965K6945P127
$$ plain form
8204 -23875 951 46988 48525 45281 47757 80814 109400 126483 111386 83680 62161 38560
8192 38560 50798 72326 89687 79442 32296 -16180 -14004 -2775 -2579 -14710 -39706 -17594
8180 -17594 16369 8219 -2500 -22694 -23029 -17829 -30278 -21011 1463 -15962 2440 -5292 11781
8167 11781 46942 72613 57458 29258 24554 19409 24112 12959 10880 9413 1292 -30702 -25989
8154 -25989 -26004 -3101 29696 13709 -3388 3523 -4794 8238 27613 36725 48815 25991 -11170
8141 -11170 -37398 -21165 -20511 -29817 -10125 2385 1526 -301 -5602 -43202 -33269 -25457 -12172 -30386
8127 -30386 -13709 -14270 -4987 9901 15072 -8058 1664 19585 42780 66153 59442 42043 39814
8114 39814 31080 -5249 -5683 18007 27625 33335 46481 34666 45532 26905 33995 29151 19486
$$ packed form
8204b3875K4826M6037J537l244K476L3057K8586J7083j5097k7706k1519k3601
8192C8560J2238K1528J7361j0245m7146m8476K176J1229J96j2131k4996K2112
8180a7594L3963q150j0719k0194l35N200j2449R267K2474j7425J8402p732J7073
8167A1781L5161K5671j5155k8200m704n145M703j1153k079j467q121l1994M713
8154b5989j5K2903L2797j5987j7097O911q317J3032J9375R112J2090k2824l7161
8141a1170k6228J6233O54r306J9692J2510q59j827n301l7600R933P812J3285j8214
8127c0386J6677n61R283J4888N171k3130R722J7921K3195K3373o711j7399k229
8114C9814q734l6329m34K3690R618N710J3146j1815J0866j8627P090m844r665
$$ plain form
8101 19486 7604 -10769 -74 11250 -15565 -18116 12448 12694 4304 -2138 25789 6247 -28369
8088 -28369 -20810 918 6458 -30645 -38597 -33539 -26645 -20838 -43502 -45466 -39884 -69261 -96892
8075 -96892 -58182 -41653 -27982 -28887 -645 10551 29488 51949 42160 24007 7571 32434
8063 32434 42071 63554 44016 18078 24072 25034 47585 56361 20087 12142 20538 10843 -16068
8050 -16068 -8583 18945 38526 37015 39754 41980 23088 20050 25759 16356 6280 -5915 21151
8037 21151 8317 30020 13540 -2136 -16846 -18126 -15027 -18355 6618 21458 25698 849 -5289
8024 -5289 -15547 7118 30110 47219 47985 55369 84175 96594 124059 114955 59102 14903 12594
8011 12594 29200 48143 41287 37902 33060 10697 15346 32497 15189 32223 38370 23745 3827
$$ packed form
8101A9486j1882j8373J0695J1324k6815k551L0564K46q390o442K7927j9542l4616
8088b8369P559K1728N540l7103p952N058O894N807k2664j964N582k9377k7631
8075i6892L8710J6529J3671r05K8242J1196J8937K2461r789j8153j6436K4863
8063C2434R637K1483j9538k5938N994R62K2551Q776l6274p945Q396r695k6911
8050a6068P485K7528J9581j511K739K226j8892l038N709r403j0076j2195K7066
8037B1151j2834K1703j6480j5676j4710j280L099l328K4973J4840M240k4849o138
8024e289j0258K2665K2992J7109P66P384K8806J2419K7465r104n5853m4199k309
8011A2594J6606J8943o856l385m842k2363M649J7151j7308J7034O147j4625j9918
$$ plain form
7998 3827 12787 6659 -3846 -10110 14546 49092 44637 7268 -22967 13688 30785 43444 35365
7985 35365 42674 65725 57403 50741 69319 56163 43477 19023 18731 20449 10181 31597 23651
7972 23651 7791 37948 62942 51659 31598 32921 45339 6839 -14135 20365 40193 41702
7960 41702 14302 22399 35732 27532 26115 32972 24477 17187 22390 1761 -8065 -2595 -4123 16427
7946 16427 -7659 -15160 15945 44258 60678 35714 17037 11593 -1135 -20222 -46660 -17912
7934 -17912 31689 17140 354 -7896 -17991 -7937 14008 20619 -1071 -5738 13228 40413
7922 40413 34247 8759 19565 25409 -12803 -23457 -21747 152 16132 -1802 -18398 -10928 -8494
7909 -8494 -38465 -37690 -6913 8907 11604 10070 -22819 -40328 -39403 -18633 5985 25730 48381
$$ packed form
7998C827Q960o128j0505o264K4656L4546m455l7369l0235L6655J7097J2659q079
7985C5365P309K3051q322o662J8578j3156j2686k4454k92J718j0268K1416p946
7972B3651j5860L0157K4994j1283k0061J323J2418l8500k0974L4500J9828J509
7960D1702k7400Q097J3333q200j417O857q495p290N203k0629r826N470j528K0550
7946A6427k4086p501L1105K8313J6420k4964j8677n444j2728j9087k6438K8748
7934a7912M9601j4549j6786q250j0095J0054K1945O611k1690m667J8966K7185
7922D0413o166k5488J0806N844l8212j0654J710K1899J5980j7934j6596P470K434
7909h494k9971P75L0777J5820K697j534l2889j7509R25K0770K4618J9745K2651
$$ plain form
7896 48381 62149 38193 44471 26289 9476 29735 59514 82465 62055 36090 35693 41907 15850
7883 15850 11506 11512 26672 -4073 -19730 -10707 -29170 -43914 -41664 -32292 -19381 -24046 162 20346
7869 20346 19153 24809 7668 -5251 1645 -14318 -14057 -26992 -37799 -29274 -18602 -6042 21499
7856 21499 38616 39170 38350 59687 45937 14693 34057 15433 7990 -2904 -3117 -1444 10385
7843 10385 -2938 -9152 14506 27004 9660 8676 28990 28607 -17568 -50966 -50101 -48513 -5837
7830 -5837 26275 39874 24545 19890 28226 19720 19242 16057 20678 -2623 -28304 -39140 -30725 -24484
7816 -24484 -11865 -2344 -8279 -7509 -2950 8100 12422 -2774 -15557 -32036 -41945 -35055 -43891 -56587
7802 -56587 -35289 -6171 -10630 -25173 -42943 -28436 -8484 8308 17457 -9395 -18429 -7089
$$ packed form
7896D8381J3768k3956O278j8182j6813K0259K9779K2951k0410k5965l97O214k6057
7883A5850m344OJ5160l0745j5657R023j8463j4744K250R372J2911m665K4208K0184
7869B0346j193N656j7141j2919O896j5963K61j2935j0807Q525J0672J2560K7541
7856B1499J7117N54q20K1337j3750l1244J9364j8624p443j0894k13J673J1829
7843A0385j3323o214K3658J2498j7344r84K0314l83m6175l3398Q65J588M2676
7830e837L2112J3599j5329m655Q336q506m78l185M621k3301k5681j0836Q415O241
7816b4484J2619R521n935P70M559J1050M322j5196j2783j6479r909O890q836j2696
7802e6587K1298K9118m459j4543j7770J4507J9952J6792R149k6852r034J1340
$$ plain form
7790 -7089 -19917 -33103 -21728 -9428 11936 24168 19501 -3261 -47850 -78071 -67421 -38822
7778 -38822 18827 32287 28477 29538 17199 5955 -13404 -3168 -10358 4584 33956 33773 17777
7765 17777 31495 50715 39456 39736 26489 1175 17183 39966 48640 19044 4563 -9476
7753 -9476 -10932 2388 37216 35217 11705 -1513 5881 8718 16220 5971 -23489 -18709 -22631
7740 -22631 -20615 -44369 -47491 -16008 6692 25066 20514 9546 -2760 -933 -5792 -31582 -26469
7727 -26469 -41301 -49276 -7776 22563 3078 -30040 -49811 -50721 -46734 -50345 -56064 -79300 -96179
7714 -96179 -140050 -139658 -89630 -59308 -54933 -73023 -85788 -72573 -62842 -66434 -82478 -84100 -78914
7701 -78914 -79991 -73763 -71472 -30289 -10193 6962 22508 -2584 -46156 -43936 -32706 -25304 -85
$$ packed form
7790g089j2828j3186J1375J2300K1364J2232m667k2762m4589l0221J0650K8599
7778c8822N7649J3460l810J061j2339j1244j9359J0236p190J4942K9372j83j5996
7765A7777J3718J9220j1259K80j3247k5314J6008K2783Q674k9596j4481j4039
7753i476j456J3320L4828j999k3512j3218P394K837P502j0249k9460M780l922
7740b2631K016k3754l122L1483K2700J8374m552j0968j2306J827m859k5790N113
7727b6469j4832p975M1500L0339j9485l3118j9771r10L987l611n719k3236j6879
7714i6179m3871L92N0028L0322M375j8090j2765J3215R731l592j6044j622N186
7701g8914j077O228K291M1183K0096J7155J5546k5092m3572K220J1230P402K5219
$$ plain form
7688 -85 -8231 -15510 -27338 19534 31374 32834 27842 41213 45228 5291 -24769 -23647 -10259 22066
7674 22066 11290 22605 19933 -12232 -39735 -52181 -29755 -1673 208 -4003 -6515 -18743 5169
7661 5169 8523 -10274 -10885 9939 8546 9122 30045 38671 19254 -13403 -17088 4889 10631 17910
7647 17910 6513 4152 -3206 15979 5021 30685 24516 10147 19910 4342 8493 41436 50818
7634 50818 46510 30092 -4827 -8412 31192 60951 60887 39369 11990 9244 4358 10657 24651
7621 24651 43290 59257 45677 29540 21063 -6758 -59485 -52891 -34611 -5474 8612 8267 18427
7608 18427 -6905 1131 -9097 4745 30307 2810 -10297 -14003 -13644 -21992 -26651 -3708 -12795
7595 -12795 -31652 -35540 -28201 -16021 2636 24273 36508 39660 28060 -19594 -59124 -34600
$$ packed form
7688h5q146p279j1828M6872J1840J460m992J3371M015l9937l0060J122J3388L2325
7674B2066j0776J1315k672l2165k7503j2446K2426K8082J881m211k512j2228K3912
7661E169L354j8797o11K0824j393N76K0923Q626j9417l2657l685K1977N742P279
7647A7910j1397k361p358J9185j0958K5664o169j4369R763j5568M151L2943R382
7634E0818m308j6418l4919l585L9604K9759o4k1518k7379k746m886O299J3994
7621B4651J8639J5967j3580j6137q477k7821n2727O594J8280K9137J4086l45J0160
7608A8427k5332Q036j0228J3842K5562k7497j3107l706L59q348m659K2943r087
7595a2795j8857l888P339J2180J8657K1637J2235L152j1600m7654l9530K4524
$$ plain form
7583 -34600 3931 28990 37169 9871 -22164 -24706 -27141 -19610 -358 8739 16414 39396 65489
7570 65489 39546 5787 -22774 -18238 31199 41066 63230 46771 20508 29842 26935 35531 18644
7557 18644 22712 28749 18114 -10999 -9162 12788 -11082 -30060 -31656 -29257 -49278 -36398 -18308
7544 -18308 7359 15344 30793 -21036 -91533 -86351 -40722 -17811 -3572 -20622 -27301 -17765 9422
7531 9422 -24440 -43655 -37470 -22609 -29977 -46337 -44298 -21873 11973 16216 13765 -3828 -42593
7518 -42593 -50215 1687 -10816 -27759 -32631 -10470 -28033 -46527 -19676 -20582 -38139 -16022 -11010
7505 -11010 -4493 -20057 -56948 -64922 -44729 -24020 -22661 -42733 -44971 -33514 -21927 -41616 -40416
7492 -40416 -17737 -6218 6806 23704 -3069 -45730 -47595 -20282 10053 14197 15838 11255 15337
$$ packed form
7583c4600L8531K5059Q179k7298l2035k542k435P531J9252R097P675K2982K6093
7570F5489k5943l3759k8561M536M9437R867K2164j6459k6263R334k907Q596j6887
7557A8644M068O037j0635k9113J837K1950k3870j8978j596K399k0021J2880J8090
7544a8308K5667P985J5449n1829p0497N182M5629K2911J4239j7050o679R536K7187
7531I422l3862j9215O185J4861p368j6360K039K2425L3846M243k451j7593l8765
7518d2593p622N1902j2503j6943m872K2161j7563j8494K6851r06j7557K2117N012
7505a1010O517j5564l6891p974K0193K0709J359k0072k238J1457J1587j9689J200
7492d0416K2679J1519J3024J6898k6773m2661j865K7313L0335M144J641m583M082
$$ plain form
7479 15337 7730 -17915 -39676 -59664 -21542 -1062 27562 35305 6546 -35470 -32569 -1522
7467 -1522 10570 -1060 -36662 -42587 -52474 -39698 -18559 -11783 5538 -2032 -34234 -23219 -2635
7454 -2635 -22622 -28956 -25946 -36641 -26772 -34940 -35303 -28133 -12281 9511 21971 -9770 -31354
7441 -31354 -21425 -11971 8304 -8686 -23841 -26595 -25350 -4389 -4809 -11505 -21086 -74945 -79795 -37567
7427 -37567 -27946 -25497 -23016 -23563 -37741 -43428 -52068 -46531 -32062 -33244 -32015 -26219 -9776 -82
7413 -82 12297 17582 35062 36002 7854 19080 -1358 -14408 -22018 -3210 24776 33532 14683
7400 14683 5561 -4475 -45861 -48429 -54280 -64540 -25518 18142 33806 28294 36026 41879 33573
7387 33573 -11943 -12360 13994 -14568 -19088 -28463 -47541 -29560 5050 -1395 -20918 -41346 1554
$$ packed form
7479A5337p607k5645k1761j9988L8122K0480K8624P743k8759m2016K901L1047
7467a522J2092j1630l5602n925r887J2776K1139O776J7321p570l2202J1015K0584
7454b635j9987o334L010j0695R869q168l63P170J5852K1792J2460l1741k1584
7441c1354R929R454K0275j6990j5155k754J245K0961m20o696r581n3859m850M2228
7427c7567R621K449K481n47j4178n687q640N537J4469j182J229N796J6443R694
7413h2J2379N285J7480R40k8148J1226k0438j3050p610J8808K7986Q756j8849
7400A4683r122j0036m1386k568n851j0260L9022M3660J5664n512P732N853q306
7387C3573m5516m17K6354k8562m520r375j9078J7981L4610o445j9523k0428M2900
$$ plain form
7374 1554 19140 -41453 -86311 -64671 -29433 1264 -11127 2216 13813 2415 26431 23399
7362 23399 7747 -168 10695 17355 1581 -3459 -4433 -7051 -33519 -29774 11938 16817 19281 18996
7348 18996 11224 -6299 -11118 -16559 -13427 -7758 -20439 -40791 -46013 -58831 -75356 -50279 -27477
7335 -27477 -19760 -5982 -30981 -23649 -16445 5820 45712 42213 11439 -8659 -4091 -1846 -14265
7322 -14265 -49248 -48413 -37534 -55823 -60788 -13240 -1415 -11964 -1949 -28747 -39516 -32459 -45757
7309 -45757 -15931 17412 9301 -19048 -14151 -34877 -24659 -16833 3087 9402 -27495 -52198 -4872
7296 -4872 34650 -16771 -5062 3754 -4895 18669 32581 48285 31557 14107 18075 16342 17946
7283 17946 12958 20809 538 -21160 -44051 -43545 -25671 -35886 -70522 -60308 -48346 -45647 -27890
$$ packed form
7374A554J7586o0593m4858K1640L5238L0697j2391J3343J1597j1398K4016l032
7362B3399j5652p915J0863O660j5774n040r74k618k6468L745M1712M879K464k85
7348A8996p772j7523m819n441L132N669j2681k0352n222j2818j6525K5077K2802
7335b7477P717J3778k4999P332P204K2265L9892l499l0774k0098M568K245j2419
7322a4265l4983Q35J0879j8289m965M7548J1825j0549J0015k6798j0769P057j3298
7309d5757K9826L3343q111k8349M897k0726J0218P826J9920O315l6897k4703M7326
7296d872L9522n1421J1709Q816q649K3564J3912J5704j6728j7450L968j733J604
7283A7946m988P851k0271k1698k2891N06J7874j0215l4636J0214J1962K699J7757
$$ plain form
7270 -27890 -9005 7042 34178 34708 16287 17835 26275 26643 35399 8734 -11543 -4167 20704
7257 20704 29276 20479 34484 37285 32664 14152 35756 51110 15247 -41017 -42807 -54650 -57308
7244 -57308 -37668 -19488 -28240 -19331 -5277 26711 35499 42392 24826 -2607 -24704 -36023 -54557
7231 -54557 -65898 -71803 -59917 -29113 -43056 -46928 -57776 -35745 -1398 7298 7044 11869 16013
7218 16013 -7594 -41757 -63958 -40803 -33258 6325 19985 -15226 -14973 2454 31350 41400
7206 41400 6580 9117 16690 13315 -20264 -29266 -14672 -33978 -37981 -32364 -4964 465 50472
7193 50472 84151 77306 41913 -4507 -18507 -2190 -8787 -20411 -33529 -33189 -22523 -15072 -30441
7180 -30441 -15484 -24305 -14361 -19161 -11897 7031 7138 21415 47611 39213 36225 46677 29529
$$ packed form
7270b7890J8885J6047K7136N30j8421J548Q440L68Q756k6665k0277P376K4871
7257B0704Q572q797J4005K801m621j8512K1604J5354l5863n6264j790j1843k658
7244e7308J9640J8180q752Q909J4054L1988Q788O893j7566k7433k2097j1319j8534
7231e4557j1341n905J1886L0804j3943l872j0848K2031L4347Q696k54M825M144
7218A6013k3607l4163k2201K3155P545L9583J3660l5211K53J7427K8896J0050
7206D1400l4820K537P573l375l3579r002J4594j9306m003N617K7400N429N0007
7193E0472L3679o845l5393m6420j4000J6317o597j1624j3118L40J0666P451j5369
7180c0441J4957q821R944m800P264J8928J07J4277K6196q398k988J0452j7148
$$ plain form
7167 29529 16339 -1681 12776 3432 -8827 -15553 21038 17348 6626 -19858 -30155 -14470
7155 -14470 -1879 -27498 -55080 -54962 -58273 -59147 -80863 -66265 -66143 -58277 -60384 -50984 -28880 -5031
7141 -5031 -15069 -54411 -51939 -28303 -16287 -17763 -35179 -9544 -8935 -40233 -46232 -27362 -15799
7128 -15799 -10986 11296 14659 -11203 -1605 4954 -26980 -24851 -9325 -26891 -20666 -3362 -35288
7115 -35288 -48766 -16001 9473 16095 22090 40923 50117 31922 39135 18528 -16120 -42338 -7234
7102 -7234 25482 49767 82426 58160 -5766 -43998 -55864 -68201 -48245 -32842 3493 27847
7090 27847 22989 -7535 -25876 -25929 -40984 -21889 6419 20499 2176 -12018 24794 41155 28502
7077 28502 17203 26578 20098 -10540 -34836 -13889 -22669 -44676 -53325 -29805 -40410 -25728 9192
$$ packed form
7167B9529j3190j8020J4457r344j2259o726L6591l690j0722k6484j0297J5685
7155a4470J2591k5619k7582J18l311q74k1716J4598J22P866k107R400K2104K3849
7141e031j0038l9342K472K3636J2016j476j7416K5635O09l1298n999J8870J1563
7128a5799M813K2282L363k5862R598O559l1934K129J5526j7566O225J7304l1926
7115c5288j3478L2765K5474O622N995J8833R194j8195P213k0607l4648k6218L5104
7102g234L2716K4285L2659k4266o3926l8232j1866j2337J9956J5403L6335K4354
7090B7847m858l0524j8341n3j5055J9095K8308J4080j8323j4194L6812J6361j2653
7077B8502j1299R375o480l0638k4296K0947q780k2007q649K3520j0605J4682L4920
$$ plain form
7064 9192 -3690 -15762 -23402 -28401 6254 49287 56994 35278 -7864 -36246 -33420 -14194 -6064
7051 -6064 522 9929 629 3397 -7583 -24783 -28284 -25547 -5037 5365 40700 36679 2301
7038 2301 5206 8260 23416 16098 413 -5951 -4581 8791 24791 17572 -11903 -14397 -12803 -3662
7024 -3662 -10071 -6419 22232 9501 -3893 -19613 -47356 -13437 22262 39453 -4574 -28032
7012 -28032 -16547 -16079 -15236 26209 22351 -16192 -18432 -2932 -21135 -53817 -78184 -59162 -21995
6999 -21995 -18806 -3135 8561 28323 -1119 -29701 -44826 -46737 -27129 970 23194 24499
6987 24499 12185 12624 11782 19035 56450 25300 -7917 -32235 -39134 -54361 -52858 -42059 -28242
6974 -28242 -35133 -43816 -42579 -37443 -39095 -48731 -39970 -58022 -87046 -69470 -36072 -13116 792
$$ packed form
7064I192j2882j2072p640m999L4655M3033P707k1716m3142k8382K826J9226Q130
7051f064O586R407r300K768j0980j7200l501K737K0510J0402L5335m021l4378
7038B301K905L054J5156p318j5685o364J370J3372J6000p219k9475k494J594R141
7024c662o409L652K8651j2731j3394j5720k7743L3919L5699J7191m4027k3458
7012b8032J1485M68Q43M1445l858l8543k240J5500j8203l2682k4367J9022L7167
6999b1995L189J5671J1696J9762k9442k8582j5125j911J9608K8099K2224J305
6987B4499j2314M39q42P253L7415l1150l3217k4318o899j5227J503J0799J3817
6974b8242o891q683J237N136j652r636Q761j8052k9024J7576L3398K2956J3908
$$ plain form
6961 792 -11983 -47231 -42343 -3289 -25676 -3315 28828 33324 34492 43860 48647 19996 -11078
6948 -11078 -32386 -41086 -61029 -37681 4105 -10443 -44770 -47957 -18309 -4508 24511 38481
6936 38481 38465 36570 27066 34208 40966 14352 1984 7422 -870 -21943 -22079 -19494 -30367 -65133
6922 -65133 -48711 -3721 34152 23584 25686 1097 -3574 -10498 -36996 -28537 -37118 -28176 -15253
6909 -15253 -6024 -4054 -23270 -21188 -12550 -11721 -17775 10665 32235 45929 54203 42760 25608
6896 25608 407 -12599 -36882 -37148 -44942 -19123 21074 22144 31046 35825 22417 16755 30451
6883 30451 16026 -388 -36034 -46201 -13383 5719 11108 14362 20001 10281 4525 25755 32915
6870 32915 7012 19846 18344 20858 -260 -2861 8087 -1104 -3608 -4909 -21883 -15830 10768
$$ packed form
6961G92j2775l5248M888L9054k2387K2361L2143M496J168R368M787k8651l1074
6948a1078k1308q700j9943K3348M1786j4548l4327l187K9648J3801K9019J3970
6936C8481j6j895r504P142O758k6614j2368N438q292k1073j36K585j0873l4766
6922f5133J6422M4990L7873j0568K102k4589m671o924k6498Q459q581Q942J2923
6909a5253R229J970j9216K082Q638Q29o054K8440K1570J3694Q274j1443j7152
6896B5608k5201j3006k4283k66p794K5819M0197J070Q902M779j3408n662J3696
6883C0451j4425j6414l5646j0167L2818J9102N389L254N639r720n756K1230P160
6870C2915k5903J2834j502K514k1118k601J0948r191k504j301j6974O053K6598
$$ plain form
6857 10768 33251 9924 6603 16657 42828 41182 12939 18578 47302 41853 5016 9375 17786
6844 17786 -2700 5545 -15969 -33705 -24311 19964 62692 67050 38326 36088 42147 51971 54060
6831 54060 34782 9349 -29741 5283 46593 58073 48138 50639 91222 119515 115707 117952 93761
6818 93761 60529 38803 30112 9621 -16834 -43398 -18340 10570 -2649 -1598 2 17966
6806 17966 32489 38482 35533 34466 51203 24204 24034 22221 -9115 -29025 2741 27117 19604
6793 19604 10153 18090 379 -3286 -11037 -24839 -25914 6163 -2409 -8123 10576 32176 7973
6780 7973 15618 14337 33924 75076 51230 11483 10403 10537 708 30115 34615 19772 26608 39760
6766 39760 30743 24133 26581 29545 23601 40314 67720 78635 95417 103191 110207 142071 164662
$$ packed form
6857A0768K2483k3327l321J0054K6171j646k8243N639K8724n449l6837M359Q411
6844A7786k0486Q245k1514j7736R394M4275M2728M358k8724k238O059R824K089
6831E4060j9278k5433l9090L5024M1310J1480r935K501M0583K8293l808K245k4191
6818I3761l3232k1726q691k0491k6455k6564K5058K8910j3219J051J600J7964
6806A7966J4523N993k949j067J6737k6999j70j813l1336j9910L1766K4376p513
6793A9604r451P937j7711l665p751j3802j075L2077q572n714J8699K1600k4203
6780G973P645j281J9587M1152k3846l9747j080J34r829K9407M500j4843O836J3152
6766C9760r017o610K448K964n944J6713K7406J0915J6782P774P016L1864K2591
$$ plain form
6753 164662 178032 191220 170968 167739 187413 201201 199584 204643 216379 284350 284011 239430 243426
6740 243426 272715 260737 236677 224127 214109 211188 264496 333332 351438 305753 323066 311356
6728 311356 329299 363002 358795 362576 414467 499735 568259 622636 663038 644845 607402 520709
$$ packed form
6753A64662J3370J3188k0252l229J9674J3788j617N059J1736O7971l39m4581L996
6740B43426K9289j1978k4060j2550j0018k921N3308O8836J8106m5685J7313j1710
6728C11356J7943L3703m207L781N1891Q5268O8524N4377M0402j8193l7443q6693
$$ [...]
##END NTUPLES=NMR SPECTRUM
##END=
