##TITLE=Analysis number 319755
Compound Code cc 49610
Book Reference 493/6/2
Project Code adrs
Chemist Name peted
##JCAMPDX= 6.0         $$ Bruker NMR JCAMP-DX V2.0
##DATA TYPE= NMR SPECTRUM
##DATA CLASS= NTUPLES
##ORIGIN= Bruker BioSpin GmbH
##OWNER= nmr
$$ XWIN-NMR		Version 3.5
$$ Thu May 25 13:37:29 2006 GMT Daylight Time (UT+1h)  MAYBRIDGE\nmr@NMR_250MHZ
##.OBSERVE FREQUENCY= 250.131544655141
##.OBSERVE NUCLEUS= ^1H
##.ACQUISITION MODE= SIMULTANEOUS (DQD)
##.ACQUISITION SCHEME= undefined
##.AVERAGES= 16
##.DIGITISER RES= 18
##SPECTROMETER/DATA SYSTEM= dpx250
##.PULSE SEQUENCE= zg30
##.SOLVENT NAME= CDCl3
##.SHIFT REFERENCE= (INTERNAL, CDCl3, 0, 16.522)
##AUDIT TRAIL= $$ (NUMBER, WHEN, WHO, WHERE, WHAT)
$$ ##TITLE= Audit trail, XWIN-NMR		Version 3.5
$$ ##JCAMPDX= 5.01
$$ ##ORIGIN= Bruker BioSpin GmbH
$$ ##OWNER= nmr
$$ C:\u/data/dgb/nmr/ADRS/5180/pdata/1/auditp.txt
$$ ##AUDIT TRAIL=  $$ (NUMBER, WHEN, WHO, WHERE, WHAT)
(   1,<2006-05-25 13:37:07.49 +100>,<MAYBRIDGE\nmr>,<NMR_250MHZ>,
      <created by zg, POWCHK disabled, PULCHK disabled
       configuration hash MD5:
       84 BC 41 DB A1 6E 1D 46 DA 25 12 A5 C1 ED C5 3A
       data hash MD5: 64K
       B2 3B DD B6 CE D8 D4 A0 F6 24 04 91 6B 79 55 6B>)
(   2,<2006-05-25 13:37:20.01 +100>,<MAYBRIDGE\nmr>,<NMR_250MHZ>,
      <Start of raw data processing
       ef LB = 0.3 FT_mod = 6 PKNL = 1 SI = 32K 
       data hash MD5: 32K
       8F CF D7 AF 1F 0D 28 5E 65 7B 06 30 F6 9C 2C 5A>)
(   3,<2006-05-25 13:37:21.54 +100>,<MAYBRIDGE\nmr>,<NMR_250MHZ>,
      <apk 
       data hash MD5: 32K
       52 DB F0 57 73 FD 66 25 D2 C9 F1 9F 79 9E 00 E9>)
(   4,<2006-05-25 13:37:22.26 +100>,<MAYBRIDGE\nmr>,<NMR_250MHZ>,
      <abs ABSG = 5 
       data hash MD5: 32K
       97 3A AA EE 4E 38 48 09 02 EA 71 CC 73 A4 59 CE>)
$$ ##END=
$$ 
$$ hash MD5
$$ 63 17 03 48 B7 69 FD E9 43 B5 FB 26 6E 2E 90 BA
##$RELAX= 
##$RELAX= 
##$RELAX= 
##$RELAX= 
##$RELAX= 
##$RELAX= 
##$RELAX= 
$$ Bruker specific parameters
$$ --------------------------
##$DU= <C:\u>
##$EXPNO= 5180
##$NAME= <ADRS>
##$PROCNO= 1
##$TYPE= <nmr>
##$USER= <dgb>
##$AMP= (0..31)
100 100 100 100 100 100 100 100 100 100 100 100 100 100 100 100 100 100 
100 100 100 100 100 100 100 100 100 100 100 100 100 100 
##$AQSEQ= 0
##$AQ_mod= 3
##$AUNM= <au_zg>
##$AUTOPOS= <59 >
##$BF1= 250.13
##$BF2= 250.13
##$BF3= 250.13
##$BF4= 250.13
##$BF5= 500.13
##$BF6= 500.13
##$BF7= 500.13
##$BF8= 500.13
##$BYTORDA= 1
##$CFDGTYP= 0
##$CFRGTYP= 5
##$CHEMSTR= <none>
##$CNST= (0..31)
1 1 145 1 1 1 1 1 1 1 1 1 1 1 1 1 1 1 1 1 1 1 1 1 1 1 1 1 1 1 1 1 
##$CPDPRG= <>
##$CPDPRG1= <>
##$CPDPRG2= <>
##$CPDPRG3= <>
##$CPDPRG4= <mlev>
##$CPDPRG5= <mlev>
##$CPDPRG6= <mlev>
##$CPDPRG7= <mlev>
##$CPDPRG8= <mlev>
##$CPDPRGB= <>
##$CPDPRGT= <>
##$D= (0..31)
0 1 0 0 0 0 0 0 0 0.06 0 0 0 0 0 0 0.0002 0 0 0 0 0 0 0 0 0 0 0 0 0 0 
0 
##$DATE= 1148560626
##$DBL= (0..7)
120 120 120 120 120 120 120 120 
##$DBP= (0..7)
150 150 150 150 150 150 150 150 
##$DBP07= 0
##$DBPNAM0= <>
##$DBPNAM1= <>
$$ [...]
##$SUBNAM7= <"">
##$SUBNAM8= <"">
##$SUBNAM9= <"">
##$SW= 20.6930455092707
##$SWIBOX= (0..15)
0 0 3 0 0 0 0 0 0 0 0 0 0 0 0 0 
##$SW_h= 5175.983436853
##$TD= 65536
##$TD0= 1
##$TE= 295.16
##$TE2= 300
##$TE3= 300
##$TEG= 300
##$TL= (0..7)
0 120 120 120 120 120 120 120 
##$TP= (0..7)
150 150 150 150 150 150 150 150 
##$TP07= 0
##$TPNAME0= <>
##$TPNAME1= <>
##$TPNAME2= <>
##$TPNAME3= <>
##$TPNAME4= <>
##$TPNAME5= <>
##$TPNAME6= <>
##$TPNAME7= <>
##$TPOAL= (0..7)
0.5 0.5 0.5 0.5 0.5 0.5 0.5 0.5 
##$TPOFFS= (0..7)
0 0 0 0 0 0 0 0 
##$TUNHIN= 0
##$TUNHOUT= 0
##$TUNXOUT= 0
##$USERA1= <user>
##$USERA2= <user>
##$USERA3= <user>
##$USERA4= <user>
##$USERA5= <user>
##$V9= 5
##$VALIST= <valist>
##$VCLIST= <CCCCCCCCCCCCCCC>
##$VD= 0
##$VDLIST= <DDDDDDDDDDDDDDD>
##$VPLIST= <PPPPPPPPPPPPPPP>
##$VTLIST= <TTTTTTTTTTTTTTT>
##$WBST= 1024
##$WBSW= 4
##$XGAIN= (0..3)
0 0 0 0 
##$XL= 0
##$YL= 0
##$YMAX_a= 231106
##$YMIN_a= -329810
##$ZGOPTNS= <>
##$ZL1= 120
##$ZL2= 120
##$ZL3= 120
##$ZL4= 120
##$ABSF1= 16.522
##$ABSF2= -4.171173
##$ABSG= 5
##$ABSL= 3
##$ALPHA= 0
##$AQORDER= 0
##$ASSFAC= 0
##$ASSFACI= 0
##$ASSFACX= 0
##$ASSWID= 0
##$AUNMP= <proc_1d>
##$AZFE= 0.1
##$AZFW= 0.1
##$BCFW= 0
##$BC_mod= 0
##$BYTORDP= 0
##$COROFFS= 0
##$CY= 12.5
##$DATMOD= 1
##$DC= 0
##$DFILT= <>
##$DTYPP= 0
##$F1P= 14.0000005364418
##$F2P= -0.99999901652339
##$FCOR= 0.5
##$FTSIZE= 32768
##$FT_mod= 6
##$GAMMA= 0
##$GB= 0
##$INTBC= 1
##$INTSCL= 1
##$ISEN= 128
##$LB= 0.3
##$LEV0= 0
##$LPBIN= 0
##$MAXI= 10000
##$MC2= 0
##$MEAN= 0
##$ME_mod= 0
##$MI= 0
##$NCOEF= 0
##$NC_proc= -3
##$NLEV= 6
##$NOISF1= 0
##$NOISF2= 0
##$NSP= 0
##$NTH_PI= 0
##$NZP= 0
##$OFFSET= 16.522
##$PC= 1
##$PHC0= 177.2929
##$PHC1= 3.292202
##$PH_mod= 1
##$PKNL= yes
##$PPARMOD= 0
##$PSCAL= 4
##$PSIGN= 0
##$REVERSE= no
##$SF= 250.13
##$SI= 32768
##$SIGF1= 0
##$SIGF2= 0
##$SINO= 400
##$SIOLD= 32768
##$SREGLST= <1H.CDCl3>
##$SSB= 0
##$STSI= 32768
##$STSR= 0
##$SW_p= 5175.98343685301
##$SYMM= 0
##$S_DEV= 0
##$TDeff= 65536
##$TDoff= 0
##$TI= <Analysis number 999999
Compound Code 99
Book Reference 9
Project Code 9>
##$TILT= no
##$TM1= 0
##$TM2= 0
##$TOPLEV= 0
##$USERP1= <user>
##$USERP2= <user>
##$USERP3= <user>
##$USERP4= <user>
##$USERP5= <user>
##$WDW= 1
##$XDIM= 32768
##$YMAX_p= 317868954
##$YMIN_p= -228936
$$ End of Bruker specific parameters
$$ ---------------------------------
##NTUPLES= NMR SPECTRUM
##VAR_NAME=  FREQUENCY,     SPECTRUM/REAL,   SPECTRUM/IMAG
##SYMBOL=    X,             R,               I
##VAR_TYPE=  INDEPENDENT,   DEPENDENT,       DEPENDENT
##VAR_FORM=  AFFN,          ASDF,            ASDF
##VAR_DIM=   32768,         32768,           32768
##UNITS=     HZ,            ARBITRARY UNITS, ARBITRARY UNITS
##FACTOR=    0.157963299565203, 1,           1
##FIRST=     4132.6476996994, 0,             0
##LAST=      -1043.33573715361, 0,           0
##MIN=       -1043.33573715361, -228936,     0
##MAX=       4132.6476996994, 317868954,     0
$$ Real data points
##PAGE= N=1
##DATA TABLE= (X++(R..R)), XYDATA
$$ [...]
$$ plain form
16395 -104830 -171844 -108997 -76839 -29791 -22681 -21361 -11325 -18169 -52492 -72033 -45731 -15973
16383 -15973 -35235 -41227 -44394 -43566 -30805 -53895 -66554 -63081 -38579 12111 12540 35609 4253
16370 4253 40072 40837 49479 87917 52446 -11000 -20386 -14232 24337 37809 -18517 18535 90290
16357 90290 147557 77476 688 -58742 -53983 -67426 -59489 -23062 -20440 75552 152227 143118
16345 143118 119044 85248 32193 -39781 11597 26653 -34022 5970 -8644 -29231 3466
16334 3466 -5033 -15260 -64439 -56136 -38080 -80451 -66726 -15104 14703 15524 54817 11818 3376
16321 3376 23433 9213 34776 87324 85864 61847 38989 14652 -35567 -4402 13209 5408
16309 5408 27966 -7260 3520 15648 -32286 -66244 -24491 21668 249 -11415 -10466 -22614
$$ packed form
16395a04830o7014O2847L2158M7048P110J320J0036o844l4323j9541K6302K9758
16383a5973j9262n992l167Q28J2761k3090j2659L473K4502N0690M29K3069l1356
16370D253L5819P65Q642L8438l5471o3446r386O154L8569J3472n6326L7052P1755
16357I0290N7267p0081p6788n9430M759j3443P937L6427K622R5992P6675r109
16345A43118k4074l3796n3055p1974N1378J5056o0675L9992j4614k0587L2697
16334C466q499j0227m9179Q303J8056m2371J3725N1622K9807Q21L9293m2999q442
16321C376K0057j4220K5563N2548j460k4017k2858k4337n0219L1165J7611p801
16309E408K2558l5226J0780J2128m7934l3958M1753M6159k1419j1664R49j2148
$$ plain form
16297 -22614 18723 94263 80451 -16897 -85315 -14705 -91 10319 14512 23868 -4849 48727
16285 48727 73388 110047 81541 67470 56569 -10780 -85850 -121803 -94023 -59432 -70437 -56463
16273 -56463 -30567 -59474 -79025 -76535 -53223 5678 17777 -40253 -68767 -114507 -109528 -30503
16261 -30503 9966 -29159 -56851 -55530 -33217 1864 64410 61235 -20207 -43254 -71923 -40467
16249 -40467 -28413 -22445 35448 62716 53418 1068 9302 2061 5042 -10006 -37004 -29559 -36390
16236 -36390 -16093 61031 85672 62019 46498 -9435 -23706 -30732 -51137 -27438 2082 30335
16224 30335 17417 63019 43910 -35332 -59526 -7613 46614 19933 -82914 -111229 -101338 -74842
16212 -74842 -100680 -63767 -69982 -47372 18007 -38567 -77407 -54392 -67603 -95036 -86424 -106931
$$ packed form
16297b2614M1337P5540j3812r7348o8418P0610J4614J0410M193R356k8717N3576
16285D8727K4661L6659k8506j4071j0901o7349p5070l5953K7780L4591j1005J3974
16273e6463K5896k8907j9551K490K3312N8901J2099n8030k8514m5740M979P9025
16261c0503M0469l9125k7692J321K2313L5081O2546l175q1442k3047k8669L1456
16249d0467J2054N968N7893K7268r298n2350Q234p241K981j5048k6998P445o831
16236c6390K0297P7124K4641k3653j5521n5933j4271p026k0405K3699K9520K8253
16224C0335j2918M5602j9109p9242k4194N1913N4227k6681j02847k8315R891K6496
16212g4842k5838L6913o215K2610O5379n6574l8840K3015j3211k7433Q612k0507
$$ plain form
16200 -106931 -89347 -82218 -19243 32651 47452 56919 60997 68646 10747 -366 6308 -59087
16188 -59087 -66192 -3597 48420 44860 -26097 -35286 37742 -3371 -37170 -82085 -72572 -58928
16176 -58928 -4106 -51170 -46723 -36280 -20058 -31943 -28323 -42081 -42303 -2370 25070 22276 24988
16163 24988 3154 -4035 -14854 -29170 -59391 -91121 -47377 -56405 -23020 -14100 10734 -55759
16151 -55759 -11478 -25203 10695 -769 -63540 -58841 -98458 -63394 -38164 -17242 13378 23306
16139 23306 -17897 -53824 -34769 1833 15842 7382 -22832 -57902 -76030 -15745 -37502 -93946
16127 -93946 -52793 4747 1882 -43964 -55635 -87222 -97397 -117931 -47305 22243 -13879 -75799
16115 -75799 -41332 -61655 -34454 9759 -65331 -85777 -57742 -33099 19225 36514 26981 44627
$$ packed form
16200a06931J7584P129O2975N1894J4801R467M078P649n7899j1113O674o5395
16188e9087p105O2595N2017l560p0957r189P3028m1113l3799m4915R513J3644
16176e8928N4822m7064M447J0443J6222j1885L620j3758k22L9933K7440k794K712
16163B4988k1834p189j0819j4316l0221l1730M3744r028L3385Q920K4834o6493
16151e5759M4281j3725L5898j1464o2771M699l9617L5064K5230K0922L0620R928
16139B3306m1203l5927J9055L6602J4009q460l0214l5070j8128O0285k1757n6444
16127i3946M1153N7540k865m5846j1671l1587j0175k0534P0626O9548l6122o1920
16115g5799L4467k0323K7201M4213p5090k0446K8035K4643N2324J7289r533J7646
$$ plain form
16103 44627 43636 9898 37410 88420 110574 93432 30280 -15700 -29090 50332 87219 66683
16091 66683 72513 42387 15098 6775 -23191 -56678 -12085 94334 84347 56642 46598 42229
16079 42229 64212 110612 101996 72091 32184 46857 60796 21809 -57869 -40707 -2681 -5391
16067 -5391 -20431 -28430 -11682 17860 18863 85841 135597 107121 60154 37625 27110 -20911
16055 -20911 -10698 -6659 -2710 30321 52380 75124 12038 21269 22007 53771 41629 -33694 -22102
16042 -22102 -11085 -42381 -60369 -17781 12907 40835 40025 5933 -67739 -43927 4085 15309
16030 15309 36327 35789 33308 115635 159983 123204 98591 107575 141592 118181 95849 84453
16018 84453 104322 131543 129358 42070 22099 91762 105578 76882 44247 -19191 -105221 4196
$$ packed form
16103D4627r91l3738K7512N1010K2154j7142o3152m5980j3390P9422L6887k0536
16091F6683N830l0126k7289q323k9966l3487M4593J06419r987k7705j0044m369
16079D2229K1983M6400q616k9905l9907J4673J3939l8987p9678J7162L8026k710
16067e391j5040p999J6748K9542J003O6978M9756k8476m6967k2529j0515m8021
16055b0911J0213M039L949L3031K2059K2744o3086R231P38L1764j2142p5323J1592
16042b2102J1017l1296j7988M2588L0688K7928q10l4092p3672K3812M8012J1224
16030A5309K1018n38k481Q2327M4348l6779k4613Q984L4017k3411k2332j1396
16018H4453J9869K7221k185q7288j9971O9663J3816k8696l2635o3438q6030J09417
$$ plain form
16006 4196 88830 36697 -87534 -143812 -95600 -8532 52242 72454 69363 81483 34777 3178
15994 3178 16261 41187 89889 81163 43750 89845 100419 15859 -63791 -107284 -99363 948
15982 948 103402 74275 22239 9243 48702 72521 69588 127911 145124 88383 71315 36077
15970 36077 39955 -30689 -100834 -61289 -21710 18968 76677 53014 16864 -70022 -98602 -118769
15958 -118769 -78513 -36970 23890 45933 82227 90565 67596 22731 73626 77926 68709 55293
15946 55293 40925 87864 71271 38599 48888 75688 48406 94100 162626 109808 1667
15935 1667 -61559 -81014 -87087 -81243 -39303 -56188 -69865 -14974 -24718 -81279 -107296 -60309
15923 -60309 -51876 -61541 21148 44426 -22499 -48226 -38718 5384 24756 42431 18034 -33973
$$ packed form
16006D196Q4634n2133j24231n6278M8212Q7068O0774K0212l091J2120m6706l1599
15994C178J3083K4926M8702q726l7413M6095J0574q4560p9650m3493P921J00311
15982I48J02454k9127n2036j2996L9459K3819k933N8323J7213n6741j7068l5238
15970C6077L878p0644p0145L9545L9579M0678N7709k3663l6150q6886k8580k0167
15958a18769M0256M1543O0860K2043L6294Q338k2969m4865N0895M300r217j3416
15946E5293j4368M6939j6593l2672J0289K6800k7282M5694O8526n2818j08141
15935A667o3226j9455o073N844M1940j6885j3677N4891r744n6561k6017M6987
15923f0309Q433r665Q2689K3278o6925k5727R508M4102J9372J7675k4397n2007
$$ plain form
15911 -33973 -7704 -12980 -501 11554 -32616 -14616 -32455 -46557 -17117 1486 56827 40719
15899 40719 -65739 -41301 -49272 -28099 59407 22548 -17230 -14959 42967 81285 -23870 -66644
15887 -66644 -15070 -12599 35422 -10520 -53162 -46857 -40507 -48024 -78312 -120729 -146722 -133404
15875 -133404 -110539 -109398 -87271 -122712 -69934 44460 52863 22400 70901 121013 89783 37666
15863 37666 49134 92963 74359 87119 49706 16766 3860 63265 -18374 -58654 12669 38142
15851 38142 68551 86079 95215 68258 30498 54912 46383 63835 2033 -47115 -32049 -2942
15839 -2942 -11141 -43202 -15395 38436 54532 37808 45198 25851 -5274 -13600 -14445 -81964 -66625
15826 -66625 -54714 -71279 -92377 -57958 -5838 -5897 -41213 -90455 -61224 -46145 -36957 -3743
$$ packed form
15911c3973K6269n276J2479J2055m4170J8000j7839j4102K9440J8603N5341j6108
15899D0719j06458K4438p971K1173Q7506l6859l9778K271N7926L8318j05155m2774
15887f6644N1574K471M8021m5942m2642O305O350p517l0288m2417k5993J3318
15875a33404K2865J141K2127l5441N2778J14394Q403l0463M8501N0112l1230n2117
15863C7666J1468M3829j8604J2760l7413l2940j2906N9405q1639m0280P1323K5473
15851C8142L0409J7528R136k6957l7760K4414q529J7452o1802m9148J5066K9107
15839b942q199l2061K7807N3831J6096j6724P390j9347l1125q326q45o7519J5339
15826f6625J1911j6565k1098L4419N2120n9l5316m9242K9231J5079R188L3214
$$ plain form
15814 -3743 -19731 -66993 -71625 -21199 -38906 -55062 -29943 -51021 9516 21141 13854 -48974
15802 -48974 -55479 -15010 24502 69266 20362 -50594 -49298 -31449 -61395 -47812 -39612 -26822
15790 -26822 -1118 -1732 -7629 -33398 -1187 35504 25129 75497 84134 95975 96290 125960 150717
15777 150717 102367 48181 36552 37726 -15999 -50419 -36001 -7502 -29772 -40117 14738 21166
15765 21166 -11475 580 14126 30004 -10971 -81326 -36361 -4510 -64977 -102564 -72315 -65622
15753 -65622 -6908 19600 17753 6020 39410 44708 16954 -16139 -44399 -86486 -82988 -57193
15741 -57193 -6837 42837 17698 -14983 26930 75907 100488 113291 103977 89521 70044 32930
15729 32930 7669 -44052 730 142742 95054 13916 22807 3813 28153 51310 12963 3397
$$ packed form
15814c743j5988m7262m632N0426j7707j6156K5119k1078O0537J1625p287o2828
15802d8974o505M0469L9512M4764m8904p0956J296J7849k9946J3583Q200J2790
15790b6822K5704o14n897k5769L2211L6691j0375N0368Q637J1841L15K9670K4757
15777A50717m8350n4186j1629J174n3725l4420J4418K8499k2270j0345N4855O428
15765B1166l2641J2055J3546J5878m0975p0355M4965L1851o0467l7587L0249O693
15753f5622N8714K6508j847j1733L3390N298k7754l3093k8260m2087L498K5795
15741e7193N0356M9674k5139l2681M1913M8977K4581J2803r314j4456j9477l7114
15729C2930k5261n1721M4782J42012m7688q1138Q891j8994K4340K3157l8347r566
$$ plain form
15717 3397 -16682 10154 -8114 12409 34008 46920 68235 41185 14384 -1245 1234 -28947
15705 -28947 -51767 -25003 13082 17700 -54344 -99760 -60891 -20112 -73023 -35150 -54341 -62326
15693 -62326 -34216 -27209 -63518 -43212 -44456 -78980 -82406 -37738 -35362 -57995 -25683 -9451
15681 -9451 -62267 -16869 29936 967 -17751 -34697 26153 24536 20665 11094 -23167 -12464
15669 -12464 64782 119853 136667 88694 36122 -43978 15699 -19273 -6587 19799 73820 92658
15657 92658 27347 -30457 -47631 7749 48586 423 -78761 -35896 -5835 -17630 23536 35558
15645 35558 68968 -2121 -33791 -55714 -37887 -42869 -24894 -27741 -26709 -43803 -79575 -59333
15633 -59333 -30992 -9146 -59861 -54821 -20574 29858 34780 42688 -6225 -46828 -75143 -72693
$$ packed form
15717C397k0079K6836j8268K0523K1599J2912K1315k7050k6801j5629K479l0181
15705b8947k2820K6764L8085M618p2044m5416L8869M0779n2911L7873j9191p985
15693f2326K8110P007l6309K0306j244l4524l426M4668K376k2633L2312J6232
15681i451n2816M5398M6805k8969j8718j6946O0850j617l871r571l4261J0703
15669a2464P7246N5071J6814m7973n2572q0100N9677l4972J2686K6386N4021J8838
15657I2658o5311n7804j7174N5380M0837m8163p9184M2865L0061j1795M1166J2022
15645C5558L3410p1089l1670k1923J7827m982J7975k847J032j7094l5772K0242
15633e9333K8341K1846n0715N040L4247N0432M922P908m8913m0603k8315K450
$$ plain form
15621 -72693 -47800 4594 35974 28347 17546 49691 55842 81541 57305 68187 75538 70818
15609 70818 15068 15950 28715 -8841 -20334 -28304 7197 66779 40690 22142 29694 22993 33300
15596 33300 -4017 -40934 -60254 25071 29304 75837 37500 12731 17197 8451 -11535 45519
15584 45519 16017 3623 33113 38506 -14898 -42492 -24899 -42714 -66596 -33252 -1253 16235
15572 16235 40725 29436 -47767 -48673 -61162 -76525 -60222 -26040 -37177 -16083 -43340 -62481
15560 -62481 -29728 -25371 -22280 40777 41392 32974 -3875 5650 26162 -29208 -53219 -56569 -64509
15547 -64509 -66706 -8501 21138 44615 60896 62447 51779 26524 18014 -6159 -6787 -786 10905
15534 10905 63780 49906 77024 80600 95783 18881 -33146 -44614 -52579 -60551 -71407 -59094
$$ packed form
15621g2693K4893N2394L1380p627j0801L2145O151K5699k4236J0882P351m720
15609G0818n5750Q82J2765l7556j1493p970L5501N9582k6089j8548P552o701J0307
15596C3300l7317l6917j9320Q5325M233M6533l8337k4769M466q746j9986N7054
15584D5519k9502j2394K9490N393n3404k7594J7593j7815k3882L3344L1999J7488
15572A6235K4490j1289p7203r06j2489j5363J6303L4182j1137K1094k7257j9141
15560f2481L2753M357L091O3057O15q418l6849R525K0512n5370k4011l350p940
15547f4509k197N8205K9639K3477J6281J551j0668k5255q510k4173o28O001J1691
15534A0905N2875j3874K7118L576J5183p6902n2027j1468p965p972j0856J2313
$$ plain form
15522 -59094 -23755 25345 -34721 -38749 9115 -45761 -37680 66923 118246 57753 25043 15248
15510 15248 -9339 14440 -16458 -129790 -61400 13424 19240 -35025 -19258 -39957 -23259 13097
15498 13097 61054 18588 -11278 37878 -27285 -84638 -83614 -49373 -35346 -24245 21544 54402
15486 54402 100472 73885 50772 -2969 -23975 8096 -21465 6147 1866 35195 32870 -23817
15474 -23817 -26552 -1879 2893 -6982 11191 37487 -4948 -73888 -47102 698 -42426 -87433
15462 -87433 -72014 -48176 -26841 44936 102036 100568 46692 -7312 -55974 -63645 -74221 -81733
15450 -81733 -116566 -76219 -23187 -66693 -99514 -143578 -131306 -67002 260 12294 -34583 -57656
15438 -57656 -67563 -114761 -130394 -115595 -36746 -50698 -99260 -54767 -47044 -97484 -74469 -42863
$$ packed form
15522e9094L5339M9100o0066m028M7864n4876Q081J04603N1323o0493l2710r795
15510A5248k4587K3779l0898j13332O8390P4824N816n4265J5767k0699J6698L6356
15498A3097M7957m2466k9866M9156o5163n7353J024L4241J4027J1101M5789L2858
15486E4402M6070k6587k3113n3741k1006L2071k9561K7612m281L3329k325n6687
15474b3817k735K4673M772r875J8173K6296m2435o8940K6786M7800m3124m5007
15462h7433J5419K3838K1335P1777N7100j468n3876n4004m8662p671j0576p512
15450h1733l4833M0347N3032m3506l2821m4064J2272O4304O7262J2034m6877k3073
15438e7656r907m7198j5633J4799P8849j3952m8562M4493P723n0440K3015L1606
$$ plain form
15426 -42863 -62614 -29272 9902 39154 16859 29220 -4025 9201 -16654 -17252 -54618 -72872
15414 -72872 -21304 56800 82819 76281 49347 50272 28724 53345 91248 84293 68480 73292 14327
15401 14327 1235 -20842 -17937 13110 -16088 -53166 -44943 -14987 16203 -38816 -51231 -55268
15389 -55268 -16104 2463 -18367 -4691 17584 54073 77415 46109 23776 36740 46929 30179
15377 30179 -30531 -80498 -73497 -69697 -14946 15377 22406 -26180 -61260 -25868 6327 23459
15365 23459 2073 43702 14217 -13233 -6315 -22525 -20211 -36031 6070 14345 6594 105571
15353 105571 89449 27659 -103999 -108521 -14889 37197 28573 3261 24235 -13614 20133 32834
15341 32834 39969 75191 135450 129285 98027 39442 69049 68897 67631 41422 52075 46565 -57280
$$ packed form
15426d2863j9751L3342L9174K9252k2295J2361l3245J3226k5855n98l7366j8254
15414g2872N1568P8104K6019o538k6934R25k1548K4621L7903o955j5813M812n8965
15401A4327j3092k2077K905L1047k9198l7078Q223K9956L1190n5019j2415m037
15389e5268L9164J8567k0830J3676K2275L6489K3342l1306k2333J2964J0189j6750
15377C0179o0710m9967P001L800N4751L0323P029m8586l5080L5392L2195J7132
15365B3459k1386M1629k9485k7450O918j6210K314j5820M2101Q275p751R8977
15353A05571j6122o1790j31658m522R3632N2086q624k5312K0974l7849L3747J2701
15341C2834P135L5222O0259o165l1258n8585K9607j52j266k6209J0653n510j03845
$$ plain form
15328 -57280 -41311 -52173 -3315 91598 59259 30795 -47926 -63445 -53075 -61940 -50067 -57383
15316 -57383 -58870 3814 15474 8384 -25239 -68269 -73896 -30939 -14587 12546 32135 876
15304 876 22125 75423 76583 73732 43834 26470 21018 61122 69607 10694 -49079 -107354 -106919
15291 -106919 -44761 11896 18196 14755 68741 13669 -55208 -71525 -87451 -116549 -140965 -132522
15279 -132522 -112733 -46437 -7321 -81422 -105159 -97436 -25731 -56888 -71102 -39552 2143 18001
15267 18001 9480 -18453 -61304 -56773 -52333 -38083 -39847 -7605 -25463 28391 79551 77322 95071
15254 95071 82257 -54423 -90967 -19442 -31324 -43362 -21660 -23274 -10587 -3935 -4834 -38749
15242 -38749 -47688 -42749 -32048 -38 -14744 20043 -37881 -77280 -54952 -23257 1511 -39996
$$ packed form
15328e7280J5969j0862M8858R4913l2339k8464p8721j5519J0370q865J1873p316
15316e7383j487O2684J1660p090l3623m3030n627M2957J6352K7133J9589l1259
15304H76K1249N3298J160k851k9898j7364n452M0104Q485n8913n9773n8275M35
15291a06919O2158N6657O300l441N3986n5072o8877j6317j5926k9098k4416Q443
15279a32522J9789O6296L9116p4101k3737P723P1705l1157j4214L1550M1695J5858
15267A8001q521k7933m2851M531M440J4250j764L2242j7858N3854N1160k229J7749
15254I5071j2814j36680l6544P1525j1882j2038K1702j614J2687O652q99l3915
15242c8749q939M939J0701L2010j4706L4787n7924l9399K2328L1695K4768m1507
$$ plain form
15230 -39996 -23261 -2127 59332 65192 57476 65597 45714 -8273 -47781 -80369 7010 79691
15218 79691 108864 48373 17571 -3451 -12961 -8433 -16010 -28422 -52124 -95003 -89538 -53685
15206 -53685 -15052 -65723 -99568 -88294 -86026 -75145 -50879 -66898 -23465 -28265 -3308 33928
15194 33928 11436 46129 61845 64297 52786 62779 68227 36359 778 -15617 -13220 23230
15182 23230 73829 127241 114669 101433 66520 140748 127029 71846 67743 94312 125243 88020
15170 88020 45225 106321 118191 83949 41865 43752 88562 24747 -8365 -84262 -92693 -44684
15158 -44684 -52034 -17737 46800 65752 131862 115033 36354 -25509 14496 34788 21644 6547
15146 6547 10355 2894 34118 39394 16240 29597 42005 -40797 -76929 -27666 17939 -16117
$$ packed form
15230c9996J6735K1134O1459N860p716Q121j9883n3987l9508l2588Q7379P2681
15218G9691K9173o0491l0802k1022r510M528p577j2412k3702m2879N465L5853
15206e3685L8633n0671l3845J1274K268J0881K4266j6019M3433m800K4957L7236
15194C3928k2492L4693J5716K452j1511R993N448l1868l5581j6395K397L6450
15182B3230N0599N3412j2572j3236l4913P4228j3719n5183m103K6569L0931l7223
15170H8020m2795O1096J1870l4242m2084J887M4810o3815l3112p5897q431M8009
15158d4684p350L4297O4537J8952O6110j6829p8679o1863M0005K0292j3144j5097
15146F547L808p461L1224N276k3154J3357J2408q2802l6132M9263M5605l4056
$$ plain form
15134 -16117 -51124 -97487 -79825 -25348 -21448 -39245 -15309 31403 42029 31204 46833 25779
15122 25779 46381 41142 30643 -5910 -36599 -48935 -65086 -58841 17115 88323 40090 13103
15110 13103 -6379 -5630 -41412 2601 141166 174617 81978 -330 -14427 -23805 -44823 -47950
15098 -47950 -61198 -127946 -109938 -68401 -111201 -131744 -108724 -64272 -268 56014 127959 136344
15086 136344 93662 84524 39677 16608 37235 55443 -17669 -25779 -11399 -8752 41751 118273
15074 118273 70997 -34965 -125881 -96580 -41540 15457 12616 12472 -19315 -59702 -14882 106260
15062 106260 58978 16535 19091 -2298 -49505 -62382 -68687 -60859 -139419 -138378 -88103 -82916
15050 -82916 -82240 -22872 -21770 -23903 -25958 -51493 -78730 -80401 -124124 -114933 -121955 -108455 -73788
$$ packed form
15134a6117l5007m6363J7662N4477L900j7797K3936M6712J0626j0825J5629k1054
15122B5779K0602n239j0499l6553l0689j2336j6151O245P5956P1208m8233k6987
15110A3103j9482P49l5782M4013J38565L3451r2639q2308j4097r378k1018l127
15098d7950j3248o6748J8008M1537m2800k0543K3020M4452O4004N6282P1945Q385
15086A36344m2682r138m4847k3069K0627J8208p3112q110J4380K647N0503P6522
15074A18273m7276j05962r0916K9301N5040N6997k841j44l1787m0387M4820J21142
15062A06260m7282m2443K556k1389m7207j2877o305P828p8560J041N0275N187
15050h2916O76N9368J102k133k055k5535k7237j671m3723R191p022J3500L4667
$$ plain form
15037 -73788 -47601 -13756 1677 -9110 -33755 -47013 -9773 17845 48776 39392 28686 15596
15025 15596 41911 95985 96874 77488 66637 51281 -14194 -19173 -38706 -17542 59876 39419
15013 39419 61904 7290 -33943 -19788 15361 21488 15495 -9900 -16276 -11460 2575 49201
15001 49201 33110 27697 8298 -29475 -12552 10805 -15952 -14250 -42460 -64929 -65158 20910
14989 20910 12505 8678 -593 -86983 -131881 -84163 19054 63523 30710 41560 21941 9039
14977 9039 43084 41504 -33881 -33372 -27485 -20010 1457 -2578 -42382 -44582 -11037 -12901 4003
14964 4003 -19483 -50359 -27265 -2639 36339 -9088 -43728 13534 36960 -14289 -56767 -71168
14952 -71168 -71971 -97053 -73227 -48812 10659 21499 47404 55323 48375 -1655 -55286 -79994
$$ packed form
15037g3788K6187L3845J5433j0787k4645j3258L7240K7618L0931r384j0706j3090
15025A5596K6315N4074Q89j9386j0851j5356o5475m979j9533K1164P7418k0457
15013C9419K2485n4614m1233J4155L5149O127n993k5395o376M816J4035M6626
15001D9201j6091n413j9399l7773J6923K3357k6757J702k8210k2469k29Q6068
14989B0910q405l827r271q6390m4898M7718J03217M4469l2813J0850j9619j2902
14977I039L4045j580p5385N09N887P475K1467m035l9804k200L3545j864J6904
14964D003k3486l0876K3094K4626L8978m5427l4640N7262K3426n1249m2478j4401
14952g1168q03k5082K3826K4415N9471J0840K5905P919o948n0030n3631k4708
$$ plain form
14940 -79994 -27244 -12766 17211 13020 -38032 -34045 -22654 -8967 -25606 -40482 -33524 4887
14928 4887 -13404 42885 27224 -1496 23791 77478 71587 44546 -2999 62482 147800 121868
14916 121868 44598 -41628 -98178 -132025 -172404 -122674 -34790 -46763 1117 47897 7661
14905 7661 -40607 -45237 -67762 -43228 -9865 88311 122282 104722 79231 75327 82459 50231
14893 50231 31576 14467 -27355 -56079 8467 74227 56426 -15827 -17514 -19923 1020 30530
14881 30530 -17384 -7539 31102 68070 33494 38874 105360 96407 60692 38300 -9705 -5388
14869 -5388 27569 46212 42975 13519 43878 42145 13268 27585 40887 13614 -26056 11896
14857 11896 27812 49893 48260 49680 65356 6675 -11661 -35816 -80188 -53599 -89349 -83782
$$ packed form
14940g9994N2750J4478K9977m191n1052L987J1391J3687j6639j4876O958L8411
14928D887j8291N6289j5661k8720K5287N3687n891k7041m7545O5481Q5318k5932
14916A21868p7270q6226n6550l3847m0379M9730Q7884j1973M7880M6780m0236
14905G661m8268m630k2525K4534L3363R8176L3971j7560k5491l904P132l2228
14893E0231j8655j7109m1822k8724O4546O5760j7801p2253j687k409K0943K9510
14881C0530m7914R845L8641L6968l4576N380O6486q953l5715k2392m8005M317
14869e388L2957J8643l237k9456L0359j733k8877J4317J3302k7273l9670L7952
14857A1896J5916K2081j633J420J5676n8681j8336k4155m4372K6589l5750N567
$$ plain form
14845 -83782 -24377 -25542 -55962 -92642 -63049 -17623 -32189 -46883 -101092 -119777 -36038 17124
14833 17124 -5815 -12018 -24528 64919 88522 57484 7092 -22756 -23200 -48429 6554 42168
14821 42168 19005 -49187 -52205 -14797 -23741 3653 22813 36229 78203 117122 85934 89432
14809 89432 67325 12483 -44432 -44409 32597 46028 60136 38986 -44340 -64902 -59682 2560
14797 2560 37536 94475 127984 101194 40130 28748 13932 -46797 -47253 -46396 -39639 7326 8127
14784 8127 12217 25342 -4226 -247 -7138 -4337 20416 34656 9685 -15111 -84013 -104370 -56778
14771 -56778 -24759 -31504 -70205 -14109 -47311 -2243 -41108 -72682 -53135 20560 73153 39395
14759 39395 -1568 -33005 -73625 -110790 -122220 -94809 -23232 51102 44243 35629 20184 -7074
$$ packed form
14845h3782N9405j165l0420l6680K9593M5426j4566j4694n4209j8685Q3739N3162
14833A7124k2939o203j2510Q9447K3603l1038n0392k9848m44k5229N4983L5614
14821D2168k3163o8192l018L7408q944K7394J9160J3416M1974L8919l1188L498
14809H9432k2107n4842n6915K3P7006J3431J4108k1150q3326k0562N220O2242
14797B560L4976N6939L3509k6790o1064j1382j4816o0729m56Q57O757M6965Q01
14784H127M090J3125k9568L979o891K801K4753J4240k4971k4796o8902k0357M7592
14771e6778L2019o745l8701N6096l3202M5068l8865l1574J9547P3695N2593l3758
14759C9395m0963l1437m0620l7165j1430K7411P1577P4334o859q614j5445k7258
$$ plain form
14747 -7074 -81805 -111688 -106308 -99922 -77880 -36831 -36706 -34697 5190 -9405 -49778 -1006 30664
14734 30664 -18583 -78630 -121939 -77080 -16861 37769 68206 50076 11042 33100 65992 6576
14722 6576 -43272 -72248 -66506 -26119 -29708 -2306 10670 -11497 29580 -1151 -49097 -90067
14710 -90067 -40947 2144 65860 62293 10242 51363 18971 -23079 -14986 -9098 -2803 18403
14698 18403 27245 7524 -1940 -21718 -55521 -51113 -71742 -61232 -40926 -31418 -12587 -29553
14686 -29553 -49154 -67340 -23285 8159 27870 -35770 -59764 -59105 -46219 -60938 -43222 -49944
14674 -49944 -44317 -76147 -126986 -90632 -77796 -39453 -38201 -4259 76413 108837 63637 3934
14662 3934 -45756 -44362 1104 -7128 -27086 -39797 -27576 -4897 43296 20724 57000 61259
$$ packed form
14747g074p4731k9883N380O386K2042M1049J25K009L9887j4595m0373M8772L1670
14734C0664m9247o0047m3309M4859O0219N4630L0437j8130l9034K2058L2892n9416
14722F576m9848k8976N742M0387l589K7402J2976k2167M1077l0731m7946m0970
14710i0067M9120M3091O3716l567n2051M1121l2392m2050Q093N888O295K1206
14698A8403Q842j9721r464j9778l3803M408k0629J0510K0306R508J8831j6966
14686b9553j9601j8186M4055L1444J9711o3640k3994O59J2886j4719J7716o722
14674d9944N627l1830n0839L6354J2836L8343J252L3942Q0672L2424m5200n9703
14662C934m9690J394M5466q232j9958j2711J2221K2679M8193k2572L6276M259
$$ plain form
14650 61259 20553 58710 78669 77404 72230 72560 9843 -18369 3861 -9621 -32665 -40578 -39429
14637 -39429 18887 -4621 -31132 -64504 -85060 -40940 -53697 -42724 4023 -10055 -10892 3916
14625 3916 19612 33238 -4721 713 33230 65154 85677 46402 11939 8664 15336 -31099
14613 -31099 -33547 -14360 -7141 -32228 -35031 -24290 -16142 -35428 -56488 -76547 -32863 7932
14601 7932 348 7748 4837 -42179 -72183 -40403 13235 66564 33681 -25524 -41699 22761
14589 22761 83385 69066 6523 3781 69173 95013 56572 50391 49074 36598 20028 10661
14577 10661 41314 31750 -14354 -14365 25478 26927 28202 46889 12993 -41124 7135 79744 115542
14564 115542 117145 132095 154489 138870 118007 81337 39769 -27354 -58834 -80501 -24695 -29817
$$ packed form
14650F1259m0706L8157J9959j265n174L30o2717k8212K2230j3482k3044p913J149
14637c9429N8316k3508k6511l3372k0556M4120j2757J0973M6747j4078q37J4808
14625C916J5696J3626l7959N434L2517L1924K0523l9275l4463l275O672m6435
14613c1099k448J9187P219k5087k803J0741Q148j9286k1060k0059M3684M0795
14601G932p584P400k911m7016l0004L1780N3638N3329l2883n9205j6175O4460
14589B2761O0624j4319o2543k742O5392K5840l8441o181j317j2476j6570r367
14577A0661L0653r564m6104j1L9843J449J275J8687l3896n4117M8259P2609L5798
14564A15542J603J4950K2394j5619k0863l6670m1568o7123l1480k1667N5806n122
$$ plain form
14552 -29817 -76861 -100356 -75014 -101609 -58975 -29519 -21930 55298 91706 76322 79742 29844
14540 29844 28397 19314 3869 12822 79357 69648 27943 -13648 -55834 -73851 -73390 -48859 -37708
14527 -37708 -36505 -20229 -16723 -49452 -11473 34454 30820 51560 50921 -20118 20692 49558 21696
14514 21696 4404 -15035 -71394 -93312 -52065 24115 12583 27068 61328 86931 53489 27750
14502 27750 -16565 -9459 -23290 -19804 -50414 -100993 -88395 -132479 -112765 -28095 17999 42960
14490 42960 6355 -31505 -101813 -74528 -47093 -61775 -63781 -70251 -91112 -103466 -33991 -5831
14478 -5831 -23163 -88961 -68455 -32572 -33317 -64983 -106600 -126324 -75237 -46709 33290 -24099
14466 -24099 -40914 -41071 -56996 -35278 -54213 -59746 -39315 -12656 -86304 -129215 -93153 -42645
$$ packed form
14552b9817m7044k3495K5342k6595M2634K9456P589P7228L6408j5384L420m9898
14540B9844j447r083j5445Q953O6535r709m1705m1591m2186j8017M61K4531J1151
14527c7708J203J6276L506l2729L7979M5927l634K0740o39p1039M0810K8866k7862
14514B1696j7292j9439n6359k1918M1247P6180j1532J4485L4260K5603l3442k5739
14502B7750m4315P106j3831L486l0610n0579J2598m4084J9714Q4670M6094K4961
14490D2960l6605l7860p0308K7285K7435j4682k006o470k0861j2354O9475K8160
14478e831j7332o5798K0506L5883p45l1666m1617j9724N1087K8528P9999n7389
14466b4099j6815j57j5925K1718j8935n533K0431K6659p3648m2911L6062N0508
$$ plain form
14454 -42645 -12908 9151 4298 -24405 -38877 -55734 -113606 -100285 10982 109225 86706 69274
14442 69274 78897 49004 10088 -44454 -73465 -54691 -8405 14226 -16445 -43934 -14331 -27921
14430 -27921 -54822 -36360 -23850 -27669 -7525 -17797 33906 59948 71629 20454 31744 25551
14418 25551 17591 16934 49911 44010 29541 -10633 -46056 -31576 -49612 -43846 -2657 -1918 -14596
14405 -14596 -19560 5403 65683 50184 -5421 -5008 33986 57133 31041 47162 101558 63616
14393 63616 -19424 -35643 -94251 -37906 -21673 -11792 33802 19060 -28822 -160853 -154568 -93348
14381 -93348 -99881 -23343 -13813 -16444 -49601 -29546 -5119 32645 61771 63168 46070 56979
14369 56979 97267 55917 24580 34215 35407 -25597 -54110 -53926 -74187 -33368 -45953 -64645
$$ packed form
14454d2645K9737K2059m853k8703j4472j6857n7872J3321J11267R8243k2519j7432
14442F9274R623k9893l8916n4542k9011J8774M6286K2631l0671k7489K9603j3590
14430b7921k6901J8462J2510l819K0144j0272N1703K6042J1681n1175J1290o193
14418B5551p960o57L2977n901j4469m0174l5423J4480j8036N766M1189P39j2678
14405a4596m964K4963O0280j5499n5605M13L8994K3147k6092J6121N4396l7942
14393F3616q3040j6219n8608N6345J6233R881M5594j4742m7882j32031O285O1220
14381i3348o533P6538R530k631l3157K0055K4427L7764K9126J397j7098J0909
14369E6979M0288m1350l1337R635J192o1004k8513J84k0261M0819j2585j8692
$$ plain form
14357 -64645 -60078 -79305 -92807 -111902 -107027 -50369 38588 42931 27735 32523 16060 -51950
14345 -51950 6462 24736 -28242 -33986 -9393 28577 70222 46125 40828 40650 97027 77273
14333 77273 50188 16401 11179 31870 -55151 -104821 -100669 -38653 -27202 4185 1398 -12857
14321 -12857 -59291 -14901 -48430 -16624 2172 -16231 38448 117971 71090 -46062 -71197
14310 -71197 -56773 -58817 -49367 -58864 -16487 -21646 17612 3507 -73425 -46950 -27909 -69340
14298 -69340 -82472 -10949 48077 3970 -42788 -53024 -34963 -28723 63739 140766 129187 68406
14286 68406 -6930 -71862 -82859 -30360 122118 122775 125752 58647 51665 39798 40327 33949 -7237
14273 -7237 13022 27777 100519 133927 45023 -16439 -66756 -86018 -115340 -128463 -65749 14338
$$ packed form
14357f4645M567j9227j3502j9095M875N6658Q8957M343j5196M788j6463o8010
14345e1950N8412J8274n2978n744K4593L7970M1645k4097n297j78N6377j9754
14333G7273k7085l3787n222K0691q7021m9670M152O2016J1451L1387k787j4255
14321a2857m6434M4390l3529L1806J8796j8403N4679P9523m6881j17152k5135
14310g1197J4424k044R450r497M2377n159L9258j4105p6932K6475J9041m1431
14298f9340j3132P1523N9026m4107m6758j0236J8061O240R2462P7027j1579o0781
14286F8406p5336o4932j0997N2499J52478O57K977o7105o982j1867N29o378m1186
14273g237K0259J4755P2742L3408q8904o1462n0317j9262k9322j3123O2714Q0087
$$ plain form
14261 14338 -14310 -36072 24172 35255 3049 40937 67897 8007 -41471 -24210 -38275 -24643
14249 -24643 8292 8261 21 -29429 -84121 -15918 25363 14413 -63234 -87431 3133 -84903
14237 -84903 -108258 -53787 -21218 -14775 2467 17658 -26317 -55838 -69246 -97454 -35320 -30152
14225 -30152 -20850 -5500 -7991 55975 76165 64000 4445 -37161 -114562 -87168 -69640 -98258
14213 -98258 -93434 -26926 -6889 -12675 51611 48585 26789 37678 58607 18381 9999 -3300
14201 -3300 -26624 -19080 43363 28119 -7942 -11237 -22887 16107 47111 54036 35202 25892 46545
14188 46545 48803 -10964 -75372 -62207 -9021 8806 -39714 -30733 -67925 -77127 -31871 -18928
14176 -18928 754 7014 -24522 -68244 -27591 -34912 9487 27197 -8342 -67728 -83465 -80018
$$ packed form
14261A4338k8648k1762O0244J1083l2206L7888K6960n9890m9478J7261j4065J3632
14249b4643L2935l1q240k9450n4692O8203M1281j0950p7647k4197R0564q8036
14237h4903k3355N4471L2569O443J7242J5191m3975k9521j3408k8208O2134N168
14225c0152R302J5350k491O3966K0190j2165n9555m1606p7401K7394J7528k8618
14213i8258M824O6508K0037n786O4286l026k1796J0889K0929m0226q382j3299
14201c300k3324P544O2443j5244l6061l295j1650L8994L1004O925j8834r310K0653
14188D6545K258n9767o4408J3165N3186J7827m8520Q981l7192r202M5256J2943
14176a8928J9682O260l1536m3722M0653p321M4399J7710l5539n9386j5737L447
$$ plain form
14164 -80018 -55720 -17186 20214 -6182 -38980 -67662 6963 78696 88035 128118 62520 74385
14152 74385 76070 -6280 -35895 -10354 56278 52379 40649 24408 99317 124995 105131 69555
14140 69555 23421 41772 40395 29366 50328 7170 -79074 -104692 -40308 -45372 -45595 -3366
14128 -3366 37063 49705 77309 69084 62301 37029 48910 103087 103328 75891 30488 -20833 -15520
14115 -15520 -6111 -12160 35924 63802 51889 9654 -4213 35616 43277 -24648 -41214 7022
14103 7022 36659 19914 -10671 -20470 -46897 -72086 -67984 -52265 -7650 2797 18614 9691
14091 9691 11689 -15291 -16233 -20037 10525 13393 2386 -11994 -44055 -40093 -30251 40625 41618 68294
14077 68294 108709 117475 92807 43534 -7662 -7945 43004 80660 49948 16146 29255 32912
$$ packed form
14164h0018K4298L8534L7400k6396l2798k8682P4625P1733R339M0083o5598J1865
14152G4385J685q2350k9615K5541O6632l899j1730j6241P4909K5678j9864l5576
14140F9555m6134J8351j377j1029K0962m3158q6244k5618O4384n064k23M2229
14128c366M0429J2642K7604q225o783k5272J1881N4177K41k7437m5403n1321N313
14115a5520R409o049M8084K7878j1913m2235j3867L9829P661o7925j6566M8236
14103G022K9637j6745l0585r799k6427k5189M102J5719M4615J0447J5817q923
14091I691J998k6980r42l804L0562K868j1007j4380l2061L962R842P0876R93K6676
14077F8294M0415Q766k4668m9273n1196k83N0949L7656l0712l3802J3109L657
$$ plain form
14065 32912 74252 71493 27620 15553 337 1668 -38314 -85909 -52802 -8108 35093 38506
14053 38506 20311 -10298 -12616 -24857 4156 -14370 -68393 -67921 -50591 -18244 -10999 -46899
14041 -46899 -80512 -35269 23572 43510 33188 -42776 -26707 -45817 -13527 30 21792 15222
14029 15222 -7181 45373 55419 23940 185 -14627 -47643 175 -12025 22245 26144 -8363
14017 -8363 -42887 -1390 -6135 -40212 -1365 51937 83116 66800 59991 34494 71606 81952
14005 81952 76910 84550 71823 15243 -24837 -55331 -120955 -143115 -146718 -49901 -766 8944
13993 8944 33091 32688 52536 43464 23854 -26097 -51477 -19711 -28021 -23876 -28485 -10583 19898
13980 19898 73327 96432 50930 -21181 -28208 41598 31089 -7585 20765 40815 15991 -17737
$$ packed form
14065C2912M1340k759m3873j2067j5216J331l9982m7595L3107M4694M3201L413
14053C8506j8195l0609k318j2241K9013j8526n4023M72J7330L2347P245l5900
14041d6899l3613M5243N8841J9938j0322p5964J6069j9110L2290J3557K1762o570
14029A5222k2403N2554J0046l1479k3755j4812l3016M7818j2200L4270L899l4507
14017h363l4524M1497m745l4077L8847N3302L1179j6316o809k5497L7112J0346
14005H1952n042P640j2727n6580m0080l0494o5624k2160l603R6817M9135R710
13993H944K4147m03J9848r072j9610m9951k5380L1766q310M145m609J7902L0481
13980A9898N3429K3105m5502p2111p027O9806j0509l8674K8350K0050k4824l3728
$$ plain form
13968 -17737 -13930 84964 133845 129633 48994 -54465 -77740 -25462 40698 49623 84163 101967
13956 101967 116077 52724 78967 58491 -11081 -52116 -42687 -79936 -83278 -38900 -22144 -22898
13944 -22898 80604 91230 -68048 -112743 -126509 -146320 -92401 -69111 -50144 -33243 7594
13933 7594 69259 53300 -38313 -4743 40450 29989 6944 26175 10233 57022 36840 79727
13921 79727 75167 -19284 -39093 -20680 -31635 12319 15122 -54251 -63341 -14196 -31252 -23589
13909 -23589 10871 15840 -67251 -135480 -103689 -26729 -74795 -52453 -17612 -3781 28307 38428
13897 38428 41531 36027 41263 47347 -47983 -130960 -61202 -2015 22795 20216 -710 -34782 -43456
13884 -43456 51739 92188 59062 7444 -4785 -14168 -25927 -30324 -7333 36784 70097 24102
$$ packed form
13968a7737L807R8894M8881m212q0639j03459k3275N2278O6160Q925L4540J7804
13956A01967J4110o3353K6243k0476o9572m1035R429l7249l342M4378J6756p54
13944b2898J03502J0626j59278m4695j3766j9811N3919K3290J8967J6901M0837
13933G594O1665j5959r1613L3570M5193j0461k3045J9231j5942M6789k0182M2887
13921G9727m560r4451j9809J8413j0955M3954K803o9373r090M9145j7056P663
13909b3589L4460M969q3091o8229L1791P6960m8066K2342L4841J3831L2088J0121
13897C8428L103n504N236O084r5330q2977O9758N9187K4810k579k0926l4072q674
13884d3456R5195M0449l3126n1618j2229r383j1759m397K2991M4117L3313m5995
$$ plain form
13872 24102 8621 17039 21954 17974 -26642 -75276 -40305 -22281 5740 23695 8617 -5830
13860 -5830 12433 7197 30584 38358 -21217 -32922 -25981 -13257 -60862 -26990 13223 37224
13848 37224 94376 96741 72189 73256 62794 54646 27881 -29310 -58872 -68104 -66821 -85077 -94525
13835 -94525 -91159 -96964 -78235 -10043 43098 139526 154552 89496 51221 83328 44044 17475
13823 17475 22909 90165 103528 93625 109311 138745 95331 72910 32098 -21792 -88782 -80561
13811 -80561 -25203 5436 -29166 11406 56666 33894 19799 49753 166521 178085 75996
13800 75996 35399 39338 23808 2203 -3632 29736 82367 80923 33371 44467 49029 34398
13788 34398 3762 -37267 -62447 -42975 -26992 -40982 -43504 10507 46031 20435 40670 36145
$$ packed form
13872B4102j5481Q418M915l980m4616m8634L4971J8024K8021J7955j5078j4447
13860e830J8263n236K3387P774n9575j1705O941J2724m7605L3872M0213K4001
13848C7224N7152K365k4552J067j0462q148k6765n7191k9562r232J283j8256r448
13835i4525L366n805J8729O8192N3141R6428J5026o5056l8275L2107l9284k6569
13823A7475N434O7256J3363r903J5686K9434m3414k2421m0812n3890o6990Q221
13811h0561N5358L0639l4602M0572M5260k2772j4095K9954J16768J1564j02089
13800G5996m0597L939j5530k1605n835L3368N2631j444m7552J1096M562j4631
13788C4398l0636m1029k5180J9472J5983j3990k522N4011L5524k5596K0235m525
$$ plain form
13776 36145 48892 17310 -2647 59343 41885 24941 41667 70138 47514 31920 57092 84063
13764 84063 62739 -3980 -17385 -18577 28277 34351 -521 43121 21165 1929 -46269 -33195
13752 -33195 -53738 -119619 -119858 -79265 6757 22475 -11891 -19614 -45855 -52137 -14559 -9256 -3746
13739 -3746 19619 60568 80818 51704 -36307 -45946 -38493 -6532 49408 48619 18269 68834 38196
13726 38196 2531 3704 -50985 -36321 -27549 -25723 -86687 -109364 -84105 -65906 -19515 8124
13714 8124 -35608 -12211 -12597 -49483 -47332 -17195 -16036 -25309 12009 41109 22639 -19646 -42717
13701 -42717 -10020 18753 2819 27099 53667 -9715 -32922 7820 -11931 38313 29739 55782
13689 55782 57912 -3364 18638 91175 150771 93928 79766 68567 48759 35257 10422 19151
$$ packed form
13776C6145J2747l1582j9957O1990j7458j6944J6726K8471k2624j5594K5172K6971
13764H4063k1324o6719j3405j192M6854O074l4872M3642k1956j9236m8198J3074
13752c3195k0543o5881k39M0593Q6022J5718l4366p723k6241o282L7578N303N510
13739c746K3365M0949K0250k9114q8011r639P453L1961N5940p89l0350N0565l0638
13726C8196l5665J173n4689J4664Q772J826o0964k2677K5259J8199M6391K7639
13714H124m3732K3397l86l6886K151L0137J159r273L7318K9100j8470m2285k3071
13701d2717L2697K8773j5934K4280K6568o3382k3207M0742j9751N0244q574K6043
13689E5782K130o1276K2002P2537N9596n6843j4162j1199j9808j3502k4835Q729
$$ plain form
13677 19151 10629 -15213 -26438 -51863 -20775 -14223 -21696 -17313 18278 51701 97142 78005
13665 78005 93020 15133 -38249 -19040 -12300 -24487 -59979 -55066 -65143 -82485 -15817 21888
13653 21888 16347 31062 -16915 -32522 -67812 20846 34715 -16352 -59861 -94724 -52171 -21107
13641 -21107 -36959 -7630 -419 -58199 -51209 -66935 -51551 -15888 -6349 44346 -3846 -26683
13629 -26683 59366 65611 18699 -36385 -16665 -40948 -22695 -20484 -60156 -67266 -76370 -44299
13617 -44299 -45156 23816 24624 56103 78570 31989 -11198 21326 25593 24481 8439 32677 17699
13604 17699 -21161 -36843 -32757 -858 52866 93645 31393 30225 -27569 -63399 -31117 3041
13592 3041 17602 38829 52983 19317 19120 55030 17909 -26923 -403 19899 3331 -10899
$$ packed form
13677A9151q522k5842j1225k5425L1088O552p473M383L5591L3423M5441j9137
13665G8005J5015p7887n3382J9209O740j2187l5492M913j0077j7342O6668L7705
13653B1888n541J4715m7977j5607l5290Q8658J3869n1067m3509l4863M2553L1064
13641b1107j5852K9329P211n7780O990j5726J5384L5663R539N0695m8192k2837
13629b6683Q6049O245m6912n5084J9720k4283J8253K211l9672p110r104L2071
13617d4299q57O8972Q08L1479K2467m6581m3187L2524M267j112j6042K4238j4978
13604A7699l8860j5682M086L1899N3724M0779o2252j168n7794l5830L2282L4158
13592C041J4561K1227J4154l3666j97L5910l7121m4832K6520K0302j6568j4230
$$ plain form
13580 -10899 -71872 -62608 9107 5589 10591 31191 60636 80037 39275 -49302 -91477 -68461
13568 -68461 1918 24331 -27617 -25132 -31047 706 11412 -6934 3657 -3235 -55412 27322
13556 27322 57935 70165 114133 135945 101170 22603 -209 -3969 -10826 716 4821 14450
13544 14450 37692 10574 -8451 -37801 -80786 -20967 7919 -20895 15884 36686 12110 4094
13532 4094 -23910 -51890 -32091 22995 68682 59820 36011 36991 -31350 -70644 10211 36953
13520 36953 -38047 -140240 -94701 -10514 13960 -52195 -31452 10912 62588 25232 -27432
13509 -27432 12732 11166 -13238 -51824 -43129 -57314 -6839 -24109 -59918 -68114 -45516 -81797
13497 -81797 -101110 -94625 -76715 -95203 -123713 -78763 -15790 5064 40775 61894 7609 -125758
$$ packed form
13580a0899o0973R264P1715l518N002K0600K9445J9401m0762q8577m2175K3016
13568f8461P0379K2413n1948K485n915L1753J0706j8346J0591o892n2177Q2734
13556B7322L0613J2230M3968K1812l4775p8567k2812l760o857J1542M105R629
13544A4450K3242k7118j9025k9350m2985N9819K8886k8814L6779K0802k4576q016
13532D094k8004k7980J9799N5086M5687q862k3809R80o8341l9294Q0855K6742
13520C6953p5000j02193M5539Q4187K4474o6155K0743M2364N1676l7356n2664
13509b7432M0164j566k4404l8586Q695j4185N0475j7270l5809q196K2598l6281
13497h1797j9313O485J7910j8488k8510M4950O2973K0854L5711K1119n4285j33367
$$ plain form
13485 -125758 -173334 -132741 -113410 -102373 -50915 -54498 -20905 46810 35802 51155 92916 124592
13473 124592 92298 53835 59854 67428 46632 19757 73481 88866 63039 84682 31980 32218
13461 32218 99325 136614 121467 68511 81431 -2396 -42956 -22601 -58848 -34759 19218 36613
13449 36613 53012 62779 45857 127930 112502 25844 -60378 -91367 -79145 -67367 -81971 -67381
13437 -67381 -42097 -23312 19096 28240 -29454 11462 70614 79759 119703 98290 -16255 -79707
13425 -79707 -46544 -62026 -48785 13369 57307 56683 73224 51429 19822 -18018 -60290 -35763
13413 -35763 41872 48844 20839 -23808 -42618 -48717 -76083 -31787 -14818 24796 15987 -11472
13401 -11472 -21726 1137 -5256 -22601 -7012 -32616 -55179 -52302 -19070 -49130 -13332 -9444
$$ packed form
13485a25758m7576M0593J9331J1037N1458l583L3593O7715j1008J5353M1761L1676
13473A24592l2294l8463O019P574k0796k6875N3724J5385k5827K1643n2702K38
13461C2218O7107L7289j5147n2956J2920q3827m0560K0355l6247K4089N3977J7395
13449C6613J6399R767j6922Q2073j5428q6658q6222l0989J2222J1778j4604J4590
13437f7381K5284J8785M2408R144n7694M0916N9152R145L9944k1413j14545o3452
13425g9707L3163j5482J3241O2154M3938o24J6541k1795l1607l7840m2272K4527
13413c5763P7635O972k8005m4647j8810o099k7366M4296J6969L9614q809k7459
13401a1472j0254K2863o393j7345J5589k5604k2563K877L3232l0060L5798L888
$$ plain form
13389 -9444 28631 21534 -2866 19417 29454 38690 60584 56004 97268 78206 -7903 -37434
13377 -37434 -54506 -24471 -40701 38862 59700 43952 -2827 1956 -74886 -48116 21027 6138
13365 6138 -58945 -43439 -52454 -20460 15682 -39733 -85197 -120904 -108302 -55242 -66366 -71096
13353 -71096 -48508 43205 16048 15004 27210 -40833 -47595 -61894 -72064 -42751 -56376 -33975
13341 -33975 9816 41395 104059 148463 86070 48186 46646 103921 141617 143031 41373 -13478
13329 -13478 27756 67454 76496 66681 124603 121094 92721 14765 -11595 11522 9470 43775
13317 43775 44558 4850 59455 58755 80042 21031 42737 50913 61674 43500 48172 84422 55990
13304 55990 5483 -5612 34521 48859 73278 29246 -60579 -66655 -113136 -116597 -115246 -72237
$$ packed form
13389i444L8075p097k4400K2283J0037R236K1894m580M1264j9062q6109k9531
13377c7434j7072L0035j6230P9563K0838j5748m6779M783p6842K6770O9143j4889
13365F138o5083J5506r015L1994L6142n5415m5464l5707J2602N3060j1124m730
13353g1096K2588R1713k7157j044J2206o8043o762j4299j0170K9313j3625K2401
13341c3975M3791L1579O2664M4404o2393l7884j540N7275L7696J414j01658n4851
13329a3478M1234L9698R042r815N7922l509k8373p7956k6360K3117k052L4305
13317D3775P83l9708N4605p00K1287n9011K1706Q176J0761j8174M672L6250k8432
13304E5990n0507j1095M0133J4338K4419m4032q9825o076m6481l461J351M3009
$$ plain form
13292 -72237 -23521 32374 14970 24589 19598 31482 84312 28757 -25169 -38042 16158 59147
13280 59147 55013 19650 839 -7118 -31593 -31171 -40112 -79049 -38906 -9070 -41902 -32440 -25405
13267 -25405 -19885 -31924 -35018 -22572 -75045 -122818 -106315 -106288 -31416 -26642 -62953 -73985 -106598
13254 -106598 -113005 -117183 -89351 30261 36843 31404 -40431 -79854 -71646 -51683 -21821 44997
13242 44997 108003 120257 102526 105187 79666 -22914 -66635 -32196 -29020 -54883 -92764 -70942
13230 -70942 -45621 -34621 39108 69679 101123 122210 117033 55450 -18639 -13523 21823 15640
13218 15640 -10627 2570 -40720 -101319 -71469 -50920 -96657 -67657 -52805 -46151 -9000 -11771
13206 -11771 -2888 35082 63818 82814 22038 -33031 -16484 13820 -728 12801 45473 98919
$$ packed form
13292g2237M8716N5895j7404R619m991J1884N2830n5555n3926j2873N4200M2989
13280E9147m134l5363j8811p957k4475M22q941l8937M0143K9836l2832R462P035
13267b5405N520j2039l094J2446n2473m7773J6503K7P4872M774l6311j1032l2613
13254a06598o407m178K7832J19612O582n439p1835l9423Q208J9963K9862O6818
13242D4997O3006J2254j7731K661k5521j02580m3721L4439L176k5863l7881K1822
13230g0942K5321J1000P3729L0571L1444K1087n177o1583p4089N116L5346o183
13218A5640k6267J3197m3290o0599K9850K0549m5737K9000J4852O654L7151k771
13206a1771Q883L7970K8736J8996o0776n5069J6547L0304j4548J3529L2672N3446
$$ plain form
13194 98919 135162 166941 165865 103916 86181 53432 -629 -7052 39229 49152 66719 69315
13182 69315 74572 69964 -1117 -48516 -7160 45405 47008 43736 17921 16117 66472 94645 68568
13169 68568 63934 40962 54941 53956 32869 -2773 -19220 2827 53053 71737 57618 66512
13157 66512 50828 83506 35836 26700 91444 77129 35808 7166 -17104 -82659 -108577 -103469
13145 -103469 -83806 -53410 8682 -49995 -104154 -132174 -79005 6542 44376 27089 6114
13134 6114 51970 109803 24998 892 -51991 -26058 -15733 -12929 -23145 -15198 -3824 -30180
13122 -30180 -31091 -62761 -73386 -61517 -39971 -2278 11523 53186 11593 55701 90884 66062
13110 66062 -4980 -57592 -20560 15219 -18738 -24788 -3145 19629 65073 -8784 -14197 37817
$$ packed form
13194I8919L6243L1779j076o1949j7735l2749n4061o423M6281R923J7567K596
13182F9315N257m608p1081m7399M1356N2565J603l272k5815j804N0355K8173k6077
13169F8568m634k2972J3979r85k1087l5642j6447K2047N0226J8684j4119Q894
13157F6512j5684L2678m7670r136O4744j4315m1321k8642k4270o5555k5918N108
13145a03469J9663L0396O2092n8677n4159k8020N3169Q5547L7834j7287k0975
13134F114M5856N7833q4805k4106n2883K5933J0325K804j0216P947J1374k6356
13122c0180r11l1670j0625J1869K1546L7693J3801M1663m1593M4108L5183k4822
13110F6062p1042n2612L7032L5779l3957o050K1643K2774M5444p3857n413N2014
$$ plain form
13098 37817 65424 49724 52755 9290 -19310 -21801 18477 63256 56713 70279 34834 15519
13086 15519 14602 -41972 -51744 -54558 -34179 28995 79315 74438 56706 -15871 -21569 61214 18762
13073 18762 -31198 -6109 28020 73511 76756 173213 178992 74992 30431 31532 6365 -34684
13061 -34684 -37535 13887 137103 129492 81627 51194 4514 -23446 -15899 5055 8737 -23000
13049 -23000 -11248 -22843 -33726 -66701 -44341 38062 79778 38670 42657 32855 -7344 -43162
13037 -43162 -1731 47007 99167 50726 23043 66530 81583 35913 2795 -10587 -3710 82441
13025 82441 121453 81313 16596 13284 17378 9860 -1864 53727 69129 52638 42595 89798
13013 89798 50093 62903 51404 -25842 -35459 19290 58176 31206 -19039 -59008 -44696 -61091
$$ packed form
13098C7817K7607j5700L031m3465k8600k491M0278M4779o543J3566l5445j9315
13086A5519r17n6574r772k814K0379O3174N0320m877j7732p2577n698Q2783m2452
13073A8762m9960K5089L4129M5491L245R6457N779j04000m4561J101k5167m1049
13061c4684k851N1422J23216p611m7865l0433m6680k7960P547K0954L682l1737
13049b3000J1752j1595j0883l2975K2360Q2403M1716m1108L987r802m0199l5818
13037d3162M1431M8738N2160m8441k7683M3487J5053m5670l3118j3382O877Q6151
13025H2441L9012m0140o4717l312M094p518j1724N5591J5402j6491j0043M7203
13013H9798l9705J2810j1499p7246r617N4749L8886k6970n0245l9969J4312j6395
$$ plain form
13001 -61091 -43057 -21575 -11327 28017 70011 79274 91393 40805 -29914 -52934 -71616 -37426
12989 -37426 -24915 -3071 -11303 35035 51804 23228 4430 -37401 -21958 8279 -12920 -2483
12977 -2483 43695 35467 2709 59816 122329 81666 7482 -50298 -60112 22348 101436 88283
12965 88283 61498 15756 -20465 -12960 -4193 5243 1972 -9708 -68482 -67646 -67574 -60285 -56710 -19286
12951 -19286 -14819 -37000 31225 82077 90531 35338 -50924 -78874 -81598 -129501 -134353 -80267
12939 -80267 -3461 76549 86472 85388 24248 -68211 -160164 -90522 -25191 -33732 -70988 -78895
12927 -78895 -74170 -104522 -98207 -11497 -18221 -47561 -61326 -54345 11729 109764 118631 46581 624
12914 624 34291 69691 99610 71597 72153 64191 93797 23781 -5304 12983 32877 -29650 -47146
$$ packed form
13001f1091J8034K1482J0248L9344M1994R263J2119n0588p0719k3020j8682L4190
12989c7426J2511K1844q232M6338J6769k8576j8798m1831J5443L0237k1199J0437
12977b483M6178q228l2758N7107O2513m0663p4184n7780r814Q2460P9088j3153
12965H8283k6785m5742l6221P505Q767R436l271j1680n8774Q36P2P289L575L7424
12951a9286M467k2181O8225N0852Q454n5193q6262k7950k724m7903m852N4086
12939h0267P6806Q0010R923j084o1140r2459r1953O9642O5331q541l7256p907
12927g8895M725l0352O315Q6710o724k9340j3765O981O6074R8035Q867p2050m5957
12914F24L3667L5400K9919k8013N56p962K9606p0016k9085J8287J9894o2527j7496
$$ plain form
12901 -47146 -54582 -35110 35124 81798 61194 -4182 31533 12469 -42016 -43231 -29801 -3373
12889 -3373 18258 46342 30578 38769 32808 -13566 -26271 -8560 -3718 776 10580 -63741 -88075
12876 -88075 -60784 -47803 -42787 -32389 -45418 -85013 -45623 -7496 -5028 -8243 9732 -953
12864 -953 55202 33693 -25064 6307 52099 72489 71094 54063 47006 15409 65045 79536
12852 79536 60337 43722 1792 2837 45689 27028 -17338 5231 30139 34013 82100 98653
12840 98653 57750 30017 37770 71956 53954 35456 19128 -5602 18746 14822 -26728 14167
12828 14167 -4302 -24679 -50156 -13471 29493 -189 -13337 10110 -3165 4112 5942 -574
12816 -574 -8556 -15972 78480 134177 64312 -14026 -13144 -25617 22359 72432 29395 13169 -41700
$$ packed form
12901d7146p436J9472P0234M6674k0604o5376L5715j9064n4485j215J3430K6428
12889c373K1631K8084j5764Q191n961m6374j2705J7711M842M494R804p4321k4334
12876h8075K7291J2981N016J0398j3029l9595L9390L8127K468l215J7975j0685
12864i53N6155k1509n8757L1371M5792K0390j395j7031p057l1597M9636J4491
12852G9536j9199j6615m1930J045M2852j8661m4366K2569K4908L874M8087J6553
12840I8653m0903k7733P753L4186j8002j8498j6328k4730K4348l924m1550M0895
12828A4167j8469k0377k5477L6685M2964k9682j3148K3447j3275P277J830o516
12816e74p982p416R4452N5697o9865p8338Q82j2473M7976N0073m3037j6226n4869
$$ plain form
12803 -41700 -48497 -59681 -39694 59871 62475 23171 32873 16752 -39827 -75129 -31204 2641
12791 2641 44673 83789 91835 115520 115819 70434 4049 33840 83371 91674 75289 40099 58868
12778 58868 97780 19819 28675 49500 5759 -37924 -52360 -70070 21265 70740 11381 10096
12766 10096 -24934 -39356 22204 48267 30432 -19881 -57447 -27323 -31131 -31376 -16287 -86924
12754 -86924 -142660 -127345 -39072 -6311 -50625 -69105 -81062 -67273 -101866 -103539 -47446 -11708
12742 -11708 25811 75503 41835 11528 53625 16596 -45167 -50641 -25009 -15147 8380 -34692
12730 -34692 -94397 -114149 -59918 -81092 -132663 -98810 -109264 -117123 -49452 17189 -27053 -90394
12718 -90394 -33489 14830 -48207 -12269 1679 32967 24895 -31331 -64309 16607 95138 65951
$$ packed form
12803d1700o797j1184J9987R9565K604l9304R702j6121n6579l5302M3925L3845
12791B641M2032L9116Q046K3685K99m5385o6385K9791M9531Q303j6385l5190J8769
12778E8868L8912p7961Q856K0825m3741m3683j4436j7710R1335M9475n9359j285
12766A0096l5030j4422O1560K6063j7835n0313l7566L0124l808k45J5089p0637
12754h6924n5736J5315Q8273L2761m4314j8480j1957J3789l4593j673N6093L5738
12742a1708L7519M9692l3668l0307M2097l7029o1763n474K5632R862K3527m3072
12730c4692n9705j9752N4231k1174n1571L3853j0454p859O7671O6641m4242o3341
12718i0394N6905M8319o3037L5938J3948L1288q072n6226l2978Q0916P8531k9187
$$ plain form
12706 65951 -16041 -49728 -27615 2744 42576 84695 82358 48145 64357 85710 62032 77626
12694 77626 49183 -6918 -21000 -61095 -62503 -57014 -36090 45011 40517 980 -13064 -9405
12682 -9405 -2784 44855 67862 -8626 -79206 -82064 -68466 -40609 -56689 -86923 -82541 34654
12670 34654 42552 -19060 33 -13721 3886 38953 66468 46955 30000 16759 37976 66292
12658 66292 24416 -679 -15924 2007 -4457 -12500 13716 50911 64469 47184 6993 40607
12646 40607 54260 3420 50199 78419 42709 28058 30420 33289 53185 80261 114780 83179
12634 83179 57655 12250 39467 -10604 -13008 -92100 -117225 -61599 16851 27301 -16919 -16375
12622 -16375 -16554 -55258 -97051 -141379 -36902 36148 -31123 -79263 -64848 -15210 3493 -49020
$$ packed form
12706F5951q1992l3687K2113L0359L9832M2119k337l4213J6212K1353k3678J5594
12694G7626k8443n6101j4082m0095j408N489K0924Q1101m494l9537j4044L659
12682i405O621M7639K3007p6488p0580k858J3598K7857j6080l0234M382J17195
12670C4654P898o1612J9093j3754J7607L5067K7515j9513j6955j3241K1217K8316
12658F6292m1876k5095j5245J7931o464q043K6216L7195J3558j7285m0191L3614
12646D0607J3653n0840M6779K8220l5710j4651K362K869J9896K7076L4519l1601
12634H3179k5524m5405K7217n0071k404p9092k5125N5626P8450J0450m4220N44
12622a6375j79l8704m1793m4328J04477P3050o7271m8140J4415M9638J8703n2513
$$ plain form
12610 -49020 -4473 -15073 -61088 -118998 -131242 -119156 -71934 17620 52879 19277 37498 66033
12598 66033 54079 36502 45196 9275 29978 24285 -30599 2758 42122 1398 -58263 -55489
12586 -55489 -47567 -53517 -21599 4035 84309 95159 88119 61973 -51502 -49840 2751 -7449
12574 -7449 6621 11990 63264 53720 -5047 -16945 -7810 -16093 -60835 -15827 5238 32893 66887
12561 66887 62203 107190 121629 30693 -56204 -105318 -101874 -33320 -32818 -30113 1557 6075 26601
12548 26601 7572 -21937 -53182 -18999 -5491 -58945 -86347 -40329 60287 174643 111169
12537 111169 30528 -19733 -35058 -3358 79527 135631 128827 89209 87506 60445 8354 -24074
12525 -24074 3469 23706 91679 110619 45944 27678 23081 38591 73111 20507 -4352 -14497
$$ packed form
12610d9020M4547j0600m6015n7910j2244J2086M7222Q9554L5259l3602J8221K8535
12598F6033j1954j7577Q694l5921K0703n693n4884L3357L9364m0724n9661K774
12586e5489P922n950L1918K5634Q0274J0850p040k6146j13475J662N2591j0200
12574g449J4070N369N1274r544n8767j1898R135q283m4742M5008K1065K7655L3994
12561F6887m684M4987J4439r0936q6897m9114L444O8554N02K705L1670M518K0526
12548B6601j9029k9509l1245L4183J3508n3454k7402M6018J00616J14356o3474
12537A11169q0641n0261j5325L1700Q2885N6104o804l9618j703k7061n2091l2428
12525b4074K7543K0237O7973J8940o4675j8266m597J5510L4520n2604k4859j0145
$$ plain form
12513 -14497 -45499 19038 77638 74332 35790 13288 16231 69582 68446 71196 92438 23746
12501 23746 -53721 -73456 -83038 -73847 -1225 1142 -33749 -64368 -44893 15217 43362 48108
12489 48108 51471 49028 14258 47095 -25204 -80831 -56185 -42289 -61979 -49992 -7464 -52341
12477 -52341 -53022 -40856 -100948 -104424 -55559 -33966 -42214 11868 33465 41929 3814 -3424 11635
12464 11635 67893 87132 1974 -86264 -67049 -56236 -41182 -71857 -75274 -50506 -13685 -36819
12452 -36819 -57806 -86644 -77716 -19868 7309 26060 68313 47566 22854 -20502 -28196 -57715
12440 -57715 -91182 -167491 -109015 -72205 -112989 -130293 -25999 44539 62214 63884 46575 6511
12428 6511 -70903 -50879 -45873 -55578 -44755 -45212 -107137 -142630 -143681 -115524 -44913 -46451 -51634
$$ packed form
12513a4497l1002O4537N8600l306l8542k2502K943N3351j136K750K1242o8692
12501B3746p7467j9735r582R191P2622K367l4891l0619J9475O0110K8145M746
12489D8108L363k443l4770L2837p2299n5627K4646J3896j9690J1987M2528m4877
12477e2341o81J2166o0092l476M8865K1593q248N4082K1597Q464l8115p238J5059
12464A1635N6258J9239q5158q8238J9215J0813J5054l0675l417K4768L6821k3134
12452c6819k0987k8838Q928N7848K7177J8751M2253k0747k4712m3356p694k9519
12440e7715l3467p6309N8476L6810m0784j7304J04294P0538J7675J670j7309m0064
12428F511p7414K0024N006r705J0823m57o1925l5493j051K8157P0611j538n183
$$ plain form
12415 -51634 -28883 -31939 -75854 -96460 -75261 -20146 884 -42416 -45198 -40045 -30332 -10359
12403 -10359 -7084 -27060 -32371 11065 -23402 -109235 -62390 -40827 -127389 -105328 -26501 -50200
12391 -50200 -58258 3029 42150 67541 48051 -36242 -65170 -72807 -55681 -45273 -76844 -94106
12379 -94106 -80338 -40416 11708 -16549 -21357 -11899 13043 31784 18205 3387 36 -32802
12367 -32802 -89860 -83992 -55085 -52642 -49532 -44394 -48674 650 43475 30353 25776 24069 52094
12354 52094 65414 27996 22647 34615 10545 12906 30351 69358 43750 47059 55835 71061
12342 71061 64858 43185 88469 89511 76012 10063 51375 3641 -72236 -49099 -38282 -15149
12330 -15149 20457 2731 -12255 33738 64199 45074 -2084 1841 24155 26511 28089 35359
$$ packed form
12415e1634K2751l056m3915k0606K1199N5115K1030m3300k782N153R713J9973
12403a0359L275j9976n311M3436l4467q5833M6845K1563q6562K2061P8827k3699
12391e0200q058O1287L9121K5391j9490q4293k8928p637J7126J0408l1571j7262
12379i4106J3768L9922N2124k8257m808R458K4942J8741j3579j4818l351l2838
12367c2802n7058N868K8907K443L110N138m280M9324M2825j3122m577j707K8025
12354E2094J3320l7418n349J1968k4070K361J7445L9007k5608L309Q776J5226
12342G1061o203k1673M5284J042j3499o5949M1312m7734p5877K3137J0817K3133
12330a5149L5606j7726j4986M5993L0461j9125m7158L925K2314K356J578P270
$$ plain form
12318 35359 17863 77456 71915 -17502 -32904 -52955 -4277 16085 -4417 -6073 -30379 -77053
12306 -77053 -126230 -132380 -85255 -46658 -1747 84326 60118 30551 45241 -11826 -27732 -76371
12294 -76371 -92542 -36692 35528 77431 3142 11435 -26577 -39971 -39816 -41893 -27672 21747
12282 21747 -20476 -54183 -18506 -10665 2758 29231 98285 87187 64212 117650 171709 95109
12270 95109 16896 -13006 28719 51031 40559 -23209 -47680 -15690 45214 65066 14683 -48734
12258 -48734 -27091 -46251 -77227 -54186 8788 49645 34856 16586 -32883 -93461 -90140 -103500
12246 -103500 -99809 -58554 -91441 -140042 -145069 -85455 -83001 -53483 -61147 -103534 -103303 -19845 5041
12233 5041 -29281 4962 19495 -2570 -28624 -44907 -23920 -23078 -83160 -135809 -106736 -58727
$$ packed form
12318C5359j7496N9593n541q9417j5402k0051M8678K0362k0502j656k4306m6674
12306g7053m9177o150M7125L8597M4911Q6073k4208k9567J4690n7067j5906m8639
12294g6371j6171N5850P2220M1903p4289Q293l8012j3394J55k077J4221M9419
12282B1747m2223l3707L5677P841J3423K6473O9054j1098k2975N3438N4059p6600
12270I5109p8213k9902M1725K2312j0472o3768k4471L1990O0904J9852n0383o3417
12258d8734K1643j9160l0976K3041O2974M0857j4789j8270m9469o0578L321j3360
12246a03500L691M1255l2887m8601n027N9614K454K9518p664m2387K31Q3458K4886
12233E041l4322L4243J4533k2065k6054j6283K0987Q42o0082n2649K9073M8009
$$ plain form
12221 -58727 -12563 -69012 -93010 -51592 -32647 -51197 -39284 -29905 -32621 -29671 -85729 -88625
12209 -88625 -87752 -33033 -4847 -51840 -58678 -68837 -66840 7054 11968 -20528 -67583 -69552 -66575
12196 -66575 -85593 -47995 -36775 -42089 -52977 -27746 17448 62310 63137 76185 107505 44490
12184 44490 -24467 -78439 -138903 -127838 -105336 -79939 -48587 46781 103030 54651 -10772 -33900
12172 -33900 -64174 -79824 -79845 -91173 -49853 -48896 -83926 -17825 10828 30206 -9292 -27538 12075
12159 12075 36725 37804 23863 -19185 14560 -8585 -6909 22602 -15660 14658 36889 39959
12147 39959 82545 34704 3385 31708 1867 -32072 18758 32724 21251 76125 37651 -11392
12135 -11392 -5059 -15056 28628 19416 12203 3648 6184 65124 55656 4851 -12831 26882 -22697
$$ packed form
12221e8727M6164n6449k3998M1418J8945j8550J1913R379k716K950n6058k896
12209h8625Q73N4719K8186m6993o838j0159J997P3894M914l2496m7055j969K977
12196f6575j9018L7598J1220n314j0888K5231M5194M4862Q27J3048L1320o3015
12184D4490o8957n3972o0464J1065K2502K5397L1352R5368N6249m8379o5423k3128
12172c3900l0274j5650k1j1328M1320R57l5030O6101K8653J9378l9498j8246L9613
12159A2075K4650J079j3941m3048L3745k3145J676K9511l8262L0318K2231L070
12147C9959M2586m7841l1319K8323k9841l3939N0830J3966j1473N4874l8474m9043
12135a1392O333r997M3684r212p213q555K536N8940r468n0805j7682L9713m9579
$$ plain form
12122 -22697 -26433 13174 67840 69135 21108 -42806 -110462 -45322 44276 43522 -55763 -63319 -25666
12109 -25666 -82933 -95337 -97429 -50468 -19333 -23801 -32854 -44488 -19163 10368 -1658 -11978
12097 -11978 -1174 -17596 -69218 -19569 -29456 -44280 -3150 29594 15181 50527 49238 53290
12085 53290 90471 65584 46549 -20269 -43437 -42949 -98950 -100947 -111986 -71001 -68767 -106646
12073 -106646 -110038 -60180 -39682 -53684 -39483 -13247 4505 -32979 -39663 -20246 50633 79600
12061 79600 55494 24863 -34675 21933 70015 63005 25859 35709 -1921 -228 -35191 -3875
12049 -3875 40167 28587 33842 50638 30747 26765 71836 53954 35228 -3181 22321 36685
12037 36685 -37984 -38105 -20542 7041 -9222 -51513 -93578 -16885 48692 62966 41071 5673
$$ packed form
12122b2697l736L9607N4666J295m8027o3914o7656O5140Q9598p54r9285p556L7653
12109b5666n7267j2404k092M6961L1135m468r053j1634K5325K9531j2026j0320
12097a1978J0804j6422n1622M9649r887j4824M1130L2744j4413L5346j289M052
12085E3290L7181k4887j9035o6818k3168M88n6001j997j1039M0985K234l7879
12073a06646l392M9858K0498j4002J4201K6236J7752l7484o684J9417P0879K8967
12061G9600k4106l0631n9538N6608M8082p010l7146R850l7630J693l4963L1316
12049c875M4042j1580N255J6796j9891l982M5071j7882j8726l8409K5502J4364
12037C6685p4669j21J7563K7583j6263m2291m2065P6693O5577J4274k1895l5398
$$ plain form
12025 5673 -47561 -16399 -75246 -10753 79615 68656 50402 15736 20055 27546 10765 16865
12013 16865 10336 -36841 -49743 -73571 -111154 -87969 -86880 -55498 5631 12396 -56147 -76465
12001 -76465 21869 154912 150937 115312 148363 138063 140637 60706 1882 -20954 -77748 -70660
11989 -70660 -4128 7895 1365 -22457 -42491 -12778 5072 30309 89047 86194 74564 86361
11977 86361 -1308 -48737 -9838 36524 125860 148070 114946 31341 -18269 -2606 20142 13677
11965 13677 -37941 -93075 -81005 -37589 -16280 25378 81590 -16925 -48759 -73164 -79470 -86448
11953 -86448 -99404 -88515 -70011 -26452 -17733 -12994 36839 113988 100962 32160 -29434 -7267
11941 -7267 54382 70280 22592 8927 47153 -11156 -56198 -58644 -39160 23517 21341 25699
$$ packed form
12025E673n3234L1162n8847O4493R0368j0959j8254l4666M319P491j6781O100
12013A6865o529m7177j2902k3828l7583K3185J089L1382O1129O765o8543k0318
12001g6465R8334J33043l975l5625L3051j0300K574p9931n8824k2836n6794P088
11989g0660O6532J2023o530k3822k0034K9713J7850K5237N8738k853j1630J1797
11977H6361q7669m7429L8899M6362Q9336K2210l3124q3605m9610J5663K2748o465
11965A3677n1618n5134J2070M3416K1309M1658N6212r8515l1834k4405o306o978
11953h6448j2956J0889J8504M3559Q719M739M9833P7149j3026o8802o1594K2167
11941g267O1649J5898m7688j3665L8226n8309m5042k446J9484O2677k176M358
$$ plain form
11929 25699 41472 69214 31314 1047 -12474 2222 1533 26576 35833 42021 18442 -4066
11917 -4066 -29468 -28446 -86463 -151502 -127887 -88969 -73460 -62472 -19190 8952 -18172 -63053
11905 -63053 -103589 -103280 -115895 -121287 -111912 -102558 -49980 9536 75549 88748 64173 -15022 -42190
11892 -42190 71854 21023 -40335 -50204 -360 52111 847 -70684 -99668 -138340 -168165 -105649
11880 -105649 -66313 -9166 18370 -12297 1301 -111 6610 -53944 -89117 -71408 -78600 -99310
11868 -99310 -88041 -27958 -14717 -44600 -39808 -39711 25794 80236 80105 36392 -15015 -65360 -21498
11855 -21498 12243 -6569 -14083 -43202 -47171 -37460 -65270 -67189 -33075 37267 40429 20959 40124
11842 40124 52356 19279 16068 -6264 -21384 -24418 -10172 -58596 -89915 -70302 -48100 -11516
$$ packed form
11929B5699J5773K7742l7900l0267j3521J4696o89K5043R257O188k3579k2508
11917d066k5402J022n8017o5039K3615L8918J5509J0988M3282K8142k7124m4881
11905f3053m0536L09j2615n392R375R354N2578N9516O6013J3199k4575p9195k7168
11892d2190J14044n0831o1358r869M9844N2471n1264p1531k8984l8672k9825O2516
11880a05649L9336N7147K7536l0667J3598j412O721o0554l5173J7709p192k0710
11868i9310J1269O0083J3241k9883M792R7O5505N4442j31m3713n1407n0345M3862
11855b1498L3741j8812p514k9119l969R711k7810j919L4114P0342L162j9470J9165
11842D0124J2232l3077l211k2332j5120l034J4246m8424l1319J9613K2202L6584
$$ plain form
11830 -11516 -16955 -1788 11445 21844 53076 53990 24139 61902 73912 64855 39762 4769
11818 4769 30861 68098 44734 -27430 -27946 -4921 3493 30495 -14092 -58483 -43248 26080
11806 26080 9316 -24798 -51319 -64751 -71352 -82422 -103746 -48496 -15011 -21771 -67697 -76061
11794 -76061 -66342 -42004 -10727 -45569 -83714 -126829 -60407 -1136 -12662 57139 11801 -46050
11782 -46050 -12823 -694 1800 -23653 -35365 8125 24361 -29231 6735 -23098 -32302 -33556
11770 -33556 -77313 -76736 -23710 24787 5825 -31306 -50771 -52773 -63664 -56684 -106095 -85313
11758 -85313 -41906 -59255 -35168 237 882 -3965 57852 80528 70046 33752 14401 -1538
11746 -1538 20803 -11684 -18810 54164 116080 69757 28407 43354 9758 -87689 -104399 -83363
$$ packed form
11830a1516n439J5167J3233J0399L1232R14k9851L7763J2010r057k5093l4993
11818D769K6092L7237k3364p2164n16K3025Q414K7002m4587m4391J5235O9328
11806B6080j6764l4114k6521j3432o601j1070k1324N5250L3485o760m5926q364
11794g6061R719K4338L1277l4842l8145m3115O6422N9271j1526O9801m5338n7851
11782d6050L3227J2129K494k5453j1712M3490J6236n3592L5966k9833r204j254
11770c3556m3757N77N3026M8497j8962l7131j9465k002j0891O980m9411K0782
11758h5313M3407j7349K4087L5405O45m847O1817K2676j0482l6294j9351j5939
11746a538K2341l2487p126P2974O1916m6323m1350J4947l3596r7447j6710K1036
$$ plain form
11734 -83363 -76358 -108658 -189656 -134885 -61081 23731 57649 86312 70054 9902 -30428 -6055
11722 -6055 29132 6567 -21435 -11218 25576 48319 63334 25719 5098 40409 106905 111201
11710 111201 63678 57336 71544 32433 30531 -2212 -108942 -90863 -25021 25221 6168 -25596
11698 -25596 32931 35904 37746 65433 77934 21934 19750 21308 -31471 -51455 -67642 -43058
11686 -43058 58793 80109 7485 -4903 59559 24158 7435 82468 52033 -11427 -13523 -5846
11674 -5846 -1313 -5232 17333 89416 93251 79504 28184 -13769 -44612 -22658 26727 79263
11662 79263 32853 -34409 -15940 -48189 14340 58501 58220 5762 -24556 -5383 31270 63572
11650 63572 68120 1321 -41821 -23365 -9913 17483 17412 -17345 -8568 -17782 -61124 -90007 -110799
$$ packed form
11734h3363P005l2300q0998N4771P3804Q4812L3918K8663j6258o0152m0330K4373
11722f055L5187k2565k8002J0217L6794K2743J5015l7615k0621L5311O6496M296
11710A11201m7523o342J4208l9111j902l2743j06730J8079O5842N0242j9053l1764
11698b5596N8527K973J842K7687J2501n6000k184J558n2779j9984j6187K4584
11686d3058J01851K1316p2624j2388O4462l5401j6723P5033l0435o3460k096P677
11674e846M533l919K2565P2083L835j3747n1320m1953l0843K1954M9385N2536
11662G9263m6410o7262J8469l2249O2529M4161k81n2458l0318J9173L6653L2302
11650F3572M548o6799m3142J8456J3452K7396p1l4757Q777r214m3342k8883k0792
$$ plain form
11637 -110799 -100403 -22113 5339 22501 55753 -24392 -62409 -24285 -28759 -29687 -5565 -2942
11625 -2942 -9556 -20579 -17832 -12966 -37242 -60625 -33434 -30725 -76319 -43622 -50011 -76362 -136115
11612 -136115 -146543 -152326 -115473 -41345 -32089 -44557 -95044 -96680 -51113 -18008 22530 78147
11600 78147 58119 52201 77766 88857 46522 -2992 -603 -1381 3075 -16882 -24387 327 20837
11587 20837 78817 66539 121670 98596 5746 -65098 -52413 -4035 44369 -160 -6613 41765
11575 41765 50231 41264 45558 16579 -18317 3206 26952 -13415 -50640 -26249 86044 115033
11563 115033 95013 41965 58925 94234 51570 6984 -922 -63827 -51372 5999 75818 4087
11551 4087 -31711 -13902 -24660 -30026 -33786 -52128 -62039 -45185 -107317 -129915 -166995 -101504
$$ packed form
11637a10799J0396P8290K7452J7162L3252q0145l8017L8124m474r28K4122K623
11625b942o614j1023K747M866k4276k3383K7191K709m5594L2697o389k6351n9753
11612a36115j0428n783L6853P4128R256j2468n0487j636M5567L3105M0538N5617
11600G8147k0028n918K5565J1091m2335m9514K389p78M456j9957p505K4714K0510
11587B0837N7980j2278N5131k3074r2850p0844J2685M8378M8404m4529o453M8378
11575D1765Q466q967M294k8979l4896K1523K3746m0367l7225K4391J12293K8989
11563A15033k0020n3048J6960L5309m2664m4586p906o2905J2455N7371O9819p1731
11551D087l5798J7809j0758n366l760j8342r911J6854o2132k2598l7080O5491
$$ plain form
11539 -101504 -85265 -81553 -76395 -110013 -105254 -20955 15022 -8819 -39553 -42783 -51715 2697
11527 2697 10331 15805 61587 131120 129611 83445 36158 21455 12212 23497 32129 -4989 -59725
11514 -59725 -115354 -80968 -35890 -42490 -86376 -43705 -24922 -42857 -22803 -35102 -91249 -118747
11502 -118747 -81012 -35892 -36498 -36313 10900 22702 39820 54741 12344 2305 38048 15581
11490 15581 3100 14516 -11538 -13293 -10518 -9060 -11151 -47087 -55535 -55822 37391 76627 40466
11477 40466 73516 47741 -4298 -18445 26760 119591 118913 14911 -3273 51092 72421 66343
11465 66343 23024 -13284 -39969 -35248 15790 -11609 -42868 1138 96183 99828 99691 45046
11453 45046 24549 27342 732 -10923 10759 46982 22008 -5350 -17316 -5015 941 30903
$$ packed form
11539a01504J6239L712N158l3618M759Q4299L5977k3841l0734l230q932N4412
11527B697P634N474M5782O9533j509m6166m7287j4703r243J1285Q632l7118n4736
11514e9725n5629L4386M5078o600m3886M2671J8783j7935K0054j2299n6147k7498
11502a18747L7735M5120o06J85M7213J1802J7118J4921m2397j0039L5743k2467
11490A5581j2481J1416k6054j755K775J458k091l5936q448k87R3213L9236l6161
11477D0466L3050k5775n2039j4147M5205R2831o78j04002j8184N4365K1329o078
11465F6343m3319l6308k6685M721N1038k7399l1259M4006R5045L645j37n4645
11453D5046k0497K793k6610j1655K1682L6223k4974k7358j1966J2301N956K9962
$$ plain form
11441 30903 73342 80082 39811 32122 42842 11684 31345 48159 44461 -115 -73402 -109933
11429 -109933 -55222 8606 105581 114592 79835 26460 45545 52095 64296 20411 -3728 -61436
11417 -61436 -54786 16617 -29576 -58655 -38794 -6260 52597 33623 -11099 -22669 15402 48415
11405 48415 19131 987 91857 127402 75269 82017 85386 103112 130178 25305 -47173 -37981
11393 -37981 -1606 86 11935 32385 58172 96259 72771 33946 -62316 -63400 13997 37754
11381 37754 41345 53725 79097 125439 70297 12239 25445 34577 -2600 -36296 -72922 -90986
11369 -90986 11777 137078 205010 195524 163982 135549 99357 140727 158506 168757 56671
11358 56671 -16936 3794 -16104 2468 28721 -24930 -93345 -62950 8145 18383 55015 60194
$$ packed form
11441C0903M2439O740m0271p689J0720l1158J9661J6814l698m4576p3287l6531
11429a09933N4711O3828R6975R011l4757n3375J9085O550J2201m3885k4139n7708
11417f1436O650P1403m6193k9079J9861L2534N8857j8974m4722j1570L8071L3013
11405D8415k9284j8144R0870L5545n2133O748L369J7726K7066j04873p2478R192
11393c7981L6375J692J1849K0450K5787L8087k3488l8825r6262j084P7397K3757
11381C7754L591J2380K5372M6342n5142n8058J3206R132l7177l3696l6626j8064
11369i0986J02763J25301O7932r486l1542k8433l6192M1370J7779J0251j12086
11358E6671p3607K0730j9898J8572K6253n3651o8415L0395P1095J0238L6632N179
$$ plain form
11346 60194 85110 80175 -5220 -27179 -62803 -124359 -121884 6924 62911 118672 98072 16305
11334 16305 21384 48097 72723 176863 175494 106718 -27566 -56244 -3814 75999 58676 75125
11322 75125 61695 36100 70943 114642 97983 23409 9312 57681 68111 79079 37189 65166
11310 65166 67850 -28249 -23213 87153 57473 -11765 -76882 -46049 -6899 -23287 -34980 32913
11298 32913 57514 31816 53630 29569 47173 67623 71080 107557 85223 61305 30162 42881
11286 42881 4427 -20771 -31318 19846 64775 51553 63761 76416 118360 98064 62551 23189
11274 23189 7358 61603 55574 42502 30583 9060 75816 56404 -24481 -40480 32638 84160
11262 84160 94718 66281 100108 71480 31596 -908 -2623 -20202 4492 18232 25612 40241
$$ packed form
11346F0194K4916m935q5395k1959l5624o1556K475J28808N5987N5761k0600q1767
11334A6305N079K6713K4626J04140j369o8776j34284k8678N2430P9813j7323J6449
11322G5125j3430k5595L4843M3699j6659p4574j4097M8369J0430J0968m1890K7977
11310F5166K684r6099N036J10366k9680o9238o5117L0833L9150j6388j1693O7893
11298C2913K4601k5698K1814k4061J7604K0450L457L6477k2334k3918l1143J2719
11286D2881l8454k5198j0547N1164M4929j3222J2208J2655M1944k0296l5513l9362
11274B3189j5831N4245o029j3072j1919k1523O6756j9412q0885j5999P3118N1522
11262H4160J0558k8437L3827k8628l9884l2504j715j7579K4694J3740P380J4629
$$ plain form
11250 40241 73442 95323 86687 32865 13921 26918 632 -13382 13445 72631 71268 80056
11238 80056 51133 30930 81198 107512 78127 52145 10348 11385 -61618 -87645 -37927 -51875
11226 -51875 4179 401 12731 23864 57136 33598 22418 57465 94773 92163 66460 -2737
11214 -2737 -33823 -11705 38917 108717 113971 76855 -10131 -62526 -39092 -44204 -58608 -23933
11202 -23933 39824 84603 123118 85104 72198 67482 59164 71877 54944 -1044 8783 43051
11190 43051 16687 -4612 -30767 225 5158 -47240 -67015 7658 57214 51685 60877 92810
11178 92810 75375 56130 51895 12833 -8022 22629 23768 -49512 23697 116387 116973 94049
11166 94049 133847 152263 66807 -29086 -49845 11494 58169 109898 61500 74457 82150 30580
$$ packed form
11250D0241L3201K1881q636n3822j8944J2997k6286j4014K6827N9186j363Q788
11238H0056k8923k0203N0268K6314k9385k5982m1797J037p3003k6027M9718j3948
11226e1875N6054l778J2330J1133L3272k3538j1180L5047L7308k610k5703o9197
11214b737l1086K2118N0622O9800N254l7116q6986n2395K3434n112j4404L4675
11202b3933O3757M4779L8515l8014j2906m716q318J2713j6933n5988R827L4268
11190D3051k6364k1299k6155L0992M933n2398j9775P4673M9556n529R192L1933
11178I2810j7435j9245m235l9062k0855L0651J139p3280P3209R2690N86k2924
11166I4049L9798J8416q5456r5893k0759O1339M6675N1729m8398J2957P693n1570
$$ plain form
11154 30580 9658 45691 58778 9550 -28408 -43531 -27047 -2935 39750 47042 53518 40118
11142 40118 -21067 -24192 -9477 5064 -2886 3380 13906 -8382 -21250 -18855 66414 162086
11130 162086 154997 158699 77707 -7052 9793 46877 93807 120709 70985 61795 45095 -13874
11118 -13874 -88098 -94299 -63437 -7660 5086 72824 113391 27182 21563 66626 51371 -19599
11106 -19599 22768 97056 109189 71582 8778 -15374 -28398 -41061 -25295 44370 53982 72455
11094 72455 60211 66698 107817 130924 87308 39731 94617 92343 110532 81699 67551 102897
11082 102897 114167 73192 56514 69177 57404 474 -3762 57967 83459 21206 35128 50650
11070 50650 29686 18947 48713 90261 136000 152994 104836 103415 103487 48093 -22996 -19810 225
$$ packed form
11154C0580k0922L6033J3087m9228l7958j5123J6484K4112M2685P292O476j3400
11142D0118o1185l125J4715J4541p950O266J0526k2288j2868K395Q5269R5672
11130A62086p089L702q0992q4759J6845L7084M6930K6902m9724r190j6700n8969
11118a3874p4224o201L0862N5777J2746O7738M0567q6209n619M5063j5255p0970
11106a9599M2367P4288J2133l7607o2804k4152j3024j2663J5766O9665R612J8473
11094G2455j2244O487M1119K3107m3616m7577N4886k274J8189k8833j4148L5346
11082A02897J1270m0975j6678J2663j1773n6930m236O1729K5492o2253J3922J5522
11070E0650k0964j0739K9766M1548M5739J6994m8158j421P2n5394p1089L186K0035
$$ plain form
11057 225 -13228 59968 106176 80880 55321 19789 4346 -35115 -1607 30748 13369 -8106
11045 -8106 -53458 -43081 1333 17803 10730 25079 106994 59553 6020 64713 118102 114491
11033 114491 39914 15593 91560 100224 64189 85474 109375 50989 -14323 -981 93442 143396
11021 143396 164716 162187 136661 107831 150402 161017 255273 346018 329806 328612 353198 489146
11009 489146 717135 1035458 1353908 1587396 1736266 1774273 1726411 1441852 1073291 801264
10999 801264 686700 597948 500705 378678 312781 379511 387322 343456 380237 398051 310150
10988 310150 249868 225713 208244 194236 169936 188305 201838 163626 219633 287806 228333
10977 228333 157858 128659 146003 190531 231648 237058 185557 133499 117859 74079 76167 62696
$$ packed form
11057B25j3453P3196M6208k5296k5559l5532j5443l9461L3508L2355j7379k1475
11045h106m5352J0377M4414J6470p073J4349Q1915m7441n3533N8693N3389l611
11033A14491p4577k4321P5967Q664l6035K1285K3901n8386o5312J3342R4423M9954
11021A43396K1320k529k5526k8830M2571J0615R4256R0745j6212j194K4586J35948
11009D89146K27989L18323L18450K33488J48870L8007m7862k84559l68561k72027
10999H01264j14564q8752r7243j22027o5897O6730P811m3866L6781J7814q7901
10988C10150o0282k4155j7469j4008k4300J8369J3533l8212N6007O8173n9473
10977B28333p0475k9199J7344M4528M1117N410n1501n2058j5640m3780K088j3471
$$ plain form
10965 62696 70993 93112 115903 145924 181015 177639 149838 128254 133263 116145 175486 207810
10953 207810 268874 254333 152968 98753 55078 32445 12750 38793 94197 62513 9311
10942 9311 14118 30399 37269 26965 63599 3632 -41847 -28077 4331 23418 48431 64237
10930 64237 122953 157211 172178 127625 68293 52513 65171 118533 121844 109093 130439 58835
10918 58835 24678 123964 138954 102260 109813 84130 109356 107755 145960 163987 170466 153046
10906 153046 153983 212482 196095 147328 78147 88409 109782 136979 132484 126365 163775 178473
10894 178473 143599 104085 93631 161785 148560 156690 146436 144050 140863 80269 95090 130678
10882 130678 167853 205102 190780 142972 179778 261733 271215 179052 104201 64971 54528 107293
$$ packed form
10965F2696Q297K2119K2791L0021L5091l376k7801k1584N009j7118N9341L2324
10953B07810O1064j4541j01365n4215m3675k2633j9695K6043N5404l1684n3202
10942I311M807J6281O870j0304L6634n9967m5479J3770L2408J9087K5013J5806
10930F4237N8716L4258J4967m4553n9332j5780J2658N3362L311j2751K1346p1604
10918E8835l4157R9286J4990l6694P553k5683K5226j601L8205J8027O479j7420
10906A53046R37N8499j6387m8767o9181J0262K1373K7197m495o119L7410J4698
10894A78473l4874l9514j0454O8154j3225Q130j0254k386l187o0594J4821L5588
10882A30678L7175L7249j4322m7808L6806Q1955R482r2163p4851l9230j0443N2765
$$ plain form
10870 107293 187397 181211 151618 179076 224968 214068 151816 177950 200931 202339 237078 203853
10858 203853 151031 202290 246134 333053 387608 383611 347148 313449 362912 427278 373802 249835
10846 249835 197917 165065 188995 181427 163465 113694 61064 104768 135343 93955 106387 146263
10834 146263 133609 129286 149328 123228 142974 157104 174014 173201 202979 216600 168092 206904
10822 206904 254030 238220 213884 208501 244417 179671 202957 182354 99968 46761 88537 155563
10810 155563 166107 189538 227706 223663 210064 178971 105430 80203 122076 102758 84266 53720
10798 53720 26513 38106 37966 52330 83328 93953 135119 134940 117198 151441 168522 156502
10786 156502 179561 223070 267314 340667 330030 252141 238716 240223 236163 206361 260763 331471
$$ packed form
10870A07293Q0104o186k9593K7458M5892j0900o2252K6134K2981J408L4739l3225
10858B03853n2822N1259M3844Q6919N4555l997l6463l3699M9463O4366n3476j23967
10846B49835n1918l2852K3930p568j7962m9771n2630M3704L0575m1388J2432L9876
10834A46263j2654m323K0042k6100J9746J4130J6910q13K9778J3621m8508L8812
10822B06904M7126j5810k4336n383L5916o4746K3286k0603q2386n3207M1776O7026
10810A55563J0544K3431L8168m043j3599l1093p3541k5227M1873j9318j8492l0546
10798E3720k7207J1593j40J4364L0998J0625M1166j79j7742L4243J7081j2020
10786A56502K3059M3509M4244P3353j0637p7889j3425J507m060k9802N4402P0708
$$ plain form
10774 331471 323574 317477 292337 283786 268743 239067 192244 154254 221907 228951 264507 285808
10762 285808 304042 357495 347888 346907 350252 326857 326229 292279 213736 160765 184764 234229 281450
10749 281450 290396 282352 320227 292918 239255 273909 365204 346290 345298 340018 401231 394250 387066
10736 387066 417454 419867 426208 416419 356087 389968 435407 443406 459883 538886 627272 653443
10724 653443 653637 643081 647235 638676 619707 613055 596278 607078 619742 598897 559671 571070
10712 571070 575899 581381 592536 584532 532892 534721 482576 494098 556475 597680 617055 615526
10700 615526 602462 673856 665126 612036 568189 510597 477520 458048 525136 547090 527842 511671
10688 511671 504660 552775 574855 603462 628913 620734 666563 739177 756957 714000 718959 757795
$$ packed form
10774C31471p897o097k5140q551j5043k9676m6823l7990O7653P044L5556K1301
10762B85808J8234N3453r607r81L345k3395o28l3950p8543n2971K3999M9465M7221
10749B81450Q946q044L7875k7309n3663L4654R1295j8914r92n280O1213o981p184
10736C87066L0388K413O341r789o0332L3881M5439P999J6477P9003Q8386K6171
10724F53443J94j0556M154q559j8969o652j6777J0800J2664k0845l9226J1399
10712E71070M829N482J1155q004n1640J829n2145J1522O2377M1205J9375j529
10700F15526j3064P1394q730n3090m3847n7592l3077j9472O7088K1954j9248j6171
10688E11671p011M8115K2080K8607K5451q179M5829P2614J7780m2957M959L8836
$$ plain form
10676 757795 742104 725210 793151 827960 860515 821174 774246 824410 817323 727995 747487 789215
10664 789215 786469 750294 708770 671485 627823 604765 614216 624967 715254 838504 917480 908393
10652 908393 958707 952728 926963 1006323 1109241 1257934 1364362 1441270 1547948 1604348 1705332
10641 1705332 1736577 1734197 1716775 1703135 1695466 1696054 1754173 1836942 1923437 2040917 2265404 2514600
10629 2514600 2750469 2929500 3110052 3263894 3475584 3765225 4160191 4649198 5346400
10620 5346400 6072708 6655852 7212408 7796848 8351515 8718037 9056972 9659522 10570040
10611 10570040 11835439 13456018 15401210 17787922 20771632 24618845 29464218 35942143
10603 35942143 44960698 58116361 78202739 109643735 157028115 216529764 269457014
$$ packed form
10676G57795j5691j6894O7941L4809L2555l9341m6928N0164p087q9328J9492M1728
10664G89215k746l6175m1524l7285m3662k3058R451J0751R0287J23250P8976r087
10652I08393N0314n979k5765P9360J02918J48693J06428P6908J06678N6400J00984
10641A705332L1245k380j7422j3640p669N88N8119Q2769Q6495J17480K24487K49196
10629B514600K35869J79031J80552J53842K11690K89641L94966M89007O97202
10620E346400P26308N83144N56556N84440N54667L66522L38935O02550R10518
10611A0570040J265399J620579J945192K386712K983710L847213M845373O477925
10603C5942143R018555J3155663K0086378L1440996M7384380N9501649N2927250
$$ plain form
10596 269457014 299462664 312911506 317868954 297052514 233456116 167488554 122999324
10589 122999324 95697094 78299405 66422893 57802933 51370825 46496113 42433917
10582 42433917 38838526 35856550 33428650 31270135 29333439 27508802 25804220 24354435
10574 24354435 23211570 22353040 21466643 20706955 20093138 19400257 18539685 17561973 16684984
10565 16684984 15932009 15255013 14637263 14060425 13461017 13017545 12644495 12303645 11944166
10556 11944166 11564519 11247145 10969668 10598234 10185798 9843262 9530041 9195407 8796698
10547 8796698 8508526 8219843 7981336 7828473 7660250 7472802 7272170 7110127 6873603
10538 6873603 6666399 6555967 6441273 6324140 6121636 5878593 5644850 5377245 5162165
$$ packed form
10596B69457014L0005650J3448842M957448k0816440o3596398o5967562m4489230
10589A22999324k7302230j7397689j1876512q619960o432108m874712m062196
10582D2433917l595391k981976k427900k158515j936696j824637j704582j449785
10574B4354435j142865q58530q86397p59688o13817o92881q60572r77712q76989
10565A6684984p52975o76996o17750n76838n99408m43472l73050l40850l59479
10556A1944166l79647l17374k77477l71434m12436l42536l13221l34634l98709
10547H796698k88172k88683k38507j52863j68223j87448k00632j62043k36524
10538F873603k07204j10432j14694j17133k02504k43043k33743k67605k15080
$$ plain form
10529 5162165 4913891 4750854 4670896 4530720 4374452 4238683 4120925 3975751 3881111 3775206
10519 3775206 3713848 3608360 3528743 3436095 3271262 3163783 3093322 2977366 2857036 2789329
10509 2789329 2708555 2624148 2573079 2437813 2330241 2267447 2260113 2194355 2172767 2120893 2086816
10498 2086816 1994920 1865840 1775479 1708279 1689986 1696881 1673855 1669886 1660145 1591045 1583412 1590994
10486 1590994 1610698 1587297 1516616 1438917 1414584 1370780 1303235 1215203 1193321 1210506 1176591
10475 1176591 1108388 1032442 964893 880421 780205 776511 783497 771283 652591 553996 528100
10464 528100 465848 381620 291086 215150 195517 174950 253296 293957 318715 328862 256906
10453 256906 231517 194318 155199 151145 177381 200090 217153 235842 191872 140325 120617 122921
$$ packed form
10529E162165k48274j63037p9958j40176j56268j35769j17758j45174r4640j05905
10519C775206o1358j05488p9617r2648j64833j07479p0461j15956j20330o7707
10509B789329q0774q4407n1069j35266j07572o2794p334o5758k1588n1874l4077
10498B086816r1896j29080r0361o7200j8293O895k3026l969r741o9100p633P582
10486A590994J9704k3401p0681p7699k4333m3804o7545q8032k1882J7185l3915
10475A176591o8203p5946o7549q4472j00216l694O986j2214j18692r8595k5896
10464E28100o2252q4228r0534p5936j9633k0567P8346M0661K4758J0147p1956
10453B56906k5389l7199l9119m054K6236K2709J7063J8689m3970n1547j9708K304
$$ plain form
10441 122921 61167 16929 212 -35140 -16169 25777 47961 92058 102674 112187 132691 111071
10429 111071 106221 91003 144470 159249 143045 142553 169961 190737 167281 185644 271915 200879
10417 200879 126592 120420 154706 160922 127786 57721 -1530 -74308 -70579 -104320 -78104 -18936
10405 -18936 54002 71126 126917 121857 88892 82388 45306 57845 81863 128314 98917 107520
10393 107520 82404 127359 196306 189235 130854 143544 62117 25036 74027 50714 31481 51699
10381 51699 66815 67600 75653 50554 77064 192266 190560 136122 118890 75251 81099 102793
10369 102793 81807 85366 69259 57380 143335 120839 71879 85168 150471 143488 49560 41312
10357 41312 127374 109792 113737 163694 167946 231218 269754 191661 174790 162890 93505 103212
$$ packed form
10441A22921o1754m4238j6717l5352J8971M1946K2184M4097J0616R513K0504k1620
10429A11071m850j5218N3467J4779j6204m92K7408K0776k3456J8363Q6271p1036
10417B00879p4287o172L4286O216l3136p0065n9251p2778L729l3741K6216N9168
10405a8936P2938J7124N5791n060l2965o504l7082J2539K4018M6451k9397Q603
10393A07520k5116M4955O8947p071n8381J2690q1427l7081M8991k3313j9233K0218
10381E1699J5116P85Q053k5099K6510J15202j706n4438j7232m3639N848K1694
10369A02793k0986L559j6107j1879Q5955k2496m8960J3289O5303o983r3928q248
10357D1312Q6062j7582L945M9957M252O3272L8536p8093j6871j1900o9385R707
$$ plain form
10345 103212 165650 204516 121431 73715 27165 11303 -14262 1711 25652 -14943 -67832
10334 -67832 -24719 17485 26099 82730 143899 144405 112817 65439 57400 95684 129752 54091
10322 54091 3557 -41722 -65344 -88999 -105440 -113896 -70914 -36007 -24371 -41133 -48660 -14542
10310 -14542 15466 -16100 -29751 -41507 -46604 -57477 -51263 -27330 7680 19448 5727 -20965
10298 -20965 -38650 -11685 -42198 -63555 -82533 -119838 -51891 1333 -29817 -70614 -76490 -42364
10286 -42364 -26394 -29256 -12210 48886 -556 -63010 -45939 -34311 -65172 -62462 -23027 24834
10274 24834 22422 11370 64478 59451 23197 -29487 -50786 -104113 -94005 -86551 -124764 -141777
10262 -141777 -89124 -72190 -66007 -98416 -90053 -63568 -28857 -40334 -107358 -125248 -98529 -80712
$$ packed form
10345A03212O2438L8866q3085m7716m6550j5862k5565J5973K3941m0595n2889
10334f7832M3113M2204Q614N6631O1169N06l1588m7378q039L8284L4068p5661
10322E4091n0534m5279k3622k3655j6441q456M2982L4907J1636j6762p527L4118
10310a4542L0008l1566j3651j1756n097j0873O214K3933L5010J1768j3721k6692
10298b0965j7685K6965l0513k1357j8978l7305O7947N3224l1150m0797n876L4126
10286d2364J5970k862J7046O1096m9442o2454J7071J1628l0861K710L9435M7861
10274B4834k412j1052N3108n027l6254n2684k1299n3327J0108P454l8213j7013
10262a41777N2653J6934O183l2409Q363K6485L4711j1477o7024j7890K6719J7817
$$ plain form
10250 -80712 -36181 11394 44733 10370 -38431 -45372 -10095 16817 -38190 -55913 -24084 -19356
10238 -19356 -9959 -46400 -60433 -111325 -101458 -88451 -92669 -23512 2403 -5202 26730 25656 30981
10225 30981 74824 76568 60072 36477 -9428 -23609 48720 159317 140590 38196 -25517
10214 -25517 -47795 -7180 19420 13778 10388 -11913 -47059 -21345 2586 6679 -27975 -103448
10202 -103448 -62130 22319 26021 13104 76423 129725 113881 58550 76560 102158 95087 111006
10190 111006 121766 140625 227998 324476 493964 604699 791603 1164094 1465345 1595909
10180 1595909 1712891 1741450 1631422 1350923 1032004 712425 502161 407668 338229 260171
10170 260171 206310 223191 186167 171513 174737 173853 189508 172564 153233 141504 144074 134062
$$ packed form
10250h0712M4531M7575L3339l4363m8801o941L5277K6912n5007j7723L1829M728
10238a9356R397l6441j4033n0892R867J3007m218O9157K5915p605L1932j074N325
10225C0981M3843J744j6496k3595m5905j4181P2329J10597j8727j02394o3713
10214b5517k2278M0615K6600n642l390k2301l5146K5714K3931M093l4654p5473
10202a03448M1318Q4449L702j2917O3319N3302j5844n5331J8010K5598p071J5919
10190A11006J0760J8859Q7373R6478J69488J10735J86904L72491L01251J30564
10180A595909J16982K8559j10028k80499l18919l19579k10264r4493o9439p8058
10170B60171n3861J6881l7024j4654L224q84J5655j6944j9331j1729K570j0012
$$ plain form
10158 134062 60450 37362 33633 73076 43382 69862 114353 53386 22615 35086 33513 2978
10146 2978 6580 8009 18891 6600 -29731 -14454 23295 29016 31099 80452 57298 39268 31465
10133 31465 8507 50771 81348 28251 -13602 -43624 -10226 -590 -14919 -47908 -60089 -12012
10121 -12012 -38810 -29420 49375 129638 130424 113894 82166 -1767 -15563 21716 46547 45712 -8607
10108 -8607 -40404 6181 3820 12253 2153 -5116 -57105 -109719 -68862 25892 33583 -59204 -118925
10095 -118925 -34269 15002 -28721 -34426 -28292 -94625 -97334 -84193 -101620 -49392 -18239 -22043
10083 -22043 -5393 38029 53985 56130 99657 59841 -10587 28267 48912 11441 -1620 5947
10071 5947 4117 86424 47940 -9207 -18551 -35219 3984 19778 10356 30544 29946 50895 17750
$$ packed form
10158A34062p3612k3088l729L9443k9694K6480M4491o0967l0771J2471j573l0535
10146B978L602J429J0882j2291l6331J5277L7749N721K083M9353k3154j8030p803
10133C1465k2958M2264L0577n3097m1853l0022L3398R636j4329l2989j2181M8077
10121a2012k6798R390P8795Q0263P86j6530l1728q3933j3796L7279K4831q35n4319
10108h607l1797M6585k361Q433j0100p269n1989n2614M0857R4754P691r2787n9721
10095a18925Q4656M9271m3723n705O134o6333k709J3141j7427N2228L1153l804
10083b2043J6650M3422J5956K145M3527l9816p0428L8854K0645l7471j3061P567
10071E947j830Q2307l8484n7147r344j6668L9203J5794r422K0188n98K0949l3145
$$ plain form
10058 17750 4784 39798 6262 -19416 12778 54972 110614 162306 217616 343746 455791
10047 455791 583483 717061 761639 759606 773269 720907 549995 420654 360525 279845 159381
10036 159381 122475 144569 179328 134865 84268 24403 -94401 -139964 -59993 -100741 -77391
10025 -77391 26972 61522 73580 11693 -33115 -91541 -89396 -60949 -59573 -52059 -32724 26360
10013 26360 -21279 -17403 -22256 -8333 31715 15047 -34031 -82232 -112399 -78411 -47179 -66788
10001 -66788 -119131 -55482 -35263 14970 87220 81503 64602 101645 54790 -694 -54503 -69483
9989 -69483 -48014 -29894 4544 26964 58675 64933 70381 46726 -20396 -43728 -10706 4318
9977 4318 31679 5009 -26296 -15061 -62318 -71718 -36643 -59062 -92214 -75576 -56478 -41819
$$ packed form
10058A7750j2966L5014l3536k5678L2194M2194N5642N1692N5310J26130J12045
10047D55791J27692J33578M4578k033J3663n2362j70912j29341o0129q0680j20464
10036A59381l6906K2094L4759m4463n0597n9865j18804m5563P9971m0748K3350
10025g7391J04363L4550J2058o1887m4808n8426K145K8447J376P514J9335N9084
10013B6360m7639L876m853J3923M0048j6668m9078m8201l0167L3988L1232j9609
10001f6788n2343O3649K0219N0233P2250n717j6901L7043m6855n5484n3809j4980
9989f9483K1469J8120L4438K2420L1711O258N448k3655o7122k3332L3022J5024
9977D318K7361k6670l1305J1235m7257r400L5075k2419l3152J6638J9098J4659
$$ plain form
9965 -41819 -46492 -50003 -29534 47599 73937 66630 33055 67842 61018 -21336 -57314 -70798 -11840
9952 -11840 24005 36201 11381 -45751 -67862 -36887 37889 35109 -48201 -66642 -20846 -45506
9940 -45506 -69944 -81277 -98110 -43624 -29027 -41049 -11339 -33766 -27929 -10414 18561 -44212
9928 -44212 -45904 33474 50737 62081 5666 4225 -8949 -2200 -25886 -16016 -51996 -63732 -19120
9915 -19120 -36688 -37473 -17581 35764 42835 24397 21682 22088 -18503 -49994 -88814 -128726 -122142
9902 -122142 -81852 -56260 -20215 -46475 -21453 49337 49562 43301 6869 30406 25735 36658
9890 36658 39293 47243 -31476 -60533 -50621 14214 30905 29550 42954 4078 30378 30956 65574
9877 65574 115497 88880 2925 -13905 -22054 -10302 899 11147 61032 63921 64114 17572 -63252
$$ packed form
9965d1819m673l511K0469P7133K6338p307l3575L4787o824q2354l5978j3484N8958
9952a1840L5845J2196k4820n7132k2111L0975P4776k780q3310j8441M5796k4660
9940d5506k4438j1333j6833N4486J4597j2022K9710k2427N837J7515K8975o2773
9928d4212j692P9378J7263J1344n6415j441j3174O749k3686R870l5980j1736M4612
9915a9120j7568p85J9892N3345P071j8438k715M06m0591l1491l8820l9912O584
9902a22142M0290K5592L6045k6260K5022P0790K25o261l6432K3537m671J0923
9890C6658K635P950p8719k9057R912O4835J6691j355J3404l8876K6300N78L4618
9877F5574M9923k6617q5955j6830q149J1752J1201J0248M9885K889J93m6542q0824
$$ plain form
9864 -63252 -126234 -154289 -105696 -30343 -46936 2628 33974 57876 -27431 -34777 28886 42614
9852 42614 105681 91726 43682 40439 23617 -16403 -3552 23530 12376 39611 12277 45085
9840 45085 20861 -73530 -50474 -49082 -53478 -80838 -81032 -64911 -67323 -70380 -48372 12883 26027
9827 26027 71151 65625 18244 36560 14863 -33149 -23017 17889 -3712 44060 75163 33423
9815 33423 -5818 -37185 -72125 -28369 7163 -6492 11203 48979 50894 -17248 -44293 -63371
9803 -63371 -17459 -13066 -20896 -24957 -31603 -66740 -89647 -115634 29026 82606 6066 -20233
9791 -20233 30335 43109 55642 47106 33229 21272 37381 23897 42979 -6703 -62018 -57265
9779 -57265 -27435 5673 17131 -16791 -84202 -59117 8319 12742 -13513 18104 20517 -9675
$$ packed form
9864f3252o2982k8055M8593P5353j6593M9564L1346K3902q5307p346O3663J3728
9852D2614O3067j3955m8044l243j6822m0020J2851K7082j1154K7235k7334L2808
9840D5085k4224r4391K3056J392m396k7360j94J6121k412l057K2008O1255J3144
9827B6027M5124n526m7381J8316k1697m8012J0132M0906k1601M7772L1103m1740
9815C3423l9241l1367l4940M3756L5532j3655J7695L7776J915o8142k7045j9078
9803f3371M5912M393p830m061o646l5137k2907k5987J44660N3580p6540k6299
9791b0233N0568J2774J2533q536j3877j1957J6109j3484J9082m9682n5315M753
9779e7265K9830L3108J1458l3922o7411K5085O7436M423k6255L1617K413l0192
$$ plain form
9767 -9675 -33450 -31211 -63972 -103977 -32998 26067 56827 72848 77617 24729 19760 -19832 -558
9754 -558 65108 65742 30437 -11234 299 54384 -21577 11220 79976 123636 121003 31916 -22326
9741 -22326 -1289 2192 13253 66955 76946 -20705 -60309 -31939 -19836 5661 16736 -3436
9729 -3436 5103 5060 -26393 -45874 -41795 -48329 -61856 -76560 -54938 -77808 -118098 -130777 -66054
9716 -66054 8067 46110 34417 9786 51419 75484 94149 80616 26373 44811 56922 103270
9704 103270 124135 107639 106750 92640 109026 45094 -22443 -6759 -13025 10797 41245 -7319
9692 -7319 -18291 36044 8262 -9319 -58061 -50568 -42439 -76496 -80164 -45445 -31916 20079 17807
9679 17807 38223 60496 -464 -41698 -39465 -19325 94 8985 25111 443 -7491 23164
$$ packed form
9767i675k3775K239l2761m0005P0979N9065L0760J6021M769n2888m969l9592J9274
9754e58O5666O34l5305m1671J1533N4085p5961L2797O8756M3660k633q9087n4242
9741b2326K1037L481J1061N3702R991r7651l9604K8370J2103K5497J1075k0172
9729c436Q539m3l1453j9481M079o534j3527j4704K1622k2870m0290j2679O4723
9716f6054P4121L8043j1693k4631M1633K4065J8665j3533n4243J8438J2111M6348
9704A03270K0865j6496q89j4110J6386o3932o7537J5684o266K3822L0448m8564
9692g319j0972N4335k7782j7581m8742P493Q129l4057l668L4719J3529N1995k272
9679A7807K0416K2273o0960m1234K233K0140J9419Q891J6126k4668p934L0655
$$ plain form
9667 23164 8655 -26728 58558 52452 34944 -15339 -25177 14348 7546 4854 26648 2876 -10191
9654 -10191 5027 114184 176961 88049 37786 34447 4995 -73051 -165601 -163581 -126331 -92399
9642 -92399 -99564 -86331 -62190 -18638 -47976 -18864 98573 184211 168985 155567 142657 50248
9630 50248 -76129 -160055 -170894 -172495 -104638 -76430 -80811 -78766 -57771 -39461 -45117 -58177
9618 -58177 16002 50979 72089 73696 31978 12976 43005 79155 103276 43130 -57835 -69631
9606 -69631 -72835 -69581 -67288 26999 112803 126705 99996 93149 88823 82261 29508 -31942 -73632
9593 -73632 -32799 23854 79449 66963 -8537 -15125 2041 22545 11313 -18212 715 4558
9581 4558 38099 51750 98511 105003 49475 549 20035 75612 82550 48790 -24966 -45454
$$ packed form
9667B3164j4509l5383Q5286o106j7508n0283r838L9525o802k692K1794k3772j3067
9654a0191J5218J09157O2777q8912n0263l339k9452p8046r2550K020L7250L3932
9642i2399p165J3233K4141M3552k9338K9112J17437Q5638j5226j3418j2910r2409
9630E0248j26377q3926j0839j601O7857K8208m381K045K0995J8310n656j3060
9618e8177P4179L4977K1110J607m1718j9002L0029L6150K4121o0146j00965j1796
9606f9631l204L254K293R4287Q5804J3902k6709o847m326o562n2753o1450m1690
9593g3632M0833N6653N5595j2486p5500o588J7166K0504j1232k9525J8927L843
9581D558L3541J3651M6761O492n5528m8926J9486N5577O938l3760p3756k0488
$$ plain form
9569 -45454 -8871 -13331 -5299 56272 71714 42215 47196 26497 24454 90716 57421 -11671 6056
9556 6056 30581 11569 -40954 -40032 -22631 -50314 -55312 -104559 -63466 -58325 -78845 -58690 -11903
9543 -11903 11750 -36628 -89409 -88030 -49520 -78627 -85874 -90444 -35046 30830 -23980 -43167
9531 -43167 -216 6115 -7947 -18288 -65319 -82871 -38998 34782 92096 28026 -112280 -79076
9519 -79076 21366 105241 143508 104427 13692 21534 20446 -94962 -129306 -76455 -34870 -95289
9507 -95289 -71784 -25498 -21543 -44262 -39124 -42068 -62379 -8590 -12093 -7265 -48919 126 24278
9494 24278 -11113 -40533 -60138 -35111 25108 -50259 -65747 -41140 4364 43147 -36690 -45233
9482 -45233 -19962 -3575 18750 -5586 -38945 -44749 2294 21728 -41038 -88679 -45412 -3056
$$ packed form
9569d5454L6583m460Q032O1571J5442k9499M981k0699k043O6262l3295o9092J7727
9556F056K4525j9012n2523R22J7401k7683m998m9247M1093N141k0520K0155M6787
9543a1903K3653m8378n2781J379L8510k9107p247m570N5398O5876n4810j9187
9531d3167M2951O331j4062j0341m7031j7552M3873P3780N7314o4070j40306L3204
9519g9076J00442Q3875L8267l9081r0735P842j088j15408l4344N2851M1585o0419
9507i5289K3505M6286L955k2719N138k944k0311N3789l503M828m1654M9045K4152
9494B4278l5391k9420j9605K5027O0219p5367j5488K4607M5504L8783p9837q543
9482d5233K5271J6387K2325k4336l3359n804M7043J9434o2766m7641M3267M2356
$$ plain form
9470 -3056 -46636 -64489 -29110 -59673 -98778 -64683 -33153 -1916 36006 11745 -26545 -104689
9458 -104689 -170063 -189398 -143483 -35285 42193 87918 114640 87038 60296 48510 41695 10031
9446 10031 -21394 -12003 -73803 -95003 20343 48567 6742 -27866 35060 41051 12472 10749
9434 10749 -48013 -49046 -8465 35004 36523 38774 -2862 -32822 -35853 -68220 -73032 -25667 12617
9421 12617 6179 -31481 -59405 -73438 -40920 11762 27959 2219 -20928 -94385 -109612 -77282
9409 -77282 -10493 63988 35082 51594 25210 68503 82820 71946 46318 63290 39145 1767
9397 1767 -48997 -84378 -123315 -71703 5250 65859 32303 -15374 11510 12342 -22442 -26624 -42961
9384 -42961 -67358 -54731 -41515 -6879 19923 69648 46997 12948 -31904 -59014 -11771 57739
$$ packed form
9470c056m3580j7853L5379l0563l9105L4095L1530L1237L7922k4261l8290p8144
9458a04689o5374j9335M5915J08198P7478M5725K6722k7602k6742j1786o815l1664
9446A0031l1425R391o1800k1200J15346K8224m1825l4608O2926N991k8579j723
9434A0749n8762j033M0581M3469J519K251m1636k9960l031l2367m812M7365L8284
9421A2617o438l7660k7924j4033L2518N2682J6197k5740k3147p3457j5227L2330
9409g7282O6789P4481k8906J6512k6384M3293J4317j0874k5628J6972k4145l7378
9397A767n0764l5381l8937N1612P6953O0609l3556m7677K6884Q32l4784m182j6337
9384d2961k4397J2627J3216L4636K6802M9725k2651l4049m4852k7110M7243O9510
$$ plain form
9372 57739 67746 42351 -37497 -23917 54883 57144 80462 118142 109857 45042 40694 78298
9360 78298 37335 -16828 -13577 43077 21073 -15605 -23116 -8455 -1515 8112 39856 23754 52766
9347 52766 79446 108233 59591 33417 10658 18894 93271 128287 72582 90582 87211 88586
9335 88586 62302 31358 13136 24878 30755 -12285 -31646 -45690 -65413 -17055 50346 84571
9323 84571 77592 50164 42751 70196 -3694 -51063 21565 76842 92282 43203 56785 7627
9311 7627 18590 36509 50744 81476 44983 29208 15687 31189 10269 -22130 -7995 19183
9299 19183 22502 91615 45971 19836 41166 34832 5394 -22691 -26591 -10522 6033 34224
9287 34224 61965 35880 79262 134511 49120 2496 -29760 -18406 18693 12863 36923 87901
$$ packed form
9372E7739J0007k5395p9848J3580P8800K261K3318L7680q285o4815m348L7604
9360G8298m0963n4163L251N6654k2004l6678p511J4661O940R627L1744j6102K9012
9347E2766K6680K8787m8642k6174k2759Q236P4377L5016n5705J8000l371J375
9335H8586k6284l0944j8222J1742N877m3040j9361j4044j9723M8358O7401L4225
9323H4571o979k7428p413K7445p3890m7369P2628N5277J5440m9079J3582m9158
9311G627J0963J7919J4235L0732l6493j5775j3521J5502k0920l2399J4135K7178
9299A9183L319O9113m5644k6135K1330o334k9438k8085l900J6069J6555K8191
9287C4224K7741k6085M3382N5249q5391m6624l2256J1354L7099n830K4060N0978
$$ plain form
9275 87901 71262 -12422 -44666 -14849 -17813 60780 59659 89165 173159 213626 180012 127226
9263 127226 83703 109258 145905 133034 101340 67615 97764 94474 123170 110016 117775 81373
9251 81373 75276 79127 78907 55094 33329 -15106 -5583 -21603 4557 41985 64020 94680 133865
9238 133865 110347 94556 171932 193225 177868 111184 159021 160123 181118 146661 97590 66646
9226 66646 47381 39186 103290 97404 56231 68514 113398 75749 68650 38726 21270 -2354
9214 -2354 -35389 -50318 -14010 24090 13949 -11419 31094 44936 91557 113134 109308 125668
9202 125668 79653 83160 140127 175578 217177 177510 147216 136503 127825 127476 167246 194889
9190 194889 159343 118968 146278 56819 93120 154642 122959 134958 133152 143772 147151 136245
$$ packed form
9275H7901j6639q3684l2244K9817k964P8593j121K9506Q3994M0467l3614n2786
9263A27226m3523K5555L6647j2871l1694l3725L0149l290K8696j3154P759l6402
9251H1373o097L851k20k3813k1765m8435R523j6020K6160L7428K2035L0660L9185
9238A33865k3518j5791P7376K1293j5357o6684M7837J102K0995l4457m9071l0944
9226F6646j9265q195O4104n886m1173J2283M4884l7649p099k9924j7456k3624
9214b354l3035j4929L6308L8100j0141k5368M2513J3842M6621K1577l826J6360
9202A25668m6015L507N6967L5451M1599l9667l0294j0713q678l49L9770K7643
9190A94889l5546m0375K7310q9459L6301O1522l1683J1999j806J0620L379j0906
$$ plain form
9178 136245 154845 144018 141470 134344 85314 17538 29397 36167 74742 125171 126424 90989
9166 90989 114551 150843 133806 111343 108852 109264 99454 115879 91374 78273 128133 120943 95826
9153 95826 72161 103082 160377 139400 128047 189658 226630 221374 254519 254899 273279 278582 305089
9140 305089 329308 394890 410142 394200 447720 487583 432610 382315 405266 476951 562918 585109
9128 585109 633352 647738 729883 832971 865651 924641 1006209 1087826 1240840 1390029 1576358
9117 1576358 1805700 2062094 2426864 2931688 3586433 4445609 5686165 7614572 10555376
9108 10555376 15134690 21762041 29062264 34349488 36900383 37989694 37689692 32305698
9100 32305698 23576152 16838538 12681994 10097166 8391473 7219841 6346272 5709039
$$ packed form
9178A36245J8600j0827k548p126m9030o7776J1859O770L8575N0429J253l5435
9166I0989K3562L6292j7037k2463k491M12r810J6425k4505j3101M9860p190k5117
9153I5826k3665L0921N7295k0977j1353O1611L6972n256L3145L80J8380N303K6507
9140C05089K4219O5582J5252j5942N3520L9863n4973n0295K2951P1685Q5967K2191
9128E85109M8243J4386Q2145J03088L2680N8990Q1568Q1617J53014J49189J86329
9117A576358K29342K56394L64770N04824O54745Q59176J240556J928407K940804
9108A0555376M579314O627351P300223N287224K550895J089311l00002n383994
9100C2305698q729546o737614m156544k584828j705693j171632q73569o37233
$$ plain form
9092 5709039 5193358 4754503 4336548 3980853 3758442 3587163 3352547 3086398 2929743 2800560
9082 2800560 2648517 2477713 2313519 2159273 2097057 2070924 2038128 2014991 1956170 1878194 1836738
9071 1836738 1790506 1714837 1657749 1591923 1557211 1518947 1442864 1326577 1336718 1304716 1307764
9060 1307764 1265350 1211654 1171502 1131411 1083513 1058041 1017814 958916 887003 889761 852607 788949
9048 788949 775090 756137 744953 764155 754117 720010 712631 734243 698258 624162 600901 643524
9036 643524 644223 610863 581393 562693 500169 503375 433757 432525 438841 369029 329467 296274 283835
9023 283835 330792 330448 310464 295512 417705 452786 367231 344801 247367 175808 167560 215886
9011 215886 230858 234255 196355 231578 227608 260114 314188 290294 214391 197882 210997 248775
$$ packed form
9092E709039n15681m38855m17955l55695k22411j71279k34616k66149j56655j29183
9082B800560j52043j70804j64194j54246o2216k6133l2796k3137n8821p7976m1456
9071A836738m6232p5669n7088o5826l4712l8264p6083j16287J0141l2002L048
9060A307764m2414n3696m0152m0091m7898k5472m0227n8898p1913K758l7154o3658
9048G88949j3859j8953j1184J9202j0038l4107p379K1612l5985p4096k3261M2623
9036F43524O99l3360k9470j8700o2524L206o9618j232O316o9812l9562l3193j2439
9023B83835M6957l44j9984j4952J22193L5081q5555k2430r7434p1559q248M8326
9011B15886J4972L397l7900L5223l970L2506N4074k3894p5903j6509J3115L7778
$$ plain form
8999 248775 256433 207448 178334 231029 238602 207527 182601 143635 136442 223843 247194 290458
8987 290458 301178 261511 127941 148725 148108 115908 113164 123686 93852 97096 31645 -7306
8975 -7306 -3538 80310 131293 99962 42881 -5346 -90498 -97215 -92999 -78144 -99086 -95933 -89124
8962 -89124 -81381 -40937 -63627 -45542 -13778 3535 16065 14559 -46056 -82184 -63686 -2419
8950 -2419 5409 -106 -28042 13657 51723 46091 60616 59939 19974 4987 -8860 5377 28582
8937 28582 75676 117072 124944 64150 21689 56869 50744 25865 47537 90984 100212 83886
8925 83886 87867 114199 86285 77544 75642 78699 64393 33869 34907 76037 49578 -66397 -42194
8912 -42194 5523 -9103 -47174 3104 -3495 -45280 -62469 16599 17243 40331 29712 -27288
$$ packed form
8999B48775P658m8985k9114N2695P573l1075k4926l8966p193Q7401K3351M3264
8987B90458J0720l9667j33570K0784o17l2200k744J0522k9834L244o5451l8951
8975g306L768Q3848N0983l1331n7081m8227q5152o717M216J4855k0942L153O809
8962h9124P743M0444k2690J8085L1764J7313J2530j506o0615l6128J8498O1267
8950b419P828n515k7936M1699L8066n632J4525o77l9965j4987j3847J4237K3205
8937B8582M7094M1396P872o0794m2461L5180o125k4879K1672M3447R228j6326
8925H3886L981K6332k7914q741j902L057j4306l0524J038M1130k6459j15975K4203
8912d2194M7717j4626l8071N0278o599m1785j7189P9068O44K3088j0619n7000
$$ plain form
8900 -27288 -45324 -4314 -20745 -69759 -127740 -149547 -114659 -109153 -83948 -28274 -29505 -11236
8888 -11236 -8362 3319 48446 81306 44736 14202 -20876 -21584 -33476 -34783 -40793 -95362 -101759
8875 -101759 -47853 -77611 -56656 -40323 -15876 -71939 -96468 -86395 -56191 -26118 9484 40829
8863 40829 25975 -21066 -10935 15159 14522 -45184 -54533 -17094 4521 61596 64176 65177 85816
8850 85816 98958 131086 133789 70652 45751 6775 -52071 -55213 -44702 -24188 1079 -27710
8838 -27710 -55726 21480 44040 -4079 -15620 29976 82693 95096 80796 77670 51559 -41603
8826 -41603 -37491 4030 -8093 5126 7066 -37480 -2226 37916 23001 4834 66397 18342
8814 18342 -37901 37447 58001 95997 128973 94358 103274 82271 23632 -31208 -9058 583
$$ packed form
8900b7288j8036M1010j6431m9014n7981k1807L4888N506K5205N5674j231J8269
8888a1236K874J1681M5127L2860l6570l0534l5078p08j1892j307o010n4569o397
8875a01759N3906k9758K0955J6333K4447n6063k4529J0073L0204L0073L5602L1345
8863D0829j4854m7041J0131K6094o37n9706r349L7439K1615N7075K580J001K0639
8850H5816J3142L2128K703o3137k4901l8976n8846l142J0511K0514K5267k8789
8838b7710k8016P7206K2560m8119j1541M5596N2717J2403j4300l126k6111r3162
8826d1603M112M1521j2123J3219J940m4546L5254M0142j4915j8167O1563m8055
8814A8342n6243P5348K0554L7996L2976l4615Q916k1003n8639n4840K2150R641
$$ plain form
8802 583 19813 31846 39225 48970 17757 -19021 25729 56386 59129 28972 -9332 -14035 -32865
8789 -32865 -41973 -60248 -70964 -14785 -19243 -6640 51293 39189 15643 5301 20060 32603
8777 32603 46179 99065 78661 132681 85725 9630 6774 3053 28680 12288 -16129 -6682
8765 -6682 -16465 -28263 17033 64183 154232 161372 139929 159702 153921 145920 104212 89977 88366
8752 88366 151415 177881 135146 164836 121710 113146 72321 61527 75305 18678 -13779 -16782
8740 -16782 -76770 -39130 24001 46175 -1553 -21741 -51639 -47086 -50037 -31203 36526 49980
8728 49980 35701 29956 -12756 -741 -62664 -127446 -51121 72555 110398 147651 142869 134322
8716 134322 135034 190086 228131 219541 122122 74027 4281 -44064 -66224 -26991 19689 80270
$$ packed form
8802E83J9230J2033P379R745l1213l6778M4750L0657K743l0157l8304m703j8830
8789c2865r108j8275j0716N6179m458J2603N7933j2104k3546j0342J4759J2543
8777C2603J3576N2886k0404N4020m6956p6095k856l721K5627j6392k8417R447
8765f682r783j1798M5296M7150R0049P140k1443J9773n781q001m1708j4235j611
8752H8366O3049K6466m2735K9690m3126q564m0825j0794J3778n6627l2457l003
8740a6782n9988L7640O3131K2174m7728k0188k9898M553k951J8834O7729J3454
8728D9980j4279n745m2712J2015o1923o4782P6325J23676L7843L7253m782q547
8716A34322P12N5052L8045q590r7419m8095o9746m8345k2160L9233M6680O0581
$$ plain form
8704 80270 128467 140052 69908 38173 26842 -3975 14312 -32920 16882 65223 101399 70824
8692 70824 42074 -17929 -21352 -37891 -19505 -18706 131 20662 42114 87339 114202 82546
8680 82546 101109 149786 173843 132073 141270 125176 97558 48179 74975 116399 125137 62186
8668 62186 38371 74325 114068 118807 133451 154430 142012 114742 117780 127145 95026 98633 53900
8655 53900 41569 92039 117856 110959 71818 71569 85668 65600 69269 80064 102639 122125 126935
8642 126935 111881 130780 137324 206461 348559 363101 293441 228540 203809 238873 192458 111105
8630 111105 116197 140600 185073 225919 223023 266748 227880 188531 193885 217039 237295 247662
8618 247662 238097 205931 188471 188018 160317 175823 249154 316122 312363 320241 316270 314964 356966
$$ packed form
8704H0270M8197J1585p0144l1735j1331l0817J8287m7232M9802M8341L6176l0575
8692G0824k8750o0003l423j6539J8386P99J8837K0531K1452M5225K6863l1656
8680H2546J8563M8677K4057m1770R197j6094k7618m9379K6796M1424Q738o2951
8668F2186k3815L5954L9743M739J4644K0979j2418k7270L038R365l2119L607m4733
8655E3900j2331N0470K5817o897l9141k49J4099k0068L669J0795K2575J9486M810
8642A26935j5054J8899O544O9137J42098J4542o9660o4901k4731L5064m6415q1353
8630A11105N092K4403M4473M0846k896M3725l8868l9349N354K3154K0256J0367
8618B47662r565l2166j7460m53k7701J5506P3331O6968l759P878l971j306M2002
$$ plain form
8605 356966 351981 369224 434744 463715 499637 540196 584192 657918 688477 676897 725405 822147
8593 822147 872824 951929 1056109 1123550 1159047 1163180 1176537 1157106 1123309 1037770 897145
8582 897145 781567 693158 626116 569618 553806 565194 522223 455327 390864 345966 337036 317685
8570 317685 349144 318017 294441 236045 247025 226738 303613 310046 268405 253280 237924 267913
8558 267913 334653 277629 245040 247494 193546 154428 149213 148223 133238 193600 215826 162609
8546 162609 159790 144485 164764 162879 232897 255421 245999 242701 264697 267563 254115 194680 159013
8533 159013 186429 217643 185430 142157 203141 251171 217348 281690 276808 243698 260163 198279
8521 198279 204356 174944 168296 147632 140883 154761 102312 127874 184182 167824 129139 50259
$$ packed form
8605C56966m985J7243O5520K8971L5922M0559M3996P3726L0559j1580M8508R6742
8593H22147N0677P9105J04180O7441L5497M133J3357j9431l3797q5539j40625
8582H97145j15578q8409o7042n6498j5812J1388m2971o6896o4463m4898q930j9351
8570C17685L1459l1127k3576n8396J0980k0287P6875O433m1641j5125j5356K9989
8558B67913O6740n7024l2589K454n3948l9118n215r90j4985O0362K2226n3217
8546A62609k819j5305K0279j885P0018K2524r422l298K1996K866j3448n9435l5667
8533A59013K7416L1214l2213m3273O0984M8030l3823O4342m882l3110J6465o1884
8521A98279O077k9412o648k0664o749J3878n2449K5562N6308j6358l8685p8880
$$ plain form
8509 50259 52188 106742 95016 69147 103160 92879 107403 92455 115533 127508 117122 129034
8497 129034 174979 104953 44605 65496 100804 70626 114761 107343 81802 98729 115929 52745
8485 52745 11648 81176 151044 179215 184032 172027 131445 127221 114638 134916 128921 127415 118476
8472 118476 68854 107098 157666 113012 104204 82445 37720 68904 59497 42373 19585 17535
8460 17535 13111 21665 -27926 -37528 8265 57531 73501 135779 110231 57011 58917 100025 85776
8447 85776 90927 110992 158476 128115 119762 110464 101252 112831 121994 156404 139138 77767 39664
8434 39664 49604 120675 124305 136381 94073 57491 71180 58366 59933 56590 72431 31473 45876
8421 45876 34349 79839 80199 -55520 -80669 32626 102556 43076 26706 54345 60979 25913
$$ packed form
8509E0259J929N4554j1726k5869L4013j0281J4524j4948K3078J1975j0386J1912
8497A29034M5945p0026o0348K0891L5308l0178M4135p418k5541J6927J7200o3184
8485E2745m1097O9528O9868K8171M817j2005m0582m224j2583K0278n995j506q939
8472A18476m9622L8244N0568m4654q808k1759m4725L1184r407j7124k2788k050
8460A7535m424Q554m9591r602M5793M9266J5970O2278k5548n3220J906M1108j4249
8447H5776N151K0065M7484l0361q353r298r212J1579R163L4410j7266o1371l8103
8434C9664R940P1071L630J2076m2308l6582J3689j2814J567l343J5841m0958J4403
8421D5876j1527M5490L60j35719k5149J13295O9930n9480j6370K7639O634l5066
$$ plain form
8409 25913 1615 59530 93715 24876 -43040 -27774 11854 59487 80139 79423 59991 -16533
8397 -16533 -23169 18778 -2586 -20093 -26223 -58880 -67520 -926 31967 50682 39273 28580
8385 28580 74574 96727 70811 68188 90067 73390 72877 53567 74422 49639 18760 24486 21387
8372 21387 11205 29074 48895 39372 33505 31169 22049 17063 -16889 -22250 -22322 -38871 -51336 -42043
8358 -42043 -80706 -101508 -105014 -24699 19949 133105 224302 232716 184603 152379 168107 156459
8346 156459 45401 23756 24292 -29342 12571 52032 45122 3103 22337 7242 -9991 10215
8334 10215 10501 -6476 -26485 -27233 17326 57753 45586 -16246 -16512 27332 85701 85573 73007
8321 73007 73471 30619 18033 84693 77283 -28601 -35555 22910 93168 2461 6662 65822 89097
$$ packed form
8409B5913k4298N7915L4185o8839o7916J5266L9628M7633K0652p16j9432p6524
8397a6533o636M1947k1364j7507o130l2657q640O6594L2893J8715j1409j0693
8385B8580M5994K2153k5916k623K1879j6677n13j9310K0855k4783l0879N726l099
8372B1387j0182J7869J9821r523n867k336r120m986l3952n361p2j6549j2465R293
8358d2043l8663k0802l506Q0315M4648J13156R1197Q414m8113l2224J5728j1648
8346A56459j11058k1645N36n3634M1913L9461o910m2019J9234j5095j7233K0206
8334A0215K86j6977k0009p48M4559M0427j2167o1832k66M3844N8369j28j2566
8321G3007M64m2852j2586O6660p410j05884o954N8465P0258r0707M201N9160K3275
$$ plain form
8308 89097 60655 61824 28400 19710 64657 72290 93065 33575 10803 39579 41864 43066 53224
8295 53224 79949 73698 57258 71922 69402 76531 88162 55982 60978 70935 29750 -33006 -42882
8282 -42882 -61673 -67268 -56920 -10048 2338 11844 79922 94623 88769 33176 4541 60678
8270 60678 116847 84085 94385 127558 76403 46684 116127 116080 113868 58100 61396 96285 90612
8257 90612 78088 45839 42827 61831 64778 72269 115788 127215 35823 43018 92960 -3521 -51849
8244 -51849 -45469 -42238 1531 111614 143603 154687 55068 2223 -1904 21686 74189 98546
8232 98546 82350 81207 83726 127475 142437 120185 98960 74466 95075 41877 39487 70574
8220 70574 100566 53817 29358 58606 64451 97308 42265 -49713 -60978 15647 134324 110776
$$ packed form
8308H9097k8442J169l3424q690M4947P633K0775n9490k2772K8776K285J202J0158
8295E3224K6725o251j6440J4664k520P129J1631l2180M996R957m1185o2756r876
8282d2882j8791n595J0348M6872J2386R506O8078J4701n854n5593k8635N6137
8270F0678N6169l2762J0300L3173n1155k9719O9443m7k212n5768L296L4889n673
8257I0612j2524l2249l012J9004K947P491M3519J1427r1392P195M9942r6481m8328
8244e1849O380L231M3769J10083L1989J1084r9619n2845m127K3590N2503K4357
8232I8546j6196j143K519M3749J4962k2252k1225k4494K0609n3198k390L1087
8220G0574K9992m6749k4459K9248N845L2857n5043r1978j1265P6625J18677k3548
$$ plain form
8208 110776 63402 23076 -861 52744 132496 150921 128579 85670 92455 110626 134593 139998
8196 139998 162883 150736 136427 147659 132793 113369 60631 61004 69426 81145 68163 72765
8184 72765 96991 87180 103425 122881 137041 127410 92289 86814 51745 18640 -1064 -3336 -24691
8171 -24691 661 74143 68911 45524 -30860 -66768 -31102 39862 83295 76062 32271 -29100
8159 -29100 -20624 14058 78543 80023 90263 73337 52093 94526 162311 143518 142060 87359
8147 87359 105643 114883 78170 39457 46120 48672 54815 19083 -29546 1798 10840 -27239 -52909
8134 -52909 -16899 -34135 -61078 -33547 4139 -4434 -4844 22381 78608 33698 21150 67852
8122 67852 77909 69319 46200 59528 33764 35231 -18932 20845 51526 45243 81979 39231
$$ packed form
8208A10776m7374m0326k3937N3605P9752J8425k2342m2909O785J8171K3967N405
8196A39998K2885j2147j4309J1232j4866j9424n2738L73Q422J1719j2982M602
8184G2765K4226r811J6245J9456J4160r631l5121n475l5069l3105j9704k272k1355
8171b4691K5352P3482n232k3387p6384l5908L5666P0964M3433p233m3791o1371
8159b9100Q476L4682O4485J480J0240j6926k1244M2433O7785j8793j458n4701
8147H7359J8284R240l6713l8713O663K552O143l5732m8629L1344R042l8079k5670
8134e2909L6010j7236k6943K7531L7686q573m10K7225N6227m4910j2548M6702
8122F7852J0057q590k3119J3328k5764J467n4163L9777L0681o283L6736m2748
$$ plain form
8110 39231 12839 50573 53666 -17373 -15049 5413 32283 63670 61490 65909 79311 104304 92637
8097 92637 69124 8193 21961 23529 -17817 -56185 -75516 -61562 -17972 47257 80639 86714
8085 86714 123918 92008 101386 135238 121841 105986 58299 100295 93435 79481 77457 89127
8073 89127 99886 62906 40224 18121 9299 47683 81687 16621 30802 -26293 -63118 -66926
8061 -66926 -7981 -50352 -68969 -2979 9507 67458 128851 49061 36681 42817 15134 50412
8049 50412 38695 71883 51490 70289 138295 183274 151134 124939 77960 58285 98913 109730
8037 109730 90573 103099 105353 145742 176002 188710 132527 136685 162784 175828 170066 177568
8025 177568 118241 91264 123989 146360 171871 177689 191472 179704 209490 218512 204276 151608
$$ packed form
8110C9231k6392L7734L093p1039K324K0462K6870L1387k180M419J3402K4993j1667
8097I2637k3513o0931J3768J568m1346l8368j9331J3954M3590O5229L3382O075
8085H6714L7204l1910R378L3852j3397j5855m7687M1996o860j3954k024J1670
8073H9127J0759l6980k2682k2103q822L8384L4004o5066J4181n7095l6825l808
8061f6926N8945m2371j8617O5990J2486N7951O1393p9790j2380O136k7683L5278
8049E0412j1717L3188k0393J8799O8006M4979l2140k6195m6979j9675M0628J0817
8037A09730j9157J2526K254M0389L0260J2708n6183M158K6099J3044n762P502
8025A77568n9327k6977L2725K2371K5511N818J3783j1768K9786R022j4236n2668
$$ plain form
8013 151608 131089 108731 99934 62710 54503 105999 119091 132222 143913 153569 150375 156707 189873
8000 189873 167056 197728 268954 290307 283395 286024 289396 325764 249258 272961 265223 166716
7988 166716 173705 168130 180806 196988 168770 152350 140730 134496 225247 288638 254652 204130
7976 204130 197450 146946 174310 274934 328708 308074 290321 305899 354896 408885 408178 317878
7964 317878 289476 339084 354288 388943 379416 407225 351089 387542 415085 432479 461538 475773
7952 475773 549451 546724 598429 553843 505122 507263 495129 460671 419789 432270 438933 429644
7940 429644 461209 522893 530783 535726 508670 477081 490706 479217 433141 471321 486100 460034
7928 460034 436898 414843 384168 387622 447557 516102 526125 530659 556746 516496 489011 547964
$$ packed form
8013A51608k0519k2358q797l7224q207N1496J3092J3131J1691R656l194O332L3166
8000A89873k2817L0672P1226K1353o912K629L372L6368p6506K3703p738r8507
7988A66716O989n575J2676J6182k8218j6420j1620o234R0751O3391l3986n0522
7976B04130o680n0504K7364J00624N3774k0634j7753J5578M8997N3989p07r0300
7964C17878k8402M9608J5204L4655r527K7809n6136L6453K7543J7394K9059J4235
7952D75773P3678k727N1705m4586m8721K141j2134l4458m0882J2481O663r289
7940D29644L1565O1684P890M943k7056l1589J3625j1489m6076L8180J4779k6066
7928D60034k3136k2055l0675L454N9935O8545J0023M534K6087m0250k7485N8953
$$ plain form
7916 547964 582126 560231 511634 540122 553729 552598 556032 517567 475233 464175 415059 373884
7904 373884 368170 406277 421700 349138 335413 325815 356238 384805 401306 390670 392341 432244
7892 432244 421903 383770 347175 302018 265851 303253 300286 282573 292272 321525 368338 382222
7880 382222 371351 350581 313340 276723 300257 279610 339555 347151 331048 350719 354725 280150
7868 280150 239583 252214 268599 324876 365144 311432 314781 249861 197351 223496 267682 254307
7856 254307 220978 186512 199706 265818 295114 205799 181188 206620 183843 83720 73803 61300
7844 61300 88706 167575 166306 137594 17384 44923 92183 108583 111632 108360 133224 153972
7832 153972 54056 -7581 -14394 43139 79821 156774 170692 175150 189738 101478 41361 84267
$$ packed form
7916E47964L4162k1895m8597K8488J3607j131L434l8465m2334j1058m9116m1175
7904C73884n714L8107J5423p2562j3725r598L0423K8567J6501j0636J671L9903
7892D32244j0341l8133l6595m5157l6167L7402k967j7713R699K9253M6813J3884
7880C82222j0871k0770l7241l6617K3534k0647N9945P596j6103J9671M006p4575
7868B80150m0567J2631J6385N6277M0268n3712L349o4920n2510K6145M4186j3375
7856B54307l3329l4466J3194O6112K9296q9315k4611K5432k2777j00123r917j2503
7844F1300K7406P8869j269k8712j20210K7539M7260J6400L049l272K4864K0748
7832A53972r9916o1637o813N7533L6682P6953J3918M458J4588q8260o0117M2906
$$ plain form
7820 84267 91562 92533 95406 123717 86172 91024 66455 70327 49443 53073 38518 83042 74565
7807 74565 42365 87789 100705 32989 -35769 -20252 -23389 16002 13447 69616 41895 66686
7795 66686 80506 45169 57826 45514 5451 -28553 -45722 -35365 -46564 -36657 -35399 -31250
7783 -31250 34541 5882 -76680 -72221 -2809 8659 -48830 -95689 -103829 -101031 -70534 -17867
7771 -17867 -36771 -62167 -50257 -42691 -50585 -35162 -20248 17958 -40228 -131784 -151705 -100073
7759 -100073 -46658 -35342 2979 591 -36998 -86606 -98790 -66151 -37907 -55795 -75873 -34890
7747 -34890 -18584 -20038 154 -60932 -84736 -40677 -6345 -3023 25906 68766 31304 26903
7735 26903 25814 -16401 -23037 -7209 18482 36844 31660 -30750 -95828 7659 79493 45278
$$ packed form
7820H4267P295R71K873K8311l7545M852k4569L872k0884L630j4555M4524q477
7807G4565l2200M5424J2916o7716o8758J5517l137L9391k555N6169k7721K4791
7795F6686J3820l5337J2657j2312m0063l4004j7169J0357j1199R907J258M149
7783c1250O5791k8659q2562M459O9412J1468n7489m6859q140K798L0497N2667
7771a7867j8904k5396J1910P566p894J5423J4914L8206n8186r1556j9921N1632
7759a00073N3415J1316L8321k388l7589m9608j2184L2639K8244j7888k0078M0983
7747c4890J6306j454K0192o1086k3804M4059L4332L322K8929M2860l7462m401
7735B6903j089m2215o636J5828K5691J8362n184o2410o5078J03487P1834l4215
$$ plain form
7723 45278 -27227 -103112 -112501 -97828 -69995 -12108 -24819 -46718 -31784 -51540 -13758 -21259
7711 -21259 -22384 -23377 -21169 1659 14142 -3306 -7198 -1412 -10361 21065 29685 -18178 -35127
7698 -35127 -403 -32755 -58642 -63337 -17769 -37044 -161533 -154773 -150176 -154743 -49488 -2268
7686 -2268 -27793 -48782 -33155 -18481 -53093 -14316 87010 100300 75645 62360 41505 10
7674 10 -32994 -40355 -30113 -53228 -34295 -52989 -38273 -38480 -31533 -26774 -29829 -8156 -68552 -112942
7660 -112942 -99439 -70234 -27466 -47510 -92121 -87943 -55358 -33485 -40404 -55621 4050 10285
7648 10285 -61778 -67465 -19273 -8776 31236 34736 -46976 -115125 -113559 -57877 -59257 -110083 -64780
7635 -64780 -38673 -56281 -51925 -39743 49745 49864 7378 -40982 -42628 -93597 -88841 -48084 -66122
$$ packed form
7723D5278p2505p5885r389J4673K7833N7887j2711k1899J4934j9756L7782p501
7711b1259j125r93K208K2828J2483j7448l892N786q949L1426Q620m7863j6949
7698c5127L4724l2352k5887m695M5568j9275j24489O760M597m567J05255M7220
7686b268k5525k0989J5627J4674l4612L8777J01326J3290k4655j3285k0855m1495
7674A0l3004p361J0242k3115J8933j8694J4716k07O947M759l055K1673o0396m4390
7660a12942J3503K9205M2768k0044m4611M178L2585K1873o919j5217N9671O235
7648A0285p2063n687M8192J0497M0012L500q1712o8149J566N5682j380n0826M5303
7635f4780K6107j7608M356J2182Q9488J19m2486m8360j646n0969M756M0757j8038
$$ plain form
7622 -66122 -16531 4051 -19369 16260 6188 -64192 -155271 -137221 -81687 -99534 -138699 -67134
7610 -67134 -11552 11971 -16461 -58623 -49078 -25555 -45033 -15882 35738 103634 118440 60941
7598 60941 65763 62777 56235 66781 23149 11500 -26438 -41751 -67953 -43618 -73075 -106929
7586 -106929 -92728 -90958 -67066 6185 99634 85999 26454 -14615 14101 -7101 -30865 -62078
7574 -62078 -72333 -46344 2464 -18564 -108271 -56954 -13503 -53209 -60472 -17096 -1965 -16674
7562 -16674 -71143 -75765 -111677 -147896 -192714 -183059 -105841 -30086 42068 -7983 -77633 -112043
7550 -112043 -88470 -79050 -85456 -131295 -106524 -68720 11973 -2003 -1138 -27291 -4702 14266
7538 14266 30858 -6820 -78908 -82047 -51432 -19053 40384 77940 66839 134080 107435 70612
$$ packed form
7622f6122M9591K0582k3420L5629j0072p0380r1079J8050N5534j7847l9165P1565
7610f7134N5582K3523k8432m2162R545K3523j9478K9151N1620O7896J4806n7499
7598F0941M822k986o542J0546m3632j1649l7938j5313k6202K4335k9457l3854
7586a06929J4201J770K3892P3251R3449j3635n9545m1069K8716k1202k3764l1213
7574f2078j0255K5989M8808k1028q9707N1317M3451l9706p263M3376J5131j4709
7562a6674n4469m622l5912l6219m4818R655P7218P5755P2154n0051o9650l4410
7550a12043K3573R420o406m5839K4771L7804Q0693j3976Q65k6153K2589J8968
7538A4266J6592l7678p2088l139L0615L2379N9437L7556j1101O7241k6645l6823
$$ plain form
7526 70612 42663 44394 13131 -29655 -7692 -10603 -2598 4918 14902 -22482 -1291 30400 14473
7513 14473 -76467 -70139 -40645 -40906 20006 15000 44083 13189 -27518 -90126 -164707 -143474 -80697
7500 -80697 21672 57201 57643 62973 75451 106554 98594 125007 134341 112855 88351 99425 122224
7487 122224 91440 23075 -15844 -79556 -56458 -71881 -45376 -33068 11325 48582 65797 74843
7475 74843 37362 83460 55780 50121 100954 138777 117863 101160 101230 118176 86480 52916 -34250
7462 -34250 -79318 -62225 -27723 -7995 45433 51536 33926 5186 -14477 -48158 -33235 -40753
7450 -40753 -55411 -45231 4319 -20964 -88988 -78651 -43188 -20191 -92636 -17214 34977 16023
7438 16023 -51717 -71417 -7268 38899 99706 115057 33995 -8670 36230 19232 29837 16953
$$ packed form
7526G0612k7949J731l1263m2786K1963k911Q005P516R984l7384K1191L1691j5927
7513A4473r0940O328K9494k61O0912n006K9083l0894m0707o2608p4581K1233O2777
7500h0697J02369L5529M42N330J2478L1103p960K6413R334k1486k4504J1074K2799
7487A22224l0784o8365l8919o3712K3098j5423K6505J2308M4393L7257J7215R046
7475G4843l7481M6098k7680n659N0833L7823k0914j6703P0J6946l1696l3564q7166
7462c4250m5068J7093L4502J9728N3428O103j7610k8740j9663l3681J4923p518
7450d0753j4658J0180M9550k5283o8024J0337L5463K2997p2445P5422N2191j8954
7438A6023o7740j9700O4149M6167O0807J5351q1062m2665M4900j6998J0605j2884
$$ plain form
7426 16953 88390 76992 21477 18745 24278 40622 -335 -14724 13021 73971 46837 -16960
7414 -16960 -80796 -20433 28291 19026 16718 32976 23013 24455 15862 -10063 -7043 -10581 -42707
7401 -42707 -65775 -85675 -55735 -44597 -18520 -13317 -36825 -5635 16361 59135 -4075 -54204
7389 -54204 -80818 -60857 -94349 -43615 42248 49472 2084 -61383 -95253 -68133 -59927 -74615
7377 -74615 -76000 -55336 -64973 -62964 -105939 -62412 -16113 -60784 -22248 40510 19320 48621
7365 48621 57398 39814 -7028 -61431 5518 50538 7413 -12866 -32831 -13671 2130 24317
7353 24317 35010 59757 -38236 -106918 -83162 -91698 -60798 -67236 -34312 -14615 -41149 -44025
7341 -44025 -19379 39707 59211 106305 93817 68164 17532 -5976 -33670 -26155 -50741 -40737
$$ packed form
7426A6953P1437j1398n5515k732N533J6344m0957j4389K7745O0950k7134o3797
7414a6960o3836O0363M8724r265k308J6258r963J442q593k5925L020l538l2126
7401d2707k3068j9900K9940J1138K6077N203k3508L1190K1996M2774o3210n0129
7389e4204k6614J9961l3492N0734Q5863P224m7388o3467l3870K7120Q206j4688
7377g4615j385K0664r637K009m2975M3527M6299m4671L8536O2758k1190K9301
7365D8621Q777j7584m6842n4403O6949M5020m3125k0279j9965J9160J5801K2187
7353B4317J0693K4747r7993o8682K3756q536L0900o438L2924J9697k6534k876
7341d4025K4646N9086J9504M7094j2488k5653n0632k3508k7694P515k4586J0004
$$ plain form
7329 -40737 -83647 -79968 -81578 -65088 -53214 -69078 -58934 24444 46602 37572 72721 71421 26932
7316 26932 24223 48170 77302 57437 -26374 -23605 13793 84372 74045 -29629 -23737 -28281
7304 -28281 -70778 -85312 -10510 9277 -6382 -6927 45251 49315 25163 40324 82755 51302
7292 51302 34817 4409 18250 31466 23372 -1014 -47481 -23210 -11473 -17319 -67611 -42395
7280 -42395 -29666 -44339 -27349 -14906 -38269 -10405 45470 44006 -13997 2293 10334 -74762
7268 -74762 -84856 -64411 -33260 -28948 -16822 -17992 -38085 -78454 -86127 -86937 -64034 -12857 -78839
7255 -78839 -150833 -101066 -50377 -72838 -81873 -86252 -51447 -30802 -28044 -45376 -35962 -38316 -63606
7242 -63606 -63503 -39137 -15921 25612 63142 54208 -6056 -59769 -72364 -80319 -18702 -33206 -866
$$ packed form
7329d0737m2910L679j610J6490J1874j5864J0144Q3378K2158r030L5149j300m4489
7316B6932k709K3947K9132j9865q3811K769L7398P0579j0327j03674N892m544
7304b8281m2497j4534P4802J9787j5659n45N2178M064k4152J5161M2431l1453
7292E1302j6485l0408J3841J3216q094k4386m6467K4271J1737n846n0292K5216
7280d2395J2729j4673J6990J2443k3363K7864N5875j464n8003J6290Q041q5096
7268g4762j0094K0445L1151M312J2126j170k0093m0369p673q10K2903N1177o5982
7255g8839p1994M9767N0689k2461r035m379L4805K0645K758j7332R414k354k5290
7242f3606J03K4366K3216M1533L7530q934o0264n3713j2595p955O1617j4504L2340
$$ plain form
7229 -866 42836 29939 -35661 -68774 -29104 -7130 30531 64717 51684 -37517 -78315 -118422
7217 -118422 -121242 -111624 -73880 -40707 -66703 -84657 -38304 1095 52935 123447 148176 137592
7205 137592 54466 -8347 -108917 -151886 -119772 -133893 -156950 -83135 961 -7253 -11240 5239
7193 5239 -66857 -54045 31406 94056 79527 34126 -4195 -62764 -47245 -21806 45425 33449
7181 33449 21133 14589 47898 65204 91082 47160 -24770 -69443 -12278 45471 50407 33524
7169 33524 38496 27512 1296 -13567 -40620 14425 -10116 -14875 -57401 -105940 -73036 -162986
7157 -162986 -163593 -81455 -48606 -45127 2264 27246 88933 45394 -20800 38617 31056 4928
7145 4928 -33044 -29711 12010 62726 83432 20649 38737 -12119 1040 56195 31875 24949
$$ packed form
7229h66M3702j2897o5600l3113L9670K1974L7661L4186j3033q9201m0798m0107
7217a18422k820R618L7744L3173k5996j7954M6353L9399N1840P0512K4729j0584
7205A37592q3126o2813j00570m2969L2114j4121k3057P3815Q4096q214l987J6479
7193E239p2096J2812Q5451O2650j4529m5401l8321n8569J5519K5439O7231j1976
7181C3449j2316o544L3309J7306K5878m3922p1930m4673N7165N7749M936j6883
7169C3524M972j0984k6216j4863k7053N5045k4541m759m2526m8539L2904q9950
7157a62986o07Q2138L2849L479M7391K4982O1687m3539o6194N9417p561k6128
7145D928l7972L333M1721N0716K0706o2783J8088n0856J3159N5155k4320o926
$$ plain form
7133 24949 100038 88330 44207 47127 41295 43911 121192 127751 75265 60814 95746 27548 -2422
7120 -2422 10878 24370 76777 19450 -10178 30326 52505 35957 31042 33851 84799 69891
7108 69891 6364 -14058 -60447 -53512 -28368 -34952 -20209 -6038 16044 -8476 -45260 -71479
7096 -71479 -61541 -39630 -30965 -4920 -38896 -16770 -31130 15677 -2633 4391 -1197 -22351 -23496
7083 -23496 19913 80195 38610 -836 2507 2530 -1748 -36139 -46195 -18663 -20687 -50304 -105881
7070 -105881 -95726 -19924 -12746 -12073 -45580 -111308 -142633 -105377 -54568 -82013 -56856 -49141
7058 -49141 -85976 -129078 -183231 -109952 -78741 -53277 -94412 -48171 -57640 -43973 -19616 1078
7046 1078 24851 8095 -26387 -97829 -146781 -107434 -53831 -70049 -123280 -154826 -93559 -26241
$$ packed form
7133B4949P5089j1708m4123K920n832K616P7281O559n2486j4451L4932o8198k9970
7120b422J3300J3492N2407n7327k9628M0504K2179j6548m915K809N0948j4908
7108F9891o3527k0422m6389O935K5144o584J4743J4171K2082k4520l6784k6219
7096g1479R938K1911Q665K6045l3976K2126j4360M6807j8310P024n588k1154j145
7083b3496M3409O0282m1585l9446L343K3m278l4391j0056K7532k024k9617n5577
7070a05881J0155P5802P178O73l3507o5728l1325L7256N0809k7445K5157P715
7058d9141l6835m3102n4153P3279L1211K5464m1135M6241r469J3667K4357K0694
7046A078K3773j6756l4482p1442m8952L9347N3603j6218n3231l1546O1267O7318
$$ plain form
7034 -26241 -127221 -150315 -79728 -30217 -5043 -21925 -31664 -36592 -38392 -9637 7722 -35845
7022 -35845 -23364 16418 4934 17533 8837 33428 74186 86359 10012 -80190 -32919 -3174
7010 -3174 -20262 18372 47398 14788 -42206 -50883 -27303 -44935 -48776 4832 33370 45317
6998 45317 24757 7383 11591 18340 45844 15838 18491 74133 55271 46879 -25167 -66251 4887
6985 4887 17979 3368 -7813 -49150 -24081 970 -2241 15421 -1413 42387 20664 -54994
6973 -54994 -49909 -47268 -98543 -75819 -88927 -49337 4116 -28867 14628 52915 33538 67974
6961 67974 54590 -4322 -12411 -11503 -26560 -18402 -27975 -29097 -1256 -39803 12755 26858 -14552
6948 -14552 -9634 -55298 -55148 -71852 -42713 28652 35301 -23828 -124209 -150675 -104756 -103152 -104594
$$ packed form
7034b6241j00980k3094P0587M9511K5174j6882r739m928j800K8755J7359m3567
7022c5845J2481L9782j1484J2599q696K4591M0758J2173p6347r0202M7271K9745
7010c174j7088L8634K9026l2610n6994q677K3580j7632l841N3608K8538J1947
6998D5317k0560j7374M208O749K7504l0006K653N5642j8862q392p2046m1084P1138
6985D887J3092j4611j1181m1337K5069K5051l211J7662j6834M3800k1723p5658
6973e4994N085K641n1275K2724j3108L9590N3453l2983M3495L8287j9377L4436
6961F7974j3384n8912q089R08j5057Q158r573j122K7841l8547N2558J4103m1410
6948a4552M918m5664J50j6704K9139P1365O649n9129j00381k6466M5919J604j442
$$ plain form
6935 -104594 -114460 -113066 -85983 -78989 -52370 -74094 -50322 4231 -53094 -80891 -28391 -15887
6923 -15887 -53508 -77382 -77019 -61575 -26870 11784 -39709 -35164 -18601 -38156 746 25870
6911 25870 -60948 -41351 -27686 -105264 -85564 -92943 -50685 31856 -24119 -58673 -4025 5222
6899 5222 -34768 -59162 -38515 -71421 -57871 -3937 18009 2062 -104972 -164718 -148039 -97861
6887 -97861 -74607 -35680 -17302 -61483 -97811 -83629 -90720 -75063 -61720 -30031 -22555 5247
6875 5247 34474 29485 -4061 3009 12093 30705 86350 75885 -68797 -145214 -92465 -93636 -49996
6862 -49996 -3254 -78609 -116286 -92569 -17065 21871 52475 66988 45568 -53962 -44123 52912
6850 52912 43281 25906 40339 37288 -3047 -50820 -43720 -64639 -79474 -58103 -6934 -55345
$$ packed form
6935a04594r866J394K7083O994K6619k1724K3772N4553n7325k7797N2500J2504
6923a5887l7621k3874L63J5444L4705L8654n1493M545J6563j9555L8902K5124
6911B5870q6818J9597J3665p7578J9700p379M2258Q2541n5975l4554N4648R247
6899E222l9990k4394K0647l2906J3550N3934K1946j5947j07034n9746J6679N0178
6887i7861K3254L8927J8378m4181l6328J4182p091J5657J3343L1689P476K7802
6875E247K9227m989l3546P070R084J8612N5645j0465j44682p6417N2749j171M3640
6862d9996M6742p5355l7677K3717P5504L8936L0604J4513k1420r9530R839R7035
6850E2912r631j7375J4433l051m0335m7773P100k0919j4835K1371N1169m8411
$$ plain form
6838 -55345 -52771 46819 36491 -25050 -27443 -69548 -92234 -112207 -130550 -116670 -82968 -75314
6826 -75314 -11080 -16931 -48044 -69273 -66053 -95812 -100094 -42642 9081 4822 24848 42873 -37022
6813 -37022 -72313 -77214 -17102 -32212 -62711 -32040 5649 11112 -10292 33999 48273 -16383
6801 -16383 11768 2940 -29345 -66408 -57361 -7605 -14388 -9902 -3023 -42126 -64057 -67155 -36805
6788 -36805 -22200 -68611 -86177 -37710 -84070 -100505 -112663 -70270 -64254 -67864 -78275 -9001
6776 -9001 15546 4269 21783 32023 27355 -2856 -20504 -74071 -85052 -22793 -33841 -78459
6764 -78459 -84118 -71369 -54434 -47822 -21476 -27025 -2447 -27636 -67481 -83759 -50700 17328
6752 17328 70402 181659 99774 42898 73314 61658 11346 106490 113656 41012 -6792 -55551
$$ packed form
6838e5345K574R9590j0328o1541k393m2105k2686j9973j8343J3880L3702P654
6826g5314O4234n851l1113k1229L220k9759m282N7452N1723m259K0026J8025p9895
6813c7022l5291m901O0112j5110l0499L0671L7689N463k1404M4291J4274o4656
6801a6383K8151q828l2285l7063R047M9756o783M486O879l9103k1931l098L0350
6788c6805J4605m6411j7566M8467m6360j6435j2158M2393O016l610j0411O9274
6776i001K4547j1277J7514J0240m668l0211j7648n3567j0981O2259j1048m4618
6764g8459n659J2749J6935O612K6346n549K4578k5189l9845j6278L3059O8028
6752A7328N3074J11257q1885n6876L0416j1656n0312R5144P166p2644m7804m8759
$$ plain form
6740 -55551 32586 39983 36493 -23082 -94381 -128809 -128408 -98058 -25421 10214 -50814 -54357 -25021
6727 -25021 -31635 -31139 44366 149193 153003 123234 52964 35023 45350 40095 52175 41059 56940
6714 56940 1246 -36940 16971 46394 31017 59656 136476 97942 103063 83504 59524 16537
6702 16537 8597 -55992 -91985 -53043 -32036 -62906 -85713 13604 83024 143937 171279 159509
6690 159509 185438 129060 54841 27932 6272 -17597 34953 35338 36760 24872 26192 47544
6678 47544 11373 1739 14708 -3822 6937 -30060 -45622 -61077 -18606 35462 5693 -64944
6666 -64944 -96553 -37220 50633 65727 -9755 -25140 -56287 -146792 -137615 -133014 -96264 -98427
6654 -98427 -57088 29526 29598 -62837 -86282 -76292 -55126 5771 69395 30198 18596 -9570 -4670
$$ packed form
6740e5551Q8137P397l490n9575p1299l4428M01L0350P2637L5635o1028l543K9336
6727b5021o614M96P5505J04827L810k9769p0270j7941J0327n255J2080j1116J5881
6714E6940n5694l8186N3911K9423j5377K8639P6820l8534N121j9559k3980m2987
6702A6537p940o4589l5993L8942K1007l0870k2807R9317O9420O0913K7342j1770
6690A59509K5929n6378p4219k6909k1660k3869N2550L85J422j1888J320K1352
6678D7544l6171r634J2969j8530J0759l6997j5562j5455M2471N4068k9769p0637
6666f4944l1609N9333Q7853J5094p5482j5385l1147r0505R177M601L6750k163
6654i8427M1339Q6614P2r2435k3445R990K1166O0897O3624l9197j1602k8166M900
$$ plain form
6641 -4670 -48419 -91357 -47654 -18897 -76603 -88139 -102124 -140250 -136362 -107226 -71972 -73700
6629 -73700 -33470 -16187 -4390 -47980 -56970 5724 36853 42917 57326 101154 68131 24564
6617 24564 -11329 -22084 -29582 -75122 -94450 -112924 -101804 -73956 -87574 -113648 -67063 -44715
6605 -44715 -74267 -103908 -93848 -62458 -31911 -2480 45179 39442 110012 101714 36140 22664
6593 22664 58977 64224 -6822 -30541 -28867 -30636 -35076 4601 -10092 -22056 31516 12337 -39515
6580 -39515 -65776 -85445 8679 63515 79154 92674 59676 69651 66228 76540 80101 86461 77576
6567 77576 71447 117260 135723 67225 -57685 -42251 -35816 -52918 -4873 -68520 -21740 -40493
6555 -40493 -33803 1375 32808 12469 31116 20416 23976 48585 28328 38866 -16695 -55484
$$ packed form
6641d670m3749m2938M3703K8757n7706j1536j3985l8126L888K9136L5254j728
6629g3700M0230J7283J1797m3590q990O2694L1129O064J4409M3828l3023m3567
6617B4564l5893j0755p498m5540j9328j8474J1120K7848j3618k6074M6585K2348
6605d4715k9552k9641J0060L1390L0547K9431M7659n737P0570q298o5574j3476
6593B2664L6313N247p1046k3719J674j769m440L9677j4693j1964N3572j9179n1852
6580c9515k6261j9669R4124N4836J5639J3520l2998R975l423J0312L561O360q885
6567G7576o129M5813J8463o8498j24910J5434O435j7102M8045o3647M6780j8753
6555d0493O690L5178L1433k0339J8647j0700L560K4609k0257J0538n5561l8789
$$ plain form
6543 -55484 -53799 -37585 -8144 32775 30212 2284 -27237 -41520 -30596 -25979 -20105 9711 26918
6530 26918 28012 18181 7523 34986 -195 4646 14810 -55344 -65503 -33496 -61242 -45124
6518 -45124 2276 30312 42865 94055 48414 -40000 -32098 14421 4380 -10774 -51142 -101849
6506 -101849 -50063 -55004 -49022 -555 16273 -44139 -77020 -111891 -115156 -115786 -56146 -18184 42038
6493 42038 -4216 14187 9555 22533 1561 -21091 -49377 -32550 -77435 -103392 -100170 -63473
6481 -63473 -66578 -32893 -45008 -57744 -111245 -89443 -72464 169 17447 2776 -33241 -9738
6469 -9738 34408 32514 -17522 -6297 17559 194 -71353 -73847 -27375 45767 65631 47295
6457 47295 43000 31652 -71645 -111053 -119834 -101965 -116852 -132000 -153205 -113232 -40430 -2173
$$ packed form
6543e5484J685J6214K9441M0919k563k7928k9521j4283J0924M617N874K9816J7207
6530B6918J094r831j0658K7463l5181M841J0164p0154j0159L2007k7746J6118
6518d5124M7400K8036J2553N1190m5641q8414P902M6519j0041j5154m0368n0707
6506a01849N1786m941N982M8467J6828o0412l2881l4871l265o30N9640L7962O0222
6493D2038m6254J8403m632J2978k0972k2652k8286J6827m4885k5957L222L6697
6481f3473l105L3685j2115j2736n3501K1802J6979P2633J7278j4671l6017K3503
6469i738M4146j894n0036J1225K3856j7365p1547k494M6472P3142J9864j8336
6457D7295m295j1348j03297l9408q781J7869j4887j5148k1205L9973P2802L8257
$$ plain form
6445 -2173 -10677 -85690 -69736 -78985 -98197 -96008 -77986 -67137 -91033 -69964 -68691 -52763 -45358
6432 -45358 -71583 -36091 -56822 -93995 -37697 -21314 -4528 6868 -20551 -35920 -25027 2737
6420 2737 15006 -11959 -60150 -153367 -135517 -53396 -28516 -45917 -26007 -11390 -72538 -95682
6408 -95682 -70321 -11746 47871 34524 19468 -1755 -26994 -12942 -42378 -88994 -108359 -73928
6396 -73928 -62145 -69744 -16720 31656 39676 31636 20499 29841 79051 79788 33365 1908 -32706
6383 -32706 -18946 -42027 -85010 -130740 -101077 -83230 -111619 -111028 -61121 -60156 -34570 52529 47296
6370 47296 35850 24610 21100 10485 -10707 24759 -8788 38227 97562 83905 63601 66425
6358 66425 61647 24012 -40049 -4010 2306 -28324 9661 -1064 -85983 -51764 20728 21601 22529
$$ packed form
6445b173q504p5013J5954r249j9212K189J8022J0849k3896K1069J273J5928P405
6432d5358k6225L5492k0731l7173N6298J6383J6786J1396k7419j5369J0893K7764
6420B737J2269k6965m8191r3217J7850Q2121K4880j7401J9910J4617o1148k3144
6408i5682K5361N8575N9617j3347j5056k1223k5239J4052k9436m6616j9365L4431
6396g3928J1783p599N3024M8376Q020q040j1137R342M9210P37m6423l1457l4614
6383c2706J3760k3081m2983m5730K9663J7847k8389N91M9907R65K5586Q7099n233
6370D7296j1446j1240l510j0615k1192L5466l3547M7015N9335j3657k0304K824
6358F6425m778l7635o4061L6039O316l0630L7985j0725q4919L4219P2492Q73R28
$$ plain form
6345 22529 24843 -13419 -19035 -46990 -3202 -41137 -46619 -11662 18862 9930 1690 -4469 -32149
6332 -32149 -3053 31378 40267 18639 3319 3158 44995 70115 30238 13174 6695 14096 22507
6319 22507 27478 -3332 -32184 -44199 -55075 -40936 -20678 -46853 -40245 -20128 14925 81566
6307 81566 111507 93255 72742 20137 -1360 -74662 -23068 995 -27610 -58035 -35213 -94246
6295 -94246 -91496 -80100 -18477 -5656 -74936 -59470 -18738 46458 80296 81035 55348 -25377
6283 -25377 19337 127475 112709 73932 44839 7049 1197 25302 45111 -466 35434 17384
6271 17384 28858 7502 9566 39388 24748 -23453 -25347 -46789 -45406 -70677 -76610 -35919 -67556
6258 -67556 -92790 -34086 10233 15054 32945 -10067 -10929 52441 48428 10306 -939 45354 -4388
$$ packed form
6345B2529K314l8262n616k7955M3788l7935n482L4957L0524q932q240o159k7680
6332c2149K9096L4431Q889k1628j5320j61M1837K5120l9877j7064o479P401Q411
6319B2507M971l0810k8852j2015j0876J4139K0258k6175O608K0117L5053O6641
6307H1566K9941j8252k0513n2605k1497p3302N1594K4063k8605l0425K2822n9033
6295i4246K750J1396O1623J2821o9280J5466M0732O5196L3838P39k5687q0725
6283b5377M4714J08138j4766l8777k9093l7790n852K4105J9809m5577L5900j8050
6271A7384J1474k1356K064K9822j4640m8201j894k1442J383k5271n933M0691l1637
6258f7556k5234N8704M4319M821J7891m3012q62O3370m013l8122j1245M6293m9742
$$ plain form
6245 -4388 -99940 -104071 -54251 -47253 -10257 49171 67798 52773 56729 -13932 -87755 -79550 -53938
6232 -53938 -66970 -89325 -70540 13089 -21809 -86377 -64614 -43689 -75485 -36288 -42112 -14618
6220 -14618 14174 68391 103038 41880 15382 56627 77354 108892 54841 2988 -16281 -41997
6208 -41997 -29437 -55880 -62462 -16978 -46932 -48178 -29280 -81779 -119137 -103046 -61793 -22076
6196 -22076 -3451 -37861 -13727 25891 25453 9626 18377 26280 73329 73237 -7375 -29136 -14725
6183 -14725 -26819 -19161 -51112 -27501 4694 36536 70081 69443 41912 20622 -6704 24975
6171 24975 28497 41313 36331 85701 99299 76381 60461 -5257 -4775 -2858 1209 -126 -29905
6158 -29905 -9736 13920 8147 -32539 -41726 -7590 50877 109436 61427 30782 2144 -27469
$$ packed form
6245d388r5552m131M9820O998L6996N9428J8627j5025L956p0661p3823Q205K5612
6232e3938j3032k2355J8785Q3629l4898o4568K1763K0925l1796L9197n824K7494
6220a4618K8792N4217L4647o1158k6498M1245K0727L1538n4051n1853j9269k5716
6208d1997J2560k6443o582M5484k9954j246J8898n2499l7358J6091M1253L9717
6196b2076J8625l4410K4134L9618m38j5827Q751P903M7049r2q0612k1761J4411
6183a4725j2094P658l1951K3611L2195L1842L3545o38k7531k1290k7326L1679
6171B4975L522J2816m982M9370J3598k2918j5920o5718M82J917M067j335k9779
6158b9905K0169K3656n773m0686r187L4136N8467N8559m8009l0645k8638k9613
$$ plain form
6146 -27469 4600 115159 92427 19129 -76018 -44995 4616 14395 32493 56868 15692 -30105
6134 -30105 -34929 -28556 -40022 -52631 24095 85353 60106 15218 -6800 -12030 69086 58882
6122 58882 -14100 -15747 -21699 -37758 -69198 -95542 -16617 29831 -50720 -791 38582 8153
6110 8153 -12486 -38949 -34236 -20474 -38479 -32009 -36723 -67067 -87738 -85303 -43441 -38417 -31246
6097 -31246 -8852 -24398 -11695 -35464 -82625 -43832 -11573 -22467 -56196 -126071 -103553 -24244
6085 -24244 -5885 43421 51218 85614 59436 5240 -54691 -52388 -30902 3228 -1347 -36702
6073 -36702 -73444 -66255 -48772 -34433 -56912 -47357 28362 57579 40722 84109 92716 111954
6061 111954 114943 140158 92713 34902 -12282 11997 -7426 5041 -16759 -22209 13300 31004
$$ packed form
6146b7469L2069J10559k2732p3298r5147L1023M9611R779J8098K4375m1176m5797
6134c0105m824O373j1466j2609P6726O1258k5247m4888k2018n230Q1116j0204
6122E8882p2982j647n952j6059l1440k6344P8925M6448q0551M9929L9373l0429
6110H153k0639k6463M713J3762j8005O470m714l0344k0671K435M1862N024P171
6097c1246K2394j5546J2703k3769m7161L8793L2259j0894l3729o9875K2518P9309
6085b4244J8359M9306P797L4396k6178n4196n9931K303K1486L4130m575l5355
6073c6702l6742P189J7483J4339k2479R555P5719K9217j6857M3387Q607J9238
6061A11954K989K5215m7445n7811m7184K4279j9423J2467k1800n450L5509J7704
$$ plain form
6049 31004 42344 20190 -32173 -54786 -38819 -18752 23133 60120 31821 -37227 -80436 -88172
6037 -88172 -53176 -27895 -6283 20719 14085 7153 -61509 -108635 -134689 -82464 -6015 68812
6025 68812 51996 -9868 -31651 -82629 -133444 -98634 -82206 -97105 -174258 -136564 -100639 -48879
6013 -48879 -48103 -104833 -52475 -31966 -49327 -3852 32634 23969 6260 16350 2731 11333 18310
6000 18310 6216 18215 6085 -12846 -72802 -53036 -48532 -50956 -25198 8831 29659 -29131
5988 -29131 12438 59979 65011 37341 32678 36962 -22314 9002 37028 -9269 -39898 -51688
5976 -51688 -43679 -37213 -6699 -21557 -49706 -75434 -50255 -34134 -41597 -73175 -70640 14506 46917
5963 46917 27568 -3759 -13165 20462 40095 7375 14248 8979 7341 -74431 -106083 -76131 -83906
$$ packed form
6049C1004J1340k2154n2363k2613J5967K0067M1885L6987k8299o9048m3209p736
6037h8172L4996K5281K1612K7002o634o932o8662m7126k6054N2225P6449P4827
6025F8812j6816o1864k1783n0978n0815L4810J6428j4899p7153L7694L5925N1760
6013d8879P76n6730N2358K0509j7361M5475L6486q665j7709J0090j3619Q602O977
6000A8310j2094J1999j2130j8931n9956J9766M504k424K5758L4029K0828n8790
5988b9131M1569M7541N032k7670m663M284n9276L1316K8026m6297l0629j1790
5976e1688Q009O466L0514j4858k8149k5728K5179J6121p463l1578K535Q5146L2411
5963D6917j9349l1327r406L3627J9633l2720O873n269j638q1772l1652K9952p775
$$ plain form
5950 -83906 -75045 -30840 -2426 7983 33914 33387 38296 3140 -7416 28377 59108 34829 -26585
5937 -26585 -48758 -18378 4078 -16132 35963 21385 50521 27799 52581 40176 41655 8104
5925 8104 13265 15810 -12234 7067 -6980 -32821 20684 36522 47114 40318 80273 49733 -20212
5912 -20212 -72986 -36754 -27312 17174 8219 -9361 -8412 18929 19350 13414 56058 34156 48533
5899 48533 23839 -16653 -28259 -49851 -67860 -60518 -117555 -76302 4119 32166 -2944 -15085
5887 -15085 -55550 -62973 -90237 -79552 -34809 3833 16227 25972 12256 3259 -1833 28918 53816
5874 53816 14790 -12793 -48789 -92008 -71941 -61218 -86608 -76582 -71582 -68582 9859 35950
5862 35950 73293 82881 19101 -30450 -38174 -47267 -72465 -74140 -73374 -65884 -15970 -17583 -62875
$$ packed form
5950h3906Q861M4205K8414J0409K5931n27M909l5156j0556L5793L0731k4279o1414
5937b6585k2173L0380K2456k0210N2095j4578K9136k2722K4782j2405J479l3551
5925H104N161K545k8044J9301j4047k5841N3505J5838J0592o796L9955l0540o9945
5912b0212n2774L6232R442M4486q955j7580R49K7341M21n936M2644k1902J4377
5899D8533k4694m0492j1606k1592j8009P342n7037M1253Q0421K8047l5110j2141
5887a5085m0465p423k7264J0685M4743L8642J2394R745j3716q997n092L0751K4898
5874E3816l9026k7583l5996m3219K0067J0723k5390J0026N000L000P8441K6091
5862C5950L7343R588o3780m9551p724r093k5198j675P66P490M9914j613m5292
$$ plain form
5849 -62875 -60190 -37435 -61595 -92946 -111090 -199243 -174361 -118178 -63625 -85553 -119204 -140853
5837 -140853 -129873 -93660 -89832 -80885 -24732 -9508 37230 2182 34574 25771 297 -29246
5825 -29246 9722 -11145 -29210 -22184 41812 19248 32880 66708 85543 64012 17726 30913
5813 30913 71355 36167 19927 -6947 -24867 9672 -43589 -82738 -84504 -80083 -38719 28404
5801 28404 27751 50649 27976 -1035 -69802 -113421 -127833 -77449 23813 -22076 -67974 -55225
5789 -55225 -53298 1033 5352 -33515 -43345 3156 -4608 -58795 -36755 -8854 26511 50831 30502
5776 30502 28271 32101 11597 14852 48053 20897 67640 75732 5491 -61000 -58739 -22153 9620
5763 9620 23738 -38128 -66993 -29517 -34569 -42413 -24070 -33063 -35197 17489 22392 33164 6321
$$ packed form
5849f2875K685K2755k4160l1351j8144q8153K4882N6183N4553k1928l3651k1649
5837a40853J0980L6213L828Q947N6153J5224M6738l5048L2392q803k5474k9543
5825b9246L8968k0867j8065P026O3996k2564J3632L3828J8835k1531m6286J3187
5813C0913M0442l5188j6240k6874j7920L4539n3261l9149j766M421M1364O7123
5801B8404o53K2898k2673k9011o8767m3619j4412N0384J01262m5889m5898J2749
5789e5225J927N4331M319l8867r830M6501p764n4187K2040K7901L5365K4320k0329
5776C0502k231L830k0504L255L3201k7156M6743Q092p0241o6491K261L6586L1773
5763I620J4118o1866k8865L7476n052p844J8343q993k134N2686M903J0772k6843
$$ plain form
5750 6321 8766 7403 -39619 -54385 20312 -23282 -29014 -62651 -47990 -66308 -28550 -28027 -44528
5737 -44528 -27926 -46016 -32251 -14594 36476 38510 39047 19759 -7092 -1692 -4636 2821 -44915
5724 -44915 -85777 -46228 -29104 -17026 -1634 69763 29080 -9653 -64211 -69852 49280 104992
5712 104992 92173 54757 44762 -4884 -18502 1871 13452 48498 49574 64076 91187 118036
5700 118036 123476 139378 90549 24069 -24365 8975 -19337 16726 8215 -7842 4791 -19989
5688 -19989 -26851 -7287 30257 51436 -41430 -43759 7498 33132 55329 43650 -1120 -24620
5676 -24620 -67886 -63405 -72257 -132759 -108457 -97201 -103066 -63816 -57408 -82788 -54941 4655 50085
5663 50085 25925 -34538 -20413 -19073 20476 34444 67495 54511 -68116 -102959 -71498 -43847
$$ packed form
5750F321K445j363m7022j4766P4697m3594n732l3637J4661j8318L7758N23j6501
5737d4528J6602j8090J3765J7657N1070K034N37j9288k6851N400k944P457m7736
5724d4915m0862L9549J7124J2078J5392P1397m0683l8733n4558n641J19132N5712
5712A04992j2819l7416r995m9646j3618K0373J1581L5046J076J4502K7111K6849
5700A18036N440J5902m8829o6480m8434L3340k8312L6063q511j6057J2633k4780
5688a9989o862J9564L7544K1179r2866k329N1257K5634K2197j1679m4770k3500
5676b4620m3266M481q852o0502K4302J1256n865L9250O408k5380K7847N9596M5430
5663E0085k4160o0463J4125J340L9549J3968L3051j2984j22627l4843L1461K7651
$$ plain form
5651 -43847 -40792 -40838 12114 12240 -13353 15132 18860 -13620 -90818 -120773 -148199 -162942 -120629
5638 -120629 -80743 -24435 -53335 -88712 -69802 -18442 44906 38533 6836 11064 -52318 -59153
5626 -59153 -36863 -28355 -41258 -33659 18191 84057 32341 6768 -15757 -24778 3643 -10491
5614 -10491 -11200 -6811 -40000 -20483 68164 59414 53681 105394 54525 36774 -35598 -74005 -38650
5601 -38650 -46656 -87641 -94293 -133450 -133847 -61127 10570 -42624 -61269 -8436 36561 20744 -6143
5588 -6143 -6149 -4095 -66468 -70473 -48372 -26162 11020 34907 19113 9160 10120 40122 -2068 3045
5574 3045 47529 42918 23529 27438 -4219 26853 19436 -20762 -60942 -58228 -29781 -82607 -107487
5561 -107487 -71508 -28987 32349 37760 52631 36407 5719 -29379 -23603 -20390 -31214 24300
$$ packed form
5651d3847L055m6N2952J26k5593K8485L728l2480p7198k9955k7426j4743M2313
5638a20629L9886N6308k8900l5377J8910N1360O3348o373l1697M228o3382o835
5626e9153K2290Q508j2903P599N1850O5866n1716k5573k2525r021K8421j4134
5614a0491p09M389l3189J9517Q8647q750n733N1713n0869j7751p2372l8407L5355
5601c8650q006m0985o652l9157l97P2720P1697n3194j8645N2833M4997j5817k6887
5588f143oK054o2373m005K2101K2210L7182K3887j5794r953R60L0002m2190N113
5574C045M4484m611j9389L909l1657L1072p417m0198m0180K714K8447n2826k4880
5561a07487L5979M2521O1336N411J4871j6224l0688l5098N776L213j0824N5514
$$ plain form
5549 24300 -7671 -59086 -58026 -38221 43293 42496 73407 93774 78276 81081 63008 80969 26445
5536 26445 -17162 -31012 -22211 -60368 -82841 -130869 -112707 -86299 -26410 370 33787 114625
5524 114625 87463 46151 53633 29276 -2740 12540 3121 658 -25719 35480 97807 81801
5512 81801 93108 51034 -3752 3064 15140 22086 -28554 -41058 -48490 -39346 -40634 21360 60243
5499 60243 31734 3566 3057 5717 13052 -10381 10837 17134 -15076 -87025 -75525 992 -3197
5486 -3197 -20614 -6838 -8065 36480 89052 94523 18188 -94516 -114592 -107586 -107545 -58830 -31228
5473 -31228 -26768 46797 84212 -30858 -45594 -28360 -12801 -19813 -45337 -82875 -99629 -65968
5461 -65968 -43932 -25827 -9858 -57202 -62366 -36764 -31527 -5769 -28908 -80748 -76692 -47676
$$ packed form
5549B4300l1971n1415J060J9805Q1514p97L0911K0367j5498K805j8073J7961n4524
5536B6445m3607j3850Q801l8157k2473m8028J8162K6408N9889K6780L3417Q0838
5524A14625k7162m1312P482k4357l2016J5280r419k463k6377O1199O2327j6006
5512H1801J1307m2074n4786O816J2076O946n0640j2504p432R144j288O1994L8883
5499F0243k8509k8168n09K660P335k3433K1218O297l2210p1949J1500P6517m189
5486c197j7417J3776j227M4545N2572N471p6335j12704k0076P006M1M8715K7602
5473c1228M460P3565L7415j15070j4736J7234J5559p012k5524l7538j6754L3661
5461f5968K2036J8105J5969m7344n164K5602N237K5758k3139n1840M056K9016
$$ plain form
5449 -47676 -74745 -30933 -4685 -44716 -30082 -4239 -17609 -4518 42941 79260 53160 17788
5437 17788 20494 -23743 -8952 -2172 -14614 22564 40943 40206 21322 -1310 -10601 -6986 27752
5424 27752 -18184 -49244 -15215 -12552 -15683 5574 15749 8043 815 71 53138 23083 -2840
5411 -2840 -45203 -48191 -42624 -45399 -32683 12799 10231 -6402 -13102 -76778 -77970 -98306 -35743
5398 -35743 41613 1969 -3023 -9284 -38305 -22616 -29089 -48083 -96900 -106964 -9725 21405
5386 21405 -15974 4693 67156 100715 37910 -56212 -67263 -35084 28542 22161 19565 49497
5374 49497 25042 28409 71046 51013 10115 -12662 -15391 8656 -15049 -34450 -67409 -108745
5362 -108745 -69787 -54955 -28906 24731 46498 93358 82794 65047 8332 -47428 -59164 -55954
$$ packed form
5449d7676k7069M3812K6248m0031J4634K5843j3370J3091M7459L6319k6100l5372
5437A7788K706m4237J4791O780j2442L7178J8379p37j8884k2632r291L615L4738
5424B7752m5936l1060L4029K663l131K1257J0175p706p228p44N3067l0055k5923
5411b840m2363k988N567k775J2716M5482k568j6633o700o3676j192k0336O2563
5398c5743P7356l9644m992o261k9021J5689o473j8994m8817j0064R7239L1130
5386B1405l7379K0667O2463L3559o2805r4122j1051L2179O3626o381k596K9932
5374D9497k4455L367M2637k0033m0898k2777k729K4047k3705j9401l2959m1336
5362a08745L8958J4832K6049N3637K1767M6860j0564j7747n6715n5760j1736L210
$$ plain form
5350 -55954 -13378 6513 -71159 -70184 -41233 -52988 -71733 -42875 -28828 -86524 -52251 -42884
5338 -42884 -33850 -4419 -12080 -39237 -45254 -19588 -29391 -44951 -56888 -30765 -29802 -41898 -48726
5325 -48726 -8298 72452 58253 -41676 -44694 -77231 -52464 -3419 32525 35554 -30943 -4911
5313 -4911 52719 65184 59912 53256 55337 19396 -22017 -42868 52012 107801 121808 128490 83444
5300 83444 52480 75861 62984 -51815 -41403 40729 23928 25198 61984 15926 -10520 -61154
5288 -61154 -53139 10383 32496 -4817 -6040 -69918 -45338 -13177 -14545 31504 18925 -2500
5276 -2500 4506 44273 42278 28752 40499 5396 18882 -1855 -45051 -61642 26351 21777 6866
5263 6866 14611 -40406 -62963 -25670 -13598 -3793 -73223 -81193 -63126 -71641 -74532 -48896 -30416
$$ packed form
5350e5954M2576J9891p7672R75K8951j1755j8745K8858J4047n7696L4273R367
5338d2884R034K9431p661k7157o017K5666r803j5560j1937K6123R63j2096o828
5325d8726M0428Q0750j4199r9929l018l2537K4767M9045L5944L029o6497K6032
5313d911N7630J2465n272o656K081l5941m1413k0851R4880N5789J4007O682m5046
5300H3444l0964K3381j2877j14799J0412Q2132j6801J270L6786m6058k6446n0634
5288f1154Q015O3522K2113l7313j223o3878K4580L2161j368M6049j2579k1425
5276b500P006L9767j995j3526J1747l5103J3486k0737m3196j6591Q7993m574j4911
5263F866P745n5017k2557L7293J2072R805o9430p970J8067q515k891K5636J8480
$$ plain form
5250 -30416 -7224 43181 35759 7818 -26401 -30329 50179 125876 114962 60231 9967 72319
5238 72319 30496 -35827 -67034 -99082 -90494 -64297 -56786 -16198 7154 -45471 -74747 -54927
5226 -54927 38512 17260 -23101 -10944 18332 24577 -7863 -17351 -32652 -21854 -66316 -89638
5214 -89638 -88947 -77283 -113057 -91414 -32911 7432 -17532 35650 105009 40598 25622 16590
5202 16590 -14436 -41861 -79459 -25470 50409 58826 24894 49395 23469 -351 -9128 6681
5190 6681 -29171 -64816 -68743 -75285 -44265 -37515 -55795 -88358 -83508 -79013 -72270 -31233 -15329
5177 -15329 -70072 -111331 -70742 -27722 -23983 -43075 -17851 18623 71498 51565 80865 71889
5165 71889 -48314 -35482 -95392 -74311 -47340 -34309 5938 8318 -14696 -30101 -61299 31889
$$ packed form
5250c0416K3192N0405p422k7941l4219l928Q0508P5697j0914n4731n0264O2352
5238G2319m1823o6323l1207l2048Q588K6197P511M0588K3352n2625k9276J9820
5226e4927R3439k1252m0361J2157K9276O245l2440r488j5301J0798m4462k3322
5214h9638O91J1664l5774K1643N8503M0343k4964N3182O9359o4411j4976r032
5202A6590l1026k7425l7598N3989P5879Q417l3932K4501k5926k3820q777J5809
5190F681l5852l5645l927o542L1020O750j8280l2563M850M495O743M1037J5904
5177a5329n4743m1259M0589M3020L739j9092K5224L6474N2875j9933K9300q976
5165G1889j20203J2832n9910K1081K6971J3031M0247K380k3014j5405l1198R3188
$$ plain form
5153 31889 85921 44505 14825 36459 14795 -77930 -65252 7148 56903 34289 5899 3901
5141 3901 51449 41165 3145 -45905 -7918 15310 -12855 -46197 -36421 33800 108295 123488
5129 123488 99966 85540 27175 -1113 6895 9286 1745 47682 60023 3956 -47005 -51296
5117 -51296 -42096 -49057 -23248 -70706 -57723 30258 75450 133148 97550 46473 -2488 -46140
5105 -46140 -52874 -13741 21894 914 -29391 -19248 -27288 -67433 -115466 -88944 -68973 -58763
5093 -58763 -30323 -26109 -92356 -42841 5631 8479 -18955 -18512 -8877 -30955 -78054 -127320 -90356
5080 -90356 -63334 -10414 8769 22086 3299 18292 24223 44460 34428 3460 28857 32109
5068 32109 28942 49794 -26329 -57076 -38683 5503 49983 49523 -48541 -17049 -10744 -25990 -41795
$$ packed form
5153C1889N4032m1416k9680K1634k1664r2725J2678P2400M9755k2614k8390j998
5141C901M7548j0284l8020m9050L7987K3228k8165l3342R776P0221P4495J5193
5129A23488k3522j4426n8365k8288Q008K391p541M5937J2341n6067n0961m291
5117e1296R200o961K5809m7458J2983Q7981M5192N7698l5598n1077m8961m3652
5105d6140o734L9133L5635k0980l0305J0143q040m0145m8033K6522J9971J0210
5093e8763K8440M214o6247M9515M8472K848k7434M43R635k2078m7099m9266L6964
5080i0356K7022N2920J9183J3317j8787J4993N931K0237j0032l0968K5397L252
5068C2109l167K0852p6123l0747J8393M4186M4480m60r8064L1492O305j5246j5805
$$ plain form
5055 -41795 -74647 -91400 -97572 -21345 114449 146614 90939 57553 67102 -1590 -62072 -86002
5043 -86002 -101819 -35562 28453 17373 -1426 -11417 -51449 -91149 -75197 -59078 -57671 389
5031 389 35762 18715 -9847 -18705 -35251 21531 71753 68572 23380 30723 43852 41145 37300
5018 37300 21441 30077 -77823 -106710 -133224 -90629 -7047 7824 -12200 -23273 20970 44417
5006 44417 7550 -36653 -46888 -23161 8027 9891 53516 23613 -17968 -17523 71595 102124
4994 102124 95793 66498 72988 88749 53788 -24924 -16974 15726 -16620 5990 91242 124368
4982 124368 58566 -3849 -43094 -61997 -94809 -107478 -49785 6240 -6000 -47236 -69332 -16086
4970 -16086 24896 8078 -13955 -13337 8258 19411 -3118 27090 71021 5477 -34578 9250
$$ packed form
5055d1795l2852j6753o172P6227J35794L2165n5675l3386R549o8692o0482k3930
5043h6002j5817O6257O4015j1080j8799r991m0032l9700J5952J6119J407N8060
5031C89L5373j7047k8562q858j6546N6782N0222l181m5192P343J3129k707l845
5018C7300j5859Q636j07900k8887k6514M2595Q3582J4871k0024j1073M4243K3447
5006D4417l6867m4203j0235K3727L1188J864M3625k9903m1581M45Q9118L0529
4994A02124o331k9295O490J5761l4961p8712P950L2700l2346K2610Q5252L3126
4982A24368o5802o2415l9245j8903l2812j2669N7693N6025j2240m1236k2096N3246
4970a6086M0982j6818k2033O18K1595J1153k2529L0208M3931o5544m0055M3828
$$ plain form
4958 9250 -15509 -66361 -124917 -102557 -65225 -41797 -52251 -565 25194 48590 59703 77537
4946 77537 60240 119279 85653 32830 48567 47834 -14878 -28060 33127 42459 68225 88559
4934 88559 139781 93485 1282 -3473 54690 106146 87172 -7769 -28689 17515 16412 21252
4922 21252 4503 716 -14868 -34212 -41766 -33548 -6177 -2915 43074 47990 27740 66312 83393
4909 83393 34805 79412 131807 146830 126964 127170 130879 74009 18217 -20711 -120022 -156588
4897 -156588 -122676 -66332 27885 -2454 -26021 -7783 52955 122786 102500 40322 -33578 -110117
4885 -110117 -70174 -30527 -46640 -38283 44979 15670 -1050 62955 38273 -10915 -80196 -92944
4873 -92944 -70657 -51355 -14410 -1485 10929 1971 21863 -2883 -72380 -108095 -87902 -99980
$$ packed form
4958I250k4759n0852n8556K2360L7332K3428j0454N1686K5759K3396J1113J7834
4946G7537j7297N9039l3626n2823J5737p33o2712j3182O1187R332K5766K0334
4934H8559N1222m6296r2203m755N8163N1456j8974r4941k0920M6204j103M840
4922B1252j6749l787j5584j9344p554Q218K7371L262M5989M916k0250L8572J7081
4909H3393m8588M4607N2395J5023j9866K06L709n6870n5792l8928r9311l6566
4897a56588L3912N6344R4217l0339k3567J8238O0738O9831k0286o2178p3900p6539
4885a10117L9943L9647j6113Q357Q3262k9309j6720O4005k4682m9188o9281j2748
4873i2944K2287J9302L6945J2925J2414q958J9892k4746o9497l5715K0193j2078
$$ plain form
4861 -99980 -77374 -37307 43092 93297 50057 57040 3229 -24250 -795 -13652 -24879 -39485
4849 -39485 -39650 -70420 -94102 -30874 51978 23886 -20595 -23011 -6943 45384 82072 73281 41850
4836 41850 46805 83212 62787 66540 85956 100823 103536 65085 24976 -10706 -9117 -18588 -21431
4823 -21431 -24935 -6071 5872 38204 27034 39305 87216 118884 89192 85138 116055 84008
4811 84008 55355 -34413 -34145 58019 124608 88612 17546 -27150 -42769 -38309 -54744 -34092
4799 -34092 -17802 35272 25009 52571 -54348 -82525 -34804 -27449 22184 35104 16782 -8507
4787 -8507 8581 14142 -7102 -21910 20649 75307 40279 27188 22615 7970 -20092 -21351 -33906
4774 -33906 -71829 -58808 -26039 22823 37948 29746 25434 55569 26148 16442 -11001 4205
$$ packed form
4861i9980K2606M0067Q0399N0205m3240O983n3811k7479K3455j2857j1227j4606
4849c9485j65l0770k3682O3228Q2852k8092m4481k416J6068N2327L6688q791l1431
4836D1850M955L6407k0425L753J9416J4867K713l8451m0109l5682J589r471k843
4823b1431l504J8864J1943L2332j1170J2271M7911L1668k9692m054L0917l2047
4811H4008k8653q9768K68R2164O6589l5996p1066m4696j5619M460j6435K0652
4799c4092J6290N3074j0263K7562j06919k8177M7721P355M9633J2920j8322k5289
4787h507J7088N561k1244j4808M2559N4658l5028j3091m573j4645k8062j259j2555
4774c3906l7923J3021L2769M8862J5125q202m312L0135k9421r706k7443J5206
$$ plain form
4762 4205 91851 66769 -12225 -14456 -16386 7233 44686 77527 1213 -26647 28307 27823 -9635
4749 -9635 -9654 -45414 -29594 21216 33308 21314 8744 24939 57964 48265 68009 56278 40433
$$ packed form
4762D205Q7646k5082p8994k231j930K3619L7453L2841p6314k7860N4954m84l7458
4749i635j9l5760J5820N0810J2092j1994j2570J6195L3025r699J9744j1731j5845
$$ [...]
##END NTUPLES=NMR SPECTRUM
##END=
