##TITLE=Analysis number 318101
Compound Code xx 49701
Book Reference 423/62
Project Code adrs
Chemist Name bruced
##JCAMPDX= 6.0         $$ Bruker NMR JCAMP-DX V2.0
##DATA TYPE= NMR SPECTRUM
##DATA CLASS= NTUPLES
##ORIGIN= Bruker BioSpin GmbH
##OWNER= nmr
$$ XWIN-NMR		Version 3.5
$$ Wed Mar 15 11:44:42 2006 GMT Standard Time (UT+0h)  MAYBRIDGE\nmr@NMR_250MHZ
##.OBSERVE FREQUENCY= 250.131544655141
##.OBSERVE NUCLEUS= ^1H
##.ACQUISITION MODE= SIMULTANEOUS (DQD)
##.ACQUISITION SCHEME= undefined
##.AVERAGES= 16
##.DIGITISER RES= 18
##SPECTROMETER/DATA SYSTEM= dpx250
##.PULSE SEQUENCE= zg30
##.SOLVENT NAME= DMSO
##.SHIFT REFERENCE= (INTERNAL, DMSO, 0, 16.522)
##AUDIT TRAIL= $$ (NUMBER, WHEN, WHO, WHERE, WHAT)
$$ ##TITLE= Audit trail, XWIN-NMR		Version 3.5
$$ ##JCAMPDX= 5.01
$$ ##ORIGIN= Bruker BioSpin GmbH
$$ ##OWNER= nmr
$$ C:\u/data/dgb/nmr/ADRS/760/pdata/1/auditp.txt
$$ ##AUDIT TRAIL=  $$ (NUMBER, WHEN, WHO, WHERE, WHAT)
(   1,<2006-03-15 11:43:59.09 +000>,<MAYBRIDGE\nmr>,<NMR_250MHZ>,
      <created by zg, POWCHK disabled, PULCHK disabled
       configuration hash MD5:
       84 BC 41 DB A1 6E 1D 46 DA 25 12 A5 C1 ED C5 3A
       data hash MD5: 64K
       C4 E1 F9 CB CC BD AA B7 3B 21 AF CB AB EE CB 6E>)
(   2,<2006-03-15 11:44:19.16 +000>,<MAYBRIDGE\nmr>,<NMR_250MHZ>,
      <Start of raw data processing
       ef LB = 0.3 FT_mod = 6 PKNL = 1 SI = 32K 
       data hash MD5: 32K
       41 B6 15 D9 CC BF 8B 8D FD EC 5B D0 CF 04 57 7D>)
(   3,<2006-03-15 11:44:23.52 +000>,<MAYBRIDGE\nmr>,<NMR_250MHZ>,
      <apk 
       data hash MD5: 32K
       5B BA 5D 12 83 CD 30 4F 1E 78 39 D3 EF 05 E2 58>)
(   4,<2006-03-15 11:44:24.90 +000>,<MAYBRIDGE\nmr>,<NMR_250MHZ>,
      <abs ABSG = 5 
       data hash MD5: 32K
       F9 75 42 CC 59 06 04 DC 0D 5B F9 17 95 41 C3 D4>)
$$ ##END=
$$ 
$$ hash MD5
$$ 80 5D C6 BB D1 CA C9 35 26 98 B6 85 85 25 8C 6E
##$RELAX= 
##$RELAX= 
##$RELAX= 
##$RELAX= 
##$RELAX= 
##$RELAX= 
##$RELAX= 
$$ Bruker specific parameters
$$ --------------------------
##$DU= <C:\u>
##$EXPNO= 760
##$NAME= <ADRS>
##$PROCNO= 1
##$TYPE= <nmr>
##$USER= <dgb>
##$AMP= (0..31)
100 100 100 100 100 100 100 100 100 100 100 100 100 100 100 100 100 100 
100 100 100 100 100 100 100 100 100 100 100 100 100 100 
##$AQSEQ= 0
##$AQ_mod= 3
##$AUNM= <au_zg>
##$AUTOPOS= <21 >
##$BF1= 250.13
##$BF2= 250.13
##$BF3= 250.13
##$BF4= 250.13
##$BF5= 500.13
##$BF6= 500.13
##$BF7= 500.13
##$BF8= 500.13
##$BYTORDA= 1
##$CFDGTYP= 0
##$CFRGTYP= 5
##$CHEMSTR= <none>
##$CNST= (0..31)
1 1 145 1 1 1 1 1 1 1 1 1 1 1 1 1 1 1 1 1 1 1 1 1 1 1 1 1 1 1 1 1 
##$CPDPRG= <>
##$CPDPRG1= <>
##$CPDPRG2= <>
##$CPDPRG3= <>
##$CPDPRG4= <mlev>
##$CPDPRG5= <mlev>
##$CPDPRG6= <mlev>
##$CPDPRG7= <mlev>
##$CPDPRG8= <mlev>
##$CPDPRGB= <>
##$CPDPRGT= <>
##$D= (0..31)
0 1 0 0 0 0 0 0 0 0.06 0 0 0 0 0 0 0.0002 0 0 0 0 0 0 0 0 0 0 0 0 0 0 
0 
##$DATE= 1142423037
##$DBL= (0..7)
120 120 120 120 120 120 120 120 
##$DBP= (0..7)
150 150 150 150 150 150 150 150 
##$DBP07= 0
##$DBPNAM0= <>
##$DBPNAM1= <>
$$ [...]
##$SUBNAM7= <"">
##$SUBNAM8= <"">
##$SUBNAM9= <"">
##$SW= 20.6930455092707
##$SWIBOX= (0..15)
0 0 3 0 0 0 0 0 0 0 0 0 0 0 0 0 
##$SW_h= 5175.983436853
##$TD= 65536
##$TD0= 1
##$TE= 294.16
##$TE2= 300
##$TE3= 300
##$TEG= 300
##$TL= (0..7)
0 120 120 120 120 120 120 120 
##$TP= (0..7)
150 150 150 150 150 150 150 150 
##$TP07= 0
##$TPNAME0= <>
##$TPNAME1= <>
##$TPNAME2= <>
##$TPNAME3= <>
##$TPNAME4= <>
##$TPNAME5= <>
##$TPNAME6= <>
##$TPNAME7= <>
##$TPOAL= (0..7)
0.5 0.5 0.5 0.5 0.5 0.5 0.5 0.5 
##$TPOFFS= (0..7)
0 0 0 0 0 0 0 0 
##$TUNHIN= 0
##$TUNHOUT= 0
##$TUNXOUT= 0
##$USERA1= <user>
##$USERA2= <user>
##$USERA3= <user>
##$USERA4= <user>
##$USERA5= <user>
##$V9= 5
##$VALIST= <valist>
##$VCLIST= <CCCCCCCCCCCCCCC>
##$VD= 0
##$VDLIST= <DDDDDDDDDDDDDDD>
##$VPLIST= <PPPPPPPPPPPPPPP>
##$VTLIST= <TTTTTTTTTTTTTTT>
##$WBST= 1024
##$WBSW= 4
##$XGAIN= (0..3)
0 0 0 0 
##$XL= 0
##$YL= 0
##$YMAX_a= 324788
##$YMIN_a= -460665
##$ZGOPTNS= <>
##$ZL1= 120
##$ZL2= 120
##$ZL3= 120
##$ZL4= 120
##$ABSF1= 16.522
##$ABSF2= -4.171173
##$ABSG= 5
##$ABSL= 3
##$ALPHA= 0
##$AQORDER= 0
##$ASSFAC= 0
##$ASSFACI= 0
##$ASSFACX= 0
##$ASSWID= 0
##$AUNMP= <proc_1d>
##$AZFE= 0.1
##$AZFW= 0.1
##$BCFW= 0
##$BC_mod= 0
##$BYTORDP= 0
##$COROFFS= 0
##$CY= 12.5
##$DATMOD= 1
##$DC= 0
##$DFILT= <>
##$DTYPP= 0
##$F1P= 14.0000005364418
##$F2P= -0.99999901652339
##$FCOR= 0.5
##$FTSIZE= 32768
##$FT_mod= 6
##$GAMMA= 0
##$GB= 0
##$INTBC= 1
##$INTSCL= 1
##$ISEN= 128
##$LB= 0.3
##$LEV0= 0
##$LPBIN= 0
##$MAXI= 10000
##$MC2= 0
##$MEAN= 0
##$ME_mod= 0
##$MI= 0
##$NCOEF= 0
##$NC_proc= -4
##$NLEV= 6
##$NOISF1= 0
##$NOISF2= 0
##$NSP= 0
##$NTH_PI= 0
##$NZP= 0
##$OFFSET= 16.522
##$PC= 1
##$PHC0= 165.9823
##$PHC1= 7.914045
##$PH_mod= 1
##$PKNL= yes
##$PPARMOD= 0
##$PSCAL= 4
##$PSIGN= 0
##$REVERSE= no
##$SF= 250.13
##$SI= 32768
##$SIGF1= 0
##$SIGF2= 0
##$SINO= 400
##$SIOLD= 32768
##$SREGLST= <1H.DMSO>
##$SSB= 0
##$STSI= 32768
##$STSR= 0
##$SW_p= 5175.98343685301
##$SYMM= 0
##$S_DEV= 0
##$TDeff= 65536
##$TDoff= 0
##$TI= <Analysis number 999999
Compound Code 99
Book Reference 9
Project Code 9>
##$TILT= no
##$TM1= 0
##$TM2= 0
##$TOPLEV= 0
##$USERP1= <user>
##$USERP2= <user>
##$USERP3= <user>
##$USERP4= <user>
##$USERP5= <user>
##$WDW= 1
##$XDIM= 32768
##$YMAX_p= 411920449
##$YMIN_p= -393589
$$ End of Bruker specific parameters
$$ ---------------------------------
##NTUPLES= NMR SPECTRUM
##VAR_NAME=  FREQUENCY,     SPECTRUM/REAL,   SPECTRUM/IMAG
##SYMBOL=    X,             R,               I
##VAR_TYPE=  INDEPENDENT,   DEPENDENT,       DEPENDENT
##VAR_FORM=  AFFN,          ASDF,            ASDF
##VAR_DIM=   32768,         32768,           32768
##UNITS=     HZ,            ARBITRARY UNITS, ARBITRARY UNITS
##FACTOR=    0.157963299565203, 1,           1
##FIRST=     4132.6476996994, 0,             0
##LAST=      -1043.33573715361, 0,           0
##MIN=       -1043.33573715361, -393589,     0
##MAX=       4132.6476996994, 411920449,     0
$$ Real data points
##PAGE= N=1
##DATA TABLE= (X++(R..R)), XYDATA
$$ [...]
15719I226j8228k3316o5753j5922O1227O9849K097n1610p5109J24270k0743l9844
15707d3856J28674K8444k9198l2044j17059L5408J35165K3889L9667L1305j3775
15696A86620p5359m0119k2993j9203Q059j8304k6691r7392L3161K7851n868n8976
15684a09214J5845l5049m8582K108M0218J00313R1710m9990k2506o6033m0177
15673a21357j07443P9879J42059R7047J663j34557l7964K6509L1869m9457j4668
15662h6420L6505J01997P3224K1530j04380J2183R152L6260j7487N1723N669o7555
15650G2401p0620l0170o0512J27355J08815K8081l8224j16453j11160P4748N8775
15639D3036l7945q1346K1836N1390K4447l7120M4016P4705m241m6198k6714j16364
$$ plain form
15719 9226 -9002 -32318 -98071 -113993 -52766 17083 19180 -32430 -107539 16731 -4012 -43856
15707 -43856 84818 113262 84064 52020 -65039 -29631 105534 129423 169090 200395 186620
15696 186620 111261 71142 48149 28946 37005 18701 -7990 -105382 -72221 -44370 -50238 -109214
15684 -109214 -93369 -128418 -177000 -174892 -134674 -34361 57349 7359 -15147 -81180 -121357
15673 -121357 -228800 -148921 -6862 90185 91848 -42709 -80673 -54164 -22295 -71752 -86420
15662 -86420 -49915 52082 125306 146836 42456 54639 63791 100051 82564 134287 139956 72401
15650 72401 1781 -28389 -88901 38454 147269 175350 137126 20673 -90487 -15739 43036
15639 43036 5091 -76255 -54419 -3029 21418 -15702 28314 103019 98778 52580 25866 -90498
15627i0498k2425J4653O3019K8843M0739L8725l7692L5180m8525k4560n2054n8291
15615a12886J04939M4013o322m9119j25889m8120R9178R8220J0149K142M708o2129
15603d1116k5861R4315l5071m1409M2266L6428N0926l5340j03360o2341R1412
15592b9151L1114K1156O9510m5628n896m894M413k2089P6149m1532k06860q761
15580a62469Q5418L8046q6848J2170O3491L9016q316O2379l7203n8569J11357
15569E8472Q0840l3889o6330k8068m4462l9900p7746p9601L5450k0479m3504N474
15557b53743N6732n0326k139M8310j2633K1526J6338P0419P1715L1211n6154J3211
15545d5533N2648n0437l6142O5669J42229n5389j52986L9221M8396O2791K0982
$$ plain form
15627 -90498 -112923 -98270 -35251 -6408 34331 73056 35364 70544 22019 -2541 -54595 -112886
15615 -112886 -7947 36066 29744 -19375 -145264 -193384 -94206 4014 14163 16305 21013 -41116
15603 -41116 -66977 27338 -7733 -49142 -6876 29552 80478 45138 -58222 -120563 -29151
15592 -29151 1963 23119 92629 47001 41105 36211 40624 18535 94684 53152 -153708 -162469
15580 -162469 -77051 -39005 -125853 -113683 -50192 -11176 -19492 42887 5684 -52885 58472
15569 58472 139312 105423 39093 11025 -33437 -73337 -151083 -230684 -195234 -215713 -259217 -253743
15557 -253743 -197011 -247337 -249476 -201166 -213799 -192273 -175935 -105516 -33801 -2590 -58744 -45533
15545 -45533 7115 -43322 -79464 -13795 128434 73045 -79941 -40720 7676 70467 91449
15534I1449L5494m7234L6421l0522r9599P4266J433j8186q8875n5560o2405J6457
15522a46861n668k5824o5573k2696R0533P0105J8602l9409N9323R502Q887K9281
15510a9798J0610m4154J8385j863l2380l0412O01J16168O4957N055j06530n3621
15498g2982J3600J3921M2931l170m7502Q613K7498M3781R371L720n3565J4034
15486B50P6519k6261K9744l6564j8431j5003K5793j32401n9040P7065M4495L0496
15474c338m2292o4692K369L5380j8681K430M3342J4327q7568J0554r84N0827O1151
15461B825N3689r9524j04667N9398K6785n2990Q2418J5435j604j01114j3137O848
15449a25638J06981P421p0718K1978K7645J6928k2860k4877k6135q0632l0462
$$ plain form
15534 91449 126943 79709 116130 85608 -13991 60275 61708 43522 -45353 -100913 -163318 -146861
15522 -146861 -152529 -178353 -243926 -266622 -176089 -105984 -87382 -126791 -67468 -57966 -49079 -19798
15510 -19798 -9188 -53342 -34957 -36820 -69200 -99612 -99011 17157 82114 87169 -19361 -72982
15498 -72982 -59382 -45461 -2530 -5700 -53202 -44589 -17091 26690 36061 39781 -13784 250
15486 250 76769 50508 80252 43688 25257 10254 36047 -96354 -155394 -78329 -33834 -3338
15474 -3338 -45630 -110322 -107953 -72573 -91254 -88824 -45482 -31155 -118723 -108169 -109153 -58326 2825
15461 2825 56514 -43010 -147677 -88279 -61494 -114484 -32066 -16631 -18235 -119349 -132486 -125638
15449 -125638 -18657 -11236 -81954 -59976 -32331 -15403 -38263 -63140 -89275 -169907 -200369
15438b00369L9571Q1565N6646L4070l12m8173k6530K9777K8381M125m6430m7599
15426i5278l866J37017M5847N2241n6303l8913q6985p9416q2520k5556J02268
15415a31464M8610J485N0175j2022K1466k2392k9248Q2467M830Q4465K0292j65571
15403d6907j11784L7782O6M1269O2830P032j2127K2848j04943l725Q0280l1155
15391e8534O8566r458p7827J513N0846K2758r7701n2424O3416m0853J4113K063
15379a13522J9797L3702l2469n2478R7158L6123n1888n3982M0524J39239N4557
15368A16761k2717j40246j30484k2304J99655J8334p3837N5532J7585j18677k0461
15357a20859P732P5465R226p9117l2779P0706O5944n547L4778O718K0185n0910
$$ plain form
15438 -200369 -160798 -79233 -22587 11483 11171 -37002 -63532 -33755 -5374 -1249 -47679 -95278
15426 -95278 -99144 37873 83720 135961 79658 40745 -46240 -125656 -208176 -233732 -131464
15415 -131464 -82854 -81369 -31194 -43216 -21750 -44142 -73390 9077 13907 98372 118664 -46907
15403 -46907 -158691 -120909 -120843 -79574 -16744 -9712 -21839 1009 -103934 -107659 -27379 -58534
15391 -58534 10032 574 -77253 -75740 -24894 -2136 -99837 -152261 -88845 -129698 -115585 -113522
15379 -113522 -93725 -60023 -92492 -144970 -47812 -11689 -63577 -117559 -77035 62204 116761
15368 116761 94044 -46202 -176686 -198990 665 18999 -54838 694 18279 -100398 -120859
15357 -120859 -113127 -37662 -28436 -107553 -140332 -69626 -3682 -9229 25549 32267 52452 1542
15345A542j62369j8844O860K5182K0917J09938J7206K5506J0170o981L3110q4748
15333b2511m036Q710M471J02744L6650j4400l3062p8848J1349m772Q3302R0291
15321A79888j9197r7063l7404m5129n828q3419M6538L2889j9634m8260j810J8700
15309g9729N4077O5r4082q28m4772n303l2605K6728Q9365j4587q9109k7197m0176
15296b58153J68813J47033k4985k0594k9588J9959N8440L9890j3677J21121O8770
15285B77029M852K5237l2547j78534p6138m304q730L8810J52417j04992K834K8259
15273A24193j1405p5210k32L1323K4361n8017J275K3379L1644j7499j02482p685
15261c6355n939p9295N9162J07678Q7554q607l2093L0357o473q485l2996j18111
$$ plain form
15345 1542 -160827 -179671 -172811 -147629 -126712 -16774 432 25938 36108 29127 62237 -22511
15333 -22511 -26547 -17837 -13366 89378 126028 111628 78566 -282 11067 6295 89597 179888
15321 179888 160691 63628 26224 -18905 -24733 -108152 -61614 -28725 -48359 -96619 -98429 -79729
15309 -79729 -25652 -25587 -119669 -120497 -165269 -170572 -203177 -176449 -87084 -101671 -190780 -217977 -258153
15296 -258153 -89340 57693 32708 12114 -17474 2485 60925 100815 87138 208259 277029
15285 277029 281881 307118 274571 96037 19899 15595 6865 45675 198092 93100 95934 124193
15273 124193 112788 37578 37346 68669 93030 35013 36288 59667 91311 73812 -28670 -36355
15261 -36355 -42294 -121589 -62427 45251 132805 124198 92105 122462 115989 107504 74508 -43603
15249d3603M444K4933K0977r3575K7530P7053p9423j7904m491L4755o8580n1339
15237a69223M7556R1785m6542K6631n7857P8675l164l7485J2336N1540K6063N070
15225B5385o7267j17423M473L9122p2159K5495Q9961J3985J8732j4022K8267J13750
15213H8299O170J9227P0038k3144j65025p9144K6061L1058Q838R91j8742J0710
15201b4663O3229j6371K9039q9180k1478N1763Q5560M754p9133o4834M5095J20675
15189A04456O7828j23724j03372L3068k025K3987j17185N413m3851P510l4042
15178a81937P5885J02990L129m5316N4245l6975M2597J4625k5692l9386O8463
15167C2628N0280p9828j03599l8795J31912l3281j36288j361K1412m836J2808
$$ plain form
15249 -43603 -39159 -14226 6751 -86824 -59294 17759 -61664 -79568 -84059 -49304 -117884 -169223
15237 -169223 -121667 -29882 -76424 -49793 -107650 -28975 -32139 -69624 -57288 -5748 20315 25385
15225 25385 -41882 -159305 -154832 -115710 -187869 -162374 -72413 -58428 -39696 -53718 -25451 88299
15213 88299 94469 113696 183734 160590 -4435 -83579 -57518 -26460 -17622 -16631 -35373 -24663
15201 -24663 38566 22195 51234 -37946 -59424 -7661 77899 82653 3520 -61314 -16219 104456
15189 104456 172284 48560 -54812 -21744 -23769 218 -116967 -111554 -155405 -147895 -181937
15178 -181937 -106052 -3062 67 -45249 8996 -27979 14618 29243 3551 -35835 32628
15167 32628 82908 3080 -100519 -139314 -7402 -40683 -176971 -178332 -156920 -161756 -148948
15156a48948J06425L0377l1923m7138j6632m6226K5028J39089K8725j07249q7341
15145a55813J7535J38895J7606m0171m2436k3012L0513l6256j36399j41761Q673
15134c62626Q3033k7892M5099J20211Q6915N5215p2466r9496J3192J26951o673
15123c8537j8157m6198m165K4624J7251P6330q2093k4687P32p5023O3478J7095
15111h9350m796M7429L507n1443O5943j8539p4173j6283k0344J01488k0136k8540
15099a05237L2800J9880J0638J57352j1645j68801l3412K2307k5073Q5591k3967
15088c9567J0326N4370J47638p098j44473j64030j2063j4896K6594R8984k0270
15077f4485r4393m6087J24379N2961p7616q2545m2836N7214k0532J9186l38L7348
$$ plain form
15156 -148948 -42523 -12146 -44069 -91207 -107839 -154065 -129037 10052 38777 -68472 -155813
15145 -155813 -138278 617 18223 -21948 -64384 -87396 -56883 -93139 -229538 -371299 -362626
15134 -362626 -279593 -307485 -262386 -142175 -55260 -45 -72511 -172007 -158815 -31864 -38537
15123 -38537 -56694 -102892 -107057 -82433 -65182 11148 -70945 -95632 -94900 -169923 -106445 -89350
15111 -89350 -94146 -46717 -43210 -94653 -28710 -47249 -121422 -137705 -158049 -56561 -76697 -105237
15099 -105237 -72437 -52557 -41919 115433 103788 -65013 -98425 -76118 -101191 -15600 -39567
15088 -39567 -29241 25129 172767 165669 21196 -142834 -154897 -169793 -143199 -44215 -64485
15077 -64485 -158878 -204965 -80586 -27625 -105241 -187786 -230622 -173408 -193940 -174754 -175092 -137744
15065a37744K7770Q13P1127Q8961j36074j12304R8810J13773m083q569p5261n6900
15053a29681K6669N2157L4416L7317P1508m1400m9621r8750j47522L039M0824
15042b01044Q6791o0638r8690L5421J42769K6423L8335o9595j18376O1593Q3643
15031g3368p615P704j9544K4636J5893K1816l4947m047P8462p970q4455l2141
15019a15576j2872N7734K1478j2754O7490l3339j9762L6258j0449l5052J4135
15008d2709j758p291j51294O868Q5949p1163l0696m5174J1363R9324J41787P2152
14996F7358q1377o671k984J4381j6789o5937K625l4155j8083J47680M0440n9845
14984a3357K7466K1980J6510K9439j10558K9506k764k571j6244O5323q4334o0223
$$ plain form
15065 -137744 -109974 -109161 -38034 50927 -85147 -197451 -98641 15132 11049 2480 -72781 -129681
15053 -129681 -103012 -50855 -16439 20878 92386 50986 1365 -97385 -244907 -241868 -201044
15042 -201044 -114253 -174891 -273581 -238160 -95391 -68968 -30633 -100228 -218604 -157011 -73368
15031 -73368 -80983 -73279 -92823 -68187 -52294 -30478 -65425 -69472 8990 1020 -83435 -115576
15019 -115576 -128448 -70714 -49236 -61990 5500 -27839 -47601 -11343 -21792 -56844 -42709
15008 -42709 -44467 -51758 -203052 -196184 -110235 -181398 -212094 -257268 -245905 -146581 -4794 67358
14996 67358 -14019 -20690 -23674 -9293 -26082 -92019 -89394 -123549 -141632 6048 46488 -13357
14984 -13357 14109 36089 52599 82038 -28520 986 -1778 -4349 -20593 44730 -39604 -99827
14972i9827k7692L6603p167Q1305P9462P444j0281J55k3471r0725p0387M77J04383
14959a9721n7532l5899M5204J7821r0772J17962L2411n200J7049N9337O3748o7606
14947G6802j13881N3942N1802Q3696N6767N4221j62142j22119j0278K1820N49
14936h821R796N2950k8051l7807j13648p6291M584Q3497J28680L0366L207O2926
14924A11388K4486j3772l5836m804l2984m9656K9895L910Q8289l5724o1148n4877
14912c0833q4422k1930m173J3081k1101l1228L3205K10647m5698p0460J22459
14901F9547N4180J3403N7156P9307j2097J3521j12739p5728L976J8336q2198j17298
14889i0634n2299k9740Q624L2480o162q744M8199O9737L698k6547L3618L5305
$$ plain form
14972 -99827 -127519 -90916 -98083 -16778 62684 70128 59847 60002 36531 -54194 -124581 -124104 -19721
14959 -19721 -77253 -113152 -67948 -50127 -140899 -22937 9474 4274 21323 80660 144408 76802
14947 76802 -37079 16863 68665 152361 209128 263349 101207 -20912 -31190 -9370 -8821
14936 -8821 975 53925 25874 -11933 -125581 -201872 -197288 -113791 14889 45255 48462 111388
14924 111388 135874 122102 86266 81462 48478 -1178 28717 32627 120916 85192 24044 -30833
14912 -30833 -115255 -137185 -141358 -128277 -149378 -180606 -147401 63246 17548 -52912 69547
14901 69547 123727 137130 194286 273593 261496 275017 162278 86550 90526 108862 26664 -90634
14889 -90634 -142933 -172673 -164049 -131569 -137731 -146475 -98276 -28539 -24841 -51388 -17770 17535
14877A7535m275j6092n0694O944j8777J18830J13524L9230n6328r1814o4696L8277
14865C1664l0941l2838j008l6610k8666l65n7594n8144K7414J15495Q2252J7130
14853B7789m5396m6083R255K7661O2343j20800k7065O3107N893K7131j0114j08876
14841a35155L912J65864J989j4793j7730L3572o9360l0387Q326J12486p329r2832
14829d1437j89142N6946L6658N0798K6874r3453O291J14330M7686m7845k6020
14818e8314O8155M9547l7717M608J6684l9476K048j04023m8290j31255m5828J13868
14806b09993J44549M1820N4549L8587j34949j06860K6308M0815K1106m5829P0111
14795e9786M0542N0717N1754K4111k9182j0236o6237k1289O7958N0145p3741p0639
$$ plain form
14877 17535 13260 -2832 -53526 -46582 -65359 53471 166995 206225 149897 58083 -6613 31664
14865 31664 723 -32115 -33123 -69733 -98399 -98764 -156358 -214502 -187088 -71593 10659 27789
14853 27789 -17607 -63690 -54435 -26774 35569 -85231 -112296 -49189 -43296 -16165 -26279 -135155
14841 -135155 -131243 34621 36610 21817 4087 37659 -31701 -62088 -53762 58724 51395 -41437
14829 -41437 -230579 -173633 -136975 -86177 -59303 -152756 -146465 -32135 15551 -32294 -58314
14818 -58314 9841 59388 21671 26279 42963 3487 5535 -98488 -146778 -278033 -323861 -209993
14806 -209993 -65444 -23624 30925 69512 -65437 -172297 -145989 -105174 -84068 -129897 -59786
14795 -59786 -19244 31473 83227 107338 78156 67920 1683 -19606 48352 98497 24756 -45883
14783d5883K6718l2914q157J4631q298K6582j09680n9719J5080n7760M2859R1176
14771a05365J1789O8226J02279J8556j06636j2587J01998P0947K5953j18144j08432
14760e1416M4184J5969j34565R3880J04545M0247r8469r8637l6448Q291J4769
14749i7650Q1997p9772j06740J3577J23169O3650k2351q4531n1113O8646q024
14738i9142P0877O644l1872m6186L4285L0955J3642m4232m5324O4192R3656J03842
14726A51337o4105q5252q1030q9602N0856Q9805J19852M3425o054n5649p4237
14715f54O5258N6244q1444j0342K9431J5630j6319K5002N9510K5984m1910r2231
14703C4159n5312n9327q1479k4534J28899Q5962m0753M2842q5263n9280k5753
$$ plain form
14783 -45883 -19165 -52079 -60236 -45605 -53903 -27321 -137001 -196720 -181640 -239400 -196541 -105365
14771 -105365 -93576 -25350 76929 95485 -11151 -23738 78260 149207 175160 57016 -51416
14760 -51416 -7232 8737 -125828 -31948 72597 112844 14375 -84262 -120710 -112419 -97650
14749 -97650 -15653 -95425 -202165 -188588 -65419 -1769 -24120 -108651 -159764 -91118 -99142
14738 -99142 -28265 -21621 -53493 -99679 -65394 -34439 -20797 -65029 -110353 -46161 47495 151337
14726 151337 87232 1980 -79050 -168652 -117796 -27991 91861 135286 129232 73583 -654
14715 -654 64604 120848 39404 29062 58493 74123 57804 82806 142316 168300 126390 34159
14703 34159 -21153 -80480 -161959 -186493 -57594 28368 -12385 30457 -54806 -114086 -139839
14692a39839J2281q2753J8677M9984R0765Q8606j7371j54087l3830J16405O9385
14681A8223j8499n5067k9575p419j014P0548L2573k8452j03557p5457M4316J6283
14669a37097M9794l900K6792P9415J6063j37317K9895k1962k9578j6405J19659
14658b4641P564N5838J38185n5p3829K1697j23512m9107j2772q2721N1288Q2874
14646i191m2527j6783P2340k3180q707m4465j46818J8211J24122O8122l4756j1801
14634e5433J7741m426j06109j3240M5914O5716M8534j1584J5049o9316k5872J12224
14622A9198j577n3301p372M6430j0483j7308R2554k7241l4441Q9986J25700m828
14610B17317l9306k1173k3444k2311q9956Q040L830j01714l820Q2820j0335K1058
$$ plain form
14692 -139839 -127558 -210311 -191634 -141650 -50885 37721 20350 -133737 -167567 -51162 18223
14681 18223 -276 -55343 -84918 -92337 -93351 -22803 9770 -18682 -122239 -197696 -153380 -137097
14669 -137097 -87303 -91203 -64411 15004 31067 -106250 -76355 -98317 -127895 -144300 -24641
14658 -24641 -17077 38761 176946 176891 103062 124759 1247 -47860 -60632 -143353 -92065 -9191
14646 -9191 -51718 -68501 3839 -19341 -28048 -72513 -219331 -201120 -76998 -8876 -43632 -55433
14634 -55433 -37692 -42118 -148227 -161467 -115553 -49837 -1303 -12887 2162 -67154 -93026 19198
14622 19198 17621 -35680 -43052 3378 -7105 -24413 68141 40900 6459 96445 222145 217317
14610 217317 178011 156838 133394 111083 21127 29167 32997 -68717 -72537 10283 -52 21006
14598B1006q447m682l3683p9881L5435q561K7476O0181m176p62l8575l8630N566
14585f7733m7564K0864K0478m6576m8031J30827J0902O411K7636o0490J4905N7261
14573A8890K9270p2239l6008l9617J1054M9332r6468M2989P540o7215R4620Q1206
14561B3354j3745J3064M1211N4262k9973j28588Q4027N9505o1804j84164L0934
14550a11917O4863k638P2005k4277n3974n2730Q5359J2396J9353o1319j18385
14539a71264L5855N9418J08138J11776l6278j23487q5315j8912J28684M7599o9141
14528a2927k9809L963j10345j83539o0932R8710Q8556M5942J6345O3797O0820
14517a9419P992R0069l3090k1739n3980n8075k089m5419P9326Q51j03154r4029
$$ plain form
14598 21006 12559 7877 -25806 -105687 -70252 -78813 -51337 8844 4668 3906 -34669 -73299 -67733
14585 -67733 -115297 -94433 -73955 -120531 -168562 -37735 -26833 -20422 7214 -53276 -38371 18890
14573 18890 48160 -24079 -60087 -99704 -88650 -39318 -135786 -92797 -85257 -152472 -57852 23354
14561 23354 9609 22673 63884 118146 88173 -40415 43612 103117 41313 -142851 -111917
14550 -111917 -47054 -49692 22313 -1964 -55938 -108668 -23309 -10913 8440 -52879 -171264
14539 -171264 -135409 -75991 32147 143923 107645 -15842 -101157 -120069 8615 56214 -12927
14528 -12927 -42736 -38773 -149118 -332657 -393589 -294879 -206323 -160381 -144036 -80239 -19419
14517 -19419 -11427 78642 45552 23813 -30167 -88242 -90331 -135750 -56424 -55573 -158727 -252756
14505b52756P8874J76639J2670l0762L7454R154J4593J33717r2548q8493n161
14494f619k5309J0450J59958K2019j25836p9873J8547n192L1432k5929q8649R1501
14482b3500R0803n2812o6330l8501n4637K3948Q5009J52799l3459q7001M9951
14471D6270M5230m1304l8601k2335R0889L9741K6928q1837j08372o3502L9581
14460f7312N853L4445q6587o6604R2921L3447P5174K9998p1738K8646K6840o3997
14448b8914K5962o2148o3601n3016L0400R0772J0461n5755p8101l9979o9454r5943
14436c89316O6971R5796K01468J78454M6162o7651p5653n8274J06016Q7526p8014
14425A13485o8277j9288k4195r9482N6381m179l3094l2871k3145Q8939Q4884R6042
$$ plain form
14505 -252756 -173882 2757 15427 -15335 22119 31273 45866 179583 87035 -1458 -6619
14494 -6619 -31928 -21478 138480 160499 34663 -45210 -26663 -31855 -423 -26352 -115001 -23500
14482 -23500 67303 14491 -51839 -90340 -144977 -121029 -36020 116779 83320 -3681 46270
14471 46270 91500 50196 11595 -10740 80149 119890 146818 64981 -43391 -106893 -67312
14460 -67312 -61459 -27014 -113601 -180205 -87284 -53837 21337 51335 -20403 8243 35083 -28914
14448 -28914 -2952 -65100 -128701 -181717 -151317 -60545 -50084 -105839 -183940 -223919 -293373 -389316
14436 -389316 -322345 -226549 -25081 153373 199535 131884 56231 -2043 103973 191499 113485
14425 113485 45208 25920 1725 -97757 -41376 -45555 -78649 -111520 -134665 -45726 39158 135200
14413A35200P3356m8861r4773O7056q4677Q0649M755N6874N6507n9363j27461
14402E9262j51779O2133L6930N0252N6116P887K9857J0885j84357J766J43707
14391A22659K0027N7890n1930K8454K064L0944k6853k6780Q5807r1965r3396m5129
14379A1792P4824m1118J9547j5149J6843n4125n6762k4248M7257P3649o410m2232
14367C868J79683l0276r9656K840M1583M529n8211N5951L5233p4679l1031l2565
14355b731q183l8069p0128m3120o9271n511J60528J38034k1622K0825J00747K4690
14343A86189j0179j189q9245J8485j15202j88063K9398M5362P7587O2855J6225
14332C2223j0920m0859q2896J7625J11291K5717O3331L1724K2588K0715o2673
$$ plain form
14413 135200 208556 159695 64922 131978 47301 127950 132705 189579 246086 186723 59262
14402 59262 -92517 -30384 6546 56798 112914 120801 150658 161543 -22814 -21048 122659
14391 122659 142686 200576 148646 177100 179164 210108 183255 156475 242282 150317 56921 11792
14379 11792 86616 45498 65045 49896 66739 12614 -44148 -68396 -21139 52510 46100 3868
14367 3868 183551 153275 53619 56459 98042 102571 44360 100311 135544 60865 29834 -2731
14355 -2731 -10914 -48983 -119111 -162231 -231502 -237013 -76485 61549 39927 60752 161499 186189
14343 186189 176010 174821 85576 104061 -11141 -199204 -169806 -124444 -46857 15998 32223
14332 32223 21303 -19556 -102452 -84827 26464 52181 115512 147236 169824 190539 127866
14321A27866o7751k5564j9388O663Q0032n0154p5475j61102k3529J8765n0057
14310b39694M4579O6004L4092K0942j8599r5617j6625J08248M8877J02173k0437
14299C3943P934j6943n7616m3509L0790O39n9492j5780O1973O2169M3169j3806
14287C3471j14603l7854L1987M5674m7231q7114J13165J39372J7634M117j9760
14276G8858n4458l0490j52729j74848J86164J52043l9497p1928L9141N0699N5800
14265C8755m1944j20387L4936J9839j0127M2183n6313l7082R895K7783J1173k5880
14253a07169K2300N1874M179L9429M2179m4741J8103r061K31R3341J17437q7045
14241A41057j1104r6351k1199Q5442q6565K2804l2631o0820J2856J2610M5694
$$ plain form
14321 127866 60115 34551 15163 21826 101858 51704 -23771 -184873 -208402 -189637 -239694
14310 -239694 -195115 -129111 -95019 -74077 -92676 -188293 -204918 -96670 -47793 54380 33943
14299 33943 41877 24934 -32682 -76191 -45401 -44762 -104254 -120034 -58061 4108 47277 33471
14287 33471 -81132 -118986 -86999 -41325 -88556 -175670 -62505 76867 94501 98618 78858
14276 78858 24400 -6090 -158819 -333667 -147503 4540 -34957 -106885 -67744 -17045 38755
14265 38755 -3189 -123576 -88640 -68801 -78928 -36745 -93058 -130140 -120245 -92462 -81289 -107169
14253 -107169 -84869 -32995 -28816 10613 52792 8051 26154 17093 17324 110665 228102 141057
14241 141057 129953 33602 12403 97845 11280 34084 1453 -59367 -46511 -33901 11793
14230A1793J39588M0670q2048j03209p6600K771J5046l7289l6959O4851P4310
14219A2924R4857M3215n2476p0657j11893N1030J06107O2251k0737K8181M9510
14208A92312m0444r1629j33558L4313J01526N1342j04124l4162p2433N2582O9773
14197B5498K4928J0321m1949k2605O4n693O0402L0734J8562P8220k7871o0441
14185I0170q8753L4657n162p8051k3991K8298R4549K1114m4591M082o6131n8298
14173i2107J01453m2625l343m3603r5231K5726J31832J24563J7902l7609k1803
14162F5155J0413o568j06413O4935Q9786L4140k6186p4193M7865N7789j16784
14151C9939k6430k2131l4430m1589K6426J35097R8332J740j0461j51150q5577
$$ plain form
14230 11793 151381 192051 110003 6794 -69806 -67035 -51989 -89278 -126237 -61386 12924
14219 12924 107781 150996 98520 27863 -84030 -33000 73107 135358 114621 142802 192312
14208 192312 151868 60239 -73319 -39006 62520 113862 9738 -24424 -96857 -44275 25498
14197 25498 50426 60747 18798 -3807 -3743 -9436 50966 81700 100262 178482 150611 90170
14185 90170 1417 36074 30912 -47139 -71130 -42832 51717 72831 28240 32322 -33809 -92107
14173 -92107 9346 -33279 -36622 -80225 -175456 -149730 -17898 106665 124567 86958 65155
14162 65155 75568 69000 -37413 27522 117308 151448 125262 51069 98934 156723 39939
14151 39939 13509 -8622 -43052 -84641 -58215 76882 175214 176954 166493 15343 -70234
14140g0234j822N5981j473J10743M7562O0393o4778j31407j3200P0119O1208o0633
14128F2459j12569j50129O4465M4437K1324O9401M9018l4756n0223J3599L9566
14117A6592j07860o8323m5200n596J81223O7405R289q708j6494k765n3913l9974
14105g4324j08928k2179L6141P6918N9554o0333J5274M8094K5237J0402n879k4722
14093b4745M3939j5863j9706N8223o4656r9685j4154J34270J00352J44311O6063
14082C08349j41923j25404p4131j1160j5238l9567L6822l3591O4724P9697l4523
14071A4055R9236M1395k8529q7801p4935J1746n943o0251j7432k9830n755Q893
14059a35151K3322j2894L8649K9950K5076J4354r0031n9437N4022L4094o3685
$$ plain form
14140 -70234 -72056 -16075 -17548 93195 140757 201150 136372 4965 -8235 61884 123092 62459
14128 62459 -50110 -200239 -135774 -91337 -70013 -612 48406 13650 -36573 -22974 16592
14117 16592 -91268 -159591 -204791 -210387 -29164 38241 47530 38822 22328 19563 -34350 -74324
14105 -74324 -183252 -205431 -169290 -92372 -32818 -93151 -77877 -29783 -4546 5856 -23 -24745
14093 -24745 19194 3331 -16375 41848 -22808 -122493 -136647 -2377 97975 242286 308349
14082 308349 166426 41022 -33109 -44269 -59507 -99074 -62252 -95843 -31119 48578 14055
14071 14055 113291 154686 126157 38356 -36579 -24833 -30776 -91027 -108459 -138289 -144044 -135151
14059 -135151 -111829 -124723 -86074 -56124 -31048 -16694 -106725 -166162 -112140 -78046 -141731
14048a41731k6545p509N7833N5832O172o4119o677p380Q0899j3387m8110J08240
14036f482O4944j4879j4934m317m3297l5148J8080K2434J1389m0265K8133O654
14024g688o0623M7302K2655R496K3633P5994J19676J0326j45509j34746P5368
14013C5884J47879k887q8677m8726l0267l0599Q5370L4773k1571o2888m1186J35241
14001A12346j173k3321m82m1309n2487J37070J03845j30532r1980J5382k9936
13990b577l6209p9358k2315O0072L0194J23004l629K8320n2779j09125j23590
13979a87992n0979J186p677N2727M7629J20626R706L1889K1886P5327M7237q5234
13967G6331n1458j1431l4286j05882K9401J4653K851k6091n1475m2906J05814
$$ plain form
14048 -141731 -168276 -175785 -117952 -62120 -55948 -120067 -126744 -134124 -53225 -66612 -114722 -6482
14036 -6482 58462 43583 28649 24332 -18965 -54113 -36033 -13599 -2210 -42475 -14342 -7688
14024 -7688 -68311 -21009 1646 11142 34775 110769 230445 240771 95262 -39484 35884
14013 35884 183763 180876 92199 43473 13206 -17393 67977 102750 81179 18291 -22895 112346
14001 112346 111173 87852 87370 46061 -6426 130644 234489 103957 11977 27359 -2577
13990 -2577 -38786 -118144 -140459 -80387 -50193 72811 69182 97502 44723 -64402 -187992
13979 -187992 -238971 -237785 -245462 -192735 -145106 -24480 -14774 17115 39001 114328 161565 76331
13967 76331 24873 13442 -20844 -126726 -97325 -82672 -79821 -105912 -157387 -200293 -94479
13956i4479R138L7698J7455m3456m9805r105J29151K8108l6746l9933l0980m8750
13944a31704M8282q2150Q428J16957k2585M3054O7842J0734O9258l4411k7896
13933F5809l6708m274l8869J06894L4420N9226l7562o0480j67661j02989J43665
13922c8529L5324j3326J16053M032j6913o429l4389k6982K8592R9704L6548p0130
13910A13555j72526j4722J45072N9522j4319k013p9501n011p9291m2646q6300
13899a78180K8659Q5677L475R3661N4602m6008k2676L9167J2481j13740q4907
13888a27789o715P2810k8038o1659J4146j1049N0406N3635j1353o7829j28931
13877b52366J5463R5129L1552N3381R0466K3068j31374n2968N3733R7251R1739
$$ plain form
13956 -94479 -85341 -47643 -30188 -73644 -123449 -132554 -3403 24705 -12041 -51974 -82954 -131704
13944 -131704 -83422 -165572 -157144 -40187 -62772 -19718 48124 58858 128116 93705 65809
13933 65809 29101 24827 -14042 92852 127272 186498 148936 88456 -79205 -182194 -38529
13922 -38529 -3205 -16531 99522 103554 86641 80212 45823 18841 47433 147137 183685 113555
13910 113555 -58971 -73693 71379 130901 116582 114569 35068 30057 -49234 -91880 -178180
13899 -178180 -149521 -63844 -60369 33292 87894 41886 19210 58377 70858 -42882 -127789
13888 -127789 -134504 -61694 -89732 -151391 -137245 -148294 -97888 -44253 -55606 -123435 -252366
13877 -252366 -236903 -141774 -110222 -56841 33625 56693 -74681 -127649 -73916 23335 115074
13866A15074q5054j48426o7490O4080N8880j25953p359J4823K8039j7447O0484
13855a10349R3124R1993L996q9780J3519m0252o8427n367Q3821J09946O4198m823
13843A41599j31158l7562l9901n8682p6659m3358p21N0949J5077L5891O3883J0873
13831f9769K0966P7639N8731k8647r1511O873L0094j0940n7225J4637M4750k3151
13819b7553J0906p4576k2541K9735M7295N201j6134j47088j8848J0975j4018L114
13807b13532j3123k2784N5451M5331K2294J3541J9151L6935l3274J4859l1049
13796a06200N7476M8423p8280o9763L6320K6953j0615J6729R5504p78j17056l1073
13784a32360P3237q377L3250N656o1638k3182j2075r199N4160j6253Q903J12056
$$ plain form
13866 115074 30020 -118406 -185896 -121816 -62936 -188889 -196248 -181425 -153386 -170833 -110349
13855 -110349 -17225 74768 78764 -11016 2503 -37749 -106176 -111543 -27722 82224 146422 141599
13843 141599 10441 -27121 -67022 -125704 -202363 -245721 -246442 -195493 -180416 -144525 -80642 -69769
13831 -69769 -48803 28836 87567 58920 -32591 -25718 4376 -6564 -63789 -49152 -4402 -27553
13819 -27553 -16647 -91223 -113764 -84029 -36734 -31533 -47667 -194755 -213603 -202628 -216646 -213532
13807 -213532 -226655 -249439 -193988 -148657 -126363 -112822 -93671 -56736 -90010 -75151 -106200
13796 -106200 -48724 -301 -78581 -148344 -112024 -85071 -95686 -78957 16547 15769 -101287 -132360
13784 -132360 -59123 -67500 -34250 -28594 -90232 -113414 -125489 -134688 -80528 -96781 -87878 24178
13772B4178J210N9013J6581j18120j09585O0312O2507p1679J042r132j00274K7185
13760a56762K1045m5847J3690M9620m7478Q353J10277j9051p9843n6758m6757
13749b49511N4566Q3235J7029O1393Q0524K2272k0300Q1065P900n0074n9588l4000
13737e489J7202k8252j62868J3232J15852J17425l4801j18796K3018P2709O2817
13726G2049o0840j10051k3113m0893P6525J1350J229P52P1135J9038n4079P5262
13714C8364L8975j7279J17821K0048p2643j21238N815N8282k3799o359m2075K5937
13702B1849P2741o1082K0713p984o7903o0893Q367j5407r716R4445J18285o3528
13690D9887L6614j35k16103q3764n6284O4379R7849J05201J0569J69434N6212
$$ plain form
13772 24178 25388 84401 100982 -17138 -126723 -66411 -3904 -75583 -74541 -83673 -183947 -156762
13760 -156762 -135717 -181564 -167874 -118254 -165732 -157379 -47102 -66153 -145996 -202754 -249511
13749 -249511 -194945 -111710 -94681 -33288 47236 69508 49208 130273 138173 88099 28511 -5489
13737 -5489 11713 -16539 -179407 -166175 -50323 67102 32301 -86495 -63477 9232 72049
13726 72049 11209 -98842 -121955 -162848 -86323 -74973 -73744 -72992 -1857 17181 -36898 38364
13714 38364 77339 60060 177881 197929 125286 4048 9863 68145 44346 37987 -4088 21849
13702 21849 94590 33508 54221 46237 -21666 -82559 -74192 -89599 -99315 -4870 113415 49887
13690 49887 86501 86366 -129737 -213501 -269785 -205406 -107557 -2356 8213 177647 233859
13679B33859p3027J3653l0753p0918n6116M3282L1877j0569l2294J1503L0422
13668I0919N7333j20932j0829K0338r3368O264J6945j8405l125j5671j2284J07030
13656B4215L476J5186P1533m0566L2384r4024m2601n0564O6492l0632Q5302O4885
13644A05086L6993k1529j06661J7924M7602K5531M35l9282j21165o9765P6410
13633d8421J23382Q1759K8798j22008k11543j04269M5479L6761J55653M3874o188
13622B3277K3062l3190n1667J6486O9876M9347k829J3292k360J4133p4821o0947
13610a6341K4403P41j0090N7558L3273o9911k2751K6907L2864N6489P2523j16081
13598F9584j25826P8619k6920m4149J27097K077m8250N2584L5368j9173j25753
$$ plain form
13679 233859 160832 174485 143732 72814 16698 59980 91857 81288 48994 60497 90919
13668 90919 148252 27320 16491 36829 -56539 -50275 -33330 -51735 -54860 -70531 -82815 24215
13656 24215 27691 42877 114410 73844 106228 12204 -30397 -80961 -14469 -45101 40201 105086
13644 105086 142079 120550 13889 31813 79415 104946 105381 66099 -55066 -124831 -48421
13633 -48421 74961 156720 185518 63510 -148033 -252302 -206823 -170062 -14409 29465 23277
13622 23277 46339 13149 -38518 -22032 47844 97191 94362 107654 105294 119427 44606 -16341
13610 -16341 8062 8803 -1287 56271 89544 19633 -3118 23789 56653 113142 185665 69584
13598 69584 -56242 22377 -4543 -48692 78405 80482 32232 84816 120184 101011 -24742
13587b4742p1557P851K4647j7774n9923l4082n2482J3538J17858k1371Q474j0398
13575a19961R5566k7305L4298M6659L6465k9426N7549k4785j33793q9294J6629
13564a37398N0157J3820Q2367J3429l5096J00137L3521N5681K0610q9748q1123
13553B6357j01587o8540k9464J6118R1308O8719N2790l1277m6723N613O0732R6881
13541A40927o0531J3455J1663m7076l808j26485N6674l6444J6093n2273M0047
13530d7758N3590k6007K8641k115J2587k4m5044n3160l2622M901o688L2652J23939
13517D2892O6247j9362M2339K3619K2499Q01r556l0023j08302m3596m6900N0440
13505h902j1225k3948K7195r8403N77L5783M9028j9402p1772N9653p5718N6496
$$ plain form
13587 -24742 -96299 -88448 -63801 -81575 -141498 -175580 -228062 -214524 -96666 -118037 -109563 -119961
13575 -119961 -24395 -51700 -17402 29257 65722 36296 93845 69060 -64733 -154027 -137398
13564 -137398 -87241 -73421 8946 22375 -12721 87416 120937 176618 197228 107480 26357
13553 26357 -75230 -143770 -173234 -157116 -65808 2911 55701 24424 -22299 -16686 44046 140927
13541 140927 80396 93851 105514 58438 54630 -71855 -15181 -51625 -35532 -87805 -47758
13530 -47758 5832 -20175 8466 6351 18938 18914 -26130 -79290 -111912 -107011 -113699 -81047 42892
13517 42892 109139 89777 132116 155735 178234 179035 169479 139456 31154 -12442 -59342 -8902
13505 -8902 -20127 -44075 -16880 -115283 -114706 -78923 -29895 -49297 -121069 -61416 -137134 -80638
13493h0638Q0209p5248N2532Q3732N2010r0533j27726l2664L1464R0427J2144
13482d291j47583r4905N7634L4824M7295N9986Q8009m8204K9218o5159j5521j3389
13470g2086m4804q9507l3590J17310J29963P172n7180j4475m5197K3414m976j9820
13458a03776O4707O8988J5940J8554m9298j840m7173j00466Q3904R9946P0310
13447A19796K7011K1455Q6542m4755j24096l698L0022m1786P2674L4788o4200
13436A13753K9054q7714j15400o3960M4498L3352L7273J9885l2571n7719j3689
13425i3238l7501J31056Q8952n4707L3350Q2392n3407p4262J9895P0458n7771
13414E5217j07897l9786j8990N3979Q6420O482m4383r8900q7057M2525N676j27934
$$ plain form
13493 -80638 -429 -75677 -23145 60587 112597 22064 -105662 -138326 -106862 -16435 -4291
13482 -4291 -151874 -246779 -189145 -154321 -107026 -47040 40969 -7235 21983 -43176 -58697 -72086
13470 -72086 -116890 -206397 -239987 -122677 7286 14458 -42722 -57197 -102394 -78980 -83956 -103776
13458 -103776 -39069 29919 45859 64413 15115 13275 -33898 -134364 -50460 49486 119796
13447 119796 146807 168262 254804 210049 85953 82255 112277 70491 143165 177953 113753
13436 113753 142807 55093 -60307 -124267 -79769 -46417 -9144 10741 -21830 -79549 -93238
13425 -93238 -130739 317 89269 34562 67912 150304 96897 22635 42530 112988 55217
13414 55217 -52680 -92466 -111456 -57477 28943 35425 -8958 -107858 -194915 -152390 -146714 -274648
13402b74648L5526N1950O4351J44005Q4304O2739j4504o2333P210K462j0103K2577
13390A13536Q744l7199j70135L512O3216M5644M8071L2791J03469M541r4469j22084
13378c63p6106M0076j8704j04608n117j5406K7653L7431M4727O1585Q622l2156
13366c2366L225Q6083l3965J0875O092p466L2093N0488q7219n2472Q6710o5860
13354c782j2489J0539J3640j11176j6667J39911j2644q2967K443j0664o6627j2673
13342a63156O6885k3011q1929j6529K01364R2819n6439p1178N379m1699p4669
13331a62163P1543M0713p1493J00680L0179m5982o0001O9500K8602R5749m9131
13320D8196j7583R6236L1425N5444L8677j28739q9617m6688L6917m314Q7945n7558
$$ plain form
13402 -274648 -239122 -187172 -122821 21184 105488 168227 153723 91390 98600 101062 90959 113536
13390 113536 122280 85081 -85054 -81542 -18326 27318 75389 108180 211649 216190 121721 -363
13378 -363 -76469 -36393 -55097 -159705 -164822 -180228 -152575 -115144 -70417 -8832 -210 -32366
13366 -32366 -29141 56942 22977 33852 39944 32478 64571 115059 27840 -24632 62078 -3782
13354 -3782 -16271 -5732 7908 -103268 -119935 19976 7332 -75635 -73192 -83856 -150483 -163156
13342 -163156 -96271 -119282 -201211 -217740 -16376 76443 20004 -51174 -45795 -87494 -162163
13331 -162163 -90620 -49907 -121400 -20720 9459 -36523 -96524 -27024 1578 97327 48196
13320 48196 30613 126849 158274 213718 252395 123656 34039 -12649 24268 19954 107899 50341
13308E0341r6424j0079N6744j2998j3593R1872L412j0618p6247q6959o4934o314
13296a75797r678M4444J72656N9063n1772r4588j5979N6237O594n4264K5269l0144
13284f7959k7231J28054L9883J5611P4205J3954j02076j7656N4354j3357n4316
13273D3466j4965l5695n2922j407n9251K1668R0448j36950P3911J5977n4692O6235
13261d4177J3345q942m5667k0854n6187l6886n3323P3004N8934N4801j8313l8637
13249a22902n3203R6021k521M6181m832k2016n4891Q0953J89101m4547k5406K9277
13237A11215k4615o9521m3538M0802J14298M4114l9542r5071n7782j4248m2958
13226g6846k8855l0188L0282J90493P2447r3707q3780j6157Q114O395N7703K5756
$$ plain form
13308 50341 -46083 -56162 582 -12416 -26009 65863 69275 58657 -17590 -104549 -169483 -175797
13296 -175797 -185475 -141031 31625 90688 38916 -55672 -71651 -15414 -8820 -63084 -37815 -67959
13284 -67959 -95190 32864 72747 88358 162563 176517 74441 56785 111139 97782 43466
13273 43466 28501 -7194 -60116 -61523 -120774 -99106 -8658 -145608 -71697 -55720 -110412 -44177
13261 -44177 -30832 -39774 -85441 -106295 -162482 -199368 -252691 -179687 -120753 -65952 -84265 -122902
13249 -122902 -176105 -80084 -82605 -36424 -41256 -63272 -118163 -37210 151891 107344 81938 111215
13237 111215 86600 17079 -26459 14343 128641 172755 133213 38142 -19640 -33888 -76846
13226 -76846 -105701 -135889 -105607 84886 157333 63626 -20154 -36311 -28197 -21802 35901 61657
13214F1657N1673M025L3990Q8617N1732j20271p9732j35941j2219J76868m131
13203A16268p7790P3665l3004k7025L3783R6533N450j2006l6454q3515r3805j11073
13191a48973K5671j6642M841k8440Q8690J33958N2788M10l596L6642j7613l8679
13179H9057q5876O5581j7329j10249N4029j7410j0254m8341k7251q1140k2573
13168b11756J01668M2350j424K8601N5517M3127J01335M5458k4322p4035j12095
13157e576k8412M1622k5556p7224P1979J24161O7626N9725p0576j99455j32077
13146a73763j6776J27662M6357j4054K5296N362K4139L9787K4274O9689P213o5563
13134I9623m24j26912J2107J72597j5304k7128j53903o0217J8761r199m4609l3159
$$ plain form
13214 61657 113330 117355 151345 239962 291694 171423 91691 -44250 -56469 120399 116268
13203 116268 38478 112143 79139 52114 85897 182430 187880 175874 139420 55905 -37900 -148973
13191 -148973 -123302 -139944 -135103 -163543 -74853 59105 111893 112303 108707 145349 127736 89057
13179 89057 3181 68762 51433 -58816 -4787 -22197 -32451 -80792 -108043 -189183 -211756
13168 -211756 -110088 -67738 -69162 -40561 14956 58083 159418 204876 180554 106519 -5576
13157 -5576 -33988 7634 -17922 -95146 -23167 100994 168620 228345 157769 -41686 -173763
13146 -173763 -190539 -62877 -16520 -30574 -5278 84 24223 64010 88284 157973 165186 99623
13134 99623 99199 -27713 -15606 156991 141687 114559 -39344 -99561 -80800 -89999 -134608 -167767
13122a67767Q5347J41385m8480N1988L1526j39293n3849M3983j0440N191q6530
13111a46939o845O9372M9262J14457q2881k723P692j4336L5464N7468N2816J5498
13099A48305l7885j46679L8274L0116L3011n7229j31861k6150R0284J00218q477
13088C1927K5443M0754l5869L7369J00081K1012j6591j07864k10443n7801R8836
13077g3146J46534P0179m0385j42536k5913Q5979L5031K4422l3826l2844n431
13066H064P150n3207m4360m9570j371P2685m6345j0920K3868O7251M1641M5147
13054F0033O6090L435L0702J04007l5013q3216n1913P197l488j27122j42002k7532
13042a98822m3612O6811J13034O0250J456R5908K5101m4351j4814j1178n9120
$$ plain form
13122 -167767 -82420 58965 10485 62473 93999 -45294 -99143 -55160 -65600 -60409 -146939
13111 -146939 -153784 -84412 -35150 79307 -3574 -6297 1395 -12941 22523 79991 132807 148305
13099 148305 110420 -36259 2015 32131 65142 7913 -123948 -150098 -59814 40404 31927
13088 31927 57370 98124 62255 99624 199705 220717 204126 96262 -114181 -171982 -73146
13077 -73146 73388 143567 103182 -39354 -65267 20712 55743 80165 46339 13495 8064
13066 8064 15214 -37993 -82353 -131923 -133294 -60609 -106954 -117874 -94006 -26755 14886 60033
13054 60033 126123 129558 160260 264267 229254 146038 94125 101322 97834 -29288 -171290 -198822
13042 -198822 -242434 -175623 -62589 -2339 -883 95025 120126 75775 60961 49783 -9337
13031i337Q1970M0167O1217N4346J59339j2631j56375r1258N8623R9045l3382
13020B51724o5030o1736L6744l6665j38751m2034k553j5507j5048m3789q7297
13009b19942j31825R6546K00184J68432k6713q5087o8643M8332k3177p2373j1208
12998a25474q653o4750P7329P0204k0733k4596J3235K1137L074N0842j7077K8933
12986C471J07790N6580L581M5462m47J1876j04818j59668l4710K758J07421L8826
12974G8122l4746j38478k206O2089N9966P1260l2260j01380P375M1434N1003L9133
12962A01312p814M7645j7069l7033j49241j9178l4279L914j4215O5517p4156N1892
12950h2705J59277J52289n4803o7317m248K7869l6286l1158n1094j6796k3024
$$ plain form
13031 -9337 72633 112800 174017 228363 387702 375071 218696 127438 186061 285106 251724
13020 251724 186694 124958 161702 125037 -13714 -55748 -58301 -73808 -88856 -132645 -219942
13009 -219942 -351767 -255221 -55037 113395 86682 1595 -67048 -18716 -41893 -114266 -125474
12998 -125474 -134127 -198877 -121548 -51344 -72077 -96673 -83438 -62301 -59227 -8385 -25462 3471
12986 3471 111261 167841 171422 216884 216437 228313 123495 -36173 -70883 -68125 39296 78122
12974 78122 43376 -95102 -97308 -35219 24747 96007 63747 -37633 -30258 11176 62179 101312
12962 101312 93498 141143 124074 87041 -62200 -81378 -115657 -111743 -125958 -60441 -134597 -82705
12950 -82705 76572 228861 174058 106741 102493 130362 94076 62918 11824 -4972 -27996
12939b7996o2854j23530J14010J33654P5584k259j11088K783M1860J17855K6934
12928A84953n3107k5198j3606N9578J6615n1007o3148m056Q376P7630o7250j028
12916F8752l0770N5721j8918p3915J6561k4843k2859M1987P9687p551m9286p1021
12904c6455P3557p81j04763K6329R0097j54O9831P0576q1497N1170N3966q3917
12892A27959j92548m3513J48095N5452m4156n8640q4395p1031n469J21895M0003
12881f348J02124n0573R761K0428N0185Q1698j9245l0045q7816M965l5876J7336
12869E6594j9952J3523j4431p169K481L525m2881q1152r6344O8409N5567k9609
12857i1439o909R5290R3592r223j7288k4499L2226P109M7758k6908J9757k4116
$$ plain form
12939 -27996 -90850 -214380 -100370 33284 108868 106609 -4479 -1696 40164 158019 184953
12928 184953 131846 106648 93042 152620 169235 118228 55080 51024 59400 137030 69780 68752
12916 68752 37982 93703 74785 870 17431 -7412 -30271 11716 91403 83852 34566 -36455
12904 -36455 37102 36321 -68442 -42113 47984 47830 117661 188237 106740 157910 211876 127959
12892 127959 -64589 -108102 39993 95445 51289 -7351 -91746 -162777 -168246 -46351 -6348
12881 -6348 95776 45203 54964 75392 125577 207275 188030 157985 70169 75134 39258 56594
12869 56594 36642 50165 35734 28565 31046 34571 -8310 -89462 -185806 -117397 -61830 -91439
12857 -91439 -98348 -3058 90534 81311 64023 39524 71750 78859 126617 99709 119466 95350
12845I5350j48371m0457p3341k2173M9508M0582M5683K5955J09175k0137j00756
12834c8982n4295J04395M725l0315J923K05814N5042o7497q3140o2117p775N9434
12822H7212l1134j42057M9138M9092j1400K6566j0248j7381K7564j1799m983N9722
12810G0292K915O4347J00696j02024j25728L418O608o0768R0906L8373o8938L7992
12798E8089k6979K8080k4039L7403J2849l4246k0268J4115l2434m7297R364L2956
12786G593J49096K0637K7059p7074n4767P4437L614l428O3166p9803M2987N6246
12774B29763p3961p6880R940Q2419O4598K5628l3926n4635q2027p7300o0637n5294
12762a02312O484n2867O6908J43891K09474q8513j05850o0176k420Q947J13339
$$ plain form
12845 95350 -53021 -93478 -166819 -188992 -139484 -98902 -53219 -27264 81911 61774 -38982
12834 -38982 -93277 11118 15843 -14472 -12549 193265 248307 180810 97670 35553 27778 87212
12822 87212 56078 -85979 -36841 12251 851 27417 17169 -212 27352 15553 10570 70292
12810 70292 73207 137554 238250 136226 10498 13916 20524 -40244 50662 89035 20097 58089
12798 58089 31110 59190 35151 72554 85403 51157 30889 45004 12570 -34727 -25363 7593
12786 7593 156689 177326 204385 127311 72544 146981 150595 147167 210333 130530 173517 229763
12774 229763 155802 78922 88862 171281 235879 261507 227581 172946 90919 13619 -47018 -102312
12762 -102312 -95828 -148695 -81787 62104 271578 183065 77215 17039 14619 23566 136905
12751A36905J8415r7995l2768P6823J31227r219l3871K3699k0132Q9509N5835
12740C38428l6981k56018l2429O1790k0308P5751m069j20250r2628N3700M8402
12729A5388j4911q125k7958j5641J01749J07503L2318l916j6346p3374k6069N7901
12717A28519p1754o7727O696J36512Q3448m0212o4712l5819j7946O6095J8631
12706A41731k1771N1692o222p2209L4727O3817j9014J4572J01477J11636j97709
12695B02727j77447N9363j4045o7746m7624J11481K0190K0536q6823j7343O0602
12684F3871N5061O3936J5651j0606J06584n4405o8811O897M2868M7037m9121k5206
12672A93756j51984n3430K7012m4858l551J13458r750k1917l469m006l4660J1913
$$ plain form
12751 136905 155320 57325 24557 101380 232607 223388 189517 213216 193084 282593 338428
12740 338428 301447 45429 13000 74790 54482 130233 126164 5914 -86714 -33014 15388
12729 15388 477 -7648 -35606 -51247 50502 158005 190323 186407 170061 96687 70618 128519
12717 128519 56765 -10962 -4266 132246 215694 175482 110770 74951 57005 123100 141731
12706 141731 119960 171652 165430 93221 127948 191765 172751 187323 288800 400436 202727
12695 202727 25280 84643 70598 2852 -44772 66709 86899 107435 20612 3269 63871
12684 63871 118932 182868 198519 187913 294497 240092 171281 178178 221046 268083 218962 193756
12672 193756 41772 -11658 15354 -29504 -33055 80403 70653 48736 45267 41261 6601 18514
12660A8514O4014Q1518O885r380m0663p5472k2171N3945K4697j994M2076o2237
12648G9732p4396o576M6928J21131K3640L728q4958L315r363j05209m4097J30516
12636H4391Q7427q4407j1199j8890l8503k2004l8342N1333P077P1546J4732k424
12624A00737j29394l0314J60711J10526N6210O395m6136j29195K3521M4839P1903
12613B39803N7179j04895L0200O6938p9377j47038q031J8046L1284P1277P1214
12602B46600q093k7968M5092o2030q9354j3455l3195L7904k5357p0604M259K2294
12590B6093N0708n3012r0352N9389O4157o4Q7456K2109o9709n8615P0251K1172
12578A29583J04745J5858m7339n3410J5523K2271Q3704m900j1692J00222j9256
$$ plain form
12660 18514 82528 164046 170931 161551 120888 45416 23245 77190 101887 99893 141969 79732
12648 79732 5336 -1240 45688 166819 190459 194187 109229 112544 103181 -2028 -46125 84391
12636 84391 171818 87411 76212 57322 18819 -3185 -41527 9806 16883 88429 103161 100737
12624 100737 -28657 -58971 101740 212266 268476 274871 228735 99540 123061 167900 239803
12613 239803 296982 192087 222287 289225 209848 62810 54779 72825 104109 175386 246600
12602 246600 238507 210539 255631 193601 104247 90792 57597 95501 70144 -460 3799 26093
12590 26093 76801 23789 -66563 -7174 56983 56919 144375 166484 96775 38160 108411 129583
12578 129583 234328 250186 202847 149437 164960 187231 270935 266035 254343 354565 335309
12567C35309j23048q1996J5140L649l4151j5370J36192J1372l8174M8596P5613
12556C33132O6550l6347q9458n1421l2152K3611O6420l8974M235Q119n7078l5888
12544A60749l3655o1109n380J71975J5565j2444R764n459n405q9862n9073P9785
12532A65451k9477m0315k9835O1689L1511l8460j4479m2175q4108K9385M2103
12521E1290q504n7502n6806P4516J42053L5018o7657n2248J03924J04474N4564
12510C23122k0370j03928r2217p806n9973J3246P6346J07176J05522j1238l0630
12499B99250j56619o1509p0222J0129Q0493N8146J8316P5979j4106q8486n1791
12488I9580m9318q575J26161M7072j00512L863J12563J4532n1454P291r4738J5129
$$ plain form
12567 335309 212261 130265 145405 149054 114903 99533 235725 247097 208923 257519 333132
12556 333132 399682 363335 273877 222456 190304 213915 280335 241361 245596 253715 196637 160749
12544 160749 127094 65985 60605 232580 248145 235701 245465 240006 234601 144739 85666 165451
12532 165451 135974 95659 65824 127513 159024 120564 106085 63910 -20198 9187 51290
12521 51290 42786 -14716 -71522 2994 145047 180065 112408 60160 164084 268558 323122
12510 323122 302752 198824 106607 98801 38828 52074 128420 235596 341118 329880 299250
12499 299250 142631 81122 10900 21029 101522 159668 177984 253963 239857 151371 99580
12488 99580 50262 41687 167848 214920 114408 118271 230834 245366 193912 201203 106465 121594
12476A21594J02748O2913j3911n5740o1142k0871l6693J05308J42424m2961j46661
12465A57008q3925O1573J10904L3715J5486j3793n8702l3605p593M9536O2958
12454B93562P3404q8902q2879m5869J7970R1789Q063n2593L5691J00463r8569
12443B52130j3714J5038L1609r6315j3829M1947Q0126J15148p1496j92837p1495
12432G6312k2894Q7717J16504J9426P9678k3521n3266L8639N3654O8855k2207
12421D18897j38243m8175N3274K8195p4638l6152l9856l702O9290M2785J7571
12410B89246N7547p502k8472n612J6040M6337j4506O5375N5985J5134j05309q923
12398C75340l4608n1867O6089J3751k6862m0340K594j0788j4559p6319k0248J00098
$$ plain form
12476 121594 224342 287255 273344 217604 156462 135591 98898 204206 346630 303669 157008
12465 157008 73083 134656 245560 279275 294761 280968 222266 188661 181068 230604 293562
12454 293562 366966 278064 195185 149316 167286 259075 267138 214545 250236 350699 252130
12443 252130 238416 253454 285063 188748 174919 216866 296992 412140 340644 147807 76312
12432 76312 53418 141135 257639 277065 356743 333222 279956 318595 372249 441104 418897
12421 418897 280654 232479 285753 313948 239310 203158 163302 159600 228890 271675 289246
12410 289246 346793 339291 310819 305207 321247 367584 353078 418453 474438 489572 384263 375340
12398 375340 340732 288865 354954 368705 341843 301503 304097 293309 278750 202431 182183 282281
12386B82281N2404K2326J6479j2618M5624l3013L1608R7184o7971n9220n0410
12375C24674p9221O2622N2012q9456O4773M2739L2871N9768n8483j51012n516
12364B55771J43024Q3250j02365j200R5879O3243J5988m1833j9413j2661j438
12353D78245K25J1775J2266L3839r7565o1668p1248l4992l6752N6461O5152M0409
12341C96147N962R3919K8438K8166o6966k3162l7402J8409K7378J20020J51265
12330G42174l8178k26169j24200J01430J08415j740J5690P5326j16675m4244L0880
12319E22709l1382Q1626L6820j8790L7708M6283k1490J7130j24790j00392J5024
12308D60456n7001k2145J02693J07747R3767m1307o8721p7008m5176m1294J5225
$$ plain form
12386 282281 334685 357011 373490 360872 406496 373483 405091 502275 434304 375084 324674
12375 324674 245453 308075 360087 270631 335404 378143 411014 470782 412299 261287 255771
12364 255771 398795 482045 379680 378480 474359 537602 553590 511757 492344 479683 478245
12353 478245 478470 490245 502511 536350 438785 377117 305869 270877 234125 290586 355738 396147
12341 396147 402109 496028 524466 552632 485666 462504 425102 443511 470889 590909 742174
12330 742174 703996 477827 353627 455057 563472 561732 577422 652748 536073 491829 522709
12319 522709 491327 572953 609773 590983 628691 674974 653484 670614 545824 445432 460456
12308 460456 403455 381310 484003 591750 685517 644210 575489 498481 453305 412011 427236
12297D27236k387J36885L2416j4850L9369O3396k1664m9777l5188m3754n716l3335
12285D92631j9246J47421N8679o1448Q4752j187m4573Q632k0512k9408K9130k8606
12273F16265j47740J50187J41934M5400P618k2950J928p5514j6448j9305J3921
12262F95296P1032r0372n9795j05755O3452R553j2133N7772o7723j3629P5310
12251F23008Q5568K0564p854J28033Q2489m8284N6198O919r6881p3185M0966J3304
12239H30845K1815R5411J2804q8926j03679L7503J12886K3295j3489L1048M5104
12228A004617q3096m0528j28847J9717Q937l7290N5591M0158N4856m8508l6472
12217H09135P9408L3548J10112K5109k2386j44034n0162L7724L0288N709j215
$$ plain form
12297 427236 424849 561734 594150 579300 618669 682065 660401 610624 575436 531682 525966 492631
12285 492631 473385 620806 679485 618037 702789 701602 657029 665661 645149 615741 644871 616265
12273 616265 468525 618712 760646 806046 813664 790714 792642 717128 700680 681375 695296
12262 695296 766328 675956 616161 510406 573858 583411 571278 629050 561327 547698 623008
12251 623008 708576 729140 721286 849319 931808 883524 939722 946641 849760 776575 817541 830845
12239 830845 852660 948071 960875 871949 768270 805773 918659 941954 928465 959513 1004617
12228 1004617 921521 880993 752146 771863 780800 743510 799101 839259 894115 845607 809135
12217 809135 888543 922091 1032203 1057312 1034926 890892 840730 878454 908742 914451 913236
12206I13236P441L6755M3583m9205P607Q3989O505K0570Q3957n5866p2723k6666
12194I99183N2159R2323n5835j01063N8609J11035J6810o6464M6171P4595m5023
12183A182500j0719Q8261P0567M0045L616J47507K1980j41379l3840p8108m6039
12172A244391M9119l3064J1883J5556n3626M035K32858J29135p0768l4918J647
12161A496248k6159k23j7857O9171M0270l6809l5390k6581L4515p404P2417Q9122
12149A651320l8196j4568l64N4098l7223m1865J711M6527M1731J14908O3402j5952
12137A825529j662l1063K5932n601o2900P8381J21030Q909j2695p1158L0619J36958
12125B042279L4202k850k315o157j0727k4816j4573K9462O010M375J21290q753
$$ plain form
12206 913236 920677 957432 1001015 951810 959417 1043406 1049911 1070481 1154438 1098572 1025849 999183
12194 999183 1051342 1143665 1087830 986767 1045376 1156411 1173221 1106757 1152928 1227523 1182500
12183 1182500 1171781 1260042 1330609 1370654 1374270 1521777 1543757 1402378 1368538 1290430 1244391
12172 1244391 1293510 1260446 1272329 1287885 1234259 1238294 1471152 1600287 1529519 1494601 1496248
12161 1496248 1470089 1469866 1452009 1521180 1561450 1524641 1489251 1462670 1497185 1489781 1562198 1651320
12149 1651320 1613124 1598556 1598192 1652290 1615067 1573202 1574913 1621440 1663171 1778079 1841481 1825529
12137 1825529 1823867 1792804 1818736 1813135 1750235 1828616 1949646 1958555 1945860 1874702 1905321 2042279
12125 2042279 2076481 2073631 2071316 2065159 2054432 2029616 2015043 2044505 2050515 2054890 2176180 2167427
12113B167427k9863L059q7928M7118M0924O9122Q1108R555n0333P8307M7743K312
12101B378551M8774P940n2704N5365N0206l2753M0637J33664Q1150n187J33765
12090B839408k5344P9350J55794m2244j92526N2952K3999q5592M4983J38093j2718
12079B976155J8966J27061O7984J95164R8866J7455o158n5496k0520j1982J01718
12068C509213J00193P4806J42302J850l8213m7138m4497P133O6802L5351R7511
12057C905313O4450L3345L5588O3152J49479J53007J16326J1929Q102R8505M154
12046D643350N3193N7619O9613J3244L8026r318J0080R5311M9612p112M8845j3235
12034E049228J43669J25195M967L9401R7851J81697K40556O9135j7744J03659
$$ plain form
12113 2167427 2137564 2140623 2052695 2099813 2140737 2209859 2290967 2300522 2250189 2328496 2376239 2378551
12101 2378551 2427325 2435265 2382561 2437926 2488132 2455379 2496016 2629680 2710830 2705643 2839408
12090 2839408 2814064 2893414 3049208 3006964 2814438 2867390 2891389 2805797 2850780 2988873 2976155
12079 2976155 2995121 3122182 3190166 3385330 3484196 3501651 3495493 3439997 3419477 3407495 3509213
12068 3509213 3609406 3684212 3826514 3828364 3790151 3743013 3698516 3705649 3772451 3807802 3905313
12057 3905313 3969763 4003108 4038696 4101848 4251327 4404334 4520660 4532589 4540691 4639196 4643350
12046 4643350 4696543 4754162 4823775 4837019 4875045 4865727 4875807 4971118 5020730 5013618 5062463 5049228
12034 5049228 5192897 5318092 5323059 5362460 5460311 5642008 5882564 5951699 5933955 6037614
12024F037614K03469J20354O9489J25819K0935j6670p212M8492J22874O1697J84830
12013F971691J23382J83405P6365J40011J11433P2831Q8614K05266R0704R6659
12003H160361J29511Q8313R4023Q9284J70427K00285J56392J90159K5625J20635
11993I425015J80566J15295L2368J10754J23674J45898K67303N9142J52762J96920
11983A0809697Q3114J46285L4259J19631J43969J72412K30337J17162K04782J36218
11973A2197866L00613K96302J47842J25949K10220K06777R6923J66795K24517
11964A3973804J26947J54281J64045J79948J95456J26189J86348O2913J32038
11955A5301969P6437Q4450K12931K30613J73722J58558J25409R0705K063R9042
$$ plain form
12024 6037614 6241083 6361437 6430926 6556745 6577680 6561010 6553798 6602290 6725164 6786861 6971691
12013 6971691 7095073 7278478 7354843 7494854 7606287 7679118 7767732 7972998 8063702 8160361
12003 8160361 8289872 8378185 8472208 8561492 8731919 8932204 9088596 9278755 9304380 9425015
11993 9425015 9605581 9720876 9753244 9863998 9987672 10133570 10400873 10460015 10612777 10809697
11983 10809697 10892811 11039096 11073355 11192986 11336955 11509367 11739704 11856866 12061648 12197866
11973 12197866 12498479 12794781 12942623 13068572 13278792 13485569 13582492 13749287 13973804
11964 13973804 14100751 14255032 14419077 14599025 14794481 14920670 15107018 15169931 15301969
11955 15301969 15378406 15462856 15675787 15906400 16080122 16238680 16364089 16454794 16456857 16555899
11945A6555899K04905J77504J24126J4839J7861k0949J19070K46506J02779N6323
11935A7598863k1896O1042L4445N4116R0856K4201j28223n6265N5828Q0570J6278
11924A7809815j11044n2820J8026p5064p8950n0126j08568p3284m7634n2774n1718
11913A7125859l6970j25056j63736p3197j8791j02637k1654j18176k04192k28727
11903A6032723k84921k29018j34114j51453j32315r8965j71974j46418j11017
11894A4572528j15690k03268k38431j33592p3855j33978j79175j96043l05656
11885A2992840j67444m3574j32826j08287j67377j35695r8891j49075j48219j50539
11875A1690913j79804k72642k21965j36701j39654j23134j44745k34329j10432
$$ plain form
11945 16555899 16760804 16938308 17062434 17077273 17095134 17074185 17193255 17439761 17542540 17598863
11935 17598863 17576967 17638009 17672454 17726570 17817426 17841627 17713404 17657139 17712967 17793537 17809815
11924 17809815 17698771 17645951 17663977 17588913 17509963 17459837 17351269 17277985 17230351 17177577 17125859
11913 17125859 17088889 16963833 16800097 16726900 16708109 16605472 16583818 16465642 16261450 16032723
11903 16032723 15747802 15518784 15384670 15233217 15100902 15001937 14829963 14683545 14572528
11894 14572528 14456838 14253570 14015139 13881547 13807692 13673714 13494539 13298496 12992840
11885 12992840 12825396 12781822 12648996 12540709 12373332 12237637 12138746 11989671 11841452 11690913
11875 11690913 11511109 11238467 11016502 10879801 10740147 10617013 10472268 10237939 10127507
11866A0127507j20679j14522j90785j71403k06971j74120j44617j55447p8098
11857H770865J7585J05k35673k20243q5265m2853n3292j50773j09915n9464j39109
11846G691968j06267j35134p2444r6834j07531j81568j51778q2077n8541j43196
11836F556598r4192m8496j08170j29671j05417o3374o1570J4484n29l4831l4910
11825E889922l3278p1191j94135j23255n9516j01125q8531j17378n1474k4624
11815E025415k9722n5591r9110j06905m9109M7171r1679l635j338j19980r3916
11804D421601m2502j2993j00396p6339r7079n0607k0756k956j25916j27678o928
11793C757451j5346k5362q4017l7803L3168J0363M8228m613j02688k17208r6880
$$ plain form
11866 10127507 10006828 9892306 9701521 9530118 9323147 9149027 9004410 8848963 8770865
11857 8770865 8788450 8788555 8552882 8332639 8247374 8204521 8151229 8000456 7890541 7831077 7691968
11846 7691968 7585701 7450567 7378123 7281289 7173758 6992190 6840412 6758335 6699794 6556598
11836 6556598 6462406 6413910 6305740 6176069 6070652 6007278 5945708 5960192 5959663 5924832 5889922
11825 5889922 5856644 5785453 5591318 5468063 5408547 5307422 5218891 5101513 5050039 5025415
11815 5025415 4995693 4940102 4840992 4734087 4684978 4732149 4640470 4636835 4635497 4515517 4421601
11804 4421601 4379099 4366106 4265710 4189371 4092292 4041685 4020929 4017973 3892057 3764379 3757451
11793 3757451 3742105 3716743 3632726 3594923 3628091 3638454 3686682 3682069 3579381 3362173 3265293
11782C265293P6645L2605k5127n4696q0767J0481q746l896p4153l8506r3555o7601
11770B937977P2058q3717j88975Q810q0365Q739O7542j39528p7251O1216m079
11759B582427l5214M700J621m4804o1511r8294n6441k960M0282r3950q9500K6684
11747B173040n168k0773P8150J09830J2262o820j23518o7580L0252o7119o4979
11736B047577j34349J3464J28329K5874K0162K5552J2688j76776j17225k9229
11726A816067J2652j8972M3534k1875m1581j9811j27919n5112j24140J3482O9335
11715A545660k5426N991R3269K5957k2392M3122M589n9563o5693k7119l5510N7353
11703A540238N1509k4241p7262q5096J6756J7347j02881R38J1333n748M1598J2055
$$ plain form
11782 3265293 3341938 3374543 3349416 3294720 3213953 3224434 3215688 3211792 3137639 3099133 3005578 2937977
11770 2937977 3010035 2926318 2737343 2746153 2665788 2674527 2742069 2602541 2525290 2586506 2582427
11759 2582427 2547213 2551913 2553534 2508730 2447219 2348925 2292484 2289524 2329806 2235856 2146356 2173040
11747 2173040 2167872 2147099 2225249 2335079 2347341 2340521 2217003 2149423 2179675 2112556 2047577
11736 2047577 1913228 1926692 2055021 2080895 2101057 2126609 2139297 1962521 1845296 1816067
11726 1816067 1828719 1809747 1853281 1831406 1789825 1770014 1642095 1586983 1462843 1476325 1545660
11715 1545660 1520234 1526225 1619494 1645451 1623059 1666181 1670770 1611207 1545514 1518395 1482885 1540238
11703 1540238 1591747 1567506 1490244 1405148 1421904 1439251 1336370 1337308 1348641 1342893 1384491 1396546
11691A396546Q4834l1259n2702M1657j07276n0840M163k2273J1135q9224M279
11680A189040L7184m813K7278M1726m9011m1708L9385o78J4664j2931j4940j04736
11668A120460M9483N9984L8167o8835m7444j82558j477J0149n2281O4657K7150
11657A017455k6457p3139n7849J7385k397l062r041p0653P6832M7230J54886K4708
11645A095898j7382n6450N0586Q6981j04487q8832M904J1732r510p381r0058O0620
11633I36621k9026L2538J03865p5026r1008l2820P0737m9221O8323m8157n323
11622H81503J04306J26945l4994q9409p5215n866p4150j07021j4018K2246J7759
11611G52086p637L0079m679j5025j2789J37669o4409n9194k4144L0693L0759l8562
$$ plain form
11691 1396546 1481380 1450121 1397419 1439076 1331800 1280960 1285123 1262850 1273985 1184761 1189040
11680 1189040 1226224 1221411 1248689 1290415 1241404 1199696 1239081 1238403 1253067 1240136 1225196 1120460
11668 1120460 1169943 1229927 1268094 1199259 1151815 969257 967780 977929 925648 990305 1017455
11657 1017455 990998 917859 860010 877395 874998 871936 862895 792242 869074 916304 1071190 1095898
11645 1095898 1078516 1022066 1072652 1159633 1055146 966314 971218 982950 973440 966059 876001 936621
11633 936621 907595 940133 1043998 968972 877964 845144 915881 866660 934983 886826 881503
11622 881503 985809 1112754 1077760 988351 913136 907270 833120 726099 712081 734327 752086
11611 752086 744449 774528 769849 754824 742035 879704 815295 756101 731957 762650 793409 754847
11599G54847M844M3847N4725j1962n0357m4542q0255n4592m8678K5077J16691
11588G09645Q76p9985k2011K5346R2167j0113j25605J9531R7713N8522n4033J9230
11576G31283l3086l9848k9245n4269o5576k494k6807k151N8650M4812n6795q5356
11564D39118M8707P9644m9381L1564n7859M1910j24247J9765P5359k4699L1318
11553E11199k8074r9975J5468J31313M4256O1430n1910J1913L412k5481l7709
11542E35842r950N4031m5645n3936R351O2004j07482j0567J44616n667N5476K7097
11530F55170p1347q0153N196l3446M1067M5957k7567n5760o1383m179J8557j9199
11518D12913M1835J66592k6541j09624o6904K2033J799o8230j4072N4805P5467
$$ plain form
11599 754847 759691 803538 858263 846301 795944 751402 671147 616555 567877 592954 709645
11588 709645 710521 630536 608525 633871 726038 715925 590320 609851 707564 766086 712053 731283
11576 731283 698197 658349 629104 574835 509259 506765 479958 477807 536457 581269 524474 439118
11564 439118 487825 567469 518088 549652 491793 533703 409456 429221 504580 479881 511199
11553 511199 483125 383150 398618 529931 574187 635617 583707 595620 599032 573551 535842
11542 535842 525892 579923 534278 480342 489693 551697 444215 433648 578264 572597 628073 655170
11530 655170 583823 503670 508866 475420 516487 562444 534877 479117 417734 413555 432112 412913
11518 412913 454748 621340 594799 485175 418271 440304 442103 373873 359801 414606 490073
11507D90073l8259o7263m7630L6050J5331Q053m0009l4883k9888P7901Q3754p3051
11495C80179P872J0105l4568k4881N1766o568M0390O8861j21322j8900j744L5343
11483C86533l5368P1234M1422o3192p8536J1743J9105K4096J5925k8367p0924
11472B93671L5972J1003n9757O0045K6482m7760j149L4373o0713J15488Q7567
11461D95222j53328k1508J13322j7553m6639O964j4954K9731Q5867J2371k4217
11450D65278k7586m0149m2117j35354M9832N4979N0471n9204o4923L2131o4926
11439B18432p3068p5891L1189L4714J11769J17128j6448q6618o1529M3053K6467
11428B69198p6004k3808K6459j6833O698l9934k5905L9059L9056J33397k3515
$$ plain form
11507 490073 451814 384551 336921 372971 388302 396355 356346 321463 291575 369476 453230 380179
11495 380179 388051 398156 363588 338707 390473 383905 424295 493156 371834 352934 351190 386533
11483 386533 351165 422399 463821 400629 322093 333836 352941 377037 392962 364595 293671
11472 293671 329643 340646 280889 340934 367416 319656 318507 352880 292167 407655 495222
11461 495222 341894 320386 433708 416155 369516 376480 361526 391257 477124 489495 465278
11450 465278 437692 397543 355426 220072 269904 324883 375354 316150 251227 283358 218432
11439 218432 145364 69473 100662 135376 247145 364273 347825 261207 199678 242731 269198
11428 269198 193194 169386 195845 179012 185710 145776 119871 158930 197986 331383 307868
11417C07868q0742j109J247P9699K3088j5999O9477L140r9329N1342l4364J4673
11405C18991J0284p9339j26880M1611R3903J01779P444k4059L4778n1082n2196
11394B75234m7858j14685O6922j6006K3299N342j1112n0588j8492R1678O2912
11383B66646r98j53054o4928J05691J58425j6631q271o4360J9970L3885O814q4047
11371A99142J9766J0667k9520k2188L1697k6048M2204N804l3273o3885l3614J5644
11359A16396N7215J36754K7908P8170k8394n0022P041m4090K0721P678j14474
11348B14903r9961J0208L3450q0605O5630J00866n716L1780M9738o0767p614k9001
11336B22911Q7358j8155M9531l3120j42387n5172R9283R884j24867j2571N82K6562
$$ plain form
11417 307868 227126 226017 227264 306963 330051 314052 383529 386669 287340 338682 304318 318991
11405 318991 329275 249936 123056 164667 258570 360349 367793 343734 378512 327430 275234
11394 275234 227376 112691 179613 163607 186906 192248 181136 130548 112056 203734 266646
11383 266646 265648 112594 47666 153357 311782 295151 286880 222520 242490 276375 283189 199142
11371 199142 218908 229575 200055 177867 209564 183516 225720 231524 198251 134366 100752 116396
11359 116396 173611 310365 338273 416443 388049 338027 345068 300978 321699 329377 214903
11348 214903 114942 125150 158600 77995 143625 244491 238775 270555 320293 259526 251912 222911
11336 222911 310269 292114 341645 308525 166138 110966 210249 220133 95266 82695 83277 109839
11324A09839L5801N3858p5123o4281K0131Q4272m5677L6375k3191n6515K7941
11313A03430J9338L7095n921P551r3593N5940k2448M311P5543Q8506p2753r7464
11301I9535n1492J9632q5311J440J09774J1438n8399n5376q881m3963K00499O2649
11289B01545K2588k6628P235J8788j7842o9981n939M8011o7865j07021N5031M2405
11277A00327o556N5878l1057q6536L7039p081m8763j8768j5887j9693R6073O0430
11265A15406Q2574J1176l9651p6787o8350M9952p6357q2333J53282J15852q5751
11254I9013k37943p80Q0207L2291k9553M3255Q7460O4575M1637l0326J5963j9237
11242A46562l2338n2486n3842N0346o4314N1321J29383p049j35914N978M4063
$$ plain form
11324 109839 145640 199498 124375 60094 80225 164497 118820 155195 132004 75489 103430
11313 103430 122768 159863 153942 161493 67900 123840 101392 105703 181246 269752 196999 99535
11301 99535 48043 67675 -17636 -16196 93578 105016 46617 -8759 -17640 -61603 138896 201545
11289 201545 224133 197505 204740 223528 205686 135705 129766 177777 109912 2891 57922 100327
11277 100327 93771 149649 118592 32056 69095 62014 13251 -5517 -21404 -41097 54976 115406
11265 115406 197980 209156 169505 92718 24368 74320 -2037 -84370 68912 184764 99013
11254 99013 -138930 -139710 -59503 -27212 -56765 -13510 73950 138525 180162 149836 165799 146562
11242 146562 114224 61738 7896 58242 -6072 45249 174632 167583 31669 37647 81710
11231H1710j6886O0404P75r4095N9729P1814Q1510l5198k6436n5877J192j35864
11219g222q9119R9731k2013L278J61070N984m9758r035j1065N4855O3733O160
11207B06599P0101L5548k8117K4193K1254p3271j484L6926O5139K3265j70723
11196B09430q5037k7337q6047j6186N5487n0093Q4438R487J3013K7184n3245k04366
11184a23272n5643J46479L5943J0620J2441K3081L4355l986K5269M708K8751K5814
11172A64560k0381o4487j10709N4751M3050J1239O0130n3008l8983J05724M8376
11161B00262m9536r2597Q690M5428m9576o8377l836O0646K999m333R4173L3615
11149A77558j25179j00686R7034J02000m8667J4684K1908M1601n0038j23293J18667
$$ plain form
11231 81710 64824 125228 126003 31908 91637 163451 244961 209763 183327 127450 128642 -7222
11219 -7222 -96341 3390 -18623 -15345 145725 151709 101951 92916 81851 136706 200439 206599
11207 206599 276700 312248 284131 308324 329578 256307 254823 291749 356888 380153 209430
11196 209430 124393 97056 11009 -5177 50310 217 84655 94142 107155 134339 81094 -123272
11184 -123272 -178915 -32436 3507 14127 26568 49649 84004 80018 105287 109995 138746 164560
11172 164560 144179 79692 -31017 23734 66784 78023 138153 85145 46162 151886 200262
11161 200262 150726 58129 66819 112247 62671 -5706 -9542 51104 54103 49770 143943 177558
11149 177558 52379 -48307 48727 150727 102060 116744 138652 180253 130215 6922 125589
11138A25589n959j28110L5608J7276K8107N6736N769j10747R074K59070M9023
11127C41436j4964P1377r2251p4293m3463O1036r9090r9128k1220l56J03001p8248
11115E3837j0758L9675R5272m1920m9178m941P9308j5205m2030K8076p704o7777
11103E6655r7901N9720j3696m1686k1461m1259l0141O9682M0186J7088l2979j5247
11091e1039L1037L5866J2588L4046O9669k4219r0483M0244L4501K7916M2595K0855
11079A83576K6862Q4158k7690l8752q3685j8852R678k8264M119M4419l2157l2242
11067I1170L002q2485p8010J5737J10431Q2690n4116Q4326k4156j1900o8859l3697
11055C4133K1977m2995L6191o19m6842Q2632M9456J23892L9489j07289k5246O7210
$$ plain form
11138 125589 119630 -8480 27128 44404 72511 129247 135016 24269 33343 292413 341436
11127 341436 326472 397849 305598 231305 187842 248878 149788 50660 29440 29084 132085 53837
11115 53837 43079 82754 178026 136106 86928 81987 161295 146090 104060 132136 124432 56655
11103 56655 -41246 18474 4778 -36908 -58369 -99628 -129769 -60087 -19901 -2813 -35792 -51039
11091 -51039 -20002 15864 28452 62498 132167 107948 17465 57709 92210 120126 162721 183576
11079 183576 210438 294596 266906 228154 144469 125617 135295 107031 111150 155569 123412 91170
11067 91170 94172 11687 -66323 -50586 59845 142535 88419 172745 148589 136689 67830 34133
11055 34133 56110 13115 49306 48687 1845 84477 133933 257825 297314 190025 164779 231989
11043B31989L6161j4317Q6037J2791N6408K3192J48061J29432J42032l6837k9227
11032G85722K5272P8227j13495q1205m1773M752J05510J00661J25627P4901R6829
11021A161028N3720m8234k12042j90871j21988m2579k4937O0988J46902P1824
11011H53811q277q3933r4808O7343j422q6932j33015j43543j07927o4261O5593
11000B62629K5663R6751k1191p6251Q295J0809j1671k0385J4347J6752n9363l7843
10988B08542o575m6970p9429k7762n3165J53197J10708q0799j34168m6948P2700
10977F9331r57N231L5453k9978n6285o405k6997N3013k3240p8456J01425O6985
10965A09120l4555q6817j11566K7268N6323J1767k886m9435m1051K2592L4760
$$ plain form
11043 231989 268150 253833 339870 352661 409069 432261 580322 709754 851786 814949 785722
11032 785722 810994 889221 775726 694521 652748 657500 763010 863671 989298 1064199 1161028
11021 1161028 1214748 1166514 954472 763601 641613 599034 574097 635085 781987 853811
11011 853811 845534 761601 666793 734136 732714 645782 512767 369224 261297 197036 262629
11000 262629 288292 385043 363852 287601 295896 306705 295034 274649 288996 305748 246385 208542
10988 208542 201967 154997 75568 47806 -5359 147838 258546 177747 43579 -3369 69331
10977 69331 68374 73605 109058 79080 22795 16390 -10607 42406 19166 -59290 42135 109120
10965 109120 74565 -12252 -123818 -96550 -40227 -28460 -31346 -80781 -121832 -99240 -64480
10954f4480M0363L4141J6871n4802q021l653L4603L6982j20528j664J61979L1932
10942A03723K801k5364k9269l0639O3861K8250n421j17307o7117k8559k4474P7858
10930e1657O8253L434l1736j4923j32864k2634R4306J31389N618r4032k637K2199
10918b5284J3542K3941O036L1737m6073p248j0203m5814j06286l2908L918N8795
10906a35847l3188O0313R1691P1919j00222j09515N2910J60056J227j28197p8448
10895a47301n680J1821l3897L9118k3820J199J33871J85944o5347j32534m9320
10884h5946o697J7614J83800J11247k537r0877n5080m1367o5472J390L3260Q2609
10872H1944J02166L7376q2430j21783j9890j74007J5799J03252M375j6720q0084
$$ plain form
10954 -64480 -24117 10024 26895 -27907 -35928 -39581 -4978 32004 -88524 -90188 71791 103723
10942 103723 106524 81160 51891 21252 85113 113363 107942 -9365 -76482 -105041 -129515 -51657
10930 -51657 16596 20030 -11706 -26629 -159493 -182127 -87821 43568 49186 -44846 -47483 -25284
10918 -25284 -11742 12199 18235 49972 3899 -3349 -13552 -59366 -165652 -198560 -194642 -135847
10906 -135847 -169035 -108722 -17031 54888 -45334 -154849 -101939 58117 59344 -68853 -147301
10895 -147301 -152981 -141160 -175057 -135939 -159759 -158560 -24689 161255 95908 -36626 -85946
10884 -85946 -92643 -75029 108771 220018 217481 126604 71524 30157 -35315 -33925 -665 81944
10872 81944 184110 221486 139056 17273 -2617 -176624 -160825 -57573 -53198 -69918 -150002
10861a50002m5808J00905N6974J3067O2215Q3097J6114k484M4177N1688n0189
10850A79754m1522K2078o6619j35864M4138N5826O4037K4559j6651l7571N5619
10839A47784P7241J01274o7757n2690j06767q8431L6067N9290r9496O1062O4611
10828A32188m0505l9850J9331j6030o9967j19839J1700k8267o339M6010K6660
10817h4908L3798J13029J33706q9981j28057P3169N1714n5818j39667r2261O0320
10806a24956p985k890n8115K595j6883N2001k0450k7424O3340n0630k8385K8491
10794a91291O3254K7563o3773J4092j2916o0433O637P3066j5621K8304K9875J43934
10782D2691j486n2553K754j34355M0494M8639q9052L4996P6326R2028l0543N632
$$ plain form
10861 -150002 -195810 -94905 -37931 -24864 37351 120448 136562 134078 178255 229943 179754
10850 179754 138232 160310 93691 -42173 1965 57791 121828 146387 129736 92165 147784
10839 147784 225025 326299 258542 205852 99085 10654 46721 106011 6515 67577 132188
10828 132188 91683 51833 71164 55134 -14833 -134672 -122972 -151239 -157578 -111568 -84908
10817 -84908 -51110 61919 195625 105644 -22413 50756 102470 46652 -93015 -185276 -124956
10806 -124956 -132941 -135831 -193946 -191351 -208234 -156233 -176683 -204107 -140767 -191397 -219782 -191291
10794 -191291 -128037 -100474 -164247 -150155 -163071 -223504 -216867 -143801 -159422 -131118 -101243 42691
10782 42691 41205 -11348 -8594 -142949 -102455 -53816 -142868 -107872 -31546 60482 29939 35571
10770C5571p1152o896K0913p4345q7748J2820N3648J8415r4234R2706Q3256p9681
10758i6727O2360M0568J472r2902N5773Q8670Q752n7298j2188J3350N5275L1996
10746I9101K0552R9002J04658j03506k4739J46237o0285j0615R2379Q2687J23191
10735E68662L05321M87408L32607Q2674L5289R542o3261M0405J18951J57563k9250
10724B045911k55705k93288k08468k03175k52286k11740j75606j94574m7643J23783
10714C27209m3481j20365R8385j39585r2216J4329L4562j0222m4763k5093k5442
10703b6682K294P1115r2949J2382N5091P7375L028p8591p0492j4744O70l0489
10691i1992J10775J80325o3902j27053j54117k822P1165L1657P9386L7593l9644
$$ plain form
10770 35571 -35581 -42477 -21564 -95909 -183657 -170837 -117189 -98774 -193008 -100302 -17046 -96727
10758 -96727 -34367 6201 7673 -85229 -29456 59214 67966 10668 -1520 11830 67105 99101
10746 99101 119653 218655 323313 219807 195068 341305 281020 270405 362784 445471 568662
10735 568662 873983 1361391 1693998 1776672 1811961 1821503 1758242 1798647 1917598 2075161 2045911
10724 2045911 1790206 1496918 1288450 1085275 832989 621249 445643 251069 203426 327209
10714 327209 283728 163363 261748 122163 29947 44276 78838 68616 23853 -1240 -26682
10703 -26682 -24388 46727 -46222 -33840 21251 98626 101654 23063 -47429 -62173 -61503 -91992
10691 -91992 18783 199108 135206 8153 -145964 -148786 -77621 -45964 33422 71015 31371
10680C1371q7038m4795Q2577P126n8586K4200J01858R9441p8908n6068J8527O8704
10668A08409r1347o5508P3018j704O6558L3663l2568K3752P7394m0379R1082J21806
10656C64176l6481o3399l99L2905J03896k8267O1651J1576o0980k3728L9485Q6917
10644D87352M1884P6858Q6107J6717k437N1602J22429J67486Q3619K90246L25296
10633A747159L74383L86730K25090L81333K74381K89406M68510P00527R05574
10624E753093J173049J684464K579779L585543M842718O696200Q524775R299045
10616D4138666Q082145N351258K313358k94060j767428j807161k22447K536854
10608E8331185O611245J1581866J6550410J8540042J4923744P606038P1984n740157
$$ plain form
10680 31371 -55667 -100462 -17885 -10759 -69345 -45145 56713 156154 77246 21178 39705 108409
10668 108409 17062 -48446 24572 22868 89426 123089 90521 114273 191667 151288 242370 364176
10656 364176 327695 264296 263897 296802 400698 372431 434082 445658 384678 360950 400435 487352
10644 487352 529236 606094 692201 708918 706481 758083 880512 1047998 1131617 1421863 1747159
10633 1747159 2121542 2508272 2733362 3114695 3389076 3678482 4146992 4847519 5753093
10624 5753093 6926142 8610606 11190385 14775928 19618646 26314846 34839621 44138666
10616 44138666 52220811 57572069 59885427 59591367 57823939 56016778 55794331 58331185
10608 58331185 64942430 76524296 93074706 111614748 126538492 134144530 134216514 128476357
10600A28476357r052646q933484n562612K50600P204248J4767352K1336702K2810937
10592A71297454J6002917M357801o572091j4551323j8969605j8615305j4172391
10585A18777457p683041q45411N677651J0493938J0953025N963768k057745q932749
10577A32346893j3607216j5860872j5110913j1679519p292893l157255J70277
10570F5808502K157495J923810k14831l282563o022504p825515q498414q015825
10562C6030155o727511n360248m171658l060611k266589j632691j297378j210691
10554A0302778j071682p80014o94929p22742n90595m84048m24201l62668l02452
10545D869447k71577k84005j92518o3022j52777k20669k27665k81322j48337j64576
$$ plain form
10600 128476357 119423711 110490227 104927615 105178215 112382463 127149815 148486517 171297454
10592 171297454 187300371 191658172 185086081 170534758 151565153 132949848 118777457
10585 118777457 111094416 110249005 115926656 126420594 137373619 143337387 141279642 132346893
10577 132346893 118739677 102878805 87767892 76088373 68795480 65638225 65808502
10570 65808502 67965997 69889807 69674976 66392413 60369909 52544394 44045980 36030155
10562 36030155 29302644 23942396 19770738 16710127 14443538 12810847 11513469 10302778
10554 10302778 9231096 8451082 7756153 7033411 6442816 5958768 5534567 5171899 4869447
10545 4869447 4597870 4313865 4121347 4058325 3905548 3684879 3457214 3175892 3027555 2862979
10535B862979j91439n8734r3838n3542m901j37382j95222j04212j04550q6396
10525A832763n7452R700o3780l0284n6733l6844j00944q5691l0626p5724o1824
10514A242561j82125p5439l4610K8368K3430r4043j41734J558J28103J7337m023
10503I09383j14859K1826M2277M4421o3192n0810m5765L4307N6832m7243J1440
10492G98617P9092q2630q3632j8087O6049o565l7071l2349m2149n2008k4683P8029
10480F42613L2466l5742q9926l1560N4833J46642J1109j4965k966k2220j04291
10469E85993N7929J23142P8422K1500k21493j42263J15582r812L9297j7382j11132
10458E19783j00287M304O2590J0955M940j7288j42199j22101K076J13386L5852
$$ plain form
10535 2862979 2671540 2612806 2518968 2465426 2460525 2323143 2127921 2023709 1919159 1832763
10525 1832763 1775311 1785011 1721231 1690947 1634214 1597370 1496426 1410735 1380109 1304385 1242561
10514 1242561 1060436 984997 950387 978755 1002185 908142 766408 767966 896069 913406 909383
10503 909383 794524 816350 858627 903048 839856 789046 743281 777588 834420 787177 798617
10492 798617 877709 795079 711447 693360 759409 752844 715773 683424 641275 589267 564584 642613
10480 642613 675079 639337 549411 517851 572684 719326 730435 715470 712504 690284 585993
10469 585993 643922 767064 845486 866986 645493 503230 618812 609000 648297 630915 519783
10458 519783 419496 423800 486390 497345 502285 484997 342798 220697 222773 336159 372011
10447C72011l2966P2523O6226o5274j16124n8024N3338J49850l3916j00342L7324
10436C44626R8543N0343k1538j7793m7720k8116m0923j4887j1008q0218N5838
10425B87147P5786p810k0812l1645Q3250J06336J6268j06235j9250R3891n8889
10414D18037M052J59343M5766P543Q428o5997M4952J03971M3507k351L5723j7400
10402G85574l8585p5724N0660L3348K1605J69821M2919L6834l9688j08165k6939
10391H51660O84L0856P7616N0753j1636L5131l3048n453R4220O1099R5994J4288
10379A262164Q8535k2848Q0643Q9920j1070J12382J50702N3035r082M5883P5840
10368A916104J45084J86013J00418Q1776J85724J81538J61330J86341L28196L15658
$$ plain form
10447 372011 339045 411568 477794 412520 296396 238372 291710 441560 407644 307302 344626
10436 344626 443169 493512 471974 454181 406461 378345 337422 322535 311527 231309 287147
10425 287147 362933 355123 334311 302666 385916 492252 508520 402285 383035 476926 418037
10414 418037 422089 581432 627198 634741 643169 577172 622124 726095 769602 767251 802974 785574
10402 785574 746989 671265 721925 755273 776878 946699 989618 1026452 986764 878599 851660
10391 851660 852344 883200 960816 1011569 999933 1035064 1002016 996563 1090783 1151882 1247876 1262164
10379 1262164 1350699 1327851 1408494 1498414 1487344 1599726 1750428 1803463 1794381 1840264 1916104
10368 1916104 2061188 2247201 2347619 2429395 2615119 2796657 2957987 3144328 3472524 3788182
10358C788182K75991J82872K89046M83856N76321N68757O04255P87739R21670
10349H478689Q09233P87075Q13383R78278J199932J543455J864726K027683K386062
10340B0888516K848056L322350M044626N189454O896695R299078J2991662J8561587
10332H4042024K7016837L9798011N6753856P1129578O2326161L1953624R075338
10325C82095429j891953n069264M989857K0158718J1637662j4448475l3791143
10318C63680831m6980821n7096714n6271196m5559686l3477420k4057580j7299350
10311H2938064j2764357r780152p663174o169463n000700m217999l493240k925709
10303C0923270k478305k304666k057095j830354j423613j263289j197907j269751
$$ plain form
10358 3788182 4064173 4247045 4536091 5019947 5596268 6165025 6769280 7557019 8478689
10349 8478689 9287922 10074997 10888380 11866658 13066590 14610045 16474771 18502454 20888516
10340 20888516 23736572 27058922 31103548 36293002 43189697 52488775 65480437 84042024
10332 84042024 111058861 150856872 207610728 278740306 341066467 373020091 382095429
10325 382095429 380203476 375134212 380124069 400282787 411920449 397471974 363680831
10318 363680831 316700010 259603296 203332100 157772414 124294994 100237414 82938064
10311 82938064 70173707 60393555 52730381 46560918 41560218 37342219 33848979 30923270
10303 30923270 28444965 26140299 24083204 22252850 20829237 19565948 18368041 17098290
10295A7098290j212464j228484j040038r07962q28907p73798o62879n88067o17131
10286I238560n34897l69625l00613l60527l87025k95600l34016l45776k43030
10277F067451j96935j55664j55002k39897k38461k27027j93712j03236j82897
10268D374620k64445j71582j55203j89867j26433j25296q3376m6581j41601k03603
10258B866633l1760l5770p9971j65864k18606p3312n3475o4799L310o4005j64463
10247A917918p5492n2274l4907q6299p7245K3771l3742m0038P2783n1527p8022
10236A484926p9244J0969l0570n2433m5304K3448n9868p1866m0830l9781K4362
10225A123809J8694N5919m2088m5075M9235K2438n2323J12439L0983j80266o8008
$$ plain form
10295 17098290 15885826 14657342 13617304 12709342 11880435 11106637 10443758 9855691 9238560
10286 9238560 8703663 8334038 8033425 7672898 7285873 6990273 6656257 6310481 6067451
10277 6067451 5870516 5714852 5559850 5319953 5081492 4854465 4660753 4557517 4374620
10268 4374620 4110175 3938593 3783390 3593523 3467090 3341794 3258418 3211837 3070236 2866633
10258 2866633 2834873 2799103 2719132 2553268 2334662 2261350 2207875 2143076 2146386 2082381 1917918
10247 1917918 1842426 1790152 1755245 1668946 1591701 1615472 1581730 1541692 1614475 1562948 1484926
10236 1484926 1405682 1416651 1386081 1333648 1288344 1311792 1251924 1180058 1139228 1099447 1123809
10225 1123809 1142503 1198422 1156334 1111259 1160494 1182932 1130609 1243048 1274031 1093765 1025757
10214A025757k8863K4032k4650J4466k0686K8546l635m3109R2331N0353M825j02867
10202A016500j2459O2822p3851j30087P1572R2452j38151r3195m1831k7916N8780
10191G84636m1172l7417N8195J93045k9250p9983k9180k5042N4757R104N1348
10180I09041R2927J29760q3794K7607m4972j47186j19732J1937O0361R0721J30333
10169A057003K6084Q6019m8388P939R2696p5628Q75K5857p898L360K2809L2790
10157A223518O9095Q8579J23079L5426j64089j42388m7247l1451o8859j7087m1233
10146A027343M5406J58953J16907J609j32687q1608o3356k5934R089q3763l8016
10135I33943P2568N2642J3912m3692p8184k339o4000j35164k6076J4402O340L8808
$$ plain form
10214 1025757 996894 1020926 996276 1010742 990056 1018602 1014967 971858 1064189 1114542 1119367 1016500
10202 1016500 1004041 1066863 993012 862925 934497 1026949 888798 795603 753772 725856 784636
10191 784636 743464 706047 764242 957287 928037 848054 818874 793832 848589 857693 909041
10180 909041 1001968 1131728 1047934 1075541 1030569 883383 763651 775588 835949 926670 1057003
10169 1057003 1083087 1169106 1120718 1128657 1221353 1145725 1146600 1172457 1164559 1167919 1190728 1223518
10157 1223518 1292613 1381192 1504271 1539697 1375608 1233220 1185973 1154522 1085663 1068576 1027343
10146 1027343 1072749 1231702 1348609 1350218 1217531 1135923 1072567 1046633 1055722 971959 933943
10135 933943 1006511 1059153 1073065 1029373 951189 948850 884850 749686 723610 738012 744352 783160
10123G83160r948r4408N197J2114q4263r8398M8171l0070o149J14424j3289j16986
10111E09555n3205L588R5706Q025p5660J6146p5262q6983k3909m623M780J5637
10099C33795K7525M4074m0803K5671J29452Q3601j6764l1853k2426l9357l1617
10088D61298L4090o6790j96764M3526K5942L7473J6619j5531p8817L6737M3757
10077C41540K3942N426O543j7896J6928K2660j0652j8503l868J2311m8847o0683
10065B68901K5801R633k0436n8134J3925O1292Q4365n9054L4702K8024o5600q4785
10053B38634N809R9163j9609N174M4388K8950j06379j27131m8109M9594J24438
10042B94922J03159P4609r733R0513l0132r2126j24386m6462J1217j6816r1940
$$ plain form
10123 783160 773212 678804 684001 696115 611852 513454 561625 531555 525406 639830 626541 509555
10111 509555 456350 459938 555644 563669 488009 504155 428893 341910 318001 313378 318158 333795
10099 333795 361320 405394 364591 390262 519714 603315 586551 554698 532272 492915 461298
10088 461298 495388 428598 231834 275360 301302 338775 355394 339863 261046 297783 341540
10077 341540 365482 370908 377451 359555 376483 399143 388491 369988 366120 378431 329584 268901
10065 268901 294702 304335 283899 225765 239690 300982 385347 326293 360995 389019 323419 238634
10053 238634 244443 343606 323997 329171 373559 402509 296130 168999 120890 170484 294922
10042 294922 398081 472690 462957 553470 523338 431212 306826 260364 271581 254765 162825
10031A62825j9736J5973J14895r826l8802n9373K5695P0414O5336j9619p3752
10020B34030k0970N5735n8570j7068q2350J14362N6958j7219o4069L3021J65965
10009C99825j4190j63405k0144o2750r01M6903k4030l3398L9884L1523o2958l9933
9997I6426J04056J9p0408k8755J2415j1112J3737J58956L2442l335p4461l0187
9985A99793L5637j01808m0202N3797k3732M1826P916m8378n505K0507P8324k0395
9973A97780q780m0031j7636l5386R9128O2839l2784k6984Q494L4183N7882k4833
9961B73872o7505N6026n5936p6697j9746O7175O3802R1721r316r3411m9798Q9048
9949B69235M6336J3633Q3650l7025r2189j25126k9939P797R7296J0826K8618J13255
$$ plain form
10031 162825 143089 159062 273957 264131 225329 165956 191651 262065 327401 307782 234030
10020 234030 213060 268795 210225 193157 110807 225169 282127 264908 200839 233860 399825
10009 399825 385635 222230 202086 139336 138435 185338 161308 127910 167794 199317 136359 96426
9997 96426 200482 200501 130093 101338 113753 102641 116378 275334 307776 304441 229980 199793
9985 199793 235430 133622 93420 147217 123485 165311 173227 124849 119344 139851 218175 197780
9973 197780 189000 148969 131333 95947 195075 257914 225130 198146 206640 240823 298705 273872
9961 273872 206367 262393 206457 129760 110014 177189 240991 332712 323396 229985 180187 269235
9949 269235 315571 329204 412854 375829 283640 158514 128575 136372 233668 244494 273112 386367
9937C86367m5083m4736k2674K2104Q551M3234r485n926j5869k2188j00181Q1008
9925B75122J82700J55891Q4517M7506J55422K51835K78797K56751J65606J57895
9915B012042J73601L2562n6953k2610N0606N0582q8231j74967k30344k58302k63737
9904A224249j35760k02404p0687k08507j97852J7525m3327j9973k2447j0791M2379
9893C72405N9823k5025r2489o3961j9953J04866M1126p9323n2992k6524J0041
9882B27994J5768K6532l7205j06182N6952N1431o6571m9222j9106J4077K7623
9871A42091N823M3188O7350O3314L016M9016q8302o3949O170K5108l4155j1693
9859B06977K6549R4499n1816j6688o7445J13298k9256j32996j5956O082J0189
$$ plain form
9937 386367 341284 296548 273874 295978 304529 347763 338278 332352 316483 294295 194114 275122
9925 275122 457822 613713 698230 745736 901158 1152993 1431790 1688541 1854147 2012042
9915 2012042 2185643 2218205 2161252 2138642 2189248 2239830 2151599 1976632 1746288 1487986 1224249
9904 1224249 1088489 886085 815398 606891 409039 426564 383237 363264 340817 330026 372405
9893 372405 432228 407203 314714 250753 230800 335666 376792 297469 244477 217953 227994
9882 227994 243762 270294 233089 126907 183859 235290 168719 119497 100391 114468 142091
9871 142091 147914 191102 258452 321766 324782 373798 285496 221547 227717 252825 218670 206977
9859 206977 233526 328025 276209 259521 192076 305374 276118 143122 127166 133248 143437
9848A43437K2331k8454N577p0974o2545N3619J33365N2560L5164k243k757n5963
9836B23117O2352n8965j19479M3225P1105P2732k1291l1797J993P2339l362m7838
9824B64131J8889l5429n1204l4693p6932n486L3339q414r3282M7851R3978J3462
9812A66210L904m5327q3897j9491Q2925J2689n2732J0611J10823j9994p3623M7529
9800A39627O1393J7370O5824R1719O6902j58434j13737J04234M7065n9385j45106
9789A17472n3038K8628L1157N2557J18781R8042J54124R5592K16621K92133K72786
9778A424855J7j66386k18868k29785k04086p3421q3145k02531o5330O3041J8878
9767B63239j9321q0424o3577N0045n9543p227k4490N8543m9340l4191J2160O7778
$$ plain form
9848 143437 165768 137314 142891 71917 9372 62991 196356 248916 284080 281837 279080 223117
9836 223117 285469 226504 107025 150250 221355 294087 272796 240999 242992 315331 311969 264131
9824 264131 283020 247591 196387 161694 84762 79276 112615 104201 10919 58770 152748 166210
9812 166210 170114 124787 40890 21399 104324 117013 64281 74892 185715 165721 92098 139627
9800 139627 201020 218390 284214 375933 442835 284401 170664 274898 321963 262578 117472
9789 117472 64434 93062 124219 176776 295557 393599 547723 643315 859936 1152069 1424855
9778 1424855 1424872 1258486 1039618 809833 605747 532326 449181 246650 181320 244361 263239
9767 263239 243918 163494 99917 149962 90419 83192 58702 117245 67905 33714 45874 113652
9755A13652L2199J2527r279M5747j45221N4197K1281L0740J1828R2688J325j01241
9743A60443o7241n429P7897J47706m4919j83195r5762P4303L8853r611M8269K9668
9731A70982p0242J8907O5294L9603p0208m9000j6020l7265j5410Q7079P5160K148
9719B01028J7742l0156p9613l6228L0648N0284j37651K6698N2435K4846J3042
9708A33075J9372J04108J7685m4042o7510j43404J0781L9918k3907O547m5740
9697F883R062O4125p016j6944r6505J288M0593l1845J67443J4793j38152r2116
9685g8391N3086n3824m0961K4496J09432N9208l634O0337p2589k6671l8564Q0565
9673G2490j2579j08318m2564J06006L3824N7142J13752p9317m5181j8713K0881
$$ plain form
9755 113652 145851 158378 149099 194846 49625 103822 125103 155843 167671 260359 261684 160443
9743 160443 93202 87773 165670 313376 268457 85262 -10500 63803 102656 93045 141314 170982
9731 170982 100740 119647 184941 224544 154336 105336 89316 52051 36641 123720 198880 201028
9719 201028 218770 188614 109001 72773 103421 153705 16054 42752 95187 120033 133075
9708 133075 152447 256555 274240 230198 162688 19284 30065 69983 46076 52623 6883
9697 6883 15945 80070 73054 56110 -40395 -39107 1486 -30359 137084 151877 13725 -78391
9685 -78391 -25305 -79129 -120090 -95594 13838 73046 69412 129749 57160 30489 -8075 72490
9673 72490 59911 -48407 -90971 15035 48859 106001 219753 140436 95255 76542 97423
9662I7423J12282N8836O4478J4499M3180J62801K54533N76444O26043N4497k14246
9651A850770l33369l45506l31076l21995k35853j25360L9795j2932j10959l1004
9641D2511o3851l6509J1249P9204O8156O8510P2722p1681o6631n3695P542J7074
9629G4601P8884Q748M7941r3422q9373o4758M302L4185j27826p2550J49450Q8839
9617C9021n7319j7645M0050R490r6509k780K3884K0000L6576j0870K7115Q1318
9605I2331j34173l4739k7042J34644M0704J1026o5232o6418Q3283O0564L7910
9594A32858L9552q4760r3050M7252O3968M9263r915L4671l7032j47863J0616J17710
9582A23270O8303m95K7696K7651N336l6888r5072r4610J1634n0774n6402N5218
$$ plain form
9662 97423 209705 268541 333019 347518 390698 553499 808032 1384476 2010519 2065016 1850770
9651 1850770 1517401 1171895 840819 518824 282971 157611 197406 184474 73515 42511
9641 42511 -21340 -57849 -46600 32604 100760 169270 241992 170311 103680 49985 57527 74601
9629 74601 153485 162233 210174 116752 27379 -37379 -33077 1108 -126718 -199268 -49818 39021
9617 39021 -18298 -35943 4107 13597 -82912 -85692 -61808 -41808 -5232 -16102 11013 92331
9605 92331 -41842 -76581 -103623 31021 71725 82751 17519 -48899 34384 94948 132858
9594 132858 172410 87650 -5400 41852 105820 155083 145168 179839 142807 -5056 5560 123270
9582 123270 191573 191078 218774 246425 251761 214873 119801 25191 36825 -13949 -70351 -15133
9570a5133J01849O1541j16O2381l1680r319p7594p003K7421K7264k9868n3449
9558E6294j1004O2072K1656m6496j53684n327N7279L1569l5951N2250l5476N1871
9546D5053O5029M0158j4947Q5605j58967j66528m8453J10505O6744R2103J2795
9535A29097r8855J9142M3985l8990O8190n1030n0868j2512M6538J00214O1573
9524B16484j8441O339o8050n0956n2789M4939P1225o7231M8184P9932J2436p732
9512B14340m4297j15916q037O9334q7810j37580j02323l5797J64008O8277O8121
9501E2320L7098J3928N9805l2652o7541J46095L0087j6044n8945l4495m0157J4188
9489A03687O6585j7393j1987j74274l3133P2638M4297p4573L5656J2955l4649
$$ plain form
9570 -15133 86716 148257 148141 210522 178842 169523 91929 84926 112347 139611 109743 56294
9558 56294 45290 107362 129018 82522 -71162 -76489 -19210 12359 -23592 28658 -6818 45053
9546 45053 110082 150240 135293 220898 61931 -104597 -153050 -42545 24199 116302 129097
9535 129097 30242 49384 93369 54379 122569 71539 20671 8159 54697 154911 216484
9524 216484 198043 204382 136332 85376 32587 77526 148751 81520 129704 209636 222072 214340
9512 214340 170043 54127 46090 115424 27614 -109966 -212289 -248086 -84078 -15801 52320
9501 52320 89418 103346 163151 130499 62958 209053 239140 223096 164151 129656 89499 103687
9489 103687 170272 152879 140892 -33382 -66515 6123 50420 -24153 11503 24458 -10191
9478a0191N9765j3182L3831L6604N3046J6299J0224q4012l1553l2993K9510P8541
9466A45889J5489M1826m3036o0102J3652M0512M896m2429j1200o063n0677j45486
9454i6729o8906j2363K3435L8880K8981J3188L1979J7975Q978k8574P8670L0891
9442F6405m8514L6348o0817p4970J05896N7295k4884Q9871N5681j27028r4187
9431a8904P6731P1978J17574j0004j8029k3598l3052K2734N7999j1953l3443j04511
9419I3522J3538n4773l2156n91o4397R061K6077K1845L8253q9048k4895L3723
9407b9841J25332P9083q5550n2957o4149p8087m0858l1898R3386K7702m8652l1774
9395a38263J01956J3499m1706M372J8942p5032o3665Q2458J20046O0107m558J9740
$$ plain form
9478 -10191 49574 36392 70223 106827 159873 176172 186396 102384 70831 37838 67348 145889
9466 145889 161378 203204 160168 100066 113718 154230 159126 116697 105497 99434 48757 -96729
9454 -96729 -165635 -177998 -154563 -115683 -86702 -73514 -41535 -23560 -14582 -43156 35514 66405
9442 66405 17891 54239 -6578 -81548 24348 81643 56759 146630 202311 75283 -18904
9431 -18904 57827 129805 247379 237375 219346 195748 162696 185430 243429 231476 198033 93522
9419 93522 107060 52287 20131 19540 -44857 -35796 -9719 12126 50379 -38669 -63564 -29841
9407 -29841 95491 174574 89024 36067 -28082 -106169 -147027 -178925 -85539 -57837 -106489 -138263
9395 -138263 -36307 -22808 -64514 -60142 -41200 -116232 -179897 -97439 22607 82714 78156 97896
9383I7896r84p2196P9984P5499j62830k3019P3142J07051m8554o4242L5514j144
9371I6117j27257j00636O975R9376L9381Q9388N0998r0511j04092O8394m3254
9360a5121k7383K4338k1891O0133q340k73O0182m5790l2748m7616q0781M0607
9348i4683P8104R8197J2298m1280J9065L0621j272j0110L7596J02466P462o4127
9336A74337O002Q4420q5353j63620m4757o6293l7339K6745R4927N0162R997J713
9324E0941L7970p3570p6633l184n6194N8809O5525J1738j5670L6513Q9856M596
9312A30697k2536l4212p2194k1831J606J5050O8060m8189L5115p3520L3605L7555
9300D9206N7580N75j11289O8859N2437k4737q4215q0839O552P330K8194M4326
$$ plain form
9383 97896 96912 24716 104700 180199 17369 -5650 67492 174543 125989 61747 97261 96117
9371 96117 -31140 -131776 -124801 -25425 13956 103344 154342 63831 -40261 28133 -15121
9360 -15121 -42504 -18166 -40057 20076 11736 11463 71645 25855 -6893 -54509 -135290 -94683
9348 -94683 -16579 81618 93916 52636 71701 102322 101050 90940 128536 231002 238464 174337
9336 174337 180339 264759 179406 15786 -28971 -95264 -132603 -105858 -10931 39231 49228 50941
9324 50941 88911 15341 -61292 -64476 -120670 -61861 3664 15402 -268 36245 126101 130697
9312 130697 108161 73949 1755 -20076 -18470 -3420 64640 16451 51566 -21954 11651 49206
9300 49206 106786 107361 -3928 64931 117368 92631 8416 -72423 -65871 -58541 -30347 13979
9288A3979n0472p5980q690P5644K8082k2294j151K5836L4413N8257M4383j7892
9276A04115o3276p739K079l2063R0738O1708p2658j04768m0462Q7775l925j24625
9264a03101k164k292n5488N9871J79404J24051n4735p3187j24910j1986P4307
9253I770K2911J9484n6846j6903P4187O491O3632k3413O8016N3709K8607n7390
9241A92255p5073j2071o5103r4991L8819J35692P6008l4607k9740n6729M53L6617
9229A11530L0045N3950n9016l7227m5414p977P636j8613J04138M3418r4565m447
9217H3458K6083p0437j8239R1723L955k4961j1927L6857k2695r7223r5408J8491
9205h0323M4918l0630K0263P8014R1738k0634j46049N9820j3750o189J046N2982
$$ plain form
9288 13979 -36493 -112473 -121163 -45519 -17437 -39731 -40882 -15046 19367 77624 122007 104115
9276 104115 40839 33100 35179 3116 93854 155562 82904 -21864 -62326 25449 21524 -103101
9264 -103101 -105265 -107557 -163045 -103174 76230 200281 145546 72359 -52551 -64537 9770
9253 9770 32681 52165 -4681 -21584 52603 59094 122726 99313 167329 221038 249645 192255
9241 192255 117182 105111 40008 -54983 -16164 119528 195536 160929 131189 74460 74913 111530
9229 111530 141575 195525 136509 99282 53868 45891 53527 34914 139052 182470 87905 83458
9217 83458 109541 39104 20865 112588 116543 91582 79655 116512 93817 -3406 -98814 -80323
9205 -80323 -35405 -66035 -45772 32242 123980 103346 -42703 17117 3367 -2822 -1776 51206
9193E1206L6084P9954N4101M1977j09271R461j06877j00747l1159j8375J08672
9182A5026Q1579L5820j1006n8325j41499J2077M1595Q4226o3920m0695N4774Q4716
9170I4368R1416j9199o5990n3097n0922Q1832J34748p8147P5084O5486K1415j3127
9158B83867j23135q5867m7702j0296J04923q7550r5884N4893J10046R276o9864
9147D2707j9417l615P428l5814J9568j088J9673o7863K0862j8255L9056j7888
9135a4646Q3536j837l8954l1538q8536l7487J5712J90215K2200k4975l7055J5295
9123E1930M3103M2961j0226M1567l8202o4795K6097r641q6430L5942N7831o5183
9111B4954K0596j2765m7836R4705J21482j25317k1769N2168J9683j1687m1465
$$ plain form
9193 51206 87290 167244 221345 263322 154051 163512 56635 -44112 -75271 -93646 15026
9182 15026 96605 132425 121419 63094 -78405 -66328 -24733 59493 -4427 -45122 9652 94368
9170 94368 185784 166585 100595 47498 -3424 78408 213156 135009 210093 275579 296994 283867
9158 283867 160732 74865 27163 16867 121790 34240 -61644 -6751 103295 112571 42707
9147 42707 23290 19675 27103 -8711 10857 9769 29442 -38421 -17559 -35814 3242 -14646
9135 -14646 68890 67053 28099 -3439 -91975 -129462 -113750 76465 98665 73690 36635 51930
9123 51930 95033 137994 127768 169335 131133 66338 92435 82794 -3636 32306 90137 24954
9111 24954 45550 32785 -15051 79654 201136 75819 54050 106218 125901 114214 72749
9100G2749J1135N3203K0825n4719r9165k7000K4249P9170N5962q5204p9846J1719
9088a6922j2098o1327l7019J64277L0257n1765j02188r307Q669j1044L7927Q2975
9076B2435K7168n1854N44N3766j7779Q814N5457L4281k6159j17569J15548O1034
9064A65686n5620m7065p2141Q443l7517L4917j8426j9465n3927m9334o777P4984
9052g6242Q4831N8702M248J13166N9506q4635r8718o2619p208P3194J0586o9397
9040E414L1024J37403K0499j4347n4570j0671K2122j59086r9883K1735O4394K6626
9028i340k1097K1013m5791p6958P6288p359j4632J05865M8146k0695o2834l3581
9016d0975J8659O6488k7704l195k4455M1992L5231M7337r4266l8361N022l2558
$$ plain form
9100 72749 83884 137087 157912 103193 4028 -22972 1277 80447 136409 51205 -28641 -16922
9088 -16922 -29020 -90347 -127366 36911 67168 15403 -86785 -96092 -87423 -98467 -60540 22435
9076 22435 49603 -2251 -1707 52059 34280 43094 98551 132832 106673 -10896 104652 165686
9064 165686 110066 63001 -9140 -697 -38214 -3297 -21723 -41188 -95115 -144449 -151226 -76242
9052 -76242 8589 67291 71539 184705 244211 159576 60858 -1761 -8969 64225 74811 5414
9040 5414 36438 173841 194340 179993 125423 114752 136874 -22212 -122095 -100360 -35966 -9340
9028 -9340 -30437 -9424 -55215 -132173 -55885 -63244 -77876 27989 76135 55440 -7394 -40975
9016 -40975 -22316 44172 16468 13273 -11182 30810 66041 113378 19112 -19249 -14227 -46785
9004d6785k8171N9733M7246m3504m4694j7589J4112Q8642K6743N4107M4793j06513
8992D8120r7854K447M2728j4689m3027j08171n819O534K7955j8591J0879m070
8980a53558R7125J44065J4806k606K7374j15995n0189k2367P6546O3883k2929
8969E6155M1641J25395P63q077n1365j21310r3584j7715N2428K8594L0550L9867
8957H3342j3675L7086p1762j21908J6105M91r1619Q7051J26309J25328P9896p8443
8945A78201k6930j11775r3220q660J0076J02382N3482j09998j29617r9920N8006
8934a77973K27497J00499L5559J0341j25210r8834P1963J22692L0664J4640j34545
8923G7293r1346j4029p0377r603O3985P3651K571j2192J43993k1860n7419L7520
$$ plain form
9004 -46785 -74956 -15223 32023 -11481 -56175 -73764 -59652 28990 55733 109840 154633 48120
8992 48120 -49734 -47287 -4559 -19248 -62275 -170446 -176265 -169731 -141776 -160367 -149488 -153558
8980 -153558 -56433 87632 102438 99832 127206 11211 -38978 -61345 15201 79084 56155
8969 56155 97796 223191 223954 215877 164512 43202 -50382 -68097 -15669 12925 43475 83342
8957 83342 69667 106753 34991 -86917 -70812 -70321 -161940 -74889 51420 176748 256644 178201
8945 178201 151271 39496 -53724 -62384 -52308 50074 103556 -6442 -136059 -235979 -177973
8934 -177973 49524 150023 185582 195923 70713 -28121 43842 166534 197198 211838 77293
8923 77293 -14053 -28082 -98459 -108062 -44077 29574 32145 19953 163946 142086 84667 122187
8911A22187P480o6738l3787L1476M3802J3345k8842o8853m2990q7672m2535J26443
8899b6684J6367m8711j4102O6925j357M8529m9547r1712n9498N5500J3880M3061
8887d7349n0997O3568L4272q9119q2256J6234Q3089R6460J7870L1321O878m6064
8875C3907J8195n5512q334m4545q8838O7793P9022o1628L8254Q7488M5627k5401
8863H6028j55210j12832K0117J01141M1652N1897j5689r9118j4140j3304L0459
8852g8999J14003N588n5463q9274p0774N3576Q363q3828N3744J08276l9794L0903
8840d3679Q1601K8772l5296k2658r8547k1377M9694o4581l4276K342J6430L7241
8828a04334M2236N3712o1848o0821O2243J7595n5525N0782J20314n3299o5827
$$ plain form
8911 122187 129667 62929 29142 60618 104420 117765 88923 20070 -22920 -110592 -153127 -26684
8899 -26684 -10317 -59028 -73130 -6205 -7562 40967 -8580 -100292 -159790 -104290 -90410 -47349
8887 -47349 -98346 -34778 -506 -89625 -171881 -155647 -72558 23902 41772 73093 79971 33907
8875 33907 52102 -3410 -11744 -56289 -145127 -77334 1688 -59940 -21686 65802 111429 86028
8863 86028 -69182 -182014 -161897 -60756 -19104 32793 17104 -82014 -96154 -109458 -78999
8852 -78999 35004 40592 -14871 -104145 -174919 -121343 -112980 -196808 -143064 -34788 -74582 -43679
8840 -43679 37922 66694 31398 8740 -89807 -111184 -61490 -126071 -160347 -158005 -141575 -104334
8828 -104334 -62098 -8386 -70234 -131055 -68812 -51217 -106742 -55960 64354 11055 -54772
8817e4772M5043N9610j18543k7997J8234j05385k0809J81214J01630l0436r2759
8806d4970l2775m3625J2316l9314O1729J00701k407N2105Q5855M0034L90p8138
8794A11901j20168k7879n5633Q1069J02985k3006q2326J9744M2170q836M545j12462
8782f7896j16389J3701J40918M0003m5219j3410L8092P8639M5597p9266r6886
8771f2116p810J14540J48849L1301o6888Q031j11725j32088M7958J01563P3436
8760A45051p6673r938p5325m1337k3320K9051K6930O2670O9408o5214l0381L9094
8748E0016N5055l1023l5577p864J578J6902o8065R579Q2576q9308j36542Q0576
8736g2097R3254R3401K7113r2407n2961N3883j4702j43433L6743M9709Q038J2611
$$ plain form
8817 -54772 -9729 49881 -68662 -96659 -78425 -183810 -204619 -23405 78225 47789 -44970
8806 -44970 -77745 -121370 -109054 -148368 -86639 14062 11655 63760 149615 189649 190039 111901
8794 111901 -8267 -36146 -91779 -10710 92275 69269 -13057 6687 48857 40021 44566 -67896
8782 -67896 -184285 -170584 -29666 10337 -34882 -48292 -10200 68439 114036 34770 -62116
8771 -62116 -69926 44614 193463 224764 157876 165907 54182 -77906 -29948 71615 145051
8760 145051 68378 58440 -16885 -58222 -81542 -52491 -25561 37109 106517 41303 10922 50016
8748 50016 105071 74048 38471 30607 32185 49087 -18978 -9399 73177 -16131 -152673 -72097
8736 -72097 21157 114558 141671 49264 -3697 50186 35484 -107949 -71206 -21497 -13459 -848
8724h48p9533r9540l8543J0356R6351R3312L308K0808J9211l1060J4687l2028
8712b3519k7337J24611Q221l797n6330q695n075l6978L8862P9311M5043j77668
8700d3351q1175J4165O8442M3647k1341M4432j5469O3840q77p5843j623m2042
8688d7195n6389K7936M0413J5002L3550j2967j45762R4484J32191J8748K703l1660
8676G1054N052N64j43247p3789J48727M6529l7365l9664P7324N8402M2798J0287
8664A66672m4938j00991N1421l8393m8082P7593n409j04351n5437P4099Q1036
8653E3220J01384l7391l2055k3946M3930L6017J974m9387M7626l1608m8648Q5804
8641A46920p8514j29388k3541l1713j8225J07444J41649o8615K4576K8263n8453
$$ plain form
8724 -848 -80381 -179921 -218464 -208108 -111757 -18445 -15137 5671 24882 -6178 8509 -23519
8712 -23519 -50856 73755 81976 78179 21849 13154 8079 -28899 9963 89274 134317 -43351
8700 -43351 -124526 -110361 -41919 1728 -19613 24819 9350 73190 72313 -3530 -5153 -47195
8688 -47195 -103584 -75648 -35235 -20233 13317 350 -145412 -50928 81263 100011 102714 71054
8676 71054 76106 76670 -66577 -140366 8361 54890 17525 -22139 55185 113587 156385 166672
8664 166672 121734 20743 72164 33771 -14311 63282 57873 -46478 -101915 -27816 53220
8653 53220 154604 117213 85158 61212 105142 141159 143133 93746 141372 109764 61116 146920
8641 146920 68406 -60982 -84523 -116236 -134461 -27017 114632 46017 70593 98856 40403
8630D0403J7946l3673j41542J3153K1794R7607j4505K5210P2125K9082J1683j6136
8618A23147J9523o2095J014l278N3159O5249M1101o5985j36592J8822L4488L5733
8606A24286N4771N4912q7506J1252p1222k5446O5093J14998j3990q1588O1074
8595B06634O6763M4330R137m0972j37120J6993J68343O5269p7169k2699r3821
8584B05688k0442m4511m867N756O2253J0394o4032q5118M0658J5819m9545O8712
8572A40765O6900R1281P9159j24459k24971J04129J10560J5643k5225n8523j6516
8561A58743l362r2023J9843M3978l5927l488K1469q9868o8679j14482j20585J645
8549b82736J25253r122o97Q0170J75085j1683j28132n8221O882J45155k7024l2084
$$ plain form
8630 40403 58349 24676 -116866 -103713 -81919 15688 1183 26393 98518 127600 139283 123147
8618 123147 142670 80575 81589 78311 131470 196719 237820 171835 35243 54065 88553 124286
8606 124286 179057 233969 146463 157715 86493 61047 126140 241138 227148 145560 206634
8595 206634 273397 317727 326864 285892 148772 165765 334108 399377 322208 299509 205688
8584 205688 185246 140735 135868 141624 203877 214271 150239 65121 105779 121598 72053 140765
8572 140765 207665 298946 378105 253646 28675 132804 243364 259007 233782 175259 158743
8561 158743 155381 63358 83201 127179 91252 87764 109233 19365 -49314 -163796 -284381 -282736
8549 -282736 -157483 -166605 -167302 -87132 87953 76270 -51862 -110083 -103201 41954 14930 -17154
8537a7154J58915K9670j2654N0839k224J00119R9851j05352j68810j30102o2268
8526e9170O4501M953k3691p0766K7036O9734Q3236P4549m5457j24453l0766q105
8514c8399O3119R1326K9265M1106l9388l5287n0851K6029N6545o656L7010o3001
8502A10818n4743K250M8621j02q8092J63o2623n4682N2221L8160R7796O6636J21199
8489B77622Q0932J76962K46268R0113p4274n1089r6440k18133p0836o5256j63922
8478A31947j7193m724j17448j6404j4694Q1600J15K6149q7233o5403M2227l5788
8466g6849P4315l9694o1823J2003Q3231k394Q3808K7651J8946K9211J092q9343
8454F0154L2475O1669o8409r984k2112q862J52121J54028k2338k6219M0426J33707
$$ plain form
8537 -17154 141761 171431 158777 209616 207392 307511 407362 302010 133200 3098 -59170
8526 -59170 5331 10284 -13407 -84173 -57137 12597 95833 170382 124925 472 -30294 -38399
8514 -38399 24720 116046 145311 186417 147029 111742 60891 86920 143465 136809 173819 110818
8502 110818 56075 58325 106946 106844 18752 18915 -43708 -98390 -46169 -8009 89787 156423 277622
8489 277622 358554 535516 781784 871897 797623 746534 650094 431961 361125 295869 131947
8478 131947 114754 110030 -7418 -23822 -38516 43084 43199 69348 -17885 -83288 -41061 -76849
8466 -76849 -2534 -42228 -104051 -92048 -8817 -11211 72597 100248 119194 148405 149497 60154
8454 60154 92629 154298 85889 75905 53793 44931 197052 351080 328742 302523 342949 476656
8442D76656J35493k0830r9656n6203n2328m1693j09121o6540q2910k146J7845
8431I8567J7336j3376l4998K2122j7586J1405n2230p3130K7640k4746l1980O3196
8419g780O0599K5640O759j20638n2881L8658j6331P5445L4174k8254P1039J6834
8407A03264l1071k4398K4147L8318P7525m5243q0785k5347k0215j12978l6622
8396a33405Q71r870J3710Q0109K9268P5361Q3104r0717o0676L4460L7138Q0664
8384A40017K9632o4851m5418M727j0738j3287j3050p649p620Q9668r829o4985
8372B6617k0563L7665K6976k7815N4608k9527o8134M348l0175N6368O1962q663
8360H3667m4938Q4514p3368o9809l6400J7436J28832m3063j8873k9284K6938O1815
$$ plain form
8442 476656 612149 591319 491663 435460 383132 341439 232318 165778 82868 80722 98567
8431 98567 115903 102527 67529 89651 72065 83470 31240 -41890 -14250 -38996 -70976 -7780
8419 -7780 52819 78459 85218 -35420 -88301 -49643 -65974 9471 43645 15391 86430 103264
8407 103264 72193 47795 71942 110260 187785 142542 61757 36410 16195 -96783 -133405
8396 -133405 -132534 -142404 -128694 -48585 -19317 56044 139148 48431 -12245 22215 59353 140017
8384 140017 169649 104798 59380 64107 53369 40082 27032 19383 11763 101431 91602 26617
8372 26617 6054 43719 70695 42880 97488 67961 -173 4175 -26000 30368 92330 83667
8360 83667 38729 123243 49875 -19934 -56334 -38898 89934 46871 27998 -1286 25652 87467
8348H7467j6747J3405K9043j3066p5970n1460J5788L251R5132Q9619p4312j08976
8336f826R488r482M2331O6401N4104l3150o2761O4565n0288k0068O325n8131q7491
8323h4983n3759l5191K1410p947J33982J9534N4817N848j8435q4966l7396k1342
8311a08428q9622J50531R7452L7188n1478j35n418J0320Q9722j343j9793P7049
8299A86045l8049N494J04656m7356N3967j21076p6277n8824J7163j9895j03218
8288i7370N5153J18941n023o7774N668l018k3512m8373q6674n4486R0145K6182
8276i0141m2511M0604Q9055O1850L2226j41870k13348P527J72716j5674J4981
8265h4585R7956J1093L7142O78J2494o2678L5477L7809m8650j31926j51284L5227
$$ plain form
8348 87467 70720 84125 113168 100102 24132 -27328 -11540 -8289 86843 176462 102150 -6826
8336 -6826 2662 -6820 35511 101912 156016 122866 60105 124670 74382 54314 60639 2508 -84983
8323 -84983 -138742 -173933 -152523 -160470 -26488 -6954 47863 53711 35276 -49690 -87086 -108428
8311 -108428 -198050 -47519 49933 87121 35643 35508 30090 40410 130132 128789 108996 186045
8299 186045 147996 153490 258146 210790 264757 143681 67404 8580 25743 5848 -97370
8288 -97370 -42217 76724 71701 3927 9595 6577 -16935 -65308 -151982 -206468 -116323 -90141
8276 -90141 -132652 -92048 -2993 58857 91083 -50787 -264135 -256608 -83892 -99566 -84585
8265 -84585 13371 24464 61606 62284 74778 12100 47577 85386 36736 -95190 -246474 -211247
8253b11247R1831N753N4976K09048j0752l3750n8132l8812N8052K2281l9289n5611
8241e652M2605j9749l3710J3394J3934q686J13604K5977j61598m5461P4593j7266
8229h015N0900L1840L1555m7376j28962K0337O3697N0386N6159q5200k6632L0403
8217C9092O9042K4370m7222P241Q4376r304l8181n0992j8441l6546L3621J12841
8205A69897N7419o7272n3758n1177r5734P9143j8984P894J72378J63212j53861
8194B09157j16492o8920l9696O6873l7824p1094K3007Q507m1321k2731k0084N3843
8182e6775j7633n930l3978Q096n2074J123N8380O6851L4452J1542m1538o5061
8170i2545j3254P6545O6039L533R80r2250J6560l5390M7855Q1951o2219q5818
$$ plain form
8253 -211247 -119416 -113663 -58687 150361 139609 105859 47727 8915 66967 89248 49959 -5652
8241 -5652 36953 17204 -16506 -3112 10822 2136 115740 141717 -19881 -65342 9251 -8015
8229 -8015 42885 74725 106280 58904 -70058 -49721 13976 64362 120521 35321 8689 39092
8217 39092 108134 132504 85282 92523 176899 167595 129414 78422 59981 23435 57056 169897
8205 169897 227316 160044 106286 55109 -40625 38518 19534 27428 199806 363018 209157
8194 209157 92665 23745 -15951 50922 13098 -57996 -34989 -26482 -67803 -90534 -110618 -56775
8182 -56775 -74408 -80338 -114316 -106220 -158294 -157171 -98791 -31940 2512 14054 -27484 -92545
8170 -92545 -105799 -29254 36785 40318 41298 -50952 -34392 -69782 -21927 60024 -2195 -88013
8158h8013N4271M9131j22446K0014J77575J5200q7083K2702o6049r0096L6510
8147g8284J11201J31001j23139j36069N1755n9300r5523J393J32956J61848K8044
8136A25883k2370j6500q6100n0494L7004O7009k4155p1441r738j7502K0367m5421
8124i3458n7147J8009L7724M0344L4601L591l9553p0489l431Q6N4440O1585N0062
8111C6364k1414N2369j4518J6191K3937k9932R013l0062m766J218l399L4910j7632
8098E2279k1687l6806O9534n7760j23039J44100J33272q7144n1037j9336J6990
8087A9366o0000j03673l1811O0608J25185k2575J1357J5143k8838n0049k1003
8076h6290K4499P407R1848P3576K4397k8638j27311n0125j110K9403l7984l1584
$$ plain form
8158 -88013 -33742 15389 -107057 -87043 90532 105732 18649 41351 -24698 -114794 -78284
8147 -78284 32917 163918 40779 -95290 -43535 -102835 -198358 -196965 -64009 97839 125883
8136 125883 103513 87013 913 -49581 -12577 54432 30277 -41164 -50902 -68404 -48037 -93458
8124 -93458 -150605 -132596 -94872 -54528 -19927 -16336 -55889 -126378 -129809 -129723 -75283 -13698 36364
8111 36364 14950 67319 52801 68992 92929 62997 72010 41948 37182 38400 35001 69911 52279
8098 52279 30592 -6214 63320 5560 -117479 26621 159893 72749 21712 2376 19366
8087 19366 -40634 -144307 -176118 -115510 9675 -12900 -1543 13600 -15238 -65287 -86290
8076 -86290 -61791 -54384 37464 111040 135437 106799 -20512 -70637 -71747 -42344 -80328 -111912
8064a11912M5865N7660M9187o8937j5156j2893Q8098K698K1281k9365K5119o5454
8052a3809l8778J7419o5062L5466K6582O3107m3430q3407P8513O2612J11872K6975
8040A78060r3435P745o1016o1731O0250K4423n4406l2773M2050K5919K7467m8171
8028A4382P8960J08366l8630j19153j22445J6624M5480Q1628O9424L338m1367
8017I6607N91J3043L1815j524j0191J8658k6829j63294R7118K9454O824r5639
8005c367k3744m4192J07658N1844N3327n2958j5561k846L3967n3242p0205J1272
7993h047M6887r0L0651j547J10287J59813k2132n712J04490N3980j09737j41373
7981B17470J965k3091m9849l0150M1649o5651k2804j9066j1815l3840j09147o5429
$$ plain form
8064 -111912 -66047 -8387 40800 -28137 -43293 -56186 31912 34610 55891 26526 51645 -13809
8052 -13809 -52587 -35168 -100230 -64764 -38182 24925 -18505 -101912 -23399 39213 151085 178060
8040 178060 84625 92370 31354 -30377 29873 54296 -110 -32883 9167 35086 62553 14382
8028 14382 93342 201708 163078 43925 -78520 -61896 -16416 65212 134636 137974 96607
8017 96607 97198 110241 142056 140532 130341 148999 122170 -41124 55994 85448 92272 -3367
8005 -3367 -27111 -71303 36355 88199 141526 88568 73007 70161 104128 50886 -19319 -8047
7993 -8047 38840 38750 69401 67854 178141 337954 315822 310110 414600 468580 358843 217470
7981 217470 219435 196344 146495 116345 157994 92343 69539 50473 38658 4818 -104329 -169758
7969a69758O548O3775L8378J23156O0865J04181K0993o2743o2376J8846M278n839
7957A40304n770n2057r2182m521R6773O3491J23275O8814k0635l9618M22J8102
7945B96398J91689K0204n7584j09576q9885k6605k8030l7379K681l341q9248j10473
7933d1149m1469M1484O5269m2091p1018K8638Q0445O9267P441o3406j08051k899
7921g7539Q1649n8641r3706n3697r8251J41356R8059m9742O8705P4574m7062O7596
7909E3301M5925L524r8309m8904k506j9324j9734J6834j9274O7918K4215J05298
7897A08964J26272K694n3488M2810K2480J8423j4503j52537j05862k566r4993
7886a02306n6401J28919N1515P1733M1437j7250q7983m9045L7157L5841l5786
$$ plain form
7969 -169758 -163210 -99435 -61057 62099 122964 227145 248138 185395 123019 141865 146143 140304
7957 140304 134534 82477 -9705 -14226 82547 146038 269313 338127 317492 277874 278296 296398
7945 296398 488087 508291 450707 341131 251246 224641 196611 159232 161913 158572 69324 -41149
7933 -41149 -82618 -41134 24135 -17956 -88974 -60336 20109 89376 96817 33411 -74640 -77539
7921 -77539 4110 -54531 -148237 -201934 -300185 -158829 -60770 -110512 -41807 32767 -14295 53301
7909 53301 99226 102750 4441 -44463 -46969 -66293 -86027 -69193 -88467 -20549 3666 108964
7897 108964 235236 237930 184442 227252 249732 268155 253652 101115 -4747 -7313 -102306
7886 -102306 -158707 -29788 21727 93460 134897 117647 29664 -19381 17776 53617 17831
7875A7831r9266n5202o5268K1305Q6066O0638L0001M2566l905K9919J04326m5027
7863A23984r6916k3905P7828R9632j15609l2009J46046Q2646l6203r8982j55727
7852b9215j07684j8016M3936P8991O4283N4005O750o6183r4125o1875L7649J05572
7840A4088Q9313n0860o1507l0667k0743K2809j8933j09950m8687J65298J0156
7829c9683K2221j22299r8659K4421R3941J28017J22505J3142o8701l2021j21591
7818g8707m1628R1434J19101J9369p667j5684K2970l1776n2057m5777o2091m5376
7806a27889O5362J01817o1226m0852k9661j9273m013k5761o648R4794M5162Q5037
7794G6849l8267n7546j7515K1459P817m4803O1204m2122p4052N58L8430p0459
$$ plain form
7875 17831 -81435 -136637 -201905 -180600 -94534 -33896 -3895 38671 34766 64685 169011 123984
7863 123984 27068 3163 80991 180623 65014 33005 179051 261697 225494 126512 -29215
7852 -29215 -136899 -154915 -110979 -31988 32295 86300 93050 26867 -67258 -129133 -91484 14088
7840 14088 103401 52541 -8966 -39633 -60376 -37567 -56500 -166450 -215137 -49839 -39683
7829 -39683 -17462 -139761 -238420 -213999 -120058 7959 130464 143606 74905 42884 -78707
7818 -78707 -120335 -28901 90200 109569 101902 86218 109188 77412 25355 -20422 -82513 -127889
7806 -127889 -62527 39290 -21936 -62788 -92449 -111722 -115735 -141496 -148144 -53350 -8188 76849
7794 76849 38582 -18964 -36479 -15020 -7203 -52006 9198 -32924 -106976 -106418 -67988 -138447
7782a38447M4826l5806j3374O1983k2631j05145l2815J22916J11175J8427K1137
7771C2246q4286q3176K5380k5249p113N7638J14657M5447j10136k6980k4994l0904
7759a17470j3780o529N6135K3881o9491M1942P2722m8287Q398k0316k8930K142
7747i9583J9084k2758m384L4789J09506K7039n9396r7852K6786K1854J3247K7518
7735d150O6302N264K9488k0313j10906Q4211L5582j1305j4598j9798l2298j27225
7723a19746P349o0354q0503M4082M3179O2576J1101p0803M4967K098K0263J03344
7711G553K1450j10934L6647J7086k6114l3857K5978N2080j8294l9203o5562o7136
7699b00306J9271L9717K6497P4008N2996p47L1079j6233j00838o9981j8785M3710
$$ plain form
7782 -138447 -93621 -129427 -142801 -80818 -103449 -208594 -241409 -118493 -7318 11109 32246
7771 32246 -52040 -135216 -109836 -135085 -142198 -84560 30097 75544 -34592 -61572 -86566 -117470
7759 -117470 -131250 -137779 -81644 -57763 -127254 -85312 -12590 -60877 -52479 -72795 -101725 -99583
7747 -99583 -80499 -103257 -107641 -72852 36654 63693 4297 -93555 -66769 -44915 -31668 -4150
7735 -4150 62152 67416 96904 76591 -34315 49896 85478 74173 59575 39777 7479 -119746
7723 -119746 -112397 -172751 -253254 -209172 -165993 -103417 -92316 -163119 -118152 -116054 -95791 7553
7711 7553 29003 -81931 -45284 -28198 -54312 -88169 -62191 -10111 -28405 -67608 -133170 -200306
7699 -200306 -181035 -141318 -114821 -40813 12183 11436 42515 26282 -74556 -144537 -163322 -119612
7687a19612P964k5976k9133k6064P6431l3712q8599n3403J71586O5240J7617K0750
7675a6911K8380m0874K8138J16781j1364k1692O4020J1198J2308N227p4101l4341
7663F6769q5871k7239m4190n5451M5714l5712M5685j7680k5167J6690Q4209M6992
7651A4749n1533o5623J06589k8429j34179L5732Q9690J1078p5224R5000k3995
7640b6145L199n0359l852l8316n1436R4217P5254N3976L8849J1204q4078k7661
7628e148j8609j01281M5786J54268J7701r2417l4984m4748j5905o5093L0271r871
7616a40030K1422J31179p1994j01402O2480J13951k6285m3047o6094J11660r020
7605a7180K6909K9751K20l6197l6675J25902j2635l1847M142O6179P4119n5117
$$ plain form
7687 -119612 -111648 -137624 -166757 -192821 -116390 -150102 -238701 -292104 -120518 -55278 -37661 -16911
7675 -16911 11469 -29405 -1267 115514 104150 82458 146478 157676 169984 175211 101110 66769
7663 66769 -19102 -46341 -90531 -145982 -100268 -135980 -90295 -107975 -133142 -116452 -32243 14749
7651 14749 -36784 -102407 4182 -24247 -158426 -122694 -33004 -21926 -97150 -2150 -26145
7640 -26145 -22946 -73305 -77157 -115473 -166909 -72692 2562 56538 95387 106591 22513 -5148
7628 -5148 -23757 -125038 -79252 75016 92717 300 -34684 -79432 -95337 -160430 -130159 -140030
7616 -140030 -118608 12571 -59423 -160825 -98345 15606 -10679 -53726 -119820 -8160 -17180
7605 -17180 9729 39480 39700 3503 -33172 92730 80095 48248 52390 118569 192688 137571
7593A37571q3001m3963N8307l1607m4164K4219N2345r265q0608l1985J9961R3471
7581F1281O1541k1595j2490k3854K7469N530j11555j71354m9155K2625O1439l7925
7569a88043K0095j0950l8353P3890J11281P1230l9024J3776k4893n8569j4608
7558h4168O455p4866P2254R4977L9243O5556R120m350p0755P89J6502r9918r0834
7545a19995o21J41504j1045m7561L9068m1537o7152j4822O2839R3021j6561n9479
7533d2341p4399o745Q5913q561o9862l2533K07986O095j575n5934p8160R6674
7521B6558N5562o1912j0989m7853K7756K971K0021j56813l7569j7697o619J17546
7509h9038J26248L5939J6307p9412j51631p8296N694M8384O4576M7133J03351
$$ plain form
7593 137571 54570 10607 68914 37307 -6857 17362 69707 60442 -20166 -52151 -32190 61281
7581 61281 122822 101227 88737 64883 92352 97882 -13673 -185027 -234182 -211557 -150118 -188043
7569 -188043 -167948 -178898 -217251 -143361 -32080 39150 126 13902 -10991 -69560 -84168
7558 -84168 -77713 -152579 -80325 14652 53895 119451 128571 124221 53466 54255 70757 -29161 -119995
7545 -119995 -120616 20888 9843 -37718 1350 -40187 -107339 -122161 -59322 33699 17138 -42341
7533 -42341 -116740 -123485 -37572 -46133 -115995 -148528 59458 65553 63978 8044 -70116 26558
7521 26558 82120 20208 9219 -38634 -10878 -7907 12114 -144699 -182268 -199965 -206584 -89038
7509 -89038 37210 73149 89456 10044 -141587 -219883 -214189 -165805 -101229 -54096 49255
7498D9255J1797L2640n3443p7460o657q1982o5436N9887L9624p3461P6034R1453
7486B251P445j15563m1746k3465R2361J18777J2246q232N9954l024J5505j13740
7474B769p3499k5957k2157J9117K6334k2092O972J2256K2771P6698M6020n7287
7462A1945J4375m2948l3353m8098j928R5610L940p2074o0533Q415P7424O1961
7450A4736N6267p946j23907p914j9611n5185J23797O2611n8512q8853j9143J23606
7438e4l4736N0247N96M704M8881l7985R174P636m6015m8340p146O8880J3597p96
7424B8643q9735M180M3806J4803j14056n4347K9628J3232L8766R1716O132k0619
7412g851Q033M3043J20242l2140j19198P0370N3575m3604K8164o5208l9363K5307
$$ plain form
7498 49255 61052 93692 40249 -37211 -43868 -125850 -191286 -131399 -91775 -165236 -89202 2251
7486 2251 9696 -105867 -147613 -171078 -78717 40060 52306 44074 104028 101004 116509 2769
7474 2769 -70730 -96687 -118844 -99727 -73393 -95485 -88513 -76257 -53486 23212 69232 11945
7462 11945 26320 -16628 -49981 -98079 -100007 -4397 -457 -72531 -133064 -124649 -47225 14736
7450 14736 71003 63057 -60850 -68764 -88375 -143560 -19763 42848 -15664 -104517 -123660 -54
7438 -54 -34790 15457 16053 20757 69638 31653 40827 48463 2448 -45892 -53038 15842 29439 28643
7424 28643 -61092 -56912 -13106 1697 -112359 -166706 -137078 -123846 -85080 6636 12768 -7851
7412 -7851 182 43225 163467 131327 12129 82499 136074 92470 120634 55426 16063 41370
7400D1370r7085o3069k7858l5550N8120O3780j0192k8458K3559K3450j10452n0867
7388b13252R7710l886j5514O1213j01650M3116J05294l401j5574K1599O1693o0288
7376b2940p5009J02920K7098p7192r7459m4908j0435m4528J23806O7856m3526
7365i4317r1492p5587N4880O1010K2661p1051J05722J28493M185J032m5530K4821
7353B4827N1678l2480j14957M1392M3884K3497j7216j07820L850M0187J3167J24444
7341I4453k0517q6422r4014l1679J51934J84966J02158n400m9891j02108l8492
7330A04988N131o007O5923N3710N516m0049p7986j35977j52321k9349N4115j4644
7318a66950m7493O1088Q1096P1232P683j153j15344o5935J9033J1732J163J09185
$$ plain form
7400 41370 -55715 -118784 -146642 -182192 -124072 -60292 -70484 -98942 -75383 -51933 -162385 -213252
7388 -213252 -115542 -119428 -134942 -73729 -175379 -132263 -26969 -30370 -45944 -24345 37348 -22940
7376 -22940 -97949 4971 32069 -45123 -142582 -187490 -197925 -242453 -118647 -50791 -94317
7365 -94317 -185809 -261396 -206516 -145506 -122845 -193896 -88174 40319 44504 45536 6 24827
7353 24827 76505 44025 -70932 -29540 14344 37841 20625 -87195 -83345 -43158 -29991 94453
7341 94453 73936 -12486 -106500 -138179 13755 198721 300879 295479 245588 143480 104988
7330 104988 110119 104112 170035 223745 229261 189212 111226 -24751 -177072 -206421 -152306 -166950
7318 -166950 -214443 -153355 -72259 -1027 6656 5503 -109841 -175776 -156743 -145011 -143848 -34663
7306c4663N7196j24965n7282L3870Q4509p158Q976J14572j13326J6687M9536m2041
7294a4089O961k0584k2161O766J7913k4824Q3746o3313L7610q377q7748J7485
7282g0615K5761R7170R4917k727r6901r5893M128j6232L6853j60001j48184M7864
7270b83860J29326P9459p4652l3412p156P7568k9711m0069q4753N4098O8209r0154
7258b35107O5017P262o7251p7576Q6447M823O2747M539Q5888J03539J28473J9437
7246A88238r7391q8341n3354m3643j36678O3897L0978j6406q368O8807K8250j5544
7234g9555N0122l8902J497J133K3440K8376N3507M9262m3565j1453m9620O4815
7222D9057O1859K7048m1953n5747m2156m1698Q2739N753p9357l1545j2300k7733
$$ plain form
7306 -34663 22533 -102432 -159714 -125844 -41335 -48493 -39517 75055 -38271 -21584 27952 -14089
7294 -14089 -7128 -27712 -49873 -43107 -25194 -50018 33728 -29585 8025 -352 -88100 -70615
7282 -70615 -44854 52316 147233 144506 47605 -48288 -44160 -60392 -23539 -183540 -331724 -283860
7270 -283860 -154534 -75075 -149727 -183139 -190295 -112727 -142438 -182507 -267260 -213162 -144953 -235107
7258 -235107 -170090 -162828 -230079 -307655 -221208 -216385 -153638 -149099 -63211 40328 168801 188238
7246 188238 90847 2506 -50848 -94491 -231169 -167272 -136294 -152700 -161068 -92261 -64011 -79555
7234 -79555 -29433 -68335 -66838 -65705 -42265 -13889 39618 88880 45315 33862 -15758 49057
7222 49057 110916 137964 96011 40264 -1892 -43590 39149 44902 -34455 -66000 -78300 -106033
7210a06033L5201P8522l5396m8506K414m7263m6359O3633N6506K728j11047l8828
7198a94428K3236O509l4178R4977J03355P0817o1123J4708N7890o876q9184p5090
7186h9387R709Q333J31086k2132k8808K3920M4142m3854k6926k6863q59k7452
7174d9091j266j4826O0020L7817P9547k295m4955n6802o043R3167m7806k6392
7162B1075O187j8289l8747O2539J13791q992m3522Q8154p929l4063n8092j86087
7150a03975m7505P5552Q4785j0985k3152m0383K977p178O254l7824K4058R7602
7138B0226n2501o982J4650R3415J15314p004k6925P215k7385k4451L1583k4051
7126A13104j57422q2689q2843J8181l0888L221Q5020R3439j2103r6515n6563J4931
$$ plain form
7210 -106033 -70832 7690 -27706 -76212 -73798 -121061 -167420 -103787 -47281 -44553 -155600 -194428
7198 -194428 -171192 -164683 -198861 -103884 -529 70288 9165 23873 81763 74887 -14297 -89387
7186 -89387 -79678 -71345 59741 37609 8801 32721 76863 33009 6083 -20780 -21639 -49091
7174 -49091 -50357 -65183 -5163 32654 112201 109906 64951 8149 2106 95273 47467 21075
7162 21075 27262 8973 -29774 32765 146556 137564 94042 182196 174267 140204 82112 -103975
7150 -103975 -151480 -75928 8857 -2128 -25280 -65663 -62686 -69864 -63610 -101434 -77376 20226
7138 20226 -32275 -39257 -24607 68808 184122 177118 150193 157408 130023 105572 137155 113104
7126 113104 -44318 -127007 -209850 -191669 -222557 -219336 -134316 -40877 -52980 -149495 -206058 -191127
7114a91127J31851J70007L1655j16683j10413k9334N4323M8309o855p7259O1424
7103c4102J49064m278j35588n8090k0228P5130J07875J9917j0795J9017K3202
7092A31124O9499N463n2154N59l5965j7431K7373L5235n5721j69609r0129Q752
7080a43004J42395L0549J6069j01059K9504N0775o6905m191N860M7150l249n3175
7068d9281j5190K2922K722O542l4473M4397R5931M5812l5413l2932l796k4983
7056B2258K8223m81j37244m9206K9848n3089M2154Q3621k2889k7761k9483K4410
7044h9639n1926o1336L6451J1869N7617p485J5343O646j4331j1712p1951N1219
7032a29235P8643Q7367m8057J4783k5329k4525m5390p4174Q2254j8360O0991O2702
$$ plain form
7114 -191127 -59276 110731 142386 25703 -84710 -114044 -59721 -11412 -18267 -95526 -34102
7103 -34102 114962 110684 -24904 -82994 -103222 -28092 79783 99700 88905 107922 131124
7092 131124 200623 206086 153932 154491 118526 101095 128468 163703 107982 -61627 -151756 -143004
7080 -143004 -609 29940 46009 -55050 -25546 25229 -41676 -45867 -40007 7143 3894 -49281
7068 -49281 -64471 -41549 -38827 -32285 -66758 -22361 73570 119382 83969 51037 47241 22258
7056 22258 50481 50000 -87244 -136450 -106602 -159691 -117537 -33916 -56805 -84566 -114049 -89639
7044 -89639 -141565 -202901 -166450 -154581 -96964 -104449 -89106 -82460 -96791 -108503 -180454 -129235
7032 -129235 -50592 36775 -11282 3501 -21828 -46353 -91743 -165917 -83663 -102023 -41032 21670
7020B1670k0369k531n0023N759N8158j8977j09309K3648K8932m8994n2473L6642
7008a27867L8279K1756J0174P4141N6500L9455o7452k1451J22618O2487l9033
6997A69607j70584o2580O8433Q8224J0579r4415K6765N8859n6180L7820o7429
6986I099j2461L1813n2860j12299l9670K7082J16368J8127K1219P0702R8720L2343
6974B08183j10675j44214J1053k8495k5110J7804R4142J5744o7468n9864M1597
6963d7303Q4134R8763j0432j9210j82529j33741R3926R9801Q4724k4669l8216
6952E248o9195N9187N8119m4353l1566L2501M3669k568m2566l3770J8379r6649
6940a03564m7764m5868k3267L0412J29751N9867k286M4135p8732m8267K1032J06457
$$ plain form
7020 21670 1301 -1230 -51253 -45494 12664 -6313 -115622 -91974 -63042 -112036 -164509 -127867
7008 -127867 -89588 -67832 -57658 16483 72983 112438 44986 23535 146153 208640 169607
6997 169607 -977 -63557 4876 93100 103679 9264 36029 94888 38708 76528 9099
6986 9099 -3362 28451 -24409 -136708 -176378 -149296 -32928 -14801 6418 77120 175840 208183
6974 208183 97508 -46706 -35653 -64148 -89258 -71454 22688 38432 -29036 -88900 -47303
6963 -47303 36831 135594 125162 105952 -76577 -210318 -116392 -16591 68133 43464 5248
6952 5248 -63947 -4760 53359 9006 -22560 9941 53610 51042 8476 -25294 -6915 -103564
6940 -103564 -151328 -197196 -220463 -190051 -60300 -433 -2719 41416 -37316 -85583 -64551 41906
6928D1906o2107N1225J8467N067j11836q5972M8885J18361P2424J3577q3404p756
6916A8837k9271p853R8541L4351j15042j07112n2425m7655J0192J7162J985J12228
6904f6062K1600j4524Q4522M1701l6514n9063l3587Q7970n6166p8748q3635O491
6892a86015R2394O2313l7451k034M4158O1797K8156N3635k1906r1323j41434m5669
6880a83379L4868J11580Q5043J8792j22387J5873L2160P9557M2243o1487n5571
6869b708M1263J5760k0739o1253j06674j06881O55R5823K9434K0352O0642Q7115
6857E2789L2611j29318j42599j0690O7468R606m392o1807q070J00519P9820P0481
6845E6418K7748N6063L4127q0454j13946N7081j3333k7175P986j5071N2366k491
$$ plain form
6928 41906 -20201 31024 49491 54558 -57278 -143250 -94365 23996 96420 109997 26593 18837
6916 18837 -10434 -18287 80254 114605 -437 -107549 -159974 -207629 -197437 -180275 -178290 -66062
6904 -66062 -44462 -58986 25536 67237 30723 -28340 -61927 26043 -30123 -108871 -192506 -186015
6892 -186015 -93621 -31308 -68759 -70793 -26635 35162 63318 116953 95047 3724 -137710 -183379
6880 -183379 -148511 -36931 48112 66904 -55483 -39610 -7450 72107 114350 52863 -2708
6869 -2708 38555 54315 33576 -27677 -134351 -241232 -240577 -144754 -115320 -94968 -34326 52789
6857 52789 85400 -43918 -186517 -197207 -129739 -120133 -124525 -186332 -194402 -93883 -14063 56418
6845 56418 84166 140229 174356 93902 -20044 37037 23704 -3471 4515 -10556 41810 39319
6833C9319m1324j6380P8184j4685j44045p2086P5940J05377k6143l4166M5416
6822d593o600K2789k943P986n2140p475J671M8588L471K2663J9787l9276j27162
6809a13234k1889N441J4180R0449O4680J7105n2447O077L1904o2597J4357N1096
6797D5122J1765M7216P2833l9637j38749m6615P3057M4787M4238j0784l3621P1934
6785A41546Q1371l3931k5904r0502j05739l3524M3038N5489J3616m9677k6654
6774c0871L9210n8362r1082P5454O2567o3704l0360r0677l2017J46256R9556r440
6762A6530m4348k8575q9196m338n68K3085J0445m3460j0667M4523J33171J02847
6750A09449p7320o0845j0808n5009j16704N7561J44334J7873O789P54N9377m3887
$$ plain form
6833 39319 -2005 -18385 59799 45114 -98931 -171017 -95077 10300 -15843 -50009 -4593
6822 -4593 -11193 11596 8653 16639 -35501 -42976 -41305 7283 10754 33417 53204 13928 -113234
6809 -113234 -135123 -129682 -115502 -25053 39627 56732 4285 10362 42266 -20331 -5974 45122
6797 45122 56887 104103 176936 137299 -1450 -48065 24992 69779 114017 103233 69612 141546
6785 141546 222917 188986 163082 72580 -33159 -66683 -23645 31844 45460 -4217 -30871
6774 -30871 8339 -50023 -141105 -65651 -3084 -66788 -97148 -187825 -219842 -73586 25970 16530
6762 16530 -27818 -56393 -145589 -149927 -150495 -127410 -116965 -160425 -171092 -126569 6602 109449
6750 109449 32129 -28716 -39524 -94533 -211237 -153676 -9342 8531 15320 16074 75451 31564
6738C1564l9316j07226l2090k1227M148m1884R5012M055q2377l5423Q7323J08921
6726b8520r4722L3122m4228k9830J5240n9502p0277j136J3085J0244M8610Q1161
6714a26753O9958R258p360K8811K776q4682M4916N1790P4733L319k61m447o0304
6701A754k2022o2232o2568O7308K2677L5343k927j6470N9479N2448l5708q8028
6689e0946o1882m4079k8721J16161K37105N7430L2444n9401j21586k6931L2684
6678H2278L4670m1286j50433M9926J42741R420j93218p9147o4821R5383R1294
6667b3193q5519l138N9472K4346O5583p5201j24067J32344O7354j23541j01797
6656a87357Q7280N7840J08117J44004K9345o8740l0227m6328p1661k1732J41553
$$ plain form
6738 31564 -7752 -114978 -147068 -168295 -164147 -206031 -111019 -106964 -189341 -224764 -137441 -28520
6726 -28520 -123242 -90120 -134348 -164178 -148938 -208440 -278717 -279853 -266768 -256524 -207914 -126753
6714 -126753 -56795 -47537 -54897 -26086 -23310 -107992 -63076 -11286 63447 66766 66505 62058 1754
6701 1754 -20268 -82500 -145068 -77760 -55083 -19740 -22667 -39137 20342 72790 37082 -50946
6689 -50946 -112828 -156907 -185628 -69467 167638 225068 257512 198111 76525 49594 82278
6678 82278 116948 75662 -74771 -24845 117896 127316 -65902 -145049 -209870 -114487 -23193
6667 -23193 -108712 -111850 -52378 -28032 37551 -37650 -161717 -29373 37981 -85560 -187357
6656 -187357 -100077 -42237 65880 209884 239229 170489 140262 93934 22273 541 142094
6645A42094J02558l3821j10764r7874m0417m9987l5035J03201N0710p6180n8290
6634a03805L0034J39556M2482n6772K0106R3397n6665p0967m0068j19554M4125
6623g8131P3923p6339o8733O8388J9121N3690O5052k6427P12k4044J4916J4949
6611C7077j7603j5197R1096N1025q0309m2541n1556n9222n1677q138K800j2493
6599a56738J16557L090q0073p2395J43416J19728l2604K1297L9552K3332o6110
6588E9052j69478q3346N6347J6268n3393J34364P8939O1252Q6144L3546m5202
6577A74493m6604j0493l7102j7750q9669P2044j1128o7828J6464M4840N4516J7498
6565I9281j263j06709j8741j2003k4648J1610K9863o5045M3219K6144j67344n5001
$$ plain form
6645 142094 244652 210831 100067 2193 -38224 -88211 -123246 -20045 30665 -45515 -103805
6634 -103805 -73771 65785 108267 51495 71601 164998 108333 37366 -2702 -122256 -78131
6623 -78131 -4208 -80547 -149280 -80892 -61771 -8081 56971 30544 31256 7212 22128 37077
6611 37077 19474 4277 95373 146398 66089 23548 -28008 -87230 -138907 -147045 -144245 -156738
6599 -156738 -40181 -37091 -117164 -189559 -46143 73585 40981 62278 101830 125162 59052
6588 59052 -110426 -193772 -137425 -121157 -174550 -40186 38753 100005 186149 219695 174493
6577 174493 127889 117396 80294 62544 -27125 44919 33791 -34037 -17573 27267 81783 99281
6565 99281 98018 -8691 -27432 -39435 -64083 -52473 -22610 -87655 -44436 -18292 -185636 -240637
6553b40637j3277K0155N236P0389J08797Q1817l3609N4393N6818n8528J8441M2607
6541A12602k8810j47202m9060N1932j4047J26846k7751N307J27479m7403j30949
6530b1056j5128j0773M2435L3759N863j13414O7917O9651j25812m6080Q9898q3602
6518a06342N0146J0136K5511K3599k5020k2912O425P253M9510J16202o1070k0249
6506E3189q287j2702j2954K8492j79299N6212R6953Q1502R717j5721o550l5250
6494E5302m7127r643r2732L828J31129J29303P2871L1781m3516o4557J4036l9151
6482A41524j29432k9876L5754n7265p8199L3587J23823N2792p4039m9056o0118
6471i0505K184L1808m3812m25K3023J1818L9982M388J19388L1862l1410P471o2656
$$ plain form
6553 -240637 -253914 -233759 -228523 -158134 -49337 32480 -1129 53264 110082 51554 69995 112602
6541 112602 83792 -63410 -112470 -60538 -74585 52261 24510 29817 157296 109893 -21056
6530 -21056 -36184 -46957 -4522 29237 35100 -78314 -10397 59254 -66558 -112638 -22740 -106342
6518 -106342 -56196 -46060 -20549 3050 -21970 -44882 -38457 -31204 18306 134508 73438 53189
6506 53189 44902 32200 19246 47738 -131561 -75349 21604 103106 112823 97102 90552 55302
6494 55302 8175 -1468 -94200 -90372 40757 170060 242931 274712 231196 166639 180675 141524
6482 141524 12092 -17784 17970 -39295 -117494 -83907 39916 92708 18669 -30387 -90505
6471 -90505 -88321 -56513 -100325 -100750 -77727 -65909 -25927 -21539 97849 129711 98301 105772 43116
6458D3116q6241k634K4078k5066K4596k130j3399O1958p7607k9113j1703M30L0713
6445f3002K27r3091n7959m5159j8948P9693J81600M208j08481J648j5741L2825
6433a02180j18667M4389R0667N6984o55P2446N6538K8042l5128m1390J7258l4330
6421C3974L8956N9142K7354o7911l6481p6273m5528N8785J58410L441j69528n2377
6409f8036R8892J01724j33194K0926K4932p1415j2047q339J3966m102j8269L3582
6397b1380k8104l0378p8415K3112J11632P9452L9663j9791r0653j3299K9332k8379
6385b7208n863J4877L3584k1160k1943j17622O2814J17230M7958J2047k0588L9008
6373A13134J324o6528o4749K8445M3758k6261m6162k1775j7488J0856r7291L370
$$ plain form
6458 43116 -43125 -45759 -21681 -46747 -22151 -24281 -37680 24278 -53329 -82442 -94145 -93715 -63002
6445 -63002 -62775 -155866 -213825 -258984 -277932 -198239 -16639 -12431 -120912 -119264 -135005 -102180
6433 -102180 -220847 -176458 -85791 -28807 -29462 42984 99522 127564 92436 51046 68304 33974
6421 33974 72930 132072 159426 91515 55034 -21239 -66767 -7982 150428 153869 -15659 -68036
6409 -68036 30856 132580 -614 20312 45244 -26171 -38218 -46557 -32591 -36693 -54962 -21380
6397 -21380 -49484 -79862 -158277 -135165 -23533 55919 95582 75791 -14862 -28161 1171 -27208
6385 -27208 -33071 -18194 15390 -5770 -27713 -145335 -82521 34709 82667 94714 74126 113134
6373 113134 114458 47930 -16819 11626 55384 29123 -17039 -38814 -56302 -45446 -142737 -139367
6361a39367J23784N0428p0155P8382l0743K5623J3381K7841N087l0089l8731p9823
6349f4382J34256n986r9813N6727P2197j9332j9738N379K8351J4984n4297k8701
6337A9645n0250J02932R16p2413r6378M3220N9143N4326J8220K5053n5292P68
6325D9890L2641J1200j849N466M921K7368M254m405m645J0567l7190p7870l1790
6312a1442n584m6813N781m9160O4457Q5094J9716j02628o2669m3095k007J37867
6300a0483N9601J1578J7730r5420j9791m4278j0366R8851J59020l8657j30113
6289b328o4596P9097k8933n273n0185L84M6657n0003k3026L2705l5740o2661N1169
6276a12733K8475O8795N5219O3941O096O5692p4305j51758j27827j3335q050o1816
$$ plain form
6361 -139367 -15583 34845 -35310 43072 12329 37952 51333 79174 84261 54172 15441 -64382
6349 -64382 69874 63888 -35925 20802 92999 73667 53929 59308 87659 102643 48346 19645
6337 19645 -30605 72327 73243 830 -95548 -52328 6815 61141 79361 104414 49122 49890
6325 49890 82531 93731 91882 97348 102269 129637 133891 129486 124841 135408 98218 20348 -11442
6312 -11442 -17026 -63839 -58058 -107218 -42761 42333 62049 -40579 -103248 -146343 -148350 -10483
6300 -10483 49118 60696 78426 -16994 -36785 -81063 -91429 7422 166442 127785 -2328
6289 -2328 -66924 12173 -16760 -22033 -72218 -71834 -25177 -75180 -98206 -65501 -101241 -163902 -112733
6276 -112733 -84258 -15463 39756 103697 109793 175485 101180 -50578 -178405 -191740 -199790 -261606
6264b61606l5098L0812N9842J11691Q3347N6917l0518r4774m8866L2165R7098
6253A010p677k7336M6782K6419n67N6790m5144q5282q5072m4901Q8187M4744l1302
6240f3349N0413l103M1084M1610q0230J7466N4383J2070q1015k4337O8976Q757
6228D2725q4836j4778L2485j9086L5547J0703l2235j5785K6677l4975k4998j5716
6216i4272R3365J9948p9461n6277l4158J31196K4809l7288l4696K4403p2414o4884
6204a79729L2633O7103n596R5766Q4878m7277m7583m8560N8215l9640o8157O1761
6192c6186j8963k9527j4944m295o2793N3629K1795p0870j9051K8889J47261J04518
6180I9463j8839l0155N9852n2194j86952j5571R7579o6633o6534J0865M7443o092
$$ plain form
6264 -261606 -296704 -265892 -206050 -94359 -11012 45905 15387 -79387 -128253 -96088 1010
6253 1010 -6667 -34003 12779 39198 38631 95421 50277 -35005 -120077 -164978 -76791 -32047 -63349
6240 -63349 -12936 -16039 25045 66655 -13575 3891 58274 70344 -10671 -35008 33968 42725
6228 42725 -42111 -56889 -24404 -43490 -7943 2760 -29475 -45260 -18583 -53558 -78556 -94272
6216 -94272 -907 19041 -60420 -116697 -150855 -19659 5150 -32138 -66834 -42431 -114845 -179729
6204 -179729 -147096 -79993 -85589 10177 95055 47778 195 -48365 9850 -29790 -97947 -36186
6192 -36186 -55149 -84676 -99620 -103915 -166708 -113079 -91284 -162154 -181205 -152316 -5055 99463
6180 99463 80624 50469 110321 58127 -128825 -144396 -46817 -113450 -179984 -169119 -121676 -127768
6168a27768M3458J16749J13143k1978p1838q348L9240j9694n6586j70575p2002
6157b36199O4434O3269N410r900o3425P9412o7961Q798K2483J7903P7005N2908
6145A4137p1861n0388L5247l744j13130l9822J00383O7523j686l5379o2444j0600
6133a71764n6305J05780L4580P9910L6331K9190l3568m3798p0021o5732k5120
6122a80517P1803L6362k9176n1856m5984J029K8120R5595Q5541q71Q5957n8290
6110C7713q4681M85K1602m2780j8952J15959J25916p6710j58809m1092Q1437k3575
6098f3487j0749J8741j50898k6885M8156n1872P7740L8982P8484R4773k911k5995
6086B4079k3227n1810K8634k2919j4427K8527R024m4521k7165M1699P8861J13101
$$ plain form
6168 -127768 -84310 32439 145582 123604 51766 43418 82658 62964 6378 -164197 -236199
6157 -236199 -171765 -108496 -103086 -112986 -176411 -96999 -164960 -156162 -133679 -115776 -38771 14137
6145 14137 -57724 -108112 -72865 -76609 -189739 -229561 -129178 -61655 -63341 -98720 -161164 -171764
6133 -171764 -228069 -122289 -87709 -7799 28532 57722 24154 -19644 -89665 -155397 -180517
6122 -180517 -108714 -72352 -101528 -153384 -199368 -198339 -170219 -74624 10917 10046 96003 37713
6110 37713 -46968 -46483 -24881 -67661 -86613 29346 155262 78552 -80257 -121349 -39912 -63487
6098 -63487 -74236 -55495 -206393 -233278 -185122 -236994 -159254 -120272 -41788 52985 50074 24079
6086 24079 852 -50958 -22324 -45243 -59670 -31143 -22119 -66640 -93805 -52106 26755 139856
6074A39856n5809l2056n1686q9799J913j5218p2245J07379J28114k2059J2338
6063E0728m1755r240J09301O3671p2834r5189j17210P2427J7315J178J11345j2405
6051G7332j01730o486J6838J651k9824K7575R7214r167j35659M1234m6238k0565
6039h7825K2422O2386M9652j08578p5953j8523n6909O357J039n2790J3035M9459
6027a96228J18979J16256N4464L8766r2126p9810L0605J00916l7697o4653j05449
6016a15977m4836J0237n5162L7012J10372N124p6017M4377J10085m6866k9623
6005e1274n903k9302K0678O0993k7978J0554Q3439k8485M8685N0368l0445r9418
5993A912j35444P9035Q2618J580N9353K6505n0938q8989j7738j34550J33835P4037
$$ plain form
6074 139856 84047 51991 305 -89494 -87581 -102799 -175044 -67665 60449 38390 50728
6063 50728 8973 -267 109034 172705 99871 4682 -112528 -40101 -22786 -21608 89737 77332
6051 77332 -24398 -30884 -14046 -12395 -42219 -14644 82570 73403 -62256 -21022 -67260 -87825
6039 -87825 -65403 -3017 46635 -61943 -137896 -156419 -213328 -206971 -205932 -258722 -245687 -196228
6027 -196228 -77249 39007 93471 132237 40111 -39699 -9094 91822 54125 -10528 -115977
6016 -115977 -160813 -150576 -205738 -168726 -58354 -53230 -129247 -84870 25215 -21651 -51274
6005 -51274 -57177 -86479 -65801 -4808 -32786 -22232 61207 32722 81407 131775 101330 1912
5993 1912 -133532 -54497 28121 29701 89054 115559 64621 -24368 -42106 -176656 -42821 31216
5981C1216q5605p0946K3183L8534O5039J0805K2837L6389k8093r5878o2208J83794
5969F9067K0360k6158j43012J186N1400q322k1340P1607r9448j31293N2935J49443
5957a3575O7301J0191r5755j04842k8649J34262L0182l387q4017j0747O8228P2298
5945D1490q8058q8025K4828J7049j9777O1355o507k3154q6328K1104P8146L338
5933f4539l996o7968O5699N6690l4735n6845p7698R1421Q7292p1519p8079k5499
5921a79776N9227M8259m7874N1358l9766l4531J37440M6951q377J9494k0384o9470
5909c7449j20440k373O7343N9292J1680o3881N3037P7868M4497l2974r9704n9118
5897a02222L5717J9605L9198k59066r6319J83109J37529M6106O0848j7727p1559
$$ plain form
5981 31216 -54389 -125335 -102152 -63618 1421 12226 35063 71452 43359 -52519 -114727 69067
5969 69067 89427 63269 -79743 -78557 -27157 -35479 -56819 14788 -84660 -215953 -163018 -13575
5957 -13575 53726 63917 -31838 -136680 -165329 -31067 -885 -4272 -88289 -99036 -30808 41490
5945 41490 -46568 -134593 -109765 -92716 -112493 -51138 -57645 -80799 -167127 -146023 -67877 -64539
5933 -64539 -68535 -136503 -70804 -14114 -48849 -105694 -183392 -91971 -4679 -76198 -154277 -179776
5921 -179776 -120549 -72290 -120164 -68806 -108572 -143103 -5663 41288 32911 52405 32021 -37449
5909 -37449 -157889 -160262 -92919 -33627 -21947 -85828 -32791 45077 89574 56600 -43104 -102222
5897 -102222 -66505 -46900 -7702 -266768 -363087 -179978 -42449 3657 64505 46778 -24781
5886b4781j0340L0098J05283J10774M8070j00106k0537J7089j5472p80M101o5442
5874G7957j27185L967j2799n4511n2835J17605J15896j4405K148p0065j48262
5863a62489n4933j6172m6733O70R003J51122K08523k2346p0197M1204J4427K395
5851E4474m2370j8370N123J6070K1369J00056j5311m2866p2977j76983n8111K2641
5839b07255O3280R415k4779N4702J2371N5134l6130J7662K7337l5406J9506N4569
5827A0406Q494j1807N0207n4529r2148J7560P3307k0104O0034m6253O0546J86035
5815B41748p6920j58452m4561j090m3139J1014L3088J43842R89l7178k8371n1163
5803a0193o5271m7757M9178J79531k5675k2888m9516n266n1310m5779K2146J5703
$$ plain form
5886 -24781 -35121 -5023 100260 211034 259104 158998 138461 155550 140078 139298 143399 77957
5874 77957 -49228 -45261 -58060 -112571 -165406 -47801 68095 53690 55838 -14227 -162489
5863 -162489 -217422 -233594 -280327 -279657 -270654 -119532 88991 66645 -3552 37652 52079 54474
5851 54474 12104 -6266 -1143 14927 36296 136352 121041 78175 5198 -171785 -229896 -207255
5839 -207255 -143975 -134560 -159339 -104637 -92266 -37132 -73262 -55600 -28263 -63669 -44163 10406
5827 10406 18900 7093 57300 2771 -89377 -71817 1490 -18614 41420 -4833 55713 241748
5815 241748 164828 6376 -38185 -39275 -82414 -71400 -38312 105530 106519 69341 40970 -10193
5803 -10193 -75464 -123221 -74043 105488 79813 56925 7409 2143 -49167 -94946 -72800 -57097
5791e7097K8146k5056K7893O8587o8396J2639L9104k0397j19903p5861J9367P2302
5779i8672R4748n3625o9262O097o798l5899Q5788j8082K7136M4718J24952j15888
5767a4787M0122J00785j3769j78313m2709k7194O2724J31057l6275j6822q5467
5756h0648l4187J10533l1701q3035j21936N1593J02247O2397r7956L4713K1839
5745f6141n4735L0513M2229m7519l2235k6098q039O627k457Q1689N8587r9488
5733a17067j02050J61376J51663J1727j83714L209P6954q2703j0582M1390K7382
5722b2415O9644m2351R136p328k7696J1117j714L34L4501o69q734o1616j6172
5709f3963j6077K2033L9024N878o891m0541J2916m5727M6607m234j13621m1249
$$ plain form
5791 -57097 -28951 -54007 -26114 42473 -25923 -13284 25820 5423 -114480 -190341 -170974 -98672
5779 -98672 -3924 -57549 -126811 -120714 -127512 -163411 -77623 -95705 -68569 -23851 101101 -14787
5767 -14787 25335 126120 112351 -65962 -108671 -135865 -73141 57916 21641 4819 -80648
5756 -80648 -114835 -4302 -36003 -119038 -240974 -189381 -87134 -24737 -122693 -87980 -66141
5745 -66141 -120876 -90363 -48134 -95653 -127888 -153986 -162025 -155398 -157855 -76166 -17579 -117067
5733 -117067 -219117 -57741 93922 105649 -78065 -74856 2098 -80605 -91187 -49797 -22415
5722 -22415 47229 4878 14014 6686 -21010 -9893 -11607 -11273 23228 22559 13825 -47791 -63963
5709 -63963 -80040 -58007 -18983 -13105 -19996 -60537 -47621 -93348 -46741 -50975 -164596 -205845
5697b05845M0963R1719L6325P3435Q7626k177n3508K372L3752l2493r859n7097
5685E213o3645O4807N5452k4438L7377j20894o6538O176R0299M4445R9016L2641
5673A59911j28204r1392J15037L3898J7990Q151o9042j12207r3576K4382J35410
5662C58L5918j00966m3243N6924O1452M9726l9418o3333O9203M961L5615L5520
5650A02717q7085o0167R379J6213j153j21859n1909J1123J37712R8906n401r2025
5638d3549N805J7226o1070K3097O7546Q552n783M3701r8579M2752j0004K1437
5626A1131N4448Q33j20367K9638m400k3536m6707k8193N05m3796J0130m8455M3965
5613a64804P5430Q52P6587M7787M7882j7522j17296J2675J1647N915O0893K9032
$$ plain form
5697 -205845 -164882 -73163 -36838 36597 124223 122046 68538 70910 104662 72169 62310 5213
5685 5213 -58432 6375 61827 37389 74766 -46128 -112666 -106490 -16191 28254 127270 159911
5673 159911 31707 -59685 55352 89250 107240 115391 46349 -65858 -159434 -135052 358
5662 358 36276 -64690 -107933 -51009 10443 60169 20751 -42582 26621 31582 67197 102717
5650 102717 15632 -44535 -35156 -18943 -20096 -141955 -193864 -182741 -45029 53877 48476 -43549
5638 -43549 -37744 -20518 -81588 -58491 9055 17607 11824 55525 -43054 -302 -10306 11131
5626 11131 65579 66412 -53955 -24317 -28717 -52253 -98960 -127153 -126648 -170444 -160314 -208769 -164804
5613 -164804 -89374 -88522 -11935 35852 83734 66212 -51084 -38409 -26762 -20847 40046 69078
5601F9078K089j9559p623j48817n726J8004K0422k162J16116j4052j652k6067
5589E1n6366M1658p0983k8569L7041J7978P4061n1259j00462p4281M1776M6002
5577a23353k5006j42113r610O1219J25667J9249J0353m5335J0811O3713M0090
5566a4315K4380n7904K6359o9238k577O3480o4332q2286J27478N6378L7257L7394
5554H2074k5391o9647L7811L1810R749r9526j01607K1880J15601J06640j8140
5543I1254l9795j2784R0382q8204p5886N1773M3042l791l2849J20706P0288n4083
5531A60053m3361K6225o377o2216m3403j2002j06571n6511M911q3232r6222N1517
5519b67189J06771L2248M9925k6261p444Q7220k479j652N55J4105m5203l614K6840
$$ plain form
5601 69078 71167 51608 43985 -104832 -110558 -92554 -72132 -74294 41822 27770 26118 51
5589 51 -56315 -14657 -85640 -114209 -77168 -59190 14871 -36388 -136850 -211131 -169355 -123353
5577 -123353 -148359 -290472 -300082 -238863 -113196 -93947 -83594 -128929 -118118 -54405 -14315
5566 -14315 10065 -47839 -21480 -90718 -93295 -29815 -94147 -176433 -48955 7423 44680 82074
5554 82074 56683 -12964 24847 56657 66406 -33120 -134727 -112847 2754 109394 91254
5543 91254 51459 38675 129057 40853 -35033 16740 59782 55991 23142 143848 214136 160053
5531 160053 116692 142917 136540 74324 30921 18919 -87652 -144163 -139252 -222484 -318706 -267189
5519 -267189 -160418 -128170 -78245 -104506 -111950 -24730 -27209 -28861 -28306 -14201 -59404 -63018 -36178
5506c6178k292Q389j29366J2584M848O0072k3537O802m2492M1493K5202J1389
5494f3086K8947p119L2396M3396n2518K4146M7033l1886o9872n4607O7051l40
5482c6459m4703K180r7096j8815J16070k041j07025l6071l7433J16074J15334
5471b9985O2802p3167j10613N2467L1285J14130p0825L9257k475K8619L3775k5411
5459D9859o0529n8781L2868L3220J8617L1175q1715j1258o6440j44210n1444J29445
5447a79193J786N9165J8519l0950M7279R8962k8725o521O8030K2899o0321p9251
5435f8321q662J06132N6269n3576n9362l7252l42J44092L3969j49845m2985K3606
5423e6277J6582O4702m4107r4348l5554L3354N8830N1517k4525n4822L5907P5847
$$ plain form
5506 -36178 -38470 -30081 -159447 -146863 -142015 -81943 -105480 -98678 -141170 -99677 -74475 -63086
5494 -63086 -34139 -41258 -8862 34534 -17984 6162 53195 21309 -48563 -103170 -36119 -36459
5482 -36459 -81162 -78982 -176078 -194893 -78823 -80864 -187889 -223960 -261393 -145319 -29985
5471 -29985 32817 -40350 -150963 -98496 -67211 46919 -23906 15351 12876 41495 75270 49859
5459 49859 -10670 -69451 -36583 -3363 15254 46429 -35286 -46544 -112984 -257194 -308638 -179193
5447 -179193 -177407 -118242 -99723 -130673 -83394 15568 -13157 -19678 48352 71251 10930 -68321
5435 -68321 -76983 29149 85418 31842 -27520 -64772 -65114 78978 112947 -36898 -79883 -56277
5423 -56277 -39695 25007 -19100 -113448 -149002 -115648 -56818 -5301 -29826 -84648 -48741 27106
5411B7106N9275o644J4976J2374m5293m5301j5942p5361j01757L675L9438M89
5399a32965L7184J6216m4954J7043J819j2230N0828J30596M628j23402p868R5600
5387C2495R6585l8655l2312J0934k7159n9738K451p0519p788R8743k8033K4474
5375A478p464k5462P510k5460L1469J3250M7651L2515l037q1318p7758L6600L3026
5362a7000j5280K7327p456o7968p1635q292J17695J74940p326j20177o6981J0428
5350e1725m4483R564k110o1118n3226P8068J38266j2226j89550M6684M9724Q4680
5338g452N008j1565o4931J8564l6567R825R9264n4327p7250j7691M4483P0986
5326b1653R2778M1573m8923j06887r9398Q3917N4537k8396N240M6632p7099k712
$$ plain form
5411 27106 86381 79737 94713 107087 61794 16493 551 -74810 -176567 -172892 -133454 -132965
5399 -132965 -95781 -79565 -124519 -107476 -105657 -117887 -67059 63537 68165 -55237 -63105 32495
5387 32495 129080 90425 58113 69047 41888 -17850 -15399 -85918 -93706 5037 -22996 1478
5375 1478 -5986 -31448 -23938 -49398 -17929 -4679 42972 75487 72450 -8868 -86626 -50026 -17000
5362 -17000 -32280 -4953 -12409 -80377 -152012 -160304 -42609 132331 125005 4828 -62153 -51725
5350 -51725 -96208 -86644 -88754 -149872 -203098 -125030 13236 1010 -188540 -141856 -92132 -7452
5338 -7452 -2444 -14009 -78940 -60376 -96943 -87118 12146 -42181 -119431 -137122 -92639 -21653
5326 -21653 71125 112698 63775 -43112 -142510 -58593 -4056 -32452 -27212 19420 -57679 -60391
5314f0391J34303m9567n6353J87o2674k5854J02072J61480q1609o3150j04296
5303a05852l2006o1880K530R6735K0626P6041K9358k4868j1853J4997o8985j1374
5291g6531O8020K8411k5786m314o3677j39825K9898O4994J15552N3571Q7458m39
5279A37332l5734o2258n4838q289N8897n4892N2624M3668l8391M8323j08000r3767
5267a15325l3933m4520L5843r211R7481q094Q8359N0161M3547N9049K8098j27789
5255F3666q9198r2742J5170K1768o9667k8689P6899l4225j7711n507m9291n2324
5243b61851N5496L0548J0787O5849J8790n2488J7542R1672K1087L8066O7915J9247
5231A22660M589J10290P4779j93590k35297j5112J20424n3157j4575P1314J6096
$$ plain form
5314 -60391 73912 24345 -32008 -31821 -94495 -120349 -18277 143203 61594 -1556 -105852
5303 -105852 -137858 -199738 -197208 -100473 -79847 -3806 25552 684 -11169 3828 -65157 -76531
5291 -76531 -8511 19900 -5886 -10200 -73877 -213702 -183804 -118810 -3258 50313 137771 137332
5279 137332 101598 39340 -15498 -23787 35110 -19782 32842 76510 38119 86442 -21558 -115325
5267 -115325 -149258 -193778 -157935 -167146 -69665 -77759 10600 60761 104308 163357 191455 63666
5255 63666 -25532 -118274 -103104 -81336 -151003 -179692 -102793 -137018 -154729 -160236 -209527 -261851
5243 -261851 -206355 -175807 -165020 -99171 -80381 -132869 -115327 -23655 -2568 35498 103413 122660
5231 122660 127249 237539 312318 118728 -116569 -131681 -11257 -64414 -78989 -7675 8421
5220H421j2435R22O3140L3050k3281n6046J390J14729j0060q03j1404O7170N3030
5207B27823K2547n2223k0037n8659k5827k6686p1500P5570k1250M317L7409K523
5195I4007n6729r3493j32487n3816O4253O8152N7048J4996O6613o0909P3709M0834
5183H2178m6022n0644l1461o4090Q3319M4223j7074j44100J3531J50733J19025
5172A39618Q2830R1335M0934j04822o0375q2142n9300m052P0428P3820q1596o6051
5160D0627n8840m2333M267P4582L2548m6574j11880l1607N1442P8596J1881O7024
5148F9733N5943p6971j27641J1152o6413L0481P8934K7744o4661N1672k8800J2156
5136b6671q183m1703J5713q1205M5628J32178N0743n3871K9001k4863r5937k8290
$$ plain form
5220 8421 -4014 -3092 60048 93098 69817 13771 15161 129890 119830 119027 107623 174793 227823
5207 227823 250370 198147 178110 119451 93624 66938 -4562 71008 49758 54075 91484 94007
5195 94007 37278 -56215 -188702 -242518 -178265 -110113 -53065 -38069 28544 -32365 41344 82178
5183 82178 36156 -14488 -45949 -110039 -26720 17503 429 -143671 -130140 20593 139618
5172 139618 222448 313783 354717 249895 189520 107378 48078 44026 114454 188274 106678 40627
5160 40627 -18213 -60546 -56279 18303 50851 4277 -107603 -139210 -87768 -9172 2709 69733
5148 69733 125676 48705 -78936 -67784 -134197 -103716 -24782 2962 -61699 -10027 -38827 -26671
5136 -26671 -34854 -76557 -60844 -142049 -96421 35757 86500 32629 61630 36767 -59170 -87460
5124h7460R5294O7587N14j24469Q272k8413O6798p566m148j5293j5271J8297l3477
5111e9335k6243O2540N4228l2835n014L4350j5506M906L553j8618K8881K4916
5099E5823j9296j4561o4635o0207J28298l6180p3267N2624o8045m2439k8529n2420
5087b22834K2403J15203O6643N1081J3954J15510P772j22420k2127l4907n2872
5076f2594r3395k1569M8842P9433m8950m2720M5242J1137j1588q0993K9704M9835
5064i7616n161m7421J8558J9419R1125J13617K2839J6807M5908K4306k8591L0616
5052B04406j59117j43676L0240P3745o6819M9183N5973J949Q1320j9232p6818
5041C1154L7469J0771r613m5693o3158k2554l5915j25212J16396J24523M229N378
$$ plain form
5124 -87460 7834 75421 75935 -48534 -40262 -68675 -1877 -9443 -13591 -28884 -44155 -25858 -59335
5111 -59335 -85578 -23038 31190 -1645 -6659 27691 12185 17091 20644 2026 30907 55823
5099 55823 36527 21966 -42669 -102876 25422 -10758 -84025 -31401 -99446 -141885 -170414 -222834
5087 -222834 -200431 -85228 -18585 32496 46450 161960 169732 47312 25185 -9722 -62594
5076 -62594 -155989 -177558 -128716 -49283 -98233 -140953 -95711 -84574 -96162 -177155 -147451 -97616
5064 -97616 -102777 -150198 -131640 -112221 -21096 92521 115360 132167 178075 202381 173790 204406
5052 204406 45289 -98387 -68147 5598 -61221 -12038 43935 45884 127204 107972 31154
5041 31154 68623 79394 69781 24088 -39070 -61624 -97539 -222751 -106355 18168 22397 27775
5029B7775p140N0417m450n276J8720k4636p4756Q203R5929P6348p2656p6637M1557
5016E3398n911M9247r6560j68541p8301N7622R2064M8810k9741m36q772r8716
5004a85837L8010Q0582l5816L5930O4243m2796k2327Q5562L5561l6935q289j21334
4992a13446o9451R0410k2500j18851j9151O0564N2445M1223P3951J14170K6003
4981A15367k7356j01864K2633k1085p3829o8724L1950R1291k1684j30111M033
4970a79379P3348J3672J02289J21582l9260j23244J5265j5830p1354M3924m6793
4959a05780M2679J83341K0699n607p5350m3124j0774j14273r0894N989l8461J40141
4947i1414Q5130m2468l8943O3156j18227m2105K5964J2720M1283O5195L7446j0117
$$ plain form
5029 27775 20635 71052 66602 61326 80046 55410 -19346 -11143 84786 161134 88478 11841 53398
5016 53398 47487 96734 174 -168367 -246668 -189046 -96982 -48172 -77913 -78349 -87121 -185837
5004 -185837 -147827 -67245 -103061 -67131 -2888 -45684 -68011 17551 53112 16177 7888 -113446
4992 -113446 -182897 -92487 -114987 -233838 -252989 -192425 -139980 -98757 -24806 89364 115367
4981 115367 88011 -13853 8780 -12305 -86134 -154858 -122908 -31617 -53301 -183412 -179379
4970 -179379 -106031 -92359 9930 131512 92252 -30992 -15727 -31557 -102911 -58987 -105780
4959 -105780 -63101 120240 140939 135332 59982 16858 6084 -108189 -199083 -193094 -231555 -91414
4947 -91414 -6284 -48752 -87695 -24539 -142766 -184871 -158907 -146187 -104904 -39709 -2263 -12380
4935a2380n2571K1803L1391n1213L3488j799n5400m7517k6210m3383N4660J00444
4923d8687n4480j07922L1506J23834L5550m833l4639m5322J54938J8060o4426
4912C579j17997o9871r9164m556J79616L6614j5059N7076j2823m7013j3247J26571
4900B3726k4155j02896L778j950p2185L7609Q7871Q5676N3024n5934Q459Q1024
4888A24047k396j17170p2778K2718K2743K9471j5741m7264o2164p950O6554P5064
4876A5134p0833n7179Q2433P5775j4276L0415J469j6329J1576k9569m4700m1241
4864e7325L0372J5693m3293L1739J27155L2716p9207j80504m9436K1294J55865
4853E069J11362O276o99q1223N3429l6271j32946L6474o092K4508K713j3159m4790
$$ plain form
4935 -12380 -64951 -43148 -11757 -62970 -29482 -31281 -86681 -134198 -160408 -203791 -149131 -48687
4923 -48687 -103167 -211089 -179583 -55749 -20199 -25032 -59671 -104993 49945 68005 3579
4912 3579 -114418 -184289 -283453 -288009 -108393 -71779 -86838 -29762 -42585 -89598 -102845 23726
4900 23726 -429 -103325 -99547 -101497 -173682 -136073 -48202 37474 90498 34564 43023 124047
4888 124047 121651 4481 -68297 -45579 -22836 6635 -9106 -56370 -118534 -126484 -59930 15134
4876 15134 -55699 -112878 -30445 45330 31054 61469 62938 46609 58185 28616 -16084 -57325
4864 -57325 -26953 -11260 -54553 -22814 104341 137057 57850 -122654 -172090 -150796 5069
4853 5069 116431 122707 122008 40785 94214 57943 -75003 -38529 -44621 -20113 -17400 -30559 -75349
4840g5349J25747O5597J2697J7279n6428p8725p7781k3443q762M8556O2310M0165
4828E1863K5724K5789j4562m0336L912p7031q6685L6681J6548r625J72208J18434
4816B22920o5427r3098o0142l0553o6780J8296J21431n4942N9613M3139o4759
4805B9698r2438o275L4887L9646K4179m1798M850J09562l0237q0013p4848o8376
4793a51163K2602j23284O2157J06943j2281m0530N0519J08994j2164N9095l6796
4782C4092k2425k1369p9555J3245K3575m0732Q1734R922r8503N6248J01680L8079
4770I5991Q261j30403m4392Q593R2032L6975p992p297N5887l6272j03348N7048
4758B5083Q6595o088j159Q6116L4960l5330j40382n056m0804K0248m8998L3252
$$ plain form
4840 -75349 50398 115995 128692 145971 89543 10818 -66963 -90406 -99168 -50612 11698 51863
4828 51863 77587 103376 88814 48478 52390 -24641 -111326 -74645 -58097 -67722 104486 222920
4816 222920 157493 64395 4253 -26300 -93080 -74784 46647 -8295 51318 94457 29698
4805 29698 -62740 -69015 -34128 5518 29697 -12101 -7251 102311 72074 -7939 -82787 -151163
4793 -151163 -128561 -251845 -189688 -82745 -95026 -135556 -85037 23957 11793 70888 34092
4782 34092 11667 -9702 -89257 -76012 -52437 -93169 -11435 -1513 -100016 -43768 57912 95991
4770 95991 104252 -26151 -70543 -61950 30082 67057 59065 51768 107655 71383 -31965 25083
4758 25083 111678 105590 104431 190547 225507 190177 49795 44739 3935 24183 -24815 8437
4746H437P669m6569p8057q1015J34051L8689K3906M7551J5820J8828k3010m1107
$$ plain form
4746 8437 16106 -30463 -108520 -189535 -55484 -16795 7111 54662 70482 89310 66300 25193
$$ [...]
##END NTUPLES=NMR SPECTRUM
##END=
