##TITLE=Analysis number 319465
Compound Code cc 49702
Book Reference 423/72
Project Code adrs
Chemist Name bruced
##JCAMPDX= 6.0         $$ Bruker NMR JCAMP-DX V2.0
##DATA TYPE= NMR SPECTRUM
##DATA CLASS= NTUPLES
##ORIGIN= Bruker BioSpin GmbH
##OWNER= nmr
$$ XWIN-NMR		Version 3.5
$$ Tue May 16 11:54:00 2006 GMT Daylight Time (UT+1h)  MAYBRIDGE\nmr@NMR_250MHZ
##.OBSERVE FREQUENCY= 250.131544655141
##.OBSERVE NUCLEUS= ^1H
##.ACQUISITION MODE= SIMULTANEOUS (DQD)
##.ACQUISITION SCHEME= undefined
##.AVERAGES= 16
##.DIGITISER RES= 18
##SPECTROMETER/DATA SYSTEM= dpx250
##.PULSE SEQUENCE= zg30
##.SOLVENT NAME= CDCl3
##.SHIFT REFERENCE= (INTERNAL, CDCl3, 0, 16.522)
##AUDIT TRAIL= $$ (NUMBER, WHEN, WHO, WHERE, WHAT)
$$ ##TITLE= Audit trail, XWIN-NMR		Version 3.5
$$ ##JCAMPDX= 5.01
$$ ##ORIGIN= Bruker BioSpin GmbH
$$ ##OWNER= nmr
$$ C:\u/data/dgb/nmr/ADRS/4410/pdata/1/auditp.txt
$$ ##AUDIT TRAIL=  $$ (NUMBER, WHEN, WHO, WHERE, WHAT)
(   1,<2006-05-16 11:53:23.49 +100>,<MAYBRIDGE\nmr>,<NMR_250MHZ>,
      <created by zg, POWCHK disabled, PULCHK disabled
       configuration hash MD5:
       84 BC 41 DB A1 6E 1D 46 DA 25 12 A5 C1 ED C5 3A
       data hash MD5: 64K
       9A 48 06 63 9E C1 F3 3C DD 5D A2 14 77 55 7B 45>)
(   2,<2006-05-16 11:53:41.52 +100>,<MAYBRIDGE\nmr>,<NMR_250MHZ>,
      <Start of raw data processing
       ef LB = 0.3 FT_mod = 6 PKNL = 1 SI = 32K 
       data hash MD5: 32K
       81 0A 17 3B 8F ED 6A 25 E0 2A 0B 6D E4 FB 63 45>)
(   3,<2006-05-16 11:53:45.30 +100>,<MAYBRIDGE\nmr>,<NMR_250MHZ>,
      <apk 
       data hash MD5: 32K
       3A B1 94 1B FD D4 AE CD F2 BD FF D2 5F 51 FF 4B>)
(   4,<2006-05-16 11:53:46.36 +100>,<MAYBRIDGE\nmr>,<NMR_250MHZ>,
      <abs ABSG = 5 
       data hash MD5: 32K
       FD DD EB EB 2B 84 42 C1 7B 5A E5 6E 7B 65 30 8F>)
$$ ##END=
$$ 
$$ hash MD5
$$ 2E 2D 4F 33 75 F7 95 F5 A1 A6 71 F1 66 2F 6D 82
##$RELAX= 
##$RELAX= 
##$RELAX= 
##$RELAX= 
##$RELAX= 
##$RELAX= 
##$RELAX= 
$$ Bruker specific parameters
$$ --------------------------
##$DU= <C:\u>
##$EXPNO= 4410
##$NAME= <ADRS>
##$PROCNO= 1
##$TYPE= <nmr>
##$USER= <dgb>
##$AMP= (0..31)
100 100 100 100 100 100 100 100 100 100 100 100 100 100 100 100 100 100 
100 100 100 100 100 100 100 100 100 100 100 100 100 100 
##$AQSEQ= 0
##$AQ_mod= 3
##$AUNM= <au_zg>
##$AUTOPOS= <25 >
##$BF1= 250.13
##$BF2= 250.13
##$BF3= 250.13
##$BF4= 250.13
##$BF5= 500.13
##$BF6= 500.13
##$BF7= 500.13
##$BF8= 500.13
##$BYTORDA= 1
##$CFDGTYP= 0
##$CFRGTYP= 5
##$CHEMSTR= <none>
##$CNST= (0..31)
1 1 145 1 1 1 1 1 1 1 1 1 1 1 1 1 1 1 1 1 1 1 1 1 1 1 1 1 1 1 1 1 
##$CPDPRG= <>
##$CPDPRG1= <>
##$CPDPRG2= <>
##$CPDPRG3= <>
##$CPDPRG4= <mlev>
##$CPDPRG5= <mlev>
##$CPDPRG6= <mlev>
##$CPDPRG7= <mlev>
##$CPDPRG8= <mlev>
##$CPDPRGB= <>
##$CPDPRGT= <>
##$D= (0..31)
0 1 0 0 0 0 0 0 0 0.06 0 0 0 0 0 0 0.0002 0 0 0 0 0 0 0 0 0 0 0 0 0 0 
0 
##$DATE= 1147776800
##$DBL= (0..7)
120 120 120 120 120 120 120 120 
##$DBP= (0..7)
150 150 150 150 150 150 150 150 
##$DBP07= 0
##$DBPNAM0= <>
##$DBPNAM1= <>
$$ [...]
##$SUBNAM7= <"">
##$SUBNAM8= <"">
##$SUBNAM9= <"">
##$SW= 20.6930455092707
##$SWIBOX= (0..15)
0 0 3 0 0 0 0 0 0 0 0 0 0 0 0 0 
##$SW_h= 5175.983436853
##$TD= 65536
##$TD0= 1
##$TE= 295.16
##$TE2= 300
##$TE3= 300
##$TEG= 300
##$TL= (0..7)
0 120 120 120 120 120 120 120 
##$TP= (0..7)
150 150 150 150 150 150 150 150 
##$TP07= 0
##$TPNAME0= <>
##$TPNAME1= <>
##$TPNAME2= <>
##$TPNAME3= <>
##$TPNAME4= <>
##$TPNAME5= <>
##$TPNAME6= <>
##$TPNAME7= <>
##$TPOAL= (0..7)
0.5 0.5 0.5 0.5 0.5 0.5 0.5 0.5 
##$TPOFFS= (0..7)
0 0 0 0 0 0 0 0 
##$TUNHIN= 0
##$TUNHOUT= 0
##$TUNXOUT= 0
##$USERA1= <user>
##$USERA2= <user>
##$USERA3= <user>
##$USERA4= <user>
##$USERA5= <user>
##$V9= 5
##$VALIST= <valist>
##$VCLIST= <CCCCCCCCCCCCCCC>
##$VD= 0
##$VDLIST= <DDDDDDDDDDDDDDD>
##$VPLIST= <PPPPPPPPPPPPPPP>
##$VTLIST= <TTTTTTTTTTTTTTT>
##$WBST= 1024
##$WBSW= 4
##$XGAIN= (0..3)
0 0 0 0 
##$XL= 0
##$YL= 0
##$YMAX_a= 448696
##$YMIN_a= -493174
##$ZGOPTNS= <>
##$ZL1= 120
##$ZL2= 120
##$ZL3= 120
##$ZL4= 120
##$ABSF1= 16.522
##$ABSF2= -4.171173
##$ABSG= 5
##$ABSL= 3
##$ALPHA= 0
##$AQORDER= 0
##$ASSFAC= 0
##$ASSFACI= 0
##$ASSFACX= 0
##$ASSWID= 0
##$AUNMP= <proc_1d>
##$AZFE= 0.1
##$AZFW= 0.1
##$BCFW= 0
##$BC_mod= 0
##$BYTORDP= 0
##$COROFFS= 0
##$CY= 12.5
##$DATMOD= 1
##$DC= 0
##$DFILT= <>
##$DTYPP= 0
##$F1P= 14.0000005364418
##$F2P= -0.99999901652339
##$FCOR= 0.5
##$FTSIZE= 32768
##$FT_mod= 6
##$GAMMA= 0
##$GB= 0
##$INTBC= 1
##$INTSCL= 1
##$ISEN= 128
##$LB= 0.3
##$LEV0= 0
##$LPBIN= 0
##$MAXI= 10000
##$MC2= 0
##$MEAN= 0
##$ME_mod= 0
##$MI= 0
##$NCOEF= 0
##$NC_proc= -3
##$NLEV= 6
##$NOISF1= 0
##$NOISF2= 0
##$NSP= 0
##$NTH_PI= 0
##$NZP= 0
##$OFFSET= 16.522
##$PC= 1
##$PHC0= 164.5742
##$PHC1= 6.512678
##$PH_mod= 1
##$PKNL= yes
##$PPARMOD= 0
##$PSCAL= 4
##$PSIGN= 0
##$REVERSE= no
##$SF= 250.13
##$SI= 32768
##$SIGF1= 0
##$SIGF2= 0
##$SINO= 400
##$SIOLD= 32768
##$SREGLST= <1H.CDCl3>
##$SSB= 0
##$STSI= 32768
##$STSR= 0
##$SW_p= 5175.98343685301
##$SYMM= 0
##$S_DEV= 0
##$TDeff= 65536
##$TDoff= 0
##$TI= <Analysis number 999999
Compound Code 99
Book Reference 9
Project Code 9>
##$TILT= no
##$TM1= 0
##$TM2= 0
##$TOPLEV= 0
##$USERP1= <user>
##$USERP2= <user>
##$USERP3= <user>
##$USERP4= <user>
##$USERP5= <user>
##$WDW= 1
##$XDIM= 32768
##$YMAX_p= 302509510
##$YMIN_p= -50337
$$ End of Bruker specific parameters
$$ ---------------------------------
##NTUPLES= NMR SPECTRUM
##VAR_NAME=  FREQUENCY,     SPECTRUM/REAL,   SPECTRUM/IMAG
##SYMBOL=    X,             R,               I
##VAR_TYPE=  INDEPENDENT,   DEPENDENT,       DEPENDENT
##VAR_FORM=  AFFN,          ASDF,            ASDF
##VAR_DIM=   32768,         32768,           32768
##UNITS=     HZ,            ARBITRARY UNITS, ARBITRARY UNITS
##FACTOR=    0.157963299565203, 1,           1
##FIRST=     4132.6476996994, 0,             0
##LAST=      -1043.33573715361, 0,           0
##MIN=       -1043.33573715361, -50337,      0
##MAX=       4132.6476996994, 302509510,     0
$$ Real data points
##PAGE= N=1
##DATA TABLE= (X++(R..R)), XYDATA
$$ [...]
16842A03251n460N761q406J956j580l181j4361j1416L604Q88r710M169L188p980
$$ 103251 97791 103552 95146 97102 95522 92341 77980 66564 70168 71056 61346 65515 68703 60723
16828F0723K735K507j2576n769K084J909o043J887K275r38p012K119J0626l123
$$ 60723 63458 65965 53389 47620 49704 51613 45570 47457 49732 48794 41782 43901 54527 51404
16814E1404r847o36r690K149K68L765Q217m74J0578O4q170j734L456m796J3056
$$ 51404 41557 40921 31231 33380 33648 37413 45630 45156 55734 55798 47628 45894 49350 44554 57610
16799E7610J4724j0848j2076K267J7630p812m773J407K0294J6426j9772k6745
$$ 57610 72334 61486 49410 51677 69307 61495 56722 58129 78423 94849 75077 48332
16787D8332q98J0417M882p065q755m132M457J5231n5m352j0974J979o840k1710
$$ 48332 47434 57851 62733 55668 46913 42781 47238 62469 62414 58062 47088 49067 42227 20517
16773B0517m049R367J1045j731q455Q966J5579k853j0560P338p6q922k1070O993
$$ 20517 16468 25835 36880 35149 26694 35660 51239 48386 37826 45164 45088 36166 15096 22089
16759B2089n851p531J8480O919K763o772j3213o902L777r279k55r29q351P908
$$ 22089 16238 8707 27187 34106 36869 30097 16884 9982 13759 4480 4225 3296 -5055 2853
16745B853P706M865p503j0055j3447n631J0664J2360Q850m427p410n530J397m72
$$ 2853 10559 15424 7921 -2134 -15581 -21212 -10548 1812 10662 6235 -1175 -6705 -5308 -5780
16731e780M10j825n309K748l704R71Q814l031R95j381J2362K58j493p430p010
$$ -5780 -5370 -7195 -12504 -9756 -13460 -12489 -3675 -6706 -5711 -7092 5270 5528 4035 -3395 -10405
16716a0405J0538K1793K744j2431k801j5991j435J0926o560j604J4980J895o023
$$ -10405 133 21926 24670 12239 9438 -6553 -7988 2938 -3622 -5226 9754 11649 5626
16703E626L686K106J0023M580k015j76L635N913l450j0230m057q69q576j1419
$$ 5626 9312 11418 21441 26021 24006 23830 27465 33378 29928 19698 15641 14772 6196 -5223
16689e223J624j938Q217n777k1081p635J1238K0006j700N151n384j2944Q296Q771
$$ -5223 -3599 -5537 2680 -3097 -24178 -31813 -20575 -569 -2269 2882 -2502 -15446 -7150 1621
16675A621j0172K719O301N363J544j2860j4460j096P341J780j3702j5P476J1573
$$ 1621 -8551 -5832 469 5832 7376 -5484 -19944 -21040 -13699 -11919 -25621 -25636 -18160 -6587
16661f587Q607Q016J734o960q196J631K872J9445L918J5565n207j8690r800p068
$$ -6587 2020 10036 11770 4810 -3386 -1755 1117 20562 24480 40045 34838 16148 6348 -720
16647g20l297k019N756m705o715J0292m636M89J3153L934L104p734N331K095j4945
$$ -720 -4017 -6036 -280 -4985 -11700 -1408 -6044 -5555 7598 11532 14636 6902 12233 14328 -617
16632f17j0677M07Q054J38j1199o36j323N690P642J0891J0972o553k470j888j3580
$$ -617 -11294 -10887 -2833 -2695 -13894 -14530 -15853 -10163 -2521 8370 19342 12789 10319 8431 -5149
16617e149J1047k344o153n169p892j0010M003K281j347R968J0361j955J0121J2671
$$ -5149 5898 3554 -2599 -7768 -15660 -25670 -21667 -19386 -20733 -10765 -404 -2359 7762 20433
16603B0433j72J2530J3885m729l660J0276J873k424O117L327M003R859K744K777
$$ 20433 20261 32791 46676 41947 38287 48563 50436 48012 54129 57456 61459 71318 74062 76839
16589G6839j6386r776o970j9638k0160P872Q958J601J5157l887j5624q839Q445
$$ 76839 60453 50677 43707 24069 3909 11781 20739 22340 37497 33610 17986 9147 17592
16576A7592r3j0315q56M363o834k15N409J186j0895j0638j7305j392L885r69k655
$$ 17592 17499 7184 6328 10691 3857 3642 9051 10237 -658 -11296 -28601 -29993 -26108 -27077 -29732
16561b9732k070j937m560J1608R740P953p24o506j3551n050J7045L503k484K939
$$ -29732 -31802 -33739 -38299 -26691 -16951 -8998 -9722 -16228 -29779 -34829 -17784 -14281 -16765 -13826
16547a3826O993l856m628j3050N587n369J0323Q192M398o639n285O860Q773m502
$$ -13826 -6833 -10689 -15317 -28367 -22780 -28149 -17826 -9634 -5236 -11875 -17160 -10300 -1527 -6029
16533f029R265j468q498q729n584l170P039J2777M547O745n716m678J4674P105
$$ -6029 3236 1768 -6730 -15459 -21043 -24213 -17174 -4397 150 6895 1179 -3499 11175 18280
16519A8280r595n296j299n226j7166r84k871k904J3236N089k56m128Q256l052
$$ 18280 8685 3389 2090 -3136 -20302 -21286 -24157 -27061 -13825 -8736 -8992 -13120 -4864 -7916
16505g916Q21l945J5147j763P954J5301M024o093j223J932L360o256J1941K3399
$$ -7916 -7095 -11040 4107 2344 10298 25599 29623 23530 22307 24239 27599 21343 33284 56683
16491E6683L7827J3628J1213J4687J4123J2598L5670N4032Q0358M1938J2399l2279
$$ 56683 94510 108138 119351 134038 148161 160759 196429 250461 330819 372757 385156 352877
16479C52877m9210j4880L4896M5623K1392p084k7477p4019n6392j5334j5234j4608
$$ 352877 303667 288787 323683 369306 390698 383614 356137 282118 225726 210392 195158 180550
16467A80550j1822k2491k3757j1446L071q01J722r174j6513k7878j8273K020o741
$$ 180550 168728 146237 122480 111034 114105 113304 115026 105852 89339 61461 43188 45208 38467
16454C8467p890L687N911o727m787J1505q610j4997N485R961j920n811J283k691
$$ 38467 30577 34264 40175 33448 28661 40166 31556 16559 22044 32005 30085 24274 25557 22866
16440B2866J447l360Q33p738j111J9155m962l191N297k631N406k384j1567j0756
$$ 22866 24313 20953 21786 14048 12937 32092 27130 23939 29236 26605 32011 29627 18060 7304
16426G304j283j79L666k733n178j0241Q047Q269n327j545r409m495J0486J9787
$$ 7304 6021 5842 9508 6775 1597 -8644 -597 7672 2345 800 -8609 -13104 -2618 17169
16412A7169k95o692q372r360r27M232q15j199J6440L67N615Q881L799r883j7756
$$ 17169 16874 10182 1810 -7550 -8477 -4245 -5060 -6259 10181 10548 16163 25044 28843 18960 1204
16397A204P841J6212j277r482p685m482K785R443p32M71K323o03o305p123q094
$$ 1204 9045 25257 23980 14498 6813 2331 5116 14559 13827 14298 16621 16018 9713 2590 -5504
16382e504j3796M9J787J2857J2361j494j8187l492J1048K797K459p126l20P211
$$ -5504 -19300 -19251 -17464 -4607 7754 6260 -11927 -15419 -4371 -1574 885 -6241 -6561 650
16368F50J9080j3672j4080n27n094M434J0910R042Q466j876k3381j1090Q389n879
$$ 650 19730 6058 -8022 -8549 -13643 -9209 1701 10743 19209 17333 -6048 -17138 -8749 -14628
16354a4628L042L101r259j1810O456k499p125N637J1542J0015q109L920J207L128
$$ -14628 -11586 -8485 -17744 -29554 -23098 -25597 -32722 -27085 -15543 -5528 -13637 -9717 -8510 -5382
16340e382J5675j2145j0335k268K084M943n635L415J8023q476j4913o401l949
$$ -5382 10293 -1852 -12187 -14455 -12371 -7428 -13063 -9648 8375 -101 -15014 -21415 -25364
16327b5364o989R447K0347J5089o628k345J052l736O10m62l069M459J925R37j5062
$$ -25364 -32353 -22906 -2559 12530 5902 3557 4609 873 1483 1021 -2048 2411 4336 5273 -9789
16312i789o949o631J2165k411j0931l825P908J8853l805j362J5635l01n700R89
$$ -9789 -16738 -23369 -11204 -13615 -24546 -28371 -20463 -1610 -5415 -6777 8858 8557 2857 3846
16298C846o549N066l417M551J1061j766q323k0637L879m535k48m655j5005O095
$$ 3846 -2703 2363 -1054 3497 14558 12792 4469 -16168 -12289 -16824 -17072 -21727 -36732 -30637
16284c0637J6548O664l934O415J4762o286O497r44j5230m569q260k652R716O512
$$ -30637 -14089 -7425 -11359 -4944 9818 3532 10029 9085 -6145 -10714 -18974 -21626 -11910 -5398
16270e398J4019p509q167L114J3738j5248j5331n374J271J0170K8188l4j7706
$$ -5398 8621 1112 -7055 -3941 9797 -5451 -20782 -26156 -24885 -14715 13473 13439 -4267
16257d267r031j0540M005J8254K766j1874J354L022r463m202J8931q414p96n949
$$ -4267 -13298 -23838 -19833 -1579 1187 -10687 -9333 -6311 -15774 -19976 -1045 -9459 -10255 -16204
16243a6204O952N799j3409M736J3368J713Q403L457O02m253j7164J307Q241L910
$$ -16204 -9252 -3453 -16862 -12126 1242 2955 11358 14815 15417 11164 -6000 -4693 3548 7458
16229G458N027l5q417n741m696L351j8700r26J4795j02p319m852J9846K092j6169
$$ 7458 12485 12450 4033 -1708 -6404 -3053 -21753 -22679 -7884 -7986 -15305 -20157 -311 1781 -14388
16214a4388O438m358p283K140O466L992k057K304M278Q926J5038l835m152l069
$$ -14388 -7950 -12308 -19591 -17451 -10985 -6993 -9050 -6746 -2468 6458 21496 17661 13509 10440
16200A0440P7j3801r417K048l435m901l639J0272O713l435o481K956J5315n816
$$ 10440 10517 -3284 -12701 -10653 -14088 -18989 -22628 -12356 -5643 -9078 -15559 -12603 2712 -3104
16186c104L238Q472O319n492J662n371J101O736J159o771k0169k1859k167J1085
$$ -3104 134 8606 14925 9433 11095 5724 6825 13561 14720 7949 -12220 -34079 -36246 -25161
16172b5161K3816L691L192p688j999p920o690O876j0281j2472R825L69J0883J960
$$ -25161 -1345 2346 5538 -2150 -4149 -12069 -18759 -11883 -22164 -34636 -24811 -24442 -13559 -11599
16158a1599m988R682J2645l695j3413j5635l779K0480J6306j8346r232j3138l161
$$ -11599 -16587 -6905 5740 2045 -11368 -27003 -30782 -10302 6004 -12342 -21574 -34712 -37873
16145c7873q37P608Q903q468k433k134J1850q524r926k248R794k132P182r344
$$ -37873 -38710 -31102 -22199 -30667 -33100 -35234 -23384 -31908 -41834 -44082 -34288 -36420 -29238 -38582
16131c8582q010P784K1140Q028L070J4762q178j2342q797j204O955J4518j417
$$ -38582 -46592 -38808 -17668 -9640 -6570 8192 14 -12328 -21125 -22329 -15374 -856 -2273
16118b273L537k52J471r080r482m872n772J1582O226k86Q033J237m020o782m322
$$ -2273 1264 1012 2483 -6597 -16079 -20951 -26723 -15141 -8915 -9201 -1168 69 -3951 -10733 -15055
16103a5055l110J1089K947j761P998K538m126L402m343R351j4302j1789L713J6891
$$ -15055 -18165 -7076 -4129 -5890 2108 4646 520 3922 -421 8930 -5372 -17161 -13448 3443
16089C443J5380j995j4283l994M939P108n782l739q237M818j3647j904J5200J9248
$$ 3443 18823 16828 2545 -1449 3490 10598 4816 1077 -7160 -2342 -15989 -17893 -2693 16555
16075A6555J3769p541j5470j0242r766J854r136k249O722m866Q154j2532N058
$$ 16555 30324 22783 7313 -2929 -12695 -10841 -19977 -22226 -15504 -20370 -12216 -24748 -19690
16062a9690R731j06J341K112j204R742R253l144j4114p34Q36q0R280L319j3719
$$ -19690 -9959 -10065 -8724 -6612 -7816 1926 11179 8035 -6079 -6813 -5977 -6057 3223 6542 -7177
16047g177q381J1834K0319J132q201j273K595j1695p186k96j829Q16K04J977J8351
$$ -7177 -15558 -3724 16595 17727 9526 8253 10848 -847 -8033 -8329 -10158 -9342 -9138 -7161 11190
16032A1190J1654j8604q946P525K838r054Q612l459M740p352m171n886J0172J4650
$$ 11190 22844 4240 -4706 2819 5657 -3397 5215 1756 6496 -856 -5027 -10913 -741 13909
16018A3909Q741j1375K32L679j619l720k2460j3392K1301K0512k290L946J282
$$ 13909 22650 11275 11507 15186 13567 9847 -12613 -26005 -4704 15808 13518 17464 18746
16005A8746k0529l706r073q495o507l252M155N176O523R027O624p442Q379J2221
$$ 18746 -1783 -5489 -14562 -23057 -29564 -32816 -28661 -23485 -16962 -7935 -1311 -8753 -374 11847
15991A1847o754M825j044K17p652L034P265L713k1503j0179m282n255M431J9930
$$ 11847 5093 9918 8874 9091 1439 4473 11738 15451 -6052 -16231 -20513 -25768 -21337 -1407
15977a407J0329J0856r63n160r370o815k910k100o343m62N347P248J6316J5336
$$ -1407 8922 19778 18815 13655 4285 -2530 -5440 -7540 -13883 -14345 -8998 -1750 14566 29902
15963B9902n125K156j8593k1482r163j354L553l768o955P586N847K285j769K479
$$ 29902 24777 26933 8340 -13142 -22305 -23659 -20106 -23874 -30829 -23243 -17396 -15111 -16880 -14401
15949a4401J2575p095r272o818Q54j819N043R728M235r904j725j0850J1314O316
$$ -14401 -1826 -8921 -18193 -25011 -24157 -25976 -20933 -11205 -6970 -16874 -18599 -29449 -18135 -11819
15935a1819q993j7271m947K014P647J3814J2706l055M478l649l710n243m238K40
$$ -11819 -20812 -38083 -43030 -41016 -33369 -19555 -6849 -9904 -5426 -9075 -12785 -18028 -22266 -22026
15921b2026J2783m782o815J0813J1908l911o356j5638N958J7110Q811l530q450
$$ -22026 -9243 -14025 -20840 -10027 1881 -2030 -8386 -24024 -18066 -956 7855 4325 -4125
15908d125p60L594j558L927j3472q84J0713Q69j0995K546l145L861K156j0285
$$ -4125 -4885 -1291 -2849 1078 -12394 -13278 -2565 -1696 -12691 -10145 -13290 -9429 -7273 -17558
15894a7558j766L732J1832N686r528K336O102j7602r086K0255N64J998n056L143
$$ -17558 -19324 -15592 -3760 1926 -7602 -5266 836 -16766 -25852 -5597 -5033 -3035 -8091 -4948
15880d948M124n925P523J7429k716j1798j1139j0580J3355M978j374j0386P710
$$ -4948 -824 -6749 774 18203 15487 3689 -7450 -18030 -4675 303 -1071 -11457 -3747
15867c747k917l821Q333q984n762q743q79K2895L820q418K34M614j129j6849R885
$$ -3747 -6664 -10485 -2152 -11136 -16898 -25641 -26520 -3625 195 -8223 -7989 -3375 -4504 -21353 -11468
15852a1468J2420m545j155P089j058o182N739O71j4217n018J6653J486j993m595
$$ -11468 952 -3593 -4748 2341 1283 -4899 840 1511 -12706 -17724 -1071 415 -1578 -6173
15838f173p364n490k5808K08J8405J4753M310L859L518R504Q7o369j2121j4755
$$ -6173 -13537 -19027 -44835 -44627 -26222 -11469 -7159 -3300 218 9722 9809 3440 -8681 -23436
15824b3436P085l5Q089L705L126Q44j3562r710L191o684P386J4601J1298m32M750
$$ -23436 -16351 -16386 -8297 -4592 -1466 -622 -14184 -23894 -20703 -27387 -20001 -5400 5898 5466 10216
15809A0216M489n095J800R434k484j4064j3044J0239R151J7953n770q915j0681
$$ 10216 14705 9610 11410 20844 18360 4296 -8748 1491 10642 28595 22825 13910 3229
15796C229N647k645L1L334j536n459n144o52j818j1839k856O068q942K142J8369
$$ 3229 8876 6231 6262 9596 8060 2601 -2543 -3195 -5013 -16852 -19708 -13640 -22582 -20440 -2071
15781b071R196J5004L150l132r187m424p93r737l092J5059L080M107j4218q700
$$ -2071 7125 22129 25279 22147 12960 8536 7743 -1994 -5086 9973 13053 17160 2942 -5758
15767e758K04N728J0792P267j3162k2296k682p76o254J384O093R762j851P635
$$ -5758 -5554 174 10966 18233 5071 -17225 -19907 -20683 -26937 -25553 -19460 -9698 -11549 -3914
15753c914J1652R477M047j3M965n594O13r736j2898j2494p045J2077J9068n491
$$ -3914 7738 17215 21262 21249 26214 20620 21233 11497 -1401 -13895 -20940 -8863 10205 4714
15739D714k554J8883o12j0555q735j8184o672o678J405J5627J1220p516q879J1868
$$ 4714 2160 21043 20431 9876 1141 -17043 -23715 -30393 -28988 -13361 -2141 -9657 -18536 -6668
15725f668J2808n640K266L23j3111k3465o606O083J7952J5550L254K806j0034
$$ -6668 6140 500 2766 3089 -10022 -33487 -40093 -34010 -16058 -508 2746 5552 -4482
15712d482k1329M838j457q618j1987J4024m385J4282j406O333J22p22p436J526
$$ -4482 -25811 -20973 -22430 -31048 -43035 -29011 -33396 -19114 -20520 -14187 -14065 -14787 -22223 -20697
15698b0697J1654k041M136p460J836K85k918J2875J0879L56j3336K362J8527J0757
$$ -20697 -9043 -11084 -6948 -14408 -12572 -12287 -15205 -2330 8549 8905 -4431 -2069 16458 27215
15684B7215k612O28l499j7409m645j9689q820j002k49j1352n085J0318J185j1994
$$ 27215 24603 25231 21732 4323 -322 -20011 -28831 -29833 -30082 -41434 -46519 -36201 -35016 -47010
15670d7010K399R321M237J3387J1908L392k363o44J6382Oj473l617r096q858j1091
$$ -47010 -44611 -35290 -31053 -17666 -5758 -2366 -4729 -5373 11009 11015 9542 5925 -3171 -12029 -23120
15655b3120N349j1274J669R843J5637M380o626q15k534R623L900j7745j171R987
$$ -23120 -17771 -29045 -27376 -17533 -1896 2484 -4142 -4957 -7491 2132 6032 -11713 -12884 -2897
15641b897P097O332M46j0596q728M472M191q900n171m988K796R737j7841j5809
$$ -2897 4200 10532 10978 382 -8346 -3874 317 -8583 -13754 -18742 -15946 -6209 -24050 -39859
15627c9859N894J6979J2501k344k727q074O986Q982N429P057p981j3731M53J1195
$$ -39859 -33965 -16986 -4485 -6829 -9556 -17630 -10644 -1662 3767 10824 2843 -10888 -10435 760
15613G60p525m579p70J0373O080l398q920J872o650M726O560j2098k754J3074
$$ 760 -6765 -11344 -12114 -1741 4339 941 -7979 -6107 -12757 -8031 -1471 -13569 -16323 -3249
15599c249P288P148q71l922K168Q01j205o640P786L76k302j114p967L013J6293
$$ -3249 4039 11187 10316 6394 8562 9363 8158 1518 9304 9680 7378 6264 -1703 1310 17603
15584A7603R491j0213k5242r682R69K18K849j238j284k938r72N758K63Q506K294
$$ 17603 27094 16881 -8361 -18043 -17074 -16856 -14007 -15245 -16529 -19467 -20439 -14681 -14418 -5912 -3618
15569c618j0054K831J2711j0219Q05J0340J0361j1094j9665n731m983P246l238
$$ -3618 -13672 -10841 1870 -8349 -7544 2796 13157 2063 -17602 -23333 -28316 -21070 -24308
15556b4308M882K0898O902o710j8860o726P887l207o200K295o972J8476K938p465
$$ -24308 -19426 1472 8374 1664 -17196 -23922 -16035 -19242 -25442 -23147 -30119 -11643 -8705 -16170
15542a6170N729O45K306j609q506r189K2448Q469m075j3337j5326L774l308M258
$$ -16170 -10441 -9796 -7490 -9099 -17605 -26794 -4346 4123 48 -13289 -28615 -24841 -28149 -23891
15528b3891K1593n065l854j2452m814J2284J9632Q269K911j5641j5649K915O878
$$ -23891 -2298 -7363 -11217 -23669 -28483 -16199 3433 11702 14613 -1028 -16677 -13762 -6884
15515f884K369L74J1265N385o83p655j4959K342P521J775J2996l089n209K711
$$ -6884 -4515 -4141 7124 12509 11826 4171 -10788 -8446 -925 850 13846 10757 5548 8259
15501H259j832Q114p917j3832m139m024k318P518m437n703J42P136J4687l337
$$ 8259 6427 14541 6624 -7208 -11347 -15371 -17689 -10171 -14608 -20311 -20169 -13033 1654 -1683
15487a683q519j0204r130l213K169P922J3456J2104J3144o904J010J4254j3888
$$ -1683 -10202 -20406 -29536 -32749 -30580 -22658 -9202 2902 16046 9142 10152 24406 10518
15474A0518j5085K672R90r227r497p284l42J443k335l16J9792J5049L972o872
$$ 10518 -4567 -1895 -905 -10132 -19629 -26913 -27255 -25812 -28147 -28463 -8671 6378 10350 3478
15460C478J722k151J593L042M095n308j0786j2465l254K2844N698o398j156l00
$$ 3478 5200 3049 4642 7684 11779 6471 -4315 -16780 -20034 2810 8508 2110 954 654
15446F54o423m625r816j0682k700K476J4247J9193K0167n329k4158k0531J6488
$$ 654 -5769 -10394 -20210 -30892 -33592 -31116 -16869 2324 22491 17162 -6996 -27527 -11039
15433a1039J0553P418P691j4313j9194o265J1911L604J0150r827j2878L719J0822
$$ -11039 -486 6932 14623 310 -18884 -25149 -13238 -9634 516 -9311 -22189 -18470 -7648
15420g648K375K009P283L659n886K607J957o778J330K442j0665k079k378l76O432
$$ -7648 -5273 -3264 4019 7678 1792 4399 6356 -422 908 3350 -7315 -9394 -11772 -12148 -5716
15405e716J8367l636o745l791j551j4333j5295P64J615r243K830J3830K0024P716
$$ -5716 12651 9015 2270 -1521 -3072 -17405 -32700 -31936 -30321 -39564 -36734 -22904 -2880 4836
15391D836o449l561k050P809J1655p618j2496l465J0451R89o989n498m176Q286
$$ 4836 -1613 -5174 -7224 585 12240 4622 -7874 -11339 -888 101 -6888 -12386 -16562 -8276
15377h276J233M141P478k117J502M404k094o766p94m903p328M958L241J631L075
$$ -8276 -7043 -2902 4576 2459 3961 8365 6271 -495 -1289 -6192 -13520 -8562 -5321 -3690 -615
15362f15j1816O375J0690L283P234l13j6700p256O31L45n161l55j6063l211N272
$$ -615 -12431 -6056 4634 7917 15151 14838 -1862 -9118 -8487 -8142 -13303 -13658 -29721 -32932 -27660
15347b7660J1021O060L76M693R733o143M926L102K827o128j6026l604Q829R346
$$ -27660 -16639 -10579 -10203 -5510 4223 -1920 3006 6108 8935 2807 -13219 -16823 -7994 1352
15333A352m717l469J623l811J1392J2816J404m345l121O82m251l436o08k465P10
$$ 1352 -3365 -6834 -5211 -9022 2370 15186 16590 12245 9124 9806 5555 2119 1511 -954 -244
15318b44j0262q970J504k153o427m963J0286R841K981J6550p151m416J0181k330
$$ -244 -10506 -19476 -17972 -20125 -26552 -31515 -21229 -11388 -8407 8143 992 -3424 6757 4427
15304D427r236p400p530q991Q011P317j0202M117Q911R732K869P111M559j1684
$$ 4427 -4809 -12209 -19739 -28730 -20719 -13402 -23604 -19487 -10576 -844 2025 9136 13695 2011
15290B011m686R163l067j6854R967N2l084P739M583Q545J718j7614q708L858p282
$$ 2011 -2675 6488 3421 -13433 -3466 -3414 -6498 1241 5824 14369 16087 -1527 -10235 -6377 -13659
15275a3659J4798R371R440j4328j7480j0285J82J0333Q04J1623J377l934p558
$$ -13659 1139 10510 19950 5622 -11858 -22143 -21961 -11628 -10824 799 2176 -1758 -9316
15262i316m074n163J205O565N340k821L102R684n332o90k246K529J101k745p38
$$ -9316 -13390 -18553 -17348 -10783 -5443 -8264 -5162 4522 -810 -1500 -3746 -1217 -116 -2861 -3599
15247c599K861M87n343p820J9340J396j3697r229o566P111J5390o246q265o61
$$ -3599 -738 -251 -5594 -13414 5926 7322 -6375 -15604 -22170 -15059 331 -5915 -14180 -14841
15233a4841L013l85K1310J7195q62j5921o653P500j368j7038O201Q616P067L75
$$ -14841 -11828 -12213 9097 26292 25430 9509 2856 10356 8988 -8050 -1849 6767 13834 14209
15219A4209k19m973q786K600K0534j2123j7013O573q65k064O568j2509o945J5872
$$ 14209 13990 9017 231 2831 23365 11242 -5771 802 -63 -2127 4441 -8068 -15013 859
15205H59O783n246r890p78O689l340l712Q28J5300K202r179l182J3145j0789r161
$$ 859 7642 2396 -7494 -8272 -1583 -4923 -8635 -7807 7493 9695 516 -2666 10479 -310 -9471
15190i471P641J2790m316j0085j1902q417m65K666N885O026P407j7796J157J4037
$$ -9471 -1830 10960 6644 -3441 -15343 -23760 -24225 -21559 -15674 -9648 -2241 -20037 -18880 -4843
15176d843N661r65q025n713O895P105J3083K906l586J834O28n873n797j0233p773
$$ -4843 818 -147 -8172 -13885 -6990 115 13198 16104 12518 14352 14980 9107 3310 -6923 -14696
15161a4696M94J4850l348N862Q765P861L239K516j9845j0750J653q176R77J4610
$$ -14696 -14202 648 -2700 3162 11927 19788 23027 25543 5698 -5052 -3399 -11575 -10598 4012
15147D012q210o393R118j0876n420q701R047M800m35J770m564J0872Q596k015
$$ 4012 -4198 -10591 -1473 -12349 -17769 -26470 -17423 -12623 -13058 -11288 -15852 -4980 3616 1601
15133A601n137l431J175j363Q146o978Q473N564n98p069j2854L808P146n044j559
$$ 1601 -3536 -6967 -5792 -7155 991 -5987 2486 8050 7452 383 -12471 -8663 -1517 -6561 -8120
15118h120J6271R333n342n2j2027j4393p076k490J714J2877P659o772J254K832
$$ -8120 8151 17484 12142 12090 63 -14330 -21406 -23896 -22182 -9305 -1646 -8418 -7164 -4332
15104d332J0101l064J646N673J3083o095r845o971k735K657Q684m012l624j4220
$$ -4332 5769 2705 4351 10024 23107 17012 7167 196 -2539 118 8802 4790 1166 -13054
15090a3054m210n933J9900O57l03p14M821J1147N820m33o512j697K77M766K545
$$ -13054 -17264 -23197 -3297 -2640 -2943 -3657 1164 12311 18131 17698 11186 9489 9766 14532 17077
15075A7077L042M778m202j3620p195p489P204m97J892Q398j1013j9097j933p48
$$ 17077 20119 24897 20695 7075 -120 -7609 -405 -902 990 9388 -1625 -20722 -22655 -23403
15061b3403r22l830J3152J0467M916o568L64j1206l180O189N223P978K077J3447
$$ -23403 -24325 -28155 -15003 -4536 380 -6188 -5824 -17030 -20210 -14021 -8798 -820 1257 14704
15047A4704J8199M714k8075p720Q30r705l285j4584N4J0875J4260M831R631l617
$$ 14704 32903 37617 9542 1822 2652 -7053 -10338 -24922 -24868 -13993 267 5098 14729 11112
15033A1112j3280o714J2962o23L63o767N842J2111n476r361L151m250q066M982
$$ 11112 -2168 -8882 4080 3457 3820 -2947 2895 15006 9530 169 3320 -930 -8996 -4014
15019d014K1943j3812j4359m98J5112O096j6571J29n256J1208l740K972M297m755
$$ -4014 17929 4117 -10242 -10740 4372 10468 -6103 -5974 -11230 -22 -3762 -790 3507 -1248
15005a248k527l943l910P31m553J8771J1368n706j1217j0498m110m943K245O429
$$ -1248 -3775 -7718 -11628 -10897 -15450 3321 14689 8983 -2234 -12732 -16842 -21785 -19540 -13111
14991a3111P161l246J0256Q312M720m157k722l21r042n819j1912J1744K0812L258
$$ -13111 -5950 -9196 1060 9372 14092 9935 7213 6892 -2150 -7969 -19881 -8137 12675 15933
14977A5933k98j5923m840k242M31N826J2371j4j4508k745N649j36n281Q164J2070
$$ 15933 15635 -288 -5128 -7370 -6939 -1113 11258 11244 -3264 -6009 -360 -496 -5777 2387 14457
14962A4457L881M99k548j0288k2O204J0578n32q271M89J5650N428l141r693j1307
$$ 14457 18338 18837 16289 6001 5979 12183 22761 22229 13958 14447 30097 35525 32384 22691 11384
14947A1384j3836K861R225k3354j7013m640j321R272M756L206l295k896J3799
$$ 11384 -2452 409 9634 -13720 -30733 -35373 -36694 -27422 -22666 -19460 -22755 -25651 -11852
14934a1852m609R520J2307J100p361j2542l163j1555J2465O050L924M539k163
$$ -11852 -16461 -6941 5366 6466 -895 -13437 -16600 -28155 -15690 -9640 -5716 -1177 -3340
14921c340J2516p30j1584K52l510r758M924K520j1996J4321J4081J832q251l908
$$ -3340 9176 8446 -3138 -2886 -6396 -16154 -11230 -8710 -20706 -6385 7696 9528 1277 -2631
14907b631L705P377Q498j807j2097J60O506J5359O392j4465n339l190P517m611
$$ -2631 1074 8451 16949 15142 3045 3205 9711 25070 31462 16997 11658 8468 15985 11374
14893A1374j6243j571R68J4173p003j4400q621J3152J1232Q809L880N142J951
$$ 11374 -4869 -6440 -5472 8701 1698 -12702 -21323 -8171 3061 11870 15750 20892 22843
14880B2843j1910q454K586k5905j1787L321N957J3760j337m276q908P316R924
$$ 22843 10933 2479 5065 -20840 -32627 -29306 -23349 -9589 -10926 -15202 -24110 -16794 -6870
14867f870j624o634J062n121J586J250P98o037N61N972j868r360J5798K4801R21
$$ -6870 -8494 -15128 -14066 -19187 -17601 -16351 -15553 -21590 -21029 -15057 -16925 -26285 -10487 14314 15235
14852A5235N043K692k260n928p699P655Q1L403r124o424J1944l656k3304q631
$$ 15235 20278 22970 20710 14782 7083 14738 14819 18222 9098 2674 14618 10962 -12342 -20973
14838b0973J4245k807r770P098m86Q929R400p530j0503O596k143M605Q284j563
$$ -20973 -6728 -9535 -19305 -12207 -12693 -3764 5636 -1894 -12397 -5801 -7944 -3339 4945 3382
14824C382O985J2638P372m018j5190j2855L483P370R221j5464r191l643R25K717
$$ 3382 10367 23005 30377 26359 11169 -1686 1797 9167 18388 2924 -6267 -9910 -8985 -6268
14810f268N954R510R853O15j1532j1545K775N871m268j730k908O403P56Q968o647
$$ -6268 -314 9196 19049 19664 8132 -3413 -638 5233 965 -765 -3673 2730 3486 12454 5807
14795E807j0514J1150L828O782l657N478L672k4008j7788K075J175p78m323K730
$$ 5807 -4707 6443 10271 17053 13396 18874 22546 -1462 -19250 -17175 -16000 -16778 -21101 -18371
14781a8371J557R112o359J6104R986j2014j0791J827J1897K3308J599j9391r046
$$ -18371 -16814 -7702 -14061 2043 12029 15 -10776 -8949 2948 26256 27855 8464 -582
14768e82n02k203l590q250N939KL003R83M964Q842q690K986M064p890o650L12
$$ -582 -1084 -3287 -6877 -15127 -9188 -9186 -6183 -5200 -236 8606 -84 2902 6966 -924 -7574 -7262
14752g262R741j0813M459M88o876M36O518l594p627k527l113j1955Q12K1207K9629
$$ -7262 2479 -8334 -3875 -3387 -10263 -9827 -3309 -6903 -14530 -17057 -20170 -32125 -31313 -10106 19523
14737A9523J2465o882o580j8867q584q170J392N742K480l070j069l750j72j0833
$$ 19523 31988 25106 18526 -341 -8925 -17095 -15703 -9961 -7481 -10551 -11620 -15370 -15542 -26375
14723b6375P438J4541m413q706p232J8054P476J3381r85M008j501k5878n244K72
$$ -26375 -18937 -4396 -8809 -17515 -24747 -6693 783 14164 13179 17187 15686 -10192 -15436 -15164
14709a5164K356Q508J5173m458j2989o321j1085l470m37k068K2059J0646j120
$$ -15164 -12808 -4300 10873 6415 -6574 -12895 -23980 -27450 -27887 -29955 -7896 2750 1630
14696A630k55P846j885j886j432n247j8171n523P706J715J4904J0642Q927R18
$$ 1630 1375 9221 7336 5450 4018 -1229 -19400 -24923 -17217 -15502 -598 10044 18971 19889
14682A9889j7039j4037P937M261m404q634o006r637l61m5N837L986M607r599o00
$$ 19889 2850 -11187 -3250 1011 -3393 -12027 -18033 -27670 -28031 -28076 -22239 -18253 -13646 -23245 -23845
14667b3845O453P800N791J1350j0354p128k341J1716M259Q935j5669j3229M809
$$ -23845 -17392 -9592 -3801 7549 -2805 -9933 -12274 -558 3701 12636 -3033 -16262 -11453
14654a1453J5753p917j900m437k751l561L484L923R737M508j0696L439O60m760
$$ -11453 4300 -3617 -5517 -9954 -12705 -16266 -12782 -8859 878 5386 -5310 -1871 -1211 -5971
14640e971o339L349J5762m419p318j0734Q804m105p517O202J2801m621J881l087
$$ -5971 -12310 -8961 6801 2382 -4936 -15670 -6866 -10971 -18488 -12286 515 -4106 -2225 -5312
14626e312L631j852p561R257M141O126j6381o803Q3P424J805o215Q746j1904K372
$$ -5312 -1681 -3533 -11094 -1837 2304 8430 -7951 -14754 -14671 -7247 -5442 -11657 -2911 -14815 -12443
14611a2443J0554L948n364P757k167M399j875M992j3261p402N773M595K345L614
$$ -12443 -1889 2059 -3305 4452 2285 6684 4809 9801 -3460 -10862 -5089 -494 1851 5465
14597E465j2527l604M03O879O455m67j2524J794j1261j5567N876J6091K1361R290
$$ 5465 -7062 -10666 -10263 -3384 3071 2604 -9920 -8126 -19387 -34954 -29078 -12987 8374 17664
14583A7664k008n280P463r933l088K255o349j0835O978L53p008N236Q020n135
$$ 17664 15656 10376 17839 7906 4818 7073 724 -10111 -3133 -2780 -9788 -4552 3468 -1667
14569a667p072M746J2677K414m824j843r807K836l814n124j0700p065J0662N595
$$ -1667 -8739 -3993 8684 11098 6274 4431 -5376 -2540 -6354 -11478 -22178 -29243 -18581 -12986
14555a2986P782J247n709J780R67l343j1459R401k086J5428R35M533J509j4614
$$ -12986 -5204 -3957 -9666 -7886 -6919 -10262 -21721 -12320 -14406 1022 1957 6490 7999 -6615
14541f615j9347m213L192K192J669K848o073l686j898L245j974R359O263N05J4008
$$ -6615 -25962 -30175 -26983 -24791 -23122 -20274 -26347 -30033 -31931 -28686 -30660 -21301 -15038 -14533 -525
14526e25K285J4149J855q496l845O908m123j9254m943K601P11r026p292m84J8373
$$ -525 1760 15909 17764 9268 5423 12331 8208 -11046 -15989 -13388 -12677 -21703 -28995 -29479 -11106
14511a1106J2884P55j1253k440K209k437r463o282M449J753J1760J1554OM938
$$ -11106 1778 2533 -8720 -11160 -8951 -11388 -20851 -27133 -22684 -20931 -9171 2383 2389 7327
14497G327J968j5139M846p875P025R573q462N897j283j9731L231M375P34J0007
$$ 7327 9295 -5844 -998 -8873 -1848 7725 -737 5160 3877 -15854 -12623 -8248 -7514 2493
14483B493N416q647r793r827j0289l15J1269K229J1292j0226p097N675L591j475
$$ 2493 7909 -738 -10531 -20358 -30647 -30962 -19693 -17464 -6172 -16398 -23495 -17820 -14229 -15704
14469a5704m832O32R880l157q378r983J0355K205J409p34Q589J0576k612J0609
$$ -15704 -20536 -19904 -10024 -13181 -21559 -31542 -21187 -18982 -17573 -18307 -9718 858 -1754 8855
14455H855P846j5770j8332p511K471J7145Q663j847l118q994L674l498N03l243
$$ 8855 16701 931 -17401 -24912 -22441 -5296 3367 1520 -1598 -10592 -6918 -10416 -9913 -13156
14441a3156l145Q972J1645j407r547J1940J0874L302n39O894N128N567l080j4334
$$ -13156 -16301 -7329 4316 2909 -6638 5302 16176 19478 18939 25833 30961 36528 33448 19114
14427A9114k4181m911L703M436k674j5567j5428R808J1742K753K06k043k492K02
$$ 19114 -5067 -9978 -6275 -1839 -4513 -20080 -35508 -25700 -13958 -11205 -10999 -13042 -15534 -15332
14413a5332l349m246J7235K040l673J971L804l016p9Q957m525m908m977J0005
$$ -15332 -18681 -22927 -5692 -3652 -7325 -5354 -1550 -4566 -4645 4312 -213 -5121 -10098 -93
14399i3k790j0561k4857R92J3558J5279J0741j827K927o647m127j069M671J49
$$ -93 -2883 -13444 -38301 -37309 -23751 -8472 2269 442 3369 -3278 -7405 -8474 -3803 -3654
14385c654p434o028j473M670P158J6271M599k585k037j6706K231K226J0954M054
$$ -3654 -11088 -17116 -18589 -13919 -6761 9510 14109 11524 9487 -7219 -4988 -2762 8192 12246
14371A2246m535N016j3392q579l093J9532M684j1582k080o104P749q36j5860J6343
$$ 12246 7711 12727 -665 -9244 -12337 7195 11879 297 -1783 -7887 -138 -974 -16834 -491
14357d91K0862J981q573o580K55N477M900L527k2325j6036Q258J5074r34n914
$$ -491 20371 22352 13779 7199 7454 12931 17831 21358 -967 -17003 -8745 6329 5395 -519
14343e19j1894j4969j632K0750R195n265j4750r79j0636P855R093J0017K285P222
$$ -519 -12413 -27382 -29014 -8264 931 -4334 -19084 -20063 -30699 -22844 -13751 -3734 -1449 5773
14329E773J1662L881r355j356k86M996j0978r276J0412K351O215j4071J6980k885
$$ 5773 17435 21316 11961 10605 10319 15315 4337 -4939 5473 7824 14039 -32 16948 14063
14315A4063j1393L663J1815J51k883R187q63N381q827r055M892n243n044j209
$$ 14063 2670 6333 18148 18299 15416 24603 23740 29121 20294 11239 16131 10888 5844 4635
14301D635l808m982r33J721R231O681J0870p364l471j685j1931k785r040K0477
$$ 4635 827 -4155 -5088 -3367 5864 12545 23415 16051 12580 10895 -1036 -3821 -12861 7616
14287G616P331j344o081n895K539q76o993N20K808N253r176q465N969M885k662
$$ 7616 14947 13603 7522 1627 4166 3290 -3703 -3183 -375 4878 -4298 -12763 -6794 -1909 -4571
14272d571k672j492l095m923L199J5747J8169r393j6095L282J1913r657j4493
$$ -4571 -7243 -8735 -11830 -16753 -13554 2193 20362 10969 -5126 -1844 10069 412 -14081
14259a4081P197R291L557j863P780j3649j3387Q664p655K826J680J5121Q632j9416
$$ -14081 -6884 2407 5964 4101 11881 -1768 -15155 -6491 -14146 -11320 -9640 5481 14113 -5303
14245e303j0425o657Q803k037j2673M802K4124K140K444J1982q651P741j0667
$$ -5303 -15728 -22385 -13582 -15619 -28292 -23490 634 2774 5218 17200 8549 16290 5623
14232E623j1550K1826N842j6455j8177m723J5025J395Q361J0170N392j221n426
$$ 5623 -5927 15899 21741 5286 -12891 -17614 -2589 -1194 7167 17337 22729 21508 16082
14219A6082r987j2359j1736L258k914j2072J0529O570O195o312L777m681k531
$$ 16082 6095 -6264 -18000 -14742 -17656 -29728 -19199 -12629 -6434 -12746 -8969 -13650 -16181
14206a6181J7659j325j4212j7003n253Q376Q88K112j421N275m994j13L895J6711
$$ -16181 1478 153 -14059 -31062 -36315 -27939 -27051 -24939 -26360 -21085 -26079 -26192 -22297 -5586
14192e586J6967p390q795O99O261M018j3672O635O303j2724r563p52J865j1161
$$ -5586 11381 3991 -4804 -4105 2156 6174 -7498 -863 5440 -7284 -16847 -17599 -15734 -26895
14178b6895l205J6275K1659o885J65J3435N843l208r965j1405N5K253q526O091
$$ -26895 -30100 -13825 7834 949 1114 14549 20392 17184 7219 -4186 -4131 -1878 -10404 -4313
14164d313K0792J6708o217j5396r482k86m741M230j1543r179j356J6561j745p239
$$ -4313 16479 33187 26970 11574 2092 1806 -2935 1295 -10248 -19427 -20783 -4222 -5967 -13206
14150a3206J2083p448j2363P859N034O518m476j501L02k265n564m506K763m729
$$ -13206 -1123 -8571 -20934 -13075 -8041 -1523 -5999 -7500 -7198 -9463 -15027 -19533 -16770 -21499
14136b1499O074J1781J1785l958j1451J4101K0230q080p421J136k628o068r735
$$ -21499 -15425 -3644 8141 4183 -7268 6833 27063 18983 11562 12698 10070 4002 -5733
14123e733m375M57L400J7149J2865n615J1782q616l0183O081R836p381o687j180
$$ -5733 -10108 -9651 -6251 10898 23763 18148 29930 21314 -8869 -2788 7048 -333 -7020 -8200
14109h200J452J1880j6532M13M843Q639j4718j1257M218M941L576K268p88J8718
$$ -8200 -6748 5132 -11400 -10987 -6144 2495 -12223 -23480 -19262 -14321 -10745 -8477 -9265 9453
14095I453J085J225r723n418n905N941K378R343Q938j2155l304K185J335j6522
$$ 9453 10538 11763 2040 -3378 -9283 -3342 -964 8379 17317 5162 1858 4043 5378 -11144
14081a1144n706K197Q287j0513K559J167l053Q355j665j995r988M732J8040J3092
$$ -11144 -16850 -14653 -6366 -16879 -14320 -13153 -16206 -7851 -9516 -11511 -21499 -16767 1273 14365
14067A4365M519l83q576j817J383K556m204N950n63r595m852J4637L707q467n818
$$ 14365 18884 18501 9925 8108 9491 12047 7843 13793 13230 3635 -1217 13420 17127 8660 2842
14052B842N647j2679O730j959J21j0033j2255j211k523J4375J800j2489k885N38
$$ 2842 8489 -4190 2540 581 702 -9331 -21586 -22797 -25320 -10945 -9145 -21634 -24519 -23981
14038b3981j4245N354K1970J6025r424o458N800N429J892Q882L807m334r206L613
$$ -23981 -38226 -32872 -10902 5123 -4301 -10759 -4959 470 2362 11244 15051 10717 1511 5124
14024E124Q160m638O634J1098n406p819n724P010l584l878j0888j230M957K466
$$ 5124 13284 8646 15280 26378 20972 13153 7429 14439 10855 6977 -3911 -5141 -184 2282
14010B282R24j4564j2718J2747L02N966K07K320J1811J6650R063j062o224n142
$$ 2282 3206 -11358 -24076 -11329 -11027 -5061 -4854 -2534 9277 25927 34990 33928 27704 22562
13996B2562n943q676j0120l462L480N384q68O873o030m23j4560J623N351j44O521
$$ 22562 16619 7943 -2177 -5639 -2159 3225 2357 9230 3200 2777 -11783 -10160 -4809 -4953 1568
13981A568r392n788Q69O798J1759m733L099L634j2260J670K479j5428j919K0356
$$ 1568 -7824 -13612 -12743 -5945 5814 1081 4180 7814 -4446 -2776 -297 -15725 -17644 2712
13967B712Q988j459r216j1144j525K0048M909j4576j2245J1586N758l49l780J5917
$$ 2712 11700 10241 1025 -10119 -11644 8404 13313 -1263 -13508 -1922 3836 3487 -293 15624
13953A5624J613k0348j7609J411N398Q758o561j0605M906M202J320o987Q905J771
$$ 15624 17237 -3111 -20720 -19309 -13911 -5153 -11714 -22319 -17413 -13211 -11891 -18878 -9973 -8202
13939h202j120l645K51L353K123p057k146P061J298p185O919j250P734l370k795
$$ -8202 -9322 -12967 -12716 -9363 -7240 -14297 -16443 -9382 -8084 -15269 -8350 -9600 -1866 -5236 -8031
13924h031r495L903n232j900M662L753r317m958N200J6160J0869Q033O634L14
$$ -8031 -17526 -13623 -18855 -20755 -16093 -12340 -21657 -26615 -21415 -5255 5614 13647 20281 20595
13910B0595r941j1212K802j5417Q547J2048j7705j5756r927J7456P447Q9o497
$$ 20595 10654 -558 2244 -13173 -4626 7422 -10283 -26039 -35966 -18510 -11063 -10974 -17471
13897a7471p10n436J906K902K753j589J9855o693j5120p393O903k516j1818L217
$$ -17471 -18181 -23617 -21711 -18809 -16056 -17645 2210 -4483 -19603 -26996 -20093 -22609 -34427 -31210
13883c1210P623K999R160J4826J984k75j2414l732J5407J3099j260j1974j600
$$ -31210 -23587 -20588 -11428 3398 5382 5107 -7307 -11039 4368 17467 16207 4233 2633
13870B633m208r098K217R355O785r897l786j2270J26K613O470P111j6005k47P861
$$ 2633 -1575 -10673 -8456 899 7684 -2213 -5999 -18269 -18143 -15530 -9060 -1949 -17954 -18201 -10340
13855a0340k658m551K684l524J8737J5882p69j955L05M583J005m989j3567j3125
$$ -10340 -12998 -17549 -14865 -18389 348 16230 15461 13506 13811 18394 19399 14410 843 -12282
13841a2282n190J1742Q010m034m785l235K491l367m104L725J0011O402J1223p227
$$ -12282 -17472 -5730 2280 -1754 -6539 -9774 -7283 -10650 -14754 -11029 -1018 5384 16607 9380
13827I380j3527l999l668J0165K014l832l166N105P1n092J3337j653n421o162
$$ 9380 -4147 -8146 -11814 -1649 365 -3467 -6633 -1528 -1457 -6549 6788 5135 -286 -6448
13813f448m135R861n25l63M681p515k5776o407J2464R851k969m397M488J1970
$$ -6448 -10583 -722 -1247 -1610 3071 -4444 -30220 -36627 -24163 -14312 -17281 -21678 -17190 -5220
13799e220k716p657J969K0103P404q684J660j448p738j466P299O481O314Q438
$$ -5220 -7936 -15593 -13624 6479 13883 5199 6859 5411 -2327 -3793 3506 9987 16301 24739
13785B4739r974k2369n50j0293k074o362O609L96M633J0468p824o406q749P58
$$ 24739 14765 -7604 -8154 -18447 -20521 -26883 -20274 -19878 -15245 -4777 -12601 -19007 -27756 -26998
13771b6998J72J2952P525k504k549K108j4448N698j480K875K741k485k806r34
$$ -26998 -26826 -13874 -6349 -8853 -11402 -9294 -23742 -18044 -19524 -16649 -13908 -16393 -19199 -20133
13757b0133k119O349J7638l005J170O176k594j1072j94O95p164k373P881P328
$$ -20133 -22252 -15903 1735 -1270 -100 6076 3482 -7590 -7784 -7089 -14253 -16626 -8745 -1417
13743a417l554L106J563p621j33k992M753J9062l849m126q326q477q628q29J10
$$ -1417 -4971 -1865 -302 -7923 -8056 -11048 -6295 12767 8918 4792 -3534 -12011 -20639 -21468 -21358
13728b1358J5907R78q404n452q871j1245m120J0020J4279J7356p704m270R679
$$ -21358 -5451 -4473 -12877 -18329 -27200 -38445 -42565 -32545 -18266 -910 -8614 -12884 -3205
13715c205j00m034k836L599O294k840j2719J6530J9162q330j0171Q229M931k896
$$ -3205 -3305 -7339 -10175 -6576 -282 -3122 -15841 689 19851 11521 1350 9579 14510 11614
13701A1614n185j993k7351r297J2075J6222N802J1575R485j3279k013J045M500
$$ 11614 6429 4436 -22915 -32212 -20137 -3915 1887 13462 22947 9668 7655 8700 13200
13688A3200j1829n223q223J7085N646k275j2946l56J2898K719j78J851Q143L737
$$ 13200 1371 -3852 -12075 5010 10656 8381 -4565 -4921 7977 10696 10518 12369 20512 24249
13674B4249q18j3928j7058J0770N014r736m049j4468n414R9K5521J3080r447J73
$$ 24249 23431 9503 -7555 3215 8229 -1507 -5556 -20024 -25438 -25339 182 13262 3815 3988
13660C988m998j1023L915P72j1872J0878Q982n217j041L210K0516R477J615q701
$$ 3988 -1010 -12033 -8118 -7346 -19218 -8340 642 -4575 -5616 -2406 18110 27587 29202 20501
13646B0501j171N191r920o162L289N167N872Q701m525k4239j0095K697j176Q67
$$ 20501 19330 24521 14601 8439 11728 16895 22767 31468 26943 2704 -7391 -4694 -5870 -5003
13632e003l893K823J6091r439o34m638l551J2002L181m923o689L066j0439J737
$$ -5003 -8896 -6073 10018 579 -55 -4693 -8244 3758 6939 2016 -4673 -1607 -12046 -10309
13618a0309j1137M434J4963j318L800j314n939r492J0942O348j3901j222M056
$$ -10309 -21446 -17012 -2049 -3367 433 -881 -6820 -16312 -5370 978 -12923 -14145 -10089
13605a0089J686j3496j0659k609j1316J3387K4698l07J943q183J2807K527P193
$$ -10089 -8403 -21899 -32558 -35167 -46483 -33096 -8398 -8705 -6762 -14945 -2138 389 7582
13592G582O898J0332L487q013P85O316m897j7383m221L694N719R643m147j1088
$$ 7582 14480 24812 28299 20286 21071 27387 22490 5107 886 4580 10299 19942 15795 4707
13578D707n877j74M645J404L005j4388j305P038R681m873N22k833j582J4283q437
$$ 4707 -1170 -1344 3301 4705 7710 -6678 -7983 -945 8736 3863 4385 1552 -30 14253 5816
13563E816l694M247m591n385l506j0280k4001J1700Q647J917N176J0785J4873
$$ 5816 2122 6369 1778 -3607 -7113 -17393 -41394 -29694 -21047 -19130 -13954 -3169 11704
13550A1704R104O337j4472p819n700n4n986o725l827j5025J2130J2811J4015O559
$$ 11704 20808 27145 12673 4854 -846 -900 -6886 -13611 -17438 -32463 -20333 -7522 6493 13052
13536A3052p447o502n852J26Q028n200N281p323J764M20p441P239K148j0281j1567
$$ 13052 5605 -897 -6749 -6623 1405 -3795 1486 -5837 -4073 -3653 -11094 -3855 -1707 -11988 -23555
13521b3555O521N816K072j637n555k0948P476R613M182M705J352J358J708O042
$$ -23555 -17034 -11218 -9146 -10783 -16338 -37286 -29810 -20197 -16015 -11310 -9958 -8600 -6892 -850
13507h50O761o064p190K421k311j1208P255J0415j3645r545L963K019M26l585
$$ -850 5911 -153 -7343 -4922 -7233 -18441 -11186 -771 -14416 -23961 -19998 -17979 -17553 -21138
13493b1138K143M947M686r10M617l854k0717J05J8296O750o926j1636P971J1968
$$ -21138 -18995 -14048 -9362 -10272 -5655 -9509 -30226 -30121 -11825 -5075 -12001 -23637 -15666 -3698
13479c698P024j785m745n015l267p696p543r978J4231K4545N774j0757m204j5431
$$ -3698 3326 1541 -3204 -8219 -11486 -19182 -26725 -36703 -22472 2073 7847 -2910 -7114 -22545
13465b2545n73J0736Q693K376j085l438m565Q753O196l019N795N807R45j6535
$$ -22545 -23118 -12382 -3689 -1313 -2398 -5836 -10401 -1648 4548 1529 7324 13131 14076 -2459
13451b459mq56O169J5723L455j3355j1965j0127j8m706J3369J1459k329O84n220
$$ -2459 -2463 -3319 2850 18573 22028 8673 -3292 -13419 -13437 -18143 -4774 6685 4356 5040 -180
13436a80j0416n958N91J074M23k518N611n82J5119q598p345Q21n434K068J2877
$$ -180 -10596 -16554 -15963 -14889 -14466 -16984 -11373 -11955 3164 -5434 -12779 -11958 -17392 -15324 -2447
13421b447q424L518K150l387p91j700L934J62q84J297Q242L472k618j0901p371
$$ -2447 -10871 -7353 -5203 -8590 -9381 -11081 -7147 -6985 -7869 -6572 1670 5142 2524 -8377 -15748
13406a5748J4295J9677M322L629n355r355j0994k050J0692l742j5074k173N328
$$ -15748 -1453 18224 22546 26175 20820 11465 471 -1579 9113 5371 -9703 -11876 -6548
13393f548m105o815o086l324Q782M013K946o047j437l544j967L911O356n838q948
$$ -6548 -10653 -17468 -23554 -26878 -18096 -14083 -11137 -17184 -18621 -22165 -24132 -20221 -13865 -19703 -28651
13378b8651J641J7880J5365k771R032O789q904p295o332p499j0712K872Q130q291
$$ -28651 -27010 -9130 6235 3464 12496 19285 10381 3086 -3246 -10745 -21457 -18585 -10455 -18746
13364a8746l071Q107O387q686o491n378j777n204O544Q146J5026P179K62j6036
$$ -18746 -21817 -13710 -7323 -16009 -22500 -27878 -29655 -34859 -28315 -20169 -5143 2036 2298 -13738
13350a3738l60j3975J1153K3185J8809j8776k3352o548J4303J2823m951p70n971
$$ -13738 -14098 -28073 -16920 6265 25074 6298 -17054 -23602 -9299 3524 -1427 -2197 -8168
13337h168K134r558p804o40K3811J6861q590j5391m581j834q391J3701J1842K998
$$ -8168 -6034 -15592 -23396 -24036 -225 16636 8046 -7345 -11926 -13760 -22151 -8450 3392 6390
13323F390j4771m625N270o483n42m051q549J6289J3739q262Q128J0604P74o992
$$ 6390 -8381 -13006 -7736 -14219 -14761 -18812 -27361 -11072 2667 -5595 2533 13137 13911 6919
13309F919O719k2083j1584M073J3470j093j5228q370N711J0438M117l863J1721
$$ 6919 13638 -8445 -20029 -15956 -2486 -3579 -18807 -27177 -21466 -11028 -6911 -10774 947
13296I47r206p740j0318L764K1666N374j516k0769L190j1289K613J2493N109L951
$$ 947 -8259 -15999 -26317 -22553 -887 4487 2971 -17798 -14608 -25897 -23284 -10791 -5682 -1731
13282a731J0024O559N97m215j2672j8501p210Q807K514k76L235p91k2430l968
$$ -1731 8293 14852 15449 11234 -1438 -19939 -27149 -18342 -15828 -16104 -12869 -13660 -36090 -40058
13268d0058J5547N419k746J1616J5432P29m32J858m214M596k118j1095q289O957
$$ -40058 -24511 -19092 -21838 -10222 5210 5939 5507 7365 3151 7747 5629 -5466 -13755 -6798
13254f798L004K16K252K373j2688k502J8090m365j7787O870K845P801J3141J795
$$ -6798 -3794 -3578 -1326 1047 -11641 -14143 3947 -418 -18205 -11335 -8490 -689 12452 14247
13240A4247q50J6115n73j6908j0896K37j2153r684r104m245Q353K1725Q252L127
$$ 14247 13397 29512 28939 12031 1135 1372 -10781 -20465 -29569 -33814 -25461 -3736 4516 7643
13226G643o537M092O185p139K89j6844k2660L150M137J1825Q477K566P421P413
$$ 7643 1106 5198 11383 4244 4533 -12311 -34971 -31821 -27684 -15859 -7382 -4816 2605 10018
13212A0018k40l019j980o31J4609Q015L715m094J015O112J762k0185j4724o110
$$ 10018 9778 6759 4779 4148 18757 26772 30487 26393 27408 33520 35282 15097 373 -5737
13198e737p842O786K0835R880J017j5338r720K341o27m054k75k761j3172J0137
$$ -5737 -13579 -6793 14042 23922 24939 9601 -119 2222 1595 -2459 -2734 -5495 -18667 -8530
13184h530J006l807p345m352P597J4474J4928n594j6069j039n064o238K846J0223
$$ -8530 -7524 -11331 -18676 -23028 -15431 -957 13971 8377 -7692 -8731 -13795 -20033 -17187 -6964
13170f964q873k743J3883n071r8N813J8133Q849q183j6888j2856M448P201R859
$$ -6964 -15837 -18580 -4697 -9768 -9866 -4053 14080 22929 14746 -2142 -14998 -10550 -3349 6510
13156F510J7876k904j6812r080m411n79J8366J5593K942n419p012j7726j1310
$$ 6510 24386 21482 4670 -4410 -8821 -9400 8966 24559 27501 22082 15070 -2656 -13966
13143a3966L580m282l25j886P850M051m167j4269K726K8543j154j0435Q379J5010
$$ -13966 -10386 -14668 -14993 -16879 -9029 -4978 -9145 -23414 -20688 7855 6701 -3734 4645 19655
13129A9655j714j4054n864K701J2071j1712j3194l073p564L646K96J436N946N688
$$ 19655 17941 3887 -1977 724 12795 1083 -12111 -15184 -22748 -19102 -18806 -17370 -11424 -5736
13115e736n160P224R936L207j2632K061O816k330n846m241k511p210P009n778
$$ -5736 -10896 -3672 6264 9471 -3161 -1100 5716 3386 -2460 -6701 -9212 -16422 -9413 -15191
13101a5191p964J238P076p766p517J2647K767R053l33l718k320J0861O255j6323
$$ -15191 -23155 -21917 -14841 -22607 -30124 -17477 -14710 -5657 -5990 -9708 -12028 -1167 5088 -11235
13087a1235r18Q900m396k3534K754K2304J3051K980j3803K679m736q820O05l360
$$ -11235 -12153 -3253 -7649 -31183 -28429 -6125 6926 9906 -3897 -1218 -5954 -14774 -14169 -17529
13073a7529o735J4450Q292K416j2748p706m448O515l153m848M983J63P070R384
$$ -17529 -24264 -9814 -1522 894 -11854 -19560 -24008 -17493 -20646 -25494 -20511 -20348 -13278 -3894
13059c894Q905J1006o066n670j673K824K613j880k265q006o385L337k5N819K100
$$ -3894 5011 16017 9951 4281 2608 5432 8045 6165 3900 -4106 -10491 -7154 -7179 -1360 740
13044G40L984l699O865J3146q846L058K124j3054j4205m7J6324J0494l891j1084
$$ 740 4724 1025 7890 21036 12190 15248 17372 4318 -9887 -9934 6390 16884 12993 1909
13030A909k0378p280L443n373m733L508l765J0329N416j880K803O807q53P541
$$ 1909 -18469 -25749 -22306 -27679 -32412 -28904 -32669 -22340 -16924 -18804 -16001 -9194 -10047 -2506
13016b506J0690L723j378p938r613j2433j457q739J4926J8133K212p167j1920
$$ -2506 8184 11907 10529 2591 -7022 -19455 -20912 -29651 -14725 3408 5620 -1547 -13467
13003a3467p135j275p474R138J8603l65n844O617r96M168r638o565M044O76K493
$$ -13467 -20602 -21877 -29351 -20213 -1610 -1975 -7819 -1202 -2198 1970 -7668 -14233 -10189 -9513 -7020
12988g020k477J0748L728L156j2125n767m486P835K470K565j2583j0825J232J1518
$$ -7020 -9497 1251 4979 8135 -3990 -9757 -14243 -6408 -3938 -1373 -13956 -24781 -23549 -12031
12974a2031J6352O073Q711k000j722j5526j1207J0000K461j8481O696J0649N689
$$ -12031 4321 10394 19105 17105 15383 -143 -11350 -1350 1111 -17370 -10674 -25 5664
12961E664o201k1357J0030L502j467j2188j0099l845Q4K314K168J1716J2631N222
$$ 5664 -537 -21894 -11864 -8362 -9829 -22017 -32116 -35961 -35877 -33563 -31395 -19679 -7048 -1826
12947a826q866r802K4223k291j1286J004K893J2584j0901r162j057P303R013l63
$$ -1826 -10692 -20494 3729 1438 -9848 -8844 -5951 6633 -4268 -13430 -14487 -7184 1829 1466
12933A466J2352J0671q138r394O837J0184L158K918o125q439j2638j4436J1598
$$ 1466 13818 24489 16351 6957 13794 23978 27136 30054 23929 15490 2852 -11584 14
12920A4M889N005L857R700J479k316n426r297j3157r986m051q24M18P094M180
$$ 14 4903 9908 13765 23465 24944 22628 17202 7905 -5252 -15238 -19289 -20113 -19695 -12601 -8421
12905h421M346L437l432r834R631J6735P552m895p680j1701k1599L528J1462M402
$$ -8421 -4075 -638 -4070 -13904 -4273 12462 20014 15119 7439 -4262 -25861 -22333 -10871 -6469
12891f469J6975K719J1233K933k1589p198n275J44j758N674J97o286O385r546
$$ -6469 10506 13225 24458 27391 5802 -1396 -6671 -6527 -8285 -2611 -2414 -8700 -2315 -11861
12877a1861k696L546j1696l403J1628J4310n280r854L273J4107J3038K649j028
$$ -11861 -14557 -11011 -22707 -26110 -14482 -172 -5452 -15306 -12033 2074 15112 17761 16733
12864A6733J043P412q285k001o089M255n393j605J0375k686M318j106k3750j997
$$ 16733 17776 25188 16903 14902 8813 13068 7675 6070 16445 13759 18077 16971 -6779 -8776
12850h776j931j0192P280J294M70M488j445p504o544P158K712n844l387J833R587
$$ -8776 -10707 -20899 -13619 -12325 -11855 -7367 -8812 -16316 -22860 -15702 -12990 -18834 -22221 -20388 -10801
12835a0801n864O363N567R897J244J1669J5017p176r225j6772j3439L741p232
$$ -10801 -16665 -10302 -4735 5162 6406 18075 33092 25916 16691 -81 -13520 -9779 -17011
12822a7011r858o554L82L203K1888J768M711j594K871p101p45O367K719r138n508
$$ -17011 -26869 -33423 -33041 -29838 -7950 -6182 -1471 -3065 -194 -7295 -8040 -1673 1046 -8092 -13600
12807a3600k861j36O688J2327n417J003n098j5677j369J6676J0798L111q743q010
$$ -13600 -16461 -16597 -9909 2418 -2999 -1996 -7094 -22771 -24140 -7464 3334 6445 -2298 -10308
12793a0308J2018J2816k1444j6316p411J6949J1673K363q652q183j505L628L949
$$ -10308 1710 14526 -6918 -23234 -30645 -13696 -2023 340 -8312 -16495 -18000 -14372 -10423
12780a0423p466J6645n520o687P62J3813m850r119K562q73L359J1766l000N925
$$ -10423 -17889 -1244 -6764 -13451 -12689 1124 -3726 -12845 -10283 -11156 -7797 3969 969 6894
12766F894J2084K981j5961j4197J2695O989q515j4730M017N256j1616K111J198
$$ 6894 18978 21959 5998 -8199 4496 11485 2970 -11760 -7743 -2487 -14103 -11992 -10794
12753a0794p49P295K038o014o320J0590J7192L189j343m536Q094j1455m664r53
$$ -10794 -11543 -4248 -2210 -8224 -14544 -3954 13238 16427 15084 10548 18642 7187 2523 1570
12739A570j5168m622R796N932O373j0769p18M003K37J3602m597n508J0636L286
$$ 1570 -13598 -18220 -8424 -2492 3881 -6888 -7606 -3603 -3366 10236 5639 131 10767 14053
12725A4053Q851M986r267m111j2940o745N738J4880J4132j3356k1351j0412O489
$$ 14053 22904 27890 18623 14512 1572 -5173 565 15445 29577 16221 -5130 -15542 -9053
12712i053P266k47Q889M20J267L793j5392j408N309Q38J4893q39j57j1891J1781
$$ -9053 -1787 -2034 6855 7275 8542 12335 -3057 -4465 844 1682 16575 15736 15579 3688 15469
12697A5469J808j0555p229j62M59O163L713J2277l527o39n687m858j108j750l449
$$ 15469 17277 6722 -507 -669 -210 5953 9666 21943 18416 17777 12090 7232 6124 4374 925
12682I25m143N578J523m597J1535L65l430J991j5127j8099k130l407M13R012R719
$$ 925 -3218 2360 3883 -714 10821 11186 7756 9747 -5380 -23479 -25609 -29016 -28603 -19591 -9872
12667i872J9925o801k729N587N688j2981m726r007o353J7837O93O29J726j675
$$ -9872 10053 3252 523 6110 11798 -1183 -5909 -14916 -21269 -3432 -2739 -2110 -384 -2059
12653b059j0979r8l89J0585K304q119j1115O006J6649J500j706l95j071O81r645
$$ -2059 -13038 -13136 -13525 -2940 -636 -8755 -19870 -13864 2785 4285 2579 2184 1113 1794 -7851
12638g851L3J0524J4M901K32p876r103m914J4970j0k0201q095N807Q903R840J2063
$$ -7851 -7818 2706 2720 7621 7853 -23 -9126 -14040 930 920 -19281 -27376 -21569 -12666 -2826 9237
12622I237m500j3650l909m637K672J8619k88j4760j0054L367j189n468K939K0636
$$ 9237 4737 -8913 -12822 -17459 -14787 3832 3544 -11216 -21270 -17903 -19092 -24560 -21621 -985
12608i85J1289n438n816m306L528M314Q32l082m885K13k945r61o827l672j890
$$ -985 10304 4866 -950 -5256 -1728 2586 3418 336 -4549 -4336 -7281 -8242 -15069 -18741 -20631
12593b0631O562J9332j974J444J0465q964k652J2069N610j460J271k466j2009
$$ -20631 -14069 5263 3289 4733 15198 6234 3582 15651 21261 19801 21072 18606 6597
12580F597j7402n035J539q943J570P091K995k594q79J5773J7706k201j4092l473
$$ 6597 -10805 -15840 -14301 -23244 -21674 -14583 -11588 -14182 -15061 712 18418 16217 2125 -1348
12566a348n544N755o335m096p86m552J94m64J2076N477N639N24j1854j6882r3
$$ -1348 -6892 -1137 -7472 -11568 -12354 -16906 -16712 -17176 -5100 377 6016 6540 -5314 -22196 -22289
12551b2289J7997l467l38J994m117j1299J943J842Q830J2771p35j264l747n70
$$ -22289 -4292 -7759 -8097 -6103 -10220 -21519 -19576 -17734 -8904 3867 3132 1868 -1879 -2449
12537b449j2107p344P092J3877P129j3321k431Q180N165J0777n337q51o30Q062
$$ -2449 -14556 -21900 -14808 -931 6198 -7123 -9554 -1374 3791 14568 9231 8380 7750 15812
12523A5812o681l09n628l395K092j0724R406R935N584k1694n329J0312P306M451
$$ 15812 9131 8822 3194 -201 1891 -8833 573 10508 16092 -5602 -10931 -619 6687 11138
12509A1138l747p983j495Q923l357p466p489l02J2124J527o1j0480m785J906L755
$$ 11138 7391 -592 -2087 6836 3479 -3987 -11476 -11778 346 1873 1812 -8668 -13453 -11547 -7792
12494g792m316n209j1092M621K0939R426J704r157k342M519q671k708J537K785
$$ -7792 -12108 -17317 -28409 -23788 -2849 6577 8281 -876 -3218 1301 -7370 -10078 -8541 -5756
12480e756l078o368q739J6285J6922M581q758M515p6r29j8072j4347m100R18j394
$$ -5756 -8834 -15202 -23941 -7656 9266 13847 5089 9604 9528 8599 -9473 -23820 -27920 -27002 -28396
12465b8396l929k482l082m861R199J4482J7616m22M159p406j7244K985J4650Q158
$$ -28396 -32325 -34807 -37889 -42750 -33551 -19069 -1453 -1875 2284 -5122 -22366 -19381 -4731 3427
12451C427j3533K022j59j511j784O159n008j4909j318P90J1728J2754J9711k433
$$ 3427 -10106 -8084 -8243 -9754 -11538 -5379 -10387 -25296 -26614 -25824 -14096 -1342 18369 15936
12437A5936j0508j4763L795J0438K837J1663M495q284n172r741k836q7o419L445
$$ 15936 5428 -9335 -5540 4898 7735 19398 23893 15609 10437 696 -2140 -2227 -8646 -5201
12423e201J0584L783p034r852R882P701j799L427m195j4115j2850j028L071K3163
$$ -5201 5383 9166 2132 -7720 2162 9863 8064 11491 7296 -6819 -19669 -20697 -17626 5537
12409E537R269j833J905M417O366j017k2569j2004P825n442p678j3697K323J1355
$$ 5537 14806 12973 14878 19295 25661 24644 2075 -9929 -2104 -7546 -15224 -28921 -26598 -15243
12395a5243J3058o768l9N811j0548J0508M161j0001m85L613p279n786N623l657
$$ -15243 -2185 -8953 -8992 -3181 -13729 -3221 940 -9061 -9546 -5933 -13212 -18998 -13375 -17032
12381a7032R26N820P700O300k997N1P366N367J4037K109m865j192q620r516j1086
$$ -17032 -16106 -10286 -2586 3714 717 768 8134 13501 27538 29647 24782 23590 14970 5454 -5632
12366e632o51L657J3141m326j3332l345R432M533j1968Q876J4063k98k52L590
$$ -5632 -6283 -2626 10515 6189 -7143 -10488 -1056 3477 -8491 385 14448 14150 13898 17488
12352A7488q36J739o165r940o739J165l153l717J647n430P653L582j2207P035
$$ 17488 16652 18391 12226 2286 -4453 -3288 -6441 -10158 -8511 -13941 -6288 -2706 -14913 -7878
12338g878J898L148J3325j76O987j0726j2977L450R472j430l308p153K945K618
$$ -7878 -5980 -2832 10493 10317 17304 6578 -6399 -2949 6523 5093 1785 -5368 -2423 195
12324A95n386j8326K11K8666J4840l541p402r398L886r135j574Q719m549q524
$$ 195 -5191 -23517 -23306 5360 20200 16659 9257 -141 3745 -5390 -6964 1755 -2794 -11318
12310a1318j2035m435O757J726O545m849K735J3293J874K13N459j735j4480O8
$$ -11318 -23353 -27788 -21031 -19305 -12760 -17609 -14874 -1581 293 506 5965 4230 -10250 -10182
12296a0182k939K350K458K125J3757M116n422L659j2706l912J5707q499K115l663
$$ -10182 -13121 -10771 -8313 -6188 7569 11685 6263 9922 -2784 -6696 9011 512 2627 -1036
12282a036J491j2038J5734O523K368p609p743J0450m823l541O324n123j554M055
$$ -1036 455 -11583 4151 10674 13042 5433 -2310 8140 3317 -224 6100 977 -577 3478
12268C478P480j0859m027P059j7292j0623j0209n056K337R612J661m20N475K0922
$$ 3478 10958 99 -3928 3131 -14161 -24784 -34993 -40049 -37712 -28100 -26439 -26859 -21384 -462
12254d62J6792Q430j5284j3626O36M686J6789Q787r918j9993p631R85J9134J1299
$$ -462 16330 24760 9476 -4150 -3514 1172 17961 26748 16830 -3163 -10794 -9809 9325 20624
12240B0624k157l835l21m086k218o081j4515k127O650L743J3606J2393J0830k080
$$ 20624 18467 14632 14311 10225 8007 1926 -12589 -14716 -8066 -4323 9283 21676 32506 30426
12226C0426q035j1452J2552N806k0678j3196r779L755L801J0534M930l613J5719
$$ 30426 22391 10939 23491 29297 8619 -4577 -14356 -10601 -6800 3734 8664 5051 20770
12213B0770L079Q548J3408l636j5274q853L743Q037j0924j8779j6449J924J685
$$ 20770 23849 32397 45805 42169 26895 18042 21785 29822 18898 119 -16330 -14406 -12721
12200a2721l080Q949J4925J5356j9015n931R419Q338K259q721K906Q435j7374
$$ -12721 -15801 -6852 8073 23429 4414 -1517 7902 16240 18499 9778 12684 21119 3745
12187C745o593O892k13j0087p012m820J0719k528j399L103j0414o344M729K0725
$$ 3745 -2848 4044 3831 -6256 -13268 -18088 -7369 -9897 -11296 -8193 -18607 -24951 -20222 503
12173E03R858L962J248M74m932j4206Q930N211n89J0558j788K461J0528J1593
$$ 503 10361 14323 15571 16045 11113 -3093 5837 11048 10459 21017 19229 21690 32218 43811
12159D3811j8305j5125o063J625j9064k805m329R541J8222P437m535j2200j114
$$ 43811 25506 10381 4318 5943 -13121 -15926 -20255 -10714 7508 14945 10410 -1790 -2904
12146b904Q135p708j2819J983J0273O925N791m376r75P514j544j0697M359J280
$$ -2904 5231 -2477 -15296 -13313 -3040 3885 9676 5300 4325 11839 10295 -402 3957 5237
12132E237k824n907k984J5376J2880n670j028L496L819R726q717j6115K458L462
$$ 5237 2413 -3494 -6478 8898 21778 16108 15080 18576 22395 32121 23404 7289 9747 13209
12118A3209j1738r825n544J44R125j85M722L417J3325m918l877O544p484R759
$$ 13209 1471 -8354 -13898 -13754 -4629 -4814 -92 3325 16650 11732 7855 14399 6915 16674
12104A6674n249j013r967k158P371O138j090n386m914l095j2912L158R996N854
$$ 16674 11425 10412 445 -1713 5658 11796 10706 5320 406 -2689 -15601 -12443 -2447 3407
12090C407O902K549O324l160o707m971n101o388K750J1843o61J667N904j03M130
$$ 3407 10309 12858 19182 16022 9315 4344 -757 -7145 -4395 7448 6787 8454 14358 14255 18385
12075A8385j200j2566R98J5231J2249j2340k0774n941P598j643P847P757J1540
$$ 18385 17185 4619 5617 20848 33097 20757 -17 -5958 1640 -3 7844 15601 27141
12062B7141p012o716p311k241J3267j2750j4924R932J5035k354n227j3615k682
$$ 27141 20129 13413 6102 3861 17128 4378 -10546 -614 14421 12067 6840 -6775 -9457
12049i457L532o553m072K195J917l314M786J2666k905j572L373J406q290O173
$$ -9457 -5925 -12478 -16550 -14355 -12438 -15752 -10966 1700 -1205 -2777 596 2002 -6288 -115
12035a15O227O61P019K252n997p912j1663J869M877j0492J2569N264J723j3656
$$ -115 6112 6773 13792 16044 10047 2135 -9528 -7659 -2782 -13274 -705 4559 6282 -7374
12021g374k307M606L618J6162p271j5777J1434J0991R472Q637k893n773j0226
$$ -7374 -9681 -5075 -1457 14705 7434 -8343 3091 14082 23554 32191 29298 23525 13299
12008A3299o812j4616M53M585M82j1726j93K4892J1225j0638j1255K988Q894o831
$$ 13299 6487 -8129 -7676 -3091 -2609 -14335 -14528 10364 21589 10951 -304 2684 11578 4747
11994D747m688j0160O972m023L766L506K302Q449O542p876j5293j3082j924J0108
$$ 4747 59 -10101 -3129 -7152 -3386 120 2422 10871 17413 9537 -5756 -18838 -20762 -10654
11980a0654O127j53m601N931M791p84K814q204j3580r110J0274J0495j820Q01
$$ -10654 -4527 -4680 -9281 -3350 1441 657 3471 -4733 -18313 -27423 -17149 -6654 -8474 -7673
11966g673N699M922k208j518L681j76k518j6909r355O314J2725k135n834N250
$$ -7673 -1974 2948 740 -778 2903 2727 209 -16700 -26055 -19741 -7016 -9151 -14985 -9735
11952i735n787L953O652n08p309k089l612j972O729M702n009J5445K106M368P703
$$ -9735 -15522 -11569 -4917 -5425 -12734 -14823 -18435 -20407 -13678 -8976 -13985 1460 3566 7934 15637
11937A5637k095j972r4K994L762r146o696O984M089R319j0222N50r430r868l636
$$ 15637 13542 11570 11476 14470 18232 9086 2390 9374 13463 22782 12560 13110 3680 -6188 -9824
11922i824p167n853J1329J4077n702N930m849q386n02K637K206O325j4174q593
$$ -9824 -16991 -22844 -11515 2562 -3140 2790 -2059 -10445 -10947 -8310 -6104 221 -13953 -22546
11908b2546K9902J5782L182q734j9057j9813L83P791J4767K875p735R18j211o577
$$ -22546 7356 23138 26320 17586 -1471 -21284 -20901 -13110 1657 4532 -3203 -2285 -3496 -10073
11894a0073j2213N209J2831l201o486R0K010P586J5106J5231p845j248R774q35
$$ -10073 -22286 -17077 -4246 -7447 -13933 -13843 -11833 -4247 10859 26090 18245 16997 26771 25936
11880B5936p301n200Q666q044j6373j533O349l537k702n194K377n872m14m875
$$ 25936 18635 13435 22101 14057 -2316 -3849 2500 -1037 -3739 -8933 -6556 -12428 -12842 -17717
11866a7717l776J30M322j359N427Q328N881k7813k153J4340N241R589M647q697
$$ -17717 -21493 -21363 -17041 -18400 -12973 -4645 1236 -26577 -28730 -14390 -9149 440 5087 -3610
11852c610k385L214r984J3738R67k608Q694J065k3911J407M775q930k232K0362
$$ -3610 -5995 -2781 -12765 973 1940 -668 8026 9091 -14820 -13413 -8638 -17568 -19800 562
11838E62J14q389L986O35j630r005p822J229J1200O947l540j984L960O412M637
$$ 562 676 -7713 -3727 -3092 -4722 -13727 -21549 -20320 -9120 -2173 -5713 -7697 -3737 2675 7312
11823G312K688o540j8400J1091j834n79J2630o110n220P799j4549k938J396J3582
$$ 7312 10000 3460 -14940 -3849 -5683 -6262 6368 258 -4962 2837 -11712 -14650 -13254 328
11809C28Q945n048m576N381J7415R928j0670l630o538j2066n71J1324J1957P711
$$ 328 9273 4225 -351 5030 22445 32373 21703 18073 11535 -531 -1102 10222 22179 29890
11795B9890l232j883j0697O523K0407k2268j3346q391p782p241p624K851N805
$$ 29890 26658 24775 14078 20601 41008 18740 5394 -2997 -10779 -18020 -25644 -22793 -16988
11782a6988J681n185L220J040m060J0985p997r868n125P105K7197J2145p669j1906
$$ -16988 -15307 -20492 -17272 -16232 -20292 -9307 -17304 -27172 -32297 -25192 2005 14150 6481 -5425
11768e425M123l221O46N254J25l502J633R857n372o169K217K339n890k455R161
$$ -5425 -1302 -4523 -3877 1377 1502 -2000 -367 9490 4118 -2051 166 2505 -3385 -5840 3321
11753C321l777l014J2793q546j212P586n060N498r585J69o201j0507J245m550
$$ 3321 -456 -3470 9323 777 -435 7151 2091 7589 -1996 -1827 -8028 -18535 -17290 -21840
11739b1840J722j142J1265q653q399J604J4912J3353n529n97J6854q020q922p186
$$ -21840 -20118 -21260 -9995 -18648 -27047 -25443 -10531 2822 -2707 -3304 13550 5530 -3392 -10578
11725a0578k343K110P513o123m335J861l69J231K823m232J991J899j7771k019
$$ -10578 -12921 -10811 -3298 -9421 -13756 -11895 -12264 -11033 -8210 -12442 -10451 -8552 -26323 -28342
11711b8342K1655J0115Q46q833o907M839k043j576N966j791m439O52J449J3235
$$ -28342 -6687 3428 4274 -4559 -11466 -6627 -8670 -10246 -4280 -6071 -10510 -9858 -8409 4826
11697D826M768p63j5388o894l957O900m946Q680K30O867P759n954N515O630o866
$$ 4826 9594 8831 -6557 -13451 -17408 -10508 -15454 -6774 -6544 323 8082 2128 7643 14273 7407
11682G407j1407q018o197Q084O41Q733m035K518P534m63n642j7849k791m232k289
$$ 7407 -4000 -12018 -18215 -10131 -9490 -757 -4792 -2274 5260 4797 -845 -18694 -21485 -25717 -28006
11667b8006J0016M775l550Q560K887M490j574k829q943j4187J1029J8282O894
$$ -28006 -17990 -13215 -16765 -8205 -5318 -828 -2402 -5231 -14174 -28361 -17332 950 7844
11654G844m352l786r0K5890R122k896P09j0565k1482j138J0972r08K390q49k97
$$ 7844 3492 -294 -384 25506 34628 31732 32441 21876 394 -744 10228 9320 11710 10861 10564
11639A0564K257J0139L686P633j3018j4985p167j928q439j2968J1714J5560M234
$$ 10564 12821 22960 26646 34279 21261 6276 -891 -2819 -11258 -24226 -12512 3048 7282
11626G282j2215k950l183k98J5198J3192q946n962P747m272j2414m659j291r70
$$ 7282 -4933 -7883 -11066 -11364 3834 17026 8080 2118 9865 5593 -6821 -11480 -12771 -13741
11612a3741R160P105m467n185J662P589L849Q503j647M098o378j5969J6136R182
$$ -13741 -4581 2524 -1943 -7128 -5466 2123 5972 14475 12828 16926 10548 -5421 10715 19897
11598A9897r867N881J697q379j068m927j5272M51J7258P905L282K303k478o139
$$ 19897 10030 15911 17608 9229 8161 3234 -12038 -11587 5671 13576 16858 19161 16683 10544
11584A0544m805p901P37J3857o735j2391l362J5552M039k816l919J5999l149q727
$$ 10544 5739 -2162 -1425 12432 5697 -6694 -10056 5496 9535 6719 2800 18799 15650 6923
11570F923J0393L08j9115j330M455Q885M867O562K004q895j1823n502J2854K611
$$ 6923 17316 17624 -1491 -2821 1634 10519 15386 21948 23952 15057 3234 -2268 10586 13197
11556A3197n444j4968N82K328N82l928L933n620m226L247m315Q335J7692p506
$$ 13197 7753 -7215 -6633 -4305 -3723 -7651 -3718 -9338 -13564 -10317 -14632 -6297 11395 3889
11542C889o658j1192k916J5724J5423J874j130q968l551k104N554k889J5719j832
$$ 3889 -2769 -13961 -16877 -1153 14270 16144 15014 6046 2495 391 5945 3056 18775 16943
11528A6943j2121N330P902M045R260M783m677j2377j6691j351M370M807n6j0468
$$ 16943 4822 10152 18054 22099 31359 36142 31465 19088 2397 1046 5416 10223 10167 -301
11514c01j7005Q817J287N834K4851L336k8760L197n542M624J2304P754j1832j6082
$$ -301 -17306 -8489 -7202 -1368 23483 26819 -1941 1256 -4286 338 12642 20396 8564 -7518
11500g518r89l024l236n43P742J2137M406k905J0076J3391j930N817m463m904
$$ -7518 -8507 -11531 -14767 -15310 -7568 4569 8975 6070 16146 29537 27607 33424 28961 24057
11486B4057O406k381k2249j6591l708J2088l034J0002J731j5457k00L887J5655
$$ 24057 30463 28082 5833 -10758 -14466 -2378 -5412 4590 6321 -9136 -9336 -5449 10206
11473A0206J7316J2654o82o977j537P159J884J054k518j3471m746m641o600p509
$$ 10206 27522 40176 39494 32517 30980 38139 40023 41077 38559 25088 20342 15701 9101 1592
11459A592q526N360Q520J949P15K144m359K514n569J1139j1417o390O988L614
$$ 1592 -6934 -1574 6946 8895 9610 11754 7395 9909 4340 15479 4062 -2328 4660 8274
11445H274M710M246k896O344m541K186r323j733L923J4612P231j694l909q302
$$ 8274 12984 17230 14334 20678 16137 18323 9000 7267 11190 25802 33033 31339 27430 19128
11431A9128n218q596o351M96J0194J386k676J3133n486j4803l660P471J3759P168
$$ 19128 13910 5314 -1037 -541 9653 11039 8363 21496 16010 1207 -2453 5018 18777 25945
11417B5945O0j8509r912J2385K126O787n285j3725l90M009Q6p273P693p281o567
$$ 25945 26005 7496 -2416 9969 12095 18882 13597 -128 -518 3491 3577 -3696 3997 -3284 -9851
11402i851l100Q670N775j618Q243n634P401k861J701o140j3715l014J2604M722
$$ -9851 -12951 -4281 1494 -124 8119 2485 9886 7025 8726 2586 -11129 -14143 -1539 3183
11388C183o060p053m598O930J5821M861n000j0390q637J0069j215R328L204j0071
$$ 3183 -2877 -9930 -14528 -7598 8223 13084 8084 -2306 -10943 -874 -2089 7239 10443 372
11374C72K700K436Q669K479m903J2553J8096K937k943j3962q868q813j0515j6977
$$ 372 3072 5508 14177 16656 11753 24306 42402 45339 42396 28434 19566 10753 238 -16739
11360a6739R254R743N825k475k687K950n803R285J0421O293r603p823j091M627
$$ -16739 -7485 2258 8083 5608 2921 5871 68 9353 19774 26067 16464 8641 7550 12177
11346A2177j5583r046J4367m745m192L194N707K669o517k7497j6346J8069J3050
$$ 12177 -3406 -12452 1915 -2830 -7022 -3828 1879 4548 -1969 -29466 -45812 -27743 -14693
11333a4693r39J1344J0527J0865J2062n722K456N757k63P015l745l092p294k023
$$ -14693 -15632 -4288 6239 17104 29166 23444 25900 31657 31394 38409 34664 31572 24278 22255
11319B2255j0824j5002j3691J506J5374J033K132L387l281q410n556J1580J607
$$ 22255 11431 -3571 -17262 -15756 -382 651 2783 6170 2889 -5521 -11077 503 2110
11306B110J419O712J1091M606R728j622M15L530p268q386j5434J973J7469J629
$$ 2110 3529 10241 21332 25938 35666 34044 34459 37989 30721 22335 6901 8874 26343 27972
11292B7972j8609j2812p044j3500J0454J4088o11J0180R994L625n99N32K053J2855
$$ 27972 9363 -3449 -10493 -23993 -13539 549 -62 10118 20112 23737 23138 23670 25723 38578
11278C8578K493j1382j0189r429J937m01K941j599M50q512J3318J6828J644M303
$$ 38578 41071 29689 19500 10071 12008 11607 14548 12949 13399 4887 18205 35033 36677 40980
11264D0980r496j3755k755J2012P39L595l117p564n718K322n582n165O177J2105
$$ 40980 31484 17729 14974 26986 27725 31320 28203 20639 14921 17243 11661 6496 12673 24778
11250B4778K04j4191k708l936o65o599P892K755O173J3070N772O453q092q606
$$ 24778 24982 10791 8083 4147 3482 -3117 4775 7530 13703 26773 32545 38998 30906 22300
11236B2300J942o984r489o975l992j649N914O279Q383L016j212p6O994r96n784
$$ 22300 24242 17258 7769 794 -3198 -4847 1067 7346 15729 18745 17533 17457 24451 23455 17671
11221A7671j5350M303K2170J1278R68k2815l355j1794n936R884j602P921l52L633
$$ 17671 2321 6624 28794 40072 41040 18225 14870 3076 -2860 7024 5422 13343 12991 16624
11207A6624p772k745L746P765m638M116L013L375J967j1517n276O031L92j072
$$ 16624 8852 6107 9853 17618 12980 17096 20109 23484 25451 13934 8658 14689 15081 14009
11193A4009K32O901p429l011K227j0385o156J747J0251K1223K647p344k616n984
$$ 14009 14241 21142 13713 10702 12929 2544 -3612 -1865 8386 29609 32256 24912 22296 16312
11179A6312R259J2610L832Q691o176j3675N708l403O18o259l476M226J329j2844
$$ 16312 25571 38181 42013 50704 44528 30853 36561 33158 33776 27517 24041 28267 29596 16752
11165A6752N05j569J907m329N197N313n674p466J100R804l620r793M462N431p832
$$ 16752 17257 15688 17595 13266 18463 23776 18102 10636 11736 21540 17920 8127 12589 18020 10188
11150A0188q05N883r9o565L250p100K687j0062l530N128J6915R702l310L628P516
$$ 10188 9383 15266 15167 8602 11852 4752 7439 -2623 -6153 -1025 15890 25592 22282 25910 33426
11135C3426j0409j0233M634P624J2960m097j1644J185J0815O921J2076n445n437
$$ 33426 23017 12784 17418 25042 38002 33905 22261 23446 34261 41182 53258 47813 42376
11122D2376j5790K97j4487p254N090J7968J1715n456j0270J54J2313N200n463
$$ 42376 26586 26883 12396 5142 10232 28200 39915 34459 24189 24343 36656 41856 36393
11109C6393k3829q608o66p33j211J3444L4889R657L915r530k1140m587O329m250
$$ 36393 12564 3956 3290 2557 1346 14790 49679 59336 63251 53721 32581 27994 34323 30073
11095C0073L698P770R65n800K047J1806k169L643O170m350m922j2138K290L804
$$ 30073 33771 41541 42506 36706 38753 50559 48390 52033 58203 53853 48931 36793 39083 42887
11081D2887j430N928M113M468o254k3502j0243R719J5767J524L614O764J555j286
$$ 42887 41457 47385 51498 55966 49712 26210 15967 25686 41453 42977 46591 53355 54910 53624
11067E3624p095j2725P176M919J1080j39r840j3390J811J470O281l541q282M862
$$ 53624 46529 33804 40980 45899 56979 56840 47000 33610 35421 36891 43172 39631 31349 36211
11053C6211O331m722j2232M683K005M495o74j7818j4769K0248J3514M842j4056
$$ 36211 42542 37820 25588 30271 32276 36771 36097 18279 3510 23758 37272 42114 28058
11040B8058j1664J7175q368J392J2709K561p996n93J0541p203j501p205k531R726
$$ 28058 16394 33569 25201 26593 39302 41863 33867 33274 43815 36612 35111 27906 25375 35101
11026C5101P439o342o257m523o080j1837o81J1679k372o796p1j1090J93K4403
$$ 35101 42540 36198 29941 25418 19338 7501 6820 18499 16127 9331 9260 -1830 -1637 22766
11012B2766P909K842Q920n11P41o107r221R797O749j3170j454o746l414R550j3862
$$ 22766 30675 33517 42437 41926 42667 36560 27339 37136 43885 30715 29261 22515 19101 28651 14789
10997A4789n894J1399N895N464M520J3251J136n140j295j479j664p173M498n27
$$ 14789 8895 20294 26189 31653 36173 49424 50560 45420 44125 42646 40982 33809 38307 37780
10983C7780o906J1232Q164k1395j8282j946K403l69m810m702n041J8699J1916
$$ 37780 30874 42106 50270 28875 10593 8647 11050 10681 5871 1169 -3872 14827 26743
10970B6743M174J4479p244J216m34Q704L712p143j3810N897j987N20K80J0868
$$ 26743 30917 45396 38152 39368 38934 47638 51350 44207 30397 36294 34307 34827 35107 45975
10956D5975o646j1235k967m149l938J1446J2818J2592J527k2220Q351J926K204
$$ 45975 39329 28094 25127 20978 17040 28486 41304 53896 55423 33203 41554 43480 45684
10943D5684p940j6257j0196J325J5713P008M103Q908N866j4947j0487L697J3422
$$ 45684 37744 21487 11291 12616 28329 35337 39440 48348 54214 39267 28780 32477 45899
10930D5899p0j1141J3843J0682j9764q663j652M831m56j4009j3786L532J6481
$$ 45899 45829 34688 48531 59213 39449 30786 29134 33965 33509 19500 5714 9246 25727
10917B5727N767M997m179J185J280O020N834p608j268j812J179l298k0180L297
$$ 25727 31494 36491 32312 33497 34777 40797 46631 39023 37755 35943 37122 33824 13644 16941
10903A6941K4434J1222r729j341j7248j060J6013l066n353r835N455J2240K96
$$ 16941 41375 52597 42868 41527 24279 23219 39232 36166 30813 20978 26433 38673 38969
10890C8969J3699k376J507j0219K109P247k486r728j0317J6287J2223L711J530
$$ 38969 52668 50292 51799 41580 43689 50936 48450 38722 28405 44692 56915 60626 62156
10877F2156R806L777o202j3140j074j15j5691p424J445R032J6117J0213J84k706
$$ 62156 71962 75739 69537 56397 55323 55208 39517 32093 33538 42570 58687 68900 69084 66378
10863F6378r567j1064l82J0851P924n666m677P731N557k715J6429p137j5014K899
$$ 66378 56811 45747 45365 56216 64140 58474 53797 61528 67085 64370 80799 73662 58648 61547
10849F1547O312k887Q57J0109j751o804r335r224P688L788o326j3326l150J387
$$ 61547 67859 64972 65829 75938 74187 67383 58048 48824 56512 60300 53974 40648 37498 38885
10835C8885Q533J0759O448L269O597P134O450p625k6502j27m516P966j700J3910
$$ 38885 47418 58177 64625 67894 74491 81625 88075 80450 53948 53821 49305 57271 55571 69481
10821F9481J3708R843k489J969l992Q806N922r0l449j612l049r927k539n689P137
$$ 69481 83189 93032 90543 92512 88520 97326 103248 103158 99709 98097 95048 85121 82582 76893 84030
10806H4030N577j967R688P258R942J5630O879j7014j8807J3037M3507K3895M5052
$$ 84030 89607 87640 97328 104586 114528 130158 137037 120023 101216 114253 157760 181655 226707
10793B26707N9760Q3787J50861K33121L32966L28651J93130K6057j76587j75569
$$ 226707 286467 370254 521115 754236 1087202 1415853 1608983 1635040 1458453 1282884
10783A282884L1805J98752J81496N8634r9141l19273l59240k24635j30766q5280
$$ 1282884 1314689 1513441 1694937 1753571 1654430 1335157 975917 751282 620516 535236
10773E35236o2773n5862k9621j8511k0159j7483k2843k0110o104l469j5872k1736
$$ 535236 472463 416601 386980 368469 348310 330827 307984 287874 281770 278301 262429 240693
10761B40693l333l305m963L139p750j1009j2120k738o575Q399J0863k048k3293
$$ 240693 237360 234055 229092 232231 224481 213472 201352 198614 192039 200438 211301 209253 185960
10748A85960k5821k9J254P04M37n697j0625J3937j403q858O632M904m97n199j2324
$$ 185960 160139 160110 161364 162068 162505 156808 146183 160120 158717 149859 156491 161395 160898 155699 143375
10733A43375k0769j9919r028o865J356P910K411K706r991q266j633k691o309J63
$$ 143375 122606 102687 93659 86794 88150 96060 98471 101177 91186 82920 81287 78596 72287 72450
10719G2450J4360J2846J0085k823K51j641N984Q645M827j1973Q053P473r837p050
$$ 72450 86810 99656 109741 106918 107169 105528 111512 120157 124984 113011 121064 128537 118700 111650
10705A11650j1830k799j522J8005N330L840j866l428q235O193q342o01P620J954
$$ 111650 99820 97021 95499 113504 118834 122674 120808 117380 109145 115338 106996 106395 114015 115969
10691A15969p009j5690j1053j214P202j777J414l189M718N087r568N191M113r85
$$ 115969 108960 93270 82217 81003 88205 86428 87842 84653 89371 94458 84890 90081 94194 93209
10677I3209o007O966J8696q257k1023j1992n163p831J012m02j646n218j4205N984
$$ 93209 87202 94168 112864 104607 83584 71592 66429 58598 59610 59208 57562 52344 38139 44123
10663D4123L108J9190p40p631J831l794J0083o481J191J941J3660M894p324j736
$$ 44123 47231 66421 65681 58050 59881 56087 66170 59689 60880 62821 76481 81375 74051 72315
10649G2315j871j4206k440K540l704Q095J2351J2756J0196J956Q630K6125K2970
$$ 72315 70444 56238 53798 56338 52634 60729 73080 85836 96032 97988 106618 132743 155713
10636A55713K9765J4710N898L5111J9634j8430j5548J6668O967R583P374n748
$$ 155713 185478 200188 206086 241197 260831 242401 226853 243521 250488 260071 267445 261697
10624B61697l5864k9547r299j1831j5911j4700j2630j2307m067j798L389N876
$$ 261697 225833 196286 186987 175156 159245 144545 131915 119608 115541 113743 117132 123008
10612A23008J9669R371J1111L495J1270J0520J3730R954j0437J605J326j1109
$$ 123008 142677 152048 163159 166654 177924 188444 202174 212128 201691 203296 204622 193513
10600A93513j981P529k213m346j3895j8632j0767M091J5017p957o101q507j1562
$$ 193513 191532 199061 196848 192502 178607 159975 149208 153299 168316 160359 154258 145751 134189
10587A34189r293l464L876q276q828j3784J0097L333p353m432j2414k3275j9981
$$ 134189 124896 121432 125308 117032 108204 94420 104517 107850 100497 96065 83651 60376 40395
10574D0395l167J3153J1438p569j2693j366O415J2285J7929J8274J9967J183J3329
$$ 40395 37228 50381 61819 54250 41557 40191 46606 58891 76820 95094 115061 116244 129573
10561A29573K9973K410L222k935k2634K37j138n284p019j1836m821l592N033N116
$$ 129573 159546 161956 165178 162243 139609 139846 138708 133424 126405 114569 109748 106156 111189 116305
10547A16305k741K190M029K3791R564L781N126l102J4810J7440K8639L7875J9953
$$ 116305 113564 115754 119783 143574 153138 156919 162045 158943 173753 191193 219832 257707 277660
10534B77660J3646J866k0770k5781j2025m765Q44o499k0846n971q390j1812o105
$$ 277660 291306 293172 272402 246621 234596 229831 230675 224176 203330 197359 188969 177157 171052
10521A71052J648l584M256l385m711k7516j4413K735n331L951J0980K8261M3323
$$ 171052 172700 169116 173372 169987 165276 137760 123347 126082 120751 124702 135682 163943 207266
10508B07266O9444R5971P8807J3237k7211j7404J4646L7455Q6066P8588j0298
$$ 207266 276710 372681 451488 464725 437514 420110 434756 472211 558277 636865 626567
10497F26567o2183l8023j7741j8664l0427r512J646k183K0866l573Q268K499p657
$$ 626567 564384 526361 508620 489956 459529 450017 451663 449480 470346 466773 475041 477540 469883
10484D69883J008J7011J0991J2793j2000j26R60K6787M7805O9152O8158L8201
$$ 469883 470891 487902 498893 511686 499686 499560 500520 527307 575112 644264 712422 750623
10472G50623O929l7401m5871m8045j5162m738O144m52M442o000n543j385K1664
$$ 750623 757552 720151 674280 626235 611073 606335 612479 612027 616469 610469 604926 603541 625205
10459F25205K0684R258M053J2939K2660K2953R111J6775l639m369L981k677J1357
$$ 625205 645889 655147 659200 672139 694799 717752 726863 743638 739999 735630 739611 736934 748291
10446G48291L9880M1868J4046M016Q907J6683L9494O3383P5344M5445L5818K5106
$$ 748291 788171 830039 844085 848101 857008 873691 913185 976568 1051912 1097357 1133175 1158281
10434A158281L1090M0638O2356N4234L7461M2175J781n469p120J0995N3256P5509
$$ 1158281 1189371 1230009 1292365 1346599 1384060 1426235 1428016 1422547 1415427 1426422 1479678 1555187
10422A555187O8439O9464O8504Q9691J22582J29757J20696J21380J45376J80975
$$ 1555187 1623626 1693090 1761594 1851285 1973867 2103624 2224320 2345700 2491076 2672051
10412B672051J94511J83503J58021J34767J75689K74327M11679N83522O41083
$$ 2672051 2866562 3050065 3208086 3342853 3518542 3792869 4204548 4788070 5429153
10403E429153N62824M44549K13058J41360M44706Q47028J119923J241778J241895
$$ 5429153 5991977 6436526 6649584 6790944 7235650 8082678 9202601 10444379 11686274
10394A1686274J062935J090176J515699K067647K764329L976242N854465Q702986
$$ 11686274 12749209 13839385 15355084 17422731 20187060 24163302 30017767 38720753
10386C8720753J3819585K3474482M0659676O0455586N9008268L7861757J1746872
$$ 38720753 52540338 76014820 116674496 177130082 236138350 274000107 285746979
10379B85746979k9451817l8311851l302567L2545024L6631335J8652407r156550
$$ 285746979 256295162 217983311 214680744 247225768 283857103 302509510 293352960
10372B93352960n3239913o4744639m4768385k6997497j6876501j1311211q013287
$$ 293352960 240113047 175368408 130600023 103602526 86726025 75414814 67401527
10365F7401527n931218m584354l807197l375429l087487k678242k051501j622631
$$ 67401527 61470309 56885955 53078758 49703329 46615842 43937600 41886099 40263468
10357D0263468j424772j424350j600730j547160j285071j043199r79759r95379
$$ 40263468 38838696 37414346 35813616 34266456 32981385 31938186 30958427 29963048
10349B9963048j113251j296881j282330j162344j032933r16304p71842o94943
$$ 29963048 28849797 27552916 26270586 25108242 24075309 23159005 22387163 21692220
10341B1692220o38010o15765o03102n43400m82214m51896m28007m25316m36588
$$ 21692220 21054210 20438445 19835343 19291943 18809729 18357833 17929826 17504510 17067922
10332A7067922m29475m13067m04641m19772m60270m85675m74028m57918m17652
$$ 17067922 16638447 16225380 15820739 15400967 14940697 14455022 13980994 13523076 13105424
10323A3105424l67934l56095l73953l68115l44868l04110k74701k52986k42996
$$ 13105424 12737490 12381395 12007442 11639327 11294459 10990349 10715648 10462662 10219666
10314A0219666k52039k33970k49383k33331k04449j86178j97218k22091k10050
$$ 10219666 9967627 9733657 9484274 9250943 9046494 8860316 8663098 8441007 8230957
10305H230957j96102k02943j93023j87181j82852j72461j86244j79127j66986
$$ 8230957 8034855 7831912 7638889 7451708 7268856 7096395 6910151 6731024 6564038
10296F564038j64375j70297j53671j48205j48808j57963j51261j40489j17851
$$ 6564038 6399663 6229366 6075695 5927490 5778682 5620719 5469458 5328969 5211118
10287E211118j09194j00331j26030j34505j29275j33545j32654j22447r5578q6929
$$ 5211118 5101924 5001593 4875563 4741058 4611783 4478238 4345584 4223137 4127559 4040630
10277D040630q5021r5357j17160j22100j13939q8889r9938q5832q0834r9282r2522
$$ 4040630 3955609 3860252 3743092 3620992 3507053 3418164 3318226 3232394 3151560 3052278 2959756
10266B959756q4587o4372o2134o2145p5094r1729p8357p9162q0769n0118J456
$$ 2959756 2875169 2810797 2748663 2686518 2611424 2519695 2441338 2362176 2281407 2231289 2232745
10255B232745K2312L0494k6548q0249n9754l6372L723L5376K5922l0031o6443
$$ 2232745 2255057 2285551 2259003 2178754 2119000 2082628 2086351 2121727 2147649 2117618 2051175
10244B051175n3460n5623o5515n9545p8228p4660q8165q4116p2315o0889o2282
$$ 2051175 1997715 1942092 1876577 1817032 1738804 1664144 1575979 1491863 1419548 1358659 1296377
10233A296377o4719o4678o6693m8893n4725n3929n6829n6484m0693k7516k6437
$$ 1296377 1231658 1166980 1100287 1051394 996669 942740 885911 829427 788734 761218 734781
10222G34781l4738l0159l8705m4894j0864j1949j7746k8374j4960n46r701j6982
$$ 734781 700043 669884 631179 586285 575421 563472 545726 517352 502392 501846 492145 475163
10210D75163k4183k1356k278J203o82r323n815j2260k6180m198k207o844j939
$$ 475163 450980 429624 427346 428549 427867 418544 412729 400469 374289 370091 367884 361040 359101
10197C59101j4805k4848j0234J570J8763R101J8056N465j794j2512M431P765R304
$$ 359101 344296 319448 309214 310784 329547 338648 356704 362169 360375 347863 352294 360059 369363
10184C69363O835O375J0813J8036j888k238j6652j0755p592l906J5462j667j663
$$ 369363 376198 382573 393386 411422 409534 407296 390644 379889 372297 368391 383853 382186 380523
10171C80523p129o416l542O456L452j2391m1777j4395J446j7156j5273j1744n086
$$ 380523 373394 366978 363436 369892 373344 360953 319176 304781 306227 289071 273798 262054 256968
10158B56968n209j1846J231Q086j9872j9155m414n707m121l60N737J9319J8913
$$ 256968 251759 239913 241144 249230 229358 210203 205789 200082 195961 195601 201338 220657 239570
10145B39570k858J1848M678j779j4184j3129L39k453J1549O142Q127L697N308
$$ 239570 236712 248560 253238 251459 237275 224146 224485 222032 233581 239723 247850 251547 256855
10132B56855O495o551k450Q3L444M513o632k7995k0895k858J9324K0726Q974M4
$$ 256855 263350 256799 254349 254432 257876 262389 255757 227762 206867 204009 223333 244059 253033 253077
10118B53077K633K74k6196n736L161J841P466r328o438k716m001M958p093L911
$$ 253077 255710 255984 229788 224052 227213 229054 236520 227192 220754 218038 214037 218995 211902 215813
10104B15813k931J842j731j8549k72o184j0764j2449r417K775j975Q569Q967k873
$$ 215813 212882 214724 212993 194444 194172 187988 177224 164775 155358 158133 156158 164727 173694 170821
10090A70821K847k953j1595k2269j4763j7051j0863L15r128n070o581M318n370
$$ 170821 173668 170715 159120 136851 122088 105037 94174 94489 85361 80291 73710 78028 72658
10077G2658q590L628O925J8487n497k0864l057N317L630O262M505J79Q780K985
$$ 72658 64068 67696 74621 93108 87611 66747 63690 69007 72637 78899 83404 83583 92363 95348
10063I5348k2920j2516j1036n648j985j8689q898k596K610Q87N185L619j282J761
$$ 95348 72428 59912 48876 43228 41243 22554 13656 11060 13670 14557 19742 23361 22079 23840
10049B3840N973j4115K923L097n587l457O383Q444O163N933O923J2810l315P077
$$ 23840 29813 15698 18621 21718 16131 12674 19057 27501 33664 39597 46520 59330 56015 63092
10035F3092P090k0366j794J2065K0000M905j0043j0519p72Q560M703j7410m265
$$ 63092 70182 49816 48022 60087 80087 84992 74949 64430 63658 72218 76921 59511 55246
10022E5246p65k01l361M060J1668R708k966j963L465n278j306j0539K902Q867
$$ 55246 54481 54280 50919 54979 66647 76355 73389 71426 74891 69613 68307 57768 60670 69537
10008F9537O681J3793O160K5099M1213J8595O000M630j4036k1034l4396j6297
$$ 69537 76218 90011 96171 121270 162483 181078 187078 191708 177672 156638 122242 105945
9996A05945k8189K649R770m766L968N681M071o715q278o077R498O261R828Q480
$$ 105945 77756 80405 90175 85409 89377 95058 99129 92414 84136 78059 87557 93818 103646 112126
9982A12126n63P123J8729L233L668K0408L8035N0998P1474J32060K33535L33240
$$ 112126 111563 118686 137415 140648 144316 164724 202759 253757 325231 457291 690826 1024066
9970A024066L26586K02023N2783j70772j66054K7460J86551J66637N9536j08743
$$ 1024066 1350652 1552675 1605458 1434686 1268632 1296092 1482643 1649280 1708816 1600073
9960A600073l13184l40238k14225j42117j00891p9546m2220k5820j8948j5887
$$ 1600073 1286889 946651 732426 590309 489418 409872 367652 341832 322884 306997
9950C06997j2787k0786j7600j795j2494j2542j5602j7505p59o546k898K821n407
$$ 306997 294210 273424 255824 254029 241535 228993 213391 195886 195127 188581 185683 188504 183097
9937A83097j3860k5896j0428L941O3l440J0192N992j0764k92L394q619j4147j710
$$ 183097 169237 143341 132913 136854 136917 133477 143669 149661 138897 138605 141999 133380 119233 117523
9923A17523j2027o59O090n573N354J00j5510k826n273J0277o586l480M247O527
$$ 117523 105496 104837 110927 105354 110708 110808 95298 92472 87199 97476 90890 87410 91657 98184
9909I8184P463l439j2351j1296R86k0550q268P592k020r158Q473l363j8521j3132
$$ 98184 105647 102208 89857 78561 79547 58997 50729 58321 56301 47143 55616 52253 33732 20600
9895B0600P505O235K1524k87j1296o942j6993M095k047n351R587j190j128J3530
$$ 20600 28105 34340 55864 55577 44281 37339 20346 24441 22394 17043 26630 25440 24312 37842
9881C7842Q802P302J787K268o736j1824j0206K912l480o621J14K5366k280j2075
$$ 37842 46644 53946 55733 58001 51265 39441 29235 32147 28667 22046 22160 47526 45246 33171
9867C3171q054Q45J0092J1836J5021j216k76p820k6690q714n844J4902M973l953
$$ 33171 25117 25962 36054 47890 62911 61695 61419 53599 26909 18195 12351 27253 32226 28273
9853B8273l284O778Q366R572J0400j0723M395o188K781J391p38j1072L612J2565
$$ 28273 24989 31767 40133 49705 60105 49382 53777 47589 50370 51761 51023 39951 43563 56128
9839E6128j011n321qO750k711j3552j6828m388Q076J904j0725p016N299l701J0528
$$ 56128 55117 49796 49788 56538 53827 40275 23447 19059 27135 29039 18314 11298 16597 12896 23424
9824B3424k266q20l459k2256m390J6719N379M565j280L697Q184j1563j0819J0380
$$ 23424 21158 20338 16879 -5377 -9767 6952 12331 16896 15616 19313 27497 15934 5115 15495
9810A5495J995j3178O095M959P105j2687n530N807R083r277j925j641Q322K787
$$ 15495 17490 4312 10407 15366 22471 9784 4254 10061 19144 9867 7942 6301 14623 17410
9796A7410n973M151p026R362L283K32r693o887O000J698j5990O798K6068j634
$$ 17410 11437 15588 8562 17924 21207 21439 11746 4859 10859 12557 -3433 3365 29433 27799
9782B7799J562n038r567r751k646J7416K945L829j0734p530j0556J939m798o667
$$ 27799 29361 24323 14756 5005 2359 19775 22720 26549 15815 8285 -2271 -332 -5130 -11797
9768a1797L909J3650m342p181K877o34k60K0461N572j813m800J255P435m849r25
$$ -11797 -7888 5762 1420 -5761 -2884 -3518 -3778 16683 22255 20442 15642 16897 24332 19483 18558
9753A8558o33j0285j1400k158o103K468J7818J8534L206j8150j8034j863n958
$$ 18558 17925 7640 -3760 -5918 -12021 -9553 8265 26799 30005 11855 -6179 -8042 -14000
9740a4000J4624l887o354J388O193Q852J068J3146k400r886j4421L035J3078m358
$$ -14000 624 -3263 -9617 -8229 -2036 6816 7884 21030 18630 8744 -5677 -2642 10436 6078
9726F078q162J0255J1756L639J5141j205n667j4433m737k738N524M204j3659M656
$$ 6078 -2084 8171 19927 23566 38707 37502 31835 17402 12665 9927 15451 19655 5996 10652
9712A0652J0725K365n459m654m284M615Q812J236j4253j8678J3312R505l816p384
$$ 10652 21377 23742 18283 13629 9345 13960 22772 24008 9755 -8923 4389 13894 10078 2694
9698B694P348L858j0842K504P899J0993K175O90N816q569m581j696J1471J1073
$$ 2694 10042 13900 3058 5562 13461 24454 26629 27319 33135 24566 19985 18289 29760 40833
9684D0833o622j9461j4202q779P59K29q371j6241O599J0219O030l202Q641P887
$$ 40833 34211 14750 548 -8231 -7472 -7243 -15614 -31855 -25256 -15037 -9007 -12209 -3568 4319
9670D319j4414j4721r438J1221R573J8230N168k425j5634j1329q76K627J2010
$$ 4319 -10095 -24816 -34254 -23033 -13460 4770 9938 7513 -8121 -19450 -20326 -17699 -5689
9657e689K397N537J2184j44j0415p667l691n593J639J1886J0494J5901K902M756
$$ -5689 -3292 2245 14429 14285 3870 -3797 -7488 -13081 -11442 444 10938 26839 29741 34497
9643C4497n036j35J2772K896k1596l1895m086j076k300J5374N42N681k12Q383
$$ 34497 29461 29326 42098 44994 23398 -8497 -12583 -13659 -15959 -585 -43 5638 5426 13809
9629A3809N936n092j999n571p302j4308J3260J9239P759J399j096k5409j1087
$$ 13809 19745 14653 12654 7083 -219 -14527 -1267 17972 25731 27130 26034 625 -10462
9616a0462N129l346J0586K097j2943j9200J1610O243J1125M681j2854M78R465
$$ -10462 -5333 -8679 1907 4004 -8939 -28139 -16529 -10286 839 5520 -7334 -6856 2609
9603B609N799l118r939r487Q620Q605L141Q818R080j4009j1481o701n751r27j801
$$ 2609 8408 5290 -4649 -14136 -5516 3089 6230 15048 24128 10119 -1362 -8063 -13814 -14741 -16542
9588a6542j0102M021J8398o613Q855O457K053m32r096p038m894J3667J2393n234
$$ -16542 -26644 -22623 -4225 -10838 -1983 4474 6527 6095 -3001 -10039 -14933 -1266 11127 5893
9574E893o600p995O901O265j3147O2R264Q529J0805p110n491K868l189M501l101
$$ 5893 -707 -8702 -1801 4464 -8683 -8621 643 9172 19977 12867 7376 10244 7055 11556 8455
9559H455n808J4473L502k388O645N520j9478k1733l452J0423k465J174K254J2032
$$ 8455 2647 17120 20622 18234 24879 30399 10921 -10812 -14264 -3841 -6306 -5132 -2878 9154
9545I154M649l380o412j1568M906l73L282p710n44k94R001K2898L318j3848O878
$$ 9154 13803 10423 4011 -7557 -2651 -3024 258 -7452 -7996 -8290 711 23609 26927 13079 19957
9530A9957J871k2029l237o711R684R13N568M340L800o000J5153j957j8758q0O235
$$ 19957 21828 -201 -3438 -10149 -465 448 6016 10356 14156 8156 23309 21352 2594 2514 8749
9515H749j1259j0159K4345J8281j729r833j982Q956p632m106L889r131j6476J0821
$$ 8749 -2510 -12669 11676 29957 28228 18395 16413 25369 17737 13631 17520 8389 -8087 2734
9501B734J2442j1391n836Q146n273j1850p112N185L906j3759o824J6359J2826
$$ 2734 15176 3785 -2051 6095 822 -11028 -18140 -12955 -9049 -22808 -29632 -13273 -447
9488d47J4631J659n673J9L951J960K717Q293L989l46j3668K857J3724k5028j7831
$$ -447 14184 15843 10170 10189 14140 16100 18817 27110 31099 30753 17085 19942 33666 8638 -9193
9473i193J379k504J0526j050p611P81j669O123J0886Q196M674K843r90n041N577
$$ -9193 -7814 -10318 208 -842 -8453 -7672 -9341 -3218 7668 15864 20538 23381 22391 17350 22927
9458B2927l466r910m049l478j2518j9139m23J4412J5873K585J4298J1467m473
$$ 22927 19461 9551 5502 2024 -10494 -29633 -30056 -15644 229 2814 17112 28579 24106
9445B4106l673p169o380j9923r905Q853R994r688K028J2836n971O458K030j5092
$$ 24106 20433 13264 6884 -13039 -22944 -14091 -4097 -13785 -11757 1079 -4892 1566 3596 -11496
9431a1496k990j52j068J6470J1968n362j0374M273K092o314l898j0850j6315P838
$$ -11496 -14486 -14638 -15706 764 12732 7370 -3004 1269 3361 -2953 -6851 -17701 -34016 -26178
9417b6178L726J3696P897K449j004q191R135O492j0220n766n675l103l280M661
$$ -26178 -22452 -8756 -859 1590 586 -7605 1530 8022 -2198 -7964 -13639 -16742 -20022 -15361
9403a5361m777k590J6323P324k020j673J8354J9301q287o169R503o322j3968r734
$$ -15361 -20138 -22728 -6405 919 -1101 -2774 15580 34881 26594 20425 29928 23606 9638 -96
9389i6N724m442K934O727l556n755Q016M910n268q663N338J478j0050o703j0381
$$ -96 5628 1186 4120 10847 7291 1536 9552 14462 9194 531 5869 7347 -2703 -9406 -19787
9374a9787Q873k671o01P755J3237R585N556o881j8797j3178m031M610k190J0696
$$ -19787 -10914 -13585 -14186 -6431 6806 16391 21947 15066 -3731 -16909 -20940 -16330 -18520 -7824
9360g824J0270J1224p920o639n380l777J186L131M972j557l40q538P775J4583
$$ -7824 2446 13670 5750 -889 -6269 -10046 -8860 -5729 -757 -2314 -2654 -11192 -3417 11166
9346A1166q342L902L435M986j604r963L625n919m604N897M485m249o55O159R27
$$ 11166 2824 6726 10161 15147 13543 3580 7205 1286 -3318 2579 7064 2815 2160 8319 9246
9331I246p157n582l169J4126l390K819j589q293m431Q645J2166j022P887J286
$$ 9246 2089 -3493 -6662 7464 4074 6893 5304 -2989 -7420 1225 13391 12369 20256 21542
9317B1542j3671o095N706j1139O434j100p612k648J4907M129j451m466R032K2684
$$ 21542 7871 1776 7482 -3657 2777 1677 -5935 -8583 6324 10453 9002 4536 13568 36252
9303C6252O910k5955L411R625j2021j3625j2447J0251o502N8J5878J1254q402
$$ 36252 43162 17207 20618 30243 18222 4597 -7850 2401 -4101 -4043 11835 23089 14687
9290A4687j1589r238N429J8622J2316j8471j8445j096J7427P023Q660J3591m720
$$ 14687 3098 -6140 -711 17911 30227 11756 -6689 -7785 9642 16665 25325 38916 34196
9277C4196m458J5896M958o977k4801j2043O998R083l900p275P543j289k736j088
$$ 34196 29738 45634 50592 43615 18814 6771 13769 22852 18952 11677 19220 17931 15195 14107
9263A4107P021j3046r342k264k615j655R331N266N324k965j652k986r77R636L640
$$ 14107 21128 8082 -1260 -3524 -6139 -7794 1537 6803 12127 9162 7510 4524 3547 13183 16823
9248A6823P943R960p784k1690L501P348k88J710R425o348j8847q79J6613M86j1018
$$ 16823 24766 34726 26942 5252 8753 16101 15813 17523 26948 20600 1753 874 17487 17973 6955
9233F955P514J2277K5R035j216K299O44j836n476j1911j2697O350O458K048m479
$$ 6955 14469 26746 26771 35806 34590 36889 37533 35697 30221 18310 5613 11963 18421 20469 15990
9218A5990n344L439L514L453M16J279n194o84J0276k785m48P021Q530O106l874
$$ 15990 10646 14085 17599 21052 21468 22747 17553 16869 27145 24360 23912 30933 39463 45569 41695
9203D1695K813r096m683P760J470j2043j2585j976K2885K24o579M395O592j4954
$$ 41695 44508 35412 30729 38489 39959 27916 15331 13355 36240 36464 29885 34280 40872 25918
9189B5918j0137P820P370q691n420N608N057J26M962L468j0536L146J3172m222
$$ 25918 15781 23601 30971 22280 16860 22468 27525 27651 32613 36081 25545 28691 41863 37641
9175C7641K621k342k779m951J2353J0339k749N609l115k698M829M512O3Q078M383
$$ 37641 40262 37920 35141 30190 42543 52882 50133 55742 52627 49929 54758 59270 59333 67411 71794
9160G1794n038J852n611o040N805N534K571P277j317n037K1699O638R427m936
$$ 71794 66756 68608 62997 56957 62762 68296 70867 78144 76827 71790 93489 100127 109554 104618
9146A04618q457m019l649l694P067o78j928J74J106K293K0623J3720J1176P097
$$ 104618 96161 92142 88493 84799 91866 91188 89260 89434 90540 92833 113456 127176 138352 145449
9132A45449J0201K112o306o229P799J3274J3625J1013J3498K6864P399P648J0614
$$ 145449 155650 157762 151456 145227 153026 166300 179925 190938 204436 231300 238699 246347 256961
9119B56961K5903K8822J6449J9832L2688R777J6453L3545M3763K3741L7963M9089
$$ 256961 282864 311686 328135 347967 380655 390432 406885 440430 484193 507934 545897 594986
9107E94986N7893N1493O2131Q1125R8036J06047J11953J12338J31329J57795J65174
$$ 594986 652879 704372 766503 847628 945664 1051711 1163664 1276002 1407331 1565126 1730300
9096A730300J86993J94009J74838J54911J20164Q6658N4649j5215o5164r9720
$$ 1730300 1917293 2111302 2286140 2441051 2561215 2647873 2702522 2687307 2622143 2522423
9086B522423j32788j31423j43381j51635j42396j15566j28232j11406r3863q7403
$$ 2522423 2389635 2258212 2114831 1963196 1820800 1705234 1577002 1465596 1371733 1284330
9076A284330q4316r6789n8094m4132n2172n0886l8624l9392n0132m6472k8446
$$ 1284330 1200014 1103225 1045131 1000999 948827 897941 859317 819925 769793 723321 694875
9065F94875l6482l0179l7409k5907o031r586k2243k2178n711j1763r684j7693
$$ 694875 658393 628214 590805 564898 558867 549281 527038 504860 499149 487386 477702 460009
9053D60009l2006k4939o071O658r661q283j8966j6502P804j1340k0112k3303k544
$$ 460009 428003 403064 396993 403651 393990 385707 366741 350239 358043 346703 326591 303288 300744
9040C00744K915k390j2165j3596r382l044k0737k0682q993o616j8031J1711K4929
$$ 300744 303659 301269 289104 275508 266126 263082 242345 221663 212670 206054 188023 199734 224663
9027B24663O774n122j4788j0137j4109r783p594j2091P05J0616q853n171J89K445
$$ 224663 231437 226315 211527 201390 187281 177498 169904 157813 158518 169134 160281 155110 155299 157744
9013A57744Q985l71r540p442l012m799K128j3803m356m508p060o391j5709L642
$$ 157744 166729 166358 156818 149376 146364 141565 143693 129890 125534 121026 113966 107575 91866 95508
8999I5508M141L566P105m992j98j161k615n687n977L198p81Q64J152j2208j2760
$$ 95508 99649 103215 110320 105328 105130 103969 101354 95667 89690 92888 92107 92971 94123 81915 69155
8984F9155m55L7o306j796p009P730l485L41K209L532J540J616j0601r258%o589
$$ 69155 68700 68737 62431 60635 53626 61356 57871 58212 60421 63953 65493 67109 56508 47250 47250 40661
8968D0661j4352K299J3557R768l536Q130k780k760k472j764J3190J139r203j9705
$$ 40661 26309 28608 42165 51933 48397 56527 53747 50987 48515 46751 59941 61080 51877 32172
8954C2172p170j199N929O661Q045O48O747j5125l949m506j2577J0327J2542k776
$$ 32172 25002 23803 29732 36393 44438 45086 51833 36708 32759 28253 15676 26003 38545 35769
8940C5769K963l576q728l394M592P576q14J1855j0394j4021l649L647M915j8475
$$ 35769 38732 35156 26428 23034 27626 35202 34388 46243 35849 21828 18179 21826 26741 8266
8926H266j3183J555j278O646J3718R299N60Q400N953j0606r806q557Q424R705
$$ 8266 -4917 -3362 -4640 2006 15724 25023 25583 33983 39936 29330 19524 10967 19391 29096
8912B9096K891O696K655L336j4585j3698L464k41j2625Q391K469l038O934n805
$$ 29096 31987 38683 41338 44674 30089 16391 19855 19614 6989 15380 17849 14811 21745 15940
8898A5940k1384j4757L695J7059J2254j48r836j1638p406j328Q973J6529J8833
$$ 15940 -5444 -20201 -16506 553 12807 12659 2823 -8815 -16221 -17549 -8576 7953 26786
8885B6786J3658q282j0658m854q156O412J1967L136j3498j1031j9676O029J8923
$$ 26786 40444 32162 21504 16650 8494 14906 26873 30009 16511 5480 -14196 -8167 10756
8872A0756M673K688j0460j1385L564j0806L174O18J4943M954K300j0345n577L517
$$ 10756 15429 18117 7657 -3728 -164 -10970 -7796 -7178 7765 12719 15019 4674 -903 2614
8858B614J6182m580j0523J6358L106j1896J2649l190o336m088N700o646r240o882
$$ 2614 18796 14216 3693 20051 23157 11261 23910 20720 14384 10296 15996 9350 110 -6772
8844f772n227L446j13k973J4239O395R630p845r72J829p76M078k735L635j732
$$ -6772 -11999 -8553 -8666 -11639 2600 8995 18625 10780 9808 11637 10861 14939 12204 15839 14107
8829A4107L145j2500k1053J315Q030J0088J0639P756j457O390o874j3435j576
$$ 14107 17252 4752 -16301 -14986 -6956 3132 13771 21527 20070 26460 19586 6151 4575
8816D575J6007L225j8947r065J1913j390n628n354o85K65j2487k653P459J5622
$$ 4575 20582 23807 4860 -4205 7708 6318 690 -4664 -5349 -5084 -17571 -20224 -12765 2857
8802B857j565o24l161M881p02j592N781q032M031O438K985K733n429r310l134
$$ 2857 1292 668 -2493 2388 1686 94 5875 -2157 1874 8312 11297 14030 8601 -709 -3843
8787c843N113M958M390l257k0324o539n78J0245O236N355K600K058k402j0269
$$ -3843 1270 6228 10618 7361 -12963 -19502 -20080 -9835 -3599 1756 4356 6414 4012 -6257
8773f257Q67J768M693K197P817j657r728k511j017Q15K479O562j599k679Q50m027
$$ -6257 -5390 -3622 1071 3268 11085 9428 -300 -2811 -3828 -3013 -534 6028 4429 1750 2600 -1427
8757a427J0023L599N056p260k0052j4423J5479J0266N631P7K522L106j917m809
$$ -1427 8596 12195 17251 9991 -10061 -24484 -9005 1261 6892 6969 9491 12597 10680 5871
8743E871j3761N61J63l714l683O52M404l388J0964J1633k207j1579R855R487J3988
$$ 5871 -7890 -7329 -7166 -10880 -14563 -13911 -9507 -12895 -1931 9702 7495 -4084 5771 15258 29246
8728B9246R390r034K123p671o788r115q957p611l991J4063K851r263J3117L956
$$ 29246 38636 29602 31725 24054 17266 8151 -806 -8417 -12408 1655 4506 -4757 8360 12316
8714A2316k184M550P768o484J0782P25n316N355j0115q145m1R742Q061l984p513
$$ 12316 10132 14682 22450 15966 26748 27473 22157 27512 17397 9252 9211 18953 27014 23030 15517
8699A5517K582r080J1149j690j817l828k0J5226j177k0334j734m99n851M99J5761
$$ 15517 18099 9019 20168 18478 16661 12833 12813 28039 26862 6528 4794 4295 -1556 -1057 14704
8684A4704Q117p114j0484J7723J483j2530j5057M129J4653p444J1392M043N470
$$ 14704 22821 15707 5223 22946 24429 11899 -3158 971 15624 8180 19572 23615 29085
8671B9085N319q068o006P680j2709n467j864J2578J6865K057l23M547j4354k5290
$$ 29085 34404 26336 20330 28010 15301 9834 7970 20548 37413 39470 39147 43694 29340 4050
8657D050j1056Q520j746K375O616J5098N833j1398r424n667K902J2542Q94m063
$$ 4050 -7006 1514 -232 2143 8759 23857 29690 18292 8868 3201 6103 18645 19539 15476
8643A5476l338J0320J3465m59j0591k281N998k035K078l270L871K960L799M007
$$ 15476 12138 22458 35923 35464 24873 22592 28590 26555 28633 25363 29234 32194 35993 40000
8629D0000J0725J0742j2552O079J2911J743J2972M246K993L629M967O70m86O698
$$ 40000 50725 61467 48915 54994 67905 69648 82620 86866 89859 93488 98455 99125 98639 105337
8615A05337Q112J0240p076r349j5593j956n573j7389q111j0885J203n301j2107
$$ 105337 113449 123689 116613 107264 91671 89715 84142 66753 58642 47757 48960 43659 31552
8602C1552J0841J2870K725R67r838j4530j0607j4108O768J787o012N153J3210
$$ 31552 42393 55263 57988 58955 49117 34587 23980 9872 16640 18427 12415 17568 30778
8589C0778J1360P6o589o92J0951l962n030k730j3081L026L544j865J029P718k652
$$ 30778 42138 42214 35625 34933 45884 41922 36892 34162 21081 24107 27651 25786 26815 34533 31881
8574C1881n192n585q958M340J2873J0430M422k0009k4674J2875J7728o423k461
$$ 31881 26689 21104 12146 16486 29359 39789 44211 24202 -472 12403 30131 23708 21247
8561B1247M550j544l662K967n702j2027K548K1256L578k0192j6677K881L15O563
$$ 21247 25797 24253 20591 23558 17856 5829 8377 29633 33211 13019 -3658 -777 -462 6101
8547F101J3343q15Q92o90l419N336L882j1532j1006m372n277N683L168n856J2550
$$ 6101 19444 18629 19521 18831 15412 20748 24630 13098 2092 -2280 -7557 -1874 1294 -4562 7988
8532G988j1047P0L592j721j4506n813j93Q558J3420J7097j3009q578L431R84j190
$$ 7988 -3059 -2989 603 -1118 -15624 -21437 -21630 -13072 348 17445 4436 -4142 -711 273 -917
8517i17k723n484j07Q295N0n192LM98N59l439m835M387J4688R18r007j736R208
$$ -917 -3640 -9124 -9231 -936 -886 -6078 -6075 -5577 -5018 -8457 -13292 -8905 5783 6701 -2306 -4042 5166
8500E166n393J777j140r722O40K1432K2017n944j786N261j0313o680j3209n667
$$ 5166 -227 1550 410 -9312 -8672 12760 34777 28833 27047 32308 21995 15315 2106 -3561
8486c561k160r384j309J5621P90j082J582o083L850o818j009j4038M944Q952J4156
$$ -3561 -5721 -15105 -16414 -793 -3 -1085 497 -5586 -1736 -8554 -9563 -23601 -18657 -9705 4451
8471D451J0352k477j6202p634J731k193K892k160M215M424M135l623j0700R386
$$ 4451 14803 12326 -3876 -11510 -9779 -11972 -9080 -11240 -7025 -2601 1534 -2089 -12789 -3403
8457c403J1980R523J0186k299k3201n214J5387p19k832q766m702j046n785o416
$$ -3403 8577 18100 28286 25987 2786 -2428 12959 12240 9408 642 -4060 -5106 -10891 -17307
8443a7307J2850J5701J282j6809p146L581J0052L269R525N959n706j1190K988
$$ -17307 -4457 11244 12526 -4283 -11429 -7848 2204 5473 14998 20957 15251 4061 7049
8430G049n205j1266j6057P221R260j1940m718P414J2032O51L964J0951j7655r061
$$ 7049 1844 -9422 -25479 -18258 -8998 -20938 -25656 -18242 -6210 -5559 -1595 9356 -8299 -17360
8416a7360P77J59m005p915n060L648R685m75Q016j553m182L381J9786R157k421
$$ -17360 -16583 -16424 -20429 -28344 -33404 -29756 -20071 -20546 -12530 -14083 -18265 -14884 4902 14059 11638
8401A1638l867j7886n140q628Q205N963M943n260R515k081r088L962Q178K298
$$ 11638 7771 -10115 -15255 -23883 -15678 -9715 -4772 -10032 -517 -2598 -11686 -7724 454 2752
8387B752p200p640J0548N234q055n9P735N791J026Q277L796K798k3276j473P440
$$ 2752 -4448 -12088 -1540 3694 -4361 -4420 3315 9106 10132 18409 22205 25003 1727 254 7694
8372G694m041j0201O629L117J5329P032K218j194l513j883j2761j0340l568J2904
$$ 7694 3653 -6548 81 3198 18527 25559 27777 26583 23070 21187 8426 -1914 -5482 7422
8358G422N208m91k477m603k33n032o155P296J1155j7312P790o083n967j31R5r90
$$ 7422 12630 12139 9662 5059 4826 -206 -6361 935 12090 -5222 2568 -3515 -9482 -9613 -9518 -10508
8342a0508O926J153K467N340j2732j9154p722J910J1019J1547O946L463j6133
$$ -10508 -3582 -2429 38 5378 -7354 -26508 -34230 -32320 -21301 -9754 -2808 655 -15478
8329a5478J334Q542J5183l488p883K66O24j3367j337o444R591R918J1826J2786
$$ -15478 -14144 -5602 9581 6093 -1790 -1524 -900 -14267 -15604 -22048 -12457 -2539 9287 22073
8315B2073j256j7979K979J4690J255m039r688j5177l720m621J2928R290K559p837
$$ 22073 20817 2838 5817 20507 21762 17723 8035 -7142 -10862 -15483 -2555 6735 9294 1457
8301A457n640J3757l249j3078J257J2174N515K250r406j1113n710J0216Q277j970
$$ 1457 -4183 9574 6325 -6753 -5496 6678 12193 14443 5037 -6076 -11786 -1570 6707 4737
8287D737L128n20m309j0999r470R993Q555k281j8858r531M382j040p088J5249
$$ 4737 7865 7345 3036 -7963 -17433 -7440 1115 -1166 -20024 -29555 -25173 -26213 -33301 -18052
8273a8052n43O365J7167o652P592L815o235l842j1994O132j487M545r683j207
$$ -18052 -18595 -12230 4937 -1715 5877 9692 3457 -385 -12379 -6247 -7734 -3189 -12872 -14079
8259a4079j459M478L574J1371J196L121j3576q950j186O467R864P155n624r399
$$ -14079 -15538 -11060 -7486 3885 5081 8202 -5374 -14324 -15510 -9043 821 7976 2352 -7047
8245g047J0434m084j4419K518J0281Q375J0593j0303j4410j025O454R636L289
$$ -7047 3387 -697 -15116 -12598 -2317 6058 16651 6348 -8062 -9087 -2633 7003 10292
8232A0292j6658k2757n245Q281j0220M008K0030J1130j151J080J0276l184j1898
$$ 10292 -6366 -29123 -34368 -26087 -36307 -32299 -12269 -1139 -2290 -1210 9066 5882 -6016
8219f016j322N88J1019j214p690j1462Q626N058J0920q254J1050O382j1714p571
$$ -6016 -7338 -6750 4269 3055 -4635 -16097 -7471 -2413 8507 253 11303 17685 5971 -1600
8205a600n330K433J768P639O957m671O046Q26P157Q686r546m041K737j5975j0448
$$ -1600 -6930 -4497 -2729 4910 11867 7196 13242 14068 21225 29911 20365 16324 19061 3086 -7362
8190g362n997N999k221m921L928J4718J3546k0492m323M201J1117K277J685j2001
$$ -7362 -13359 -7360 -9581 -14502 -10574 4144 17690 -2802 -7125 -2924 8193 10470 12155 154
8176A54q706J8588J2394j1058L526J0797n148j9948L577J1397M460K160j392l951
$$ 154 -8552 10036 22430 11372 14898 25695 20547 599 4176 15573 20033 22193 20801 16850
8162A6850k363l294j2539j0192P090O315j0678m198J1593j2580P253J5671n817
$$ 16850 14487 11193 -1346 -11538 -4448 1867 -8811 -13009 -1416 -13996 -6743 8928 3111
8149C111p04L724j4592K831o500j456J0317Q282j752q158Q607J2890l728j3169
$$ 3111 2407 6131 -8461 -5630 -12130 -13586 -3269 5013 3261 -4897 3710 16600 12872 -297
8135b97j5624M619N273P571L862l404m217rp749j4639R397N166P447J7293J0979
$$ -297 -15921 -11302 -6029 1542 5404 2000 -2217 -2226 -9975 -24614 -15217 -10051 -2604 14689 25668
8120B5668j179j087j1513j0223j2401j0570J1881R047m388J7567r152P240j762
$$ 25668 24489 23402 11889 1666 -10735 -21305 -9424 -377 -4765 12802 3650 10890 9128
8107I128n926J2475M960q333o052p63J086R81L14r6n611L202l058M55L099M804
$$ 9128 3202 15677 20637 12304 6252 5489 6575 7556 7870 7774 2163 5365 2307 2762 5861 10665
8091A0665j0238P65Q819m063m457J239o484k756L021J6645K332j6647j353O61
$$ 10665 427 1192 10011 5948 1491 2730 -3754 -6510 -3489 13156 15488 -1159 -2512 -1851
8077a851P440l833O483j1191R864L145M860J0542j7K47n362j6217K974o275p105
$$ -1851 5589 1756 8239 -2952 6912 10057 14917 25459 25442 25689 20327 4110 7084 809 -6296
8062f296l23j891l497R939Q918J1462M86l056r089j200j174j2300j4123R374N148
$$ -6296 -6619 -8510 -12007 -2068 6850 18312 18798 15742 6653 5453 4279 -8021 -22144 -12770 -7622
8047g622R301R840o163n394J0477J4055m775j2872p762K2350J3584n471j3982
$$ -7622 1679 11519 5356 -38 10439 24494 19719 6847 -915 21435 35019 29548 15566
8034A5566j7493J2304k780L366k314j8493j0884J6591J5471J7154L481j185m957
$$ 15566 -1927 10377 7597 10963 8649 -9844 -20728 -4137 11334 28488 31969 30784 25827
8021B5827P255k745P34J1417K253J863n801j1488j3008P109P908L15j0952r682
$$ 25827 33082 30337 31071 42488 44741 46604 40803 29315 16307 23416 31324 31639 20687 11005
8007A1005Q03j535K696Q91P058J8266M175j3603o557L254M957J054j3216n325
$$ 11005 11808 10273 12969 13860 20918 39184 43359 29756 23199 26453 31410 32464 19248 13923
7993A3923J623N206R968J0052j1791j7159r860O212m95K47R147l140K92N040O525
$$ 13923 15546 20752 30720 40772 28981 11822 1962 8174 7679 7926 17073 13933 14225 19265 25790
7978B5790k635J682K615N929R557N47j7400j4492m146P362P390l554j1889Q916
$$ 25790 23155 24837 27452 33381 42938 43485 26085 11593 7447 14809 22199 18645 6756 15672
7964A5672K334M031r38j3873Q231K595M010R713J0672j597k1415o990L521k617
$$ 15672 18006 22037 21099 7226 15457 18052 22062 31775 42447 40850 19435 12445 15966 13349
7950A3349J3030J8780j4343j2156j8458j209n844J2786P451J845J0864J007O493
$$ 13349 26379 45159 30816 18660 202 -1007 -6851 5935 13386 15231 26095 27102 33595
7937C3595M715M01j2983J356L649l664q374m130P718M153K242K34j1375n885Q413
$$ 33595 38310 38711 25728 27084 30733 27069 18695 14565 22283 26436 28678 28912 17537 11652 20065
7922B0065J248j5967j1146K1699M827k5358J900N009J7132l396j3107p042l900
$$ 20065 21313 5346 -5800 15899 20726 -4632 -2732 2277 19409 16013 2906 -4136 -8036
7909h036J1466M651L228n904J1485J151R616L371j2718j1423j19M283K817L278
$$ -8036 3430 8081 11309 5405 16890 18041 27657 31028 18310 6887 6768 11051 13868 17146
7895A7146N157O940P18P92P828j1963j7748p688Q75Q122O069q424r156Q914K714
$$ 17146 22303 29243 29961 30753 38581 26618 8870 1182 2057 10179 16248 7824 -1332 7582 10296
7880A0296j3639M536N34k4L325J0057O325m253r075N204P118k473k591J781p560
$$ 10296 -3343 1193 1727 1703 5028 15085 21410 17157 8082 13286 20404 17931 15340 17121 9561
7865I561P041M046n865j9007m444j5457k150J1516Q202Q116N552Q326O944j1833
$$ 9561 16602 20648 14783 -4224 -8668 -24125 -26275 -14759 -6557 1559 7111 15437 22381 10548
7851A0548l128M877K485j0956k6319j1877K7174K28j1070N462n29r51L858M434
$$ 10548 7420 12297 14782 3826 -22493 -34370 -7196 -6968 -18038 -12576 -13105 -14056 -10198 -5764
7837e764N925N299k0093n837J8155L484N912j0901m795N654l470K980l536j3468
$$ -5764 161 5460 -14633 -20470 -2315 1169 7081 -3820 -8615 -2961 -6431 -3451 -6987 -20455
7823b0455p346k408J3897Q761K96O582N821o161R215o707j0755O618Q861K419
$$ -20455 -27801 -30209 -16312 -7551 -7255 -673 5148 -1013 8202 1495 -9260 -2642 6219 8638
7809H638m101J703l53q542J958K435J3867J7722q185j4032j0189r869n678M369
$$ 8638 4537 6240 5887 -2655 -697 1738 15605 33327 25142 11110 921 -8948 -14626 -10257
7795a0257K840m725J0266j744q783J0745J2802k72m841p291k523m335K081R573
$$ -10257 -7417 -12142 -1876 -3620 -12403 -1658 11144 10872 6031 -1260 -3783 -8118 -6037 3536
7781C536N986j356r293m373o353L854P644R764k700n538p264J6043J0628p459
$$ 3536 9522 8166 -1127 -5500 -11853 -7999 -355 9409 6709 1171 -6093 9950 20578 13119
7767A3119j5048l483M99l541K66o364l912k163K0128m00j895N599P780r342K198
$$ 13119 -1929 -5412 -4913 -8454 -8188 -14552 -18464 -20627 -499 -899 -2794 2805 10585 1243 3441
7752C441Q340n745j2317q546N8J636J9790m160j5243j341M62l076R178k267m891
$$ 3441 11781 6036 -6281 -14827 -14769 -13133 6657 2497 -12746 -14087 -13625 -16701 -7523 -9790 -14681
7737a4681q14l714M309J1686J1141p104n069N855j937j0841j7934k241n637m199
$$ -14681 -15495 -19209 -14900 -3214 7927 823 -4246 1609 -328 -11169 -29103 -31344 -36981 -41180
7723d1180K3693K1651J3316J0554L042j058j1615n570J874K641N117j2824L31
$$ -41180 -17487 4164 17480 28034 31076 30018 18403 12833 14707 17348 22465 9641 9972
7710I972N22P984j379r827q417r992M687N709k600K660j58j396J0598K185O9N55
$$ 9972 10494 18478 17099 7272 -1145 -11137 -6450 -741 -3341 -681 -839 -2235 8363 10548 10617 11172
7694A1172n425j0446j3409j0174j87M686j099q455k470J7246J8874l944q247K0674
$$ 11172 5747 -4699 -18108 -28282 -28469 -23783 -24882 -33337 -35807 -18561 313 -3631 -11878 8796
7680H796Q396N807q021r259O93o007j719J088M818j0969K817Q250J1937r465l193
$$ 8796 17192 22999 14978 5719 6412 405 -1314 -226 4592 -6377 -3560 4690 16627 7162 3969
7665C969j712o575J2195L718j2228j2643Q107R092J2419k107j9113l948k182N843
$$ 3969 2257 -4318 7877 11595 -633 -13276 -5169 3923 16342 14235 -4878 -8826 -11008 -5165
7651e165P492j867N276j6824N832P022P065k280j3929k6409n319k392J813M1555
$$ -5165 2327 460 5736 -11088 -5256 1766 8831 6551 -7378 -33787 -39106 -41498 -39685 1870
7637A870Q031K647L673p342n2p20M107N975j4958o73k891j0376j643l765L908
$$ 1870 9901 12548 16221 8879 8827 8107 12214 18189 3231 2558 -333 -10709 -12352 -16117 -12209
7622a2209k422Q654p085n81m1Q213M121n646p665j7156J1079J9584J6186l054
$$ -12209 -14631 -5977 -13062 -13643 -13684 -5471 -1350 -6996 -14661 -31817 -20738 -1154 15032 11978
7608A1978j0229o33l123K81M698o614j4372K898M502K60j533K622J0483l330m208
$$ 11978 1749 1116 -2007 -1726 2972 -3642 -18014 -15116 -10614 -10354 -11887 -9265 1218 -2112 -6320
7593f320K518M705n171j3481R906j711j338J3825j2006j2354J2380n399K866J877
$$ -6320 -3802 903 -4268 -17749 -7843 -9554 -10892 2933 -9073 -21427 -9047 -14446 -11580 -9703
7579i703k279n308l836M47P057Q424N02P3m768M463k46p723j5642k942N788k267
$$ -9703 -11982 -17290 -21126 -20679 -13622 -5198 -4696 -4623 -9391 -4928 -5174 -12897 -28539 -31481 -25693 -27960
7563b7960N723Q204N571P810N076J0898r275j6322p743N547O655J590N89N719
$$ -27960 -22237 -14033 -8462 -652 4424 15322 6047 -10275 -18018 -12471 -5816 -4226 -3637 2082
7549B082j835k696m925j2207P491K1564q69k0358m236R57n211J1872K6515J5992
$$ 2082 247 -2449 -7374 -19581 -12090 9474 8605 -11753 -15989 -15032 -20243 -8371 18144 34136
7535C4136l766r569j6662k4885o218K0314R630k268j250j4104R25J4149K689r796
$$ 34136 30370 20801 4139 -20746 -26964 -6650 2980 712 -538 -14642 -13717 432 3121 -6675
7521f675n703o470k826J1308m538J0366J4596p002j3619N0j4483K055J0095n835
$$ -6675 -12378 -18848 -21674 -10366 -14904 -4538 10058 3056 -10563 -10513 -24996 -22941 -12846 -18681
7507a8681J0099j735O061P041o476l057J1254j06j6157j593n094M02K4924J0551
$$ -18681 -8582 -10317 -4256 2785 -3691 -6748 4506 4400 -11757 -13350 -18444 -18042 6882 17433
7493A7433j9077j3470Q12J1937J0385P285n890l566M620L243j950L211N444J9413
$$ 17433 -1644 -15114 -14302 -2365 8020 15305 9415 5849 10469 13712 11762 14973 20417 39830
7479C9830n270j9194j3734l562j3653O370J4299k046j6100o708J8730m748n069
$$ 39830 34560 15366 1632 -1930 -15583 -9213 5086 3040 -13060 -19768 -1038 -5786 -10855
7466a0855J5363J3335k05k411r261o708j042J563J97P606r366o820L189N038n660
$$ -10855 4508 17843 17638 15227 5966 -742 -1784 -221 -24 7582 -1784 -8604 -5415 -377 -6037
7451f037r509j8641O407L798o320j680J2770O136N822l997P75J865N925J1253
$$ -6037 -15546 -34187 -27780 -23982 -30302 -31982 -19212 -13076 -7254 -11251 -10476 -8611 -2686 8567
7437H567j933j2524M507N768J273k622j9328L848J0930L355j596j9780J069k65
$$ 8567 6634 -5890 -1383 4385 5658 3036 -16292 -12444 -1514 1841 245 -19535 -18466 -18731
7423a8731p520L652O554K031O872J3522K228j6327m648J0677J0944R796J703o436
$$ -18731 -26251 -22599 -16045 -14014 -7142 6380 8608 -7719 -12367 -1690 9254 19050 20753 14317
7409A4317j0922k1604j1251L516J2231n38o384K966J7903J6082m86k12n162j318
$$ 14317 3395 -18209 -29460 -25944 -13713 -14251 -20635 -17669 234 16316 15830 15618 10456 9138
7395I138m197k213O30q54j2936n591J62J3461M894L513j0896o57N560l870j3002
$$ 9138 4941 2728 3358 2504 -10432 -16023 -15861 -2400 2494 6007 -4889 -5546 14 -3856 -16858
7380a6858L498P294L761j1096q163O709L645O132p951Q113J3097j2054j3642l335
$$ -16858 -13360 -6066 -2305 -13401 -21564 -14855 -11210 -5078 -13029 -4916 8181 -3873 -17515 -20850
7366b0850M570J4305k195r916K833N17n039l924P352J0346Q420L36j6469j1718
$$ -20850 -16280 -1975 -4170 -14086 -11253 -10736 -15775 -19699 -12347 -2001 6419 6755 -9714 -21432
7352b1432J4120K1030q947r275P227M625j1343k068R980N759J72K746P660j830
$$ -21432 -7312 13718 4771 -4504 2723 7348 -3995 -6063 3917 9676 9848 12594 20254 18424
7338A8424j1066J424J792J336n015j4237J8033O760k790j1019q976p588J1217
$$ 18424 7358 8782 10574 11910 6895 -7342 10691 17451 14661 3642 -5334 -12922 -1705
7325a705J346L047l172j891j4449j407J4640J774M974J2099Q363p143k2422r415
$$ -1705 -359 2688 -484 -2375 -16824 -18231 -3591 -1817 3157 15256 23619 16476 -5946 -15361
7311a5361J2720j981k950K455n284J4368p215k2560M117K419Q238q464q064K845
$$ -15361 -2641 -4622 -7572 -5117 -10401 3967 -3248 -25808 -21691 -19272 -11034 -19498 -27562 -24717
7297b4717R92n45Q901K0442l593r94m06j6015k387O653K403M119l343K863N447
$$ -24717 -23725 -24270 -15369 5073 1480 486 80 -15935 -18322 -11669 -9266 -5147 -8490 -5627 -180
7282a80m015K303J9709p258j6175m351K227J2327K655L627m868O561o595j6265
$$ -180 -4195 -1892 17817 10559 -5616 -9967 -7740 4587 7242 10869 6001 12562 5967 -10298
7268a0298m179n99J967k088M289L229k968j635j0282N23M348P804J2536K864l276
$$ -10298 -14477 -15076 -13109 -15197 -10908 -7679 -10647 -12282 -22564 -22041 -17693 -9889 2647 5511 2235
7253B235q513J969K0363J148p695j5941N697O705J6400j0435j442j0388r52j07
$$ 2235 -6278 -4309 16054 17202 9507 -6434 -737 5968 22368 11933 10491 103 -849 -956
7239i56J271P196J6647K625j8883k0122j4304K414J5278L94L632O369m545m347
$$ -956 315 7511 24158 26783 7900 -12222 -26526 -24112 -8834 -8440 -4808 1561 -2984 -7331
7225g331j7280M171J3314Q594L793m448j2734p148j3534N261J988O649m656N275
$$ -7331 -24611 -20440 -7126 1468 5261 813 -11921 -19069 -32603 -27342 -25354 -18705 -23361 -18086
7211a8086K4195N736j1218l151Q681L050p61K028N393K746p573j8875j2619J68
$$ -18086 6109 11845 627 -2524 6157 9207 8446 10474 15867 18613 11040 -7835 -20454 -20286
7197b0286J1752Q494K373r809j869N164Q940k519O609o873j1704L742J333J287
$$ -20286 -8534 -40 2333 -7476 -9345 -4181 4759 2240 8849 1976 -9728 -5986 -4653 -3366
7183c366J0192k648m412l260N087N565N403j1001j1946m504J5867J5575Q216N906
$$ -3366 6826 4178 -234 -3494 1593 7158 12561 1560 -10386 -14890 977 16552 24768 30674
7169C0674j0845j0320L545j4815j8945j273l238R09J3158M987q121J436J1336
$$ 30674 19829 9509 13054 -1761 -20706 -21979 -25217 -24308 -11150 -6163 -14284 -12848 -1512
7156a512p191m438n388j435j4779j5594J4558J0860Q662j324R563O510n027j92
$$ -1512 -8703 -13141 -18529 -19964 -34743 -50337 -35779 -24919 -16257 -17581 -8018 -1508 -6535 -6727
7142f727P587m481k26P71n242n686L925r088n142q93N462r485J592K0041j243
$$ -6727 860 -3621 -3847 -3076 -8318 -14004 -10079 -19167 -24309 -25202 -19740 -29225 -27633 -7592 -8835
7127h835k115j472j1463J925K226n91J0634j801P49R138J576o327J1050m641l931
$$ -8835 -10950 -12422 -23885 -21960 -19734 -20325 -9691 -11492 -10743 -1605 -29 -6356 4694 53 -3878
7112c878R31P730l9n765o776m873k372J3097N874J785k431k5p550R92J387q879
$$ -3878 -2947 4783 4744 -1021 -7797 -12670 -15042 -1945 3929 5714 3283 3258 -4292 -3300 -1913 -10792
7096a0792k536r01j7545N519J3438J1998k44l196L135l241M199M589m839l062
$$ -10792 -13328 -14229 -31774 -26255 -12817 -819 -1063 -4259 -1124 -4365 -166 4423 -416 -3478
7082c478k821q89l153n892o176m16J374n182R273m660R305J0279q518k47N595
$$ -3478 -6299 -7188 -10341 -16233 -22409 -22825 -21451 -26633 -17360 -22020 -12715 -2436 -10954 -11201 -5606
7067e606J3046j3290j721k830j252J1439J6479j2116j5613J1319M572Q388k801
$$ -5606 7440 -5850 -7571 -10401 -11653 -214 16265 4149 -11464 -145 4427 12815 10014
7054A0014m748j2660k793M700R982m2R064j3229j702l131K767L42j115J3388N193
$$ 10014 5266 -7394 -10187 -5487 4495 4453 13517 288 -1414 -4545 -1778 -1436 -2551 10837 16030
7039A6030q469p130m710L91J651J2406P490M387j4292j5854n259N7j521k095N118
$$ 16030 7561 431 -4279 -3888 -2237 10169 17659 22046 7754 -8100 -13359 -13302 -14823 -16918 -11800
7024a1800k390n304N138Q067L640J507m320j535l43k559m42P70p223M562l393
$$ -11800 -14190 -19494 -14356 -6289 -2649 -1142 -5462 -6997 -7340 -9899 -10341 -9571 -16794 -12232 -15625
7009a5625l995n334K720K433R284Q024j2244k500L310L918J328j4132L614J5525
$$ -15625 -19620 -24954 -22234 -19801 -10517 -2493 -14737 -17237 -13927 -10009 -8681 -22813 -19199 -3674
6995c674j2676j1613J6351L826J1488J8032n127k461m774j226k838L573q374M511
$$ -3674 -16350 -27963 -11612 -7786 3702 21734 16607 14146 9372 8146 5308 8881 507 5018
6981E018N044O64R409j683r373p613r664j478J5814L581O705J314p289j4574Q738
$$ 5018 10062 10726 20135 18452 9079 1466 -8198 -9676 6138 9719 16424 17738 10449 -4125 4613
6966D613l171P449k046n203r535R83O20j1064j3257J8757N306q498l755P624Q195
$$ 4613 1442 8891 6845 1642 -7893 -6910 -6290 -17354 -30611 -11854 -6548 -15046 -18801 -11177 -2982
6951b982Q204P46q520K680j18p979M599R854N751M90M416N193j2594L63n760j8674
$$ -2982 5222 5968 -2552 128 10 -7969 -3370 6484 12235 12725 17141 22334 9740 10103 4343 -14331
6935a4331o785M926Q553J0414L582j4131K382N438m927K759O669j2988j6006n55
$$ -14331 -21116 -16190 -7637 2777 6359 -7772 -5390 48 -4879 -2120 4549 -8439 -24445 -25000
6921b5000q984J8389J2007j295l342p07m043P15J3005l599J19o18Q481J0884J208
$$ -25000 -33984 -15595 -3588 -4883 -8225 -8932 -12975 -12260 745 -2854 -2735 -3353 5128 16012 17220
6906A7220N296q209j5239j2150n17j0696N072J1993O595n836j5116l847J9565
$$ 17220 22516 14307 -932 -13082 -13599 -24295 -19223 -7230 -635 -6471 -21587 -25434 -5869
6893e869J5766J522l241j0462o782m240l384R986p554l307J792n661Q488o383
$$ -5869 9897 11419 8178 -2284 -9066 -13306 -16690 -6704 -14258 -17565 -15773 -21434 -12946 -19329
6879a9329j3744j3334q55J4817Q678L943J2143N269O436j2867r453O438M854j2793
$$ -19329 -33073 -46407 -47262 -32445 -23767 -19824 -7681 -2412 4024 -8843 -18296 -11858 -7004 -19797
6865a9797L70Q511p25N975J4987J279j1302o947L249J1484Q234k991r829n526
$$ -19797 -19427 -10916 -11641 -5666 9321 10600 -702 -7649 -4400 7084 15318 12327 2498 -3028
6851c028k0623O652N164J5811Q814l431r063j855j100M866l420j0138N179N566
$$ -3028 -23651 -16999 -11835 3976 12790 9359 296 -1559 -2659 2207 -1213 -11351 -6172 -606
6837f06J0777M794l950n634j2709n883M885Q740l614j0530q589N811J0463M690
$$ -606 10171 14965 11015 5381 -7328 -13211 -8326 414 -3200 -13730 -22319 -16508 -6045 -1355
6823a355L991o565j1337N481P006N58J9610k496r413K942J0235p232j8449k7143
$$ -1355 2636 -3929 -15266 -9785 -2779 -2221 17389 14893 5480 8422 18657 11425 -7024 -34167
6809c4167K691J1133n197J0972J0249r202l829q941J4506J2224p97j068R729J175
$$ -34167 -31476 -20343 -25540 -14568 -4319 -13521 -17350 -26291 -11785 439 -358 -1426 8303 9478
6795I478j2426n990j4364L480j512J582K983P856J2757L447K416R907N670j1562
$$ 9478 -2948 -8938 -23302 -19822 -21334 -19752 -16769 -8913 3844 7291 9707 19614 25284 13722
6781A3722k0708n828l339m551k508K518P072J1145K2777J8849J0768K589r597
$$ 13722 -6986 -12814 -16153 -20704 -23212 -20694 -13622 -2477 20300 39149 49917 52506 42909
6768D2909N437j0839n994k057r545j4631k249K4778J1403o801j933j2795k473
$$ 42909 48346 37507 31513 29456 19911 5280 3031 27809 39212 32411 30478 17683 15210
6755A5210L388J845n751k626m822j0237j1381l537L627R721J5183J0539m686j5266
$$ 15210 18598 20443 14692 12066 7244 -2993 -14374 -17911 -14284 -4563 10620 21159 16473 1207
6741A207k780P506o706l997O890M896j3059J66K710j2873L835K743K808q321J1215
$$ 1207 -1573 5933 -773 -4770 2120 7016 -6043 -5877 -3167 -16040 -12205 -9462 -6654 -14975 -3760
6726c760K4585l872l974o225N948p126j7888j0571k559n8J9077k052j0167R220
$$ -3760 20825 16953 12979 6754 12702 5576 -12312 -22883 -25442 -25500 -6423 -8475 -18642 -9422
6712i422J1322l922k77J3557J0067k079j3146j0581j7443J8110j2807j0116Q914
$$ -9422 1900 -2022 -2299 11258 21325 19246 6100 -4481 -21924 -3814 -16621 -26737 -17823
6699a7823J4102L910o073Q353O102l418M984R560L049m019q718L266m294o055
$$ -17823 -3721 189 -5884 2469 8571 5153 10137 19697 22746 18727 10009 13275 8981 2926
6685B926M654k50p465J1294k888p621L534R381N334k701j1523N345l223n737L800
$$ 2926 7580 7330 -135 11159 8271 650 4184 13565 18899 16198 4675 10020 6797 1060 4860
6670D860j4490r335j307k745O903K0769J1396l90n603q471j3571M355J8922O804
$$ 4860 -9630 -18965 -20272 -23017 -16114 4655 16051 15661 10058 1587 -11984 -7629 11293 18097
6656A8097n128r411R17m779P552n815m234K155M605J222m306l531j0281O543o117
$$ 18097 12969 3558 4475 -304 7248 1433 -2801 -646 3959 5181 875 -2656 -12937 -6394 -12511
6641a2511j885O212J2082K36m204J374J1217m346k463m436J157L617l644j3329
$$ -12511 -14396 -8184 3898 4134 -70 1304 12521 8175 5712 1276 2433 6050 2406 -10923
6627a0923j5566P213R058R98O76J1552l74K808J5674k006j0659n490L184j0715
$$ -10923 -26489 -19276 -10218 -9220 -8544 3008 2634 5442 21116 19110 8451 2961 6145 -4570
6613d570j6341j410q021o141l082l756J6745J1958N243J1034Q444k2377o032J3240
$$ -4570 -20911 -22321 -30342 -36483 -39565 -43321 -26576 -14618 -9375 1659 10103 -12274 -18306 -5066
6599e066Q299o73p103M698P066K001n362k448l788r965l919J935J4779J1397n843
$$ -5066 3233 2560 -4543 155 7221 9222 3860 1412 -2376 -12341 -16260 -14325 454 11851 6008
6584F008j1044O4K58J9619R646M228p287k7989p778P061M462k417j562n361L025
$$ 6008 -5036 -4972 -4714 14905 24551 28779 21492 -6497 -14275 -7214 -2752 -5169 -6731 -12092 -9067
6569i067J1332J3535j680p864j785J4066q924l842q650l261M409J2133p399q23
$$ -9067 2265 15800 14120 6256 4471 18537 9613 5771 -2879 -6140 -1731 10402 3003 2180
6555B180j0546k5530j1280J0154J4940q18k569M73L460J2195K032l945j0327J6110
$$ 2180 -8366 -33896 -45176 -35022 -20082 -20900 -23469 -22996 -19536 -7341 -5309 -9254 -19581 -3471
6541c471J721l29J2206N936J912P826J1601j7874j8767j0626l191L300k09L937
$$ -3471 -1750 -2079 10127 16063 17975 25801 37402 19528 761 -9865 -13056 -9756 -9965 -6028
6527f028J3205l062r474J02O803m53j2758R445P951M981l505j101p655j595j752
$$ -6028 7177 4115 -5359 -5257 1546 1093 -11665 -2220 5731 10712 7207 6106 -1549 -3144 -4896
6512d896O29n745N978O516k97K757N267j865k8393j1474J3458J1157M188J5797
$$ -4896 -4267 -10012 -4034 2482 2185 4942 10209 8344 -20049 -31523 -18065 -6908 -2720 13077
6498A3077n70k018o939J788J3922m022j895J683J492m350p597j9986j757N201
$$ 13077 12507 10489 3550 5338 19260 15238 13343 15026 16518 12168 4571 -15415 -17172 -11971
6484a1971n457Q401R212q596O478J8984j693j411m250J3591k814m456l142l080
$$ -11971 -17428 -9027 185 -8411 -1933 17051 15358 13947 9697 23288 20474 16018 12876 9796
6470I796n301M355J2403M122m529j2935q819P4m155j2947r90R438J2796m65k900
$$ 9796 4495 8850 21253 25375 20846 7911 -908 -834 -4989 -17936 -18926 -9488 3308 2843 -57
6455e7J044j3460j6848j0043J165J7832J3216K796K959N186L0m621m683k696o838
$$ -57 987 -12473 -29321 -39364 -38199 -20367 -7151 -4355 -1396 3790 3820 -801 -5484 -8180 -15018
6440a5018k867r849M040K932L037m079j0348K2545J0788j1652m055P522J303O190
$$ -15018 -17885 -27734 -23694 -20762 -17725 -21804 -32152 -9607 1181 -10471 -14526 -7004 -5701 489
6426D89J611j02M164p598q251m012K618M320J4295J207j0010r321j886k35R913
$$ 489 2100 1998 6162 -1436 -9687 -13699 -11081 -6761 7534 8741 -1269 -10590 -12476 -12711 -2798
6411b798L632J4747J5846k876j5634l938J6013j3732n497p802r79n493R801L788
$$ -2798 834 15581 31427 28551 12917 8979 24992 11260 5763 -2039 -3018 -8511 1290 5078
6397E078r89n825J566o533l301P140N589j1560r505J8814J599j5551J2974l343
$$ 5078 4089 -1736 -170 -6703 -10004 -2864 2725 -8835 -18340 474 2073 -13478 -504 -3847
6383c847O309J0544j3796j98K371K782p701M562l789l011O701J2344j362N055
$$ -3847 2462 13006 -790 -988 1383 4165 -3536 1026 -2763 -5774 927 13271 11909 16964
6369A6964q498o08o583p972K792K1017K4968o433k2086j3908q101O648K0323K471
$$ 16964 8466 7858 1275 -6697 -3905 17112 42080 35647 13561 -347 -8448 -1800 18523 20994
6355B0994j4429j0644k110q87j3722m802K4278K0587J397p570j1941r391q557
$$ 20994 6565 -4079 -6189 -7076 -20798 -25600 -1322 19265 20662 13092 1151 -8240 -16797
6342a6797Q97Q666J961K747k619J4454Q048n247n805k278n775N064N86L771L524
$$ -16797 -15900 -7234 -5273 -2526 -5145 9309 17357 12110 6305 4027 -1748 3316 3902 7673 11197
6327A1197r750m524J9658l659j4420n214Q708R915K929l908k1669r699N607K898
$$ 11197 1447 -3077 16581 12922 -1498 -6712 1996 11911 14840 10932 -10737 -20436 -14829 -11931
6313a1931R023K138r686r062P694q567L250N452p495J966J4693r959j3234l524
$$ -11931 -2908 -770 -10456 -19518 -11824 -20391 -17141 -11689 -19184 -17218 -2525 -12484 -25718 -29242
6299b9242J7664O900O020j071l644q102N61m814q571R782l5m056P839Q351N4Q586
$$ -29242 -11578 -4678 1342 271 -3373 -11475 -10914 -15728 -24299 -14517 -14552 -18608 -10769 -2418 -2364 6222
6283F222M462P036N266j1476O030p569j7317q960J645L032M244j007O027J0128
$$ 6222 10684 17720 22986 11510 17540 9971 -7346 -16306 -14661 -11629 -7385 -8392 -2365 7763
6269G763r733K720P891q500p344J531N411l658r039k027k332M492k332o367R111
$$ 7763 -1970 750 8641 141 -7203 -5672 -261 -3919 -12958 -14985 -17317 -12825 -15157 -21524 -12413
6254a2413N528K549p032n731R554j324k732n36K750P566k45K54L484J744K9J624
$$ -12413 -6885 -4336 -11368 -17099 -7545 -8869 -11601 -12137 -9387 -1821 -2066 -1812 1672 3416 3445 5069
6238E069p670J201O255o134L300P14K11l567q047j429m281j3987k004m835J5177
$$ 5069 -2601 -1400 4855 -1279 2021 2735 2946 -621 -8668 -10097 -14378 -28365 -30369 -35204 -20027
6223b0027L423M213o818r376J0633J2025m756L469J070K140M855N590l014j1892
$$ -20027 -16604 -12391 -19209 -28585 -17952 -5927 -10683 -7214 -6144 -4004 851 6441 3427 -8465
6209h465q496j312Q883O332O831j441N46q1J438Q581o18j1178L315K403o282o593
$$ -8465 -16961 -18273 -9390 -3058 3773 2332 2878 2797 4235 12816 12198 1020 4335 6738 456 -6137
6193f137K936j3016r274J2948p231o635N831M275J3212j945n846O554P36N397
$$ -6137 -3201 -16217 -25491 -12543 -19774 -26409 -20578 -16303 -3091 -5036 -10882 -4328 -3592 1805
6179A805N06j2047m287L856P338j507j1160j0796J1966p739j2081J306K1061J7934
$$ 1805 2311 -9736 -14023 -10167 -2829 -4336 -15496 -26292 -14326 -22065 -34146 -32840 -11779 6155
6165F155r15j5700l013P847J161l156K223m273n214P27j2592l725Q333J648o285
$$ 6155 5240 -10460 -13473 -5626 -4465 -7621 -5398 -9671 -14885 -14158 -26750 -30475 -22142 -20494 -26779
6150b6779J4017m476k424r83J47K0392N550J773N511o310p107K995J1620N088
$$ -26779 -12762 -17238 -19662 -20645 -20498 -106 5444 7217 12728 6418 -689 2306 13926 19014
6136A9014n985j891o427j1853R621L849J835n873m34j1494j4729K218K516R66
$$ 19014 13029 11138 4711 -7142 2479 6328 8163 2290 1856 -9638 -24367 -22149 -19633 -18667
6122a8667J5336J2749j5708j5812M969K1245J854p76M843j7523Q7J7780o237j1969
$$ -18667 -3331 9418 -6290 -22102 -17133 4112 5966 5190 10033 -7490 -7403 10377 4140 -7829
6108g829r946N226J156R942K843P896O236k450j1758J841J729J074l313O239M210
$$ -7829 -17775 -12549 -11393 -1451 1392 9288 15524 13074 1316 3157 4886 5960 2647 8886 13096
6093A3096o183P427J0983m206o164q537R41N854j1242k999j2440L481P496l169
$$ 13096 6913 14340 25323 21117 14953 6416 7357 13211 1969 -1030 -13470 -9989 -2493 -5662
6079e662k885j6554j4965N827P021N078O093q76J7095M372k1442n907M622O524
$$ -5662 -8547 -25101 -40066 -34239 -27218 -22140 -16047 -16923 172 4544 -16898 -22805 -18183 -11659
6065a1659N038N061o09o1M177j780n189M525N384k263o375J410L104J3292O790
$$ -11659 -6621 -1560 -2169 -2230 1947 167 -5022 -497 4887 2624 -3751 -2341 763 14055 20845
6050B0845j3480k0071l64r646J46l592N585J8716J1653o097k1506P119R96l679
$$ 20845 7365 -12706 -13070 -22716 -22570 -26162 -20577 -1861 9792 3695 -17811 -10692 -9696 -13375
6036a3375K962O174r814L705J9976n424j237P15K520k858J268R891L82q286l349
$$ -13375 -10413 -4239 -14053 -10348 9628 4204 2967 3682 6202 3344 4612 14503 14885 6599 3250
6021C250j0267k149l200P844Q62q834o580J2953L284k677J998J5307q444o371
$$ 3250 -7017 -9166 -12366 -4522 -3660 -12494 -19074 -6121 -2837 -5514 -3516 11791 3347 -3024
6007c024J3114J1574p833j1156q727O918O303Q735j621j5582k304P885O721K031
$$ -3024 10090 21664 13831 2675 -6052 866 7169 15904 14283 -1299 -3603 4282 11003 13034
5993A3034m754j4051j2606J244m704Q941m985J239N756j215j692n425m848Q967
$$ 13034 8280 -5771 -18377 -17133 -21837 -12896 -17881 -16642 -10886 -12101 -13793 -19218 -24066 -15099
5979a5099P819l965p453j4952o874J2672P612Q351Q190P449j4807r361j0875m566
$$ -15099 -7280 -11245 -18698 -33650 -40524 -27852 -20240 -11889 -3699 3750 -11057 -20418 -31293 -35859
5965c5859J2298J4708L278N608p230K299L934P320k892p967n445O113K288j2105
$$ -35859 -23561 -8853 -5575 33 -7197 -4898 -964 6356 3464 -4503 -9948 -3835 -1547 -13652
5951a3652J1462J8491R148j78j412j755L868o993j3382j297l472K432j0324K164
$$ -13652 -2190 16301 25449 25271 23859 22104 25972 18979 5597 4300 828 3260 -7064 -4900
5937d900J1841P437j2861m772O028l475p504j4119p774J1637K0688k315n646k331
$$ -4900 6941 14378 1517 -3255 2773 -702 -8206 -22325 -30099 -18462 2226 -89 -5735 -8066
5923h066O470p654n127o360r98m637Q213l055J759J3940N134n750j006L692N771
$$ -8066 -1596 -9250 -14377 -20737 -21735 -26372 -18159 -21214 -19455 -5515 -381 -6131 -7137 -3445 2326
5908B326M643r208o847k455L898J1211m281j1043J1605R293Q555K613k3149j1546
$$ 2326 6969 -2239 -9086 -11541 -7643 3568 -713 -11756 -151 9142 17697 20310 -2839 -14385
5894a4385L361J796m72o779n433J114M292M535J7381J9866l238j8623k588q304
$$ -14385 -11024 -9228 -9700 -16479 -21912 -20798 -16506 -11971 5410 25276 22038 3415 827 -7477
5880g477R073J3944R285K769p901R334n846j1353j2251R308O337L97M929Q298
$$ -7477 1596 15540 24825 27594 19693 29027 23181 11828 -423 8885 15222 15619 20548 28846
5866B8846m435r627j3008o341N747Q832Q010K599r474p539n281R623l013o692
$$ 28846 24411 14784 1776 -4565 1182 10014 18024 20623 11149 3610 -1671 7952 4939 -1753
5852a753n495k481j1214r005J1758J1898K378o819r153R138L719l707K2448P252
$$ -1753 -7248 -9729 -20943 -29948 -18190 -6292 -3914 -10733 -19886 -10748 -7029 -10736 11712 18964
5838A8964j755r927n981J477Q992k128r440N5q397M981J5163O118m489j7130k7
$$ 18964 17209 7282 1301 2778 11770 9642 202 257 -8140 -3159 12004 18122 13633 -3497 -3524
5823c524K86J1987o019n807Q64Q727J0628k149j6150n130L231J3096J325r646
$$ -3524 -3238 8749 2730 -3077 -2213 6514 17142 14993 -1157 -6287 -3056 10040 11365 1719
5809A719J6252O369j2285o668P660O411j6512l070M197J823K576k852l049k92
$$ 1719 17971 24340 12055 5387 13047 19458 2946 -124 4073 5896 8472 5620 2571 2279
5795B279J98J311J2256n999p518o758j2968P318l203j0902J4158q3r437R474J5675
$$ 2279 2477 3788 16044 10045 2527 -4231 -17199 -9881 -13084 -23986 -9828 -9911 -19348 -9874 5801
5780E801j0746j283J0526j121l113j0904L460J9462J3284m490r141p759m542m66
$$ 5801 -4945 -6228 4298 3177 64 -10840 -7380 12082 25366 20876 11735 3976 -566 -1032
5766a032M007J3683N2k905N088q030Q452O395o687p214k0997j4723k469J1284
$$ -1032 2975 16658 16710 13805 18893 10863 19315 25710 19023 11809 -9188 -23911 -26380 -15096
5752a5096L588O90J0686q230k822J2561J316o601L903O218k441p01J734p468j6044
$$ -15096 -11508 -10818 -132 -8362 -11184 1377 2693 -3908 -5 6213 3772 3071 4805 -2663 -18707
5737a8707j2984K0042Q379l877O100M005j0852j140l677n898J7928J3734r354
$$ -18707 -31691 -11649 -3270 -7147 -1047 2958 -7894 -9034 -12711 -18609 -681 13053 3699
5724C699r841l416J626R245N889p923n404K067P322n857Q21J6584N364j5552j9646
$$ 3699 -6142 -9558 -7932 1313 7202 -721 -6125 -4058 3264 -2593 -1772 14812 20176 4624 -15022
5709a5022L587J5407n557m297k420M735m007o907L698j214o12L481N265L334Q197
$$ -15022 -11435 3972 -1585 -5882 -8302 -3567 -7574 -14481 -10783 -11997 -12609 -9128 -3863 -529 7668
5694G668Q306j055j4557k715J4333N531j3282K618p197q878J4767N372l584n116
$$ 7668 15974 14919 362 -2353 11980 17511 4229 6847 -350 -9228 5539 10911 7327 2211
5680B211j2810j0539J5419M135P679j2755m575R465j6801Q751R414j5709n565
$$ 2211 -10599 -21138 -5719 -1584 6095 -6660 -11235 -1770 -18571 -9820 -406 -16115 -21680
5667b1680Q305O261p655j1017k482L078J7425m62n734n112L379J0519K326J4035
$$ -21680 -13375 -7114 -14769 -25786 -28268 -25190 -7765 -8227 -13961 -19073 -15694 -5175 -2849 11186
5653A1186M852Q503J054o190r184k2028j3479L050M646M292K204L168O402n512
$$ 11186 16038 24541 25595 19405 10221 -11807 -25286 -22236 -17590 -13298 -11094 -7926 -1524 -7036
5639g036K147J7232p641J242K263l977o966m73J2391O965j2486r620R654O600
$$ -7036 -4889 12343 4702 5944 8207 4230 -2736 -3209 9182 16147 3661 -5959 3695 10295
5625A0295m406p760o03N677n822j1531R856K240L034l618j4021j4076R993J4869
$$ 10295 5889 -1871 -2474 3203 -2619 -14150 -4294 -2054 980 -2638 -16659 -30735 -20742 -5873
5611e873L782P218L401o62j9017l353J429k87m674K0907Q7j3533J2759P164k0490
$$ -5873 -2091 5127 8528 7866 -11151 -14504 -13075 -13362 -18036 2871 2958 -10575 2184 9348 -11142
5596a1142k63J05K606J1157J6038J0169j6359q259p34K966M318o136M959J0532
$$ -11142 -11405 -11300 -8694 2463 18501 28670 12311 4052 3318 6284 10602 4466 9425 19957
5582A9957J6622j0879n796n845k5916J814O456m135P228K024J850N199p271O455
$$ 19957 36579 25700 19904 14059 -11857 -10043 -3587 -7722 -494 1530 3380 8579 1308 7763
5568G763R531j6471n312K962K076P211o103j4506P348J8461J829p841j9445p10
$$ 7763 17294 823 -4489 -1527 549 7760 1657 -12849 -5501 12960 14789 6948 -12497 -13207
5554a3207q472L818k581J753R447J5002L842L367r975j4525j8549O510N046J5449
$$ -13207 -21679 -17861 -20442 -18689 -9242 5760 9602 12969 2994 -11531 -30080 -23570 -18524 -3075
5540c075N303k94M427O439j285j0432P024p887k127n656n423p557j0879n351L939
$$ -3075 2228 1934 6361 12800 11515 1083 8107 220 -1907 -7563 -12986 -20543 -31422 -36773 -32834
5525c2834J5289n041N511K1294J0029k720j3653n109J327K356L564P496L864j6699
$$ -32834 -17545 -22586 -17075 4219 14248 11528 -2125 -7234 -5907 -3551 13 7509 11373 -5326
5511e326j6304J5531J1628j1922N527R487j1659j3285p35J5491J3466q0K257K289
$$ -5326 -21630 -6099 5529 -6393 -866 8621 -3038 -16323 -17058 -1567 11899 11819 14076 16365
5497A6365n756J493J6155n38j2834j5428p570O749j2561o089Q127M63R364J6943
$$ 16365 10609 12102 28257 27719 14885 -543 -8113 -1364 -13925 -20014 -11887 -11424 -2060 14883
5483A4883k274j3926n619J1618l006r865n084q063K31l127L60L004R799n320M439
$$ 14883 12609 -1317 -6936 4682 1676 -8189 -13273 -21336 -21105 -24232 -23872 -20868 -11069 -16389 -11950
5468a1950Q15q418N776J5752J2102k012J840K604q319j7370Q840L41L214K666
$$ -11950 -11135 -19553 -13777 1975 14077 12065 13905 16509 8190 -9180 -340 1 3215 5881
5454E881k166j323L46N253p189Q335J3071k666r507j2092l476o438J1583k401
$$ 5881 3715 2392 2738 7991 802 9137 22208 19542 10035 -2057 -5533 -11971 -388 -2789
5440b789o715J2805L607k628j1514j3242j4572R701j233O983J2178P602o137j6590
$$ -2789 -9504 3301 6908 4280 -7234 -20476 -35048 -25347 -26580 -19597 -7419 183 -5954 -22544
5426b2544n094M763R420k193o680P810J0026J451j8215k874J9325J1491P225k638
$$ -22544 -27638 -22875 -13455 -15648 -22328 -14518 -4492 -3041 -21256 -24130 -4805 6686 13911 11273
5412A1273j2784j1472r394n662l63J1194K875P94P063Q938k981n461P424k021
$$ 11273 -1511 -12983 -22377 -28039 -28402 -17208 -14333 -13539 -6476 2462 -519 -5980 1444 -577
5398e77m146J2170J0859N896j147J2129n470j648o452o7j969k568K592o174J155
$$ -577 -4723 7447 18306 24202 23055 35184 29714 28066 21614 21547 19578 17010 19602 13428 14583
5383A4583J21p52k397j4649m777j0094K031M121J893l31J762K813J0559J0314
$$ 14583 14704 13952 11555 -3094 -7871 -17965 -15934 -11813 -9920 -10251 -8489 -5676 4883 15197
5369A5197l015m458j5028m764N525J3665J3414j6667r149Q405M619K834l354k961
$$ 15197 12182 7724 -7304 -12068 -6543 7122 20536 3869 -5280 3125 7744 10578 7224 4263
5355D263k695n193N750J4516m432o737j9292j0487j504J3904K2952p414o723J861
$$ 4263 1568 -3625 2125 16641 12209 5472 -13820 -24307 -25811 -11907 11045 3631 -3092 -1231
5341a231j010k599k885j2010J3897J165p784P079R434J118p786J1336N400N892
$$ -1231 -2241 -4840 -7725 -19735 -5838 -4673 -12457 -5378 4056 5174 -2612 8724 14124 20016
5327B0016n864q128o208k774J941m794r085P227M223o934n987N353N367r890o94
$$ 20016 14152 6024 -184 -2958 -1017 -5811 -14896 -7669 -3446 -10380 -16367 -11014 -5647 -15537 -16231
5312a6231J1290p437m131K664M199j0523j443J19J2890J426j0941j2672k0K550
$$ -16231 -4941 -12378 -16509 -13845 -9646 -20169 -21612 -21493 -8603 -7177 -18118 -30790 -30810 -28260
5298b8260J1007K0797J0243k057n155q088R036q064j3252k334M9J117L122j5J1509
$$ -28260 -17253 3544 13787 11730 6575 -1513 7523 -541 -13793 -16127 -16078 -14961 -11839 -11854 -345
5283c45n843j0796j1940m724J2452J3613m195l143J7281l005j2496M87n27M969
$$ -345 -6188 -16984 -28924 -33648 -21196 -7583 -11778 -14921 2360 -645 -13141 -12654 -13181 -8212
5269h212J5683j0884j4703L073r02p89p529k387J9028J6792K356j4806q685k65
$$ -8212 7471 -3413 -18116 -15043 -15945 -16734 -24263 -26650 -7622 9170 11526 -3280 -11965 -12230
5255a2230J1820j573M074j775n066n93r790m208O306K1590J8610k063r448j014
$$ -12230 -410 -1983 2091 316 -4750 -5343 -15133 -19341 -13035 8555 27165 25102 15654 14640
5241A4640N387r10p876r010j1810n278J6873R45q822l8q433J0499K4896P685n138
$$ 14640 20027 19117 11241 2231 -9579 -14857 2016 2961 -5861 -5899 -14332 -3833 21063 28748 23610
5226B3610j7835r992l9M092R609o534p66m913o900k404J830K270j116q078M159
$$ 23610 5775 -4217 -4256 -164 9445 2911 2145 -2768 -9668 -12072 -10242 -7972 -9088 -17166 -13007
5211a3007J4283O2p173R059L817j4398j2574N439l619J0213K334J62J0670L627
$$ -13007 1276 1338 -5835 3224 7041 -7357 -19931 -14492 -18111 -7898 -5564 -5402 5268 8895
5197H895p677r479J0372K658p174L129J654m020j776j326J6694O21m974j0962
$$ 8895 1218 -8261 2111 4769 -2405 724 2378 -1642 -3418 -4744 11950 12571 7597 -3365
5183c365n620J3308j1132k0121r347P611L2614J2547J125p551j502K715L144j2342
$$ -3365 -8985 4323 -6809 -26930 -36277 -28666 3948 16495 17620 10069 8567 11282 14426 2084
5169B084j0370j0495k293M99N724K5417K454k2068p668O16J2991j565j5152P366
$$ 2084 -8286 -18781 -21074 -20575 -14851 10566 13020 -9048 -16716 -16100 -3109 -4674 -19826 -12460
5155a2460J0704j1406K606J4331j913j8129l541o319q8K656R741Q724o821p203
$$ -12460 -1756 -13162 -10556 3775 1862 -16267 -19808 -26127 -26215 -23559 -13818 -5094 -11915 -19118
5141a9118J0239n637k876P267P22L20p257m810m63L728O212Q950K754J255P179
$$ -19118 -8879 -14516 -17392 -10125 -9403 -9083 -16340 -21150 -21613 -17885 -11673 -2723 31 1286 8465
5126H465n905r843n070k0220O072M027O689J2002K885l562j0046p191O695J153
$$ 8465 2560 -7283 -12353 -32573 -26501 -22474 -15785 -3783 -898 -4460 -14506 -21697 -15002 -13849
5112a3849k639M36J0031P706j056J1708L91j1191R720O169P077o396m587r66l031
$$ -13849 -16488 -16052 -6021 1685 629 12337 12728 1537 11257 17426 24503 18107 13520 12554 9523
5097I523n435j464k438k331M038K644o040J3038l853j6532N368q054l403J6159
$$ 9523 4088 2624 186 -2145 1893 4537 -1503 11535 7682 -8850 -3482 -11536 -14939 1220
5083A220K2079m802p513j240p184l996m539M034K326J1603J6441n551J234j3455
$$ 1220 23299 18497 10984 9744 2560 -1436 -5975 -1941 385 11988 28429 22878 24112 10657
5069A0657n406o491q904m33L432r491q277R962J7229P475N417j1388j15J938k702
$$ 10657 5251 -1240 -10144 -10577 -7145 -16636 -24913 -14951 2278 9753 15170 3782 3667 5605 2903
5054B903L414m16J0161J2674k3496q426p519L473J199Q871J1732j1650k978l625
$$ 2903 6317 5901 16062 28736 5240 -3186 -10705 -7232 -6033 2838 14570 2920 -58 -3683
5040c683j683R265O413j5060r377k390R707J2786q587m55M587m934l839J198q06
$$ -3683 -5366 3899 10312 -4748 -14125 -16515 -6808 5978 -2609 -3064 1523 -3411 -7250 -6052 -6858
5025f858m8q609L374j880P261J226o355p948l273J6203M958r677j261q486J644
$$ -6858 -6906 -15515 -12141 -14021 -6760 -5534 -11889 -19837 -23110 -6907 -1949 -11626 -12887 -21373 -19729
5010a9729R815J2016N105r848l203r136J793L284j1766J789J6437N840J4021J2199
$$ -19729 -9914 2102 7207 -2641 -5844 -14980 -13187 -9903 -21669 -19880 -3443 2397 16418 28617
4996B8617p765q728m432P459j0225j6892m889N179k149J286J7974q298n822p843
$$ 28617 20852 12124 7692 15151 4926 -11966 -16855 -11676 -13825 -12539 5435 -2863 -8685 -16528
4982a6528r097n738J1305N540j355j45J2264J1425Q586l077q285j668m602Q957
$$ -16528 -25625 -31363 -20058 -14518 -15873 -16018 -3754 7671 16257 13180 4895 3227 -1375 7582
4968G582j0615j0161J1637J0832M75k250j5296r809M60J5874J4832L940P006m479
$$ 7582 -3033 -13194 -1557 9275 9750 7500 -7796 -17605 -17145 -1271 13561 17501 24507 20028
4954B0028r348j6569o89J0164n274j8316j105J7655N972J579M449J228l818R07
$$ 20028 10680 -5889 -6578 3586 -1688 -20004 -21109 -3454 2518 4097 8546 9774 5956 6863
4940F863N511j0091j2710J8985Q775o333j340j4428j6872J0370J741J340L114
$$ 6863 12374 2283 -10427 8558 17333 11000 9660 -4768 -21640 -11270 -9529 -8189 -5075
4927e075L796N157o431p819q043J7917R632J0587n655n289J1206l713j610j614
$$ -5075 -1279 3878 -2553 -10372 -18415 -498 9134 19721 14066 8777 19983 16270 14660 13046
4913A3046l709q618j9525r21R077q852n6J3767J9105n8j9454O49m42O707r389
$$ 13046 9337 719 -18806 -19727 -10650 -19502 -19558 -5791 13314 13256 -6198 -5549 -5991 716 -8673
4898h673p579j126k442J007K050l686l262J3982R828J7407p544j4895L712j2349
$$ -8673 -16252 -17378 -19820 -18813 -16763 -20449 -23711 -9729 99 17506 9962 -4933 -1221 -13570
4884a3570l130k528K452J153L456J8087j082m902k074r51J2806l136k697m928
$$ -13570 -16700 -19228 -16776 -15623 -12167 5920 4838 -64 -2138 -3089 9717 6581 3884 -1044
4870a044L442K219j2490j2005L908N624o461J611m561L256J4551Q604N513o131
$$ -1044 2398 4617 -7873 -19878 -15970 -10346 -16807 -15196 -19757 -16501 -1950 6654 12167 6036
4856F036K059j4285j4503l859Q63l783J1877P333N515o719j2674P340R196N084
$$ 6036 8095 -6190 -20693 -24552 -23689 -27472 -15595 -8262 -2747 -9466 -22140 -14800 -5604 -520
4842e20o646L360J32q04j696J3521N400N795j409k6O898Q234o297j7533j206K698
$$ -520 -7166 -3806 -3674 -4478 -6174 7347 12747 18542 17133 17107 24005 32239 25942 8409 7203 9901
4826I901L552K330o365j3945J2795k614R771K271p790o036R49o683N905J5077
$$ 9901 13453 15783 9418 -4527 8268 5654 15425 17696 9906 3870 4819 -1864 4041 19118
4812A9118M911o896n834o91n119K281j08r922k473l529o653l145R90J9827l146
$$ 19118 24029 17133 11299 10608 5489 7770 7662 -2260 -4733 -8262 -14915 -18060 -17070 2757 -389
4797c89j0507l068Q55K260J0585l808L861K63L453R652n925l965n9J73j5687L905
$$ -389 -10896 -13964 -13109 -10849 -264 -4072 -211 52 3505 13157 7232 3267 3208 3381 -12306 -8401
4781h401J8172j43j9426J3285Q045j4947j5502J064j126N50P733O535K0403M254
$$ -8401 9771 9628 -9798 3487 11532 -3415 -18917 -17853 -18979 -18429 -10696 -4161 16242 20496
4767B0496j8027r128M459K849P329n134k542j2956n369P087J0862M22l01m512
$$ 20496 2469 -6659 -2200 649 7978 2844 302 -12654 -18023 -10936 -74 348 47 -4465
4753d465q67J169J794K504o431n671P346L801J0710N759l404j0809n071J3613
$$ -4465 -5332 -4163 -2369 135 -6296 -11967 -4621 -820 9890 15649 12245 1436 -3635 9978
4739I978K684Q78r954n575p50N825J2564l945j2604k861K7054M62j4036M994J845
$$ 9978 12662 13540 3586 -1989 -2739 3086 15650 11705 -899 -3760 23294 23756 9720 14714 16559
4724A6559n155r090l137m625k394l863L941o068J429K0827Q178J649j3453j5948
$$ 16559 11404 2314 -823 -5448 -7842 -11705 -7764 -13832 -12403 8424 16602 18251 4798 -11150
4710a1150J3588k957j0152l561J594m41n711N863J4934L032L500R966p661r391
$$ -11150 2438 -519 -10671 -14232 -12638 -13079 -18790 -12927 2007 5039 8539 18505 10844 1453
4696A453n868j9318N177L240K056O042R61j589J0949L725m646M04N665J48j4663
$$ 1453 -4415 -23733 -18556 -15316 -13260 -7218 -6257 -7846 3103 6828 2182 2586 8251 8399 -6264
4681f264k1798J385M382r4J4289J1971K200J3363R55j2041j8212j1681O872J3816
$$ -6264 -28062 -26677 -22295 -22389 -8100 3871 6071 19434 20389 8348 -9864 -21545 -14673 -857
4667h57N384J461r444m130M128l290P85J67m845o133N239J6555N617q772j3304
$$ -857 4527 5988 -3456 -7586 -3458 -6748 -5963 -5796 -10641 -16774 -11535 5020 10637 1865 -11439
4652a1439R460L316J814Q93J923R363k033n505L134O709R705q676o379j1019j49
$$ -11439 -1979 1337 3151 4044 5967 15330 13297 7792 10926 17635 27340 18664 12285 1266 1117
4637A117K730j0M700J790P429L672L198k128o989l235J889j298J185M589o003
$$ 1117 3847 3837 8537 10327 17756 21428 24626 22498 15509 12274 14163 12865 14050 18639 12636
4622A2636k528q51O043J9858J458j7259k312J322j3420n690L246J1009o696m169
$$ 12636 10108 9257 15300 35158 36616 19357 17045 18367 4947 -743 2503 13512 6816 2647
4608B647Q408n427J56O453m022p868m465j0738n27M440J037M224L851r376J719
$$ 2647 11055 5628 5784 12237 8215 347 -4118 -14856 -15383 -10943 -9906 -5682 -1831 -11207 -9488
4593i488k179r675q117M738j309l764O608J7942K801P61j544l300J786J2963m085
$$ -9488 -11667 -21342 -29459 -24721 -26030 -29794 -23186 -5244 -2443 -1682 -3226 -6526 -4740 8223 4138
4578D138j2144r070j577L017K345p541P093R447r282l279m073M96O367K924k144
$$ 4138 -8006 -17076 -18653 -15636 -13291 -20832 -13739 -4292 -13574 -16853 -20926 -20430 -14063 -11139 -13283
4563a3283O426K431j0071Q063Q294r465m320l682m269J4603r984j0848R926J6855
$$ -13283 -6857 -4426 -14497 -6434 1860 -7605 -11925 -15607 -19876 -5273 -15257 -26105 -16179 676
4549F76J8222o804j9215q655M82J4486m330J297M747Q115J0800j111j5020r256
$$ 676 18898 12094 -7121 -15776 -15294 -808 -5138 -3841 906 9021 19821 18710 3690 -5566
4535e566K716n016O499J8775J0252p636K72l213r711k61j3311m604P129q57n116
$$ -5566 -2850 -7866 -1367 17408 27660 20024 20296 17083 7372 7111 -6200 -10804 -3675 -4532 -9648
4520i648Q713R331P642j968j7851p69o975M622O938n847M485K188j4800n316K482
$$ -9648 -935 8396 16038 14070 -3781 -4550 -11525 -6903 35 -5812 -1327 861 -13939 -19255 -16773
4505a6773N649L30k880K999J8307j0865k074R389n378j5380N612Q567r21j1393
$$ -16773 -11124 -10794 -13674 -10675 7632 -3233 -5307 4082 -1296 -16676 -11064 -2497 -3418 -14811
4491a4811O357J9570j737j4230j6551n943R031N497R464O417p132k601Q19m762
$$ -14811 -8454 11116 9379 -4851 -21402 -27345 -18314 -12817 -3353 3064 -4068 -6669 -5850 -10612
4477a0612m14L516r035j678Q800m77P135K11J5690J744O429r747j5891j2486o854
$$ -10612 -11026 -7510 -16545 -18223 -9423 -9900 -2765 -2554 13136 14880 21309 11562 -4329 -16815 -23669
4462b3669O70J0415L368M964J9200m422j5226K885J8017M516n45k198J381J786
$$ -23669 -22999 -12584 -9216 -4252 14948 10526 -4700 -1815 16202 20718 20173 17975 19356 21142
4448B1142o479j4436j7865O091J8779m018n387O701k094M293K579q687j0729K956
$$ 21142 14663 227 -17638 -11547 7232 3214 -2173 4528 2434 6727 9306 619 -10110 -7154
4434g154N002R106j984p783k355o735J6602J832R298j0410j0182K767M316l270
$$ -7154 -2152 6954 4970 -2813 -5168 -11903 4699 6531 15829 5419 -4763 -1996 2320 -950
4420i50q695N382j410Q517n590o421M336K6322m723j9466p018Q169P194q062r303
$$ -950 -9645 -4263 -5673 2844 -2746 -9167 -4831 21491 16768 -2698 -9716 -1547 5647 -2415 -11718
4405a1718M329n756q004J2667m735o850N050N387m579K487p41l626J459l160P09
$$ -11718 -7389 -13145 -21149 -8482 -13217 -20067 -15017 -9630 -14209 -11722 -12463 -16089 -14630 -17790 -17081
4390a7081J63M082n42O412J0420J6874N246o309L05j1780j5683O993Q936l384
$$ -17081 -16918 -12836 -13378 -6966 3454 20328 25574 19265 19570 7790 -7893 -900 8036 4652
4376D652q176k773j577O980K299Q84j258m229J906Q975K770r422p102J650l717
$$ 4652 -3524 -6297 -7874 -894 1405 2289 1031 -3198 -1292 7683 10453 1031 -6071 -4421 -8138
4361h138L879R222k306Q549P199N927J038j2472j5363J765R532m358j0032O627
$$ -8138 -4259 4963 2657 11206 18405 24332 25370 12898 -2465 -700 8832 4474 -5558 1069
4347A069R61j87L194N679j955r203o39K302p347K467O164Q560j767Q084j511j7877
$$ 1069 2030 1843 5037 10716 8761 -442 -1081 1221 -6126 -3659 2505 11065 9298 17382 15871 -2006
4331b006O95n576J3090J1158q975j0840Q100J0312K340j6105q559M676O135j562
$$ -2006 -1311 -6887 6203 17361 8386 -2454 5646 15958 18298 2193 -6366 -1690 4445 2883
4317B883M9o788m147Q794M232k172j1487j4600L493j6849P023K7935N157mo95
$$ 2883 2932 -3856 -8003 791 5023 2851 -8636 -23236 -19743 -36592 -29569 -1634 3523 3519 2824
4302B824j633R970J2203O759m53j4997n565j3799m326K796L394J82k30L840J0715
$$ 2824 1191 11161 23364 30123 29670 14673 9108 -4691 -9017 -6221 -2827 -2645 -2875 965 11680
4287A1680j785j4367j1144J3935K162r195q999m257K665J0388q177l8J6798J9399
$$ 11680 9895 -4472 -15616 -1681 481 -8714 -17713 -21970 -19305 -8917 -17094 -17132 -334 19065
4273A9065R692o260l17j1035O609k599j5399k491o6J922K596j019j609l021J3072
$$ 19065 28757 22497 22180 11145 17754 15155 -244 -2735 -2801 -879 1717 698 -911 -3932 9140
4258I140M954j9140N169J1737R701m52j6062J0575M230o666M171n391L015K8j1639
$$ 9140 14094 -5046 123 11860 21561 21109 5047 15622 19852 13186 17357 11966 14981 15009 3370
4243C370l956j1343k896J3481R507N183O872n276O725q824j1230l643k603L223
$$ 3370 -586 -11929 -14825 -1344 8163 13346 20218 14942 21667 12843 1613 -2030 -4633 -1410
4229a410j633n144k695j477p94O016q37j259p376L79J159J5737R960J572j1390
$$ -1410 -3043 -8187 -10882 -12359 -13153 -7137 -7974 -9233 -16609 -16230 -15071 666 10626 12198 808
4214H08r2K561k898n005o771j0837k855N482Q071J6520O985q768M66P186q915
$$ 808 716 3277 379 -4626 -11397 -22234 -25089 -19607 -11536 4984 11969 3201 3667 10853 1938
4199A938o620j5656R316J7148L09m241J5453j2404q307Q203R768J3694r637o225
$$ 1938 -4682 -20338 -11022 6126 6435 2194 17647 5243 -3064 5139 14907 28601 18964 12739
4185A2739N813N158k625P280M073j3837j7378n200J0509k159L963m04m006m906
$$ 12739 18552 23710 21085 28365 32438 18601 1223 -3977 6532 4373 8336 7932 3926 -980
4171i80n352j6837n558K2652J7249N437j4261r311J3206J0708m280j5789J412
$$ -980 -6332 -23169 -28727 -6075 11174 16611 2350 -6961 6245 16953 12673 -3116 -1704
4158a704L449k682o069Q329j0288n255K4143N443j0470k605Q149p355k732k2578
$$ -1704 1745 -937 -7006 1323 -8965 -14220 9923 15366 4896 2291 10440 3085 353 -22225
4144b2225P575J2260J1264o3q501j684J3056K012o027l350m402p72n338l698N641
$$ -22225 -14650 -2390 8874 8811 310 -1374 11682 13694 7667 4317 -85 -857 -6195 -9893 -4252
4129d252J3278n005k0633k827J0878L627L20K866p710J0042J3536j1478l968M587
$$ -4252 9026 4021 -16612 -19439 -8561 -4934 -4614 -1748 -9458 584 14120 2642 -1326 3261
4115C261K847q113j4406m759J1968J3422r862Q566n333J300Q86J714Q84L877J1020
$$ 3261 6108 -2005 -16411 -21170 -9202 4220 -5642 2924 -2409 -1109 -223 1491 2375 6252 17272
4100A7272m18l833k1192o102j492P548j012q674R495J2416m519N104P443q191
$$ 17272 16854 13021 -8171 -14273 -15765 -8217 -9229 -17903 -8408 4008 -511 4593 12036 3845
4086C845j826p446N80m413j5783L337K106J1021q614L275K723O464Q947J6618
$$ 3845 2019 -5427 -4847 -9260 -25043 -21706 -19600 -8579 -17193 -13918 -11195 -4731 4216 20834
4072B0834m835n040m950r895j705M063J0093M601j4107j6576K789J2584Q70n677
$$ 20834 15999 10959 6009 -3886 -5591 -1528 8565 13166 -941 -17517 -14728 -2144 -1274 -6951
4058f951l514j673q13J0654J1471J2468O85J508j1866j7456o628r76R869M102
$$ -6951 -10465 -12138 -12951 -2297 9174 21642 22327 23835 11969 -5487 -12115 -13091 -3222 880
4044H80J4595k976k891q785k862p105o178L510K2201j366j0365O850j222j2835
$$ 880 15475 12499 9608 823 -2039 -9144 -15322 -11812 10389 9023 -1342 5508 4286 -8549
4030h549o734J1600J2312Q232M925j191J3441J1782K310j4107j9467j0883j1808
$$ -8549 -15283 -3683 8629 16861 21786 20595 34036 45818 48128 34021 14554 3671 -8137
4017h137j3570J5105P786Q20r472n413m149N479j0226k316J2363J8809N766j0516
$$ -8137 -21707 -6602 1184 2004 -7468 -12881 -17030 -11551 -21777 -24093 -11730 7079 12845 2329
4003B329l036N389j1711M204r6m200p17Q773n84j1689n163O293P131Q363N719
$$ 2329 -707 4682 -7029 -2825 -2921 -7121 -7838 935 351 -11338 -16501 -10208 -3077 5286 11005
3988A1005K426n580j1950q533M678k263k78q657q200P850J2888R415q005q594
$$ 11005 13431 7851 -4099 -12632 -7954 -10217 -10495 -19152 -27352 -19502 -6614 2801 -5204 -13798
3974a3798j2997L816J3901K1998P552o605L179J287l871m150n415j2139N081J7373
$$ -13798 -26795 -22979 -9078 12920 20472 13867 17046 18333 14462 10312 4897 -7242 -2161 15212
3960A5212p34j562J0145l735n171M281j6721j0434j2139m619J1576J796K592j3711
$$ 15212 14478 12916 23061 19326 14155 18436 1715 -8719 -20858 -25477 -13901 -12105 -9513 -23224
3946b3224N621J6241M425j160j0560J384k327l8M625o045n196O729P412J0667
$$ -23224 -17603 -1362 3063 1903 -8657 -7273 -9600 -9638 -5013 -11058 -16254 -9525 -2113 8554
3932H554K146o722p99o109J4252R099J43o067j938R630k121p985j4602q440n713
$$ 8554 10700 3978 3179 -2930 11322 20421 20564 14497 12559 22189 20068 12083 -2519 -10959 -16672
3917a6672J0702j708L345p632M237Q672R934j0449o717j6205p325P107p21L042
$$ -16672 -5970 -7678 -4333 -11965 -7728 944 10878 429 -6288 -22493 -29818 -22711 -23432 -20390
3903b0390n526J2320P373J907p70M507o104Q427q750j0692J296J1925P489P605
$$ -20390 -25916 -13596 -6223 -4316 -5086 -579 -6683 1744 -7006 -17698 -16402 -4477 3012 10617
3889A0617L367m58p814R89k891K521j3740j892Q707j493r121k829N097j1024j645
$$ 10617 13984 13526 5712 6701 3810 6331 -7409 -9301 -594 -2087 -11208 -14037 -8940 -19964 -21609
3874b1609J0209M771Q066M042r528J870R112O293O290O557j0545k916p955n158
$$ -21609 -11400 -6629 1437 5479 -4049 -2179 6933 13226 19516 26073 15528 12612 4657 -501
3860e01R941k290k215p108m198O314K049n720Q652K0321m644j7808m461j0281
$$ -501 9440 7150 4935 -2173 -6371 -57 1992 -3728 4924 25245 20601 2793 -1668 -11949
3846a1949l798P063J583q506J2498K136p221l734j988N718N69P089L364j6021
$$ -11949 -15747 -8684 -7101 -15607 -3109 -973 -8194 -11928 -13916 -8198 -7629 -540 2824 -13197
$$ [...]
##END NTUPLES=NMR SPECTRUM
##END=
