##TITLE=Analysis number 315378
Compound Code cc 49804
Book Reference 382/138/1
Project Code adrs
Chemist Name simons
##JCAMPDX= 6.0         $$ Bruker NMR JCAMP-DX V2.0
##DATA TYPE= NMR SPECTRUM
##DATA CLASS= NTUPLES
##ORIGIN= Bruker BioSpin GmbH
##OWNER= NMR
$$ XWIN-NMR		Version 3.5
$$ Thu Nov 17 09:08:17 2005 GMT Standard Time (UT+0h)  MAYBRIDGE\NMR@NMR_250MHZ
##.OBSERVE FREQUENCY= 250.131544655141
##.OBSERVE NUCLEUS= ^1H
##.ACQUISITION MODE= SIMULTANEOUS (DQD)
##.ACQUISITION SCHEME= undefined
##.AVERAGES= 16
##.DIGITISER RES= 18
##SPECTROMETER/DATA SYSTEM= dpx250
##.PULSE SEQUENCE= zg30
##.SOLVENT NAME= CDCl3
##.SHIFT REFERENCE= (INTERNAL, CDCl3, 0, 16.522)
##AUDIT TRAIL= $$ (NUMBER, WHEN, WHO, WHERE, WHAT)
$$ ##TITLE= Audit trail, XWIN-NMR		Version 3.5
$$ ##JCAMPDX= 5.01
$$ ##ORIGIN= Bruker BioSpin GmbH
$$ ##OWNER= NMR
$$ C:\u/data/dgb/nmr/ADRS/12530/pdata/1/auditp.txt
$$ ##AUDIT TRAIL=  $$ (NUMBER, WHEN, WHO, WHERE, WHAT)
(   1,<2005-11-17 09:07:55.10 +000>,<MAYBRIDGE\NMR>,<NMR_250MHZ>,
      <created by zg, POWCHK disabled, PULCHK disabled
       configuration hash MD5:
       62 19 C7 07 E1 42 D1 B7 37 6C 3D D0 77 39 F9 E6
       data hash MD5: 64K
       64 D0 6B BB B0 BE A1 97 DD 6F B1 60 BF FA 5C 4A>)
(   2,<2005-11-17 09:08:07.10 +000>,<MAYBRIDGE\NMR>,<NMR_250MHZ>,
      <Start of raw data processing
       ef LB = 0.3 FT_mod = 6 PKNL = 1 SI = 32K 
       data hash MD5: 32K
       C0 45 0C 47 DC A9 EF 5F 27 53 A8 1C C6 1C A9 30>)
(   3,<2005-11-17 09:08:09.00 +000>,<MAYBRIDGE\NMR>,<NMR_250MHZ>,
      <apk 
       data hash MD5: 32K
       DA 1E 3C 9A B3 C4 A5 61 6B DE DD 0C 9E DF A1 D1>)
(   4,<2005-11-17 09:08:09.73 +000>,<MAYBRIDGE\NMR>,<NMR_250MHZ>,
      <abs ABSG = 5 
       data hash MD5: 32K
       49 00 16 70 5D B5 05 FD 91 D4 D9 7C 6F E9 0A FA>)
$$ ##END=
$$ 
$$ hash MD5
$$ 19 53 2E 6A 88 B3 05 A5 E5 77 66 06 14 EA F1 34
##$RELAX= 
##$RELAX= 
##$RELAX= 
##$RELAX= 
##$RELAX= 
##$RELAX= 
##$RELAX= 
$$ Bruker specific parameters
$$ --------------------------
##$DU= <C:\u>
##$EXPNO= 12530
##$NAME= <ADRS>
##$PROCNO= 1
##$TYPE= <nmr>
##$USER= <dgb>
##$AMP= (0..31)
100 100 100 100 100 100 100 100 100 100 100 100 100 100 100 100 100 100 
100 100 100 100 100 100 100 100 100 100 100 100 100 100 
##$AQSEQ= 0
##$AQ_mod= 3
##$AUNM= <au_zg>
##$AUTOPOS= <3 >
##$BF1= 250.13
##$BF2= 250.13
##$BF3= 250.13
##$BF4= 250.13
##$BF5= 500.13
##$BF6= 500.13
##$BF7= 500.13
##$BF8= 500.13
##$BYTORDA= 1
##$CFDGTYP= 0
##$CFRGTYP= 5
##$CHEMSTR= <none>
##$CNST= (0..31)
1 1 145 1 1 1 1 1 1 1 1 1 1 1 1 1 1 1 1 1 1 1 1 1 1 1 1 1 1 1 1 1 
##$CPDPRG= <>
##$CPDPRG1= <>
##$CPDPRG2= <>
##$CPDPRG3= <>
##$CPDPRG4= <mlev>
##$CPDPRG5= <mlev>
##$CPDPRG6= <mlev>
##$CPDPRG7= <mlev>
##$CPDPRG8= <mlev>
##$CPDPRGB= <>
##$CPDPRGT= <>
##$D= (0..31)
0 1 0 0 0 0 0 0 0 0.06 0 0 0 0 0 0 0.0002 0 0 0 0 0 0 0 0 0 0 0 0 0 0 
0 
##$DATE= 1132218473
##$DBL= (0..7)
120 120 120 120 120 120 120 120 
##$DBP= (0..7)
150 150 150 150 150 150 150 150 
##$DBP07= 0
##$DBPNAM0= <>
##$DBPNAM1= <>
$$ [...]
##$SUBNAM7= <"">
##$SUBNAM8= <"">
##$SUBNAM9= <"">
##$SW= 20.6930455092707
##$SWIBOX= (0..15)
0 0 3 0 0 0 0 0 0 0 0 0 0 0 0 0 
##$SW_h= 5175.983436853
##$TD= 65536
##$TD0= 1
##$TE= 294.16
##$TE2= 300
##$TE3= 300
##$TEG= 300
##$TL= (0..7)
0 120 120 120 120 120 120 120 
##$TP= (0..7)
150 150 150 150 150 150 150 150 
##$TP07= 0
##$TPNAME0= <>
##$TPNAME1= <>
##$TPNAME2= <>
##$TPNAME3= <>
##$TPNAME4= <>
##$TPNAME5= <>
##$TPNAME6= <>
##$TPNAME7= <>
##$TPOAL= (0..7)
0.5 0.5 0.5 0.5 0.5 0.5 0.5 0.5 
##$TPOFFS= (0..7)
0 0 0 0 0 0 0 0 
##$TUNHIN= 0
##$TUNHOUT= 0
##$TUNXOUT= 0
##$USERA1= <user>
##$USERA2= <user>
##$USERA3= <user>
##$USERA4= <user>
##$USERA5= <user>
##$V9= 5
##$VALIST= <valist>
##$VCLIST= <CCCCCCCCCCCCCCC>
##$VD= 0
##$VDLIST= <DDDDDDDDDDDDDDD>
##$VPLIST= <PPPPPPPPPPPPPPP>
##$VTLIST= <TTTTTTTTTTTTTTT>
##$WBST= 1024
##$WBSW= 4
##$XGAIN= (0..3)
0 0 0 0 
##$XL= 0
##$YL= 0
##$YMAX_a= 590251
##$YMIN_a= -580135
##$ZGOPTNS= <>
##$ZL1= 120
##$ZL2= 120
##$ZL3= 120
##$ZL4= 120
##$ABSF1= 16.522
##$ABSF2= -4.171173
##$ABSG= 5
##$ABSL= 3
##$ALPHA= 0
##$AQORDER= 0
##$ASSFAC= 0
##$ASSFACI= 0
##$ASSFACX= 0
##$ASSWID= 0
##$AUNMP= <proc_1d>
##$AZFE= 0.1
##$AZFW= 0.1
##$BCFW= 0
##$BC_mod= 0
##$BYTORDP= 0
##$COROFFS= 0
##$CY= 12.5
##$DATMOD= 1
##$DC= 0
##$DFILT= <>
##$DTYPP= 0
##$F1P= 14.0000005364418
##$F2P= -0.99999901652339
##$FCOR= 0.5
##$FTSIZE= 32768
##$FT_mod= 6
##$GAMMA= 0
##$GB= 0
##$INTBC= 1
##$INTSCL= 1
##$ISEN= 128
##$LB= 0.3
##$LEV0= 0
##$LPBIN= 0
##$MAXI= 10000
##$MC2= 0
##$MEAN= 0
##$ME_mod= 0
##$MI= 0
##$NCOEF= 0
##$NC_proc= -2
##$NLEV= 6
##$NOISF1= 0
##$NOISF2= 0
##$NSP= 0
##$NTH_PI= 0
##$NZP= 0
##$OFFSET= 16.522
##$PC= 1
##$PHC0= 83.1207
##$PHC1= 4.553776
##$PH_mod= 1
##$PKNL= yes
##$PPARMOD= 0
##$PSCAL= 4
##$PSIGN= 0
##$REVERSE= no
##$SF= 250.13
##$SI= 32768
##$SIGF1= 0
##$SIGF2= 0
##$SINO= 400
##$SIOLD= 32768
##$SREGLST= <1H.CDCl3>
##$SSB= 0
##$STSI= 32768
##$STSR= 0
##$SW_p= 5175.98343685301
##$SYMM= 0
##$S_DEV= 0
##$TDeff= 65536
##$TDoff= 0
##$TI= <Analysis number 999999
Compound Code 99
Book Reference 9
Project Code 9>
##$TILT= no
##$TM1= 0
##$TM2= 0
##$TOPLEV= 0
##$USERP1= <user>
##$USERP2= <user>
##$USERP3= <user>
##$USERP4= <user>
##$USERP5= <user>
##$WDW= 1
##$XDIM= 32768
##$YMAX_p= 349520298
##$YMIN_p= -462947
$$ End of Bruker specific parameters
$$ ---------------------------------
##NTUPLES= NMR SPECTRUM
##VAR_NAME=  FREQUENCY,     SPECTRUM/REAL,   SPECTRUM/IMAG
##SYMBOL=    X,             R,               I
##VAR_TYPE=  INDEPENDENT,   DEPENDENT,       DEPENDENT
##VAR_FORM=  AFFN,          ASDF,            ASDF
##VAR_DIM=   32768,         32768,           32768
##UNITS=     HZ,            ARBITRARY UNITS, ARBITRARY UNITS
##FACTOR=    0.157963299565203, 1,           1
##FIRST=     4132.6476996994, 0,             0
##LAST=      -1043.33573715361, 0,           0
##MIN=       -1043.33573715361, -462947,     0
##MAX=       4132.6476996994, 349520298,     0
$$ Real data points
##PAGE= N=1
##DATA TABLE= (X++(R..R)), XYDATA
$$ [...]
##PAGE= N=2
##DATA TABLE= (X++(I..I)), XYDATA
$$ plain form
27768 434316 428781 427451 429133 433770 445067 451691 447902 455399 466126 466460 453517 436043 426895
27755 426895 423763 423426 421059 418722 424130 429032 427041 428604 423106 432313 438531 429339 420757 419769 420121
27740 420121 414693 415776 421095 414449 419551 420369 433207 441794 439484 443739 439574 432623 434722 440144
27726 440144 446929 446717 444039 435772 434444 441242 440055 436122 437620 429090 435296 444438 443635 452112 445418
27711 445418 443491 440394 437818 431600 428222 432881 436424 445201 449602 444225 444425 453360 459942 457362
27697 457362 448305 432678 428144 431508 438389 433463 431920 437039 438649 434680 427213 444375 458334
27684 458334 443629 427184 417076 425457 432732 438104 440091 444439 444726 436005 435293 445291 454903 440331
27670 440331 438855 448104 447077 440282 432712 424880 419954 424541 422596 415926 422054 437552 432621 440738
$$ packed form
27768D34316n535j330J682M637J1297O624l789P497J0727L34j2943j7474r148
27755D26895l132l37k367k337N408M902j991J563n498R207O218r192q582r88L52
27740D20121n428J083N319o646N102Q18J2838Q587k310M255m165o951K099N422
27726D40144O785k12k678q267j328O798j187l933J498q530O206R142q03Q477o694
27711D45418j927l097k576o218l378M659L543Q777M401n377K00Q935O582k580
27697D57362r057j5627m534L364O881m926j543N119J610l969p467J7162J3959
27684D58334j4705j6445j0108Q381P275N372J987M348K87q721p12R998R612j4572
27670D40331j476R249j027o795p570p832m926M587j945o670O128J5498m931Q117
$$ plain form
27656 440738 448657 450211 452855 452096 448194 446034 441703 437011 441990 433135 428648 441268 452646 458032
27642 458032 458090 458980 453059 442113 436092 445276 445252 450154 447422 451963 458680 464316 461949 448953 452796
27627 452796 471412 471652 462820 456541 456440 448267 437831 446691 450581 443622 453282 466159 461556 459164
27613 459164 454966 447166 442769 435855 445247 451914 450911 447010 460616 474214 458923 448384 453684
27600 453684 464522 462894 461623 465165 462578 456218 449183 442837 438331 429802 432013 441230 438766 429996
27586 429996 431761 441877 439447 438809 433878 443541 451502 435534 436799 446258 445191 443238 445509 446801
27572 446801 447860 441733 447758 442224 440374 442514 440611 443891 445678 462690 470503 458572 450028 429769
27558 429769 431062 441700 441737 441079 432452 428379 431648 442774 444672 449450 448197 445854 440017 440134 447447
$$ packed form
27656D40738P919J554K644p59l902k160m331m692M979q855m487J2620J1378N386
27642D58032N8Q90n921j0946o021R184k4M902k732M541O717N636k367j2996L843
27627D52796J8616K40q832o279j01q173j0436Q860L890o959R660J2877m603k392
27613D59164m198p800m397o914R392O667j003l901J3606J3598j5291j0539N300
27600D53684J0838j628j271L542k587o360p035o346m506q529K211R217k464q770
27586D29996J765J0116k430o38m931R663P961j5968J265R459j067j953K271J292
27572D46801J059o127O025n534j850K140j903L280J787J7012P813j1931q544k0259
27558D29769J293J0638L7o58q627m073L269J1126J898M778j253k343n837J17P313
$$ plain form
27543 447447 456914 457154 454667 454714 450837 440743 447207 448572 452708 446666 443388 451176 452819 452015 456663
27528 456663 457071 450963 439612 441387 445309 453852 468682 464400 464820 455121 448274 456150 456972 454793
27514 454793 455083 448599 435369 442901 445587 439497 430794 442100 455571 459190 456910 457865 453618 463944
27500 463944 459229 456147 448983 444707 437967 444332 439298 432625 432491 446414 460201 462989 462450 467688
27486 467688 467384 463525 461162 455116 441980 440398 448546 464837 476688 462366 445020 445850 444225
27473 444225 438792 449027 458906 448759 441917 448949 459691 463687 464062 471995 460290 460605 459585 460868
27459 460868 461439 454409 445452 446938 453749 457193 446698 454638 476371 478716 454062 438435 422523
27446 422523 421930 436021 441409 448566 449867 455279 458099 455520 455995 462279 459369 469828 479147 471009
$$ packed form
27543D47447R467K40k487M7l877j0094O464J365M136o042l278P788J643q04M648
27528D56663M08o108j1351J775L922Q543J4830m282M20r699o847P876Q22k179
27514D54793K90o484j3230P532K686o090q703J1306J3471L619k280R55m247J0326
27500D63944m715l082p164m276o740O365n034o673j34J3923J3787K788n39N238
27486D67688l04l859k363o046j3136j582Q148J6291J1851j4322j7346Q30j625
27473D44225n433J0235R879j0147o842P032J0742L996L75P933j1705L15j020J283
27459D60868N71p030q957J486O811L444j0495P940K1733K345k4654j5627j5912
27446D22523n93J4091N388P157J301N412K820k579M75O284k910J0459R319q138
$$ plain form
27432 471009 460598 457806 468284 471526 467426 456858 465464 467407 466344 462051 449299 452885 451897
27419 451897 455897 463242 464353 458385 449743 452486 458800 455564 450579 448497 451826 455326 473059 480972
27405 480972 484928 486675 473345 461435 459756 469644 466559 467919 465862 472519 469706 460242 467601 478169
27391 478169 488238 468877 456414 452225 455512 464986 463638 462442 462593 458753 455312 453000 438943
27378 438943 443958 456208 454124 459987 468427 478144 459911 453708 456867 457192 446615 441008 441684 448945
27364 448945 448386 442173 444688 452501 455008 464697 467422 453102 446918 455809 469796 482115 488032 483251
27350 483251 476778 465629 460356 456237 454160 451237 444757 439948 453769 454588 454133 459519 467214 483073
27336 483073 485849 478389 470993 475256 477367 482595 477559 475654 471899 464896 455273 444535 442690 446749
$$ packed form
27432D71009j0411k792J0478L242m100j0568Q606J943j063m293j2752L586r88
27419D51897M000P345J111n968q642K743O314l236m985k082L329L500J7733P913
27405D80972L956J747j3330j1910j679R888l085J360k057O657k813r464P359J0568
27391D78169J0069j9361j2463m189L287R474j348j196J51l840l441k312j4057
27378D38943N015J2250k084N863Q440R717j8233o203L159L25j0577n607O76P261
27364D48945n59o213K515P813K507R689K725j4320o184Q891J3987J2319N917m781
27350D83251o473j1149n273m119k077k923o480m809J3821Q19m55N386P695J5859
27336D83073K776p460p396M263K111N228n036j905l755p003r623j0738j845M059
$$ plain form
27322 446749 455286 455221 461069 461518 458991 462069 453247 457729 473537 477334 461012 444244 447067 449607
27308 449607 448028 449478 454701 470907 486443 483538 475221 472449 474968 461438 456283 456869 458526 463379
27294 463379 473995 485946 472366 451489 444679 459795 460344 466659 459180 455717 469743 478643 480943
27281 480943 478637 475639 466292 454301 449321 463992 470075 475448 479072 489531 482567 479104 468794
27268 468794 481502 486741 485506 477651 478341 486689 473537 473245 472415 479643 480994 473145 472126 472432 457776
27253 457776 456285 452167 460390 465090 464928 474897 470483 474914 481974 475869 473729 480536 485389 489463
27239 489463 469631 453614 467376 470250 481757 485098 489265 482600 478011 471316 467337 461197 460817
27226 460817 463138 456956 454388 458307 471590 474245 474022 479204 475931 467131 456396 464011 468235 475994
$$ packed form
27322D46749Q537o5N848M49k527L078q822M482J5808L797j6322j6768K823K540
27308D49607j579J450N223J6206J5536k905q317k772K519j3530n155N86J657M853
27294D63379J0616J1951j3580k0877o810J5116N49O315p479l463J4026Q900K300
27281D80943k306k998r347j1991m980J4671O083N373L624J0459o964l463j0310
27268D68794J2708N239j235p855O90Q348j3152k92q30P228J351p849j019L06j4656
27253D57776j491m118Q223M700j62R969m414M431P060o105k140O807M853M074
27239D89463j9832j6017J3762K874J1507L341M167o665m589o695l979o140l80
27226D60817K321o182k568L919J3283K655k23N182l273q800j0735P615M224P759
$$ plain form
27212 475994 479433 473214 479870 491705 493393 485018 482245 466834 466385 469861 470220 478166 483323 476222
27198 476222 475174 478383 476575 478374 475577 467724 467283 468199 469883 469769 472809 474976 488222 484753 464335
27183 464335 453634 449018 449103 455970 465473 475715 468014 476844 481017 460909 451943 465905 469896 478745
27169 478745 466160 463818 466506 472337 482273 478025 477661 481419 480328 486317 473073 465381 465945 468004
27155 468004 464996 467080 457619 460297 472620 469209 474202 480773 476217 468961 468416 476751 472731 469716
27141 469716 472323 468915 464911 477836 485008 489436 488872 474133 473585 478004 459240 462539 472679 496145
27127 496145 495282 484385 476701 465099 457711 461685 466324 471633 468316 477988 493882 499252 491835 482375
27113 482375 484958 486900 480815 481984 489039 484962 474650 477802 493073 489698 475426 478964 485372
$$ packed form
27212D75994L439o219O656J1835J688q375k773j5411m49L476L59P946N157p101
27198D76222j048L209j808J799k797p853m41R16J684j14L040K167J3246l469k0418
27183D64335j0701m616Q5O867R503J0242p701Q830M173k0108q966J3962L991Q849
27169D78745j2585k342K688N831R936m248l64L758j091N989j3244p692N64K059
27155D68004l008K084r461K678J2323l411M993O571m556p256n45Q335m020l015
27141D69716K607l408m004J2925P172M428n64j4739n48M419j8764L299J0140K3466
27127D96145q63j0897p684j1602p388L974M639N309l317R672J5894N370p417r460
27113D82375K583J942o085J169P055m077j0312L152J5271l375j4272L538O408
$$ plain form
27100 485372 477946 483694 489232 487465 483451 472585 476421 479383 491270 489114 485523 481644 476115 482081
27086 482081 482984 470685 475094 480958 478243 472561 474308 490107 489148 478750 481041 482002 464310 459398
27072 459398 470992 478305 470307 466902 472610 479360 478717 482861 482212 486015 478554 472989 471166 476633
27058 476633 482755 495165 494837 499111 487955 474586 465444 472304 480381 481612 476278 469735 473074 482309
27044 482309 476547 463452 460662 470297 486748 488340 490214 491064 494519 495055 495846 498199 489702 472757
27030 472757 467138 477823 487926 488706 493720 502035 505271 501409 502227 512212 521999 508053 500461 489229
27016 489229 476654 469169 465802 477362 490789 494787 494126 482334 470344 469140 475802 486041 479258
27003 479258 484428 486810 487697 488666 507030 520276 508524 492153 486630 490509 493870 498796 497484 487511
$$ packed form
27100D85372p426N748N538j767m014j0866L836K962J1887k156l591l879n529N966
27086D82081R03j2299M409N864k715n682J747J5799r59j0398K291R61j7692m912
27072D59398J1594P313p998l405N708O750o43M144o49L803p461n565j823N467
27058D76633O122J2410l28M274j1156j3369r142O860Q077J231n334o543L339R235
27044D82309n762j3095k790R635J6451J592J874Q50L455N36P91K353q497j6945
27030D72757n619J0685J0103P80N014Q315L236l862Q18R985R787j3946p592j1232
27016D89229j2575p485l367J1560J3427L998o61j1792j1990j204O662J0239o783
27003D79258N170K382Q87R69J8364J3246j1752j6371n523L879L361M926j312r973
$$ plain form
26989 487511 476551 471950 469235 468810 481072 481696 467903 469767 475493 467576 466992 474263 480225 479620
26975 479620 474910 485479 494299 500795 506126 500493 495858 490679 492953 491885 494388 489566 481264 475993
26961 475993 475395 482645 486203 492954 489624 474981 490814 492583 494298 497697 506541 496991 482184 477521
26947 477521 478843 474729 470911 474479 484452 499750 511393 509133 498990 506070 502849 499988 506615
26934 506615 496441 480295 479136 473927 479562 484876 475309 465888 469892 476730 484901 484950 484815 505994
26920 505994 519386 513245 504441 499312 481566 485004 489560 485693 499618 515375 513604 501506 481898
26907 481898 475479 484611 489133 501090 508326 514364 512165 501230 502659 505172 507018 497333 504142 506232
26893 506232 489873 479873 473041 480303 498575 508588 508015 509543 501548 496868 492291 490469 493673
$$ packed form
26989D87511j0960m601k715m25J2262O24j3793J864N726p917n84P271N962o05
26975D79620m710J0569Q820O496N331n633m635n179K274j068K503m822q302n271
26961D75993n98P250L558O751l330j4643J5833J769J715L399Q844r550j4807m663
26947D77521J322m114l818L568R973J5298J1643k260j0143P080l221k861O627
26934E06615j0174j6146j159n209N635N314r567r421M004O838Q171M9j35K1179
26920E05994J3392o141q804n129j7746L438M556l867J3925J5757j771j2098j9608
26907D81898o419R132M522J1957P236O038k199j0935J429K513J846r685O809K090
26893E06232j6359j0000o832P262J8272J0013n73J528p995m680m577j822L204
$$ plain form
26880 493673 485702 485311 491474 489928 486532 493491 502784 505149 492722 485410 484333 491055 492502 496949
26866 496949 500518 499525 498639 496275 505457 513036 509908 515378 517718 506870 512172 515186 518478 528706
26852 528706 527023 511382 494869 496292 502116 501032 501018 513651 514206 505232 490300 495614 499815 486596
26838 486596 491238 497508 492717 492631 493518 493549 494451 495292 498081 501624 502482 504250 505586 518459 521532 512552
26822 512552 497139 496187 507959 511917 513542 499592 483406 484226 502699 508646 508085 507064 498696 500199
26808 500199 507773 510290 505882 506988 509898 502491 492437 506293 518349 514281 504007 502369 512554
26795 512554 505389 507259 516672 507731 503924 508000 503565 492861 483622 488516 490975 486711 487126 479869
26781 479869 474705 487614 509937 515682 517269 518355 514159 507986 506126 505576 503192 503321 508101 518465
$$ packed form
26880D93673p971l91O163j546l396O959R293K365j2427p312j077O722J447M447
26866D96949L569r93q86k364R182P579l128N470K340j0848N302L014L292J0228
26852E28706j683j5641j6513J423N824j084j4J2633N55q974j4932N314M201j3219
26838D86596M642O270m791q6Q87L1R02Q41K789L543Q58J768J336J2873L073q980
26822E12552j5413r52J1772L958J625j3950j6186Q20J8473N947n61j021q368J503
26808E00199P574K517m408J106K910p407j0054J3856J2056m068j0274j638J0185
26795E12554p165J870R413q941l807M076m435j0704r239M894K459m264M15p257
26781D79869n164J2909K2323N745J587J086m196o173j860n50k384J29M780J0364
$$ plain form
26767 518465 524806 521263 521614 529965 528445 517729 508092 510690 512337 522144 518018 507270 501237 501386
26753 501386 506046 506809 512707 508078 513913 507937 494407 491780 502031 501532 500702 504985 507516 516432
26739 516432 528293 515215 503945 499657 497172 494709 503496 499522 507005 497189 492690 490924 492110
26726 492110 494297 500192 523460 539327 536688 526495 511034 500401 494390 484014 484606 493456 494475
26713 494475 506848 513009 520165 512866 505535 501409 503161 500517 509933 527441 531548 531830 520445 502091
26699 502091 505870 508173 507137 500587 506634 509846 507774 526981 533794 523965 514792 501986 505011 515087
26685 515087 527084 526715 516927 513279 506629 502201 504936 510874 517969 517458 516170 514772 509660 504454
26671 504454 503238 506488 508878 517398 521658 513843 510488 513111 518693 526488 521875 506035 499906 506625
$$ packed form
26767E18465O341l543L51Q351j520j0716r637K598J647R807m126j0748o033J49
26753E01386M660P63N898m629N835n976j3530k627J0251m99q30M283K531Q916
26739E16432J1861j3078j1270m288k485k463Q787l974P483r816m499j766J186
26726D92110K187N895K3268J5867k639j0193j5461j0633o011j0376N92Q850J019
26713D94475J2373O161P156p299p331m126J752k644R416J7508M107K82j1385j8354
26699E02091L779K303j036o550O047L212k072J9207O813r829r173j2806L025J0076
26685E15087J1997l69r788l648o650m428K735N938P095n11j288j398n112n206
26671E04454j216L250K390Q520M260p815l355K623N582P795m613j5840o129O719
$$ plain form
26657 506625 497517 497572 495402 488524 486478 505653 514341 514360 500308 488712 509270 517523 505019 496066
26643 496066 498323 511007 519000 523770 523963 523784 513567 507301 514092 522592 519397 517145 515964 511578
26629 511578 519911 530823 532729 534359 533390 519451 510000 517261 514047 506496 508981 508658 511804 517615
26615 517615 510649 510679 504618 511694 528242 535320 514704 505698 511649 520034 512245 505461 514406 515890
26601 515890 511853 508653 513148 520872 521985 512630 495052 497245 490699 484569 487611 506549 520684
26588 520684 528329 525036 517919 519924 512691 516722 515327 514088 514661 519002 518280 518371 515991 509962 503837
26573 503837 501778 514016 530669 526446 514533 509924 510280 511252 504098 502107 507568 519240 522436 517214
26559 517214 525045 525533 523636 530720 532312 527994 537139 545761 551348 547013 531639 522168 534410 533116
$$ packed form
26657E06625r108N5k170o878k046J9175Q688J9j4052j1596K0558Q253j2504q953
26643D96066K257J2684P993M770J93j79j0217o266O791Q500l195k252j181m386
26629E11578Q333J0912J906J630r69j3939r451P261l214p551K485l23L146N811
26615E17615o966L0o061P076J6548P078k0616r006N951Q385p789o784Q945J484
26601E15890m037l200M495P724J113r355j7578K193o546o130L042J8938J4135
26588E20684P645l293p117K005p233M031j395j239N73M341p22R1k380o029o125
26573E03837k059J2238J6653m223j1913m609L56R72p154j991N461J1672L196n222
26559E17214P831M88j897P084J592m318R145Q622N587m335j5374r471J2242j294
$$ plain form
26545 533116 521375 529891 535893 524566 527322 527992 534698 531250 530353 533916 530099 512868 506567 509342
26531 509342 511460 518346 521841 520750 523624 519573 520576 526405 533538 527937 529942 530728 525736 535979
26517 535979 542745 529671 525167 524725 528400 522707 519667 515527 522433 520067 525339 530710 527801 526838
26503 526838 531982 518328 516010 514785 510655 510638 518516 518678 513982 518304 532518 532161 524363 523129 527780
26488 527780 532391 536049 531265 515777 517376 524605 534038 531014 512430 499218 516455 525372 515087
26475 515087 511572 520019 511289 507877 519551 529636 534065 541396 524461 533016 541838 539321 528137
26462 528137 523958 525002 526891 521478 521569 520212 511885 507619 515987 524470 532305 531876 525266 530901 531428
26447 531428 544758 540330 534417 536955 545350 544302 530912 530946 534789 547794 540494 523709 517352 513204
$$ packed form
26545E33116j1741Q516O002j1327K756O70O706l448q97L563l817j7231o301K775
26531E09342K118O886L495j091K874m051J003N829P133n601K005P86m992J0243
26517E35979O766j3074m504m42L675n693l040m140O906k366N272N371k909r63
26503E26838N144j3654k318j225m130j7P878J62m696M322J4214l57p798j234M651
26488E27780M611L658m784j5488J599P229R433l024j8584j3212J7237Q917j0285
26475E15087l515Q447q730l412J1674J0085M429P331j6935Q555Q822k517j1184
26462E28137m179J044J889n413R1j357q327m266Q368Q483P835m29o610N635N27
26447E31428J3330m428n913K538Q395j048j3390L4L843J3005p300j6785o357m148
$$ plain form
26433 513204 510465 518373 525137 522462 528862 542542 549165 548465 543538 538970 536711 528518 529929 540257
26419 540257 539262 542390 542935 544509 543472 542486 546546 553975 547773 553634 549334 528753 532179 527316 535552
26404 535552 545845 544470 539692 546474 540518 525158 521654 521610 530371 530984 545245 541279 541572 533257
26390 533257 520720 527551 525199 519616 528694 540127 545429 527802 520983 537791 537287 528276 535430
26377 535430 531824 524685 544925 554104 551648 547885 538419 529214 530634 528936 526403 539410 546793 531468
26363 531468 527699 526493 532977 537313 533602 531897 533762 528902 534163 534726 529298 532229 535234 534200
26349 534200 535112 532218 523292 520753 535319 547214 543627 550886 550520 549389 532806 523076 520716 531845
26335 531845 543234 552979 542798 536610 541296 547267 538043 537602 543111 542196 558207 575481 568642 562872
$$ packed form
26433E13204k739P908O764k675O400J3680O623p00m927m568k259q193J411J0328
26419E40257r95L128N45J574j037r86M060P429o202N861m300k0581L426m863Q236
26404E35552J0293j375m778O782n956j5360l504m4Q761O13J4261l966K93q315
26390E33257j2537O831k352n583R078J1433N302j7627o819J6808n04r011P154
26377E35430l606p139K0240R179k456l763r466r205J420j698k533J3007P383j5325
26363E31468l769j206O484M336l711j705J865m860N261N63n428K931L005j034
26349E34200R12k894q926k539J4566J1895l587P259l66j131j6583r730k360J1129
26335E31845J1389R745j0181o188M686N971r224m41N509r15J6011J7274o839n770
$$ plain form
26321 562872 556903 552250 551114 556664 562016 557597 552361 549668 539199 534514 535569 533942 548673 558786
26307 558786 553302 547671 549580 557387 552180 542688 536705 537791 540592 544725 555781 557237 556819 548846
26293 548846 540737 547358 547518 549126 550209 558300 565167 557448 553804 556416 561992 562311 560793 551905 548294
26278 548294 552523 528262 524880 531499 543456 554302 557705 546830 546285 548265 557646 554616 554289 552091
26264 552091 540567 537125 554015 555665 545298 549254 556365 566198 569751 569274 565572 554946 568474
26251 568474 575389 565312 560557 555851 550213 560466 561130 559011 565124 553962 544418 536328 525487
26238 525487 519371 522343 533364 535284 536022 533527 535017 538019 549552 548435 551089 553256 547795 539588
26224 539588 541401 550355 552543 543156 548611 554588 558428 558709 559764 557942 562824 560187 562359 568730
$$ packed form
26321E62872n969m653j136N550N352m419n236k693j0469m685J055j627J4731J0113
26307E58786n484n631J909P807n207r492n983J086K801M133J1056J456m18p973
26293E48846q109O621J60J608J083Q091O867p719l644K612N576L19j518q888l611
26278E48294M229k4261l382O619J1957J0846L403j0875n45J980R381l030l27k198
26264E52091j1524l442J6890J650j0367L956P111R833L553m77l702j0626J3528
26251E68474O915j0077m755m706n638J0253O64k119O113j1162r544q090j0841
26238E25487o116K972J1021J920P38k495J490L002J1533j117K654K167n461q207
26224E39588J813Q954K188r387N455N977L840K81J055j822M882k637K172O371
$$ plain form
26210 568730 556302 549367 559982 573854 569285 560789 562636 556475 550094 539733 547646 551769 556644
26197 556644 552058 556489 550588 549844 556418 555253 550795 552627 555211 564161 566516 564443 555706 553752
26183 553752 565473 573546 568905 573254 572301 565175 551728 545181 542122 549121 563008 568714 559942 560900
26169 560900 568218 567139 549755 544554 550975 563404 560119 559189 567117 569028 561779 556920 560354 560255
26155 560255 563856 554458 540873 552063 571052 571988 561573 560066 567888 562357 565268 564413 569874 567219
26141 567219 557327 556388 556051 556209 558256 552059 552173 565886 566894 562258 558421 568390 563109 559173 563453
26126 563453 569497 550111 545366 549002 552574 548392 553510 573387 575848 567383 559351 552998 561606 573095
26112 573095 579346 581752 584049 564741 556142 565098 558700 564785 568341 569082 564662 553939 553955 552265
$$ packed form
26210E68730j2428o935J0615J3872m569q496J847o161o381j0361P913M123M875
26197E56644m586M431n901p44O574j165m458J832K584Q950K355k073q737j954
26183E53752J1721Q073m641M349r53p126j3447o547l059O999J3887N706q772R58
26169E60900P318j079j7384n201O421J2429l285r30P928J911p249m859L434r9
26155E60255L601r398j3585J1190J8989R36j0415j507P822n531K911q55N461k655
26141E67219r892r39l37J58K047o197J14J3713J008m636l837R969n281l936M280
26126E63453O044j9386m745L636L572m182N118J9877K461q465q032o353Q608J1489
26112E73095O251K406K297j9308q599Q956o398O085L556P41m420j0723J6j690
$$ plain form
26098 552265 542409 546517 549213 546542 563002 559665 569835 559879 545513 555681 561830 557067 562936
26085 562936 563668 561317 548472 544099 550815 554654 556742 551897 553965 550179 551580 557841 564496 559547
26071 559547 559095 553833 558804 561525 570321 570617 576540 576745 579322 577870 584828 582793 576434 585464 595907
26056 595907 591367 580282 575989 570845 573726 579766 581541 586120 581036 560080 554854 557405 557832 566427
26042 566427 568133 551529 554276 561410 563953 568810 576592 581350 569601 578498 582309 580034 579755 586203
26028 586203 592555 589195 584409 567641 560331 563788 560357 566168 562722 562127 559702 565313 582875 592512
26014 592512 591817 591464 586605 584612 584395 594000 607556 608518 596684 587019 577484 574984 567317 560619 553697
25999 553697 539233 539993 559115 588151 580707 569691 571079 572877 567500 560107 553901 546175 536239
$$ packed form
26098E52265r856M108K696k671J6460l337J0170r956j4366J0168O149m763N869
26085E62936P32k351j2845m373O716L839K088m845K068l786J401O261O655m949
26071E59547m52n262M971K721Q796K96N923K05K577j452O958k035o359R030J0443
26056E95907m540j1085m293n144K881O040J775M579n084k0956n226K551M27Q595
26042E66427J706j6604K747P134K543M857P782M758j1749Q897L811k275k79O448
26028E86203O352l360m786j6768p310L457l431N811l446n95k425N611J7562R637
26014E92512o95l53m859j993k17R605J3556R62j1834r665r535k500p667o698o922
25999E53697j4464P60J9122K9036p444j1016J388J798n377p393o206p726r936
$$ plain form
25986 536239 545358 571475 573095 558613 558764 565293 569606 569311 573274 580642 570553 561620 566784 567610
25972 567610 561867 555832 555273 555193 554228 548641 551525 551862 548361 560899 570504 579661 579371 575851 573460
25957 573460 580042 579328 562761 561350 572673 575169 569304 568000 563074 559990 564727 559815 557706 565506
25943 565506 580626 597103 596244 587126 579349 583653 576638 570840 573150 562234 565070 581516 588620
25930 588620 589304 580176 579027 583901 591334 595262 599896 587848 592474 592483 578734 580885 583172 574962 572553
25915 572553 579530 585341 580930 583896 583339 573709 579693 572584 556515 562590 571773 570907 571081 569811 577318
25900 577318 570628 584773 582089 578505 583398 583658 583862 581569 593066 595814 597230 598265 601838 602180
25886 602180 589066 578790 581700 586490 582983 583842 591015 604953 604742 593165 589641 588606 598046 605229
$$ packed form
25986E36239R119K6117J620j4482J51O529M313k95L963P368j0089q933N164Q26
25972E67610n743o035n59q0r65n587K884L37l501J2538R605R157k90l520k391
25957E73460O582p14j6567j411J1323K496n865j304m926l084M737m912k109P800
25943E65506J5120J6477q59r118p777M304p015n798K310j0916K836J6446P104
25930E88620O84r128j149M874P433L928M634j2048M626Rj3749K151K287q210k409
25915E72553O977N811m411K966n57r630N984p109j6069O075R183q66J74j270P507
25900E77318o690J4145k684l584M893K60K04k293J1497K748J416J035L573L42
25886F02180j3114j0276K910M790l507Q59P173J3938k11j1577l524j035R440P183
$$ plain form
25872 605229 604671 603965 603974 584363 575189 577103 579344 575262 572685 577390 582889 582908 579549 583614 582144 598400
25856 598400 598957 595555 599897 596888 587845 583834 591786 600454 607696 611884 609454 603933 598774 592272
25842 592272 591495 589889 590460 600726 611821 599993 602825 603297 599459 597911 602071 606886 606244 600087
25828 600087 589348 586860 596891 609495 609143 598482 599499 615259 614815 612608 615833 613962 614412 619691
25814 619691 610731 607094 601269 607690 602568 595026 592493 591052 592248 613796 614015 590048 578695 585166
25800 585166 595599 612381 607396 593756 592983 617999 609225 599503 596690 595261 598445 596827 600085
25787 600085 603339 597024 597798 603683 588197 584656 602879 602559 602506 602841 612937 618522 615953 609203 597496
25772 597496 590750 590292 582742 581390 583752 582061 574220 582696 595716 611368 616292 611510 619736 615896
$$ packed form
25872F05229n58p06Rj9611r174J914K241m082k577M705N499J9l359M065j470J6256
25856E98400N57l402M342l009r043m011P952Q668P242M188k430n521n159o502
25842E92272p77j606N71J0266J1095j1828K832M72l838j548M160M815o42o157
25828F00087j0739k488J0031J2604l52j0661J017J5760m44k207L225j871M50N279
25814F19691q960l637n825O421n122p542k533j441J196K1548K19k3967j1353O471
25800E85166J0433J6782m985j3640p73K5016q774r722k813j429L184j618L258
25787F00085L254o315P74N885j5486l541J8223l20n3L35J0096N585k569o750j1707
25772E97496o746m58p550j352K362j691p841Q476J3020J5652M924m782Q226l840
$$ plain form
25758 615896 616770 613097 602142 597311 596513 610159 614102 607050 596765 590444 600375 595715 590613 592004
25744 592004 602894 615507 603512 587557 595112 596446 602951 603317 601804 597001 606492 606200 613578 620247
25730 620247 610869 610100 604396 600845 590791 588256 597801 599508 592879 586780 597280 608316 614528 617084
25716 617084 612853 606359 605263 611744 614374 607258 599282 600141 607964 610282 603810 597966 599513 615391
25702 615391 615649 615483 613760 613661 608144 608058 608672 611382 606668 611126 618996 613623 599732 597918 587450
25687 587450 587845 604543 620330 617354 609777 608079 610610 603895 602942 615053 628509 621491 608507
25674 608507 609448 615936 618472 616424 622579 617296 605327 606757 603343 604063 604538 604085 615367 629328
25660 629328 620565 609319 615633 619281 614555 604361 599790 612864 621395 617825 608611 612229 621684
$$ packed form
25758F15896Q74l673j0955m831p98J3646L943p052j0285o321R931m660n102J391
25744E92004J0890J2613j1995j5955P555J334O505L66j513m803R491k92P378O669
25730F20247r378p69n704l551j0054k535R545J707o629o099J0500J1036O212K556
25716F17084m231o494j096O481K630p116p976Q59P823K318o472n844J547J5878
25702F15391K58j66j723r9n517q6O14K710m714M458P870n373j3891j814j0468
25687E87450L95J6698J5787k976p577j698K531o715r53J2111J3456p018j2984
25674F08507R41O488K536k048O155n283j1969J430l414P20M75m53J1282J3961
25660F29328q763j1246O314L648m726j0194m571J3074Q531l570r214L618R455
$$ plain form
25647 621684 626948 620095 614802 620811 617433 607722 602023 606662 596536 598702 605221 603118 613363 616377
25633 616377 612523 602598 599832 596052 600287 611760 615546 622761 630121 627650 617977 620815 626576 625685
25619 625685 621481 617005 624546 614626 615257 617504 618938 618195 618461 628443 630722 641341 653264 641038
25605 641038 642252 638918 629819 615372 617091 616291 612042 610853 614508 621998 627819 631362 620214 616511
25591 616511 625890 620370 626568 630412 629489 629579 602452 612823 629182 618909 598890 601362 621178
25578 621178 614771 609918 613186 603855 597524 600203 612597 619618 612677 607852 614782 618642 628952 640267
25564 640267 636486 630645 630921 635326 622726 615505 609176 602087 606198 623437 627873 625781 617841 605701
25550 605701 599234 610992 638357 638459 636620 635099 629080 624441 619157 619544 628518 640514 643759 630224
$$ packed form
25647F21684N264o853n293O009l378r711n699M639j0126K166O519k103J0245L014
25633F16377l854r925k766l780M235J1473L786P215P360k471r673K838N761q91
25619F25685m204m476P541r920O31K247J434p43K66R982K279J0619J1923j2226
25605F41038J214l334r099j4447J719q00m249j189L655P490N821L543j1148l703
25591F16511R379n520O198L844r23R0k7127J0371J6359j0273k0019K472J9816
25578F21178o407m853L268r331o331K679J2394P021o941m825O930L860J0310J1315
25564F40267l781n841K76M405j2600p221o329p089M111J7239M436k092p940j2140
25550F05701o467J1758K7365J02j839j521o019m639n284L87Q974J1996L245j3535
$$ plain form
25536 630224 610122 617253 623276 619673 642133 649407 648215 646427 638240 627082 623330 630095 629493 629574
25522 629574 635649 643697 631333 631511 629592 633956 643506 640379 634133 624077 621168 619219 618233 620650
25508 620650 630404 641015 651738 647523 637326 637616 644258 640559 628266 633023 639837 630454 626433
25495 626433 634406 635857 636025 638134 648847 649501 651731 638447 638157 632401 636703 632255 629266 622933
25481 622933 611807 616737 614712 617988 622683 627099 634712 631290 638637 640065 637300 631283 641065 647401
25467 647401 636881 629542 634979 631530 630559 632194 637267 637162 637546 643421 656760 658253 659184 652125 644268
25452 644268 643891 636409 650877 662938 662579 652824 630203 628289 626587 630886 641349 636456 636086 642649
25438 642649 650122 656223 662063 666043 674207 667669 652069 648552 643381 636266 638079 649011 647503 643803
$$ packed form
25536F30224k0102P131O023l603K2460P274j192j788q187j1158l752O765o02Q1
25522F29574O075Q048j2364J78j919M364R550l127o246j0056k909j949r86K417
25508F20650R754J0611J0723m215j0197K90O642l699j2293M757O814r383m021
25495F26433P973J451J68K109J0713O54K230j3284k90n756M302m448k989o333
25481F22933j1126M930k025L276M695M416P613l422P347J428k765o017R782O336
25467F47401j0520p339N437l449r71J635N073j05L84N875J3339J493R31p059p857
25452F44268l77p482J4468J2061l59r755k2621j914j702M299J0463m893l70O563
25438F42649P473O101N840L980Q164o538j5600l517n171p115J813J0932j508l700
$$ plain form
25424 643803 640158 643733 630624 642444 651989 653090 654290 653469 655186 646671 646145 653905 657297 642683
25410 642683 640465 636092 634950 638408 642914 653145 658214 646651 649977 653273 646345 639005 633878 627960
25396 627960 629913 636553 644626 649716 654617 655542 654978 646517 646873 648934 633730 620089 621902 629707
25382 629707 645205 655297 661235 659169 645624 641703 641669 630128 635828 640356 644111 634036 637335
25369 637335 634039 631070 648248 669301 665597 662127 663076 654820 648964 643697 642941 646338 642179 639915
25355 639915 639131 626295 623520 626920 638761 647616 652142 649105 648759 646162 640676 624236 624927 636711
25341 636711 641077 649447 657221 645428 634463 626729 634105 634088 632400 626187 628354 649325 664311 663120
25327 663120 660685 658673 650625 656266 659733 662145 664698 654620 657176 667495 677567 679901 675264
$$ packed form
25424F43803l645L575j3109J1820R545J101J200q21J717q515n26P760L392j4614
25410F42683k218m373j142L458M506J0231N069j1563L326L296o928p340n127n918
25396F27960J953O640Q073N090M901R25n64q461L56K061j5204j3641J813P805
25382F29707J5498J0092N938k066j3545l921l4j1541N700M528L755j0075L299
25369F37335l296k969J7178K1053l704l470R49q256n856n267p56L397m159k264
25355F39915p84j2836k775L400J1841Q855M526l037l46k597n486j6440O91J1784
25341F36711M366Q370P774j1793j0965p734P376j7j688o213K167K0971J4986j191
25327F63120k435k012q048N641L467K412K553j0078K556J0319J0072K334m637
$$ plain form
25314 675264 668843 653618 648682 642949 653542 658712 649166 639421 639712 645924 646574 641032 640354 651682
25300 651682 662313 657128 665128 674455 668964 671314 660191 649990 655423 659254 663087 672446 669846
25287 669846 666680 664215 663591 672305 667365 660655 655618 658291 671683 674165 664201 662933 659535 661347
25273 661347 658286 659573 652558 649557 659612 668017 666472 659770 662758 671250 669862 668072 674560 676651
25259 676651 665087 661266 668770 669316 668686 657250 652906 664982 664468 657852 660150 663156 657278 658424
25245 658424 658220 663729 671259 677689 680607 684382 680311 668610 655023 650181 632181 634654 643780 650551
25231 650551 651799 663938 657461 661511 671305 675217 673265 671171 669696 666782 659159 664846 669315 671340
25217 671340 679985 670624 663920 667474 676735 678241 689217 697002 705062 706409 695519 675818 680192
$$ packed form
25314F75264o421j5225m936n733J0593N170r546r745K91O212O50n542o78J1328
25300F51682J0631n185Q000R327n491K350j1123j0201N433L831L833R359k600
25287F69846l166k465o24Q714m940o710n037K673J3392K482r964j268l398J812
25273F61347l061J287p015l001J0055Q405j545o702K988Q492j388j790O488K091
25259F76651j1564l821P504N46o30j1436m344J2076n14o616K298L006n878J146
25245F58424k04N509P530O430K918L775m071j1701j3587m842j8000K473R126O771
25231F50551J248J2139o477M050R794L912j952k094j475k914p623N687M469K025
25217F71340Q645r361o704L554R261J506J0976P785Q060J347j0890j9701M374
$$ plain form
25204 680192 678117 671587 675387 666831 664332 672278 671702 666545 663510 673979 676619 663698 657054 654876
25190 654876 658403 666051 665870 672938 670009 665828 661191 657420 662706 667735 671850 677706 694020 685584
25176 685584 686129 686521 678851 674036 674596 686091 691794 692786 687061 678067 667474 665519 671804 676218 683470
25161 683470 696455 695090 685086 675926 675659 693275 695480 689691 691082 697198 691578 680242 672643
25148 672643 674017 677109 677348 686558 690344 676531 661712 659440 656606 666066 679050 691280 686586
25135 686586 691769 680610 686552 696436 691642 679761 681138 696202 696988 703367 706786 696427 682612
25122 682612 681307 679633 678220 680493 684725 683754 685267 677617 673146 677136 674555 670163 666046 678170
25108 678170 683049 685573 698169 701145 699403 702713 702727 702900 703018 694667 686959 681866 686789 688197 687010
$$ packed form
25204F80192k075o530L800q556k499P946n76n157l035J0469K640j2921o644k178
25190F54876L527P648j81P068k929m181m637l771N286N029M115N856J6314q436
25176F85584N45L92p670m815N60J1495N703R92n725q994j0593j955O285M414P252
25161F83470J2985j365j0004r160k67J7616K205n789J391O116n620j1336p599
25148F72643J374L092K39R210L786j3813j4819k272k834R460J2984J2230m694
25135F86586N183j1159N942R884m794j1881J377J5064P86O379L419j0359j3815
25122F82612j305j674j413K273M232r71J513p650m471L990k581m392m117J2124
25108F78170M879K524J2596K976j742L310J4J73J18q351p708n093M923J408j187
$$ plain form
25093 687010 696751 696981 693011 697961 701534 703296 705461 709351 706527 714199 712061 710090 702231 701542 713078
25078 713078 709173 709666 709441 700864 694291 703020 711489 707215 718886 721942 714482 705358 707995 721162
25064 721162 718443 707171 702700 700324 693923 684937 683855 697561 702331 702597 699098 691147 690038 684255
25050 684255 682846 691769 693321 685894 695684 696551 695657 698087 704544 702186 701733 699808 699029 703289 709724
25035 709724 704258 694906 687198 681239 688027 694866 686548 688354 694140 702895 705586 710128 716541 721033
25021 721033 717402 712503 712852 712471 716535 706825 708498 714565 711171 716219 717578 728036 729603 713138
25007 713138 698628 693445 709963 708061 711150 710675 714577 727571 733850 735303 727292 725473 725804 730985
24993 730985 731035 724567 724188 726789 721575 712913 704824 709186 701772 707539 725496 730718 714411 708449
$$ packed form
25093F87010R741K30l970M950L573J762K165L890k824P672k138j971p859o89J1536
25078G13078l905M93k25q577o573Q729Q469m274J1671L056p460r124K637J3167
25064G21162k719j1272m471k376o401q986j082J3706M770K66l499p951j109n783
25050F84255j409Q923J552p427R790Q67q94K430O457k358m53j925p79M260O435
25035G09724n466r352p708n959O788O839q318J806N786Q755K691M542O413M492
25021G21033l631m899L49l81M064r710J673O067l394N048J359J0458J567j6465
25007G13138j4510n183J6518j902L089m75L902J2994O279J453q011j819L31N181
24993G30985N0o468l79K601n214q662q089M362p414N767J7957N222j6307n962
$$ plain form
24979 708449 712199 703156 708603 703356 711947 717409 708602 711150 706103 690537 686914 696546 702144 701240
24965 701240 711273 717550 719722 718037 709059 694678 688708 685155 691880 705174 711095 704253 704459 705252
24951 705252 707354 708558 705849 696543 699604 708290 708929 710011 729201 727114 720078 718154 720467 727357
24937 727357 733724 735297 729506 730773 723914 713589 713021 717502 730231 755038 767724 748906 728412
24924 728412 716926 715661 721162 734463 736141 723184 727321 727506 720192 727333 727398 716406 712803 707969
24910 707969 709354 712350 709553 714366 712052 712711 720116 737040 727991 728413 722210 732373 738388 731003
24896 731003 732010 729218 735850 738065 724618 724254 720700 722980 715673 716091 722477 724715 729164 733377
24882 733377 733809 749139 759836 749691 741130 736576 737169 728823 722150 720428 727931 736518 741491 737339
$$ packed form
24979G08449L750r043N447n247Q591N462q807K548n047j5566l623R632N598r04
24965G01240J0033O277K172j685q978j4381n970l553O725J3294N921o842K06P93
24951G05252K102J204k709r306L061Q686O39J082J9190k087p036j924K313O890
24937G27357O367J573n791J267o859j0325n68M481J2729K4807J2686j8818k0494
24924G28412j1486j265N501J3301J678j2957M137J85p314P141O5j0992l603m834
24910G07969J385K996k797M813k314O59P405J6924r049M22o203J0163O015p385
24896G31003J007k792O632K215j3447l64l554K280p307M18O386K238M449M213
24882G33377M32J5330J0697j0145q561m554N93q346o673j722P503Q587M973m152
$$ plain form
24868 737339 749994 752502 737860 725781 726320 721997 714562 711591 714390 721455 719304 732853 736512
24855 736512 756761 756749 758145 746010 746339 753522 755180 742394 745763 748078 746828 746914 740837 737234 743167
24840 743167 744814 742458 739001 727738 725134 734227 736210 736490 738516 728748 733161 738779 759305 760104
24826 760104 751687 744601 747501 741887 742131 748199 742419 735566 736108 742611 743044 749853 756066 751010 745158
24811 745158 754278 772057 777937 771540 756109 742845 723523 713986 733851 743113 741963 749603 746248
24798 746248 741679 757276 759701 750828 749916 747817 741734 747667 746178 737542 744639 753722 766187 761847
24784 761847 743413 741777 758739 764924 756104 750089 746682 744775 741519 736678 736797 728360 737204 746854
24770 746854 739868 746996 752144 750434 747390 745799 758455 755705 763133 764670 766622 770098 768352 760120
$$ packed form
24868G37339J2655K508j4642j2079N39m323p435k971K799P065k151J3549L659
24855G36512K0249j2J396j2135L29P183J658j2786L369K315j250Q6o077l603N933
24840G43167J647k356l457j1263k604R093J983K80K026r768M413N618K0526P99
24826G60104q417p086K900n614K44O068n780o853N42O503M33O809O213n056n852
24811G45158R120J7779N880o397j5431j3264j9322r537J9865R262j150P640l355
24798G46248m569J5597K425q873r12k099o083N933j489q636P097R083J2465m340
24784G61847j8434j636J6962O185q820o015l407j907l256m841J19q437Q844R650
24770G46854o986P128N148j710l044j591J2656k750P428J537J952L476j746q232
$$ plain form
24756 760120 754521 747968 751188 748667 740157 737525 741179 748017 752417 755139 749928 738687 721338 720587
24742 720587 736809 753303 751683 741234 739576 742260 745402 746790 747548 748622 741756 738513 741343 740112
24728 740112 734926 743428 739792 737906 744544 748300 743704 752554 758091 753183 760987 760783 752733 753661 755628
24713 755628 763587 759544 758600 765398 769533 762849 756708 757795 765610 778676 787138 776880 764251 758175
24699 758175 761371 760339 754362 749867 764423 773105 782837 779425 774666 780316 779439 772177 762803 769968
24685 769968 769343 764980 758452 760243 763132 754137 759850 760019 767207 773333 773414 774937 772608 769215 767613
24670 767613 776715 772300 774978 767903 752142 745165 758122 765098 764053 742826 739854 751592 756416
24657 756416 760848 768162 771643 771680 776826 783260 778468 775081 780403 779659 779034 779193 775139 776576 766012
$$ packed form
24756G60120n599o553L220k521q510k632L654O838M400K722n211j1241j7349p51
24742G20587J6222J6494j620j0449j658K684L142J388P58J074o866l243K830j231
24728G40112n186Q502l636j886O638L756m596Q850N537m908P804k04q050R28J967
24713G55628P959m043r44O798M135o684o141J087P815J3066Q462j0258j2629o076
24699G58175L196j032n977m495J4556Q682R732l412m759N650q77p262r374P165
24685G69968o25m363o528J791K889q995N713J69P188O126Q1J523k329l393j602
24670G67613R102m415K678p075j5761o977J2957O976j045k1227k972J1738M824
24657G56416M432P314L481L7N146O434m792l387N322p44o25J59m054J437j0564
$$ plain form
24642 766012 776935 789991 782283 786330 798659 790489 786895 788959 789515 786856 779129 773695 766697 770403
24628 770403 774387 779068 790065 787160 788007 781059 771255 767692 779248 781446 784128 786147 784114 783423
24614 783423 781180 781424 773377 772977 771843 781178 774462 777456 782657 782017 773790 770439 773897 776953 769294
24599 769294 778432 786395 781474 779203 789278 798735 802467 795567 782851 785836 787877 778135 773150 780300
24585 780300 785708 785244 781415 780470 789043 792942 800682 817703 800984 795215 803202 805252 805565 791945
24571 791945 786386 793456 792260 788876 793116 789291 786422 792675 785619 787860 785049 783232 771518 772148
24557 772148 782531 791130 795651 788455 779576 790417 787287 778095 776384 783868 799518 797781 790088
24544 790088 791820 802565 799191 784668 786621 786042 789505 786992 785810 794844 794951 797168 816772 815461
$$ packed form
24642G66012J0923J3056p708M047J2329q170l594K064N56k659p727n434o998L706
24628G70403L984M681J0997k905Q47o948r804l563J1556K198K682K019k033o91
24614G83423k243K44q047m00j134R335o716K994N201o40q227l351L458L056p659
24599G69294R138P963m921k271J0075R457L732o900j2716K985K041r742m985P150
24585G80300N408m64l829r45Q573L899P740J7021j6719n769P987K050L13j3620
24571G91945n559P070j196l384M240l825k869O253p056K241k811j817j1714O30
24557G72148J0383Q599M521p196q879J0841l130r192j711P484J5650j737p693
24544G90088J732J0745l374j4523J953n79L463k513j182R034J07K217J9604j311
$$ plain form
24530 815461 821989 820680 803345 799081 792327 792739 805985 812637 820851 828283 821002 816386 804652 810307
24516 810307 814795 812855 809926 803629 799479 792819 799415 811867 803735 804433 813684 821342 808845 803902
24502 803902 813427 817070 822360 832918 817766 816347 826840 831435 833298 820117 793471 794220 807341
24489 807341 816830 820253 814540 817920 819688 818682 813893 801565 793648 799152 802371 807451 817897 826210
24475 826210 836776 836673 826062 813093 816122 818288 813301 809012 814577 825540 814689 817680 826020
24462 826020 821368 817419 821055 832442 833371 827129 811139 812104 823266 822123 813363 809653 808158 810520
24448 810520 815496 819355 820001 818863 812563 816573 823076 815641 814179 819442 827968 826181 823743 829526
24434 829526 829730 820699 817463 808868 803931 806543 806347 812764 826561 837930 836514 842674 845264 845527
$$ packed form
24530H15461O528j309j7335m264o754M12J3246O652Q214P432p281m616j1734N655
24516H10307M488j940k929o297m150o660O596J2452q132O98R251P658j2497m943
24502H03902R525L643N290J0558j5152j419J0493M595J863j3181k6646P49J3121
24489H07341R489L423n713L380J768j006m789j2328p917N504L219N080J0446Q313
24475H26210J0566j03j0611j2969L029K166m987m289N565J0963j0851K991Q340
24462H26020m652l949L636J1387R29o242j5990R65J1162j143q760l710j495K362
24448H10520M976L859O46j138o300M010O503p435j462N263Q526j787k438N783
24434H29526K04r031l236q595m937K612j96O417J3797J1369j416O160K590K63
$$ plain form
24420 845527 839049 824736 820054 829970 837234 833058 829579 833025 850714 855245 839990 829820 823653
24407 823653 820907 826777 838543 845906 844569 829604 824886 832730 841568 840404 836518 836806 824838 826655
24393 826655 833193 831705 824000 815073 816255 820016 839034 835726 829046 831807 833045 837145 838159 840627
24379 840627 836396 841689 836320 823430 830342 850946 859022 858110 845110 840854 835512 837480 834929 826243
24365 826243 822827 825753 830506 827767 817133 819369 826406 828727 835262 838847 847592 847145 852107 852163 852298
24350 852298 842386 837262 837462 855303 850294 833486 840431 847354 847503 846206 846155 845757 844767 841840 838807
24335 838807 834666 836409 839006 855862 868148 859041 854979 856412 858916 854527 855439 865866 858610 845623
24321 845623 848778 854303 847659 844198 848162 848888 856914 854003 850233 867214 868175 860475 852309 850367
$$ packed form
24420H45527o478j4313m682R916P264m176l479L446J7689M531j5255j0170o167
24407H23653k746N870J1766P363j337j4965m718P844Q838j164l886K88j1968J817
24393H26655O538j488p705q927J182L761J9018l308o680K761J238M100J014K468
24379H40627m231N293n369j2890O912K0604Q076r12j3000m256n342J968k551q686
24365H26243l416K926M753k739j0634K236P037K321O535L585Q745m47M962N6J35
24350H52298r912n124K00J7841n009j6808O945O923J49j297n1l98r90k927l033
24335H38807m141J743K597J6856J2286r107m062J433K504m389R12J0427p256j2987
24321H45623L155N525o644l461L964P26Q026k911l770J6981R61p700q166j942
$$ plain form
24307 850367 848940 842777 848296 842570 847381 849156 839671 849421 853712 859711 853770 847929 845177 852484
24293 852484 864124 869427 869622 867369 863224 854700 855558 864011 878464 868395 853046 855273 861411 866524
24279 866524 864106 849727 840206 848265 876864 888306 879049 865767 867127 861889 864795 867759 860810
24266 860810 867189 869496 861069 863422 871925 874907 867951 865428 867232 865454 867558 873529 875046 869459
24252 869459 874196 874474 870462 861643 866949 873363 870354 870135 875649 865668 868268 870447 874809 890450
24238 890450 890807 883877 881029 883113 884010 891347 878367 868282 865054 859799 850883 854688 848906 859492
24224 859492 873715 888842 893776 882526 876656 870392 884676 887897 881798 880989 879220 879086 875765 876445
24210 876445 886365 889810 886511 884042 876982 879829 883441 868287 864175 887840 901730 900429 889708
$$ packed form
24307H50367j427o163N519n726M811J775r485R750M291N999n941n841k752P307
24293H52484J1640N303J95k253m145q524Q58Q453J4453j0069j5349K227O138N113
24279H66524k418j4379r521Q059K8599J1442r257j3282J360n238K906K964o949
24266H60810O379K307q427K353Q503K982o956k523J804j778K104N971J517n587
24252H69459M737K78m012q819N306O414l009k19N514r981K600K179M362J5641
24238H90450L57o930k848K084Q97P337j2980j0085l228n255q916L805n782J0586
24224H59492J4223J5127M934j1250n870o264J4284L221o099q09j769j34l321O80
24210H76445R920L445l299k469p060K847L612j5154m112K3665J3890j301j0721
$$ plain form
24197 889708 879499 871901 873633 875301 876459 877825 885626 887633 880503 883723 884998 872470 867958 876736
24183 876736 888763 895135 897660 894931 900841 904521 900414 899312 896621 891352 897855 895918 889589 891514
24169 891514 890243 895712 891924 899408 904239 901882 902506 911755 914832 909609 908277 916443 915873 906350 890089
24154 890089 888715 890526 887566 899908 910856 912003 897171 885838 880330 894282 904401 904137 899063
24141 899063 895199 879419 889457 909281 907225 903040 902307 917330 910763 901448 901014 903193 904245 907059
24127 907059 903186 906496 905973 908029 906636 918362 926963 925697 916648 906776 905750 910540 908405 913579
24113 913579 915849 919532 922599 925014 927611 922885 916011 913765 910845 914147 918110 920228 931749 928682
24099 928682 925069 921522 911916 917462 917094 917354 915279 925387 928703 931051 928883 927110 921497 926303
$$ packed form
24197H89708j0209p598J732J668J158J366P801K007p130L220J275j2528m512Q778
24183H76736J2027O372K525k729N910L680m107j102k691n269O503j937o329J925
24169H91514j271N469l788P484M831k357O24R249L077n223j332Q166n70r523j6261
24154H90089j374J811k960J2342J0948J147j4832j1333n508J3952J0119k64n074
24141H99063l864j5780J0038J9824k056m185p33J5023o567r315m34K179J052K814
24127I07059l873L310n23K056j393J1726Q601j266r049r872j026M790k135N174
24113I13579K270L683L067K415K597m726o874k246k920L302L963K118J1521l067
24099I28682l613l547r606N546l68K60k075J0108L316K348k168j773n613M806
$$ plain form
24085 926303 921288 921349 924870 925306 934914 936500 913213 908157 906345 927408 934737 926466 914992 910949
24071 910949 905133 909398 916746 932236 947758 955930 944867 941123 938145 941806 939785 943929 946005
24058 946005 937524 933101 926727 927864 932800 937299 932545 928885 948401 943836 935709 919268 919439 928017
24044 928017 923904 916856 922463 922338 926955 930857 923488 923216 928701 935786 935186 927226 925643 920373 919834
24029 919834 927287 931062 932011 940571 952712 955183 956437 950889 947880 945396 930830 939987 940097 939733
24015 939733 933244 933559 934726 932235 929853 928604 923713 925154 931801 932031 939986 943843 959107 963055
24001 963055 950411 942867 943112 934236 938367 944615 952416 956833 948043 952911 956294 961032 952093 953761
23987 953761 964770 965951 963948 966232 971602 965519 957058 959508 965135 962353 961806 959718 949782 955623
$$ packed form
24085I26303n015O1L521M36R608J586k3287n056j812K1063P329q271j1474m043
24071I10949n816M265P348J5490J5522Q172j1063l744k978L661k021M144K076
24058I46005q481m423o374J137M936M499m754l660J9516m565q127j6441J71Q578
24044I28017m113p048N607j25M617L902p369k72N485P085o00p960j583n270n39
24029I19834P453L775R49Q560J2141K471J254n548l009k484j4566R157J10l64
24015I39733o489L15J167k491k382j249m891J441O647K30P955L857J5264L948
24001I63055j2644p544K45q876M131O248P801M417q790M868L383M738q939J668
23987I53761J1009J181k003K284N370o083q461K450N627k782n47k088r936N841
$$ plain form
23973 955623 956023 963446 972129 972220 971487 962798 961525 968279 975735 972405 977220 977143 964115 972805 979306
23958 979306 966304 970641 972062 973515 979721 982673 975863 975903 971847 962313 967620 977361 987258 983005
23944 983005 974333 974904 972129 968130 982513 987833 990784 995872 984812 966609 955869 947188 949905
23931 949905 956560 967312 973516 968246 961794 964254 963853 957857 952313 950309 944974 945417 961199 976502
23917 976502 980131 979630 984504 992138 993410 989671 991186 983769 973316 969377 979786 975931 977671 983942
23903 983942 985658 984541 981768 984394 976498 972389 981374 977801 982140 989893 996292 997629 984638 985292
23889 985292 987430 990670 984917 985672 983668 990254 997716 1007964 1008816 994820 979785 983584 988205 983403
23875 983403 987098 988443 995608 1000850 1004518 1012599 1016158 1012245 1002903 989333 994040 991712 984759 988308
$$ packed form
23973I55623M00P423Q683R1p33q689j273O754P456l330M815p7j3028Q690O501
23958I79306j3002M337J421J453O206K952o810M0m056r534N307R741R897m253
23944I83005q672N71k775l999J4383N320K951N088j1060j8203j0740q681K717
23931I49905O655J0752O204n270o452K460m01n996n544k004n335M43J5782J5303
23917I76502L629n01M874P634J272l739J515p417j0453l939J0409l855J740O271
23903I83942J716j117k773K626p896m109Q985l573M339P753O399J337j2991O54
23889I85292K138L240n753P55k004O586P462J0248Q52j3996j5035L799M621m802
23875I83403L695J345P165N242L668Q081L559l913r342j3570M707k328o953L549
$$ plain form
23861 988308 992441 998689 1006922 1014135 1016233 1015297 1015741 1014428 1012628 1010111 1003750 1006502 1013324 1013305 1007093
23846 1007093 996771 989659 989086 997893 1003540 998782 1004119 998650 985903 997571 1011644 1024866 1015487
23833 1015487 998647 996408 1001939 1008459 1013016 1010902 1017030 1024716 1028435 1033310 1030806 1020813 1011767 1015076
23819 1015076 1019509 1024146 1027414 1030773 1032541 1027604 1023055 1007105 1013011 1018926 1005550 1006985 1005795
23806 1005795 1011605 1020609 1025973 1027684 1033290 1038581 1035091 1036448 1039237 1035065 1032651 1027522 1028807 1026720
23792 1026720 1037309 1041934 1035526 1025546 1009930 1020112 1027165 1035291 1035854 1023473 1022263 1034434 1036220
23779 1036220 1037684 1036951 1041858 1033085 1026096 1032286 1032399 1034652 1031746 1033187 1040227 1033389 1034566 1041975
23765 1041975 1037457 1032789 1039633 1061888 1067774 1071154 1056612 1047142 1053766 1063427 1067391 1062919 1051555
$$ packed form
23861I88308M133O248Q233P213K098r36M44j313j800k517o361K752O822j9o212
23846A007093j0322p112n73Q807N647m758N337n469j2747J1668J4073J3222r379
23833A015487j6840k239N531O520M557k114O128P686L719M875k504r993r046L309
23819A015076M433M637L268L359J768m937m549j5950N906N915j3376J435j190
23806A005795N810R004N364J711N606N291l490J357K789m172k414n129J285k087
23792A026720J0589M625o408r980j5616J0182P053Q126N63j2381j210J2171J786
23779A036220J464p33M907q773o989O190J13K253k906J441P040o838J177P409
23765A041975m518m668O844K2255N886L380j4542r470O624R661L964m472j1364
$$ plain form
23752 1051555 1056934 1070555 1073622 1052175 1039735 1057970 1068251 1053498 1051643 1061364 1055923 1049168
23740 1049168 1038823 1038712 1048474 1048779 1055397 1062568 1063269 1063351 1044490 1030408 1038833 1043986 1050555 1057439
23726 1057439 1060726 1046196 1065479 1067319 1051162 1052040 1051222 1046339 1043938 1048282 1042544 1046783 1059765
23713 1059765 1058891 1051916 1060143 1078556 1078196 1064789 1059388 1071301 1071069 1068448 1072263 1067128 1061103 1058070
23699 1058070 1061214 1069871 1075570 1071683 1069505 1069315 1063675 1059835 1056313 1051214 1059373 1066244 1071022 1073688
23685 1073688 1074526 1076018 1072746 1083878 1083726 1079293 1076381 1075990 1083425 1091007 1088882 1078268 1076407 1074180
23671 1074180 1078379 1081980 1088378 1087400 1096008 1094656 1088733 1090235 1086095 1085956 1074637 1069761 1071641 1075662
23657 1075662 1078049 1088545 1091373 1092502 1087213 1089513 1083058 1093545 1092975 1100142 1110457 1096555 1077251
$$ packed form
23752A051555N379J3621L067k1447j2440J8235J0281j4753j855R721n441o755
23740A049168j0345j11R762L05O618P171P01Q2j8861j4082Q425N153O569O884
23726A057439L287j4530J9283J840j6157Q78q18m883k401M344n738M239J2982
23713A059765q74o975Q227J8413l60j3407n401J1913k32k621L815n135o025l033
23699A058070L144Q657N699l887k178j90n640l840l522n099Q159O871M778K666
23685A073688Q38J492l272J1132j52m433k912l91P435P582k125j0614j861k227
23671A074180M199L601O398r78Q608j352n923J502m140j39j1319m876J880M021
23657A075662K387J0496K828J129n289K300o455J0487n70P167J0315j3902j9304
$$ plain form
23644 1077251 1082642 1101765 1111354 1114921 1124806 1124136 1123321 1109253 1099333 1092683 1109747 1109170 1102943 1103658
23630 1103658 1107376 1091618 1091321 1095288 1095488 1091330 1092766 1089558 1102335 1106358 1108672 1109231 1112176 1114410
23616 1114410 1122142 1125318 1115244 1100078 1098852 1105008 1112424 1116929 1122828 1127064 1106586 1102264 1113625
23603 1113625 1122889 1121917 1113161 1105961 1104502 1112811 1118545 1128414 1136069 1133869 1127161 1130004 1131934 1131212
23589 1131212 1120570 1120752 1123078 1123421 1122188 1108499 1109684 1113917 1119312 1128786 1135442 1145424 1149497 1150432
23575 1150432 1138042 1119108 1129076 1135639 1133920 1134007 1126245 1123828 1127050 1132659 1146594 1143616 1153903
23562 1153903 1159210 1146971 1141177 1137447 1137694 1146067 1149366 1149825 1160128 1159647 1154772 1136908 1132114 1139565
23548 1139565 1130851 1133974 1148204 1146881 1145831 1157824 1162487 1161551 1156134 1147904 1144188 1153862 1172474
$$ packed form
23644A077251N391J9123R589L567R885o70q15j4068r920o650J7064n77o227P15
23630A103658L718j5758k97L967K00m158J436l208J2777M023K314N59K945K234
23616A114410P732L176j0074j5166j226O156P416M505N899M236k0478m322J1361
23603A113625R264r72q756p200j459Q309N734R869P655k200o708K843J930p22
23589A131212j0642J82K326L43j233j3689J185M233N395R474O656R982M073R35
23575A150432j2390j8934R968O563j719Q7p762k417L222N609J3935k978J0287
23562A153903N307j2239n794l730K47Q373L299M59J0303m81m875j7864m794P451
23548A139565q714L123J4230j323j050J1993M663r36n417q230l716R674J8612
$$ plain form
23535 1172474 1177489 1167623 1172061 1167240 1149862 1149040 1160473 1162091 1167993 1173396 1179552 1180040 1186280 1174962
23521 1174962 1162671 1166657 1169522 1166091 1169527 1169939 1164779 1164263 1161147 1165241 1167286 1167803 1169948 1175815
23507 1175815 1182313 1181336 1180571 1174442 1180147 1174403 1182890 1192268 1182823 1164889 1158394 1170944 1172775 1168575
23493 1168575 1163133 1170163 1177398 1181007 1172217 1167756 1177116 1192051 1197353 1183383 1181747 1193547 1199309
23480 1199309 1205952 1209900 1208860 1202863 1208640 1204253 1205627 1200607 1190559 1182207 1184270 1190337 1189206 1195562
23466 1195562 1192337 1191070 1190596 1191123 1193218 1196553 1206786 1201073 1206234 1211030 1207570 1203120 1202134 1203929
23452 1203929 1212227 1223993 1225453 1211340 1206620 1210897 1202566 1219185 1226419 1222920 1220876 1224605 1225426
23439 1225426 1222568 1223706 1218653 1214386 1208395 1212392 1216889 1219745 1220752 1214950 1209631 1219091 1238014 1242162
$$ packed form
23535A172474N015r866M438m821j7378q22J1433J618N902N403O156M88O240j1318
23521A174962j2291L986K865l431L436M12n160n16l116M094K045N17K145N867
23507A175815O498r77p65o129N705n744Q487R378r445j7934o495J2550J831m200
23493A168575n442P030P235L609q790m461R360J4935N302j3970j636J1800N762
23480A199309O643L948j040n997N777m387J374n020j0048q352K063O067j131O356
23466A195562l225j267m74N27K095L335J0233n713N161M796l460m450r86J795
23452A203929Q298J1766J460j4113m720M277q331J6619P234l499k044L729Q21
23439A225426k858J138n053m267n991L997M497K856J007n802n319R460J8923M148
$$ plain form
23425 1242162 1238433 1234167 1230784 1224677 1223732 1222584 1226731 1224763 1229126 1230595 1234526 1249366 1250633 1240474
23411 1240474 1235596 1233835 1237482 1230949 1229133 1239968 1247315 1247758 1245313 1241923 1237909 1232515 1230570 1238682
23397 1238682 1259613 1263514 1258400 1245713 1250761 1257109 1252801 1240272 1242961 1244199 1239478 1237759 1239418
23384 1239418 1249490 1233111 1238190 1252720 1258941 1262465 1256928 1252182 1249764 1250034 1258258 1259555 1265098
23371 1265098 1273804 1271071 1270321 1270009 1265912 1260465 1265238 1260945 1264158 1257526 1235555 1241242 1252287 1257570
23357 1257570 1271517 1274954 1274242 1272551 1275906 1286201 1293772 1273936 1258331 1258569 1265622 1263514 1262523 1259692
23343 1259692 1262883 1275119 1279725 1287246 1295941 1299868 1300525 1292824 1286317 1287603 1280750 1286758 1291825 1292642
23329 1292642 1285667 1281726 1275307 1275070 1272946 1282915 1284232 1289214 1307220 1310289 1292032 1274206 1278311
$$ packed form
23425A242162l729m266l383o107r45j148M147j968M363J469L931J4840J267j0159
23411A240474m878j761L647o533j816J0835P347M43k445l390m014n394j945Q112
23397A238682K0931L901n114j2687N048O348m308j2529K689J238m721j719J659
23384A239418J0072j6379N079J4530O221L524n537m746k418K70Q224J297N543
23371A265098Q706k733p50l12m097n447M773m293L213o632k1971N687J1045N283
23357A257570J3947L437p12j691L355J0295P571j9836j5605K38P053k108r91k831
23343A259692L191J2236M606P521Q695L927O57p701o507J286o853O008N067Q17
23329A292642o975l941o419k37k124R969J317M982J8006L069j8257j7826M105
$$ plain form
23316 1278311 1287625 1284906 1302871 1314274 1312147 1305266 1308666 1321147 1318832 1310168 1312151 1316121 1316563
23303 1316563 1313721 1317839 1323225 1324268 1327087 1326445 1316229 1311837 1305485 1309818 1315780 1314594 1316635 1305663
23289 1305663 1305884 1303968 1310026 1322564 1330151 1337226 1342853 1345530 1330586 1322288 1319915 1323746 1330086 1328731
23275 1328731 1333208 1339509 1346670 1336356 1333730 1337871 1334283 1330072 1326806 1342414 1334706 1323375 1344355
23262 1344355 1353158 1351685 1341627 1341340 1345606 1353582 1361869 1350502 1361971 1355559 1354557 1353461 1347371
23249 1347371 1335865 1337710 1342527 1354492 1357308 1351225 1352186 1344020 1355315 1361071 1357122 1365599 1368142
23236 1368142 1360539 1358995 1352685 1360923 1353854 1358561 1379134 1390021 1398319 1396038 1394698 1381850 1378314
23223 1378314 1387501 1395387 1391463 1381024 1367430 1373373 1384942 1389312 1383940 1387406 1389503 1398971 1402955
$$ packed form
23316A278311R314k719J7965J1403k127o881L400J2481k315q664J983L970M42
23303A316563k842M118N386J043K819o42j0216m392o352M333N962j186K041j0972
23289A305663K21j916O058J2538P587P075N627K677j4944q298k373L831O340j355
23275A328731M477O301P161j0314k626M141l588m211l266J5608p708j1331K0980
23262A344355Q803j473j0058k87M266P976Q287j1367J1469o412j002j096o090
23249A347371j1506J845M817J1965K816o083R61q166J1295N756l949Q477K543
23236A368142p603j544o310Q238p069M707K0573J0887Q298k281j340j2848l536
23223A378314R187P886l924j0439j3594N943J1569M370n372L466K097R468L984
$$ plain form
23210 1402955 1408850 1402142 1388818 1385103 1398589 1403383 1396301 1393095 1403801 1412097 1393443 1387380 1382233
23197 1382233 1387253 1399086 1404927 1398689 1392346 1393114 1402385 1411099 1412723 1408650 1416694 1431715 1438624 1422718
23183 1422718 1421642 1434545 1455330 1458870 1448780 1437674 1428011 1417755 1426584 1439373 1439243 1437480 1432117
23170 1432117 1432743 1438472 1432058 1425409 1420025 1426068 1428608 1441372 1433660 1429093 1414824 1414688 1415217 1429901
23156 1429901 1441037 1449774 1458643 1467479 1463339 1449691 1444983 1453068 1461053 1470258 1465340 1465017 1468878 1459766
23142 1459766 1460501 1457366 1455090 1452124 1460280 1467066 1465591 1460268 1458267 1464507 1471959 1476811 1463889 1464971
23128 1464971 1465501 1461168 1460315 1470274 1476100 1477686 1472638 1466614 1470789 1486596 1478886 1480843 1479443 1490598
23114 1490598 1491980 1479813 1477359 1482605 1491655 1488349 1480880 1495487 1505244 1502965 1496132 1494417 1490868
$$ packed form
23210A402955N895o708j3324l715J3486M794p082l206J0706Q296j8654o063n147
23197A382233N020J1833N841o238o343P68R271Q714J624m073Q044J5021O909j5906
23183A422718j076J2903K0785L540j0090j1106r663j0256Q829J2789j30j763n363
23170A432117O26N729o414o649n384O043K540J2764p712m567j4269j36N29J4684
23156A429901J1136Q737Q869Q836m140j3648m708Q085P985R205m918l23L861r112
23142A459766P35l135k276k966Q156O786j475n323k001O240P452M852j2922J082
23128A464971N30m333q53R959N826J586n048o024M175J5807p710J957j400J1155
23114A490598J382j2167k454N246R050l306p469J4607R757k279o833j715l549
$$ plain form
23101 1490868 1487766 1481154 1492629 1492602 1496883 1497272 1491447 1497556 1507162 1502746 1501737 1502598 1500411 1504530 1507178
23086 1507178 1496724 1492483 1502026 1514576 1521431 1516115 1522137 1517056 1523376 1530326 1534634 1541540 1534986
23073 1534986 1532878 1546867 1566318 1568953 1556720 1540698 1525537 1520802 1518634 1520411 1526004 1533625 1534878
23060 1534878 1540253 1533540 1537764 1538224 1547037 1558702 1562617 1554402 1540636 1542256 1548645 1551710 1560104 1562377
23046 1562377 1556805 1554033 1548457 1553889 1564863 1567084 1570154 1575804 1579146 1576491 1566212 1558088 1562543
23033 1562543 1575438 1576723 1573967 1559606 1575034 1585264 1586591 1589410 1587159 1572299 1574659 1578463 1575853
23020 1575853 1577480 1574299 1581729 1594126 1593941 1585574 1584309 1592937 1601677 1607678 1602921 1606042 1613259 1618213
23006 1618213 1634443 1627950 1617974 1611504 1608892 1599536 1603576 1616835 1620160 1637532 1631864 1625570 1632886
$$ packed form
23101A490868l102o612J1475k7M281L89n825O109R606m416j009Q61k187M119K648
23086A507178j0454m241R543J2550O855n316O022n081O320O950M308O906o554
23073A534986k108J3989J9451K635j2233j6022j5161m735k168J777N593P621J253
23060A534878N375o713M224M60Q813J1665L915q215j3766J620O389L065Q394K273
23046A562377n572k772n576N432J0974K221L070N650L342k655j0279q124M455
23033A562543J2895J285k756j4361J5428J0230J327K819k251j4860K360L804k610
23020A575853J627l181P430J2397j85q367j265Q628Q740O001m757L121P217M954
23006A618213J6230o493r976o470k612r356M040J3259L325J7372n668o294P316
$$ plain form
22993 1632886 1649967 1645903 1638133 1631964 1640389 1652453 1662304 1662872 1653132 1645924 1638806 1636615 1638444 1644540
22979 1644540 1646567 1640025 1650400 1658293 1662817 1655142 1659899 1663720 1668484 1680999 1677334 1671227 1662596
22966 1662596 1664404 1667731 1661860 1661645 1659082 1659776 1670564 1667631 1658584 1674430 1693716 1692383 1694618 1696500
22952 1696500 1700933 1700088 1709643 1715370 1698813 1693238 1700765 1713405 1718105 1708416 1702646 1698967 1695384 1699489
22938 1699489 1700702 1701213 1706579 1712748 1717227 1721849 1712643 1715725 1716028 1717155 1711088 1695599 1688998 1696927
22924 1696927 1706089 1713723 1716671 1727545 1743537 1738065 1740310 1732348 1727757 1748837 1752777 1737989 1737004
22911 1737004 1749477 1760304 1756933 1751083 1760919 1761364 1753484 1745036 1743534 1760643 1771500 1771054 1763239
22898 1763239 1763931 1766483 1766830 1772034 1768125 1772676 1778022 1784571 1776595 1777866 1789509 1788870 1775397 1776804
$$ packed form
22993A632886J7081m064p770o169Q425J2064R851N68r740p208p118k191J829O096
22979A644540K027o542J0375P893M524p675M757L821M764J2515l665o107q631
22966A662596J808L327n871k15k563O94J0788k933r047J5846J9286j333K235J882
22952A696500M433q45R555N727j6557n575P527J2640M700r689n770l679l583M105
22938A699489J213N11N366O169M479M622r206L082L03J127o067j5489o601P929
22924A696927R162P634K948J0874J5992n472K245p962m591K1080L940j4788r85
22911A737004J2473J0827l371n850R836M45p880q448j502J7109J0857m46p815
22898A763239O92K552L47N204l909M551N346O549p976J271J1643o39j3473J407
$$ plain form
22884 1776804 1791728 1801634 1787800 1778199 1793189 1793240 1801355 1820852 1836708 1834110 1837387 1821904 1814863
22871 1814863 1822428 1829290 1829304 1825480 1828374 1825357 1826275 1822734 1821382 1825726 1826072 1821739 1824989 1827178 1827468
22856 1827468 1843600 1848445 1851447 1858308 1847633 1839854 1850375 1857324 1855662 1853793 1864761 1867015 1868232
22843 1868232 1864296 1863237 1865539 1864894 1876401 1889609 1896957 1888274 1875609 1880050 1886528 1890766 1893993
22830 1893993 1882381 1883064 1886232 1882627 1884711 1889274 1888916 1905078 1916577 1904355 1899532 1908963 1923868
22817 1923868 1934502 1931729 1937693 1942830 1938070 1925021 1924405 1932495 1941037 1940086 1955943 1962491 1957138 1953257
22803 1953257 1953462 1954530 1959055 1961523 1961577 1958188 1980092 1986274 1984481 1978641 1976998 1970274 1958662 1968879
22789 1968879 1977076 1973769 1968901 1972752 1980333 1985267 1986255 2007059 2016651 2011490 2018973 2025277 2023852 2016921
$$ packed form
22884A776804J4924R906j3834r601J4990N1Q115J9497J5856k598L277j5483p041
22871A814863P565O862J4l824K894l017R18l541j352M344L46m333L250K189K90
22856A827468J6132M845L002O861j0675p779J0521O949j662j869J0968K254J217
22843A868232l936j059K302o45J1507J3208P348q683j2665M441O478M238L227
22830A893993j1612O83L168l605K084M563l58J6162J1499j2222m823R431J4905
22817A923868J0634k773N964N137m760j3049o16Q090Q542r51J5857O548n353l881
22803A953257K05J068M525K468N4l389K1904O182j793n840j643o724j1612J0217
22789A968879Q197l307m868L851P581M934R88K0804R592n161P483O304j425o931
$$ plain form
22775 2016921 2004579 2008002 2013575 2017802 2022172 2015335 2019310 2014981 2024160 2025747 2018799 2021295 2019553 2023082
22761 2023082 2037966 2039444 2032546 2045914 2055618 2061505 2059565 2056484 2054998 2071063 2083107 2084603 2094929
22748 2094929 2100025 2100550 2106188 2112736 2108999 2101280 2089651 2085437 2102502 2120282 2121175 2122944 2120068 2113875
22734 2113875 2109434 2114280 2114888 2115768 2119794 2116236 2123307 2135847 2146049 2158680 2163510 2163337 2165952 2167113
22720 2167113 2165582 2170263 2172360 2168807 2177787 2188675 2193188 2189145 2192171 2200792 2210713 2215503 2215228 2230473
22706 2230473 2232947 2219213 2210016 2208171 2215616 2228504 2243592 2254548 2254948 2247557 2251660 2260851 2257890
22693 2257890 2256574 2246445 2241521 2252598 2264635 2275917 2285881 2283092 2288473 2303646 2308924 2312309 2328135
22680 2328135 2331120 2326787 2327448 2325816 2337836 2348316 2348800 2343800 2350196 2361566 2367552 2361173 2360229 2371858
$$ packed form
22775B016921j2342L423N573M227M370o837L975m329R179J587o948K496j742L529
22761B023082J4884J478o898J3368R704N887j940l081j486J6065J2044J496J0326
22748B094929N096N25N638O548l737p719j1629m214J7065J7780Q93J769k876o193
22734B113875m441M846O08Q80M026l558P071J2540J0202J2631M830j73K615J161
22720B167113j531M681K097l553Q980J0888M513m043L026Q621R921M790k75J5245
22706B230473K474j3734r197j845P445J2888J5088J0956M00p391M103R191k961
22693B257890j316j0129m924J1077J2037J1282R964k789N381J5173N278L385J5826
22680B328135K985m333O61j632J2020J0480M84n000O396J1370N986o379r44J1629
$$ plain form
22666 2371858 2382349 2395205 2399599 2406732 2417292 2438259 2449291 2458913 2466318 2475311 2485194 2482643 2490442
22653 2490442 2511458 2537120 2555248 2565868 2560992 2575576 2605245 2630339 2652765 2672462 2691472
22642 2691472 2724021 2772912 2813869 2871170 2938248 3009845 3075769 3163416 3286378 3425362 3531508
22631 3531508 3452444 3112915 2704041 2190294 1703418 1463097 1384208 1360946 1414755 1515694
22621 1515694 1626048 1710080 1780337 1842892 1877128 1925603 1981215 2019446 2041156 2057758 2086111
22610 2086111 2104173 2126493 2158871 2173798 2179253 2188357 2207856 2229422 2244656 2249537 2256334 2262495
22598 2262495 2282661 2300626 2317641 2321716 2325350 2332050 2340429 2348032 2349965 2362152 2367811 2390469 2398004
22585 2398004 2400340 2398622 2396294 2404496 2419310 2424938 2442428 2447704 2446261 2443686 2452379 2454944 2465146
$$ packed form
22666B371858J0491J2856M394P133J0560K0967J1032R622P405Q993R883k551P799
22653B490442K1016K5662J8128J0620m876J4584K9669K5094K2426J9697J9010
22642B691472L2549M8891M0957N7301O7078P1597O5924Q7647J22962J38984J06146
22631C531508p9064l39529m08874n13747m86876k40321p8889k3262N3809J00939
22621A515694J10354Q4032P0257O2555L4236M8475N5612L8231K1710J6602K8353
22610B086111J8062K2320L2378J4927N455R104J9499K1566J5234M881O797O161
22598B262495K0166J7965J7015M075L634O700Q379P603J933J2187N659K2658P535
22585B398004K336j718k328Q202J4814N628J7490N276j443k575Q693K565J0202
$$ plain form
22572 2465146 2470967 2484487 2484940 2482888 2480193 2491470 2503446 2502559 2503791 2514376 2521759 2534497 2550364
22559 2550364 2552674 2548184 2543306 2558431 2572806 2563798 2560929 2573333 2573987 2582923 2597561 2594496 2590781
22546 2590781 2592501 2606778 2611305 2631577 2629764 2634618 2637133 2651785 2651324 2662436 2677311 2673942 2676541
22533 2676541 2689684 2702262 2698707 2703641 2710427 2695956 2692218 2712976 2732760 2730899 2728802 2730087 2719068
22520 2719068 2715792 2708896 2710638 2719093 2725908 2741548 2756968 2772326 2771781 2773269 2768730 2771642 2778341
22507 2778341 2785063 2807205 2813294 2818217 2822059 2838896 2845946 2857005 2872404 2870156 2865705 2857115 2861225
22494 2861225 2863967 2873781 2881929 2883700 2891414 2904647 2913421 2912242 2912422 2926319 2943611 2950735 2965637
22481 2965637 2973928 2982316 2984729 2993011 3002110 2999368 2999588 3006326 3015179 3032250 3040185 3035688 3049638 3080761
$$ packed form
22572B465146N821J3520M53k052k695J1277J1976q87J232J0585P383J2738J5867
22559B550364K310m490m878J5125J4375r008k869J2404O54Q936J4638l065l715
22546B590781J720J4277M527K0272j813M854K515J4652m61J1112J4875l369K599
22533B676541J3143J2578l555M934O786j4471l738K0758J9784j861k097J285j1019
22520B719068l276o896J742Q455O815J5640J5420J5358n45J488m539K912O699
22507B778341O722K2142O089M923L842J6837P050J1059J5399k248m451q590M110
22494B861225K742R814Q148J771P714J3233Q774j179J80J3897J7292P124J4902
22481B965637Q291Q388K413Q282R099k742K20O738Q853J7071P935m497J3950L1123
$$ plain form
22467 3080761 3081885 3086855 3110103 3126847 3134616 3147054 3152977 3163867 3158536 3145502 3147620 3145752 3146414
22454 3146414 3153727 3157239 3167944 3162544 3160249 3182660 3207669 3205580 3193652 3201833 3211532 3234876 3241450
22441 3241450 3257536 3277483 3281360 3270844 3262576 3261477 3269264 3288867 3314676 3316600 3310538 3307568 3318028
22428 3318028 3337148 3348077 3355361 3363536 3369476 3375090 3383109 3377170 3387626 3406450 3419562 3424733 3439224
22415 3439224 3439113 3445618 3456250 3463139 3463686 3481290 3504915 3518528 3534068 3538275 3542776 3536621 3545342
22402 3545342 3549883 3552288 3568427 3578412 3593905 3604695 3608143 3610458 3628610 3645147 3655949 3647724
22390 3647724 3657270 3683069 3706775 3716274 3714131 3717692 3725516 3733327 3746465 3759277 3768386 3770919 3785996
22377 3785996 3784083 3792913 3811229 3821974 3829106 3842000 3857351 3879772 3886744 3891085 3901421 3918230
$$ packed form
22467C080761J124M970K3248J6744P769J2438N923J0890n331j3034K118j868O62
22454C146414P313L512J0705n400k295K2411K5009k089j1928Q181R699K3344O574
22441C241450J6086J9947L877j0516q268j099P787J9603K5809J924o062k970J0460
22428C318028J9120J0929P284Q175N940N614Q019n939J0456J8824J3112N171J4491
22415C439224j11O505J0632O889N47J7604K3625J3613J5540M207M501o155Q721
22402C545342M541K405J6139R985J5493J0790L448K315J8152J6537J0802q225
22390C647724R546K5799K3706R499k143L561P824P811J3138J2812R109K533J5077
22377C785996j913Q830J8316J0745P132J2894J5351K2421O972M341J0336J6809
$$ plain form
22365 3918230 3918249 3934648 3954686 3967021 3988412 3993911 3988285 3998571 4001079 4008874 4017849 4024393 4033045
22352 4033045 4044371 4067004 4074219 4085939 4104020 4116937 4115494 4124752 4151644 4169529 4185258 4212214
22340 4212214 4237188 4249727 4267380 4288483 4291176 4292735 4319911 4338680 4341488 4357955 4373171 4388974
22328 4388974 4406340 4419996 4439037 4453664 4470536 4499738 4517070 4526725 4536309 4553167 4574588 4590704
22316 4590704 4613987 4670575 4721458 4751899 4752715 4776266 4741402 4701228 4698687 4685157 4692830 4680415
22304 4680415 4658134 4653877 4640848 4641607 4670840 4713162 4733380 4747914 4761230 4792152 4827528 4849234
22292 4849234 4869784 4896908 4930947 4959845 4983100 4993171 5010569 5034931 5068949 5097601 5111818
22281 5111818 5130461 5127869 5150170 5165417 5181843 5190359 5204339 5229596 5249472 5269286 5288933 5330869
$$ packed form
22365C918230J9J6399K0038J2335K1391N499n626J0286K508P795Q975O544Q652
22352D033045J1326K2633P215J1720J8081J2917j443R258K6892J7885J5729K6956
22340D212214K4974J2539J7653K1103K693J559K7176J8769K808J6467J5216J5803
22328D388974J7366J3656J9041J4627J6872K9202J7332R655R584J6858K1421J6116
22316D590704K3283N6588N0883L0441Q16K3551l4864m0174k541j3530P673j2415
22304D680415k2281m257j3029P59K9233M2322K0218J4534J3316L0922L5376K1706
22292D849234K0550K7124L4039K8898K3255J0071J7398K4362L4018K8652J4217
22281E111818J8643k592K2301J5247J6426Q516J3980K5257J9876J9814J9647M1936
$$ plain form
22269 5330869 5364095 5399052 5426199 5442089 5476645 5510157 5536406 5552229 5563573 5568906 5578487 5609153
22257 5609153 5651251 5680277 5703760 5710644 5724462 5747469 5780103 5803738 5834182 5859453 5897458
22246 5897458 5973066 6106112 6289553 6453094 6613577 6706968 6712579 6687909 6644250 6606877 6585602
22235 6585602 6580056 6573896 6581696 6597295 6617588 6643167 6665089 6699219 6735227 6767096 6792990 6826688
22223 6826688 6862336 6898010 6922324 6950664 6979278 7007646 7053387 7103808 7145850 7184181 7244479
22212 7244479 7302917 7343949 7386248 7416425 7460518 7492045 7496191 7519935 7552355 7579612 7607195
22201 7607195 7658951 7719696 7773254 7826789 7884102 7956283 8023785 8084072 8149575 8203603 8265690
22190 8265690 8344300 8417679 8481909 8554188 8623802 8688100 8741225 8788456 8826959 8891102 8983552
$$ packed form
22269E330869L3226L4957K7147J5890L4556L3512K6249J5823J1344N333R581L0666
22257E609153M2098K9026K3483O884J3818K3007L2634K3635L0444K5271L8005
22246E897458P5608J33046J83441J63541J60483R3391N611k4670m3659l7373k1275
22235F585602n546o160P800J5599K0293K5579K1922L4130L6008L1869K5894L3698
22223F826688L5648L5674K4314K8340K8614K8368M5741N0421M2042L8331O0298
22212G244479N8438M1032M2299L0177M4093L1527M146K3744L2420K7257K7583
22201G607195N1756O0745N3558N3535N7313P2181O7502O0287O5503N4028O2087
22190H265690P8610P3379O4230P2279O9614O4298N3125M7231L8503O4143R2450
$$ plain form
22179 8983552 9066861 9163645 9245550 9301519 9372373 9437856 9504585 9590879 9664854 9751200 9829100
22168 9829100 9912245 10005893 10122833 10251159 10352490 10451458 10571174 10683582 10796010 10915630
22158 10915630 11031308 11154549 11300885 11467416 11641900 11842530 12082599 12306682 12346107
22149 12346107 12117814 11839883 11459538 11100860 10981624 11040816 11174078 11354831 11588205
22140 11588205 11826031 12038461 12220111 12403651 12594020 12772622 12940926 13113439 13303473
22131 13303473 13496496 13673361 13861579 14056110 14247757 14456706 14660337 14847720 15077321
22122 15077321 15316371 15567377 15826861 16054524 16289248 16522941 16766587 17007640 17255772
22113 17255772 17517440 17790770 18067013 18357265 18671702 19002656 19358701 19723810 20093016
$$ packed form
22179H983552Q3309R6784Q1905N5969P0854O5483O6729Q6294P3975Q6346P7900
22168I829100Q3145R3648J16940J28326J01331R8968J19716J12408J12428J19620
22158A0915630J15678J23241J46336J66531J74484K00630K40069K24083L9425
22149A2346107k28293k77931l80345l58678j19236N9192J33262J80753K33374
22140A1588205K37826K12430J81650J83540J90369J78602J68304J72513J90034
22131A3303473J93023J76865J88218J94531J91647K08949K03631J87383K29601
22122A5077321K39050K51006K59484K27663K34724K33693K43646K41053K48132
22113A7255772K61668K73330K76243K90252L14437L30954L56045L65109L69206
$$ plain form
22104 20093016 20492412 20901450 21338596 21794072 22268331 22762493 23256484 23759661 24273656
22095 24273656 24810810 25366392 25960451 26610697 27287188 28007296 28766880 29558987 30393277
22086 30393277 31283237 32238242 33249791 34331711 35451232 36616181 37874006 39229932
22078 39229932 40673784 42234607 43908339 45734975 47718529 49887003 52273921 54893819
22070 54893819 57831936 61164799 64973162 69285993 74215770 79942486 86546909 94290372
22062 94290372 103485739 114444899 127558117 143353279 162831512 186763076 210573815
22055 210573815 211169762 159499633 87468470 5392698 -89437497 -149918904 -173642118
22048 -173642118 -180423984 -176257881 -160761687 -141788947 -125361967 -112230984 -101787225
$$ packed form
22104B0093016L99396M09038M37146M55476M74259M94162M93991N03177N13995
22095B4273656N37154N55582N94059O50246O76491P20108P59584P92107Q34290
22086C0393277Q89960R55005J011549J081920J119521J164949J257825J355926
22078C9229932J443852J560823J673732J826636J983554K168474K386918K619898
22070E4893819K938117L332863L808363M312831M929777N726716O604423P743463
22062I4290372R195367J0959160J3113218J5795162J9478233K3931564K3810739
22055B10573815N95947n1670129p2031163q2075772r4830195o0481407k3723214
22048a73642118o781866M166103J5496194J8972740J6426980J3130983J0443759
$$ plain form
22041 -101787225 -93304502 -86235830 -80187239 -74919103 -70318960 -66232686 -62517604 -59164194
22033 -59164194 -56149705 -53378985 -50851993 -48571098 -46485682 -44576215 -42788847 -41115877
22025 -41115877 -39569449 -38138952 -36784711 -35550075 -34424882 -33345696 -32324408 -31365223
22017 -31365223 -30458789 -29624581 -28843230 -28088152 -27368721 -26674355 -25997580 -25351386 -24739482
22008 -24739482 -24152437 -23586833 -23052164 -22555410 -22079732 -21620853 -21191100 -20772035 -20369325
21999 -20369325 -19968716 -19589690 -19219782 -18864618 -18514087 -18167580 -17807697 -17451795 -17115919
21990 -17115919 -16803892 -16502635 -16194695 -15897759 -15619843 -15358648 -15114950 -14894518 -14678237
21981 -14678237 -14447642 -14223566 -14005693 -13800344 -13603257 -13396114 -13188390 -12989190 -12785213
$$ packed form
22041a01787225Q482723P068672O048591N268136M600143M086274L715082L353410
22033e9164194L014489K770720K526992K280895K085416J909467J787368J672970
22025d1115877J546428J430497J354241J234636J125193J079186J021288R59185
22017c1365223R06434Q34208P81351P55078P19431O94366O76775O46194O11904
22008b4739482N87045N65604N34669M96754M75678M58879M29753M19065M02710
21999b0369325M00609L79026L69908L55164L50531L46507L59883L55902L35876
21990a7115919L12027L01257L07940K96936K77916K61195K43698K20432K16281
21981a4678237K30595K24076K17873K05349J97087K07143K07724J99200K03977
$$ plain form
21972 -12785213 -12575120 -12380679 -12181493 -11984716 -11781013 -11569304 -11363381 -11143454 -10935748
21963 -10935748 -10729392 -10495812 -10251592 -9994110 -9741399 -9615481 -9794059 -10095943 -10463399
21954 -10463399 -10898778 -11121833 -11145713 -11064145 -10919303 -10710048 -10470621 -10250822 -10063282 -9905241
21944 -9905241 -9755011 -9618253 -9485903 -9365879 -9247264 -9143398 -9048339 -8960946 -8873439 -8771350
21934 -8771350 -8671177 -8574257 -8464430 -8371757 -8290880 -8194021 -8080026 -8007818 -7959060 -7916088 -7890089
21923 -7890089 -7875313 -7843547 -7799773 -7746861 -7687214 -7615236 -7535681 -7460422 -7401560 -7332093 -7284660
21912 -7284660 -7241099 -7179483 -7108596 -7056324 -7010611 -6967858 -6923435 -6883616 -6841497 -6785104 -6720675
21901 -6720675 -6657672 -6582289 -6504976 -6442567 -6386404 -6334285 -6276111 -6223295 -6170476 -6131950 -6099552
$$ packed form
21972a2785213K10093J94441J99186J96777K03703K11709K05923K19927K07706
21963a0935748K06356K33580K44220K57482K52711J25918j78578l01884l67456
21954a0463399m35379k23055k3880Q1568J44842K09255K39427K19799J87540J58041
21944i905241J50230J36758J32350J20024J18615J03866R5059Q7393Q7507J02089
21934h771350J00173R6920J09827R2673Q0877R6859J13995P2208M8758M2972K5999
21923g890089J4776L1766M3774N2912N9647P1978P9555P5259N8862O9467M7433
21912g284660M3561O1616P0887N2272M5713M2753M4423L9819M2119N6393O4429
21901f720675O3003P5383P7313O2409N6163N2119N8174N2816N2819L8526L2398
$$ plain form
21890 -6099552 -6055299 -6013686 -5981479 -5930957 -5894662 -5873320 -5837427 -5792483 -5746873 -5695185 -5644108
21879 -5644108 -5596730 -5537970 -5489717 -5458835 -5416157 -5382238 -5343469 -5291056 -5242446 -5194625 -5133528
21868 -5133528 -5047628 -4951098 -4828152 -4692644 -4602322 -4582014 -4593754 -4682056 -4798822 -4890524 -4940772
21857 -4940772 -4971488 -4976235 -4978754 -4969907 -4948005 -4906673 -4861272 -4821981 -4790255 -4763482 -4738704 -4710980
21845 -4710980 -4670947 -4622990 -4590532 -4565883 -4543858 -4512817 -4495659 -4478880 -4456307 -4444408 -4429325
21834 -4429325 -4416600 -4408125 -4388311 -4362255 -4333838 -4290425 -4255235 -4219039 -4187031 -4163091 -4135606
21823 -4135606 -4112906 -4099623 -4097138 -4078658 -4058309 -4038969 -4021550 -4000173 -3974192 -3952085 -3939957
21812 -3939957 -3927119 -3904221 -3890022 -3872842 -3852606 -3834694 -3815176 -3794736 -3782202 -3767980 -3754741
$$ packed form
21890f099552M4253M1613L2207N0522L6295K1342L5893M4944M5610N1688N1077
21879e644108M7378N8760M8253L0882M2678L3919L8769N2413M8610M7821O1097
21868e133528Q5900R6530J22946J35508R0322K0308j1740q8302j16766r1702n0248
21857d940772l0716m747k519Q847K1902M1332M5401L9291L1726K6773K4778K7724
21845d710980M0033M7957L2458K4649K2025L1041J7158J6779K2573J1899J5083
21834d429325J2725Q475J9814K6056K8417M3413L5190L6196L2008K3940K7485
21823d135606K2700J3283K485J8480K0349J9340J7419K1377K5981K2107J2128
21812c939957J2838K2898J4199J7180K0236J7912J9518K0440J2534J4222J3239
$$ plain form
21801 -3754741 -3728348 -3691577 -3671446 -3667481 -3655342 -3635081 -3615081 -3591959 -3567680 -3543760 -3516938
21790 -3516938 -3497908 -3497101 -3501133 -3498853 -3487047 -3468797 -3446586 -3436734 -3416820 -3387874 -3374318 -3360413
21778 -3360413 -3346583 -3329333 -3310936 -3296426 -3288878 -3275180 -3264878 -3250640 -3233835 -3217607 -3197404
21767 -3197404 -3174673 -3163924 -3152691 -3139094 -3124603 -3129593 -3132899 -3123027 -3107936 -3084426 -3059372 -3051499
21755 -3051499 -3030388 -3019547 -3018333 -3006047 -2981837 -2966782 -2949036 -2926337 -2907232 -2905490 -2898785 -2894995
21743 -2894995 -2893990 -2878277 -2851885 -2834565 -2824429 -2826425 -2817489 -2808092 -2798781 -2774915 -2756109 -2758320
21731 -2758320 -2761501 -2750633 -2728233 -2718218 -2701115 -2688880 -2678092 -2665772 -2653690 -2653994 -2645411 -2626774
21719 -2626774 -2629324 -2615298 -2600278 -2594860 -2576319 -2559722 -2540220 -2536396 -2538682 -2539137 -2525649 -2509287
$$ packed form
21801c754741K6393L6771K0131L965J2139K0261K0000K3122K4279K3920K6822
21790c516938J9030Q07m032K280J1806J8250K2211R852J9914K8946J3556J3905
21778c360413J3830J7250J8397J4510P548J3698J0302J4238J6805J6228K0203
21767c197404K2731J0749J1233J3597J4491m990l306R872J5091K3510K5054P873
21755c051499K1111J0841J214J2286K4210J5055J7746K2699J9105J742O705L790
21743b894995J005J5713K6392J7320J0136j996Q936R397R311K3866J8806k211
21731b758320l181J0868K2400J0015J7103J2235J0788J2320J2082l04Q583J8637
21719b626774k550J4026J5020N418J8541J6597J9502L824k286m55J3488J6362
$$ plain form
21707 -2509287 -2502045 -2494318 -2494163 -2481912 -2461149 -2452274 -2445513 -2437367 -2420412 -2415118 -2410430 -2398255 -2386341
21694 -2386341 -2368131 -2350993 -2349180 -2353791 -2344775 -2341938 -2346972 -2337039 -2331887 -2319838 -2299023 -2296479 -2286581
21681 -2286581 -2278764 -2268038 -2254797 -2242604 -2232598 -2215646 -2204290 -2211745 -2211176 -2198596 -2189885 -2173135
21669 -2173135 -2168535 -2162008 -2155259 -2152972 -2139388 -2140344 -2136596 -2123461 -2111731 -2113122 -2112547 -2099151 -2093184
21656 -2093184 -2078522 -2072194 -2059488 -2050963 -2033273 -2030651 -2024982 -2018153 -2013035 -2018122 -2007450 -1987288 -1968353
21643 -1968353 -1964859 -1956722 -1946776 -1943205 -1955240 -1962075 -1935971 -1921110 -1918868 -1926316 -1925150 -1909749 -1903394
21630 -1903394 -1896585 -1886133 -1878500 -1871083 -1873732 -1868016 -1854090 -1848876 -1841634 -1837861 -1833568 -1822665 -1823387
21617 -1823387 -1813712 -1805584 -1808279 -1814389 -1820695 -1815023 -1795555 -1775823 -1771684 -1755240 -1758807 -1761355 -1735179
$$ packed form
21707b509287P242P727J55J2251K0763Q875O761Q146J6955N294M688J2175J1914
21694b386341J8210J7138J813m611R016K837n034R933N152J2049K0815K544R898
21681b286581P817J0726J3241J2193J0006J6952J1356p455N69J2580Q711J6750
21669b173135M600O527O749K287J3584r56L748J3135J1730j391N75J3396N967
21656b093184J4662O328J2706Q525J7690K622N669O829N118n087J0672K0162J8935
21643a968353L494Q137R946L571j2035o835K6104J4861K242p448J166J5401O355
21630a903394O809J0452P633P417k649N716J3926N214P242L773M293J0903p22
21617a823387R675Q128k695o110o306N672J9468J9732M139J6444l567k548K6176
$$ plain form
21604 -1735179 -1730166 -1734155 -1726059 -1721528 -1714633 -1704507 -1705957 -1721676 -1724278 -1725747 -1718432 -1711435 -1711474 -1712508
21590 -1712508 -1708555 -1700941 -1696944 -1676572 -1657584 -1636399 -1627844 -1633905 -1632506 -1602472 -1592714 -1589222 -1598472
21577 -1598472 -1599889 -1607235 -1593287 -1570325 -1552464 -1548573 -1543149 -1538881 -1540290 -1541840 -1533195 -1517494 -1504112
21564 -1504112 -1495090 -1503601 -1509429 -1518225 -1506409 -1508593 -1501639 -1484893 -1475847 -1463709 -1460099 -1444817 -1438690
21551 -1438690 -1436180 -1436775 -1433612 -1433868 -1425508 -1428271 -1415614 -1395344 -1385402 -1378463 -1379367 -1367160 -1359997 -1354801
21537 -1354801 -1350210 -1349552 -1349795 -1354452 -1352014 -1353047 -1339955 -1332215 -1317777 -1310801 -1312873 -1313125 -1311272 -1307166
21523 -1307166 -1306551 -1309533 -1303080 -1302964 -1291497 -1284330 -1282405 -1274523 -1262306 -1250373 -1245610 -1240811 -1231770 -1212311
21509 -1212311 -1205955 -1202571 -1200130 -1195161 -1180803 -1172371 -1162864 -1148943 -1150701 -1146971 -1136162 -1124346 -1114399
$$ packed form
21604a735179N013l989Q096M531O895J0126j450j5719k602j469P315O997l9j034
21590a712508L953P614L997K0372J8988K1185Q555o061J399L0034R758L492r250
21577a598472j417p346J3948K2962J7861L891N424M268j409j550Q645J5701J3382
21564a504112R022q511n828q796J1816k184O954J6746R046J2138L610J5282O127
21551a438690K510n95L163k56Q360k763J2657K0270R942O939r04J2207P163N196
21537a354801M591O58k43m657K438j033J3092P740J4438O976k072k52J853M106
21523a307166O15k982O453J16J1467P167J925P882J2217J1933M763M799R041J9459
21509a212311O356L384K441M969J4358Q432R507J3921j758L730J0809J1816R947
$$ plain form
21496 -1114399 -1099080 -1076045 -1068269 -1065670 -1057236 -1049864 -1032575 -1016659 -1004768 -975465 -954123 -936493
21484 -936493 -910395 -884656 -866437 -842472 -819026 -782543 -747237 -690739 -626266 -551896 -484356
21473 -484356 -397450 -266497 -121942 -8527 -100061 -439000 -847579 -1353246 -1838359 -2083397
21463 -2083397 -2160130 -2165304 -2115871 -2024783 -1918984 -1828760 -1756212 -1691724 -1642891 -1627056 -1602354
21452 -1602354 -1565197 -1521804 -1479474 -1468609 -1452997 -1429332 -1413397 -1407688 -1394962 -1371402 -1359168
21441 -1359168 -1343115 -1320701 -1303194 -1294707 -1279627 -1276206 -1273384 -1259442 -1241732 -1228986 -1220781 -1224639
21429 -1224639 -1215476 -1203451 -1198483 -1204922 -1211174 -1207568 -1203478 -1197938 -1192575 -1185061 -1179822 -1173776 -1162902
21416 -1162902 -1158027 -1153787 -1147108 -1126342 -1120051 -1117114 -1113357 -1110208 -1109263 -1104586 -1107782 -1109174 -1105831 -1100970
$$ packed form
21496a114399J5319K3035P776K599Q434P372J7289J5916J1891K9303K1342J7630
21484i36493K6098K5739J8219K3965K3446L6483L5306N6498O4473P4370O7540
21473d84356Q6906J30953J44555J13415r1534l38939m08579n05667m85113k45038
21463b083397p6733n174M9433R1088J05799R0224P2548O4488M8833J5835K4702
21452a602354L7157M3393M2330J0865J5612K3665J5935N709J2726K3560J2234
21441a359168J6053K2414J7507Q487J5080L421K822J3942J7710J2746Q205l858
21429a224639R163J2025M968o439o252L606M090N540N363P514N239O046J0874
21416a162902M875M240O679K0766O291K937L757L149R45M677l196j392L343M861
$$ plain form
21402 -1100970 -1088086 -1082860 -1092200 -1094209 -1081860 -1066090 -1055949 -1050931 -1062634 -1072381 -1071757 -1068837 -1058280
21389 -1058280 -1052784 -1051859 -1043779 -1036969 -1033189 -1026481 -1017313 -995175 -978275 -986771 -991308 -992980 -994159 -1001205
21375 -1001205 -993034 -983451 -983252 -974585 -968866 -954527 -963780 -975043 -979381 -973697 -964857 -964601 -965813 -963136
21361 -963136 -968750 -956329 -957688 -944240 -929450 -929044 -938340 -938579 -922041 -907808 -912694 -915651 -919963
21348 -919963 -920302 -901307 -885514 -892251 -894039 -892287 -897460 -905656 -897988 -892033 -894809 -900133 -903827 -893623
21334 -893623 -881423 -872631 -861165 -849705 -839325 -838848 -851940 -854257 -858515 -860948 -862380 -855015 -845128
21321 -845128 -842735 -832090 -827702 -835680 -839802 -845665 -841366 -831643 -824659 -807057 -798334 -806872 -805686 -802779
21307 -802779 -806435 -803324 -812240 -816107 -808847 -801862 -810082 -810552 -806742 -808271 -791739 -779584 -792802 -785674
$$ packed form
21402a100970J2884N226r340k009J2349J5770J0141N018j1703r747O24K920J0557
21389a058280N496R25Q080O810L780O708R168K2138J6900q496m537j672j179p046
21375a001205Q171R583J99Q667N719J4339r253j1263m338N684Q840K56j212K677
21361i63136n614J2421j359J3448J4790M06r296k39J6538J4233m886k957m312
21348i19963l39J8995J5793o737j788J752n173q196P668N955k776n324l694J0204
21334h93623J2200Q792J1466J1460J0380M77j3092k317m258k433j432P365R887
21321h45128K393J0645M388p978m122n863M299R723O984J7602Q723q538J186K907
21307h02779l656L111q916l867P260O985q220m70L810j529J6532J2155j3218P128
$$ plain form
21293 -785674 -768334 -773101 -780165 -777685 -775509 -754739 -746231 -752340 -755069 -747066 -742951 -741391 -737480 -734769
21279 -734769 -731895 -733352 -732592 -723222 -725604 -737917 -737461 -746562 -745141 -737403 -748393 -745446 -740801 -731292
21265 -731292 -724020 -728209 -717870 -705805 -692535 -689213 -697364 -697166 -686085 -687077 -686796 -684845 -676414 -669736
21251 -669736 -673838 -685751 -684343 -681045 -672907 -664190 -655868 -650837 -644321 -642831 -644083 -641029 -640221 -632792
21237 -632792 -626230 -627646 -632626 -630014 -634418 -637254 -640214 -649074 -645404 -632925 -634627 -628812 -614553 -615094
21223 -615094 -615069 -608701 -603009 -601195 -605146 -604768 -613564 -620161 -627132 -619258 -613971 -618856 -614156 -598944 -600884
21208 -600884 -610083 -611940 -603696 -596205 -602086 -596083 -585417 -572107 -564125 -564702 -556014 -554826 -562973 -571436
21194 -571436 -579412 -572242 -560747 -546955 -541931 -549028 -551916 -551876 -562615 -564370 -569649 -559732 -554937 -551297
$$ packed form
21293g85674J7340m767p064K480K176K0770Q508o109k729Q003M115J560L911K711
21279g34769K874j457P60R370k382j2313M56r101J421P738j0990K947M645R509
21265g31292P272m189J0339J2065J3270L322q151J98J1081r92K81J951Q431O678
21251f69736m102j1913J408L298Q138Q717Q322N031O516J490j252L054Q08P429
21237f32792O562j416m980K612m404k836k960q860L670J2479j702N815J4259n41
21223f15094K5O368N692J814l951L78q796o597o971P874N287m885M700J5212j940
21208f00884r199j857Q244P491n881O003J0666J3310P982n77Q688J188q147q463
21194e71436p976P170J1495J3792N024p097k888M0j0739j755n279R917M795L640
$$ plain form
21180 -551297 -552741 -561361 -560464 -563065 -559686 -546897 -541497 -528291 -519725 -523232 -526866 -526803 -522315 -514516
21166 -514516 -531263 -530705 -523793 -527360 -528182 -530251 -520054 -513414 -502448 -501365 -496090 -499390 -508805 -505383
21152 -505383 -509694 -499543 -485916 -481919 -496009 -507371 -506600 -504589 -495099 -486158 -493862 -492649 -489866
21139 -489866 -488886 -495316 -497345 -494487 -486833 -486227 -485965 -476331 -472911 -473733 -461800 -463617 -476672 -483743 -470444
21124 -470444 -463353 -462142 -467103 -474138 -465219 -453417 -434258 -431878 -427270 -432580 -445571 -435683 -433935
21111 -433935 -425628 -427700 -437300 -437433 -437880 -436016 -429964 -417825 -415660 -416651 -417412 -418806 -424227 -435328 -440258
21096 -440258 -439745 -428647 -415059 -415900 -417976 -413431 -401603 -383974 -388606 -407788 -424138 -422263 -410673
21083 -410673 -408020 -408577 -407581 -401155 -390807 -381754 -380424 -375068 -382508 -392852 -407582 -400095 -393421 -402878
$$ packed form
21180e51297j444q620Q97k601L379J2789N400J3206Q566l507l634O3M488P799
21166e14516j6747N58O912l567q22k069J0197O640J0966J083N275l300r415L422
21152e05383m311J0151J3627L997j4090j1362P71K011R490Q941p704J213K783
21139d89866R80o430k029K858P654O06K62R634L420q22J1933j817j3055p071J3299
21124d70444P091J211m961p035Q919J1802J9159K380M608n310j2991R888J748
21111d33935Q307k072r600j33m47J864O052J2139K165r91p61j394n421j1101m930
21096d40258N13J1098J3588q41k076M545J1828J7629m632j9182j6350J875J1590
21083d10673K653n57R96O426J0348R053J330N356p440j0344j4730P487O674r457
$$ plain form
21069 -402878 -406921 -405738 -408713 -412002 -402942 -398776 -392970 -389959 -380330 -375912 -382621 -366272 -349382 -348448
21055 -348448 -358850 -362271 -355507 -347274 -339201 -346429 -351048 -338344 -336160 -342702 -348083 -338859 -323976
21042 -323976 -320509 -325070 -326130 -323748 -327494 -332663 -331622 -325128 -326285 -321590 -319252 -311349 -303373 -297508
21028 -297508 -294824 -303969 -317346 -312518 -306161 -311220 -313007 -311595 -308239 -305880 -316898 -314112 -292184
21015 -292184 -281209 -286819 -290304 -292749 -290683 -296500 -296260 -291556 -292900 -303623 -303057 -294595 -302695 -297263
21001 -297263 -298419 -305791 -307608 -306532 -295082 -276593 -274606 -285562 -277368 -280668 -270742 -254820 -261388
20988 -261388 -276405 -273098 -271667 -274492 -265237 -267561 -275268 -271139 -256839 -252129 -272348 -274423 -268721
20975 -268721 -261414 -258468 -259166 -258734 -258188 -247982 -234916 -237890 -249669 -248899 -250334 -253319 -258340 -245485
$$ packed form
21069d02878m043J183k975l289R060M166N806L011R629M418o709J6349J6890R34
21055c48448j0402l421O764Q233Q073p228m619J2704K184o542n381R224J4883
21042c23976L467m561j060K382l746n169J041O494j157M695K338P903P976N865
21028b97508K684r145j3377M828O357n059j787J412L356K359j1018K786K1928
21015b92184J0975n610l485k445K066n817K40M704j344j0723N66Q462q100N432
21001b97263j156p372j817J076J1450J8489J987j0956Q194l300R926J5922o568
20988b61388j5017L307J431k825R255k324p707M129J4300M710k0219k075N702
20975b68721P307K946o98M32N46J0206J3066k974j1779P70j435k985n021J2855
$$ plain form
20961 -245485 -246345 -243903 -232029 -233115 -241359 -247040 -233818 -233348 -241260 -241867 -234658 -229013 -238863 -232748
20947 -232748 -213674 -203289 -204829 -218400 -224390 -229564 -224835 -219242 -206779 -206915 -221619 -219184 -220301
20934 -220301 -220861 -218937 -221928 -224482 -226286 -222324 -221024 -208207 -203947 -202120 -204935 -212207 -211653 -206564
20920 -206564 -197920 -195195 -195024 -194716 -179781 -171449 -181768 -184414 -183020 -173024 -179990 -194775 -200273 -187941
20906 -187941 -168517 -166838 -174137 -180169 -176011 -166872 -162042 -163877 -179016 -177830 -182625 -182976 -184185 -181034
20892 -181034 -180624 -165067 -157379 -164207 -172492 -163361 -151692 -161459 -162604 -161919 -172511 -178516 -171206 -164004
20878 -164004 -164762 -162232 -148379 -142581 -142487 -141221 -150215 -150235 -151685 -146795 -143478 -138266 -136505 -123687 -130626
20863 -130626 -142716 -127082 -121050 -130646 -118459 -111965 -125456 -126361 -123811 -120084 -102441 -102882 -108451
$$ packed form
20961b45485q60K442J1874j086q244n681J3222M70p912o07P209N645r850O115
20947b32748J9074J0385j540j3571n990n174M729N593J2463j36j4704K435j117
20934b20301n60J924k991k554j804L962J300J2817M260J827k815p272N54N089
20920b06564Q644K725J71L08J4935Q332j0319k646J394R996o966j4785n498J2332
20906a87941J9424J679p299o032M158R139M830j835j5139J186m795l51j209L151
20892a81034M10J5557P688o828q285R131J1669r767j145O85j0592o005P310P202
20878a64004p58K530J3853N798R4J266q994k0j450M890L317N212J761J2818o939
20863a30626j2090J5634O032r596J2187O494j3491r05K550L727J7643m41n569
$$ plain form
20850 -108451 -111944 -120939 -129567 -133259 -139268 -129415 -109362 -103393 -104836 -103124 -95534 -95667 -92528 -96048
20836 -96048 -93178 -102158 -108026 -101582 -96775 -100495 -98808 -89211 -86440 -89527 -96524 -103183 -114035 -115831
20822 -115831 -114215 -108358 -106702 -97905 -87402 -91039 -101451 -99399 -98427 -103981 -108526 -104218 -84604 -70582
20808 -70582 -93367 -100327 -90985 -87624 -91248 -80150 -75561 -70756 -82137 -73705 -72495 -74063 -68112 -63554
20794 -63554 -70309 -73636 -75573 -59070 -58993 -65176 -57328 -53764 -52081 -59032 -69622 -69122 -63520 -56621 -49437
20779 -49437 -50749 -43368 -44545 -55871 -57168 -54585 -61545 -67400 -55328 -44812 -41885 -40194 -40240 -40046
20765 -40046 -29095 -20156 -18049 -31366 -44559 -41806 -30634 -40407 -50938 -46360 -31497 -25620 -23781
20752 -23781 -19303 -15711 -20097 -22661 -25963 -20668 -1998 10270 6100 7372 12961 10654 6213 1149
$$ packed form
20850a08451l493q995q628l692o009R853K0053N969j443J712P590j33L139l520
20836i6048K870q980n868O444M807l720J687R597K771l087o997o659j0852j796
20822a15831J616N857J656Q797J0503l637j0412K052R72n554m545M308J9614J4022
20808g0582k2785o960R342L361l624J1098M589M805j1381Q432J210j568N951M558
20794f3554o755l327j937J6503P7o183P848L564J683o951j0590N00N602O899P184
20779d9437j312P381j177j1326j297K583o960n855J2072J0516K927J691m6J94
20765d0046J0951Q939K107j3317j3193K753J1172r773j0531M578J4863N877J839
20752b3781M478L592m386k564l302N295J8670J2268m170J272N589k307m441n064
$$ plain form
20738 1149 7276 2728 -2 -175 -4904 -8988 1368 -2278 -545 546 -2151 -860 -5533 -834 11807
20723 11807 19470 25253 11909 12391 25113 25562 21232 7794 -6349 -10695 4044 6552 5614 9266
20709 9266 3363 -1582 -1265 12114 23045 23341 15217 17084 18718 10566 5885 9589 12509 16894 28541
20694 28541 32250 37639 52181 46547 39602 36489 34151 38247 41575 42521 41711 38518 36382 36459 42243
20679 42243 42871 37627 29430 33137 44745 56669 56948 58448 50192 50366 61422 71083 64686 61474
20665 61474 58780 64895 66461 57143 63287 44368 36798 34818 28939 34986 49925 58398 56135 47626
20651 47626 59793 74880 73729 67247 73769 70834 70635 75766 73545 68292 81499 83981 86216 81242
20637 81242 69860 72532 71229 77883 78012 79296 65708 70884 74717 89531 98857 100273 94320 98473
$$ packed form
20738A149O127m548k730j73m729m084J0356l646J733J091k697J291m673M699J2641
20723A1807P663N783j3344M82J2722M49m330j3438j4143m346J4739K508r38L652
20709I266n903m945L17J3379J0931K96q124J867J634q152m681L704K920M385J1647
20694B8541L709N389J4542n634o945l113k338M096L328R46q10l193k136P7N784
20679D2243O28n244q197L707J1608J1924K79J500q256J74J1056R661o397l212
20665F1474k694O115J566r318O144j8919p570j980n879O047J4939Q473k263q509
20651D7626J2167J5087j151o482O522k935j99N131k221n253J3207K482K235m974
20637H1242j1382K672j303O654J29J284j3588N176L833J4814R326J416n953M153
$$ plain form
20623 98473 93007 84721 82009 88444 90673 94358 102691 98095 106547 101121 95432 92487 90447 83124
20609 83124 83953 96736 101640 97555 89979 99937 104349 103861 107093 109417 109281 112017 115037 115530 124109
20594 124109 126274 113040 102975 112263 118435 126636 117219 113074 121123 126145 136501 129114 127050
20581 127050 131847 137502 141011 131459 127198 119759 113642 109619 109675 114415 116099 113792 102734 113027
20567 113027 113613 126540 131652 140918 140710 137549 133537 143886 150775 147440 149591 150246 155682 162709
20553 162709 167707 165241 165427 155578 157641 159335 157097 158289 156351 153141 146171 162445 168327 159332
20539 159332 147816 152675 159321 165025 177640 176580 172068 163696 158537 162805 164155 164918 179885 180679
20525 180679 174206 176880 184280 183708 177712 179206 186525 185277 185676 183425 172961 171996 183086 185092
$$ packed form
20623I8473n466q286k712O435K229L685Q333m596Q452n426n689k945k040p323
20609H3124Q29J2783M904m085p576R958M412m88L232K324j36K736L020M93Q579
20594A24109K165j3234j0065R288O172Q201r417m145Q049N022J0356p387k064
20581A27050M797N655L509r552m261p439o117m023N6M740J684k307j1058J0293
20567A13027N86J2927N112R266k08l161m012J0349O889l335K151O55N436P027
20553A62709M998k466J86r849K063J694k238J192j938l210o970J6274N882q995
20539A59332j1516M859O646N704J2615j060m512q372n159M268J350P63J4967P94
20525A80679o473K674P400n72n996J494P319j248L99k251j0464r65J1090K006
$$ plain form
20511 185092 179059 169956 167170 166937 176909 181381 170921 171096 180114 191594 196524 176540 173938 173159
20497 173159 171089 162660 167473 168800 165344 175468 181950 192327 198339 207233 206439 205105 199721 184987
20483 184987 190185 193922 197994 201682 211672 220336 214008 211142 210612 202022 198291 210860 217217 223470
20469 223470 225562 220932 216963 215102 217415 225504 224799 216623 215148 223358 220498 227589 225048 218902
20455 218902 233059 244589 244246 230777 224104 230352 223266 229802 240236 244410 255087 246424 235679
20442 235679 239393 238696 228236 220389 232343 237566 237793 235488 234116 228503 222093 229293 257624 265200
20428 265200 264168 261595 254327 254896 260255 265046 254015 242757 242106 257200 261644 246191 249749 257105
20414 257105 247856 250187 260889 266143 275009 281121 289454 280485 262127 252041 267216 270510 265220
$$ packed form
20511A85092o033r103k786k33R972M472j0460J75R018J1480M930j9984k602p79
20497A73159k070q429M813J327l456J0124O482J0377O012Q894p94j334n384j4734
20483A84987N198L737M072L688R990Q664o328k866n30q590l731J2569O357O253
20469B23470K092m630l969j861K313Q089p05q176j475Q210k860P091k541o146
20455B18902J4157J1530l43j3469o673O248p086O536J0434M174J0677q663j0745
20442B35679L714o97j0460p847J1954N223K27k305j372n613o410P200K8331P576
20428B65200j032k573p268N69N359M791j1031j1258o51J5094M444j5453L558P356
20414B57105r249K331J0702N254Q866O112Q333q969j8358j0086J5175L294n290
$$ plain form
20401 265220 258639 259661 261669 271077 278519 280828 271596 266547 271971 272283 269811 273005 289744 290416
20387 290416 283247 266428 265585 268431 277330 283034 278890 296084 306796 301070 300252 290683 286145 283310
20373 283310 282984 290038 297461 298164 289623 288794 302848 309244 300373 293956 295567 305774 305612 309851 325902
20358 325902 321897 319987 326565 328919 317392 311383 303987 306254 302691 311607 307342 302994 299918 302054
20344 302054 313885 318600 314237 314477 321656 319182 310569 314082 319449 320432 331731 347068 350027 338049
20330 338049 329064 338024 332118 317713 317121 330906 335522 332219 336470 338002 344558 350574 357706 351204
20316 351204 335534 335004 333696 333562 338274 336203 335318 327633 327451 329127 339996 342469 342775 331232 332423
20301 332423 346334 354911 355224 344550 345743 354464 348257 343647 348214 349862 345893 336365 334840 341285
$$ packed form
20401B65220o581J022K008R408P442K309r232n049N424L12k472L194J6739O72
20387B90416p169j6819q43K846Q899N704m144J7194J0712n726q18r569m538k835
20373B83310l26P054P423P03q541q29J4054O396q871o417J611J0207j62M239J6051
20358C25902m005j910O578K354j1527o009p396K267l563Q916m265m348l076K136
20344C02054J1831M715m363K40P179k474q613L513N367R83J1299J5337K959j1978
20330C38049q985Q960n906j4405n92J3785M616l303M251J532O556O016P132o502
20316C51204j5670n30j308j34M712k071q85p685j82J676J0869K473L06j1543J191
20301C32423J3911Q577L13j0674J193Q721o207m610M567J648l969r528j525O445
$$ plain form
20287 341285 346683 343713 345647 356996 368680 364909 345218 342104 361307 371662 362728 357160 358639
20274 358639 361573 368407 369130 369449 374389 374315 381015 386743 389048 386182 387959 388464 378962 370616 365402
20259 365402 369842 375499 383655 378541 374422 374130 372034 369980 368400 378985 384588 385715 385966 399133
20245 399133 402151 401864 399447 405496 407595 406603 406030 398503 388290 388580 393144 394579 403116 399441 384550
20230 384550 384239 384778 394487 407543 405041 397982 393634 387272 392619 394441 397563 388792 389947 407776
20216 407776 415856 420460 421349 409048 400784 402548 408241 429866 437782 424144 413706 417726 427589
20203 427589 431123 416217 410676 413697 413794 417915 434378 449906 444680 434303 442931 437309 423806
20190 423806 422988 428880 429777 435803 437617 431737 440042 447041 454604 456711 444943 439012 436371 446788
$$ packed form
20287C41285N398k970J934J1349J1684l771j9691l114J9203J0355q934n568J479
20274C58639K934O834P23L19M940p4O700N728K305k866J777N05r502q346n214
20259C65402M440N657Q156n114m119k92k096k054j580J0585N603J127K51J3167
20245C99133L018k87k417O049K099r92n73p527j0213K90M564J435Q537l675j4891
20230C84550l11N39R709J3056k502p059m348o362N347J822L122q771J155J7829
20216D07776Q080M604Q89j2301q264J764N693K1625P916j3638j0438M020R863
20203D27589L534j4906n541L021R7M121J6463J5528n226j0377Q628n622j3503
20190D23806q18N892Q97O026J814n880Q305O999P563K107j1768n931k641J0417
$$ plain form
20176 446788 454486 459441 462032 455886 449750 451860 447082 437854 439506 451218 464249 479688 474105
20163 474105 450234 438595 436530 428091 439995 460106 468289 488226 489669 477443 463715 467133
20151 467133 465969 460500 461276 468059 455498 455436 470648 476094 464422 457514 457668 465284 480040 495179
20137 495179 484487 469401 467318 465816 463888 462936 467996 469483 466812 455792 453173 462947 479888
20124 479888 486139 485026 492936 481005 479307 481364 485647 482074 491368 500308 496852 481349 460660
20111 460660 469613 477966 483108 476739 470887 476838 484058 492092 492694 493741 507804 511199 498843 484725
20097 484725 488573 498510 502125 493622 491219 511607 519383 517705 518924 517124 516519 516390 517980 516689
20083 516689 516322 510059 506217 501114 502845 508584 518146 531755 530147 538739 539708 527675 521446 523055
$$ packed form
20176D46788P698M955K591o146o136K110m778r228J652J1712J3031J5439n583
20163D74105k3871j1639k065q439J1904K0111Q183J9937J443j2226j3728L418
20151D67133j164n469P76O783j2561o2J5212N446j1672o908J54P616J4756J5139
20137D95179j0692j5086k083j502j928r52N060J487k671j1020k619R774J6941
20124D79888O251j113P910j1931j698K057M283l573R294Q940l456j5503k0689
20111D60660Q953Q353N142o369n852N951P220Q034O02J047J4063L395j2356j4118
20097D84725L848R937L615q503k403K0388P776j678J219j800o05j29J590j291
20083E16689l67o263l842n103J731N739R562J3609j608Q592R69j2033o229J609
$$ plain form
20069 523055 518917 515495 515168 521311 532454 532162 538743 532765 525962 526756 535332 537948 530016 529221 528304
20054 528304 534534 542247 538099 529154 527432 530221 539746 537306 531738 530112 537174 537435 532834 542443
20040 542443 550646 541561 529797 533848 543910 541983 540711 541142 549632 543647 544186 549686 553222 546239
20026 546239 542658 550965 547911 558901 567030 559191 558952 577774 579681 565747 564881 562302 561709 556435
20012 556435 565309 587728 590874 581812 563911 560228 556309 557238 566282 567748 571183 577261 578708 579500
19998 579500 575727 580811 572006 568648 567771 572442 576130 569661 563201 569596 572715 572690 584651 592415 595840
19983 595840 588783 588167 579375 571159 571572 578303 583560 584945 582997 590342 594326 593709 590832 580944 578980
19968 578980 580313 587808 589180 597385 597910 590170 595953 609939 619655 623109 617895 610303 617438 616029
$$ packed form
20069E23055m138l422l27O143J1143k92O581n978o803P94Q576K616p932p95r17
20054E28304O230P713m148q945j722K789R525k440n568j626P062K61m601R609
20040E42443Q203r085j1764M051J0062j927j272M31Q490n985N39N500L536o983
20026E46239l581Q307l054J0990Q129p839k39J8822J907j3934q66k579n93n274
20012E56435Q874K2419L146r062j7901l683l919R29R044J466L435O078J447P92
19998E79500l773N084q805l358q77M671L688o469o460O395L119k5J1961P764L425
19983E95840p057o16q792q216M13O731N257J385j948P345L984o17k877r888j964
19968E78980J333P495J372Q205N25p740N783J3986R716L454n214p592P135j409
$$ plain form
19954 616029 621809 619736 615353 620022 617775 605650 599441 606311 618667 635163 628671 612955 609662
19941 609662 610151 616831 613612 619404 623635 613977 611093 611678 613796 622523 616179 618267 617502 616984 622972
19926 622972 625030 634513 628503 626507 629058 626692 626775 626494 612396 610213 617356 626533 636489 648700
19912 648700 659638 655755 652085 659926 665806 664681 662429 663792 672096 679015 677693 667324 652480
19899 652480 650862 653394 657543 656914 664156 657677 657167 645240 634285 637234 647766 647853 650856 654455
19885 654455 655770 663390 660833 658101 658135 669208 672099 668072 672765 667704 674946 668587 667484 675016
19871 675016 682032 683638 678806 689501 691459 681029 680894 686163 674701 682279 681335 695275 698951 698009
19857 698009 697051 693175 688284 688728 692963 692930 693375 695214 710914 710147 694922 690966 695522 693755 692988
$$ packed form
19954F16029N780k073m383M669k247j2125o209O870J2356J6496o492j5716l293
19941F09662M89O680l219N792M231r658k884N85K118Q727o344K088p65n18N988
19926F22972K058R483o010j996K551k366Q3k81j4098k183P143R177R956J2211
19912F48700J0938l883l670P841N880j125k252J363Q304O919j322j0369j4844
19899F52480j618K532M149o29P242o479n10j1927j0955K949J0532Q7L003L599
19885F54455J315P620k557k732L4J1073K891m027M693n061P242o359j103P532
19871F75016P016J606m832J0695J958j0430j35N269j1462P578r44J3940L676r42
19857F98009r58l876m891M44M235l3M45J839J5700p67j5225l956M556j767p67
$$ plain form
19842 692988 698086 699535 704416 717961 727310 724852 725270 724174 711926 696293 710560 715420 703807
19829 703807 708829 707293 708849 716755 720975 716862 722217 722593 719800 712913 704144 711161 709168 722333
19815 722333 727569 726589 722745 715289 718122 717217 719270 723053 722604 722769 726725 730523 724818 709091 711190
19800 711190 724966 721839 718459 732707 742459 752298 746959 737878 732569 727475 725555 732349 741418 737093
19786 737093 745599 753772 761031 754403 747457 746536 752036 756364 753203 753065 759040 748221 737519 737492 741509
19771 741509 751572 743022 747017 754264 756664 756530 758813 763518 758094 760777 769701 768839 768105 775792 785940
19756 785940 784267 775566 773277 771823 770477 774129 790147 784082 779259 790210 797004 797441 791855 793004
19742 793004 793487 805051 798414 796228 788310 784119 790705 789266 783069 794420 790915 792615 794690 793609
$$ packed form
19842F92988N098J449M881J3545R349k458M18j096j2248j5633J4267M860j1613
19829G03807N022j536J556P906M220m113N355L76k793o887q769P017j993J3165
19815G22333N236r80l844p456K833r05K053L783m49J65L956L798n705j5727K099
19800G11190J3776l127l380J4248R752R839n339r081n309n094j920O794R069m325
19786G37093Q506Q173P259o628o946r21N500M328l161j38N975j0819j0702k7M017
19771G41509J0063q550L995P247K400j34K283M705n424K683Q924q62p34P687J0148
19756G85940j673q701k289j454j346L652J6018o065m823J0951O794M37n586J149
19742G93004M83J1564o637k186p918m191O586j439o197J1351l505J700K075j081
$$ plain form
19728 793609 795691 793287 791487 791820 789940 800865 806296 807223 806750 810100 805296 797544 798936 802655 809026
19713 809026 808767 803038 800460 803840 810209 807737 817758 820237 819363 819675 821998 842107 844693 838342
19699 838342 836096 838016 850142 856756 848788 845696 848081 842456 846067 834713 828342 840618 845768
19686 845768 844878 843797 839837 834609 833693 840406 846028 845086 846038 847245 850124 859768 862226 855868 859094
19671 859094 860634 862520 863985 867611 853363 839723 844851 851356 864677 860299 856714 856800 864861 870208
19657 870208 876467 866448 854677 861414 863822 854654 852109 850987 850381 857948 867416 874922 875655 876854
19643 876854 872138 872567 877315 880074 884207 894062 891555 885339 889843 887017 886144 888419 895738 895575 889366
19628 889366 885374 884933 885601 888612 889891 897838 897672 901024 910005 911910 917176 912391 914718 918059 912049
$$ packed form
19728G93609K082k404j800L33j880J0925N431R27m73L350m804p752J392L719O371
19713H09026k59n729k578L380O369k472J0021K479q74L12K323K0109K586o351
19699H38342k246J920J2126O614p968l092K385n625L611j1354o371J2276N150
19686H45768q90j081l960n228r16O713N622r42R52J207K879R644K458o358L226
19671H59094J540J886J465L626j4248j3640N128O505J3321m378l585Q6Q061N347
19657H70208O259j0019j1771O737K408r168k545j122o06P567R468P506P33J199
19643H76854m716M29M748K759M133R855k507o216M504k826q73K275P319j63o209
19628H89366l992m41O68L011J279P947j66L352Q981J905N266m785K327L341o010
$$ plain form
19613 912049 894714 898328 910656 904039 905165 912053 915868 907403 907310 901928 914591 914682 901874 911158
19599 911158 916512 923695 928086 917539 908638 920426 926775 934708 937937 945460 945930 941714 941855 937355
19585 937355 943177 929966 928629 942965 964371 965925 954331 959456 961104 967733 959180 948171 942516
19572 942516 940498 940423 943465 942061 952829 963981 959431 956433 953188 961230 963602 968395 974153 970918
19558 970918 978175 979859 973132 959268 971068 969273 958076 958507 952757 967751 973588 986858 988440
19545 988440 992768 986741 976399 967026 965779 974402 988628 987424 978485 981566 994695 1000875 998386
19532 998386 996114 997202 1002263 993015 989897 996058 1006577 1012460 1003527 996210 1000878 1003594 998073 990642
19518 990642 980977 993382 1002638 1016038 1013347 1005573 993100 997955 1017286 1015619 1010536 1008405 1010112
$$ packed form
19613I12049j7335L614J2328o617J126O888L815q465r3n382J2663R1j2808R284
19599I11158N354P183M391j0547q901J1788O349P933L229P523M70m216J41m500
19585I37355N822j3211j337J4336K1406J554j1594N125J648O629q553j1009n655
19572I42516k018p5L042j404J0768J1152m550k998l245Q042K372M793N758l235
19558I70918P257J684o727j3864J1800j795j1197M31n750J4994N837J3270J582
19545I88440M328o027j0342r373j247Q623J4226j204q939L081J3129O180k489
19532I98386k272J088N061r248l118O161J0519N883q933p317M668K716n521p431
19518I90642r665J2405R256J3400k691p774j2473M855J9331j667n083k131J707
$$ plain form
19505 1010112 1023640 1018496 1015811 1020954 1026609 1034716 1037812 1019342 1011299 1023777 1028698 1028939 1028964 1027770
19491 1027770 1019586 1026774 1035679 1028997 1021836 1040923 1047247 1049880 1054449 1059782 1051194 1054506 1058759 1061245
19477 1061245 1060243 1064426 1066634 1056271 1043973 1045558 1052489 1051628 1039949 1041600 1053784 1059502 1061399
19464 1061399 1073712 1076648 1069007 1080444 1075664 1056916 1050027 1049913 1056876 1057660 1068363 1074374 1072446
19451 1072446 1076528 1066397 1053712 1066697 1082781 1085979 1090036 1099154 1097012 1098846 1109134 1111308 1097647
19438 1097647 1098222 1108549 1103679 1112611 1102079 1090407 1108908 1109404 1095836 1096499 1107985 1117049 1121070
19425 1121070 1106311 1102979 1113154 1111197 1112210 1118443 1126368 1127549 1130615 1132368 1123536 1121801 1124116
19412 1124116 1120518 1124761 1127116 1128268 1120459 1122891 1124421 1131634 1119947 1119226 1122794 1118175 1115386 1128814
$$ packed form
19505A010112J3528n144k685N143N655Q107L096j8470q043J2478M921K41K5j194
19491A027770q184P188Q905o682p161J9087O324K633M569N333q588L312M253K486
19477A061245j002M183K208j0363j2298J585O931q61j1679J651J2184N718J897
19464A061399J2313K936p641J1437m780j8748o889j14O963P84J0703O011j928
19451A072446M082j0131j2685J2985J6084L198M057R118k142J834J0288K174j3661
19438A097647N75J0327m870Q932j0532j1672J8501M96j3568O63J1486R064M021
19425A121070j4759l332J0175j957J013O233P925J181L066J753q832j735K315
19412A124116l598M243K355J152p809K432J530P213j1687p21L568m619k789J3428
$$ plain form
19398 1128814 1140068 1145501 1158751 1163249 1150628 1144360 1136542 1138316 1157661 1172691 1176410 1164809
19386 1164809 1165402 1153074 1153289 1157798 1152512 1160206 1159346 1153742 1160212 1172278 1178884 1174939 1172715 1168372
19372 1168372 1154438 1160258 1168523 1164650 1166053 1178629 1185845 1188238 1191606 1186445 1187672 1195852 1181746
19359 1181746 1168472 1172692 1187665 1190432 1195809 1188152 1174818 1172034 1183200 1202067 1212524 1211105
19347 1211105 1201394 1190361 1190443 1204122 1199673 1189778 1190340 1197279 1209734 1211475 1206990 1210064 1215224 1227213
19333 1227213 1231153 1227538 1213652 1210410 1218361 1222872 1224007 1221118 1226263 1225478 1230536 1245382 1244328 1251503
19319 1251503 1262833 1260033 1248898 1242511 1254726 1259053 1255962 1242549 1240047 1249364 1261417 1265394 1257289
19306 1257289 1260261 1256346 1240207 1234296 1244797 1253053 1260101 1266115 1268437 1269158 1281070 1287646 1282029
$$ packed form
19398A128814J1254N433J3250M498j2621o268p818J774J9345J5030L719j1601
19386A164809N93j2328K15M509n286P694q60n604O470J2066O606l945k224m343
19372A168372j3934N820Q265l873J403J2576P216K393L368n161J227Q180j4106
19359A181746j3274M220J4973K767N377p657j3334k784J1166J8867J0457j419
19347A211105r711j1033Q2J3679m449r895N62O939J2455J741m485L074N160J1989
19333A227213L940l615j3886l242P951M511J135k889N145p85N058J4846j054P175
19319A251503J1330k800j1135o387J2215M327l091j3413k502R317J2053L977q105
19306A257289K972l915j6139n911J0501Q256P048O014K322P21J1912O576n617
$$ plain form
19293 1282029 1272556 1270279 1271591 1260880 1268388 1279188 1275951 1285366 1298242 1294936 1286355 1287745 1290691
19280 1290691 1285745 1282004 1276288 1271427 1278110 1291829 1296452 1297861 1312922 1316585 1313702 1315053 1313025
19267 1313025 1305043 1297995 1303843 1307809 1310306 1312791 1311708 1310713 1305085 1305054 1310158 1329974 1343722 1339879
19253 1339879 1347977 1357256 1348905 1347376 1350611 1349764 1349360 1354056 1355590 1355224 1361151 1350570 1344467 1355122
19239 1355122 1362426 1371886 1376748 1373744 1371057 1384721 1386060 1388725 1399424 1395124 1382597 1370222 1373325
19226 1373325 1381073 1384444 1387499 1379880 1369768 1369951 1371752 1374398 1382404 1385655 1391646 1391971 1395675 1396019
19212 1396019 1383150 1380875 1398303 1398530 1389223 1383044 1384054 1389971 1383612 1394867 1408694 1421951 1423697
19199 1423697 1423769 1431793 1430425 1428113 1416088 1419255 1431117 1433984 1431616 1424622 1432225 1433190 1434451 1440123
$$ packed form
19293A282029r473k277J312j0711P508J0800l237R415J2876l306q581J390K946
19280A290691m946l741n716m861O683J3719M623J409J5061L663k883J351k028
19267A313025p982p048N848L966K497K485j083r95n628l1N104J9816J3748l843
19253A339879Q098R279q351j529L235q47m04M696J534l66N927j0581o103J0655
19239A355122P304R460M862l004k687J3664J339K665J0699m300j2527j2375L103
19226A373325P748L371L055p619j0112J83J801K646Q006L251N991L25L704L44
19212A396019j2869k275J7428K27r307o179J010N917o359J1255J3827J3257J746
19199A423697P2Q024j368k312j2025L167J1862K867k368o994P603R65J261N672
$$ plain form
19185 1440123 1442370 1441959 1446151 1452720 1448489 1447573 1452139 1463028 1467381 1467987 1472558 1475953 1469714 1469144 1470891
19170 1470891 1486233 1487411 1490052 1508959 1501329 1484675 1476417 1469759 1471078 1475341 1481832 1478511 1480125
19157 1480125 1479325 1473078 1481967 1494899 1505023 1511197 1511336 1498902 1486569 1491325 1494751 1495105 1493210 1493283
19143 1493283 1502966 1505532 1518263 1519077 1512071 1511730 1520241 1515900 1527116 1519188 1525295 1517802 1511825 1508891
19129 1508891 1513682 1520124 1518512 1517251 1528248 1543884 1553758 1558602 1565326 1547153 1539213 1537448 1541811
19116 1541811 1550764 1555444 1564140 1559516 1551456 1552822 1561546 1572916 1576620 1591534 1608154 1606174 1599942
19103 1599942 1590124 1581671 1579124 1581502 1580622 1580918 1590034 1595255 1599726 1592774 1581663 1585237 1574233 1583357
19089 1583357 1599237 1604553 1603121 1603160 1601585 1604918 1593130 1588668 1593519 1597345 1600285 1610474 1625592
$$ packed form
19185A440123K247m11M192O569m231r16M566J0889M353O06M571L395o239n70J747
19170A470891J5342J178K641J8907p630j6654q258o658J319M263O491l321J614
19157A480125q00o247Q889J2932J0124O174J39j2434j2333M756L426L54j895P3
19143A493283R683K566J2731Q14p006l41Q511m341J1216p928O107p493n977k934
19129A508891M791O442j612j261J0997J5636R874M844O724j8173p940j765M363
19116A541811Q953M680Q696m624q060J366Q724J1370L704J4914J6620j980o232
19103A599942r818q453k547K378q80K96R116N221M471o952j1111L574j1004R124
19089A583357J5880N316j432L9j575L333j1788m462M851L826K940J0189J5118
$$ plain form
19076 1625592 1623497 1615302 1614878 1623832 1628771 1624967 1634998 1635956 1635258 1633301 1640044 1644106 1642951 1653132
19062 1653132 1652515 1651129 1665822 1669603 1675467 1686336 1698804 1695581 1679094 1677925 1671803 1672231 1677130
19049 1677130 1674654 1682065 1683137 1675947 1670574 1683696 1685400 1687514 1682568 1685769 1681736 1686613 1684491 1684082
19035 1684082 1692851 1692027 1698072 1716085 1715421 1719424 1727988 1719000 1717276 1728397 1737293 1722921 1723641 1731708
19021 1731708 1723928 1722257 1724593 1733884 1739485 1755306 1760984 1748829 1749884 1749272 1757259 1759375 1755915 1759606
19007 1759606 1755001 1761323 1779456 1790100 1792030 1788324 1789124 1788670 1786815 1790204 1790419 1777860 1791902 1807075
18993 1807075 1804176 1790064 1802797 1814757 1815041 1811365 1801918 1808880 1806653 1806095 1817942 1817221 1818299 1829953
18979 1829953 1830355 1828610 1822819 1824195 1828520 1849055 1851741 1839729 1836510 1854852 1867577 1877334 1878432
$$ packed form
19076A625592k095q195m24Q954M939l804J0031R58o98j957O743M062j155J0181
19062A653132o17j386J4693L781N864J0869J2468l223j6487j169o122M28M899
19049A677130k476P411J072p190n373J3122J704K114m946L201m033M877k122m09
19035A684082Q769q24O045J8013o64M003Q564q988j724J1121Q896j4372P20Q067
19021A731708p780j671K336R291N601J5821N678j2155J055o12P987K116l460L691
19007A759606m605O322J8133J0644J930l706Q00m54j855L389K15j2559J4042J5173
18993A807075k899j4112J2733J1960K84l676r447O962k227n58J1847p21J078J1654
18979A829953M02j745n791J376M325K0535K686j2012l219J8342J2725R757J098
$$ plain form
18966 1878432 1849792 1838183 1833839 1846517 1853839 1865378 1875679 1867482 1862740 1862566 1874493 1897502
18954 1897502 1901400 1899937 1907418 1906918 1905666 1905619 1899835 1905463 1922209 1927092 1919955 1913329 1911218 1917222
18940 1917222 1937807 1940108 1938785 1931584 1924557 1932493 1943713 1949845 1948495 1947264 1953447 1956135 1960232
18927 1960232 1959462 1958514 1958518 1967173 1976785 1985398 1989653 1987617 1986641 1987610 1978784 1985856 1995960 2011570 2022820
18912 2022820 2008926 2005885 2011062 2000651 1991990 1990183 1995616 1997233 2001129 2006891 2009612 2016980 2030538
18899 2030538 2037074 2047398 2036679 2030942 2037240 2045345 2049551 2052746 2060196 2064826 2062990 2064749 2073618
18886 2073618 2081479 2088212 2091850 2083409 2070891 2063660 2070604 2074894 2082693 2089812 2095891 2095545 2096787 2088456
18872 2088456 2092146 2099940 2106528 2101720 2107375 2112684 2117445 2136944 2137218 2147583 2151050 2155129 2148830 2143942
$$ packed form
18966A878432k8640j1609m344J2678P322J1539J0301q197m742j74J1927K3009
18954A897502L898j463P481n00j252m7n784N628J6746M883p137o626k111O004
18940A917222K0585K301j323p201p027P936J1220O132j350j231O183K688M097
18927A960232p70r48MQ655R612Q613M255k036r76R69q826P072J0104J5610J1250
18912B022820j3894l041N177j0411q661j807N433J617L896N762K721P368J3558
18899B030538O536J0324j0719n737O298Q105M206L195P450M630j836J759Q869
18886B073618P861O733L638q441j2518p231O944M290P799P119O079l46J242q331
18872B088456L690P794O588m808N655N309M761J9499K74J0365L467M079o299m888
$$ plain form
18858 2143942 2148562 2147814 2155932 2153780 2149626 2153225 2147671 2168619 2182220 2180397 2180566 2182199 2187214 2193600
18844 2193600 2189962 2181277 2183562 2196144 2199147 2212204 2223750 2238176 2243975 2243458 2224625 2210711 2220722
18831 2220722 2230029 2232117 2233609 2241450 2247092 2247847 2257308 2260027 2263084 2260329 2258328 2258487 2266377 2267321 2265860
18816 2265860 2266596 2278822 2294557 2319190 2319174 2320743 2315535 2310363 2316323 2324365 2332971 2337938 2340588 2346615
18802 2346615 2336963 2337604 2357267 2365564 2366342 2365775 2373843 2371299 2362049 2365015 2377264 2383445 2384170 2381084
18788 2381084 2383273 2404148 2425984 2426447 2424432 2432745 2453220 2450781 2459066 2467461 2462184 2472815 2470151
18775 2470151 2466404 2468555 2465830 2478150 2488862 2491770 2493045 2525397 2549206 2546402 2558272 2534470
18763 2534470 2489576 2478330 2479359 2476940 2473928 2477972 2486465 2493839 2497867 2511746 2528778 2513875 2505457
$$ packed form
18858B143942M620p48Q118k152m154L599n554K0948J3601j823J69J633N015O386
18844B193600l638q685K285J2582L003J3057J1546J4426N799n17j8833j3914J0011
18831B220722R307K088J492P841N642P55R461K719L057k755k001J59P890R44j461
18816B265860P36J2226J5735K4633j6J569n208n172N960Q042Q606M967K650O027
18802B346615r652O41J9663Q297P78n67Q068k544r250K966J2249O181P25l086
18788B381084K189K0875K1836M63k015Q313K0475k439Q285Q395n277J0631k664
18775B470151l747K151k725J2320J0712K908J275L2352K3809k804J1870k3802
18763B534470m4894j1246J029k419l012M044Q493P374M028J3879J7032j4903q418
$$ plain form
18750 2505457 2521780 2532085 2543120 2558414 2573124 2586001 2590127 2594296 2604784 2610192 2609383 2617334
18738 2617334 2627418 2630943 2625203 2628005 2639939 2641301 2644025 2651008 2662909 2666907 2668006 2696720 2706902
18725 2706902 2703450 2719373 2745520 2751563 2753346 2759327 2776935 2791978 2790397 2796313 2796098 2809334 2837318
18712 2837318 2867734 2889202 2910428 2942042 2964713 2989676 3012894 3018332 3015166 3018467 3039737 3070439
18700 3070439 3090666 3049846 2973680 2908315 2878835 2867413 2840967 2791195 2730721 2690642 2678537
18689 2678537 2664963 2668075 2683030 2690654 2715367 2749967 2776301 2793348 2793597 2811163 2847715 2889650
18677 2889650 2909884 2891408 2835774 2755799 2723701 2719161 2711270 2669170 2593918 2517338 2477809 2473542
18665 2473542 2483303 2486667 2480547 2482312 2504146 2513534 2528445 2541801 2554863 2581632 2597652 2619963
$$ packed form
18750B505457J6323J0305J1035J5294J4710J2877M126M169J0488N408q09P951
18738B617334J0084L525n740K802J1934J362K724O983J1901L998J099K8714J0182
18725B706902l452J5923K6147O043J783N981J7608J5043j581N916k15J3236K7984
18712B837318L0416K1468K1226L1614K2671K4963K3218N438l166L301K1270L0702
18700C070439K0227m0820p6166o5365k9480j1422k6446m9772o0474m0079j2105
18689B678537j3574L112J4955P624K4713L4600K6334J7047K49J7566L6552M1935
18677B889650K0234j8476n5634p9975l2098m540p891m2100p5252p6580l9529m267
18665B473542R761L364o120J765K1834R388J4911J3356J3062K6769J6020K2311
$$ plain form
18653 2619963 2641530 2651670 2669814 2694396 2713373 2731184 2746474 2759238 2764863 2771369 2772354 2787826
18641 2787826 2802071 2813625 2815344 2820274 2837778 2843574 2854487 2852461 2847646 2851497 2862766 2873346
18629 2873346 2869432 2882779 2900910 2918546 2934940 2942158 2948066 2952188 2966950 2981255 2989597 2991572
18617 2991572 2995022 3002825 3019489 3044481 3057031 3049582 3043184 3043971 3044534 3054795 3061244 3064485 3074793
18604 3074793 3082269 3097909 3095169 3096002 3115744 3130522 3130490 3129672 3133037 3145545 3149085 3147627 3148047 3147684
18590 3147684 3146007 3158286 3175327 3187872 3196008 3211941 3224950 3228675 3232621 3241589 3254348 3278788
18578 3278788 3288104 3292177 3297141 3293728 3313150 3326936 3324614 3326303 3337396 3328832 3332129 3347144 3351955
18565 3351955 3354683 3355826 3362889 3373151 3389040 3400153 3399073 3409747 3413611 3411787 3412115 3425480 3432439
$$ packed form
18653B619963K1567J0140J8144K4582J8977J7811J5290J2764N625O506R85J5472
18641B787826J4245J1554J719M930J7504N796J0913k026m815L851J1269J0580
18629B873346l914J3347J8131J7636J6394P218N908M122J4762J4305Q342J975
18617B991572L450P803J6664K4992J2550p449o398P87N63J0261O449L241J0308
18604C074793P476J5640k740Q33J9742J4778l2q18L365J2508L540j458M20l63
18590C147684j677J2279J7041J2545Q136J5933J3009L725L946Q968J2759K4440
18578C278788R316M073M964l413J9422J3786k322J689J1093q564L297J5015M811
18565C351955K728J143P063J0262J5889J1113j080J0674L864j824L28J3365O959
$$ plain form
18552 3432439 3438946 3432106 3447171 3464755 3479314 3495729 3509634 3510418 3520108 3520683 3526077 3536303 3553052
18539 3553052 3576096 3584008 3581754 3571273 3574736 3587677 3607401 3615486 3627859 3632111 3641695 3648451 3649559
18526 3649559 3653921 3665857 3677841 3697983 3712300 3710757 3718760 3731335 3745095 3755759 3767925 3774238
18514 3774238 3786034 3789559 3789469 3800615 3822873 3830334 3830527 3842384 3851229 3853559 3854379 3857798 3872476 3892349
18500 3892349 3897392 3898837 3902803 3912442 3931693 3944247 3960164 3963116 3959265 3959333 3973062 3989957 4009189
18487 4009189 4016954 4018428 4037732 4067040 4079992 4074831 4081487 4099398 4108348 4123028 4122377 4128115 4144157
18474 4144157 4156647 4168299 4175373 4191269 4201809 4201153 4204168 4211621 4210715 4229484 4250781 4260055 4272629
18461 4272629 4282338 4307095 4331814 4326903 4326757 4345522 4370814 4386382 4402138 4409016 4423934 4431654
$$ packed form
18552C432439O507o840J5065J7584J4559J6415J3905P84R690N75N394J0226J6749
18539C553052K3044P912k254j0481L463J2941J9724Q085J2373M252R584O756J108
18526C649559M362J1936J1984K0142J4317j543Q003J2575J3760J0664J2166O313
18514C774238J1796L525r0J1146K2258P461J93J1857Q845K330Q20L419J4678J9873
18500C892349N043J445L966R639J9251J2554J5917K952l851O8J3729J6895J9232
18487D009189P765J474J9304K9308J2952n161O656J7911Q950J4680o51N738J6042
18474D144157J2490J1652P074J5896J0540o56L015P453r06J8769K1297R274J2574
18461D272629R709K4757K4719m911j46J8765K5292J5568J5756O878J4918P720
$$ plain form
18449 4431654 4446325 4448906 4456297 4466276 4484547 4499540 4513506 4521606 4522410 4536034 4554856 4569497
18437 4569497 4573157 4586921 4612833 4623160 4636247 4642310 4650656 4665889 4686548 4694474 4704960 4715648
18425 4715648 4707863 4709271 4728307 4751745 4780674 4799173 4823727 4834046 4839756 4857888 4870622 4872091
18413 4872091 4878377 4893608 4911308 4923388 4953985 4978228 4994898 4999783 5013609 5037303 5048994 5050957
18401 5050957 5066974 5080381 5107936 5132681 5146425 5168697 5190983 5212785 5224329 5233439 5255760
18390 5255760 5285187 5314932 5322060 5322975 5329999 5343184 5372617 5405942 5427369 5431476 5427195 5423152 5430360
18377 5430360 5453960 5472149 5477003 5498077 5518203 5539261 5564026 5589462 5613429 5637996 5672400
18366 5672400 5702563 5726163 5735844 5744755 5764107 5766131 5783026 5827032 5843189 5842841 5858585 5875670
$$ packed form
18449D431654J4671K581P391R979J8271J4993J3966Q100Q04J3624J8822J4641
18437D569497L660J3764K5912J0327J3087O063Q346J5233K0659P926J0486J0688
18425D715648p785J408J9036K3438K8929J8499K4554J0319N710J8132J2734J469
18413D872091O286J5231J7700J2080L0597K4243J6670M885J3826K3694J1691J963
18401E050957J6017J3407K7555K4745J3744K2272K2286K1802J1544R110K2321
18390E255760K9427K9745P128R15P024J3185K9433L3325K1427M107m281m043P208
18377E430360K3600J8189M854K1074K0126K1058K4765K5436K3967K4567L4404
18366E672400L0163K3600R681Q911J9352K024J6895M4006J6157l48J5744J7085
$$ plain form
18354 5875670 5880775 5893752 5915758 5924247 5937580 5966874 6004114 6030927 6046553 6076269 6095716 6107526
18342 6107526 6131980 6170712 6204493 6244776 6265644 6293315 6315725 6334074 6357657 6378373 6406443
18331 6406443 6437841 6470614 6485463 6510830 6542455 6575407 6603777 6652613 6694290 6712886 6746897
18320 6746897 6806823 6871206 6921153 6947774 6984253 7014174 7038789 7090506 7151331 7183754 7201720
18309 7201720 7233091 7247510 7264302 7286040 7319004 7361442 7400697 7441763 7480877 7510343 7538500
18298 7538500 7576592 7615971 7690673 7777074 7826994 7852302 7893676 7938894 8000921 8052049 8082190
18287 8082190 8116276 8164890 8203535 8233338 8261510 8286282 8315136 8359353 8402807 8427659 8454864
18276 8454864 8492408 8537669 8582473 8635470 8677853 8724224 8774245 8831471 8882386 8930423 8983142
$$ packed form
18354E875670N105J2977K2006Q489J3333K9294L7240K6813J5626K9716J9447J1810
18342F107526K4454L8732L3781M0283K0868K7671K2410J8349K3583K0716K8070
18331F406443L1398L2773J4849K5367L1625L2952K8370M8836M1677J8596L4011
18320F746897N9926O4383M9947K6621L6479K9921K4615N1717O0825L2423J7966
18309G201720L1371J4419J6792K1738L2964M2438L9255M1066L9114K9466K8157
18298G538500L8092L9379P4702Q6401M9920K5308M1374M5218O2027N1128L0141
18287H082190L4086M8614L8645K9803K8172K4772K8854M4217M3454K4852K7205
18276H454864L7544M5261M4804N2997M2383M6371N0021N7226N0915M8037N2719
$$ plain form
18265 8983142 9033899 9081983 9131225 9200005 9269995 9324603 9381849 9439872 9492207 9554903 9622288
18254 9622288 9681269 9739913 9784572 9839413 9915352 9998440 10074677 10151381 10235665 10319169 10400811
18243 10400811 10493465 10576886 10662031 10754971 10836189 10922896 11010142 11096516 11164946 11251957 11340469
18232 11340469 11410397 11478619 11535652 11576236 11619553 11689129 11771126 11842724 11915617 11994854 12066557
18221 12066557 12153130 12265476 12384753 12503821 12617131 12752334 12886372 13016447 13152241
18212 13152241 13286075 13419600 13561925 13689212 13784338 13862327 13929714 14014912 14124561 14238919
18202 14238919 14334697 14419663 14516634 14607849 14718416 14871647 15036628 15204067 15399027 15591335
18192 15591335 15775699 15976684 16205957 16428815 16655756 16888503 17142780 17391836 17645988
$$ packed form
18265H983142N0757M8084M9242O8780O9990N4608N7246N8023N2335O2696O7385
18254I622288N8981N8644M4659N4841P5939Q3088P6237P6704Q4284Q3504Q1642
18243A0400811R2654Q3421Q5145R2940Q1218Q6707Q7246Q6374O8430Q7011Q8512
18232A1340469O9928O8222N7033M0584M3317O9576Q1997P1598P2893P9237P1703
18221A2066557Q6573J12346J19277J19068J13310J35203J34038J30075J35794
18212A3152241J33834J33525J42325J27287R5126P7989O7387Q5198J09649J14358
18202A4238919R5778Q4966R6971R1215J10567J53231J64981J67439J94960J92308
18192A5591335J84364K00985K29273K22858K26941K32747K54277K49056K54152
$$ plain form
18183 17645988 17916301 18186861 18458300 18743888 19025923 19323727 19650965 19977558 20305628
18174 20305628 20662033 21026753 21408784 21813732 22234125 22653351 23101112 23582787 24090450
18165 24090450 24593638 25099231 25622007 26175320 26768095 27399180 28032455 28662335 29283589
18156 29283589 29975680 30746883 31533179 32353322 33229205 34163282 35214157 36373938 37619470
18147 37619470 38976139 40530544 42280128 44233142 46404737 48852687 51655504 54859319
18139 54859319 58517129 62631342 66923285 70169492 70372000 68681965 68962340 71778063
18131 71778063 75123619 74759920 64253204 48300281 39139417 36537686 35562330 32064989
18123 32064989 20349279 5056073 -2698832 -4259637 -3885916 -2582228 -1577573 -267149
$$ packed form
18183A7645988K70313K70560K71439K85588K82035K97804L27238L26593L28070
18174B0305628L56405L64720L82031M04948M20393M19226M47761M81675N07663
18165B4090450N03188N05593N22776N53313N92775O31085O33275O29880O21254
18156B9283589O92091P71203P86296Q20143Q75883R34077J050875J159781J245532
18147C7619470J356669J554405J749584J953014K171595K447950K802817L203815
18139E4859319L657810M114213M291943L246207K02508j690035K80375K815723
18131G1778063L345556l63699j0506716j5952923r160864k601731r75356l497341
18123C2064989j1715710j5293206p754905j560805L73721J303688J004655J310424
$$ plain form
18115 -267149 3782193 9791658 15782340 19849831 21485344 23974090 29337566 36253057
18107 36253057 41216382 35757950 13944267 -8517401 -18032687 -21386778 -25411997 -35463408
18099 -35463408 -52276858 -64372303 -68419343 -69576031 -70001877 -70701380 -72531653 -72861894
18091 -72861894 -71047710 -68570679 -65658048 -62018458 -58093903 -54447109 -51197247 -48306501
18083 -48306501 -45725953 -43446168 -41449180 -39709970 -38114593 -36582769 -35139487 -33801793
18075 -33801793 -32615170 -31609852 -30728076 -29828898 -28905518 -28034368 -27244317 -26554274 -25934928
18066 -25934928 -25284648 -24619100 -23978889 -23364359 -22779717 -22224802 -21682683 -21161374 -20665657
18057 -20665657 -20183034 -19717249 -19275256 -18832152 -18415980 -18038362 -17648266 -17277430 -16924173
$$ packed form
18115b67149M049342O009465N990682M067491J635513K488746N363476O915491
18107C6253057M963325n458432k1813683k2461668r515286l354091m025219j0051411
18099c5463408j6813450j2095445m047040j156688m25846o99503j830273l30241
18091g2861894J814184K477031K912631L639590L924555L646794L249862K890746
18083d8306501K580548K279785J996988J739210J595377J531824J443282J337694
18075c3801793J186623J005318Q81776Q99178R23380Q71150P90051O90043O19346
18066b5934928O50280O65548O40211O14530N84642N54915N42119N21309M95717
18057b0665657M82623M65785M41993M43104M16172L77618L90096L70836L53257
$$ plain form
18048 -16924173 -16577043 -16238174 -15912059 -15594343 -15291716 -14996835 -14716640 -14430816 -14147801
18039 -14147801 -13877021 -13622527 -13367768 -13116147 -12903134 -12686424 -12471670 -12263507 -12064383
18030 -12064383 -11872527 -11676096 -11479632 -11302456 -11136145 -10951843 -10771462 -10595617 -10423105
18021 -10423105 -10249320 -10087353 -9929724 -9766973 -9607444 -9462671 -9324538 -9192947 -9070270
18012 -9070270 -8946376 -8809698 -8673522 -8556076 -8444327 -8330196 -8206341 -8086239 -7966260
18003 -7966260 -7842497 -7749290 -7653390 -7549790 -7442117 -7340415 -7228297 -7135223 -7041130 -6944276
17993 -6944276 -6858177 -6761199 -6668009 -6586970 -6494198 -6406091 -6327610 -6244434 -6162420 -6089804 -5994757
17982 -5994757 -5911101 -5819360 -5730043 -5653477 -5587069 -5528554 -5468730 -5393634 -5319630 -5240971 -5174295
$$ packed form
18048a6924173L47130L38869L26115L17716L02627K94881K80195K85824K83015
18039a4147801K70780K54494K54759K51621K13013K16710K14754K08163J99124
18030a2064383J91856J96431J96464J77176J66311J84302J80381J75845J72512
18021a0423105J73785J61967J57629J62751J59529J44773J38133J31591J22677
18012i070270J23894J36678J36176J17446J11749J14131J23855J20102J19979
18003g966260J23763R3207R5900J03600J07673J01702J12118R3074R4093R6854
17993f944276Q6099R6978R3190Q1039R2772Q8107P8481Q3176Q2014P2616R5047
17982e994757Q3656R1741Q9317P6566O6408N8515N9824P5096P4004P8659O6676
$$ plain form
17971 -5174295 -5118137 -5052768 -4986734 -4925842 -4853604 -4779449 -4719346 -4653280 -4592274 -4537326 -4477294
17960 -4477294 -4420906 -4367800 -4301970 -4235142 -4167148 -4104691 -4038323 -3990796 -3936671 -3879048 -3815284
17949 -3815284 -3753382 -3695524 -3641754 -3588415 -3531770 -3463058 -3404122 -3343776 -3274864 -3204153 -3137633
17938 -3137633 -3107997 -3075150 -3026471 -2967634 -2903034 -2857427 -2835268 -2807778 -2783630 -2743052 -2699967
17927 -2699967 -2656213 -2614471 -2552026 -2494981 -2439562 -2369995 -2314866 -2258323 -2199652 -2142410 -2065650
17916 -2065650 -1987018 -1939590 -1925620 -1913009 -1871841 -1829677 -1798319 -1773820 -1776730 -1773577 -1759502 -1746557
17904 -1746557 -1716326 -1688499 -1670967 -1636396 -1593035 -1552346 -1513964 -1483304 -1458667 -1426767 -1375658
17893 -1375658 -1334080 -1298651 -1257496 -1232101 -1193900 -1139221 -1091607 -1052404 -1017728 -970169 -932018
$$ packed form
17971e174295N6158O5369O6034O0892P2238P4155O0103O6066O1006N4948O0032
17960d477294N6388N3106O5830O6828O7994O2457O6368M7527N4125N7623O3764
17949c815284O1902N7858N3770N3339N6645O8712N8936O0346O8912P0711O6520
17938c137633K9636L2847M8679N8837O4600M5607K2159K7490K4148M0578M3085
17927b699967M3754M1742O2445N7045N5419O9567N5129N6543N8671N7242P6760
17916b065650P8632M7428J3970J2611M1168M2164L1358K4499k910L153J4075J2945
17904a746557L0231K7827J7532L4571M3361M0689L8382L0660K4637L1900N1109
17893a375658M1578L5429M1155K5395L8201N4679M7614L9203L4676M7559L8151
$$ plain form
17882 -932018 -898517 -864339 -829489 -793423 -751912 -700282 -662075 -631784 -595365 -563359 -531930
17871 -531930 -489207 -436777 -382418 -346497 -314206 -268584 -222094 -169923 -124086 -71175 -30958
17860 -30958 10560 40881 72241 103505 133612 179122 230553 268217 300125 348588 405085 466562
17848 466562 511921 561984 617415 680530 750228 813081 866903 909450 958810 1001450 1044850
17837 1044850 1089190 1126742 1174040 1220319 1261856 1301909 1323084 1345659 1384105 1438595 1488370
17826 1488370 1525311 1569816 1629173 1682236 1744959 1811248 1877065 1935062 1979899 2034081 2097366
17815 2097366 2155792 2204202 2249274 2298003 2357006 2405878 2440387 2479273 2520668 2569463 2619402
17804 2619402 2665111 2704958 2748011 2786663 2833224 2874296 2918722 2970895 3029301 3081239 3144049
$$ packed form
17882i32018L3501L4178L4850L6066M1511N1630L8207L0291L6419L2006L1429
17871e31930M2723N2430N4359L5921L2291M5622M6490N2171M5837N2911M0217
17860c0958M1518L0321L1360L1264L0107M5510N1431L7664L1908M8463N6497O1477
17848D66562M5359N0063N5431O3115O9698O2853N3822M2547M9360M2640M3400
17837A044850M4340L7552M7298M6279M1537M0053K1175K2575L8446N4490M9775
17826A488370L6941M4505N9357N3063O2723O6289O5817N7997M4837N4182O3285
17815B097366N8426M8410M5072M8729N9003M8872L4509L8886M1395M8795M9939
17804B619402M5709L9847M3053L8652M6561M1072M4426N2173N8406N1938O2810
$$ plain form
17793 3144049 3197827 3239160 3310023 3393401 3456419 3506551 3571047 3638848 3700131 3747825 3792683
17782 3792683 3855195 3923314 3992148 4065949 4129768 4196719 4270266 4339956 4403173 4470734 4539283
17771 4539283 4616041 4698981 4761744 4837618 4912876 4981476 5059232 5144662 5233659 5316882 5398965
17760 5398965 5486656 5565925 5645802 5743614 5842241 5931125 6014344 6111574 6202261 6297592 6402469
17749 6402469 6497539 6589826 6688549 6793950 6902987 7016572 7136576 7250948 7355195 7474224
17739 7474224 7597123 7718311 7841632 7957159 8072042 8192678 8327546 8458789 8607831
17730 8607831 8750018 8901504 9043976 9196791 9348146 9490497 9641398 9811636 10003021
17721 10003021 10197934 10377416 10558550 10744491 10937927 11133195 11331144 11543241 11752710
$$ packed form
17793C144049N3778M1333P0863Q3378O3018N0132O4496O7801O1283M7694M4858
17782C792683O2512O8119O8834P3801O3819O6951P3547O9690O3217O7561O8549
17771D539283P6758Q2940O2763P5874P5258O8600P7756Q5430Q8997Q3223Q2083
17760E398965Q7691P9269P9877R7812R8627Q8884Q3219R7230R0687R5331J04877
17749F402469R5070R2287R8723J05401J09037J13585J20004J14372J04247J19029
17739G474224J22899J21188J23321J15527J14883J20636J34868J31243J49042
17730H607831J42187J51486J42472J52815J51355J42351J50901J70238J91385
17721A0003021J94913J79482J81134J85941J93436J95268J97949K12097K09469
$$ plain form
17712 11752710 11978822 12199094 12435930 12673271 12906944 13164288 13443990 13716280 13992401
17703 13992401 14283545 14579382 14896199 15237094 15585382 15942286 16320635 16712830 17106416
17694 17106416 17531496 17997052 18459319 18937430 19445578 19975255 20518942 21087946 21685225
17685 21685225 22308979 22968374 23677874 24399423 25119729 25892304 26702200 27552650 28467217
17676 28467217 29467144 30524924 31678266 32979152 34408760 35969794 37720458 39693415
17668 39693415 41924126 44490145 47465656 50853715 54659300 58592528 61564666 62625630
17660 62625630 63012888 63171119 63633999 65834153 67745108 64388950 56460638 47794343
17652 47794343 37165285 29513848 26739026 23273699 15127939 6555651 -2740064 -11809715
$$ packed form
17712A1752710K26112K20272K36836K37341K33673K57344K79702K72290K76121
17703A3992401K91144K95837L16817L40895L48288L56904L78349L92195L93586
17694A7106416M25080M65556M62267M78111N08148N29677N43687N69004N97279
17685B1685225O23754O59395P09500P21549P20306P72575Q09896Q50450R14567
17676B8467217R99927J057780J153342J300886J429608J561034J750664J972957
17668C9693415K230711K566019K975511L388059L805585L933228K972138J060964
17660F2625630L87258J58231M62880K200154J910955l356158p928312q666295
17652D7794343j0629058p651437k774822l465327q145760q572288r295715r069651
$$ plain form
17644 -11809715 -15621502 -15466856 -14637628 -13152791 -10526041 -8458468 -7187030 -5746124
17636 -5746124 -3720818 -1499675 2274676 6970429 8242499 3639430 -2603223 -10675568
17628 -10675568 -18479598 -21727679 -23499433 -29339324 -37559639 -45772125 -55355613 -61684714
17620 -61684714 -63669416 -64486005 -65499072 -65669255 -65745428 -65621147 -64265579 -61980619 -59335311
17611 -59335311 -56396674 -53335666 -50479797 -47971329 -45772785 -43823496 -42055334 -40420121
17603 -40420121 -38934793 -37605654 -36430329 -35356477 -34370279 -33421042 -32492736 -31627724 -30853198
17594 -30853198 -30119455 -29429047 -28789162 -28148983 -27525179 -26918859 -26333098 -25774139 -25240113
17585 -25240113 -24737317 -24246571 -23769857 -23315368 -22876590 -22451571 -22050255 -21660119 -21294536
$$ packed form
17644a1809715l811787J54646Q29228J484837K626750K067573J271438J440906
17636e746124K025306K221143L774351M695753J272070m603069o242653q072345
17628a0675568p804030l248081j771754n839891q220315q212486r583488o329101
17620f1684714j984702q16589j013067j70183p6173J24281J355568K284960K645308
17611e9335311K938637L061008K855869K508468K198544J949289J768162J635213
17603d0420121J485328J329139J175325J073852R86198R49237R28306Q65012P74526
17594c0853198P33743O90408O39885O40179O23804O06320N85761N58959N34026
17585b5240113N02796M90746M76714M54489M38778M25019M01316L90136L65583
$$ plain form
17576 -21294536 -20952557 -20602584 -20266647 -19940054 -19615653 -19306673 -19020866 -18741868 -18459592
17567 -18459592 -18184813 -17919346 -17663048 -17398180 -17139083 -16902479 -16661184 -16419718 -16193104
17558 -16193104 -15966781 -15746614 -15554708 -15381044 -15208059 -15017845 -14845170 -14717103 -14661438
17549 -14661438 -14602686 -14489116 -14342943 -14214800 -14136169 -14099222 -14039634 -13946239 -13833012 -13703063
17539 -13703063 -13566265 -13441954 -13318425 -13178944 -13035060 -12875312 -12734812 -12611815 -12493777
17530 -12493777 -12375476 -12247482 -12134650 -12061257 -12019710 -11977235 -11902068 -11810556 -11746651 -11715391
17520 -11715391 -11693047 -11655704 -11581515 -11501016 -11433543 -11369121 -11295116 -11211251 -11135580 -11054752 -10962855
17509 -10962855 -10872951 -10774874 -10684570 -10602413 -10517985 -10448166 -10384201 -10322877 -10245719 -10164257 -10095440
$$ packed form
17576b1294536L41979L49973L35937L26593L24401L08980K85807K78998K82276
17567a8459592K74779K65467K56298K64868K59097K36604K41295K41466K26614
17558a6193104K26323K20167J91906J73664J72985J90214J72675J28067N5665
17549a4661438N8752J13570J46173J28143P8631L6947N9588R3395J13227J29949
17539a3703063J36798J24311J23529J39481J43884J59748J40500J22997J18038
17530a2493777J18301J27994J12832P3393M1547M2475P5167R1512O3905L1260
17520a1715391K2344L7343P4189Q0499O7473O4422P4005Q3865P5671Q0828R1897
17509a0962855Q9904R8077R0304Q2157Q4428O9819O3965O1324P7158Q1462O8817
$$ plain form
17498 -10095440 -10031568 -9968380 -9904866 -9839088 -9788183 -9736729 -9671513 -9608599 -9558410 -9507200 -9455096
17487 -9455096 -9400499 -9330920 -9267083 -9224768 -9179569 -9129527 -9080869 -9033387 -8980060 -8915788 -8853524
17476 -8853524 -8799776 -8739731 -8682704 -8625837 -8565521 -8514248 -8457854 -8415541 -8371585 -8318889 -8265870
17465 -8265870 -8216949 -8180032 -8141047 -8108570 -8069273 -8027528 -7990418 -7951117 -7921764 -7904383 -7883018
17454 -7883018 -7856499 -7828706 -7799472 -7771385 -7735060 -7701893 -7664107 -7621456 -7578719 -7539319 -7495071
17443 -7495071 -7447509 -7396023 -7359441 -7325852 -7287019 -7301002 -7312648 -7293614 -7283996 -7279052 -7254966 -7240846
17431 -7240846 -7230296 -7205353 -7172961 -7151306 -7132620 -7125162 -7096081 -7069553 -7040365 -7016376 -6997660
17420 -6997660 -6968351 -6938049 -6913617 -6875977 -6845974 -6817502 -6790843 -6767845 -6744724 -6726497 -6703377
$$ packed form
17498a0095440O3872O3188O3514O5778N0905N1454O5216O2914N0189N1210N2104
17487i455096N4597O9579O3837M2315M5199N0042M8658M7482N3327O4272O2264
17476h853524N3748O0045N7027N6867O0316N1273N6394M2313M3956N2696N3019
17465h265870M8921L6917L8985L2477L9297M1745L7110L9301K9353J7381K1365
17454g883018K6519K7793K9234K8087L6325L3167L7786M2651M2737L9400M4248
17443g495071M7562N1486L6582L3589L8833j3983j1646J9034R618M944K4086J4120
17431g240846J0550K4943L2392K1655J8686P458K9081K6528K9188K3989J8716
17420f997660K9309L0302K4432L7640L0003K8472K6659K2998K3121J8227K3120
$$ plain form
17409 -6703377 -6676187 -6656783 -6629562 -6597741 -6576899 -6556477 -6530385 -6513340 -6493944 -6460297 -6433313
17398 -6433313 -6412737 -6397496 -6370858 -6348815 -6337107 -6309169 -6283666 -6257728 -6231655 -6204250 -6183203
17387 -6183203 -6160700 -6142651 -6120325 -6098424 -6082379 -6062785 -6047768 -6040633 -6026717 -6015209 -6007219 -5980076
17375 -5980076 -5945518 -5929235 -5912480 -5890439 -5884034 -5858381 -5831099 -5811347 -5792555 -5785328 -5772704 -5753120
17363 -5753120 -5747445 -5731743 -5705329 -5689669 -5671306 -5652486 -5637128 -5624535 -5610174 -5598805 -5581618
17352 -5581618 -5558670 -5542921 -5534996 -5523990 -5515677 -5503575 -5483086 -5462058 -5439751 -5430120 -5406712 -5375854
17340 -5375854 -5364130 -5333566 -5318272 -5317864 -5307681 -5287276 -5276244 -5266947 -5251451 -5240365 -5226296 -5217455
17328 -5217455 -5201609 -5183758 -5170951 -5163660 -5150852 -5136491 -5116557 -5096118 -5074250 -5061400 -5042798
$$ packed form
17409f703377K7190J9404K7221L1821K0842K0422K6092J7045J9396L3647K6984
17398f433313K0576J5241K6638K2043J1708K7938K5503K5938K6073K7405K1047
17387f183203K2503J8049K2326K1901J6045J9594J5017P135J3916J1508P990K7143
17375e980076L4558J6283J6755K2041O405K5653K7282J9752J8792P227J2624J9584
17363e753120N675J5702K6414J5660J8363J8820J5358J2593J4361J1369J7187
17352e581618K2948J5749P925J1006Q313J2102K0489K1028K2307R631K3408L0858
17340e375854J1724L0564J5294M08J0183K0405J1032R297J5496J1086J4069Q841
17328e217455J5846J7851J2807P291J2808J4361J9934K0439K1868J2850J8602
$$ plain form
17317 -5042798 -5035180 -5020136 -5002562 -4986005 -4977329 -4965804 -4961534 -4950008 -4934977 -4926726 -4906367 -4888085
17305 -4888085 -4874343 -4865712 -4868070 -4859002 -4833316 -4816746 -4809628 -4805714 -4792505 -4773280 -4756213 -4737267
17293 -4737267 -4733560 -4728777 -4710463 -4685479 -4685308 -4683948 -4680314 -4659550 -4636591 -4634995 -4624314 -4627413 -4629942
17280 -4629942 -4630532 -4616433 -4605495 -4591159 -4581269 -4566682 -4561370 -4554884 -4544400 -4532783 -4522728 -4519613
17268 -4519613 -4514353 -4499129 -4477933 -4467073 -4471345 -4463451 -4456468 -4459339 -4447156 -4442248 -4428885 -4413775
17256 -4413775 -4396219 -4404822 -4422545 -4416243 -4401401 -4391297 -4383174 -4371880 -4355079 -4346391 -4343123 -4341714
17244 -4341714 -4337441 -4326848 -4306542 -4290793 -4278584 -4263354 -4254396 -4246069 -4248201 -4245041 -4211210 -4191268
17232 -4191268 -4173339 -4152190 -4140204 -4150345 -4144883 -4142999 -4142568 -4134999 -4128357 -4117811 -4108123 -4094604 -4084332
$$ packed form
17317e042798P618J5044J7574J6557Q676J1525M270J1526J5031Q251K0359J8282
17305d888085J3742Q631k358R068K5686J6570P118L914J3209J9225J7067J8946
17293d737267L707M783J8314K4984J71J360L634K0764K2959J596J0681l099k529
17280d629942n90J4099J0938J4336R890J4587N312O486J0484J1617J0055L115
17268d519613N260J5224K1196J0860m272P894O983k871J2183M908J3363J5110
17256d413775J7556q603j7723O302J4842J0104Q123J1294J6801Q688L268J409
17244d341714M273J0593K0306J5749J2209J5230Q958Q327k132L160L3831J9942
17232d191268J7929K1149J1986j0141N462J884M31P569O642J0546R688J3519J0272
$$ plain form
17219 -4084332 -4079481 -4087347 -4095118 -4084432 -4074721 -4066289 -4060337 -4042219 -4027083 -4009292 -4008386 -3993193 -3975924
17206 -3975924 -3960475 -3950066 -3943778 -3944358 -3947197 -3944197 -3938556 -3931312 -3935443 -3932659 -3926833 -3918026 -3912786 -3910371
17192 -3910371 -3895622 -3886943 -3892157 -3871576 -3866622 -3860122 -3842375 -3825348 -3818658 -3798782 -3795792 -3798217 -3800729
17179 -3800729 -3805331 -3804821 -3793137 -3772941 -3767334 -3769230 -3760146 -3751694 -3741955 -3724438 -3707037 -3705715 -3701728
17166 -3701728 -3691152 -3683785 -3688891 -3683344 -3665740 -3650812 -3654528 -3663796 -3663665 -3659827 -3637630 -3620691 -3615147
17153 -3615147 -3600296 -3585112 -3581054 -3563438 -3545222 -3545149 -3539177 -3539698 -3538153 -3531854 -3516220 -3500087 -3495460
17140 -3495460 -3503672 -3488792 -3489348 -3472507 -3461474 -3455998 -3442061 -3433074 -3442049 -3448428 -3446719 -3436079 -3436621
17127 -3436621 -3425511 -3422152 -3423039 -3409464 -3393809 -3380386 -3375478 -3367105 -3362610 -3357124 -3359461 -3341127 -3318159
$$ packed form
17219d084332M851p866p771J0686R711Q432N952J8118J5136J7791R06J5193J7269
17206c975924J5449J0409O288n80k839L000N641P244m131K784N826Q807N240K415
17192c910371J4749Q679n214K0581M954O500J7747J7027O690J9876K990k425k512
17179c800729m602N10J1684K0196N607j896R084Q452R739J7517J7401J322L987
17166c701728J0576P367n106N547J7604J4928l716r268J31L838K2197J6939N544
17153c615147J4851J5184M058J7616J8216P3N972n21J545O299J5634J6133M627
17140c495460q212J4880n56J6841J1033N476J3937Q987q975o379J709J0640n42
17127c436621J1110L359q87J3575J5655J3423M908Q373M495N486k337J8334K2968
$$ plain form
17114 -3318159 -3302974 -3293995 -3303736 -3292945 -3282180 -3286969 -3284420 -3269802 -3257150 -3243407 -3229885 -3216502
17102 -3216502 -3213682 -3208163 -3200849 -3208579 -3218021 -3218783 -3203638 -3190082 -3176366 -3156807 -3134590 -3119728 -3099651
17089 -3099651 -3085879 -3090926 -3073503 -3058978 -3045035 -3004627 -2972444 -2952249 -2931607 -2914202 -2901295
17078 -2901295 -2885821 -2882241 -2865444 -2854362 -2838402 -2868680 -2918405 -2959849 -2997173 -3027369 -3037033 -3060481
17066 -3060481 -3106507 -3149378 -3200554 -3245687 -3259199 -3248786 -3242860 -3225490 -3199562 -3189366 -3186116 -3179566
17054 -3179566 -3156826 -3137293 -3115449 -3087226 -3078158 -3103516 -3150828 -3189524 -3219654 -3224291 -3246302 -3281158
17042 -3281158 -3305305 -3347317 -3384038 -3397076 -3399274 -3417230 -3412248 -3398206 -3398904 -3395350 -3391263 -3368868
17030 -3368868 -3342532 -3329966 -3302647 -3279371 -3264215 -3254238 -3247008 -3233677 -3224348 -3222629 -3211090 -3193844
$$ packed form
17114c318159J5185Q979r741J0791J0765m789K549J4618J2652J3743J3522J3383
17102c216502K820N519P314p730r442p62J5145J3556J3716J9559K2217J4862K0077
17089c099651J3772n047J7423J4525J3943M0408L2183K0195K0642J7405J2907
17078b901295J5474L580J6797J1082J5960l0278m9725m1444l7324l0196r664k3448
17066c060481m6026m2871n1176m5133j3512J0413N926J7370K5928J0196L250O550
17054c179566K2740J9533K1844K8223R068k5358m7312l8696l0130m637k2011l4856
17042c281158k4147m2012l6721j3038k198j7956M982J4042o98L554M087K2395
17030c368868K6336J2566K7319K3276J5156R977P230J3331R329J719J1539J7246
$$ plain form
17018 -3193844 -3186055 -3177303 -3161422 -3153690 -3160943 -3152146 -3138408 -3121013 -3115576 -3116304 -3119132 -3107831 -3105570
17005 -3105570 -3093646 -3075069 -3063912 -3063064 -3062650 -3060657 -3051157 -3040074 -3041207 -3039407 -3033836 -3027799 -3028991
16992 -3028991 -3023519 -3014493 -3003316 -2997873 -3010541 -3002001 -2981898 -2975500 -2971345 -2953996 -2948211 -2943693 -2930487
16979 -2930487 -2933531 -2931878 -2929808 -2920571 -2910082 -2915573 -2907682 -2902666 -2898440 -2896526 -2903146 -2900118 -2883870
16966 -2883870 -2864471 -2861528 -2855229 -2857951 -2867924 -2864733 -2860509 -2858151 -2847043 -2840294 -2849643 -2842220 -2826596
16953 -2826596 -2819080 -2818030 -2825866 -2826768 -2822168 -2819086 -2819175 -2811503 -2796440 -2796769 -2794290 -2796179 -2794530 -2790442 -2792377
16938 -2792377 -2784422 -2785922 -2781338 -2768630 -2756315 -2750469 -2752073 -2755182 -2755775 -2747735 -2748253 -2742778 -2742349 -2738749
16924 -2738749 -2739483 -2727830 -2722938 -2721851 -2712442 -2708298 -2704893 -2704761 -2702632 -2692198 -2679891 -2679344 -2680129 -2692171
$$ packed form
17018c193844P789Q752J5881P732p253Q797J3738J7395N437p28k828J1301K261
17005c105570J1924J8577J1157Q48M14J993R500J1083j133J800N571O037j192
16992c028991N472R026J1177N443j2668Q540K0103O398M155J7349N785M518J3206
16979b930487l044J653K070R237J0489n491P891N016M226J914o620L028J6248
16966b883870J9399K943O299k722r973L191M224K358J1108O749r349P423J5624
16953b826596P516J050p836r02M600L082q9P672J5063l29K479j889J649M088j935
16938b792377P955j500M584J2708J2315N846j604l109n93Q040n18N475M29L600
16924b738749p34J1653M892J087R409M144L405J32K129J0434J2307N47p85j2042
$$ plain form
16910 -2692171 -2689767 -2684290 -2687334 -2676845 -2660013 -2653346 -2649659 -2653258 -2645117 -2643813 -2651086 -2652245 -2639237
16897 -2639237 -2629095 -2625893 -2627391 -2624939 -2624247 -2621773 -2614953 -2613259 -2615389 -2618594 -2623276 -2623881 -2612027 -2602537
16883 -2602537 -2589394 -2574474 -2583968 -2591165 -2586251 -2583357 -2579864 -2578263 -2578538 -2591434 -2600259 -2593632 -2571282
16870 -2571282 -2559887 -2563206 -2563378 -2569285 -2573994 -2579083 -2573065 -2559433 -2559618 -2561169 -2558008 -2559669 -2553165 -2541422
16856 -2541422 -2538166 -2534402 -2529660 -2531001 -2534774 -2524640 -2514113 -2517352 -2519184 -2527339 -2519586 -2511085 -2516477
$$ packed form
16910b692171K404N477l044J0489J6832O667L687l599Q141J304p273j159J3008
16897b639237J0142L202j498K452O92K474O820J694k130l205m682o05J1854R490
16883b602537J3143J4920r494p197M914K894L493J601k75j2896q825O627K2350
16870b571282J1395l319j72n907m709n089O018J3632j85j551L161j661O504J1743
16856b541422L256L764M742j341l773J0134J0527l239j832q155P753Q501n392
$$ [...]
##END NTUPLES=NMR SPECTRUM
##END=
