##TITLE=Analysis number 316465
Compound Code cc 49902
Book Reference 458/80
Project Code adrs
Chemist Name stevem
##JCAMPDX= 6.0         $$ Bruker NMR JCAMP-DX V2.0
##DATA TYPE= NMR SPECTRUM
##DATA CLASS= NTUPLES
##ORIGIN= Bruker BioSpin GmbH
##OWNER= nmr
$$ XWIN-NMR		Version 3.5
$$ Mon Jan 16 13:52:35 2006 GMT Standard Time (UT+0h)  MAYBRIDGE\nmr@NMR_250MHZ
##.OBSERVE FREQUENCY= 250.131544655141
##.OBSERVE NUCLEUS= ^1H
##.ACQUISITION MODE= SIMULTANEOUS (DQD)
##.ACQUISITION SCHEME= undefined
##.AVERAGES= 16
##.DIGITISER RES= 18
##SPECTROMETER/DATA SYSTEM= dpx250
##.PULSE SEQUENCE= zg30
##.SOLVENT NAME= CDCl3
##.SHIFT REFERENCE= (INTERNAL, CDCl3, 0, 16.522)
##AUDIT TRAIL= $$ (NUMBER, WHEN, WHO, WHERE, WHAT)
$$ ##TITLE= Audit trail, XWIN-NMR		Version 3.5
$$ ##JCAMPDX= 5.01
$$ ##ORIGIN= Bruker BioSpin GmbH
$$ ##OWNER= nmr
$$ C:\u/data/dgb/nmr/ADRS/14780/pdata/1/auditp.txt
$$ ##AUDIT TRAIL=  $$ (NUMBER, WHEN, WHO, WHERE, WHAT)
(   1,<2006-01-16 13:51:36.93 +000>,<MAYBRIDGE\nmr>,<NMR_250MHZ>,
      <created by zg, POWCHK disabled, PULCHK disabled
       configuration hash MD5:
       62 19 C7 07 E1 42 D1 B7 37 6C 3D D0 77 39 F9 E6
       data hash MD5: 64K
       49 43 93 4D 2E 00 2B 0F 73 01 52 5E 82 C0 D9 AD>)
(   2,<2006-01-16 13:52:03.56 +000>,<MAYBRIDGE\nmr>,<NMR_250MHZ>,
      <Start of raw data processing
       ef LB = 0.3 FT_mod = 6 PKNL = 1 SI = 32K 
       data hash MD5: 32K
       8D C2 27 F4 CE 69 36 72 D1 10 EB A2 AD FF 9A 51>)
(   3,<2006-01-16 13:52:06.89 +000>,<MAYBRIDGE\nmr>,<NMR_250MHZ>,
      <apk 
       data hash MD5: 32K
       46 F1 22 14 9C CB 87 43 D1 AF 60 CD 8A 6E E3 4C>)
(   4,<2006-01-16 13:52:08.28 +000>,<MAYBRIDGE\nmr>,<NMR_250MHZ>,
      <abs ABSG = 5 
       data hash MD5: 32K
       19 A0 13 B8 32 28 65 0C 6A 25 AD 3D 5F AE FE 66>)
$$ ##END=
$$ 
$$ hash MD5
$$ B7 82 07 31 9B DF B2 2D A8 53 80 06 82 A3 2B 55
##$RELAX= 
##$RELAX= 
##$RELAX= 
##$RELAX= 
##$RELAX= 
##$RELAX= 
##$RELAX= 
$$ Bruker specific parameters
$$ --------------------------
##$DU= <C:\u>
##$EXPNO= 14780
##$NAME= <ADRS>
##$PROCNO= 1
##$TYPE= <nmr>
##$USER= <dgb>
##$AMP= (0..31)
100 100 100 100 100 100 100 100 100 100 100 100 100 100 100 100 100 100 
100 100 100 100 100 100 100 100 100 100 100 100 100 100 
##$AQSEQ= 0
##$AQ_mod= 3
##$AUNM= <au_zg>
##$AUTOPOS= <34 >
##$BF1= 250.13
##$BF2= 250.13
##$BF3= 250.13
##$BF4= 250.13
##$BF5= 500.13
##$BF6= 500.13
##$BF7= 500.13
##$BF8= 500.13
##$BYTORDA= 1
##$CFDGTYP= 0
##$CFRGTYP= 5
##$CHEMSTR= <none>
##$CNST= (0..31)
1 1 145 1 1 1 1 1 1 1 1 1 1 1 1 1 1 1 1 1 1 1 1 1 1 1 1 1 1 1 1 1 
##$CPDPRG= <>
##$CPDPRG1= <>
##$CPDPRG2= <>
##$CPDPRG3= <>
##$CPDPRG4= <mlev>
##$CPDPRG5= <mlev>
##$CPDPRG6= <mlev>
##$CPDPRG7= <mlev>
##$CPDPRG8= <mlev>
##$CPDPRGB= <>
##$CPDPRGT= <>
##$D= (0..31)
0 1 0 0 0 0 0 0 0 0.06 0 0 0 0 0 0 0.0002 0 0 0 0 0 0 0 0 0 0 0 0 0 0 
0 
##$DATE= 1137419494
##$DBL= (0..7)
120 120 120 120 120 120 120 120 
##$DBP= (0..7)
150 150 150 150 150 150 150 150 
##$DBP07= 0
##$DBPNAM0= <>
##$DBPNAM1= <>
$$ [...]
##$SUBNAM7= <"">
##$SUBNAM8= <"">
##$SUBNAM9= <"">
##$SW= 20.6930455092707
##$SWIBOX= (0..15)
0 0 3 0 0 0 0 0 0 0 0 0 0 0 0 0 
##$SW_h= 5175.983436853
##$TD= 65536
##$TD0= 1
##$TE= 294.16
##$TE2= 300
##$TE3= 300
##$TEG= 300
##$TL= (0..7)
0 120 120 120 120 120 120 120 
##$TP= (0..7)
150 150 150 150 150 150 150 150 
##$TP07= 0
##$TPNAME0= <>
##$TPNAME1= <>
##$TPNAME2= <>
##$TPNAME3= <>
##$TPNAME4= <>
##$TPNAME5= <>
##$TPNAME6= <>
##$TPNAME7= <>
##$TPOAL= (0..7)
0.5 0.5 0.5 0.5 0.5 0.5 0.5 0.5 
##$TPOFFS= (0..7)
0 0 0 0 0 0 0 0 
##$TUNHIN= 0
##$TUNHOUT= 0
##$TUNXOUT= 0
##$USERA1= <user>
##$USERA2= <user>
##$USERA3= <user>
##$USERA4= <user>
##$USERA5= <user>
##$V9= 5
##$VALIST= <valist>
##$VCLIST= <CCCCCCCCCCCCCCC>
##$VD= 0
##$VDLIST= <DDDDDDDDDDDDDDD>
##$VPLIST= <PPPPPPPPPPPPPPP>
##$VTLIST= <TTTTTTTTTTTTTTT>
##$WBST= 1024
##$WBSW= 4
##$XGAIN= (0..3)
0 0 0 0 
##$XL= 0
##$YL= 0
##$YMAX_a= 453411
##$YMIN_a= -517741
##$ZGOPTNS= <>
##$ZL1= 120
##$ZL2= 120
##$ZL3= 120
##$ZL4= 120
##$ABSF1= 16.522
##$ABSF2= -4.171173
##$ABSG= 5
##$ABSL= 3
##$ALPHA= 0
##$AQORDER= 0
##$ASSFAC= 0
##$ASSFACI= 0
##$ASSFACX= 0
##$ASSWID= 0
##$AUNMP= <proc_1d>
##$AZFE= 0.1
##$AZFW= 0.1
##$BCFW= 0
##$BC_mod= 0
##$BYTORDP= 0
##$COROFFS= 0
##$CY= 12.5
##$DATMOD= 1
##$DC= 0
##$DFILT= <>
##$DTYPP= 0
##$F1P= 14.0000005364418
##$F2P= -0.99999901652339
##$FCOR= 0.5
##$FTSIZE= 32768
##$FT_mod= 6
##$GAMMA= 0
##$GB= 0
##$INTBC= 1
##$INTSCL= 1
##$ISEN= 128
##$LB= 0.3
##$LEV0= 0
##$LPBIN= 0
##$MAXI= 10000
##$MC2= 0
##$MEAN= 0
##$ME_mod= 0
##$MI= 0
##$NCOEF= 0
##$NC_proc= -5
##$NLEV= 6
##$NOISF1= 0
##$NOISF2= 0
##$NSP= 0
##$NTH_PI= 0
##$NZP= 0
##$OFFSET= 16.522
##$PC= 1
##$PHC0= 88.73083
##$PHC1= -8.55547
##$PH_mod= 1
##$PKNL= yes
##$PPARMOD= 0
##$PSCAL= 4
##$PSIGN= 0
##$REVERSE= no
##$SF= 250.13
##$SI= 32768
##$SIGF1= 0
##$SIGF2= 0
##$SINO= 400
##$SIOLD= 32768
##$SREGLST= <1H.CDCl3>
##$SSB= 0
##$STSI= 32768
##$STSR= 0
##$SW_p= 5175.98343685301
##$SYMM= 0
##$S_DEV= 0
##$TDeff= 65536
##$TDoff= 0
##$TI= <Analysis number 999999
Compound Code 99
Book Reference 9
Project Code 9>
##$TILT= no
##$TM1= 0
##$TM2= 0
##$TOPLEV= 0
##$USERP1= <user>
##$USERP2= <user>
##$USERP3= <user>
##$USERP4= <user>
##$USERP5= <user>
##$WDW= 1
##$XDIM= 32768
##$YMAX_p= 447172485
##$YMIN_p= -247828
$$ End of Bruker specific parameters
$$ ---------------------------------
##NTUPLES= NMR SPECTRUM
##VAR_NAME=  FREQUENCY,     SPECTRUM/REAL,   SPECTRUM/IMAG
##SYMBOL=    X,             R,               I
##VAR_TYPE=  INDEPENDENT,   DEPENDENT,       DEPENDENT
##VAR_FORM=  AFFN,          ASDF,            ASDF
##VAR_DIM=   32768,         32768,           32768
##UNITS=     HZ,            ARBITRARY UNITS, ARBITRARY UNITS
##FACTOR=    0.157963299565203, 1,           1
##FIRST=     4132.6476996994, 0,             0
##LAST=      -1043.33573715361, 0,           0
##MIN=       -1043.33573715361, -247828,     0
##MAX=       4132.6476996994, 447172485,     0
$$ Real data points
##PAGE= N=1
##DATA TABLE= (X++(R..R)), XYDATA
$$ [...]
23769e4305L8609l1725j1225M9768J0738J6694j3366O938k7840k0113L3712L4737
$$ -54305 -15696 -47421 -58646 -8878 1860 18554 5188 12126 -15714 -35827 -2115 32622
23757C2622L955K611l8027l9344j2336L7350N1406J2343l3366J1402P295R054
$$ 32622 36577 39188 1161 -38183 -50519 -13169 38237 50580 17214 28616 35911 44965
23745D4965k3681j6066K4931J7860L3139j6107p3648K2275J3150L4627M0234n0522
$$ 44965 21284 5218 30149 48009 81148 65041 -8607 13668 26818 61445 101679 51157
23733E1157m5733q654M5788K24n6173q590K961K0256K5697K7275M0937n8900n1373
$$ 51157 5424 -3230 42558 42782 -13391 -21981 -19020 1236 26933 54208 95145 36245 -15128
23720a5128l6238r172m0586N0869N365J472K4180m911q098L183p885K1471N4477
$$ -15128 -51366 -60538 -101124 -50255 -44890 -43418 -19238 -24149 -32247 -29064 -36949 -15478 38999
23707C8999N942j4410n3599n0612O832L5535L914K4267L5291K3696o1248n0717
$$ 38999 44941 30531 -23068 -73680 -66848 -31313 -27399 -3132 32159 55855 -5393 -56110
23695e6110K5965r522k1159L6602J8082L8283l846l1630r994m6163k8559O4214
$$ -56110 -30145 -39667 -60826 -24224 -6142 32141 28295 -3335 -13329 -59492 -88051 -23837
23683b3837O82k4534L721K5994K9663J1279K4379R943l1671O1842K6562n9029
$$ -23837 -23155 -47689 -43968 -17974 11689 22968 47347 57290 25619 87461 114023 54994
23671E4994k9268J8211R1528J7354j27110j5986M6051L4561M703m3994k3319k7939
$$ 54994 25726 43937 135465 152819 25709 9723 55774 90335 95038 51044 27725 -214
23659b14k6374P478N636M2843j3649k6799N310O2124N383j0012r401L0028k695
$$ -214 -26588 -19110 -13474 29369 15720 -11079 -5769 56355 61738 51726 42325 72353 69658
23646F9658n6413J0659q171K3295J8851J6024p7393k9623J5041J6753K6659k6632
$$ 69658 13245 23904 15733 39028 57879 73903 -3490 -33113 -18072 -1319 25340 -1292
23634a292m6036K38L7189M9272n427J457l0191J530l890J7271o865J9870J436
$$ -1292 -47328 -47090 -9901 39371 33944 35401 5210 6740 2850 20121 13256 33126 34562
23621C4562n5148n6631J5228R700R915l0665k5416Q796n578K5099M9595R016L089
$$ 34562 -20586 -77217 -61989 -52289 -42374 -73039 -98455 -89659 -95237 -70138 -20543 -11527 -8438
23608h438l1901L9757J7190J6778P892l643P6193l3373q1042o4604j640j2015
$$ -8438 -40339 -582 16608 33386 41278 37635 113828 80455 -587 -65191 -66831 -78846
23596g8846J9527L5061L870l7120J6834Q0943N0660p0618p8580L1492J2043J0926
$$ -78846 -59319 -24258 -20388 -57508 -40674 40269 90929 20311 -58269 -26777 -14734 -3808
23584c808J7396k5953J3056k5633k1447J4690L7172l8092l8686j2644M8581R9291
$$ -3808 13588 -12365 691 -24942 -46389 -31699 5473 -32619 -71305 -83949 -35368 63923
23572F3923M7831k2321k8208m8600l3829K9277L0605k3662j3652M2406L3303k0183
$$ 63923 111754 89433 61225 12625 -21204 8073 38678 15016 1364 43770 77073 56890
23560E6890j2081m9204j4704N109M2013K872n518r873K3868m8791J2453J5257
$$ 56890 44809 -4395 -19099 -13990 28023 30895 25377 15504 39372 -9419 3034 18291
23548A8291J980J0847j5436l4309l7135j58k5371Q055L1597L2362o308R439j7236
$$ 18291 20271 31118 15682 -18627 -55762 -55920 -81291 -73236 -41639 -9277 -15585 -6146 -23382
23535b3382l4455P061R825M792R367K1953K1061L206m5912p917K0993k800K3374
$$ -23382 -57837 -50776 -40951 -36159 -26792 -4839 16222 19428 -26484 -34401 -13408 -16208 7166
23522G166K5381k5996J1697J1384n1065j062q051l5241k9470P4319O1616M3306
$$ 7166 32547 6551 18248 29632 -21433 -22495 -30546 -65787 -95257 -20938 40678 83984
23510H3984j768k51k2279j7850r242j1670L5399j4081n6200n9461L0924P6598
$$ 83984 82216 81965 59686 41836 32594 20924 56323 42242 -13958 -73419 -42495 34103
23498C4103P810n0433r491K4561j2306o3503q740K5015L972J5473L5796O455m1108
$$ 34103 41913 -8520 -18011 6550 -5756 -69259 -77999 -52984 -49012 -33539 2257 8712 -32396
23485c2396K3933n26n0332m3158j4217R788j6203K6318L9250J0583K3174j062
$$ -32396 -8463 -8989 -59321 -102479 -116696 -106908 -123111 -96793 -57543 -46960 -23786 -24848
23473b4848K9738o556p8319K0537N1596m671L9636J7525M1407m888o3110k8808
$$ -24848 4890 -1666 -79985 -59448 -7852 -12523 27113 44638 86045 81157 18047 -10761
23461a0761O88K764L7266L4000o5378k5006K8422j5419r314n6047n1399K2462
$$ -10761 -10073 -7309 29957 63957 -1421 -26427 1995 -13424 -22738 -78785 -130184 -107722
23449a07722J3434K6663r115L3493K1876k2762K9280M8013j9867K5056m1121j7068
$$ -107722 -94288 -67625 -76740 -43247 -21371 -44133 -14853 33160 13293 38349 -2772 -19840
23437a9840M2908K6576k0911l9741p448j3850j3715M5197k2813k1976J071L5518
$$ -19840 23068 49644 28733 -11008 -18456 -32306 -46021 -824 -23637 -45613 -44542 -9024
23425i024k0696k1424j6268K5049k5520O1327O1190L6912N6370k3095k9708n6340
$$ -9024 -29720 -51144 -67412 -42363 -67883 -6556 54634 91546 147916 124821 95113 38773
23413C8773l9079J4193M8267J7609j8323k9281k3535m1032p2242J9600J9198J2456
$$ 38773 -306 13887 62154 79763 61440 32159 8624 -32408 -104650 -85050 -65852 -53396
23401e3396L1554K4422n2083J7230R277L1431KM1555J067j7367K6286K4690l4336
$$ -53396 -21842 2580 -49503 -32273 -22996 8435 8437 49992 51059 33692 59978 84668 50332
23388E0332L0914K2887j2817m6014p43J5904n5577m6257M864N179n079k3725k0618
$$ 50332 81246 104133 91316 45302 44559 60463 4886 -41371 -36507 -31328 -36407 -60132 -80750
23375h0750k087q116k7574L1942M3026K2165J2276Q0286J4389l1957J4462l6840
$$ -80750 -82837 -90953 -118527 -86585 -43559 -21394 -9118 71168 85557 53600 68062 31222
23363C1222o5376k9466k4780M5437Q1484l4882m7221j0692L1128R622j4745Q950
$$ 31222 -34154 -63620 -88400 -42963 38521 3639 -43582 -54274 -23146 -13524 -28269 -19319
23351a9319K3732K8026j59p1457K2898P443j3014j4792j1273l049J5160J642J5011
$$ -19319 4413 32439 32280 -39177 -16279 -8836 -21850 -36642 -47915 -50964 -35804 -34162 -19151
23338a9151k1643l2048n441J2529k9796k0226P3312J838l5498j1788M3828p721
$$ -19151 -40794 -72842 -78283 -65754 -95550 -115776 -42464 -40626 -76124 -87912 -44084 -51805
23326e1805K8067k7434L3646K7112p046o134k2429k5300N815J5701K9180P08K2578
$$ -51805 -23738 -51172 -17526 9586 2540 -3594 -26023 -51323 -45508 -29807 -627 81 22659
23313B2659N3822o6920n6469J4897J6922l8170m4180l5246M8147N3414q556k3547
$$ 22659 76481 9561 -46908 -32011 -15089 -53259 -97439 -132685 -84538 -31124 -39680 -63227
23301f3227L1702R954j0721j4998M9054m874m9634k4986j156O403O7760n502N226
$$ -63227 -31525 -21571 -32292 -47290 1764 -3110 -52744 -77730 -78886 -72483 -4723 -10225 -4999
23288d999K1858J0705L8643j3621n6054L1784K1881j7689K8223J9910j8985m06
$$ -4999 16859 27564 66207 52586 -3468 28316 50197 32508 60731 80641 61656 61250
23276F1250k4302m2125j0652n0335j7886N2919L5098Q813j5935j5972J5056j2661
$$ 61250 36948 -5177 -15829 -66164 -84050 -31131 3967 12780 -3155 -19127 -4071 -16732
23264a6732J3785Q1814M2292n558m7388Q530j6130n294k3627o5523n4125J1824
$$ -16732 -2947 78867 121159 115601 68213 76743 60613 55319 31692 -33831 -87956 -76132
23252g6132J9780L7528M3841K2422l9080j7357n0661k712L8166n1197M1572K1666
$$ -76132 -56352 -18824 25017 47439 8359 -8998 -59659 -62371 -24205 -75402 -33830 -12164
23240a2164o7166K3631L7188L882K5093K5145k5928j4522K1393Q908m0384K7913
$$ -12164 -79330 -55699 -18511 -14629 10464 35609 9681 -4841 16552 25460 -14924 12989
23228A2989K4063j4417n73o934l0401j1367N1673J5600j9828j0239L938n4445
$$ 12989 37052 22635 22062 15128 -15273 -26640 25033 40633 20805 10566 14504 -39941
23216c9941m4592j4506J1123J9042j7508J5355n864l1512j128Q015L9294J4860
$$ -39941 -84533 -99039 -87916 -68874 -86382 -71027 -76891 -108403 -109531 -101516 -62222 -47362
23204d7362j8066K4189k6590n4902L0635J6463M9439L3209k2124J5888M8200J0437
$$ -47362 -65428 -41239 -67829 -122731 -92096 -75633 -26194 7015 -15109 779 48979 59416
23192E9416m5515J7121j1535n4475K52p283K5399J5899J0184k8482J6339L3282
$$ 59416 13901 31022 19487 -34988 -34736 -42019 -16620 -721 9463 -19019 -2680 30602
23180C0602j623j7468j0348k1088m0906N0913M7267l9579m1358R943M7334O5739
$$ 30602 28979 11511 1163 -19925 -60831 -9918 37349 -2230 -43588 -33645 13689 79428
23168G9428k6737J7575k0290P083l4159q4886j880O0091l785l3047L4093O0077
$$ 79428 52691 70266 49976 57059 22900 -61986 -63866 -3775 -7560 -40607 -6514 53563
23156E3563M7600J9391j9618k3887m3301m4472J154k0744k4681O8081O4663j9888
$$ 53563 101163 120554 100936 77049 33748 -10724 -9570 -30314 -54995 13086 77749 57861
23144E7861J8748j9313o4023m9649l4990Q7733N7884p1778p042J6171K5178K3286
$$ 57861 76609 57296 -6727 -56376 -91366 -3633 54251 -17527 -24569 -8398 16780 40066
23132D0066L4004q311o1260J5776r56m5686k5974j5237m2818P6717J715K5258
$$ 40066 74070 65759 4499 20275 19319 -26367 -52341 -67578 -110396 -33679 -31964 -6706
23120f706L572j6499n7882J3168j6900K8012K4970L2376J2194k3283P488l357
$$ -6706 -3134 -19633 -77515 -64347 -81247 -53235 -28265 4111 16305 -6978 510 -2847
23108b847P181J7496O338n8389l8657K7092N8711j1461P363j9734J4858j9332
$$ -2847 4334 21830 28168 -30221 -68878 -41786 16925 5464 12827 -6907 7951 -11381
23096a1381l7838l9603K9305M2928l280q819J1618p151k3601l7990J6403K5092
$$ -11381 -49219 -88822 -59517 -16589 -19869 -28688 -17070 -24221 -47822 -85812 -69409 -44317
23084d4317N3625J3404j0226O236j6469m906J8497J291L081k7597k5278k0302
$$ -44317 9308 22712 12486 18722 2253 -2653 15844 17135 20216 -7381 -32659 -52961
23072e2961r0M8907N1585K6953J3040K5695p36o7682q4932K9102J8433M8488N2820
$$ -52961 -53051 -4144 47441 74394 87434 113129 112393 44711 -40221 -11119 7314 55802 108622
23059A08622j3788l7022m1902m7971j0846q108k9706l6391L2902P0604k1343l4721
$$ 108622 94834 57812 15910 -32061 -42907 -51015 -80721 -117112 -84210 -13606 -34949 -69670
23047f9670L6889N7716J976j7999J4398Q4882o519m05n9028j3417J6711m7322
$$ -69670 -32781 24935 26911 8912 23310 108192 101673 101268 42240 28823 45534 -1788
23035a788l9143k6942l2834O5030K3539K4406L1959L518o1486R062K6029O663
$$ -1788 -40931 -67873 -100707 -35677 -12138 12268 44227 47745 -13741 -4679 21350 28013
23023B8013o071J0584j614k1541R876N4051n9326j1378J0534P386j5237l51l7670
$$ 28013 21942 32526 30912 9371 19247 73298 13972 2594 13128 20514 5277 4926 -32744
23010c2744k8628M534l163K5197m431l721J9725L4867j8395J5305j4305j2682
$$ -32744 -61372 -56838 -60001 -34804 -39235 -42956 -23231 11636 -6759 8546 -5759 -18441
22998a8441k9912M3087J6758k5175k9412o267n8025k4410K0059J2974P3376m9866
$$ -18441 -48353 -5266 11492 -13683 -43095 -49362 -107387 -131797 -111738 -98764 -25388 -75254
22986g5254k8612J2707K8193p725N564K3064L9372l3722j5210j0981j4207L0057
$$ -75254 -103866 -91159 -62966 -70691 -65127 -42063 -2691 -36413 -51623 -62604 -76811 -46754
22974d6754k5873r456J4321k4278J8076L7684j4769q677k7486m1179M3874L5434
$$ -46754 -72627 -82083 -67762 -92040 -73964 -36280 -51049 -59726 -87212 -128391 -84517 -49083
22962d9083L7529k7188j6119q408j9708k2435N843M2914k5775L1253L8643M6906
$$ -49083 -11554 -38742 -54861 -63269 -82977 -105412 -99569 -56655 -82430 -51177 -12534 34372
22950C4372j173m3897k0079n00J3442n538L4416q604j2081k8337k0887k3126J7646
$$ 34372 33199 -10698 -30777 -31277 -17835 -23373 11043 2439 -9642 -37979 -58866 -81992 -64346
22937f4346M6865J361n270k7678l2314K0592J6309L3279n570l0614n605j3617
$$ -64346 -17481 -16120 -21390 -49068 -81382 -60790 -44481 -11202 -16772 -47386 -52991 -66608
22925f6608j2297M3150m472k2948J2958N9313M8204l2051L9559l2028n4332R237
$$ -66608 -78905 -35755 -40227 -63175 -50217 9096 57300 25249 64808 32780 -21552 -12315
22913a2315M5304m196o512j2252j9004n1866J9501M9493K9786j2408l3757k2346
$$ -12315 32989 28793 22281 10029 -8975 -60841 -41340 8153 37939 25531 -8226 -30572
22901c0572k5891J3594L8445K5414l5747j3475J4239j3877n555j3206N0086j0622
$$ -30572 -56463 -42869 -4424 20990 -14757 -28232 -13993 -27870 -33425 -46631 3455 -7167
22889g167p715L9658K6089l6746m1862M186K2322K4140k6912n3605M2241K1053
$$ -7167 -14882 24776 50865 14119 -27743 -23557 -1235 22905 -4007 -57612 -15371 5682
22877E682r368L0962K0759l6099m1068N5393L6541k0864j8882r709k1064r959
$$ 5682 -3686 27276 48035 11936 -29132 26261 62802 41938 23056 13347 -7717 -17676
22865a7676j5849L403O933l1271k7701K2557J6968m3058j9774N2214R236j1972
$$ -17676 -33525 -30122 -23189 -54460 -82161 -59604 -42636 -85694 -105468 -53254 -44018 -55990
22853e5990k2867M1052M1600K881o489Q272M7416K9647k7864p7907m418J4356
$$ -55990 -78857 -37805 3795 6676 187 8459 55875 85522 57658 -20249 -24667 -10311
22841a0311j2621J523L9035Mj1764k9384J6681M807p755K0178j8248n1561K5223
$$ -10311 -22932 -21409 17626 17630 5866 -23518 -6837 -2030 -9785 10393 -7855 -59416 -34193
22828c4193N3920r167m4681j353j1769J8223j1149L0911K5281M5029n2899j2771
$$ -34193 19727 10560 -34121 -35474 -47243 -29020 -40169 -9258 16023 61052 8153 -4618
22816d618O0689J7760m5133k6523J7979l8286k9289p109n5055J9624P8731N2863
$$ -4618 56071 73831 28698 2175 20154 -18132 -47421 -54530 -109585 -89961 -11230 41633
22804D1633p105j2234k7382l3139J1772q070k2285j0176J0189K1502J6794l5479
$$ 41633 34528 22294 -5088 -38227 -26455 -34525 -56810 -66986 -56797 -35295 -18501 -53980
22792e3980m711o818K7370l053K1258K2436k2061l4300K31J340R8754j3933q7153
$$ -53980 -58691 -65509 -38139 -41192 -19934 2502 -19559 -53859 -53628 -52288 46466 32533 -54620
22779e4620Q541k8265M8040K3705j687k5758L6515L5849K1354l0193k2962L9921
$$ -54620 -46079 -74344 -26304 -2599 -4286 -30044 6471 42320 63674 33481 10519 50440
22767E0440l7832m3862K7886M339p601L3210N9904m4557k0922o0693o1487K8177
$$ 50440 12608 -31254 -3368 971 -6630 26580 86484 41927 21005 -39688 -101175 -72998
22755g2998L9106j2698k7398M4346j7328j5182N8116j837J4997O7846l7098k0038
$$ -72998 -33892 -46590 -73988 -29642 -46970 -62152 -4036 -5873 9124 76970 39872 19834
22743A9834k3647n4620j1832N2437K2963m64q155j2599j037k4446k4066J9258
$$ 19834 -3813 -58433 -70265 -17828 5135 4671 -3484 -16083 -17120 -41566 -65632 -46374
22731d6374N4608O6930k3852q7128k6244J2705M2236j6289J4847J3558m3073j8446
$$ -46374 8234 75164 51312 -35816 -62060 -49355 -7119 -23408 -8561 4997 -38076 -56522
22719e6522M5687j0904p985J6821O052K1640m9811K3580K0733N3427L1590K715
$$ -56522 -10835 -21739 -29724 -12903 -6851 14789 -35022 -11442 9291 62718 94308 97023
22707I7023l7831o7624R815J4564j9480J9780j6102n6830K1400J2478m647r078
$$ 97023 59192 -8432 1383 15947 -3533 16247 145 -56685 -35285 -22807 -27454 -36532
22695c6532K8329m4306j4744N2011K2743L525k8565l3058n0253K9671K5229J2198
$$ -36532 -8203 -52509 -67253 -15242 7501 11026 -17539 -50597 -100850 -71179 -45950 -33752
22683c3752j1307Q018O5404N3337m2904m2979q987k9752k7184j066r528J7944
$$ -33752 -45059 -37041 28363 81700 38796 -4183 -13170 -42922 -70106 -71172 -80700 -62756
22671f2756J6959o705K2157R784K5966l161k3843J5419N06k1832R544J9253q401
$$ -62756 -45797 -52502 -30345 -20561 5405 2244 -21599 -6180 -5674 -27506 -17962 1291 -7110
22658g110M676r740m9282J1649J6699k7570j7499K111j9893j2322K9867M5081
$$ -7110 -2434 -12174 -61456 -49807 -33108 -60678 -78177 -76066 -95959 -108281 -78414 -33333
22646c3333K3605k7835k8517j8671M1898M4600K4180n3294n737k0070J3066N7436
$$ -33333 -9728 -37563 -66080 -84751 -42853 1747 25927 -27367 -33104 -53174 -40108 17328
22634A7328J123j0209M0815N1593o671J3988L0736l6518o4576k1994p5331J7061
$$ 17328 18451 8242 49057 100650 93979 107967 138703 102185 37609 15615 -59716 -42655
22622d2655O2687L1438J6737k3219j7402l1018m069L328q621K2303L5429m1842
$$ -42655 20032 51470 68207 44988 27586 -3432 -7501 -4173 -12794 9509 44938 3096
22610C096j0768N2952j3601l0670N213m0191J401P3986r769k1140J211k1878r015
$$ 3096 -7672 45280 31679 1009 6222 -33969 -32568 41418 31649 10509 11720 -10158 -19173
22597a9173l1975K8697p303m5325L6042K6380l486j7201Q377k6496j1160K3175
$$ -19173 -51148 -22451 -29754 -75079 -39037 -12657 -16143 -33344 -24967 -51463 -62623 -39448
22585c9448K346k139N6953M5212k7709p881l150k3455K2004k5712j9160p253k0041
$$ -39448 -37102 -39241 17712 62924 35215 27334 24184 729 22733 -2979 -22139 -29392 -49433
22572d9433l6965K096J6801N0687M7347k3632p0351J0495J6209l2822k8939l1983
$$ -49433 -86398 -84302 -67501 -16814 30533 6901 -63450 -52955 -36746 -69568 -98507 -130490
22560a30490K0406N8404M4593K6539l0571j2199K2280L317n0828m2706l2403K9195
$$ -130490 -110084 -51680 -7087 19452 -11119 -23318 -1038 2279 -48549 -91255 -123658 -94463
22548i4463j619O4655j2096l8759J9071O2003N0694k045m0574p3709j9236M7931
$$ -94463 -96082 -31427 -43523 -82282 -63211 -1208 49486 47441 6867 -66842 -86078 -38147
22536c8147L2354j36m8430q12N1000l8115l3042j5035K3854L3309J6056L4141
$$ -38147 -5793 -5929 -54359 -55171 -4171 -42286 -75328 -90363 -66509 -33200 -17144 16997
22524A6997K64l1644P244l5691p5392l3048N6353M233q977o960P4653N7008j1899
$$ 16997 17261 -14383 -7139 -42830 -118222 -151270 -94917 -90684 -99661 -106621 -31968 25040 13141
22511A3141l7194k2852j6280m2824l1865M6074M8098J7494l9081n6129J7234O5691
$$ 13141 -24053 -46905 -63185 -106009 -137874 -91800 -43702 -26208 -65289 -121418 -104184 -38493
22499c8493M6417r068j4663p963r520K0435j5478n00j3866q521k3642j4611N1386
$$ -38493 7924 -1144 -15807 -23770 -33290 -12855 -28333 -28833 -42699 -51220 -74862 -89473 -38087
22486c8087L5355L5747k3132M284j250k7981J0801n6996k662R0498L3129l0974
$$ -38087 -2732 33015 9883 14167 12917 -15064 -4263 -61259 -63921 26577 59706 28732
22474B8732J8095P5383k4585l5240l5399j2292j23114l0755M4254M8453N225L8616
$$ 28732 46827 122210 97625 62385 26986 14694 -108420 -139175 -94921 -46468 -41243 -2627
22462b627n921l8292R15k3749J3359j359n040L7598m1248j2486l3109N974k2538
$$ -2627 -8548 -46840 -45925 -69674 -56315 -57674 -62714 -25116 -66364 -78850 -111959 -105985 -128523
22449a28523K1607K1325N2563M5813o326o3001K2132k075J6753L0805N3174n240
$$ -128523 -106916 -85591 -33028 12785 6459 -56542 -34410 -36485 -19732 11073 64247 59007
22437E9007m17L7641m9583o0381O687L4197j4818n6580N1606M1514n7784o481
$$ 59007 58590 96231 46648 -13733 -7046 27151 12333 -44247 7359 48873 -8911 -15392
22425a5392K7577m5131j0232O1339J7238k9328j1550J9548L3792r972m595q348
$$ -15392 12185 -32946 -43178 18161 35399 6071 -5479 14069 47861 37889 33294 24946
22413B4946l3257O20l1716P751R816j7127R0608L8679o912q3384l8565N2819n6011
$$ 24946 -8311 -7691 -39407 -31656 -21840 -38967 51641 90320 83408 24 -38541 14278 -41733
22400d1733p7956L4159N3641L9640r583k5739j3130J1850R119k7780m841K744
$$ -41733 -119689 -85530 -31889 7751 -1832 -27571 -40701 -28851 -19732 -47512 -52353 -49609
22388d9609p52M177J0423N8769j0063k6772N7940M7811J603k3872J44j3979j0386
$$ -49609 -50361 -46184 -35761 23008 12945 -13827 44113 91924 93527 69655 69799 55820 45434
22375D5434k9567m2323j3439M430k133J2539J5320m6898N4633J1944m6918K4190
$$ 45434 15867 -26456 -39895 -35465 -37598 -25059 -9739 -56637 -2004 9940 -36978 -12788
22363a2788J18344l9879n8244N9877q307j5794n1489n1615J1603L0589l3400l9304
$$ -12788 105556 65677 7433 67310 59003 43209 -8280 -59895 -48292 -17703 -51103 -90407
22351i0407L590m6261j1388M2002L9975J5141J3493l6890m7420l5460K8560P6779
$$ -90407 -86817 -133078 -144466 -102464 -62489 -47348 -33855 -70745 -118165 -153625 -125065 -48286
22339d8286K4969k1346J6935j1411j8272N0076M3298j0701j3724j8007m1029P6314
$$ -48286 -23317 -44663 -27728 -39139 -57411 -7335 35963 25262 11538 -6469 -47498 28816
22327B8816J8695o5415K7654l025m6977k5301L1284P617j9886j6353j9549K4381
$$ 28816 47511 -17904 9750 6725 -40252 -65553 -34269 -26652 -46538 -62891 -82440 -58059
22315e8059k1600l742M0669J7352K8542J2276J1717k2068k0746J2189k9647p5888
$$ -58059 -79659 -83401 -42732 -25380 3162 15438 27155 5087 -15659 -3470 -33117 -109005
22303a09005k6392K0704K2505R3055P1635o320J3145R850n2787r658o546L669
$$ -109005 -135397 -114693 -92188 867 72502 66182 79327 89177 36390 26732 20186 23855
22291B3855l9574J258q16J7720K33O258N220K1798J1454K4217O161K962l7636
$$ 23855 -15719 -14461 -15277 2443 2676 8934 14154 35952 47406 71623 77784 80746 43110
22278D3110k0581L7227J2063Q891k230j0009n9954m1204L4070M8718O161J3918
$$ 43110 22529 59756 71819 80710 78480 68471 8517 -32687 1383 50101 56262 70180
22266G0180l833j7013P588n485o5002l2165K2098N8659m7022N178L7314k7451
$$ 70180 66347 49334 56922 51437 -13565 -45730 -23632 35027 -11995 -6817 30497 3046
22254C046m0475k1967K1932L7646p896m4125j0994J267P8513N3233l0238p6070
$$ 3046 -37429 -59396 -37464 182 -7714 -51839 -62833 -61566 16947 70180 39942 -36128
22242c6128m7238k3888L0997N8373L1561l2285l7036J047M8881K1956n2805l3074
$$ -36128 -83366 -107254 -76257 -17884 13677 -18608 -55644 -54597 -5716 16240 -36565 -69639
22230f9639K9143N3099l787J9225M0348J6236n4049k4395j5534N866k9128o5M9005
$$ -69639 -40496 12603 8816 28041 68389 84625 30576 6181 -9353 -3487 -32615 -32680 16325
22217A6325M8341J7710m9327p4348P647r601J5306M4592j767n1572j311K5620
$$ 16325 64666 82376 33049 -41299 -33652 -43253 -27947 16645 14878 -36694 -38005 -12385
22205a2385J3717m551q000R869L530J2249M359N4007o0426p6549l6712J5651j3342
$$ -12385 1332 -3219 -11219 -1350 2180 14429 18788 72795 12369 -64180 -100892 -85241 -98583
22192i8583m445n074K1448L3032k4752j1859L0138M3082O5169J3482q1987m5463
$$ -98583 -103028 -108102 -86654 -53622 -78374 -90233 -60095 -17013 48156 61638 -20349 -65812
22180f5812k7988L216L1103O323j4212n6863K8879Q1070n0344L7006O948L4146
$$ -65812 -93800 -90584 -59481 -53158 -67370 -124233 -95354 -14284 -64628 -27622 -20674 13472
22168A3472O098m7553K3737N0360p174k7005P979k2554L0784p854l4384j9087
$$ 13472 19570 -27983 -4246 46114 38940 11935 19914 -2640 28144 20290 -14094 -33181
22156c3181J4699J2857o028K5689L3730l3368J162L0111n1060n782N80r038l3632
$$ -33181 -18482 -5625 -11653 14036 47766 14398 15560 45671 -5389 -11171 -10591 -19629 -53261
22143e3261j3875J875J8582J5183M0619K1652M810M2532M78l934k1222n2839l3826
$$ -53261 -67136 -65261 -46679 -31496 9123 30775 35585 78117 78595 74661 53439 600 -33226
22130c3226O0555J906k8226l3791L8402j56j2213K23o0731k9649l8435m6047K6200
$$ -33226 27329 29235 1009 -32782 5620 5464 -6749 -6526 -67257 -96906 -135341 -181388 -155188
22117a55188L5711j9921N6368N2692L1236J5607k5091q825K8244q353L8031l0729
$$ -155188 -119477 -139398 -83030 -30338 898 16505 -8586 -17411 10833 2480 40511 9782
22105I782l7851m1637m7732k3580P963K3538N5743K2256J3271K6218L5534P205
$$ 9782 -28069 -69706 -117438 -141018 -133055 -109517 -53774 -31518 -18247 7971 43505 50710
22093E0710Q972o098l0576m0582N19k5388J3477L9058K9253N371l8543P532J4363
$$ 50710 59682 53584 23008 -17574 -17055 -42443 -28966 10092 39345 44716 6173 13705 28068
22080B8068l4939l664j4142n6719k4866N3742L4830Q129m4308m5055K3729O708
$$ 28068 -6871 -10535 -24677 -81396 -106262 -52520 -17690 -9561 -53869 -98924 -75195 -68487
22068f8487K7387P43j2863K8420L7258K678J7906n6989r882P3402K0845l6607
$$ -68487 -41100 -40357 -53220 -24800 12458 15136 33042 -23947 -33829 39573 60418 23811
22056B3811o8102n9960k821Q4280J6469M0075k9446m621k6695k3178K5718m1581
$$ 23811 -44291 -104251 -107072 -22792 -6323 33752 4306 -315 -27010 -50188 -24470 -66051
22044f6051l3830j2346M0683L090o853j3538j532j6973L9840O9041L4451J2332
$$ -66051 -99881 -112227 -71544 -68454 -75307 -88845 -90377 -107350 -67510 1531 35982 48314
22032D8314l0658p449j0283q1119J262K4378l4018L2251K9193J6602j4207k5934
$$ 48314 17656 10207 -76 -81195 -79933 -55555 -89573 -57322 -28129 -11527 -25734 -51668
22020e1668M0399O0584p9078j4897K9488m035J2522M884j4408O187r177L7729
$$ -51668 -11269 49315 -29763 -44660 -15172 -19207 -6685 -1801 -16209 -10022 -19199 18530
22008A8530L1217M4245l16r684j043k3952j23249o8195k161L5390L2805N8203
$$ 18530 49747 93992 93676 83992 82949 58997 -64252 -132447 -134608 -99218 -66413 -8210
21996h210J8232L6781M262n1698O5889J5449q5400l754K2637L4954k4522l5946
$$ -8210 10022 46803 51065 -633 65256 80705 -4695 -8449 14188 49142 24620 -11326
21984a1326m3459j5184O1934M7667P689l827k4054j1082k1018J7432M766o017
$$ -11326 -54785 -69969 -8035 39632 47321 43494 19440 8358 -12660 4772 9538 3521
21972C521j870N039m798l103K0742J0727k8632j8999j1980J8703k4939l6983k709
$$ 3521 1651 6690 1892 -1211 19531 30258 1626 -17373 -29353 -10650 -35589 -72572 -75281
21959g5281J2762J6567K6888L6018J7490o261M214l9084o8030m1452K7680N7983
$$ -75281 -62519 -45952 -19064 16954 34444 28183 32397 -6687 -74717 -116169 -88489 -30506
21947c0506J6960j8858L1874j2733J0491j7260n8794J4455L5011r24j823M355
$$ -30506 -13546 -32404 -530 -13263 -2772 -20032 -78826 -64371 -29360 -30284 -32107 -27752
21935b7752l6528k0196N581k3859q378K1856L0526N2033L7519K5772J2225M5180
$$ -27752 -64280 -84476 -78895 -102754 -111132 -89276 -58750 -6717 30802 56574 68799 113979
21923A13979J1222k8346o9151N268j0530L6426k6613j7616n3401K50K4492l529
$$ 113979 125201 96855 27704 32972 22442 58868 32255 14639 -38762 -38512 -14020 -17549
21911a7549m870l0914J0948Q491N5106o439p990j0818L4525N0773J5414o5336
$$ -17549 -22419 -53333 -42385 -33894 21212 14773 6783 -4035 30490 81263 96677 31341
21899C1341r0858j6564L7746J4774k9540q9777J5046J1376N1197l7116J2964j2405
$$ 31341 -59517 -76081 -38335 -23561 -53101 -142878 -127832 -116456 -65259 -102375 -89411 -101816
21887a01816M5204j881l5496l2063l2094K1764L5658P4802M2850K5802j3596m383
$$ -101816 -56612 -58493 -93989 -126052 -158146 -136382 -100724 -25922 16928 42730 29134 24751
21875B4751N39j0646l1605Q282K6700J6824L574k2316j2965j5298M9914J0089
$$ 24751 25290 14644 -16961 -8679 18021 34845 38419 16103 3138 -12160 37754 47843
21863D7843K9579J8665l9137q1812o621L0738j3517L4873L8441K1728p1598l4777
$$ 47843 77422 96087 56950 -24862 -31483 -745 -14262 20611 59052 80780 9182 -25595
21851b5595K2102K5397J6060k4025m2064K0676M4887M4525r914n71J418J1005
$$ -25595 -3493 21904 37964 13939 -28125 -7449 37438 81963 72049 71478 72896 83901
21839H3901k6656r10N837l9497K6409q610n0192k9888J9315m8149l7674k3655
$$ 83901 57245 56335 62172 22675 49084 40474 -9718 -39606 -20291 -68440 -106114 -129769
21827a29769Q5073P0092q837J6308M2334J9268p0665p3156J394L0918O9613l943
$$ -129769 -44696 25396 16559 32867 75201 94469 23804 -49352 -47958 -17040 52573 48630
21815D8630q3913o4061l3298l714L5296K932k560K2894L7216n574O629j1358n1935
$$ 48630 -35283 -99344 -132642 -136356 -101060 -98128 -100688 -77794 -40578 -46152 -39523 -50881 -102816
21802a02816K482m545q80N8450j501j6516L6565L1484m8766K1695J0853K0126
$$ -102816 -100334 -104879 -105759 -47309 -48810 -65326 -28761 2723 -46043 -24348 -13495 6631
21790F631L6438m0991Q403Q623M918R662q783j6387K0786n8135o4034k9137M8601
$$ 6631 43069 2078 10481 19104 24022 33684 24901 8514 29300 -28835 -92869 -122006 -73405
21777g3405N3213M0567N805m8779L697N9378R035O111j5154n8545j3325L601N086
$$ -73405 -20192 20375 26180 -22599 -18902 40476 49511 55622 40468 -18077 -31402 -27801 -22715
21764b2715K5651j7442k2256m561L1138k6123l0957K3791M9293J9249L3835R487
$$ -22715 2936 -14506 -36762 -41323 -10185 -36308 -67265 -43474 5819 25068 58903 68390
21752F8390o9386o6671k7595P3896K7202j7376K0079K9334k0483m9275R860o153
$$ 68390 -996 -67667 -95262 -21366 5836 -11540 8539 37873 17390 -31885 -22025 -28178
21740b8178J7322j5168k8904j6950k3671L8876J5978M6065j9395J092j5992R94
$$ -28178 -10856 -26024 -54928 -71878 -95549 -56673 -40695 5370 -14025 -12933 -28925 -27931
21728b7931K6258K5524j2412N383m2019J3014j606l2658j613K7011J2461j5218
$$ -27931 -1673 23851 11439 16822 -25197 -12183 -13789 -46447 -48060 -21049 -8588 -23806
21716b3806q640M2262L9985o530n7932k464M9535L1105L167k8848k5232N20l2390
$$ -23806 -32446 9816 49801 43271 -14661 -17125 32410 63515 66682 37834 12602 13122 -19268
21703a9268M3564k711J8323J4212K4948l3095m2021M170o219j9318n511K1343
$$ -19268 24296 21585 39908 54120 79068 45973 3952 8122 1903 -17415 -22926 -1583
21691a583J6272j3026k5075j8712n395L6796j9677k1555J3300p490k6525K0885
$$ -1583 14689 1663 -23412 -42124 -47519 -10723 -30400 -51955 -38655 -46145 -72670 -51785
21679e1785K1022k688j9722r496j481M3659N6842J0005N855n7623n1131J2775
$$ -51785 -30763 -33451 -53173 -62669 -64150 -20491 36351 46356 52211 -5412 -56543 -43768
21667d3768l4009q732L5588J7164J4497p7k3224j3596K1622j6849k4033M7053
$$ -43768 -77777 -86509 -50921 -33757 -19260 -19337 -42561 -56157 -34535 -51384 -75417 -28364
21655b8364M0619l8285J3603N507L5853R922k7786k1861j0289j2039M8989J914
$$ -28364 12255 -26030 -12427 -6920 28933 38855 11069 -10792 -21081 -33120 15869 17783
21643A7783m0139l151j4216K860J4921J4011k2927n6694j6823M5185J2252j7916
$$ 17783 -22356 -25507 -39723 -36863 -21942 -7931 -30858 -87552 -104375 -59190 -46938 -64854
21631f4854J8624n634j01224n893Q4616J544M8575N1616K6868j3963o3248l0513
$$ -64854 -46230 -51864 -153088 -158981 -74365 -72821 -24246 27370 54238 40275 -22973 -53486
21619e3486m2015p05M4313M345L4384j3588j0633M307O154K137n331r0858j5880
$$ -53486 -95501 -96206 -51893 -47548 -13164 -26752 -37385 -33078 -26924 -24787 -30118 -120976 -136856
21606a36856K1411n9013O4195O6871k4128J3022l3608j8745K1369N4509J7440
$$ -136856 -115445 -174458 -110263 -43392 -67520 -54498 -88106 -106851 -85482 -30973 -13533
21595a3533M7073O286M4302m8955l8310P029J5528k7419L0373p805m4107M108
$$ -13533 33540 39826 84128 35173 -3137 3892 19420 -7999 22374 14569 -29538 -25430
21583b5430M4037m6384N420K2129L1185p103J399p0343j873R465O0619k5417l7242
$$ -25430 18607 -27777 -22357 -228 30957 23854 25253 -45090 -46963 -37498 23121 -2296 -39538
21570c9538j2345Q101M2041O445m0030m7586N5479M5532o214k7607o9019M0791
$$ -39538 -51883 -43782 -1741 4704 -35326 -82912 -27433 18099 11885 -15722 -84741 -43950
21558d3950p326n3879L2621N974K8823j2893k5848K0734J6559M5788k4469l3991
$$ -43950 -51276 -105155 -72534 -66560 -37737 -50630 -76478 -55744 -39185 6603 -17866 -51857
21546e1857L4656l586m9193m2934J7788J10658P9035r3894j1342l6287n9407l803
$$ -51857 -17201 -20787 -69980 -112914 -95126 15532 94567 673 -10669 -46956 -106363 -110166
21534a10166M0610R607k6286J6245J4546L315N1339M872l134K245n047m5820m2850
$$ -110166 -69556 -59949 -86235 -69990 -55444 -52129 -790 4082 948 3193 -1854 -47674 -90524
21521i0524J3425j0857M386P5055L0756J346L2253m3119q273n9475n006P9486
$$ -90524 -77099 -87956 -83570 -8515 22241 23587 55840 12721 4448 -55027 -60033 19453
21509A9453L273l4686R300l6080l951p964k8102J7027j9967j5395P363K3880q351
$$ 19453 22726 -11960 -2660 -38740 -42691 -50655 -78757 -61730 -81697 -97092 -89729 -65849 -74200
21496g4200j3275M0476k0850Q912L8420K3453m8264k7273R714J1982M4300k3008
$$ -74200 -87475 -46999 -67849 -58937 -20517 2936 -45328 -72601 -62887 -50905 -6605 -29613
21484b9613n4904l2444l686O0744N9627k0625j4481k0919j1604j560j1322j3104
$$ -29613 -84517 -116961 -120647 -59903 -276 -20901 -35382 -56301 -67905 -69465 -80787 -93891
21472i3891K4405N9458j4791k2370K1362K1522o923N342r496l7988l3841K2258
$$ -93891 -69486 -10028 -24819 -47189 -25827 -4305 -11228 -5886 -15382 -53370 -87211 -64953
21460f4953R757J0804N6001N0029L4799j6761k1198j1964l6184j140n0593n2094
$$ -64953 -55196 -44392 11609 61638 96437 79676 58478 46514 10330 9190 -41403 -93497
21448i3497M5750L6644K5767o941k8656K4693K5504n6244q161j0238l8042K9725
$$ -93497 -47747 -11103 14664 7723 -20933 3760 29264 -26980 -35141 -45379 -83421 -53696
21436e3696O9018j3451j9736n405j126k3833l7526p170n706o111J3898P581L0606
$$ -53696 15322 1871 -17865 -23270 -24396 -48229 -85755 -92925 -98631 -104742 -90844 -83263 -52657
21423e2657l9326q227K0013O292q088J3440P865O299J4006M1609l1406J0426K0533
$$ -52657 -91983 -100210 -80197 -73905 -81993 -68553 -60688 -54389 -40383 1226 -30180 -19754 779
21410G79P346M038K2467j6424O179o5277p6550J0846K0134J6801O3253K5634K258
$$ 779 8125 12163 34630 18206 24385 -40892 -117442 -106596 -86462 -69661 -6408 19226 21484
21397B1484j1700P621K6196K1653J6982J4434l1804j5351k4301k9430n2699m4434
$$ 21484 9784 17405 43601 65254 82236 96670 64866 49515 25214 -4216 -56915 -101349
21385a01349R337k5191k9291L1260L6848N8000P2914P1052k1095m8853N973N1988
$$ -101349 -92012 -117203 -146494 -115234 -78386 -20386 52528 123580 102485 53632 59605 111593
21373A11593l3916o4603n4392m3701M7254j8776M33J4904M1857j8336j6682L9709
$$ 111593 77677 13074 -41318 -85019 -37765 -56541 -56108 -41204 653 -17683 -34365 5344
21361E344K1727q942k3283l352k5120q7673k3304P9456O6364j0897O514J2089
$$ 5344 27071 18129 -5154 -8506 -33626 -121299 -144603 -65147 1217 -9680 -3166 8923
21349H923M1615k5766n0758k0005K1254J2015L9340J4252Q772j7175K3439q530
$$ 8923 50538 24772 -25986 -45991 -24737 -12722 26618 40870 49642 32467 55906 47376
21337D7376J7039p7586m4966L4435J0792j5567K266R214O2192K1447n4049K5479
$$ 47376 64415 -13171 -58137 -23702 -12910 -28477 -26211 -16997 45195 66642 12593 38072
21325C8072M2343l982J13M829q2114j4141J4565l0979L819M9095l85k2894j762
$$ 38072 80415 76433 76546 81375 -739 -14880 -315 -31294 -27475 21620 21235 -1659 -3421
21312c421q192m7139J6638L5584K3485K5753M5522K2284j2098p0894q6022j8129
$$ -3421 -11613 -58752 -42114 -6530 16955 42708 88230 110514 98416 27522 -58500 -76629
21300g6629N1741O7449m4095o391l755K9742q985m0428j9387l798L1251L0697
$$ -76629 -24888 42561 -1534 -7925 -11680 18062 9077 -31351 -50738 -54536 -23285 7412
21288G412o58r988l560j0354K224M8554j0027p1486J8064J5532k5167q481k816
$$ 7412 6754 -3234 -6794 -17148 -14924 33630 23603 -47883 -29819 -14287 -39454 -47935 -50751
21275e0751N7054L7742k0752j1537k4614k4167O678J6763m0810O598Q2664j9660
$$ -50751 6303 44045 23293 11756 -12858 -37025 -30347 -13584 -54394 -47796 34868 15208
21263A5208n2027K8364o6230j6660K3488m5994J973K2973N325K7629K5547j2811
$$ 15208 -36819 -8455 -74685 -91345 -67857 -113851 -111878 -88905 -83580 -55951 -30404 -43215
21251d3215K1696K3054r970M5171M1772L3881n5101o3067l9767J9955j2097K3630
$$ -43215 -21519 1535 -8435 36736 78508 112389 57288 -5779 -45546 -25591 -37688 -14058
21239a4058N4020N2967J2163l7718l5816j0115m3431k2565N8115N5119p407Q459
$$ -14058 39962 92929 105092 67374 31558 21443 -21988 -44553 13562 68681 61274 69733
21227F9733k95m3360J830k1942M973L6521K3190k3052M225K5992j8844n8274l9283
$$ 69733 69438 26078 27908 5966 10939 47460 70650 47598 51823 77815 58971 697 -38586
21214c8586r507N1561K6792K26l0490L3571K3950M010j1137r102k1548L668P735
$$ -38586 -48093 3468 30260 30486 -4 33567 57517 61527 50390 41288 19740 23408 31143
21201C1143J1996n2208m9246L5973M6821K6985j4404q983l5125n0797k9754N0892
$$ 31143 43139 -9069 -58315 -22342 24479 51464 37060 28077 -7048 -57845 -87599 -36707
21189c6707K587J4280r3882M915K626R33M1572K1983k245o579K5852L2266K127
$$ -36707 -34120 -19840 -113722 -108807 -106181 -105248 -63676 -41693 -43938 -50517 -24665 7601 9728
21176I728p8073m3103L4049L8499M9437j7382R943J6335M017k2694j7093l630
$$ 9728 -68345 -111448 -77399 -38900 10537 -6845 3098 19433 23450 756 -16337 -19967
21164a9967k869O026J4620K4356n034o7130j2713m874L7524Q336j0760m0372J7885
$$ -19967 -22836 -16810 -2190 22166 17132 -49998 -62711 -67585 -30061 -21725 -32485 -72857 -54972
21151e4972N8799J2678K2234M1929k8178j4420K0599j0432k7042m1565L4163J5838
$$ -54972 3827 16505 38739 80668 52490 38070 58669 48237 21195 -20370 13793 29631
21139B9631p1911n9232J1756M1903j4549L1153o3082j7225K5224N8290Q0727r218
$$ 29631 -42280 -101512 -89756 -47853 -62402 -31249 -94331 -111556 -86332 -28042 52685 43467
21127D3467J6943k3585k6165R698J1524o823J3664r171l8834j1444j516j3782
$$ 43467 60410 36825 10660 20358 31882 25059 38723 29552 -9282 -20726 -22242 -36024
21115c6024K7992J9989o2787o8672R209K973L0436N7014N0390Q442j7936r1791
$$ -36024 -8032 11957 -50830 -119502 -110293 -107320 -76884 -19870 30520 38962 21026 -70765
21103g0765k7355K0885N3829Q462n507k8674J2870K2937j8906R64L1478N6804
$$ -70765 -98120 -77235 -23406 -14944 -20451 -49125 -36255 -13318 -32224 -31260 218 57022
21091E7022J091M829l2129p2226L2384J2416J2236l134J4636K0848j0065o79k6308
$$ 57022 58113 62942 30813 -41413 -9029 3387 15623 12489 27125 47973 37908 37229 10921
21078A0921L3218j2405o1445l833L3760J9346J4800l0581j7634R672n181P7431
$$ 10921 44139 31734 -29711 -33544 216 19562 34362 3781 -13853 -4181 -9362 68069
21066F8069M8148o714L6109m3784l5478o2340j6722L469P373k8785n7729j2915
$$ 68069 116217 109503 145612 101828 66350 4010 -12712 -9243 -1870 -30655 -88384 -101299
21054a01299N6854N7383p745n6016k4352M3826l1405k6110M6291n004n1796O9266
$$ -101299 -44445 12938 5193 -50823 -75175 -31349 -62754 -88864 -42573 -47577 -99373 -30107
21042c0107M2695j3539L498L5598L5963n2693k9669K6021M0252n3931l0355j8890
$$ -30107 12588 -951 2547 38145 74108 21415 -8254 17767 58019 4088 -26267 -45157
21030d5157J2854K6775P420j3542M5746k5263l7338m433J1691q60K03J396k4486
$$ -45157 -32303 -5528 1892 -11650 34096 8833 -28505 -32938 -21247 -22107 -21904 -20508 -44994
21017d4994Q446L5621j5326n318L6178L873k1750m0581l3551q200J9588J584o722
$$ -44994 -36548 -927 -16253 -21571 14607 18480 -3270 -43851 -77402 -85602 -66014 -64430 -71152
21004g1152J3723M4363l3415l6297L1171l4374M0241N4088j4085j8458j920j0539
$$ -71152 -57429 -13066 -46481 -82778 -51607 -85981 -45740 8348 -5737 -24195 -26115 -36654
20992c6654J1983N0467L2731m9450m0412M3791M5891j0134K5124l9339o641j5358
$$ -36654 -24671 25796 58527 9077 -31335 12456 58347 48213 73337 33998 27357 11999
20980A1999k742j5258K7451M0721Q609j3746l2492k6850k794J0310p353k5019
$$ 11999 9257 -6001 21450 62171 70780 57034 24542 -2308 -5102 5208 -2145 -27164
20968b7164L691O36R37J4903j7090L6768k4766j0736m787J7533l2566J0622L7527
$$ -27164 -23473 -22837 -21900 -6997 -24087 12681 -12085 -22821 -27608 -10075 -42641 -32019 5508
20955E508J1644o50j7742l7761n8766r539Q4074P8091l5226m8533K8343L8003
$$ 5508 17152 16502 -1240 -39001 -97767 -107306 -23232 54859 19633 -28900 -557 37446
20943C7446J1708l3123j2157o1887l5469N7661q525J0208n14J6386P729K0299
$$ 37446 49154 16031 3874 -58013 -93482 -35821 -44346 -34138 -34652 -18266 -10537 9762
20931I762L6603k0328j9964k1156K2909N4784n219k3621L284K5905r865L3991
$$ 9762 46365 26037 6073 -15083 7826 62610 57391 33770 37054 62959 53094 87085
20919H7085l8491j7986n2680M2112M2978k5883L6074L1064K6540K2846r8438j1628
$$ 87085 48594 30608 -22072 20040 63018 37135 73209 104273 130813 153659 55221 43593
20907D3593K1288r885j9170n4877M1770M1508n4957o8044j9L0808K6052j0636
$$ 43593 64881 54996 35826 -19051 22719 64227 9270 -58774 -58793 -27985 -1933 -12569
20895a2569R061l8479L0255L2066n8389K479K3634J0968k54K4578j4047n9658
$$ -12569 -3508 -41987 -11732 20334 -38055 -35576 -11942 -974 -1228 23350 9303 -50355
20883e0355L6997k2258k1703L1966N3066j1094o3692J3663N6269k6757l5617j7944
$$ -50355 -13358 -35616 -57319 -25353 27713 16619 -47073 -33410 22859 -3898 -39515 -57459
20871e7459j2849n9947K756J0087L5453M7173L6190J62j7405m15k8028N278Q738
$$ -57459 -70308 -130255 -127499 -117412 -81959 -34786 1404 1566 -15839 -16254 -44282 -39004 -30266
20858c0266k2639K1458M1678M9654l757K0292l6153j9832L257R427L3894J7103
$$ -30266 -52905 -31447 10231 59885 56128 76420 40267 20435 23692 33119 67013 84116
20846H4116m653j8538J4919j2503l1404M6476l5427M0013O0770m5486l0532l8887
$$ 84116 79463 60925 75844 63341 31937 78413 42986 82999 143769 98283 67751 28864
20834B8864N9384L1631k37o8202l5166k9604l0532J3688l9064o2368j5724N962
$$ 28864 88248 119879 119642 51440 16274 -13330 -43862 -30174 -69238 -131606 -147330 -141368
20822a41368J4678J4755L6516l9245O2490M2114j6922J7665K342K7182l3066J4626
$$ -141368 -126690 -111935 -75419 -114664 -52174 -10060 -26982 -9317 -6975 20207 -12859 1767
20810A767J1607J5246K2760L9368J0607m9228m0052P340j8994m1626l5254j3145
$$ 1767 13374 28620 51380 90748 101355 52127 12075 19415 421 -41205 -76459 -89604
20798h9604M0372Q2367L2870J7699J5733K8614k4458o5771m8388j5237m767n0329
$$ -89604 -49232 33135 66005 83704 99437 128051 103593 37822 -10566 -25803 -30570 -80899
20786h0899J424K2617N466J0462K9182K2945M0504K6162m5990q498J7355M1565
$$ -80899 -79475 -56858 -51392 -40930 -11748 11197 51701 77863 31873 23375 40730 82295
20774H2295J0304J0658J2354l3828j8869k1016m980M6889k520m0824m8357j3985
$$ 82295 92599 103257 115611 81783 62914 41898 36918 83807 81287 40463 -7894 -21879
20762b1879J0336q410J5265J2476j5030M8344O1132l2015l3456n3492k4746j5667
$$ -21879 -11543 -19953 -4688 7788 -7242 41102 102234 70219 36763 -16729 -41475 -57142
20750e7142J53J4959L9767K2831N0630R549J4485l0668l4112j2243J5732j3242
$$ -57142 -56989 -42030 -2263 20568 71198 80747 95232 64564 30452 18209 33941 20699
20738B0699p3363k2712k2131p9919j7423M0366Q1371P9472N3553m9557l9089N876
$$ 20699 -52664 -75376 -97507 -177426 -194849 -154483 -73112 6360 59913 10356 -28733 -22857
20726b2857J5889J5697k1645k3361m1530J094L7469L3806m787l8920q112j1078
$$ -22857 -6968 8729 -12916 -36277 -77807 -76713 -39244 -5438 -10225 -49145 -57257 -68335
20714f8335P888L7834m788k3362j1754P2631O2070P1630J5107l7307j06930n1070
$$ -68335 -60447 -22613 -27401 -50763 -62517 10114 72184 143814 158921 121614 14684 -36386
20702c6386K7281L0576J19j6137l8423o255O8290k6582o9108P3647K8461J6243
$$ -36386 -9105 21471 21590 5453 -32970 -39225 29065 2483 -66625 7022 35483 51726
20690E1726l8726N378K8448K018j9579l8497P532Q664k7545K0538J9303l8007
$$ 51726 13000 18378 46826 48844 29265 -9232 -1700 6964 -20581 -43 19260 -18747
20678a8747m2849K4036L0255m4902l0924L0560L6023L4988l2926j7127K5061N0330
$$ -18747 -61596 -37560 -7305 -52207 -83131 -52571 -16548 18440 -14486 -31613 -6552 43778
20666D3778j5214m7212J1996L937p914l3869l7162L1391P505m2656J4835K1595
$$ 43778 28564 -18648 -6652 -2715 -10629 -44498 -81660 -50269 -42764 -85420 -70585 -48990
20654d8990J1878O590J8311J4469K2647p0740l3482p98j717M1916O0858L6869
$$ -48990 -37112 -30522 -12211 2258 24905 -45835 -79317 -80115 -81832 -39916 20942 57811
20642E7811m07j2557N361n873L4355O82k9909k1517m41l9281n948j078j8349P768
$$ 57811 57404 44847 50208 44335 78690 79372 49463 27946 27505 -11776 -17724 -18802 -37151 -29383
20628b9383N755J9092J7421J4762k8241l0262r386J0541J9159k8360K7436J6732
$$ -29383 -23628 -4536 12885 27647 -594 -30856 -40242 -29701 -10542 -38902 -11466 5266
20616E266P976l3419m3251M3335O1125j5471J5142L2287l067o8301n6600K714
$$ 5266 13242 -20177 -63428 -20093 41032 25561 40703 72990 69923 1622 -54978 -52264
20604e2264j1695M8777M6589O052q952k1836m2756l4883Q0272L7973o197k6975
$$ -52264 -63959 -15182 31407 37459 28507 6671 -36085 -70968 9304 47277 41080 14105
20592A4105J3746P2303N361J0081l1152m8247m3366j1621K7443K1663K9927m9911
$$ 14105 27851 100154 105515 115596 84444 36197 -7169 -18790 8653 30316 60243 10332
20580A0332o8585j7057m394L3480O6173m323o926r471j7465L0115j6914j9824
$$ 10332 -58253 -75310 -79704 -46224 19949 15626 8700 -771 -18236 11879 -5035 -24859
20568b4859Q17N976q84K4593R2396l0755p2800k7360k1117M1005J5532j0481l163
$$ -24859 -24042 -18066 -18950 5643 98039 67284 -5516 -32876 -53993 -12988 2544 -7937 -11100
20555a1100Q582L1182L1982n2625j7320J1406j3184L677o877j9067j3932L508
$$ -11100 -2518 28664 60646 8021 -9299 2107 -11077 -7400 -14277 -33344 -47276 -43768
20543d3768O4459O3325j1050l8019j0261L3208k592n7120M5273J4498l4933J0549
$$ -43768 20691 84016 72966 34947 24686 57894 55302 -1818 43455 57953 23020 33569
20531C3569p164k6823N5756J4918j2769m4308k1252J4910l820n2756J3399O6524
$$ 33569 26405 -418 55338 70256 57487 13179 -8073 6837 3017 -49739 -36340 30184
20519C0184J0532Q753l6837q9897r875O318q751R1600J6274k6411j9896k3957
$$ 30184 40716 49469 12632 -77265 -87140 -80822 -89573 2027 18301 -8110 -28006 -51963
20507e1963k6148m279M1918P405N4743O5764K50N674Q124J1465m0129k4313L0712
$$ -51963 -78111 -82390 -40472 -33067 21676 87440 87690 93364 101488 112953 72824 48511 79223
20494G9223l7472m8966p300K6956m2749r0378K0433J1103K4594Q9837k1820K7672
$$ 79223 41751 -7215 -14515 12441 -30308 -120686 -100253 -89150 -64556 25281 3461 31133
20482C1133K4714j5522N042n1970o799K3890J0036l1469k3400l0175L4891L4400
$$ 31133 55847 40325 45367 -6603 -13402 10488 20524 -10945 -34345 -64520 -29629 4771
20470D771k3115j5960O218M5626K3479L1421n9074m7386k760R441K808M1976k3370
$$ 4771 -18344 -34304 -28086 17540 41019 72440 13366 -34020 -36780 -27339 -24531 17445 -5925
20457e925J2986M0933N671o6083n9332o0522J421L8413O1470N5812J1891J3918
$$ -5925 7061 47994 53665 -12418 -71750 -132272 -130851 -92438 -30968 24844 36735 50653
20445E0653N007m2470k3249k7765j8467O4556L613l2370p0897r404k6096M8627
$$ 50653 55660 13190 -10059 -37824 -56291 8265 11878 -20492 -91389 -100793 -126889 -78262
20433g8262J1680o1633M768J9311q985K2243O5939N4066m2143r558n965k8909
$$ -78262 -66582 -128215 -123447 -104136 -113121 -90878 -24939 29127 -13016 -22574 -28539 -57448
20421e7448J8239K6725m0713r011N0349O9464L8883j2423K6982j1798L3303q012
$$ -57448 -39209 -12484 -53197 -62208 -11859 57605 96488 84065 111047 99249 132552 124540
20409A24540n7979o1374k1768j8543j4522o095L1948N9044K2283m8398m755L1430
$$ 124540 66561 5187 -16581 -35124 -49646 -55741 -23793 35251 57534 9136 4381 35811
20397C5811Q5264P6069n5489p6362k8211j2672M9922O4320Q135j8387m1887J083
$$ 35811 121075 197144 141655 65293 37082 24410 74332 138652 146787 128400 86513 87596
20385H7596k5059n5403o584j2803n63J1363J445N8451j0386m851M909l6573J9348
$$ 87596 62537 7134 550 -12253 -12816 -1453 -8 58443 48057 43206 48115 11542 30890
20372C0890o7018M7858J9960L524l4633j5990M4702N3672k0363m6544q414j0638
$$ 30890 -36128 11730 31690 35214 581 -15409 29293 82965 62602 16058 7644 -2994
20360b994k4135l007j72j5658P308K8361M3388K5528l4283k4164N830l201K9272
$$ -2994 -27129 -30136 -30308 -45966 -38658 -10297 33091 58619 24336 172 6002 2801 32073
20347C2073m501k3821N1411m8064o304J8388J8544R583j6150K2837j0444m0505
$$ 32073 27572 3751 55162 7098 794 19182 37726 47309 31159 53996 43552 3047
20335C047m1441k4067N079M2717L6605l8286l0822r914L379O7709n4929m9978
$$ 3047 -38394 -62461 -57382 -14665 21940 -16346 -47168 -57082 -53703 14006 -40923 -90901
20323i0901Q3931L8633k86M54L0155O870l7536r576j3216n5217n921N3336j3754
$$ -90901 -6970 31663 31377 31831 61986 68856 31320 21744 8528 -46689 -52610 726 -13028
20310a3028K2513R703k6318m8687p2675L2834K1510k470K3832k907K1483O9171
$$ -13028 9485 19188 -7130 -55817 -128492 -95658 -74148 -76618 -52786 -55693 -34210 34961
20298C4961L2900l432k2724n2838j0966J9255L8678l0282k733k0581K0871Q312
$$ 34961 67861 64429 41705 -11133 -22099 -2844 35834 5552 2819 -17762 3109 11421
20286A1421O2066K1743J259m7767p5716J7148M3994k7741j9948K311J6132L9322
$$ 11421 73487 95230 96489 48722 -26994 -9846 34148 6407 -13541 -11230 4902 44224
20274D4224m670p4484L2470M1050j9293N681l5244j6618L7357l4711L1669M8147
$$ 44224 39554 -34930 -2460 38590 19297 24978 -10266 -26884 10473 -24238 7431 55578
20262E5578k7839j6823k0426k721J5529R389p779J3604J3594j3745K2733K8274
$$ 55578 27739 10916 -9510 -12231 3298 12687 4908 18512 32106 18361 41094 69368
20250F9368j6347l2307L3412M408m0064o0687N059P66M1344K0105k403J0554Q535
$$ 69368 53021 20714 54126 58534 18470 -42217 -37158 -36392 4952 25057 22654 33208 41743
20237D1743K2327K0053p806l1343J1040K9065k9465l9014J5309J0209j700K4125
$$ 41743 64070 84123 76317 44974 56014 85079 55614 16600 31909 42118 40418 64543
20225F4543K4244m501j3021N48k8581j8223m2239k2756l3625J1694M2437L0664
$$ 64543 88787 84286 71265 71813 43232 25009 -17230 -39986 -73611 -61917 -19480 11184
20213A1184J8710R887L9241O645O3798j378q9995J4727K0562l7059l1208M5441
$$ 11184 29894 39781 79022 85667 149465 148087 58092 72819 93381 56322 25114 70555
20201G0555L0397j6050l1031R348j1737K9947J5377l5880k8068o5171o9435k6597
$$ 70555 100952 84902 53871 63219 51482 81429 96806 60926 32858 -32313 -101748 -128345
20189a28345L5193N0145l8669K1946L7460O3291R994k8139l2756k7416j5788m0044
$$ -128345 -93152 -43007 -81676 -59730 -22270 41021 51015 22876 -9880 -37296 -53084 -93128
20177i3128m178k8233m758N1095P5376N7246M0678K4897m0644p9199m4318J6964
$$ -93128 -97306 -125539 -130297 -79202 -3826 53420 94098 118995 78351 -848 -45166 -28202
20165b8202P1699j7946l5137K6768m134l8848k6166K1493K0603J0178k9520J8445
$$ -28202 43497 25551 -9586 17182 13048 -25800 -51966 -30473 -9870 308 -29212 -10767
20153a0767m3210r237J2033N331K9599q5N0240J5908l623N152m3679m5248k7983
$$ -10767 -53977 -63214 -51181 -45850 -16251 -16336 33904 49812 46189 51341 7662 -37586 -65569
20140f5569m4357O6849J2090K2184L6654j2754r674P985l4235M5325K4328k7221
$$ -65569 -109926 -43077 -30987 -8803 27851 15097 5423 13408 -20827 24498 48826 21605
20128B1605L274Q8505L3176p6845j3188M211k2690j6499j2270J4468N5608O1318
$$ 21605 24879 113384 146560 69715 56527 60738 38048 21549 9279 23747 79355 140673
20116A40673k3674r6100J6481R5837r277m2909k3869K0023K2748r974j5201l8115
$$ 140673 116999 20899 37380 133217 123940 81031 57162 77185 99933 89959 74758 36643
20104C6643k4313J9692m530K4833m031l1617k221M1726R637j2939Q967m7306K1551
$$ 36643 12330 32022 27492 52325 48294 16677 14456 56182 65819 52880 61847 14541 36092
20091C6092o7787p867M9624j7906J02J9502L3685Q756J3j1204l1606j9793J8739
$$ 36092 -31695 -39562 10062 -7844 -7742 11760 45445 54201 54214 43010 11404 -8389 10350
20078A0350J501M3114K569j7170k0307K2665l184L6753K9407m5700o7731m2129
$$ 10350 11851 54965 57534 40364 20057 42722 39538 76291 105698 59998 -7733 -49862
20066d9862P162K5768O5518M2100j1033j1513J9479l0095n0027N689L8409O5287
$$ -49862 -42700 -16932 48586 90686 79653 68140 87619 57524 7497 13186 51595 116882
20054A16882R444m0727J369O7090J50068J60573K38664K36608R1601L3405j21300
$$ 116882 126326 85599 86968 154058 304126 464699 703363 939971 1031572 1064977 943677
20043I43677j53769j49645j38446p3900Q7326J35678J23605J84606J38754L3117
$$ 943677 789908 640263 501817 427917 515243 650921 774526 959132 1097886 1131003
20033A131003p4400k15521k39367k04117j15794q7289q9456p4387l939Q686l1162
$$ 1131003 1056603 841082 601715 397598 281804 194515 105059 30672 26733 35419 4257
20022D257K5009L7639k3742Q915l347m1290k0660K3084M1193O6277K7088l6462
$$ 4257 29266 66905 43163 52078 48731 7441 -13219 9865 51058 117335 144423 107961
20010A07961l1490M883m190N1133l911n4412N684N4250R330N0007J21189P0369
$$ 107961 76471 81354 77164 128297 124386 69974 75658 129908 139238 189245 310434 380803
19998C80803J31297K09246K13691J51620L1968o5204j85281k11359j17535K5812
$$ 380803 512100 721346 935037 1086657 1118625 1053421 868140 656781 539246 565058
19988E65058J01458J07144K22356J94070M5121q0218k10690k43106j81350j30851
$$ 565058 666516 773660 996016 1190086 1235207 1154989 944299 701193 519843 388992
19978C88992o8968n8055n3134k9760M8K9981m1093J1678k9660m5001J3180J3956
$$ 388992 320024 261969 208835 179075 179123 209104 168011 179689 150029 105028 118208 132164
19966A32164K529R331k9158k6702N160J5960K2656J3409q691m0661m6372M2676
$$ 132164 134693 144024 114866 88164 93324 109284 131940 145349 136658 95997 49625 92301
19954I2301L731n7163k5271k8548M5121K5578J3198N8994k0311o2569K91J4986
$$ 92301 96032 38869 13598 -14950 30171 55749 68947 127941 107630 45061 45352 60338
19942F0338K6259l4478K4872r86j6038k2396K8223L1147J617n2112p473J3400
$$ 60338 86597 52119 76991 76005 59967 37571 65794 96941 98558 46446 38973 52373
19930E2373m8072J7479K5359Q228K7248n709j681P881M4086N77r1779J6312Q0167
$$ 52373 4301 21780 47139 55367 82615 76906 75225 83106 127192 127769 35990 52302 132469
19917A32469j69J8943K0581M4166j720M5043L2078K0982N6274L0736K640o9544
$$ 132469 132300 151243 171824 215990 214270 259313 291391 312373 368647 399383 402023 332479
19905C32479r947j980l024l4184K4494N9860K4858R8751N6820O1947J15309R8350
$$ 332479 322532 320552 317528 283344 307838 367698 392556 491307 548127 610074 725383 823733
19893H23733Q2947Q7243J13344J77848K13445L35174M19497N52673R38947J733051
$$ 823733 906680 993923 1107267 1285115 1498560 1833734 2253231 2805904 3744851 5477902
19883E477902K955090L175727J095680J39301M87913j202088k798704k266818
$$ 5477902 8432992 11608719 12704399 12843700 13331613 12129525 9330821 7064003
19875G064003j100890m7903J005343K453813K998475R19703l62891K18633j291127
$$ 7064003 5963113 5915210 6920553 9374366 12372841 13292544 12929653 13148286 11857159
19866A1857159l231196k923030j800949j081965p30882m53814k27066j13107j06346
$$ 11857159 8625963 5702933 3901984 2820019 2089137 1635323 1408257 1295150 1188804
19857A188804j16427J9848l544m8267l184j7468j03172p2384k9161r202J00933
$$ 1188804 1072377 1092225 1088681 1040414 1037230 1019762 916590 844206 815045 805843 906776
19846I06776Q9498k2503N5027J78765J37841J15642J41495J54317K42141L49516
$$ 906776 996274 973771 1028798 1207563 1345404 1461046 1602541 1756858 1998999 2348515
19836B348515M70846Q17895J440458K510418L469168K337811L23884M24148j82054
$$ 2348515 2819361 3637256 5077714 7588132 11057300 13395111 13718995 14143143 13961089
19827A3961089k531195k955784j784074n33653N17676J804400L136915K341338
$$ 13961089 11429894 8474110 6690036 6156383 6674059 8478459 11615374 13956712
19819A3956712q1294l6673l27025k743785l484864k500855j534942q31992n51311
$$ 13956712 13875418 13838745 13511720 10767935 7283071 4782216 3247274 2415282 1863971
19810A863971m17218k61527j43365j09463r0572n4320l4117l3371j4292q3948
$$ 1863971 1446753 1185226 1041861 932398 841826 787506 753389 720018 705726 621778
19800F21778j03560m3817j5100m2041m810L5382m150m9299K676J4508k1144j3432
$$ 621778 518218 474401 459301 417260 412450 447832 443682 394383 397059 411567 390423 376991
19788C76991l8554j3137J41m643O6810N818J8861L7889l5016j18760l7337m1061
$$ 376991 338437 325300 325441 320798 387608 393426 412287 450176 415160 296400 259063 218002
19776B18002L7021J2400R060N7330K5296n0374o8732o6711m9890N3734O567k750
$$ 218002 255023 267423 276483 333813 359109 308735 240003 173292 123402 177136 183703 180953
19764A80953j8740N821l8439j5446M7134J7638m2160J3335J4960o9593K4346J8740
$$ 180953 162213 168034 129595 114149 161283 178921 136761 150096 165056 95463 119809 138549
19752A38549m6380j5242M3534N0494K8676k7245o52L0836l6627k1482j8165M753
$$ 138549 92169 76927 120461 170955 199631 172386 171734 202570 165943 144461 126296 131049
19740A31049J2103K3695L5658J4720O290N0682P2195L530l9771p015l7610n7951
$$ 131049 143152 166847 202505 217225 223515 274197 346392 349922 310151 303136 265526 207575
19728B07575J9110R0055M0419J9814l066K5801K5998m8806L9257k1622o2024n2083
$$ 207575 226685 316740 357159 376973 373907 399708 425706 376900 416157 394535 332511 280428
19716B80428j5141M9901j310O470K2045N0748K6221k6645J0542J05572J74301
$$ 280428 265287 315188 313878 320348 342393 393141 419362 392717 403259 508831 683132
19705F83132J59624K99009N78328P88514M95720J25812p8599n00480o64031m50842
$$ 683132 842756 1141765 1720093 2508607 3004327 3130139 3051540 2551060 1887029 1436187
19695A436187j60578l1233Q3256L20556O07174O86107J55350R098k16221p25389
$$ 1436187 1275609 1244376 1327632 1648188 2255362 2941469 3096819 3105917 2889696 2164307
19685B164307o83356m47843k90725j65649o6063q1426j00096q9287j6924K9325
$$ 2164307 1480951 1033108 742383 576734 510671 429245 329149 239862 222938 252263
19675B52263N1635O6095k6261k6616m4269M3566K7445P827m8528j7525Q3348l227
$$ 252263 303898 369993 343732 317116 272847 316413 343858 351685 303157 285632 368980 365753
19663C65753J3105N2714Q1394K9552P2963J35593J25292J86342K12811L37953
$$ 365753 378858 431572 512966 542518 615481 751074 876366 1062708 1275519 1613472
19653A613472O18075Q29593M29549J14778j06018n57943o19065m46058k11272
$$ 1613472 2231547 3061140 3490689 3605467 3499449 2941506 2322441 1876383 1665111
19644A665111j9012J52303L20434O10657O51464K13865o9188m67818p85191o70233
$$ 1665111 1646099 1798402 2118836 2729493 3380957 3594822 3525634 3057816 2272625 1602392
19634A602392m65618l05747j44275j04190o0961l2301l4776o8092j4291N2130
$$ 1602392 1136774 831027 686752 582562 521601 489300 454524 386432 372141 424271
19624D24271l2808l7801l605K8505r865p3780l0342K424K8566M8570J3935J5903
$$ 424271 391463 353662 350057 378562 368697 294917 264575 266999 295565 344135 358070 373973
19612C73973N8583J5027M3237m8678J3927R0123M1743L7162K3240p5181n6221
$$ 373973 432556 447583 490820 442142 456069 546192 587935 625097 648337 573156 516935
19601E16935m836K9942j8538j3597k901R4392Q5253N9254O8401l3469j1412j2138
$$ 516935 512099 542041 523503 509906 507005 601397 686650 745904 814305 780836 769424 757286
19589G57286l3411n3157k1039J7851l1127L5634L5048L5756J4720j704k2785K8978
$$ 757286 723875 670718 649679 667530 636403 672037 707085 742841 757561 755857 733072 762050
19577G62050Q0327K538k4045P7406M0318M9435J12978P7935J30650L7336O2465
$$ 762050 842377 844915 820870 898276 938594 988029 1101007 1178942 1309592 1346928 1409393
19566A409393O6507J02980O7459J19971K02577K78118M68729M49629M38198L89174
$$ 1409393 1475900 1578880 1646339 1766310 1968887 2247005 2715734 3165363 3603561 3992735
19556C992735K87607M3128N2700J29361K68736M30644M43577N84063N70271M52881
$$ 3992735 4280342 4323470 4376170 4505531 4774267 5204911 5648488 6232551 6802822 7255703
19546G255703N20856N70078N87367Q14258J046323J406743J899422K231025K685676
$$ 7255703 7776559 8346637 8934004 9748262 10794585 12201328 14100750 16331775 19017451
19537A9017451L180067L908109N449332Q297734J3891955K4725422M1849688N0281117
$$ 19017451 22197518 26105627 31554959 39852693 53744648 78470070 120319758 170600875
19529A70600875K8225999P857494j3137179m1474245m0566129k4882694j0253623
$$ 170600875 198826874 206684368 193547189 152072944 111506815 86624121 76370498
19522G6370498K247457J7175585L7571590M8428318K3539275J040599j7544827
$$ 76370498 78617955 95793540 133365130 181793448 205332723 206373322 188828495
19515A88828495m7316881m7563205l1954236j9081582j1418577o823767l940630
$$ 188828495 141511614 93948409 61994173 42912591 31494014 24670247 20729617
19508B0729617k241828j291801q41602p51654p14218n82631l76595l06165m20872
$$ 20729617 18487789 17195988 16354386 15602732 14888514 14305883 13929288 13623123 13202251
19499A3202251k06746P3221J67547K19687M41746O08294O30676O99388Q48189
$$ 13202251 12995505 13068726 13236273 13455960 13897706 14506000 15136676 15836064 16684253
19490A6684253J253788J560807K076784K710323L459509M689444O881592J0731601
$$ 16684253 17938041 19498848 21575632 24285955 27745464 32434908 39316500 50048101
19482E0048101J8357073L2897041N1455672M8210617J9263760J874154k9138860
$$ 50048101 68405174 101302215 152757887 200968504 220232264 222106418 192967558
19475A92967558m9047578l7363717j9566985n222373Q274291K6063469M6713984
$$ 192967558 143919980 106556263 86989278 81766905 90041196 116104665 162818649
19468A62818649M4235320J3058706m622475l3126485n3995902m4003170k7937282
$$ 162818649 207053969 220112675 215490200 182363715 128367813 84364643 56427361
19461E6427361j6911577j0460340o455119m157360k779203k005168j454006j135073
$$ 56427361 39515784 29055444 22600325 18442965 15663762 13658594 12204588 11069515
19453A1069515j007527r02004p91307q37307q48526n64098j84413j01970q5466
$$ 11069515 10061988 9159984 8368677 7531370 6682844 6118746 5934333 5832363 5746897
19444E746897k971p8950j58247j49725j39568l43221n17299n13002n54671m97083
$$ 5746897 5743926 5664976 5506729 5357004 5217436 4874215 4356916 3843914 3289243 2792160
19434B792160l58071k28384q2864O03p3662p8598j17240l0202r5002r1360l7985
$$ 2792160 2434089 2205705 2122841 2123444 2049782 1971184 1853944 1823742 1728740 1637380 1599395
19423A599395N180l8502k9817m8365p4675r8141k2371Q733L665k2684j5949Q0227
$$ 1599395 1604575 1566073 1536256 1487891 1413216 1315075 1292704 1301437 1305102 1282418 1266469 1346696
19411A346696K9921l246M8147l7743p3475p9797r1919j49279j27525k6501Q180
$$ 1346696 1376617 1373371 1421518 1383775 1310300 1230503 1138584 989305 861780 835279 843459
19400H43459K961J0599N5067J15198O0664r600o9082j11927m2583k8526q6667
$$ 843459 846420 857019 912086 1027284 1087948 1078348 1009266 897339 854756 826230 739563
19389G39563n0978N9160J6305o2389Q03P5167N4218O70k5003p4008o1935n5531
$$ 739563 688585 747745 764050 701661 702464 777631 831849 832519 807516 733508 671573 616042
19377F16042j2666M8196n089q9643n2571O519M9445M8550L4814L9858J0322L6528
$$ 616042 603376 651572 646483 556840 504269 510788 560233 608783 643597 683455 693777 730305
19365G30305m318l4905k7575n9427J2047M6097K1569Q6041J599l204K6340j2078
$$ 730305 725987 691082 663507 604080 616127 662224 683793 769834 771433 768229 794569 782491
19353G82491l3088q7823l9237o824K7243R0110P1994O7019l3787k2579L2657M9191
$$ 782491 749403 661580 622343 615519 642762 732872 804866 871885 838098 815519 848176 897367
19341H97367M2064R5893J05190K06124L42631O03396P04949M18259J19751j70129
$$ 897367 939431 1035324 1140514 1346638 1689269 2292665 2997614 3415873 3535624 3365495
19331C365495n22200n42966l13198j44578j4334R7776L70515O43885N05268J31940
$$ 3365495 2843295 2300329 1987131 1842553 1828219 1925995 2296510 2940395 3445663 3577603
19321C577603q9095n17374o91838n52868m06467k33738r2093q1985l7237n9088
$$ 3577603 3488508 2971134 2279296 1726428 1319961 1086223 994130 912145 874908 815820
19311H15820m0069j16676o2224j1958j878N839O0647J3105K0121K6455m1741m7528
$$ 815820 775751 659075 596851 584893 583015 588854 649501 662606 682727 709182 667441 619913
19299F19913J048m9070M0150J16153P8302R142Q1902O0183N5929P9334J49752
$$ 619913 620961 571891 612041 728194 806496 815638 897540 957723 1013652 1092986 1242738
19288A242738K41780L97954O45539O66399M01381J12835k62319o43180o19881
$$ 1242738 1484518 1882472 2528011 3194410 3595791 3708626 3446307 2803127 2183246
19279B183246m52892j56059j5208K85308N06705O58131M50743P6620k05083n38371
$$ 2183246 1730354 1574295 1559087 1844395 2351100 3009231 3459974 3536594 3331511 2793140
19269B793140p11281n58100l48468k11599j54608j36713j00064o5907k7538K1430
$$ 2793140 2081859 1523759 1175291 963692 809084 672371 572307 506400 478862 500292
19259E00292j4434J7798k9176j2732L1882k5895L290k470k0389m6827l1550Q1876
$$ 500292 485858 503656 474480 461748 493630 467735 471025 468555 448166 401339 369789 451665
19247D51665M4887q8500m8926P086L041K9161M4507K4544O1306K7723K458j9888
$$ 451665 496552 408052 359126 366212 369253 398414 442921 467465 528771 556494 558952 539064
19235E39064l9532K8770J60779K40981L9213m8742m9778j25774j00605j00482
$$ 539064 499532 528302 689081 930062 969275 920533 870755 744981 644376 543894
19225E43894j01788j6274l7263q994K752k8518K5711K9484o7651k6931j2578M2572
$$ 543894 442106 425832 388569 379575 382327 353809 379520 409004 341353 314422 301844 344416
19213C44416M3048o0976k3056J6048j2087Q8815J8628j2748n3000k1484m418m4238
$$ 344416 387464 326488 303432 319480 307393 396208 414836 402088 349088 327604 323186 278948
19201B78948K349L1701K1746L7265k5495m1281N7289K0747p4966l2246M4324Q4605
$$ 278948 281297 312998 334744 372009 346514 305233 362522 383269 308303 276057 320381 404986
19189D04986J09154P0810p6315m5416n3656K6961j1913r229k0689Q9459K14772
$$ 404986 514140 584950 508635 463219 409563 436524 424611 415382 394693 484152 698924
19178F98924J42567Q0219P1976M4686j75781k33166j31840j31275q5818J0055
$$ 698924 841491 921710 993686 1038372 862591 629425 497585 366310 280492 290547
19168B90547K0573k3921j3359J955O8576l0607k3028m3938n261m3545k4012K6604
$$ 290547 311120 287199 273840 275795 344371 313764 290736 246798 241537 197992 173980 200584
19156B00584M156L034L1665O3398k8273k3491m5460K0507l4782J3104L1974j2448
$$ 200584 204740 207774 239439 302837 274564 251073 205613 226120 191338 204442 236416 223968
19144B23968J3535l4488k4634N3270L4478k3889J2540J8680m9253p169k807J1273
$$ 223968 237503 203015 178381 231651 266129 242240 254780 273460 224207 217038 214231 225504
19132B25504K8989K8870p420k7333J1455K6085j7513M43J0403L8342p2957k6679
$$ 225504 254493 283363 275943 248610 260065 286150 268637 269080 279483 317825 244868 218189
19120B18189l7428r794M8012P5247p6155r332q41l1577q856k5096j9005L3658
$$ 218189 180761 170967 218979 294226 218071 208739 207898 176321 167465 142369 123364 157022
19108A57022L2060J1545M396o883J7725M8841L8653L0755j3990o241j4835J9611
$$ 157022 189082 200627 205023 198140 215865 264706 303359 334114 320124 313883 299048 318659
19096C18659L4353J11195L3913J6317L7553J09588J59451p771q8571j48982o6633
$$ 318659 353012 464207 498120 514437 551990 661578 821029 813258 724687 575705 509072
19085E09072r5578l9441P9495P9671K8212J77831J39300l8356j88586j94655j00120
$$ 509072 413494 374053 453548 533219 561431 739262 878562 840206 651620 456965 356845
19074C56845j9049k2620n633J0464J5850j0322m6508J7320L2618l2033k1357K8722
$$ 356845 337796 315176 309543 320007 335857 325535 279027 296347 328965 296932 275575 304297
19062C04297j2761j08143J6817O7691R166j237K1552R803L1133m0260P624K5029
$$ 304297 291536 183393 200210 267901 277067 275830 297382 307185 338318 298058 305682 330711
19050C30711P5332L1256r635K4176O3801J34231J60882J55628K6431n8835l0307
$$ 330711 406043 437299 427664 451840 515641 649872 810754 966382 992813 933978 903671
19039I03671L517K6817J20548N2595m0444l5642N9602R5251q0776j61145o6474
$$ 903671 907188 934005 1054553 1107148 1066704 1031062 1090664 1185915 1105139 943994 877520
19028H77520l3573N7699J06648J2063j67007j55386j24382p5623P903K4899J3530
$$ 877520 843947 901646 1008294 1020357 853350 697964 573582 497959 505862 530761 544291
19017E44291K1760L9763j2906l9675L1877J4846P508R8928K44274K42384J52330
$$ 544291 566051 605814 592908 553233 585110 599956 607464 706392 950666 1193050 1345380
19006A345380Q4298K3849q9234k16742j94852j46060k1441Q5074J66244K09896
$$ 1345380 1429678 1453527 1364293 1147551 952699 806639 785198 870272 1036516 1246412
18996A246412J80658J34422K4866j01126q6894j2119N5258j46988l24402k08000
$$ 1246412 1427070 1561492 1586358 1485232 1398338 1386219 1441477 1294489 970087 762087
18986G62087j13476m9968l3325N8008J08610J15999J16467Q4049l3776j26875
$$ 762087 648611 598643 565318 623326 731936 847935 964402 1048451 1014675 887800
18976H87800j10701n7173q9915n7725p2565m0428n2003m6192O4259P1668K7489
$$ 887800 777099 719926 630011 572286 499721 459293 407290 361098 425357 497025 524514
18965E24514N9749K8363l3322N1916O8526J26544J86454K81036K27820O8672K3281
$$ 524514 584263 612626 579304 631220 699746 826290 1012744 1293780 1521600 1590272 1613553
18954A613553m4611j46233k31593j53422l0656L1753J35175K37872K57209J35296
$$ 1613553 1568942 1422709 1191116 1037694 1007038 1038791 1173966 1411838 1669047 1804343
18944A804343K3382k4321j87036j60698r6251M3376J60179K23796M96771P73259
$$ 1804343 1827725 1803404 1616368 1455670 1359419 1402795 1562974 1786770 2283541 3056800
18934C056800J422755K179926J394243j052936j916642j418876p70430l83306
$$ 3056800 4479555 6659481 8053724 7000788 5084146 3665270 2894840 2511534
18926B511534o3241K28876N99064J247549K008161J486103j032614k074687j580486
$$ 2511534 2448293 2677169 3276233 4523782 6531943 8018046 6985432 4910745 3330259
18917C330259r44368n45201l45198k17037j60457j08172l9538l1130l8370k3137
$$ 3330259 2385891 1840690 1495492 1278455 1117998 1009826 970288 939158 900788 877651
18907H77651K444m7064J3752L0602L604R8430J48546J13417j3898N1788P9998
$$ 877651 880095 833031 846783 877385 880989 979419 1127965 1241382 1227484 1279272 1359270
18896A359270J58683J92098J95231K45193L65898N72341J029080J927692K665914
$$ 1359270 1517953 1710051 1905282 2150475 2516373 3088714 4117794 6045486 8711400
18887H711400J469589j320502k017329j167784l39906L70894J182355K467740
$$ 8711400 10180989 8860487 6843158 5675374 5335468 5706362 6888717 9356457
18879I356457L475954K216111J90179r17397k809882k994206j956976r72781k13943
$$ 9356457 12832411 15048522 15238701 14321304 11511422 8517216 6560240 5587459 5373516
18870E373516N55927J743056K637639R89135k046466k611937j872420j171301
$$ 5373516 5929443 7672499 10310138 11299273 9252807 6640870 4768450 3597149
18862C597149o82884l95027k80004j90053k2948k9070O0100J21177m3236k03046
$$ 3597149 2914265 2519238 2239234 2049181 2026233 1997163 2057263 2178440 2135204 1932158
18852A932158k79309j94241r5414P799N2233Q2302J17530J46813O3766M1735R2952
$$ 1932158 1652849 1458608 1363194 1370993 1423226 1505528 1623058 1769871 1833637 1875372 1968324
18841A968324J21253J74924L65222N97023R20160J624235K920979L377136N12849
$$ 1968324 2089577 2264501 2629723 3226746 4146906 5771141 8692120 12069256 12582105
18832A2582105k795239k845580j794987r22291k73080J86051O17472J323611K486396
$$ 12582105 9786866 6941286 5146299 4224008 3950928 4136979 4754451 6078062 8564458
18823H564458L135426Q19203k509787k877069j926267j227458q76686n60781l22123
$$ 8564458 11699884 12519087 10009300 7132231 5205964 3978506 3101820 2541039 2218916
18814B218916j63862p4205R5654K19235K09182J23288N5466j18802l69687l14178
$$ 2218916 2055054 1980849 2076503 2295738 2504920 2628208 2683674 2564872 2195185 1881007
18804A881007k01081j49210l0260O7730J23743Q0594l4210j43693k66707j61522
$$ 1881007 1679926 1530716 1500456 1568186 1691929 1772523 1738313 1594620 1327913 1166391
18794A166391q2770j5380k9223j01901m3673q1957p0027L2515K4167j5875m8933
$$ 1166391 1083621 1068241 1039018 937117 893444 811487 741460 773975 798142 782267 733334
18783G33334j9614n907L1271L2807K6716j7614Q3863J33787R1891N3874n4105
$$ 733334 713720 707813 739084 771891 798607 780993 864856 998643 1090534 1144408 1090303
18772A090303j09410l3127L6420J13463K10743K53040J07066o974O8224N8713
$$ 1090303 980893 947766 984186 1097649 1308392 1561432 1668498 1661524 1729748 1788461
18762A788461p9147j95183k04153j29071m7883l1534n0895j2354J28140J38872
$$ 1788461 1709314 1514131 1309978 1180907 1133024 1101490 1050595 1038241 1166381 1305253
18752A305253k2551j96303j20607j19104r3763P178J3568N3185l9769j09717j7755
$$ 1305253 1282702 1086399 965792 846688 752925 760103 773671 826856 787087 677370 659615
18741F59615J6992J834M265L178l6165q2439k2507L246M3018j7752j5114l0422
$$ 659615 676607 678441 682706 685884 649719 567280 544773 548019 591037 573285 558171 527749
18729E27749l9001O6715P5630k223k952K6835o5565j2531m7117m1592j6744l2058
$$ 527749 488748 555463 631093 628870 625918 652753 587188 574657 527540 485948 469204 437146
18717D37146L5973Q2938J5522J6947N355j0141o0673j1498K8926J7034j0550k5158
$$ 437146 473119 556057 571579 588526 593881 583740 523067 511569 540495 557529 546979 521821
18705E21821J6898n2572l3903L1030J3539K5665O1116L0812L1673L21M5827J674
$$ 521821 538719 486147 452244 483274 496813 522478 583594 614406 646079 646400 692227 693901
18693F93901P98K1370k0955r7375m4578K0005M4450K9554L7720q401j3413j4139
$$ 693901 694699 716069 695114 597739 553161 573166 617616 647170 684890 676489 663076 648937
18681F48937l0028o4318o6987M7817M6087K6654K6626R575J8013o758J256o5431
$$ 648937 618909 554591 487604 535421 581508 608162 634788 644363 662376 655618 656874 591443
18669E91443N729K7828J01269O6653K5959p05L3284P6791O900n2918L199j3530
$$ 591443 597172 625000 726269 792922 818881 818176 851460 928251 935151 882233 885432 871902
18657H71902K2638L7221k0900j00404m5643L4208O3435K9182k3388N8127R3799
$$ 871902 894540 931761 910861 810457 764814 799022 862457 891639 868251 926378 1020177
18646A020177r103m2576M016N6429K5609k189k6177q899n42r41K5777M2597J7384
$$ 1020177 1011074 968498 972514 1028943 1054552 1052363 1026186 1017287 1016745 1015804 1041581 1084178 1101562
18633A101562J7454L5405O0682J1273L6371M8694k9211l5176K132N4498J14343
$$ 1101562 1119016 1154421 1215103 1226376 1262747 1311441 1282230 1247054 1249186 1303684 1418027
18622A418027J19287J17531K9645k8707M5620Q8163O1485R6375K47219K65007
$$ 1418027 1537314 1654845 1684490 1655783 1701403 1789566 1851051 1947426 2194645 2459652
18612B459652K41924N8131P7069K04270O7888r7156j21960Q555J37487K65766
$$ 2459652 2701576 2759707 2836776 3041046 3108934 3011778 2889818 2898373 3035860 3301626
18602C301626L60061L00188J83035J65154L05433L63894L28848L73291M00461
$$ 3301626 3661687 3961875 4144910 4310064 4615497 4979391 5308239 5681530 6081991
18593F081991O05635Q65832J143459J411443J714082K027865K651788L732025
$$ 6081991 6687626 7553458 8696917 10108360 11822442 13850307 16502095 20234120
18585B0234120N745921R722697J7506030K9211134L0226236o33707k6826228k4933149
$$ 20234120 25980041 35702738 53208768 82419902 112646138 112012431 85186203 60253054
18577F0253054j5097019p380632k576127J259870O196962J4521242K6685523K8832845
$$ 60253054 45156035 37775403 35199276 36459146 42656108 57177350 83862873 112695718
18569A12695718j567750k9002671k7087076j7090562r908962o004902l489449
$$ 112695718 111127968 82125297 55038221 37947659 28038697 22033795 18544346
18562A8544346j839856j235712j341012j266894q88469m00914Q4182M38168L97589
$$ 18544346 16704490 15468778 14127766 12860872 11972403 11571489 11655671 12093839 12491428
18553A2491428L7028J73497P16322J284545J715983K508206L756426M768745L677947
$$ 12491428 12528456 12701953 13418275 14702820 16418803 18927009 22683435 27452180 31130127
18544C1130127K545449L319059K594562J450381L902588P858338J0114153J4723693
$$ 31130127 33675576 36994635 39589197 41039578 44942166 52800504 62914657 77638350
18536G7638350K7242229L9807920K6143547j6175289l1060973j7190951L662968
$$ 77638350 104880579 144688499 170832046 154656757 123595784 106404833 110067801
18529A10067801K4417766L0081174J619432j9032032n652148J7194094J5363898
$$ 110067801 134485567 164566741 166186173 147154141 141501993 158696087 174059985
18522A74059985j9538976l3652638k0747928j033996J8965012K4997997o132100
$$ 174059985 154521009 120868371 100120443 99086447 118051459 143049456 136917356
18515A36917356l4790115l2047545k0764176j2472990p966027n256934l446058
$$ 136917356 102127241 70079696 49315520 36842530 28876503 23619569 20173511
18508B0173511k163799j474554j019715m61007L09374Q91949Q34755L78669o7147
$$ 20173511 18009712 16535158 15515443 15054436 15363810 16255759 17090514 17469183 17402036
18499A7402036j18181k5037j40598j33176M21153J602521L255724L964570K456111
$$ 17402036 17283855 17258818 17118220 16985044 17406197 19008718 22264442 26229012 28685123
18490B8685123K288659L304166K720292L165988O046406R753271J5188021K7652178
$$ 28685123 30973782 34277948 36998240 40164228 46210634 55963905 71151926 98804104
18482I8804104M2766175K7717165k1943064m1027890l0431730j6762714p632502
$$ 98804104 141570279 169287444 147344380 106316490 75884760 59122046 51489544
18475E1489544j905714L486081J1338749K4143283L8417177K7079820j8854307
$$ 51489544 49583830 53069911 64408660 88551943 126969120 154048940 135194633
18468A35194633m0143216l2194882k0050905j1874225p257851m452054k738759
$$ 135194633 95051417 62856535 42805630 30931405 23673554 19221500 16482741
18461A6482741j948277j516851j069239o44827l71667k89807m23914m76527l61314
$$ 16482741 14534464 13017613 11948374 11303547 10931880 10642073 10218159 9741632 9380318
18452I380318J9326J91061j88142q71275r24420l73846J5699J09744j28511l57261
$$ 9380318 9399644 9590705 9402563 8531288 7606868 7233022 7248721 7358465 7229954 6872693
18442F872693k41833L0149J47657k23047n28271l81060k7977L56905N59848J28313
$$ 6872693 6630860 6661009 6808666 6585619 6057348 5676288 5648311 6005216 6565064 6693377
18432F693377l82492m46081r0550M95206Q23261P12336N37743K57429j22152j62705
$$ 6693377 6310885 5864804 5774254 6269460 7092721 7805057 8342800 8600229 8478077 8315372
18422H315372n0726l39265o94410n07531n0299M64891Q69054L76145p04159j245483
$$ 8315372 8264646 7925381 7230971 6723440 6673141 7138032 8007086 8383231 7679072 6433589
18412F433589j104587p51257m46438j93913l7897J49019M89088P10761P00883
$$ 6433589 5329002 4577745 4131307 3937394 3899497 4048516 4537604 5248365 5949248
18403E949248J95291m17989l79171M7630M46452J48048l37783l94735k14796j5699
$$ 5949248 6144539 5726550 5347379 5395009 5841461 5989509 5651726 5256991 5042195 5026496
18393E026496J43408L11266N68523O54555P16837Q47990Q12323M01275J38172
$$ 5026496 5169904 5481170 6049693 6704248 7421085 8269075 9081398 9482673 9620845
18384I620845J19167J8512O4991L29187Q13222J295631K031171K948449M215872
$$ 9620845 9740012 9758524 9823515 10152702 10965924 12261555 14292726 17241175 21457047
18375B1457047M748009K790940J372212L335877O599050N977054N5138l075243
$$ 21457047 26205056 28995996 30368208 33704085 40303135 46280189 46335327 43260084
18367D3260084m072740m008302j696650J020758L732705P168173J2829879K2564950
$$ 43260084 39187344 35179042 33482392 34503150 38235855 45404028 58233907 80798857
18359H0798857L4353580L2481970J3638450P200216R264663K152638j9329268
$$ 80798857 115152437 147634407 161272857 168473073 177737736 179890374 160561106
18352A60561106k2439549j3770692j9477954k4719290j8642665j0381714l634888
$$ 160561106 138121557 124350865 104872911 80153621 61510956 51129242 47494354
18345D7494354K441704R171748J5674613J2321899n765673j7674483j5943653
$$ 47494354 49936058 59107806 74782419 87104318 81338645 63664162 47720509
18338D7720509j0457131o144951l223938j488071n01181L70572J615248L181036
$$ 47720509 37263378 31118427 27894489 26406418 25905237 26275809 27891057 31072093
18330C1072093L733467K022299J697077M949757R790505J2191584N838836k419545
$$ 31072093 34805560 36827859 38524936 43474693 53265198 65456782 71295618 68876073
18322F8876073m648214k411079K674263R208706J7038828K3450254K0824900O661431
$$ 68876073 64227859 61816780 64491043 73699749 90738577 114188831 135013731 141675162
18314A41675162p28933J0117561L3652157O0294554O4967650M3150008J2446081
$$ 141675162 140946229 151063790 184715947 245010501 309978151 353128159 365574240
18307C65574240j8261134k2715968r026403J0056911n865278k8914447k0170956
$$ 365574240 347313106 324597138 315570735 325627646 319762368 290847921 270676965
18300B70676965m639451l989846k1354099k8582137l7165732m2495821l4453833
$$ 270676965 266037514 262047668 240693569 212111432 174945700 132449879 97996046
18293I7996046k2661355j3406410p027729j766082L856661O148708j478834r771091
$$ 97996046 75334691 61928281 54900552 53134470 56991131 63139839 61661005 51889914
18285E1889914r688449o450278l281147q32658J093722K749257J964970n07413
$$ 51889914 42201465 35751187 32470040 31637382 32731104 35480361 37445331 36937918
18277C6937918n51497P33473J894565L188952M838320N558634O340982J1566952
$$ 36937918 36386421 37119894 39014459 42203411 47041731 52600365 58941347 70508299
18269G0508299K0782028K8120417J8697119p273341j9488733j3792362k375235
$$ 70508299 91290327 119410744 138107863 130834522 111345789 97553427 95178192
18262I5178192R939291K3894006L2241976K2744138K1155155M3245637N1023993
$$ 95178192 105117483 129011489 161253465 183997603 205152758 248398395 299422388
18255B99422388K2095713o808171k8061962n8849538o8116979n1051852l2203184
$$ 299422388 321518101 314709930 286647968 227798430 159681451 108629599 76426415
18248G6426415j9916148j2604413p734378m414724k305769n00758J962907N516526
$$ 76426415 56510267 43905854 36171476 31756752 29450983 28950225 30913132 36429658
18240C6429658Q688594M622083o522969j0884145q465722n408584l293875j784189
$$ 36429658 45118252 49740335 43217366 32333221 23867499 18458915 15165040 13380851
18232A3380851r18306n72148l44985k6867K6924l45117q00770o74175m89905o24704
$$ 13380851 12462545 11890397 11545412 11518545 11545469 11200352 10399582 9725407 9235502 8610798
18222H610798n40500o18743o94644m98480q0853J20272r8146k96701l98230k98459
$$ 8610798 8070298 7451555 6756911 6258431 6177578 6297850 6199704 5903003 5504773 5206314
18212E206314o0393L72832N55285J30348n07453o43250m99475k59773n8912R7503
$$ 5206314 5145921 5518753 6074038 6204386 5696933 5053683 4554208 4294435 4235523 4333026
18202D333026J37347k51216l35237k23568o8971k8169L2807J08953p2236j20117
$$ 4333026 4470373 4219157 3883920 3660352 3591381 3563212 3596019 3704972 3632736 3512619
18192C512619O265J36910L12008L48588J58248K3172K70526O48886R89809Q22266
$$ 3512619 3518884 3655794 3967802 4316390 4474638 4497810 4768336 5417222 6407031 7229297
18182G229297M95455M624l16704k37812L34J89082k2575k00747k3569j78767k89886
$$ 7229297 7724752 7729376 7412672 7174860 7175194 7364276 7341701 7140954 7117385 6938618 6648732
18171F648732m37388m59123m16508l48687q8390K24206L18973L38801K55164J25781
$$ 6648732 6211344 5752221 5335713 4987026 4898636 5122842 5441815 5780616 6035780 6161561
18161F161561j7695m64506q00518p49307n87251m02176j77306j8119M4118J29263
$$ 6161561 6143866 5679360 4878842 4129535 3542284 3140108 2962802 2944683 2988801 3118064
18151C118064J69724O6804o8725r0397j9687K2719K7570J67666K36163L90167
$$ 3118064 3287788 3354592 3285867 3195470 3175783 3198502 3226072 3393738 3629901 4020068
18141D020068L60573K03643m1502j42100o1687L1386K16883M79242O06985M70945
$$ 4020068 4380641 4584284 4542782 4400682 4338995 4370381 4587264 5066506 5673491 6144436
18131F144436N39045P75742Q03910M17924Q1197m05819p40134n09154j00242J31034
$$ 6144436 6683481 7459223 8263133 8681057 8762254 8356435 7616301 7107147 7006905 7137939
18121G137939K51148L93444P70178J124062J481235J791624J770813K257081L739705
$$ 7137939 7389087 7782531 8552709 9676771 11158006 12949630 14720443 16977524 20717229
18112B0717229O818476J3150369K6799480M4379071K3076490l1605915l9229978
$$ 20717229 27535705 40686074 67485554 111864625 134941115 103335200 64105222
18105F4105222k4968321j3484221p296862l931632j811012r29677j115860j153329
$$ 64105222 39136901 25652680 18355818 14424186 12613174 11683497 10567637 9414308
18097I414308o70871k34514J10689K97810J89319q0241q1789R639K350J2606L7084
$$ 9414308 8743437 8508923 8619612 8917422 9106741 9026500 8944711 8954350 8956700 8969306 9006390
18086I006390j81721k10751K6346L81166O37776R21932J050624J198765J365596
$$ 9006390 8824669 8613918 8640264 9021430 9659206 10581138 11631762 12830527 14196123
18077A4196123J780462K443390L128091L993065N222038P532731J2317700K1626850
$$ 14196123 15976585 18419975 21548066 25541131 30763169 38295900 50613600 72240450
18069G2240450L6345794M1240739O829647k8674146k7230564j1490563O079366
$$ 72240450 108586244 149826983 156656630 127982484 100751920 89261357 95340723
18062I5340723K5298457L5937398N908140l5915827l9202092k6285657j5841535
$$ 95340723 120639180 156576578 162484718 126568891 87366799 61081142 45239607
18055D5239607r651074n804758l453100j913546p74279k71635l26112J15986Q83167
$$ 45239607 35588533 29783775 26330675 24417129 23642850 23371215 23045103 23161089 24044256
18046B4044256J600853K480192L711734N055525P016679J0792412J6988613K2572778
$$ 24044256 25645109 28125301 31837035 36892560 43909239 54701651 71690264 94263042
18038I4263042J4988455m806609j1256651m579005P065811K2166961L9070536
$$ 94263042 109251497 104444888 93188237 88609232 95675043 117842004 156912540
18031A56912540L6576014m691568l5040250k9444226j2414730M348950K0564021
$$ 156912540 193488554 188796986 153756736 124312510 111897780 116246730 136810751
18024A36810751L1670863K4819555J7445840J3402894j1219365j3280581J1844985
$$ 136810751 168481614 193301169 210747009 224149903 212930538 199649957 211494942
18017B11494942K0183146l498452o822537K166943j5439604k1742337N70318Q646976
$$ 211494942 231678088 228179636 221357099 223524042 208084438 186342101 186912419 195559395
18009A95559395k4718574m5669583l6306010k2108010j2522798p534514m628048
$$ 195559395 170840821 125171238 88865228 66757218 54234420 46699906 42071858
18002D2071858k414487o58556M62064J966849M671381R257603J5742143J8922170
$$ 42071858 39657371 38998815 39460879 41427728 46099109 55356712 71098855 90021025
17994I0021025O925221p663574o988058J663583J2452329K2640220K6202960K4902317
$$ 90021025 96946246 89282672 82294614 83958197 96410526 119050746 145253706 170156023
17986A70156023L0220593K9699365J7011573n968274k2750565k5126629l0632674
$$ 170156023 200376616 230075981 247087554 241119280 218368715 193242086 162609412
17979A62609412l5837772k7662028j5174464l812668O587753J6595643K0842689
$$ 162609412 126771640 99109612 83935148 80122480 86710233 103305876 124148565
17972A24148565J8273196J9458371K133089k9122596l1524059j8014153k763011
$$ 124148565 142421761 161880132 164013221 134890625 103366566 85352413 82589402
17965H2589402J3220395K6239144J2693076k2835932l1930463k2393120j3049679
$$ 82589402 95809797 122048941 134742017 111906085 79975622 57582502 44532823
17958D4532823q211618o100208m088365k393076j238336k26737Q89301J427765
$$ 44532823 36321205 30220997 26132632 23739556 22501220 22274483 23163784 24591549
17950B4591549J274726J422994K645899N569119J0470659J4040051N780778p279948
$$ 24591549 25866275 27289269 29935168 35504287 45974946 60014997 65795775 58515827
17942E8515827q518409k882086N069293J5343066K4649410J4930513j3935940
$$ 58515827 49997418 47115332 52184625 67527691 92177101 107107614 93171674
17935I3171674k4356618j7375974p818709N82874P554099O920767n764067j3652503
$$ 93171674 68815056 51439082 43620373 44203247 51757346 58678113 52914046 39261543
17927C9261543j1765704p619055m504302k677453j352638n39282m44081o40175
$$ 39261543 27495839 19876784 15372482 12695029 11342391 10803109 10359028 9718853
17919I718853p39844o45011l30663j7712J90379M51821O87206L63956m07643r00399
$$ 9718853 8979009 8333998 8003335 7985623 8176002 8627823 9315029 9678985 9271342 8370943
17909H370943r06137m68043J73454P83370R70669L68354m54071p70755n88205
$$ 8370943 7464806 6996763 7170217 7953587 8924256 9292610 8838539 8067784 7479579
17900G479579m11590k19694P7894R1868l66186q59730r48288o37341m65267k95272
$$ 7479579 7067989 6848295 6926189 7018057 6651871 5792141 4843853 4206512 3741245 3445973
17890C445973k35855j20731N3270R4633R2030K20720M29182N54434M71705K49416
$$ 3445973 3210118 3089387 3142657 3237290 3329320 3550040 3979222 4533656 5005361 5254777
17880E254777L40409M17804J88348Q2929J42092k3215k27551j9970R6672j58283
$$ 5254777 5595186 6012990 6201338 6284267 6426359 6403144 6175593 6155623 6252295 6094012
17870F094012k82804j33232R1326K98676J83254j72585l67921m57413n19757n18002
$$ 6094012 5811208 5677976 5769302 6067978 6251232 6078647 5710726 5253313 4733556 4215554
17860D215554m48013k35415l6600K8952J58719J81373k5165k43916k19615j74476
$$ 4215554 3767541 3532126 3495526 3524478 3683197 3864570 3839405 3595489 3375874 3201398
17850C201398r8923P3744J73410Q7149J9294m1539j87877r1838M2455Q9979J39739
$$ 3201398 3102475 3176219 3349629 3436778 3456072 3414533 3226656 3134818 3177273 3267252 3406991
17839C406991J28047J04917K03982K08118L15105M57609O14516L80442o0622q7133
$$ 3406991 3535038 3639955 3843937 4052055 4367160 4824769 5439285 5819727 5759105 5671972
17829E671972J08259L00666N64415M98835Q3472l68513m03064j21425L06379N69303
$$ 5671972 5780231 6080897 6645312 7144147 7227619 6859106 6456042 6334617 6640996 7210299
17819G210299N68228K34213O711N3718K77916N64237R37880J348015J469124J388256
$$ 7210299 7778527 8012740 8019451 8073169 8351085 8915322 9853202 11201217 12670341 14058597
17809A4058597J306283J264946J213883J306297J803901K532572L350146M626445
$$ 14058597 15364880 16629826 17843709 19150006 20953907 23486479 26836625 31463070
17801C1463070P064457J1194165J5959175J6196536R611776K921214k092551m758301
$$ 31463070 38527527 49721692 65680867 81877403 91489179 94410393 92317842 87559541
17793H7559541j523426O164617J7010391L2539300N1554790O7892438P1072362
$$ 87559541 86036115 92200732 109211123 141750423 193305213 261197651 332270013
17786C32270013L2517997l4323126o0521593l8439016R742M4646100Q5976910
$$ 332270013 364788010 330464884 269943291 231504275 231514017 276160117 362137027
17779C62137027P9237552N797906n5513246n8047332m1231212m2419810n2725717
$$ 362137027 441374579 447172485 391659239 333611907 292380695 249960885 197235168
17772A97235168n0115722l5922422k1142447r736030l49030Q397847J4725831
$$ 197235168 147119446 111197024 90054577 80318547 79969517 88367364 103093195
17765A03093195J1329379m751790j9097779k0893002j5673139j0070447n859928
$$ 103093195 114422574 109670784 90573005 69680003 54006864 43936417 38076489
17758C8076489l039184j390211q28544q90146n76721M84036J648494K449093K736275
$$ 38076489 35037305 33647094 32818550 31928404 31351683 31835719 33484213 35933306 38669581
17749C8669581L350704N173824Q950737J5243639K2994647K4428502J2712912
$$ 38669581 42020285 47194109 56144846 71388485 94383132 118811634 131524546
17742A31524546J176928N150920K0315638K9101153J4535295j1715324k0795428
$$ 131524546 132701474 137852394 158168032 187269185 201804480 190089156 169293728
17735A69293728p714972J8077982N1413968P0195241L6989115j4881183k9956159
$$ 169293728 161578756 179656738 231070706 301265947 338255062 323373879 293417720
17728B93417720k3892728r295760J1892549K2899970k070602n0141747o5492823
$$ 293417720 269524992 260229232 272121781 295021751 292951149 242809402 177316579
17721A77316579m6963159k8221841k1481946j9058387j4502669r716743o312108
$$ 177316579 130353420 102131579 80649633 61591246 47088577 37371834 31059726
17714C1059726m080578k533628j501668n42787J079724L234376M697426K124072
$$ 31059726 26979148 24445520 22943852 22401065 23480789 26715165 31412591 33536663
17706C3536663l773944o846017n688054l688998k158190j459220j261367j237203
$$ 33536663 29762719 22916702 17228648 13539650 11381460 9922240 8660873 7423670
17698G423670r85485p62363n58857m57087l92381l76538l19643j49124j19781
$$ 7423670 6438185 5675822 5116965 4659878 4267497 3890959 3571316 3422192 3302411
17689C302411r4547j93870j24426j13062p7707q8922q8827j44854l8283M605k511
$$ 3302411 3207864 3013994 2889568 2776506 2698799 2609877 2521050 2376196 2337913 2342518 2340007
17678B340007l6414n4325j02818p3880j02680p2883p1476j01059n9109l9490k9128
$$ 2340007 2303593 2249268 2146450 2072570 1969890 1897007 1825531 1724472 1665363 1625873 1596745
17667A596745l2909N816J076K5070K5932R9619K17483K52409K3574j33395j31736
$$ 1596745 1563836 1569652 1570728 1595798 1621730 1721349 1938832 2191241 2214815 2081420 1949684
17656A949684m2689j4542K1567K576k3487J0214K7810o922m2637L9163J31772
$$ 1949684 1906995 1892453 1914020 1916596 1893109 1903323 1931133 1924211 1881574 1920737 2052509
17645B052509J45510N2502n6005q6318p8030m190J5910J7055N0973J65136K72862
$$ 2052509 2198019 2250521 2194516 2108198 2030168 2025978 2041888 2058943 2109916 2275052 2547914
17634B547914K68099K20026J63481J08988r773O3049P9969J30752K79270M62996
$$ 2547914 2816013 3036039 3199520 3308508 3298735 3361784 3441753 3572505 3851775 4314771
17624D314771P42364R90375J034558O22194j88544o53850m74431r35O96854J320103
$$ 4314771 5057135 6047510 7082068 7704262 7515718 6861868 6387437 6386502 7083356 8403459
17614H403459J373145M40923n53987o47433l60828k02041k26647k52217q3306
$$ 8403459 9776604 10217527 9663540 9016107 8655279 8453238 8226591 7974374 7891068
17605G891068M5150K33111M54194N53980O83943P80730N88631M77759O45216Q95775
$$ 7891068 7936218 8169329 8623523 9177503 9861446 10642176 11230807 11708566 12353782 13249557
17595A3249557J461325K097184K627443L175039L790230M159428M799661O191716
$$ 13249557 14710882 16808066 19435509 22610548 26400778 30560206 35359867 41551583
17587D1551583R199085J5077623K5721992M0904952N0270373M0787808K0087860
$$ 41551583 50750668 65828291 91550283 132455235 182725608 223513416 243601276
17580B43601276j679210k2278188k5041815m038639J8966386K0481602M130804
$$ 243601276 241922066 219643878 194602063 190563424 209529810 230011412 234142216
17573B34142216j6078161l7877113m8915588m1490612k7346029j5980854q792978
$$ 234142216 218064055 180186942 131271354 89780742 62434713 46453859 37660881
17566C7660881n268372l988249l233515k446796j582059p54996n7071j43269q38782
$$ 37660881 32392509 28404260 25170745 22723949 21141890 20386894 20329823 20186554 19347772
17557A9347772j411800j437704j127273p89939m42288j14280p8328j72096j76798
$$ 19347772 17935972 16498268 15370995 14581056 14138768 14024488 13946160 13774064 13597266
17548A3597266j42838n3972J40027L77651N52771R67630J363303J463658J549042
$$ 13597266 13454428 13400456 13540483 13918134 14470905 15438535 16801838 18265496 19814538
17539A9814538K137820K829786L479423M231490N662211Q164797J3264441K2956642
$$ 19814538 21952358 24782144 28261567 32493057 38155268 46320065 59584506 82541148
17531H2541148L7149360M5662037L6289757J7409971k235595k1481316k3822128
$$ 82541148 119690508 165352545 201642302 219052273 216816678 195335362 171513234
17524A71513234l883736J7113596J8175070L595733j4314957l4079168m4082933
$$ 171513234 167629498 184743094 202918164 206513897 192198940 158119772 114036839
17517A14036839l7412128k4895440j5048545q936336n409605l497072k567090
$$ 114036839 76624711 51729271 36680726 27744390 22334785 18837713 16270623
17510A6270623k048446j512501r30489m73975k17332k55319n04265o75656o52661
$$ 16270623 14222177 12709676 11779187 11305212 11087880 10832561 10328296 9652640 8999979
17501H999979m66374k08860j20844j68380l86109n47261o76469p98641p89017
$$ 8999979 8533605 8324745 8203901 8035521 7649412 7102151 6425682 5627041 4838024
17492D838024o25134n04322m35946l81069k14139j11671M3213M6449L4483j5631
$$ 4838024 4212890 3708568 3272622 2891553 2677414 2565743 2608956 2655405 2689888 2674257
17482B674257m5006R5251R9715K43762M61826N61362O93657N87900L60243M2938
$$ 2674257 2629251 2724502 2824217 3067979 3529805 4091167 4784824 5372724 5732967 5775905
17472E775905l20164m14285j37525Q7522n4743k98963n70293p42795p42797n61647
$$ 5775905 5455741 5041456 4903931 4991453 4936710 4637747 4067454 3324659 2581862 2020215
17462B020215m32771k94176j79253j39862j61041j29531q6019n293J0312N0035
$$ 2020215 1587444 1293268 1114015 974153 813112 683581 597562 592269 602581 652616
17452F52616O7459N6480L6127K2027l184Q9810K08302J94223J18436R210O1175
$$ 652616 720075 776555 812682 834709 831525 921335 1129637 1323860 1442296 1451506 1512681
17441A512681M494j30033o7840L583j15966j76663j34397m6900P3990L4740o8457
$$ 1512681 1517175 1387142 1319302 1322885 1206919 1030256 895859 848959 922949 957689 889232
17430H89232O2508R0713J58177K16990L59268M08281N97975N32485K84790R4395
$$ 889232 951740 1042453 1200630 1417620 1776888 2185169 2783144 3315629 3600419 3694814
17420C694814j26669k68578j93046J14657J72573J9780j79844m38104o70489o65328
$$ 3694814 3568145 3299567 3106521 3221178 3393751 3413531 3233687 2795583 2125094 1459766
17410A459766m88107k94254j65551r3716l5387p4770l9127n0898m2608r6133l1182
$$ 1459766 971659 677405 511854 418138 382751 307981 268854 217956 175348 79215 48033
17399D8033j6713J9381J9242K457K1664n9548m1390j8556L7517l2870k4252J4418
$$ 48033 31320 50701 69943 72400 94064 34516 -6874 -25430 12087 -20783 -45035 -30617
17387c0617M6175M0565j114N0336Q885q8538l3106K8610N5329P9606N2314K8401
$$ -30617 15558 56123 55009 105345 114230 25692 -7414 21196 76525 156131 208445 236846
17375B36846n623k5950J0511l8554k5438j1950n9120j5915N5041K7102o2707j1753
$$ 236846 231223 205273 215784 177230 151792 139842 80722 64807 119848 146950 84243 72490
17363G2490m9159l2759P146N1600J4158K7661J1321m7821m7288l8638J1493N3478
$$ 72490 23331 -9428 -2282 49318 63476 91137 102458 54637 7349 -31289 -19796 33682
17351C3682J3553J8886j537o006P843L2002j0747m7209n1383m4496l6986M2826
$$ 33682 47235 66121 64584 58578 66421 98423 87676 40467 -10916 -55412 -92398 -49572
17339d9572R4721M9070q8484j17321l8803J6430K4408J2773N2340L125J9712o1315
$$ -49572 45149 94219 5735 -111586 -150389 -133959 -109551 -96778 -44438 -41313 -21601 -82916
17327h2916m7606P1311J22508M9908k826q673n3530j0214j0920M2731k7209j4297
$$ -82916 -130522 -59211 63297 113205 110379 101706 48176 37962 27042 69773 42564 28267
17315B8267J9770K2549L5564k2147J0048J2516r6375j8197j7788J9175m3331o0804
$$ 28267 48037 70586 106150 84003 94051 106567 10192 -8005 -25793 -6618 -49949 -110753
17303a10753M0323N7921M8027q516n4305j1959J8022L7222O5060N205n8405K2527
$$ -110753 -70430 -12509 35518 27002 -27303 -39262 -21240 15982 81042 86247 27842 50369
17291E0369O7020K6977O5159k3132L8962O0198P2858J32470J83540K20004L5608
$$ 50369 117389 144366 209525 186393 225355 285553 358411 490881 674421 894425 930033
17280I30033k0506N5789J27610K6520K0703L1760m2162j56674j19296K3020J15239
$$ 930033 909527 965316 1092926 1119446 1140149 1171909 1129747 973073 853777 876797 992036
17269I92036P3788J2504l1927P7196J85214P6942r2072r7176m2832J356j0829
$$ 992036 1065824 1078328 1046401 1123597 1308811 1385753 1293681 1196505 1153673 1155029 1144200
17258A144200q6211j43749j87977k48197j57296j10275m3999M2857K2642L4035
$$ 1144200 1057989 914240 726263 478066 320770 210495 166496 209353 231995 266030
17248B66030J984n8217l3529k3250P0241M1934j3714l3777J4437N640J6332J0557
$$ 266030 268014 209797 176268 153018 223259 265193 251479 217702 232139 237779 254111 264668
17236B64668K3K1898L6120R1527K17832K29672J01507J09580J23388J34522N3798
$$ 264668 264691 286589 322709 414236 632068 861740 963247 1072827 1196215 1330737 1384535
17225A384535l8539j91745k28707l3914O5545Q7127m3721j97648j79316j20974
$$ 1384535 1345996 1154251 925544 891630 957175 1044302 1000581 802933 623617 502643
17215E02643n3842Q9639K03352K36735J46820n4846j62031j57819j59466l935
$$ 502643 448801 538440 741792 978527 1125347 1070501 908470 750651 591185 587250
17205E87250J43753J00601L8230k2954j06963j97498j84866j31935p7908q5300
$$ 587250 731003 831604 869834 846880 739917 542419 357553 225618 147710 62410
17195F2410m9014J5788K3891K496m0812o5594M8352J0514l175J3407k8283l531
$$ 62410 13396 29184 53075 55571 14759 -50835 -2483 8031 4856 18263 -10020 -13551
17183a3551r96l2957R43J6790k4059n2510J0102j7608o2324m046K3034N7839L1820
$$ -13551 -14547 -47504 -46561 -29771 -53830 -106340 -96238 -113846 -176170 -180216 -157182 -99343 -67523
17170f7523m5441M5974K7038K531l2951j327l7479j3455j8967J3505J05183P72
$$ -67523 -112964 -66990 -39952 -37421 -70372 -71699 -109178 -122633 -141600 -128095 -22912 -22140
17158b2140p7375r6669J116J8719N6075J3642M5011j6761m8613N0873k8282K3235
$$ -22140 -99515 -196184 -195068 -176349 -120274 -106632 -61621 -78382 -126995 -76122 -104404 -81169
17146h1169L2864l68j5552N1038J3517k2797k6295l387j448J4162J6960k7006
$$ -81169 -48305 -48673 -64225 -13187 330 -22467 -48762 -52149 -53597 -39435 -22475 -49481
17134d9481L7447K2444m8403j6629J2803l0368M1736L9121j6139m1157K9210k2667
$$ -49481 -12034 10410 -37993 -54622 -41819 -72187 -30451 8670 -7469 -48626 -19416 -42083
17122d2083K5322m8921k8618J5985j0972M9757l2715J6661K6560O046J940J37
$$ -42083 -16761 -65682 -94300 -78315 -89287 -39530 -72245 -55584 -29024 -22978 -21038 -20901
17110b0901p3911l6896l3542K1393L4503l4193k4471L8370P3782Q516o977J5581
$$ -20901 -94812 -131708 -165250 -143857 -109354 -143547 -168018 -129648 -55866 -47350 -54327 -38746
17098c8746k4263k6611L932J1651K324J8586n814m604r399M2281P0748r655m5190
$$ -38746 -63009 -89620 -85688 -74037 -71713 -53127 -58941 -63545 -72944 -30663 40085 30430 -14760
17085a4760k3793l9441o761Q075M0605L7083M1174m6941n7611J0339L6115N6344
$$ -14760 -38553 -77994 -84755 -76680 -36075 1008 42182 -4759 -62370 -52031 -15916 40428
17073D0428K5660l4984L1824Q637L6092L1511K4751R5068J31378J80110K10474
$$ 40428 66088 31104 62928 71565 107657 139168 163919 258987 390365 570475 780949
17062G80949J80863J27458P145p6879n6674n2921N5657K0146m2325n2749p7186
$$ 780949 961812 1089270 1096415 1019536 962862 909941 965598 985744 943419 890670 813484
17051H13484j57723k22989j42168r9111o8919p3699o1449j7427o9712L5555L8259
$$ 813484 655761 432772 290604 191493 122574 48875 -12574 -30001 -99713 -64158 -25899
17040b5899N2377k8156p1266j6681J0360M9337L4392l9760o3894p383p500q705
$$ -25899 26478 -1678 -72944 -89625 -79265 -29928 4464 -35296 -99190 -106573 -114073 -122778
17028a22778r550K7844J9380Q324J8276M0479m480N6878K6098J2632K3942L8818
$$ -122778 -132328 -104484 -85104 -76780 -58504 -18025 -22505 34373 60471 73103 97045 135863
17016A35863p1075k5378L4141J09437J90340J84531J66589K07970R1483J5852
$$ 135863 64788 39410 73551 182988 373328 557859 724448 932418 1023901 1039753
17006A039753j28027n7867Q741R5245M6783j5832o2722j81279k18555j74628q3357
$$ 1039753 911726 853859 862600 957845 1004628 988796 926074 744795 526240 351612 268255
16995B68255l4418n2170o2237r5512o7271J1159k3979q611J5436J5865n219M1938
$$ 268255 233837 181667 119430 23918 -43353 -32194 -56173 -64784 -49348 -33483 -38702 3236
16983C236L6516K9567j5945n8861n3144k0187N473J6296M6200K5498l3906m1488
$$ 3236 39752 69319 53374 -5487 -58631 -78818 -73345 -57049 -10849 14649 -19257 -60745
16971f0745l3403j2394K3068J4982J2393k0669k8071n9507O259M3910r677j1945
$$ -60745 -94148 -106542 -83474 -68492 -56099 -76768 -104839 -164346 -158087 -114177 -123854 -135799
16959a35799m345M0834R098K8447M61O631l3003l8769j7273m33l9089K193j1548
$$ -135799 -140144 -99310 -90212 -61765 -61304 -54673 -87676 -126445 -143718 -144151 -183240 -181047 -192595
16946a92595o012O7908L8804J8790L0794K2311J3023j2863n1082k7610K2611P775
$$ -192595 -198607 -130699 -91895 -73105 -42311 -20000 -6977 -19840 -70922 -98532 -75921 -68146
16934f8146k5670l6711R809p473L5184r190o1766n782M4104P7276m638j0657J2736
$$ -68146 -93816 -130527 -120718 -128191 -93007 -102197 -163963 -169745 -125641 -48365 -53003 -63660 -50924
16921e0924j6901m039j5142K7635j7106k2554k446J9201L174j3035o177K3929
$$ -50924 -67825 -71864 -87006 -59371 -76477 -99031 -101477 -82276 -79102 -92137 -98314 -74385
16909g4385L7277l4644r921o3123l9258N8795N4777J5778K4192n822m3944M3431
$$ -74385 -37108 -71752 -81673 -144796 -184054 -125259 -70482 -54704 -30512 -36334 -80278 -36847
16897c6847l2240q891M4146M0560k942r462j2111j8222l7051J9060N0272J1104
$$ -36847 -69087 -77978 -33832 6728 3786 -5676 -17787 -36009 -73060 -54000 -3728 7376
16885G376k7947k1418R919m773p634j9978k5600k7059K9041P6314J2843j6828
$$ 7376 -20571 -41989 -32070 -36843 -44477 -64455 -90055 -117114 -88073 -11759 1084 -15744
16873a5744m9811l2111M08O1690L0488n6566m3218n763J6708N2369k4849o5839
$$ -15744 -65555 -97666 -97258 -35568 -5080 -61646 -104864 -110627 -93919 -41550 -66399 -132238
16861a32238O3213O016n5719J8464J8298L6836m1641l508j6841J3257k6654N266
$$ -132238 -69025 -63009 -118728 -100264 -81966 -45130 -86771 -90279 -107120 -93863 -120517 -115251
16849a15251J446K128J6943R110J120M6996M773k3527q659j3067k6770l4175L427
$$ -115251 -113805 -111677 -94734 -85624 -84504 -37508 -32735 -56262 -64921 -77988 -104758 -138933 -135506
16836a35506r360J1309M3369L5319p728o1338m3923j1471L2048K9519K7012k4324
$$ -135506 -144866 -133557 -90188 -54869 -62597 -123935 -167858 -179329 -147281 -117762 -90750 -115074
16824a15074n5202j3456K4050M9831M6674K0827L8354m2335p5911R64R2348r891
$$ -115074 -170276 -183732 -159682 -109851 -63177 -42350 -3996 -46331 -122242 -121278 -28930 -38821
16812c8821k9383K1636J529m6837J6447K0513J6345L6028P6837M1992j10294n1804
$$ -38821 -68204 -46568 -45039 -91876 -75429 -54916 -38571 -2543 74294 116286 5992 -45812
16800d5812j9804m871K942O198l2327J2866O0817K7489K0418l4702k9858o7821
$$ -45812 -65616 -70487 -67545 -61347 -93674 -80808 -19991 7498 27916 -6786 -36644 -104465
16788a04465m0041k4866K3441O4435P2243l434J3975M3356k6010q3515l2655m4829
$$ -104465 -144506 -169372 -145931 -81496 -9253 -12687 1288 44644 18634 -64881 -97536 -142365
16776a42365j8980Q222M2269k3027M6752K3499n0751o6081J4518J7337M7237K3085
$$ -142365 -161345 -153123 -110854 -133881 -87129 -63630 -114381 -180462 -165944 -148607 -101370 -78285
16764g8285k4849J455K7180o179M784k6437p4719p0778O1408Q5006O5423Q756
$$ -78285 -103134 -101679 -74499 -80678 -75894 -102331 -177050 -247828 -186420 -101414 -35991 -27235
16752b7235l0833r076k5086j7226l2662l4371p05J8152P7622O057j5073K4793
$$ -27235 -58068 -67144 -92230 -109456 -142118 -176489 -177194 -159042 -81420 -75363 -90436 -65643
16740f5643Q762Q874l6259o937k6055l4201K6401R628j9621J6023L9644J6585
$$ -65643 -56881 -48007 -84266 -91203 -117258 -151459 -125058 -115430 -135051 -119028 -79384 -62799
16728f2799j0645l900j2673J8968J9541J9881j7435m3678k1142k1714j7838M4016
$$ -62799 -73444 -77344 -90017 -71049 -51508 -31627 -49062 -92740 -113882 -135596 -153434 -109418
16716a09418J2129k5822K2909Q0451J2201o11j6514O362M2832q59m2049n440J0538
$$ -109418 -97289 -123111 -100202 -19751 -7550 -8161 -24675 -18313 24519 23660 -18389 -23829 -13291
16703a3291l8539m1156k7540K7228N5334j2195J5574K0677m1867l7293o987l5310
$$ -13291 -51830 -92986 -120526 -93298 -37964 -50159 -34585 -13908 -55775 -93068 -100055 -135365
16691a35365L9358j566q9910k3866N8783J5378N0361N0864o604l2196K7877K0424
$$ -135365 -96007 -97573 -187483 -211349 -152566 -137188 -86827 -35963 -42567 -74763 -46886 -26462
16679b6462m2448l0819J0493O1695L2117l589L2440M43p6492n4007o48P0308O830
$$ -26462 -68910 -99729 -89236 -27541 4576 987 33427 33870 -42622 -96629 -97277 -26969 -20139
16666b0139o4100M4748N5373j1516l7108m7078K132j605k8083j9737O3395L9792
$$ -20139 -84239 -39491 15882 4366 -32742 -79820 -77688 -79293 -107376 -127113 -63718 -23926
16654b3926l1161j6048O6064J062q070L7675j2149p7237j0226J6834p973L1083
$$ -23926 -55087 -71135 -5071 -4009 -12079 25596 13447 -63790 -74016 -57182 -65155 -34072
16642c4072j4056J4632L2302J6072l552m0112k3949k0580l5042k3319N9094L9574
$$ -34072 -48128 -33496 -1194 14878 11326 -28786 -52735 -73315 -108357 -131676 -72582 -33008
16630c3008M8646M650J121k3172o7556l0600N560K4804M2125K9794m8437j2082
$$ -33008 15638 20288 21409 -1763 -69319 -99919 -94359 -69555 -27430 2364 -46073 -58155
16618e8155j6408m790J9252l0813k4099K7101Q092L8139J3642j0795m46m0687
$$ -58155 -74563 -79353 -60101 -90914 -115013 -87912 -79820 -41681 -28039 -38834 -39280 -79967
16606g9967J9963N2122J8692n2016k901r93o1148l5195K0177J4328O8668L1167
$$ -79967 -60004 -7882 10810 -41206 -44107 -45100 -106248 -141443 -121266 -106938 -38270 -7103
16594g103n1906l236n949l0777j602N3144J4713J5661j4594M3026k6558p6384
$$ -7103 -59009 -62245 -68194 -98971 -100573 -47429 -32716 -17055 -31649 11377 -15181 -91565
16582i1565k7685l0469j6394O765N2605K963K7982L9758j1548j2481n1986J6896
$$ -91565 -119250 -149719 -166113 -159348 -106743 -103780 -75798 -36040 -47588 -60069 -112055 -95159
16570i5159M616j0069N785O2698N1779Q846l7201k2501K5946r337n5923l2731
$$ -95159 -90543 -100612 -94827 -32129 19650 28496 -8705 -31206 -5260 -14597 -70520 -103251
16558a03251r126k0702K3721P155J3598J7605M032J8170j726O3852J7993j7838
$$ -103251 -112377 -133079 -109358 -102203 -88605 -71000 -66968 -48798 -50524 13328 31321 13483
16546A3483l5110n3020M518P176l5028j0819R919J7384M5741N5254j9388k7525
$$ 13483 -21627 -74647 -70129 -62953 -97981 -108800 -98881 -81497 -35756 19498 110 -27415
16534b7415l5722j3059K6545l7085m6348k4440N8666M4132J3581r7606o951L8119
$$ -27415 -63137 -76196 -49651 -86736 -133084 -157524 -98858 -54726 -41145 -138751 -145702 -107583
16522a07583l476M5392N7922l378J5676k3408k2645L5704J6169k5050l3409k5634
$$ -107583 -111059 -65667 -7745 -11123 4553 -18855 -41500 -5796 10373 -14677 -48086 -73720
16510g3720o8033l3121J8930M7334O1389O5623K0270k6092J4417m7066j6370J0585
$$ -73720 -141753 -174874 -155944 -108610 -47221 18402 38672 12580 26997 -20069 -36439 -25854
16498b5854l0920k5542M8361k5840O989L8979K499L5830J725j9835N076q2347
$$ -25854 -56774 -82316 -33955 -59795 -52806 -13827 -11328 24502 26227 6392 11468 -70879
16486g0879m1238o2431J2258J7993L6410K6275J216M000l5493N179l3917l0361
$$ -70879 -112117 -174548 -162290 -144297 -107887 -81612 -80396 -76396 -111889 -106710 -140627 -170988
16474a70988O0050N5789J1303k8351Q9108N3908k7247r1739o4271m0019Q309J3241
$$ -170988 -110938 -55149 -43846 -72197 16911 70819 43572 -48167 -112438 -152457 -144148 -130907
16462a30907O0450L9308j6346m9959j1783N019K5228L9745L4532l0821k2506l1290
$$ -130907 -70457 -31149 -47495 -97454 -109237 -104218 -78990 -39245 -4713 -35534 -58040 -89330
16450h9330L3046j7607L0384K8114l3152o518p758m8582l6426k1419o61L6954
$$ -89330 -56284 -73891 -43507 -15393 -48545 -55063 -62821 -111403 -147829 -169248 -169909 -132955
16438a32955J3882k5728m4991L0615N4681N8048J6178O797O217l1471J314k1655
$$ -132955 -119073 -144801 -189792 -159177 -104496 -46448 -30270 -23473 -17256 -48727 -47413 -69068
16426f9068n009K3819r377J189J6705N0009L6445m2703l6610l4709N1369j7181
$$ -69068 -74077 -50258 -59635 -58446 -41741 8268 44713 2010 -34600 -69309 -17940 -35121
16414c5121L6677N9215m2245O414l6520l7233n479m5461K1283O0751j79k2576
$$ -35121 1556 60771 18526 24940 -11580 -48813 -54292 -99753 -78470 -17719 -17898 -40474
16402d0474m1127J6514k3299k7249M4095K2559j2233o353J2390M2361K8330m986
$$ -40474 -81601 -65087 -88386 -115635 -71540 -48981 -61214 -67567 -55177 -12816 15514 10528
16390A0528j3720m5028j0819j807l1907m5088L6819L300L9465j4105l6464j2811
$$ 10528 -3192 -48220 -59039 -60846 -92753 -137841 -101022 -97722 -58257 -72362 -108826 -121637
16378a21637P607O710n2211K4125N9010P478k3023K2496k5135j8968J2021M4874
$$ -121637 -114030 -107320 -159531 -135406 -76396 -68918 -91941 -69445 -94580 -113548 -101527 -56653
16366e6653M6000L7092k5552k7007k902m5933Q470M1892j2605j3272K0768L842
$$ -56653 -10653 26439 887 -26120 -29022 -74955 -66485 -24593 -37198 -50470 -29702 -25860
16354b5860k0357M8373j754l9662k1033J586k8314j9819R660J2490O0375j5525
$$ -25860 -46217 2156 402 -39260 -60293 -58707 -87021 -106840 -97180 -84690 -24315 -39840
16342c9840p0816J386j4519K33O8692n199m1632K5821J2019M335K3236J0650m5435
$$ -39840 -110656 -109270 -123789 -123556 -54864 -60063 -101695 -75874 -63855 -59520 -36284 -25634 -71069
16329g1069R794j2591l6013j3218L626n795K6520N0251M6585l2723k6130j9685
$$ -71069 -61275 -73866 -109879 -123097 -119471 -125266 -98746 -48495 -1910 -34633 -60763 -80448
16317h0448j7519l0344j0617M3511l047L6899R120o9836m3771K1792N1799M7591
$$ -80448 -97967 -128311 -138928 -95417 -98464 -61565 -52445 -122281 -166052 -144260 -92461 -44870
16305d4870m781N5923n5164q883N2028l68L4611j3709j959l0585K5228P8709j0578
$$ -44870 -49651 6272 -48892 -57775 -5747 -6115 28496 14787 12828 -17757 7471 86180 75602
16292G5602p9927k7600j4493R906K6160K560k2138p932J3672J9619N6569N7606
$$ 75602 -4325 -31925 -46418 -36512 -10352 -7792 -29930 -37862 -24190 -4571 51998 109604
16280A09604o5497j9347P2553m3339j17888k1043m2351j8850J3386k3182L6229
$$ 109604 44107 24760 97313 53974 -63914 -84957 -127308 -146158 -132772 -155954 -119725
16269a19725K6551K1162m605p3856J1807q71k1989M0395M6486j7647p0020N0346
$$ -119725 -93174 -72012 -76617 -150473 -138666 -139537 -161526 -121131 -74645 -92292 -162312 -111966
16257a11966K5848K1387J6343J1217j2714k6211k5501n5670J0774N0659P1611
$$ -111966 -86118 -64731 -48388 -37171 -49885 -76096 -101597 -157267 -146493 -95834 -24223
16246b4223l2452l0890l4546N757K6692n463k5082k1148M2081Q7782K5362r501
$$ -24223 -56675 -87565 -122111 -116354 -89662 -95125 -120207 -141355 -99274 -11492 13870 4369
16234D369j5399l2708l0622j4064k95j1914M9392Q14N630J5586K0395j185k7318
$$ 4369 -11030 -43738 -74360 -88424 -88719 -100633 -51241 -50427 -44797 -29211 -8816 -10001 -37319
16221c7319l2497j225j370m4243K4093L1819J1587J4448k6219p998K5733J9606
$$ -37319 -69816 -71041 -72411 -116654 -92561 -60742 -49155 -34707 -60926 -68924 -43191 -23585
16209b3585m2420l0510K9366K4039j5594O134M1954M5927j9989k5989M2979K3239
$$ -23585 -66005 -96515 -67149 -43110 -58704 -52570 -10616 35311 15322 -10667 32312 55551
16197E5551l1560o8321m2399K9920n170m2057J1644P901J6942K253j0703M0797
$$ 55551 23991 -44330 -86729 -56809 -61979 -104036 -92392 -84491 -67549 -65296 -75999 -35202
16185c5202N142m2829J6414m495k0274J9848L0937J9665M566k9562N6191O959
$$ -35202 -30060 -72889 -56475 -60970 -81244 -61396 -30459 -10794 -6228 -35790 20401 27360
16173B7360l0584l0498j9084l0719n0318o753N6849M7134K9896J2602K344O67
$$ 27360 -3224 -33722 -52806 -83525 -133843 -140596 -83747 -36613 -6717 5885 8229 8896
16161H896k6758p445J6138m63m6540j5894k8522Q336M2097N0586J6199L4022P306
$$ 8896 -17862 -25307 -9169 -9632 -56172 -72066 -100588 -92252 -50155 431 16630 50652 57958
16148E7958k3043M6494j421l6048o0764k7375K0296k9825N8175Q8542j1494p3335
$$ 57958 34915 81409 79988 43940 -16824 -44199 -23903 -53728 4447 92989 81495 8160
16136H160o1046M94L5710K4320P682J6237p362K2108J9166M3079n4482m5481m5277
$$ 8160 -52886 -52392 -16682 7638 15320 31557 24195 46303 65469 108548 54066 8585 -36692
16123c6692q62M9472O4447m8856R165J7785m1465m4606Q632j2546k6190J814l7232
$$ -36692 -37554 11918 76365 27509 36674 54459 12994 -31612 -22980 -35526 -61716 -59902 -97134
16110i7134n9405K500L8507J8294J3712k5036L1032j1936N7937M3205l4631l4163
$$ -97134 -156539 -154039 -115532 -97238 -83526 -108562 -77530 -89466 -31529 11676 -22955 -57118
16098e7118Q760q411M2243m3752J4090L9115l8112j9686O6577O982j8936p349
$$ -57118 -48358 -56769 -14526 -58278 -44188 -5073 -43185 -62871 3706 10688 -8248 -15597
16086a5597p0623n1981L4016L256L7444R516l7411j3630j9116K4295P267m9451
$$ -15597 -86220 -138201 -104185 -100929 -63485 -53969 -91380 -105010 -124126 -99831 -92564 -142015
16074a42015L0129K3090j4948l2341j7582k3910O5921M6236L0256n6185n4223
$$ -142015 -111886 -88796 -103744 -136085 -153667 -177577 -111656 -65420 -35164 -91349 -145572
16063a45572n9207l154O8552N8455L046n0079k8841m193J4399r645r932Q0728
$$ -145572 -204779 -207933 -139381 -80926 -77880 -127959 -156800 -160993 -146594 -156239 -166171 -85443
16051h5443J1269L4622k7347P249M8735l6602q864R701R29l0795l8017n52N3249
$$ -85443 -74174 -39552 -66899 -59650 -10915 -47517 -56381 -46680 -45751 -76546 -114563 -115115 -61866
16038f1866N2587L6445L5443l9618j6865r168m830J5374p63l7920j937N8975L761
$$ -61866 -9279 27166 62609 22991 6126 -3042 -7872 7502 6739 -31181 -33118 25857 29618
16025B9618m6809j2321j5113J3185k0134J2752M6015L8548o744k2786K3669L062
$$ 29618 -17191 -29512 -44625 -31440 -51574 -38822 7193 45741 38997 16211 39880 42942
16013D2942k7676l8713q866L150o3265l2003K4928j1639L261K6773k6128k2181
$$ 42942 15266 -23447 -32313 -29163 -92428 -124431 -99503 -111142 -107881 -81108 -107236 -129417
16001a29417l949L8087J8021l6727k0978J3661J7702k7853l073K1828M4022K8688
$$ -129417 -133366 -95279 -77258 -113985 -134963 -121302 -103600 -131453 -134526 -112698 -68676 -39988
15989c9988M7185n3347r312M9503O022k6158J067n4140n6270k8689L3165K7486
$$ -39988 7197 -46150 -55462 -5959 63 -26095 -25028 -79168 -135438 -164127 -130962 -103476
15977a03476n010K4895M7876K6269l0625L057M0451l302K8375j0435m2782l7251
$$ -103476 -108486 -83591 -35715 -9446 -40071 -37014 3437 135 28510 18075 -24707 -61958
15965f1958k5597M5997K0265j4475M1216m6215k0352J5754m5201R802J500K4022
$$ -61958 -87555 -41558 -21293 -35768 5448 -40767 -61119 -45365 -90566 -80764 -79264 -55242
15953e5242K2761j6073K454o327J2980R897K4654k7731k928N2213L633n9155k2852
$$ -55242 -32481 -48554 -46100 -52427 -39447 -29550 -4896 -32627 -35555 16658 20291 -38864 -61716
15940f1716j5508K9022M740K8326K2013M8241q959m5989m4423o1619k3165K3998
$$ -61716 -77224 -48202 -43462 -15136 6877 55118 46159 170 -44253 -105872 -129037 -105039
15928a05039L7588o262K7539K3372J4548q934m4129q90K2506Q779m1816l3493
$$ -105039 -67451 -73713 -46174 -22802 -8254 -17188 -61317 -62207 -39701 -30922 -72738 -106231
15916a06231J6097n922l388K2589j3496R973l9221L4456K2247M4456N6559n0820
$$ -106231 -90134 -96056 -99444 -76855 -90351 -80378 -119599 -85143 -62896 -18440 38119 -12701
15904a2701Q865K3526n085k0258o28O0411Q542p6307j3393R937j8101M0062k8256
$$ -12701 -3836 19690 14605 -5653 -6281 54130 62672 -13635 -27028 -17091 -35192 4870 -23386
15891b3386p9099r036J5713l028m4846J922M8022K5123N0345L8032j5972l0535
$$ -23386 -102485 -111521 -95808 -98836 -143682 -141760 -93738 -68615 -18270 19762 3790 -26745
15879b6745k9523M0762L4795k3031k0207J9907k3090l2256r021k482k5249M0868
$$ -26745 -56268 -15506 19289 -3742 -23949 -4042 -27132 -59388 -68409 -70891 -96140 -55272
15867e5272j31l5816r005K115Q994K0065O233n3443J9232L3904m663m2392o402
$$ -55272 -55403 -91219 -100224 -98109 -89115 -69050 -62817 -116260 -97028 -63124 -67787 -110179 -116581
15854a16581O1056O4946O050m3810o1648P187M3219K6365J4450r25l1847N418
$$ -116581 -55525 9421 15471 -28339 -89987 -82800 -39581 -13216 1234 309 -31538 -26120
15842b6120K6852L8825M6792k7283l0447L1011M027l6186K0177j1559l9504j2285
$$ -26120 732 39557 86349 59066 28619 59630 63657 27471 47648 36089 -3415 -15700
15830a5700K4691j2856k1295J0874R625J1253J4133j4104l7833j2660k8188M311
$$ -15700 8991 -3865 -25160 -14286 -4661 6592 20725 6621 -31212 -43872 -72060 -67749
15818f7749P157l704J7597j9359k7604O0264J1671J6465Q0354j666o2814m6743
$$ -67749 -60592 -64296 -46699 -66058 -93662 -33398 -21727 -5262 75092 73426 10612 -36131
15806c6131p025m7970p0380M8389R6395L4084o0440P680m3061Q396j298O5026
$$ -36131 -43156 -91126 -161506 -113117 -16722 17362 -43078 -35398 -78459 -70063 -71361 -6335
15794f335M3183n8829o4825r694J7441L7245M9606J3068P157K444L480J4772l6200
$$ -6335 36848 -21981 -86806 -96500 -79059 -41814 7792 20860 28017 30461 33941 48713 12513
15781A2513o4441n012K3737j1980k3573j3802O9835j946k6417k8063j906K00R206
$$ 12513 -51928 -56940 -33203 -45183 -68756 -82558 -12723 -14669 -41086 -69149 -71055 -70855 -61649
15768f1649L0799l553J0221o4986m1048M39K2130M4492J2082K4941K186M435K6919
$$ -61649 -30850 -34403 -24182 -89168 -130216 -129777 -107647 -63155 -51073 -26132 -23946 -19511 7408
15755G408j1930q0379K7007J7244q963K8037N228o9614L5236O7596K838j7632
$$ 7408 -4522 -84901 -57894 -40650 -49613 -21576 -16348 -85962 -50726 16870 19708 2076
15743B076o1537q281N529k0264O1768J6869K2715K7865j5892n2335r587q781l7304
$$ 2076 -59461 -67742 -62213 -82477 -20709 -3840 18875 46740 30848 -21487 -31074 -39855 -77159
15730g7159r289J7132L8547J4823K2682J5008j3787k6625J1888Q743n4184j3064
$$ -77159 -86448 -69316 -30769 -15946 6736 21744 7957 -18668 -6780 1963 -52221 -65285
15718f5285K5390P0633L9352o0085o1935l6688L0470J6168L829p266j8367l5706
$$ -65285 -39895 30738 70090 10005 -51930 -88618 -58148 -41980 -38151 -45417 -63784 -99490
15706i9490L2732O8399M6809k1663l7210J260K890k5544o786j631J0144J7884
$$ -99490 -66758 1641 48450 26787 -10423 -9163 -6273 -31817 -38603 -40234 -30090 -12206
15694a2206J4946J4011p8721K636L3446k0280K3224n117k3874j2028j2536L8336
$$ -12206 2740 16751 -61970 -59334 -25888 -46168 -22944 -28061 -51935 -63963 -76499 -38163
15682c8163J2802o767q934l3343j10449L3102P2361j7052K0254M2944K1614K6562
$$ -38163 -25361 -32128 -41062 -74405 -184854 -151752 -79391 -96443 -76189 -33245 -11631 14931
15670A4931M812m5960q785l463K5255N165l7663j0311J4362J5643m083M8347j2769
$$ 14931 19743 -26217 -35002 -38465 -13210 -8045 -45708 -56019 -41657 -26014 -30097 18250 5481
15657E481m9257O370k9760r069L7014J5937k7168J870J1224n429n8149N271J2295
$$ 5481 -43776 -37406 -67166 -76235 -39221 -23284 -50452 -48582 -37358 -42787 -100936 -95665 -83370
15644h3370L1370k2829m0018j810M4675Q3638k3333k8982L7467K6745j7022l9026
$$ -83370 -52000 -74829 -114847 -116657 -71982 11656 -11677 -40659 -3192 23553 6531 -32495
15632c2495k8260L3517K214l9727j0793j8771L13J0452P796N0799L2600j2373
$$ -32495 -60755 -27238 -25024 -64751 -75544 -94315 -94002 -83550 -75754 -24955 7645 -4728
15620d728l4568o3462K3548L2730n4156l4047J4240M6140N7995j5571j8124O671
$$ -4728 -39296 -102758 -79210 -46480 -100636 -134683 -120443 -74303 -16308 -31879 -50003 -43332
15608d3332L2213j8477k6773L9394k1712j5170j0455O6357M4853l7498k9529M723
$$ -43332 -11119 -29596 -56369 -16975 -38687 -53857 -64312 2045 46898 9400 -20129 -15406
15596a5406l2325j7740j013R702K5547J8933j0541k962j650M836o576m583o964
$$ -15406 -47731 -65471 -66484 -56782 -31235 -12302 -22843 -25805 -27455 -22619 -29195 -33778 -40742
15583d0742k8814l3613L3396Q579K7409K9629m758J245J5953j7707k7902n4271
$$ -40742 -69556 -103169 -69773 -61194 -33785 -4156 -8914 -7669 8284 -9423 -37325 -91596
15571i1596P193r520J3428K8907K3446L4018R337n9581k0217n2924Q3689j8242
$$ -91596 -84403 -93923 -80495 -51588 -28142 5876 15213 -44368 -64585 -117509 -33820 -52062
15559e2062L0446K0374p6338n432L7983N6352j4049m9867K5851k9679J6299L1400
$$ -52062 -21616 -1242 -77580 -83012 -45029 11323 -2726 -52593 -26742 -56421 -40122 -8722
15547h722L787Q692j1096J5273N325J4785j3686o2332L85n950m445l3891K6292
$$ -8722 -4935 3757 -7339 7934 13259 28044 14358 -47974 -47589 -53539 -57984 -91875 -65583
15534f5583k8980r777M5417j9555n3743L0326N5045j1906j4733J1718M4780J6436
$$ -65583 -94563 -104340 -58923 -78478 -132221 -101895 -46850 -58756 -73489 -61771 -16991 -555
15522e55k0350j3862K3159r648l3780j9379l1584m189R929P5934Q1730k2602k494
$$ -555 -20905 -34767 -11608 -21256 -55036 -74415 -105999 -110188 -100259 -24325 57405 34803 32309
15509C2309m5357j125k3732m5866L2101J6200J2968J321k5225M3802N1223l2933
$$ 32309 -13048 -14173 -37905 -83771 -51670 -35470 -22502 -21181 -46406 -2604 48619 15686
15497A5686k9448J7902m8925j2429o137k6437j360N2498j1759j813K1792J0139
$$ 15686 -13762 4140 -44785 -57214 -63351 -89788 -91148 -38650 -50409 -52222 -30430 -20291
15485b0291J06531j9172k2831k0398o4692o4651K2330J7564P4383J7317j5428
$$ -20291 86240 67068 44237 23839 -40853 -105504 -83174 -65610 8773 26090 10662
15474A0662j0363k8347K6276J079q543l7899k9511M1651K7642Q455L7231K5765
$$ 10662 299 -28048 -1772 -693 -9236 -47135 -76646 -34995 -7353 1102 38333 64098
15462F4098o2101k8718j8934J9437m0413n983k6975J879O2269K8687k0949l2371
$$ 64098 1997 -26721 -45655 -26218 -66631 -72614 -99589 -97710 -35441 -6754 -27703 -60074
15450f0074L0145K7250J3909k7093M7870l8913l6606J0404J2227J6833J2051m7674
$$ -60074 -29929 -2679 11230 -15863 32007 -6906 -43512 -33108 -20881 -4048 8003 -39671
15438c9671j1755L8448J422n0030m7202Q402N911K2775q426L4104o048J5429R096
$$ -39671 -51426 -12978 -11556 -61586 -108788 -100386 -94475 -71700 -80126 -46022 -52070 -36641 -27545
15425b7545l2374J6717M195n6537J7290N567J3861P3919J9664j9089j9782L4486
$$ -27545 -59919 -43202 -39007 -95544 -78254 -72687 -58826 15093 34757 15668 -4114 30372
15413C0372j7293q2930l8468J3407N9122O8745k7175j9404K1182J9616K0568l3782
$$ 30372 13079 -69851 -108319 -94912 -35790 32955 5780 -13624 7558 27174 47742 13960
15401A3960L459j7655K1191K8573K6390J6044k2892j4558l0610o690k2987r0949
$$ 13960 17419 -236 20955 49528 75918 91962 69070 54512 23902 17212 -5775 -96724
15389i6724K213N0427M3426O845k1935K8676J1390l2530j5026n9533k6644L5648
$$ -96724 -94511 -44084 -658 6187 -15748 12928 24318 -8212 -23238 -82771 -109415 -73767
15377g3767J3603L2923j3164j0520M152R566m5324j9905N2488J2234Q468Q4912
$$ -73767 -60164 -27241 -40405 -50925 -46773 -37207 -82531 -102436 -49948 -37714 -29246 55666
15365E5666M4453q3015l4420K8252k7052K23J1096J4564n5621J3406K7989P3383
$$ 55666 100119 17104 -17316 10936 -16116 -15893 -4797 9767 -45854 -32448 -4459 68924
15353F8924J3369p7833n6505n695O2024l7732J8099m0964M4628L3060R724L9709
$$ 68924 82293 4460 -52045 -57740 4284 -33448 -15349 -56313 -11685 21375 31099 70808
15341G0808n6347m4772j1995l9910k5804J1434L1387N9069j765L936L676k0740
$$ 70808 14461 -30311 -42306 -82216 -108020 -96586 -65199 -6130 -7895 -3959 -283 -21023
15329b1023p6822J9695O6140j0102j5980K7543l575o263j9755o0323j726N1201
$$ -21023 -97845 -78150 -12010 -22112 -38092 -10549 -14124 -20387 -40142 -100465 -102191 -50990
15317e0990J0311J4723M9370K9850j2046J0752m2105K2137L0186m3604p4566k9849
$$ -50990 -40679 -25956 23414 53264 41218 51970 9865 32002 62188 18584 -55982 -85831
15305h5831J8783m1650k940L128K934M0873M1044L8290M8241o7130o1811L5206
$$ -85831 -67048 -108698 -111638 -108510 -105576 -64703 -23659 14631 62872 -4258 -66069 -30863
15293c0863L6393k1951k6106L2009J9490j7948R320k6249m1073J3804N0418j39
$$ -30863 5530 -16421 -42527 -10518 8972 -8976 344 -25905 -66978 -53174 -2756 -2895
15281b895K0641J4666J1354n17P151k0561l3247j389K4155Q3118O3586l4634k8694
$$ -2895 17746 32412 43766 43249 50400 29839 -3408 -4797 19358 102476 166062 131428 102734
15268A02734q2248n5223j7957K495P907m1458l3402L2327M156n311k5411L776
$$ 102734 20486 -34737 -52694 -50199 -42292 -83750 -117152 -84825 -80669 -85980 -111391 -107615
15256a07615K6987P669O479J0242j9180R804K2453n3714m5373K0632P5128O5694
$$ -107615 -80628 -72959 -66480 -56238 -75418 -65614 -43161 -96875 -142248 -121616 -46488 19206
15244A9206j7240m8765m2691J9927R3967J00706m696p3940l6220O28O685J4833
$$ 19206 1966 -46799 -89490 -69563 24404 125110 120414 46474 10254 10882 17567 32400
15232C2400k0121m3794q364K0449m7575L5210P1588l2582m2273l3736K6329n593
$$ 32400 12279 -31515 -39879 -19430 -67005 -31795 39793 7211 -35062 -68798 -42469 -48062
15220d8062K077k0252l9958L1166L9392m5561r244j6414M740P2639K7776q7001
$$ -48062 -45985 -66237 -106195 -75029 -35637 -81198 -90442 -106856 -102116 -29477 -1701 -88702
15208h8702r2185L1840P9373J4847O2092M0311l7781l7515K2834N5243k6491n4081
$$ -88702 -180887 -149047 -69674 -54827 7265 47576 9795 -27720 -4886 50357 23866 -30215
15196c0215k722Q936k3430J5567J6113L4313l389l7473J205M5230k4591j7700
$$ -30215 -32937 -24001 -47431 -31864 -15751 18562 15173 -22300 -21095 24135 -456 -18156
15184a8156K9969j8717m2359K1632N9650n8497l6280J192N6480K5100k7515k8571
$$ -18156 11813 -6904 -49263 -27631 32019 -26478 -62758 -61566 -5086 20014 -7501 -36072
15172c6072K4014j189K4178O878P687M2622j9782m8746m9984j0491j3845J0936
$$ -36072 -12058 -13247 10931 17809 25496 68118 48336 -410 -50394 -60885 -74730 -63794
15160f3794k7262J5356M018P3258j4974M1815K6432q633M931O6188k5141q744
$$ -63794 -91056 -75700 -71682 1576 -13398 28417 54849 46216 51147 117335 92194 83450
15148H3450k5953O241J3283n5161p0616k420J939m8372L4978p927K1890L8242
$$ 83450 57497 63738 77021 21860 -48756 -51176 -49237 -97609 -62631 -70558 -48668 -10426
15136a0426j5153Q473M5450k502l2936n160J3870j714j7895m2550J6783k6883
$$ -10426 -25579 -17106 28344 25842 -7094 -12254 1616 -98 -17993 -60543 -43760 -70643
15124g0643l017p929K3108N1636P7451M7533r522o7579j1022M8774n182l2811
$$ -70643 -73660 -81589 -58481 -6845 70606 118139 108617 41038 30016 78790 73608 40797
15112D0797j6529m9072M2570M459m4267k7359k1119L5088M1003J0132l648o157
$$ 40797 24268 -24804 17766 22225 -22042 -49401 -70520 -35432 5571 15703 12055 5898
15100E898M949K6419N359J2876J3915k6619j6106k8655j2291J0340P091j6486
$$ 5898 10847 37266 42625 55501 69416 42797 26691 -1964 -14255 -3915 3176 -13310
15088a3310L4803l0345k4479k1061K7645L3396j3813l6887j25607M6668N4501
$$ -13310 21493 -8852 -33331 -54392 -26747 6649 -7164 -44051 -169658 -122990 -68489
15077f8489l6813O1977L0107k6167K0721K724m1203l9662L0786R2692l4746k9272
$$ -68489 -105302 -43325 -13218 -39385 -18664 -15940 -57143 -96805 -66019 26673 -8073 -37345
15065c7345M197k002l0460m9341j6568J8021K7738J5272L5015K0074q90j4793
$$ -37345 -33148 -35150 -65610 -114951 -131519 -113498 -85760 -70488 -35473 -15399 -16289 -31082
15053c1082k7326k9483J6342K0175J3467k0051p528N0437M672p1639J8777L0487
$$ -31082 -58408 -87891 -71549 -51374 -37907 -57958 -65486 -15049 -10377 -82016 -63239 -32752
15041c2752J2500j1843l6706P5468P3224k6091R354j1411o422K3563k6853j9951
$$ -32752 -20252 -32095 -68801 6667 79891 53800 63154 51743 45321 68884 42031 22080
15029B2080j2767o9246N540o644M0718R023L2640m359l8749k798K2008j424q704
$$ 22080 9313 -59933 -54393 -61037 -20319 -11296 21344 16985 -21764 -24562 -2554 -3978 -12682
15016a2682P64K503l005K2037j3515l7322L1009J2444J0112n669k3218n8965n7640
$$ -12682 -11918 -9415 -12420 9617 -3898 -41220 -10211 2233 12345 6676 -16542 -75507 -133147
15003a33147N5375Q8397J4143j7103j4392M7379K1414n8650k0041k3614M021P969
$$ -133147 -77772 10625 24768 7665 -6727 40652 62066 3416 -16625 -40239 -36218 -28249
14991b8249J4819J2683k344j9747o927J9531R650J6099l135J504q412L678k3808
$$ -28249 -13430 -747 -3091 -22838 -29765 -10234 -584 15515 12380 13884 5472 9150 -14658
14978a4658m0790l255N9946P60k2844q859l2569j3195k2188P822J096J8545k1795
$$ -14658 -55448 -58703 1243 2003 -20841 -29700 -62269 -75464 -97652 -89830 -88734 -70189 -91984
14965i1984l808K0094O2926j541j0877j1633K2579M8253l5664o9410Q559N0300
$$ -91984 -95792 -75698 -12772 -14313 -25190 -36823 -14244 34009 -1655 -71065 -62506 -12206
14953a2206J3511m0205j1858K9042J0259k0416k5360M6729L0421R285k7700N04
$$ -12206 1305 -38900 -50758 -21716 -11457 -31873 -57233 -10504 19917 29202 1502 2006
14941B006Q55j8233l0440k0448j9479k4142j172K8036M8533O066m0687m5806L6004
$$ 2006 2861 -15372 -45812 -66260 -85739 -109881 -111053 -83017 -34484 -28418 -69105 -114911 -78907
14928g8907J1897P880l0216O9575K3965J1762r202L368j985m393J1878J4533J2761
$$ -78907 -67010 -59130 -89346 -19771 4194 15956 6754 10122 8137 3744 15622 30155 42916
14915D2916l9747m5712o375K3630J3025j6235J2141K3867M3574n0669j3048m7718
$$ 42916 3169 -42543 -48918 -25288 -12263 -28498 -16357 7510 51084 415 -12633 -60351
14903f0351J0737K2161O5622N7833J5879l0307r5031K9431j1873j6424k8296k5885
$$ -60351 -49614 -27453 38169 96002 111881 81574 -13457 15974 4101 -12323 -40619 -66504
14891f6504k676M125J332K7430m64K2159n3422k4476J603J8043N0089L7855J6757
$$ -66504 -69180 -65055 -63723 -36293 -36757 -14598 -68020 -92496 -90893 -72850 -22761 15094 31851
14878C1851L3675L2631J4629p3420j2448K2837n2990j2049M605m2537p816K5783
$$ 31851 65526 98157 112786 39366 26918 49755 -3235 -15284 -10679 -53216 -61032 -35249
14866c5249J7458k9745l7971k7596J0826K2453J2683K9576K2905Q256o4224m0652
$$ -35249 -17791 -47536 -85507 -113103 -102277 -79824 -67141 -37565 -14660 -6404 -70628 -111280
14854a11280p754L716K9945l888L0050O1032M747l5988k6525k9082K5407P5928
$$ -111280 -119034 -115318 -85373 -89261 -59211 1821 6568 -29420 -55945 -85027 -59620 16308
14842A6308L1678j1J2248k1586m6732j857j8249K0882q894k5666N1478J3782k7339
$$ 16308 47986 47975 60223 38637 -8095 -9952 -28201 -7319 -16213 -41879 9599 23381 -3958
14829c958m3977q122k0215k3693P216N7642k3845J8232M6998K1654L9407l1731
$$ -3958 -47935 -56057 -76272 -99965 -92749 -35107 -58952 -40720 6278 27932 67339 35608
14817C5608r818L236m7669l1056o537p114N8405P896o774r259M858m127N106K511
$$ 35608 25790 29026 -18643 -49699 -56236 -63350 -4945 2951 -3823 -13082 -8224 -12351 -7245 -4734
14803d734J7205N9077K3367o1351o0362p356J4026O6992L3977j7768n3327k3336
$$ -4734 12471 71548 94915 33564 -26798 -34154 -20128 46864 80841 63073 9746 -13590
14791a3590j5358J7094L5513l355j8720J1051k8617L776k9265n1397r02N2321
$$ -13590 -28948 -11854 23659 20304 1584 12635 -15982 -12206 -41471 -92868 -93770 -41449
14779d1449L7106j690K2823l2658n4352k7077l6006M9930Q5026O130j0247J8133
$$ -41449 -4343 -6033 16790 -15868 -70220 -97297 -133303 -83373 1653 7783 -2464 15669
14767A5669j6890j9509L5123k947m605k0019k366K537O390q813q706j3127O4784
$$ 15669 -1221 -20730 14393 11446 6841 -13178 -15544 -13007 -6617 -15430 -24136 -37263 27521
14754B7521L096J6837k3126l5068O425k7184k2984K0040P630J6139K4733j1066
$$ 27521 30617 47454 24328 -10740 -4315 -31499 -54483 -34443 -26813 -10674 14059 2993
14742B993P632k839j15347j3557j505P8509O5801j9508l2273k4756K2606L0491
$$ 2993 10625 7786 -107561 -121118 -122623 -44114 21687 2179 -30094 -54850 -32244 -1753
14730a753K67j8031k4473M7357l2149r0325j1411O1612L5692m7423n0491P662
$$ -1753 -1486 -19517 -43990 3367 -28782 -119107 -130518 -68906 -33214 -80637 -131128 -123466
14718a23466J275o924O089K8837M3333j7577L4965L6210j995J0032N5002K6444
$$ -123466 -122191 -129115 -123026 -94189 -50856 -68433 -33468 2742 747 10779 65781 92225
14706I2225m3321j3184k1820m2344M3256N6930K7506m4124l0244p648J3377l6449
$$ 92225 48904 35720 13900 -28444 14812 71742 99248 55124 24880 17232 30609 -5840
14694e840o3303j1456L4058O3488O850K075J0158l0294J0834m409J1544j7531
$$ -5840 -69143 -80599 -46541 16947 23797 25872 36030 5736 16570 12161 23705 6174
14682F174L1117j7899m147O010M5529k2113M992q2085n8224J7562L9399L6138
$$ 6174 37291 19392 15245 21255 66784 44671 49663 -32422 -90646 -73084 -33685 2453
14670B453R756O926K0272K9519j7468k6334K1453j287k945j3446k1821o8418N320
$$ 2453 12209 19135 39407 68926 51458 25124 46577 45290 42345 28899 7078 -61340 -56020
14657e6020L0410M204m8548p0582k2697N6525O6738r717J1978L6533p60J2070
$$ -56020 -25610 -21406 -69954 -140536 -163233 -106708 -39970 -49687 -37709 -1176 -1936 10134
14645A0134N1988m0726l0431J255l4711J0509M4585k3696K1073l5561j094M6556
$$ 10134 62122 21396 -9035 -7780 -42491 -31982 12603 -11093 9980 -25581 -26675 19881
14633A9881O1645m0871o7631J2319k9762m6224q150L0494M9262j7698k75N9232
$$ 19881 81526 40655 -26976 -14657 -44419 -90643 -98793 -68299 -19037 -36735 -37010 22222
14621B2222M5078k8592j16565j9283J4258k5721N4411r594q940o68m7767P548
$$ 22222 67300 38708 -77857 -97140 -82882 -108603 -54192 -63786 -72726 -73394 -121161 -113613
14609a13613N4725j6603q478j1466N6079K4946j8716o2837k0108O8822K6644m8379
$$ -113613 -58888 -75491 -83969 -95435 -39356 -14410 -33126 -95963 -116071 -47249 -20605 -68984
14597f8984j1730N8368N1669k3754J7198j7536l9603q084l2517M397N591M9473
$$ -68984 -80714 -22346 29323 5569 22767 5231 -34372 -42456 -74973 -70576 -64985 -15512
14585a5512L697J927o699m5988k8977m992M1622P6054j4867p7885L455r33N9092
$$ -15512 -11815 -9888 -16587 -62575 -91552 -96544 -54922 21132 6265 -71620 -68165 -69098 -10006
14572a0006L874l5785L8864P7494m6497j6811l136L028R863J1621K5637M6374
$$ -10006 -6132 -41917 -3053 74441 27944 11133 7997 11025 20888 32509 58146 104520
14560A04520m2184l2199L1568j0408o0121N703J6972k9150j2O466K803j8057j6506
$$ 104520 62336 30137 61705 51297 -8824 -3121 13851 -15299 -15311 -8845 -6042 -24099 -40605
14547d0605Q298k2396L11k1269R769K7223m3890j3774P5651M7631P4368n3058
$$ -40605 -32307 -54703 -54392 -75661 -65892 -38669 -82559 -96333 -20682 26949 101317 48259
14535D8259k6365N2870J6887m9742r3551l34j4581K8633K5589n3162j7330K1053
$$ 48259 21894 74764 91651 41909 -51642 -51976 -66557 -37924 -12335 -65497 -82827 -61774
14523f1774Q2131L3321l4996o5455k1719N3095L7672N151J4975L525l5139n3910
$$ -61774 20357 53678 18682 -46773 -68492 -15397 22275 27426 42401 45926 10787 -43123
14511d3123j3056q119k4735j2979L7156P7264o100k3239N7898j0609O626k8899
$$ -43123 -56179 -64298 -89033 -102012 -64856 12408 6308 -16931 40967 30358 36984 8085
14499H085m8994J4781K1784M3598k7884k0294O788k0353L2168j8341p2819j1613
$$ 8085 -40909 -26128 -4344 39254 11370 -8924 -2136 -22489 9679 -8662 -81481 -93094
14487i3094P5983m0679K0862L0119j2299K5614J4884K8373o984n6242J7002K0576
$$ -93094 -17111 -57790 -36928 -6809 -19108 6506 21390 49763 42779 -13463 3539 24115
14475B4115M8397l2531o0917l0592J6369J5177m4024K3536L4164m0660J2628J461
$$ 24115 72512 39981 -20936 -51528 -35159 -19982 -64006 -40470 -6306 -46966 -34338 -32877
14463c2877j3621j8876m0101Q987O6632M4397P134k0865J430j7707j136O087K9883
$$ -32877 -46498 -65374 -105475 -96488 -29856 14541 21675 810 2240 -15467 -16603 -10516 19367
14450A9367M6224k259n7820K0762k0170n3488j3485P2484J4651K4965L3338o2508
$$ 19367 65591 63332 5512 26274 6104 -47384 -60869 11615 26266 51231 84569 22061
14438B2061L770Q690J2058m733j409J9902n84q29K041K4073K0446m7459k4431
$$ 22061 25831 34521 46579 41846 40437 60339 59755 58926 60967 85040 105486 58027 33596
14425C3596m1771k1760N9005J6793k845m2546o4383M867L0671l8541J7726O0926
$$ 33596 -8175 -29935 29070 45863 43018 472 -63911 -59044 -28373 -66914 -49188 11738
14413A1738K7464j6025m2654r532m365k5181L8787M6842J3180j6810N7112m4388
$$ 11738 39202 23177 -19477 -29009 -33374 -58555 -19768 27074 40254 23444 80556 36168
14401C6168j9332N3359L380r129J8446r870o4836m4715l8213L5234L9644j3908
$$ 36168 16836 70195 73575 64446 82892 73022 8186 -36529 -74742 -39508 136 -13772
14389a3772m7554o264k4726L9533K1990K2803j27N9192n6669l4630K7740P777
$$ -13772 -61326 -67590 -92316 -52783 -30793 -7990 -8117 51075 -5594 -40224 -12484 -4707
14377d707J3745J0258K3488p436j2199L252k3022k5323P8747N4774l6997m9312
$$ -4707 9038 19296 42784 35348 23149 26401 3379 -21944 56803 111577 74580 25268
14365B5268K709L2122N6188K2741r2195k5662k3639k9911j6063Q075M083M205
$$ 25268 27977 60099 116287 139028 46833 21171 -2468 -32379 -48442 -40367 -36284 -32079
14353c2079o8632j3408M599o558L0710K9830N3398L7836O452J4032k3851K1015
$$ -32079 -100711 -114119 -109520 -116078 -85368 -55538 -2140 35696 42148 56180 32329 53344
14341E3344M2356n2919j9902N3041M3451J2427r002j6938J9410L7316m0713j5325
$$ 53344 95700 42781 22879 75920 119371 131798 122796 105858 125268 162584 121871 106546
14329A06546m1952m2321n1823J8978M7006m2346j8025n0126K8849O5519L9638
$$ 106546 64594 22273 -29550 -10572 36434 -5912 -23937 -74063 -45214 20305 59943
14318E9943L6208K0498m0609p497j8549M6268j2383j6683R291j0264j8030j9387
$$ 59943 96151 116649 76040 68543 49994 96262 83879 67196 76487 66223 48193 28806
14306B8806j925M5910K1329j2621n1659k274J3285j2457k4802l6704j6157k7294
$$ 28806 26881 72791 94120 81499 29840 27566 40851 28394 3592 -33112 -49269 -76563
14294g6563J0359K2807L705j9433K3374K7405j1574m6371M91M473J6895L7766
$$ -76563 -66204 -43397 -39692 -59125 -35751 -8346 -19920 -66291 -65800 -61327 -44432 -6666
14282f666N0247j51l6169p76K3234K100K5422N451l3842n165J2041J8189L384
$$ -6666 43581 43430 7261 6485 29719 31819 57241 62692 28850 23685 35726 53915 57299
14269E7299j2873K1404j4858n8475o012L0447l3001J2703k969n7504j1427L3219
$$ 57299 44426 65830 50972 -7503 -13515 16932 -16069 -3366 -6335 -63839 -75266 -42047
14257d2047N5859k3580P7435Q4569J4869l8332l6629m2614k8901j7226J7304j9379
$$ -42047 13812 -9768 67667 152236 167105 128773 92144 49530 20629 3403 20707 1328
14245A328p124K3594j8449J5431J4829K1153Q299l356n1059j1481K1984J6237
$$ 1328 -5796 17798 -651 14780 29609 50762 59061 55705 4646 -6835 15149 31386
14233C1386L3919k7209j0731N444L3955Q078n2103l7050J7316K564k3609j9934
$$ 31386 65305 38096 27365 32809 66764 74842 22739 -14311 3005 5569 -18040 -37974
14221c7974j8117q528K0169l0210m8652L4679J6380N9836R1629J7993j1039o5848
$$ -37974 -56091 -64619 -44450 -74660 -123312 -88633 -72253 -12417 79212 97205 86166 20318
14209B0318m9503o035K2438J1209j9721m2009Q590l2876L273M5284K5123l6730
$$ 20318 -29185 -35220 -12782 -1573 -21294 -63303 -54713 -87589 -84316 -39032 -13909 -50639
14197e0639J5796j4835k0291l9076J4141M7809l1154m5709J8846R215N3669K8012
$$ -50639 -34843 -49678 -69969 -109045 -94904 -47095 -78249 -123958 -105112 -95897 -42228 -14216
14185a4216n6769J3302M952N085M7200P7817m887l1334Q189J9623j8041m6716
$$ -14216 -70985 -57683 -52731 -47646 -446 77371 72484 41150 49339 68962 50921 4205
14173D205m4175P871J1495K9034K3363K764k1210K5938L1291L459m1690j1494
$$ 4205 -39970 -32099 -20604 8430 31793 34557 13347 39285 70576 74035 32345 20851
14161B0851p5730L3830K8442l7715r361j913K8552M0974N4827l671k9174m7395
$$ 20851 -54879 -21049 7393 -30322 -39683 -41596 -13044 27930 82757 79086 49912 2517
14149B517k7628M2755N4028M6109j7552o8626n0961K5364R195M4736Q757M367
$$ 2517 -25111 17644 71672 117781 100229 31603 -19358 6006 15201 59937 68694 73061
14137G3061l762J9598p873J3140k3869l6605k5514N5229Q341l5774M8581r682
$$ 73061 69299 88897 81024 94164 70295 33690 8176 63405 71746 35972 84553 74871
14125G4871j7038l3039o0108l2980J4754J926k4146m615N9419M0761m2670m8646
$$ 74871 57833 24794 -35314 -68294 -53540 -51614 -75760 -80375 -20956 19805 -22865 -71511
14113g1511M5978N8103R525l5754k3919j7275j9695M0784j0898k1193l7307N5308
$$ -71511 -25533 32570 42095 6341 -17578 -34853 -54548 -13764 -24662 -45855 -83162 -27854
14101b7854O3985l4691o8752L9480M8310j8717K0741N245o0274J478M4930l3332
$$ -27854 36131 1440 -67312 -27832 20478 1761 22502 27747 -32527 -31049 13881 -19451
14089a9451J261j8152m2844o926Q084L6265N0853M6052m965j0620l284k2872M7116
$$ -19451 -18190 -36342 -79186 -86112 -78028 -41763 9090 55142 50177 39557 36273 13401 60517
14076F0517o67l8232m0098k2122L5883R188n4337P532L6195M8182L0306q3902
$$ 60517 59850 21618 -18480 -40602 -4719 4469 -49868 -42336 -6141 42041 72347 -11555
14064a1555l0921n661K5039M2031O1105L8468k2492q8432k9754J9159q669j5452
$$ -11555 -42476 -48137 -23098 18933 80038 118506 96014 7582 -22172 -3013 -11682 -27134
14052b7134l801K818n437k5132J7412N8459j0603l3407o2598P42N1500l0497l7261
$$ -27134 -30935 -28117 -33554 -58686 -41274 17185 6582 -26825 -89423 -88681 -37181 -67678 -104939
14039a04939K7314N0835l6090J5175M5619L1573m80l9053l2752m4261J040J8207
$$ -104939 -77625 -26790 -62880 -47705 -2086 29487 29007 -10046 -42798 -87059 -86019 -67812
14027f7812P1799k3633l4950K0776M0356N5145O427j4510J538l9276k4272L504
$$ -67812 3987 -19646 -54596 -33820 6536 61681 68108 53598 55136 15860 -8412 -4908
14015d908J3082n7449n336K3588J3728J0501J119J9967R330n7323J6169n289n190
$$ -4908 8174 -49275 -54611 -31023 -17295 -6794 -5675 14292 23622 -33701 -17532 -22821 -28011
14002b8011K6543L215J7470l1394Q628K2561k2147J5617K6232j4355N408j9398
$$ -28011 -1468 1747 19217 -12177 -3549 19012 -3135 12482 38714 24359 29767 10369
13990A0369n637N1761O7488n970j6569j10228P162K4257j2760n5570j2562O7989
$$ 10369 4732 56493 123981 118011 101442 -8786 -1624 22633 9873 -45697 -58259 9730
13978I730N7711K9712K7654j7271q0679k9185M0238M8290R978m1754m3858k2054
$$ 9730 67441 97153 124807 107536 26857 -2328 37910 86200 96178 54424 10566 -11488
13966a1488N060k5036M5249Q031M3118p02n3453l3358J9143k0766n9741K100L9613
$$ -11488 -6428 -31464 13785 21816 64934 64232 10779 -22579 -3436 -24202 -83943 -81843 -42230
13953d2230P0631O465j8295J2117o646k5932j7291K8489l0124r92k553J8506O4188
$$ -42230 28401 34866 16571 28688 22042 -3890 -21181 7308 -22816 -23808 -26361 -7855 56333
13940E6333K3981N17k0627k1112p522l0080q7292O345k265J8004O8770L7634o471
$$ 56333 80314 80831 60204 39092 31570 1490 -85802 -79457 -81722 -63718 5052 42686 36215
13927C6215l5511m1994k9282L5577m565j2576m2472J9786K1429j540k1383K878
$$ 36215 704 -41290 -70572 -34995 -39560 -52136 -94608 -74822 -53393 -54933 -76316 -73438
13915g3438L1761J768j1865M2477L7108k6081j116K9244K191l7544M163J6827
$$ -73438 -41677 -39909 -51774 -9297 27811 1730 614 29858 32049 -5495 -1332 15495
13903A5495j9508q29k634q1036J4573K3458K4182L5772K0706k1115l3856J0843
$$ 15495 -4013 -4842 -7476 -88512 -73939 -50481 -26299 9473 30179 9064 -24792 -13949
13891a3949r678k1942J5972J3480M0937p046m3660o219j0701m1461L0854P9325
$$ -13949 -23627 -45569 -29597 -16117 24820 17774 -25886 -32105 -42806 -84267 -53413 25912
13879B5912J02111K9983n3821l7536l3665m4115K9464O0824M1007l7490J7099
$$ 25912 128023 158006 104185 66649 32984 -11131 18333 79157 120164 82674 99773
13868I9773K5491n0312o9991n4311O652j3901J9973L7812M004k3101j8807l873
$$ 99773 125264 74952 4961 -49350 -42698 -56599 -36626 1186 5190 -17911 -36718 -40591
13856d0591r319L5991J0231l6856k1497r350r281J9730R2898k8861m4977J9329
$$ -40591 -49910 -13919 -3688 -40544 -62041 -71391 -80672 -60942 31956 3095 -41882 -22553
13844b2553M4979J3502j027q4224n5005k0717l116M2299K1718m0090m046J16813
$$ -22553 22426 35928 34901 -49323 -104328 -125045 -128161 -85862 -64144 -104234 -108280 8533
13832H533P0694r532j2191J0634l1055p3354K4901L3953K2996J0777j1773j9908
$$ 8533 79227 69695 57504 68138 37083 -36271 -11370 22583 45579 56356 44583 24675
13820B4675K584k9993k2520j6276p981R344K1808N3037M229m3661k3414j8190
$$ 24675 27259 -2734 -25254 -41530 -49511 -40167 -18359 34678 38907 -4754 -28168 -46358
13808d6358n8606q820K8802M1566O5795K1198J380l2980p1946j3539N2633K8637
$$ -46358 -104964 -113784 -84982 -43416 22379 43577 44957 11977 -59969 -73508 -20875 7762
13796G762L5504n9875l4954J6190K8014J0196l560j0204l8246L4708N8505K6266
$$ 7762 43266 -16609 -51563 -35373 -7359 2837 -723 -10927 -49173 -14465 44040 70306
13784G0306k4091p9406l4954L0193J3339J3444Q0677J9074M735k6479O891r087
$$ 70306 46215 -33191 -68145 -37952 -24613 -11169 69508 88582 93317 66838 73729 64642
13772F4642j4802j4133k4141L3717o2055J1188O9757O373p389O36q811Q288K1514
$$ 64642 49840 35707 11566 45283 -16772 -5584 64173 70546 63157 63793 54982 63270 84784
13759H4784j0041j8277n1005J2882K6361m4776J4036K6086l3007k445j8551J4732
$$ 84784 74743 56466 5461 18343 44704 -72 13964 40050 7043 4598 -13953 779
13747G79K5656k1243N9298l3033l0748K8857O656k6381k2113J0007k3246K0131
$$ 779 26435 5192 64490 31457 709 29566 36222 9841 -12272 -2265 -25511 -5380
13735e380R539l538k0583J8176L6013p4706n5022L7588J8016N9085o403l573l8093
$$ -5380 4159 621 -19962 -1786 34227 -40479 -95501 -57913 -39897 19188 12785 9212 -28881
13722b8881j776j0340J5985K972M4916M0967l2412J9267L878l1441l7628n241
$$ -28881 -30657 -40997 -25012 -22040 22876 63843 31431 50698 54576 23135 -14493 -19734
13710a9734j701k2137l3874L7100j1063R703L7798K3633m3116j6976O2529n6424
$$ -19734 -21435 -43572 -77446 -40346 -51409 -41706 -3908 19725 -23391 -40367 22162 -34262
13698c4262n3135K4142Q4077L9838l4838o6223N4148o186j6054M6953q490m4692
$$ -34262 -87397 -63255 20822 60660 25822 -40401 13747 7561 -8493 38460 29970 -14722
13686a4722k0307k4071O4193J2237l288k7270P144K3953o4570k229L4996J5638
$$ -14722 -35029 -59100 5093 17330 14042 -13228 -6084 17869 -46701 -48930 -13934 1704
13674A704j7097M0511k806o1028O025R662l3529k6677M706K2089M3245j1712l1690
$$ 1704 -15393 25118 22312 -38716 -32691 -23029 -56558 -83235 -78529 -56440 -13195 -24907 -56597
13661e6597l7106O2269M4481Q711L0813J2732m1504j2891k7172j099O8225P9393
$$ -56597 -93703 -31434 13047 21758 52571 65303 23799 10908 -16264 -17363 50862 130255
13649A30255l8858K1126n1781j7676K8817l2840j2933o7792m0220N3774m7008
$$ 130255 91397 112523 60742 43066 71883 39043 26110 -41682 -81902 -28128 -75136
13638g5136m7780K0889K9817K2568J0709J3124o028L6278k1709j324j7422l8533
$$ -75136 -122916 -102027 -72210 -49642 -38933 -25809 -31837 4441 -17268 -18592 -36014 -74547
13626g4547j4504K2768M86O6435L3244O293p789k0372k4021M1534J4664k3280
$$ -74547 -89051 -66283 -65797 638 33882 40175 32386 12014 -12007 29527 44191 20911
13614B0911k5213j3526p000L5155l7798j5050M3303L6816J6786j642j1403J1042
$$ 20911 -4302 -17828 -24828 10327 -27471 -42521 782 37598 54384 52742 41339 52381
13602E2381J0130j9539k7300l530j1997j2833O0508M6355l778J0819o3424l6631
$$ 52381 62511 42972 15672 12142 145 -12688 47820 94175 90397 101216 37792 1161
13590A161J0716l0252m1750k5208N4238M1893K5925L7993J5211p3982J9500M3690
$$ 1161 11877 -18375 -60125 -85333 -31095 10798 36723 74716 89927 15945 35445 79135
13578G9135m1383m6737j7757J4504L1200k5173R572L9083q0508m6276P5865R138
$$ 79135 37752 -8985 -26742 -12238 18962 -6211 3361 42444 -38064 -84340 -8475 663
13566F63l4529k1570J069j8248M1831M1791k4571r401O376Q401k8663l3775j9271
$$ 663 -33866 -55436 -54367 -72615 -30784 11007 -13564 -22965 -16589 -8188 -36851 -70626 -89897
13553h9897p033K6782K261K432O4456L0207m7520J3323j5421m181J7934Q658J0866
$$ -89897 -96930 -70148 -67887 -65455 -999 29208 -18312 -4989 -20410 -24591 -6657 2001 12867
13540A2867M8947K966r758J1345M9087J3156l8716m3699J2932J8866K2271r511
$$ 12867 61814 64780 55022 66367 115454 128610 89894 46195 59127 77993 100264 90753
13528I0753k9386k6155K6621J8387J6155Q213L120j28l9043k0148j6470l3817
$$ 90753 61367 35212 61833 80220 96375 104588 107708 107580 68537 48389 31919 -1898
13516a898P070K2063O7797L3404J7285n7840j11038j772O4280L6047o3639l6766
$$ -1898 5172 27235 95032 128436 145721 87881 -23157 -24929 39351 75398 11759 -25007
13504b5007l6341R183R871P2040k5014j472L1911J3912j3359r700k0700L241L4064
$$ -25007 -61348 -52165 -42294 29746 4732 3260 35171 49083 35724 26024 5324 8565 42629
13491D2629r971k0139N7230J2435N385m3298l3377Q200k4915M1334m9836n003
$$ 42629 32658 12519 69749 82184 87569 44271 10894 19094 -5821 35513 -14323 -19326
13479a9326k3150O733J7180l0508j0552M6078J0368J2212L2711m6431n8233J3876
$$ -19326 -42476 -35743 -18563 -49071 -59623 -13545 -3177 9035 41746 -4685 -62918 -49042
13467d9042L1069L3787L8510q421K0232L6588L3998j461p6986J244J7897N359
$$ -49042 -17973 15814 54324 45903 66135 102723 136721 135260 58274 59518 77415 82774
13455H2774J2323o0035p7030M9270M1615K2300m5998m416j2580m577j9089K0992
$$ 82774 95097 35062 -41968 7302 48917 71217 25219 20803 8223 3646 -15443 5549
13443E549N5966J5329l4630p2356K5275O3689N4693K8637k509l1800k3784l2651
$$ 5549 61515 76844 42214 -30142 -4867 58822 113515 142152 139643 107843 84059 51408
13431E1408J8068M1030k049n0942j8308j4398k7470J8545j3486K9568j7824o3814
$$ 51408 69476 110506 108457 57515 39207 24809 -2661 15884 2398 31966 14142 -49672
13419d9672l7090J0294J4209N5564P4811R884m198k8358k5727j1998L5568M9331
$$ -49672 -86762 -76468 -62259 -6695 68116 78000 73802 45444 19717 7719 43287 92618
13407I2618k5545k945j3127j0087l5460K2214O0658l3177n9948K7175j7598k2601
$$ 92618 67073 64128 51001 40914 5454 27668 88326 55149 -4799 22376 4778 -17823
13395a7823j739P9742L1366M6932K871J2787o354n1717l9990K721o5019m2202
$$ -17823 -19562 60180 91546 138478 141349 154136 147782 96065 56075 58796 -6223 -48425
13383d8425K3948O0471k6170j1845N3712J039j180L494j633N2301K4626P686l4035
$$ -48425 -24477 35994 9824 -2021 51691 52730 51550 55044 53411 105712 130338 138024 103989
13370A03989n9130n0260K748N524k0049M254J2120n821l9779J011L0762M2783
$$ 103989 44859 -5401 -2653 2871 -17178 -12924 -804 -6625 -46404 -45393 -14631 28152
13358B8152M1956o51L503N635K2836m470q9043r868J1127p828k8038K1261K027
$$ 28152 70108 69457 72960 78595 101431 96961 7918 -1950 9177 1349 -26689 -5428 -3401
13345c401l2880J3164N0012O6894L5468q336m2426o0542o752r621l0889J9873
$$ -3401 -36281 -23117 26895 93789 129257 120921 78495 17953 11201 1580 -29309 -9436
13333i436R4961M6744K9809l5973n7369N537J0558j287n3090r2033k51L7107M743
$$ -9436 85525 132269 162078 126105 68736 74273 84831 83544 30454 -61579 -61830 -24723 -19980
13320a9980L083J5065M0717K8584k5006J6347j8839L3195j8588m3076o882J6125
$$ -19980 -16897 -1832 38885 67469 42463 58810 39971 73166 54578 11502 4620 20745
13308B0745j9253j6194L1811K2868n9379M7750M4826l774M112m4086q0702J7081
$$ 20745 1492 -14702 17109 39977 -19402 28348 73174 69400 73512 29426 -51276 -34195
13296c4195M8466O1370J1542l1667J2592J5916j8270k9606m1878m8235J3924L7813
$$ -34195 14271 75641 87183 55516 68108 84024 65754 36148 -5730 -53965 -40041 -2228
13284b228L5625r392j2374K8728k2972N827M6756o951l5693k346J2468k0641J9604
$$ -2228 33397 24005 11631 40359 17387 23214 69970 63019 27326 24980 37448 16807 36411
13271C6411j9131O625m7752J3604k4103j7860K4762L0228J6082n7109L4577J9720
$$ 36411 17280 23905 -23847 -10243 -34346 -52206 -27444 2784 18866 -38243 -3666 16054
13259A6054l7323L4222Q4376L4729m8708k303P4531k8272k6548k2425K314K428
$$ 16054 -21269 12953 97329 132058 83350 81047 155578 127306 100758 78333 80647 83075
13247H3075p1583P378Q4589q838k4471M310n3393m9267N2832N5214j4338j5763
$$ 83075 11492 18870 103459 94621 70150 74460 21067 -28200 24632 79846 65508 49745
13235D9745j8148J7412l291L7201l2887n0505m595k9213J2869O4473j7950j5541
$$ 49745 31597 49009 45718 82919 50032 -473 -5068 -34281 -21412 43061 25111 9570
13223I570L5377K3339J728q725N271k829L7147r979k3811K2417M2256l9882m1760
$$ 9570 44947 68286 70014 61289 66560 63731 100878 90899 67088 89505 131761 91879 50119
13210E0119k5593k0080L0973K705K8239n206j272K3423K9981n3777k2005P1089
$$ 50119 24526 4446 35419 38124 66363 61157 59885 83308 113289 59512 37507 108596
13198A08596P536j8453l6479J89k3938j9318M0346J5903K2895J9847j7442n1514
$$ 108596 116132 97679 61200 61389 37451 18133 58479 74382 97277 117124 99682 48168
13186D8168o3968J2451P6807M7831N98o5668L4376R6764n586n3113k0439K0136
$$ 48168 -15800 -3349 73458 121289 121887 56219 90595 187359 181773 128660 108221 128357
13174A28357p879k3989k5854k2856p968K1450j2843M148J5173K8242O7867L0182
$$ 128357 120478 96489 70635 47779 39811 61261 48418 52566 67739 95981 163848 194030
13162A94030m5312n6732q7093l9502J8855j0415L1264J6148K0275J0772m7950
$$ 194030 148718 91986 4893 -34609 -15754 -26169 5095 21243 41518 52290 4340
13151D340j6242K3598J8407L0115L2575l9970n8467J9m848k6295K1858J0483Q2750
$$ 4340 -11902 11696 30103 60218 92793 52823 -5644 -5625 -10473 -36768 -14910 -4427 78323
13138G8323K3043J949M2796l9510m9202L507K5271N5825J4909m9580n628j6340
$$ 78323 101366 103315 146111 106601 57399 60906 86177 142002 156911 107331 101703 85363
13126H5363k477p234k2235n300L1440J2071n2055j1224m095q740k6670k0624j6898
$$ 85363 82886 75652 53417 48117 79557 91628 39573 28349 24254 15514 -11156 -31780 -48678
13113d8678J6634l2457j7776J8272j2800M7317J3830K2810N1655n679m0174j5980
$$ -48678 -32044 -64501 -82277 -64005 -76805 -29488 -15658 7152 58807 53128 12954 -3026
13101c026K2638k491K923L1488k4736p69L162j3595j0965Q623O1273L5286O368
$$ -3026 19612 17121 20044 51532 26796 26027 29189 15594 4629 13252 74525 109811 116179
13088A16179J4497N0601J6508j8875M1201R4201P5695J15974P0449q2224j57941
$$ 116179 130676 181277 197785 178910 220111 314312 390007 505981 576430 494206 336265
13077C36265q6594r0450o1214N879K337m4023m1074o3339j3941P4298J0821J8684
$$ 336265 249671 159221 98007 103886 106223 62200 21126 -42213 -56154 18144 28965 47649
13065D7649l4333J8374M5703k6284k7038K4332k5363J7441J9129j1582r511k5784
$$ 47649 13316 31690 77393 51109 24071 48403 23040 40481 59610 48028 38517 12733
13053A2733r070k0252j8362K5639m3376n914N1916J7368j7517K5602M9782M4031
$$ 12733 3663 -16589 -34951 -9312 -52688 -58602 -6686 10682 -6835 18767 68549 112580
13041A12580J2798j94j2171m84m8035j8376j4689R193j2982K8502q503k7495K1240
$$ 112580 125378 125184 113013 112529 64494 46118 31429 40622 27640 56142 47639 20144 41384
13028D1384K7858j6538K9020K7438k1966J2283q522n6809o5589j8612R9266L1694
$$ 41384 69242 52704 81724 109162 87196 99479 90957 34148 -31441 -50053 49213 80907
13016H0907m3647l0625N135l9925K0589N5052L8263r857J3553M0271P452j1950
$$ 80907 37260 6635 11770 -28155 -7566 47486 85749 75892 89445 129716 137168 125218
13004A25218J1348k4286n5737M1210k0554n8249o430J7011N815j4197M705M3182
$$ 125218 136566 112280 56543 97753 77199 18950 12520 29531 35346 21149 25854 69036
12992F9036L7026Q003k5516j2154j7067j7405R503j1369l3123l0704J2531N4863
$$ 69036 106062 114065 88549 76395 59328 41923 51426 40057 6934 -23770 -11239 43624
12980D3624K2976M104m6438l6032J6835P547n587j0427m6857k1439K5000M9382
$$ 43624 66600 70704 24266 -11766 5069 12616 7029 -3398 -50255 -71694 -46694 2688
12968B688J8839k1043N868M8544L4210k4126l6142j5408n2548j6003J2158n563
$$ 2688 21527 484 6352 54896 89106 64980 28838 13430 -39118 -55121 -42963 -48526
12956d8526K9030K3563j8129K0801M859N0782K7395j8398L3822N910j69N2819
$$ -48526 -19496 4067 -14062 6739 11598 62380 89775 71377 105199 111109 110940 163759
12944A63759K808l4298l1190j3047q433n118l785k9159q2768L3525M1639j6420
$$ 163759 166567 132269 101079 88032 79599 74481 70696 41537 -41231 -7706 33933 17513
12932A7513K4313L009j7211m4811n724j3864J3296M2992L2751K7655k4192q8310
$$ 17513 41826 44835 27624 -17187 -22911 -36775 -23479 19513 52264 79919 55727 -32583
12920c2583p718N2604K7665O0095l7109o3268R580J356M4878M6696l9697n2309
$$ -32583 -40301 12303 39968 100063 62954 -314 9266 10622 55500 102196 62499 10190
12908A0190K6298p845jL2954L8732j4576l9233j4838k1089J8865K5681n8990Q404
$$ 10190 36488 28643 28642 61596 100328 85752 46519 31681 10592 29457 55138 -3852 4552
12895D552N1061J8129k0223K2366M9592J7939L190m0795j8312k1232j1509M8665
$$ 4552 55613 73742 53519 75885 125477 143416 146606 105811 87499 66267 54758 103423
12883A03423J4624n9266l1926k0834J4089Q3756Q626k5680k8368K3272p890j0139
$$ 103423 118047 58781 26855 6021 20110 103866 112492 86812 58444 81716 73826 63687
$$ [...]
##END NTUPLES=NMR SPECTRUM
##END=
