##TITLE=Analysis number 317589
Compound Code cc 49904
Book Reference 458/90
Project Code qc-cat
Chemist Name stevem
##JCAMPDX= 6.0         $$ Bruker NMR JCAMP-DX V2.0
##DATA TYPE= NMR SPECTRUM
##DATA CLASS= NTUPLES
##ORIGIN= Bruker BioSpin GmbH
##OWNER= nmr
$$ XWIN-NMR		Version 3.5
$$ Fri Feb 24 12:25:52 2006 GMT Standard Time (UT+0h)  MAYBRIDGE\nmr@NMR_250MHZ
##.OBSERVE FREQUENCY= 250.131544655141
##.OBSERVE NUCLEUS= ^1H
##.ACQUISITION MODE= SIMULTANEOUS (DQD)
##.ACQUISITION SCHEME= undefined
##.AVERAGES= 16
##.DIGITISER RES= 18
##SPECTROMETER/DATA SYSTEM= dpx250
##.PULSE SEQUENCE= zg30
##.SOLVENT NAME= DMSO
##.SHIFT REFERENCE= (INTERNAL, DMSO, 0, 16.522)
##AUDIT TRAIL= $$ (NUMBER, WHEN, WHO, WHERE, WHAT)
$$ ##TITLE= Audit trail, XWIN-NMR		Version 3.5
$$ ##JCAMPDX= 5.01
$$ ##ORIGIN= Bruker BioSpin GmbH
$$ ##OWNER= nmr
$$ C:\u/data/dgb/nmr/ADRS/16870/pdata/1/auditp.txt
$$ ##AUDIT TRAIL=  $$ (NUMBER, WHEN, WHO, WHERE, WHAT)
(   1,<2006-02-24 12:25:29.66 +000>,<MAYBRIDGE\nmr>,<NMR_250MHZ>,
      <created by zg, POWCHK disabled, PULCHK disabled
       configuration hash MD5:
       84 BC 41 DB A1 6E 1D 46 DA 25 12 A5 C1 ED C5 3A
       data hash MD5: 64K
       5B 42 74 ED 01 C6 0B C7 F9 F8 48 D8 CD 98 F9 45>)
(   2,<2006-02-24 12:25:42.35 +000>,<MAYBRIDGE\nmr>,<NMR_250MHZ>,
      <Start of raw data processing
       ef LB = 0.3 FT_mod = 6 PKNL = 1 SI = 32K 
       data hash MD5: 32K
       E6 05 A0 A8 0D 4F E8 5E 15 4D F8 B1 08 0C B7 5A>)
(   3,<2006-02-24 12:25:44.28 +000>,<MAYBRIDGE\nmr>,<NMR_250MHZ>,
      <apk 
       data hash MD5: 32K
       88 40 0C 20 B6 09 39 93 BF 64 46 4A 1F 47 7F CE>)
(   4,<2006-02-24 12:25:45.05 +000>,<MAYBRIDGE\nmr>,<NMR_250MHZ>,
      <abs ABSG = 5 
       data hash MD5: 32K
       63 FF C9 7E 04 E8 B3 F7 DB 3A 6F 9A 63 EA 69 3D>)
$$ ##END=
$$ 
$$ hash MD5
$$ AE 45 B8 4C FE 19 0E E0 24 A3 7E AD 5D FB F9 CC
##$RELAX= 
##$RELAX= 
##$RELAX= 
##$RELAX= 
##$RELAX= 
##$RELAX= 
##$RELAX= 
$$ Bruker specific parameters
$$ --------------------------
##$DU= <C:\u>
##$EXPNO= 16870
##$NAME= <ADRS>
##$PROCNO= 1
##$TYPE= <nmr>
##$USER= <dgb>
##$AMP= (0..31)
100 100 100 100 100 100 100 100 100 100 100 100 100 100 100 100 100 100 
100 100 100 100 100 100 100 100 100 100 100 100 100 100 
##$AQSEQ= 0
##$AQ_mod= 3
##$AUNM= <au_zg>
##$AUTOPOS= <28 >
##$BF1= 250.13
##$BF2= 250.13
##$BF3= 250.13
##$BF4= 250.13
##$BF5= 500.13
##$BF6= 500.13
##$BF7= 500.13
##$BF8= 500.13
##$BYTORDA= 1
##$CFDGTYP= 0
##$CFRGTYP= 5
##$CHEMSTR= <none>
##$CNST= (0..31)
1 1 145 1 1 1 1 1 1 1 1 1 1 1 1 1 1 1 1 1 1 1 1 1 1 1 1 1 1 1 1 1 
##$CPDPRG= <>
##$CPDPRG1= <>
##$CPDPRG2= <>
##$CPDPRG3= <>
##$CPDPRG4= <mlev>
##$CPDPRG5= <mlev>
##$CPDPRG6= <mlev>
##$CPDPRG7= <mlev>
##$CPDPRG8= <mlev>
##$CPDPRGB= <>
##$CPDPRGT= <>
##$D= (0..31)
0 1 0 0 0 0 0 0 0 0.06 0 0 0 0 0 0 0.0002 0 0 0 0 0 0 0 0 0 0 0 0 0 0 
0 
##$DATE= 1140783929
##$DBL= (0..7)
120 120 120 120 120 120 120 120 
##$DBP= (0..7)
150 150 150 150 150 150 150 150 
##$DBP07= 0
##$DBPNAM0= <>
##$DBPNAM1= <>
$$ [...]
##$SUBNAM7= <"">
##$SUBNAM8= <"">
##$SUBNAM9= <"">
##$SW= 20.6930455092707
##$SWIBOX= (0..15)
0 0 3 0 0 0 0 0 0 0 0 0 0 0 0 0 
##$SW_h= 5175.983436853
##$TD= 65536
##$TD0= 1
##$TE= 293.16
##$TE2= 300
##$TE3= 300
##$TEG= 300
##$TL= (0..7)
0 120 120 120 120 120 120 120 
##$TP= (0..7)
150 150 150 150 150 150 150 150 
##$TP07= 0
##$TPNAME0= <>
##$TPNAME1= <>
##$TPNAME2= <>
##$TPNAME3= <>
##$TPNAME4= <>
##$TPNAME5= <>
##$TPNAME6= <>
##$TPNAME7= <>
##$TPOAL= (0..7)
0.5 0.5 0.5 0.5 0.5 0.5 0.5 0.5 
##$TPOFFS= (0..7)
0 0 0 0 0 0 0 0 
##$TUNHIN= 0
##$TUNHOUT= 0
##$TUNXOUT= 0
##$USERA1= <user>
##$USERA2= <user>
##$USERA3= <user>
##$USERA4= <user>
##$USERA5= <user>
##$V9= 5
##$VALIST= <valist>
##$VCLIST= <CCCCCCCCCCCCCCC>
##$VD= 0
##$VDLIST= <DDDDDDDDDDDDDDD>
##$VPLIST= <PPPPPPPPPPPPPPP>
##$VTLIST= <TTTTTTTTTTTTTTT>
##$WBST= 1024
##$WBSW= 4
##$XGAIN= (0..3)
0 0 0 0 
##$XL= 0
##$YL= 0
##$YMAX_a= 741043
##$YMIN_a= -628151
##$ZGOPTNS= <>
##$ZL1= 120
##$ZL2= 120
##$ZL3= 120
##$ZL4= 120
##$ABSF1= 16.522
##$ABSF2= -4.171173
##$ABSG= 5
##$ABSL= 3
##$ALPHA= 0
##$AQORDER= 0
##$ASSFAC= 0
##$ASSFACI= 0
##$ASSFACX= 0
##$ASSWID= 0
##$AUNMP= <proc_1d>
##$AZFE= 0.1
##$AZFW= 0.1
##$BCFW= 0
##$BC_mod= 0
##$BYTORDP= 0
##$COROFFS= 0
##$CY= 12.5
##$DATMOD= 1
##$DC= 0
##$DFILT= <>
##$DTYPP= 0
##$F1P= 14.0000005364418
##$F2P= -0.99999901652339
##$FCOR= 0.5
##$FTSIZE= 32768
##$FT_mod= 6
##$GAMMA= 0
##$GB= 0
##$INTBC= 1
##$INTSCL= 1
##$ISEN= 128
##$LB= 0.3
##$LEV0= 0
##$LPBIN= 0
##$MAXI= 10000
##$MC2= 0
##$MEAN= 0
##$ME_mod= 0
##$MI= 0
##$NCOEF= 0
##$NC_proc= -4
##$NLEV= 6
##$NOISF1= 0
##$NOISF2= 0
##$NSP= 0
##$NTH_PI= 0
##$NZP= 0
##$OFFSET= 16.522
##$PC= 1
##$PHC0= 95.78943
##$PHC1= 1.339859
##$PH_mod= 1
##$PKNL= yes
##$PPARMOD= 0
##$PSCAL= 4
##$PSIGN= 0
##$REVERSE= no
##$SF= 250.13
##$SI= 32768
##$SIGF1= 0
##$SIGF2= 0
##$SINO= 400
##$SIOLD= 32768
##$SREGLST= <1H.DMSO>
##$SSB= 0
##$STSI= 32768
##$STSR= 0
##$SW_p= 5175.98343685301
##$SYMM= 0
##$S_DEV= 0
##$TDeff= 65536
##$TDoff= 0
##$TI= <Analysis number 999999
Compound Code 99
Book Reference 9
Project Code 9>
##$TILT= no
##$TM1= 0
##$TM2= 0
##$TOPLEV= 0
##$USERP1= <user>
##$USERP2= <user>
##$USERP3= <user>
##$USERP4= <user>
##$USERP5= <user>
##$WDW= 1
##$XDIM= 32768
##$YMAX_p= 362222990
##$YMIN_p= -153925
$$ End of Bruker specific parameters
$$ ---------------------------------
##NTUPLES= NMR SPECTRUM
##VAR_NAME=  FREQUENCY,     SPECTRUM/REAL,   SPECTRUM/IMAG
##SYMBOL=    X,             R,               I
##VAR_TYPE=  INDEPENDENT,   DEPENDENT,       DEPENDENT
##VAR_FORM=  AFFN,          ASDF,            ASDF
##VAR_DIM=   32768,         32768,           32768
##UNITS=     HZ,            ARBITRARY UNITS, ARBITRARY UNITS
##FACTOR=    0.157963299565203, 1,           1
##FIRST=     4132.6476996994, 0,             0
##LAST=      -1043.33573715361, 0,           0
##MIN=       -1043.33573715361, -153925,     0
##MAX=       4132.6476996994, 362222990,     0
$$ Real data points
##PAGE= N=1
##DATA TABLE= (X++(R..R)), XYDATA
$$ [...]
26743 17564 18177 23369 5515 6276 2483 20890 9817 11526 21078 38512 41010 29468 21327 -1699
26729 -1699 -17021 -23287 -26453 -29749 -27843 -4099 5502 9878 842 12468 30776 26715 3799
26716 3799 1494 25343 35613 38530 32466 3582 4716 29887 41774 27928 8630 13071 34808
26703 34808 39088 28859 7531 8402 -6202 -8613 -4987 14855 15990 12367 9997 12360 5225 14804
26689 14804 32707 19266 -8182 -25700 -37854 -37359 -28624 -7896 12526 -624 -21723 -20093
26677 -20093 8234 3177 4987 16486 36648 33069 18222 3880 -7079 12115 33922 29534
26665 29534 -4106 -38076 -39654 -21107 -5752 -6396 -14908 -14447 -10785 9861 14031 11088 17511 13687
26651 13687 1570 -32810 -35588 -31999 -18198 -875 13094 23005 36568 26618 14578 -2781
26639 -2781 -11126 -20758 -14139 -9604 3023 -1168 12013 12615 22670 26486 21954 -10418 -30395 -22445
26625 -22445 -12031 -9972 -20960 -28450 -12925 811 -4028 -6027 8988 2883 17284 30845 26546
26612 26546 22072 23619 16319 9787 -10892 -10639 15331 11238 9210 -5790 -16907 -28318 -33634
26599 -33634 -25483 -18430 -11055 4952 15577 34438 64089 49508 33373 32980 25452 3195 -7109
26586 -7109 -3095 16421 20339 25072 14937 -4364 -13255 -5196 -5879 1465 892 -7609 -23133 -23558
26572 -23558 -13234 -275 12215 15635 5372 2812 -21332 -15477 -15416 -6289 607 -1303 9558
26559 9558 3780 14771 20383 19927 42010 56005 41954 37464 26493 2224 -13703 -18356 -14415
26546 -14415 -179 25674 41807 31200 9218 -7177 -1153 -244 -20165 -49444 -55627 -59567 -38586
26533 -38586 -4937 -5545 -6014 7102 12832 16988 -9091 -22591 -29329 -12576 -5116 -12372 -17315 -10694
26519 -10694 4411 17566 -6028 -4373 5360 6700 -4672 -12558 9249 25824 36535 33247 29030
26506 29030 33837 35932 26824 6629 95 3755 4934 6936 -9068 -4278 -3330 -11872 2052 14440
26492 14440 28200 11039 4843 5164 -3494 -7382 -6056 -13575 -4837 -15480 -9456 -10126 -15754 -21761
26478 -21761 -18361 -7746 -5391 -12435 -4381 7529 4473 -1071 -2331 16902 458 -16793 -24051
26465 -24051 -25920 -11841 -15884 -19673 -16336 -19299 -25124 3953 24490 14463 9743 -452 2402
26452 2402 -12224 -20875 6738 26870 16778 -12818 -8059 12008 6474 -8702 -3001 -8478 8527
26439 8527 -21129 -21055 -13686 -22466 -27697 -27280 -30303 -32135 -24404 -7097 -12309 -10334 -10670 -23410 -7141
26424 -7141 18391 20249 -8209 -2497 -8802 -5664 19519 35291 43045 9397 511 13483 3642
26411 3642 -20468 -21364 8442 15959 19640 14952 -1522 -11470 -756 -1972 -7646 4791 19299
26398 19299 -8364 -18063 -14525 -11238 -14341 -13272 11385 15178 -14279 -16177 -56 16224 22824
26385 22824 5797 -3932 6698 6501 16887 27606 24066 23332 19731 15394 18264 19971 31025 25837
26371 25837 4695 -5991 -11421 -8000 -4593 4103 12406 18862 33245 13194 1339 -12634 -13700
26358 -13700 -11901 -8414 -26184 -34120 -30350 -21920 -13054 -10764 -27634 -17439 -13245 -24665 -29158
26345 -29158 -32267 -17069 18998 15144 15712 4704 -16789 -10331 28100 26564 27330 34693 22746
26332 22746 14935 13806 43642 60052 44358 31279 3735 -19426 4921 20992 3358 -12260
26320 -12260 -11571 -8602 3686 19391 3839 5386 2874 1929 10550 -2495 -391 16459 -1892
26307 -1892 -25262 -22565 -13245 -2832 -496 3730 25122 18238 16901 8499 1613 -5368 21243 20132
26293 20132 19161 25128 -1399 -3831 10786 31302 36200 27479 21065 -1706 -10609 -21981 -18950
26280 -18950 -3536 -20182 -27965 -29235 -15811 -7116 -14846 -8862 7067 -2881 -19354 -24431 -19697
26267 -19697 -5189 -11251 7138 7883 -2117 7412 30181 2381 -11284 -6669 -8416 -6746 -20929
26254 -20929 -9144 -19215 -28013 -29103 -24031 -12874 -2735 -423 9385 -2977 -4609 16535 18366
26241 18366 -3878 4625 21731 6621 -1755 4083 7967 26684 30806 34640 16665 4294 7144
26228 7144 -1621 4853 20943 15012 15492 20424 16223 13729 7039 6988 4441 11746 18142 -2756 -16643
26213 -16643 -21292 -36107 -30506 -39893 -41714 -36394 -41465 -46479 -55324 -56443 -21913 -6010 -10116 -7921
26199 -7921 -9175 -8896 -14102 -5833 6368 807 -4838 4265 10921 3674 -17720 -10226 -23156 -30200
26185 -30200 -29829 -31912 -32168 -27353 -27398 -9643 -12895 -8971 -10160 -19226 -29834 -23323 -24365 -14578 -13975
26170 -13975 -12803 -6115 2747 417 -17207 -8534 -13565 -12382 -12431 -9954 -20684 -17377 11177 19745
26156 19745 3093 5359 31013 29921 23803 25192 20135 20404 24309 11359 -27649 -34776 -13444
26143 -13444 -437 -13677 -9158 -14264 -12539 9318 33862 30341 14291 7377 5788 -1115 -12099
26130 -12099 -13418 -18975 -18013 4397 14084 9879 1829 3740 9889 12441 15502 28120 40816 46562
26116 46562 39454 31742 7849 14540 36747 34813 15359 10312 7980 4048 14169 1825 -13763
26103 -13763 -10398 -20531 -37072 -41349 -30993 -15603 -7174 -16347 -9357 21886 38075 17483 7779
26090 7779 20798 8813 -4401 -6385 -803 5411 -110 -19198 -11693 -13401 -34412 -24766 -20746
26077 -20746 -10591 -7940 -4121 10167 1735 -13371 -23474 -27616 -21446 5241 -3336 -12102 -9775
26064 -9775 840 -643 3228 9051 18583 24522 4225 20133 15706 1369 4762 10562 27773
26051 27773 21087 6655 9742 13399 -6826 11147 9303 -2997 -14617 -29499 -9324 -7262 -1145
26038 -1145 2527 8821 23430 -529 -9140 4608 11295 17188 19047 3154 -6662 -2601 -7452 3160
26024 3160 -1704 -701 0 898 -997 -15663 -4083 5513 9143 16154 14179 12916 10538 -5548
26010 -5548 -21522 -26762 -8240 2241 17409 30835 25125 21011 2271 20535 28263 25892 15023
25997 15023 -4279 -18429 -11208 1033 9411 3031 -2468 9633 11414 -6350 -9660 -1057 -822
25984 -822 -8482 -19914 -16264 835 -4615 -20843 -24852 -2735 16667 43270 30033 3627 860
25971 860 21731 945 -13990 -6592 -12766 -15815 1688 10264 -1121 -24388 -9091 5940 3132
25958 3132 1899 13615 44529 39173 24149 10479 15253 6732 4675 25764 20752 4989 -22956
25945 -22956 -15091 2450 12831 7693 23626 35017 3134 -15688 -10972 -6179 -3103 -2982 16033
25932 16033 17583 -2439 -23050 -31704 -6971 5303 11003 -3018 9987 12430 27771 25593 29996
25919 29996 11437 -13379 -22872 -28612 -52268 -23696 -2261 -2082 -17957 -6070 4925 11015 25864
25906 25864 37962 25546 2106 -2665 -1607 -2264 -5211 -14504 2057 3341 -15127 -1632 5423
25893 5423 373 -11994 -31318 -37273 -19895 -23927 -32313 -27858 -32132 -19167 -26381 -39677 -26532
25880 -26532 -24042 -18793 -11431 -7993 -2445 -4812 -13743 -30150 -29935 -15406 -10053 -19963 -15395 -13769
25866 -13769 -26792 -27379 -10012 -22442 -29695 -22345 -21339 -17558 -3846 796 19342 31030 15178
25853 15178 -11617 -24983 -39572 -30294 -13187 17304 21075 16325 -3922 -27459 -33972 -31662 -25480
25840 -25480 -6271 -10989 -11270 -9478 -27488 -29466 -24807 -22537 -13688 -16868 -10483 -10330 9443 13919
25826 13919 18707 6271 -44 2040 2735 4406 6779 1437 -11180 -6296 5979 16151 22325 28245
25812 28245 19010 6907 -550 -25675 -38783 -22401 -20530 -29399 -16206 -9061 4028 4664 -22927
25799 -22927 -34670 -26618 -35610 -23835 -19674 -7498 -2748 54 -1658 3775 11452 2646 -16538
25786 -16538 -4432 -2275 -6643 -12667 -11818 -15162 -15611 -3158 9944 6002 7513 -4045 -12300 -2892
25772 -2892 -7885 2899 8401 -7699 -6657 -8355 -9089 -27154 -33498 -44134 -33040 -5683 3649
25759 3649 -12532 -12038 -5319 -4285 5440 -44 -20135 -16652 5129 19084 29662 42680 45101
25746 45101 22305 -3726 7591 1880 1741 16253 24426 15807 3575 -23313 -28907 -28125 -21425
25733 -21425 -8436 6932 790 22722 23440 30324 32915 26664 16548 27181 34436 22809 31255
25720 31255 15809 11265 -3561 -6907 -3515 5400 20128 19913 -2445 -13409 4240 -2688 -4448
25707 -4448 -17698 -25139 -36531 -33376 -11107 -733 -7362 -6954 -6439 1915 13264 8739 10930 11208
25693 11208 18670 10931 8028 4196 19249 30103 6977 -27626 -16032 -7276 -21876 -40097 -30664
25680 -30664 -10243 6903 2828 -13661 -11248 -16351 -3842 11964 21347 19931 17108 7712 -1350
25667 -1350 -4242 7196 12647 6309 9287 6311 19225 27288 11909 -766 -16560 611 15662
25654 15662 17622 19670 5972 -12108 -25461 -36117 -32289 -13878 3864 527 7542 6795 -15242
25641 -15242 -18503 -9870 -10022 11133 18200 15171 4809 869 -936 -8298 13105 31759 42850
25628 42850 17288 -866 7432 22520 38933 43006 45716 30632 31645 39906 16663 5654 18039
25615 18039 -879 -32360 -21808 -23280 -7612 4685 -6339 -22073 -27498 -31451 -31460 -20158 191
25602 191 6490 24167 40231 39219 37132 30907 29144 21589 24512 26557 27763 12451 16658 21246
25588 21246 2447 -1419 12648 3866 -2347 11164 33985 37178 14513 4302 -4823 -26470 -25208
25575 -25208 169 17189 12593 15428 22884 16050 8943 10355 10551 -13201 -35197 -32537 -14792
25562 -14792 -9938 -10253 -18413 -3287 17757 16260 7469 -5001 -12575 -17749 18 996 -10060 -23406
25548 -23406 -16588 -1676 6257 14564 14503 8909 5176 -6226 -22969 -28180 -24634 -19220 -28853 -17015
25534 -17015 -17922 -11603 -3516 15656 25307 12173 8675 4977 -5191 8377 -1245 -172 8174 3133
25520 3133 9685 21619 23735 16764 7 -19667 -23873 -25957 -12702 -3435 -9501 489 13761
25507 13761 3711 -7381 -4106 -999 -13842 -8010 10186 -631 -14826 -19284 -18070 -2287 13830
25494 13830 22824 21314 16609 -9889 -32330 -20058 -12417 3612 -4277 6869 4191 -7044 -1798
25481 -1798 -2570 -23786 -33636 -17802 13865 33378 28730 32870 16113 7224 9833 6499 -3289 -17575
25467 -17575 -22946 -36283 -26464 -26099 -27634 -22821 -32933 -22175 -24215 -23621 -21588 -39506 -33906 -22861
25453 -22861 16443 32861 21072 15053 -5599 -3015 2835 8414 -1774 -23663 -9210 -13853 -18488
25440 -18488 -9216 4757 19231 2226 -34714 -26439 8291 1641 803 -286 4636 19438 5302
25427 5302 -5825 -23182 -21176 -9723 -13939 -17911 -19533 -27491 -18617 -15035 -8422 743 -4236 -7021
25413 -7021 15302 -7548 -12679 -4784 25794 34334 -4073 -12071 10212 25074 34699 36942 37899
25400 37899 30743 19522 15792 -6402 -10079 131 -1006 4070 -14124 -37567 -43144 -12681 -17402
25387 -17402 -22037 -8123 3870 3676 19372 12847 5409 23650 28090 22600 14865 15946 9458 12520
25373 12520 -1959 1786 15395 41007 43532 44085 42616 33003 23787 -4048 -24738 -10971 11028
25360 11028 -5427 -33383 -21761 -20876 -30945 -20224 11385 30941 27015 18532 23312 13198 -4812
25347 -4812 -19168 -18671 -24035 -24394 -32882 -40654 -31789 -34673 -42826 -32765 -39557 -28566 -7652 -12156
25333 -12156 -8044 18916 8193 -3718 -12189 -11455 4260 13387 3294 5030 -12894 -5022 13633
25320 13633 10025 8014 10792 9263 11178 2674 -1872 -5942 6529 28311 22542 22759 27069 23254
25306 23254 5402 -330 10295 5784 -1066 -15095 -46226 -33038 -13061 -7834 -6098 3553 7913
25293 7913 20434 7651 -3579 -932 10386 17667 30651 21599 886 458 10393 5518 12445
25280 12445 3395 12367 4975 -13550 -19497 -11823 -8817 -3495 3158 3811 4205 1115 160 -8804 -13598
25265 -13598 -1635 4531 4872 17441 15110 8144 -11013 -13276 -2226 3511 7613 -1446 1939 17474
25251 17474 27324 16733 -723 -540 -2067 -11109 -12446 6612 16941 22311 13811 13066 22670 12587
25237 12587 -2341 -9218 -4712 -9331 -5086 5311 7317 8238 -170 1677 2894 11374 22989 22558
25223 22558 21670 10684 -1894 20518 30708 3489 -7584 -2816 27717 20604 -6944 -7595 -14179
25210 -14179 -14596 -17657 -1688 17783 14594 -12903 -28754 -30161 -23727 21060 34125 4103 6817
25197 6817 27883 38939 20614 -10532 -27447 -22291 -19311 -11259 -2540 -3692 -13790 -12840 -12798 -18560
25183 -18560 -9879 6185 8471 17100 24159 8770 8657 26105 -722 -18034 -31743 -19191 11621
25170 11621 13257 -3462 -521 -4361 -8715 -8575 -8980 -14601 -25177 -19208 -7803 -3468 1329 -3417
25156 -3417 -16673 -10793 -3408 5776 19575 21479 20778 16442 11752 15960 39953 63668 41808 9186
25142 9186 -7278 -5828 -8747 -3210 7581 6019 -3434 -8776 -22287 -32340 -39330 -12717 10674
25129 10674 18009 18144 9925 -10784 -10938 -19629 -43787 -28510 -21225 377 22431 44034 53385
25116 53385 44851 35503 30979 21037 7018 12652 10825 3495 5461 20118 29870 12197 -3383
25103 -3383 27230 39465 31489 33502 33974 23234 6461 2330 -11896 -37642 -37610 -23087 -17248 -7227
25089 -7227 5216 -3094 -7426 15874 40377 59542 45260 35704 11943 -13973 964 11127
25077 11127 2463 2494 -9517 -20799 -30274 -17675 -8902 13860 21540 -626 -18599 -20398 -13582
25064 -13582 -12388 4932 -2127 -5918 878 -5940 2945 32384 30909 120 -3755 3842 2223 1734
25050 1734 -6092 -13769 -22231 -14836 -300 4812 -5661 1627 -5826 -20218 -16507 -10489 12355 18524
25036 18524 16686 25850 20800 13514 -1389 1253 17652 13110 25685 8930 -8688 -6452 -20026
25023 -20026 -24941 -21450 4253 24741 7487 8785 2408 7944 75 -2833 812 19159 804
25010 804 -23854 -22469 -27571 -22857 -6119 -2925 -15605 -5265 -2343 34236 34058 30709 21672 17704
24996 17704 18821 15430 18603 16607 901 6930 19166 32871 25999 37179 25807 14959 -4214
24983 -4214 -11651 7824 4120 -901 21592 29450 9979 -18609 -31175 -30024 -6243 -14178 -10933
24970 -10933 195 9462 13692 10208 5430 6065 5098 -14831 -33780 -26632 -17422 -7495 13144 -7346
24956 -7346 -25121 -25268 -22474 1975 27769 33693 26999 25717 10636 -574 -10079 -2559 218 -1046
24942 -1046 5416 7770 19031 31645 23509 9031 2167 5595 14612 14625 2896 10770 19555 4498
24928 4498 -11366 -15794 -8446 -12780 -21701 -24235 -4844 -3772 -1793 5189 11919 9179 8220 14978
24914 14978 17858 11510 -19491 -18854 -12854 -135 -3850 -20597 -14982 -1036 14168 33537 24316
24901 24316 9768 8802 -8681 -16704 65 4587 9432 1240 6438 30169 32907 36501 24120
24888 24120 9315 6666 6857 -3201 -25527 -37539 -18189 -544 11846 7873 10442 7626 -8707
24875 -8707 -7659 -11526 -15210 -13398 -20692 1102 16922 -6906 -41499 -50357 -31990 5523 10388
24862 10388 20584 19689 14505 11234 440 -1892 7097 -2930 -8930 5908 6202 6070 8123 11499
24848 11499 32030 24349 11864 7136 39622 40434 27375 26757 43168 32349 8793 -10014 -5284
24835 -5284 4935 9856 9554 9988 11634 7458 1188 7572 10856 5356 -1561 2453 -382 -6643 -24783
24820 -24783 -24478 -23187 -10153 -3046 -3031 -8282 -11401 -8719 5190 -1911 3416 11500 -494 -17821
24806 -17821 -13411 -13907 -5289 -3117 -3356 -2140 -1958 5614 3839 -9328 -11506 16185 22928 13706 2097
24791 2097 -3589 -7775 -8580 8873 9929 13749 10215 -7721 -22909 -30218 -20610 -13813 -14207 -6433
24777 -6433 -20183 -16470 11405 30579 24163 21061 20711 2465 -6902 15129 27732 23900 11613
24764 11613 9024 2930 -4560 -8824 -13957 -19059 -19068 8036 6462 10263 34289 30605 24295 12241
24750 12241 22808 17484 7228 4698 2696 7894 11557 4912 1504 13562 12623 -1648 -4711 -3682
24736 -3682 -1919 -4121 4780 14510 13487 -8467 -3981 -15169 -18805 -20253 -21658 -10611 5400 -2006
24722 -2006 -19215 -15674 735 -8100 -11280 -5842 2325 -2674 -12059 -7453 16365 18792 18554 14082
24708 14082 9966 12996 14839 2202 5073 -1936 1847 12095 7791 68 11596 29026 38556
24695 38556 29149 22291 27969 15892 30262 20788 -9326 -22490 -11860 28781 54048 35045
24683 35045 9186 35649 25925 -7465 -12117 -9835 -10483 -12503 -3635 -5263 6451 10911 5758 5042
24669 5042 21254 9944 -7321 -3971 5817 33162 29913 22464 28102 16315 11174 14482 9363
24656 9363 11067 14439 27173 20494 15485 3688 -6416 4721 15025 16770 20402 30847 37791
24643 37791 33065 17399 22693 40316 35153 18807 8272 13571 14709 6516 1436 3292 16893
24630 16893 17982 30389 18752 22054 22860 12898 -4862 -25749 -35909 -19744 1781 -1778 2881
24617 2881 9793 15076 17600 35356 26807 10792 13140 11777 16319 5165 -8857 -19163 -10258
24604 -10258 9799 15930 29359 24225 -580 23322 22659 23050 2877 -9556 -28110 -18927 2504
24591 2504 104 18296 21372 23515 15910 -2299 -907 10801 17838 3288 -8079 -17297 -9018
24578 -9018 18381 19402 27293 27178 14641 19472 11620 31104 39944 32425 31080 20267 10511 22574
24564 22574 9297 -7375 -2618 -3060 -1907 3568 2463 10671 18437 -1068 -14885 -20274 -10657 -15946
24550 -15946 -21223 -32428 -13452 -7204 -19808 -20487 -21496 -19121 -15811 -5410 8106 23282 19242
24537 19242 2649 12598 20056 13366 -14061 -4923 -6201 10870 8298 859 11608 6807 -157
24524 -157 -428 -8721 3511 29733 21956 16345 20283 13786 -5211 -5809 -6489 -10122 -4541 -1749 4297
24509 4297 29162 27255 18860 -1198 -13730 -8356 -8654 -5662 9591 2997 19799 16367 25623 22035
24495 22035 26960 16487 -19893 -17252 8545 -1856 7570 11005 16448 14098 15751 8530 16073
24482 16073 11376 10088 7516 5238 2707 6634 -19892 -22308 -17858 -11314 6860 17730 24907 35764
24468 35764 23990 10742 -11067 -11453 7717 21396 15657 4569 8027 16943 -6173 -14099 -9927
24455 -9927 -9878 -3736 -17694 -11376 10017 3886 -9747 1039 16828 25612 33642 52148 66040
24442 66040 64507 33088 20649 22133 31193 24224 32558 20167 5737 6317 5656 -3046 -4959 -4723
24428 -4723 -14475 -21939 -5336 8422 -3551 -618 -4814 -11551 8110 23171 15539 28842 29121
24415 29121 25709 8827 -6531 -10279 -2125 -10072 -2442 2668 8299 4780 -4872 -9358 4248 9040
24401 9040 -10778 -25508 -24464 -35704 -41307 -33860 -12447 -1281 5529 27118 31113 17791 11102
24388 11102 16035 17261 20208 3615 -15941 -27014 -14064 261 2895 4365 -14399 -4532 8616
24375 8616 6618 -13693 -11582 -11813 -34384 -54311 -51502 -45819 -31873 -6080 2218 7526 21666
24362 21666 18724 26313 39906 29198 18746 16400 17337 24471 27009 28218 35349 20292 15097 28411
24348 28411 6973 -5792 9706 6594 17551 38214 27372 14076 2642 -11231 -10707 1022
24336 1022 12951 8651 11381 18457 12037 8585 14354 12817 9760 -1450 -60 -3920 6413 2427
24322 2427 4746 13210 11670 21302 36183 17693 -11542 -29182 -42690 -32336 -18727 -3164 14911
24309 14911 7779 -11114 -26018 -11387 5980 4435 2625 -6496 9003 18951 6304 6400 8225
24296 8225 21256 11407 16338 15193 9406 12989 22028 14075 -8261 -8151 -5187 -4702 12873 23358
24282 23358 8567 24447 21714 19910 11657 7807 12389 18826 16392 15895 10459 4398 16043 15323
24268 15323 -299 -5098 -18209 -4163 8049 14424 5014 -221 -1767 2027 9443 5848 1710
24255 1710 10025 8464 7089 7611 -3052 -17788 -7818 15173 14456 -2117 -7376 11484 20681 22533
24241 22533 21306 -5918 -2861 -4210 4413 22408 19954 12595 671 -19600 -23098 -9875 -510
24228 -510 -16994 -21709 -17768 -15719 15857 16098 267 -4529 4507 31302 19235 12768 8819 5033
24214 5033 6312 -5508 -25077 -5323 13845 23196 10590 -13527 -29083 -33477 -24038 -28243 -15349
24201 -15349 1822 -2880 -1472 -9962 -10254 4179 10243 1558 1440 5129 16186 23762 7114 18007
24187 18007 30152 22396 18080 1939 -1067 10667 -5165 2887 13898 6566 10335 10382 1507 -7303
24173 -7303 -29238 -25421 -20626 -18465 -16836 -11816 -5506 12746 22107 24471 21079 21816 11438 4472
24159 4472 -8808 -6320 -7810 -3552 5228 12931 14605 6855 23254 35541 36650 12233 19553 21950
24145 21950 -154 -15065 -7619 30766 35563 17877 804 -6900 -16782 -6219 10429 13226 4407
24132 4407 -1199 5958 13938 28403 45431 28276 15840 3641 -5588 -1612 13157 23665 33788
24119 33788 26094 17469 17066 11927 29333 31512 22286 30372 27847 20525 29683 4349 -2902 9882
24105 9882 34935 45449 34205 19264 20008 21129 12724 11002 2051 12786 24918 17173 26933
24092 26933 19067 26253 25238 13379 13731 22274 18958 37571 37279 33976 9092 -3653 8193 18724
24078 18724 13096 -2230 -6181 -10861 -1524 21387 21419 -472 5984 22546 20782 26026 22379 11279
24064 11279 17876 24356 31435 22661 18811 28936 22311 7809 3690 5233 11536 -3330 -13354
24051 -13354 -2143 12217 -4043 -17113 -21485 -14192 2591 -3078 -4320 7655 13305 2770 5876
24038 5876 -725 -7872 8283 8874 1606 5840 15545 19112 -11279 -28713 -26079 -19511 -8781 -22
24024 -22 23077 22008 3105 -295 -15114 -4648 20599 25127 19914 16052 19682 19806 20927 946
24010 946 482 29501 36742 24274 13706 29083 28652 18158 18745 16526 10482 20940 -981 -28695
23996 -28695 -22368 -8610 7702 14852 25508 34603 25217 15435 -224 -13807 -14675 17520 3780
23983 3780 -9261 -8470 -26848 -16928 -22258 -26527 -10187 -7336 -17149 -8163 -2867 -2374 9217 637
23969 637 -3846 -12353 6157 27467 18583 16411 -5662 -25868 -20240 3812 12468 9079 -519 8466
23955 8466 -8324 6194 21540 14870 1950 -7010 -8537 -4569 -8169 -5618 -15330 -26305 -45951
23942 -45951 -40683 -26786 -19757 -12027 -2884 1537 -4258 -16369 -14679 -9837 -19761 -29217 -28793 -25393
23928 -25393 -13052 2595 17100 15842 14502 12258 17224 14492 10628 12088 17435 19480 7321
23915 7321 5655 34347 50139 34952 4816 1364 -3435 2203 17940 14035 26701 37143 29252
23902 29252 35116 36906 30999 33401 43159 26827 5856 11023 7367 1213 -16518 -9028 -12566 -1885
23888 -1885 22388 38025 29160 27843 35079 34763 15141 2425 -4469 3973 8240 -3275 -21187
23875 -21187 -11847 -14843 -20373 -5933 17174 25701 11745 4855 15631 27003 28379 2896 -6576
23862 -6576 -3486 2508 3528 1277 16860 6982 4285 12669 16229 22011 2914 -7105 8610 28288
23848 28288 24738 23400 15977 14327 13397 19386 42086 42639 25925 20464 12955 7187 3331 -900
23834 -900 9447 16325 13432 8526 14472 -279 -12918 -9522 -10052 9909 36001 33882 19448 19017
23820 19017 30669 1745 -6800 -8763 -12093 -14471 -6946 -30891 -44395 -35562 -27718 -10240 -2666
23807 -2666 3530 -15860 -22696 999 -3294 -24490 -37419 -43184 -36729 -22725 -6595 -7722 -7657 -11174
23793 -11174 -607 3869 7876 -8483 4770 22939 21019 846 -17458 -16965 4949 17138 16214
23780 16214 17436 28588 19655 12685 19781 22746 3322 8596 20735 20707 13233 19105 5723 -9362
23766 -9362 -9548 -7118 -4686 13897 14963 4658 1235 -2517 -7278 -17891 -19017 -35843 -26834 -15182
23752 -15182 -12492 7197 23727 20925 -8581 -4521 -24 11595 13382 6416 23562 29685 14627
23739 14627 -8783 -21181 -25666 -26415 -17243 -11806 -6623 -23996 -50053 -40368 -22524 -14018 -2743
23726 -2743 8156 29123 22909 5644 6756 -9132 -1968 -14944 -7155 7254 -12182 -17406 -5155
23713 -5155 10590 2719 -7747 4021 6330 7858 -4741 -90 11443 5236 -3147 -13515 -6685
23700 -6685 -1350 -5141 -1864 4733 -4275 -9307 -34150 -32356 -4630 11628 -3549 -8400 -18145 -25959
23686 -25959 -25720 -488 -5760 -11011 -4093 20908 28818 40786 28225 5616 1392 3029 3714 8163
23672 8163 -1001 -6744 -9923 -14516 -14320 -7290 22035 14855 21249 15886 5818 19435 21675 6967
23658 6967 -1810 10325 25062 18439 13430 17534 36221 30258 30641 9735 17463 24945 16605 4103
23644 4103 11324 -2031 6831 9524 764 3910 7676 -12091 -12553 -409 -1688 -8979 -17722 -20521
23630 -20521 -20322 -5667 4489 4917 -6833 -5450 -13911 -2903 20545 14139 7828 -1812 8966
23617 8966 5182 15763 5492 6598 11126 31562 31926 10837 4350 120 3321 4820 2728 18458
23603 18458 6273 3080 11244 17611 17438 18613 12361 13984 15421 -461 -5464 23896 39167 27367
23589 27367 14022 421 9769 19447 9597 2027 2275 19395 7491 9776 1208 -2580 11236
23576 11236 20202 16243 21808 42647 42402 17229 8834 7120 7029 6111 3575 17116 24387 9111
23562 9111 6977 11972 15969 23216 30929 32816 19847 26989 11592 -24068 -31505 -5782 415 8950
23548 8950 35157 19467 7961 9332 15192 22047 5480 -9376 2081 10313 21143 17230 8758
23535 8758 3792 14322 21157 8259 -365 -8909 -7865 -12813 -13161 -5930 -11112 -2080 19478 35796
23521 35796 37092 19822 769 -20721 -19665 -12954 -6917 -1714 -2151 -544 -631 -8261 -7255 13648
23507 13648 18297 -4333 -22946 -24477 -27686 -18949 -15477 -9360 -1625 -2188 11777 20622 12419 -1450
23493 -1450 3178 813 4401 12179 6708 15093 25956 27061 37119 48998 34848 24347 35543
23480 35543 27917 10578 18730 30528 26186 29661 45591 30056 30369 28013 7613 5011 9781
23467 9781 10838 9525 22892 33726 37951 9295 -6363 -650 4244 26941 36293 26744 -1653
23454 -1653 -18528 -16266 -17675 -7745 4991 -2792 3089 13410 14887 5505 -1885 -9443 -15058 -10161
23440 -10161 2355 -23242 -37486 -16487 -3906 -9069 -25589 -30311 -16642 -9513 7784 20552
23428 20552 31966 15476 918 2507 -3371 -12700 -6170 -18179 -25835 -49604 -34780 -15039 2094
23415 2094 16897 14717 -1940 -8847 -9305 -2178 -4482 -8440 -5172 9473 21256 11016 -9496
23402 -9496 -12205 -8887 -14138 3148 -1160 -4615 -349 16855 11809 10707 -4321 -1402 4964 7056
23388 7056 8658 11538 32789 21723 6667 8361 9018 15290 15268 25114 20473 3349 135 17012
23374 17012 25227 8226 6993 9039 4360 -6540 -9121 -27003 -28935 -21533 -26499 -21009 -11119 10551
23360 10551 7885 5666 4339 -10505 -20124 -13200 -7782 -11085 -18002 -20462 -11258 20096 26895 27386
23346 27386 32638 26451 18291 21245 989 5328 27247 37508 17420 3118 19554 32510 34746
23333 34746 26587 15064 11658 15069 21073 13844 17948 6119 -10477 -6296 4979 1381 -753
23320 -753 12434 16498 4240 689 2118 -4101 -19449 -21831 -7866 -13469 -9523 5779 14999 21054
23306 21054 14501 21120 21321 16877 12465 4466 -9892 -18150 -35026 -27567 -19390 -8823 15708 10479
23292 10479 3334 -8764 -14427 5868 30860 36449 39336 10392 -6939 -1464 9500 21291 24042
23279 24042 33922 32850 28209 32061 50454 50518 29468 27217 40293 32661 -18592 -29849 -27821 -44301
23265 -44301 -33762 -13836 -20135 -21697 -25323 -12860 -5993 5786 24211 24399 16785 8121 5867
23252 5867 7235 17537 26261 10211 -26152 -30955 -21628 -28472 -29175 -7286 17257 -71 -5839
23239 -5839 1442 9164 9133 22444 34470 10197 6320 13612 11627 7489 18427 34566 37875 33162
23225 33162 21131 -4370 -1777 14068 3861 1594 9647 -3954 -8694 -22516 -29364 -13410 2605
23212 2605 -5871 -17937 -11677 -10680 -14059 -23495 -10984 -4475 -21107 -21571 -901 -139 -10371 -27171
23198 -27171 -16262 -14128 7861 11486 2853 -2509 -6705 7200 7122 13492 25920 26912 8232 -5223
23184 -5223 -11970 -3649 -1070 -26 20191 29073 19131 5048 -11529 -5445 -21242 -12478 18722
23171 18722 20954 18574 -2028 -7029 11434 -705 -7937 -12093 4434 26351 43287 32349 8513
23158 8513 -13754 -17315 2759 13472 14510 20891 13575 3121 4924 25099 43242 50096 23438
23145 23438 3979 -3485 7625 -1482 -4551 3333 10511 1714 17318 17217 8655 5625 16099 14113
23131 14113 7806 18974 22107 16009 -7252 -4482 -1637 -9844 8460 7296 -6749 -6195 -5498 -9455
23117 -9455 -17491 5826 16047 19399 5466 5655 13336 9751 6063 15441 33540 55902 62310 37846
23103 37846 22453 15535 23075 43186 28568 31103 33533 17540 -465 5522 3711 2159 -22757
23090 -22757 -29577 -22122 -23074 -6935 16399 30187 29893 27964 31464 30311 34387 13483 5136 7775
23076 7775 7531 26262 21530 19341 -198 15276 29120 22406 20827 34759 23088 14408 15489
23063 15489 2804 -6774 7265 25034 27739 21935 1777 -7005 491 -9684 -16161 -17675 -29419
23050 -29419 -22768 3767 13017 27819 22401 4209 -13952 -20040 -683 -2733 -22877 -11511 2427
23037 2427 5560 7735 10317 27985 34336 28210 6712 12219 23913 4696 7523 6247 -7715
23024 -7715 -3011 15553 10778 8519 11389 1099 -7938 -2707 11337 21649 6104 -1428 -2636
23011 -2636 4447 21179 4764 -10019 -13703 -15725 -13173 -676 -4518 16855 46018 29426 17019
22998 17019 9775 5538 19269 38891 42711 52354 41449 47914 54012 45282 44915 47755 20959 17208
22984 17208 19452 18421 6654 -2625 608 14106 13071 17461 27729 34121 25402 20427 26061 11481
22970 11481 4127 15618 15471 22204 8308 -22330 -30180 -16741 -21501 -16822 -4093 5677 -4036
22957 -4036 2563 18991 24169 12865 14765 18748 12273 21520 14670 26151 39280 31403 15561
22944 15561 14135 34754 23292 -3673 4825 7601 12150 15538 37246 19237 18355 16463 15036
22931 15036 21735 28210 11778 18857 19390 9796 -4524 10335 18713 26172 15063 -8656 -39941
22918 -39941 -49236 -48187 -29774 -22500 -29085 -10605 6165 24583 31493 11969 13688 21388 18644
22905 18644 4652 12949 17674 -25904 -20228 -20766 -24220 8857 24088 21136 -7900 -9987 -12060
22892 -12060 -3840 -4081 -20856 -8467 13415 34611 12527 -943 2154 4487 11473 25493 44313
22879 44313 58564 70710 54362 30069 16811 1817 27030 51965 55261 40711 14408 -28278
22867 -28278 -9068 25858 3927 -3766 10679 33076 37680 26533 18996 21083 3178 -6715 7978
22854 7978 11402 -21401 -25916 -11091 -4778 -17479 -26185 -27872 -23790 -18505 -2082 -2067 641 -5529
22840 -5529 -11017 -18609 -22443 -24518 -38797 -42833 -12264 1429 -14481 -20116 -30362 -29633 -19386
22827 -19386 1360 12725 14682 -773 -4855 8638 4132 -5824 -6458 -2161 -8838 -8346 -6802 -3081
22813 -3081 -2736 -19425 -26515 -11548 3386 13285 19666 10224 8169 -17013 -21999 -18686 -23723 -23361
22799 -23361 -16870 -8007 6077 42221 42568 34779 26141 11359 28645 47242 46232 32232 25879
22786 25879 9410 296 -3162 -29397 -58817 -50498 -16119 -2448 -10808 -18867 -1521 22438 30141
22773 30141 27861 -167 -15445 -8379 -17924 -42321 -21484 6989 -9597 -27105 -31338 -18342
22761 -18342 8129 23020 14155 -7834 -19943 -25232 -11242 3049 14895 17370 -4840 -7981
22749 -7981 -7237 7119 20804 22559 18123 11634 6015 -601 -10602 -5611 5130 3931 18084 13460
22735 13460 20835 11360 2808 3510 -9895 -19828 -21173 -13527 -1292 14721 11117 11173 1387 17026
22721 17026 38784 30191 37029 34262 29562 20950 10245 -3332 -36188 -48875 -15563 7142 8335
22708 8335 17143 4554 964 -3969 -1077 14877 23783 22508 4384 -1300 18474 23290 21349 23994
22694 23994 32783 38328 38323 36310 35155 20829 18861 29736 28489 15679 18089 37016 26945 -948
22680 -948 -4012 6940 21902 30562 32427 36340 22464 11181 25143 26501 25442 16606 6542
22667 6542 -3055 5563 3361 8670 27724 41711 40814 36069 38848 42320 22028 1504 4426 8726
22653 8726 3711 -5433 223 18331 31282 13065 2022 1669 16325 19285 21915 5695 2127
22640 2127 6422 27499 36865 29969 3302 -25085 -19566 -5708 -1444 -14031 -20395 -9692 -2732
22627 -2732 -19069 -10552 1018 5500 -1347 -18429 -22576 -28300 -9714 -4986 -8086 -9049 -1482 1074
22613 1074 -11748 -26020 -11606 8947 -7719 -8215 10620 27758 15613 22818 31214 24791 30243
22600 30243 30937 36021 42468 25598 12662 11668 18560 13131 7993 19514 26301 31122 12691 -5500
22586 -5500 2065 4500 22665 35477 29574 10156 10283 19464 5920 -7573 -9964 -22539 -15131
22573 -15131 9724 15436 5131 15477 12957 10694 24411 27674 12594 -8378 -6387 -2912 1974
22560 1974 15053 18068 3507 22934 40426 29185 48036 34477 9503 973 9289 8426 -3928
22547 -3928 -1713 -9505 -29914 -16792 -4202 8217 1152 -1151 7255 6718 -3757 -2205 2975 5956
22533 5956 -12665 -17887 -12614 -14403 -32045 -32347 -21753 -13397 8969 30961 31137 18400 8297
22520 8297 -2920 5994 21995 22512 7005 14075 23352 28280 29928 29513 31068 19736 18238 6303
22506 6303 -1492 -5708 -10139 -634 12535 1303 -13233 -12632 9381 15837 12068 21875 37575 31278
22492 31278 9845 -21165 -31654 -11821 3888 -34 -2885 18938 24685 29981 35722 29788 1767
22479 1767 7206 13520 8273 14505 19689 11614 -2317 -27980 -28784 -20058 -11480 -20625 106 15577
22465 15577 14759 19312 18749 9464 3573 4715 2181 -3612 -21695 -28915 -43825 -28005 -8687 4236
22451 4236 -16477 -22785 -29897 -15237 -4667 -5748 24549 43534 36265 41617 42854 16005 254
22438 254 7790 19597 25721 37501 29475 29074 25182 18142 8523 1435 -34 8924 21662 18153
22424 18153 21247 25600 36769 20357 -1919 -7169 1150 -5830 10754 20777 24083 33767 37958
22411 37958 18321 22896 32045 5505 -31645 -27618 -7816 7203 17695 22545 17448 11087 5324
22398 5324 -13463 -15590 -7441 4424 10823 10311 -12251 -20050 1037 10708 6673 -6945 -12458 16158
22384 16158 16536 7338 22453 20016 15122 8715 -1063 -7901 -4169 -15158 -12967 9074 12995 16217
22370 16217 28849 15273 3464 10456 -4718 -2690 6038 -4068 -16299 -20531 1026 4255 12794
22357 12794 11925 29243 26196 -1285 -17069 -8041 2975 17988 19236 28935 21994 660 -705
22344 -705 -1732 -12960 -10639 -7495 -1739 2783 -8799 -20250 -17102 -6498 -24069 -30515 -25299 2432
22330 2432 20312 10534 4324 -639 2219 2934 -932 -15381 -28038 -2609 6649 16089 2118 6320
22316 6320 9676 -4157 -14002 -21304 -12242 9147 81 -100 3760 -3119 3942 1997 12892 13501
22302 13501 2776 4442 10435 7041 9438 20432 14704 7672 8864 448 -6276 -93 9890 16398
22288 16398 21022 5935 1857 26069 42904 20256 10160 5861 50304 63719 53655 39800
22276 39800 33028 24037 26996 33606 13647 4049 11672 16715 4675 2972 27386 45969 40838
22263 40838 25229 21181 21876 34775 28473 31177 24168 43083 50916 61534 49038 23067 24320
22250 24320 44250 43505 29560 18724 681 12361 14899 31721 34523 32081 36017 28178 1523
22237 1523 1544 22704 24782 174 -3387 3589 4243 7552 -4365 7025 6414 -6121 -5600 -9836 -8031
22222 -8031 281 -4129 10403 9608 3200 3503 10662 22592 17642 12708 4857 2996 2304 5735 14332
22207 14332 18400 3540 4408 16751 12683 4610 -2542 -58 -10385 4062 4054 -1094 2936 -295
22193 -295 -6835 -5973 1990 -7032 -19810 -17656 5820 6235 -5033 -17948 -9384 27476 34129 22144
22179 22144 14328 12345 32027 51320 54318 41792 42428 43034 15581 -2846 -24582 -42868 -29635
22166 -29635 -12136 1707 8265 19975 12079 17204 17831 14459 23727 33443 42086 50233 42237 25380
22152 25380 17668 21042 5110 -2631 21727 23526 6515 1638 -2536 -4020 13381 14254 18225 12990
22138 12990 5793 18164 27599 20409 36379 36353 33333 24248 21246 18006 17064 12963 13071 8803 1080
22123 1080 16708 -83 -13855 -1152 8330 21043 25824 25074 13804 32336 31960 21294 6295
22110 6295 13251 24823 39393 31311 21367 26256 40456 41625 50800 46097 30221 6427 -3044
22097 -3044 -14503 -17419 -14123 6333 12719 10721 16520 4997 1321 6165 -1986 -4138 -5497 -19120
22083 -19120 -14076 -11775 -24511 -20958 -698 16245 12241 26930 21949 18280 11875 791 -9116
22070 -9116 3143 17782 -2510 5292 -3427 -23296 -21703 -30140 -57281 -38626 -29667 -16347 -2614
22057 -2614 14029 35095 34854 29814 37583 19864 34739 60294 46170 30809 31796 24430 1130
22044 1130 -11139 -27086 -20057 -22951 -20618 -7585 -4600 -19401 -28777 -32767 -12972 5838 4245
22031 4245 -1901 -6434 -11032 -13087 -16467 -27801 -30343 -28443 -20597 -2794 12176 9322 2820 9151
22017 9151 537 14969 18026 10018 2602 -5964 -15054 -16712 -18160 -26538 -30036 -22243 -18474 -11421
22003 -11421 -3694 1096 9403 15872 19614 6214 -9655 -29084 -36191 -1580 25267 11260 -4433
21990 -4433 -26619 -29920 -10474 -22468 -6116 23001 33906 29839 41108 32900 34613 51356 44407
21977 44407 31375 17038 20272 17359 8986 16371 30712 18720 6319 -30 -1888 9760 2157
21964 2157 -5559 -19105 -29091 -17647 -7357 -80 7166 7980 12607 11573 9821 14608 16489 26488
21950 26488 23653 18671 16441 17289 37570 38287 43414 28646 9316 16624 26536 9813 -3606 15314
21936 15314 23762 16409 15050 11853 28603 44304 44068 41225 33721 18449 9936 23010 13447 5394
21922 5394 2248 -9008 -3858 -4711 -6610 15375 29804 20894 22859 6454 4162 10729 6877 12204
21908 12204 8189 -7728 -5733 2777 -11620 -7667 6365 13116 -3617 -3192 -15777 -37890 -22781
21895 -22781 -11759 -9772 8929 20819 45680 45797 51891 32915 22827 15292 20347 13266 15588
21882 15588 28039 37749 14937 10420 29849 36834 15677 -131 4306 22770 31767 31766 26034 13769
21868 13769 11322 17873 16320 10618 -2618 -13528 2178 -11770 -18455 -4298 6120 -267 -6588
21855 -6588 218 6572 2792 -1818 110 23247 30971 29980 31019 30162 35546 37105 18432 -8800
21841 -8800 -8875 -6614 -782 12752 9762 627 7995 21923 40730 21810 9351 -14901 -30414
21828 -30414 -28008 -3003 23327 18183 5223 20357 17545 9014 9666 618 -10535 -24529 -13032
21815 -13032 19049 10382 -14401 -20358 11727 20276 981 -13311 1467 -10072 -19016 -607
21803 -607 -1903 -27545 -31682 -15267 8192 19013 4821 -6936 -1954 21482 10741 380 -1426
21790 -1426 -2915 14543 14078 311 -9133 -18723 -21798 -21917 71 18575 27215 20514 31379 46328
21776 46328 40500 34483 16606 -10687 -22433 -24715 -14956 -4106 -21632 -36832 -40512 -17002 2334
21763 2334 6648 4620 -10311 -21506 -6578 9517 4163 -7716 -33111 -29339 -16398 -9585 6643
21750 6643 7290 8773 12657 26736 22829 3586 3713 241 -296 -3416 8367 5183 4239 -14540 -15179
21735 -15179 -171 29474 35502 33156 15258 14753 30030 20826 29896 32100 21906 5531 5986
21722 5986 -12809 -14146 -11129 -6457 5474 30909 32643 21770 30042 30227 34564 19995 28117 23761
21708 23761 35678 33052 15317 24389 25667 15155 18345 20659 23158 4312 9191 20894 16511
21695 16511 6576 -322 13258 7782 44 16739 3721 6546 8513 2351 9025 3306 -6507 -1738
21681 -1738 11347 18408 28521 33678 22532 11542 -318 -9208 3142 19851 26893 27736 25987
21668 25987 30390 19725 19468 24530 25775 20160 38858 36232 25983 21718 13512 5823 4435 -410
21654 -410 3251 4401 8801 11330 15797 13212 -4699 -431 3921 12623 7639 -4210 -13765 -7738
21640 -7738 12869 15606 34920 22948 4710 11148 15365 4798 20039 47176 36175 8812
21628 8812 -8757 -1952 4228 -5345 -3777 -4976 -16844 -19952 -13788 -559 -8674 6711 11669 12121
21614 12121 17510 20744 14526 10155 -3695 14383 25365 7673 5151 -775 6796 8380 1400
21601 1400 -19913 -21813 -23497 -29566 -22256 6665 17704 -17696 -17913 -22729 -27280 -7842 -7652 -10661
21587 -10661 -12720 -16198 -44761 -48646 -40208 -38931 -48669 -29067 -5147 18601 31379 49488 53124
21574 53124 42385 43247 40310 27460 34245 18023 10060 -7958 -31688 -43428 -47104 -40460 -12274
21561 -12274 19756 9574 -6851 -14482 -17428 -9060 -12114 -17317 -2795 8306 21599 33325 -3027
21548 -3027 -4449 25237 41067 52262 36376 6393 -8323 1571 17916 22715 26590 22475 26356
21535 26356 25254 20801 1514 3528 22945 10010 12282 3872 -2554 -8077 -4511 4387 9619 30607
21521 30607 43574 63319 65164 78930 73948 59442 41248 34902 40114 36475 27749 6461 9770
21508 9770 14014 36018 25065 13455 1259 20209 33087 26503 15845 -1865 3867 36475
21496 36475 34353 30539 24280 28138 19197 5415 -2068 11316 21782 8559 -17705 -12863 14403
21483 14403 21028 28427 18458 15973 25260 22455 16038 2547 -2194 -8206 -11502 -11742 -10377 -11922
21469 -11922 -18552 -22634 -25422 -15626 -21249 -10710 -11282 584 3322 -7668 -10540 -16981 -37244 -47813
21455 -47813 -40493 -18177 -443 -963 -3783 -13015 -6153 -23733 -21992 -23943 -16294 -10972 -22893 -18371
21441 -18371 -11723 -5448 -25134 -30517 -25073 -25092 -37800 -45412 -41125 -23377 4564 33083 39909 26872
21427 26872 20068 12498 8980 175 6930 4641 9729 20361 36973 50685 61800 53080 36466
21414 36466 29297 17335 8495 18092 11690 7153 13369 16607 10611 -1881 -15927 -11723 -8453 12523
21400 12523 19126 30869 31824 25837 8827 2515 123 4755 1812 491 -3830 -2691 1065 -5820
21386 -5820 -3678 3957 -951 -258 15663 19409 21475 9971 -4272 -3739 -9219 -17205 -8910 -1332
21372 -1332 2639 -13803 -30852 -32966 -14329 -9230 -25860 -45746 -52987 -40596 -27151 -11494 -4734
21359 -4734 -5624 -19985 -5976 8369 -8015 -22862 -31908 -21089 -22068 -43137 -51069 -28671 -17796
21346 -17796 -21040 -10816 -15856 -183 14005 13230 23978 43070 57686 42961 5083 -28309
21334 -28309 -25742 -7283 -2813 -12877 -12595 -5248 -8096 -12844 -17634 -2040 1387 7979 17689 3249
21320 3249 4706 23628 30126 35767 29918 11921 -1728 6161 -7072 -15364 -17352 -20904 -20757 -8859
21306 -8859 -13797 -27710 -26971 15935 21645 35934 42415 12592 2596 -3051 -3353 -1556 -8379 -11741
21292 -11741 821 19173 11288 22308 30659 28952 33964 13504 22437 17815 2028 887 13528
21279 13528 15729 25981 23890 21920 31423 10003 11324 22473 19696 -2596 -13236 -1308 5982
21266 5982 -1943 -16375 -9096 5211 17654 12150 6665 24414 6899 -1672 -8859 -159 10312
21253 10312 17555 20261 430 -14679 -14347 23575 51203 72275 71678 36422 10994 26247 29345
21240 29345 41363 35553 18014 8953 12033 2326 7019 20105 17136 -2473 -17596 -203 -2609
21227 -2609 -16932 -14746 -10359 -15353 -27770 -25768 -3143 -5375 -16748 -4762 5143 -17840 -26551
21214 -26551 -18360 -9138 -10301 -21903 -17797 3511 12244 10902 27249 12903 17616 28608 19044
21201 19044 1912 -12502 -11617 1683 22530 22063 9420 -4311 -11191 -13990 -10608 -4628 -11251
21188 -11251 -4109 -16066 -4297 10945 7875 14155 25520 16195 14402 27047 17530 32874 14526
21175 14526 -11799 -6789 1630 -132 -19446 -12472 -1611 -3945 2037 31576 20449 1644 25711
21162 25711 38764 31673 20083 25419 33820 28058 59499 57455 32098 38317 58651 60764 45068
21149 45068 13297 -3981 -18975 -29733 -43609 -20589 -13334 -11460 11376 28679 23638 34136
21137 34136 40515 33474 18714 16314 9547 20908 28225 33499 43374 20771 -531 -5976 444
21124 444 20781 9254 3678 -3602 -22979 -25523 -10810 -9111 -20082 -16026 -103 -6530 14182
21111 14182 -7095 -14458 -4342 -28196 -33667 -17748 -14804 -9272 7014 16760 -7846 -23838 924
21098 924 16697 -5144 -13064 2684 26619 35865 52364 48711 12544 -5105 -13224 -21222 -10599
21085 -10599 -6048 -6243 3557 -6992 -30969 -27221 -18512 -33775 -40485 -22351 12542 29059 17046
21072 17046 18538 35004 36898 33405 47528 31337 12211 3388 -4641 -27865 -46494 -52129 -44609
21059 -44609 -11680 1167 6971 24913 24244 10816 9917 24022 26757 18916 25171 13328 10752
21046 10752 12882 11283 13299 27188 12811 -12090 -2799 -13703 -13880 -19960 -13194 -10693 -16807 -12290
21032 -12290 -4344 -14210 -5340 1757 -1899 -6252 -7758 -9632 5044 3586 -24333 -35992 -27381 -28239
21018 -28239 -37272 -38908 -14984 -7524 -12 14999 22409 19600 6031 12699 31569 21640 29613
21005 29613 26072 17243 -10088 -22597 -24643 -13224 9245 21633 12642 8688 -14492 -31895 -15782
20992 -15782 -5947 7497 47531 65905 51655 37969 32241 65006 66051 66267 50811 21582 20544
20979 20544 34131 40235 42027 44458 60248 49226 36318 29410 18399 483 1594 -9095 -6802
20966 -6802 -4016 -13592 -21817 -49228 -61487 -58333 -53103 -51642 -26043 11843 33312 35652 11430
20953 11430 7826 15653 11164 32483 46866 26537 29147 27463 46885 47873 34486 16048 24711
20940 24711 27383 31683 18373 -9639 -15201 -30331 -27881 -5151 37706 34515 39978 38430 31261
20927 31261 -1080 -17241 -5909 3053 6044 9254 -672 6867 9440 -10009 -15085 -172 15587
20914 15587 -7166 -26820 -19371 -29848 -11499 40 7569 26005 20788 -7844 -37036 -35484
20902 -35484 -12319 3506 6700 -1556 -2761 8067 18258 18860 -2888 -3057 -5479 -12438 2338
20889 2338 18916 18526 -15447 -21389 -6801 3372 665 14364 9763 3743 17317 11462 -15537
20876 -15537 8987 8070 6526 12831 16152 19657 17935 16723 17343 681 -15824 -21726 -18694 -20465
20862 -20465 -15150 -7718 2024 -5145 -452 -7361 -5441 -23136 -38154 -33574 -20871 -834 10366
20849 10366 6433 9200 -14799 -5537 -27682 -19821 -9588 -14827 -17287 -26804 -32121 -22230 9239
20836 9239 21379 28099 28996 10444 9248 -4250 10873 15423 9737 17670 31673 23918 34141
20823 34141 48681 26043 3804 -4350 -3559 -5614 -8397 -18479 -16046 -24253 -34016 -18746 -1613
20810 -1613 32974 46040 47678 54596 56015 34317 18692 18953 463 -16365 -16711 -27193 -34310
20797 -34310 -37785 -25544 -31384 -37307 -13799 13126 26016 45569 53099 28764 4446 -6797
20785 -6797 -5383 3905 15459 21073 13961 840 -19095 -32648 -44808 -34558 -24758 -19294 -15260
20772 -15260 -28206 -29812 -26473 -7463 -6367 -13700 -740 -7493 -10398 3778 22333 24839 25989
20759 25989 18528 8584 6643 3891 5595 -9833 11562 14829 14631 4568 5197 7542 13135 13461
20745 13461 11437 16241 2413 -3747 -15190 -22303 -19054 -18468 2839 -9126 -33570 -40875 -39295
20732 -39295 -47424 -48633 -36135 -25436 -9710 16095 23929 22262 4687 -11360 -28756 -10397
20720 -10397 12869 -7740 -16216 -4684 281 4554 -4495 -19300 -18777 -22771 -33205 -22875 -10602
20707 -10602 -4779 -4115 -4376 -7330 -1262 14473 13127 -5419 -30056 -18190 -11431 7692 21608
20694 21608 23111 35684 29224 19451 712 -5645 6352 -2070 -12861 -18131 -27101 -31968 -21349
20681 -21349 1763 -3389 -22376 -37917 -26131 -12584 -22239 -15914 -1989 -11838 272 -8066 5973
20668 5973 31850 30904 27804 26656 3835 -10260 -6311 -19247 -15676 -15884 -20911 -15871 -14538 9883
20654 9883 29693 27103 45337 37908 32420 34138 35003 25175 12732 -738 -7493 -1304 -12580 -15636
20640 -15636 -2932 828 -15276 1550 -13737 -19942 -4630 -8790 1077 7667 15597 18929 4020
20627 4020 -6158 -2540 12783 30621 35377 29215 6067 -355 -15023 -8187 3240 5720 10358
20614 10358 17918 8270 -10659 6094 -5899 7475 27954 27185 31126 14176 -6763 -17806 -16012
20601 -16012 -14538 6493 20377 7830 18826 30300 14672 7729 -10826 -5610 -387 -2969 1041
20588 1041 -1155 -12340 -13891 -9870 -11632 5627 -9 7491 3874 -10701 -12587 -20293 -3963 4003
20574 4003 436 7202 223 -17804 -7151 -5883 -1053 6358 18964 6438 9909 26217 21681
20561 21681 -4833 -14135 -20514 -19698 -3253 5257 11439 12674 8391 910 -4827 5001 -1166 8663
20547 8663 3311 15959 15912 22095 -485 -10224 -14085 -13331 2605 8501 45 -17553 -15343 -26038
20533 -26038 -17829 -4867 -6956 1036 -3786 -19386 -1428 20905 13578 14246 16897 -3756 -17536
20520 -17536 -17229 -8168 -13068 -26580 -43978 -23041 -12794 -13066 -5610 2529 21514 16910 28389
20507 28389 39750 20664 -2414 7944 -10525 -16977 1817 10562 -5209 -3679 11137 15484
20495 15484 -5075 -7036 -1152 -1782 -8453 -4290 -9595 -11629 919 19583 25962 12760 -1649
20482 -1649 -13421 -22703 -7435 -5382 -15049 2901 15481 7373 3010 16321 21750 -723 5310
20469 5310 31486 29764 20132 18972 13212 6702 19660 31293 37460 43209 22180 22198 21645 14815
20455 14815 3995 -6142 -7517 -16235 -23789 -23115 -12745 -19300 -17899 -20816 -30706 -12906 4420
20442 4420 5876 12732 2245 -25665 -18156 -15565 -2470 10622 22847 43271 43249 16895 9254
20429 9254 -5136 -10588 -12879 -8333 13885 18571 14278 -5783 -10619 -3304 7835 -3446 -6785
20416 -6785 1367 -3858 -10579 -2966 1169 13497 9199 8248 16390 21930 18021 12955 15800 22674 23066
20401 23066 23681 7277 5673 -7544 -5671 8069 23118 25992 22890 12634 21094 902 -13110
20388 -13110 -10061 -1403 6206 19186 31764 39273 19979 3471 77 2129 -20378 -35417 -5224
20375 -5224 19859 4643 -6408 -29908 -45788 -42638 -16599 -8322 -25119 -27302 -17293 7924
20363 7924 6542 -9030 -7490 -25966 -23989 -23624 -10500 13518 10189 10273 13885 20282 4757 -14895
20349 -14895 -3984 3636 1588 10904 16919 11650 -1265 -11159 -807 12430 19666 28275 31152
20336 31152 26865 23641 22773 14518 13489 21977 18915 22962 25049 18621 10919 -1865 -3308 -815
20322 -815 12828 -4595 -14404 7514 7860 6668 12854 20038 31123 26185 13669 19613 24120 16614
20308 16614 -1430 -20232 -15549 13495 8098 -4268 -16958 -9872 3522 -5989 5927 27795
20296 27795 26876 31526 31614 25632 31193 24588 750 -20498 -13568 20128 6233 9947 6186 -1705
20282 -1705 3180 9981 4997 449 -10891 -6874 3020 8130 21464 25850 18437 17930 21919 12249
20268 12249 18810 24177 18117 17668 21678 27297 23514 20991 17658 21672 12364 3549 -22770 -30895
20254 -30895 -32023 -22126 -14167 -11628 -16011 -11901 -17501 -21517 -19488 -11974 -8208 4761 7371 21623
20240 21623 32728 4464 -8655 -17591 -4309 20474 23884 22298 11624 10954 32433 37072 41171
20227 41171 39988 25766 -1185 -32360 -40153 -24925 -5475 -2172 -1355 2300 -6197 -8208 -16044
20214 -16044 -7388 -6436 5154 -2946 -17554 -21033 -18715 -5330 -5360 -8133 1533 -4923 -20195 -29746
20200 -29746 -37961 -43464 -23427 14927 22114 16592 31379 29804 30535 34811 28578 -2574 -7578 4905
20186 4905 5834 16428 1142 -19695 -31297 -14296 942 -7062 7469 13743 23769 26129 13981
20173 13981 7764 -11742 -18883 -16270 -19698 -13579 -10215 -5893 8769 9071 -13507 4222 16151
20160 16151 26428 36168 43341 43894 31740 28933 2794 -25722 -17669 -9424 1495 5240 3380
20147 3380 8255 20208 32736 48665 44256 52815 32815 30143 24588 11310 5970 24235 4816
20134 4816 -13212 -1511 -17769 -17800 10500 2624 -19044 -24453 -3977 3027 -899 6464 -3601
20121 -3601 -8891 -22845 -23515 -4329 -7646 -20438 -22597 -13021 -5456 -20380 -23603 -3261 15904
20108 15904 1524 -323 23457 25743 18333 4172 -15225 -8580 -9713 306 -7685 -1760 3203
20095 3203 20411 12053 -11844 -11330 14811 12562 13089 12648 4584 23636 10675 5459 -2635 -1076
20081 -1076 -13750 -17113 -20362 -26681 -24181 -4576 2799 -2421 -3850 11677 16650 -807 -19568
20068 -19568 -14826 12632 27311 16163 8307 9068 15933 17921 9240 12294 9240 -4444 2980 19650
20054 19650 57 -12893 -16012 -12975 -7059 -14729 -24818 -24811 -24776 -8402 -14197 2237 6938 9585
20040 9585 6901 7697 9634 -1810 2402 -3291 2731 11795 -2663 -9044 7135 16520 15839 18005
20026 18005 10468 952 38013 37585 32638 18179 5743 -8451 -4136 4326 6818 16999 33213
20013 33213 34761 29127 19985 4694 1903 -16850 -23524 -18016 -17219 -11195 -12344 -24582 -21199 -1450
19999 -1450 1640 5235 8019 10424 4230 -17975 -5520 8438 20623 32434 20852 9475 1521
19986 1521 -13695 -15587 -19620 -405 -1363 -13402 -7886 -2851 -5923 -16201 -16182 -4922 48 1506
19972 1506 6673 4574 8448 1338 -5557 -8722 3729 3609 13400 30220 28730 -17874 -28518 -17279
19958 -17279 -17262 4180 19424 34087 19224 20800 29277 30943 31517 22655 23400 20630 17191 -1417
19944 -1417 1463 17621 15156 -5028 -4934 7013 -5950 1218 -10574 -24990 -31385 -21544 -5225
19931 -5225 6829 3787 -12486 -26191 -5550 19104 14726 2413 9761 -1829 -22263 -15549 -4476
19918 -4476 4012 2957 -28328 -27185 -23243 -12965 2751 -2703 7293 32490 23261 10976 1270
19905 1270 -14231 -9105 -13339 4991 14998 34530 42346 32837 33867 38511 21582 -2169 -23936
19892 -23936 -9315 -12210 165 5807 12974 9762 -5579 -8380 -17576 -8578 414 -2924 -4465 -6832
19878 -6832 -27253 -31587 -20808 3240 12165 27612 49871 46856 12447 23950 22198 1936 -5146
19865 -5146 -6566 2024 17363 21571 1855 4401 -3488 -8121 4888 2169 3476 10911 11720 18253
19851 18253 7092 12248 24199 21729 20888 37235 11831 -10482 -15317 -16133 -17734 3817 12073
19838 12073 7798 2122 -2097 -6943 -17758 -17461 -22177 4649 23812 8286 11395 22642 18711
19825 18711 17475 11756 11229 13890 6919 -3458 -12886 12871 16933 -3319 -13043 -10471 8682 16838
19811 16838 7511 -9229 -34934 -39139 -31464 -7587 20751 26304 12157 4595 9377 20173 7813
19798 7813 4545 -5249 -11692 -11977 -15280 -5880 -4625 -75 31052 13370 -9087 -11648 823 3733
19784 3733 16572 12531 19030 7489 -6689 -32418 -26466 -15257 -16747 1019 8593 9145 23332
19771 23332 34322 24833 30289 20525 20682 21145 3611 19807 1394 -16694 -2739 8046 14926
19758 14926 2381 19012 34948 13220 -2854 4641 -3726 -3168 -9205 -17398 4690 15743 13600
19745 13600 14419 24429 27596 14215 -5625 -18214 -17234 -28397 -16361 14385 18304 4936 -3591
19732 -3591 -4498 3604 4724 -15627 -20185 -17796 -11792 -14067 -12775 2630 21747 16719 11181 20458
19718 20458 38770 32739 38861 36518 41335 20095 -4804 -15442 -15667 -9650 -14126 -26525 -19571
19705 -19571 1269 4231 5020 22747 28465 7863 -1008 -1381 110 27541 55002 53136 46787 35626
19691 35626 26323 19431 4966 -4605 -22197 -19560 -17293 -7177 17637 33432 22496 -7854 -17360
19678 -17360 1881 17454 18055 1730 -857 1039 6131 40605 36741 12762 10076 -6999 -11782
19665 -11782 908 7653 6425 935 12890 35064 34807 15790 -6546 -5750 4039 32667 44249
19652 44249 49754 44846 15654 7403 12923 12003 5039 -11931 -16969 -10674 -15099 -20648 -37742 -36125
19638 -36125 -33421 -31866 -32474 -32703 -33915 -14970 9827 16476 -3454 19196 39049 38118 4005 -7367
19624 -7367 10672 25183 35689 34369 22724 2348 -8153 -4781 13824 26124 16067 9223
19612 9223 -1068 -6868 -12879 -16094 -11317 13580 30252 37478 24038 3412 -11311 -16061 -6199
19599 -6199 -13028 -24088 -21817 -22984 -11791 -10325 13104 33207 24379 10193 -9975 -25241 -13680
19586 -13680 -14619 -21556 -17178 -2805 23563 38207 27141 -2359 -12053 10451 22798 31201 14089
19573 14089 68 -19890 -12615 -9365 -11059 -4882 -9368 18391 37275 24857 8051 -6984 -15020
19560 -15020 -8054 18681 33514 24383 6434 -26132 -40521 -24005 -21003 -28566 -42552 -30479
19548 -30479 7417 38302 52036 41489 23032 7968 17662 26464 19753 -3586 4295 9607 5836
19535 5836 11951 1344 -21250 -25702 -10702 17280 26483 24695 24441 15851 -4139 -5783 10579
19522 10579 8079 -552 -11667 -15326 -19492 -41417 -43890 -25127 -15951 -15705 -14377 -2056 -4160 2259
19508 2259 1144 5379 -1767 2658 11110 12839 -3886 -14523 -6442 5037 9695 20411 21437 24285
19494 24285 16973 15776 16845 20232 21409 16584 12008 9451 192 -12870 -13174 -8552 -2307 1175
19480 1175 -2821 6 -426 11631 10385 -831 -7846 -27792 -16002 -11545 -39737 -37665 -4643
19467 -4643 5589 1935 -11285 -35232 -41815 -40220 -40445 -47390 -52095 -48025 -31318 -24207 -12721 -12873
19453 -12873 -14142 5158 18658 25520 1541 -13090 -3120 -1031 -6201 -25380 -36900 -14397 5307
19440 5307 908 -4019 -9678 -22134 -7250 7142 917 -17205 4043 23688 16584 15723 12739
19427 12739 18797 19187 6146 1688 5874 7282 1907 1679 -1235 8461 10762 22423 28023 20357
19413 20357 20397 20023 20711 20436 1936 -15206 1817 3901 5281 -176 -16536 -28591 -26005 -20680
19399 -20680 -2237 10804 1734 -20090 -19127 4504 24832 28208 16232 446 -19323 -4710
19387 -4710 3371 -10405 -13252 -14143 -5186 -1921 9210 2545 -12488 -20336 -10501 -3756 1795 -6677
19373 -6677 -16823 -5287 20397 28960 20525 18052 -6651 -17107 -17338 6818 5721 -13994 -10481
19360 -10481 -6517 5694 10470 3146 2841 -893 900 5835 -1329 -2337 12821 7897 6042 6893
19346 6893 -9595 -4408 -5279 -8328 -9730 -3749 5620 -13325 -14303 -837 88 -4576 -21823 -27712
19332 -27712 -19253 -14138 -1215 16887 26823 43731 21363 12846 10837 6423 -4589 -19725 -28634
19319 -28634 -10738 148 -855 3421 1576 -10339 -14699 -21434 -5193 -6457 -14537 -32113 -36254
19306 -36254 -32207 -15626 -15903 -4946 8685 -3370 572 16551 25462 44300 43952 24956 16362
19293 16362 -5331 -21747 -5461 352 9831 17680 12825 9112 17122 811 11285 42715 33014
19280 33014 7362 -4940 -8394 5916 30874 27769 -10950 -12047 16163 7468 -16265 -23167 -11275
19267 -11275 16538 17662 2763 -7621 -12511 -3273 -12478 -23511 -20386 -14090 15129 27519 34413
19254 34413 11962 -12470 -6791 -2792 9915 13769 -309 -579 -11263 -15877 -14340 -3713 -11905
19241 -11905 -10081 4680 -7036 -3903 3269 8291 16739 24668 18688 8908 -3110 4957 21936
19228 21936 6525 887 -12210 -16111 -8607 5531 -7396 -3232 31269 32194 13040 4541 1898
19215 1898 5657 5794 -2912 -8987 -29083 -27079 -4765 3190 2898 -6393 13082 24066 11343 -14771
19201 -14771 3271 4661 -10962 -13007 -8093 2211 21339 18051 15616 6602 -12596 -6485 26212
19188 26212 22818 -10199 -14244 913 6081 7188 4145 2777 -14850 -5437 -4163 5922 17653
19175 17653 -1244 5671 -4859 17789 28494 10931 13594 10762 12577 20081 -6096 -5469 1410
19162 1410 5316 -13311 -9490 3192 17762 16244 19060 48897 38145 33877 20318 13467 16986
19149 16986 16153 36313 43697 31511 3810 -8937 2855 11248 37165 41445 37013 4732 -12766
19136 -12766 -26169 -12192 -4486 -3001 -6256 -7674 10055 25545 28066 7778 692 -10657 -27502
19123 -27502 -38161 -38637 -10546 -4666 -8205 -4045 -5746 -14514 -21347 -32031 -11651 -653 -11287
19110 -11287 -27475 -43675 -35451 -16552 -12362 5823 33644 32116 11254 13885 21520 13375 2678
19097 2678 1022 -13485 -14222 -4574 -11161 -7577 -3829 -10426 -1953 10061 13595 -5269 -24192 -21462
19083 -21462 -10929 -5847 -8912 -20189 -30789 -38212 -34330 -12770 -2737 11169 1072 1476 1672
19070 1672 8796 981 -3437 6032 -1110 -13334 -23683 -23569 -10604 9367 24427 -114 -7574
19057 -7574 1389 4596 1687 -13420 -12465 -7123 -16377 -3534 22278 26337 15523 6281 1840 17236
19043 17236 12205 21228 38751 24592 -633 -13364 -17574 -27890 -17090 -4919 6247 22
19031 22 -18058 -20888 -6872 8828 5783 -10532 -17440 -27196 -21674 -1875 5355 5048 11283 11294 5898
19016 5898 6887 22978 9925 8644 2479 -1193 -327 -6168 5160 17069 11665 10559 5947 10688
19002 10688 15011 4745 804 -7695 -16735 -15687 -10409 -22595 -22121 -16291 -16077 17352 18125 15930
18988 15930 6634 -8266 3818 18908 21294 19228 13876 11827 13845 8901 -5771 -24824 -26720
18975 -26720 -19213 -26640 -29140 -21374 -25025 -30144 -19319 11327 14171 -1420 -13901 -4056 14008
18962 14008 -7576 -8865 -3577 -10013 -19626 -11021 6285 3819 -1127 -13155 -8254 4849 7188
18949 7188 12351 18895 35831 20294 6485 6982 20390 28564 16958 13831 24666 17337 5204
18936 5204 -10820 -14331 -14634 -12641 -1339 -6912 4877 11678 11174 -6143 -19594 -10558 7325 19664
18922 19664 10479 495 8751 10705 18561 13872 -318 -8904 -13009 -13756 -20287 -30773 -46999 -39382
18908 -39382 -18826 -5884 11417 17531 17644 30456 37413 22433 -4164 -19688 -19339 -3690 10848
18895 10848 20103 22634 10079 -5421 -1400 -46 -4273 -2622 6066 -476 4268 5256 -3313 -9294
18881 -9294 -14179 -2249 12723 12343 -4056 -22877 -21460 -1424 14823 10937 7998 2541 -170
18868 -170 -12627 -13694 -3928 -3378 9577 16849 25622 33377 36543 32619 27539 2068 -795 -2270
18854 -2270 -8335 -16418 9863 17773 18469 -2007 -8615 -3702 -9910 -19866 -21288 -10790 3128 6927
18840 6927 4147 -17119 -23743 -34094 -20237 -6147 -9404 -15921 -33500 -18286 -30620 -45167 -40402
18827 -40402 -20215 -20084 -22310 -985 14349 -10555 -24067 -13267 -966 92 -5645 -3207 -13935
18814 -13935 3056 7504 19553 11794 3559 20071 23842 14459 26235 27616 23367 18677 18355 22325
18800 22325 14198 11841 13431 8747 5006 16001 21442 16828 1760 -4369 18465 30164 19230
18787 19230 19298 7817 9498 7307 -12722 -17341 -6715 -8842 -21596 -17884 6442 -4376 -32159
18774 -32159 -43835 -27528 -38782 -49615 -48895 -26545 -17046 -26888 -11792 8742 -740 -26411 -25216
18761 -25216 -7633 936 4750 9332 7774 -13077 -21249 1182 22886 13731 -14 -10344 -17975
18748 -17975 -22937 -21112 -18029 -17927 -27103 -25197 -5575 9458 13439 10449 21121 47941 42327 10971
18734 10971 7038 14525 13668 1223 7813 37605 34496 6086 -28908 -38347 -2824 12244 7050
18721 7050 -477 12851 9236 17127 15213 24119 15981 3720 -23508 -7244 -4891 -14399 -16223 2292
18707 2292 2898 1621 -8456 2921 30491 24272 8105 9979 6597 -25123 -23123 -8443 -19508
18694 -19508 -23641 -26700 -38608 -42494 -34080 -33208 -24801 -15977 -8614 23 -5442 -21766 -23656 -16182
18680 -16182 11001 24021 13954 1503 -7066 -14107 -16378 -27607 -28772 -28273 -10911 -11004 -4494 16609
18666 16609 8577 -15081 -14098 -25619 -42175 -39761 -26854 -10398 -28640 -35445 -28948 -31687 -39494
18653 -39494 -38326 -12218 8193 194 -5831 -1435 3628 15441 30452 29769 14777 7206 7970 10271
18639 10271 17476 27702 12133 -18788 -34398 -24352 -22302 -6881 6253 16557 19302 46700
18627 46700 46750 34515 25908 11517 -9336 -9932 -6531 2661 3551 -12896 -41070 -40361 -42688 -30884
18613 -30884 -14619 -2800 1149 -735 9344 14438 10911 -6053 -8159 -708 729 -692 10226
18600 10226 5369 12 1242 12261 4510 -21312 -26907 -26865 3205 17546 7241 13136 15393 28918
18586 28918 38494 32477 7069 289 6027 -11691 -25734 -28055 -6509 5694 10792 5826 -18434
18573 -18434 -29681 -27566 -15810 -12555 -13073 -12496 -7598 -13979 -974 3749 13880 15895 -56 8894
18559 8894 25588 18852 14490 35819 37812 12945 -7337 -7398 -7249 4514 -14519 -13984 -4027 -19173
18545 -19173 -27162 -14756 -2950 -14702 -13716 -10047 -13149 -18934 -32718 -35461 -14576 -3141 -9357
18532 -9357 -4276 -7216 -14267 -4485 -10375 -6665 -23668 -29964 -35620 -21448 -3651 -1704 -7083 -9345
18518 -9345 -12979 -7569 3495 240 6425 8809 8671 -8004 -23466 -49904 -41847 -27978 -8489
18505 -8489 -580 -15833 -34402 -36362 -29003 -19159 -29851 906 13312 -55 5027 -5987 -17473
18492 -17473 -20695 -12902 -5281 1826 574 -22835 -18368 -9150 -13654 -16376 -9700 7370 6248 289
18478 289 -12346 -20198 -23905 -21102 -33927 -30939 -23442 -16138 -22630 -9359 6312 9761 7932 13464
18464 13464 11907 24382 11283 -2695 -8103 -9081 -15599 -6102 18463 18446 23071 30448 17313 16245
18450 16245 15625 4660 9022 986 -18454 -21930 -20153 -9185 -15075 -21349 -9409 3756 7990
18437 7990 16633 7314 -201 6642 3858 -9064 6582 5266 7053 -1882 6748 -1310 -21154 -27172
18423 -27172 -21060 -26785 -27383 -9588 -3413 -16690 -8218 8290 19237 2637 8404 5185 -1372
18410 -1372 -973 1018 -11400 -7381 -13192 -19146 -6751 -69 -838 2837 886 -10378 -13935 -20910
18396 -20910 -8841 -2406 9621 -8274 -22439 -11393 -14271 -23440 -8806 404 -2403 -2871 -1700
18383 -1700 -7687 -11722 -16141 -7039 1849 -1007 1447 -826 -2425 336 -19675 -35411 -25952 -10710
18369 -10710 -1720 -15157 -31426 -11764 28852 42831 24614 365 -27269 -18053 -10277 -13422
18357 -13422 -21604 -19171 -4461 -1359 -20584 -8637 13945 21059 11410 22831 29927 23506 5493
18344 5493 -19222 -32578 -26688 -7046 -3640 -1180 8011 -933 -16819 -30954 -20797 -20494 -17186
18331 -17186 -20972 -29580 -26463 -11980 15470 30900 18763 6224 -7190 2754 -761 -21121 -12307
18318 -12307 -1205 19380 16708 -1434 -32559 -44789 -35645 -37909 -28496 2719 8574 17844 -3970
18305 -3970 -15494 -8033 -9708 -12220 -7759 -5928 -10420 -3161 3925 6947 20672 25721 17473 -2205
18291 -2205 -2743 13613 6882 2842 7719 17468 7468 5468 -565 -21600 -20255 -29966 -54095 -51137
18277 -51137 -43296 -12849 31947 22690 724 -9662 -9946 -15947 -17094 -7365 -8961 -14051 -15913 -16065
18263 -16065 -15859 -19113 2654 4635 12029 23472 5220 -15465 -23524 -14245 -9459 -13520 -24624
18250 -24624 -31322 -42511 -30856 -25574 -40691 -36988 -28391 -35637 -49519 -63022 -39673 4116 450
18237 450 -6322 -3012 -15013 -9415 9548 21919 8463 -16120 790 -6577 16268 38713 58726
18224 58726 60572 50000 49774 56385 41892 30581 30668 19493 20634 14701 -5512 -6292 11895 18026
18210 18026 34503 56273 43707 32438 31799 29836 11104 -5382 -1284 3847 11621 2137 266
18197 266 4984 -1418 -16492 -26553 -25852 -6818 -1687 -10323 -18386 -20564 -8560 -10308 7982 17809
18183 17809 -7465 -20724 1806 -3542 -8300 -11647 4055 3726 -7513 -13932 -19248 -8352 -8025
18170 -8025 -7576 -14625 -25498 -26273 -22860 -24268 -8212 2830 -6978 4316 7343 341 -16535 -29603
18156 -29603 -23865 -16027 -4212 -10355 -982 -1158 4902 22112 6597 -21668 -38488 -35428 -35143 -12278
18142 -12278 5770 9790 8739 13753 5334 4073 -19076 -21386 -16570 -15646 -23820 -30375 -20996 -21943
18128 -21943 -26764 -20988 -15112 -2848 -18345 -28417 -24332 -2704 8 913 -18042 -14004 -5692
18115 -5692 -12203 -16509 -17520 -12860 -15917 -10701 561 12438 -7196 -7432 -15405 -26698 -16647 -8616
18101 -8616 3023 6494 -10866 -13194 -15 -748 -17 9308 1750 888 -12873 -30527 -37451 -16271
18087 -16271 -5570 -11994 -234 6301 10629 -9078 -6851 465 5357 17164 12569 -9983 -3502
18074 -3502 -1645 -3597 -2609 16953 21381 12609 8162 -4118 -19380 -30105 -33687 -29146 -29871 -24832
18060 -24832 -33351 -10333 -9437 8294 12202 12147 -6221 -17579 -15347 -13363 -18257 -12718 -19608 -33169
18046 -33169 -33575 -15227 -3873 5353 5318 -2992 -8817 -25872 -34815 -33176 -24024 -20178 -1003 9626
18032 9626 5208 -58 13102 -6198 -24192 -35175 -25195 -1219 15956 23999 23488 -5659 -21368
18019 -21368 -22204 -31438 -38387 -9461 -12548 -19331 -41626 -25812 -720 -13378 -32529 -32532 -14583 7316
18005 7316 -5719 -4453 -15654 -23783 -20295 -18762 10306 18746 21956 42161 33558 29039 17554
17992 17554 5969 -1313 -14747 -9185 -4260 -6611 -15191 -2054 3832 -16212 -26199 -15902 -14781
17979 -14781 -7560 -20301 -20622 -14383 -1144 10355 5285 -3402 -11947 -14482 12256 19733 10390 -18735
17965 -18735 -16805 -19061 -10001 11426 26706 22578 9491 7337 12990 15417 25677 17223 -1835
17952 -1835 -7239 -11043 -5209 16282 2472 -18818 -6393 -151 -8495 -5706 6056 -6541 -13016
17939 -13016 4118 8356 13068 1576 -1175 5603 -39 8044 -15395 -19525 5645 12347 8413
17926 8413 14715 21250 24045 23024 10829 7949 1493 -9430 -12229 -28636 -12690 5487 11938
17913 11938 15115 7287 9849 12319 3824 15051 14297 -5887 -21599 -12893 -17274 -14737 -8852 -11052
17899 -11052 -34038 -37388 -21186 -36013 -52314 -40370 -27608 -16136 -8156 -10207 -15059 -25187
17887 -25187 -30161 -31001 -33336 -51312 -38022 -32535 -26743 -25466 -9578 -527 -10895 -17277 -34887
17874 -34887 -39597 -47118 -46795 -56687 -57604 -30164 -12781 -2978 233 28608 10299 5376 13920 -4297
17860 -4297 -12962 -3801 -8258 -12088 -2450 6403 3379 4018 8871 20459 11066 12604 -6858 -5050
17846 -5050 -9608 -25754 -23285 -12728 -21897 -16158 5135 11305 4607 8349 5018 -2514 -16615 -27693
17832 -27693 -29959 17811 26857 -3030 -11013 -14764 -26044 -32872 -30400 -13824 -3889 -4036 2817 14554
17818 14554 14205 -860 -20381 -29680 -17412 -11252 -6626 67 -338 2692 -7561 -16979 -13029 -9583
17804 -9583 -459 -5621 -13456 -12609 -8672 -18196 -11914 -1290 5502 -9332 -15337 -25024 -21364 -13732
17790 -13732 -6211 -7953 -15149 -11824 -1683 -5771 -32506 -20532 6411 1920 -17725 -22026 -10096
17777 -10096 -12141 -7162 3956 5197 -7540 -8281 4917 10466 -1106 -7110 -13130 6493 21766
17764 21766 6339 -21354 -31924 -29060 -44397 -38351 -20652 -18282 -3338 -6929 4513 8825 -7030
17751 -7030 -10142 -14637 -1792 -19569 -30931 -26117 -15234 -14516 -6900 -2816 -16075 -8368 -5510 -20715
17737 -20715 -16004 -17923 -32926 -21378 -24169 1578 4486 -20977 -28990 -35585 -39156 -21349 -10947
17724 -10947 -5842 9672 18054 6091 -3794 -7794 -22216 -20711 -38364 -38727 -19152 -28790 -45660
17711 -45660 -57585 -43175 -14712 -6897 -26228 -38690 -56372 -46564 -32291 -29144 -37864 -1281
17699 -1281 17086 16946 3912 -18623 -30573 -31538 -39337 -12923 -26231 -36116 -44968 -43972 -33751 -14902
17685 -14902 -8508 -7011 -26464 -41453 -65899 -51395 -22846 -13152 45 -9793 -8552 -13270 -31406
17672 -31406 -24441 -23605 -27641 -22950 -28354 -41661 -26767 -14370 -11230 -16311 -29633 -32172 -26776 -44319
17658 -44319 -45101 -27405 -29861 -33785 -32946 -54366 -66542 -47258 -35393 -31251 -13442 -5768 -22608
17645 -22608 -27097 -5926 14088 11562 6377 -1704 -5344 5157 -4859 -14276 -7262 -18410 -31234
17632 -31234 -33125 -22885 -14298 -16920 -17739 -11727 2026 4365 13002 -6795 -7366 -2886 54 -17884
17618 -17884 -9616 -4797 -16359 -26935 -3627 17357 12362 10969 8644 -7465 -33301 -19078 -1969
17605 -1969 -18889 -15558 -4213 -2740 11847 -13200 -27055 -34499 -27100 -8438 7472 6992 451
17592 451 979 -13972 -17647 -5083 -5668 -19747 -13443 -8159 -16824 -22316 -30857 -42150 -50893 -58969
17578 -58969 -64561 -60845 -41497 -52744 -42572 -31118 -22649 507 6182 -7184 -15213 -11074 -22427
17565 -22427 -23685 -35551 -42323 -20354 -21832 -19303 -4915 10943 -5740 -21752 -34190 -21303
17553 -21303 7914 5281 -7364 -32135 -55249 -45425 -32836 -23440 -38426 -48227 -30548 -24328 -12415
17540 -12415 1596 8451 6927 -4937 -8804 -5998 -15316 -26150 -28828 -37305 -36696 -52679 -53557 -55061
17526 -55061 -33014 -13800 -575 -19761 -15226 -24130 -29438 -28362 -12769 -12008 -24663 -25257 -19786
17513 -19786 -19193 -26251 -24110 -15318 -24714 -21110 -7562 -659 -6354 -12741 -22275 -20591 -23294 -22718 -3618
17498 -3618 -14444 -10115 -15839 -18390 -19137 -10281 -4421 -13095 -26846 -7295 -5740 -24530 -43271 -34290
17484 -34290 -14928 4107 2797 -19029 -9231 16833 11914 -3396 4384 3308 -14770 -12945 -22305
17471 -22305 -25132 -15824 -13559 -11327 9255 8415 -6688 592 -20188 -22782 -13080 150 -14961
17458 -14961 -3963 5347 -3584 -37291 -8437 9031 -5726 -10212 -27070 -29338 -30297 -19832 -9454
17445 -9454 -16436 -7006 -6006 -18702 -13361 5545 23695 16022 3090 -14410 -27095 -19652 -29753
17432 -29753 -38122 -20915 -9725 -13438 -6104 6680 -1745 8215 10228 15691 11028 9387 670 3058
17418 3058 -1151 -22968 -31135 -34907 -37695 -31702 -28584 -12590 -15092 -17615 -8911 -2069 16066 28750
17404 28750 20322 7379 -3911 -8407 -2738 6240 11730 7161 -1749 -15831 -12437 -14493 8026
17391 8026 18996 20819 9516 -3304 -6123 -11380 -18694 -7391 -10442 -10632 2293 -886 -14707
17378 -14707 -31953 -50428 -44349 -16769 -4667 -10981 -10071 8648 25789 42234 30842 13028
17366 13028 7714 2763 -6847 -16541 -782 6694 -13345 -30476 -26200 -34456 -34912 -35922 -35493 -36818
17352 -36818 -41857 -50610 -62912 -55800 -41070 -31763 -19548 -15237 -20456 -15847 -5077 7078 17258
17339 17258 -3797 -14862 -36735 -25999 -24479 -22855 -12734 -10644 -4165 -7425 -15805 -15692 -7896
17326 -7896 -38861 -48400 -56149 -56429 -49496 -24526 -3621 -11539 10531 31224 20718 8865 -8209
17313 -8209 -33167 -65433 -66962 -45192 -23809 -10759 -21659 -19258 -13476 -7989 -18388 -25774 -31624
17300 -31624 -27053 -28186 -16090 -8892 6694 -4105 -46131 -57660 -48637 -27052 -31194 -47228 -37965
17287 -37965 -15777 12173 17625 19383 -8 -29412 -37581 -37441 -21749 -24194 -33042 -30916 -29179
17274 -29179 -35060 -40414 -48244 -34622 -24487 -29713 -40656 -28166 -10867 -20433 -12861 -3189 -11925
17261 -11925 -15440 -16355 -13775 -15255 -27045 -24062 -25696 -25441 -35094 -38159 -27531 -19473 -26813 -34852
17247 -34852 -39003 -37160 -31012 -16256 10592 14096 4296 -2004 -13352 -13696 -18987 -3957 5674 -7307
17233 -7307 -11004 -15408 -13774 -3229 15473 1345 -3981 -11468 -11513 11748 -6061 -2543 14424 5857
17219 5857 80 26581 37401 31307 43544 39041 15490 -3521 -21542 -38556 -35917 -7536 21877
17206 21877 31699 16548 -6579 6502 19673 36907 21416 -5229 -20500 -8347 13772 9664
17194 9664 20845 25646 21522 17383 30343 31423 23820 12281 2230 6800 4587 -870 -2060 3617
17180 3617 10030 18296 9092 5742 12117 834 -17401 -11556 13184 21713 12664 11258 -16345 -20730
17166 -20730 -24174 -18811 -10209 -19794 -38417 -66932 -58668 -46298 -19468 -19739 -10938 -9967 -11134 -3830
17152 -3830 1631 -16297 -22817 -15082 -8894 2206 -1241 11488 20057 39716 33927 33291 43778 24420
17138 24420 8798 2164 -6917 -16069 -15708 -18999 -28742 -26000 -29440 -16843 -5478 -11805 -8582 -29678
17124 -29678 -35584 -23823 -12860 -20688 -18186 -22186 -32637 -41409 -47002 -25476 -14584 -17288 -31941
17111 -31941 -33847 -54188 -72684 -75328 -69313 -63984 -41740 -40586 -35109 -31432 -33561 -30960 -20036
17098 -20036 -29504 -13291 13403 19489 13968 7217 8100 -4401 8860 8624 10874 -2973 -4171 -17429
17084 -17429 -27156 -43536 -40299 -18336 -5125 15847 -6972 -19831 -21652 -27572 -33822 -41142 -39706
17071 -39706 -36533 -63040 -48089 -34400 -41630 -47877 -30242 -47182 -62488 -45371 -24753 -16927
17059 -16927 -32862 -36865 -45639 -39607 -28904 -5934 -10102 -10897 -29800 -39277 -35632 -32534 -34757 -38508
17045 -38508 -30063 -28805 -31226 -28704 -8354 -4498 -7632 -23603 -25363 -32376 -37387 -24449 -8013
17032 -8013 -5796 -6191 -14682 -8928 -15652 -1593 8634 -8044 -39908 -52652 -30648 -3621 53
17019 53 -25451 -36270 -28153 -22160 1524 8868 -9225 -33012 -45949 -37508 -14640 -19635 -3215
17006 -3215 128 5158 3673 -8770 -17429 -14315 -6001 -7593 -17930 -25383 -29659 -20510 -10427 -28967
16992 -28967 -38343 -18156 -6367 -3104 -4022 -10621 -22397 -26134 -26558 -26343 -35790 -17505 -11133 -10817
16978 -10817 -9351 -10807 -10579 -32098 -26975 -29054 -28265 -26882 -30551 -14499 15335 6243 -17715 -28485
16964 -28485 -36856 -35724 -43999 -48020 -44565 -11372 -9898 1197 -5112 -14914 -13188 -20225 -35181 -28571
16950 -28571 -31753 -33098 -30023 -19250 -7966 -6 -11161 -4600 4528 12234 22297 23010 20351 -6871
16936 -6871 -17601 1774 7375 5588 5123 14515 19410 30989 40455 30754 -5842 -29158 -35677 -24704
16922 -24704 -17589 -6328 2286 -6235 256 -5176 5230 2469 4991 -9595 -17780 -15141 -10282 -3726
16908 -3726 -10038 -18682 -15874 -17515 -22334 -28505 -8548 -13435 -37256 -39665 -38527 -22583 -1948 -5858
16894 -5858 -3136 -7665 -21029 -37004 -45820 -46630 -36242 -17158 -2109 -2456 -5515 856 8203 -1573
16880 -1573 -8316 -10147 -16639 -21222 -18971 -16316 -30684 -35968 -38929 -29932 -23069 -13051 -23543 -46565
16866 -46565 -53003 -52079 -60838 -29614 -5075 -14676 -32209 -35242 -22204 -30556 -45399 -67414 -65857
16853 -65857 -55039 -62678 -66396 -40242 -25509 -30985 -40871 -29629 -27149 -11415 -26177 -17369 -9388
16840 -9388 -25952 -40776 -35110 -17217 -18409 -23312 -30921 -24319 -14952 5412 15987 -5675 -19377
16827 -19377 -17644 -19033 -24447 -19759 -25302 -33587 -29134 -15744 -25198 -20932 -14393 -21847 -20216 -19054
16813 -19054 -24974 -30985 -22556 -27662 -22064 -38082 -49817 -58444 -44688 -26803 -49357 -54146 -29326
16800 -29326 -23662 -30701 -8946 -6684 -9031 -15495 -22827 -21419 -25780 -34029 -35096 -23971 -905 1188
16786 1188 -2162 -9414 -30363 -29186 -14634 -23646 -38547 -44538 -38354 -26007 12066 13340 2619
16773 2619 -21828 -44288 -54766 -59150 -50110 -56534 -45009 -24016 -4887 -2118 -7387 -15533 -22944
16760 -22944 -35308 -43632 -28066 7339 2995 -24016 -44421 -35141 -22399 -22315 -3341 -9791 2380
16747 2380 -7344 -16171 -3747 -4721 797 -24145 -48286 -39703 -28599 -31866 -32675 -33506 -31543 -22160
16733 -22160 832 4819 -23258 -50289 -59320 -46256 -33882 -21130 6459 -4813 -12864 -15294
16721 -15294 -10128 -5587 4594 4986 14011 19877 -15687 -42848 -44207 -35956 -34048 -43120 -45364 -23738
16707 -23738 -25810 -20841 -13697 -14601 -6968 -297 -11140 -29524 -34499 -23975 -18407 -37216 -35292 -32374
16693 -32374 -19665 -3313 4574 -17811 -9432 -19141 -15822 -26709 -28242 -18339 -15012 -26619 -46484
16680 -46484 -55494 -68675 -67918 -63461 -52935 -41341 -23250 -16015 -27010 -34681 -11846 6310 20411
16667 20411 8277 -10045 -27282 -24151 -26668 -24166 -25805 -25804 -30098 -19637 -12560 -25090 -11141 -8980
16653 -8980 -10891 -6591 -20904 -30734 -36226 -37614 -28911 -9888 -19344 -45833 -38869 -24232 -32477 -45084
16639 -45084 -46180 -47518 -36151 -23195 -22787 -22604 -32837 -21695 -17607 -7627 7450 3876 -3618 9856
16625 9856 -21565 -48075 -47353 -41557 -47380 -49442 -33174 -21781 147 20244 37074 28298 8776
16612 8776 10468 10578 -4242 -20961 -32700 -48608 -46069 -37011 -55352 -56822 -36255 -2222 5564
16599 5564 -8803 -9412 6017 261 -27260 -51637 -23856 -32180 -44218 -34113 -22088 -15234 -11181
16586 -11181 4373 22744 19135 4791 4254 -6903 -25427 -25467 -22290 -10024 -5247 -18459 -14387
16573 -14387 -1295 5973 -7705 -11754 2832 12710 11793 -7844 -13785 -22 12711 17582 9822
16560 9822 9392 3863 473 -14200 -29710 -39546 -29780 -26332 -25190 -28874 -13115 -20519 -15081 -5771
16546 -5771 -22291 -21014 -8488 -1170 640 -17687 -18063 -24268 -19628 -23385 -15693 -18244 -16491 -21728
16532 -21728 -42373 -51229 -34808 -24287 -28386 -6953 557 -5999 -26627 -34201 -38546 -40101 -18610
16519 -18610 -22865 -24384 -26511 -23246 -28372 -35209 -44314 -51123 -32309 -33510 -27252 -10972 -22704 -40936
16505 -40936 -59009 -70845 -77515 -72730 -55053 -54187 -55822 -39294 -29464 -28330 -29683 -14808 2162
16492 2162 1123 -8414 -20652 -21738 -38155 -32040 -29159 -23634 -6923 10935 16894 -2254 -2241 -4470
16478 -4470 -18551 -26110 -11922 -28703 -41663 -29697 -29567 -23863 -26342 -37597 -39975 -46536 -71158
16465 -71158 -84285 -66431 -28723 -8123 -9215 -33042 -32127 -11917 -15804 -24521 -12987 -9921 -19419
16452 -19419 -40790 -34984 -12614 -15297 5293 14927 22089 24751 17296 -3600 -23883 -27655 -39954
16439 -39954 -33264 -26682 -21400 1031 2201 -16431 -29411 -34040 -21098 8465 -19760 -50960 -73479
16426 -73479 -86957 -66387 -26120 -18427 -18547 -4427 11875 -2377 -25566 -25318 -21884 -35845 -25709
16413 -25709 -22959 -35722 -19251 -29306 -46877 -57486 -56343 -37612 -18134 -23737 -34156 -47268
16401 -47268 -53162 -44295 -22334 -26058 -23777 -29826 -25689 -15998 -19921 2358 -209 5487 -4511 -1742
16387 -1742 21975 35228 30318 38354 65669 87557 108429 131707 198014 313208 470722 737508
16375 737508 1167462 1636153 1835633 1820616 1782785 1812217 1958199 1975213 1750731 1409905
16365 1409905 1071819 750558 524789 382086 285009 225019 169063 134849 132532 118818 88653
16354 88653 71079 67171 66009 62224 36501 20655 25005 36211 49609 60330 50311 16926
16342 16926 -21769 -33753 -3353 26589 44367 35530 10552 -20623 -28076 -21781 -35381 -19655
16330 -19655 3909 10551 13016 17511 2287 5615 13041 170 22673 20881 -15926 -23587 -8276
16317 -8276 -5994 -15480 -35165 -37511 -17632 -16686 -21089 -14745 -16170 -2653 9870 2725 -18611 -10148
16303 -10148 -1595 5434 25880 7199 -26686 -38409 -24489 3855 14597 -7887 -7746 8610
16291 8610 22752 26821 33605 8654 10644 14491 11999 10566 12982 18713 38334 52441 56539 31895
16277 31895 21993 15202 -981 -17946 -20565 -4686 -31105 -52936 -62622 -83743 -67756 -58852 -48247
16264 -48247 -61872 -95054 -101992 -76151 -31312 -463 -1349 3800 9983 32194 19662 -18189 -14379
16251 -14379 -14669 -32011 -52077 -43150 -44629 -28380 -8524 -7073 -20922 -17483 -12665 -5575 -5684 -20628
16237 -20628 -18743 -20752 -28303 -28467 -21559 -24287 -29830 -18056 -13867 -7784 15126 30108 36255 28750
16223 28750 12429 2114 -5812 -7208 -3596 10683 -547 -22031 -27239 -22276 -2981 27369 40960
16210 40960 11427 -5215 2687 1830 -3925 -6025 1460 -6542 11546 13549 20521 18848 12423 8737
16196 8737 22436 37023 39220 39073 52344 62346 34102 8888 11905 3569 -6001 -11404 2422
16183 2422 -475 -5418 4927 -24331 -33077 -38389 -29406 -45901 -55663 -28502 -24262 -32217 -30120 -14670
16169 -14670 -1782 -9377 -5644 2485 4793 -1391 1948 8896 16730 21791 28821 32317 19227 30232
16155 30232 50170 63916 43215 20865 -7635 -33947 -35752 -12277 3815 16539 2743 2769
16143 2769 1881 10744 18748 22629 42500 61915 43118 38053 30727 7407 821 -598 -13382 -17235
16129 -17235 -25086 -23095 -4722 8880 3325 -6006 -4306 -26514 -31642 -43422 -49742 -54184 -40174
16116 -40174 -44469 -44835 -54777 -70074 -63770 -33045 -7427 19000 6130 -8631 -6786 -22139 -24514
16103 -24514 -4610 15560 10664 -3400 -2474 16202 17728 9231 4 -26397 -32538 -24864 -26432
16090 -26432 -23082 -18844 -41063 -53133 -58353 -80215 -89863 -55625 -31555 -21910 -10102 -20212 -24202
16077 -24202 -43343 -28111 -8411 -15717 -1326 21494 30622 15971 11155 37297 49471 19733
16065 19733 17142 45543 73436 91210 88203 112115 145271 192165 188784 154796 143578 149224
16053 149224 152288 138724 145711 172621 197677 157960 90500 79796 93664 89107 74605 56078
16041 56078 44975 22685 -2175 8344 18223 3602 -17431 -19815 -32664 -43351 -14674 -12882
16029 -12882 -19868 644 17661 28815 21542 24175 9274 390 -17053 -28984 -29364 -18301 -7359
16016 -7359 -11268 -23294 -24496 -43319 -55610 -45000 -23183 -28559 -59547 -57845 -44649 -53924 -74049
16003 -74049 -107242 -92920 -61290 -79388 -89641 -116304 -151281 -153925 -131385 -89285 -78427 -91057
15991 -91057 -110687 -106584 -80525 -40550 -26828 -35349 -32465 -33091 -12641 -975 -3065 11998 -493
15978 -493 -7384 -20556 -15544 -4634 -21809 -36362 -54175 -65506 -70047 -98100 -102548 -99108 -86169
15965 -86169 -68915 -41054 -1162 36133 43975 65433 91649 92765 89621 83593 73900 78555 84782
15952 84782 81009 88809 105702 120014 174226 339316 617914 854117 899849 841665 823060
15941 823060 884628 991322 985314 804533 596243 400060 255366 178984 140162 87820 48474
15930 48474 27346 33541 50959 45946 65379 80142 97366 106300 123592 149680 166428 155508
15918 155508 137575 140894 127089 108205 88949 77505 69690 58045 62367 73171 80709 86384
15906 86384 78302 61520 36795 -7486 -58006 -66130 -60902 -52021 -50018 -59937 -85118 -87726 -63466
15893 -63466 -37860 -7705 34266 51450 71000 81650 102287 134439 184074 232805 260170 269764
15881 269764 305100 398292 516995 718610 1070740 1572409 1915004 1930022 1865348 1852989
15871 1852989 2017046 2158362 1961710 1595084 1243214 922644 667695 486911 361445
15862 361445 288864 287860 321642 364846 399688 397181 379052 415049 475131 501071 494134 455683
15850 455683 398543 354367 327237 283716 195623 90648 26263 16421 44697 35528 -8674 -38914
15838 -38914 -16185 43332 122409 179672 214047 308692 460645 674795 935562 1224271 1529750
15827 1529750 1863647 2247516 2691803 3189079 3711240 4274335 4906888 5531204 6187039
15818 6187039 6945341 7913610 9194952 11004232 13439753 16493361 20155390 24869195
15810 24869195 31632038 42167261 59260449 88330909 140098001 224642158 310233580
15803 310233580 336675493 321684565 310650588 323352478 359794429 362222990 312071843
15796 312071843 249262530 184597982 127970694 89430309 65875624 51175322 41338798
15789 41338798 34182295 28697041 24547249 21277902 18538669 16241799 14309014 12654309
15781 12654309 11342789 10317806 9513171 8891206 8392994 7918027 7478563 7083262 6754758
15772 6754758 6472343 6243225 6021982 5811060 5524947 5150937 4817521 4566287 4362645
15763 4362645 4144800 3838873 3524712 3286053 3120697 2957644 2783572 2600446 2439962
15754 2439962 2287222 2114878 1979002 1853045 1724565 1605338 1475049 1379995 1311790 1293421
15744 1293421 1259825 1209283 1197587 1225356 1258521 1248916 1195361 1167753 1196774 1298855 1480512
15733 1480512 1829515 2331513 2699571 2683265 2533455 2500317 2667431 2876093 2764706 2367515
15723 2367515 1922132 1505570 1201892 1011372 897608 821059 775031 745389 729353 691613
15713 691613 657744 646359 629749 620600 611003 593279 590030 577337 572964 560909 555518 561937 556280
15700 556280 521491 485515 458652 437851 403025 381590 353684 331171 322223 316655 337712 347674
15688 347674 355704 350196 330476 325888 322868 309476 272159 255533 258454 277265 299724 299253 293905
15675 293905 291986 316620 334838 353907 366053 333234 319254 346929 375275 370184 361332 321053
15663 321053 288102 289066 307587 334474 335365 323778 323324 335394 357511 375948 361463 320671 285970
15650 285970 269376 278554 277298 245014 216071 185669 173891 176600 182863 182620 194737 208314 222516
15637 222516 229513 248441 258228 265413 279952 293482 292353 278622 253861 227552 219873 209751
15625 209751 183333 166991 135104 128255 135927 151094 180793 186574 189478 194590 177658 170403 172018
15612 172018 198741 223916 239588 237617 253120 271320 272976 280266 282157 318211 344221 346221
15600 346221 330601 298895 265437 248485 238581 231972 226077 211039 189730 175827 157613 137144
15588 137144 122729 113666 122392 124122 117552 135912 134266 131166 118401 123753 120985 114619 113978 110714
15574 110714 121904 136294 132905 124159 122509 125908 97773 79007 69842 67920 71399 70642 74688
15561 74688 81734 95629 102293 98170 95046 99233 115984 115537 106011 83526 80137 60863 63921 78124
15547 78124 107799 111858 78323 43262 21450 37756 53183 47564 49159 34153 60433 85796
15535 85796 75111 55666 57625 72512 87700 83540 86373 90588 72960 69230 82381 98123 113198
15522 113198 108102 101499 104826 102726 120920 151067 129976 123647 110555 85572 70419 70144 74345
15509 74345 91782 83596 75203 81634 72240 74771 83711 78939 56194 56805 55116 33652 18186 53657
15495 53657 77011 67550 65796 68931 88807 98367 94399 94533 98467 98235 91375 86106 82493 81581 74003
15480 74003 55446 38586 27859 31916 41929 54161 44518 32355 5991 14611 28324 45500
15468 45500 56927 54729 60567 58208 42964 36411 23716 22310 35916 56681 79103 65462 44089
15455 44089 33701 29889 14685 14248 17738 20935 32582 44847 47417 50677 55440 66150 79908
15442 79908 88031 69450 58884 65067 41236 26041 36413 66828 57286 81590 69219 25099
15430 25099 9670 28962 31287 29940 31762 36270 35958 23073 26731 31995 30432 46675 48340 20311
15416 20311 23043 24840 18915 11815 14829 7169 -15521 -510 4482 -6315 -39886 -25532 -10617
15403 -10617 879 15728 26832 -8342 -22153 -197 24069 42311 21224 5403 21016 29093
15391 29093 28076 20791 19234 29336 25639 48519 39344 27308 33047 39746 48590 31069 17222
15378 17222 21566 25867 32106 35371 19636 9294 26073 32430 20750 19530 24998 19176 35510
15365 35510 37673 29835 24764 18883 6552 242 2575 2658 -6931 -10376 -10396 1774 16752 31052
15351 31052 37360 41060 38769 47278 50378 44456 10602 -6798 4968 -310 11043 42190 47230
15338 47230 53356 73628 108288 114196 122145 127744 98104 101414 73680 34904 13006 20489 18066
15325 18066 34980 29354 -13703 -11976 -21555 -12328 13159 23808 27665 38913 46434 70077 83063
15312 83063 57042 33445 20855 17382 12512 11774 11681 17023 30506 34665 21997 14017 33255 44743
15298 44743 44912 53786 87256 69548 40589 38603 56589 58899 63841 66673 74503 79055 81850 75500
15284 75500 73336 63631 61096 72279 84819 95800 67294 48406 73705 70747 49348 37751
15272 37751 37310 30575 35170 49363 61377 40107 39658 34917 35054 34948 15241 10669 14408 5316
15258 5316 6565 6548 -761 15396 7867 -8030 -6505 -10351 -10756 -490 -2418 11086 36262 27718
15244 27718 45835 43924 42342 37409 50245 61903 62504 62507 77943 92603 122562 151917 172340
15231 172340 206467 260704 328008 453312 689741 1087310 1562382 1841626 1836765 1780335 1804234
15220 1804234 1960329 2032900 1838561 1510509 1171668 851358 607163 448332 357484 274650
15210 274650 220761 190020 152875 121076 123924 119704 88917 88059 89362 86833 104617 102680 93851
15197 93851 95588 81688 66322 42877 43848 69776 80783 61819 44500 24858 24159 16883 -1712
15184 -1712 -1225 16337 42715 34071 22348 2348 8603 28721 21599 38297 43341 30392 4002
15171 4002 -5945 941 9803 24521 21271 23787 3217 8399 7555 15409 35229 46197 43794 39744
15157 39744 21563 8718 9257 25275 42776 44352 18152 2078 9696 8178 11359 18140 17708
15144 17708 10252 31502 47817 37479 34830 46208 16942 9704 17197 26703 38979 35564 28827
15131 28827 33731 51227 47189 36945 32457 32111 20833 18085 17668 20489 34417 29156 17439 5964
15117 5964 -2905 -6793 -16578 -27507 -20456 -18671 -13486 -6368 -3970 14522 23634 32999 16974 4577
15103 4577 -14866 2871 33464 50713 40740 21283 20341 31770 34365 29512 47377 55671 58659
15090 58659 54697 47668 43588 44474 32946 262 766 7764 5338 16230 13955 12240 -2352 8625
15076 8625 19097 37433 47118 43164 43647 44077 29788 12457 -6201 -12282 -9234 -10644 -1373 11637
15062 11637 14290 -13255 -12508 9352 11473 -19762 -20123 -2042 -4167 5108 30 -17721 -37223
15049 -37223 -28036 -30545 -10571 -12943 -8389 12522 6751 11046 -4189 11544 15523 14512 34157
15036 34157 57740 51170 14214 -13266 -16465 17863 41534 54002 34331 10171 -3471 -25233
15024 -25233 -31382 -17265 9605 22942 44257 58001 25931 -1736 6329 14017 13095 8894 -1030
15011 -1030 -690 6745 5303 4734 40 -17067 -10675 15067 37281 16774 8306 12638 -4126 -14829
14997 -14829 -8456 -16980 -9862 14218 22766 32386 40268 32718 34822 34130 19377 14910 8651 19638
14983 19638 20460 24457 16707 -715 -13226 -17229 -25810 -741 22570 15126 5021 -3060 -27873
14970 -27873 -29216 -21127 -5192 -5149 -17941 7313 20245 28165 38887 32454 34757 22149 14863
14957 14863 10536 3356 -470 2648 32779 42253 49801 54202 35129 30825 12208 5463 12807 -3930
14943 -3930 -2340 1916 -4611 -1474 -6038 1538 4858 19580 18435 17865 15130 9569 -4920 2974
14929 2974 3498 -13269 -17517 -21660 -31752 -19252 14374 19972 4513 17585 19265 20533 26823
14916 26823 18968 -5223 5248 7010 14597 15955 -6018 -19542 -42987 -41369 -30501 -32148 -21014
14903 -21014 -1554 10474 34650 20402 3089 -11290 -7026 -11313 -29995 -12484 -2653 -15201
14891 -15201 4719 9278 9405 -5661 -7853 9127 25116 27975 14980 10490 -18048 -35030 -36113
14878 -36113 -32107 -13536 -34514 -42756 -27590 -24042 -6718 -5180 -25430 -14354 3971 17680
14866 17680 17445 3685 -3925 -17437 -33938 -35009 -12580 8514 8510 4837 15430 15565 -2335 -2418
14852 -2418 -11749 -14846 -2114 -1870 1240 3781 2035 11115 39640 75611 95548 120897 142871
14839 142871 163909 170079 168494 153308 127709 81632 75253 60672 4720 -8638 -9367 -9199 -1148
14826 -1148 -2740 3 14193 1324 8651 14611 7800 19073 20140 21710 11276 179 5578
14813 5578 -5701 21750 34987 35086 20342 11004 5433 3882 4944 -9783 3401 7157 14458 6477
14799 6477 2008 -4897 1076 5355 9002 -10229 -19179 -8974 -19891 -33062 -38463 -26884 -15759
14786 -15759 -12415 -16682 -12173 -4212 1358 -2995 -11614 -22924 -21754 -10366 5519 998 8006 7278
14772 7278 -11751 -12799 -16468 -26619 -29166 -19607 -21188 -23500 -27601 -14650 -31 -4192 -7646 -18454
14758 -18454 -17039 -22833 -19549 4471 10155 -8301 -5188 4157 6975 7387 -2108 1541 -10425 -12216
14744 -12216 -16464 -2012 -10202 -6045 4890 25209 20007 9056 -16787 -29452 -31149 -27859 -30599
14731 -30599 -29822 -24615 -21742 -35677 -38154 -30499 -8544 -4578 -8136 -18053 -13101 -19534 -26567 -28358
14717 -28358 -39270 -27831 -6658 -2168 -4080 8492 14279 3673 -10650 -23947 -23007 -20119 -19
14704 -19 -1026 -15856 -8696 11519 14559 22655 16151 -6397 -15106 3291 27290 32432 26629 11284
14690 11284 -14413 -16400 -2996 16118 7403 -9213 -23708 -28221 -24778 -17503 -40823 -25116 -5708
14677 -5708 -8048 -9154 -2260 -3742 9544 18252 -289 -7067 -20025 -26084 -4555 1382 3583 2099
14663 2099 -2777 -922 -1850 -7432 -30921 -31996 -3054 -4982 -1913 3363 -1685 1148 -20851 -31793
14649 -31793 -22976 -25452 -21914 -23171 -12458 8993 15919 2483 15326 6530 8509 9802 -14892
14636 -14892 -14699 -11406 314 -4673 -6715 -1062 7489 8023 -5722 -12920 -790 2192 8198 17451
14622 17451 21384 5089 -16377 -9457 -16204 -21504 -24796 -15883 791 -7104 -27031 -15136 -28769
14609 -28769 -41567 -35647 -33405 -24719 -16095 -7044 -1591 -17991 -21970 6456 12196 15369 16668 16812
14595 16812 23867 11556 4058 2712 2499 -7281 -24201 -9189 2014 14733 7767 -7329 -12515
14582 -12515 -602 5670 -1609 -19793 -10063 1148 -5262 -9297 -8570 907 6418 20791 20943 25015
14568 25015 8563 -21234 -3395 13674 11786 6714 -537 14992 15748 -4591 -23905 -22394 -17645
14555 -17645 -39470 -50013 -45458 -27692 -18143 -23305 -23220 -45755 -44257 -17887 -15934 -1511 -15118
14542 -15118 -14009 -5899 7286 2854 -12665 -32968 -36005 -28875 -17806 -20856 -16452 -9557 -23744
14529 -23744 -14353 -9890 -15941 -24899 -23640 -24566 -33905 -9816 16804 8987 -182 -12539 -25653 -47367
14515 -47367 -44364 -32743 -35070 -23362 -21036 -24001 -25536 -26676 -21419 -16806 -3653 -3576 -6721 -6839
14501 -6839 -10566 -15937 -11085 -10875 11606 8610 22740 14261 -9392 -7676 11852 11614 7976 -18764
14487 -18764 -25043 -30708 -26090 -21483 -27630 -28952 -19865 4880 20147 25359 13929 -1994 -14300
14474 -14300 -8891 4243 581 6257 6524 27431 24640 12393 19443 28160 35617 15405 3191
14461 3191 -10457 -25518 -20081 -28372 -23933 -22159 -26482 -7331 -6276 3812 -9920 2168 2659
14448 2659 5588 15373 16093 -6530 -10195 -6313 -2484 7399 16426 24819 20434 6355 -28913 -44393
14434 -44393 -41740 -33730 -15919 -15811 -12191 -17980 -21172 -12560 -14821 -10302 -21877 -21152 5031 25789
14420 25789 32628 28200 -57 -22079 -21444 -8861 19798 21829 19959 9819 564 -3799 -15790
14407 -15790 -35181 -37088 -11798 10239 7063 4365 18578 33696 41461 20779 21473 30089 26629
14394 26629 40031 29926 7921 5685 -7343 -30347 -34804 -44207 -40615 -53749 -51819 -50225 -23011
14381 -23011 -13549 -9827 -15910 -24324 -13486 5649 1644 -1913 -28263 -26246 -28840 -27134 -31718 -27171
14367 -27171 -22826 -21635 -1204 -4074 -8428 10114 31332 25708 8164 -3985 -4182 -13427 -7592
14354 -7592 -19632 -20420 -164 21275 15218 12488 24894 11904 21197 12904 -15051 -9018 -8669 -26165
14340 -26165 -33761 -21195 -19133 -20158 -9899 4603 13208 23708 33521 7729 -1933 -6514 -20526
14327 -20526 -32502 -31754 -17905 -14040 4844 25221 25904 18094 5975 -10422 -16121 -5442 -17523
14314 -17523 -18471 -13481 -14709 -11012 2574 14676 12336 12619 -8446 -21716 -20872 -28928 -33828 -29180
14300 -29180 -29862 -30416 -32450 -39761 -35853 -41265 -40963 -46075 -30673 -26266 -25788 -26213 -30162 -28799 -38308
14285 -38308 -52232 -30621 -21414 -29254 -27729 -15013 6495 -12531 -19403 -25262 -27932 -26328 -27435
14272 -27435 -27289 -26238 -14429 3081 -12998 -15279 5929 -13520 -26296 -34796 -22466 -14499 916
14259 916 -25289 -47942 -34805 -36919 -47104 -56207 -52502 -53818 -25080 -25192 -38155 -23009 -15131
14246 -15131 -30072 -24010 -43316 -54092 -50867 -26682 16914 26245 21931 10648 568 -17252
14234 -17252 -24840 -13500 -17532 -7613 2777 -12464 -15973 -12990 2131 23464 38076 17983 10072
14221 10072 18180 22526 2670 12138 10321 8132 20357 27537 21332 18583 -1330 -24744 -17518
14208 -17518 5710 -4688 -25593 -32251 -40107 -26901 -22418 -13606 -20209 -25194 -30920 -26999 -33392
14195 -33392 -15375 -8818 -20295 7498 4775 491 10185 14180 -4917 5 9832 9405 20847
14182 20847 17709 -268 14512 21806 4331 8157 7600 2802 16414 25921 23488 15960 8015 -4145
14168 -4145 -2450 5759 11438 -3590 -1144 -1128 -725 -10625 -12660 -6318 -19107 -24270 -20422 -12219 -6741
14153 -6741 -974 -12923 -4769 -2318 -12508 -15803 -15017 -16023 -2014 17137 17514 -21819 -17259 9697
14139 9697 19564 24570 14025 -7607 -1728 4073 -2416 -14720 -35619 -19699 -24593 -38692 -38232
14126 -38232 -53338 -49895 -45929 -36141 -1182 14920 11061 24805 17596 -13119 -38306 -34508 -15649
14113 -15649 -9295 -134 17397 16663 6861 -14066 -12007 14111 28788 15153 8788 -7912 -17540
14100 -17540 -16159 -33271 -43522 -32580 -19338 -6792 2694 -23600 -29292 -27897 -27149 -13044 -1457
14087 -1457 -11223 -21509 -21317 -15174 -19846 -29677 -42095 -41554 -26611 -9457 -23597 -28147 -17679 1223
14073 1223 2256 -29022 -38961 -22957 -17667 1028 -1536 -18616 -31085 -14347 9191 18712 2789
14060 2789 -9506 -16211 -25757 953 -7475 -4315 19527 31690 23747 -3582 -31524 -29679 -22466
14047 -22466 -10825 -26228 -37620 -11132 -14919 -34024 -20594 -11633 -7369 -193 -259 -18672 -8187
14034 -8187 -6157 -7859 -3035 -20183 -20850 7743 14191 8792 -24041 -21630 -8422 1846 73 -12857
14020 -12857 -10666 -622 -8259 -12789 -24556 -27413 -32706 -23486 -23474 -20705 -21473 -16920 -9085 -16957 -19757
14005 -19757 -30324 -28195 -12033 -7124 -4941 -8749 -9155 -22344 -19086 -6977 -16148 -6533 5078
13992 5078 28434 14022 12503 14553 9255 5133 -291 3445 -3479 2611 -9181 -7229 3286 -8521
13978 -8521 -5176 -10519 -14095 -27841 -56280 -71311 -40137 -44108 -19743 -13548 -29505 -29370 -27695
13965 -27695 -18074 -10903 -15750 -34141 -22397 8134 6886 1997 -19160 -19226 -15720 -20566 -1032 -4156
13951 -4156 -38210 -54737 -52524 -48374 -35645 -9305 -1151 -9411 -31309 -54738 -43652 -30585 -6862
13938 -6862 7865 -15344 -19444 -17374 -24017 -15617 975 -5218 -2483 -7776 -26974 -48075 -45718
13925 -45718 -10364 -1732 -22774 -21465 -13743 -21584 -31168 -22966 -22172 -23780 -32400 -22215 -21630 -11830
13911 -11830 -2590 553 -18159 -14587 -15181 -29305 -31432 -29044 -21388 -21502 -13993 1677 1659 -15225
13897 -15225 -29978 -18807 5264 1522 -28718 -23229 -22815 -28730 -39872 -46285 -13770 -15675 -29119
13884 -29119 3370 28319 6386 1660 13457 -8918 -22326 -14348 -24980 -24498 -20321 -24193 -22932
13871 -22932 -20271 7990 -2487 -2318 -13149 -28742 -32139 -22762 -9209 -14836 -40485 -46699 -25849
13858 -25849 -13027 -2288 329 1349 -17689 -25707 -35608 -21599 -28678 -38482 -26755 -15423 -9514
13845 -9514 -20145 -6839 10667 -1923 -10177 -2677 1912 -11208 -10887 9546 8418 -19037 -42908
13832 -42908 -30981 -23105 -4972 -5929 -3647 -3625 -4438 -19460 -19521 -25256 -37531 -20185 -17075 -26335 -21474
13817 -21474 -26691 -20325 -35017 -26845 -15460 -31116 -24067 -17780 -30118 -29612 -15776 -7583 -16386
13804 -16386 -16467 -27434 -28284 -28592 2933 14624 18228 25554 19129 7877 8902 21107 19498 -1079
13790 -1079 -27145 -21838 -15795 -25331 -11475 937 2027 94 6463 15447 1191 -15772 -12960
13777 -12960 -13205 -21129 -33349 -26013 -43185 -46165 -30264 -12586 -17490 -13809 -21488 -30258 -55386
13764 -55386 -39080 -24289 -30022 -15690 8485 137 -11053 8147 -4299 -11577 -12361 -48108 -36982
13751 -36982 -17841 -17806 -20038 -15257 -11660 -6854 -23003 -12823 -22308 -45115 -40170 -26401 -26568 -31460
13737 -31460 -6690 -3145 4845 9756 -5247 -17634 -10337 -14053 -37794 -34664 -17412 -16092 -15142
13724 -15142 -1881 -1900 -20865 -29189 -23954 -609 -4319 -21268 -29740 -15137 -145 -7575 -19394
13711 -19394 -8285 5566 24021 2100 -11005 -14799 -7940 -1503 -6498 -3758 7528 5373 3377
13698 3377 8315 8023 -16463 -33716 -30215 -21828 -35867 -40700 -41876 -43832 -34299 -29832 -13154 -14277
13684 -14277 -19687 -25658 -44458 -37985 -13282 -4854 -13780 -28907 -24368 -31775 -25742 11928 5353
13671 5353 533 11836 20096 27570 7422 -11391 -16216 5728 6194 5795 -13503 -22295 -24938 -15677
13657 -15677 -8398 136 13733 4377 -2698 -24262 -24224 -12967 -20271 -27937 -12379 -11095 -6019 3307
13643 3307 -7819 -27423 -16957 -6966 -16978 -18283 -32996 -43563 -27303 -4722 6444 5232
13631 5232 -10200 -20484 -21349 -16093 2098 7700 10155 -4871 -892 3134 -7359 -12952 -5916 -11263
13617 -11263 -29099 -43146 -35256 -24509 2056 17206 21662 -3131 -28777 -50515 -54741 -41306
13605 -41306 -50159 -57335 -48140 -35608 -8524 -12568 -28650 -35856 -9738 -1453 -145 -12530 -12543 6633
13591 6633 9021 -17506 -32195 -26906 -30571 -33947 -30637 -45449 -31027 -37264 -18794 -11553 -23914
13578 -23914 -29726 -13308 -1525 3835 -20011 -31061 -31016 -21775 -23961 -20734 -4521 -4920 -8266 -21299
13564 -21299 -29256 -41630 -22402 -1606 -14052 -17065 -21306 -25938 -14418 -14094 -10800 -14785 -14468 -24408
13550 -24408 -9495 -2716 -17345 -41112 -46578 -26797 -23485 -31186 -35288 -15130 -3641 -25713 -39879
13537 -39879 -33735 -40607 -15893 -20402 -26292 -34528 -29708 -35861 -41575 -34396 -42792 -33464 -21247 -20178
13523 -20178 -16759 -15182 -14254 -27600 -20360 6948 34056 26692 24958 18914 3684 3466 3757 -9190
13509 -9190 -14241 -2785 1997 12888 11197 -8614 -19892 -12721 5221 -2610 -6114 -1202 -20766
13496 -20766 -20843 -1848 -6077 -14652 -9655 5031 8376 21263 10027 -4053 -1822 3099 1374 -24161
13482 -24161 -31763 -10865 237 -14260 -25468 -33484 -35503 -36710 -17662 -23088 -27765 -15193 11545
13469 11545 1502 -8123 -12840 -25121 -15307 -1728 -20641 -11476 -4079 -3633 -5281 -121 5370 4623
13455 4623 21511 16910 27376 25583 5365 645 -4707 -14391 -26875 -13816 -17235 -19267 -18191
13442 -18191 -35317 -23962 -19853 -24160 2603 21548 19946 -3759 -4685 -15933 -21310 -32456 -24223
13429 -24223 -6842 -14060 -33658 -52150 -59004 -26275 2759 12568 7725 8107 4512 -7283 917
13416 917 14543 12069 14984 14792 12731 15441 10964 -574 7419 9935 3619 2259 10443 6946 17185
13401 17185 39302 55691 27869 -4593 5305 -2716 -7471 -6129 -23558 -19138 -31284 -30403 -21618
13388 -21618 -214 1416 -3967 -16839 1890 24347 17956 7189 28244 10673 -13782 -25221
13376 -25221 -26069 -45068 -46521 -35332 -26787 -23378 -12629 14560 25254 25002 31875 18481 8428
13363 8428 -7677 -29585 -25829 4420 3403 10168 -5582 -16416 -17166 -7540 -2222 -11411 -22651
13350 -22651 -4209 8459 9851 42859 46510 30602 7714 11150 12227 4626 3463 13892 20802
13337 20802 5468 -7633 -13826 -4394 1259 -3906 -11133 -12869 -7943 -13358 -6604 -6262 -1385 131
13323 131 4105 10917 13333 -1298 -22083 -7703 10083 11192 -4779 10068 14595 -903 6492
13310 6492 10384 18116 29699 28577 8088 -14580 -13551 -15959 -14704 -18183 -22190 -12745 -9704 -12577
13296 -12577 -30479 -51442 -40483 -25225 -26276 -24931 -20640 -20061 -10819 -13256 -19656 -19185 -24160 -35850
13282 -35850 -25089 -22685 -23441 945 15466 21156 10936 -3682 -4992 12496 21317 -5362 -22574
13269 -22574 -11922 -11539 -11994 -16398 -26885 -10956 -16705 -8302 -11277 -34757 -21851 -5854 -7411
13256 -7411 -1443 -1712 -21137 -21632 -15460 15587 16941 -596 -11127 -18065 -7726 -10953 -19158 -13004
13242 -13004 -904 -10534 -10051 -16811 -10857 135 -14891 -20447 -27895 -22629 -26597 -26971 -29584 -27059
13228 -27059 -29297 -20392 -6376 8484 7620 10475 -1591 6095 7379 6083 25667 27844 39434
13215 39434 52960 27234 25182 22385 2068 -7952 -22424 -7900 -9174 -26469 -31250 -35064 -27370
13202 -27370 -28132 -29548 -26394 -14484 -10072 -8515 -22468 -16282 663 -5848 -2446 -5624 -21321 -40372
13188 -40372 -22350 -1297 4469 3316 -13716 -23186 -25725 -35868 -49570 -52328 -43833 -37068 -34775
13175 -34775 -28298 -26746 7126 15881 2212 -12140 2303 -1484 -20210 -23155 -10224 12818 14864
13162 14864 8766 4872 -629 13976 6886 1965 -619 -1323 -690 3361 -1499 4691 22169 31052
13148 31052 42570 53906 51486 16387 -6279 2171 -16205 -19585 -7539 -12644 -24941 -19662 -15096
13135 -15096 -17309 -27684 -20950 -30027 -26624 -17387 -27010 -23709 -17139 -7178 7505 1487 5507 12414
13121 12414 11951 11135 -3956 -13217 -12245 -15250 -18929 -6383 -10703 -23531 -31580 -20711 1505 870
13107 870 -3410 -504 18857 3140 4911 13926 12954 -2023 5322 7153 -5978 -17921 -21477 -6773
13093 -6773 -11748 565 14966 -6726 -20828 -26490 -19876 -7572 -21359 -46989 -51955 -44178 -42960
13080 -42960 -41478 -56736 -51275 -34259 -17105 -19735 -21239 -31223 -26659 -27447 -39015 -27701 -24595
13067 -24595 -24679 -3849 18740 18720 9499 -1193 -10145 -28824 -25234 -8712 -5481 -12270 -15095 -11848
13053 -11848 -4672 -18486 -27523 -20760 -38081 -46550 -46430 -59017 -32032 -16990 -33172 -35061 -31294
13040 -31294 -24872 -39663 -41257 -48837 -49827 -34174 -9377 1417 76 -3797 -11709 -19445 -8187
13027 -8187 -2959 12762 25822 14538 7924 3120 -2372 2011 17792 13896 -10915 -20154 -15345
13014 -15345 8759 5231 -3981 8906 23631 19365 1624 9719 18791 23153 1169 3533 23567
13001 23567 14042 2641 -3859 -12790 -12341 -26933 -34274 -20297 -13815 -16092 -5167 1849 -15666
12988 -15666 -31930 -36772 -17344 -14353 -5960 4521 -7542 2639 -1240 -6879 -199 6977 5657
12975 5657 -5381 -2848 -3622 9308 21120 24804 9986 -5997 -7797 856 4138 12097 -7219
12962 -7219 -25295 -21825 -26186 -13941 -7169 -19630 -19103 -28260 -32106 -17604 -12394 -15814 -13653 -4027
12948 -4027 6081 27810 11844 -7435 -18343 -22656 -28293 -21064 -18747 -6349 -1862 1049 3513
12935 3513 88 -530 -4385 535 -3288 -16169 -9401 -699 -18336 -23601 -30893 -40635 -22501 -24366
12921 -24366 -25808 -35777 -53333 -40955 -32728 -17950 -23996 -27767 -11248 -14044 -10108 -6707 232
12908 232 2702 -7007 -13494 -9120 3041 -3844 -5913 -15415 -9677 19749 41572 54669 43128 10137
12894 10137 951 -9823 -13101 -19439 -7190 -10198 -3854 -3761 7555 22315 22485 19013 12788 8576
12880 8576 7349 13965 6127 -10489 -19574 -15319 -1144 7447 -1859 1442 14225 17563 6104 4801
12866 4801 -2694 -10157 8597 13558 2570 -37542 -40490 -15471 6108 5707 -2949 -8726 -3141 -13135
12852 -13135 -21107 -25977 -22750 -35834 -39925 -17428 -16135 -24129 -13577 -21976 -33940 -32828 -3944
12839 -3944 -2140 -12328 -19958 -32304 -42946 -27917 -22149 223 18554 21676 10315 -12365 -23866
12826 -23866 -21344 -27620 -46363 -16412 9366 1706 -10876 -9189 -3889 8756 18102 17529 -4027
12813 -4027 -13499 -30626 -53360 -52442 -21199 -13262 3960 -8271 -22554 -27426 -25034 -1495 4109
12800 4109 5936 -13196 -21134 -4022 -15351 -25918 -15454 -4733 518 2490 6963 -3477 -17833
12787 -17833 -23625 -13420 -9985 -9451 -14736 -13848 -6270 -8556 -8791 15443 9369 -11109 -2319 -4862
12773 -4862 -13932 7698 7401 15642 15680 22730 24304 17001 -2581 2035 -3266 -10911 2241 -626 -22145
12758 -22145 -38674 -41931 -44665 -30209 -27921 -9321 5403 12565 15487 -19559 -39332 -30233 -38431
12745 -38431 -49837 -22707 1148 1625 3664 -1741 -30481 -37247 208 17702 10794 9716 -9334
12732 -9334 -13482 -20320 -24678 -13093 6833 28496 21871 5148 1674 19750 16751 17625 7499
12719 7499 573 -19060 -25707 -8310 4415 -12016 -10766 7663 9046 3204 13859 21081 -4628
12706 -4628 -20996 -24504 -12029 3613 8145 -160 -31385 -38267 -43076 -34102 -37717 -41017 -9633
12693 -9633 5248 -9828 -38191 -34497 -31851 -48389 -56032 -36257 -3915 12318 20837 21102 3899
12680 3899 -26084 -23929 -26859 -14551 10295 20514 13997 -9797 -2771 12605 18285 -125 6790
12667 6790 21312 29952 9400 -10380 -8398 -20261 -17955 -2700 14845 -796 -9686 -4020 -13661
12654 -13661 -15812 -9345 -14698 -26932 -30900 -30155 -2943 7169 -11550 -4388 6050 -3284 9761
12641 9761 -2155 -27364 -30754 -24510 -21031 -19769 -21789 -20212 -29717 -13235 -408 -6241 -16587
12628 -16587 -8754 -2017 8107 33397 17288 -1202 -24319 -42928 -56461 -57843 -59517 -26837
12616 -26837 -7902 142 13842 20862 21798 17302 575 -5533 -7498 -17513 -9231 11095 14025
12603 14025 -3656 -4384 -8745 -19724 -22593 -1316 -20317 -36333 -17535 -13133 -24238 -15403 3933
12590 3933 10940 -12808 -21483 -11736 1489 10947 10755 17200 -2720 -17240 -24562 -23926 -16708 -9306
12576 -9306 -4507 13819 28320 43221 26148 255 -26782 -44189 -41243 -35876 -19030 -515
12564 -515 7181 7321 8698 9185 1117 -12039 -34709 -36320 2773 9383 -1640 -8750 -10347 -8305
12550 -8305 -4025 -6408 -4964 -11157 -29514 -9585 -3755 6328 11415 10634 1127 -6343 2949 -4366
12536 -4366 4813 22815 18867 21669 2451 -2232 -7486 372 4556 -1233 -12843 7559 9246 -14718
12522 -14718 -8390 -12153 -14214 -16876 -24200 -38019 -48730 -45523 -31448 -761 15873 11780 2964
12509 2964 15286 6714 -3298 -10463 -14137 -7900 -11892 -3315 4493 -4612 -15147 -14034 7194 6668
12495 6668 13476 3886 896 2215 -6348 19799 37659 25926 30214 33651 29034 5553 -11530
12482 -11530 -5181 29417 52548 49206 29932 19572 11376 12194 12779 14840 36499 30610 26401 13142
12468 13142 23352 4968 -14546 -22531 -3048 26903 39414 10212 -27828 -36430 -33759 -34449 -13525
12455 -13525 -16632 -26779 -15448 6306 7828 -3358 -21352 -15354 -1201 -33890 -29503 -5445
12443 -5445 -6909 -16562 -11377 5215 12539 8701 18548 25100 19127 17719 11787 3248 22119 28036
12429 28036 29420 15519 7159 18915 27888 40425 29765 16435 38265 42417 11068 4509 893
12416 893 -14427 -18183 -27707 -26915 -25626 -34101 -29542 -43189 -30480 -21032 -18117 -7421 -7057 5915
12402 5915 13585 10622 -2873 -10171 -13431 -1335 17224 26055 30918 34422 50726 62758 63360 54040
12388 54040 16689 -6540 -7202 -7901 -7199 -8960 10118 38086 52826 59558 43398 43338 47052 24706
12374 24706 11879 13974 9233 -2719 29050 45433 31061 33140 45651 43368 36321 29199 24085
12361 24085 24254 31317 14846 -2069 -4805 33 10687 19999 34883 40152 17195 -13092 -30398
12348 -30398 -22594 -8788 -4900 1522 18766 31648 47944 52969 64526 71018 54752 48633 50259
12335 50259 34435 13735 23690 54727 47038 25613 31732 52069 54645 65443 44607 25819
12323 25819 25705 13147 27130 27377 1390 12428 22403 32186 36858 17617 13133 23551 42705
12310 42705 50447 35557 19819 26711 35136 41502 32066 34904 24281 20196 24098 7750 -12168
12297 -12168 -21095 -10521 -15488 -14557 -1567 16665 48703 47574 45049 5659 -12290 -6911 17841
12284 17841 50126 53837 25769 32492 13895 9923 28494 39899 40177 34679 20336 15901 20079
12271 20079 20152 17588 24486 28290 23643 26935 31762 38887 55171 78365 105867 124020 134318 159720
12257 159720 223147 313891 420575 513625 575835 614413 577390 482118 413555 368843 342155
12246 342155 328730 366754 437993 534033 599451 652168 666197 599503 473733 345205 256738
12235 256738 192167 163848 145282 133492 134493 123661 88513 86770 96761 95838 92025 73875 68345
12222 68345 101753 116886 121388 140440 140709 131223 133661 105943 104554 126436 144066 158146 156841
12209 156841 190763 237641 306961 408903 512165 596522 639721 633504 575285 500233 418275
12198 418275 345751 325025 353583 406776 512404 605878 658042 671991 612665 534009 415653
12187 415653 290327 221347 177429 145423 142416 131907 128679 114862 96107 67693 56255 56512
12175 56512 64220 64036 72753 85510 107021 118375 107252 104027 119069 109166 84293 81418 76685
12162 76685 83153 89799 79479 61873 58690 55934 49815 52274 45229 16707 -3747 -947 16294
12149 16294 19159 19278 15626 16207 33634 50079 35347 1570 13808 29855 39309 36976 36725 42499
12135 42499 59204 56686 63211 74549 77917 67426 74433 68201 44261 38815 38756 26027 31755 41421
12121 41421 33213 44408 40693 41233 39881 30540 38280 45625 38224 19407 6772 1363 19605 41047
12107 41047 36556 30281 20413 17032 22221 18025 31705 47465 55902 37866 34864 43941 60121
12094 60121 61480 58747 48156 55801 66519 78573 79276 69170 60082 50683 57034 45352 45106 43342
12080 43342 39958 38098 64029 81655 63426 61805 73424 76925 77733 57129 50269 60810 63727
12067 63727 41739 45344 49084 45745 39378 49657 59749 71979 67509 52367 51391 50537 33489
12054 33489 27539 24291 28210 37453 28089 30308 35144 50143 56123 65901 60554 51872 37983 19528
12040 19528 50981 73368 56321 42724 49190 47692 51127 59798 72732 78958 78263 82148 106028
12027 106028 88539 83868 89926 99356 103032 103092 90207 90545 86722 72544 82471 83936 99242 93151
12013 93151 78710 66228 68262 82720 87653 82872 81011 58252 34853 31376 36233 47154 62948
12000 62948 74964 83043 105171 110660 106378 120287 122404 118967 107725 111894 112365 121151 127523 140043
11986 140043 134194 128171 135047 121440 116862 121683 97715 83769 91082 100127 90515 61296 62913
11973 62913 60903 63090 62312 72873 87759 91984 90406 116575 129691 114117 84396 80394 76673
11960 76673 88258 84154 67498 63509 65217 79207 104780 142562 147093 135287 105358 102782 112108
11947 112108 122385 116801 102359 114872 142068 163586 169235 170614 154241 133632 121697 138395
11935 138395 130711 120202 108406 124346 142336 110437 92650 97894 69194 63805 67954 67882 79049
11922 79049 61340 59885 64633 77286 92402 117072 121453 94033 76653 76420 60271 66666 75503
11909 75503 64327 67359 71670 73361 81407 97334 96713 84778 73048 71331 86427 92445 80705
11896 80705 65800 45735 41422 47861 38350 54417 69510 56352 48459 40332 49071 34038 30738
11883 30738 40211 68558 80577 76313 83219 59573 32706 27622 9059 -1073 -8620 10681 29528
11870 29528 53233 71330 85997 105932 137893 141106 135273 113985 116963 121230 96796 66925
11858 66925 76519 96844 93787 102458 112876 123135 125994 131750 153344 162644 159910 151483 165382
11845 165382 166548 125951 99093 105529 106442 81342 87816 107366 124552 134777 144864 178999
11833 178999 186837 188536 179060 159422 165068 164632 150259 156192 147555 117218 107967 93117 95310
11820 95310 141107 190475 218531 261276 251501 227068 223597 219511 217782 223909 206162 219919 255517
11807 255517 276489 271832 277026 294796 294680 282899 271365 286767 308977 331019 363507 379951
11795 379951 389509 411319 401797 367437 351646 339918 342007 349449 371721 374112 372753 395727 409784
11782 409784 407482 406693 404865 416947 433208 467094 508072 535509 576946 680908 816030 1027584
11770 1027584 1289894 1547489 1746890 1888167 1943956 1892892 1851037 1838988 1901426 2077301
11760 2077301 2355442 2770756 3252127 3693986 4112877 4513597 4814379 5090524 5499597
11751 5499597 6048054 6823286 7960048 9603621 12031080 15628305 21159267 30301137
11743 30301137 45617124 68108972 90748927 105762309 115485821 115541043 101754894 83666101
11735 83666101 67645833 55899290 50988926 54586638 68279923 89927228 108131371
11728 108131371 118171351 123295259 115524353 95486872 74088668 54974994 39760734
11721 39760734 29425925 22954676 18840298 16118459 14223119 12760721 11630484 10808682
11713 10808682 10140519 9620570 9288606 9145290 9094587 9040971 9041687 9129188 9231119 9410118
11703 9410118 9797066 10326489 11002791 12031836 13504062 15679437 19029509 24352094 33278443
11694 33278443 48530463 71905737 97161770 114564215 125877473 127965644 114332697
11687 114332697 94513998 76658247 63103263 56706429 59333882 72479475 94783345
11680 94783345 115417542 127260917 133532409 127210633 106685778 83271387 62005818
11673 62005818 44599441 32401984 24549245 19446601 16027504 13685195 11950203 10633376
11665 10633376 9622389 8723606 7886278 7162554 6476967 5850482 5344164 4935319 4606932
11656 4606932 4338891 4150400 4059984 4064294 4085540 4087036 4043279 3886395 3638329 3290738 2947448
11645 2947448 2660427 2397625 2160816 1994493 1840448 1702636 1577278 1494008 1420013 1325232
11635 1325232 1225601 1127602 1054212 998375 964597 939180 905799 883077 878075 858084 804883
11624 804883 727440 666688 607862 566664 565581 580758 593887 628461 642741 637097 619182 561193
11612 561193 502830 479702 473792 486392 507687 514942 524281 522377 511533 502449 495118 481365 490379
11599 490379 493032 482777 450911 430424 423840 429792 459055 500660 516638 511098 483534 474652
11587 474652 497112 562891 675566 773619 821915 801803 748424 655788 585022 550003 499017
11576 499017 451992 466564 505621 568997 619052 622102 609449 566051 509452 453145 387460 344978
11564 344978 321271 300395 293707 281803 282468 274801 288896 301049 316802 317047 324295 322579 297288
11551 297288 293998 272089 260405 262271 273651 295400 331520 371999 396584 422324 451019 486469
11539 486469 538754 642432 702976 701253 675230 658813 678057 731690 815539 883324 893347
11528 893347 879017 846228 841375 824296 755725 696063 650859 643562 649622 678013 659443 565610
11516 565610 460092 364686 292818 257945 228533 247839 255550 250860 240768 244473 236303 229492
11504 229492 216276 191303 159911 129514 125246 135083 164163 182429 202571 223004 236730 262381
11492 262381 277305 268070 247932 265277 293212 349862 443381 569246 652773 621466 553712
11481 553712 481778 402253 331084 304813 300273 308608 368384 469808 552437 582931 532377 435947
11469 435947 352868 287836 215615 149309 134052 150764 145285 153098 171613 175545 181892 174465
11457 174465 163716 163589 177557 195123 197090 199249 202130 175380 169824 168679 163537 149929 123311
11444 123311 110694 117595 121502 141908 168871 189179 200948 202786 202586 209554 204040 196929 161394
11431 161394 150624 159565 152998 149846 153717 170186 178555 189413 196751 195306 183889 177514 178361
11418 178361 193160 192017 189231 208314 225033 239716 273528 303101 305883 297598 313819 358292
11406 358292 425912 522814 565879 535063 501521 499020 481676 471641 442645 426527 468752 567444
11394 567444 672925 740396 732314 653829 541542 449577 383291 342197 340224 371235 413001
11383 413001 452675 461111 420622 383395 357512 341052 313274 304954 314918 324384 363417 406675
11371 406675 415910 414651 402778 402451 383608 366006 385334 434876 485303 525852 580439 640243
11359 640243 717597 789513 802903 747883 724633 717124 701977 709166 789826 924843 1105738
11348 1105738 1255324 1356473 1352235 1235755 1086807 960447 886545 840594 837476 899208 977547
11337 977547 988752 934343 837715 727329 621439 566526 549320 528786 489018 464738 422238
11326 422238 392610 391753 377749 347751 333189 338481 350961 356251 358937 356291 374286 386738 422118
11313 422118 477198 487857 454525 429012 401716 384493 366520 380045 432241 525954 663773
11302 663773 784064 853249 864902 824341 762586 699033 643270 581382 580294 629405 705593
11291 705593 782031 823852 842007 793421 692748 627788 568783 525115 500199 478082 438696
11280 438696 407244 405737 407430 417672 432664 444275 426444 424956 422322 420627 408134 422707
11268 422707 438773 443328 447080 436618 452418 416832 358126 327311 287736 275899 253467 242601
11256 242601 252221 248976 244437 254698 258992 258829 268358 267736 259243 266260 268562 283274 297236 309116
11242 309116 296829 286853 295815 301635 309241 319030 331338 329796 311901 300763 300194 264734 267522
11229 267522 285844 312886 358942 394663 463853 541932 627827 739555 844611 884312 915611
11218 915611 884837 806613 726850 678782 661851 648551 683089 767271 867845 937162 978985
11207 978985 991048 945246 850396 755207 675572 598221 540743 493026 463822 432309 432498 421543
11195 421543 431665 436661 418545 405659 407467 414373 415864 394212 376753 384255 383342 384117 393234
11182 393234 394911 375908 375513 393165 421998 471683 526858 615731 743214 874556 972576 1037063
11170 1037063 1078054 1068486 983210 882701 789988 742791 741335 789454 885851 1012661 1121091
11159 1121091 1176653 1160814 1096012 988406 874548 800961 723531 661733 616896 579943 571532
11148 571532 586133 587686 578871 570996 552934 553650 570988 575620 574209 577373 550310 537213 540250
11135 540250 525544 525435 552441 564127 561918 520774 497766 514187 525428 528517 522816 513106 508064
11122 508064 521431 529078 546537 539199 529048 557616 599888 651993 682073 723874 764362 824284
11110 824284 934686 1044861 1100349 1161422 1236909 1306799 1356700 1395658 1442254 1504984 1586155
11099 1586155 1706286 1875351 1963328 2020495 2132822 2287618 2444611 2578954 2722608 2895797
11089 2895797 3174644 3589455 4149614 4921989 5999141 7549526 9828891 13220760 18657052
11080 18657052 28109318 43646749 60952883 64903748 57571800 47879130 37043709 28391249
11072 28391249 23423649 21731151 22766157 27234904 36939697 52856442 65952654 63327064
11064 63327064 53730164 42445465 30817551 22047305 16508855 13087602 10889807 9476779
11056 9476779 8527866 7927279 7662778 7643727 7718269 7710302 7559829 7336710 7179692 7147292
11046 7147292 7152370 7228937 7341924 7556461 7989588 8654217 9628642 10962036 12818169 15496760
11036 15496760 19498465 25887417 36739031 54822132 77825596 88587032 83656394
11029 83656394 76075891 69022126 68136044 78120641 93430853 97280565 93026100 91786661
11021 91786661 96619090 104177527 99606302 87542833 76191790 67727112 67764594 78250758
11013 78250758 87849896 81544167 68614585 54372289 40261249 29695383 22857272
11006 22857272 18512093 15606897 13505761 11932189 10820133 10062021 9526408 9132734
10998 9132734 8804825 8511416 8327965 8351702 8598316 8890698 9117906 9335021 9584634 9793226
10988 9793226 10107002 10724490 11785604 13516040 16224556 20394620 26926454 38159569
10980 38159569 57169089 80828644 89731154 80787172 67791610 52993167 40409836
10973 40409836 32769268 29684431 30283925 35070402 46108845 65211390 84114617 84272926
10965 84272926 72194369 57633432 42069188 29639756 21478108 16329265 12937132
10958 12937132 10638801 8965462 7748344 6898829 6250346 5753873 5394140 5079435 4754498
10949 4754498 4513990 4363542 4203444 3983073 3749408 3568264 3413410 3279932 3205801 3164615
10939 3164615 3113314 3049328 2997978 3002680 2958908 2880351 2821635 2815517 2788313 2799300 2884764 2965007
10927 2965007 2980361 2969704 2948243 2890342 2894536 2948457 3017334 3143500 3358705 3660696 3988701
10916 3988701 4337940 4817932 5483225 6464553 7972138 10476717 14260843 17954016 18882135
10907 18882135 17874441 16400920 14895665 14211991 14726817 16520047 20002854 26117148
10899 26117148 36630482 53630369 74379081 89235900 99727993 108944351 113602122
10892 113602122 107694404 97616730 90045348 79305757 65134932 53011994 43299607
10885 43299607 36641219 34139568 36149606 42711185 50659410 52091920 46752024 39384278
10877 39384278 31368879 24563064 19965451 17249306 15656695 14753198 14302587 14177108
10869 14177108 14375404 15071327 16459050 18824913 22660582 27530114 30618896 30763642
10861 30763642 30116951 29632671 30406295 33529991 39844979 50448197 63760874 73231608
10853 73231608 77992812 84632311 98260257 124604763 160557098 192927709 215322279
10846 215322279 220262951 215752994 209738127 210895898 212297781 203098321 195563554 191094526
10838 191094526 185427061 173244662 159685572 141897014 117128666 93582185 73864641
10831 73864641 58873796 49062265 43775868 42439741 44021863 44382997 40803630 36066131
10823 36066131 31112935 26482879 23041578 20699770 19170220 18277132 17908231 17959130 18261393
10814 18261393 18786557 19597636 20981218 23264860 26980657 33288486 43689699 58897469
10806 58897469 73528686 77407515 72960567 66595845 61199640 60939644 69012418 85035202
10798 85035202 100947234 115481121 138923847 168957479 190643681 200695930 200072073
10791 200072073 179307473 144757469 111404190 82477177 60443570 45634041 36196567
10784 36196567 30200868 26406384 24260730 23803445 25363221 29078110 32718688 31908313
10776 31908313 28002125 23416578 18686069 14859801 12223940 10499085 9364279 8566661
10768 8566661 7942393 7477204 7116429 6862571 6727436 6654575 6601877 6510906 6254693 5808838
10758 5808838 5298328 4758102 4253766 3842218 3537546 3321648 3141593 3023657 2912582
10749 2912582 2818019 2732296 2662802 2563058 2430085 2298849 2187578 2063861 1959210 1859695
10739 1859695 1784759 1705470 1652607 1617817 1599692 1595001 1558587 1519578 1466713 1413768 1386641
10728 1386641 1381395 1347298 1327483 1319394 1304286 1265405 1214422 1186264 1162721 1131648 1130695 1152355
10716 1152355 1158853 1145932 1152735 1167431 1174391 1169659 1153597 1122789 1122750 1133707 1159975 1180211 1214868
10703 1214868 1227896 1251255 1266749 1276090 1319191 1346953 1389265 1448784 1486438 1478439 1441878 1380501
10691 1380501 1323914 1282800 1259013 1203127 1153538 1135046 1127757 1131682 1113915 1094194 1078562 1055216
10679 1055216 1045677 1027646 1005156 971704 939883 890688 853048 834441 848027 865557 891705
10668 891705 916756 916703 883951 845375 808388 801146 818427 871666 916856 930141 938480 960095
10656 960095 971667 989745 1031373 1125951 1194626 1250500 1304831 1382722 1457360 1538418 1595618
10645 1595618 1611430 1615106 1654647 1714647 1821175 2014915 2262441 2592018 3053227 3616187
10635 3616187 4428661 5794811 8238428 12867557 21411045 32286669 34162218 28810712
10627 28810712 22978268 16216702 10807251 7506623 5643672 4530524 3819701 3328848
10619 3328848 2999477 2734425 2512641 2349054 2282448 2222262 2136961 2060452 1988264 1933000
10609 1933000 1884575 1820630 1762774 1721492 1689346 1686217 1727743 1820752 1930922 2026514 2122369
10598 2122369 2229656 2338136 2447102 2565037 2701855 2904668 3104221 3254734 3354162 3409848
10588 3409848 3454239 3482062 3602108 3823490 4127722 4422823 4652815 4834821 5038033 5317363
10578 5317363 5731615 6299748 6970453 7715639 8623870 9794182 11461114 13847069 17327523
10569 17327523 22815986 31703880 44499708 55679895 58855285 59073051 60150528 65531285
10561 65531285 80622057 108868672 141437517 152618354 143389109 131268084 122810202
10554 122810202 126493522 141576400 155006237 151442329 133183398 113759569 98539655
10547 98539655 89848457 80409489 67301733 54906090 43487235 34279380 28022980 23952507
10539 23952507 21291202 19517851 18413309 17819984 17586025 17639171 17679683 17743547 18012747
10530 18012747 18577334 19451098 20697645 22468436 25221242 29882296 37684405 48185814
10522 48185814 55367005 56309845 56464805 58357139 64761560 77890316 95557149 116558611
10514 116558611 145818183 179575352 207012536 220116114 225004378 224756421 217595372
10507 217595372 208533996 199880612 192157563 187550226 183899790 178596261 171933590 158760678
10499 158760678 140737180 125755661 108930922 88535191 70589006 55536177 43615474
10492 43615474 35238944 29630246 25877351 23305023 21491954 20102290 18998346 18129305
10484 18129305 17501234 17240897 17198587 17160092 17145790 17246313 17653544 18608509 20453455 23813783
10474 23813783 29590560 37670582 42888282 42520139 41127480 40473022 42882933 51384255
10466 51384255 67143145 83396800 90930612 92005351 85622492 78309380 77019117 85088151
10458 85088151 98987385 104682681 98455512 85284321 71472341 61653642 57909907 55338059
10450 55338059 48112791 39634568 31389270 24045901 18682704 15115250 12756103 11067811
10442 11067811 9815800 8904823 8296392 7802375 7281472 6757150 6331752 6010886 5809669
10433 5809669 5687403 5532669 5283457 4984671 4723111 4546950 4419828 4261703 4059299
10424 4059299 3894682 3733421 3551862 3374925 3224667 3104451 3045353 2978261 2903786 2800810
10414 2800810 2730710 2674065 2591602 2519339 2469951 2391752 2331505 2273984 2222051 2145604 2076542
10403 2076542 2026304 2032481 2049487 2060983 2088896 2108804 2139076 2196353 2296558 2445772 2686810
10392 2686810 2937125 3232724 3600681 4094349 4709839 5391280 6094058 6791414 7474055
10383 7474055 8176287 9075907 10404735 12260699 14741781 18254659 23756626 31844596
10375 31844596 40671181 47166998 51143258 52314566 50701784 49317683 50885044 57633303
10367 57633303 72469898 98053478 134177779 176199005 206721750 207970565 190187421
10360 190187421 170554375 159643852 169416200 205434461 250442352 271299342 263549205
10353 263549205 244470440 221609244 194685185 163814041 133342777 106601623 85195295
10346 85195295 70727876 63514698 62886052 67630518 73914013 75017410 69001329 59497026
10338 59497026 49289347 40290061 33674294 29374506 26657895 24785164 23338377 22185206
10330 22185206 21432831 21217823 21657862 22786386 24553634 27275044 31686525 39083504
10322 39083504 50653393 64473767 74542849 79264034 83806348 92828137 106898180
10315 106898180 118358894 119612596 114191337 109647048 113014762 132048601 166283125
10308 166283125 194772940 202986181 199846038 189965290 180033871 179891137 188621076 192529794
10300 192529794 177182680 149742910 121946500 97252891 77093898 61262925 49258681
10293 49258681 40010960 32902354 27843265 24448366 22176528 20735680 20230739 21018522
10285 21018522 22953647 24433692 23661355 21142435 18077905 15092964 12723689 11045884
10277 11045884 9812739 8790785 7967671 7267221 6682541 6198413 5803415 5432687 5075961
10268 5075961 4779127 4509230 4266382 4040419 3832527 3638342 3462360 3307801 3140123
10259 3140123 2977657 2808166 2662331 2531532 2397695 2253157 2134896 2037880 1959307 1872248
10249 1872248 1778816 1676086 1602216 1582700 1600657 1650078 1677628 1660275 1592336 1519972 1483074
10238 1483074 1495016 1505949 1501764 1498819 1444407 1379538 1351956 1360019 1381250 1389318 1349526 1290823
10226 1290823 1231562 1197088 1171819 1167178 1161785 1142140 1106421 1063301 1027315 1023563 1034137 1021551
10214 1021551 1019789 999354 973121 972392 961471 944463 956168 967424 970015 964118 944650 920954
10202 920954 861415 840898 831471 834471 833916 859915 890970 901857 911919 915455 921246 924593 941327
10189 941327 985688 1042036 1058913 1064163 1086474 1076880 1074392 1083313 1117761 1116491 1050969 1019978
10177 1019978 995563 951361 946783 948379 944094 939486 941283 941949 952564 933854 878296 820385 803812
10164 803812 766680 761051 785309 797579 795697 791386 783542 771831 765316 750928 740474 750788
10152 750788 759352 757728 739281 744479 744968 786539 811733 833145 806494 794551 805802 816444
10140 816444 839795 893101 954659 1042937 1131385 1171143 1164274 1141014 1090605 1039087 1011011 1025111
10128 1025111 1033653 1008743 974782 933039 898172 882036 888987 900755 888388 875512 909085 996185
10116 996185 1116317 1263900 1444243 1657658 1892338 2134565 2370413 2569004 2715102 2826719
10106 2826719 2960994 3191576 3540925 3995256 4508478 5031008 5572683 6173918 6929634
10097 6929634 7959266 9297486 10978647 13160241 16071790 20198049 26495945 36687842
10089 36687842 53322605 77458191 103810073 125059109 140538706 148700609 147510663
10082 147510663 144911574 147390293 150404479 150155194 146734682 135092062 113645262 89528976
10074 89528976 67788386 50152723 37482176 29024653 23386977 19493379 16668725 14547909
10066 14547909 12927428 11626705 10549627 9704491 8973100 8344477 7857886 7493913 7246813
10057 7246813 7096240 7039079 7041643 7142605 7276706 7421776 7613122 7816111 8055541 8324443
10047 8324443 8596094 8880204 9289507 9963644 10922861 12232422 14029495 16523310 20050739
10038 20050739 25514188 34490375 49396013 71236111 94857462 113635102 127501625
10031 127501625 134672225 133029736 130266905 132221996 134605561 134315155 131347128 120790331
10023 120790331 101453531 79787620 60211163 44380581 33027053 25441830 20422883
10016 20422883 16993039 14499238 12612216 11164004 9966910 8946263 8145508 7499735
10008 7499735 6977202 6554133 6167951 5821290 5539707 5326720 5176085 5072936 4952957
9999 4952957 4720833 4418208 4107133 3816020 3593808 3443893 3343185 3255431 3130023 2957695
9989 2957695 2839311 2709696 2610197 2543651 2449673 2375259 2269113 2128111 1976219 1835202
9979 1835202 1712544 1603728 1498028 1391331 1275471 1152795 1056851 986185 941818 901204
9969 901204 875001 831881 787179 772373 773978 816925 870914 897647 897961 895648 849004 801325
9957 801325 749335 726857 767065 833491 848413 811631 760256 709267 673437 644513 664209 694255
9945 694255 697537 705091 707315 706268 715137 738474 755092 808105 853780 838719 773772 726000 703444
9932 703444 676750 667560 644232 591263 521106 464095 410029 394812 373056 359972 342997 339167
9920 339167 319279 314929 359024 386270 417317 455604 475967 496679 528370 548295 583705 615357
9908 615357 634883 630778 618366 578402 539436 523070 501892 494635 504071 481131 436965 399909
9896 399909 337348 301578 300377 320977 327225 333714 362056 348800 331854 325512 324442 334841 319638
9883 319638 314332 301103 305457 319409 303558 271670 256489 242285 219426 217436 212239 207447 207553
9870 207553 209361 223463 240906 274858 310974 347972 436846 530151 619890 732746 870594
9859 870594 987974 1064903 1140927 1229626 1284353 1301056 1293200 1252350 1181964 1099217 1056266 1041872
9847 1041872 1081466 1105070 1101216 1116659 1156500 1183646 1176835 1114576 1049675 1038750 1037337 1019060
9835 1019060 961441 870798 752389 624094 533058 482660 455256 423737 384641 351613 336276
9824 336276 322459 334242 343157 337743 328094 328672 334651 329680 303408 292528 295809 292397 314022
9811 314022 375230 461417 577101 657404 719504 790807 889132 959831 981289 960670 903978
9800 903978 827475 820402 862678 896064 857007 781864 689836 620371 592112 609811 683037 790811
9788 790811 864926 835070 768593 696214 635003 601302 607227 645319 690246 682456 631026 536793
9776 536793 450121 372926 311433 275972 254025 235715 212076 187064 177228 162316 168315 159507
9764 159507 138244 117473 118924 100124 75413 72772 76369 81650 55014 74792 97674 82343
9752 82343 76977 71438 85425 87899 77027 38709 38339 39422 41964 62741 77280 67822 78416
9739 78416 84446 64907 62499 62211 65729 77779 73297 72645 59604 47429 58361 66465 80331 76444
9725 76444 84569 69760 69776 68360 56919 67295 100492 114744 126443 140037 121780 92609 87710
9712 87710 103877 112801 89855 66369 82251 97836 95778 84494 82601 72213 50221 42265 60380
9699 60380 79852 79988 67915 65465 60214 63446 64938 71699 63289 60909 73502 70450 76105 70194
9685 70194 59048 52575 53572 71709 64096 17035 7088 12965 20342 18094 21482 23575 35644 34700
9671 34700 22806 10220 20872 56280 90527 75201 61514 33364 28808 51464 83058 105450
9659 105450 110824 87509 76435 82760 103195 95857 95532 85672 78445 79222 79168 58734 29387 35138
9645 35138 29027 16435 21168 41772 65681 89019 85868 82803 58343 33755 32339 36354 57800
9632 57800 78498 80151 73900 40473 23612 16641 23168 47173 58461 48134 28307 27594 28018
9619 28018 24857 48946 61471 54211 49045 47377 56865 48061 50711 50061 40426 22028 5538 14910
9605 14910 9215 33169 50785 41996 14238 6749 12982 -3201 107 12494 36471 62793 64322
9592 64322 54245 65992 52343 30878 23264 52589 88377 79562 85771 87093 85496 80308 84742
9579 84742 99717 105485 113034 115331 153323 191312 242456 314329 435004 559315 665194 745187
9567 745187 802249 811092 801104 820345 835692 827517 827891 796417 694470 555226 447772 346163
9555 346163 265072 215677 163580 134509 109289 90386 100389 89323 64579 50824 61808 90737
9543 90737 99497 88248 61741 85428 88086 78026 65295 45654 58750 73222 81044 89384 88482
9530 88482 76959 53962 70779 100922 106478 107728 106667 134477 159534 185851 233346 300702
9518 300702 391365 518147 636826 723537 778030 809470 779014 779493 785243 770821 758422 705593
9506 705593 614986 489890 384692 313229 250434 208079 176150 164008 148175 109554 75433
9495 75433 75834 78318 77630 82279 86757 81467 73415 31498 24342 36003 47714 58055 52329 54049
9481 54049 58308 53994 51612 54837 71248 73101 67315 76720 82308 74354 79915 74541 54306 34206
9467 34206 32914 38634 46333 43890 44442 53064 54258 43041 19472 6145 21126 7629 3458 -2718
9453 -2718 4908 14439 -13110 -8158 21108 42167 33658 17659 18699 22670 32232 34007 21312 23393
9439 23393 37775 13545 -10683 -18265 -26773 -12897 -4677 23035 24813 39422 66539 67963 57675
9426 57675 42574 18031 4396 2235 20764 44935 71490 68876 40729 11749 7043 15498 30284
9413 30284 13122 13861 17192 37616 41928 40952 14280 -5162 563 4925 8260 -676 12414 30105
9399 30105 36457 49839 59148 41530 17603 5943 3528 -4297 7650 20102 10264 9430 19721
9386 19721 30563 20668 17709 26179 23703 29212 29208 14850 33137 45974 82531 68450 63796 69606
9372 69606 71036 48750 41583 40061 32510 40136 49369 72045 78965 53923 47367 47853 48621 44638
9358 44638 35238 41408 41894 52501 56017 37264 13460 7761 30362 38278 38235 43484 32562 25107
9344 25107 28121 20107 35587 37152 57553 46778 32521 30133 49662 55576 37235 31034 50735
9331 50735 45890 19337 6555 -1048 -5500 -12936 -4164 20244 8967 -920 30637 33432 19273
9318 19273 6286 9471 26570 27164 34149 38157 16531 768 15765 20443 21862 23748 18825 -416
9304 -416 12646 39390 57306 55114 45125 35389 43477 36839 48401 65003 60497 57781 61742 64163
9290 64163 54922 29302 11647 16191 26474 20361 5405 221 5823 -13413 -24853 -35261 -28450
9277 -28450 -14261 -13722 -9104 22625 32471 18879 14538 -5990 -14428 -921 23929 40642 44289
9264 44289 21615 10234 9326 9115 7658 -2110 -5658 2331 8188 32732 51157 45030 28742 23005
9250 23005 10174 -9108 -14875 -15073 3352 31434 42107 37015 23374 25878 40106 26593 15217
9237 15217 14874 27964 34609 34248 6860 18421 24630 22955 23678 22924 28985 -1747 745 3242 14204
9222 14204 19093 27067 -819 -20110 -11068 7695 25601 24709 21541 16872 20486 17912 -1297 -758
9208 -758 -2185 9139 23023 14455 5527 4415 17930 16847 31343 31048 35460 48683 35743 21373
9194 21373 5618 22936 27715 24322 19223 20023 16550 5090 13715 33322 29746 18760 3840
9181 3840 -6504 -12200 7501 11063 21351 37649 31967 20200 8423 5339 -9009 -3173 -7844
9168 -7844 -10052 490 14816 31009 47930 23953 22156 26348 27385 1043 -1201 16278 31528
9155 31528 27404 26427 23391 10760 16334 27934 34638 40137 24071 5168 -8711 -15043 1087
9142 1087 27430 33031 40411 36516 34689 24490 16257 10296 7927 8725 25489 20991 -999 -26427
9128 -26427 -18057 3963 8390 11131 25933 35595 33219 42379 39783 31539 27589 31211 31122 56052
9114 56052 62117 50346 40529 34461 35910 27809 20808 14961 18344 25315 17173 12307 5568 11080
9100 11080 26407 42403 40741 35507 24600 26716 27925 -3432 -5986 21948 25969 21886 17484
9087 17484 10760 -8903 -24513 -22042 -39624 -25952 -10503 12262 19309 23478 15541 13763 8630
9074 8630 8739 24433 43589 41405 19093 14685 12451 5208 18400 22209 45816 47180 25308 23915
9060 23915 27851 14882 21344 15122 27422 31058 1268 -5971 -14583 -15716 -6906 2350 15448 16036
9046 16036 18231 32625 20912 7276 -545 -9709 -8643 -22302 -20744 -1273 8339 -1877 -6783
9033 -6783 -16753 -9043 -2980 5883 20255 15793 -1128 -14114 -28639 -12722 -20856 -15544 -15977 -4369
9019 -4369 18617 22818 30688 26668 7572 3506 11678 -2161 -17992 -14386 4262 22184 26924
9006 26924 16131 23841 34869 34705 24652 26710 29814 34693 29571 19004 11519 9816 7758 5933
8992 5933 5024 2983 10554 18344 18572 10199 -828 -16328 -16176 800 27813 22693 13169 15369 18904
8977 18904 7309 -7235 -5405 -6410 4212 10265 -6935 -19269 -16734 5050 49537 53916 9633
8964 9633 11938 40665 34403 29324 26505 10831 -4082 655 11863 11975 39489 38653 34308 30776
8950 30776 23568 18169 14138 9763 5188 12771 16966 4633 -20614 -35160 -38308 -27029 -8886
8937 -8886 887 -5538 5787 2451 2157 5530 -5025 -19041 -17603 -6673 5014 7705 -10663 -3682
8923 -3682 19665 19909 2593 4816 19378 28417 31296 17372 25494 49295 52007 27506 7611
8910 7611 4448 -970 12168 18129 4362 3667 10180 23211 22966 19471 29205 39429 48409 53288
8896 53288 53029 32615 21994 1718 -8245 -7761 27507 55587 61372 59279 64096 55878 20083 13715
8882 13715 5283 8744 27810 39573 48987 50199 34224 17307 19617 28340 45184 33172 23080
8869 23080 -434 -11209 -13965 -16204 -11281 -16571 3089 -12356 -12671 8898 3081 -10985 -6737
8856 -6737 -3198 10055 20167 35830 33923 20787 5340 5787 10519 5172 -2736 -8414 -3493 -7274
8842 -7274 824 29095 55369 72495 64561 31582 2180 3829 17637 15277 29009 18941 6152
8829 6152 12352 13570 10375 -9535 7129 17032 9004 15660 7704 23301 48555 46024 33748 31104
8815 31104 25690 11792 14403 7109 -1971 13011 36607 52097 65525 91368 112687 163423 186613
8802 186613 190428 169079 138331 90386 70285 60708 34821 31238 6617 921 21689 27276 7906
8789 7906 21800 35126 50934 37402 6443 -18162 -11374 -3614 -8102 -22875 -24481 -18651 -15920
8776 -15920 5110 12592 18150 32060 21045 10958 5128 -8206 -3642 6745 11827 8292 8316 24568
8762 24568 51893 53031 44556 22948 325 4273 19917 9350 18962 27489 18191 11496 28027
8749 28027 5559 -14172 -4975 7669 12744 -5361 1946 24675 19104 23823 13211 20541 481
8736 481 -30855 -36634 -28410 -13978 -12415 -12081 -4760 -9168 -3785 -5053 17490 30917 24883 36288
8722 36288 36820 44514 30552 33727 26520 2384 5300 28141 51601 72424 51751 29796 26294
8709 26294 36045 27969 13265 1085 -3924 25639 32006 33109 37806 43605 86333 155777 191914
8696 191914 211692 188795 140503 107749 96455 65867 39330 27349 33553 33883 21009 5041
8684 5041 3948 3131 2457 9093 319 20935 16584 10301 5601 2797 -5525 843 27226 11342 813
8669 813 21502 25319 31826 16391 9295 -9068 -2421 3059 6079 2858 11629 10650 9399 9269 17466
8654 17466 35969 34069 31817 26296 39261 53430 33063 22221 -14480 -19253 9266 17075 46
8641 46 -8707 2543 -4505 -19084 -22609 -10519 -18447 -32991 -14194 12452 33937 33205 13177 19070
8627 19070 49130 52164 40588 45531 59120 46530 33462 41102 35535 13611 11104 1701 9017
8614 9017 21151 21735 26894 8995 -1245 -10286 -10235 5549 11539 14985 28814 517 -4014 -2840
8600 -2840 -1571 4161 4753 7047 6270 9056 4793 -17655 -36972 -52469 -45274 -32440 -14842 -10750
8586 -10750 -9457 -3021 -15547 -23678 -37696 -23498 689 -4717 -9871 -15992 -7614 -5306 -4922 2247
8572 2247 13495 30734 27595 35293 35571 37603 17929 3129 -8988 8270 26483 17213 14594
8559 14594 18791 27486 11126 19069 31053 25877 21633 28785 7632 334 -6604 11222 29235
8546 29235 20835 16697 24373 13790 23531 29917 14098 -5266 -9485 -879 -5512 6091 10836 9570
8532 9570 11605 19570 43251 53360 33718 -5255 -12155 -8145 -3343 -9373 623 6713 -3619 -3531
8518 -3531 230 1411 18050 566 -2375 6005 -3152 2839 2342 -6160 -5423 -8654 2624 -11951
8504 -11951 -14028 -6049 -13112 -22068 -5443 26812 27713 15511 22511 26277 18108 18533 30907 50953
8490 50953 56084 51436 61488 49591 18390 20590 37356 42606 44481 34636 15635 -2568 13310
8477 13310 32171 30635 33337 13684 -12931 -15470 -24396 -11054 -3302 1906 15384 22201 19494
8464 19494 13990 -1442 -8453 -25863 -23074 57 5695 -206 -9947 -13924 -7018 4257 7050 -9437
8450 -9437 -19368 -6270 14266 6612 2671 20072 28506 7768 -1597 1778 3550 10491 13455 11440
8436 11440 16587 10484 21772 30481 16001 7053 15745 -7607 -14311 6015 12944 9874 6564 343
8422 343 -10972 -9651 -2300 -7656 -19314 -25430 -21888 -10885 -8723 3228 -2190 -1514 -1191 -3662 -7245
8407 -7245 -6584 27667 27051 2094 1541 7400 9578 5904 -9382 -7773 -1121 -1715 6886 5073 12730
8392 12730 11429 22742 14251 8065 -10587 -5618 11978 28790 26386 31915 25872 18838 6519
8379 6519 1588 16373 17288 11878 25412 29959 36740 41585 37108 29327 9112 -3340 1238 7737
8365 7737 46820 110295 156421 169812 156730 152159 105766 98857 111241 152545 189312 178270
8353 178270 163458 129238 85916 46582 22906 30917 37698 30684 20680 18843 -2608 -17569
8341 -17569 -12242 -4293 -16334 -24525 -6400 35000 57667 43731 3880 -20656 -34169 -31819 -20230
8328 -20230 -13427 -4372 19393 6395 -15483 -19521 781 5629 -8192 -12875 5827 15616 22120
8315 22120 21631 9834 -10007 -21252 -36725 -53659 -51752 -33575 -15229 -17017 -30117 -11130 2782
8302 2782 -7978 -5748 -2245 -15604 -4803 20950 39000 30157 9269 -11325 1368 10848 11373
8289 11373 33706 24890 10516 -3129 -17531 -8117 -13448 -22630 -23510 -9971 -5052 6401 10949
8276 10949 -9488 -4207 5141 3120 -725 9281 6831 17647 15986 -14185 -37600 -19442 5623
8263 5623 14436 3060 7275 18965 9736 -5943 -6692 -4355 15532 53279 84634 119000 138465
8250 138465 163573 147475 118859 111321 116754 123316 130443 159169 166368 159459 124889 84638 43526
8237 43526 17570 -2504 18486 20672 16643 19799 39363 37598 42982 45391 37000 30830 22304 18712
8223 18712 4417 -2897 -19598 -25918 -28508 -4392 19921 18914 18865 6002 4289 14376 7363 5826
8209 5826 12816 26184 13860 -6859 -22095 -21301 -1835 5122 8156 32197 42185 24596 26997
8196 26997 36809 27869 25186 21050 46162 54041 35827 31264 34387 48735 34061 24327 32117 29475
8182 29475 7563 1385 436 16809 -5278 -24434 -35722 -11090 -3125 -18212 -23939 -2158 2305
8169 2305 -5982 -5493 -28235 -45755 -50265 -37025 -38627 -35445 -19928 590 6256 9815 12105 2450
8155 2450 -6159 -21248 -28505 -13109 3380 6916 -3146 14864 14815 10612 8901 20035 20180 -7400
8141 -7400 -19048 -12585 -13654 -12352 14941 8635 -1666 -1437 5059 6366 26705 33952 26073 5531
8127 5531 -12344 -26157 -19030 -9269 -10737 587 12684 38574 38946 20200 8749 18295 29400
8114 29400 -2876 -9498 -5564 2800 -3622 -1894 1678 820 -3471 -32238 -22191 -13591 13313 20747
8100 20747 36633 48163 43889 17774 7998 22666 21107 7354 13620 34541 42172 39267 39058
8087 39058 29796 7729 -7360 -20118 -16665 14414 35004 25512 6852 16046 15964 28076 36798
8074 36798 31270 21856 14965 11239 7138 7207 75 6916 9455 -1720 3424 630 -7123 -14015 10873
8059 10873 17108 15367 18565 23508 32151 24932 21914 23936 9391 10297 8501 14587 6534 -3469
8045 -3469 14963 39311 39589 18000 18292 21997 28693 34904 30121 15049 10433 4949 785 9346
8031 9346 35501 44774 48516 31329 8039 1366 7736 16683 11142 306 -13087 5830 1804
8018 1804 12507 12552 -5761 -22274 -43207 -30778 -16092 -16469 -4631 14714 16808 27687 31631
8005 31631 16049 15694 16457 12056 26910 22617 -13000 -4235 4265 8299 15842 -1665 -2570 18932
7991 18932 12739 -1132 15343 17129 36059 40510 31040 21962 -2449 -8522 6412 15723 3359
7978 3359 -2993 -7112 5195 18604 17460 1368 891 -6232 -132 9750 18312 23531 9346 3516
7964 3516 9661 22460 6568 11953 31021 32170 26056 31234 27042 15105 25514 10760 -779
7951 -779 -9278 -7378 -2872 -2801 5080 6762 -5462 -8382 -2087 -12214 -8434 7013 9588 5225 4753
7936 4753 1281 23002 36108 13984 1784 7634 8564 -6332 -17182 -11504 4985 26865 27808
7923 27808 35450 40734 25214 19640 44487 66075 43246 41127 47388 25075 10021 26625 39673
7910 39673 28853 5444 -7730 -3228 -2510 -12476 -7887 -9791 -15905 3994 1091 -5353 -11750 -11856
7896 -11856 -12037 -30009 -28760 -21444 -3069 -5029 11107 23339 19965 -8596 -34273 -42312 -11775
7883 -11775 1060 19719 16773 -1946 -5495 -6581 -10722 -10795 -10350 15571 33215 33317 9577 -10791
7869 -10791 -3457 5647 23710 26474 22462 23092 3877 4829 5822 471 4580 17189 16366 4722 -12091
7854 -12091 -4027 -7560 -9819 4307 -3025 4625 17008 3103 1274 744 10391 10911 26924 10868
7840 10868 11401 10636 -13407 -4842 26022 36067 23492 20481 23967 46162 93244 94980 68236
7827 68236 68125 76248 63462 35632 4189 -5857 -3539 6089 26878 29710 25325 18490 13389 10363
7813 10363 -2066 -7064 -22626 -22579 -8227 -8617 -25509 -29231 -9146 -19697 -16345 -1404 5497 6354
7799 6354 1960 9420 12647 9361 9794 -21311 -29602 -23623 5291 11353 7659 22931 26626 4137
7785 4137 315 11647 23536 6745 -207 -465 -7091 -5258 17666 16049 12146 3856 18496 37522
7771 37522 34062 15139 3454 4522 -1966 15922 22626 12973 30307 33208 -8428 -11703 6778
7758 6778 18634 27744 34789 20160 36584 63362 81326 82736 70165 53194 31162 20487 31137
7745 31137 42231 30765 14495 7570 1722 2010 -7911 -11369 -18992 -7603 8230 8919 12217 7835
7731 7835 -3577 -5079 2159 6766 6063 15007 41847 23672 -7332 -6625 -8488 7727 15664 -565
7717 -565 -5207 9915 33878 46060 29782 12817 20736 9722 4273 11117 34749 42110 39913
7704 39913 31023 29677 27053 38874 43535 27512 15438 19618 37218 36103 48817 35793 32708
7691 32708 17564 25499 22129 10248 13474 7019 -2579 -6223 -14655 -15374 -8121 -6538 2021 6626
7677 6626 1941 1827 -3180 18843 19021 11695 4814 18981 21372 18422 18998 18395 7803 15202 25711
7662 25711 15673 24706 29135 17134 31775 32741 25817 19393 5891 15300 -3027 -5789 4663
7649 4663 -3105 -4317 776 -6650 -1393 932 -11011 -34016 -23721 -6882 -8984 -6029 2617 21763
7635 21763 33544 18328 -5992 -19867 -14185 -13753 1163 29861 32865 18777 25079 8595 951
7622 951 22707 30288 40547 43716 21726 5852 22419 26969 19887 9000 1924 -2381 -2817 -458
7608 -458 3980 23851 28287 38119 38372 48478 40122 28927 26641 20550 11747 8572 -6157 2178
7594 2178 -5158 2209 1984 -5653 -10501 -6467 -6208 -6113 -1635 232 -6367 -13269 -9416 -11449 -26274 -29562
7578 -29562 -28441 -28573 -33481 -5548 25687 21351 15361 28475 27837 17058 5800 -6578 1779 -1167
7564 -1167 7451 -10649 -1553 19133 18788 13127 4552 12417 29140 34241 20501 21794 19023 5115
7550 5115 11654 9590 19131 18292 -5243 1038 15609 13017 12365 9786 12734 -9376 -17868 8162
7536 8162 4462 -765 -7226 13391 26725 5941 -18218 -14055 10854 18032 25771 32219 21397
7523 21397 -2224 -21153 6132 36184 50477 38346 40618 54840 73334 120473 187600 192663
7511 192663 164386 144136 124703 106383 122803 161662 168630 188876 170505 131245 70206 33527
7499 33527 24573 11388 22258 13442 7169 8877 2929 20049 7276 -9018 5900 13776 30844
7486 30844 30519 18781 13086 20913 10386 15974 22611 29086 16001 10356 16198 18468 36399 48329
7472 48329 60717 91617 89651 90654 109298 116329 138485 135706 137026 135334 134775 120049 116689 123996
7458 123996 98932 78769 89887 89458 76373 68407 50749 55667 63786 65176 53626 51731 65328
7445 65328 102901 132998 186129 218147 197866 174098 154333 136373 128564 140170 154714 144421
7433 144421 152103 143815 116957 83613 48878 33769 32161 44692 43497 33652 26935 26568 27268 11940
7419 11940 -86 -1744 19296 23248 348 -25684 -31122 -22775 3037 14654 23299 22745 8173
7406 8173 13860 7281 575 -606 -3267 6818 2117 -4564 -6685 31 12258 1993 15089 38312
7392 38312 29453 25985 10298 2277 6418 18026 25350 42762 68418 82332 88571 113145 146252
7379 146252 188806 219940 228314 228895 217743 213590 190166 164289 132086 109243 114033 107713 65663
7366 65663 40509 9272 -9447 -10042 13365 14443 -3380 -1760 -3538 -15661 19593 43893 23206
7353 23206 17760 13492 -1215 -15828 3458 7524 2070 14611 15823 1866 -9075 -3861 13210
7340 13210 7019 7966 6585 9580 12298 25077 41867 37379 23597 22600 32384 30504 27107 27046 34817
7325 34817 36763 37375 45547 45031 31139 -13265 -27409 -15553 -2949 -6491 -3596 -15242 -7413 -721
7311 -721 1671 8563 17206 37628 36804 27991 14682 -2458 6630 12714 22134 23349 22849 25775 18995
7296 18995 18295 17708 20665 17703 24199 22684 5299 13298 35089 44119 38618 32782 36574 46412 49998
7281 49998 52720 39263 36395 48581 66374 84636 92148 123717 156548 184450 222459 254175
7269 254175 297913 324261 347026 380751 411827 427959 403388 385342 387547 388626 367607 332165
7257 332165 290462 259434 220838 177509 146255 122322 94661 66564 55518 43823 55399 62353
7245 62353 60185 49946 55972 46069 31660 26922 23071 15813 29229 43648 35690 4148 -13615
7232 -13615 5089 3486 12744 4775 -2836 7670 22662 21165 52794 64932 54334 38116 18473
7219 18473 2915 6514 8512 20651 15136 20435 30862 27831 23192 22122 9982 15563 8951 6240
7205 6240 -2217 1792 -12980 -30483 -40274 -21490 -14804 -27859 -36435 -44392 -48011 -23514 -15237 -9454
7191 -9454 -7464 -5216 7119 2886 -15684 563 19891 21391 19323 33122 16850 13651 23954
7178 23954 21740 9005 -3022 -8403 -5782 -10574 -28026 -41620 -30929 -48714 -47653 -42764 -27645
7165 -27645 -24090 -22008 -4284 -6236 -17415 -8180 2453 -15066 -17291 1547 10934 7111 328
7152 328 11537 7881 -7305 -15065 -19244 -675 11911 -14163 -13320 -9705 -15415 -12258 2655 -3757
7138 -3757 -12818 -28185 -16294 -9061 -9004 4224 20884 22212 3810 -15623 -15227 -2020 -17354 -33710
7124 -33710 -14442 -16986 1110 3882 4151 -19847 -20832 -8382 -4479 -17165 -13055 1336 3824 -10432
7110 -10432 -10550 4530 16210 23830 22849 6764 5707 -1643 15531 16736 17076 10630 7915 12654
7096 12654 12983 -3813 7657 10156 475 11937 19479 28121 38757 36938 19662 15126 12315 14827
7082 14827 15778 13543 15798 6233 -20310 -13527 -7631 4022 28000 21847 3844 9524 29840 33286
7068 33286 34006 32736 29648 21658 25182 26857 572 -5103 -6881 -17240 -26577 -23619 -9597 3298
7054 3298 -8146 -3745 -7362 -14299 -5546 1704 14189 37319 15842 -6799 -3934 -13330 -20663 -19684
7040 -19684 -3391 -15291 -12386 -6706 -12725 -6851 10748 7726 12489 19601 34272 40625 29834
7027 29834 31341 26327 11221 1104 1064 6600 13075 8598 1103 8453 -379 -3853 -20481 -17565
7013 -17565 -19206 -2651 8291 17093 -3430 1921 13098 -13925 -30581 -15117 -8863 -5192 7300
7000 7300 7237 27104 39884 21707 11163 -9525 -10579 -3227 3066 17905 24358 29601 18583 6810
6986 6810 -7434 -2475 13404 10644 3555 14161 11844 7804 12046 21764 22647 1076 8610 24068
6972 24068 20113 5750 -7044 -23131 -10746 8939 -1876 -14575 -21107 -3164 11930 -7287
6960 -7287 -33103 -17308 -6599 -1417 16308 36185 35172 19124 -17279 -31866 -23786 -29723 -25019
6947 -25019 -13132 13078 16336 -12541 -21252 -18704 -40671 -40535 -33542 -35959 -39461 -45201 -36646 -25615
6933 -25615 -3092 13783 5374 -1752 -7075 -12169 -2861 3190 9986 -886 -22424 -31507 -22916 -22373
6919 -22373 -17401 -18666 -8583 7592 24250 26816 29016 25260 15576 -1364 4149 165 4291 6886
6905 6886 -9894 -15304 -22943 -27317 -17924 1660 9766 9212 18931 14941 32 -11972 -9376 -23071
6891 -23071 -23570 -27243 -14452 -3269 -10461 -18892 -17237 1545 8232 -567 2346 11683 14543 -1169
6877 -1169 -12631 -9323 -30099 -50924 -43786 -35740 -9547 -12504 -10794 -10768 -8795 1210 -1954 -31614
6863 -31614 -19326 -4490 -7457 2733 35902 57923 50734 43924 33037 22329 6785 5945 16904
6850 16904 10940 -5157 -4913 5159 660 -12094 -9014 -3273 2996 5423 -3540 -5922 -9217 3805
6836 3805 11640 2365 -5727 -7903 -4939 10147 12734 6586 708 -9990 -24406 -19918 -26090 -19100
6822 -19100 -10413 -11278 -11468 -1421 18418 2790 -22207 -9283 -10108 -12880 -12109 -8195 -4255 25979
6808 25979 19750 11030 -6379 -19770 -10615 5785 24156 4382 -16015 -26689 -8872 -15211 -424
6795 -424 -3487 -24695 -27580 -32279 -21987 -3398 -394 2938 11818 7434 -3552 -6760 -23289 -36143
6781 -36143 -23093 -22385 -12645 11152 18360 11714 17088 18696 4028 25602 23098 942 -71 -18509
6767 -18509 -33177 -45417 -29829 -14894 -18437 -1013 -8301 -7803 2537 17158 1535 -3039 11755
6754 11755 26890 25808 18169 23074 17106 14447 15227 40033 48326 20231 5349 3368 4857 6066
6740 6066 20929 8475 2006 2313 17617 27392 14164 3405 5267 13873 19034 17392 25815 8641
6726 8641 -21463 -19503 -17146 -23297 -36515 -32661 -4042 18182 39916 32703 6857 -7339 -12484
6713 -12484 -11879 4029 -9074 -10843 -11139 5600 15493 18128 32719 24762 30051 33122 28417 21813
6699 21813 6126 -6933 -21952 -6536 -13072 -17558 -19033 -6465 -5904 5607 11123 -2140 1469
6686 1469 2207 188 -4635 997 -1866 -27446 -29598 -17798 -17547 -3942 -3927 -8285 -3061 -11499 -8698
6671 -8698 7681 4456 654 -11097 -9660 -8037 -4443 -975 9785 10532 16791 16600 17046 18387 21123
6656 21123 12642 -1283 6335 -1467 -13357 -31427 -36712 -27118 -12802 10993 18614 6545 -816
6643 -816 1773 12965 16317 8839 16720 5791 23144 30735 12964 4984 7923 -2681 -1667 -5322
6629 -5322 4469 -12284 -18789 -27413 -33157 -15330 646 6404 -4351 -10782 -17182 -13964 -8303 -16565
6615 -16565 -18837 -16334 -6836 -11554 6002 10093 5838 -1645 -7253 -19861 -21759 -17236 4642 15462
6601 15462 5444 1315 -4618 5318 32967 29023 14540 207 -1061 4000 16641 5555 15026
6588 15026 33597 13997 -13363 -9234 -5214 -3841 -21017 -16456 1959 -9162 8663 6155 -3953
6575 -3953 1706 -8889 -13343 -2503 -2862 -8956 -5210 2049 -19609 -21772 -22785 -5762 5591 11234
6561 11234 22260 28611 12950 4702 -3026 -24690 -36322 -22231 -23263 -15166 819 -13504 -32449
6548 -32449 -23563 -17859 -23860 -23131 -17227 -20745 -17327 -12524 -2772 6458 2689 -4878 -6196 -3644 1561
6533 1561 2953 13800 14871 -3482 -11937 -15926 -16007 -21867 -26772 -30806 -37754 -10793 5964 -20051
6519 -20051 -20701 -13215 -6469 -18510 -34735 -34676 -15701 -20357 -30921 -22158 -4697 14483 -1307 -1733
6505 -1733 -7350 -5325 8649 16697 13615 17191 22412 35587 11716 -12888 -16866 -23544 -32686 -4901
6491 -4901 1970 3120 12806 11546 6324 2112 17406 22852 22584 -863 -29344 -20659 -27144 -30400
6477 -30400 -3334 29772 33837 23460 12746 -7711 -43030 -31228 1285 8039 14182 24015 21735
6464 21735 19426 14340 20625 17887 13802 -16310 -30143 -27892 -22744 -9641 -20712 -22979 -13442 -25806
6450 -25806 -21342 2079 6130 -2270 -30439 -46751 -37544 -33464 -30401 -12115 22028 24267 -2627
6437 -2627 -20998 -5140 3815 -6542 -17748 -28690 -34955 -32339 -20752 -12649 -6217 3643 15394
6424 15394 17836 15084 16712 12184 3245 4320 -17489 -28176 -16585 -14655 -7099 5059 13682 -7691
6410 -7691 -21730 -15246 15914 11096 5589 9071 -4192 -12434 -18891 -5326 -3874 7268 25183
6397 25183 24208 -10050 -22430 -5319 -12146 -17418 -17538 -9802 -9618 -11580 3407 3860 2421 -5933 -40073
6382 -40073 -31066 -27816 -40132 -16342 8616 36914 41095 26205 22464 26403 -2217 -1464 -5229
6369 -5229 8521 2210 -10734 -34070 -26780 -23254 -16790 -10534 -3058 -7676 4786 7148 -13387 -19749
6355 -19749 -15049 517 22640 32322 28873 10465 -1674 -33908 -32324 -5257 35649 58279 30591
6342 30591 2443 -18885 -29595 -13458 -18313 -1369 4959 7188 -18426 -4584 8428 -5404
6330 -5404 5151 13231 11304 20111 11352 -3422 -11192 -17057 -6376 3353 3444 2116 -22085 -14442
6316 -14442 -13355 -13200 -25475 -25536 -13480 196 3427 -6716 -5424 11541 1440 26028 20044 -51
6302 -51 11053 5324 -1198 -3402 -4268 -2848 -15832 4003 1002 -11043 -4902 -2928 -14109 -26251
6288 -26251 4080 16283 9448 5186 11466 11024 -5707 -9397 -18048 -4724 8772 -5076 10669
6275 10669 23597 23924 15949 188 20194 24813 28913 5429 -16233 -9933 -984 -10072 -20660
6262 -20660 -14437 -31277 -33279 -25650 -1853 13104 -2810 -11274 -23791 -29528 -8355 -12987 -20032
6249 -20032 -5904 -13799 -7562 422 -1263 1121 21969 33632 29446 45178 22637 -6180 -5255
6236 -5255 7008 -8277 -36630 -34442 -15623 -1266 -1 -3966 -8835 -20525 -14355 -4716 3093
6223 3093 7474 7900 16453 12413 -8829 -7715 -13120 -37317 -39162 -19795 -26149 -44455 -25960 -221
6209 -221 5089 3659 12611 19929 12814 19527 8659 23003 14597 -5918 -15861 -26943 -19487 -14326
6195 -14326 -11944 13365 24676 10213 9180 23112 22094 25968 20719 7142 -11833 -15008 -9713
6182 -9713 12478 8748 5223 10132 5358 -10433 -2223 1454 3042 12305 11542 7985 178 -10738
6168 -10738 -16638 -23166 -11123 5966 2772 -3834 -10901 -19715 -16467 -4211 12821 7074 9644 1145
6154 1145 7497 7471 -4842 -21169 -5628 -12720 -21105 -19343 -22180 -40250 -30827 -28137 -22408 -2801
6140 -2801 -6810 -14357 -23461 -21140 -1509 -18200 -30054 -22036 -3863 4562 2173 -13303 -10079 -4152
6126 -4152 -5328 -628 -6124 -11491 -18048 -2212 6800 19059 12261 -5083 23001 32938 32300 33058
6112 33058 13124 -2209 -3863 -12959 -17240 -3354 -15665 -14799 2188 -2004 -9064 -6392 -13914 -19370
6098 -19370 -13682 -20597 19434 30421 -2390 -27180 -35177 -26540 -16900 -13375 -11609 1629 4183
6085 4183 6568 2554 -7049 3837 13818 32691 40601 20430 2313 -11768 -5082 -13147 -20549 -8576
6071 -8576 25271 42213 29976 5818 8252 -2711 -24510 -35115 -22633 -19229 -24818 -27259 -12460
6058 -12460 0 2172 -2153 -7761 -7353 -17719 -13554 -6116 5001 7773 -13428 -21382 -18566 -17942
6044 -17942 -27780 -5985 3706 3939 -9267 -24088 -28484 -22962 -15946 -25692 -25430 -18284 -6755 -15697
6030 -15697 -1368 16360 17871 -8950 -6139 12812 2207 -637 31414 43798 24467 -3410
6018 -3410 -12378 -11910 5453 16835 19337 8009 6022 4053 -13295 -19718 -33704 -59425 -63204 -40811
6004 -40811 -26684 -26906 -16956 -2097 7691 14009 6330 -3791 -16755 7979 15455 6025 5874 -1650
5990 -1650 19294 19373 22153 12241 -1907 -2682 -15852 -37609 -43369 -31875 -1041 16000 24631 30499
5976 30499 31882 19893 35268 43068 34221 28240 20546 7940 22702 16306 -7627 -22937 -29799
5963 -29799 -16748 -22024 -18917 -12148 -20852 1889 9922 12657 15813 29298 30774 21091 27413 28049
5949 28049 14540 -13266 -28450 -21637 -14644 -3122 8969 19924 9040 16120 10520 -7366 -2616
5936 -2616 7314 11080 17751 12292 -4755 -9246 -13653 -18301 -38365 -28927 -18258 -15027 -17573 -15054
5922 -15054 -18254 -37786 -22483 -10281 -20094 -31668 -42151 -52236 -67981 -61682 -28443 -6719
5910 -6719 -15719 -16334 -16930 -12813 -10028 -21485 -3875 9199 -2091 -10042 -7380 7831 434 -13211
5896 -13211 -20719 -28495 -14759 -6011 -7474 9851 13683 14702 22425 28116 35223 6129 -273 -1175
5882 -1175 -10666 -37330 -29525 -10710 -9134 6000 20811 -12084 -30441 -13451 5206 19414 22712
5869 22712 8325 4242 -14416 -11448 -1206 -22095 -47084 -26759 -14879 -17937 -23017 -29193 -23871
5856 -23871 -1743 -5282 -7810 -8602 17235 7370 -10641 -1432 -4700 -33433 -35591 -15875 -17269 -4039
5842 -4039 9097 5416 -2139 6711 14601 17114 13971 -9647 -16521 -20935 -13202 -27976 -40290 -48552
5828 -48552 -12891 4242 -1380 2668 -12079 -18198 -15909 -9670 3347 3231 2352 -9351 -828 341
5814 341 10459 19674 21862 21296 8033 13237 10094 5343 17395 17664 12408 16407 16733 -1808 -1912
5799 -1912 -7891 11307 35874 4619 -18807 -29666 -48022 -41348 -18280 -3346 -20783 -22906 -11164
5786 -11164 -4308 -11817 8386 5590 -16811 -16721 -7466 3027 5220 17 -14052 -6182 21410 49197
5772 49197 34350 5625 -7502 -8007 15854 28382 924 -331 9146 9595 11382 -12736 -6421
5759 -6421 -24202 -30070 -21339 -8354 -9880 4558 9481 9407 -3154 -12207 -4497 -15418 -10507 -5874
5745 -5874 2501 -4233 -9582 -24313 -16965 -13341 -9293 -6515 -7981 -5592 5431 18853 32982 27283
5731 27283 29220 42338 43078 55175 87681 80646 52424 61010 63020 57391 17212 9419 14089 -12847
5717 -12847 -16967 -16074 -17009 -7206 -8436 3926 -6065 1244 18332 17420 -5400 -7814 -14333 -25190
5703 -25190 -27549 -13668 -18528 -26772 -33072 -28822 -25327 -13862 -14297 -4285 -917 9444 79 7152
5689 7152 31896 24791 26956 52199 73154 98932 129935 150493 184892 178172 134143 107517 82428
5676 82428 67940 53837 36236 17411 -978 -12911 -13613 10021 31236 25322 17383 9994 -13465
5663 -13465 -16681 -11570 -7496 7243 10501 -26524 -18212 -7314 -2155 12413 12770 18151 17753 29390
5649 29390 14532 -9964 -13392 -7437 -24856 -27723 -13110 9312 22394 30011 55116 88514 144220
5636 144220 174891 165884 145144 109235 62083 22328 5479 -7082 -3158 -7535 -3921 11237
5624 11237 10046 166 -5883 -232 16336 17521 4922 -20862 -33056 -24742 -24256 -5726 -7977 -37815
5610 -37815 -49176 -20625 -7154 -7833 -7309 -13318 -17786 -24978 -29491 -16571 -2019 8409 31790
5597 31790 38687 34784 34541 24778 21273 20687 25239 30660 39128 31905 29822 17559 8631 10871 14625
5582 14625 26070 25184 30837 13864 24572 23212 25065 16294 -6232 -17750 -8514 -9405 -28371 -25757
5568 -25757 -32429 -21661 -8537 -23008 -44796 -27457 3365 -12038 -22771 -20883 -19265 -25993 -26949
5555 -26949 -19542 -39147 -36077 -17425 -14428 -12591 -10418 -5687 -307 12549 49585 53886 47279 39139
5541 39139 40521 24196 12316 3955 8003 27957 40724 29547 9782 -1697 9868 21402
5529 21402 16378 9053 5031 -12131 -13199 13025 27093 32233 14347 23483 26810 19351 7556
$$ [...]
##END NTUPLES=NMR SPECTRUM
##END=
