##TITLE=Analysis number 317952
Compound Code cc 49905
Book Reference 458/100
Project Code adrs
Chemist Name stevem
##JCAMPDX= 6.0         $$ Bruker NMR JCAMP-DX V2.0
##DATA TYPE= NMR SPECTRUM
##DATA CLASS= NTUPLES
##ORIGIN= Bruker BioSpin GmbH
##OWNER= nmr
$$ XWIN-NMR		Version 3.5
$$ Thu Mar  9 08:16:01 2006 GMT Standard Time (UT+0h)  MAYBRIDGE\nmr@NMR_250MHZ
##.OBSERVE FREQUENCY= 250.131544655141
##.OBSERVE NUCLEUS= ^1H
##.ACQUISITION MODE= SIMULTANEOUS (DQD)
##.ACQUISITION SCHEME= undefined
##.AVERAGES= 16
##.DIGITISER RES= 18
##SPECTROMETER/DATA SYSTEM= dpx250
##.PULSE SEQUENCE= zg30
##.SOLVENT NAME= CDCl3
##.SHIFT REFERENCE= (INTERNAL, CDCl3, 0, 16.522)
##AUDIT TRAIL= $$ (NUMBER, WHEN, WHO, WHERE, WHAT)
$$ ##TITLE= Audit trail, XWIN-NMR		Version 3.5
$$ ##JCAMPDX= 5.01
$$ ##ORIGIN= Bruker BioSpin GmbH
$$ ##OWNER= nmr
$$ C:\u/data/dgb/nmr/ADRS/350/pdata/1/auditp.txt
$$ ##AUDIT TRAIL=  $$ (NUMBER, WHEN, WHO, WHERE, WHAT)
(   1,<2006-03-09 08:15:42.91 +000>,<MAYBRIDGE\nmr>,<NMR_250MHZ>,
      <created by zg, POWCHK disabled, PULCHK disabled
       configuration hash MD5:
       84 BC 41 DB A1 6E 1D 46 DA 25 12 A5 C1 ED C5 3A
       data hash MD5: 64K
       E5 69 AF E1 D3 66 02 A8 5F 29 1E 53 6D 2A B3 BB>)
(   2,<2006-03-09 08:15:54.20 +000>,<MAYBRIDGE\nmr>,<NMR_250MHZ>,
      <Start of raw data processing
       ef LB = 0.3 FT_mod = 6 PKNL = 1 SI = 32K 
       data hash MD5: 32K
       46 EA 59 D5 CF 02 1A C6 CE 37 EB 61 A4 50 CF 24>)
(   3,<2006-03-09 08:15:55.85 +000>,<MAYBRIDGE\nmr>,<NMR_250MHZ>,
      <apk 
       data hash MD5: 32K
       EE 20 68 20 06 C0 C7 BB 05 09 D7 30 FF B8 A7 B5>)
(   4,<2006-03-09 08:15:56.60 +000>,<MAYBRIDGE\nmr>,<NMR_250MHZ>,
      <abs ABSG = 5 
       data hash MD5: 32K
       FD 8E 7E 90 E2 69 9D ED DE EA 08 88 21 5B D0 58>)
$$ ##END=
$$ 
$$ hash MD5
$$ 26 19 43 11 66 10 7B B1 A6 BB 60 55 89 67 39 C2
##$RELAX= 
##$RELAX= 
##$RELAX= 
##$RELAX= 
##$RELAX= 
##$RELAX= 
##$RELAX= 
$$ Bruker specific parameters
$$ --------------------------
##$DU= <C:\u>
##$EXPNO= 350
##$NAME= <ADRS>
##$PROCNO= 1
##$TYPE= <nmr>
##$USER= <dgb>
##$AMP= (0..31)
100 100 100 100 100 100 100 100 100 100 100 100 100 100 100 100 100 100 
100 100 100 100 100 100 100 100 100 100 100 100 100 100 
##$AQSEQ= 0
##$AQ_mod= 3
##$AUNM= <au_zg>
##$AUTOPOS= <3 >
##$BF1= 250.13
##$BF2= 250.13
##$BF3= 250.13
##$BF4= 250.13
##$BF5= 500.13
##$BF6= 500.13
##$BF7= 500.13
##$BF8= 500.13
##$BYTORDA= 1
##$CFDGTYP= 0
##$CFRGTYP= 5
##$CHEMSTR= <none>
##$CNST= (0..31)
1 1 145 1 1 1 1 1 1 1 1 1 1 1 1 1 1 1 1 1 1 1 1 1 1 1 1 1 1 1 1 1 
##$CPDPRG= <>
##$CPDPRG1= <>
##$CPDPRG2= <>
##$CPDPRG3= <>
##$CPDPRG4= <mlev>
##$CPDPRG5= <mlev>
##$CPDPRG6= <mlev>
##$CPDPRG7= <mlev>
##$CPDPRG8= <mlev>
##$CPDPRGB= <>
##$CPDPRGT= <>
##$D= (0..31)
0 1 0 0 0 0 0 0 0 0.06 0 0 0 0 0 0 0.0002 0 0 0 0 0 0 0 0 0 0 0 0 0 0 
0 
##$DATE= 1141892142
##$DBL= (0..7)
120 120 120 120 120 120 120 120 
##$DBP= (0..7)
150 150 150 150 150 150 150 150 
##$DBP07= 0
##$DBPNAM0= <>
##$DBPNAM1= <>
$$ [...]
##$SUBNAM7= <"">
##$SUBNAM8= <"">
##$SUBNAM9= <"">
##$SW= 20.6930455092707
##$SWIBOX= (0..15)
0 0 3 0 0 0 0 0 0 0 0 0 0 0 0 0 
##$SW_h= 5175.983436853
##$TD= 65536
##$TD0= 1
##$TE= 294.16
##$TE2= 300
##$TE3= 300
##$TEG= 300
##$TL= (0..7)
0 120 120 120 120 120 120 120 
##$TP= (0..7)
150 150 150 150 150 150 150 150 
##$TP07= 0
##$TPNAME0= <>
##$TPNAME1= <>
##$TPNAME2= <>
##$TPNAME3= <>
##$TPNAME4= <>
##$TPNAME5= <>
##$TPNAME6= <>
##$TPNAME7= <>
##$TPOAL= (0..7)
0.5 0.5 0.5 0.5 0.5 0.5 0.5 0.5 
##$TPOFFS= (0..7)
0 0 0 0 0 0 0 0 
##$TUNHIN= 0
##$TUNHOUT= 0
##$TUNXOUT= 0
##$USERA1= <user>
##$USERA2= <user>
##$USERA3= <user>
##$USERA4= <user>
##$USERA5= <user>
##$V9= 5
##$VALIST= <valist>
##$VCLIST= <CCCCCCCCCCCCCCC>
##$VD= 0
##$VDLIST= <DDDDDDDDDDDDDDD>
##$VPLIST= <PPPPPPPPPPPPPPP>
##$VTLIST= <TTTTTTTTTTTTTTT>
##$WBST= 1024
##$WBSW= 4
##$XGAIN= (0..3)
0 0 0 0 
##$XL= 0
##$YL= 0
##$YMAX_a= 424489
##$YMIN_a= -447400
##$ZGOPTNS= <>
##$ZL1= 120
##$ZL2= 120
##$ZL3= 120
##$ZL4= 120
##$ABSF1= 16.522
##$ABSF2= -4.171173
##$ABSG= 5
##$ABSL= 3
##$ALPHA= 0
##$AQORDER= 0
##$ASSFAC= 0
##$ASSFACI= 0
##$ASSFACX= 0
##$ASSWID= 0
##$AUNMP= <proc_1d>
##$AZFE= 0.1
##$AZFW= 0.1
##$BCFW= 0
##$BC_mod= 0
##$BYTORDP= 0
##$COROFFS= 0
##$CY= 12.5
##$DATMOD= 1
##$DC= 0
##$DFILT= <>
##$DTYPP= 0
##$F1P= 14.0000005364418
##$F2P= -0.99999901652339
##$FCOR= 0.5
##$FTSIZE= 32768
##$FT_mod= 6
##$GAMMA= 0
##$GB= 0
##$INTBC= 1
##$INTSCL= 1
##$ISEN= 128
##$LB= 0.3
##$LEV0= 0
##$LPBIN= 0
##$MAXI= 10000
##$MC2= 0
##$MEAN= 0
##$ME_mod= 0
##$MI= 0
##$NCOEF= 0
##$NC_proc= -3
##$NLEV= 6
##$NOISF1= 0
##$NOISF2= 0
##$NSP= 0
##$NTH_PI= 0
##$NZP= 0
##$OFFSET= 16.522
##$PC= 1
##$PHC0= 174.3062
##$PHC1= 5.543218
##$PH_mod= 1
##$PKNL= yes
##$PPARMOD= 0
##$PSCAL= 4
##$PSIGN= 0
##$REVERSE= no
##$SF= 250.13
##$SI= 32768
##$SIGF1= 0
##$SIGF2= 0
##$SINO= 400
##$SIOLD= 32768
##$SREGLST= <1H.CDCl3>
##$SSB= 0
##$STSI= 32768
##$STSR= 0
##$SW_p= 5175.98343685301
##$SYMM= 0
##$S_DEV= 0
##$TDeff= 65536
##$TDoff= 0
##$TI= <Analysis number 999999
Compound Code 99
Book Reference 9
Project Code 9>
##$TILT= no
##$TM1= 0
##$TM2= 0
##$TOPLEV= 0
##$USERP1= <user>
##$USERP2= <user>
##$USERP3= <user>
##$USERP4= <user>
##$USERP5= <user>
##$WDW= 1
##$XDIM= 32768
##$YMAX_p= 379287052
##$YMIN_p= -446504
$$ End of Bruker specific parameters
$$ ---------------------------------
##NTUPLES= NMR SPECTRUM
##VAR_NAME=  FREQUENCY,     SPECTRUM/REAL,   SPECTRUM/IMAG
##SYMBOL=    X,             R,               I
##VAR_TYPE=  INDEPENDENT,   DEPENDENT,       DEPENDENT
##VAR_FORM=  AFFN,          ASDF,            ASDF
##VAR_DIM=   32768,         32768,           32768
##UNITS=     HZ,            ARBITRARY UNITS, ARBITRARY UNITS
##FACTOR=    0.157963299565203, 1,           1
##FIRST=     4132.6476996994, 0,             0
##LAST=      -1043.33573715361, 0,           0
##MIN=       -1043.33573715361, -446504,     0
##MAX=       4132.6476996994, 379287052,     0
$$ Real data points
##PAGE= N=1
##DATA TABLE= (X++(R..R)), XYDATA
$$ [...]
24093 -14974 -37970 -41617 -22085 -6146 -10701 -15497 3606 12081 22146 53438 78505 67035
24081 67035 69350 63590 7909 25065 -12337 -59821 -63251 -80651 -85524 -80287 -47172 -49697 -92818
24068 -92818 -93399 -73320 -15560 8716 -11129 2049 9631 18784 26661 -9789 -13794 -44778 -40316
24055 -40316 -5871 68927 64865 59125 70482 70368 35174 -1061 -25337 -25367 -55466 -66993 -56421
24042 -56421 -35335 -39970 -69815 -65395 -33366 9238 12534 -25810 -40302 -76940 -86156 -53558
24030 -53558 -25914 21777 31048 15299 1801 696 -43687 -33905 -25555 -7160 -21139 -45192
24018 -45192 -62297 -25311 6820 15388 31204 33158 39075 -11329 -74368 -65510 10643 56654
24006 56654 47846 46648 51365 11982 9145 6471 -31520 -18950 -14592 -6304 10222 25368 39995
23993 39995 4592 -36013 -14956 -2650 -51153 -53378 -15752 29659 43497 53351 3175 -19933
23981 -19933 -23677 -34221 -59814 -104843 -105742 -60891 -32761 -20121 -8116 34627 48114 31733
23969 31733 49110 -15040 -36971 -53825 -78831 -78210 -51201 -25279 2201 -14451 -19152 -1715
23957 -1715 -2584 1073 -4547 -20485 8105 -2306 -16529 -11098 -20271 11975 41863 36939 20530
23944 20530 11561 -12104 -30934 -49387 -63598 -39742 -6766 -37959 -48373 -45372 -9490 -22861
23932 -22861 -43063 -40405 5549 2987 -29438 -65578 -49724 -9120 37564 43867 6277 6343 23208
23919 23208 25213 64403 42269 29200 35463 7446 23434 28933 19476 1917 -171 -18710 7236
23906 7236 -12781 -9117 11055 -855 2461 23736 31378 -3580 -37374 -25903 -39177 -31173 -2966
23893 -2966 14501 39430 40408 9876 -21427 -6319 22113 19525 14105 1887 -1438 18543 43666
23880 43666 53599 30280 26593 61241 42255 -9678 -18335 2965 -7002 978 -34239 -37498 -33701
23867 -33701 -15630 -18522 -11869 -17722 -50316 -65942 -34127 -33056 -14546 10459 26464 17646 -24046
23854 -24046 -37412 -34452 -36271 -19090 -11487 -17450 -6811 -2254 12413 3403 -14917 -49171 -60326
23841 -60326 -56928 -24647 2454 3073 22526 22137 672 37851 76721 84224 23927 -8699 -24295
23828 -24295 -21900 48893 60282 18157 -30944 -35013 -61206 -43050 -19216 -9759 -40514 -72976
23816 -72976 -57648 -5339 -24621 -7524 1171 15471 35259 7647 -4230 -378 -38212 -26768
23804 -26768 11736 34070 28826 25745 6395 -22040 8909 2832 -8549 8165 29464 -23654
23792 -23654 -41744 -39598 -45723 -27588 -1938 -24246 -31042 -18909 -2740 -18849 -23941 -4862
23780 -4862 -12161 -48455 -42891 -32774 -2724 -1366 39431 60906 56262 64217 69830 43163 30228
23767 30228 7843 -40410 -49881 -49184 -68234 -85368 -33360 -23764 1168 14880 40654 28137
23755 28137 -1052 29689 61686 79154 89636 59597 18889 7410 -9553 4308 42982 62138
23743 62138 45617 8067 -12064 -4383 -4982 12629 1859 -48486 -25840 -19170 -39132 -59547
23731 -59547 -36091 -38828 -40983 -46271 -55641 -22593 29580 59087 23613 40935 34436 2221 8809
23718 8809 20338 -7158 12919 36844 -1656 -7475 3339 27676 65465 8178 -41870 -23834
23706 -23834 -13265 -5719 12435 10879 -521 -9173 -22785 -7539 33029 16148 5560 34834
23694 34834 55799 47839 50505 45830 8850 14874 24614 17086 14823 25071 21289 7096 -28057
23681 -28057 -65055 -60924 -39188 -41462 -7530 -25565 2036 35541 23211 27408 -15032 -23765
23669 -23765 -45208 -35998 -7278 7669 -18019 -17522 -166 9462 -8640 923 1816 -32408 -13284
23656 -13284 -44553 -35859 -26646 -19695 -18106 -23083 804 17959 17136 43153 39111 5953 -46009
23643 -46009 -48445 -29008 112 -17130 -43300 -43459 -20444 -37454 -77839 -43946 42498 84813
23631 84813 53345 84239 114982 53285 4623 -37900 -55464 -9016 5808 24435 29839 26189
23619 26189 23960 10155 20337 -10851 -27915 -30017 -6215 -5709 -24528 -54428 -6532 1498 -25733
23606 -25733 -26490 -13800 -36412 -10534 -1255 -13566 -30041 -37165 -35544 -33651 -28692 -25246 2854
23593 2854 27563 22274 -26220 -25494 -19669 -52516 -112450 -82681 -81828 -73084 -42974 -10932 -32894
23580 -32894 -80598 -84380 -57434 -63005 -39370 3950 14484 -30852 -39432 41248 68876 52430
23568 52430 50895 45708 5695 -43167 -52600 -59098 -41939 -33826 -29143 -19783 -14756 15489 23731
23555 23731 -9734 -45004 -65669 -46339 -15188 -25607 13600 15447 20465 31891 58411 13063
23543 13063 -47836 -51559 -58885 -26099 -13091 -9327 -28463 -34500 -30851 -44201 -59298 -32760 -7271
23530 -7271 2502 -9981 -36442 -6265 2992 -18533 -4370 -42259 -48253 -34897 3891 46322
23518 46322 -28088 -95735 -50443 -34507 -51062 -54309 -44151 -3227 -4484 -14978 -2263 -7506
23506 -7506 1550 -17392 -12836 16548 1862 -30687 27690 40570 11979 -11360 -9463 24853
23494 24853 26928 -1381 -19230 -24752 -38361 -84235 -73009 -10463 -14206 -55024 -25754 19819
23482 19819 -2651 -16519 -23747 -61816 -61625 -31014 -38007 -88529 -101320 -54136 -32735 -6411
23470 -6411 28665 566 -37078 -37938 -15294 12987 54359 14720 -15898 -46172 -45842 -75343 -58967
23457 -58967 -36534 -49504 -56022 -39583 -17886 -4716 -20577 -23196 -21256 -19679 28736 28415 22033
23444 22033 -15626 14371 26681 27858 74415 69263 49786 21749 34670 25293 -7636 -2580
23432 -2580 58125 113970 80942 23424 18026 3743 23883 -4093 -4435 -6276 -41020 -34486 5918
23419 5918 15289 -92 -46827 -12832 27584 42487 19855 1871 -30144 -24126 -38218 -44119
23407 -44119 -9466 -7638 -10906 -26776 14949 123103 143808 48674 17438 21675 31187 38010
23395 38010 -3050 -15948 -40094 -55208 -64507 -34764 -40002 -56040 -28937 -9054 18490 36123
23383 36123 39585 21521 -6096 6032 51109 81638 29898 -13762 8796 7881 41172 70887
23371 70887 50260 24914 -30325 -13013 -46597 -74610 -91090 -78828 -66951 -68028 -78996 -64476
23359 -64476 -35649 -22766 -51382 -36544 -11808 12039 10647 9600 1583 -20014 681 -3860
23347 -3860 -44161 -40689 5834 39672 60129 40569 14475 30056 33390 30677 10740 14304 52159
23334 52159 78062 50767 47658 44936 1691 -19210 19516 -19707 -17373 14527 -1557 10085
23322 10085 1175 -12893 -18299 -42462 -46355 -29954 -46190 -92819 -84430 -15147 42492 41445 11393
23309 11393 -42524 -39092 -43080 -85783 -74789 -31242 -64878 -69807 -24115 11379 30091 25092
23297 25092 -8138 -14994 17123 25486 16296 7910 -11301 16043 45049 28843 10097 -4308
23285 -4308 6413 -1981 -8932 -48427 -38275 -9183 23350 25878 25654 52531 43255 41600 -693
23272 -693 -22683 -1977 20621 28798 32924 25312 40200 22761 16480 -20397 -43118 -3872 2284
23259 2284 -7997 -96 -11943 -1097 18522 16272 1040 -21666 -82148 -62717 -51454 -37250
23247 -37250 -50905 -34691 -16832 14616 -5957 -30620 -344 16277 -7340 -63779 -121757 -116241
23235 -116241 -70073 -50303 -41598 -11534 12945 -3153 -10164 24759 39237 38744 19551 21328
23223 21328 76845 103467 30580 -16473 9677 7565 -32565 -5512 -25028 -26509 -27952 -45402
23211 -45402 -10823 3693 -55007 -37272 7375 5788 13814 39217 47482 34824 -17347 -10929
23199 -10929 41572 36907 41574 13307 4567 -17802 1550 -27089 -40200 -8101 21557 21409 24586
23186 24586 -9771 -43172 -47653 -37178 -74659 -44682 -14492 -19079 -41116 -43133 -34541 25043
23174 25043 88486 72581 64628 65148 40944 -15806 -17377 -23570 -30402 -19177 -5501 26151 28562
23161 28562 43848 67174 130995 147902 97495 52430 -18518 -68516 -48803 -10490 8914 14764
23149 14764 -5659 -25183 -14828 -15096 -78065 -54639 -61603 -63440 -82605 -73937 -65707 -70905 -63791
23136 -63791 -67841 -5453 -2835 7173 -30162 -39745 -34309 -48486 5352 8332 5799 -23831 -39437
23123 -39437 -72291 -89895 -67125 -46600 -10177 10250 579 -39436 -76865 -56588 -11628 -26829
23111 -26829 -76720 -81248 -59523 -96629 -123973 -136325 -98533 -41998 -47759 -52700 -28151 -3415
23099 -3415 -29288 -44618 -36830 -50265 -42905 -43550 -64432 -92237 -77458 -39419 -18991 3393 35815
23086 35815 46718 71094 45437 39768 31763 -34421 -89922 -42883 -18211 18578 20708 39531
23074 39531 62351 55224 84479 76067 21237 -9362 -26153 -16494 -16080 -21831 -1560 24037 33045
23061 33045 67434 51306 18528 -31894 -40266 -19195 -12666 -15251 3320 41200 43725 25457
23049 25457 23749 6942 -5673 -42850 -63284 -41291 -12933 -7733 22266 54596 49438 34251
23037 34251 9268 -20386 -14033 -19072 -22505 -27575 -7788 -9149 -12710 2703 -16627 -1794 -23052
23024 -23052 -27377 -19872 16315 44701 46322 -22674 -51534 -51574 -85700 -93189 -50422 19157 40647
23011 40647 38473 41555 82187 61427 27266 43333 105534 118788 118707 93940 72299 79835 63192
22998 63192 24551 -14611 -51804 -40861 -37425 -43593 -54490 -26612 -3364 -22981 -20104 35560
22986 35560 50292 49745 48967 -23723 -42543 16201 29712 19401 -14237 -30450 -30077 3876 3856
22973 3856 -6177 -7243 -19393 24394 47779 4340 -4665 22833 18234 10518 17988 4458 -17148
22960 -17148 -27229 -4660 -27957 -24968 -23116 -7853 6744 35731 84141 63812 10961 -48221
22948 -48221 -68243 -34890 -6275 15291 28609 25662 27271 5041 3407 37371 33283 56697
22936 56697 42986 35944 31412 29664 49865 36237 46258 70017 53246 10533 2120 -10840
22924 -10840 -5611 -33509 -34564 17280 14403 -4987 -4655 30111 69789 74747 71840 91176 51322
22911 51322 29583 37546 28891 6839 1569 14372 16752 -13131 -44747 -67233 -44588 -35488 -50516
22898 -50516 -50052 -11883 23803 -30574 -55488 -57036 -40993 -52324 -21586 -19868 -25629 -42278 -36432
22885 -36432 -42255 -19146 -9507 -47103 -36126 -20492 -21245 -4793 -26443 -2673 -1868 5435 -25196
22872 -25196 -76613 -69469 5602 45110 10272 -36360 -52109 -25151 -5918 24071 8236 -13481
22860 -13481 -40595 -36026 9948 43896 19460 4498 13557 42515 50642 70123 60790 44729
22848 44729 35548 32292 50321 72348 91937 71209 46911 17242 -8545 -14412 -14741 27548 57751
22835 57751 44082 89522 125026 88219 18163 -31736 -52427 -62229 -19216 29829 939 26946
22823 26946 39002 39422 49600 23982 3137 -12744 -4818 32113 15323 12081 48715 57902 8741
22810 8741 -44041 -19437 -15802 -24873 -19837 15195 17460 28009 38918 26056 46442 55002 60581
22797 60581 48760 29560 36309 20786 -25368 -40349 -28595 -29704 -12127 -3817 -20738 -20859 439
22784 439 -12055 -7647 -25504 -21170 11211 8534 9760 13042 -3364 -42039 -74106 -38577 -53076
22771 -53076 -51239 -59767 -82121 -57349 -56375 -35971 3130 8492 13800 -7689 5238 34842 27640
22758 27640 -6333 16030 8871 9797 11465 -24146 -20340 -29664 -26674 -23986 -85205 -50771 -56604
22745 -56604 -4469 15846 -4516 -28414 -30098 -28110 -38245 -22850 -18205 -53038 -26232 -23663
22733 -23663 -1659 39355 35167 3243 6492 20979 29160 66522 33900 -19184 4829 37428
22721 37428 31019 29658 10962 623 -27013 -49987 -75265 -35229 -8327 8754 6423 -9046
22709 -9046 -55960 -59346 -28918 -5349 -45422 6771 43526 11259 -33518 -28694 -88385 -102571
22697 -102571 -16126 11202 24704 55659 53623 34600 19159 3586 17231 -10086 -70979 -72160
22685 -72160 -20906 12582 -5187 29287 52554 51184 32663 19807 37632 10313 -1435 6644
22673 6644 -22117 -13842 21074 21039 -24379 -58995 -54371 -17572 34250 59700 29196 -30824 -63628
22660 -63628 -44725 -27443 -16615 223 10211 56448 71582 -19269 -49487 -60895 -12973 27131
22648 27131 62150 36193 1610 10574 62832 79847 44804 853 -22040 -38721 -14408 33212
22636 33212 15073 15584 38266 63268 25605 -2521 2660 1583 7243 23072 27956 63606 49666
22623 49666 21805 20887 12451 12008 48867 94012 95356 36761 -20997 -23225 -36795 -893 -9772
22610 -9772 -49969 5036 49056 57209 61362 59755 -14048 -58664 -42020 -29744 -32904 -30910 12614
22597 12614 20041 12321 -9482 -43858 -18944 -1393 11297 36474 31446 29761 29739 3392 14864
22584 14864 33685 62504 48471 25090 8475 -27250 7080 16107 7409 21222 4781 254
22572 254 -28014 -23449 -20045 -30468 -8005 -9415 -35714 -5422 2541 12168 -3339 -54953 -84934
22559 -84934 -8919 50962 57548 18404 -6627 -463 7625 -10867 -65150 -101664 -48236 -12987
22547 -12987 -23828 -48876 -42033 -42344 -41608 -28518 -30293 -49697 -1398 5692 -8471 -45912 -39695
22534 -39695 -32109 -39354 -54429 -56817 -27572 -42531 -43457 -79357 -102165 -76190 -13865 37453 34576
22521 34576 31126 12718 -15332 -25633 -15159 -33582 -48837 -60426 -67771 -46537 -34254 -2015
22509 -2015 23284 37882 47868 27166 -16057 -10803 -2620 -14990 -33369 -73954 -45050 -6470
22497 -6470 -12855 -27064 -19730 19653 -9313 -71420 -94839 -66291 -36867 -21318 -22088 -20027 -11285
22484 -11285 29218 -15923 -42721 -23552 3934 -2091 5677 15119 32885 39158 72273 24446
22472 24446 -15497 -8569 86231 88883 48757 18583 21217 10496 -23076 -19657 22508 46137
22460 46137 -913 -45067 -55898 -58714 -63351 -72272 -46538 -13561 -27706 -58103 -26422 -17709
22448 -17709 -31477 16900 31494 28775 3731 -18074 -17943 3300 2177 -7122 -30232 -13604 -3963
22435 -3963 -2501 33866 55384 29567 -14809 -63749 -67263 -7049 55503 12107 -11648 -3456
22423 -3456 -1189 40604 30623 49144 47009 24819 30785 41484 45115 30118 -19566 -10947 12105
22410 12105 27751 35989 42407 42242 29853 3721 -23273 -40486 -24417 28574 42219 40815 -109
22397 -109 -28932 -37224 -3342 22821 -37458 -71428 -47444 -10114 51448 14837 36087 33980
22385 33980 6023 23410 40333 61679 56940 23176 50587 60887 41079 43760 35513 13657
22373 13657 3621 -2752 -16605 49923 67506 57310 23064 47114 66161 41025 21669 13556
22361 13556 37135 33552 72216 108937 63648 -11674 -27560 -25900 -47480 -15420 9143 20049
22349 20049 -31432 -58140 -28186 4391 24453 29859 25759 32289 1056 -32816 -30564 -55052
22337 -55052 -54363 -21968 27282 5139 -13263 -61198 -20579 -4468 -1769 -1408 -22431 -77938 -73498
22324 -73498 -101730 -88415 -55414 -5663 -5424 -37287 -40745 -17786 -45772 -52990 -29104 -42258
22312 -42258 -45848 -21078 2181 -5771 -10027 31852 28345 6956 12003 54913 31731 -7448 -3941
22299 -3941 18002 5348 -10803 -28198 -67719 -97992 -91811 -59113 -16273 -3641 -15202 -16905
22287 -16905 -43378 -40148 -14861 17708 68183 108005 103269 42481 -2901 -18072 33768 56906
22275 56906 70830 44921 47007 24922 -2268 7545 428 53586 61683 -6295 -9809 -9866 -24774
22262 -24774 -61904 -39546 -51534 -58613 14338 55952 78054 49773 70873 101408 94490 42826
22250 42826 -7446 -41174 -66119 -68759 -23419 -9242 -17840 -37683 -36704 -69501 -63964 -40958 -7654
22237 -7654 -27703 -46894 -26864 15090 21800 -13629 -17434 -39586 -43444 -91910 -104119 -72900
22225 -72900 -4731 -9148 -17658 2785 47304 53690 9134 -16689 -15866 -13266 -4912 -12092 6335
22212 6335 -30242 -62873 -44509 -23306 22778 61784 37935 29164 15562 -7646 -8658 -33174
22200 -33174 -27331 -10120 -41632 -222 -37 2970 9473 28853 22162 -5642 136 -22726 -45629
22187 -45629 -39880 -1057 43791 40607 19442 19318 862 52910 103941 82107 35431 12537
22175 12537 15983 -23831 -55855 -62084 -64992 5822 45465 53582 21138 -22827 -53082 -8326
22163 -8326 15565 51053 36692 -198 8255 52665 38309 18265 -12754 -37959 -30476 -49202
22151 -49202 -37284 22704 18063 -30228 -66407 -57955 -2917 -3649 -16216 10667 -6595 -45227
22139 -45227 -20907 -3875 -28592 -79922 -74615 -66989 -56922 10712 9614 9338 17022 9561 4906
22126 4906 -20136 -24283 28165 54042 3928 -42286 -23605 -25146 35373 78130 44870 4205
22114 4205 -4730 -8489 -2909 -14069 -1916 -12335 -43969 -26875 -39466 -36088 1877 21743 20767
22101 20767 14708 46464 24044 31505 54161 29500 2853 -2916 -37897 -81094 -84597 -57315
22089 -57315 -59633 -80970 -83851 -82647 -73931 -43436 -53418 -30434 -9293 -21752 -38530 -93590 -111056
22076 -111056 -119667 -50640 -30821 -21491 11671 39474 28832 30730 22058 -413 31240 47652
22064 47652 57891 61048 38801 55517 71840 7707 -3139 20590 43086 57642 15479 -18600
22052 -18600 -106625 -118238 -84242 -84131 -42172 9546 -25989 -15379 30156 52941 29288 8731
22040 8731 21490 -5205 -24142 -29924 13169 23832 -5126 25359 29750 46681 70054 35213
22028 35213 6862 11847 26432 36895 65215 58161 54249 60890 60845 46308 28945 10830 -4522
22015 -4522 14683 64577 75943 73606 44230 57621 5390 -61235 -26875 45515 41084 30809
22003 30809 39727 -19031 -38111 -22636 -26943 -30454 -51131 -66148 -59982 -32717 -14135 10294
21991 10294 40073 20057 12493 44063 39429 29662 27366 -3678 -19311 -18637 26481 37286 50277
21978 50277 53091 63147 33563 56114 56039 -12489 -50054 -98928 -99925 -39461 3413 23679 -12214
21965 -12214 -3215 43895 52948 -6132 -44741 -83377 -95256 -83292 -47263 -32374 -23845 -29295
21953 -29295 -40753 -32700 -24683 -18106 14438 17216 -22238 5371 44844 71816 66516 30203 35798
21940 35798 43799 49230 -28886 -64806 -30264 -21682 -39012 -14727 -4363 8629 8942 -9195 -12158
21927 -12158 -34742 -2289 -17047 8141 -10069 -19587 -25440 -29811 -13079 -33335 -34984 -25252 -15732
21914 -15732 4606 17889 -12674 -23869 -15302 -18301 -2528 18729 15075 20473 22082 64451 56059
21901 56059 40210 29281 -35164 -47308 -20231 -8756 -34727 -53422 -45187 -18602 -18458 -27331
21889 -27331 -5152 -25141 -47438 -43367 -4803 -25945 -24182 -23834 -21980 -14996 9837 23617 23335
21876 23335 51934 37287 15182 22518 -2582 -23365 -10651 -21111 -28459 -26100 -24083 -738
21864 -738 13542 33168 55572 66331 31906 -32422 -32764 -7246 8351 25553 -26515 -1355
21852 -1355 -8042 -22493 -38340 -35358 -25780 16025 29625 79741 67346 22538 22564 31241 3572
21839 3572 -19572 -13285 -11844 -11142 15778 50306 29414 -22963 -90841 -98349 -72911 -57360 -20851
21826 -20851 20962 -10002 -19282 -3982 -26174 -24712 -26297 4455 -12524 -29790 -44999 -71659
21814 -71659 -60896 -47208 -42112 -16638 11164 -27735 -25681 36266 47350 35707 15337 44713
21802 44713 79844 84952 60034 48792 11539 -20072 -58985 -53067 5399 -23639 -24929 6626
21790 6626 43197 69949 58238 -4208 -36210 -46304 -8431 -35036 -44700 -37647 -26972 -28086
21778 -28086 -57846 -46635 -21479 -34164 -44919 -62735 -39176 -23616 -48745 -20243 12272 6025
21766 6025 33741 50501 19438 -2003 -16162 -41781 -34212 4397 -2516 -34467 -25523 -1893
21754 -1893 21153 20896 -8259 -39831 -41244 -54703 -19615 36491 48960 60219 55549 73091 48626
21741 48626 7315 -12285 -60781 -103764 -106713 -89440 -89358 -46525 -35487 8477 25673 4700
21729 4700 2680 29674 39921 12596 31933 27757 29416 -6177 39486 23823 -28789 -107885
21717 -107885 -117187 -99108 -93575 -81051 -66721 -35888 14142 12000 -16626 -5950 -24951 -20095
21705 -20095 -17476 -35628 -29611 -42354 -38506 -29191 4113 -1857 2571 18149 11911 27246 -18621
21692 -18621 -47342 -63110 -30407 -12860 619 37657 -10845 -37721 -9196 7326 20963 30804
21680 30804 67685 93579 67928 -26784 -78342 -67190 -62597 -18102 45063 63134 50602 30190
21668 30190 16183 29117 7599 -21207 -38566 -45051 -45760 -19857 -41092 -42432 -15025 21603
21656 21603 41022 28930 15431 27506 4848 -28709 -49038 -46163 -33700 -9398 6323 3530
21644 3530 18467 -8758 -6528 -38961 -36178 -2867 65299 78982 18792 -10413 -42625 1697
21632 1697 -6764 -21920 -26786 -30678 -79266 -75786 -19374 47499 47453 40454 53822 39827 48387 82510
21618 82510 58916 6162 9764 10114 10438 7734 -989 -22874 -26387 3029 18202 3021 1930
21605 1930 -14406 16931 30264 8398 -27794 -2486 10174 1355 32410 18210 -17331 -25822
21593 -25822 -39275 -52134 -6184 46423 101353 72627 49996 21801 -30514 -66063 -48553 -7694
21581 -7694 -12567 -44421 -44697 -52945 -94369 -87877 -40951 -1357 -16637 8688 9163 -16408 -10465
21568 -10465 11272 -24051 -63049 -80317 -35943 -8753 -43132 -57686 -28999 -7148 -30198 -16580
21556 -16580 7200 50065 59503 69345 20881 -44553 -73518 489 29107 20090 -36790 -75679
21544 -75679 -35691 13211 -3916 -63510 -45636 -4833 14636 44897 22717 23539 -9478 -17024
21532 -17024 -27149 -2378 23295 53434 43227 26518 9895 -10488 -18983 -37847 -80125 -111480
21520 -111480 -108998 -45970 -27763 -23745 34479 83674 75490 43979 27060 35758 16842 -43742
21508 -43742 -43263 14588 15518 -18411 -6166 -6362 -33831 -36846 -56052 -31406 -2426 -4691 4429
21495 4429 5198 -4554 -7399 -24769 -10895 25588 27119 28580 30465 64284 75088 64383 13101
21482 13101 40863 62739 51454 31549 4061 31592 31692 -11537 -37965 -45615 -49907 -44491 -8206
21469 -8206 12554 42214 8062 -23110 -65824 -84040 -106238 -114097 -70029 -10169 -34756 -16199
21457 -16199 40735 76446 54940 57939 41371 57066 61063 21441 -13960 -24370 -32750 4688
21445 4688 17059 20996 155 -57217 -74129 -110531 -96515 -43415 -23733 -26222 -23220 -28349 -68333
21432 -68333 -54145 -73648 -60158 -54591 -20962 -45849 -20517 27506 24757 15086 -891 7774
21420 7774 -7972 -24172 -19293 10167 30559 29576 10588 -18976 -40657 -72146 -105603 -82790
21408 -82790 -73786 -36160 -21270 -19797 -28888 -25594 -6300 9247 -14647 -10208 16918 -1377 5683
21395 5683 -2546 24860 20508 -35638 -47379 -63989 -41692 -9274 -18847 -46807 -66623 -8864
21383 -8864 14793 27082 18325 -15691 -34299 -46939 -32094 -17975 -18569 -37927 -10245 -33417
21371 -33417 -39204 -17755 -22494 11434 19579 11245 -11531 -16149 -7580 31888 59645 46974 44064
21358 44064 19852 9546 10406 38996 38946 25891 30586 38428 41573 41763 3290 -12820 -46998 -55797
21344 -55797 -73928 -92258 -87434 -43256 -8409 7448 14753 -12819 -8599 12578 6992 12330 -12417
21331 -12417 24753 56620 40735 26151 12767 -10122 -14143 16130 -2854 -762 12447 15079
21319 15079 21364 15942 -30184 -24260 5149 2511 7908 -48247 -69387 -28151 -20183 -31918 -43707
21306 -43707 -22996 29175 34846 41976 25039 10909 18055 40551 39382 -20990 -48849 -35479
21294 -35479 -27531 -8689 -43196 -27082 4946 34198 42499 5650 -22596 -3018 -10532 -47570
21282 -47570 -85701 -80923 -22151 -11834 -11352 -21393 -40491 -92585 -62880 -22906 5300 38878
21270 38878 19406 1842 73149 95559 48677 21124 37517 58482 76362 47884 49706 13875
21258 13875 -30633 -74402 -89650 -80443 -79458 -57007 -18270 -1843 18935 -547 4371 -31054
21246 -31054 -61651 -53501 -42345 -80413 -88064 -57895 -55160 -61602 -76125 -70969 -52145 -7985 35281
21233 35281 -128 -51349 -46401 -21828 4317 -8939 -27202 -60388 -45152 -34001 -59814 -48105
21221 -48105 -2814 17408 -7589 -45679 -24378 -713 -3663 2146 34078 20504 -19026 -12195
21209 -12195 -9705 2985 -8237 -64743 -73422 -66466 -50952 -55029 -83507 -55164 -35985 -42520 -14584
21196 -14584 -12033 -33870 -37493 -79875 -54274 -7621 17560 11818 -456 -9750 25026 10493
21184 10493 -12607 -8885 -28866 -14827 9805 -7555 -26056 -52818 -41144 -38464 -25096 -60973
21172 -60973 -45054 -8544 -20093 -33773 -39822 -42501 -35809 -16432 14665 -41696 -22209 39158
21160 39158 38350 31928 -37701 -57194 -10666 14093 7658 -3161 -13317 -20338 -18168 -8422 -7838
21147 -7838 -16173 30824 62464 2127 -61789 -64438 -38249 -59073 -55908 -17710 20945 54422
21135 54422 65496 49946 9179 10782 40038 56134 59379 43612 8613 -24981 -10284 -23353
21123 -23353 -48940 -12073 26829 8299 6523 -36920 -78987 -112298 -106207 -75878 -38916 -13687
21111 -13687 -24890 -9232 37272 23371 2517 12885 -4337 -38806 -41833 7039 5554 6189
21099 6189 3202 -32362 -50472 -31639 -28255 -30957 -38274 -30807 -33751 -9207 25759 50483 45954
21086 45954 38415 51656 60659 58395 81 -33851 -62832 -58343 -45207 -49540 -31840 -31577 -14631
21073 -14631 24442 10839 -15690 -27166 -20137 -27617 -54192 -53433 -31046 548 6549 -24313 -56095
21060 -56095 -26236 -14866 12043 -8792 -46508 -56785 -55440 -88295 -104257 -119365 -46478 18174
21048 18174 2854 -40211 -59450 -59157 -79630 -94433 -114566 -75959 -18941 7604 -4817 -3978
21036 -3978 40602 74490 58477 53365 51281 50178 -5080 22472 24374 8662 33239 6526 -24804
21023 -24804 -33820 5459 32273 39149 9608 -7151 -22784 -27018 -34297 -25432 -37475 -45123 -23668
21010 -23668 18032 -830 -69877 -78352 -80879 -57953 -7200 1146 -3745 24802 28783 5066 8234
20997 8234 4379 -1968 -20567 14991 22795 68742 94503 41957 -14236 -61113 -49003 -16135
20985 -16135 15903 -14918 -53683 -56928 -8711 25291 6884 10771 -10526 -16844 -11965 -41263
20973 -41263 -87306 -88694 -76132 -92465 -106332 -106317 -84913 -42377 -24505 -28326 -16625 22949 -43232
20960 -43232 -68201 -35109 -59540 -82764 -75788 -46873 -73363 -89538 -57184 -38785 -47010 -47631
20948 -47631 -61568 -40947 -43614 -46414 -53754 -1288 23469 -52799 -91921 -81716 -259 41052
20936 41052 18549 -30923 -49033 -147 9800 6420 16909 28473 11195 -11646 -3740 21422
20924 21422 25193 -20699 -38687 -25088 -10783 -19231 6748 -46217 -34743 18869 26521 23623
20912 23623 41523 17959 -21640 4528 26463 322 -37287 -78096 -91569 -61298 -12487 17760
20900 17760 14351 -6449 -25101 -23228 -22981 -28401 -17878 29324 46928 -149 -16629 -28226 24181
20887 24181 2890 1920 17265 -46361 -75077 -48809 -3351 -10808 -2516 23850 -6685 -72506
20875 -72506 -95264 -99895 -63800 -21780 -2649 -29546 -56349 -20661 38507 28142 12134 1126
20863 1126 2763 1334 6330 11276 10104 28916 85832 71503 52181 32546 6494 -17585 -24386
20850 -24386 -17178 4060 49198 12483 9910 -12366 -12194 -22142 -7455 26526 7459 -41533 -35313
20837 -35313 -23710 -6613 -56564 -48047 -45691 -57971 -34676 20476 36495 26988 36470 21453
20825 21453 34774 27860 -2402 -23194 9080 28481 -11844 -75364 -91163 -72156 -53895 -55766
20813 -55766 -33153 -59880 -66951 -16796 11592 -19530 -30568 -24026 -22070 13448 63571 61624
20801 61624 44834 30275 57241 57144 54879 81663 67386 33562 45210 45394 40794 44571 -20916
20788 -20916 -44104 -6637 20703 645 -59176 -65277 -37912 2679 37922 30803 19101 21327
20776 21327 37647 49216 56585 46358 64611 52768 -1267 13466 13419 38321 79410 47669
20764 47669 37129 -2228 -2316 1524 -20402 12426 23339 30864 -5657 -34236 -17782 -13662 9801
20751 9801 7636 -30821 5607 -9745 -46969 -44740 -29835 -15748 -3561 40047 67556 64144
20739 64144 46630 62559 101830 63297 22530 6532 9524 2932 24121 -17004 -30891 -12352
20727 -12352 -6486 -28308 -46115 -42174 -30243 -9643 18030 31272 15612 1624 -23389 20235
20715 20235 2491 -5899 -27762 -48716 -53505 -48124 -10518 -26464 -10289 33067 94996 89901
20703 89901 60535 16462 -31748 -17989 13088 9026 2915 31046 45320 26788 -6730 -39357
20691 -39357 -13849 11166 1904 1748 16588 4450 5353 47863 37217 42187 59779 43325 1905
20678 1905 5235 -5020 5421 53870 64548 46020 47805 102854 120204 105090 63893 11995
20666 11995 4370 -17234 -50467 -45243 -20765 -9269 -6829 10031 26472 -751 12162 54085
20654 54085 -4135 -49554 -53234 -52383 -6815 -11561 -45592 -34648 8823 1833 -38218 -17237 -950
20641 -950 -9028 -16373 -1282 4878 44312 34925 39303 67514 78342 74450 19 -14065 -32160
20628 -32160 -70258 -71006 -48702 -56419 -32661 16429 5525 -8249 -28106 -95580 -43785 16396
20616 16396 47730 61203 57228 37009 13085 10754 10125 16052 37522 76242 43794 -11829 -7628
20603 -7628 -32360 -39782 -38604 -8364 28284 53697 38826 -5051 -16096 -9256 24293 13866
20591 13866 -12246 -46510 -59012 -37929 -32038 -64648 -61084 -29736 -10056 -38902 -58450 -10682
20579 -10682 20257 23091 -6739 -22621 -29751 -25316 -33216 -5668 6875 -3932 -4542 -6250 14586
20566 14586 45688 22840 -17793 -3411 5404 -14199 -29137 -37869 -36968 -42575 -24293 -20702 -5444
20553 -5444 4186 18838 -11938 -71312 -92241 -83960 -67387 -111945 -112938 -72921 -38943 -59554 -64689
20540 -64689 -54175 -51263 -12511 -34501 -46026 -22091 -24141 7934 -17100 -41989 -50931 -52226
20528 -52226 -53313 -42113 -1398 34702 16478 -7290 16740 12964 -24938 -56844 -80950 -35424
20516 -35424 7677 3951 -45189 -42577 -21897 12981 11206 4312 3620 12841 59766 51451 3693
20503 3693 -4768 18299 4864 -16207 3925 7157 20444 27531 43269 25053 -12095 -48166
20491 -48166 -44202 -29506 -1835 -8776 -11153 27038 8615 -7718 -35524 801 51510 70154
20479 70154 58882 45060 33846 32557 3949 15305 36041 2621 -45276 -71178 -69147 -70454
20467 -70454 -71195 -33585 21838 39475 22164 3745 -40434 -34752 -61223 -73929 -28220 20117
20455 20117 30530 55066 79180 32083 -24910 2660 20235 22388 53446 23455 3492 705
20443 705 -21121 -40907 -37134 -15092 -2959 -23104 -9187 5380 27902 22487 69235 47336
20431 47336 47276 60071 44302 13326 13451 29840 19370 46920 65201 82737 30566 -30005 256
20418 256 -20789 -19423 26429 3498 -13757 -10243 -14648 -38007 -12738 -8913 -11242 -52470 -99090
20405 -99090 -70434 -64337 -20291 50604 67514 27896 1002 -21382 18367 78228 68562 5924
20393 5924 -49112 -26600 -27573 -60704 -87140 -38209 8560 21546 -527 -24130 -18910 -19902 -32020
20380 -32020 -52975 -36321 20997 -12058 -41329 -55212 -44659 -23671 -10456 -5404 -26466 -12667
20368 -12667 -52319 -48399 -65410 -53679 -45380 -33733 785 35694 49741 65638 55335 24481
20356 24481 -3899 -26328 -72766 -77837 -72040 -31080 4354 -2746 2130 -3990 11195 8704 -21090
20343 -21090 -14621 -11440 -7062 -5625 11172 23170 -19159 -86090 -74656 -71120 -49115 16626 1335
20330 1335 1735 15521 4166 -22559 -22457 -5994 11743 -8889 -26581 -31389 -3323 7260 17472
20317 17472 20034 -12489 -53461 3639 34896 2246 -25655 1466 -5455 -7046 -13117 -1612
20305 -1612 37000 36886 12095 -14369 15094 14120 54106 89879 68050 24528 23177 -12824 -4754
20292 -4754 44485 66935 75597 34039 -7174 -13282 -53808 -62265 -44897 -25389 5079 -4618 -37234
20279 -37234 -94234 -60396 -47043 -11946 22392 27468 1501 -19535 -23353 9483 9557 37284 54995
20266 54995 43126 33717 34053 19949 7184 4985 4085 -18461 -23330 8681 34272 14420 -3324
20253 -3324 -36136 -31283 -37721 -86337 -71531 -8108 12650 -20964 -4743 5232 -20109 -15534 -8418
20240 -8418 -5939 -16491 -49237 -33664 -35876 -25731 -7480 -35446 -64821 -49659 -33758 -29464
20228 -29464 24607 23730 -13896 -23714 -62057 -83508 -64236 -16191 -31104 -23613 -42634 -86328
20216 -86328 -85640 -46071 9098 21283 7534 33816 28352 -16768 -26990 -55203 -21274 -33235
20204 -33235 -7964 78701 89912 61299 14708 1140 9791 34868 16146 26015 8261 -42055
20192 -42055 -12057 36355 55022 43065 3626 -4405 36448 54578 49719 7570 -38285 -68568
20180 -68568 -53765 -44639 -22974 -25132 -25258 -20100 3099 32720 3711 -6904 -12796 13420 38496
20167 38496 47997 31798 34440 49215 20928 -12965 -38018 -20952 -14010 -4860 7958 27365
20155 27365 -5788 -40613 -60030 -30227 5810 50234 75347 38961 40463 13847 -23234 4339
20143 4339 16185 15807 -2412 11703 15204 33005 29210 -30066 -64575 -18575 22458 -11875 -45663
20130 -45663 -47272 -77850 -58425 -31442 -32019 -29819 -19126 -46544 -52593 -25773 1092 24241 21257
20117 21257 9470 -14174 -7733 1573 35856 38220 9714 -25641 -19453 9283 -3753 -32392
20105 -32392 -4430 28468 36087 12084 6401 19147 59953 57210 59481 1151 -35062 -28152 9056
20092 9056 44094 48802 34192 42081 52266 71099 68970 59628 40769 61345 71317 38717 1747
20079 1747 -16243 -34210 -65926 -52880 -30820 -1701 -23525 -10192 -17197 -20766 -40831 -96210
20067 -96210 -73715 -52236 -33921 -45405 -7375 37430 108087 96112 58566 53307 50122 70081
20055 70081 71363 57770 62893 81034 74329 23822 5187 4492 11228 33441 -301 -16794 -23004
20042 -23004 -8254 54814 75507 92140 64334 16640 -18375 15840 -14118 -47266 -22909 19129
20030 19129 50252 56153 43874 31730 38732 39028 54934 53587 70093 81561 39504 11277 -11212
20017 -11212 -10376 5097 -26494 -51568 -71544 -97571 -52625 -18816 6749 2463 -15559 -52777
20005 -52777 -58937 -38209 -40445 -10420 -23466 5188 37729 17243 -28888 -43544 -14578 -23288
19993 -23288 -33707 6280 38412 45236 43928 -53454 -79355 -22575 29508 15990 -12707 -27721
19981 -27721 -24078 -10114 -26780 -20809 -38007 -39720 -9554 -15597 -24360 -14243 14325 8518 -26639
19968 -26639 3603 -17409 -32581 -57572 -71748 -80105 -94713 -85643 -56107 -28032 18705 17503
19956 17503 -16189 1167 33350 -11767 -30195 -8903 1175 -22624 -18364 -26469 31489 34329
19944 34329 31567 43629 -15728 -15016 16355 -3074 -16902 -4622 5114 9225 21296 2507 13213
19931 13213 40429 1326 -31193 -6116 41565 57880 17683 -14614 -5197 -7523 13024 14248
19919 14248 13625 56723 79696 78331 67682 28770 -17120 -30430 -58397 -81459 -46859 -21696
19907 -21696 -52378 -76690 -70500 -26245 -20449 -43428 -61220 -58984 -60451 -55906 -66822 -31613 44917
19894 44917 36641 2083 -5963 9292 18276 30256 56841 5315 -14525 -29663 -20838 -7069
19882 -7069 35950 80750 71879 38351 15209 14015 7406 12904 35604 51924 86890 100773 74754
19869 74754 48713 82447 92818 99019 71779 35713 1165 -185 2669 7928 -31624 -43330
19857 -43330 -13346 -6456 15494 19363 24809 80408 83705 73810 65349 51221 52300 51469 27886
19844 27886 -8586 -16666 -27911 -17173 3038 -7945 9899 31489 6978 -15209 -19206 -19429
19832 -19429 28491 67695 62322 47368 38606 47479 34739 -986 -25650 -49900 -85775 -79457
19820 -79457 -23460 -24662 -44072 -76513 -55047 -34770 -38488 -64485 -56243 -17162 -4413 23188
19808 23188 -1824 -44808 -57332 -62645 -42986 -15961 -28287 -34544 25424 59696 66145 65777 18928
19795 18928 17250 55732 63692 47490 88089 48804 -23988 -23978 14023 46063 70374 93612 78882
19782 78882 37467 168 -8618 -15833 -62472 -1326 36622 39444 10744 -21874 -2536 45022
19770 45022 93391 77008 49080 58213 55829 61797 40691 820 -2999 20141 17337 58597 43460
19757 43460 37217 -7508 -42283 -57777 -24550 18004 40147 22059 -14541 -20644 -2934 -25419
19745 -25419 17468 32420 32158 8426 -7587 686 -1252 -28338 -14005 22317 -16292 -27920
19733 -27920 -50000 -68991 -50555 -9181 41330 64320 54023 -1839 -61975 -44578 -28326 -12499
19721 -12499 19907 14116 61432 64246 36250 13482 -30817 -34264 -10262 -6982 -20376 7288
19709 7288 3431 36518 56915 83284 146723 225147 258056 221058 152789 141451 151932 138981
19697 138981 130678 135415 143762 119505 115818 135232 179348 216545 177949 130629 179722 183832
19685 183832 147900 129410 101889 73150 39075 17455 10998 32181 64667 89300 86977 73474
19673 73474 58673 46293 45569 51930 48797 51693 90968 129740 107543 52393 65827 48878 32399
19660 32399 34784 17604 -14069 25748 80369 135850 191894 221819 258503 216667 156826 186324
19648 186324 164219 122427 141588 147199 143598 131057 160335 169803 179651 130479 69599 78660
19636 78660 96918 113084 87593 95326 69465 39086 23612 39903 60381 39015 56905 33808
19624 33808 23007 25109 -5678 -39460 -35489 -11763 9948 -11452 -19298 -40229 -61243 -40443
19612 -40443 -46097 -35672 9109 14986 65214 84366 93855 68772 51086 9982 59693 74140
19600 74140 125641 144608 88518 52407 47938 45234 -47 -36147 -32452 23452 27806 50236
19588 50236 80065 108708 54091 -5197 -25446 -4428 29331 21146 35285 10942 33172 41772
19576 41772 -12060 822 31808 28121 48595 51553 47747 66482 26113 -35227 -45729 -27994
19564 -27994 26703 50095 47722 31921 50236 43999 75757 78189 76204 39106 32811 33100 6710
19551 6710 48398 36340 33328 22974 7991 20411 40111 74275 152964 117742 32723 18741
19539 18741 18694 7244 34155 79615 49358 41456 71916 69498 74985 35555 6301 4970 50779
19526 50779 92576 134760 92710 18454 25970 27852 -6767 -36008 -51627 -7440 -36985 -53563
19514 -53563 -70361 -30216 -15939 -5356 -16297 -41536 -10414 -24609 -49990 -21444 30470 50703
19502 50703 16282 -40453 -39783 -29797 23198 44825 24742 42252 38989 58673 24394 -14778
19490 -14778 8530 11170 -31062 2941 30991 23365 46102 57105 49492 31582 55772 39950
19478 39950 26302 38804 76078 73249 111788 49862 25995 1396 14624 37765 62550 42755
19466 42755 67299 80174 70780 39071 13823 -23485 -22756 -14244 -3967 32955 42695 40809 52804
19453 52804 64555 77490 87950 102950 73075 30565 34617 24319 13299 14353 8376 40612
19441 40612 54065 65863 59237 54552 45055 48436 13754 -29296 1867 50703 88029 60380
19429 60380 16766 37583 59926 72432 48754 60492 77891 60849 10290 -19085 -45701 -58443
19417 -58443 -29508 -1023 26020 8021 -5296 45733 101532 57421 63710 72731 66726 112054
19405 112054 120314 96449 51001 -7079 -40199 27539 45496 34240 56992 60862 71827 66614
19393 66614 89433 98446 74646 74533 86939 99932 97475 30726 30555 44340 67356 55753 42825
19380 42825 20028 32749 35793 16808 58062 82790 40249 -28029 -27485 19303 27262 61235
19368 61235 75675 31857 52962 68622 17681 -14339 4684 10622 7476 -61309 -73662 -36460
19356 -36460 10531 -11477 -27079 -42934 -45450 -30851 8023 31280 37999 54433 20032 -10218
19344 -10218 -15093 17715 24363 15503 44017 70076 72783 74936 40613 47141 48411 54137 84043
19331 84043 108616 88506 67871 38314 67627 97967 72240 61730 72892 52157 51487 63092
19319 63092 59531 100949 141837 104218 95814 45023 18629 47356 20530 -14764 -3775 -3773 6905
19306 6905 5097 19665 20050 -293 -19491 36164 42398 63997 73070 60159 60926 58568 45598
19293 45598 51368 97877 116740 107937 89093 53725 50348 41954 77231 86136 61554 77291 104919
19280 104919 108909 98837 121760 152985 152275 118720 110412 109878 98460 89316 97610 61387 46421
19267 46421 26982 21442 9055 55938 125947 141390 76282 60188 85890 75420 65147 76420
19255 76420 74143 45133 20227 31633 94960 148703 188722 186521 220501 214397 227158 231575
19243 231575 180659 186216 195583 205321 241400 274776 235933 225018 244836 291789 400944 579574
19231 579574 891880 1198927 1424654 1520752 1524448 1370507 1103552 898438 780466 782348
19221 782348 862575 1087743 1433144 1740387 1936672 2018149 1946748 1672461 1362202 1130790
19211 1130790 986852 915243 882495 906237 971514 1049443 1146292 1251256 1387137 1492125
19201 1492125 1555825 1609820 1722179 1894607 2077223 2373729 2866393 3586319 4801128 6732335
19191 6732335 9902770 15455192 23365278 30193503 33416307 33927123 30713397 24091182
19183 24091182 18210629 15002991 14011389 14898756 18061022 24328122 32078192 36641297
19175 36641297 37367121 35642736 29751914 21846070 15848894 12227735 10175501 8905704
19167 8905704 7958636 7204977 6472334 5741144 5130666 4628967 4322328 4094409 3922480
19158 3922480 3719699 3523285 3388456 3249263 3127403 3057347 3044765 3084509 3110314 3170914
19148 3170914 3305291 3561251 3885640 4409330 5328421 6795988 9222090 13512864 20660685
19139 20660685 29364527 35223304 37352169 36302623 30604690 23067441 17831830 15329104
19131 15329104 14770709 16314027 20809631 28507914 35953900 39186145 39158347 35505403
19123 35505403 27667740 19755776 14378105 10994910 8774124 7249851 6224949 5484782
19115 5484782 4954810 4545772 4172713 3920440 3702499 3430524 3188610 2919492 2608542
19106 2608542 2306525 2071234 1886495 1732126 1640913 1570374 1519374 1498301 1461314 1382702
19096 1382702 1321791 1210088 1095835 942561 839817 769403 692907 615086 594019 556161
19086 556161 527164 500309 486057 486803 446063 360746 315823 324497 324413 300802 293304 293081 290992
19073 290992 280450 284274 280191 259442 238601 238512 247364 218419 216685 209380 226834 216676 217566
19060 217566 207905 191718 221331 238608 237044 258218 235741 206838 172553 149961 152696 183766
19048 183766 168440 190351 187202 170614 180173 180703 159254 123483 82775 75711 97294 67764
19036 67764 92409 92368 34611 2537 -13088 33907 61794 59848 19898 43028 88918 81968 69624
19023 69624 68302 51134 23797 6532 49041 40361 45609 81980 105263 144073 185712 201038
19011 201038 202347 220848 239650 239253 210884 190738 154639 99810 106777 132023 140257 115080
18999 115080 124088 146406 159764 158323 132788 131656 109954 79855 30776 391 5948 31377
18987 31377 1498 -9929 -24504 -4216 44180 54627 29795 70150 90300 64911 69525 91483
18975 91483 150916 191886 201350 170405 131672 117274 98189 134605 148874 139258 93525 51230
18963 51230 54519 162238 207392 174988 160131 103575 32690 13398 36317 69679 95006 117793
18951 117793 135805 137506 138887 159926 93312 97577 114812 103875 61894 56003 83155 77057
18939 77057 55638 32727 48389 43677 52303 70622 43226 36274 25864 54501 108438 148868
18927 148868 144135 142646 138717 124346 113252 111503 173300 261260 293130 258934 276310 283041
18915 283041 268986 241891 262785 260851 214632 187211 202462 222179 194397 163039 196060 264077
18903 264077 282951 269905 234516 233874 215395 187156 128597 102665 106608 112139 139832 150653
18891 150653 138132 120756 82278 82065 57772 70583 14682 -1154 32420 73608 57826 13168
18879 13168 -9478 43381 122517 152602 196829 255175 263412 245303 239300 240945 271851 277340
18867 277340 298869 245213 207900 229692 221887 243459 290257 357353 381358 374866 414105 479188
18855 479188 499818 417710 341751 335503 298969 272704 294968 292507 296657 260251 240735 215335
18843 215335 184806 208489 186802 157190 163980 167447 151044 160703 173818 146733 118562 83598
18831 83598 55809 88450 105194 114571 118313 84189 70366 68369 67493 121829 144479 106504 94321
18818 94321 65784 53267 103220 129548 149326 188344 157503 110782 154062 191970 172752 132110
18806 132110 138242 138510 140391 165268 171313 201722 202469 190974 154136 92944 85847 79671 103913
18793 103913 115111 122172 100427 113140 124757 95500 114406 109435 138163 152486 133960 126514
18781 126514 120818 85557 71382 80839 79165 99390 105102 65987 42920 63324 125901 151559
18769 151559 110262 121402 128202 206043 307321 391215 454926 440782 321060 260169 201047
18758 201047 194349 168741 126843 73733 90442 112516 76919 67568 63810 73461 88849 96579
18746 96579 94938 144646 214492 214707 192349 178192 169798 157197 122611 92363 80381 87040 124913
18733 124913 158183 162001 156692 164676 148747 179007 191813 171002 115154 130868 160568 143851
18721 143851 146481 113992 113751 119352 119641 141698 124516 86570 80567 114393 108008 79886 92168
18708 92168 95124 76482 87287 96993 86106 92832 72014 52925 56664 45555 66375 98504
18696 98504 156184 228016 208301 176180 117984 76025 76319 99185 108838 139742 131338 115242
18684 115242 135122 118991 101362 59486 30799 43535 70813 46195 50921 70202 101803 121212
18672 121212 128836 148329 158683 135531 161510 208308 279338 300034 270424 264672 283508 229149
18660 229149 213863 237754 252380 257589 256115 316203 346170 312087 270324 238586 198058 137748
18648 137748 96919 74657 65437 114968 115966 73251 99243 159997 156825 155083 132736 123383 116320
18635 116320 106845 136636 158210 99304 65729 37749 28283 69482 118120 158489 175709 184508
18623 184508 167624 194132 240143 249411 325254 389663 372432 373980 421493 416161 399968 366374
18611 366374 327237 342694 337817 342375 410351 416569 405880 391891 366665 352332 283778 260603
18599 260603 286467 300864 248312 199503 227660 239271 187056 147629 143018 126897 121130 105158
18587 105158 103288 74338 109326 134982 95965 76491 137758 180842 176013 180072 198694 184464
18575 184464 171480 191553 164355 149333 179491 208677 230288 195047 192974 219077 243890 219850
18563 219850 209809 205390 234705 288714 358360 408861 455541 486593 514504 488052 414029 383533
18551 383533 341865 309495 245063 197827 197760 198359 229268 243795 266463 296427 289359 259677 203268
18538 203268 186517 186318 211351 203004 197569 228741 226656 220007 202712 165253 171116 146404 134093
18525 134093 190130 229388 259640 226764 222171 226426 248714 275740 266794 264430 285642 300801
18513 300801 296060 303967 344684 383380 475797 544754 581572 527300 506471 493329 450277 451856
18501 451856 459790 503035 584465 648031 687825 704312 673595 595237 568272 622479 647620 629881
18489 629881 587615 643363 728221 777000 760296 740670 700689 695675 726756 773007 813398 859087
18477 859087 933795 1024391 1246114 1530835 1960121 2528332 3111343 3720931 4742590 6677485
18467 6677485 10226404 15545986 19400479 18118010 13750850 10220614 8291264 7396060
18459 7396060 7027378 7071420 7772457 9784404 13848748 18897624 20600964 17138474 12345621
18450 12345621 9017830 7028745 5767656 4918876 4306542 3860958 3619109 3513806 3547692
18441 3547692 3640070 3798779 3937613 3987744 4050448 4036051 3957017 3910576 3785612 3615035
18431 3615035 3483776 3441100 3610675 3992095 4629002 5411526 6289231 7329303 8855675
18422 8855675 11464332 16197992 23764586 30629328 31433551 27023974 22835900 21719362
18414 21719362 24219995 29350795 33042215 32327547 30785411 33390520 40388132 47084671
18406 47084671 49082425 47288428 45692501 47355245 52138387 55620485 52828082 45319379
18398 45319379 37277450 29773782 23680506 19749856 17607896 16915400 17598257 19633522
18390 19633522 22032477 22429281 19927153 16628462 14171425 12498306 11241612 10330660
18382 10330660 9793482 9477909 9239354 8900805 8633122 8586328 8851466 9600789 11065450
18373 11065450 13053560 14606268 15216870 15936590 18294406 23596040 31909589 38919210
18365 38919210 39961648 37471397 34938154 32756251 32427870 35908866 44380146 56717374
18357 56717374 69439279 80469087 87409536 86545988 79864772 74602179 71170707 65407360
18349 65407360 59558404 56898116 55919070 53381267 48712070 42878427 35816500 28956632
18341 28956632 23963840 20855105 19112089 18339014 18344116 18823540 18630747 16793663 14250970
18332 14250970 12111249 10535754 9422330 8638377 8086304 7635188 7366466 7184789 7089098
18323 7089098 7064495 7128658 7391605 7937606 8821773 10489181 13504138 18063282 22452852
18314 22452852 23363147 20627116 17572852 16177987 16847628 20008048 25326476 30491015
18306 30491015 34621917 40819377 49784752 56411243 57764485 55360685 48579012 37764982
18298 37764982 27470067 20465950 16024309 13107608 11157020 9876981 9057971 8593600
18290 8593600 8561080 9114599 10309558 11404174 11068191 9319916 7468698 6099062 5117499
18281 5117499 4421282 3909178 3569301 3320121 3050271 2815334 2670782 2552046 2435304
18272 2435304 2367376 2315593 2219952 2040009 1829645 1622992 1478211 1351500 1250263 1132777
18262 1132777 1068187 1076633 1082795 1005185 917204 849893 795822 751120 730496 689621 667652 624349
18250 624349 634248 652242 652236 672309 630171 628951 637683 576142 539290 522562 537894 539650 518413
18237 518413 436127 417569 401309 366538 347203 374993 427864 464118 513063 565596 567069 559926
18225 559926 549577 528618 479431 493056 474725 430334 419836 402411 368307 326414 328236 277011
18213 277011 214131 184594 203526 217951 239140 264469 275694 271602 242121 258499 281561 312118
18201 312118 282350 228568 192058 242491 280196 290560 328670 363702 383749 364158 339921
18190 339921 272915 225285 281274 324599 286843 263677 274636 294595 238839 243995 292513 343639
18178 343639 407042 436286 437977 480724 475017 415932 353670 341482 324448 292538 318326 315524
18166 315524 274396 251757 256657 185201 221380 312336 344109 333533 350416 328416 283406 269571
18154 269571 285919 299408 346781 400261 446199 483986 513026 580703 738396 869541 871434
18143 871434 854945 879070 933613 1079293 1348533 1591934 1598730 1417987 1271376 1158916
18133 1158916 1123004 1211126 1373436 1406151 1337366 1234509 1168870 1120393 1104612 1113236 1196336
18122 1196336 1243484 1334575 1526338 1677849 1809566 2001600 2272447 2626734 3139433 3836973
18112 3836973 4802104 6257581 8482810 12181954 18881548 32295320 55748390 75416503
18104 75416503 69532667 47225821 30124265 20779191 15591516 12626840 10899074 10077512
18096 10077512 10113190 11034846 13201845 16741327 19834461 20120995 18318675 16958691 17239901
18087 17239901 19860549 25339337 31613918 33004381 28037074 21806251 17995913 16908066
18079 16908066 18143873 20844044 21815276 18893967 14346464 10887456 8723808 7303565
18071 7303565 6328822 5605199 5101283 4757281 4505029 4187357 3873268 3671891 3587755 3537756
18061 3537756 3525782 3564176 3494925 3462774 3483899 3602919 3841692 4196074 4699601 5571101
18051 5571101 7053966 9487547 12545944 14314048 13680159 12491337 12618702 14410111
18043 14410111 17861245 22361922 27060423 32237054 37851395 42183988 43200765 40707050
18035 40707050 36617224 31538584 25313925 19717610 16121179 14473419 14382260 15670854
18027 15670854 17509580 18050688 16714131 15162698 14606916 15461939 18579028 24583750
18019 24583750 30682768 31352709 26797278 22308270 20599863 22371893 27474814 32156260
18011 32156260 30523900 23777620 17509189 13488909 11036323 9480878 8464554 7889956
18003 7889956 7671678 7816239 8442256 9855011 12102978 13831133 13622113 12503463 12455014
17994 12455014 14512341 19044007 24135563 26136901 23480073 18476633 14388276 12236781
17986 12236781 11611457 12339443 13629680 13653179 11983729 10189241 9235656 9173604 9762519
17977 9762519 10922698 12959742 16720422 23075593 30202254 33860002 34729353 37291320
17969 37291320 40056723 39786506 39238126 40175986 39376841 37472273 37607520 36479248 30324867
17960 30324867 22495545 16736503 13108663 10804638 9224216 8049221 7197170 6565252
17952 6565252 6047230 5624151 5333805 5149515 5035883 4858279 4629280 4361523 4090806
17943 4090806 3940254 3902821 3863824 3720088 3502635 3323691 3233366 3252951 3365023 3597025
17933 3597025 4016568 4667738 5394113 5997256 6460114 7017974 7983102 10000350 14037043
17924 14037043 20196982 24888224 23976205 19765836 16596168 15858488 17758988 21657990
17916 21657990 23636108 20533854 15134139 11042209 8509368 6987724 6046995 5394695
17908 5394695 4893987 4446158 4025842 3667704 3411468 3200112 3033255 3009531 3024366 3053843
17898 3053843 3077823 3120181 3184778 3285878 3414252 3569111 3775263 4081296 4496324 5060625
17888 5060625 5882795 7111788 9043360 11725695 14377357 15838042 16015619 15289806 14462677
17879 14462677 14499823 16217710 20202962 27074254 36977508 49031832 59616905 62195898
17871 62195898 55470391 46694165 42455645 44906487 54919649 70020427 80942333 79930507
17863 79930507 71005928 62439718 55796068 48171856 39148142 31030121 25297264 21849018
17855 21849018 20124894 19932464 21200081 23381156 24628140 23250488 19857476 16296191
17847 16296191 13622737 11832109 10623339 9715924 9037186 8450817 7918405 7500778 7246603
17838 7246603 7195346 7366351 7695271 8195555 9092493 10823831 13746390 17715478 21210130
17829 21210130 22640231 22966183 24726845 28932646 33319300 34415854 31914302 29065299
17821 29065299 29186161 34304953 44641196 55307647 59136742 56236378 51947110 49214572
17813 49214572 49253011 52335039 55392056 52910726 43943198 34014647 27080320 22455824
17805 22455824 18600562 15296537 12823623 11094561 9866053 8985428 8344149 7882794
17797 7882794 7593698 7596405 8068882 8580086 8506031 7583282 6296645 5215070 4500276 3954373
17787 3954373 3538156 3165562 2843948 2564559 2304951 2103226 1989890 1875391 1724967
17778 1724967 1593129 1508389 1389216 1253341 1183059 1160732 1118740 1046787 957686 900401 848928
17767 848928 808002 776001 752254 733095 680115 666564 689087 676322 623574 608604 586697
17756 586697 583377 576023 578928 611440 570155 550445 567868 550732 541070 600037 598859 590293 548850
17743 548850 501897 503672 530428 520044 532927 500229 455690 467456 452513 406940 332419 274986
17731 274986 225501 241662 217818 182455 184274 180320 163439 167616 184113 145619 103599 124670
17719 124670 181588 189201 181078 137113 121724 119847 106895 123271 104275 73781 94756 88882
17707 88882 115997 152652 140054 153024 184679 188225 200018 206562 266428 327298 367210 347428
17695 347428 325520 267082 253031 271989 290265 304219 322013 274072 255481 231546 237281 263169
17683 263169 232509 206108 207610 194692 154668 124312 94881 58355 32316 63505 46100 35747
17671 35747 28695 43858 87307 139117 108353 63265 -26797 -37722 8219 16560 27172 25617
17659 25617 24442 17026 22877 2936 7735 34402 88675 82762 74933 133981 164563 139709 141784
17646 141784 182252 145468 119192 135159 102384 107121 123733 96102 108070 120129 65579 35635
17634 35635 41110 64808 87230 101474 77851 42357 35570 20018 53740 74963 64272 54317
17622 54317 6120 9179 -12526 -26123 -6790 3353 30049 1953 -48883 -39645 -36119 1225
17610 1225 54610 54152 60358 70387 98795 107157 87619 79088 57305 88525 116908 113932 77820
17597 77820 107099 168421 183194 117777 110896 76051 112376 145568 161538 164029 164138 122899
17585 122899 117039 127077 122600 159536 200132 170650 169759 194683 278234 290043 233757 250567
17573 250567 267388 267053 253720 229884 212932 204950 197344 204112 205761 203298 191408 179985 124171
17560 124171 111718 100275 111964 104209 118271 152401 188278 217444 219412 168945 114031 109673
17548 109673 159425 188162 213301 261603 246215 243084 212573 217551 257738 284731 310521 344668
17536 344668 332111 335087 374805 405144 370875 414104 488637 543301 564142 605100 645251 708325
17524 708325 722837 752453 767014 822533 874133 899945 902674 967935 992614 1019046 1129460
17513 1129460 1270973 1418826 1538404 1661712 1803687 2058759 2339645 2736060 3298427
17504 3298427 4013849 5009101 6503828 8928651 13026016 19462648 27536907 34801718
17496 34801718 39420684 41005279 39650032 37153691 36722544 39135055 41761573 42262252
17488 42262252 39837360 34327161 26915022 20016195 15042967 11896944 9861295 8477220
17480 8477220 7545611 6772164 6086787 5524402 5018643 4643837 4400038 4219887 3991310
17471 3991310 3739113 3446597 3160583 2880167 2679693 2560341 2505498 2473811 2432862 2377610
17461 2377610 2298894 2332707 2378574 2376626 2397455 2450595 2598080 2865611 3239223 3773930 4426096
17450 4426096 5353008 6787048 9177549 13133851 19220540 26582530 32995900 37021552
17442 37021552 38425374 37161701 34935134 34786516 36964996 38983430 39043007 36656715
17434 36656715 31535963 24768890 18573542 14048531 11038333 9037688 7639533 6639796
17426 6639796 5932025 5366048 4870170 4414185 4077585 3801045 3530730 3314607 3072310
17417 3072310 2761594 2498547 2271059 2032004 1852326 1726899 1635634 1496157 1380023 1262202
17407 1262202 1161469 1071818 1012845 966091 941381 929459 886641 840495 776069 714923 651407
17396 651407 605953 622523 647506 687280 767639 886248 1053269 1305113 1499832 1629161
17386 1629161 1686588 1636836 1528878 1521235 1544095 1613368 1617361 1511925 1292895 1038598 788781
17375 788781 672807 603571 527333 481832 458191 460907 491201 529053 524366 493907 469713 519705
17363 519705 532223 503462 419040 380106 354876 364405 347028 330188 310403 296730 303278 331747
17351 331747 362273 358294 339865 324283 323715 311458 266186 260614 275030 261141 215769 236487
17339 236487 200176 147583 164532 139306 101688 73637 66438 114048 113793 87541 126557 132703
17327 132703 112814 81093 76763 103555 82884 119446 149630 144907 198984 223001 238718 225152
17315 225152 207533 224819 251526 295165 292493 282641 280054 310236 304187 273420 265975 193339
17303 193339 157202 126182 132983 155110 180880 209496 217498 195645 156163 137916 165755 167280
17291 167280 122531 159667 212470 186975 163941 110663 87666 65838 33226 41704 20503 23962
17279 23962 10764 -19775 -7207 44917 25638 466 -14368 -12415 26522 21175 16854 26340
17267 26340 79928 84544 61171 36749 -14650 11672 66675 63632 85832 108482 102278 68608
17255 68608 30097 537 25238 47871 45735 4853 -46739 -61439 -55640 -5867 -33160 -40664
17243 -40664 -17951 -39011 -93143 -37937 5195 5459 4728 -63271 -45723 4069 -674 -45355 -47949
17230 -47949 -8797 -19922 -11718 -37605 -59222 -41389 -11271 -61257 -110968 -87543 -69609 -52440
17218 -52440 -16132 -2653 -1865 10529 74301 87055 45269 -21153 -24722 -27846 -5486 -27987
17206 -27987 -65501 -66644 -37295 -60236 -29543 -52768 -103293 -63927 18934 32287 34501 54628
17194 54628 35279 40136 33861 24232 -24967 -53095 -40387 -38809 -25989 -61610 -81729 -43480
17182 -43480 16842 47704 51715 4966 20688 22468 10902 -12853 -9189 -17029 -31111 -36019 -50600
17169 -50600 -58860 -84576 -75526 -27476 25417 36015 29682 31650 -6610 24931 67738 26556
17157 26556 26433 -1667 -10886 -8012 -16917 -7770 -27962 -46133 -64649 -62964 -26490 2121 29733
17144 29733 9212 -36389 -63741 -49699 -31148 -20893 981 16214 -13324 13108 28378 -37108
17132 -37108 -47200 -33479 -27309 27289 56932 78459 64334 29433 41135 60223 27153 -22906
17120 -22906 -25325 -53775 -70259 -55095 -30763 -4960 24977 26491 7219 -40903 -41812 -22761
17108 -22761 744 7376 12622 26613 37750 28510 8405 3090 8295 -43150 -66462 -50361 -40622
17095 -40622 23900 26186 -4858 -7483 -823 -18566 -54640 -74825 -88548 -61165 -31310 -27054
17083 -27054 -28891 -16882 -13428 -22566 -44787 -4378 55075 48524 15664 -26531 -61237 -49303
17071 -49303 -19192 32907 31776 -8624 -26674 -20212 24464 29053 34733 55874 68366 58071
17059 58071 8633 -31644 -54252 -52109 -36472 13255 13341 4871 45770 77707 39280 21529 -5011
17046 -5011 -42197 -13152 -26402 -21290 -11740 19748 25608 35433 58755 21810 -24951 -19212 -26608
17033 -26608 -1814 -63181 -74263 -59229 -38840 -38773 -33909 -4300 -14661 -41645 -2212 32259
17021 32259 52986 33734 26183 34895 -13305 -27266 2918 40170 42866 26635 -7257 -3377
17009 -3377 12383 -13674 -24447 -29792 -20859 -27485 -36272 -18147 -24801 -29761 -32580 -19116 -30703
16996 -30703 -29837 -26735 -585 5509 -11496 -14589 43826 61057 58620 27785 12423 14494 20419
16983 20419 44194 78109 156783 202340 220658 211710 240245 223454 176699 137305 96584 83995
16971 83995 92668 96778 77441 57119 47147 64455 117163 125560 91432 65598 15133 -41390
16959 -41390 -45784 -17952 -11765 21583 19295 45615 46491 58690 48242 31450 26028 25407 2469
16946 2469 22308 44760 -1590 -9692 46486 94274 57526 40420 24874 50652 66261 45673
16934 45673 77972 81817 87982 85508 119220 152269 146871 136396 157287 169100 195272 196507 180580
16921 180580 190889 190733 211189 184795 166767 136107 97016 50070 61064 48344 54534 45831
16909 45831 6746 -5948 13774 -33817 -33235 -7305 -10070 -13575 -38102 -43081 -2928 -30848 -69577
16896 -69577 -21124 45859 26998 -25877 -36709 13217 33530 35688 57777 25808 17645 4654
16884 4654 -17541 -76037 -98482 -89991 -73844 -61541 -45032 -32992 -616 -2813 13606 -6960
16872 -6960 -20451 -14898 -31034 18521 56291 42837 46012 42553 28099 34324 19461 8061 -1138
16859 -1138 4319 -11258 -8350 -8165 -22907 -48834 -67875 -86595 -42309 -28844 -18127 -4024 -13483
16846 -13483 -8822 -18745 -54262 -117844 -122789 -62927 -2123 -755 8468 5919 -34487 -44903 -34728
16833 -34728 -70182 -34977 -3475 6440 -30773 -74736 -57486 -40544 -13141 -33997 -66453 -88068
16821 -88068 -101052 -111318 -107937 -85409 -66479 -37218 -4841 6950 15595 4454 -27416 -14244
16809 -14244 -22306 -40181 -30661 -33597 -4481 9187 -61357 -100267 -56401 -39092 -52153 -92959
16797 -92959 -88458 -48866 -52844 -33247 -27470 -12931 -28866 -16080 -25574 -15844 12923 16414 5006
16784 5006 16424 26150 48803 45295 33546 19705 -28708 -82746 -80443 -39518 -6898 4324
16772 4324 -7270 16178 9159 -24328 -1394 27037 30157 27755 19865 3562 -5365 5762 8871
16759 8871 29593 22988 29802 8419 -4283 -44040 -80927 -60568 -51706 -95559 -113537 -96570
16747 -96570 -80894 -80389 -88738 -63430 -31891 11579 -2490 -14522 -14715 -23922 -3099 -20354 -26607
16734 -26607 -20005 -26214 -1856 -36151 -90554 -59641 10493 34512 6163 -26678 -30300 -21612
16722 -21612 -41477 -7904 -11387 -11776 2037 10346 5109 25792 47894 28796 35785 55405 17428
16709 17428 -7093 -7170 1332 14209 25798 33776 19264 13610 -16654 -25701 -38855 -6912 12307
16696 12307 10545 32333 18341 -13328 -37841 -33899 -15098 -12104 -8072 -8207 7708 -21957 -71789
16683 -71789 -55089 -21456 -26663 -61408 -17049 27411 -9219 -37414 12092 17970 6955 931
16671 931 23946 33576 34105 40635 49663 9683 -6952 3459 303 20772 -10280 -29816 -14823
16658 -14823 -353 -39549 -42131 -2526 30680 -60 -38739 -96222 -121833 -91775 -18736 20295
16646 20295 23989 2255 -797 -12960 -27597 -29354 -35999 -38695 -17512 13777 -4258 -32054 -42417
16633 -42417 -27210 -27137 -44217 -17525 10866 -37376 -42963 -12936 -5460 -32766 -52271 -25378 -14790
16620 -14790 -6417 20648 -808 -28867 9161 -4086 -15346 724 36098 -37337 -74909 -78884
16608 -78884 -28844 -33071 -58291 -70855 -73291 -65912 -29376 -10262 34781 28251 34932 42887 61839
16595 61839 65737 64451 76385 60071 51879 44957 14435 -15030 -9022 -16273 9487 10694 39993
16582 39993 57000 51960 34757 20255 53428 85533 26610 -25924 -14679 -10439 10898 30631
16570 30631 31941 -13569 -794 -2231 3284 26314 -15726 -33365 -23443 -37125 -48718 -75033
16558 -75033 -70559 -13419 33324 23812 1679 4013 5011 -3059 6419 16276 -18551 -32797 -22541
16545 -22541 8857 -19743 -45934 -16537 -31330 -29830 13019 1678 18607 27693 -5261 -41732
16533 -41732 -52767 -55851 -73196 -62150 -49884 -80332 -103922 -49070 -7290 -24216 -53568 -66339
16521 -66339 -71580 -75785 -46834 7883 52 -38997 -25439 27597 31427 -17176 -38164 -47823 -63799
16508 -63799 -9656 -18545 -47039 -17990 -5263 -13337 -26441 -39991 -68091 -36747 -16620 14339
16496 14339 15945 3616 6244 -8431 -14255 -9127 -27082 -3655 12093 -26599 -26741 5412 11109
16483 11109 -9728 -34514 -53010 -101780 -73466 -25059 -15071 -3198 10327 12315 20693 41606
16471 41606 7217 -15208 -83848 -94677 -74551 -30711 -42403 701 2733 -53897 -29609 -39295
16459 -39295 -50792 -63148 -48027 -47682 -44255 -843 21438 31415 31521 -19510 -53484 -24368 -12245
16446 -12245 9587 47331 -14151 -44453 -7986 -2356 5712 2506 -45588 -58657 -45876 -64374
16434 -64374 -82541 -95191 -72940 -85950 -102749 -81431 -38077 258 14560 11803 8631 17714
16422 17714 -14712 -6262 35713 41933 29900 4440 12319 -10919 5962 10368 -18604 -65208
16410 -65208 -71897 -35263 -42571 -35118 -21341 -22263 -28759 -29346 -13398 -15509 -7212 -23734 -53449 -60457
16396 -60457 -35048 -40111 -59698 -30486 -5149 -39873 -36922 -22526 -35753 -29527 -1003 -50158
16384 -50158 -35938 -36855 -41375 -40154 -62152 -57117 -17752 -27623 6792 30255 26533 36960 5439
16371 5439 -8230 2031 21621 -3173 -50831 -38914 -9227 -7756 20193 19052 14547 57355
16359 57355 22952 -27640 -49995 -75153 -19513 -1125 562 22540 20256 14168 12256 -504
16347 -504 28348 54223 64797 70233 49820 56368 18796 -8654 -25401 -7441 5739 -11379
16335 -11379 -15673 -29272 -2445 -30046 -37695 -48211 -64149 -34850 -47338 -60909 -53582 -35246
16323 -35246 -66048 -52156 -6651 -25016 -26863 -63033 -34590 -31877 237 11359 4724 21912
16311 21912 -9940 -31868 -6332 -1661 20203 20866 10664 18050 33955 39280 64983 67866 26032
16298 26032 20895 -9321 -20975 37921 4501 -1131 470 -17092 -18342 -18522 -61655 -63527 -11452
16285 -11452 6467 -24211 -37768 -61362 -22072 -25775 -30636 -23972 -9767 -21809 -30648 -24874 -37274
16272 -37274 -54329 -36048 -61685 -45525 -3547 5714 5742 9716 11750 -21002 -11899 40158 52306
16259 52306 46159 39473 1450 25557 27176 9812 -40261 -81370 -44586 -20774 -12505 59445
16247 59445 33603 -8879 611 28274 48869 31372 -2145 9960 13675 27789 67475 40102
16235 40102 38328 17906 -29562 -36179 -39214 -1217 11716 -5585 -19464 -21718 -24942 23906 26888
16222 26888 -21880 -66183 -76232 -20889 17577 38327 13684 -32587 -63541 -25134 4956 -19932
16210 -19932 -6041 -23754 -39499 -10495 15753 29150 57048 54831 36808 -11325 -16075 23956
16198 23956 33278 -11342 -18962 -5510 -368 -6191 6988 23544 945 2737 10436 10564 -5749
16185 -5749 -16678 -38038 -44897 -100320 -47414 -10629 -51581 -72358 -52387 -67244 -77051 -69226
16173 -69226 -52162 -41938 -77443 -76517 -64563 -65518 -13734 17709 -2571 -37111 -38359 -3035 -25421
16160 -25421 -20941 -31403 -74887 -95617 -67954 -50907 -49764 -37310 -8874 -4753 -24024 -26614
16148 -26614 -32934 4193 18578 32460 44308 117 1841 46506 76939 71598 32867 44971
16136 44971 19888 27258 32509 -8798 -32924 -436 6381 -20326 -23941 -42972 -43635 -23569 6629
16123 6629 34465 41949 76099 83907 14391 -28590 -1157 22599 -3409 -19698 -23656 -20441 -27496
16110 -27496 -27308 -8675 6755 23980 15093 12809 29213 9200 -13522 -35996 -52750 -80166
16098 -80166 -49150 -23961 -45599 -42331 -17068 18629 37098 9900 2659 -3763 -46506 -65418
16086 -65418 -55484 -44129 -16398 888 10404 64051 79035 32235 12055 13923 21048 40142
16074 40142 -4251 -6906 -17004 -15787 19582 -41209 -64196 -17279 -2293 -28883 -28889 -73575 -103919
16061 -103919 -54430 -8917 -11992 -14441 -10512 -3409 30461 8474 -6838 10141 -8555 -7556 27333
16048 27333 54107 24725 -18330 -61620 -78914 -64413 -62632 -91673 -93386 -69002 -48005 -36633
16036 -36633 -72992 -44731 -14152 -58936 -99696 -59535 -21491 -34105 -52255 -68217 -86337 -68601
16024 -68601 -16356 -28321 -23304 12524 6715 -571 3184 -413 2414 11954 -18735 -16916 -9559
16011 -9559 112 33142 11467 -5272 -10316 14017 16716 -10923 -67105 -94242 -50768 -956
15999 -956 32875 41072 36106 26578 23827 35532 80 -40651 -32415 -46960 -33131 -3569 -15615
15986 -15615 5044 4165 -1655 -6315 -22484 18808 42912 -3440 -26534 -14344 -11136 7293 -11049
15973 -11049 -24612 -12383 15589 12582 -42507 -21750 -40680 -79830 -33397 19333 9844 -39795
15961 -39795 -29573 -8344 16535 834 30634 60799 54533 31147 20295 10634 25720 9159
15949 9159 1847 -10499 3921 -45642 -89741 -51972 -7449 30835 33895 47144 -20682 -33056
15937 -33056 -11779 -10738 15017 53313 63457 43297 24577 48287 76707 79662 37638 7585
15925 7585 2177 -1499 -3767 -10551 -16688 -14476 47432 65250 53413 -13816 -41302 -32121 10000
15912 10000 17100 7550 -23495 -37385 -52117 -51054 -55818 -22443 -4457 10850 2127 29722 34155
15899 34155 47472 45032 22452 32238 16228 -5842 8012 -18960 -31413 -42011 -59952 -93539
15887 -93539 -66800 -22306 3080 17303 -45018 -94178 -109275 -65368 -20888 4948 -4276 5128
15875 5128 36244 9945 -23077 -30185 -7348 38766 68799 82300 75988 75038 49700 -9034 -6341
15862 -6341 -26116 560 54820 52779 82370 41684 19569 -110 -43876 -36090 -43656 -21014
15850 -21014 -14956 20422 5266 -9186 -2730 25823 -21693 -58595 -15214 17607 19268 43053
15838 43053 32856 18067 -15615 -45049 -27467 6561 29044 3048 -180 25943 30899 17975
15826 17975 -76 13635 48239 26456 -61504 -90294 -76613 -55305 -43457 -53911 -46028 -28809
15814 -28809 -27548 -21974 42402 20360 9083 -18697 -49067 -60354 -74829 -38926 -23001 -20499
15802 -20499 31625 44460 -3299 28570 32381 -18385 -50168 -28074 -10939 -36428 -72302 -76907
15790 -76907 -29475 17223 26338 -10431 -2995 17241 -4043 2804 16369 -15143 7097 41542
15778 41542 10562 -30110 -52453 -69801 -30002 10350 31893 49982 70102 59406 39750 26892
15766 26892 62892 78070 19510 -27404 -60167 -100783 -104736 -74804 -41228 -31961 -66555 -54182
15754 -54182 -18502 15732 14300 10501 32282 53699 35315 -18383 -6798 -13273 -27017 -26083 -31895
15741 -31895 -7090 9195 -4976 570 -7521 -16593 -18662 16595 15816 12439 37537 58585 62320
15728 62320 41357 8455 -29144 -49513 -30258 -81712 -92991 -57962 -30744 -44607 -24013 -27568
15716 -27568 -47536 -16577 14164 51574 25287 -2969 11724 -46802 -75239 -52530 -36496 845
15704 845 -28597 -66353 -71706 -72093 -24363 16126 -10141 -43986 -35396 -35394 -44538 -28458 -22004 -41413
15690 -41413 -19220 -10710 -53226 -44230 -16813 -2859 -29298 -55201 -55820 -45870 -23035 -40078 -52607
15677 -52607 -20571 -14297 -27378 12170 8591 -30658 -14080 31602 15704 -18159 -9582 1929
15665 1929 40061 45936 61171 15275 9640 29822 -3227 -40825 -20586 -20408 -30166 -89517 -113023
15652 -113023 -128794 -127410 -123058 -86383 -53856 -49301 -17413 -16253 -12915 -31358 -27958 -50567 -25505
15639 -25505 17130 9116 3483 38484 80883 71784 72693 68975 56743 57526 70415 37858 24912
15626 24912 -16423 -50997 -60760 -14337 13173 11582 15475 -15988 -36014 -17335 6779 20854
15614 20854 -4214 -5520 19617 -7043 -42577 -66949 -75268 -60329 -17309 43605 38800 38736 -8733
15601 -8733 -57636 -69000 -67036 -24168 10445 49254 53484 24496 -9155 -48283 -40141 31571
15589 31571 46811 51875 106299 98948 40904 46527 60621 34033 16309 -6580 -14510 2644
15577 2644 36527 19808 -17457 -21479 -34965 -45333 -69766 -61752 -39076 -5368 22659 17518
15565 17518 20740 29109 18770 15008 1020 31005 29900 31846 45144 47376 6380 -6175 -41644
15552 -41644 -50870 -32660 -21719 5622 -935 5516 9345 18004 36840 40130 3606 -35048 -55637
15539 -55637 -17207 -2553 -7860 13792 40218 34099 42695 6562 -48991 -66744 -66664 -60306 -12461
15526 -12461 4136 19030 -7362 -8918 4319 20045 14378 6169 3998 10456 -10961 43891 94981
15513 94981 64211 59127 39299 2944 -391 8304 39013 43420 26789 64320 70729 34707 1616
15500 1616 -1174 -44870 -66353 -27715 -51088 -82986 -27878 10305 14110 3312 -21318 -48974
15488 -48974 -50903 -11567 14149 54516 15831 -13454 -11677 1944 13788 28292 43756 52850
15476 52850 39392 60632 30708 25979 49171 53023 21836 15769 55584 57566 12447 -32466
15464 -32466 -61170 -62647 -56321 -64441 -40338 7762 71504 54169 35342 -9530 -58218 -47629
15452 -47629 -15498 -6013 4685 55049 61105 19782 21605 44439 30875 3494 -5571 11822
15440 11822 4755 22501 23497 28923 20617 4932 21397 42482 62779 64651 83035 58346 31887
15427 31887 14528 10704 14849 -15810 -34885 -24398 10698 -1403 13284 1248 -38027 -47995
15415 -47995 -19489 -28497 -48013 -43031 -68421 -42987 -35963 -10714 40986 51494 61921 49040
15403 49040 27680 6691 33493 70725 71102 82616 96041 73452 54513 7225 5453 15635
15391 15635 -24000 -46002 -25938 -11509 34030 55887 34423 30457 26809 48408 87796 113716
15379 113716 38763 -43308 -42440 -23760 -4036 20456 38245 44610 20030 -1465 966 -12552
15367 -12552 -8073 -41485 -26679 -34476 -40056 -27624 -34313 -54496 -15038 20084 8375 -38427
15355 -38427 -29607 -15927 8443 22977 -2466 -6359 -7456 4688 16403 -24955 -59819 -40564
15343 -40564 6910 -9057 -15318 11885 -4925 -9052 4478 41518 29529 -23804 -50699 -54288
15331 -54288 -77275 -54504 -21716 -14927 -14327 15663 63560 18276 16940 20704 -21774 3628 27089
15318 27089 -6013 7344 68544 39399 19231 42483 102019 100715 73090 93312 63968 41924
15306 41924 35473 -13142 -29083 10961 53207 76775 67398 39288 24196 16711 4844 -42926
15294 -42926 -14546 4865 6924 1890 15331 -561 22659 33404 25967 33875 21658 7645
15282 7645 -986 -27255 -24435 -24621 13292 39632 51667 34159 27749 43532 86959 62051 27031
15269 27031 26676 28042 43706 51099 38834 45085 25283 29994 14694 -12974 -8176 18208 -10194
15256 -10194 -35219 32019 65550 51463 32153 36848 13363 -21270 5332 41928 3954 -1811
15244 -1811 37960 89125 103666 73747 40360 8672 -3767 40414 81005 23485 -55381 -72410
15232 -72410 -35213 -20262 -24220 -5962 50900 73414 70242 19615 21812 44546 77707 29164
15220 29164 8787 -30707 -42200 -35058 -16645 -29308 -30337 -5069 5666 -8289 -9027 -16587 -20760
15207 -20760 -28446 15278 40728 30631 -4079 -15617 -4922 -7717 -17209 -23547 -14466 -11002 -24254
15194 -24254 -4226 18808 37468 47539 865 9705 60628 49369 65616 124456 94662 14893
15182 14893 36752 64262 71382 20194 -6532 12534 -6057 -14530 -50970 -41060 1624 -41595
15170 -41595 -66712 23251 53736 35775 8667 23429 30868 -8267 -55412 -40487 12985 2881
15158 2881 -10118 -6244 24097 38778 35650 16691 45164 87562 79771 89964 67236 44372
15146 44372 40697 64064 76032 71652 -7709 -29827 -6485 -7923 -23615 -48978 -6640 4493
15134 4493 -22537 -52787 -10776 -12987 -5349 -32176 -34772 -39976 -45175 -18384 -8323 36606 64296
15121 64296 35144 -18944 13618 4849 -30764 -26108 -32979 -49577 -81149 -74189 -69842 -74215 -46643
15108 -46643 10989 61564 96322 85845 59799 58725 66645 54966 27054 -5470 -44693 -81765
15096 -81765 -54648 -37475 -21006 -10941 -44634 -35891 -18215 3926 -16785 -15785 -3683 -4086
15084 -4086 36035 57526 -1687 -17590 -25131 -28455 -12922 -4788 11800 10897 7114 -19944 -51959
15071 -51959 -54654 -67115 -27239 4750 21459 55796 42993 48081 20475 -15972 20786 59037
15059 59037 88031 81217 38190 37338 56135 35742 33357 38576 24529 32429 26129 20267 19675 6803
15045 6803 11535 -4090 -426 19782 -5946 -4760 5267 23111 12578 -5247 -23889 -27822 1019
15032 1019 -2504 -18906 5156 -7682 -8638 42007 83521 54279 23610 -1981 33181 34705 17526
15019 17526 10157 1040 -17029 -11033 31055 37150 49287 76398 111974 96142 132226 108468
15007 108468 65731 76460 36049 687 -11249 -10592 41101 32870 10248 -27523 -41192 -20876
14995 -20876 12667 32672 13929 1854 25721 19805 -17485 -59903 -194 42562 25633 -7226
14983 -7226 10286 12213 4171 22190 35572 24550 36498 29614 -9274 -34818 -35485 -16987 -11592
14970 -11592 -29389 -3480 35687 -15369 -57681 -55030 -6568 11461 10072 -4529 -3951 28715
14958 28715 21574 14718 8422 -1353 -23140 -3556 2871 10682 -16744 -38016 -3976 18451 36687
14945 36687 29555 -1084 -19865 -18076 -8234 14417 27522 13674 11884 -20385 -22488 -12634 -21817
14932 -21817 -56853 -87242 -87462 -36179 -15323 -10334 9189 4146 2254 -14630 -16046 -4048 -29921
14919 -29921 -33257 -49278 -65960 -52646 -43383 13941 60671 7243 -6132 -4339 -4930 16942 40519
14906 40519 65996 36036 23849 -12863 10090 29210 -13753 -80230 -78487 -75773 -59322 -26984
14894 -26984 25628 10299 -50915 -19543 48065 112705 102161 36836 -6539 6540 -12236 -27165
14882 -27165 -49680 -36710 -31583 -47818 -34270 -10877 47563 45982 -19222 -19989 14480 -8606
14870 -8606 -20376 -15757 -19136 31509 56046 67027 12874 -29534 -35165 8001 25527 16657 15374
14857 15374 -9628 -20680 -7241 -2453 -12632 -12432 11952 44647 21719 8755 4918 2722 2696
14844 2696 -9234 -16900 6537 38999 47298 -12708 -27102 -54070 -45593 -23618 -25995 2662 54280
14831 54280 66575 -1059 -11306 31349 42176 -7825 -14839 3352 -10842 -29011 -23055 2055
14819 2055 6456 20035 389 14086 40887 42850 18636 -27727 -15590 3233 -23946 -58892
14807 -58892 -31100 3547 -17941 -25382 4238 15620 -23804 -41111 -27803 -32134 -57346 -32096
14795 -32096 -1826 24799 4370 6470 10541 -28922 -29043 -27638 3610 61826 57377 50170 75056
14782 75056 82929 49907 46201 63317 66872 59836 82571 71261 69052 31125 3911 -4280 -740
14769 -740 44768 27118 -37323 -26934 17147 6512 44182 86377 109012 76947 36323 -70
14757 -70 -31724 -55982 -2943 45034 54588 73838 80081 40769 39040 30440 8471 29790 24425
14744 24425 3060 -23668 16000 42449 47437 19741 28327 24169 -5093 -20724 -20238 -14504 -11522
14731 -11522 51069 69201 62585 910 -24440 23065 68359 56876 24423 30269 29792 39416 21186
14718 21186 19661 18729 45467 38103 68703 89294 65237 -3933 -10153 -7872 10677 15174 15624
14705 15624 9166 -1037 -7287 50178 70607 47446 -11431 -23992 38937 1355 7298 -5642
14693 -5642 55064 41376 -2877 -9012 -8229 7484 20659 21095 8370 -16747 -9210 -6906 -43765
14680 -43765 -36587 -12260 -11993 -26570 1870 3644 -3427 -3559 -8873 -25495 -10760 11625 38239
14667 38239 37034 43026 34724 2533 -10857 20641 24623 13199 539 32620 55890 39116
14655 39116 32585 32517 38065 -10998 -6514 -17792 -60725 -59899 -33738 -35360 -48642 -16427 -13946 -18801
14641 -18801 -2272 13912 27840 58284 107287 90344 36812 60768 61869 44129 45985 62124
14629 62124 22509 38509 55810 39765 32689 -12685 25991 67908 54470 53714 41130 26053
14617 26053 21076 12744 4617 -7099 -56378 -72470 -37511 -19729 -23727 -13482 -31086 -16882
14605 -16882 6420 4451 -30058 -38483 -26134 -46680 -10931 -10249 -18049 -23946 -17747 -23261 -44560
14592 -44560 -44899 -8954 47173 54723 28565 94553 75206 23974 10473 17060 -2297 -13637
14580 -13637 -24708 10390 -15298 12624 35802 24326 35397 39151 43407 12176 -10414 -24442
14568 -24442 7571 47798 38802 4529 -17176 -628 10644 34810 62237 52435 6339 -38421
14556 -38421 -13790 -18737 -464 9660 -19423 -55400 -36578 -38095 -20013 -29986 -31658 -15844
14544 -15844 29464 49757 25710 -17794 -42621 -10241 12747 -7314 -9982 5541 -16895 -3240
14532 -3240 26266 50815 71673 65345 84105 56857 33488 16784 24671 20151 13285 9896 27648
14519 27648 83823 79407 72602 90497 71191 24149 41901 54212 37141 21709 -769 21184
14507 21184 -37193 -6588 38676 55192 26284 38350 48026 47655 20271 -22 -6365 -16482
14495 -16482 12012 20084 16600 16005 14329 10183 -23364 -52230 -50604 -24010 3572 24736 16838
14482 16838 -17701 -49199 -34922 526 37580 66281 89616 162787 158619 106062 102937 113859
14470 113859 173807 260087 422213 662375 1074133 1598641 1928948 1695130 1223384 864162
14460 864162 610927 455174 367293 269429 187293 195437 211757 214870 178113 118664 121854 172934
14448 172934 190673 134540 109593 93002 75789 39575 76617 61020 38121 51005 46930 50950
14436 50950 67769 82200 74769 124577 122418 63952 46133 53475 56681 39155 30076 16004 19036
14423 19036 13337 -7330 20588 39901 51060 9534 -20382 -19206 -12759 19775 73347 107002
14411 107002 118452 84680 35306 67759 34584 3903 12208 49687 86399 70714 47052 67148
14399 67148 14800 4634 32099 56360 66004 60540 60110 80603 105011 105100 73573 56778 27933
14386 27933 47849 75989 71687 83366 116069 148416 86175 13509 16278 460 2574 3112 2007
14373 2007 35934 78845 59155 62562 58914 56961 60891 94716 106028 87830 47017 35487 69708
14360 69708 107872 138378 145889 134829 132478 76041 -2867 -1780 38246 4923 -6366 -9371
14348 -9371 -7629 54712 75195 77623 78626 62618 57968 61247 71284 74075 48280 56380 32911
14335 32911 -11533 -15277 17445 3215 -16069 7279 16268 23903 23314 45984 82342 43410 29391
14322 29391 70493 86334 97890 58133 47259 46289 49208 9184 32764 52561 31435 40749
14310 40749 3970 -56189 -42504 12122 33008 45262 30670 33248 51434 66742 34942 19422
14298 19422 4134 -6423 15161 54198 56735 41525 33511 90000 82999 72903 66541 83914
14286 83914 131521 126658 168856 177939 129840 35742 -1582 12053 50549 41417 42696 35456 46696
14273 46696 54047 19002 22549 27013 64307 68443 82127 73681 68795 39485 -20779 -17812 -27760
14260 -27760 -31982 -18560 -23103 -30747 -14028 -17226 -6734 24323 8967 11255 32515 59413 67065
14247 67065 68961 79182 104918 134196 119210 107506 160620 203398 271946 313955 345690 329353
14235 329353 285862 233937 176792 78820 59799 73135 51339 23144 4888 18101 -12126
14224 -12126 6548 43519 85783 73505 66246 75124 88485 62371 69849 74319 88324 97389 83349
14211 83349 30166 54780 85724 49562 363 -23925 -10427 67696 75431 80140 82985 43363
14199 43363 48563 19032 10989 30598 43757 93709 79401 58802 62019 76803 84597 78945 85374
14186 85374 108305 80776 51363 22056 38062 21352 64326 88847 89953 65671 16876 67603
14174 67603 140121 166818 155829 141378 153932 136880 150151 158009 94634 85467 91934 98441
14162 98441 98162 58924 1146 -2654 70397 71786 48429 50641 54690 104569 104835 120751 109958
14149 109958 107107 110280 61139 45703 59648 60276 88682 137595 150881 159031 175695 245069
14137 245069 330038 299058 216694 158383 157745 149210 178457 218272 185639 149089 128956 116334
14125 116334 128726 130113 117074 123193 100373 44259 17412 7754 7967 41768 41214 -18665 -146920
14112 -146920 -316192 -446504 -382234 -301493 -206863 -83003 -20307 -2883 34064 117874 175282
14101 175282 187628 175392 162009 170558 187322 221039 220221 148194 113130 125002 133804 146841
14089 146841 170179 207959 234333 221759 203244 228539 241593 266825 281026 280556 258619 229801
14077 229801 246277 220163 194827 206186 191099 236148 260126 251644 248149 198016 176428 208979
14065 208979 243846 272334 306467 256949 241667 251232 272597 325642 360109 299154 248901 237097
14053 237097 286093 336059 335350 367737 369896 380744 393216 388644 421861 443292 385308 377945
14041 377945 399990 434972 450493 517640 579587 582896 604273 626324 654891 658646 641375 664080
14029 664080 683033 740152 788145 825202 875637 900434 899047 919334 932769 996307 1014743 1040220
14017 1040220 1084000 1130506 1222739 1338367 1460808 1537783 1535512 1566604 1715765 1883295 2110707
14006 2110707 2332380 2531084 2672165 2913504 3159803 3522657 4067699 4780354 5652913
13997 5652913 6711629 8028716 9719768 11567288 13304949 15680492 19412860 24832285
13989 24832285 32842868 45516693 66765337 105351289 178836958 294470237 379287052
13982 379287052 344240725 237471826 152956613 103914632 75407639 57708124 45959713
13975 45959713 37903704 32343736 28479721 25930047 24286010 22628349 20599907 18763025
13967 18763025 17311241 15949488 14555614 13052267 11532443 10192774 9095066 8202812
13959 8202812 7413068 6767228 6223706 5701172 5238398 4810655 4431244 4129564 3862764
13950 3862764 3603675 3304262 3004686 2829386 2708758 2546795 2377415 2205618 2048311
13941 2048311 1921263 1815005 1735215 1651406 1558551 1511652 1445612 1391275 1313125 1242991 1124748
13930 1124748 1038264 1012900 1024217 1011782 1013511 991830 894529 885274 891179 802845 746441 702107
13918 702107 636900 585482 501070 483525 466031 472479 488733 472764 444545 424241 393441 394940
13906 394940 402453 365759 361261 331097 329194 299359 329936 345042 329643 308163 278911 199315
13894 199315 192739 167831 160215 174086 199298 197556 197716 188722 168249 159565 145645 98526 115426
13881 115426 112898 61805 70940 69224 85665 126123 148777 150125 142622 114916 103039 152876
13869 152876 203496 126857 55550 59508 70790 49620 48060 83731 72356 138944 261720 426137
13857 426137 592051 707534 761754 711011 565727 387862 295121 249516 190593 186449 154604
13846 154604 128231 111988 120130 110947 83379 67923 66355 94500 96578 48728 18445 -22099
13834 -22099 -11394 19667 2449 -39431 -74823 -92280 -77795 3029 -3956 27132 34201 44932
13822 44932 38603 45209 34708 69996 96906 107704 16832 -28127 -12958 -4202 -16092 -44133
13810 -44133 -16194 45901 23101 -11571 -52853 -66979 -16065 44376 40954 21345 24656 -20112
13798 -20112 -24914 -4363 39341 37853 19990 2470 -41368 -20268 12050 57929 23780 -19922
13786 -19922 1291 28371 61312 85566 69355 79831 41384 -13750 430 28909 39298 78911
13774 78911 74831 51505 57851 61416 48822 26434 33396 35860 12542 -5732 2 2630 30750
13761 30750 30533 45061 20106 43849 50729 31248 5452 -30622 -14410 -26149 -56309 -76141
13749 -76141 -36053 147 22784 -1539 -28523 -49279 -45479 11127 7834 11203 25417 -13544
13737 -13544 -26465 -12892 -24299 -24454 22984 -18472 -69349 -57506 -31278 9945 8114 6963
13725 6963 -9599 2166 23429 -13271 -12986 -5967 15349 11338 1246 5315 22301 35498 42733
13712 42733 49642 77706 120044 94262 61433 32628 17623 62308 79882 72229 32722 17844
13700 17844 -7606 -50002 -54910 -66957 -86989 -79261 -26550 -15049 -20098 -2702 4117 6957 20388
13687 20388 45269 45726 12017 -13873 -35573 -53409 -146 7323 -56259 -41114 -25920 -17596
13675 -17596 1967 47427 74580 48856 21595 -10564 -491 25700 9684 -418 -6246 6904
13663 6904 24219 45844 3128 -12201 -13655 -15302 -15726 -20699 4693 34851 40291 -14989 -15962
13650 -15962 6922 29741 16986 7917 11184 25010 14488 -11315 -19774 -18744 -15013 -11266 -10558
13637 -10558 -13680 2234 29723 1837 12987 23945 29247 9667 -20784 -7445 -22276 9844
13625 9844 17999 6120 4233 27119 -19526 -8965 -63523 -60556 -48715 -27103 -41307 -47497 -43081
13612 -43081 -39807 -3783 26275 26605 -27908 -20807 9344 10615 1035 -20197 -19545 2359 -23630
13599 -23630 -14756 -8728 101 18881 4271 -5121 -19057 7660 18155 25184 24896 21159 16862
13586 16862 -21269 -20807 -505 3896 -1761 8625 7384 16206 28789 32370 7100 30474 57724
13573 57724 47584 -23513 -11833 7655 6062 24389 38644 2734 35746 40688 67272 37818
13561 37818 -8721 -43219 -77213 -60620 -6741 12929 25623 46718 27818 21250 20882 18785
13549 18785 7579 22369 33438 -29892 -69701 -64856 -19383 -27197 -41545 -33993 -29479 -9531
13537 -9531 -9965 -26924 5981 -13845 -12159 -8501 -13619 41203 53271 46421 22065 5836 15341
13524 15341 -19531 -6988 12034 -11704 -19905 36435 39370 52863 25052 41842 72287 47619
13512 47619 17124 -3058 -4172 -2948 38272 76427 124601 86699 29065 75914 156489 218141
13500 218141 293458 461660 691774 1147903 1722128 1990339 1678908 1142758 761393 561055
13490 561055 418487 327773 250014 189340 129550 118202 139829 133603 92567 94205 52090 49371
13478 49371 102160 133037 94388 92266 75828 31807 5648 13056 3894 7568 28588 51799
13466 51799 40372 42229 25904 53368 64121 58800 53440 27121 -14090 -26251 31859 68938
13454 68938 30480 10161 12453 40100 32898 52478 43373 6798 7009 32423 27298 36073 50605
13441 50605 62423 38002 27451 70814 49000 14914 -6984 -11646 -12282 -10231 -17856 -12406 -16951
13428 -16951 -31582 -65153 -38722 -15891 8409 -13052 -20227 27205 44563 32818 -14148 -3482
13416 -3482 45691 21207 18689 40906 9882 -12308 12217 45878 33711 -3386 -52625 -73981
13404 -73981 -61208 -63595 -27711 7778 9135 -4957 -5988 6734 -27343 -39880 -28250 -31610
13392 -31610 3552 10993 31876 67541 19284 40747 55179 51415 19879 54016 57655 30388
13380 30388 -17244 -1222 62444 75870 65293 16 3234 8710 -16028 -46201 -29493 -21521
13368 -21521 290 9091 1589 -14714 -27258 11344 17907 8872 13168 6425 -56490 -87339 -33783
13355 -33783 2720 -32270 -28776 -26793 -33793 -33064 -35689 -27162 -48399 -19665 52207 55349 6112
13342 6112 -31161 -55506 -43199 -6778 -10345 -27746 -28463 -23196 -12709 41179 52802 -20064 -48999
13329 -48999 -23802 17648 40546 16822 21268 24698 45644 43141 -6318 -31865 -81673 -89594
13317 -89594 -72017 -28807 -22034 -33408 -57749 -54881 -4975 16164 5471 -29961 -41849 -51144
13305 -51144 -43216 -5891 1533 14946 -11048 -56252 -58705 -79335 -55466 -22643 -50738 -35315
13293 -35315 -67107 -36867 4540 32061 26514 18295 40459 35993 9608 -27350 -81717 -44697
13281 -44697 -26352 -1417 21192 42216 17766 -18891 -9592 -814 -31550 -39944 -21219 -23739
13269 -23739 -43684 -67048 -57275 -53942 -15586 12942 4384 32257 84078 61968 38160 14562
13257 14562 -36162 -4514 28613 19446 -9634 22281 22006 -21061 -37453 -58879 -48571 -60935
13245 -60935 -89698 -56074 -17495 -21566 -37527 -34063 -17559 -7633 -11655 -9109 -18189 -12151 3855
13232 3855 7818 24946 3953 22748 30691 6602 -17711 -37133 -30037 -7474 27337 107325
13220 107325 142858 121132 85383 31178 -10968 -4336 19021 -17061 -25543 4048 -17978 -13574
13208 -13574 23273 -168 11358 66231 75044 62145 28498 14294 23179 48835 74303 43189
13196 43189 4980 -28813 -31862 -17273 -24267 -15211 30308 12610 -21682 -36508 22577 9798
13184 9798 -14175 -3857 54888 43933 18020 26206 24209 -6515 -8733 -2344 -20220 18513 46418
13171 46418 4891 -56890 -31795 1491 13147 -3626 -33917 26066 51281 58608 70157 87073
13159 87073 94812 61701 14258 -9833 -15828 -2202 -1609 -12039 -12322 -61169 -125006 -126414 -39600
13146 -39600 -3967 -49961 -4355 34542 16208 19135 20169 -1149 -33415 -10925 24242 37261
13134 37261 26802 12270 -7203 -26434 -14111 -20461 -29171 6198 24869 3084 -3535 9926
13122 9926 3499 6693 -28723 -60605 -57439 -69270 -95585 -73735 -89406 -96152 -134910 -132118 -125700
13109 -125700 -118800 -101407 -87514 -97282 -106595 -84751 -72368 -35627 -16781 3870 16188 -13389
13097 -13389 -28827 -31746 -1394 31534 53021 39874 40001 33427 29977 55407 72229 51458 23769
13084 23769 -16080 -24900 -14800 -5319 -23672 -29505 -35542 -65440 -100612 -59950 -2386 -17316
13072 -17316 -31071 -1576 14198 20398 21586 34044 20985 25700 31565 32965 -4738 -27864 -61453
13059 -61453 -2475 37863 82597 77213 45087 40062 90738 126422 157942 151616 119568 130912
13047 130912 130095 108865 92605 121676 152847 141704 97553 35700 13574 -6953 28279 16853
13035 16853 33143 74949 63836 45097 12657 24923 30741 15312 3236 -34201 -62194 8150
13023 8150 41974 88713 78692 35588 45451 65496 35450 7196 -1589 2546 32954 71232
13011 71232 67316 45914 52723 56445 35193 53191 64368 20756 44628 77794 83385 68690
12999 68690 54502 61475 60214 20308 7013 7304 -10442 -25653 -55261 -69170 -51973 -31553
12987 -31553 -22862 -40953 -54062 -38437 -12556 -4664 29422 20934 8379 7629 4039 -6628 -22513
12974 -22513 -37626 -31284 -46302 -61166 -50931 -15971 -18969 3044 -50149 -96188 -60629 -37427
12962 -37427 -17084 -15257 -12728 -13528 -63376 -48329 10767 27571 10367 27881 45870 43736 13653
12949 13653 -1671 -48202 -17932 19220 40197 14396 -43496 -69505 -68064 -74578 -11732 30783
12937 30783 8933 -14977 -30025 -19489 -52076 -49019 -25820 -25688 -40734 -25164 -17909 -25386 13277
12924 13277 24476 -10258 -6383 18848 27397 47859 38987 -5025 -37588 -27307 -17359 -16167 -838
12911 -838 8276 -17626 -24396 -3613 20417 44177 49133 67606 31340 20603 -32054 -7646 -27299
12898 -27299 -72118 -73167 -37617 39086 55963 21108 19500 37716 31900 2149 -65814 -63166
12886 -63166 -4045 4362 -20540 -41345 -25520 -21086 -48850 -31322 -59571 -41767 -21565 -22177
12874 -22177 -46112 -76903 -86960 -68072 -29863 2926 -30904 -30678 27872 54124 48885 23925
12862 23925 33325 31878 13943 -45031 -95372 -54021 -7378 1237 9179 -12651 -56097 -78761
12850 -78761 -51696 -10682 31419 14502 317 24038 5549 -12183 -3105 40882 46435 44105
12838 44105 46080 -16152 -54149 -74114 -105169 -55920 -27396 -37017 -56930 -54282 -813 19005
12826 19005 36104 24959 -26917 -101592 -131783 -77984 -54818 -71115 -98089 -126408 -56194 -32120
12814 -32120 -34252 -22984 -9656 -40411 -59276 -67340 -39737 -25824 -28158 -6817 12322 42877
12802 42877 37895 49536 70355 83084 36132 -42494 -79271 -57213 -36171 -1074 44120 18182
12790 18182 2554 11349 32766 12003 -24490 14549 22852 641 -35348 8061 60709 34596
12778 34596 -16256 -37594 -29547 -10230 -5445 -14762 12448 -16515 -15534 -15477 3033 -19545 -38429
12765 -38429 -35741 -43115 -16333 -27623 -31822 -1367 -21035 -42218 -61601 -39382 -20010 -17631
12753 -17631 -37012 -35998 -32337 -48305 -74666 -105874 -95333 -75147 -60879 -51219 -43563 192
12741 192 -856 -52290 -29932 -15279 -57378 -57871 -3879 -21093 -55788 -4867 21127 1151 -37782
12728 -37782 -11153 -12226 -28547 5015 476 -26035 -20605 27373 33253 24388 12184 -8297 9265
12715 9265 28803 33402 -21092 -61169 -71481 -50275 -11461 52295 74634 31327 -14576 -18290
12703 -18290 31795 86799 25336 -4052 -20218 19762 38549 48999 29210 51622 32390 -596
12691 -596 -30567 1745 29534 32792 46797 52756 23641 -28851 -3869 2667 43981 16341 -33999
12678 -33999 -9406 -46899 -52973 -65255 -44590 -16912 -1277 26846 40600 13854 1252 -3585
12666 -3585 -7137 -11442 -22237 -4143 -4942 -18080 -45531 -38015 -13874 -27203 -22521 -29791 894
12653 894 -36633 -53017 -3435 26780 52623 45705 11469 -24644 -29416 -3600 -28949 -38537 -61189
12640 -61189 -81820 -69307 -38363 -37403 -71355 -66040 -20045 -34166 -91941 -83863 -64862 -50304
12628 -50304 -33309 -25325 -38375 2005 15775 12477 -9512 20360 29844 26525 8852 -37095
12616 -37095 -81054 -107662 -113351 -80223 -61115 -28171 -18630 -27278 -14711 7515 16603 -25152
12604 -25152 -49537 -26448 -8499 -29534 -13500 11159 -6661 -6140 -27873 -32826 -26345 -42894
12592 -42894 -39456 -31669 -21203 22922 49512 10953 -21973 -35528 16426 22337 9980 -24515
12580 -24515 -76124 -48352 -18007 9905 36608 16861 7356 31885 -4838 -47500 -35685 -6718
12568 -6718 9496 26821 23264 16148 -29856 -3166 42563 13180 45084 77569 30790 -8589
12556 -8589 5947 11780 16655 11956 4301 -17267 -18677 -25813 -44457 -15608 34841 45301 48564
12543 48564 45655 21766 6740 -28127 -51013 -16799 -9244 -2908 27300 26893 23242 48315 80896
12530 80896 114424 140817 190295 176554 210459 198646 132136 93864 61035 67005 73019 38872
12518 38872 11511 -1439 -7709 1483 4270 31469 21181 27019 5338 2586 26320 17993 -41341
12505 -41341 -79797 -57723 -47538 -63864 -90222 6199 43689 50333 30691 4230 -32954 -62718
12493 -62718 -4030 67424 85355 84159 58222 53101 48815 24034 13696 17101 3732 -39656
12481 -39656 -76133 -39829 -26560 -36038 -1989 27673 19157 -16792 -50685 -32934 -10145 -31347
12469 -31347 -26072 -51170 -16888 -17710 -18210 -31033 -32522 -27153 -8817 -3684 -1889 15059 15261 6621
12455 6621 14065 -16653 -26799 -27375 -15901 -18063 -22682 -49816 -63529 -55190 -38953 -38066 17208
12442 17208 52793 59339 50894 9857 16041 -7600 -11161 13707 33471 15443 -6661 -26088
12430 -26088 -8420 -695 -14856 -44573 -62778 -85953 -92695 -69761 -54544 -28957 -6743 9304
12418 9304 26985 -14497 -62649 -23775 60346 55751 14999 -8703 -31300 -40271 11792 54535
12406 54535 74150 31666 -7941 -7902 -49441 -63721 -58990 -81176 -61967 -49222 -48343 -7224 19390
12393 19390 15052 1490 -4358 -15904 6407 39786 43482 26483 6859 53133 75229 47655
12381 47655 25398 23078 3004 -13918 -29158 -20630 -45165 -5794 -24941 -73426 -61132 -34655
12369 -34655 -6800 25160 -7499 -46517 -65454 -32735 11894 6385 -20291 -27548 19012 49685
12357 49685 19875 5675 8726 -579 37854 37477 -352 14135 21168 5130 36692 50118 9263
12344 9263 -18249 -10034 1912 -23307 -33394 -45679 -39379 -18391 -19929 -3419 20139 14399 10223
12331 10223 -9039 -22868 -21372 3413 -719 -27043 -29254 -63154 -68632 -35348 -7987 37000
12319 37000 76250 73130 27761 -15724 -24213 -46915 -108561 -137752 -95076 -78417 -47746 -68203
12307 -68203 -85566 -29038 14067 -8134 -12667 3381 -30994 -25660 1425 -10196 -4737 -7354
12295 -7354 7710 36202 71086 45969 -8939 -14165 6473 39764 41782 15098 50383 14832
12283 14832 -24567 -47864 -53824 -13148 -26469 -35609 -25089 625 34075 35486 48716 92683
12271 92683 78288 14166 -53441 -60320 -35849 -23708 10956 15611 13659 4386 -1060 16439 34351
12258 34351 13046 -9305 2079 -12065 -11421 5861 99 13097 40158 -12525 -50765 -76307
12246 -76307 -53545 -39739 -10650 10125 28450 40173 -13054 -40965 2005 3881 -16790 -34884
12234 -34884 -26205 -31705 -9549 57747 12755 19080 59997 -6468 -12058 19021 25881 -1624 -982
12221 -982 2369 5528 27207 -5831 974 -30535 -33867 -9817 37012 62344 94410 95204 44808
12208 44808 7669 -36400 -50706 -20908 -27373 4753 1857 -2097 -6447 26093 63437 38212
12196 38212 35092 49972 40917 28986 -6945 -54076 -80114 -71464 38301 64167 24765 25942
12184 25942 -27048 -16854 -7337 -40642 -36887 -26656 -16451 27573 32052 33576 11762 -28734
12172 -28734 -23492 -5878 -12135 -39416 -990 14360 5178 -12494 -9868 23906 17379 -25938 -44658
12159 -44658 -64868 -73130 -45818 -10400 -19494 14382 83880 81543 25537 -12731 972 5109
12147 5109 -28820 -30673 -116 -23496 -41534 -24407 -8117 8400 -12470 9909 21227 -8403
12135 -8403 21524 -2621 -36745 -95906 -153569 -103220 -68120 -73385 -95159 -109414 -78687 -57837
12123 -57837 -88765 -83804 -70214 -41301 -30543 -36581 -1193 49862 58096 6618 -23025 -13730
12111 -13730 14702 25969 41120 82837 69639 42262 28840 35152 27071 45094 66296 11721
12099 11721 -40890 -49914 -32231 -27202 -39549 -4796 2952 -40989 -25255 -7799 -21102 -42504
12087 -42504 -14581 -33795 -81607 -51683 -24654 -42813 -42931 -39773 -41380 -47354 -35157 -10159 32211
12074 32211 16883 14061 4744 -9024 36209 40255 18154 34274 26350 11538 51391 39306
12062 39306 46804 8045 -44331 -34859 2275 -6390 -23740 -19979 -9275 -34879 -55502 -54336 -24343
12049 -24343 -1172 27065 46268 30327 8989 2502 -22005 20213 43228 27753 52807 54925
12037 54925 -1823 -35326 -47210 -46538 -35895 -2145 27566 33704 36926 32281 -5709 -48459 -49912
12024 -49912 -25372 -6135 18538 26029 44447 46131 15840 40466 57228 49389 58522 17098
12012 17098 -16275 -19021 -42687 -42172 -12106 745 6701 17473 1928 2185 -669 -12636 342
11999 342 28345 64706 66067 -15378 -51779 -27556 -34436 -41352 -45318 -19745 66973 93894 72798
11986 72798 55544 37503 19939 -10565 -34224 -39975 -65177 -46601 -37461 -20219 -28235 -3877
11974 -3877 -24266 -50824 -15257 7191 24271 38445 42633 11084 -7049 -39309 -55457 2758
11962 2758 50714 49098 10156 9728 6674 3224 -3636 -643 12767 14851 40492 44477 10066 14951
11948 14951 28311 2346 1604 10593 23352 31071 19790 29527 45011 3068 16540 30969 24811
11935 24811 4363 9735 25442 64364 47415 31898 35021 42053 37621 36631 -36608 -55930 -63574
11922 -63574 -61186 -64570 -48813 -17776 -24486 2979 43991 33272 66972 50373 10140 8116
11910 8116 -3450 5902 -39283 -82316 -45424 -3235 42474 14878 4675 -11894 -6227 -13219
11898 -13219 3650 49790 46240 39703 34906 8091 -46807 -31644 -31540 -58996 -25425 -4592 -56134
11885 -56134 -86443 -94040 -91124 -101057 -85216 -25592 -1887 -27238 -72595 -93869 -43032 10529
11873 10529 3751 7520 -8375 1508 17565 41175 -16284 -39094 -67091 -78986 -46875 6141
11861 6141 31759 22373 31451 33588 -14808 -28704 -7457 21609 -1246 -7363 -12523 -32804 -27783
11848 -27783 -6410 -8317 -49164 -65840 -71005 -37249 -35930 -41148 -33431 -15659 -23792 3505 24670
11835 24670 -10285 -7300 -15257 -37169 -31255 -14130 2454 24187 19905 -16381 -24669 30086 44965
11822 44965 43469 55328 81780 65953 47527 50611 20591 -2151 1630 16225 23611 63559
11810 63559 102094 155152 171868 67005 -6439 -5141 13990 75368 50588 11912 8126 6606
11798 6606 10561 471 4896 702 -8644 17536 4360 -5458 -29672 -39765 -49128 -66128 -101507
11785 -101507 -72118 -23193 6557 28223 58825 29099 21817 -672 34392 -9291 -58304 -33284
11773 -33284 -5607 36066 47492 57878 71295 58638 3685 -71193 -83681 -61587 -63597 -19488
11761 -19488 15720 425 -28282 -11799 -17670 -10234 -5251 4498 -20737 -15181 -21928 1317 41477
11748 41477 65976 67478 45084 -12847 -77690 -97652 -70946 -9656 -10367 -38359 -73958 -54684
11736 -54684 -36662 -47208 -45328 30099 42147 37101 32097 18643 16891 9870 35032 23788 34329
11723 34329 30551 -33057 -48973 -43651 -7172 -4885 33236 16754 23355 7593 -25624 -17868 8704
11710 8704 13134 18798 45288 14987 12207 27491 32788 44140 34893 18181 -6247 -29422 -63702
11697 -63702 -52455 -13518 16637 -10988 -14156 -36136 -56646 -28404 -9467 -1620 -215 -13516
11685 -13516 17007 88975 98507 54316 -8685 16023 14621 12893 4931 -3826 -235 3453 -8046
11672 -8046 -4941 32780 42621 20146 -20099 31212 67567 71115 15110 -27313 -30019 -24886 -36707
11659 -36707 -35354 5603 32462 59899 28688 33242 51235 34132 1785 -29383 -32578 6400
11647 6400 16250 11598 61172 70939 62506 64671 40994 14220 39569 50887 52203 16479 24099
11634 24099 33174 -28217 -27898 -50736 -49035 -16326 31668 6619 -41340 -57006 -37489 -3088
11622 -3088 25822 16783 26962 47267 7733 -1049 -2881 -37974 -77579 -100451 -74431 21921
11610 21921 67430 57022 57826 46222 46050 27444 37094 48006 53127 73101 34467 56466 60355
11597 60355 60011 82922 59509 62015 78828 85734 125165 93379 77434 37017 44868 58526 17656
11584 17656 30807 162 -26557 -24706 -42973 -57219 -37171 29378 63923 14290 -38397 -34948
11572 -34948 -9034 25064 52380 38693 -9530 -21194 1096 -47981 -45948 1661 526 -24153
11560 -24153 -40427 -28770 3880 -13718 -10551 -31073 -6895 3851 -30543 -23291 -14164 -13967 -31345
11547 -31345 -30868 21264 18928 -2098 11700 21680 -2496 -14137 15899 41187 58474 -2623
11535 -2623 -4394 7752 -17680 -68400 -82417 -59466 -65380 -60982 -65624 -37016 -19929 -15428 6095
11522 6095 -21428 -27311 -5732 -18797 -25247 -7283 -33959 -80937 -84123 -67623 -42368 18315
11510 18315 51786 30005 18896 -9299 1475 38530 22042 35673 97224 81235 31669 47541
11498 47541 42099 43295 9155 -6135 -1655 -61028 -94897 -77009 -59485 -13992 22710 8539
11486 8539 -26925 -2909 28796 -28198 -33220 -28487 -57653 -72276 -8460 40078 67247 83717
11474 83717 69881 53525 36872 2427 -40403 -12044 14843 11987 -37585 -54118 -40634 -48824
11462 -48824 -45753 -16921 36263 66647 38604 10495 7142 -3927 -11453 -29781 34538 43065
11450 43065 -17985 -3117 -10103 -8688 5299 14395 2935 5249 30171 47919 40842 28475 8061
11437 8061 41868 64539 44814 37376 32565 24471 25927 7956 30895 49258 38284 -28583 -86251
11424 -86251 -70434 -41709 -34423 -55109 -57315 -33768 -39965 -57081 -57563 -39712 -33400 27101 37842
11411 37842 -38097 -54910 -28180 1561 -2864 -5793 -34359 -22566 16047 -22184 -5279 -18166
11399 -18166 -21439 -47440 -40230 -24361 -50843 -58917 -39795 -26402 -1427 29279 32681 4042
11387 4042 -650 -1592 3875 -3519 10844 58644 66024 24637 25483 56053 63918 82365 131270 139671
11373 139671 48167 -16990 -42623 -48922 -47880 -71932 -21209 -24367 -586 43885 17195 5224
11361 5224 -12096 -37710 -12975 27552 34251 -3377 -54587 -32490 -146 33742 31314 22865
11349 22865 866 -20638 -24603 -45905 -53570 -96674 -86312 -78888 -41856 -2851 57383 40178
11337 40178 11521 -24195 -24061 -9659 -18647 2468 20685 -12883 -45253 -15295 10084 16519
11325 16519 -807 -47 63773 105262 120246 57766 -3829 11426 51659 24278 -34836 -25477
11313 -25477 -16452 -6944 37696 74642 88600 90975 72791 49952 868 -2823 -21662 -74072
11301 -74072 -81487 -67563 -26799 7261 -28606 -57411 -54853 -60377 -74495 -68962 -66312 -46004 -56758
11288 -56758 -75303 -61659 -58401 -39847 2918 29889 41016 -1949 1516 -7813 -6425 9233
11276 9233 27898 11023 10709 -28237 -47163 -65458 -62539 -75498 -52046 -29763 -23926 -32747 -17197
11263 -17197 -22224 -34158 -33399 -65154 -90165 -95600 -68638 -71439 -83629 -93360 -87203 -82140 -61117
11250 -61117 -20924 -3720 -1075 2146 26213 37337 42122 45378 69886 65556 81746 87777 72514
11237 72514 62002 22970 -3618 -13480 -5816 33311 39456 23274 -23235 -85322 -74655 -48633
11225 -48633 -61774 -48577 -5173 34099 71599 54383 -3670 -1035 14587 38967 18490 1220
11213 1220 -1834 -27713 -59681 12549 42334 12605 4452 38878 26523 8756 -51276 -24956
11201 -24956 -43308 -70592 -84866 -38057 -19599 -42014 -50447 -44789 -26196 -13497 6925 -31860
11189 -31860 5321 39661 36921 3324 -9087 12605 38068 20639 39635 -5765 -28265 -57786
11177 -57786 -44311 -27245 -1625 -27929 10115 12628 -43313 -37333 -67665 -110805 -73278 -43000
11165 -43000 -30760 -54236 -72509 -714 29605 7806 7150 2334 13212 -2997 -22178 26412
11153 26412 63598 90820 86931 85413 67554 7443 -50849 -49449 -22340 -21564 -20109 15417 78861
11140 78861 126254 107107 62388 45880 53274 44007 9576 -39227 -32198 35882 73259 64993
11128 64993 54571 52934 19922 -29844 -20220 271 29645 3752 -10324 22958 20365 -3987
11116 -3987 2664 7761 28601 43491 43276 -10705 -67037 -82799 -46310 -51143 -65239 -50215 -56965
11103 -56965 -8593 11959 15454 24935 53675 43310 -24180 -37863 -1524 35134 44481 41134
11091 41134 42065 6708 -18095 6512 4617 12107 28772 6757 5752 51694 45469 32062 25142
11078 25142 32992 28126 25862 4577 7929 46282 73643 40533 29915 6956 3919 -23316 -35325
11065 -35325 -17230 11027 13648 43963 -27456 -102720 -44246 11262 4538 15532 19826 26522
11053 26522 66195 77163 22360 -8652 -14651 -18059 -17616 -10581 27975 13982 -16267 -37791 -42003
11040 -42003 -19787 8265 31967 27470 17071 -43367 -83444 -85331 -37282 -13124 -7682 -2202
11028 -2202 1527 10004 22490 8180 -10192 -13891 -8213 -29423 -14004 -21181 -19284 -1254 -6458
11015 -6458 21658 43697 16522 -16565 -43156 -15262 7096 1714 16125 -2050 -34437 -27113
11003 -27113 -1459 -8664 -76943 -95768 -39133 -22562 -8019 26379 44864 11377 -27901 -27346
10991 -27346 15501 17820 6940 -20370 -33580 -37815 -31468 9 20004 20405 18503 -7643 -22766
10978 -22766 -69196 -64517 -11735 14810 -19833 -49046 -52277 -30475 -27355 -44836 -47495 -3759
10966 -3759 27805 -1241 -391 23370 32781 26653 19981 5398 31136 34682 24049 19427 10187
10953 10187 -54541 -65500 -32850 17723 31355 25234 -47113 -63113 -28676 -47873 -47565 -26539
10941 -26539 -58276 -40742 -44931 -18998 -4723 26806 32779 1585 -27247 -5299 -6907 2367
10929 2367 57141 37401 -15525 -57905 -58386 -34420 -29797 -32466 -47963 -59365 -15997 14377 4811
10916 4811 2907 8630 4134 -9754 26095 27988 -11701 -59493 -72458 -84543 -114816 -66640 -14003
10903 -14003 -18617 -20205 -23975 -17350 2856 -12171 -33273 -37208 -52010 -33903 -27627 5463 8761
10890 8761 15013 15728 56418 12642 -26447 -8181 7148 21440 33080 35267 39049 25809 44169
10877 44169 27972 1265 44278 66383 43184 -2436 -1387 50849 64553 45326 60152 60867
10865 60867 33288 50448 78558 82935 81735 74158 47197 18902 15037 27531 66977 56493
10853 56493 19513 -47058 -9365 9708 25441 -1263 -23682 -34695 -70618 -81505 -37968 -18232
10841 -18232 -30252 -15373 -9954 -20292 -16355 -18024 -36295 -29332 -25325 5416 -6107 -14233 -17994
10828 -17994 -13332 -6325 43531 88593 66522 40038 70029 93918 148611 96151 23552 -26191
10816 -26191 -87290 -95540 -63859 -45753 -22041 30495 68560 96415 99055 82470 90878 76816
10804 76816 154199 315791 527286 552839 409987 266873 156973 66219 53757 -19918 -70710
10793 -70710 -40183 7353 44659 27795 39035 8940 -6461 9610 31673 27594 -34510 -50922
10781 -50922 -83 57373 58286 12168 3001 31209 36157 -26931 -15878 25706 44346 39511 7436
10768 7436 55525 116193 81954 52348 31734 18614 -4911 -24573 -25214 -16705 1193 25328
10756 25328 45474 80377 78800 14689 -31678 1296 -26412 -37605 -30458 -37082 -12960 512
10744 512 2805 -29428 -67191 -31666 -80 -60909 -74720 -65362 -45469 -20977 13187 -14052
10732 -14052 -9118 -2913 -32875 -42574 -70475 -28921 31653 20692 -19894 -57882 -52381 -64030
10720 -64030 -70236 -41771 -35954 -4090 -25132 -54348 -14034 52274 31911 -11866 -19370 15478
10708 15478 21970 -2790 -31348 -39256 2553 23314 11834 69284 103917 75018 38290 -4149
10696 -4149 -55816 -63691 -72632 -62228 -54405 -61683 -45665 -1564 11170 -6850 -2392 2638 -6945
10683 -6945 -60368 -57183 -40180 -59975 -35702 23195 47205 40775 11241 -10956 17145 38742
10671 38742 5100 -29316 -18389 7914 37001 11187 -60820 -96194 -79297 -56159 -39676 757
10659 757 8924 28083 65841 85761 68527 83186 78812 53574 1924 -31331 -4752 12405
10647 12405 23535 50391 88201 49705 44870 57038 55505 36890 8740 28534 88344 86622
10635 86622 78793 55800 -6401 -1145 49038 27148 5531 -50450 -75215 -57667 -60016 -33554
10623 -33554 -45547 -32783 -18763 -6167 -17360 -40486 -41795 -51430 -56550 -31361 -34639 -58646
10611 -58646 -25194 -14989 -11991 13876 7011 50328 81153 81267 86616 40587 31354 42905 39771
10598 39771 -2157 -48020 -99003 -96328 -77488 -86335 -68830 -35517 -23881 -41966 -56501 -58089
10586 -58089 -98474 -63763 -14725 -15700 -38732 -67936 -32079 -14071 -30905 1727 -23729 -40673
10574 -40673 -15226 12576 36203 10975 -10668 35927 60205 28674 -30834 -35431 -9747 -42247
10562 -42247 -8926 -12939 -24494 -65694 -54133 -25545 33917 37614 9605 -17267 -57344 -68161
10550 -68161 -83074 -61127 -20574 8278 -1392 -4709 -4156 -13567 1664 35014 65521 77084 73269
10537 73269 34226 26791 28653 33253 7111 -14834 -1171 15580 19006 12991 -31174 -23906 2078
10524 2078 1765 -26606 -33308 -44783 -53891 -26574 7750 34185 16568 14416 -1196 2884 17775
10511 17775 28151 29895 792 34767 33262 31900 56666 51671 10791 -33694 -58589 -69339
10499 -69339 -67737 -69527 -39028 -14586 9959 -2738 -55101 -63350 -62231 -11879 15685 3086
10487 3086 11144 -19779 -51459 -38143 21192 -8892 15445 36101 22328 15097 3814 1692
10475 1692 908 41708 3050 -17804 24280 32508 39354 35677 9556 -2403 -16746 -26713 -17507
10462 -17507 -46033 -50141 -28270 -49295 -41401 -62400 -80965 -104655 -95492 -81890 -62604 -84336
10450 -84336 -88979 -67089 -9102 892 10092 -45889 -77355 -36104 -792 5906 -11727 14827
10438 14827 62335 2899 -50619 -74957 -76937 -81344 -96499 -31615 -2624 521 -12323 -17709
10426 -17709 -2332 -26474 -51667 -43046 -68505 -70084 -24717 2434 35062 64944 27656 -13590
10414 -13590 -20476 5920 -17226 -8475 -20770 -10229 2092 -511 -1272 4381 -1564 11328 9399
10401 9399 8197 14595 19538 -25646 -30486 -10216 22817 2977 -20784 -3197 12374 23008 22068
10388 22068 23009 9701 29078 12806 -9505 -3892 -7445 28702 32847 15511 -14097 -21298 8380
10375 8380 32934 4389 14307 54003 42581 25498 24192 26956 9130 16064 -23518 -93981 -118898
10362 -118898 -95927 -73241 -38074 -15048 -12479 -24275 -60642 -78841 -59189 -63186 -28090 -43022
10350 -43022 -58531 -52487 -51648 -78472 -107910 -64311 -73553 -85710 -76778 -9805 26067 35458 -5795
10337 -5795 -35315 -91638 -104633 -62244 -11329 6963 -11107 -14428 -23729 -30733 -18122 -26591 -33412
10324 -33412 -13534 -15752 -22994 -42443 -36788 -64053 -72571 -67469 -36944 6609 23141 47493 75418
10311 75418 21077 8043 79058 64879 20606 9792 -357 14774 26425 -31119 -76209 -57455
10299 -57455 -33721 -4176 -69394 -71803 -14206 26974 1366 -24850 -17629 -55417 -95131 -122634
10287 -122634 -113436 -89073 -24821 19881 28565 -2078 6379 34661 3191 -8339 10567 2273
10275 2273 -5851 20687 97618 101851 63043 54233 64707 40163 30212 25788 -392 -45340 23235
10262 23235 13636 -32987 645 11473 -12967 3091 8237 -6009 -33397 -50602 -8431 46380
10250 46380 15786 -38850 -40306 -38415 -39869 1879 28262 28698 19303 43674 78088 31706 -11978
10237 -11978 -12474 -34310 -47939 -6786 34317 3720 -15450 -5651 -13632 3526 13431 17387 55402
10224 55402 41822 -12349 -20639 -21075 -15220 -35435 -10907 -5168 19038 26278 -31696 -38389 -32104
10211 -32104 -59634 -45569 -26601 -57029 -79059 -85251 -69943 -27177 -660 -24036 -62243 -60692
10199 -60692 -43924 -57905 -74106 -48361 -2307 -15575 -11618 -39730 -53971 -87900 -101118 -85536
10187 -85536 -65702 -60644 -51531 10790 23499 22906 23241 750 -29511 -12277 31064 29308 -5118
10174 -5118 -8729 -6808 -31649 -2679 30172 14512 38876 7111 -16818 9696 5646 -23092
10162 -23092 -44125 -38669 -3288 -2829 -29332 -53343 -17833 -6372 -14854 -25332 -15446 31984 63482
10149 63482 78741 116840 95776 24657 -36347 -24722 23144 74397 35788 -34425 -43770 -1112
10137 -1112 12124 15658 -4186 5409 39276 102380 77358 48328 30602 10686 -4018 4097
10125 4097 35330 46560 41575 1562 -42450 -10168 -3047 -1366 -28773 -45511 -993 49503
10113 49503 54979 5613 -4245 -38414 -15289 14675 -6994 -29552 -15776 -10171 52441 113918
10101 113918 134531 85358 30203 -18587 -23757 -11540 18145 20290 11303 -21221 -40595 -48595
10089 -48595 -38258 -24149 -16405 -4936 -743 8266 8743 4016 -3176 -23948 -42860 -56500 -110977
10076 -110977 -117484 -81461 -17959 41254 42946 15111 -30107 -40308 -51533 -52976 -53191 -74030
10064 -74030 -29979 -1035 23911 -984 -2039 49157 61333 28444 -14193 -20003 -9616 40017
10052 40017 36295 58345 69713 53041 -5204 -28921 -23799 -53547 -112435 -127588 -54660 -10162
10040 -10162 -3558 -13609 -14865 20642 56888 12217 10399 27062 -1933 -23988 -1965 2465
10028 2465 -13467 -31570 -45289 -10612 -2278 -7695 34711 48115 55434 90887 60204 2941
10016 2941 -32469 -55263 -60006 -91187 -112640 -64775 -11497 9679 -5726 1289 -36034 -46578
10004 -46578 2245 40827 55655 29506 32891 -14364 -52368 -8247 16359 1383 4934 -54292
9992 -54292 -69593 -16134 -29461 -95857 -61140 -35142 -59289 -54540 -57734 -65426 -62139 -86380 -53325
9979 -53325 -43163 -74455 -77206 -58798 -35472 -10407 13449 -12932 7803 5870 694 -7419 -29374
9966 -29374 -30635 -37311 -6969 -5804 33251 49761 39497 64227 52274 -10749 -6408 -2848 541
9953 541 58790 55775 3739 -42450 -14155 45173 46047 41622 20493 -31010 -70251 -64187 -63078
9940 -63078 -67381 -51204 -24152 -57883 -63579 -70212 -43407 -2537 11920 16285 18030 -20362 -24045
9927 -24045 -3756 31335 25233 1180 -2495 -63795 -83796 -58006 6910 59291 33850 -19464
9915 -19464 -27763 1345 7251 -12818 -33184 -14778 -28731 -6541 30731 33487 55595 31210
9903 31210 29183 55533 31576 -43134 -55357 13834 -3475 -22184 19065 79455 78492 31921
9891 31921 7163 -16062 -41535 -33166 -47646 -40889 -34635 -8527 26036 41727 14897 4805
9879 4805 12051 1319 29974 29778 42673 51645 65539 74187 66681 61588 40983 26667 44543
9866 44543 40310 78573 99605 119531 119954 99171 54348 2609 -19141 21636 84939 75075 384
9853 384 -17549 -29420 -39077 -48363 -23062 16719 44122 37136 14854 27453 64617 72679 82269
9840 82269 64229 14283 -14700 -28040 -22322 -18025 31318 29938 -753 3619 12725 21253 21434
9827 21434 -924 -45434 -42042 -23663 -45626 -55881 13911 14282 -17047 -26865 -31295 -34321 -26592
9814 -26592 -25711 10097 14212 12583 67741 62298 71378 66355 57317 28874 47177 73629 71260 41253
9800 41253 18314 5549 113 -2866 -12745 -47384 -53826 -49562 -38094 -28436 -30504 -6468 25776
9787 25776 13355 -21489 -2932 18898 -29780 1510 41960 16492 17510 6721 40276 37645
9775 37645 43259 46640 34108 17194 -46319 -46031 23086 60133 45554 41911 50268 -4080 -38300
9762 -38300 -74903 -72199 -37464 -9864 -4379 11931 24020 34 -32404 -47109 -31100 23645
9750 23645 5012 -13719 -35723 -56351 -75652 -110929 -74595 -49656 -41102 -59116 -50525 -10040
9738 -10040 -4401 12870 21244 12278 15120 10053 739 -4631 18768 19111 12492 -13343 -4862 4571
9724 4571 9031 -41515 -71106 -87251 -22686 3852 20363 35650 15935 -4247 5679 12598 -3314
9711 -3314 -25534 -13249 17316 21985 -46971 -32523 23247 10212 20861 -10422 -61003 -61198 -38131
9698 -38131 -26024 -35755 -66414 -32933 -6466 -11997 -55884 -60774 -10325 7289 10485 53078 32612
9685 32612 -15354 -62883 -8065 28390 33751 18635 -14882 -59049 -32614 -2988 16489 9163
9673 9163 -6234 41203 49055 5656 -38194 -67520 -52870 -36403 -29793 -70902 -90728 -83434 -63167
9660 -63167 -50631 -40552 -23689 10408 57661 52046 41919 62047 50401 24143 38360 19066
9648 19066 14962 14060 7603 -7376 -24329 -44056 -81435 -42009 -33516 -48382 -36685 -92881 -76270
9635 -76270 -17002 10667 -13466 -49747 -53549 -48021 -39836 -20081 -48617 -68926 -12480 24786
9623 24786 15543 11995 30498 -11093 -18167 21286 53190 60036 5256 -33934 613 66894 63059
9610 63059 35215 50120 58171 15791 -17386 -24286 -22039 -19900 9610 -11422 -28602 -33104 -24963
9597 -24963 8776 9625 754 3635 -20626 -58317 -59719 -71726 -110273 -116508 -91082 -50621 -30683
9584 -30683 -15629 -16836 -3899 -7109 -3782 24765 -5877 -27477 28004 70068 29963 -39568
9572 -39568 -79318 -59491 -21851 8265 55780 70617 38403 58499 78554 50532 -6241 2117
9560 2117 11533 2268 -15402 -9499 15668 31819 60735 42634 5274 -16289 -25626 -26819 -49220
9547 -49220 -14026 24986 6352 11535 5134 -32742 -42892 -10929 -19356 -15568 -25918 -61530 -31738
9534 -31738 -17892 -43530 -4948 885 -10234 942 -10488 22275 44488 16708 -4558 12537
9522 12537 9434 5506 -17067 -9002 25602 2079 18345 -3489 -35583 -43100 21384 -23969 -36923
9509 -36923 -37175 1265 4105 -9289 22704 17041 31 -21699 24859 42069 45832 10101 -37365
9496 -37365 -52829 -24183 -9767 20000 53626 18314 -27770 -23921 -80763 -94498 -74788 -74562
9484 -74562 -58485 -16721 -11196 21073 31536 30498 53172 61998 64772 24154 16209 9671 5050
9471 5050 -13804 -41532 -50666 -5755 38063 22859 7406 6512 -1693 29009 28629 21704 7654
9458 7654 32790 25495 32644 20612 49993 14762 -2389 5095 -3734 3495 10003 46575 41188
9445 41188 12102 11922 27567 35533 27100 -35942 -46747 -24457 23014 -2222 6018 34999 22624
9432 22624 3768 -41883 -81852 -110199 -102248 -75276 -68473 -44073 -29857 -56777 -88544 -71283
9420 -71283 -40844 -9948 -28478 4133 38848 47923 32050 -14841 -23024 -5008 -834 3491 16205
9407 16205 39234 33642 62249 86266 111505 60469 41342 48731 55429 13423 6597 47795 53730
9394 53730 9051 -23491 -17695 3925 -52156 -60030 -41260 -28991 -37272 9422 36890 51687
9382 51687 44846 32425 30199 31967 6771 9060 -6218 -26313 -29848 -17854 7302 46149 65680
9369 65680 68148 15567 17591 31489 29634 -1270 22862 -1083 -7381 -19654 -14824 7975 15189
9356 15189 28943 37721 33695 -41308 -70087 -56041 -31922 -33754 -23856 -15173 5513 41066 52524
9343 52524 23122 48354 90256 79659 76521 50417 31385 51280 46931 -6211 -19032 19794
9331 19794 34207 14511 36297 38588 30948 50755 47736 -3901 -44437 -65503 -30575 -16682
9319 -16682 -12824 -42203 -53413 -36243 -31597 -3633 22833 43176 -23151 -39524 19247 62318
9307 62318 22416 -4322 -42549 -63107 -18352 -12253 -8405 -10581 -65917 -81513 -88240 -71023 -87737
9294 -87737 -85188 -47426 60831 74971 25598 11559 -6710 -25274 -47504 -49755 -46223 -18163
9282 -18163 4553 14630 32726 -4420 -67645 -45984 -37993 -18314 -13876 5396 18153 -16350
9270 -16350 -54859 -53940 -41087 -24763 -6911 -36379 -31793 -70995 -60453 -16936 -13167 -12005 -9084
9257 -9084 9555 31860 35850 32215 38797 30401 5056 -6724 -6109 -3681 52785 27813 -1515
9244 -1515 18890 53481 60949 72667 41856 45608 2971 -21271 -51633 -34794 3872 7664 10360
9231 10360 8446 20759 -15848 -27173 -23371 19547 72090 56241 5089 18740 27589 47900
9219 47900 36419 6329 -5167 -29139 -27241 -32144 -58584 -92132 -96975 -92736 -94712 -42693 -25026
9206 -25026 -5311 2518 -44723 -49384 -16519 -32461 -81391 -111600 -81239 -29776 -52267 -36780
9194 -36780 -20301 5250 37293 90290 60327 19784 20408 449 -36801 -27601 -8447 37508
9182 37508 40360 48786 38873 24980 39478 57579 30440 33149 69232 62721 30974 16414 7801
9169 7801 58063 96403 93698 60998 45747 1087 -4751 -2559 8021 -30640 -24851 35833 63980
9156 63980 79892 120297 98787 126923 136853 62014 20772 42155 48182 42392 37834 51070 35865
9143 35865 72267 67456 64849 88731 35291 33589 68611 65336 72736 42341 19177 18584 39359
9130 39359 73514 64438 87143 98591 91090 93424 91041 154974 182770 181025 166571 136871 125453
9117 125453 127570 110777 171712 169960 141871 160754 136966 122924 110049 151155 170903 179299
9105 179299 203720 207972 196522 262872 318887 333722 356364 396140 518796 663504 867532
9094 867532 1165987 1466083 1863650 2559891 3746101 5941468 10194831 17407035 23541647
9085 23541647 22082807 15261895 9710521 6522950 4677573 3551748 2846921 2404043
9077 2404043 2062362 1769398 1532910 1366158 1260732 1185022 1108539 1056945 1009064 954584
9067 954584 899026 768100 649509 605249 552361 468901 460325 437648 384955 336328 256651
9056 256651 239186 243261 194578 170391 160569 166441 162653 193106 239658 206486 144018 143000 161862
9043 161862 194722 189809 160617 173518 149960 117764 85312 114755 115707 125546 105650 103946 104873
9030 104873 124797 144656 121502 107262 134857 100770 90785 99290 62011 40844 42571 20447
9018 20447 17263 19784 21686 36921 43683 4048 4242 50564 34676 43128 40951 21745 58976
9005 58976 101963 122645 117817 88029 70486 84777 109196 108587 83429 89836 43287 34037 46892
8992 46892 61003 29966 19909 16614 -11730 -27248 -13705 -34 12905 -28219 -57240 -49392
8980 -49392 -49047 -27784 19819 42979 85226 85771 18052 4007 9861 10356 21319 17854 33787
8967 33787 47707 57752 48398 40155 31768 84352 104324 117672 110538 82902 82944 93118 59750
8954 59750 44733 39425 27005 23145 10873 22884 24792 43112 53841 50810 29456 12568 12037
8941 12037 2411 -16001 -18665 -49362 -38209 -36621 -59702 -93939 -68912 -30245 -18125 -23782 -33317
8928 -33317 -56945 -75702 -65352 -72148 -92554 -73889 -51080 -80319 -107561 -136626 -94750 -30146
8916 -30146 -6006 -4684 -12903 -9169 -14302 -24483 -23941 -67537 -99793 -52528 -7488 -52603 -62329
8903 -62329 -91080 -81908 -19145 5462 -14419 -14104 -5308 5440 -22889 -11233 -7310 -24453 -20252
8890 -20252 4159 -158 -19429 -8727 16661 3378 -16738 -11879 3219 -8147 -18311 -674
8878 -674 25122 46061 16884 -45555 -5056 3755 8842 21916 -10678 -10221 27239 21406 16256
8865 16256 18762 28219 7676 37161 14168 -16581 -30460 -76540 -68407 -46506 -65483 -54922
8853 -54922 3478 -84 -13525 -833 16411 20761 22993 -8320 44308 56687 31016 1773
8841 1773 -26035 -54362 -57908 -20002 40032 51044 21395 -62790 -90900 -90381 -21887 407 35863
8828 35863 64421 31428 -21768 -24561 -13341 -41605 -41834 -28434 -30737 -11555 1943 7433 14147
8815 14147 52566 52001 -21634 -13960 2300 35547 46935 40353 15532 -6000 19959 -22337 -27161
8802 -27161 32042 47507 67330 37342 20665 32580 42567 35442 22152 43255 51334 -15153
8790 -15153 -91276 -73210 -49472 -42551 9920 34984 18162 36405 57028 82047 58729 28987
8778 28987 -7324 -1209 20524 5255 -26263 -60044 -41622 -22401 -57172 -54888 -51376 -35644
8766 -35644 20024 1932 2917 52987 16258 -17843 50352 27056 -17981 -17509 -5009 -21245 -46270
8753 -46270 -31178 -23226 30037 56124 48181 32481 -822 3780 -7391 -24485 -24944 -27305 -16139
8740 -16139 -12946 8594 38856 63670 15182 -29127 32993 73420 16368 -16456 -31721 -68901
8728 -68901 -59848 -15155 -11794 -4047 28140 31867 11467 -25253 7458 20045 13260 21797 -15477
8715 -15477 -36919 -41851 -19353 22845 4338 968 19826 25169 13964 -25223 -12910 36255
8703 36255 77956 83852 99974 104339 14263 -43142 -39082 -29666 -7735 -4980 4561 -21051 16319
8690 16319 21248 19653 -2953 -26225 -21102 -8967 -8869 28431 15034 -17260 -29925 4528 14375
8677 14375 -5673 -31806 -50907 -44952 -41039 -23539 -20424 -28138 -2837 -1775 -4753 -1128 -16965
8664 -16965 -5142 3468 15968 45726 86584 89348 54556 24594 23068 46601 33246 28212 -18189
8651 -18189 1179 8582 45402 48588 32746 23641 22962 46351 36734 66562 60359 47619 42063
8638 42063 23124 7400 -30828 -17286 -10247 -211 1220 25080 35353 11289 8774 23651
8626 23651 75159 71366 21227 -38234 -54539 -18042 6480 24274 57146 32257 12131 13962
8614 13962 13272 -14716 5637 30209 80707 109520 96586 85283 75887 94811 114054 100505
8602 100505 118218 153016 184924 167772 147131 150742 198317 206510 197720 218230 241985 200549
8590 200549 156770 125466 74770 52518 81285 92931 80733 73057 84326 68880 22467 -26251
8578 -26251 7912 17818 43654 48851 35719 67768 33804 -33080 -42693 12616 41550 48345 59806
8565 59806 26437 24509 17045 13353 10445 2645 -3573 -18845 -13559 33056 -2129 20803 51140
8552 51140 76043 43933 18358 53257 42161 31020 11921 -46308 -52997 3940 767 -43364
8540 -43364 -42932 -41535 -2818 653 -16676 10012 20339 2962 9677 -19510 -35912 -16722 -1578
8527 -1578 7542 2179 27224 31534 32629 20844 8312 -23414 -18326 -31032 -17754 -56104 -61491
8514 -61491 -3727 25853 17142 7193 -30135 -34941 -9964 36162 50878 71395 1888 34805
8502 34805 80687 91763 71317 30915 6451 -27560 -7344 13438 26939 32973 11134 13561
8490 13561 35083 24132 77866 56759 44609 48588 27749 16379 -19180 -22277 -46172 -7765
8478 -7765 33592 36370 -5610 -23516 -14870 -7818 5009 9261 14586 10267 60417 121439 105376
8465 105376 66684 33730 56832 45049 20515 -4370 13943 -25381 -14482 -16084 -19647 3376
8453 3376 26447 5510 -20821 -27641 -7211 -11897 15041 42446 -15335 -4193 14743 -11354
8441 -11354 -39007 -24435 -4714 11365 -21436 -25626 -30024 -56302 -26190 -25406 -31837 13751 29316
8428 29316 6607 4626 23979 77823 108271 87715 45637 7809 -26018 -12499 -3231 11226
8416 11226 23659 -13012 -12453 11674 4406 -5803 21606 1577 12299 -15978 6139 -12218
8404 -12218 -51609 -36860 -27772 13289 -7565 -41512 -32881 -13877 -30111 -68032 -52507 -101528
8392 -101528 -123293 -79121 -32159 -26043 -20465 -18088 -21073 -28727 -49017 -16443 15452 66832 82426
8379 82426 36800 -1972 10150 31632 33776 13068 4208 24435 49678 -1080 -53999 -39870
8367 -39870 -23134 -56780 -55927 -22933 34320 77727 75654 58457 -15042 -46591 -81796 -69557
8355 -69557 -41198 -602 -38111 -11991 49563 29066 -9618 -49798 -39306 -448 13912 -20902
8343 -20902 -17102 -10611 -33086 -20869 -28028 -25440 -45848 -47805 -48662 -57048 -16042 -6453 16574 28837
8329 28837 28297 3179 2815 11551 1702 18574 23319 -3136 -12703 -5278 4446 638 -8187 -13725
8315 -13725 -11501 -1142 1671 12810 36933 12155 -26219 -48898 -21499 12120 29431 -14637
8303 -14637 -55977 -8011 50248 114448 121371 87356 43445 41044 40095 -12803 -26722 34637 28858
8290 28858 6804 -12713 18551 69159 46011 -25430 -36071 -71360 -59990 -33695 -34445 -29885
8278 -29885 23087 15744 15656 44996 24931 20628 -7971 -20752 -1139 -43692 -27343 -4048 34066
8265 34066 101397 64722 47993 52318 56739 30040 47665 71674 116934 99300 69987 50637
8253 50637 56810 21771 2964 26493 13140 539 4024 34278 47145 46060 26635 21641 57469
8240 57469 52528 56153 75935 28953 -20839 -35516 -59728 -54191 -43079 -54161 -39876 -52178
8228 -52178 -19737 8924 74330 124630 144118 118324 88433 52538 51501 52348 43912 42688 70440
8215 70440 93784 74104 56579 60219 47823 74109 24259 19236 6135 22531 -17645 19416
8203 19416 29383 -15210 -26577 20944 -19058 -27550 -46150 -55319 -57107 -25193 -20206 -25531 -16596
8190 -16596 -28118 4235 -10065 2988 39838 65791 25883 4555 14774 -43824 -66637 -41588
8178 -41588 -15723 624 -27462 -14531 -5692 -16087 -16509 -1883 7114 3137 7289 6934 16436 84967
8164 84967 104367 91984 88894 43947 10678 15760 10360 37755 53575 32453 -9235 -10555 -54002
8151 -54002 3812 30473 45884 39853 3998 14502 37955 35597 -4716 -26839 -29885 -1000
8139 -1000 28436 80603 46557 26949 946 -20712 -21429 2246 -20428 -18557 -54934 -66265 -34508
8126 -34508 -4382 30652 50404 63570 20743 -34141 -45386 -45433 -35828 -7062 -18838 -20601 9857
8113 9857 33536 54422 57920 48393 37210 -3698 -22594 -19748 -44205 -51562 -33276 28479 64802
8100 64802 30425 -31013 -49504 1435 -1697 816 128 14608 8652 28739 34735 66932 103128
8087 103128 107196 92174 104390 102190 82273 46653 48154 79069 42572 8981 -70505 -69477
8075 -69477 -27539 -7545 27647 13626 11185 20944 74578 41497 7078 -15340 -19942 4478
8063 4478 24350 30576 10907 -15244 -27518 -34489 -14626 11559 4537 -37439 -51422 -65856 -35497
8050 -35497 -31317 4919 1239 23479 70578 78009 60259 28735 -7390 -16525 25618 52685 101973
8037 101973 121363 68295 51871 34006 -5718 1035 767 52945 79167 82661 117641 138105
8025 138105 85329 52296 39107 -14175 -49773 -40162 -52010 -67059 -42338 898 28963 5190
8013 5190 12706 28612 53527 65062 52227 60733 57159 48562 60827 52506 70946 72983 86484
8000 86484 102312 106997 118651 89270 73359 53313 51941 32026 51519 106388 106594 108701 82905
7987 82905 41819 51719 66238 71090 90538 67714 65801 60231 76611 70793 35634 45188 66166
7974 66166 94589 128112 106154 60786 67757 69243 55549 57147 96324 94266 142628 155153 120002
7961 120002 90392 94962 112054 153425 124726 119491 104525 43593 44066 36484 31734 74348 108949
7948 108949 69715 32530 33324 66915 77350 95851 106229 60337 15695 39907 48722 44862
7936 44862 54476 81765 25566 22998 51110 34219 -33935 -51468 -14803 35404 31936 21974 60137
7923 60137 61522 68999 84895 101454 114053 102464 117227 82345 105917 103748 85251 82402 65708
7910 65708 45468 55597 97020 83267 60236 55993 27507 28156 51251 56541 63643 51408 51973
7897 51973 65154 77663 113450 84469 38691 9476 26481 4159 -9766 -5247 -15801 -11249
7885 -11249 12116 24886 65157 67060 32496 21016 45599 55645 32512 29669 18947 16089
7873 16089 35399 10609 30854 81695 104398 103853 119870 92705 72498 57751 69827 26728
7861 26728 23878 -10420 -12532 -742 -72 16530 61391 90685 117880 118754 88544 47063 -5895
7848 -5895 -24212 -739 -5729 10360 10428 20904 37064 46381 21596 3083 37836 60753 64198
7835 64198 60326 47453 29606 31737 32527 49356 53486 40508 12855 -13708 -26144 -4957 11511
7822 11511 -6945 -25124 -33234 -23238 -7675 -32598 -26639 -13234 38859 34778 -26181 -29185 11184
7809 11184 5751 -16301 -37833 2115 3447 -22360 -20553 21035 38458 11079 -24623 -18451 -24406
7796 -24406 -18914 -56422 -63776 -31293 -6695 -5384 -17902 -8684 -6791 -36590 -4522 22743 -6898
7783 -6898 406 11820 -5957 24303 70076 108326 79734 53414 -7690 -34011 -53094 -51297
7771 -51297 -8674 42661 71961 32087 35535 30965 1775 -1324 34211 31274 35828 46761 2732
7758 2732 -17633 -7421 -19052 -9689 -7993 -3271 29846 -9286 -3989 72041 48414 30331 80737
7745 80737 67583 29195 -9302 -61909 -72432 -60755 -18235 20481 40249 90427 89722 38069
7733 38069 7083 9981 -9664 -15563 -7518 -36311 -14564 2423 -27915 -44231 -48268 -35135 -39112
7720 -39112 -44480 -27213 -44975 -73490 -62761 -72172 -22157 22316 -113 -6917 -7543 -15767 -11723
7707 -11723 6028 21896 47519 53875 43764 25152 26721 18672 11605 11289 18460 -8593 -22063
7694 -22063 3058 47356 38403 13185 -13290 13266 -14326 -25010 -851 50256 64899 40864
7682 40864 25083 32047 21276 9435 18598 4949 995 1301 -1916 -18523 -47160 -43240 -41465
7669 -41465 -62176 -89041 -118277 -107298 -72701 -47124 -13678 6932 6836 -17423 -13892 17825 50516
7656 50516 29734 -158 -20144 -9588 32216 68326 35977 -8950 -12054 -15095 -17274 -25852 1544
7643 1544 24457 47152 14990 18240 37182 5142 9257 12237 -11325 -25769 -42436 -12250 -14774
7630 -14774 -45467 3085 25621 36030 24584 -15960 -14813 -18337 -33381 -22007 -72761 -87932
7618 -87932 -67971 -51979 -73928 -68346 -99046 -107873 -65415 -3790 -31555 -53705 -63368 -35866
7606 -35866 -9405 10219 31676 48315 68355 59591 32290 24135 -351 -24556 -47319 -40329
7594 -40329 -33394 -1587 -7705 18886 7477 -32702 -29350 -74700 -90429 -78618 -9337 42640
7582 42640 69783 72439 33505 -1124 -14243 1065 -1005 -35311 -31822 -55651 -48530 -44194 -57102
7569 -57102 -41524 -52864 -60971 -21463 21371 58102 18719 -53107 -72428 -32549 -7395 20583
7557 20583 13616 36853 67801 55003 37749 34256 50383 36882 -39109 -70455 -35938 -24822
7545 -24822 -17232 4348 -7396 2786 9869 -46835 -65805 -43049 -10235 -2147 18448 34702
7533 34702 4366 -14343 -5873 -1738 -33634 -38081 -20388 -11232 -18728 -56864 -58839 -31129 -15516
7520 -15516 -8415 -12968 -1813 -33397 -50957 -48602 -16483 1141 29706 51700 31958 49994
7508 49994 38604 6762 -19607 -25248 -4743 36702 82307 69809 -4848 -18620 -39724 -45152
7496 -45152 -28913 -11075 33612 10367 46903 66709 45339 34141 10536 -10521 -14670 -23083
7484 -23083 4771 26405 44813 14283 4617 -9365 -41897 -3394 31796 15890 -31252 -49514
7472 -49514 -10148 -12618 1247 2626 10556 25767 11318 9983 2088 -23210 399 11803 -7577
7459 -7577 -24530 -4294 27411 34529 22514 -31854 -27955 -14188 -29415 2144 28891 39090
7447 39090 3687 -2553 -2874 -3387 19238 37949 16183 3184 -4113 -38825 -24613 -3946 4106
7434 4106 34406 42732 27332 21560 16136 14379 32615 31926 12033 33039 30558 13740 -31804
7421 -31804 -17820 -54776 -69989 -64079 -36380 9474 -18649 -8133 -25817 -75339 -54668 -39587
7409 -39587 -54085 -32944 -23407 -34615 -13812 2545 -814 11090 -430 14052 21440 -21578
7397 -21578 -3341 23835 20261 32166 15836 -5941 -26165 22001 25698 -25567 -40685 5438
7385 5438 16162 25970 24933 34895 8478 -13642 -5827 -3708 18030 23518 28322 21611 4294 -24073
7371 -24073 -79156 -47191 15502 86138 74064 56225 55966 -25439 2808 -10134 -19919 -7459
7359 -7459 -41248 -21244 700 2079 -5986 12383 -463 -24834 -15910 8800 -36548 -59195 -61833
7346 -61833 -63163 -33031 -19075 -35748 -98766 -82584 -31085 -45060 -32751 -51815 -71743 -35627
7334 -35627 -62122 -37201 -38059 -83671 -76080 -37927 -2012 2044 -13628 4959 35267 65513 27995
7321 27995 45616 54255 42536 36834 32166 72425 122290 61695 31352 44255 17985 6613
7309 6613 15762 8345 -11419 -26530 3976 -11857 -55467 -32312 -13815 -39521 -69144 -56084
7297 -56084 -18886 10603 13698 -14343 278 -9662 5314 4310 -8027 -21056 -43759 -62149
7285 -62149 -18881 -19550 -45281 -3989 12561 -9071 -25181 -38889 -50963 -52838 -23468 15896
7273 15896 51055 80396 31927 5626 29907 41656 32443 -2375 -5238 -62034 -91794 -62682
7261 -62682 -42358 -2744 9128 -14783 -10979 18267 1568 -21548 -2206 25916 17503 13656
7249 13656 1969 15375 24697 -21218 -13880 1842 4017 43088 47062 15561 3575 14641 898
7236 898 30904 39570 78039 104957 52686 -9310 -28277 -46270 -26423 -43534 2622 11242 -2403
7223 -2403 -2026 16620 2279 14056 21504 28275 -7045 -2548 51905 57306 32836 20050 35229
7210 35229 36691 45254 60362 59287 48900 15034 -14291 27613 24298 -21835 -52754 -3951 67553
7197 67553 64899 64129 44576 -7631 -55964 -28025 -7676 -30128 -13794 -37909 -34180 -40703 -53206
7184 -53206 -46025 -14174 34085 44131 24001 -32584 -60637 -46254 -44934 -80350 -47735 -12062
7172 -12062 -10577 -38027 -69988 -49373 24357 44727 16828 22905 57016 40674 27483 -9317
7160 -9317 -15933 -9521 15112 33157 54424 87879 69469 37294 -15294 -32839 -9039 18765
7148 18765 16589 23217 -12559 -26801 -24817 -29164 17796 3346 -17922 -9500 4572 -31470 -42803
7135 -42803 -39676 -43580 -34243 -13082 10557 5985 -6183 -26714 2520 7982 29001 26812 -4872
7122 -4872 -56529 -65843 -30239 -10961 23732 14696 -28483 -37070 -29438 -59429 -56913 -86439 -64450
7109 -64450 -26637 -21498 -6542 -30735 -23763 -28568 -16291 -22751 -52600 1827 58622 45528 16360
7096 16360 21502 -582 -57650 -62637 -51181 -55311 -28608 -25893 -52330 -99139 -134849 -109601 -57187
7083 -57187 6070 3928 -14472 -30989 -21923 3584 -1407 15488 26644 -44775 -75550 -66122 -86200
7070 -86200 -77780 -47050 -25619 -14544 15351 33094 75568 59689 59504 74481 49849 -11253
7058 -11253 -11157 12140 -32560 -19669 12969 60118 44794 25744 28476 3671 -25469 -41635 -65979
7045 -65979 -23444 5927 18906 3359 -25841 -42954 -25235 -29384 -28232 -304 -17219 -50787
7033 -50787 -74614 -58924 -19240 -8810 -14419 -28774 -32986 -15747 -1241 183 -25429 -37294
7021 -37294 -20397 -29113 -18415 -67927 -83779 -79906 -75697 -69014 -39347 -29397 -36696 -17458 -3360
7008 -3360 -12070 -38200 -5119 -11926 3276 35685 39862 21969 -16643 -21473 15134 800 17401
6995 17401 3754 12426 53471 67527 57848 44324 39017 15159 11591 30237 54373 22267 27122
6982 27122 23028 3340 34844 22482 -2111 -10059 -23794 -53524 -35388 -22704 -43767 -28344
6970 -28344 -18725 -2892 -20402 -40896 -62301 -36217 -1689 2208 24119 -137 -2904 19785
6958 19785 17355 20772 -2391 -1541 12650 -44408 -68562 -81352 -58898 -72554 -70383 -22925 -13917
6945 -13917 16396 -12060 -57382 -35726 -4778 9075 11530 40399 81635 54470 -632 -44426
6933 -44426 -36272 -6699 56285 84508 72695 24748 -20606 -6894 -22400 -52671 -52927 -65816
6921 -65816 -50292 -16533 -13366 -20151 -24553 -11419 35517 -1855 13913 41553 -13853 -54626
6909 -54626 -47436 -32761 -2161 74627 67459 40238 15049 6492 27840 50020 43543 19302 2043
6896 2043 -27780 -65686 -79918 -57524 -31060 -54616 -45180 -20047 5928 4748 -48148 -76336
6884 -76336 -54964 45100 73110 21155 5447 6362 -2916 -33911 15550 16013 -10494 35336 92651
6871 92651 45447 15972 -26383 -38385 -7846 -13942 -30667 -45094 -41497 -37470 -6765 35150
6859 35150 38542 38317 68325 69298 100354 65206 26675 1708 -15817 -38023 -23542 -30946 -57574
6846 -57574 -62732 -46848 -41281 -29806 -48477 -57736 -23816 8880 -25651 -66501 -75809 -23049 -26161
6833 -26161 -35403 -15008 -3580 -1496 69722 78253 499 -49189 -18321 345 18294 61482
6821 61482 29348 -9398 -35303 -11457 -2584 -14798 -37707 1572 46812 30153 3517 23471
6809 23471 26382 21134 10974 25868 -40209 -59854 -21923 2414 68811 97987 72084 104680
6797 104680 164059 121130 52126 50064 47149 36499 203 -17001 -3428 -8356 3592 -13750
6785 -13750 18379 20614 -48629 -68876 1342 42617 52849 47928 33196 -39723 -81947 -48431
6773 -48431 -19092 -27997 -62542 -92321 -58994 57238 65866 894 -7127 -4220 -30475 -50173
6761 -50173 -29508 -22534 -2279 49581 60272 46419 -10953 -37698 -46499 12967 66865 94708
6749 94708 117497 86831 51161 35626 -3161 -6637 4250 -1347 -65843 -69668 -43787 -20314
6737 -20314 -17377 -33965 11295 38274 75430 8796 -7748 26559 47150 69296 -4467 -3958
6725 -3958 11361 12748 52537 72597 62315 106711 137540 137801 95729 74858 81260 61033 28524
6712 28524 -19063 -16835 1188 24424 28840 22928 19079 25817 758 55770 85182 39614 6919
6699 6919 41869 45970 51906 49718 70446 30254 12400 15405 58752 54503 22125 -6313 -10521
6686 -10521 13739 24475 51760 3558 -38313 -61178 -61096 -74873 -42751 -22546 -24610 -48181 -47894
6673 -47894 -21825 -8984 -13922 2573 41864 37881 13305 10689 25979 32086 45183 4703 -1356
6660 -1356 31672 13478 4301 -6122 -37150 -68142 -61971 -42757 -43401 -32202 -20153 -23678 -26453
6647 -26453 -34136 -64480 -91046 -81362 -108390 -92036 -88796 -85659 -58336 -27453 -13735 -42239 -40860
6634 -40860 -51356 -53984 -40224 -23471 -15097 -38943 -34171 -61533 -56691 -76657 -80627 -56615 -52934
6621 -52934 -86845 -83579 -79093 -66381 -30862 -21431 -461 -144 -16605 -33400 -21139 -24784 -7852
6608 -7852 -34841 -51288 -10693 15456 33650 17708 -14409 -16506 -18995 -31802 -69549 -69974 -41591
6595 -41591 -36347 -15667 -15168 -11386 -2826 5718 -16155 -40489 -16250 -1853 28528 25431 23358
6582 23358 4481 16039 31596 21983 25927 11762 -22892 -21433 841 -25187 -32638 -25931 -48056
6569 -48056 -59790 -85564 -82742 -66151 -39014 -5147 -12035 8206 70045 82512 49121 -13828
6557 -13828 -43050 -69803 -80594 -20295 9393 -6858 -26183 -11941 -6886 6011 3292 -5579
6545 -5579 -10655 -24611 -51989 -30646 -27772 84 -20619 -58126 -54644 -33649 6766 -13471 -10887
6532 -10887 47275 31254 -5437 -20599 -9752 31612 45178 34056 7153 14264 41235 67853
6520 67853 82818 132227 64417 -14283 -29728 -15446 -19855 -3191 34020 27294 11233 24661
6508 24661 6582 7431 -9328 -30133 -12168 19626 42840 3067 -22702 6829 30651 4291
6496 4291 -24558 303 -11167 17037 22632 23359 22580 11239 5625 -3539 -18679 -28919 12600
6483 12600 36318 37859 13201 7604 -48095 -72892 -43227 -9776 35030 24498 16275 15699 36174
6470 36174 14274 22561 9499 8544 -11009 4772 34666 11971 1140 -34845 -33961 -18596 -10825
6457 -10825 -4480 193 16838 46580 65511 54824 54816 12973 -26439 3046 31037 50961 30366
6444 30366 1081 7946 -48774 -91000 -62862 -44101 -102027 -92535 -9600 -5088 -12156 -6101 -40131
6431 -40131 -70715 -71355 -74449 -50390 -16108 -24386 -38201 -18268 -42421 -65511 -73968 -60866 -53807
6418 -53807 -18432 -11246 -2310 -5394 -10284 -54371 -67582 -62275 -11255 62880 63031 25989 23951
6405 23951 10922 11211 -46380 -71438 -79823 -35589 -22109 -29887 -14892 21290 67813 25030 -6591
6392 -6591 22127 42271 47374 35066 14772 -1563 -25014 -29965 -28148 -73148 -81503 -72509 4505
6379 4505 20975 9999 10154 30974 13303 -19698 -5606 -26388 -4999 -3520 -14474 -22992 -1852
6366 -1852 13242 14868 41754 6484 30496 55599 31872 3267 -31399 -29130 -39152 -57491
6354 -57491 -33432 -7344 -26459 -67322 -75599 -74297 -46190 -24167 -59569 -86042 -108010 -104578
6342 -104578 -64301 -29454 3902 6678 -11599 -8550 -16329 -18007 -46088 -11577 -10041 -37226 -9614
6329 -9614 -21304 -1599 -29317 -51948 -99891 -79691 -35041 -15108 -29342 -9492 -18548 -60277
6317 -60277 -106976 -38901 19167 20787 26031 24664 10305 9386 32567 89519 118635 78166 37637
6304 37637 36001 42260 52978 54326 2016 -39239 -52399 -6827 25590 37986 57752 67859
6292 67859 47506 9799 -45882 -46686 -30535 -1979 24104 -10753 -34902 -41499 -51042 -39994 -27952
6279 -27952 -46345 -59926 -6804 24824 27599 59530 44530 14004 -11562 3742 62164 69489
6267 69489 103498 86057 67367 71799 38553 -2610 -58973 -37452 -21981 -48141 -76474 -54854
6255 -54854 -75933 -103112 -40926 -16503 -78592 -78882 -25827 -31499 -69442 -54864 -33697 -8973
6243 -8973 -14360 -22058 -2118 18770 10968 -6073 -17189 -47657 -24515 25227 49776 45776 45028
6230 45028 47935 68467 62210 52630 58442 67122 70660 11378 -50820 -32022 -893 10696 10908
6217 10908 -18325 -65777 -93036 -51868 -30240 -22708 -23022 12529 32372 26808 15644 16178 8468
6204 8468 18024 402 -47318 -40160 -64040 -86089 -21887 30134 39872 1881 35661 28271 9121
6191 9121 11252 13973 37365 21908 -10075 6325 12655 4837 61091 82685 42408 40033 49894
6178 49894 40301 24872 -8147 -29593 -21693 -28546 -27848 -15554 -40887 -61395 -38005 -49227 -55178
6165 -55178 -42848 -26807 -17875 7878 28612 16502 -32111 -32195 -11349 24652 24088 5864 18070
6152 18070 46221 42407 43101 14624 26088 13395 48781 19068 -14445 42518 73804 87509
6140 87509 37492 -7060 -41157 -18379 18826 56638 68241 89876 98338 99720 65258 12795
6128 12795 -5063 7688 -12325 -30716 -7536 -2780 1182 -3055 -22298 30326 83122 38859
6116 38859 -25162 -68930 -50093 -54827 -47401 -38186 -30839 -46618 -34432 -16993 -77974 -30897 27660
6103 27660 -22847 -20115 -47209 -64958 -61276 -65969 -40433 8092 32410 -32568 -68824 -66631 -88773
6090 -88773 -75049 -75659 -70750 -100234 -76606 -76336 -45785 -54607 -55592 -105986 -91134 -67505 -48336
6077 -48336 -2721 17734 20729 46554 38262 16743 60374 67209 12296 -19130 -58665 -41529
6065 -41529 -10760 -36589 -56960 -46212 12098 36618 20104 4446 18959 15984 -41074 -66689
6053 -66689 -51812 -74022 -50460 -23847 -31360 -3505 22963 6415 1396 30457 50096 87673
6041 87673 101623 49119 44494 63266 75678 9466 2465 45279 10617 -12266 6648 17322
6029 17322 -10743 -37754 -33038 -10412 9924 2213 10186 38737 56321 23213 -6461 15429
6017 15429 65940 72440 46310 31035 30571 60620 79451 60908 51014 1624 -4456 26335 34973
6004 34973 15722 56943 74028 79400 80422 58122 13200 -28393 -9108 -4662 -12672 -12841 -15632
5991 -15632 -21531 -40201 -4643 6107 -27824 215 43665 30238 43823 25714 -12932 -28667
5979 -28667 -18589 -19403 -19294 -39955 -407 27212 -811 -31404 -37475 -26238 6654 9193 15741
5966 15741 17198 -23078 -43368 -31113 -7756 7605 -331 -15403 -21370 -40675 -22149 19205
5954 19205 703 4463 18161 30881 -3901 -42626 -75524 -69321 -28195 -4343 -3161 19755
5942 19755 9226 8859 16044 38759 20227 5753 16332 20789 28116 46990 44072 29062 -14032
5929 -14032 -35425 -38477 -36786 -21211 -37222 -13663 14285 10502 -20820 -49493 -20752 -8118
5917 -8118 -28297 -24601 -49536 -33833 27449 29603 10587 -15337 3364 10641 18114 54680 -3883
5904 -3883 -35445 -60361 -79242 -31253 -5784 27340 -6406 -49580 -14929 38198 54270 27373
5892 27373 43635 41700 14280 3219 19020 32029 43831 10143 -23738 -10265 -3524 8542
5880 8542 -12543 -28899 -15406 -57312 -37040 6353 -3350 -15018 -29668 -31119 -44415 -12863
5868 -12863 11677 40669 48438 51705 57960 20006 -39589 -57207 -24480 -17642 -31 14441 35379
5855 35379 33979 3744 -23576 -16846 -7669 6242 18686 48802 33269 34164 38277 33071 12928
5842 12928 -23716 -13336 -488 -14700 13431 46652 22975 3655 1317 8480 18974 42575
5830 42575 19879 -13015 3361 21069 14238 -15095 -54463 -28331 18750 44059 53390 49240
5818 49240 10852 -37235 -7602 27407 53939 62136 86940 21080 -16389 -21224 8450 -1451
5806 -1451 -10991 34326 31912 8580 13838 41941 63756 48989 32908 41563 15358 26615 38896
5793 38896 55088 15470 12051 10591 5305 -50757 -28942 -1751 8179 10030 8646 30336 45854
5780 45854 45432 56840 28703 24744 2134 -22726 -18894 -38772 -41368 -14287 -17970 10584 6905
5767 6905 37541 42793 30452 59472 57093 43301 50100 55365 66713 52021 74772 79941 83673
5754 83673 80504 49950 -25327 -31927 -10637 37245 18893 -25951 -65378 -70515 -55127 -33993
5742 -33993 -13383 16014 43118 51131 30382 26136 -14155 -28968 -52926 -77881 -58907 -55203
5730 -55203 -49555 -67440 -38468 -24673 -38826 -50404 -32600 -23958 -14624 -1608 51659 69638
5718 69638 22469 -13781 42247 40472 21600 19714 57852 65881 27115 17743 37435 58704 24195
5705 24195 -39128 -65670 -82026 -63459 -1261 -15787 -41256 -31338 -12456 39466 14038 -27424
5693 -27424 -20122 22305 18670 41731 7506 11717 541 -14777 -8935 -10277 -11892 33982 70528
5680 70528 23190 9515 -5668 -12750 22992 17492 -3561 -5521 -36917 -39043 -21429 -16116 -25653
5667 -25653 -45687 -46002 2758 22203 -5129 9582 19631 828 18852 41155 7219 242
5655 242 -20372 -39556 -67756 -117895 -104691 -69861 -25616 19488 43728 42073 -10583 -18696 -32367
5642 -32367 -35075 -49490 -53502 -63243 -34034 9136 40349 40972 29975 5405 -38404 -35480 -44110
5629 -44110 -29775 24791 7933 -790 23217 49440 52517 20717 -44508 -47212 -5312 -23308
5617 -23308 65 76275 67708 20933 4511 42596 23503 45562 32983 10043 14241 58909
5605 58909 55354 38342 59706 94535 109418 115309 55579 12611 13426 9041 9628 -16347 23000
5592 23000 14443 -14061 7641 29414 15502 37858 104933 76484 39791 33706 -9354 17981
5580 17981 24972 -10936 -28902 -17200 -25391 -40781 9043 61083 42329 -41202 -90324 -61862
5568 -61862 -49365 -92091 -127541 -104905 -46743 -74344 -71575 -31853 -35678 -42761 -58117 -19010
5556 -19010 5069 -2839 7297 23270 -5734 -23285 -50150 -25709 4969 9991 -5800 43943
5544 43943 72225 24195 -7519 -20707 -68508 -67162 -53096 -43172 -38622 -30685 -50367 -37373 -26716
5531 -26716 -9533 -36361 -91551 -99223 -75208 -60473 -35928 -5403 15967 -290 -8935 -5175
5519 -5175 6610 23183 8345 -52583 -51736 -39130 -31686 -19416 -38072 -41068 -29514 -21513 2250
5506 2250 9476 28518 38062 70263 58049 20850 6354 -7126 22956 10401 -13448 -46895
5494 -46895 -11208 15286 -8460 -65512 -69886 -79449 -32250 19947 15209 -13800 4194 40730
5482 40730 51578 67964 68870 44123 9386 -22144 -60359 -47191 -14270 19559 39543 33837
5470 33837 -680 -49 -33682 -51354 -49632 -73580 -81405 -58565 -29903 6999 -2170 -34312 -72880
5457 -72880 -78341 -65452 -28606 -11551 -43561 -28634 -15947 -13564 -8934 37846 51909 30438
5445 30438 -24330 -69086 -23391 30154 24281 -6088 -23297 -55593 -37730 -2447 18433 10265
5433 10265 -26214 -34248 4314 11447 -15588 -18714 -58579 -46149 -12100 -17269 -55765 -72487 -42287
5420 -42287 -46333 -12552 2175 25606 19422 9051 -11692 -8807 -21678 -26768 -46002 -48235 -9371
5407 -9371 32525 14648 -18920 4061 -33632 -6273 83496 99859 73050 26084 1199 6004
5395 6004 24931 18845 -11155 -11944 80109 40159 33244 48010 60255 32937 16408 35899 49768
5382 49768 9520 -28696 -37179 -27870 605 -18970 -17095 -9715 -31550 -56071 -57573 -16161 -24696
5369 -24696 -42132 -9442 -22525 -53144 -35952 -6534 8132 -5734 -26582 -33331 5391 30459
5357 30459 6503 -2634 8436 36710 4865 -24883 21127 34585 53273 53653 53121 52144 40390
5344 40390 50098 39952 24388 2756 -21679 -31016 -55477 -24052 -21455 -1307 -8042 14716 -21639
5331 -21639 -2160 19612 1947 -4752 36218 4212 -14126 14784 -4925 -16145 1977 -23314
5319 -23314 -69155 -79866 -46898 -4987 47113 49384 12860 -35720 -24264 -62233 -72508 -43216
5307 -43216 -35091 -34405 -13602 6453 30186 26558 -20376 -22053 -9067 -9363 -27914 -33165 -19674
5294 -19674 -43020 -45371 -41887 -18206 7299 2410 8326 -3593 4392 28296 21559 42169 18255
5281 18255 38035 15396 469 -21648 -19921 22428 74847 107297 120712 89790 61169 96131
5269 96131 94580 84953 72929 32774 -1356 -1443 24896 12671 -3649 45133 91565 83769 50698
5256 50698 10787 -8484 1005 1495 -41845 -9420 11801 14072 40342 8022 5911 28254 23691
5243 23691 -33003 -89751 -105365 -106691 -121419 -138313 -66448 5526 6267 -24027 -27481 25205 45761
5230 45761 66317 63083 23619 43783 92209 70691 47436 28281 36274 26231 11919 -5871
5218 -5871 -1708 -21366 -30031 9394 20372 33434 61400 51243 26186 -27397 -66917 -31102
5206 -31102 9071 -12486 -74486 -83847 -64583 -45697 -43201 -26454 -17742 10853 -11347 -24919
5194 -24919 7586 26764 16331 23565 32622 63052 58438 16313 -4882 -17244 10924 -11662
5182 -11662 4127 61465 65318 24110 4439 -6728 -22989 -7663 -19339 -6598 9895 -4605
5170 -4605 27701 26051 -15185 -19033 10784 71636 58086 32319 19113 863 7990 35017 54643
5157 54643 67871 1672 -59222 -74136 -59721 -24438 -17668 -27652 -64570 -20433 26552 4420
5145 4420 -38546 -43927 428 54878 30071 5801 4849 -13965 27160 75097 18075 -36649 -23963
5132 -23963 8450 25341 10502 -29303 -20128 -15595 -40005 -25456 -14699 -1738 -20248 -13744
5120 -13744 -17909 -29493 -18570 -20873 -927 3533 -15663 -52514 -28199 -4814 34395 -1542
5108 -1542 -22811 13901 34393 28747 23646 10930 -22668 -53020 -36922 -26500 -44451 -69660
5096 -69660 -21606 -13089 11337 53442 18556 24708 37031 2084 -13718 12274 19115 -1502
5084 -1502 -11147 -35623 -13494 14726 -11905 -12441 25235 39330 42903 11593 -9949 -405 -13212
5071 -13212 -19457 -5999 946 -1572 -32604 -70338 -23416 16721 564 16563 30120 28891 4623
5058 4623 11318 -11862 -61104 -43834 17906 6813 661 1429 -25219 -60126 -5182 75087 85595
5045 85595 68965 62294 94777 97011 38913 45339 75111 95217 112562 81223 45112 32274
5033 32274 34529 17514 8758 18783 29442 33354 47077 40133 29703 70822 87733 59188 19200
5020 19200 -46876 -40778 32589 54443 32048 64247 92284 62552 34379 4053 25051 7582
5008 7582 4836 12202 12660 20886 2397 -29031 38192 85806 85327 79469 70397 100190 105449 104141
4994 104141 69419 44483 8554 -7676 8307 14766 8157 24413 17952 -20940 -56967 -45895
4982 -45895 -60655 -57677 -18836 -4766 29833 57755 100818 68771 -9512 -18169 -20805 -62245
4970 -62245 -90846 -54061 -7959 6156 -28683 4496 33529 36866 33918 10162 -8929 -13974
4958 -13974 28654 63395 83182 28995 -25077 -66799 -61133 -31009 -10121 -10787 14537 48760
4946 48760 50418 26284 -9847 14347 40115 27894 -5689 -18093 -28909 -1773 30861 52306
4934 52306 78104 85181 54227 54320 72034 53176 2658 -32371 -21458 5565 27945 21634 8376
4921 8376 -37444 -37137 -54664 -89242 -53204 -6153 26649 15737 -7808 36096 22107 -5186
4909 -5186 -19876 -6211 48329 54196 47428 64136 11425 -47452 -54878 -40972 -31125 -8383 17913
4896 17913 70050 87887 48338 8387 836 38905 58458 19589 -27372 -32111 -33937 -44935
4884 -44935 -60700 -70320 -43679 -47 32791 33536 -13663 -7741 58155 111763 77125 60667 72673
4871 72673 56256 35566 11044 8229 6728 -9296 5401 17857 34132 22158 7246 -35781
4859 -35781 -32446 4580 54877 27207 -3583 32536 46714 41529 -5219 -66993 -111790 -28943
4847 -28943 7495 -3480 -6100 -10259 -9549 1137 -41072 -83415 -57772 -14008 -38551 -75076 -75866
4834 -75866 -79169 -82806 -87561 -51956 -1347 -2905 -10657 -29392 -41566 -19398 -7351 -12498 1405
4821 1405 35266 67841 75717 35339 -3183 -4181 -18053 -23195 -6557 -2544 5530 4092 35249
4808 35249 52528 41948 -3520 -30796 -22953 -28792 -86112 -56270 10903 34856 9982 -1484
4796 -1484 33900 34102 19532 -4838 216 49655 46183 50867 4908 29589 -8574 -48986 -73357
4783 -73357 -52269 -10279 37445 68338 49682 10133 -24661 -48447 -56834 -15115 72962 108940
4771 108940 113647 63990 35079 -10696 -69113 -65490 -46602 -19966 2878 15190 14017 -207
4759 -207 -28616 -77203 -34520 14213 -6042 24031 14229 -14045 -29320 9339 836 4252 19214
4746 19214 29740 -18392 -17518 -38002 -34629 -32423 -28553 -7406 15405 12459 45108 51418 30974
4733 30974 35396 50488 59557 45197 57251 73170 76965 65969 53423 29851 14740 1366
4721 1366 138 12066 35165 5191 6890 36791 52107 25403 25042 27437 22352 8548 -7215
4708 -7215 6122 10060 4928 -17812 -59997 -81624 -6162 -25422 -43344 -50339 -20016 -15451 -47397
4695 -47397 -61659 -38287 -36064 -3378 5083 -580 -22369 -55582 -49828 -31060 2323 -2884 -12296
4682 -12296 5112 5038 -37428 -81666 -72177 -13032 -17730 -1884 39303 52855 43140 31937 10898
4669 10898 10563 30931 36841 10703 -15035 -30817 -42912 -26154 -60109 -41995 -463 40574
4657 40574 87920 72315 -227 32186 62601 28454 -26679 -61596 -51899 5955 28932 27692
4645 27692 66177 119246 131746 75225 19063 -46405 -20423 41345 70257 82970 84303 61194
4633 61194 20743 73281 87875 40957 8855 486 -40581 -47689 1863 8974 -8126 -4418 2345
4620 2345 -15220 6858 42637 27150 21223 32279 38651 -7969 -64408 -59640 -77656 -53629 -68319
4607 -68319 -105592 -48642 4651 8425 21117 8600 -18674 -64411 -64877 -40046 -20410 4990
4595 4990 32602 36965 77449 128655 120323 62294 -31256 -42850 -16747 18114 20747 -1669 -8495
4582 -8495 -13424 -9333 9226 14883 -1538 -33339 -21041 25386 27435 -28757 1769 27523 24211
4569 24211 -1465 -34273 -32374 -70127 -91491 -76655 -52902 -15321 -27733 -43975 -33706 -13373
4557 -13373 41639 63152 -2002 -27061 79 7296 41582 64156 81737 127319 66255 -4510
4545 -4510 -37213 -53252 -34162 -6745 -18535 7265 51982 83136 70847 61629 50614 13506
4533 13506 -8713 -27243 -48873 -25649 1734 -4596 16571 23548 59426 39819 63562 57459
4521 57459 -3610 -10941 -6730 -21217 14491 39539 78354 74016 23153 -28427 -25405 -9243 -1164
4508 -1164 135 34994 8076 -8027 -7015 5272 -25339 -74172 -75630 -72898 -60621 -50816 -14339
4495 -14339 -27303 -6250 7950 24699 41058 45866 53515 44235 36726 21477 -4363 -6812 -40725
4482 -40725 -61934 -57520 -27112 -16037 3705 18628 74767 62984 14284 11578 16397 13236 31470
4469 31470 42096 12978 20239 31212 27518 37557 14990 -18064 -7851 26215 29680 28246 20826
4456 20826 -21854 -35809 -29893 12575 18089 -2364 -27652 -9370 29256 27433 -9218 -19206 -1662
4443 -1662 7985 28205 33279 35973 -3446 -16484 -49393 -67569 -15730 -9594 -13202 -27377 -46530
4430 -46530 -33424 20666 43835 5866 -7144 -21196 -52848 -96086 -78753 -41371 -29774 -226
4418 -226 -39760 -30130 -24809 -2060 -27362 -19433 -14643 -2585 -7720 14004 -1056 -13798 -15091
4405 -15091 -29455 -49742 -87009 -73219 -31933 14622 56933 41629 37430 28337 24293 57868
4393 57868 72090 70494 47926 -5272 -31830 -48078 -64232 -35562 -19087 -33614 -39111 -8314
4381 -8314 60067 63989 42256 10736 10973 16365 32770 25055 30002 67204 65546 62390 26015 1017
4367 1017 -22606 -32723 -39789 -67268 -26367 171 3080 5142 2088 -4545 23498 49464 28114
4354 28114 25851 48237 25416 -39346 -75452 -68839 -68561 -83001 -60614 -54573 -28858 34513 75025
4341 75025 10428 -710 -11145 -30414 -7373 23160 45930 50862 23082 -17779 -58656 -30313
4329 -30313 26579 2979 -60795 -52360 -43110 5485 36222 32926 58156 67037 47235 -6893 -32478
4316 -32478 -23370 -22071 12290 7485 -36401 -52290 -52043 -19597 -17869 -39309 -14082 -30779 -37413
4303 -37413 -12042 5922 7182 7085 5172 -11475 16907 71255 49786 18378 30667 62764 71740
4290 71740 18525 -30283 -57716 -41430 -20574 4225 1683 -2230 817 -6953 2706 -14271 -33850
4277 -33850 -5135 -15292 -10471 -31225 -42612 -12975 -13873 20258 25180 -7098 -19915 15295 68989
4264 68989 76958 70719 48387 21016 -2510 -6148 -4693 -14838 24202 56838 36427 -10802 -45420
4251 -45420 -37522 28742 70056 51214 11272 15759 52525 103540 89513 26114 -3294 28879
4239 28879 929 20365 75385 56236 -9619 24970 45528 58490 86548 68971 31151 42567
4227 42567 24200 40672 53274 55522 21325 -5123 3938 5310 27194 -8650 -9310 -4209 -7334
4214 -7334 34089 67788 80502 16068 -4159 27104 42851 19876 -79817 -70965 -25391 3974
4202 3974 -17989 14225 22304 3439 9686 43285 46963 -49816 -29325 76988 88775 43452
4190 43452 16451 -47419 -66745 -37999 -54573 -49249 -30943 13922 34283 35697 20038 10859
4178 10859 45603 14925 -14523 -20823 -4276 2059 48540 19491 -1972 -7859 4651 -34313
4166 -34313 -110934 -111495 -68318 -19721 -16396 -45458 -29019 -43957 -40192 -39573 -12451 -7408 -23301
4153 -23301 -25554 -16709 1734 11180 42425 59272 29820 -18429 -46437 -51624 -36471 -10152 -18155
4140 -18155 -23092 -30312 -13291 -30867 -22141 4911 -39792 -47201 -7783 26618 2149 -27869 -5740
4127 -5740 -4138 19281 -22445 -51723 -27867 -15039 -8622 -14624 16738 23519 -25387 -20462 31705
4114 31705 27553 -328 12194 36597 28709 16000 3821 8723 2876 11791 11062 18916 -16147
4101 -16147 -46058 -70616 -54886 -51354 -21753 29957 60513 44367 45108 25570 -8106 -50742
4089 -50742 -31828 14409 55 11971 14001 -6835 38366 76564 48558 32874 47598 53593
4077 53593 27872 -11386 -49286 -17592 1804 14715 6140 -29889 -28111 12385 29765 23517
4065 23517 22418 15034 6295 20617 57633 42641 -17537 -59265 -31827 -24080 5385 7560 -21776
4052 -21776 -63085 -72643 -57828 -14345 36697 43543 55698 37954 9797 8399 50829 61614
4040 61614 78683 36504 39624 2999 -17182 10893 5299 23317 -4859 -22121 -12539 -2621 7001
4027 7001 3520 -8991 -14627 -22096 -36968 -40952 -24342 44624 72902 69917 32425 -5956 -19311
4014 -19311 -17818 5886 21019 -10752 -17356 -5215 6089 7204 4378 -4516 6243 12342 -10658
4001 -10658 -4248 -15460 -16824 -30189 5171 34652 15012 48485 13576 385 2396 16201
3989 16201 30824 41372 85674 66779 8122 -28964 -42685 -53021 -63164 -48793 -17197 -44457
3977 -44457 -60158 -76455 -56043 -23206 -44091 -50218 -20536 -6059 3579 153 34223 9372
3965 9372 -9554 -22515 -24794 -45380 -65024 -40376 -42571 10956 48453 37048 -7589 -19060
3953 -19060 -16029 -18887 19665 11385 -27625 -56311 -12255 54060 42519 36525 -1243 -15967 -1143
3940 -1143 2557 3892 6286 21500 24765 31993 38916 13160 38046 33723 20130 9756 9942 8548
3926 8548 -8528 -35252 4140 23069 -38459 -42496 -10468 -29012 3583 34036 10238 -9812
3914 -9812 53048 85477 76176 72850 43345 -4700 9411 30154 3887 12368 39184 19749 10393
3901 10393 -16508 -36384 -54519 -43809 -8086 38117 49569 4412 -49629 -72245 -23930 -4641
3889 -4641 37606 97411 99396 61014 22121 -7559 24950 6242 1835 16892 18812 19435 -3743
3876 -3743 -15093 26339 23015 -6326 -13494 -20382 40457 36942 30777 27509 -20887 -54039 -39413
3863 -39413 -40946 -56586 -26554 -2586 9823 -13120 -40267 -20176 -12595 13655 49775 75951
3851 75951 59638 18605 12450 34153 32433 -19598 -65806 -36841 -2754 47055 68304 25723
3839 25723 -3924 -24334 -44740 -2093 -22670 -10698 12205 2424 1221 -5973 41031 -3305
3827 -3305 -54182 -59925 -31982 -4168 8619 28704 45814 35738 -43497 -48174 -19111 12012
3815 12012 40102 41124 -6823 -37058 -38131 -50653 -31684 -7691 16381 18361 -837 -22674
3803 -22674 -9519 -26122 -37777 -64909 -103736 -115653 -115799 -88101 -66599 -33923 -1314 24032
3791 24032 17724 -11007 -48077 22097 6233 8127 -2269 10576 24922 15774 25688 53361 35476
3778 35476 -4229 9923 35108 76374 89178 27854 -6255 -17317 -22189 2947 10308 26858
3766 26858 14440 -19904 -32526 -50964 -1894 25714 54586 50216 -4835 -64096 -49097 -48977
3754 -48977 -46790 -21621 16722 38138 30150 23312 31068 58969 71276 22692 -33908 -35630 -11581
3741 -11581 7407 -686 -49012 -58865 -22847 -8211 33102 32869 8219 -5631 -32517 -15602 4358
3728 4358 12896 27782 -8909 -64145 1059 39023 -2057 -34791 -26588 -9650 -52574 -77654
3716 -77654 -85695 -102400 -89782 -108184 -72872 -48619 -53067 -29143 -35563 -49718 -30558 -44536
3704 -44536 -64547 -10193 39501 56501 45537 11875 -18508 6428 39840 20035 20217 31500
3692 31500 36534 65058 41067 7927 21379 51529 59186 79394 58530 21071 -7975 7185
3680 7185 -21248 -22084 -33735 -37950 -63567 -63028 -36928 -53141 -87296 -53191 -6461 -1654 4685
3667 4685 -21444 -54155 -78197 -67753 -28467 -48062 -22817 3080 19039 -3621 -12003 -21105
3655 -21105 -23652 -3039 -10066 -16036 -11247 -38812 -26837 -5023 -5614 8904 13245 12229 -28822
3642 -28822 -12961 -1720 2148 20109 24067 12644 -29126 -65818 -28299 -23611 -12618 -20713 -45057
3629 -45057 -63514 -50742 -42806 -14497 -28983 -3096 9903 -39203 -50304 -66728 -43203 -4866
3617 -4866 -21024 -6307 -7117 -70448 -113710 -87504 -33535 -25294 -26570 5374 24620 26326 49727
3604 49727 53208 73551 46409 50954 52807 36263 -438 3343 -34615 -21592 -21239 -52833 -37573
3591 -37573 -14132 -14893 -12008 -27306 -42734 -32866 -56125 -73563 -50407 -19356 -15413 -51199 -57060
3578 -57060 -27058 -15787 -8511 -64063 -67452 -35226 4839 27553 7351 -2595 -67296 -67327 -77658
3565 -77658 -97372 -94156 -79458 -41113 -47496 -37665 -16178 14933 63911 34894 -5317 -14373 -2663
3552 -2663 -497 -6293 -19812 -41271 -16357 23771 20072 -15098 16202 -6047 -39389 -22213 61232
3539 61232 66312 66794 68345 25479 -19994 -57379 -62394 6088 57456 87744 95110 116278 90151
3526 90151 53531 53870 71083 72677 58238 13346 -64274 -64505 -13769 -4807 -5592 18065 39720
3513 39720 66562 67606 42070 37216 12448 -28601 -18097 -28627 -93752 -58842 -28130 10126
3501 10126 83994 62589 2672 -1138 -4241 -20734 -30249 -6137 32111 36880 72983 63801 49746
3488 49746 74113 51327 -24956 -37666 -60331 -76981 -109945 -136179 -94623 -2816 14153 21765
3476 21765 30873 -17012 -47779 -23985 2072 -14296 -20821 -18573 -15605 22605 22001 -31804 -47979
3463 -47979 -53210 -59618 -27001 -39083 -37009 -31543 -33105 -69311 -34816 -49172 -35383 -30908 -1007
3450 -1007 66294 43246 16075 33821 47704 15561 28467 58537 29070 25041 6032 14938
3438 14938 15183 -13799 -49617 -37602 -25077 -57042 -74309 -52820 -10846 9417 -15449 3121
$$ [...]
##END NTUPLES=NMR SPECTRUM
##END=
