##TITLE=Analysis number 317726
Compound Code cc 49908
Book Reference 458/94
Project Code adrs
Chemist Name stevem
##JCAMPDX= 6.0         $$ Bruker NMR JCAMP-DX V2.0
##DATA TYPE= NMR SPECTRUM
##DATA CLASS= NTUPLES
##ORIGIN= Bruker BioSpin GmbH
##OWNER= nmr
$$ XWIN-NMR		Version 3.5
$$ Wed Mar  1 14:22:04 2006 GMT Standard Time (UT+0h)  MAYBRIDGE\nmr@NMR_250MHZ
##.OBSERVE FREQUENCY= 250.131544655141
##.OBSERVE NUCLEUS= ^1H
##.ACQUISITION MODE= SIMULTANEOUS (DQD)
##.ACQUISITION SCHEME= undefined
##.AVERAGES= 16
##.DIGITISER RES= 18
##SPECTROMETER/DATA SYSTEM= dpx250
##.PULSE SEQUENCE= zg30
##.SOLVENT NAME= CDCl3
##.SHIFT REFERENCE= (INTERNAL, CDCl3, 0, 16.4127)
##AUDIT TRAIL= $$ (NUMBER, WHEN, WHO, WHERE, WHAT)
$$ ##TITLE= Audit trail, XWIN-NMR		Version 3.5
$$ ##JCAMPDX= 5.01
$$ ##ORIGIN= Bruker BioSpin GmbH
$$ ##OWNER= nmr
$$ C:\u/data/dgb/nmr/ADRS/17230/pdata/1/auditp.txt
$$ ##AUDIT TRAIL=  $$ (NUMBER, WHEN, WHO, WHERE, WHAT)
(   1,<2006-03-01 14:21:42.54 +000>,<MAYBRIDGE\nmr>,<NMR_250MHZ>,
      <created by zg, POWCHK disabled, PULCHK disabled
       configuration hash MD5:
       84 BC 41 DB A1 6E 1D 46 DA 25 12 A5 C1 ED C5 3A
       data hash MD5: 64K
       26 AE EA E5 F9 F7 B1 D9 2F 5F D8 2B CE 5A 11 FD>)
(   2,<2006-03-01 14:21:55.03 +000>,<MAYBRIDGE\nmr>,<NMR_250MHZ>,
      <Start of raw data processing
       ef LB = 0.3 FT_mod = 6 PKNL = 1 SI = 32K 
       data hash MD5: 32K
       7C 1F 2F 09 94 61 7B 52 8A EC 92 C0 94 E6 50 42>)
(   3,<2006-03-01 14:21:57.12 +000>,<MAYBRIDGE\nmr>,<NMR_250MHZ>,
      <apk 
       data hash MD5: 32K
       E8 C0 D3 34 8C 66 F3 C7 99 7C A3 32 11 07 50 83>)
(   4,<2006-03-01 14:21:57.83 +000>,<MAYBRIDGE\nmr>,<NMR_250MHZ>,
      <abs ABSG = 5 
       data hash MD5: 32K
       05 80 49 B3 3D 3A 1F 8C 8E 53 29 C4 75 5D 3A 5A>)
$$ ##END=
$$ 
$$ hash MD5
$$ 9E 25 D0 C9 F0 AD A6 D3 AA 81 BB 56 FA F4 6A 12
##$RELAX= 
##$RELAX= 
##$RELAX= 
##$RELAX= 
##$RELAX= 
##$RELAX= 
##$RELAX= 
$$ Bruker specific parameters
$$ --------------------------
##$DU= <C:\u>
##$EXPNO= 17230
##$NAME= <ADRS>
##$PROCNO= 1
##$TYPE= <nmr>
##$USER= <dgb>
##$AMP= (0..31)
100 100 100 100 100 100 100 100 100 100 100 100 100 100 100 100 100 100 
100 100 100 100 100 100 100 100 100 100 100 100 100 100 
##$AQSEQ= 0
##$AQ_mod= 3
##$AUNM= <au_zg>
##$AUTOPOS= <37 >
##$BF1= 250.13
##$BF2= 250.13
##$BF3= 250.13
##$BF4= 250.13
##$BF5= 500.13
##$BF6= 500.13
##$BF7= 500.13
##$BF8= 500.13
##$BYTORDA= 1
##$CFDGTYP= 0
##$CFRGTYP= 5
##$CHEMSTR= <none>
##$CNST= (0..31)
1 1 145 1 1 1 1 1 1 1 1 1 1 1 1 1 1 1 1 1 1 1 1 1 1 1 1 1 1 1 1 1 
##$CPDPRG= <>
##$CPDPRG1= <>
##$CPDPRG2= <>
##$CPDPRG3= <>
##$CPDPRG4= <mlev>
##$CPDPRG5= <mlev>
##$CPDPRG6= <mlev>
##$CPDPRG7= <mlev>
##$CPDPRG8= <mlev>
##$CPDPRGB= <>
##$CPDPRGT= <>
##$D= (0..31)
0 1 0 0 0 0 0 0 0 0.06 0 0 0 0 0 0 0.0002 0 0 0 0 0 0 0 0 0 0 0 0 0 0 
0 
##$DATE= 1141222901
##$DBL= (0..7)
120 120 120 120 120 120 120 120 
##$DBP= (0..7)
150 150 150 150 150 150 150 150 
##$DBP07= 0
##$DBPNAM0= <>
##$DBPNAM1= <>
$$ [...]
##$SUBNAM7= <"">
##$SUBNAM8= <"">
##$SUBNAM9= <"">
##$SW= 20.6930455092707
##$SWIBOX= (0..15)
0 0 3 0 0 0 0 0 0 0 0 0 0 0 0 0 
##$SW_h= 5175.983436853
##$TD= 65536
##$TD0= 1
##$TE= 293.16
##$TE2= 300
##$TE3= 300
##$TEG= 300
##$TL= (0..7)
0 120 120 120 120 120 120 120 
##$TP= (0..7)
150 150 150 150 150 150 150 150 
##$TP07= 0
##$TPNAME0= <>
##$TPNAME1= <>
##$TPNAME2= <>
##$TPNAME3= <>
##$TPNAME4= <>
##$TPNAME5= <>
##$TPNAME6= <>
##$TPNAME7= <>
##$TPOAL= (0..7)
0.5 0.5 0.5 0.5 0.5 0.5 0.5 0.5 
##$TPOFFS= (0..7)
0 0 0 0 0 0 0 0 
##$TUNHIN= 0
##$TUNHOUT= 0
##$TUNXOUT= 0
##$USERA1= <user>
##$USERA2= <user>
##$USERA3= <user>
##$USERA4= <user>
##$USERA5= <user>
##$V9= 5
##$VALIST= <valist>
##$VCLIST= <CCCCCCCCCCCCCCC>
##$VD= 0
##$VDLIST= <DDDDDDDDDDDDDDD>
##$VPLIST= <PPPPPPPPPPPPPPP>
##$VTLIST= <TTTTTTTTTTTTTTT>
##$WBST= 1024
##$WBSW= 4
##$XGAIN= (0..3)
0 0 0 0 
##$XL= 0
##$YL= 0
##$YMAX_a= 547661
##$YMIN_a= -705552
##$ZGOPTNS= <>
##$ZL1= 120
##$ZL2= 120
##$ZL3= 120
##$ZL4= 120
##$ABSF1= 16.41272
##$ABSF2= -4.280451
##$ABSG= 5
##$ABSL= 3
##$ALPHA= 0
##$AQORDER= 0
##$ASSFAC= 0
##$ASSFACI= 0
##$ASSFACX= 0
##$ASSWID= 0
##$AUNMP= <proc_1d>
##$AZFE= 0.1
##$AZFW= 0.1
##$BCFW= 0
##$BC_mod= 0
##$BYTORDP= 0
##$COROFFS= 0
##$CY= 12.5
##$DATMOD= 1
##$DC= 0
##$DFILT= <>
##$DTYPP= 0
##$F1P= 14.0000005364418
##$F2P= -0.99999901652339
##$FCOR= 0.5
##$FTSIZE= 32768
##$FT_mod= 6
##$GAMMA= 0
##$GB= 0
##$INTBC= 1
##$INTSCL= 1
##$ISEN= 128
##$LB= 0.3
##$LEV0= 0
##$LPBIN= 0
##$MAXI= 10000
##$MC2= 0
##$MEAN= 0
##$ME_mod= 0
##$MI= 0
##$NCOEF= 0
##$NC_proc= -3
##$NLEV= 6
##$NOISF1= 0
##$NOISF2= 0
##$NSP= 0
##$NTH_PI= 0
##$NZP= 0
##$OFFSET= 16.41272
##$PC= 1
##$PHC0= -112.9148
##$PHC1= 5.712057
##$PH_mod= 1
##$PKNL= yes
##$PPARMOD= 0
##$PSCAL= 4
##$PSIGN= 0
##$REVERSE= no
##$SF= 250.130027331794
##$SI= 32768
##$SIGF1= 0
##$SIGF2= 0
##$SINO= 400
##$SIOLD= 32768
##$SREGLST= <1H.CDCl3>
##$SSB= 0
##$STSI= 32768
##$STSR= 0
##$SW_p= 5175.98343685301
##$SYMM= 0
##$S_DEV= 0
##$TDeff= 65536
##$TDoff= 0
##$TI= <Analysis number 999999
Compound Code 99
Book Reference 9
Project Code 9>
##$TILT= no
##$TM1= 0
##$TM2= 0
##$TOPLEV= 0
##$USERP1= <user>
##$USERP2= <user>
##$USERP3= <user>
##$USERP4= <user>
##$USERP5= <user>
##$WDW= 1
##$XDIM= 32768
##$YMAX_p= 360045520
##$YMIN_p= -110015
$$ End of Bruker specific parameters
$$ ---------------------------------
##NTUPLES= NMR SPECTRUM
##VAR_NAME=  FREQUENCY,     SPECTRUM/REAL,   SPECTRUM/IMAG
##SYMBOL=    X,             R,               I
##VAR_TYPE=  INDEPENDENT,   DEPENDENT,       DEPENDENT
##VAR_FORM=  AFFN,          ASDF,            ASDF
##VAR_DIM=   32768,         32768,           32768
##UNITS=     HZ,            ARBITRARY UNITS, ARBITRARY UNITS
##FACTOR=    0.157963299565203, 1,           1
##FIRST=     4105.31403379415, 0,            0
##LAST=      -1070.66940305886, 0,           0
##MIN=       -1070.66940305886, -110015,     0
##MAX=       4105.31403379415, 360045520,    0
$$ Real data points
##PAGE= N=1
##DATA TABLE= (X++(R..R)), XYDATA
$$ [...]
19503a2926Q511M3123j2510q937J0352L4291j2639k3046p834O11j8936k6020p334
19490c3294L0412m717l6583p815k431K1024J6397k9451r361J7601L2766o174j5561
19477b7187J9088P166J6526K9557J496k4254l7926k4249r32L6764J9077N612j0727
19464A0011l6680o548L1723K281J2781j6015l0806j7450K6628J0069n976O898
19452a3084j582N418M252J6254K9006k745j631j0462j9396j0866P870l136k6238
19439b6340l24p293N982n896R538j9989m759J4022k0005j0432L8905K4468p717
19426i840K044J1261j2682K904R59o373j265K2769L463q715M316O017l938P408
19412A8328j1816j5502J2884K2162l471k8k7648j133J1125J4131o909p213J7841
$$ y = [-12926, -4415, 38708, 26198, 17261, 27613, 61904, 49265, 26219, 18385, 18996, 60, -25960, -33294, -2882, -7599, -44182, -51997, -54428, -33404, -17007, -46458, -55819, -38218, -5452, -11626, -27187, -8099, -933, 15593, 45150, 46646, 22392, -15534, -39783, -40715, -3951, 15126, 20738, 10011, -26669, -33217, -1494, 787, 13568, -2447, -33253, -50703, -24075, -14006, -19982, -13084, -14666, -9248, -4996, 11258, 40264, 37519, 35888, 25426, 6030, -4836, 3034, -102, -26340, -26664, -33957, -27975, -33871, -24333, -44322, -49081, -35059, -55064, -65496, -26591, -2123, -9840, -7796, 3465, -9217, -6313, -5354, -11727, -12992, 9777, 13240, 4525, 8841, 14858, 10920, 18328, 6512, -8990, 3894, 26056, 22585, 22557, -5091, -6224, 4901, 19032, 12123, 4910, 22751]
19399B2751j0149n578j0773l205n320O836J8114m125j604j473o125n305R084N355
19385H483j3537q229K5201N083l640J7084J7764J2939k1651j6041o557j2969J6030
19372A9960K281k4014j0172l070J6097l350J6689n175J6299Q843K9986j0122m2131
19359A2121o7O401K826Q034J3269Q25p870J7668J5059j7489k0896k4955j5523
19346a0597j2576j170q233N889K66J0844j63J5236j1048j9230j8463q52K8995
19333b1102O142j743L641j6705K0496L8437r385m477k109M936J7466J4491L382
19320E3470j4159k1142J0788J3071j0018J1090L503M48R518O308j4864r262O033
19307D4784j1847l384R820J3139p122j2793l612J6206k637j3767j0306j5230j5383
$$ y = [22751, 12602, 7024, -3749, -6954, -12274, -5438, 12676, 8551, 6947, 5474, -651, -5956, 3128, 8483, -5054, -13283, 11918, 17001, 13361, 30445, 48209, 61148, 39497, 23456, 16899, 3930, 19960, 22241, -1773, -11945, -15015, 1082, -2268, 14421, 9246, 25545, 34388, 64374, 54252, 12121, 12054, 18455, 21281, 29315, 42584, 43409, 35539, 53207, 68266, 50777, 29881, 4926, -10597, -23173, -24343, -32576, -26687, -26421, -15577, -15740, -504, -11552, -30782, -49245, -50097, -21102, -14960, -16703, -13062, -29767, -9271, 29166, 19781, 15304, 13195, 18131, 35597, 50088, 53470, 39311, 18169, 28957, 42028, 32010, 43100, 46603, 47051, 56569, 62877, 48013, 38751, 44784, 32937, 29553, 39373, 52512, 45390, 32597, 28985, 45191, 42554, 28787, 18481, 3251, -12132]
19294a2132K3309l828k3297j6768K5970L6776Q944n300l349J6281J8608k5189
19282D0025l7519R750J4976k232o19q762n620k1104m039J739K2233j8840J3619
19269C607Q810p448l407r890P574K6141k520j252q799M903j1665j0925r914K9418
19255A4633j8293k1332J8060j3952Q662J7326j039J512J7964J3194J722k258k5333
19242A0866l5414K7104J2803k3841k2028J4607O698m860j3051J7382J8777L316
19230A2359Q941J1297R585l6541j4718K9845j0137R497J7950r445j3630L1027
19218D6030K6831l3207l7052m373J5052J4022J5902r248R779j1744m656K620j147
19205B8809L3511j3898k9452j6964J5232K4445l039L32k9043k7446O028Q287J1578
$$ y = [-12132, 11177, 7349, -15948, -32716, -6746, 30030, 38974, 33674, 30325, 46606, 65214, 40025, 2506, 12256, 27232, 25000, 24381, 15619, 9999, -11105, -15144, -13405, 8828, -10012, 3607, 12417, 4969, 1562, -8328, -754, 25387, 22867, 21615, 12816, 17719, 6054, -4871, -14785, 14633, -3660, -24992, -6932, -20884, -12222, 5104, 4065, 5577, 23541, 36735, 38457, 36199, 10866, -24548, 2556, 15359, -8482, -30510, -15903, -9205, -14065, -27116, -9734, 9043, 12359, 21300, 32597, 42182, 5641, -9077, 20768, 10631, 20128, 38078, 28633, 15003, 46030, 72861, 39654, 2602, -1771, 13281, 27303, 43205, 33957, 43736, 31992, 27336, 29956, 28809, 62320, 48422, 18970, 2006, 17238, 41683, 38644, 38976, 9933, -17513, -11485, -3198, 8380]
19192H380M762R556o542j0071J2692n926k016K1911J0687k5467O311J6920p253
19179C3944k5869k8368J7757L2580L799k5794J7440J3412r356O735r75k1642M640
19166A8303J5756j9310M104M0034j0702m3125p412K7851J9208j9527j4048j7493
19154f361m264Q382K828K1507K6495l3742N532L481l2946j8046J1444K4075J2961
19141B1346m71k316j4420k6641q841K561J1527J367o090J6308Q849J3378Q494
19128B5051J2533n027J8727k4523o068j721j6423k9640L3074J300k5694J896K1045
19115D530k4940j2362J6699J8308K7042J1022j7194l430J3220N606j876m714j0790
19102B1121o764j7054r942J2354L448j5787j8070J1837L579R595J7336J187j8028
$$ y = [8380, 13142, 22698, 16156, 6085, 18777, 12851, 10835, 32746, 43433, 17966, 24277, 41197, 33944, 8075, -20293, -2536, 30044, 33843, 8049, 25489, 38901, 29545, 36280, 35305, 13663, 18303, 34059, 14749, 18853, 58887, 48185, 5060, -2352, 25499, 44707, 25180, 11132, -6361, -10625, -2243, 585, 22092, 48587, 14845, 20377, 23858, -9088, -27134, -15690, 8385, 21346, 20875, 18559, 4139, -22502, -31343, -28782, -17255, -15888, -21978, -5670, 3179, 16557, 25051, 37584, 32557, 51284, 26761, 20693, 18972, 2549, -27091, 5983, 7283, -18411, -16515, 4530, -20410, -32772, -16073, 2235, 29277, 40299, 23105, 19675, 32895, 38501, 36625, 31911, 21121, 14357, -2697, -12639, -285, 3163, -12624, -30694, -18857, -15278, -5683, 11653, 12840, -5188]
19089e188J3976j0908J3674K4317k9950j4944J3137J2297j9149k985p060M870
19077g913L4481R484J180Q022Q769j2381k6800j5543K2634K9103l5239J0539N213
19064C1549m310j1128j6894r343J1853K1342k422j1227m910P001R236o253J2145
19051B6639j5428k5808j1701L0927q353n0R574k2508j1929J4797K5059J3568j2549
19038A2238k2832J9082k1705j5137J2636J4503P084m821n172j2868r071j9733
19026d5796L7212N3407J820p859j7080j8554k5047J0901J3641J1390r409Q907
19014A3533K896k3628J1278L146N267m802L1555J3164k786j6278o882j3975l109
19001I379N458N801Q664R055n24J7592j998j5781K1106O78J1954K9627j3867K0900
$$ y = [-5188, 8788, -2120, 11554, 35871, 5921, -9023, 4114, 16411, -2738, -5723, -12783, -7913, 26568, 36052, 37232, 45254, 54023, 41642, 14842, -701, 21933, 51036, 15797, 26336, 31549, 27239, 16111, -783, -10126, 1727, 23069, 20647, 9420, 4510, 11511, 20747, 14494, 26639, 11211, -14597, -26298, 4629, -3724, -3774, 5800, -16708, -28637, -13840, 11219, 24787, 12238, -10594, 8488, -13217, -28354, -15718, -1215, 5869, 1048, -4124, -16992, -26063, -45796, -8584, 44823, 46643, 38784, 21704, 3150, -21897, -10996, 2645, 14035, 4626, 13533, 16429, -7199, 4079, 7225, 12492, 7690, 39245, 52409, 49623, 33345, 26463, 12488, 9379, 14837, 20638, 29302, 38357, 37833, 55425, 53427, 37646, 58752, 59430, 71384, 101011, 87144, 108044]
18987A08044j2779n937k8865j4514M936J5683J0035k9578n9759j6927O945J7699
18975e017J1064P809J9848K5902O152j3013j0584j7971k611K6284J2572j2209
18963D8226r410J1154L899R905r357R956Q176Q150j5107l160j0586L5599O155
18950I3600K9074J7536K1107N5846L0204K8025m378k5928p319k1288r396j5338
18938A91745p631n6J7436K4126K4973J3262k0433k5724k5512l1492l3999p062
18926A19633J28k2076j4940l8217k0479R790K5010J7085Q400k804l1781Q753K6569
18913H5071j143m420l2851m474K8184J6225J2453O56j9999K74l862K741M8503
18900A27358L9309M4492O6152M5668p981j7376q768j5004l1173m3606J0610O200
$$ y = [108044, 95265, 89328, 60463, 45949, 50885, 66568, 76603, 47025, -12734, -29661, -22716, -5017, 6047, 13856, 33704, 59606, 65758, 52745, 42161, 24190, 21579, 47863, 60435, 48226, 38816, 49970, 53869, 63774, 54417, 64373, 72549, 80699, 65592, 62432, 51846, 87445, 93600, 122674, 140210, 161317, 217163, 247367, 275392, 271014, 245086, 237767, 216479, 207083, 191745, 184114, 184058, 201494, 225620, 250593, 263855, 243422, 217698, 192186, 160694, 126695, 119633, 119761, 97685, 82745, 44528, 24049, 33839, 58849, 75934, 84334, 81530, 49749, 58502, 85071, 83928, 79508, 46657, 42183, 70367, 86592, 99045, 99701, 79702, 79976, 76114, 78855, 127358, 166667, 211159, 277311, 322979, 314998, 297622, 288854, 273850, 242677, 199071, 209681, 215881]
18888B15881K5649M4085L6370K349k7931p4774m9688l5332k4074j2751j5341l178
18876H1265l635J8181j9483k4942N354Q127K494K0005q845k101j3233J5526P150
18863H5863l2604j966k1585N549k525q773j7412k5827j4967m425J1528N4049K8401
18850E5306J8138l1363j1345K6911K5326o170o067j197j0875m654q74j6173l1418
18837E545o178l325r48n291J2704M2219L9732J4130j8716j420K4652N594m426
18824A04272O4248N3003K0081M599L50l2454k1264l237L146L0224K0788L2184
18812B75940J0975k104k9859n0598m1029l5712j244K56r014K2217K7907p118k0760
18799A39857K1507k7250j6562l0557p473J1208r417Q093J1210j316K1307J2944
$$ y = [215881, 241530, 285615, 321985, 324334, 296403, 221629, 171941, 136609, 112535, 99784, 84443, 81265, 77630, 95811, 76328, 51386, 56740, 64867, 67361, 87366, 78521, 76420, 63187, 78713, 85863, 53259, 51293, 29708, 35257, 32732, 23959, 6547, -19280, -34247, -38672, -27144, 26905, 55306, 73444, 42081, 30736, 57647, 82973, 76803, 70736, 69539, 58664, 54010, 53136, 36963, 5545, -633, -3958, -4906, -10197, 2507, 44726, 84458, 98588, 79872, 78452, 103104, 108698, 104272, 168520, 221523, 241604, 246203, 246553, 214099, 192835, 189598, 192744, 222968, 243756, 275940, 286915, 284811, 254952, 204354, 163325, 127613, 126369, 126625, 117611, 139828, 167735, 160617, 139857, 161364, 134114, 117552, 86995, 79522, 90730, 81313, 89406, 100616, 99300, 120607, 133551]
18787A33551p44j0852J7070J7868J5469O0535K4277j2930K7988M6808K9788K892
18775C51720l319j5141j7371k8269P441L2339N4650R3996R9499R4576P4015J6838
18763G60974j9239r1095j39354j36083l4363L5164L8645j657k4633l8491n8680
18752B91188m3255q817O705l2481p951j0744p119l6649j1918K1422q747l8700
18740A12934K1373Q529J0217N6k8261J641K4965K6543K1446N045K288J0010j6168
18727B00618j7246j5402K3644K3823J3343L6949M3901N8046K8459k1234m8921
18716C25980k5764k7893j7504r843N93M5559L2112k0213k8769k8670m8325o129
18704A91134J1378j7371L850j6254m1920k4466j9186K2977K7565O168J6754J473
$$ y = [133551, 132807, 121955, 139025, 156893, 172362, 232897, 257174, 244244, 272232, 319040, 348828, 351720, 348401, 333260, 315889, 287620, 295061, 327400, 382050, 476046, 575545, 670121, 744136, 760974, 741735, 650640, 511286, 375203, 340840, 376004, 414649, 412992, 388359, 349868, 291188, 247933, 239116, 245821, 213340, 205389, 194645, 187526, 150877, 138959, 160381, 151634, 112934, 134307, 142836, 153053, 153109, 124848, 126489, 151454, 177997, 199443, 204488, 206776, 216786, 200618, 183372, 167970, 191614, 215437, 228780, 265729, 309630, 367676, 396135, 374901, 325980, 300216, 272323, 254819, 244976, 245569, 291128, 323240, 303027, 274258, 245588, 197263, 191134, 202512, 185141, 188991, 172737, 130817, 106351, 87165, 110142, 137707, 143875, 160629, 162102]
18692A62102m462J7550j2380k177R415k6864l4006j5465j3757Q490J8788l953
18680A03281l077J2435J0555l0681q03N052j5177j3455P600O853J1011O147R957
18667A09698o828J3502Q4M714J2748M7245P450M082L0586K4232K1445q169l0081
18654B30708l2393k5848N015L0302K634N009M2834J2680L6242Q95j5744o685n0929
18641B34720l2802l5214k6455J4999j102j4994M932K7703k8320K686J8559j3363
18629A51349n320p435O636q40O82p477j005L0331O657n35k1750k5942j8531p749
18615I9071K9941M9218L1852L8576N2958P006J2384K5027M320K565Q42J1811j7297
18602C48274m084K9758J6906n93J824j2001L1342K1349j1785l5543l6913m3091
$$ y = [162102, 157640, 175190, 162810, 160633, 170048, 143184, 109178, 93713, 79956, 88446, 107234, 103281, 100204, 112639, 123194, 92513, 91710, 96762, 81585, 68130, 75730, 82583, 93594, 99741, 109698, 102870, 116372, 116456, 121170, 133918, 181163, 188613, 192695, 223281, 247513, 268958, 260789, 230708, 198315, 172467, 177482, 207784, 210418, 215427, 258261, 270941, 307183, 308078, 292334, 285649, 234720, 201918, 166704, 140249, 155248, 154146, 139152, 144084, 171787, 143467, 146153, 164712, 151349, 146029, 138594, 145230, 144390, 145072, 137595, 136590, 166921, 173578, 173043, 151293, 125351, 106820, 99071, 129012, 178230, 210082, 248658, 301616, 308622, 321006, 346033, 350353, 352918, 353760, 365571, 348274, 344190, 373948, 390854, 390261, 392085, 380084, 411426, 432775, 420990, 385447, 348534, 305443]
18590C05443k5019N22l4189j8842q749j4716K500M3789J4159J9968K8641L875
18578C17382L6662K9985K3795L4064O5740P3626M6607L6488L388j4861k1459M464
18566F35881k2251l7710l265J3509L2315K7303M0960L8419L794k7885p4002o5390
18554E61678l8585n7848l7858o136k2210L231M5941J0553n3059k5233l8674k7160
18542C14640k8578j1831p380k3010j0928K2004K6043J0586J5531M085K3053Q3825
18530D18040Q4458P1071N5468N5097M2158L6779K3903Q902l7311r339j617m860
18518G42749J3547M1665K2794J2765J6991J7695j4530l6864m9884n3968m6627
18507F66333o2990o0065k5071k8752j6427J5137J8680n830m2058l0396j8996k1214
$$ y = [305443, 280424, 280946, 246757, 227915, 219166, 204450, 206950, 250739, 264898, 284866, 313507, 317382, 354044, 384029, 407824, 441888, 507628, 581254, 627861, 664349, 667737, 652876, 631417, 635881, 613630, 575920, 572655, 586164, 618479, 645782, 686742, 725161, 728955, 701070, 627068, 561678, 523093, 465245, 427387, 421251, 399041, 402272, 448213, 458766, 405707, 380474, 341800, 314640, 286062, 274231, 266851, 243841, 232913, 254917, 280960, 291546, 307077, 311162, 334215, 418040, 502498, 573569, 629037, 684134, 726292, 763071, 786974, 795876, 758565, 749226, 747609, 742749, 756296, 797961, 820755, 833520, 850511, 868206, 853676, 816812, 766928, 712960, 666333, 603343, 543278, 518207, 489455, 473028, 488165, 506845, 501015, 458957, 428561, 409565, 388351]
18495C88351q024J0033P189Q304J2466K0415N296O220r431M1007K9690K128m624
18482E09020J1829K8346K4835K7903O7419P6095J09233J13256P0263N6704M0949
18471A135852J9272N2470N7641P5125J31561K11143K47359K11008J98751J58929
18461B499111P4018L6902L0349N7228J54936K65217M54373O97596J101711J734519
18451G105960K806628M276927N659589P312787O966650N152382L157481j155402
18443D1283002l632361n143530n165954l135510k97221K396621N224177O414415
18435C7943639M518149L127288p81790m354583n996015p228724o542561n154823
18427A5530580l722445k492217j622279j080748p18083m97955l21059j45253k1570
$$ y = [388351, 380327, 390360, 397549, 405853, 418319, 438734, 444030, 450250, 440819, 481826, 511516, 513644, 509020, 520849, 549195, 574030, 601933, 669352, 745447, 854680, 967936, 1038199, 1094903, 1135852, 1155124, 1207594, 1265235, 1340360, 1471921, 1683064, 1930423, 2141431, 2340182, 2499111, 2573129, 2610031, 2640380, 2697608, 2852544, 3117761, 3572134, 4269730, 5371441, 7105960, 9912588, 14189515, 19849104, 27161891, 34128541, 39280923, 42438404, 41283002, 37650641, 32507111, 27341157, 24205647, 23908426, 26305047, 31529224, 37943639, 42461788, 45589076, 44807286, 40452703, 34456688, 27227964, 20685403, 15530580, 11808135, 9315918, 7693639, 6612891, 5894808, 5396853, 5075794, 4930541, 4908971]
18418D908971L8194J09322R1503L3910q8653j68870r1239n1585R7071K28778L92953
18407E500355N96329Q37057J213721J980376L360594N052149O762108Q742597
18399C4045286P956015N942449K944321k147181m721145o411235n851712l165189
18391B8591609K54239L402251O572837P277282N166977L098550k091428n686965
18383D6585352p811906q789004p599744n933801m192563k735456j805654j258877
18375F458347r07902o67138m77618l17279k20776j23406j09768j77817k27586
18366C229057k66557k63722k16114j54893p5905m066J7346k4450l6409q2331l6287
18355B085669p6875j17034j17521j21860q5847k1021M3408N6486M4268J4600p4749
$$ y = [4908971, 4947165, 5056487, 5147990, 5181900, 5093247, 4924377, 4833138, 4781553, 4878624, 5107402, 5500355, 6096684, 6933741, 8147462, 10127838, 13488432, 18540581, 25302689, 34045286, 42001301, 47943750, 50888071, 48740890, 44019745, 37608510, 31756798, 28591609, 28845848, 32248099, 38820936, 46098218, 51265195, 54363745, 52272317, 46585352, 38773446, 29984442, 22384698, 16450897, 12258334, 9522878, 7717224, 6458347, 5550445, 4883307, 4405689, 4088410, 3867634, 3744228, 3634460, 3456643, 3229057, 2962500, 2698778, 2482664, 2327771, 2251866, 2247800, 2265146, 2240696, 2204287, 2121956, 2085669, 2008794, 1891760, 1774239, 1652379, 1566532, 1545511, 1588919, 1645405, 1689673, 1704273, 1629524]
18344A629524p6445n3803o4962m8988J3194K7587N3625M8620Q5070J50981K65944
18333B030347M64995Q13274J505987J908472R73866k1663p76516j043127o74578
18324E181057k00143K38981P80863J501241K822016N446059Q945459Q907494P002192
18315D0625219N536441L125953j737353m269267m264317m282313m902325m930589
18307B4901449n034620l917427j959859Q5020K392449M101037K242659p46308
18299B2064400k849206l926667l236665k127456j315935q59768n36032l03090
18291F909581j28529j37003j02743K7652L64814J011530J912323J918628P94641
18282A2570894k33372r27967o97007K06308J455280L309767N608970N487576K963287
$$ y = [1629524, 1553079, 1499276, 1434314, 1385326, 1398520, 1426107, 1479732, 1528352, 1613422, 1764403, 2030347, 2495342, 3308616, 4814603, 6723075, 7696941, 7675278, 6898762, 5855635, 5181057, 4980914, 5219895, 6000758, 7501999, 10324015, 15770074, 24715533, 33623027, 40625219, 46161660, 49287613, 47550260, 43280993, 39016676, 34734363, 29832038, 24901449, 19866829, 15949402, 13989543, 14074563, 16467012, 20568049, 22810708, 22064400, 19215194, 15288527, 12051862, 9924406, 8608471, 7748703, 7212671, 6909581, 6781052, 6644049, 6541306, 6568958, 6933772, 7945302, 9857625, 11776253, 12570894, 12337522, 11409555, 10712548, 10918856, 12374136, 15683903, 21292873, 26780449, 29743736]
18273B9743736J667659K575319P765639J4641384J6427333J3224751M068833j719110
18265H8395544m999983j483143K520902N11940p20556j332452k360755m826556
18257G5704941n122001p438865r963873j0010688r409058p259448m506162k396068
18249A9598778p79439P03131J079732m56948j603143k443359k569123j942891
18241A1586738j293557q58616n93887l39152k72593k75255k55750j44670O2468
18232G615726M08813Q80784J757258L356676O074965P463655L911610m03992l416384
18223B7649111m088055j931409J667126N849367O884699N874675Q235767J2551461
18215F2692742J2905923R548606M433103n594417j2612055j4809509j4484640
$$ y = [29743736, 31411395, 33986714, 41752353, 56393737, 72821070, 86045821, 90114654, 88395544, 83395561, 81912418, 84433320, 84945260, 84224704, 82892252, 80531497, 75704941, 70582940, 63144075, 53180202, 43169514, 33760456, 26501008, 21994846, 19598778, 18819339, 19522470, 20602202, 20145254, 18542111, 16098752, 13529629, 11586738, 10293181, 9434565, 8840678, 8501526, 8228933, 7953678, 7697928, 7553258, 7615726, 8024539, 8905323, 10662581, 14019257, 20094222, 27557877, 31469487, 31065495, 27649111, 23561056, 21629647, 23296773, 29146140, 36030839, 41905514, 50141281, 62692742, 75598665, 85147271, 89580374, 83985957, 71373902, 56564393, 42079753]
18208D2079753j1043712p562524n129203l371897k175446j201783l58587N90955
18200A1827556J764225K167825N27862r29669j927263k183596j688083j324612
18192H234245j113647r32247p60982o16270n21367l83842k69216k30437j03894
18183C302343o6843J192l1737q9142j92149k58632k47854k38638j31686o5398
18173A981456l3092k0354K0492R944Q3679J54310J62116J09776P2916K3292L1648
18162B596183J49627K67561L44789M82384P46050J286499K316667L910467N176295
18153A7276522M507060J621936j453225l533947l790213k835100j538051l31266
18145I923716R47447K591225M179284M270511J814912j256454l659390m352701
$$ y = [42079753, 31036041, 23473517, 18344314, 14972417, 12796971, 11595188, 11236601, 11827556, 13591781, 15759606, 16287468, 15357799, 13430536, 11246940, 9558857, 8234245, 7120598, 6188351, 5427369, 4811099, 4289732, 3905890, 3636674, 3406237, 3302343, 3235500, 3236692, 3204955, 3115813, 2923664, 2665032, 2417178, 2178540, 2046854, 1981456, 1948364, 1928010, 1948502, 1958446, 2042125, 2196435, 2358551, 2468327, 2541243, 2564535, 2596183, 2745810, 3013371, 3358160, 3840544, 4586594, 5873093, 8189760, 12100227, 17276522, 21783582, 23405518, 21952293, 18418346, 14628133, 11793033, 10254982, 9923716, 10871163, 13462388, 17641672, 21912183, 23727095, 22470641, 18811251, 14458550]
18137A4458550l685679k556034j599788j018445p17823n20072m06187l08096k37082
18128C409344j92911j40109r8090k3046M5491J00432J83439K37083K29839K82946
18118D034418L36961L29277M07433N46287P10905Q98469J320462K105887L548364
18109A4238463O547467J2033492K1186295K5922981R641083k888459j1536593
18102G5144729j2883918q695686o616414o122521m830629j682044J876371L492266
18094C9682154J751536o19526j639239q22474k61047j879772m169114n958176
18086B6084342n996017m767472l314033k214606j515715j141900r25971p34627
18078E474001n49273m11934l03278j75493j42073j15399n8228r520N1676R6432
$$ y = [14458550, 10772871, 8216837, 6617049, 5598604, 4880781, 4360709, 3954522, 3646426, 3409344, 3216433, 3076324, 2978234, 2955188, 3000679, 3101111, 3284550, 3521633, 3751472, 4034418, 4371379, 4700656, 5108089, 5654376, 6365281, 7263750, 8584212, 10690099, 14238463, 20785930, 32819422, 54005717, 79928698, 89569781, 86681322, 75144729, 62260811, 53565125, 46948711, 40826190, 35995561, 34313517, 36189888, 39682154, 41433690, 40814164, 39174925, 38352451, 38091404, 36211632, 32042518, 26084342, 20088325, 15320853, 12006820, 9792214, 8276499, 7134599, 6208628, 5474001, 4924728, 4512794, 4209516, 4034023, 3891950, 3776551, 3718323, 3708803, 3760479, 3856911]
18068C856911O9062Q1521L0065M8387P3868J62641L08454N52598R18371J574930
18058G676808K832822N119523P891272R167569O351769P79455m273953o950272
18050B8594993o636488m723757k503969m07216J929706M776853O949685O301460
18042C4281267K004355k827222o212384o875891n654774l885273k530824j673438
18034F625816j165649q27488o08426m87841m11814l55919k71845k06203j78471
18025B112160j29001o5483n0400o6194r3297r2739q8363p0583m8963l2374j7053
18014A357710m0022n1599l3245m5496n6936n6437n6057m7257l1268j8442m2448
18003H78503j1084P993K2648P111K5580O2970O6466N4957J1031L763k0182n3430
$$ y = [3856911, 3925973, 4007494, 4037559, 4085946, 4159814, 4322455, 4630909, 5183507, 6101878, 7676808, 10509630, 15629153, 23520425, 32687994, 39039763, 39819218, 35545265, 28594993, 21958505, 17234748, 14730779, 14323563, 16253269, 21030122, 27979807, 34281267, 36285622, 33458400, 27246016, 20370125, 14715351, 10830078, 8299254, 6625816, 5460167, 4632679, 4024253, 3536412, 3124598, 2768679, 2496834, 2290631, 2112160, 1983159, 1917676, 1867276, 1801082, 1707785, 1615046, 1526683, 1456100, 1407137, 1374763, 1357710, 1317688, 1266089, 1232844, 1187348, 1130412, 1073975, 1017918, 970661, 939393, 920951, 878503, 867419, 875412, 898060, 905171, 930751, 993721, 1060187, 1115144, 1126175, 1129938, 1109756, 1056326]
17991A056326l1813M1564J00270J18080J30527J09686N9818L83l4497o3882m3214
17980A443248k7746N3215Q4395P2373P1715L9635O4294J27811J92596J98344J58998
17969B478878J31836J09319J57670L20690N63374R44914J594557K798010M775062
17960A3874310N047268K059899l03948j813227j048574K053894O910080J0115241
17952C6894943N233582j338712n872288p332272m578125l12274L426852K323891
17944B8445597j456872m018370n502250m560818k958054j874206j244104q47005
17936E983918n66535l08834j80452j50806j60794j32887j03035K528K09148L43015
17926D935266L37369K94654K68739K37059K89607M23258P26061J260282K381257
$$ y = [1056326, 1024513, 1066077, 1166347, 1284427, 1414954, 1524640, 1584458, 1584841, 1550344, 1486462, 1443248, 1415502, 1468717, 1553112, 1625485, 1697200, 1736835, 1801129, 1928940, 2121536, 2319880, 2478878, 2610714, 2720033, 2877703, 3198393, 3761767, 4706681, 6301238, 9099248, 13874310, 18921578, 20981477, 20677529, 18864302, 17815728, 19869622, 26779702, 36894943, 42128525, 40789813, 34917525, 27585253, 23007128, 22694854, 26121706, 28445597, 26988725, 22970355, 17468105, 12907287, 9949233, 8075027, 6830923, 5983918, 5417383, 5108549, 4928097, 4777291, 4616497, 4483610, 4380575, 4383103, 4592251, 4935266, 5272635, 5567289, 5836028, 6073087, 6362694, 6785952, 7512013, 8772295, 11153552]
17917A1153552M100984M051110J505908j72373r12570O21672L511348M498832
17909B8358463N215141P849362R486409Q914012L990427j950719m736262n762986
17901E1363847p088170o521735n348597k279561K884905P843057Q909889N061331
17893E4824966o98800n598072p486558n725814k018713K149068M887012M051048
17885D4384137N7299m195617p156045p247529n823198m007111k646417j835970
17877A1529549j331943r32519p03246n13481l10479o6199J75039M73035R98074
17868I317830K030740L399422K311707K72954r58292j474653k07173K352256N642122
17859B2686913N338391P71941k322717m340648l560921q87397K099944L921715
$$ y = [11153552, 15254536, 19305646, 20811554, 20639181, 19726611, 20348283, 23859631, 28358463, 33573604, 41422966, 50909375, 59823387, 63813814, 61863095, 57126833, 51363847, 44275677, 37753942, 32405345, 30125784, 33010689, 40853746, 49763635, 54824966, 54126166, 48528094, 41041536, 35315722, 33297009, 35446077, 40333089, 44384137, 44441436, 40245819, 33089774, 25842245, 20019047, 16011936, 13365519, 11529549, 10197606, 9265087, 8561841, 8048360, 7737881, 7671682, 7846721, 8319756, 9317830, 11348570, 14747992, 17059699, 17332653, 16374361, 14899708, 14692535, 17044791, 22686913, 28025304, 28797245, 26474528, 22133880, 18572959, 17685562, 19785506, 23707221]
17851B3707221L334234M001263N942025Q341035Q666367M634174j203695n747306
17843E1675318o604772l365768K023941O590666P255984K699541l676869q904978
17835D7693063j0737388r479562p091581m875736l297696k259152j555461j050573
17827G345914o54497m77143m37285l55525k86197k13189j33659r2064o5099o859
17817D624397Q0361J29286J79727J75403J28792J28275K03572L71120O56155R94219
17807G671307J605760K816745M146782M231080L951374M298544M190905L952177
17799C6864674K529732O74850K84103K733473Q915281J7010664K2654110J6829740
17791A08496627K142186r860244j5309430j1142250J138461J5313906J8453202
$$ y = [23707221, 27041455, 31042718, 36984743, 45325778, 53992145, 58626319, 57422624, 51675318, 45070546, 41704778, 43728719, 50319385, 57575369, 60274910, 56598041, 47693063, 36955675, 27476113, 20384532, 15508796, 12211100, 9951948, 8396487, 7345914, 6691417, 6214274, 5776989, 5421464, 5135267, 4922078, 4788419, 4696355, 4631256, 4624397, 4704758, 4834044, 5013771, 5189174, 5317966, 5446241, 5649813, 6020933, 6677088, 7671307, 9277067, 12093812, 16240594, 20471674, 24423048, 28721592, 32912497, 36864674, 39394406, 40069256, 40353359, 43086832, 52002113, 69012777, 91666887, 108496627, 110638813, 100778569, 85469139, 74326889, 75465350, 90779256, 109232458]
17784A09232458P791020m274435j1391239j2016179j0804023j1318180j2276508
17777E4942914j1791540r248818n809606k730831M7463K583659L002463M94799
17769C1490503k423136m411284m827686l817655k606203j648692r43622n86406
17761A0225819m95686n15865n42852m43057j81649K01167N60086R87590J607900
17752A1403453K952153N009784N752098L843541J582166R35799L126920O565612
17744D1171526N889424J381084k540225l616985J23131Q754889J6164049J3037594
17736H0364487N027553k506899p459718n304741O35651N652978K949730n630446
17728G3728595j1694935j3661287j1054667p520890n564853m606687l894512k862432
$$ y = [109232458, 117023478, 112749043, 101357804, 89341625, 78537602, 67219422, 54942914, 43151374, 33902556, 28092950, 25362119, 25409582, 27993241, 30995704, 31490503, 29067367, 24656083, 19828397, 16010742, 13404539, 11755847, 10812225, 10225819, 9730133, 9214268, 8671416, 8228359, 8046710, 8247877, 8807963, 9795553, 11403453, 14355606, 19365390, 25117488, 28961029, 30543195, 31478994, 34605914, 41171526, 47060950, 48442034, 45901809, 42284824, 42407955, 51162844, 67326893, 80364487, 85392040, 82885141, 75425423, 70120682, 70756333, 76409311, 79359041, 73728595, 62033660, 48372373, 37317706, 29796816, 24231963, 19625276, 15730764, 12868332]
17720A2868332j762884r75185l79820n6085R9334M49664Q24173M14461l36843
17711A1145147q27918j021914j030315r02690p87120o96115o31131o02416n74992
17702D070536n19840m57264l29031j49215j03102p1975p1148q2340j14346j37184
17692B035091j62080j46774j36213j07131j04866n4190m6238k5423k0846n6805
17682A174525o4757l4101k0533R966O561K4558P7401J15942J27297O3081k6003
17671A453937J4615J12952J48378N7564o1564r4125n0200J03991L18050M51794
17661B455392K80021N2015j43734j96755q2602M2694J28257k3086k03391k90072
17651B018739k03161m0513O652n2064j67386k12456j24619n4433Q3297J93141
$$ y = [12868332, 11105448, 10130263, 9750443, 9694358, 9793692, 10243356, 11067529, 11481990, 11145147, 10317229, 9295315, 8265000, 7362310, 6575190, 5879075, 5247944, 4645528, 4070536, 3550696, 3093432, 2764401, 2615186, 2512084, 2440109, 2368961, 2286621, 2172275, 2035091, 1873011, 1726237, 1590024, 1482893, 1378027, 1323837, 1277599, 1252176, 1231330, 1174525, 1109768, 1075667, 1055134, 1065100, 1071661, 1096219, 1173620, 1289562, 1416859, 1479940, 1453937, 1468552, 1581504, 1729882, 1787446, 1725882, 1631757, 1581557, 1685548, 2003598, 2455392, 2735413, 2787428, 2643694, 2446939, 2364337, 2407031, 2535288, 2512202, 2308811, 2018739, 1815578, 1775065, 1781717, 1729653, 1562267, 1349811, 1225192, 1170759, 1254056, 1447197]
17641A447197J59283L7540m8223o1308q8820j23260j76497j39317j22762p4119
17631H09714n0979j0719L412K4475K5346j8666q2242o3467k5059k5040l3302M700
17619E58173O823K5224K7650J5614j0716j4279q684l0561J0355L6915L5901N2731
17607G05146J00890J00523R0256N3788k0703k7735k3369k2421M8851O1978N5753
17596A122957M4165Q2162J15707M5689n524q1226r9530o1366K6889R8045K3837
17585A311805n7835j18933j62448j34136q7011q2325n5498O985J7726k008k6486
17574F09836m6233l1551k2163j6640j0994L6692M6805Q8179P1612O6232N0355
17563H42130J9960r890m1187k4568K6058P3185P5105N6265N542r7751q0935q3807
$$ y = [1447197, 1606480, 1644020, 1595797, 1534489, 1445669, 1322409, 1145912, 1006595, 883833, 809714, 758735, 748016, 751428, 775903, 801249, 782583, 700341, 636874, 611815, 586775, 553473, 558173, 564996, 590220, 617870, 633484, 622768, 608489, 599805, 569244, 579599, 616514, 652415, 705146, 806036, 906559, 996815, 1050603, 1029900, 1002165, 978796, 956375, 1005226, 1067204, 1122957, 1167122, 1249284, 1364991, 1410680, 1405156, 1323930, 1224400, 1163034, 1189923, 1287968, 1311805, 1253970, 1135037, 972589, 838453, 751442, 669117, 613619, 620604, 638330, 636322, 609836, 563603, 532052, 509889, 493249, 482255, 518947, 565752, 653931, 725543, 791775, 842130, 862090, 852200, 811013, 786445, 812503, 885688, 960793, 1017058, 1022600, 924849, 843914, 760107]
17551G60107k9266L5774K2046N231R347k2925K7812P8609J12501J23942O2148
17540A185326k2209r3286j5164O6738J54992K23056K30616J92785Q9078k6557
17530A985375p9981r4682n1051M2091R5892O7779j1999j28203j90535j96850j57006
17519A280830j17137m0987J278k4312k3083k9720l1093k8891l4036l4023L7882
17508I56708N3850N4244P4573Q6884K2891j4026k721O711L7612P3644J28144J00859
17496A579373J41860J45558J53561J49806K44619L64184N05589O00678Q00591
17487D685819J210804J928517L122755M886584O889010Q743767R311039P992522
17479D8770817N419018J816588j190961k239210j509924O65228K393774K285244
$$ y = [760107, 730841, 766615, 788661, 793892, 803239, 780314, 808126, 886735, 999236, 1123178, 1185326, 1163117, 1069831, 1054667, 1121405, 1276397, 1499453, 1730069, 1922854, 2011932, 1985375, 1905394, 1810712, 1759661, 1801752, 1897644, 1965423, 1953424, 1825221, 1634686, 1437836, 1280830, 1163693, 1122706, 1123984, 1099672, 1076589, 1046869, 1015776, 986885, 952849, 918826, 956708, 1010558, 1064802, 1139375, 1226259, 1249150, 1235124, 1232403, 1239114, 1276726, 1350370, 1478514, 1579373, 1721233, 1866791, 2020352, 2170158, 2414777, 2778961, 3284550, 3885228, 4685819, 5896623, 7825140, 10947895, 15834479, 22723489, 31467256, 40778295, 48770817, 54189835, 56006423, 54815462, 52576252, 51066328, 51731556, 54125330, 56410574]
17471E6410574M91120k843400o142420q107462q579874p616238n955041m304059
17463A3353200k942533j986879j362780r67116p26856n20398l74085k91568k54056
17454C926929k19411j97698j67884j61131j25449p7986n9495l0693k9078m4650
17444B813454m8492J2376N7720J42806K30356K40609K53854L75071N95769R86440
17434E659963J642758K804127M328138O034826P512691P641240O308566L987502
17426D5919811Q93771j338477j925802j068765Q27909J971405J694078r621k890596
17417D4073713n441172o856981p092040o156650m768135l414126k273357j522232
17409F549020j071447p51024n37921m26084l21506k40715j81032j87107j85468
$$ y = [56410574, 56901694, 54058294, 47915874, 39808412, 31228538, 23612300, 17657259, 13353200, 10410667, 8423788, 7061008, 6093892, 5367036, 4846638, 4472553, 4180985, 3926929, 3707518, 3509820, 3341936, 3180805, 3055356, 2977370, 2917875, 2887182, 2858104, 2813454, 2764962, 2777338, 2835058, 2977864, 3208220, 3448829, 3702683, 4077754, 4673523, 5659963, 7302721, 10106848, 14434986, 20469812, 27982503, 35623743, 41932309, 45919811, 46813582, 45475105, 43549303, 42480538, 43308447, 45279852, 46973930, 46964309, 44073713, 38632541, 31775560, 24683520, 18526870, 13758735, 10344609, 8071252, 6549020, 5477573, 4726549, 4188628, 3762544, 3441038, 3200323, 3019291, 2832184, 2646716]
17400B646716k02670j70369j70757j17802n6260n4964p9860r2062j34890j68781
17390A398301j32949j01590p0505r3632q1572l8558m1112n0233m2870j6673j7900
17379G10707l5179l8832l3445m8522j2468J6323J3560j2257k9670j0961m5123
17368D74133p2384m6749n066L508LN219K8583k1241l7846k0473N369L2643M5927
17355C91626R572k746K7316k1328k8082O1j5563M396n913R016O814l0644k9498
17342C15027k4513j5443J2400L379k531r384J9943O3891N7531L9051K7608j459
17330D85500j4827l2098p441j2232J2378M111j9669m3396m6552m5338m0532l7785
17318B02119m2008m170R863J2217o908k1284j8910M228O943M480P813J2805R305
$$ y = [2646716, 2444046, 2273677, 2102920, 1985118, 1928858, 1873894, 1794034, 1701972, 1567082, 1398301, 1265352, 1163762, 1093257, 999625, 918053, 879495, 838383, 788150, 745280, 728607, 710707, 675528, 636696, 603251, 554729, 542261, 558584, 572144, 559887, 530217, 519256, 474133, 401749, 355000, 349934, 353442, 353445, 358664, 387247, 366006, 328160, 307687, 313056, 345699, 391626, 401198, 398452, 425768, 404440, 376358, 376419, 360856, 365252, 359339, 368355, 375169, 344525, 315027, 290514, 275071, 287471, 290850, 288319, 278935, 298878, 362769, 420300, 459351, 486959, 485500, 470673, 438575, 431134, 418902, 431280, 435391, 415722, 372326, 325774, 280436, 239904, 202119, 160111, 155941, 165804, 178021, 171113, 149829, 130919, 135147, 142090, 146570, 154383, 167188, 176493]
17305A76493J7355o264l2519J4781J333j8277K0105l693m170J3757M712M65L4585
17292B18663P127J8637M7157L5111O6582M0610K8057Q664J0761k3439l0531l9104
17280C88295k6392k856k0250j5273J2702R801K9346K2183J3640K40j9728l4743
17268C56965k9419Q631K1227J023l6062p4029m8155j5605l3781r30j0197j9108
17256A20560j6530k1093k418L578K2446J0113L2148K1781j6046j1610k670j9698
17244A20561M954J9353j7541p432K8878M0366M3044N0506N0604M4450N9464l447
17232D33760k2498k6914j2969l3937j6036L6404K964j3319n4303m8016j5848J1146
17220B40434J5982J6832K4814K3636N102l1096l5972k2512P466K2137M335J448
$$ y = [176493, 193848, 187584, 155065, 169846, 171179, 152902, 173007, 169314, 165144, 178901, 183613, 184078, 218663, 225790, 244427, 291584, 326695, 393277, 433887, 461944, 470608, 481369, 457930, 427399, 388295, 361903, 359047, 338797, 323524, 336226, 346027, 375373, 397556, 411196, 411436, 391708, 356965, 327546, 336177, 357404, 358427, 322365, 248336, 200181, 184576, 150795, 149865, 139668, 120560, 104030, 82937, 80519, 84097, 106543, 116656, 148804, 170585, 154539, 142929, 140259, 120561, 125515, 144868, 127327, 119895, 148773, 189139, 232183, 282689, 333293, 377743, 437207, 433760, 411262, 384348, 371379, 337442, 321406, 357810, 360774, 347455, 293152, 245136, 229288, 240434, 256416, 273248, 298062, 321698, 326800, 295704, 259732, 237220, 244686, 266823, 271158, 272606]
17208B72606j033l6688l6768j6355m3303n2987o1693j7932J7986M247J4523J0947
17196E3550M733L6156j4108l8921J2832N688M564J1201j0082L0433K1196j7692
17184I9550j0073k852k8897q443P15j983k2993J3515P110J8151J8149Q738j7376
17171G3311P992L868j335k167o812j3942q158J3407k6969l0679P869J1555K352
17158C0292l43r222j4435o451o151J7549Q712J5162P2O801K0736R150p322M803
17144F9353R660J5478R878k6274K062m646j8379o778J544q65J3454j642J3767
17131G6612j6276k9258j8273J0241J9426o248N625L398n159j9698k620J2221l525
17118B6466k0725J029J2037m498m804j0130J822o269N318K2390K4475m352j3090
$$ y = [272606, 271573, 234885, 198117, 181762, 138459, 85472, 23779, 5847, 23833, 28080, 42603, 53550, 58283, 94439, 80331, 41410, 54242, 59930, 64494, 75695, 65613, 96046, 117242, 99550, 89477, 86625, 57728, 49285, 50000, 48017, 25024, 38539, 45649, 63800, 81949, 90687, 73311, 81303, 85171, 83836, 81669, 74857, 60915, 52757, 66164, 39195, 8516, 16385, 27940, 30292, 29949, 20727, 6292, -159, -6310, 11239, 19951, 35113, 35185, 41986, 62722, 71872, 64550, 69353, 79013, 94491, 104369, 78095, 80157, 75511, 57132, 50354, 51898, 51033, 64487, 62845, 76612, 60336, 31078, 12805, 23046, 42472, 36224, 41849, 45247, 40088, 20390, 17770, 29991, 26466, 5741, 6770, 18807, 14309, 9505, -625, 1197, -5072, 246, 22636, 47111, 42759, 29669]
17105B9669j6464j7151q262J7011O425K6125j1115p707J7098K3378L1307j6393
17093G3921j8020M645P40P63P1q264j7838j7505r164L5200J6621o285J3963j0192
17079E8656k0633n593l750j6545j373o457J8107q113j1564J6439r125L540m475
17066I114J8975l4051k8203o684J8878M0310r059k7806P301M51j5336j176L2363
17053E077K1396j3543k0707k4453N775R180K1923K9676K0115k9757j1066m2742
17041b9126l20K6046J7845K923J3475j5438j1296J6681p928j9949k907j0300J9905
17028c89L6610J2042j0576Q501O275p002l630j8534k791K0888K2620j3346j0877
17015C9791R239Q219m618j0977j1891k1277K0151L7362L426r703k5497k0228j611
$$ y = [29669, 13205, -3946, -12208, 4803, 11228, 37353, 26238, 18531, 35629, 59007, 90314, 73921, 55901, 60546, 61286, 62049, 62120, 53856, 36018, 18513, 9349, 44549, 61170, 54885, 68848, 58656, 38023, 32430, 28680, 12135, 10762, 4305, 22412, 14299, 2735, 19174, 10049, 13589, 9114, 28089, -5962, -34165, -40849, -21971, 18339, 9280, -18526, -11225, -10774, -26110, -27286, 5077, 26473, 12930, -7777, -32230, -26455, -17275, 4648, 34324, 54439, 24682, 13616, -29126, -29446, -3400, 14445, 17368, 30843, 15405, 4109, 20790, 12862, -7087, -9994, -20294, -389, 36221, 48263, 37687, 46188, 52463, 45461, 41831, 23297, 20506, 41394, 64014, 50668, 39791, 49030, 57249, 52631, 41654, 29763, 8486, 28637, 65999, 69425, 59722, 34225, 13997, 12386]
17002A2386k883N0932m969j7528J5894n487j7951m8957k1426J7545L0644L9787
16990D7987K9813j8595k9730l3062O020P825J2625j2240k6796J5058K9918N926
16978C4749L3493l134p117J6582j5035r503J2381K9279L7296J7172M5461O0187
16966B51811M0496L985j9878k9273K2821K5444j8752j946l3831l4281p92k3827
16954A81977n0693k7756k089k4361m5906J9053O033J80o233k121L537j043r695
16941D0883j8871J0511k010j6627L0647J1102o307k9168l2202o226J2506J2180
16929F418J0045J2940j3701k6515K6683L3813N933p744j1378J0236R226N0645
16917A06601O7268N5483L161J0744k0596j5423K6332J6301Q663J4757L808k0488
$$ y = [12386, 9503, 60435, 55466, 37938, 53832, 48345, 30394, -18563, -39989, -22444, 8200, 47987, 77800, 59205, 29475, -3587, 2433, 10258, 22883, 10643, -16153, -1095, 28823, 34749, 68242, 65108, 57991, 74573, 59538, 50035, 62416, 91695, 128991, 146163, 191624, 251811, 292307, 296292, 276414, 247141, 269962, 295406, 276654, 274708, 240877, 206596, 205804, 181977, 131284, 103528, 101439, 77078, 31172, 50225, 56258, 56438, 50205, 48084, 51621, 50578, 40883, 22012, 32523, 30513, 13886, 44533, 55635, 49328, 20160, -12042, -18268, -5762, 6418, 16463, 29403, 15702, -10813, 15870, 49683, 55616, 47872, 36494, 46730, 55956, 106601, 173869, 229352, 232513, 243257, 222661, 207238, 233570, 249871, 258534, 273291, 277099, 256611]
16905B56611m6449k3614k6739n0324m1764j7569J3752j1663j5878r20J11r825
16893B5729J2984P667J3135k3199j7569o438Q070p624R583J1963k932l2506k0126
16880b1263O296K2890L6430p783l3375l3394j7196J9314j0554q481J1887R062
16868b6167J3599J1102Q395J7253n65m8969J7391K8117o825k4789j1482J0175
16856a2765J5287M660R124l24j6745M209k2336j803o073j3923r768J0822L2033
16843g602K1831m851j1666O283l658j0938k1157J3973Q276j1165j7461O61J0361
16830b7113j3861j2643K6255K0963k985j4793p100j3401P092K4833j0521o285
16818b9559q792n061K0302K6388R111P818K3507K67m8340j9622J6429P963J886
$$ y = [256611, 210162, 186548, 159809, 109485, 67721, 50152, 63904, 52241, 36363, 35443, 35554, 25729, 38713, 46380, 59515, 36316, 18747, 12309, 20379, 12755, 22338, 34301, 31369, -1137, -21263, -14967, 7923, 44353, 36570, 3195, -30199, -47395, -28081, -38635, -47116, -35229, -26167, -12568, -1466, 6929, 24182, 23617, -25352, -7961, 20156, 13331, -11458, -22940, -12765, 2522, 7182, 16306, 15982, -763, 3446, -18890, -20693, -26766, -40689, -50457, -39635, -7602, 14229, 9378, -2288, 3995, 337, -10601, -31758, -17785, -9509, -20674, -38135, -37474, -27113, -40974, -53617, -27362, -6399, -9384, -24177, -31277, -44678, -37586, -12753, -23274, -29559, -38351, -43412, -23110, 3278, 12389, 20207, 43714, 43981, -4359, -23981, -7552, 411, 2297]
16805B297R056Q221r574k6593K085J3636k8073n674m963Q873M0596J6022j8928
16792F981k5499j499J2891J4825j3517l3872J2278M666q639N102k5507P327J9356
16779b5107k680k8698K3560J4020R210K9401Q801r841m689r114R204q56k7708
16766a4497j865N641k3903j5395J3637J8970L4153P229k6757j3920j8645l383
16754c8735K5050L998J7388l735k3417N474J1404j7695J601K2662j7335o258j0835
16741c0433J5545L5397j1292j1309j4208p157p358L2738K2290P984l0268j7062
16729a5133J6534K0934j2059k878K2634j8401j5908Q681k3961k102K4673K8297
16717C1311k0578q254J9918m355j4184m692N330N417J2038j2286l2567k2817L0784
$$ y = [2297, 11353, 19574, 10000, -16593, -14508, -872, -28945, -34619, -39582, -30709, 9887, 25909, 6981, -18518, -20017, -7126, 7699, -5818, -39690, -27412, -22746, -31385, -26283, -51790, -44463, -25107, -27787, -56485, -32925, -18905, -9695, 19706, 28507, 18666, 13977, 4863, 14067, 13211, -14497, -16362, -10721, -34624, -50019, -36382, -17412, 16741, 23970, -2787, -16707, -35352, -38735, -13685, -9687, 7701, 3966, -19451, -13977, -2573, -20268, -18667, 3995, -13340, -19598, -30433, -14888, 20509, 9217, -2092, -16300, -23457, -30815, 1923, 24213, 32197, 1929, -15133, 1401, 22335, 10276, 7398, 30032, 11631, -4277, 4404, -19557, -21659, 3014, 31311, 10733, 2479, 22397, 18042, 3858, -834, 4496, 9913, 21951, 9665, -22902, -45719, -14935]
16704a4935J1633k0158j3847M112l6254J4221Q322j6259O710J6099K0509J3364
16692f483L714j2085l096J524j8202p583j3647K3488J5475j3672N373L5313L211
16679A3330l921k2925N881r623j2345l323j0174j3201j6460J2181L4095J2820
16667a3665N060J9921J7232j2943M58j5671J3151n787J5095j1760J2247j8144
16655E194l9102M756K5058K265L192k6301j2673k848L585J7218J4174J4772m7710
16642c8420j8499J7382K3519P538k6002Q989j833j0441P75q037O198O819L9908
16629G896J2518r940j632L081L001j2348m4213j5930M5668K1116K50K5680J7611
16616E2758m6878m1965L3083K8904k8905m3570K7937M4813J9294R529j0626k9701
$$ y = [-14935, -3302, -23460, -37307, -33195, -69449, -55228, -46906, -63165, -56455, -40356, -19847, -6483, -2769, -14854, -17950, -16426, -34628, -42211, -55858, -32370, -16895, -30567, -25194, 10119, 13330, 9409, -13516, -7635, -17258, -29603, -32926, -43100, -56301, -72761, -60580, -26485, -13665, -8605, 11316, 28548, 15605, 16063, 392, 13543, 7756, 22851, 11091, 23338, 5194, -33908, -29152, -4094, -1829, 1363, -24938, -37611, -40459, -36874, -19656, -5482, 9290, -38420, -56919, -39537, -16018, -8480, -34482, -25493, -27326, -37767, -36992, -45029, -38831, -32012, 7896, 20414, 10474, 8842, 11923, 14924, 2576, -41637, -57567, -11899, 9217, 9467, 35147, 52758, 5880, -36085, -3002, 25902, -3003, -46573, -18636, 26177, 45471, 55000, 44374, 14673]
16604A4673l3807l767J4473K4681K3451K520k4677m6851k1198P824L9905M3799
16592D1026J0902l3688m1856L754K5119m34L0303J2430p962j4304m6425k8134
16580d9269k2215K1703P228L3838R663K2441j9185m1105J4853K4191o571Q272
16568C844o258j1667j0972n229m918L4914R128j9086k0647o09J8478L891r511
16555a8642k889N327n051j8861J6401J5034Q506J7440m019K3404j277j8737m7327
16542c0691m6570P650J3591J4213J3346J9456j0260Q380K6325j1248J1080j0574
16530D698P265Q862j7777r33o514K1601L45K5424M921k057p006l0788k2653j7971
16516c2583j0864J100L5585K9033k5381k2011o048K6115N94j5693p67K669L6720
$$ y = [14673, -19134, -22901, -8428, 16253, 39704, 42224, 17547, -29304, -50502, -42678, -2773, 41026, 51928, 18240, -23616, -19862, 5257, 4823, 35126, 47556, 39594, 25290, -21135, -49269, -71484, -49781, -42553, -8715, 948, 23389, 4204, -36901, -22048, 2143, -4428, 3844, -2414, -14081, -25053, -30282, -35200, -286, 8842, -10244, -30891, -31500, -13022, -9131, -18642, -21531, -16204, -21255, -40116, -23715, -8681, -175, 17265, 13246, 36650, 35373, 16636, -30691, -77261, -69611, -56020, -41807, -28461, -9005, -19265, -10885, 15440, 4192, 15272, 4698, 11963, 20825, 3048, 2115, -4399, 17202, 17547, 42971, 47892, 45835, 38829, 8041, -14612, -32583, -43447, -42347, -6762, 22271, -3110, -25121, -31169, -5054, -4460, -20153, -20920, -18251, 18469]
16503A8469J927k4099J8892K3278K2077k0841k6492j8437J7682J9952l789l6422
16491g803P505l759l865l143j0193j3464j613J0870N518J4470P523j0541k3085
16478c1580j8300M3501L7552j46j2674K810o76J1436K2263q548l660q345l903
16465B9730K2358j082j9869n2360J1186O033p99J0174j3689j7553J7360q392J1783
16452e120K8322Q30k0247N577J17k460K0837j1892k3940m963K3307n813j3615
16439i060j4646j5659L047P386r512O375J705N559P151j854j4792J984L1432J5464
16425A4580j7424l126J6523j4016k0084j2972K7215O161j1728j8677m780J995
16413c6333K0376o33Q21Q203o922J5496K497L621k8843j6970P745k115m467m425
$$ y = [18469, 20396, -3703, 15189, 38467, 60544, 39703, 13211, -5226, 12456, 32408, 28619, -7803, -298, -4057, -7922, -11065, -21258, -34722, -36335, -25465, -19947, -5477, 2046, -8495, -31580, -49880, -6379, 31173, 31027, 18353, 21163, 20487, 31923, 54186, 45638, 41978, 33633, 29730, 52088, 51006, 31137, -21223, -10037, -4004, -4803, 5371, -8318, -25871, -8511, -16903, -5120, 23202, 24032, 3785, 9362, 9479, 7019, 27856, 15964, -7976, -12939, 10368, 4555, -9060, -23706, -39365, -36318, -28932, -38444, -32069, -30364, -24805, -17654, -19508, -34300, -32316, -884, 14580, -2844, -5970, 10553, -3463, -23547, -36519, -9304, -3143, -14871, -33548, -38328, -36333, -15957, -16590, -15769, -7566, -14488, 1008, 3505, 7126, -21717, -38687, -30942, -33057, -37524, -41949]
16399d1949J2864m334k6619J4048J6265J5662J6842k505l702O97k877J0259J1756
16386A6407J4783l6367J5284j8519Q539J1459l6106k9353K1211N4938K3073k0923
16374B4426k8359q041r319O149J1799n565K2488K9107m6841j5155j0739j1431
16362d1481K9098j6159j6149J6776j990M7561J8474l0962k2971q82m85o179n723
16349c1072L5364j8736j7616K6297K9129p89j1054k8195J9864K0008q125J00j4604
16336E71O841j202m830P328J2747N350j0860j3403k723Q316N154m935j3314M889
16322g1L069j18J2127n418o56m977j1582k989j2680M856L641J7780n442N050M1778
16307D4368K0106K873o061l8902j0281J9541j0033J2804p648o406k8037k4669
$$ y = [-41949, -29085, -33419, -60038, -45990, -29725, -14063, 2779, 274, -3428, -2731, -5608, 4651, 16407, 31190, -5177, 10107, -8412, 127, 11586, -24520, -53873, -32662, 22276, 45349, 24426, -3933, -11974, -21293, -15144, -3345, -8910, 13578, 42685, -4156, -19311, -30050, -41481, -12383, -28542, -44691, -27915, -29905, 17656, 36130, 5168, -17803, -18685, -19170, -25349, -31072, 4292, -14444, -32060, -5763, 23366, 22577, 11523, -16672, 3192, 23200, 15075, 15175, 571, 7412, 6210, 1380, 8708, 21455, 26805, 15945, 2542, -181, 8135, 13289, 8354, -4960, -71, 2998, 2880, 15007, 9589, 8933, 3956, -7626, -10615, -23295, -18439, -14798, 2982, -2460, 2590, 44368, 64474, 67347, 61286, 22384, 12103, 31644, 21611, 34415, 26767, 20361, -7676, -32345]
16295c2345k153n357N578J8473J702K4326J3073k2900n609o950m583J6058L3854
16282C3167k45k851k407p636o049L535K612p761J0192m659j2587k10K4317K7585
16268E7003j8504p638j2015P489K9571K058j1702l109L1972K1433j8667k4776
16256E3115j7437j6596L653L2331r721k954l700k3126k4649k1792j6143m718J2706
16243c9031J5698R279O531m563j1130O954K3878m586q222j9372p4J7817M088R728
16229F995m481j3840k4932P728J8147J8911j2996k3940J7885J9433N262k6623
16217a2451j25j1023M527M0435p28J292p26m8855j1341K9042M3135k5101l2447
16204b4366J7049J3219L0K5530o228k053J1194r98N809n39k6572j5787K1276l01
$$ y = [-32345, -34498, -39855, -34277, -15804, -14102, 10224, 23297, 397, -5212, -12162, -16745, -687, 33167, 32922, 30071, 27664, 20028, 13979, 17514, 20126, 12365, 22557, 17898, 5311, 5101, 29418, 57003, 38499, 30861, 18846, 26335, 55906, 57964, 46262, 43153, 75125, 96558, 77891, 53115, 35678, 19082, 22735, 55066, 45345, 42391, 38691, 15565, -9084, -30876, -47019, -51737, -39031, -23333, -14054, -7523, -12086, -23216, -16262, 7616, 3030, -5192, -24564, -24638, -6821, -2733, 6995, 2514, -11326, -36258, -28530, -10383, 8528, -4468, -28408, -10523, 8910, 14172, -12451, -12576, -23599, -19072, 21363, 20635, 21927, 21201, -27654, -38995, -9953, 33182, 8081, -24366, -7317, 5902, 5932, 31462, 25234, 23181, 34375, 33377, 39186, 38647, 12075, -3712, 17564, 17263]
16190A7263k4743j6105j977J5059P585q037j289q51J5283j3043P507k236k742
16177h326L4567J0828j9106j8373P26O803J7938o478J893j7628m273Q9j0795J456
16163a0679J6955j5766M034N619m982n15q42p837Q680J4281R996L02n067R575
16149B3754R960j7232k6304j3190j5115j4694K0187J7622M467J7088N820K3416
16137C5779r457j052J2009k6455l3523k322J4645Q796L2571k1099l5331k6285
16125e1724k0806K4650K4815Q767K798j8373M47R291R126k541K4686K8175O71
16112C9982j0678k3354J089j056K604Q700k0132Q375K0172K375k5233j0839j4067
16099b2062k1983l3981L675K9460J3192K8491K1330J0387j8534k7863k2699p549
$$ y = [17263, -7480, -23585, -25562, -10503, -2918, -10955, -12244, -13095, 2188, -10855, -3348, -5584, -8326, 26241, 37069, 17963, -410, 316, 7119, 25057, 18579, 20472, 2844, -1429, -1340, -12135, -10679, 6276, -9490, -5456, 163, -4819, -5334, -6176, -14013, -5333, 8948, 18944, 19246, 14179, 23754, 33714, 16482, -9822, -23012, -38127, -52821, -32634, -15012, -10545, 6543, 12363, 35779, 26322, 25270, 37279, 10824, -22699, -25021, -10376, -1580, 30991, 9892, -25439, -51724, -72530, -47880, -23065, -14298, -11500, -29873, -29426, -20135, -11009, -13550, 11136, 39311, 39982, 29304, 5950, 7039, 5983, 8587, 17287, -2845, 5530, 25702, 28077, 2844, -7995, -22062, -44045, -78026, -74351, -44891, -31699, -3208, 18122, 28509, 9975, -17888, -40587, -48136]
16087d8136J5278L0047k919n173L2250J5555k1238j395R638j5888n817n687r355
16074a2840n567K2169N199J3688J2633M5698q808j4839j4563j6243k5811k5508
16062b4792j6312n134J7036K8343J9134j070k4012J1119p083l4331j6217O935
16050d6384R740L6051K1847j7825K576M255Q360j9407j3151j6036L41R040J5476
16037e117Q217j5239j1667j3745k865P121Q129O253K6715J5946j4192j0839J6052
16024A4769P326k3924j7867J2448L0244p797J5836k0166p877j1127L33P658M475
16011D331j3678j9266j3156j1958J7946L3722K3978R620J3626j5639q540J8383
15999C9369j5186l7482N40m919m0849n260K0921J0099M097j6924n629J5946J8080
$$ y = [-48136, -32858, -2811, -5730, -10903, 21347, 36902, 15664, 14269, 23907, 8019, 2202, -3485, -12840, -18407, 3762, 8961, 22649, 35282, 80980, 72172, 57333, 42770, 26527, 716, -24792, -41104, -46238, -29202, -859, 18275, 17205, -6807, 4312, -2771, -37102, -53319, -46384, -36644, -593, 21254, 3429, 6005, 10260, 18620, -787, -13938, -29974, -29633, -20593, -5117, 3100, -12139, -23806, -37551, -40416, -33295, -25166, -18913, 7802, 23748, 9556, -1283, 14769, 22095, -1829, -19696, -7248, 22996, 15199, 31035, 10869, 2992, -8135, -7802, -144, 4331, -9347, -28613, -41769, -53727, -35781, -2059, 21919, 31539, 45165, 29526, 20986, 39369, 24183, -13299, -12759, -17678, -58527, -63787, -42866, -32767, -28670, -45594, -51223, -35277, -17197]
15986a7197K0905r597J6149r672q670Q820J2417m458L19j280J6024K3486n417
15973D1829k4493L099J7471j7838l4903n566P493q641K2166L7472n172j7944l2075
15960a7102j9169m940J2015K994K865j950m797K6672L189k1428P027J1519j5065
15947a8170j3783k2229J3858L6694n397J0064l96Q154L849j0989J3624k073j8514
15934e308p214q365J1374K7346R895j3534j4081m544N045K102J218p651M842n266
15920d141j7599m198r917k211L3896J4508k3339K879J4743L7n584j6828J1063
15907f691m757M230r632k2348k0L1996j1968n613p688L004k9195J6350K958p942
15893d7316L887L7714K7040j2380o787J4971j714j0398K904j5861q404j5178j9457
$$ y = [-17197, 3708, -5889, 10260, 588, -8082, 738, 13155, 8697, 9016, 7736, 23760, 47246, 41829, 17336, 20435, 37906, 20068, -14835, -20401, -12908, -21549, 617, 38089, 32917, 14973, -17102, -36271, -41211, -29196, -26202, -23337, -25287, -30084, -3412, -223, -21651, -14624, -3105, -18170, -31953, -54182, -40324, -3630, -9027, 1037, 641, 8795, 12644, 1655, 15279, 13206, -5308, -12522, -20887, -9513, 17833, 27728, 14194, 113, -4431, 614, 2716, 3934, -3717, 1125, -4141, -21740, -25938, -35855, -38066, -4170, 10338, -13001, -10122, 4621, 4658, -926, -17754, -6691, -11448, -7218, -16850, -39198, -39218, -7222, -19190, -24803, -32491, -29487, -58682, -42332, -39374, -47316, -43429, -5715, 21325, 8945, 2158, 17129, 15415, 5017, 7921, -7940, -16344, -31522, -50979]
15880e0979L0761K0767M807l8670k1118N852K3722N398N922n486N567L461l0980
15867d0976L2224J3827k2381j5742j467L0844J8484K391m568j9627P963r858Q160
15854g26K0925j011K2113q148l0039m3663J5998L1132K6224L744N649j5266j9558
15841G374l189J9096k0661j1260m187j8921J2761O090j6685o807p859K5496L4566
15828A5814j593q710j602M991q971j5141Q643j6630L4839J202Q955k9646p715
15815a5564p265j177J1873j5269Q43j206L1378M697p222m227Q449j4013j650M126
15801f227K7247j610j0945Q223L2507j1607k7606N801p618r504j8944o007j1851
15788c8141L525K4891j4721p413K665J398p907R472J8539N512k5106j1173K736
$$ y = [-50979, -20218, 549, 5356, -33314, -54432, -48580, -24858, -19460, -13538, -19024, -13457, -9996, -40976, -8752, 5075, -17306, -33048, -34515, -3671, 14813, 17204, 12636, -6991, 972, -8886, -726, 20199, 19188, 41301, 33153, 3114, -40549, -24551, 6581, 32805, 36549, 42198, 26932, 7374, 4185, 23281, 2620, -8640, -12827, -31748, -18987, -12897, -29582, -36389, -44248, -18752, 15814, 14221, 5511, 3909, 8900, -71, -15212, -6569, -23199, 11640, 12842, 21797, -7849, -15564, -22829, -24006, -12133, -27402, -26559, -27765, 3613, 8310, 1088, -3139, 5310, -8703, -10353, -6227, 21020, 19410, 8465, 16688, 49195, 37588, 9982, 15783, 8165, -1339, -20283, -26290, -38141, -34616, -9725, -24446, -31859, -29194, -27796, -35703, -26231, -7692, -2180, -27286, -38459, -35723]
15775c5723K715N575L341J6744J9450N13j1549q549k3990j7072O577J5603M4151
15762A7786N69o308J1460k9706k4615j3910JK7166J5674O044n670J4502j6250
15749c257k1084j8308K2111O926K2041o876m4025K048J7483k2839q904J9234n486
15736d0936k416M589L131J3960M8326J9067Q245K89l2717j4801J0434k699j4458
15723A4J4055r204k6724J3796K0590K374l2228O977N925J0563o467j7894n575
15710b3798L1585r937m447O003K491r060m174K9822L437J0528k0119k6531M977
15697i223J2445r601J0041k735j9323J8370R899r852k97o666j0877m671Q582j0642
15683b4550M512l975o87k66K1132l547n189J2483l859L272L4879j1596k9258N132
$$ y = [-35723, -33008, -27433, -24092, -7348, 12102, 12615, 1066, -7483, -31473, -48545, -41968, -26365, 17786, 18355, 12047, 23507, -6199, -30814, -44724, -44723, -17557, -1883, 4161, -1509, 12993, -3257, -24341, -42649, -20538, -13612, 8429, 1553, -42472, -40424, -22941, -45780, -54684, -35450, -40936, -43352, -38763, -35632, -21672, 26654, 45721, 53966, 54255, 21538, 6737, 17171, 14472, 14, 14069, 4865, -21859, -8063, 12527, 14901, -17327, -10350, -4425, 6138, -329, -18223, -23798, 7787, -2150, -6597, -594, 1897, -7163, -11337, 18485, 21922, 32450, 12331, -14200, -9223, 3222, -6379, 3662, 927, -18396, -26, 9873, 21, -276, -6942, -17819, -22490, -13908, -24550, -20038, -24013, -24700, -24966, -3834, -7381, -12570, -87, -3946, -674, 34205, 22609, -6649, -1517]
15669a517K1277N72P62j2593l96q887j715J5599j4142P395J8586J0936M657p107
15655C3427K8555Q90j215M671j3233r182n807j5161l0989K259P622J2795o851
15642G781j0220K579n737R157P70O193K6739L223j7300j9388j0116J6276J4919
15629B4876p749j8051J2193J1146k677j4232K575q078j8033R171M978K6930K4302
15616D7351J754r696l7399k0522l02L104j028j6149K3327K5128q782m766J7585
15603A9605M900J021J1611L448O417k505l137k0580q36P03k8769o126j0107k8341
15589e2696j2779K0581K0529j620M3419K1042j28O649j753l9990k3617r321j0532
15576d0216n160k0111K576K0952L5574m853p63J1457J7153P5K4954j5493M548
$$ y = [-1517, 19760, 20332, 21094, 8501, 8105, -782, -2497, 13102, -1040, 6355, 24941, 35877, 40534, 33427, 61982, 62872, 61657, 66328, 53095, 43913, 38106, 22945, -8044, -5785, 1837, 14632, 7781, -2439, 140, -5597, 3560, 4330, 10523, 37262, 40485, 23185, 3797, -6319, 9957, 24876, 17127, -924, 11269, 22415, 19738, 5506, 8081, 3, -18030, -8859, -3881, 23049, 47351, 49105, 39409, 2010, -18512, -18814, -15710, -16738, -32887, -9560, 15568, 6786, 2020, 19605, 24505, 25526, 37137, 40585, 47002, 44497, 41360, 20780, 19944, 20647, -8122, -14248, -24355, -52696, -65475, -44894, -24365, -25985, 17434, 38476, 38348, 44997, 43244, 3254, -20363, -29684, -40216, -45376, -65487, -62911, -41959, -6385, -11238, -12001, -544, 16609, 16684, 41638, 26145, 30693]
15563C0693K8436J6962L0008k2124m0836k3563L791j2418L120R356P139j505j2559
15550A6500l76J4492K677j7070p630J2342j9746k534N387j7525J74J237L11j7011
15536b8772O635J3398L1249r269k4806J4110L6112k9652j0771j070M272N369k618
15523D187K9160k4222l124Q991l172m377q612j1954j8373j8582n251J7515K1890
15510a5924J8832R315j7057l9679o437K3064L5301j0695K6964M1353K7300k0608
15498G1729r568l0633l6283m689J376M16J0686n353k2452k675L7956L6428Q949
15485E5887j6463j5303j4399j95l912r506L10J799q258K271K8428R979j4780j0150
15471E708j3956q338Q494K5990L424l8940l4272K9161J6517k8795k6828L4420
$$ y = [30693, 59129, 76091, 106099, 83975, 43139, 19576, 23367, 10949, 14069, 23425, 30564, 29059, 16500, 16124, 30616, 33293, 16223, 8593, 20935, 1189, -1345, 4042, -13483, -13309, -12072, -11761, -28772, -22137, -8739, 22510, 13241, -11565, 2545, 38657, 9005, -1766, -2836, 1436, 6805, 4187, 33347, 9125, 6001, 14992, 11820, 7443, -1169, -13123, -31496, -50078, -55329, -37814, -15924, 2908, 12223, -4834, -44513, -50950, -27886, 7415, -3280, 23684, 65037, 92337, 71729, 62161, 31528, -4755, -9444, -8068, -7652, 3034, -2319, -24771, -27446, 10510, 46938, 55887, 39424, 24121, 9722, 9527, 5615, -3891, -3581, -1782, -10040, -7769, 20659, 30638, 15858, 5708, -8248, -16586, -8092, 17898, 21322, -17618, -51890, -22729, -6212, -35007, -61835, -27415]
15459b7415J9669K055k0940q814J4564J2412Q247J9744j13j354L198j8874j0919
15446h540j0634j9214L247J7244O426m909J1335k444J5483q208J1486J0070k2744
15433a402k6336K3264j94o119j2479j9910L842J5752J5725J3202k241M989M479
15420A2572O231p167N099P844P022O577q628k3975n203M474l948M007K5957R94
15406C1856n416j3779J6174r153j1438J1458J5598J3490k7388K1821p311k7556
15394H356j5683J8068J7264J4109J192P8j1077k2279K858J8044j1948R685j478
15381B7189j0456j5533k5844N1K3905J0967r996K1164J119k5953p814l701O947
15368g955L2507K2701k447k0114j6687O535k7570l6210o670R081K5418J0835K7311
$$ y = [-27415, -7746, -5691, -26631, -35445, -20881, -8469, -222, 19522, 19409, 18055, 21253, 2379, -8540, -19174, -38388, -35141, -17897, -11471, -16380, -5045, -7489, 7994, -214, 11272, 21342, -1402, -27738, -4474, -4668, -10787, -23266, -43176, -39334, -23582, -7857, 5345, 3104, 8093, 12572, 18803, 11636, 16735, 24579, 31601, 38178, 29550, 5575, 372, 4846, 898, 4905, 30862, 31856, 26440, 12661, 28835, 19682, 8244, 19702, 35300, 48790, 21402, 43223, 35912, 8356, -7327, 10741, 28005, 42114, 43306, 43384, 32307, 10028, 12886, 30930, 18982, 28667, 27189, 16733, 1200, -24644, -24593, -688, 10279, 283, 21447, 22566, -3387, -11201, -14902, -7955, 24552, 47253, 44806, 24692, 8005, 14540, -13030, -49240, -55910, -46829, -21411, -10576, 16735]
15355A6735j4983k577k027m435l3358J781J2769m821q757n481L0728j0860n14
15342b5800m321J7604R046J3114m743q671j8598J5376o038p962N168J9014P55
15329C944k9222n201K6719J4539J738k3948m390j3139K3873P069O889p691O966
15316H146l988M235l319l1695J2969j5502o681N990n080P53M617K851k2198J0487
15302c8415j532K3380R776j0838j2677r411K6882J0555n28N658M362n5973N840
15289d2921M4148L83m580J3227j1805r942J1216K5392K5482j8556l8082k3734
15277b9772P292J1860J8066K3510k131r918r027J2320m528k6900J7822K3686j0074
15264B2206l301k2764p371J3097J6820k4865j6522q091J6870j292J6047L14Q73
$$ y = [16735, 1752, -825, -2852, -7287, -40645, -38864, -26095, -30916, -39673, -45154, -14426, -25286, -25800, -30121, -12517, -3471, 9643, 4900, -3771, -22369, -6993, -13031, -20993, -15825, 3189, 3944, -25278, -30479, -3760, 10779, 12517, -11431, -15821, -28960, -5087, 1982, 8871, 1180, 8146, 4158, 8393, 5074, -26621, -13652, -29154, -35835, -29845, -34925, -34172, -29555, -26704, -48902, -38415, -39947, -16567, -6791, -17629, -30306, -39717, -12835, -2280, -2808, 2850, 7212, -48761, -42921, 1227, 1610, -2970, 10257, -1548, -11490, -274, 25118, 50600, 32044, -6038, -29772, -22480, -10620, 7446, 30956, 28825, 18907, 9880, 22200, 17672, -9228, 8594, 32280, 22206, 18905, -3859, -11230, 1867, 18687, -6178, -22700, -30791, -13921, -15213, 834, 1148, 2021]
15251B021M726j9695k6146j4692Q19K2653K2005L4925J3655j7703k6473J94P317
15238C606q550R984P420K5130L13k3738M2958N8446N2150J6316k9908j8973j8156
15225A16998l541j8803k2124k7784k3591Q54n768J4177L43N087K8708m258r70
15212E9328j6081j8178p814n067R551j4873m242j219J3803J7672q297j4264n607
15199D712n487P321J8301j8060k6239j3621K5230J127M041K2157O449j1071n537
15186I323K2565j5453n505M347p224Q501K8320k431k8194R254L240k1417j0382
15173e056L79Q934k996p113L3691q914m0098N945L4535o976k5345N854J1180P483
15159A1503j2236j303j0905j8699J9617J3197k097j3896O782P207K0790K72j7102
$$ y = [2021, 6747, -12948, -39094, -53786, -52967, -30314, -8309, 26616, 40271, 22568, -3905, -3711, 3606, -4944, 5040, 12460, 37590, 37903, 14165, 57123, 115569, 167719, 184035, 154127, 135154, 116998, 113457, 94654, 72530, 44746, 21155, 22009, 16241, 30418, 30761, 35848, 64556, 60298, 59328, 43247, 25069, 17255, 12188, 21739, 6866, 2624, 1405, 15208, 32880, 24583, 10319, 4712, -775, 6546, 24847, 6787, -19452, -33073, -7843, -6716, -2675, 19482, 25931, 14860, 9323, 31888, 16435, 10930, 15277, 8053, 16554, 44874, 42443, 14249, 23503, 26743, 5326, -5056, -4677, 4257, 1261, -5852, 27839, 18925, -21173, -15228, 19307, 12331, -13014, -7160, 4020, 11503, -733, -2036, -12941, -31640, -12023, 1174, -923, -14819, -8037, -830, 19960, 20232, 3130]
15146C130L617L1686P274q936K5096Q373l2639j6804j3770J0292P281j34l84K0175
15132D4257L4310n124j4521m1766l2760Q559J524m739P435R190J8059j2411j9008
15119f995L9243P467l7850l604k5937j145J5494J7904P530K0738K745P638L788
15106D7016Q052j5633j6291j847M981j8288k5313j2719M160M72l2733J0659K2550
15093b4934k947R50J4368J7940j4764L31K2494j4404k8334k238L9775N451o861
15080F827Q897K1334j4784P317R086p986j3899k3470l806N461L0850n376l0372
15067i921m138J737P542J5688R035q479r310j1033J4486M469N10k9590r192P977
15053b0219K2989K731K1608R330k5570k8664k1565l425M545K5002K4395J5148
$$ y = [3130, 6747, 38433, 45707, 36771, 61867, 70240, 37601, 20797, 7027, 17319, 24600, 24466, 24082, 44257, 78567, 73443, 58922, 17156, -15604, -7045, -5521, -10260, -2825, 6365, 24424, 12013, -6995, 32248, 39715, 1865, -1739, -27676, -28821, -13327, 4577, 12107, 32845, 35590, 43228, 47016, 55068, 39435, 23144, 21297, 26278, 7990, -17323, -30042, -25882, -25410, -58143, -47484, -24934, -27881, -26931, -12563, 5377, -9387, -9056, 13438, -966, -29300, -31538, 8237, 13688, 6827, 15724, 37058, 22274, 29591, 38677, 30691, 16792, -6678, -10484, -5023, 25827, 20451, -9921, -14059, -12322, -4780, 10908, 19943, 11464, 2154, -8879, 5607, 10076, 10586, -19004, -28196, -20219, 2770, 5501, 27109, 36439, 10869, -17795, -39360, -42785, -38240, -13238, 11157, 26305]
15041B6305K0285l674k2230M162J6548q594P97r126J0675O075N926j381r024r184
15027B7560k6334j2768k0872j5382P4513P5735J3660k7759Q173L2226J9244L5819
15015A83815k742L1622N9150N0104Q3288J09587J74955K98284N51188J191875
15005B731126K793063M130115J388285p36937k385638k882531j917852j075663
14997B043968o31600l79768k09564j50351j17396r8375o4792p8026l6432l2412
14987B45252R599l6527m3597r936p290l4906j542k428k0066m171J9593j8763r225
14974H5993j3515J6867N132J0709j1586l7460k8707K0370K7023K383q739n5365
14962A3105q394J9119J3592K122k1992k5443j3578k853l592l6024J2232N7265
$$ y = [26305, 46590, 42916, 20686, 24848, 41396, 32802, 33599, 24473, 35148, 41223, 47149, 45768, 36744, 27560, 1226, -11542, -32414, -47796, 26717, 102452, 116112, 88353, 96526, 128752, 147996, 183815, 181073, 212695, 271845, 321949, 405237, 514824, 689779, 988063, 1539251, 2731126, 5524189, 9654304, 11042589, 10305652, 7920014, 5037483, 3119631, 2043968, 1412368, 1032600, 823036, 672685, 555289, 456914, 392122, 314096, 277664, 245252, 254851, 218324, 174727, 164791, 157501, 122595, 121053, 118625, 98559, 94388, 113981, 95218, 85993, 72478, 89345, 94477, 105186, 93600, 56140, 27433, 47803, 74826, 77209, 68470, 13105, 4711, 23830, 37422, 39544, 17552, -7891, -21469, -24322, -27914, -63938, -51706, 5559]
14950E559R733k576K759Q872J395J5665j5967k0608j1410k2402n435l077N5939
14937A8447L4837j2620p666J4072Q945r331J19k8869n851K2275R008k46k1334
14924B1786K480K7463J3112j0992o745J6345j7331k7295j3184Q009J5303M077
14912C3028n495m010m054l040j4330l3091j0149L0845M6526M329j6332j9078J741
14899F890j2941J9901j050K5997j5887j9540J998K1937k1858l27k1920K591J6290
14886B081L208J2636k651j6446K6365K3242J2238M52l4107r212j4476j1459j7362
14873b5491l2994J2601J4638N980l312K3314L4142k8103n73J0522k3184j5635
14861b8095L4140M8840j3292l9887k430J1046J8091J7318P588l2534l1666M232
$$ y = [5559, 15292, 12716, 15475, 24347, 25742, 41407, 25440, 4832, -6578, -28980, -34415, -37492, 18447, 53284, 40664, 32998, 47070, 56015, 46684, 46803, 17934, 12083, 34358, 43366, 43120, 21786, 24266, 51729, 64841, 53849, 47104, 63449, 46118, 18823, 5639, 13648, 28951, 33028, 27533, 23523, 19469, 16429, 2099, -30992, -41141, -10296, 36230, 40559, 24227, 5149, 6890, -6051, 13850, 12800, 38797, 22910, 3370, 5368, 27305, 5447, 5120, -16800, -14209, 2081, 5289, 17925, 15274, -1172, 25193, 48435, 60673, 61125, 27018, 17806, 3330, -8129, -25491, -58485, -45884, -31246, -25266, -28578, -5264, 28878, 775, 202, 10724, -12460, -28095, 6045, 54885, 41593, 1706, -724, 10322, 28413, 45731, 53319, 20785, -10881, -6649]
14849f649J2758n266J1664k4831j2021J4124R301J0017J4230K8807L114k6936
14837B8312k8125j7045P97J1729K1971j8188Q570K0842j8932J2436l19k9485k6328
14824c3765K5629N3305j978k8337k2567j1397M846J6531j134Q332J735j2923N460
14811C737j4958K2455R458m4203J1669K0973K620O923K0666P864k3001k1595Q30
14798C438m051N581K0856k1771j4038k7190Q621K2179L694j3558j610m69J52o248
14784b4414J8559N14q912K4419P574p569l7994o109J1698j5675j2579K0927K3793
14771e768M211l2016M070L1964O156k5416p703k563R699K1199J5897n166j6680
14758b116j4458J4910j3679q596J2466K1745O032Q324j1108l5064j3393j310j6332
$$ y = [-6649, 6109, 843, 12507, -12324, -24345, -10221, -920, 9097, 23327, 52134, 55248, 28312, 187, -16858, -16061, -4332, 17639, -549, 8021, 28863, 9931, 22367, 22048, -7437, -33765, -8136, 45169, 43191, 14854, -7713, -19110, -14264, 2267, 1133, 9465, 11200, -1723, 3737, -11221, 11234, 20692, -23511, -11842, 9131, 11751, 18674, 39340, 47204, 24203, 2608, 3438, -613, 4968, 25824, 4053, -9985, -37175, -28554, -6375, -2681, -16239, -17849, -18318, -18166, -24414, -5855, -5341, -14253, 10166, 17740, 10171, -27823, -33932, -22234, -37909, -50488, -29561, -5768, -1557, -33573, -29503, 2461, 8617, -16799, -24502, -27065, -17366, 3833, 19730, 14564, -2116, -16574, -1664, -15343, -23939, -11473, 10272, 16304, 24628, 13520, -21544, -34937, -36247, -52579]
14745e2579P342J3728J8186K2977j91k1602n387O124J03J9803J9456m498k8770
14732e308k4791K0301M2973J7205q515k6842l8148r658j5277J4811J4811J071
14720a7367K4190j408M792j3494j7004j4009J3922L1645k5812j0515J4271L3870
14708B3081L2186Q542K1363k9008j9851j2677j0796R222J1574q182k9036k8700
14696c2282K8331Q207J4670J0115p232k7433l2595q8j0176n362M7307L2276j085
14683B4653k8701J7516L0870R589j6460P5J307j7271P86j5392j4229l8279Q908
14670c6628K2120L5990M305l754K656m46K517M349k1282k2316R559L844k8614
14657b7700L9100J0928k0075k818L994J3724k3143r450L8187J0760j2244n389
$$ y = [-52579, -45237, -31509, -13323, 9654, 9463, -12139, -17526, -11402, -11299, 8504, 27960, 23462, -5308, -30099, -9798, 33175, 50380, 41865, 15023, -23125, -32783, -48060, -33249, -18438, -17367, 6823, 5415, 10207, -3287, -20291, -34300, -20378, 11267, -14545, -25060, -10789, 23081, 55267, 63809, 85172, 56164, 36313, 23636, 12840, 22062, 33636, 25454, -3582, -32282, -3951, 4256, 18926, 29041, 21809, -5624, -38219, -38307, -48483, -53845, -6538, 25738, 24653, -4048, 13468, 44338, 53927, 37467, 37542, 38849, 21578, 22364, 6972, -7257, -45536, -36628, -14508, 21482, 25787, 22033, 24689, 24243, 26760, 31109, 9827, -12489, -2930, 914, -27700, 11400, 22328, 2253, -565, 3429, 17153, -5990, -15440, 22747, 33507, 21263, 15874]
14645A5874k5036j5076j4217L2839K3505J9710K1620R608r048p294m255j7949
14633C0281n402j9910k0280n145K3362K1936J5976O042m211J8596J1672j3612
14621E9305L439j2245n890m8783r902j4648n660k5347P233M3949r82J7079N4726
14608F2274J0821l3320N998J0482J5905N173K691r648l253k971k0286m03r209
14595C4254k2830j8644J1391J4835P803n185j0263J5291j1011q455j0981o519
14583a0314o763J2065L1644R024J1501J6631q723K846n5p742j0991K1036p468
14570E2691q775j3672l9829j3601L3272K272k3708n664p694k805K6814J0685o650
14557C336J1433o323l616m0830j6969K4080K9048K7691k5293j8686m91o622L919
$$ y = [15874, -9162, -24238, -38455, -5616, 17889, 37599, 59219, 68827, 59779, 52485, 48230, 30281, 24879, 4969, -15311, -20456, 2906, 24842, 40818, 46860, 42649, 61245, 72917, 59305, 62744, 50499, 44609, -4174, -14076, -28724, -34384, -59731, -52498, -8549, -9531, 7548, 62274, 73095, 39775, 45773, 56255, 72160, 77333, 80024, 70376, 67123, 64152, 43866, 43463, 34254, 11424, -7220, 4171, 19006, 26809, 21624, 11361, 26652, 15641, 7186, -3795, -10314, -17077, -5012, 26632, 35656, 47157, 63788, 55065, 57911, 57856, 50114, 39123, 60159, 52691, 43916, 30244, -9585, -23186, 10086, 12358, -11350, -17014, -24708, -27513, -699, 9986, 3336, 14769, 8446, 4830, -36000, -52969, -28889, 159, 27850, 2557, -16129, -16620, -23242, -19323]
14544a9323j9676n877K7079J0234K0092K052K8M093N844l09k4944P672J1584j2395
14530F154J4140J4604j0895j0055l1543j9457J579K0336K2208N305l235j2597
14518c456J4470l601K6361Q782k3286J9748J4037k6100j1063K768M191P327l694
14505B6484K289j0912k4072q950J3070K4384Q572j4001j2266n388J0929J841j1075
14492I05K6577M3727j4297J1685P58m980j5815j8614l588m74J2712l1748M267
14479A1115L7376L627m9745j2306M502k2343k2020L4871K15j2984Q755j988J5669
14466e256j9514l2573J1828J4387o2N054O494J1474K2348J5268k3177n084r492
14453h305l5623N963n191j3500K2524N9821K9152n771K1244j5871j267K9525j2338
$$ y = [-19323, -38999, -44876, -17797, -7563, 12529, 14581, 14609, 18702, 24546, 24237, -707, 6965, 18549, 6154, 20294, 34898, 24003, 13948, -17595, -37052, -35473, -15137, 7071, 12376, 9141, -3456, 11014, 7413, 33774, 42556, 19270, 39018, 53055, 26955, 15892, 18660, 22851, 30178, 26484, 28773, 17861, -6211, -15161, -2091, 22293, 30865, 16864, 4598, -790, 10139, 11980, 905, 27482, 71209, 56912, 68597, 69355, 64375, 48560, 29946, 26358, 25884, 38596, 6848, 11115, 48491, 52118, 2373, -9933, -5431, -27774, -49794, -14923, -14708, -27692, -18937, -20925, -5256, -24770, -57343, -45515, -31128, -31190, -26136, -19642, -8168, 14180, 29448, 6271, 1187, -8305, -43928, -37965, -43156, -56656, -34132, 25689, 54841, 49070, 70314, 54443, 53176, 82701, 70363]
14440G0363r698r624J2801K8074J5786k90j5737l8706l6000J7320k722r778j3665
14427H124J1128N619q482k003k054K600j4024P976L5928J016K432K8489L0715
14414A07464j6676L163L0862K9153L4251J5537N3347O4142J17731J87603K89746
14403I16323L08568K75298K05311P5950o5322j84974k51081k89762k77702k10704
14393E01905j38304l9096k8463j7254k1736l4541j5756j4852r716j4242m2174
14382A25771j0013j5959O33j5196k2678n132K2099J1465o445j619J0920J7929
14370A11775q082l4926K1466o28j9289k6618J3698J3205o826j8892j169k1364
14358B2350j045j0719J1224k5387q894K1215L8540J3264l4463o627J8436J2971
$$ y = [70363, 60665, 51041, 63842, 91916, 107702, 107412, 91675, 52969, 16969, 34289, 31567, 21789, 8124, 19252, 24871, 16389, 14386, 12332, 14932, 908, 8884, 44812, 45828, 48260, 76749, 107464, 90788, 93951, 124813, 153966, 188217, 203754, 257101, 321243, 438974, 626577, 916323, 1224891, 1500189, 1705500, 1781450, 1716128, 1531154, 1280073, 990311, 712609, 501905, 363601, 324505, 296042, 278788, 257052, 222511, 206755, 191903, 182187, 167945, 125771, 115758, 99799, 100432, 85236, 62558, 57426, 79525, 90990, 84545, 82926, 93846, 111775, 103693, 68767, 90233, 89605, 70316, 43698, 57396, 70601, 63775, 44883, 43714, 22350, 21305, 10586, 21810, -3577, -12471, 8744, 47284, 60548, 26085, 19458, 37894, 50865]
14346E0865l425j0460J5066O465R683L070q330o139R832n984p250O76j730j59
14332E2180j6935L6414J5456j1736j955O918r746Q00j3589O006K117q162L688
14319F1456k1935j0184J420J512J3454L1975J5625j1175j6513J8294l6308j6004
14307C1617K5095K884R314R326J5656k8449k1615j667J6862m808L279j9555j0268
14294B7671Q46K271m991p259P68L8716M377k594J8241J7212p765L91k8696j2514
14280D6674k444J0875j0564n6048J7134K3379J3574P583J785j4189K463J1809
14268E2031J6480j6108j7898j6902l912K3972J6697o301q454j2845K9634J0900
14256F7294K769O00j7515N83j5450P561K4639K2820J3185j4749j5452J311J2745
$$ y = [50865, 47440, 36980, 52046, 58511, 68194, 71264, 62934, 56795, 66627, 60643, 53393, 54069, 52339, 52180, 35245, 71659, 87115, 75379, 73424, 80342, 70596, 71396, 57807, 63813, 65930, 57768, 61456, 39521, 29337, 30757, 32269, 45723, 77698, 93323, 82148, 65635, 83929, 47621, 31617, 56712, 59596, 68910, 78236, 93892, 65443, 43828, 42161, 59023, 54215, 57494, 37939, 27671, 28517, 30788, 25797, 18538, 19306, 58022, 62399, 59805, 78046, 95258, 87493, 87884, 59188, 46674, 44230, 55105, 44541, -11507, 5627, 29006, 42580, 50163, 51948, 37759, 40222, 52031, 68511, 52403, 34505, 17603, 13691, 37663, 54360, 48059, 39605, 26760, 56394, 67294, 70063, 70663, 53148, 53731, 38281, 45842, 70481, 93301, 106486, 91737, 76285, 77596, 90341]
14243I0341l777k370j6559n470J022k2559l2084K9237R534L4394k82O062j4502
14230G2987j987J948J2302K84j1576R174J787j2254J0528l015N823O356k2368
14217F9989J0046L6846j0780j0300M166K5898K6054J9239R192r637m878l0851
14205A34984j7433k6444r528j7012r278k4475J2418J9220J4303J8816k6074k1549
14193D7948m354L527J3268J5507K0804j485o964K4301K5740m094J7230M288J2109
14180A67825j7990K064K3762N137J7096K3198M4272L6324L7664K6572L1192J0438
14168D07554J9864K3093L1890K6360O592M6255R7641J06812J89529L71589N94118
14157A921297P88127J033185J099935J012897Q16409N11206J66593k50173o49490
$$ y = [90341, 86564, 84194, 67635, 62165, 63187, 40628, 8544, 37781, 47315, 81709, 81427, 87489, 72987, 71000, 72948, 85250, 85534, 73958, 83132, 84919, 72665, 83193, 80178, 86001, 92357, 69989, 80035, 116881, 106101, 95801, 99967, 125865, 151919, 171158, 180350, 170713, 165835, 134984, 117551, 91107, 81579, 64567, 55289, 30814, 43232, 62452, 76755, 95571, 69497, 47948, 43594, 47121, 60389, 75896, 96700, 95215, 88251, 112552, 138292, 134198, 151428, 155716, 167825, 149835, 151899, 175661, 180798, 197894, 221092, 265364, 301688, 339352, 365924, 397116, 407554, 427418, 450511, 482401, 508761, 515353, 561608, 659249, 766061, 955590, 1327179, 1921297, 2709424, 3742609, 4842544, 5855441, 6671850, 7183056, 7349649, 7099476, 6449986]
14148F449986r28192j032599j057251q90524o80077m34875k86976j86398j34616
14139H18478p8319p0453p2031n5577p3714n2438k6965k488l0163k4518J0914K4825
14127C67551k4576m7488k2249Q037l1568p2695l8768j2048j615K516J3102K0620
14115A60819r133J228M0544J8762j8820j9379L406l5073m3346j3573J5975r718
14103I1692j3895j0885Q335j8377k6363R533J2708r28L2443J0388p985l279j7278
14090F6109m175J2289K95m238P254K0120L5669J7078L31k827L2226M2088L4722
14077B56941J3840K9626P4957O6561J18511J47314J66594J41123J72711J73624
14067A361802M8708n6822j42564j92735k03782j72025j07952p7511k4790j4105
$$ y = [6449986, 5521794, 4489195, 3431944, 2541420, 1861343, 1426468, 1139492, 953094, 818478, 740159, 669706, 597675, 542098, 468384, 415946, 388981, 386493, 356330, 331812, 342726, 367551, 342975, 295487, 273238, 281275, 249707, 177012, 138244, 126196, 124581, 127097, 140199, 160819, 151686, 152914, 193458, 212220, 193400, 174021, 177427, 142354, 99008, 85435, 101410, 91692, 77797, 66912, 75247, 56870, 30507, 40040, 52748, 51820, 84263, 94651, 86666, 83387, 66109, 61934, 74223, 74518, 70280, 77534, 97654, 133323, 150401, 150732, 147905, 180131, 222219, 256941, 270781, 300407, 375364, 441925, 560436, 707750, 874344, 1015467, 1188178, 1361802, 1410510, 1353688, 1211124, 1018389, 814607, 642582, 534630, 457119, 432329, 418224]
14057D18224k4550J1403O43l406j7776J261n908J1480K0781J247l5242n4234k0756
14044C03167j7617o0397q2912o7891n8396n1857j6753m3557j3802J2319O1826
14033c5870N6531k691m320p297J6602M3096O1382O4922M8771R4123P9167K3101
14021D37517p054m6303n0490n3964o4294k5353J9816J3419k7546j2203M8053o56
14009B30942L000M6408L5785L4991P9282N3641J16344J44096J67448J61198J31480
13998A204615O7957M3139J1200k3039q7661j67029j52029j18521j11137j02377
13988E65118m1105k3669k8218k5533k8945o582O899J8161K3508L1956J9486n3066
13976D58010L289K1153O501j3938K4225L8697O0792J2116o896j3729r590M0199
$$ y = [418224, 393674, 405077, 405720, 402314, 384538, 385799, 379891, 391371, 412152, 413399, 378157, 323923, 303167, 285550, 225153, 142241, 74350, 15954, -35903, -52656, -96213, -110015, -97696, -35870, 20661, 17970, 13650, 6353, 22955, 66051, 127433, 192355, 241126, 335249, 414416, 437517, 430463, 384160, 333670, 279706, 215412, 190059, 209875, 223294, 195748, 183545, 231598, 230942, 233942, 280350, 316135, 351126, 430408, 484049, 600393, 744489, 911937, 1073135, 1204615, 1272572, 1315711, 1326911, 1303872, 1216211, 1049182, 897153, 778632, 667495, 565118, 524013, 500344, 472126, 446593, 417648, 411066, 417965, 436126, 459634, 491590, 511076, 458010, 461299, 482452, 488953, 475015, 499240, 537937, 598729, 610845, 603949, 590220, 580630, 620829]
13964F20829N3515N1983m882K1570p218O309J4828M4169M7359Q0434Q2601P3662
13952A085159N5626N2646R6357Q3787P1878Q4434J00430J01083R7142J32104J51946
13941B112592J66638J74136K34505L33378M66303O18912Q50548R91047J135236
13932G083295J245218J307735J390005J514526J611759J855673K293819L037677
13924B1339707M301113O710834J1294115J9801050L2747529M7800677O2064884
13917B06059909O5300854N6593960L1958881J31916l1330246n3256000o1106415
13910B14352859n6844666m4929678l1851188k0912272j3347208q634059n737044
13903C2096744m059320l112513k561919k218770j955180j716943j589942j508607
$$ y = [620829, 674344, 726327, 721445, 743015, 735797, 742106, 756934, 801103, 848462, 928896, 1011497, 1085159, 1140785, 1193431, 1289788, 1373575, 1445453, 1529887, 1630317, 1731400, 1828542, 1960646, 2112592, 2279230, 2453366, 2687871, 3021249, 3487552, 4106464, 4957012, 5948059, 7083295, 8328513, 9636248, 11026253, 12540779, 14152538, 16008211, 18302030, 21339707, 25640820, 32351654, 43645769, 63446819, 96194348, 143995025, 206059909, 271360763, 327954723, 359913604, 360045520, 328715274, 275459274, 214352859, 157508193, 112578515, 80727327, 59815055, 46467847, 37833788, 32096744, 28037424, 24924911, 22362992, 20144222, 18189042, 16472099, 14882157, 13373550]
13895A3373550j430720j325922j196559r83365q20061p16039o35720n20223m51881
13886E293060l92518l43501k82691l01600k76081k59450k40671k35596j67412
13877B793540n6557M6228J29897K17084K65825L07909K72034J67104M9057p5484
13867D116637j66252k74617l77807m38554m67700m07464k97215k01939j70952
13858A314137j21083j18875j08102q4686o7802m9692m0068J450k6445j8501J2025
13847F92358P745j3326l5274l7010j8721m7740l4219J8157K8998k1244k437k089
13835E35198k9955k6468j2546j0599l123J823L02M67j0940k0928j1443p618O953
13822D11123N85j5566j1717m0481N651J0956L311r778O975n183m551j0407J0281
$$ y = [13373550, 11942830, 10616908, 9420349, 8436984, 7616923, 6900884, 6265164, 5744941, 5293060, 4900542, 4557041, 4274350, 3972750, 3696669, 3437219, 3196548, 2960952, 2793540, 2736983, 2783211, 2913108, 3130192, 3396017, 3703926, 3975960, 4143064, 4192121, 4116637, 3950385, 3675768, 3297961, 2859407, 2391707, 1984243, 1687028, 1485089, 1314137, 1193054, 1074179, 966077, 881391, 813589, 763897, 723829, 725279, 698834, 680333, 692358, 700103, 686777, 651503, 614493, 595772, 548032, 513813, 531970, 560968, 539724, 537287, 535198, 505243, 478775, 466229, 455630, 452507, 454330, 454632, 455099, 444159, 423231, 411788, 404170, 411123, 411708, 396142, 384425, 343944, 349595, 360551, 363862, 354084, 361059, 355876, 351325, 340918, 351199]
13809C51199K5660L5541J5571L8894K2321n455J7318j0824j5193m104j9323j2695
13797D38910J4556K6077k874J3059L4486J8159j8576r361j9932m2754q9054r2397
13785B70299q2097o9549p9513m6676r918o450J428J1387J7881J3200l35k6646
13773f989q352o27j5839j5717J409K5139R676K0559K1005K4424J7847j2738N696
13760F5493J1415k668J8657M6542O2175J16139J63342J84352K44128K70307J72038
13749A351920K4164p2773j78264k51888k53666j59157r2011n0956k4517k7759
13739B65093l1162n0750l2411O420k218l2001r933J560l72J4512K522j3818j0733
13726A06709j875J3717k6139j7276N622j94q68j2480j3785l6492k7389j5430k0968
$$ y = [351199, 376859, 412400, 427971, 466865, 489186, 483731, 501049, 490225, 475032, 470928, 451605, 438910, 453466, 479543, 476669, 489728, 524214, 542373, 523797, 514436, 494504, 451750, 362696, 270299, 188202, 118653, 39140, -7536, -17454, -23904, -22476, -11089, 6792, 19992, 19657, -6989, -15341, -15968, -31807, -47524, -46115, -20976, -11300, 9259, 30264, 54688, 72535, 59797, 65493, 76908, 74240, 92897, 139439, 201614, 317753, 481095, 665447, 909575, 1179882, 1351920, 1376084, 1303311, 1125047, 873159, 619493, 460336, 368325, 317369, 292852, 265093, 233931, 183181, 150770, 157190, 154972, 122971, 113038, 114598, 114226, 128738, 131260, 117442, 106709, 104834, 118551, 92412, 75136, 80758, 80564, 79696, 67216, 53431, 16939, -10450, -25880, -46848]
13713d6848K740M4465J5999J4560M2067M708m574J4972L0395k3729n6137k4525
13701A4093M541j3028q562K5303K7380K1600J8781J0791K685j1897l2509k6583
13689C2595J6754J1500J2156Q973J0059p556k9679K6864j6122Q666M2476L8885
13677A55571L1714O9317J25561K43897M90472P31650O21235K16001k94810n43596
13667A847012n72826m21576k77328j78142q7291l3892n4886j4765P229k4381j7838
13656A71316q109M427k4490j3300k0441k6588R603k0937k0992L533l0260m672
13644A9090L6643M309k2013o536k131R257j1848j5982N279M334L1798o717k4767
13631B0716r113P260K5127j2531k9386J9980K5422J8642K9418L0557r443k158
$$ y = [-46848, -44108, 357, 16356, 30916, 72983, 77691, 73117, 88089, 118484, 94755, 38618, 14093, 18634, 5606, -2956, 22347, 49727, 71327, 90108, 100899, 103584, 91687, 59178, 32595, 49349, 60849, 73005, 81978, 92037, 84481, 54802, 81666, 65544, 74210, 116686, 155571, 187285, 256602, 382163, 626060, 1116532, 1848182, 2469417, 2685418, 2390608, 1847012, 1274186, 852610, 575282, 397140, 309849, 275957, 221071, 206306, 213535, 189154, 171316, 163207, 167634, 143144, 129844, 109403, 82815, 92418, 71481, 50489, 54022, 23762, 19090, 55733, 60042, 38029, 31493, 29362, 38619, 26771, 10789, 16068, 20402, 52200, 45483, 20716, 11603, 18863, 43990, 31459, 2073, 22053, 47475, 66117, 95535, 126092, 116649, 114491]
13619A14491j50k7091j6337k3297k5721r066J0179j0878j647l543o398j2126P238
13606d346p04k399k186J4740K5211L5320Q699L45J2340n3635m2527j8349j7960
13593d5451j2965K2375N1055J4359k6605j1706K234k3444L3825M1082J1667j6698
13581C9728l963n2671j2215L1469r261j5480p605r048K0755Q222K5230k751O28
13568A3038n177l408q38L666K4727k1444l5230O215R227J9379Q881k423N511r847
13554A2277J3114K289P693P887j1201j0474K1708M840j0893j7909J262k4713l12
13541d432R628L2834j0697j3387k2938P696J0511N223l507L103J4440r577j0421
13528H476M374j435j221j6321k7559N869J5846K0292J4235p116r897L1215J5587
$$ y = [114491, 114341, 87250, 70913, 47616, 21895, 12829, 23008, 12130, 10483, 6940, 542, -11584, -4346, -5050, -7449, -9635, 5105, 30316, 65636, 74335, 74680, 87020, 33385, -9142, -27491, -45451, -58416, -36041, 15014, 29373, 2768, -8938, -6704, -30148, 3677, 44759, 56426, 39728, 35765, -16906, -29121, 2348, -6913, -22393, -29998, -39046, -18291, -10069, 15161, 12410, 13038, 7861, 4453, 3615, 7281, 32008, 10564, -24666, -18451, -9224, 10155, 19036, 16613, 22124, 12277, 25391, 27680, 35373, 43260, 32059, 21585, 43293, 48133, 37240, 19331, 20593, -4120, -4432, 5196, 38030, 27333, 13946, -8992, -1296, 9215, 14438, 10931, 14034, 28474, 18897, 8476, 12850, 11415, 10194, -6127, -33686, -27817, -11971, 8321, 22556, 15440, 5543, 36758, 52345]
13515E2345j0503j1052K9795k0320l3490K814L0103j6711k8095k9246m025J7572
13503b0813M7517j8719l8966R525K0802J9889r999m75N06Q86m37L748K0460M623
13489C8547k2856l4595j7732j6079J2190L0166J4122L971k1016J184q493j8817
13477c9408J0285J8205p78N501J2808k1386k2476r727L5808O0616J8512o498m6010
13464A5452k7076j3468k1027Q226K5225L1245P613n418L301J7932j4780k0840
13452F385k3839m29K3963L0576l5400N989J0075k910Q261k9578j4486R175K7418
13439A5200m136N458K9456K1737L7258J5770l710K5214N4127M7318N6765J16522
13427D16979J66304K43181L16390L25257K54669J08377m559j59652k57723l14547
$$ y = [52345, 41842, 30790, 60585, 40265, 6775, 9589, 39692, 22981, -5114, -34360, -38385, -20813, 26704, 7985, -30981, -21456, -654, 19235, 9236, 8761, 9267, 10153, 9716, 13464, 33924, 38547, 15691, -18904, -36636, -52715, -40525, -10359, 3763, 7734, -13282, -12098, -20591, -39408, -29123, -10918, -11696, -6195, 6613, -14773, -37249, -46976, -11168, 49448, 67960, 61462, 15452, -11624, -25092, -46119, -37893, -12668, 18577, 26190, 20772, 24073, 42005, 27225, 6385, -17454, -17883, 6080, 36656, 1256, 7245, 17320, 14410, 22671, -6907, -21393, -12218, 15200, 11064, 16522, 45978, 67715, 104973, 120743, 117033, 142247, 196374, 243692, 300457, 416979, 583283, 826464, 1142854, 1468111, 1722780, 1831157, 1826598, 1666946, 1409223, 1094676]
13417A094676l02867k01096j21691j22165q5143n5452m2837R603N376n2759j9840
13406A05805j4233o109M377N493j0588k6675N763O836k460J9047j3109l1096l2190
13393A0861N032J3766m69k8738r637K660l724o769J109n934o027K2852j8081r699
13379c2798L0232K788L6j6124m642K7366j6231j3566r963P694K1514k61L827o333
13365f461m193J872P485N03P91k389j031j3512L0925K6293r265K479O228k3130
13351A6595l5390p951J5068R275N94R720Q637m39J3273K3146l5878k0791J8933
13338A4792Q141J6496j1367j916l0878j6320Q303J6479K2524R626l5266j1947
13326a1333j148J9653L9517n000J0605K0212r96k8306j0749J270P262K5839J4852
$$ y = [1094676, 791809, 590713, 469022, 346857, 261714, 206262, 163425, 173028, 178404, 125645, 105805, 91572, 85463, 89840, 95333, 84745, 58070, 63833, 70669, 68209, 87256, 74147, 43051, 10861, 15893, 29659, 29190, 452, -9185, -6525, -10249, -17018, -15909, -21843, -27870, -5018, -23099, -32798, -2566, 222, 258, -15866, -20508, 6858, -9373, -22939, -32902, -25208, -3694, -3955, -128, -6461, -10654, -8782, -1297, -794, -3, -2392, -3423, -16935, 13990, 40283, 31018, 33497, 39725, 16595, -18795, -26746, -11678, -2403, -1809, 7911, 16548, 16109, 29382, 52528, 16650, -4141, 14792, 22933, 39429, 28062, 26146, -4732, -21052, -12749, 3730, 26254, 35880, 614, -11333, -12481, 7172, 46689, 41689, 52294, 72506, 71510, 43204, 32455, 33725, 40987, 66826, 81678]
13313H1678l5086m0187j8056J6207J9980J9349Q289k7005m940M057J314J7272
13301D2872L348j7688J3075M2304J6082J9468o097l5018j3552J5807j2035j5689
13289E2877p960j5905k8676M28R278K685j9983J8463L9157N712o14p981p005L463
13275D3939m858j4012k1528L0056L158j6389j2647q770k2950J1156L710J0401
13263A266J3739M636j5090J1269L2762K524j0262O396K6837N9589N5961M1079
13251B30706k606N939L022j2696m0139n8973l6487j4224l0387j6705O382M8959
13239H2791K6481L623j9148l3834j1914J8237j8225o060K909L942K4580p280l1738
13226C4364j3201L26K606J0852J3440q923j1219j5172O155J8081p240k5810J1140
$$ y = [81678, 46592, 6405, -11651, 4556, 24536, 43885, 52174, 25169, 20229, 24286, 25600, 42872, 46220, 28532, 41607, 83911, 99993, 119461, 113364, 78346, 64794, 80601, 68566, 52877, 44917, 29012, 336, 764, 10042, 12727, -7256, 11207, 50364, 56076, 55462, 47481, 40476, 43939, 39081, 25069, 3541, 33597, 36755, 20366, 7719, -1051, -24001, -12845, -9135, 1266, 15005, 19641, 4551, 15820, 48582, 51106, 40844, 47240, 74077, 133666, 189627, 230706, 228100, 234039, 237061, 224365, 184226, 125253, 88766, 74542, 44155, 27450, 33832, 82791, 109272, 112895, 93747, 59913, 47999, 66236, 48011, 41951, 44860, 48802, 73382, 66102, 34364, 21163, 21489, 24095, 34947, 48387, 39464, 28245, 13073, 19228, 37309, 30069, 4259, 15399]
13213A5399L0475J7316L4019J7152M6756O5245O3677L6053k391m4295p0801o6728
13201A41877k4823o568k0273m752J7690L0330O3718N5849K3813j4730j6283m6798
13189A99050m1771l9721k1770q804J3711k5629j4493m7323j3193j6924l074L2067
13177A2126J9206q575J6230l061j2018J131j2529J240k25K574O647K2053J5639
13164F0438J2307n730M8194M0130J0904l1845o8525k3055J0377q267j1041J9636
13152E3523M5533K4208L7026R2735K9924k7923n0417m5171l4005n1413m765J5264
13140H4519n225l1480k53j5322n973k2253K1545K7669p089N280J2959j1826l5742
13127A6809J31J3336Q204o737j3640J6727J1464j6026m426J229K78r921k9250
$$ y = [15399, 45874, 63190, 97209, 114361, 161117, 226362, 290039, 326092, 323701, 279406, 208605, 141877, 117054, 110486, 90213, 85461, 103151, 133481, 197199, 253048, 276861, 262131, 245848, 199050, 157279, 117558, 95788, 86984, 100695, 75066, 60573, 13250, 57, -16867, -19941, 12126, 31332, 22757, 38987, 35926, 23908, 25039, 12510, 13750, 13525, 16099, 22746, 44799, 60438, 72745, 67015, 115209, 155339, 166243, 134398, 65873, 42818, 53195, 44928, 33887, 53523, 99056, 123264, 160290, 253025, 282949, 255026, 204609, 159438, 125433, 74020, 69255, 84519, 79294, 47814, 47561, 32239, 26266, 4013, 25558, 53227, 46138, 51418, 64377, 52551, 16809, 16940, 30276, 38480, 31743, 18103, 34830, 46294, 30268, 25842, 27071, 27349, 17428, -11822]
13114a1822K0596L0192L3803Q297j269k9212o361J0310Q196J1188K2449k842l6365
13101E7160m8357q830K4430r448K2359K0661j4646q026R328j5147L1437J1565
13089G2486o0Q55k5413j9761m429K883N735K6096q342j4452M055k2451l4960j9421
13075c7179M868K7069K716K5005N790j2678j7544J2765Q860O733L791l5276k6173
13062c1253M284L0395K3172j5256l5216Q170K0959K7412m551k461J430j3860l210
13049A0015j0335P533k266k406L974J2601k332j7716k735N892J4679K426o448
13036A2882k1307j7306K440j2683K993j0107J8035K2447K4860m603r977R596N604
13023B2874j0906r64r284O784Q734R476k6138j0348o188r513J8739P552j4932
$$ y = [-11822, 8774, 38966, 72769, 81066, 79797, 50585, 44224, 54534, 62730, 73918, 96367, 93525, 57160, 8803, -27, 24403, 14955, 37314, 57975, 43329, 35303, 44631, 29484, 60921, 72486, 72426, 73281, 47868, 28107, 23678, 26561, 32296, 58392, 50050, 35598, 39653, 17202, -17758, -37179, -32311, -5242, -2526, 22479, 28269, 15591, -1953, 10812, 19672, 26405, 30196, -5080, -31253, -26969, 3426, 26598, 11342, -23874, -15704, 5255, 32667, 28116, 25655, 27085, 13225, 10015, -320, 7213, 4947, 2541, 6515, 19116, 16784, -932, -3667, 2225, 16904, 19330, 12882, -8425, -25731, -23291, -35974, -32981, -43088, -25053, -2606, 22254, 17651, 7674, 17270, 22874, 11968, 11004, 1720, 8504, 17238, 26714, 576, -9772, -15960, -25473, -6734, 818, -14114]
13010a4114l825MJ6262O527k1242J5792J8282N650K5623K8039k6617j8873n190
12997B6318j7207p284K0623J1784R638J8632Q989K029N581l1248q142p002R494
12984D2205m754l4970j0863m050J6436K9188K8652Q313M13m7035k6275r779o066
12971a8585P525j1083J1750J3193q659N630o830J2393o080k9247K032J1745o519
12958b2735J5780L2729j6634l1640k3109J80O1292K1732m565K2868j3868k8947
12946A3083J5995O858J1194j5640j2028J8367o799k4587J930l405k1410L896P471
12933e075k4353m64K8123M760j8496q712j7069K0538J1744j2694J1407m640l555
12920a8486K8496J9842j0717o963j3548q051j2420K4213j464K369J6298j8690
$$ y = [-14114, -17939, -17935, -1673, 4854, -16388, -596, 17686, 23336, 48959, 76998, 50381, 31508, 26318, 9111, 1827, 22450, 34234, 43872, 62504, 71493, 73522, 79103, 47855, 39713, 32711, 42205, 37451, 2481, -8382, -12432, 4004, 33192, 61844, 70157, 70570, 23535, -2740, -12519, -18585, -11060, -22143, -10393, 2800, -5859, -229, -7059, 5334, -746, -29993, -27961, -16216, -22735, -6955, 25774, 9140, -22500, -45609, -45429, 15863, 37595, 33030, 55898, 42030, 13083, 29078, 35936, 47130, 31490, 19462, 37829, 31030, 6443, 8373, 4968, -16442, -12546, -5075, -29428, -29892, -1769, 2991, -15505, -24217, -41286, -20748, -9004, -21698, -10291, -14931, -18486, 10010, 29852, 19135, 12172, -1376, -9427, -21847, 2366, 902, 3271, 19569, 879]
12908H79l775K8420p876o004J0092k2045l8958O428K7522L2156q846k8593n593
12895a6193J6968K5240L3826k4950l550O0J1618Q879m891J7755j5452k0623j106
12882B7581j946L206N59k041j3716L9730L9051M535l0937k8941l1517m499N805
12869F870K617J0280J9002K939r303j9718k3538j5968J9209J1857J0523o273L5547
12856D4044p635k0233J3380J5228k9711l534M09j0613N955k4762N53L4200K9125
12843D6406L1376k0951p651j1767l965j0868k5073K4992N311j046J3064J6119
12831E5947k8247J1939J9091q368r533J149j4662k9777l4007K87K0562J2659k7069
12818c0029P764o291j2581M2830L0608l0806j7525p139j8079R598K8792n634M501
$$ y = [879, -2896, 25524, 17648, 11644, 21736, -309, -39267, -32839, -5317, 26839, 17993, -10600, -16193, 775, 26015, 59841, 34891, 31341, 31401, 43019, 51898, 47007, 64762, 49310, 28687, 27581, 25635, 28841, 29400, 27359, 13643, 53373, 92424, 96959, 66022, 37081, 5564, 1065, 6870, 9487, 19767, 38769, 41708, 32405, 12687, -10851, -26819, -7610, 4247, 14770, 8497, 44044, 36409, 16176, 29556, 44784, 15073, 11539, 11948, 1335, 7290, -17472, -16919, 17281, 46406, 77782, 56831, 49180, 37413, 33448, 22580, -2493, 22499, 27810, 26764, 39828, 55947, 27700, 39639, 58730, 50362, 40829, 41978, 27316, -2461, -36468, -36181, -15619, -2960, -30029, -22265, -28556, -41137, 1693, 32301, 1495, -16030, -23169, -41248, -31650, -2858, -8492, -3991]
12805c991J5244K9635K4559j6090l6619l547o208k0299J9556N8346P8789J24310
12793B63685J45402Q3257k4734j12788r8448p5160m5117n2434l7001j7842n967
12782B2853Q982J3470K5292N664j1952l4141k3503m852J0514L3402L331k4905
12770B4155q816k172J0514J646J1051q83k421o298q313M1394J6504m7303k3043
12757F015o042j231m877J826N2o791J7978k0532J2670r930j3656j3695K4654L1450
12743A7891O60q272K1851j9948n357j2601p863K5458K8307k267n803j3806k8013
12730i763k3361N610K7433K7282k0015K973p43l26q3J1116k9080k4954O353J7928
12716i630m823r61R273N032L983J5395k6002q598M424P785N034m510J5707Q02
$$ y = [-3991, 11253, 40888, 65447, 49357, 12738, 9191, 2983, -17316, 2240, 60586, 139375, 263685, 409087, 492344, 467610, 354822, 256374, 181214, 136097, 83663, 46662, 28820, 22853, 31835, 45305, 70597, 76261, 64309, 30168, 6665, 1813, 12327, 45729, 49060, 24155, 15339, 13167, 23681, 25327, 36378, 35495, 33074, 26776, 18463, 59857, 76361, 29058, 6015, -27, -1258, -6135, -4309, -4257, -11048, 6930, -13602, -932, -10862, -24518, -38213, -13559, 17891, 18551, 10279, 32130, 12182, 6825, -5776, -13639, 11819, 40126, 37859, 32056, 18250, -9763, -33124, -27514, -81, 27201, 7186, 10159, 9416, 9090, 9007, 20123, -8957, -33911, -27558, -9630, -14453, -15414, -6141, -1109, 2874, 18269, -7733, -16331, -11907, -4122, 912, -3598, 12109, 12911]
12702A2911m881p253m19L987o381M970J5202j3810j8572m003J0257O507P916L3974
12688D0405M6090o86n655k4429k8520l6715r500p137J1968K0076K1127j908j4069
12675A1047l135q34j9517K529q488P199J0715J3654M421J2441k7886R786J4283
12662B6215l329r344O242n081o805N233j0256r246k3872J2580M8536K0243k0612
12649C0504k2994n718j3362J8025J5474J1576J566j5171L909N462J8457j6223
12637C1505Q571p685j5415j6082q154L2434J3701N785L0107J5756r110l5858l8550
12624G005J5799j203J8906k967j4772k0919m8897J2451L1092J2504j606j3767
12612f374j5830L1063P608m175K6394N206l1068m0956k286j8420o782R749L016
$$ y = [12911, 8030, 777, 358, 4345, -2036, 2934, 18136, 4326, -14246, -18249, -7992, -1485, 6431, 40405, 86495, 85809, 80154, 55725, 27205, -9510, -19010, -26147, -14179, 5897, 27024, 25116, 11047, 7912, 7078, -12439, -9910, -18398, -11199, -484, 13170, 17591, 30032, 2146, 11932, 26215, 22886, 13542, 19784, 14703, 7898, 13131, 2875, -6371, -30243, -17663, 30873, 51116, 30504, 7510, 1792, -11570, 6455, 21929, 33505, 35071, 19900, 23809, 29271, 47728, 31505, 40076, 32391, 16976, 894, -7260, 25174, 38875, 44660, 74767, 90523, 81413, 45555, 7005, 22804, 21601, 40507, 37540, 22768, 1849, -47048, -34597, -3505, 8999, 7393, -6374, -22204, 8859, 16467, 12292, 38686, 43892, 12824, -28132, -30418, -48838, -55620, -45871, -42855]
12599d2855K2523J024l464L1538K5034o598j1098k7761j084Q786j2700N280L5621
12586B4246K0098J9209k1j9621m3463K7612L8078l6597k4764P349J3040O737J1244
12573D3147k5053O989p831k3889j3225p197K7370K8496J007j0627j2700P925M828
12560A9240Q309k1829l470J7581K9764j5725j3940j0914Q455J020k4832o956J0147
12547c150P956J3913k1174m083j0703j5019N827j0147J7301L1201k096J0125k0306
12534c55J4066L6479j246k3749J3676j7033k2459P248L9393j5444m2542l2608
12522d4574j1695p387J2218K0010L4638K1043J5363J9955M7860N5471K0810j2792
12510A70920l9053j3096l3754l5639J8477j2451j1526n857R320j2873l6884k4635
$$ y = [-42855, -20332, -19308, -22772, 8766, 33800, 27202, 16104, -11657, -12741, -3955, -16655, -11375, 24246, 44344, 63553, 63532, 43911, 448, 28060, 66138, 29541, 4777, 12126, 25166, 31903, 43147, 18094, 25083, 17252, -6637, -19862, -27059, 311, 28807, 29814, 19187, 6487, 14412, 19240, 27549, 5720, 2250, 19831, 49595, 33870, 19930, 9016, 17471, 18491, -6341, -13297, -3150, 4806, 18719, -2455, -6538, -17241, -32260, -26433, -36580, -19279, 11922, 9826, 19951, -355, 13711, 50190, 48944, 25195, 38871, 21838, -621, 6627, 46020, 30576, -11966, -44574, -56269, -63656, -51438, -31428, 3210, 24253, 39616, 59571, 107431, 162902, 183712, 170920, 131867, 118771, 85017, 49378, 67855, 55404, 43878, 38021, 47341, 34468, -2416, -27051]
12498b7051k8121j0633K2979M1755J4059M5790J7903p924q080k1001k1638k0132
12486b094o999P876R133l016R726L324K1340J0767l3592J4252K9649N8772O6124
12473A85262P5908M3667j3319p5780n2729n2464l7852j0293J0457q211k9842k5214
12461I590M787M295j3745o729m877k5578q152J7243K8729R72n84k5728L487Q190
12447h100L3926J3959k982n797k0446P701K1445J3395j1376k7202M045L7415J3955
12434F9938L1883J7827K9380n848n4722l3034R369r243j0982n0893j8815L722
12422b1418J2660J0010n562J7884n9O906m888P937q642j4715n559K545j2336r30
12408a6167R425l639L998j4621r359K4101R370k853J7678J700j8154K0621m025
$$ y = [-27051, -55172, -65805, -42826, -1071, 12988, 58778, 76681, 68757, 60677, 39676, 18038, -2094, -9093, -1217, 7916, 4900, 14626, 17950, 39290, 50057, 16465, 30717, 60366, 119138, 185262, 261170, 304837, 291518, 215738, 163009, 110545, 72693, 62400, 72857, 64646, 34804, 9590, 14377, 18672, 4927, -1802, -6679, -32257, -40409, -23166, 5563, 6535, 5951, -19777, -16290, -8100, 25826, 39785, 36803, 31006, 10560, 18261, 39706, 53101, 41725, 14523, 18568, 55983, 69938, 101821, 119648, 149028, 143180, 88458, 55424, 64793, 55550, 44568, -6325, -25140, -21418, -8758, 1252, -4310, 13574, 13515, 20421, 15533, 23470, 14828, 113, -5446, -2901, -15237, -16167, -6742, -10381, -6383, -21004, -30363, -6262, 3108, 255, 17933, 19633, 1479, 22100, 18075]
12395A8075N136n903p789j4619j0858Q82m21R437L6728p374j0810L7513M6084
12382I6081J411m4184k7123j0142k5050J2829p794j4658p845R173J2529L7155
12370C2382M082k3586j9296l1218k2218J5671M5472L3480q670l624n970p180R167
12357A8492O586j8436J5646R557l771l2867l9915k970K3321m089J1375j1379m070
12344c2520j2631K5288K9606K3554M77k9032J0805J0784o303j3469l2858j038
12332b7337o792J4258K0011J234j5002j1900O823J8950R686q304n64j2485l9368
12319e0790K1120J6342J6357K4262m584R726K2204K0003M7192R1402J49132J11169
12307D73535K1990n1047j22993j33490r8571n0699j8254o262J868n855J9245L861
$$ y = [18075, 23211, 17308, 9519, -5100, -15958, -15076, -15497, -6060, 30668, 23294, 12484, 49997, 96081, 97492, 53308, 26185, 16043, -9007, 3822, -3972, -18630, -26475, -17302, -4773, 32382, 36464, 12878, -6418, -37636, -59854, -44183, 1289, 34769, 26099, 22475, 16505, 9325, 18492, 25078, 6642, 22288, 31845, 28074, -4793, -44708, -47678, -24357, -28446, -17071, -28450, -32520, -45151, -19863, 9743, 33297, 33774, 4742, 15547, 26331, 20028, 6559, -26299, -27337, -34129, -19871, 140, 1374, -13628, -25528, -18705, 245, 9931, 1627, 1063, -11422, -50790, -29670, -13328, 3029, 27291, 22707, 32433, 54637, 74640, 121832, 213234, 362366, 473535, 495525, 444478, 321485, 187995, 89424, 38725, 20471, 14209, 16077, 10222, 29467, 33328]
12295C3328j2136K0214M659j3198o255M500k1871J4593p609L225J973O350k776
12282B4997K3955J4438l105M694k1237j5620K0454l531L054J6905N4865O648O452
12269A32969M2470P9734J28640K51738M03597M19326J56497j14543k91873l71549
12259H37006k83958j53574j13524r2513m7365p250J1981J465j4130j8232l8915
12248H0991k3911J51o362k4126K698j2739q880N839J0060p951j9477j407J4268
12235I154J7541J9902J0732L526J0599J0770n960l0272L0924L8937L7051O6582
12223B19486J13339K10242L53792M60720K85109j1406k38586l69857l28700k25570
12213D68569j61399j14605k1036n1132k9984M450k188l3017l0804J959j8869K2000
$$ y = [33328, 21192, 41406, 46065, 32867, 26612, 31112, 9241, 23834, 16225, 19450, 21423, 27773, 24997, 48952, 63390, 60285, 64979, 43742, 28122, 48576, 45045, 48099, 65004, 119869, 126517, 132969, 175439, 255173, 383813, 635551, 1039148, 1458474, 1614971, 1500428, 1208555, 837006, 553048, 399474, 285950, 193437, 146072, 138822, 150803, 152268, 138138, 119906, 80991, 57080, 57231, 50869, 26743, 29441, 16702, 7822, 13661, 23721, 15770, -3707, -5114, 9154, 26695, 46597, 57329, 60855, 71454, 82224, 76264, 45992, 76916, 115853, 152904, 219486, 332825, 543067, 896859, 1357579, 1642688, 1631282, 1392696, 1022839, 694139, 468569, 307170, 192565, 171529, 120397, 90413, 94863, 92675, 59658, 28854, 30813, 11944, 33944]
12201C3944J035j0543m558j7432j1697K5591O793K3385J7024k9305j5923j1003
12189G311J1367K3827j1389m421J993K029J9919J2185m6510M976P9288P3457J00463
12176B74495J63747J29179M630j01302j33889j15026o0750k5519l7014j8031j7810
12165F2710j3065l1318k1134M849J2862Q093m468J5920K5400j0879q57r843p474
12152C0796k5801j7881K8234K7593m1K0715J3684P289M7723M6568j0190j6664
12140A52025l9948l0226l1616m377L1781k4039j3528p06j638n22j1344P364j5281
12127A7945R975Q44Q562R945J0508l051j2582l2002m4682K1051M0648j8421L700
12114A2440J2487O711K7881J5471j8328j1390K943L488K2650k4048N4745J20458
$$ y = [33944, 34979, 24436, 19878, 2446, -9251, 16340, 23133, 46518, 63542, 34237, 18314, 7311, 18678, 42505, 31116, 26695, 28688, 30717, 50636, 62821, 16311, 21287, 100575, 174032, 274495, 438242, 567421, 572051, 470749, 336860, 221834, 161084, 135565, 98551, 80520, 62710, 49645, 18327, -2807, 2042, 14904, 22997, 18529, 34449, 59849, 48970, 48113, 38270, 30796, 4995, -12886, 15348, 42941, 42900, 63615, 77299, 84588, 132311, 178879, 168689, 152025, 112077, 81851, 50235, 45858, 77639, 53600, 40072, 39366, 37728, 37206, 25862, 33226, 17945, 27920, 28764, 37326, 47271, 57779, 54728, 42146, 10144, -34538, -13487, 27161, 8740, 12440, 24927, 31638, 59519, 74990, 56662, 45272, 48215, 51703, 74353, 50305, 105050, 225508]
12102B25508Q4290O3618J0968k3988n9852p6873n2745l8936l6578j1005J960O423
12090I2790j6170k9013k78J8619K5250K5501j3620l0870j026j0525r639l144M99
12077D8374L433K1367K1920n279j061j141J0025K809j8272j3872R210Q119K2699
12064A08331j8896j0702J2135M8928O9355m650K3868j089p449l5724m7156k0273
12052A16678k1414j6409J3832q188j2661q501j7257r634J901k9668J4315L1142
12040E4136K537j6669l4837j2519L4689J7612J807J9901L854k0507k7738J1599
12028C3865j0132j9996j0516J0862L0052Q12j8783l1577L360K8148J8765m567
12016C0293K6130K1844M2394R0804P3697K9651m0226m5957o7402n0871m1832N946
$$ y = [225508, 309798, 373416, 384384, 360396, 300544, 223671, 170926, 131990, 95412, 84407, 86367, 92790, 76620, 47607, 47329, 65948, 91198, 116699, 103079, 72209, 71183, 60658, 51019, 47875, 48374, 51807, 73174, 95094, 89815, 88754, 87613, 97638, 100447, 82175, 68303, 77513, 85632, 108331, 89435, 78733, 90868, 139796, 209151, 204501, 228369, 227280, 219831, 184107, 136951, 116678, 95264, 78855, 92687, 84499, 71838, 63337, 46080, 36446, 38347, 8679, 22994, 54136, 56673, 40004, 5167, -7352, 27337, 44949, 46756, 66657, 70511, 50004, 22266, 33865, 23733, 3737, -6779, 4083, 34135, 34947, 16164, -15413, -12053, 16095, 34860, 30293, 56423, 78267, 120661, 211465, 285162, 314813, 274587, 228630, 161228, 110357, 68525, 74471]
12004G4471K73l2285J461k1549n020M459J5218j4377m005k5371k1292m221L3213
11991I75J2908k6749L919N071j1780J335Q359n762j9552l013o91J077L508J2787
11977a7608L6166K3044J966m514l464j368k2556m9895J0544L5625p256r655j8827
11964b7798K0813J3548m3586k9576J5763K1068M1083n155L4157N855l9640j5894
11952i362n911J1350P145P226J4059Q415k0401l9952M278J7664l931m349k9409
11939d3178j1817n196r556M9357J7625m97M610Q796j1447m07p842J7569j0685
11926b668J4697P082j2106j3919k6997m527K3143O242k9988n211M1906R559J968
11913I181l8827j7619J2004L1677p594n537m09j4188j559K1055J8063r247K799
$$ y = [74471, 74744, 42459, 43920, 22371, 17351, 21810, 37028, 22651, 18646, -6725, -28017, -32238, 975, 13883, -12866, -8947, -3876, -15656, -14321, -5962, -11724, -31276, -34289, -34980, -33903, -30395, -17608, 18558, 41602, 43568, 39054, 35590, 34222, 11666, -38229, -27685, 7940, 684, -8971, -27798, -6985, 6563, -37023, -66599, -50836, -29768, 11315, 6160, 40317, 46172, 6532, -9362, -15273, -3923, 3222, 10448, 24507, 32922, 12521, -27431, -23153, -5489, -9420, -13769, -43178, -54995, -60191, -69747, -20390, -2765, -3262, 1348, 10144, -1303, -1710, -9552, 8017, -2668, 12029, 19111, 7005, -6914, -33911, -38438, -15295, -9053, -39041, -44252, -2346, 7213, 9181, -29646, -47265, -35261, -3584, -11178, -16715, -17124, -31312, -32871, -11816, 6247, -3000, -201]
11900b01m618k0781J4703j4052J197M966L0266l132j827J3237K3814O478n9034
11887h984n677Q116J8816P902o113J5846k624l0335K833n316m31P76N078k677
11873b790r544J4055J1427J9964M599J4330j2956m4723R953j4187k3175j3976
11861d7023Q107P460K7374J7749j468K577L555l834n223k991q823j9374l9600
11848f1514O7M2996M462O045j9928j7148O736p811K3402J9961O669j2239j8926
11835b7228j8975J0070L3897n435J5665K3572R171J1818k4478j2243P436J7652
11823D0922m2910j0621m13L642O157j039j4923k0600J4024K5761j0938j6716J961
11810b5693j1897j2528r639K4710J5327J0629K2660l681k8386j8571k108Q371
$$ y = [-201, -4819, -25600, -10897, -24949, -23752, -18786, 11480, 8348, 6521, 19758, 43572, 50050, -8984, -14661, -6545, 12271, 20173, 14060, 29906, 27282, -3053, -220, -5536, -5967, -5191, -113, -2790, -12334, 1721, 13148, 33112, 37711, 52041, 39085, -5638, 4315, -9872, -33047, -47023, -38916, -31456, -4082, 13667, 12199, 14776, 18331, 14497, 9274, 6283, -2540, -21914, -61514, -61447, -18451, -13989, -7944, -27872, -45020, -38284, -46095, -22693, -2732, 3937, -8302, -27228, -46203, -36133, -2236, -7671, 7994, 31566, 40737, 52555, 28077, 15834, 23270, 40922, -1988, -12609, -13022, -9380, -3223, -4262, -19185, -39785, -25761, 0, -10938, -27654, -25693, -37590, -50118, -59757, -35047, -19720, -9091, 13569, 9888, -18498, -37069, -39177, -30806]
11798c0806k87P180r595k5630J1093L668M927P518J4235K0112J689K4536r545
11785A9095r640l117J983J3914K3816j1751K251j9608m812j1945k0493J1051O600
11772b656K7905j6805k0218J002j120R727J0826o150j1533r199J0405K8199j2117
11759H266k0288j6835q811k2586J1575K1809J2288J8990J97m8379q653L6736K7790
11746A2099o022o894p812j1648j0741M531p381P523J8152J1366J0749j9618j2588
11733a8284L646J3210k8928J645K8101J5787j1083j3248J2543l6392j0659J2174
11721c1488J6178M414M789J2730j0884q377l593p519l1510j283N858J7224Q527
11708b4934k896O150J8418q262j0609J4462J9109P621O173j0350l2589j0204j6760
$$ y = [-30806, -31093, -23913, -33508, -59138, -48045, -44377, -39450, -31932, -17697, 2415, 4104, 28640, 19095, 9455, 6338, 8321, 22235, 46051, 34300, 36551, 16943, 12131, 186, -20307, -9256, -2656, 25249, 8444, -11774, -10772, -11892, -2165, 8661, 2511, -9022, -18221, -7816, 20383, 8266, -12022, -28857, -37668, -60254, -48679, -26870, -14582, 4408, 4605, -43774, -52427, -15691, 12099, 6077, -817, -8629, -20277, -31018, -26487, -33868, -26345, -8193, 3173, 13922, -5696, -18284, -14638, -1428, -30356, -28711, -610, 15177, 4094, -9154, 3389, -33003, -43662, -31488, -15310, -10896, -6107, 6623, -4261, -12638, -16231, -23750, -55260, -56543, -50685, -33461, -24934, -27830, -21680, -3262, -11524, -22133, -7671, 11438, 19059, 25232, 14882, -17707, -27911, -44671]
11695d4671m333N274K707R590J608k0843j0587L7826L2127j1076j2431j3797K6140
11682b466J596j5945l380J1464P346j6665l295N528J2193N462l1661k3132k778
11669e5733N700Q008R531j441P207N977j1832J9994L4076k2518j0285n694N434
11656a1576j5616Q166J3891J2271K8574L635k5674k8307j5793r077K9022K1028
11644A0544j6233J3072J3891j0727k7901n031L088r431k8781J4613J6517J0552
11632a5827m496L0019J186k2383l2807k3853n544o064L6793o1j088j4590J7532
11619d1183L2624O646j281j4101m638p363R967j5854l792N96J5339p490O876L4368
11605A0714m30r976K234J841m444J1257l5100r342K6139j028K15J0903Q271j6606
$$ y = [-44671, -49004, -43730, -41023, -31433, -29825, -50668, -61255, -23429, 8698, -2378, -14809, -28606, -2466, -870, -16815, -20195, -8731, -1385, -18050, -21345, -15817, -3624, 1838, -29823, -52955, -55733, -50033, -42025, -32494, -33935, -26728, -20751, -32583, -12589, 21487, -1031, -11316, -17010, -11576, -27192, -19026, -5135, 7136, 35710, 39345, 13671, -14636, -30429, -39506, -10484, 10544, -5689, 7383, 21274, 10547, -17354, -22385, -19297, -28728, -57509, -42896, -26379, -15827, -20323, 9696, 10882, -11501, -44308, -68161, -73705, -79769, -42976, -43037, -44125, -58715, -41183, -8559, -1913, -3194, -17295, -21933, -29296, -19329, -35183, -38975, -38379, -23040, -30530, -23654, 10714, 10284, 308, 2542, 4383, -61, 11196, -23904, -33246, -7107, -8135, -7920, 2983, 11254, -5352]
11591e352j9469K7495k997o646j8036J4690L1510j6935l4656J7040l564M027j2066
11578b4959J2164K8532K3048m591k4692l0525K989K5804l5638j7469l532J6131
11566c2738K8946Q55K6876j857n5856k7589L7453Q477p547j7264p690J2864Q897
11553b6173Q243J0657K3935j3830j3954P420k832L612J9683J0963r771l7805J4993
11540d859l7486j2858M4906K091j3299j0281P04J0993m043m020r894o779K066
11527d2759O645L1939K167P285N373j5986j7748K439K338q759K0741k393L646
11514e072n724o948k5276j7091J4333J2810j3536L0034J5133n970k6891p963J8476
11501b3685j0782J279J8132O065j0289J34L307q703p02K231R979J0667j148j6817
$$ y = [-5352, -24821, 2674, -323, -6969, -25005, -10315, 21195, 4260, -30396, -13356, -16920, -12893, -24959, -12795, 15737, 38785, 34194, 9502, -21023, -18034, 7770, -27868, -45337, -48869, -32738, -3792, -2937, 23939, 22082, -33774, -61363, -23910, -15433, -22980, -40244, -47934, -35070, -26173, -17930, -7273, 16662, 2832, -11122, -3702, -6534, -2922, 16761, 27724, 17953, -19852, -4859, -42345, -55203, -10297, -8206, -21505, -31786, -31082, -20089, -24132, -28152, -38046, -44825, -42759, -36114, -4175, -2008, 5277, 10650, -5336, -23084, -20645, -18307, -27066, -6325, -8718, -5072, -10796, -17744, -43020, -60111, -45778, -32968, -46504, -16470, -1337, -7307, -34198, -42161, -23685, -34467, -33188, -15056, -8991, -19280, -19146, -15839, -24542, -25244, -23013, -13034, -2367, -3515, -20332]
11487b0332O84k934M88Q009K1704O481M667K2423j7564j4682k4460k4934P421
11474c3029K1801J1316k991q195j2375o981n394P592J260J3745L4107L640r561
11461A4935N098K1305j2096n324n907l2343j1196k625k9788j7212k0197P0M5717
11448d9563M5438R324k2080p380K6322n961J336j1734j4718k0221K1702K0077
11436g458K6286J8280j0692l4503j7675o243N541K6611J1276Q680K4540P656k1741
11423C0558o842J904n855J9027J0566j2615j8240j9605l4647j3157p824l6015
11411i2745J7707J9305K2222K7230R552K344Q049o812j0216J8172Q985k1586l1614
11398b9407O641K4635J6811L933k571j3967l478K3732L217k871M905J2963j1519
$$ y = [-20332, -19648, -22582, -22094, -14085, 7619, 14100, 18767, 41190, 23626, 8944, -15516, -40450, -33029, -11228, 88, -2903, -11098, -23473, -30454, -35848, -28256, -26996, -13251, 20856, 24496, 14935, 20033, 41338, 29242, 23918, 18011, -14332, -25528, -28153, -57941, -75153, -95350, -95280, -49563, -4125, 5199, -16881, -24261, 2061, -3900, -2564, -14298, -29016, -49237, -27535, -7458, 18828, 37108, 26416, -8087, -25762, -32005, -26464, 147, 11423, 20103, 44643, 52299, 30558, 23716, 25620, 19765, 38792, 49358, 36743, 18503, -1102, -35749, -48906, -56730, -92745, -75038, -55733, -33511, -6281, 3271, 5615, 13664, 6852, -3364, 14808, 23793, 2207, -29407, -22766, 1869, 18680, 22613, 20042, 6075, 2597, 26329, 29546, 26675, 31580, 44543, 33024]
11385C3024k4239k0107j0624J8450q688J0670n259L896P806J9486P038p954Q417
11372C1916j0960j4717j3159j121K2895J6199k0517j5169j9370l2077N971J2281
11360c7828N1250j7225j6250k1400J9221K4066J8755l2660j8226R684J8838J0118
11348H343J1769n482k4708L900K2860j052l7182o136o17q88k5443k4501J386M3484
11334c4267L4417m761r487j6562O986O540r737K2605J6305j8873q092m996K356
11321a7566M5137J3950k739k3370l7742j7341o883j8436J6486K3133p72j9548
11309d5691j4329l880J0359K9114J965o25K811J7161O712q26l645K7300M6825
11296G3251N2479L5218k93k643l934n2737l4859j2660k140j3558p927M344J7698
$$ y = [33024, 8785, -11322, -21946, -3496, -12184, -1514, -6773, -2877, 4929, 24415, 31453, 23499, 31916, 20956, 6239, -6920, -8041, 14854, 31053, 10536, -4633, -24003, -56080, -50109, -37828, 13422, -3803, -20053, -41453, -22232, 1834, 20589, -12071, -30297, -20613, -1775, 8343, 20112, 14630, -10078, -6178, 16682, 15630, -21552, -27688, -28305, -29193, -54636, -79137, -77751, -34267, 150, -4611, -14098, -30660, -23674, -17134, -26871, -4266, 12039, -6834, -14926, -19922, -17566, 27571, 41521, 38782, 15412, -22330, -39671, -46554, -64990, -48504, -25371, -26143, -45691, -60020, -63900, -53541, -24427, -22462, -23087, -20276, -3115, 3597, 2771, -874, 26426, 73251, 125730, 160948, 160655, 158012, 154078, 101341, 66482, 53822, 51682, 38124, 30197, 34541, 52239]
11283E2239K0185m854r300j0393J31l6426j5081k3591j5364j785L6605L456k2853
11270b7031K2469J0390j4061j0016j448r062L019J9839J323M331R058O737J7936
11257C3484Q634k2569k7908j9234Q418K2165J1720r744P733n592k7419J4042K269
11244d001j0305P724j152l251J0332J422r12j5621l2864k4362J3923N1523K9691
11231B2147k7739l7823j3234R807n418j3604L0542K7719k2585K6751J352j9860
11219b1945j7581L3147Q699k9990m474m834J0613k134m382m386o094J4890m85
11206b8956J0307j0861K4530J3113k4196k0018p79M136j6840J8220K5922k202
11194g624R891k347Q277K8438L8381L7382J7923q803Q87J2577J0992k3735n0775
$$ y = [52239, 72424, 67570, 58270, 47877, 48008, 11582, -3499, -27090, -42454, -44239, -7634, -4178, -27031, -4562, 5828, -8233, -18249, -19697, -28759, -25740, -5901, -4578, -247, 8811, 15548, 33484, 42118, 19549, -8359, -27593, -19175, 2990, 14710, 4966, 12699, 7107, -20312, -6270, -4001, -14306, -6582, -7734, -10985, -653, 769, -143, -15764, -48628, -72990, -59067, -7544, 22147, -5592, -43415, -56649, -46842, -52260, -65864, -35322, -7603, -30188, -3437, -2085, -21945, -39526, -6379, 2320, -27670, -32144, -36978, -26365, -28499, -32881, -37267, -43361, -28471, -28956, -18649, -29510, -4980, 8133, -16063, -36081, -36860, -32724, -49564, -31344, -5422, -7624, 2267, -80, 8197, 36635, 75016, 112398, 130321, 121518, 122405, 134982, 145974, 122239, 71464]
11181G1464k9754k086j2006j7459j3964J770K4663J3176P860q112k0358m4346
11169b9152j6227O0475J9571k4374l2425m2j2246o022M530J0134J0388L8584J0807
11156C4001K3529Q599j7415l3518k2242j644J1564P86j4162J0035k4947j4531
11144c9945L024O834P240q530L0872P90K893r602m0598k1593L074o411K5853k478
11130d8577O29K5018k0735k182K4703K4839J054o456l432P43K072J7801J218R208
11116B5903k1147k3999n321j9435j0488P039m946Q650K4185O784J410o619r696
11103b7680L225J1242K5579J3868j3847j5518p05K4044K933l6280j7967N203K4190
11090a713j0927j2430K0135J9510r741l1024q825m71O185L0256J686j2026j4870
$$ y = [71464, 41710, 39624, 27618, 10159, -3805, -2035, 22628, 35804, 43664, 35552, 15194, -29152, -45379, 15096, 34667, 10293, -22132, -22174, -34420, -40442, -35912, -25778, -15390, 23194, 34001, 57530, 66129, 48714, 15196, -7046, -8690, 2874, 3660, -10502, -467, -25414, -39945, -36921, -30087, -22847, -31377, -505, 285, 3178, -6424, -47022, -68615, -65541, -71952, -46099, -48577, -47948, -22930, -43665, -45847, -21144, 3695, 4749, -1707, -5139, -4396, -2324, 15477, 16695, 25903, 4756, -19243, -24564, -43999, -54487, -47448, -52394, -43744, -19559, -12775, -11365, -17984, -27680, -24455, -13213, 12366, 26234, 12387, -3131, -3836, 20208, 23141, -13139, -31106, -25903, -1713, -12640, -25070, -4935, 14575, 4834, -26190, -35015, -35486, -29301, 955, 2641, -9385, -24255]
11077b4255J7361J0846r56J5032J5982p382K2602k3613k5903L1158J1056j2715
11065B9213k309m581n342j6205J2594N921n583p308J881Q173l822j9604k4444
11052c1416K6079K0805r012j5339j5447M25j2572n740K9051K7258J3358m479K201
11039B5172j6565m4046k3798J9326J4700L4610K7508j2368m9470j8696j72r370
11027e3169l2226p601J5001K218J4667K244m322K1101j6344M162p451j0996L4370
11014c8346K6713J6417o133K8728q551m3408r348j4350k7245J0577L0708J3497
11002b0741P88J5293K8696j8671j2116M345j5576N915l646p680Q304J3967k11
10989a333j3680k134R245J7113n600j2368Q803J7798j0062k1237n28j415O65k3607
$$ y = [-24255, -6894, 3952, 2996, 18028, 34010, 26628, 49230, 25617, -286, 30872, 41928, 29213, 26904, 22323, 16981, 776, 13370, 19291, 13708, 6400, 8281, 16454, 12632, -6972, -31416, -5337, 15468, 6456, -8883, -24330, -23905, -36477, -42217, -13166, 14092, 27450, 22971, 25172, 8607, -35439, -59237, -39911, -25211, 9399, 36907, 24539, -24931, -43627, -43799, -53169, -85395, -92996, -77995, -75777, -61110, -58866, -63188, -42087, -58431, -54269, -61720, -72716, -38346, -11633, 4784, -1349, 27379, 18828, -24580, -33928, -48278, -75523, -64946, -34238, -20741, -19953, -4660, 24036, 5365, -6751, -2406, -17982, -12067, -15713, -23393, -15089, -1122, -1333, -15013, -17147, -7902, 9211, 3611, -8757, 46, 17844, 7782, -13455, -13983, -15398, -14733, -38340]
10975c8340o222J8122n897k2855J2551K1700m102K708m674l7510J2160q699J134
10962e9924J9570J7880J7119k275l5218l1432j7503O767K1770N574r989K1144
10950d6517L1145J6357r051O234j3530k8879J3804L5136J2301l8945l0017O340
10938d5622K5610Q421q08j0332o681j9856k83j7390j0130J4113K9101Q049J4739
10925a1069K8103k85k3992r030p397m363M157j703j0417j9367P922q926N230j698
10911e2835l5411O968K1205j3963K4629K6249k1116J1481L8453M995P488j4909
10899C234l7772M232K1740j4951j10k410j117j1002j9100q640l098k379M7136
10886b4237L1337k228L361O479K2335L281l2162l0896j6397p291q377J2003K2599
$$ y = [-38340, -44562, -26440, -32337, -55192, -42641, -20941, -25043, -22335, -27009, -64519, -52359, -61058, -59924, -40354, -22474, -5355, -7630, -42848, -74280, -91783, -85016, -63246, -57672, -67661, -46517, -15372, 985, -8066, -1832, -15362, -44241, -30437, 4699, 17000, -21945, -51962, -45622, -20012, -11591, -12399, -22731, -29412, -49268, -49551, -66941, -77071, -62958, -33857, -25808, -11069, 17034, 16749, -7243, -16273, -23670, -28033, -23876, -25579, -35996, -55363, -47441, -56367, -51137, -52835, -88246, -81278, -60073, -74036, -49407, -23158, -44274, -32793, 5660, 10655, 18143, 3234, -34538, -30306, -8566, -23517, -23627, -26037, -27154, -38156, -57256, -65896, -68994, -71373, -24237, 7100, 4872, 8233, 14712, 37047, 40328, 8166, -22730, -39127, -46418, -54795, -42792, -20193]
10873b0193J8121k960k8115m575L2261m534j0850k0088j461k1879k7795K3853
10861f8215O087L3342K205L352j5468L1752K9371K0791J2867k4128k1262j6535
10849e841R370r256m081J0690k1179k8272R65L2966J0200r295n112n945j862O503
10835b0149K1389N343j7130j0022J1202J42p685J4438J7322j0832M958k0881r165
10822b1070P595k931K9221j3265k6177j1297K484J104L702j722q235j443J3895
10809b8139L3042k771k3591k27J6297M567J2083j7383q172J0976P838J5833J5428
10796C5781j0752m5803j0775J3429k6085M071L2179l2025K128Q985k2359r535
10784f0761K2618L2897J4741q425k2444m795J290N138q283l7569K3801K2501J7
$$ y = [-20193, -2072, -5032, -33147, -37722, -5461, -9995, -20845, -40933, -42394, -64273, -92068, -68215, -62128, -28786, -26581, -23229, -38697, -6945, 22426, 43217, 56084, 31956, 10694, -5841, 3529, -5727, -9808, 882, -20297, -48569, -47604, -14638, -4438, -13733, -18845, -24790, -26652, -20149, 1240, 6583, -10547, -20569, -9367, -9225, -16910, -2472, 14850, 4018, 8976, -11905, -21070, -13475, -16406, 12815, -450, -26627, -37924, -35440, -34336, -30634, -32356, -40591, -42034, -28139, 4903, 2132, -21459, -21686, -5389, -822, 11261, -6122, -14294, -3318, 4520, 20353, 35781, 25029, -20774, -31549, -18120, -44205, -40134, -7955, -39980, -37852, -28867, -51226, -60761, -38143, -5246, 9495, 1070, -21374, -26169, -24879, -19741, -28024, -65593, -41792, -19291, -19274]
10771a9274J3268J0634l1298J019R161m818p973n577q001k076L5353O323l25J0172
10757F588k0179k2978J2784K5608j1326k5842J5634O299r604o437J6288J9488
10745F323J4797l7717j0353K2022J8360j0898p88j4740q901L053j057R20q392
10732b7371j6317J316j9600n737o792P407L8824J6162L7745P044j6120J3841J1229
10719D1631n834j3041k2437l640j668j0380N943K2398q121N05r647j6914j1911
10706c3116P905j6352J959l933j5692k5496N422r35j0056M926N9293K4604L722
10693B251K3954L2304l3241j4192l3537l2873J725K3196L7246K775n916j7543
10681a3851r482j1848j7046L0759r022K9644L5915m929j2467J3330k1800K425
$$ y = [-19274, -6006, 4628, -26670, -25651, -16490, -21308, -29281, -34858, -42859, -44935, -9582, -3259, -3584, 6588, -13591, -36569, -23785, 1823, -9503, -35345, -19711, -13412, -23016, -29453, -13165, 6323, 21120, -16597, -26950, -4928, 13432, 2534, 1746, -12994, -21895, -18842, -19899, -18979, -27371, -43688, -42372, -61972, -67709, -74501, -67094, -28270, -12108, 25637, 32681, 16561, 30402, 41631, 35797, 22756, 319, -3321, -4989, -15369, -9426, 12972, 4851, 5356, -4291, -21205, -33116, -25211, -41563, -39604, -43537, -59229, -84725, -79303, -80238, -90294, -85368, -26075, -1471, 2251, 26205, 58509, 25268, 11076, -22461, -55334, -53609, -30413, 6833, 9608, 3692, -13851, -23333, -35181, -52227, -21468, -30490, -846, 35069, 30140, 17673, 31003, 9203, 11628]
10669A1628o707j7069r76o744M083K367k544m11J2447p678j0720j686M790J919
10655a7301J5584k2213k3525N123n748j8M081J2899k888k348j917k968J8512K050
10641b0677p29J4562k6259q916Q480m26L0844k227k0094M124q43J9490j0837P799
10627e709O969L93k098o157l0114k0320K9964K1005j1776K4824N286k7260P188
10614g805L821j347J6153K0752K660k340j0918K899j4603O448m77l9758m0096
10601f4611J8522L7526Q975j3723q476n922K9957Q062M08j3777q500q573r38k170
10587b3240j7117j2416o973L1784L832l3580k043J0119J6386q911j3550J0540
10575d5169J2711J3870J639J7782J5149J0562l577j8027j8857l867K456p357K1002
$$ y = [11628, 4921, -12148, -13124, -19868, -15785, -13418, -15962, -16373, -3926, -11604, -22324, -24010, -19220, -17301, -1717, -23930, -47455, -42332, -48080, -48098, -44017, -31118, -34006, -36354, -38271, -41239, -22727, -20677, -21406, -6844, -33103, -42019, -33539, -33965, -3121, -5348, -25442, -21318, -22161, -2671, -13508, -5709, 1260, 1653, -445, -6602, -36716, -57036, -27072, -6067, -17843, 6981, 12267, -14993, -7805, -3984, -5331, 10822, 31574, 34234, 31894, 20976, 23875, 9272, 15720, 15243, -24515, -64611, -46089, -8563, 412, -13311, -21787, -27709, 2248, 10310, 10718, -3059, -11559, -20132, -21070, -23240, -40357, -52773, -59746, -27962, -24130, -57710, -59753, -49634, -33248, -42159, -55709, -45169, -32458, -18588, -16949, 833, 15982, 26544, 22967, 4940, -13917, -17784, -15328, -22685, -1683]
10562a683j0149p062K3973J972o896j3757K5735R547k1315J7859M528l0967k926
10549a1141Q207K6094M145p660k8299j7441j213J8896J5629r52M564k456j587
10536F786n700L290k2392J1482J8866J6843K3371j3189k7260k2966j0686r587
10524c1142k129P965J4481J5203k2791n737K0017L1083j4997Q455j0452j9483
10512i527L676M863j1463J5105K5259J3210L391j3500j5607k9559j1604J3256
10500a2500Q28N557J9198j8921J7301j4059k0549Q521k4317m875O977K2434K0093
10487E688o653j5581j048o496Q553M506n672J030J0097j2241m3J4879k254J6082
10473A0847K939m128l852N036Lk8071j8341j0190Q890K1584L1709j6276j8418
$$ y = [-1683, -11832, -18894, 5079, 7051, 155, -13602, 12133, 21680, 365, 18224, 22752, -8215, -11141, -2934, 23160, 27305, 19645, -8654, -26095, -27308, -8412, 7217, 6265, 10829, 8373, 6786, 1086, 4376, -18016, -6534, 12332, 29175, 52546, 39357, 12097, -10869, -21555, -31142, -33271, -25306, -10825, 4378, -18413, -24150, -4133, 26950, 11953, 20408, 9956, -9527, -5851, -988, -12451, 2654, 27913, 41123, 44514, 31014, 15407, -14152, -25756, -12500, -11672, -6115, 13083, -5838, 11463, -2596, -23145, -14624, -38941, -43816, -36839, -14405, 5688, -965, -16546, -17594, -24090, -15537, -11031, -16703, -15673, -5576, -17817, -17860, -2981, -5235, 10847, 13786, 9658, 5806, 10842, 10845, -17226, -35567, -45757, -36867, -15283, 16426, 150, -18268]
10460a8268m665j1545q956k0600m269J7132L2772L429R159K463P397M021j9226
10447a1156k4660o797j3585J7171O203o726p373J5889P910L509j7328k5393J5370
10434d6966K0518j7854k377M172J8639K5600j2206j434j5269L225L6865L898k0561
10421c750k5700j0610K4838q005j9080J9142M077j6467o173k249J2396J8054j6349
10408b9876j6353J0947J2500j4499n708J6037K5600l763k3221j8905j9678j5221
10396h2140P038L0951m004j558J8609J5366J2861n102r946k2708L675J6212q00
10383b1546o949k306k179l971J1477R994J896k7334J7803L3765j5739k1064J6785
10370i368K8996k02r341k955p199l008J7851K4346k0405r450j7931Q115M2971
$$ y = [-18268, -22933, -34478, -43434, -64034, -68303, -51171, -18399, -14970, -5811, -3348, 4049, 8070, -11156, -35816, -42613, -56198, -39027, -32824, -39550, -46923, -31034, -23124, -19615, -36943, -62336, -46966, -26448, -44302, -46679, -42507, -23868, 1732, -10474, -11908, -27177, -23952, 12913, 16811, -3750, -29450, -40060, -15222, -23227, -42307, -23165, -19088, -35555, -41728, -43977, -31581, -13527, -29876, -46229, -35282, -22782, -37281, -42989, -26952, -1352, -5115, -28336, -47241, -66919, -82140, -75102, -44151, -48155, -49713, -31104, -15738, -2877, -7979, -17925, -40633, -36958, -20746, -21546, -28495, -30801, -32980, -36951, -25474, -15480, -13584, -40918, -23115, 10650, -5089, -26153, -9368, 19628, 19426, 10085, 7130, -69, -3077, 14774, 39120, 18715, 9265, -8666, -551, 42420]
10357D2420J6474k5734k0698M319J5722k1189k3561K0502L2738l1374j6510J5046
10345H155K0949k585l8749l5857J7778m379L993J9795L4105K9885K490q857l8087
10332H636j0812j6392P524Q557n321L2959R469n062o985q081k8029j5149K0263
10319h423J5668J4188r185q837j9201k482j2783p084J6007O619K9232K1299k3107
10306A1911J6059o732N248J2117Q918J5319J5364M136k7792m8171j3643l523K5534
10293A4745L9063l317p013j6713K2878R911o026J46j9711k5993K3932J3507l1893
10280A3516m956P048l4625j1557m468J7386J250J0J4853J2872n640k9535o495
10267c0341J0760L186j9j1854J7353n406p570K6738R347R645L608k9184j7591
$$ y = [42420, 58894, 33160, 12462, 16781, 32503, 11314, -12247, 8255, 40993, 9619, -6891, 8155, 29104, 26519, -12230, -48087, -30309, -34688, -30695, -10900, 23205, 53090, 55580, 46723, 8636, -2176, -18568, -11044, -2487, -7808, 25151, 34620, 29558, 22573, 14492, -13537, -28686, -8423, 7245, 21433, 12248, 3411, -15790, -18272, -31055, -38139, -22132, -15513, 13719, 35018, 11911, 27970, 21238, 26486, 38603, 47521, 62840, 78204, 82340, 54548, 6377, -7266, -10789, 14745, 53808, 50491, 43478, 26765, 49643, 59554, 53528, 53674, 33963, 7970, 31902, 45409, 13516, 8560, 15608, -19017, -30574, -35042, -17656, -16406, -16396, -1543, 11329, 5689, -23846, -30341, -19581, -16395, -16414, -28268, -10915, -16321, -23891, 2847, 12194, 21839, 25447, -3737, -21328]
10254b1328K656Q057K8172o823k502k3211o942J7707J6310q311m0393N878J5121
10241a5609K7482j6870j0047l910P225K1441R547qq67M2779M4048M4835L2966
10228A83012L3975M8725M2187N664N417j2033l3364n5026l5078j8387l3733n9415
10216G1944k4421J0967M39n2292R217J1142K2430j136k0890l3568p511K1253P598
10203A5172K4886J589o39p707j0599q13K084k192j4497O306j418N024k2659j9226
10189b4689Q900L0194L1113l4600j9882K5260Q855L446K4694j1186j7121L506
10177B8490K3960m229j5463k8701L5113J8775q313j3182rj2893R192P051j0163
10164B9628l8119n676j6956q069j2546Q092K3497M476j4141j3379J2497J7562
$$ y = [-21328, -18672, -10615, 17557, 10734, 8232, -14979, -21921, -4214, 12096, 3785, -36608, -30730, -15609, 11873, -4997, -15044, -18954, -11729, 9712, 19259, 19251, 18384, 61163, 105211, 150046, 183012, 216987, 265712, 307899, 313563, 318980, 306947, 273583, 218557, 183479, 165092, 131359, 71944, 47523, 58490, 58929, 6637, 15854, 26996, 49426, 48290, 27400, -6168, -13679, 7574, 15172, 40058, 41647, 41008, 33301, 22702, 21889, 23973, 21781, 7284, 13590, 12172, 17196, -5463, -24689, -15789, 14405, 45518, 10918, -8964, 16296, 25151, 28597, 53291, 42105, 24984, 28490, 52450, 48221, 32758, 4057, 39170, 57945, 49632, 36450, 36441, 23548, 32740, 39791, 29628, -8491, -14167, -31123, -39192, -51738, -43646, -20149, -15673, -29814, -43193, -30696, -13134]
10152a3134J057M77l285j5003K4626J9045K06K3923P736o224j4966j6391k2389
10139a4322j8440j3627K6591K6234j8000K073K4427J5993J0312j1509j792O450
10127C4390p447L345k299L70k6225j8774N5l127K4724K807j48l0973j1074K3176
10113a1200j970j4452k8403N209K7095J4101N110q581k4635l593L7738L1679k0785
10100G313k5531K779J6295J7536j9478J3998K5904k414l0106j0658J821q348r756
10087b0645J7104K0167M900J4770j1414L477J6144J783O364J5814j766K008O107
10074G4813o740k0764j9868j0000K5483R290N340L4848L8467N5570J27652L27679
10062F41770N59570K48618n8729k84319l88086k69259j60645p8507k7632l0416
$$ y = [-13134, -12077, -11600, -14885, -29888, -5262, 13783, 13989, 37912, 45648, 39424, 24458, 8067, -14322, -32762, -46389, -19798, 6436, -11564, -9491, 14936, 30929, 41241, 29732, 27940, 34390, 26943, 30288, 27989, 28359, 2134, -16640, -16585, -19712, 5012, 7819, 7671, -23302, -34376, -11200, -13170, -27622, -56025, -50816, -23721, -9620, -4510, -13091, -37726, -41319, -3581, 28098, 7313, -18218, -15439, 856, 18392, -1086, 12912, 38816, 36402, 6296, -4362, -2541, -10889, -20645, -3541, 16626, 21526, 36296, 24882, 28359, 44503, 46286, 52650, 68464, 66698, 68706, 74813, 68073, 47309, 27441, 17441, 42924, 52214, 57554, 92402, 130869, 186439, 314091, 641770, 1201340, 1449958, 1391229, 1106910, 718824, 449565, 288920, 210413, 182781, 152365]
10052A52365q916K1222K9038L4693P240k7092j7847m6266l5024o0342m4237o959
10040b125O524K676J0808l599J2936L352j4867j0788k5203p69K1864K3236J0491
10027C4536l44o637j7820R59N378n978l0387P160J2000k6182J8743L5213P886
10014C4527R243L8861K810n23k8343k18J0811p120j2792Q787J2765o950k9285
10001C2573R959O704l6232k6178L937N545K1668j3882R90j5572k6105J7233J6351
9988c009j87K1265K160N972j8970k4745o248J4985k731N112j0270P415L1346k5260
9974c165l0613J2625L6122M093j2200O985K022p771L201n3512m2865K5473K1514
9961c8091J5177J8051J3254J9597j1251l579l416p237q897k0802j655J05o122
$$ y = [152365, 143449, 164671, 193709, 228402, 235642, 208550, 190703, 144437, 109413, 49071, 4834, -2125, 4399, 7075, 17883, 14284, 27220, 30572, 15705, 4917, -20286, -21055, 809, 24045, 34536, 34192, 27555, 9735, 10694, 16072, 10094, -20293, -13133, -1133, -27315, -8572, 26641, 34527, 43770, 82631, 85441, 84918, 56575, 56357, 67168, 60048, 47256, 56043, 68808, 61858, 32573, 42532, 49236, 13004, -13174, -9237, -3692, 17976, 4094, 5084, -10488, -36593, -19360, -3009, -3196, 18069, 20229, 26201, 7231, -17514, -23762, -8777, -11508, -6396, -16666, -9251, 22095, -3165, -33778, -21153, 14969, 19062, 6862, 13847, 15869, 8098, 11299, -42213, -85078, -59605, -38091, -22914, -4863, 8391, 27988, 16737, 13158, 9742, 2505, -6392, -27194, -28849, -28744, -34866]
9948c4866P414L0162Q442l793j0721J6938J9826M032p66J3609P061j8610j5038
9935B3690k4956j8264L0969K0295Q417J8101k8244m839J8266j1770K446J2447
9923D6558M681j2790n44j1830k4642r030k0152K2189M5106p558j5588Q548N941
9910C0889m5999k964M293K4342P654o815j9837j5462J8153K46p207P976p77J1823
9896F315k2379k0925L852j9697M496M8420R60J0104j0709k0321K1172j2592q164
9883a9468R823J5620L8431k63k8584o394P179J4291K3293J2278l2722M578J5145
9870E3207k0343K2115M5894L4970L0754K4065j1071m2022j8857k463j8408k3743
9858G4098q196K5428Q953r750l0585l8981J7240L6860p199j6751r801J9183J0629
$$ y = [-34866, -27452, 2710, 11152, 7359, -3362, 13576, 33402, 37434, 36668, 50277, 57338, 38728, 23690, -1266, -19530, 11439, 31734, 40151, 58252, 30008, 25169, 43435, 31665, 34111, 46558, 51239, 38449, 37905, 26075, 1433, -7597, -27749, -5560, 39546, 31988, 16400, 24948, 30889, -15110, -18074, -13781, 10561, 18215, 11400, -8437, -23899, -5746, -5500, -12707, -4731, -5508, 6315, -16064, -36989, -33137, -52834, -48338, 82, 1042, 11146, 437, -19884, 1288, -11304, -19468, -9645, 5975, 44406, 44143, 15559, 9165, 16344, 30635, 53928, 66206, 33484, 38062, 53207, 32864, 54979, 100873, 135843, 166597, 190662, 179591, 137569, 118712, 116249, 97841, 74098, 65902, 91330, 100283, 90533, 59948, 20967, 38207, 75067, 67868, 51117, 41316, 60499, 71128]
9845G1128m105J0833N2083L2564k2626l5341n385j9326l8168r02K0352J9875J1282
9832I2264R026k2445k6610k7118q227q631p491Q328J0484n54J2709R527Q878m132
9818D6008j6319m3035J8865J8194J5450N467N172k594J1597j0882p320L879k3480
9805B1002J0086O75K1069K2299M342l497O77q620j7969n68R214J0008k631O229
9791G2316J1196k099J6630j9916j7188M357l6962m9794m085J2798R157J1724J8598
9778B6732l0156q257K8590J0760O695J7496j8905j6185n772j6040m980J1067J147
9765B192J2572Q59M250K7105J4848j5019N576L796J3240J9303J4724p200k0577
9752G5669k4016K1651K4504j725q362k1888l1756m285K4582J9874k7519M65k52
$$ y = [71128, 67023, 77856, 129939, 162503, 139877, 104536, 99151, 79825, 41657, 40755, 61107, 80982, 92264, 101290, 78845, 52235, 25117, 16890, 8259, 768, 9096, 19580, 19026, 31735, 41262, 50140, 46008, 29689, -13346, 5519, 23713, 39163, 44630, 49802, 47208, 58805, 47923, 40603, 44482, 21002, 31088, 31763, 52832, 75131, 79473, 75976, 76653, 68033, 50064, 49496, 58710, 68718, 66087, 72316, 83512, 81413, 98043, 78127, 60939, 65296, 28334, -21460, -25545, -12747, -3590, 8134, 26732, -3424, -11681, 16909, 27669, 34364, 51860, 32955, 16770, 10998, -5042, -10022, 1045, 2192, 14764, 15623, 19873, 46978, 61826, 46807, 52383, 56179, 69419, 88722, 103446, 96246, 75669, 51653, 73304, 97808, 96083, 87721, 65833, 34077, 29792, 54374, 74248, 46729, 47194, 46942]
9739D6942O022K3327j345J2498J7106k2714k3241j6928Q050J765j985P300K0206
9726G7003p380j1730n253J1948j0979p178k9684k1496k224J1571J1942K2656Q060
9713D7256j4516J6574J8883J3432j2899k4541k0561J9060N4059K7385r571j9794
9701I4767k6878k351j2678N897p787O480K1489m3651j1491J6382K5237j0156k4567
9688C0693l069J0059J1099l945k1789k4813Q640K1733j4333r373j398J4615J4408
9675C2527k9856l412J0200J8751m868j1383m305P273N381K7353J9982L2848K473
9662A02964l119k6740j5500J0470J1586K0319J7679k2529k6356q828k1095j4259
9650B4592O005J4710J5885K4721J8212L6946k4319m7964n1925j0534M461Q563
$$ y = [46942, 52964, 76291, 74946, 87444, 104550, 81836, 58595, 41667, 49717, 51482, 49497, 56797, 77003, 69623, 57893, 52640, 64588, 53609, 46431, 16747, -4749, -6973, 4598, 16540, 39196, 47256, 32740, 49314, 68197, 81629, 68730, 44189, 23628, 42688, 96747, 124132, 114561, 94767, 67889, 65538, 52860, 58757, 50970, 57450, 78939, 35288, 23797, 40179, 65416, 55260, 30693, 27624, 37683, 48782, 44837, 23048, -1765, 6875, 28608, 14275, 4902, 3504, 18119, 32527, 2671, -741, 9459, 28210, 23342, 11959, 7654, 14927, 20308, 47661, 67643, 100491, 102964, 99845, 73105, 57605, 68075, 79661, 99980, 117659, 95130, 68774, 59946, 38851, 24592, 30597, 45307, 61192, 85913, 104125, 141071, 116752, 68788, 16863, 6329, 10790, 19353]
9638A9353K7261K6859L9698K3097k3181m569o647N068k0770l2757L569j1415q280
9625C7286j2454n769L2415K4757L571j1022j7968K138L9971j5022L470R582R14
9612I1869r847k3713L49M0042K8716K352J8100J2231k0879k5328J4088J6955l780
9599A41155J3041j1630j121k2129J3052m620k1153J0587k6179j0081p175k551
9587G1196o216P425N602q820L22M1266J6673K5191J596r888j7594L466k6752k0606
9573H2861J217J0646k325J4619K2712J5544L975J2117k3530j620J5901m5874k3745
9560H2498M5618l92j0367r826k424J794j7524l857L1728K6398k9480K050M0100
9547A56316K5823j1666j8934n556j0857k251J4429M5723J0593k3850j9164R068
$$ y = [19353, 46614, 73473, 113171, 136268, 113087, 108518, 101871, 106939, 86169, 53412, 56981, 45566, 37286, 24832, 19063, 51478, 76235, 79806, 68784, 50816, 52954, 92925, 77903, 81373, 90955, 91869, 82022, 58309, 58658, 98700, 127416, 129768, 147868, 160099, 139220, 113892, 127980, 144935, 141155, 154196, 142566, 141445, 119316, 132368, 127748, 106595, 117182, 91003, 80922, 73747, 71196, 64980, 72405, 78007, 69187, 69509, 110775, 127448, 152639, 154235, 144347, 126753, 130219, 103467, 82861, 84078, 94724, 92399, 107018, 129730, 145274, 149249, 161366, 137836, 136216, 152117, 106243, 82498, 128116, 127724, 117357, 107531, 105107, 106901, 89377, 85520, 117248, 143646, 114166, 116216, 156316, 182139, 170473, 151539, 145983, 135126, 132875, 147304, 193027, 203620, 179770, 160606, 169674]
9535A69674M122k393P016J2915K8928k437k6220Q467K2696k5060j9754q202o2
9522A69690j416j7075o788L5668J5978N335K1797J1283l118j165Q710J4978K5149
9509B79026P101q096k0592k1373l317K9384L5763J4667j550j8316k3121J4826
9497B84402K3360M2800J6448l0468k8412m573O338J6686L1645K1750J4170L058
9485C97204q045j2172l898L8286M9234K0197J5683j2444o582j795J8230J4740
9473E08638R039J6827P546L2868K3138L3872L339m216k004L0632L9594J7003L0522
9460G46798N583l9527l2392K7990L6460r6J4396N0854O5737N891J8414K9479L0609
9447I60196N542J1987K279R010O908K0037L4901j09j6849L4611K4643k3288J7741
$$ y = [169674, 173796, 171403, 178419, 191334, 220262, 217825, 191605, 200072, 222768, 197708, 177954, 169752, 169690, 168274, 151199, 144411, 180079, 196057, 201392, 223189, 234472, 231354, 230189, 238899, 253877, 279026, 286127, 278031, 257439, 236066, 232749, 262133, 297896, 312563, 311013, 292697, 269576, 284402, 307762, 350562, 367010, 336542, 308130, 303557, 309895, 326581, 358226, 379976, 394146, 397204, 389159, 376987, 373089, 411375, 460609, 480806, 496489, 484045, 477463, 475668, 493898, 508638, 517677, 534504, 542050, 574918, 598056, 631928, 635267, 631051, 629047, 659679, 699273, 716276, 746798, 752381, 712854, 680462, 708452, 744912, 744816, 759212, 810066, 875803, 881694, 900108, 929587, 960196, 965738, 977725, 980004, 989014, 995922, 1015959, 1050860, 1050751, 1033902, 1068513, 1093156, 1069868, 1087609]
9434A087609J4301J1766J9501j5740Q636j613k3741l3223l03J1895q923k7910
9422A042255j0761k3018k8343L2383J3689k3730j0656l7764r054l763j785j5241
9410I24212o363j0524k9361j3653Q82j6017k1080j4670j4570l242J0345N804J5453
9397H27216k9710j8750L113o5j3160j0483m3076o1611j7462j0385m4787k9507
9385E51333O810p65L832o175j5172O632j4237k5879l9261l5919j2468l0315J7952
9372D06368O667m2095l0806j193q710P205K8876P313o9o784J2772j954j2488j9555
9358C45547q254Q831k2163M356K5372r803l3214k9223l1361l42K6778k8649J7285
9345B65160j1885j1438M633M0743J8982j0808l0539j8551M881J6585k2002j6428
$$ y = [1087609, 1101910, 1113676, 1133177, 1117437, 1126073, 1124460, 1100719, 1067496, 1067193, 1079088, 1070165, 1042255, 1031494, 1008476, 980133, 1012516, 1026205, 1002475, 991819, 954055, 945001, 941238, 939453, 924212, 917849, 907325, 877964, 864311, 865193, 849176, 828096, 813426, 798856, 795614, 805959, 811763, 827216, 797506, 778756, 781869, 781804, 768644, 758161, 715085, 653474, 636012, 625627, 580840, 551333, 558143, 557378, 561210, 555035, 539863, 546495, 532258, 506379, 467118, 431199, 418731, 388416, 406368, 413035, 370940, 340134, 338941, 330231, 337436, 366312, 373625, 373556, 366772, 379544, 377590, 365102, 345547, 337293, 346124, 323961, 328317, 353689, 343886, 310672, 281449, 250088, 249746, 276524, 247875, 265160, 253275, 241837, 246470, 287213, 306195, 295387, 264848, 246297, 251178, 267763, 245761, 229333]
9333B29333j6689l997j6695L393j8102j0405N840J3657n68r072M920J5787j2058
9320A85344j7961l0844J6191J3839j0209j9120K5346n662k8549l893J768K623
9308A28873M283J8761J3918K9352O210j0483r590j1604q500j401r189r805K0800
9295A61625l2570k5504J1069J1056j092j0102K5446L1832k730l0920l8256j4676
9283H5178j085K8650J4162k5034m2627L6005L5633Q355k9525k849M627M904J3990
9270A30384K5762k7203k2970j8676J8361J4281k647j8231l3377j4062J0188J4425
9258G6235K9524J9388k2229k8837l3888L0686M6883J2252k9639k3535j4188k6975
9246C5677r049l0292o235M1868P804Q865n373k600M105J8449n668j5856L1751
$$ y = [229333, 212644, 208647, 191952, 195345, 177243, 166838, 172678, 186335, 185767, 176695, 181615, 197402, 185344, 167383, 136539, 152730, 166569, 156360, 137240, 162586, 156924, 128375, 124482, 126250, 128873, 133156, 151917, 165835, 195187, 201397, 190914, 181324, 169720, 161220, 159819, 150630, 140825, 161625, 129055, 103551, 114620, 125676, 124584, 114482, 139928, 171760, 169030, 138110, 99854, 85178, 84093, 112743, 126905, 101871, 59244, 95249, 130882, 139237, 109712, 106863, 111490, 116394, 130384, 156146, 128943, 105973, 87297, 105658, 119939, 117292, 99061, 65684, 51622, 61810, 76235, 105759, 125147, 102918, 74081, 40193, 70879, 117762, 130014, 100375, 76840, 62652, 35677, 26628, -3664, -9899, 31969, 39773, 48638, 43265, 40665, 44770, 63219, 57551, 41695, 73446]
9233G3446K4299q473J77l1854p395K5586j5711K868P23j0800o478m481j9227M0005
9219F2685L0483J6932J8424j8700k0391j1124k2769l7714j132J7534J05N268K2815
9206F2416J4555Q01L245L293j2524j4268p206J5243O140j3763k1891j324j3602
9193B1115J7307J1039L837L4180J3066k4133j0625K121j4724m003J1869J9894
9181H0943j3622k5404O865m626k7506p613K4117J6267k7046M498L979J8245m367
9168D4730k8651J0801j795j37K465k3236j2503j2892J3477M6014n176j6214Q725
9155B5608L2874N776k6646j1347l783J3007n467j2118P85L900N916J61j8229K513
9141A2950J300q344j4445R037J75Q21R054L873K6548k01k2884P362K0144O272
$$ y = [73446, 97745, 89272, 89449, 57595, 50200, 75786, 60075, 62943, 63666, 52866, 46388, 41907, 22680, 62685, 93168, 110100, 128524, 109824, 89433, 78309, 55540, 17826, 16694, 34228, 34333, 39601, 62416, 76971, 77772, 81017, 84310, 71786, 57518, 50312, 65555, 71695, 57932, 36041, 34717, 21115, 38422, 49461, 53298, 87478, 100544, 76411, 65786, 67907, 53183, 49180, 61049, 80943, 67321, 41917, 48782, 44156, 16650, 9037, 33154, 49421, 22375, 26873, 30852, 49097, 44730, 16079, 26880, 25085, 24948, 27413, 4177, -8326, -21218, -7741, 38273, 33097, 16883, 25608, 58482, 64258, 37612, 26265, 22482, 35489, 30022, 17904, 18689, 22589, 28505, 28666, 10437, 12950, 14250, 5906, -8539, 498, 673, 1494, 10548, 14421, 40969, 40768, 17884, 25246, 45390, 51662]
9127E1662l3957q460J8594K1821r77j1238j3606J1261M685R235j034j3587k5924
9114H475N917j629J8052J1464j2899l2430j1700J1237J377Q948Q371J4006J011
9101C0200Q144j7552j764p395j5363O190l153m541K6453M6293M495n42R83k9930
9087D2518m4956L880J6840Q708R595J158j6555K938J3717J4518l9130j4647P18
9074f98P358k1569k8901R863M5843L3942j9263m376k1697j6712q469j42L6493
9061A1672K7236J5524O34k7921J324j2324o829M553r45L563m453K4285j7225j8172
9047I22L494J788q28j5441j2138J7001K21q562j9380J7K3624L251J1381j3054
9033g704k4675p332j306J2938L24K087K6883N667m140l409J9605J1510M882K1953
$$ y = [51662, 17705, 9245, 27839, 49660, 48683, 37445, 23839, 35100, 39785, 49020, 47986, 34399, 8475, 14392, 12763, 30815, 42279, 29380, -3050, -14750, -3513, -2136, 6812, 15183, 29189, 30200, 38344, 20792, 19028, 11633, -3730, 2460, -693, -5234, 21219, 67512, 72007, 71465, 72448, 42518, -2438, 1442, 18282, 26990, 36585, 37743, 21188, 24126, 37843, 52361, 13231, -1416, -698, 6660, -14909, -43810, -33947, 11896, 45838, 26575, 22199, 502, -16210, -24679, -24821, 11672, 38908, 54432, 55066, 27145, 28469, 16145, 9316, 13869, 12924, 16487, 12034, 36319, 19094, 922, 4416, 6204, 5376, -10065, -22203, -5202, -4981, -13543, -32923, -32906, -9282, -6031, 5350, -7704, -32379, -39711, -41017, -28079, -27755, -25668, 1215, 6882, 2742, -667, 18938, 30448, 35330, 57283]
9019E7283M809j8832j857l0209k0922k113J1564P195n818j1359Q0J4570K1933
9006B6324j512K2703K5883m963o409m204n0308k8023J6822J0022m736N293j3132
8993f240O137R420J3421K0261J1335n066j9333j0706j6692l2600j4774L324L9526
8980a987O222J0450O162J222l617k5491j3894j1029K2003J7300n27j8344p594
8967a9124J8349m571m138K1771L347J4995K7881K0701l3103j6036l295o946k466
8954A7365L301N508k6304j0576l425Q985K2298K464j2670O1q479J1710j9228n576
8940a4566J6348P84j0144J4155M36k7036n480K775J442K0203J2325N310N560O
8926B2118O434r969k4197Q309J1416J5642M2171j6371j7147J6648l545O333K7901
$$ y = [57283, 62092, 43260, 41403, 11194, -9728, -11841, -277, 6918, 1100, -10259, -10179, 4391, 26324, 24812, 47515, 73398, 68435, 62026, 57822, 7514, -20509, -3687, 6335, 1599, 6892, -6240, -103, 9317, 22738, 42999, 54334, 49268, 29935, 19229, 2537, -30063, -44837, -41513, -1987, 4235, 14685, 20847, 22069, 18452, -7039, -20933, -31962, -9959, 7341, 6814, -11530, -19124, -775, -5346, -9484, 12287, 15634, 30629, 58510, 79211, 46108, 30072, 26777, 19831, 17365, 20666, 26174, -130, -10706, -14131, -5146, 17152, 19616, 6946, 7007, -1472, 10238, -8990, -14566, 1782, 2566, -7578, 6577, 7013, -20023, -25503, -22728, -21286, -1083, 11242, 16552, 22112, 22118, 28552, 18583, -5614, 2695, 14111, 29753, 71924, 55553, 38406, 55054, 51509, 57842, 85743]
8913H5743j2113J9955k662l1035j2564K7598J296j7789J9366J5977K6089K6873
8901A46734L5396L5562K4785N7215J29884K11082L60287N75220N02786J25780
8891B204731j89880m16606m35245l41150k33919j68871j05174n8047m585k8907
8881B22347n4202l7308k6259l386K0832k4862l2871j2998q325N963p45k1715J8722
8868D5193J9187J3985j313j1520M304O974q599L074j3836n3217j1212K6906O959
8855B6885n084L210J8222R207k358R379J7786j0085j520N055L345K0613p320j4276
8841G3059o291n057K8642J8055N7437R4182J32898J15872Q9312J5295m7319j11496
8829D54589r6581q7981q5347m5911m6513j2080k4024l2281L614L204J9348K2982
$$ y = [85743, 73630, 93585, 90923, 59888, 47324, 74922, 76218, 58429, 77795, 93772, 119861, 146734, 182130, 217692, 242477, 299692, 429576, 640658, 1000945, 1576165, 2078951, 2204731, 2014851, 1598245, 1163000, 821850, 587931, 419060, 313886, 255839, 251254, 222347, 168145, 130837, 104578, 101192, 122024, 97162, 64291, 51293, 42968, 48931, 48186, 26471, 45193, 64380, 78365, 77052, 65532, 69836, 76810, 68211, 71285, 57449, 4232, -6980, 19926, 26885, 21801, 25011, 43233, 52440, 50082, 59461, 77247, 67162, 65642, 70697, 74042, 94655, 87335, 73059, 66768, 61711, 90353, 108408, 165845, 260027, 392925, 508797, 598109, 613404, 566085, 454589, 358008, 270027, 184680, 138769, 92256, 80176, 56152, 23871, 27485, 30689, 50037, 73019]
8817G3019l947j1578k617m273l3181o42J7553J3146q245L921K533J0107J7862
8804G3658J7003j8953J461K8233M549k3878K4182M9395O2264J2556p375M0684
8792B63779Q4397J83212K23423J95014J14835J4269j07319j82923k09813j87021
8782C91853j17917n0231n9923k9536o981k1633K5032j0931J1073J4218j778j8942
8770A24304k6281k6739k2743l6J1249J0754K6261J3293j0798n1752k390J3026
8758E8148J7930M2664J1054j114k0964l408J3533j1444J6939L3508K4226M1558
8746B22630R4424J14139J22189M4745j907q7057r4166p7754p7986p3411l6922
8735A48924k8856k0591k810j6625j6663o607K0041Q029j8202K1442R756j3225
$$ y = [73019, 69072, 57494, 54877, 50604, 17423, 16781, 34334, 47480, 39235, 43156, 45689, 55796, 73658, 90661, 71708, 73169, 101402, 105951, 82073, 106255, 155650, 217914, 230470, 223095, 263779, 348176, 531388, 754811, 949825, 1064660, 1078929, 971610, 788687, 578874, 391853, 273936, 223705, 163782, 134246, 127265, 105632, 130664, 119733, 130806, 145024, 143246, 124304, 98023, 71284, 48541, 48505, 59754, 70508, 96769, 110062, 99264, 47512, 45122, 58148, 76078, 118742, 129796, 128682, 107718, 104310, 117843, 106399, 123338, 156846, 181072, 222630, 317054, 431193, 553382, 598127, 596220, 509163, 414997, 337243, 259257, 185846, 148924, 120068, 99477, 96667, 80042, 63379, 56772, 76813, 84842, 66640, 88082, 97838, 84613]
8723H4613l012L4236J3054l4833j7419J1583N224k17l9952k9321K0122J1162o767
8710D8473Q980K4687K3857L79l032j0059j5661Q944J4810j745Q73O146j4589j7781
8696G4282O539j3710j413N922j9543k8508K010K2882K2072j8874J9935L2445K1412
8683A25451M7512K456k689J9711m9123l5999l9915Q852M0216K0713j9441l4536
8671H3208Q963j3507o182k1267j6657m492J0258K7624M238K3268J1092L5017J6589
8658A58152m365j4400j9612L002Q707p447k7595j8640J6082K5669m642j0012j8500
8645H6399k1968J3991l048N141Q899j589Q542K2602L119j3429J159P982k1319
8632I6481j7879K4580j4945j1256J7591J8363K7047M557j6605N666M3151q066
$$ y = [84613, 81601, 115837, 128891, 94058, 76639, 88222, 93446, 93229, 53277, 23956, 44078, 55240, 48473, 57453, 82140, 105997, 106376, 103344, 93285, 77624, 86568, 101378, 99633, 100506, 106652, 92063, 74282, 80821, 67111, 65698, 71620, 52077, 23569, 25579, 48461, 70533, 51659, 71594, 104039, 125451, 172963, 175419, 172730, 192441, 143318, 107319, 67404, 76256, 116472, 137185, 117744, 83208, 92171, 78664, 72482, 51215, 34558, 30066, 40324, 67948, 72186, 95454, 106546, 141563, 158152, 153787, 139387, 119775, 122777, 131484, 124037, 96442, 77802, 93884, 119553, 114911, 104899, 86399, 64431, 78422, 75374, 80515, 89414, 87825, 96367, 118969, 122088, 108659, 109818, 117800, 96481, 78602, 103182, 88237, 76981, 94572, 112935, 139982, 144539, 127934, 133600, 176751, 168685]
8620A68685j0199L04M713K1468J5163J9262J9623N644K1026j8043k5219j1123
8608B11304j0448l853J4945j0046K239J545j6160k9518k4672J1451j69R614K8644
8595A84876L2637J6362K7052K0750L2285Q3216J66555L33863M72289L29408J2500
8584A711793k34062l52883l27883k21462j13337q2534r1316p3471m5312k0620
8574A48913J2077J3876j3667n116L250l4806k9170Q167K0992J320l1333j6688
8562G7815J6138l603j3381J0682J3583J9147J6121M1083O308k7469j2853K3678
8550A67249M2393N5582N6175R7778J38716K60235N38170R39679R30394K27442
8540C453813l00506p18060p56058n10080l22234k19813j51662j00507l3725n4396
$$ y = [168685, 158486, 158790, 163503, 184971, 200134, 219396, 239019, 244663, 265689, 247646, 222427, 211304, 200856, 197003, 211948, 201902, 204141, 205686, 189526, 160008, 135336, 146787, 146618, 156232, 184876, 217513, 233875, 260927, 281677, 313962, 397178, 563733, 897596, 1369885, 1699293, 1711793, 1477731, 1124848, 796965, 575503, 462166, 379632, 288316, 214845, 169533, 148913, 160990, 174866, 161199, 156083, 159333, 124527, 95357, 103524, 124516, 125836, 94503, 77815, 93953, 90350, 76969, 87651, 101234, 120381, 136502, 177585, 183893, 156424, 143571, 167249, 209642, 265224, 321399, 419177, 557893, 818128, 1356298, 2295977, 3226371, 3453813, 3153307, 2435247, 1679189, 1169109, 846875, 627062, 475400, 374893, 341168, 286772]
8530B86772k7015m0203m8581j8401m5115j6914L2095Q511j9601P772k271k1357
8518I5692k0160k4875L9517M9316Q956k4990K766Q68K7589L6238j5558k7896k170
8505A45293l30n681M3032P0151R6625J94791L64216M80126K61361o7549k57728
8494A324307l26429l04198k23167j43785n4183m9523o4579l0220q904J146J1967
8483A32432O749j9653j0697l4990j8102J1702J2191K6923M025Q55k5106l4262
8471E2067J4173q234k435j2028P560K0035K4280O497J0122k6359j5545j5029p130
8458D7974R107M27J1258q061J1524j830q959J7988P378r375m1010R9J8897O562
8444F1979j5252K20J667J7935N695j2473j2289N185j9737N954L6687J1081j8897
$$ y = [286772, 259757, 219554, 170973, 152572, 107457, 90543, 122638, 131149, 111548, 119320, 117049, 95692, 75532, 50657, 90174, 139490, 148446, 123456, 126222, 127090, 154679, 190917, 175359, 147463, 145293, 144963, 139282, 182314, 252465, 349090, 543881, 908097, 1388223, 1649584, 1582035, 1324307, 997878, 693680, 470513, 326728, 272545, 223022, 158443, 128223, 119319, 120465, 132432, 139181, 119528, 108831, 73841, 55739, 67441, 79632, 106555, 110580, 111435, 86329, 52067, 66240, 58006, 55571, 43543, 51103, 71138, 95418, 101915, 112037, 85678, 70133, 55104, 47974, 57081, 57508, 68766, 60705, 72229, 70399, 61440, 79428, 86806, 77431, 36421, 36520, 55417, 61979, 46727, 46947, 48614, 66549, 72244, 59771, 47482, 52667, 32930, 38884, 75571, 86652, 67755]
8431F7755l9190N798p796q383Q498J2907k663N393J2757K81k2564K0759Q538J6854
8417G8944o265k4686r605r360j0712o223J2875L7772k3934k9011J6687J2428o453
8404C2457L7282J4848J1506k760k6965j244r900k5497M102j7225q390o697L9825
8391D1342M1009r56m366n3520Q457J4895k533Q110k3641k0872Q810K0817j4766
8378B2786k9292k4996K6004K3089j2903J2106L3907k7635j4593m910M2230J9071
8366F4864j419j3492j8104J3444J3557l3633n678J3596m962n846J6074k5254P707
8353B0854K8593k8644k3230L1140j5627n369L356K1292q047j9671k3879J6100
8341c132P034j0419K0542N574j350N295K3775q393l2421r66K3834p367r842P276
$$ y = [67755, 28565, 34363, 26567, 18184, 26682, 39589, 36926, 42319, 55076, 55357, 32793, 53552, 62090, 78944, 72679, 47993, 38388, 29028, 18316, 12093, 24968, 62740, 38806, 9795, 26482, 38910, 32457, 69739, 84587, 96093, 93333, 66368, 65124, 55224, 29727, 33829, 16604, 8214, 1517, 41342, 82351, 81395, 77029, 23509, 31966, 46861, 44328, 52438, 28797, 7925, 16735, 37552, 22786, -6506, -31502, -5498, 17591, 4688, 16794, 50701, 23066, 8473, 3563, 45793, 64864, 63445, 49953, 31849, 45293, 58850, 25217, 19539, 33135, 28173, 22327, 38401, 13147, 20854, 49447, 20803, -2427, 28713, 13086, 7717, 11073, 32365, 24318, 4647, -19232, -3132, 3902, -6517, 14025, 19599, 18249, 23544, 47319, 38926, 6505, 5539, 29373, 22006, 12164, 19440]
8327A9440l6753o894M0357M666l788l9065o609J6354J9894M987n808k762l901
8314A18R263j7920J019j8274k16J3033J2103p903R44M660J5805j2802L210q629
8300e589J0830l804j6987K5240j1756j9814n356j123k0463k0255P000R825n606
8287e7858J2473J3006p362Q119L671N053j4895K2054J7455K911l222j8070O42
8274a6023j727j0247K2303K4329j0631n629n880k1593j425K793K1014K0381l651
8261A4014J0922J7999o236j4449n618j9327J1953K1175L913j5856p207L915j1882
8248C316m136J3306R472J1195n849J6426j5167n627J0237J8378j3890k5763J2195
8235B4093J5557J0652j739k1047k5746k0108J8345p15K5674n058j807k1864k0202
$$ y = [19440, -17313, -24207, 16150, 20816, 17028, -22037, -28646, -12292, 7602, 12589, 6781, 4019, 118, 9381, -8539, -7520, -25794, -26010, -12977, -874, -8777, -7833, -3173, 12632, -170, 3040, -5589, 5241, 1437, -15550, 9690, -2066, -21880, -27236, -28359, -48822, -69077, -62077, -52252, -57858, -45385, -32379, -39741, -31622, -27951, -22898, -37793, -15739, 1716, 4627, 1405, -16665, -16023, -17750, -27997, -5694, 18635, 8004, 2375, -3505, -25098, -26523, -23730, -2716, 17665, 14014, 24936, 42935, 36699, 22250, 16632, -2695, 9258, 30433, 34346, 18490, 11283, 15198, 3316, -820, 12486, 21958, 33153, 27304, 43730, 28563, 22936, 33173, 51551, 37661, 11898, 24093, 39650, 50302, 48563, 27516, 1770, -18338, 7, -708, 24966, 19908, 18101, -3763, -23965]
8222b3965N98k76K4592j7720k3162q73K4894P553J2835r936k2160M0435K4679
8209C7494m3639k0076J5934K2036j10o870k9592M616L4969L0273j1888m895J0474
8196C8726L0065j767j9850K307J7312j5700J679j2930k9764l8688m839J6481K0905
8183C937Q014k8458m85J9729n966k252K1142J4169q457J5958k6121n433J6966
8170B2743Q967j9829k3084R027L554k370J4816K9396J8775q751n1160p683L4995
8157B9396j4200m448k4388k2531L5922L6353j1535j1571k1860m961m931J9892
8145A138p142j3719M583J7145J5217N786J4840k422j5286j2873L167P525J2198
8132C0157J9596K4365j0066m181N776j8023k6810q889M920J4386J1488M939j5878
$$ y = [-23965, -23367, -23643, 949, -16771, -39933, -40806, -15912, -8359, 4476, -5460, -27620, 12815, 37494, -6145, -26221, -10287, 11749, 11639, 4769, -24823, -20207, 14762, 45035, 33147, 28252, 38726, 68791, 67024, 47174, 49481, 66793, 51093, 52772, 39842, 10078, -28610, -33449, -16968, 3937, 11951, -16507, -16992, 2737, -3229, -5481, 15661, 29830, 21373, 37331, 11210, 5777, 22743, 31710, 11881, -11203, -2176, 1378, -992, 13824, 43220, 61995, 53244, 2084, -5599, 29396, 15196, 10748, -13640, -36171, -249, 36104, 24569, 12998, -8862, -13823, -18754, 1138, -6004, -19723, -15140, 2005, 17222, 23008, 37848, 35426, 20140, 7267, 10434, 17959, 30157, 49753, 74118, 64052, 59871, 65647, 47624, 20814, 11925, 16845, 31231, 42719, 47658, 31780]
8119C1780j3418J2357m100m0718k6309M1369L7072l5572j5869Q661O268J5202
8107A6723k7606j6495J0318L336N332o957j6416K092J1183J1361r043r391N713
8094a9850N0582L7234k9649p880J4345K2961J8471M9499J9119j2460j0142J4564
8082A46794l273p563N233m0630m0610O577k7586l7069k3825n190K2006L1854k0769
8069E949p455n105k55o852P747r97k229Q037J8677J0718R4J8055K290p221j4213
8054B7240N397k980L0777K9580n561m2647j3439K0741N114Q640J190R152o89j445
8040G1070j8957J2264j487q670j0893J3569K6787R05j011K81k4750j0081k1681
8027B7346j9138L495J9091J8615K059n874J859K7380J9036n48j0219m0120j4130
$$ y = [31780, 18362, 30719, 26619, -14099, -40408, 961, 38033, 2461, -13408, -4747, 1521, 16723, -10883, -27378, -17060, -13724, -8392, -15349, -31765, -29673, -18490, -7129, -16172, -25563, -19850, 30732, 67966, 38317, 30437, 44782, 67743, 86214, 135713, 154832, 142372, 132230, 146794, 143521, 135958, 141191, 100561, 59951, 66528, 38942, 1873, -21952, -27142, -5136, 26718, 5949, -1506, -6611, -6866, -13718, -5971, -6968, -9197, -1160, 17517, 28235, 28329, 46384, 48674, 41453, 27240, 32637, 29657, 60434, 90014, 84453, 41806, 28367, 49108, 54222, 62862, 64052, 73204, 72515, 71070, 52113, 64377, 62890, 54220, 43327, 56896, 83683, 84588, 83577, 83858, 59108, 49027, 27346, 8208, 11703, 30794, 49409, 51468, 45594, 47453, 74833, 93869, 93321, 83102, 42982, 28852]
8014B8852M064l367L578r698K08o445P137M8651J9867k7362k3059j7692K625j072
8000B6287L9174K1803j7324J439k5260J335k505l446m703R838Q522m1155k8392
7987a4387L0897J682K563n309L4594j0293n665K6547j4066K241K4126P098l869
7974G6159R688L44j3620j6742J1094K652Q49q503n707j7399Q239K9436j5503k7656
7960C3331l0132J6916K2888j9905J3802J7233K1051o766k0413q577j9150J877
7948B2155J955k8920j5L2637k1515j6827L1747J430j0055K835j054j5335m163
7935e125j1163J2229o804k6498J4720K2875J761J7930q98k5648j4707M5895K2833
7922D7400k939J3061k122k5304j901K856L38o852k8700k2836K6743K9293J2046
$$ y = [28852, 32916, 29549, 33127, 23429, 23637, 17192, 24329, 72980, 92847, 65485, 42426, 24734, 27359, 26287, 65461, 87264, 69940, 71379, 46119, 47454, 44949, 41503, 36800, 46638, 55160, 14005, -14387, 16510, 18192, 20755, 15446, 50040, 39747, 34082, 60629, 46563, 48804, 72930, 80028, 76159, 85847, 86191, 72571, 55829, 66923, 69575, 70424, 61921, 56214, 38815, 47054, 76490, 60987, 33331, 3199, 20115, 43003, 23098, 36900, 54133, 75184, 68418, 48005, 39428, 20278, 22155, 24110, -4810, -4825, 27812, 6297, -10530, 21217, 22647, 12592, 15427, 14373, -962, -5125, -16288, -4059, -10863, -37361, -22641, 234, 1995, 19925, 19027, -6621, -21328, 24567, 47400, 44461, 57522, 55400, 30096, 28195, 31051, 31389, 24537, -4163, -26999, -256, 29037, 41083]
7909D1083l769L339j3719j2628q847J9851K781P515j1265j7184J4708j1470N442
7896A5837o499l488q28J3683J4182k7618J2140L230k8005j6398r297J1433j642
7883b3270J9791j1635m1633j083J3567L980o973k4516J1497L4124J679J0782k2534
7870c6224l368l042k2175j568J1116M0590J6373M19J6894j4068j529P168j5778
7857e192J3185j0742k8442j4662K4348K0582N721J0890J0246k384j7389R000J389
7844A6550j6284r754j2439R731K1016K460n484P240r238O984j3649j2752P064
$$ y = [41083, 37314, 40653, 26934, 14306, 5459, 25310, 28091, 35606, 24341, 7157, 21865, 10395, 15837, 9338, 5850, 5022, 18705, 32887, 5269, 17409, 20639, -7366, -23764, -33061, -21628, -23270, -3479, -15114, -56747, -57830, -44263, -40283, -47256, -71772, -60275, -26151, -24472, -13690, -36224, -39592, -42634, -64809, -66377, -55261, -14671, 1702, 2121, 19015, 4947, 3418, 10586, -5192, 7993, -2749, -31191, -45853, -21505, -923, 4798, 15688, 25934, 23550, 6161, 15161, 16550, 266, -9488, -21927, -12196, 8820, 11280, 5796, 13036, 3798, 10782, -2867, -15619, -8555]
$$ [...]
##END NTUPLES=NMR SPECTRUM
##END=
