##TITLE=Analysis number 316806
Compound Code cc 49909
Book Reference 458/92
Project Code adrs
Chemist Name stevem
##JCAMPDX= 6.0         $$ Bruker NMR JCAMP-DX V2.0
##DATA TYPE= NMR SPECTRUM
##DATA CLASS= NTUPLES
##ORIGIN= Bruker BioSpin GmbH
##OWNER= nmr
$$ XWIN-NMR		Version 3.5
$$ Fri Jan 27 09:09:28 2006 GMT Standard Time (UT+0h)  MAYBRIDGE\nmr@NMR_250MHZ
##.OBSERVE FREQUENCY= 250.131544655141
##.OBSERVE NUCLEUS= ^1H
##.ACQUISITION MODE= SIMULTANEOUS (DQD)
##.ACQUISITION SCHEME= undefined
##.AVERAGES= 16
##.DIGITISER RES= 18
##SPECTROMETER/DATA SYSTEM= dpx250
##.PULSE SEQUENCE= zg30
##.SOLVENT NAME= CDCl3
##.SHIFT REFERENCE= (INTERNAL, CDCl3, 0, 16.522)
##AUDIT TRAIL= $$ (NUMBER, WHEN, WHO, WHERE, WHAT)
$$ ##TITLE= Audit trail, XWIN-NMR		Version 3.5
$$ ##JCAMPDX= 5.01
$$ ##ORIGIN= Bruker BioSpin GmbH
$$ ##OWNER= nmr
$$ C:\u/data/dgb/nmr/ADRS/15230/pdata/1/auditp.txt
$$ ##AUDIT TRAIL=  $$ (NUMBER, WHEN, WHO, WHERE, WHAT)
(   1,<2006-01-27 09:09:04.81 +000>,<MAYBRIDGE\nmr>,<NMR_250MHZ>,
      <created by zg, POWCHK disabled, PULCHK disabled
       configuration hash MD5:
       62 19 C7 07 E1 42 D1 B7 37 6C 3D D0 77 39 F9 E6
       data hash MD5: 64K
       A1 4B B3 41 46 D2 62 41 2F 35 FC 04 52 29 90 B0>)
(   2,<2006-01-27 09:09:18.32 +000>,<MAYBRIDGE\nmr>,<NMR_250MHZ>,
      <Start of raw data processing
       ef LB = 0.3 FT_mod = 6 PKNL = 1 SI = 32K 
       data hash MD5: 32K
       80 87 00 75 31 EC 33 45 96 86 FF FC 14 ED 78 5F>)
(   3,<2006-01-27 09:09:20.23 +000>,<MAYBRIDGE\nmr>,<NMR_250MHZ>,
      <apk 
       data hash MD5: 32K
       19 96 AD 65 D0 7B 96 79 70 08 B1 2F 99 97 A2 D8>)
(   4,<2006-01-27 09:09:20.99 +000>,<MAYBRIDGE\nmr>,<NMR_250MHZ>,
      <abs ABSG = 5 
       data hash MD5: 32K
       B2 07 01 9A 2F A3 E0 23 8A DD E6 56 74 0D 6A BA>)
$$ ##END=
$$ 
$$ hash MD5
$$ B0 A0 B3 B8 97 5D 17 B5 A5 C2 61 A5 DB 98 C0 B2
##$RELAX= 
##$RELAX= 
##$RELAX= 
##$RELAX= 
##$RELAX= 
##$RELAX= 
##$RELAX= 
$$ Bruker specific parameters
$$ --------------------------
##$DU= <C:\u>
##$EXPNO= 15230
##$NAME= <ADRS>
##$PROCNO= 1
##$TYPE= <nmr>
##$USER= <dgb>
##$AMP= (0..31)
100 100 100 100 100 100 100 100 100 100 100 100 100 100 100 100 100 100 
100 100 100 100 100 100 100 100 100 100 100 100 100 100 
##$AQSEQ= 0
##$AQ_mod= 3
##$AUNM= <au_zg>
##$AUTOPOS= <39 >
##$BF1= 250.13
##$BF2= 250.13
##$BF3= 250.13
##$BF4= 250.13
##$BF5= 500.13
##$BF6= 500.13
##$BF7= 500.13
##$BF8= 500.13
##$BYTORDA= 1
##$CFDGTYP= 0
##$CFRGTYP= 5
##$CHEMSTR= <none>
##$CNST= (0..31)
1 1 145 1 1 1 1 1 1 1 1 1 1 1 1 1 1 1 1 1 1 1 1 1 1 1 1 1 1 1 1 1 
##$CPDPRG= <>
##$CPDPRG1= <>
##$CPDPRG2= <>
##$CPDPRG3= <>
##$CPDPRG4= <mlev>
##$CPDPRG5= <mlev>
##$CPDPRG6= <mlev>
##$CPDPRG7= <mlev>
##$CPDPRG8= <mlev>
##$CPDPRGB= <>
##$CPDPRGT= <>
##$D= (0..31)
0 1 0 0 0 0 0 0 0 0.06 0 0 0 0 0 0 0.0002 0 0 0 0 0 0 0 0 0 0 0 0 0 0 
0 
##$DATE= 1138352943
##$DBL= (0..7)
120 120 120 120 120 120 120 120 
##$DBP= (0..7)
150 150 150 150 150 150 150 150 
##$DBP07= 0
##$DBPNAM0= <>
##$DBPNAM1= <>
$$ [...]
##$SUBNAM7= <"">
##$SUBNAM8= <"">
##$SUBNAM9= <"">
##$SW= 20.6930455092707
##$SWIBOX= (0..15)
0 0 3 0 0 0 0 0 0 0 0 0 0 0 0 0 
##$SW_h= 5175.983436853
##$TD= 65536
##$TD0= 1
##$TE= 294.16
##$TE2= 300
##$TE3= 300
##$TEG= 300
##$TL= (0..7)
0 120 120 120 120 120 120 120 
##$TP= (0..7)
150 150 150 150 150 150 150 150 
##$TP07= 0
##$TPNAME0= <>
##$TPNAME1= <>
##$TPNAME2= <>
##$TPNAME3= <>
##$TPNAME4= <>
##$TPNAME5= <>
##$TPNAME6= <>
##$TPNAME7= <>
##$TPOAL= (0..7)
0.5 0.5 0.5 0.5 0.5 0.5 0.5 0.5 
##$TPOFFS= (0..7)
0 0 0 0 0 0 0 0 
##$TUNHIN= 0
##$TUNHOUT= 0
##$TUNXOUT= 0
##$USERA1= <user>
##$USERA2= <user>
##$USERA3= <user>
##$USERA4= <user>
##$USERA5= <user>
##$V9= 5
##$VALIST= <valist>
##$VCLIST= <CCCCCCCCCCCCCCC>
##$VD= 0
##$VDLIST= <DDDDDDDDDDDDDDD>
##$VPLIST= <PPPPPPPPPPPPPPP>
##$VTLIST= <TTTTTTTTTTTTTTT>
##$WBST= 1024
##$WBSW= 4
##$XGAIN= (0..3)
0 0 0 0 
##$XL= 0
##$YL= 0
##$YMAX_a= 705825
##$YMIN_a= -885335
##$ZGOPTNS= <>
##$ZL1= 120
##$ZL2= 120
##$ZL3= 120
##$ZL4= 120
##$ABSF1= 16.522
##$ABSF2= -4.171173
##$ABSG= 5
##$ABSL= 3
##$ALPHA= 0
##$AQORDER= 0
##$ASSFAC= 0
##$ASSFACI= 0
##$ASSFACX= 0
##$ASSWID= 0
##$AUNMP= <proc_1d>
##$AZFE= 0.1
##$AZFW= 0.1
##$BCFW= 0
##$BC_mod= 0
##$BYTORDP= 0
##$COROFFS= 0
##$CY= 12.5
##$DATMOD= 1
##$DC= 0
##$DFILT= <>
##$DTYPP= 0
##$F1P= 14.0000005364418
##$F2P= -0.99999901652339
##$FCOR= 0.5
##$FTSIZE= 32768
##$FT_mod= 6
##$GAMMA= 0
##$GB= 0
##$INTBC= 1
##$INTSCL= 1
##$ISEN= 128
##$LB= 0.3
##$LEV0= 0
##$LPBIN= 0
##$MAXI= 10000
##$MC2= 0
##$MEAN= 0
##$ME_mod= 0
##$MI= 0
##$NCOEF= 0
##$NC_proc= -5
##$NLEV= 6
##$NOISF1= 0
##$NOISF2= 0
##$NSP= 0
##$NTH_PI= 0
##$NZP= 0
##$OFFSET= 16.522
##$PC= 1
##$PHC0= 244.1035
##$PHC1= 5.907987
##$PH_mod= 1
##$PKNL= yes
##$PPARMOD= 0
##$PSCAL= 4
##$PSIGN= 0
##$REVERSE= no
##$SF= 250.13
##$SI= 32768
##$SIGF1= 0
##$SIGF2= 0
##$SINO= 400
##$SIOLD= 32768
##$SREGLST= <1H.CDCl3>
##$SSB= 0
##$STSI= 32768
##$STSR= 0
##$SW_p= 5175.98343685301
##$SYMM= 0
##$S_DEV= 0
##$TDeff= 65536
##$TDoff= 0
##$TI= <Analysis number 999999
Compound Code 99
Book Reference 9
Project Code 9>
##$TILT= no
##$TM1= 0
##$TM2= 0
##$TOPLEV= 0
##$USERP1= <user>
##$USERP2= <user>
##$USERP3= <user>
##$USERP4= <user>
##$USERP5= <user>
##$WDW= 1
##$XDIM= 32768
##$YMAX_p= 545074493
##$YMIN_p= -213678
$$ End of Bruker specific parameters
$$ ---------------------------------
##NTUPLES= NMR SPECTRUM
##VAR_NAME=  FREQUENCY,     SPECTRUM/REAL,   SPECTRUM/IMAG
##SYMBOL=    X,             R,               I
##VAR_TYPE=  INDEPENDENT,   DEPENDENT,       DEPENDENT
##VAR_FORM=  AFFN,          ASDF,            ASDF
##VAR_DIM=   32768,         32768,           32768
##UNITS=     HZ,            ARBITRARY UNITS, ARBITRARY UNITS
##FACTOR=    0.157963299565203, 1,           1
##FIRST=     4132.6476996994, 0,             0
##LAST=      -1043.33573715361, 0,           0
##MIN=       -1043.33573715361, -213678,     0
##MAX=       4132.6476996994, 545074493,     0
$$ Real data points
##PAGE= N=1
##DATA TABLE= (X++(R..R)), XYDATA
$$ [...]
$$ plain form
23863 -6883 -57078 -53609 -41323 -13525 44568 29370 -29790 -32401 192 1087 28089 41178 64758
23850 64758 25579 -18467 -45643 -64193 -46647 -14310 -28032 9579 67178 105220 90483 62136
23838 62136 45755 431 15216 5311 -27546 -23700 -63326 -18209 1270 4208 71712 38548
23826 38548 2690 14214 1108 1505 916 34244 45629 -12463 -18608 -34415 -85521 -83267 -99055
23813 -99055 -106922 -66462 -28074 -42301 -77297 -101096 -33641 -7587 1313 58060 76349 36456
23801 36456 2945 -26249 -10202 -17414 -70929 -78705 -29975 -20357 -592 37154 3187 -502
23789 -502 11091 1773 -47362 -89317 -124533 -83644 -15250 -4260 -21671 -33790 -55857 -37516
23777 -37516 -36862 -107908 -56234 12037 39760 4494 16055 -7746 -10883 -6033 27537 -7786
$$ packed form
23863f883n0195L469J2286K7798N8093j5198n9160k611L2593Q95K7002J3089K3580
23850F4758l9179m4046k7176j8550J7546L2337j3722L7611N7599L8042j4737k8347
23838F2136j6381m5324J4785r905l2857L846l9626M5117J9479K938O7504l3164
23826C8548l5858J1524j3106L97n89L3328J1385n8092o145j5807n1106K254j5788
23813i9055p867M0460L8388j4227l4996k3799O7455K6054Q900N6747J8289l9893
23801C6456l3511k9194J6047p212n3515p776M8730R618J9765L7746l3967l689
23789e02J1593r318m9135m1955l5216M0889O8394J0990j7411j2119k2067J8341
23777c7516O54p1046N1674O8271K7723l5266J1561k3801l137M850L3570l5323
$$ plain form
23765 -7786 -32617 43193 54806 -3525 -51227 -46523 -63519 -97974 -77983 -69283 -102393 -92172
23753 -92172 -96934 -12663 32939 18514 12738 44831 61217 31510 -19208 -83362 -88634 -49135
23741 -49135 -22496 -18221 -17007 13570 18068 15396 46497 -13234 -94306 -89829 -32197 -36811 -65697
23728 -65697 897 39458 69918 86951 14376 23466 74579 80611 28869 -45014 -83169 -86302
23716 -86302 -89502 -59559 -25578 -12109 2733 -13697 -12555 -13755 -9072 8463 -23762 -54323
23704 -54323 -64602 -26154 -1945 -14592 -33116 -27579 21837 64944 73140 -1281 -57415 -42350
23692 -42350 14454 56558 53473 20311 11607 24698 36575 9103 19066 4951 -7483 -2550
23680 -2550 -19417 -9409 -1619 -30186 3782 54153 29022 25032 28579 -4853 -7656 -7118 -38186
$$ packed form
23765g786k4831P5810J1613n8331m7702M704j6996l4455J9991Q700l3110J0221
23753i2172m762Q4271M5602j4425n776L2093J6386k9707n0718o4154n272L9499
23741d9135K6639M275J214L0577M498k672L1101n9731q1072M477N7632m614k8886
23728f5697O6594L8561L0460J7033p2575R090N1113O032n1742p3883l8155l133
23716h6302l200K9943L3981J3469J4842j6430J142j200M683J7535l2225l0561
23704e4323j0279L8448K4209j2647j8524N537M9416M3107Q196p4421n6134J5065
23692d2350N6804M2104l085l3162q704J3091J1877k7472R963j4115j2434M933
23680b550j6867J0008P790k8567L3968N0371k5131l990L547l3432k803N38l1068
$$ plain form
23667 -38186 -45954 -83157 -63392 -1999 21529 17704 -25456 -25502 -25326 -7037 -30994 -25613 31499
23654 31499 -13859 19885 9787 -42975 -53149 -51562 -68834 -38274 -815 -32693 -54767 -60443
23642 -60443 -28609 -8422 40664 61323 19060 49005 75829 72589 39754 14718 -9704 -5142
23630 -5142 -20109 -40200 -87053 -113632 -85011 -39404 30901 108601 74901 -9950 -70895 -23955
23618 -23955 -29523 11406 21607 -20439 -967 -26402 -31258 -42623 -28321 6510 -49937 -69275
23606 -69275 3125 39762 13888 44574 22163 -11142 -54357 -56343 -55280 -82654 -65263 -74113
23594 -74113 -37159 -25185 -42532 -64140 -83354 -76748 -31727 -68460 -96842 -88918 -90379 -88102
23582 -88102 -100209 -108097 -47318 -37517 919 40682 29488 39299 28781 -10385 -58733 -56812
$$ packed form
23667c8186p768l7203J9765O1393K3528l825m3160m6J76J8289k3957N381N7112
23654C1499m5358L3744j0098n2762j0174J587j7272L0560L7459l1878k2074n676
23642f0443L1834K0187M9086K0659m2263K9945K6824l240l2835k5036k4422M562
23630e142j4967k0091m6853k6579K8621M5607P0305P7700l3700q4851o0945M6940
23618b3955n568M0929J0201m2046J9472k5435m856j1365J4302L4831n6447j9338
23606f9275P2400L6637k5874L0686k2411l3305m3215j986J063k7374J7391q850
23594g4113L6954J1974j7347k1608j9214O606M5021l6733k8382P924j461K277
23582h8102j2107p888O0779R801L8436L9763j1194R811j0518l9166m8348J921
$$ plain form
23570 -56812 -48217 -99135 -102448 -52093 -50942 -12184 14580 5033 -1903 -19011 19382 100400 69346
23557 69346 1202 -42032 -65452 -53465 -38554 -120759 -142970 -110645 -99047 -102952 -143368 -90981
23545 -90981 -26081 6955 70602 104363 48886 23411 -29541 -34997 -72891 -40227 -1233 46898
23533 46898 102994 93927 89946 30501 -87159 -70151 -49508 -64061 -71771 -69897 -40223 -34497
23521 -34497 -44677 -38606 -60661 -37295 -4226 -21575 -6669 -19278 -1088 81885 58721 18217
23509 18217 14579 12231 13315 55147 36596 1239 -8197 -12070 -19809 5066 31869 6955 -42307
23496 -42307 -8187 -8037 -64600 -37089 19557 39889 106617 99150 64818 3024 -35638 -76153
23484 -76153 -113430 -137869 -139513 -110323 -18941 -12560 -12250 -5389 56911 66718 323 -33022 -9438
$$ packed form
23570e6812Q595n0918l313N0355J151L8758K6764r547o936j7108L8393Q1018l1054
23557F9346o8144m3234k3420J1987J4911q2205k2211L2325J1598l905m0416N2387
23545i0981O4900L3036O3647L3761n5477k5475n2952n456l7894L2664L8994M8131
23533D6898N6096r067l981n9445j17660J7008K0643j4553p710J874K9674N726
23521c4497j0180O071k2055K3366L3069j7349J4906j2609J8190Q2973k3164m0504
23509A8217l638k348J084M1832j8551l5357r436l873p739K4875K6803k4914m9262
23496d2307L4120J50n6563K7511N6646K0332O6728p467l4332o1794l8662m0515
23484g6153l7277k4439j644K9190R1382O381L10O861O2300R807o6395l3345K3584
$$ plain form
23471 -9438 -17655 -58925 -46479 -5140 -5736 -26698 -28173 38752 27768 7662 -94394 -114713
23459 -114713 -53848 -71283 -78426 -69463 -87380 -93982 -66116 -41254 -31223 -21149 1970 38835
23447 38835 1700 -19407 -38297 -1248 9514 -42034 -56314 -30819 -15195 -24145 -60427 -59637
23435 -59637 12563 20277 1572 -27700 -43747 -112884 -136399 -81959 -65047 255 -3919 -13926
23423 -13926 2299 41332 79486 102208 108893 36543 45346 -4907 -38154 -26825 2683 -14886
23411 -14886 24825 50560 25990 23801 -40662 -90125 -62669 -53257 -90490 -114737 -89248 -102231
23399 -102231 -70115 -44951 9208 60581 12959 29810 3707 -61851 -105589 -52028 -22249
23388 -22249 -6092 23029 -60558 -96547 -66990 -46161 9671 -11253 -84974 -112958 -125093 -81416
$$ packed form
23471i438q217m1270J2446M1339n96k0962j475O6925j0984k0106j02056k0319
23459a14713O0865j7435p143Q963j7917o602K7866K4862J0031J0074K3119L6865
23447C8835l7135k1107j8890L7049J0762n1548j4280K5495J5624q950l6282P90
23435e9637P2200P714j8705k9272j6047o9137k3515N4440J6912O5302m174j0007
23423a3926J6225L9033L8154K2722O685p2350Q803n0253l3247J1329K9508j7569
23411a4886L9711K5735k4570k189o4463m9463K7456R412l7233k4247K5489j2983
23399a02231L2116K5164N4159N1373m7622J6851k6103o5558m3738N3561K9779
23388b2249J6157K9121q3587l5989K9557K0829N5832k0924p3721k7984j2135M3677
$$ plain form
23376 -81416 -18902 -5132 -41324 -26432 22350 -2548 -51164 1455 -6343 -61865 -54195 -47373
23364 -47373 -43893 -62129 -52013 -99821 -147361 -123137 -84881 -34473 -21419 -42569 -22141 -854
23352 -854 73109 130100 66745 56840 71074 34838 53107 11705 -6214 -19847 -97143 -135140
23340 -135140 -43684 8603 -34108 -9508 28871 -24550 -100103 -96517 -79042 -62665 -64197 -83672
23328 -83672 -78291 -34007 -7892 22179 6739 6771 21420 -15521 -8528 -26608 -45609 -13411 -41556
23315 -41556 -52915 -27537 -58765 -55966 -56339 -63781 -74706 -73374 -20566 33523 25262 11009 12763
23302 12763 -12690 -32451 -20536 -18107 1386 1661 9499 2491 25491 70934 88902 163481 221917
23289 221917 294411 444666 540106 607776 571120 516099 589981 598432 584559 495265 310722
$$ packed form
23376h1416O2514J3770l6192J4892M8782k4898m8616N2619p798n5522P670O822
23364d7373L480j8236J0116m7808m7540K4224L8256N0408J3054k1150K0428K1287
23352h54P3963N6991o3355r905J4234l6236J8269m1402j7919j3633p7296l7997
23340a35140R1456N2287m2711K4600L8379n3421p5553L586J7475J6377j532j9475
23328h3672N381M4284K6115L0071j5440L2J4649l6941O993j8080j9001L2198k8145
23315d1556j1359K5378l1228K799l73p442j0925J332N2808N4089q261j4253J754
23302A2763k5453j9761J1915K429J9493K75P838p008K3000M5443J7968P4579N8436
23289B21917P2494J50255R5440O7670l6656n5021P3882Q451j3873q9294j84543
$$ plain form
23278 310722 185706 77531 6702 -54117 -70447 -45899 -73435 -96174 -83683 -44289 -50669
23267 -50669 1578 14110 -62609 -59847 -31726 58687 96357 61423 26078 9889 44043 75655
23255 75655 31290 17724 19494 60090 -4155 -61155 -64120 -25852 25872 -321 -32024 -71776
23243 -71776 -85502 -111703 -64136 -49879 -32889 -18695 -83493 -100830 -75427 -38630 6396 4511
23231 4511 -19300 -60581 -57016 -90562 -50444 -7546 14300 -14957 -28148 -48081 -74110 -74948
23219 -74948 -118547 -70449 -73017 -68923 6024 -6165 -81775 -105951 -112174 -43509 38359 111901
23207 111901 115496 111190 28590 -23169 -43919 -42869 36717 51955 38007 38536 -7687 -25927
23195 -25927 -87997 -89912 -8235 40340 18656 66837 86930 126587 93143 47013 -30843 -36551
$$ packed form
23278C10722j25016j08175p0829o0819j6330K4548k7536k2739J2491L9394o380
23267e0669N2247J2532p6719K762K8121R0413L7670l4934l5345j6189L4154L1612
23255G5655m4365j3566J770M0596o4245n7000k965L8268N1724k6193l1703l9752
23243g1776j3726k6201M7567J4257J6990J4194o4798j7337K5403L6797M5026j885
23231D511k3811m1281L565l3546M0118M2898K1846k9257j3191j9933k6029q38
23219g4948m3599M8098k568M094P4947j2189p5610k4176o223O8665Q1868P3542
23207A11901L595m306q2600n1759k0750J050P9586J5238j3948N29m6223j8240
23195b5927o2070j915Q1677M8575k1684M8181K0093L9657l3444m6130p7856n708
$$ plain form
23183 -36551 -14626 -14094 -263 4315 42513 63388 62895 81407 5534 -49854 -7017 17057 -9044
23170 -9044 19439 34795 21230 23513 31654 32170 6987 10707 17884 19148 36200 61963 56049
23157 56049 27519 25513 -24984 20809 7461 -9288 -14196 134 34999 48378 20695 22657
23145 22657 28178 47179 35775 -11244 -60197 -54227 -62553 -82111 -61379 22583 120045 194462
23133 194462 321218 486829 522949 527361 560847 588818 604738 586550 551393 445852 248141
23122 248141 138387 98980 77876 93108 84696 76275 49828 -10674 9480 22891 -7287 32982
23110 32982 28932 -5270 -16979 -26495 -25353 -27986 -54148 -87479 -121794 -129344 -153275 -105974 -23575
23097 -23575 -45489 -82816 -90591 -26070 -30424 49129 77206 85301 48821 2622 -28501 -9957
$$ packed form
23183c6551K1925N32J3831M578L8198K0875m93J8512p5873n5388M2837K4074k6101
23170i044K8483J5356j3565K283Q141N16k5183L720P177J264J7052K5763n914
23157E6049k8530k006n0497M5793j3348j6749m908J4330L4865J3379k7683J962
23145B2657N521J9001j1404m7019m8953N970q326j9558K0732Q3962R7462P4417
23133A94462J26756J65611L6120M412L3486K7971J5920j8188l5157j05541j97711
23122B48141j09754l9407k1104J5232q412q421k6447o0502K0154J3411l0178M0269
23110C2982m050l4202j1709r516J142k633k6162l3331l4315p550k3931M7301Q2399
23097b3575k1914l7327p775O4521m354P9553K8077Q095l6480m6199l1123J8544
$$ plain form
23085 -9957 26284 -11867 -57332 -7244 -8710 -8255 -8535 14557 39117 -18654 -68193 -75088 -73446
23072 -73446 -26852 -52326 -73314 -90989 -95874 -112094 -112857 -70044 -46758 -5400 -14327 -103011
23060 -103011 -112564 -63354 31614 64961 21452 56727 59991 42402 31149 39883 66926 101255
23048 101255 69256 79443 16531 -16868 -30156 -28444 19301 52526 33707 52929 49394 76975
23036 76975 26587 16951 30048 34024 44433 62617 52182 72220 66744 35060 46857 39736
23024 39736 19254 787 33555 41303 19623 15000 8138 -22459 -44364 22405 52093 45457
23012 45457 5472 20045 -10758 -15871 -54057 -37324 -47483 -67805 -68780 -114147 -95240 -52238
23000 -52238 -46368 -36929 -18979 -59828 -120008 -150195 -131709 -36485 -37514 -36656 -53043 -68612 -23726
$$ packed form
23085i957L6241l8151m5465N0088j466M55k80K3092K4560n7771m9539o895J642
23072g3446M6594k5474k0988j7675m885j6220p63M2813K3286M1358q927q8684
23060a03011r553M9210R4968L3347m3509L5275L264j7589j1253Q734K7043L4329
23048A01255l1999J0187o2912l3399j3288J712M7745L3225j8819J9222l535K7581
23036G6975n0388r636J3097L976J0409J8184j0435K0038n476l1684J1797p121
23024C9736k0482j8467L2768P748k1680m623o862l0597k1905O6769K9688o636
23012D5457l9985J4573l0803n113l8186J6733j0159k0322r75m5367J8907M3002
23000e2238N870R439J7950m0849o0180l0187J8486R5224j029Q58j6387j5569M4886
$$ plain form
22987 -23726 22401 27534 9362 18884 4913 29401 -31564 -100720 -92122 -71387 -76579 -61793
22975 -61793 -30301 1015 -4799 -5788 -27760 -9012 63250 20715 -17216 -20684 -51762 -69477
22963 -69477 -17892 9328 3067 10870 74108 118468 62993 22456 -3215 -40729 -45665 -25040
22951 -25040 -45477 -19455 -37030 -38569 -18131 10558 11779 15122 11116 23366 40361 54871
22939 54871 75706 56768 4676 -62503 -58773 -52922 -49557 -84760 -56848 -17734 -19910 -20095 -26734
22926 -26734 -42643 -53931 -83923 -59073 -46169 -34575 -68882 -102609 -49579 -46027 17176 33028
22914 33028 -19335 -29332 14423 18650 -43569 -103006 -43200 -30655 -80497 -80513 -61890 -37492 -25499
22901 -25499 -82871 -111928 -75513 -49743 -23882 -10257 26594 18250 -43510 -101627 -72787 -18440
$$ packed form
22987b3726M6127N133j8172R522j3971K4488o0965o9156Q598K0735n192J4786
22975f1793L1492L1316n814r89k1972J8748P2262m2535l7931l468l1078j7715
22963f9477N1585K7220o261P803O3238M4360n5475m0537k5671l7514m936K0625
22951b5040k0437K6022j7575j539K0438K8689J221L343m006J2250J6995J4510
22939E4871K0835j8938n2092o7179L730N851L365l5203K7912L9114k176j85o639
22926b6734j5909j1288k9992K4850J2904J1594l4307l3727N3030L552O3203J5852
22914C3028n2363r997M3755M227o2219n9437N9806J2545m9842j6J8623K4398J1993
22901b5499n7372k9057L6415K5770K5861J3625L6851q344o1760n8117K8840N4347
$$ plain form
22889 -18440 11603 26501 19684 -23775 -25462 -19137 -44129 -32169 -76965 -110615 -68920 -29415
22877 -29415 12875 25824 -3786 -9889 8253 70418 77361 27396 -16999 1405 11832 44437
22865 44437 68754 47089 53708 22107 24803 -2322 -65234 -114177 -91496 -81017 -39641 -24111
22853 -24111 -21526 -66584 -58303 -96710 -135477 -134754 -86735 -99994 -104925 -82900 -60383 -25379 -13860
22840 -13860 -26777 32869 4503 -20174 -36137 -15006 -18540 -25070 -91632 -125473 -111402 -85572
22828 -85572 -64167 -10970 61120 111787 122681 103831 -3013 -11491 -43753 15506 79356 63233
22816 63233 76453 69792 70984 66119 47944 5835 10301 47734 35366 4843 -34361 -42768 -31923
22803 -31923 -50090 -38543 -14153 -8303 -5019 -3697 -21235 -29208 -19003 46470 96614 150324
$$ packed form
22889a8440L0043J4898o817m3459j687O325k4992J1960m4796l3650M1695L9505
22877b9415M2290J2949k9610o103J8142O2165O943m9965m4395J8404J0427L2605
22865D4437K4317k1665O619l1601K696k7125o2912m8943K2681J0479M1376J5530
22853b4111K585m5058Q281l8407l8767P23M8019j3259m931K2025K2517L5004J1519
22840a3860j2917N9646k8366k4677j5963K1131l534o530o6562l3841J4071K5830
22828h5572K1405N3197P2090N0667J0894j8850j06844q478l2262N9259O3850j6123
22816F3233J3220o661J192m865j8175m2109M466L7433j2368l0523l9204q407J0845
22803c1923j8167J1547K4390N850L284J322j7538p973J0205O5473N0144N3710
$$ plain form
22791 150324 147017 51101 -67322 -54221 -26718 -68309 -84030 -49234 -52077 -25638 -47842 -87977
22779 -87977 -102227 -95170 -98355 -43252 -11973 -14395 -55918 -81046 -41877 -5886 -36592 -35565
22767 -35565 -44752 -86367 -30833 -3712 12339 -2440 7188 -19173 5008 34854 70385 40296
22755 40296 -6689 -25745 -6654 -37741 -87322 -106065 -125199 -108793 -132069 -106981 -45430 -6078
22743 -6078 14677 -63447 -41090 -30597 -37617 -50811 -13816 21604 -10091 -7518 12322 -7277
22731 -7277 -33828 -25482 -52170 -59646 -33319 10593 -4996 -42214 -55481 -50914 -27162 -11651
22719 -11651 -21443 -52438 -29656 -17403 -44823 -21762 15010 54679 47308 -28604 -40895 -68511
22707 -68511 -95642 -116860 -106112 -85291 -81168 -39897 -3010 -32227 -36173 -15725 8242 -17604
$$ packed form
22791A50324l307r5916j18423J3101K7503m1591j5721L4796k843K6439k2204m0135
22779h7977j4250P057l185N5103L1279k422m1523k5128L9169L5991l0706J027
22767c5565r187m1615N5534K7121J6051j4779R628k6361K4181K9846L5531l0089
22755D0296m6985j9056J9091l1087m9581j8743j9134J6406k3276K5088O1551L9352
22743f078K0755p8124K2357J0493p020j3194L6995L5420l1695K573J9840j9599
22731g277k6551Q346k6688p476K6327M3912j5589l7218j3267M567K3752J5511
22719a1651r792l0995K2782J2253k7420K3061L6772L9669p371p5912j2291k7616
22707f8511k7131k1218J0748K0821M123M1271L6887k9217l946K0448K3967k5846
$$ plain form
22695 -17604 -14730 -59229 -67189 -59916 -68203 -81255 -45146 9853 21873 -10926 -9391 31078 61333
22682 61333 29053 31832 -13918 -22049 -89206 -125730 -40283 -9625 -11789 -17511 -20902 25010 -30277
22669 -30277 -38356 -24831 -26664 -76917 -57747 -38463 -45975 -21267 -49575 -48492 -42164 -18819 -901
22656 -901 -2441 37980 52475 19567 7010 54371 75004 38702 35167 74184 97390 101626 57960
22643 57960 16979 36364 17545 18035 643 -29711 -66857 -57918 3334 9027 -23615 16570
22631 16570 28262 12178 -43757 -58595 -66598 -27912 40886 74195 62130 11620 -17735 -13291
22619 -13291 46048 85631 37805 -76850 -80249 -82630 -50252 -36721 -66014 -89031 -64303 -2169
22607 -2169 -10169 -24120 -23956 -24806 -37908 7267 20855 79519 50274 -1516 -40464 -36946 -23802
$$ packed form
22695a7604K874m4499p960P273q287j3052L6109N4999J2020l2799J535M0469L0255
22682F1333l2280K779m5750q131o7157l6524Q5447L0658k164n722l391M5912n5287
22669c0277q079J3525j833n0253J9170J9284p512K4708k8308J083O328K3345J7918
22656i01j540M0421J4495l2908j2557M7361K0633l6302l535L9017K3206M236m3666
22643E7960m0981J9385j8819M90j7392l0354l7146Q939O1252N693l2642M0185
22631A6570J1692j6084n5935j4838q003L8686O8798L3309j2065n0510k9355M444
22619a3291N9339L9583m7826j14655l399k381L2378J3531k9293k3017K4728O2134
22607b169q000j3951J64q50j3102M5175J3588N8664k9245n1790l8948L518J3144
$$ plain form
22594 -23802 -58783 -87901 -71358 -14194 -6619 -16435 -8555 -46478 -90823 -55418 -48235 -35702
22582 -35702 -34365 -14157 70636 111765 101425 71895 62847 22922 6541 21540 -12357 -63842
22570 -63842 -58936 -67817 -45839 -7306 -61472 -64272 -80370 -153679 -159466 -134466 -145924 -89675
22558 -89675 15509 52121 45188 37022 48422 -24541 -46916 -34204 -19799 28299 -10895 -41518
22546 -41518 -68697 -92998 -64411 -7534 28249 -30889 -47077 -82874 -84009 -36611 -14907 2390
22534 2390 -25835 -60720 -32426 -45764 -18738 -33244 -54733 -55163 -69096 -68901 -67937 -75724 -80913
22521 -80913 -124937 -117870 -63706 -4381 -14230 -53631 -56961 -96403 -48154 24459 59418 10731
22509 10731 -36203 -48801 -4400 20393 68599 36066 -7329 32639 62296 81972 8927 -83623
$$ packed form
22594b3802l4981k9118J6543N7164P575r816P880l7923m4345L5405P183J2533
22582c5702J337K0208Q4793M1129j0340k9530r048l9925j6381J4999l3897n1485
22570f3842M906q881K1978L8533n4166k800j6098p3309n787K5000j1458N6249
22558h9675J05184L6612o933q166J1400p2963k2375J2712J4405M8098l9194l0623
22546d1518k7179k4301K8587N6877L5783n9138j6188l5797j135M7398K1704J7297
22534B390k8225l4885K8294j3338K7026j4506k1489m30j3933J95R64p787n189
22521h0913m4024P067N4164N9325r849l9401l330l9442M8249P2613L4959m8687
22509A0731m6934j2598M4401K4793M8206l2533m3395L9968K9657J9676p3045r2550
$$ plain form
22497 -83623 -86648 -132094 -60418 -1862 19952 -10218 -42471 -58106 -63715 -67612 -54319 -8492
22485 -8492 -17755 -37520 -46306 -11153 14558 -43747 -78826 -91292 -64166 -39787 -42088 -77574
22473 -77574 -85334 -15164 2650 24381 -8966 -48090 -45804 -105688 -122741 -145332 -161894 -164696
22461 -164696 -143956 -145851 -125510 -85341 -74158 -79363 -79431 -70369 -51376 -40746 -9532 -19435 -10439
22448 -10439 -2790 8393 35218 -6594 -18866 12776 -38656 1898 58830 36852 260 -31334
22436 -31334 -55063 -75690 -30922 7949 -18814 -25724 -69357 -87559 -66492 -21087 4527 15861
22424 15861 -30472 -44001 -10526 -21898 -58431 -52393 6175 7554 -41252 -41786 -60346 -31540
22412 -31540 55002 89083 25345 -21709 -80412 -63305 -81336 -116268 -63779 -64452 -72656 -47031
$$ packed form
22497h3623l025m5446P1676N8556K1814l0170l2253j5635n609l897J3293M5827
22485h492r263j9765q786L5153K5711n8305l5079j2466K7126K4379k301l5486
22473g7574p760P0170J7814K1731l3347l9124K286n9884j7053k2591j6562k802
22461a64696K0740j895K0341M0169J1183n205o8R062J8993J0630L1214r903Q996
22448a0439P649J1183K6825m1812j2272L1642n1432M0554N6932k1978l6592l1594
22436c1334k3729k0627M4768L8871k6763o910m3633j8202K1067M5405K5614J1334
22424A5861m6333j3529L3475j1372l6533O038N8568J379m8806n34j8560K8806
22412c1540Q6542L4081o3738m7054n8703J7107j8031l4932N2489o73q204K5625
$$ plain form
22400 -47031 61710 84098 17313 -12215 10439 28154 31003 27702 40250 104080 108701 64675
22388 64675 55420 63508 39557 12711 1867 549 2333 -6176 -10396 3598 9814 -11907 -4095
22375 -4095 -17320 -27745 -49106 -89740 -95079 -98355 -76682 38106 98192 39986 -43912 19920
22363 19920 -17547 18804 55270 81590 50755 -5579 -44017 -68764 -47867 -25884 -25989 -27989
22351 -27989 -105169 -116245 -74506 -14561 10436 12195 34455 45736 16163 -43526 -84367 -89285
22339 -89285 -101939 -34050 14525 716 11920 27026 12855 -7694 -57997 -32674 -9828 -32938
22327 -32938 -82745 -57484 -54648 -13824 41687 57639 -3520 -35187 -12218 12025 18968 5285
22315 5285 -27486 -24351 1343 44289 35210 -9789 -64018 -88666 -98299 -58586 -41372 -46694 -9385
$$ packed form
22400d7031J08741K2388o6785k9528K2654J7715K849l301J2548O3830M621m4026
22388F4675r255Q088k3951k6846j0844j318J784q509m220J3994O216k1721P812
22375d095j3225j0425k1361m0634n339l276K1673J14788O0086n8206q3898O3832
22363A9920l7467L6351L6466K6320l0835n6334l8438k4747K0897K1983j05k000
22351b7989p7180j1076M1739N9945K4997J759K2260J1281k9573n9689m0841m918
22339h9285j2654O7889M8575j3809J1204J5106j4171k0549n0303K5323K2846k3110
22327c2938m9807K5261K836M0824N5511J5952o1159l1667K2969K4243O943j3683
22315E285l2771L135K5694M2946r079m4999n4229k4648r633L9713J7214n322L7309
$$ plain form
22302 -9385 56426 47287 36887 13993 -48399 -29411 -34869 -37458 29981 2151 7606 67176 72286
22289 72286 33686 32082 102561 88058 36849 -2273 -27030 -15211 -15779 -21149 -38725 -38829 -104998
22276 -104998 -135554 -106710 -70962 -35786 -50236 -41490 -13211 40905 113551 105780 35240 39026
22264 39026 41972 72516 134857 72733 -11521 -32105 -69002 -52554 -35577 -17764 -55161 -24524
22252 -24524 48106 103233 64638 26007 39472 -3380 -19742 -31901 -38171 -22627 -46852 -41701
22240 -41701 10700 29012 20985 14343 32263 36117 14573 16535 -15745 -16910 -11474 -14356 -70442
22227 -70442 -60792 -81818 -43542 -47476 -43486 -23708 11619 3589 12926 -16619 -60054 -78647 -45752
22214 -45752 -35572 -53312 -51134 -61550 -40624 3714 56380 50085 -4172 -20813 17514 3506
$$ packed form
22302i385O5811r139j0400k2894o2392J8988n458k589O7439k7830N455N9570N110
22289G2286l8600j604P0479j4503n1209l9122k4757J1819n68n370j7576j04o6169
22276a04998l0556K8844L5748L5176j4450Q746K8279N4116P2646p771p0540L786
22264C9026K946L0544O2341o2124q4254k0584l6897J6448J6977J7813l7397L0637
22252b4524P2630N5127l8595l8631J3465m2852j6362j2159o270J5544k4225N151
22240d1701N2401J8312q027o642J7920L854k1544J962l2280j165N436k882n6086
22227g0442R650k1026L8276l934L990J9778L5327q030R337k9545m3435j8593L2895
22214d5752J0180j7740K178j0416K0926M4338N2666o295n4257j6641L8327j4008
$$ plain form
22202 3506 23679 12840 1119 -22742 8479 43418 111245 68618 -8582 -66614 -58271 -51069
22190 -51069 -43221 6473 66908 52750 37436 21396 -26526 -35244 8401 -30054 -52267 7007
22178 7007 -4567 16989 25202 6062 -2004 6989 -15022 -24581 -39377 -36977 -27882 -16928 33076
22165 33076 55088 27137 -539 -16116 12477 36779 34093 23094 -26763 -44789 -69875 -53239
22153 -53239 -11841 17829 37858 8604 10187 12331 -50632 -63238 -35245 -32195 -29202 -13958
22141 -13958 7667 2983 33208 -3390 -43483 -16391 -35695 -77102 -102524 -154360 -161597 -65808
22129 -65808 24068 50523 -3232 -1123 -16449 -80100 -93384 -80539 -41274 -19736 15610 -5191
22117 -5191 -43374 -39280 -63554 -93711 -33157 19897 4005 24369 81281 14111 2578 30118
$$ packed form
22202C506K0173j0839j1721k3861L1221L4939O7827m2627p7200n8032Q343P202
22190e1069P848M9694O0435j4158j5314j6040m7922q718M3645l8455k2213N9274
22178G007j1574K1556Q213j9140q066Q993k2011r559j4796K400R095J0954N0004
22165C3076K2012k7951k7676j5577K8593K4302k686j0999m9857j8026k5086J6636
22153e3239M1398K9670K0029k9254J583K144o2963j2606K7993L050K993J5244
22141a3958K1625m684L0225l6598m0093K7092j9304m1407k5422n1836p237R5789
22129f5808Q9876K6455n3755K109j5326o3651j3284J2845L9265K1538L5346k0801
22117e191l8183M094k4274l0157O0554N3054j5892K0364N6912o7170j1533K7540
$$ plain form
22105 30118 39273 22213 -11472 -45372 -27588 -11336 -2525 45102 60177 -11316 -36049 -6577
22093 -6577 2775 1836 14999 -2239 -45385 -51704 27702 50083 -7180 -42348 -62925 -88886 -91550
22080 -91550 -95150 -96958 -80127 -64272 -60892 -67382 -19034 12770 33136 36037 -26928 -35135 20659
22067 20659 -6040 -37286 -78667 -106118 -130037 -116328 -74141 -117215 -91579 -102259 -74348 -40390
22055 -40390 -44767 -28082 -38597 -60307 -67417 -54368 -43269 -66188 -31488 1555 5552 41244
22043 41244 51851 37106 49045 39539 4567 403 5301 -15339 1457 13299 39328 4815
22031 4815 10669 1737 -31521 -84927 -71402 -82811 -123086 -86356 -26047 -12093 -36802 8851
22019 8851 46780 61147 -34392 -65101 -85813 -90654 -34323 62300 51432 -56592 -56900 -23532
$$ packed form
22105C0118R155j7060l3685l3900J7784J6252Q811M7627J5075p1493k4733K9472
22093f577R352r39J3163j7238m3146o319P9406K2381n7263l5168k0577k5961k664
22080i1550l600j808J6831J5855L380o490M8348L1804K0366K901o2965q207N5794
22067B0659k6699l1246m1381k7451k3919J3709M2187m3074K5636j0680K7911L3958
22055d0390m377J6685j0515k1710p110J3049J1099k2919L4700L3043L997L5692
22043D1244J0607j4745J1939r506l4972m164M898k0640J6796J1842K6029l4513
22031D815N854q932l3258n3406J3525j1409m0275L6730O0309J3954k4709M5653
22019H851L7929J4367r5539l0709k0712m841N6331R6623j0868j08024l08L3368
$$ plain form
22007 -23532 -27819 -18314 -5491 -15471 -98698 -112974 -28533 2049 -21502 -77768 -49233 -55511
21995 -55511 -107315 -125752 -142410 -126479 -98370 -63733 -49866 -66461 -78054 -118439 -171102 -131645
21983 -131645 -52586 -30323 35789 32842 -2064 -33956 -53166 12140 52989 64929 11272 -75234
21971 -75234 -84368 -60880 -26393 13861 -15771 -20728 -4394 36760 49118 76744 17306 28926
21959 28926 37305 24871 65534 54043 74809 86612 77604 68632 58660 17282 -16274 -3074
21947 -3074 -13349 -35849 9473 33460 -46160 -95993 -65677 -22404 9954 -22901 -60976 -75707
21935 -75707 -62864 16882 38817 -4493 42203 14377 -74238 -104945 -42847 15574 29132 18458
21923 18458 51617 70691 8148 -495 14389 39218 22082 7630 -9362 -51275 -39075 29104
$$ packed form
22007b3532m287R505J2823r980q3227j4276Q4441L0582k3551n6266K8535o278
21995e5511n1804j8437j6658J5931K8109L4637J3867j6595j1593m0385n2663L9457
21983a31645P9059K2263O6112k947l4906l1892j9210O5306M0849J1940n3657q6506
21971g5234r134K3488L4487M0254k9632m957J6334M1154J2358K7626n9438J1620
21959B8926Q379j2434M0663j1491K0766J1803r008q972r972m1378l3556J3200
21947c074j0275k2500M5322K3987p9620m9833L0316M3273L2358l2855l8075j4731
21935g5707J2843P9746K1935m3310M6696k7826q8615l0707O2098N8421J3558j0674
21923A8458L3159J9074o2543q643J4884K4829j7136j4452j6992m1913J2200O8179
$$ plain form
21911 29104 16974 28726 28331 -13281 -62523 -38214 -16959 -24563 -88319 -123230 -138371 -82771
21899 -82771 -91203 -109716 -101050 -112648 -81581 -49549 -93470 -113683 -64601 -59017 -65071 -60148 -68386
21886 -68386 -84183 55109 99700 97028 56835 19660 16306 23766 13896 54737 35273 20043
21874 20043 26179 44100 2471 -35103 -37101 -17294 -21341 -77688 -40025 13809 -25734 -18482
21862 -18482 -18123 -43358 -14266 -16942 -29272 -40171 -74902 -56813 -67244 -93448 -126329 -73107
21850 -73107 -63221 -25346 33467 88297 71588 57107 20108 2609 36229 34703 28842 40397
21838 40397 62767 89376 10603 -67183 -42980 28921 46743 51136 67921 89311 80789 53999
21826 53999 22988 46089 5131 -26466 -29358 -4957 -51718 -119321 -77168 -43870 -40913 3851
$$ packed form
21911B9104j2130J1752l95m1612m9242K4309K1255p604o3756l4911j5141N5600
21899h2771q432j8513Q666j1598L1067L2032m3921k0213M9082N584o054M923q238
21886f8386j5797J39292M4591k672m0193l7175l354P460r870M0841j9464j5230
21874B0043O136J7921m1629l7574j998J9807m047n6347L7663N3834l9543P252
21862a8482L59k5235K9092k676j2330j0899l4731J8089j0431k6204l2881N3222
21850g3107R886L7875N8813N4830j6709j4481l6999j7499L3620j526n861J1555
21838D0397K2370K6609p8773p7786K4203P1901J7822M393J6785K1390q522k6790
21826E3999l1011K3101m0958l1597k892K4401m6761o7603M2153L3298K957M4764
$$ plain form
21814 3851 -27388 -66882 -89490 -101615 -41011 -52431 -62076 -57553 -36017 -27691 -79415 -143645
21802 -143645 -153145 -123803 -106567 -40659 11921 13549 29288 42962 37472 73875 54282 13163
21790 13163 -8792 -22546 -2699 -27037 -6793 -23562 -48844 -96814 -113102 -46845 -64147 -85445
21778 -85445 -38585 -15054 16304 27726 19780 28561 -35479 -57780 -18130 -1564 9927 -25765
21766 -25765 -19102 -37827 -107525 -16518 37073 -244 -46871 -43314 -215 -9391 19064 40516
21754 40516 49689 16076 20867 40347 58486 61350 -12548 -14335 -127 12939 21235 27611 -49144
21741 -49144 -45891 -18182 -48686 -15409 7487 -13247 -49423 -54378 -19895 -11450 4304 48984
21729 48984 53687 29298 -14722 -37075 -38593 -76345 -73840 -27262 36469 -6318 -20550 32179
$$ packed form
21814C851l1239l9494k2608j2125O0604j1420r645M523K1536Q326n1724o4230
21802a43645r500K9342J7236O5908N2580J628J5739J3674n490L6403j9593m1119
21790A3163k1955j3754J9847k4338K0244j6769k5282m7970j6288O6257j7302k1298
21778h5445M6860K3531L1358J1422p946Q781o4040k2301L9650J6566J1491l5692
21766b5765O663j8725o9698R1007N3591l7317m6627L557M3099r176K8455K1452
21754D0516R173l3613M791J9480J8139K864p3898j787J4208J3066Q296O376p6755
21741d9144L253K7709l0504L3277K2896k0734l6176m955L4483Q445J5754M4680
21729D8984M703k4389m4020k2353j518l7752K505M6578O3731m2787j4232N2729
$$ plain form
21717 32179 45481 30956 64498 -19161 -78301 -111808 -120868 -52485 -48162 -44899 -13494 1094
21705 1094 -12646 -17503 -52698 -46051 -44400 -5097 -18892 -18431 15690 -2076 -98266 -105215 -68234
21692 -68234 -59539 -73640 -92321 -120446 -106479 -96371 -82454 -65441 -45075 -28829 -37615 -47848
21680 -47848 -17192 -3983 -8865 1809 13868 -9291 36415 12520 13553 -8613 -24439 8332
21668 8332 32003 -9184 -23937 -38221 -53518 -39788 -37929 -77419 -95894 -135740 -153221 -156806
21656 -156806 -75983 -35963 -60476 -23536 -6823 -21044 -12710 17460 -11605 -36004 -45297 -66528
21644 -66528 -95957 -59255 15790 40046 57343 27595 30583 -16301 32483 44827 9463 -25415
21632 -25415 -71179 -34814 53159 100069 58420 22519 17386 51409 46845 51044 10482 -13283
$$ packed form
21717C2179J3302j4525L3542q3659n9140l3507r060O8383M323L263L1405J4588
21705A094j3740m857l5195O647J651L9303j3795M61L4121j7766r6190o949L6981
21692f8234Q695j4101j8681k8125J3967J0108J3917J7013K0366J6246q786j0233
21680d7848L0656J3209m882J0674J2059k3159M5706k3895J033k2166j5826L2771
21668H332K3671m1187j4753j4284j5297J3730J859l9490j8475l9846j7481l585
21656a56806Q0823M0020k4513L6940J6713j4221Q334L0170k9065k4399r293k1231
21644f6528k9429L6702P5045K4256J7297k9748K988m6884M8784J2344l5364l4878
21632b5415m5764L6365Q7973M6910m1649l5901n133L4023m564M199m0562k3765
$$ plain form
21620 -13283 -15502 19067 -6886 -34856 -40817 -25216 -37816 -37818 -30296 -28402 10009 10269 888 14411
21606 14411 30812 -44447 -61296 -12012 86740 62902 24732 3972 5780 24309 389 7917
21594 7917 15461 23186 33205 57175 53980 59522 30925 -198 -80643 -117809 -45442 -8527 73099
21581 73099 59051 -24256 -61 15644 4186 16506 43872 37689 44614 48865 7066 -51288
21569 -51288 -37366 24186 60344 19456 8272 71274 40415 12151 -22043 -82078 -150269 -119215
21557 -119215 -90057 -78002 -27525 17343 39253 22935 -42409 -44425 -46822 -24308 14175 -33848
21545 -33848 -106887 -32652 29544 -18168 -48316 -35090 -34654 -52772 -14911 73384 75671 3444
21533 3444 -2166 52021 52794 84834 140711 111440 80835 100096 147996 110349 76942 76297 32526
$$ packed form
21620a3283k219L4569k5953k7970n961J5601j2600kP522J894L8411K60r381J3523
21606A4411J6401p5259j6849M9284R8752k3838l8170k0760J808J8529k3920P528
21594G917P544P725J0019K3970l195N542k8597l1123q0445l7166P2367L6915Q1626
21581G3099j4048q3307K4195J5705j1458J2320K7366o183O925M251m1799n8354
21569e1288J3922O1552L6158m0888j1184O3002l0859k8264l4194o0035o8191L1054
21557a19215K9158J2055N0477M4868K1910j6318o5344k016k397K2514L8483m8023
21545c3848p3039P4235O2196m7712l0148J3226M36j8118L7861Q8295K287p2227
21533C444n610N4187P73L2040N5877k9271l0605J9261M7900l7647l3407o45m3771
$$ plain form
21520 32526 38241 38293 22861 24209 6968 22433 52083 56235 66677 33287 -13733 -49385 -69215
21507 -69215 -27151 -16625 10375 10905 32776 26078 45823 16681 12038 9224 28729 38942 38338
21494 38338 16749 -10754 -31696 6092 18840 -17835 1344 36963 606 25814 15068 -800
21482 -800 39311 76849 43832 27491 75252 15497 -44312 -43039 28120 5927 -15546 -10088
21470 -10088 -29078 -38451 -69856 -78744 -33094 2211 -22889 -13139 73772 119975 97140 -10400
21458 -10400 -73589 -53189 -79756 -107774 -34515 -467 62821 171976 168785 107982 89787 107274
21446 107274 80141 60222 -38758 -75157 -10802 47868 3911 -8175 -15851 -12771 -17599 -77251
21434 -77251 -88247 -69501 -74225 -45972 -49582 -124133 -159268 -159643 -149119 -81597 -43522 -68733
$$ packed form
21520C2526N715N2j5432J348j7241J5465K9650M152J0442l3390m7020l5652j9830
21507f9215M2064J0526K7000N30K1871o698J9745k9142m643k814J9505J0213o04
21494C8338k1589k7503k0942L7788J2748l6675J9179L5619l6357K5208j0746j5868
21482h00M0111L7538l3017j6341M7761n9755n9809J273P1159k2193k1473N458
21470a0088j8990r373l1405q888M5650L5305k5100R750Q6911M6203k2835j07540
21458a0400o3189K0400k6567k8018P3259L4048O3288J09155l191o0803j8195J7487
21446A07274k7133j9919r8980l6399O4355N8670m3957j2086p676L080m828n9652
21434g7251j0996J8746m724K8253l610p4551l5135l75J0524O7522L8075k5211
$$ plain form
21422 -68733 -95415 -46509 32631 35706 -11224 -37204 -77078 -64253 -92826 -99183 -23155 -29736
21410 -29736 -80074 -124839 -104716 -67855 -75783 -21022 35055 4965 -39415 -41562 -47784 -36926
21398 -36926 -29764 -17623 -30487 -40209 -42129 -29991 -28467 -16995 -53372 -51086 -23586 -40696 -37264
21385 -37264 -102159 -132357 -110945 -99157 -66937 -23722 18361 56663 101658 85191 84832 15337
21373 15337 -55832 -84202 -18982 51007 19177 -30942 -24154 14157 -10839 -8978 -9037 18833 4577
21360 4577 -57254 -90857 -94511 -121646 -126732 -87257 -64418 -39482 -39262 -10689 -82 7101 2789
21347 2789 -57969 -83926 -60881 -56694 -93084 -70717 -63729 -27648 39861 68756 54033 -30971
21335 -30971 -43672 -18479 60909 108069 66734 19146 16112 59421 29980 -27175 11035 45357
$$ packed form
21422f8733k6682M8906P9140L075m6930k5980l9874J2825k8573o357P6028o581
21410b9736n0338m4765K0123L6861p928N4761N6077l0090m4380k147o222J0858
21398c6926P162J2141j2864r722j920J2138J524J1472l6377K286K7500j7110L432
21385c7264o4895l0198K1412J1788L2220M3215M2083L8302M4995j6467l59o9495
21373A5337p1169k8370O5220O9989l1830n0119O788L8311k4996J861n9K7870j4256
21360D577o1831l3603l654k7135n086L9475K2839K4936K20K8573J0607P183m312
21347B789o0758k5957K3045M187l6390K2367O988L6081O7509K8895j4723q5004
21335c0971j2701K5193P9388M7160m1335m7588l034M3309k9441n7155L8210L4322
$$ plain form
21323 45357 -12457 -56140 -58607 -77719 -76537 -28990 -49080 -32036 -8570 -2238 -19059 -42310
21311 -42310 -68387 -102249 -127997 -123191 -85717 -37107 11077 -33737 -72281 -118640 -185788 -109290
21299 -109290 -60422 -18643 -41947 -93076 -57638 -1871 -8270 -29868 -1217 -8916 -23450 -73861
21287 -73861 -73400 -44028 3962 -183 -51393 -99811 -101328 -66540 -34294 -10242 -17804 -45774 -50598
21274 -50598 -72530 -108683 -107069 -126849 -100574 -19934 -21070 1013 -2667 -28021 -51238 -82827
21262 -82827 -59018 -10881 -14056 -95550 -139511 -134353 -94077 -79949 -53861 -44701 -61922 -61260 -52767
21249 -52767 -58681 -104619 -140612 -116562 -100607 -54318 -14981 -3587 47414 43619 7016 19391
21237 19391 74919 100172 61595 29069 65062 58993 49671 51506 27948 11621 47099 17278
$$ packed form
21323D5357n7814m3683k467j9112J182M7547k0090J7044K3466O332j6821k3251
21311d2310k6077l3862k5748M806L7474M8610M8184m4814l8544m6359o7148P6498
21299a09290M8868M1779k3304n1129L5438N5767o399k1598K8651p699j4534n0411
21287g3861M61K9372M7990m145n1210m8418j517L4788L2246K4052p562k7970m824
21274e0598k1932l6153J614j9780K6275Q0640j136K2083l680k5354k3217l1589
21262h2827K3809M8137l175q1494m3961N158M0276J4128K6088R160j7221O62Q493
21249e2767n914m5938l5993K4050J5955M6289L9337J1394N1001l795l6603J2375
21237A9391N5528K5253l8577l2526L5993o069r322J835k3558j6327L5478k9821
$$ plain form
21225 17278 5950 456 12543 31001 8434 -10439 22109 37231 46025 91277 62658 78174
21213 78174 77110 86048 120183 109880 123167 99550 74071 95002 91583 103441 93100 13535
21201 13535 37397 78059 63486 84602 53746 24072 -8900 -61223 -69858 -85365 -105467 -121228
21189 -121228 -111632 -73572 -18779 25570 29378 21922 12262 -17077 -111852 -118036 -77719 -36788
21177 -36788 -90189 -81416 55770 86719 16543 15150 68890 34057 16479 13385 27111 40237
21165 40237 19627 11807 6875 -37533 -39326 4915 71062 64394 18720 -40584 -80785 -66717
21153 -66717 -24215 -35868 -12416 31018 -37097 -104112 -71825 37024 17623 -44215 -73747
21142 -73747 -64306 -90078 -138487 -172576 -173482 -139047 -82849 -67197 -89103 -87064 -74297 -47671
$$ packed form
21225A7278j1328n494J2087J8458k2567j8873L2548J5122Q794M5252k8619J5516
21213G8174j064Q938L4135j0303J3287k3617k5479K0931l419J1858j0341p9565
21201A3535K3862M0662j4573K1116l0856k9674l2972n2323q635j5507k0102j5761
21189a21228R596L8060N4793M4349L808p456r660k9339r4775o184M0317M0931
21177c6788n3401Q773J37186L0949p0176j393N3740l4833j7578l094J3726J3126
21165D0237k0610p820m932m4408j793M4241O6147o668m5674n9304m0201J4068
21153f6717M2502j1653K3452M3434o8115o7015L2287J08849j9401o1838k9532
21142g3747R441k5772m8409l4089r06L4435N6198J5652k1906K039J2767K6626
$$ plain form
21130 -47671 7714 13816 2984 -1536 -60881 -60983 -77730 -52199 4735 7887 -8055 -22772 -49084
21117 -49084 -15300 -16268 -59962 -101209 -65057 -49863 -52627 -53707 -24527 -33893 1648 -16458 -23385
21104 -23385 -44574 -16053 -32847 -29426 -41084 -84800 -83187 -45888 25813 29994 -993 -33736
21092 -33736 -18230 -18897 1331 -40517 -17473 -30921 -46188 -21458 15067 4334 -27910 27200
21080 27200 -13845 -39890 -38985 -77387 -124471 -77843 -35211 -73482 -95016 -112718 -108653 -87199
21068 -87199 -85561 -83482 -73967 -26257 -4169 -6935 -75451 -72428 -17440 -32190 -77028 -64726 -56457
21055 -56457 -87801 -131110 -104508 -32197 -18539 -3760 19217 1454 6428 18328 -41422 -37442
21043 -37442 -29653 -18901 2031 20386 11382 -17003 6814 -11377 2473 1558 -64407 -33146
$$ packed form
21130d7671N5385O102j0832m520n9345j02j6747K5531N6934L152j5942j4717k6312
21117d9084L3784r68m3694m1247L6152J5194k764j080K9180r366L5541j8106o927
21104b3385k1189K8521j6794L421j1658m3716J613L7299P1701M181l0987l2743
21092c3736J5506o67K0228m1848K3044j3448j5267K4730L6525j0733l2244N5110
21080B7200m1045k6045R05l8402m7084M6628M2632l8271k1534j7702M065K1454
21068h7199J638K079R515M7710K2088k766o8516L023N4988j4750m4838J2302Q269
21055e6457l1344m3309K6602P2311J3658J4779K2977j7763M974J1900n9750L980
21043c7442P789J0752K0932J8355r004k8385K3817j8191J3850r15o5965L1261
$$ plain form
21031 -33146 -14807 12440 35114 -964 6330 36341 30697 3319 -43693 -106503 -121479 -97054
21019 -97054 -77196 -58773 -31205 -34027 -48616 -27733 -81048 -65665 -64894 -45149 -69620 -72783
21007 -72783 -38495 -40973 -22524 32122 41563 29945 75202 105876 28888 -35246 -13024 -72096
20995 -72096 -70434 -77174 -88117 -65770 -50759 -40252 -31037 -6619 -26467 -20629 586 -18843
20983 -18843 -15073 12269 3299 -3206 62447 29497 24958 45306 -2730 -13764 -15137 -62314 -89295
20970 -89295 -67590 -54015 -65462 -46782 -26196 -26799 -36239 3912 23140 31591 -1832 -34537
20958 -34537 18463 22658 -11870 -6274 44476 72327 47352 42726 62432 38473 23038 43515
20946 43515 -15443 -78348 -74543 -102965 -144713 -129823 -36287 38614 63374 25581 12419 8232
$$ packed form
21031c3146J8339K7247K2674l6078P294L0011n644k7378m7012o2810j4976K4425
21019i7054J9858J8423K7568k822j4589K0883n3315J5383P71J9745k4471l163
21007g2783L4288k478J8449N4646R441j1618M5257L0674p6988o4134K2222n9072
20995g2096J662o740j0943K2347J5011J0507R215K4418j9848N838K1215j9429
20983a8843L770K7342q970o505O5653l2950m539K0348m8036j1034j373m7177k6981
20970h9295K1705J3575j1447J8680K0586o03r440M0151J9228Q451l3423l2705
20958c4537N3000M195l4528N596N0750K7851k4975m626J9706k3959j5435K0477
20946D3515n8958o2905L805k8422m1748J4890R3536P4901K4760l7793j3162m187
$$ plain form
20934 8232 65092 22721 -40178 -63001 -72547 -49014 -20274 -54943 -58850 -10822 50181 -44543
20922 -44543 -114703 -89047 -76675 -18175 40731 25643 -56344 -66539 -30816 -36412 -10329 -15207
20910 -15207 -78568 -64652 -23573 -13821 -11883 1045 55826 92405 68802 17964 -4484 -8377
20898 -8377 13294 46461 18158 -10648 13316 -10197 -35637 -39672 -10247 13002 8398 -34730
20886 -34730 -46011 -45154 -51493 -33394 -61205 -74629 -60083 -26248 -16377 -33812 -38070 5554 31538
20873 31538 -4719 -46231 -49496 -6000 16887 19726 37086 14489 1442 63384 91552 63535
20861 63535 57977 51293 53621 5901 44671 5383 -48444 -82206 -98512 -71617 -45194 7673
20849 7673 -10108 -33424 -101773 -86628 7437 8962 13950 34549 32059 13581 -24484 -69454
$$ packed form
20934H232N6860m2371o2899k2823r546K3533K8740l4669l907M8028O1003r4724
20922d4543p0160K5656J2372N8500N8906j5088q1987j0195L5723n596K6083m878
20910a5207o3361J3916M1079R752J938J2928N4781L6579k3603n0838k2448l893
20898h377K1671L3167k8303k8806K3964k3513k5440m035K9425K3249m604m3128
20886c4730j1281Q57o339J8099k7811j3424J4546L3835R871j7435m258M3624K5984
20873C1538l6257m1512l265M3496K2887K839J7360k2597j3047O1942K8168k8017
20861F3535n558o684K328m7720L8770l9288n3827l3762j6306K6895K6423N2867
20849G673j7781k3316o8349J5145R4065J525M988K0599k490j8478l8065m4970
$$ plain form
20837 -69454 -51437 -38881 -64003 -83042 -58686 -77845 -32102 42110 83626 74376 46938 48197
20825 48197 68541 40702 33230 53851 51603 97015 111703 88049 67891 42490 10277 -86301
20813 -86301 -109736 -75002 -45880 -12415 -1126 721 75186 106640 2545 -70395 -116820 -89926
20801 -89926 1187 12991 5572 5645 4457 7200 18270 8791 -12580 35742 23777 -52663 -84452
20788 -84452 -73101 -47884 -52829 -46454 -55242 -52641 -2237 37416 6918 -42343 -61916 -22208
20776 -22208 -45751 -66777 -59169 -3515 -1111 -41766 -93644 -57808 -31465 -32893 -94247 -64854
20764 -64854 -42748 -14984 -6822 -12895 -34085 -74860 -103071 -109300 -84195 -48111 6132 121
20752 121 15102 82158 25219 -48721 -72407 -71958 -62420 -122812 -70132 -47098 -108088 -145019 -133734
$$ packed form
20837f9454J8017J2556k5122j9039K4356j9159M5743P4212M1516r250k7438J259
20825D8197K0344k7839p472K0621k248M5412J4688k3654k0158k5401l2213r6578
20813h6301k3435L4734K9122L3465J1289J847P4465L1454j04095p2940m6425K6894
20801h9926R1113J1804p419P3j188K743J1070r479k1371M8322j1965p6440l1789
20788h4452J1351K5217m945O375q788K601N0404L9653l0498m9261j9573L9708
20776b2208k3543k1026P608N5654K404m0655n1878L5836K6343j428o1354K9393
20764f4854K2106K7764Q162o073k1190m0775k8211o229K5105L6084N4243o011
20752A21J4981O7056n6939p3940k3686M49R538o0392N2680K3034o0990l6931J1285
$$ plain form
20739 -133734 -129598 -138213 -128170 -91738 -65801 -24403 -63470 -93835 -107458 -137268 -159484 -155122
20727 -155122 -110329 -94795 -137357 -78212 -76015 -59829 10776 18959 34237 23723 6622 22968
20715 22968 38722 41292 38051 8672 -74520 -86969 -44884 -11443 -2713 -90924 -127864 -95804
20703 -95804 -45127 -19274 -59115 -55251 -52735 -48606 -17385 -13915 -102 -11555 -3946 38454 96749
20690 96749 45929 4226 4550 -11246 4144 -19049 -19479 -36095 -46081 -29407 15868 -2383 6293
20677 6293 38267 44893 -23214 -59550 -12390 -5744 5973 33068 38005 13983 23703 -2708 -11226
20664 -11226 -33730 -41309 -25518 -82135 -99180 -117220 -124466 -75928 -29239 -71246 -135765 -118658
20652 -118658 -119504 -113208 -22511 -10347 -7723 16345 27145 63260 76526 -7520 -46760 -64417
$$ packed form
20739a33734M136q615J0043L6432K5937M1398l9067l0365j3623k9810k2216M362
20727a55122M4793J5534m2562N9145K197J6186P0605Q183J5278j0514j7101J6346
20715B2968J5754K570l241k9379q3192j2449M2085L3441Q730q8211l6940L2060
20703i5804N0677K5853l9841L864K516M129L1221L470J3813j1453P609M2400N8295
20690I6749n0820m1703L24j5796J5390k3193m30j6616r986J6674M5275j8251Q676
20677F293L1974O626o8107l6336M7160O646J1717K7095M937k4022R720k6411q518
20664a1226k2504p579J5791n6617j7045j8040p246M8538M6689m2007o4519J7107
20652a18658q46O296R0697J2164K624K4068J0800L6115J3266q4046l9240j7657
$$ plain form
20640 -64417 -77211 -111518 -92651 -97413 -48720 -7374 -24646 -34980 -37482 -59101 -53645 4573
20628 4573 31615 46932 46871 24674 49920 33892 2441 -47619 -49584 -39686 -21032 -16863 -41557
20615 -41557 -8199 11753 83520 77328 15580 15392 2528 21663 79210 58777 58852 71901 53479
20602 53479 26785 18265 53166 74674 37521 16459 350 -21529 9467 18640 44603 99237
20590 99237 85483 110484 75924 6651 -38629 -32493 -3232 44491 65754 78234 53794 31973
20578 31973 37890 65093 47220 44335 8233 -17526 -33370 15395 -14279 23868 64138 80033
20566 80033 107787 15141 -31024 12996 96022 94990 79264 42257 -22700 -53965 -52443 -54210
20554 -54210 -52302 -17231 -10631 14723 47468 67534 49732 44265 26318 20994 -29095 -18009
$$ packed form
20640f4417j2794l4307J8867m762M8693M1346j7272j0334k502k1619N456N8218
20628D573K7042J5317o1k2197K5246j6028l1451n0060j965R898J8654M169k4694
20615d1557L3358J9952P1767o192o1748j88j2864J9135N7547k0433P5J3049j8422
20602E3479k6694q520L4901K1508l7153k1062j6109k1879L0996R173K5963N4634
20590I9237j3754K5001l4560o9273m5280O136K9261M7723K1263J2480k4440k1821
20578C1973N917K7203j7873k885l6102k5759j5844M8765k9674L8147M0270J5895
20566H0033K7754r2646m6165M4020Q3026j032j5726l7007o4957l1265J522j767
20554e4210J908L5071O600K5354L2745K0066j7802n467j7947n324n0089J1086
$$ plain form
20542 -18009 8371 15642 -43264 -40714 -73161 -25464 -6245 3772 5980 3432 -25121 16569
20530 16569 4610 -43517 -65713 -13776 38600 29970 20860 -18338 -98753 -79430 -24396 -28885
20518 -28885 -43901 -24054 -14358 -16352 -36156 -48345 -65319 -46736 66392 60473 37031 101019
20506 101019 124028 104682 74378 53514 19349 -6373 -33178 -8846 12528 -136 14743
20495 14743 22166 8112 19486 -32167 -45406 -51846 -54243 -59512 -61697 -39396 -33746 -33069 -16238
20482 -16238 9439 5540 -13002 -4861 6238 -326 -3252 -33556 -14580 -23405 -65534 -36956 -56395
20469 -56395 -47380 -29414 -8054 -33441 -38796 -22844 -12001 27688 71387 100336 59783 18108
20457 18108 -23584 -6783 -8806 -965 -49617 -58588 -1570 50733 3678 -1679 -7554 -8904 28077
$$ packed form
20542a8009K6380P271n8906K550l2447M7697J9219J0017K208k548k8553M1690
20530A6569j1959m8127k2196N1937N2376q630r110l9198q0415J9323N5034m489
20518b8885j5016J9847R696j994j9804j2189j6974J8583J13128n919k3442O3988
20506A01019K3009j9346l0304k0864l4165k5722k6805K4332K1374j2664J4879
20495A4743P423j4054J1374n1653j3239o440k397n269k185K2301N650O77J6831
20482a6238K5677l899j8542Q141J1099o564k926l0304J8976q825m2129K8578j9439
20469e6395R015J7966K1360k5387n355J5952J0843L9689M3699K8949m0553m1675
20457A8108m1692J6801k023P841m8652q971N7018N2303m7055n357n875j350L6981
$$ plain form
20444 28077 50491 91361 85380 71172 81403 102397 83523 58918 -15327 -18563 10026 56942
20432 56942 56602 -4737 -25999 409 24707 28028 2013 -21589 -2838 -12616 -42861 -68072
20420 -68072 -15016 -12941 -20478 -70300 -90721 -68777 6682 -28316 -41386 -9010 10498 -36612
20408 -36612 -64129 -42428 -46351 -37778 24840 44252 18704 -956 2343 -5616 -94460 -99222 -88979
20395 -88979 -81987 -35008 -14980 19775 60453 42591 -5161 4305 30349 113288 78606 60574
20383 60574 50050 44865 56947 39168 10528 23644 -6092 7010 1503 -304 18436 22300
20371 22300 9527 7215 -8680 -40916 22674 49621 -4911 -21377 -26731 -45079 -38679 -9477
20359 -9477 -1964 -27507 -34425 8177 9701 20864 23751 -9567 -36121 -34613 25745 94884 82209
$$ packed form
20444B8077K2414M0870n981j4208J0231K0994j8874k4605p4245l236K8589M6916
20432E6942l40o1339k1262K6408K4298L321k6015k3602J8751r778l0245k5211
20420f8072N3056K075p537m9822k0421K1944P5459l4998j3070L2376J9508m7110
20408c6612k7517K1701l923Q573O2618J9412k5548j9660L299p959q8844m762J0243
20395h8979O992M6979K0028L4755M0678j7862m7752R466K6044Q2939l4682j8032
20383F0574j0524n185J2082j7779k8640J3116k9736J3102n507j807J8740L864
20371B2300j2773k312j5895l2236O3590K6947n4532j6466n354j8348O400K9202
20359i477P513k5543o918M2602J524J1163K887l3318k6554J508O0358O9139j2675
$$ plain form
20346 82209 40367 20352 -35725 -99742 -135005 -74417 37771 55428 41319 -987 -10922 25971
20334 25971 66988 68621 48845 -4727 -35370 -45028 9715 50868 93307 95696 64636 44377
20322 44377 28401 18621 109759 136743 97518 37378 16279 -191 -33347 8425 40748 51637
20310 51637 -23063 -57000 -19175 -25360 -43473 -20557 -34079 5292 51059 36993 -41961 -100392
20298 -100392 -135805 -131120 -110445 -50287 -13563 2129 17506 -24196 -47953 25746 34422 24653
20286 24653 21145 31533 40961 31885 -5244 53658 25774 -847 -24850 -2728 -15767 -28200
20274 -28200 -30863 -6835 11224 21136 -5012 -55618 -140318 -118055 -88698 -42907 -23927 -40068
20262 -40068 -862 20131 41646 85897 85204 58942 17319 29380 5647 -5603 -10489 -4402
$$ packed form
20346H2209m1842k0015n6077o4017l5263O0588J12188J7657j4109m2306r935L6893
20334B5971M1017J633j9776n3572l0643r658N4743M1153M2439K389l1060k0259
20322D4377j5976r780R1138K6984l9225o0140k1099j6470l3156M1772L2323J0889
20310E1637p4700l3937L7825o185j8113K2916j3522L9371M5767j4066p8954n8431
20298a00392l5413M685K0675O0158L6724J5692J5377m1702k3757P3699Q676r769
20286B4653l508J0388R428r076l7129N8902k7884k6621k4003K2122j3039j2433
20274b8200k663K4028J8059R912k6148n0606q4700K2263K9357M5791J8980j6141
20262d0068L9206K0993K1515M4251o93k6262m1623J2061k3733j1250m886O087
$$ plain form
20250 -4402 49308 92930 1952 -56138 -61821 -61148 -87270 -70399 -67025 15464 69655 73322 95638
20237 95638 109184 81259 21918 -5596 -8631 29810 10026 20298 16316 17176 45103 28762
20225 28762 -23972 -5063 24819 60344 62504 30855 10440 2643 15875 39624 -17123 -51750
20213 -51750 -55025 -47930 16439 26263 45965 21057 -12622 -30652 -13226 -29917 -68335 -34034
20201 -34034 47561 16989 70202 110424 111841 84094 65599 82466 77881 45175 13152 17251
20189 17251 53049 34925 -23363 -31470 -20010 12941 8784 12689 -67495 -34813 32442 17883
20177 17883 54788 96766 36298 -38281 -94174 -34091 26511 40446 4784 -22191 -54156 -57732
20165 -57732 -53324 41261 60888 61959 47204 56752 48832 35399 4815 -45685 -40876 -27129 -17412
$$ packed form
20250d402N3710M3622r0978n8090n683O73k6122J6871L374Q2489N4191L667K2316
20237I5638J3546k7925n9341k7514l035L8441j9784J0272l982Q60K7927j6341
20225B8762n2734J8909K9882L5525K160l1649k0415p797J3232K3749n6747l4627
20213e1750l275P095O4369R824J9702k4908l3679j8030J7426j6691l8418L4301
20201c4034Q1595l0572N3213M0222J417k7747j8495J6867m585l2706l2023M099
20189A7251L5798j8124n8288q107J1460L2951m157L905q0184L2682O7255j4559
20177A7883L6905M1978o0468p4579n5893O0083O0602J3935l5662k6975l1965l576
20165e7732M408R4585J9627J071j4755R548p920j3433l0584n0500M809J3747R717
$$ plain form
20152 -17412 -60329 -73933 -59514 -7194 15053 -8506 23343 22923 29979 37642 95862 120888
20140 120888 101407 76832 30382 -10427 8872 44399 57365 51492 38636 22905 66053 71205
20128 71205 25646 -10586 29115 77473 54748 53560 41626 25648 27028 5797 3569 19493
20116 19493 16683 2644 -16371 -7399 12654 19427 17288 -29265 -44363 -16754 52849 34380
20104 34380 12065 -30930 -68127 -52842 -11909 328 -18657 -33750 16040 42565 59276 57571
20092 57571 70943 79736 54881 55677 37044 50377 33639 81699 39480 -11462 -17577 19914
20080 19914 39646 106149 97600 117188 109449 66585 51839 41758 62097 105882 95271 100852
20068 100852 106743 82662 106795 104739 115665 98417 96138 99807 81925 88834 37101 -24347
$$ packed form
20152a7412m2917j3604J4419N2320K2247k3559L1849m20P056P663N8220K5026
20140A20888j9481k4575m6450m0809J9299L5527J2966n873j2856j5731M3148N152
20128G1205m5559l6232L9701M8358k2725j188j1934j5978J380k1231k228J5924
20116A9493k810j4039j9015Q972K0053O773k139m6553j5098K7609O9603j8469
20104C4380k2315m2995l7197J5285M0933J2237j8985j5093M9790K6525J6711j705
20092E7571J3372Q793k4855P96j8633J3333j6738M8060m2219n0942o115L7491
20080A9914J9732O6503q549J9588p739m2864j4746j0081K0339M3785j0611N581
20068A00852N891k4081K4133k056J0926j7248k279L669j7882O909n1733o1448
$$ plain form
20056 -24347 -8368 40168 48899 47786 61129 23165 5500 13214 -10196 -3707 29202 48542
20044 48542 19532 27134 34812 64363 47945 35637 37053 15295 -13147 -19864 9050 -16525
20032 -16525 -10169 -20243 33930 34840 28009 35137 -13360 -6774 -16616 -553 3046 -24103 3918
20019 3918 37691 64367 53280 47301 70687 36531 34695 -34402 -82642 -54797 -8250 11733
20007 11733 2978 -34375 -10484 34346 53901 34860 20475 64511 55174 -10281 -38701 -9604
19995 -9604 10794 11684 15851 -45471 -81214 -23673 83022 103061 47719 67105 93031 85426
19983 85426 55848 1592 2237 1644 14481 11850 -28935 -35237 -35170 -33327 -33466 -57968 -16875 34870
19969 34870 60757 57324 26982 50800 82875 29679 4664 18965 60816 58388 64678 74483
$$ packed form
20056b4347J5979M8536Q731j113J3343l7964j7665P714k3410O489L2909J9340
20044D8542k9010P602P678K9551j6418j2308J416k1758k8442o717K8914k5575
20032a6525O356j0074N4173R10o831P128m8497O586r842J6063L599k7149K8021
20019C918L3773K6676j1087n979K3386l4156j836o9097m8240K7845M6547J9983
20007A1733q755l7353K3891M4830J9555j9041j4385M4036r337o5455k8420K9097
19995i604K0398Q90M167o1322l5743N7541J06695K0039n5342J9386K5926p605
19983H5426k9578n4256O45n93J2837k631m0785o302O7J843j39k4502M1093N1745
19969C4870K5887l433l0342K3818L2075n3196k5015J4301M1851k428O290R805
$$ plain form
19957 74483 93108 82868 26512 55445 9974 -62761 -69537 -37970 -25293 11625 43483 4711
19945 4711 -27973 -40541 -1531 28252 53132 46232 57672 12959 21079 29128 46656 71858
19933 71858 2774 -3767 -4552 -52105 -1165 51811 57974 22300 23736 7873 -10101 -23556 -15540
19920 -15540 40953 64148 81133 100962 116138 69098 50334 59205 22342 24034 15814 -4921
19908 -4921 -42826 1139 16094 516 -11252 -6669 5073 46489 111113 103566 76073 98165
19896 98165 41138 -14078 -47884 19780 98056 129726 117808 44508 -22944 -61273 -49615 4891
19884 4891 59725 80976 110050 116082 101984 70130 60654 55667 22191 -18079 -13053 42611 99674
19871 99674 82594 39492 -25564 -48312 201 16198 29646 102547 117700 73195 -977 -59488
$$ packed form
19957G4483J8625j0240n6356K8933m5471p2735o776L1567J2677L6918L1858l8772
19945D711l2684j2568L9010K9783K4880o900J1440m4713Q120Q049J7528K5202
19933G1858o9084o541p85m7553N0940N2976O163l5674J436j5863j7974j3455Q016
19920a5540N6493K3195J6985J9829J5176m7040j8764Q871l6863J692q220k0735
19908d921l7905M3965J4955j5578j1768M583J1742M1416O4624p547k7493K2092
19896I8165n7027n5216l3806O7664P8276L1670j1918p3300o7452l8329J1658N4506
19884D891N4834K1251K9074O032j4098l1854r476m987l3476m0270N026N5664N7063
19871I9674j7080m3102o5056k2748M8513J5997J3448P2901J5153m4505p4172n8511
$$ plain form
19859 -59488 -82415 -27334 -8983 -25290 -31525 -1370 -11619 3379 13194 379 37268 61078
19847 61078 54267 29410 17244 -6725 -24033 22497 89521 94816 51543 11825 57261 107186
19835 107186 88595 51471 123017 122793 100194 42560 27020 38035 56498 55538 42893 62970
19823 62970 80190 75763 77366 3254 37350 70237 5772 -61691 -63164 -25278 23619 3501
19811 3501 26787 11812 22160 86176 112977 36462 56394 70407 -25938 -33432 5287 82221
19799 82221 103482 43213 36586 109986 104578 40388 10341 -18384 -32592 -8679 32901 71161
19787 71161 98723 36805 -7611 -4798 30334 26964 -32671 -90587 -87312 -78313 -64888 -20251
19775 -20251 56599 49586 53440 113735 118104 110605 96471 86306 47937 -3506 -2968 50580 88294
$$ packed form
19859e9488k2927N5081J8351j6307o235L0155j0249J4998R815j2815L6889K3810
19847F1078o811k4857j2166k3969j7308M6530O7024N295m3273l9718M5436M9925
19835A07186j8591l7124P1546k24k2599n7634j5540J1015J8463r60j2645K0077
19823F2970J7220m427J603p4112L4096L2887o4465o7463j473L7886M8897k0118
19811C501K3286j4975J0348O4016K6801p6515J9932J4013r6345p494L8719P6934
19799H2221K1261o0269o627P3400n408o4190l0047k8725j4208K3913M1580L8260
19787G1161K7562o1918m4416K813L5132l370n9635n7916L275Q999J3425M4637
19775b0251P6850p013L854O0295M369p499j4134j0165l8369n1443N38N3548L7714
$$ plain form
19762 88294 44897 -19216 -35418 4443 7962 -20829 -56845 -36299 -548 -1619 -18193 -11784
19750 -11784 21589 -111 -50919 -38033 -4089 -619 17972 30261 10030 54178 47521 -27071
19738 -27071 10824 58121 36880 44560 36280 46862 76986 77683 60147 60770 57456 92294 109645
19725 109645 64830 81647 143657 211348 143753 28938 3867 12054 24767 38635 48418 41115
19713 41115 7283 -12184 -79864 -71332 -27618 36916 80550 117672 90697 42294 -13907 -13575
19701 -13575 68365 106213 74867 18446 -76508 -102574 -33936 25368 77061 66291 51169 35661
19689 35661 23385 40574 81295 83413 77925 89720 116179 141337 106345 69924 119288 103698
19677 103698 94491 86547 73908 72749 43487 -18949 9931 5293 25309 25464 133208 139593 111417
$$ packed form
19762H8294m3397o4113j6202L9861L519k8791l6016K0546L5751j071j6574O409
19750a1784L3373k1700n0808J2886L3944L470J8591J2289k0231M4148o657p4592
19738b7071L7895M7297k1241P680q280J0582L0124O97j7536O23l314L4838J7351
19725A09645m4815J6817O2010O7691o7595j14815k5071Q187J2713J3868R783p303
19713D1115l3832j9467o7680Q532M3714O4534M3634L7122k6975m8403n6201L32
19701a3575Q1940L7848l1346n6421r4954k6066O8638N9304N1693j0770j5122j5508
19689C5661j2276J7189M0721K118n488J1795K6459K5158l4992l6421M9364j5590
19677A03698r207p944j2639j159k9262o2436K8880m638K0016J55J07744O385k8176
$$ plain form
19664 111417 122945 86646 32005 26739 63529 105722 104335 100173 84846 34414 -21158 2511
19652 2511 48795 45089 18991 37725 51841 31396 68663 117664 114864 62799 62498 67861 110225
19639 110225 104661 72423 82728 127186 157688 120422 56243 37936 34310 58532 67778 1809
19627 1809 -39564 -50083 21386 -3664 -24247 -7420 29945 75773 68630 144561 163415 95252
19615 95252 102095 63895 32637 1612 9426 12765 -65682 -69354 -19912 -8467 -16267 4160 66480
19602 66480 54100 36961 27489 39005 76629 106269 89569 53649 17357 -3950 -23126 10962
19590 10962 -24588 -40150 -4064 51184 59484 -16030 3004 20151 85506 94932 92471 137846
19578 137846 128734 65962 6610 44523 38246 -5459 34942 20599 9618 38108 57961 79914
$$ packed form
19664A11417J1528l6299n4641n266L6790M2193j387m162j5327n0432n5572K3669
19652B511M6284l706k6098J8734J4116k0445L7267M9001k800n2065l01N363M2364
19639A10225n564l2238J0305M4458L0502l7266o4179j8307l626K4222R246o5969
19627A809m1373j0519P1469k5050k0583J6827L7365M5828p143P5931J8854o8163
19615I5252O843l8200l1258l1025P814L339p8447l672M9442J1445p800K0427O2320
19602F6480j2380j7139r472J1516L7624K9640j6700l5920l6292k1307j9176L4088
19590A0962l5550j5562L6086N5248Q300p5514J9034J7147O5355R426k461M5375
19578A37846r112o2772n9352L7913o277m3705M0401j4343j0981K8490J9853K1953
$$ plain form
19566 79914 42509 41453 73917 83963 57995 12194 -13322 46026 22908 57612 106543 136847
19554 136847 133116 98934 63316 20660 31994 72793 86140 94331 106301 81204 63690 49944
19542 49944 81308 83170 98797 50491 102 37946 28213 61201 41426 35087 58962 70903
19530 70903 118550 139571 81954 27883 43463 -40692 -34458 -10674 42605 58356 42673 -694
19518 -694 -23375 -5896 3212 -26314 -29748 -17382 12160 37130 55302 69267 76305 98118 125359
19505 125359 89778 46414 80768 90035 68443 48996 15266 -53354 -21582 16599 56773 69318
19493 69318 78176 122387 124638 133461 187334 129896 109807 134016 91153 76803 38304 31888
19481 31888 67089 94995 66062 43659 46651 62237 81319 133871 115177 110656 198790 199179
$$ packed form
19566G9914l7405j056L2464J0046k5968m5801k5516N9348k3118L4704M8931L0304
19554A36847l731l4182l5618m2656J1334M0799J3347Q191J1970k5097j7514j3746
19542D9944L1364J862J5627m8306n0389L7844r733L2988j9775o339K3875J1941
19530G0903M7647K1021n7617n4071J5580q4155O234K3784N3279J5751j5683m3367
19518f94k2681J7479R108k9526l434J2366K9542K4970J8172J3965P038K1813K7241
19505A25359l5581m3364L4354R267k1592j9447l3730o8620L1772L8181M0174J2545
19493F9318Q858M4211K251Q823N3873n7438k0089K4209m2863j4350l8499o416
19481C1888L5201K7906k8933k2403K992J5586J9082N2552j8694m521Q8134L89
$$ plain form
19469 199179 162069 204457 170452 96709 47260 14964 6994 40023 34150 47198 83508 54231
19457 54231 61632 50424 109027 97729 84701 125569 122645 106382 81077 91926 162587 104938
19445 104938 56290 111859 111341 147882 149844 96868 64763 61898 32884 5426 50302 107037
19433 107037 103949 26459 -6463 -5858 19339 64472 105374 118893 144930 135458 95037 80473
19421 80473 77341 147550 118528 30939 28519 24538 44508 45586 73361 86906 110100 149466
19409 149466 153000 78787 12423 45827 75361 49298 -9814 28402 113638 111846 106131 101342
19397 101342 123091 124804 88548 125894 120915 90371 73637 113199 83113 61201 35831 71563
19385 71563 76315 68138 57196 -18310 13067 34625 48841 63716 107175 154095 119107 77436
$$ packed form
19469A99179l7110M2388l4005p3743m9449l2296p970L3029n873J3048L6310k9277
19457E4231P401j1208N8603j1298j3028M0868k924j6263k5305J0849P0661n7649
19445A04938m8648N5569n18L6541J962n2976l2105k865k9014k7458M4876N6735
19433A07037l088p7490l2922O05K5197M5133M0902J3519K6037r472m0421j4564
19421H0473l132P0209k9022q7589k420l981J9970J078K7775J3545K3194L9366
19409A49466L534p4213o6364L3404K9534k6063n9112L8216Q5236j792n715m789
19397A01342K1749J713l6256L7346m979l0544j6734L9562l0086k1912k5370L5732
19385G1563M752q177j0942p5506L1377K1558J4216J4875M3459M6920l4988m1671
$$ plain form
19373 77436 72852 75614 91354 87137 52942 41091 80869 142640 126364 84107 84793 79687 35767
19360 35767 -22265 4403 -7973 66757 78520 81277 120991 95598 46872 40119 30963 53283
19348 53283 49251 50168 62861 53943 61042 79831 98306 92415 75411 82323 93494 97800 100394
19335 100394 100571 117286 40494 47302 65913 97335 132269 124539 50142 81900 110519 32861
19323 32861 10982 32421 112581 124467 95192 79593 30515 44888 57624 110906 201075 195139
19311 195139 151465 223905 216056 183978 148492 118191 60751 64757 138193 171846 163246 127032
19299 127032 98760 101990 121398 163007 161548 92793 42913 73279 142127 180455 142041 115881
19287 115881 97618 105941 94004 120667 116091 96413 87618 88565 116464 69781 57905 90296
$$ packed form
19373G7436m584K762J5740m217l4195j1851L9778O1771j6276m2257O86n106m3920
19360C5767n8032K6668j2376P4730J1763K757L9714k5393m8726o753r156K2320
19348E3283m032R17J2693q918P099J8789J8475n891j7004O912J1171M306K594
19335A00394J77J6715p6792O808J8611L1422L4934p730p4397L1758K8619p7658
19323C2861k1879K1439Q0160J1886k9275j5599m9078J4373J2736N3282R0169n936
19311A95139m3674P2440p849l2078l5486l0301n7440M006P3436L3653q600l6214
19299A27032k8272L230J9408M1609j459o8755m9880L0366O8848L8328l8414k6160
19287A15881j8263Q323j1937K6663m576j9678q795R47K7899m6683j1876L2391
$$ plain form
19275 90296 163268 219962 248202 217785 159706 96314 24519 1094 75857 147682 120172 120038
19263 120038 150945 185048 178236 122407 89243 111974 157596 198067 131531 137297 133979 123699
19251 123699 143033 166809 132567 100072 160637 178903 162739 143988 131806 117401 150519
19240 150519 159762 143762 117038 162755 222528 289171 357240 400415 357033 278697 244854 204818
19228 204818 192868 215089 244866 290803 255941 263386 346146 322287 240522 216433 162079 162324
19216 162324 147086 172888 153156 119951 147207 173850 196501 221022 202772 114863 88975
19205 88975 99633 73130 65832 89833 145071 156307 172347 137468 144175 198437 197861 160360
19193 160360 97045 154228 191024 215191 275896 311172 313468 356186 419126 437155 395672 327231
$$ packed form
19275I0296P2972N6694K8240l0417n8079o3392p1795k3425P4763P1825k7510j34
19263A20038L0907L4103o812n5829l3164K2731M5622M0471o6536N766l318j0280
19251A23699J9334K3776l4242l2495O0565J8266j6164j8751j2182j4405L3118
19240A50519R243j6000k6724M5717N9773O6643O8069M3175m3382p8336l3843m0036
19228B04818j1950K2221K9777M5937l4862P445Q2760k3859q1765k4089n4354K45
19216A62324j5238K5802j9732l3205K7256K6643K2651K4521j8250q7909k5888
19205H8975J0658k6503p298K4001N5238J1236J6040l4879O707N4262n76l7501
19193A60360o3315N7183L6796K4167O0705L5276K296M2718O2940J8029m1483o8441
$$ plain form
19181 327231 251119 212133 259585 272252 281257 289025 303507 243493 287963 340141 278451 214732
19169 214732 208737 224367 249604 218014 227050 249271 251175 201335 133007 84175 64996 62493
19157 62493 78420 117259 126611 95662 70108 82769 80922 61829 91036 111262 97165 82521
19145 82521 127016 179926 192407 153586 71670 74641 112729 77138 66616 108109 143266 150926
19133 150926 172638 192717 205399 206743 179823 146449 127908 86215 21810 19497 17528 63575
19121 63575 121015 124343 120391 165413 129975 155117 214389 183124 173919 144729 139021 175397
19109 175397 154545 121533 161686 237508 221463 187066 187339 200288 184564 168690 182207 206209
19097 206209 155251 128132 178947 224940 244750 278456 277342 280075 237935 153964 137728 130365
$$ packed form
19181C27231p6112l8986M7452J2667R005P768J4482o0014M4470N2178o1690o3719
19169B14732n995J5630K5237l1590R036K2221J904m9840o8328m8832j9179k503
19157F2493J5927L8839R352l0949k5554J2661j847j9093K9207K0226j4097j4644
19145H2521M4495N2910J2481l8821q1916K971L8088l5591j0522M1493L5157P660
19133A50926K1712K0079J2682J344k6920l3374j8541m1693o4405k313j969M6047
19121F3575N7440L328l952M5022l5438K5142N9272l1265r205k9190n708L6376
19109A75397k0852l3012M0153P5822j6045l4397K73J2949j5724j5874J3517K4002
19097B06209n0958k7119N0815M5993J9810L3706j114K733m2140q3971j6236p363
$$ plain form
19085 130365 142074 227061 257606 324100 400734 498004 548641 599823 531907 394066 329759
19074 329759 300138 276928 229232 164468 134660 108110 165137 250008 248346 278271 270808 220490
19062 220490 162396 140049 153028 235386 294512 306387 239020 160277 160098 148200 172717 180978
19050 180978 178280 199042 200549 202601 193188 181428 168886 194634 201031 214150 171056 91972
19038 91972 111981 129971 162629 233473 281868 277805 276559 326903 392765 472829 523025 569465
19026 569465 603218 592450 526569 381219 293412 288268 257228 218391 208027 180418 206337
19015 206337 197688 128152 119772 159665 198658 146834 173897 163964 163534 165335 153184 97150 117113
19002 117113 189843 207750 215297 230661 222855 210441 235038 226700 213027 198775 196997 204060
$$ packed form
19085A30365J1709Q4987L0545O6494P6634R7270N0637N1182o7916j37841o4307
19074C29759k9621k3210m7696o4764k9808k6550N7027Q4871j662K9925p463n0318
19062B20490n8094k2347J2979Q2358N9126J1875o7367p8743j79j1898K4517Q261
19050A80978k698K0762J507K052r413j1760j2542K5748O397J3119m3094p9084
19038I1972K0009J7990L2658P0844M8395m063j246N0344O5862Q0064N0196M6440
19026E69465L3753j0768o5881j45350q7807n144l1040l8837j0364k7609K5919
19015B06337q649o9536q380L9893L8993n1824K7063r933m30J801j2151n6034J9963
19002A17113P2730J7907P547J5364p806j2414K4597q338j3673j4252j778P063
$$ plain form
18990 204060 284517 331592 245617 198720 204220 247281 255197 251127 247690 239512 256833 226438
18978 226438 252781 259485 267443 234276 235002 254839 243886 272172 330716 342916 360450 449009
18966 449009 547395 610627 738726 832662 928377 1027618 1096048 1132914 1107026 1110917 1125825
18955 1125825 1064738 1001946 975557 1003693 1040637 1109699 1186741 1242796 1175003 1109286 1010639
18944 1010639 900842 796946 661666 556907 460263 457552 456442 382880 354223 278179 207511
18933 207511 175495 253903 290197 276699 274407 232648 230104 265634 291309 309110 325816 373542
18921 373542 371339 389136 477916 602147 709517 861680 1029910 1112483 1174972 1225587 1250225
18910 1250225 1225666 1226628 1208140 1117369 1142977 1183744 1249576 1306262 1349196 1362022 1324161 1212708
$$ packed form
18990B04060Q0457M7075q5975m6897N500M3061P916m070l437q178J7321l0395
18978B26438K6343O704P958l3167P26J9837j0953K8286N8544J2200J7534Q8559
18966D49009R8386O3232J28099R3936R5715R9241O8430L6866k5888L891J4908
18955A125825o1087o2792k6389K8136L6944O9062P7042N6055o7793o5717r8647
18944A010639j09797j03896j35280j04759r6644k711j110p3562k8657p6044p0668
18933B07511l2016P8408L6294j3498k292m1759k544L5530K5675J7801J6706M7726
18921C73542k203J7797Q8780J24231J07370J52163J68230Q2573O2489N0615K4638
18910A250225k4559R62j8488r0771K5608M0767O5832N6686M2934J2826l7861j11453
$$ plain form
18898 1212708 1082937 919332 694573 521549 428677 442012 445949 417042 360229 344525 326073
18887 326073 303818 294679 299661 286513 252109 283486 250482 260319 254250 228609 220099 238570
18875 238570 245193 257625 262021 266518 305554 315195 314673 287886 236780 297506 343301 363972 349977
18862 349977 339990 300094 261780 268025 275151 302941 257555 237085 239660 205716 223428 245278
18850 245278 309565 389602 402787 390157 343803 326456 341235 335555 320138 331053 357603 372610
18838 372610 318016 288527 312217 290927 307949 324969 357294 385313 392238 418723 434169 460394
18826 460394 431546 416649 390175 373388 435445 403772 341179 346031 330690 378917 401410 374380
18814 374380 391271 418305 481191 478060 449025 459221 508808 533312 561507 615554 611778 660269
$$ packed form
18898A212708j29771j63605k24759j73024r2872J3335L937k8907n6813j5704j8452
18887C26073k2255r139M982j3148l4404L1377l3004R837o069k5641q510J8471
18875B38570O623J2432M396M497L9036R641n22k6787n1106O0726M5795K0671j3995
18862C49977r987l9896l8314O245P126K7790m5386k0470K575l3944J7712K1850
18850B45278O4287Q0037J3185j2630m6354j7347J4779n680j5417J0915K6550J5007
18838C72610n4594k9489K3690k1290J7022J7020L2325K8019O925K6485J5446K6225
18826D60394k8848j4897k6474j6787O2057l1673o2593M852j5341M8227K2493k7030
18814C74380J6891K7034O2886l131k9035J0196M9587K4504K8195N4047l776M8491
$$ plain form
18802 660269 638573 639919 736208 803824 887713 1046111 1187267 1219274 1118511 1030675 991138
18791 991138 996252 982452 975700 1067230 1184514 1460375 1653114 1651171 1544576 1323054 1099255
18780 1099255 968990 872746 834061 927787 1002049 1020444 1009837 916481 800929 664270 601204
18769 601204 639201 628346 616356 660332 766837 929209 983487 996343 973508 873586 774842
18758 774842 759458 779035 780119 832780 958757 1085441 1233955 1434765 1627722 1694269 1693314
18747 1693314 1598360 1539635 1496974 1473067 1686175 1964710 2298464 2717125 2996286 2937107
18737 2937107 2716397 2347660 2039406 1860332 1671773 1606330 1697111 1844807 1919147 1958565
18727 1958565 1845073 1592753 1295158 1148792 1111012 1059909 970373 843392 708345 589702
$$ packed form
18802F60269k1696J346R6289O7616Q3889J58398J41156L2007j00763q7836l9537
18791I91138N114j3800o752R1530J17284K75861J92739j943j06595k21522k23799
18780A099255j30265r6244l8685R3726P4262J8395j0607r3356j15552j36659o3066
18769F01204L7997j0855j1990M3976J06505J62372N4278J2856k2835r9922r8744
18758G74842j5384J9577J084N2661J25977J26684J48514K00810J92957O6547r55
18747A693314r4954n8725m2661k3907K13108K78535L33754M18661K79161n9179
18737B937107k20710l68737l08254j79074j88559o5443R0781J47696P4340L9418
18727A958565j13492k52320k97595j46366l7780n1103q9536j26981j35047j18643
$$ plain form
18717 589702 616276 667786 692643 689211 704348 694693 693127 676595 717775 722262 772917 892650
18705 892650 944779 942054 976034 942214 910281 895058 871232 939768 1102559 1270992 1502575
18694 1502575 1724494 1904141 1904096 1802286 1676844 1464266 1368543 1329676 1306697 1341303 1466503
18683 1466503 1562720 1535698 1445860 1261541 1122482 1076677 1008369 995575 1009345 993818 1003139
18672 1003139 986105 975846 930086 834585 792162 775472 815321 855323 970100 1045169 1143682
18661 1143682 1226412 1196693 1148848 1088204 996281 933992 860540 824725 908145 1005915 1116615
18650 1116615 1240865 1275877 1280427 1317180 1188868 1046021 960432 896073 800439 758638 733257
18639 733257 692949 709113 707560 739217 711967 695985 740660 711026 671282 677524 745432 794793
$$ packed form
18717E89702K6574N1510K4857l432J5137r655j566j6532M1180M487N0655J19733
18705H92650N2129k725L3980l3820l1933j5223k3826O8536J62791J68433K31583
18694A502575K21919J79647m5j01810j25442k12578r5723l8867k2979L4606J25200
18683A466503R6217k7022q9838j84319j39059m5805o8308j2794J3770j5527R321
18672A003139j7034j0259m5760r5501m2423j6690L9849M0002J14777P5069R8513
18661A143682Q2730k9719m7845o0644r1923o2289p3452l5815Q3420R7770J10700
18650A116615J24250L5012M550L6753j28312j42847q5589o4359r5634m1801k5381
18639G33257m0308J6164j553L1657k7250j5982M4675k9634l9744O242O7908M9361
$$ plain form
18627 794793 807132 799417 779380 769679 827606 830963 865502 883369 965263 1072390 1175484 1288778
18615 1288778 1396171 1504024 1612225 1659656 1684211 1747213 1774933 1755654 1668165 1626004 1685446
18604 1685446 1762302 1798184 1873796 1908036 1861711 1791815 1707585 1657041 1583157 1532139 1408641
18593 1408641 1288271 1163528 1099547 1100057 1054810 1051840 1058250 1057816 1058021 1040089 983757 945817
18581 945817 919636 885244 872451 910984 895181 904828 1009860 1092398 1118703 1171760 1256961
18570 1256961 1242742 1251779 1298231 1302565 1321664 1370745 1460017 1469650 1536884 1610251 1638402 1667852
18558 1667852 1613298 1557773 1516961 1525153 1647801 1767442 1879020 1914766 1873419 1766902 1663693
18547 1663693 1602407 1546946 1492106 1515308 1527896 1546127 1519114 1521588 1507105 1525667 1494834
$$ packed form
18627G94793J2339p715k0037r701N7927L357L4539J7867Q1894J07127J03094J13294
18615A288778J07393J07853J08201M7431K4555O3002K7720j9279q7489m2161N9442
18604A685446P6856L5882P5612L4240m6325o9896q4230n0544p3884n1018j23498
18593A408641j20370j24743o3981N10m5247k970O410m34K05j7932n6332l7940
18581I45817k6181l4392j2793L8533j5803R647J05032Q2538K6305N3057Q5201
18570A256961j4219R037M6452M334J9099M9081Q9272R633O7234P3367K8151K9450
18558A667852n4554n5525m0812Q192J22648J19641J11578L5746m1347j06517j03209
18547A663693o1286n5461n4840K3202J2588J8231k7013K474j4483J8562l0833
$$ plain form
18536 1494834 1422805 1335921 1292691 1284272 1284757 1322698 1370472 1389080 1424955 1474644 1553387 1656841
18524 1656841 1673941 1717698 1744085 1709912 1661304 1669758 1700234 1713345 1731465 1767046 1851104
18513 1851104 1895089 1919021 1952203 1900023 1857416 1838097 1903464 2000644 2073799 2103421 2126009
18502 2126009 2218859 2373319 2499585 2620238 2796083 3033003 3270926 3519631 3739258 4070057
18492 4070057 4419176 4781720 5080780 5301369 5431599 5601612 5755377 5955468 6201551
18483 6201551 6406596 6734161 7104596 7483093 7998440 8619937 9212800 9837822 10562225
18474 10562225 11467258 12725534 14431145 16950334 20790623 27097431 37426205 52008958
18466 52008958 68670114 87797382 109404908 130372141 147312300 160557194 168464944
$$ packed form
18536A494834p2029q6884m3230q419M85L7941M7774J8608L5875M9689P8743J03454
18524A656841J7100M3757K6387l4173m8608Q454L0476J3111J8120L5581Q4058
18513A851104M3985K3932L3182n2180m2607j9319O5367R7180P3155K9622K2588
18502B126009R2850J54460J26266J20653J75845K36920K37923K48705K19627L30799
18492D070057L49119L62544K99060K20589J30230J70013J53765K00091K46083
18483F201551K05045L27565L70435L78497N15347O21497N92863O25022P24403
18474A0562225R05033J258276J705611K519189L840289O306808J0328774J4582753
18466E2008958J6661156J9127268K1607526K0967233J6940159J3244894P907750
$$ plain form
18459 168464944 166180262 159705164 152369010 146206124 142412657 141451393 146176798 155730606
18451 155730606 166497362 174327206 181003132 182100979 172789313 159352611 141864450
18444 141864450 120389105 98954418 80923595 65225194 51308840 41266413 34644513
18437 34644513 30100105 26961744 24879435 23575255 22794684 22239955 21864119 21601080 21441599
18428 21441599 21450223 21777827 22553808 24082231 26725185 30990611 38056171 49824882 67084869
18419 67084869 87658106 110698788 135896461 161066747 183027478 199897772 208941397
18412 208941397 205574145 196416838 185687752 177212585 172705877 171570663 175876580 185956719
18404 185956719 199031916 209779556 217875276 217995375 205219987 186948130 164003496
$$ packed form
18459A68464944k284682o475098p336154o162886l793467r61264M725405R553808
18451A55730606J0766756P829844O675926J097847r311666j3436702j7488161
18444A41864450k1475345k1434687j8030823j5698401j3916354j0042427o621900
18437C4644513m544408l138361k082309j304180p80571n54729l75836k63039j59481
18428B1441599Q624L27604P75981J528423K642954M265426P065560J1768711J7259987
18419F7084869K0573237K3040682K5197673K5170286K1960731J6870294R043625
18412B08941397l367252r157307j0729086q475167m506708j135214M305917J0080139
18404A85956719J3075197J0747640Q095720J20099j2775388j8271857k2944634
$$ plain form
18397 164003496 137600665 111228504 88199924 68077314 51434771 40177879 32939814
18390 32939814 28021589 24521068 21891694 19837737 18187575 16679448 15285323 14043422
18382 14043422 12916284 11973388 11227330 10648299 10137269 9693121 9338407 8923890 8548611
18373 8548611 8218283 7869839 7449044 7039350 6538824 6114300 5790089 5537973 5246966
18364 5246966 5045268 4880247 4760688 4686128 4686569 4601563 4480953 4467304 4483473 4462823 4423391
18353 4423391 4357962 4200873 4031666 4056297 4176182 4405560 4626680 4693714 4617733 4386177
18343 4386177 4141079 3998225 3935951 3989619 4083483 4139747 4145516 4027174 3900484 3781529
18333 3781529 3665876 3562461 3477650 3488830 3585863 3670288 3778083 3887652 4102493 4400506
$$ packed form
18397A64003496k6402831k6372161k3028580k0122610j6642543j1256892p238065
18390C2939814m918225l500521k629374k053957j650162j508127j394125j241901
18382A4043422j127138r42896p46058n79031n11030m44148l54714m14517l75279
18373H548611l30328l48444m20795m09694n00526m24524l24211k52116k91007
18364E246966k01698j65021j19559p4560M41q5006j20610j3649J6169k0650l9432
18353D423391o5429j57089j69207K4631J19885K29378K21120O7034p5981k31556
18343D386177k45098j42854o2274N3668R3864N6264N769j18342j26690j18955
18333C781529j15653j03415q4811J1180R7033Q4425J07795J09569K14841K98013
$$ plain form
18323 4400506 4808945 5298777 5677754 5951122 6120585 6198301 6341563 6424855 6442760 6639207
18313 6639207 6992426 7413137 7880185 8447049 9078149 9974307 11506327 14064148 18575938
18304 18575938 25989144 34190615 38742752 39370575 36432847 31305447 28164966 28015898
18296 28015898 30455342 35548234 44254796 59388723 85978205 126580440 168942046
18289 168942046 204688586 233625003 245586188 235069288 215287122 194301126 167698136
18282 167698136 141860838 120253438 97505551 77694339 68299706 69128159 79986225
18275 79986225 97205139 107746873 106374746 95017605 75118788 56841651 45796142
18268 45796142 40017096 37248061 36140993 35918825 35666996 35009586 34512880 34775065 36713276
$$ packed form
18323D400506M08439M89832L78977K73368J69463P7716J43262Q3292J7905J96447
18313F639207L53219M20711M67048N66864O31100Q96158J532020K557821M511790
18304A8575938P413206Q201471M552137O27823k937728n127400l140481j49068
18296B8015898K439444N092892Q706562J5133927K6589482M0602235M2361606
18289A68942046L5746540K8936417J1961185j0516900j9782166k0985996k6602990
18282A67698136k5837298k1607400k2747887j9811212r394633Q28453J0858066
18275G9986225J7218914J0541734j372127j1357141j9898817j8277137j1045509
18268D5796142n779046k769035j107068k22168k51829o57410m96706K62185J938211
$$ plain form
18259 36713276 41959715 50380470 57296813 59924880 59199207 55484185 53092062 55567471
18251 55567471 63918825 80252865 105518009 132167343 151202647 166174920 184270604
18244 184270604 221664554 287028251 361073459 420675683 443719664 435662937 411425763
18237 411425763 396055697 401045406 402670821 402904086 400232526 385761870 363146267 339524016
18229 339524016 303836911 252802783 204256687 158576106 120234450 95258933 81259234
18222 81259234 75324465 76647000 81688820 82689141 78497501 69773181 57617320 47987150
18214 47987150 42344810 39359094 38057792 37470487 37128940 36908650 36752244 37090441 38593100
18205 38593100 41900178 47959836 58377908 76121527 104507881 137493588 157475230
$$ packed form
18259C6713276N246439Q420755O916343K628067p25673l715022k392123K475409
18251E5567471Q351354J6334040K5265144K6649334J9035304J4972273J8095684
18244A84270604L7393950O5363697P4045208N9602224K3043981q056727k4237174
18237D11425763j5370066M989709J625415K33265k671560j4470656k2615603k3622251
18229C39524016l5687105n1034128m8546096m5680581l8341656k4975517j3999699
18222H1259234n934769J322535N041820J000321m191640q724320j2155861r630170
18214D7987150n642340k985716j301302n87305l41547k20290j56406L38197J502659
18205C8593100L307078O059658J0418072J7743619K8386354L2985707J9981642
$$ plain form
18198 157475230 160038754 148206939 127547196 115404212 122039849 147255362 178058490
18191 178058490 207634254 248032484 301865239 357791579 405688667 430875472 405427895
18184 405427895 341097677 265759061 189942766 132139750 97278909 76627376 63559162
18177 63559162 55048554 49745769 47350250 48504507 54503000 63646082 68551030 67381143
18169 67381143 61245561 50745979 42136982 37916653 36639413 37721972 41644098 49082885
18161 49082885 59758754 71925529 85527577 96075109 98575049 96269999 87542041
18154 87542041 74583334 63466118 55147391 51778548 55139381 63336970 74252795 86810645
18146 86810645 93604133 93284765 88231977 75623542 61045885 48357556 37372860 29589299
$$ packed form
18198A57475230K563524j1831815k0659743j2142984O635637K5215513L0803128
18191A78058490K9575764M0398230N3832755N5926340M7897088K5186805k5447577
18184D05427895o4330218p5338616p5816295n7803016l4860841k0651533j3068214
18177F3559162q510608n302785k395519J154257N998493R143082M904948j169887
18169F7381143o135582j0499582q608997m220329j277240J082559L922126P438787
18161D9082885J0675869J2166775J3602048J0547532K499940k305050q727958
18154H7542041j2958707j1117216q318727l368843L360833Q197589J0915825J2557850
18146H6810645O793488l19368n052788j2608435j4577657j2688329j0984696p783561
$$ plain form
18138 29589299 24630572 21411219 19088711 17368595 16184572 15390980 14921066 14626057
18130 14626057 14505149 14531990 14726800 15027908 15396687 15887337 16527508 17255202 18063817
18121 18063817 19182978 20830013 23487212 27560031 33917877 44123550 60452649 83261773
18113 83261773 110359542 142612663 173952252 195759326 211848198 220572527 222939604
18106 222939604 232289177 245967055 240715144 228283378 211417684 190470967 187398900
18099 187398900 193120577 198017931 200111638 194809147 181454828 162269298 140282916
18092 140282916 114570357 90227894 70678007 54714098 43160062 35620000 30491775
18085 30491775 26677066 23955377 21951757 20409673 19335474 18627187 18193658 17865921
$$ packed form
18138B9589299m958727l219353k322508j720116j184023p93592m69914k95009
18130A4626057j20908K6841J94810L01108L68779M90650O40171P27694Q08615
18121A8063817J119161J647035K657199M072819O357846J0205673J6329099K2809124
18113H3261773K7097769L2253121L1339589K1807074J6088872Q724329K367077
18106B22939604R349573J3677878n251911j2431766j6865694k0946717l072067
18099A87398900N721677M897354K093707n302491j3354319j9185530k1986382
18092A40282916k5712559k4342463j9549887j5963909j1554036p540062n128225
18085C0491775l814709k721689k003620j542084j074199p08287m33529l27737
$$ plain form
18077 17865921 17535114 17340688 17360869 17609862 18073242 18795205 19809044 20998640 22730713
18068 22730713 25302408 29265403 36002129 47506311 66315537 91479262 119901505
18061 119901505 150796461 172005457 177088924 171194291 150235856 123557931 101303778
18054 101303778 85166338 79598040 86241356 101289441 120746831 143006560 156530768
18047 156530768 156889972 148105060 126171707 99497143 75975759 55841249 41303948
18040 41303948 32115502 26176094 21992318 19044342 16891470 15284819 14083301 13092015
18032 13092015 12345311 11720117 11063202 10482005 9996437 9677018 9519176 9461468 9427230 9360079
18022 9360079 9251605 9061338 8816722 8445165 7985058 7426804 6996691 6677070 6429785
$$ packed form
18077A7865921l30807j94426K0181K48993M63380P21963J013839J189596J732073
18068B2730713K571695L962995O736726J1504182J8809226K5163725K8422243
18061A19901505L0894956K1208996N083467n894633k0958435k6677925k2254153
18054A01303778j6137440n568298O643316J5048085J9457390K2259729J3524208
18047A56530768L59204q784912k1933353k6674564k3521384k0134510j4537301
18040D1303948r188446n939408m183776k947976k152872j606651j201518r91286
18032A3092015p46704o25194o56915n81197m85568l19419j57842n7708l4238o7151
18022I360079j08474j90267k44616l71557m60107n58254m30113l19621k47285
$$ plain form
18013 6429785 6200478 5963812 5699881 5452251 5119430 4896928 4746610 4652502 4693904 4734619
18003 4734619 4769865 4807151 4788148 4802094 4849816 4902075 4912640 4972995 5016587 5141046 5359649
17992 5359649 5595478 6030777 6543929 6984139 7451162 7836971 8073499 8154376 8180046 8220334
17982 8220334 8347381 8655098 9253087 9980389 10610968 11271422 11957566 12797476 14002169
17973 14002169 15912958 18857304 23105066 29188501 38540958 53789796 77455385 108222014
17965 108222014 142413771 169413135 179980687 174975519 157348090 140373879 135729155
17958 135729155 146807762 170255394 194486608 203459348 193476113 165510464 128289945
17951 128289945 94508604 68490376 51588719 41361994 35094441 31053255 28365429
$$ packed form
18013F429785k29307k36666k63931k47630l32821k22502j50318r4108M1402M0715
18003D734619L5246L7286j9003J3946M7722N2259J0565O0355M3592J24459K18603
17992E359649K35829M35299N13152M40210M67023L85809K36528Q0877K5670M0288
17982H220334J27047L07717N97989P27302O30579O60454O86144Q39910J204693
17973A4002169J910789K944346M247762O083435R352457J5248838K3665589L0766629
17965A08222014L4191757K6999364J0567552n005168j7627429j6974211m644724
17958A35729155J1078607K3447632K4231214Q972740r983235k7965649l7220519
17951A28289945l3781341k6018228j6901657j0226725o267553m041186k687826
$$ plain form
17944 28365429 26520126 25485086 25088518 25093621 25157400 25332000 25676275 26652368 28651861
17935 28651861 32081852 37403826 45530261 58219516 78450860 103084178 119148542
17928 119148542 125225022 123628938 118329401 125223906 155003042 204590901 247110423
17921 247110423 271477301 287080707 294447523 312208665 343606972 370620980 376236906
17914 376236906 349522975 310975359 277514925 262737797 273618243 291960402 293602927
17907 293602927 273623153 231937280 180734261 135278217 100116659 76930457 62498644
17900 62498644 53291055 47205379 43047276 40129619 38077468 36737036 35981097 35828598
17892 35828598 36500516 37989088 40762102 45900532 55486422 72433309 92591907 104738003
$$ packed form
17944B8365429j845303j035040l96568N103O3779J74600L44275R76093J999493
17935B8651861L429991N321974Q126435J2689255K0231344K4633318J6064364
17928A19148542O076480j596084n299537O894505K9779136M9587859M2519522
17921B47110423K4366878J5603406P366816J7761142L1398307K7014008N615926
17914C76236906k6713931l8547616l3460434j4777128J0880446J8342159J642525
17907B93602927j9979774m1685873n1203019m5456044l5161558k3186202j4431813
17900F2498644r207589o085676m158103k917657k052151j340432p55939j52499
17892C5828598O71918J488572K773014N138430R585890J6946887K0158598J2146096
$$ plain form
17884 104738003 109346114 109057922 109019146 121360485 143508485 170293657 207139816 250446305
17876 250446305 291601690 320272505 326455791 317591482 301196178 280045143 259629776
17869 259629776 235093775 206697080 184886555 176272924 175897805 175265571 173781709 165380113
17861 165380113 148655663 129475308 106987331 83897973 64453902 49773086 40123480
17854 40123480 33973036 29908226 27191345 25346153 23911736 22683748 21533915 20549923
17846 20549923 19954176 19713381 19649502 19873631 20511666 21877120 24415282 29286496 38638018
17837 38638018 53816895 67529057 73081407 72853393 66989886 62878067 70623766 92722067
17829 92722067 117018905 125421328 119941907 101140272 76883698 64277938 65311262
$$ packed form
17884A04738003M608111k88192l8776J2341339K2148000K6785172L6846159M3306489
17876B50446305M1155385K8670815O183286q864309j6395304k1151035k0415367
17869B59629776k4536001k8396695k1810525q613631l75119o32234j483862q401596
17861A65380113j6724450j9180355k2487977k3089358j9444071j4680816r649606
17854D0123480o150444m064810k716881j845192j434417j227988j149833r83992
17846B0549923n95747k40795o3879K24129O38035J365454K538162M871214R351522
17837C8638018J5178877J3712162N552350k28014n863507m111819P745699K2098301
17829I2722067K4296838Q402423n479421j8801635k4256574j2605760J033324
$$ plain form
17822 65311262 72463948 74171424 69156339 57778321 41875509 29595323 22189836 17697263
17814 17697263 14831020 12902369 11590307 10633012 9801372 8973190 8257577 7643457 7260625
17805 7260625 7046472 6995468 6914684 6724415 6351269 5887085 5465182 5229911 5147881 5065079
17795 5065079 4946777 4838361 4696794 4518895 4441062 4456961 4520182 4529464 4484815 4400332 4252277
17784 4252277 4109808 4050971 4023882 3998606 4026480 4082893 4195796 4335090 4307276 4198485
17774 4198485 4058585 3859582 3657342 3474156 3337581 3251318 3168936 3096267 3108532 3149420
17764 3149420 3176154 3187730 3196641 3215346 3301480 3369166 3366362 3480887 3545928 3626767 3620948 3644924
17752 3644924 3720027 3859157 4043906 4208110 4324697 4436824 4542664 4675173 4815502 5132388
$$ packed form
17822F5311262P152686J707476n015085j1378018j5902812j2280186p405487m492573
17814A7697263k866243j928651j312062r57295q31640q28182p15613o14120l82832
17805G260625k14153n1004q0784j90269l73146m64184m21903k35271q2030q2802
17795E065079j18302j08416j41567j77899p7833J5899O3221R282m4649q4483j48055
17784D252277j42469n8837k7089k5276K7874N6413J12903J39294k7814j08791
17774D198485j39900j99003k02240j83186j36575q6263q2382p2669J2265M0888
17764C149420K6734J1576Q911J8705Q6134O7686k804J14525O5041Q0839n819K3976
17752C644924P5103J39130J84749J64204J16587J12127J05840J32509J40329L16886
$$ plain form
17742 5132388 5601356 6079165 6586279 7097516 7480893 7789584 8192379 8819267 9730716
17733 9730716 10962423 12471648 13943287 15140932 16039995 16824219 17747234 19145166 21376966
17724 21376966 24886946 30265340 39153696 53105847 69618270 83611710 94350759
17717 94350759 99591624 97446822 93288382 90751426 92824173 106208750 138152267 194183891
17709 194183891 275053902 363946850 418039083 420549189 385079980 331270875 304348769
17702 304348769 339606662 427316414 510216852 545074493 530988250 476499374 410505380
17695 410505380 354522459 303847324 250231647 195920679 152995197 128370202 119735081
17688 119735081 124001110 137031644 147768616 146917819 134211606 111895505 87626959
$$ packed form
17742E132388M68968M77809N07114N11237L83377L08691M02795O26888R11449
17733I730716J231707J509225J471639J197645Q99063P84224R23015J397932K231800
17724B1376966L509980N378394Q888356J3952151J6512423J3993440J0739049
17717I4350759N240865k144802m158440k536956K072747J3384577L1943517N6031624
17709A94183891Q0870011Q8892948N4092233K510106l5469209n3809105k6922106
17702C04348769L5257893Q7709752Q2900438L4857641j4086243n4488876o5993994
17695D10505380n5982921n0675135n3615677n4310968m2925482k4624995q635121
17688A19735081M266029J3030534J0736972q50797j2706213k2316101k4268546
$$ plain form
17681 87626959 69710107 58630761 51993129 47924630 45194357 43158613 41592782 40197743
17673 40197743 39161070 38869262 39710465 42376836 47549542 56822101 73170993 98141595
17665 98141595 124605086 143121686 153679382 161154414 176258963 203995641 228177829
17658 228177829 235748583 227903508 213374548 216052015 259135590 330662773 388906986
17651 388906986 418311491 412842094 377101122 350743482 353777585 374815833 381870569
17644 381870569 355828906 302786180 233898974 174862899 137669898 113263406 93827131
17637 93827131 76122640 61811777 52132315 45872570 41717820 39164634 38795392 41273237
17629 41273237 45641060 48178045 46762144 41738368 34092785 26827632 22027140 19108352
$$ packed form
17681H7626959j7916852j1079346o637632m068499k730273k035744j565831j395039
17673D0197743j036673k91808Q41203K666371N172706R272559J6348892K4970602
17665I8141595K6463491J8516600J0557696P475032J5104549K7736678K4182188
17658B28177829P570754p845075j4528960K677467M3083575P1527183N8244213
17651C88906986K9404505n469397l5740972k6357640L034103K1038248P054736
17644C81870569k6041663n3042726o8887206n9036075l7193001k4406492j9436275
17637I3827131j7704491j4310863r679462o259745m154750k553186l69242K477845
17629D1273237M367823K536985j415901n023776p645583p265153m800492k918788
$$ plain form
17621 19108352 17134753 15437391 13866594 12434917 11206907 10258255 9488780 8857314
17613 8857314 8325113 7854521 7433959 7099798 6840310 6597913 6396806 6185742 6022870
17604 6022870 5901145 5732012 5542069 5391599 5252444 5160071 5078584 4972196 4913139 4864743
17594 4864743 4771526 4608862 4454179 4319457 4178232 4024398 3984354 4009971 4081082 4179088
17584 4179088 4307135 4408586 4364459 4172793 3910094 3636468 3395338 3254216 3191874 3108209
17574 3108209 3070422 3072679 3104342 3178851 3146160 3164637 3133242 3091450 3116212 3141603 3296944
17563 3296944 3576521 3830147 4074681 4352686 4727673 5115384 5555011 5989988 6441630
17554 6441630 6995855 7569431 8086346 8697068 9351476 9970287 10600655 11383796 12218476
$$ packed form
17621A9108352j973599j697362j570797j431677j228010r48652p69475o31466
17613H857314n32201m70592m20562l34161k59488k42397k01107k11064j62872
17604F022870j21725j69133j89943j50470j39155r2373q1487j06388n9057m8396
17594D864743r3217j62664j54683j34722j41225j53834m0044K5617P1111R8006
17584D179088J28047J01451m4127j91666k62699k73626k41130j41122o2342q3665
17574C108209l7787K257L1663P4509l2691J8477l1395m1792K4762K5391J55341
17563C296944K79577K53626K44534K78005L74987L87711M39627M34977M51642
17554F441630N54225N73576N16915O10722O54408O18811O30368P83141Q34680
$$ plain form
17545 12218476 13218361 14590925 16476775 19028495 22617867 27668402 35162178 46825011
17537 46825011 65420325 93459427 131676900 177069030 221528731 255981325 273191644
17530 273191644 270768895 255967044 239855599 233084740 241181301 258839660 274676062
17523 274676062 277271036 259499669 224262866 180046418 136333688 100462569 74517315
17516 74517315 57195932 46003477 38498602 33162230 29187821 26158164 23785408 21935731
17508 21935731 20468539 19248149 18174248 17154698 16266030 15592541 15167334 14931382 14786982
17499 14786982 14795494 14785464 14815568 14947237 15177394 15588516 16362552 17567595 19426990 22278926
17489 22278926 26512232 33051349 43696908 60635486 85356404 117886299 154848976
$$ packed form
17545A2218476R99885J372564J885850K551720L589372N050535P493776J1662833
17537D6825011J8595314K8039102L8217473M5392130M4459701L4452594J7210319
17530B73191644k422749j4801851j6111445o770859Q096561J7658359J5836402
17523B74676062K594974j7771367l5236803m4216448m3712730l5871119k5945254
17516G4517315j7321383j1192455p504875n336372l974409l029657k372756j849677
17508B1935731j467192j220390j073901j019550q88668o73489m25207k35952j44400
17499A4786982Q512j0030L0104J31669K30157M11122P74036J205043J859395K851936
17489B2278926M233306O539117J0645559J6938578K4720918L2529895L6962677
$$ plain form
17482 154848976 189377975 215488381 228135062 226067985 215390109 203942537 199252616
17475 199252616 205310587 217680393 228188967 228499870 213140975 184433501 148590780
17468 148590780 112713268 82759076 60721344 45841228 36258046 29960562 25520699
17461 25520699 22263958 19729711 17777385 16243928 14980860 13917442 12918301 12015692
17453 12015692 11155452 10314440 9561354 8928571 8307953 7768044 7326729 6849273 6345573
17444 6345573 5856708 5345735 4895108 4527399 4341737 4250655 4166972 4084441 3879977 3577559
17434 3577559 3322486 3130347 3027511 2998477 2944452 2843874 2743937 2592252 2422256 2309242
17424 2309242 2216899 2112913 2064192 2053932 2022830 2037235 2093303 2143414 2092997 2013276 1911993
$$ packed form
17482A54848976L4528999K6110406J2646681k067077j0677876j1447572m689921
17475A99252616O057971J2369806J0508574L10903j5358895k8707474l5842721
17468A48590780l5877512k9954192k2037732j4880116r583182o297484m439863
17461B5520699l256741k534247j952326j533457j263068j063418r99141r02609
17453A2015692q60240q41012p53086o32783o20618n39909m41315m77456n03700
17444F345573m88865n10973m50627l67709j85662r1082q3683q2531k04464l02418
17434C577559k55073j92139j02836k9034n4025j00578r9937j51685j69996j13014
17424B309242r2343j03986m8721j0260l1102J4405N6068N0111n0417p9721j01283
$$ plain form
17413 1911993 1893870 2037818 2319074 2568334 2752598 2921609 3029603 3088755 3091083 3069130
17403 3069130 2950415 2800473 2655541 2580630 2565502 2481840 2404581 2230953 1912966 1638781
17393 1638781 1468614 1368170 1265328 1181355 1175652 1142133 1146586 1128115 1105814 1156028 1274918
17382 1274918 1371697 1392093 1370446 1308017 1314112 1328060 1418040 1556416 1703097 1799206 1848763
17371 1848763 1884794 1907222 1929752 1872789 1861184 1930141 2149016 2406884 2539698 2545449 2465090
17360 2465090 2286880 2224515 2255223 2352538 2374424 2284941 2192406 2053721 1879607 1708417
17350 1708417 1557752 1341990 1108211 880752 786915 778740 762418 769730 792835 797351 804980
17339 804980 813079 788458 801629 839767 834336 842314 838674 838009 804706 814084 888744 920873 913382
$$ packed form
17413A911993j8123J43948K81256K49260J84264J69011J07994N9152K328k1953
17403C069130j18715j49942j44932p4911j5128q3662p7259j73628l17987k74185
17393A638781j70167j00444j02842q3973n703l3519M453j8471k2301N0214J18890
17382A274918R6779K0396k1647o2429O095J3948Q9980J38376J46681R6109M9557
17371A848763L6031K2428K2530n6963j1605O8957K18875K57868J32814N751q0359
17360B465090j78210o2365L0708R7315K1886q9483r2535j38685j74114j71190
17350A708417j50665k15762k33779k27459r3837q175j6322P312K3105M516P629
17339H04980Q099k4621J3171L8138n431P978l640o65l3303R378P4660L2129p491
$$ plain form
17326 913382 921436 907305 937753 1011001 1071508 1124294 1064750 1104507 1257526 1258373 1177657 1137402
17314 1137402 1021562 836215 778897 878491 912286 922985 879153 813247 725897 703499 719804
17303 719804 648655 569631 540188 545327 539734 462512 404597 336388 370596 374525 312254 252658
17291 252658 162568 137317 179608 248256 242381 229188 221812 160879 162046 182986 149127 114494
17279 114494 76753 41771 62720 80962 81967 94064 108016 74693 82461 5581 -23802 66867
17267 66867 167709 217077 255447 327622 312107 260512 238628 186423 216813 295609 346267
17256 346267 381624 460065 464329 433022 426012 345551 310424 234302 207807 228633 184720 204183
17244 204183 177986 178500 208586 315505 305032 268912 227670 162278 161646 244715 277963 310390
$$ packed form
17326I13382Q054j4131L0448P3248O0507N2786n9544L9757J53019Q47q0716m0255
17314A137402j15840j85347n7318R9594L3795J0699m3832o5906q7350k2398J6305
17303G19804p1149p9024k9443N139n593p7222n7915o8209L4208L929o2271n9596
17291B52658r0090k5251M2291O8648n875j3193p376o0933J167K0940l3859l4633
17279A14494l7741l4982K0949J8242J005J2097J3952l3323P768p6880k9383R0669
17267F6867J00842M9368L8370P2175j5515n1595k1884n2205L0390P8796N0658
17256C46267L5357P8441M264l1307p010q0461l5127p6122k6495K0826m3913J9463
17244B04183k6197N14L0086J06919j0473l6120m1242o5392o32Q3069L3248L2427
$$ plain form
17232 310390 269378 255493 290907 267594 341142 397482 427871 516283 582629 541631 489088
17221 489088 437254 516974 585512 575008 644604 755667 751974 634616 571796 527362 505081
17210 505081 559766 651081 751886 942280 1167383 1309289 1422180 1528836 1699738 1784306
17200 1784306 1820200 1777792 1738911 1636631 1492597 1392008 1367021 1424724 1483741 1493260 1518643
17189 1518643 1665955 1859042 1998425 2036611 2084053 1990281 1836549 1808044 1793979 1689169
17179 1689169 1473401 1262928 1028396 910419 866062 830242 762065 735177 645938 526913
17169 526913 515761 576707 617660 679010 716113 764995 695822 602224 519058 467160 458034 394715
17157 394715 400357 515982 801990 1076326 1313559 1508459 1642371 1755155 1852637 1834528
$$ packed form
17232C10390m1012j3885L5414k3313P3548N6340L0389Q8412O6346m0998n2543
17221D89088n1834P9720O8538j0504O9596J11063l693j17358o2820m4434k2281
17210E05081N4685R1315J00805J90394K25103J41906J12891J06656J70902Q4568
17200A784306L5894m2408l8881j02280j44034j00589k4987N7703N9017R519K5383
17189A518643J47312J93087J39383L8186M7442r3772j53732k8505j4065j04810
17179A689169k15768k10473k34532j17977m4357l5820o8177k6888q9239j19025
17169E26913j1152O0946M0953O1350L7103M8882o9173r3598q3166n1898r126o3319
17157C94715N642J15625K86008K74336K37233J94900J33912J12784R7482j8109
$$ plain form
17147 1834528 1739001 1633483 1552460 1542678 1553948 1549211 1406394 1194074 989274 885790 822431
17136 822431 875572 1081910 1354062 1525349 1523728 1346691 1097938 934311 930757 1066451
17126 1066451 1175270 1267823 1252532 1108076 854276 650972 563847 468786 304372 253985
17116 253985 220800 155821 156976 146474 143506 187538 160377 94187 45612 78408 80770 58875
17104 58875 81240 91242 129875 201294 180745 145631 115183 137065 80772 72589 107438 111822
17092 111822 66487 41804 47459 105636 120220 134257 91792 22269 -11134 -18448 27933 82041
17080 82041 58995 46389 26872 -55512 -78465 -61207 -3332 -2145 -82861 -26711 12886 -634
17068 -634 15852 26166 49679 35923 18888 96784 149845 151377 190879 174090 159923 159635 85196
$$ packed form
17147A834528r5527j05518q1023r782J1270m737j42817k12320k04800j03484o3359
17136H22431N3141K06338K72152J71287j621j77037k48753j63627l554J35694
17126A066451J08819R2553j5291j44456k53800k03304q7125r5061j64414n0387
17116B53985l3185o4979J155j0502k968M4032k7161o6190m8575L2796K362k1895
17104E8875K2365J0002L8633P1419k0549l5114l0448K1882n6293q183L4849M384
17092A11822m5335k4683N655N8177J4584J4037m2465o9523l3403p314M6381N4108
17080H2041k3046j2606j9517q2384k2953J7258N7875J187q0716N6150L9597j3520
17068f34J6486J0314K3513j3756j7035P7896N3061J532L9502j6789j4167k88p4439
$$ plain form
17055 85196 9184 50421 86527 61322 67089 98815 57415 35594 3960 2089 -5580 -53700
17043 -53700 -27398 19685 19328 -48831 -36820 -20825 -43732 1766 26947 -3568 -50713 -30805
17031 -30805 11576 54943 95219 157651 264151 407067 613529 896219 1069173 1189984
17021 1189984 1300224 1302048 1256275 1207610 1224002 1339104 1431157 1483413 1470842 1354165 1182111
17010 1182111 949464 716949 525425 397834 336549 309781 279599 229898 212063 184510
17000 184510 193137 169913 146818 135381 101767 81977 78334 99616 129188 87250 118153 94873
16988 94873 48541 17667 -17983 33894 84865 67665 8922 18769 126506 219191 180387 161197
16976 161197 295162 422637 595154 772825 907930 1070229 1191270 1189610 1139799 1110638
$$ packed form
17055H5196p6012M1237L6106k5205N767L1726m1400k1821l1634j871p669m8120
17043e3700K6302M7083l57o8159J2011J5995k2907M5498K5181l0515m7145J9908
17031c0805M2381M3367M0276O2432J06500J42916K06462K82690J72954J20811
17021A189984J10240J824m5773m8665J6392J15102R2053N2256j2571j16677j72054
17010A182111k32647k32515j91524j27591o1285k6768l0182m9701j7835k7553
17000A84510Q627k3224k3095j1437l3614j9790l643K1282K9572m1938L0903k3280
16988I4873m6332l0874l5650N1877N0971j7200n8743R847J07737R2685l8804j9190
16976A61197J33965J27475J72517J77671J35105J62299J21041j660m9811k9161
$$ plain form
16966 1110638 1139689 1179201 1163016 1151532 1102629 1007330 920669 764418 566354 363574 262864
16955 262864 206523 154809 122595 48362 46447 -8239 -40608 -53460 -31560 27083 53991 41400
16943 41400 77812 62907 46802 31912 -8773 -32102 24905 15371 -37577 -39106 -45923 10466
16931 10466 35030 56176 44526 26178 6880 39416 -443 -22768 -3280 -43065 -31777 -40508
16919 -40508 -51534 -33264 -32427 -60164 -93494 -105679 -98489 -114584 -94418 -135806 -184431 -213678
16907 -213678 -206567 -112021 -34076 -9115 -43378 -109659 -105533 -93553 -129401 -172215 -173953 -115925
16895 -115925 -112671 -140744 -85201 -22958 -55945 -85499 -63627 -22194 -14988 674 4804 39753
16883 39753 -61265 -133224 -152472 -131968 -84178 -84837 -95260 -87630 -45077 -71917 -86495 -54809
$$ packed form
16966A110638K9051L9512j6185j1484m8903r5299q6661j56251j98064k02780j00710
16955B62864n6341n1714l2214p4233j915n4686l2369j2852K1900N8643K6908j2591
16943D1400L6412j4905j6105j4890m0685k3329N7007r534n2948j529o817N6389
16931A0466K4564K1146j1650j8348j9298L2536l9859k2325J9488l9785J1288q731
16919d0508j1026J8270Q37k7737l3330j2185P190j6095K0166m1388m8625k9247
16907b13678P111R4546P7945K4961l4263o6281M126J1980l5848m2814j738N8028
16895a15925L254k8073N5543O2243l2987k9554K1872M1433P206J5662M130L4949
16883C9753j01018p1959j9248K0504M7790o59j0423P630M2553k6840j4578L1686
$$ plain form
16871 -54809 -54169 39518 71354 89305 38898 15979 10575 31882 -48548 -94008 -37306 -13145
16859 -13145 -40500 -59939 -90653 -135800 -118197 -100798 -96534 -77899 -85367 -109457 -103116 -2765
16847 -2765 26070 4342 -22514 -21979 -63977 -74951 -78366 -99981 -45742 -47917 -27471 4300 27873
16834 27873 25570 -35053 -59312 -77379 -87974 -31626 -22162 -78524 -97373 -107590 -122587 -106998
16822 -106998 -56521 -30518 -5311 -3523 -59934 -101050 -96533 -100802 -71189 -87738 -93887 -80013
16810 -80013 -51223 -34331 -55120 -58197 -72857 -117744 -113846 -29112 -3360 -17469 18131 -16468
16798 -16468 7086 -71966 -72036 -48711 -52665 -3302 -14722 -43811 -33847 -36590 -84765 -97875 -83191
16785 -83191 -107010 -119086 -121335 -77685 -57203 -23360 -20655 -31014 -28492 -12832 -31150 -20437
$$ packed form
16871e4809O40R3687L1836J7951n0407k2919n404K1307q0430m5460N6702K4161
16859a3145k7355j9439l0714m5147J7603J7399M264J8635p468k4090O341J00351
16847b765K8835k1728k6856N35m1998j0974l415k1615N4239k175K0446L1771K3573
16834B7873k303o0623k4259j8067j0595N6348R464n6362j8849j0217j4997J5589
16822a06998N0477K6003K5207J788n6411m1116M517m269K9613j6549o149J3874
16810h0013K8790J6892k0789l077j4660m4887L898Q4734K5752j4109L5600l4599
16798a6468K3554p9052p0K3325l954M9363j1420k9089R964k743m8175j3110J4684
16785h3191k3819j2076k249M3650K0482L3843K705j0359K522J5660j8318J0713
$$ plain form
16773 -20437 13177 17719 68528 55616 -15282 -131089 -159082 -80554 -99360 -128519 -113696 -83555
16761 -83555 -123271 -132458 -105901 -78550 -116377 -110630 -83859 -102408 -191828 -171065 -109091 -94485
16749 -94485 -98254 -77898 -78583 -94629 -88511 -65868 -122855 -138701 -100730 -113337 -74265 -78158 -95618
16736 -95618 -113000 -132781 -78342 -48746 -94379 -101227 -89215 -27722 -1577 -35941 -34705 -15930
16724 -15930 -16090 -16552 -4650 -27190 -36704 -72259 -48169 -48655 -60808 -78081 -74492 -61123 -82297
16711 -82297 -116420 -213092 -180184 -173945 -137380 -118591 -91506 -40520 -28138 22463 57543 15682
16699 15682 -321 -28556 -4985 -36508 -60916 -65291 -103917 -92537 -93756 -97853 -103067 -125240
16687 -125240 -123616 -81807 -81670 -33353 -7550 -63906 -103975 -150720 -161557 -107580 -107455 -114050 -72146
$$ packed form
16773b0437L3614M542N0809j2912p0898j15807k7993P8528j8806k9159J4823L0141
16761h3555l9716r187K6557K7351l7827N747K6771j8549q9420K0763O1974J4606
16749i4485l769K0356o85j6046O118K2643n6987j5846L7971j2607L9072l893j7460
16736i5618j7382j9781N4439K9596m5633o848J2012O1493K6145l4364J236J8775
16724a5930j60m62J1902k2540r514l5555K4090m86j2153j7273L589J3369k1174
16711h2297l4123r6672L2908O239L6565J8789K7085N0986J2382N0601L5080m1861
16699A5682j6003k8235K3571l1523k4408m375l8626J1380j219m097n214k2173
16687a25240J624M1809J37M8317K5803n6356m0069m6745j0837N3977J25o595M1904
$$ plain form
16674 -72146 -40260 -47873 -71031 -135037 -132389 -95171 -84935 -113040 -151489 -166728 -152971 -83041
16662 -83041 -45165 -46520 2531 -63234 -145011 -114747 -121470 -155222 -127835 -89651 -35876 -57720
16650 -57720 -126055 -161539 -141408 -74264 -45202 -56854 -79199 -79539 -70315 -98415 -152735 -114252
16638 -114252 -105037 -114219 -90781 -103109 -57077 -47403 -26982 37094 98968 63101 23309 -56738
16626 -56738 -108389 -134303 -134969 -140441 -129201 -104130 -124753 -131823 -106932 -108104 -133394 -114992 -117768
16613 -117768 -92516 -46984 -63834 -57120 -89381 -46201 -40031 -2486 8369 -38188 -68935 -118789
16601 -118789 -173768 -160127 -113498 -100617 -149474 -116604 -54825 -53437 -60555 5794 49982 12585
16589 12585 -45098 -69349 -85690 -37009 -41386 -49735 -29017 -67377 -106932 -140402 -123208 -99216
$$ packed form
16674g2146L1886p613k3158o4006K648L7218J0236k8105l8449j5239J3757O9930
16662h3041L7876j355M9051o5765q1777L0264o723l3752K7387L8184N3775k1844
16650e7720o8335l5484K0131O7144K9062j1652k2345l40R224k8100n4320L8483
16638a14252R215r182K3438j2328M6032R674K0421O4076O1874l5867l9792q0047
16626e6738n1651k5914o66n472J1240K5071k0623p070K4891j172k5290J8402k776
16613a17768K5252M5532j6850O714l2261M3180O170L7545J0855m6557l0747m9854
16601a18789n4979J3641M6629J2881m8857L2870O1779J388p118O6349M4188l7397
16589A2585n7683k4251j6341M8681m377q349K0718l8360l9555l3470J7194K3992
$$ plain form
16577 -99216 -120958 -72987 -34397 -13749 -29934 -65262 -59668 -55552 -69183 -10051 -1183 -20332
16565 -20332 15035 -30374 -45053 -46670 -18507 -51584 -100182 -112038 -86082 -62559 -53443 -60873
16553 -60873 -143314 -156975 -101431 -49272 -19803 27784 -5825 -52815 -89802 -132191 -112722 -58463
16541 -58463 13750 69819 24248 -19199 -15435 -5841 7654 8165 -66081 -111374 -92066 -61810
16529 -61810 -65461 -16830 -7549 -78923 -68965 -56184 -101369 -79837 -53937 -39506 69161 66940
16517 66940 27684 20800 67438 93368 89663 54428 52334 58322 60418 -8717 -60145 -45408 -44558
16504 -44558 -33605 -24526 -4676 -23790 -37731 -42425 -25836 -81897 -83165 -67634 -74944 -86100
16492 -86100 -79265 -97261 -71104 -43747 -71511 -125509 -130210 -43421 -1313 -5118 -28373 -13981
$$ packed form
16577i9216k1742M7971L8590K0648j6185l5328N594M116j3631N9132Q868j9149
16565b0332L5367m5409j4679j617K8163l3077m8598j1856K5956K3523R116p430
16553f0873q2441j3661N5544N2159K9469M7587l3609m6990l6987m2389J9469N4259
16541e8463P2213N6069m5571m3447L764R594J3495N11p4246m5293J9308L0256
16529f1810l651M8631R281p1374R958J2781m5185K1532K5900J4431J08667k221
16517F6940l9256o884M6638K5930l705l5235k094N988K096o9135n1428J4737Q50
16504d4558J0953R079J9850j9114j3941m694J6589n6061j268J5531p310j1156
16492h6100O835j7996K6157K7357k7764n3998m701Q6789M2108l805k3255J4392
$$ plain form
16480 -13981 8639 1341 -57060 -116164 -61216 -77668 -115768 -154759 -195626 -212180 -144038 -49436
16468 -49436 -47594 -37584 -52143 -31063 -54620 -72676 -72375 -50170 -22593 -15829 -31742 -18385
16456 -18385 -20008 -33654 -11851 -9723 -41970 -27435 -4111 -67337 -78099 -59911 8685 18960
16444 18960 -28459 -87552 -68434 -34900 -79598 -128945 -175593 -146875 -87066 -108431 -109258 -52319
16432 -52319 -66759 -50575 -57133 -62992 -75588 -54419 -51891 -44471 -85352 -49901 -42126 -48309 -78077
16419 -78077 -118729 -109290 -26146 16933 -7248 -109024 -193371 -131959 -47309 -27698 24123 18569
16407 18569 -15932 -79627 -80038 -15692 -37565 -41207 -33787 -82622 -26727 52827 11248 -15777
16395 -15777 -5352 -18316 -21674 -12590 17808 13794 44683 19025 -45116 -70885 -36057 -14779
$$ packed form
16480a3981K2620p298n8401n9104N4948j6452l8100l8991m0867j6554O8142R4602
16468d9436J842J0010j4559K1080k3557j8056L01K2205K7577O764j5913J3357
16456a8385j623j3646K1803K128l2247J4535K3324o3226j0762J8188O8596J0275
16444A8960m7419n9093J9118L3534m4698m9347m6648K8718N9809k1365q27N6939
16432e2319j4440J6184o558n859j2596K1169K528P420m0881L5451P775o183k9768
16419g8077m0652R439Q3144M3079k4181j01776q4347O1412Q4650J9611N1821n554
16407A8569l4501o3695m11O4346k1873l642P420m8835N5895P9554m1579k7025
16395a5777J0425j2964l358R084L0398m014L0889k5658o4141k5769L4828K1278
$$ plain form
16383 -14779 -34227 -81627 -163212 -153234 -60817 2345 56006 63166 87124 17899 -34711 -30359
16371 -30359 19414 62954 7133 -39693 -56614 -50905 -32677 -37743 -84825 -106543 -156536 -121892
16359 -121892 -65118 -54250 -70441 -29025 -39452 -65191 -82944 -91806 -104060 -96959 -81537 -44977
16347 -44977 -35636 -23668 -26399 -25469 13939 7020 46963 48727 49357 45214 61947 61221 62433 43536
16333 43536 -11935 -74545 -98711 -96108 -62789 -53821 -54755 -95361 -88673 -98178 -62280 -63661 -74629
16320 -74629 -44370 -31328 -19744 -46937 -61950 -15087 -42170 -81757 -78039 -105292 -150972 -171730
16308 -171730 -185648 -160228 -100486 -81956 -120200 -87584 -55999 -48395 -82983 -104492 -167712 -147880
16296 -147880 -121510 -117260 -101089 -72982 -38108 1677 -49424 -21165 17260 22274 -41907 -45975
$$ packed form
16383a4779j9448m7400q1585R978R2417O3162N3661P160K3958o9225n2610M352
16371c0359M9773M3540n5821m6826j6921N709J8228n066m7082k1718m9993L4644
16359a21892N6774J0868j6191M1416j0427k5739j7753q862j2254P101J5422L6560
16347d4977R341J1968k731R30L9408o919L9943J764O30m143J6733p26J212j8897
16333D3536n5471o2610k4166K603L3319Q968r34m0606O688r505L5898j381j0968
16320g4629L0259J3042J1584k7193j5013M6863k7083l9587L718k7253m5680k0758
16308a71730j3918K5420N9742J8530l8244L2616L1585P604l4588k1509o3220J9832
16296a47880K6370M250J6171K8107L4874L9785n1101K8259L8425N014o4181m068
$$ plain form
16284 -45975 -63513 -56421 -24643 381 522 -43683 -20568 3629 -78785 -118812 -173680 -120891
16272 -120891 -52455 -47321 -47230 -20325 -5919 -26728 1744 36419 -9126 -34641 -24020 -56780
16260 -56780 -33848 -33274 -57911 -70491 -35512 -583 -5353 -48011 -116750 -130500 -106403 -91984
16248 -91984 -49245 -58441 -57736 -88896 -56830 -2770 -21106 13212 30935 -17339 -50923 -18970
16236 -18970 -24754 -39901 -59707 -8177 39451 37400 -97041 -112442 -97027 -84533 -82958 -48934
16224 -48934 9265 39317 55993 86375 64004 37986 58749 87156 147519 143838 164020 205043
16212 205043 202450 193898 147187 174052 191225 151345 94470 68535 76374 98986 83710 53856
16200 53856 62406 58743 90585 70925 64238 63694 40584 -16224 -24554 -21010 34283 43491 25893
$$ packed form
16284d5975j7538P092L1778K5024J41m4205K3115K4197q2414m0027n4868N2789
16272a20891O8436N134R1K6905J4406k0809K8472L4675m5545k5515J0621l2760
16260e6780K2932N74k4637j2580L4979L4929m770m2658o8739j3750K4097J4419
16248i1984M2739r196P05l1160L2066N4060j8336L4318J7723m8274l3584L1953
16236a8970n784j5147j9806N1530M7628k051j34441j5401J5415J2494J575L4024
16224d8934N8199L0052J6676L0382k2371k6018K0763K8407O0363l681K0182M1023
16212B05043k593q552m6711K6865J7173l9880n6875k5935P839K2612j5276k9854
16200E3856Q550l663L1842j9660o687n44k3110n6808q330L544N5293R208j7598
$$ plain form
16187 25893 73721 126697 118585 105111 110127 83647 114755 113917 129898 95885 23159 37405
16175 37405 105716 110183 91316 72611 112418 57897 35054 27119 19649 2849 -1602 46880
16163 46880 83220 -24971 -78198 -65778 -56452 15338 -23513 -78547 -40042 -2433 20734 -27853
16151 -27853 -19826 28388 -13781 -62883 -65891 -68090 -22791 10070 75213 106951 67951 9057
16139 9057 -32256 -53875 -77191 -95120 -59332 -26152 -87725 -82697 -118856 -72985 -20607 -5670
16127 -5670 -22935 -47635 -104838 -90803 -37517 6231 -12458 -8028 -1741 -35568 -28685 -12284
16115 -12284 -2010 -84522 -115168 -98879 -56591 13250 -47012 -169809 -167836 -118496 -24929 99887
16103 99887 10623 -48607 -43648 -58164 -49209 -36083 -51899 -113973 -109476 -122104 -82361 -16707
$$ packed form
16187B5893M7828N2976q112j3474N016k6480L1108q38J5981l4013p2726J4246
16175C7405O8311M467j8867j8705L9807n4521k2843p935p470j6800m451M8482
16163D6880L6340j08191n3227J2420R326P1790l8851n5034L8505L7609K3167m8587
16151b7853Q027M8214m2169m9102l008k199M5299L2861O5143L1738l9000n8894
16139I057m1313k1619k3316j7929L5788L3180o1573N028l6159M5871N2378J4937
16127e670j7265k4700n7203J4035N3286M3748j8689M430O287l3827O883J6401
16115a2284J0274q2512l0646J6289M2288O9841o0262j22797J973M9340R3567J24816
16103I9887q9264n9230M959j4516Q955J3126j5816o2074M497j2628L9743O5654
$$ plain form
16091 -16707 1287 -7135 41024 80520 61775 44748 35351 30824 29409 -46958 -94948 -105260
16079 -105260 -117554 -187344 -162396 -114541 -70718 -69265 -31817 -84382 -81431 -80939 -126898 -87755
16067 -87755 -56316 -58486 -70041 -95608 -99089 -140278 -139941 -131927 -120257 -96962 -46853 -71390 -114652
16054 -114652 -123635 -118841 -93791 -95120 5073 51943 14591 -15085 -56310 -78890 -124672 -187725
16042 -187725 -167673 -82579 -30724 -44785 -36177 -25960 13551 16286 342 18461 24738 -9639
16030 -9639 -31690 -18365 -3034 24751 70171 52336 -22284 -53940 -30712 -22534 779 1022
16018 1022 10127 -78659 -145729 -148229 -164959 -175291 -170980 -165941 -143397 -148687 -153212 -116500 -91259
16005 -91259 -26192 16246 17795 -20253 -68247 -58555 -19115 -25323 -33831 -66520 -46908 -61034
$$ packed form
16091a6707J7994q422M8159L9496j8745j7027r397m527j415p6367m7990j0312
16079a05260j2294o9790K4948M7855M3823J453L7448n2565K951M92m5959L9143
16067h7755L1439k170j1555k5567l481m1189L37Q014J1670K3295N0109k4537m3262
16054a14652q983M794K5050j329J00193M6870l7352k9676m1225k2580m5782o3053
16042a87725K0052Q5094N1855j4061Q608J0217L9511K735j5944J8119O277l4377
16030i639k2051J3325J5331K7785M5420j7835p4620l1656K3228Q178K3313K43
16018A022R105q8786o7070k500j6730j0332M311N039K2544n290m525L6712K5241
16005i1259O5067M2438J549l8048m7994R692L9440o208q508l2689J9612j4126
$$ plain form
15993 -61034 -74032 -84469 -100167 -107887 -129453 -142180 -116907 -55315 -36574 -111316 -100670 -23725
15981 -23725 -22942 -15899 709 -56188 -86212 -84493 -78212 -80253 -4483 3820 -66153 -80857 -119273
15968 -119273 -106551 -138459 -145987 -131876 -77439 -54821 -35174 -15729 -41282 -79069 -52764 8260
15956 8260 14031 -1256 -31951 -52697 -28177 -42593 -48688 -70805 -75860 -84667 -112897 -76551 -4747
15943 -4747 -4839 2058 -19637 -95975 -91313 -72179 -92965 -44338 16779 -43075 -77424 -96102 -102378
15930 -102378 -106076 -69750 18425 36740 6911 -87130 -140819 -172836 -142447 -149520 -121825 -40180
15918 -40180 -12472 -2195 91858 82375 -2954 -36213 -130001 -160658 -145468 -105856 -100758 -96652
15906 -96652 -79439 -64863 -41946 -44875 -91185 -58916 7271 11236 -18190 -79351 -42650 -34633
$$ packed form
15993f1034j2998j0437j5698p720k1566j2727K5273O1592J8741p4742J0646P6945
15981b3725P83P043J6608n6897l0024J719O281k041P5770Q303o9973j4704l8416
15968a19273J2722l1908p528J4111N4437K2618J9647J9445k5553l7787K6305O1024
15956H260N771j5287l0695k0746K4520j4416o095k2117n055q807k8230L6346P1804
15943d747r2O897k1695p6338M662J9134k0786M8627O1117n9854l4349j8678o276
15930a02378l698L6326Q8175J8315k9829r4041n3689l2017L0389p073K7695Q1645
15918d0180K7708J0277R4053r483q5329l3259r3788l0657J5190L9612N098M106
15906i6652J7213J4576K2917k929m6310L2269O6187L965k9426o1161L6701Q017
$$ plain form
15894 -34633 -70113 -95942 -61631 12893 19765 -39594 -84134 -131359 -124020 -68202 -23939 -27471
15882 -27471 -21943 -23707 -8842 -2336 23372 20383 25504 60517 35939 802 -7863 7183 89008
15869 89008 57883 18177 13927 9447 -10709 -23401 -18350 -59258 -140575 -145568 -130920 -124114 -76918
15856 -76918 -28191 8662 -14551 -87250 -84266 -81424 -59917 -18473 -38926 -19575 -41259 -50635
15844 -50635 -9589 21933 41076 -7208 -53342 -28932 -27184 -79257 -84123 -83027 4046 13969
15832 13969 -18877 -58739 -95689 -91104 -84709 -116300 -192167 -153208 -60842 -16290 16033 20464
15820 20464 60095 123676 92251 53689 36604 27053 9252 -42667 -73653 -101340 -60301 -36391
15808 -36391 -41468 -57766 -67904 -63297 -52648 -54825 -23042 13820 -51354 -108764 -90156 -90530 -100633
$$ packed form
15894c4633l5480k5829L4311P4524O872n9359m4540m7225P339N5818M4263l532
15882b7471N528j764J4865O506K5708k989N121L5013k4578l5137q665J5046Q1825
15869H9008l1125l9706m250m480k0156j2692N051m0908q1317m993J4648O806M7196
15856g6918M8727L6853k3213p2699K984K842K1507M1444k0453J9351k1684r376
15844e0635M1046L1522J9143m8284m6134K4410J748n2073m866J096Q7073R923
15832A3969l2846l9862l6950M585O395l1591p5867L8959R2366M4552L2323M431
15820B0464L9631O3581l1425l8562j7085r551j7801n1919l0986k7687M1039K3910
15808c6391n077j6298j0138M607J0649k177L1783L6862o5174n7410J8608l74j0103
$$ plain form
15795 -100633 -33770 8183 -22483 -65183 -39706 -33058 -83084 -61694 -6823 -29883 -48717 -44973
15783 -44973 -17030 -109422 -106001 -13729 18128 -26481 -31553 -17362 -48115 -62006 -29166 -51615
15771 -51615 -85068 -58374 -1460 12108 -10354 -26012 -15331 -30221 -41471 -59797 -73546 -77679
15759 -77679 -94389 -70498 -40412 8648 14488 -4019 38610 55431 49146 10612 -8 -17179
15747 -17179 -5682 -8478 -8604 -15491 -4222 4252 3233 6527 -33373 -38300 -64134 -30149 -64394
15734 -64394 -93561 -115892 -118386 -78602 -44781 -102041 -116267 -64094 -38073 -10929 9489 -48865
15722 -48865 -111384 -128338 -104583 -80397 -83298 -31621 -26128 1965 2108 14641 -47250 -115049
15710 -115049 -147716 -110885 -91201 -79518 -54836 -14423 29418 35371 40652 -16658 8155 -3302
$$ packed form
15795a00633O6863M1953l0666m2700K5477O648n0026K1390N4871k3060j8834L744
15783d4973K7943r2392L421R2272L1857m4609n072J4191l0753j3891L2840k2449
15771e1615l3453K6694N6914J3568k2462j5658J0681j4890j1250j8326j3749m133
15759g7679j6710K3891L0086M9060N840j8507M2629J6821o285l8534j0620j7171
15747a7179J1497k796j26o887J1269Q474j019L294l9900m927k5834L3985l4245
15734f4394k9167k2331k494L9784L3821n7260j4226N2173K6021K7144K0418n8354
15722d8865o2519j6954K3755K4186k901N1677N493K8093J43J2533o1891o7799
15710a15049l2667L6831J9684J1683K4682M0413M3841N953N281n7310K4813j1457
$$ plain form
15698 -3302 38243 72563 52456 8698 -78179 -97107 -30807 10828 -44659 -64840 -74137 -76069
15686 -76069 -83568 -36590 -24517 -4999 -7287 4197 -8396 -53831 -52534 -63163 -96498 -97449 -57949
15673 -57949 -11961 -34153 -59557 -85722 -51630 1367 15953 3470 15261 8504 -33543 -38540
15661 -38540 -22646 -42970 -89929 -91815 -95247 -107325 -62429 -53816 -44327 -9752 -18774 -50448 -51562
15648 -51562 -27826 -33449 -41696 -19888 -10979 -19085 8506 4853 -28175 -25551 7180 6196 8043
15635 8043 60971 -3536 -46642 -56973 -1691 40954 16308 -22411 -7329 -3341 -57282 -102678
15623 -102678 -111165 -100343 -68914 -55361 -45926 -42715 -39229 -27879 -25481 -43889 -89725 -83821 -78770
15610 -78770 -85983 -133617 -156543 -148040 -109946 -87495 -97913 -112269 -113165 -73768 -50298 -3537
$$ packed form
15698c302M1545L4320k0107m3758q6877j8928O6300M1635n5487k0181r297j932
15686g6069p499M6978J2073J9518k288J1484j2593m5435J297j0629l3335r51L9500
15673e7949M5988k2192k5404k6165L4092N2997J4586j2483J1791o757m2047m997
15661c8540J5894k0324m6959j886l432j2078M4896Q613R489L4575r022l1674j114
15648e1562K3736n623q247K1808Q909q106K7591l653l3028K624L2731r84J847
15635H043N2928o4507m3106j0331N5282M2645k4646l8719J5082L988n3941m5396
15623a02678q487J0822L1429J3553R435L211L486J1350K398j8408m5836N904N051
15610g8770p213m7634k2926Q503L8094K2451j0418j4356q96L9397K3470M6761
$$ plain form
15598 -3537 31237 10504 37682 -26101 -39725 -87147 -66328 -65597 -60200 -89713 -57716 -31243
15586 -31243 -47900 -59835 -70036 -51173 -31944 1424 46839 57608 58875 41620 51437 53024
15574 53024 -20592 -50180 -16396 -22719 -75187 -84026 -60526 -47999 8067 13062 -7104 -63342
15562 -63342 -100535 -75789 13207 30157 -4990 -53213 -42008 -45170 -17330 27487 37927 24229
15550 24229 7476 -33699 -22675 7887 -63668 -61419 47 -53751 -40872 9945 -7465 -65038
15538 -65038 -34673 -68616 -41503 -72753 -116994 -119114 -110381 -108147 -83757 -24670 -23058 -76080
15526 -76080 -75088 -72614 -97234 -73291 -40801 -70099 -35610 -33548 -115423 -92706 -100496 -92463 -57851
15513 -57851 -39031 -40937 -41319 -66545 -95303 -89859 -105633 -90342 -59690 -101533 -76721 -70270 -91171
$$ packed form
15598c537L4774k0733K7178o3783j3624m7422K0819P31N397k9513L1997K6473
15586c1243j6657j1935j0201J8863J9229L3368M5415J0769J267j7255R817J587
15574E3024p3616k9588L3784o323n2468q839K3500J2527N6066M995k0166n6238
15562f3342l7193K4746Q8996J6950l5147m8223J1205l162K7840M4817J0440j3698
15550B4229j6753m1175J1024L0562p1555K249O1466n3798J2879N0817j7410n7573
15538f5038L0365l3943K7113l1250m4241k120Q733K234K4390N9087J612n3022
15526g6080R92K474k4620K3943L2490k9298L4489K062q1875K2717p790Q033L4612
15513e7851J8820j906l82k5226k8758N444j5774J5291L0652m1843K4812O451k0901
$$ plain form
15500 -91171 -95004 -58549 30836 7821 -22282 9081 9905 18736 47525 53883 6673 28371 28603
15487 28603 -11209 -37208 -85832 -81072 -25654 -1475 32224 41627 29500 5378 -10835 18583
15475 18583 18297 42721 18453 -1422 -54599 -106975 -95031 -33063 6804 -46676 -31277 21250
15463 21250 -10545 -6570 18773 -11510 9337 -4308 -53190 -74460 -25364 -3068 9862 23625
15451 23625 21008 46516 32717 -25546 -39979 -50910 -27325 9344 22481 36678 12854 -34371
15439 -34371 -13394 -39599 -56447 -38426 -12404 -93990 -97216 -82073 -52253 -54366 22738 44650
15427 44650 722 -56555 -66737 -70883 -83360 -67315 -59931 -71115 -63088 -42324 -22188 -20817
15415 -20817 4475 -2957 5367 11394 30364 8048 -4095 27729 44662 33369 34671 56715
$$ packed form
15500i1171l833L6455Q9385k3015l0103L1363Q24Q831K8789O358m7210K1698K32
15487B8603l9812k5999m8624M760N5418K4179L3699R403j2127k4122j6213K9418
15475A8583k86K4424k4268j9875n3177n2376J1944O1968L9867n3480J5399N2527
15463B1250l1795L975K5343l0283K0847j3645m8882k1270M9096K2296J2930J3763
15451B3625k617K5508j3799n8263j4433j0931K3585L6669J3137J4197k3824m7225
15439c4371K0977k6205j6848J8021K6022q1586l226J5143K9820k113P7104K1912
15427D4650m3928n7277j0182m146j2477J6045P384j1184Q027K0764K0136J371
15415b0817K5292p432Q324O027J8970k2316j2143L1824J6933j1293J302K2044
$$ plain form
15403 56715 38110 21003 22935 -6767 9090 14371 31417 20274 16622 -6011 -28953 -47267
15391 -47267 -77002 -58262 -63114 26093 26390 21904 20487 18844 9536 21560 22990 19408 28910 -26403
15377 -26403 -83840 -109188 -80339 -56321 -67904 -41778 -37099 -98617 -166272 -156782 -153423 -155825
15365 -155825 -145763 -166106 -151216 -138633 -109928 -65560 9681 24162 14623 -1065 21456 7435
15353 7435 11804 11299 11583 -12019 -68305 -44683 -48084 -31450 -8980 -3320 9211 -1889 27919
15340 27919 -6234 -5610 -40362 -114708 -164075 -103766 -24715 34142 49976 44380 40134 52868
15328 52868 6444 -18945 17888 53629 49191 78957 38463 13252 69171 54714 73266 84744
15316 84744 1769 -25099 -34421 13635 22182 -8913 -20179 20853 38328 58291 82838 164359
$$ packed form
15403E6715j8605j7107J932k9702J5857N281J7046j1143l652k2633k2942j8314
15391d7267k9735J8740m852Q9207K97m486j417j643r308J2024J430l582R502n5313
15377b6403n7437k5348K8849K4018j1583K6126M679o1518o7655R490L359k402
15365a55825J0062k0343J4890J2583K8705M4368P5241J4481r539j5688K2521j4021
15353G435M369n05K84k3602n6286K3622l401J6634K2470N660J2531j1100K9808
15340B7919l4153O24l4752p4346m9367O0309P9051N8857J5834n596m246J2734
15328E2868m6424k5389L6833L5741m438K9766m0494k5211N5919j4457J8552J1478
15316H4744q2975k6868r322M8056Q547l1095j1266M1032J7475J9963K4547Q1521
$$ plain form
15304 164359 214825 227671 198885 173076 152027 205264 238762 208104 182456 142542 138075 148021
15292 148021 160541 163982 201523 242526 271221 302439 290537 276758 218411 164420 151153 145830
15280 145830 164339 230095 207392 169253 168575 189111 184554 148467 150089 175708 154275 155340
15268 155340 153662 87662 54407 69194 90037 96455 44301 -29623 -9686 50323 31837 -38519
15256 -38519 -84093 -68151 -42030 -10766 37571 28091 -16779 -4601 2868 22992 36620 34332
15244 34332 81928 81583 85725 54091 36513 72404 22192 -56153 -81201 -78240 -24309 -47783
15232 -47783 -31353 3782 -1592 -69422 -58114 -60679 -41365 -63167 -85163 -54447 -41663 24434
15220 24434 4409 8057 40814 25836 29146 16408 -13611 -45425 -48926 -70885 -90302 -86566
$$ packed form
15304A64359N0466J2846k8786k5809k1049N3237L3498l0658k5648l9914m467R946
15292A48021J2520L441L7541M1003K8695L1218j1902j3779n8347n3991j3267n323
15280A45830J8509O5756k2703l8139o78K0536m557l6087J622K5619k1433J065
15268A55340j678o6000l3255J4787K0843O418n2154p3924J9937O0009j8486p0356
15256c8519m5574J5942K6121L1264M8337r480m4870J2178P469K0124J3628k288
15244C4332M7596l45M142l1634j7578L5891n0212p8345k5048K961N3931k3474
15232d7783J6430L5135n374o7830J1308k565J9314k1802k1996L0716J2784O6097
15220B4434k0025L648L2757j4978L310j2738l0019l1814l501k1959j9417L736
$$ plain form
15208 -86566 -86742 -22752 -2224 -3943 -34511 -41013 -50058 -35319 -30368 -49647 -41111 -14875 -41391
15195 -41391 -9739 38078 75061 96471 39252 -22722 -8016 -60094 -37855 -74594 -117639 -150481
15183 -150481 -100373 -42089 -12789 -25108 -62432 -7614 -50514 -50818 -10080 -1255 5236 49929
15171 49929 48421 60563 61385 37734 12405 -18934 -6293 26626 45445 43915 14669 95854
15159 95854 123248 58637 -68296 -102083 -30307 4870 23756 -31129 -61608 -82540 -64290
15148 -64290 29570 -5399 -43218 -31855 -40567 -10501 -36437 -50452 -93618 -67982 20198 28402
15136 28402 3394 15761 15576 4453 4389 -20079 -67258 -76175 -46680 -37833 -27044 -24919 -20187
15123 -20187 -13468 7644 29180 29020 95321 111619 69653 2367 -32320 -3648 36236 67717
$$ packed form
15208h6566j76O3990K0528j719l0568o502r045J4739M951j9279Q536K6236k6516
15195d1391L1652M7817L6983K1410n7219o1974J4706n2078K2239l6739m3045l2842
15183a50481N0108N8284K9300j2319l7324N4818m2900l04M0738Q825O491M4693
15171D9929j508J2142Q22k3651k5329l1339J2641L2919J8819j530k9246Q1185
15159I5854K7394o4611j26933l3787P1776L5177J8886n4885l0479k0932J8250
15148f4290R3860l4969l7819J1363q712L0066k5936j4015m3166K5636Q8180Q204
15136B8402k5008J2367j85j1123o4k4468m7179q917K9495Q847J0789K125M732
15123b0187O719K1112K1536j60O6301J6298m1966o7286l4687K8672L9884L1481
$$ plain form
15111 67717 85509 97303 42061 -16911 -34539 -4955 -28109 -49147 -60909 20635 39800 -38592
15099 -38592 -7764 13445 20703 9142 -29761 -11394 -37566 -17644 -14690 -13502 4545 37022
15087 37022 -2636 15971 31022 25060 -12053 29098 85882 89771 56516 15929 -12045 -50449
15075 -50449 -43316 643 42511 133974 140784 95450 15988 -14324 -30772 -36880 -14928 -30854
15063 -30854 -49005 -77877 -9458 44586 47115 50981 63528 43029 -14953 -48051 -30747 -18538
15051 -18538 13727 33620 64604 68776 31092 20679 -13235 27369 31432 74227 80001 103162
15039 103162 89659 76961 66268 47158 -8377 -56889 -62380 -33643 27117 77737 118032 101245
15027 101245 84851 113343 89925 76184 114341 122199 147576 201069 177044 144336 168912 191668
$$ packed form
15111F7717J7792J1794n5242n8972j7628K9584k3154k1038j1762Q1544J9165p8392
15099c8592L0828K1209P258j1561l8903J8367k6172J9922K954J188J8047L2477
15087C7022l9658J8607J5051n962l7113M1151N6784L889l3255m0587k7974l8404
15075e0449P133M3959M1868R1463O810m5334p9462l0312j6448o108K1952j5926
15063c0854j8151k8872O8419N4044K529L866J2547k0499n7982l3098J7304J2209
15051a8538L2265J9893L0984M172l7684j0413l3914M0604M063M2795N774K3161
15039A03162j3503j2698j0693j9110n5535m8512n491K8737O0760N0620M0295j6787
15027A01245j6394K8492k3418j3741L8157P858K5377N3493k4025l2708K4576K2756
$$ plain form
15015 191668 166399 162221 184778 192168 154685 156647 218500 201760 159349 233159 302599 241906
15003 241906 149737 72851 50503 19302 21957 36840 25811 32447 102898 97113 142995 135706
14991 135706 144106 141740 107016 81830 53041 49891 32822 -19710 -18470 -27674 -7127 -30462
14979 -30462 3996 -19393 17138 84973 78844 19290 -33842 -108888 -48877 2062 4263 58166
14967 58166 94277 28234 -8055 56864 83390 76734 51908 22245 -22127 -25126 -21570 -12958
14955 -12958 27669 42406 -26199 -78108 -67560 -27190 -38072 -43958 -63964 -95132 -77762 -88944
14943 -88944 -91071 -53551 -16028 5595 24332 25352 40523 97546 144517 82680 58657 70141
14931 70141 48225 42096 103638 58783 28487 9641 71842 28964 -11979 6615 125083 126484
$$ packed form
15015A91668k5269m178K2557P390l7483J962O1853j6740m2411P3810O9440o0693
15003B41906r2169p6886k2348l1201K655J4883j1029O636P0451n785M5882p289
14991A35706Q400k366l4724k5186k8789l150j7069n2532J240r204K0547k3335
14979c0462L4458k3389L6531O7835o129n9554n3132p5046O0011N0939K201N3903
14967E8166L6111o6043l6289O4919K6526o656k4826k9663m4372k999L556Q612
14955a2958M0627J4737o8605n1909J0548M0370j0882n886k0006l1168J7370j1182
14943h8944k127L7520L7523K1623J8737J020J5171N7023M6971o1837k4023J1484
14931G0141k1916o129O1542m4855l0296j8846O2201m2878m0943J8594J18468J401
$$ plain form
14919 126484 121966 96434 46719 15892 2657 -6474 46327 115300 150025 175802 156984 76611
14907 76611 25829 50385 32652 62272 104762 138434 183019 153873 152141 138954 75218 53613
14895 53613 56474 99218 77029 75449 41351 79007 126016 100778 30517 70929 106484 100998
14883 100998 101393 81351 103576 103658 106142 127963 91913 76449 56670 53062 82059 115080 99736
14870 99736 117169 111501 158570 188044 185653 181595 204181 184915 161105 175034 106275 63110
14858 63110 69950 63089 74699 77961 22398 23772 2044 -253 23245 -29904 -29895 13312 77937
14845 77937 103371 108663 71168 56805 -289 -48712 -30164 -41579 -8167 1385 15636 21787
14833 21787 17754 11082 23713 21115 33024 12125 12396 39380 62019 37181 1808 -22856 50499
$$ packed form
14919A26484m518k5532m9715l0827j3235r131N2801O8973L4725K5777j8818q0373
14907G6611n0782K4556j7733K9620M2490L3672M4585k9146j732j3187o3736k1605
14895E3613K861M2744k2189j580l4098L7656M7009k5238p0261M0412L5555n486
14883A00998L95k0042K2225Q2K484K1821l6050j5464j9779l608K8997L3021j5344
14870I9736J7433n668M7069K9474k391m058K2586j9266k3810J3929o8759m3165
14858F3110O840o861J1610L262n5563J374k1728k297K3498n3149RM3207O4625
14845G7937K5434N292l7495j4363n7094m8423J8548j1415L3412R552J4251O151
14833B1787m033o672J2631k598J1909k0899K71K6984K2639k4838l5373k4664P3355
$$ plain form
14820 50499 55650 101281 54010 71231 61941 93880 62190 61838 131388 120579 96736 91256 46273
14807 46273 37409 36647 26285 67385 71617 42418 48914 45716 46089 21421 22119 -19307 -76264 -71937
14793 -71937 -42959 -61921 -71761 -86847 -20276 -2171 989 10442 18716 29595 61774 130351
14781 130351 140348 120091 64283 51409 51254 13611 -23198 -14302 52124 102137 93217 71475
14769 71475 29924 27659 92306 94617 63295 21673 45304 26582 11631 35034 39787 75072
14757 75072 84819 86651 49078 66684 102432 84140 43822 -6602 -24905 55205 95373 64038
14745 64038 98318 51360 70055 94559 99049 104615 84834 54352 55813 36005 22807 22006 48660
14732 48660 114830 175160 105118 90126 36070 -24365 45763 89600 67436 23170 -35887 -69432
$$ packed form
14820E0499N151M5631m7271J7221r290L1939l1690l52O9550j0809k3843n480m4983
14807D6273q864p62j0362M1100M232k9199O496l198L73k4668O98m1426n6957M327
14793g1937K8978j8962r840j5086O6571J8105L160R453Q274J0879L2179O8577
14781A30351R997k0257n5808j2874j55l7643l6809Q896O6426N0013q920k1742
14769G1475m1551k265O4647K311l1322m1622K3631j8722j4951K3403M753L5285
14757G5072R747J832l7573J7606L5748j8292m0318n0424j8303Q0110M0168l1335
14745F4038L4280m6958J8695K4504M490N566j9781l0482J461j9808j3198q01K6654
14732D8660O6170O0330p0042j4992n4056o0435P0128M3837k2164m4266n9057l3545
$$ plain form
14720 -69432 -38587 -34805 -71204 -86001 -5588 -12420 -3162 -12994 28717 91291 65879 9659
14708 9659 32631 60112 90721 89716 12735 -16379 -6120 8068 -9921 -42510 -80204 -68516
14696 -68516 9730 69332 110545 143903 180461 121345 94438 102874 150989 163169 171142 130022
14684 130022 32084 22622 39691 43690 59150 75561 23491 21424 63640 105480 86024 54398
14672 54398 53077 86282 92347 118842 106510 89055 100128 43570 59473 45906 50342 72202
14660 72202 70753 63456 36719 75736 91916 98349 30492 25941 89890 135698 55557 -26288
14648 -26288 -1514 61023 82223 88624 66983 80224 108028 93895 94571 105921 77919 19324
14636 19324 53749 71831 57008 63403 71678 115355 100248 95488 92815 71674 58815 55605 76115
$$ packed form
14720f9432L0845L782l6399j4797Q0413o832R258r832M1711O2574k5412n6220
14708I659K2972K7481L0609j005p6981k9114J0259J4188j7989l2589l7694J1688
14696f8516P8246N9602M1213L3358L6558n9116k6907Q436M8115J2180P973m1120
14684A30022r7938r462J7069L999J5460J6411n2070k067M2216M1840j9456l1626
14672E4398j321L3205O065K6495j2332j7455J1073n6558J5903j3567M436K1860
14660G2202j449p297k6737L9017J6180O433o7857m551O3949M5808q0141q1845
14648b6288K4774O2537K1200O401k1641J3241K7804j4133O76J1350k8002n8595
14636A9324L4425J8082j4823O395Q275M3677j5107m760k673k1141j2859l210K0510
$$ plain form
14623 76115 93299 90500 133907 115708 114490 170628 212456 259520 316320 364804 440989 495212
14611 495212 505981 583189 713073 801669 868073 983795 1108918 1260058 1489448 1672255
14601 1672255 1802987 1947417 2062412 2116822 2086113 2007098 1937030 1830618 1737263 1688977
14591 1688977 1699791 1660522 1605983 1552448 1514096 1453874 1495826 1504550 1439076 1433719 1446313 1399386
14579 1399386 1432285 1460562 1451622 1457495 1498387 1583409 1696446 1741277 1788248 1809884 1867829
14568 1867829 1975879 2032732 2023720 2009410 2045702 1972211 1877638 1778910 1618341 1484945 1374100
14557 1374100 1275102 1130071 1066855 1002999 918623 846952 755730 620840 614447 607327 529034
14546 529034 502243 481228 431971 391040 363022 390751 416112 387047 359180 339527 344255 390221
$$ packed form
14623G6115J7184k799M3407j8199j218N6138M1828M7064N6800M8484P6185N4223
14611D95212J0769P7208J29884Q8596O6404J15722J25123J51140K29390J82807
14601A672255J30732J44430J14995N4410l0709p9015p0068j06412r3355m8286
14591A688977J0814l9269n4539n3535l8352o0222M1952Q724o5474n357J2594m6927
14579A399386L2899K8277q940N873M0892Q5022J13037M4831M6971K1636N7945
14568A867829J08050N6853r012j4310L6292p3491r4573r8728j60569j33396j10845
14557A374100r8998j45031o3216o3856q4376p1671r1222j34890o393p120p8293
14546E29034k6791k1015m9257m0931k8018K7729K5361k9065k7867j9653M728M5966
$$ plain form
14534 390221 366125 334248 299906 264869 259136 244354 263287 256562 274715 293248 294461 332263
14522 332263 343484 321724 324829 342818 357522 332943 295702 275510 272436 258499 255525 242541
14510 242541 288032 280353 269188 231162 289138 327999 310838 280554 300689 292313 311135 351160
14498 351160 344674 323525 316902 292163 290427 278461 223702 205867 219045 214561 225357 217365
14486 217365 227114 263644 284899 231850 227979 253691 234671 234108 296548 336943 303847 331939
14474 331939 337324 357118 413902 432869 468796 453996 446843 445188 430289 414422 381364 365839
14462 365839 312693 297302 299549 305367 308188 323176 331688 310971 328219 346435 296484 266796
14450 266796 284463 279751 253361 275794 302609 261985 298826 374202 401188 405351 338973 357967
$$ packed form
14534C90221k4096l1877l4342l5037n733j4782J8933o725J8153J8533J213L7802
14522C32263J1221k1760L105J7989J4704k4579l7241k0192l074j3937k974j2984
14510B42541M5491p679j1165l8026N7976L8861j7161l0284K0135q376J8822M0025
14498C51160o486k1149o623k4739j736j1966n4759j7835J3178m484J0796p992
14486B17365R749L6530K1255n3049l871K5712j9020n63O2440M0395l3096K8092
14474C31939N385J9794N6784J8967L5927j4800p153j655j4899j5867l3058j5525
14462C65839n3146j5391K247N818K821J4988Q512k0717J7248J8216m9951k9688
14450B66796J7667m712k6390K2433K6815m0624L6841P5376K6986M163o6378J8994
$$ plain form
14438 357967 372835 371258 350040 318816 311571 352416 351581 367814 399258 347165 372551 319827
14426 319827 262586 290505 348098 399469 403492 401415 349085 321752 335457 352034 407707 379705
14414 379705 419437 457089 473352 437662 397991 420387 456923 457447 477960 535574 573356 626667
14402 626667 640543 570093 518809 517922 516452 507470 443690 459652 469432 404613 389922 463163
14390 463163 502258 554365 610049 591811 548893 536599 567775 580458 566942 584222 632345
14379 632345 685776 672694 622192 672369 717028 697317 704731 686188 585132 514113 440310
14368 440310 527254 563544 520690 498784 486621 414253 447421 537634 508219 472086 472647 437430
14356 437430 420788 440356 428322 460633 437890 411782 418321 394933 402148 376217 291653 237453
$$ packed form
14438C57967J4868j577k1218l1224p245M0845q35J6233L1444n2093K5386n2724
14426C19827n7241K7919N7593N1371M023k077n2330k7333J3705J6577N5673k8002
14414C79705L9732L7652J6263l5690l9671K2396L6536N24K0513N7614L7782N3311
14402F26667J3876p0450n1284q87j470q982o3780J5962R780o4819j4691P3241
14390D63163L9095N2107N5684j8238m2918j2294L1176J2683j3516J7280M8123
14379F32345N3431j3082n0502N0177M4659j9711P414j8543j01056p1019p3803
14368D40310Q6944L6290m2854k1906j2163p2368L3168R0213k9415l6133N61l5217
14356D37430j6642J9568j2034L2311k2743k6108O539k3388P215k5931q4564n4200
$$ plain form
14344 237453 298608 388079 451707 504224 497295 459669 490742 569750 574816 573637 542946 507855
14332 507855 509917 543094 508377 485258 479414 441383 414503 404202 420127 402042 403856 428787
14320 428787 441304 444648 436897 407268 453491 449077 445229 378312 418043 437377 439448 428414
14308 428414 415588 450988 494511 510380 497883 528656 583898 576483 597242 653698 689913 678365
14296 678365 648601 636026 608590 613742 665197 714695 705047 644188 650068 659270 647622 655827
14284 655827 657383 681444 755613 754537 753134 778302 838535 808151 816170 903139 943986 919223
14272 919223 896873 910501 905221 904309 943820 971886 976791 1020632 1060486 1076303 1045245 1009651
14260 1009651 1048769 1061018 1107967 1160306 1179032 1199129 1116513 1126572 1124356 1150820 1134941
$$ packed form
14344B37453O1155Q9471O3628N2517o929l7626L1073P9008N066j179l0691l5091
14332E07855K062L3177l4717k3119n844l8031k6880j0301J5925j8085J814K4931
14320D28787J2517L344p751k9629M6223m414l848o6917L9731J9334K071j1034
14308D28414j2826L5400M3523J5869j2497L0773N5242p415K0759N6456L6215j1548
14296F78365k9764j2575k7436N152N1455M9498r648o0859N880R202j1648Q205
14284F55827J556K4061P4169j076j403K5168O0233l0384Q019Q6969M0847k4763
14272I19223k2350J3628n280r12L9511K8066M905M3841L9854J5817l1058l5594
14260A009651L9118J2249M6949N2339J8726K0097q2616J0059k216K6464j5879
$$ plain form
14249 1134941 1106443 1141836 1221545 1318418 1299870 1255784 1285723 1296008 1307341 1375784 1431499
14238 1431499 1484381 1519489 1546792 1577555 1575186 1598430 1606802 1660515 1767717 1792329 1748198
14227 1748198 1743727 1793358 1879188 1943336 1990427 2017567 2026569 2034096 2121020 2194160 2251720 2314639
14215 2314639 2388783 2412709 2522314 2650987 2752089 2820441 2943486 3096370 3243174 3379418
14205 3379418 3498353 3600625 3740752 3930315 4099588 4286603 4514989 4735629 4921946
14196 4921946 5156544 5418922 5721365 6011606 6392081 6767603 7095452 7440838 7887669
14187 7887669 8349574 8899538 9487748 10174962 10873725 11677461 12528561 13419617 14449790
14178 14449790 15619291 16840746 18145121 19687136 21417812 23342069 25445869 27870028
$$ packed form
14249A134941k8498L5393P9709R6873j8548m4086K9939J0285J1333O8443N5715
14238A431499N2882L5108K7303L0763k369K3244Q372N3713J07202K4612m4131
14227A748198m471M9631Q5830O4148M7091K7140R002P527Q6924P3140N7560O2919
14215B314639P4144K3926J09605J28673J01102O8352J23045J52884J46804J36244
14205C379418J18935J02272J40127J89563J69273J87015K28386K20640J86317
14196D921946K34598K62378L02443K90241L80475L75522L27849L45386M46831
14187G887669M61905N49964N88210O87214O98763Q03736Q51100Q91056J030173
14178A4449790J169501J221455J304375J542015J730676J924257K103800K424159
$$ plain form
14170 27870028 30621019 33791587 37351161 41285983 45810477 50907637 56773999 63493472
14162 63493472 71133427 79862192 89767926 100948362 113495102 127578541 143189942
14155 143189942 160281044 178709260 198157540 218155645 238264376 257902558 276346587
14148 276346587 292908277 307079970 318399103 326572191 331595026 333606446 332873046 329826817
14140 329826817 324978385 318939812 312241745 305255496 298413258 292000397 286286054 281361672
14132 281361672 277389428 274431531 272468420 271590642 271819207 273182856 275686021 279250587
14124 279250587 283871082 289449427 295937976 303147650 310832529 318717523 326323035 333121979
14116 333121979 338652458 342353310 343684730 342214005 337499261 329606869 318583438 304618422
$$ packed form
14170B7870028K750991L170568L559574L934822M524494N097160N866362O719473
14162F3493472P639955Q728765R905734J1180436J2546740J4083439J5611401
14155A43189942J7091102J8428216J9448280J9998105K0108731J9638182J8444029
14148B76346587J6561690J4171693J1319133Q173088N022835K011420p33400l046229
14140C29826817m848432o038573o698067o986249o842238o412861n714343m924382
14132B81361672l972244k957897j963111q77778K28565J363649K503165L564566
14124B79250587M620495N578345O488549P209674P684879P884994P605512O798944
14116C33121979N530479L700852J331420j470725m714744p892392j1023431j3965016
$$ plain form
14108 304618422 288226649 269924135 250443718 230370698 210391851 191049757 172757112
14101 172757112 155718720 140081105 125841558 113000387 101521692 91273506 82145472
14094 82145472 74046701 66861394 60499528 54874148 49852763 45350685 41381096 37851748
14086 37851748 34709005 31898226 29372348 27133467 25075861 23212669 21538169 20070386
14078 20070386 18736377 17480782 16410432 15388423 14447927 13591818 12818152 12085904 11408340
14069 11408340 10811488 10235996 9732299 9223316 8786383 8391361 8006901 7667860 7267656
14060 7267656 6886222 6602091 6358655 6127084 5811528 5594163 5445739 5296667 5134705
14051 5134705 4956568 4806615 4666269 4538805 4404712 4333820 4234235 4201859 4216803 4160441
$$ packed form
14108C04618422j6391773j8302514j9480417k0073020j9978847j9342094j8292645
14101A72757112j7038392j5637615j4239547j2841171j1478695j0248186r128034
14094H2145472q098771p185307o361866n625380n021385m502078l969589l529348
14086C7851748l142743k810779k525878k238881k057606j863192j674500j467783
14078B0070386j334009j255595j070350j022009r40496q56109p73666p32248o77564
14069A1408340n96852n75492n03697n08983m36933l95022l84460l39041m00204
14060G267656l81434k84131k43436k31571l15556k17365j48424j49072j61962
14051E134705j78137j49953j40346j27464j34093p0892r9585l2376J4944n6362
$$ plain form
14041 4160441 4134481 4088019 4049357 3991539 3909512 3947123 3907109 3864688 3786595 3710147 3655475
14030 3655475 3601191 3530500 3509305 3507026 3520079 3502662 3466016 3423180 3327761 3238244 3154108
14019 3154108 3116588 3015851 2991186 2956022 2863941 2688614 2509173 2398280 2282877 2221589
14009 2221589 2173311 2142774 2029238 1896671 1797675 1780724 1813606 1780002 1765323 1708253 1618508
13998 1618508 1569578 1583432 1520849 1500431 1547298 1542294 1545543 1582980 1596926 1654335 1687109 1757810
13986 1757810 1807720 1918392 2045229 2106160 2137255 2205779 2332612 2416494 2447795 2550120
13976 2550120 2727831 2913310 3046220 3122541 3243509 3385708 3512768 3605981 3623410 3673006
13966 3673006 3734016 3748785 3815627 3878063 3883046 3835157 3802433 3766313 3735296 3672951 3500992
$$ packed form
14041D160441k5960m6462l8662n7818q2027L7611m0014m2421p8093p6448n4672
14030C655475n4284p0691k1195k279J3053j7417l6646m2836r5419q9517q4136
14019C154108l7520j00737k4665l5164r2081j75327j79441j10893j15403o1288
14009B221589m8278l0537j13536j32567r8996j6951L2882l3604j4679n7070q9745
13998A618508m8930J3854o2583k0418M6867n004L249L7437J3946N7409L2774P0701
13986A757810M9910J10672J26837O0931L1095O8524J26833Q3882L1301J02325
13976B550120J77711J85479J32910P6321J20968J42199J27060R3213J7429M9596
13966C673006O1010J4769O6842O2436M983m7889l2724l6120l1017o2345j71959
$$ plain form
13955 3500992 3357749 3237386 3191938 3079554 2882933 2732013 2639064 2561413 2397489 2209648
13945 2209648 2040243 1957339 1873663 1744376 1640754 1568744 1441757 1312816 1255917 1242629
13935 1242629 1206443 1125222 991622 930743 899263 881247 817116 787347 782655 758466 767112
13924 767112 736372 628309 551305 573580 626842 609923 566466 522982 415545 358597 354524
13913 354524 349978 348691 270763 283958 268955 278063 328722 386307 358510 320561 319284 274601
13901 274601 256296 266804 338512 371510 356009 318706 280930 302356 328147 296224 260166
13890 260166 248003 156767 138504 150934 135673 74034 110720 127978 145983 89026 119062
13879 119062 133048 160596 154287 106133 110601 139249 184201 135213 96640 95973 83913 101670
$$ packed form
13955C500992j43243j20363m5448j12384j96621j50920r2949p7651j63924j87841
13945B209648j69405q2904q3676j29287j03622p2010j26987j28941n6899j3288
13935A242629l6186q1221j33600o0879l1480j8016o4131k9769m692k4189Q646
13924G67112l0740j08063p7004K2275N3262j6919m3457m3484j07437n6948m073
13913C54524m546j287p7928J3195j5003R108N0659N7585k7797l7949j277m4683
13901B74601j8305J0508P1708L2998j5501l7303l7776K1426K5791l1923l6058
13890B60166j2163r1236j8263J2430j5261o1639L6686J7258J8005n6957L0036
13879A19062J3986K7548o309m8154M468K8648M4952m8988l8573o67j2060J7757
$$ plain form
13867 101670 79463 70044 30687 45542 85596 94077 119794 160117 188131 208905 244702 243008
13855 243008 197700 206621 174805 134227 116940 87959 532 -1678 -7089 -74321 -80376 -69193
13843 -69193 -46773 -24065 10563 117639 166026 76878 19286 -23125 12315 42289 24002
13832 24002 16159 33738 30139 39310 -14963 -47231 -49890 -15436 41986 33818 34307 67635 106341
13819 106341 71875 46391 85322 96484 50357 40474 59589 -8303 -64997 -104622 -125438 -119902
13807 -119902 -148414 -109019 -17242 20933 3069 -869 26644 26788 26144 -4111 -33397 -23024
13795 -23024 -53867 -21816 -27606 387 26691 -2553 -14607 19639 9793 -17833 -32395 -4953
13783 -4953 2064 -37814 -27174 -19584 -38917 -18621 -45472 -33436 -39843 -34538 -41125 -78047 -114634
$$ packed form
13867A01670k2207r419l9357J4855M0054Q481K5717M0323K8014K0774L5797j694
13855B43008m5308Q921l1816m0578j7287k8981q7427k210n411o7232o055J1183
13843f9193K2420K2708L4628J07076M8387q9148n7592m2411L5440K9974j8287
13832B4002p843J7579l599R171n4273l2268k659L4454N7422q168M89L3328L8706
13819A06341l4466k5484L8931J1162m6127r883J9115o7892n6694l9625k0816N536
13807a19902k8512L9395R1777L8175j7864l938K7513J44o44l0255k9286J0373
13795b3024l0843L2051n790K7993K6304k9244j2054L4246r846k7626j4562K7442
13783d953P017l9878J0640P590j9333K0296k6851J2036o407N305o587l6922l6587
$$ plain form
13770 -114634 -74438 -22237 3559 25163 84869 80723 58241 30663 11898 58122 22730 -7641
13758 -7641 -5611 29881 92421 43269 5894 32386 41869 41532 33372 71837 99170 74894 47439
13745 47439 10538 -765 28227 74465 30867 -28303 -4818 -15008 -6280 8376 -13384 -28935
13733 -28935 -70441 716 15502 -36583 9905 68113 45728 31500 30274 27898 32228 60227
13721 60227 96828 99930 130315 160846 132493 150618 135906 152735 166009 177637 184359 196404
13709 196404 251510 305254 376205 384847 329803 305845 378960 467219 513687 532806 564405 655144
13697 655144 767340 839683 969932 1102674 1161135 1245853 1320806 1455500 1553267 1638948 1724698
13686 1724698 1780440 1853269 1909201 1927936 1936883 1916034 1836494 1832392 1760895 1661083 1611745 1610853
$$ packed form
13770a14634M0196N2201K5796K1604N9706m146k2482k7578j8765M6224l5392l0371
13758g641K030L5492O2540m9152l7375K6492R483l37q160L8465K7333k4276k7455
13745D7439l6901j1303K8992M6238m3598n9170K3485j0190Q728J4656k1760j5551
13733b8935m1506P1157J4786n2085M6488N8208k2385j4228j226k376M330K7999
13721F0227L6601L102L0385L0531k8353J8125j4712J6829J3274J1628O722J2045
13709A96404N5106N3744P0951Q642n5044k3958P3115Q8259M6468J9119L1599R0739
13697F55144J12196P2343J30249J32742N8461Q4718P4953J34694R7767Q5681Q5750
13686A724698N5742P2829N5932J8735Q947k0849p9540m102p1497r9812m9338q92
$$ plain form
13674 1610853 1600995 1585922 1544000 1536114 1579112 1619788 1613276 1612385 1601354 1597953 1606900 1619394 1645033
13661 1645033 1703123 1760832 1818168 1920564 1946827 1928311 1991158 2009788 2061777 2049294 1971888
13650 1971888 1881207 1738025 1627758 1521850 1432154 1337102 1174337 1080644 992402 903304
13640 903304 873594 806395 686971 626358 569182 554756 449362 437375 442126 353981 301747
13629 301747 325351 289318 275457 270467 268065 162666 139439 203906 166171 129391 152230 98961
13617 98961 102733 149993 150434 101128 43841 47204 35853 15275 7372 34067 78789 57464 102205
13604 102205 198984 149935 58272 53311 93077 95738 73898 85097 61363 61455 40229 22592
13592 22592 18367 -43009 -20916 -38669 -43807 35113 58890 -43517 -75914 -21902 10684 23542
$$ packed form
13674A610853r858j5073m1922p886M2998M0676o512q91j1031l401Q947J2494K5639
13661A645033N8090N7709N7336J02396K6263j8516O2847J8630N1989j2483p7406
13650A971888r0681j43182j10267j05908q9696r5052j62765r3693q8242q9098
13640I03304k9710o7199j19424o0613n7176j4426j05394j1987M751q8145n2234
13629C01747K3604l6033j3861m990k402j05399k3227O4467l7735l6780K2839n3269
13617I8961L772M7260M41m9306n7287L363j1351k0578p903K6695M4722k1325M4741
13604A02205R6779m9049r1663m961L9766K661k1840J1199k3734R2k1226j7637
13592B2592m225o1376K2093j7753n138P8920K3777j02407l2397N4012L2586J2858
$$ plain form
13580 23542 56671 88716 99282 85741 67630 40471 -28963 40153 57198 50403 37687 25285
13568 25285 42458 12643 -22397 29877 59820 94741 101646 42026 -32879 -4423 -26700 -83343
13556 -83343 -82777 -102652 -160556 -180395 -160769 -114020 -63808 -54137 -37191 -55762 -84517 -74629
13544 -74629 -79799 -57999 -33927 -33825 -8267 5985 34711 63006 31202 32609 18771 -64211
13532 -64211 -107896 -81631 -61488 -5298 -8170 209 12316 -26829 -54955 902 64359 75788
13520 75788 77166 82547 60207 41003 32863 -23920 -16759 -3780 17740 31510 69675 16904
13508 16904 -62049 -109362 -88410 -47208 15055 415 -22744 23568 -17262 -27551 -5094 3887
13496 3887 31594 3199 17310 36714 60121 17379 7273 -62735 -80798 -66702 -53687 -96407
$$ packed form
13580B3542L3129L2045J0566j3541j8111k7159o9434O9116J7045o795j2716j2402
13568B5285J7173k9815l5040N2274K9943L4921O905n9620p4905K8456k2277n6643
13556h3343N66j9875n7904j9839J9626M6749N0212R671J6946j8571k8755R888
13544g4629n170K1800K4072J02K5558J4252K8726K8295l1804J407j3838q2982
13532f4211m3685K6265K0143N6190k872Q379J2107l9145k8126N5857O3457J1429
13520G5788J378N381k2340j9204q140n6783P161J2979K1520J3770L8165n2771
13508A6904p8953m7313K0952M1202O2263j4640k3159M6312m0830j0289K2457Q981
13496C887K7707k8395J4111J9404K3407m2742j0106p0008j8063J4096J3015m2720
$$ plain form
13484 -96407 -117428 -107372 -67153 -51139 -43321 -63837 -33074 -71040 -65847 -101681 -98632 -121748
13472 -121748 -145958 -107020 -88392 -122344 -108604 -27145 -23056 -64946 -91826 -67426 -93244 -126106
13460 -126106 -158021 -104110 -30460 40042 27197 23227 -30207 -92093 -59662 -20389 -20569 -1178
13448 -1178 -6982 47084 66867 50518 13354 7696 -26538 -56682 -81313 -75635 -88517 -104562
13436 -104562 -104071 -136933 -134172 -106549 -68663 -31911 -167 -9259 -48275 -75784 -61863 -60743
13424 -60743 -95205 -99860 -36751 -32795 -15447 -33240 -75893 -55601 -25342 -28605 15711 40887
13412 40887 2378 -1282 -48705 -87740 -87013 -60298 -38745 -37334 -34524 -19566 -31009 -73398 -73413
13399 -73413 -17146 -53703 -83409 -56433 -44852 -84360 -102843 -90867 -57912 -15247 -1989 -3740
$$ packed form
13484i6407k1021J0056M0219J6014P818k0516L0763l7966N193l5834L049k3116
13472a21748k4210L8938J8628l3952J3740Q1459M089m1890k6880K4400k5818l2862
13460a26106l1915N3911P3650P0502j2845l970n3434o1886L2431L9273j80J9391
13448a178n804N4066J9783j6349l7164n658l4234l0144k4631N678j2882j6045
13436a04562M91l2862K761K7623L7886L6752L1744r092l9016k7509J3921J120
13424f0743l4462m655O3109L956J7348j7793m2653K0292L0259l263M4316K5176
13412D0887l8509l660m7423l9035P27K6715K1553J411K810J4958j1443m2389j5
13399g3413N6267l6557k9706K6976J1581l9508j8483J1976L2955M2665J3258j751
$$ plain form
13387 -3740 -5594 -6805 -15670 -59719 -66042 -50190 -36455 -85280 -95310 -63933 -26067 -18282 17772
13374 17772 -87728 -148126 -107211 -70217 -36674 -38676 -33474 -28261 -37896 16375 25006 35232
13362 35232 14149 -29128 -51718 -85768 -151742 -158730 -197514 -172860 -134706 -136836 -90711 -70806
13350 -70806 -39087 -25245 -46367 -53599 -40341 -57961 -90602 -114968 -171684 -175555 -154111 -151710
13338 -151710 -101525 -44598 -33981 -75565 -82835 -112161 -86188 -74626 -102765 -113967 -73282 -95711
13326 -95711 -91513 -84173 -113603 -103685 -121924 -139784 -95298 -52723 -33236 -67021 -25427 40238
13314 40238 23390 -22996 -15182 -37728 -47498 -62382 -52577 -34699 -13349 15910 21869 34366
13302 34366 -11150 -70355 1620 43026 -8203 -41756 -38573 -8921 -12828 -90309 -77489 -44074
$$ packed form
13387c740j854j211q865m4049o323J5852J3735m8825j0030L1377L7866P785L6054
13374A7772j05500o0398M0915L6994L3543k002N202N213r635N4271Q631J0226
13362C5232k1083m3277k2590l4050o5974o988l8784K4654L8154k130M6125J9905
13350g0806L1719J3842k1122p232J3258j7620l2641k4366n6716l871K1444K401
13338a51710N0185N6927J0617m1584p270k9326K5973J1562k8139j1202M0685k2429
13326i5711M198P340k9430R918j8239j7860M4486M2575J9487l3785M1594O5665
13314D0238j6848m6386P814k2546r770j4884R805J7878K1350K9259N959J2497
13302C4366m5516n9205P1975M1406n1229l3553L183K9652l907p7481J2820L3415
$$ plain form
13290 -44074 -29243 -83754 -48160 -7171 -20622 27700 86997 23266 -15760 -75678 -129828 -115071
13278 -115071 -40033 2784 -54093 -12912 -1176 8818 -9387 -21513 -44188 -72915 -94391 -75849
13266 -75849 -47501 -29810 -22805 -28550 -79294 -78692 -87893 -35359 -13037 -10415 5130 -6946 -26425
13253 -26425 -54429 -83574 -56360 -34567 -121979 -124666 -103347 -53179 -115640 -169576 -122508 -115037
13241 -115037 -52938 22909 58251 99327 100870 66182 19606 2533 1396 160 -30175 -58298
13229 -58298 -66877 -63067 -97861 -104417 -90670 -88705 -133478 -144800 -142334 -159556 -113918 -65251 -19592
13216 -19592 24524 -12403 2684 31524 6998 24346 29818 -28652 -55000 -27324 53474 35320
13204 35320 11275 -17763 -85661 -125965 -102677 -121204 -86332 -35699 -56910 -79708 -39362 -56824
$$ packed form
13290d4074J4831n4511L5594M0989j3451M8322N9297o3731l9026n9918n4150J4757
13278a15071P5038M2817n6877M1181J1736R994j8205j2126k2675k8727k1476J8542
13266g5849K8348J7691P005n745n0744O02r201N2534K2322K622J5545j2076j9479
13253b6425k8004k9145K7214K1793q7412k687K1319N0168o2461n3936M7068P471
13241a15037O2099P5847L5342M1076J543l4688m6576j7073j137j236l0335k8123
13229e8298q579L810l4794o556J3747J965m4773j1322K466j7222M5638M8667M5659
13216a9592M4116l6927J5087K8840k4526J7348N472n8470k6348K7676Q0798j8154
13204C5320k4045k9038o7898m0304K3288j8527L4872N0633k1211k2798M0346j7462
$$ plain form
13192 -56824 -92854 -41499 -77755 -93157 -30858 -7822 30790 62481 65414 -8407 -76530 -116379
13180 -116379 -109099 -54649 -6826 29596 12773 8794 4477 9263 32 -18104 -16179 -34348 -90124
13167 -90124 -141978 -110502 -98189 -56647 -22634 -53956 -80723 -52087 -55472 -74668 -115970 -68661
13155 -68661 -23221 -12222 -53580 -106599 -71461 -40306 -34498 -44972 -62367 -102153 -97447 -94789
13143 -94789 -122194 -122481 -32279 -8368 -16979 -43837 -54554 -53807 -35914 -73160 -70583 -63590 12088
13130 12088 -16956 -62580 -45550 -27784 -37093 -90838 -97709 -29674 -40294 -75751 -27361 47623
13118 47623 57991 12439 -55123 -106547 -126742 -69129 -80530 -143015 -135081 -99980 -94414 -31693
13106 -31693 -31075 -35203 -40894 -40982 -8348 -5910 -17135 -35671 -68335 -88080 -63103 -56093 -921
$$ packed form
13192e6824l6030N1355l6256j5402O2299K3036L8612L1691K933p3821o8123l9849
13180a16379P280N4450M7823L6422j6823l979m317M786r231j8136J925j8169n5776
13167i0124n1854L1476J2313M1542L4013l1322k6767K8636l385j9196m1302M7309
13155f8661M5440J0999m1358n3019L5138L1155N808j0474j7395l9786M706K658
13143i4789k7405k87R0202K3911q611k6858j0717P47J7893l7246K577O993P5678
13130A2088k9044m5624J7030J7766r309n3745o871O8035j0620l5457M8390P4984
13118D7623J0368m5552o7562n1424k0195N7613j1401o2485P934L5101N566O2721
13106c1693O18m128n691q8L2634K438j1225j8536l2664j9745K4977P010N5172
$$ plain form
13093 -921 -2127 -44873 -16849 16844 8246 4544 -8208 -22177 -34488 -72417 -63502 -52953 -10715
13080 -10715 -75710 -123775 -98268 -90858 -30959 -40718 -95596 -113376 -92018 -100276 -129907 -110316
13068 -110316 -50748 5522 14013 -31221 -124493 -133465 -103620 -85052 -71860 -101610 -114261 -94967
13056 -94967 -102150 -173014 -182461 -93791 -18557 40723 93413 103571 17441 51247 48601 33619
13044 33619 39628 32076 38265 38829 -33452 -53423 -47501 -23657 -13597 -20727 -72793 -62788 -80868
13031 -80868 -101020 -80834 -43732 -69448 -127324 -125693 -96555 -80830 -98206 -62310 -65997 -102880
13019 -102880 -72839 -45572 28655 43722 -7524 -75819 -118970 -104212 -149297 -154983 -72353 -52325
13007 -52325 -72314 -14197 4276 -6652 -8793 -12734 -50207 -48130 14472 37742 51798 30749
$$ packed form
13093i21j206m2746K8024L3693q598l702j2752j3969j2311l7929Q915J0549M2238
13080a0715o4995m8065K5507P410N9899r759n4878j7780K1358q258k9631J9591
13068a10316N9568N6270Q491m5234r3272q972K9845J8568J3192k9750j2651J9294
13056i4967p183p0864r447Q8670P5234N9280N2690J0158q6130L3806k646j4982
13044C3619O009p552O189N64p2281j9971N922K3844J0060p130n2066J0005j8080
13031h0868k0152K0186L7102k5716n7876J631K9138J5725j7376L5896l687l6883
13019a02880L0041K7267P4227J5067n1246o8295m3151J4758m5085n686Q2630K0028
13007e2325j9989N8117J8473j0928k141l941l7473K077O2602K3270J4056k1049
$$ [...]
##END NTUPLES=NMR SPECTRUM
##END=
