##TITLE=Analysis number 316897
Compound Code cc 49928
Book Reference 458/88
Project Code adrs
Chemist Name stevem
##JCAMPDX= 6.0         $$ Bruker NMR JCAMP-DX V2.0
##DATA TYPE= NMR SPECTRUM
##DATA CLASS= NTUPLES
##ORIGIN= Bruker BioSpin GmbH
##OWNER= nmr
$$ XWIN-NMR		Version 3.5
$$ Tue Jan 31 11:38:51 2006 GMT Standard Time (UT+0h)  MAYBRIDGE\nmr@NMR_250MHZ
##.OBSERVE FREQUENCY= 250.131544655141
##.OBSERVE NUCLEUS= ^1H
##.ACQUISITION MODE= SIMULTANEOUS (DQD)
##.ACQUISITION SCHEME= undefined
##.AVERAGES= 16
##.DIGITISER RES= 18
##SPECTROMETER/DATA SYSTEM= dpx250
##.PULSE SEQUENCE= zg30
##.SOLVENT NAME= CDCl3
##.SHIFT REFERENCE= (INTERNAL, CDCl3, 0, 16.522)
##AUDIT TRAIL= $$ (NUMBER, WHEN, WHO, WHERE, WHAT)
$$ ##TITLE= Audit trail, XWIN-NMR		Version 3.5
$$ ##JCAMPDX= 5.01
$$ ##ORIGIN= Bruker BioSpin GmbH
$$ ##OWNER= nmr
$$ C:\u/data/dgb/nmr/ADRS/15430/pdata/1/auditp.txt
$$ ##AUDIT TRAIL=  $$ (NUMBER, WHEN, WHO, WHERE, WHAT)
(   1,<2006-01-31 11:38:26.52 +000>,<MAYBRIDGE\nmr>,<NMR_250MHZ>,
      <created by zg, POWCHK disabled, PULCHK disabled
       configuration hash MD5:
       62 19 C7 07 E1 42 D1 B7 37 6C 3D D0 77 39 F9 E6
       data hash MD5: 64K
       DD 6D 65 0C 8A 8A E6 6A 6D 37 F7 9D 7F 5A 9D 31>)
(   2,<2006-01-31 11:38:40.95 +000>,<MAYBRIDGE\nmr>,<NMR_250MHZ>,
      <Start of raw data processing
       ef LB = 0.3 FT_mod = 6 PKNL = 1 SI = 32K 
       data hash MD5: 32K
       1F 6E E0 67 C2 A5 0C 2F C6 23 A7 E5 F0 43 66 94>)
(   3,<2006-01-31 11:38:42.98 +000>,<MAYBRIDGE\nmr>,<NMR_250MHZ>,
      <apk 
       data hash MD5: 32K
       16 9A B0 8E A8 06 4B 1E 35 2A 5C 6F C4 05 F5 64>)
(   4,<2006-01-31 11:38:43.88 +000>,<MAYBRIDGE\nmr>,<NMR_250MHZ>,
      <abs ABSG = 5 
       data hash MD5: 32K
       FA C2 81 EA B6 CC 4F D4 A6 03 DF 87 20 68 B6 93>)
$$ ##END=
$$ 
$$ hash MD5
$$ CF 56 97 CB CF 4C 10 43 EC 1E A5 46 DC BA 40 BB
##$RELAX= 
##$RELAX= 
##$RELAX= 
##$RELAX= 
##$RELAX= 
##$RELAX= 
##$RELAX= 
$$ Bruker specific parameters
$$ --------------------------
##$DU= <C:\u>
##$EXPNO= 15430
##$NAME= <ADRS>
##$PROCNO= 1
##$TYPE= <nmr>
##$USER= <dgb>
##$AMP= (0..31)
100 100 100 100 100 100 100 100 100 100 100 100 100 100 100 100 100 100 
100 100 100 100 100 100 100 100 100 100 100 100 100 100 
##$AQSEQ= 0
##$AQ_mod= 3
##$AUNM= <au_zg>
##$AUTOPOS= <20 >
##$BF1= 250.13
##$BF2= 250.13
##$BF3= 250.13
##$BF4= 250.13
##$BF5= 500.13
##$BF6= 500.13
##$BF7= 500.13
##$BF8= 500.13
##$BYTORDA= 1
##$CFDGTYP= 0
##$CFRGTYP= 5
##$CHEMSTR= <none>
##$CNST= (0..31)
1 1 145 1 1 1 1 1 1 1 1 1 1 1 1 1 1 1 1 1 1 1 1 1 1 1 1 1 1 1 1 1 
##$CPDPRG= <>
##$CPDPRG1= <>
##$CPDPRG2= <>
##$CPDPRG3= <>
##$CPDPRG4= <mlev>
##$CPDPRG5= <mlev>
##$CPDPRG6= <mlev>
##$CPDPRG7= <mlev>
##$CPDPRG8= <mlev>
##$CPDPRGB= <>
##$CPDPRGT= <>
##$D= (0..31)
0 1 0 0 0 0 0 0 0 0.06 0 0 0 0 0 0 0.0002 0 0 0 0 0 0 0 0 0 0 0 0 0 0 
0 
##$DATE= 1138707505
##$DBL= (0..7)
120 120 120 120 120 120 120 120 
##$DBP= (0..7)
150 150 150 150 150 150 150 150 
##$DBP07= 0
##$DBPNAM0= <>
##$DBPNAM1= <>
$$ [...]
##$SUBNAM7= <"">
##$SUBNAM8= <"">
##$SUBNAM9= <"">
##$SW= 20.6930455092707
##$SWIBOX= (0..15)
0 0 3 0 0 0 0 0 0 0 0 0 0 0 0 0 
##$SW_h= 5175.983436853
##$TD= 65536
##$TD0= 1
##$TE= 293.16
##$TE2= 300
##$TE3= 300
##$TEG= 300
##$TL= (0..7)
0 120 120 120 120 120 120 120 
##$TP= (0..7)
150 150 150 150 150 150 150 150 
##$TP07= 0
##$TPNAME0= <>
##$TPNAME1= <>
##$TPNAME2= <>
##$TPNAME3= <>
##$TPNAME4= <>
##$TPNAME5= <>
##$TPNAME6= <>
##$TPNAME7= <>
##$TPOAL= (0..7)
0.5 0.5 0.5 0.5 0.5 0.5 0.5 0.5 
##$TPOFFS= (0..7)
0 0 0 0 0 0 0 0 
##$TUNHIN= 0
##$TUNHOUT= 0
##$TUNXOUT= 0
##$USERA1= <user>
##$USERA2= <user>
##$USERA3= <user>
##$USERA4= <user>
##$USERA5= <user>
##$V9= 5
##$VALIST= <valist>
##$VCLIST= <CCCCCCCCCCCCCCC>
##$VD= 0
##$VDLIST= <DDDDDDDDDDDDDDD>
##$VPLIST= <PPPPPPPPPPPPPPP>
##$VTLIST= <TTTTTTTTTTTTTTT>
##$WBST= 1024
##$WBSW= 4
##$XGAIN= (0..3)
0 0 0 0 
##$XL= 0
##$YL= 0
##$YMAX_a= 630060
##$YMIN_a= -672847
##$ZGOPTNS= <>
##$ZL1= 120
##$ZL2= 120
##$ZL3= 120
##$ZL4= 120
##$ABSF1= 16.522
##$ABSF2= -4.171173
##$ABSG= 5
##$ABSL= 3
##$ALPHA= 0
##$AQORDER= 0
##$ASSFAC= 0
##$ASSFACI= 0
##$ASSFACX= 0
##$ASSWID= 0
##$AUNMP= <proc_1d>
##$AZFE= 0.1
##$AZFW= 0.1
##$BCFW= 0
##$BC_mod= 0
##$BYTORDP= 0
##$COROFFS= 0
##$CY= 12.5
##$DATMOD= 1
##$DC= 0
##$DFILT= <>
##$DTYPP= 0
##$F1P= 14.0000005364418
##$F2P= -0.99999901652339
##$FCOR= 0.5
##$FTSIZE= 32768
##$FT_mod= 6
##$GAMMA= 0
##$GB= 0
##$INTBC= 1
##$INTSCL= 1
##$ISEN= 128
##$LB= 0.3
##$LEV0= 0
##$LPBIN= 0
##$MAXI= 10000
##$MC2= 0
##$MEAN= 0
##$ME_mod= 0
##$MI= 0
##$NCOEF= 0
##$NC_proc= -2
##$NLEV= 6
##$NOISF1= 0
##$NOISF2= 0
##$NSP= 0
##$NTH_PI= 0
##$NZP= 0
##$OFFSET= 16.522
##$PC= 1
##$PHC0= 100.7235
##$PHC1= 5.906605
##$PH_mod= 1
##$PKNL= yes
##$PPARMOD= 0
##$PSCAL= 4
##$PSIGN= 0
##$REVERSE= no
##$SF= 250.13
##$SI= 32768
##$SIGF1= 0
##$SIGF2= 0
##$SINO= 400
##$SIOLD= 32768
##$SREGLST= <1H.CDCl3>
##$SSB= 0
##$STSI= 32768
##$STSR= 0
##$SW_p= 5175.98343685301
##$SYMM= 0
##$S_DEV= 0
##$TDeff= 65536
##$TDoff= 0
##$TI= <Analysis number 999999
Compound Code 99
Book Reference 9
Project Code 9>
##$TILT= no
##$TM1= 0
##$TM2= 0
##$TOPLEV= 0
##$USERP1= <user>
##$USERP2= <user>
##$USERP3= <user>
##$USERP4= <user>
##$USERP5= <user>
##$WDW= 1
##$XDIM= 32768
##$YMAX_p= 432845656
##$YMIN_p= -87911
$$ End of Bruker specific parameters
$$ ---------------------------------
##NTUPLES= NMR SPECTRUM
##VAR_NAME=  FREQUENCY,     SPECTRUM/REAL,   SPECTRUM/IMAG
##SYMBOL=    X,             R,               I
##VAR_TYPE=  INDEPENDENT,   DEPENDENT,       DEPENDENT
##VAR_FORM=  AFFN,          ASDF,            ASDF
##VAR_DIM=   32768,         32768,           32768
##UNITS=     HZ,            ARBITRARY UNITS, ARBITRARY UNITS
##FACTOR=    0.157963299565203, 1,           1
##FIRST=     4132.6476996994, 0,             0
##LAST=      -1043.33573715361, 0,           0
##MIN=       -1043.33573715361, -87911,      0
##MAX=       4132.6476996994, 432845656,     0
$$ Real data points
##PAGE= N=1
##DATA TABLE= (X++(R..R)), XYDATA
$$ [...]
##PAGE= N=2
##DATA TABLE= (X++(I..I)), XYDATA
$$ plain form
16262 -1753954 -1751238 -1748381 -1744274 -1740795 -1734929 -1730339 -1727336 -1726923 -1729973 -1728631 -1725269 -1727540 -1722024 -1715996
16248 -1715996 -1720831 -1730962 -1725497 -1728045 -1727050 -1728165 -1726730 -1723141 -1722607 -1726503 -1722312 -1720020 -1726259 -1723903
16234 -1723903 -1717424 -1722643 -1717798 -1708054 -1699592 -1696650 -1702391 -1706474 -1709301 -1707501 -1704161 -1696942 -1693700 -1699712
16220 -1699712 -1702457 -1697431 -1694593 -1692305 -1693002 -1694117 -1686398 -1684515 -1685842 -1689486 -1693961 -1697920 -1692625 -1691766
16206 -1691766 -1701921 -1702882 -1697881 -1687569 -1674927 -1669035 -1663308 -1664199 -1668957 -1671273 -1661484 -1661915 -1663466 -1660188
16192 -1660188 -1666004 -1668894 -1662664 -1664151 -1667781 -1662054 -1653792 -1654767 -1659123 -1655597 -1658649 -1661513 -1654322 -1647493
16178 -1647493 -1649985 -1648923 -1643447 -1648264 -1656398 -1653801 -1649125 -1649362 -1650521 -1642135 -1632702 -1633643 -1635537 -1635452 -1633861
16163 -1633861 -1627119 -1629390 -1628184 -1631681 -1638594 -1633078 -1629688 -1625688 -1616983 -1614096 -1614313 -1615605 -1613472 -1609715
$$ packed form
16262a753954K716K857M107L479N866M590L003M13l050J342L362k271N516O028
16248a715996m835j0131N465k548R95j115J435L589N34l896M191K292o239K356
16234a723903O479n219M845R744Q462K942n741m083k827J800L340P219L242o012
16220a699712k745N026K838K288o97j115P719J883j327l644m475l959N295Q59
16206a691766j0155r61N001J0312J2642N892N727q91m758k316R789m31j551L278
16192a660188n816k890O230j487l630N727Q262r75m356L526l052k864P191O829
16178a647493k492J062N476m817q134K597M676k37j159Q386R433r41j894Q5J591
16163a633861O742k271J206l497o913N516L390M000Q705K887k17j292K133L757
$$ plain form
16149 -1609715 -1608859 -1610532 -1607963 -1609848 -1610729 -1607593 -1607768 -1607278 -1607199 -1605132 -1597607 -1594138 -1586706 -1582613 -1589309
16134 -1589309 -1596038 -1589471 -1585007 -1593958 -1593594 -1595865 -1593953 -1596361 -1599448 -1598140 -1591500 -1591230 -1590005 -1589453 -1587147
16119 -1587147 -1586413 -1580575 -1580913 -1583013 -1579715 -1576092 -1580236 -1579676 -1576242 -1568267 -1571435 -1580367 -1580293 -1573483 -1571241
16104 -1571241 -1569199 -1566510 -1569999 -1569081 -1571169 -1575747 -1568723 -1560001 -1558046 -1563373 -1564646 -1566681 -1564435 -1560271
16090 -1560271 -1558929 -1557925 -1557728 -1558431 -1554153 -1547997 -1544653 -1540907 -1542318 -1546492 -1546623 -1544098 -1540261 -1536216 -1530155
16075 -1530155 -1523755 -1521766 -1522945 -1527047 -1530561 -1537859 -1537964 -1532021 -1531527 -1530735 -1531769 -1530724 -1530456 -1525328 -1517236
16060 -1517236 -1520098 -1521600 -1517163 -1512358 -1515408 -1516648 -1517050 -1516521 -1516310 -1521647 -1513172 -1507292 -1506089 -1513480 -1513725
16045 -1513725 -1504383 -1500687 -1495819 -1494147 -1497065 -1500959 -1496960 -1496078 -1496773 -1497194 -1502727 -1500332 -1498102 -1493345 -1496963
$$ packed form
16149a609715Q56j673K569j885q81L136j75M90P9K067P525L469P432M093o696
16134a589309o729O567M464q951L64k271J912k408l087J308O640K70J225N52K306
16119a587147P34N838l38k100L298L623m144N60L434P975l168q932P4O810K242
16104a571241K042K689l489R18k088m578P024Q722J955n327j273k035K246M164
16090a560271J342J004J97p03M278O156L344L746j411m174j31K525L837M045O061
16075a530155O400J989j179m102l514p298j05N943M94P92j034J045K68N128Q092
16060a517236k862j502M437M805l050j240m02N29K11n337Q475N880J203p391k45
16045a513725R342L696M868J672k918l894L999Q82o95m21n533K395K230M757l618
$$ plain form
16030 -1496963 -1497126 -1491143 -1499841 -1495454 -1494508 -1492370 -1489460 -1496070 -1501123 -1499807 -1492990 -1490520 -1489676 -1488083 -1484817
16015 -1484817 -1484694 -1481729 -1473729 -1468967 -1471166 -1471732 -1474438 -1470613 -1474260 -1484099 -1483158 -1475319 -1471723 -1472301 -1475461
16000 -1475461 -1471910 -1469293 -1463431 -1460864 -1462750 -1463001 -1460595 -1462674 -1465052 -1464021 -1463486 -1462629 -1459044 -1452394 -1456037
15985 -1456037 -1460370 -1447223 -1441578 -1441122 -1439989 -1449487 -1452568 -1447913 -1443360 -1445250 -1445933 -1445781 -1443757 -1439764
15971 -1439764 -1432005 -1433424 -1434239 -1439129 -1431575 -1425932 -1429494 -1432670 -1432198 -1429666 -1429590 -1424595 -1420691 -1425351 -1435200
15956 -1435200 -1430670 -1422303 -1417540 -1418516 -1417029 -1417116 -1417366 -1412086 -1406423 -1407294 -1410010 -1416805 -1418311 -1413377 -1414510
15941 -1414510 -1417650 -1405738 -1405113 -1404036 -1401970 -1402953 -1402614 -1403135 -1403922 -1403234 -1402266 -1396600 -1400786 -1400295 -1399733 -1397565
15925 -1397565 -1390273 -1393917 -1399176 -1399790 -1399173 -1402737 -1399863 -1394281 -1390703 -1387771 -1387827 -1393635 -1394904 -1385586 -1381389
$$ packed form
16030a496963j63N983q698M387R46K138K910o610n053J316O817K470Q44J593L266
16015a484817J23K965Q000M762k199n66k706L825l647r839R41P839L596n78l160
16000a475461L551K617N862K567j886k51K406k079k378J031N35Q57L585O650l643
15985a456037m333J3147N645M56J133r498l081M655M553j890o83J52K024L993
15971a439764P759j419q15m890P554N643l562l176M72K532P6M995L904m660r849
15956a435200M530Q367M763r76J487q7k50N280N663q71k716o795j506M934j133
15941a414510l140J1912O25J077K066r83L39n21p87O88R68N666m186M91N62K168
15925a397565P292l644n259o14O17l564K874N582L578K932n6n808j269R318M197
$$ plain form
15910 -1381389 -1383371 -1376941 -1371275 -1377652 -1384453 -1382666 -1379289 -1374173 -1374324 -1365029 -1356951 -1361391 -1368473 -1368807
15896 -1368807 -1370246 -1373074 -1373013 -1377270 -1380383 -1373091 -1365664 -1359384 -1359799 -1362827 -1363082 -1364761 -1364752 -1356140 -1348292 -1348971
15880 -1348971 -1347061 -1353071 -1356221 -1355527 -1357546 -1359768 -1357900 -1355066 -1351776 -1341910 -1342270 -1339409 -1340197 -1350655
15866 -1350655 -1354350 -1349488 -1347777 -1350206 -1348010 -1340508 -1340160 -1344208 -1345701 -1349600 -1353240 -1355330 -1349830 -1339093
15852 -1339093 -1332561 -1330177 -1329607 -1329878 -1323658 -1322353 -1320647 -1324652 -1334825 -1339274 -1333871 -1340801 -1341799 -1341443 -1337816
15837 -1337816 -1331058 -1329363 -1326266 -1325663 -1325435 -1320758 -1318311 -1321586 -1324901 -1331782 -1332903 -1333777 -1330181 -1328797 -1332022
15822 -1332022 -1323167 -1314516 -1308126 -1306798 -1307065 -1313418 -1321153 -1313011 -1306195 -1308495 -1297890 -1298659 -1302097 -1304186
15808 -1304186 -1305310 -1301438 -1290838 -1292531 -1295341 -1295842 -1294816 -1295886 -1292272 -1293733 -1296982 -1296868 -1295920 -1291549
$$ packed form
15910a381389j982O430N666o377o801J787L377N116j51R295Q078m440p082l34
15896a368807j439k828O1m257l113P292P427O280m15l028k55j679RQ612P848o79
15880a348971J910o010l150O94k019k222J868K834L290R866l60K861p88j0458
15866a350655l695M862J711k429K196P502L48m048j493l899l640k090N500J0737
15852a339093O532K384N70k71O220J305J706m005j0173m449N403o930r98L56L627
15837a337816O758J695L097O03K28M677K447l275l315o881j121q74L596J384l225
15822a332022Q855Q651O390J328k67o353p735Q142O816k300J0605p69l438k089
15808a304186j124L872J0600j693k810n01J026j070L614j461l249J14R48M371
$$ plain form
15794 -1291549 -1287610 -1285176 -1288233 -1286921 -1284004 -1283739 -1285204 -1274974 -1272115 -1280245 -1283690 -1283633 -1279350 -1281743
15780 -1281743 -1283883 -1286354 -1283547 -1279965 -1280821 -1282858 -1281142 -1274407 -1268591 -1266471 -1261843 -1264742 -1266684 -1265456
15766 -1265456 -1260155 -1263478 -1268722 -1270392 -1270260 -1267010 -1262598 -1255961 -1254449 -1254470 -1251316 -1251563 -1254664 -1247820 -1247560
15751 -1247560 -1257561 -1265485 -1269972 -1272956 -1265414 -1263182 -1258590 -1248040 -1244374 -1246734 -1250687 -1250636 -1247868 -1246403
15737 -1246403 -1243547 -1239584 -1240649 -1235858 -1233802 -1233687 -1235034 -1233767 -1238763 -1243238 -1239986 -1237472 -1236758 -1238063
15723 -1238063 -1239292 -1246071 -1244993 -1236348 -1237258 -1240735 -1238720 -1234718 -1237457 -1244510 -1238470 -1232490 -1227379 -1213983
15709 -1213983 -1216218 -1217566 -1211698 -1209419 -1210195 -1209630 -1212486 -1212332 -1213203 -1217337 -1222170 -1215018 -1207706 -1212594 -1211619
15694 -1211619 -1206328 -1205251 -1197961 -1189317 -1183973 -1190684 -1200366 -1210240 -1211688 -1217921 -1225030 -1233231 -1227726 -1219213
$$ packed form
15794a291549L939K434l057J312K917K65j465J0230K859q130l445N7M283k393
15780a281743k140k471K807L582q56k037J716O735N816K120M628k899j942J228
15766a265456N301l323n244j670J32L250M412O637J512k1L154k47l101O844K60
15751a247560j0001p924m487k984P542K232M592J0550L666k360l953N1K768J465
15737a246403K856L963j065M791K056J15j347J267m996m475L252K514P14j305
15723a238063j229o779J078Q645r10l477K015M002k739p053O040N980N111J3396
15709a213983k235j348N868K279p76N65k856J54q71m134m833P152P312m888R75
15694a211619N291J077P290Q644N344o711r682r874j448o233p109q201N505Q513
$$ plain form
15680 -1219213 -1213278 -1216715 -1216392 -1209517 -1208941 -1205205 -1197168 -1202690 -1202132 -1199732 -1194710 -1193489 -1191680 -1193233 -1202977
15665 -1202977 -1201560 -1199882 -1202144 -1205132 -1199270 -1202001 -1198829 -1193659 -1193622 -1194617 -1197685 -1197843 -1193621 -1180673 -1179140
15650 -1179140 -1181411 -1180681 -1175301 -1175269 -1181775 -1186781 -1185800 -1180988 -1184787 -1184253 -1183878 -1183139 -1176352 -1177871 -1175967 -1180132
15634 -1180132 -1176660 -1179200 -1181620 -1180641 -1182527 -1172639 -1162813 -1159829 -1158469 -1157685 -1163223 -1166803 -1170722 -1174216
15620 -1174216 -1169821 -1161063 -1160936 -1158751 -1157110 -1154765 -1149742 -1153169 -1151148 -1146329 -1145121 -1147478 -1151704 -1154725
15606 -1154725 -1155020 -1154116 -1157344 -1159994 -1151804 -1148942 -1160649 -1165452 -1160759 -1159390 -1154395 -1149684 -1146868 -1137735
15592 -1137735 -1135176 -1142432 -1145351 -1141164 -1144395 -1147208 -1142804 -1136650 -1137814 -1131666 -1140267 -1143422 -1136335 -1136398
15578 -1136398 -1134720 -1139624 -1141179 -1136797 -1134079 -1135613 -1132433 -1131800 -1127264 -1126780 -1118696 -1118645 -1123293 -1126481 -1128079
$$ packed form
15680a219213N935l437L23O875N76L736Q037n522N58K400N022J221J809j553r744
15665a202977J417J678k262k988N862k731L172N170L7r95l068j58M222J2948J533
15650a179140k271P30N380L2o506n006R81M812l799N34L75P39O787j519J904m165
15634a180132L472k540k420R79j886R888R826K984J360P84n538l580l919l494
15620a174216M395Q758J27K185J641K345N023l427K021M819J208k357m226l021
15606a154725k95R04l228k650Q190K862j1707m803M693J369M995M711K816R133
15592a137735K559p256k919M187l231k813M404O154j164O148q601l155P087o3
15578a136398J678m904j555M382K718j534L180O33M536M84Q084N1m648l188j598
$$ plain form
15563 -1128079 -1127572 -1122185 -1124128 -1121633 -1116534 -1114700 -1121445 -1130475 -1131330 -1124772 -1125907 -1127882 -1128155 -1122331 -1114080
15548 -1114080 -1114867 -1112211 -1107105 -1109030 -1103447 -1096446 -1098635 -1107891 -1119252 -1121668 -1118817 -1121383 -1118443 -1112486
15534 -1112486 -1107439 -1104041 -1098868 -1098352 -1101057 -1104040 -1108743 -1113899 -1121578 -1118920 -1108093 -1097740 -1094676 -1090928
15520 -1090928 -1094985 -1102893 -1104545 -1098599 -1092412 -1088490 -1087210 -1093730 -1096944 -1093754 -1096057 -1093612 -1090574 -1075385
15506 -1075385 -1082804 -1092565 -1093144 -1086780 -1084708 -1087237 -1082180 -1078725 -1082885 -1083905 -1074675 -1069320 -1065385 -1065081
15492 -1065081 -1062097 -1061940 -1068042 -1079093 -1085420 -1077107 -1074044 -1070436 -1056973 -1049788 -1048082 -1055951 -1060802 -1067170
15478 -1067170 -1067356 -1069680 -1070727 -1068411 -1071444 -1073384 -1068966 -1064589 -1063216 -1057020 -1053541 -1056443 -1061368 -1060721
15464 -1060721 -1054383 -1056840 -1056939 -1052817 -1056079 -1058724 -1057614 -1055068 -1054189 -1059671 -1061791 -1061335 -1058847 -1059641 -1067944
$$ packed form
15563a128079N07N387j943K495N099J834o745r030q55O558j135j975k73N824Q251
15548a114080p87K656N106j925N583P001k189r256j1361k416K851k566K940N957
15534a112486N047L398N173N16k705k983m703n156p679K658J0827J0353L064L748
15520a090928m057p908j652N946O187L922J280o520l214L190k303K445L038J5189
15506a075385p419r761n79O364K072k529N057L455m160j020R230N355L935L04
15492a065081K984J57o102j1051o327Q313L063L608J3463P185J706p869m851o368
15478a067170j86k324j047K316l033j940M418M377J373O196L479k902m925O47
15464a060721O338k457r9M122l262k645J110K546Q79n482k120M56K488p94q303
$$ plain form
15449 -1067944 -1065156 -1060134 -1051987 -1045222 -1038913 -1042457 -1046331 -1050532 -1047611 -1044790 -1049388 -1051434 -1045952 -1035971
15435 -1035971 -1029110 -1027968 -1036805 -1043866 -1042444 -1039043 -1042181 -1038624 -1034917 -1037461 -1032713 -1024699 -1025078 -1028224
15421 -1028224 -1034611 -1034484 -1033230 -1028650 -1029882 -1036520 -1038836 -1035927 -1030400 -1032621 -1039452 -1037622 -1033853 -1036475
15407 -1036475 -1036908 -1035507 -1028808 -1028263 -1030023 -1027517 -1026874 -1029947 -1029753 -1030572 -1024035 -1019405 -1022906 -1027591 -1025952
15392 -1025952 -1024161 -1022772 -1022609 -1018569 -1012629 -1005701 -1004513 -1005682 -1010316 -1011870 -1015590 -1010428 -1004589 -1005573
15378 -1005573 -999794 -1000594 -1007894 -1005226 -1002440 -1005483 -1008025 -1005914 -1002398 -1006288 -1006951 -1002416 -1000894 -1000243 -993502
15363 -993502 -989031 -986635 -979958 -982625 -991194 -996686 -985363 -982762 -992809 -990171 -984305 -984648 -983992 -983382
15349 -983382 -987540 -992398 -1000239 -1002381 -997393 -992123 -991441 -990380 -987742 -986090 -979680 -977631 -983257 -984013 -982647
$$ packed form
15449a067944K788N022Q147O765O309l544l874m201K921K821m598k046N482R981
15435a035971O861J142q837p061J422L401l138L557L707k544M748Q014l79l146
15421a028224o387J27J254M580j232o638k316K909N527k221o831J830L769k622
15407a036475m33J401O699N45j760K506O43l073J94q19O537M630l501m685J639
15392a025952J791J389J63M040N940O928J188j169m634j554l720N162N839r84
15378a005573N779q00p300K668K786l043k542K111L516l890o63M535J522O51O741
15363i93502M471K396O677k667q569n492J1323K601j0047K638N866l43O56O10
15349i83382m158m858p841k142M988N270O82J061K638J652O410K049n626p56J366
$$ plain form
15334 -982647 -978091 -975405 -969985 -970206 -984730 -981323 -975660 -974804 -977090 -977368 -980033 -984500 -990343 -992395 -983690
15319 -983690 -972321 -965288 -964065 -965837 -972571 -969769 -970177 -967879 -966160 -965287 -970936 -975125 -968649 -967612
15305 -967612 -969973 -970832 -971264 -967965 -963395 -965399 -976890 -970777 -965985 -968741 -975046 -969958 -959680 -957256
15291 -957256 -960199 -957995 -953835 -956979 -962134 -957126 -946744 -944483 -951338 -959945 -958205 -947687 -952757 -956231
15277 -956231 -948631 -936989 -933849 -936952 -942428 -951997 -945498 -940381 -935145 -939468 -941586 -950278 -949603 -945193
15263 -945193 -944258 -943854 -943680 -940710 -934593 -926618 -926447 -926357 -924677 -926185 -930404 -927302 -925494 -933331 -935526 -930952
15247 -930952 -927995 -925369 -921134 -924749 -927511 -932539 -923393 -916513 -919308 -925522 -923205 -917001 -921709 -923297
15233 -923297 -929113 -930885 -920881 -916656 -914418 -915892 -916024 -921274 -921749 -916799 -917235 -918754 -915081 -920275 -918359
$$ packed form
15334i82647M556K686N420k21j4524L407N663Q56k286k78k665m467n843k052Q705
15319i83690J1369P033J223j772o734K802m08K298J719Q73n649m189O476J037
15305i67612k361q59m32L299M570k004j1491O113M792k756o305N088J0278K424
15291i57256k943K204M160l144n155N008J0382K261o855q607J740J0518n070l474
15277i56231P600J1642L140l103n476r569O499N117N236m323k118q692O75M410
15263i45193R35M04J74K970O117P975J71R0J680j508m219L102J808p837k195M574
15247i30952K957K626M235l615k762n028R146O880k795o214K317O204m708j588
15233i23297n816j772J0004M225K238j474j32n250m75M950m36j519L673n194J916
$$ plain form
15218 -918359 -913020 -916018 -914323 -913666 -913901 -907488 -908121 -911944 -912951 -906757 -910176 -911836 -911383 -910083 -907260
15203 -907260 -902941 -901239 -902346 -901283 -902731 -910092 -911214 -903216 -900063 -906515 -907014 -903958 -900810 -897755
15189 -897755 -893616 -890987 -889404 -882150 -879396 -883019 -883697 -886967 -890149 -885449 -885999 -887757 -890439 -892209 -885903
15174 -885903 -883168 -882407 -875400 -870192 -868275 -870155 -879454 -888027 -879187 -865360 -863355 -867420 -874507 -878814
15160 -878814 -877540 -873905 -876209 -870388 -866448 -867004 -868293 -869630 -866942 -859485 -858674 -862563 -866570 -865652 -869675
15145 -869675 -868261 -863156 -865386 -862204 -848156 -854322 -859617 -857141 -856230 -857699 -854491 -858414 -859300 -858033
15131 -858033 -852057 -850947 -853412 -856424 -859525 -859394 -856244 -848448 -844599 -842610 -842485 -845542 -849066 -846120 -844697
15116 -844697 -847643 -847493 -845007 -844755 -850059 -845069 -841234 -846436 -842936 -837853 -829133 -822708 -831630 -837139 -835924
$$ packed form
15218i18359N339k998J695O57k35O413o33l823j007O194l419j660M53J300K823
15203i07260M319J702j107J063j448p361j122P998L153o452m99L056L148L055
15189h97755M139K629J583P254K754l623o78l270l182M700n50j758k682j770O306
15174h85903K735P61P007N208J917j880r299q573Q840J3827K005m065p087m307
15160h78814J274L635k304N821L940n56j289j337K688P457Q11l889m007R18m023
15145h69675J414N105k230L182J4048o166n295K476R11j469L208l923q86J267
15131h58033N976J110k465l012l101J31L150P796L849J989J25l057l524K946J423
15116h44697k946J50K486K52n304M990L835n202L500N083Q720O425q922n509J215
$$ plain form
15101 -835924 -833390 -824558 -830559 -833359 -825689 -825199 -828556 -826791 -823917 -812489 -805767 -804772 -805659 -808545 -816410
15086 -816410 -821700 -817917 -815434 -814868 -816450 -811845 -805815 -810868 -810684 -809615 -803185 -796877 -792923 -800701 -805532
15071 -805532 -798330 -795193 -793737 -790480 -796753 -795148 -790025 -785278 -785582 -784526 -782111 -778461 -772710 -768964
15057 -768964 -764620 -758513 -755936 -753672 -759972 -769910 -771483 -769626 -767318 -757741 -755833 -760722 -765728 -758475
15043 -758475 -757255 -756310 -756514 -753195 -745327 -739659 -737959 -738581 -731707 -730306 -736113 -732178 -726266 -721984 -716026
15028 -716026 -718851 -723699 -717790 -706476 -703360 -701651 -699473 -694903 -691473 -693509 -690299 -681058 -672473 -659660
15014 -659660 -656705 -663584 -658063 -642291 -628711 -619732 -602911 -586762 -578589 -578362 -567570 -548965 -526922
15001 -526922 -515980 -499532 -480995 -456647 -427417 -399769 -369497 -333289 -291352 -238513 -174734
$$ packed form
15101h35924K534Q832o001k800P670M90l357J765K874J1428O722R95q87k886p865
15086h16410n290L783K483N66j582M605O030n053J84J069O430O308L954p778m831
15071h05532P202L137J456L257o273J605N123M747l04J056K415L650N751L746
15057g68964M344O107K577K264o300r938j573J857K308R577J908m889n006P253
15043g58475J220R45k04L319P868N668J700o22O874J401n807L935N912M282N958
15028g16026k825m848N909J1314L116J709K178M570L430k036L210R241Q585J2813
15014f59660K955o879N521J5772J3580Q979J6821J6149Q173K27J0792J8605K2043
15001e26922J0942J6448J8537K4348K9230K7648L0272L6208M1937N2839O3779
$$ plain form
14990 -174734 -91664 15781 148230 322084 540882 733353 625708 -194098 -1213049 -1930739
14980 -1930739 -2173461 -2076487 -1918485 -1779932 -1666527 -1571961 -1497288 -1428926 -1374390 -1330438
14970 -1330438 -1288845 -1251286 -1221172 -1190436 -1162073 -1145381 -1139101 -1132552 -1118452 -1104870 -1095871 -1082213
14958 -1082213 -1070803 -1053290 -1040106 -1030236 -1024042 -1009817 -1002647 -997839 -992180 -982097 -978950 -979361 -971059
14945 -971059 -958893 -947571 -942138 -939136 -929003 -926265 -926319 -925127 -919342 -917016 -912983 -917426 -921718 -920439
14931 -920439 -917561 -918518 -919294 -914870 -907106 -901948 -906739 -903277 -903669 -900263 -890928 -885544 -883101 -877163 -869419
14916 -869419 -863959 -861992 -859829 -866161 -868001 -863285 -861663 -856998 -843438 -834724 -838611 -839375 -840247 -833034
14902 -833034 -835112 -841311 -834285 -829346 -824385 -827296 -823946 -824161 -825689 -831526 -836125 -842112 -846730 -850735
$$ packed form
14990a74734Q3070J07445J32449J73854K18798J92471j07645q19806j018951p17690
14980a930739k42722R6974J58002J38553J13405R4566P4673O8362N4536M3952
14970a330438M1593L7559L0114L0736K8363J6692O280O549J4100J3582Q999J3658
14958a082213J1410J7513J3184R870O194J4225P170M808N659J0083L147m11Q302
14945i71059J2166J1322N433L002J0133K738n4J192N785K326M033m443m292J279
14931i20439K878r57p76M424P764N158m791L462l92L406R335N384K443N938P744
14916h69419N460J967K163o332j840M716J622M665J3560Q714l887p64q72P213
14902h33034k078o199P026M939M961k911L350k15j528n837m599n987m618m005
$$ plain form
14888 -850735 -862172 -864707 -865642 -857982 -854603 -850748 -851518 -851069 -850232 -846333 -834423 -822974 -823693 -824439 -818285
14873 -818285 -812035 -806153 -798535 -792161 -792837 -795114 -795429 -792927 -789946 -788188 -798741 -814122 -823242 -824857
14859 -824857 -827703 -828081 -825011 -821434 -823663 -825377 -823204 -826063 -824991 -826544 -836621 -847481 -853946 -850377
14845 -850377 -842997 -839825 -843830 -837198 -828137 -825939 -826095 -827615 -828398 -824100 -820174 -814958 -805693 -804310 -800484
14830 -800484 -802251 -800776 -795388 -791870 -798248 -797561 -805405 -815071 -816591 -821573 -822029 -828293 -834813 -838190 -840533
14815 -840533 -829758 -826367 -820397 -819723 -824297 -827586 -829107 -828129 -826981 -823420 -825337 -824976 -819015 -815570 -814081
14800 -814081 -813459 -812316 -815072 -813399 -812113 -804504 -798309 -795879 -793853 -795538 -794644 -786569 -791191 -790402 -789039
14785 -789039 -787900 -794128 -789681 -783496 -784482 -786676 -783910 -791663 -799183 -807388 -804609 -800177 -792594 -788410
$$ packed form
14888h50735j1437k535r35P660L379L855p70M49Q37L899J1910J1449p19p46O154
14873h18285O250N882P618O374o76k277l15K502K981J758j0553j5381r120j615
14859h24857k846l78L070L577k229j714K173k859J072j553j0077j0860o465L569
14845h50377P380L172m005O632R061K198j56j520p83M298L926N216R265J383L826
14830h00484j767J475N388L518o378O87p844r666j520m982m56o264o520l377k343
14815h40533J0775L391N970O74m574l289j521R78J148L561j917L61N961L445J489
14800h14081O22J143k756J673J286P609O195K430K026j685Q94Q075m622P89J363
14785g89039J139o228M447O185r86k194K766p753p520q205K779M432P583M184
$$ plain form
14771 -788410 -794450 -793427 -785604 -782912 -781525 -773288 -778878 -784729 -785057 -782043 -783601 -790054 -789237 -781627 -777523
14756 -777523 -778945 -776166 -773504 -771927 -768624 -769255 -769700 -775018 -777470 -772289 -765403 -755587 -752706 -750510 -751399
14741 -751399 -752477 -754491 -753959 -763255 -772695 -773986 -770466 -762927 -761546 -758380 -753154 -751729 -755277 -759917
14727 -759917 -760993 -762661 -757948 -759582 -764409 -764332 -764930 -761241 -758984 -756719 -753577 -756983 -753506 -749958 -741639
14712 -741639 -741244 -742340 -744351 -747614 -750636 -746717 -749325 -740521 -736692 -740169 -748561 -744874 -744082 -742700 -745099
14697 -745099 -747447 -742924 -743331 -747932 -743465 -735082 -731060 -737175 -739933 -738674 -742044 -740584 -735430 -732721
14683 -732721 -725757 -725239 -730307 -736575 -734355 -732700 -732116 -733511 -732264 -729452 -733981 -734596 -728452 -725744 -728746
14668 -728746 -729984 -732421 -726500 -717275 -721083 -725471 -730023 -722743 -716433 -718342 -720617 -719024 -716294 -717922
$$ packed form
14771g88410o040J023P823K692J387Q237n590n851l28L014j558o453Q17P610M104
14756g77523j422K779K662J577L303o31m45n318k452N181O886R816K881K196q89
14741g51399j078k014N32r296r440j291L520P539J381L166N226J425l548m640
14727g59917j076j668M713j634m827P7n98L689K257K265L142l406L477L548Q319
14712g41639L95j096k011l263l022L919k608Q804L829l477q392L687P92J382k399
14697g45099k348M523m07m601M467Q383M022o115k758J259l370J460N154K709
14683g32721O964N18n068o268K220J655N84j395J247K812m529o15O144K708l002
14668g28746j238k437N921R225l808m388m552P280O310j909k275J593K730j628
$$ plain form
14654 -717922 -720619 -719213 -717950 -725511 -732663 -733081 -723760 -725282 -729280 -730235 -725882 -723301 -721265 -717373 -713650
14639 -713650 -712645 -707092 -710393 -711297 -706412 -706635 -712950 -704155 -706305 -709601 -709102 -711698 -714282 -708726 -703781
14624 -703781 -704209 -704686 -707411 -700033 -694954 -698593 -704685 -705950 -703666 -703298 -702915 -701121 -700175 -697510 -692410
14609 -692410 -695516 -696986 -690416 -687018 -687795 -688841 -693097 -698827 -708744 -715046 -715762 -712536 -702094 -692248
14595 -692248 -691599 -696358 -695107 -688766 -684704 -686245 -691433 -693295 -692162 -688140 -688974 -688145 -685469 -683191 -686236
14580 -686236 -688395 -683571 -688717 -693250 -686625 -676599 -672991 -675973 -682494 -687235 -689293 -686657 -687782 -683063
14566 -683063 -677903 -682279 -678690 -676048 -675346 -673614 -675681 -670474 -670451 -670523 -672888 -669632 -671276 -674048 -676701
14551 -676701 -672346 -670146 -667267 -663949 -662480 -667973 -672510 -670860 -671245 -669099 -668768 -670561 -666109 -662880 -667048
$$ packed form
14654g17922k697J406J263p561p152m18R321j522l998r55M353K581K036L892L723
14639g13650J005N553l301r04M885k23o315Q795k150l296M99k596k584N556M945
14624g03781m28m77k725P378N079l639o092j265K284L68L83J794R46K665N100
14609f92410l106j470O570L398p77j046m256n730r917o302p16L226J0442R846
14595f92248O49m759J251O341M062j541n188j862J133M022q34Q29K676K278l045
14580f86236k159M824n146m533O625J0026L608k982o521m741k058K636j125M719
14566f83063N160m376L589K642P02J732k067N207K3p2k365L256j644k772k653
14551f76701M355K200K879L318J469n493m537J650l85K146L31j793M452L229m168
$$ plain form
14536 -667048 -671804 -675818 -676766 -673759 -669571 -663434 -662389 -658539 -663950 -666257 -660158 -659323 -656988 -657879 -660199
14521 -660199 -664894 -658331 -652960 -657275 -667798 -668167 -662931 -654625 -651462 -650300 -648929 -649275 -648804 -653992 -658914
14506 -658914 -658912 -656863 -656478 -654161 -650521 -653609 -656147 -658605 -654753 -650597 -647811 -654991 -663950 -657329 -657588
14491 -657588 -663048 -655689 -651740 -658029 -660189 -655454 -646103 -645291 -648419 -645446 -639019 -639116 -643122 -647219 -648563
14476 -648563 -642116 -642112 -639997 -640959 -638552 -638442 -638442 -641286 -638164 -636535 -635433 -639868 -635114 -629659 -623046 -632872
14460 -632872 -637965 -639445 -643764 -643721 -644793 -643286 -637453 -632420 -631078 -627701 -631766 -633812 -636070 -632314 -635033
14445 -635033 -634636 -633662 -634258 -635587 -629454 -622797 -615767 -614977 -617895 -618777 -618071 -618965 -620450 -629147 -632193 -624831
14429 -624831 -619430 -623898 -628388 -629587 -635133 -634400 -631667 -625717 -620907 -622993 -615908 -613751 -615754 -619531
$$ packed form
14536f67048m756m014r48L007M188O137J045L850n411k307O099Q35K335q91k320
14521f60199m695O563N371m315j0523l69N236Q306L163J162J371l46M71n188m922
14506f58914KK049L85K317L640l088k538k458L852M156K786p180q959O621k59
14491f57588n460P359L949o289k160M735R351Q12l128K973O427r7m006m097j344
14476f48563O447MK115r62K407J10%k844L122J629J102m435M754N455O613r826
14460f32872n093j480m319M3j072J507N833N033J342L377m065k046k258L756k719
14445f35033L97R74n96j329O133O657P030P90k918q82P06q94j485q697l046P362
14429f24831N401m468m490j199n546P33K733N950M810k086P085K157k003l777
$$ plain form
14415 -619531 -615583 -612485 -611977 -612589 -614112 -612095 -613777 -615129 -619833 -624956 -618861 -608807 -609510 -610708 -611266
14400 -611266 -610717 -605215 -605864 -610971 -615953 -612852 -613627 -612176 -608781 -606533 -604157 -608520 -610820 -613791 -613420
14385 -613420 -613296 -607569 -594504 -594358 -598402 -600953 -606202 -610202 -603605 -608087 -604302 -597736 -596711 -601665
14371 -601665 -603360 -603349 -607113 -600979 -601193 -600498 -603259 -606258 -600597 -600411 -596459 -595214 -597435 -595057 -596138
14356 -596138 -599052 -601265 -600745 -601193 -598803 -597266 -600974 -597939 -595655 -593138 -595586 -586012 -581119 -577807 -575734
14341 -575734 -583423 -589988 -591628 -593705 -593851 -589197 -589619 -587095 -584423 -584897 -591555 -595224 -598131 -591939 -587274
14326 -587274 -588129 -583787 -582748 -581664 -589051 -593129 -595386 -592592 -591301 -588541 -579111 -580634 -589807 -594402
14312 -594402 -585582 -580816 -581303 -579332 -578885 -585251 -589877 -588380 -585007 -582012 -584946 -582011 -575644 -572796 -575103
$$ packed form
14415f19531L948L098N08o12j523K017j682j352m704n123O095J0054p03j198n58
14400f11266N49N502o49n107m982L101p75J451L395K248K376m363k300k971L71
14385f13420J24N727J3065J46m044k551n249m000O597m482L785O566J025m954
14371f01665j695J1l764O134k14O95k761k999N661J86L952J245k221K378j081
14356e96138k914k213N20m48K390J537l708L035K284K517k448R574M893L312K073
14341e75734p689o565j640k077j46M654m22K524K672m74o658l669k907O192M665
14326e87274q55M342J039J084p387m078k257K794J291K760R430j523r173m595
14312e94402Q820M766m87J971M47o366m626J497L373K995k934K935O367K848k307
$$ plain form
14297 -575103 -576311 -579263 -581485 -573617 -572435 -578479 -578165 -574046 -570221 -564575 -568412 -566069 -563594 -569527
14283 -569527 -574905 -579246 -571632 -568654 -566855 -568238 -573369 -574081 -570811 -572024 -573068 -569938 -568630 -565653
14269 -565653 -567222 -570671 -569118 -565045 -561983 -558246 -557125 -553536 -553882 -558966 -559795 -564049 -557855 -554166 -561834
14254 -561834 -566542 -564883 -559814 -555533 -548378 -548193 -558679 -565203 -565665 -565184 -556913 -555301 -555864 -559868 -561301
14239 -561301 -562628 -562118 -565085 -560567 -548773 -550400 -549312 -553759 -557743 -556452 -549246 -545783 -545058 -534122
14225 -534122 -531479 -541630 -546445 -551298 -552688 -549420 -547436 -547441 -543750 -542194 -540776 -540948 -541463 -543878 -538512
14210 -538512 -534350 -539442 -541765 -542950 -540924 -544271 -546864 -546126 -547229 -541820 -535780 -537821 -545876 -543258
14196 -543258 -538121 -536971 -539842 -541296 -541200 -538376 -534617 -533816 -532232 -532765 -527134 -528013 -535111 -539956 -537846
$$ packed form
14297e75103j208k952k222P868J182o044L14M119L825N646l837K343K475n933
14283e69527n378m341P614K978J799j383n131p12L270j213j044L130J308K977
14269e65653j569l449J553M073L062L737J121L589l46n084q29m254O194L689p668
14254e61834m708J659N069M281P155J85j0486o524m62M81Q271J612n63m004j433
14239e61301j327N10k967M518J1794j627J088m447l984J291P206L463P25J0936
14225e34122K643j0151m815m853j390L268J984nL691J556J418j72n15k415N366
14210e38512M162n092k323j185K026l347k593P38j103N409O040k041q055K618
14196e43258N137J150k871j454R6K824L759Q01J584n33N631q79p098m845K110
$$ plain form
14181 -537846 -539979 -539612 -537595 -538279 -538963 -531663 -526177 -527676 -532766 -538913 -539921 -540831 -541979 -538920 -537248
14166 -537248 -519657 -516427 -518797 -523279 -521240 -513018 -518058 -525388 -529646 -530203 -529003 -524628 -520672 -519205
14152 -519205 -523776 -529575 -535529 -542547 -537856 -531698 -529051 -528658 -523056 -513623 -510007 -506623 -510113 -513316
14138 -513316 -516713 -518972 -514248 -515920 -513835 -506625 -510666 -512941 -513350 -518757 -518187 -515715 -507878 -507115 -515194
14123 -515194 -524465 -522695 -524033 -522664 -510806 -511464 -511412 -505390 -508021 -511877 -516332 -513690 -511140 -518283 -515276
14108 -515276 -510491 -511519 -511557 -509207 -508980 -508499 -510209 -506993 -506293 -509373 -507240 -505499 -508601 -510714 -510165 -512097
14092 -512097 -509721 -503680 -499014 -496943 -503289 -506311 -512423 -506784 -506512 -502455 -496610 -497393 -493613 -489646 -497298
14077 -497298 -497816 -494131 -494026 -501193 -508815 -505246 -494920 -497346 -499433 -500582 -495436 -484417 -483747 -484682 -485901
$$ packed form
14181e37846k133L67K017o84o84P300N486j499n090o147j008r10j148L059J672
14166e37248J7591L230k370m482K039Q222n040p330m258n57J200M375L956J467
14152e19205m571n799n954p018M691O158K647L93N602R433L616L384l490l203
14138e13316l397k259M724j672K085P210m041k275m09n407N70K472P837P63q079
14123e15194r271J770j338J369J1858o58N2O022k631l856m455K642K550p143L007
14108e15276M785j028l8K350K27M81j710L216P00l080K133J741l102k113N49j932
14092e12097K376O041M666K071o346l022o112N639K72M057N845p83L780L967p652
14077d97298n18L685J05p167p622L569J0326k426k087j149N146J1019O70r35j219
$$ plain form
14062 -485901 -477588 -477596 -487472 -491326 -486153 -486729 -489152 -485890 -486124 -490077 -482521 -481629 -482504 -481371 -485014 -489053
14046 -489053 -492443 -494623 -493987 -486084 -482641 -482628 -484512 -482229 -487655 -492608 -490658 -492153 -498079 -498271 -492018
14031 -492018 -485667 -481140 -478677 -472132 -472781 -475919 -471126 -472609 -482849 -489306 -494791 -491813 -489917 -491304
14017 -491304 -488137 -482738 -477656 -472515 -477758 -484578 -480520 -466299 -462934 -466041 -472566 -468820 -465294 -467931
14003 -467931 -472330 -469979 -471866 -471226 -479015 -478252 -471857 -468994 -470323 -476354 -483521 -483343 -476852 -473737 -464307
13988 -464307 -460806 -457215 -455282 -454051 -453861 -460629 -464286 -472260 -471231 -473368 -472624 -466139 -466804 -463628 -452509
13973 -452509 -455248 -458447 -460790 -462736 -459101 -460907 -460822 -464926 -469032 -468999 -462771 -457891 -459311 -463030 -460627
13958 -460627 -458966 -462739 -464247 -465326 -462858 -463277 -464481 -460575 -456999 -453122 -448002 -449344 -446685 -448050
$$ packed form
14062d85901Q313qr876l854N173n76k423L262k34l953P556Q92q75J133l643m039
14046d89053l390k180O36P903L443J3j884K283n426m953J950j495n926j92O253
14031d92018O351M527K463O545o49l138M793j483j0240o457n485K978J896j387
14017d91304L167N399N082N141n243o820M058J4221L365l107o525L746L526k637
14003d67931m399K351j887O40p789P63O395K863j329o031p167J78O491L115R430
13988d64307L501L591J933J231J90o768l657p974J029k137P44O485o65L176J1119
13973d52509k739l199k343j946L635j806Q5m104m106L3O228M880j420l719K403
13958d60627J661l773j508j079K468m19j204L906L576L877N120j342K659j365
$$ plain form
13944 -448050 -448120 -451351 -456749 -457372 -457735 -450754 -446960 -443051 -444622 -445930 -440917 -443552 -443570 -449908 -453448 -446686
13928 -446686 -442486 -448366 -452057 -451336 -451417 -452824 -453637 -450602 -443588 -438519 -442388 -443703 -438283 -437298 -431609
13913 -431609 -432257 -435486 -439293 -442150 -435435 -435333 -436541 -431244 -432142 -434100 -435184 -429183 -434511 -439540 -442403
13898 -442403 -438392 -436351 -431900 -431656 -431429 -440390 -446330 -436798 -428197 -423022 -426760 -431065 -432779 -425564 -424788
13883 -424788 -423649 -424230 -424225 -426255 -430593 -430398 -426486 -428743 -437063 -440940 -436386 -435148 -436354 -427890 -425094
13868 -425094 -430514 -430119 -430886 -435670 -428710 -434361 -437884 -437868 -438324 -437415 -431315 -427039 -420665 -415754 -415666 -414620
13852 -414620 -413078 -411223 -410443 -413060 -416401 -415601 -419697 -421014 -415518 -411558 -416894 -420194 -420094 -421788 -426269
13837 -426269 -423269 -421804 -419830 -421993 -422191 -418840 -421454 -420862 -418389 -419584 -421935 -421974 -420007 -420657 -412198
$$ packed form
13944d48050p0l231n398o23l63O981L794L909j571j308N013k635j8o338l540O762
13928d46686M200n880l691P21q1j407q13L035P014N069l869j315N420R85N689
13913d31609o48l229l807k857O715J02j208N297q98j958j084O001n328n029k863
13898d42403M011K041M451K44K27q961n940R532Q601N175l738m305j714P215P76
13883d24788J139n81Nk030m338J95L912k257q320l877M554J238j206Q464K796
13868d25094n420L95p67m784O960n651l523J6m56R09O100M276O374M911Q8J046
13852d14620J542J855P80k617l341Q00m096j317N496L960n336l300J00j694m481
13837d26269L000J465J974k163j98L351k614N92K473j195k351l9J967o50Q459
$$ plain form
13822 -412198 -401760 -393700 -393587 -394672 -401132 -408230 -409197 -410417 -412059 -407235 -401954 -402688 -402053 -405251 -412078
13807 -412078 -415549 -418330 -415706 -409922 -406877 -399226 -397578 -398153 -407086 -402356 -400346 -401510 -405287 -410890
13793 -410890 -411729 -404482 -400602 -399166 -398514 -397950 -400769 -402222 -400222 -392027 -387854 -392092 -391943 -396935 -397364
13778 -397364 -396183 -396708 -392602 -391372 -399151 -402020 -398299 -395323 -391873 -387380 -384713 -387173 -393134 -396932
13764 -396932 -400546 -395568 -392175 -389435 -386357 -386168 -389307 -390768 -391203 -393426 -393940 -393932 -388206 -384492 -383815 -390932
13748 -390932 -386502 -380390 -381609 -386538 -393692 -388433 -387069 -389263 -386227 -384836 -382089 -381018 -378980 -375567
13734 -375567 -379236 -382628 -380242 -381204 -387206 -389982 -389433 -388768 -382301 -379887 -385123 -380834 -372011 -373849 -375785
13719 -375785 -375642 -375471 -376516 -372696 -372137 -372322 -374099 -375713 -377377 -378118 -377524 -378985 -371706 -369480 -368975 -377046
$$ packed form
13822d12198J0438Q060J13j085o460p098r67j220j642M824N281p34O35l198o827
13807d12078l471k781K624N784L045P651J648n75q933M730K010j164l777n603
13793d10890q39P247L880J436O52N64k819j453K000Q195M173m238J49m992m29
13778c97364J181n25M106J230p779k869L721K976L450M493K667k460n961l798
13764c96932l614M978L393K740L078J89l139j461m35k223n14QN726L714O77p117
13748c90932M430O112j219m929p154N259J364k194L036J391K747J071K038L413
13734c75567l669l392K386r62o002k776N49O65O467K414n236M289Q823j838j936
13719c75785J43J71j045L820N59j85j777j614j664p41N94j461P279K226N05q071
$$ plain form
13703 -377046 -383800 -383847 -381550 -379551 -383266 -381969 -373174 -368474 -366501 -364841 -365612 -363595 -365633 -368054 -369412
13688 -369412 -371112 -369228 -365470 -363347 -370343 -377220 -380237 -378317 -374136 -372302 -373352 -369201 -366308 -362971
13674 -362971 -361651 -357652 -354966 -364108 -360479 -355028 -361222 -362461 -357216 -357450 -365912 -371165 -369922 -357048
13660 -357048 -348330 -346897 -350039 -353885 -355269 -363036 -368806 -368060 -365921 -366689 -364958 -361766 -360200 -354676 -354294
13645 -354294 -350191 -347135 -345418 -342388 -337900 -343941 -342937 -339189 -339861 -343925 -341319 -343939 -350855 -354192
13631 -354192 -358420 -355508 -345466 -349966 -360021 -357615 -357151 -356854 -354318 -353840 -348657 -351454 -352006 -348850 -350371
13616 -350371 -345798 -338543 -333175 -333349 -331214 -335996 -336199 -335513 -343652 -351802 -346228 -343043 -347427 -346982 -342060
13601 -342060 -339812 -333676 -332144 -338662 -336829 -334726 -335881 -337565 -337611 -339815 -346527 -345975 -338535 -330752 -331140
$$ packed form
13703c77046o754m7K297J999l715J297Q795M700J973J660p71K017k038k421j358
13688c69412j700J884L758K123o996o877l017J920M181J834j050M151K893L337
13674c62971J320L999K686r142L629N451o194j239N245k34q462n253J243J2874
13660c57048Q718J433l142l846j384p767n770P46K139p68J731L192J566N524L82
13645c54294M103L056J717L030M488o041J004L748o72m064K606k620o916l337
13631c54192m228K912J0042m500j0055K406M64K97K536M78N183k797n52L156j521
13616c50371M573P255N368j74K135m782k03O86q139q150N574L185m384M45M922
13601c42060K248O136J532o518J833K103j155j684m6k204o712N52P440P783l88
$$ plain form
13586 -331140 -328187 -326886 -328255 -323832 -326101 -328735 -326943 -327217 -329696 -328552 -325815 -329977 -331675 -330287
13572 -330287 -325192 -321560 -320244 -324368 -325576 -324956 -325803 -327017 -329285 -329826 -336528 -334485 -338081 -333903 -331952
13557 -331952 -325620 -322751 -317579 -315419 -314568 -315743 -311411 -317565 -322512 -315070 -311881 -308343 -306884 -305813
13543 -305813 -303888 -312109 -315311 -310724 -314427 -321324 -318681 -313894 -322947 -324509 -319475 -325237 -323504 -320286
13529 -320286 -314274 -314718 -317832 -323361 -317808 -314219 -309062 -307628 -307970 -312034 -320613 -315130 -310231 -310552 -308690
13514 -308690 -307442 -300692 -298574 -305600 -307469 -306477 -302090 -295735 -291225 -299263 -302209 -296067 -296827 -302450 -302254
13499 -302254 -302705 -302302 -302870 -301305 -295953 -292863 -294887 -301648 -298166 -291652 -294015 -289686 -289274 -293795 -293796 -293336
13483 -293336 -293818 -292844 -299971 -303239 -306073 -303360 -303635 -301439 -304190 -300962 -292955 -297843 -299694 -298799 -303392
$$ packed form
13586c31140K953J301j369M423k269k634J792k74k479J144K737m162j698J388
13572c30287N095L632J316m124j208O20q47j214k268n41o702K043l596M178J951
13557c31952O332K869N172K160Q51j175M332o154m947P442L189L538J459J071
13543c05813J925q221l202M587l703o897K643M787r053j562N034n762J733L218
13529c20286O012m44l114n529N553L589N157J434l42m064q579N483M899l21J862
13514c08690J248O750K118p026j869R92M387O355M510q038k946O142p60n623J96
13499c02254m51M03n68J565N352L090k024o761L482O514k363M329M12m521jM60
13483b93336m82R74p127l268k834K713k75K196k751L228Q007m888j851Q95m593
$$ plain form
13468 -303392 -300887 -300030 -300409 -303039 -303350 -297016 -294271 -291895 -294247 -295907 -296208 -293991 -298143 -299201 -297694
13453 -297694 -298472 -299797 -295811 -286250 -286731 -280490 -281570 -281165 -283140 -281548 -277208 -275576 -277053 -286632 -286707
13438 -286707 -289831 -289770 -285167 -278921 -279980 -286633 -283856 -281991 -291554 -294898 -292608 -287781 -284987 -282429 -275934
13423 -275934 -273289 -268846 -270262 -271759 -271611 -274118 -272183 -265225 -274410 -278335 -277512 -280758 -280661 -271125 -266035
13408 -266035 -266912 -269733 -270226 -269538 -271202 -277015 -276338 -270519 -271580 -271781 -276154 -279677 -276481 -271624 -270644 -279576
13392 -279576 -279374 -273517 -269763 -265065 -265141 -270793 -273330 -269220 -267136 -263718 -262094 -270155 -273700 -270329 -265974
13377 -265974 -266074 -272105 -268975 -262945 -254946 -254618 -267682 -281505 -281282 -272488 -263565 -263504 -265385 -266416 -270153
13362 -270153 -268757 -260232 -254423 -252614 -250323 -254262 -253348 -247821 -248399 -248174 -251897 -248900 -250049 -251601 -250265
$$ packed form
13468c03392K505Q57l79k630l11O334K745K376k352j660l01K217m152j058J507
13453b97694p78j325L986R561m81O241j080M05j975J592M340J632j477r579p5
13438b86707l124O1M603O246j059o653K777J865r563l344K290M827K794K558O495
13423b75934K645M443j416j497J48k507J935O958r185l925Q23l246R7R536N090
13408b66035q77k821m93O88j664n813O77N819j061k01m373l523L196M857R80q932
13392b79576K02N857L754M698p6n652k537M110K084L418J624q061l545L371M355
13377b65974j00o031L130O030P999L28j3064j3823K23Q794Q923O1j881j031l737
13362b70153J396Q525N809J809K291l939R14N527n78K25l723K997j149j552J336
$$ plain form
13347 -250265 -243668 -246974 -249762 -248155 -245496 -246555 -241703 -234410 -235073 -239252 -239330 -237903 -245082 -249279 -242315
13332 -242315 -241884 -249365 -249549 -243656 -243865 -249691 -250752 -246095 -243074 -236897 -233290 -233333 -237615 -237103 -239023 -244573
13316 -244573 -245273 -242467 -244282 -246355 -247690 -246066 -238177 -236482 -233305 -233551 -239584 -241677 -240712 -237271 -234668
13301 -234668 -234099 -231594 -229954 -221783 -222754 -226150 -225934 -225554 -225325 -224492 -222692 -234042 -232420 -232100 -228575 -227515
13285 -227515 -231162 -227819 -228153 -234679 -233855 -230536 -233348 -226388 -229910 -241515 -243772 -244626 -242880 -240225 -231150
13270 -231150 -223685 -228851 -233807 -233137 -229987 -222071 -215806 -217458 -222633 -221668 -219011 -222487 -224526 -228473 -228905
13255 -228905 -224223 -212098 -212322 -208066 -206258 -201644 -201171 -206332 -212082 -214161 -216866 -213862 -216262 -217420
13241 -217420 -217353 -210951 -210498 -208608 -206013 -208542 -209485 -210714 -215260 -214068 -209091 -207229 -203415 -197728 -197674 -196759
$$ packed form
13347b50265O597l306k788J607K659j059M852P293o63m179p8J427p179m197O964
13332b42315M31p481j84N893k09n826j061M657L021O177L607m3m282N12j920n550
13316b44573p00K806j815k073j335J624P889J695L177k46o033k093R65L441K603
13301b34668N69K505J640Q171r71l396K16L80K29Q33J800j1350J622L20L525J060
13285b27515l647L343l34o526Q24L319k812O960l522j1605k257q54J746K655R075
13270b31150P465n166m956O70L150P916O265j652n175R65K657l476k039l947m32
13255b28905M682J2125k24M256J808M614M73n161n750k079k705L004k400j158
13241b17420O7O402M53J890K595k529r43j229m546J192M977J862L814N687N4R15
$$ plain form
13225 -196759 -192493 -191919 -201684 -206177 -205739 -206925 -209805 -210107 -206154 -208051 -210353 -202077 -198925 -201703 -199109
13210 -199109 -200513 -201596 -204806 -199222 -194208 -197696 -193894 -199724 -207443 -209829 -210242 -207751 -204598 -196175
13196 -196175 -184948 -188530 -191899 -192323 -193207 -197849 -190017 -191595 -191869 -186956 -185912 -183120 -181660 -178583 -177837
13181 -177837 -174972 -183089 -190790 -192620 -195264 -189446 -186058 -192163 -202814 -199998 -193126 -194229 -189968 -184182
13167 -184182 -180072 -171993 -175708 -178545 -175470 -176923 -179849 -181035 -183286 -185130 -185749 -194234 -195614 -183978
13153 -183978 -186356 -183802 -185879 -190773 -180408 -173654 -168387 -182869 -186774 -184688 -183148 -177588 -177041 -177763
13139 -177763 -170074 -168077 -169564 -170340 -173755 -171431 -168108 -171730 -174766 -170523 -165345 -162715 -164427 -170285
13125 -170285 -173442 -166761 -160278 -166274 -168064 -167605 -169839 -174002 -170498 -157097 -161568 -164800 -168181 -170945
$$ packed form
13225a96759M266N74r765m493M38j186k880l02L953j897k302Q276L152k778K594
13210a99109j404j083l210N584N014l488L802n830p719k386m13K491L153Q423
13196a96175J1227l582l369m24q84m642P832j578k74M913J044K792J460L077P46
13181a77837K865q117p701j830k644N818L388o105j0651K816O872j103M261N786
13167a84182M110Q079l715k837L075j453k926j186k251j844o19q485j380J1636
13153a83978k378K554k077m894J0365O754N267j4482l905K086J540N560N47p22
13139a77763P689J997j487p76l415K324L323l622l036M243N178K630j712n858
13125a70285l157O681O483n996j790M59k234m163L504J3401m471l232l381k764
$$ plain form
13111 -170945 -171902 -170403 -171341 -165080 -164256 -172601 -173532 -170832 -163004 -162513 -161109 -164419 -163734 -167134 -169847 -168034
13095 -168034 -165963 -163938 -163530 -164752 -165347 -158949 -159204 -161856 -159651 -156978 -153999 -154189 -159323 -158783 -151146
13080 -151146 -159492 -162006 -160533 -156313 -154004 -155102 -160955 -159331 -155263 -149912 -152369 -150297 -156224 -153626
13066 -153626 -148406 -148913 -149791 -146322 -145921 -144725 -147787 -145777 -145449 -155387 -152830 -148775 -142990 -144204 -149760
13051 -149760 -149792 -147308 -146953 -143706 -136815 -139332 -143718 -145148 -145702 -146137 -142718 -141072 -143622 -140464 -136350
13036 -136350 -129542 -134335 -133197 -131930 -137200 -136408 -138608 -142743 -142504 -135983 -139672 -142147 -142102 -138911 -135679
13021 -135679 -138527 -136333 -130816 -129966 -139113 -140349 -140563 -132651 -137725 -139567 -134357 -127998 -124786 -131800 -134838
13006 -134838 -133778 -125540 -124162 -127196 -131122 -130723 -126239 -124699 -121632 -115494 -114837 -119178 -115210 -114128 -120262
$$ packed form
13111a70945r57J499r38O261Q24q345r31K700P828M91J404l310O85l400k713J813
13095a68034K071K025M08j222n95O398k55k652K205K673K979j90n134N40P637
13080a51146q346k514J473M220K309j098n853J624M068N351k457K072n927K598
13066a53626N220n07q78L469M01J196l062K010L28r938K557M055N785j214n556
13051a49760l2K484L55L247O891k517m386j430n54m35L419J646k550L158M114
13036a36350O808m793J138J267n270P92k200m135K39O521l689k475M5L191L232
13021a35679k848K194N517Q50r147j236k14P912n074j842N210O359L212p014l038
13006a34838J060Q238J378l034l926L99M484J540L067O138O57m341L968J082o134
$$ plain form
12991 -120262 -119470 -121513 -120266 -123018 -126442 -123062 -117346 -113324 -116360 -126688 -129680 -125879 -126152 -123818
12977 -123818 -121890 -118390 -119307 -116964 -116647 -115714 -109875 -105987 -104047 -102520 -101338 -102692 -105475 -104636 -102413
12962 -102413 -105065 -109212 -113691 -117633 -113339 -113142 -113864 -113941 -107547 -101680 -100999 -99954 -99678 -98531 -102136 -107802
12946 -107802 -107398 -104511 -103272 -95146 -98090 -98331 -96841 -96668 -98092 -98480 -103824 -101363 -98317 -96902 -94483
12931 -94483 -96183 -95527 -102595 -103407 -96545 -93361 -96864 -94298 -92561 -87651 -84832 -76969 -85652 -94328 -91621
12916 -91621 -78616 -74251 -84653 -86569 -86214 -79763 -83988 -86928 -84611 -82222 -84570 -86109 -88904 -94562
12902 -94562 -88799 -87459 -85413 -87307 -88467 -82822 -78312 -80505 -84713 -79778 -79903 -79019 -76855 -76744 -76450
12887 -76450 -74517 -81385 -84075 -81789 -73119 -68049 -64390 -71884 -74836 -76105 -69651 -67216 -70715 -70106 -72274
$$ packed form
12991a20262P92k043J247k752l424L380N716M022l036j0328k992L801k73K334
12977a23818J928L500r17K343L17R33N839L888J940J527J182j354k783Q39K223
12962a02413k652m147m479l942M294J97p22p7O394N867O81J045K76J147l605n666
12946a07802M04K887J239Q126k944k41J490J73j424l88n344K461L046J415K419
12931i4483j700O56p068q12O862L184l503K566J737M910K819P863q683q676K707
12916i1621J3005M365j0402j916L55O451m225k940K317K389k348j539k795n658
12902i4562N763J340K046j894j160N645M510k193m208M935j25Q84K164J11K94
12887g6450J933o868k690K286Q670N070L659p494k952j269O454K435l499O09k168
$$ plain form
12872 -72274 -76831 -79995 -79540 -76539 -77531 -76944 -70589 -67134 -64987 -63023 -62205 -64367 -62940 -56160 -50773
12857 -50773 -50764 -52850 -55656 -67871 -63842 -65419 -61770 -63697 -59958 -52895 -50829 -51530 -50600 -49566 -44466
12842 -44466 -49144 -48538 -45410 -46170 -49817 -51945 -51301 -50625 -51083 -52734 -52158 -53788 -53544 -50287 -46353 -48644
12826 -48644 -43772 -34950 -30170 -31576 -38497 -39732 -34732 -28554 -32377 -39608 -37729 -34906 -25237 -19075
12812 -19075 -18766 -13949 -6979 -3156 -3910 -2696 -13219 -38251 -56535 -77762 -89105 -80848 -66880
12799 -66880 -62538 -59236 -60178 -64165 -64519 -55176 -51602 -49342 -48426 -49223 -48962 -42624 -42899 -41440 -30909 -35244
12783 -35244 -43687 -44668 -36825 -38292 -39253 -33805 -31616 -37058 -38571 -35445 -29823 -31326 -31848 -30080 -28116
12768 -28116 -24705 -20031 -22410 -24639 -23910 -29154 -32588 -34860 -35166 -34723 -28181 -26461 -33663 -35388 -24585
$$ packed form
12872g2274m557l164M55L001r92N87O355L455K147J964Q18k162J427O780N387
12857e0773Rk086k806j2215M029j577L649j927L739P063K066p01R30J034N100
12842d4466m678O06L128p60l647k128O44O76m58j651N76j630K44L257L934k291
12826d8644M872Q822M780j406o921j235N000O178l823p231J879K823R669O162
12812a9075L09M817O970L823p54J214j0523k5032j8284k1227j1343Q257J3968
12799f6880M342L302r42l987l54R343L574K260R16p97K61O338k75J459J0531m335
12783c5244q443r81P843j467r61N448K189n442j513L126N622j503n22J768J964
12768b8116L411M674k379k229P29n244l434k272l06M43O542J720p202j725J0803
$$ plain form
12753 -24585 -15568 -19197 -21504 -19591 -18414 -24462 -31807 -31549 -29785 -24855 -21449 -21374 -25037 -17513 -17508 -22425
12737 -22425 -22079 -18225 -9621 -7206 -4404 -5558 -13258 -19656 -16801 -11518 -12604 -11421 -10578 -15207 -16021
12722 -16021 -8461 -8707 -4906 -6145 -7266 -7787 -5533 -8887 -9158 -4368 3189 343 -4739 -3280 820
12707 820 1545 -4426 -8197 -13876 -6601 3478 -2219 -4355 464 2554 2614 1921 2824 6009 11517 7080
12691 7080 2269 4137 12935 15703 13930 6716 -2027 -655 8569 10106 9474 7412 9610 7917 12232
12676 12232 15274 15112 17818 21670 17383 8833 5291 6932 10060 9390 10438 9314 12211 17198 21084
12661 21084 21225 25029 24938 17605 16844 15816 21994 26741 27063 24345 26657 29020 33928 28513 21508 21658
12645 21658 27621 27523 28772 32912 29547 34446 39105 36974 39139 38110 35818 40051 39696 40946 43973
$$ packed form
12753b4585R017l629k307J913J177o048p345K58J764M930L406P5l663P524Nm917
12737b2425L46L854Q604K415K802j154p700o398K855N283j086J183Q43m629q14
12722a6021P560k46L801j239j121n21K254l354k71M790P557k846n082J459M100
12707H20P25n971l771n679P275J0079n697k136M819K090O0o93R03L185N508m437
12691G080m811J868Q798K768j773p214q743J372R224J537o32k062K198j693M315
12676A2232L042j62K706L852m287q550l542J641L128o70J048j124K897M987L886
12661B1084J41L804r1p333p61j028O178M747L22k718K312K363M908n415p005J50
12645B1658N963r8J249M140l365M899M659k131K165j029k292M233l55J250L027
$$ plain form
12630 43973 42752 41520 38550 39490 40341 47750 47892 43650 29958 24746 29469 29413 28456 24598 31211 37394
12614 37394 44819 44768 45345 42430 39245 40328 43802 42420 44153 49239 50344 48100 56846 61648 51790
12599 51790 47114 44941 50661 51900 48973 51265 58949 57547 47559 44228 44812 49623 54640 46014 41143
12584 41143 51455 59755 59876 56550 52058 50984 53823 48963 51631 55113 55898 54296 54992 63427 76273
12569 76273 80337 70519 69076 72076 72206 69551 71742 75680 73407 70824 80746 82380 83264 79916 79623
12554 79623 85903 92338 89987 82725 78302 76618 79355 84640 80974 75740 72048 77769 87377 85159
12540 85159 80074 82823 86892 82514 79044 79157 78980 79426 77986 85557 88453 90137 87161 92072 97751
12525 97751 98107 96100 92817 96162 96315 86926 91853 97788 100889 107139 112013 111725 114992 112597 105817
$$ packed form
12630D3973j221j232k970R40Q51P409J42m242j3692n212M723n6r57l858O613O183
12614C7394P425n1N77k915l185J083L474j382J733N086J105k244Q746M802r858
12599E1790m676k173N720J239k927K292P684j402r988l331N84M811N017q626m871
12584D1143J0312Q300J21l326m492j074K839m860K668L482P85j602O96Q435J2846
12569G6273M064r818j443L000J30k655K191L938k273k583R922J634Q84l348k93
12554G9623O280O435k351p262m423j684K737N285l666n234l692N721R608k218
12540H5159n085K749M069m378l470J13j77M46j440P571K896J684k976M911N679
12525I7751L56k007l283L345J53r389M927N935L101O250M874k88L267k395o780
$$ plain form
12510 105817 106673 108489 103839 101336 93360 92789 95410 101063 103550 102066 99628 95870 93850 107224
12496 107224 110066 100944 92406 92912 100830 96718 95097 96415 96276 105732 111564 111423 115420 118074 120971
12481 120971 116689 111419 115373 121257 112930 110390 109739 108131 105798 109789 109810 112772 115564 123350 123461
12466 123461 122557 125195 126206 132146 136939 133409 124162 125573 121119 115012 113328 112161 120667 127015
12452 127015 119629 115040 123962 128328 125702 120444 117723 117533 116461 119928 128810 128124 128462 130031 126545
12437 126545 120635 122372 128872 132349 130688 136352 140559 139150 141798 143933 139080 140064 137632 140291
12423 140291 143377 141614 143116 139581 140086 141622 139311 140912 145687 151738 161164 159306 148816 142170
12409 142170 138626 132969 136053 136587 143094 146395 147546 149598 154868 158468 158906 151803 141918 147405 150607
$$ packed form
12510A05817Q56J816m650k503p976n71K621N653K487j484k438l758k020J3374
12496A07224K842r122q538N06P918m112j621J318j39R456N832j41L997K654K897
12481A20971m282n270L954N884q327k540o51j608k333L991K1K962K792P786J11
12466A23461r04K638J011N940M793l530r247J411m454o107j684j167Q506O348
12452A27015p386m589Q922M366k626n258k721j90j072L467Q882o86L38J569l486
12437A26545n910J737O500L477j661N664M207j409K648K135m853R84k432K659
12423A40291L086j763J502l535N05J536k311J601M775O051R426j858j0490o646
12409A42170l544n657L084N34O507L301J151K052N270L600M38p103r885N487L202
$$ plain form
12394 150607 152259 154489 153092 152325 153858 158075 165055 168223 165301 158049 156754 162427 164982 165606 166317
12379 166317 168334 172975 180646 178213 175267 176785 175584 175809 176122 173159 176185 175586 179101 178963 168593
12364 168593 162207 167121 172198 175315 174117 169223 172923 176268 178071 176977 178255 180166 182175 176826
12350 176826 175060 176941 185250 194705 200232 198071 188912 181554 192055 201333 196160 196527 197363 196738 195479
12335 195479 200626 206472 204608 201077 200397 199556 196696 199693 200777 205747 207555 209617 206499 201113 202727
12320 202727 203253 208059 207672 208611 210607 213869 207665 209121 209785 210809 223754 226396 219603 213623 211484
12305 211484 212839 217394 217251 223426 218535 216944 218854 217527 223929 231052 225316 222620 223250 222463 224633
12290 224633 231286 230510 225681 225621 226466 232327 230012 223007 219935 217418 222148 225212 230350 232860 235756
$$ packed form
12394A50607J652K230j397p67J533M217O980L168k922p252j295N673K555O24P11
12379A66317K017M641P671k433k946J518j201K25L13k963L026n99L515j38j0370
12364A68593o386M914N077L117j198m894L700L345J803j094J278J911K009n349
12350A76826j766J881Q309R455N527k161r159p358J0501R278n173L67Q36o25j259
12335A95479N147N846j864l531o80q41k860K997J084M970J808K062l118n386J614
12320B02727N26M806l87R39J996L262o204J456O64J024J2945K642o793n980k139
12305B11484J355M555j43O175m891j591J910j327O402P123n736k696O30p87K170
12290B24633O653p76m829o0Q45N861k315p005l072k517M730L064N138K510K896
$$ plain form
12275 235756 237403 240987 238386 241930 248850 247322 248720 246016 245551 247683 247764 248159 236523 235118 248552
12260 248552 251182 253195 252819 260123 261949 257186 249406 249682 252265 248506 251332 258356 260789 267952 265346
12245 265346 264914 265762 258403 258646 255817 256563 254382 253153 253621 258625 264481 267052 272141 268284 272873
12230 272873 274973 268559 267539 271278 270028 270579 265793 263130 263365 262412 260263 265435 270070 267936 270730
12215 270730 271965 272615 280163 288206 294401 291954 289506 291815 296051 291339 286070 291702 293677 293792 296041
12200 296041 295730 299753 297194 298361 303071 295175 283375 284802 289482 285949 281028 286629 288962 288536
12186 288536 294753 298640 296298 296802 294114 288473 294240 298516 296342 295667 298755 297178 302445 302305 299715
12171 299715 295178 293517 299162 297491 309436 312579 310951 312814 307869 314942 326064 322630 314767 318425
$$ packed form
12275B35756J647L584k601L544O920j528J398k704m65K132Q1L95j1636j405J3434
12260B48552K630K013l76P304J826m763p780K76K583l759K826P024K433P163k606
12245B65346m32Q48p359K43k829P46k181j229M68N004N856K571N089l857M589
12230B72873K100o414j020L739j250N51m786k663K35r53k149N172M635k134K794
12215B70730J235O50P548Q043O195k447k448K309M236m712n269N632J975J15K249
12200B96041l11M023k559J167M710p896j1800J427M680l533m921N601K333m26
12186B88536O217L887k342N04k688n641N767M276k174o75L088j577N267j40k590
12171B99715m537j661N645j671J1945L143j628J863m945P073J1122l434p863L658
$$ plain form
12157 318425 317099 315619 316647 318527 323109 322152 318024 312512 310845 312690 317336 318973 323433 320315
12143 320315 322680 326393 329844 333721 339633 342976 345066 350536 350753 342304 332811 337426 343891 348761
12129 348761 348211 345326 340600 338820 342224 339928 343322 340982 347255 351735 352422 346669 343371 340261 342148
12114 342148 352639 357892 356164 357786 362751 366203 361698 359091 362824 366792 364872 362759 366841 373344
12100 373344 372571 367061 363416 371746 376450 371382 367733 365979 367445 369152 361695 358364 366515 373965
12086 373965 376956 377782 375870 372793 379988 384988 385078 391886 400503 400842 388892 385802 383280 380476 388147
12071 388147 386868 381247 385295 391672 392617 390428 393624 396136 399621 400959 398342 399796 399228 403543 395776
12056 395776 391316 394265 399282 398997 403012 411635 415573 412394 410617 413631 415654 417636 411037 407876
$$ packed form
12157C18425j326j480J028J880M582r57m128n512j667J845M646J637M460l118
12143C20315K365L713L451L877N912L343K090N470K17q449r493M615O465M870
12129C48761n50k885m726j780L404k296L394k340O273M480O87n753l298l110J887
12114C42148J0491N253j728J622M965L452m505k607L733L968j920k113M082O503
12100C73344p73n510l645Q330M704n068l649j754J466J707p457l331Q151P450
12086C73965K991Q26j912l077P195N000R0O808Q617L39j1950l090k522k804P671
12071C88147j279n621M048O377R45k189L196K512L485J338k617J454n68M315p767
12056C95776m460K949N017k85M015Q623L938l179j777L014K023J982o599l161
$$ plain form
12042 407876 409690 415367 422205 425874 421537 423193 415846 417838 421033 420954 423825 425902 427066 421315 420610
12027 420610 420999 433603 433112 434059 438231 442022 439627 437361 438045 433008 430269 429714 434689 434942 440353
12012 440353 439167 444589 451956 453004 451962 454024 460409 457277 453947 451494 449761 451506 455405 460445
11998 460445 463047 469456 467243 460272 458117 461777 462693 455129 450880 461397 475069 479761 471595 468649
11984 468649 468198 470968 475256 472761 468686 462186 463157 469816 479485 484380 490100 490398 486459 480976 478991
11969 478991 483297 495917 503510 504596 493628 488107 490748 500283 507527 503666 496802 495365 500900 505300
11955 505300 509824 510298 513984 515315 517340 516111 504602 501120 501347 502824 505669 505701 506418 503704 506725
11940 506725 506524 509525 515469 515150 514676 519284 523725 523567 534592 530582 519634 516817 520560 522557 525872
$$ packed form
12042D07876J814N677O838L669m337J656p347J992L195p9K871K077J164n751p05
12027D20610L89J2604m91R47M172L791k395k266O84n037k739n55M975K53N411
12012D40353j186N422P367J048j042K062O385l132l330k453j733J745L899N040
11998D60445K602O409k213o971k155L660R16p564m249J0517J3672M692q166k946
11984D68649m51K770M288k495m075o500R71O659R669M895N720K98l939n483j985
11969D78991M306J2620P593J086j0968n521K641R535P244l861o864j437N535M400
11955E05300M524M74L686J331K025j229j1509l482K27J477K845L2P17k714L021
11940E06725k01L001N944l19m74M608M441j58J1025m010j0948k817L743J997L315
$$ plain form
11925 525872 533683 532229 527866 531804 537545 539201 544345 542943 546138 546162 543632 540996 541189 546762 549653
11910 549653 547603 551389 552121 551016 558773 565976 570328 571952 567846 563698 559012 562519 564867 563789
11896 563789 568064 572375 571561 567126 561502 567275 571819 571190 575947 578113 575805 581590 583540 577990 580005
11881 580005 584006 583133 580703 583731 594962 597098 598603 605472 598301 600521 605019 605064 595250 596004 593245
11866 593245 593803 596408 602350 605988 605159 596021 595186 597516 602356 606864 615226 616502 617513 624103 628454
11851 628454 630035 628262 624350 615232 620250 623651 623919 624834 624413 622783 628863 634272 637008 640612 645422
11836 645422 647043 639442 632436 636254 641562 640225 637265 640116 639044 644571 650295 649339 655543 660421
11822 660421 659848 662607 669236 667699 663761 666696 670978 679322 680511 681715 682648 687003 684071 685772 690275
$$ packed form
11925E25872P811j454m363L938N741J656N144j402L195K4k530k636J93N573K891
11910E49653k050L786P32j105P757P203M352J624m106m148m686L507K348j078
11896E63789M275M311q14m435n624N773M544o29M757K166k308N785J950n550K015
11881E80005M001q73k430L028J1231K136J505O869p171K220M498M5r814P54k759
11866E93245N58K605N942L638q29r138q35K330M840M508Q362J276J011O590M351
11851F28454J581j773l912r118N018L401K68R15m21j630O080N409K736L604M810
11836F45422J621p601p006L818N308j337k960K851j072N527N724r56O204M878
11822F60421n73K759O629j537l938K935M282Q344J189J204R33M355k932J701M503
$$ plain form
11807 690275 691484 690166 688235 681894 682214 682216 682428 685146 682526 679458 682244 693727 703160 702298 701072
11792 701072 700016 698100 705867 707148 709178 706249 702508 695483 697361 705791 711649 712686 714730 718970
11778 718970 727015 730328 729734 728667 723690 716510 715947 712551 717132 727430 727405 722573 724004 725983 724011
11763 724011 725085 725404 722647 728253 737819 748125 752652 754407 747438 743913 739285 736838 743279 749533
11749 749533 754470 756642 758227 760024 766706 767960 765115 770450 769863 777696 778761 778070 784149 782173 780674
11734 780674 784526 779396 778291 786491 787159 790816 794516 798600 799280 799636 799276 796470 799124 810920 814787
11719 814787 810170 808696 803665 797697 801620 811531 821190 825828 820428 816538 813306 817831 827158 838840
11705 838840 838581 834759 832951 829735 827012 834337 840506 837102 831063 828455 830272 834562 836433 841309
$$ packed form
11807F90275J209j318j931o341L20KK12K718k620l068K786J1483R433q62j226
11792G01072j056j916P767J281K030k929l741p025J878Q430N858J037K044M240
11778G18970Q045L313n94j067m977p180n63l396M581J0298k5m832J431J979j972
11763G24011J074L19k757N606R566J0306M527J755o969l525m628k447O441O254
11749G49533M937K172J585J797O682J254k845N335n87P833J065o91O079j976j499
11734G80674L852n130j105Q200O68L657L700M084O80L56l60k806K654J1796L867
11719H14787m617j474n031n968L923R911R659M638n400l890l232M525R327J1682
11705H38840k59l822j808l216k723P325O169l404o039k608J817M290J871M876
$$ plain form
11691 841309 843927 842761 842125 834287 834753 842273 848642 846521 849768 856208 865914 875129 869971 867249 868674
11676 868674 876249 883905 877607 878624 880817 885959 889658 893976 890673 888265 886746 885373 887904 897762
11662 897762 896899 896510 910402 924087 926399 926004 923349 916620 914889 917013 912281 915998 923031 929402
11648 929402 929953 934126 934803 936911 935964 938384 935645 936200 945389 955412 965212 965206 965928 962096 965573 969167
11632 969167 972861 974640 969756 966171 965442 962366 976368 984742 985131 981354 984258 990611 985485 984828 996580
11617 996580 995313 992112 987097 994101 999874 1000374 1007198 1008297 1014157 1021643 1019356 1020791 1027540 1023467
11603 1023467 1020165 1016859 1020883 1023488 1024261 1025863 1037433 1046063 1047804 1053931 1055498 1051661 1048085 1049723
11589 1049723 1050419 1054543 1053469 1056279 1059226 1067020 1076992 1076928 1073572 1068308 1066417 1078026 1090087 1093300
$$ packed form
11691H41309K618j166o36p838M66P520O369k121L247O440R706R215n158k722J425
11676H68674P575P656o298J017K193N142L699M318l303k408j519j373K531R858
11662H97762q63l89J3892J3685K312l95k655o729j731K124m732L717P033O371
11648I29402N51M173O77K108r47K420k739N55R189J0023R800oP22l832L477L594
11632I69167L694J779m884l585p29l076J4002Q374L89l777K904O353n126o57J1752
11617I96580j267l201n015P004N773N00O824J099N860P486k287J435O749m073
11603A023467l302l306M024K605P73J602J1570Q630J741O127J567l837l576J638
11589A049723O96M124j074K810K947P794R972o4l356n264j891J1609J2061L213
$$ plain form
11575 1093300 1092169 1092256 1089181 1093706 1096269 1102748 1107278 1104681 1104718 1114547 1116363 1114908 1112802 1120293 1125741
11560 1125741 1127890 1131616 1136806 1132140 1130029 1131184 1139275 1146401 1146791 1155534 1159007 1161885 1170932 1177733
11546 1177733 1181505 1180167 1181258 1183599 1189397 1193445 1194914 1195360 1195681 1194161 1193413 1193931 1192637 1193645 1196097
11531 1196097 1200096 1207656 1207486 1208701 1210193 1211348 1214906 1223989 1233784 1228274 1231322 1237615 1241907 1246504
11517 1246504 1244749 1242810 1243051 1243866 1244770 1250324 1257133 1266410 1275005 1273053 1270467 1278445 1287702 1294309 1294815
11502 1294815 1294328 1293253 1296614 1305790 1310723 1309683 1325489 1336821 1333623 1335647 1331958 1335151 1346096
11489 1346096 1345306 1343583 1351615 1353839 1350468 1352560 1351322 1351829 1358769 1370313 1377614 1380833 1378865 1384910
11475 1384910 1387700 1387307 1392556 1402164 1407070 1410038 1408647 1408426 1407608 1407685 1407454 1414682 1422510 1426789 1430761
$$ packed form
11575A093300j131Q7l075M525K563O479M530k597L7R829J816j455k106P491N448
11560A125741K149L726N190m666k111J155Q091P126L90Q743L473K878R047O801
11546A177733L772j338J091K341N798M048J469M46L21j520p48N18j294J008K452
11531A196097L999P560j70J215J492J155L558R083R795n510L048O293M292M597
11517A246504j755j939K41Q15R04N554O809R277Q595j952k586P978R257O607N06
11502A294815m87j075L361R176M933j040J5806J1332l198K024l689L193J0945
11489A346096p90j723Q032K224l371K092j238N07O940J1544P301L219j968O045
11475A384910K790l93N249R608M906K968j391k21q18P7k31P228P828M279L972
$$ plain form
11460 1430761 1437506 1438537 1442757 1451518 1457911 1461319 1469545 1478763 1481905 1480724 1482470 1493335 1510091
11447 1510091 1523828 1528187 1531171 1532194 1539125 1546413 1545405 1542926 1543343 1554080 1558956 1564481 1570589 1575256
11433 1575256 1579975 1584044 1589319 1595226 1602153 1610315 1613462 1615481 1625801 1633562 1641337 1645668 1655779
11420 1655779 1652386 1652926 1665699 1683040 1691720 1700199 1713500 1724058 1736247 1744037 1751919 1759725 1771852
11407 1771852 1783393 1804558 1817617 1832935 1844607 1866007 1885818 1902099 1916054 1931557 1950382
11396 1950382 1969799 1991904 2019928 2048188 2076557 2109327 2141091 2184270 2231406 2288205 2337605
11385 2337605 2382403 2447114 2532768 2649988 2799271 2993402 3221857 3425884 3459940 3101108
11375 3101108 2288214 1305120 529051 156248 125003 255076 415985 563587 690352 795292
$$ packed form
11460A430761O745J031M220Q761O393L408Q226R218L142j181J746J0865J6756
11447A510091J3737M359K984J023O931P288j008k479M17J0737M876N525O108M667
11433A575256M719M069N275N907O927Q162L147K019J0320P761P775M331J0111
11420A655779l393N40J2773J7341Q680Q479J3301J0558J2189P790P882P806J2127
11407A771852J1541K1165J3059J5318J1672K1400J9811J6281J3955J5503J8825
11396A950382J9417K2105K8024K8260K8369L2770L1764M3179M7136N6799M9400
11385B337605M4798O4711Q5654J17220J49283J94131K28455K04027L4056l58832
11375C101108q12894r83094p76069l72803l1245J30073J60909J47602J26765J04940
$$ plain form
11365 795292 876957 945916 1004229 1058143 1109311 1156330 1200204 1232994 1271908 1308419 1337269
11354 1337269 1365424 1384755 1397447 1406193 1422821 1441556 1457182 1474458 1494970 1508028 1520068
11343 1520068 1542903 1569688 1586064 1594412 1610545 1620503 1636447 1656245 1677446 1688276 1695716 1699824
11331 1699824 1714412 1724215 1730902 1735992 1746343 1760752 1780903 1799559 1812721 1825041 1840109 1850899
11319 1850899 1857247 1874228 1895258 1901513 1909802 1915798 1914930 1921624 1928118 1935900 1939313 1945553 1956273
11306 1956273 1959000 1968967 1981013 1991280 2010114 2024267 2039350 2059438 2079604 2100940 2117837 2139411
11294 2139411 2162024 2181233 2197224 2216367 2240682 2256855 2279931 2313327 2348918 2378312 2413197
11283 2413197 2451453 2490962 2532626 2576862 2625260 2682575 2759779 2849304 2948418 3066944 3194193
$$ packed form
11365G95292Q1665O8959N8313N3914N1168M7019M3874L2790L8914L6511K8850
11354A337269K8155J9331J2692Q746J6628J8735J5626J7276K0512J3058J2040
11343A520068K2835K6785J6376Q348J6133R958J5944J9798K1201J0830P440M108
11331A699824J4588R803O687N090J0351J4409K0151J8656J3162J2320J5068J0790
11319A850899O348J6981K1030O255Q289N996q68O694O494P782L413O240J0720
11306A956273K727R967J2046J0267J8834J4153J5083K0088K0166K1336J6897K1574
11294B139411K2613J9209J5991J9143K4315J6173K3076L3396L5591K9394L4885
11283B413197L8256L9509M1664M4236M8398N7315P7204Q9525R9114J18526J27249
$$ plain form
11272 3194193 3289918 3324649 3287015 3137329 2847502 2483022 2062760 1631512 1280336 1039148
11262 1039148 919944 898978 948291 1038681 1140359 1245148 1336665 1414175 1476534 1537822 1593611
11251 1593611 1645180 1694526 1732859 1770766 1805360 1835205 1859249 1883094 1903125 1932659 1966300
11240 1966300 1997199 2025005 2051578 2075555 2099414 2131004 2159800 2181629 2205423 2232089 2263815
11229 2263815 2294764 2320433 2333867 2341161 2346709 2351701 2368255 2397613 2439292 2482863 2532611 2585140
11217 2585140 2636597 2696928 2764789 2856521 2962440 3085623 3246786 3425460 3590854 3565607
11207 3565607 3021278 2150452 1444016 1093278 1083141 1210867 1351027 1475669 1584640 1680150
11197 1680150 1758132 1828185 1881515 1916462 1940368 1961991 1983884 1999599 2025348 2053719 2082180
$$ packed form
11272C194193R5725L4731l7634j49686k89827l64480m20262m31248l51176k41188
11262A039148j19204k0966M9313R0390J01678J04789R1517P7510O2359O1288N5789
11251A593611N1569M9346L8333L7907L4594K9845K4044K3845K0031K9534L3641
11240A966300L0899K7806K6573K3977K3859L1590K8796K1829K3794K6666L1726
11229B263815L0949K5669J3434P294N548M992J6554K9358M1679M3571M9748N2529
11217B585140N1457O0331O7861R1732J05919J23183J61163J78674J65394k5247
11207C565607n44329q70826p06436l50738j0137J27726J40160J24642J08971R5510
11197A680150P7982P0053N3330L4947K3906K1623K1893J5715K5749K8371K8461
$$ plain form
11186 2082180 2111031 2138661 2168546 2186932 2201086 2214869 2242557 2264370 2277938 2291355 2309013
11175 2309013 2335903 2357539 2373362 2386653 2403165 2423650 2434698 2438677 2455628 2470341 2496257
11164 2496257 2521159 2529439 2540211 2558677 2571629 2581305 2595423 2609826 2617647 2627823 2638699 2652726
11152 2652726 2670598 2692255 2714023 2738426 2756760 2769327 2783248 2795683 2804648 2807876 2812746 2830398
11140 2830398 2856571 2876732 2887550 2898770 2913105 2934066 2950776 2957296 2965271 2978375 2995899 3008989
11128 3008989 3024576 3038851 3054379 3072631 3087243 3104012 3116147 3132246 3155058 3177979 3204317
11117 3204317 3233235 3247132 3262095 3267740 3284814 3297222 3302628 3298869 3305393 3337081 3369195 3388590
11105 3388590 3407064 3424054 3440737 3475281 3503223 3526384 3552245 3571613 3588140 3604537 3619596
$$ packed form
11186B082180K8851K7630K9885J8386J4154J3783K7688K1813J3568J3417J7658
11175B309013K6890K1636J5823J3291J6512K0485J1048L979J6951J4713K5916
11164B496257K4902Q280J0772J8466J2952R676J4118J4403P821J0176J0876J4027
11152B652726J7872K1657K1768K4403J8334J2567J3921J2435Q965L228M870J7652
11140B830398K6173K0161J0818J1220J4335K0961J6710O520P975J3104J7524J3090
11128C008989J5587J4275J5528J8252J4612J6769J2135J6099K2812K2921K6338
11117C204317K8918J3897J4963N645J7074J2408N406l759O524L1688L2114J9395
11105C388590J8474J6990J6683L4544K7942K3161K5861J9368J6527J6397J5059
$$ plain form
11094 3619596 3630527 3645985 3673933 3695654 3711562 3735143 3758864 3776750 3796411 3817265 3844476
11083 3844476 3864134 3886171 3911551 3939203 3965033 3982318 4002323 4030468 4065628 4107022 4156578
11072 4156578 4202821 4238717 4276309 4321273 4369016 4424516 4481565 4531346 4584753 4654308 4756371
11061 4756371 4846696 4918288 4944076 4973574 5072408 5172303 5262896 5399184 5597497 5896259 6247523
11050 6247523 6622315 6911703 6712241 5636551 3969680 2486596 1670742 1498030 1675261
11041 1675261 1944301 2205143 2430304 2619307 2782431 2924236 3052204 3174241 3282786
11032 3282786 3376564 3450359 3516625 3586178 3651915 3716146 3776215 3834516 3893182 3938274 3981079
11021 3981079 4028892 4072875 4112428 4152180 4200892 4249283 4294590 4338290 4377299 4408010 4432030
$$ packed form
11094C619596J0931J5458K7948K1721J5908K3581K3721J7886J9661K0854K7211
11083C844476J9658K2037K5380K7652K5830J7285K0005K8145L5160M1394M9556
11072D156578M6243L5896L7592M4964M7743N5500N7049M9781N3407O9555J02063
11061D756371R0325P1592K5788K9498R8834R9895R0593J36288J98313K98762L51264
11050F247523L74792K89388j99462j075690j666871j483084q15854j72712J77231
11041A675261K69040K60842K25161J89003J63124J41805J27968J22037J08545
11032C282786R3778P3795O6266O9553O5737O4231O0069N8301N8666M5092M2805
11021C981079M7813M3983L9553L9752M8712M8391M5307M3700L9009L0711K4020
$$ plain form
11010 4432030 4461519 4495054 4525194 4557915 4583757 4623851 4676359 4723437 4778887 4833954 4867515
10999 4867515 4891756 4899800 4897910 4895915 4894289 4898997 4912863 4955577 5033284 5131524 5228588 5294695
10987 5294695 5349539 5397212 5443604 5470895 5496284 5519209 5555405 5598274 5650309 5704114 5748600
10976 5748600 5795785 5845570 5891877 5934570 5976064 6012293 6055528 6089868 6126196 6167463 6206855
10965 6206855 6246987 6285990 6324602 6350171 6373020 6414712 6459180 6520690 6605831 6690030 6740037
10954 6740037 6786393 6829182 6883421 6936031 6996083 7051641 7113917 7181477 7238825 7293607 7358265
10943 7358265 7424269 7492081 7553255 7613593 7673355 7742911 7818950 7897700 7977987 8073443 8200529
10932 8200529 8304206 8365247 8326081 8320160 8374678 8441134 8523712 8595681 8655254 8721195 8793609
$$ packed form
11010D432030K9489L3535L0140L2721K5842M0094N2508M7078N5450N5067L3561
10999D867515K4241Q044j890j995j626M708J3866M2714P7707R8240R7064O6107
10987E294695N4844M7673M6392K7291K5389K2925L6196M2869N2035N3805M4486
10976E748600M7185M9785M6307M2693M1494L6229M3235L4340L6328M1267L9392
10965F206855M0132L9003L8612K5569K2849M1692M4468O1510Q5141Q4199N0007
10954F740037M6356M2789N4239N2610O0052N5558O2276O7560N7348N4782O4658
10943G358265O6004O7812O1174O0338N9762O9556P6039P8750Q0287R5456J27086
10932H200529J03677O1041l9166n921N4518O6456Q2578P1969N9573O5941P2414
$$ plain form
10921 8793609 8860013 8928633 9002711 9075103 9144763 9219806 9306516 9397995 9498450 9597150 9687555
10910 9687555 9783079 9879365 9980973 10088570 10203590 10325495 10442560 10562787 10673991 10783588
10900 10783588 10895543 11014769 11133424 11254922 11375459 11492784 11612237 11743299 11884319
10891 11884319 12034950 12187164 12345450 12499817 12641530 12776457 12918247 13081132 13258396
10882 13258396 13441238 13629494 13819296 13995466 14175391 14365211 14558255 14765013 14993198
10873 14993198 15222660 15452904 15678548 15913290 16152973 16388570 16639515 16915825 17203673
10864 17203673 17515160 17834249 18126994 18422882 18744186 19099739 19459272 19826372 20219159
10855 20219159 20630056 21046797 21472183 21921216 22391890 22881035 23386855 23907100 24451703
$$ packed form
10921H793609O6404O8620P4078P2392O9660P5043Q6710R1479J00455R8700R0405
10910I687555R5524R6286J01608J07597J15020J21905J17065J20227J11204J09597
10900A0783588J11955J19226J18655J21498J20537J17325J19453J31062J41020
10891A1884319J50631J52214J58286J54367J41713J34927J41790J62885J77264
10882A3258396J82842J88256J89802J76170J79925J89820J93044K06758K28185
10873A4993198K29462K30244K25644K34742K39683K35597K50945K76310K87848
10864A7203673L11487L19089K92745K95888L21304L55553L59533L67100L92787
10855B0219159M10897M16741M25386M49033M70674M89145N05820N20245N44603
$$ plain form
10846 24451703 25024798 25615898 26225173 26855414 27543907 28297357 29139656 30040979 30961560
10837 30961560 31901877 32832148 33784139 34791336 35886284 37094231 38409199 39821940
10829 39821940 41365112 43034292 44823568 46727923 48792981 51067892 53412985 55446055
10821 55446055 57417935 59925729 63153839 67113597 71685313 76868338 82774982 89544529
10813 89544529 97332275 106611759 117931360 131993658 149673496 171842839 199284552
10806 199284552 230280958 253845882 231482149 112833042 -40862876 -158799442 -216236495
10799 -216236495 -216161398 -195764803 -174215062 -155342168 -139462039 -126093055 -114646300
10792 -114646300 -104857074 -96476879 -89286880 -83113400 -77678707 -72818820 -68440061 -64498209
$$ packed form
10846B4451703N73095N91100O09275O30241O88493P53450Q42299R01323R20581
10837C0961560R40317R30271R51991J007197J094948J207947J314968J412741
10829C9821940J543172J669180J789276J904355K065058K274911K345093K033070
10821E5446055J971880K507794L228110L959758M571716N183025N906644O769547
10813H9544529P787746R279484J1319601J4062298J7679838K2169343K7441713
10806A99284552L0996406K3564924k2363733j18649107j53695918j17936566n7437053
10799b16236495P5097K0396595K1549741J8872894J5880129J3368984J1446755
10792a14646300R789226Q380195P189999O173480N434693M859887M378759L941852
$$ plain form
10784 -64498209 -61044225 -58300396 -56385251 -54699529 -52863129 -50754708 -48570795 -46545259
10776 -46545259 -44736250 -43108515 -41586569 -40169806 -38850892 -37578383 -36354602 -35201684
10768 -35201684 -34152404 -33196219 -32343540 -31578965 -30861873 -30143660 -29418236 -28699735 -27996603
10759 -27996603 -27321523 -26682204 -26073187 -25498109 -24942128 -24390952 -23836700 -23296269 -22763270
10750 -22763270 -22247301 -21735644 -21215998 -20709716 -20224237 -19707421 -19137571 -18554918 -18139555
10741 -18139555 -18308098 -19049889 -19687932 -19917341 -19691923 -19259995 -18816151 -18413245 -18065939
10732 -18065939 -17758956 -17483019 -17209683 -16939192 -16658024 -16381840 -16125777 -15885361 -15660659
10723 -15660659 -15452337 -15249524 -15063614 -14880322 -14681924 -14474100 -14272612 -14082072 -13913394
$$ packed form
10784f4498209L453984K743829J915145J685722J836400K108421K183913K025536
10776d6545259J809009J627735J521946J416763J318914J272509J223781J152918
10768c5201684J049280R56185Q52679P64575P17092P18213P25424P18501P03132
10759b7996603O75080O39319O09017N75078N55981N51176N54252N40431N32999
10750b2763270N15969N11657N19646N06282M85479N16816N69850N82653M15363
10741a8139555j68543p41791o38043k29409K25418M31928M43844M02906L47306
10732a8065939L06983K75937K73336K70491K81168K76184K56063K40416K24702
10723a5660659K08322K02813J85910J83292J98398K07824K01488J90540J68678
$$ plain form
10714 -13913394 -13748712 -13599233 -13448458 -13296251 -13146911 -12998719 -12845796 -12693577 -12545206
10705 -12545206 -12410658 -12274813 -12134077 -11997775 -11875732 -11763440 -11652780 -11541771 -11427742
10696 -11427742 -11309938 -11196164 -11075618 -10949992 -10828969 -10706615 -10579350 -10445572 -10321325
10687 -10321325 -10223177 -10142890 -10082131 -10086697 -10163434 -10218339 -10213435 -10154617 -10085047 -9989024 -9871931
10676 -9871931 -9737852 -9594996 -9521884 -9498587 -9468154 -9410037 -9326386 -9256795 -9208373 -9160172 -9094169
10665 -9094169 -9030984 -8974834 -8905796 -8836662 -8774899 -8712444 -8655375 -8598247 -8540021 -8483181 -8430054
10654 -8430054 -8374716 -8327658 -8267825 -8198156 -8129119 -8066401 -8023988 -8017593 -7997452 -7950113 -7904428
10643 -7904428 -7845047 -7775189 -7716038 -7662897 -7611131 -7557509 -7503229 -7457568 -7407455 -7354088 -7306300
$$ packed form
10714a3913394J64682J49479J50775J52207J49340J48192J52923J52219J48371
10705a2545206J34548J35845J40736J36302J22043J12292J10660J11009J14029
10696a1427742J17804J13774J20546J25626J21023J22354J27265J33778J24247
10687a0321325R8148Q0287O0759m566p6737n4905M904N8818O9570R6023J17093
10676i871931J34079J42856P3112K3297L0433N8117Q3651O9591M8422M8201O6003
10665i094169O3185N6150O9038O9134O1763O2455N7069N7128N8226N6840N3127
10654h430054N5338M7058N9833O9669O9037O2718M2413O395K0141M7339M5685
10643g904428N9381O9858N9151N3141N1766N3622N4280M5661N0113N3367M7788
$$ plain form
10632 -7306300 -7262521 -7220990 -7178352 -7138497 -7099211 -7065010 -7039562 -7011708 -6984035 -6943800 -6897727
10621 -6897727 -6847416 -6806280 -6769175 -6736440 -6714316 -6690343 -6706907 -6769244 -6794689 -6772513 -6730522
10610 -6730522 -6672063 -6610260 -6537181 -6472420 -6419578 -6352074 -6300290 -6280859 -6277790 -6270010 -6244818 -6216202
10598 -6216202 -6181803 -6146245 -6104814 -6066976 -6036149 -6001153 -5958174 -5929887 -5914881 -5889795 -5868379
10587 -5868379 -5846367 -5825093 -5804653 -5784409 -5758614 -5734041 -5704051 -5669158 -5641351 -5614515 -5596840
10576 -5596840 -5575968 -5549125 -5527127 -5497051 -5479128 -5468833 -5459005 -5445422 -5419496 -5393524 -5372456
10565 -5372456 -5340463 -5306721 -5277047 -5250608 -5218835 -5191029 -5172985 -5159224 -5144219 -5128055 -5106110
10554 -5106110 -5091156 -5069389 -5056927 -5046550 -5034269 -5025245 -5017112 -5005876 -5003952 -4996299 -4971405 -4938805
$$ packed form
10632g306300M3779M1531M2638L9855L9286L4201K5448K7854K7673M0235M6073
10621f897727N0311M1136L7105L2735K2124K3973j6564o2337k5445K2176M1991
10610f730522N8459O1803P3079O4761N2842O7504N1784J9431L069P780K5192K8616
10598f216202L4399L5558M1431L7838L0827L4996M2979K8287J5006K5086K1416
10587e868379K2012K1274K0440K0244K5795K4573K9990L4893K7807K6836J7675
10576e596840K0872K6843K1998L0076J7923J0295R828J3583K5926K5972K1068
10565e372456L1993L3742K9674K6439L1773K7806J8044J3761J5005J6164K1945
10554e106110J4954K1767J2462J0377J2281R024Q133J1236J924P653K4894L2600
$$ plain form
10542 -4938805 -4907561 -4882565 -4857239 -4833838 -4810965 -4794227 -4785405 -4766415 -4745694 -4729279 -4716016
10531 -4716016 -4707156 -4690954 -4671221 -4654933 -4639922 -4614033 -4592591 -4571037 -4548014 -4529308 -4508406
10520 -4508406 -4491274 -4479760 -4466792 -4443570 -4425815 -4411379 -4399310 -4382380 -4368381 -4352924 -4339868
10509 -4339868 -4326241 -4309765 -4288941 -4266189 -4252505 -4248476 -4240183 -4226153 -4217998 -4204605 -4187566 -4186739
10497 -4186739 -4182124 -4170196 -4145835 -4121814 -4100136 -4082046 -4061201 -4038390 -4019025 -4006888 -4006053 -4006489
10485 -4006489 -3999916 -3979401 -3961148 -3944021 -3931370 -3928527 -3940284 -3953632 -3966452 -3970874 -3963081 -3958535
10473 -3958535 -3942410 -3913962 -3896695 -3880569 -3868382 -3855416 -3844599 -3833377 -3825457 -3811898 -3796132
10462 -3796132 -3783215 -3769662 -3758223 -3738928 -3722714 -3710204 -3709384 -3700473 -3690662 -3678607 -3662538 -3653089
$$ packed form
10542d938805L1244K4996K5326K3401K2873J6738Q822J8990K0721J6415J3263
10531d716016Q860J6202J9733J6288J5011K5889K1442K1554K3023J8706K0902
10520d508406J7132J1514J2968K3222J7755J4436J2069J6930J3999J5457J3056
10509d339868J3627J6476K0824K2752J3684M029Q293J4030Q155J3393J7039Q27
10497d186739M615J1928K4361K4021K1678J8090K0845K2811J9365J2137Q35m36
10485d006489O573K0515J8253J7127J2651K843j1757j3348j2820m422P793M546
10473c958535J6125K8448J7267J6126J2187J2966J0817J1222P920J3559J5766
10462c796132J2917J3553J1439J9295J6214J2510Q20Q911R811J2055J6069R449
$$ plain form
10450 -3653089 -3641145 -3623639 -3605071 -3590209 -3567577 -3557657 -3546642 -3528519 -3512460 -3495818 -3477329
10439 -3477329 -3467749 -3469940 -3488720 -3506090 -3509013 -3508442 -3496535 -3475095 -3453120 -3441939 -3430438 -3410850
10427 -3410850 -3387768 -3374756 -3351745 -3334165 -3321584 -3307638 -3281086 -3254269 -3241663 -3228913 -3215356
10416 -3215356 -3197651 -3178590 -3159634 -3134337 -3112968 -3090747 -3064113 -3035932 -3004486 -2963711 -2921897
10405 -2921897 -2878000 -2832677 -2778969 -2708025 -2626538 -2523836 -2397091 -2238249 -2056765 -1895114
10395 -1895114 -1965838 -2576638 -3460160 -4153007 -4474416 -4455472 -4324688 -4187979 -4079157 -3992044
10385 -3992044 -3914852 -3844299 -3782643 -3725455 -3679183 -3648298 -3606120 -3572108 -3546512 -3508868 -3485088
10374 -3485088 -3460007 -3438796 -3417212 -3404368 -3388716 -3378185 -3370292 -3355656 -3339053 -3321503 -3295961
$$ packed form
10450c653089J1944J7506J8568J4862K2632R920J1015J8123J6059J6642J8489
10439c477329R580k191j8780j7370k923N71J1907K1440K1975J1181J1501J9588
10427c410850K3082J3012K3011J7580J2581J3946K6552K6817J2606J2750J3557
10416c215356J7705J9061J8956K5297K1369K2221K6634K8181L1446M0775M1814
10405b921897M3897M5323N3708P0944Q1487J02702J26745J58842J81484J61651
10395a895114p0724o10800q83522o92847l21409J8944J30784J36709J08822Q7113
10385c992044P7192P0553O1656N7188M6272L0885M2178L4012K5596L7644K3780
10374c485088K5081K1211K1584J2844J5652J0531P893J4636J6603J7550K5542
$$ plain form
10363 -3295961 -3275909 -3262142 -3244435 -3229949 -3214284 -3199307 -3187464 -3176259 -3174666 -3165289 -3152540 -3145224
10351 -3145224 -3130323 -3108910 -3093206 -3088013 -3089732 -3085068 -3072207 -3058568 -3042183 -3032313 -3026031 -3020506
10339 -3020506 -3015115 -3009186 -3013171 -3016668 -3002071 -2975080 -2953825 -2949186 -2942040 -2927906 -2912541 -2898099
10327 -2898099 -2879000 -2859256 -2847801 -2848012 -2867581 -2898125 -2927981 -2945449 -2955732 -2961743 -2958294 -2946455
10315 -2946455 -2931230 -2917731 -2910946 -2902802 -2888795 -2880809 -2869717 -2857163 -2846697 -2844691 -2832087 -2823348
10303 -2823348 -2811961 -2799138 -2783461 -2773494 -2762919 -2749172 -2735419 -2729082 -2728800 -2739021 -2757484 -2783055
10291 -2783055 -2812415 -2828007 -2828849 -2824201 -2818288 -2808196 -2788299 -2777754 -2772957 -2762012 -2752284 -2744822 -2739643
10278 -2739643 -2733353 -2725457 -2717492 -2721582 -2720272 -2712167 -2701847 -2693049 -2691474 -2689174 -2683414 -2675122 -2665215 -2656287
$$ packed form
10363c295961K0052J3767J7707J4486J5665J4977J1843J1205J593R377J2749P316
10351c145224J4901K1413J5704N193j719M664J2861J3639J6385R870O282N525
10339c020506N391N929l985l497J4597K6991K1255M639P146J4134J5365J4442
10327b898099J9099J9744J1455k11j9569l0544k9856j7468j0283o011L449J1839
10315b946455J5225J3499O785Q144J4007P986J1092J2554J0466K006J2604Q739
10303b823348J1387J2823J5677R967J0575J3747J3753O337K82j0221j8463k5571
10291b783055k9360j5592q42M648N913J0092J9897J0545M797J0945R728P462N179
10278b739643O290P896P965m090J310Q105J0320Q798J575K300N760Q292R907Q928
$$ plain form
10264 -2656287 -2651915 -2645748 -2636171 -2622983 -2618624 -2624214 -2619893 -2614434 -2612000 -2611711 -2608427 -2607939 -2601934 -2593688
10250 -2593688 -2588757 -2577933 -2564885 -2561625 -2565190 -2560732 -2561822 -2563545 -2560231 -2555708 -2548529 -2542245 -2536934
10237 -2536934 -2531799 -2526476 -2525936 -2523711 -2519909 -2510773 -2504967 -2499416 -2490323 -2489405 -2486895 -2491622 -2486192 -2476402
10223 -2476402 -2472329 -2466920 -2456696 -2447333 -2448095 -2447025 -2442083 -2442135 -2433902 -2431018 -2427579 -2428245 -2427932 -2423217 -2417969
10208 -2417969 -2416442 -2405604 -2399481 -2397751 -2401735 -2396630 -2393481 -2390607 -2387783 -2392808 -2384473 -2370058 -2362418
10195 -2362418 -2363211 -2355906 -2352598 -2353360 -2352905 -2359686 -2359698 -2351870 -2341619 -2332125 -2332932 -2337537 -2329957 -2318931 -2312523
10180 -2312523 -2313088 -2317951 -2311910 -2304535 -2307475 -2309121 -2305521 -2300769 -2296411 -2287294 -2277962 -2271969 -2262678 -2257430
10166 -2257430 -2255977 -2255156 -2251616 -2252099 -2243167 -2241045 -2239032 -2234192 -2233451 -2230599 -2229456 -2219759 -2211973 -2209286 -2210139
$$ packed form
10264b656287M372O167R577J3188M359n590M321N459K434K89L284M88O005Q246
10250b593688M931J0824J3048L260l565M458j090j723L314M523P179O284N311
10237b536934N135N323N40K225L802R136N806N551R093R18K510m727N430R790
10223b476402M073N409J0224R363p62J070M942n2Q233K884L439o66L13M715N248
10208b417969J527J0838O123J730l984N105L149K874K824n025Q335J4415P640
10195b362418p93P305L308p62M55o781j2P828J0251R494q07m605P580J1026O408
10180b312523n65m863O041P375k940j646L600M752M358R117R332N993R291N248
10166b257430J453Q21L540m83Q932K122K013M840P41K852J143R697P786K687q53
$$ plain form
10151 -2210139 -2217170 -2221111 -2218366 -2207458 -2201380 -2200161 -2198163 -2191909 -2190934 -2187581 -2189152 -2190405 -2186560 -2181282
10137 -2181282 -2174657 -2167635 -2172057 -2174726 -2162231 -2153621 -2152196 -2153029 -2148611 -2145038 -2142139 -2133916 -2129252 -2131014
10123 -2131014 -2127977 -2129941 -2130593 -2127474 -2119763 -2116935 -2112721 -2106906 -2103521 -2101161 -2107903 -2104187 -2103270 -2108229
10109 -2108229 -2101016 -2094208 -2090914 -2092828 -2082772 -2081675 -2079649 -2073067 -2070632 -2074354 -2074680 -2064027 -2056483 -2055357
10095 -2055357 -2054488 -2056052 -2047226 -2044968 -2041267 -2032978 -2032679 -2033483 -2031601 -2030253 -2027177 -2025376 -2022579 -2016445 -2007891
10080 -2007891 -2004541 -2001293 -1993207 -1991172 -1999570 -1998600 -1988894 -1981579 -1983604 -1984837 -1977347 -1978856 -1978450 -1976968
10066 -1976968 -1971939 -1962792 -1956175 -1960061 -1963430 -1960792 -1956103 -1950142 -1943793 -1949263 -1954990 -1950595 -1935900 -1930473
10052 -1930473 -1931299 -1933514 -1923128 -1914923 -1908828 -1903209 -1908091 -1924051 -1932528 -1936036 -1929715 -1919613 -1904818
$$ packed form
10151b210139p031l941K745J0908O078J219J998O254R75L353j571j253L845N278
10137b181282O625P022m422k669J2495Q610J425q33M418L573K899Q223M664j762
10123b131014L037j964o52L119P711K828M214N815L385K360o742L716R17m959
10109b108229P213O808L294j914J0056J097K026O582K435l722l26J0653P544J126
10095b055357Q69j564Q826K258L701Q289K99q04J882J348L076J801K797O134Q554
10080b007891L350L248Q086K035q398R70R706P315k025j233P490j509M06J482
10066a976968N029R147O617l886l369K638M689N961O349n470n727M395J4695N427
10052a930473q26k215J0386Q205O095N619m882j5960q477l508O321J0102J4795
$$ plain form
10039 -1904818 -1893833 -1889741 -1891711 -1891544 -1897290 -1895426 -1888431 -1882143 -1879010 -1879934 -1873221 -1871855 -1876170 -1877072
10025 -1877072 -1871187 -1865300 -1859977 -1854914 -1850021 -1846372 -1845732 -1835414 -1823133 -1822684 -1819846 -1813165 -1807887 -1810195
10011 -1810195 -1811474 -1803551 -1800052 -1802491 -1808694 -1810090 -1804949 -1801091 -1796080 -1795131 -1795238 -1787683 -1779684 -1786412
9997 -1786412 -1793491 -1790683 -1786453 -1783878 -1780413 -1778144 -1778253 -1773493 -1767748 -1756993 -1752462 -1747297 -1739269 -1732470
9983 -1732470 -1726181 -1719454 -1719875 -1717595 -1716917 -1715696 -1717411 -1715760 -1712922 -1712573 -1712797 -1706401 -1700946 -1705964 -1705932 -1707865
9967 -1707865 -1700852 -1690898 -1688500 -1687729 -1677138 -1664983 -1655782 -1653775 -1650455 -1646904 -1638401 -1637006 -1632070 -1623821
9953 -1623821 -1627612 -1625172 -1619111 -1604378 -1596023 -1585534 -1574813 -1566183 -1566065 -1567889 -1555807 -1548207 -1544206
9940 -1544206 -1536169 -1524090 -1519855 -1515292 -1505606 -1495356 -1479364 -1460998 -1440273 -1414288 -1397159 -1383292
$$ packed form
10039a904818J0985M092j970J67n746J864O995O288L133r24O713J366m315r02
10025a877072N885N887N323N063M893L649O40J0318J2281M49K838O681N278k308
10011a810195j279P923L499k439o203j396N141L858N011R49j07P555P999o728
9997a786412p079K808M230K575L465K269j09M760N745J0755M531N165Q028O799
9983a732470O289O727m21K280O78J221j715J651K838L49k24O396N455n018L2j933
9967a707865P013R954K398P71J0591J2155R201K007L320L551Q503J395M936Q249
9953a623821l791K440O061J4733Q355J0489J0721Q630J18j824J2082P600M001
9940a544206Q037J2079M235M563R686J0250J5992J8366K0725K5985J7129J3867
$$ plain form
9928 -1383292 -1361108 -1331603 -1306471 -1281770 -1247893 -1209673 -1166337 -1119267 -1067532 -995610 -918458
9917 -918458 -825947 -710838 -591406 -481245 -405155 -392266 -500864 -755149 -1120546 -1540737
9907 -1540737 -1989361 -2401783 -2710132 -2898733 -2969455 -2953751 -2879618 -2781874 -2680622 -2586144
9897 -2586144 -2505958 -2436015 -2383253 -2345301 -2302575 -2258127 -2220795 -2188371 -2168984 -2151785 -2123472
9886 -2123472 -2096449 -2080331 -2066896 -2053897 -2042313 -2027485 -2012662 -1998949 -1983985 -1976492 -1969133 -1961341
9874 -1961341 -1944293 -1936260 -1929024 -1916100 -1906975 -1899635 -1888678 -1883382 -1874329 -1865426 -1864549 -1859195 -1850010 -1837351
9860 -1837351 -1828190 -1821224 -1821127 -1820379 -1815163 -1808761 -1798047 -1791882 -1787880 -1784318 -1771986 -1766006 -1771235 -1783827
9846 -1783827 -1785440 -1787686 -1790885 -1790445 -1783356 -1775202 -1772784 -1766073 -1761135 -1762687 -1754306 -1745638 -1740219 -1738494
$$ packed form
9928a383292K2184K9505K5132K4701L3877L8220M3336M7070N1735P1922P7152
9917i18458R2511J15109J19432J10161P6090J2889j08598k54285l65397m20191
9907a540737m48624m12422l08349j88601p0722J5704P4133R7744J01252R4478
9897b586144Q0186O9943N2762L7952M2726M4448L7332L2424J9387J7199K8313
9886b123472K7023J6118J3435J2999J1584J4828J4823J3713J4964P493P359P792
9874a961341J7048Q033P236J2924R125P340J0957N296R053Q903Q77N354R185J2659
9860a837351R161O966R7P48N216O402J0714O165M002L562J2332N980n229j2592
9846a783827j613k246l199M40P089Q154K418O711M938j552Q381Q668N419J725
$$ plain form
9832 -1738494 -1736454 -1728040 -1722798 -1723951 -1720642 -1720666 -1716669 -1712614 -1708830 -1707530 -1709034 -1705789 -1699762 -1696599 -1695456
9817 -1695456 -1688427 -1689310 -1692693 -1687027 -1679275 -1675908 -1684717 -1689445 -1683771 -1681061 -1675195 -1666432 -1661149 -1658790
9803 -1658790 -1664603 -1662345 -1653199 -1653903 -1651210 -1646168 -1641623 -1639429 -1645131 -1638672 -1632580 -1633184 -1630661 -1630635 -1632909
9788 -1632909 -1628257 -1631607 -1629400 -1625249 -1619008 -1617246 -1614348 -1609024 -1602537 -1601765 -1597269 -1597814 -1596422 -1595894 -1598789
9773 -1598789 -1608633 -1616585 -1619130 -1624460 -1621372 -1617946 -1615185 -1603210 -1595989 -1594039 -1587537 -1584079 -1582940 -1585819
9759 -1585819 -1580185 -1575430 -1571017 -1565007 -1568397 -1570033 -1575193 -1574568 -1565549 -1569469 -1564521 -1566680 -1569144 -1568148 -1569396
9744 -1569396 -1569847 -1572303 -1569375 -1567370 -1567433 -1567032 -1559754 -1556213 -1554125 -1549960 -1546656 -1542564 -1540320 -1538916 -1539338
9729 -1539338 -1539708 -1538586 -1537152 -1530060 -1531825 -1524819 -1525600 -1532138 -1527622 -1523915 -1521381 -1526804 -1526559 -1518657 -1519763
$$ packed form
9832a738494K040Q414N242j153L309k4L997M055L784J300j504L245O027L163J143
9817a695456P029q83l383N666P752L367q809m728N674K710N866Q763N283K359
9803a658790n813K258R146p04K693N042M545K194n702O459O092o04K523K6k274
9788a632909M652l350K207M151O241J762K898N324O487P72M496n45J392N28k895
9773a598789r844p952k545n330L088L426K761J1975P221J950O502L458J139k879
9759a585819N634M755M413O010l390j636n160O25R019l920M948k159k464R96j248
9744a569396m51k456K928K005o3M01P278L541K088M165L304M092K244J404m22
9729a539338l70J122J434P092j765P006p81o538M516L707K534n423K45P902j106
$$ plain form
9714 -1519763 -1527434 -1528598 -1526122 -1523659 -1521122 -1515006 -1507416 -1500110 -1489538 -1490517 -1497506 -1498576 -1497871 -1498909
9700 -1498909 -1496462 -1491815 -1490965 -1501331 -1509971 -1500312 -1492790 -1493889 -1488841 -1480462 -1478129 -1474287 -1477623 -1481558
9686 -1481558 -1484651 -1479742 -1474180 -1467642 -1468997 -1471793 -1473455 -1472943 -1468882 -1471284 -1475974 -1471144 -1463550 -1460193
9672 -1460193 -1461605 -1459595 -1454151 -1452133 -1450057 -1449489 -1454738 -1453577 -1450859 -1454059 -1450316 -1444280 -1437325 -1435050
9658 -1435050 -1439083 -1445668 -1449941 -1441864 -1438592 -1443586 -1441326 -1438922 -1445523 -1439143 -1434824 -1427325 -1423744 -1422162
9644 -1422162 -1422329 -1421459 -1419613 -1421494 -1427300 -1423785 -1409120 -1413712 -1414835 -1412164 -1409949 -1412405 -1409776 -1409062 -1404565
9629 -1404565 -1397895 -1399784 -1400134 -1402413 -1400518 -1402613 -1406609 -1410057 -1401214 -1400235 -1397155 -1398759 -1394810 -1390803 -1392195
9614 -1392195 -1396129 -1398160 -1399680 -1394652 -1389397 -1386542 -1379556 -1380827 -1379270 -1381217 -1379740 -1385208 -1383288 -1374233
$$ packed form
9714a519763p671j164K476K463K537O116P590P306J0572r79o989j070P05j038
9700a498909K447M647Q50j0366q640R659P522j099N048Q379K333L842l336l935
9686a481558l093M909N562O538j355k796j662N12M061k402m690M830P594L357
9672a460193j412K010N444K018K076N68n249J161K718l200L743O036O955K275
9658a435050m033o585m273Q077L272m994K260K404o601O380M319P499L581J582
9644a422162j67Q70J846j881n806L515J4665m592j123K671K215k456K629P14M497
9629a404565O670j889l50k279J895k095l996l448Q843R79L080j604L949M007j392
9614a392195l934k031j520N028N255K855O986j271J557j947J477n468J920R055
$$ plain form
9600 -1374233 -1370516 -1376039 -1372932 -1368753 -1366486 -1363940 -1363482 -1359007 -1361343 -1357628 -1353844 -1354143 -1350839 -1340102
9586 -1340102 -1341220 -1345896 -1348364 -1344848 -1341575 -1333539 -1329231 -1335285 -1333043 -1335388 -1342168 -1346888 -1343446 -1331967
9572 -1331967 -1331296 -1329843 -1333495 -1329861 -1330943 -1336563 -1339858 -1335506 -1328706 -1325272 -1328107 -1329315 -1325311 -1322947
9558 -1322947 -1317650 -1324503 -1330756 -1324510 -1321165 -1320591 -1326607 -1330055 -1329511 -1325423 -1319291 -1313222 -1314974 -1314245 -1315525
9543 -1315525 -1317574 -1309453 -1302119 -1299816 -1307189 -1308202 -1305927 -1297430 -1296051 -1298774 -1295552 -1295514 -1297701 -1296376 -1300725
9528 -1300725 -1302851 -1287303 -1281582 -1290662 -1294667 -1294933 -1293458 -1285383 -1279064 -1279914 -1277901 -1272493 -1270589 -1273530
9514 -1273530 -1278492 -1280301 -1276776 -1272756 -1276472 -1275674 -1271145 -1269569 -1263613 -1257288 -1257758 -1261315 -1260612 -1258673 -1259662
9499 -1259662 -1264813 -1265330 -1263127 -1261698 -1262665 -1258946 -1251714 -1243306 -1238646 -1243193 -1247533 -1248602 -1244980 -1244548 -1244755
$$ packed form
9600a374233L717n523L107M179K267K546M58M475k336L715L784k99L304J0737
9586a340102j118m676k468L516L273Q036M308o054K242k345o780m720L442J1479
9572a331967O71J453l652L634j082n620l295M352O800L434k835j208M004K364
9558a322947N297o853o253O246L345N74o016l448N44M088O132O069j752P29j280
9543a315525k049Q121P334K303p373j013K275Q497J379k723L222L8k187J325m349
9528a300725k126J5548N721r080m005k66J475Q075O319q50K013N408J904k941
9514a273530m962j809L525M020l716P98M529J576N956O325m70l557P03J939r89
9499a259662n151n17K203J429r67L719P232Q408M660m547m340j069L622M32k07
$$ plain form
9484 -1244755 -1241830 -1239959 -1238195 -1231280 -1225778 -1224392 -1226726 -1221220 -1221632 -1221301 -1220568 -1221862 -1220564 -1216347 -1213074
9469 -1213074 -1213869 -1212240 -1211761 -1211907 -1212733 -1214489 -1214207 -1210796 -1206786 -1201481 -1189549 -1183426 -1179466 -1171809 -1174083
9454 -1174083 -1178734 -1175377 -1176398 -1174882 -1165492 -1167141 -1165767 -1165797 -1166115 -1171512 -1170760 -1162681 -1159763 -1154084 -1152180
9439 -1152180 -1160282 -1160457 -1148147 -1136168 -1134531 -1136532 -1135429 -1128748 -1123888 -1121474 -1122498 -1124332 -1128159 -1134696
9425 -1134696 -1131982 -1129106 -1122789 -1115857 -1110958 -1109666 -1104480 -1097347 -1098564 -1098150 -1092851 -1085572 -1077869 -1075379
9411 -1075379 -1069153 -1060470 -1056699 -1058291 -1054096 -1046726 -1039832 -1033421 -1030350 -1028193 -1028204 -1014580 -1001871 -997166
9397 -997166 -996926 -989706 -976897 -961769 -956310 -953035 -943253 -934109 -920785 -907371 -899983 -879876 -865236
9384 -865236 -852987 -839986 -826101 -798754 -776489 -762809 -746855 -715680 -684877 -650868 -612432 -569829
$$ packed form
9484a244755K925J871J764O915N502J386k334N506m12L31P33j294J298M217L273
9469a213074p95J629M79j46q26j756K82L411M010N305J1932O123L960P657k274
9454a174083m651L357j021J516R390j649J374l0l18n397P52Q079K918N679J904
9439a152180q102j75J2310J1979J637k001J103O681M860K414j024j834l827o537
9425a134696K714K876O317O932M899J292N186P133j217M14N299P279P703K490
9411a075379O226Q683L771j592M195P370O894O411L071K157j1J3624J2709M705
9397i97166K40P220J2809J5128N459L275R782R144J3324J3414P388K0107J4640
9384h65236J2249J3001J3885K7347K2265J3680J5954L1175L0803L4009L8436M2603
$$ plain form
9372 -569829 -526518 -472651 -413348 -347436 -261503 -152907 -22144 137541 334514 604641 917293
9361 917293 1190971 1061364 -44475 -1596097 -2768495 -3289372 -3247963 -3030080 -2816476
9352 -2816476 -2638163 -2482326 -2359561 -2264693 -2180499 -2100732 -2039743 -1983571 -1921595 -1875373 -1842800
9341 -1842800 -1805204 -1772787 -1746317 -1722978 -1695577 -1673555 -1651036 -1630178 -1612004 -1596005 -1583856
9330 -1583856 -1572460 -1560486 -1548762 -1534757 -1520503 -1503717 -1495857 -1491958 -1485158 -1475305 -1468614 -1463742 -1454839
9317 -1454839 -1450797 -1449817 -1445296 -1440104 -1435083 -1425133 -1416118 -1408489 -1403148 -1394992 -1389613 -1390449 -1389049 -1385314 -1385079
9302 -1385079 -1383408 -1375802 -1368928 -1363032 -1354989 -1348049 -1345087 -1340745 -1341694 -1343753 -1338055 -1332275 -1329463 -1329642 -1332475
9287 -1332475 -1331121 -1323137 -1316456 -1314613 -1308440 -1295654 -1293267 -1294767 -1296848 -1294981 -1285277 -1282532 -1285272 -1286525
$$ packed form
9372e69829M3311N3867N9303O5912Q5933J08596J30763J59685J96973K70127L12652
9361I17293K73678j29607j105839j551622j172398n20877M1409K17883K13604
9352b816476J78313J55837J22765R4868Q4194P9767O0989N6172O1976M6222L2573
9341a842800L7596L2417K6470K3339K7401K2022K2519K0858J8174J5999J2149
9330a583856J1396J1974J1724J4005J4254J6786P860L899O800R853O691M872Q903
9317a454839M042R80M521N192N021R950R015P629N341Q156N379q36J400L735K35
9302a385079J671P606O874N896Q043O940K962M342r49k059N698N780K812j79k833
9287a332475J354P984O681J843O173J2786K387j500k081J867R704K745k740j253
$$ plain form
9273 -1286525 -1287518 -1285074 -1281664 -1280800 -1280252 -1275987 -1280273 -1281705 -1275815 -1271867 -1277296 -1272216 -1262445 -1264204 -1269395
9258 -1269395 -1271010 -1266981 -1258493 -1247186 -1241561 -1244450 -1260475 -1262014 -1253833 -1250692 -1253381 -1250103 -1248541 -1245775
9244 -1245775 -1233886 -1225434 -1224348 -1227085 -1225706 -1224199 -1226028 -1232595 -1231911 -1224196 -1214344 -1214395 -1224365 -1223783 -1222529
9229 -1222529 -1227635 -1231596 -1230669 -1225684 -1224224 -1220484 -1217506 -1208539 -1203175 -1200099 -1199372 -1197002 -1198265 -1193136 -1183717
9214 -1183717 -1178683 -1185616 -1194825 -1195463 -1199514 -1198604 -1192764 -1181308 -1180153 -1174320 -1170759 -1167870 -1166858 -1165668
9200 -1165668 -1168976 -1169749 -1165403 -1164924 -1166564 -1170670 -1171343 -1163716 -1158410 -1166023 -1168884 -1169193 -1165008 -1165308 -1174882
9185 -1174882 -1180683 -1174719 -1165039 -1164687 -1167750 -1169224 -1167718 -1164224 -1157534 -1158501 -1158846 -1155702 -1158521 -1161713 -1162113
9170 -1162113 -1154739 -1151334 -1157257 -1160929 -1155116 -1148219 -1143132 -1139846 -1137980 -1134646 -1133068 -1132900 -1129837 -1133941
$$ packed form
9273a286525r93K444L410Q64N48M265m286j432N890L948n429N080R771j759n191
9258a269395j615M029Q488J1307N625k889j6025j539Q181L141k689L278J562K766
9244a245775J1889Q452J086k737J379J507j829o567O84P715R852n1r970N82J254
9229a222529n106l961R27M985J460L740K978Q967N364L076P27K370j263N129R419
9214a183717N034o933r209o38m051R10N840J1456J155N833L561K889J012J190
9200a165668l308p73M346M79j640m106o73P627N306p613k861l09M185l00r574
9185a174882n801N964R680L52l063j474J506L494O690r67l45L144k819l192m00
9170a162113P374L405n923l672N813O897N087L286J866L334J578J68L063m104
$$ plain form
9156 -1133941 -1138720 -1134326 -1125342 -1132981 -1139857 -1138362 -1134369 -1131026 -1124831 -1123756 -1127588 -1131118 -1128037 -1126295
9142 -1126295 -1124994 -1124846 -1127525 -1124592 -1126441 -1126766 -1121120 -1119492 -1121388 -1123335 -1128794 -1125126 -1119795 -1119377 -1109810
9127 -1109810 -1107619 -1116841 -1113775 -1106695 -1106893 -1106366 -1102609 -1097245 -1094788 -1099011 -1102991 -1104784 -1106792 -1097964 -1092057
9112 -1092057 -1091197 -1089602 -1089674 -1090574 -1090486 -1083022 -1073097 -1068616 -1072537 -1082336 -1083123 -1076412 -1076350 -1081344 -1080280 -1076421
9096 -1076421 -1072194 -1065314 -1065290 -1070473 -1070195 -1069658 -1063957 -1063224 -1052312 -1044892 -1044128 -1044238 -1039532 -1035474 -1038844 -1037601
9080 -1037601 -1038035 -1031277 -1028920 -1036303 -1034557 -1028923 -1023952 -1018974 -1012506 -1010873 -1016492 -1025104 -1020375 -1006890
9066 -1006890 -999524 -997273 -993692 -995563 -987986 -972913 -964662 -962778 -949619 -940671 -936189 -918905 -900197
9053 -900197 -881778 -855023 -824718 -792128 -757611 -750099 -793105 -883900 -1010191 -1117376 -1185951
$$ packed form
9156a133941m779M394Q984p639o876J495L993L343O195J075l832l530L081J742
9142a126295J301J48k679K933j849l25N646J628j896j947n459L668N331M18R567
9127a109810K191r222L066P080j98N27L757N364K457m223l980j793k008Q828N907
9112a092057Q60J595p2r00Q8P464R925M481l921r799p87O711O2m994J064L859
9096a076421M227O880K4n183K78N37N701P33J0912P420P64j10M706M058l370J243
9080a037601m34O758K357p383J746N634M971M978O468J633n619q612M729J3485
9066a006890P366K251L581j871P577J5073Q251J884J3159Q948M482J7284J8708
9053i00197J8419K6755L0305L2590L4517P512m3006r0795j26291j07185o8575
$$ plain form
9042 -1185951 -1212485 -1216748 -1211221 -1207415 -1204971 -1204584 -1202421 -1208957 -1210673 -1205665 -1198955 -1181162 -1168392 -1159556
9028 -1159556 -1154682 -1140014 -1129026 -1125134 -1115975 -1102391 -1096920 -1080939 -1063413 -1047820 -1039284 -1035034 -1027980
9015 -1027980 -1012320 -992778 -977949 -952395 -927713 -895947 -861222 -837782 -838856 -880981 -967227 -1080361
9003 -1080361 -1188899 -1267106 -1302674 -1297574 -1284855 -1278819 -1280190 -1286486 -1289699 -1290898 -1283777 -1276477 -1265828
8990 -1265828 -1256535 -1254179 -1232789 -1218314 -1215844 -1215920 -1209445 -1199722 -1191148 -1189422 -1185868 -1177628 -1174911 -1166873
8976 -1166873 -1160347 -1161191 -1160733 -1158496 -1156219 -1150449 -1144208 -1142732 -1142554 -1137696 -1137039 -1135673 -1135657 -1147725 -1148847
8961 -1148847 -1141861 -1141598 -1139947 -1135240 -1127172 -1124160 -1122570 -1113985 -1116071 -1124218 -1115418 -1100058 -1099824 -1103653
8947 -1103653 -1098536 -1096689 -1104884 -1103295 -1101405 -1101646 -1099972 -1097038 -1093795 -1100101 -1096719 -1088245 -1087018 -1086825 -1091783
$$ packed form
9042a185951k6534m263N527L806K444L87K163o536j716N008O710J7793J2770Q836
9028a159556M874J4668J0988L892R159J3584N471J5981J7526J5593Q536M250P054
9015a027980J5660J9542J4829K5554K4682L1766L4725K3440j074m2125q6246j13134
9003a080361j08538p8207l5568N100J2719O036j371o296l213j199P121P300J0649
8990a265828R293K356K1390J4475K470p6O475R723Q574J726L554Q240K717Q038
8976a166873O526q44M58K237K277N770O241J476J78M858O57J366J6j2068j122
8961a148847O986K63J651M707Q068L012J590Q585k086q147Q800J5360K34l829
8947a103653N117J847q195J589J890k41J674K934L243o306L382Q474J227J93m958
$$ plain form
8932 -1091783 -1092146 -1096132 -1095326 -1089358 -1081627 -1079549 -1079127 -1081259 -1082826 -1082548 -1080845 -1080045 -1081154 -1079076 -1074366
8917 -1074366 -1079143 -1078055 -1070834 -1067236 -1061533 -1057174 -1057217 -1059702 -1070414 -1077671 -1074684 -1068732 -1066200 -1060323
8903 -1060323 -1060690 -1065912 -1063313 -1059892 -1064367 -1060349 -1050917 -1052427 -1053461 -1053298 -1056422 -1058958 -1045020 -1038483
8889 -1038483 -1044546 -1048541 -1051553 -1044306 -1040756 -1045042 -1037197 -1028658 -1032451 -1039691 -1043864 -1044901 -1042841 -1040318
8875 -1040318 -1039776 -1040878 -1041984 -1040674 -1043431 -1043732 -1044942 -1043779 -1038774 -1042396 -1035726 -1038341 -1038313 -1030909 -1031538
8860 -1031538 -1036957 -1039956 -1034992 -1033261 -1035993 -1038481 -1036167 -1037617 -1035110 -1031127 -1026477 -1024350 -1029012 -1029822
8846 -1029822 -1031912 -1039046 -1038915 -1031973 -1033034 -1028274 -1026110 -1030171 -1024428 -1025568 -1021323 -1018220 -1018829 -1021915 -1024935
8831 -1024935 -1027867 -1025709 -1023966 -1023078 -1022443 -1015810 -1012060 -1014480 -1012812 -1013235 -1014014 -1012119 -1008036 -1009305 -1014058
$$ packed form
8932a091783l63l986Q06N968P731K078M22k132j567K78J703Q00j109K078M710
8917a074366m777J088P221L598N703M359m3k485j0712p257K987N952K532N877
8903a060323l67n222K599L421m475M018R432j510j034J63l124k536J3938O537
8889a038483o063l995l012P247L550m286P845Q539l793p240m173j037K060K523
8875a040318N42j102j106J310k757l01j210J163N005l622O670k615K8P404o29
8860a031538n419k999M964J731k732k488K314j450K507L983M650K127m662q10
8846a029822k090p134J31O942j061M760K164m061N743j140M245L103o09l086l020
8831a024935k932K158J743Q88O35O633L750k420J668m23p79J895M083j269m753
$$ plain form
8816 -1014058 -1018499 -1016250 -1014447 -1013957 -1013925 -1017194 -1020633 -1016934 -1014121 -1007808 -1008337 -1005054 -997858 -1000039 -1002570
8801 -1002570 -1008156 -1011012 -1003651 -996575 -991752 -993214 -994778 -998069 -1005383 -1010214 -1007420 -998638 -997720 -999543
8787 -999543 -997248 -998666 -995579 -995722 -998519 -992826 -990030 -988444 -995679 -998131 -995439 -995669 -992132 -988609 -985871
8772 -985871 -985949 -986388 -980725 -979139 -976231 -978834 -982146 -987044 -982557 -973235 -965632 -968626 -972403 -971209 -962030
8757 -962030 -957351 -960184 -955713 -946328 -939161 -945459 -957943 -977304 -999995 -1016711 -1022969 -1028168 -1028817 -1020658
8743 -1020658 -1007668 -997508 -994897 -997704 -1001324 -1005131 -997695 -988037 -981833 -984731 -977625 -976136 -986027 -986519
8729 -986519 -986197 -985738 -981415 -972791 -975507 -975465 -974480 -975294 -976196 -978828 -975267 -975387 -972126 -969118 -967511 -966886 -964620
8712 -964620 -968743 -971193 -974651 -974793 -977453 -977614 -978470 -975992 -970168 -972667 -969917 -968324 -968812 -964014 -961605
$$ packed form
8816a014058m441K249J803M90L2l269l439L699K813O313n29L283P196k181k531
8801a002570n586k856P361P076M823j462j564l291p314m831K794Q782R18j823
8787i99543K295j418L087j43k797N693K796J586p235k452K692k30L537L523K738
8772i85871p8m39N663J586K908k603l312m898M487R322P603k994l777J194R179
8757i62030M679k833M471R385P167o298j2484j9361k2691j6716o258n199o49Q159
8743a020658J2990J0160K611k807l620l807P436R658O204k898P106J489r891m92
8729i86519L22M59M323Q624k716M2R85q14r02k632L561j20L261L008J607O25K266
8712i64620m123k450l458j42k660j61q56K478N824k499K750J593m88M798K409
$$ plain form
8697 -961605 -958110 -962027 -964089 -960761 -959101 -959573 -959325 -966939 -968881 -967389 -965228 -957718 -951202 -946830 -953155
8682 -953155 -956418 -950708 -946870 -947433 -953272 -961609 -954525 -943582 -941378 -935063 -936706 -943450 -948507 -949536
8668 -949536 -944815 -939150 -943715 -944631 -944210 -939109 -936456 -945258 -954558 -953829 -951313 -954231 -954712 -946612 -946350 -947685
8652 -947685 -941406 -931791 -938537 -940263 -941073 -945242 -945604 -950537 -951441 -947331 -941644 -936529 -935278 -936742 -931449
8637 -931449 -929138 -931420 -937204 -940880 -939749 -934041 -930356 -933330 -936817 -930877 -925040 -920352 -920506 -926774 -930256
8622 -930256 -929406 -935095 -933016 -926754 -917797 -910158 -911388 -918237 -920702 -920640 -919533 -923446 -925397 -922379 -911640
8607 -911640 -908132 -914033 -913404 -913666 -919667 -936636 -954702 -960748 -960660 -960285 -959083 -953680 -948361 -952873 -961371
8592 -961371 -962292 -959821 -959128 -955789 -947805 -941219 -945736 -945382 -950155 -951622 -941117 -934535 -936107 -939124 -940757
$$ packed form
8697i61605L495l917k062L328J660m72K48p614j942J492K161P510O516M372o325
8682i53155l263N710L838n63n839q337P084J0943K204O315j643o744n057j029
8668i49536M721N665m565r16M21N101K653q802r300P29K516k918m81Q100K62j335
8652i47685O279R615o746j726q10m169l62m933r04M110N687N115J251j464N293
8637i31449K311k282n784l676J131N708L685k974l487N940N837M688j54o268l482
8622i30256Q50n689K079O262Q957P639j230o849k465O2J107l913j951L018J0739
8607i11640L508n901O29k62o001j6969j8066o046Q8L75J202N403N319m512q498
8592i61371r21K471O93L339P984O586m517L54m773j467J0505O582j572l017j633
$$ plain form
8577 -940757 -943714 -946330 -941499 -939533 -937199 -939894 -940540 -938696 -935784 -933672 -928171 -929196 -934354 -934702 -931345
8562 -931345 -924533 -925123 -930744 -936739 -933173 -928723 -924028 -927591 -923606 -928894 -930597 -925112 -921611 -927495 -930193
8547 -930193 -928021 -932808 -940255 -934630 -922414 -910011 -916511 -921242 -922102 -928426 -927781 -922965 -923692 -921793 -921714
8532 -921714 -927406 -927523 -925539 -921604 -919071 -924555 -926854 -921803 -918475 -917292 -922995 -923290 -918838 -915370 -918448
8517 -918448 -915728 -906035 -899863 -904096 -901179 -906245 -909166 -910374 -912735 -914443 -913360 -909128 -911098 -912417
8503 -912417 -908645 -913518 -910814 -898868 -897876 -903414 -904866 -909329 -902472 -900207 -902130 -905784 -903201 -904753
8489 -904753 -910519 -908689 -906425 -900246 -902474 -898681 -895566 -897784 -899305 -894645 -897489 -893725 -890300 -889379 -891379
8474 -891379 -893751 -896298 -894370 -903388 -898239 -898197 -897644 -898481 -899342 -894811 -892813 -894130 -896197 -897820 -888979 -895456
$$ packed form
8577i40757k957k616M831J966K334k695o46J844K912K112N501j025n158l48L357
8562i31345O812n90n621n995L566M450M695l563L985n288j703N485L501n884k698
8547i30193K172m787p447N625J2216J2403o500m731q60o324O45M816p27J899P9
8532i21714n692j17J984L935K533n484k299N051L328J183n703k95M452L468l078
8517i18448K720R693O172m233K917n066k921j208k361j708J083M232j970j319
8503i12417L772m873K704J1946R92n538j452m463O857K265j923l654K583j552
8489i04753n766J830K264O179k228L793L115k218j521M660k844L764L425R21k000
8474h91379k372k547J928r018N149M2N53q37q61M531J998j317k067j623Q841o477
$$ plain form
8458 -895456 -903705 -902265 -901433 -904033 -900775 -894359 -892881 -899716 -897622 -888974 -901218 -900322 -897065 -893965 -893128
8443 -893128 -891041 -891283 -885415 -882222 -882287 -883708 -887793 -886145 -888072 -890666 -892726 -896465 -898189 -897157 -892697
8428 -892697 -891715 -892177 -897411 -893946 -888187 -888254 -887904 -884149 -884129 -886692 -893419 -895239 -893577 -896492 -897188 -894190
8412 -894190 -894692 -895212 -888552 -889540 -889227 -891485 -891085 -883468 -879184 -879679 -876431 -876534 -882035 -881135 -874599 -872744
8396 -872744 -869387 -866483 -868292 -870568 -866199 -866304 -879663 -888613 -888242 -885675 -878417 -875852 -885976 -888557
8382 -888557 -888834 -882180 -873679 -865810 -862767 -873511 -876266 -871821 -873203 -877621 -875882 -875280 -870254 -868051 -862733
8367 -862733 -870173 -874745 -872981 -877246 -880819 -874666 -870621 -876709 -882720 -877469 -877887 -874650 -871117 -868154 -863719
8352 -863719 -859963 -855502 -848610 -850004 -855673 -864310 -869517 -859241 -857141 -856780 -851155 -852343 -851488 -848449 -847724
$$ packed form
8458h95456q249J440Q32k600L258O416J478o835K094Q648j2244Q96L257L100Q37
8443h93128K087k42N868L193o5j421m085J648j927k594k060l739j724J032M460
8428h92697R82m62n234L465N759o7L50L755K0k563o727j820J662k915o96K998
8412h94190n02n20O660r88L13k258M00P617M284m95L248j03n501R00O536J855
8396h72744L357K904j809k276M369j05j3359q950L71K567P258K565j0124k581
8382h88557k77O654Q501P869L043j0744k755M445j382m418J739O02N026K203N318
8367h62733p440m572J764m265l573O153M045o088o011N251m18L237L533K963M435
8352h63719L756M461O892j394n669q637n207J0276K100L61N625j188Q55L039P25
$$ plain form
8337 -847724 -843675 -849651 -853852 -859766 -866683 -863689 -865823 -868429 -865938 -856099 -849558 -847311 -839872 -840784 -854331
8322 -854331 -851377 -852201 -844585 -841139 -848324 -845752 -842193 -847816 -849078 -846511 -843510 -842261 -844480 -846256 -844563
8307 -844563 -843497 -846271 -858965 -866159 -866641 -860220 -857480 -854518 -852705 -853002 -855130 -858349 -854768 -852070 -852719
8292 -852719 -850039 -850622 -852245 -844681 -845887 -844268 -837611 -839196 -849227 -849187 -844560 -844727 -843552 -844752 -841956
8277 -841956 -849587 -859644 -859724 -858261 -859665 -858779 -853651 -849099 -848004 -845847 -847884 -853711 -847464 -846109 -851687
8262 -851687 -853765 -853684 -848262 -842654 -840121 -842105 -845025 -838859 -838905 -844602 -849208 -851199 -846795 -842051 -830502
8247 -830502 -835078 -835096 -841947 -843522 -836664 -836976 -834460 -832080 -833374 -835937 -836691 -840286 -840677 -830634 -824311
8232 -824311 -823279 -829761 -836827 -842267 -843839 -833808 -830480 -831177 -832410 -831148 -834053 -837901 -839457 -838537 -832997
$$ packed form
8337h47724M049n976m201n914o917K994k134k606K491R839O541K247P439r12j3547
8322h54331K954q24P616L446p185K572L559n623j262K567L001J249k219j776J693
8307h44563J066k774j2694p194m82O421K740K962J813k97k128l219L581K698o49
8292h52719K680n83j623P564j206J619O657j585j0031M0M627j67J175j200K796
8277h41956p631j0057q0J463j404Q86N128M552J095K157k037n827O247J355n578
8262h51687k078Q1N422N608K533j984k920O166m6n697m606j991M404M744J1549
8247h30502m576j8o851j575O858l12K516K380j294k563p54l595l91J0043O323
8232h24311J032o482p066n440j572J0031L328o97j233J262k905l848j556R20N540
$$ plain form
8217 -832997 -827417 -821651 -822431 -826617 -823515 -822386 -823245 -826141 -815899 -812319 -820107 -827713 -830330 -830888 -829362
8202 -829362 -832444 -835817 -838313 -841329 -833512 -827702 -826265 -821929 -815863 -823603 -826572 -825595 -830914 -828616 -827311
8187 -827311 -827056 -824742 -827603 -827325 -824686 -825663 -824713 -822975 -827764 -825780 -819614 -817151 -822812 -819747 -815136
8172 -815136 -819979 -824704 -819784 -824539 -824119 -812085 -804064 -812870 -816689 -817917 -817286 -817305 -820429 -823865 -823714
8157 -823714 -817688 -818242 -814532 -811691 -809302 -806540 -814291 -814147 -812316 -819012 -818805 -816254 -810639 -817881 -825880
8142 -825880 -818638 -809430 -809994 -813173 -813825 -811688 -809319 -807211 -806410 -798507 -793781 -797599 -803917 -804709 -800720
8127 -800720 -801543 -801901 -804624 -804991 -801205 -803449 -805494 -803487 -809137 -810473 -801679 -793228 -790383 -793575 -798484
8112 -798484 -796961 -800928 -802294 -799831 -796321 -792622 -802879 -809411 -812677 -812624 -805354 -800970 -801914 -807029 -806666
$$ packed form
8217h32997N580N766p80m186L102J129q59k896J0242L580p788p606k617n58J526
8202h29362l082l373k496l016P817N810J437M336O066p740k969R77n319K298J305
8187h27311K55K314k861K78K639r77R50J738m789J984O166K463n661L065M611
8172h15136m843m725M920m755M20J2034Q021q806l819j228O31j9l124l436J51
8157h23714O026n54L710K841K389K762p751J44J831o696K07K551N615p242p999
8142h25880P242R208n64l179o52K137K369K108Q01P903M726l818o318p92L989
8127h00720q23l58k723l67L786k244k045K007n650j336Q794Q451K845l192m909
8112g98484J523l967j366K463L510L699j0257o532l266N3P270M384r44n115L63
$$ plain form
8097 -806666 -807468 -811114 -806975 -799704 -801302 -800963 -800415 -799692 -796190 -799661 -800689 -802358 -803248 -797904 -793648 -790316
8081 -790316 -791437 -792057 -787536 -789994 -778332 -777184 -790389 -801630 -812582 -807351 -802548 -802845 -805731 -807132
8067 -807132 -801438 -795787 -790851 -791426 -788265 -785388 -782568 -781853 -781713 -779517 -783448 -786183 -784429 -785521 -789042
8052 -789042 -792820 -797416 -802565 -800038 -794175 -791909 -793657 -789494 -779325 -784530 -796171 -796983 -795598 -793189
8038 -793189 -787539 -782204 -783557 -788488 -795768 -800414 -794054 -790587 -792330 -787763 -788438 -789235 -788860 -791257 -791901
8023 -791901 -788490 -780185 -780849 -787558 -789065 -786576 -787156 -787251 -789253 -784362 -781140 -778021 -781341 -785955 -783912
8008 -783912 -781588 -776999 -778369 -786730 -788855 -791055 -786836 -789599 -785794 -784718 -784237 -793479 -796679 -795607 -789978
7993 -789978 -792001 -787004 -781677 -785400 -787113 -787110 -792324 -784023 -781373 -782690 -781386 -781236 -782416 -780706 -778795
$$ packed form
8097h06666q02l646M139P271j598L39N48P23L502l471j028j669q90N344M256L332
8081g90316j121o20M521k458J1662J148j3205j1241j0952N231M803k97k886j401
8067h07132N694N651M936n75L161K877K820P15J40K196l931k735J754j092l521
8052g89042l778m596n149K527N863K266j748M163J0169n205j1641q12J385K409
8038g93189N650N335j353m931p280m646O360L467j743M567o75p97L75k397o44
8023g91901L411Q305o64o709j507K489n80r5k002M891L222L119l320m614K043
8008g83912K324M589j370q361k125k200M219k763L805J076M81r242l200J072N629
7993g89978k023M997N327l723j713Ln214Q301K650j317J304J50j180J710J911
$$ plain form
7978 -778795 -780493 -777768 -781487 -780167 -777147 -775002 -781555 -782751 -779080 -774418 -773077 -771709 -769526 -771053
7964 -771053 -767234 -761687 -758385 -761074 -767740 -776423 -786586 -779384 -772511 -784294 -784237 -780385 -776524 -776746 -775019
7949 -775019 -780610 -783227 -777706 -784904 -783494 -784780 -780409 -772542 -776878 -776947 -777524 -771508 -771713 -766614 -769383
7934 -769383 -774541 -773550 -774553 -776474 -772145 -767398 -766397 -768986 -766247 -767600 -771732 -774407 -774208 -778542 -783147
7919 -783147 -778781 -771493 -763857 -765343 -767816 -767072 -768358 -774410 -782912 -785803 -783266 -780535 -777760 -784923 -788160
7904 -788160 -784440 -776740 -764806 -764383 -763910 -760350 -764153 -764587 -769820 -769773 -762827 -759960 -763017 -762622 -760048 -762020
7888 -762020 -768707 -767399 -769480 -771599 -771865 -777829 -782462 -770969 -774511 -770043 -764557 -769921 -776474 -775169
7874 -775169 -777382 -780404 -774412 -775188 -775719 -773252 -775775 -773187 -765786 -762913 -765789 -768706 -767749 -772332 -766235
$$ packed form
7978g78795j698K725l719J320L020K145o553j196L671M662J341J368K183j527
7964g71053L819N547L302k689o666q683j0163P202O873j1783N7L852L861k22J727
7949g75019n591k617N521p198J410j286M371P867m336o9n77O016k05N099k769
7934g69383n158R91j003j921M329M747J001k589K739j353m132k675J99m334m605
7919g83147M366P288P636j486k473P44j286o052q502k891K537K731K775p163l237
7904g88160L720P700J1934M23M73L560l803m34n233M7O946K867l057L95K574j972
7888g62020o687J308k081k119k66n964m633J1493l542M468N486n364o553J305
7874g75169k213l022N992p76n31K467k523K588P401K873k876k917R57m583O097
$$ plain form
7859 -766235 -760058 -762687 -768227 -770288 -765045 -764254 -766154 -765964 -772843 -777998 -773533 -769845 -765990 -765501 -766140
7844 -766140 -768445 -765908 -767924 -772847 -774955 -776222 -769991 -766845 -771860 -767498 -759286 -759383 -759032 -756627 -757124
7829 -757124 -757047 -761237 -759791 -758280 -757533 -753829 -751035 -753679 -752685 -754684 -759184 -759276 -758644 -761570 -757268 -758623
7813 -758623 -756096 -756202 -758400 -755905 -754749 -763442 -765330 -759795 -756279 -753272 -760107 -764044 -758755 -758185 -748073
7798 -748073 -748584 -747589 -748011 -747858 -745749 -746245 -750308 -749400 -750368 -748532 -742712 -736117 -735761 -741468 -742056 -738233 -733119
7781 -733119 -728276 -736858 -747070 -751561 -748525 -746291 -743028 -746593 -747032 -744806 -743905 -755576 -753025 -739375
7767 -739375 -739584 -741684 -745383 -747604 -749781 -749854 -746977 -746561 -744725 -746114 -747592 -749194 -751680 -750423 -749965 -749648
7751 -749648 -744676 -740295 -736432 -741777 -740001 -739195 -747505 -749905 -745439 -739803 -735952 -736825 -737405 -738876 -736075
$$ packed form
7859g66235O177k629n540k061N243P91j900J90o879n155M465L688L855M89o39
7844g66140k305K537k016m923k108j267O231L146n015M362Q212r7L51K405m97
7829g57124P7m190J446J511P47L704K794k644R94j999m500r2O32k926M302j355
7813g58623K527j06k198K495J156q693j888N535L516L007o835l937N289N70J0112
7798g48073n11R95m22J53K109m96m063R08r68J836N820O595L56n707n88L823N114
7781g33119M843q582j0212m491L036K234L263l565m39K226R01j1671K551J3650
7767g39375k09k100l699k221k177p3K877M16J836j389j478j602k486J257M58L17
7751g49648M972M381L863n345J776Q06q310k400M466N636L851q73n80j471K801
$$ plain form
7736 -736075 -737378 -745403 -746106 -745229 -746435 -749219 -750738 -750636 -752329 -753571 -753185 -748307 -743058 -740324 -743551
7721 -743551 -744285 -745293 -745884 -745576 -746334 -743854 -742114 -743989 -743224 -738147 -741006 -744124 -742085 -735543 -735799 -740574
7705 -740574 -748763 -749622 -745027 -740026 -738333 -735611 -734676 -735364 -734693 -735695 -725019 -716013 -717688 -729652 -735658
7690 -735658 -737540 -732048 -731439 -733247 -730405 -724802 -722183 -723694 -722393 -729877 -738385 -742696 -746194 -739916 -734850
7675 -734850 -739199 -737432 -727565 -721191 -726825 -727190 -721751 -713880 -716198 -718067 -724768 -738500 -737954 -734936 -736455
7660 -736455 -734872 -730275 -724379 -728855 -733218 -735417 -735500 -731905 -734687 -737340 -734172 -740039 -742982 -733383 -719517
7645 -719517 -720698 -721183 -726851 -733513 -734014 -729179 -728743 -731699 -727264 -722928 -718548 -719961 -715637 -718824 -724941
7630 -724941 -727903 -731005 -729364 -731193 -732522 -721383 -721236 -723755 -718899 -722686 -722888 -720740 -720879 -720283 -718496
$$ packed form
7736g36075j303q025p03Q77j206k784j519J02j693j242L86M878N249K734l227
7721g43551p34j008n91L08p58K480J740j875P65N077k859l118K039O542k56m775
7705g40574q189q59M595N001J693K722R35o88O71j002J0676R006j675j1964o006
7690g35658j882N492O09j808K842N603K619j511J301p484q508m311l498O278N066
7675g34850m349J767R867O374n634l65N439P871k318j869o701j3732N46L018j519
7660g36455J583M597N896m476m363k199q3L595k782k653L168n867k943R599J3866
7645g19517j181m85n668o662n01M835M36k956M435M336M380j413M324l187o117
7630g24941k962l102J641j829j329J1139J47k519M856l787k02K148j39N96J787
$$ plain form
7615 -718496 -715816 -716070 -720786 -723154 -718835 -708083 -707215 -706956 -713219 -715193 -720477 -724013 -727650 -727841 -723508
7600 -723508 -715344 -712817 -714169 -718570 -714889 -715828 -720780 -712160 -708172 -710006 -715499 -712526 -713342 -717143 -715568
7585 -715568 -715136 -713692 -713589 -713857 -714045 -709823 -708886 -715963 -720933 -715626 -713112 -708964 -705462 -705266 -705850 -703639
7569 -703639 -705632 -709272 -714494 -709174 -707904 -707575 -705549 -712201 -710000 -702350 -708688 -714980 -715926 -717561 -710509
7554 -710509 -707146 -710898 -715362 -722700 -726025 -728096 -717830 -709263 -709147 -710321 -711082 -703994 -701991 -712659
7540 -712659 -717317 -714264 -711956 -703209 -698173 -699436 -701994 -700155 -699603 -699389 -710009 -714442 -708119 -704543 -703841
7525 -703841 -701457 -702932 -705984 -703248 -704683 -696729 -693123 -694088 -694687 -697103 -701908 -711291 -708707 -702383 -703312
7510 -703312 -707248 -701650 -694258 -695524 -696677 -699172 -702908 -703888 -704583 -708138 -707462 -705596 -704238 -697033 -698777
$$ packed form
7615g18496K680k54m716k368M319J0752Q68K59o263j974n284l536l637j91M333
7600g23508Q164K527j352m401L681r39m952Q620L988j834n493K973q16l801J575
7585g15568M32J444J03k68j88M222R37p077m970N307K514M148L502J96n84K211
7569g03639j993l640n222N320J270L29K026o652K201P650o338o292r46j635P052
7554g10509L363l752m464p338l325k071J0266Q567J16j174p61P088K003j0668
7540g12659m658L053K308Q747N036j263k558J839N52K14j0620m433O323L576P02
7525g03841K384j475l052K736j435P954L606r65n99k416m805r383K584O324r29
7510g03312l936N598P392j266j153k495l736r80o95l555O76J866J358P205j744
$$ plain form
7495 -698777 -701481 -701425 -698963 -691426 -690680 -690401 -692661 -695827 -699493 -701434 -702480 -699621 -700232 -705707 -706008 -704616
7479 -704616 -705182 -706044 -705679 -707309 -707119 -701964 -701669 -696312 -692408 -691848 -697219 -693874 -686025 -691792 -694841 -690880
7463 -690880 -692449 -695965 -692615 -687276 -686092 -688637 -685201 -686471 -694215 -692940 -692295 -695043 -696191 -691268 -693907
7448 -693907 -695319 -691307 -696293 -694484 -689458 -693919 -696368 -694998 -694478 -690109 -684828 -684201 -685170 -691460 -685925
7433 -685925 -677776 -671539 -672428 -676899 -681777 -683748 -686775 -691113 -695864 -704944 -710651 -712389 -703681 -693673
7419 -693673 -690802 -688897 -692400 -693729 -690145 -692474 -693463 -696500 -688624 -684210 -687281 -687317 -682904 -685390 -689398
7404 -689398 -693575 -693191 -691758 -689505 -697313 -697959 -695844 -693260 -690417 -685815 -685296 -684460 -686314 -688358 -690778
7389 -690778 -692642 -689556 -690593 -685041 -675981 -680481 -679914 -677556 -675291 -676001 -679019 -679642 -685407 -687603 -684614
$$ packed form
7495f98777k704N6K462P537P46K79k260l166l666j941j046K859o11n475l01J392
7479g04616n66q62L65j630J90N155K95N357L904N60n371L345P849n767l049L961
7463f90880j569l516L350N339J184k545L436j270p744J275O45k748j148M923k639
7448f93907j412M012m986J809N026m461k449J370N20M369N281O27r69o290N535
7433f85925Q149O237q89m471m878j971l027m338m751r080n707j738Q708J0008
7419f93673K871J905l503j329L584k329r89l037P876M414l071l6M413k486m008
7404f89398m177L84J433K253p808o46K115K584K843M602N19Q36j854k044k420
7389f90778j864L086j037N552R060m500N67K358K265p10l018o23n765k196K989
$$ plain form
7374 -684614 -678455 -672266 -673526 -672178 -676236 -682509 -685703 -681907 -677917 -679996 -678472 -676322 -675199 -682572
7360 -682572 -683657 -681306 -679962 -674763 -681849 -688555 -691047 -684675 -681238 -683185 -679879 -673589 -669383 -672797
7346 -672797 -674511 -668330 -665586 -671041 -680778 -685757 -691329 -683154 -674318 -676759 -676292 -676259 -677045 -676885 -666890 -660361
7330 -660361 -662467 -668576 -676046 -683016 -686538 -682766 -683485 -677143 -677579 -680334 -681066 -683048 -686599 -688838 -691097
7315 -691097 -690589 -689254 -687871 -679765 -669897 -663821 -662225 -662919 -669642 -680582 -686283 -683836 -677232 -676875 -680917
7300 -680917 -679762 -679143 -681972 -680057 -671810 -665694 -664973 -675212 -673030 -661489 -664891 -664306 -669009 -675491 -681931
7285 -681931 -680598 -674636 -680563 -679709 -681104 -678529 -674805 -678301 -680890 -678682 -682130 -678985 -669594 -663325 -665892
7270 -665892 -676251 -675537 -668171 -663152 -669784 -668956 -662184 -665249 -669254 -675482 -679677 -670803 -666278 -662292 -662423
$$ packed form
7374f84614O159O189j260J348m058o273l194L796L990k079J524K150J123p373
7360f82572j085K351J344N199p086o706k492O372L437j947L306O290M206l414
7346f72797j714O181K744n455r737m979n572Q175Q836k441M67L3p86J60R995O529
7330f60361k106o109p470o970l522L772p19O342m36k755p32j982l551k239k259
7315f91097N08J335J383Q106R868O076J596o94o723j0940n701K447O604L57m042
7300f80917J155O19k829J915Q247O116P21j0239K182J1541l402N85m703o482o440
7285f81931J333N962n927Q54j395K575L724l496k589K208l448L145R391O269k567
7270f65892j0359P14P366N019o632Q28O772l065m005o228m195Q874M525L986j31
$$ plain form
7255 -662423 -657004 -662215 -664813 -665295 -665695 -662344 -656562 -653991 -650423 -653799 -655241 -657553 -658643 -657133 -667577
7240 -667577 -669651 -669205 -667647 -669401 -670113 -668443 -670916 -667455 -666502 -672132 -676315 -672495 -672462 -670859 -674241 -678070
7224 -678070 -673271 -675766 -680543 -671691 -667743 -667433 -668289 -670922 -671088 -669169 -665290 -655874 -657954 -663847 -662690
7209 -662690 -664726 -668072 -665412 -662621 -657581 -658812 -666452 -669733 -669337 -660760 -665287 -666867 -665042 -662944 -666070
7194 -666070 -667546 -668564 -664343 -659527 -654357 -662640 -669321 -664092 -661049 -659680 -661923 -662121 -652646 -654105 -655698
7179 -655698 -649974 -653797 -657281 -653418 -649384 -649958 -652521 -658865 -665531 -660709 -662662 -666185 -666100 -665146 -663345
7164 -663345 -658157 -656960 -650943 -654461 -656144 -652773 -654547 -660907 -660736 -658536 -649249 -648614 -653786 -658045 -663061
7149 -663061 -665341 -661685 -661317 -657035 -655926 -654306 -655459 -658997 -658467 -654930 -655525 -658622 -654317 -650136 -655624
$$ packed form
7255f62423N419n211k598m82m00L351N782K571L568l376j442k312j090J510j0444
7240f67577k074M46J558j754p12J670k473L461R53n630m183L820L3J603l382l829
7224f78070M799k495m777Q852L948L10q56k633j66J919L879R416k080n893J157
7209f62690k036l346K660K791N040j231p640l281L96Q577m527j580J825K098l126
7194f66070j476j018M221M816N170q283o681N229L043J369k243j98R475j459j593
7179f55698N724l823l484L863M034n74k563o344o666M822j953l523Q5R54J801
7164f63345N188J197O017l518j683L371j774o360J71K200R287O35n172m259n016
7149f63061k280L656L68M282J109J620j153l538N30L537n95l097M305M181n488
$$ plain form
7134 -655624 -657664 -653177 -652176 -654702 -663496 -673614 -678432 -670836 -665494 -663597 -661330 -656040 -649662 -645394
7120 -645394 -645781 -639405 -637623 -639770 -641115 -651257 -651260 -643068 -643952 -647215 -649679 -651571 -652368 -647662 -645845 -654158
7104 -654158 -660840 -661213 -661634 -656680 -654292 -651347 -648548 -645133 -643768 -647112 -647953 -647563 -645372 -647201 -642427
7089 -642427 -648204 -645211 -645824 -652436 -651943 -653242 -652430 -652929 -647841 -639504 -631047 -636418 -640955 -640747 -637522 -639240
7073 -639240 -637868 -637343 -643875 -640559 -634736 -626708 -633505 -638101 -634967 -639877 -642885 -649006 -650363 -643444 -634919
7058 -634919 -636477 -640885 -647064 -652688 -649229 -642283 -639222 -640051 -646579 -650494 -651541 -645040 -633697 -628222
7044 -628222 -630453 -637416 -631272 -631374 -626377 -629595 -636214 -640404 -643815 -645123 -641990 -640120 -642971 -641176 -639186
7029 -639186 -637064 -642881 -647422 -648191 -644457 -645341 -642641 -645290 -644901 -645925 -647246 -641944 -646733 -646393 -642517
$$ packed form
7134f55624k040M487J001k526q794j0118m818P596N342J897K267N290O378M268
7120f45394l87O376J782k147j345j0142lQ192q84l263k464j892p97M706J817q313
7104f54158o682l73m21M954K388K945K799L415J365l344q41L90K191j829M774
7089f42427n777K993o13o612M93j299Q12m99N088Q337Q457n371m537K08L225j718
7073f39240J372N25o532L316N823Q028o797m596L134m910l008o121j357O919Q525
7058f34919j558m408o179n624L459O946L061q29o528l915j047O501J1343N475
7044f28222k231o963O144j02M997l218o619m190l411j308L133J870k851J795J990
7029f39186K122n817m541p69L734q84K700k649L89j024j321N302m789L40L876
$$ plain form
7014 -642517 -645521 -647207 -646417 -643318 -638153 -632368 -630987 -634581 -637061 -637800 -637979 -635140 -634192 -631734 -626426
6999 -626426 -628663 -632010 -634026 -639500 -636622 -631574 -636927 -641657 -640514 -642579 -638508 -630178 -627505 -630114
6985 -630114 -631516 -632379 -627880 -625939 -623660 -628157 -631777 -639051 -649595 -646238 -641407 -643336 -650324 -648456
6971 -648456 -639947 -632861 -632098 -631119 -630085 -626978 -633851 -631016 -621593 -617607 -619209 -617463 -623357 -634535 -637434
6956 -637434 -639453 -634383 -629776 -627949 -630577 -632620 -636767 -632068 -629979 -627810 -628823 -636868 -642470 -642424 -645425
6941 -645425 -641762 -638448 -641101 -641271 -643196 -638154 -634965 -627857 -634872 -643103 -633564 -627119 -624365 -620969 -622896
6926 -622896 -625392 -630862 -633755 -630363 -627059 -626130 -625976 -625600 -623632 -626920 -622602 -622218 -627538 -627355 -628003 -630767
6910 -630767 -639667 -635029 -627647 -622376 -630816 -634802 -635977 -635200 -630661 -626749 -624671 -620989 -618930 -619785 -618959
$$ packed form
7014f42517l004j686P90L099N165N785J381l594k480p39j79K839R48K458N308
6999f26426k237l347k016n474K878N048n353m730J143k065M071Q330K673k609
6985f30114j402q63M499J941K279m497l620p274j0544L357M831j929o988J868
6971f48456Q509P086P63R79J034L107o873K835R423L986j602J746n894j1178k899
6956f37434k019N070M607J827k628k043m147M699K089K169j013q045n602M6l001
6941f45425L663L314k653j70j925N042L189P108p015q231R539O445K754L396j927
6926f22896k496n470k893L392L304R29J54L76J968l288M318L84n320J83o48k764
6910f30767q900M638P382N271q440l986j175P77M539L912K078L682K059q55Q26
$$ plain form
6895 -618959 -620798 -627763 -628089 -626076 -628431 -629862 -631141 -627575 -623874 -628089 -627314 -620832 -624001 -624776 -626581
6880 -626581 -628326 -622341 -621648 -617723 -610223 -604938 -610110 -617250 -624819 -631088 -629030 -620488 -619424 -620571 -620857
6865 -620857 -617124 -619046 -621744 -623319 -620778 -618447 -619303 -616023 -613479 -616061 -621268 -623637 -619134 -618682 -620191
6850 -620191 -618632 -614340 -619209 -620982 -623482 -628358 -627364 -620504 -611427 -607361 -615154 -623018 -621805 -616678 -618666
6835 -618666 -618048 -608024 -602747 -609871 -602835 -601180 -611896 -614129 -615924 -616782 -614521 -614984 -616569 -619885 -625388
6820 -625388 -622213 -621191 -621799 -618091 -623763 -621478 -620877 -624725 -623691 -616535 -615698 -612708 -612635 -615728 -613578 -608996
6804 -608996 -612195 -613166 -617014 -618132 -618597 -616276 -612367 -614028 -613445 -611881 -614734 -618618 -618807 -618569 -616522 -615434
6788 -615434 -616193 -620761 -613063 -611655 -613693 -614248 -609990 -607747 -613280 -608045 -605907 -611949 -611965 -606221 -608825
$$ packed form
6895f18959j839o965l26K013k355j431j279L566L701m215P75O482l169p75j805
6880f26581j745N985O93L925P500N285n172p140p569o269K058Q542J064j147k86
6865f20857L733j922k698j575K541K331q56L280K544k582n207k369M503M52j509
6850f20191J559M292m869j773k500m876R94O860R077M066p793p864J213N127j988
6835f18666O18J0024N277p124P036J655j0716k233j795q58K261m63j585l316n503
6820f25388L175J022o08L708n672K285O01l848J034P156Q37K990P3l093K150M582
6804f08996l199r71l848j118m65K321L909j661N83J564k853l884j89K38K047J088
6788f15434p59m568P698J408k038n55M258K243n533N235K138o042j6N744k604
$$ plain form
6773 -608825 -610008 -605448 -609707 -610043 -607887 -606666 -607053 -609336 -611199 -614370 -611853 -612647 -618042 -609990 -600924
6758 -600924 -597398 -599573 -605363 -609740 -611795 -604521 -597543 -593907 -593871 -592144 -598250 -608363 -616169 -617851 -622784
6743 -622784 -628746 -632705 -627017 -622084 -624408 -623670 -619651 -624010 -626712 -627987 -623470 -611550 -609795 -609635 -611584
6728 -611584 -608742 -605007 -603323 -602868 -604514 -606241 -606030 -607217 -604748 -610821 -614344 -615519 -611036 -609726 -613874
6713 -613874 -614062 -608880 -608908 -611322 -608586 -610087 -605308 -603989 -607187 -604977 -599828 -599277 -608244 -607329 -612171 -607640
6697 -607640 -603568 -606367 -604301 -600099 -598241 -600988 -602312 -601666 -601617 -600701 -600033 -597060 -595693 -596989 -599952 -600723
6681 -600723 -597207 -599111 -603082 -605138 -602156 -604233 -604498 -605054 -603939 -608629 -611256 -611274 -616163 -606757 -604353
6666 -604353 -606331 -597350 -599829 -600126 -598119 -598401 -604558 -603669 -604009 -609731 -615966 -617986 -614348 -608259 -597436
$$ packed form
6773f08825j183M560m259l36K156J221l87k283j863l171K517p94n395Q052R066
6758f00924L526k175n790m377k055P274O978L636L6J727o106j0113p806j682m933
6743f22784n962l959N688M933k324P38M019m359k702j275M517J1920J755J60j949
6728f11584K842L735J684M55j646j727K11j187K469o073l523j175M483J310m148
6713f13874j88N182k8k414K736j501M779J319l198K210N149N51q967R15m842M531
6697f07640M072k799K066M202J858k747j324O46M9R16O68K973J367j296k963p71
6681f00723L516j904l971k056K982k077k65n56J115m690k627j8m889R406K404
6666f04353j978Q981k479k97K007k82o157Q89l40n722o235k020L638O089J0823
$$ plain form
6651 -597436 -598612 -603294 -597921 -595918 -599028 -597423 -596725 -602257 -606268 -608986 -604818 -603663 -611376 -611220 -601773
6636 -601773 -598140 -600207 -591374 -593133 -594054 -596968 -597277 -599225 -597999 -602039 -601800 -604265 -602500 -599419 -605440
6621 -605440 -602185 -600308 -601169 -601490 -596458 -595187 -596137 -598625 -596578 -594568 -588822 -584905 -584567 -590814 -591605 -590010
6605 -590010 -596248 -598075 -591974 -591620 -587456 -590492 -600165 -601689 -601405 -603980 -608222 -607343 -605451 -605537 -606462 -599061
6589 -599061 -596263 -602740 -598228 -592079 -594526 -597463 -597840 -597282 -594846 -586373 -589349 -591660 -594297 -598908 -599167
6574 -599167 -589514 -579336 -577056 -581067 -590178 -591000 -594925 -597267 -598822 -598733 -596437 -588693 -587844 -587875 -591162 -600120
6558 -600120 -601939 -594833 -589385 -587143 -584148 -587561 -582967 -584489 -584280 -586560 -588232 -591629 -593061 -595155 -592646
6543 -592646 -588496 -589856 -587275 -583426 -589414 -588011 -592663 -594649 -590426 -590183 -587966 -585263 -583716 -582300 -584358
$$ packed form
6651e97436j176m682N373K003l110J605O98n532m011k718M168J155p713J56R447
6636f01773L633k067Q833j759r21k914l09j948J226m040K39k465J765L081o021
6621f05440L255J877q61l21N032J271r50k488K047K010N746L917L38o247p91J595
6605e90010o238j827O101L54M164l036r673j524K84k575m242Q79J892q6r25P401
6589e99061K798o477M512O149k447k937l77N58K436Q473k976k311k637m611k59
6574e99167R653J0178K280m011r111q22l925k342j555Q9K296P744Q49l1l287q958
6558f00120j819P106N448K242K995l413M594j522K09k280j672l397j432k094K509
6543e92646M150j360K581L849n988J403m652j986M223K43K217K703J547J416k058
$$ plain form
6528 -584358 -588580 -592408 -593479 -589859 -588796 -592809 -592901 -586839 -589032 -594731 -587747 -581471 -583557 -588492 -592211
6513 -592211 -593418 -594997 -597891 -597257 -592391 -590195 -584345 -585560 -587905 -588931 -592621 -591824 -593210 -590548 -590603
6498 -590603 -591672 -593101 -603379 -598280 -594618 -590190 -592132 -596146 -591013 -588909 -582759 -576523 -575792 -584922
6484 -584922 -592192 -591434 -591629 -592242 -592314 -595831 -593122 -587858 -587995 -588957 -589115 -590602 -593017 -598773 -599382 -590956 -589305
6467 -589305 -591044 -593507 -585810 -576493 -574466 -576858 -585820 -592434 -592044 -587203 -586320 -581918 -582143 -576617 -578647
6452 -578647 -582643 -587614 -584122 -580538 -584008 -588506 -584905 -583060 -579880 -582340 -588262 -589374 -583626 -579745
6438 -579745 -580839 -579463 -575789 -572014 -572364 -578513 -577999 -580922 -575925 -577226 -580941 -581620 -584731 -585920 -586744
6423 -586744 -584914 -587729 -587401 -582749 -576882 -577103 -578780 -576796 -578184 -576734 -579704 -584130 -579539 -567040 -564457
$$ packed form
6528e84358m222l828j071L620J063m013r2O062k193n699O984O276k086m935l719
6513e92211j207j579k894O34M866K196N850j215k345j026l690P97j386K662n5
6498e90603j069j429j0278N099L662M428j942m014N133K104O150O236P31r130
6484e84922p270P58j95o13p2l517K709N264j37r62j58j487k415n756o09Q426J651
6467e89305j739k463P697R317K027k392q962o614L90M841Q83M402k25N526k030
6452e78647l996m971L492L584l470m498L601J845L180k460n922j112N748L881
6438e79745j094J376L674L775l50o149N14k923M997j301l715o79l111j189q24
6423e86744J830k815L28M652N867k21j677J984j388J450k970m426M591J2499K583
$$ plain form
6408 -564457 -572121 -579612 -578038 -582376 -584404 -582229 -581665 -580191 -577380 -576801 -578683 -580952 -577194 -572745 -575476
6393 -575476 -577483 -570559 -569416 -573391 -574843 -569912 -566499 -568331 -569158 -571232 -576331 -578483 -576738 -579573 -579290
6378 -579290 -572945 -573360 -576710 -582465 -582970 -571774 -568110 -565537 -563663 -560483 -558748 -556039 -560862 -561425 -561858
6363 -561858 -564044 -562874 -569862 -576528 -577821 -582127 -577028 -581281 -583892 -587262 -586459 -581296 -579505 -569490
6349 -569490 -567622 -575073 -573328 -571208 -566541 -556434 -551623 -558813 -565206 -566441 -567495 -566472 -564198 -572466
6335 -572466 -576420 -574444 -580075 -578549 -572825 -569051 -563042 -559318 -559321 -558638 -556218 -556328 -567029 -571650 -571575 -576338
6319 -576338 -577313 -567626 -562535 -561166 -563130 -571430 -568247 -569671 -570323 -574132 -574122 -566196 -567320 -576606 -577475 -572589
6303 -572589 -569295 -570905 -568036 -563013 -562088 -566085 -567408 -566667 -566313 -563804 -561785 -565021 -563057 -564966 -569989
$$ packed form
6408e64457p664p491J574m338k028K175N64J474K811N79j882k269L758M449k731
6393e75476k007O924J143l975j452M931L413j832q27k074n099k152J745k835K83
6378e79290O345m15l350n755n05J1196L664K573J874L180J735K709m823n63m33
6363e61858k186J170o988o666j293m306N099m253k611l370Q03N163J791J0015
6349e69490J868p451J745K120M667J0107M811p190o393j235j054J023K274q268
6335e72466l954J976n631J526N724L774O009L724lO83K420j10j0701m621P5m763
6319e76338r75R687N091J369j964q300L183j424o52l809J0P926j124r286q69M886
6303e72589L294j610K869N023R25l997j323P41L54K509K019l236J964j909n023
$$ plain form
6288 -569989 -576558 -574104 -571312 -569435 -565541 -569977 -568096 -563277 -567573 -572813 -568453 -565294 -573586 -574415 -572808
6273 -572808 -578068 -575813 -572840 -574198 -574732 -566686 -560139 -561387 -563827 -559753 -554111 -558058 -564894 -566488 -561673
6258 -561673 -563959 -565765 -562970 -559374 -560087 -562239 -566025 -565214 -567303 -563899 -561240 -562063 -563644 -570745 -571057
6243 -571057 -568951 -572175 -572403 -570616 -565114 -564339 -559907 -560783 -565468 -566148 -567409 -561519 -569439 -568139 -559340
6228 -559340 -560719 -567872 -568175 -564086 -559914 -557567 -558384 -561980 -556351 -551542 -554214 -553844 -557834 -554213 -553746
6213 -553746 -555212 -557749 -554847 -549988 -559546 -561211 -559681 -558428 -558544 -555223 -554195 -557957 -565348 -564969 -561564
6198 -561564 -554842 -558448 -561674 -560666 -562913 -564808 -567219 -566388 -555737 -556480 -559059 -558996 -563422 -558996 -553207
6183 -553207 -562382 -572954 -573943 -566720 -562959 -560398 -561718 -556299 -540010 -543849 -556509 -564333 -564140 -562410
$$ packed form
6288e69989o569K454K792J877L894m436J881M819m296n240M360L159q292q29J607
6273e72808n260K255K973j358n34Q046O547j248k440M074N642l947o836j594M815
6258e61673k286j806K795L596p13k152l786Q11k089L404K659q23j581p101l12
6243e71057K106l224k28J787N502P75M432q76m685o80j261N890p920J300Q799
6228e59340j379p153l03M089M172K347q17l596N629M809k672L70l990L621M67
6213e53746j466k537K902M859r558j665J530J253j16L321J028l762p391L79L405
6198e61564O722l606l226J008k247j895k411Q31J0651p43k579O3m426M426N789
6183e53207r175j0572r89P223L761K561j320N419J6289l839j2660p824J93J730
$$ plain form
6169 -562410 -555730 -552168 -555136 -554916 -554602 -555019 -550950 -556060 -561526 -560200 -557799 -560884 -564122 -558883 -556408
6154 -556408 -554204 -553051 -555106 -555141 -553714 -555779 -556896 -551834 -554698 -554724 -556277 -557297 -556821 -557552 -556309 -552175
6138 -552175 -551810 -549152 -549481 -553285 -561504 -563921 -564232 -560407 -562973 -554052 -552149 -550982 -546321 -546552 -545906 -544696
6122 -544696 -549417 -555323 -552998 -549846 -553568 -549260 -549641 -550784 -549142 -547165 -549012 -543899 -536880 -537075 -543782
6107 -543782 -548882 -550234 -552215 -553900 -543824 -543215 -553200 -553963 -557276 -549182 -552763 -552136 -550805 -554300 -553690
6092 -553690 -553875 -556333 -547426 -538470 -539068 -545468 -543395 -543123 -549838 -550385 -541023 -538991 -541555 -541077 -549151 -553637
6076 -553637 -550799 -541651 -544800 -540059 -534283 -539840 -552876 -557064 -550697 -542810 -537570 -543802 -545166 -549319
6062 -549319 -555924 -553540 -554250 -554454 -550906 -548469 -545067 -544431 -541149 -537991 -546622 -547463 -549484 -551324 -548984
$$ packed form
6169e62410O680L562k968K20L14m17M069n110n466J326K401l085l238N239K475
6154e56408K204J153k055l5J427k065j117N062k864k6j553j020M76p31J243M134
6138e52175L65K658l29l804q219k417l11L825k566Q921J903J167M661k31O46J210
6122e44696m721n906K325L152l722M308l81j143J642J977j847N113P019j95o707
6107e43782n100j352j981j685J0076O09r985p63l313Q094l581O27J331l495O10
6092e53690j85k458Q907Q956n98o400K073K72o715n47R362K032k564M78q074m486
6076e53637K838R148l149M741N776n557j3036m188O367P887N240o232j364m153
6062e49319o605K384p10k04L548K437L402O36L282L158q631q41k021j840K340
$$ plain form
6047 -548984 -552370 -547713 -541508 -539902 -533303 -538249 -544808 -541188 -535364 -530221 -531647 -533651 -539555 -545699
6033 -545699 -547472 -550853 -551452 -545327 -539572 -535147 -542601 -546808 -549813 -549788 -546614 -544257 -544853 -545168 -547226 -543696
6017 -543696 -548987 -551567 -540794 -535109 -536434 -541279 -547022 -544255 -540110 -537278 -538760 -543181 -542823 -546902
6003 -546902 -547083 -546452 -541574 -543811 -550770 -550747 -549908 -548766 -548772 -547601 -547843 -552815 -549628 -543023 -543321 -540787 -546018
5986 -546018 -538539 -532249 -531612 -538766 -543900 -541619 -540614 -544933 -547429 -544584 -544931 -549172 -552292 -558070 -550231
5971 -550231 -542424 -541896 -549461 -555819 -552116 -542567 -535383 -531462 -527683 -534904 -534068 -533272 -530348 -533416 -533427 -537669
5955 -537669 -542900 -541722 -540245 -544253 -540156 -533081 -534192 -536940 -541303 -542047 -546574 -549438 -540485 -534626 -534816
5940 -534816 -532391 -530561 -533882 -546512 -544037 -535337 -539208 -544260 -542610 -540892 -533797 -533304 -535748 -533083
$$ packed form
6047e48984l386M657O205J606O599m946o559L620N824N143j426k004n904o144
6033e45699j773l381n99O125N755M425p454m207l005K5L174K357n96l15k058L530
6017e43696n291k580J0773N685j325m845n743K767M145K832j482m421L58m079
6003e46902j81O31M878k237o959K3Q39J142oJ171k42m972L187O605k98K534n231
5986e46018P479O290O37p154n134K281J005m319k496K845l47m241l120n778P839
5971e50231P807N28p565o358L703R549P184L921L779p221Q36P96K924l068j1m242
5955e37669n231J178J477m008M097P075j111k748m363p44m527k864Q953N859j90
5940e34816K425J830l321j2630K475Q700l871n052J650J718P095M93k444K665
$$ plain form
5926 -533083 -531136 -528442 -525777 -530142 -540730 -537579 -529691 -527173 -527368 -523809 -526493 -534918 -530625 -526692
5912 -526692 -527130 -530262 -530456 -534006 -539440 -540793 -536831 -540231 -549029 -545221 -544173 -546684 -547244 -546497 -536552
5897 -536552 -531085 -531803 -535082 -537612 -541312 -536923 -531771 -530502 -531948 -532400 -534628 -536374 -534796 -536283 -530087
5882 -530087 -533023 -546000 -556870 -556607 -553777 -546079 -545958 -540931 -532531 -530626 -532272 -535861 -534401 -530856
5868 -530856 -525870 -524876 -536191 -544002 -542184 -540519 -534666 -533584 -536996 -539119 -535975 -535447 -539405 -539794 -540665
5853 -540665 -535395 -532784 -530297 -535935 -546027 -543150 -540757 -543620 -541880 -549586 -550997 -545775 -529155 -521857
5839 -521857 -517845 -523007 -527183 -523651 -520860 -520227 -524306 -524656 -530871 -533483 -533769 -528476 -528512 -524569 -523769 -523829
5823 -523829 -523498 -527459 -528858 -523181 -529272 -536125 -534832 -532225 -528259 -525696 -520040 -522486 -528249 -533911 -531901
$$ packed form
5926e33083J947K694K665m365j0588L151P888K518j95L559k684q425M293L933
5912e26692m38l132j94l550n434j353L962l400q798L808J048k511n60P47R945
5897e36552N467p18l279k530l700M389N152J269j446m52k228j746J578j487O196
5882e30087k936j2977j0870K63K830P698J21N027Q400J905j646l589J460L545
5868e30856M986R94j1315p811J818J665N853J082l412k123L144N28l958l89q71
5853e40665N270K611K487n638j0092K877K393k863J740p706j411N222J6620P298
5839e21857M012n162m176L532K791O33m079l50o215k612k86N293l6L943Q00o0
5823e23829L31l961j399N677o091o853J293K607L966K563N656k446n763n662K010
$$ plain form
5808 -531901 -524828 -519117 -515604 -511329 -514839 -526414 -526503 -522283 -521132 -513191 -515778 -521334 -521344 -518561 -518484 -530286
5792 -530286 -537433 -533945 -529240 -528650 -522370 -517210 -523915 -533238 -531650 -529156 -523321 -523566 -523076 -529497 -534926
5777 -534926 -537305 -531999 -531448 -522786 -519657 -519574 -520684 -523471 -528226 -528272 -528415 -528135 -521995 -516775 -519307 -521994
5761 -521994 -523989 -530196 -529678 -528053 -531144 -535408 -534986 -534565 -531138 -527458 -528613 -531024 -533326 -531281 -530225
5746 -530225 -526834 -525287 -525847 -524623 -522797 -518322 -512578 -511203 -516078 -518373 -519298 -518141 -518595 -516055 -516828
5731 -516828 -513407 -514446 -520150 -517530 -519605 -521708 -529064 -533653 -534984 -525899 -516971 -516021 -517992 -523394 -524933
5716 -524933 -523190 -519480 -521340 -519149 -519224 -525457 -523902 -523306 -521688 -523932 -520980 -520204 -523879 -526381 -532932
5701 -532932 -534345 -533674 -531253 -526566 -519460 -515111 -517568 -519129 -521130 -526949 -529825 -522300 -523980 -519993 -517704
$$ packed form
5808e31901P073N711L513M275l510j1575q9M220J151P941k587n556j0K783P7j1802
5792e30286p147L488M705N90O280N160o705r323J588K494N835k45M90o421n429
5777e34926k379N306N51Q662L129Q3j110k787m755m6j43K80O140N220k532k687
5761e21994j995o207N18J625l091m264M22M21L427L680j155k411k302K045J056
5746e30225L391J547n60J224J826M475N744J375m875k295r25J157m54K540p73
5731e16828L421j039n704K620k075k103p356m589j331R085Q928R50j971n402j539
5716e24933J743L710j860K191p5o233J555N96J618k244K952P76l675k502o551
5701e32932j413O71K421M687P106M349k457j561k001n819k876P525j680L987K289
$$ plain form
5686 -517704 -514812 -521217 -522121 -528763 -537083 -531555 -525960 -523956 -524403 -527845 -526628 -518225 -523050 -524959 -527480
5671 -527480 -523446 -526029 -530180 -526764 -518586 -516641 -521548 -522052 -517415 -521380 -528709 -527583 -524274 -515665 -512843
5656 -512843 -510852 -510775 -516732 -520591 -518952 -519599 -523094 -521841 -513117 -511863 -517065 -516512 -511602 -515053 -519459
5641 -519459 -515916 -511819 -509516 -512631 -511208 -507902 -502927 -511713 -519085 -529071 -531650 -528993 -523489 -512034
5627 -512034 -505356 -503088 -504707 -505422 -501579 -507843 -505954 -506594 -505331 -503241 -508453 -512182 -513539 -516929 -514912
5612 -514912 -516736 -509332 -506763 -515946 -515571 -512001 -511471 -513639 -505859 -499785 -504111 -506018 -505152 -508662 -511068
5597 -511068 -513395 -514599 -508528 -511706 -512468 -502276 -505561 -511776 -515473 -513049 -509662 -507526 -508017 -507672 -508885
5582 -508885 -512312 -516063 -514715 -510212 -506739 -510254 -512959 -516655 -522426 -527082 -526824 -515338 -506036 -507057
$$ packed form
5686e17704K892o405r04o642q320N528N595K004m47l442J217Q403m825j909k521
5671e27480M034k583m151L416Q178J945m907n04M637l965p329J126L309Q609K822
5656e12843J991P7n957l859J639o47l495J253Q724J254n202N53M910l451m406
5641e19459L543M097K303l115J423L306M975q786p372r986k579K657N504J1455
5627e12034O678K268j619p15L843o264J889o40J263K090n212l729j357l390K017
5612e14912j824P404K569r183L75L570N30k168P780O074m326j907Q66l510k406
5597e11068k327j204O071l178p62J0192l285o215l697K424L387K136m91L45j213
5582e08885l427l751J348M503L473l515k705l696n771m656K58J1486R302j021
$$ plain form
5568 -507057 -509778 -506979 -507534 -512347 -516780 -518916 -521322 -522356 -522345 -517462 -515317 -514748 -508929 -512698 -512820 -505161
5552 -505161 -502826 -509550 -507741 -506477 -515878 -527804 -521514 -517088 -519814 -514651 -518559 -518134 -519515 -510543
5538 -510543 -504225 -507345 -509110 -510373 -507941 -499049 -495935 -497618 -503877 -507099 -508664 -512322 -514622 -509361
5524 -509361 -504371 -501169 -505014 -506645 -504845 -503884 -506829 -507152 -503920 -500837 -502990 -508303 -508022 -512844 -519970
5509 -519970 -519541 -515544 -509043 -508048 -506640 -503263 -504306 -512352 -513910 -517091 -519243 -513476 -510567 -511158 -506532
5494 -506532 -503786 -502105 -505997 -505463 -502387 -506438 -508413 -507590 -507506 -502514 -496201 -488714 -492170 -498320 -498334 -494968
5478 -494968 -499660 -508360 -513834 -508424 -499011 -491787 -485848 -493453 -500398 -508487 -511054 -506951 -497293 -495791
5464 -495791 -494087 -496656 -499271 -497868 -500335 -510920 -515530 -516064 -508137 -506548 -504852 -504511 -511576 -508424 -507402
$$ packed form
5568e07057k721K799n55m813m433k136k406j034J1M883K145N69N819l769j22P659
5552e05161K335o724J809J264r401j1926O290M426k726N163l908M25j381Q972
5538e10543O318l120j765j263K432Q892L114j683o259l222j565l658k300N261
5524e09361M990L202l845j631J800R61k945l23L232L083k153n313K81m822p126
5509e19970M29L997O501R95J408L377j043q046j558l181k152N767K909n91M626
5494e06532K746J681l892N34L076m051j975Q23Q4M992O313P487l456o150j4L366
5478d94968m692q700n474N410R413P224N939p605o945q089k567M103R658J502
5464d95791J704k569k615J403k467j0585m610n34P927J589J696L41p065L152J022
$$ plain form
5449 -507402 -498779 -498645 -494815 -490742 -492348 -491349 -493976 -502060 -514837 -515463 -510588 -502295 -498606 -502034 -510641
5434 -510641 -513451 -504079 -498450 -490105 -489639 -490488 -492092 -491337 -497518 -502807 -499245 -501189 -503079 -496978 -498880
5419 -498880 -508427 -507008 -502774 -499415 -498088 -500535 -498050 -502430 -502491 -500252 -495560 -484285 -484467 -488186 -494297
5404 -494297 -501567 -504491 -506058 -504799 -500419 -500352 -499931 -500671 -499785 -497971 -498066 -508032 -517992 -519002 -509381 -503063
5388 -503063 -500911 -497970 -494715 -499075 -503618 -504297 -503968 -504432 -509359 -509509 -501358 -494970 -493742 -495121 -501366
5373 -501366 -503612 -497161 -501089 -504149 -500895 -493172 -498138 -499869 -495424 -498616 -496235 -492076 -498764 -507013
5359 -507013 -503392 -500391 -507013 -508337 -506626 -502416 -497829 -485214 -478268 -479594 -489754 -494282 -498211 -500847
5345 -500847 -502120 -507044 -510737 -509132 -509325 -501699 -496651 -498078 -495383 -493905 -495364 -495810 -492933 -492937 -495316 -495076
$$ packed form
5449e07402Q623J34L830M073j606R99k627q084j2777o26M875Q293L689l428q607
5434e10641k810R372N629Q345M66q49j604P55o181n289L562j944j890O101j902
5419d98880r547J419M234L359J327k447K485m380o1K239M692J1275j82l719o111
5404d94297p270k924j567J259M380O7M21p40Q86J814r5r966r960j010R621O318
5388e03063K152K941L255m360m543o79L29m64m927j50Q151O388J228j379o245
5373e01366k246O451l928l060L254P723m966j731M445l192K381M159o688q249
5359e07013L621L001o622j324J711M210M587J2615O946j326j0160m528l929k636
5345e00847j273m924l693J605j93P626N048j427K695J478j459m46K877mk379K40
$$ plain form
5329 -495076 -497285 -491803 -490845 -496948 -503938 -503463 -500455 -501338 -496049 -494528 -494332 -488980 -495345 -496870 -492528
5314 -492528 -492438 -498704 -497617 -496990 -488349 -487123 -492860 -498733 -497219 -497092 -498540 -500231 -498929 -497363 -498518
5299 -498518 -497944 -490551 -488327 -482778 -480977 -478373 -481447 -493168 -500670 -498599 -499953 -496951 -501038 -497892
5285 -497892 -496891 -501679 -505673 -502105 -498326 -499111 -495006 -495756 -492190 -490537 -495414 -501520 -500011 -494687 -491396
5270 -491396 -486643 -486453 -487480 -489759 -492218 -498183 -501109 -505222 -500547 -494700 -487118 -484714 -491743 -491549 -490349
5255 -490349 -488321 -484502 -488187 -493514 -491670 -492350 -497577 -499293 -488272 -477749 -479984 -480548 -483799 -489614
$$ packed form
5329d95076k209N482R58o103o990M75L008q83N289J521J96N352o365j525M342
5314d92528R0o266J087O27Q641J226n737n873J514J27j448j691J302J566j155
5299d98518N74P393K224N549J801K604l074j1721p502K071j354L002m087L146
5285d97892J001m788l994L568L779p85M105p50L566J653m877o106J509N324L291
5270d91396M753J90j027k279k459n965k926m113M675N847P582K404p029J94J200
5255d90349K028L819l685n327J844o80n227j716J1021J0523k235n64l251n815
$$ [...]
##END NTUPLES=NMR SPECTRUM
##END=
