##TITLE=Analysis number 319549
Compound Code cc 50401
Book Reference 461/46
Project Code adrs
Chemist Name toml
##JCAMPDX= 6.0         $$ Bruker NMR JCAMP-DX V2.0
##DATA TYPE= NMR SPECTRUM
##DATA CLASS= NTUPLES
##ORIGIN= Bruker BioSpin GmbH
##OWNER= nmr
$$ XWIN-NMR		Version 3.5
$$ Tue May 23 10:06:42 2006 GMT Daylight Time (UT+1h)  MAYBRIDGE\nmr@NMR_250MHZ
##.OBSERVE FREQUENCY= 250.131544655141
##.OBSERVE NUCLEUS= ^1H
##.ACQUISITION MODE= SIMULTANEOUS (DQD)
##.ACQUISITION SCHEME= undefined
##.AVERAGES= 16
##.DIGITISER RES= 18
##SPECTROMETER/DATA SYSTEM= dpx250
##.PULSE SEQUENCE= zg30
##.SOLVENT NAME= DMSO
##.SHIFT REFERENCE= (INTERNAL, DMSO, 0, 16.522)
##AUDIT TRAIL= $$ (NUMBER, WHEN, WHO, WHERE, WHAT)
$$ ##TITLE= Audit trail, XWIN-NMR		Version 3.5
$$ ##JCAMPDX= 5.01
$$ ##ORIGIN= Bruker BioSpin GmbH
$$ ##OWNER= nmr
$$ C:\u/data/dgb/nmr/ADRS/5000/pdata/1/auditp.txt
$$ ##AUDIT TRAIL=  $$ (NUMBER, WHEN, WHO, WHERE, WHAT)
(   1,<2006-05-23 10:06:09.65 +100>,<MAYBRIDGE\nmr>,<NMR_250MHZ>,
      <created by zg, POWCHK disabled, PULCHK disabled
       configuration hash MD5:
       84 BC 41 DB A1 6E 1D 46 DA 25 12 A5 C1 ED C5 3A
       data hash MD5: 64K
       3C 64 D2 98 A8 EA 5B 75 EC B5 3D 34 6E 99 F0 CB>)
(   2,<2006-05-23 10:06:30.63 +100>,<MAYBRIDGE\nmr>,<NMR_250MHZ>,
      <Start of raw data processing
       ef LB = 0.3 FT_mod = 6 PKNL = 1 SI = 32K 
       data hash MD5: 32K
       90 D4 A8 8A BC CF 85 6D 10 94 82 4F E6 15 74 A7>)
(   3,<2006-05-23 10:06:32.65 +100>,<MAYBRIDGE\nmr>,<NMR_250MHZ>,
      <apk 
       data hash MD5: 32K
       48 7D 4B BB 76 B1 79 60 D3 9C 42 5A F7 B6 32 07>)
(   4,<2006-05-23 10:06:33.44 +100>,<MAYBRIDGE\nmr>,<NMR_250MHZ>,
      <abs ABSG = 5 
       data hash MD5: 32K
       9D 04 15 A9 55 EA 58 27 A0 CB D2 40 D2 22 5C F0>)
$$ ##END=
$$ 
$$ hash MD5
$$ 47 75 06 A2 22 C1 77 E5 0A 26 F1 47 1D 00 BB C9
##$RELAX= 
##$RELAX= 
##$RELAX= 
##$RELAX= 
##$RELAX= 
##$RELAX= 
##$RELAX= 
$$ Bruker specific parameters
$$ --------------------------
##$DU= <C:\u>
##$EXPNO= 5000
##$NAME= <ADRS>
##$PROCNO= 1
##$TYPE= <nmr>
##$USER= <dgb>
##$AMP= (0..31)
100 100 100 100 100 100 100 100 100 100 100 100 100 100 100 100 100 100 
100 100 100 100 100 100 100 100 100 100 100 100 100 100 
##$AQSEQ= 0
##$AQ_mod= 3
##$AUNM= <au_zg>
##$AUTOPOS= <11 >
##$BF1= 250.13
##$BF2= 250.13
##$BF3= 250.13
##$BF4= 250.13
##$BF5= 500.13
##$BF6= 500.13
##$BF7= 500.13
##$BF8= 500.13
##$BYTORDA= 1
##$CFDGTYP= 0
##$CFRGTYP= 5
##$CHEMSTR= <none>
##$CNST= (0..31)
1 1 145 1 1 1 1 1 1 1 1 1 1 1 1 1 1 1 1 1 1 1 1 1 1 1 1 1 1 1 1 1 
##$CPDPRG= <>
##$CPDPRG1= <>
##$CPDPRG2= <>
##$CPDPRG3= <>
##$CPDPRG4= <mlev>
##$CPDPRG5= <mlev>
##$CPDPRG6= <mlev>
##$CPDPRG7= <mlev>
##$CPDPRG8= <mlev>
##$CPDPRGB= <>
##$CPDPRGT= <>
##$D= (0..31)
0 1 0 0 0 0 0 0 0 0.06 0 0 0 0 0 0 0.0002 0 0 0 0 0 0 0 0 0 0 0 0 0 0 
0 
##$DATE= 1148375163
##$DBL= (0..7)
120 120 120 120 120 120 120 120 
##$DBP= (0..7)
150 150 150 150 150 150 150 150 
##$DBP07= 0
##$DBPNAM0= <>
##$DBPNAM1= <>
$$ [...]
##$SUBNAM7= <"">
##$SUBNAM8= <"">
##$SUBNAM9= <"">
##$SW= 20.6930455092707
##$SWIBOX= (0..15)
0 0 3 0 0 0 0 0 0 0 0 0 0 0 0 0 
##$SW_h= 5175.983436853
##$TD= 65536
##$TD0= 1
##$TE= 294.16
##$TE2= 300
##$TE3= 300
##$TEG= 300
##$TL= (0..7)
0 120 120 120 120 120 120 120 
##$TP= (0..7)
150 150 150 150 150 150 150 150 
##$TP07= 0
##$TPNAME0= <>
##$TPNAME1= <>
##$TPNAME2= <>
##$TPNAME3= <>
##$TPNAME4= <>
##$TPNAME5= <>
##$TPNAME6= <>
##$TPNAME7= <>
##$TPOAL= (0..7)
0.5 0.5 0.5 0.5 0.5 0.5 0.5 0.5 
##$TPOFFS= (0..7)
0 0 0 0 0 0 0 0 
##$TUNHIN= 0
##$TUNHOUT= 0
##$TUNXOUT= 0
##$USERA1= <user>
##$USERA2= <user>
##$USERA3= <user>
##$USERA4= <user>
##$USERA5= <user>
##$V9= 5
##$VALIST= <valist>
##$VCLIST= <CCCCCCCCCCCCCCC>
##$VD= 0
##$VDLIST= <DDDDDDDDDDDDDDD>
##$VPLIST= <PPPPPPPPPPPPPPP>
##$VTLIST= <TTTTTTTTTTTTTTT>
##$WBST= 1024
##$WBSW= 4
##$XGAIN= (0..3)
0 0 0 0 
##$XL= 0
##$YL= 0
##$YMAX_a= 400711
##$YMIN_a= -459021
##$ZGOPTNS= <>
##$ZL1= 120
##$ZL2= 120
##$ZL3= 120
##$ZL4= 120
##$ABSF1= 16.522
##$ABSF2= -4.171173
##$ABSG= 5
##$ABSL= 3
##$ALPHA= 0
##$AQORDER= 0
##$ASSFAC= 0
##$ASSFACI= 0
##$ASSFACX= 0
##$ASSWID= 0
##$AUNMP= <proc_1d>
##$AZFE= 0.1
##$AZFW= 0.1
##$BCFW= 0
##$BC_mod= 0
##$BYTORDP= 0
##$COROFFS= 0
##$CY= 12.5
##$DATMOD= 1
##$DC= 0
##$DFILT= <>
##$DTYPP= 0
##$F1P= 14.0000005364418
##$F2P= -0.99999901652339
##$FCOR= 0.5
##$FTSIZE= 32768
##$FT_mod= 6
##$GAMMA= 0
##$GB= 0
##$INTBC= 1
##$INTSCL= 1
##$ISEN= 128
##$LB= 0.3
##$LEV0= 0
##$LPBIN= 0
##$MAXI= 10000
##$MC2= 0
##$MEAN= 0
##$ME_mod= 0
##$MI= 0
##$NCOEF= 0
##$NC_proc= -5
##$NLEV= 6
##$NOISF1= 0
##$NOISF2= 0
##$NSP= 0
##$NTH_PI= 0
##$NZP= 0
##$OFFSET= 16.522
##$PC= 1
##$PHC0= 155.2493
##$PHC1= 19.49655
##$PH_mod= 1
##$PKNL= yes
##$PPARMOD= 0
##$PSCAL= 4
##$PSIGN= 0
##$REVERSE= no
##$SF= 250.13
##$SI= 32768
##$SIGF1= 0
##$SIGF2= 0
##$SINO= 400
##$SIOLD= 32768
##$SREGLST= <1H.DMSO>
##$SSB= 0
##$STSI= 32768
##$STSR= 0
##$SW_p= 5175.98343685301
##$SYMM= 0
##$S_DEV= 0
##$TDeff= 65536
##$TDoff= 0
##$TI= <Analysis number 999999
Compound Code 99
Book Reference 9
Project Code 9>
##$TILT= no
##$TM1= 0
##$TM2= 0
##$TOPLEV= 0
##$USERP1= <user>
##$USERP2= <user>
##$USERP3= <user>
##$USERP4= <user>
##$USERP5= <user>
##$WDW= 1
##$XDIM= 32768
##$YMAX_p= 333582616
##$YMIN_p= -928831
$$ End of Bruker specific parameters
$$ ---------------------------------
##NTUPLES= NMR SPECTRUM
##VAR_NAME=  FREQUENCY,     SPECTRUM/REAL,   SPECTRUM/IMAG
##SYMBOL=    X,             R,               I
##VAR_TYPE=  INDEPENDENT,   DEPENDENT,       DEPENDENT
##VAR_FORM=  AFFN,          ASDF,            ASDF
##VAR_DIM=   32768,         32768,           32768
##UNITS=     HZ,            ARBITRARY UNITS, ARBITRARY UNITS
##FACTOR=    0.157963299565203, 1,           1
##FIRST=     4132.6476996994, 0,             0
##LAST=      -1043.33573715361, 0,           0
##MIN=       -1043.33573715361, -928831,     0
##MAX=       4132.6476996994, 333582616,     0
$$ Real data points
##PAGE= N=1
##DATA TABLE= (X++(R..R)), XYDATA
$$ [...]
14897A9614j5665r2765K9236L1148l3213j37035J9143P4201K9646R513o1253L5718
$$ 19614 3949 -88816 -59580 -28432 -61645 -198680 -179537 -105336 -75690 -66177 -127430 -91712
14885i1712j6932n2908R8921R1763N3490O342q9942r0324K0315K2093k4147M8659
$$ -91712 -108644 -161552 -62631 29132 82622 88964 -978 -91302 -70987 -48894 -73041 -24382
14873b4382R3272m625l3842j23321o8805k0249O4903J02489J0139m3998n6938
$$ -24382 68890 64265 30423 -92898 -161703 -181952 -117049 -14560 -4421 -48419 -105357
14862a05357k7163J41632J30146K0375j30996r7993p1744j3625Q9474J33502R0350
$$ -105357 -132520 9112 139258 159633 28637 -69356 -141100 -154725 -65251 68251 158601
14851A58601o3893n7668q0655L8886N586j5415j5396J3686l2243q3206J11345
$$ 158601 94708 37040 -43615 -4729 857 -14558 -29954 -16268 -48511 -131717 -20372
14840b0372J215m1608J371N5370J03238Q0973P855r0746j00154j67433K8742j01155
$$ -20372 -19157 -60765 -59394 -4024 99214 180187 188042 97296 -2858 -170291 -141549 -242704
14828b42704l5527J63371J14336J45048J1499p7321r6577r364N1489J8511o0934
$$ -242704 -278231 -114860 -524 144524 156023 78702 -17875 -27239 24250 42761 -18173
14817a8173N4655m0951m2480k8641J3265N86N6951O3227N114N1294r4244p9569
$$ -18173 36482 -4469 -46949 -75590 -62325 -61739 -4788 58439 63553 114847 20603 -58966
14805e8966n8793j54572J11905R5095J96821n2546k4955M9048m013q954j8750
$$ -58966 -117759 -272331 -160426 -65331 131490 78944 53989 103037 99024 90070 71320
14794G1320J3076n2042L9496L3869q3198r5077J2871J18171k1399Q600P5159o9548
$$ 71320 84396 32354 71850 105719 22521 -72556 -59685 58486 37087 45687 120846 51298
14782E1298j08951m6921m6961O8897R624P4959Q2816p9940k2924k52j4820n4297
$$ 51298 -57653 -104574 -151535 -82638 -73014 1945 84761 4821 -18103 -18355 -33175 -87472
14770h7472N9267P2380M1551O2114J5252j15779k2433J1830m6952J14425k5072
$$ -87472 -28205 44175 85726 147840 163092 47313 24880 36710 -10242 104183 79111
14759G9111j03206Q979n1414o0481J0381r5758j608J01712J42971j1704m5267
$$ 79111 -24095 -15116 -66530 -127011 -116630 -212388 -213996 -112284 30687 18983 -26284
14748b6284K683k770J38363l5j52704K2077M3412J08735M6013r7508j2052J3353
$$ -26284 -23601 -26371 111992 111957 -40747 -18670 24742 133477 179490 81982 69930 83283
14736H3283o3172j75915j13374q3984j7438P1496J61761R6966j09877j5040O9943
$$ 83283 20111 -155804 -269178 -353162 -370600 -299104 -137343 -40377 -150254 -165294 -95351
14725i5351J10676l185j5948R7817n0537j05224m1280J39763m9418n3820J14632
$$ -95351 15325 12140 -3808 94009 43472 -61752 -103032 36731 -12687 -66507 48125
14714D8125q250j2249j01481k6435K2843q0218j01541J7033M8003J15116M9263
$$ 48125 39875 27626 -73855 -100290 -77447 -157665 -259206 -242173 -194170 -79054 -29791
14703b9791P4364J01558J22399n1598j75272j26990N937K1139O9237M2374l5875
$$ -29791 44573 146131 268530 216932 41660 -85330 -79393 -58254 10983 53357 17482
14692A7482k6300k8534j0222L1279J10675Q0445n4097j45598l4473m5918j05521
$$ 17482 -8818 -37352 -47574 -16295 94380 174825 120728 -24870 -59343 -105261 -210782
14681b10782K8014N6157k9258J5726j1536J79825L4828j17113o8949K3257j29717
$$ -210782 -182768 -126611 -155869 -140143 -151679 28146 62974 -54139 -123088 -99831 -229548
14670b29548m4825J60246R9444j15203j36471k3754J74013Q2214J15405N5470
$$ -229548 -274373 -114127 -14683 -129886 -266357 -290111 -116098 -33884 81521 136991
14660A36991o2588n1821r1539J02339M3607j5702o8907l5854K6755K2300m0677
$$ 136991 74403 22582 -68957 33382 76989 61287 -7620 -43474 -16719 5581 -35096
14649c5096q2149k1694j6167P289J42330K9516p0197P4704j0203M379j2117p794
$$ -35096 -117245 -138939 -155106 -147817 -5487 24029 -46168 28536 18333 22712 10595 2801
14637B801p3910k1097J01301P7174m3837q4343M512N2298K2141j0858n8552J9443
$$ 2801 -71109 -92206 9095 86269 42432 -41911 -37399 14899 37040 26182 -32370 -12927
14625a2927M2337j12307o6051o4799N7793J66145O764J7851J7096k7293j70096
$$ -12927 29410 -82897 -148948 -213747 -155954 10191 16955 34806 51902 24609 -145487
14614a45487q5767R0818Q6151M5371n2384k5626P5831K476n1287P2617R0827O8797
$$ -145487 -231254 -140436 -54285 -8914 -61298 -86924 -11093 -8617 -59904 12713 103540 172337
14602A72337j5670M1702l2872m9744K8476l3506K5420m9762n3927r1477j21932
$$ 172337 156667 198369 165497 115753 144229 110723 136143 86381 32454 -59023 -180955
14591a80955p2413N7372J41656J05825J33281n8120o3021q8416l333J9616L281
$$ -180955 -253368 -195996 -54340 51485 184766 126646 63625 -24791 -28124 -8508 -5227
14580e227j16227q3411K720K31931O4642r0447j47806J8298J06738q1739k0639
$$ -5227 -121454 -204865 -202145 29786 94428 3981 -143825 -125527 -18789 -100528 -121167
14569a21167J87564m890Q1970O1077j42414n4323J1271L1285k6616m877m2198
$$ -121167 66397 61507 143477 204554 62140 7817 19088 50373 23757 18880 -23318
14558b3318K3602j663p0651l049k0072R965K0753l592J298m0274p671q41N1305
$$ -23318 284 -1379 -72030 -75079 -95151 -85186 -64433 -68025 -66727 -107001 -114672 -115513 -64208
14545f4208J1575L1239L9502L7664Q1226o5231n0666Q8239K127q7363j24743j39966
$$ -64208 -52633 -21394 18108 55772 136998 71767 21101 109340 111467 24104 -100639 -240605
14533b40605L6763J1709M5740K4783J00818J14146L568p8919l0174o0896J0018
$$ -240605 -203842 -192133 -146393 -121610 -20792 93354 96922 18003 -12171 -73067 -63049
14522f3049J17071N4910n7929p4557l0182N6265k6812m5215k9516M7328j3175
$$ -63049 54022 108932 51003 -23554 -53736 2529 -24283 -69498 -99014 -51686 -64861
14511f4861M505l8410j05476k18k1595N2220J26907Q5385p002j02997r6615j1396
$$ -64861 -60356 -98766 -204242 -204460 -226055 -173835 -46928 38457 31455 -71542 -168157 -179553
14499a79553M4114o354R9723j5563p616L5847M0689P3875j09655r8860q4553K8020
$$ -179553 -135439 -141793 -42070 -57633 -65249 -29402 11287 85162 -24493 -123353 -207906 -179886
14487a79886J64298L6456L8283K4463j2735k8310Q9318O4258l5543l4447q5203
$$ -179886 -15588 20868 59151 83614 70879 42569 131887 196145 160602 126155 40952
14476D0952k5942p632N7450Q0679N3254j04716j55355r707N4353Q169L0947N0541
$$ 40952 15010 7378 64828 145507 198761 94045 -61310 -71017 -16664 -8495 22452 72993
14464G2993K6545j09604K321k9863m6245M909K5201J1068l1042j8211N3789J59461
$$ 72993 99538 -10066 -7745 -37608 -83853 -78944 -53743 -42675 -73717 -91928 -38139 121322
14452A21322J11649o2471j50566J7096k1259L0079r8182K2672J07602o5242p9379
$$ 121322 232971 170500 19934 37030 15771 45850 -52332 -29660 77942 12700 -66679
14441f6679o7461Q2998J9150J48952R9349k1182l6550K2861m5545q2412n2765
$$ -66679 -134140 -51142 -31992 116960 216309 195127 158577 181438 135893 53481 716
14430G16O4784K91j08893P7008k052p8555K6731l3994n4762j9090N7542J67254
$$ 716 65500 65791 -43102 33906 31854 -46701 -19970 -53964 -108726 -127816 -70274 96980
14418I6980J01617L888q5315j23274n4258J28608J3914P5071N5850o3676j34306
$$ 96980 198597 202485 117170 -6104 -60362 68246 82160 157231 213081 149405 15099
14407A5099k2325P0047l5366L7006J1446o1643o1456m2824N8468J56090K528K9453
$$ 15099 -7226 62821 27455 64461 75907 14264 -47192 -90016 -31548 124542 127070 156523
14395A56523L751L9805L7292j6303m2246k5189Q1132O318n0921o334j49425j53925
$$ 156523 160274 200079 237371 221068 178822 153633 234765 241083 190162 183828 34403 -119522
14383a19522r409q7333k2932P7784K08994J66343J3216K3486k5687m2643j9220
$$ -119522 -128931 -216264 -239196 -161412 47582 213925 227141 250627 224940 182297 163077
14372A63077l3896J1421p3441j56689J0688O7978j44523k7843K386J07398R6986
$$ 163077 129181 140602 67161 -89528 -78840 -10862 -155385 -183228 -180842 -73444 23542
14361B3542n389r0956N6316L8171R863K2984J2989M770n1386o4943j08315o5541
$$ 23542 18153 -72803 -16487 21684 31547 54531 67520 72290 20904 -44039 -152354 -217895
14349b17895J06610K08274k6630r7854R643K0271k2658k074k491L4487o190M8128
$$ -217895 -111285 96989 70359 -27495 -17852 2419 -20239 -22313 -24804 9683 3493 51621
14337E1621J00641l5195l3475n5011n8135K5081J74367J12745n3469j82549j23964
$$ 51621 152262 117067 83592 28581 -29554 -4473 169894 282639 229170 46621 -77343
14326g7343o2265l7338k5761m8531J45543L9634M8144J015J7264p4955j717k7811
$$ -77343 -139608 -176946 -202707 -251238 -105695 -66061 -17917 -16902 362 -74593 -76310 -104121
14314a04121j2747l2237J40838J13799R2993k8255p1997L9569r157o0193p131
$$ -104121 -116868 -149105 -8267 105532 198525 170270 98273 137842 128685 68492 61361
14303F1361m1083J4069P3407L2225l9390Q2154l4198p5995M0477L7802k786L4618
$$ 61361 20278 34347 107754 139979 100589 182743 148545 72550 113027 150829 148043 182661
14291A82661p1946n8805M1296k359j3830K2070O595j480Q532Q4857j6609K244
$$ 182661 110715 51910 93206 90847 77017 99087 105682 104202 112734 197591 180982 183226
14279A83226m4278M906M6435m6620L5007n8286j06070n2186Q9072J25213j196
$$ 183226 138948 143854 190289 143669 178676 120390 14320 -37866 51206 176419 175223
14268A75223l6827p8186Q384P6803K558o91r0631j17733J35958q761p2956q7788
$$ 175223 138396 60210 68594 145397 147955 147264 56633 -61100 74858 66097 -6859 -94647
14256i4647j06695J23388N9294N2187L1113j34802k9393P1952O4503Q4095J2678
$$ -94647 -201342 -77954 -18660 33527 64640 -70162 -99555 -27603 36900 120995 133673
14245A33673l8917l9373K8540N5143k3718J9257M5834j00689q7168o6455P3272
$$ 133673 94756 55383 83923 139066 115348 134605 180439 79750 -7418 -73873 -601
14234f01J73077M3843n5570j7924L5619R0331J9077l8954j03957o6416N6948M2071
$$ -601 172476 216319 160749 142825 178444 268775 287852 248898 144941 78525 135473 177544
14222A77544O4893j08498Q8159J45429q2368p1299j18229r2034o1749P0244J86942
$$ 177544 242437 133939 222098 367527 285159 213860 95631 3597 -58152 12092 199034
14211A99034N0196n9426J7647L491k28965r0960Q7526J25238K5423o1588R288
$$ 199034 249230 189804 207451 210942 -18023 -108983 -21457 103781 129204 67616 76904
14200G6904J609o5840N2953K2887O0048k2957j00927n8801N1214J38210N4226
$$ 76904 78513 12673 65626 88513 148561 125604 24677 -34124 17090 155300 209526
14189B09526o4438n9891Q6434J2438r2969J3259o8768L4916J01513M2259j28034
$$ 209526 145088 85197 171631 184069 91100 104359 35591 70507 172020 214279 86245
14178H6245r5542k4691k662J13140M8436N7934j4031j8556r2633o7367j07581
$$ 86245 -9297 -33988 -36650 76490 124926 182860 168829 150273 57640 -9727 -117308
14167a17308p7742l1318n596Q9375k3942o933J4961K16310N597m3518j9110r3368
$$ -117308 -195050 -226368 -231964 -142589 -166531 -173464 -158503 57807 63404 19886 776 -92592
14155i2592m2075K1834J55918J10135l9575o7938N4348M4602q1445r801P5201
$$ -92592 -134667 -112833 43085 153220 113645 45707 100055 144657 63212 53411 128612
14144A28612R1429p3819J0609p0414R7622N8729p5314l2497j06560j58294O2553
$$ 128612 220041 146222 156831 86417 184039 242768 167454 134957 28397 -129897 -67344
14133f7344J68834L5799l6008j0704J07554L7791j47729j47036k2823N5074J23332
$$ -67344 101490 137289 101281 90577 198131 235922 88193 -58843 -81666 -26592 96740
14122I6740l314l2881Q5935N957J07712q5820J7459O666l392o9624j23614j14410
$$ 96740 93426 60545 146480 152437 260149 174329 191788 198454 195062 125438 1824 -112586
14110a12586j8943J4402O2697l2412N1363n7252M4401j24784M2560J9054K484
$$ -112586 -131529 -117127 -54430 -86842 -35479 -92731 -48330 -173114 -130554 -111500 -109016
14099a09016J33829L03319Q804j96708p6357l5852j16N9381l2655O147O9579k7373
$$ -109016 24813 328132 336936 140228 63871 28019 27903 87284 54629 60776 130355 102982
14087A02982O9329R819m661q7842K2372k5307Q6718J13371n9654n0927j00116
$$ 102982 172311 182130 177469 89627 111999 86692 173410 286781 227127 176200 76084
14076G6084j04267K5404P8509L2238j8613l3783j2901o0802J3853J36448M8396
$$ 76084 -28183 -2779 75730 107968 89355 55572 42671 -18131 -4278 132170 180566
14065A80566N1011l2622P0900k1868n2602n6079J3588R0575p0366l0767r3681
$$ 180566 231577 198955 269855 247987 195385 139306 152894 243469 173103 142336 48655
14054D8655l2259K1219n7836P086M6980l0483J25784n6407l3403J01997j14868
$$ 48655 16396 37615 -20221 -13135 33845 3362 129146 72739 39336 141333 26465
14043B6465j84314J7552L7130r0708N6798J21485J15488Q671L5815M3378M3192
$$ 26465 -157849 -140297 -103167 -193875 -137077 -15592 99896 108567 144382 187760 230952
14032B30952o0658l540j7049j6169k0424K8277J595r2219m001J7872r0911K4657
$$ 230952 170294 166754 149705 133536 113112 141389 142984 50765 46764 64636 -26275 -1618
14020a618J9527p0220J38648k0883l8663N4315K3640K6893R4567M3996m0170n5187
$$ -1618 17909 -52311 86337 65454 26791 81106 104746 131639 226206 270202 230032 174845
14008A74845n2654j2607k3652O3459l7822r9511k7893J02184K41784K1217r5590
$$ 174845 122191 109584 85932 149391 111569 12058 -15835 86349 328133 349350 253760
13997B53760o4651j01649j78224k1388J56112o2040q609Q9778J12701j12606q6569
$$ 253760 189109 87460 -90764 -112152 43960 -18080 -26689 63089 175790 63184 -23385
13986b3385N8963Q7808Q1451j74247o7854j3182K3569P8538o4193n5924J41543
$$ -23385 35578 123386 204837 30590 -37264 -50446 -26877 51661 -12532 -68456 73087
13975G3087P1364J3102N3884l3742N9277L6388m727j02814p1213k019j3154M3636
$$ 73087 144451 157553 211437 177695 236972 273360 268633 165819 94606 92587 79433 123069
13963A23069M6979j13366k20922L4370P2590l1949j8211O9492J04632J72401J30842
$$ 123069 170048 56682 -164240 -129870 -57280 -89229 -107440 -37948 66684 239085 369927
13952C69927r1134r6757k5499Q412L495p4741P272N7922j06870R4156Q710r0390
$$ 369927 278793 182036 156537 164949 168444 93703 100975 158897 52027 146183 154893 64503
13940F4503j4644R6725l2160P4598k2150q5377q7244J1661j1818O5161L8714J08627
$$ 64503 49859 146584 114424 189022 166872 81495 -5749 5912 -5906 59255 97969 206596
13928B06596J14593J8280j38697j02509k0178Q5506M8341q9978k6768R8972O726
$$ 206596 321189 339469 200772 98263 78085 163591 211932 121954 95186 194158 200884
13917B00884r0769K1026n610k1353K5934L8143k7728J3798J3778K2961n1884j9748
$$ 200884 110115 131141 125531 104178 130112 168255 140527 154325 168103 191064 139180 119432
13905A19432J09050m9548j00535r7702N421l6660R5664J57741O5237Q400M9612
$$ 119432 228482 178934 78399 -19303 -13882 -50542 45122 202863 268100 276500 326112
13894C26112M9282p7637j07537P8072M423j18143K723r1715O9014R5805k6984
$$ 326112 375394 297757 190220 268292 272715 154572 157295 65580 134594 230399 203415
13883B03415M0923k6113j28831L558J79754j7428K9151Q62m9518o2061j08649
$$ 203415 244338 218225 89394 92952 272706 255278 284429 285291 235773 173712 65063
13872F5063o6474Q977o797J2185O1631m1670n9285J420M5690P2876N0295R0046
$$ 65063 -1411 7566 769 12954 74585 32915 -26370 -24950 20740 93616 143911 233957
13860B33957q8654J3933L4869M6249j719o083M2974q4406j00108L7738J29643
$$ 233957 145303 159236 194105 240354 238635 232552 275526 191120 91012 128750 258393
13849B58393l0966Q558O327m4692J5397l7191K6341j02162k38655N7396P1833
$$ 258393 227427 235985 242312 197620 213017 175826 202167 100005 -138650 -81254 -9421
13838i421j1374k6419Q1670M6405L8376Q9021o6243J04700p1243p2883o302l5059
$$ -9421 -20795 -47214 34456 80861 119237 208258 142015 246715 175472 102589 96287 61228
13826F1228n0369J15191J9926J41844J17059j2525j00242r4459J0434o7337o547
$$ 61228 10859 126050 145976 287820 404879 392354 292112 197653 208087 140750 134203
13815A34203l0241R0441p8928j7394J08034J1382m6802L2871J2692N1816L6546
$$ 134203 103962 194403 115475 98081 206115 217497 170695 203566 216258 268074 304620
13804C04620k0838J7048j452p0320j8917k9982p3180K7236n9442J0603N4646l8128
$$ 304620 283782 300830 299378 229058 210141 180159 106979 134215 74773 85376 140022 101894
13792A01894K2465J10368q4217q3199Q687L7175Q1905n3275Q4978M4517J05966
$$ 101894 124359 234727 150510 67311 75998 113173 195078 141803 226781 271298 377264
13781C77264k0310r1227L3058j33881J0520j1104q087j4693M5880K6773m0941
$$ 377264 356954 265727 298785 164904 175424 164320 156233 141540 187420 214193 173252
13770A73252O6397M6969k1832j0292p384j4882l04n3445r0703r702P148K5834
$$ 173252 239649 286618 264786 254494 247110 232228 231924 178479 87776 78074 85222 111056
13758A11056p3192M8504K19137j2046r3760o4859J393L8778o3430k134J274n0022
$$ 111056 37864 86368 305505 293459 199699 134840 136233 175011 111581 109447 110721 60699
13746F0699o4930m4470O7666P4294R4390j3273J07122O0771J9088Q610m910N650
$$ 60699 -4231 -48701 18965 93259 187649 174376 281498 342269 361357 369967 365057 370707
13734C70707p3314p5551q1703J5799J06450j3573p9728O449J04729J07722J1086
$$ 370707 297393 221842 140139 155938 262388 248815 169087 175536 280265 387987 399073
13723C99073L2805j44566j65146O6413L8618m5183J7793p8055n3002L4779Q8205
$$ 399073 431878 287312 122166 188579 227197 182014 199807 121752 68750 103529 191734
13712A91734K2952n6990J46061K2138R6243p9720m5985j6863N6242M5577p0005
$$ 191734 214686 157696 303757 325895 422138 342418 296433 279570 335812 381389 311384
13701C11384K6704r2904o6150N2864M3941J09571J59695j7161j02918o3540j20975
$$ 311384 338088 245184 179034 231898 275839 385410 545105 527944 425026 361486 240511
13690B40511n032j7179M0111J00241Q9534P6761j31736m0082k4233r2292q1639
$$ 240511 235479 218300 258411 358652 448186 524947 393211 353129 328896 236604 154965
13679A54965j1120K4537m6966j5734P2537P2995o2567j6338o5415q8357J96925
$$ 154965 143845 168382 121416 105682 178219 251214 188647 172309 106894 18537 215462
13668B15462J18486k7162l8224Q1349K3603o5629k9470j21176J7529l9311o0085
$$ 215462 333948 306786 268562 349911 373514 307885 278415 157239 174768 135457 75372
13657G5372J27578J39543o1322J3507k0314J56222P4513q0672p3844k2986q0691
$$ 75372 202950 342493 281171 294678 274364 430586 505099 424427 350583 327597 246906
13646B46906k4841J26326n264p2392J05466J37226p6205o5779p0465n1996N5670
$$ 246906 222065 348391 343127 270735 376201 513427 437222 371443 300978 248982 304652
13635C04652M6186n7858m3538l9686o897J3047m8503k992L6569j4766O3374k7090
$$ 304652 350838 292980 249442 209756 202859 215906 167403 164411 200980 186214 249588 222498
13623B22498J01657p06j08280J404k1052K8989l622Q807k1871N564P9724N9478
$$ 222498 324155 323449 215169 216573 195521 224510 220888 229695 207824 213388 293112 352590
13611C52590p187K0065r2915j01171l5756J02691k8222o0192Q2202L3116M9642
$$ 352590 345403 365468 272553 171382 135626 238317 210095 149903 232105 265221 314863
13600C14863N7949r3702j43927p5065Q1984J02690M0486J1257J01254n0670L393
$$ 314863 372812 279110 135183 60118 142102 244792 285278 296535 397789 347119 350512
13589C50512J08456p4504L9434k9711l6138l2110k4026J5055N5474o448P6046
$$ 350512 458968 384464 423898 394187 358049 325939 301913 316968 372442 365994 442040
13578D42040L8250Q0885j7726r3690j02173k34009P0685K06334J32073J1294j3579
$$ 442040 480290 561175 543449 449759 347586 113577 184262 390596 522669 533963 520384
13567E20384r0021j26605j28124L1630J09807j02762n0223P0643K0934R2047j1741
$$ 520384 430363 303758 175634 207264 317071 214309 164086 234729 255663 347710 335969
13556C35969J8314o660k3438k4078p0193N9106r690j02171J08029K36469M6852
$$ 335969 354283 347623 324185 300107 229914 289020 279330 177159 285188 521657 568509
13545E68509r6381p6212k0748j26975j85114P9598J28546P1857j7951j02710j18567
$$ 568509 472128 395916 375168 248193 63079 142677 271223 343080 325129 222419 103852
13534A03852j09711J05853J39156R6704N312j72790q6392N8169K6232Q4354j7496
$$ 103852 -5859 99994 239150 335854 341166 168376 81984 140153 166385 250739 233243
13523B33243Q3548k351L2068R6943p8068L879J02453J21542k9756j1737j26189
$$ 233243 316791 314440 346508 443451 365383 369262 471715 593257 563501 551764 425575
13512D25575j06370j20152M7699o918m8135N5252M7810Q6051M5139k3373n8863
$$ 425575 319205 199053 246752 239834 191699 246951 294761 380812 425951 402578 343715
13501C43715P1410m79k2562p0538J00037m097k5129p9443P2730l2452j3412M6413
$$ 343715 415125 414646 392084 321546 421583 417486 392357 312914 385644 353192 339780 386193
13489C86193J8542j7209L2683p7616l3156j8161M8366R0711J8562N6740J3761
$$ 386193 404735 387526 420209 342593 309437 291276 339642 430353 448915 505655 519416
13478E19416m0880j33763q7864P4120L4013o4023j12716q0946l5094M6246o9466
$$ 519416 478536 344773 256909 331029 365042 301019 188303 107357 72263 118509 49043
13467D9043J31386J6318n1052J08174Q7592j02935p6758J20490N8523k4471q12
$$ 49043 180429 196747 145695 253869 341461 238526 161768 282258 340781 316310 315498
13456C15498o667M1318M3618J23794j10717j60091j37277M50P0265j0900J8696
$$ 315498 308831 350149 393767 517561 406844 246753 109476 109926 180191 169291 187987
13445A87987Q5613r571k0566j02000K3151M7381M5739k6399l3601J00111P2619
$$ 187987 273600 264029 243463 141463 164614 211995 257734 231335 197734 297845 370464
13434C70464j6754M6400m0390r905L6670Q4731M2853l8237l3706o8812J2342j8196
$$ 370464 353710 400110 359720 349815 386485 471216 514069 475832 442126 373314 385656 367460
13422C67460M2889j11809q4974N5606l7213M7061O6204l5066p0928L0292O3872
$$ 367460 410349 298540 213566 269172 231959 279020 345224 310158 239230 269522 333394
13411C33394L8934R6134N9237J45966n5580j76694j48793O8271L651m814N5065
$$ 333394 372328 468462 527699 673665 618085 441391 292598 360869 364520 359706 414771
13400D14771l0638m532J14176p7958k2217R3772j13021j60592O8346K50908O654
$$ 414771 384133 379601 493777 415819 393602 487374 374353 213761 282107 533015 539669
13389E39669j19535m2129l9206K78n7994N6611K0341J9310k2253P6727j3742L9873
$$ 539669 420134 378005 338799 339077 281083 337694 358035 377345 355092 431819 418077 457950
13377D57950n5993R089r9312K2463K8770K8953N216j9080p9165J34021M6372q059
$$ 457950 401957 411046 311734 334197 362967 391920 397136 378056 298891 432912 479284 471225
13365D71225L6615j1212M1992k8194j52320r5905M8372M9471O6097Q643J1902
$$ 471225 507840 496628 538620 510426 358106 262201 310573 360044 426141 434784 446686
13354D46686l1889K3734p19p618j25876j14966j08818J07411J31374N9432J00129
$$ 446686 414797 438531 437812 430194 304318 189352 80534 187945 319319 378751 478880
13343D78880J44958K7019l3588m5111j01633K4153j05131q6199L1328R7334m5837
$$ 478880 623838 650857 617269 572158 470525 494678 389547 303348 334676 432010 386173
13332C86173p6604p2318J35947R8026L668j65845m377R0765J04585N8135l1594
$$ 386173 309569 237251 373198 471224 474892 309047 304670 395435 500020 558155 526561
13321E26561j7193k8110m8876K0282M7895j16998j48606M5222l7631L0708m9903
$$ 526561 509368 481258 432382 452664 500559 383561 234955 280177 242546 273254 223351
13310B23351q6599R3538Q7491K947J06396L451j41553l6879l2747J23487J21485
$$ 223351 136752 230290 317781 320728 427124 430575 289022 252143 219396 342883 464368
13299D64368j0437q7439l0943j0133q2236l0880O7019M6269O9880R7969Q7640
$$ 464368 453931 366492 335549 325416 243180 212300 279319 325588 395468 493437 581077
13288E81077L5651r4820j7481p175r6391p6010Q165K0019k7781k9448j7464K5875
$$ 581077 616728 521908 504427 497252 400861 324851 333016 353035 325254 295806 278342 304217
13276C04217M4360K4617M3195J2717m1979n7042p918P0727J8553J2312m7220n432
$$ 304217 348577 373194 416389 429106 387127 330085 322167 392894 411447 423759 376539 371107
13264C71107o2045j5322m5654K0304J34949P8486J0152J3630Q3369K6114N7141
$$ 371107 309062 293740 248086 268390 403339 481825 491977 505607 588976 615090 672231
13253F72231j71586j32596m2538q613L9464L9852J19365J8172k0680J17043J0420
$$ 672231 500645 368049 325511 316898 356362 396214 515579 533751 513071 630114 640534
13242F40534n8277j06596j9300j11985j74981J04968O0573P1888N3510K559m7204
$$ 640534 582257 475661 456361 344376 169395 274363 334936 406824 460334 462893 415689
13231D15689o348Q3259O3635L5422q8047M7320P434M291m8476n6792m5252j4794
$$ 415689 409341 492600 556235 591657 503610 550930 558364 562655 514179 457387 412135 397341
13219C97341L0198n2042M3073r5910j36231m8122K3325J64073R5762l3716n7777
$$ 397341 427539 375497 418570 322660 186429 138307 161632 325705 421467 387751 329974
13208C29974L7362M2064p331Q5240J11513J41296q6309j51039p0079p3182R5888
$$ 329974 367336 409400 402069 487309 598822 740118 653809 502770 432691 359509 455397
13197D55397r2215k45L0263Q2271P3124K5846q7420j47231J817p0699k3986L8705
$$ 455397 363182 362937 393200 475471 548595 574441 487021 339790 341607 270908 246922 285627
13185B85627O4214J07478J54070M5572j79919R3075J03924J3054j46395j01944
$$ 285627 349841 457319 611389 656961 477042 570117 674041 687095 540700 438756
13175D38756j06788m8856Q5274q0774M2744p8260n5220M7411Q2414M2310n7242
$$ 438756 331968 283112 368386 287612 330356 252096 196876 244287 326701 369011 311769
13164C11769n164L2178J05337J1200K6624J47997K0898O823j35154M2059M8787
$$ 311769 306605 338783 444120 455320 481944 629941 650839 657662 522508 564567 613354
13153F13354j42957j17787J6312o78J0051J81P5909k6827K1861l9261p8878Q3731
$$ 613354 470397 352610 368922 368244 378295 378476 454385 427558 449419 410158 331280 415011
13141D15011J82355n5731n394N3729j8526m5903p5148o3373k8410K7352q5326
$$ 415011 597366 541635 536241 589970 571444 525541 450393 387020 358610 385962 300636
13130C00636L5436L8636K2241k620m8830K2810O610J35396K471J2925j1817p226
$$ 300636 336072 374708 396949 394329 345499 368309 374919 510315 512786 525711 513894 506668
13118E06668p4634l2813M2341J11679k0539j5174j6050k67J8636N4420n6730n2789
$$ 506668 432034 399221 441562 553241 532702 517528 501478 501211 519847 574267 517537 464748
13106D64748n5216R1632k258Q3771K9430o6643o6472O7783J2265o338R5444j81474
$$ 464748 409532 501164 498906 582677 612107 545464 478992 546775 559040 552702 648146 466672
13094D66672j87383j2783P003O4340m68J30426J10346M8463j24999L1340J11427
$$ 466672 279289 266506 273509 337849 337381 467807 578153 626616 501617 532957 644384
13083F44384m3947n931l804o926n3068j37843J4831L9629J9208L4284q2158p6425
$$ 644384 600437 594506 590702 583776 530708 392865 407696 447325 466533 500817 418659 342234
13071C42234j6674J14578J06915K6390N8965j35844n5681j05105r1013M0776J36812
$$ 342234 325560 440138 547053 573443 632408 496564 440883 335778 244765 285541 422353
13060D22353R3441J335K039m9855m6682L7750L4975M4713Q3051j17849o7318K2301
$$ 422353 515794 517129 519168 469313 422631 460381 495356 540069 623120 505271 437953 460254
13048D60254l3897o0473J11074N7982K8626j25604o3668m6829Q0586P7514J1714
$$ 460254 426357 365884 476958 534940 563566 437962 374294 327465 408051 485565 497279
13037D97279L5877l3677p8757K9222K6195L0227p765j06038l0373q1631J8398
$$ 497279 533156 499479 420722 449944 476139 506366 498601 392563 362190 280559 298957
13026B98957m809R2883J21774n7440j84609P4908J70869K4858k7262n2121j869
$$ 298957 294148 387031 508805 451365 266756 341664 512533 537391 510129 458008 456139
13015D56139J43271K2611n0170q2506m2418J17860J29576q2551k6049K8192L7901
$$ 456139 599410 622021 571851 489345 446927 564787 694363 611812 585763 613955 651856
13004F51856P3582P992j14991l7321q0728L5339J11694k2300r8096Q1113m0677
$$ 651856 725438 733430 618439 581118 500390 535729 647423 625123 527027 608140 567463
12993E67463j01519k5937M2394J12947K5413j14229P281l5408j30617n349L9554
$$ 567463 465944 440007 482401 595348 620761 506532 513813 478405 347788 342439 381993
12982C81993L9907L9786O5137J4273q5218o2832n1576J0930J00029P7051j14037
$$ 381993 421900 461686 526823 541096 455878 393046 341470 352400 452429 529480 415443
12971D15443j794K9884j708N5928k9359N2123k0468r2018j15099M8413R1289P8514
$$ 415443 413649 443533 441825 497753 468394 520517 500049 408031 292932 341345 432634 511148
12959E11148L6632J0885P986o7701Q210o072k5310J48411J1323J65161n3431o3614
$$ 511148 547780 558665 566651 498950 507160 501088 475778 624189 635512 800673 747242 683628
12947F83628o2474j15441P9768J5293n0680O2084J07017M400p5685k2607o6075
$$ 683628 621154 505713 585481 600774 550094 612178 719195 723595 647910 625303 559228
12936E59228j00258P7384K1347R3675R7672j75347N051j9361L1095j2211m3060
$$ 559228 458970 536354 557701 651376 749048 573701 578752 559391 590486 578275 535215
12925E35215K1996R3035P9816j03681j97932J525J77791K7323o9814j13876L3465
$$ 535215 557211 650246 730062 626381 428449 429974 607765 635088 565274 451398 484863
12914D84863K1403M4607k6138n219M7266j19312l0049J10836N4641R0556p732
$$ 484863 506266 550873 524735 519516 566782 447470 417421 528257 582898 673454 665722
12903F65722j35734o6777j38489J10977O6524M4891j7701J6457l4027n7159L6983
$$ 665722 529988 463211 324722 435699 502223 547114 529413 545870 511843 454684 491667
12892D91667K9316J17790R9151J8838m1378R0580J6286k01682l9896J6731J24818
$$ 491667 520983 638773 737924 756762 715384 805964 822250 620568 580672 597403 722221
12881G22221L9278m1353j7898K6098Q0304M2531k1795O8139j20920j37690K5699
$$ 722221 761499 720146 702248 728346 808650 851181 829386 897525 776605 638915 664614
12870F64614O1891l2323K3366J6912j04452N4109J09617j8550r9657L0169L3050
$$ 664614 726505 694182 717548 734460 630008 684117 793734 775184 675527 705696 738746
12859G38746O2555K4014r833M9134j04231k20226l6259J34405M2111m3531j52983
$$ 738746 801301 825315 815482 864616 760385 540159 503900 638305 680416 636885 483902
12848D83902N455J20955J8925J01076N5104k4213l8099Q8774P3637l2841j29232
$$ 483902 489357 610312 629237 730313 785417 761204 723105 811879 885516 852675 723443
12837G23443l4347J42984J44176J6138p7041j22900q5658o5434O4869j8103K7627
$$ 723443 689096 832080 976256 992394 915353 792453 706795 641361 706230 688127 715754
12826G15754k1355R2340K1372j52124j41039J03309R4879M986j8908k5297l1678
$$ 715754 694399 786739 808111 655987 514948 618257 713136 718122 699214 673917 642239
12815F42239n9225k4005O5947R451K4034L3207N9576l5683l9697n4746k9917Q174
$$ 642239 583014 559009 624956 634407 658441 691648 751224 715541 675844 621098 591181 599355
12803E99355Q6669M2253j896o7936N6314p281P7718k1258r8091j5167J10869J20691
$$ 599355 686024 728277 726381 658445 714759 707478 785196 763938 665847 650680 761549 882240
12791H82240n5945j45163p9257J35587M7202M9616m5785m1557K2218P4738Q8874
$$ 882240 826295 681132 601875 737462 784664 834280 788495 746938 769156 843894 932768
12780I32768L245j01778p5317o9849p2081L8482N7930o8059r6017k1945J04579
$$ 932768 936013 834235 758918 689069 616988 655470 713400 645341 549324 527379 631958
12769F31958R7260p5729R3658j7891p0627R306J09532L0710N5035j6156l4361
$$ 631958 729218 653489 747147 729256 658629 667935 777467 808177 863212 847056 812695
12758H12695l9215k8289j0534l7451j30240k9321K5781R8926K0645o5515p0849
$$ 812695 773480 745191 734657 697206 566966 537645 563426 662352 682997 617482 546633
12747E46633R0892J2782r5937p9014Q3510J9542M7068J25073j7985m6389P7325
$$ 546633 637525 650307 554370 475356 558866 578408 625476 750549 732564 686175 763500
12736G63500m8695L1952J03393L3138n2995o9686L4430P5734p2473j03855k6221
$$ 763500 714805 746757 850150 883288 830293 760607 795037 870771 798298 694443 668222
12725F68222k0372k2162J04287K6580j2918L5001j28463m2198j2618J08052J03867
$$ 668222 647850 625688 729975 756555 743637 778638 650175 607977 595359 703411 807278
12714H07278o0079j04652p1350R3046J04120j12830K6054N1547J01243P3344j0561
$$ 807278 747199 642547 571197 664243 768363 655533 681587 733134 834377 907721 897160
12703H97160r5443j5028J03993N1712m1410p0299p0103L3937l1068J13572J31331
$$ 897160 801717 786689 890682 942394 900984 830685 760582 794519 763451 877023 1008354
12692A008354l8517q3272l2134K753L9808o1571j87672r3271J18564O2186N607
$$ 1008354 969837 886565 854431 857184 896992 835421 647749 554478 673042 735228 740835
12681G40835r4406j1488Q1023p5527q5379R2900l7826l941R8516J26382N2958
$$ 740835 646429 634941 715964 640437 555058 647958 610132 606191 704707 831089 884047
12670H84047O2033j7754k2571J11431J33376m9471m1218P488J700j13741m7218
$$ 884047 946080 928326 905755 1017186 1150562 1101091 1059873 1067361 1069061 955320 908102
12659I08102J90106J13017n710j59740J1503Q8508R9002m46l4397k134j232r857
$$ 908102 1098208 1211225 1205515 1045775 1057278 1145786 1244788 1244342 1209945 1207811 1206579 1196722
12647A196722P9488J6026O6170j52154j6016M3960N6664J77097J0040l2209L6446
$$ 1196722 1276210 1292236 1358406 1206252 1190236 1234196 1290860 1467957 1477997 1445788 1482234
12636A482234J448J11952q202q2332j15744o3749K2405Q6164R9092M0920N0895
$$ 1482234 1483682 1595634 1587432 1505100 1389356 1325607 1348012 1434176 1533268 1574188 1625083
12625A625083l847J9803k9557J06980J14355L5289J53881J38120N0078j9227O6200
$$ 1625083 1621236 1641039 1611482 1718462 1832817 1868106 2021987 2160107 2210185 2190958 2257158
12614B257158P7049l8678q6275o8157j20727j25825j31963q06L4223M4441l4343
$$ 2257158 2334207 2295529 2209254 2141097 2020370 1894545 1762582 1761776 1795999 1840440 1806097
12603A806097o4311j04079m1106J83635q70p3486K5780m4188r4341j9869M3700
$$ 1806097 1741786 1637707 1596601 1780236 1779366 1705880 1731660 1687472 1593131 1573262 1616962
12592A616962r0853r4798K7759n5815r6585l0258M6372P6804J10481j8398l9968
$$ 1616962 1526109 1431311 1459070 1403255 1306670 1276412 1322784 1399588 1510069 1491671 1451703
12581A451703N254R839N2886J5683k4699Q625M9588J2739k0876K7568l2137j3775
$$ 1451703 1456957 1466796 1519682 1535365 1510666 1519291 1568879 1581618 1560742 1588310 1556173 1542398
12569A542398r5262j01030k58052J3869Q9516K8481p9464l8940J26827J75304
$$ 1542398 1447136 1346106 1088054 1101923 1191439 1219920 1140456 1101516 1228343 1403647
12559A403647l0106k02933j58930O5192J5970L4926m9345p7356M1616M5734K8352
$$ 1403647 1373541 1170608 1011678 1076870 1092840 1127766 1078421 1001065 1042681 1088415 1116767
12548A116767j0946o1436p8723q5229M9779L0545r1394o3312J34812J15522K8687
$$ 1116767 1105821 1044385 965662 880433 930212 960757 869363 806051 940863 1056385 1085072
12537A085072k7224q9339j30675l4327n2419J57940L6438N3331K805p1618j13066
$$ 1085072 1057848 968509 837834 803507 751088 909028 945466 998797 1001602 929984 816918
12526H16918Q9034J44044j40732o9698k7711l3825m1554r3822n9043O4993O880
$$ 816918 905952 1049996 909264 839566 811855 778030 736476 642654 583611 648604 655484
12515F55484J2854L0537M0212j0705r4691Q6603O659j1559K2840Q9008K255n9830
$$ 655484 668338 698875 739087 728382 633691 720294 726953 715394 738234 827242 829497 769667
12503G69667n5442J78847k5359q1721L4192j6855L2078q486R3583l7138J6132
$$ 769667 714225 893072 867713 785992 820184 803329 835407 826921 920504 883366 899498
12492H99498j35334j01730P9907Q9061Q9437J43293r0343j79579K8181j8743Q0621
$$ 899498 764164 662434 742341 831402 920839 1064132 973789 794210 822391 803648 884269
12481H84269o5810l5988q599O3195N8083o0899p9780l3997L4255M3404j02873
$$ 884269 818459 782471 773872 837067 895150 834251 754471 720474 754729 798133 695260
12470F95260J16861K038n7559j6041L8993j9227K4624K00360J19955n6840j17392
$$ 695260 812121 814159 756600 740559 779552 760325 784949 985309 1105264 1048424 931032
12459I31032n9983R68K3172N3645P5159m4481j9928L9527J20287P4972j333Q15
$$ 931032 871049 872017 895189 948834 1023993 979512 959584 999111 1119398 1194370 1193037 1193852
12447A193852j74884q6182j0135m3440N3911r140J05231j31942k5569L3640R5234
$$ 1193852 1018968 932786 922651 879211 933122 923982 1029213 897271 871702 905342 1000576
12436A000576M0283q0831Q5805J910o1527L8308J43130N4289j43095n5818J4858
$$ 1000576 1040859 960028 1045833 1047743 986216 1024524 1167654 1221943 1078848 1023030 1037888
12425A037888n8257N4843n1845M0439R8431l1794P722l9772N2904p5389j00640
$$ 1037888 979631 1034474 982629 1023068 1121499 1089705 1097427 1057655 1110559 1035170 934530
12414I34530J1622J08208J00492J11387j63577j21440j6858P9272N9863k0093
$$ 934530 946152 1054360 1154852 1266239 1102662 981222 964364 1043636 1103499 1083406
12404A083406j8871n543p9907l4599L2080R7071Q8381R6719j35711l859j9797
$$ 1083406 1064535 1058992 979085 944486 976566 1073637 1162018 1258737 1123026 1119167 1099370
12393A099370m4850m0028m9017J452N2285K0847l7977m3350p6041O0563Q9290
$$ 1099370 1054520 1014492 965475 966927 1019212 1040059 1002082 958732 882691 943254 1032544
12382A032544m9714j31178K1846Q5484L6319q4813r9116m5998Q3816R4230M9975
$$ 1032544 982830 851652 873498 958982 995301 910488 811372 765374 849190 943420 993395
12371I93395N4165r0915j2129J47737L5511j1962o3114j7156m0577m6396K649
$$ 993395 1047560 956645 944516 1092253 1127764 1115802 1052688 1035532 994955 948559 951208
12360I51208J9886M5294p74N7737L5955m5984o4873p1476j8276L8924N0J22311
$$ 951208 971094 1016388 1015614 1073351 1109306 1063322 998449 926973 908697 947621 947671 1069982
12348A069982M9571j06389O6995K0137l0989J77279R7682m2363o9336l9170o680
$$ 1069982 1119553 1013164 1080159 1100296 1069307 1246586 1344268 1301905 1232569 1193399 1186719
12337A186719J7749O0635Q1600M3620K8546J11594N4479o8468j34767j9822P6682
$$ 1186719 1204468 1265103 1346703 1390323 1418869 1530463 1584942 1516474 1381707 1361885 1438567
12326A438567J08527Q9042M5325N8848P8910J52954R0363k5760M091P8449j04152
$$ 1438567 1547094 1636136 1681461 1740309 1819219 1972173 2062536 2036776 2040867 2119316 2015164
12315B015164j44054q7835J18208R6099J3795Q456j1945J1850J15543J17455J31228
$$ 2015164 1871110 1783275 1901483 1997582 2011377 2019833 2007888 2019738 2135281 2252736 2383964
12304B383964J0853o3453n4547j13370J53342J59705J32207J14509K03711O5814
$$ 2383964 2394817 2331364 2276817 2163447 2316789 2476494 2608701 2723210 2926921 2992735
12294B992735J15046R0959Q4790M6441M4493J7493R8178J76578K47097J20509
$$ 2992735 3107781 3198740 3283530 3329971 3374464 3391957 3490135 3666713 3913810 4034319
12284D034319j6564L8645J20861K5170J88670K94284L1156O1910R6001O7132L2706
$$ 4034319 4017755 4056400 4177261 4202431 4391101 4685385 4716541 4778451 4874452 4941584 4974290
12273D974290O9468R828m1905O3391n681J72464K83957J55170L5718M806Q1430
$$ 4974290 5043758 5053586 5011681 5075072 5069391 5241855 5525812 5680982 5716700 5721506 5802936
12262E802936k1528j5811J03391L29445J10076K0195n2235Q4472K71783L01949
$$ 5802936 5781408 5765597 5868988 6198433 6308509 6328704 6276469 6360941 6632724 6934673
12252F934673L60128J62255L39356L81843M62399M73850M05755L05230M97166
$$ 6934673 7294801 7457056 7796412 8178255 8640654 9114504 9520259 9825489 10322655
12243A0322655O04490Q02434P45163O62696P84147R04959Q66406R61182J002967
$$ 10322655 10927145 11729579 12474742 13137438 13921585 14826544 15692950 16654132 17657099
12234A7657099J115746R64310J012201J065313J259477J421976J479920J778637
$$ 17657099 18772845 19737155 20749356 21814669 23074146 24496122 25976042 27754679
12226B7754679J895683K153914K432202K839738L368117L926161M661640N613056
$$ 27754679 29650362 31804276 34236478 37076216 40444333 44370494 49032134 54645190
12218E4645190O280315O943763P450842P643512P395426O559494N169196L751417
$$ 54645190 60925505 67869268 75320110 82963622 90359048 96918542 102087738 105839155
12210A05839155K311360O53488m45991j391150j979250j933098j534804r57748
$$ 105839155 108150515 108804003 108358012 106966862 104987612 103054514 101519710 100561962
12202A00561962l11643L40389R02205J217426J519475J696904J975923K051492
$$ 100561962 100250319 100590708 101492913 102710339 104229814 105926718 107902641 109954133
12194A09954133K116023K102262K229363K297885K523863K708878K777392K709250
$$ 109954133 112070156 114172418 116401781 118699666 121223529 123932407 126709799 129419049
12186A29419049K600726K709411K763897K877102K951024L579347M509768N643082
$$ 129419049 132019775 134729186 137493083 140370185 143321209 146900556 151410324 157053406
12178A57053406P214766R317307J1917039J4659758J7420901J9631219K0722362
$$ 157053406 164268172 173585479 185502518 200162276 217583177 237214396 257936758
12171B57936758J9790916J6944260J2228029N875619p79624p180734j2322340
$$ 257936758 277727674 294671934 306899963 312775582 311995958 304815224 292492884
12164B92492884j5669467j6789273j6096363j4567567j2184671r901106p892674
$$ 292492884 276823417 260034144 243937781 229370214 217185543 207284437 199391763
12157A99391763o281432m903800m097627l773631l399647l227312l269770l161030
$$ 199391763 193110331 188206531 184108904 180335273 176935626 173708314 170438544 167277514
12149A67277514l173133l065857k997609k702736k579691k462926k391122k240239
$$ 167277514 164104381 161038524 158040915 155338179 152758488 150295562 147904440 145664201
12141A45664201k142541k044748j793876j527228j057222n53486j3357O78456
$$ 145664201 143521660 141476912 139683036 138155808 137098586 136545100 136531743 137210199
12133A37210199J576926K416972K842777L015205K940919K308770J181220m33091
$$ 137210199 138787125 141204097 144046874 147062079 150002998 152311768 153492988 153059897
12125A53059897k315410m096001n519728o680987p484780p552735p447875p011580
$$ 153059897 150744487 146648486 141128758 134447771 126962991 119410256 111962381 104950801
12117A04950801o401996n728089m940731m177637l802963l462887l084378k752508
$$ 104950801 98548805 92820716 87879985 83702348 79899385 76436498 73352120 70599612
12109G0599612k530895k406660k349059k182414k031127k036299j883008j808222
$$ 70599612 68068717 65662057 63312998 61130584 59099457 57063158 55180150 53371928
12101E3371928j870354j822714j744133j627408j517657j525963j453870j375056
$$ 53371928 51501574 49678860 47934727 46307319 44789662 43263699 41809829 40434773
12093D0434773j322074j306100j178525j090718j034561r33000j037984r53033
$$ 40434773 39112699 37806599 36628074 35537356 34502795 33569795 32531811 31578778
12085C1578778q14465p89213p66266p87550o34593p19827n19113n15380n98791
$$ 31578778 30764313 29975100 29208834 28421284 27786691 27066864 26547751 26032371 25433580
12076B5433580n13831m01918l57692m58437m46305l35193m18725l67136n15320
$$ 25433580 24919749 24517831 24160139 23701702 23255397 22920204 22501479 22134343 21619023
12067B1619023m78541m94512k82733l78324l66292l41710k80180k77859k78445
$$ 21619023 21140482 20645970 20363237 19984913 19618621 19276911 18996731 18718872 18440427
12058A8440427m29993l87564k52890k42568l25180l97594l13717j84759l10210
$$ 18440427 18010434 17622870 17369980 17127412 16802232 16404638 16090921 15906162 15595952
12049A5595952l06655l24478m55217l09542k43001l96799l22766k62773k92586
$$ 15595952 15289297 14964819 14509602 14200060 13957059 13560260 13237494 12974721 12682135
12040A2682135l81313l39155j79505k19000j24414j53889j73459k43289k16647
$$ 12682135 12300822 11961667 11782162 11563162 11438748 11284859 11111400 10868111 10651464
12031A0651464q0957j93645j85496j32433j77669j72733j25875j83925j84638
$$ 10651464 10570507 10376862 10191366 10058933 9881264 9708531 9582656 9398731 9214093
12022I214093j88368k16240j62292j11842p4691p2668Q147j66409j92187m1115
$$ 9214093 9025725 8809485 8647193 8535351 8460660 8387992 8396139 8229730 8037543 7996428
12012G996428j02507k10162j06795n825j41876j14471j11470j37311j65823j21623
$$ 7996428 7893921 7683759 7576964 7571139 7429263 7314792 7203322 7066011 6900188 6778565
12002F778565j61051m4424J8238q9202n7667o7034j13821n7873p2114j63330j85355
$$ 6778565 6617514 6573090 6591328 6502126 6444459 6377425 6263604 6205731 6133617 5970287 5784932
11991E784932p4102k29930j67359j17528K6402k5151j56010M982J64k0632j09523
$$ 5784932 5710830 5480900 5313541 5196013 5222415 5197264 5041254 5046236 5046400 5025768 4916245
11980D916245m0671k2782J36565l6228j35026p1234m6317l5847j38078K5279k7643
$$ 4916245 4875574 4852792 4989357 4953129 4818103 4746869 4700552 4664705 4526627 4551906 4524263
11969D524263k14355j42150l0746r079N8140P7644l262m4769q047n5437j82345
$$ 4524263 4309908 4167758 4137012 4127933 4186073 4263717 4260455 4215686 4207639 4152202 3969857
11958C969857l2093J68781N2188j26509j76797J0814L1525o7826n4217l3403p2247
$$ 3969857 3937764 4106545 4158733 4032224 3855427 3866241 3897766 3829940 3775723 3742320 3670073
11947C670073j50843q4789Q0504Q6341o0361r9310N5486n1514n8238K0053k5276
$$ 3670073 3519230 3434441 3514945 3601286 3540925 3441615 3497101 3445587 3387349 3407402 3382126
11936C382126j27943n287J02715K0688k25558q7638R4683K5160l2049j5487J7350
$$ 3382126 3254183 3248896 3351611 3372299 3146741 3059103 3153786 3178946 3146897 3131410 3148760
11925C148760J08364n1592j28231j5809j7368j66708L4737O9467P0309O6101P575
$$ 3148760 3257124 3205532 3077301 3061492 3044124 2877416 2912153 2981620 3051929 3118030 3125605
11914C125605J1391j9605j31557M5221N6228K8145l1556n6336r1830n4118j270
$$ 3125605 3136996 3117391 2985834 3031055 3087283 3115428 3083872 3027536 2935706 2881588 2880318
11903B880318m002m421P3167j24633j81638m1898J6878L7576l9343J1230O9852
$$ 2880318 2876316 2871895 2945062 2820429 2638791 2596893 2613771 2651347 2612004 2623234 2693086
11892B693086p5466m045o3224L433j09666p8991l01j0332K6919J3575m3127o2204
$$ 2693086 2617620 2613575 2550351 2553784 2444118 2365127 2364826 2354494 2381413 2394988 2351861 2289657
11880B289657l6924O7283l1839O014O8442P067o6884K142j5311k09398o5992L4953
$$ 2289657 2252733 2320016 2288177 2294191 2362633 2369700 2302816 2304958 2289647 2080249 2014257 2049210
11868B049210m6774J29346J63378N4459p7613k6044K211n4672k3972K8170P1237
$$ 2049210 2002436 2131782 2295160 2349619 2272006 2245962 2248173 2193501 2169529 2197699 2268936
11857B268936N9716k353n8583p1248j7402O8120k5928P7065M6743j35212j42592
$$ 2268936 2328652 2326299 2267716 2196468 2179066 2247186 2221258 2298323 2345066 2209854 2067262
11846B067262p5237j3151J09688L3824M3283q1755k1741r714M1004J6056k5907
$$ 2067262 1992025 1978874 2088562 2122386 2165669 2083914 2062173 2052459 2093463 2109519 2083612
11835B083612l0289q9100k3124l8971l0634J52370j532L4124J17102L7374n7214
$$ 2083612 2053323 1964223 1941099 1902128 1871494 2023864 2022332 2056456 2173558 2210932 2153718
11824B153718r1312j83479r1445j3780M0639O1892M0555K5843M1736j29153j44841
$$ 2153718 2062406 1878927 1787482 1773702 1814341 1876233 1916788 1942631 1984367 1855214 1710373
11813A710373L569J43337N0801M1352R078n4966n9247l5509O3196M3991L1072
$$ 1710373 1713942 1857279 1908080 1949432 1958510 1903544 1844297 1808788 1871984 1915975 1947047
11802A947047O3525j21623k8208p4393m4681J4919k808K7996L6597P0708K1391
$$ 1947047 2010572 1888949 1860741 1786348 1741667 1756586 1753778 1781774 1818371 1889079 1910470
11791A910470r9560j24778j6485m8536L0122N0500j28708k3059J28189N2339J22644
$$ 1910470 1810910 1686132 1669647 1621111 1651233 1701733 1573025 1549966 1678155 1730494 1853138
11780A853138J9786k92n9118j45276j04480R4275J33969J14819q1733L8299J0439
$$ 1853138 1872924 1872632 1813514 1668238 1563758 1658033 1792002 1906821 1825088 1863387 1873826
11769A873826m8035K8831J23709N8033K4056o3447o978L6851L0816o1863q1108
$$ 1873826 1825791 1854622 1978331 2036364 2060420 1996973 1989995 2026846 2057662 1995799 1914691
11758A914691O1470M0908l3834o1302O8885Q567K9512p1830J7500k9260n5277
$$ 1914691 1976161 2017069 1983235 1921933 1990818 1999385 2028897 1957067 1974567 1945307 1890030
11747A890030n4596J20188Q1840N4933J09781P4534o5487m0198l0764M8455O0272
$$ 1890030 1835434 1955622 2037462 2092395 2202176 2276710 2211223 2171025 2140261 2188716 2248988
11736B248988J2562o9556j3950M4371n9294k2871J10381P6510k6625M077M737
$$ 2248988 2261550 2191994 2178044 2222415 2163121 2140250 2250631 2327141 2300516 2304593 2309330
11725B309330N6244J14974J00638N8909J8439r2069o5308n7233N4511Q8488K15189
$$ 2309330 2365574 2480548 2581186 2640095 2658534 2566465 2501157 2443924 2498435 2586923 2802112
11714B802112J55456J2845j9411j75705p3296m1087K31514j0787k26959k8781
$$ 2802112 2957568 2970413 2951002 2775297 2702001 2660914 2892428 2881641 2654682 2625901
11704B625901L3309j10442j44427j15099J4037j52702O5858J27165O8908q5192
$$ 2625901 2659210 2548768 2404341 2289242 2303279 2150577 2216435 2343600 2412508 2327316
11694B327316j50522l4937P0004P5328j0296O9778N5539l5565L6840r0491j56418
$$ 2327316 2176794 2141857 2211861 2287189 2276893 2346671 2402210 2366645 2403485 2312994 2156576
11683B156576n3911J48915m697n9469q0690P6841o0028j33775Q2999J34942J3461
$$ 2156576 2102665 2251580 2246883 2187414 2106724 2183565 2123537 1989762 2072761 2207703 2221164
11672B221164r4824j03220q0283O3217N7430m3290j31533n5420L3192k7183j05293
$$ 2221164 2126340 2023120 1942837 2006054 2063484 2020194 1888661 1833241 1866433 1839250 1733957
11661A733957j33354J2003m1338l4233p1435J46901K6642Q5O7137k4594r0574
$$ 1733957 1600603 1612606 1571268 1537035 1465600 1612501 1639143 1639228 1706365 1681771 1591197
11650A591197p7892J4474J06853N5332N3151j7645k4253r5973r5108p9583N2103
$$ 1591197 1513305 1527779 1634632 1689964 1743115 1725470 1701217 1605244 1510136 1430553 1482656
11639A482656K6927L1086N9913n7355j08161q5017p2888N1447o3040N4190J50143
$$ 1482656 1509583 1540669 1600582 1543227 1435066 1350049 1277161 1328608 1265568 1319758 1469901
11628A469901p838M5333n8744k6227l2992k5990M0184J23696j4026j30023l011
$$ 1469901 1462063 1507396 1448652 1422425 1389433 1363443 1403627 1527323 1513297 1383274 1380263
11617A380263J5122o4360R0162J22645k9205r5897n2016m9393j39593l6569J32130
$$ 1380263 1395385 1331025 1421187 1543832 1514627 1418730 1366714 1317321 1177728 1141159 1273289
11606A273289O3993l6721l3923p9572P8506J22867R6834j410j54561K4161O3908
$$ 1273289 1337282 1300561 1266638 1187066 1265572 1388439 1485273 1483863 1329302 1353463 1417371
11595A417371Q3967p0782m5534M6979o5541j1557p0846l4069l1571j5436l9419
$$ 1417371 1501338 1430556 1385022 1432001 1366460 1354903 1284057 1249988 1218417 1202981 1163562
11584A163562J9744k423o4298L8620R132J8954J6844O4742K0976j25126J3051
$$ 1163562 1183306 1180883 1116585 1155205 1164337 1183291 1200135 1264877 1285853 1160727 1173778
11573A173778j1597p0748O9761J0355N0470J0779j32518J5824M8615P833k5643
$$ 1173778 1162181 1091433 1161194 1171549 1222019 1232798 1100280 1116104 1164719 1172552 1146909
11562A146909J00732J03912p0243j66302q7072k2000J7783o3871r1417J00157
$$ 1146909 1247641 1351553 1281310 1115008 1027936 1005936 1023719 959848 868431 968588
11552I68588J02103j9462l2095L8329Q2294l2963k1517L9116J03451K9518r8783
$$ 968588 1070691 1051229 1019134 1057463 1139757 1106794 1085277 1124393 1227844 1257362 1158579
11541A158579j7966p1365n1837r766j06666N9805Q6895J3634J237m8368J8334
$$ 1158579 1140613 1069248 1017411 1007645 900979 960784 1047679 1061313 1062550 1014182 1032516
11530A032516R2740J5140j03604o822J0943J03304N8806K8168j4302k0159j8272
$$ 1032516 1125256 1140396 1036792 1029970 1040913 1144217 1203023 1231191 1216889 1196730 1178458
11519A178458j63917m5983J47617M2982n7663j47485j04317O7891J71360M1470
$$ 1178458 1014541 968558 1116175 1159157 1101494 954009 849692 917583 1088943 1130413
11509A130413k3641l4648J04888K2652r6527k5086l2041j64515k688K23924J03657
$$ 1130413 1106772 1072124 1177012 1199664 1103137 1078051 1046010 881495 878807 1102731 1206388
11498A206388k4591j38607o7541K7056N1067J4405p8040J32805L2553o8518n7509
$$ 1206388 1181797 1043190 975649 1002705 1053772 1068177 990137 1122942 1155495 1086977 1029468
11487A029468j48330R288M1774l4906N1199L1034O7255L8994J8992p4444N8934
$$ 1029468 881138 890426 932200 897294 948493 979527 1046782 1085776 1104768 1030324 1089258
11476A089258L9118r8565o1519k0920k772M7713n0467p3483K8269J34778R5884
$$ 1089258 1128376 1029811 968292 947372 944600 992313 941846 868363 896632 1031410 1127294
11465A127294q8315o3585r4702k7387N9612L1175o0242n2340K7942L5185K5837
$$ 1127294 1038979 975394 880692 853305 912917 944092 883850 831510 859452 894637 920474
11454I20474l106j5489r1285j40428L6230L3441j32090M3787J30601P0611k4289
$$ 920474 917368 901879 810594 670166 706396 739837 607747 651534 782135 852746 828457
11443H28457m5097o8570J41201J22479J7527j08243N6391J2566o0261Q3807o3724
$$ 828457 783360 714790 855991 978470 995997 887754 944145 956711 896450 980257 916533
11432I16533q5898j2531O9522N82k328J9037M3398J0668R6784P062j26612p0735
$$ 916533 830635 818104 887626 888208 885880 904917 948315 958983 1055767 1062829 936217 865482
11420H65482q0699J75601N9664j05299M6586q6828k07516M6696Q5107q1729j14628
$$ 865482 784783 960384 1020048 914749 961335 874507 666991 713687 798794 717065 602437
11409F02437N4475J21953J07108N8124r8320l1727p9688Q3143J3990l5730P4033
$$ 602437 656912 778865 885973 944097 845777 814050 734362 817505 831495 795765 869798
11398H69798Q1746M7024n366K5350J0321j15701j43355L2713p302n9218L3987
$$ 869798 951544 998568 993202 1018552 1028873 913172 769817 802530 795228 736010 769997
11387G69997K0672r6023L7678J1586n7204J07823N6120l0611J3690j24388O9808
$$ 769997 790669 694646 732324 743910 686706 794529 850649 820038 833728 709340 779148
11376G79148N6814p6840N6376k0579j20432J3383K6752K3005L6556n8432p8480
$$ 779148 835962 759122 815498 794919 674487 687870 714622 737627 774183 715751 637271
11365F37271P3548P8713Q9452m1532J7593j04885j3346J26022p0157k6622P2126
$$ 637271 710819 789532 878984 837452 855045 750160 736814 862836 792679 766057 838183
11354H38183j15654k9302P7408P5755j13344m7269P2368J2505l5595j7142k628
$$ 838183 722529 693227 770635 846390 733046 685777 758145 770650 735055 717913 715285
11343G15285O470J29135K9120k02905j25657M9629J10187M60J11282J19781o8291
$$ 715285 721755 850890 880010 677105 551448 601077 711264 711724 823006 942787 874496
11332H74496j15350j50051K772N32J68299J18750j09893q5190J6256N7472J09181
$$ 874496 759146 609095 611867 612399 780698 899448 789555 704365 720621 778093 887274
11321H87274k8837n4076J01150p5837K0615r0620j78427M7879K6343l0569J02338
$$ 887274 858437 804361 905511 829674 850289 759669 581242 629121 655464 624895 727233
11310G27233R8882n5020r04m3174j9945J8600o9080l7156Q3164M3040j91391q4005
$$ 727233 826115 771095 770191 727017 707072 725672 656592 619436 702600 745640 554249 470244
11298D70244K314L5360J6533L15K6295P5967J72230K4307j18528p0296M7273O0547
$$ 470244 472558 507918 524451 524766 551061 627028 799258 823565 705037 634741 682014 742561
11286G42561Q1395L1688n8105j55811j1638Q6984J9809n4246k2352N4307K8624
$$ 742561 823956 855644 797539 641728 630090 717074 736883 682637 660285 714592 743216
11275G43216J09213M0663O455M1484j01425o1909R276j60507m4212O7663L596
$$ 743216 852429 893092 899547 941031 839606 777697 786973 626466 582254 649917 653513
11264F53513j9066l2255j4633N0274L7749R0900L9563l5824M4516j00087o1359
$$ 653513 634447 602192 587559 637833 675582 766482 806045 770221 814737 714650 653291
11253F53291q2177q4309P6164Q3909l4120r3703M5839R2624k465L621j88061o5778
$$ 653291 571114 486805 562969 646878 612758 519055 564894 657518 655053 658674 470613 404835
11241D04835Q5589j5374k8892J17609n6371l6637M766R1261Q4107P297j10414
$$ 404835 490424 475050 446158 563767 507396 470759 475525 566786 650893 658190 547776
11230E47776j4509m9749j09912J5785J2762Q543O7654R3309J44174L2464q6271
$$ 547776 533267 483518 373606 389391 402153 410696 478350 571659 715833 748297 662026
11219F62026L1733L1808j56123J4389O462m1116N0509O3907k04161m4589O6534
$$ 662026 693759 725567 569444 583833 590295 549179 599688 663595 459434 414845 481379
11208D81379m8132r2768J43677J76106l6521j78753M687P7168J62884J25037n8320
$$ 481379 433247 340479 484156 660262 623741 444988 449675 526843 689727 814764 756444
11197G56444o6445r3257n8138J4687R6507m6358q5543j25663R2933M1061M0373
$$ 756444 689999 596742 538604 553291 649798 603440 517897 392234 485167 526228 566601
11186E66601m7688J4318k2178n4371N2346J77829k9906j47384q3348J4541l3030
$$ 566601 518913 533231 511053 456682 509028 686857 656951 509567 426219 440760 407730
11175D07730p9087k1406k323L4779J65435N1075K0194r7275q4218R2127M2824
$$ 407730 328643 307237 304914 339693 505128 556203 576397 479122 394904 487031 529855
11164E29855L8475p3727p4348p7965J1386R3118Q9150M2144k9425j09742q3703
$$ 529855 568330 494603 420255 342290 353676 446794 535944 578088 548663 438921 355218
11153C55218J9606o635m7555o0745K1911J36427J08796Q9011n385p4136j61078
$$ 355218 374824 368189 320634 259889 281800 418227 527023 616034 610649 536513 375435
11142C75435r072R3921P0374m0152n8427p5516J76877K3162j460j0486Q95q9706
$$ 375435 366363 460284 530658 490506 432079 356563 533440 556602 555142 544656 545551 455845
11130D55845N5634J80296J25156j21723k9839k6893r0910J47810K4268j17700
$$ 455845 511479 691775 816931 695208 665369 638476 547566 695376 719644 601944
11120F01944j32686m5817K0183M3022l3246k7394o8226o3565n4521Q1423k975
$$ 601944 469258 423441 443624 486646 453400 426006 357780 294215 239694 321117 318142
11109C18142m6645q5047N4783M7347J01985m477P498R0449n36o953J06577m5420
$$ 318142 271497 186450 241233 288580 390565 386088 393586 484035 483499 476546 583123 537703
11097E37703j69131M1855K9633M8188N0523J1749j68972j24355J06J45873K03855
$$ 537703 368572 410427 440060 488248 538771 550520 381548 257193 257299 403172 607027
11086F07027k1413n5333q4585K3178o0158j11534O0631R1389O266n4874o6220
$$ 607027 585614 530281 445696 468874 408716 297182 357813 449202 455468 400594 334374
11075C34374J36N2024m9808q9870K3374J32003j33531m7404N3142j18033m644
$$ 334374 334510 386534 336726 246856 270230 402233 268702 221298 274440 156407 151763
11064A51763K2304J31848l3699j71694R7747J9333j55180q38Q3074J46365J62775
$$ 151763 174067 305915 272216 100522 198269 217602 62422 61584 144658 291023 453798
11053D53798q2514J49548N2797j30320o1994n2861J54463M9100J03651N7140K1790
$$ 453798 371284 520832 573629 443309 381315 328454 482917 532017 635668 692808 714598
11042G14598j0136j28544j53036l8841K4231J69559J52071J70226J26385p6327
$$ 714598 704462 575918 422882 384041 408272 577831 729902 900128 1026513 950186
11032I50186j26592P2041m8435q0174j26876J0948J57235J69230K34328Q1202
$$ 950186 823594 895635 847200 767026 640150 651098 808333 977563 1211891 1293093
11022A293093n2854r4638n689Q1650k777k12547J8787r0151j86019N2924J74878
$$ 1293093 1240239 1145601 1139912 1221562 1218785 1006238 1025025 934874 748855 801779 976657
11011I76657O4354L3996q1150q84J7978j91100j36041K80K9351O6844P7527r4617
$$ 976657 1041011 1075007 993857 992973 1010951 819851 683810 684090 713441 780285 857812 763195
10999G63195j15322o4379q8543o2085K5354O2643o7976n4052R3488k6022O9443
$$ 763195 647873 583494 494951 432866 458220 520863 452887 398835 492323 466301 535744
10988E35744l1175m3380J23715p2895R6060k2587j09572j7879n8487r6086L0909
$$ 535744 504569 461189 584904 512009 608069 585482 475910 458031 399544 303458 334367
10977C34367J4270m2785K0920m9j43345q0788M4955n125m4601R9044L9545M8841
$$ 334367 348637 305852 326772 326723 183378 102590 147545 142420 97819 196863 236408 285249
10965B85249L5117p14K2842m2622j25053m3158n358O0631N0891Q5320q5535r4781
$$ 285249 320366 319652 342494 299872 174819 131661 126303 186934 237825 323145 237610 142829
10953A42829p648L2841r3358l4293J46149Q5954O2595j1100p4212N7655r0944
$$ 142829 135181 168022 74664 40371 186520 272474 335069 323969 249757 307412 216468
10942B16468N4629M3870q4592j39373R641M4485k8518L9446J68868P8105o970
$$ 216468 271097 314967 230375 91002 100643 145128 116610 156056 324924 403029 396059
10931C96059O060M5228j11004m4493p299Q9684n2814n7845k5264L1613p6937K4694
$$ 396059 402119 447347 336343 291850 284551 374235 321421 263576 238312 269925 192988 217682
10919B17682M8917m6382l9064o5070l7478j10343J21094J16286Q7327j0219n6663
$$ 217682 266599 220217 181153 116083 78605 -31738 89356 205642 292969 282750 226087
10908B26087n309j30574m7833l6538k2837J0808J22874l8276k1112P2697L2469
$$ 226087 220778 90204 42371 5833 -17004 -6196 116678 78402 57290 129987 162456
10897A62456o6474j95918O5160M418k807j5978p9551n0553R9350P0405L847j02894
$$ 162456 95982 -99936 -34776 -30358 -33165 -49143 -128694 -179247 -79897 -9492 -5645 -108539
10885a08539j7172K637J93669J80314L9568r9313k4995q4053j01881O8021J24432
$$ -108539 -125711 -123074 70595 250909 290477 191164 166169 82116 -19765 48256 172688
10874A72688K2070r4187q577Q4972l4923l5394q427N4533m9067r196L636k4923
$$ 172688 194758 100571 91994 176966 142043 106649 98222 152755 103688 94492 98128 73205
10862G3205J14217J30118n435J0766k6028r2432j09706N9573L2888K6521L4848
$$ 73205 187422 317540 312105 322871 296843 204411 94705 154278 187166 213687 248535
10851B48535l1117r3855L6175m5390n2302L5435m4449k438m570k7199j7122P2340
$$ 248535 217418 123563 159738 114348 62046 97481 53032 50594 46024 18825 1703 74043
10839G4043m4870p7216j20254M8556J60597L8618N5251P9346L2550m1716j15346
$$ 74043 29173 -48043 -168297 -119741 40856 79474 134725 214071 246621 204905 89559
10828H9559L5765J14911Q9773M7481l5117n1795j848j25949l3037l7047m8052
$$ 89559 125324 240235 330008 377489 342372 290577 288729 162780 129743 92696 44644
10817D4644p7729m9636j1656n5061o5451O7608N2216M5070m1016m4527k1555O9780
$$ 44644 -33085 -82721 -94377 -149438 -214889 -147281 -95065 -49995 -91011 -135538 -157093 -87313
10805h7313R1423n9090K30m3658r3640k9822K3250R150n3767N2615L4216K0891
$$ -87313 4110 -54980 -54750 -98408 -192048 -221870 -198620 -189470 -243237 -190622 -156406 -135515
10793a35515N4933K4342l104k0527o4460J8542M1186n5813M1445j10596n3253
$$ -135515 -80582 -56240 -59344 -79871 -144331 -125789 -84603 -140416 -98971 -209567 -262820
10782b62820N9591J2444r938N2105p7511M3936o5917j30848O3450J41013Q5967
$$ -262820 -203229 -190785 -200723 -148618 -226129 -182193 -248110 -378958 -315508 -174495 -88528
10771h8528R5625L3391r2185j43394p5088L9834j385k7881m7521m597M0358j6592
$$ -88528 7097 40488 -51697 -195091 -270179 -230345 -231730 -259611 -307132 -311729 -271371 -287963
10759b87963K9352p5731O6922Q8397j351k3092l6372M9445N9034q4194j53341
$$ -287963 -258611 -334342 -267420 -179023 -180374 -203466 -239838 -190393 -131359 -215553 -368894
10748c68894j4571Q3756K7346N8353O2181j4852m3888n2782K6428J14481L5427
$$ -368894 -383465 -299709 -272363 -214010 -151829 -166681 -210569 -263351 -236923 -122442 -87015
10737h7015l8120J3689o4228o5335L9080J8520N839l8814n0698Q1789N8403Q5160
$$ -87015 -125135 -111446 -175674 -241009 -201929 -183409 -177570 -216384 -267082 -185293 -126890 -41730
10725d1730M3723J6913j25606m6323M7368m6685J11815M100n5594p8874k1699
$$ -41730 1993 18906 -106700 -153023 -105655 -152340 -40525 -36425 -92019 -170893 -192592
10714a92592M7508J63667o1070j34744j38496R9068J35982J95492R9299n4399
$$ -192592 -145084 18583 -42487 -177231 -315727 -216659 -80677 114815 214114 159715
10704A59715o6341p2904p5286q6594m3933j2204L2071q5995P7681J23922p0181
$$ 159715 93374 20470 -54816 -141410 -185343 -197547 -165476 -251471 -173790 -49868 -120049
10693a20049o2542j30738N4792Q1959Q7028p4415J748r3550J20148K9337o3068
$$ -120049 -182591 -313329 -258537 -176578 -89550 -163965 -162217 -255767 -135619 -106282 -169350
10682a69350j55816j05369j58420N3964J72487R8307N7500l4187r3512K4477k0588
$$ -169350 -325166 -430535 -588955 -534991 -362504 -264197 -206697 -240884 -334396 -309919 -330507
10671c30507q0909k1664j50175o4333k777O4114J08956O0521r230Q2126J63328
$$ -330507 -411416 -433080 -583255 -647588 -650365 -586251 -477295 -416774 -426004 -343878 -180550
10660a80550K401Q9411K217P2262M01015J73843R5304J06528J18342L1318k50893
$$ -180550 -178149 -88738 -86521 -14259 386756 560599 655903 762431 880773 912091 661198
10649F61198q8446j37023q8550m2399j50593k39487l6370J29743N9380o7344J35795
$$ 661198 572752 435729 347179 304780 154187 -85300 -121670 8073 67453 109 135904
10638A35904J09151J99662K70663J64549L08253K98997L26414K55153K15248K89527
$$ 135904 245055 444717 715380 879929 1188182 1487179 1813593 2068746 2283994 2573521
10628B573521K50916L60090O27144Q34292J167417J579986K229492K885163L815803
$$ 2573521 2824437 3184527 3811671 4645963 5813380 7393366 9622858 12508021 16323824
10619A6323824N061733N855221N781356N126390M582199L867755K723528J466154
$$ 16323824 21385557 27240778 33022134 38148524 42730723 46598478 49322006 50788160
10611E0788160M82834P23895K352186N164863Q518915J0594376J0358383Q489424
$$ 50788160 51270994 51994889 54347075 59511938 68030853 78625229 88983612 97473036
10603I7473036O855834N227414K562446j161333l978684l665627l70974M700512
$$ 97473036 104328870 109556284 112118730 110957397 106978713 103313086 102942112 107642624
10595A07642624R671746J2627350J1744660Q663695N836053L034163j556564p430886
$$ 107642624 117314370 129941720 141686380 150350075 156186128 159220291 157663727 150232841
10587A50232841j1608164j1755546q083411k748912J857764M219840L970067K104634
$$ 150232841 138624677 126869131 118785720 116036808 117894572 122114412 126084479 128189113
10579A28189113L28842j576233m738347q487604j0872358j0437617p868467m789169
$$ 128189113 128517955 126941722 122203375 113715771 102843413 92405796 84537329 79748160
10571G9748160k087577p65018o40838j241210j991669k844542m154867n639304
$$ 79748160 77660583 76895565 76254727 75013517 73021848 70177306 66022439 60383135
10563F0383135o556096o437513n453602m337494l383215k694017k042345j765352
$$ 60383135 53827039 47389526 41935924 37598430 34215215 31521198 29478853 27713501
10555B7713501j569475j180741j274734j167073j024406q84048p46402q13783
$$ 27713501 26144026 24963285 23688551 22521478 21497072 20613024 19866622 19052839
10547A9052839p82722o41302o42287n70079n12604n37955n62005n48543n33330
$$ 19052839 18270117 17628815 16986528 16416449 15903845 15365890 14803885 14255342 13722012
10538A3722012l48188l52122l06989l15566k85616l64258k68943k50683j58144
$$ 13722012 13373824 13021702 12714713 12399147 12113531 11749273 11480330 11229647 11071503
10529A1071503k88198k82418k53952k51654k38640l67473k92710k94850k36877
$$ 11071503 10783305 10500887 10246935 9995281 9756641 9389168 9096458 8801608 8564731
10520H564731k15779k72230k27920r7208j51090j77325j63241j35084k09016k77743
$$ 8564731 8348952 8076722 7848802 7751594 7600504 7423179 7259938 7124854 6915838 6638095
10510F638095l54317j73511m4188L7973o0863p5542j27656j23206l23006k21816
$$ 6638095 6283778 6110267 6066079 6104052 6043189 5967647 5839991 5716785 5393779 5171963
10500E171963k9512q0351l8057j07302j72683p5804j59416k06797q1623P2111
$$ 5171963 5142451 5062100 5024043 4916741 4744058 4668254 4508838 4302041 4220418 4292529
10490D292529j5341j44498j74048j87561m1201K0788q7337j31480j61225j48416
$$ 4292529 4277188 4132690 3958642 3771081 3729880 3750668 3663331 3531851 3370626 3222210
10480C222210m2346r327l1523j30522K6473m1510j30159j41496o3040q6411o1272
$$ 3222210 3179864 3170537 3139014 3008492 3034965 2993455 2863296 2721800 2658760 2572349 2511077
10469B511077n4905P47n5112k3165j3072K8317Q9032r4995q1719m6267k9358J4251
$$ 2511077 2456172 2456919 2401807 2378642 2365570 2393887 2482919 2387924 2306205 2259938 2230580 2244831
10457B244831j8572k4143m5065j11051r9215N0088j8592J7146m0485r6643n7263
$$ 2244831 2226259 2202116 2157051 2046000 1946785 1996873 1978281 1995427 1954942 1858299 1801036
10446A801036j11872n5868K7760L3062J8186p8396N4287L9277m1482p3990j36460
$$ 1801036 1689164 1633296 1661056 1694118 1712304 1633908 1688195 1727472 1685990 1612000 1475540
10435A475540p7425m2852n2877N9870M5992n1739o265m0703j92760P2879P3740
$$ 1475540 1398115 1355263 1302386 1362256 1408248 1356509 1350244 1309541 1116781 1189660 1263400
10424A263400r7772p7977J9828J735J90646q3637r2551j084K8447j9266n5834
$$ 1263400 1165628 1087651 1107479 1109214 1299860 1216223 1123672 1122588 1151035 1131769 1075935
10413A075935n8986O5305J00421m8848k3315r521o0656o4535n4304o0737p989
$$ 1075935 1016949 1082254 1182675 1133827 1110512 1100991 1040335 975800 921496 860759 852770
10402H52770K9028n7843O4588J381o6325Q93o4274Q7091J2580j07499n3777J4340
$$ 852770 881798 823955 888543 889924 823599 824492 760218 847309 859889 752390 698613 712953
10390G12953m8935J0411K9135o778J17355j10320n5162o0509l0037R3540k7177
$$ 712953 664018 674429 703564 696786 814141 703821 648659 588150 558113 651653 624476
10379F24476p9824Q2870O2173K3167o527r1971j04654J8434p2373m5335N6572
$$ 624476 544652 627522 689695 712862 706335 614364 509710 528144 455771 410436 467008
10368D67008J36640J49357k081n1659m5912o0801L8724n8299j26211N5801O491
$$ 467008 603648 753005 750924 699265 653353 592552 631276 572977 446766 502567 509058
10357E09058q1731j08592M6392J19755O2195O2052P5879r1985j00702p9044j13745
$$ 509058 427327 318735 365127 484882 547077 609129 685008 593023 492321 413277 299532
10346B99532k8424P0408q095P3949N0721O5401k9723N9414K9963M4407q5837j22783
$$ 299532 271108 341516 333421 407370 458091 523492 493769 553183 583146 627553 541716 418933
10334D18933j2304J8520l2775p7464L2782j7489l4922p4506q5367J837J95688
$$ 418933 406629 425149 392374 314910 347692 330203 295281 220775 135408 137245 332933
10323C32933J30547r685n0962l3929n6784q8854j1311R8177P4947o479Q3264N4441
$$ 332933 463480 453795 402833 368904 312120 223266 211955 310132 385079 378600 461864 516305
10311E16305n4163l755j48288j52353M3574L848M9758j41424p9735N1643O2828
$$ 516305 462142 458387 310099 157746 201320 205168 254926 113502 33767 85410 148238
10300A48238J336q795J1398M0805p5329K0989J20712j4366L1631R2636o7430p9813
$$ 148238 149574 140779 152177 192982 117653 138642 259354 244988 276619 369255 301825 222012
10288B22012l9750k2869l0441J21318J12511J0597M9375L227Q307k2489o0096
$$ 222012 182262 159393 128952 250270 362781 373378 422753 425980 434287 411798 351702
10277C51702m3597l4974n0626L4656j6394L886N0294M3177J4244o6757k1369m2259
$$ 351702 308105 273131 222505 257161 240767 244653 294947 338124 352368 285611 264242 221983
10265B21983j4589J9581P6674J3576l6912K0713L2459m1729j8415P4864P377n0528
$$ 221983 207394 226975 303649 317225 280313 301026 333485 291756 273341 348205 355582 305054
10253C05054j10456P1046P1407J2658m4268K9298J43446m6196j14298J4750J3070
$$ 305054 194598 265644 337051 349709 305441 334739 478185 431989 317691 332441 345511
10242C45511P5081L1943N1675J46580Q7705l5355o2362J26254J29658N730p6055
$$ 345511 420592 452535 504210 650790 738495 703140 640778 767032 896690 902420 826365
10231H26365P5608q2083q7631m7340O4593q3816q0520p4543j0605J26788N6837
$$ 826365 901973 819890 732259 684919 749512 665696 585176 510633 500028 626816 683653
10220F83653m8534j25756j08111J1376J9881L1180p4370j23228q9299Q8549m5643
$$ 683653 635119 509363 401252 412628 432509 463689 389319 266091 176792 265341 219698
10209B19698J0722p5793P0484R851o4089k7057P1186P1994N1373l229P1203O7265
$$ 219698 230420 154627 225111 234962 170873 143816 215002 286996 338369 335140 406343 473608
10197D73608j3615Q5888R3864J68742J17177J58186l4587n0956m7120O3290l0416
$$ 473608 459993 545881 639745 808487 925664 1083850 1049263 998307 951187 1014477 984061
10186I84061M5005J09355l9609n9503j4055k4874j7420n7699l1612n7754M358
$$ 984061 1029066 1138421 1098812 1039309 1025254 1000380 982960 925261 893649 835895 840253
10175H40253O0713n3165j6578r3091p3524j209J39592L3486j18478j3361R5437
$$ 840253 900966 847801 831223 738132 664608 663399 802991 836477 717999 704638 800075
10164H00075J47521o9904j07688j44302k3099J26551J29617J63005l8841m4410
$$ 800075 947596 877692 770004 625702 602603 729154 858771 1021776 982935 938525
10154I38525J15911J66895J67578J7021J2680m3456J30427O4569j67905j5719
$$ 938525 1054436 1221331 1388909 1405930 1418610 1375154 1505581 1570150 1402245 1386526
10144A386526K00945K9393l9784j69510j11438j07038j18619L2644n8310j24358
$$ 1386526 1587471 1616864 1577080 1407570 1296132 1189094 1070475 1103119 1044809 920451
10134I20451q5903r0341n1330J5941l0224o0281P7784J2168l2611j41662j38903
$$ 920451 834548 744207 692877 708818 678594 618313 696097 708265 675654 533992 395089
10123C95089P9886j04060j22633o3330L8539K1647J03478r3371p9448O6714R5328
$$ 395089 474975 370915 248282 184952 223491 245138 348616 255245 175797 242511 337839
10112C37839P5231j10194r1329o1522l0507L55o113k0512j7001N4923N8820O753
$$ 337839 413070 302876 211547 150025 119518 119873 113760 93248 76247 131170 189990 196743
10100A96743j1128O5106j30115q7921J9678n813l0486p9484n2040o9418Q645P8371
$$ 196743 185615 250721 120606 32685 52363 46550 16064 -63420 -115460 -184878 -176233 -97862
10088i7862O1626j10633k4291K5006K359J00033r185o5996k0398l7980R4938K0249
$$ -97862 -36236 -146869 -171160 -146154 -143795 -43762 -52947 -118943 -139341 -177321 -82383 -62134
10076f2134j86511r7899L5939J58228K7078j122l9237j73095j08991l10N5404
$$ -62134 -248645 -346544 -310605 -152377 -125299 -126421 -165658 -338753 -447744 -448054 -392650
10065c92650J73695O3341r6401k1762n657l7906L6607k0329k9351M8255R6012
$$ -392650 -218955 -155614 -252015 -273777 -279434 -317340 -280733 -301062 -330413 -282158 -186146
10054a86146j5753k4247j10971K2865O9745N3205k7789l6273j19577m6367j5562
$$ -186146 -201899 -226146 -337117 -314252 -244507 -191302 -219091 -255364 -374941 -421308 -436870
10043d36870J09719K5365j26277l6177J41935L6469L0829J8402M5143L3946J28545
$$ -436870 -327151 -301786 -428063 -464240 -322305 -285836 -255007 -236605 -191462 -157516 -28971
10032b8971n4129k06699j28802r7322Q2043n551r0637J20041P4414O3279M8907
$$ -28971 -83100 -289799 -418601 -515923 -433880 -439431 -530068 -410027 -335613 -272334 -223427
10021b23427j05854Q443O7866N3893j8690p902p4672j03847j05694J37574L4418
$$ -223427 -329281 -320838 -252972 -199079 -217769 -225671 -300343 -404190 -509884 -372310 -337892
10010c37892R306j3478J1008L014q4634J030o0181o2521K0788J84081J47134M679
$$ -337892 -328586 -342064 -331056 -328042 -412676 -411646 -471827 -534348 -513560 -329479 -182345 -177666
9998a77666k6109j49352p3398L367l065J5438l0771p5832m9264l879j1654j05692
$$ -177666 -203775 -353127 -426525 -423158 -426223 -410785 -441556 -517388 -566652 -570531 -582185 -687877
9986f87877j3977Q9369J72330L5576q0614J02341j06915j17081L9360n5797l751
$$ -687877 -701854 -612485 -440155 -404579 -485193 -382852 -489767 -606848 -567488 -623285 -627036
9975f27036P231J7696P8117q6469n3256k7962q80K6361j22939j83m0611r645N1801
$$ -627036 -619805 -602109 -523992 -610461 -663717 -691679 -692559 -666198 -789137 -789320 -829931 -839576 -787775
9962g87775K4147j01074o0192N5495Q9945M4070O4671o6368j28567M9946J11522
$$ -787775 -763628 -864702 -924894 -869399 -779454 -735384 -670713 -737081 -865648 -815702 -704180
9951g04180l2068J0740R999p6623j36699O4561N3379j03804Q7541R5598M2693
$$ -704180 -736248 -725508 -715509 -792132 -928831 -864270 -810891 -914695 -827154 -731556 -688863
9940f88863J48637J19470j309L312o8318o2732q4116j8583Q8753l5265J6947L2630
$$ -688863 -540226 -420756 -422065 -418753 -487071 -549803 -633919 -652502 -563749 -599014 -582067 -549437
9928e49437o2443n4730O3146n865m5080J33745J19927J1290J37161K9584N8585
$$ -549437 -611880 -666610 -603464 -609329 -654409 -520664 -400737 -389447 -252286 -222702 -164117
9917a64117j8199n9307q0748p7464l1648n3918k6950Q9739R7062J31363J23953
$$ -164117 -182316 -241623 -322371 -399835 -431483 -485401 -512351 -422612 -325550 -194187 -70234
9906g0234o3002j12297j9388M5954J07418K63545K08552J01113J6260L2794l3150
$$ -70234 -133236 -245533 -264921 -218967 -111549 151996 360548 461661 477921 510715 477565
9895D77565R8069K03418J42072R1075J24711J56732J52564J43426J07593L59128
$$ 477565 575634 779052 921124 1012199 1136910 1293642 1446206 1589632 1697225 2056353
9885B056353K13917J15501K32127K65746J14693J66791J20453K0654M7124J17657
$$ 2056353 2270270 2385771 2617898 2883644 2998337 3165128 3285581 3306235 3353359 3471016
9875C471016J21906J48976J38213R6897m3746L9926M3605R7145J20683J06537
$$ 3471016 3592922 3741898 3880111 3977008 3933262 3973188 4016793 4113938 4234621 4341158
9865D341158K03431O5737J32302K15257K83944N52359N89360N11659M40058N45960
$$ 4341158 4544589 4610326 4742628 4957885 5241829 5794188 6383548 6895207 7335265 7881225
9855G881225N32401O34660N13194M24941L09507J90256j0907o3487o1321j26721
$$ 7881225 8413626 9048286 9561480 9986421 10295928 10486184 10475277 10411790 10350469 10223748
9845A0223748j26126r4791q8270p7541j05913K9775J01425J68452K12465M30816
$$ 10223748 10097622 10002831 9914561 9837020 9731107 9760882 9862307 10030759 10243224 10674040
9835A0674040O21163O34957O63278Q95064J158179J210524J350399J704424K106136
$$ 10674040 11295203 11930160 12593438 13488502 14646681 15857205 17207604 18912028 21018164
9826B1018164K436599K928048L306602M086749N198435O162021P079377Q152403
$$ 21018164 23454763 26382811 29689413 33776162 38974597 45136618 52215995 60368398
9818F0368398R189741R722019R619326Q727435P104295M917358K676602K30333
$$ 60368398 69558139 79280158 88899484 97626919 104731214 109648572 112325174 112555507
9810A12555507j792371l131754l859758l834758l186843k287974j143321L1714
$$ 112555507 110763136 107631382 103771624 99936866 96750023 94462049 93318728 93350442
9802I3350442J260868K508594L598691M532150N060089N575692N772203N610976
$$ 93350442 94611310 97119904 100718595 105250745 110310834 115886526 121658729 127269705
9794A27269705N376471M716906M127538L526814K741775K004680J277254P15346
$$ 127269705 132646176 137363082 141490620 145017434 147759209 149763889 151041143 151756489
9786A51756489L12796Q6054L94881Q73400K117301L738352O022915Q857425J2480963
$$ 151756489 152069285 152155339 152550220 153423620 155540921 159279273 165302188 174159613 186640576
9777A86640576J6567964K0609241K3990036K5371085K3865273J9279509J2607243
$$ 186640576 203208540 223817781 247807817 273178902 297044175 316323684 328930927
9770C28930927M651689l818049j2129740j8314629k1064313k0751612j8707791
$$ 328930927 333582616 329764567 317634827 299320198 278255885 257504273 238796482
9763B38796482j5746484j2412140r379162o571590m416832k700217j268217m70481
$$ 238796482 223049998 210637858 201258696 194687106 190270274 187570057 186301840 185831359
9755A85831359n7259K02788J67570k63591r76164j615789k304081l217829m138994
$$ 185831359 185774100 185976888 186144458 185880867 184904703 183288914 180984833 177767004 173628010
9746A73628010m903503n439598n916901n992848n766609n358379m595712l546778
$$ 173628010 168724507 163284909 157368008 151375160 145608551 140250172 135654460 132107682
9738A32107682k477466j296807m899J238121K289706L189521L865835L983485
$$ 132107682 129630216 128333409 128328510 129566631 131856337 135045858 138911693 142895178
9730A42895178L305417K115550L60540j841345m197943o165712p543399q474688
$$ 142895178 146200595 148316145 148676685 146835340 142637397 136471685 128928286 120453598
9722A20453598q730378q365870p577354o810410n879621n106064m555244l944771
$$ 120453598 111723220 103357350 95779996 88969586 83089965 77983901 73428657 69483886
9714F9483886l492581l047222k739747k465247k313526k005888j831706j754787
$$ 69483886 65991305 62944083 60204336 57739089 55425563 53419675 51587969 49833182
9706D9833182j550084j527475j329849j164370j119742j043039q87723q67263
$$ 49833182 48283098 46755623 45425774 44261404 43141662 42098623 41210900 40343637
9698D0343637q28043o54838p00970p38680n31621m82795m00849n86078o52539
$$ 40343637 39515594 38860756 38159786 37421106 36889485 36406690 36005841 35419763 34767224
9689C4767224p40945o29761p43272r78454r88185r21021r06688r03618q36046
$$ 34767224 34026279 33396518 32653246 31674792 30686607 29765586 28858898 27955280 27119234
9680B7119234p28670q11509o66361o01289n12773m81757n00409n56017m20896
$$ 27119234 26390564 25579055 24912694 24311405 23798632 23316875 22816466 22260449 21839553
9671B1839553m79255k95176m09404m71241l80332l37374j99664l37314m07882
$$ 21839553 21360298 21065122 20655718 20184477 19804145 19466771 19267107 18929793 18521911
9662A8521911l59620m35171m08774l72124l45077k98311l23232k61164l14388
$$ 18521911 18162291 17727120 17318346 16946222 16601145 16302834 15979602 15718438 15404050
9653A5404050m32449l09885m07267k66508k41058m11176m20827l08910k72051
$$ 15404050 14971601 14661716 14254449 13987941 13746883 13335707 12914880 12605970 12333919
9644A2333919k40280j74395j54949l14241m15007l14778k96447k37248j56330
$$ 12333919 12093639 11919244 11764295 11450054 11035047 10720269 10423822 10186574 10030244
9635A0030244j84236k71065l03348j26866j45585j69343n2942j41203k19399j93178
$$ 10030244 9846008 9574943 9271595 9144729 8999144 8829801 8776859 8635656 8416257 8223079
9625H223079j26209j77684j07442l7284j08972j85542j74285q5251j73102j42485
$$ 8223079 8096870 7919186 7811744 7774460 7665488 7479946 7305661 7220410 7047308 6904823
9615F904823k04897m2212j57710j79360k19156j31787m5047j37089r9217Q1019
$$ 6904823 6699926 6657714 6500004 6320644 6101488 5969701 5924654 5787565 5688348 5769367
9605E769367N1723o3053O3822p3908l8859j74071j07866k51162j47695o612L8671
$$ 5769367 5821090 5758037 5821859 5747951 5709092 5535021 5427155 5175993 5028298 5021686 5060357
9594E060357r969k09137j01402O8139r5693j01368l0891o3787j64143n3132J046
$$ 5060357 5050388 4841251 4739849 4807988 4712295 4610927 4580036 4516249 4352106 4298974 4300020
9583D300020L4565K7096J8471l2746k18738o1799j75327j24252P9614p0559j10294
$$ 4300020 4334585 4361681 4380152 4347406 4128668 4066869 3891542 3767290 3846904 3776345 3666051
9572C666051j80875L298k6017n414J1084r54j15340r3953j02285R868L7027j13956
$$ 3666051 3485176 3488474 3462457 3457043 3468127 3467173 3351833 3257880 3155595 3165463 3202490 3088534
9560C088534K558J37427M8151m3445o7250j96061j6396P9250p5532k07284m3513
$$ 3088534 3091092 3228519 3276670 3233225 3165975 2969914 2953518 3032768 2957236 2749952 2706439
9549B706439P0036J26157O6234q4445n6854J12342M908l2143L1234o3031j71009
$$ 2706439 2776475 2902632 2968866 2884421 2827567 2939909 2944817 2912674 2943908 2880877 2709868
9538B709868q6925O1229k6712p2902j06294p590J6053k7445L324P6758o8643r7467
$$ 2709868 2622943 2684172 2657460 2584558 2478264 2470674 2486727 2459282 2462606 2539364 2470721 2373254
9526B373254O2343K9614o4662k8128k5349j08646r2594L0471J40591j1587j8415
$$ 2373254 2435597 2465211 2400549 2372421 2347072 2238426 2145832 2176303 2316894 2305307 2286892
9515B286892M3285P3318j7720j05105R782m1823j0074o493n4136r3892J96346
$$ 2286892 2330177 2403495 2385775 2280670 2290452 2248629 2238555 2232062 2177926 2084034 2280380
9504B280380O4098m6629n4385r5771K1181K6931R340j22639k46931j30622M057
$$ 2280380 2344478 2297849 2243464 2147693 2168874 2195805 2205145 2082506 1835575 1704953 1709010
9493A709010J44288Q6667L2137n3462j3781k6542q6726m7237O970k4574P472R2113
$$ 1709010 1853298 1939965 1972102 1918640 1904859 1878317 1791591 1744354 1751324 1726750 1734222 1826335
9481A826335n9838j23485q8456p449m0323J49010J06089P1335p9256l7414l3781
$$ 1826335 1766497 1643012 1554556 1547107 1506784 1655794 1761883 1833218 1753962 1716548 1682767
9470A682767L4552J5558k9089l140O2452J0708j36548l2486j3790j5762k4573
$$ 1682767 1717319 1732877 1703788 1700648 1763100 1773808 1637260 1604774 1590984 1575222 1550649
9459A550649k7399r0756j9489J43025J11501l7611P9209o5210j15500j00960j48766
$$ 1550649 1523250 1432494 1413005 1556030 1667531 1629920 1709129 1643919 1528419 1427459 1278693
9448A278693K363k376J4797Q8374r3026N7823k1161l3679J05497j6417L6488J35637
$$ 1278693 1281056 1278680 1293477 1381851 1288825 1346648 1325487 1291808 1397305 1380888 1417376 1553013
9436A553013Q6500J06550j41470k894L5349m0835j34723n165l3681n7319R2578
$$ 1553013 1639513 1746063 1604593 1601699 1637048 1596213 1461490 1456325 1422644 1365325 1457903
9425A457903J28179P8286M031k7875j14296j59745l8656l0183j49802M1344N5367
$$ 1457903 1586082 1664368 1668399 1640524 1526228 1366483 1327827 1297644 1147842 1189186 1244553
9414A244553J04525L7679L9054R019m6069r6394M3212J21549o6283l3847M6337
$$ 1244553 1349078 1386757 1425811 1434830 1388761 1292367 1335579 1457128 1390845 1356998 1403335
9403A403335L6218n5102M0655J38267J88325m4594m3565J80346P4010k6555j6926
$$ 1403335 1439553 1384451 1425106 1563373 1751698 1707104 1663539 1843885 1917895 1891340 1874414
9392A874414P1096O2354J10806m0711r2314k9700O729p8588j0080j53782N5162
$$ 1874414 1945510 2007864 2118670 2077959 1985645 1955945 1962674 1884086 1874006 1720224 1775386
9381A775386R3999j2559m2577n4153n6693j32335K4105P6746j87306n8628K153
$$ 1775386 1869385 1856826 1814249 1760096 1703403 1571068 1595173 1671919 1484613 1425985 1428138
9370A428138q1834P8293o790J6600j21439J04572m623O0845J31425P55r3835q1628
$$ 1428138 1346304 1424597 1417807 1434407 1312968 1417540 1412917 1473762 1605187 1605942 1512107 1430479
9358A430479L2007J57371Q1876J15581O0030q2011m5845J80586J4252m1187J66674
$$ 1430479 1462486 1619857 1701733 1817314 1877344 1795333 1749488 1930074 1944326 1903139 2069813
9347B069813K22798J41088J22247q813j08622j62884p335o6090j48761j43417
$$ 2069813 2292611 2433699 2555946 2547133 2438511 2275627 2268292 2202202 2053441 1910024
9337A910024k16008o0235L6813n2534j49145j04997l641K5947J3046n7757o2955
$$ 1910024 1694016 1633781 1670594 1618060 1468915 1363918 1360277 1386224 1399270 1341513 1278558
9326A278558J52896K9685q3464o5641n8422m811K1785j3639P651N4397O1315N8366
$$ 1278558 1431454 1461139 1377675 1312034 1253612 1248801 1270586 1256947 1264598 1318995 1380310 1438676
9314A438676K9917r2713J40095J17727k7471j3959P8305P4852p372J6696P2197
$$ 1438676 1468593 1375880 1515975 1633702 1606231 1592272 1670577 1745429 1738057 1754753 1826950
9303A826950N1718p7765o441K276J7600j51187j25163j38701j92373o0444K7342
$$ 1826950 1878668 1800903 1794462 1796738 1814338 1663151 1537988 1399287 1206914 1146470 1173812
9292A173812M3192k3926J14698J4694j5458o5003j58255o6313j4406O2665P7652
$$ 1173812 1217004 1193078 1307776 1322470 1307012 1242009 1083754 1017441 1003035 1065700 1143352
9281A143352L9718j36454m8275L555j3794J8642N2500n8968p957P0911j588q1093
$$ 1143352 1183070 1046616 998341 1001896 988102 1006744 1059244 1000276 992319 1063230 1061642 980549
9269I80549j10328J2056K6300N6408P5789N5665K7854Q834o7830j9492m4244l0323
$$ 980549 870221 882277 908577 964985 1040774 1096439 1124293 1133127 1065297 1045805 1001561 971238
9257I71238Q364Q0605J5138l6060j42454n4838k8595J1300L7108q1056n5876Q1409
$$ 971238 979602 1060207 1075345 1039285 896831 841993 813398 824698 861806 780750 724874 806283
9245H06283J461q147j4082r1565K606J60853K041l5138l0760o4097o8813P2571
$$ 806283 807744 799597 785515 693950 696556 857409 859450 824312 793552 729455 660642 733213
9233G33213L0757j37445n6014J1078P2585R9635M5186r675p2849K8452R5583N6523
$$ 733213 763970 626525 570511 581589 654174 753809 798995 789320 716471 744923 840506 897029
9221H97029n258o6380m1501O2781M5340j45448j03714m4385q843M0458R6152j3541
$$ 897029 891771 825391 783890 846671 892011 746563 642849 598464 589621 630079 726231 712690
9209G12690j05687O0214P3785j5494L2117M3817o9016J02292L2439j40581n4837
$$ 712690 607003 667217 741002 725508 757625 801442 732426 834718 867157 726576 671739
9198F71739P2984o372q2210N7724k941o2047N4302n4102n4511J8808m417J1389
$$ 671739 744723 738351 656141 713865 710924 648877 703179 649077 594566 613374 608957 620346
9186F20346l0862k5737K7047R2630M627l6944l7003M1932n5833J3660O7927Q1115
$$ 620346 589484 563747 590794 683424 688051 651107 614104 656036 600203 613863 681790 762905
9174G62905p5593o9391q614P7757M0979o3535m9844m088N1462m0665k1129N0398
$$ 762905 687312 617921 609307 687064 728043 664508 614664 610576 662038 621373 600244 650642
9162F50642J2426l1119q3221o9751L9914J44325j17190m4444o4780j1575m1239
$$ 650642 663068 631949 548728 478977 518891 663216 546026 501582 436802 425227 383988
9151C83988k1155j01268j2069J43359N9576L8559L9896M4064P6760J14230j14565
$$ 383988 362833 261565 249496 392855 452431 490990 530886 574950 651710 765940 651375
9140F51375q2634N1312l2237j0097j2507K007L3727p357l373p8718l6944L0793
$$ 651375 568741 620053 587816 577719 565212 567219 600946 593589 590216 511498 474554 505347
9128E05347j1618J54713O4112p3910q2904o219p7013l1166J19631O8658o4874
$$ 505347 493729 648442 712554 638644 555740 549521 472508 441342 560973 629631 564757
9117E64757O109N4257L0021j7152K3544p4652J114L1070q0269J1490K7662J8818
$$ 564757 570866 625123 655144 637992 661536 586884 587998 619068 538799 550289 577951 596769
9105E96769p8094L3618O1261o0554q8179m6403J68748J01895o5783q8773l9903
$$ 596769 518675 552293 613554 553000 464821 418418 587166 689061 623278 534505 494602
9094D94602J6385N007j3597j08726l2756n3791j43341p9919J41691J25795J12875
$$ 494602 510987 515994 502397 393671 360915 307124 163783 83864 225555 351350 464225
9083D64225k352k3007m4661J57102O7860j10332J3843M7330q1127j13048m0887
$$ 464225 461873 438866 394205 551307 619167 508835 522678 570008 488881 375833 334946
9072C34946p4315M2365J30556P7142J8171J3868q9045M5445M2998j2297J32666
$$ 334946 260631 302996 433552 510694 528865 542733 453688 499133 542131 529834 662500
9061F62500p4601k22827M032M6686j587j00505q6570p5121J24861K9173j9304
$$ 662500 587899 365072 369104 415790 414203 313698 227128 152007 276868 306041 286737
9050B86737J22264r2602n2604P5704k0641l9647R1237J03992R3553R968m7715
$$ 286737 409001 316399 263795 339499 318858 279211 370448 474440 567993 577961 530246
9039E30246o3235M437q7857O8383Q369k3236p4294R427O8776O5959J02928L3413
$$ 530246 467011 471448 383591 451974 460343 437107 362813 372240 441016 506975 609903 643316
9027F43316O1418j8766j33570r7360l7218J2793m4330N2240P9989k1595L6589
$$ 643316 704734 685968 552398 455038 417820 430613 386283 438523 518512 496917 533506
9016E33506p0925j8289N8302l9233M4548P2132r3893L3886P273J7736J2191L223
$$ 533506 462581 444292 502594 463361 507909 580041 486148 520034 527307 545043 557234 560457
9004E60457p5904m4086j15793n8142j0661n1867P998J08875J42121P1410J6807
$$ 560457 484553 440467 324674 266532 255871 204004 212002 320877 462998 534408 551215
8993E51215N993N939J06880j45121j69616k2742n8898J2996p1237J9351K7065
$$ 551215 557208 563147 670027 524906 355290 332548 273650 286646 215409 234760 261825
8982B61825L1254R1506J14323k2746n2265o9216J2242k2519J5019l3191Q7206
$$ 261825 293079 384585 498908 476162 423897 354681 366923 344404 359423 326232 413438
8971D13438l2349q1906O8279N3135L7527J33258k15115j87466O7648P5438P1715
$$ 413438 381089 299183 367462 420597 458124 591382 376267 188801 256449 331887 403602
8960D03602n4822P7100r023L8959L6038P9219m3699n6021j48826m9766n7228N8188
$$ 403602 348780 425880 416857 455816 491854 571073 527374 471353 322527 272761 215533 273721
8948B73721O802m4695q7816n76J46280L7517J3457P248J09130L7103L4694j22984
$$ 273721 280523 235828 148012 147436 293716 331233 344690 351938 461068 498171 532865 409881
8936D09881n3546j1632j8290K111P6923P6293P9127k1910j3286m8242j11241j1449
$$ 409881 356335 344703 326413 328524 405447 481740 560867 538957 525671 477429 366188 354739
8924C54739p0265K8217K6331R6397j6686o407j7994m9544q5829j40578j7418O5818
$$ 354739 284474 312691 339022 435419 418733 412326 394332 344788 258959 118381 100963 166781
8912A66781J02432P4534O8931R3554J0116j47545p7359J02761n1285R5345L5688
$$ 166781 269213 343747 412678 506232 516348 368803 291444 394205 342920 438265 473953
8901D73953j36995j1109j0135K5618R2783k7588p2676r0553r970N2665Q4086m7501
$$ 473953 336958 325849 315714 341332 434115 406527 333851 243298 233328 285993 370079 322578
8889C22578r8330k0268R1975P4006m4394J1252M2904n4277j6331Q4880L1361j5358
$$ 322578 224248 203980 295955 369961 325567 336819 379723 325446 309115 393995 425356 409998
8877D09998j5404j0277n5165l2072N6731N907l943l8894q561O7468n040k4282
$$ 409998 394594 384317 329152 297080 353811 359718 355775 316881 308320 375788 370748 346466
8865C46466p6711j20504J0624P7888R426J09316m7672j09927K7595Q686J00012
$$ 346466 269755 149251 159875 237763 247189 356505 308833 198906 226501 235187 335199
8854C35199K2372J8379l502j03672k6081M0654J3943K9863p1257m6145r3429M413
$$ 335199 357571 375950 372448 268776 242695 283349 297292 327155 255898 209753 116324 120737
8842A20737J03077L3682j04780J22143M1330M8528N2761N300j0443m1770o4533
$$ 120737 223814 257496 152716 274859 316189 364717 417478 422778 412335 370565 306032
8831C06032N5371N9365j56924j80492P726N7543R930L4723L3353R5423k08356
$$ 306032 361403 420768 263844 83352 91078 148621 158551 193274 226627 322050 113694
8820A13694k3737J14637Q9340k1239l5435m0455n3479J4649K3686P8676P0527
$$ 113694 89957 204594 293934 272695 237260 196805 143326 157975 181661 260337 330864
8809C30864J6943j5602j63866J2851n3581K8639M6622N0085J4049O1325n0356
$$ 330864 347807 332205 168339 181190 127609 156248 202870 252955 267004 328329 277973
8798B77973j02867j30849K4435J13265J38595J17151R8691j8494J0519k6030k65356
$$ 277973 175106 44257 68692 181957 320552 437703 536394 517900 528419 502389 237033
8787B37033n0990O0111L59R2229m6616q5302M1235k677j25341O7436J46197j20639
$$ 237033 186043 246154 246513 338742 292126 206824 248059 245382 120041 187477 333674 213035
8775B13035n0762N1896N929j65944j32012M6500J49849O6510P9552N2564q94J4848
$$ 213035 162273 214169 220098 54154 -77858 -31358 118491 185001 264553 317117 316223 331071
8763C31071n6170j83543r5287J52428R0579l8205n411r4252l4844P4680N0757
$$ 331071 274901 91358 -3929 148499 239078 200873 195462 101210 66366 141046 191803
8752A91803Q6390J05197p3486p9911j07396K2851R8966J9311q29l0882k0669j5653
$$ 191803 278193 383390 309904 229993 122597 145448 244414 263725 262896 232014 211345 195692
8740A95692j048R0238j0518P0449j9793k1689k0501N4432o9895p5352O2029P7970
$$ 195692 194644 284882 274364 344813 325020 303331 282830 337262 267367 192015 254044 332014
8728C32014p7247m385k5786j9996m1036K5888N3376r9183N105K7107q1579m150
$$ 332014 254767 250382 224596 204600 163564 189452 242828 143645 148750 175857 94278 90128
8716I0128O4227K5340L3003J6564P215l0978L1084J3443k373j2608n804N2693
$$ 90128 154355 179695 212698 229262 236477 205499 236583 250026 247653 235045 229241 281934
8704B81934M3426O5456q3725l4006O3490M4573j01101m1363J4757o133o8166m4709
$$ 281934 325360 390816 307091 273085 336575 381148 280047 238684 253441 247308 179142 134433
8692A34433j52917J2361O6019J31143J82609L1875j11697q0961j58435k3292Q1565
$$ 134433 -18484 -6123 59896 191039 373648 405523 293826 212865 54430 31138 112703
8681A12703P9031p8409l789P3203n3741k5823L2442O4504M7371M9662Q894K5752
$$ 112703 191734 113325 109536 182739 128998 103175 135617 200121 247492 297154 306048 331800
8669C31800m2027o7939q375K9088m6850j64853Q0338k923K6018O5943k5588l3980
$$ 331800 289773 221834 213459 242547 195697 30844 111182 108259 134277 200220 174632 140652
8657A40652M3180N9158m1906n8799j0224N4200J04484j02847J31533J09081M0237
$$ 140652 183832 242990 201084 142285 132061 186261 290745 187898 319431 428512 468749
8646D68749l0186k0149N835p0061j3695K7554l2206j19160M4589l7496M2314J7402
$$ 468749 438563 418414 424249 354188 340493 368047 335841 216681 261270 223774 266088 283490
8634B83490k8870J994j01133o3985m379m0230J14789J19874K3474L592j18958
$$ 283490 254620 256614 155481 91496 87117 46887 161676 281550 305024 308616 189658
8623A89658o6022R6301L2791k8797k9189L3279l1943K8652P3988M8019J1597j39513
$$ 189658 123636 219937 252728 223931 194742 228021 196078 224730 298718 346737 358334 218821
8611B18821o3615N4851L5316j8567l820j7830R6117p7501j03357l0321M7229N4076
$$ 218821 155206 210057 245373 226806 222986 205156 301273 223772 120415 90094 137323 191399
8599A91399O4508J93708o2498k16041M8143K9921O0777P3929j50641j48692p309
$$ 191399 255907 449615 387117 171076 219219 249140 309917 383846 233205 84513 77204
8588G7204j0022J84092o976L4467k7414l9417L7789j02888p0081L0979R4458r007
$$ 77204 67182 251274 244298 278765 251351 211934 249723 146835 76754 107733 202191 193184
8576A93184K6081J47376q2910r8502N3285l6672j4730m1066M6721j886l1503O6559
$$ 193184 219265 366641 283731 185229 238514 201842 187112 146046 192767 190881 159378 225937
8564B25937J03611R3830j06972q3680O5997j37068j22269L9193J6437m6940N1910
$$ 225937 329548 423378 316406 232726 298723 161655 39386 78579 95016 48076 99986
8553I9986M5202J13564R7227j08240j901o1206l6391J6785j5589N4756O9720R6671
$$ 99986 145188 258752 355979 247739 245838 184632 148241 165026 149437 204193 273913 370584
8541C70584L2998r0177j94665Q073J00571O1149N221j8963K3705j166O2078k9861
$$ 370584 403582 313405 118740 126813 227384 288533 293754 274791 298496 297330 359408 329547
8529C29547m7447q058l1431J242j12605p650Q0966l2483N3984N9152q3348j13077
$$ 329547 282100 274042 242611 243853 131248 123598 204564 172081 226065 285217 201869 88792
8517H8792o8996Q9173P6580j8980J0982j8253L8949L894j26501l0469Q9642P100
$$ 88792 19796 108969 185549 166569 177551 159298 198247 202141 75640 45171 134813 141913
8505A41913L3641J20783M0582L8137j32657j01606J5931J13548o3479M0163N0440
$$ 141913 175554 296337 336919 375056 242399 140793 156724 270272 206793 246956 297396
8494B97396M0508j23009m0469M6802J0716j26352j8955l1873K436J28083p4934
$$ 297396 337904 214895 174426 221228 231944 105592 86637 54764 57200 185283 110349
8483A10349k5254q9459j1875K3589J5842O1983l5265L6683J01937N8634m037n6181
$$ 110349 85095 -4364 -16239 7350 23192 85175 49910 86593 188530 247164 243127 186946
8471A86946n176k5877L1068j28635q6316J56273J6174j0685L7898J7215J370n2812
$$ 186946 181770 155893 186961 58326 -27990 128283 144457 133772 171670 188885 190255 137443
8459A37443m0764m7451O6176R6037K1937o299k6673J95022N2179K3564n9117j86268
$$ 137443 96679 49228 115404 211441 233378 227079 200406 395428 447607 471171 412054 225786
8447B25786j13046M0272K3289J51687l4537o5378j7870R0216l9337K4316o943
$$ 225786 112740 153012 176301 327988 293451 228073 210203 300419 261082 285398 278455
8436B78455j01822J2940O2025r0968Q1258O5236N9983n4542n4923m9636r002P9904
$$ 278455 176633 189573 251598 160630 241888 307124 367107 312565 257642 208006 199004 278908
8424B78908M4845o0487p5858J1950O5863J7815j3615n5105q1465j2758Q5466O9593
$$ 278908 323753 263266 187408 199358 265221 283036 269421 214316 132851 120093 205559 275152
8412B75152J3303q0853M5751N0865k2031j30153L4774k5830n6052l0693L2369
$$ 275152 288455 207602 253353 304218 282187 152034 186808 160978 104926 74233 106602
8401A06602L1261P8846J2718q8187K3645L3121M3727J7384r5234q4492K6996O8715
$$ 106602 137863 216709 229427 141240 164885 198006 241733 259117 163883 79391 106387 175102
8389A75102K2780m5818L1358Q9939J07442J6241j16608k4281m9289j1178p2345
$$ 175102 197882 152064 183422 273361 380803 397044 280436 256155 206866 195688 123343
8378A23343j17246M3824N2801k4252J7250J03155K7215J5134j34927j9835O8900
$$ 123343 6097 49921 102722 78470 95720 198875 226090 241224 106297 86462 155362
8367A55362r6986n7686K5191M8440O145R7445M6907k1864j41296j05212K0240
$$ 155362 58376 690 25881 74321 80466 177911 224818 202954 61658 -43554 -23314
8356b3314P4804J62121j9361j7625l6455n4377n6503l5910j6386P9352J1983k620
$$ -23314 51490 213611 194250 176625 140170 85793 29290 -6620 -23006 56346 68329 65709
8344F5709r937K0648n1838r6336J22512J72816O7094m9959m8184n4004L4070R6350
$$ 65709 55772 76420 24582 -71754 50758 223574 290668 240709 192525 138521 172591 268941
8332B68941M1166j28110Q208n4509j4099j10217l517Q9119N2758m8487K740K1284
$$ 268941 310107 181997 190205 135696 121597 11380 7863 96982 149740 101253 103993 125277
8320A25277L1086p0285M9947m5602l9017Q8150n361l3262O6415J03723M1664J9910
$$ 125277 156363 86078 136025 90423 51406 139556 134195 100933 167348 271071 312735 332645
8308C32645q9482j05055n5981r2819P2597M8647J18548J79343J21335m2212j3016
$$ 332645 243163 138108 82127 -10692 61905 110552 229100 408443 529778 487566 474550
8297D74550n9598q5603J11163K8992K437K572q1344r95k1416j08450l4751K6656
$$ 474550 414952 329349 440512 469504 471941 474513 393169 392174 370758 262308 227557 254213
8285B54213m7362k11475L2940l9468j1194L6018J00640J22165o6256K3094K6637
$$ 254213 206851 -4624 28316 -11152 -22346 13672 114312 236477 170221 193315 219952
8274B19952m4182K7804O2611o886p8743l2769j6790n5575o4704P1450K4030J4177
$$ 219952 175770 203574 266185 259299 180556 147787 130997 75422 10718 82168 106198 120375
8262A20375j02228m5887J02658J05241m4156j40671N171N0674m6577L8022K9359
$$ 120375 18147 -27740 74918 180159 136003 -4668 503 51177 4600 42622 71981
8251G1981M5353J9287M2010p8664k8555J05319n2873K3o0504R9755k1437r2412
$$ 71981 117334 136621 178631 99967 71412 176731 123858 123881 63377 163132 141695 49283
8239D9283o2113J7245r2773n8781J11354L8453n7764J4980l7264L6108N9949m833
$$ 49283 -12830 4415 -88358 -147139 -35785 2668 -55096 -40116 -77380 -41272 18677 13844
8227A3844M9788n8498J01774L474j97567q1800P4929J18573J39112O162k9841
$$ 13844 63632 5134 106908 110382 -87185 -168985 -94056 24517 163629 169791 139950
8216A39950P9596j8592o8922O0386r7314J0969P7200j6419k07336p7092R2503
$$ 139950 219546 200954 132032 192418 95104 106073 183273 166854 -40482 -117574 -25071
8205b5071M1794J5753L5909j5766l1252q7423l1841J96718J39313n6445O598j15881
$$ -25071 16723 32476 68385 52619 21367 -66056 -97897 98821 238134 181689 188287 72406
8193G2406q732P2539j1903m4791L2065n3188p8423K6763o5129K0366N9349J03962
$$ 72406 63674 136213 124310 79519 111584 58396 -20027 6736 -58393 -38027 21322 125284
8181A25284Q8457O8001j48871j08344m4210J3382o9941K9377j4704J25153R6812
$$ 125284 213741 281742 132871 24527 -19683 -6301 -76242 -46865 -61569 63584 160396
8170A60396j00531j14952j39268o689K49444K15294l5847j43883q1343Q2627O4610
$$ 160396 59865 -55087 -194355 -201044 48400 263694 227847 83964 2621 85248 149858
8159A49858j22382N4300J27877K9902p5682l639n4196q4461o4163L0632Q1331
$$ 149858 27476 81776 209653 239555 163873 160234 106038 21577 -42586 -11954 69377
8148F9377M2341k2612K4327o982M3071j47668j7980J96575j7905Q592r4255n9711
$$ 69377 111718 89106 113433 106451 149522 1854 -16126 180449 162544 171136 76881 17170
8136A7170j25555l4793J07882J28798J7095J42427r062n6982q6570j40441q3128
$$ 17170 -108385 -143178 -35296 93502 110597 253024 243962 186980 100410 -40031 -123159
8125a23159m034K1114k3912O1851R5117J14831J0583n6382m4343M5478k3879j2054
$$ -123159 -127193 -106079 -129991 -68140 26977 141808 152391 96009 51666 97144 73265 61211
8113F1211J6556p650l5377m1498j08949n0329M6854J35942L0852j17148K32790
$$ 61211 77767 70117 34740 -6758 -115707 -166036 -119182 16760 47612 -69536 163254
8102A63254J73634Q8476j40198k02920j02047o1599J27349M1814o869n301k1433
$$ 163254 336888 425364 285166 82246 -19801 -81400 45949 87763 80894 75593 54160
8091E4160J6849J8780J16079k1113L8251R6771j9109j94625l276r4330J47024
$$ 54160 71009 89789 205868 184755 223006 319777 300668 106043 102767 8437 155461
8080A55461N9202K7549o0346p603n9171P3900q3004o8199L6672L8572n6670O9731
$$ 155461 214663 242212 181866 174263 115092 188992 105988 37789 74461 113033 56363 126094
8068A26094J7414k7825q4346p9951k2897O4671N2927J0223n8242j38579Q2433
$$ 126094 143508 115683 31337 -48614 -71511 -6840 46087 56310 -1932 -140511 -58078
8057e8078J32454j43003n6014R7644m0076J7900M0934Q0411j17321M9861k2442
$$ -58078 74376 -68627 -124641 -26997 -67073 -49173 -8239 72172 -45149 4712 -17730
8046a7730M443j7847k0553q0072J05319J21571M8120J11629N2884r3205o1710
$$ -17730 -13287 -31134 -51687 -131759 -26440 95131 143251 254880 307764 214559 152849
8035A52849m5672L1182m4036j24523j20438J7165M8000O3137p3540j6504N1913
$$ 152849 107177 138359 94323 -30200 -150638 -133473 -85473 -22336 -95876 -112380 -60467
8024f0467Q3310l067k0011O4260n3735j40591O6491J10965j5658j3734J32772
$$ -60467 22843 19776 -235 64025 10290 -130301 -63810 47155 31497 17763 150535
8013A50535M9312l9666M9230R0941j39708j10197m9543L7759L140M8187J03242
$$ 150535 199847 160181 209411 300352 160644 50447 904 38663 41803 89990 193232
8002A93232P7669l2217j12862K4261n8417j43964l8266J02249K0510N1323n0883
$$ 193232 270901 238684 125822 150083 91666 -52298 -90564 11685 32195 83518 32635
7991C2635o5725J3623j5156k0445R512N4186p4150l6107j2055j884J33748J35921
$$ 32635 -33090 -19467 -34623 -55068 -45556 8630 -65520 -101627 -113682 -115566 18182 154103
7979A54103P972l8673j11320m9691K3877Q43m3357L7179P265l6114O515L8050
$$ 154103 162075 123402 12082 -37609 -13732 -12889 -56246 -19067 -11802 -47916 -41401 -3351
7967c351n1801k5755K6229j214M1250Q702j5820J38767L3735j00902p1848J7131
$$ -3351 -55152 -80907 -54678 -55892 -14642 -5940 -21760 117007 150742 49840 -22008 -4877
7955d877p193Q5496q9303n563J5212l5800N0059Q688p0284l402L239N834l2877
$$ -4877 -12070 73426 -15877 -21440 -6228 -42028 8031 16719 -53565 -56967 -53728 -47894 -80771
7942h0771L4113m8753R6125L1929k1888N652N2297Q9964n4842k454r478q3060
$$ -80771 -46658 -95411 714 32643 10755 16407 68704 158668 103826 101372 91894 8834
7930H834O3926O2183j1934o4093J01922P0481r1052j1695k9645o5567l4393O2155
$$ 8834 72760 134943 123009 58916 160838 231319 140267 128572 98927 33360 -1033 61122
7918F1122N6577l3663p0o1936q2559n3060J2582J0361J26355N1329M2722m2664
$$ 61122 117699 84036 83966 22030 -60529 -113589 -101007 -90646 35709 87038 129760 87096
7906H7096q6074K5126J93561l8551p7593p6886l8095L9900L547j3269n5294M6180
$$ 87096 1022 26148 219709 181158 103565 26679 -11416 28484 32031 18762 -36532 9648
7894I648M8237J8157r5932m8367L3921n9555K5772L1146K1369j26228Q6066J42034
$$ 9648 57885 76042 -19890 -68257 -34336 -93891 -68119 -36973 -15604 -141832 -55766 86268
7882H6268o7229K7925n3665P9299R6265K6070K9421n4480L4937j3550n2183M0830
$$ 86268 19039 46964 -6701 72598 168863 194933 224354 169874 204811 191261 139078 179908
7870A79908M6601l3107o5781j00767j96906K5054J27239P9965Q6182l7907j32885
$$ 179908 226509 193402 127621 26854 -170052 -144998 -17759 62206 148388 110481 -22404
7859b2404o2269m3984j9034P4413K6427P7232J99807m0808k03885p7159M3593
$$ -22404 -84673 -128657 -147691 -73278 -46851 30381 230188 189380 -14505 -91664 -48071
7848d8071j6383r1944Q3405N9200j9905r2275J8501L7498O8732M6414j11056j16814
$$ -48071 -64454 -156398 -72993 -13793 -33698 -125973 -107472 -69974 -1242 45172 -65884 -182698
7836a82698k6641l9247k1813l3239J22679J64510R2711k8612j42323n9295k46
$$ -182698 -209339 -248586 -270399 -303638 -180959 -16449 76262 47650 -94673 -153968 -154214
7825a54214q789M4571P1100j3880N8396m3351p9405M348R3192R682M6470r0276
$$ -154214 -163003 -118432 -47332 -61212 -2816 -46167 -125572 -121224 -28032 -18350 28120 -62156
7813f2156K7071p4581k4489L9309R9853n3083K1686K2662M6247m7310l9885K9092
$$ -62156 -35085 -109666 -134155 -94846 5007 -48076 -26390 -3728 42519 -4791 -44676 -15584
7801a5584M7595P7872K7017K6288l8890j20139p6090m406N4585K6749M6510J01895
$$ -15584 32011 109883 136900 163188 124298 4159 -71931 -76337 -21752 4997 51507 153402
7789A53402j3552l449k9233M795m168k1363K3479n377j75445n1440P5558P3111
$$ 153402 139850 136401 107168 111963 107795 86432 109911 104534 -70911 -122351 -46793 26318
7777B6318M0942j3853p2342J7362M6583P3609P6359k8937p1768o0768q6569j08362
$$ 26318 67260 53407 -18935 -1573 45010 118619 194978 166041 94273 33505 -53064 -161426
7765a61426j0759J6704o805N8960m390p7449n1166N4563Q2007K9416K975r6786
$$ -161426 -172185 -155481 -162286 -103326 -107716 -185165 -236331 -181768 -99761 -70345 -67370 -164156
7753a64156o195P1892K2637L0331R802q7357J08107M6394p0286l9635J7504j3258
$$ -164156 -170351 -98459 -75822 -45491 -35689 -123046 -14939 31455 -38831 -78466 -60962 -74220
7741g4220N486j0972R4246m043n5568M5511J44709R322L848m1239j13292Q6899
$$ -74220 -68734 -79706 14540 10497 -45071 440 145149 154471 158319 117080 3788 90687
7729I0687P4976n4182j14994k7761m4456o3262O517R5594L7144j00859P586P9046
$$ 90687 165663 111481 -3513 -31274 -75730 -138992 -132475 -36881 263 -100596 -93010 -13964
7717a3964O2093p5467L776R3783J1988j75203J29662M9379p2071M1292Q9736l596
$$ -13964 48129 -27338 -23562 70221 82209 -92994 36668 86047 13976 55268 145004 141408
7705A41408P2294m0382k9623j16600r6789K3329m944J1474L0083l6837l619j44
$$ 141408 213702 173320 143697 27097 -69692 -46363 -51307 -39833 -9750 -46587 -50206 -50350
7693e0350J43982P8736r8872j67241o7225j20477j6294J21961J03255j9929K9010
$$ -50350 93632 172368 73496 -93745 -160970 -281447 -297741 -175780 -72525 -92454 -63444
7682f3444q730L4180Q4007P0676M088m1687K9985k1215r8911K9545n846j01326
$$ -63444 -72174 -37994 46013 116689 120777 79090 109075 87860 -11051 18494 12648 -88678
7670h8678O3578J13312j39759m1558J31141Q5672O1572j07104j11163R3846j1550
$$ -88678 -25100 88212 -51547 -93105 38036 123708 185280 78176 -32987 60859 49309
7659D9309j21974j31373K2415P680R1168J16844M9173l128L1001J09961j04833
$$ 49309 -72665 -204038 -181623 -173943 -82775 34069 83242 80114 111115 221076 116243
7648A16243l7263j6841M3691j39776N597J19836q5845l7346P660K14676P8974
$$ 116243 78980 62139 105830 -33946 -28349 91487 5642 -31704 -24044 190632 269606
7637B69606j36867j71897j5897r213M1277L7599M7704k0673j24053J8145n807
$$ 269606 132739 -39158 -55055 -64268 -22991 14608 62312 41639 -82414 -64269 -70076
7626g0076p1614P1056l3214q1987N1621J30760J04277O369P6885p5383k0466l3555
$$ -70076 -141690 -70634 -103848 -185835 -134214 -3454 100823 107192 184077 108694 88228 54673
7614E4673m1699r9001J0685J21130m6096R824J18j14205j5282R8640K09878M0342
$$ 54673 12974 -86027 -75342 45788 -308 9516 9634 -104571 -119853 -21213 188665 229007
7602B29007m0364q4069L8853o4265r2881m2338l9063k5442Q3289J8882L496k6950
$$ 229007 188643 104574 143427 79162 -13719 -56057 -95120 -120562 -37273 -18391 -14895 -41845
7590d1845P1745m495l4622Q8112P7176O4989j2281j28974k66K4934m0629j30667
$$ -41845 29900 25405 -9217 78895 156071 221060 208779 79805 79539 104473 63844 -66823
7578f6823l2733L6758J9161k5515J36063Q3266r788j19899n2858J19126r1073
$$ -66823 -99556 -62798 -43637 -69152 66911 150177 140389 20490 -32368 86758 -4315
7567d315j01264l3948k0848J0796J4928O026M69J02036m2497Q3418L1772m4846
$$ -4315 -105579 -139527 -160375 -149579 -134651 -128625 -128156 -26120 -68617 14801 46573 1727
7555A727M3603J4818q7580K6938P9960Q3658J07453p3519j1980j1624K058L6214
$$ 1727 45330 60148 -27432 -494 79466 163124 270577 197058 185078 173454 175512 211726
7543B11726P068n3104j1121q381j5744p5588r9555j3791L2556J72590J4530k8970
$$ 211726 218794 165690 154569 146188 130444 54856 -44699 -58490 -25934 146656 161186 132216
7531A32216P2107o826r0593l780K98q4583n8459q401J27684l2405k129j04317
$$ 132216 204323 197497 106904 103124 103422 18839 -39620 -48021 79663 47258 45129 -59188
7519e9188n7848n5701q3041M0581o630J1993K4933N3572K8387P9680Q1604J2582
$$ -59188 -117036 -172737 -255778 -215197 -221827 -209834 -184901 -131329 -102942 -23262 58342 70924
7507G0924J639l3099l2596j6968j36142j03892j3164M5700q268M6331J12808K1042
$$ 70924 72563 39464 6868 -10100 -146242 -250134 -263298 -217598 -225866 -179535 -66727 -45685
7495d5685l534N4941M0039o6715n7024J14419o5985j79886J6613Q8756R7487R4616
$$ -45685 -49219 5722 45761 -20954 -77978 36441 -29544 -209430 -192817 -104061 -6574 88042
7483H8042J198o3486j63792L1022o6130l5910j03492r033J50122J35290K8235
$$ 88042 89240 25754 -138038 -107016 -173146 -209056 -312548 -321581 -171459 -36169 -7934
7472g934L4119N8070r4555j57171o8186R1422m0130J14026J35006J2598q6311
$$ -7934 26185 84255 -10300 -167471 -235657 -144235 -184365 -70339 64667 77265 -9046
7461i046p0703J5507K5528K6406l9848Q8211J8892K9608K5158p6309r2679n4359
$$ -9046 -79749 -64242 -38714 -12308 -52156 36055 54947 84555 109713 33404 -59275 -113634
7449a13634J17057o092J37454m323j54322M3598j91166o7353R7997O6179j6021
$$ -113634 3423 -2669 134785 130462 -23860 19738 -171428 -238781 -140784 -74605 -90626
7438i0626j03730J8036K2496Q4628P2347k374M0480o05q8706r9771M111R5979
$$ -90626 -194356 -176320 -153824 -69196 3151 777 41257 40652 -48054 -147825 -143714 -47735
7426d7735N8078K0069N1881j15295k4860j1223j28823k4980O6559Q9714J252L0391
$$ -47735 10343 30412 82293 -33002 -57862 -69085 -197908 -222888 -156329 -66615 -65363 -34972
7414c4972K7813l2589O0863j00535O2980M626J5106J545r7817r6406J02240J03975
$$ -34972 -7159 -39748 21115 -79420 -16440 -11814 3292 4837 -92980 -189386 -87146 16829
7402A6829K5076k6r3881r7939p1808L7399J79623O2760k9981M5576l5160m6511
$$ 16829 41905 41879 -52002 -149941 -221749 -184350 -4727 58033 28052 73628 38468 -8043
7390h043j08224o6681L9201J0078M2203q9643O0589J39356J15906m4186R002L9260
$$ -8043 -116267 -182948 -143747 -133669 -91466 -181109 -120520 18836 134742 90556 99558 138818
7378A38818p266K435k7571J883r7513p9786M1860j3342p3748j3110P6829M4874
$$ 138818 131552 133987 106416 108299 10786 -69000 -27140 -40482 -114230 -127340 -50511 -5637
7366e637R6001M1672q9027r4842q8550O0735k733N0082N5948l6978K4124k1069
$$ -5637 90364 132036 43009 -51833 -140383 -79648 -82381 -32299 23649 -13329 10795 -10274
7354a0274m1836J3685L334J05184J1212K4680o7701j15404J14470K4023M1219
$$ -10274 -52110 -38425 -35091 70093 81305 105985 38284 -77120 37350 61373 102592
7343A02592m2293p3492j0637n8444o0141j0701J63207j5530J1609n7161p3102
$$ 102592 60299 -13193 -23830 -82274 -142415 -153116 10091 -5439 6170 -50991 -124093
7332a24093O8976Q7050n5217q548n3089q4205K7411K3341K418L0198k474p3728
$$ -124093 -55117 31933 -23284 -31832 -84921 -169126 -141715 -118374 -115956 -85758 -88232 -161960
7320a61960j34040O3298Q5025P6551Q2695k8304o0041O0151K5502P2051P1892
$$ -161960 -296000 -232702 -147677 -71126 11569 -16735 -76776 -16625 8877 80928 152820
7309A52820j26324j08336K0077J9218O1464l9604j50473L923J38663P9989k9633
$$ 152820 26496 -81840 -61763 -42545 18919 -20685 -171158 -167235 -28572 51417 21784
7298B1784M1567M1152l3263M9467j23249j31488O8558m2765R4312R1144q1607
$$ 21784 63351 104503 71240 120707 -2542 -134030 -65472 -108237 -13925 77219 -4388
7287d388O0688J57891q288j21552j61247n3710R7887l0700L6204K8419l4806R7025
$$ -4388 56300 214191 205903 84351 -76896 -130606 -32719 -63419 -27215 1204 -33602 63423
7275F3423j278r8542L7653n554K1200l3470q7895j2622j4290p7861m1825N6294
$$ 63423 62145 -36397 1256 -4298 16902 -16568 -104463 -117085 -131375 -209236 -251061 -194767
7263a94767k0520l2177m647J28689J11516k7702p5101o463O349k0877k1360K8518
$$ -194767 -215287 -247464 -252111 -123422 -11906 -39608 -114709 -121172 -114823 -135700 -157060 -128542
7251a28542N5936p478M2492k5945p8147j3165J77436L0373p2744j25089J67162
$$ -128542 -72606 -80084 -37592 -63537 -141684 -154849 22587 52960 -19784 -144873 22289
7240B2289O2662n0013o233O6600m4126j50669p0886O9064P5207N5758o388L3437
$$ 22289 84951 34938 28705 95305 51179 -99490 -170376 -101312 -26105 29653 23265 56702
7228E6702J4850K594q8811p9261j6312L1225N9393Q9437J5767q1948j32164j2477
$$ 56702 71552 74146 -14665 -93926 -110238 -79013 -19620 69817 85584 3636 -128528 -141005
7216a41005K7357k4030P8183J17977m3172m3247o2373j4471l7061l605m7210J42471
$$ -141005 -113648 -137678 -59495 58482 15310 -27937 -90310 -104781 -141842 -145447 -192657 -50186
7204e0186N2819j04054l2413O8457N9355O0199J26500q1562j38125p7898r780
$$ -50186 2633 -101421 -133834 -65377 -6022 54177 180677 99115 -39010 -116908 -126688
7193a26688N7488J34528l1588j77706q448O739K1318m3001P9723K6226j37591
$$ -126688 -69200 65328 33740 -143966 -152414 -145675 -124357 -167358 -87635 -61409 -199000
7182a99000J08225J37946k5105j9349J34575J6582N3039L6419j0474j4260O3320
$$ -199000 -90775 47171 22066 2717 137292 153874 206913 243332 232858 218598 281918
7171B81918r6976k7260k0679j00292p8943m7167J05110j938j25454M2240J12547
$$ 281918 184942 157682 137003 36711 -42232 -89399 15711 13773 -111681 -69441 43106
7160D3106p3998n6668r4397n3102j1669J980Q7667N1745J04894k3293M518K7344
$$ 43106 -30892 -87560 -181957 -235059 -246728 -244748 -157081 -105336 -442 -23735 -19217 8127
7148H127p6555k9956l097J6496Q1328j28214k7067l0011n3977P5820R864P6934
$$ 8127 -68428 -98384 -101481 -84985 -3657 -131871 -158938 -188949 -242926 -167106 -157242 -80308
7136h0308J48673j8392r0277r5929r7534R357R4377K6947j9074R3918o5176q1094
$$ -80308 68365 49973 -40304 -136233 -233767 -224410 -130033 -103086 -122160 -28242 -93418 -174512
7124a74512p4510k6725j2104k4884q7869J59986J09673N3962M8056o9098j6754
$$ -174512 -249022 -275747 -287851 -312735 -400604 -240618 -130945 -76983 -28927 -98025 -114779
7113a14779K2545j1493M5069M0756L9760q5506q4184k9006R890J15007M0916O9447
$$ -114779 -92234 -103727 -58658 -17902 21858 -63648 -147832 -176838 -166948 -51941 -11025 58422
7101E8422L766l6261k8283O1482q3371r7793J16975K0970o2749l8720O3186K1052
$$ 58422 62188 25927 -2356 59126 -24245 -122038 -5063 15907 -46842 -85562 -22376 -1324
7089a324l9808j3554L6345O3648j0221J08852L0128n5735q3954k7090o8377j7056
$$ -1324 -41132 -54686 -18341 45307 35086 143938 174066 118331 34377 7287 -61090 -78146
7077g8146M3931M9252j11274j60121O4637J05192l0457j3802k8068O371P1251
$$ -78146 -34215 15037 -96237 -256358 -191721 -86529 -116986 -130788 -158856 -152485 -81234
7066h1234m4503r0907j5500J68367Q3650k9236J11894k9090r3405r48q3494j5975
$$ -81234 -125737 -216644 -232144 -63777 19873 -9363 102531 73441 -19964 -20912 -104406 -120381
7054a20381K9471M0106n9871o5948j0176k3070n00N8709L2079N866N2213R661
$$ -120381 -90910 -50804 -110675 -176623 -186799 -209869 -210369 -151660 -119581 -113715 -61502 -51841
7042e1841P8510M1686J5425m6912m172K6440K5439n6142j6805n8548P514O4757
$$ -51841 26669 68355 83780 36868 32696 59136 84575 28433 11628 -46920 -39406 25351
7030B5351j17906p8655R1280N6665k5260R2919K6870j74370r164N1828J8105K4615
$$ 25351 -92555 -171210 -79930 -23265 -48525 44394 71264 -103106 -112270 -60442 -42337 -17722
7018a7722j5399N7912J4427L2470j24463j16546K2034M4134M6460r2345q635J56026
$$ -17722 -33121 24791 39218 71688 -52775 -169321 -147287 -103153 -56693 -149038 -157673 -1647
7006a647J037k0424K9091J20693P6809K7344q2170j24002l7433j597p6829K2215
$$ -1647 -610 -21034 8057 128750 205559 232903 150733 26731 -10702 -12299 -89128 -66913
6994f6913Q7378o4574R8321J01754o4782l8792N9392o8899j56446k128K4079K5821
$$ -66913 20465 -44109 54212 155966 91184 52392 111784 42885 -113561 -115689 -91610 -65789
6982f5789K7243R1654q3924o6602J4870j6616m8011R9495K8977q4933n2505q8162
$$ -65789 -38546 53108 -30816 -97418 -82548 -99164 -147175 -47680 -18703 -103636 -156141 -244303
6970b44303J04006L8175Q1037m5959j77229R3776P2690j0991k7688k5198M730
$$ -244303 -140297 -102122 -21085 -67044 -244273 -150497 -77807 -88798 -116486 -141684 -136954
6959a36954p6993R2835J16448r4116L5725K6573M1260k7231Q6232j991r8579q9645
$$ -136954 -213947 -121112 -4664 -98780 -63055 -36482 4778 -22453 63779 61788 -36791 -126436
6947a26436r9358J3517K29754Q8520p8595J6161L871q5543J968j6069j2163J96
$$ -126436 -225794 -212277 17477 105997 27402 43563 47434 -38109 -36141 -52210 -64373 -64177
6935f4177m9769J103P3337m8612L2464m0061j39963O0376J69662Q4525l9094O6904
$$ -64177 -113946 -112843 -39506 -88118 -55654 -95715 -235678 -175302 -5640 78885 39791 106695
6923A06695K5373l7210r4698j01444o0114m6762j5127O0559l551R3156N4156J524
$$ 106695 132068 94858 160 -101284 -161398 -208160 -223287 -162728 -166279 -73123 -18967 -17443
6911a7443j4250l2353j26857j9151K357j5847m6150l142J33093l9242J1597N9018
$$ -17443 -31693 -64046 -190903 -210054 -207697 -223544 -269694 -272836 -139743 -178985 -167388 -108370
6899a08370o0286r399n4357Q3658K3038J6462M6910l590j16357O3777M663R4044
$$ -108370 -168656 -178055 -232412 -148754 -125716 -109254 -62344 -65934 -182291 -118514 -113851 -19807
6887a9807j36285o7210j6097M4866L2262m8173P4339P1474k6005m3049L4617O7511
$$ -19807 -156092 -223302 -239399 -194533 -162271 -210444 -136105 -64631 -90636 -133685 -99068 -31557
6875c1557K1110M001o1308Q8431P929j05303m5675m4947R5292k6963r8070L4901
$$ -31557 -10447 -6446 -67754 20677 28606 -76697 -122372 -167319 -72027 -98990 -197060 -162159
6863a62159J51410O9620j20l118m8155p6663j7220J03298O0524M1717l5378N3634
$$ -162159 -10749 58871 58751 55633 7478 -69185 -86405 16893 77417 119134 83756 137390
6851A37390n2900j37541J1917l1557q1578m2989Q5223K4293j5856n3270J22108
$$ 137390 84490 -53051 -41134 -72691 -154269 -197258 -112035 -87742 -103598 -156868 -34760
6840c4760K3106p2691Q611J0584j0213R9216K0411n4433n9061k8856P0332p4626
$$ -34760 -11654 -84345 -75734 -65150 -75363 23853 44264 -10169 -69230 -98086 -27754 -102380
6828a02380j34940J79211O6118k1704j35010l9197N021o0906O3019J0257R3375
$$ -102380 -237320 -58109 8009 -13695 -148705 -187902 -182881 -243787 -180768 -170511 -77136
6817g7136q93n4927J5436N5041j0168O2655j3119O4717J90166m8929k53863k8450
$$ -77136 -78029 -132956 -117520 -62479 -72647 -9992 -23111 41606 231772 182843 -71020 -99470
6805i9470O4026L8466K7355Q8250J6716m5325j09516L79M1535J485j24822r0748
$$ -99470 -35444 3022 30377 118627 135343 90018 -19498 -19119 22416 23901 -100921 -191669
6793a91669j3452Q3247J17791J46984L5413o4731j17197m3664N4496Q1211k5395
$$ -191669 -205121 -121874 -4083 142901 178314 113583 -3614 -47278 7218 88429 63034
6782F3034j84179n933J09973M7842P3444J7843k5026M2604o083k03483m9240n9847
$$ 63034 -121145 -127078 -17105 30737 104181 122024 96998 139602 133519 -69964 -119204 -179051
6770a79051j8825J24815J15791P114j31756R0208Q4972j01296P1615L0587J5594
$$ -179051 -197876 -73061 42730 49844 -81912 8296 93268 -8028 63587 94174 109768
6759A09768j11360j80497L199J11218o279o8160o474M5702Q48j4051l8529J55009
$$ 109768 -1592 -182089 -178890 -67672 -73951 -142111 -148585 -102883 -102035 -116086 -154615 394
6747C94N1781r4847K0770n4887p3705J6619M5486n5290P0377M6030R2260o7980
$$ 394 52175 -42672 -21902 -76789 -150494 -133875 -88389 -143679 -73302 -27272 64988 -2992
6735b992j17670J6647P9933n7751n8043o4734M2245Q4289j1808m1341k513M526
$$ -2992 -120662 -104015 -24082 -81833 -139876 -204610 -162365 -78076 -89884 -131225 -133738 -129212
6723a29212k8224R4896P3700o9975q184n6059k9272o1675L7358Q8349N0671l740
$$ -129212 -157436 -62540 11160 -58815 -66999 -123058 -152330 -214005 -176647 -88298 -37627 -41367
6711d1367n5000l1193J8628j09723P46p278m492k8482J4997J60503J26657l1350
$$ -41367 -96367 -127560 -108932 -218655 -217909 -225187 -229679 -258161 -243164 -82661 43996 12646
6699A2646o9072p5095K3157J37971N6639j4572p0363p9642j0849N8002J6965J54304
$$ 12646 -56426 -131521 -108364 29607 86246 71674 1311 -78331 -89180 -31178 -14213 140091
6687A40091N1136r9591r4711m4670j24l7527O269O6811K0617p3451Q848j0946
$$ 140091 191227 91636 -3075 -47745 -47869 -85396 -79127 -12316 8301 -65150 -56302 -67248
6675f7248Q7267N2467k3880q9014k7854k1375J3721J00116q9076N6952m5145Q273
$$ -67248 20019 72486 48606 -40408 -68262 -89637 -75916 24200 -64876 -7924 -53069 -44796
6663d4796L8938k1521R0746k7463k7301M6363L7984m8964j73856o3439N9868J49542
$$ -44796 -5858 -27379 63367 35904 8603 54966 92950 43986 -129870 -193309 -133441 16101
6651A6101L1076j20933j3645O2630j9541o4026j8519p4654j5792K26646n7723
$$ 16101 47177 -73756 -87401 -24771 -44312 -108338 -126857 -201511 -217303 9343 -48380
6640d8380L121J12546J51711J09431j30035j84340L1064m2011l7038M7383K3306
$$ -48380 -45259 67287 218998 328429 198394 14054 45118 3107 -33931 13452 36758
6629C6758q5317k6183R9604j2641o8328j44292o4229L2736J43093j3742k7081
$$ 36758 -48559 -74742 24862 12221 -56107 -200399 -264628 -231892 -88799 -102541 -129622
6618a29622q5632J6789J49674k420j3395j7469N9475n4588j2356J19646N9409
$$ -129622 -215254 -198465 -48791 -51211 -64606 -82075 -22600 -77188 -89544 30102 89511
6607H9511k8675j4107j44656r4702K5746j2654m5168j657M7069m2839n7552R3586
$$ 89511 60836 46729 -97927 -192629 -166883 -179537 -224705 -226362 -179293 -222132 -279684 -186098
6595a86098n240O8212N4412k7741p2552J56323p6537J2083m793j45916J09685
$$ -186098 -191338 -123126 -68714 -96455 -169007 -12684 -89221 -77138 -81931 -227847 -118162
6584a18162J58972J8628k4263j88280p4926J8721r686O3072R025m0921R2599J28320
$$ -118162 40810 59438 35175 -153105 -228031 -209310 -218996 -155924 -146899 -187820 -95221 33099
6572C3099R3320l2615q719j09788r5143o0672M3430R591K5335l1134K8555m152
$$ 33099 126419 93804 85085 -24703 -119846 -180518 -137088 -127497 -102162 -133296 -104741 -108893
6560a08893o4196L5676k2065k9840P6779P4486Q3460n206m1929k5997k2454j23328
$$ -108893 -173089 -137413 -159478 -189318 -112539 -38053 45407 40201 -1728 -27725 -50179 -173507
6548a73507J19J76071K3720k0927N4974J57018O488j09150j98843n391J87540
$$ -173507 -173388 2683 26403 5476 60450 217468 223956 114806 -84037 -89428 98112
6537I8112n0139j9921J07073O2608l8764K4625o8325j65208n1402J20193Q1646
$$ 98112 47973 28052 135125 197733 158969 183594 115269 -49939 -101341 18852 100498
6526A00498L3470j53488p2636n1808L6144K2632n6054N0525Q8096O366K9789m3266
$$ 100498 133968 -19520 -92156 -143964 -107820 -85188 -141242 -90717 -2621 3745 33534 -9732
6514i732l5366o8011k2987k9486l0848J18540n3672J9247m975j8088J21395J40879
$$ -9732 -45098 -113109 -136096 -165582 -196430 -77890 -131562 -112315 -117290 -135378 -13983 126896
6502A26896J05396l9838J0680p1281J8899K7761j69751r4315J40515J2917j3206
$$ 126896 232292 192454 203134 131853 150752 178513 8762 -85553 54962 67879 54673
6491E4673N9096O6950k6471l380o3910j59951J2285K5944J65413j29896m8754
$$ 54673 113769 180719 154248 150868 86958 -72993 -60708 -34764 130649 753 -48001
6480d8001O8602J2878p1684L0826o061j7740n2311k6435P1086L8497P6635q0279
$$ -48001 20601 33479 -38205 -7379 -13440 -31180 -83491 -109926 -38840 -343 76292 -3987
6468c987l6873K8398R1491k5751n4943q5308j13610J1060K7519k1354L6899J57229
$$ -3987 -40860 -12462 79029 53278 -1665 -86973 -200583 -189523 -162004 -183358 -146459 10770
6456A0770N4994O5339j8081k7668j01498j13270p7020k8313M6219L8210J69950
$$ 10770 65764 131103 113022 85354 -16144 -129414 -206434 -234747 -188528 -150318 19632
6445A9632O3020r4556m8376j21211r5405K6121J01667J03876j8678j16194l1481
$$ 19632 82652 -11904 -60280 -181491 -276896 -250775 -149108 -45232 -63910 -180104 -211585
6434b11585J73397n2679o3956J6929P1474Q1917j12458n6030M6486R7095j4173
$$ -211585 -38188 -90867 -154823 -137894 -66420 15497 -96961 -152991 -106505 -9410 -23583
6423b3583j06317p3256j337N6937O2472R4843o5495j21528R0461j4973q1686R0365
$$ -23583 -129900 -203156 -204493 -147556 -85084 9759 -55736 -177264 -86803 -101776 -183462 -93097
6411i3097L3573l697m6180J8641j3846O509O3278M2609o3896p1473q903j18111
$$ -93097 -59524 -63221 -109401 -90760 -104606 -98097 -34819 7790 -56106 -127579 -136482 -254593
6399b54593K8692P8873m6775n342J09457o505r9683N638l8485j17680P530N7515
$$ -254593 -225901 -147028 -193803 -199145 -89688 -96193 -195876 -190238 -228723 -346403 -338873 -281358
6387b81358Q8534M462n2605l1194N9856J16827p9668j45290M3797n9161O9359
$$ -281358 -192824 -188362 -240967 -272161 -212305 -95478 -175146 -320436 -276639 -335800 -266441
6376b66441J79441M5149n4206l8458N451M304L0283j0391k8815j03510J6458O8700
$$ -266441 -87000 -41851 -96057 -134515 -129064 -124760 -94477 -104868 -133683 -237193 -220735 -152035
6364a52035O5623j0903P3451j27010J4001J24040M1189M02j19283j52500K9696
$$ -152035 -86412 -97315 -23864 -150874 -136873 -12833 28356 28758 -90525 -243025 -213329
6353b13329N3063P3508M8534N1160m7869k3731j9099l196N86n4161j1471J27217
$$ -213329 -160266 -86758 -38224 12936 -34933 -58664 -77763 -80959 -80373 -134534 -146005 -18788
6341a8788J47501R7222o2189n9529j08376n2398m3292l0815J21208O7399n684
$$ -18788 128713 225935 163746 104217 -4159 -56557 -99849 -130664 -9456 57943 52259
6330E2259o7437n1713k2887J71598K5528j75949k0149m3226L1962n6002p6555
$$ 52259 -15178 -66891 -89778 81820 107348 -68601 -88750 -131976 -100014 -156016 -232571
6319b32571P9486r5408M756J7933L8525l8572L315j0263Q4145P2917K3529j7925
$$ -232571 -153085 -248493 -243737 -225804 -187279 -225851 -222536 -232799 -148654 -75737 -52208 -70133
6307g0133J0091O2120N8224j13612m1224m9889m9275K8382L6729J67921O852n1246
$$ -70133 -60042 2078 60302 -53310 -94534 -144423 -193698 -165316 -128587 39334 46186 -5060
6295e060r2036K2875n2541l6183l1379j3359j72231r197K03808J68653j7187j04378
$$ -5060 -97096 -74221 -126762 -162945 -194324 -207683 -379914 -389111 -185303 -16650 -33837 -138215
6283a38215M030N0592J3174n7224K4666j8842o2568J7916n2731k0493J52311J17728
$$ -138215 -134185 -83593 -70419 -127643 -102977 -121819 -184387 -166471 -219202 -239695 -87384 30344
6271C0344M1613p4452L292j1576q9105K3350j1740j7343J8471L1197j16949M2200
$$ 30344 71957 -2495 797 -10779 -99884 -76534 -88274 -105617 -87146 -55949 -172898 -130698
6259a30698p385J8064M2879k6936q9208K3649R3578J7335L8718j27896L8274J12575
$$ -130698 -138083 -120019 -77140 -104076 -193284 -169635 -76057 -58722 -20004 -147900 -109626 2949
6247B949l176q1130M4214J08227K2617n316M2606J4928n0244p2309n2856L6416
$$ 2949 -227 -81357 -37143 71084 93701 88385 130991 145919 95675 23366 -29490 6926
6235F926R4852j3950j29735J0621l9466O9576o1419j00612P3708r5124K01497
$$ 6926 101778 87828 -41907 -31286 -70752 -1176 -62595 -163207 -89499 -184623 16874
6224A6874M4749r2404j21155N7224k1499j6186Q3317O9133Q4040p555J5685M1364
$$ 16874 61623 -30781 -151936 -94712 -116211 -132397 -49080 20053 104093 96538 112223 153587
6212A53587q1745l6139j20392M2654J09430O6526n2681q5101r7088j8387J7402
$$ 153587 71842 35703 -84689 -42035 67395 133921 81240 -3861 -100949 -119336 -101934
6201a01934M2141m9475k2030q5313Q16R9151Q027p4812l3888J23500J44993J23994
$$ -101934 -59793 -109268 -131298 -216611 -215795 -116644 -108617 -183429 -217317 -93817 51176 175170
6189A75170L9443m4038k29797r7657j57226Q332R6662q077q82Q7902L456J8818
$$ 175170 214613 170575 -59222 -156879 -314105 -305773 -209111 -217188 -218070 -130168 -126712 -107894
6177a07894M6926q7490j53410n8664L5179P8249j6657n8819K3584J35000J41358
$$ -107894 -60968 -148458 -301868 -360532 -325353 -247104 -263761 -322580 -298996 -163996 -22638
6166b2638O0514P6610q3786q6940l2884P5946R5240M8805k1765j04706j3239j071
$$ -22638 37876 114486 30700 -56240 -89124 -13178 82062 130867 109102 4396 -8843 -9914
6154i914M1831M5239N7249j25767k02051J8739M5245J2279n6962J8455K5288K1606
$$ -9914 31917 77156 134405 8638 -193413 -174674 -129429 -117150 -174112 -155657 -130369 -108763
6142a08763N5487P2963J1442j8562k5869m9811j33148o5303R2700Q9701Q6556
$$ -108763 -53276 19687 31129 12567 -13302 -63113 -196261 -261564 -168864 -79163 7393
6131G393M1572k6820J3005M2523j45215j59540J1728P5693J61880r7800q0846
$$ 7393 48965 22145 35150 77673 -67542 -227082 -215354 -139661 22219 -75581 -156427
6120a56427N0169J00562k4282M6677k2196r5316j03393j5405K4537k0654l0185
$$ -156427 -106258 -5696 -29978 16699 -5497 -100813 -204206 -219611 -195074 -215728 -245913
6109b45913J12336J0514k5232J5860k4924K1678P4615O4722O4957K0447k1214
$$ -245913 -133577 -123063 -148295 -132435 -157359 -135681 -61066 3656 68613 89060 67846
6098F7846k5611J6304k1003L145K1926L2352q9492m3581N61j05815j0667O6285
$$ 67846 42235 58539 37536 40681 62607 94959 5467 -38114 -37553 -143368 -154035 -87750
6086h7750N1248L8413q1282m1591j02700J0417K5768O8548l0730L9899N6172j04431
$$ -87750 -36502 1911 -79371 -120962 -223662 -213245 -187477 -118929 -149659 -109760 -53588 -158019
6074a58019n3185K4585L4341P3371K2496K6077M8567m260o2983j18539j0727j6448
$$ -158019 -211204 -186619 -152278 -78907 -56411 -30334 18233 13973 -49010 -167549 -178276 -194724
6062a94724K7049r158J9477M4640N1681j01200K4410J30409R3264k9220j16630
$$ -194724 -167675 -176833 -157356 -112716 -61035 -162235 -137825 -7416 85848 56628 -60002
6051f0002j33470j04700L4286P1860Q1527k2323k5750J6933Q1880N6731K732l6917
$$ -60002 -193472 -298172 -263886 -192026 -110499 -132822 -158572 -141639 -59759 -3028 -296 -37213
6039c7213j2167k5769o6835l3047L7498l5021k68091p6030Q1867K01303Q877N5211
$$ -37213 -49380 -75149 -141984 -175031 -137533 -172554 -440645 -516675 -434808 -233505 -224628 -169417
6027a69417J07628l6006L4018M7348o6961j10782L4224J25123M6116R330q2466
$$ -169417 -61789 -97795 -63777 -16429 -83390 -194172 -159948 -34825 11291 20621 -61845
6016f1845o5676L2256J01184L3382j24067o2974l5186J044O3970m6101J0867m1342
$$ -61845 -127521 -95265 5919 39301 -84766 -147740 -182926 -181882 -117912 -164013 -153146 -194488
6004a94488K6534J23523L1250j19780j35488M5883Q4957N3447J22j58739m1196
$$ -194488 -167954 -44431 -13181 -132961 -268449 -222566 -137609 -84162 -84040 -242779 -283975
5993b83975k8623l3506J02110J30009l9007L4367K9789K4765j36719O0871O9653
$$ -283975 -312598 -346104 -243994 -113985 -152992 -118625 -88836 -64071 -200790 -139919 -70266
5982g0266J9999j02276j12004l8021M1514k9196n0862M2368K6061P4320M4557
$$ -70266 -50267 -152543 -264547 -302568 -261054 -290250 -341112 -298744 -272683 -198363 -153806
5971a53806P0258P1932j44011k30746j8205J70111Q5801L71j8528m4341K6771
$$ -153806 -83548 -11616 -155627 -386373 -404578 -234467 -148666 -148295 -166823 -211164 -184393
5960a84393M3282k2458J38704O8276m2780j24677l4217M2289J54022J02547Q6256
$$ -184393 -141111 -163569 -24865 43411 631 -124046 -158263 -115974 38048 140595 226851
5949B26851k6799k4978n534j45646j25813K9039N8530O9342k5721k9932j34029
$$ 226851 200052 175074 169540 23894 -101919 -72880 -14350 54992 29271 -661 -134690
5938a34690q4116n298K7862L6078Q196p1239j3988Q1362J18926Q7657J6802o1569
$$ -134690 -218806 -224104 -196242 -160164 -151968 -223207 -237195 -155833 -36907 50750 67552 5983
5926E983n5818k1215P8m6824N6338K3194J12986k958P408m4780K900j7882O0375
$$ 5983 -49835 -71050 -70972 -117796 -61458 -38264 74722 71764 79172 34392 37292 19410 79785
5913G9785k134p0649N779j3982n0297j9193L0626m1231O5710O8849m5730M6319
$$ 79785 77651 7002 12781 -1201 -51498 -70691 -40065 -81296 -15586 53263 7533 53852
5901E3852O1798P274J3625j34174r5055l3180m748p806r5333J4909Q766N1771
$$ 53852 115650 122924 136549 2375 -92680 -125860 -130608 -138414 -233747 -218838 -210072 -158301
5889a58301J0500o5733l5761K9465P6594N3909n735l5148J7592n3804n1595J1028
$$ -158301 -147801 -213534 -249295 -219830 -143236 -89327 -95062 -130210 -112618 -166422 -218017 -206989
5877b06989j3511p8523K0557N5473Q9351J34206N8399K3906j13446J7086k2892
$$ -206989 -220500 -299023 -278466 -222993 -133642 564 58963 82869 -30577 -13491 -36383
5866c6383r0927M9042j5174q3993J24265K6419r7634p5086l8673j20762Q0819
$$ -36383 -127310 -78268 -93442 -177435 -53170 -26751 -124385 -199471 -238144 -358906 -278087
5855b78087M1480O2601l2969J3016L7192k6488n4935q0785M8772Q7562j8737r9487
$$ -278087 -236607 -174006 -206975 -193959 -156767 -183255 -238190 -318975 -270203 -182641 -201378 -300865
5843c00865O2445O5080L1896j42956K7189Q3195J15430P5071O5284q0027m0249
$$ -300865 -238420 -173340 -141444 -284400 -257211 -174016 -58586 16485 81769 1742 -38507
5832c8507J7605k7421N6161N0444R5926m9834j9224l2485j48380l6400K3069m5963
$$ -38507 -20902 -48323 7838 58282 154208 104374 85150 52665 -95715 -132115 -109046 -155009
5820a55009K0923J24648j794p1389l1780j3427k8908J8171o149k7611p3541l7973
$$ -155009 -134086 -9438 -11232 -82621 -114401 -127828 -156736 -138565 -144714 -172325 -245866 -283839
5808b83839O4J84886J8781L0676K4552l1866K9706R6085O0044k2235p3428j0119
$$ -283839 -283775 -98889 -80108 -49432 -24880 -56746 -27040 69045 129089 106854 33426 23307
5796B3307r5194q7129K7272L8695K8236K2029J03212L8539l0442m4319P198K144
$$ 23307 -71887 -159016 -131744 -93049 -64813 -42784 60428 98967 68525 24206 31404 33548
5784C3548p6045m2105O4124r452m4864j0742j17308R1311K4506j1547q0397N4793
$$ 33548 -42497 -84602 -20478 -29930 -74794 -85536 -202844 -111533 -87027 -98574 -178971 -124178
5772a24178J10262j29041p7642M3922J20027K09021j7320p4699k09019j04699
$$ -124178 -13916 -142957 -220599 -176677 -56650 152371 135051 60352 -148667 -253366
5762b53366O5373K5726J61234N039p8972K5411Q7279l204m6403l1771p0695m1629
$$ -253366 -187993 -162267 -1033 4006 -74966 -49555 37724 34520 -11883 -43654 -114349 -155978
5750a55978m85k7669P9177L3300O9767l4708o0212j5639k9723J45415N1403L6935
$$ -155978 -156463 -184132 -104955 -71655 -1888 -36596 -96808 -112447 -142170 3245 54648 91583
5738I1583j61023p6334J16205J31424O5152j29267j04297r1331o2283L4301p4541
$$ 91583 -69440 -145774 -29569 101855 167007 37740 -66557 -157888 -220171 -185870 -260411
5727b60411J15713J04216j2546L1667j03085L2554J22685n4703p7297R0135L0732
$$ -260411 -144698 -40482 -53028 -21361 -124446 -91892 30793 -23910 -101207 -11072 19660
5716A9660q4284m1507j02906k2230P1529R6457q8809m3406j36728k3727Q0567
$$ 19660 -64624 -106131 -209037 -231267 -159738 -63281 -152090 -195496 -332224 -355951 -275384
5705b75384J50675l2719o1012J62974P5527l1800P27o8504j58033m9374J93865
$$ -275384 -124709 -157428 -218440 -55466 20061 -11739 -11012 -79516 -237549 -286923 -93058
5694i3058Q3546p8930n1902L6769Q9108o0374j05415N3232J41606N2265m5170
$$ -93058 -9512 -88442 -140344 -103575 -14467 -74841 -180256 -127024 14582 66847 21677
5683B1677j9119m2079o0642M4824j1097O3016k1057k6507l9487m5361o4766O7149
$$ 21677 2558 -39521 -100163 -55339 -66436 -3420 -24477 -50984 -90471 -135832 -200598 -133449
5671a33449K06661P8653j87044n3113R1312N7429k3947J5205o9863q3022r2076
$$ -133449 73212 151865 -35179 -88292 3020 60449 36502 51707 -18156 -101178 -193254
5660a93254J41374k3711o3919q029l5338R0608j37974L40J8564Q7441N3459q2172
$$ -193254 -51880 -75591 -139510 -147539 -182877 -92269 -230243 -229903 -211339 -123898 -70439 -152611
5648a52611j040n8624J9184k8403L394o641k7572k413L6535R5463J23832O6714
$$ -152611 -153651 -212275 -193091 -221494 -218100 -224741 -252313 -254726 -218191 -122728 1104 67818
5636F7818m0181j5260l700q4326J3582J17674m4186j58551p4530J22306p8142
$$ 67818 27637 12377 8677 -75649 -62067 55607 11421 -147130 -221660 -99354 -177496
5625a77496o3224J34159M5976J3280k5896K0076J60958P0176m2730r7938P8677
$$ -177496 -240720 -106561 -60585 -47305 -73201 -53125 107833 178009 135279 37341 116018
5614A16018P6840j81596j09617n6966m3968M6221N9330K8154J735m2329Q57l5467
$$ 116018 192858 11262 -98355 -155321 -199289 -153068 -93738 -65584 -63849 -106178 -105321 -140788
5602a40788J7721L1905j10512n7195p5384m7022K4537J00576N2167l1466n5778
$$ -140788 -123067 -91162 -201674 -258869 -334253 -381275 -356738 -256162 -203995 -235461 -291239
5591b91239J35565M5656j6585l9536l7386q2951J21127J40416J07054k3343j66460
$$ -291239 -155674 -110018 -126603 -166139 -203525 -286476 -165349 -24933 82121 58778 -107682
5580a07682o4357r68N0122l5211m096J22878M9791n6781J179J8027j6352j0105
$$ -107682 -172039 -173007 -122885 -158096 -162192 -39314 10477 -46304 -45125 -27098 -43450 -53555
5568e3555r8743j18983J1284P3028Q2939J41208K172j5915K4131J944M3267l5499
$$ -53555 -152298 -271281 -259997 -186969 -104030 37178 39350 23435 47566 49510 92777 57278
5556E7278j2589m9602j10346Q527o64m596k0648J6730o1824n579J54742M0492
$$ 57278 44689 -4913 -115259 -106732 -107396 -111992 -132640 -115910 -177734 -183313 -28571 11921
5544A1921j06518j02700L5463Q7132J04393j00730j9238O369m8470Q1009k7237
$$ 11921 -94597 -197297 -161834 -74702 29691 -71039 -90277 -83908 -132378 -51369 -78606
5533g8606j12926k1042M4232L2080k3089j71633N4225J81916N1817R1399K660
$$ -78606 -191532 -212574 -168342 -136262 -159351 -330984 -276759 -94843 -43026 48373 51033
5522E1033R088P5011j00873j55518M79l9578Q263M807n6269M3719J69267q5859
$$ 51033 60121 135132 34259 -121259 -120780 -160358 -152095 -147288 -203557 -159838 9429 -76430
5510g6430N7418j7495j44956j16972M3359R3425J6777R7712J00899o9068m5569
$$ -76430 -19012 -36507 -181463 -298435 -255076 -161651 -144874 -47162 53737 -15331 -60900
5499f0900j22827P8185P3586o688n2055M3467J52108O0771j25153O4349n015r7269
$$ -60900 -183727 -105542 -31956 -38644 -90699 -47232 104876 165647 40494 104843 99828 2559
5487B559q0046J41490O8827m7059N7574k0552j00497n3605n0016k8353K7934q265
$$ 2559 -77487 64003 132830 85771 143345 122793 22296 -31309 -81325 -109678 -81744 -90009
5475i0009q8099O8500o2553M5031K4847n2897J32659K10819M7355l2585o9275
$$ -90009 -178108 -109608 -172161 -127130 -102283 -155180 -22521 188298 235653 203068 133793
5464A33793o4707j5976R8507O0101j07744j11333P0306j600O6400n1251l4113
$$ 133793 69086 53110 151617 211718 103974 -7359 62947 61347 127747 76496 42383
5453D2383N1388j00536p0081o7155o7602Q0129J12421J01865m2526j20728q527
$$ 42383 93771 -6765 -76846 -144001 -211603 -131474 -19053 82812 40286 -80442 -88969
5442h8969L6749n1656j10267k9072M6614j0032K2976N5626L3726p895J27533j00286
$$ -88969 -52220 -103876 -214143 -243215 -196601 -206633 -183657 -128031 -94305 -102200 25333 -74953
5430g4953j67798p1118P8929R4294j2772m216J16596R2618j06621k4762J05290
$$ -74953 -242751 -313869 -234940 -140646 -153418 -157634 -41038 51580 -55041 -79803 25487
5419B5487N9171p5355K1615n1040l5931N6382M0708R431k4823n5860j6673k6673
$$ 25487 84658 9303 30918 -20122 -56053 329 41037 50468 25645 -30215 -46888 -73561
5407g3561K6380j7354l6852J5673K8590J08684j544j33662r5517O6714L4158j7947
$$ -73561 -47181 -64535 -101387 -85714 -57124 51560 50016 -83646 -179163 -112449 -78291 -96238
5395i6238k931J03903m5762j97088M1915Q8928J1293k3352Q1620l538M6314n1445
$$ -96238 -99169 4734 -41028 -238116 -196201 -107273 -95980 -119332 -37712 -41250 5064 -46381
5383d6381n540m2692l7099q1216J5248l247N3253k2086j27100j0813L9784l1977
$$ -46381 -51921 -94613 -131712 -212928 -197680 -200927 -147674 -169760 -296860 -307673 -267889 -299866
5371b99866N1348J26283M9743L8790j3093K8759L0595J23977J5045q5904k06290
$$ -299866 -248518 -122235 -72492 -33702 -46795 -18036 12559 136536 151581 65677 -140613
5360a40613R727L3948M3270L1888k2827R4139Q2719j02673m2509j2708P9720K5469
$$ -140613 -130886 -96938 -53668 -21780 -44607 49532 132251 29578 -12931 -25639 54081 79550
5348G9550m3222j11216q1294j02264O1915J6218K5677O9251J22347p3500j26427
$$ 79550 36328 -74888 -156182 -258446 -196531 -180313 -154636 -85385 36962 -36538 -162965
5337a62965J7455O1059N3961P2596k963o0579j770J5193R861j10467j58864N5100
$$ -162965 -145510 -84451 -30490 42106 39143 -21436 -23206 -8013 1848 -108619 -267483 -212383
5325b12383P4334L5930J15833o6876l2448Q3281j34810j02523K4888k7281J3788
$$ -212383 -138049 -102119 13714 -53162 -85610 -2329 -137139 -239662 -214774 -242055 -228267
5314b28267J58327J18467J9403k9253M4657m4792n2417l7126j845N7673K0424
$$ -228267 -69940 48527 67930 38677 83334 38542 -13875 -51001 -52846 4827 25251
5303B5251O6269p5674J5415N2403p2425j47811l9667p2802j35877Q5019J91354
$$ 25251 91520 15846 31261 83664 11239 -136572 -176239 -249041 -384918 -299899 -108545
5292a08545L0590k05633r3699K06529j0140J38249Q5874M0469k33j18496o7493
$$ -108545 -77955 -283588 -377287 -170758 -180898 -42649 43225 83694 83461 -35035 -102528
5281a02528j9146K5795J26347M3547r165m2235r4764l5422J9174N2159M5777m2982
$$ -102528 -121674 -95879 30468 74015 64850 22615 -72149 -107571 -88397 -36238 9539 -33443
5269c3443j0592M3987M8581m7535j70436q6978O6956M6026j3047L716l265K7523
$$ -33443 -44035 -48 48533 998 -169438 -256416 -189460 -143434 -156481 -152765 -156030 -128507
5257a28507J5890l9142M5701Q1084k02178j5574P6902K5661J6153m5015j577L9992
$$ -128507 -112617 -151759 -106058 -24974 -227152 -242726 -165824 -140163 -124010 -169025 -170602 -130610
5245a30610J04335j5723l3647r1470J04775K0272j641J1938p0660l2474k4961
$$ -130610 -26275 -41998 -75645 -167115 -62340 -42068 -43709 -31771 -102431 -134905 -159866
5234a59866N5734j958j0948N5620o0838j41011m2618J61963O9778J52910L3084
$$ -159866 -104132 -106090 -117038 -61418 -122256 -263267 -305885 -143922 -74144 78766 111850
5223A11850j29149q1354J64146j02905j04272N0339O1794K5769l109q0131k6311
$$ 111850 -17299 -98653 65493 -37412 -141684 -91345 -29551 -3782 -6891 -87022 -113333
5212a13333M9865L3571j1513m9301j15594l2479J2080P6293J38177P344r632k2817
$$ -113333 -63468 -29897 -41410 -90711 -206305 -238784 -226704 -150411 -12234 -4890 -14522 -37339
5200c7339J2617k2856k6044j04999k5314R7665K5089J6835m185J66816J0900j46623
$$ -37339 -24722 -47578 -73622 -178621 -203935 -106270 -81181 -64346 -68531 98285 109185 -37438
5188c7438r5592R777p1312m3387K509o0700J36442J51243o6000j96234j5883P2113
$$ -37438 -133030 -123253 -194565 -237952 -235443 -296143 -159701 -8458 -74458 -270692 -286575 -214462
5176b14462J09151K36773j9432r6650j18053k6532j5041M1416M0742K0387N1042
$$ -214462 -105311 131462 112030 15380 -102673 -129205 -144246 -102830 -62088 -41701 9341
5165I341r7304j07970N5831J07799m8463j4777J2385J21176J16138L1657j60087
$$ 9341 -87963 -195933 -140102 -32303 -80766 -95543 -83158 38018 154156 185813 25726
5154B5726j52915J559N939k377j03413k9429O0725j7130n1527J12183J1163j77018
$$ 25726 -127189 -125630 -119691 -122068 -225481 -254910 -194185 -211315 -262842 -150659 -139496 -316514
5142c16514J19952J19186j9485K4665J7220m7263j8170m2167k5619J32717J3090
$$ -316514 -196562 -77376 -96861 -72196 -54976 -102239 -120409 -162576 -188195 -55478 -42388
5131d2388n8203q1764P561R3721J06012l4512k0064Q5883L8866l2251j18949J4305
$$ -42388 -100591 -182355 -174794 -81073 24939 -9573 -29637 56246 95112 62861 -56088 -41783
5119d1783l5263r4080P757m7703P5138N3800j284M586J7094R2975r5296L172M665
$$ -41783 -77046 -171126 -163369 -211072 -135934 -82134 -83418 -78832 -61738 31237 -64059 -60887 -56222
5106e6222N3760n4325J20683o1285m9943j19527R0410J3924j20832p9880j08849
$$ -56222 -2462 -56787 63896 2611 -47332 -166859 -76449 -62525 -183357 -263237 -372086
5095c72086j2511N8592K7444Q0669J2740m3605k514J62356l2943j60686J52046
$$ -372086 -384597 -326005 -298561 -217892 -205152 -248757 -251271 -88915 -121858 -282544 -130498
5084a30498J71375K545r1572N8112O2332q3147l6460l5348l1930J6421O9663o0381
$$ -130498 40877 43422 -48150 9962 72294 -10853 -47313 -82661 -114591 -98170 -28507 -88888
5072h8888K725j562m0056m716J04947k4082k1971M6383m8785j12574N1075J68607
$$ -88888 -86163 -87725 -127781 -132497 -27550 -51632 -73603 -27220 -76005 -188579 -137504 31103
5060C1103J3978j991n83p9070p2418J39031l602q446O3579m7726J0754l4992J6523
$$ 31103 45081 43090 42507 -36563 -108981 30050 26448 18002 81581 33855 44609 9617 26140
5047B6140J902j30177j47842R4385J51225R172r4114M6155n8077N4532L7237p6630
$$ 26140 28042 -102135 -249977 -155592 -4367 4805 -89309 -43154 -101231 -46699 -9462 -86092
5035h6092N8261Q7553O8245J1675k6811r0460l298n9566p4311l0496J9056k7432
$$ -86092 -27831 59722 127967 139642 112831 22371 19073 -40493 -114804 -145300 -126244 -153676
5023a53676K4612N4957m4731R3200M4434j90823p4116L6976J65090l3606j34036
$$ -153676 -129064 -74107 -118838 -25638 18796 -172027 -246143 -209167 -44077 -77683 -211719
5012b11719K2717J79231L9121L5171n6446j31590R776m5467j52778P6341J65554
$$ -211719 -189002 -9771 29350 64521 8075 -123515 -113739 -159206 -311984 -235643 -70089
5001g0089P2662m5115j3554O0815L709M8633k3479p309J562o9637o7963r499N1559
$$ -70089 2573 -42542 -56096 4719 8428 57061 33582 26273 27835 -41802 -109765 -119264 -67705
4988f7705m9256Q4996k3788j03118M499M407M3417K7568o9054l0166K8911K0427
$$ -67705 -116961 -31965 -55753 -158871 -154372 -149965 -106548 -78980 -148034 -178200 -149289 -128862
4976a28862Q2228j8027n5226j4416N9148m809R8765J48862m8492q3188M4795j48592
$$ -128862 -46634 -64661 -119887 -134303 -75155 -79964 18801 167663 119171 35983 80778 -67814
4964f7814j01256J07671M5332j0443J5245l2728L4297q7291p9620l8508J80965
$$ -67814 -169070 -61399 -16067 -26510 -11265 -43993 -9696 -96987 -176607 -215115 -34150
4953c4150k077j12007o2462P3319M8170J5527M903Q8117O9622q504l6987l1092
$$ -34150 -36227 -148234 -210696 -137377 -89207 -73680 -68777 19340 88962 80458 43471 12379
4941A2379o0636J3424j1854l2893k1509J02588m1784o2549k6384R9755Q3932n5297
$$ 12379 -48257 -34833 -46687 -79580 -101089 1499 -40285 -102834 -129218 -29463 54469 -828
4929h28p9998K9201L7068k6990j01785j22735N4840J63471N8111q0385J5379Q1612
$$ -828 -80826 -51625 -14557 -41547 -143332 -266067 -211227 -47756 10355 -70030 -54651 26961
4917B6961L3591j5012j4076n1086m7224k8831k1749k3198M1085m1980J12772n3292
$$ 26961 60552 45540 31464 -19622 -66846 -95677 -117426 -140624 -99539 -141519 -28747 -82039
4905h2039m5624J30108Q6067O5472j3648j15500l956J9732p8247K5092k8172M6249
$$ -82039 -127663 2445 88512 153984 140336 24836 20880 40612 -37635 -12543 -40715 5534
4893E534m6331m648L8549l2951m4512q791R5563j5105j54029p7021o768N5070
$$ 5534 -40797 -45445 -6896 -39847 -84359 -93150 2413 -12692 -166721 -243742 -250510 -195440
4881a95440J08415J05832j19839q2351m42O6240J64660N2538j3483J13995O3660
$$ -195440 -87025 18807 -101032 -183383 -183825 -117585 47075 99613 86130 200125 263785
4870B63785L5710j48779q0659N1245M6441j72971q2979N392j25886r824J07625
$$ 263785 299495 150716 70057 121302 167743 -5228 -88207 -82815 -208701 -218525 -110900
4859a10900j02831l6879j777J6229J60711R6017K4523n1518o7801r1135j15381
$$ -110900 -213731 -250610 -252387 -236158 -75447 20570 45093 -6425 -74226 -165361 -280742
4848b80742n551j856J3120J03320J70430j48763k3600R0126l2997K747n9060M3724
$$ -280742 -286293 -288149 -275029 -171709 -1279 -150042 -173642 -83516 -116513 -113766 -172826 -129102
4836a29102p0012J0648n1368N6177R4864P3627P0748P7622r2823J28267L9305
$$ -129102 -199114 -188466 -239834 -183657 -88793 -15166 55582 133204 40381 168648 207953
4825B07953r6167j2509N7757p9237j18246j44438j4228R2596M5030l5320l60O3033
$$ 207953 111786 99277 157034 77797 -40449 -184887 -199115 -106519 -61489 -96809 -97169 -34136
4813c4136n2511k1283R445L2494M0081K3779o5665j3901P4248Q1604k5068o7163
$$ -34136 -86647 -107930 -98485 -65991 -25910 -2131 -67796 -81697 -7449 74155 49087 -18076
4801a8076r4654L2199Q1873Q5267k2933O0674L3836q8417k8319M1691n2429J6466
$$ -18076 -112730 -80531 1342 86609 63676 124350 158186 69769 41450 83141 30712 47178
4789D7178j97277o5135P5717n3765M350j9655P0458R6935K7594n7737O4119q9930
$$ 47178 -150099 -215234 -139517 -193282 -188932 -208587 -138129 -41194 -13600 -71337 -7218 -97148
4777i7148p6290P7647N5039M3702J06205J4468j20613j49457M547J43811J831
$$ -97148 -173438 -95791 -40752 2950 109155 123623 3010 -146447 -141900 1911 3742
4766C742j2271J13024m7481q231N3237J4512j10997r3560j44576M3755k1138K8389
$$ 3742 -8529 104495 57014 48783 102020 116532 5535 -88025 -232601 -188846 -209984 -181595
4754a81595J27145O5344M3098M7047o3229j89724o253n0761L1970J02880O0882
$$ -181595 -54450 10894 53992 101039 37810 -151914 -158167 -208928 -176958 -74078 -13196
4743a3196l5329M0538L8546m683j59618Q4532k3969l6901l6364q0872m3256J8354
$$ -13196 -48525 -7987 30559 25876 -133742 -49210 -73179 -110080 -146444 -227316 -270572 -252218
4731b52218L344k4263k9630k6009J15131J01464M3777L9746N2679m6016q475N0659
$$ -252218 -248874 -273137 -302767 -328776 -213645 -112181 -68404 -28658 24021 -21995 -30470 20189
4719B0189J53620Q1005p8874n364k4180j17098j91166r9127o392R58N4402M9579
$$ 20189 173809 254814 175940 170576 146396 29298 -161868 -260995 -267387 -266429 -212027 -162448
4707a62448M4388M953p891j9558K9008j503J5565K0800o010J823O771L4584Q2669
$$ -162448 -118060 -113107 -120998 -140556 -111548 -113051 -97486 -76686 -82696 -80873 -74102 -39518 43151
4694D3151q5954j55630l1936J6915K9947n2508J8446Q5924P588P0163L6185K4347
$$ 43151 -42803 -198433 -230369 -213454 -183507 -236015 -217569 -131645 -124057 -53894 -17709 6638
4682F638k4924p5495J23038j01992q1759Q7394J09191M0205n547p029m010j20463
$$ 6638 -18286 -93781 29257 -72735 -154494 -67100 42091 82296 76749 69720 65710 -54753
4670e4753K9829N5056k7249j59455M6560R6319r511l2119K4815k4420L4972m6157
$$ -54753 -24924 30132 2883 -156572 -110012 -13693 -23204 -55323 -30508 -54928 -19956 -66113
4658f6113m5985O1414P5081o7925o3237j5008m4473n6738J410J525J36884l175
$$ -66113 -112098 -50684 24397 -43528 -106765 -121773 -166246 -222984 -221574 -220049 -83165 -86340
4646h6340R9978j1898M643Q1745j01920n0536q057j5196j14623p5737j09579M9557
$$ -86340 13638 1740 6383 88128 -13792 -64328 -72385 -87581 -202204 -277941 -387520 -337963
4634c37963P3344L5697j4832K0939L3755J5476J4711m5296j2328L1793P1123j5185
$$ -337963 -264619 -228922 -243754 -222815 -189060 -173584 -158873 -204169 -216497 -184704 -113581 -128766
4622a28766n567K5102m6966K1521J76988J02908j4448q0066m0266J0973Q0690
$$ -128766 -134333 -109231 -156197 -134676 42312 145220 130772 50706 10440 21413 102103
4611A02103m7702m0424N8065P6254j85906k29801j7658J36988R2216r551K7028
$$ 102103 54401 13977 72042 148296 -37610 -267411 -285069 -148081 -55865 -65416 -38388
4600c8388l4965N7556k8681l7667J29131N8886N8926j17969j45547k7788Q1801
$$ -38388 -73353 -15797 -44478 -82145 46986 105872 164798 46829 -98718 -126506 -44705
4589d4705L2169K638m6496R065N3345O04O561J03811n2589q1737j13919j7456
$$ -44705 -12536 -9898 -56394 -47329 6016 6620 13181 116992 64403 -17334 -131253 -148709
4577a48709J20872J4537k2169j6997o1799P095J40541r7987L1928R7018o3799
$$ -148709 -27837 -13300 -35469 -52466 -114265 -107170 33371 -64616 -32688 64330 531
4566E31k61796j1433J10895k6734J09368K0640o5401J03548J02853n3425p810
$$ 531 -261265 -272698 -161803 -188537 -79169 -58529 -123930 -20382 82471 29046 21236
4555B1236L2930k3427o4827p3968k3498m0345R1780M9356l4934L5890j10009n906
$$ 21236 54166 30739 -34088 -108056 -131554 -171899 -80119 -30763 -65697 -29807 -139816 -145722
4543a45722J5699K9795m5992J1966k9821K758K0036M3771Q9116k1018l2095O3502
$$ -145722 -130023 -100228 -146220 -134254 -164075 -161317 -141281 -97510 -8394 -29412 -61507 1995
4531A995j1880n4942j20006M0848J22237r3983n2934K9429o6570Q2908J08967
$$ 1995 -9885 -64827 -184833 -143985 -21748 -115731 -168665 -139236 -205806 -122898 -13931
4520a3931O4352N1313M0018k7779j47030j7963p3035k1093K4117n7609p1141M6752
$$ -13931 50421 101734 141752 113973 -33057 -51020 -124055 -145148 -121031 -178640 -249781 -203029
4508b03029Q6295o0621n713m8272k7634R3596J13844l5389r407J04416Q0557j8512
$$ -203029 -116734 -177355 -183068 -231340 -258974 -165378 -51534 -86923 -96330 8086 88643 70131
4496G0131j6031M979J2203m4515r9232O4353o1826m9716N4332O9077j3168j5443
$$ 70131 54100 59079 71282 26767 -72465 -8112 -69938 -119654 -65322 3755 -9413 -24856
4484b4856Q1719k6267j01383j19593p5814J62235L0712J2512L4947M4245p8909
$$ -24856 56863 30596 -70787 -190380 -266194 -103959 -73247 -60735 -25788 18457 -60452
4473f0452M4939J50900K3262j38189r4650k306n5372m989J11025q6000q536R5878
$$ -60452 -15513 135387 158649 20460 -74190 -76496 -131868 -136857 -25832 -111832 -120368 -24490
4461b4490k2327R122N9567m5139q3722j7054J2060q3185K6027J56992R8879K306
$$ -24490 -46817 -37695 21872 -23267 -106989 -124043 -111983 -195168 -169141 -12149 86730 89036
4449H9036o7613o5876o4540J6576n1136k3871l477J2541K3065j8750r7594j1416
$$ 89036 21423 -44453 -108993 -92417 -143553 -167424 -170901 -158360 -135295 -154045 -251639 -263055
4437b63055R2204j00596r152J20893Q4813M2991R8423K135j14106j04203o4778
$$ -263055 -170851 -271447 -280599 -159706 -74893 -31902 66521 68656 -45450 -149653 -214431
4426b14431J668N9844N8011K2616O5135J58171N0258R017L9802j31787j19173
$$ -214431 -212763 -152919 -94908 -72292 -7157 151014 201272 210289 250091 118304 -869
4415h69L8487Q6136j07663j42940m7005K6177O5351M8051l489j04205l2503Q4229
$$ -869 37618 123754 16091 -126849 -173854 -147677 -82326 -34275 -37764 -141969 -174472 -90243
4403i0243P0776J3856r2159N3637l7632N0620r0155K097Q8486P4884l0430o9676
$$ -90243 -19467 -5611 -97770 -44133 -81765 -31145 -121300 -119203 -30717 44167 13737 -55939
4391e5939l3942m8347N584K7983N674l4173J4260K56r8695M2454J12450m679l5539
$$ -55939 -89881 -138228 -132644 -104661 -98987 -133160 -118900 -118644 -217339 -174885 -62435 -67114 -102653
4378a02653J8006k3709J7756j9037Q5333L7219Q335o4791l8796r290R8027q8569
$$ -102653 -84647 -108356 -90600 -109637 -24304 12915 21250 -43541 -82337 -91627 6400 -82169
4366h2169Q9284l8583m385N8300j2893r4929l2878J52094M8671R9566j04909m5048
$$ -82169 7115 -31468 -35853 22447 9554 -85375 -118253 33841 82512 182078 77169 32121
4354C2121p0261r1729l0951K8190k02304j25948M2023J15195J33699M9013K6573
$$ 32121 -38140 -129869 -160820 -132630 -334934 -460882 -418859 -303664 -169965 -120952 -94379
$$ [...]
##END NTUPLES=NMR SPECTRUM
##END=
