##TITLE=Analysis number 319803
Compound Code cc 50413
Book Reference 461/48
Project Code adrs
Chemist Name toml
##JCAMPDX= 6.0         $$ Bruker NMR JCAMP-DX V2.0
##DATA TYPE= NMR SPECTRUM
##DATA CLASS= NTUPLES
##ORIGIN= Bruker BioSpin GmbH
##OWNER= nmr
$$ XWIN-NMR		Version 3.5
$$ Tue May 30 11:15:58 2006 GMT Daylight Time (UT+1h)  MAYBRIDGE\nmr@NMR_250MHZ
##.OBSERVE FREQUENCY= 250.131544655141
##.OBSERVE NUCLEUS= ^1H
##.ACQUISITION MODE= SIMULTANEOUS (DQD)
##.ACQUISITION SCHEME= undefined
##.AVERAGES= 16
##.DIGITISER RES= 18
##SPECTROMETER/DATA SYSTEM= dpx250
##.PULSE SEQUENCE= zg30
##.SOLVENT NAME= CDCl3
##.SHIFT REFERENCE= (INTERNAL, CDCl3, 0, 16.522)
##AUDIT TRAIL= $$ (NUMBER, WHEN, WHO, WHERE, WHAT)
$$ ##TITLE= Audit trail, XWIN-NMR		Version 3.5
$$ ##JCAMPDX= 5.01
$$ ##ORIGIN= Bruker BioSpin GmbH
$$ ##OWNER= nmr
$$ C:\u/data/dgb/nmr/ADRS/5390/pdata/1/auditp.txt
$$ ##AUDIT TRAIL=  $$ (NUMBER, WHEN, WHO, WHERE, WHAT)
(   1,<2006-05-30 11:15:38.19 +100>,<MAYBRIDGE\nmr>,<NMR_250MHZ>,
      <created by zg, POWCHK disabled, PULCHK disabled
       configuration hash MD5:
       B5 A6 C7 38 BA 16 E7 09 FD 8C 39 C2 85 6D FD 14
       data hash MD5: 64K
       BE E6 75 BA 5B 47 7E A6 C7 56 A9 35 15 07 10 C1>)
(   2,<2006-05-30 11:15:50.36 +100>,<MAYBRIDGE\nmr>,<NMR_250MHZ>,
      <Start of raw data processing
       ef LB = 0.3 FT_mod = 6 PKNL = 1 SI = 32K 
       data hash MD5: 32K
       D4 6A AE CA 43 5B CE 12 D1 97 8C D1 0D EB F1 85>)
(   3,<2006-05-30 11:15:51.91 +100>,<MAYBRIDGE\nmr>,<NMR_250MHZ>,
      <apk 
       data hash MD5: 32K
       A1 F6 FB 67 72 1A 05 B2 21 FE D3 74 2E 57 2F F5>)
(   4,<2006-05-30 11:15:52.67 +100>,<MAYBRIDGE\nmr>,<NMR_250MHZ>,
      <abs ABSG = 5 
       data hash MD5: 32K
       4A AD 6A 40 3D 3B EB 59 5C 58 0C C3 CB BE D2 78>)
$$ ##END=
$$ 
$$ hash MD5
$$ A6 A3 5C 16 EA EF 10 EF A9 6D C8 B7 F2 0E 5E E4
##$RELAX= 
##$RELAX= 
##$RELAX= 
##$RELAX= 
##$RELAX= 
##$RELAX= 
##$RELAX= 
$$ Bruker specific parameters
$$ --------------------------
##$DU= <C:\u>
##$EXPNO= 5390
##$NAME= <ADRS>
##$PROCNO= 1
##$TYPE= <nmr>
##$USER= <dgb>
##$AMP= (0..31)
100 100 100 100 100 100 100 100 100 100 100 100 100 100 100 100 100 100 
100 100 100 100 100 100 100 100 100 100 100 100 100 100 
##$AQSEQ= 0
##$AQ_mod= 3
##$AUNM= <au_zg>
##$AUTOPOS= <12 >
##$BF1= 250.13
##$BF2= 250.13
##$BF3= 250.13
##$BF4= 250.13
##$BF5= 500.13
##$BF6= 500.13
##$BF7= 500.13
##$BF8= 500.13
##$BYTORDA= 1
##$CFDGTYP= 0
##$CFRGTYP= 5
##$CHEMSTR= <none>
##$CNST= (0..31)
1 1 145 1 1 1 1 1 1 1 1 1 1 1 1 1 1 1 1 1 1 1 1 1 1 1 1 1 1 1 1 1 
##$CPDPRG= <>
##$CPDPRG1= <>
##$CPDPRG2= <>
##$CPDPRG3= <>
##$CPDPRG4= <mlev>
##$CPDPRG5= <mlev>
##$CPDPRG6= <mlev>
##$CPDPRG7= <mlev>
##$CPDPRG8= <mlev>
##$CPDPRGB= <>
##$CPDPRGT= <>
##$D= (0..31)
0 1 0 0 0 0 0 0 0 0.06 0 0 0 0 0 0 0.0002 0 0 0 0 0 0 0 0 0 0 0 0 0 0 
0 
##$DATE= 1148984137
##$DBL= (0..7)
120 120 120 120 120 120 120 120 
##$DBP= (0..7)
150 150 150 150 150 150 150 150 
##$DBP07= 0
##$DBPNAM0= <>
##$DBPNAM1= <>
$$ [...]
##$SUBNAM7= <"">
##$SUBNAM8= <"">
##$SUBNAM9= <"">
##$SW= 20.6930455092707
##$SWIBOX= (0..15)
0 0 3 0 0 0 0 0 0 0 0 0 0 0 0 0 
##$SW_h= 5175.983436853
##$TD= 65536
##$TD0= 1
##$TE= 294.16
##$TE2= 300
##$TE3= 300
##$TEG= 300
##$TL= (0..7)
0 120 120 120 120 120 120 120 
##$TP= (0..7)
150 150 150 150 150 150 150 150 
##$TP07= 0
##$TPNAME0= <>
##$TPNAME1= <>
##$TPNAME2= <>
##$TPNAME3= <>
##$TPNAME4= <>
##$TPNAME5= <>
##$TPNAME6= <>
##$TPNAME7= <>
##$TPOAL= (0..7)
0.5 0.5 0.5 0.5 0.5 0.5 0.5 0.5 
##$TPOFFS= (0..7)
0 0 0 0 0 0 0 0 
##$TUNHIN= 0
##$TUNHOUT= 0
##$TUNXOUT= 0
##$USERA1= <user>
##$USERA2= <user>
##$USERA3= <user>
##$USERA4= <user>
##$USERA5= <user>
##$V9= 5
##$VALIST= <valist>
##$VCLIST= <CCCCCCCCCCCCCCC>
##$VD= 0
##$VDLIST= <DDDDDDDDDDDDDDD>
##$VPLIST= <PPPPPPPPPPPPPPP>
##$VTLIST= <TTTTTTTTTTTTTTT>
##$WBST= 1024
##$WBSW= 4
##$XGAIN= (0..3)
0 0 0 0 
##$XL= 0
##$YL= 0
##$YMAX_a= 503565
##$YMIN_a= -774961
##$ZGOPTNS= <>
##$ZL1= 120
##$ZL2= 120
##$ZL3= 120
##$ZL4= 120
##$ABSF1= 16.522
##$ABSF2= -4.171173
##$ABSG= 5
##$ABSL= 3
##$ALPHA= 0
##$AQORDER= 0
##$ASSFAC= 0
##$ASSFACI= 0
##$ASSFACX= 0
##$ASSWID= 0
##$AUNMP= <proc_1d>
##$AZFE= 0.1
##$AZFW= 0.1
##$BCFW= 0
##$BC_mod= 0
##$BYTORDP= 0
##$COROFFS= 0
##$CY= 12.5
##$DATMOD= 1
##$DC= 0
##$DFILT= <>
##$DTYPP= 0
##$F1P= 14.0000005364418
##$F2P= -0.99999901652339
##$FCOR= 0.5
##$FTSIZE= 32768
##$FT_mod= 6
##$GAMMA= 0
##$GB= 0
##$INTBC= 1
##$INTSCL= 1
##$ISEN= 128
##$LB= 0.3
##$LEV0= 0
##$LPBIN= 0
##$MAXI= 10000
##$MC2= 0
##$MEAN= 0
##$ME_mod= 0
##$MI= 0
##$NCOEF= 0
##$NC_proc= -4
##$NLEV= 6
##$NOISF1= 0
##$NOISF2= 0
##$NSP= 0
##$NTH_PI= 0
##$NZP= 0
##$OFFSET= 16.522
##$PC= 1
##$PHC0= 172.5372
##$PHC1= 6.481348
##$PH_mod= 1
##$PKNL= yes
##$PPARMOD= 0
##$PSCAL= 4
##$PSIGN= 0
##$REVERSE= no
##$SF= 250.13
##$SI= 32768
##$SIGF1= 0
##$SIGF2= 0
##$SINO= 400
##$SIOLD= 32768
##$SREGLST= <1H.CDCl3>
##$SSB= 0
##$STSI= 32768
##$STSR= 0
##$SW_p= 5175.98343685301
##$SYMM= 0
##$S_DEV= 0
##$TDeff= 65536
##$TDoff= 0
##$TI= <Analysis number 999999
Compound Code 99
Book Reference 9
Project Code 9>
##$TILT= no
##$TM1= 0
##$TM2= 0
##$TOPLEV= 0
##$USERP1= <user>
##$USERP2= <user>
##$USERP3= <user>
##$USERP4= <user>
##$USERP5= <user>
##$WDW= 1
##$XDIM= 32768
##$YMAX_p= 365289379
##$YMIN_p= -120327
$$ End of Bruker specific parameters
$$ ---------------------------------
##NTUPLES= NMR SPECTRUM
##VAR_NAME=  FREQUENCY,     SPECTRUM/REAL,   SPECTRUM/IMAG
##SYMBOL=    X,             R,               I
##VAR_TYPE=  INDEPENDENT,   DEPENDENT,       DEPENDENT
##VAR_FORM=  AFFN,          ASDF,            ASDF
##VAR_DIM=   32768,         32768,           32768
##UNITS=     HZ,            ARBITRARY UNITS, ARBITRARY UNITS
##FACTOR=    0.157963299565203, 1,           1
##FIRST=     4132.6476996994, 0,             0
##LAST=      -1043.33573715361, 0,           0
##MIN=       -1043.33573715361, -120327,     0
##MAX=       4132.6476996994, 365289379,     0
$$ Real data points
##PAGE= N=1
##DATA TABLE= (X++(R..R)), XYDATA
$$ [...]
15369b5507K8653j327o790k940J1235K3002Q10j5601o468l9387m6682J0994k095
$$ -25507 3146 1819 -4971 -7911 3324 26326 27136 11535 5067 -34320 -81002 -70008 -72103
15356g2103Q265K1169J9230M275k9824O855m293k8043p011K1656Q664j056J4182
$$ -72103 -63838 -42669 -23439 -19164 -48988 -42133 -46426 -74469 -81480 -59824 -51160 -52216 -38034
15343c8034m786l929O964Q79j6844j4629J6964J6379r835p538J9546J3372j0887
$$ -38034 -42820 -46749 -39785 -38906 -55750 -70379 -53415 -37036 -46871 -54409 -34863 -21491 -32378
15330c2378K6831j8599j7441L753k2931k2169K2080J8784k0624j4412J4887J7299
$$ -32378 -5547 -24146 -41587 -37834 -60765 -82934 -60854 -42070 -62694 -77106 -62219 -44920
15318d4920j8752l461J1680O254r354K280o542j7289L295L3865J1068r646p851
$$ -44920 -63672 -67133 -55453 -49199 -58553 -56273 -62815 -80104 -76809 -42944 -31876 -41522 -49373
15305d9373r950R099k0635J953o878M043J2227L1270Q631n905k3217k3397P498
$$ -49373 -59323 -50224 -70859 -68906 -75784 -71741 -59514 -28244 -19613 -25518 -48735 -72132 -64634
15292f4634J5084L0109J1116k4691k2802K8460M487l1503J4569k315K23O326L438
$$ -64634 -49550 -19441 -8325 -33016 -55818 -27358 -22871 -54374 -39805 -42120 -41897 -35571 -32133
15279c2133K6098o928k8582j1810M795O22M866L224L0139j4053L564p584j398
$$ -32133 -6035 -12963 -41545 -53355 -48560 -47938 -43072 -39848 -9709 -23762 -20198 -27782 -29180
15266b9180m516K240Q742O677o943j6745k3170m704K9193L1377J7628r404j2237
$$ -29180 -33696 -31456 -22714 -16037 -22980 -39725 -62895 -67599 -38406 -7029 10599 1195 -11042
15253a1042q66j0597J1796P206k935m033j7214r292K179N429K0797J3113J4692
$$ -11042 -11908 -22505 -10709 -3503 -6438 -10471 -27685 -36977 -34798 -29369 -8572 4541 19233
15240A9233k2134l3502J0423l403k5420r724L714j958j1379K9056R927K1151L8105
$$ 19233 -2901 -36403 -25980 -29383 -54803 -64527 -60813 -62771 -74150 -45094 -35167 -14016 24089
15227B4089M4924j8394l5347j9247j3823L0958J6925n849j6331j8264j3289j4828
$$ 24089 69013 50619 15272 -3975 -17798 13160 30085 24236 7905 -10359 -23648 -38476
15215c8476L5014J8795l1869j3843q490q342J9842J202j5600L572J4234m714j7195
$$ -38476 -3462 15333 -16536 -30379 -38869 -47211 -27369 -26167 -41767 -38195 -23961 -28675 -45870
15202d5870j5613J5333K4669p045Q063Q026K713L4302j1276k3829k7759q529j3959
$$ -45870 -61483 -46150 -21481 -28526 -20463 -12437 -9724 24578 13302 -10527 -38286 -46815 -60774
15189f0774J7954J6256l57M1238K1299j6097l6718j5041J4629K628j6834j5921
$$ -60774 -42820 -26564 -26921 14317 35616 19519 -17199 -32240 -17611 -14983 -31817 -47738
15177d7738J3556J2292j6485J6391j618J9896n614Q414n480l5086J2258n052L931
$$ -47738 -34182 -21890 -38375 -21984 -23602 -3706 -9320 -906 -6386 -41472 -29214 -34266 -30335
15164c0335r201k7J6873r260k4367Q091r1L547j355o063J7135J702l2951l8050
$$ -30335 -39536 -39563 -22690 -31950 -56317 -48226 -48317 -44770 -46125 -52188 -35053 -33351 -66302 -104352
15150a04352L5591L2381K905M15m168j7048o087J2171K5589J986m027m512j2280
$$ -104352 -68761 -36380 -33475 -33060 -37228 -54276 -60363 -48192 -22603 -20617 -24644 -29156 -41436
15137d1436K0092j7562k0959K313l8346K0533K219J16J7744J6835K2244L5029
$$ -41436 -21344 -38906 -59865 -57552 -95898 -75365 -73146 -73030 -55286 -38451 -16207 18822
15125A8822N339P849o104l448k5739k7695k2121J0775K0103J4849k1762j1057
$$ 18822 24161 32010 25906 22458 -3281 -30976 -53097 -42322 -22219 -7370 -29132 -40189
15113d0189k0896k98J7610k189L13k73Q664j3047r308K5177j4281r564O805N418
$$ -40189 -61085 -61383 -43773 -45962 -45649 -45922 -37258 -50305 -59613 -34436 -48717 -58281 -51476 -46058
15099d6058p040n536P763M518K5810K8400K5163L721l4918l7914k1603J6653J9740
$$ -46058 -53098 -58634 -50871 -46353 -20543 7857 33020 36741 1823 -36091 -57694 -41041 -21301
15086b1301K2208J2312m9753r840J0729j068Q73J7490r157Q821k02k125L824j6219
$$ -21301 907 13219 -36534 -46374 -35645 -36713 -35840 -18350 -27507 -18686 -18888 -21013 -17189 -33408
15072c3408M636j322J425l0726O76K4357J3394o357o282k293j3036j7694P537
$$ -33408 -28772 -30094 -28669 -59395 -58719 -34362 -20968 -27325 -33607 -35900 -48936 -66630 -59093
15059e9093K8309R850N978j616l783k2160K6064J1216j7106k137J9631L5166M401
$$ -59093 -30784 -20934 -14956 -16572 -20355 -42515 -16451 -5235 -22341 -24478 -4847 30319 34720
15046C4720j2452k6100m8949M1726l773k0497j0294o725O128m270J8613o903J3142
$$ 34720 22268 -3832 -52781 -11055 -14828 -35325 -45619 -52344 -46216 -50486 -31873 -38776 -25634
15033b5634K087K989o835j961n985P9K954J4527K143J0195Q662j5013k4214J0472
$$ -25634 -23547 -20558 -27393 -29354 -35339 -35260 -32306 -17779 -15636 -5441 3221 -11792 -36006 -25534
15019b5534J5796J4131l752j0663J3167j3646k3452O020j3842p735P143O752P629
$$ -25534 -9738 4393 641 -10022 3145 -10501 -33953 -27933 -41775 -49510 -42367 -35615 -27986
15006b7986K4772k0172j4419J2923K2314K0274M511k1790J365N522j3929k5863
$$ -27986 -3214 -23386 -37805 -24882 -2568 17706 22217 427 1792 7314 -6615 -32478
14994c2478j5116Q802J3164j4169l889J7281K5325R59k9757L860Q55k7220j5689
$$ -32478 -47594 -38792 -25628 -39797 -43686 -26405 -1080 -121 -29878 -26018 -25163 -52383 -68072
14981f8072K8517O084L759m841L328j4289M965q544R435K1691j0494o608J6156
$$ -68072 -39555 -33471 -29712 -34553 -31225 -45514 -40549 -49093 -39658 -17967 -28461 -35069 -18913
14968a8913K0169m6936k8329j4543J5015M0064O155N045J4427L582q783M066J2728
$$ -18913 1256 -45680 -74009 -88552 -73537 -33473 -27318 -22273 -7846 -4264 -13047 -8981 3747
14955C747k2461j9989J0751J8778J7101k1850j9523N306L5762Q414j7244j0636
$$ 3747 -18714 -38703 -27952 -9174 7927 -13923 -33446 -28140 7622 16036 -1208 -11844
14943a1844k5620k4874R538K6980Q700j3684J163j014n327J5829J5171j7261k7266
$$ -11844 -37464 -62338 -52800 -25820 -17120 -30804 -29641 -30655 -35982 -20153 -4982 -22243 -49509
14930d9509J056k3291Q552K5698k160O991j9004J494K4276L081P364j3342l548
$$ -49509 -48453 -71744 -63192 -37494 -39654 -32663 -51667 -50173 -25897 -22816 -15452 -28794 -32342
14917c2342j8759L1426J5524j1609j4933J6985J5780J1796o396j3702l023j7815
$$ -32342 -51101 -19675 -4151 -15760 -30693 -13708 2072 13868 7472 -6230 -9253 -27068
14905b7068M496K412q101k8779k471j4339J3794J2031J9251l336J1573R676K825
$$ -27068 -22572 -20160 -28261 -57040 -59511 -73850 -60056 -48025 -28774 -32110 -20537 -10861 -8036
14892h036k2895o35J9955J9618j7264k4651N352j5868m688j6465l239R016k285
$$ -8036 -30931 -31566 -11611 8007 -9257 -33908 -28556 -44424 -49112 -65577 -68816 -59800 -62085
14879f2085L5296K1988N395J4689j3491k5771k3314K7269J8064k1656j6039j8512
$$ -62085 -26789 -4801 594 15283 1792 -23979 -47293 -20024 -1960 -23616 -39655 -58167
14867e8167k0684l617N396j2907J4908L4349N173K3801J6735k2738j8921Q88J6369
$$ -58167 -78851 -82468 -77072 -89979 -75071 -40722 -35549 -11748 4987 -17751 -36672 -35784 -19415
14854a9415j8867k1926j1173J4895K5834J6366J1422n070j7750M859N35r736j4533
$$ -19415 -38282 -60208 -71381 -56486 -30652 -14286 -2864 -7934 -25684 -20825 -20290 -30026 -44559
14841d4559j6781K5299J4710O70j2883k745o250l6925P755M0775J5938J3331K3192
$$ -44559 -61340 -36041 -21331 -20661 -33544 -36289 -42539 -79464 -71709 -30934 -14996 -1665 21527
14828B1527j6896q866J8775l1299k8592l797J4334k0232j7235m4K8666J3792j3731
$$ 21527 4631 -4235 14540 -16759 -45351 -49148 -34814 -55046 -72281 -72325 -43659 -29867 -43598
14815d3598j5403o406p726J4281K0231N112J1814j1300q692p734J3250Q408J2049
$$ -43598 -59001 -65407 -73133 -58852 -38621 -33509 -21695 -32995 -41687 -49421 -36171 -27763 -15714
14802a5714j5162k627k627L6012L869n282n985j9504k6727n971J655k050K245
$$ -15714 -30876 -33503 -36130 -118 3751 -1531 -7516 -27020 -53747 -59718 -58063 -60113 -57868
14789e7868P094p717j1929K4247M1585o164J352O715j0389q704k301j2826j644
$$ -57868 -50774 -58491 -70420 -46173 -4588 -10752 -9400 -2685 -13074 -21778 -24079 -36905 -38549
14776c8549j179r234n107J7605J5735r845J1541J7105N651J4926j8487l3584j1296
$$ -38549 -39728 -48962 -54069 -36464 -20729 -30574 -19033 -1928 3723 18649 162 -33422 -44718
14763d4718R44Q650j43J477R615N154O84j1533O100L3371J3930k6278j8684j1819
$$ -44718 -43774 -35124 -35267 -33790 -24175 -19021 -18337 -29870 -23770 9601 23531 -2747 -21431 -33250
14749c3250j4031q246L7825J2752j1192J2625K0765q215j3631m45Q446L937k7556
$$ -33250 -47281 -55527 -17702 -4950 -16142 -3517 17248 9033 -4598 -5043 3403 7340 -20216
14736b0216l1470J0765K4246L724J2965K6693n531k7037l2200l8440L950K3014
$$ -20216 -51686 -40921 -16675 -12951 14 26707 21176 -5861 -38061 -76501 -72551 -49537
14724d9537o191J381j220J6910n925k639p229K0378L055l283k288L0279n571l6667
$$ -49537 -55728 -54347 -55567 -38657 -44582 -47221 -54450 -34072 -31017 -34300 -36588 -6309 -11880 -48547
14710d8547j4780J8764r8J7478j0792o948j898k36j6691j3453l0457K0797L3249
$$ -48547 -63327 -44563 -44661 -27183 -37975 -44923 -46821 -47057 -63748 -77201 -107658 -86861 -53612
14697e3612K4952J7282R160l0958R693N769o564J5245Q362r393k1971j668K1093
$$ -53612 -28660 -11378 -2218 -33176 -23483 -17714 -24278 -9033 -671 -10064 -32035 -33703 -12610
14684a2610Q334j3906j4356J4626l223r569j5386j4417J9322J2312J2945r888
$$ -12610 -4276 -18182 -32538 -17912 -21135 -30704 -46090 -60507 -41185 -28873 -15928 -25816
14672b5816k7874L692K4870k0691k1418J2297J7602j0178o372L211O755j9843
$$ -25816 -53690 -49998 -25128 -45819 -67237 -54940 -37338 -47516 -53888 -50677 -43922 -63765
14660f3765j7777L634L8058M5227M1207J4473k5823l2437l1858l2140K3889J8349
$$ -63765 -81542 -77908 -39850 5377 46584 61057 35234 2797 -29061 -61201 -37312 -18963
14648a8963j2757n288K8774Q933P727j6657j5194q665j6864M893J5965J1019j3981
$$ -18963 -31720 -37008 -8234 699 8426 -8231 -23425 -32090 -48954 -44061 -28096 -17077 -31058
14635c1058r096L0929p754j7978m60l4015l1887M7771K3109J7316j8451q37m955
$$ -31058 -40154 -9225 -16979 -34957 -35417 -69432 -101319 -53548 -30439 -13123 -31574 -32411 -37366
14622c7366O484J5J3408j6238l93J2188n075J591j3293M548r243j5128J0912J0962
$$ -37366 -30882 -30867 -17459 -33697 -34090 -21902 -26977 -25386 -38679 -34131 -43374 -58502 -47590 -36628
14608c6628Q902l1991q327K8152O64j2085K8507L8388K679n447j0422k6349Q479
$$ -36628 -27726 -59717 -68044 -39892 -39228 -51313 -22806 15582 18261 12814 2392 -23957 -15478
14595a5478N974r538j0032j364K5258K549k3791l3359k7841m282J4696M3449J2996
$$ -15478 -9504 -19042 -29074 -30438 -5180 -2631 -26422 -59781 -87622 -91904 -77208 -33759 -20763
14582b0763K3465K4869m780m0300k0932L1316j5468j3256J8770j983L601J5768
$$ -20763 2702 27571 22791 -17509 -38441 -7125 -22593 -35849 -17079 -19062 -15461 307
14570C07Q894J69q354j7037J377k7870M670R86n673J1891J0243P147j0063j9746
$$ 307 9201 9370 1016 -16021 -14644 -42514 -37844 -36858 -42531 -30640 -20397 -13250 -23313 -43059
14556d3059k1453K9170K6707J4202o762l1846j3337J1207K2966J2433k6783K519
$$ -43059 -64512 -35342 -8635 5567 -1195 -33041 -46378 -35171 -12205 228 -26555 -24036
14544b4036R982J4010r462L1638P203j7481n785J223J4947K052J126p922j0822
$$ -24036 -14054 -44 -9506 22132 29335 11854 6069 7292 22239 24291 25417 17495 6673
14531F673J0777K7574P14o049l7482K819j5176j1624K525L0215M658j8750N569
$$ 6673 17450 45024 45738 39689 2207 5026 -10150 -21774 -19249 10966 15624 -3126 2443
14518B443K7571J8439K9188k7207J412p300K401j7515l2964j5841J8633L2064
$$ 2443 30014 48453 77641 50434 51846 44546 46947 29432 -3532 -19373 -740 31324
14506C1324J461l3116K382P063o836k1187J6971k52l170k4792j3604L6438J7980
$$ 31324 32785 -331 2051 9114 2278 -18909 -1938 -2190 -5360 -30152 -43756 -7318 10662
14493A0662K6460J2522l4070k3413k5566R855K0579k0743l538j511J8550L50j1264
$$ 10662 37122 49644 15574 -7839 -33405 -23550 -2971 -23714 -27252 -28763 -10213 -9863 -21127
14480b1127L2888j567k2360P287K1048j074j9057j6891l000R395K7375o246j2373
$$ -21127 11761 10194 -12166 -4879 16169 15095 -3962 -20853 -23853 -14458 12917 6671 -5702
14467e702j1112P447M578k246K738J8208r998r072J0397j8419r533M395j3563
$$ -5702 -16814 -9367 -4789 -7035 -4297 13911 3913 -5159 5238 -13181 -22714 -18319 -31882
14454c1882n769j2325k361M4350K8427l091p2544n0321L4242K1344K1445Q264
$$ -31882 -37651 -49976 -52337 -7987 20440 17349 -55195 -105516 -71274 -49930 -28485 -20221
14442b0221p178o911j844J0507q808R485Q406j3103j0496L4867k5944j7011J4282
$$ -20221 -27399 -34310 -36154 -25647 -34455 -24970 -16564 -29667 -40163 -5296 -31240 -48251 -33969
14429c3969J6727M430J2779n339j2335O969M789m0332j0822K8926R978L895j0396
$$ -33969 -17242 -12812 -33 -5372 -17707 -10738 -5949 -46281 -57103 -28177 -18199 -14304 -24700
14416b4700j6097k0920j0324N045M4752P200P901K907p951L073j484J466J8842
$$ -24700 -40797 -61717 -72041 -66996 -22244 -15044 -7143 -4236 -12187 -9114 -10598 -9132 9710
14403I710P941k8039j1406M0484J0150j6519l9047l1219k4084q508K3647L0938
$$ 9710 17651 -10388 -21794 18690 28840 12321 -26726 -57945 -82029 -90537 -66890 -35952
14391c5952m597k4705m474M0476L2535j3778j4375r000N012n1460r258L0776K9172
$$ -35952 -40549 -65254 -69728 -29252 3283 -10495 -24870 -33870 -28858 -80318 -89576 -58800 -29628
14378b9628K1594k3903J070J8428K2856j7207k608j618k703p269K3204j1387o563
$$ -29628 -8034 -31937 -30867 -12439 10417 -6790 -9398 -11016 -13719 -20988 2216 -9171 -15734
14365a5734j2624j2102J9720J1363J594J4178K803K1059j5427m4391k1588R843
$$ -15734 -28358 -40460 -20740 -9377 -7783 6395 9198 30257 14830 -29561 -51149 -41306
14353d1306j1934K0075N559r570o172J8650K6736Q047j5650n955j7430L0322q120
$$ -41306 -53240 -33165 -27606 -37176 -43348 -24698 2038 10085 -5565 -11520 -28950 1372 -6748
14340f748l4057j4156K9013M346J260K2306m673j9252j5278M905J7557J9354j7779
$$ -6748 -40805 -54961 -25948 -21602 -20342 1964 -2709 -21961 -37239 -32334 -14777 4577 -13202
14327a3202k3224j0211k2289k1192J0439K3924k259L693j120q729J6219J9959
$$ -13202 -36426 -46637 -68926 -90118 -79679 -55755 -58014 -54321 -55441 -64170 -47951 -27992
14315b7992M2597j008j755q433j9790J18p297j5411K453j7912j6969L0022K346
$$ -27992 14605 13597 11842 3409 -16381 -16263 -23560 -38971 -36518 -54430 -71399 -41377 -39031
14302c9031J3398j3328K170j0241J4189O463j0774L846k7571O161N877j7131q613
$$ -39031 -25633 -38961 -36791 -47032 -32843 -26380 -37154 -33308 -60879 -54718 -48841 -65972 -74585
14289g4585J5455R193j5371j8190O161J2415k794k61K4994J2478l661m379j129
$$ -74585 -59130 -49937 -65308 -83498 -77337 -64922 -67716 -67977 -42983 -30505 -34166 -38545 -39674
14276c9674m817M7235J504k3613k2078J9928q676J3719j3285O761L115j091j4474
$$ -39674 -44491 2744 4248 -19365 -41443 -21515 -30191 -16472 -29757 -22996 -19881 -20972 -35446
14263c5446J8413O571j7732p951q000J0741j8545J3489K8860q548k06M337J8024
$$ -35446 -17033 -10462 -28194 -36145 -44145 -33404 -51949 -38460 -9600 -18148 -18354 -14017 4007
14250D007J8884k4140j0281q084p309K2862l191k06k9794k6387o704j6399M76
$$ 4007 22891 -1249 -11530 -19614 -26923 -4061 -7252 -7458 -37252 -63639 -70343 -86742 -86266
14237h6266n133K6930K5998l507m594j841K970L479K0750K7573o673n489J0112
$$ -86266 -91399 -64469 -38471 -41978 -46572 -48413 -45443 -41964 -21214 6359 -314 -5803 4309
14224D309k3397L519O026J1563j0529j1202J2999j4860m3736J2086J2044J7704
$$ 4309 -19088 -15569 -9543 2020 -8509 -19711 -6712 -21572 -65308 -53222 -41178 -23474
14212b3474K7n448K2095j34k2219n601m231j4236N612J1857o636K3612P387k3571
$$ -23474 -23447 -28895 -6800 -6934 -29153 -34754 -38985 -53221 -47609 -35752 -42388 -18776 -11389 -34960
14198c4960j2838k906Q072J6915k0896j1747j2224j3111L7047K560L0102L9875
$$ -34960 -47798 -50704 -42632 -25717 -46613 -58360 -70584 -83695 -46648 -44088 -13986 25889
14186B5889o27n801k6204k8743P288m718l212M417n003j7467j818O500j172M4845
$$ 25889 25262 19461 -6743 -35486 -28198 -32916 -36128 -31711 -36714 -54181 -55999 -49499 -50671 -5826
14172e826N615o360j0014n760k4848j5191K1946J9227J1264o4k1351R318J4092
$$ -5826 -211 -6571 -16585 -22345 -47193 -62384 -40438 -21211 -9947 -10011 -31362 -22044 -7952
14159g952j6869n537K0187j34k7355K2466L146j5696m353j622l0801k0826K7894
$$ -7952 -24821 -30358 -10171 -10305 -37660 -15194 -12048 -27744 -32097 -33719 -64520 -85346 -57452
14146e7452M8861K3543J9661k3020j2462K0247k6418K843M145K5628j1362q868
$$ -57452 -8591 14952 34613 11593 -869 19378 -7040 -4197 -52 25576 14214 5346
14134E346n569K0131J7940j5123j9302M739j0929j1316k9432j7238J751m227L3660
$$ 5346 -223 19908 37848 22725 3423 8162 -2767 -14083 -43515 -60753 -59002 -63229 -29569
14121b9569P973m651j9887l2533j7187J7687M3265J0070j0064O452J7145K5778
$$ -29569 -21596 -26247 -46134 -78667 -95854 -78167 -34902 -24832 -34896 -28444 -11299 14479
14109A4479N70J351J4714K756K645L871o235j6444j4032l384k6062K8181J0171
$$ 14479 15049 16400 31114 33870 36515 40386 34151 17707 3675 291 -25771 2410 12581
14096A2581l101l531j254l309Q764l3381m943J5916j527l618q448J7489K4288
$$ 12581 9480 5949 4695 1386 10150 -23231 -28174 -12258 -13785 -17403 -25851 -8362 15926
14083A5926j3394N722k8977j4658j1784J4873K0601J7390J7001o867k3116K4676
$$ 15926 2532 8254 -20723 -35381 -47165 -32292 -11691 5699 22700 15833 -7283 17393
14071A7393J7636k6065k3008K5158K244k0712k555l2730n1932J056L9199L0605
$$ 17393 35029 8964 -14044 11114 13358 -7354 -9909 -42639 -94571 -93515 -54316 -23711
14059b3711m072k6061L667L1886M277O380K979L008N524j3985j5663j3666J2705
$$ -23711 -27783 -53844 -50177 -18291 -14014 -7634 -4655 -1647 3877 -10108 -25771 -39437 -26732
14046b6732K957m010O939J7886j4490n316K5153R065J3401R620j0321j6835j3198
$$ -26732 -23775 -27785 -20846 -2960 -17450 -22766 2387 11452 24853 34473 24152 7317 -5881
14033e881J8182qj1555J601j3123k860l156R053o310m550j888j1365J5565K1361
$$ -5881 12301 12293 738 2339 -10784 -13644 -16800 -7747 -14057 -18607 -20495 -31860 -16295 5066
14019E066l66P60L2796p772p49j9066J345j5934k6758J9641L3251j5425R665N254
$$ 5066 4700 5460 38256 30484 29735 10669 12014 -3920 -30678 -11037 22214 6789 16454 21708
14005B1708J3218j5506j8590j5291n337j3274R912R873K5049M3799J5616j3888
$$ 21708 34926 19420 830 -14461 -19798 -33072 -23160 -13287 11762 55561 71177 57289
13993E7289l5828k8128j4228N48K1836J7428j5624m310j0510k0566r124p782k3849
$$ 57289 21461 -6667 -20895 -20347 1489 18917 3293 -1017 -11527 -32093 -41217 -48999 -72848
13980g2848K2369K0942m988M234l7142M434J9949M3939J0067n731k5345j1103
$$ -72848 -50479 -29537 -34525 -30291 -67433 -62999 -43050 889 10956 5225 -20120 -31223
13968c1223J9428J874K8470n01k5915l2906j1880K9742K1139J2328O060q383j3971
$$ -31223 -11795 -9921 18549 18048 -7867 -40773 -52653 -22911 -1772 10556 16616 8233 -5738
13955e738K2378N107j5802K566l996r667J6791K2762J3675l4099l2266j4483j1045
$$ -5738 16640 21747 5945 8511 4515 -5152 11639 34401 48076 13977 -18289 -32772 -43817
13942d3817j6232J0617K1530K3455K756j757L391Q554l4119K3493L2010J4606
$$ -43817 -60049 -49432 -27902 -4447 -1691 -3448 -57 8497 -25622 -2129 29881 44487
13930D4487l906K376k2387m1436J845l81K718L735J4317o293k261o167p746k0954
$$ 44487 40581 42957 20570 -20866 -19021 -19402 -16684 -12949 1368 -4925 -7186 -13353 -21099 -42053
13916d2053J1643k681o704M6395K4935j588j2204J6342K947k7446m1319k963J2763
$$ -42053 -30410 -33091 -39795 6600 31535 29947 17743 34085 37032 9586 -31733 -34696 -21933
13903b1933P165P692q205k816j597j2855K2626R414P257j1663M896J5884r057
$$ -21933 -14768 -7076 -15281 -18097 -19694 -32549 -9923 -509 6748 -4915 -19 15865 6808
13890F808j1392l4236j3185J8894R190J4709N1863j3191j7093j1774k3546j9844
$$ 6808 -4584 -38820 -52005 -33111 -23921 -9212 42651 29460 12367 593 -22953 -42797
13878d2797j446k8538P532k086l114p650J5361L5142K2665k1991j926J4567O230
$$ -42797 -44243 -72781 -65249 -67335 -70449 -78099 -62738 -27596 -4931 -26922 -28848 -14281 -8051
13865h051J8340p983l445j1203J7642J1654j1622j0797m804J1346r380M214k9561
$$ -8051 10289 2306 -1139 -12342 5300 16954 5332 -5465 -10269 1077 -8303 -4089 -33650
13852c3650R555L0000j2595j1464j4434J0987J007N545q553J7726J0757J7874
$$ -33650 -24095 5905 -6690 -18154 -32588 -21601 -20594 -15049 -23602 -5876 4881 22755
13840B2755Q232j5616j6958k4729J5635J577j0821K5784k237k6559k7033L269
$$ 22755 30987 15371 -1587 -26316 -10681 -9104 -19925 5859 3622 -22937 -49970 -46701
13828d6701M3799K7477n550M86K2223j2505o805r71Q387J241K8051M657J2295
$$ -46701 -2902 24575 19025 19511 41734 29229 22424 21453 29840 31081 59132 63789 76084
13815G6084j7877j2223l2941k5422j5161j3275J0359K1173L1379K0345j8928k7612
$$ 76084 58207 45984 13043 -12379 -27540 -40815 -30456 -9283 22096 42441 23513 -4099
13803d099j7826M658J0882K5752q049J307J0955n546J4048M921n728j4878k7837
$$ -4099 -21925 -17267 -6385 19367 11318 12625 23580 18034 32082 37003 31275 16397 -11440
13790a1440K901J8859k0873K0543K8278q173k9023j7321n154N554J5043J0479
$$ -11440 -8539 10320 -10553 9990 38268 30095 1072 -16249 -21403 -15849 -806 9673
13778I673J4812J8048L540j4543j1630l0263k2132k436j2540J5541N918J6018
$$ 9673 24485 42533 46073 31530 19900 -10363 -32495 -34931 -47471 -31930 -26012 -9994
13766i994N471q847j4325N0561K5318J093l089O154K2057n105k1446k6821k1924
$$ -9994 -4523 -13370 -27695 22866 48184 49277 46188 52342 74399 69294 47848 21027 -897
13753h97J9775k9351J033J6306M8319l376m1951j5698J5070J1493j6702p429p901
$$ -897 18878 -10473 -9440 6866 55185 51809 9858 -5840 9230 20723 4021 -3408 -11309
13740a1309J2691o573j6688J6810L3452N485P937M920J4950K3491P32j2409p968
$$ -11309 1382 -5191 -21879 -5069 28383 33868 41805 46725 61675 85166 85898 73489 65521
13727F5521P992j0083l5468l1345j6743K2251L3053K009m952j5675k004n35J9210
$$ 65521 73513 63430 27962 -3383 -20126 2125 35178 37187 32235 16560 14556 14021 33231
13714C3231p866l1401o828O85j07N379j029k7813k9491p708J4143J4410J1920
$$ 33231 25365 -6036 -12864 -12179 -12286 -6907 -7936 -35749 -65240 -72948 -58805 -44395 -32475
13701c2475K5517k4408Q975K6295J4512O99K6815Q18j1236j7045R627J9115r28
$$ -32475 -6958 -31366 -22391 3904 18416 19115 45930 46748 35512 18467 28094 47209 46281
13688D6281j9421l1550k1821J965j925j5942J8869J6827J2054J1672k4621m0237
$$ 46281 26860 -4690 -26511 -24546 -26471 -42413 -23544 -6717 5337 17009 -7612 -47849
13676d7849P118L8332M330k3429j4977R380L4720j172l4719K4941J2143K636J9886
$$ -47849 -40731 -2399 1931 -21498 -36475 -27095 7625 6453 -28266 -3325 8818 11454 31340
13663C1340j6097l2266m781k336K7010j1214j7742P959J2950m720K0363L4239
$$ 31340 15243 -17023 -21804 -24140 2870 -8344 -26086 -18127 -5177 -9897 10466 44705
13651D4705O432J4554O573j5821L385K9629P731q375j6549j8772k5563o597n0
$$ 44705 51137 65691 72264 56443 59828 89457 97188 88813 72264 53492 27929 21332 21282
13638B1282j4336q428J8400L810l8799N071K922q366j363J5966J0302Q04R444
$$ 21282 6946 -1482 16918 20728 -18071 -13000 -10078 -18444 -19807 -3841 6461 7265 16709
13625A6709J99J1192K493k4591j6578O307j0670P387J3461L980N978J7608M065
$$ 16709 16908 28100 30593 6002 -10576 -4269 -14939 -7552 5909 9889 15867 33475 37540
13612C7540j1506j5970O170K0306n545j976K2227J4532k8507q894j3354k0674
$$ 37540 26034 10064 16234 36540 30995 29019 51246 65778 37271 28377 15023 -5651
13600e651k4230K097K9497q252l629K1220M28J3189j124k3484k425k4385R771
$$ -5651 -29881 -27784 1713 -6539 -10168 11052 11480 24669 23545 61 -2364 -26749 -16978
13587a6978J7652J1216Q154l4538p663j4160N717L3351K4173j7128J4359J523
$$ -16978 674 11890 20044 -14494 -22157 -36317 -30600 2751 26924 9796 24155 25678
13575B5678j1607R512j1189m971l125J1116j0179Q166L5439L914l5194k7244j5122
$$ 25678 14071 23583 12394 7423 4298 15414 5235 13401 48840 52754 17560 -9684 -24806
13562b4806K0180L185K058L254J6257j6126J9815J0109j3961j0302O855j7614
$$ -24806 -4626 -1441 617 3871 20128 4002 23817 33926 19965 9663 16518 -1096
13550a096k977o103q064l031K3568J6970N856r52O944q295k5835j7749J181j606
$$ -1096 -4073 -10176 -18240 -21271 2297 19267 25123 24171 31115 22820 -3015 -20764 -19583 -21189
13536b1189J3246j519q375J7681K605L72j2186J3832j0136K9696J2238J5647K1946
$$ -21189 -7943 -9462 -17837 -156 2449 2821 -9365 4467 -5669 24027 36265 51912 73858
13523G3858j3684j9538N959N37Q842Q875k362m563j4977J1379j1498J0297J2192
$$ 73858 60174 40636 46595 47132 55974 64849 62487 57924 42947 54326 42828 53125 65317
13510F5317j4763m3990P406K529q835J740M2001J2486J2679M687n2233j8072K0131
$$ 65317 50554 6564 13970 16499 7664 9404 51405 63891 76570 81257 29024 10952 31083
13497C1083j7325N203J6377j3791k6284J0754N598J726o403J1495n687K4236j0128
$$ 31083 13758 18961 35338 21547 -4737 6017 11615 13341 6938 18433 12746 36982 26854
13484B6854N023l7410L3316N928j4561l5419q121L2631L437L704K198n543j6280
$$ 26854 31877 -5533 27783 33711 19150 -16269 -24390 8241 11678 15382 17580 12037 -4243
13471d243M797r35j4694l7719q63L6524M1462L287r72N926J1471o629p819Q205
$$ -4243 554 -381 -15075 -52794 -53657 -17133 24329 27616 26644 32570 44041 37412 29593 37798
13457C7798L351J3209j5668N432L4513L4653M285J1067M38K749k6888m0059l4975
$$ 37798 41149 54358 38690 44122 78635 113288 117573 128640 129078 131827 104939 64880 29905
13444B9905r56M0689J8403j7543Q984J5794N494Q277l362J351k768m5129k8412
$$ 29905 28949 69638 88041 70498 79482 95276 100770 109047 105685 107036 104268 59139 30727
13431C0727K1652K4165J224Q422j1559l6573k4345j7646M942O575q043M331P732
$$ 30727 52379 76544 77768 86190 74631 38058 13713 -3933 1009 7584 -459 3872 11604
13418A1604O359J3113j40J7674j2277k9299m600K9043K8468L152j0741r113O346
$$ 11604 17963 31076 30936 48610 36333 7034 2434 31477 59945 63097 52356 43243 49589
13405D9589j0154r744K214j222m990k974m597J5774J0676j7822j1544J2392n271
$$ 49589 39435 29691 31905 30683 25693 22719 18122 33896 44572 26750 15206 27598 22327
13392B2327J4496K8740l442k6481j1801q537L271J4304J6749l039k0647j7551
$$ 22327 36823 65563 62121 35640 23839 15302 18573 32877 49626 46587 25940 8389
13380H389R827L3276J2476J984k0144l329m216j6806N67j574k1661O082J1416
$$ 8389 18216 51492 63968 65952 45808 42479 38263 21457 22024 20450 -1211 4871 16287
13367A6287n478M358M897l554j5102J9832M4517P922k4372L791J7106j5408l3917
$$ 16287 10809 15167 20064 16510 1408 21240 65757 73679 49307 53098 70204 54796 20879
13354B0879J2812j2509n369K0180L8055N146k1605m2479J2200K5532l183m203
$$ 20879 33691 21182 15813 35993 74048 79194 57589 15110 27310 52842 49659 45456
13342D5456r238j1592J6120L0647l2094J0814J5458R882j924j4930R066k0889
$$ 45456 36218 24626 40746 71393 39299 50113 65571 75453 73529 58599 67665 46776
13330D6776j4262P033j010j6981J2429J6900N221q099k5082p802l323J4913J5362
$$ 46776 32514 39547 38537 21556 33985 50885 56106 48007 22925 15123 11800 26713 42075
13317D2075K0048K0747j8529k71j2532j5776p581K7205L9568Q186l9109k1461
$$ 42075 62123 82870 64341 64070 51538 35762 28181 55386 94954 103140 64031 42570
13305D2570L1370J7028j5665o883l7533l195j1407J0990q004M759J9523K216n1841
$$ 42570 73940 90968 75303 68420 30887 27692 16285 27275 19271 24030 43553 45769 -6072
13292f072m3472K8389O3163P183K397j4986J2922K7007m671j8514J3684j3315
$$ -6072 -49544 -21155 42008 49191 51588 36602 49524 76531 71860 53346 67030 53715
13280E3715l90r47L3141r831j4080q007J3129j3860k8394k7863j9572L138L4435
$$ 53715 53325 52378 85519 75688 61608 53601 66730 52870 24476 -3387 -22959 -19821 14614
13267A4614M149K5827L1308j8817j6053o129j0392J3441J9104N085j0314j8255
$$ 14614 18763 44590 75898 57081 41028 34899 24507 37948 57052 62137 51823 33568
13255C3568K0287K9728j0577p239n016l797q242K8185K0817l148p465p82j1394
$$ 33568 53855 83583 73006 65767 60751 56954 48712 76897 97714 94566 87101 86319 74925
13242G4925J4641n407p867N068O306q939j6659J2871L643L680j2718J0333N098
$$ 74925 89566 84159 76292 81360 87666 78727 62068 74939 78582 82262 69544 79877 84975
13229H4975K0584k9889r363K3293l853j2753j5111k7719P746K4025m123j993J1011
$$ 84975 105559 75670 66307 89600 85747 72994 57883 30164 37910 61935 57812 55819 66830
13216F6830j6825J7468J0699J1932j1375l1947l630K3108j137k9663j8432l569
$$ 66830 50005 67473 78172 90104 78729 46782 43152 66260 65123 35460 17028 13459
13204A3459o084R425L4996K8087N009k1552q865k2993J0992J9715J1062j0995
$$ 13459 7375 16800 51796 79883 84892 63340 54475 31482 42474 62189 73251 62256
13192F2256r867k8944M602K2392K7142J4474J1149o756m942q793k2417J9818m773
$$ 62256 52389 23445 28047 50439 77581 92055 103204 96448 91506 82713 60296 80114 75341
13179G5341o21o90J9377O726J140k2595K908q829k9461j2515J8243P500K9949
$$ 75341 74720 74030 93407 100133 101273 78678 81586 72757 43296 30781 49024 56524 86473
13166H6473j0668j9615M2411K0653M892l4592j1231L109N005K3175r001l1567
$$ 86473 75805 56190 98601 119254 124146 89554 78323 81432 86437 109612 100611 69044
13154F9044k307J2932r242M967K492j7701K8284L736j4063k3087j3877J7475J4835
$$ 69044 66737 79669 70427 75394 77886 60185 88469 92205 78142 55055 41178 58653 73488
13141G3488K205Q45j6840n875J1172L55j4716k1620Q836Q337k740J1844J0058
$$ 73488 75693 76538 59698 53823 64995 65350 50634 29014 37850 46187 43447 55291 65349
13128F5349J335r546k881J665o185l514N730J1034o398k3619K6947J3666N470
$$ 65349 66684 57138 54257 55922 49737 46223 51953 62987 56589 32970 59917 73583 79053
13115G9053K373o332K3559l3491M440M699j6522q39J5003N291J9598j6719l0855
$$ 79053 81426 75094 98653 65162 69602 74301 57779 56940 71943 77234 96832 80113 49258
13102D9258n380L71L565j2833L8575M588j2330j4965j278M4565P773j0998j2688
$$ 49258 43878 44249 47814 34981 73556 78144 65814 50849 49571 94136 101909 90911 78223
13089G8223q875j5100q230l226J5860J7963l35j9137q703J4939J7478J5820M8273
$$ 78223 69348 54248 46018 42792 58652 76615 76280 57143 48440 63379 80857 96677 144950
13076A44950N354N450j6288l0129k2867J9408K1050o958k7510O714R750J0616
$$ 144950 150304 155754 139466 109337 86470 105878 126928 119970 92460 99174 108924 119540
13064A19540j788k967K923L190l333j0874n593k0484K975j0617J2163J2994m66
$$ 119540 117752 114785 117708 120898 117565 106691 101098 80614 83589 72972 85135 98129 97663
13051I7663j3785j9526j5199L45J7625O296R620J0591J2645J0108k2192k6835
$$ 97663 83878 64352 49153 49498 67123 73419 83039 93630 106275 116383 94191 67356
13039F7356J2849j0367M866K0881K4794J1405k329J81J7830N48l6604k3730J5041
$$ 67356 80205 69838 74704 95585 120379 131784 129455 129636 147466 148014 111410 87680 102721
13026A02721j0637O572K3543j4403k1499k352j648K0363j04o87O928j2664J9627
$$ 102721 92084 98656 122199 107796 86297 83945 82297 102660 102556 101869 108797 96133 115760
13013A15760m31J3131M6402L7375o380n094M95j7414n324P854K5812k3126K4507
$$ 115760 115329 128460 174862 212237 205857 200763 201258 183844 178520 186374 212186 189060 213567
13000B13567K842M818L9432N4788K4329J2066P4551J14930J31432J81613K06829
$$ 213567 216409 221227 260659 315447 339776 351842 426393 541323 672755 854368 1061197
12989A061197K25860K48410K09793J98567J20573N2516M440o9899j20297j74800
$$ 1061197 1287057 1535467 1745260 1943827 2064400 2116916 2121356 2051457 1931160 1756360
12979A756360j95579k14575k07004j89403j73357j08273q1309p6805l9534l2446
$$ 1756360 1560781 1346206 1139202 949799 776442 668169 586860 510055 470521 438075
12969D38075j9802k1700l1627J6571n6k2067o02j8824k8334k3453k4609k5524
$$ 438075 418273 396573 364946 381517 381461 359394 358792 339968 311634 288181 263572 238048
12957B38048k4617o400J925K8372J3522j4074n67J8794J2325l4432j6393j480
$$ 238048 213431 207031 208956 237328 250850 236776 236209 255003 267328 232896 216503 215023
12945B15023k2553R209L6323N640j6337N110k1464j9346O607l231K2505l98k3395
$$ 215023 192470 201679 238002 243642 227305 232415 210951 191605 198212 194981 217486 217088 193693
12932A93693j684J9529m110Q523o370M151j2470J0135M754M845j114j1177O290
$$ 193693 192009 211538 207428 215951 209581 213732 201262 211397 216151 220996 219882 208705 214995
12919B14995j7095k1520k8404j8174L0218R682Q449m676k1293k826J3834k5725
$$ 214995 197900 176380 147976 129802 160020 169702 178151 173475 152182 149356 163190 137465
12907A37465l1632J1344J6323J2385J3083q100j7600K3982O105J4645j7125j5965
$$ 137465 105833 117177 133500 145885 158968 150868 133268 157250 163355 178000 160875 144910
12895A44910j3280l248m658J3050J3140J5117R667K0674K638l8603l416K2346
$$ 144910 131630 128382 123724 136774 149914 165031 174698 195372 198010 159407 155991 178337
12883A78337N855k740r410j1698l828l3269m2652K1759M3911J4925J0895L8071
$$ 178337 184192 181452 172042 160344 156516 123247 80595 102354 146265 161190 172085 210156
12871B10156j1902j8523j1495J0852O115K973J5987J8415J1026Q853N509j3039
$$ 210156 198254 179731 168236 179088 185203 188176 204163 222578 233604 242457 247966 234927
12859B34927L3057n156K1603M939O825j4561n1121l5740K2064J6933k881m012
$$ 234927 267984 262828 284431 289370 296195 281634 230513 194773 216837 233770 230889 226877
12847B26877l896K7006p225P555K4424N972j0632o203M325p691K271N391r162
$$ 226877 222981 249987 242762 250317 274741 280713 270081 263878 268203 260512 262783 268174 259012
12834B59012K6906L1004R95Q465J0442J7851N712j5876j1052K981P382J5514O213
$$ 259012 285918 316922 317917 326382 336824 354675 360387 344511 333459 336440 343822 359336 365549
12821C65549Q264k2914q974J6140L4282Q913J0215k705J734j7475l4556j0970
$$ 365549 373813 350899 341925 358065 392347 401260 411475 408770 410504 393029 358473 347503
12809C47503K0201L2970L0832J0491k8986k6936P011M324k7520j5411m677l1305
$$ 347503 367704 400674 431506 441997 413011 386075 393086 397410 369890 354479 349802 318497
12797C18497k20J5481k7046j3051j4700k7350N504M4444K9323P341P115j2317
$$ 318497 318277 333758 306712 293661 278961 251611 257115 301559 330882 338223 345338 333021
12785C33021R107j0337j8301Q463q06j3745K1969q38j5943P2R45J3319N6049Q720
$$ 333021 342128 331791 313490 321953 321147 307402 329371 328533 312590 312662 313607 326926 382975 391695
12771C91695m935j9706Q600M480N645p544J2310l618L5925J7891L808K2722M7667
$$ 391695 386760 367054 375654 380134 385779 378235 390545 386927 422852 440743 444551 467273 514940
12758E14940J3755L3406L9320N4689L0990J7466L1908K8201j3325j2555n6353
$$ 514940 528695 562101 601421 656110 687100 704566 736474 764675 751350 738795 682442
12747F82442n9787n6941m4947k3948m6969m3663l4254N371K529k1920J3440P064
$$ 682442 622655 565714 520767 496819 449850 406187 371933 377304 379833 357913 371353 378417
12735C78417j8577P699k7284n0742J644K1176O347p953J9251J7071K3052K8132
$$ 378417 359840 367539 340255 289513 291157 312333 318680 310727 329978 347049 370101 398233
12723C98233J6340P240J325K0588K0594N0588J0409R61M673k1522j8079m3649
$$ 398233 414573 421813 423138 443726 464320 514908 525317 526278 530951 509429 491350 447701
12711D47701j9087k4161n3400o0958m0351k3346J3492P578k100J5660J5799J7301
$$ 447701 428614 404453 351053 290095 249744 226398 239890 247468 245368 261028 276827 294128
12699B94128L8663P7769O6313K2893J6369N6788N3635m828J1589K1999j454j1550
$$ 294128 332791 410560 476873 499766 516135 572923 626558 621730 633319 655318 653864 642314
12687F42314N067M7034L8717j4j6154k629k924j4624M5607L8656k1486k6992j305
$$ 642314 647381 694415 733132 733118 716964 714335 711411 696787 742394 781050 759564 732572 731267
12674G31267l9562k6526J4423k566q035j2975k4199M4585L3523K8397L7343N800
$$ 731267 691705 665179 679602 677036 669001 656026 631827 676412 709935 738332 775675 781475
12662G81475J8779M2054K5478J5176j591J988O770l6633P251L7013L8456J7379
$$ 781475 800254 842308 867786 882962 881371 883359 890129 853496 860747 897760 936216 953595
12650I53595J4039K1052K6645L166n664k1180j598J4565K8675L4462L3833K9886
$$ 953595 967634 988686 1015331 1018497 1012833 991653 990055 1004620 1033295 1067757 1101590 1131476
12638A131476m357Q381J1580K6161M4102J6567K1060l124O637J1298K3254M4101
$$ 1131476 1127119 1135500 1147080 1173241 1217343 1233910 1254970 1251846 1258483 1269781 1293035 1337136
12626A337136J0469K2820K6618M3813M6338K7062J5532K5051K1768K9990M7892
$$ 1337136 1347605 1370425 1397043 1440856 1487194 1514256 1529788 1554839 1576607 1606597 1654489
12615A654489N7355Q5631P6993Q3670N2295P2101R9749R9173P6590O4117N9979
$$ 1654489 1711844 1797475 1874468 1958138 2010433 2082534 2182283 2281456 2358046 2422163 2482142
12604B482142Q5585Q3905Q5771R7577J14375R2580Q7693J58866K12714K35828
$$ 2482142 2567727 2651632 2737403 2834980 2949355 3041935 3129628 3288494 3501208 3737036
12594C737036K67813K70775K96900L59597L89830L81267M19237M56603M99389
$$ 3737036 4004849 4275624 4572524 4932121 5321951 5703218 6122455 6579058 7078447
12585G078447N27227O31922P61398R46591J182891J449724J713628K029859K390615
$$ 7078447 7605674 8237596 8998994 9945585 11128476 12578200 14291828 16321687 18712302
12576A8712302K812220L279762L869156M711046N997474P993972J1227727J6479185
$$ 18712302 21524522 24804284 28673440 33384486 39381960 47375932 58603659 75082844
12568G5082844K3901223L1253265L5912578L8781029M1672183M2206888L5195642
$$ 75082844 98984067 130237332 166149910 204930939 246603122 288810010 324005652
12561C24005652K3220420J2605071N458236l985422j8876591l1655762l6235248
$$ 324005652 347226072 359831143 365289379 361303957 342427366 310771604 274536356
12554B74536356l5588299l5841105l6195974l2746471k4368871j6528532j1391907
$$ 274536356 238948057 203106952 166910978 134164507 109795636 93267104 81875197
12547H1875197q278606o371619n177709m400773l907366l561002l318419l046318
$$ 81875197 73596591 67224972 62047263 57646490 53739124 50178122 46859703 43813385
12539D3813385k802247k523227k272120k056209j795531j606214j454991j260140
$$ 43813385 41011138 38487911 36215791 34159582 32364051 30757837 29302846 28042706
12531B8042706j165925j071436r37452q65781q11755p69759p34320p02423o43868
$$ 28042706 26876781 25805345 24867893 24002112 23190357 22420598 21686278 20983855 20339987
12522B0339987o10393n48887n85074n64502n67279o20139n64191n14779m99608
$$ 20339987 19729594 19180707 18595633 18031131 17463852 16843713 16279522 15764743 15265135
12513A5265135m67332m38818m20089m04775l88742l83346l72266l59925l58774
$$ 15265135 14797803 14358985 13938896 13534121 13145379 12762033 12389767 12029842 11671068
12504A1671068l66737l63639l71311l30439l13349l14136k94011k63739k11157
$$ 11671068 11304331 10940692 10569381 10238942 9925593 9611457 9317446 9053707 8842550
12495H842550k14118j75643j39414r8585q4211l2270m5484o0151j38914j61447
$$ 8842550 8628432 8452789 8313375 8214790 8130579 8098309 8052825 7992674 7853760 7692313
12485G692313k40813l10746l20072l16503k82455k72545k17654j77935j61308
$$ 7692313 7451500 7140754 6820682 6504179 6221724 5949179 5731525 5553590 5392282
12476E392282j27340r4289j08405j33114j31978j23377j09782p4027p1984j19030
$$ 5392282 5264942 5170653 5062248 4929134 4797156 4673779 4563997 4489970 4417986 4298956
12466D298956j50233j20630q9626p9882q6502p5799r1268m9248q1948o7256o8295
$$ 4298956 4148723 4028093 3938467 3858585 3772083 3696284 3605016 3555768 3473820 3406564 3338269
12455C338269q4060o4151j02415r2048r5980j08100q2264m9383p2307o3106p7486
$$ 3338269 3254209 3190058 3087643 2995595 2899615 2791515 2709251 2659868 2587561 2524455 2446969
12444B446969j17100j22569j10274j22750j24394q6310r5109r3243q1696n2670
$$ 2446969 2329869 2207300 2097026 1974276 1849882 1763572 1668463 1575220 1493524 1440854
12434A440854k5303k3333o2930k6483m187n5923n2977m4709o0519m8225l6849
$$ 1440854 1415551 1392218 1329288 1302805 1298618 1242695 1189718 1145009 1084490 1036265 999416
12423I99416K904J7991O51l162M8K1035J2593p985K6386k8770n8369l5121n1858
$$ 999416 1002320 1020311 1020962 1017800 1017848 1038883 1051476 1043491 1069877 1041107 982738 947617 895759
12410H95759n2583n5588j4598o186o203k3674l1095o707L449K4666J9240M371
$$ 895759 843176 787588 772990 766804 760601 736927 705832 699125 702574 727240 746480 750851
12398G50851J9864J2447j7735l8797p842L1895J5830k7333l803J7168J6286r124
$$ 750851 770715 783162 765427 726630 718788 750683 766513 739180 735377 752545 768831 759707
12386G59707J9927j2495Q203J750o452j9423j412o769j2198j1684l9879l9587
$$ 759707 779634 767139 775342 777092 770640 751217 749805 743036 730838 719154 679275 639688
12374F39688j344M736n9501L032l1300l1454j6005m0716J179J3125j0791K1889
$$ 639688 638344 643080 583579 586611 555311 523857 507852 467136 468315 481440 470649 492538
12362D92538J5160P04j4314L1958L0734L3580M239j723Q19l946K8594J3185K605
$$ 492538 507698 508402 494088 526046 556780 590360 594599 592876 593695 589749 618343 631528 634133
12349F34133L016J7131j7056j6873K8130L2189k1845m008j0714J1793J1875R417
$$ 634133 637149 654280 637224 620351 648481 680670 658825 654817 644103 655896 667771 677188
12337F77188R71K1849J6045O638P07q245K6270j5292j3388j0516p716k1818j9861
$$ 677188 678159 700008 716053 722691 723398 715153 741423 726131 712743 702227 694511 672693 652832
12324F52832k1830J0767J1255L2814q187k524J1859k6361R61J8508j4897j065
$$ 652832 631002 641769 653024 685838 677651 675127 686986 660625 661586 680094 665197 664132
12312F64132J8516L3739M589j3618n223k3464j7662j0043R881l2563k6388l536
$$ 664132 682648 716387 720976 707358 702135 678671 661009 650966 660847 628284 601896 598360
12300E98360Q106r150k9687m50J1579n842m851J2943J665j0112M370K2970K9839
$$ 598360 606466 597316 567629 567179 578758 572916 568065 581008 582673 572561 576931 599901 629740
12287F29740l3090l0464j2649L4514K2631J350K4270J9100J7896q436p1j9123
$$ 629740 596650 566186 553537 588051 610682 612032 636302 655402 673298 664862 664791 645668
12275F45668j2431R071k095l2010j1560N734J225j3073o161L297k255J3037J2954
$$ 645668 633237 642308 640213 608203 596643 602377 603602 590529 584368 587665 585410 598447 611401
12262F11401J5371k496j5279J5836j1064O776q241K4838L7689N213o956O606O319
$$ 611401 626772 624276 608997 624833 613769 620545 612304 637142 674831 680044 673088 679694 686013
12249F86013P303M138j5051O392K9494j2385j9918L7995P4868N602K1251K4931
$$ 686013 693316 697454 682403 688795 718289 705904 685986 723981 798849 804451 825702 850633
12237H50633K8790J1068j0361j6874j1689m1302o0125l7880P373J6988j403n002
$$ 850633 879423 890491 880130 863256 851567 810265 750140 712260 719633 736621 735218 730216
12225G30216j3153L2021L6796K3785m429l9161k7862j0097k715o254Q003N367
$$ 730216 717063 749084 785880 809665 805236 766075 738213 728116 725401 719147 727150 732517
12213G32517K683J4615K4938K5239K071j2017J6196N0756M9814K6391J4218m084
$$ 732517 735200 749815 774753 799992 802063 790046 806242 856998 906812 933203 947421 943337
12201I43337L7462L4505j1075l200J0219k668j7165l7581n417r063k265K4444
$$ 943337 980799 1015304 1004229 1001029 1011248 1008580 991415 953834 948417 939354 937089 961533
12189I61533L1070L3692L7291K6108M5277O2723N8427O5357N2280L3570J3545
$$ 961533 992603 1026295 1063586 1089694 1134971 1197694 1256121 1321478 1373758 1407328 1420873
12178A420873J2871K838J4411L1835l806J2634M7544P7618P2202Q7868J29131
$$ 1420873 1433744 1436582 1450993 1482828 1479022 1491656 1539200 1616818 1689020 1776888 1906019
12167A906019J47282J74712J84342J86361J73601J59297J07357P3031M7254M7261
$$ 1906019 2053301 2228013 2412355 2598716 2772317 2931614 3038971 3112002 3159256 3206517
12157C206517K7225J1643O154k0995m5174j4415k0084j2010K6031P4867J17092
$$ 3206517 3233742 3245385 3251539 3230544 3185370 3170955 3150871 3138861 3164892 3239759 3356851
12146C356851J41162J28087J45635J41037J14724O2265N2268M3458N2759M6344
$$ 3356851 3498013 3626100 3771735 3912772 4027496 4089761 4142029 4185487 4238246 4284590
12136D284590R0330J34350J85199K50043K38150J96397J72525J38212J00985R6519
$$ 4284590 4374920 4509270 4694469 4944512 5182662 5379059 5551584 5689796 5790781 5887300
12126E887300J03221J13535J74510K46432K88898L07020L37573M27253M41124
$$ 5887300 5990521 6104056 6278566 6524998 6813896 7120916 7458489 7885742 8326866
12117H326866M09214M23596M44044N08018N75031O78544P88986Q30628Q51101
$$ 8326866 8736080 9159676 9603720 10111738 10686769 11365313 12154299 12984927 13836028
12108A3836028Q78678Q23778P18076N67989M37259M38734M90028O00863Q54242
$$ 13836028 14714706 15538484 16256560 16824549 17261808 17700542 18190570 18791433 19645675
12099A9645675J227290J766414K545266L621355N135565P097989R583607J2233923
$$ 19645675 20872965 22639379 25184645 28806000 33941565 41039554 50623161 62857084
12091F2857084J4279710J4713112J2804364Q757252L482818k242131p485529j0746683
$$ 62857084 77136794 91849906 104654270 113411522 116894340 114652209 107166680 96419997
12083I6419997j0979975q778305n733486l012441r84340M24976J457181K258216
$$ 96419997 85440022 76661717 70928231 67915790 66931450 67356426 68813607 71071823
12075G1071823K863007L089254K894209K389978J706983R36766M07071L76698
$$ 71071823 73934830 77024084 79918293 82308271 84015254 84952020 85359091 85735789
12067H5735789J025955K119100L221601L913036M008159L540995K550341J219413
$$ 85735789 86761744 88880844 92102445 96015481 100023640 103564635 106114976 107334389
12059A07334389j43156j017226r68005n7780J552695L804895O888269J1157559
$$ 107334389 107191233 106174007 105206002 105148222 106700917 110505812 117394081 128551640
12051A28551640J6991564K4394141L2005597L6721667L5448269K7725997J5316418
$$ 128551640 145543204 169937345 201942942 238664609 274112878 301838875 317155293
12044C17155293l24116j7277063l0789501l6093473l3110449k5896347j8349368
$$ 317155293 316831177 299554114 268764613 232671140 199560691 173664344 155314976
12037A55314976j2150320p503939m142850j710000k5314Q09714O77485k14320
$$ 155314976 143164656 135660717 131517867 129807867 129782553 130592267 131269752 131055432
12029A31055432j548524k998136m159921m766380m477451l525811k349418j398511
$$ 131055432 129506908 126508772 122348851 117582471 113105020 109579209 107229791 105831280
12021A05831280r27589r23414j286970j906556k563718k992614l007055k458342
$$ 105831280 104903691 103980277 102693307 100786751 98223033 95230419 92223364 89765022
12013H9765022j600651o94917M25141J904832M066139O765596R633815J1553441
$$ 89765022 88164371 87469454 87894595 89799427 93865566 100631162 110264977 121818418
12005A21818418J1381263Q836194M352133j665617q284183j3607905j5986052
$$ 121818418 133199681 142035875 146388008 144722391 136438208 122830303 106844251
11998A06844251j5349060j3016803j0227269p634669n490604l908771k837133
$$ 106844251 91495191 78478388 68251119 60616450 55125846 51217075 48379942
11991D8379942k094278j677333j332775j116627j042624j052936j083030j186506
$$ 48379942 46285664 44608331 43275556 42158929 41116305 40063369 38980339 37793833
11983C7793833j316800j407812j477070j541193j526249j442962j304871j178539
$$ 37793833 36477033 35069221 33592151 32050958 30524709 29081747 27776876 26598337
11975B6598337j038854r70817r37510r48484r65875r53632r79681r47480q58265
$$ 26598337 25559483 24588666 23651156 22702672 21736797 20783165 19803484 18856004 17997739
11966A7997739p85199p00291o38263n59113m97085m99534m23806l99098m15149
$$ 17997739 17212540 16512249 15873986 15314873 14817788 14318254 13894448 13495350 13080201
11957A3080201l65117l03155k38701j88966j78407j57956j50182j40254j56473
$$ 13080201 12715084 12411929 12173228 11984262 11805855 11647899 11497717 11357463 11200990
11948A1200990j84899k60612k85224k72388l02597k98255k65822k41654j97595
$$ 11200990 11016091 10755479 10470255 10197867 9895270 9597015 9331193 9089539 8891944
11939H891944k01568j90243j47479j50567j20923j32234j39771j40708k01277
$$ 8891944 8690376 8500133 8352654 8202087 8081164 7948930 7809159 7668451 7467174
11930G467174k61535k58283k84782l20018l19228l03163l24541k84702k29538
$$ 7467174 7205639 6947356 6662574 6342556 6023328 5720165 5395624 5110922 4881384
11921D881384j89683j79464j60623j59014j26515q8211p8444j28527j23765r0347
$$ 4881384 4691701 4512237 4351614 4192600 4066085 3977874 3899430 3770903 3647138 3556791
11911C556791q5738r1992p9617o6793n8218r5063r9902o5275n7736q3465r2062
$$ 3556791 3471053 3379061 3299444 3232651 3174433 3079370 2979468 2914193 2856457 2772992 2680930
11900B680930j05619j16237j23841q1182m4509q4952r3904o9766q2334p0816l0789
$$ 2680930 2575311 2459074 2335233 2254051 2209542 2124590 2030686 1960920 1878586 1807770 1776981
11889A776981o1119o8681o5781o1700o9846o0584j2355j4240p201m1741k1999
$$ 1776981 1715862 1647181 1581400 1519700 1449854 1389270 1376915 1362675 1355474 1313733 1291734
11878A291734O866l892N191m0881m7006n4210n8423m8188m2434j1073l2657m4155
$$ 1291734 1298600 1294708 1299899 1259018 1212012 1157802 1099379 1051191 1008757 997684 965027 920872
11866I20872k0416M0220l805r495j6397l888o041j7654j06196p7413m5856n0957
$$ 920872 900456 940676 936871 927376 910979 907091 901050 883396 777200 699787 653931 602974
11854F02974k9176j6904P566j983Q455M904L107p42K715J1032k0940k7615K706
$$ 602974 573798 556894 564460 562477 570932 575836 578943 578201 580916 591948 571008 543393 546099
11841E46099q10n910k172k106R545L7438M139n5379k1273J4116M247k0165j1539
$$ 546099 545289 539379 537207 535101 544646 582084 586223 530844 509571 523687 527934 507769 496230
11828D96230j5997k7474J3734j3871j6454j1948J0232j2623l8546j6878J5412
$$ 496230 480233 452759 466493 452622 436168 424220 434452 421829 383283 366405 381817
11817C81817K87j9790j0744k5207k6841k1978o887J2459N279J7131J0661j0809
$$ 381817 382104 362314 351570 326363 299522 277544 270657 283116 288395 305526 316187 305378
11805C05378r049j0947q862j8321N419J7318j763j0673J7919l953m354M625o999
$$ 305378 296329 285382 276520 258199 263618 280936 279173 268500 286419 282466 278112 282737 275738
11792B75738l8404k6153J4117j454j4673k3141n25m747k1922l2544L127J3884
$$ 275738 237334 211181 225298 223844 209171 186030 185505 180758 158836 126292 129419 143303
11780A43303q743j3601k015J1811K3656L2505j0431q688j2985j7351j6432O171
$$ 143303 134560 120959 118944 130755 154411 186916 176485 167797 154812 137461 121029 127200
11768A27200K0384M65j0684j3479j536K660k8613K8597l699l7246j7761j408j1873
$$ 127200 147584 148049 137365 123886 122350 125010 96397 124994 121295 84049 66288 64880 53007
11755E3007r214J7670L1952J8137O303m2549k6487n339R65L845O42M791R59n754
$$ 53007 43793 61463 93415 111552 117855 75306 48819 43480 44445 48290 48932 53723 54682 48928
11741D8928J2845J95O697k7044k6705Q751R926j283j373l953J1433N686J8574
$$ 48928 61773 61968 68665 41621 14916 23667 33593 32310 30937 26984 38417 44103 62677
11728F2677J8182n314k2201J5070K1656L928O333k621J0399n176J2157j3278j2673
$$ 62677 80859 75545 53344 68414 90070 93998 100331 97710 108109 102933 115090 101812 89139
11715H9139J0127m275l4768k7263M304K0907j6362L799J4340J0524J3743L041
$$ 89139 99266 94991 60223 32960 37264 58171 41809 45608 59948 70472 84215 87256
11703H7256l255j8101m794K51m230O307J3881J761K1471M103n070n834m626k1036
$$ 87256 84001 65900 61106 61357 57127 63434 77315 79076 100547 104650 99580 93746 89120 68084
11689F8084l2688J1602j186J4608J6590o88j2713k3365k6887L148P476Q516K5129
$$ 68084 35396 46998 45812 60420 77010 76322 63609 40244 13357 16505 23981 32497 57626
11676E7626J8899p655J7079K1092r937j0879m3685J308o809j1287P824l968J5995
$$ 57626 76525 68870 85949 107041 97104 86225 42540 43848 37039 25752 33576 29608 45603
11663D5603J2544K5736J6440Q837j0169k5416j032L5347K5135j5868l678J8414
$$ 45603 58147 83883 100323 109160 98991 73575 72543 107890 133025 117157 113479 131893
11651A31893K4040p332p57l461k317O2706M9032J5956O5245P0741O8201O3838
$$ 131893 155933 148601 147844 144383 142066 204772 253804 269760 335005 405746 473947 537785
11639E37785K8451J5869o885l4470j7754K129k4706o3336l8172J7510k374m064
$$ 537785 566236 582105 575220 540750 522996 525125 500419 437083 398911 416421 414047 409983
11627D09983o6j7820j0235p383j692j3061J2181Q83K2729K5547O665K9305L4422
$$ 409983 409917 392097 381862 374479 372787 359726 371907 372790 395519 421066 427731 457036 491458
11614D91458M3302L3211K4561M3930J8585j9667j3568j7148K6585L5476K9486
$$ 491458 534760 567971 592532 636462 655047 635380 621812 604664 631249 666725 696211
11603F96211M1226R5930Q3875J05795J76814J92803J61758J03640J49n3097j16156
$$ 696211 737437 833367 917242 1023037 1199851 1392654 1554412 1658052 1658201 1605104 1488948
11592A488948j68610j63071j64026j26467j07472p4273n5408m4357k4914n593
$$ 1488948 1320338 1157267 993241 866774 759302 685029 629621 585264 560350 554757
11582E54757K1996P75l2246j7359j2528M6619J8845J5329l683k1049n8754j9141
$$ 554757 576753 577528 545282 527923 515395 562014 580859 596188 592505 571456 512702 493561
11570D93561J7349j8539P889N116R332J0072L272J1098k637m174p092L0870M3611
$$ 493561 510910 492371 500260 505376 514708 524780 528052 539150 536513 532339 525247 556117 599728
11557E99728O3071L8341L4697N3o089k5243l8254o8635o3913m8013n6695q100
$$ 599728 662799 701140 735837 735890 729801 704558 666304 597669 533756 485743 429048 420948
11545D20948m1986m8168k3494n6498k1361j6502k0143J2404L07j7112Q115j1876
$$ 420948 378962 330794 307300 250802 229441 212939 192796 205200 205507 188395 196510 184634
11533A84634J1024p748j7253j8124K1370j2576k6294o348M143L31o372p674j1855
$$ 184634 195658 187910 170657 152533 173903 161327 135033 128685 132828 133159 126787 119113 107258
11520A07258J394k0883j1283k8443J5204L3584L581j1758k931M897N898J1996
$$ 107258 108652 87769 76486 48043 63247 96831 100412 88654 85723 90620 96518 108514
11508A08514J9915l744l3300k8157n159o067K6422q170j9555k7495j0099L0020
$$ 108514 128429 124685 91385 63228 58069 52002 78424 70254 50699 23204 13105 43125
11496D3125M0453J9815J3199J0507J8437j5266k9330k8835J3307r160J4061P051
$$ 43125 83578 103393 116592 127099 145536 130270 100940 72105 85412 76252 90313 97364
11484I7364n106P78j4066k6656O725Q031m597R900j4145J0140m784k9969j5635
$$ 97364 92258 93036 78970 52314 59039 67070 62473 72373 58228 68368 63584 33615 17980
11471A7980J3178j0727P516J2303j7923l773L8606N567j4132k3973j1619J5111
$$ 17980 31158 20431 27947 40250 22327 18554 57160 62727 48595 24622 13003 28114
11459B8114J5779k3180m8756J8869L5634K238l727K7244O086j8293J6267J276
$$ 28114 43893 20713 -28043 -9174 26460 28698 24971 52215 58301 40008 56275 57551
11447E7551J2515l2139m3268J526K7449J029n650q802K8802K0422M244J423j3742
$$ 57551 70066 37927 -5341 -3815 23634 24663 19013 10211 39013 59435 63679 65102 51360
11434E1360j6511J1548O941O885K102k1086M635p694J6411L7786K130m956j0416
$$ 51360 34849 46397 53338 60223 62325 41239 45874 38180 54591 92377 94507 89551 79135
11421G9135J6312j87o423k2441R534J97j4159O147k9665j7612M727K7069J108
$$ 79135 95447 95260 88837 66396 75930 76127 61968 68115 38450 20838 25565 52634 53742
11408E3742K497J4623j1462M572o138q829k253j3505K403k2962j5177L1620r253
$$ 53742 56239 70862 59400 63972 57834 49005 46752 33247 35650 12688 -2489 29131 19878
11395A9878j6026J7776K6683l995K613K9313J8493k282j7690j3113p726r988K1603
$$ 19878 3852 21628 48311 44316 46929 76242 94735 92453 74763 61650 53924 43936 65539
11382F5539K5421m725m2319j236j081j2719m340K349J300P806l962r45n913n841
$$ 65539 90960 86235 43916 42680 41599 28880 24540 26889 28189 35995 32033 31088 25175 19334
11368A9334J1029K6505j5576j4356N62k350M3899J6148l5302j5444r64j981j1701
$$ 19334 30363 56868 41292 26936 27498 25148 69047 85195 49893 34449 33485 31504 19803
11355A9803P891p600j0495K3085j869K5015K7701p467l476r712j6556K2846k1184
$$ 19803 27694 20094 9599 32684 30815 55830 83531 76064 72588 62876 46320 69166 47982
11342D7982j4117M380k0908l4413j2383J9817n510j2758J1250L8064M2440j116
$$ 47982 33865 38245 17337 -17076 -29459 -9642 -15152 -27910 -16660 21404 63844 62728
11330F2728Q590p75j0143L452m196n944J1162k0077K5880J1972j3114j5862N527
$$ 62728 71318 70543 60400 63852 59656 53712 64874 44797 70677 82649 69535 53673 59200
11317E9200L6687J9361q093L33m7207j2646o736m8669k0039J4328K7867J0636
$$ 59200 95887 115248 107155 107488 60281 47635 40899 -7770 -27809 -13481 14386 25022
11305B5022j835p090O888K71L2204J3538M137R963J8756r909m3216j5653j0805
$$ 25022 23187 16097 22985 23256 55460 68998 73135 83098 101854 91945 48729 33076 22271
11292B2271j8377L433J6274O519L56J7191J0952m511k8079j9719M587J8706J8530
$$ 22271 3894 7327 23601 30120 30476 47667 58619 54108 26029 6310 10897 29603 48133
11279D8133J0236L7036J6263l606k2686j2960m1880k5245m2201k0934N9439K8750
$$ 48133 58369 95405 111668 108062 85376 72416 30536 5291 -36910 -57844 1595 30345
11267C0345J9368k0576o3788j5987L1626N819J8114j4384n189J5556J3541K2937
$$ 30345 49713 29137 -34651 -50638 -19012 -13193 4921 -9463 -14652 904 14445 37382
11255C7382M234k9995j9689J9447Q829j0941j0037J3196j0207m898L3224J8975
$$ 37382 41616 11621 -8068 11379 20208 9267 -770 12426 2219 -2679 30545 49520
11243D9520k5230j3262J0082L5574L1782j0471p97n946k2309k8321R185R857K0452
$$ 49520 24290 11028 21110 56684 88466 77995 77198 71252 48943 20622 29807 39664 60116
11230F0116J6771L513r135j632j0780k3782j7839k7024R625N355J0710J2255L2048
$$ 60116 76887 80400 71265 69633 58853 35071 17232 -9792 -167 5188 15898 28153 60201
11217F0201R312k5592j0411J2650K9315l495l8627m7036k357K5132J3186J024
$$ 60201 69513 43921 33510 46160 75475 71980 33353 -13683 -16040 9092 22278 23302
11205B3302J4796L4202j0153l3332n336R684K4567J6871Q70n169k7509l3821J3309
$$ 23302 38098 72300 62147 28815 23479 33163 57730 74601 75471 70302 42793 8972 22281
11192B2281P254k0259l6407k633K7918J6890J1247j9571p845L0461R973k1719
$$ 22281 29535 9276 -27131 -29764 -1846 15044 26291 6720 -1125 29336 39309 17590
11180A7590k437L968r111P56K271k8682J9356J4193J6060M4501J1851j3143J85
$$ 17590 15153 19121 10010 10766 13037 -15645 3711 17904 33964 78465 90316 77173 77358
11167G7358J8915J4551k9977N93M928l9841j6860P869K9999J5587m88l327J696
$$ 77358 96273 110824 80847 81440 86368 46527 29667 37536 67535 83122 82634 79307 81003
11154H1003J5343O569j3060j4701J8002k5710q405o864l2422P030r71l344L2004
$$ 81003 96346 102915 89855 75154 93156 67446 59041 52177 19755 26785 25814 22470 54474
11141E4474l967J9161j7168k1358l4176P599M2188p100k980N837j881j5230p833
$$ 54474 50507 69668 52500 31142 -3034 4565 46753 39653 36673 42510 40629 25399 17566
11128A7566L6141M242j2742P947m522j6539j5530j3784K2613M5680j0366k3262
$$ 17566 53707 57949 45207 53154 48632 32093 16563 2779 25392 71072 60706 37444
11116C7444l207k3083P393J8408p32Q104J225P911K0938k0906l9976j3502j0608
$$ 37444 34237 11154 18547 36955 36223 44327 45552 53463 74401 53495 13519 17 -10591
11103a0591L2455K0805k529L6721k543n1546k6291N961K3158K1608j3368p338
$$ -10591 21864 42669 40140 76861 74318 22772 -3519 2442 25600 47208 33840 26502
11091B6502K7914J4056m1610m4170M851L4668Q197K4340j3100K3785L906j267
$$ 26502 54416 68472 26862 -17308 -12457 22211 30408 54748 41648 65433 69339 68072
11079F8072o448l386j7875n914O309j8916M295l06j0405K90J4040P776P375Q006
$$ 68072 61624 58238 40363 34449 40758 21842 26137 25831 15426 15716 29756 37532 44907 52913
11065E2913J7237j817k0015O11l905k1303j3683Q486R522j2382j8355J5586J3052
$$ 52913 70150 68333 48318 48929 45024 23721 10038 18524 28046 15664 -2691 12895 25947
11052B5947n094p842m333r98J5367j3880j2102J7019o022m351K8267K5262k0922
$$ 25947 20853 13011 8678 7680 23047 9167 -2935 14084 8062 3711 31978 57240 36318
11039C6318l9617m0987J7221J1907q716R486r72J9675O087K0046L0994P58o5993
$$ 36318 -3299 -44286 -27065 -15158 -23874 -14388 -15360 4315 10402 30448 61442 62200 -3793
11026c793k9168Q314K0259J8218Q649j4228Q30j8305k8134M162Q224N604l007
$$ -3793 -32961 -24647 -4388 13830 22479 8251 9081 -9224 -37358 -33196 -24972 -19368 -22375
11013b2375j1573M406k6044q365K9620K6424M2680L047J6696m3865k1356j1783
$$ -22375 -33948 -29542 -55586 -63951 -34331 -7907 34773 37820 54516 10651 -10705 -22488
11001b2488J7900J9858L7793R352M23k5967l4743j261N744J0335K4132j9374k3434
$$ -22488 -4588 15270 53063 62415 62838 36871 2128 867 6611 16946 41078 21704 -1730
10988a730J3591j1611k5999J4121K8545m232j2035q232R722J1001j9713j6208
$$ -1730 11861 250 -25749 -11628 16917 12685 650 -7582 2140 13141 -6572 -22780
10976b2780K863J9575M340J335k1699K4617J7244J4234J4255r973L385J143j3489
$$ -22780 -19917 -342 3998 5333 -16366 8251 25495 39729 53984 44011 47396 48539 35050
10963C5050K201P008R221k0213M384j3490K9620K460m4882j8385K3499k1396j1156
$$ 35050 37251 44259 53480 33267 37651 24161 53781 56241 11359 -7026 16473 -4923 -16079
10950a6079J9798L512j4920K2172K3791J280O582J1831j1399k0842j4961P835
$$ -16079 3719 7231 -7689 14483 38274 39554 46136 57967 46568 25726 10765 18600
10938A8600q036R559K3994m451j2849M257j4891K0786K3626J7798j9239J3393
$$ 18600 10564 20123 44117 39666 26817 31074 16183 36969 60595 78393 59154 72547
10926G2547K6520q797j4211q921j198j4869O3607M3314j7837l1536R792l053o005
$$ 72547 99067 90270 76059 67138 65940 51071 114678 157992 140155 108619 118411 115358 109353
10913A09353L739K4671K109k7312n883R223K5579J4912K1433j1603l5754q037
$$ 109353 113092 137763 139872 112560 106677 115900 141479 156391 177824 166221 130467 122430
10901A22430R968M3077j4031M198m430j5699j11j4474j3909l4513j904J7846J2330
$$ 122430 132398 175475 161444 165642 161212 145513 145402 130928 117019 82506 80602 98448 110778
10888A10778J2592k4481k47l3424j4693M5986K2359J6156J3819j1410q351m966
$$ 110778 123370 98889 98642 65218 50525 96511 118870 135026 148845 137435 129084 124118
10876A24118J7309J0867N108r004j9703j4666J7757l874j9132j8405K0899n468
$$ 124118 141427 152294 157402 148398 128695 114029 131786 127912 108780 90375 111274 105806
10864A05806J5842O196p12M835P570O445J2429K1233n609k8005J5809N862J1340
$$ 105806 121648 127844 127132 131967 139537 145982 158411 179644 174035 146030 161839 167701 179041
10851A79041M182l5734l1889j0253K3408J8688j3598J8512L746J860L2503q656
$$ 179041 183223 147489 115600 105347 128755 147443 133845 152357 156103 157963 190466 181810
10839A81810l7598Q529j2454k8019J1483J0829j6699m2183j3905J4524J8063J7580
$$ 181810 144212 152741 140287 112268 123751 134580 117881 75698 61793 76317 94380 111960
10827A11960L5360L0179k6316j7784J0009l154o314J4811j0304q618j087j9385
$$ 111960 147320 177499 151183 133399 143408 140254 133940 148751 138447 129829 128742 109357
10815A09357n741J4667L4555K3317P350n798m370j080o446J6800j8745p758j6784
$$ 109357 103616 118283 152838 176155 183505 177707 173337 172257 165811 182611 163866 156108 139324
10802A39324R290K3055k665j174j0409j3075Q406r676k0856K1116J159n090J3558
$$ 139324 148614 171669 169004 167830 157421 144346 152752 143076 122220 143336 144495 139405 152963
10789A52963M098j4000k3703j8345l5002j3205k17m184p516J5422L2554R613K8108
$$ 152963 157061 143061 119358 101013 66011 52806 52589 48405 40889 56311 88865 98478 126586
10776A26586l167q525O310l0703p655J3447k3966J2310L1874K0401J3391q602
$$ 126586 123419 114894 121204 90501 82846 96293 72327 84637 116511 136912 150303 141701
10764A41701l1849m3939M675L1393N918j9617l7417Q49K6202J8334L8755L3246
$$ 141701 109852 65913 70588 101981 107899 88282 50865 51714 77916 96250 135005 168251
10752A68251Q073r153j5424M345k2810j734q019K1631O578J5616j1383k5030J3405
$$ 168251 176324 167171 151747 156092 133282 131548 123529 145160 151738 167354 155971 130941 144346
10739A44346n3624m121J4112p040K361J5K3347K1570O244R858M627n772J0383
$$ 144346 90722 86601 100713 93673 96034 96049 119396 140966 147210 157068 161695 155923 166306
10726A66306j7956m0033j8606J4880O622J9143r599j1005j047O425j9130L803
$$ 166306 148350 108317 89711 104591 111213 130356 120757 109752 108705 115130 96000 99803
10714I9803J9557K040J460p099k2828q22p703L009l12M711M2732k337k6841J1716
$$ 99803 119360 121400 122860 115761 92933 92111 84408 87417 87105 91816 134548 132211 105370 117086
10700A17086L346M818m373l3525P311J9232P044q169o294l9161J2270J2024O2
$$ 117086 120432 125250 120877 87352 94663 113895 120939 112770 106476 67315 79585 91609 91671
10687I1671Q082Q006j3975j9311P015K7382J9026Q970j1764K3529L9991N274N569
$$ 91671 99753 107759 93784 74473 81488 108870 127896 136866 125102 148631 188622 193896 199465
10674A99465j1524J9328j4459p37J6330l874P783m1787j2766J5635j2237j3621
$$ 199465 187941 207269 192810 192073 208403 204529 212312 170525 157759 173394 161157 147536
10662A47536j7329k414j796M1640K3332K2019p760J1744p042k358n605q781j3598
$$ 147536 130207 127793 125997 167637 190969 212988 205228 216972 209930 207572 201967 193186 179588
10649A79588k5650k584N807k2491q851J6184j1145K3388N1126M3498L8619K7427
$$ 179588 153938 151354 157161 134670 125819 142003 130858 154246 205372 248870 287489 314916
10637C14916L2233M019l0881K300j5637r181l878m3499m0771l4811M939N678O385
$$ 314916 347149 351168 320287 322587 306950 297769 293891 250392 209621 174810 179749 185427 191812
10624A91812m290p175j7754m0521k0785J1152K824j3113k0123J3713J3311j2379
$$ 191812 187522 180347 162593 122072 101287 112439 115263 102150 82027 95740 109051 96672
10612I6672j1095J7908K8858J2270m206j3546j1983j0090P954J1443K2235K5424
$$ 96672 85577 103485 132343 144613 140407 126861 114878 104788 112742 124185 146420 171844
10600A71844K8396N328K1979L5925K2890P661k2222l4404L314j4610l9954j8122
$$ 171844 200240 205568 227547 263472 286362 294023 271801 237397 240711 226101 186147 168025
10588A68025k4821M29O06l721J8183j9098k9486M476L2979j0926l982K854r980
$$ 168025 143204 143633 144239 140518 158701 139603 110117 114593 147572 136646 132664 135518 125538
10575A25538k7246Q65k860N265k3173R312J1378q171k3084k8849n065J4448M6193
$$ 125538 98292 99157 96297 101562 78389 87701 99079 90908 67824 38975 33910 48358 94551
10562I4551K6494k129j4433J260N221l250P839K2659J3863m532k5694n739j2925
$$ 94551 121045 118916 104483 105743 110964 107714 115553 138212 152075 147543 121849 116110 103185
10549A03185j2220l0196K045L427k4442m770L2835M1353j5182n324J9010O271
$$ 103185 90965 60769 62814 66241 41799 37029 69864 111217 96035 90711 109721 115992
10537A15992M237K2730L2169m8891m6988K257K7285N019k1268p383p959j106p562
$$ 115992 120229 142959 175128 126237 79249 81506 108791 113810 92542 85159 77200 76094 68532
10524F8532m47n874J0749J4472P288K2704K0213j6991l339J5399j2017k3112m31
$$ 68532 68085 62211 72960 87432 94720 117424 137637 120646 117307 132706 120689 97577 97146
10511I7146o169k457j9225l8834q722M7580J5246N391M2740j8285l808r15N154
$$ 97146 90977 88520 69295 30461 21739 69319 84565 89956 132696 114411 110603 109688 114842
10498A14842j1504j4212R193L5613k2818r955J0758N167J1555J5456l245l1355
$$ 114842 103338 89126 98319 133932 111114 101159 111917 117084 128639 144095 140850 109495
10486A09495k0609m251j4764J4326J7952P01J8116j930r371o549j205J5721m47
$$ 109495 88886 84635 69871 84197 102149 102850 120966 119036 109665 103116 101911 117632 117185
10473A17185R331K5054j0514j9577j2880k0060J9868K6824r0l0137J11J0794L1870
$$ 117185 126516 151570 141056 121479 108599 88539 108407 135231 135141 105004 105115 115909 147779
10460A47779K1805j1620j1843J354M6250R31k8282j2892j6343Q931j799n030j2443
$$ 147779 169584 157964 146121 147475 193725 194656 166374 153482 137139 146070 144271 139241 126798
10447A26798N4187L1918k9124j2250J1230j8918m197j0834j8285j4910J3165K8668
$$ 126798 180985 212903 183779 171529 182759 163841 159644 148810 130525 115615 128780 157448
10435A57448L1156K6083l445k499j7033p429O354o049l2103J889N081l8322k2737
$$ 157448 188604 214687 211242 208743 191710 184281 190635 184586 152483 154372 159453 121131 98394
10422I8394K7342J4855J0118p983j2321L5245J8322j0636j5540l2948j2100l977
$$ 98394 125736 140591 150709 142726 130405 165650 183972 173336 157796 124848 112748 108771
10410A08771R864l630J5179j943j0737K6355K2026Q966l5439k9084p532N6955
$$ 108771 118635 115005 130184 128241 117504 143859 165885 174851 139412 110328 102796 159751
10398A59751K5746k5828l1947l5647J1702K9851K2038L0477k216m1680j780P689
$$ 159751 185497 159669 127722 92075 103777 133628 155666 186143 183927 142247 140467 148156
10386A48156J3671p549j438J3027K6368l921k7970P825K9526J5056L94r010l8077
$$ 148156 161827 154278 152840 165867 192235 188314 160344 168169 197695 212751 213145 204135 166058
10373A66058j6232l3394K351K5681m98k0129M362J9546o995l4170J1144K0649
$$ 166058 149826 116432 118783 144464 143966 123837 128199 147745 140750 106580 117724 138373
10361A38373K0601O80r113p357m7050j929L7085J2352J3424q401M6220K2355l3732
$$ 138373 158974 159654 150541 143184 96134 94205 131290 143642 157066 148665 194885 217240 183508
10348A83508j9927K0566K1098J7712j7538k8083m3553k5838k041O839Q704J0087
$$ 183508 163581 184147 205245 222957 205419 177336 133783 107945 105904 112743 121447 131534
10336A31534j428o475j8517L46N760r600P088r868m764k0530J3428M4671o066
$$ 131534 130106 123631 105114 105460 111220 101620 108708 98840 94076 73546 86974 131645 125579
10323A25579K9810P545n793Q944p126K5071J9280m1566k1413j2987j4445J0749
$$ 125579 155389 162934 157141 166085 158959 184030 203310 161744 140331 127344 112899 123648
10311A23648q03L1444J9629L022R36j4420k0714J0542K6127K2512j450j1266k3404
$$ 123648 122845 154289 173918 176940 177876 163456 142742 153284 179411 201923 200473 189207 165803
10298A65803j4949K0617j4365j0499K9538l550k5953j1533K5906K5719J5799j7008
$$ 165803 150854 171471 157106 146607 176145 172595 146642 135109 161015 186734 202533 185525
10286A85525n780M253q263k7862N090K7545l421O407r982O698O817P328L1055
$$ 185525 179745 183998 175735 147873 152963 180508 177087 183494 173512 180210 187027 194355 225410
10273B25410j3342l2676k424K7521k1935j596m159J547K2334k3610j7024P782
$$ 225410 212068 179392 176968 204489 182554 180958 176799 178346 200680 177070 160046 167828
10261A67828J4506K1166J5829l5368m5706J7002o504K5865M0716l311K6435L6123
$$ 167828 182334 203500 219329 183961 138255 155257 148753 174618 215334 212023 238458 274581
10249B74581N599L2608L3397L0929l3045k6974k2836o718K791j1692L2309L6953
$$ 274581 280180 312788 346185 377114 344069 317095 294259 287541 290332 278640 310949 347902
10237C47902J8667M6759M1276q558k3030R235j8602j6352l7330n1430k3706k0154
$$ 347902 366569 413328 454604 446046 423016 432251 413649 397297 359967 308537 284831 264677
10225B64677J3057O555l0217k9419k0323k399L7003J0314n793J1860N318j58j440
$$ 264677 277734 284289 254072 224653 204330 201931 238934 249248 243455 255315 260633 260475 259035
10212B59035k223j6099K326M2110K1911m325M898j4447k63K6505L6934J2874J6266
$$ 259035 256812 240713 243039 285149 307060 302735 307633 293186 292923 319428 356362 369236 385502
10199C85502P9774P2291N3479Q6341Q7683Q0791J00115P0013L4002L6020o224
$$ 385502 465276 537567 591046 677387 765070 845861 945976 1015989 1049991 1086011 1079787
10188A079787m6140m7702j10049j24946j26190q1390n7880m5734j850J1524j0522
$$ 1079787 1033647 985945 875896 750950 624760 543370 485490 439756 437906 449430 438908
10177D38908j9835l0362P22k1848j4397j0587l1852M129O244K3015J4510r030
$$ 438908 419073 388711 389433 367585 353188 342601 310749 314878 321122 344137 358647 349617
10165C49617J5841L5974M4805N60j721Q591K4902J6648N3840J02568J25301R8052
$$ 349617 365458 401432 446237 446797 445076 453667 478569 495217 549057 651625 776926 874978
10153H74978J28230J32682J59418J39005J14602M9964J8802j4347n6558q1249
$$ 874978 1003208 1135890 1295308 1434313 1548915 1598879 1617681 1603334 1546776 1465527
10143A465527j49592k11497j69708j27495r5013o5909m2321N320R513k1416l6229
$$ 1465527 1315935 1104438 934730 807235 712222 646313 603992 609312 618825 597409 561180
10132E61180r298m5576l4869j3629o082J4269K4910J6398L168L1661p074l4670
$$ 561180 551882 506306 471437 457808 451726 465995 490905 507303 510471 542132 535058 500388
10120E00388J4320J9275J2068j515N525O157L98K8609N6537O8985O7038J01122
$$ 500388 514708 533983 546051 544536 550061 556218 556616 585225 641762 710747 777785 878907
10108H78907J46666J36351J31458P8931L3703k0554j03384j25341j60938j36694
$$ 878907 1025573 1161924 1293382 1372313 1406016 1385462 1282078 1156737 995799 859105
10098H59105j10443q8726q8483n5146l4480q279k3304k8665K440O209R591r266
$$ 859105 748662 659936 571453 516307 481827 473548 450244 421579 424019 430228 439819 430553
10086D30553K550K386k9434l1676l1490q86J0716j348R917K2882K310J0927k0182
$$ 430553 433103 435489 406055 374379 342889 342003 352719 351371 361288 384170 386480 397407 377225
10073C77225j9794n814Q575N8388J4393R430N5457P2222N9957Q5982P0453Q1331
$$ 377225 357431 351617 360192 418580 432973 442403 497860 570082 630039 716021 786474 867805
10061H67805N8958n518l3167l1362l3640q3876p1306m7520p8104q2650m031J3969
$$ 867805 926763 921245 888078 856716 823076 739200 667894 620374 542270 459620 455589 469558
10049D69558k5716o444q537L855M429O092j7347o546L747J8605j2554j8267n906
$$ 469558 443842 437398 428861 432716 437145 443237 425890 419344 423091 441696 429142 410875 404969
10036D04969M5356J4608m2430P316Q558K4669l806j3826L0451J6791j8881o423
$$ 404969 450325 464933 422503 429819 438377 463046 459240 445414 475865 492656 473775 467352
10024D67352k89o817K3613N712J4815l0766k8719J6641P523J5675o024q367m877
$$ 467352 467063 460246 483859 489571 504386 473620 444901 461542 469065 484740 478716 470349 465472
10011D65472J0439J4513L0140J5881k146K0033l8203p099K6454J4697J5745J4792
$$ 465472 475911 490424 520564 536445 534299 554332 516129 509030 535484 550181 565926 580718
9999E80718J1439n020o234l5426J3629K5892l4307n9202j4580J8719R22J0730
$$ 580718 592157 587137 580903 545477 559106 584998 550691 491489 476909 495628 496550 507280
9987E07280N824J6645K8682M577J0689J1495j5728q745J4383K0600L1692L5475
$$ 507280 513104 529749 558431 563008 573697 585192 569464 560719 575102 595702 627394 662869
9975F62869l2796k9422J7406K2818l3935K189J7743J2041L734J3326K3478K0931
$$ 662869 630073 600651 618057 640875 606940 609129 626872 638913 642647 655973 679451 700382
9963G00382J007j2423l6540j5582O25J4636J1079q745k1599P04J6676k011L0010
$$ 700382 701389 688966 652426 636844 637469 652105 663184 654439 632840 633544 650220 648209 678219
9950F78219K1523l8636q685m788j603J3008L123Q899K1612j751P722n735l157
$$ 678219 699742 661106 652421 647633 646030 659038 662161 671060 692672 690921 698643 692908 689751
9937F89751j9233Q844K4360k0342j9787L1227M4958N0936L1740J0444P7843Q8103
$$ 689751 670518 679362 703722 683380 663593 694820 739778 790714 822454 832898 910741 998844
9925I98844Q7013L6534k8472l0266m4866j29967r8503p4717l6437m045j3573j028
$$ 998844 1085857 1122391 1093919 1063653 1018787 888820 790317 715600 679163 675118 661545 660517
9913F60517J4399N8665N6157L2176J7698K89L0525J4704K2023n910J050M434R801
$$ 660517 674916 733581 789738 821914 839612 839901 870426 885130 907153 901243 902293 906727 916528
9900I16528j3648m534J734K7382N7625N4837L5499M3483j5367m5556k5092l1312
$$ 916528 902880 898346 900080 927462 985087 1039924 1075423 1118906 1103539 1057983 1032891 1001579
9888A001579K5698M1880n726j0871j7865k6031j7044k1915k1361p966J0837j1034
$$ 1001579 1027277 1069157 1063431 1052560 1034695 1008664 991620 969705 948344 940378 951215 940181
9876I40181k3100q752J0649M7926Q5147N6305L0251L5745K8060M3488L5011l113
$$ 940181 917081 908329 918978 966904 1052051 1108356 1138607 1174352 1202412 1245900 1280911 1277798
9864A277798J436n327N418K5104M3103N0247R8188J31705J12931J18776J22852
$$ 1277798 1279234 1273907 1279325 1304429 1347532 1397779 1495967 1627672 1740603 1859379 1982231
9853A982231J57767J77213J96664J81542J76494J69839J50951J59425J76630J91116
$$ 1982231 2139998 2317211 2513875 2695417 2871911 3041750 3192701 3352126 3528756 3719872
9843C719872J85718K10601K47115K07413J33108R4311M2693n4135r8084j01481
$$ 3719872 3905590 4116191 4363306 4570719 4703827 4798138 4840831 4786696 4688612 4587131
9833D587131q1468j09403j00730j10767m8222n5603m9182J3034P2346J82820K89184
$$ 4587131 4505663 4396260 4295530 4184763 4136541 4080938 4031756 4044790 4117136 4299956 4589140
9822D589140M46940O32397Q15442R82899J093924J007091R14497O89080L96397
$$ 4589140 5036080 5668477 6483919 7466818 8560742 9567833 10482330 11171410 11567807
9813A1567807N0517j88796l14558l54335l96092m80956n51001m99112l67772k79895
$$ 11567807 11618324 11429528 11114970 10760635 10364543 9883587 9332586 8833474 8465702 8185807
9803H185807k37657j63206j06976p3695J8236J03571J89976K77913M17564N17863
$$ 8185807 7948150 7784944 7677968 7604273 7622509 7726080 7916056 8193969 8611533 9129396
9793I129396O69625P46358Q34306R15212J018471J166567J435344J866882K424950
$$ 9129396 9799021 10545379 11379685 12294897 13313368 14479935 15915279 17782161 20207111
9784B0207111L251350M478826O151914Q338989J1220369J4674318J7717911J7872083
$$ 20207111 23458461 27937287 34089201 42428190 53648559 68322877 86040788 103912871
9776A03912871J4070894Q503446K604609m838475j3157620j6818984j4938424
$$ 103912871 117983765 126487211 129091820 124253345 111095725 94276741 79338317
9769G9338317j1327325p833469m762368k211934L4170K117227M223153O165673
$$ 79338317 68010992 60177523 55415155 53203221 53237391 55354618 59577771 65743444
9761F5743444P700800Q723307R376625R240006P878492O267341N087852L696391
$$ 65743444 73444244 82167551 91544176 100784182 108662674 114930015 120017867 123714258
9753A23714258J866956O31230n4830j260960k997746m240826m705884m852535
$$ 123714258 125581214 126212444 126157614 124896654 121898908 117658082 112952198 108099663
9745A08099663m893586m058130k087209M04101L384085P667845J3938464K2149252
$$ 108099663 103206077 99147947 97060738 97464839 100848924 108516769 122455233 144604485
9737A44604485L2120720M2363951M6471757L8433907K3661918R229725r104303
$$ 144604485 176725205 219089156 265560913 303994820 327656738 336886463 327782160
9730C27782160l3393521m7496698m3753388l4202981k4844263j6469195r742915
$$ 327782160 294388639 246891941 203138553 168935572 144091309 127622114 117879199
9723A17879199m735231j131054J486650L293271M330478M764742M869330M649909
$$ 117879199 113143968 112012914 113499564 116792835 121123313 125888055 130757385 135407294
9715A35407294L801138K572551J544887P16909o16342k584587m180683n483959
$$ 135407294 139208432 141780983 143325870 144042779 143426437 140841850 136661167 131177208
9707A31177208p328359r243765j0205788j0199845r174640p125861m870195k804844
$$ 131177208 123848849 114605084 104399296 94199451 85024811 77898950 73028755 70223911
9699G0223911q73635J111037L275055N870003R015745J2228699J4406978J3464108
$$ 70223911 69350276 70461313 73736368 79606371 88622116 100850815 115257793 128721901
9691A28721901R263334L799656k172064r480315j6112113j7816095j5387279j2022466
$$ 128721901 137985235 141784891 139612827 130132512 114020399 96204304 80817025 68794559
9683F8794559r128240o812121n052580l795718k942050k348470j954086j675473
$$ 68794559 59666319 52854198 47801618 44005900 41063850 38715380 36761294 35085821
9675C5085821j517116j463933j388049j282053j261608j192267j116756j055627
$$ 35085821 33568705 32104772 30716723 29434670 28173062 26980795 25864039 24808412
9667B4808412r46076q24899o91072n81262m72798m13713l00120j98552j12039
$$ 24808412 23862336 23037437 22346365 21765103 21292305 20878592 20578472 20379920 20267881
9658B0267881K5347J63601K16958K32031K42426J86754k3703l15908o45065q64232
$$ 20267881 20293228 20456829 20673787 20905818 21148244 21334998 21311295 20995387 20350322 19486090
9648A9486090j050730j162708j255164j185721r67073p79938o45789n50521m34760
$$ 19486090 18435360 17272652 16017488 14831767 13864694 13084756 12438967 11888446 11453686
9639A1453686l38406k53947j93688j48484j21230p0217p1135p4943j03283o9123
$$ 11453686 11115280 10861333 10667645 10519161 10397931 10327714 10256579 10181636 10078353 10009230
9629A0009230r9010j11626j56775j94627k62138l03304l41103l56484l67523l21691
$$ 10009230 9910220 9798594 9641819 9447192 9185054 8881750 8540647 8184163 7816640 7494949
9619G494949l06946l07569k73192k55676k67449k43324k49003k72002k74942k04950
$$ 7494949 7188003 6880434 6607242 6351566 6084117 5840793 5591790 5319788 5044846 4839896
9609D839896j51587j10496r7544j03163j17651j32217j22858p3924j05819j22098
$$ 4839896 4688309 4577813 4480269 4377106 4259455 4127238 4004380 3930456 3824637 3702539
9599C702539j16890r4477p6020j12223r9200p0095m2485o4973o9169o0479l9689
$$ 3702539 3585649 3491172 3415152 3302929 3203729 3133634 3091149 3026176 2957007 2896528 2856839
9588B856839r6788j15568j13237j39649j32485p8184q0225r1423j17350r0457
$$ 2856839 2760051 2644483 2531246 2391597 2259112 2180928 2100703 2009280 1891930 1801473
9578A801473n9637j5299j5211m4730k4766l7093k8996k0453l0078j3891k0814
$$ 1801473 1741836 1726537 1711326 1666596 1641830 1604737 1575741 1555288 1525210 1511319 1490505
9567A490505l4444l4383l5681m3120m1108l8136m0913l8454Q809J7855o8788o4268
$$ 1490505 1456061 1421678 1385997 1342877 1301769 1263633 1222720 1184266 1193075 1210930 1142142 1077874
9555A077874k3676K3077K5122L7768K2460K6583K0675r979k9935o8247p7198p3801
$$ 1077874 1054198 1077275 1102397 1140165 1162625 1189208 1209883 1199904 1169969 1101722 1024524 950723
9543I50723p5625j01438o3507j2131J4947k629J0326J5115p477J3115K6209j422
$$ 950723 875098 773660 710153 698022 712969 710340 720666 735781 728304 741419 767628 766206
9531G66206M438j542J651J3952k7196m1060j3235P456J60n768j3937k8564j9584
$$ 766206 770644 769102 770753 784705 757509 716449 703214 710670 710830 705062 691125 662561 642977
9518F42977l7853m4117K1184K7424j4973m7296J9456p086n247l542K248M779L7018
$$ 642977 605124 561007 582191 609615 594642 547346 566802 559716 554469 550927 553175 557954 594972
9505E94972L4477p81q213o5847n7967l9093p157N887k866J8275n179o933J6514
$$ 594972 629449 628668 620455 554608 496641 457548 450391 456278 453412 471687 466508 459575 476089
9492D76089K3226R671k217j4439O754P153K183k4743l4499r385m238K1357k2087
$$ 476089 499315 508986 506769 492330 499084 506237 508420 483677 449178 439793 435555 456912 434825
9479D34825l559l1302j8239j0929o894p578j1972M111j2942j5319j1948J4848
$$ 434825 431266 399964 381725 370796 363902 356324 344352 348463 335521 320202 308254 323102
9467C23102J8293j4055n963Q593K8834J3036J1855J0392m280l0998k5936q676
$$ 323102 341395 327340 321377 329970 358804 371840 383695 394087 389807 358809 332873 324197
9455C24197J1452P372j3695O722k4873J6355K5868j006k9358k4853j956n454Q312
$$ 324197 335649 343021 329326 336048 311175 327530 353398 352392 323034 298181 296225 290771 299083
9442B99083J7577Q355m1950k1486J1731O488r999n565J0949J6830p249j5897q963
$$ 299083 316660 325015 283065 261579 273310 279798 269799 264234 275183 292013 284764 268867 259904
9429B59904K376J1372K7570J9243K7761R110j37k2721l755j0393k3282J4470j2004
$$ 259904 262280 273652 301222 320465 348226 357336 357199 334478 330723 320330 297048 311518 299514
9416B99514K6158J4950K0773k608j8229k0042j9224J7227K9173K5926M3537l660
$$ 299514 325672 340622 361395 358787 340558 320516 301292 318519 347692 373618 417155 413495
9404D13495k4776N4335M7103L3657L0646N203N2850N8644N47j6565m2474n0283
$$ 413495 388719 443054 490157 523814 554460 559663 612513 671157 671704 655139 612665 562382
9392E62382n9181l4213J969j1916k8813o2J6222J338L989o131k7759j0256r477
$$ 562382 503201 468988 470957 459041 430228 430166 446388 447726 451715 445584 417825 407569 398092
9379C98092O219K4586l1265j1968K8693J1932p690J5588K8779J6166J3903K3746
$$ 398092 404311 428897 397632 385664 414357 426289 418599 434187 462966 479132 493035 516781
9367E16781L1996J3342K4898O258P286M2184O8915O3145J15150J77602J81555
$$ 516781 548777 562119 587017 593275 600561 642745 711660 774805 889955 1067557 1249112
9356A249112J06990O8853N8648r095o0113j22051j25447j33166r8783j03536o5820
$$ 1249112 1356102 1424955 1483603 1474508 1414395 1292344 1166897 1033731 934948 831412 765592
9345G65592n8258k9101O437k4797l0486m7261N653N963O521j8718k5405k464r32
$$ 765592 707334 678233 684670 659873 629387 582126 587779 593742 600263 581545 556140 553676 552744
9332E52744j4028K4588M949m194J4889O919J1361Q712R612K8799M7555M6278O7440
$$ 552744 538716 563304 568253 564059 578948 585867 597228 605940 615552 644351 691906 738184 805624
9319H05624P8189R0856J14834J57979J62369J83882J23136J25717O9409k1060
$$ 805624 883813 974669 1089503 1247482 1409851 1593733 1716869 1842586 1911995 1890935
9309A890935r7546j37951j43393j72577j17508j06488j05319r6197m8330k4538
$$ 1890935 1793389 1655438 1512045 1339468 1221960 1115472 1010153 913956 865626 841088
9299H41088m6259k5408j5935j9356k63j830j9094l8071j5081j8868M083j2313
$$ 841088 794829 769421 753486 734130 733867 732037 712943 674872 659791 640923 645006 632693
9287F32693k5389J5659l036R205J0465q850J6847J7152j6939j3529M2215N7391
$$ 632693 607304 622963 619927 629132 639597 630747 647594 664746 647807 634278 676493 733884
9275G33884L7029R0765R9343R1998R0772R3355P5787M417n0203j5069l5049n9205
$$ 733884 770913 861678 961021 1053019 1143791 1237146 1312933 1317350 1267147 1252078 1217029 1157824
9263A157824o8846m0048o8075m7944o1708m2033l6958l5097m5582k5152k0239
$$ 1157824 1088978 1048930 980855 932911 871203 829170 792212 757115 711533 686381 666142
9252F66142k3273m025L220m96k5588k6783M366M5980L5183M036J6741R625j4417
$$ 666142 642869 638844 642064 641568 615980 589197 593563 639543 674726 678762 695503 705128 690711
9239F90711N921O59j8165n742m7O775K1746l96j5680n784N1314K7447L634L5667
$$ 690711 696632 697291 679126 673384 673337 680112 701858 701462 685782 679998 731312 758759 762393 798060
9225G98060N8741N7404O3424L8943n183k8285l1410o26m4279m4804k1628n3830
$$ 798060 856801 914205 977629 1016572 1011389 983104 951694 951068 906789 861985 840357 786527
9213G86527l6349m0832m5300k1844J446p755l928L2613K3053J2359n024j1721
$$ 786527 750178 709346 664046 642202 643648 635893 631965 664578 687631 699990 694966 683245
9201F83245n548K128j8070o602m188p828p394m66J0068l3016p877j584m316K7205
$$ 683245 677697 679825 661755 655153 650965 643137 635743 635277 645345 612329 604452 602868 598552 625757
9187F25757J5846J5315L1778o28n6286k2469J9039J9896k2502j2788n331N892
$$ 625757 641603 656918 688696 688068 631782 609313 628352 648248 625746 612958 607627 613519
9175F13519K4024M687l3011r048j2626j7213r330m2372j0371J5516K0339o65k8725
$$ 613519 637543 642230 609219 600171 587545 570332 561002 518630 508259 523775 544114 543449 514724
9162E14724J3002p07L2072J3401N926M766l321J488P337j4532k0696j4491k0813
$$ 514724 527726 527019 559091 572492 578418 583184 579863 581351 588688 574156 553460 538969 518156
9149E18156K0084M1011J3826Q401L8149M160k5965R60Q866L344J3313j2159k3173
$$ 518156 538240 579251 593077 601478 639627 643787 617822 618782 627648 630992 644305 632146 608973
9136F08973j3867r777L283l455J03K8507L5371J7986J5956M835o121k247j3217
$$ 608973 595106 585329 588612 585157 585260 613767 649138 667124 683080 687915 681794 679547 666330
9123F66330m3254J8998K6868K557J0M394K7688K1874l6266k8881L0456N6039k5377
$$ 666330 623076 642074 668942 671499 671509 675903 703591 725465 689199 660318 690774 746813 721436
9110G21436m184J2121K375L0556k4062k5959k3315M660J8248K1411K788J4479
$$ 721436 717252 729373 731748 762304 738242 712283 688968 693628 711876 733287 736075 750554
9098G50554j4043L2688L2097N439j2118J7472q052J2271K481m1033j0873L0747
$$ 750554 736511 769199 801296 806735 794617 812089 804037 816308 818789 777756 766883 797630
9086G97630K8533K036J8650J7986j0664l881J3837R96M939O69q163J761K9847
$$ 797630 826163 828199 846849 864835 854171 850290 864127 865123 870062 870731 862568 864329 894176
9073H94176K7508P202m703J2498J0226J4924j3479m893k1613L517K4671K5748
$$ 894176 921684 928886 924183 936681 946907 961831 948352 943459 921846 925363 950034 975782
9061I75782J5336J0807M9423O982l1714Q68K1914R250R64J4512J8898N392M327
$$ 975782 991118 1001925 1051348 1058330 1026616 1027484 1049398 1058648 1059612 1074124 1093022 1098414 1102741
9048A102741J3860M191K83p603j0086J5342K4995M2295K5971m743J0943m319J674
$$ 1102741 1116601 1120792 1121075 1113472 1103386 1118728 1143723 1186018 1211989 1207246 1218189 1213870 1215544
9035A215544J0005J0322J1281K1101J1562Q173J2295n21K482J4774r37J3100p414
$$ 1215544 1225549 1235871 1247152 1268253 1279815 1287988 1300283 1299762 1302244 1317018 1316081 1329181 1321767
9022A321767J7564K1185L5269L2838n206k4768P124J0920N714N879K3501J3454
$$ 1321767 1339331 1360516 1395785 1428623 1423417 1398649 1405773 1416693 1422407 1428286 1451787 1465241
9010A465241J282J8705J7094K732K370j2454J5624N022J1857R359O622K1236K8868
$$ 1465241 1466523 1485228 1502322 1505054 1507424 1494970 1510594 1515616 1527473 1536832 1543454 1564690 1593558
8997A593558L6971k5171K933J7898K020L0922K4190J8014J3198J4192J8122J7631
$$ 1593558 1630529 1605358 1608291 1626189 1628209 1659131 1683321 1701335 1714533 1728725 1746847 1764478
8985A764478J6936q556L0063J7758K1321K5967M9421P276J6158L6028K6654j124
$$ 1764478 1781414 1772858 1802921 1820679 1842000 1867967 1917388 1924664 1940822 1976850 2003504 2002380
8973B002380M2841K5872L0171J5313j3108k9044J360Q098L2613K0475K208K4719
$$ 2002380 2045221 2071093 2101264 2116577 2103469 2074425 2075785 2083883 2116496 2136971 2139179 2163898
8961B163898L1618K2514N825J7914J8017R422j1404K0649N0947L9772M7265L1423
$$ 2163898 2195516 2218030 2223855 2241769 2259786 2269208 2257804 2278453 2329400 2369172 2416437 2447860
8949B447860l512J7684K6075L6842M0423R898M9460N2825N746M2396R26R19K1862
$$ 2447860 2444348 2462032 2488107 2524949 2565372 2575270 2624730 2677555 2683301 2725697 2726623 2727542 2749404
8936B749404M8254P1591K9051M1298L8133K9908J7049L5538M9946N5100N5124
$$ 2749404 2797658 2869249 2898300 2939598 2977731 3007639 3024688 3060226 3110172 3165272 3220396
8925C220396R378M0655N6426L4273L5379N833K2041M9020P3171L9729M2817N0101
$$ 3220396 3229774 3270429 3326855 3361128 3396507 3402340 3424381 3473401 3546572 3586301 3629118 3679219
8913C679219K9262N5053O1210N3611M9660M4954M2742K8996O0630J01450P4901
$$ 3679219 3708481 3763534 3824744 3878355 3928015 3972969 4015711 4044707 4105337 4206787 4281688
8902D281688N5163M3054O2254M9408N3568Q9705O1698P5039M9570O7351O8485
$$ 4281688 4336851 4379905 4442159 4491567 4545135 4634840 4696538 4771577 4821147 4888498 4956983
8891D956983R2705R1248O9317Q5683P4715R0390J08813J10262R6115R1407J02769
$$ 4956983 5049688 5140936 5210253 5295936 5370651 5461041 5569854 5680116 5776231 5867638 5970407
8880E970407J09263R1644J01460Q4794R7691J28440J16981J55874J41016R2161
$$ 5970407 6079670 6171314 6272774 6357568 6455259 6583699 6700680 6856554 6997570 7089731
8870G089731J46180J17085J37592J38328J71773J71752J51278J32811J32829J72136
$$ 7089731 7235911 7352996 7490588 7628916 7800689 7972441 8123719 8256530 8389359 8561495
8860H561495J86705J57506J71486K38327K28589K09829K17254J89870J99867J84220
$$ 8561495 8748200 8905706 9077192 9315519 9544108 9753937 9971191 10161061 10360928 10545148
8850A0545148K23733K50151K43678K87238K63450K88420L11024K97198L14489
$$ 10545148 10768881 11019032 11262710 11549948 11813398 12101818 12412842 12710040 13024529
8841A3024529L39852L45979L58293L50013L41357L86921M08978M48693M44043
$$ 13024529 13364381 13710360 14068653 14418666 14760023 15146944 15555922 16004615 16448658
8832A6448658M53195M82916M79993M69198N14160N40286N55595N74524O00832
$$ 16448658 16901853 17384769 17864762 18333960 18848120 19388406 19944001 20518525 21119357
8823B1119357O32642O61941O92834O98568O95969P43987P75366Q24181Q60782
$$ 21119357 21751999 22413940 23106774 23805342 24501311 25245298 26020664 26844845 27705627
8814B7705627Q73770R10041R45125R78516J026744J022272J086133J134425J167611
$$ 27705627 28579397 29489438 30434563 31413079 32439823 33462095 34548228 35682653 36850264
8805C6850264J196967J220541J254132J300062J329181J335598J348998J399329
$$ 36850264 38047231 39267772 40521904 41821966 43151147 44486745 45835743 47235072
8797D7235072J405465J374838J399759J438351J430577J387792J387837J369029
$$ 47235072 48640537 50015375 51415134 52853485 54284062 55671854 57059691 58428720
8789E8428720J332952J269233J205557J148751J054903R65893Q57077P60044O47828
$$ 58428720 59761672 61030905 62236462 63385213 64440116 65406009 66263086 67023130 67670958
8780F7670958N72279M26907K64108J53754K7605o3918k20055l42899m28410n55612
$$ 67670958 68243237 68670144 68934252 69088006 69115611 69051693 68831638 68488739 68060329 67504717
8770F7504717o57505p38563q14225q91996r51710j035896j061714j119392j131550
$$ 67504717 66847212 66108649 65294424 64402428 63450718 62414822 61353108 60233716 59102166
8761E9102166j162207j203444j222201j210473j225275j215675j196839j192695
$$ 59102166 57939959 56736515 55514314 54303841 53078566 51862891 50666052 49473357
8753D9473357j190779j184518j162519j130511j130811j091514j035862j026080
$$ 49473357 48282578 47098060 45935541 44805030 43674219 42582705 41546843 40520763
8745D0520763j014945j007005r64188r01786q64552q72267q88229q47087q25002
$$ 40520763 39505818 38498813 37534625 36632839 35768287 34896020 34007791 33160704 32335702
8736C2335702q22297p74727p58697p30149p17474o97723o63754o30072o49047
$$ 32335702 31513405 30738678 29979981 29249832 28532358 27834635 27170881 26540809 25891762
8727B5891762o24416n73553n89893n53260n37766n48622n26374m73655m99883
$$ 25891762 25267346 24693793 24103900 23550640 23012874 22464252 21937878 21464223 20964340
8718B0964340m94526m83145m66935m45806m24577l82347l82984l75310l75012
$$ 20964340 20469814 19986669 19519734 19073928 18649351 18267004 17884020 17508710 17133698
8709A7133698l56564l75092l55335l61204l31191l41547l24685l25864k90893
$$ 17133698 16777134 16402042 16046707 15685503 15354312 15012765 14688080 14362216 14071323
8700A4071323k60505k72942k94255k99108k95899k66828k14204k32808k50529
$$ 14071323 13810818 13537876 13243621 12944513 12648614 12381786 12167582 11934774 11684245
8691A1684245k35413k18812k16951k22880k11993k12824j88927j76422j89144
$$ 11684245 11448832 11230020 11013069 10790189 10578196 10365372 10176445 10000023 9810879
8682I810879j91305j81197j89651j84645j88561j66632j57709j44902j73225j57956
$$ 9810879 9619574 9438377 9248726 9064081 8875520 8708888 8551179 8406277 8233052 8075096
8672H075096j57755j75967j50888j20698j21328j17530j13155r9160j49303j29481
$$ 8075096 7917341 7741374 7590486 7469788 7348460 7230930 7117775 7018615 6869312 6739831
8662F739831j31720j23278j20506j20905j10546r5695j17313j07165j11787j02968
$$ 6739831 6608111 6484833 6364327 6243422 6132876 6037181 5919868 5812703 5700916 5597948
8652E597948j02797p3538p4496j04497j00862r0451o1646p5631m9478o3376q2674
$$ 5597948 5495151 5421613 5347117 5242620 5141758 5051307 4989661 4914030 4864552 4801176 4718502
8641D718502q8546q1898o4151q9231q5431p7668p1878k6828m7527q1618n6157
$$ 4718502 4629956 4548058 4483907 4394676 4309245 4231577 4159699 4132871 4085344 4003726 3947569
8630C947569o7708p8620n1992k8016p454k0956p3109p8533o2793n5054o3434p0996
$$ 3947569 3879861 3801241 3749249 3721233 3713779 3692823 3619714 3541181 3478388 3423334 3359900 3288904
8618C288904m2170p346l8784l3468n3659r1333k2556m5139k0725m8281m9241o2575
$$ 3288904 3246734 3239388 3200604 3167136 3113477 3022144 2999588 2954449 2933724 2885443 2836202 2773627
8606B773627l4885p989k7093l8003k5081l7417j4012R542l3698j7266l6207j7654
$$ 2773627 2738742 2730753 2703660 2665657 2640576 2603159 2589147 2598689 2564991 2547725 2511518 2493864
8594B493864m8947j4110j0309m5248n8485m2682n1643k2901M811j0111j9692k6542
$$ 2493864 2444917 2430807 2420498 2375250 2316765 2274083 2222440 2199539 2204350 2194239 2174547 2148005
8582B148005m9476l6771j8593k3717n6355m3560l0257Q637J3080R77K1679l4340
$$ 2148005 2098529 2061758 2043165 2019448 1963093 1919533 1889276 1897913 1910993 1911970 1933649 1899309
8570A899309l7852m4441j3925j7367m4197m9223k8391m289R317j0413L469N693
$$ 1899309 1861457 1817016 1803091 1785724 1741527 1692304 1663913 1659624 1668941 1658528 1661997 1667690
8558A667690j0767p401j3050j831j3193j4474o106j9289k8088k9908j5499Q901
$$ 1667690 1656923 1649522 1636472 1634641 1621448 1606974 1600868 1581579 1553491 1523583 1508084 1516985
8546A516985q808j7003m5768k0636j279k5928K231n23k4111n0475j5788K2814
$$ 1516985 1508177 1491174 1445406 1424770 1423491 1397563 1399794 1399271 1375160 1324685 1308897 1331711
8534A331711o001m817m5083k9098j4951j2693M323J4203k6500m9708k9138M444
$$ 1331711 1325710 1320893 1275810 1246712 1231761 1219068 1223391 1237594 1211094 1161386 1132248 1136692
8522A136692O33j6033Q613k3106j724j7822j9044O756o559j1819k673j3253q713
$$ 1136692 1137325 1121292 1129905 1106799 1105075 1087253 1068209 1074965 1068406 1056587 1053914 1040661 1031948
8509A031948J026j347k4976n839P764q232j224L421l7135L139K5373j5023k5578
$$ 1031948 1032974 1031627 1006651 1000812 1008576 1000344 999120 1002541 965406 968545 993918 978895 953317
8496I53317Q455P083l0658k5688k3386j9194L608K675m593j9331k2213j3070o00
$$ 953317 961772 968855 938197 912509 889123 869929 873537 876212 871619 852288 830075 817005 816405
8483H16405j6079j4044k6205P754R772J0117L589m0221n094M3002J4847k7268
$$ 816405 800326 786282 760077 767831 777603 787720 791309 751088 745994 788996 803843 776575
8471G76575k8960j6964K661m918J0108O999j3847k7348j1971K9890L559k8752
$$ 776575 747615 730651 733312 728394 738502 745501 731654 704306 692335 722225 725784 697032
8459F97032l3689M963J9270M4858L5298k4929n5697l1483K1512K1314q745k5599
$$ 697032 663343 668306 687576 732434 767732 742803 687106 655623 677135 698449 689704 664105
8447F64105j465j0990k8491J0598J5737r734k5936m318n430j4425K267j4279M336
$$ 664105 662640 651650 623159 633757 649494 639760 613824 609506 604076 589651 591918 577639 581975
8434E81975K6433K0772l4918m4630K038K871j6153J4345M138n16o176j0506j0126
$$ 581975 608408 629180 594262 549632 551670 554541 538388 552733 556871 556355 550179 539673 529547
8421E29547k0563n592J1500j0079R28J9495J7074R534K5347j7092k6067j1225
$$ 529547 508984 503392 514892 504813 505741 525236 542310 551844 577191 560099 534032 522807
8409E22807m938m98O251k796P483p719K147r726l9710k8773L324O434J2245J4844
$$ 522807 517869 517371 523622 520826 528309 520590 522737 513011 473301 444528 447852 454286 466531 481375
8395D81375K3592j9443j6392L456k1684R529L2776L252m944k2016j3774k4034
$$ 481375 504967 485524 469132 472588 450904 460433 493209 496461 491517 469501 455727 431693
8383D31693m450N854J2408r807j641K4147j8545k034l6869l404J6465j0685o371
$$ 431693 427243 433097 445505 435698 434057 458204 439659 437625 400756 397352 413817 403132 396761
8370C96761j6792J7884l518k529J3181K592n4940l1868L598K6874L32J9800j3883
$$ 396761 379969 397853 394335 391806 404987 407579 352639 320771 324369 351243 351575 371375 357492
8357C57492j8414q9j1372j6127j4789O919J0410L5236j7386r985M398J3005k141
$$ 357492 339078 338989 327617 311490 296701 303620 314030 349266 331880 321895 326293 339298 337157
8344C37157r838J1161R256q9j6161p211J8972n839j1887K671L118j8464j2437
$$ 337157 327319 338480 347736 347647 331486 324275 343247 337408 325521 328192 331310 312846 300409
8331C00409K0015J222k770L2993J9080k7897l1655j9375m851J1602J9071K0856
$$ 300409 320424 321646 318876 351869 370949 343052 311397 292022 287171 298773 317844 338700
8319C38700O85k5023R258J2316j2433k883o35K0733J5756n959j4631j7112o526
$$ 338700 339385 314362 323620 335936 323503 320620 319985 340718 356474 350515 335884 318772 312246
8306C12246Q989k7387m662K6694O488J8633J8265K0813M1j7686j0573K035k3227
$$ 312246 321235 293848 289186 315880 322368 341001 359266 380079 380120 362434 351861 353896 330669
8293C30669l8317k9736j992q173p414k8625l992L4117M2201j5423k0777k4616
$$ 330669 292352 262616 260624 252451 245037 216412 212420 246537 288738 273315 252538 227922
8281B27922J8077Q170R382K9341n732o445j066L429K080r030K51j9699k4616j1113
$$ 227922 245999 254169 263551 292892 287160 280715 279649 283078 285158 276128 276379 256680 232064 220951
8267B20951J9570L2738j4139J526K3817J1849k2822j2468k7529J1805j3611J8544
$$ 220951 240521 273259 259120 260646 284463 296312 273490 261022 233493 245298 231687 250231
8255B50231j0966j3009J2976J9135k0420j774J268o498m793J5185K6904m0799
$$ 250231 239265 226256 239232 258367 237947 236173 237441 230943 226150 241335 268239 227440
8243B27440k7260L7498R347o884M684k5762J2346L3194q514j5436n106Q257j6138
$$ 227440 200180 237678 247025 240141 244825 219063 231409 264603 256089 240653 235547 243804 227666
8230B27666k1605P4K7257r805j1729O229J6933J7758k2233K641j686j0015j6752
$$ 227666 206061 206135 233392 223587 211858 218087 235020 252778 230545 233186 231500 221485 204733
8217B04733l1970l827M530q342o877J6317j3139j3169j4632l0372l790J2916L8506
$$ 204733 172763 168936 173466 165124 158247 174564 161425 148256 133624 103252 99462 112378 150884
8204A50884J4706j1238j6466m049L1913N292k4994N780K8717J2531P914J402m7723
$$ 150884 165590 154352 137886 133837 165750 171042 146048 151828 180545 193076 200990 202392 154669
8191A54669k0441q981L3833K3995j2411J67K377L288P489L665K338J3271k5187
$$ 154669 134228 125247 159080 183075 170664 170831 173208 176496 183985 187650 189988 203259 178072
8178A78072j2212K659j4381j3885J5544J7333O581m980k1203j6371j213K4580
$$ 178072 165860 168519 154138 140253 155797 173130 179711 174731 153528 137157 135944 160524
8166A60524L0299j2571j9313R833q495O03m142j046K454j454K526j8814j2419
$$ 160524 190823 178252 158939 168772 160277 160880 156738 155692 158146 156692 159218 140404 127985
8153A27985O831l02p992L6459L942l6064q977p939K4211R699j8347K0881k162
$$ 127985 134816 134514 126522 162981 166923 130859 121882 113943 138154 147853 129506 150387 148225
8140A48225j6899l65K4212k9765k1634j2428J2284q785j8756J2092K9440j3042
$$ 148225 131326 130961 155173 125408 103774 91346 103630 94845 76089 88181 117621 104579
8128A04579j648K2702j716J5983K0131k3172k3003p47q130P275Q918M132j2894
$$ 104579 102931 125633 123917 139900 160031 136859 113856 113109 104979 112254 121172 125304 112410
8115A12410m983r772n276K2998J6666J4746k5060J8262n584k1928k1031N623j716
$$ 112410 107427 97655 92379 115377 132043 146789 121729 139991 134407 112479 91448 97071 95355
8102I5355J4506N740L77l240J7268j1772j0199R025P656k7317l2091J0876J5233
$$ 95355 109861 115601 115978 112738 130006 118234 108035 117060 124716 97399 65308 76184 91417
8089I1417k808j7713j9259j0497L6275L1849R138o883k490m570J5147M335p932
$$ 91417 88609 70896 51637 41140 77415 109264 118402 111519 109029 104459 119606 123941 116009
8076A16009q097l6355L624K4639M514k3712l961N879o071j1270j383j002M056
$$ 116009 107912 71557 75181 99820 104334 80622 76661 82540 76469 65199 63816 62814 66870
8063F6870K432l927N934J1747k6225K812L6126J1767P760O348j4061k3216P420
$$ 66870 69302 65375 71309 83056 56831 59643 95769 107536 115296 121644 107583 84367 91787
8050I1787K2093J7065Q818j194J0551L408k0176k7072o655Q724k921j7666k873
$$ 91787 113880 130945 139763 138569 149120 152528 132352 105280 98625 107349 104428 86762 83889
8037H3889J5786N941j801l1777m361j5154K7084K4900L49K2362P236M616j8063
$$ 83889 99675 105616 103815 72038 67677 52523 79607 104507 104856 127218 134454 139070 121007
8024A21007q960k4353J2699M217k2113J9065K4215O614j2964j8097K6762N483
$$ 121007 112047 87694 100393 104610 82497 101562 125777 132391 119427 101330 128092 133575
8012A33575n223k8124j5480J7032K9079k1856k8713k9545l361K7091J2427J0546
$$ 133575 128352 100228 84748 101780 130859 109003 80290 50745 47384 74475 86902 97448
8000I7448M60j1025l3417j788K1906j3641j2855K8768L7430q399J3925j4481l3780
$$ 97448 97908 86883 53466 51678 73584 59943 47088 75856 113286 104887 118812 104331 70551
7987G0551j968k851n258j0088n509J5775J900L180k0142j0779K8588K1823L3950
$$ 70551 68583 65732 60474 50386 44877 60652 62552 65732 45590 34811 63399 85222 119172
7974A19172K3458m4314j0552J6628L290k4563k8183o759K3191J2805J0732k5174
$$ 119172 142630 98316 87764 104392 107682 83119 54936 48177 71368 84173 94905 69731
7962F9731o50J0868M880m009j4387j6417q172K1123j103R882J0589M423q887L090
$$ 69731 69081 79949 84829 80820 66433 50016 41844 62967 61864 71746 82335 86758 77871 80961
7948H0961M7643r046k3700O643k0404j9269Q763J8418P134k0883J9027N333j0927
$$ 80961 128604 119558 95858 102501 82097 62828 71591 90009 97143 76260 95287 100620 89693
7935H9693P52j6527j080j5803k698M1213K2036k7888m9949j3283O012K6133K4487
$$ 89693 90445 73918 72838 57035 54337 95550 117586 89698 39749 26466 32478 58611 83098
7922H3098L765j8029L0256R245p197j4305k9971q36J4798J3562l8284k1730M3896
$$ 83098 86863 68834 99090 108335 101138 86833 56862 56026 70824 84386 46102 24372 68268
7909F8268J7683j3193r40J1070O524N354Q878l129m1272j1282Q986j3227j6228
$$ 68268 85951 72758 71818 82888 89412 94766 103644 100515 59243 47961 56947 43720 27492
7896B7492J3514l470k7684L1429k188l457m3829K1910N5611J2598J2527r983k7743
$$ 27492 41006 37536 9852 41281 39093 35636 -8193 13717 69328 81926 94453 84470 56727
7883E6727j3154o094P237N463J0655K6631Q109m484l1785l0899K3521M697j7012
$$ 56727 43573 37479 44716 50179 60834 87465 95574 91090 59305 28406 51927 56624 39612
7870C9612L0406K0096L947J2181j3919j5949K503K4338p619k6453J2463p074q233
$$ 39612 70018 90114 94061 106242 92323 76374 78877 103215 95596 69143 81606 74532 66299
7857F6299l9935K04K4443j3986J2006J0107j0052j6285k3437J8082K8263j4849
$$ 66299 26364 26568 51011 37025 49031 59138 49086 32801 9364 27446 55709 40860
7845D0860J6808M398p263K679K4208j365j6101O419r415R979j2912l559j3073
$$ 40860 57668 62066 54803 57482 81690 80325 64224 70643 61228 71207 58295 54736 41663
7832D1663O011j129J3281Q364J5030l396k2449K4302j0717j8626j3446j1462k1951
$$ 41663 47674 46545 59826 68190 83220 79824 57375 81677 70960 52334 38888 27426 5475
7819E475J1659q657p9L77Q554p837J7349m785l881J6529J2930J8636N833j3937
$$ 5475 17134 8477 8398 8775 17329 9492 26841 22056 18175 34704 47634 66270 72103 58166
7805E8166q912J6814P144m535q621j1908L561r55Q957P369n107j321j5196l537
$$ 58166 49254 66068 73212 68677 60056 48148 51709 50754 59711 67080 61973 60652 45456 41919
7791D1919n814J156p412l5005j5308J9102R499J8255K515k08j1299j354K3942
$$ 41919 36105 37261 29849 -5156 -20464 -1362 8137 26392 28907 28699 17400 16046 39988
7778C9988J0694l209j5937j0277j1192k2889N389N4308m042j3983l0407N006J6500
$$ 39988 50682 47473 31536 21259 10067 -12822 -7433 46875 42833 28850 -1557 3449 19949
7765A9949L3574K1429j4729O431m0229k3188J1913K1069M77r079K0113J7777m696
$$ 19949 53523 74952 60223 66654 26425 3237 15150 36219 36696 27617 47730 65507 60811
7752F0811l8312o196J8580L803L2433j7649l2798J0355k0954l3216o005L2289
$$ 60811 22499 16303 34883 38686 71119 53470 20672 31027 10073 -23143 -29148 3141
7740C141K0234K4261n162K6475J3687m912q508p555j6002k797k679q396j1554
$$ 3141 23375 47636 42474 68949 82636 77724 69216 61661 45659 42862 40183 31787 20233
7727B0233M222J6242K2059P383j9853k2512j306K101o944K031j6689J4491L787
$$ 20233 24455 40697 62756 70139 50286 27774 26468 28569 21625 23656 6967 21458 25245
7714B5245k6341k3228j3893o170K6146M520J6614K5467J5785o751j5892J727k8864
$$ 25245 -1096 -24324 -38217 -44387 -18241 -13721 2893 28360 44145 37394 21502 23229 -5635
7701e635l1121M015N122K7888O65Q681P811J9505K998k0784j5985J5783J943K1406
$$ -5635 -36756 -32741 -27619 269 934 9615 17426 36931 39929 19145 3160 18943 20886 42292
7687D2292n464j2302L1572j461q307O141O093j1938l0736O580J1158J4860m753
$$ 42292 36828 24526 56098 54637 46330 52471 58564 46626 15890 22470 33628 48488 43735
7674D3735l2792M17l46k3928Q624L2868J7023j4487j4240j8411K2254K9471K7030
$$ 43735 10943 11360 11014 -12914 -4290 28578 45601 31114 16874 -1537 20717 50188 77218
7661G7218r290l8213l0041M143O325o218J7025J6151m494k5968k8018q258L2167
$$ 77218 67928 29715 -326 3817 10142 3924 20949 37100 32606 6638 -21380 -29638 2529
7648B529P650n021l046j716l002m066L233J6541j6005J1474k3227k3388R860P373
$$ 2529 10179 5158 2112 396 -2606 -6672 -3439 13102 -2903 8571 -14656 -38044 -28184 -20811
7634b0811k564k7051j6542K3547L292j8946K3617K7731J5124L0058q0n996j1540
$$ -20811 -23375 -50426 -66968 -43421 -40129 -59075 -35458 -7727 7397 37455 37375 31379 19839
7621A9839m9423j2051M1351J4718n94o826n764N275L37r838j8802P289K6872j879
$$ 19839 -29584 -41635 -284 14434 13840 7014 1250 6525 6862 -2976 -21778 -14489 12383 10504
7607A0504L84M327k4830J1097J7568J1422q916j6446o045L2253J5078n98j612
$$ 10504 10888 15215 -9615 1482 19050 30472 21556 5110 -935 31318 46396 45798 44186
7594D4186P716r248O021K3631J3847k3113l9395l496J6812n809q142j6716M3450
$$ 44186 51902 42654 48675 72306 86153 63040 23645 20149 36961 31152 23010 6294 49744
7581D9744J4557j9581o203j1378M998L5699j1434l9310l9677j4492K6716J794
$$ 49744 64301 44720 38517 27139 32137 67836 56402 17092 -22585 -37077 -10361 -8567
7569h567K3226J6415j2435k8642L903M114K312J1829J5638J4385l2960j4339Q397
$$ -8567 14659 31074 18639 -10003 -6100 -1986 326 12155 27793 42178 9218 -5121 3276
7556C276L620J655j6575J4109J1812J699j3298j832J3760Q791j5719k2261j5356
$$ 3276 6896 8551 -8024 6085 17897 19596 6298 4466 18226 27017 11298 -10963 -26319
7543b6319m49J0573L9197l1185k2132L7177K7974K1499P434k7934j7150j762l4616
$$ -26319 -26768 -16195 23002 -8183 -30315 6862 34836 56335 63769 35835 18685 16923 -17693
7530a7693k1114J4211K7824j105j4209L3691J3586k7397j1042J456j5485Q078
$$ -17693 -38807 -24596 3228 2123 -12086 21605 35191 7794 -3248 -1792 -17277 -9199
7518i199L0090p14k2744j5596m018K8525J3610J039J3648J3887J0805k9314j5589
$$ -9199 20891 20177 -2567 -18163 -22181 6344 19954 20993 34641 48528 59333 30019 14430
7505A4430K9886j9007l6769k228J204N31o558K555J8740J5430k1293j2211j4112
$$ 14430 44316 25309 -11460 -13688 -12484 -11953 -18511 -15956 2784 18214 -3079 -15290 -29402
7492b9402k846k0357K2623R214K2739Q763m845J5896j5262r325L965R556k1814
$$ -29402 -32248 -52605 -29982 -20768 1971 10734 5889 21785 6523 -2802 1163 10719 -11095
7479a1095r864J8726L2777o556r635j2566M537J457j5932k6284J2249k052O127
$$ -11095 -20959 -2233 30544 23988 14353 1787 6324 7781 -8151 -34435 -22186 -24238 -18111
7466a8111K8300J7886K903M4117J5113l2251j8835j3906J835K1817L977k6548
$$ -18111 10189 28075 30978 75095 90208 57957 39122 25216 27051 48868 52845 26297
7454B6297r191Q644K0823N634l8224n448q504J8844J0540m900j4082l939j4263
$$ 26297 17106 25750 46573 52207 13983 8535 31 18875 29415 24515 10433 6494 -7769
7441g769j1852j7943j0476K8653J8289L191K0616J7916J3424j3876j7936l5899
$$ -7769 -19621 -37564 -48040 -19387 -1098 2093 22709 40625 54049 40173 22237 -13662
7429a3662k3506k8268J3271J2531k304n067K6246M7500q616k9157J6357M546m989
$$ -13662 -37168 -65436 -52165 -39634 -41938 -47005 -20759 26741 18125 -11032 5325 9871 4882
7416D882k0881P604j6281k2300J1260M869J2837M628o310k5534K0155J6074Q647
$$ 4882 -15999 -8395 -24676 -46976 -35716 -30847 -18010 -13382 -19692 -45226 -25071 -8997 -350
7403c50K4574j1313l6281K437K1640L563J5988m193j873q425L3240J1692l3462
$$ -350 24224 12911 -23370 -20933 707 4270 20258 16065 14192 5767 39007 50699 17237
7390A7237l0330j1715J8587J1540k678l7199j5500K1498J8575q306Q538L4250
$$ 17237 -13093 -24808 -6221 5319 2641 -34558 -50058 -28560 -9985 -18291 -9753 24497
7378B4497j1831m345j4806q274j9342j0641R474k3655J1931L9046j8440j3004
$$ 24497 12666 8321 -6485 -14759 -34101 -44742 -35268 -58923 -46992 -7946 -26386 -39390
7366c9390k943l709N13K9664L062j6639J1546J4339l416K4120q128k0833N472
$$ -39390 -42333 -46042 -45529 -15865 -12803 -29442 -17896 -3557 -6973 17147 9019 -11814 -6342
7353f342J6005P058n109j2354r724k0204J0265J5473K7557k1190j5303r231r830
$$ -6342 9663 16721 11612 -742 -10466 -30670 -20405 -4932 22625 1435 -13868 -23099 -32929
7340c2929j1172K5864J705K5854K4763k3168k6801K8428J2859R51J5326P483p254
$$ -32929 -44101 -18237 -16532 9322 34085 10917 -15884 12544 25403 26354 41680 49163 41909
7327D1909m6311j8907M049J2656j349J9654n009k5607J7876K7390j5074j4074
$$ 41909 -4402 -23309 -19260 -6604 -7953 11701 6692 -18915 -1039 26351 11277 -2797
7315b797R193j9265r097K5171K8690j3649k0772r048Q290m077J7529M606Q015
$$ -2797 6396 -12869 -21966 3205 31895 18246 -2526 -11574 -3284 -7361 10168 14774 22789
7302B2789L485q152R793j3509k5122j6905L505J05L528L4390N400j0942j6854
$$ 22789 26274 18122 27915 14406 -10716 -27621 -24116 -24011 -20483 13907 19307 8365 -8489
7289h489j829l647p362k0911L245r601J1717K9814m680J3374q305m2695J5569
$$ -8489 -10318 -13965 -21327 -42238 -38993 -48594 -36877 -7063 -11743 1631 -6674 -49369 -33800
7276c3800P797K1663r510k6084J1951J0332M713k9947j232K3713K9645J012J1778
$$ -33800 -26003 -4340 -13850 -39934 -27983 -17651 -12938 -42885 -44117 -20404 9241 10253 22031
7263B2031j2003j7693Q482k422P537O969j3711r867j185j1136K9727o577r746
$$ 22031 10028 -7665 817 -1605 5932 12901 -810 -10677 -11862 -22998 6729 152 -9594
7250i594J2843j2895N952r73n817k0181l144M895M273J8491m610o81j9074K3087
$$ -9594 3249 -9646 -3694 -4667 -10484 -30665 -33809 -28914 -24641 -6150 -10760 -11441 -30515 -7428
7236g428K0132J3352J6707k0485j0506j7199j1510L382K305J829J471K7513k2415
$$ -7428 12704 26056 42763 22278 11772 -5427 -16937 -13555 -11250 -9421 -7950 19563 -2852
7223b852l3346O562J2431j0057J4076J5401n916l3827j3761J8718P566j8623O529
$$ -2852 -36198 -29636 -17205 -27262 -13186 2215 -3701 -37528 -51289 -32571 -25005 -43628 -37099
7210c7099k1105j385L5846O517l0462k1029M6989N825k313m268j655Q792J2282
$$ -37099 -58204 -59589 -23743 -17226 -47688 -68717 -21728 -15903 -18216 -22484 -24139 -15347 -3065
7197c065M173Q704l5963L208N048P401N39R583k3897o655l296J5405l818l7082
$$ -3065 1108 9812 -26151 -22943 -17895 -10494 -9955 -372 -24269 -30924 -34220 -18815 -22633 -59715
7183e9715j30k503J067M4284K6273l3171K3198J0292o791j7511P487k65j976j1422
$$ -59715 -59845 -62348 -61281 -16997 9276 -23895 -697 9595 2804 -14707 -7220 -7485 -9461 -20883
7169b0883J1182J3723K3320J043L358o129J6727l6260m0165J0915R557j7382p399
$$ -20883 -9701 4022 27342 28385 31743 25614 42341 6081 -34084 -23169 -13612 -30994 -38393
7156c8393j4837j915J2400L1762P195j5126K7028L361j9366j751O013k72l7212
$$ -38393 -53230 -55145 -42745 -10983 -3788 -18914 8114 11475 -7891 -9642 -3629 -3901 -41113
7143d1113j22J164J0428J4083o301j8113j158K4125l504K5252N954p468M285j7680
$$ -41113 -41235 -40071 -29643 -15560 -21861 -39974 -41132 -17007 -20511 4741 10695 3227 7512 -10168
7129a0168q483K5620L573k523j8540K1657L8836r568k2804k7407m3122J4269J4964
$$ -10168 -18651 6969 10542 8019 -10521 11136 49972 40404 17600 -9807 -52929 -38660 -23696
7116b3696o382J4403r435j7996L3092L402J919N887k3042q264K3447K4141K494
$$ -23696 -30078 -15675 -25110 -43106 -10014 -6612 -4693 1194 -21848 -30112 -6665 17476 19970
7103A9970l7374n2431N892J9389L7942o137k2765J2225M840K127j385l724Q308
$$ 19970 -17404 -69835 -63943 -44554 -6612 -12749 -35514 -23289 -18449 -16322 -17707 -21431 -13123
7090a3123K0337J9653L790k5766j0978J5359J4513l9537k2502P547L4079J0261
$$ -13123 7214 26867 30657 4891 -6087 9272 23785 -15752 -38254 -30707 3372 13633
7078A3633n424R865J5879j4066l5739j8512J5053L6071K5043p877J9770o35n2076
$$ 13633 8209 18074 33953 19887 -15852 -34364 -19311 16760 41803 33926 53696 53061 985
7065I85m995k3330J2548n806j7328J5139M864M956r746k544r50J6494P86k2443
$$ 985 -4010 -27340 -14792 -20598 -37926 -22787 -17923 -12967 -22713 -25257 -26207 -9713 -8927 -31370
7051c1370q291j2527K1185M581q313J3002o051j3722K428j2313P102j1023q124
$$ -31370 -39661 -52188 -31003 -26422 -34735 -21733 -27784 -41506 -39078 -51391 -44289 -55312 -63436
7038f3436K6563J1987k7271J201L1231j2473N731J617K1398J4084l916J3902n37
$$ -63436 -36873 -24886 -52157 -50956 -19725 -32198 -26467 -24850 -3452 10632 6716 20618 20081
7025B0081k5550j507k0190r093J0195J3589K3357k636j6060P042K1049k2499n818
$$ 20081 -5469 -6976 -27166 -36259 -26064 -12475 10882 8246 -7814 -772 20277 -2222 -8040
7012h040P1J1929l21O529l8434l4543O916R840L798k267j0524n457K5437K7660
$$ -8040 -7969 3960 3639 10168 -28266 -62809 -55893 -46053 -42255 -44522 -55046 -60503 -35066 -7406
6998g406O729J0126Q501l0390j9044r883n318k0041J4878J6630p768J3844p568
$$ -7406 -677 9449 17950 -12440 -31484 -41367 -46685 -66726 -51848 -35218 -42986 -29142 -36710
6985c6710Q309L501O85j22Q088M68J4079l232L016k196j6421l405j9551k8478
$$ -36710 -28401 -24900 -24215 -24337 -16249 -15781 -1702 -4934 -1918 -4114 -20535 -23940 -43491 -71969
6971g1969n547J9539L3059J9399N769j2967j5400J0508J0767m086j6373O836J1130
$$ -71969 -77516 -57977 -24918 -5519 250 -12717 -28117 -17609 -6842 -10928 -27301 -20465 -9335
6958i335k7206Q12P181J4725K5909j1316m438k410j4308r361j8307j0518J2386
$$ -9335 -36541 -35729 -28548 -13823 12086 770 -3668 -6078 -20386 -29747 -48054 -58572 -46186
6945d6186J9723k6555l3792K8033M0926P012k5509r108l1008r783M5518K2112
$$ -46186 -26463 -53018 -86810 -58777 -17851 -10839 -36348 -45456 -76464 -86247 -40729 -18617
6933a8617J3909K2758k0918l5554J6798J9280J9141l180l3218j8159N054K3024
$$ -18617 -4708 18050 -2868 -38422 -21624 -2344 16797 13617 -19601 -37760 -32706 -9682
6921i682J2719J4145K740k278J0545K050q700M169j4574l2224j4051J1362j2155
$$ -9682 3037 17182 19922 17644 28189 30239 21539 25708 11134 -21090 -35141 -23779 -35934
6908c5934J9382L7448J2179p008q948l4116l4325m23p59K0822q44k735k6070O409
$$ -35934 -16552 20896 33075 26067 17119 -16997 -51322 -51745 -52504 -31682 -32526 -35261 -61331 -54922
6894e4922M2079q26k5046K382j1367o720N0539K8465N3k7854q203q765j732J1905
$$ -54922 -12843 -13669 -38715 -36333 -47700 -54420 -3881 24584 24637 -3217 -11420 -20185 -21917 -10012
6880a0012L7064j6795K0290k1641l6976k5452p917J4142J893J7239J2141k8973
$$ -10012 27052 10257 30547 8906 -28070 -53522 -61439 -47297 -45404 -28165 -16024 -44997
6868d4997j3122k105J1540q174J5460L618J696J9388K0112O280l686l70k3511
$$ -44997 -58119 -60224 -48684 -56858 -41398 -37780 -36084 -16696 3416 9696 6010 5640 -17871
6855a7871k9100J7658R55r656j0231K972L050O546M885k841k435K1301L0948q0
$$ -17871 -46971 -29313 -28358 -38014 -48245 -45273 -42223 -35677 -30792 -33633 -36068 -14767 16181 16101
6841A6101j9343M913p014j6945J9725j4954j4706j0613k3651J5533K6134K78M253
$$ 16101 -3242 1671 -5343 -22288 -2563 -17517 -32223 -42836 -66487 -50954 -24820 -24542 -20289
6828b0289K161j2745p543L852n94L4125P547r350j6330j8038l109J3456M6222
$$ -20289 -18128 -30873 -38416 -34564 -35158 -1033 6514 -2836 -19166 -37204 -40313 -26857 19365
6815A9365K2349m0858m3089k0449N038k662J574K2691K9091p366L024l6082M803
$$ 19365 41714 856 -42233 -62682 -57644 -60306 -58732 -36041 -6950 -14316 -11292 -47374 -42571
6802d2571j1212R40L0914J684m680R768K0088K4943j8594j302j4679J3122m237
$$ -42571 -53783 -52843 -21929 -20245 -24925 -15157 4931 29874 11280 9978 -4701 8421 4184
6789D184l0581J4022j758n935J2005M67N803M722K951n711N270J0495n889l571
$$ 4184 -26397 -12375 -14133 -20068 -8063 -7596 -1793 2929 5880 169 5439 15934 10045 6474
6775F474J3372J017J0268J793m3870K2675J5339k1911k618j1825K8489k488r76
$$ 6474 19846 20863 31131 32924 -10946 11729 27068 5157 2539 -9286 19203 16715 15739
6762A5739k7457n683K8212o760k0947K001L1355K7703J6588m3659j7581j4657
$$ 15739 -11718 -17401 10811 4051 -16896 -14895 16460 44163 60751 17092 -489 -15146
6750a5146J9090Q857j7140k095k2890j8563L976J0540J2633j1641L931J1319k1002
$$ -15146 3944 12801 -4339 -6434 -29324 -47887 -43911 -33371 -20738 -32379 -28448 -17129 -38131
6737c8131j128J479j1790j1381m482K7396J5212K1937l112m055J3642J7741j331
$$ -38131 -39259 -37780 -49570 -60951 -65433 -38037 -22825 -888 -4000 -8055 5587 23328 21997
6724B1997j7936n3j580j9759Q862L248J337k0929j6451j9689J8850j2177j238
$$ 21997 4061 4008 2428 -17331 -8469 -5221 -3884 -24813 -41264 -60953 -42103 -54280 -55518
6711e5518n45j4801L2537M0978l9179o535K445P361P574n190K1235j90j0955m729
$$ -55518 -56063 -70864 -38327 2651 -36528 -43063 -40618 -33257 -25683 -30873 -9638 -9828 -20783 -25512
6697b5512P702m186j141R414K2293O03k9574K859K4247N000m531L0989j999O073
$$ -25512 -17810 -21996 -23137 -13723 8570 9173 -20401 -17542 6705 11705 7174 38163 36164 42237
6683D2237L1223Q408N692j4051j7890l0652j0228p477M049k6828k9014P135J0517
$$ 42237 73460 81868 87560 73509 55619 24967 14739 7262 11311 -15517 -44531 -37396 -26879
6670b6879K615J1406O806p802q000P564J0983J2145J4251J4529k2374k3012j1961
$$ -26879 -24264 -12858 -6052 -13854 -21854 -14290 -3307 8838 23089 37618 15244 -7768 -19729
6657a9729j7191L254k1593K7647o940q103L0458q876p166R063K9498L2502p477
$$ -19729 -36920 -33666 -55259 -27612 -34552 -42655 -12197 -21073 -28239 -19176 10322 42824 35347
6644C5347J7249K113K1234l1996l9991j7162j4610K5650J8551J7930J0211k6596
$$ 35347 52596 54709 75943 43947 3956 -13206 -27816 -2166 16385 34315 44526 17930
6632A7930k6618o843R599j6750N961m929O536k594r946k4597n5K2884N678l0972
$$ 17930 -8688 -15531 -5932 -22682 -16721 -21650 -15114 -17708 -27654 -52251 -52306 -29422 -23744 -54716
6618e4716J8217M3768K9510n529k8789j4269j1204q552j129M999J7764K506J9564
$$ -54716 -36499 7269 36779 31250 2461 -11808 -23012 -31564 -32693 -27694 -9930 -7424 12140
6605A2140K0857k8242l6501M443J6509q154n456J0049K0942M0756k8850l5748
$$ 12140 32997 4755 -31746 -27303 -10794 -18948 -24404 -14355 6587 47343 18493 -17255
6593a7255j742J3798L1331J1258r300j1606k354j3647k8201p966L579L7037J0504
$$ -17255 -18997 -5199 26132 37390 28090 16484 14130 483 -27718 -35684 -32105 4932 15436
6580A5436L526o888k7794k1607J6132k157k3408P624L1264J1773k5738j3364q031
$$ 15436 18962 12074 -15720 -37327 -21195 -23352 -46760 -39136 -7872 3901 -21837 -35201 -43232
6567d3232K7996L2880q388l3656J4205o199k4419J5482q511j5909M148K2302J6774
$$ -43232 -15236 17644 9256 -24400 -10195 -16394 -40813 -25331 -33842 -49751 -45603 -23301 -6527
6554f527l8481j8159M0340M6505M898j7036j0447k900l1071K0018J6733K333j8537
$$ -6527 -45008 -63167 -22827 23678 28576 11540 1093 -1807 -32878 -12860 3873 6206 -12331
6541a2331j7321j2062J6649M2988N097J5112k1180J1385j9679k2425j9124O950
$$ -12331 -29652 -41714 -25065 17923 23020 38132 16952 28337 8658 -13767 -32891 -25941
6529b5941K5601J161o21Q495l893k9922k5524K0532J1033l633j774n105J6330
$$ -25941 -340 821 200 8695 4802 -25120 -50644 -30112 -19079 -22712 -24486 -29591 -13261
6516a3261K0094M249J2096J3172l6269j5369P003K827j5242O878o163o12M695
$$ -13261 6833 11082 23178 36350 81 -15288 -8285 -5458 -20700 -13822 -19985 -20597 -15902
6503a5902L9910J9543j2813M9310p77j8547q339M359o652k6014q123l1412j7627
$$ -15902 24008 43551 30738 80048 79271 60724 52385 56744 50092 24078 15955 -15457 -33084
6490c3084q926l743Q202j2395J8058N843j6492k7073J3257L1753K0831M547j0604
$$ -33084 -42010 -45753 -37551 -49946 -31888 -26045 -42537 -69610 -56353 -24600 -3769 778 -9826
6477i826n166j7839R96O00J1897K4240K4656k130j0808J3177k386r415j6566K882
$$ -9826 -14992 -32831 -31835 -31235 -19338 4902 29558 27428 16620 29797 27411 17996 1430 4312
6463D312Q460L4k129r263J384j9733q822m924J8499k2051n3521l2573M6662L2772
$$ 4312 12772 12806 10677 1414 2798 -16935 -25757 -30681 -12182 -34233 -87754 -120327 -73665 -40893
6449d0893K683l3528L2692K4064q362J179j96j283m74j0359k6711m479K4584k719
$$ -40893 -38210 -71738 -39046 -14982 -23344 -22165 -22361 -23644 -24118 -34477 -61188 -65667 -41083 -43802
6435d3802N737k4197k591O767J2088k3523o497K1464K0420J1498J4249J1539J4252
$$ -43802 -38065 -62262 -64853 -58086 -45998 -69521 -76018 -54554 -34134 -22636 -8387 3152 17404
6422A7404N491l43m9020M494m245m376J5068l216L547j7689O340J5516p288o141
$$ 17404 22895 22552 -26468 -21974 -26219 -30595 -15527 -18743 -15196 -32885 -26545 -11029 -18317 -24458
6408b4458K7244p869n419M061J8106k2193j8088J9018L2045J573L51l260j0207
$$ -24458 2786 -5083 -10502 -6441 11665 -10528 -28616 -9598 22447 24020 24371 21111 10904
6395A0904j9320j1688l591J6856J3392K9373M366j9269j8708o833k9207p304p248
$$ 10904 -8416 -20104 -23695 -6839 6553 35926 40292 21023 2315 -4518 -33725 -41029 -48277
6382d8277K1388N029k678q43M779j4860k339J4907j7949R494J9313l24Q825p420
$$ -48277 -26889 -21860 -24538 -25381 -20602 -35462 -37801 -22894 -40843 -31349 -12036 -12360 -3535 -10955
6368a0955M882k8121j9231l402K9754L2488J4781j9743m518L208R0n813M413j2338
$$ -10955 -6073 -34194 -53425 -56827 -27073 5415 20196 453 -4065 -857 -767 -6580 -2167 -14505
6354a4505j3388J4893q497Q409Q329k0638K1968j4165j096J882J1518m5294j114
$$ -14505 -27893 -13000 -21497 -13088 -4759 -25397 -3429 -17594 -18690 -16808 -5290 -50584 -51698
6341e1698L4315k295q937j3655M577L4938K0067l607m745n765r574k2293K322
$$ -51698 -17383 -19678 -28615 -42270 -37693 -2755 17312 13705 8960 3195 -6379 -28672 -26350
6328b6350q517q241j8796j6798N774O855K0708O990j1195j4617k617J4195K8448
$$ -26350 -34867 -43108 -61904 -78702 -72928 -66073 -45365 -38375 -49570 -64187 -66804 -52609 -24161
6315b4161l1721q143L3501O389j0878l857K3563j4496o441P623j3973J6072J6650
$$ -24161 -55882 -64025 -30524 -24135 -35013 -38870 -15307 -29803 -36244 -28621 -42594 -26522 -9872
6302i872j0253j2259j9220Q498N092L9036k410k1753j2914J0529R098J5768L1638
$$ -9872 -20125 -32384 -51604 -43106 -38014 1022 -1388 -23141 -36055 -25526 -16428 -660 30978
6289C0978j5309j3198J1314k8830q167p452k2467j4693J444J0772K0078M7164
$$ 30978 15669 2471 13785 -15045 -23212 -30664 -53131 -67824 -66380 -55608 -35530 11634
6277A1634J4110j69j4228j3713J1744l0402j2582K0136l694j1063o613j2415j3330
$$ 11634 25744 25575 11347 -2366 9378 -21024 -33606 -13470 -17164 -28227 -34840 -47255 -60585
6264f0585J8933K6031k3907K2951J990L0090j2408q252M89k5714k1672O659R736
$$ -60585 -41652 -15621 -39528 -16577 -14587 15503 3095 -5157 -4668 -30382 -52054 -45395 -35659
6251c5659k462q342P319q251p452K0913j199j8646k671q601k0994J3630K6187
$$ -35659 -38121 -46463 -39144 -47395 -54847 -33934 -35133 -53779 -56450 -65051 -86045 -72415 -46228
6238d6228l74o39o382J3808M3340K5911l3615o058j919j1790J793J1184n33J237
$$ -46228 -46602 -47241 -53623 -39815 3525 29436 -4179 -10237 -12156 -23946 -22153 -10969 -11502 -10265
6224a0265J850P95o742J3015J2590k1797j9079k196J1654q704K3409L0176j9808
$$ -10265 -8415 -7620 -14362 -1347 11243 -10554 -29633 -31829 -20175 -28879 -5470 24706 4898
6211D898j9847n51J4419j7531j7482J6501J5717j5884M641J7585J735l376k7860
$$ 4898 -14949 -15500 -1081 -18612 -36094 -19593 -3876 -19760 -15119 2466 4201 825 -27035
6198b7035j5646K7659J3173j52J031k0158L950k543J0981K54O245n677L354Q681
$$ -27035 -42681 -15022 -1849 -2001 -970 -21128 -17178 -19721 -8740 -8486 -2241 -7918 -4564 4117
6184D117j0475l748J333j1804j1255L092k3895m1579j1989J1809K5837J9930K2729
$$ 4117 -6358 -10106 -8773 -20577 -31832 -28740 -52635 -94214 -106203 -94394 -68557 -48627 -25898
6171b5898J4953K9135j1793m3252l327J9210J1300J1965K283k2464J6192J4078
$$ -25898 -10945 18190 6397 -36855 -40182 -20972 -9672 2293 4576 -17888 -1696 12382
6159A2382m1849k1964j4193K6219M786J3263L2334L698k5639r677m858K020M510
$$ 12382 -29467 -51431 -65624 -39405 -34619 -21356 10978 14676 -10963 -20640 -25498 -23478 -18968
6146a8968k0510R427K2171L174L4936J6502l391j9852J664k2305j8263J4250L61
$$ -18968 -39478 -30051 -7880 -4706 30230 46732 43341 23489 25153 2848 -15415 -1165 -804
6133h04r530n74R942o805L744L2223N751M399J8204J1807m975j8079k1971l2498
$$ -804 -10334 -10908 -966 -7771 -4027 28196 33947 38346 56550 68357 63382 45303 23332 -9166
6119i166r471j2877J9200K5094j0037k8477j4018M2842J6640j8165j1784J9343
$$ -9166 -18637 -31514 -12314 12780 2743 -25734 -39752 3090 19730 1565 -10219 9124
6107I124K0491m329k2500k1112M893j449j1119j3722J4471L4159J1522l6972j3835
$$ 9124 29615 25286 2786 -18326 -13433 -14882 -26001 -39723 -25252 8907 20429 -16543 -30378
6094c0378J6025J0423O8j7732q552J5535K217l496k2736l2845J0226j706J1269
$$ -30378 -14353 -3930 -3862 -21594 -30146 -14611 -12394 -15890 -38626 -71471 -61245 -62951 -51682
6081e1682J5885N964K8124j340Q840j0029p547Q676P762j4563p724P547j7976
$$ -51682 -35797 -29833 -1709 -3049 5791 -4238 -11785 -3109 4653 -9910 -17634 -10087 -28063
6068b8063K816j5794n243J0530K921J3841J4640P561N197K447j9569k7706J8371
$$ -28063 -25247 -41041 -46284 -35754 -32833 -18992 -4352 3209 8406 10853 -8716 -36422 -18051
6055a8051j1086j1520q747L238J9730J1306J139J2507k9227k3135j1665J7114
$$ -18051 -29137 -40657 -49404 -46166 -26436 -15130 -13991 -1484 -30711 -53846 -65511 -48397
6043d8397L1193M2088r929N405j7018k6961j0138k474j6741Q883O982J1459J1525
$$ -48397 -17204 24884 14955 20360 3342 -23619 -33757 -36231 -52972 -44089 -37107 -25648 -14123
6030a4123L1280M1214r99p014j5744k6657k2838o219M136K8362k5087l0693J191
$$ -14123 17157 58371 57372 50358 34614 7957 -14881 -21100 -16964 11398 -13689 -44382 -43191
6017d3191J4792M01N089J196k5504m663K1846j1091K6025K1144j2604j1473m401
$$ -43191 -28399 -27998 -22909 -21713 -47217 -51880 -30034 -41125 -15100 6044 -6560 -18033 -22434
6004b2434Q218o407N240k10l145K8794J2036o002K144j298J7445J9168k7159l2695
$$ -22434 -14216 -20623 -15383 -15593 -18738 10056 22092 16090 18234 16936 34381 53549 26390 -6305
5990f305n485M4442l2873k4676M715J2400n965l170J0321j2355n432l018j0434
$$ -6305 -11790 32652 -221 -24897 -20182 -7782 -13747 -16917 -6596 -18951 -24383 -27401 -37835
5977c7835J1589J5778L869j9019l418Q722M679O014j3308J4283j5229r230L071
$$ -37835 -26246 -10468 -6599 -25618 -29036 -20314 -15635 -9621 -22929 -8646 -23875 -33105 -30034
5964c0034J3369J5669P362j682l3018m019J1110N607l1J2272o13L3232Q185j2085
$$ -30034 -16665 -996 6366 4684 -28334 -32353 -21243 -15636 -15667 -3395 -4008 29224 37409 25324
5950B5324Q916K8099k6406m3112j9535M232K0791J0305l490j8372l789J8357m231
$$ 25324 34240 62339 35933 -7179 -26714 -22482 -1691 8614 5124 -13248 -17037 1320 -2911
5937b911l7387j6479J4917J7576M261K0341j0415n31J0549k3p285k0368k7129
$$ -2911 -40298 -56777 -41860 -24284 -20023 318 -10097 -10628 -79 -102 -7387 -27755 -54884
5924e4884J592j640J0652K7717R302K5649r837J1329l1305N636J7110q836k4235
$$ -54884 -53292 -54932 -44280 -16563 -7261 18388 8551 19880 -11425 -5789 11321 2485 -21750
5911b1750J008K2630K2578J3935R049L059N563k1734l0806n107Q018k1563p288
$$ -21750 -20742 1888 24466 38401 47450 50509 56072 34338 3532 -1575 6443 -15120 -22408
5898b2408k3059r872K3653K2432L0962J7946l3871K47k4752k5138k3529O482K7855
$$ -22408 -45467 -55339 -31686 -9254 21708 39654 5783 6030 -18722 -43860 -67389 -60907 -33052
5885c3052j469j5900K0560K6457L6408j2854l3455l355K0707L0078k150M766k2693
$$ -33052 -34521 -50421 -29861 -3404 33004 20150 -13305 -16660 4047 34125 31975 36741 14048
5872A4048L362L210k2814k5154j1370J2975N727K26K1540j0646j2022R488J0197
$$ 14048 17410 20620 -2194 -27348 -38718 -25743 -20016 -19790 1750 -8896 -20918 -11430 -1233
5859a233j3779l1020J203L0094Q193m606O153J1853k4735j4045j5375J4489Q051
$$ -1233 -15012 -46032 -44829 -14735 -6542 -11148 -4995 6858 -17877 -31922 -47297 -32808 -24757
5846b4757Q994J4941j010Q152K062L208p361M004M2915j9268k9609K4243K1291
$$ -24757 -15763 -822 -1832 6320 8382 11590 4229 8233 51148 31880 2271 26514 47805
5833D7805o866j0231q826k4032k6796J1444J655L4910J9810k6403j6909k0216
$$ 47805 40939 30708 21882 -2150 -28946 -17502 -15847 19063 38873 12470 -4439 -24655
5821b4655O993J6286n948l6538m630J8432J3992J6594J2332m550l0961j1958K564
$$ -24655 -17662 -1376 -7324 -43862 -48492 -30060 -16068 526 12858 8308 -22653 -34611 -32047
5808c2047Q521j2993O7J3659O996p022p822j1549j5585Q930q096K8929L0196r754
$$ -32047 -23526 -36519 -36452 -22793 -15797 -22819 -30641 -42190 -57775 -48845 -56941 -28012 2184 -7570
5794g570n929j3054j644N226o601o90K8011n194R907q286j7691P790j8975o438
$$ -7570 -13499 -26553 -28197 -22971 -29572 -30262 -2251 -7445 2462 -5824 -23515 -15725 -34700 -41138
5780d1138k7004K626K5681J5111j9201j885K6813k311l062o758J0311j3566k2134
$$ -41138 -68142 -65516 -39835 -24724 -43925 -45810 -18997 -21308 -24370 -31128 -20817 -34383 -56517
5767e6517j5908L781J0832K4002J6471K3193J6549j3590k9136j2188r215k516
$$ -56517 -72425 -68644 -57812 -33810 -17339 5854 22403 8813 -20323 -32511 -41726 -44242
5755d4242J7975l647L9270J2726j9120m0571Q807n318q513j6890J4547J6447J7406
$$ -44242 -26267 -29914 9356 22082 2962 -37609 -28802 -34120 -42633 -59523 -44976 -28529 -11123
5742a1123m742k647J838K1852j2191J3416K5813j3296j0724J0970M062P623L2514
$$ -11123 -15865 -18512 -16674 5178 -7013 6403 32216 18920 8196 19166 23228 30851 63365
5729F3365K427l9391N239p549K492J8828j2154j7769J5548j566j9798l0377J4930
$$ 63365 65792 26401 31640 24091 26583 45411 33257 15488 31036 29470 9672 -20705 -5775
5716e775J6662l596k1460O487p66n275j4211K5087J3774M193j1247j8580J6209
$$ -5775 10887 7291 -14169 -7682 -8448 -13723 -27934 -2847 10927 15120 3873 -14707 1502
5703A502L420n904o597l3077k8334M226l811J447K9287Q615j660K0291P69o262
$$ 1502 4922 -982 -7579 -40656 -68990 -64764 -68575 -67128 -37841 -29226 -30886 -10595 -9826 -16088
5689a6088K2011j2198p92l429M602J0274j0918j1062j6108Q477j3170l9737J2447
$$ -16088 5923 -6275 -7067 -10496 -5894 4380 -6538 -17600 -33708 -25231 -38401 -78138 -65691
5676f5691K2806K1912M765J8842J6443j7379k6071O884j6739m632J0444j6511
$$ -65691 -42885 -20973 -16208 2634 19077 1698 -24373 -17489 -34228 -38860 -28416 -44927
5664d4927q942J7797J8012j3355k9423N578L9126M2592j4712l5172j316K3138
$$ -44927 -53869 -36072 -18060 -31415 -60838 -55260 -16134 26458 11746 -23426 -24742 -1604
5652a604L0276j4754j7919J97M309j9147p602K578J0111P867J6738K692K1258
$$ -1604 28672 13918 -4001 -3804 505 -18642 -26244 -23666 -13555 -5688 11050 13742 35000
5639C5000M492r841k8747k0946K0119K3758j5533j7708j3752J4541J0959k3776
$$ 35000 39492 29651 904 -20042 77 23835 8302 -9406 -23158 -8617 2342 -21434
5627b1434j1483J1627L3028M3437J9178j1061l6302q04p647j1876j4862j7015
$$ -21434 -32917 -21290 11738 55175 74353 63292 26990 26186 18539 6663 -8199 -25214
5615b5214k8806Q765j224K888K0168J4137N1756k6087k3691L3884n624j4127R617
$$ -25214 -54020 -45255 -46479 -43591 -23423 -9286 42470 16383 -7308 26576 20952 6825 16442
5602A6442L400j5870k0102R48l482q648K3711k962j0846J1378j8558k9555l939
$$ 16442 19842 3972 -16130 -15182 -18664 -27312 -3601 -6563 -17409 -6031 -24589 -54144 -58083
5589e8083N403J1859L9988L6770J8420k2679m0562r0M4793N564j7585m358j2759
$$ -58083 -52680 -40821 -833 35937 54357 31678 -8884 -8974 35819 41383 23798 19440 6681
5576F681j04K183m605j1670j7564k6891l586R708l03Q196N229K6317K2302j9176
$$ 6681 6577 8760 4155 -7515 -25079 -51970 -55556 -45848 -46151 -37955 -32726 -6409 15893 -3283
5562c283J2811J7942k4506j3895k238J4827n94j4554L4843J0323k6931o63o405
$$ -3283 9528 27470 2964 -10931 -13169 1658 1064 -13490 21353 31676 4745 4082 -2323
5549b323m86K5450O653k7132j1788k289J2979J203N652L691k2471j1677M541N776
$$ -2323 -2809 22641 29294 2162 -9626 -11915 1064 2267 7919 11610 -10861 -22538 -17997 -12221
5535a2221j429o692j482j0894J0490L2946k204j485k1947j6926l4842K7896M637
$$ -12221 -13650 -20342 -21824 -32718 -22228 10718 8514 7029 -14918 -31844 -66686 -38790 -34153
5522c4153J5630K9558l459k1823J1427k2364L396L7738K1746r098j8847k1290
$$ -34153 -18523 11035 7576 -14247 -2820 -25184 -21788 15950 37696 28598 9751 -11539
5510a1539k7933L701M2244K2709j9059M619K633j9678k1946J3732J3155p215K0033
$$ -11539 -39472 -35771 6473 29182 10123 14742 17375 -2303 -24249 -10517 2638 -4577 15456
5497A5456O418r603o144j4872r392Q453K6354N979L050j0681r355P013j5444n526
$$ 15456 21874 12271 6127 -8745 -18137 -9684 16670 22649 25699 15018 5663 12676 -2768 -8294
5483h294k7751j409P984j1302j5559K0221k4570M782O387L336K5828j3091r948
$$ -8294 -36045 -37454 -29470 -40772 -56331 -36110 -60680 -55898 -49511 -46175 -20347 -33438 -43386
5470d3386J7555J0174K721N995R035J7884k1984m4650j2041k7275l251j525l362
$$ -43386 -25831 -15657 -12936 -6941 2094 19978 -2006 -46656 -58697 -85972 -89223 -90748 -94110
5457i4110J2189K9662J7691p606K4362J2581k3046j1134j4489k824n72J7269J9957
$$ -94110 -81921 -52259 -34568 -42174 -17812 -5231 -28277 -39411 -53900 -56724 -57296 -40027 -20070
5444b0070j3990k0909J1937K4733M07k5139q252N988K1413J555J2435J6426m354
$$ -20070 -34060 -54969 -43032 -18299 -17892 -43031 -51283 -45295 -23882 -22327 -9892 6534 2180
5431B180j3978p323J0103j263o979K076r458j6365N04J9165J6073o61N0399K1334
$$ 2180 -11798 -19121 -9018 -10281 -17260 -15184 -24642 -41007 -40503 -21338 -5265 -5926 44473 65807
5417F5807O650k2519p972j7371k0338j9338L9816j10k3741r464J7279J1662j607
$$ 65807 72457 49938 41966 24595 4257 -15081 24735 24625 884 -8580 8699 20361 18754
5404A8754J9639j6342j3480l8742j6534K4259L5354P033k509m3936j8039Q256
$$ 18754 38393 22051 8571 -30171 -46705 -22446 12908 19941 17432 -26504 -44543 -36287
5392c6287K9299J1293J0438j7752J6501J0927L728o802o519p903l3431n886L6080
$$ -36287 -6988 4305 14743 -3009 13492 24419 28147 21345 14826 6923 -26508 -32394 3686
5379C686L1679k863k9266k1089m223J1677J8704J1048L395k2932l0315j2770K1083
$$ 3686 35365 32502 3236 -17853 -22076 -10399 8305 19353 22748 -184 -30499 -43269 -22186
5366b2186m134k7885l715J5123K1901J9129K2929J2020N076R103j5758k692J448
$$ -22186 -26320 -54205 -57920 -42797 -20896 -1767 21162 33182 38258 47361 31603 28911 30359
5353C0359j6183k4841k8427K1482j1098o964K1526j2453J0936m694J7562K4819
$$ 30359 14176 -10665 -39092 -17610 -28708 -35672 -14146 -26599 -15663 -20357 -2795 22024
5341B2024J7127q28j1925j0608r103j1214O023j4891k2348j4146J6778n083M342
$$ 22024 39151 38323 26398 15790 6687 -4527 1496 -13395 -35743 -49889 -33111 -38194 -33852
5328c3852J6020J6105j2353L446J9184k420J410k501J1353j0029j8240J4021q468
$$ -33852 -17832 -1727 -14080 -10634 8550 6130 7540 5039 16392 6363 -11877 2144 -6324
5315f324M473J066J3456o626j5140K347M361k3443k9628R505J4152p710K4446
$$ -6324 -1851 -785 12671 6045 -9095 -6748 -2387 -25830 -55458 -45953 -31801 -39511 -15065
5302a5065q224K788O342o016j4487K5445K6907l247J241n776j9955K6296l129
$$ -15065 -23289 -20501 -14159 -20175 -34662 -9217 17690 14443 15684 9908 -10047 16249 13120
5289A3120K3515n26L476r869R432O972r897k8235R665J712J0782k3866k7599J4838
$$ 13120 36635 36109 39585 29716 39148 46120 36223 7988 17653 19365 30147 6281 -21318 -6480
5275f480K0174j1149J619o776J1745L772j5479j9714l342J458p464P339K5533
$$ -6480 13694 2545 4164 -2612 9133 12905 -2574 -22288 -25630 -24172 -31636 -24297 1236
5262A236L6395L4677K4926j0897o439m6693n3382m939L75j2693P022J3911k1271
$$ 1236 37631 72308 97234 86337 79898 33205 -20177 -25116 -24741 -37434 -30412 -16501 -37772
5249c7772l053J6212K2532k556J8238R680o776J4137j3722J828j1502j1856J4703
$$ -37772 -40825 -24613 -2081 -4637 13601 23281 16505 30642 16920 18748 7246 -4610 10093
5236A0093j8323j5508j1446r401P980K3875O902j1439j0372M280L3263M966j1932
$$ 10093 -8230 -23738 -35184 -44585 -36605 -12730 -5828 -17267 -27639 -23359 9904 14870 2938
5223B938j6421m1661J6024L762o219j1012L989N2749J1887p707J1669M046j2588
$$ 2938 -13483 -55144 -39120 -35358 -41577 -52589 -48600 4149 16036 8329 19998 24044 11456
5210A1456l0j2934J3590J825j7563j8151r582R614K9000j5815j4347j4423k4926
$$ 11456 11426 -1508 12082 13907 -3656 -21807 -31389 -21775 7225 -8590 -22937 -37360 -62286
5197f2286P66J8570k193r899J6747k732K3405j2121J413p818j101j8279K8027
$$ -62286 -61520 -42950 -45143 -55042 -38295 -41027 -17622 -29743 -28330 -36148 -37249 -55528 -27501
5184b7501L8483k194J0386J0631k0008k6549m979K490r866J5175J015Q078J187
$$ -27501 10982 8788 19174 29805 9797 -16752 -21731 -19241 -29107 -13932 -12917 -4839 -3652
5171c652n460l7048j081J1981J2653O597k1161k0998J0684n128k508K6813p95
$$ -3652 -9112 -46160 -47241 -35260 -22607 -16010 -37171 -58169 -47485 -52613 -55121 -28308 -29103
5158b9103P004n913j2844Q747K4575L744m419K004k7054q146m094J8549L459j7579
$$ -29103 -22099 -28012 -40856 -32109 -7534 -3790 -8209 -6205 -33259 -41405 -45499 -26950 -23491 -41070
5144d1070m048J6097J2694J0058j131J678k2741K0459N001r312j6557K2496j5456
$$ -41070 -45118 -29021 -16327 -6269 -7400 -5722 -28463 -8004 -3003 -12315 -28872 -6376 -21832
5131b1832j0151j0906J8519J1706k1278J604k092j0493M042K1917L1171K9326
$$ -21832 -31983 -42889 -24370 -12664 -33942 -32338 -34430 -44923 -40881 -18964 12207 41533
5119D1533k7394l829l617L959J8886K0808l2202n3838j2828Q204N297l468J2475
$$ 41533 14139 10310 6693 10652 29538 50346 18144 -35694 -48522 -40318 -35021 -38489 -26014
5106b6014J3462N113K455j3409J8265k3477j6877J9031J5077o956J9397n817k1663
$$ -26014 -12552 -7439 -4984 -18393 -128 -23605 -40482 -21451 -6374 -13330 6067 250 -21413
5093b1413j7823j9561L0502L6355k3373k5384N763J9863J5669q487p125m554l929
$$ -21413 -39236 -58797 -28295 8060 -15313 -40697 -34934 -15071 598 -7889 -15014 -19568 -23497
5080b3497j1121K0975J4134j6855j6901J8341J5569j4805N738K6338k7258k1423
$$ -23497 -34618 -13643 491 -16364 -33265 -14924 645 -14160 -8422 17916 -9342 -30765
5068c0765K9779N4904j0551j6629n910J1299L728j3790o773R078l0718k7166Q91
$$ -30765 -986 53918 43367 26738 20828 32127 35855 22065 15292 24370 -6348 -33514 -32623
5055c2623K2028J9418K4770K133j073k3438j4072R149J8471k8231j2007P522m121
$$ -32623 -10595 8823 33593 35726 34653 11215 -2857 6292 24763 -3468 -15475 -7953 -12074
5042a2074q743k584J3099J8065l427K7912P621k6433j572J4090q664l2081k1018
$$ -12074 -20817 -23401 -10302 7763 4336 32248 39869 13436 11864 25954 17290 -14791 -35809
5029c5809J6630K3433n1731j8177J9179J9954K7648J4347N824m219k5841p196
$$ -35809 -19179 4254 -47477 -65654 -46475 -26521 1127 15474 21298 17079 -8762 -15958
5017a5958k178l597J3461M207K3264k15k503j1236j6544K7968K6335j4334l0130
$$ -15958 -18136 -21733 -8272 -4065 19199 18984 16481 5245 -11299 16669 43004 28670 -1460
5004a460q305N393K8944K1446k913j5J4445k2901l2421k5636r894M515M2697L623
$$ -1460 -9765 -4372 24572 46018 43105 43090 57535 34634 2213 -23423 -33317 -28802 13895 17518
4990A7518j8922K1100Q980l001N818K5942J5120j071k8824m5137j4116J4235l970
$$ 17518 -1404 19696 28676 25675 31493 57435 72555 71484 42660 -2477 -16593 -2358 -6328
4977f328j3304n71l830p38O007L255K5570j898k5188j516k963m891r39K875p125
$$ -6328 -19632 -20203 -24033 -24771 -18764 -15509 10061 8163 -17025 -18541 -21504 -26395 -27334 -24459 -31584
4962c1584J0968J8661Q559J9299J6872j2046j0999k5716k9632j8655K5089K6800
$$ -31584 -20616 -1955 6604 25903 42775 30729 19730 -5986 -35618 -54273 -29184 -2384
4950b384j0631k2522L1108J9287R946N337j0753k0492m7282K4774K4410k9670
$$ -2384 -13015 -35537 -4429 14858 24804 30141 19388 -1104 -48386 -23612 798 -28872
4938b8872k8680K6063K6433Q521L1189O526m313K7384J8553l2668j6059k4876
$$ -28872 -57552 -31489 -5056 3465 34654 41180 36867 64251 82804 50136 34077 9201
4926I201q814J5414l128M094n819k2100N905K1346N719J1587j034r85K2966k3392
$$ 9201 387 15801 12673 16767 10948 -11152 -5247 16099 21818 33405 32371 31386 54352 30960
4912C0960q106q368l041R98m853l6568K503n788j6195L4520K5636L3291r12m4848
$$ 30960 22854 14486 11445 12443 7590 -28978 -26475 -32263 -48458 -13938 11698 44989 44077 -771
4898g71p070j4363k1559K0976k0405J2874j9224j6658J0023O901J3873o929N108
$$ -771 -7841 -22204 -43763 -22787 -43192 -30318 -49542 -66200 -56177 -49276 -35403 -42332 -37224
4885c7224N764L325N262q645r017J4504L387J0666L0343n252k0621j0404j6516
$$ -37224 -31460 -28135 -22873 -31518 -40535 -26031 -22644 -11978 18365 13113 -7508 -17912 -34428
4872c4428q302J3486L493O715K8957l8235k9082p990O212J2644L0310L6520j0317
$$ -34428 -42730 -29244 -25751 -19036 9921 -28314 -57396 -65386 -59174 -46530 -16220 20300 9983
4859I983j6353j1066l5168J8937r182j700O377J6808k0563j1595l5479L925M2642
$$ 9983 -6370 -17436 -52604 -33667 -42849 -44549 -38172 -21364 -41927 -53522 -89001 -85076 -42434
4846d2434J4964J6385L571j8277k4862J4223L2426K1555o965j0784k8964j0253
$$ -42434 -27470 -11085 -7514 -25791 -50653 -36430 -4004 17551 10586 -198 -29162 -39415
4834c9415J1964K0909j4907j7008N92L6601K0609J0520k8574j6606l3882n057
$$ -39415 -27451 -6542 -21449 -38457 -37865 -1264 19345 29865 1291 -15315 -49197 -54254
4822e4254J6508K1077j0499j0174J388J3413J6233N939k1839j2296J8625K3609
$$ -54254 -37746 -16669 -27168 -37342 -35954 -22541 -6308 -369 -22208 -34504 -15879 7730
4810G730j6656r386j2709J2717J6268K1468j5515n323q145J356j6995M63K2715
$$ 7730 -8926 -18312 -31021 -18304 -2036 19432 3917 -1406 -9551 -8195 -25190 -24727 -2012
4797b012J5827j7314R90Q799m9254m0601M1569L9771m19j0612j0915k311j1583
$$ -2012 13815 -3499 -2509 6290 -42964 -83565 -41996 -2225 -2644 -13256 -24171 -26482 -38065
4784c8065J268J6429K6588J4799k0137n107O840O471j1200J0759M869O931j5052
$$ -38065 -36797 -20368 6220 21019 882 -4225 2615 9086 -2114 8645 13514 20445 5393
4771E393J4815L97m122l0394m3284P656M4936J0082j4025R423J1004k1695k3792
$$ 5393 20208 20605 16483 -13911 -57195 -49539 -4603 5479 -8546 877 11881 -9814 -33606
4758c3606j361j0887j4558K307L3386o127r271K065K8058R353K1003K0563L101
$$ -33606 -34967 -45854 -60412 -58105 -24719 -30846 -40117 -38052 -9994 -641 20362 40925 44026
4745D4026j1160j6830o359j0599L167l139J2135J1317l1166k0437K144J6851O193
$$ 44026 32866 16036 9677 -922 2245 -894 11241 22558 -8608 -29045 -26901 -10050 -3857
4732c857N255J3471j3376j8540j9535L9373L4240L880j5706m0728N10j5930O162
$$ -3857 1398 14869 1493 -17047 -36582 2791 37031 40911 25205 -15523 -15013 -30943 -24781
4719b4781k3200P120L1624l010o281J9588m267J9363M59P27o519o651K5634L312
$$ -24781 -47981 -40861 -9237 -12247 -18528 1060 -3207 16156 16615 17342 10823 4172 29806 33118
4705C3118N967q322j311m0693J0078J4768J435m6071N477K1122L0754J2420r407
$$ 33118 39085 30763 29452 -11241 -1163 13605 15040 -31031 -25554 -4432 26322 38742 29335
4692B9335P84j7742r507L558J1525L897Q961l215j6588J0747R100j2131o822P094
$$ 29335 30119 12377 2870 6428 17953 21850 30811 27596 11008 21755 30855 18724 11902 18996
4678A8996Q016N314m642j6122l9599j2344P938J1819k701O557j5677j2696L1092
$$ 18996 27012 32326 27684 11562 -28037 -40381 -32443 -20624 -23325 -16768 -32445 -45141 -14049
4665a4049K2689J812K640J5482k744l153k9984j4742J1228J9867j21L425n600
$$ -14049 8640 10452 13092 28574 25830 22677 -7307 -22049 -10821 9046 8925 12350 6750
4652F750J3853l804l0463J064k6962j3191K8094J1689L399Q228j138k0922p340
$$ 6750 20603 16799 -13664 -12600 -39562 -52753 -24659 -12970 -9571 -1343 -2481 -23403 -30743
4639c0743J9900K2282Q131k02M789N613n754J1084k4891j8091J6364n457L453
$$ -30743 -10843 11439 19570 19368 24157 29770 24016 35100 10209 -7882 8482 3025 6478
4626F478J4943n554k0071r724j2375k171P785O564J8166j5279j5383j7100M2155
$$ 6478 21421 15867 -4204 -13928 -26303 -28474 -20689 -14125 4041 -11238 -26621 -43721 -1566
4613a566Q016r330P279K2513L1148m412l3482j0013j3116K745K3136N996k702
$$ -1566 6450 -2880 4399 26912 58060 53648 20166 10153 -2963 -218 22918 28914 26212
4600B6212r482m7336j8293L9505K6104q782j3607j9767o918o41L0768K0417j0081
$$ 26212 16730 -30606 -48899 -9394 16710 7928 -5679 -25446 -32364 -33005 -2237 18180 8099
4587H099J2015k1778j1162L999o622K868J8080J3218J2439P879k740j2744p715
$$ 8099 20114 -1664 -12826 -8827 -15449 -12581 5499 18717 31156 39035 36295 23551 15836
4574A5836k1198J1525j6939j2934K5015J3176k7082k4705j4265K9610o07K1569
$$ 15836 -5362 6163 -10776 -23710 1305 14481 -12601 -37306 -51571 -21961 -22568 -999
4562i99Q454k799r346m1r239L800J5165L8988R116j2276j9056k1348N965L501
$$ -999 7455 4656 -4690 -4731 -13970 -10170 4995 43983 53099 40823 21767 419 6384 9885
4548I885o426j03J222K5467M103q647j424O258k2809j1953l680M16L323J2941
$$ 9885 3459 3356 4578 30045 34148 25501 24077 30335 7526 -4427 -8107 -7691 -4368 8573
4534H573j808j4272K1265l014j1987J8792m65k2361J2042j9898j4642P480J4302
$$ 8573 6765 -7507 13758 10744 -1243 17549 17084 -5277 6765 -13133 -27775 -20295 -5993
4521e993J6538Q067L2119j1k3162j9728p632K9657J3863N294k9481k3387K1822
$$ -5993 10545 18612 50731 50720 27558 7830 198 29855 43718 49012 19531 -3856 17966
4508A7966j2537j3723k1764j9020K1187J492J3444K0801m841J0420j0006n004
$$ 17966 5429 -8294 -30058 -49078 -27891 -26399 -12955 7846 3005 13425 3419 -1585
4496a585j3456m216j171J3735K415q359m575L5784J7032k5656p679m8771J6901
$$ -1585 -15041 -19257 -20428 -6693 -4278 -12637 -17212 18572 35604 9948 2269 -46502 -29601
4483b9601L9421K6598j0462m502j2032p364l1108l405J1984j6304k2421K508L4538
$$ -29601 9820 36418 25956 21454 9422 2058 -29050 -32455 -20471 -36775 -59196 -56688 -22150
4470b2150K9352m1937j9037J6573J319j654K4255Q83j3158J6896J618k8191L153
$$ -22150 7202 -34735 -53772 -37199 -35880 -37534 -13279 -12396 -25554 -8658 -7040 -35231 -32078
4457c2078J6608l9202j0848J8388J3090J9997m210J4395k5504k31j4156K2549
$$ -32078 -15470 -54672 -65520 -47132 -34042 -14045 -18255 -3860 -29364 -29595 -43751 -21202
4445b1202j0592j912P790j639P887J6084k6072j4684J3499m76j6916K064K6346
$$ -21202 -31794 -33706 -25916 -27555 -19668 -3584 -29656 -44340 -30841 -31317 -48233 -46169 -19823
4432a9823J6055J0570k6288j6741j26P091P228k0813j5721K3249K8125l568q17
$$ -19823 -3768 6802 -19486 -36227 -36353 -29262 -22034 -42847 -58568 -35319 -7194 -10762 -11579
4419a1579L7682j6514l3042J2537M648J4857K27j6466p409k937K153N430j5218
$$ -11579 26103 9589 -23453 -10916 -6268 8589 8816 -7650 -15059 -17996 -15843 -10413 -25631
4406b5631J5678J0820j3405j2003j9923j8769Q847l307k30m910j0071O01L0612
$$ -25631 -9953 867 -12538 -24541 -44464 -63233 -54386 -57693 -57923 -62833 -72904 -72303 -41691
4393d1691O472j7756q844K6869K7006J3320K391k9013j2875L3799J7884m1025
$$ -41691 -35219 -52975 -61819 -34950 -7944 5376 7767 -21246 -34121 -322 17562 -23463
4381b3463K808J763J885K4011M694l2750j3873K2170j734k291L8136p167j4228
$$ -23463 -20655 -18892 -17007 7004 11698 -21052 -34925 -12755 -14489 -16780 21356 14189 -39
4368c9L486R625q954q816j714l7212k147K6736K5790j069J9889p007o630N026
$$ -39 3447 13072 4118 -4698 -6412 -43624 -45771 -19035 6755 5686 25575 18568 11938 16964
4354A6964j5979j8579J4889P210j4651k3998L858M367k3770r866K0782J3966J0328
$$ 16964 985 -17594 -2705 4505 -10146 -34144 -30286 -25919 -49689 -59555 -38773 -24807 -14479
4341a4479k673m350R991J7018P995J2708J5132m526k4391k0806P047R867p813
$$ -14479 -17152 -21502 -11511 5507 13502 26210 41342 36816 12425 -8381 -1334 8533 720
4328G20k1055R026L39l730j1922J7869J360j133P543N517k344J0642j1521j0875
$$ 720 -20335 -11309 -10970 -14700 -26622 -8753 -7393 -8526 -983 4534 2190 12832 1311 -9564
4314i564Q228j408K657k2767j204K7579o65k6704L569O879j033J6370R859N79
$$ -9564 -1336 -2744 -87 -22854 -24058 3521 2856 -23848 -20279 -13400 -14433 1937 11796 12375
4300A2375l0724n6170n565M4669K3762L0513K9429l6097j2685J7061L0821n425
$$ 12375 -18349 -74519 -80084 -35415 -11653 18860 48289 12192 -493 16568 47389 41964
4288D1964j8632j6195j1604j7579K2614J4962j5301j1203j0983j1314j989l0138
$$ 41964 23332 7137 -4467 -22046 568 15530 229 -10974 -21957 -33271 -35260 -65398
4276f5398J717K1977J6422J6559J0609k6797j2144K2542j9511L847q652l257J638
$$ -65398 -63681 -41704 -25282 -8723 1886 -24911 -37055 -14513 -34024 -30177 -38829 -42086 -40448
4263d0448Q154P246Q054J5870l7730l5478K3176K9986K3945J12l3045j4534r60
$$ -40448 -32294 -25048 -16994 -1124 -38854 -74332 -51156 -21170 2775 2887 -30158 -44692 -45652
4250d5652K6329K7754p038j6652r69j8279r382l172N2K6000J3795j2452l64l263
$$ -45652 -19323 8431 1393 -15259 -16228 -34507 -43889 -47061 -47009 -21009 -7214 -19666 -20030 -23293
4236b3293J9551K1883p189m1388k5656J8359L6646n764l795Q710k483N037p919
$$ -23293 -3742 18141 10952 -30436 -56092 -37733 -1087 -6851 -10646 -1936 -4419 618 -7301
4223g301j828j9073J1584P913k6647J1331J1588Q276K921J3135p577P719o823
$$ -7301 -9129 -28202 -16618 -8705 -35352 -24021 -12433 -4157 -1236 11899 4322 12041 5218
4210E218J7152k0924l695M045j4029j6232M033L0080l865m689O239n708J8661
$$ 5218 22370 1446 -2249 1796 -12233 -28465 -24432 5648 1783 -2906 3333 -2375 16286
4197A6286J4383K5283j4812j906k9239j1296N456J8964m710l2238p259P715k2232
$$ 16286 30669 55952 41140 39234 9995 -1301 4155 23119 18409 -13829 -21088 -13373 -35605
4184c5605j7226J5149M9477J9073j5706j2314L120o358K247j0968m569O398K429
$$ -35605 -52831 -37682 11795 30868 15162 2848 5968 -390 1857 -9111 -13680 -7282 -4853
4171d853Q433J4652K909k627J4098p383k2719j1438K5553K1818j7176j4302J5872
$$ -4853 3580 18232 21141 18514 32612 25229 2510 -8928 16625 38443 21267 6965 22837
4158B2837N688k7840j1026n789J1601k898J467L5778L254o165K3906K2563j3237
$$ 22837 28525 685 -10341 -16130 -4529 -7427 -5960 29818 33072 26907 50813 73376 60139
4145F0139k1589L036j2652l092j565m714j0342j3084J10j5496J428M4499k4528
$$ 60139 38550 41586 28934 25842 24277 19563 9221 -3863 -3753 -19249 -17821 26678 2150
4132B150k4074K3189J4773O845k1355K457R671j552j234L914K0305K4075j7552
$$ 2150 -21924 1265 16038 22883 1528 3985 13656 12104 10870 14784 35089 59164 41612
4119D1612m0027M116K0779k7958l1027J8526l379J0286N660k30J6859J5585l4898
$$ 41612 1585 5701 26480 -1478 -32505 -13979 -17358 -7072 -1412 -1642 15217 30802 -4096
4106d096k4813k079L777L3762O691j0486N815K0847p970j0624q400j8224j0703
$$ -4096 -28909 -30988 -27211 6551 13242 2756 8571 29418 21448 10824 2424 -15800 -26503
4093b6503K182L9320j0048l8846r242Q820P680M466q558R023J2497K2258K0723
$$ -26503 -24321 14999 4951 -33895 -43137 -34317 -26637 -22171 -30729 -21706 -9209 13049 33772
4080C3772O995q226j3117L866K3760k781j8200l671P224j1140R685j2615J3667
$$ 33772 40767 32541 19424 23290 47050 44269 26069 22398 29622 18482 28167 15552 29219
4067B9219N0l640P93k4440j9140j1051J7723K5009o240j6204J1089K0145K1899
$$ 29219 29269 25629 26422 1982 -17158 -28209 -10486 14523 8283 -7921 3168 23313 45212
4054D5212j1109j7883J7277l418l7008o221L662o556k0573O966l6740l1425K457
$$ 45212 34103 16220 33497 30079 -6929 -13150 -9488 -16044 -36617 -29651 -66391 -97816 -95359
4041i5359K1194K492J5473J6985L666J6409K6563K1927j4933J3393k3446k407
$$ -95359 -74165 -71673 -56200 -39215 -35549 -19140 7423 29350 14417 27810 4364 1957
4029A957l0006r023R836p424J6445K1128j3592J934K7861j5326k1253N837L4346
$$ 1957 -28049 -37072 -27236 -34660 -18215 2913 -10679 -8745 19116 3790 -17463 -11626 22720
4016B2720m041J0895J199j4144p552N962J0060j7307N910q758j8016j7150j8161
$$ 22720 18679 29574 30773 16629 9077 15039 25099 7792 13702 4944 -13072 -30222 -48383
4003d8383k718L9351p159K905O124j607J8831K3947j7706l3814Q52K5326j1882
$$ -48383 -51101 -11750 -18909 -16004 -9880 -11487 7344 31291 13585 -20229 -19377 5949 -5933
3990e933J4092j838k6862M082j456J0943k555n885J7800J2285k3412J049J0127
$$ -5933 8159 6321 -20541 -16459 -17915 -6972 -9527 -15412 2388 14673 -8739 -7690 2437
3977B437l686l503R639j412L2966m783j1247j3418J6440k1958j1806r995J719
$$ 2437 -1249 -4752 4887 3475 36441 31658 20411 6993 23433 1475 -10331 -20326 -18607
3964a8607K4487K9011J169j7887k0387k3922o605M4423J5673m985o065j7862k2708
$$ -18607 5880 34891 36060 18173 -2214 -26136 -32741 11682 27355 22370 16305 -1557 -24265
3951b4265J0121J5494J2026j15r788J7815o55R526l0796j8807j069k3413k9594
$$ -24265 -14144 1350 13376 13261 3473 21288 20633 30159 -637 -19444 -20513 -43926 -73520
3938g3520M644K0472K0529K739O667K275l2134j3156K8386J6902K188L708M30
$$ -73520 -68876 -48404 -27875 -25136 -18469 -16194 -48328 -61484 -33098 -16196 -14008 -10300 -9870
3925i870O578r21j7253k4899m821k067L3185K6940J796j0332j5480K981K0568
$$ -9870 -3292 -4213 -21466 -46365 -51186 -53253 -20068 6872 8668 -1664 -17144 -14163 6405
3912F405n106k4076m590K922K1833j5339j4596L7914J0027Q553K2784J0089k5637
$$ 6405 1299 -22777 -27367 -24445 -2612 -17951 -32547 5367 15394 23947 46731 56820 31183
3899C1183l670q250k1335k8241j3480j6428J225J8050J4497j2281O476L233p21
$$ 31183 27513 19263 -2072 -30313 -43793 -60221 -58996 -40946 -26449 -38730 -32254 -29021 -29742
3886b9742Q480j5162q529L414P152q308K417J5858P1j2749L2R414J0873J9388
$$ -29742 -21262 -36424 -44953 -41539 -34387 -42695 -40278 -24420 -24349 -37098 -37066 -27652 -16779 2609
3872B609m874O821J0320j6742k9191n21j5859p676J2253j2536o625K1612m615
$$ 2609 -2265 4556 14876 -1866 -31057 -31578 -47437 -55113 -42860 -55396 -62021 -40409 -45024
3859d5024J7448K4272P394k6072j989Q280J892J6460q039K132j456J9074l802
$$ -45024 -27576 -3304 4090 -21982 -23971 -15691 -13799 2661 -5378 -3246 -4702 14372 10570
$$ [...]
##END NTUPLES=NMR SPECTRUM
##END=
