##TITLE=Analysis number 319410
Compound Code cc 50416
Book Reference 461/44
Project Code adrs
Chemist Name toml
##JCAMPDX= 6.0         $$ Bruker NMR JCAMP-DX V2.0
##DATA TYPE= NMR SPECTRUM
##DATA CLASS= NTUPLES
##ORIGIN= Bruker BioSpin GmbH
##OWNER= nmr
$$ XWIN-NMR		Version 3.5
$$ Mon May 15 08:32:46 2006 GMT Daylight Time (UT+1h)  MAYBRIDGE\nmr@NMR_250MHZ
##.OBSERVE FREQUENCY= 250.131544655141
##.OBSERVE NUCLEUS= ^1H
##.ACQUISITION MODE= SIMULTANEOUS (DQD)
##.ACQUISITION SCHEME= undefined
##.AVERAGES= 16
##.DIGITISER RES= 18
##SPECTROMETER/DATA SYSTEM= dpx250
##.PULSE SEQUENCE= zg30
##.SOLVENT NAME= CDCl3
##.SHIFT REFERENCE= (INTERNAL, CDCl3, 0, 16.522)
##AUDIT TRAIL= $$ (NUMBER, WHEN, WHO, WHERE, WHAT)
$$ ##TITLE= Audit trail, XWIN-NMR		Version 3.5
$$ ##JCAMPDX= 5.01
$$ ##ORIGIN= Bruker BioSpin GmbH
$$ ##OWNER= nmr
$$ C:\u/data/dgb/nmr/ADRS/4250/pdata/1/auditp.txt
$$ ##AUDIT TRAIL=  $$ (NUMBER, WHEN, WHO, WHERE, WHAT)
(   1,<2006-05-15 08:32:21.56 +100>,<MAYBRIDGE\nmr>,<NMR_250MHZ>,
      <created by zg, POWCHK disabled, PULCHK disabled
       configuration hash MD5:
       84 BC 41 DB A1 6E 1D 46 DA 25 12 A5 C1 ED C5 3A
       data hash MD5: 64K
       02 B7 29 8A CE 6C C8 C9 67 5C 63 30 60 7E 94 03>)
(   2,<2006-05-15 08:32:37.33 +100>,<MAYBRIDGE\nmr>,<NMR_250MHZ>,
      <Start of raw data processing
       ef LB = 0.3 FT_mod = 6 PKNL = 1 SI = 32K 
       data hash MD5: 32K
       06 52 AE 37 02 EE 0F F1 D0 A8 D1 C2 AE 9E AC 51>)
(   3,<2006-05-15 08:32:38.91 +100>,<MAYBRIDGE\nmr>,<NMR_250MHZ>,
      <apk 
       data hash MD5: 32K
       B7 90 0E 32 A5 DA B4 3D 9F 91 11 8F D3 55 4C 2C>)
(   4,<2006-05-15 08:32:39.77 +100>,<MAYBRIDGE\nmr>,<NMR_250MHZ>,
      <abs ABSG = 5 
       data hash MD5: 32K
       1E B4 1E B7 7B 19 1F C1 99 08 7C 7E A5 00 77 D5>)
$$ ##END=
$$ 
$$ hash MD5
$$ C7 6B AE A6 80 53 E3 42 7E 72 A9 C7 36 11 02 BC
##$RELAX= 
##$RELAX= 
##$RELAX= 
##$RELAX= 
##$RELAX= 
##$RELAX= 
##$RELAX= 
$$ Bruker specific parameters
$$ --------------------------
##$DU= <C:\u>
##$EXPNO= 4250
##$NAME= <ADRS>
##$PROCNO= 1
##$TYPE= <nmr>
##$USER= <dgb>
##$AMP= (0..31)
100 100 100 100 100 100 100 100 100 100 100 100 100 100 100 100 100 100 
100 100 100 100 100 100 100 100 100 100 100 100 100 100 
##$AQSEQ= 0
##$AQ_mod= 3
##$AUNM= <au_zg>
##$AUTOPOS= <2 >
##$BF1= 250.13
##$BF2= 250.13
##$BF3= 250.13
##$BF4= 250.13
##$BF5= 500.13
##$BF6= 500.13
##$BF7= 500.13
##$BF8= 500.13
##$BYTORDA= 1
##$CFDGTYP= 0
##$CFRGTYP= 5
##$CHEMSTR= <none>
##$CNST= (0..31)
1 1 145 1 1 1 1 1 1 1 1 1 1 1 1 1 1 1 1 1 1 1 1 1 1 1 1 1 1 1 1 1 
##$CPDPRG= <>
##$CPDPRG1= <>
##$CPDPRG2= <>
##$CPDPRG3= <>
##$CPDPRG4= <mlev>
##$CPDPRG5= <mlev>
##$CPDPRG6= <mlev>
##$CPDPRG7= <mlev>
##$CPDPRG8= <mlev>
##$CPDPRGB= <>
##$CPDPRGT= <>
##$D= (0..31)
0 1 0 0 0 0 0 0 0 0.06 0 0 0 0 0 0 0.0002 0 0 0 0 0 0 0 0 0 0 0 0 0 0 
0 
##$DATE= 1147678340
##$DBL= (0..7)
120 120 120 120 120 120 120 120 
##$DBP= (0..7)
150 150 150 150 150 150 150 150 
##$DBP07= 0
##$DBPNAM0= <>
##$DBPNAM1= <>
$$ [...]
##$SUBNAM7= <"">
##$SUBNAM8= <"">
##$SUBNAM9= <"">
##$SW= 20.6930455092707
##$SWIBOX= (0..15)
0 0 3 0 0 0 0 0 0 0 0 0 0 0 0 0 
##$SW_h= 5175.983436853
##$TD= 65536
##$TD0= 1
##$TE= 295.16
##$TE2= 300
##$TE3= 300
##$TEG= 300
##$TL= (0..7)
0 120 120 120 120 120 120 120 
##$TP= (0..7)
150 150 150 150 150 150 150 150 
##$TP07= 0
##$TPNAME0= <>
##$TPNAME1= <>
##$TPNAME2= <>
##$TPNAME3= <>
##$TPNAME4= <>
##$TPNAME5= <>
##$TPNAME6= <>
##$TPNAME7= <>
##$TPOAL= (0..7)
0.5 0.5 0.5 0.5 0.5 0.5 0.5 0.5 
##$TPOFFS= (0..7)
0 0 0 0 0 0 0 0 
##$TUNHIN= 0
##$TUNHOUT= 0
##$TUNXOUT= 0
##$USERA1= <user>
##$USERA2= <user>
##$USERA3= <user>
##$USERA4= <user>
##$USERA5= <user>
##$V9= 5
##$VALIST= <valist>
##$VCLIST= <CCCCCCCCCCCCCCC>
##$VD= 0
##$VDLIST= <DDDDDDDDDDDDDDD>
##$VPLIST= <PPPPPPPPPPPPPPP>
##$VTLIST= <TTTTTTTTTTTTTTT>
##$WBST= 1024
##$WBSW= 4
##$XGAIN= (0..3)
0 0 0 0 
##$XL= 0
##$YL= 0
##$YMAX_a= 404447
##$YMIN_a= -577472
##$ZGOPTNS= <>
##$ZL1= 120
##$ZL2= 120
##$ZL3= 120
##$ZL4= 120
##$ABSF1= 16.522
##$ABSF2= -4.171173
##$ABSG= 5
##$ABSL= 3
##$ALPHA= 0
##$AQORDER= 0
##$ASSFAC= 0
##$ASSFACI= 0
##$ASSFACX= 0
##$ASSWID= 0
##$AUNMP= <proc_1d>
##$AZFE= 0.1
##$AZFW= 0.1
##$BCFW= 0
##$BC_mod= 0
##$BYTORDP= 0
##$COROFFS= 0
##$CY= 12.5
##$DATMOD= 1
##$DC= 0
##$DFILT= <>
##$DTYPP= 0
##$F1P= 14.0000005364418
##$F2P= -0.99999901652339
##$FCOR= 0.5
##$FTSIZE= 32768
##$FT_mod= 6
##$GAMMA= 0
##$GB= 0
##$INTBC= 1
##$INTSCL= 1
##$ISEN= 128
##$LB= 0.3
##$LEV0= 0
##$LPBIN= 0
##$MAXI= 10000
##$MC2= 0
##$MEAN= 0
##$ME_mod= 0
##$MI= 0
##$NCOEF= 0
##$NC_proc= -4
##$NLEV= 6
##$NOISF1= 0
##$NOISF2= 0
##$NSP= 0
##$NTH_PI= 0
##$NZP= 0
##$OFFSET= 16.522
##$PC= 1
##$PHC0= 166.9107
##$PHC1= 5.297075
##$PH_mod= 1
##$PKNL= yes
##$PPARMOD= 0
##$PSCAL= 4
##$PSIGN= 0
##$REVERSE= no
##$SF= 250.13
##$SI= 32768
##$SIGF1= 0
##$SIGF2= 0
##$SINO= 400
##$SIOLD= 32768
##$SREGLST= <1H.CDCl3>
##$SSB= 0
##$STSI= 32768
##$STSR= 0
##$SW_p= 5175.98343685301
##$SYMM= 0
##$S_DEV= 0
##$TDeff= 65536
##$TDoff= 0
##$TI= <Analysis number 999999
Compound Code 99
Book Reference 9
Project Code 9>
##$TILT= no
##$TM1= 0
##$TM2= 0
##$TOPLEV= 0
##$USERP1= <user>
##$USERP2= <user>
##$USERP3= <user>
##$USERP4= <user>
##$USERP5= <user>
##$WDW= 1
##$XDIM= 32768
##$YMAX_p= 312222659
##$YMIN_p= -550861
$$ End of Bruker specific parameters
$$ ---------------------------------
##NTUPLES= NMR SPECTRUM
##VAR_NAME=  FREQUENCY,     SPECTRUM/REAL,   SPECTRUM/IMAG
##SYMBOL=    X,             R,               I
##VAR_TYPE=  INDEPENDENT,   DEPENDENT,       DEPENDENT
##VAR_FORM=  AFFN,          ASDF,            ASDF
##VAR_DIM=   32768,         32768,           32768
##UNITS=     HZ,            ARBITRARY UNITS, ARBITRARY UNITS
##FACTOR=    0.157963299565203, 1,           1
##FIRST=     4132.6476996994, 0,             0
##LAST=      -1043.33573715361, 0,           0
##MIN=       -1043.33573715361, -550861,     0
##MAX=       4132.6476996994, 312222659,     0
$$ Real data points
##PAGE= N=1
##DATA TABLE= (X++(R..R)), XYDATA
$$ [...]
15433E4303k2495J2620K8001n7192n1858l6893q410o843k366q24M0178p39K8297
15420b4221O4406L468j5970l4456q595K2523J8676k1102m4453J2571L624P6O427
15407a7026j2467O127R0667L0335Q395o6010p9141L3546J9425p301L6577m338
15395C8789o982j7445j7963o309k8441J6221M3592j1280m1948K4011k3135l8105
15383f8995l8070M3502K5801n649J622L6919L9496Q20Q631m988J926k025Q775
15370D7765k6227P494O834n8100n0253M0412O7871m5740K7575M6295O297n1322
15358A8901r089j6822K787J8678j6747L1886O008J5964J1928m828q535K4753l6263
15345C8621j4787L8027K7238j9644k4129k4103J4464L1356K2453J0036N987K9364
$$ y = [54303, 31808, 44428, 72429, 15237, -36621, -73514, -81924, -88767, -91133, -91957, -51779, -52518, -24221, 40185, 43653, 27683, -6773, -15368, 7155, 25831, 4729, -39724, -27153, -23529, -23453, -17026, -29493, -23366, 67301, 97636, 106031, 40021, -39120, -5574, 13851, 6550, 43127, 38789, 31807, 14362, -3601, -9910, -38351, -22130, 21462, 10182, -31766, -7755, -30890, -68995, -107065, -63563, -37762, -43411, -41789, -4870, 34626, 35446, 44077, 39089, 41015, 38990, 47765, 21538, 29032, 35866, -22234, -72487, -32075, 35796, -9944, 17631, 63926, 70223, 18901, 9812, -7010, -4223, 14455, -2292, 29594, 35602, 51566, 63494, 58666, 50131, 74884, 38621, 23834, 61861, 89099, 69455, 45326, 21223, 35687, 67043, 89496, 99532, 105519, 134883]
15333A34883l1478p608K813n2578k7334J1040K2615J2412K3735l6063Q454j414
15321E9477N408q485l4380n7807L2483k204K039K5484L5355k635J6538J619l8901
15308C3991l1804o6894p642J4711J5140K0333j086L0214j3534j012M1175j4337
15296A9255n8467m465J4003Q50k2955K6130J3682M6237P341k0191n9934o49J085
15283c8078M150L3613m0244j1967N9757J6972n2580k1964J202L0212k7964N496
15271d1395J5730K3094j0406J7581k913k2645J0065p976J2329j575o3292J8988
15259e2415r405k4608K1619P606L1061j695M2266J7540j4125l4600K6131l2918
15247b3543j942j9147k4940K5089N703K3648J464Q798L659J1818L533K4631O521
$$ y = [134883, 103405, 95797, 98610, 46032, 18698, 29738, 52353, 64765, 88500, 52437, 60891, 59477, 64885, 56400, 22020, -35787, -3304, -5508, -3469, 22015, 57370, 54735, 71273, 72892, 33991, 2187, -64707, -72349, -57638, -42498, -22165, -23251, 6963, -6571, -7583, 33592, 19255, -39212, -43677, -29674, -28824, -51779, -25649, -11967, 34270, 41611, 21420, -38514, -39163, -38078, -33928, -315, -40559, -52526, 7231, 24203, -28377, -50341, -49139, -18927, -46891, -41395, -25665, -2571, -12977, 4604, 1691, -20954, -10889, -18865, -6536, -8111, -71403, -52415, -61820, -86428, -64809, -57203, -26142, -27837, 14429, 31969, 17844, -16756, 9375, -23543, -25485, -44632, -69572, -44483, -38780, -15132, -13668, -4870, -1211, 10607, 14140, 38771, 45292]
15234D5292L3641K9600k7330m108p7536p0700K8460Q0650J7469r4653j3134N3175
15222H26j2725j0774M3285J727m7154L126J2016j8466M0274N1948k6854k7947
15210I282m3797K9812L1582l0646m9911j2765j0048k9532p745K4198P9354M420
15198e796m1730l662j557J657L0532n59k0119L4358J0877p989l733K4289K0727
15185C7295k8996j1677r002k713K0215k3876l0266o162O651N1787K7553n099k8557
15172b847J821k4317J3501J9705n1543k2656m9805m1689J3715N7781O2785M300
15160a9249o770K8960j0871L2833l1334j0191J6296K2937m2602r688o71j0716
15148d1066m4153M9107j7972l4130J0766k2469J3894K4281K733O8903M2983j4503
$$ y = [45292, 78933, 108533, 81203, 77095, -441, -71141, -42681, 37969, 55438, -39215, -52349, 826, -11899, -22673, 20612, 22339, -24815, -21689, -9673, -28139, 12135, 64083, 37229, 9282, -34515, -4703, 26879, -3767, -53678, -66443, -76491, -106023, -113768, -89570, -10216, -5796, -47526, -51188, -52745, -51088, -20556, -21115, -41234, -6876, 4001, -3988, -7721, 16568, 37295, 8299, -3378, -12380, -15093, 5122, -18754, -49020, -55182, -48531, 3256, 30809, 25710, -2847, -1026, -25343, -11842, 7863, -43680, -66336, -116141, -157830, -144115, -86334, -23549, -19249, -26019, 2941, -7930, 24903, -6431, -16622, -326, 22611, -19991, -29679, -30350, -41066, -85219, -36112, -54084, -88214, -77448, -99917, -86023, -61742, -59009, 9894, 52877, 38374]
15136C8374J4536k3798o3061q9742k0989M6135J10919L2154k4480o5906j0130
15125e5988K3540m017j4875j7693K9714Q304N6562k4800q764p662P035O999J3234
15112A1589m929j3995j8451K8579K1176j2772j080M2229j2712j4312K9651O6355
15100A21328j9750o6957j4494K652m569n728l8455L627J1079n20o6834J0534M0266
15087b7821K058k5531P583Q936J3121k5569M7222r498m1886R438N7782L5445p531
15074D3749K0381J0724m9178n9902k3586L6768L4646m7215m9067o55K6188r276
15062f6423m0811n555Q374J3354J7195M2976l9798J1841R2265K0589k0656r416
15050B3935m0624q550M5796J5790j2264j2760J5695L9172m7712l0501k8306j0053
$$ y = [38374, 52910, 29112, -33949, -123691, -144680, -98545, 12374, 44528, 20048, -45858, -55988, -32448, -36465, -51340, -69033, -39319, -31015, 25547, 747, -8017, -15679, -8644, -1645, 11589, 6660, -7335, -25786, 2793, 23969, 11197, 10117, 52346, 39634, 25322, 54973, 121328, 101578, 34621, 20127, 22779, 18210, 12482, -25973, -22346, -11267, -11787, -78621, -68087, -27821, -25763, -51294, -43711, -34775, -21654, -47223, -1, -9499, -51385, -41947, 15835, 51280, 43749, 64130, 74854, 25676, -34226, -57812, -21044, 13602, -33613, -82680, -83335, -57147, -66423, -107234, -112789, -104415, -91061, -73866, -30890, -70688, -58847, 33418, 54007, 33351, 23935, -16689, -25239, 20557, 36347, 24083, 11323, 27018, 66190, 18478, -12023, -40329, -50382]
15038e0382M1542L3209J3390o372l7132l3700r905R714K5848J8528J1420q018
15026H142M565o32K1205k6261l4042K6577L4828J180j4895o3104j99q418j3102
15013f4156m5111r197R918N6638J6763j4923J5586n1625k3627N7036J6726l4132
15001g0104j6228L8634K8089L356Q159L1291l3701k3950K7638O507J2314M2076
14989E4081q647m5731L6700k2052l2427l6374k3447J802J0796p887J460M8985
14977b2741M7124k6224k2680K3073K0136o573n949m1895j6373P8077M2755q868
14965E9862k6483J3026j2170n920k7989j11321k1135M7450N2384P105K510n5700
14953g8381M954Q9454L573k8394r428K4421n246l3719J9614l6196k229K2809j8369
$$ y = [-50382, -8840, 24369, 37759, 31387, -5745, -39445, -49350, -39636, -13788, 4740, 16160, 8142, 12707, 12075, 33280, 7019, -27023, -446, 34382, 35562, 20667, -42437, -42636, -51054, -64156, -109267, -118464, -108546, -51908, -35145, -50068, -34482, -86107, -109734, -52698, -35972, -70104, -86332, -47698, -19609, -16253, -8094, 23197, -10504, -34454, -6816, -309, 12005, 54081, 45434, -297, 36403, 14351, -18076, -54450, -77897, -76095, -65299, -73186, -71726, -22741, 24383, -1841, -24521, -1448, 18688, 12115, 6166, -35729, -52102, 25975, 68730, 59862, 33379, 46405, 34235, 28315, 326, -110995, -132130, -84680, -32296, -25191, -22681, -78381, -73427, 16027, 19600, -8794, -18222, 6199, 953, -32766, -13152, -49348, -51577, -28768, -47137]
14940d7137p552k3090j3872N5067M3023j5336L922J3996k9667R355L9938k7485
14928A162r6044M203J516J9281K0355L6300J7432k4733k5539o169L3190K4955
14916E909m967l7776o215K7328k0093j6515k3131L5366L5972j109N9459K1632
14904G5860o0529k9389o2802l0941J7676J8961J1136K7511j035P8118L0280o0643
14892A4203n6718J6317L2879M1679l8635j4294k4759L642O5176L3817m7061m4406
14880a8160R434M8634K0937O3494j2057n8668j6373j8414J3068L1182m6207p942
14868H928L985K3780k3114n0279J3584K3531K0703n123l1204m4649K7253L3932
14856A327l5054j6396N2270N3339J45N161l5834n2735J2961N61k9949n2464K5127
$$ y = [-47137, -54689, -77779, -91651, -36584, 6439, -8897, -4975, 9021, -20646, -11291, 28647, 1162, -94882, -90679, -89163, -69882, -49527, -13227, 4205, -20528, -46067, -52236, -19046, 5909, 942, -36834, -43049, -15721, -35814, -52329, -75460, -40094, -4122, -5231, 54228, 75860, 15331, -14058, -76860, -107801, -90125, -71164, -60028, -32517, -33552, 44566, 74846, 14203, -42515, -26198, 6681, 48360, 9725, -4569, -29328, -25686, 39490, 73307, 26246, -18160, -8726, 39908, 60845, 124339, 112282, 53614, 37241, 18827, 31895, 63077, 16870, 8928, 12913, 36693, 13579, -36700, -23116, 415, 21118, 15995, -15209, -59858, -32605, 1327, -33727, -50123, 2147, 55486, 55631, 60792, 24958, -27777, -14816, -14255, -44204, -96668, -71541]
14843g1541K4456n9792M451P4981J4518L223l9161k7249K9910n2619l25N5750
14831d3398J5790M7603R008J9305K9981K4970q0714k3732K5741P187J6251K4409
14819G2401K305n4671o8389J2425K929k200M0168M310P439l5333L8838j6217n7308
14806e3303K5045L781J1971k9172k4858J0699n603K642r479k5548N5026L9716
14794I17m7911p838L9948L2093K5327j8473J5267r833J1744R624K866m3566l9289
14781b9124j1880R955m9609k900M0671j2928R910K7136L8476J0979m0417K1118
14769A1387K4929P005j35L4241m7105l8184k9045M279m220K4347l0165J3832L8330
14756I496R896q724J4278m7897l5787M1374r697J3399m698o0835k0508L5875n085
$$ y = [-71541, -47085, -106877, -102426, -27445, -12927, -9704, -48865, -76114, -46204, -98823, -99148, -43398, -27608, 19995, 29003, 48308, 78289, 103259, 22545, -1187, 24554, 31741, 47992, 72401, 74706, 20035, -48354, -35929, -33000, -35200, 4968, 9278, 16717, -18616, 20222, 4005, -53303, -28258, -24477, -12506, -41678, -66536, -55837, -61440, -58798, -68277, -93825, -38799, 917, -46994, -54832, -14884, 17209, 42536, 24063, 39330, 29497, 41241, 50865, 53731, 10165, -29124, -41004, -31049, -80658, -83558, -42887, -55815, -45905, -18769, 19707, 30686, -9731, 11387, 36316, 43321, 43186, 77427, 30322, -7862, -36907, -32628, -36848, -12501, -42666, -28834, 9496, 19392, 10668, 24946, -22951, -58738, -17364, -27061, -13662, -18360, -79195, -99703, -63828, -68913]
14743f8913L0568N9509q433m4648N314l8150K2462O3212j1452m5208j5502j6980
14731f8221O1173L676j8416J8840K2236l1419p199p745k7528j736n3095N3231
14719e6203J1959R466K2094Q37J6970m63Q707o5785k4087M7612N8938l6299L719
14706b535K7541l0956m967J4212P945M4361j2778l0864K9755M3835l9552j6278
14694B9719j562Q182j3837l6293j8305L2408J0861J6191J3526K731o2536k3240
14682d2155L8038K1505j5785J0794N6876o005k0091k1582o583n0659L1479K1860
14670A7692N9664L1683r594n7206L5273Q647m8124n404j054k6340j7103J7493
14658E627r714N3379r894n1161p424j9644j3992J9769k1769O2762M488N780N5988
$$ y = [-68913, -38345, 21164, 12731, -31917, -26603, -64753, -42291, 20921, 9469, -35739, -51241, -68221, -7048, -3372, -21788, -2948, 19288, -12131, -19330, -27075, -54603, -56339, -109434, -56203, -44244, -34778, -12684, -11847, 5123, 4660, 13367, -52418, -76505, -28893, 30045, -6254, -2535, 25006, -5950, -10917, 3295, 11240, 55601, 42823, 11959, 41714, 85549, 45997, 29719, 28157, 36339, 22502, -13791, -32096, 312, 11173, 27364, 40890, 43621, -18915, -42155, -4117, 17388, 1603, 12397, 69273, 63268, 43177, 21595, 15012, -35647, -4168, 17692, 77356, 109039, 99445, 42239, 77512, 86159, 38035, 32631, 31577, 5237, -11866, 5627, -4087, 49292, 39398, -11763, -19187, -38831, -52823, -33054, -54823, 7939, 12427, 18207, 74195]
14645G4195r7008n2822L4958m7465o7890M1912N3716L1433j778j3978o200L251
14633d7676J7057j2937n150M185n128k8899k5000l1235j0263J3621K8994r166
14621a11597J8918J80l4493O4167k3531k7005j5877K7037J13664O7911m4198n5348
14609b0172m2249k3613O3404m779m445L0261l3536p0639k523R4257M4511M1781
14597G2258P059m3227M622k7130J0063N301j474k0448M2623N2400o843m9129p6592
14584c0517N226M5284K7236l1046k9361K4482J9668l5104N445M1713R520n7780
14572e234J8354L6302J1449J9341n6684j9094J8926R486M341L3594j4467Q505
14560F4819m5790l4121K758j688j6424l813p948L097M2086N0649j8031l1842n0807
$$ y = [74195, -22813, -75635, -40677, -88142, -156032, -114120, -60404, -28971, -30749, -44727, -50927, -47676, -30619, -43556, -48706, -44521, -49649, -78548, -103548, -134783, -145046, -131425, -102431, -111597, -92679, -92499, -126992, -62825, -86356, -113361, -129238, -102201, 11463, 79374, 35176, -20172, -62421, -86034, -22630, -27409, -31854, -1593, -35129, -105768, -108291, -14034, 30477, 72258, 79317, 36090, 40712, 13582, 23645, 28946, 27472, 7024, 49647, 102047, 95204, 46075, -30517, -25291, 19993, 47229, 16183, -13178, 11304, 30972, -4132, 1313, 43026, 52546, -5234, 13120, 49422, 60871, 80212, 23528, 4434, 23360, 32846, 37187, 70781, 56314, 64819, 19029, -15092, -12334, -14022, -30446, -34259, -42207, -39110, 2976, 53625, 35594, 3752, -47055]
14547d7055L4059L6703N5056j6255m1475m4190M5186L3862l079p717m8456n844
14535i205K2118k8173K8971N1816M37m8187m558K710k5018J8176n3183K7291M9484
14522C2679l5925k8382k646P705K8k9661l5854m0701R594O5743L2937q0062K8784
14509g5761N0983j5228J0167M2832J4260o211M1840k7458k0758j8469l3683j2786
14497e0272P3846J1138l9677j1686L3345k1954M04K5864J6576j6571l369J150
14485A8794l05j1894O3367k076m7381L758Q865K9517L4230l054j1760P848j5856
14472G4053j9357m8368p8318l2881J814K7141J2959Q115p516N5625M1774L993
14460C9034k7435p359n5315m7118L3758J3889M3436M0961M1718j8696m1560o1036
$$ y = [-47055, -12996, 23707, 78763, 62508, 21033, -23157, 22029, 55891, 52812, 45095, -3361, -9205, 12913, -15260, 13711, 65527, 65964, 17777, 13219, 15929, -9089, 9087, -44096, -16805, 32679, -3246, -31628, -34274, -26569, -26541, -56202, -92056, -132757, -123163, -57420, -24483, -104545, -75761, -24778, -40006, -29839, 12993, 27253, 21042, 62882, 35424, 14666, -3803, -37486, -50272, 23574, 34712, -4965, -16651, 16694, -5260, -4856, 21008, 37584, 21013, 17644, 18794, 18489, 6595, 69962, 67886, 20505, 24263, 33128, 62645, 96875, 93821, 82061, 89909, 74053, 54696, 6328, -71990, -104871, -103057, -75916, -62957, -54842, -62358, -6733, 35041, 39034, 11599, 4240, -51075, -98193, -64435, -50546, -7110, 33851, 75569, 56873, 15313, -45723]
14448d5723K3832O8823l2715l1293L1563j5197k7705l2576J0383P6057N7406k3826
14436E9029n6977k1746j3775K9992O4126J436k0011m7209j8154J7192k9860j8171
14424e4128K5761O527K4095O4192N3454n4020m7972M056k6379n3345j1883l7420
14412a07062J1701L9722k4479M1627J6070K3756K5878l3256o1246J3021L4053
14401b0215N3620R700L1068k7113j5428K2970M92n9678o400K238J6637K5829q445
14388B5275n488j4280j9855M918K2846M3107J0444j0244l3590m0520j4525K3468
14376h444K3948j7768K0565M6291k7906k4406k9045m641n0656L3776Q5469l7092
14364A0091m0684q400j8322p557m389K4894R143J1404J8212m0449N3449L1097
$$ y = [-45723, -21891, 46932, 14217, -17076, 14487, -710, -28415, -60991, -50608, 25449, 82855, 59029, 2052, -19694, -33469, -3477, 60649, 62085, 42074, -5135, -23289, -6097, -35957, -54128, -28367, -21840, 2255, 66447, 119901, 65881, 17909, 21965, -4414, -57759, -69642, -107062, -95361, -55639, -80118, -38491, -22421, 1335, 27213, -6043, -67289, -54268, -20215, 33405, 43105, 74173, 47060, 31632, 54602, 55094, -4584, -10984, -8746, 7891, 33720, 25275, 19787, 5507, -14348, -9430, 13416, 56523, 66967, 56723, 23133, -17387, -31912, -8444, 15504, -2264, 18301, 64592, 36686, 12280, -16765, -21406, -72062, -38286, 47183, 10091, -30593, -38993, -57315, -64872, -69261, -44367, -35224, -23820, -5608, -46057, 7392, 38489]
14352C8489k3546m3748J6868M2524j5947J0791j6058k7236m1585L4734L3813o592
14340B507j4391q023J8594N8851l2274n7230J3712J2125k1626M1745K9174r699
14328C3465J1546J0356j127l2279K2906m5920j1100N699j4731l506N213j6978
14316c6456l0266j6145L4006k1183m125N468P8953l0674p4276M569R3509p313
14304c933l5672o7916L6042N0175k1089o901R929J9286n7789l9521M7156M5013
14292b5220j6286m4366k8051M044M3L4327M2035N9462R486k683q726l813k5374
14279e122l1744j5885J2011O112O6434j3301l8267q7853p4124N9993M5230J2362
14267f4154R671J6778n138j0630K3361N366N775O302j0726J8710M1261r930j3262
$$ y = [38489, 14943, -28805, -11937, 30587, 14640, 25431, 9373, -17863, -59448, -24714, 9099, 2507, -11884, -19907, -1313, 57538, 25264, -31966, -18254, -6129, -27755, 13990, 43164, 33465, 45011, 55367, 54240, 21961, 44867, -1053, -12153, -6454, -21185, -24691, -19478, -36456, -66722, -82867, -48861, -70044, -74169, -68701, 10252, -20422, -94698, -90129, 3380, -3933, -39605, -107521, -71479, -21304, -42393, -49294, -39365, -20079, -77868, -117389, -70233, -25220, -41506, -85872, -113923, -109879, -109836, -75509, -33474, 25988, 35474, 32791, 24065, 20252, -5122, -36866, -52751, -40740, -34628, 31806, 18505, -19762, -107615, -181739, -121746, -76516, -64154, -54483, -37705, -42843, -53473, -30112, -24746, -18971, -12669, -23395, -4685, 36576, 26646, 13384]
14254A3384J657l2576N7307l4372k4625o179P6488K5378J4858q838o1098r1671
14242g0287P197M1424J4538j9291L3100K4188n9933l446L5560M6053Q781M4121
14230A02005J2210q8306o8758r240Q33M8688k7619m3063J3235m324k3839L1311
14218e6867p654M6158J3007j3025J909l3984m4716L5048L3183m193l6980j1114
14206g9228M248L6243K3656j3418J0277K716N649m368n3352K8246l174P5667N1380
14193H4542n0545n2850j4240j570O6877R2577M3601l9032r3106m742J772L8155
14181G1439K7633l9872n1653m110l698m0189M1801Q795j0360l0922j1779O045
14169c6870K641J1755L414k4805m0459L5237J5431K1712J2644M378j0582M9268
$$ y = [13384, 15041, -17535, 39772, 5400, -19225, -25404, 51084, 76462, 91320, 82482, 21384, -70287, -63090, -21666, -7128, -26419, 6681, 30869, -29064, -32510, 3050, 49103, 57884, 102005, 114215, 25909, -42849, -52089, -51256, -2568, -30187, -73250, -60015, -64339, -88178, -56867, -64521, -18363, -5356, -18381, -16472, -50456, -95172, -60124, -26941, -31134, -68114, -79228, -74980, -38737, -15081, -28499, -18222, -15506, -9857, -14225, -67577, -39331, -42505, 33162, 84542, 33997, -18853, -33093, -34663, 32214, 124791, 168392, 129360, 36254, 31512, 33284, 71439, 99072, 59200, 7547, 3437, -261, -40450, 1351, 10146, -214, -31136, -42915, -36870, -34229, -22474, -19060, -43865, -84324, -49087, -33656, -11944, 700, 5078, -5504, 43764]
14157D3764J1728k1781o918p949K0065k4502l8293L091M9417K0242o1972K9211
14145A6103j0720m2901k3419K4993R692M787j7855k7755N732l5605J5260O0480
14133b1208J6299M6758J217p539p4320j4457J8837o767K8567O8737L6408K1017
14121A13549n9237n443R160j6408j5468j096m3024j9177L3696j0711N415J1087
14109B343j4434K6345j7977k4977m6404o238K2310N4565K9584l2963P177O2225
14097F1556K4842M0751j2446n3047l1359N9R360K9479R016k4831J277j2105O342
14084D8894J4552k1258k4982l6444j6458k4236j4125J0072l6965l5615k1174N1829
14072a05910M0350j1439n5486l1751k1918L4803R86l9801j3479P1219N6739O4637
$$ y = [43764, 55492, 33711, 26793, 18844, 38909, 14407, -23886, -20795, 28622, 48864, -13108, 16103, 5383, -37518, -60937, -35944, -26252, -21465, -39320, -67075, -61343, -96948, -81688, -21208, -4909, 41849, 43066, 35527, -38793, -53250, -34413, -41180, -12613, 56124, 92532, 113549, 54312, 48869, 58029, 41621, 26153, 25057, -17967, -37144, -3448, -14159, -8744, 2343, -12091, 14254, -3723, -28700, -75104, -81342, -59032, -4467, 25117, -7846, -669, 61556, 86398, 127149, 114703, 61656, 30297, 30356, 39716, 69195, 78211, 53380, 54657, 42552, 48894, 63446, 42188, 17206, -19238, -35696, -59932, -74057, -63985, -100950, -136565, -157739, -105910, -65560, -76999, -132485, -164236, -186154, -151351, -150365, -190166, -203645, -132426, -75687, -11050]
14060a1050M6333l5979k0739l1938k6615K1136q732r496L4881R338j2874q766
14048e4501L280O223R243P579k2666k9510M2359N0004J9455l8717l433K2600k4168
14035a2252P858M8728n5935n7768P7179k7547o4259J4428M4082o9044n124M4095
14023e5559P0397j0908j7305j3239N1967J1557k4397k4210l7939k056K7094L5697
14011A1099m8763k0042J6047L8700k0331k5737M2557N2427K6756L9637O947o0935
13999E8362l5501k9286j6310q247k4025J7457j3084J1820M151k4092O953J7652
13987c4150l415j5868K5117J7910k853M7758N2402J425m2897l5059k8293m8641
13975f6564j1901N377o514l821O1406Q4662J4300J0623l6384o9810J0525K3719
$$ y = [-11050, 35283, -696, -21435, -53373, -79988, -58852, -67584, -77080, -42199, -32861, -45735, -54501, -51221, -44998, -35755, -28176, -50842, -80352, -37993, 12011, 31466, -7251, -10684, 11916, -12252, -4394, 44334, -11601, -69369, 7810, -19737, -83996, -69568, -25486, -94530, -99654, -55559, 14838, 3930, -13375, -26614, 25353, 36910, 12513, -11697, -49636, -51692, -24598, 11099, -37664, -57706, -41659, -2959, -23290, -49027, -6470, 45957, 72713, 112350, 119297, 58362, 22861, -6425, -22735, -30982, -55007, -37550, -50634, -38814, -34663, -58755, -51802, -34150, -37565, -53433, -28316, -10406, -13259, 34499, 86901, 88326, 45429, 10370, -17923, -66564, -78465, -73088, -79602, -83423, -22017, 62645, 76945, 87568, 51184, -18626, -8101, 15618]
13963A5618K0660j321r847j7554m4499l895K7684K4897k1330L0700p985n314m3536
13950c5722j6509j6732J3940n4169M9089K6551O6257M1754p136q848j7539j0841
13938C0095j0546l5516j2847L8094L410m3573p8250K1601M2618K4880q741l1958
13926f0733L6732J2780p916k5231j6272N2611L5970j6889n6173m777R3805j3372
13914C0535k1291L340L0928j3265j4013J2242K8949Q2044j4986k9916j667k9390
13902F3510n6130K902K479n6356L951m546j9507P2026L2541j3245m419j7623L7828
13889D3411K2448r0316m7743L9981J3543o342m134l769k1219k2601N2255K4539
13877E3j8059j6119r896m365n6124J1038P3623K116n2340k6684R5320M1006r003
$$ y = [15618, 36278, 34957, 25110, 7556, -36943, -40838, -13154, 11743, -9587, 21113, 13128, 7814, -35722, -52231, -68963, -55023, -109192, -60103, -33552, 32705, 74459, 67323, 58475, 40936, 30095, 19549, -15967, -28814, 9280, 12690, -30883, -109133, -87532, -44914, -20034, -28775, -60733, -24001, -11221, -19137, -44368, -60640, -8029, 27941, 11052, -45121, -49898, 43907, 30535, 9244, 12584, 43512, 30247, 16234, 28476, 57425, 139469, 124483, 94567, 92900, 63510, 7380, 10282, 12761, -43595, -39644, -44190, -63697, 8329, 40870, 27625, 23206, 5583, 43411, 65859, -24457, -72200, -32219, -18676, -25018, -29152, -32921, -54140, -76741, -24486, 53, -18006, -34125, -44021, -48386, -104510, -93472, -19849, -17733, -70073, -96757, -1437, 39569, 30566]
13864C0566M452j3514m0763o4839P040M5712N3004l5202k5098L9140L5785m9090
13852a2807K274M9749K8220p696l6792K4144J4968k5028R009k6543n7452R693
13840b8261J3115j570K8251R339p884k7272N4439O530o2716p1568o250N7336M1144
13827D633j0199J4869K1610k2513K3123j1349k7947Q364L6612j1180l7889l2077
13815d3943K1272j1308l2218k3827r659L3168O072J1135l4511l0362k754k7010
13803a43945M6191L4827Q201K2033M0546J1403k2176k5210j2466L8865p674J4129
13791D724K9864m5627j2483k7887L1105j4028k1803l401J785L1140K6929k2325
13779b2007j396j009J8437L3372K9613K765L2131l1408o4150k9262j8337j2580
$$ y = [30566, 35018, 21504, -19259, -84098, -77058, -31346, 21658, -13544, -38642, 498, 36283, -12807, -10533, 39216, 67436, 59740, 22948, 47092, 62060, 37032, 46041, 19498, -37954, -28261, -15146, -16716, 11535, 20874, 12990, -14282, 40157, 46687, -16029, -87597, -93847, -36511, 4633, -5566, 9303, 30913, 8400, 31523, 20174, -7773, 591, 37203, 26023, -11866, -43943, -22671, -33979, -66197, -90024, -99683, -66515, -60443, -49308, -83819, -114181, -116935, -143945, -97754, -62927, -54726, -32693, 7853, 19256, -2920, -28130, -40596, -1731, -9405, 4724, 34588, -11039, -23522, -51409, -20304, -34332, -56135, -59536, -57751, -26611, 318, -22007, -23403, -24412, -5975, 27397, 57010, 59775, 91906, 60498, -3652, -32914, -51251, -63831]
13767f3831J4309L3427K759K8219l382o0989P30l5261j6258N4681L9266j6990
13755b3320l6903n3402N0276k0239j8948P7264N5091l824k6192j8404L3223q5606
13743g0984n7047K1092J1407J9475O2658J9791k0967m3906k8314o54K2218j075
13731f6306M3667K075J6891N432L4217J7025n6940J3456K4849m7150K3627K4157
13719C5000n1744j1593j404j1665L1625j474k3198K0473N6465o467K729J1347
13707E0094l7316m9787J1406J518l5596j2959K1216m9215O415O1K330l334K2853
13694g2314M1031J5692k586k8084o9753l7396R6763M0685j0339K5953j464m1357
13682d3169j8867O938l6669L4856J1061O750l8945r598O4680O072m8241O3153
$$ y = [-63831, -49522, -16095, -13336, 14883, 11501, -49488, -48758, -84019, -100277, -45596, -6330, -23320, -60223, -113625, -63349, -83588, -102536, -25272, 29819, 25995, -197, -18601, 14622, -70984, -128031, -106939, -95532, -76057, -13399, 6392, -14575, -58481, -86795, -87449, -65231, -66306, -22639, -20564, -3673, 1759, 35976, 53001, -3939, 9517, 34366, -12784, 10843, 35000, -16744, -28337, -29741, -41406, -9781, -11255, -34453, -13980, 42485, 36018, 38747, 50094, 12778, -37009, -25603, -24085, -59681, -72640, -51424, -100639, -94224, -94163, -91833, -95167, -72314, -31283, -15591, -18177, -46261, -116014, -153410, -56647, -15962, -26301, -348, -1812, -43169, -62036, -55098, -91767, -56911, -45850, -39100, -78045, -87643, -22963, -16891, -65132, -1979]
13670a979M8534m0819l5200k126L3152O1788J2724j7414K5812K3812p0539q8835
13658e1090L9500q138M8816k6846k5787k084J6532J5953N1882J7451q596Q25j5339
13645E3079M2987j1104m1113L0655N864m3396p288k4475m8287K2870l0366o0143
13633a10717l1989P898M3784J3146L8299m2713k2849L0759O3730N044L2176J4189
13621D0757m768n6l0212q154Q686l0407l2337Q056J3722P0999N098l2810J6844
13608B5418J2558r595N58k198J6429J768p6084J4612K4970q864k8512M3560j1370
13595C250K4857L2335j6787m6810k2104k2783l5907k6623O6095J6476m0690L4843
13583c3848L0769j5554k5807O681K3607L6950K255j9370K968L0760Q802J7059
$$ y = [-1979, 46555, 5736, -29464, -31590, 1562, 63350, 76074, 58660, 84472, 108284, 37745, -51090, -11590, -19728, 29088, 2242, -23545, -25629, -9097, 6856, 58738, 76189, 67593, 68418, 53079, 96066, 84962, 43849, 74504, 80368, 36972, 29684, 5209, -43078, -20208, -50574, -110717, -142706, -134808, -91024, -77878, -39579, -82292, -105141, -74382, -10652, -5608, 26568, 40757, 35989, 35933, 5721, -2433, 6253, -24154, -56491, -48435, -34713, 36286, 41384, 8574, 25418, 37976, 28381, 28939, 26741, 43170, 44938, -31146, -16534, 8436, -428, -28940, 14620, 3250, 28107, 60442, 43655, -3155, -25259, -48042, -83949, -110572, -44477, -28001, -68691, -33848, -3079, -18633, -44440, -37759, -14152, 22798, 25053, 5683, 8651, 39411, 48213, 65272]
13571F5272q6413J2351J6801R768l4468l0339k8114L5483J9217L1003m209j4675
13559h323R023o26l2411l8149O8668L3515q394K0269j4321j3577K7209o1081l1193
13546d9391j9004m9657N4270P2434o2716l9235n930Q0067R7635k2162l4531m5724
13534b3944k8861L2799Q3180n269q1252m5814M0265L1971J8912j3180k7415k9377
13522d7985P3227j6478M1380m6648n5259Q998J1261M5768L4365l2810m51l2106
13510a6738m1851k303O1655K2150o5469n2203m2979L8520N9432O957R292M2210
13498A8673J2205r702o0174p5009K7531L6966N618N9886o1732m1452K6370J5268
13486d5552M977J0009O3408L4915n3822l5106R84O520m6191K1841L2318L7896
$$ y = [65272, -21141, -8790, 8011, 17779, -16689, -47028, -75142, -39659, -20442, 10561, 6352, -8323, 700, 74, -32337, -70486, -1818, 31697, 23303, 43572, 29251, 15674, 42883, -18198, -49391, -68395, -118052, -63782, 8652, -54064, -93299, -99229, -19162, 78473, 56311, 21780, -23944, -52805, -20006, 63174, 57905, -23347, -69161, -28896, 3075, 21987, 8807, -18608, -47985, 25242, 8764, 50144, 3496, -51763, -42765, -31504, 14264, 48629, 15819, 15368, -16738, -58589, -60892, 763, 22913, -42556, -94759, -137738, -99218, -39786, -32829, -23537, 18673, 30878, 21176, -38998, -114007, -86476, -49510, -43892, 15994, -45738, -87190, -60820, -45552, -40575, -30566, 32842, 67757, 13935, -21171, -20187, -13667, -59858, -38017, -5699, 32197]
13474C2197n744J8090L223k5683j9801L8148m1821j0219k1937J3668J8251k2569
13462b4197k4543J7907k4189k8224O2632N8598l0465o5972l0173K5812P9L3256
13450b9479j7650J9624J3995J4938L1786j6426n2840l2387J4887J4503k395J7329
13438b4115N861O0273N284n4419m9085m2933J5403p552L7161n018j5453l0276
13426a04869M3M0828k9992m2522K4775K9517J9323Q6387m6839m2553l808J8211
13414e1499Q8202M0738j8999m4382k9391M2634K1121l9543J0665l0613P50M597
13402e720l5357l8697k0883J4890K8179J8284q231M997Q08q037K1542J81l7370
13389f5414L1623M6726M0284k3445k263k461J0498o231l5473M524K6488m9147
$$ y = [32197, 26453, 44543, 47766, 22083, 2282, 40430, -1391, -11610, -33547, -19879, -1628, -24197, -48740, -30833, -55022, -83246, -20614, 37984, 7519, -58453, -88626, -62814, -62735, -29479, -47129, -27505, -13510, 1428, 33214, 16788, -36052, -68439, -53552, -39049, -41444, -24115, -18254, 42019, 47303, -7116, -56201, -99134, -83731, -91283, -54122, -59140, -74593, -104869, -104826, -63998, -93990, -136512, -111737, -82220, -62897, 23490, -23349, -65902, -69710, -51499, 36703, 77441, 58442, 14060, -15331, 27303, 48424, 8881, 19546, -11067, -10317, -5720, -41077, -79774, -100657, -85767, -57588, -39304, -47535, -42538, -41730, -49767, -28225, -28044, -65414, -33791, 12935, 53219, 29774, 27511, 25050, 35548, 29317, -6156, -1632, 24856, -24291]
13377b4291O162p644K8141L2519J2848k4863L4210p469r0510M1740L9537J0401
13365E0781Q436j2818k597l5580k5640R811k795J219K3074K7754m6648k7852j0041
13352d2896K8599j0808m5516L7217J5655k0694K9448K7590N310N4197O0074o8333
13340F9843n3630j7297K9323N0791k5103m9337r821L864J4999j7004J2043K5014
13328C3685J1676J5943L4713L3007M9733o6404q4411P292K1530K2603N0358J1258
13316A40983m8598O09L970O125J2053r764J38n234J6612K5531L2553k7598L5400
13303A82780j4901p0351o6501k1921j9528n4643j7054K1739K990p510j499L2913
13291c3486M088l1427l7885k0175K4217j0947p914K1422L4567K083j294J4763
$$ y = [-24291, -18129, -25773, 2368, 34887, 47735, 22872, 57082, 49613, -40897, 843, 40380, 50781, 59217, 46399, 43802, 8222, -17418, -7607, -10402, -9183, 13891, 41645, -5003, -32855, -42896, -14297, -25105, -70621, -33404, -17749, -38443, -8995, 18595, 23905, 78102, 138176, 69843, 16213, -1084, 28239, 79030, 53927, 4590, -5231, -1367, 13632, -3372, 8671, 33685, 45361, 61304, 96017, 129024, 178757, 112353, 27942, 35234, 56764, 79367, 129725, 140983, 92385, 92994, 96964, 103089, 115142, 105378, 105516, 100282, 116894, 142425, 174978, 147380, 182780, 167879, 97528, 31027, 9106, -10422, -65065, -82119, -60380, -57390, -64900, -66399, -33486, -29398, -60825, -98710, -118885, -94668, -105615, -113529, -92107, -57540, -55457, -56751, -41988]
13279d1988r027K3687J2575M4500j455L9230o862n199M412j3165M6039j7604R442
13266H4585k3596j7527J4867J0705j5199j2117k6851L3564J5199R301K2276L4488
13254A29695n3267m6189l9810q494N7108N7855k4163l3368j1788m03j5959j4778
13242c561M8183M0179n4888j4086L5385K9388m4612j251j3267l4972m8330q9244
13230a51076K168M9411M2074N5227j0214l190K8158q462M1482j838m7939k0111
13218b4310j8991m47Q787k7347j3803j1244j3584P1275Q7349Q544M0299l3643
13206G2885N412k6112p0163o9629n0K5680j5331J8056R173P5285L9677n4551m5149
13193c4817K2411Q081m7018J2179M0296K4974K3639k0595k0671o4778o966J3154
$$ y = [-41988, -51015, -27328, -14753, 29747, 28292, 67522, 60660, 55461, 59873, 46708, 92747, 75143, 84585, 60989, 43462, 58329, 69034, 53835, 41718, 14867, 48431, 63630, 72931, 95207, 129695, 76428, 30239, -9571, -18065, 39043, 96898, 72735, 39367, 27579, 27176, 11217, -3561, 44622, 84801, 29913, 15827, 51212, 80600, 35988, 34737, 21470, -13502, -61832, -151076, -148908, -99497, -57423, -2196, -12410, -15600, 12558, 4096, 45578, 43740, -4199, -24310, -43301, -43748, -34961, -62308, -76111, -87355, -100939, -29664, 57685, 66229, 106528, 72885, 78297, 52185, -17978, -87607, -87657, -61977, -77308, -59252, -50079, 25206, 64883, 10332, -34817, -12406, -4325, -51343, -39164, 1132, 26106, 49745, 29150, 8479, -56299, -63265, -50111]
13181e0111q325N8921M5067o915l0083J3502l3882J6910M4275l7488p1834J4313
13169d5650J3374j3888j779P789K4474J358k9007j4440K4313K8970L1465m0033
13157a3054N371N7990L665k8644q573q674K810L8669j746j079j2241j8435m0402
13144b4343K5140l0347j2395k2100p6544J7864L1434n811l7170l655N6033Q8399
13132F505K9097n2631k5705J27309M9657p1692k4198N8538J6964l2368l6122l4152
13120A1202n0726O742R808L3013q856p368J8984R467l65N385K664n6942k8059
13107e5051M1342L2197j162k6465j4261j5154q511Q4722N1732L3828p1051k8442
13095B3724K1674M4133n4795k7200J0930Q449N9097j4775j9238J1030m4963n880
$$ y = [-50111, -58436, 485, 45552, 38637, 8554, 22056, -11826, 5084, 49359, 11871, -59963, -45650, -32276, -46164, -47943, -40154, -15680, -14322, -43329, -57769, -33456, -4486, 26979, -13054, -7683, 50307, 53972, 25328, 16755, 8081, 10891, 49560, 47814, 46735, 34494, 16059, -24343, 797, -29550, -41945, -64045, -140589, -122725, -91291, -97102, -134272, -137927, -81894, 6505, 35602, -17029, -42734, 84575, 134232, 62540, 38342, 96880, 113844, 81476, 45354, 11202, -39524, -32782, -22974, 10039, 1183, -6185, 12799, 22266, 21901, 27286, 29950, -26992, -55051, -13709, 18488, 17326, -9139, -23400, -38554, -47065, 37657, 89389, 123217, 52166, 23724, 45398, 89531, 34736, 7536, 18466, 26915, 86012, 71237, 51999, 63029, 18066, 12186]
13083A2186O7923k4863J6100k625j3893p3290m4365j6749l6806O2028R8912l335
13071D1223q623J4388K1916l4662j8125J2367L4242K9183R527k9253l9490j7211
13059A5482N055L5516j8149j2426p2151J0829M8733Q62k2334k1290K8556L7138
13047C5821k7368l1647K1296L371K9945J8700Q890k092M972l017J3341k2403L2803
13034H2612N3333J6729r5434m228J6564j8359M7541K2293m006l6843j4774K5888
13022I1316m981o55k2477n85j2843p364l7656N541M162j1797o288K4927J6884
13009C8184M3082l3188J5528M199J26j1446k0404j6529j78k1974M2431L1208l124
12996F7915p782J2402o0799q022J2845L7270L6375P269j4515q673P327l4601k0154
$$ y = [12186, 80109, 55246, 71346, 68721, 54828, -18462, -62827, -79576, -116382, -54354, 44558, 41223, 32600, 46988, 68904, 34242, 16117, 28484, 62726, 91909, 101436, 72183, 32693, 15482, 20537, 56053, 37904, 25478, -46673, -35844, 12889, 13751, -8583, -29873, -1317, 35821, 8453, -23194, -1898, 1473, 31418, 50118, 59008, 56916, 61888, 58871, 72212, 49809, 82612, 135945, 152674, 57240, 53012, 69576, 51217, 98758, 121051, 117045, 80202, 65428, 91316, 86335, 85680, 63203, 62618, 49775, 42411, 4755, 10296, 14458, 2661, -3627, 21300, 38184, 81266, 48078, 63606, 67805, 67931, 56485, 36081, 19552, 19374, -2600, 39831, 71039, 67915, 60133, 72535, 11736, 3714, 16559, 53829, 90204, 97473, 82958, 74285, 81612, 47011, 26857]
12983B6857L2081Q198j7520n1513j2465O396L5459J4129r882j627L307j5428k8473
12970a0481K7355M0023L062P978m2589j2000j2454P9014j1294r964L064j4426
12958D7288j9240m4081L298J0349J7391O4832L140k2868m7695m4762j7279r980
12946e9607p385J8216O058L0373k5503L8102J4749k3650n691j0582l4383J5777
12934d3526K5183L148j0111j6504k05n506M1807M4098J5616j6493L2691M7169
12922A17367p245k9551q4414j9640L6361l6562K1789J7137j0395L3205k2191P410
12910B3271k8409o0938P1889L8800n1847j5165L8336k5696m0448j4077M8676K261
12898a3347M0905q296l4545o964j7481L0225J9586j2287R613L1465L2896j1524
$$ y = [26857, 58938, 67136, 49616, -1897, -14362, -7966, 27493, 41622, 31740, 30113, 33420, 17992, -10481, 16874, 56897, 59959, 67937, 25348, 13348, 894, 79908, 68614, 58650, 61714, 47288, 28048, -16033, -12735, -2386, 15005, 79837, 82977, 60109, 12414, -32348, -49627, -59607, -66992, -48776, -42718, -12345, -37848, 254, 15003, -8647, -14338, -24920, -59303, -43526, -18343, -15195, -25306, -41810, -42015, -47521, -5714, 38384, 54000, 37507, 70198, 117367, 110122, 80571, -3843, -23483, 12878, -23684, -1895, 15242, 4847, 38052, 15861, 23271, -5138, -66076, 5813, 44613, -7234, -22399, 15937, -9759, -50207, -64284, -15608, -13347, 27558, 19262, -15283, -22247, -39728, -9503, 10083, -2204, 7409, 38874, 71770, 60246]
12886F0246J7625K6858J3693l2724o8167k5293J1924J0450q231j8366l9481l968
12874e5434k2700L6474J3099o030K4914J9171M6196k507O0696N64q3009Q28R775
12861D2037k2657n1500k6165K0031K1057O1555L2861k2459l4079K1188k0226o067
12849A5576N2329O0126L9033k6661J2222k3268m2394k8910J3036k1597n2845k6561
12837b9914m753J6216N8942M6847n5599l6556M6187N9211j5957n0590j0022j6708
12825G304l0369j6771K6254Q936J2991R619j3935j8040n6420M0134L6157K8568
12813C4428m4856m6696j3417M8691N9945L633k1355K4217O708L0008k57k9637
12801E1412o2993k0598J6675O0053K8442k0115k7417k4230N0557L1862r022J6793
$$ y = [60246, 77871, 104729, 118422, 85698, 17531, -7762, 4162, 14612, 6381, -11985, -51466, -55434, -78134, -41660, -28561, -34591, -9677, 9494, 55690, 53183, 113879, 114443, 31434, 32262, 42037, 19380, -32120, -58285, -38254, -17197, 44358, 77219, 54760, 20681, 41869, 21643, 15576, 67905, 128031, 167064, 140403, 152625, 129357, 86963, 58053, 71089, 49492, -3353, -29914, -34667, -18451, 40491, 87338, 31739, -4817, 41370, 100581, 84624, 34034, 24012, 7304, -23065, -39836, -13582, -4646, 8345, 17964, 4029, -14011, -70431, -30297, 5860, 34428, -10428, -57124, -70541, -21850, 38095, 41728, 20373, 44590, 51298, 81306, 81049, 51412, -11581, -32179, -15504, 44549, 72991, 52876, 25459, 1229, 51786, 83648, 74626, 91419]
12789I1419N273L0626J6815m4938n5553L612N557J8998J870j3730q057L007k825
12776E2074N9297J7227O511q7228k1325J6888j2233N5177k1009O864m1391l7796
12764f944k182K9264J0615r973P5601M4869l0444L25j8353l8379m6935p435m7009
12751d6980J5981J2206K3584K4805k5636K3892J9060j6575q5933P532J16896O4116
12739A32948m198j5774m4117p0462l1617j2683L5387N2138N1909M3072R386Q548
12727A54537J8733l641k6606r831k625o184J8608p510J1582K3894l3913k7616
12715A09428j1209k3147O1333r054Q15K3329q828p8370N763K7731m957J459K535
12702I6828M487j5435o6166L6739L5694l0750J575J8707K8909M0553k4862m9164
$$ y = [91419, 96692, 127318, 144133, 99195, 43642, 47254, 52811, 71809, 73679, 59949, 51892, 54899, 52074, 111371, 128598, 135109, 47881, 26556, 43444, 31211, 86388, 65379, 72243, 30852, -6944, -9126, 20138, 30753, 20780, 96381, 141250, 110806, 111131, 92778, 54399, 7464, 29, -46980, -30999, -18793, 4791, 29596, 3960, 27852, 46912, 30337, -55596, -48064, 68832, 132948, 128750, 112976, 68859, -1603, -33220, -45903, -10516, 41622, 93531, 136603, 145989, 154537, 173270, 169629, 143023, 133192, 130567, 124383, 142991, 135481, 147063, 170957, 137044, 109428, 98219, 75072, 136405, 127351, 128166, 151495, 142667, 64297, 70060, 97791, 92834, 94293, 96828, 101315, 85880, 19714, 56453, 92147, 61397, 62972, 81679, 110588, 151141, 126279, 77115]
12690G7115l1403k0293j7586J682K1662l0725K6493r9m33N069L9624J1557m4798
12677C7865Q863Q5401J9427k9775k381J4004r495k3913r421j9574n490O272L3530
12664A05313K2896l7392k2369j5363j6847L5959L7202K8819Q520M390Q0292L3867
12652B65287n2137o1608k2321Q205n49j530j1621j6730O0110K4594o385k1005
12640A64310l4583k6116L0205M6080R945P360k8222r131o0994l5976j110K4180
12628H5948Q2195L6214j4491m2034l1211J7161k2498O2687J0711m2324l1680j4018
12616I6660L0922L0660k3280l0674O9007M9583j7243m3233J3623n7934j5712O7973
12604A70352L1091j0325J1060j8716k3761L4559l1825p7383K9836N5575L9839
$$ y = [77115, 45712, 25419, 7833, 9515, 31177, 452, 26945, 26846, 26413, 31482, 71106, 82663, 37865, 46728, 132129, 151556, 121781, 119400, 133404, 123909, 99996, 90575, 71001, 65511, 71783, 105313, 128209, 90817, 68448, 53085, 36238, 72197, 109399, 138218, 146738, 151128, 231420, 265287, 213150, 151542, 129221, 137426, 136877, 135347, 123726, 106996, 167106, 191700, 185315, 164310, 129727, 103611, 133816, 179896, 189841, 197201, 168979, 159848, 98854, 62878, 61768, 85948, 168143, 204357, 189866, 147832, 116621, 133782, 111284, 173971, 184682, 142358, 110678, 96660, 127582, 158242, 134962, 104288, 173295, 222878, 205635, 162402, 176025, 118091, 102379, 170352, 201443, 191118, 202178, 183462, 159701, 194260, 162435, 85052, 114888, 170463, 210302]
12593B10302o17n1256r2685p494k3923K9061L6896j9644k7478M222K115l3122
12581B6377j3041r41M4992J3444M7509O6259K8304J5883k7053j7526m149N1386
12569B31444k273j116o345n1641N506O0881k1224m2252L957m2202J308K9048J7254
12556A82345N2164o610o171L8981M0839N7416N1436k778j2129N6178K0747O5728
12544E38146m143j2706j8965J0447k6021k0890K843l795M6807J4992r441k5870
12532D91404j8839p4691L0612N2277M2279M2181Q217n1745q650J0905L4212J3866
12520E72028m670n2129j0187L6936j7818o7569K7838Q3399J9558j0225N2857O1743
12508F91761R5851J26602N4588P4955O7795n501M1460J9536J7222K5039j4753
$$ y = [210302, 209685, 158429, 65744, 58250, 34327, 63388, 100284, 80640, 53162, 57384, 59499, 26377, 13336, 12395, 57387, 70831, 118340, 184599, 212903, 228786, 201733, 184207, 180058, 231444, 229171, 228055, 221710, 170069, 175575, 236456, 215232, 172980, 176937, 134735, 136043, 165091, 182345, 234509, 227899, 221728, 260709, 301548, 358964, 410400, 407622, 395493, 451671, 472418, 538146, 534003, 521297, 502332, 512779, 486758, 465868, 468711, 464916, 511723, 526715, 517274, 491404, 472565, 397874, 428486, 480763, 523042, 565223, 573440, 521695, 513045, 523950, 558162, 572028, 567358, 515229, 505042, 541978, 524160, 456591, 484429, 567828, 587386, 577161, 630018, 691761, 787612, 914214, 968802, 1043757, 1111552, 1106051, 1147511, 1167047, 1184269, 1209308, 1194555]
12497A194555j16632l1572m818m5746l7033m9434m4939k7837r6133m7068N2395
12486G45738j7653p229O506L375k8366o905K57k9328j9339K4574p706k4946l4453
12473F04525N5799L4894j59k9555L8217P758m7008k7669J111J1878J3986L8717
12461G02494O6064J0481j8430j3591k7505L3168m5375m2949j0042k3969K7261
12450F57607l0061n2670o9228O6874O1794l0974l7549q3136q8637l7939N2157
12439D08238K1495l9350m8388o0938j4306K165P4043k722o7789M242L341L5458
12427C15489P2059M3756K3104J5600j8743N412q496k9551k9116m9423k7827L2784
12415C45048m2254n7969k8504N2024M917P546j0625L2721M9424K6265m8385p8449
$$ y = [1194555, 1077923, 1046351, 1041533, 995787, 958754, 909320, 864381, 836544, 740411, 693343, 745738, 728085, 720856, 727362, 730737, 702371, 695466, 695723, 666395, 647056, 671630, 663924, 638978, 604525, 660324, 695218, 695059, 665504, 703721, 711479, 664471, 636802, 637913, 649791, 663777, 702494, 768558, 779039, 760609, 747018, 719513, 752681, 707306, 664357, 654315, 630346, 657607, 627546, 574876, 505648, 572522, 634316, 603342, 565793, 482657, 394020, 356081, 408238, 429733, 390383, 341995, 281057, 266751, 268916, 342959, 340237, 272448, 276690, 280031, 315489, 387548, 431304, 454408, 470008, 451265, 456677, 448181, 418630, 389514, 340091, 312264, 345048, 302794, 244825, 216321, 268345, 273262, 280808, 270183, 302904, 352328, 378593, 330208, 251759]
12403B51759M5656j4123k3877j9900l0477J5188N8440O9098J9217L8460K6223
12392D35664j3091p6587J5754L5406o0399j7629K8524K1248l5478k6523M3301
12381C50190L1912j1405Q194K9292L717R647j2784R003J1334p961m9329p5786
12369B96024l0880P6231j0844j0106n419l919K1898J1772n276k6377J2373R3666
12357D19143O9750k2455j5889n410k7578m64N0417N8599M956k3368o0486l9369
12345D07846l900J4731J1239J3142j7953J0240J0562K6021K9187K8649N359o1811
12333D73312k8158n1714J5934K3315J9763p961l3357K6599M3615r61K9695J0744
12321E20826N7192k1049n2170q870J0633j0150K1436J3206M1576O454l8529j5395
$$ y = [251759, 297415, 283292, 259415, 239515, 209038, 224226, 282666, 351764, 370981, 409441, 435664, 422573, 345986, 361740, 397146, 336747, 319118, 347642, 368890, 333412, 306889, 350190, 382102, 370697, 378891, 408183, 411900, 421547, 408763, 417766, 429100, 421139, 371810, 296024, 265144, 341375, 330531, 320425, 315006, 311087, 332985, 344757, 339481, 313104, 325477, 419143, 488893, 466438, 450549, 445139, 417561, 417097, 467514, 526113, 531069, 507701, 447215, 407846, 403946, 418677, 429916, 443058, 425105, 435345, 445907, 471928, 501115, 529764, 535123, 473312, 445154, 393440, 409374, 432689, 452452, 444491, 411134, 437733, 481348, 480387, 510082, 520826, 578018, 556969, 504799, 495929, 506562, 496412, 517848, 531054, 572630, 579084, 540555, 525160]
12309E25160K4218K6653j4720j4020k6273l352O0802K3291J4582r284l3813o9629
12297E03615K1941N0091L0629j9157j1347k2951K1163Q818k8710J7488j0318J1769
12285E73031l698p980k3837L3182L826j0238j3407J8983J5258o7579j499L6684
12273E52726L8410J3411l9896j5936L6688P7493P1786k5168q0375j917L9437p578
12261F59081L3208L3276J0540r311J0395N762N2849N5585L8589m3530j09344k2412
12249G14688M2118O5000k7416J5178l2585n5772n0001K4630P6587P0914n5893
12238G87448l6388l232j2372L7701K6143N466k8975K302k909P666K8234j6634
12226G94450m5910j1440M4820J3274o659J5391L3858j338N5436K0119j8057J0051
$$ y = [525160, 549378, 576031, 561311, 547291, 521018, 517666, 578468, 601759, 616341, 607057, 573244, 503615, 525556, 575647, 606276, 587119, 575772, 552821, 573984, 582802, 554092, 571580, 561262, 573031, 569333, 561353, 537516, 570698, 574524, 564286, 550879, 569862, 585120, 517541, 516042, 552726, 591136, 604547, 564651, 548715, 585403, 662896, 734682, 709514, 629139, 627222, 666659, 659081, 692289, 725565, 736105, 726794, 737189, 742951, 795800, 851385, 889974, 846444, 737100, 714688, 756806, 821806, 794390, 809568, 776983, 721211, 671210, 695840, 772427, 843341, 787448, 751060, 747828, 735456, 773157, 799300, 804766, 775791, 778093, 775184, 782850, 811084, 794450, 748540, 737100, 781920, 795194, 788535, 803926, 837784, 836446, 891882, 912001, 893944, 903995]
12214I03995J9119M8829P3057P4783M6545o239m6470K701J2271O6232K0951j2852
12202A202922L8061K5541L1136M9874J2868L934M9261K5172M0455J5411L4593
12191A529228k915j5540m7661j6057L6108P6696N1987K2205R7862J43753Q2610
12180A958276J06399P9259J06157J40653R3031J06699J34838L6789M2793N2162
12170B857056Q1223J08406N5627N5459J8015O5700N2659L1673N5600P9011J22798
12159C583227J29750O0891O1301R4543L1516M7214O2855O560M6220L8016J1110
12148D173203L1156N3466Q8292J11804Q1332J06039R2417J44282K01565K59943
12138E343499K64369L07242K90160L22346L74810M33412N26478M26774M08925
$$ y = [903995, 923114, 971943, 1045000, 1119783, 1166328, 1160089, 1113619, 1116320, 1128591, 1194823, 1215774, 1202922, 1240983, 1266524, 1297660, 1347534, 1360402, 1364336, 1413597, 1438769, 1479224, 1494635, 1529228, 1526313, 1510773, 1463112, 1447055, 1483163, 1559859, 1611846, 1634051, 1731913, 1875666, 1958276, 2064675, 2143934, 2250091, 2390744, 2483775, 2590474, 2725312, 2762101, 2804894, 2857056, 2938279, 3046685, 3102312, 3157771, 3175786, 3241486, 3294145, 3325818, 3381418, 3460429, 3583227, 3712977, 3773868, 3835169, 3929712, 3961228, 4008442, 4071297, 4077857, 4124077, 4162093, 4173203, 4204359, 4257825, 4346117, 4457921, 4539253, 4645292, 4737709, 4881991, 5083556, 5343499, 5607868, 5915110, 6205270, 6527616, 6902426, 7335838, 7862316, 8289090, 8698015]
12129H698015M34455M35574N32736N31819N80373O24998N90592O69589P38794
12120A3836945Q32383Q54679Q30315R07596J004435J053635J141745J355415J614418
12111B3431566J855201K283416K812997L441100M190032M868037N615912O293989
12103E4792250O566503O251204N325989L784348J935530N4637j450668k405680
12095G4854113k652808k380413j893834j243402o18848j0432N60111R53482J346916
12086F8914885J557843J606398J467043J266098J107848J131256J189704J336135
12078G9577210J640080K001922K252441K359859K335482K190131K111894K163362
12070I6632381K166052K483871L088516M021020N154061O633834Q476992J0608908
$$ y = [8698015, 9132470, 9568044, 10100780, 10632599, 11212972, 11837970, 12428562, 13098151, 13836945, 14669328, 15524007, 16354322, 17261918, 18266353, 19319988, 20461733, 21817148, 23431566, 25286767, 27570183, 30383180, 33824280, 38014312, 42882349, 48498261, 54792250, 61358753, 67609957, 72935946, 76720294, 78655824, 78710461, 77259793, 74854113, 72201305, 69820892, 67927058, 66683656, 66064808, 66054376, 66614487, 67567969, 68914885, 70472728, 72079126, 73546169, 74812267, 75920115, 77051371, 78241075, 79577210, 81217290, 83219212, 85471653, 87831512, 90166994, 92357125, 94469019, 96632381, 98798433, 101282304, 104370820, 108391840, 113545901, 120179735, 128656727, 139265635]
12062A39265635J2649975J4286935J4800864J3549841J0333720N625330K17938
12055B10730238m809161q483250j0425428j0953466j0430070r190629p738413
12048A48699821o385654n092089m029265l192463k674467k368866k317462k294213
12040A20345342k406669k554944k486380k305705k026324j715337j418160j215367
12032A04216456j199804j336777j477144j531807j540494j435016j164349p42299
12024I3788766k31897M25720J113076J940712K847710L516423L803092L528873
12016A10732475K454560P63735j288378l213223m814842n809535o250408o141219
12008H6433165n705401n118481m515346l865309l267589k812554k519212k164622
$$ y = [139265635, 151915610, 166202545, 181003409, 194553250, 204886970, 210512300, 210730238, 205921077, 197437827, 187012399, 176058933, 165628863, 156438234, 148699821, 142314167, 137222078, 133192813, 130000350, 127325883, 124957017, 122639555, 120345342, 117938673, 115383729, 112897349, 110591644, 108565320, 106849983, 105431823, 104216456, 103016652, 101679875, 100202731, 98670924, 97130430, 95695414, 94531065, 93788766, 93556869, 93982589, 95095665, 97036377, 99884087, 103400510, 107203602, 110732475, 113187035, 113950770, 112662392, 109449169, 104634327, 98824792, 92574384, 86433165, 80727764, 75609283, 71093937, 67228628, 63961039, 61148485, 58629273, 56464651]
12000E6464651j944518j770585j669848j611035j601181j571225j521219j437913
11992D3337127j350398j278837j190819j159654j094709j077329j061202r71153
11984C4153026r35430r57325r90145r59126r25576q70020q34510p79883p27110
11975B6173901p03190o46342o46592n80522n55910m64123m58457m67759m26488
11966B1224518l37807l77091m01591l23253l24362l45838l40211l53029l69375
11957A8051961l60721l69696l06919l80806l41600k76976l23219k76031k64813
11948A5151180k82219k59744k91678k65696k58631k24083k95443k89491j97425
11939A2786770k93123k67898l25413k95018l16115k89783k52294k70721k32117
$$ y = [56464651, 54520133, 52749548, 51079700, 49468665, 47867484, 46296259, 44775040, 43337127, 41986729, 40707892, 39517073, 38357419, 37262710, 36185381, 35124179, 34153026, 33217596, 32260271, 31270126, 30311000, 29385424, 28515404, 27680894, 26901011, 26173901, 25470711, 24824369, 24177777, 23597255, 23041345, 22577222, 22118765, 21651006, 21224518, 20886711, 20509620, 20108029, 19784776, 19460414, 19114576, 18774365, 18421336, 18051961, 17691240, 17321544, 17014625, 16633819, 16292219, 16015243, 15692024, 15415993, 15151180, 14868961, 14609217, 14317539, 14051843, 13793212, 13569129, 13273686, 12984195, 12786770, 12493647, 12225749, 11900336, 11605318, 11289203, 10999420, 10747126, 10476405, 10244288]
11930A0244288k36514k44478k08963k16493j99374j53372j52039k00494j84582
11921H447979j87027k07140j91880j70461j79015j89586j93639j79236j58908
11912F791087j56533j50448j19313j57504j93393r9161j20594q8403j14269j51582
11902E439887q6897j22170j38982j10708k0609p2466j48027p5804m0185r9773
11892D524266j13636p3765p3986p5211n9780q5111q5474l8270j13798j25833j09483
11881C569919q4968j01262q4842q2513j22747q0748o5454p041k9238m5294n0058
11870B815754j09065q7256k5502m1709j35476q3015l6518q3941j12673r4199n8753
11859A947647J7022j801p6963j9037j8051n979m8335p9404n4566k3008k1079N524
$$ y = [10244288, 10007774, 9763296, 9554333, 9337840, 9138466, 8985094, 8833055, 8632561, 8447979, 8260952, 8053812, 7861932, 7691471, 7512456, 7322870, 7129231, 6949995, 6791087, 6634554, 6484106, 6364793, 6207289, 6013896, 5914735, 5794141, 5705738, 5591469, 5439887, 5352990, 5230820, 5091838, 4981130, 4960521, 4888055, 4740028, 4664224, 4624039, 4524266, 4410630, 4336865, 4262879, 4187668, 4127888, 4042777, 3957303, 3919033, 3805235, 3679402, 3569919, 3484951, 3383689, 3298847, 3216334, 3093587, 3012839, 2947385, 2940344, 2911106, 2865812, 2815754, 2706689, 2619433, 2593931, 2552222, 2416746, 2333731, 2297213, 2213272, 2100599, 2006400, 1947647, 1964669, 1962868, 1885905, 1866868, 1848817, 1842838, 1794503, 1715099, 1660533, 1637525, 1616446, 1621970]
11847A621970o232K4030k511j5199l7988j06001l0196R732j2004J792L702q0915
11835A370180k1430k0074p0595m2170j4453n6881m0353L6093n79j1891J0113N3614
11823A191574Q000j68482r0258J9898N55m4290k0737j410R64k004m410k3103j0348
11810H55949m5095M4580Q067j720j3260m1680l2459j8652n9194n5892Q12M5538
11798F86994j5180J6326j7474J2827O3747L991o6226j2730l892m0641j4779k6088
11786E86875Q470J9381k8033N159k1132m5071K2559K7691m6863l7506J5782M363
11774E11675J2998k8967K5707L0345l6719k1311j0367l0078M814L6052j734o685
11762D85730N8593J5883q764n1486q090k992l6213p1936m0497L6608K4335O3479
$$ y = [1621970, 1615738, 1639768, 1637257, 1622058, 1584070, 1478069, 1447873, 1457605, 1445601, 1447393, 1451095, 1370180, 1348750, 1328676, 1258081, 1215911, 1201458, 1144577, 1104224, 1140317, 1139738, 1127847, 1137960, 1191574, 1199574, 1031092, 940834, 960732, 961287, 916997, 896260, 894850, 895814, 893810, 889400, 866297, 855949, 810854, 855434, 863501, 861781, 848521, 806841, 774382, 755730, 696536, 640644, 641456, 686994, 671814, 688140, 670666, 683493, 747240, 751231, 685005, 672275, 668383, 627742, 612963, 586875, 595345, 614726, 586693, 591852, 570720, 525649, 548208, 575899, 529036, 491530, 507312, 511675, 524673, 495706, 521413, 551758, 515039, 493728, 483361, 453283, 458097, 494149, 492415, 485730, 544323, 560206, 551442, 499956, 491866, 488874, 452661, 380725, 340228, 376836, 401171, 464650]
11750D64650K8526n5762l510J5452k4081j0656j0796J4347l035j6810K5479o2914
11738C60890K0280M7862j4684l5847j850m7581j0066j7340J8542M3284O121l6668
11726C32943l7173l2652k148q709O4873K3105k1607o0685l5638L9014J4650J3361
11714B89334k59K9233N266J1481m1243O695J4659n165m4489l998P1572j0615k9453
11701B93018O74k2864j3832N4395J4459o0000r7577l0806J8556L9592K591j4915
11689A83291K9661M2412l377k47l8575q8518J4772M5178K9810j2897L356J7576
11677B22442N9171K4072m8041l213m5549J374L4406J0745m7280j8465J6034Q3441
11665B89137J1133k5559J5199m9013j2319K1737N6661L4775P9406j0692k460K9519
$$ y = [464650, 493176, 437414, 433904, 449356, 425275, 414619, 403823, 418170, 415135, 398325, 423804, 360890, 381170, 429032, 414348, 378501, 376651, 329070, 319004, 301664, 320206, 363490, 369611, 332943, 295770, 263118, 260970, 252261, 317134, 340239, 318632, 257947, 222309, 261323, 275973, 289334, 289075, 318308, 323574, 335055, 293812, 300507, 315166, 310001, 265512, 261514, 333086, 322471, 293018, 293692, 270828, 256996, 311391, 325850, 265850, 168273, 137467, 156023, 195615, 198206, 183291, 212952, 255364, 251987, 251740, 213165, 124647, 139419, 184597, 214407, 201510, 204866, 222442, 281613, 305685, 257644, 254431, 208882, 210256, 244662, 255407, 208127, 189662, 205696, 289137, 300270, 274711, 289910, 240897, 228578, 250315, 306976, 341751, 421157, 410465, 408005, 437524]
11653D37524L2295J7006n797M1467J6751K2311L4854M6468o55p7914l0297r381
11641E24632j074L2480l9379j4282P149j5308o3108M55j2432N502j8942L2836
11629D38529J03922M3613L3424J8080M8823J6986j9257k3798q571l3657j6207
11618F01887j9558L6250P5410L4883P534j4269L0789O1501K1288O4560J42365
11607A042640P3272M7264n1319q571j9884K6315k2698m6236o6240m9833m5075
11596H79635p4955m4711n9437p7768j3140J4894K9820J8026k8105l8529J6200
11585F21930J3770J9206l807m3049k7306Q3171J3888o826o219q513K2656k4695
11573F54206j7639j0350k7538O3231M9860k5102k6603L8649K5728o5466j4994
$$ y = [437524, 469819, 486825, 481028, 522495, 539246, 561557, 596411, 642879, 642224, 564310, 534013, 524632, 523558, 556038, 516659, 502377, 509526, 494218, 431110, 431565, 419133, 424635, 405693, 438529, 542451, 586064, 619488, 637568, 686391, 703377, 684120, 660322, 651751, 618094, 601887, 582329, 618579, 693989, 728872, 736406, 722137, 752926, 814427, 835715, 900275, 1042640, 1115912, 1163176, 1111857, 1103286, 1083402, 1109717, 1087019, 1040783, 974543, 924710, 879635, 804680, 759969, 700532, 622764, 609624, 624518, 654338, 672364, 644259, 605730, 621930, 635700, 654906, 651099, 608050, 580744, 663915, 677803, 670977, 664758, 656245, 678901, 654206, 636567, 626217, 598679, 661910, 711770, 686668, 660065, 698714, 724442, 658976, 643982]
11562F43982J6776R346n0330q457j852n2655n8908K7425L0261n5574m2384l0584
11550D27046k8614k1239k3411l1263R556j2633J0151M8135l6030l6661N865m0108
11538B70794K3198m299N088j686M2684l850k6686k055J9133P452O3433L6195o7216
11525C62185n6745n1124r454k7238n4974j2671L4783L3528k2371k5323n4171k5221
11513I1204K612N372K1729p264L329j456J8966L9563L3761k76J1952J5864o2313
11500A73043l4879q190l853j4252K5096M8890j7040J0577K1526K7457N568n8343
11488A75600k8102J7337o661K5675p039j4850j8677m8172l9830L0184J9667n1050
11476E4082m454N3861K7947j4627M440K5293L7408q352l6058O0292j2823l0048
$$ y = [643982, 660758, 670104, 619774, 611317, 609465, 556810, 497902, 525327, 555588, 500014, 457630, 427046, 398432, 377193, 353782, 322519, 332075, 319442, 329593, 377728, 341698, 305037, 310902, 270794, 293992, 289693, 294781, 293095, 335779, 331929, 305243, 303188, 322321, 329773, 393206, 429401, 362185, 305440, 254316, 244862, 217624, 162650, 149979, 184762, 218290, 195919, 170596, 116425, 91204, 93816, 99188, 120917, 113653, 116982, 115526, 134492, 174055, 207816, 207540, 219492, 235356, 173043, 138164, 129974, 126121, 111869, 136965, 185855, 168815, 179392, 200918, 228375, 233943, 175600, 147498, 164835, 158174, 183849, 176810, 161960, 143283, 95111, 55281, 85465, 105132, 54082, 49628, 103489, 131436, 116809, 121249, 146542, 183950, 175598, 139540, 199832, 187009, 156961]
11464A56961q627k0147J7967j7713n9667j4095P355J0663n530n563q831j4288
11452C8485J5790L6755k6793k6879Q059M7101P375n9906q800n9562p2772N8015
11440d3132M7514J1721q360N7724k803n2721j1189N4295r549r426L2112N0486
11428A16672L2325k7611L4451j3167m3028L0372l927q8376p2976M3555R533l2343
11416a4520J8045J5291n106l3972K2142K9473k6298k7374J6600J1613L9425L9164
11404H4483j2367K8027k2139M675o772n1817p618j5628o480L9065O3270N6514
11392A53213k7760o5984n757j6906q4200M52J8491j01J5200O3548K5337k9293
11380D6240R73j157J41J3636m4030o545K3076L3805L5650K465o9501k3441J0958
$$ y = [156961, 148334, 128187, 146154, 128441, 68774, 54679, 62034, 72697, 67167, 61604, 52773, 38485, 54275, 91030, 64237, 37358, 45417, 92518, 99893, 39987, 31187, -28375, -101147, -43132, 4382, 16103, 7743, 65467, 62664, 9943, -1246, 53049, 43500, 34074, 66186, 116672, 148997, 121386, 155837, 142670, 99642, 130014, 126087, 37711, -35265, 8290, 17823, -14520, 3525, 18816, 13710, -20262, 1880, 31353, 5055, -22319, -5719, 5894, 45319, 84483, 72116, 100143, 78004, 82679, 75907, 24090, 16472, 844, -5636, 33429, 96699, 153213, 125453, 59469, 53712, 36806, -47394, -46942, -28451, -28552, -13352, 50196, 75533, 46240, 47213, 46056, 46197, 59833, 15803, 9258, 32334, 66139, 101789, 104254, 34753, 11312, 22270]
11367B2270j8055l6769N1564R2344K5740P763m9090j7950n495L749M1637k4860
11355I2848K2258J4889L6635j3611j4447l7272l2092l8901R845l5561O3772r815
11343E8548o3844j5795M1705N3182O42P125R266k1257K9330N1266P0203R7759
11331C18130J92854J39793r0279j36319j56740j16422K2113O198R689k1392m0566
11320A27059K2418l9144l5052Q187q724J284K0820L3191L8502m0739j5363m0987
11308G1452J5327J6835q4073j103J4332N71k087M8531J9391J177m8722K786M218
11295E8635j2746j6527q167L8367n204n705N852L1420O451K2507l7420k3545l51
11282E3567k8470J7528m1084J5768P2094J515m176l4336j4838M0662L2667k1401
$$ y = [22270, 4215, -32554, 19010, 111354, 137094, 144857, 95767, 77817, 72322, 76071, 117708, 92848, 115106, 129995, 166630, 153019, 138572, 101300, 69208, 30307, 40152, 4591, 68363, 58548, -5296, -21091, 20614, 73796, 74438, 81563, 90829, 69572, 98902, 150168, 220371, 318130, 510984, 650777, 560498, 424179, 267439, 151017, 173130, 179328, 189017, 167625, 127059, 149477, 110333, 75281, 83468, 74744, 76028, 96848, 130039, 168541, 127802, 112439, 71452, 86779, 103614, 19541, 18438, 32770, 33341, 31254, 79785, 99176, 100353, 51631, 54417, 58635, 45889, 29362, 21195, 59562, 54358, 48653, 54505, 85925, 92376, 114883, 77463, 53918, 53567, 25097, 42625, 1541, 17309, 89403, 90918, 86742, 52406, 37568, 78230, 110897, 89496]
11270H9496k0455J2115k8130j5891L8295k6129j8977n342r069R562O2373j6619
11258G1229k8833K1273j5465k3115j883j7101j1108K6867K0122P4535M2184p2919
11246H5786l6623m1584p2233l1213Q9729N0243J1534J7583j3620n1039K3991L4623
11234F7177l2748k0871J0796m7312K809K8229N3691K0761J1916l6705m3179k3998
11222i434K1636l3380K8167n483M0834k0725l1645l2749J6814Q58K8165L6588
11210C9646M8200j8128j3223J4895N4321K186n5008j9026m9787J5992J2312J6672
11198D9052l3933j9903l190K6682j711r93J0642o286M2531J6550k263K2822j660
11185I8340K137p254n438k7920j1134Q154l8103j8326N0999K8934L7075K7091
$$ y = [89496, 69041, 81156, 53026, 37135, 75430, 49301, 30324, 24982, 15913, 25475, 87848, 71229, 42396, 63669, 48204, 25089, 23206, 6105, -5003, 21864, 41986, 116521, 158705, 85786, 49163, 7579, -64654, -95867, -6138, 44105, 55639, 73222, 59602, 8563, 32554, 67177, 34429, 13558, 24354, -22958, -20149, 8080, 61771, 82532, 94448, 57743, 14564, -9434, 12202, -21178, 6989, 1506, 42340, 21615, -10030, -42779, -25965, -25107, 3058, 39646, 87846, 69718, 56495, 71390, 125711, 127897, 72889, 53863, 4076, 20068, 32380, 49052, 15119, -4784, -7974, 18708, 16997, 16004, 26646, 20360, 62891, 79441, 77178, 100000, 98340, 100477, 93223, 87785, 59865, 48731, 56885, 18782, 456, 51455, 80389, 117464, 144555]
11173A44555L3675J1984O1848J1212j35403m1742M1017J8783k3120o2102k4958
11162C5749j045l6135K5419M8863L7936l7271o5579n4178J4750O1209K9372K298
11150F1388k1156p364j6542J3888L6401N733l4103M2463K0153j3797j9983j0149
11138E6932L0330K760m1671n5135k2851N7733L2251K6347n665k3409J330m15R675
11125F8212M4256l4011m2559j3650N757O21L2191l5051j7804L6001K0349N446
11113F9758j5936J4390K188k3382n8210k5502m5083j3276R710M5966K3544J9354
11101C521q567l5064k1596J4120K0107K4175N2753P341j9634j789L429k4731L4662
11088D8727k0664n6189J5827K5708j128j4085k6292r813K2521M3294P172r331
$$ y = [144555, 178230, 190214, 252062, 263274, 127871, 86129, 127146, 145929, 122809, 60707, 35749, 34704, -1431, 23988, 72851, 110787, 73516, 7937, -46241, -31491, 29718, 59090, 61388, 40232, 32868, 16326, 30214, 66615, 72348, 38245, 80708, 100861, 87064, 67081, 56932, 87262, 90022, 48351, -6784, -29635, 28098, 60349, 86696, 81031, 57622, 58952, 58537, 68212, 112468, 78457, 35898, 22248, 28005, 28626, 60817, 25766, 7962, 43963, 64312, 69758, 53822, 68212, 70400, 47018, -11192, -36694, -81777, -95053, -85343, -39377, -15833, 3521, -5046, -40110, -61706, -47586, -27479, -3304, 49449, 56790, 37156, 35367, 38796, 14065, 48727, 28063, -28126, -12299, 13409, 12281, -1804, -28096, -37909, -15388, 27906, 35078, 25747]
11076B5747l909K731J4537j0747J1874k0315K110l4093n2533M9892N1319l3957
11064B656N167P6688M6222l6484p1666l0600L9569j8080K6531K2515O7082j0270
11052A19330o1949k3717k028q388O202j6220O963m7483k1995K7500L8280L8726
11040E5221J6271l9637k7222L3068K6873m1415j5660j9391J9902K1174J4269K5853
11028F9306q203K7464o6k6515J1634M5938M420k9119K4271J2469J0172o2848n2442
11015B6481m9854m9172M8543J7312N841J3076m2532R251K3327k7708k5839k3678
11003g4952P323L0140m601j8546L5650L3515m889j7495K5566L6478M9153M6184
10991A43526l5274n5300R898M8206L8242j1326M633m4441K792L8985J8478q8851
$$ y = [25747, 21838, 24569, 39106, 28359, 40233, 19918, 22028, -12065, -64598, -14706, 36613, 2656, 7823, 84511, 130733, 94249, 22583, -8017, 31552, 13472, 40003, 62518, 129600, 119330, 57381, 33664, 31636, 23248, 29450, 13230, 20193, -27290, -49285, -21785, 16495, 55221, 71492, 31855, 4633, 37701, 64574, 23159, 7499, -11892, 8010, 29184, 43453, 69306, 61103, 88567, 88501, 61986, 73620, 119558, 123978, 94859, 119130, 131599, 141771, 78923, 26481, -23373, -72545, -24002, -6690, -849, 12227, -30305, -21054, 2273, -25435, -51274, -74952, -67629, -37489, -42090, -60636, -24986, 8529, 3640, -13855, 11711, 48189, 97342, 143526, 108252, 52952, 62850, 111056, 149298, 137972, 142605, 98164, 100956, 139941, 158419, 69568]
10979F9568m2378K790n0081l8170J5048J7917p648l7824k6385O5064K2914j6932
10967b6117J2334M3019P102L4745K8309K2930m3031r7253m9963K0666M6700K0390
10955A9831L5277N5478k2175p4854N0160r93l7555k121j2521r102J6792j088L3022
10942E0151k192J5748K7291Q89p5397m2811J5180N7024L0766k1133l8815L1668
10930D8369N4534l0973k2442j780j9049M265k0664q984Q8104N2410l4109m9843
10918E9838k50j7683k3127m4483P616N4914M2339J7647k6206m9539k2177n8657
10906e9768J9835J04403J704p5548M1735N1543M911m9220L8993J5092m9401o127
10894C8152N3374J7928L9028J3283q0710m1395k3090O4773L8365l0080j9393K6270
$$ y = [69568, 27190, 29980, -20101, -58271, -43223, -25306, -32954, -70778, -97163, -32099, -9185, -26117, -13783, 29236, 36338, 71083, 99392, 122322, 79291, -17962, -67925, -47259, -559, 19831, 55108, 110586, 88411, 13557, 63717, 62724, 25169, 23048, 10527, 1425, 18217, 17129, 50151, 47959, 63707, 90998, 91887, 16490, -26321, -11141, 45883, 76649, 55516, 16701, 48369, 102903, 71930, 49488, 47708, 28659, 32924, 12260, 3276, 91380, 143790, 109681, 59838, 59588, 41905, 18778, -25705, -18089, 36825, 79164, 96811, 70605, 21066, -1111, -59768, -39933, 64470, 66174, -9374, 32361, 83904, 88815, 39595, 78588, 93680, 44279, 38152, 91526, 109454, 148482, 161765, 81055, 39660, 16570, 81343, 119708, 89628, 70235, 96505]
10882I6505j0212J20q518k1921L3506L7689n667N740j2091k002k4513k3896j0914
10869E3826j8898L5156J531o5970o944p057L5822m814P699K0802P109j4705M312
10856D7869m158L2204k4705q430j2723m8337k5798j6014P0547k9511p130j7519
10844d3705n767M6768m3381L4825P4220L0925l1834n3415K7843K9334m9960K512
10832A8365j1439k9177J2940L3512j1265M127J8534l1368k224N3117N9244j4722
10820I9644l9762J4795m376l9404k5947k2882M3905Q570L7987j2137l2049P7080
10808A05424P609l5893K5375L5260n2797m7383k1599k9258l4772J2446K7407R146
10796I65P518J3760N0816l4833m3493L74J5186r741J0939k0957k035J1922o106
$$ y = [96505, 86293, 86413, 77895, 55974, 89480, 127169, 121502, 127242, 115151, 113149, 88636, 64740, 53826, 34928, 70084, 71615, 5645, -1299, -8356, 27466, 22652, 30351, 51153, 58262, 43557, 47869, 43711, 75915, 51210, 42780, 30057, -18280, -44078, -60092, 10455, -19056, -26186, -43705, -49472, -2704, -46085, -11260, 62960, 93885, 62051, 8636, 36479, 65813, 15853, 18365, 6926, -22251, -9311, 24201, 12936, 17063, 35597, 4229, 2005, 55122, 114366, 99644, 59882, 74677, 70301, 30897, 4950, -17932, 25973, 34543, 72530, 60393, 28344, 105424, 113033, 77140, 102515, 137775, 84978, 37595, 15996, -13262, -48034, -35588, -8181, 965, 8483, 22243, 73059, 38226, -5267, -4893, 10293, 552, 11491, -9466, -11501, 421, -5685]
10783e685J6431N7811N1110J3864J4876l4806j0959K4022M9412m0225L398L9462
10771A78711Q955J3873m168j3491j1207M0534N6717M9580N1232K7369O8973j7629
10759D49449j948O4369O0898J25627J74369J48031K1938M9144J92505J54078K13585
10748A652045L05437M23961N88222R50947J557075K836821N590100J1080964J6593743
10739D1579315J2577185j205231j3199591j1807461q023559n170000l032769j876902
10731I840987j293595q80053p53476o39322m89527m28842l34413k53314k47160
10722D521285j64901k41667k66078k40529k42546j54969j40782p4403o0210k7665
10712B907535o9210p5700j05279q6285q8071o6135m2113j46681p0506m1870n8411
$$ y = [-5685, 10746, 68557, 119667, 133531, 148407, 113601, 102642, 126664, 176076, 135851, 139249, 178711, 187666, 201539, 197371, 183880, 172673, 213207, 269924, 319504, 370736, 398105, 467078, 449449, 447501, 511870, 572768, 698395, 872764, 1020795, 1042733, 1091877, 1284382, 1438460, 1652045, 1957482, 2381443, 2969665, 3920612, 5477687, 8314508, 13904608, 24985572, 41579315, 54156500, 52951269, 39751678, 27944217, 19920658, 14750658, 11717889, 9840987, 8547392, 7667339, 6913863, 6274541, 5785014, 5356172, 5021759, 4768445, 4521285, 4356384, 4114717, 3848639, 3608110, 3365564, 3210595, 3069813, 2995410, 2935200, 2907535, 2838325, 2762625, 2657346, 2571061, 2482990, 2416855, 2374742, 2228061, 2157555, 2115685, 2057274]
10701B057274l2861m6104l5603q0764p1666J5464m3843j39396n6634k8334p5922
10690A461611j01451l6608K468o30M6997L1732p4781n1500K2382j6242o6721q1976
10678A135281n6602l1655J1487l3338l8711M1890k9493m1530k7756q3488m9702
10667G96383N808K0614K7440N6049n9368q2125L084N3965m2536n4515l9625m2689
10655F42485k1652k5141M9516J6625k385J062p4222o4953M0216J6356j38L5179
10643F12948n8087q384n66k8550m9228p6403k1044Q563K1757n79L837J1212J5276
10630D30752k2090n7200o1113M1312P148k8546K2272J406l37J1345L2638K0980
10618C98567j2675n714k1299o0383j6261R024K9941L2873j7401l4033p266K7559
$$ y = [2057274, 2024413, 1978309, 1942706, 1861942, 1790276, 1805740, 1761897, 1622501, 1565867, 1537533, 1461611, 1360160, 1323552, 1326020, 1325390, 1372387, 1404119, 1329338, 1277838, 1300220, 1283978, 1217257, 1135281, 1078679, 1047024, 1058511, 1025173, 986462, 1028352, 998859, 957329, 929573, 846085, 796383, 802191, 822805, 850245, 906294, 846926, 764801, 767885, 821850, 779314, 724799, 685174, 642485, 620833, 595692, 645208, 661833, 659448, 660510, 586288, 521335, 561551, 577907, 577769, 612948, 554861, 546477, 545911, 517361, 468133, 391730, 370686, 379249, 401006, 400427, 404264, 415476, 430752, 408662, 351462, 290349, 331661, 338809, 310263, 332535, 333941, 333604, 344949, 377587, 398567, 385892, 380178, 358879, 298496, 282235, 291259, 321200, 354073, 336672, 302639, 295373, 322932]
10606C22932l4795k7700j4923j2476K3152K6522l8530k9611n8599K4514Q199k9148
10594A59537j1698J6183J3394l5084J6209K783K7075J4405m7150J2115j6295K7245
10582A78719k9372J0644K3342L6733m60L8908O1143m721j10084m1929O0717k9917
10570A93723k9377j5811q058N748M8104L225n6240J891N063n2904p550Q027L1340
10557A27181M2772M4537o471j1809k3961K2964o8564p4205J4469j0203l403L1012
10545H4319l5552k1116J5407j4847J7899m7764k1760P1053J3536L5165K0496j0178
10533A06658j5669m9204j6045k6132K1132L521M510K3593k9663o322P8045R680
10521A04104N083J6019R624j4509m4877m9160J5182K1967k4294m862Q377N982
$$ y = [322932, 288137, 260437, 245514, 233038, 256190, 282712, 244182, 214571, 155972, 180486, 188685, 159537, 147839, 164022, 177416, 142332, 158541, 161324, 188399, 202804, 155654, 167769, 151474, 178719, 149347, 159991, 183333, 220066, 219606, 258514, 319657, 314936, 204852, 162923, 223640, 193723, 164346, 148535, 140477, 146225, 194329, 197554, 141314, 143205, 148268, 95364, 87814, 95841, 127181, 169953, 214490, 208019, 196210, 172249, 195213, 126649, 52444, 66913, 56710, 53307, 84319, 48767, 27651, 43058, 28211, 46110, -1654, -23414, 47639, 61175, 96340, 116836, 106658, 90989, 41785, 25740, -392, 20740, 24261, 28771, 52364, 22701, 16379, 94424, 104104, 109187, 125206, 134830, 120321, 75444, 26284, 41466, 63433, 39139, 34277, 42654, 48636]
10509D8636m027l6629K3898l6989k3540M2522M5585M5286J084J2373l2792k9038
10497E6369L750N0799M6262M6542m0597j3965j1372R348j3166n104L9651l6084
10485A32433k0907j544m8280l5559r880K0092N2656K0624J3721J6975m212N769
10473A41888J793k8347o532k9017k8495K1408Q474N636N7328K6634P22k9553l6181
10460A05758l0639n2261k1193Q474N329K1248k8129O525K5966M1696K7589m7586
10448F2777q6371M7176P4861p40m0933J2736M0732m1300k5111j3506J5644P808
10436E3773o1082k3602J8449L5115M2456j6714l9801l9538J9535N9492L1684j0215
10424F9552J8085l1969L6954K5533J6525k3079j106n474L5903K354n6119k1737
$$ y = [48636, 44609, 7980, 31878, -5111, -28651, 13871, 59456, 104742, 105826, 118199, 85407, 56369, 60119, 110918, 157180, 203722, 163125, 149160, 137788, 147136, 133970, 128866, 168517, 132433, 111526, 109982, 61702, 26143, 16263, 36355, 89011, 109635, 123356, 140331, 136119, 141888, 143681, 115334, 108802, 79785, 51290, 72698, 81172, 86808, 144136, 170770, 171492, 141939, 105758, 75119, 22858, 1665, 10139, 15468, 36716, 8587, 15112, 41078, 82774, 110363, 62777, -23594, 23582, 98443, 97703, 56770, 69506, 110238, 68938, 43827, 30321, 45965, 53773, -7309, -30911, -12462, 22653, 65109, 48395, 8594, -30944, -11409, 48083, 79767, 69552, 87637, 55668, 92622, 118155, 134680, 111601, 110495, 105021, 140924, 143278, 87159, 65422]
10412F5422q020j8440r08J3912J4318K4921R491k4334l4744m1030K3380N0057
10400G4025J167L935k7871L550m869j4806N140N4678q575l5878k6674K9436j7803
10387C5455K5409J8011Q7656j939m2316O328j8768l1661j2944j3699J2696P265
10375G1493k1499l8670N4704L7813Q79m1216j2220j3387k976K800p669k8321Q4899
10362H6630N3938M4009j9435r3972j8250M5017L7781j1141m8660J2368M744k6565
10350F6464j6851M1403J8279N9286R712l3566j6606l4203J5634j8689m8225j5090
10338B7548k5560K2367J2977P0656L0270J7101l0174M6170P246K3863k3610j381
10326A77473K7812J5925r853K490j6803l2743q294J5345j7917l832N0747J9106
$$ y = [65422, 57402, 38962, 38054, 51966, 66284, 91205, 100696, 76362, 41618, 588, 23968, 74025, 75192, 79127, 51256, 54806, 49937, 35131, 40271, 94949, 86374, 50496, 23822, 53258, 35455, 60864, 78875, 166531, 164592, 122276, 128604, 109836, 78175, 65231, 51532, 64228, 71493, 49994, 11324, 66028, 103841, 104720, 63504, 51284, 37897, 34921, 37721, 30052, 1731, 86630, 140568, 184577, 165142, 71170, 52920, 97937, 135718, 124577, 75917, 88285, 93029, 66464, 49613, 91016, 109295, 168581, 178293, 144727, 128121, 93918, 109552, 90863, 42638, 27548, 1988, 24355, 37332, 107988, 138258, 155359, 125185, 171355, 178601, 202464, 178854, 177473, 205285, 221210, 211357, 213847, 197044, 164301, 156007, 171352, 153435, 149603, 200350, 219456]
10314B19456K0635N5648k547r213l1988p828L8345m5905m1818l1487L12K9747
10302A93357O8034M3478J2749P5470L5107J8789n4624q389j8609j0294J0407J04727
10290D70202Q2521P7771M8077L8706P0070K9855L0984j156l7150l1230m3463n1115
10278F84072p8785j11465j3413L236k273o9359l5021l8979k1970L5185N6933M616
10266D12777j5951l3519o5322K1940K4705j9743j3329J9198N1193J4289J3107
10255D09345M0156J9054j7006o9098k0980J05225J15391P0907P7945J11148J48825
10244I90912J26918R8731O2146j6297L4706k0997p0325j18218j17492j32524j07675
10233G29885m6473j27145j20712k8673R246j33J2193l7841l2934L8820n798L5
$$ y = [219456, 240091, 295739, 293192, 283979, 251991, 244163, 282508, 236603, 194785, 163298, 163610, 193357, 261391, 304869, 317618, 393088, 428195, 446984, 392360, 383971, 365362, 355068, 365475, 470202, 552723, 630494, 678571, 717277, 787347, 817202, 848186, 847030, 809880, 778650, 735187, 684072, 605287, 493822, 480409, 483645, 481372, 412013, 376992, 338013, 316043, 351228, 408161, 412777, 396826, 363307, 297985, 319925, 344630, 324887, 311558, 330756, 381949, 396238, 409345, 449501, 468555, 451549, 382451, 361471, 466696, 582087, 652994, 730939, 842087, 990912, 1117830, 1216561, 1278707, 1262410, 1297116, 1276119, 1205794, 1087576, 970084, 837560, 729885, 683412, 556267, 435555, 406882, 416128, 415995, 428188, 390347, 357413, 396233, 390435, 390470]
10221C90470k8689K6860J1858J1533L2164n080R614l5948R006k0372n4400j7935
10209C29081M995K0545O5130P9492K7580R0077P7713P0778J22964J64025R5095
10198A147475L2812K1494p0559j30601j60443j14701k3587j0496p7907q6273j4893
10187E12321J5172k0620l6689k4423o1443o6108l000j598o778q301K5083q103
10175C15513k429N7471J2875k5646j8010k7400j9621m5580j9881K9160Q0753L5196
10163C72401m0706l1047N2298J7904j9483P5043J06248K5597R028l9478n9611
10152D68194m6141k6287k720j470J6561j4169J2460m5539n2067l5491J4112K8451
10140C15894m9920J7350j6685o5352R674k8255J02N4346O5613L2607L5135q28
$$ y = [390470, 361781, 388641, 400499, 412032, 444196, 439116, 448730, 412782, 421788, 401416, 347016, 329081, 334076, 354621, 419751, 499243, 526823, 616900, 694613, 765391, 888355, 1052380, 1147475, 1180287, 1201781, 1131222, 1000621, 840178, 725477, 701890, 691394, 613487, 527214, 512321, 527493, 506873, 470184, 445761, 384318, 318210, 315210, 313612, 306834, 298533, 323616, 315513, 313084, 370555, 383430, 357784, 339774, 312374, 292753, 247173, 227292, 256452, 337205, 372401, 331695, 300648, 352946, 370850, 351367, 426410, 532658, 558255, 567283, 527805, 468194, 422053, 395766, 393046, 391576, 408137, 393968, 406428, 360889, 308822, 273331, 287443, 315894, 265974, 283324, 266639, 201287, 210961, 182706, 182808, 237154, 302767, 335374, 370509, 369681]
10128C69681p458O222l4494l4547k1124j746J4056k6802K0304L4296J1765J9219
10116C49372Q042J2076n3655J0381O8974m921p8546p2329p560l0773J8206L5246
10104B54513N526K5934L2745J5735J7563k702r468K5219j9496l8057K6116j4172
10092C19456j2977J5704J3314J52O672J7338l0140K85O110K173K2554N3999O9075
10079D83715N1417J5225k3944o7583K3283O677j7346l9118m6524R545K7514K2456
10067D45317k5602n0268k5197r482m1996K1608N8313M1510O2583N621j7112J9429
10055D84724l5081j20265m7511j0637L7331J6580K4898p43l6501L624O6908M4561
10043D27888l3245o3305P17M0618k2083l92R25P6499L0440J3152O39k3499M498
$$ y = [369681, 362223, 368445, 333951, 299404, 278280, 276534, 290590, 263788, 284092, 318388, 330153, 349372, 357414, 369490, 315835, 326216, 395190, 390269, 311723, 239394, 231834, 201061, 219267, 254513, 260039, 285973, 318718, 334453, 352016, 349314, 339846, 365065, 345569, 307512, 333628, 319456, 306479, 322183, 335497, 335649, 342321, 359659, 329519, 329804, 335914, 338087, 360641, 414640, 483715, 535132, 550357, 526413, 458830, 482113, 488790, 471444, 432326, 385802, 395347, 422861, 445317, 419715, 369447, 344250, 334768, 292772, 314380, 372693, 414203, 476786, 482407, 465295, 484724, 449643, 329378, 281867, 271230, 308561, 325141, 350039, 349296, 312795, 316419, 383327, 427888, 394643, 331338, 332055, 372673, 350590, 350198, 351123, 427622, 458062, 471214, 471853, 448354, 452852]
10030D52852k549M1013n4347q601J0083K9188k1389J8277N6579N3208J0964j3161
10018E72117j4834K2729N7911o793o5107j13869q8899l9948R376k2342n7624P8029
10006C30746N0694j0963L4296P3746J4245n4518K4862J1443p4019j4881J7116
9995D02767J5994O819M2007n973q1606J0975N448k8502J4342r125j8807P2488
9983D26827M084L569N8007L2381O7907L3869K0139L0655m9363r2819K8440k362
9971E61334m6476m586M6999j5031L5383O0946l4162K7332J3294j7024M8773l8046
9959F38736J5111R292O208N5023J5781K860L1754K0605P0453O2807N4081J09226
9947A091937J9649R9595O2033J35556J64736J84232K85150K97391J95738P1147
$$ y = [452852, 450303, 491316, 436969, 428368, 438451, 467639, 446250, 464527, 521106, 574314, 585278, 572117, 557283, 580012, 637923, 631130, 566023, 452154, 363255, 323307, 332683, 310341, 252717, 330746, 381440, 370477, 404773, 478519, 492764, 438246, 463108, 474551, 400532, 385651, 402767, 418761, 425580, 467587, 461614, 380008, 390983, 396431, 367929, 382271, 373146, 354339, 426827, 430911, 434480, 492487, 524868, 592775, 626644, 646783, 677438, 628075, 535256, 563696, 561334, 514858, 510272, 557271, 542240, 577623, 638569, 604407, 631739, 645033, 628009, 676782, 638736, 653847, 663139, 669347, 724370, 740151, 743011, 774765, 795370, 865823, 928630, 982711, 1091937, 1111586, 1211181, 1273214, 1408770, 1573506, 1757738, 2042888, 2340279, 2536017, 2607164]
9937B607164R9233N1197P7437J87759K72638K43627J60505R8532N2901p2295o9405
9926C709293l5465j03291j56359n9450q3949m0166j1106l2525P2598J40016J36601
9915C536197K58158L16556M50761O72222Q87009J013222R25540P92724N49577
9906I401966K50058l7436k95487l86199l75630l69335k47106j60504r2533j87252
9896G500542l01459k48528k09133j44730r0971k2304R5270K11545K21108M03831
9886G415171N82695O14551O06532P01085P77238Q84001J004659J233669J488078
9877A5307679J936767K680077L780438N158865P231284J0144406J4008662J7955114
9869G8203292J9408457J5087708M774096o330896j2522099j3287309j1515405
$$ y = [2607164, 2706397, 2757594, 2835031, 3022790, 3295428, 3539055, 3699560, 3798092, 3850993, 3778698, 3709293, 3673828, 3570537, 3414178, 3354728, 3270779, 3230613, 3219507, 3186982, 3259580, 3399596, 3536197, 3794355, 4110911, 4561672, 5233894, 6120903, 7134125, 8059665, 8852389, 9401966, 9652024, 9614588, 9319101, 8932902, 8557272, 8187937, 7940831, 7780327, 7687794, 7500542, 7199083, 6950555, 6741422, 6596692, 6505721, 6483417, 6578687, 6790232, 7011340, 7415171, 7997866, 8612417, 9218949, 9920034, 10697272, 11581273, 12585932, 13819601, 15307679, 17244446, 19924523, 23704961, 28863826, 36095110, 46239516, 60248178, 78203292, 97611749, 112699457, 117473553, 111142657, 98620558, 85333249, 73817844]
9862G3817844q972336o505243m434008k667320j092673L75157J939040L768929
9854E6229390N750809P348817Q039931P621006O594385N411331M047380L071025
9846A04114074K730198K572835K063825J074078o3693j449444l141865m462038
9838A03437970m691700l999444l067444j951006k69829K370489N902451J0954916
9830A08686403J7965314K7146817L8090783M7388485M6104779K6840078l807083
9823C08415576k8570879l7956416l6593206l0424677k2937684j6121146j0827648
9816A24983920o781668l603304j072809R56922K452112L583683M007661L814396
9808A28340913L260666K453355J321336j7190r32745j039850r39131j512140l186582
$$ y = [73817844, 64845508, 58340265, 53906257, 51238937, 50146264, 50521421, 52460461, 56229390, 61980199, 69329016, 77368947, 84989953, 91584338, 96995669, 101043049, 104114074, 106844272, 109417107, 111480932, 112555010, 112491317, 111041873, 107900008, 103437970, 98746270, 94746826, 91679382, 89728376, 89458547, 91829036, 97731487, 108686403, 126651717, 153798534, 191889317, 239277802, 285382581, 312222659, 308415576, 279844697, 241888281, 205295075, 174870398, 151932714, 135811568, 124983920, 118202252, 114598948, 113526139, 114483061, 116935173, 120518856, 124526517, 128340913, 131601579, 134054934, 135376270, 135359080, 134426335, 133386485, 132447354, 130935214, 127748632]
9799A27748632n598895p833843q946301q580284p224193n675583m242498k853567
9791G6793468j508516m5721J609482L627723O115879R294530J2944018J5269547
9783A24100410J3106292N091215n568872j3063740j5175117j3962315j1525249
9776H3002624r017264o907522n378595m297340l433562k820037k357586k142718
9768D6648000j824903j642690j524257j482665j428589j396433j346545j228131
9760C4773787j077177r40559q38719o84507n41227m19398l87529m32268n23762
9751B8928641m21064k63719j43826j6206J07180J58429J03336j06094l85179p00841
9741B7260657r74373j155838j187342j117104r61737r34195p86461o62949o30590
$$ y = [127748632, 122149737, 114315894, 105369593, 96789309, 89565116, 83889533, 79647035, 76793468, 75284952, 75239231, 76848713, 80476436, 86592315, 95886845, 108830863, 124100410, 137206702, 142297917, 136729045, 123665305, 108490188, 94527873, 83002624, 73985360, 67077838, 61699243, 57401903, 53968341, 51148304, 48790718, 46648000, 44823097, 43180407, 41656150, 40173485, 38744896, 37348463, 36001918, 34773787, 33696610, 32756051, 31917332, 31232825, 30691598, 30272200, 29884671, 29452403, 28928641, 28507577, 28243858, 28100032, 28083826, 28191006, 28349435, 28452771, 28346677, 27961498, 27260657, 26286284, 25130446, 23943104, 22826000, 21864263, 20930068, 20143607, 19480658, 18850068]
9732A8850068m88403l87824l46283l45487k76681j72217k39085k44280j93051
9723A6156757k09629j56877j86061k18838k31027k54819l66286l92082m25816
9714A3715322l24804k74613k73657k45988k59169l83728l86677l44956l66486
9705A0855244k82564l09911k81062k25796k23353j93611j81030k19843k43954
9696H694120k30531k50081l01725j97896j77700j20976j33370k03305j57392j39351
9686F781793j65972j53178j23461j13325j55844j02678j27041j36117j55444j53565
9676E395168j43244j47825j35778j12816j30519j64610j33478p9063o6265l1147
9666D250423k972j5917l075j29834j35754n9992m8317o1031q1688p9338j00718
$$ y = [18850068, 18361665, 17973841, 17627558, 17282071, 17005390, 16833173, 16594088, 16349808, 16156757, 15947128, 15790251, 15604190, 15385352, 15154325, 14899506, 14533220, 14141138, 13715322, 13390518, 13115905, 12842248, 12596260, 12337091, 11953363, 11566686, 11221730, 10855244, 10572680, 10262769, 9981707, 9755911, 9532558, 9338947, 9157917, 8938074, 8694120, 8463589, 8213508, 7911783, 7713887, 7536187, 7415211, 7281841, 7078536, 6921144, 6781793, 6615821, 6462643, 6339182, 6225857, 6070013, 5967335, 5840294, 5704177, 5548733, 5395168, 5251924, 5104099, 4968321, 4855505, 4724986, 4560376, 4426898, 4347835, 4281570, 4250423, 4247451, 4231534, 4228459, 4098625, 3962871, 3902879, 3854562, 3793531, 3711843, 3632505, 3531787]
9655C531787o2831j00155j16083j22898j03066j40708o3780m7931o6440l8083
9645B669812o011J3232n2741p4547m7434m0445n9870q8942q2687j33814j21299
9634A975254j16868j02200o5870q0292q1350J4329q852k8721k6659n314J3686
9623A487143q3798p2053j9011M6345Q151p5814o6101J3761p587l9617n5875O79
9611A136223K8533l0663n8096r1689l0189m753m5822j1555j6520m1401L6117J9464
9599H89649J0744J1883q596L4312j8156l4973q1291l0401k7416K6069q5964K7452
9587G13312O0868k3781k8721j2996J4418l7912J1403k2912j06325m8025l995j140
9575E14194P600J288L2880J5229k028n3268k4551M2471m7161n3758l303o267j8609
$$ y = [3531787, 3468956, 3368801, 3252718, 3129820, 3026754, 2886046, 2822266, 2774335, 2707895, 2669812, 2663801, 2677033, 2624292, 2549745, 2502311, 2461866, 2401996, 2313054, 2230367, 2096553, 1975254, 1858386, 1756186, 1690316, 1610024, 1528674, 1543003, 1534151, 1505430, 1478771, 1473457, 1487143, 1403345, 1331292, 1312281, 1358626, 1366777, 1290963, 1224862, 1238623, 1231036, 1191419, 1135544, 1136223, 1164756, 1134093, 1075997, 984308, 954119, 949366, 903544, 891989, 875469, 834068, 870185, 889649, 900393, 912276, 903680, 937992, 919836, 884863, 803572, 773171, 745755, 771824, 685860, 713312, 774180, 750399, 721678, 708682, 723100, 685188, 696591, 673679, 567354, 519329, 515334, 514194, 521794, 523082, 555962, 571191, 569163, 515895, 491344, 533815, 486654, 432896, 429593, 423326, 404717]
9562D04717L2688M9523o331l3130n0518J4271O0260n0588o5904j7172K5991l1436
9550C32371l3906l402O233N744O9853K6628L9020j7037l8502K7960p377k3799
9538C83786N123m2105L3343K372j3833j9887n3193j7909k039J2749R038L0708
9526C28153R633N299l7318m5469j9687L7913L4344J43k4883K3216K7745N068O379
9513C50536p0301L2064O0858p936j0293o1882l0475m5192M1841K6844k7556J5320
9501B73828J7307k462l3075L2249J9005J4341Q778O5315k3744j4191J3329N559
9489C76239K5709N3394R486j6493m6278n0852m3488n1050l9691N804J7852r827
9477B30805k667J5986k6979M8719K9100l8344m5030L4792J9263m0417j2824j6063
$$ y = [404717, 437405, 486928, 480597, 447467, 396949, 411220, 471480, 420892, 354988, 337816, 363807, 332371, 298465, 295063, 301296, 307040, 376893, 403521, 442541, 425504, 387002, 414962, 407585, 383786, 388909, 346804, 380147, 382519, 368686, 348799, 295606, 277697, 275658, 288407, 297445, 328153, 337786, 343085, 305767, 260298, 240611, 278524, 312868, 313011, 288128, 311344, 339089, 344157, 350536, 280235, 312299, 373157, 365221, 354928, 293046, 262571, 217379, 259220, 286064, 258508, 273828, 291135, 288673, 255598, 287847, 306852, 321193, 329971, 395286, 371542, 357351, 370680, 376239, 401948, 455342, 464828, 448335, 402057, 351205, 307717, 256667, 216976, 222780, 240632, 230805, 228138, 244124, 217145, 265864, 294964, 256620, 211590, 246382, 265645, 225228, 212404, 196341]
9465A96341M743k6929L9694Q2871O261R036M8901J71n52n659j1039K4752j12N0277
9451D18756Q1699J51349J35600J26140J61673Q5481p885j3450m2469n1976r1155
9440I53763j37829o1395r0445N778n6360m2530l8233k5476m575m8764m0100p780
9428D06054L9806L0507k1093j5903k5969l7678q130L0996N4456M5861J8807K3740
9416E41454O7086j6259J3362l1451k0077K4696J2180J1379J23922J71089J76827
9405A074208K17775J68816R6826N1157l0781m9387j6151l0485j33074j02796j13705
9394A132403j61573p9038n3796R252L0549N298j3621k7652R872k5226p5454p5904
9382F75110J7294J3010J5649J3712K2510l496L2771K5368J0320n8492L682R7206
$$ y = [196341, 201084, 174155, 213849, 296720, 302981, 312017, 360918, 361089, 360537, 354878, 343839, 368591, 368479, 418756, 500455, 651804, 787404, 913544, 1075217, 1160698, 1152813, 1139363, 1096894, 1044918, 953763, 815934, 754539, 664094, 669872, 613512, 570982, 532749, 507273, 502698, 453934, 413834, 406054, 445860, 476367, 455274, 439371, 413402, 375724, 367594, 398590, 453046, 498907, 517714, 541454, 608540, 592281, 605643, 574192, 554115, 578811, 590991, 602370, 726292, 897381, 1074208, 1291983, 1460799, 1557625, 1608782, 1578001, 1528614, 1512463, 1481978, 1348904, 1246108, 1132403, 970830, 891792, 837996, 847248, 877797, 883095, 869474, 841822, 851694, 826468, 751014, 675110, 692404, 705414, 721063, 734775, 757285, 753789, 786560, 811928, 822248, 763756, 767438, 864644]
9370H64644J05357O7174j48Q369L0249O1727J59609J71301J59565J03269K2851
9359A753967l3235N0525N2282N4152O4806Q909p7190l1921k906q704N335L2222
9347A868242Q6117P3860N9113R0811P5214J39779R3718J22448J78285J43120J41917
9336C072624J78878J84821J67874K03456K22573K75654K79163K69440K95700L66051
9326E516234L17623K63209K75772K58731K13653K25946K50702J94379J25276N3164
9316G694689p0383j03782q6079j47483k35488k60581k78731j79328k12147k55615
9306E865072k76870k55329k11391k27196j35604j71633k54182k04033j56847n8455
9296C913532j64635j68743j61336j37943j51102j38938o3763p3718j5065r1984
$$ y = [864644, 970001, 1037175, 1037027, 1045396, 1075645, 1137372, 1296981, 1468282, 1627847, 1731116, 1753967, 1720732, 1771257, 1823539, 1877691, 1942497, 1951406, 1874216, 1842295, 1839389, 1830685, 1836020, 1868242, 1954359, 2028219, 2087332, 2178143, 2253357, 2393136, 2486854, 2609302, 2787587, 2930707, 3072624, 3251502, 3436323, 3604197, 3807653, 4030226, 4305880, 4585043, 4854483, 5150183, 5516234, 5833857, 6097066, 6372838, 6631569, 6845222, 7071168, 7321870, 7516249, 7641525, 7694689, 7624306, 7520524, 7434445, 7286962, 7051474, 6790893, 6512162, 6332834, 6120687, 5865072, 5588202, 5332873, 5121482, 4894286, 4758682, 4587049, 4332867, 4128834, 3971987, 3913532, 3748897, 3580154, 3418818, 3280875, 3129773, 2990835, 2927072, 2853354, 2838289, 2746305]
9286B746305q7188r0286p7457j15136j09114o0857k8055m7917n0446o0520p1357
9275A947972p212m3522l5929p1331m8731k1980l7812k4465l1830p2555n7919k1775
9263A472911k3274k6242l9367m7248o9288J8570J6489k3499j6825r420k5266o0815
9251A166726n5957j9399j5102n9116l735p644J8671K8773p1914p6364p6535n8293
9239G70111j6601O3154r52k5049p091j3847r223k2798p5745k5161J6548K5502
9227F78848k4128K5420L6235l6435p1575j0831j4770J6452J0111l03o9306j1041
9215E28677k4893P11M1057k3197k994j4980j9534J6875r641j7770R894K211j0768
9202D75648K2130k6421k5830L0486k8767k2328J2734J1886J9918j4403k6479j8223
$$ y = [2746305, 2659117, 2568831, 2491374, 2376238, 2267124, 2206267, 2178212, 2130295, 2079849, 2019329, 1947972, 1940760, 1897238, 1861309, 1789978, 1741247, 1719267, 1681455, 1656990, 1625160, 1552605, 1494686, 1472911, 1449637, 1423395, 1384028, 1336780, 1267492, 1286062, 1302551, 1279052, 1262227, 1252807, 1227541, 1166726, 1110769, 1091370, 1076268, 1017152, 1013417, 1005773, 1024444, 1053217, 981303, 904939, 828404, 770111, 753510, 816664, 815712, 790663, 783572, 769725, 760502, 737704, 661959, 636798, 653346, 678848, 654720, 680140, 716375, 679940, 608365, 597534, 582764, 599216, 609327, 609024, 539718, 528677, 503784, 504495, 545552, 522355, 519361, 504381, 484847, 501722, 492081, 474311, 484205, 486416, 475648, 497778, 471357, 445527, 476013, 447246, 424918, 437652, 449538, 469456, 455053, 428574, 410351]
9190D10351n565o7579J0444O6342q742q2083o5790K0229R87m095K5677j9217k9659
9177B51300j6199m6247O7081K9550L6037l7385m4583J8983K1581j5329l0874k47
9165B33668j0375O651k5463L378j1528J8668k7943k8550q083N0307O892j0231
9153A97391k9308l5538n7225K3254M0360M816M1662k7950m6445j9221K6915J0743
9141A29454K5022O6517J4553o1618n8022j5046m7781j3589Q516K9342O7086K5576
9129A70010k4946m4164O662J4345M8211J0007l8231k7004m543L690o0065k0809
9117C3163L7026J3235Q947l9255k1426J7543J954K9573N188K466l170M6230M0152
9104A71626m0469n8807L3501M6850m8190l8790L7236L3041K0619m3344l5682m2387
$$ y = [410351, 404786, 337207, 347651, 413993, 405251, 323168, 257378, 277607, 278594, 274499, 300176, 280959, 251300, 235101, 188854, 255935, 285485, 321522, 284137, 239554, 258537, 280118, 264789, 233915, 233668, 223293, 229944, 204481, 207859, 196331, 214999, 187056, 158506, 150423, 200730, 207622, 197391, 168083, 132545, 75320, 98574, 138934, 143750, 185412, 157462, 111017, 91796, 118711, 129454, 154476, 220993, 235546, 173928, 115906, 100860, 53079, 39490, 48006, 77348, 144434, 170010, 145064, 100900, 107562, 121907, 170118, 180125, 141894, 114890, 110347, 114037, 53972, 33163, 70189, 83424, 92371, 53116, 31690, 49233, 51187, 80760, 85948, 88414, 85244, 131474, 171626, 131157, 72350, 105851, 152701, 104511, 65721, 102957, 135998, 156617, 113273, 77591, 35204]
9092C5204K2221l9582J6265M824k6117j3713M4134M708N984n859j490m8633K5861
9079B3807M0232K0911L3431p236P622k0755l2630n2823n933J6323O2614l421p1228
9066A0914r094q358K2153N6033J5317K293j2182M2736M179n9587p588l8746K7602
9053D5672L9664N2732l1134k1050n5512m691K4027j0743m6300J1465l9657j5908
9041e1435O9033L9106k3946j9047J2879O260J6123q130r845M4164K8924J3947
9029A18033k0844J5146k6349l9807O035r259L0480l0925L285K2099k7672p1117
9017c0895M631j7329K7180J2740J4952L3683J0385k2163P04k295l0859J0679L0355
9004D1768P1139n0034l2640k0347l7461l252J9042L9201L9406n794r284j4069
$$ y = [35204, 57425, 17843, 34108, 38932, 12815, -898, 43236, 47944, 53928, 48069, 46579, -2054, 23807, 64039, 84950, 118381, 111145, 118767, 98012, 65382, 12559, 6626, 22949, 85563, 82142, 10914, 1820, -6538, 15615, 71648, 86965, 89258, 77076, 119812, 123991, 64404, 56816, 18070, 45672, 85336, 138068, 106934, 85884, 30372, 25681, 49708, 38965, -7335, 4130, -35527, -51435, 17598, 56704, 32758, 13711, 26590, 32850, 48973, 40843, 30998, 75162, 104086, 118033, 97189, 112335, 85986, 46179, 52214, 42955, 73435, 42510, 45795, 67894, 40222, -30895, -26264, -43593, -16413, -3673, 11279, 44962, 55347, 33184, 33888, 31593, 734, 11413, 41768, 112907, 62873, 30233, 9886, -27575, -30827, -11785, 27416, 66822, 61028, 51744, 37675]
8992C7675k965o608k4795J3182k6301O597l435k6674l6184L0797J8655N1880P547
8979C9371m6911l6063m6753k133J6836K0538P7294M5450j5195l3623k5272M8797
8967D2336L8663K9115K181m2913p3353P422j6982k985j0059M718J3508K4012J7966
8954C3629J1504L121J4662K2779k3229k2575q4056M331L9317M3418O803m8560
8942A144l5850K0769O5771K3252J4091k250K828J1059Q686p854m1857J8131k6960
8929E0960m4585K6710j8887j0585l6141J7092N5920M3418j9325P760o6907k27
8917E203j4053J6418M2491O3802j9057m7615j7765L5336K274j0283L312L6318
8905I6381l1901L5913J9049o8192j04930M5397J9957K0445N3559R2624m39k2813
$$ y = [37675, 34710, 28102, 3307, 16489, -9812, -3215, -6650, -33324, -69508, -38711, -20056, 31824, 39371, -7540, -43603, -90356, -92489, -75653, -55115, 22179, 67629, 52434, 18811, -6461, 42336, 80999, 110114, 112295, 69382, -3971, 3451, -13531, -16516, -26575, -21857, -8349, 15663, 33629, 45133, 48254, 62916, 85695, 62466, 39891, -44165, -39834, -517, 42901, 49704, 1144, -34706, -13937, 51834, 75086, 89177, 86927, 89755, 100814, 109500, 101646, 59789, 77920, 50960, 6375, 33085, 14198, 3613, -32528, -15436, 40484, 83902, 64577, 72337, 5430, 5203, -8850, 7568, 50059, 113861, 94804, 47189, 29424, 64760, 67034, 56751, 60063, 96381, 64480, 100393, 119442, 51250, -53680, -8283, 11674, 32119, 85678, 178302, 177863, 155050]
8893A55050l5559r096k5305k4112J001M4703M1648K186m8353J7653K922L5250
8881A57988J359J0781K6962K0258j4822p5833L2763l987k1354O3811L0869k0360
8869B08435k4629M1396K9193J8322O8844N2990n650j527Q7936P249j5810Q2536
8857E49285J53172K00651K75348L93993N93693R81984J584022K246934K190476
8848I169558J009174p74864j810067j826044j368389r29074o45125m13082l31429
8839B080658k28089j40599j23614j26933j13851q4475o4770o1001k0750k2672
8829A093904p5482l7352j07760o1374j154k2864m867m0416m8479j8825K1846k2104
8817F75073o2893n3701J5701l11l4680n9298l2481j075K0272K724l6121l9225
$$ y = [155050, 119491, 110395, 85090, 60978, 61979, 106682, 148330, 150516, 102163, 119816, 122738, 157988, 159347, 170128, 197090, 217348, 202526, 126693, 159456, 155469, 134115, 197926, 228795, 208435, 183806, 225202, 254395, 272717, 341561, 394551, 388901, 387374, 475310, 482559, 466749, 549285, 702457, 903108, 1178456, 1572449, 2166142, 3148126, 4732148, 6979082, 9169558, 10178732, 9403868, 7593801, 5767757, 4399368, 3470294, 2825169, 2412087, 2080658, 1852569, 1711970, 1588356, 1461423, 1347572, 1263097, 1198327, 1137326, 1116576, 1093904, 1018422, 981070, 873310, 811936, 810782, 787918, 783051, 742635, 694156, 675331, 697177, 675073, 612180, 558479, 574180, 573869, 539189, 479891, 447410, 446335, 466607, 469331, 433210, 393985]
8805C93985m9505m718M1104r018o0244j0889N4106j1188L9219K1166k1773l9840
8793C42405k8671l1808Q891l675J3713j6390O85J74k0009l7214O484L2725R406
8780B76716r219K248L556L5137m9504j7860L0478K0031K3204n3398q1868K9942
8768B09463K986j0286M501l0569j1985o4714j5060j5016j2465K9106N8104j3134
8756A30931K3605K0939J133k0950m6285j6100J0780N426l9799K1691M8827k1973
8744A18225K5115J1358k457K1119l3539m9914l343L922n0713k1970Q355j5586
8732A0572J3559k4578o813L2243P9497m682q997r413l5536m8149O17J0140j5778
8719g318J4410K6610Q955L3300p721l3085m9553M2662k1243k2449L1218o6373
$$ y = [393985, 344480, 339762, 380866, 371848, 311604, 300715, 354821, 343633, 382852, 404018, 382245, 342405, 313734, 281926, 290817, 287142, 300855, 284465, 285150, 285324, 265315, 228101, 234585, 267310, 276716, 267497, 269745, 273301, 308438, 258934, 241074, 271552, 291583, 314787, 261389, 179521, 209463, 212449, 202163, 206664, 176095, 164110, 99396, 84336, 69320, 56855, 85961, 144065, 130931, 154536, 175475, 176608, 155658, 109373, 93273, 104053, 109479, 69680, 91371, 140198, 118225, 143340, 154698, 152241, 173360, 139821, 89907, 86564, 90486, 39773, 17803, 26158, 10572, 24131, -447, -7260, 24983, 104480, 99798, 90801, 81388, 45852, -2297, -1680, 8460, -7318, 7092, 33702, 42657, 75957, 68236, 35151, -14402, 28260, 7017, -15432, 15786, -50587]
8707e0587l6163M9525K5596P771K2401p2452j8687K1319Q2560j619n1342j1728
8695c3406j0198m9411J3001O1872J4499p441l129N9214L239k3728L3180p708n8627
8682h643j4356q667l8615J2019Q6052L2761K3268k0951R624J1240J078n9337n299
8669B0174O5550J3834k2577l5123J4808N2504M4595l7045j22558n9617J7667j2032
8657e9820M6441k9462k8757N0814j9302J9951k4995R627N8073J8886M2965K1251
8645A05672k562J6056j6075o8858k096j9151N316j3346k8043n169M3180M861l4603
8632a4818Q24P9570L3882o0011l2810K0376r858j5793k6688N4960K3733k1571
8620C1796J5444K6005p3010n0276L4344L4201o000k2865L3685L7010r942J4406
$$ y = [-50587, -86750, -37225, -11629, -3858, 18543, -53909, -72596, -51277, 31283, 29664, -21678, -33406, -43604, -93015, -80014, -18142, -3643, -11084, -14213, 45001, 48240, 24512, 57692, 49984, -8643, -22999, -31666, -70281, -58262, 27790, 60551, 83819, 62868, 72492, 83732, 84810, 25473, 20174, 85724, 99558, 76981, 41858, 56666, 109170, 153765, 116720, -5838, -65455, -47788, -59820, -13379, -42841, -71598, -20784, -40086, -20135, -45130, -35503, 22570, 41456, 84421, 105672, 103110, 119166, 103091, 34233, 32137, 12986, 18302, 4956, -23087, -28256, 14924, 19785, -14818, -13994, 65576, 99458, 39447, 6637, 27013, 17155, 1362, -25326, 29634, 53367, 31796, 47240, 73245, 235, -50041, -15697, 18504, 12504, -10361, 23324, 60334, 50392, 64798]
8608F4798J3757j0626m324m121k250K0765j669k7737k3988r2701l0565N6459j4479
8595e6681l523N5020K497J2708n22m2715M695L8035L905j8964J3157O7186k8149
8582D6649k4524l401p814N333R899n0243L914L7609J0797l9610k9911L827j2907
8569e0382L2602J3470j5488m3089M795M1720L6774Q3787K4011n1825l7006m2176
8557b807j6521M3031L7391J0120j9193J63m677J7556M081k4825j5919O498r258
8544B5640j2850R336k0583n3155m091M1614K6320j8458m3787j409J7821O539p575
8531c4638K4526n0873J3471P4402J1405O817L0475j4296j0562k2360r099k4885
8519e617r9033o850k3893J5081K1637q685L6138O7220J1237j3425K2779J7963
$$ y = [64798, 78555, 67929, 63605, 59484, 57234, 77999, 76330, 48593, 24605, -68096, -98661, -42202, -56681, -60204, -5184, -2687, 10021, 9499, -33216, -28521, 9514, 13419, -5545, 7612, 74798, 46649, 22125, 18724, 10910, 16243, 26142, -24101, -20187, 17422, 28219, -11391, -41302, -37475, -50382, -17780, -4310, -19798, -62887, -58092, -16372, 20402, 104189, 128200, 76375, 39369, -2807, -19328, 23703, 61094, 71214, 52021, 52184, 47507, 65063, 69144, 44319, 28400, 34898, 25640, 12790, 22126, 1543, -51612, -55703, -14089, 12231, -6227, -50014, -51423, -33602, -27063, -34638, -10112, -60985, -47514, 26888, 38293, 45110, 75585, 61289, 50727, 28367, 19268, -5617, -104650, -111500, -135393, -120312, -98675, -107360, -71222, -4002, 7235, -6190, 16589, 34552]
8507C4552M2118O571j9097r2010K1730K9138j2591R348K8140m4197k7325j0490
8495c4113J8713K8879M4392j5152p903j3322K0578k053m6394k4916J982Q790j6554
8482c7073L7664k5474K81P760M337M0514k9336j4372l8302Q181K0680j2644p532
8469d5316k0521J8174K1472l905J1419k3831k331K6112K0063k935m5582l1926
8457g9107L0168J4329J6000N2483J089m0745m367m7896J2399J3054m6372K2982
8445e5983N4491L2533l0606j8230O3435L2601l6154l6194O517k804K0749k8193
8433B162l0720M7275l5372J0458k9989R1198P0643N403k2855n792o3898k3230
8421A5283J1007J6578m5522l2694j7723J1427M042M2566P077L6998j7175o678
$$ y = [34552, 76670, 83241, 64144, -27866, -6136, 23002, 10411, 19759, 47899, 3702, -23623, -34113, -15400, 13479, 57871, 42719, 34816, 21494, 42072, 40019, -6375, -31291, -29309, -20519, -37073, 591, -24883, -24602, -16842, -12505, 28009, -1327, -15699, -54001, -45820, -25140, -37784, -45316, -65837, -47663, -26191, -30096, -18677, -42508, -44839, -18727, 1336, -1599, -47181, -79107, -48939, -34610, -18610, 33873, 34962, -5783, -10150, -58046, -45647, -32593, -78965, -55983, -1492, 31041, 435, -17795, 45640, 78241, 42087, 5893, 12410, 9606, 30355, 2162, -28558, 18717, -16655, -6197, -36186, 55012, 125655, 131058, 108203, 102411, 38513, 15283, 26290, 42868, -2654, -35348, -53071, -41644, -37602, 4964, 12041, 49039, 31864, 25186]
8409B5186K1895K9515m6406m5874j6606r679M8039k4883j0953L9713J5409Q0148
8397A05504j158o6395r5882Q450M2917L4749l745m4426k2122J8704j5448J4153
8385b4699M9034p017k853j2252J5460J0008l594m6563k6475L6643q147L4941L8431
8372E2917l8412k0491N230K4453K8907m1117m2186L991K0958l4325k698J8737
8360b4036R7379J1051j1928l0203K1172L2599l0210n0384O022k202J5185j5040
8348A9405m300O516r272M1229K4025k2865K7795n6656n4669l7179p197O658J0447
8335e6063m007k0930k1992M2704J8467K449j8439J928K9524P6626m95k4280N989
8322C1481m6231K5502R295j04749k6429N8161M6357J9961j5491m4746L7453j0082
$$ y = [25186, 47081, 76596, 30190, -15684, -32290, -41969, 6070, -18813, -29766, 9947, 25356, 105504, 104346, 37951, -57931, -49481, -6564, 28185, 24440, -19986, -42108, -23404, -38852, -24699, 24335, 17318, 14465, 2213, 17673, 27681, 24087, -22476, -48951, -12308, -20455, 14486, 52917, 14505, -5986, -756, 23697, 52604, 11487, -30699, -26708, -5750, -40075, -42773, -24036, 73343, 84394, 72466, 42263, 63435, 96034, 65824, 15440, 21462, 19260, 34445, 19405, 15105, 21621, 12349, 53578, 77603, 54738, 82533, 25877, -28792, -65971, -73168, -66510, -56063, -60070, -81000, -102992, -60288, -41821, -39372, -57811, -55883, -26359, 50267, 49772, 25492, 31481, -14750, 10752, 20047, -84702, -111131, -52970, -6613, 13348, -2143, -46889, -9436, -19518]
8310a9518P406J4700n580l3264L577k435P1620O4324K615m8895n8885k3374J3885
8297a3824j4769l3288L5957m604l6739k1511P233N5235R2588k1712p8492J6360
8285a7566K6432K9710M5865j4916l1379p485k0130k2506l3277p012Q735L3284
8273a0245j424M663m0544j6875R337m65q029k4061K4597j000Q780J5414l2284
8260g2136k5738J1299M2618O1855k4489J982q083j8854l5562j7961K7352k0898
8248g8615J413j6731k3023L511N7309L2138N9423R816m4012M6396k7102N236R26
8235B6685r4225l6977K5241N8826Q9218l7683k3559n444P951J6249k1852m7376
8223d2946n1530L7462M4755O2577p6637o2538O758L5402Q1514M8921l0578m2558
$$ y = [-19518, -12112, 2588, -2992, -36256, -32679, -35114, 36506, 100830, 103445, 54550, -4335, -27709, -13824, -28593, -61881, -25924, -30528, -67267, -88778, -81545, -26310, 66278, 44566, -33926, -17566, 8866, 38576, 84441, 69525, 38146, 30661, 10531, -11975, -45252, -52264, -43529, -10245, -11669, -7006, -47550, -64425, -55088, -55553, -63582, -87643, -63046, -64046, -55266, -39852, -72136, -97874, -86575, -43957, 17898, -6591, -4609, -12692, -31546, -67108, -85069, -57717, -78615, -77202, -93933, -116956, -113445, -56136, -23998, 35425, 45241, 1229, 47625, 20523, 25759, 26685, -67540, -104517, -79276, -20450, 68768, 31085, 7526, 2082, 10033, 26282, 4430, -42946, -94476, -57014, -12259, 50318, -26319, -88857, -82099, -46697, 34817, 83738, 53160, 10602]
8211A0602K0269K8125R136q7627j7008r05m7216l4146J9295M3160L2427J3613
8199a0275Q302k5186j0887M6262j1127J7980m836k1015k0669m0882L5432M5814
8187H913J079l0856j8562l2951j6037L2316k8643q674O5043J3185m1970N6385
8175g72N1162J4229k3539m1008n4416m4565J8388M2235o384j2857O1659o6810
8163f2678K2689M5534l4433j9322L8009J0127k6254j4587J0682K6727K8343L1281
8151E6118l2287Q483K0556m0953j0874K2444k5736R5L6398J419j8430n3295n5363
8138i1425j75P615L464K1070P0663K3840l6134k9094p453J384l6578l2940K7235
8125g8528Q1902M1233P726m3308m2673p6559k557N3043j6477M615O0258Q118J7839
$$ y = [10602, 30871, 58996, 68132, -19495, -36503, -37408, -84624, -118770, -99475, -56315, -23888, -10275, -1973, -27159, -38046, 8216, -2911, 15069, 10233, -10782, -31451, -72333, -36901, 8913, 9992, -20864, -39426, -72377, -88414, -56098, -84741, -93415, -28372, -15187, -57157, -772, 50390, 64619, 41080, 72, -54344, -98909, -80521, -38286, -44670, -57527, 4132, -62678, -39989, 5545, -28888, -48210, -10201, -74, -26328, -40915, -30233, -3506, 24837, 56118, 23831, 32314, 52870, 11917, 1043, 23487, -2249, -2154, 34244, 35663, 17233, -36062, -91425, -91600, -83985, -80521, -59451, 11212, 35052, -1082, -30176, -37629, -36245, -72823, -105763, -78528, 3374, 44607, 52333, 9025, -33648, -110207, -112764, -59721, -76198, -71583, -11325, -3207, 14632]
8112A4632j2040n1872j4071J9312L7482k3210l5934J8017p217M5909K4363J8724
8100C4095L5609O868r135K496m2994P217k7114m2143j1927L607O580l8470N0594
8087b4717N4963J6341j6730j8622n8013K7616O4957N021m6466n4762k1370L9014
8075c2768r921j3870K4929M6896o9413L2378J6278L5638j8295k8785k7703p53
8063d5389M6145O68j7804J5233j8149q711j3520j9486J110J3304M651Q2963M1253
8050H2268K8646n1010n8637l8361k8154p849J1710K9894j1819O665r283k1491
8038f7421o333N0871K2429O5243N526M554m6876n022N8666n443l0370k6604L1586
8025E0806R335j3762O290j1790k3611J6368J2234P011k8725l0839m3557o994P660
$$ y = [14632, 2592, -49280, -63351, -44039, -6557, -29767, -65701, -47684, -54901, -8992, 15371, 34095, 69704, 76572, 67437, 69933, 26939, 34156, 7042, -35101, -47028, -43421, -36841, -75311, -24717, 30246, 46587, 29857, 11235, -46778, -19162, 45795, 50816, 4350, -50412, -71782, -32768, -42689, -56559, -31630, 15266, -54147, -21769, -5491, 30147, 11852, -16933, -44636, -45389, 756, 1424, -16380, -1147, -19296, -28007, -41527, -61013, -59903, -46599, -41948, 41015, 82268, 110914, 59904, 1267, -37094, -65248, -73097, -61387, -31493, -43312, -36647, -45930, -67421, -73754, -22883, -454, 64789, 70315, 74869, 27993, 22971, 81637, 76194, 45824, 19220, 50806, 60141, 46379, 52669, 40879, 17268, 33636, 45870, 52881, 24156, -6683, -50240, -57234, -49574]
8012d9574j4108K6185M882r346k0487q132J0988J5904l2931k6740L8006j6392
8000h1745m538L2415R6493N5251m9010J951m0315j0521O3899J1409j73o3172l7326
7987b5382Q3009L5504M45k2653L059j9736m222N924k737k7850p866m0059n0853
7974g3417k0655l221L7494N6561k9678K1401P0235k8256J9289O1942K8652N352
7962A45699m5643j372k4394o260k6794l9502k1918J9996J7969J2491m16m9138
7950a9282j146M9775K0676n3998J5464N1147J6240r684L805k8663j3769j0589
7938A9976m333j624J054j4128K2148o0292k5290k3840M8840K8382k9028l8825
7926g6960j2973L7134K3803j637J6199J4802l953j2324K8116l0294J4648L1747
$$ y = [-49574, -63682, -37497, -32615, -41961, -62448, -70580, -59592, -43688, -76619, -103359, -65353, -81745, -86283, -53868, 42625, 97876, 48866, 50817, 10502, -19, 63880, 75289, 75116, 11944, -25382, 57627, 93131, 93576, 70923, 73982, 54246, 50024, 55948, 53211, 25361, 17495, -22564, -73417, -94072, -97293, -59799, -3238, -32916, -11515, 58720, 30464, 49753, 111695, 140347, 145699, 100056, 98684, 74290, 68030, 41236, 1734, -20184, -188, 17781, 30272, 29856, -19282, -20428, 29347, 50023, -3975, 11489, 62636, 78876, 69192, 72997, 44334, 30565, 19976, 15643, 14019, 15073, 945, 23093, -37199, -62489, -86329, -37489, -9107, -38135, -76960, -89933, -52799, -28996, -30633, -14434, 368, -3585, -15909, 12207, -18087, -3439, 28308]
7914B8308k8513l5235L3670N1327j2992k7926k6538k0268J4862N2527o0226n4677
7902h5681O8935K2577l0054k2235k3087M837M2185M5807q80n238J53k4005L9437
7889C2751N9227K0603k4157o923l6424k1343j1066L7127k040l0716m4641R557
7877a8045L6953J5726K3489R033k5305l367j4636J7202k7787K6213N5201k4020
7865G0657k2160o3555l217j5032j3620O6976j7405o536n5202N348K5834j5558
7853d3470P671L4036j2083j1780P119j9806J5499k8479q531P511l753m287m1582
7840a01935j9834J8941N5370R1698P567J9121j2688j8441m2543j3579K4891R352
7828A7920M5664L341k7057j3355n4497L37J5410j4624Q371k1086J7093N1390q867
$$ y = [28308, -205, -35440, -1770, 49557, 36565, 8639, -17899, -38167, -23305, 29222, -31004, -85681, -16746, 5831, -24223, -46458, -69545, -64708, -22523, 23284, 22404, 17166, 17319, -6686, 32751, 91978, 112581, 88424, 81501, 45077, 23734, 12668, 49795, 47755, 17039, -27602, -18045, 18908, 34634, 58123, 67156, 41851, 38484, 23848, 41050, 13263, 39476, 94677, 70657, 48497, -15058, -18275, -33307, -46927, 20049, 2644, -3892, -59094, -53746, -27912, -43470, -35799, -1763, -13846, -25626, -18507, -38313, -22814, -51293, -59824, -52313, -56066, -60353, -101935, -121769, -102828, -47458, 44240, 51807, 70928, 58240, 39799, -2744, -16323, 8568, 17920, 63584, 66925, 39868, 26513, -27984, -27647, -12237, -26861, -18490, -39576, -22483, 28907, 20040]
7815B0040j288j4276J1645J9917p433k5469j3817K6074j1764K6114L4982l3184
7803C1541o758n548m3775m3070K070N0370k9332l114J0223r050J8472j4556J6755
7790b5772O851M0766N4301O066L8748o0914p476L1480J6530j3984p9914m3612
7778c6930N3305m436J7613M9371j218J6894r1445K45J4888K4499Q994j8775n3056
7765b0051k9157j3163P5749N8635m7281l5933M2231L4035K0112l0947p0483J0132
7753f121n352m3109M4593M785J2947k7604N434O2618p674j5310k5050l6776J5161
7740b1458L1734k762M2199J8870k8264J1387L0863M201n6734l4897j9998J2824
7728a2035k4690r7179j9720M6215Q7972l0883L955j2621j623K1217K3205l4727
$$ y = [20040, 18752, 4476, 16121, 36038, 28605, 3136, -10681, 15393, 3629, 29743, 64725, 31541, 24783, 19235, -24540, -67610, -65540, -15170, -44502, -47616, -37393, -46443, -27971, -42527, -25772, -18921, 21845, 76146, 82212, 120960, 60046, 52570, 84050, 100580, 86596, 6682, -36930, 16375, 11939, 29552, 78923, 77705, 94599, 3154, 3399, 18287, 42786, 51780, 33005, -20051, -49208, -62371, 13378, 72013, 24732, -11201, 31030, 65065, 85177, 54230, -16253, -6121, -11473, -54582, -9989, -5204, 7743, -19861, -14427, 48191, 40517, 25207, 157, -36619, -21458, 10276, 7514, 49713, 68583, 40319, 51706, 82569, 86770, 30036, -4861, -24859, -12035, -36725, -133904, -153624, -107409, -19437, -50320, -46365, -58986, -60609, -39392, -16187, -50914]
7716e0914M1936L2108L5073j6264j7333J4002j7180o7486L410L3102j148j7674
7704b8368p7562J3479M8527k5100L8961j8491K8241N0421K6450m3625k6783j0114
7692b3964m9479k4833J9376K0972j0653k3719p186M6304R452j1226o2047o940
7680a23943P0077M8018J7836n0670o3860L9918O5753j1024k6745L6184J7589n1795
7668c2662o6345L0182M7014k30P678J8686O999k9276n2405M0979O2937M429k2527
7655A5459m7463M972j462K2609j1024j1101J739O178J3100n6974l0052J9785O4813
7642i421m4264J1740J5695k1586k7150l3108k0867O1740L6825L7555n366o2281
7630f0488l1205J9877L6242K6663L2074l9347n393k576K1366L1223J0541j16j627
$$ y = [-50914, -8978, 23130, 58203, 41939, 24606, 38608, 21428, -46058, -42648, -9546, -10694, -28368, -105930, -92451, -43924, -69024, -30063, -48554, -20313, 30108, 56558, 12933, -13850, -23964, -73443, -98276, -78900, -57928, -68581, -92300, -99486, -53182, -43730, -54956, -117003, -123943, -53866, -5848, 11988, -38682, -102542, -62624, 3129, -7895, -34640, 1544, 19133, -32662, -99007, -68825, -21811, -22041, -14363, 4323, 11322, -17954, -70359, -29380, 33557, 37986, 15459, -32004, -27032, -28494, -5885, -16909, -28010, -26271, -20093, -6993, -63967, -94019, -74234, -9421, -53685, -41945, -26250, -47836, -74986, -108094, -128961, -67221, -30396, 7159, 1793, -60488, -91693, -71816, -35574, -8911, 23163, -16184, -21577, -24153, -2787, 28436, 38977, 38861, 37234]
7617C7234O586j4169o4516n1590J0089n193K5251l1373O6404N7456j1218k8026
7605c065l2413j0937k0280j21l7581L1493L7679o9890P535N8136J8457j9484J0588
7592b9883j6903K3746R2021K7444n7258n9427M4083l241m445j2647k5559q159
7580c0228j204L823J9411l9680J1219M3792L7264L0796k9821n3117j6507m1539
7568f5791r226K7845M0175j0254k6109K0587O720k7365j6891K8352J3658K0068
7556A769K2537k1295K6335o017L4960N8196j0190n1950J5074j5501l3630k5908
7544e620j5165K1773o191R571j6554J3022K5488K7169m921m3619n7446j9194K6219
7531d5468L0501j610j5300K1265m033p37Q633l7068L6151M508m2332L0436k1086
$$ y = [37234, 43820, 29651, -34865, -86455, -76366, -81559, -56308, -87681, -21277, 36179, 24961, -3065, -35478, -46415, -66695, -66816, -104397, -72904, -35225, -105115, -97580, -39444, -20987, -40471, -29883, -46786, -23040, 68981, 96425, 39167, -20260, 23823, 20582, 16137, 3490, -22069, -30228, -31432, -27609, -8198, -47878, -36659, 7133, 44397, 75193, 45372, -7745, -24252, -65791, -75017, -47172, -6997, -17251, -43360, -22773, -16053, -43418, -60309, -31957, -18299, 1769, 24306, 3011, 29346, 23329, 58289, 116485, 106295, 54345, 69419, 53918, 20288, -5620, -20785, 988, -5203, 4368, -12186, 836, 26324, 53493, 48572, 4953, -52493, -71687, -45468, -14967, -16577, -31877, -10612, -14645, -15382, -6749, -43817, -7666, -3158, -45490, -15054, -36140]
7518c6140k9017P828m5319P3313K9743j1007k6372K3836n2989J8342L9104m4691
7506e3369J0192L9548P432j8749j2007r186k8036Q119n525m0512L3939M4722M1820
7493A8388q8096k2518J7574R955p276q848L7298J4060p300l6330j6497r115j7607
7480a16312n9539O7839N2352M6900L8460k129m0420L6979O9714J1294l2584p687
7468F4867J2836n6257j2358Q6585n504J2908L352n8907j1877R678j2172o2333
7456b9182M4931N5204m7139m5579L8358j9721m6079l7093K866R6937Q1749K080
7444I7332m6886p7347j8821K8601K4933O864L5046j3829k4227n0474o455R523
7432c5740M9389j6031P474j4534j7967j3734O5526J5905k7655L822j9406K2426
$$ y = [-36140, -65157, -57329, -102648, -29335, 408, -10599, -36971, -13135, -66124, -47782, -8678, -53369, -43177, -3629, 3803, -14946, -26953, -36139, -64175, -56056, -61581, -102093, -68154, -23432, 18388, -69708, -92226, -74652, -64697, -71973, -80821, -43523, -29463, -36763, -73093, -89590, -98705, -116312, -175851, -108012, -55660, -8760, 29700, 27571, -12849, 24130, 93844, 105138, 72554, 64867, 77703, 21446, 9088, 95673, 90169, 103077, 106429, 47522, 35645, 45323, 33151, -29182, 15749, 70953, 23814, -21765, 16593, -3128, -49207, -86300, -83434, 13503, 95252, 97332, 50446, -26901, -45722, -17121, 7812, 14676, 49722, 35893, 11666, -38808, -45263, -35740, 13649, -2382, 5092, -9442, -27409, -41143, 24383, 40288, 12633, 16455, -2951, 19475]
7420A9475K2360J5394j4027j18429L954O4707J1615j2204R590M4228M0929m4561
7408D3031k9052J2084N605R831j4933M9507k9625p9195l2556O409L3511k139n3474
7395h0996J4274P4732j0537n4378m7049J5565L5637M895M6406R5266k700j3065
7383G8050l5552l3606M7015L2932l6062k1505J562J1784O7030J6012k035o5326
7371F0299n4907m7245J856K4649J1971k3010j9420K2008K006j3883M5349k2743
7359a3070r532J3167O146l1628q852r039m75M378M6536J0581N3693M9899O013
7346A17817m6404m8961L1125m3293L448L8825J8220K8713J6091p3865m2684m3191
7334d4159K2590j4822q5373J1256J1509K0892L7530K8457J2853J6693J2343l9314
$$ y = [19475, 41835, 57229, 43202, -75227, -71273, -6566, 5049, -7155, 2435, 46663, 87592, 43031, 13979, 26063, 31668, 41499, 26566, 76073, 46448, -32747, -65303, -58894, -25383, -27522, -80996, -66722, 8010, -2527, -56905, -103954, -88389, -52752, -47857, -1451, 93815, 91115, 78050, 42498, 8892, 55907, 88839, 52777, 31272, 32834, 44618, 111648, 127660, 125625, 60299, 5392, -41853, -39997, -15348, -3377, -26387, -45807, -23799, -21793, -35676, 9673, -13070, -22602, -9435, -3289, -34917, -43769, -52808, -53283, -48905, -2369, 8212, 61905, 111804, 117817, 71413, 22452, 53577, 10284, 13732, 52557, 70777, 99490, 115581, 41716, -968, -44159, -21569, -36391, -121764, -110508, -98999, -78107, -40577, -12120, 733, 17426, 29769, -9545]
7322i545k0327K7831J5626P581J447J0094j6911J2310N3222M48l4261l0276J6078
7309C3317n608J2480M0991j0797m1644l2721R281N0496M2080j3440o2153m4274
7297b1992j3441N823l0968j6229J8232J6825j5417Q500N1976l5931r873k8265
7285g0760n766P9975L1110m5370M0862m7595o9268M2041P4986J9354l6381o3204
7273e0016l3982J9817R8272J9314k3960j2128l7512K1428K9250j9082m750k7054
7261b0403J5849R43L9441K1551l3591j0259k120k3748J4794M6273P388Q314m4367
7248B0065n4409l7558J7741M5639k4116n1219K066J2487N0481O353j7430J8932
7236a0968P284l1523O145M4263K436k0275m1463J324k2393m237J1407M351M8427
$$ y = [-9545, -29872, -2041, 13585, 21166, 22613, 32707, 15796, 28106, 81328, 81776, 47515, 17239, 33317, 27709, 40189, 81180, 70383, 28739, -3982, 5299, 55795, 97875, 84435, 22282, -21992, -35433, -29610, -60578, -76807, -58575, -41750, -57167, -48667, 3309, -32622, -42495, -70760, -76526, 3449, 34559, -10811, 30051, -17544, -86812, -44771, 30215, 49569, 13188, -50016, -83998, -64181, 34091, 53405, 29445, 17317, -20195, 1233, 30483, 11401, 6651, -20403, -4554, -3611, 35830, 57381, 23790, 13531, 11411, -12337, 2457, 48730, 56118, 64432, 20065, -34344, -71902, -54161, -8522, -32638, -83857, -81791, -69304, -18823, -12470, -29900, -10968, -3684, -35207, -29062, 15201, 17637, -2638, -44101, -42777, -65170, -69407, -58000, -53649, -5222]
7223e222r250L3213m5427l752j2760k3826Q1185M6799j1287l1125P972k1290k5366
7210b0136K575j0112K8930J9796l9740l1790L3812K584J025o580L7492L4122m4634
7197G344j2069R798l4015K3460j237R389K9734K5027l2306q647M303k6329k0004
7184b5552k7833N0346L7065n77J5815M374J2029j8668k4825O666J3858L4924k3242
7171E4380o9997O119J3592J791K4380k9015l2212K322n4177J1757K2406N4253
7159E599J0979k1110R355K9178k7562k2812J3842K6725J1696n3005m3853M3795
7147a7173p498n907l003j9117j9092N9368j858Q075p376k2137J5427o255K1068
7134e478j6258J6594O4375M1546k7867l6363R805N1214j3619m0266Q933J0007
$$ y = [-5222, -14472, 18741, -26686, -30438, -43198, -67024, 14161, 60960, 49673, 18548, 26520, 5230, -20136, -17561, -27673, 1257, 21053, -18687, -50477, -16665, -14081, -13056, -19636, 17856, 51978, 7344, -4725, 5073, -28942, -5482, -6719, 2670, 32404, 57431, 25125, 16478, 20781, -5548, -25552, -53385, -3039, 34026, 33449, 49264, 53638, 65667, 46999, 22174, 28840, 42698, 77622, 54380, -15617, -9498, 4094, 5885, 30265, 1250, -30962, -28640, -82817, -71060, -48654, 5599, 16578, -4532, 4823, 34001, 6439, -16373, -2531, 24194, 35890, -17115, -60968, -17173, -24671, -30578, -33581, -52698, -71790, -12422, -14280, -6205, -13581, -35718, -20291, -26546, -5478, -21736, -5142, 59233, 100779, 72912, 36549, 46354, 97568, 83949, 43683, 52616, 62623]
7122F2623j5686l4832l866M0371K3134o1908r712Q146K0839l44J6091m7806k8513
7109c1463j0787M436K4730p239O4198O986k3904o648M1426J6231m2437p5058o368
7096d5897J7555m149j9167o683J5833L4813j7939L9805l6347q1789L20M7180r303
7083f5768m5596M4592J9492l926r130M5800O1898M7467J6567l5354l9989p4929
7071c8876J1575J9978j9582K9632N2048j3499M004j1450M69n041j3501j8901J0425
7058G281R852j0464K1263J6260n866o3728j5396M863M2364N3520j4123m2471O099
7045I454J7569m8376l9938j7757M8257L4629K1381L1608Q803k7821l7508P2420
7033G2721j0279l3340q6084m178K9606q042k6935K5793j290J5571J2424J0162
$$ y = [62623, 46937, 12105, 8239, 48610, 71744, 9836, 124, 8270, 29109, 28765, 44856, -2950, -31463, -42250, -37814, -13084, -20323, 43875, 50861, 26957, 20309, 61735, 77966, 35529, -39529, -45897, -28342, -32491, -51658, -58341, -42508, -7695, -25634, 14171, -22176, -103965, -103645, -56465, -65768, -111364, -66772, -47280, -51206, -60336, -14536, 47362, 94829, 111396, 76042, 36053, -38876, -27301, -7323, -26905, 2727, 54775, 41276, 45280, 33830, 34299, 29258, 15757, -3144, 7281, 17133, 6669, 27932, 44192, 38326, -25402, -40798, -35935, 6429, 59949, 45826, 3355, 9454, 27023, -21353, -61291, -79048, -30791, 3838, 25219, 56827, 65630, 37809, 301, 72721, 62442, 29102, -56982, -61160, -31554, -39596, -66531, -40738, -42028, -26457, -14033, -3871]
7021c871l2854o4181j56J4149Q2981J5894r863M0018M295k4395n8522l81Q340
7008b8546J7577O4323l4981J0229R358l696L4208k8221l2425l8548o147N1198
6996A4329L6977J7076l2953l8102m5296k6019K4425R428k7917q363P3277K6800
6984B3662P217o606k6039p5926k0669N4040R7666p774l4600l4380K892J1355l7910
6971d7072j6661L2316M1663n1240n6133J2411r570M7253K2934Q8875P5094p5458
6959F4412o5590J7514K7916k2736j9786l2525J8511M7459m513n9974J9872K8519
6947A9079l7413k7416J878n1395J2983k5746l1284K1183J414L1674J1497O215
6935f7331n5812L0153K5261O6493K1035N468J0847J1418k1913K8053J2451o1124
$$ y = [-3871, -36725, -100906, -101062, -86913, -3932, 11962, 2099, 42117, 46412, 22017, -36505, -36886, -28546, -10969, 53354, 18373, 28602, 37960, 34264, 68472, 40251, 7826, -30722, -36869, 14329, 51306, 68382, 35429, -2673, -47969, -73988, -49563, -40135, -68052, -76415, -3138, 23662, 30879, 24273, -1766, -77692, -98361, -44321, 53345, 45571, 10971, -23409, -20517, -9162, -47072, -63733, -31417, 10246, -40994, -97127, -84716, -94286, -47033, -24099, 64776, 139870, 64412, -1178, 16336, 44252, 21516, 1730, -30795, -12284, 35175, 30662, -29312, -9440, 19079, -18334, -45750, -43872, -95267, -82284, -108030, -139314, -118131, -116717, -85043, -73546, -67331, -123143, -92990, -67729, -1236, 19799, 25267, 36114, 47532, 25619, 53672, 66123, 4999]
6923D999k7111o4513l3712J7045L4003M8794n0904m2457O622Q7717L3199k6546
6911a2864m139m2495q504q642l3977K6438J4509M3698L2054n641J3058j3986J1863
6898A1372Q032p797m473K2639o583J4761j023L7020n554M351j0882K7192l9675
6885D9380p1984M540j7387Q835j7498j5251M600K983O6805m3768o8940n657K2432
6872h0910J7762L3733M9182L9857j5758l5089l6213N975J551N796L3216m1349
6860b2247p7504K2135L9216K5677K6942o407J6818N2756l2189j9062P64M0322
6848F7221k1878p657M551m3210N917p403m317p020R062k3728M9432K0634o0447
6835a8843k4741k5546P0989L0825o4952k2809k9792K8000Q5911K9551K0712m6693
$$ y = [4999, -22112, -86625, -120337, -103292, -69289, -20495, -71399, -113856, -107234, -19517, 13682, -12864, -17003, -59498, -68002, -76644, -110621, -84183, -69674, -25976, 6078, 437, 13495, -491, 11372, 19404, 11607, 7134, 29773, 23190, 37951, 36928, 73948, 68394, 72745, 61863, 89055, 49380, -22604, -18064, -35451, -26616, -44114, -59365, -54765, -51782, 15023, -28745, -97685, -103342, -80910, -63148, -29415, 19767, 59624, 43866, 8777, -27436, -21461, -19910, -14114, 19102, -22247, -99751, -77616, -38400, -12723, 14219, 7812, 24630, 77386, 45197, 26135, 26899, 67221, 45343, 37686, 42237, -973, 4944, -2459, -6776, -13796, -4734, -28462, 20970, 41604, -18843, -43584, -69130, 1859, 32684, -32268, -55077, -84869, -56869, 29042, 58593, 79305, 32612]
6823C2612j2160p632J7472l5356K259K0192j6647j8363J5708j4435L7782L2505
6811E3937P6165M4163o6416k6397N050k3537p141j2565j7192n3331l0152r740
6799f7156M922o451j5807R58N2023J9241J2648N6828q410j8097K321j0400J4777
6786C7397K6130k0047o561P429o7039N526O6914P314m1731L512j8946o5308l9631
6773a05041M3606k6947K4079K3367L3730j1348K470P2427O0549l0873o682J9190
6761I8527m1812j01918K0216K1348N8829O496m2481R941l3513j3551k52j3827
6749c1997l4130k3219L7913N9365J3575M544J3893k8808K5709L2306j04192k9262
6737f4303Q2462J0704k8958j7392O062Q0229M474j3134l4417l2944k3300k287
$$ y = [32612, 20452, 12820, 30292, -5064, -2805, 17387, 740, -17623, -1915, -16350, 21432, 53937, 130102, 174265, 107849, 81452, 86502, 62965, 55824, 43259, 26067, -27264, -57416, -67156, -62234, -68685, -84492, -83534, -31511, -12270, 378, 57206, 48796, 30699, 33020, 22620, 37397, 63527, 43480, 36919, 44348, -22691, -17165, 49749, 57063, 15332, 18844, -102, -65410, -105041, -61435, -88382, -64303, -40936, -7206, -18554, -16084, 56343, 116892, 86019, 79337, 98527, 56715, -45203, -24987, -3639, 55190, 61686, 19205, 29146, -4367, -17918, -18170, -31997, -66127, -89346, -51433, 7932, 21507, 26051, 39944, 11136, 36845, 69151, -35041, -64303, 18159, 28863, -95, -17487, -11425, 68804, 73278, 60144, 25727, -7217, -30517, -32804]
6725c2804l741O446O0669K6285j4723L1006l4970k6419J7891o0780o1586k2618
6713a15344N9284M5537M6489k560N733K0007J9566J4859P507n3674o8401l9161
6701f0158L7095O9461J2574m505j5255j2105R679j1027k2528l989P16j1897Q0674
6688F8735j799l8204l7950K103m0506L4074K8093R054K7139p545L1438K7532m1732
6675F0432q1935l1043L901K371P350j3317J922l171L9103L2095K0576m2710n6790
6662f1216K8325J4896M4442K6451Q783k3019j4908M8862r107k4952p4206n5480
6650i1129J694P247R116M3763k743m9185K3444j7103L5536P6462j0129j0760k0708
6637d495k1182M1372K0719J6971k6133M607O3479L6746p242l768l2500l9228r402
$$ y = [-32804, -36545, -30099, 30570, 56855, 42132, 73138, 38168, 11749, 29640, -31140, -92726, -115344, -56060, -10523, 35966, 33406, 39139, 59146, 78712, 93571, 101078, 47404, -20997, -60158, -23063, 46398, 58972, 54467, 39212, 27107, 36786, 25759, 3231, -758, -42, -11939, 68735, 66936, 28732, -9218, -7115, -47621, -13547, 14546, 23600, 50739, 43194, 74632, 102164, 60432, -21503, -52546, -48645, -46274, -38924, -52241, -50319, -53490, -14387, 17708, 38284, -4426, -61216, -32891, -17995, 26447, 52898, 61681, 38662, 23754, 72616, 63509, 38557, -35649, -91129, -89435, -82188, -73072, -29309, -32052, -81237, -57793, -74896, -39360, 37102, 26973, 16213, -4495, -25677, 15695, 36414, 53385, 27252, 31859, 95338, 132084, 124842, 121074, 88574, 49346, 39944]
6624C9944m7203K0090M3510r628n4945l8074l8264K478Q2581J1268p2413m2221
6612a02877k3757M3362P15O020L9666r127J5869J412J5379j1240o1025N6926R0500
6599F1823R270o0335j6611P978l0343L5818J9327n8332j0242r615M9983N9698
6587E8419j933l4367m937k9908m705n1537j6031j56j6075L2788K1642K5342K5496
6574D038k4971m9516r056Q4664L5538q5150o9719j8400P3241P2952J6198L8657
6562F8476k913j2386l9984l5915l2220J0923K3906L8036Q515J251N934j2961l5597
6549a4935j4194l1347J7236O022m4365o751M0565M2236j9811L6749P2212Q276
6537I1893k7873k0144K6061j7650m690N9066n1108n2299L0622Q831K0035l864
$$ y = [39944, -7259, 12831, 56341, 46713, -8232, -46306, -84570, -82092, 489, 11757, -60656, -102877, -126634, -83272, -82557, -76537, -36871, -45998, -30129, -28717, -13338, -24578, -85603, -28677, 61823, 71093, 10758, -5853, 2125, -28218, 7600, 26927, -31405, -41647, -51262, -1279, 58419, 56486, 22119, 17182, -12726, -17431, -68968, -84999, -85155, -101230, -68442, -46800, -21458, 4038, -20933, -70449, -79505, 5159, 40697, -44453, -114172, -132572, -59331, 13621, 29819, 68476, 65563, 53177, 13193, -22722, -54942, -44019, -20113, 17923, 26438, 27689, 33623, 20662, -14935, -29129, -60476, -43240, -37218, -81583, -88334, -47769, -5533, -25344, 11405, 83617, 91893, 64020, 43876, 69937, 52287, 47597, 106663, 55555, 3256, 33878, 42709, 62744, 58880]
6525E8880m5638k8768k6651M318k8606n4056J2402J21168L1322o7824l1943P5885
6513B0489l8785M874L2418j1004l1937O57n99k5247L0790J3487k2178k5190R478
6500d2747K3747j0344J064j4372j2572M7129j1164M5836L6304n821n1701n8293
6488e2934K2882L3886o111l6048p658L3542J0725Q812k7101j1950K1501J8747
6476H293J451k5643m990j8638l1634J9746M6389O0244n329L1131k1428o2441o1388
6463f4237M7163M6344K1144r3490J9717j3516l2090J1924N3298P261j9561J4277
6451a766J3781k63n6774k0405Q672K2142k1997J9342k4343j0064K5295l3197n388
6438h4965O596O607J8787P948M1537n0206j8177Q0644K7842k7383p1591J6581
$$ y = [58880, 13242, -15526, -42177, -37859, -66465, -120521, -108119, 13049, 44371, -23453, -55396, 20489, -18296, -13422, 18996, 7992, -23945, -23288, -23887, -49134, -18344, -4857, -27035, -52225, -42747, -19000, -29344, -28280, -42652, -55224, -8095, -19259, 26577, 62881, 57060, 5359, -52934, -30052, 3834, -2277, -38325, -45983, -12441, -1716, 7096, -20005, -31955, -10454, 8293, 9744, -15899, -20889, -39527, -71161, -51415, -5026, 55218, 49889, 81020, 59592, -2849, -64237, -17074, 29270, 50414, -43076, -23359, -36875, -68965, -57041, -3743, 3518, -16043, -1766, 12015, 11752, -45022, -65427, -56755, -34613, -56610, -37268, -61611, -71675, -46380, -79577, -84965, -78369, -71762, -52975, -45027, -3490, -53696, -71873, 8771, 36613, 9230, -62361, -45780]
6426d5780n409o1640L7728P6925J048k8654k2420R9364L0030m8367o7256k336
6414c6767r036m7077k2394M1912M3869P9714n0961q7276q339j3854k191M4743
6402f7657L3583k7438l6282J8394J2418n518k0416o546M4511K0805l1580n7450
6390a23176Q766Q7838L0478m4349J0700K3810j2923N709M8714J3215n4707k6126
6378c2051J0648M2007j1837k9784L4705l1177k042j0097o3563J3202N0676K1264
6366h049o4272k7530M0993L2029N7244O5817k8914j4955k6741j8576J5032J0644
6354C2722q6962m6451N2855J565j9844k7223l3890k091J01291M8893J2843l747
6342B9961n2384p0624k338j3258O336N744K6412M0963P545L3037J593j0199k2828
$$ y = [-45780, -51189, -112829, -75101, 1824, 2872, -25782, -48202, 51162, 81192, 32825, -34431, -36767, -45803, -92880, -115274, -73362, -29493, 50221, -740, -88016, -96355, -110209, -112400, -67657, -34074, -61512, -97794, -79400, -66982, -72500, -92916, -99462, -54951, -34146, -65726, -123176, -114410, -26572, 3906, -40443, -29743, -5933, -18856, -13147, 35567, 48782, -5925, -32051, -21403, 20604, 8767, -21017, 13688, -17489, -19531, -29628, -93191, -79989, -29313, -8049, -72321, -99851, -58858, -26829, 30415, 96232, 67318, 52363, 25622, 7046, 22078, 32722, -54240, -100691, -47836, -46271, -66115, -93338, -127228, -129319, -28028, 20865, 33708, 29961, -22423, -93047, -95385, -108643, -102307, -96563, -70151, -29188, -21643, 11394, 12987, 2788, -20040]
6329b0040l5101n3586N265K0783K0670Q570j0994j9919k8853J4879M8375n941
6317e5892l0576k2229N348K6056j8598J2890O1021L9780M050M8204n171l6466
6305B8417J16L2778l1243j0660L5875j2212N9555l3363m8024j241j4670k5712
6293b0384n161N5883k17k4755l9669l8690K3808J0898m0680L7138Q2631l3685
6281G117n2315J1449k5689j5233k5667j1023J0528J07324Q237l8355j8977r039
6269e1643R5095M4845r631o0450l8824k0864j6338k2016k0944J1779L4041K1622
6257c3328m229k494J9093K793l0921k7162l827K9102m80K3127l2632M510j0255
6244f6703l2424P1172m239n5735J04746O2454l9888j3287K0806l8138l7662J6632
$$ y = [-20040, -55141, -108727, -103462, -82679, -62009, -53439, -64433, -84352, -113205, -98326, -49951, -55892, -86468, -108697, -103349, -77293, -95891, -83001, -21980, 17800, 21850, 70054, 64883, 28417, 28533, 61311, 30068, 19408, 55283, 43071, 102626, 69263, 21239, 19998, 5328, -20384, -25545, 30338, 30121, 5366, -34303, -72993, -49185, -38287, -78967, -41829, 40802, 7117, -45198, -33749, -59438, -74671, -100338, -111361, -100833, 6491, 14728, -23627, -42604, -51643, 43452, 88297, 78666, 18216, -20608, -41472, -57810, -79826, -100770, -88991, -54950, -33328, -37557, -40051, -20958, -18165, -49086, -76248, -80075, -50973, -51453, -28326, -60958, -56448, -66703, -99127, -27955, -32194, -87929, 16817, 79271, 39383, 26096, 46902, 8764, -28898, -12266]
6232a2266K7461j030M28k6559j0680K1350k519k2006L8492R686J8519l5107m1633
6219c5864J5940M1405k9487l6893K510j2048j250K4959n161j633Q341L9169L505
6206A3493J1170M2624n65m9627k3736K9628k2580p960K289r178r0223O409N0503
6193d7753l1811q104r631Q98K3389R7230J7888m0765n118M6448L1703J9602k7384
6180F6592L8236J1821l6206J4651m158l8374o5004l7098l8377m0176r727O7246
6168g0574Q2503P6996M1194n2501m0412J3734K9213L6872j7429l99l8826Q670
6156F9041l8221Q284K659J5166m0606n5899j6837L836M2314K1187K1832l9827
6144g071k1591L5513M2960l3804l1200K7156n7686m1021K0486K9809o680M3783
$$ y = [-12266, 15195, 14165, 14593, -11966, -22646, -1296, -3815, -25821, 12671, 22357, 40876, 5769, -35864, -19924, 21481, -8006, -44899, -42389, -54437, -55687, -30728, -35889, -37522, -29181, 9988, 13493, 24663, 67287, 66722, 17095, -6641, 22987, 407, -7553, -5264, -14442, -104665, -98256, -47753, -79564, -87668, -97299, -96401, -73012, 24218, 42106, 1341, -3777, 42671, 74374, 93976, 66592, 104828, 116649, 80443, 95094, 90936, 52562, -12442, -49540, -87917, -128093, -137820, -70574, 11929, 88925, 130119, 77618, 37206, 50940, 80153, 117025, 99596, 99197, 60371, 69041, 30820, 39104, 41763, 56929, 16323, -39576, -56413, -52577, -10263, 10924, 32756, -7071, -28662, 6851, 49811, 16007, -15193, 11963, -45723, -86744, -66258, -36449, -43129, 654]
6132F54M1339K2271j000L3320N055p9440j2942l0647N8016l5428L388L2940K0390
6119E7916k033l754p1220o4234L93N0948J1272K7657O5512j0134j4132m700k1876
6106B1615K8385K3706k6275k0862N929O3399J5812k2408N853m9270l4353q716
6094B815o1358K1550J1144m3735j2087j6769j4932K1286P3449L9338j6624n2049
6082d7972o2293L2042K8736K1989k5422m621K1886M177N2432l3713o1840K2029
6070e2570J4195j505k1494l1280N3993j6965m0051k071q543k4864N7459R5729
6058B2033p5592o7371L2689N7340L9436J3835k0201m0401l3342J2720N0517M8503
6046D0166j21n4675L6430J9594M1353L3031l1954j9126j4119j3616l7697o9058
$$ y = [654, 41993, 64264, 63264, 96584, 101639, 22199, 9257, -21390, 36626, 1198, 4586, 37526, 57916, 55883, 52129, -19091, -83325, -82932, -31984, -20712, 6945, 72457, 62323, 48191, 43491, 21615, 50000, 73706, 47431, 26569, 32498, 95897, 111709, 89301, 95154, 45884, 11531, 2815, -58543, -36993, -25849, -69584, -81671, -98440, -113372, -92086, -18637, 20701, 4077, -47972, -110265, -78223, -49487, -27498, -52920, -57541, -35655, -31478, 20954, -12759, -74599, -52570, -38375, -39880, -61374, -92654, -38661, -55626, -95677, -97748, -106291, -131155, -73696, 22033, -53559, -120930, -88241, -30901, 8535, 22370, 2169, -38232, -71574, -58854, -8337, 40166, 40045, -14630, 21800, 41394, 82747, 115778, 83824, 64698, 50579, 36963, -734, -69792]
6034f9792M6855N8191m091j171K4599l0007l2755n1028n5831O3310K9159J5917
6022f644J067K4264L7915m809r2126p701K9882K2432M0362q58R487M3157M715
6009A01143k4017N289Q85l0131L9964j6616J7502j6421o0613k8220k1943J7719
5997a5459L5l2935M1698J8793K4997N3739j9605m1631m1047o900K4751J4712P636
5984B8784l0335l6081j84K817P055K2600J0275k2409L654K9239M503m2784k0272
5971d3138J7251O7213M9411k0958m3257j1550j2418J3792L3682j0131p3704j2592
5959d6399L848j7995L1m558K66N2323m305o5461k4201M1550L2271r456j0180K2672
5945b9594M8151K6932j9064j0961L659L7318K0250m054K073l8762m7630p2344
$$ y = [-69792, -22937, 35254, 31163, 29992, 54591, 24584, -8171, -59199, -115030, -51720, -22561, -6644, -5577, 18687, 56602, 51793, -40333, -48034, -18152, 4280, 44642, 43784, 53271, 96428, 101143, 77126, 82415, 83300, 53169, 93133, 76517, 94019, 77598, 16985, -11235, -33178, -15459, -15424, -48359, -6661, 12132, 37129, 90868, 71263, 29632, -11415, -18315, 6436, 21148, 28784, -1551, -37632, -37816, -34999, -27944, -5344, 4931, -17478, -13824, 15415, 19918, -22866, -43138, -25887, 41326, 90737, 69779, 26522, 14972, 2554, 16346, 50028, 39897, -33807, -46399, -42551, -60546, -60515, -65073, -64807, -12484, -16789, -82250, -106451, -64901, -32630, -42086, -52266, -29594, 18557, 45489, 26425, 15464, 19123, 56441, 76691, 72637, 74710, 35948, -11682, -84026]
5933h4026j2569k3142j3262j6500o5391K8471r991P711N3018J12472O4527n3360
5921a2042m6198M6100J6073k1347J9401N094o1080R598L6222j8142j1011k9987
5909f7319M5444J2507k9079k0108j6865J5535J1574K410p395M0609L7714K0763
5897D5790L7810k0330p4898n1243K4674J5870L5385J2036k7536j0557J3694J300
5885A995L5559K2964n9446o1041K8456J353k927k731m139N8406J4957j2797L450
5872B4059k6448N12j04573m1894K9854N8408Q1251N976j3367O702K879n6206j0925
5859d3772M0641m2948K9013N9343k5132n540k394L3518Q39m3692k2063K7507m3173
5846c7853Q980j4143m8104J5237j2409j01j2762O6059M3394M2711o737r232L4112
$$ y = [-84026, -96595, -119737, -132999, -149499, -214890, -186419, -196410, -188699, -135681, -23209, 41318, -12042, -58240, -12140, 3933, -17414, 1987, 7081, -53999, -44401, -8179, -26321, -37332, -67319, -21875, -9368, -38447, -58555, -75420, -59885, -48311, -45901, -53296, -12687, 25027, 45790, 83600, 63270, -11628, -62871, -38197, -22327, 13058, 25094, -2442, -12999, 695, 1995, 37554, 60518, 1072, -59969, -31513, -30160, -33087, -35818, -39957, 18449, 33406, 20609, 24059, -2389, -1877, -106450, -148344, -118490, -60082, 21169, 27145, 13778, 20480, 23359, -32847, -43772, -3131, -46079, -17066, 42277, 17145, 11605, 9211, 42729, 43568, -124, -22187, 5320, -37853, -28873, -43016, -91120, -75883, -88292, -88393, -101155, -35096, 8298, 51009, 44272, 35040, 69152]
5833F9152m590J4319n7139m4352n002J0806n2246l4552J9118J162L6736Q0203
5821C3615l5911k4390k175k251n867M3005n2736J8674Q3437J7303l1661J1427
5809E2470l2804k5363k4630l6837K7664M2285M1702J2073l4284p0992l33J8695
5797c0354J2721k5051j4866P433J3701J0637N914j4814k2325L1229K3047l7173
5785c9901j2758J2569O550j766l4101K1901O518L0234L7346P8032K0862o4359
5773F1127p9073j9717L6512O1450K9375j035O830j1675q4202l1519l496q056m1179
5760h4658j0283K4829M3626P516n3547j6807N6005N3031k437n1914K5597l984
5748a3026L6307m0766P65R410M6335M4612k2985n6444R743R479M0801R635J1662
$$ y = [69152, 64562, 78881, 21742, -22610, -27612, -16806, -69052, -103604, -84486, -83324, -46588, 33615, -2296, -26686, -28861, -31112, -36979, 6026, -46710, -28036, 55401, 72704, 41043, 52470, 19666, -5697, -30327, -67164, -39500, 2785, 44487, 56560, 22276, -48716, -49049, -30354, -17633, -42684, -57550, -50117, -36416, -25779, -19865, -34679, -57004, -25775, -2728, -39901, -52659, -40090, -33540, -35306, -69407, -47506, -40988, -10754, 26592, 104624, 125486, 61127, -17946, -37663, -1151, 60299, 89674, 88639, 95469, 83794, -408, -31927, -35423, -43479, -84658, -94941, -70112, -26486, -18970, -72517, -89324, -33319, 19712, 17275, -34639, -9042, -13026, 23281, -17485, -16720, -7310, 39025, 83637, 60652, 4208, 13951, 23430, 64231, 73866, 85528]
5735H5528K9532j4987l8491r1442q307Q6383N7909m3935j4226l6911n2415m746
5723d6108j1086L4761L9169M0200q293m4019l1380m3434Q929O9630P6579j5619
5711F9329m9079m4579J7569N6395J2277J3627J6513J1971l1585l0680m5315J4668
5699A1111K859m177J8238N9604M129n8098L765Q001j0604J7080M788M3328J125
5686A01149m3673O574o8126N893N283j6113j6061l0457J6311L2897j5234n3273
5674g4830K8696L9463R4151j6963q9646M051j2849p2079l9669M2958K5722M6661
5662b4334M4845j9536r442j6690k2246N247P458q217q874k3687r641q894N5551
5649c8460K8534k451m4275J4009m115J0885O2507j530J7356p936J304O205K740
$$ y = [85528, 115060, 100073, 61582, -29860, -38167, 48216, 106125, 62190, 47964, 11053, -41362, -46108, -57194, -22433, 16736, 56936, 48643, 4624, -26756, -70190, -61261, 8369, 84948, 69329, 20250, -24329, -6760, 49635, 61912, 75539, 92052, 104023, 72438, 41758, -3557, 11111, 13970, 9793, 28031, 87635, 91764, 33666, 37431, 45432, 34828, 51908, 56696, 100024, 101149, 57476, 64050, -4076, 1817, 7100, -9013, -25074, -55531, -39220, -6323, -21557, -74830, -46134, -6671, 87480, 70517, -19129, -15078, -27927, -100006, -139675, -96717, -70995, -24334, 20511, 975, -8467, -25157, -47403, -42156, -34698, -42915, -51789, -75476, -85117, -94011, -38460, -9926, -12377, -56652, -42643, -46758, -35873, 26634, 25104, 42460, 34524, 35828, 42033, 44773]
5636D4773q023L432o556l3310J8442j9815o2224q985K1695K2140m943p426j6005
5623e6805J1855O2043K2416Q02j8398n9301n8035J0890J7121j8416P021P038J5617
5610e6152O4065K6918p1039K3887J9135l7343p636O4531R772M2930M719l0575
5598E3212n6079n3708n2516P9347M2596L9987j4329p6945k3479Q403m311K2858
5586c4964n3681K125M4986k024l4081j1188K3207j6128M4179l785NN2995P49j3310
5572i15q524r662k0973M4156N924M0832K8221k6802n3393n6017R731K0861O3096
5559C6535J6347n5919l0090J8327m7080L139l001o827O2427M3141O292j1525j4058
5546A7708k1034l5932l0995n4798q236O1606J21053L0184k6720m9743K1471K8043
$$ y = [44773, 36750, 40182, 33626, 316, 18758, -1057, -63281, -72266, -50571, -28431, -33374, -40800, -56805, -44950, 17093, 39509, 40311, 21913, -37388, -95423, -84533, -67412, -85828, -78807, -71769, -56152, 7913, 34831, -36208, -12321, 6814, -30529, -38165, 26366, 36138, 79068, 83787, 53212, -2867, -56575, -109091, -29744, 12852, 52839, 38510, -38435, -61914, -53511, -57822, -34964, -88645, -86520, -41534, -43558, -77639, -88827, -65620, -81748, -37569, -41354, -41349, 11646, 12395, -915, -9439, -19101, -40074, 4082, 10006, 50838, 79059, 52257, -1136, -57153, -47422, -26561, 36535, 52882, -3037, -33127, -14800, -61880, -58741, -61742, -68569, -6142, 36999, 43291, 31766, 17708, -3326, -39258, -70253, -125051, -133287, -71681, 49372, 79556, 52836, 3093, 24564, 52607]
5534E2607L0556o365m3363m5664J0581m064n2335p490J7271J6211L4190N153n7254
5521d9966m0581M8835O0451K0061K568j4636M3585m708l1507l0600N817m224j0674
5508e579j4271k5967K6686L0793m020M285l9580J6108Q4049l6744q1262P927M655
5495c2920l7704K9422L5408j2188j6582q503J9188j7645K717K1334j8719n3633
5483h9825J2472L1943O7556K8256L1703N22q065l3605n7111M0966K3330o9325
5471b1183l7001K7837M1911P293M432j3765K7688M8288o140m9714K5863r40p68
5458E3801k2030q881n4271L0191k4186J2418n0961P553K7203L8078J3529J6796
5446C9240l9758k597O660k8231l4781L8764L8707o1224n3202J6948J1003m2808
$$ y = [52607, 83163, 76798, 33435, -12229, -1648, -5712, -58047, -65537, -48266, -32055, 2135, 7288, -49966, -90547, -41712, 18739, 38800, 41368, 26732, 70317, 65609, 34102, 3502, 9319, 5095, -5579, -19850, -45817, -19131, 11662, 7642, 11927, -27653, -11545, 72504, 35760, -45502, -37575, -32920, -70624, -41202, -5794, -17982, -34564, -43067, -23879, -41524, -38807, -17473, -36192, -89825, -77353, -45410, 22146, 50402, 82105, 82627, 74562, 40957, -16154, 24812, 48142, -21183, -58184, -30347, 11564, 18857, 23289, 9524, 37212, 85500, 79360, 29646, 55509, 54569, 53801, 31771, 22890, -31381, -1190, -25376, -12958, -63919, -56366, -29163, 8915, 22444, 39240, -518, -3115, 3545, -24686, -59467, -20703, 18004, -43220, -96422, -79474, -68471, -111279]
5434a11279K970J3140L7964M9660N3307j6786l9595k8586j7561k019o638J4266
5422e1157J4913J6928L4142L0499J1765j9542m4404l4349N3778K2725o7785k993
5410c5480J4534k9440l884m3250l3900L7474J705K6674J535O5500P083O351l8245
5397b3343l9182L1591L879o474L7543k6552J0329M7235p180l3142J5377O035m5299
5384b9183n4903J4383L8291J831j6678L0286n722K5399J3581l1742l8281K3886
5372b8852L246j7701l1952K2145j739J8597K2705K8182Q920M110J7635l5026n6410
5359d6140L2036l4422m6802J166R637j5324k393N3551N407M6598k323k0375j865
5346b1249J1283N567K9418l4586k4866L53j6212K7068q163o4757K5401J5119r644
$$ y = [-111279, -108309, -95169, -57205, -7545, 45762, 28976, -10619, -39205, -56766, -58785, -65423, -51157, -36244, -19316, 14826, 45325, 57090, 37548, -6856, -41205, 12573, 35298, -32487, -35480, -20946, -50386, -54270, -97520, -131420, -93946, -92241, -65567, -64032, 1468, 8551, 14902, -23343, -62525, -30934, -27055, -33529, 4014, -22538, -12209, 35026, 27846, -5296, 10081, 16116, -29183, -84086, -69703, -31412, -29581, -46259, -15973, -21695, 3704, 17285, -14457, -52738, -28852, -25606, -43307, -75259, -53114, -54853, -36256, -13551, 14631, 23551, 27661, 45296, 10270, -46140, -14104, -48526, -95328, -94162, -84525, -99849, -102242, -48691, -43284, 3314, 991, -19384, -21249, -9966, -4399, 25019, -9567, -34433, -34080, -50292, -23224, -31387, -96144, -70743, -55624, -65268]
5333f5268L6601j285K1178M0665l9604R496O4769K9814l3775k5406O72j869K7731
5320F3719K0190k3192q912J8205R829j9699o704k6346O868M1876j2388l1190j0272
5307B1984j5414l3200L8076J5659j4252j5349j4238L6225K7135n1625m1944m2922
5295h9865J466M1072M9750M8535m5053Q824l8756k6825j7393L7994O2123J7858
5283D9730j7689m1070M4591o016j4040k102K6658N5244n338k6370l7998m9399
5271b3799J5456j5778N935L8339j5797J9368j2482M0838J81l5437n694L144l3281
5258a9007l1079r802m293m2863m482j5330k8292M3790J5581L6146N8848j7011
5246a7794m0539P408O7479P4559J2824o8291n2445k6147l2574L8459N6431L0974
$$ y = [-65268, -28667, -29952, -8774, 31891, -7713, 1783, 66552, 96366, 62591, 37185, 37857, 35988, 63719, 83909, 60717, 51805, 70010, 79839, 60140, 53436, 27090, 33958, 75834, 63446, 32256, 21984, 6570, -26630, 11446, 27105, 12853, -2496, -16734, 19491, 46626, -4999, -46943, -89865, -88399, -47327, 2423, 50958, 5905, 14729, -24027, -50852, -68245, -30251, 31872, 49730, 32041, -9029, 35562, 29546, 15506, 13404, 40062, 95306, 89968, 63598, 25600, -23799, -8343, -24121, -18186, 20153, 4356, 23724, 11242, 52080, 52261, 16824, 11130, 14274, -19007, -50086, -59888, -64181, -107044, -111526, -126856, -155148, -111358, -95777, -59631, -783, -17794, -58333, -50925, 16554, 91113, 103937, 35646, -16799, -42946, -75520, -37061, 19370, 50344]
5234E0344m7627K0090K8725J2795l5413p5205R239M4268J0753n5383j7114N3289
5222a239m1559r075m3215J2411J5687j241n0762L947P4976Q5182K9430q3892n1846
5209f1196P699o7710j6137O8175M0852J7351M705m7600l4418n5402j0202N1278
5197a02605J05585K1651o7958k8024l4078L303O6469J6422o662k5259P2713K4090
5185D5647k875r168m2461k3241j202q269M951q604K835j3821L50L2017N8488j2578
5171B2069m7543l2552k1796L9588J2189L230j8946K8474L1706k7212l047j4177
5159b8017M860O043k8046N4956N8527k7530K908j0831l0005k9257K685k7534n767
5146e7008L3577O0451K8403k0887l6438n3578r053o085M855M4111N3039R442K3745
$$ y = [50344, 2717, 22807, 51532, 64327, 28914, -46291, -37052, 7216, 17969, -37414, -54528, -1239, -42798, -51873, -95088, -82677, -66990, -68231, -118993, -115046, -40070, 45112, 74542, -9350, -61196, -53497, -121207, -137344, -69169, -28317, -10966, -6261, -53861, -88279, -143681, -153883, -102605, 2980, 24631, -43327, -71351, -105429, -102126, -35657, -19235, -25897, -51156, 21557, 45647, 42772, 33604, -8857, -32098, -33300, -41569, -36618, -45222, -42387, -56208, -55858, -23841, 34647, 22069, -25474, -58026, -79822, -40234, -28045, -24815, -43761, -15287, 16419, -10793, -13840, -28017, -23157, -17114, -45160, 9796, 68323, 40793, 43701, 32870, 2865, -26392, -23707, -51241, -57008, -23431, 37020, 65423, 44536, 8098, -45480, -54533, -60618, -55763, -11652, 41387, 50829, 74574]
5133G4574L6272o8982j2533K4740j4554l3294R864J7725J5355M155L4507k7327
5121F0502k7747j0260L5337R958n1827k3518k2964K2719M872K6399J086K9241
5109E3798k2106m6492l1516q296N6699l453L3322j0737k3469J0418j2239O13P323
5096C865M6553o387K3019L9578k6328m8010J1136L6092O803o0370O584k3651k9414
5083b0530N003Q404m9763k1681o72K0894L041J5865N235j7195j782L0831j1430
5070c3780m1529k7373m8381J9008J7710o904M8895P6878M6819J5728n0756L6274
5058E2589J0255l6059o9351l2330m87O0733m2564m5622L1113P084L7489K7804
5046F54l3146J3931k8153j8145j0486J2784N1154J3146o431L0441L2943J4213
$$ y = [74574, 110846, 41864, 29331, 54071, 39517, 6223, 16087, 33812, 49167, 53322, 87829, 60502, 32755, 22495, 57832, 67790, 15963, -7555, -30519, -7800, -2928, 23471, 24557, 53798, 31692, -14800, -46316, -54612, 2087, -1366, 31956, 21219, -2250, 8168, -4071, -3458, 3865, 50418, 44031, 67050, 106628, 80300, 32290, 43426, 79518, 86321, 25951, 32535, 8884, -20530, -15527, -7123, -56886, -78567, -79239, -58345, -55304, -39439, -34204, -51399, -53181, -22350, -33780, -75309, -102682, -151063, -132055, -114345, -121249, -72354, 4524, 51343, 67071, 16315, 52589, 62844, 26785, -42566, -74896, -75383, -14650, -57214, -102836, -71723, -64639, -27150, 654, -32492, -18561, -46714, -64859, -75345, -62561, -11407, 1739, -4692, 25749, 58692, 72905]
5034G2905l302o5483k1787K4222N04k8999j750J2003O0281J7148k2142p653K1158
5021E7105l3292p8230k6561J3754O966m314L7405O5741j6388k3415M0502m4821
5009e548k6525J4771j5462k0672L129J698J2761M9953N5713l1110r7556m011N8424
4996d435j8392L3518Q318j4902K390q434K2897M0944l7393n542K6069n2m4059
4983I27l3291M4632K5179l2145j113J5611m312M030k5093j6446K9598j8369j1795
4970b2587k2943m0628O0064K5118J9455j3261J4386J9553P101K6743K10n9665
4958A3546o583L8078k4363n7119k5430L8847L3796L0495k1231n5410m6532J8680
4946f3226J3892K1296K5518j0056K9356K7991j1863n1599k1756m31j0563p772
$$ y = [72905, 69603, 4120, -17667, 6555, 7059, -21940, -23690, -11687, 48594, 65742, 43600, 35947, 57105, 23813, -54417, -80978, -67224, -60258, -64572, -27167, 38574, 22186, -1229, 39273, -5548, -32073, -17302, -32764, -53436, -50307, -48609, -35848, 14105, 69818, 38708, -58848, -62859, -4435, -22827, 10691, 19009, 4107, 6497, -1937, 20960, 61904, 24511, 18969, 45038, 44986, 927, -32364, 12268, 37447, 5302, 4189, 19800, 15488, 19518, -5575, -22021, 7577, -10792, -22587, -45530, -86158, -26094, -976, 18479, 5218, 19604, 39157, 46258, 73001, 73211, 13546, 6963, 45041, 20678, -36441, -61871, -23024, 10772, 41267, 20036, -35374, -81906, -63226, -49334, -28038, -2520, -12576, 16780, 44771, 32908, -18691, -40447, -40878, -51441, -59213]
4934e9213J4827N421m8692J2262J3257P2655L1223n3390j6434N4949K0435L2985
4922H0285K3166m8499j7002M939l3840k7885L0570j3389l0865R127L3810k8393
4910a7976J538N9576o1170n7384K6300J0150J8872L2050o146j7121k9698k8707
4898f9716N5692j938o2981J4712J6218K4309Q1560q47l8626m0767l2544j1335
4886f6263K6674K5860J7183N0123L3938J7281m110o6313k8099J1745q998p6380
4874f7359l6210L6243J6279K0673j4746Q15L0868j4181k2423l5671n610O1619
4862b9703K4980l6977L5113M7731J6624k7690n9460q8128j3139J7456M6662K1001
4850d5530O581Q060J3998O5102k389k8642j6796j103l4969q8541K3669N7956M3475
$$ y = [-59213, -44386, -38965, -87657, -75395, -62138, 10517, 41740, -11650, -28084, 26865, 47300, 80285, 103451, 54952, 37950, 42889, 9049, -18836, 11734, -1655, -32520, -23393, 10417, -17976, -16438, 43138, -18032, -75416, -49116, -38966, -20094, 11956, 5810, -11311, -41009, -69716, -14024, -15962, -78943, -64231, -48013, -23704, 57856, 57009, 18383, -22384, -54928, -66263, -39589, -13729, 3454, 53577, 87515, 104796, 100686, 34373, 6274, 18019, 9021, -67359, -103569, -67326, -51047, -30374, -45120, -44305, -13437, -27618, -50041, -85712, -91322, -29703, -4723, -41700, -6587, 41144, 57768, 30078, -29382, -117510, -130649, -113193, -66531, -45530, -38949, -30889, -16891, 48211, 45822, 17180, 384, -719, -35688, -124229, -100560, -42604, 871]
4837H71l0351j8079K324j4261K7199L9706j54k4897k3384L6387R669j1506K187
4824d289l7672l2973j6793L1389J03302M7333n9320k4888R470L6878K9246m333
4812G7350l9010J4215l4698J510J956M898N6946L0268n1862j16Q457j1760j8150
4799D0004n382m6892o3876K6835L0230j6182l732J3011L9729l2305j8615j5933
4787e3108O368K6753k3628j4336K0588n1711k158P3850K3311K9592L7070j8569
4775E4022m5360k8208n246L2923K9069J9282J2858p712m1234M794J5108P599k2024
4762B5871j3724o90m0735l3584m896Q4926k7148n1292O158L7662J6759M2702m7082
4749e073l5293l476J8293J2342l9469L4313J8582n5968K1173K545L8632n544k1672
$$ y = [871, -29480, -47559, -45235, -59496, -32297, 7409, 7255, -17642, -41026, -4639, 5030, -6476, -4289, -41961, -74934, -91727, -60338, 42964, 90297, 30977, 6089, 15559, 52437, 81683, 77350, 38340, 52555, 17857, 19367, 21323, 26221, 83167, 113435, 61573, 61457, 69914, 58154, 40004, 34622, -12270, -76146, -49311, -19081, -35263, -38995, -25984, 13745, -18560, -37175, -53108, -46740, -19987, -43615, -57951, -37363, -89074, -91232, -17382, 5929, 35521, 72591, 54022, 8662, -19546, -24792, 8131, 37200, 56482, 69340, 61628, 20394, 25188, 40296, 47895, 25871, 12147, 11457, -29278, -62862, -67758, 17168, -9980, -61272, -55114, -17452, -693, 42009, -5073, -40366, -43842, -25549, -13207, -52676, -18363, 219, -55749, -34576, -32031, 6601, 1057, -20615]
4736b0615K6493N1148j3165m4349k0250J3008R584r252k0272K2294qL8215N351
4723C8182l1442q965K3461L931k9392k8192o9413P674L8936L7401K6152J9792
4711B8125j7098L951L455L7467M0065n2704L3201J9452n114n1889l1242l7370
4699b9701L3268K6435J1289j1137o9148O563m933j05946q094J03810O9645N0835
4687G2886l9185k9830N296J0804m9130l960l5306P122L1662L318J9898j2711L8291
4674A9155j5943j855P495j9188J636j6377J116R474K0114l5312k128N5066L1598
4661E4851l5212m4125l2469K4682j0954L404N7573l0024j7794l9113O631O6279
4649C729M8715j1232L04m835l4815j5342K8984O8593l1211J9640M3401j3784k7204
$$ y = [-20615, 5878, 57026, 43861, -488, -20738, -7730, 1854, -7398, -27670, -5376, -5384, 32831, 38182, 6740, -2225, 21236, 25167, -4225, -32417, -101830, -94156, -55220, -17819, 8333, 28125, 11027, 14978, 18433, 55900, 95965, 43261, 76462, 95914, 90800, 38911, 7669, -29701, 3567, 30002, 41291, 30154, -38994, -32431, -37364, -143310, -151404, -47594, 22051, 72886, 33701, 3871, 9167, 19971, -29159, -33119, -68425, -61303, -29641, -26323, -6425, -19136, 19155, 3212, 1357, 8852, -10336, -8700, -25077, -23961, -14487, 5627, -29685, -31813, 23253, 54851, 19639, -24486, -56955, -32273, -43227, -39823, 17750, -12274, -30068, -69181, -62550, 3729, 52444, 41212, 41516, 36681, 1866, -13476, 15508, 84101, 52890, 72530, 115931, 102147, 74943]
4636G4943K2384l3146m5116k9582o8362k9284L455L3898M210J7202J1329K6614
4624a1455P588J3052k8438k9875J1939p075l4231o977j5599j6696M1666J9932
4612e6169M1208J5761L528m0358L351k676M7251K3980p627p309k8306j3960J860
4599a9466K6962j2964l4268j0769M1411M1076m3022n9242j3767j7629O0202M7205
4587E729K8791l2067k691q957L5575L1944r737m9956k9928p706K8829o7l8024
4574d8265K5969L0559j5589m1779k9869k2098K6952Q2414K0330j0966R672j2192
4562A5138N1398j6946n4224J7689l0361l2271J5808M6267M2012k3518m6033M8248
4550C3207L9723n2092j4475m7180N636L5746Q317l0663p515L8123J9042q0347
$$ y = [74943, 97327, 64181, 19065, -10517, -78879, -108163, -104708, -70810, -66600, -49398, -38069, -11455, -3867, 9185, -19253, -49128, -37189, -44264, -78495, -85472, -101071, -117767, -76101, -56169, -14961, 800, 4328, -36030, -32679, -35355, 11896, 35876, 28249, 20940, -7366, -21326, -19466, 7496, -5468, -39736, -50505, -9094, 31982, -11040, -70282, -84049, -101678, -41476, 5729, 34520, 2453, -238, -9195, 26380, 58324, 48587, -1369, -31297, -39003, -10174, -10241, -48265, -22296, 8263, -7326, -49105, -78974, -101072, -74120, 8294, 28624, 17658, 27330, 15138, 66536, 49590, -4634, 13055, -17306, -49577, -33769, 12498, 54510, 30992, -15041, 33207, 72930, 20838, 6363, -40817, -35181, 565, 8882, -21781, -29296, 8827, 27869, -52478]
4538e2478P0202N0384k90q093o1370J004K5367k5911k0122M168j7243j2072J450
4525d5004L2226j2112K1056k3994M0450M3833k4527j3420k7720J7604J791N4124
4513F4307K6540p8952l4386L5494O2848n8501n5951J8231J3746J8366l678K903
4501A0967K7674l3885j2562m6813l7638O7407R365M702O8256K7004J0186K4479
4489A19142q3529K393L8305m1817J3638j534k4499l6571k5238k5358J2100M3601
4477i367O334j439M5276J4051K0563M1307j0160j1573j2421j5989j7165J1349
4465F0766k5920m9702l010M8049J8762r411l6516l7566m4108J545J2210P4996
4453A0095P2717l2641k8533l7594l0611p823o3764K0279M4795l9760q708M29P0654
$$ y = [-52478, 17724, 68108, 67818, 59725, -1645, -641, 24726, -1185, -21307, -17139, -34382, -46454, -45004, -12778, -24890, -3834, -27828, 12622, 56455, 31928, 18508, -9212, 8392, 10183, 64307, 90847, 11895, -22491, 13003, 75851, 17350, -38601, -20370, -6624, 11742, 8064, 10967, 38641, 4756, -7806, -54619, -92257, -24850, -15485, -10783, 57473, 84477, 94663, 119142, 35613, 38006, 76311, 34494, 48132, 46598, 22099, -14472, -39710, -65068, -52968, -9367, -3033, -4472, 40804, 54855, 75418, 116725, 106565, 94992, 82571, 66582, 49417, 60766, 34846, -14856, -17866, 30183, 48945, 39534, 3018, -34548, -78656, -77111, -64901, 10095, 82812, 50171, 21638, -15956, -46567, -54390, -118154, -97875, -53080, -92840, -101548, -101119, -30465]
4440c0465N9106J704m548l6377m1019M0848m6232K5712K2004M772J8946l3559
4428a9108k9775k052N1808Q668Q999j6862j0153n6150l097p904N3763j3002K755
4415c2110j1188l5330o032J3509M5139K5601L281Q566J130j0209l1856R723L6762
4402A6986M5681R77l8365l5643l239l7676k3222j811P862l9071K6428L6339j0766
4389e5520m1558P6627Q3201n7274o8506L1406O2608j6575j7947l2779k4641N3346
4377g612L1651J3006K8208n7270L2879l2708N108N3259n5163n0252N847m030p627
4364d4704k0156J6112L6079L7471L5746l0040O717o521N3755K2538n2263m2751
4352A1983q0018J5166J4897q621J4294j9155K5703k5482mP6364J3159l7046J1266
$$ y = [-30465, 28641, 30345, 25797, -10580, -51599, -10751, -56983, -31271, -9267, -4495, 14451, -19108, -48883, -50935, 873, 9541, 18540, 1678, -8475, -64625, -67722, -75626, -21863, -34865, -32110, -43298, -78628, -84660, -71151, -26012, -411, 2870, 11436, 12566, 2357, -29499, -19776, 16986, 62667, 63644, 25279, -10364, -13603, -51279, -74501, -76312, -68450, -107521, -81093, -44754, -55520, -97078, -20451, 62750, 5476, -63030, -31624, 30984, 14409, -3538, -36317, -60958, -7612, 24039, 37045, 65253, 7983, 40862, 8154, 13262, 66521, 11358, -38894, -33047, -37077, -44704, -64860, -48748, -12669, 24802, 60548, 30508, 37225, 30704, 84459, 106997, 54734, 11983, -68035, -52869, -37972, -46593, -32299, -51454, -25751, -51233, -51237, 25127, 38286, 1240, 12506]
4339A2506P520O493K1610J7159J3435R22K570l3864n5814n6505J2426L9206O003
4326f333r315l1838L4986O83K9418q657K6974J6101K1392k9267K907m8887L0482
4313B8646n332L5065K7548n4868J0862q078q280k7452l1969Q022N2940l8417j2225
4300b3538K7650m0584p455L816K7977L4194l305k5919J3408L4437j2845o1173
4288c3337l1231J1276M5422J4312n6707L5919L5652l9805k3159p423m1205N3936
4276c6350L1937j7812L305l1525L2290J4443j16j3252M2606m2250n7509l015K1028
4263e6220Q9279J2087n0124K3534K6347J9351m5484j0395k8225J912l369j9739
4251d1046L364m794l4818L1243J06444m663p1625q40k633M0373J8001R86O720
$$ y = [12506, 20026, 26519, 48129, 65288, 78723, 79645, 82215, 48351, -7463, -63968, -51542, -12336, -6333, -15648, -47486, -12500, -11817, 17601, 8944, 35918, 52019, 73411, 44144, 47051, -1836, 28646, 23314, 58379, 85927, 31059, 41921, 33843, 25563, -1889, -33858, -25836, 27104, -11313, -23538, 4112, -36472, -43927, -40111, -12134, 22060, 18755, -7164, 6244, 40681, 27836, -33337, -64568, -53292, -7870, 6442, -50265, -14346, 21306, -18499, -41658, -49081, -90286, -36350, -4413, -22225, -18920, -50445, -18155, -3712, -3828, -17080, 25526, -16724, -74233, -77248, -56220, 33059, 45146, -4978, 18556, 44903, 64254, 18770, 8375, -19850, -17938, -21307, -41046, -37682, -42476, -77294, -46051, 60393, 55730, -15895, -16735, -19368, 21005, 39006, 39992, 46712]
4238D6712J6179M4521m9281p040l1444k3848J4884l7015k6004k1525K5424M9024
4226E87M0282l1559k1203j5958k916m5062j9356j706k0729k3159K5013K7895K6948
4213f0923M4963j8113m7813L8378M3743k9012k4457M1524L6573l6374j0901k1533
4201d3945J7569N0046J2836L5875r412K7222m7801l7673j7734j6067j0219R172
4189c0131k7673K6074L2406J772J2189k8063o7734N5495N1952J3047m9527k556
4177a2749O1682K4667K6435n1798l3493J0849q668p828Q38K7470q790K6983j761
4164E3837K494P45J2941l3940M989R55K116M0577p475q409m573j8148r819l0201
4150F089m2016J0797k578o0677K691M6498K7536j4268p293J0M4646M7751l576
$$ y = [46712, 62891, 107412, 58131, 51091, 19647, -4201, 10683, -26332, -52336, -73861, -48437, 587, 40869, 9310, -11893, -27851, -30767, -75829, -95185, -96891, -117620, -140779, -115766, -87871, -60923, -15960, -34073, -81886, -43508, 235, -28777, -53234, -11710, 24863, -11511, -22412, -43945, -26376, 23670, 36506, 72381, 62969, 90191, 42390, 4717, -13017, -29084, -39303, -30131, -57804, -31730, 676, 2448, 14637, -13426, -81160, -25665, 26287, 39334, -10193, -12749, 48933, 73600, 100035, 48237, 14744, 25593, 16925, 9097, 9935, 37405, 28615, 55598, 53837, 56331, 57076, 70017, 36077, 41066, 42021, 44137, 84714, 77239, 68830, 64257, 46109, 36290, 6089, -35927, -25130, -27708, -88385, -85694, -39196, -11660, -25928, -33221, -33211, 11435, 59186, 55610]
4137E5610j5509J8266L3223K0444m6813p9377p6648P004K8828o0605k5273K5433
4125a15417J8968N6357J4572j526J3386l261l7407j412o794K1257J8249n1098
4113g4126p1971j7203P4332Q2658L5983l9423j2785J1218O3110K1932p1048R677
4101A2354K1671K5009L2277p0977m9633p727j1941O4625J4007Q342J1549J0824
4089F0380p563l3461Q0O0172J1467n8857j3753n22j0327m4506k0344K7632n063
4076c4665m1444q038J7491l3229J3152P9280J082j6274K1365O248J5492O579p56
4063B6283k6258j5492l7620N2156M7614K1659p973o2620K4987J1851l3230l4958
4051c3601M3896J5552n2230k7991J3617L729L1454M4547q293l241l6504l1137
$$ y = [55610, 40101, 58367, 91590, 112034, 65221, -14156, -90804, -83800, -54972, -115577, -140850, -115417, -96449, -40092, -25520, -27046, -13660, -16921, -54328, -55740, -62534, -41277, -23028, -74126, -146097, -163300, -88968, -6310, 29673, -9750, -22535, -11317, 51793, 73725, 2677, 12354, 34025, 59034, 91311, 20334, -29299, -37026, -48967, 15658, 29665, 38007, 49556, 60380, 52817, 19356, 19436, 79608, 91075, 32218, 18465, 17943, 7616, -36890, -57234, -29602, -34665, -76109, -84147, -66656, -99885, -86733, -7453, -6371, -22645, -1280, 4968, 20460, 27039, 26283, 25, -15467, -53087, -931, 46683, 68342, 60369, -2251, 22736, 34587, 1357, -33601, 10295, 25847, -26383, -54374, -40757, -37028, -5574, 38973, 30680, 27439, -9065, -40202]
4039d0202l1700K5039j2720K0125J7042l078l6808p666J6345L4238j2727L2690
4027E78k1371L1832j0592j0823M2336K8246l144P32Q238l6737p048m0611m424
4014b2788M709J4532O850J0190N2309K9017j3647j4294j3334l6608n9721k668
4002d5453L4007J8727P8762M875m4644R870k6909l8618J1887J0009l340K433l6450
$$ y = [-40202, -71902, -46863, -59583, -39458, -22416, -25494, -62302, -69968, -53623, -19385, -32112, 578, -20793, 11039, 447, -10376, 31960, 60206, 57062, 57794, 66032, 29295, 22247, -18364, -22788, -18079, -3547, 3303, 13493, 65802, 94819, 81172, 66878, 53544, 16936, -42785, -45453, -11446, 7281, 86043, 90918, 46274, 56144, 29235, -9383, 2504, 12513, 9173, 11606, -24844]
$$ [...]
##END NTUPLES=NMR SPECTRUM
##END=
