##TITLE=Analysis number 317868
Compound Code cc 50806
Book Reference 445/174/10
Project Code adrs
Chemist Name laurenf
##JCAMPDX= 6.0         $$ Bruker NMR JCAMP-DX V2.0
##DATA TYPE= NMR SPECTRUM
##DATA CLASS= NTUPLES
##ORIGIN= Bruker BioSpin GmbH
##OWNER= nmr
$$ XWIN-NMR		Version 3.5
$$ Tue Mar  7 13:10:28 2006 GMT Standard Time (UT+0h)  MAYBRIDGE\nmr@NMR_250MHZ
##.OBSERVE FREQUENCY= 250.131544655141
##.OBSERVE NUCLEUS= ^1H
##.ACQUISITION MODE= SIMULTANEOUS (DQD)
##.ACQUISITION SCHEME= undefined
##.AVERAGES= 16
##.DIGITISER RES= 18
##SPECTROMETER/DATA SYSTEM= dpx250
##.PULSE SEQUENCE= zg30
##.SOLVENT NAME= CDCl3
##.SHIFT REFERENCE= (INTERNAL, CDCl3, 0, 16.522)
##AUDIT TRAIL= $$ (NUMBER, WHEN, WHO, WHERE, WHAT)
$$ ##TITLE= Audit trail, XWIN-NMR		Version 3.5
$$ ##JCAMPDX= 5.01
$$ ##ORIGIN= Bruker BioSpin GmbH
$$ ##OWNER= nmr
$$ C:\u/data/dgb/nmr/ADRS/150/pdata/1/auditp.txt
$$ ##AUDIT TRAIL=  $$ (NUMBER, WHEN, WHO, WHERE, WHAT)
(   1,<2006-03-07 13:10:06.35 +000>,<MAYBRIDGE\nmr>,<NMR_250MHZ>,
      <created by zg, POWCHK disabled, PULCHK disabled
       configuration hash MD5:
       84 BC 41 DB A1 6E 1D 46 DA 25 12 A5 C1 ED C5 3A
       data hash MD5: 64K
       E3 60 7B 73 56 8B FB 7E 26 DC D5 96 96 29 72 8E>)
(   2,<2006-03-07 13:10:18.80 +000>,<MAYBRIDGE\nmr>,<NMR_250MHZ>,
      <Start of raw data processing
       ef LB = 0.3 FT_mod = 6 PKNL = 1 SI = 32K 
       data hash MD5: 32K
       6E 2D F6 91 BB 85 77 7C 2A 26 96 89 C0 B7 33 62>)
(   3,<2006-03-07 13:10:20.95 +000>,<MAYBRIDGE\nmr>,<NMR_250MHZ>,
      <apk 
       data hash MD5: 32K
       83 7A 09 D3 1A 3E A9 01 95 36 4E DD 36 A0 32 9C>)
(   4,<2006-03-07 13:10:21.74 +000>,<MAYBRIDGE\nmr>,<NMR_250MHZ>,
      <abs ABSG = 5 
       data hash MD5: 32K
       1B F2 76 83 4B 3F DB 47 2A F7 13 3A 8B 29 FC C9>)
$$ ##END=
$$ 
$$ hash MD5
$$ 35 05 1C D6 5D 91 0C B5 91 73 7B D8 EB 92 E9 3A
##$RELAX= 
##$RELAX= 
##$RELAX= 
##$RELAX= 
##$RELAX= 
##$RELAX= 
##$RELAX= 
$$ Bruker specific parameters
$$ --------------------------
##$DU= <C:\u>
##$EXPNO= 150
##$NAME= <ADRS>
##$PROCNO= 1
##$TYPE= <nmr>
##$USER= <dgb>
##$AMP= (0..31)
100 100 100 100 100 100 100 100 100 100 100 100 100 100 100 100 100 100 
100 100 100 100 100 100 100 100 100 100 100 100 100 100 
##$AQSEQ= 0
##$AQ_mod= 3
##$AUNM= <au_zg>
##$AUTOPOS= <35 >
##$BF1= 250.13
##$BF2= 250.13
##$BF3= 250.13
##$BF4= 250.13
##$BF5= 500.13
##$BF6= 500.13
##$BF7= 500.13
##$BF8= 500.13
##$BYTORDA= 1
##$CFDGTYP= 0
##$CFRGTYP= 5
##$CHEMSTR= <none>
##$CNST= (0..31)
1 1 145 1 1 1 1 1 1 1 1 1 1 1 1 1 1 1 1 1 1 1 1 1 1 1 1 1 1 1 1 1 
##$CPDPRG= <>
##$CPDPRG1= <>
##$CPDPRG2= <>
##$CPDPRG3= <>
##$CPDPRG4= <mlev>
##$CPDPRG5= <mlev>
##$CPDPRG6= <mlev>
##$CPDPRG7= <mlev>
##$CPDPRG8= <mlev>
##$CPDPRGB= <>
##$CPDPRGT= <>
##$D= (0..31)
0 1 0 0 0 0 0 0 0 0.06 0 0 0 0 0 0 0.0002 0 0 0 0 0 0 0 0 0 0 0 0 0 0 
0 
##$DATE= 1141737005
##$DBL= (0..7)
120 120 120 120 120 120 120 120 
##$DBP= (0..7)
150 150 150 150 150 150 150 150 
##$DBP07= 0
##$DBPNAM0= <>
##$DBPNAM1= <>
$$ [...]
##$SUBNAM6= <"">
##$SUBNAM7= <"">
##$SUBNAM8= <"">
##$SUBNAM9= <"">
##$SW= 20.6930455092707
##$SWIBOX= (0..15)
0 0 3 0 0 0 0 0 0 0 0 0 0 0 0 0 
##$SW_h= 5175.983436853
##$TD= 65536
##$TD0= 1
##$TE= 294.16
##$TE2= 300
##$TE3= 300
##$TEG= 300
##$TL= (0..7)
0 120 120 120 120 120 120 120 
##$TP= (0..7)
150 150 150 150 150 150 150 150 
##$TP07= 0
##$TPNAME0= <>
##$TPNAME1= <>
##$TPNAME2= <>
##$TPNAME3= <>
##$TPNAME4= <>
##$TPNAME5= <>
##$TPNAME6= <>
##$TPNAME7= <>
##$TPOAL= (0..7)
0.5 0.5 0.5 0.5 0.5 0.5 0.5 0.5 
##$TPOFFS= (0..7)
0 0 0 0 0 0 0 0 
##$TUNHIN= 0
##$TUNHOUT= 0
##$TUNXOUT= 0
##$USERA1= <user>
##$USERA2= <user>
##$USERA3= <user>
##$USERA4= <user>
##$USERA5= <user>
##$V9= 5
##$VALIST= <valist>
##$VCLIST= <CCCCCCCCCCCCCCC>
##$VD= 0
##$VDLIST= <DDDDDDDDDDDDDDD>
##$VPLIST= <PPPPPPPPPPPPPPP>
##$VTLIST= <TTTTTTTTTTTTTTT>
##$WBST= 1024
##$WBSW= 4
##$XGAIN= (0..3)
0 0 0 0 
##$XL= 0
##$YL= 0
##$YMAX_a= 754165
##$YMIN_a= -840799
##$ZGOPTNS= <>
##$ZL1= 120
##$ZL2= 120
##$ZL3= 120
##$ZL4= 120
##$ABSF1= 16.522
##$ABSF2= -4.171173
##$ABSG= 5
##$ABSL= 3
##$ALPHA= 0
##$AQORDER= 0
##$ASSFAC= 0
##$ASSFACI= 0
##$ASSFACX= 0
##$ASSWID= 0
##$AUNMP= <proc_1d>
##$AZFE= 0.1
##$AZFW= 0.1
##$BCFW= 0
##$BC_mod= 0
##$BYTORDP= 0
##$COROFFS= 0
##$CY= 12.5
##$DATMOD= 1
##$DC= 0
##$DFILT= <>
##$DTYPP= 0
##$F1P= 14.0000005364418
##$F2P= -0.99999901652339
##$FCOR= 0.5
##$FTSIZE= 32768
##$FT_mod= 6
##$GAMMA= 0
##$GB= 0
##$INTBC= 1
##$INTSCL= 1
##$ISEN= 128
##$LB= 0.3
##$LEV0= 0
##$LPBIN= 0
##$MAXI= 10000
##$MC2= 0
##$MEAN= 0
##$ME_mod= 0
##$MI= 0
##$NCOEF= 0
##$NC_proc= -2
##$NLEV= 6
##$NOISF1= 0
##$NOISF2= 0
##$NSP= 0
##$NTH_PI= 0
##$NZP= 0
##$OFFSET= 16.522
##$PC= 1
##$PHC0= 241.086
##$PHC1= 8.785357
##$PH_mod= 1
##$PKNL= yes
##$PPARMOD= 0
##$PSCAL= 4
##$PSIGN= 0
##$REVERSE= no
##$SF= 250.13
##$SI= 32768
##$SIGF1= 0
##$SIGF2= 0
##$SINO= 400
##$SIOLD= 32768
##$SREGLST= <1H.CDCl3>
##$SSB= 0
##$STSI= 32768
##$STSR= 0
##$SW_p= 5175.98343685301
##$SYMM= 0
##$S_DEV= 0
##$TDeff= 65536
##$TDoff= 0
##$TI= <Analysis number 999999
Compound Code 99
Book Reference 9
Project Code 9>
##$TILT= no
##$TM1= 0
##$TM2= 0
##$TOPLEV= 0
##$USERP1= <user>
##$USERP2= <user>
##$USERP3= <user>
##$USERP4= <user>
##$USERP5= <user>
##$WDW= 1
##$XDIM= 32768
##$YMAX_p= 299266023
##$YMIN_p= -68587
$$ End of Bruker specific parameters
$$ ---------------------------------
##NTUPLES= NMR SPECTRUM
##VAR_NAME=  FREQUENCY,     SPECTRUM/REAL,   SPECTRUM/IMAG
##SYMBOL=    X,             R,               I
##VAR_TYPE=  INDEPENDENT,   DEPENDENT,       DEPENDENT
##VAR_FORM=  AFFN,          ASDF,            ASDF
##VAR_DIM=   32768,         32768,           32768
##UNITS=     HZ,            ARBITRARY UNITS, ARBITRARY UNITS
##FACTOR=    0.157963299565203, 1,           1
##FIRST=     4132.6476996994, 0,             0
##LAST=      -1043.33573715361, 0,           0
##MIN=       -1043.33573715361, -68587,      0
##MAX=       4132.6476996994, 299266023,     0
$$ Real data points
##PAGE= N=1
##DATA TABLE= (X++(R..R)), XYDATA
$$ [...]
22725e797n66L458L33L053k644l397p670K088L637L618K037j337l026L206J442
22710a565j336O049L388m375n341k506m028p612p372K049k927J2353P979j620
22696f864J303L477N383L268J514k354M59N530N815l260q989m916p498J378L043
22681b711k061j128j307r343k192N437M298R068J081Q79j81m275m127K503J913
22666b146L545K667l880j341P29L093m874p369j911R079N931N91K384j195m075
22651A228m684m313l80O773l456o544n292o642N489J0269k323j15k111J455J825
22636h821j235M04k893O652N287k088l765K738L719m631K5K422K347K613J512
22621D286m01l359o451l336O170O294k362l203J140J13R03k152n519K835M657
$$ plain form
22725 -5797 -6363 -2905 -2572 481 -2163 -5560 -13230 -11142 -7505 -3887 -1850 -3187 -6213 -3007 -1565
22710 -1565 -2901 3148 6536 2161 -3180 -5686 -9714 -17326 -24698 -22649 -25576 -13223 -5244 -6864
22696 -6864 -5561 -2084 3299 6567 8081 5727 6186 11716 17531 14271 5282 366 -7132 -5754 -2711
22681 -2711 -4772 -5900 -7207 -16550 -18742 -13305 -9007 61 1142 2021 1840 -2435 -6562 -4059 -2146
22666 -2146 1399 4066 186 -1155 -426 2667 -2207 -9576 -11487 -2408 3523 4114 6498 5303 1228
22651 1228 -3456 -7769 -8149 -1376 -4832 -11376 -16668 -23310 -17821 -7552 -9875 -9990 -12101 -10646 -8821
22636 -8821 -10056 -9652 -12545 -5893 -606 -2694 -6459 -3721 -2 -4633 -4608 -2186 161 2774 4286
22621 4286 3885 526 -5925 -9261 -3091 3203 841 -2362 -1222 -1109 -206 -2358 -7877 -5042 -385
22606c85Q52j0130l898K784J952K721M750j758l020R630K480m038j0800n690k76
22591a4826j526L240L642k862J160j256k760M637M491j459K85n19K868K539P58
22576a588m335L637K26l072j442K02L618L256m610n638k343M811j431M873j16
22561c952n199K741L165k189k167p062K931R302O814r088l686k756j614K430K059
22546h271r27r32N718O329j950L780j171J339J265O50q196j895K588L398n377
22531c652k98M901J362R66k08J239J606M69L352l880r088o396l172k216M873J0375
22515B33M426J217J16J924p344p459l037p206j059J834M273N790M160k226M563
22500B05K286K212m718q474k339J586R969O092J880J07l96m174k721l440P98K481
$$ plain form
22606 -385 467 -9663 -13561 -10777 -8825 -6104 -1354 -3112 -6132 3498 5978 1940 -8860 -14550 -14826
22591 -14826 -16352 -13112 -9470 -12332 -11172 -12428 -15188 -10551 -6060 -7519 -7234 -7753 -4885 -2346 -1588
22576 -1588 -5923 -2286 -2060 -5132 -6574 -6372 -2754 502 -4108 -9746 -12089 -7278 -8709 -3836 -3952
22561 -3952 -9151 -6410 -3245 -5434 -7601 -14663 -11732 -2430 4384 -4704 -8390 -11146 -12760 -10330 -8271
22546 -8271 -9198 -10130 -4412 1917 -33 3747 2576 3915 5180 5830 -2366 -4261 -1673 1725 -3652
22531 -3652 -3950 951 2313 3279 3071 4310 5916 6385 9737 5857 -3231 -9627 -12799 -15015 -10142 233
22515 233 4659 5876 5992 7916 572 -6887 -9924 -17130 -18189 -16355 -12082 -6292 -2132 -4358 205
22500 205 2491 4703 -15 -8489 -10828 -9242 727 6819 8699 8806 8410 4236 1515 -1925 -1127 1354
22484A354j0791q378L530O297L67L58M08J595l173p5N305O698M583k68o520K639
22468C929L954j349p157m605L286k469L868L05j710n318n317K875O809J218l476
22453e157m86m270M008q64L061K569J389n274n708l82L711L894l629j237o46p520
22437a6541m513n999J953M528m452J891R706j392K62M632N465j721m990Q34O271
22422d066M217J417r14P04j265n930j596n13J840J015J161m518K191L704n582
22407h135l71N206j688j626k09M769j051r27k132p10L056P863M065q151n942Q351
22391B368m03m861J214l05R63M540p758o894Q269P888J166l487j169k029J888
22376A390m90m447k461k048M81J55J824J263j751k163N233L121l42j421L411K142
$$ plain form
22484 1354 -9437 -17815 -14285 -7988 -7621 -7263 -6855 -5260 -8433 -8508 -3203 3495 8078 7810 1290 3929
22468 3929 7883 6534 -623 -5228 -1942 -4411 -543 -238 -1948 -7266 -12583 -9708 -2899 -1681 -5157
22453 -5157 -5643 -9913 -5905 -6769 -3708 -1139 250 -5024 -10732 -11114 -7403 -3509 -7138 -8375 -9021 -16541
22437 -16541 -21054 -27053 -25100 -20572 -25024 -23133 -13427 -14819 -14557 -9925 -4460 -6181 -11171 -10337 -4066
22422 -4066 151 1568 654 1358 93 -5837 -7433 -7946 -6106 -5091 -3930 -8448 -6257 -2553 -8135
22407 -8135 -8506 -3300 -4988 -6614 -6823 -2054 -3105 -4032 -6164 -6874 -3818 4045 8110 -41 -5983 2368
22391 2368 1965 -2896 -1682 -1987 -1024 3516 -4242 -11136 -2867 5021 6187 2700 1531 -498 1390
22376 1390 900 -3547 -6008 -8056 -7575 -7420 -5596 -4333 -6084 -8247 -3014 107 -235 -1656 1755 3897
22360C897q816N41L968l646o673n394L738J178N918M546l561k312l272l055r2
22345a3035N276O444P29j514n393K166n92M019L760j199M918r38N45m639m05r845
22329i703n48M454M939m357k452O15K294N586m644k650r949J825L746j008N602
22314f250K580k355n944m420j300K627P144j448L300O945O269n818l519P803L09
22299E923j580m515j643o48r026j362Q445j35K096P655j321l392j814J941L444
22284D068n763m675J473P878O729l558j108j696m571k792K512k348Q28Q205j873
22269C309m145o139J674J3517L583n010J414n336m600j956k662J346L37K437M694
22254B463m470k861k992m753l256O468N403R40j232l223K173L741M263j004q504
$$ plain form
22360 3897 -4919 -4378 -410 -4056 -10729 -16123 -12385 -11207 -5289 -743 -4304 -6616 -9888 -12943 -13035
22345 -13035 -7759 -1315 -586 -2100 -7493 -5327 -5919 -1900 1860 661 5579 4641 5186 547 142 -9703
22329 -9703 -10251 -5797 -858 -5215 -7667 -7052 -4758 828 -3816 -6466 -16415 -14590 -10844 -11852 -6250
22314 -6250 -3670 -6025 -11969 -16389 -17689 -15062 -7918 -9366 -6066 879 7148 1330 -2189 5614 5923
22299 5923 4343 -172 -1815 -2463 -11489 -12851 -4406 -4541 -2445 5210 3889 497 -1317 624 4068
22284 4068 -1695 -6370 -4897 2981 9710 6152 5044 3348 -1223 -4015 -1503 -3851 -3023 5182 3309
22269 3309 -836 -6975 -5301 8216 11799 6789 8203 2867 -1733 -3689 -6351 -5005 -4668 -2231 2463
22254 2463 -2007 -4868 -7860 -12613 -15869 -9401 -3998 -3058 -4290 -7513 -5340 -1599 2664 1660 -6844
22239f844L587K966J1185O255l587K372n680m805l975M13J840L874J305m099o926
22224b119k826J795J686J287l107J357l67J807k109o594M029J889l163R41N863
22209C69k146l444L372M205N68k775M579j215M83L451K818j541m862n53J34J132
22193D575K935M92k104n181M358n02L27l16K712m720m20j177N706P500j199L188
22177A6174J724l740j655o094K408k895j0378J528N472L625p122k278J680L295
22163A744P239J528p402m49J22N465K357l24P578Q359L321R907K1696K0659K2334
22148A04134K6023K0199M702j1090j9312j4864k2249j9686j3904j3953r465j0015
22136B0520j461p611m369O568N758r593p205l489n681n770J339J429M677L626
$$ plain form
22239 -6844 -3257 -291 10894 17149 13562 15934 10254 5449 1474 1887 3727 7601 8906 4807 -2119
22224 -2119 -4945 -3150 -1464 -177 -3284 -1927 -2294 -487 -2596 -9190 -5161 -3272 -6435 -5494 369
22209 369 -1777 -5221 -1849 2356 2924 149 4728 3513 3996 7447 10265 8724 3862 3309 3443 4575
22193 4575 7510 8002 5898 717 5075 4573 4900 4584 7296 2576 2156 979 6685 14185 12986 16174
22177 16174 17898 14158 12503 6409 8817 5922 -4456 -2928 2544 6169 -953 -3231 -1551 1744
22163 1744 8983 10511 3109 2660 2782 8247 10604 10280 17858 26217 29538 39445 61141 81800 104134
22148 104134 130157 150356 155058 143968 124656 109792 87543 67857 53953 40000 30535 20520
22136 20520 19059 11448 7079 13647 19405 9812 2607 -882 -6563 -12333 -10994 -9565 -4888 -1262
22122a262N695N908k200J709j262k057j030o175O207N189J313l859r707j1683
22108a3214M161N742R66J4660L152p760j6890P84L913J789M048j462l736L501
22094c46m82j778P173L429o95m911o985q506N88M020L220k8Q24J756M541N049
22078F869K129J871m387m459o437o424R10M913O686k673k314K489J738K654K474
22063F039j394j1022J384K566J015p237n16N253R856R68j465K153j1617k902N418
22048a501n218m065j061Q861N670L428K06o672n891m845K54N471L605K19N127
22033C588M938Q33p068n408L252R884K52l281j559q577o601K453j610J180L673
22018d051L813j231j157j195Q461L793m907n122Q28M707O722K054q912l710m892
$$ plain form
22122 -1262 4433 10341 8141 9850 8588 6531 5501 -674 5533 10722 12035 8176 -1531 -13214
22108 -13214 -9053 -3311 -2345 12315 15467 7707 -9183 -8399 -4486 -2697 1351 -111 -3847 -346
22094 -346 -828 -2606 4567 7996 7301 2390 -4595 -13101 -12513 -8493 -5273 -5301 -4477 -2721 1820 6869
22078 6869 8998 10869 6482 2023 -4414 -10838 -9928 -5015 1671 -1002 -3316 -827 911 3565 6039
22063 6039 4645 -6377 -4993 -2427 -1412 -8649 -9165 -3912 5944 6912 5447 7600 -4017 -6919 -1501
22048 -1501 -6719 -10784 -11845 -2984 2686 6114 6320 -352 -6243 -11088 -10834 -5363 -1758 -1539 3588
22033 3588 8526 9359 2291 -3117 135 10019 10271 6990 5431 -3146 -9747 -7294 -8904 -7724 -4051
22018 -4051 -238 -1469 -2626 -3821 4640 8433 3526 -1596 -768 3939 10661 12715 3803 93 -4799
22003d799p162J293J524J593j760R233M568o36J34l885j924l855M057J198l965
21988d386j377J985O955l143k554j686R34N091k814o054l990k88P263N293j243
21973a4k757j66j782K144J397N91K603k503K791N363m936j1163L532N183q62l332
21957c911k809O134K056J38J27n180k960l1O743M104k6m88j671m905j461n82J0932
21940F210N827l791p515K351J941j085n883j0484n873J573K336Q727J337P80L197
21925c52l837o685p93J731j880k097m440M278O248P622N515L677L24l420J286
21910G177p134r253l411M549L623n456m949O180L249N981R36n52K322m632k202
21895c572K977K736l873k466p745K595M591L136oO59l538J27N931O425q000o311
$$ plain form
22003 -4799 -11961 -10668 -9144 -7551 -9311 -78 4490 3854 3988 103 -1821 -5676 -1619 -421 -4386
21988 -4386 -5763 -3778 3177 34 -2520 -4206 -3272 1819 -995 -7049 -11039 -11327 -4064 1229 -14
21973 -14 -2771 -2937 -4719 -2575 -1178 -587 2016 -487 2304 7667 2731 -8432 -4900 283 -579 -3911
21957 -3911 -6720 -586 1470 1608 1735 -3445 -6405 -6436 307 4411 4385 3897 2226 -2679 -4140 -4722 6210
21940 6210 12037 8246 731 3082 5023 3938 -1945 -12429 -18302 -16729 -14393 -5666 -4329 -3549 -352
21925 -352 -4189 -10874 -11667 -9936 -11816 -13913 -18353 -14075 -7827 -205 5310 8987 9311 5891 7177
21910 7177 43 -9210 -12621 -8072 -4449 -9905 -14854 -8674 -5425 556 1492 940 3262 -1370 -3572
21895 -3572 -595 2141 -1732 -4198 -11943 -9348 -4757 -1621 -1627 -968 -4506 -4379 1552 7977 -23 -6334
21879f334L70J711L379o38O360J81m753K391J600q229k857K598l756L664P605
21864C292N90J851K38J193J677L660k949o127j707o791n523K036K061N905K810
21849B216p96L151Q500J017n813l004n717K788M348K223M236q822o524l518k131
21834g846L359L681L218J435k940K627K722p044J36r552P97P799k630k731M093
21819b876O393l869o2j502m391k266J528R189J05m33J298k151k316O537l024J01
21803B261M067k388j1120n099L308N013K658N080p351l279O044j247o203l539
21789a1795Q72k18K730J416O138j582L562J982o703m946L530r8j095P08J12m5
21773e432l981N255J872K504j14N5m316M120n35k969l753M54Q914Q399k812j1365
$$ plain form
21879 -6334 -5964 -4253 -874 -1512 4848 5029 276 2667 4267 -3962 -6819 -4221 -7977 -4313 3292
21864 3292 3882 5733 5971 7164 8841 12501 9552 3425 1718 -5073 -10596 -8560 -6499 -594 2216
21849 2216 1420 4571 13071 14088 8275 5271 -446 2342 6690 8913 13149 4327 -2197 -5715 -7846
21834 -7846 -4487 -806 2412 3847 907 3534 6256 -788 -652 -10204 -9407 -1608 -4238 -6969 -2876
21819 -2876 3517 -352 -414 -1916 -6307 -8573 -7045 2144 2249 1816 3114 963 -1353 5184 2160 2261
21803 2261 6328 3940 -7180 -12279 -8971 -3958 -1300 3780 -3571 -6850 -806 -2053 -8256 -11795
21789 -11795 -10923 -11141 -8411 -6995 -857 -2439 1123 3105 -3598 -8544 -5014 -5112 -6207 -5499 -5387 -5432
21773 -5432 -9413 -4158 -2286 218 104 159 -4157 -37 -572 -3541 -7294 -6840 2074 10473 7661 -3704
21757c704m916O450L6K74K994l261m554L606L821L377n439n057R02J2458j33n487
21741A367j004q2J753o113n736J251M419N694o060J805m447R54K576J887N686
21726C950P844k064j1973k314l756l128K949k416o602J983J237Q138n965l868
21712a5985N670k321O287O552k881J671L7O287M299J031j2143j988R969p87r56
21697D742j256J730O97O29k677n062r634N500P498M187l719r72l33m634L510Q673
21681H879J922p645p013O238q75K876N137m225k280m827k806K52j209k736j640
21666i952j048N204M922K677l252k663m216K925O908q92m238N752P06K896R815
21651A5544m029l152J0411K528q729r879n127J351N079K97q678o377Q228M200
$$ plain form
21757 -3704 -8620 -2170 -2134 -1860 1134 -2127 -6681 -3075 746 4123 -1316 -6373 -5471 6987 6854 1367
21741 1367 363 281 2034 -4079 -9815 -8564 -4145 1549 -4511 -2706 -7153 -6199 -3623 -1736 3950
21726 3950 11794 9730 -2243 -4557 -8313 -11441 -8492 -10908 -17510 -15527 -14290 -6152 -12117 -15985
21712 -15985 -10315 -12636 -6349 203 -2678 -1007 -970 5317 9616 10647 -1496 -3484 6485 5698 4742
21697 4742 3486 5216 5913 6542 3865 -1197 -10831 -5331 2167 6354 2635 1663 1330 -3304 206 8879
21681 8879 10801 3156 -3857 2381 1506 4382 9519 5294 3014 -1813 -4619 -4367 -5576 -8312 -9952
21666 -9952 -11000 -5796 -874 1803 -1449 -4112 -8328 -5403 1505 613 -3625 2127 2833 5729 15544
21651 15544 11515 8363 18774 21302 12573 2694 -2433 -1082 3997 4294 -4384 -10761 -2533 1667
21637A667P60n727j296j34o278K316R532J0676L843j850k163k948j960k228j415
21622B795L339M630m481l263P538L247J89o229j2864l88P902k711J743j25K55
21607A577L007R37l789L016R889J333L46o764k097n581q131J588k115k111N298
21592c597O861K143N36Q930o12m301p332o736M583m348n951J151P44J059l383
21577a0253j803k185O042L442k843l083L942K791l227R71j273k685N310M845j21
21562a30O336j350K532K8k612L709m4O73k892o046m932m779j901N377j175k841
21546a0047P70R221N435J05m791m816N058L243o046r08J681M743k911n338o314
21531a0915N7L381m57M997M259L688k219n504p111N31N045J423m722n249p420
$$ plain form
21637 1667 2427 -3300 -4596 -4730 -11008 -8692 840 11516 15359 13509 11346 8398 6438 4210 2795
21622 2795 6134 10764 6283 3020 10558 13805 13994 7765 -5099 -5487 2415 -296 1447 1322 1577
21607 1577 4584 5521 1732 4748 14637 15970 16316 9552 7455 1874 -6257 -4669 -6784 -8895 -3597
21592 -3597 3264 5407 5943 14873 14261 9960 2628 -4108 475 -3873 -9824 -8673 -7929 -6870 -10253
21577 -10253 -12056 -14241 -8199 -4757 -7600 -10683 -6741 -3950 -7177 -6206 -7479 -10164 -4854 -9 -130
21562 -130 6206 4856 7388 7416 4804 8513 8469 9142 6250 204 -4728 -9507 -11408 -6031 -7206 -10047
21546 -10047 -9277 -56 5379 5484 693 -4123 935 4178 -1868 -2776 -1095 3648 737 -4601 -10915
21531 -10915 -10858 -7477 -7934 -2937 1322 5010 2791 -2713 -9824 -9293 -4248 -2825 -7547 -12796 -20216
21516b0216n43N263L038L469J552K740J1652l117q329o684p977P528Q192k478
21502e910L699K150q230m304J0439Q843l308n319j851K494j43j009n344k921m58
21487a1172Q999R80L920q296k9L230K390J485J925M355k503L915O66l105p983
21472a223L56O939q94R034O756o348p435k277J042j996P14j991J835m488o186
21457f162n861J844L042N482K154O888l54p245l210j650P51K43j96k435K228j408
21441e889M163o851p42M290L594L116R895J587k539l974o585K198J356j262M253
21426F610n23k816j250l27L241K482M48j941q064P660J990n902o80j3542k48P712
21410e150J509l610J072M518k115Q89O755J160n390J235q63L188k93q989k46J933
$$ plain form
21516 -20216 -20759 -15496 -12458 -8989 -7437 -4697 6955 3838 -4491 -11175 -19152 -11624 -3432 -5910
21502 -5910 -2211 -61 -8291 -12595 -2156 6687 3379 -1940 -3791 -1297 -1440 -2449 -7793 -10714 -11172
21487 -11172 -2173 -1193 2727 -5569 -5598 -2368 22 1507 3432 7787 5284 9199 9865 6760 -1223
21472 -1223 -867 6072 5178 14212 20968 14620 7185 4908 5950 3954 4668 2677 4512 24 -6162
21457 -6162 -12023 -10179 -7137 -1655 499 7387 7033 -212 -3422 -5072 -4321 -4078 -4274 -6709 -4481 -5889
21441 -5889 -1726 -8577 -9319 -5029 -1435 1681 11576 13163 10624 6650 65 2263 3619 2357 6610
21426 6610 6087 3271 2021 1694 4935 7417 7865 5924 -2140 5520 7510 1608 928 -12614 -12862 -5150
21410 -5150 -3641 -7251 -6179 -1661 -3776 -2887 3868 5028 -362 873 10 3198 2905 -6084 -6330 -4397
21394d397M206j764L290P762N813l163j0474l300j805N369n14J634M824O741r705
21379D517l532r554k432K655K399M887L846n374n308j0506K665N735J420k533
21365a1115N488l080o895j926J0899Q290j070j74P513k601p999l397M745N83K007
21350A268m857o230N69J526m313N602K749Q98L808J625R41m176K839K544M941
21335I734J277n749j792l8k780k573o017L951P46O032Q394p813l779Nj182K610
21319A026J403l001j686j613n16O258L280n986J220l621K25L965P73n11p241j201
21303g226R367Q072j78n590k531j060k89L603k819l937j545K785M261O44k494
21288A063j990m720R3j760p924K281K998R112M043o449k366l347o827l473O36
$$ plain form
21394 -4397 -191 -1955 1335 9097 14910 11747 1273 -2027 -3832 1537 1023 2657 7481 14222 4517
21379 4517 985 -8569 -11001 -8346 -5947 -1060 2786 -2588 -7896 -18402 -15737 -10002 -8582 -11115
21365 -11115 -5627 -8707 -15602 -17528 -6629 1661 591 417 7930 5329 -2670 -6067 -1322 -739 1268
21350 1268 -3589 -9819 -9250 -7724 -12037 -6435 -3686 -2788 1020 2645 3586 -590 2249 4793 9734
21335 9734 11011 5262 3470 3432 652 -1921 -7938 -3987 -3241 2791 11185 3372 -407 -402 -1584 1026
21319 1026 2429 -572 -2258 -3871 -4387 1871 5151 -835 385 -3236 -3011 954 1727 1216 -6025 -7226
21303 -7226 2141 10213 10035 4445 1914 854 565 4168 1349 -2588 -4133 -1348 2913 3557 1063
21288 1063 -927 -5647 -5554 -7314 -15238 -12957 -9959 -847 3196 -3253 -5619 -8966 -15793 -19266 -18630
21273a8630N200Q548M279L278k879k357p60K389M736k27L09K312k830j999M18
21258A787k751l303M943N161O150j181o433j945M080J251n934o521Q198K796j0358
21243d060j1189N834Q776L152M41K95k199J823n821m728O118O409j117j840m175
21228b281K127L938P886q383p952K549K410J398o733k186N042L312K103O359J312
21213A0901m432o344j13p11j603K064o722N815j889J658N273M798l341r18n086
21198f50q363m332m23P244N239m463k358R09m27p47M757KO106n448l837k167p363
21181a6321P24K462P607k015p69L702j631n74j180K627n648J740N412P677k979
21166H34l661l293k036M707N335j0242n635O973P12M866M456j6J124n379J0o652
$$ plain form
21273 -18630 -13430 -4882 -603 2675 -204 -2561 -3321 -932 3804 3577 3886 6198 3368 1369 1787
21258 1787 -964 -4267 676 5837 11987 10806 4373 2428 6508 7759 1825 -4696 3502 6298 -4060
21243 -4060 -15249 -9415 -639 2513 2954 3249 1050 2873 -2948 -7676 -1558 4851 3734 1894 -2281
21228 -2281 -154 3784 11670 3287 -4665 -2116 294 1692 -5041 -7227 -2185 1127 3230 9589 10901
21213 10901 6469 125 12 -699 -2302 -238 -6960 -1145 -3034 -1376 3897 8695 5354 4436 -650
21198 -650 -9013 -13345 -13768 -6524 -1285 -5748 -8106 -7197 -7624 -8371 -3614 -3612 2494 -2954 -6791 -8958 -16321
21181 -16321 -15597 -13135 -5528 -7543 -8312 -4610 -6241 -6815 -7995 -5368 -11016 -9276 -3864 3813 834
21166 834 -2827 -6120 -8156 -3449 1886 -8356 -13991 -7018 -6306 -1440 3016 3000 4124 -1255 -1245 -7897
21150g897j989Q0P60O73m447q56K262O016O499j358M726K88k102p960k091o37
21134h033L077L513k235L962L980j676r78K35n182o90o502o249M500O639M166
21119a473L683k650L019O660L968K279P61R53o085o829l734k974k899m915l952
21104a4188j633M252j864M411N635k26l331Q543k113p361O443j288m126q96Q297
21089E55J0130o556o481M089Q434l27l112J089o562n925K780K445k685q351l042
21074a3519J275j250M69m205M911O801J537o753o15k222r30M047N606J583M095
21059H30k003m767K159O57p25l41M385M751m415L74M009k687k982K767l268J127
21043a29L822m511l866l429K704l389J058N646L086N064j056M200j541O88K108
$$ plain form
21150 -7897 -9886 -9806 -9046 -8373 -12820 -13676 -11414 -5398 1101 -257 4469 4757 2655 -5305 -7396 -8033
21134 -8033 -4956 -1443 -3678 284 4264 2588 1610 1845 -3337 -4027 -10529 -16778 -12278 -5639 -1473
21119 -1473 2210 -440 2579 9239 13207 15486 16247 17200 11115 4286 552 -2422 -5321 -10236 -14188
21104 -14188 -15821 -11569 -13433 -9022 -3387 -3613 -6944 1599 -514 -7875 -1432 -2720 -6846 -7742 555
21089 555 10685 4129 -2352 1737 10171 9844 6732 7821 1259 -4666 -1886 559 -2126 -10477 -13519
21074 -13519 -12244 -13494 -13025 -17230 -12319 -5518 -3981 -10734 -11349 -13571 -14501 -10454 -4848 -3265 830
21059 830 -1173 -5940 -3781 -3124 -3849 -4190 195 4946 531 905 4914 2227 -755 2012 -1256 -129
21043 -129 3693 -818 -4684 -8113 -5409 -8798 -7740 -2094 992 6056 5000 9200 7659 8347 10455
21028A0455N27p491r449l220m267p99M276k168j783j02J293JM482j782k679N035
21012g671l534M060K026R89o99J171l909p384r85l54N134J3164P434p3O3k889
20996F543l677q978L31m57K191o643Q80J1688j776n475k778M141O654k092M017
20981D569m784n383L615N030j256n890P676P213o717k231L250L709M288j567k718
20966H804P224Q588r115n721K629K879l974J27K738k462q358m966l742J786J64
20951c399o149N214L573o62M40P051L773l802Q94j114j056l135o210l34l708n412
20935a4036j058j822L975J1572J4718L215j978p073j899r545q198k750K835K155
20921i889M32m036j96L705L915Q682J803l541M691J319m814q478N555N823j774
$$ plain form
21028 10455 10982 3491 -5958 -9178 -13445 -14244 -9968 -12136 -13919 -14021 -12728 -12727 -8245 -10027 -12706 -7671
21012 -7671 -11205 -7145 -5119 -4130 -4829 -3658 -7567 -14951 -15936 -16290 -11156 2008 9442 9369 9432 6543
20996 6543 2866 -6112 -5781 -6238 -4047 -10690 -9810 1878 102 -5373 -8151 -4010 2644 552 4569
20981 4569 -215 -5598 -1983 3047 1791 -4099 3577 10790 4073 1842 5092 8801 13089 11522 8804
20966 8804 16028 24616 15501 9780 12409 15288 11314 11441 14179 11717 3359 -1607 -5349 -3563 -3399
20951 -3399 -9548 -4334 -761 -1423 -983 6068 9841 6039 6933 5819 4763 1628 -4582 -4916 -8624 -14036
20935 -14036 -15094 -16916 -12941 -1369 13349 16564 14586 7513 5614 -3931 -12129 -14879 -12044 -9889
20921 -9889 -9457 -13493 -13689 -9984 -6069 2613 4416 875 5566 6885 2071 -6407 -852 4971 3197
20906C197k829Q10k019l480L130J968q30M854o341o036M859L316O960m357N78
20891C780l844J900L073k264l551L330q57l421L090M415q293n481o62k849K137
20876i497K862K467K318j551k672J079P474K74m35K74N57l259k724M214n7j229
20860I5M375q07K809J088l42K275l18r760l010M335N608j161M6j477j1187l183
20844a0614K193L896k936J714M67L332o422m1j865R87M672k237r46M281r77L928
20828e68M859l112r976O218N419m352J648k939k160m769j675J0986L019K504l628
20813A474j54m895p109k779L177O946O42P136k992m626l573k024L684m83n06K596
20797c486o11R380K780k310k70l041j672l007M76o530j055M759L6O059L75l394
$$ plain form
20906 3197 368 1178 -841 -4321 -1191 777 -53 4801 -1540 -7576 -2717 599 7559 3202 3780
20891 3780 -64 1836 4909 2645 -906 2424 1567 -1854 1236 5651 -2642 -8123 -8785 -11634 -9497
20876 -9497 -6635 -4168 -1850 -3401 -6073 -4994 2480 2754 2319 2593 3150 -109 -2833 1381 1324 95
20860 95 4470 3663 6472 7560 7218 9493 9175 -585 -3595 740 6348 5187 5233 3756 -7431 -10614
20844 -10614 -8421 -4525 -7461 -5747 -5280 -1948 -8370 -8411 -10276 -9289 -4617 -6854 -7800 -3519 -4496 -568
20828 -568 4291 1179 -8797 -2579 2840 -1512 136 -2803 -4963 -9732 -11407 -421 2598 5102 1474
20813 1474 1320 -3575 -10684 -13463 -10286 -3340 -2698 4438 1446 -3180 -6753 -8777 -5093 -5576 -6082 -3486
20797 -3486 -4097 5283 8063 5753 5483 2442 770 -2237 -1761 -8291 -9346 -4587 -4551 1508 1883 -1511
20781a511k4j015L846J750l523l478M243j119j152K471P690k881k612o141k396
20766e852M802O879k082n150l167N830P511L95m878l198K037K546m420p423N742
20751d28N213n383j270j005l162k63L9M360Q09j886K281j756l900j1598n19J0815
20735g653J1723L209l425n209m250j28L655K837N704r68r877q060N507P928p76
20720B17J531Q69k156K341N358q69J301k84q801o424n571J1887M144m621j071
20705b149j307m981m124J694K884K284O143L259r761o706J0665K76o18j080J756
20690a765L393J615l222k368r789J929O754R439m014k928J459l900r90L733O139
20675E485m721K758L076l05j626k699j120p095L92L743k037o956j477M816q08
$$ plain form
20781 -1511 -1535 -2550 1296 3046 -477 -3955 288 -831 -1983 488 8178 5297 2685 -3456 -5852
20766 -5852 -1050 5829 3747 -1403 -4570 1260 8771 9166 4288 1090 3127 5673 1253 -6170 -428
20751 -428 4785 -598 -1868 -2873 -6035 -6298 -6259 -1899 -1090 -2976 -695 -2451 -6351 -17949 -18468 -7653
20735 -7653 4070 7279 3854 -1355 -5605 -5733 -2078 759 6463 5495 -4382 -12442 -6935 993 217
20720 217 1748 2617 461 2802 8160 7291 8592 8308 -493 -6917 -12488 -601 3543 -1078 -2149
20705 -2149 -3456 -8437 -12561 -10867 -7983 -5699 444 3703 -6058 -12764 -2099 -1823 -2441 -3521 -1765
20690 -1765 1628 3243 21 -2347 -12136 -10207 -3453 5986 1972 -956 503 -3397 -4387 -654 5485
20675 5485 764 3522 6598 6293 4667 1968 848 -6247 -5855 -2112 -4149 -11105 -12582 -7766 -8574
20660h574J808P308M320L42M880L102l9m121j752n070l948j967K345L925m06k381
20644b28r50J077L166m207M83J88J75M751J560o38P766Q9l014q305o984k47M605
20627g13J293l749m605K342J388L632j566n075o396q7O668L176k029L186k21l270
20611f026M409J131j881l186K786L103M508M821m831N452l782m861P491J201o719
20596C616m606m066k811J76k626L430Q937M848L873K181q261j0608o401k7K221
20581a0124L014n599n96k472L873O668Q428J393K922L00j417o128j05j665p172
20566h680L425J90J199O604K478r51j623r948p047M015J046L177L5M956K853J775
20550C504m588k54J073m46M336N317n602m650N688L567J948m292q974O668K123
$$ plain form
20660 -8574 -6766 542 4862 5204 10084 13186 13147 9026 7274 2204 -1744 -3711 -1366 2559 2153 -228
20644 -228 -1178 -101 3065 -1142 -659 -471 -296 4455 6015 5377 13143 13232 10218 1913 -5071 -5318 -713
20627 -713 580 -3169 -7774 -5432 -4044 -412 -1978 -7053 -13449 -13536 -6868 -3692 -5721 -2535 -2756 -6026
20611 -6026 -1617 -486 -2367 -5553 -2767 336 4844 9665 4834 10286 6504 1643 9134 10335 3616
20596 3616 -990 -5056 -7867 -7691 -10317 -6887 2050 6898 10771 12952 4691 -5917 -12318 -12345 -10124
20581 -10124 -7110 -12709 -13305 -15777 -11904 -5236 3192 4585 7507 7807 6390 262 157 -1508 -8680
20566 -8680 -5255 -5065 -3866 2738 5216 4265 2642 -7306 -14353 -10338 -9292 -6115 -6080 -1124 1729 3504
20550 3504 -1084 -1338 -265 -711 3625 8942 3340 -1310 4378 7945 9893 5601 -3373 3295 5418
20535E418J804K494n488o707J313j833Q830Q197p941j1100o869L755Q231R18R69
20520A991m12k81L305n982r195j476K570m278p18P469k052o384O504P372P231
20505E664L807j16j537j34l637l609J225l295P74l09m205J262K636O391N537j404
20489I050o039J002L643m02n639J552k631j0896N21J0037j123n208O592P934m457
20474C936N17j149o320l665k273L193N17k806K230M676K827L156j282l590m588
20459d621R10L768o789l664k40M795K29O589o645q095r32j363J660L394l961L861
20443a1104L843M112L337J076K535L949N336L032k169k748p283o310r614n758
20429a7766N485M098L288l725K693R371k359m200N834L984J34q87j04k769L035
$$ plain form
20535 5418 7222 9716 4228 -2479 -1166 -2999 5831 14028 6087 -5013 -11882 -8127 104 1022 1991
20520 1991 1579 1298 4603 -1379 -10574 -12050 -9480 -13758 -14476 -7007 -9059 -15443 -8939 -1567 5664
20505 5664 9471 9355 7818 7684 4047 438 1663 -1632 -858 -1167 -5372 -4110 -1474 4917 10454 9050
20489 9050 3011 4013 7656 7254 1615 3167 536 -10360 -9839 198 -925 -6133 459 8393 3936
20474 3936 4453 3304 -3016 -6681 -8954 -5761 -5244 -8050 -5820 -1144 1683 4839 3557 -33 -4621
20459 -4621 -3711 57 -6732 -10396 -10636 -5841 -5612 977 -5668 -13763 -14695 -16058 -14398 -11004 -14965 -11104
20443 -11104 -7261 -3149 188 1264 3799 7748 13084 16116 13947 11199 3916 -2394 -12008 -17766
20429 -17766 -12281 -8183 -4895 -8620 -5927 3444 1085 -3115 2719 6703 6837 5950 5846 3077 6112
20414F112R48K816J060j177o114k986J292N21k799n405k109L725k552N287P76
20399f05l927m532p10J532j941L953P404N597J923m694j879m715o288l251k407
20384a4540N1L87J611K228R69L467L211n601m376L21R441J129M57O142J702K05
20368F804K421n510n169P413l134q124K123N132q67m285P055Q371m59q611p638
20353d478r709O0K798Q790j762J258J145ln92R41Q342Q49n507L592K576j52L814
20336A1962L306o757k62k642r870j1145J071Q024j854l146N035J2339K218l489
20322D790k629K818k834r044l289j052j194n681R483N342r18L4M054j715Q43M685
20306C693J445m029L065l483k446j41K446p593l5N276m58J240j230k705J684J026
$$ plain form
20414 6112 7060 9876 10936 9759 3645 659 1951 2472 -327 -5732 -7841 -4116 -6668 -1381 -605
20399 -605 -4532 -9064 -9774 -8242 -10183 -6230 1174 6771 8694 4000 2121 -2594 -8882 -12133 -14540
20384 -14540 -14489 -14102 -12491 -10263 -9294 -5827 -2616 -8217 -12593 -12272 -2831 -1702 -1245 4897 6599 6804
20368 6804 9225 3715 -1454 5959 2825 -5299 -3176 1956 1089 -3196 3859 12230 11771 3160 -4478
20353 -4478 -14187 -14127 -11329 -2539 -4301 -3043 -1898 -1901 -2493 -1552 6790 7639 2132 5724 8300 8148 11962
20336 11962 15268 8511 8249 5607 -4263 -15408 -14337 -6313 -8167 -11313 -6278 6061 8279 4790
20322 4790 2161 4979 2145 -6899 -10188 -11240 -12434 -18115 -8632 -3290 -4208 -4174 -120 -1835 -992 3693
20306 3693 5138 1109 4174 691 -1755 -1896 550 -7043 -7078 -1802 -2260 -1020 -2250 -4955 -3271 -2245
20290b245o342O0P39K430O380K698k244Q142j118o362p444P5k93J332J2671m84
20274G995n689J491N358m116q60Q430N660l069p139j0597l661K555O068N949M891
20259A3266l481m746o044n035k623L559K112r078r60P987j090M335L421n874j983
20244f234N166Q734O734j208n304k676k186j744m083p995j030j618M497P689M951
20229C693j086J579j885M990r81m063K509p519j392M32K106J789J779M40l875
20214a484n371O970L589L58l370p104n756l748Q478K66K983M982K214J652K363
20199G022k578Q8K616m670j690L632j561k519m700p590M023R262M729L15k072
20184D307l189l528J731j645J666j275l333M576N36K68K963l772n305M015M711
$$ plain form
20290 -2245 -8587 -8527 -7788 -5358 1022 3720 1476 9618 8500 2138 -5306 -5231 -5524 -4192 8479 7995
20274 7995 2306 3797 9155 5039 4179 12609 18269 15200 8061 -2536 -6197 -3642 2426 8375 13266
20259 13266 9785 5039 -1005 -6040 -8663 -5104 -2992 -12070 -13030 -5043 -6133 -1798 1623 -4251 -6234
20244 -6234 -1068 7666 14400 13192 7888 5212 3026 1282 -2801 -10796 -11826 -13444 -8947 -1258 3693
20229 3693 2607 4186 2301 7291 6310 2247 4756 -2763 -4155 -3723 -1617 172 1951 2391 -1484
20214 -1484 -6855 115 3704 4062 692 -6412 -12168 -15916 -7438 -7172 -4189 793 3007 4659 7022
20199 7022 4444 4532 7148 2478 788 4420 2859 340 -4360 -11950 -7927 1335 6064 6379 4307
20184 4307 1118 -2410 -679 -2324 -658 -1933 -5266 -690 -154 114 3077 -695 -6000 -1985 2726
20169B726l415L608j076Q9J555j543n327R62Q416J145o170l751M579Q352n08J386
20153A1028n38p13L81o575K9J269k382n282k107K535m64k164O365M460l285J3
20137B570j745m06L672J597m184K175m022k09K991k092M088q7n286p526K345J796
20121d323k551J337J732k734Q09l158J817R501P739m049m747k8k048J2050O170
20106A7517k688j664r8N26r39j562N37n668n506k855l420k067M202r71m190l315
20090a2161Q849J579M867L083M18j437o86k227K799p525N05K472J698k058M015
20075D191j038k646l813O814k310q861O004L368j968q04P51K889J699l915k990
20060b629j834k041J359K880K238J68m664N189L199K248j129l437n332m055n08
$$ plain form
20169 2726 -689 2919 1843 1932 3487 1944 -3383 -2421 5995 7140 970 -2781 1798 10150 9642 11028
20153 11028 10490 9777 10158 3583 3612 4881 2499 -2783 -4890 -2355 -2819 -4983 1382 5842 2557 2570
20137 2570 825 419 4091 5688 1504 3679 -343 -552 2439 347 4435 4348 -938 -8464 -6119 -4323
20121 -4323 -6874 -5537 -3805 -6539 -5730 -8888 -7071 2430 10169 6120 1373 1345 -703 11347 17517
20106 17517 14829 13165 13067 13593 12654 11092 11629 5961 455 -2400 -5820 -7887 -3685 -4656 -8846 -12161
20090 -12161 -3312 -1733 3134 6217 6635 5198 4512 2285 5084 -2441 -1936 536 2234 176 4191
20075 4191 3153 507 -3306 3508 1198 -7663 -1659 1709 -259 -1063 -312 2577 4276 361 -2629
20060 -2629 -4463 -6504 -5145 -2265 -27 141 -4523 666 3865 6113 4984 1547 -3785 -7840 -8348
20045h348p44m442N285N671q4p945L192M858P608L912r416n496L159M948J510
20030C668o208L993M298L558m070l30P43J451L394m33K53o64l688m341m17N618
20014F825P658J489j279q939q582K289q90M541J405l052L164j553k265m232J385
19999b036l092L53Q4M973P298l659o813j773J89J338J580k404j932L689K103J958
19983A856L882L275J4l664L597J572M151M789P75o919j026K55o605p416j166j865
19967d495j861l700K078N157M432K957k79m847j568m423J920O559P909k611j727
19952E501m84j980q529r444L948O171j664K835N493R29k102r40K637J752k642
19937A481r41N22J055N668K295n996j4139L284j513m228N666P936P715j394N16
$$ plain form
20045 -8348 -9092 -13534 -8249 -2578 -2662 -10607 -7415 -2557 5051 8963 -453 -5949 -2790 2158 3668
20030 3668 -2540 1453 5751 9309 5239 4909 5652 7103 10497 10064 10317 9653 5965 1624 1207 6825
20014 6825 14483 15972 14693 5754 -2828 -539 -1429 3112 4517 1465 4629 3076 811 -3421 -2036
19999 -2036 -5128 -4775 -4691 282 7580 3921 -2892 -4665 -4476 -3138 -1558 -3962 -5894 -2205 -102 1856
19983 1856 5738 9013 9027 5363 8960 10532 14683 19472 20247 13328 12302 12557 5952 -1464 -2630 -4495
19967 -4495 -6356 -10056 -7978 -2821 1611 4568 4289 -558 -2126 -6549 -4629 1930 9839 7228 5501
19952 5501 5017 3037 -5492 -14936 -10988 -4817 -6481 -3646 1847 2776 674 -266 2371 4123 1481
19937 1481 540 1062 2117 7785 10080 4084 -10055 -6771 -8284 -12512 -6846 1090 8805 7411 7927
19922G927j0354l034j44N21J508p321m791n54J3467J1642k229m381j069j71l58
19907F59k534l649L867L178N559M3l926M499K469L05j213k215m374p195j177K736
19891b968J342J92J979l373l064M521K260k996O78M397O49L282N538M107o161
19876A0383j669Q185K901k673o128m699M779k980m027m443p59q562j770P118K86
19861d058m927N55N669P204M415p061p92n66q787Q38l128K221L790Q33j575K339
19845c030J683L738K901j681j454q127k610O464J647j7k31j271R40o292j66P729
19829B23j958o59M36J314o5L712M354P729J016L20m623o394m691n254R89Q930
19813E379K30O68l643j956m151n629N699M933m83j630N815K332N442L331j0228
$$ plain form
19922 7927 -2427 -5461 -5605 -5084 -3576 -10897 -15688 -16242 -2775 8867 6638 2257 1188 1017 659
19907 659 -1875 -5524 -1657 1521 7080 7123 3197 7696 10165 10470 9257 7042 2668 -4527 -5704 -2968
19891 -2968 -1626 -1434 545 -2828 -5892 -1371 889 -2107 -1429 2968 3617 6899 12437 16544 10383
19876 10383 8714 16899 19800 17127 10999 6300 11079 8099 4072 -371 -1130 -9692 -11462 -4344 -4058
19861 -4058 -8985 -8430 -2761 4443 8858 1797 1005 439 -8348 -7510 -10638 -8417 -4627 -3794 -5369 -3030
19845 -3030 -1347 2391 5292 3611 2157 -5970 -8580 -2116 -469 -486 -717 -1988 -1048 -7340 -7506 223
19829 223 -1735 -2394 -1958 -644 -709 3003 7357 15086 16102 16422 11799 5405 714 -4540 -3551 5379
19813 5379 5609 6277 2634 678 -3473 -9102 -3403 1530 1047 -583 5232 7564 13006 16337 6109
19798F109l979M815l00q177m594J381P394J538k92K562m233J945j561n68n656
19783c616J719N228J110n612l894K616L678o736O34J599l480M932M246K1j099
19768A346q99J124L195K378K127n53k804n699p19K806K206p10L526k056L834N278
19752A4380k265q640k570l282l304P227N935J658m34o04p75K253p756k891J29
19737i39J533M418K155k23r814l655P106l35L514O800L649m45j315o604k285K52
19721C812n277L665M008j663j15K081J441K304j466k465l758J553J678N382j998
19706I182m103k834j964j085l78J644J991J467J121j921j0862k76K677K995K169
19691a77l523O689N304m499O285O260m529l078j2462O4N200L514q123q90M217
$$ plain form
19798 6109 2130 6945 6645 -1532 -6126 -4745 2649 4187 3895 6457 2224 4169 2608 2040 -3616
19783 -3616 -1897 3331 4441 -1171 -5065 -2449 1229 -5507 -4873 -3274 -6754 -1822 2424 2445 1346
19768 1346 447 1571 4766 7144 9271 8718 5914 215 -504 2302 4508 3798 7324 5268 9102 14380
19752 14380 12115 3475 905 -2377 -5681 1546 7481 9139 8705 8101 7326 9579 1823 -1068 -939
19737 -939 594 5012 7167 6944 -2870 -6525 581 246 3760 10560 14209 13764 12449 5845 3560 3812
19721 3812 -1465 2200 6208 4545 4430 6511 7952 10256 8790 6325 2567 4120 5798 11180 9182
19706 9182 5079 2245 281 -804 -1182 462 2453 3920 5041 3120 -7742 -8018 -5341 -2346 -177
19691 -177 -3700 2989 8293 3794 10079 16339 11810 8732 -3730 -3666 1534 5048 -3075 -3965 252
19676B52M077l337k837k076M863L656o987l291M905O468O16QJ129n917r587J76
19660g882K256L204j856J909M274O395k32o340k005O950l613n485P776N266j651
19645H966L343k465q471j199j054o932L577O719Q45n375k039m497K168K534N539
19630A659L040p195K495J392J1204P955J653m497q785l127k689m398j579L920
19616A048Q944J394m476n051N20N282N96n421k913O127J747K245L52K651j106
19601A1939n554k170J64j489k051L894R563L51o957L226O376k035j5918l800q76
19586e337M562K692L827n77j80j722m312K450L541j077m990j768M639K731L321
19571G800k811k331Pj336k625m102l780r15R084k234J008j244k847P028O177J221
$$ plain form
19676 252 4329 992 -1845 -3921 942 4598 -2389 -5680 -775 5693 6309 6317 7446 1529 -8058 -7882
19660 -7882 -5626 -2422 -4278 -2369 1905 8300 8068 1728 -277 6673 3060 -2425 5351 10617 8966
19645 8966 12309 9844 1373 174 -880 -7812 -4235 2484 3329 -2046 -4085 -8582 -6414 -3880 1659
19630 1659 4699 -2496 -1 1391 12595 20550 22203 17706 8921 5794 3105 -1293 -2872 1048
19616 1048 9992 11386 6910 1859 2379 7661 8257 2836 -77 6050 7797 10042 10394 13045 11939
19601 11939 6385 4215 4379 2890 839 4733 14296 14647 7690 10916 17292 15257 -661 -4461 -5337
19586 -5337 -775 1917 5744 5167 4987 3265 -1047 1403 4944 3867 -1123 -2891 1748 4479 7800
19571 7800 4989 2658 2665 1329 -1296 -5398 -9178 -10093 -1009 -3243 -2235 -3479 -6326 702 6879 8100
19555H100M79R512Q229m219n148r444k014k319n118q12L903J610j19k126J791
19540B305l839O107Q68m625p831m966K554M680K751M5J731J61L992l022M250L971
19524I132j319L474o36r14n412L959j476j908P279l461m901Q544P469j042n625
19509A3163p129q960J430J170O113o529j0997q68J135O128J97R85J388N054q50
19494A430j055J923L451j130O41J567K71n605j797M987l928j408J978k30K540
19479C635J952n964j149R40M050m922m55o94R165J0598J275J470M155k148o08
19464B1300j1679l964L175L186l290l299J884M989l413J590J377p138n734m80
19450a496j739L575K884o5P877L16l073q092n071J435q353l682K743N926j274
$$ plain form
19555 8100 8579 18091 26320 22101 16953 7509 5495 3176 -1942 -2754 1149 2759 2640 514 2305
19540 2305 -1534 4573 5441 816 -7015 -11981 -9427 -4747 -1996 -1951 -220 -59 3933 911 5161 9132
19524 9132 7813 11287 10651 9737 4325 8284 6808 4900 12179 8718 3817 12361 19830 18788 13163
19509 13163 6034 -2926 -1496 -326 5787 -742 -11739 -12607 -11472 -5344 -5147 -4162 -2774 2280 1430
19494 1430 375 2298 5749 4619 5260 6827 7098 1493 -304 4683 755 -653 1325 1095 3635
19479 3635 5587 -377 -1526 -586 3464 -1458 -1913 -2607 6558 17156 18431 19901 24056 21908 21300
19464 21300 9621 5657 8832 12018 8728 5429 7313 12302 8889 10479 11856 4718 -1016 -1496
19450 -1496 -3235 340 3224 3159 11036 11352 8279 187 -4884 -3449 -11802 -15484 -12741 -6815 -8089
19435h089N102N868n536n043N611N687m1J079M633k31q988o248K083P741K267
19420E895j810J839J330k79L313K996l284q145l123K144K940J246o931L55k96
19405a810L88L186k917j858m480K68L155M115n79M593J566k78k008n568k86M381
19389A868O444R81m747k112J440M515J782O24j0525l397J705K435k68l86J583
19374A942P082o61l002j105k233j2599j779J3748P069q952J36L355L014J991L562
19359A1568j150j689J002j142M322j056o75K381j795j364j362K400N364L550l876
19344A6478j549P155j350k639j853k990J088r9o608K12J600O029p295l576J553
19329F156M08p019Q526K989p567k744m612k82L764n458l138M543P465N146l152
$$ plain form
19435 -8089 -2987 2881 -2655 -7698 -2087 3600 3559 4638 9271 9040 52 -6196 -4113 3628 5895
19420 5895 4085 5924 7254 6975 10288 13284 10000 1855 -1268 876 3816 5062 -1869 -1514 -1810
19405 -1810 -1422 1764 -1153 -3011 -7491 -7223 -4068 47 -532 4061 5627 5349 3341 -2227 -2513 1868
19389 1868 8312 9293 4546 2434 3874 8389 10171 10795 270 -3127 -1422 1013 745 359 1942
19374 1942 9024 8363 5361 4256 2023 -10576 -12355 1393 8462 -490 -354 3001 6015 8006 11568
19359 11568 10418 8729 9731 8589 12911 11855 11180 13561 11766 10402 9040 11440 16804 20354 16478
19344 16478 14929 22084 20734 18095 16242 13252 14340 14241 7633 7845 9445 15474 8179 4603 6156
19329 6156 6564 -455 8071 11060 3493 749 -3863 -4145 -381 -5839 -8977 -4434 3031 8177 5025
19314E025m800p202N87M655j512J703l856n4Q646k342j434L335P04p91K073l541
19298A196n87K466N567l019R96l86O08l355o37k738k031j341Q24n05j878J264
19282c556n719l36M656J0781Q405m585J962j812j0301r84K897k330n84J124K157
19267A775O611O918J928M220n864l773J336k129j632k186K204M87N613J971n427
19252A2052o237n593q857L886m37o464m40N69O214O927r15m39M215n464N363M632
19236I012K190J926n457p014O96L906k344p254L855l133k195M360J958N372K738
19221H616N786M619j0217K7p5K462j556l78o34j301L06Q441L369l294l303j234
19205A1634R065L362j0463o951K58o248k186O0p34L748J860N1M060p55j854l828
$$ plain form
19314 5025 225 -6977 -6390 -1735 -3247 -1544 -5400 -5454 3192 850 -584 2751 3455 2664 4737 1196
19298 1196 609 3075 8642 5623 6619 6233 6841 3486 2849 111 -1920 -3261 -2437 -2942 -4820 -3556
19282 -3556 -9275 -9611 -4955 5826 14231 9646 11608 9796 -505 -1489 1408 -922 -1506 -382 1775
19267 1775 8386 15304 17232 21452 15588 11815 13151 11022 9390 7204 9408 9895 15508 17479 12052
19252 12052 5815 222 -8635 -4749 -5186 -11650 -12090 -11521 -5307 1620 705 266 4481 -983 4380 9012
19236 9012 11202 13128 7671 657 1353 5259 2915 -4339 -484 -3617 -5812 -1452 506 5878 8616
19221 8616 14402 19021 8804 8831 8756 11218 9662 9284 8650 7349 7655 16096 19465 16171 12868 11634
19205 11634 20699 24061 13598 6647 6905 657 -1529 -1469 -2203 1545 3405 3456 7516 6761 4907 1079
19189A079L48J847j84k515L548N198j253J343Q062P98M833o310k770k030%L498
19173A5492l002o15m13l441l994N816k548j6888K828M09P870R40o401r38r52K498
19157c339l794j663O552Q030K364p070K788N421p96o561k924K922O780o748J377
19142C339m73M044R0j540k92j858N336L53k893K990M773j389m076L445M362M661
19126B0872N33r337p788R70L580m486m594k183L575M446r37L85j110k04J3809
19111A7531K28l232K230O71o936j1018M546M590M279Q4K253J120j1677l965L863
19096D567L896o582r6M191J456M769J258p072N57n392j957L642p143j625N762
19081B31P729L089o32O37r79k32k06n399l341L912J990K738K749o371L114K873
$$ plain form
19189 1079 1427 3274 3090 575 4123 9321 8068 9411 17473 18271 23104 16794 14024 11994 11994 15492
19173 15492 12490 11875 11462 8021 4027 9843 7295 -9593 -6765 -6356 1514 2454 -3947 -4885 -5837 -3339
19157 -3339 -7133 -8796 -2244 5786 8150 1080 3868 9289 8493 1932 -992 1930 8710 1962 3339
19142 3339 2866 6910 7000 5460 5168 3310 8646 8999 6106 9096 13869 12480 8404 11849 16211 20872
19126 20872 21405 12068 4280 5250 8830 4344 -250 -2433 1142 5588 4651 5036 3926 3722 17531
19111 17531 17759 14527 16757 17428 10492 -526 4020 8610 12889 12973 15226 16346 4669 704 4567
19096 4567 8463 1881 1785 5976 7432 12201 13459 6387 6944 1552 -405 3237 -3906 -5531 231
19081 231 7960 11049 10417 11054 10075 9843 9637 4238 897 4809 6799 9537 12286 5915 9029 11902
19065A1902M359K166r131r591l006J0717O359J56Q590J439k839M00m973j295k340
19050A2913K255n46p83J661r39l535L05L924K938K02k534o075o638J349K126M873
19034A1496L081m182k456R65k878K938O3m184R46r25L656j737P484p273l592M834
19018H236J852J762K596J572m886m121N453P520L416J274k417j1430j0246j023
19004d42m136J451J0031J1106J692m559o56j361k978o136p50K073L939K7j719
18989G582k335J108R548N916m393m132l359L429M344n649m392m272m158M097L313
18974F647M200k743o12L861j702J651k134p511k839l437K178M802L32r54J325
18959C064L850K502p056o053P759Q613k321n274j827K301k91l608p93J0383M917
$$ plain form
19065 11902 16261 18427 9296 -295 -3301 7416 13775 13931 22521 23960 21121 21521 16548 15253 12913
19050 12913 15168 14622 13839 15500 14561 11026 11331 15255 18193 18395 15861 9786 3148 4497 6623 11496
19034 11496 14577 10395 7939 8904 6026 8964 9027 4843 5789 4864 8520 6783 14267 6994 3402 8236
19018 8236 10088 11850 14446 16018 11132 7011 12464 19984 23400 24674 22257 10827 581 -442
19004 -442 -4578 -3127 6904 18010 19702 15143 14487 13126 10148 4012 3262 5335 9274 9301 7582
18989 7582 5247 6355 15903 21819 17426 13294 9935 13364 17708 12059 7667 3395 -763 3334 6647
18974 6647 10847 8104 7492 11353 9651 11302 9168 1657 -1182 -4619 -2441 2361 2693 1739 3064
18959 3064 6914 9416 2360 -3693 4066 12679 10358 5084 3257 5558 5267 1659 866 11249 16166
18944A6166J724m118n270K283Q410K763k542m156m542k948J429n81l717j762K670
18929E809L545L010M631K435k996L567K052q475n563R34p95L68j522l675J125
18914D450J185K797j514l422n924P292K719K72P091m252n153r57k164j446N547
18899F521Q76o742k049K292K808K895M339r12r077j043J6470M836m308k992J084
18884A4998N102P2Q53O44J740n602k554M01l505n285O1P173M428p430J939L342
18868A6377K23J01n072N854N33r621r591r67k576P274O311m813L549N18j0790
18853b690j399N527k369p92Q455l425k17o015j442L007O368L787K624N072J269
18838A7760K249p637l09K438n021P85L737p535n93O571K280m019o14j044k647
$$ plain form
18944 16166 17890 13772 8502 10785 19195 21958 19416 15260 10718 7770 9199 8618 4901 3139 5809
18929 5809 9354 12364 16995 19430 16434 20001 22053 13578 8015 8949 8154 8522 7000 3325 4450
18914 4450 5635 8432 6918 3496 -2428 4864 7583 7855 14946 10694 5541 4584 2420 974 6521
18899 6521 7397 655 -1394 898 3706 6601 10940 10028 951 -92 16378 21214 16906 13914 14998
18884 14998 20100 20172 21025 21669 23409 17807 15253 15654 12149 6864 6925 14098 18526 11096 13035 16377
18868 16377 16600 16701 11629 17483 18016 8395 -1196 -2163 -4739 2535 8846 4033 7582 8100 -2690
18853 -2690 -4089 1438 -931 -1723 6732 3307 3090 -2925 -4367 -1360 5008 8795 11419 16491 17760
18838 17760 20009 12372 12063 14501 9480 10265 14002 6467 5874 12445 14725 10706 10092 9048 6401
18823F401J5M674j688J597l09K770M813K932N25m865n243m310m968M048R656j626
18807A4422J980M37n627j835M46J120m331o54L565n867n915k072J243pr83Q694
18791D616L803L50N90n54R40N420J803M631M918o770j3983j343m61N964o608p444
18775d128J1485L933Q022N840N643m436p032n18n47J982N594O546L238k770j353
18760C1499n57m599j50q943n858N851L80l718N215Q422o251l536M022O8P38M345
18744B6928n358q316k038k727Q8J0411Q18J914j092p463l453Q5o879L710N190
18729A1818J740L132J300L959m058l089p33o431l390M19N734O729K765O5J858
18714B1818j816r376k045p171L889R557K671Q03L406J057j226M435k589o995J530
$$ plain form
18823 6401 6416 11090 9402 10999 10690 13460 18273 21205 21730 16865 11622 7312 2344 6392 16048 14422
18807 14422 16402 16839 11212 9377 9823 10943 6612 5958 9523 3656 -2259 -4331 -3088 -3095 -4078 4616
18791 4616 8419 8769 9359 8805 9745 15165 16968 21599 26517 19747 5764 4421 3960 9924 3316 -4128
18775 -4128 7357 11290 19312 25152 30795 26359 19327 18809 18262 20244 25838 32384 35622 32852 31499
18760 31499 30942 26343 26193 17250 11392 17243 17623 13905 19120 27542 21291 17755 21777 21845 22583 26928
18744 26928 21570 13254 11216 8489 8577 18988 19806 21720 20628 13165 9712 9797 2918 6628 11818
18729 11818 13558 16690 17990 21949 17891 14802 14069 7638 4248 4667 10401 17130 19895 19960 21818
18714 21818 20002 10626 8581 1410 5299 14856 17527 18330 21736 22793 21567 26002 23413 16418 17948
18699A7948j274n065l229P32L494L042N706J276K775q474j381L770L988O359k088
18684B7579p325n859j892n539j090M694J871K51M619P70n05j86l241k170M921
18669A6898j764j574N104j559m378m781N832K583M996K203l939j1659r790k342
18655d170J3863P623q69j841k490L360K962K074m73j358l164j65K935m092p626
18640F569K086M531j003k919n63K5L505J877k249o383j145L292j866N481P590
18625A8828k323n130m739J688J550N898j853M985J784k925l589J938K182O510
18611B4804L581o325o561K795l225l77k499j306k752L807J176k549j195P77P714
18596A7865M986m34J2092N584L421O59n980r560o854j0093l362o161k336P85j019
$$ plain form
18699 17948 16674 11609 8380 9112 12606 15648 21354 22630 25405 16931 15550 19320 23308 29667 27579
18684 27579 20254 14395 12503 6964 5874 10568 12439 12690 17309 18079 17574 17388 14147 11977 16898
18669 16898 15134 13560 18664 17105 12727 7946 13778 16361 21357 23560 19621 7962 -1828 -4170
18655 -4170 9693 17316 16447 14606 12116 15476 18438 20512 20039 18681 15517 15352 18287 14195 6569
18640 6569 8655 13186 12183 9264 8701 8726 12231 14108 11859 5476 4331 7623 5757 11238 18828
18625 18828 16505 11375 6636 8324 9874 15772 13919 18904 20688 17763 14174 16112 18294 24804
18611 24804 28385 22060 15499 18294 15069 14692 12193 10887 8135 11942 13118 10569 9374 10151 17865
18596 17865 22851 22417 34509 40093 43514 44173 38193 28633 21779 11686 8324 2163 -173 612 -407
18581d07O010O391P287K082k178p65L772M545K632N676O521j347q204m689O81
18566B8007J430j189q045L36k14J256K412k106m210n263K111Q05q55n131k861
18551F483L755J187K10l508j882O739O717P344L085o152J82n878m008k782N755
18536A7247k49p003m450l261L275J359n862M470N516Q981j72m247L448j573o58
18521A6821J311j634R14n816N762J1554K625k345o978j86L793r202j329P508M305
18506B7103q10J506L788n193j972j52M75K231J780M345q56p093J855k715n186
18491A9106O4J24J874K451k918r43k191k517k279q06K973J645O092k268m378m382
18475A1647M51M872n563p539M435K143L663n01N92O578N984p518k105L286K266
$$ plain form
18581 -407 5603 11994 19281 21363 19185 18420 22192 26737 29369 35045 41566 40219 32015 27326 28007
18566 28007 29437 28248 20203 20539 20325 21581 23993 21887 17677 12414 14525 15330 14475 9344 6483
18551 6483 10238 11425 11635 8127 6245 12984 19701 27045 30130 23978 24160 18282 14274 11492 17247
18536 17247 16998 9995 5545 2284 5559 6918 1056 5526 11042 20023 19851 15604 19052 17479 16821
18521 16821 18132 16498 17412 11596 17358 28912 31537 29192 22214 22028 25821 16619 15290 22798 27103
18506 27103 26293 27799 31587 26394 24422 24270 24745 26976 28756 33101 32245 25152 27007 24292 19106
18491 19106 19170 19294 21168 23619 20701 19758 17567 15050 12771 11965 14938 16583 22675 20407 16029 11647
18475 11647 12098 16970 11407 3868 8303 10446 14109 13608 14200 20778 26762 19244 17139 20425 22691
18460B2691J034k798K407M259J369m125L200k49O57R05n596q165m682L02L352
18445A4561M543r67k946l153K691M673J346k372l252N165L348l844p094J716L162
18430A7577J101M605N45j367n694m251L94L529Q187K706l626M51M40q320j948
18415A4329j405P377K228o555J585O985K322J061q640n547L669l974j446p82O763
18400A7970N969M58p336q635K754K272R032J1545M227l276k836k965m81P447L103
18385C9248J486j070Q25J1135Q209K442M333j130k246j0352r417L883R663R193
18371F6202J459J016K164j051m704o291j2284j643p54q86J240p622l9K064o740
18356C2131P873M949Q10k446j1535o640j837P292k710k581J701l128P63P180k345
$$ plain form
18460 22691 23725 20927 23334 27593 28962 24837 28037 27788 28445 29350 23754 15589 10907 11209 14561
18445 14561 19104 18137 15191 12038 14729 19402 20748 18376 15124 20289 23637 19793 12699 14415 17577
18430 17577 18678 23283 23828 22461 16767 12516 12910 16439 24626 27332 23706 24157 24597 16277 14329
18415 14329 12924 20301 22529 15974 17559 24544 26866 27927 19287 13740 17409 13435 11989 11207 17970
18400 17970 23939 24397 17061 8426 11180 13452 22484 34029 38256 34980 32144 29179 28698 36145 39248
18385 39248 40734 39664 40489 51624 59833 62275 66608 65478 63232 52880 43463 47346 57009 66202
18371 66202 67661 68677 70841 69790 65086 58795 46511 44868 44114 43228 44468 36846 36807 38871 32131
18356 32131 40004 44953 45763 43317 31782 25142 23305 30597 27887 25306 27007 23879 24642 31822 29477
18341B9477l506k944M864N516j031l861N490P174M684J0915O950L810O691l660
18327G0569k569n771n459N044L657k343M127L373l144o600M654L76o349q680l353
18312D7532O69r219k409o897J91l44k886k719J81P37m759q093J600N722J328K526
18296B3160j399j654L953M889n206l297Q50M787N247j801O29Q71o645o143L11
18281A8552J756L450n005p219J770M677K370N353q31K654L772K412m385j347J070
18266B9049m27m418n862J154R540L115l974M4o939m973l911K321N641N208Q779
18251C4347L346L644O325l060m661M743N264N458N914J910R591J0125J2914R470
18237A05330O200M236k757l804o742j685J092l51p53K243L076K124j0273p100
$$ plain form
18341 29477 25971 23027 27891 33407 32376 28515 34005 41179 45863 56778 63728 67538 74229 70569
18327 70569 68000 62229 56770 61814 65471 63128 67255 70628 67484 60884 65538 65914 59565 50885 47532
18312 47532 48201 38982 36573 29676 29867 29523 26637 23918 24099 24836 20077 11984 13584 19306 20634 23160
18296 23160 21761 20107 24060 28949 23743 20446 21296 26083 31330 29529 30158 31029 24384 18241 18552
18281 18552 20308 23758 18753 11534 13304 17981 20351 25704 24873 27527 31299 33711 29326 27979 29049
18266 29049 28622 24204 18342 19496 29036 32151 28177 28221 21282 16309 12398 14719 20360 25568 34347
18251 34347 37693 41337 47662 44602 39941 44684 49948 55406 61320 63230 72821 82946 95860 105330
18237 105330 111530 115766 113009 109205 102463 100778 101870 101519 100766 103009 106085 108209 97936 90836
18223I0836o010m188m528j0937l617k775m485k932n290j779L200L6o879k202J287
18208C9737P469J901r0n443r669K74Q88j907J93K008N254J07Q7K028q356n514
18192B8967M740K850J695K457J175o586m576N018L883J106m068K040j2316p842
18178A8543M794R193Q044J803j873M865m957J869L198m476n853N114k057O612
18164D4819j827J410J757m639n151m287L566J2334N838m678m827L496O359N312
18150E9482o88Q222J406n249p417r434O631N506R322R71k906k142n65l414O737
18135F6462P737j050k964N175J5636J0934P593O83M044J4654O832L991R228K0402
18121A69357J0732J7429K6598K7616L6526M7411N9549R3349J25224J77002K82406
$$ plain form
18223 90836 84826 80638 76110 65173 61556 58781 54296 51364 46074 44295 47495 47531 40652 38450 39737
18208 39737 47206 49107 49017 43574 33905 34179 35067 33160 33353 35361 40615 40722 40809 42837 34481 28967
18192 28967 33707 36557 38252 40709 41884 35298 30722 35740 39623 40729 36661 38701 26385 18543
18178 18543 23337 32530 40574 42377 40504 45369 40412 42281 45479 41003 35150 40264 38207 44819
18164 44819 42992 44402 46159 41520 36369 32082 35648 47982 53820 49142 44315 47811 54170 59482
18150 59482 58794 67016 68422 63173 55756 46322 52953 58459 67781 68752 65846 63704 63139 59725 66462
18135 66462 74199 73149 70185 75360 90996 101930 109523 110206 114250 128904 135736 139727 148955 169357
18121 169357 180089 197518 224116 251732 288258 335669 395218 488567 613791 790793 1073199
18110A073199L91748M95550O20680P92028R63114J085047R89173M24262k05030
18101F629771o45669q85610r67244r21279p96825o34489m48234k98776k06532
18092H25113j40931j09488q5702n6014n1390l8343l7918m0215k8036j7593j3763
18081B05720j7595j5099j1567j8525j0330o089n374n168l519j850n747j0117n124
18068H9616m58q475p953j497L954l286N838J526K799k985l724j730j235K90o83
18053G1997l748l901R35K727n344n250J917j500k990L244k837j37j628j427L000
18038E5058l715k354k264Q92M235L745m156p806n910N078L545m3L668R12l884
18023D7001q285J4907K508n907m466K883l157l464J265Q880O980K325L716r39
$$ plain form
18110 1073199 1464947 1960497 2581177 3373205 4336319 5421366 6410539 6834801 6629771
18101 6629771 5984102 5098492 4131248 3209969 2413144 1778655 1330421 1031645 825113
18092 825113 684182 574694 488992 432978 381588 343245 305327 265112 237076 219483 205720
18081 205720 188125 173026 161459 142934 132604 126515 121141 115973 112454 110604 104857 94740 89616
18068 89616 89158 80683 72730 71233 75187 71901 77739 79265 82064 79079 75355 73625 72390 72680 71997
18053 71997 68249 64348 65283 68010 62666 57416 59333 57833 54843 58087 55250 55113 53485 52058 55058
18038 55058 51343 48989 46725 47617 51852 55597 51441 43635 37725 42803 46348 46305 49973 50885 47001
18023 47001 38716 53623 56131 50224 45758 48641 45484 42020 43285 52165 59145 61470 65186 64247
18009F4247o529J343O210l644o633N728o91m305n76n23J2671J1839N768o282m824
17994G3799l463j715k859n246J918p396m46n36o649q201J385O911J0773n93o508
17979E1174Q79j060m630P034n19n964o292p891k18P995K468R930n07l920p331
17964D1148L390M229n15J526j201Q56J564J567J429M00k55l421j533L106j165
17949E1125m876J421M059P707M551j436n721o927P654N734n418q517N993P098
17935F2447o006n063j55L269L617J2P58L965N521K950l946r68k616k280O426O988
17919G4919M109J936K853R186J966J744Q136J5587J7643K5683L3194K6989L8834
17906B62779N2662N5586M5610M2102K8703J3351O270Q74o874k621o354m863R650
$$ plain form
18009 64247 57718 59061 65271 61627 54994 60722 60031 55726 55150 54627 67298 79137 84905 78623 73799
17994 73799 70336 68621 65762 60516 62434 55038 54592 54056 47407 39206 40591 47502 58275 57682 51174
17979 51174 52053 50993 46363 53397 52878 46914 40622 32731 32513 40508 42976 52906 52399 48479 41148
17964 41148 44538 48767 48252 49778 48577 49433 50997 52564 53993 54393 54138 50717 49184 52290 51125
17949 51125 46249 47670 51729 59436 63987 62551 56830 49903 57557 63291 57873 49356 55349 62447
17935 62447 56441 51378 51223 54492 58109 58121 58879 62844 68365 71315 67369 66401 63785 61505 67931 74919
17919 74919 79028 80964 83817 93003 94969 96713 104849 120436 138079 163762 196956 223945 262779
17906 262779 315441 371027 416637 458739 487442 500793 507063 507937 501063 498442 492088 487225 496875
17893D96875J0958K0546J8186K470J12j4266k0796k1028k4503k6841l2772l2542
17881C76399k7462k9231l5417k8200k4183k5791k1075j6119j0919j1176j0661
17870A36165o451J0871J2258J2076K0701J8431J1739K2510L2574L8190L6557L8900
17858C84521L5662M4359M5790M9190L1238J5815q92j8891m0893l9931l0953m4897
17846D30118n8076m7670l0853l5956l9331l2525k5083j2101j3198j1648o142j0283
17834A07252p53p11m233K028l319k357R723p36j105M016L981o256m17J1446J843
17819A20402M934M843J6071J2598J5356J3627J4103J6136J7646O470P232O219
17807B55637O928n10P763P560o923J622L731m436k820o33m755j0595j5375r124
$$ plain form
17893 496875 507833 528379 546565 549035 549147 534881 514085 493057 468554 441713 408941 376399
17881 376399 348937 319706 284289 256089 231906 206115 185040 168921 158002 146826 136165
17870 136165 129714 140585 152843 164919 185620 204051 215790 238300 270874 309064 345621 384521
17858 384521 420183 464542 510332 559522 590760 606575 605683 586792 545899 505968 475015 430118
17846 430118 372042 324372 293519 257563 218232 185707 160624 148523 135325 123677 117535 107252
17834 107252 106499 105788 101555 103583 100264 97907 107630 106894 105789 109805 113786 107530 107113 118559 120402
17819 120402 125336 130179 146250 158848 174204 187831 201934 218070 235716 242186 249418 255637
17807 255637 262565 262055 269818 277378 270455 272077 275808 271372 268552 267919 263164 252569 237194 228070
17793B28070j5491k3732j9608k5428j3380m564n152j3954j1737p468j201M68q29
17780H5994N66o884L129J497q63j031r733m323N639L801r876o167L228L618N717
17765G4312O01O78L306L167K291r67j540n402N287L109J3344M444O471J616m168
17750A06549k908p08k008j935Q282O060N099L966k61o993n428n752M648J688r520
17735A00779o840q173r132q914k030n40J393L766P328P089j021j164J102K810
17721H6453r36j159K05O034K105j482J1206m822l631J159l578p977m141O842N34
17706H6812O74O069P080L81k288p244m828j309l887m49r08k413J297r810j211
17691F7966O856k538j835k712j0348n30J6454R144K535K699k311J544M09J0355
$$ plain form
17793 228070 212579 188847 169239 143811 130431 125867 120715 106761 95024 87556 86355 86823 85994
17780 85994 86560 79676 82805 84302 83439 82408 72675 68352 73991 77792 67916 61749 64977 68595 74312
17765 74312 74913 75591 78897 82064 84355 83388 81848 76446 81733 84842 98186 102630 109101 110717 106549
17750 106549 103641 102933 100925 98990 107272 113332 118431 122397 122136 115143 109715 103963 108611 110299 100779
17735 100779 93939 85766 76634 67720 65690 65150 66543 70309 77637 84726 83705 82541 83643 86453
17721 86453 85517 84358 84563 90597 92702 91220 102426 97604 93973 95132 91554 83577 79436 86278 86812
17706 86812 87486 93555 100635 101016 98728 91484 86656 85347 81460 81011 80103 77690 78987 69177 67966
17691 67966 74822 72284 70449 67737 57389 56859 73313 82457 84992 87691 85380 86924 87333 97688
17677I7688L249o95K160N152J922l409l003k9O723M277K218o859L416o902p891
17662I8017p986m875Q96j578p83O2m67j14l801m498J207K511Q797K718k344p21
17646H7041o448n387J218J2554J6142Q494O243k934O808J1692o77O169k220o65
17632A38030k528M364O420n917r743n062L9M909l41n244J269J1573J3795Q261
17618A59825Q674J4602J2336O931j468k708o686n548l111q257o801q950q835q030
17604A41974K765J654J13r07M91j171M6o107K322J209k451l177K57k256j960P
17588A32809K869J380L510R780J0202j422M735L396K014j662k426J410K813P531
17574A76939J1017K675K466j716N931K0268J9221J0210L563L985P435P650M369
$$ plain form
17677 97688 100937 100242 102402 107554 109476 106067 103064 103035 109758 114035 116253 109394 112810 105908 98017
17662 98017 90031 85156 86052 84474 83691 83753 83286 83172 79371 74873 76080 78591 87388 90106 87762 87041
17646 87041 80593 75206 76424 88978 105120 113614 119857 116923 123731 135423 134746 140915 138695 138030
17632 138030 135502 139866 146286 140369 130626 125564 125603 130512 130171 124927 126196 137769 151564 159825
17618 159825 168499 183101 195437 202368 200900 198192 191506 185958 182847 174590 167789 158839 150004 141974
17604 141974 144739 146393 146506 145599 146090 144919 144965 138858 141180 142389 139938 136761 137018 134762 132802 132809
17588 132809 135678 137058 140568 150348 160550 159128 163863 167259 169273 167611 165185 166595 169408 176939
17574 176939 187956 190631 193097 191381 197312 217580 236801 247011 250574 254559 261994 269644 274013
17561B74013o381j3420j2230j1799r677L84L118k023j5307j0329m003j0266m195
17548A77885J736P397P040k754l624O998J1916O53L234K1164J6803J8189J7881
17535B84518J5608P462j100m177l694n972K014oL082O836k512J951J0790K0977
17521C35777K1522J6826J7949J7504Q704J7684L0978L4616K7974K5401K9712K8525
17509F13172L6467K9761J3500L721N289R368J1300J2801J2288K5410L3690K4905
17497H31672J0964k0125l7297m2292m9999m9959m8037m2681k8761k1260j5051
17486D87174o113J5223K4163K1398J2135J6640K2137J3347j480l547r399j4758
17474E76920r921l633n598O392J4091J9804J4083K0830K6630K6028J6267J9648
$$ plain form
17561 274013 267632 254212 241982 230183 220506 220890 224008 221985 206678 196349 192346 182080 177885
17548 177885 179621 187018 194058 191304 187680 194678 206594 207247 210481 231645 248448 266637 284518
17535 284518 300126 307588 306488 302311 298617 292645 294659 294653 297735 304571 302059 304010 314800 335777
17521 335777 357299 374125 392074 409578 418282 435966 466944 501560 529534 554935 584647 613172
17509 613172 649639 679400 692900 696621 701910 711278 722578 735379 747667 773077 806767 831672
17497 831672 842636 822511 785214 742922 692923 642964 594927 552246 523485 502225 487174
17486 487174 481061 496284 520447 541845 553980 570620 592757 606104 604624 601077 591678 576920
17474 576920 566999 563366 557768 564160 578251 598055 612138 632968 659598 685626 701893 721541
17462G21541Q245o728j3727k0636k1760j8934j3640j4233k626J3036J2649J3788
17450F56975K5051L3603K6809J7229J8869K3180K1808K5123K7515L3402K5390
17439I34954K2554K8781L9009M2757N1666N8476N6739N5346O2408N3254M1079
17428A447023L6584K4367L1525L4937L3791N1420P4443Q6958J03020J09621R4918
17417B128607J01800R7456R2698J02086J26026J57091K02971K71809L58003M60629
17407D099176O16877Q04598R96485J202233J480326J780457K019813J931975J333004
17398A6264944Q03310N60455N54614O53799Q03374J188505J844973K676933L482267
17389B8833174M313094N169766N765640O110751O377175O305021N947035M959434
$$ plain form
17462 721541 729786 723058 709331 688695 666935 648001 634361 620128 617502 630538 643187 656975
17450 656975 682026 715629 742438 759667 778536 801716 823524 848647 876162 909564 934954
17439 934954 957508 986289 1025298 1068055 1119721 1178197 1234936 1290282 1352690 1405944 1447023
17428 1447023 1483607 1507974 1539499 1574436 1608227 1659647 1734090 1821048 1924068 2033689 2128607
17417 2128607 2230407 2327863 2420561 2522647 2648673 2805764 3008735 3280544 3638547 4099176
17407 4099176 4716053 5520651 6517136 7719369 9199695 10980152 12999965 14931940 16264944
17398 16264944 17068254 17628709 18183323 18837122 19640496 20829001 22673974 25350907 28833174
17389 28833174 33146268 38316034 44081674 50192425 56569600 62874621 68821656 73781090
17381G3781090L467098K511074J790889P58596k62296j039663j547863k141153
17373G7317772l349816m820157n742576o345432o834793o851032o356677n518808
17365C1498481m493519l411809k407894j524230o94887J11974R48294J948714
17357B1975124L224327M794551O429364Q124454J0314868J3027677J5779569J7165090
17349A00835024J4608307R535351O074382M534569L889690K157447q17089l124238
17341A37693443m410245n895620p401850p921827p913655p501977o545429n535382
17333H4567458m494357l781906m147635m999814n633670o215667o800001o937909
17325D1556499o595872n929640n051036m104608l252658k540076j945730j497654
$$ plain form
17381 73781090 77248188 79759262 81550151 82308747 82046451 81006788 79458925 77317772
17373 77317772 73967956 69147799 63405223 57059791 50224998 43373966 37017289 31498481
17365 31498481 27004962 23593153 21185259 19661029 18966142 19078116 20026410 21975124
17357 21975124 25199451 29994002 36423366 44547820 54862688 67890365 83669934 100835024
17349 100835024 115443331 124978682 131053064 135587633 139477323 141634770 140817681 137693443
17341 137693443 133283198 127387578 119985728 112063901 104150246 96648269 90102840 84567458
17333 84567458 80073101 76291195 72143560 67143746 61510076 55294409 48494408 41556499
17325 41556499 34960627 29030987 23979951 19875343 16622685 14082609 12136879 10639225
17317A0639225j172287r51299p80383o45327n39211m67594m13583l56147l21624
17308D991770k81519k53030k28584k03488j68504j35531r0308o0249k0133K3740
17298C574164R0019J71684K59927L64580M75564N81722O56612O87481O35069M38304
17288G935126K50078R5572n5103j35959j45640j26295p9151j00660k35684l64371
17278G037913m82100o21420p22396p54896p08136o21036n14997m14275l15799
17269A882858k32502j73090j30144j06686r1888p1163n4915n6961m8540n0181
17259H66788m6065m9129m2883l9709l4115l1855k7519l2318l5960l0457k6592
17248D70186k3351k5154k4795l4616l0279k3139j9445j4839n699o299q686j3677
$$ plain form
17317 10639225 9466938 8515639 7735256 7089929 6550718 6083124 5669541 5313394 4991770
17308 4991770 4710251 4457221 4228637 4025149 3856645 3721114 3630806 3570557 3550424 3574164
17298 3574164 3664183 3835867 4095794 4460374 4935938 5517660 6174272 6861753 7496822 7935126
17288 7935126 8185204 8280776 8225673 8089714 7944074 7817779 7738628 7637968 7402284 7037913
17278 7037913 6555813 5934393 5211997 4457101 3748965 3127929 2612932 2198657 1882858
17269 1882858 1650356 1477266 1347122 1240436 1148548 1077385 1022470 965509 916969 866788
17259 866788 820723 771594 728711 689002 654887 623032 595513 563195 527235 496778 470186
17248 470186 446835 421681 396886 362270 331991 308852 289407 274568 268869 262570 253884 240207
17236B40207j1940q827q379p695o248K271M18m883n731L21J789q967m928j0993
17222A66415p434P25n649j4477j3209j6451q658n640j0747N96N125o677n941k721
17208G5257k817l403n745L764K65K965O343O742J777q696r19J0623R142L129K144
17193A00571N90K017j843k941l367j723K02j629n495K10O91m840n649n35j1148
17178F5111n924l995m979n001L71k637l054j2448r551l803l204j1705l572P625
17164C234q23N61L650P31k471J70K551m15L032R026K804K487P229N242k275N911
17148D0644J0629J317J536K353m004o048J2669Q631n906m464j281m185k287m874
17134D4730l277K881k958m053p296k958p37N14m472n621m277m146r654r719j103
$$ plain form
17236 240207 228267 219440 211061 203366 197118 199389 199807 194924 189193 189514 191303 182336 177408 166415
17222 166415 158981 159706 154057 139580 126371 109920 101262 95622 84875 85471 90596 83919 77978 75257
17208 75257 72440 69037 63292 67056 67321 70286 76629 83371 85148 76452 75533 86156 95298 98427 100571
17193 100571 101161 103178 101335 98394 95027 93304 93506 91877 86382 86592 87283 82443 76794 76259 65111
17178 65111 59187 55192 50213 45212 45583 42946 39892 27444 17893 14090 10886 -819 -4391 3234
17164 3234 2411 2972 6622 7353 4882 5052 7603 7188 10220 19246 22050 24537 31766 37008 34733 40644
17148 40644 51273 52590 54126 56479 52475 46427 59096 67727 61821 57357 56076 51891 49604 44730
17134 44730 41453 44334 41376 37323 30027 27069 26332 26846 22374 16753 12476 8330 -1324 -11043 -12146
17119a2146j385R543O874j148n847j197R85m300J499j707m592P913L37k211j211
17104h593l769m624N572K349K839R796j0966k977Q207R585L265m266K973N113
17090A4504N552P30M571j122L15k001j28O563M462r225k220r99O925k012q075
17075A7840K017J0469l23K367L431K786M298l041m571m754l492m794J302l089
17061B0446J245L570J184o142p000k518r617p040K10J012n579k374K535P203K563
17046c02j677R04L298O497M316k435k768k535j434L701P819L680Pn130m222K305
17030A2024O732k441m979l482K997O181O279l068j0893l410j819l160N561J608
17016H130j099M443J0694N053K214p770k864o90k930m675M28M88O25N411M23M94
$$ plain form
17119 -12146 -13531 -3988 2886 1738 -4109 -5306 -4321 -8621 -7122 -8829 -13421 -5508 -5171 -7382 -8593
17104 -8593 -12362 -16986 -11414 -9065 -6226 3570 -7396 -10373 -2166 7419 10684 6418 9391 14504
17090 14504 20056 20786 25357 24235 24550 22549 22421 28984 33446 24221 22001 21002 27927 25915 17840
17075 17840 19857 30326 30003 32370 35801 38587 42885 39844 35273 30519 27027 22233 23535 20446
17061 20446 21691 25261 26445 20303 13303 10785 1168 -5872 -5662 -4650 -10229 -12603 -10068 -2865 -302
17046 -302 -1979 -1075 2223 8720 13036 10601 7833 5298 3864 7565 15384 19064 19071 13941 9719 12024
17030 12024 18756 16315 11336 7854 10851 17032 23311 20243 9350 5940 4121 961 6522 8130
17016 8130 7031 11474 22168 27221 29435 21665 18801 18111 15181 10506 10934 11422 12047 17458 17881 18375
17000A8375P39K27M492M452j671o478L24l096j539O172K716j071m207k407o444
16985A0584j063J844O747J123j0440p9J301P233O737r625q600L21J603M355j336
16970A0705q141M3k571K869J7k154j645L146m125l577o03j883Q785J476J654J904
16954E900m656k537J315k050o089N006K197k421K239j52l467m592M546r31J341
16939d351J333L187o10q00K176M421k326o259k737k38j56O131N993l266k54n052
16923b808p48m405k879K019P224M541N5l49n433M457j337k026Q597k5r169j137
16907c423K265l14l822P965P177m146J909O905J929p225Q22j714L557l003L28
16892I210L697N460j845k48m638o04M553O065L385M557O427J2514Q637J436J0496
$$ plain form
17000 18375 19114 19341 23833 28285 26614 20136 20460 17364 15825 21997 24713 23642 19435 17028 10584
16985 10584 9521 11365 18112 19235 8795 8716 10017 17250 23987 14362 5762 6083 7686 12041 10705
16970 10705 2564 2607 36 2905 2922 768 -877 2269 -1856 -5433 -6036 -7919 866 2342 3996 5900
16954 5900 1244 -1293 22 -2028 -8117 -3111 -914 -3335 -1096 -1248 -4715 -9307 -4761 -5692 -4351
16939 -4351 -3018 169 -441 -1241 935 5356 3030 -3229 -5966 -6204 -6360 -229 5764 2498 2244 -2808
16923 -2808 -3556 -7961 -10840 -8821 -1597 2944 2999 2650 -2783 1674 337 -1689 6908 6883 -2286 -3423
16907 -3423 -1158 -1472 -5294 2671 9848 5702 7611 14516 16445 9220 10042 8328 11885 8882 9210
16892 9210 12907 18367 16522 16274 11636 11032 15585 21650 25035 29592 36019 48533 57170 58606 69102
16877F9102J6422K0225K8958L3581L3276L8314M7294L7836L4555L8957L1329K1280
16865D51129K0363L0826L6046M1597M7978N3087L7436K5352N573k1349m3099o6789
16853F18150p1471o9607n7026m5445l8357k8441j7855o013Ro342j1785j3366J628
16840B54079M535r028l877n835j3307o511L532M397j1076j9563j4753j9068k2245
16827A41280r466j3373j4162o664p368j0697n511m068J339L564N298J0657J6278
16814A07107K5069L9714M7388L8109L5731L2973J4950J002r102k6981m1498l1748
16802B32714k6653k1764j7007p454n191L534P357J0543Q641n242n119L205J462
16789A79026J161p185n621N459K100J94l504k697J044j0899j4681k0369j6567
$$ plain form
16877 69102 85524 105749 134707 168288 201564 239878 287172 325008 359563 398520 429849 451129
16865 451129 471492 502318 538364 579961 627939 681026 718462 743814 749387 728038 684939 618150
16853 618150 546679 477072 420046 374601 336244 307803 289948 283935 283944 277602 265817 252451 254079
16840 254079 258614 249586 245709 239874 226567 220056 223588 227985 216909 197346 182593 163525 141280
16827 141280 131814 118441 104279 97615 90247 79550 74039 69971 71310 74874 80172 90829 107107
16814 107107 132176 171890 219278 257387 293118 326091 341041 342043 332941 305960 264462 232714
16802 232714 206061 184297 167290 159836 154645 158179 165536 176079 184720 179478 174359 177564 179026
16789 179026 180187 173002 167381 172840 174940 175134 171630 168933 169977 159078 144397 124028 107461
16776A07461j1687j9234j8326j2406j1366k343R68p075p015p930N500j228n354
16763I965j149M092K71L77M477n672o571n506R76N995N425M198m264j111j672
16748I831k29m870j119m099j564j332J193L096o818o472R53r11j089k349O940
16733h839J097Q60l022P860Q008N03l616J170J343p364o752L49J629M598N068
16718B892j668M904O427k632K614O307J129j021k288k125N29q260J225m960l649
16703e76m003o74L714M325L408j029j889N838n70j0212q148L245K240l871L45
16688g857l0k314k10r13k909P796R286k780n687P562Q827m313p045r87N864N297
16672I587L614N994J318L238J723J328k293l546q50J486n152k015P176m093l1
$$ plain form
16776 107461 95774 76540 58214 45808 34442 32099 33067 25992 18977 11047 16547 15319 9965
16763 9965 8816 12908 13179 13556 18033 12361 5790 284 1260 7255 12680 16878 12614 11503 9831
16748 9831 9602 4732 3613 -486 -2050 -3382 -2189 907 -5911 -12383 -11430 -12341 -13430 -15779 -8839
16733 -8839 -7742 -6882 -9904 -2044 5964 6467 2851 4021 5364 -2000 -8752 -8403 -6774 -2176 2892
16718 2892 1224 6128 12555 9923 12537 18844 19973 18952 16664 14539 15068 6808 8033 3073 -576
16703 -576 -4579 -5253 -1539 2786 6194 5165 3276 9114 8544 -1668 -9816 -6571 -4331 -8202 -7857
16688 -7857 -7887 -10201 -10411 -11324 -14233 -6437 2849 69 -5618 1944 10771 6458 -587 -1574 4290 9587
16672 9587 13201 19195 20513 23751 25474 26802 24509 20963 20113 21599 16447 14432 21608 17515 17484
16657A7484p91j321r43J135m762n017J42L434N382M453K445k27o0N928M964N089
16641C7335j42k984m002N06k658k006q99o923k923K786K917l23L005R61j367N523
16625B8806O932Q947K681J0733O451J0748J2312K0057K6142M0867N4006O8373
16613B97055R7695J29774J45920J88248K29027K51733K30536J07860l9032j36085
16603A502731j95076k22890k21253k06205j72252j24247p8760n2279m4867l5867
16593A49035k4001j2459j4279j8617o977o732k722m520n530j643K425k587m821
16580D6572j966K049l864P45L161p45q70n888J258R613p017q576n076J910m588
16565B6718j341k740L34l513m806k930j0R130K426q384K28j508l98Q134o609p120
$$ plain form
16657 17484 16693 15372 14429 15564 10802 5785 5927 9361 14743 19196 21641 21414 21354 27282 32246 37335
16641 37335 37193 34209 30207 30713 28055 26049 25150 18227 15304 18090 21007 20684 23689 24650 23283 28806
16625 28806 35738 44685 47366 58099 64550 75298 87610 107667 133809 174676 228682 297055
16613 297055 394750 524524 670444 858692 1087719 1339452 1569988 1677848 1638816 1502731
16603 1502731 1307655 1084765 863512 657307 485055 360808 282048 229769 184902 149035
16593 149035 125034 112575 98296 79679 72702 65970 63248 58728 53198 51555 53980 51393 46572
16580 46572 44606 46655 42791 43536 46697 45952 45082 39194 40452 50065 43048 34472 29396 31306 26718
16565 26718 25377 22637 22971 19458 14652 11722 11712 20842 23268 14884 15112 13604 13206 21340 14731 7611
16549G611M731K440O724O637J687j273L139J0221N382k446j071j296k778k903
16535C6805J624m305J201k096k537r71o919p986j660M549J2186J0493L673q097
16521C5960p303k391m286l186K13K936O485N496q81J073J97j810k469l247k446
16506B4341k333q9q30k495k597P785j32N02L37p283l694j054j138k200m895O957
16490A1182M900M68M964k948k200J347R1L901l670k08Q335k16j570M970O33o895
16474B3084k094K83J85n591J275l91j011n849j172K616P635N247K482j072Q57
16459B6484r25K027J874m06k348L551O341j900L867M649l860p945M301R49M36
16444C7095n014L382K584o400P63N740n137L22K929K627j968k86R117k622j896
$$ plain form
16549 7611 12342 14782 21506 28143 29830 28557 31696 41917 47299 44853 43782 42486 39708 36805
16535 36805 38429 34124 35325 33229 30692 29721 22802 14816 13156 17705 29891 40384 44057 35960
16521 35960 28657 26266 21980 18794 19007 21943 28428 33924 33043 34116 34313 32503 30034 26787 24341
16506 24341 22008 21919 21089 18594 15997 23782 23650 24152 24489 17206 13512 12458 11320 9120 4225 11182
16490 11182 16082 16550 21514 18566 16366 17713 17804 21705 18035 17827 26162 25946 24376 29346 29979 23084
16474 23084 20990 21273 21458 15867 17142 16751 15740 9891 8719 11335 18970 24217 26699 25627 26484
16459 26484 25559 27586 29460 29054 26706 30257 36598 34698 38565 43214 39354 31409 35710 36659 37095
16444 37095 32081 35463 38047 31647 32410 38150 33013 33335 36264 38891 36923 36637 45754 43132 41236
16429D1236J005J076M66O00r300m029L28N375l598j0804j2887m662J84l448Q11
16414B353L075J707k614O274O088J643O559M940J105L862L011k18r08j036P70
16399C6611J581j620j800N549l96m904K780R11N131Q23N248M508j01J878l38q002
16383D7859j1064L422K534n175p227K689o10n968j2962o400l85o38l169N116N897
16368A3919Q966J2241P358l88J537K072O756R957Q04q857l512M403J3500J3784
16354H2540l914l981N866p42m370q856o329j730m241j830p219j3231j1485r483
16340A0995j491l759o05Q297O068Q767P595r687q20j083l776O35L459n245k046
16325A7304m058n53k764L718K881R197R986L854P562J0816N274l479k369O797
$$ plain form
16429 41236 42241 43317 43783 44383 35083 31054 31382 36757 33159 22355 9468 4806 4990 1542 2353
16414 2353 5428 7135 4521 10795 16883 18526 25085 30025 31130 34992 38003 37785 36877 35841 36611
16399 36611 38192 36572 34772 40321 39925 35021 37801 38712 43843 44666 49914 54422 54321 56199 55861 47859
16383 47859 36795 40217 42751 37576 30349 33038 32428 26460 13498 7098 6713 6075 2906 8022 13919
16368 13919 22885 35126 42484 42096 43633 45705 52461 62418 63222 54365 50853 55256 68756 82540
16354 82540 78626 74645 80511 79769 75399 66543 60214 58484 54243 52413 45194 31963 20478 10995
16340 10995 9504 5745 5140 13437 19505 28272 35867 26180 25360 24277 20501 21136 24595 19350 17304
16325 17304 13246 12693 9929 13647 16528 25725 35711 39565 47127 57943 63217 59738 57369 64166
16311F4166P243K858q194J826j768n07j905m279J902Q72J1421O961K762J0222
16297I3580J2376K97M461J7004K567N57M359K008j469m324J685l660j3334k285
16283A13822j804o725q86J465l076l706j846L585K26j216r045j3237q573r558
16269E9426r993m253K369m71j7501q719O54m33j0187l305k647p88K740L022Q711
16254A8625J0003J0001P028J0835J8167J5975J5821J6861J7492J4092J3673L294
16242A71867m839o76O451N611k25k338o21J3380J8115J1991J8249K1786K7905
16229B86656L2150M5655M5682M0852L822j8880l4289l4769l5366l4160l7017m0487
16217B19849l6809k4288m206l965j176J5546K8440J8589J8553K5351J7477K889
$$ plain form
16311 64166 71409 74267 66073 67899 66131 65624 63719 59440 61342 62214 73635 80596 83358 93580
16297 93580 105956 106253 110714 127718 130285 130842 135201 137209 135740 131416 133101 129441 116107 113822
16283 113822 112018 105293 104407 105872 102796 99090 97244 100829 101055 99839 90794 77557 68984 59426
16269 59426 49433 45180 47549 47078 29577 20858 21512 21079 10892 7587 4940 4152 6892 9914 18625
16254 18625 28628 38629 45657 56492 74659 90634 106455 123316 140808 154900 168573 171867
16242 171867 167028 166352 172803 178414 178189 175851 175230 188610 206725 218716 236965 258751 286656
16229 286656 318806 364461 410143 450995 454817 435937 401648 366879 331513 297353 260336 219849
16217 219849 183040 158752 154546 150581 149405 164951 193391 211980 230533 255884 273361 276250
16205B76250k663q268j0968r479j4627j1936o080l689M206L564q847p307Q388
16192B08544J8312Q761k364j289n472j3827q906m865k357k754m855m547j084K249
16178A85546R721J1200R243L060O135O528Q325J3016J0321L299P806R120M608
16165B87928K110L128K59l165l96K481p69m225p102M845Q598O984P600K1604J4778
16150C44658J5213J1346L188q392o737p764p035o335j4025q600j508J2756L5571
16137C62336K7781L2181L1130K7297L3404K9979K8983J8120J2653J4113K0820
16126F38797K0782K1551K2940K4645K5533K3723K3170K5520K5151K3901K0472
16115H96185J7354K9374M2669M2699N2462O5667Q1618R5381J02818J04930R6075
$$ plain form
16205 276250 273587 265319 254351 244872 230245 218309 212229 208540 212746 216310 207463 200156 208544
16192 208544 226856 235617 233253 231964 226492 212665 203759 198894 196537 193783 188928 184381 183297 185546
16178 185546 195267 206467 215710 218770 224905 231433 239758 252774 263095 266394 274200 283320 287928
16165 287928 290038 293166 293425 290260 289864 292345 291576 287351 280249 285094 293692 300676 308276 329880 344658
16150 344658 359871 371217 374405 366013 359276 351512 344477 338142 324117 315517 314009 326765 362336
16137 362336 390117 422298 453428 480725 514129 544108 573091 591211 603864 617977 638797
16126 638797 659579 681130 704070 728715 754248 777971 801141 826661 851812 875713 896185
16115 896185 913539 942913 985582 1028281 1080743 1146410 1228028 1323409 1426227 1531157 1627232
16104A627232R5964R3453Q6076Q0291P3240M7902L9522N9946Q9424J12429J27349
16093B532828J29132J32853J46044J79515K01692K18320K41189K58899K97576
16084D338048L46758M06396M66583N45815O48386P94991R86385J257417J619446
16075A1410225K061600K643774L467614M737915O699265R647794J3912046J8814125
16067G3394358K3182612K8160802L4539403M1006626M4796103L8628887J5557232
16060B99266023q255953k5223481l5266250l9695325l8969344l4606806k8343846
16053H8905018k1245070j4919795j0557131p777800n890232m527251l505570k744423
16045A7737746k195853j798145j492883j268007j102393r47071q31362p50695
$$ plain form
16104 1627232 1723196 1816649 1902725 1983016 2056256 2104158 2143680 2203626 2293050 2405479 2532828
16093 2532828 2661960 2794813 2940857 3120372 3322064 3540384 3781573 4040472 4338048
16084 4338048 4684806 5091202 5557785 6103600 6751986 7546977 8533362 9790779 11410225
16075 11410225 13471825 16115599 19583213 24321128 31020393 40668187 54580233 73394358
16067 73394358 96576970 124737772 159277175 200283801 245079904 283708791 299266023
16060 299266023 291010070 265786589 230520339 190825014 151855670 117248864 88905018
16053 88905018 67659948 52740153 42183022 34405222 28514990 23987739 20482169 17737746
16045 17737746 15541893 13743748 12250865 10982858 9880465 8933394 8102032 7351337
16037G351337o67665n86002m95966m22369l57960l01063k56760k35655k23796
16028C804101k21321k12900k19421k24745k27849k13592j99869j91002j79261
16019A914141j59033j28557r6474p4194m4837k9033k9402l4540l4493m2853m8979
16008A191746n4256o3868o9309n7385n0167m3100m5983m1334l8315l7979l3498
15997F56552l2531k8734k4648k9493k3862j7900j1812p200j0094n909l165P8L749
15984D65031N095K755l891j0254j7536k0600l6258m2226l8201k3013j6529j1845
15972B52528L58m92m645J1018M025m024o89q568j3555j3131j0453j2504j5988
15959A83880j1360j1665m842k308p100l312o299K164J164k106N31K533r76j809
$$ plain form
16037 7351337 6683672 6097670 5601704 5179335 4821375 4520312 4263552 4027897 3804101
16028 3804101 3582780 3369880 3150459 2925714 2697865 2484273 2284404 2093402 1914141
16019 1914141 1755108 1626551 1530077 1455883 1411046 1382013 1352611 1318071 1283578 1240725 1191746
16008 1191746 1137490 1073622 1004313 946928 896761 853661 807678 766344 728029 690050 656552
15997 656552 624021 595287 570639 541146 517284 499384 487572 480372 470278 464369 461204 461282 465031
15984 465031 470126 472881 468990 458736 441200 420600 384342 342116 303915 280902 264373 252528
15972 252528 252886 252394 247749 258767 262792 258768 258079 249511 235956 222825 212372 199868 183880
15959 183880 172520 160855 156013 153705 146605 143293 136994 139158 140322 138216 138747 141280 140304 138495
15945A38495j285j514M194j013n127p75j123l998p696j4277j0077n962j2765j9217
15931E7860o844J0282L882o888Kj088R63K809L256J1164N882J41k017M071k528
15916H0947L710O102j309L527O016Q714N595O470O608K987j8767k4619j7348j5962
15902E2671j9315j3464j0786J24Q09l104M8l52q39l124k285q855j1656j567Q956
15887a2739O179m395m738m676m479k965o961l602N502J4753N957R206O753J1559
15873A5354K5704K1995J7088n293P108J8214M967M798M068L574l025l179l760
15860A07613o120j2997q385o414j0637j436M151j4960j2150k067m948j4743r011
15847G896N674M118o896r662p106j198n300k083l488p590l617q667q292o412q112
$$ plain form
15945 138495 137210 135696 139890 138877 133750 132975 131852 127854 120158 105881 95804 89842 77077 57860
15931 57860 51016 61298 65180 58292 58294 57206 58169 60978 64234 75398 81280 81421 79404 83475 80947
15916 80947 84657 90759 89450 92977 98993 107707 113302 119772 126380 129367 110600 85981 68633 52671
15902 52671 33356 19892 9106 9230 10039 6935 6983 6631 5792 2668 383 -8472 -20128 -21695 -12739
15887 -12739 -6560 -10955 -15693 -20369 -24848 -27813 -34774 -38376 -32874 -18121 -12164 -2958 3795 15354
15873 15354 41058 63053 80141 74848 81956 100170 105137 109935 114003 117577 114552 111373 107613
15860 107613 101493 88496 80111 73697 63060 61624 65775 50815 38665 36598 31650 16907 7896
15847 7896 13570 17688 10792 1130 -5976 -7174 -12474 -14557 -18045 -25635 -29252 -37919 -46211 -52623 -60735
15832f0735p564k88J115M168L979R78m451J0598J8817J2884r26kM782J5466K027
15817H48r651n269K735Q198N716n167n03n464o593M941P081J2324J3820O155P044
15802C6215P068O37r239l851N913O899K065m985p813j6j378p969n208P311k80
15787B5369n936N691O271J407k255p715K788O67o122n123p198j6570q641K24J727
15772a5416n887m596n513n486K27P713k641l076L492Q891K840o97M947l72J772
15757a3802J2054J3566J1300N086n075K199k880j677m398r036K943M156l195J036
15743A2277l989r430o840j721J559k755k90K003K624N398j017K791n90k987O409
15728C442j380q46j866K882L197q48L66j508K169k178m721l707j440P063P836
$$ plain form
15832 -60735 -68299 -68587 -67472 -63304 -59325 -58347 -62798 -52200 -33383 -20499 -21425 -21427 -16645 -1179 848
15817 848 -8803 -14072 -11337 -3139 2577 -2590 -3093 -8557 -15150 -10209 -3128 9196 23016 29171 36215
15802 36215 43283 43920 34681 30830 36743 43642 45707 40722 32909 32893 31515 23546 18338 25649 25369
15787 25369 19433 25124 31395 32802 30547 22832 25620 26287 20165 15042 7844 -8726 -17367 -17143 -15416
15772 -15416 -21303 -25899 -31412 -36898 -36671 -28958 -31599 -34675 -31183 -22292 -19452 -20149 -15202 -15574 -13802
15757 -13802 -1748 11818 23118 28204 23129 25328 22448 20771 16373 7337 10280 14436 11241 12277
15743 12277 8288 -1142 -7982 -9703 -8144 -10899 -11189 -9186 -6562 -1164 -2181 610 20 -2967 3442
15728 3442 2062 1216 -650 2232 5429 4581 4947 3439 5608 3430 -1291 -4998 -6438 625 8461
15713H461J1891Q212M027q83p144k193o670j0496N413N231j737r60o567L27N428
15698A2340n740j826L528j108m873o348k341l300L018M777q156k336L95L370Q514
15683h6n062o4K813L859N325n674q104K890M5O62L441o765l605O433J141j11k491
15666e353j260p947l01N225R82L244J291m720M558N427j079n55J708N659r29K407
15650H357p96o92r422k046m941j700n418q0N508M517M534K775m615j262o04J053
15634d832O771l222q082L776p62K359L187r34M535J683n515m510j166j033k765
15619a0510L36l725K66K732J412j385k491P1M326K620r084n033P036J0830M861
15604B262q203Q53O21k910n711j1340k456M807l15o3m001M791J1873m95j1545
$$ plain form
15713 8461 20352 28564 32591 31708 24564 22371 15701 5205 10618 15849 14112 13152 6585 6912 12340
15698 12340 6600 4774 8302 7194 2321 -4027 -6368 -9668 -6650 -1873 -10029 -12365 -11970 -8600 -86
15683 -86 -5148 -5212 -2399 1460 6785 1111 -6993 -4103 -4058 -3396 45 -6720 -10325 -3892 -2751 -2862 -5353
15666 -5353 -6613 -14560 -14861 -9636 -8654 -5410 -4119 -8839 -4281 1146 67 -488 1220 6879 5950 8357
15650 8357 7561 6869 -2553 -4599 -9540 -11240 -16658 -16738 -11230 -6713 -2179 596 -4019 -5281 -5885 -4832
15634 -4832 1939 -1283 -9365 -5589 -6351 -3992 -805 -1739 2796 4479 -1036 -5546 -6712 -7745 -10510
15619 -10510 -10174 -13899 -13633 -10901 -9489 -10874 -13365 -13294 -8968 -6348 -15432 -20465 -13429 -2599 2262
15604 2262 -5941 -5088 -4467 -7377 -13088 -24428 -26884 -22077 -22392 -22455 -26456 -21665 -9792 -10287 -21832
15589b1832o980L500p190j918m776m585n010K384M008N129K680M709N514Q195
15575a6172N526L712k632o135J67L261L492J877J037M243J692Q51o438q989N31
15560a3977Q355m387l766K870K593n905O444M382j13m9q246q926m877M329M776
15545a6497L409L213Q553n8m887K796l448j462M869l55O129P146L587N26K911
15530A6432J973K233M808M197J294M105K423O744P013J1971J1520J7567L0068
15517A22348M4242N3296P8310J08383J36520J71721K05993K41136K40354J79677
15507A581980M8773q3736j68560k08984k17326k00785j74966j48228r9768p0929
15497B57471m9956m2661l4650k0044j6118j1598j6547j0241j1984q973j464K752
$$ plain form
15589 -21832 -28812 -25312 -32502 -34420 -39196 -43781 -48791 -46407 -42399 -37270 -34590 -29881 -24367 -16172
15575 -16172 -10646 -6934 -9566 -15701 -15534 -12273 -8781 -6904 -5867 -1624 68 919 -5519 -14508 -13977
15560 -13977 -5622 -10009 -13775 -10905 -8312 -14217 -7773 -3391 -3504 -3553 -11799 -20725 -25602 -21273 -16497
15545 -16497 -13088 -9875 -1322 -1380 -6267 -3471 -6919 -8381 -3512 -3867 2262 9408 12995 13521 16432
15530 16432 18405 20638 25446 29643 30937 35042 37465 44209 51222 63193 74713 92280 122348
15517 122348 166590 219886 298196 406579 543099 714820 920813 1161949 1402303 1581980
15507 1581980 1630753 1547017 1378457 1169473 952147 751362 576396 428168 328400 257471
15497 257471 207515 164854 130204 110160 94042 82444 65897 55656 43672 34699 33235 35987
15485C5987j2047p705j273l842k863m238L214N689P251j715j1676l265o444n720
15471h647J601L277P081L968n335m846p872J308P506j265M330m690p565j352J607
15456a0894k011l188r58q79R83j531M63k735o702j529R418J3600J043j361o52
15441f933J14j960K738M047L182k31l709k159O139R342j0485j1279K022m88l331
15426a2991k698p202M127M124M331M592L37l109M004j460K457m436m944K273N078
15411e517l403q279r08O670o95l515P2L852Q690J006m135J78k301M307L663P719
15395G404l138q832n249L379j468o393M340R546o61n564j003L258J361n680l394
15380a2094m68o94O625L918l640j151j0693r499R959J1344M147l592p244k915
$$ plain form
15485 35987 23940 16235 14962 11120 8257 4019 7233 12922 20173 18458 6782 3517 -2927 -8647
15471 -8647 -7046 -3769 3312 7280 1945 -2901 -10773 -9465 -1959 -3224 1106 -3584 -11149 -12501 -10894
15456 -10894 -12905 -16093 -17051 -17930 -16947 -18478 -18015 -20750 -27452 -28981 -19563 -5963 -4920 -6281 -6933
15441 -6933 -6819 -8779 -6041 -1994 1188 957 -2752 -4911 1228 10570 85 -11194 -9172 -9660 -12991
15426 -12991 -15689 -22891 -18764 -14640 -10309 -5717 -5380 -8489 -4485 -5945 -3488 -7924 -12868 -10595 -5517
15411 -5517 -8920 -17199 -18107 -11437 -12132 -15647 -15575 -11723 -3033 -2027 -6162 -5984 -8285 -3978 -315 7404
15395 7404 4266 -4566 -9815 -6436 -7904 -14297 -9957 -411 -1072 -6636 -7639 -4381 -3020 -8700 -12094
15380 -12094 -12562 -13256 -6631 -2713 -6353 -7504 -18197 -27696 -17737 -6393 -2246 -5838 -13082 -15997
15366a5997Q01O495K14o582l359Q476o081m660j814p11n072q932p36M76q52O677
15350c1657m66R62R116J1961o610k040J353n70N929O210K807L259J131K854j254
15335B985p192l900Q373P197q7r282m929k399j800P10r122L022j484k859P178
15320a3589R766Q276m163j702k40k458K93k102k6k127k241n704m12m183l297Q240
15304a5669Q760j277K484l079n821J918P578r30J474P937m096n190n610l596P60
15289a4357n95q754L857J1297J804J438j826J182K407n413m212J528j593n458
15275a8695L054J377M140O40p849p659M11R059Q337o341m313O288k110m369O033
15260a1997M355n94L209J23K60k445j771J87J110l819m064q01L295n43L325Q16
$$ plain form
15366 -15997 -15196 -8701 -8487 -15069 -18428 -9952 -16033 -20693 -22507 -23218 -28290 -37222 -37958 -37482 -38334 -31657
15350 -31657 -32123 -31161 -22045 -10084 -16694 -18734 -17381 -17951 -12022 -5812 -3005 254 1385 4239 2985
15335 2985 -4207 -8107 266 7463 7376 -1906 -6835 -9234 -11034 -10324 -19446 -16424 -17908 -20767 -13589
15320 -13589 -3823 4453 290 -1412 -1652 -4110 -3817 -5919 -5945 -8072 -10313 -16017 -16429 -20612 -23909 -15669
15304 -15669 -6909 -8186 -5702 -8781 -14602 -12684 -5106 -6036 -4562 3375 -721 -5911 -11521 -15117 -14357
15289 -14357 -14952 -23706 -19849 -8552 -6748 -5310 -7136 -5954 -3547 -8960 -13172 -11644 -13237 -18695
15275 -18695 -15641 -14264 -10124 -9484 -17333 -24992 -24581 -15522 -7185 -13526 -17839 -11551 -13661 -18030 -11997
15260 -11997 -7642 -8236 -5027 -4904 -4644 -7089 -8860 -8673 -7563 -11382 -15446 -16247 -12952 -13495 -10170 -9354
15244i354P137m942j676n701j324l2J755j203l202l361J474Q83k479K618N545
15229a3862j589k482L164K641O855K366n826o073o19K528L134n317o509N94P968
15214a3027j660j416K486M437L04j399M845Q093k797j3331p81l909j128j017P670
15199a2630N138k176J934P81l754L030n61j540J544O104j070k664M737L599j684
15184G88k691k382m154K764J2023n401j804k784l002M135l071o784K731J102o547
15169a5077r001r327P558L767M215P254N635l081o057j226o91K713J519n620p23
15154a8142L685l939j559j32N213O030l465L45L610J226K068l776n02m32L625
15139f145M117k862j625l400m700r39M362J887P198m593n516N243K05L830m113
$$ plain form
15244 -9354 -2217 -7159 -8835 -14536 -15860 -15892 -14137 -15340 -18542 -21903 -20429 -19546 -22025 -19407 -13862
15229 -13862 -15451 -17933 -14769 -12128 -5273 -2907 -8733 -14806 -15425 -12897 -9763 -15080 -21589 -20995 -13027
15214 -13027 -14687 -16103 -13617 -9180 -8876 -10275 -5430 2663 -134 -13465 -14246 -18155 -19283 -20300 -12630
15199 -12630 -7492 -9668 -7734 -6953 -10707 -7677 -8238 -9778 -8234 -2130 -3200 -5864 -1127 2472 788
15184 788 -1903 -4285 -8439 -5675 6348 947 -857 -3641 -6643 -2508 -5579 -12363 -9632 -8530 -15077
15169 -15077 -24078 -33405 -25847 -22080 -17865 -10611 -4976 -8057 -14114 -15340 -16031 -13318 -11799 -17419 -18142
15154 -18142 -14457 -18396 -19955 -20087 -14874 -8844 -12309 -11964 -8354 -7128 -5060 -8836 -9338 -9770 -6145
15139 -6145 -2028 -4890 -6515 -9915 -14615 -15554 -11192 -9305 -2107 -6700 -12216 -6973 -6768 -2938 -7051
15124g051q289K689L120K253j460l086l718m962K092N590L747K221m511n005l079
15109a9449l61K045J123N357j921k397M513o79O366J78q8p559o49L596o19L626
15093f918k180m661O53L304o185J286k282Q33K751L803K498j598o042K691N047
15078g000p899k704R02J768N181q3k295k258k437N47K791M849n56K479L912N66
15062b237l452j328J942M903M536p155o993m740J609J484J882K241K272L652J379
15047ej686m273r541o213m192j419K238J593N130R452K177J321J743l98k351o017
15031a2441n303L092L092L793K177M282j295J844n97l520n566k005J242k777K880
15016a1102R385o355L492P400k803m103o055m893M738j106p094m208P289M515
$$ plain form
15124 -7051 -15340 -12651 -9531 -7278 -8738 -11824 -15542 -20504 -18412 -12822 -9075 -6854 -11365 -16370 -19449
15109 -19449 -19810 -17765 -16642 -11285 -13206 -15603 -11090 -11769 -5403 -5225 -5313 -12872 -13521 -9925 -10544 -6918
15093 -6918 -9098 -13759 -13106 -9802 -15987 -14701 -16983 -16150 -13399 -9596 -7098 -8696 -14738 -12047 -7000
15078 -7000 -14899 -17603 -16701 -14933 -9752 -9835 -12130 -14388 -16825 -16278 -13487 -8638 -9194 -6715 -2803 -2237
15062 -2237 -5689 -7017 -5075 -172 4364 -2791 -9784 -14524 -12915 -11431 -9549 -7308 -5036 -1384 -5
15047 -5 -1691 -5964 -15505 -21718 -25910 -27329 -25091 -23498 -18368 -8916 -6739 -5418 -3675 -4073 -6424 -12441
15031 -12441 -17744 -14652 -11560 -7767 -5590 -1308 -2603 -759 -1356 -4876 -10442 -12447 -11205 -13982 -11102
15016 -11102 -1717 -8072 -4580 2820 17 -4086 -10141 -15034 -10296 -11402 -18496 -22704 -15415 -10900
15002a0900Q42o803K938Q592N472r9r73L351N910l399r314j682n44l63M182l349
14986f139l257L28J797k807n468N915o08k512N460K627j548O82J389k56n84p53
14970e734Q75L192k63n043m196l71q391l592m99K543n76Q199M398L137k423k3
14954h767j912Q933N991m059m968J315l420q436k101O295R917l172m841O301n099
14939h023l966n697M942L322L295L786O119o865k831k114N963K715k609m521J007
14924e477k751l55q88J814J200o271K322L29j343m466Q61R873N20Q28q738K266
14908a0276K173l172n621K601R05K829P90j045M171O240j794l221Q105j700q520
14893g535l39O76n323K293P893P12j231m093J892p45L21J034n987n531J166N648
$$ plain form
15002 -10900 -10058 -16861 -13923 -5331 141 42 -931 2420 8330 4931 -4383 -6065 -6609 -6972 -2790 -6139
14986 -6139 -9396 -9068 -7271 -10078 -15546 -9631 -10239 -12751 -7291 -4664 -6212 -5530 -4141 -4397 -4981 -5734
14970 -5734 -4859 -1667 -1930 -6973 -11169 -11540 -19931 -23523 -24022 -21479 -22055 -13856 -9458 -6321 -8744 -8767
14954 -8767 -10679 -1746 4245 186 -4782 -3467 -6887 -15323 -17424 -11129 -1212 -4384 -9225 -2924 -8023
14939 -8023 -11989 -17686 -12744 -9422 -6127 -2341 3778 -3087 -5918 -8032 -2069 646 -1963 -6484 -5477
14924 -5477 -8228 -8583 -9471 -7657 -6457 -12728 -10406 -10077 -11420 -15886 -15025 -5152 -4632 -3804 -12542 -10276
14908 -10276 -8103 -11275 -16896 -14295 -13390 -10561 -9771 -10816 -6645 -405 -2199 -5420 2685 985 -7535
14893 -7535 -7874 -7198 -12521 -10228 -2335 -1623 -2854 -6947 -5055 -5800 -5479 -4445 -10432 -15963 -14797 -9149
14877i149m64J984N926P16o593m114Q660N946J38K846j625m765q018L323N29k68
14861d928j072M83n218N436O652m603k686J327l06M108o6k949p522l229j287N703
14845a0157P745m88k353n324J109K813J073j977k514K368K868j792L222M252j517
14830f72n759m884M050N035p781L101P454J925K273K392K669N728j514k716j563
14815I738M059J235p143n264J406n60q83l209k079m079p22J514l621M760M688
14800a60j417J972q242K653N167J338j260N21P567o02l341N35k013J92l348l219
14784c657J923M580J595l327n642m178P584P646n017M25L093K155k244j630o659
14769c353r051J088P698Q724N2j328K646p52m76Q2P546q73j0546o414O091L502
$$ plain form
14877 -9149 -9613 -7629 -1703 -987 -7580 -11694 -3034 2912 3050 5896 4271 -494 -8512 -5189 -4660 -4928
14861 -4928 -6000 -5517 -10735 -5299 1353 -3250 -5936 -4609 -4915 -807 -873 -3822 -11344 -14573 -15860 -10157
14845 -10157 -2412 -2900 -5253 -10577 -9468 -6655 -5582 -7559 -10073 -7705 -4837 -6629 -3407 845 -672
14830 -672 -6431 -11315 -7265 -2230 -10011 -6910 544 2469 4742 7134 9803 15531 14017 11301 9738
14815 9738 13797 15032 7889 2625 4031 3471 2588 -621 -2700 -6779 -7501 -5987 -9608 -4848 -160
14800 -160 -1577 395 -7847 -5194 -27 1311 51 572 8139 7537 4196 4731 2718 2910 -438 -3657
14784 -3657 -1734 2846 4441 1114 -4528 -8706 -1122 6524 1507 1932 5025 7180 4936 3306 -3353
14769 -3353 -12404 -11316 -3618 5106 5158 3830 6476 5724 5248 5330 12876 12003 1457 -4957 1134 4636
14753D636p835q863J301j336K130L927M32n885K621L766m872l228k273N401L060
14738g018j896k004n77Q742Q239k640q831N539q07m854k043P72k749m187J29M691
14722i494Q074J840m414q617P930N866K530n262R28M810K631J337o21o440j1848
14707a0750j809J665P10J351N401k726m962n772n216M055P054L718P589l354k948
14692e994L565M659o33l12j075q89J745k330n292q03K984J473J857J723m468m869
14676h659m240P792J191q643l447P275P567M872p529m304N14M770p153j5956J327
14661b4623N327J0599L882k142K165N473J850M855p497o53k2O065J261l394p154
14646d008r137L408P118P295j785p308J021J991L13l761m254J223n249j951M912
$$ plain form
14753 4636 -3199 -12062 -10761 -12097 -9967 -6040 -5608 -11493 -8872 -5106 -9978 -13206 -15479 -10078 -7018
14738 -7018 -8914 -10918 -11495 -2753 5486 2846 -5985 -446 -1253 -6107 -8150 -7378 -10127 -14314 -14185 -9494
14722 -9494 -1420 420 -3994 -12611 -4681 1185 3715 -1547 -619 4191 6822 8159 7538 1098 -10750
14707 -10750 -12559 -10894 -10184 -8833 -3432 -6158 -11120 -16892 -22108 -18053 -10999 -7281 308 -3046 -5994
14692 -5994 -2429 2230 1597 1285 210 -679 1066 -1264 -6556 -7359 -4375 -2902 -1045 678 -3790 -8659
14676 -8659 -12899 -5107 -3916 -12559 -16006 -8731 -1164 3708 -3821 -8125 -7611 -2841 -9994 -25950 -24623
14661 -24623 -19296 -8697 -4815 -6957 -4792 681 2531 7386 -111 -764 -786 5279 6540 3146 -4008
14646 -4008 -13145 -9737 -2619 4676 2891 -4417 -3396 -1405 -1092 -4853 -9107 -7884 -13133 -15084 -10172
14631a0172J876j202n56M975m49K629j85K331J098j395M191N669m334o444o31
14616b599L139l203L596J280n054Q68K859k164O25L426N945K04p995q082M314
14601b841J467M268N468n629q791K604M563L977k384M283K456P92o363j452P719
14586A0137j712l583m302j548L443k347Q229N90l552M43k92L70P725p40p427o404
14570i70J511j537K468k588J236L026j161M207L53L456j085n573j957O494M427
14555A2307q522n904q691N853P525M853J893k935r505o539k497N914R661O79j2630
14540h538R21L516N726N14n7q827m221K269K167o185L533L331N16L776k90J795
14524e4L772l527l238K591P09n821r15K898l700j810p31M360K198K724O485j677
$$ plain form
14631 -10172 -8296 -9498 -10054 -5079 -5528 -2899 -3084 -753 345 -1050 3141 8810 4476 -1968 -2599
14616 -2599 540 -2663 933 2213 -2841 -1973 886 -1278 -653 2773 8718 8922 927 -7155 -2841
14601 -2841 -1374 2894 8362 2733 -6058 -3454 1109 5086 2702 6985 9441 10233 3870 2418 10137
14586 10137 8425 4842 540 -1008 2435 88 8317 8907 5355 5798 5506 5876 13601 12861 5434 -970
14570 -970 541 -996 1472 -1116 120 3146 1985 6192 6545 10001 8916 3343 1386 7880 12307
14555 12307 3785 -2119 -10810 -4957 2568 7421 9314 6379 -3126 -9665 -12162 -6248 3413 4092 -8538
14540 -8538 -7617 -4101 1625 2139 2082 -6745 -10966 -8697 -6530 -12715 -9182 -5851 -5335 -1559 -1849 -54
14524 -54 3718 191 -3047 -456 253 -5568 -6483 -3585 -7285 -9095 -9826 -5466 -3268 -544 5941 4264
14508D264l726o0m810O76K596p21j690O766J1816P206j0403j0474o629p213M52
14493a1950J460k279O832P478N228j744l197j527K365M670p848j339n184l731
14479a0766J084L290L015K380O879k344L117N776j892o62n622p525j973J05J415
14464c723o79N265J830n506l383J66M641K027l301J433Q517P188l737r209n182
14449c653O450j670P3m195N2n869K785J812K027n132o585L830Q128l09l690L283
14433b663L075j549l873L734L564N32j573M392P819j294p845n341q059J185P645
14418b51l538k409L380M387n697o615K749M083P689k452m242k888j65q16L31n724
14402a2178M63J618Q76J908P273m920O46l347J815M154o87O94p087k200J248K460
$$ plain form
14508 4264 538 478 -4332 -3656 -1060 -1781 -3471 3295 15111 22317 11914 1440 -5189 -12402 -11950
14493 -11950 -10490 -12769 -5937 1541 6769 5025 1828 301 2666 7336 -512 -1851 -7035 -10766
14479 -10766 -9682 -6392 -3377 -997 5882 3538 6655 12431 10539 9877 4255 -3270 -5243 -5138 -3723
14464 -3723 -4402 863 2693 -2813 -6196 -6030 -1389 638 -2663 -1230 7287 14475 10738 1529 -3653
14449 -3653 2797 1127 1200 -2995 -2943 -8812 -6027 -4215 -2188 -7320 -13905 -10075 -1947 -2256 -5946 -2663
14433 -2663 412 -1137 -5010 -1276 2288 2820 1247 5639 13458 12164 4319 -1022 -9081 -7896 -251
14418 -251 -3789 -6198 -2818 1569 -4128 -10743 -7994 -3911 3778 1326 -2916 -5804 -5969 -6785 -6454 -12178
14402 -12178 -11715 -10097 -9221 -7313 -40 -4960 -4314 -7661 -5846 -1692 -2379 -1685 -8772 -10972 -9724 -7264
14386g264J738o888O026J1229j911m307M71j493q1K135O506n76M326k59j1829
14371b177J116J348K30L984L947O697p450p601j341M273N57o04M312j512j188
14356D591j286l357l923L0L106O326j625n642m435O645K362r001p701Q218J1114
14341E422P146j624k397r34q494O64Q87q09o8l297k995p089l858P255N683p15
14325e223L449M45m06k135O87L666p340n148N233P446k984k700p964k139K025
14310a3088J167j528N086N051K920m296p155N960K717n046j448J826L080K100
14296b654N264Q025J454p309k56O011O219N226j724q099m492J507J277K544n918
14281G075q767K860M053q21n519o15K700P40m045j305K15M807M113l307q484K97
$$ plain form
14386 -7264 -5526 -12414 -6388 4841 2930 -1377 -906 -2399 -2480 -345 6161 5585 9911 9652 -2177
14371 -2177 -1061 287 517 4501 8448 15145 7695 94 -1247 3026 3583 2979 7291 5779 4591
14356 4591 3305 -52 -3975 -3945 -839 5487 3862 -1780 -6215 430 2792 -6209 -13910 -5692 5422
14341 5422 12568 10944 8547 7613 -881 -217 670 -139 -207 -3504 -6499 -13588 -17446 -10191 -4508 -5223
14325 -5223 -1774 -1329 -1735 -3870 -3183 483 -6857 -12005 -6772 674 -2310 -5010 -12974 -15113 -13088
14310 -13088 -11921 -13449 -8363 -3312 -392 -4688 -11843 -5883 -3166 -8212 -9660 -7834 -4754 -2654
14296 -2654 2610 10635 12089 4780 4524 10535 16754 21980 20256 12157 7665 9172 10449 12993 7075
14281 7075 -1692 1168 5221 4400 -1119 -1734 966 1706 -2339 -3644 -3429 1378 5491 2184 -6300 -6003
14265f003N211L97j273J560M252k762K098J666M8M158K354m168q453l652K207
14250b360K736l3o4L320n620M459J0039j89K740M339l179j767j770l624j153J33
14234H007O612K773j972o81m246j294J780K346p68r916k312O431j868n605K058
14219A345L219M802N675p448J330P01q53k518N839m639o228j054J764n79L988
14204E344J557m423j601O85K6r188n284L42K918J890M653L186J1067P093m182
14189A4083k58l713l246m217p495L262M104O77M072K733N99K996L244j470p072
14174H299q05K099O251l19l201k349N913M956M20p166o562O54N068k79K229l249
14158A1959l598L281p568m997j357O162K692J517l44M752k692n625p522j333M273
$$ plain form
14265 -6003 -792 -395 -1668 -108 4144 1382 3480 5146 5194 9352 11706 7538 -915 -4567 -2360
14250 -2360 376 343 279 3599 -2021 2438 12477 12288 15028 19367 16188 14421 12651 9027 7874 8007
14234 8007 14619 17392 15420 14739 10493 9199 10979 13325 12557 2641 329 6760 4892 -713 1345
14219 1345 4564 9366 15041 7593 8923 9624 8771 6253 12092 7453 1225 171 1935 1356 5344
14204 5344 6901 2478 877 1562 1588 -7600 -12884 -12542 -9624 -7734 -3081 105 11172 18265 14083
14189 14083 13825 10112 6866 2649 -4846 -1584 2520 3197 7269 10002 10601 13597 16841 15371 8299
14174 8299 7494 9593 15844 15525 12324 9975 15888 20844 21264 14098 7536 8190 13258 12979 15208 11959
14158 11959 8361 11642 4074 -923 -2280 3882 6574 8091 7747 12499 9807 4182 -3340 -4673 -400
14143d00K30J01j515P41O140P039m251n962j64L125K781l470L954M558k999J9
14127I927k68k668k532M085K848m019K96N690L510j138l049K636M600K666n098
14112A7486J30K75n05L941m142k037r33l477l406J732K605O82o46l752l492m319
14096A42K645O952m435k360Q637m420l238n249r46M865J942K319L461J2725L617
14081B6657j2331n789M496Q176j331r231Q89K871l994j444Q74M58L255J37j162
14066A2531j172M514J213q85j634k830Q09m493o508M486M059k048K009n306l51
14051D394K875O818P064K534q68K523j898m464J54J1440L479l353j859K697p74
14036C0762j290k412j043J627m042R37L833m57r361j0827o925M840N280j178M05
$$ plain form
14143 -400 -170 -69 -1584 -843 5297 12336 8085 2123 1959 5084 7865 4395 8349 12907 9908 9927
14127 9927 9659 6991 4459 8544 11392 7373 7669 13359 16869 15731 12682 15318 19918 22584 17486
14112 17486 17616 17891 17386 21327 17185 15148 14215 10738 7332 9064 11669 12351 11705 7953 4461 142
14096 142 2787 9739 5304 2944 11581 7161 3923 -1326 -2272 2593 4535 6854 10315 23040 26657
14081 26657 14326 8537 13033 21209 19878 10647 11536 14407 10413 8969 9843 10301 13556 13693 12531
14066 12531 11359 15873 17086 16201 14567 11737 12546 8053 1545 6031 10090 8042 10051 4745 4394
14051 4394 7269 14087 21151 23685 22817 25340 23442 18978 19132 30572 34051 30698 28839 31536 30762
14036 30762 29472 27060 26017 27644 23602 24539 28372 27915 18554 7727 802 5642 10922 9744 10149
14021A0149P564P388R457L758m21p92n076N401O518P631R377J395n385P1J081
14006E8116L720J377j5074m90J4954K1750J0011N976J3497J1269J8331J4749K4473
13993A82659K9987M3398N9982Q0557R8616J23496J52235J59014J57125J38692
13983A225761J08906N4438j7174r1566j40912j60773j63325j58364j32368j11042
13973D13581q9624o5531m9301j7838j3070j3404j9086j8239j3317j4297j1509
13962H8365o101o290k467k529p493j2452j286k043n415L376P303P9k674J668j912
13947E0129k877p64j392R81L128J7152K2108J9073K0024L2144L4653L9640K9469
13934B63468J6645P707j0477l0102l1537l5611k7449k3003k7252j7242j9363m293
$$ plain form
14021 10149 17713 25101 34558 38316 37895 37103 32027 37428 43946 51577 60954 62349 56964 57035 58116
14006 58116 61836 63213 48139 47649 62603 84353 94364 100340 113837 125106 143437 158186 182659
13993 182659 212646 256044 316026 396583 495199 618695 770930 929944 1087069 1225761
13983 1225761 1334667 1389105 1371931 1280365 1139453 978680 815355 656991 524623 413581
13973 413581 323957 258426 209125 191287 178217 164813 145727 127488 114171 99874 88365
13962 88365 82264 75974 73507 70978 63485 51033 49747 47704 42289 45665 52968 53047 50373 52041 50129
13947 50129 47252 46488 45096 46077 49205 66357 88465 107538 127562 159706 194359 233999 263468
13934 263468 280113 287820 277343 247241 215704 180093 152644 129641 102389 85147 65784 61491
13922F1491L22L896k617m516J604l335j016j37j131n860m786K632J990l452p428
13907C7657j818m445R20R438Q408p461m827q5M613l391o205j414M806K162m207
13892C4151m205m482k3M997p358n378j638j185K280k033k893k856M444N040J800
13877B0661Q041N863J176l840k319k61M720l786o679Q702J0244m93j51N426k407
13862D4897l76P043N893J642L385Q389N961L869j69o046l941j0027q559m590o255
13847D1116m952q065P84J483m678p498m094p351K576L253O840R429J0285N454
13833D4582P727P353j55O302J364J76P354N380p667j1662M807R448N498m510o215
13818F9782r09k61l332m41o460p608r328j874k198Q116p052j556k229K793K997
$$ plain form
13922 61491 61813 65709 63092 58576 60180 56845 55829 55692 54561 48701 43915 46547 48537 45085 37657
13907 37657 35839 31394 32314 41752 50160 42699 37872 37787 42400 39009 32804 31390 36196 38358 34151
13892 34151 29946 25464 25441 30438 23080 17702 16064 14879 17159 15126 12233 9377 13821 18861 20661
13877 20661 28702 34565 35741 31901 29582 29321 34041 30255 23576 32278 42522 42029 41878 47304 44897
13862 44897 44521 51564 57457 59099 62484 70873 76834 80703 80534 74488 70547 60520 51961 47371 41116
13847 41116 36164 28099 28883 30366 25688 18190 14096 6745 9321 12574 19414 28843 39128 44582
13833 44582 52309 59662 59507 65809 67173 67349 74703 80083 72416 60754 65561 75009 80507 75997 69782
13818 69782 68873 68612 65280 64839 58379 50771 41443 39569 37371 45487 38435 36879 34650 37443 40440
13803D0440m222r3K993Q61k104m16N321K558k174M189J1659R380J2103J6267J8322
13788A15084J6534J8872K6190L8755M8837O7649R3001J18669J46394J85004K12678
13777A087667K17177J98191J50260P6716r319r7337j60341j95592k04112j87477
13767H75833j55645j33732r9574p3815n1460l5165k7630k9098j8464j8500j4066
13756B18684j3409j2516j4477j0951j4506j1644j1506j1341o183K082m650r565
13744A00018N65p552j9460r611j733j0852n504n789n253l375m403m955r813k845
13730I438p209L963J0272P941q82n630j03J3086J0088R625J0730J4324J6585J6862
13716A09090J6777J2590M712L193Q080J531J226J352j022j089l060k481N452j411
$$ plain form
13803 40440 36218 36125 39118 39979 37875 37459 42780 45338 43164 47353 59012 68392 80495 96762 115084
13788 115084 131618 150490 176680 215435 264272 331921 424922 543591 689985 874989 1087667
13777 1087667 1304844 1503035 1653295 1730011 1720692 1623355 1463014 1267422 1063310 875833
13767 875833 720188 586456 486882 413067 361607 326442 298812 269714 251250 232750 218684
13756 218684 205275 192759 178282 167331 152825 141181 129675 118334 112151 114233 109583 100018
13744 100018 100583 93031 73571 63960 62227 51375 45871 40082 34829 31454 27051 22096 12283 9438
13730 9438 2229 6192 16464 24405 23523 17893 17790 30876 40964 50589 61319 75643 92228 109090
13716 109090 125867 138457 143169 146362 154442 155973 157199 158551 157529 156440 153380 150899 156351 154940
13702A54940q382J026J271M612R867J1592J3648J0673J8148L0086J9702J8637
13690B85820J4380l201k2225j5914k3799k3741k3992k7761j1612j0441q906m799
13678A23809m706J813L519l373L967O133J0585J1746O435K48p338M941M486k317
13664A59948L066K392L739O596J0377q3l962m320l837j769m277r99J875O620P593
13649A82959L333m516K149N909L313M275M372J24J1827R406O099L048O507R564
13635B48369J1781K501r707o204k155l549N291J0841K463K830Q636J1392k090
13622B80399O161M915Q576J3629L485J011J088q154M01m457O54R98Q601M262J4565
13607C36134J4997K5749L7297L9576L4572K8736K7989K7275L0595K3629K4691
$$ plain form
13702 154940 146558 147584 148855 153467 163334 174926 188574 199247 217395 247481 267183 285820
13690 285820 300200 296999 274774 258860 235061 211320 187328 159567 147955 137514 128608 123809
13678 123809 119103 120916 124435 121062 125029 131162 141747 153493 159928 160176 152838 157779 162265 159948
13664 159948 163014 165406 169145 175741 186118 186035 182073 177753 173916 172147 167870 166871 168746 175366 182959
13649 182959 186292 181776 183925 189834 193147 197422 201794 201918 213745 223151 229250 232298 238805 248369
13635 248369 260150 262651 252944 246740 244585 241036 246327 257168 259631 262461 271097 282489 280399
13622 280399 286560 291475 300051 313680 317165 318176 319264 311110 311511 307054 307708 308706 317307 321569 336134
13607 336134 351131 376880 414177 453753 488325 517061 545050 572325 602920 626549 651240
13596F51240K5285L0965K6055K6320K3986K4154L0831K6350J5787J5194J5770
13585I11937J2383K2514K3075K7598L9844N5022O8129P5108P6598P6632P3824
13574A462664O7400N6075M6652N1602N4730N3290N5636O9553Q4730J00401J24662
13563B227395J61234J87737K10695K45729K76019L11022L64496M37734N24677
13554D946738O21400P47657R14652J105388J303491J478245J659747J846399K062810
13545A6686527K384806K937156L865261N364498P423029J0029088J3495502J7850841
13537H0036708K2378884K6360838K8363762K7095894K4648205K0593641J1686544
13530B41164476M88315r067556j8028003k5264293k8695749k8640019k6220060
$$ plain form
13596 651240 676525 707490 733545 759865 783851 808005 838836 865186 880973 896167 911937
13585 911937 924320 946834 969909 997507 1037351 1092373 1160502 1235610 1312208 1388840 1462664
13574 1462664 1530064 1586139 1632791 1684393 1739123 1792413 1848049 1917602 2002332 2102733 2227395
13563 2227395 2388629 2576366 2787061 3032790 3308809 3619831 3984327 4422061 4946738
13554 4946738 5568138 6315795 7230447 8335835 9639326 11117571 12777318 14623717 16686527
13545 16686527 19071333 22008489 25873750 31238248 38661277 48690365 62185867 80036708
13537 80036708 102415592 128776430 157140192 184236086 208884291 229477932 241164476
13530 241164476 241652791 232585235 214557232 189292939 160597190 131957171 105737111
13523A05737111k2265790j7620238j3310631r721050o924424m973670l724208
13516B7197100k975382k524300k236527k047737j896680j760724j596766j417403
13508A0741581j236343j060037q89087p49637o30564n16954m40646l82130l33450
13499D502733k89772k68849k50825k44534k35368k23879k17007k07503j91968
13490B373028j70182j55644j37489j15120r4847p2936o7843n6995m9177m1897
13480A410898m0849m7996n3918n8248n8467m5036m3757l5313l2256l0057k9454
13469I35547l8083l4967m4441m2257l5640l2745k9743k8547k3358j8961q949j0560
13457E87296n518j523p188j1260p576q100j0733j8144j8457k5581k9450k7636
$$ plain form
13523 105737111 83471321 65851083 52540452 42819402 35894978 30921308 27197100
13516 27197100 24221718 21697418 19460891 17413154 15516474 13755750 12158984 10741581
13508 10741581 9505238 8445201 7556114 6806477 6175913 5658959 5218313 4836183 4502733
13499 4502733 4212961 3944112 3693287 3448753 3213385 2989506 2772499 2564996 2373028
13490 2373028 2202846 2047202 1909713 1794593 1699746 1626810 1558967 1501972 1452795 1410898
13480 1410898 1370049 1322053 1268135 1209887 1151420 1106384 1062627 1027314 995058 965001 935547
13469 935547 897464 862497 818056 775799 740159 707414 677671 649124 625766 606805 597856 587296
13457 587296 581778 580255 573067 561807 554231 546131 535398 517254 498797 473216 443766 416130
13445D16130k6622k5134j3685m583q511o665l196l067m823R63J387j2797j4973
13432B94424j4534j2953j949j2052j2377j0076m931j1782j313q37q442j1226k820
13419A89132J556K813J393K964K241j077k329n73O16n722l887p249k469m582j4506
13404A58321j4200j6194r990k133o903j708J598j190k637l791M844N556J737k341
13390A10969J293Q028M067N604n86K959P967N084O758M693j611K588L232l261
13376A57784j5429j2840j1998j0242j3062j7672r460q773n227l790m798l786j020
13363C9687N926j60j2889m186M659m11o994o110K691k436m680j813J89K148k07
13348A5414M318P936R08L306J8259J7581J7915J1919J1451J0621M898M502J516
$$ plain form
13445 416130 389508 364374 350689 346106 337595 330930 327734 324667 319844 320807 322194 309397 294424
13432 294424 279890 266937 264988 252936 240559 230483 225552 213770 212457 211620 203178 191952 189132
13419 189132 190688 193501 194894 197858 200099 199022 196693 196120 196736 191014 187127 179878 177409 172827 158321
13404 158321 144121 127927 117937 115804 108901 107193 108791 107601 104964 101173 106017 111573 113310 110969
13390 110969 112262 120290 124357 129961 129375 132334 140301 145385 152143 156836 155225 157813 161045 157784
13376 157784 142355 129515 117517 107275 94213 76541 67081 58308 53081 49291 44493 40707 39687
13363 39687 45613 45453 32564 28378 33037 32626 25632 19522 22213 19777 15097 13284 13473 15621 15414
13348 15414 19732 27668 28576 31882 50141 67722 85637 97556 109007 119628 124526 129028 130544
13335A30544N197J691j336J037P03k044j2896j0827q967p361R98m557r978j838
13321H0366j859p691k145p119j0057o397o658o476p490r109M720J148j970p357
13307A1906j1731l933o000l873r574o438m112K346j238N115N549K240R883J4600
13293D740N837L429K130K62J288L610M39M582K326K974L425k352k568o068m339
13278A9715L541J497Q73J940J1677M522J280N554R118K532j218o02J091N848J959
13263F9327k973m669m570l285n124o04N271M491L806O057m00l011p972o801p685
13248D1858J562L010q499j4026q272m524j3555n241L126K144p842m679P925O40
13234f373j463R159J0244M55R84l248Q61P653O702J0976L72L72J956M771p09j739
$$ plain form
13335 130544 135741 137432 136096 137133 137836 135792 122896 112069 103102 95741 96739 92182 82204 80366
13321 80366 78507 70816 68671 61552 51495 45098 38440 31964 24474 15365 20085 21233 19263 11906
13307 11906 175 -3758 -9758 -13631 -23205 -29643 -33755 -31409 -32647 -27532 -21983 -19743 -9860 4740
13293 4740 10577 14006 16136 16398 17686 21296 21735 26317 28643 31617 35042 32690 30122 24054 19715
13278 19715 23256 24753 25626 27566 39243 43765 45045 50599 59717 62249 61031 60429 61520 67368 69327
13263 69327 66354 61685 57115 53830 48706 48102 53373 57864 61670 67727 67327 64316 56344 49543 41858
13248 41858 43420 46430 37931 23905 15633 11109 -2446 -7687 -4561 -2417 -10259 -14938 -7013 -6373
13234 -6373 -7836 1323 11567 12022 13006 9758 10619 18272 24974 35950 36322 36694 38650 43421 42712 40973
13218D0973r45n084m791M347R53l039j0269k227m617L267K638q968J837Q20L833
13203A8728L378O002l473o000J64j247k578L629j290J463M422P963J509o76k10
13188C1784J09o463m144j520L766J3025M301J019k002L84m25j024J380M292q572
13173C5910m272J70k945M174n607r802o446L283O52j17K198k248l22L36n036n716
13157D212m857M345M486J855l583J803N257K094L078L853m524o949Q64J235K058
13142A5227l391p979m673m282L144Q983N218K800O76m424m213k89Q912N202K026
13127B2937j464j0271J079J2916p07M977j553m355J984N98n131j3518L681P332
13113A8505M2M567O34J88K735l045m32o453n539K420M858N778J297J452J0366
$$ plain form
13218 40973 40028 34944 30153 34500 35453 32414 22145 19918 15301 18568 21206 12238 14075 14895 18728
13203 18728 22106 28108 24635 18635 18799 17552 14974 18603 17313 18776 23198 31161 32670 31994 31784
13188 31784 31893 25430 21286 19766 23532 36557 40858 41877 39875 40259 39834 38810 40190 44482 35910
13173 35910 31638 31808 28863 33037 27430 17628 11182 14465 15117 15000 17198 14950 14628 14964 9928 4212
13157 4212 -645 3700 8186 10041 6458 8261 13518 15612 18690 22543 18019 11070 11934 13169 15227
13142 15227 11836 3857 -816 -5098 -1954 7029 12247 15047 15723 11299 7086 6797 15709 20911 22937
13127 22937 21473 11202 12281 25197 24490 29467 27914 23559 25543 26141 21010 7492 11173 18505
13113 18505 18547 23114 23748 23936 26671 23626 23194 16741 11202 13622 18480 24258 25555 27007 37373
13098C7373N176j0625k918J2456m729J1242J2154P676M359J789N112N303J7284
13085A01652K0853K2635K9247M4951N8664O6176J02420J36308J47898J46691J46371
13074A023866J28535J02969M1174k2860o2078j10616j48722j46538j40412j28184
13064E37134j07425q7936p0457m9693m1363k5461k1222j6474j6939j7972j1010
13053G1182r757j3868n096J012k187j0205k16P53K978k478J60o025k126n930k484
13038A5713k307l363L433J855p572K820j573n265P63J4n495n008k23J396L308
13023a504L894K752Q469Q63n589k568l519k587O14N090j712L373Q864j577l633
13008A1230j603K281k728J986N927j023q231j297l592J596J861p278k5k178k771
$$ plain form
13098 37373 42549 31924 29006 41462 36733 47975 60129 67805 72164 73953 79065 84368 101652
13085 101652 122505 145140 174387 219338 278002 344178 446598 582906 730804 877495 1023866
13074 1023866 1152401 1255370 1296544 1273684 1211606 1100990 952268 805730 665318 537134
13064 537134 429709 341773 271316 221623 180260 154799 133577 117103 100164 82192 71182
13053 71182 61425 47557 42461 43473 41286 31081 30865 31618 34596 32118 32278 26253 24127 18197 15713
13038 15713 13406 10043 13476 15331 7759 10579 9006 3741 4504 4518 -977 -5985 -6208 -4812 -1504
13023 -1504 2390 5142 13611 14474 8885 6317 2798 211 825 5915 4203 7576 16440 14863 11230
13008 11230 9627 11908 9180 11166 17093 16070 7839 6542 2950 4546 6407 -871 -896 -3074 -5845
12993e845Q36Q160K802p312n603k44N433j062l615R06K158N649J207k834j791
12978a155p077L312J628Q603K570q728K32J798l015O04L105l801L909j651K345
12963B679q05K532m662r486J461O563L420o0l239j580q90N412J448k166r33L610
12947C304l126j2019j772j311m79p97N13J890O497m580o68P456N872q555k315
12932a0090Q453O462j09k979P75r588p314o678O828N065L946K123o579J424O132
12917b129P32J500L61J1935L118n362k199J35n1L832O617k691k338m519o345p2
12901B524O323l833J361l96P88O087q378r596l977l468p817k633J949M276K656
12886a4134r1O710L771m648p40J1104K009o132l697m87N171M670l410K52M427
$$ plain form
12993 -5845 -5009 3151 5953 -1359 -6962 -7206 -1773 -2835 -6450 -5544 -3386 2263 3470 636 -1155
12978 -1155 -8232 -4920 -3292 5311 7881 -847 -615 1183 -1832 -1228 1877 -1924 1985 334 2679
12963 2679 1874 4406 -256 -9742 -8281 -1718 1702 1642 -1597 -3177 -4067 1345 2793 627 -306 3304
12947 3304 178 -11841 -13613 -14924 -15403 -16200 -15687 -13797 -7300 -11880 -12548 -5092 780 -7775 -10090
12932 -10090 -1637 4825 4716 1737 2512 -7076 -14390 -21068 -14240 -9175 -5229 -3106 -9685 -8261 -2129
12917 -2129 -1397 103 464 12399 15517 10155 7956 8091 8040 11872 18489 15798 13460 8941 2596 2524
12901 2524 8847 5014 6375 5979 6767 12854 4476 -5120 -9097 -12565 -20382 -23015 -21066 -16790 -14134
12886 -14134 -14225 -7515 -3744 -8392 -9132 1972 3981 -2151 -5848 -6335 -1164 3506 96 348 4775
12871D775M350L790o342m752M477n612k06J296N87m024m201n814N801j767q742
12856a6384o19J4569j48N336j013p927K950M90j908N538O079o088j0685J171J753
12841f886M573M835m636J759k88m016O371m061j679R14N720k113k992J0071K063
12826I635o812k722k053K904J18n779p175j701M016O097N58p391J706N829O03
12811b167L171O39L303M030k812k372J564j256m727K001m495N58M260n4l277R81
12795f53K35r022o315M720Q505J616k775J228l365L308Q150R37k831p941l051
12780g254j204l736L930K373O1Q86Q14K304N108m464p019P192J2615J456q51r114
12764C097p285M541p50J948j700N01m79k576L075N821j435m885N910m87o47j964
$$ plain form
12871 4775 9125 12915 6573 1821 6298 686 480 1776 2363 -1661 -5862 -11676 -5875 -7642 -16384
12856 -16384 -17003 -2434 -2582 2754 1741 -6186 -3236 -2746 -4654 884 6963 875 -9810 -8639 -6886
12841 -6886 -2313 2522 -2114 -355 -643 -4659 1712 -2349 -4028 -3114 2606 493 -2499 7572 9635
12826 9635 2823 101 -1952 952 1070 -4709 -11884 -13585 -9569 -3472 -2914 -10305 -8599 -2770 -2167
12811 -2167 1004 1643 4946 8976 6164 3792 5356 4100 -627 1374 -3121 -2563 1697 1643 -1634 -653
12795 -653 -418 -9440 -15755 -11035 -2530 -914 -3689 -2461 -5826 -2518 5632 6569 3738 -4203 -7254
12780 -7254 -8458 -12194 -8264 -5891 -5830 -4944 -4130 -1826 3282 -1182 -8201 -1009 11606 13062 12211 3097
12764 3097 -4188 353 -397 1551 -149 352 -127 -2703 372 6193 4758 -127 5783 5296 4649 2685
12748B685K26k373N71j585o228K341L518l006O00Q94J948J843J983J44L388j420
12732E529l517M01j724j2368k355O658O064K646o261n388J0071j413q397N55L802
12717e697Q322j38K97k569K155L118K322J569L92J224r735n278K502l999J476
12702d039N366m815r65J055n74L556P74o70N35L138k877n541q73N278P23l160
12686c089M89k125l421l503M104p706j553O512O040M029k470Q20l103L993L964
12671B981k865n093N27n799r77L121M835l932J33o77j373j436M19L417M12r80
12655g287L653L762K135J859L539k54o529M84n013n532M106M119k070L054L134
12640C160k840j591k077j157L7k270p12O782j831K986k897k541J303j648J089
$$ plain form
12748 2685 2911 538 1109 -476 -6704 -4363 -845 -3851 -3251 -2357 -409 1434 3417 3561 6949 5529
12732 5529 2012 2413 689 -11679 -14034 -7376 -1312 1334 -4927 -10315 -244 -1657 -10054 -9499 -5697
12717 -5697 2625 2487 2784 215 2370 5488 7810 9379 9771 10995 1260 -4018 -1516 -5515 -4039
12702 -4039 1327 -3488 -4453 -3398 -3972 -416 358 -312 223 3361 484 -5057 -5930 -652 71 -3089
12686 -3089 -2600 -4725 -8146 -11649 -7545 -15251 -16804 -10292 -4252 -223 -2693 -1873 -4976 -983 2981
12671 2981 116 -4977 -4450 -10249 -11226 -8105 -3270 -7202 -7069 -7746 -9119 -10555 -10136 -6719 -6307 -7287
12655 -7287 -3634 128 2263 4122 7661 7407 878 1362 -3651 -9183 -5077 -958 -3028 26 3160
12640 3160 320 -1271 -3348 -4505 -4468 -6738 -7450 -668 -2499 487 -2410 -4951 -3648 -5296 -4207
12625d207P35j076o05L477L202q378l397J217N502K656r13j264L315l919j608
12610e263L263l907m593r72P03O697K144l716j78J927k108M312m341J787M04m174
12594h015j861M325J319N320K988m284k626m168K482M679m48q53l143O858M157
12579F730m923m225l520p741n892Q182J0506K86K160j521m603m746k30R978J0753
12564A1194J660n652m088q910K826P092O5m769l215l347m98N954N435l47r518
12549f118o359K549L667J547P709P205k068k494j271J286m433L466J324k413k301
12534A296o716J750j741k665m974r27Q349P971O020o13l327M564l273K447j452
12519F709m286J942l78K155M047L048N45q765l131O117L599l805n750m090o301
$$ plain form
12625 -4207 -3472 -4548 -5153 -1676 1526 -6852 -10249 -9032 -3530 -874 -1787 -3051 264 -3655 -5263
12610 -5263 -2000 -5907 -10500 -11472 -10769 -4072 -1928 -5644 -5822 -3895 -6003 -1691 -6032 -4245 -3841 -8015
12594 -8015 -9876 -5551 -4232 1088 4076 -208 -2834 -7002 -4520 159 -289 -1142 -4285 2573 6730
12579 6730 1807 -2418 -5938 -13679 -19571 -11389 -883 -597 1563 42 -4561 -9307 -9537 441 11194
12564 11194 12854 7202 3114 -5796 -2970 4122 4187 -582 -3797 -7144 -7642 -1688 3747 3400 -6118
12549 -6118 -12477 -9928 -6261 -4714 2995 10200 8132 5638 4367 5653 1220 4686 6010 3597 1296
12534 1296 -5420 -3670 -5411 -8076 -13050 -13977 -5628 2343 8363 7750 4423 8987 5714 8161 6709
12519 6709 2423 4365 3987 6142 10189 13237 13782 5017 1886 8003 11602 7797 2047 -2043 -8344
12504h344m011O28Q372J1209K952n03J47j0420k010j291l955P74M450K977J572
12489B547l306l475L223n195j1328n675M549O767P095L382j627r29o85k787J30
12474g314M084M828J496p449p07R59r29K551j158P81m853N461J74m693J896J312
12458c561N26J703l120K789r12l97n164l64R84l966L961O482q5j981l192N516
12442g81N43o82j341o963K065r94l881L644J076O256J669l639K82r629N729N465
12426a181m896q19k470p058J5046j845k840O882J591o052J675N425j402m678O667
12411D045O142N09k168Q5j960l722m829m567r63L084k67k082k925L217J254K620
12395b527J235n910j55K813m249k977Q686J071j647o473m896N932P806N247K637
$$ plain form
12504 -8344 -12355 -11727 -3355 7854 10806 10303 10450 30 -1980 -3271 -7226 -6452 -2002 975 2547
12489 2547 -759 -4234 -1011 -6206 -17534 -23209 -18660 -11893 -4798 -1416 -3043 -3972 -4657 -7444 -7314
12474 -7314 -3230 1598 3094 -4355 -5062 -4103 -5032 -2481 -3639 -2858 -7711 -2250 -2076 -6769 -4873 -3561
12458 -3561 -3035 -1332 -4452 -1663 -2575 -2972 -8136 -8500 -7516 -11482 -7521 -1039 -1124 -3105 -6297 -781
12442 -781 -238 -920 -2261 -9224 -7159 -8153 -12034 -8390 -7314 -1058 611 -3028 -2746 -12375 -6646 -1181
12426 -1181 -6077 -6896 -9366 -16424 -1378 -3223 -6063 819 2410 -3642 -1967 3458 2056 -2622 4045
12411 4045 10187 10696 8528 8613 6653 2931 -1898 -6465 -7428 -4344 -4611 -6693 -9618 -6401 -5147 -2527
12395 -2527 -1292 -7202 -7357 -4544 -8793 -11770 -3084 -2013 -3660 -10133 -15029 -9097 -1291 3956 6593
12380F593j326n900n623q84q43K711l733l529l78N797O760L534r05k199j1318
12365a1243n153N361O028k868K510P295j141l347K389L997k14p48j392j361j667
12350a554j916p528m84Q473L91K2n138j262J276O87J6j398L218N682l689j617
12334d821M21N58N063L497J288k655r529o103l521K57K052L045K680j263l504
12319a2535L508K284l03j785J810j758L227K827K304j56N33L990l496m463l697
12304g710J506O367M820j04m816n40L265k200O089N020m812r391k354J96L038
12289a626j15L732J335j0605o998m512l452J581Q055N435N186O53n943j629j567
12274a0470M682Q358N509J95k281J668n35j252K635k689m896k070M989j999j662
$$ plain form
12380 6593 5267 -633 -6256 -7140 -7983 -5272 -9005 -12534 -12912 -7115 -355 3179 2274 75 -11243
12365 -11243 -16396 -11035 -5007 -7875 -5365 1930 789 -2558 -169 3828 3614 2866 1474 113 -1554
12350 -1554 -3470 -10998 -11482 -3009 -2618 -2596 -7734 -8996 -7720 -7033 -7017 -8415 -5197 485 -3204 -4821
12334 -4821 -4400 -3842 1221 4718 6006 3351 -6178 -12281 -15802 -15545 -13493 -10448 -7768 -9031 -12535
12319 -12535 -9027 -6743 -7046 -8831 -7021 -8779 -5552 -2725 -421 -577 -44 3946 450 -4013 -7710
12304 -7710 -6204 163 4983 4879 63 -477 2788 588 6677 11697 6885 -2506 -4860 -4664 -1626
12289 -1626 -1741 1991 3326 -7279 -14277 -18789 -22241 -20660 -12605 -7170 -1984 -1331 -7274 -8903 -10470
12274 -10470 -5788 2570 8079 8274 5993 7661 7126 5874 8509 5820 924 -1146 3843 1844 182
12259A82O76M128M859j0343J542L323l492j688P21M248M438P827P541l735k836
12244A7391k610N47m014o96l364m759l251j488j574l891P17j970p701k118R359
12229i422M384n857P09n02J73O891M961L211L119L500n552k907n8j326j760j036
12213a472J316J1590L561J71N344n175m632m47J34L087M23k501J655J6007o05
12198B8456N891P371N938R195Q790l225M372O180N70K647K160l565l697r604p702
12183E3777p16k247p49J412j786K02J724n731m048j314m128M46m74n006l206n200
12167B2956L98L991J881Q556L580k540j561J370M737P118J535O056O090Q447J3474
12152H6088K1487J7629J2691K3697K7113J9715K2812J2607O804O038O929J218
$$ plain form
12259 182 858 4986 9845 -498 1044 4367 875 -813 -92 4156 8594 16421 23962 20227 17391
12244 17391 14781 15328 11314 10618 7254 2495 -756 -2244 -3818 -7709 -6992 -8962 -16663 -18781 -9422
12229 -9422 -5038 -10895 -10186 -10688 -10515 -3624 1337 4548 7667 11167 5615 2708 2650 1324 -436 -1472
12213 -1472 -156 11434 14995 15166 20510 15335 10703 10256 10390 13477 13900 11399 13054 29061 28456
12198 28456 34347 41718 47656 56851 65641 62416 66788 72968 73538 76185 78345 74780 71083 61479 53777
12183 53777 53061 50814 50065 51477 49691 49893 51617 45886 41838 40524 36396 36842 36368 31362 28156 22956
12167 22956 23354 27345 29226 37782 41362 38822 37261 38631 43368 50486 52021 58077 64167 72614 86088
12152 86088 107575 125204 137895 161592 188705 208420 231232 243839 250643 256681 263610 264828
12140B64828j5674k2767k4469j8825j5053j4521j6272r331j4603j3819j1030r453
12128G9011k490r422n260n53n148p615L329L168j007j831L923J528P1L076J805
12113F2585j974O376J2940O587R777P346J0193J3558J9808K2961K5179K4054K2535
12100B41925J4306Q169J4764J2032Q64r025k2892j9482j4738k0151j2252j4432
12088A79088j6040l283k337q047q924q491L886J056K110j12M41n257j0520j1731
12074A11839r010q164m616p057o102j654J320q739o718q70O996J326J663P538
12060G7752J3417J2647J4018N400R275M930L7l82J682J2179O558j369l405m086
12046A48653K905N569L229P752J5050J2882J8611J4561J5878J2529J0220J0927
$$ plain form
12140 264828 249154 226387 201918 183093 168040 153519 137247 127916 113313 99494 88464 79011
12128 79011 76521 67099 61839 61286 56138 48523 51852 55020 54013 52182 56105 57633 57704 60780 62585
12113 62585 60611 66987 79927 86514 96291 103637 113830 127388 147196 170157 195336 219390 241925
12100 241925 256231 264400 279164 291196 292060 283035 260143 240661 225923 205772 193520 179088
12088 179088 163048 159765 157428 149381 140457 131966 135852 136908 139018 138906 139347 134090 123570 111839
12074 111839 102829 94665 90049 82992 76890 75236 76556 67817 61099 60229 67225 68551 70214 77752
12060 77752 91169 103816 117834 123234 132509 137439 137476 137094 138776 150955 157513 156144 152739 148653
12046 148653 151558 157127 160356 168108 183158 196040 214651 229212 245090 257619 267839 278766
12034B78766j605r625j1619q716j5966k0223k5259k0725j1953j8918j3793j1640
12022A08724j1657r440n541j6295j1450L38k998j021M322P908N349O19m753j0243
12008E3862k887K682m1P697R216O445N442L527J2982J6912J9519J3183J7092J2183
11994A77814J2706K2759K5955J8089J2034L282Q44p442j7107k1883k1399j8592
11982A87060j7134j7231k0681k4612j5478j5491p068m766o374m060L105q318n350
11969D3602l130j52p70o438o392K006rM702P05l038k75L164L549L312p45k584
11953C7507J404N956K794M199P678L458P900J1034Q553J0471r75q877k190o453
11939H2459j1189j0823r578q972J51k111o084r730n092P840J27p949P86J992N186
$$ plain form
12034 278766 277161 267536 255917 247201 231235 211012 185753 165028 153075 134157 120364 108724
12022 108724 97067 87627 82086 65791 54341 54679 51681 50660 54982 62890 68239 68858 64105 53862
12008 53862 50975 53657 53616 61313 70529 76974 82416 85943 98925 115837 135356 148539 165631 177814
11994 177814 190520 213279 239234 257323 269357 272639 273483 266041 248934 227051 205652 187060
11982 187060 169926 152695 132014 107402 91924 76433 69365 64599 58225 54165 57270 48952 43602
11969 43602 40472 40320 39550 33112 26720 28726 28717 33419 34124 31086 30811 33975 37524 40836 40091 37507
11953 37507 38911 44867 47661 51860 59538 62996 70896 81930 90483 100954 99979 91102 88912 82459
11939 82459 71270 60447 50869 41897 42048 39937 33853 24123 19031 26871 26998 19049 19835 21827 27013
11924B7013p916m842K328R82k800k111o56p486O6m86p024k523O390J0721L08m798
11908G166P6n026J033N381n303r061J601N702Q53n088k27L079L84o54J791l256
11892a549l264J442K25J738M394n96p197j713M597J432K790n578m58o328J490
11877h575K644l518L635K876P618K934j348p359m315L327L081n195k943j216K544
11862e810k415n130L414K688O873L847J121K314o714j700K883j647J366n269q680
11847a2859J414J0557J793j419M341P09j434J022m526L94k926j390J871L028j678
11832a103n28r8k491J230O348l946k24l993J885O161q20l706L162j419N24K12
11816A194j550n039K899L427q88J897j334N827M420l605k96m045n445n289J358
$$ plain form
11924 27013 19097 14255 16583 17565 14765 12654 11998 4512 4578 4092 -2932 -5455 935 11656 11964 7166
11908 7166 7242 2216 3249 8630 3327 -5734 -4133 1569 2422 -2666 -2893 186 570 -84 1707 -1549
11892 -1549 -4813 -3371 -3146 -1408 2986 2390 -4807 -6520 -1923 -491 2299 -3279 -3737 -10065 -8575
11877 -8575 -5931 -9449 -5814 -2938 4680 7614 6266 -1093 -5408 -2081 1000 -4195 -7138 -8354 -5810
11862 -5810 -8225 -13355 -9941 -7253 -380 3467 4588 6902 188 -1512 1371 -276 1090 -4179 -12859
11847 -12859 -11445 -888 905 -514 3827 4536 3102 4124 -402 -8 -2934 -4324 -2453 575 -1103
11832 -1103 -1631 -1729 -4220 -2990 3358 -588 -812 -4805 -2920 3241 2421 -1285 1877 458 982 1194
11816 1194 -356 -5395 -2496 931 43 1940 606 6433 10853 7248 6952 2907 -2538 -7827 -6469
11801f469K044K857l02n298q59J332K312M537M195J802o217p555O683k423m465
11786g826J673J927J225K764M364l577N928l001k523J796j0543k614M7N411M214
11771g35n414n277K188M423L727J408J45J317k304p32O242K517m900r365m754
11756a1514K241l032m275N124L435Q099P582K86m117J404q30k218J860n113o993
11741h061K908J603l251p214m164n155k36J892L369P230L955J026L83k031j604
11726i350r13O62J257L937K311j179n061K372j023J0326j769k895j727q335R45
11711a0442J0928M375J836k935n688l57R60L032L76m694j207j822M79j325o28
11696g112J42K125P539k911J63l529M993M168m698m62Q441M477p458n461j781
$$ plain form
11801 -6469 -4425 -1568 -1870 -7168 -8027 -6695 -4383 154 4349 6151 -66 -7621 -938 -3361 -7826
11786 -7826 -6153 -4226 -3001 -237 4127 550 6478 3477 954 2750 -7793 -10407 -10360 -4949 -735
11771 -735 -6149 -11426 -9238 -4815 -1088 320 465 1782 -522 -1254 4988 7505 2605 -6760 -11514
11756 -11514 -9273 -12305 -16580 -11456 -8021 78 7660 7946 3829 5233 4403 2185 4045 -1068 -8061
11741 -8061 -5153 -3550 -6801 -14015 -18179 -23334 -23570 -21678 -18309 -11079 -7124 -6098 -5715 -7746 -9350
11726 -9350 -10263 -9601 -8344 -4407 -2096 -3275 -8336 -5964 -6987 3339 1570 -1325 -3052 -11387 -10442
11711 -10442 486 4861 6697 3762 -1926 -2283 -1323 1709 2085 -2609 -3816 -5638 -5159 -6484 -7112
11696 -7112 -6970 -4845 2694 -217 -54 -3583 1410 5578 880 418 8859 13336 5878 417 -1364
11681a364P85M802k682R48k044K42j098R576L712o962K348n964k626K224l569
11666a672n019j960P580L890k437n645J89l880k230P015j932k582M704N635o9
11651A587K229m431m90j100o293O227P933J043j490p776l94N346l233o828J189
11636f481k592o366M052N318N47j725N033L939k290P42j2K037L847n267p728n251
11620a2197M476O336L410j656J082o96M401N37p09J502K947m138L431p57k10q94
11604F865j2787q508k102l30L413K471L579R71L703N520m817l638j969O938M396
11589C705P038K465p109m882l488r31J292L567j111J00N62Q77L21K668k423Q17
11573C468k74l107k115K5J801l651j837N565n90j281M266j937k7J227J247m859
$$ plain form
11681 -1364 -579 4223 1541 2489 445 687 -411 9165 12877 5915 8263 2299 -327 1897 -1672
11666 -1672 -6691 -8651 -1071 2819 382 -5263 -5074 -8954 -11184 -4169 -6101 -8683 -3979 1656 1587
11651 1587 3816 -615 -1105 -2205 -8498 -2271 5662 6705 5215 -2561 -2955 2391 -842 -7670 -6481
11636 -6481 -9073 -15439 -11387 -6069 -5522 -7247 -2214 1725 -565 177 165 2202 6049 782 -6946 -12197
11620 -12197 -7721 -1385 2025 369 1451 755 5156 5693 4984 6486 9433 5295 8726 7969 7759 6865
11604 6865 -5922 -14430 -16532 -16862 -13449 -10978 -7399 -6428 -2725 2795 -2022 -5660 -7629 -691 3705
11589 3705 10743 13208 6099 1217 -2271 -3202 -1910 1657 546 646 1208 2085 2406 5074 2651 3468
11573 3468 3194 87 -2028 -2003 -202 -3853 -5690 -125 -715 -1996 2270 333 306 1533 2780 -2079
11557b079k692m03J298O501p93m743l082j341J565O093J694N24J321l953Q78N341
11541F129l675o780m857J210O085O910m928R81j045j748l304o102K235Q29K933
11526e127p00N018K696M932j317j728j868o773J796J4254N360o092o285m291L126
11511C001k484j201l57l807n027K115J0715L16n323L518k503l485m669K400P030
11496B39J156o382J891P03J299l849Q07K595k559l202r98l110N484L405K835L027
11480C341m734q22j317L874l446O253N242M239J78L619k53l247m566J334N210
11465A4905q800j662J408P4n591L38m044n343J660q56l541J573K236M907Q36m814
11449f714j586n48L037j825L838L110k567k143l879M67L413N389p59n068m531
$$ plain form
11557 -2079 -4771 -5174 -3876 2625 1832 -2911 -5993 -7334 -5769 324 2018 2542 3863 -90 788 6129
11541 6129 2454 -4326 -9183 -7973 -1888 5022 94 1075 30 -1718 -5022 -11124 -8889 -8060 -5127
11526 -5127 -5827 -809 1887 6819 5502 3774 1906 -4867 -3071 11183 16543 10451 4166 -125 3001
11511 3001 517 -684 -1041 -4848 -9875 -7760 2955 3271 -2052 1466 -1037 -4522 -9191 -6791 239
11496 239 1395 -4987 -3096 -2393 -1094 -4943 -4136 -1541 -4100 -7302 -8300 -11410 -5926 -2521 314 3341
11480 3341 -1393 -2215 -3532 342 -3104 3149 8391 12630 12808 16427 16174 12927 8361 9695 14905
11465 14905 6105 4443 5851 5925 334 672 -3372 -8715 -7055 -7911 -11452 -9879 -7643 -2736 -1900 -6714
11449 -6714 -8300 -8848 -5811 -7636 -3798 -688 -3255 -5398 -9277 -8810 -5397 -8 -767 -5835 -10366
11434a0366O854J0262k184q630J918L62L687l182k48J242N713K106J983M288n823
11419G982p11k30l509k780N881j561R50o753n034J030k611q28J404k96k258M894
11403d430N083j303l026J00L967p376n519k849k705n202R334J0796k397K374l840
11388f993j813K195L66J184P59L990K164j174l416n688p711J37M225j285p387
11373b0447Q92J611L684O991M493j678n66j959j670K984Q477n15m34m848j225
11358d210k208l847k161Q22J459j054j009m671K238j873L545Q823J024L383n607
11343e346m442l306L179N886M576q51m056L201L210q675l394k895k21M956R555
11328A377J922J59k920o264n345N66K305J167L255l833j426n799Q094P792J787
$$ plain form
11434 -10366 -3512 6750 4566 -4064 -2146 -1784 1903 -1279 -1527 -285 5428 7534 9517 13805 7982
11419 7982 7271 7041 3532 752 6633 5072 6022 -731 -5765 -4735 -7346 -8174 -6770 -7066 -9324 -4430
11403 -4430 653 -650 -3676 -3576 391 -6985 -12504 -15353 -18058 -23260 -13926 -3130 -5527 -3153 -6993
11388 -6993 -8806 -6611 -6245 -5061 -4302 -312 1852 678 -2738 -8426 -16137 -16000 -11775 -13060 -20447
11373 -20447 -19555 -17944 -14260 -7269 -2776 -4454 -5020 -6979 -8649 -5665 2812 2297 1863 -2985 -4210
11358 -4210 -6418 -10265 -12426 -11604 -10145 -11199 -12208 -16879 -14641 -16514 -12969 -4146 -3122 261 -5346
11343 -5346 -9788 -13094 -9915 -4029 547 -304 -4360 -1159 2051 -6624 -10018 -12913 -13134 -8178 1377
11328 1377 3299 3458 538 -5726 -11071 -10505 -8200 -7033 -3778 -7611 -9037 -14836 -6742 1050 2837
11313B837o980q793O98L665J671j046n046l614j1487M42R022K440N023M002P194
11298B8R79m335j928M724M274M121l838L763j307j2332r040K689j298n879Q603
11283a0776N780m284l480l945M800Q296K108j5J586j435n739j037O445R354k964
11268D694o568n450q52K639K024k972o592l499K580O295P022M681M445n94j440
11253F413q579j226J121K404P16q885R638R139l426o501l750N555j93n936Q958
11238E448J110l168K678j212j564l262K248l417L936K370n296m370n632Q570M523
11223B962m497k566K195M615n79o052L22k085r144M347K723j089L075K695j262
11208d340o683n678N552j852o570l521L380N451K801j03O124K784l484j61l74
$$ plain form
11313 2837 -4143 -12936 -12238 -8573 -6902 -7948 -12994 -16608 -28095 -27653 -18631 -16191 -11168 -7166 28
11298 28 1007 -3328 -5256 -532 3742 7863 4025 7788 6481 -5851 -14891 -12202 -13500 -19379 -10776
11283 -10776 -4996 -9280 -12760 -16705 -11905 -3609 -1501 -1516 70 -1365 -7104 -8141 -1696 7658 4694
11268 4694 -1874 -7324 -8176 -5537 -3513 -6485 -13077 -16576 -13996 -7701 -679 4002 8447 7853 6413
11253 6413 -2166 -3392 -2271 133 849 -8036 1602 10741 7315 814 -2936 2619 2426 -3510 5448
11238 5448 6558 3390 6068 4856 3292 30 2278 -1139 2797 5167 -129 -4499 -10131 -1561 2962
11223 2962 -1535 -4101 -1906 2709 2130 -3922 -3600 -5685 -14829 -10482 -7759 -8848 -5773 -3078 -4340
11208 -4340 -11023 -16701 -11149 -13001 -19571 -23092 -19712 -14261 -11460 -11563 -5439 -2655 -6139 -6300 -6674
11193f674Q89M567M725p215j8238l330O908P923l826k289l721O39N788R625j83
11178d412n197k283K454Q395K199o83o865l793j925k152L776J567n110O488O876
11163f65K116k850M066k368j252N580M617l455j843J536o304n064R33l269j051
11148i273j142l35M715m517M602L793m271j559M374j597j280J1061P470o580o185
11133g24J596N850q04K33j72k642q64l135q682k25L37q60P298O688j837r154l61
11116g458O76n872J914O976n016M52K301q32l259N421p75p575M160L603Q146M22
11100C284o025L526J766M86P71l15j491l819n000M069L301q50o19L945R862L619
11084A6510q845l679J29j997L780m6N71o922n054p45k134q058M285Q549R375J09
$$ plain form
11193 -6674 -5785 -1218 3507 -3708 -21946 -25276 -18368 -10445 -14271 -16560 -20281 -19642 -13854 -4229 -4412
11178 -4412 -9609 -11892 -9438 -1043 1156 473 -6392 -10185 -12110 -14262 -10486 -8919 -14029 -7541 -665
11163 -665 1451 -1399 2667 299 -953 4627 9244 5789 3946 5482 -822 -5886 -4953 -8222 -9273
11148 -9273 -10415 -10750 -6035 -10552 -5950 -2157 -6428 -7987 -3613 -5210 -6490 4571 12041 5461 -724
11133 -724 872 6722 5918 6151 5979 3337 2473 -662 -9344 -9569 -9232 -10092 -2794 3894 2057 -7097 -7458
11116 -7458 -6782 -12654 -10740 -3764 -8780 -8328 -6027 -6859 -10118 -4697 -5472 -13047 -8887 -5284 2862 3284
11100 3284 -2741 785 2551 3037 3808 3493 2002 -1817 -6817 -2748 553 -297 -916 3029 12891 16510
11084 16510 7665 3986 4115 2118 5898 5852 6423 -499 -5553 -6298 -8432 -16490 -12205 -3656 5719 5828
11068E828k643n75N241P041j012r903l177l571m799k052m638M283M846L341P551
11053E761J585K266M242o257j0468m852k78j065k928J104j945Q619l662o677O279
11038h276n43l460K361M880m282j0360J49M341N112Q951J09n86M127k829o209
11023f515M257M263n344q201j196Q97K688P051L848m800o380k855M943M010L886
11008E52M518Q63M753K879R559K311j2305l498L190J514n654n563n016j726j387
10993e010n361M385J822j824N241Q90o219j812K189N641K976k093j1182m187K758
10978a1786N442M497j57N44K957M662o682n537L592p64j213m343M010Q276n204
10963a706r10O146m393j087j001K481m034q958m104L235J1642M432r920j88L052
$$ plain form
11068 5828 3185 2610 7851 14892 13880 3977 800 -2771 -7570 -9622 -14260 -9977 -5131 -1790 5761
11053 5761 7346 9612 13854 7597 -2871 -7723 -8001 -9066 -11994 -10890 -12835 -4216 -7878 -14555 -8276
11038 -8276 -8819 -12279 -9918 -5038 -9320 -19680 -19531 -15190 -10078 -1127 -1018 -1604 2523 -306 -6515
11023 -6515 -2258 2005 -3339 -11540 -12736 -11839 -9151 -2100 1748 -3052 -9432 -12287 -7344 -3334 552
11008 552 5070 5933 10686 13565 23124 25435 13130 9632 12822 14336 8682 3119 -1897 -3623 -5010
10993 -5010 -10371 -5986 -4164 -5988 -747 143 -6076 -7888 -5699 -58 2918 825 -10357 -14544 -11786
10978 -11786 -6344 -1847 -2004 -1460 1497 6159 -523 -6060 -2468 -3232 -4445 -8788 -4778 3498 -1706
10963 -1706 -2616 3530 -863 -1950 -2951 -470 -4504 -13462 -17566 -14331 -2689 1743 -8177 -8365 -5313
10948e313N241k75J995k495l456l073j457j881K12j152J951N597J842p824r422
10933a9510L402J1560M366p684l405L374N251K817Q92k345n024O553L93k697k277
10918d334M190M381L620J450m154j885J704j828p52O460J535q766j625Q418j035
10903G379j806M522l614j0501n384m19m133J2428L301l630K629L959J762j225
10889E268o401l235K555j014Q40J884L388k780k658l211l957n26J550k452k467
10874a3216K613N817J32n204K999O153n569n297k523M439P368n628l492L078O496
10859a834k581k4j4K766j13p014m973n29O833Q077j278m063O534P122N477k121
10843A2265k997j260m660o449m52R542o746j0539P958J639Q76J511k033l555k313
$$ plain form
10948 -5313 -72 -347 1648 -847 -4303 -7376 -8833 -10714 -10502 -11654 -9703 -4106 -2264 -10088 -19510
10933 -19510 -16108 -4548 -182 -7866 -11271 -7897 -2646 171 1063 -1282 -6306 247 640 -2057 -4334
10918 -4334 -144 4237 7857 9307 5153 3268 4972 3144 2392 8852 10387 1621 -4 8414 7379
10903 7379 5573 10095 6481 -4020 -9404 -9823 -13956 -1528 1773 -1857 772 4731 6493 5268
10889 5268 -1133 -4368 -1813 -2827 -1987 -103 3285 505 -2153 -5364 -9321 -9847 -8297 -10749 -13216
10874 -13216 -10603 -4786 -4654 -9858 -6859 -706 -6275 -11572 -14095 -9656 -2288 -7916 -11408 -8330 -1834
10859 -1834 -4415 -4439 -4453 -1687 -1800 -8814 -13787 -14316 -7483 594 -684 -4747 1787 8909 14386 12265
10843 12265 9268 8008 3348 -3101 -3553 5989 -757 -11296 -3338 -1699 -823 688 -1345 -4900 -7213
10828g213K12N965J025o551J371j38K619J72J453J453q97m170o527k174N318K23
10812g859N430P70r328m876K055r01M942l06O85J972J328K806j994J76K113L088
10796A01m772o647r425o739J038O138N572k270j546J0355Q493M84J53J840L411
10781F186n278m206j561K663J68l217j827n572j32J3096N44J761O712l356r458
10766c477J785K402L24j0670m831L288K297n74k351q3j142L963J299K641N166
10751C7R66n503l544k523K48K007M669j40o666l402j290J319J095J828M991Q809
10735B901K675n53n95N109J924n638j0395N8n35k134q32K856j022J228l288P793
10719d48M607m982o184q380l380O919Q928Q33Q766M062j00p99o066j526j130L026
$$ plain form
10828 -7213 -7001 -1036 -11 -6562 -5191 -5329 -2710 -2538 -1085 368 -529 -4699 -11226 -13400 -8082 -7859
10812 -7859 -2429 -1659 -10987 -15863 -13808 -14709 -9767 -10073 -9388 -7416 -6088 -3282 -5276 -5100 -2987 101
10796 101 -4671 -11318 -20743 -27482 -26444 -20306 -14734 -17004 -18550 -8195 298 782 935 2775 6186
10781 6186 908 -3298 -4859 -2196 -2028 -5245 -7072 -12644 -12776 320 864 2625 9337 5981 -3477
10766 -3477 -1692 710 1034 -9636 -14467 -11179 -8882 -9456 -11807 -11890 -13032 -9069 -7770 -5129 37
10751 37 1003 -4500 -8044 -10567 -10319 -8312 -3643 -3783 -10449 -13851 -15141 -13822 -12727 -10899 -5908 2901
10735 2901 5576 5023 4428 9537 11461 5823 -4572 -4514 -5049 -7183 -8015 -5159 -6181 -4953 -8241 -448
10719 -448 4159 -823 -7007 -15387 -18767 -11848 -2920 -2087 6679 10741 10641 9842 3776 2250 1120 4146
10703D146k094l877l751L106N459j077l997n2O687j088m852m071j837L370L0j467
10687e365n738J418O220j325O84j071n44k312Q71r777N753O322N965Q504M330
10672A3935j595J670j210o303j2542r712K40N604Q356j105L298L634r54N279L014
10657A1609j984j738j2070m187J864J748O42L370J424n856p136P01K749n569N126
10642i307L988O079O210k161k647L6Q55o043l155N872m439p659k261O715N185
10627b732M741L778l979l64L160J153q821r24L681N897j271p190j735k406M274
10612b738L11J067j983K81M824M098o449k040j65K781L65n103R62M871L893N77
10596E552J682m731J411O275p464k158M92o326O641j238m36J112l451j025l596
$$ plain form
10703 4146 2052 -1825 -5576 -2470 2989 1912 -2085 -2137 4550 3462 -1390 -5461 -7298 -3928 -3898 -5365
10687 -5365 -11103 -9685 -3465 -4790 -4106 -5177 -5721 -8033 -7162 -16939 -11186 -4864 1101 9605 13935
10672 13935 12340 14010 12800 6497 -6045 -15757 -15517 -9913 -1557 -2662 636 4270 3316 8595 11609
10657 11609 9625 7887 -4183 -8370 -6506 -4758 -4116 -746 678 -5178 -12314 -11613 -8864 -14433 -9307
10642 -9307 -5319 760 6970 4809 2162 2198 3053 -2990 -6145 -273 -4712 -12371 -14632 -7917 -2732
10627 -2732 2009 5787 1808 1444 4604 5757 -3064 -3988 -307 5590 4319 -2871 -4606 -7012 -2738
10612 -2738 -2427 -1360 -3343 -3062 1762 5860 -589 -2629 -2794 -13 352 -4751 -3789 1082 4975 5552
10596 5552 7234 2503 3914 10189 2725 567 1059 -5267 1374 136 -300 812 -2639 -3664 -7260
10581g260j994P292K62m460M291K126l941J134L349K485j246J419m506q20J967
10566I8Q723N217L774k826m905l209k563o561o312p777k86M530J0361N98k216
10551c354l276k113K636Q325M441o440n937l142P30K832K187M136o14k405K55
10536a739J16p141l904l394J335O845N838J821k810o54o266M210J969k678J155
10521e297O258Q36J993m097m054N220O818k258l516j78J873J615M86n079m650
10506d030j887M391q65j879j632K558j838j310K018J735K487L91M883n139l785
10491c902J889k686p009J050M518n699k50K449L21k404J25J2234O339l26l458
10476C191J666j02l961q566k574P017O52p989k60O342J788K253r84k78l344K679
$$ plain form
10581 -7260 -9254 -1962 -1700 -6160 -1869 257 -3684 -2550 799 3284 2038 3457 -1049 -1869 98
10566 98 8821 14038 17812 14986 10081 6872 4309 -2252 -8564 -16341 -16627 -12097 -1736 -1138 -3354
10551 -3354 -6630 -8743 -6107 2218 6659 219 -5718 -8860 -8130 -5298 -3111 1025 411 -1994 -1739
10536 -1739 -1623 -8764 -12668 -16062 -14727 -7882 -2044 -223 -3033 -3687 -9953 -5743 -3774 -6452 -5297
10521 -5297 961 1797 3790 -307 -4361 859 7677 5419 1903 1725 3598 5213 5699 620 -4030
10506 -4030 -5917 -1526 -2391 -4270 -5902 -3344 -5182 -6492 -4474 -2739 -252 139 5022 -117 -3902
10491 -3902 -2013 -4699 -11708 -10658 -6140 -11839 -12089 -9640 -9319 -11723 -11598 636 6975 6649 3191
10476 3191 4857 4755 794 -7772 -10346 -3329 -2677 -10666 -10926 -4584 -2796 -543 -1527 -1805 -5149 -2470
10460b470O857L549n017R38J999o102o686j564q46k683k692K662M348J431N18
10445e758k086K244N370j354N08J532m762k100J528J926j080p694L037K700k743
10430h732N653k441p400r60P148L145M53m733k750O69L497n29J818j855j906k717
10414a1640k711L4M80N641L410m227N313O229r51L278k115o827o65M02k168m434
10398a0951P05N779R856L695o5o27k580o204k209L38K378q99P62L754m387l370
10382d025p63L073r37l305L831j634m743l365K496N672R080j982l177N669L74
10367F264o20k955k873j839J006K522M534k851m883j924P304L640j051j355p048
10352b129o837l725j587L846j066J212j684L773J673m709K40M574N716k989j64
$$ plain form
10460 -2470 4387 7936 2919 3857 5856 -246 -6932 -8496 -9342 -12025 -14717 -12055 -7707 -6276 -5758
10445 -5758 -7844 -5600 -230 -1584 -1076 456 -4306 -6406 -4878 -2952 -4032 -11726 -8689 -5989 -8732
10430 -8732 -3079 -5520 -12920 -13880 -6732 -3587 -3134 -7867 -10617 -9948 -6451 -6980 -5162 -7017 -8923 -11640
10414 -11640 -14351 -14317 -13837 -8196 -4786 -9013 -3700 2529 1578 4856 2741 -4086 -4751 -4349 -6517 -10951
10398 -10951 -10246 -4467 5389 9084 9019 8392 5812 -392 -2601 -2263 115 -784 -22 3732 -655 -4025
10382 -4025 -4788 -1715 -2652 -5957 -2126 -3760 -8503 -11868 -9372 -3700 5380 3398 221 5890 6264
10367 6264 5644 2689 -184 -2023 -1017 1505 6039 3188 -1695 -3619 3685 7325 6274 4919 -2129
10352 -2129 -8966 -12691 -14278 -10432 -11498 -10286 -11970 -8197 -6524 -11233 -10993 -6419 -703 -3692 -3856
10337c856R88l897R03M383q7j015k097k431n076K082P640O736l395L447N406K850
10321A2581l758q122n156k271M039j202m549j960O441n28n857o645K098L77K520
10306a1992Q376k39Q810J706n164k252K330K386o973q939J570R966L00j218L324
10291A991k072l997l698l731K44K781L673J548K677N444o106J991P296K326j302
10276I065k452m830l880k224J615N420J2581j964p718j0040p649l59n50O731J5104
10261H850n51k392k4J202L609j834n397j585j696n738O341m911j246L008J800
10246e64J438L70m52j0093j075P074P131K910k206L846m084n177j0053k254N840
10231g349P189O333K325o603m444n078L983O035M583K458R96m80k142n894n219
$$ plain form
10337 -3856 -2868 -6765 -5862 -1479 -1566 -2581 -4678 -7109 -12185 -10103 -2463 4273 878 4325 9731 12581
10321 12581 8823 701 -4455 -6726 -2687 -3889 -8438 -10398 -3957 -4485 -10342 -16987 -14889 -14512 -11992
10306 -11992 -3616 -3855 4955 6661 1497 -755 1575 3961 -3012 -11951 -10381 -415 -115 -1333 1991
10291 1991 -81 -4078 -7776 -11507 -11263 -8482 -4809 -3261 -584 4860 -1246 745 8041 10367 9065
10276 9065 6613 1783 -2097 -4321 -2706 2714 15295 13331 5613 -4427 -12076 -12435 -12985 -6254 8850
10261 8850 8299 5907 5883 7085 10694 8860 3463 1878 182 -5556 785 -4126 -5372 -2364 -564
10246 -564 874 1244 792 -9301 -10376 -3302 3829 6739 4533 8379 4295 -882 -10935 -13189 -7349
10231 -7349 -160 6173 8498 1895 -2549 -7627 -3644 2391 6974 9432 10428 9948 7806 1912 -3307
10216c307n643J909j649K734K561K970l54N988N023l493M813p14j474N089o601
10201G852o294m37N104k517m559n238o813l347J64N640j740q02N336L651p634
10186a1634j736P349O907j374m222J600j080M922J789K383j796j1442l413M351
10172g396O61N311J968N61P589J870l742R71j971q00K268j911l5k304q123M758
10156c25R227o22n226k990O38q008Q042O530J75j823m118M839N057J617M199J379
10140A8591M446L981O210k645o156j441j0300j411j453p558r626m839Q199K380
10126a622k554N016M003P33j147k819O748J402m609l701m522k160J236O24K45
10111c127Q06K93L102K702o6r14J076n400j717j354k684N28K495P4K850Q930L28
$$ plain form
10216 -3307 -8950 -7041 -8690 -5956 -3395 -425 -779 5209 10232 6739 11552 10838 9364 14453 7852
10201 7852 1558 1121 6225 3708 -851 -6089 -12902 -16249 -16085 -10445 -12185 -12987 -7651 -4000 -11634
10186 -11634 -13370 -6021 886 -488 -4710 -3110 -4190 732 2521 4904 3108 -8334 -11747 -7396
10172 -7396 -6735 -1424 544 1105 8694 10564 6822 7793 5822 5022 7290 5379 5344 3040 -5083 -325
10156 -325 8902 8280 3054 64 702 -7306 736 7266 7441 5618 1500 6339 11396 13013 17212 18591
10140 18591 23037 27018 33228 30583 24427 22986 12686 11275 9822 2264 -7362 -12201 -4002 -1622
10126 -1622 -4176 840 4843 5576 4429 1610 8358 9760 5151 1450 -3072 -5232 -3996 -3372 -3127
10111 -3127 -2321 -2028 1074 3776 3710 2796 3872 -1528 -3245 -4599 -7283 -6755 -4260 -4186 -1336 7594 7922
10094G922k169k339j612J291J734J30L764P89k103m130K986L429j817j731M262
10079A0406k644l767k858N193N064l720N8J951J688M52L100Q38L118M118L816
10064B6813J715m759Q019O196R980P650Q269K1597L5576M7511N9441P0839Q2207
10051C81054J03577J01727N9149k516m3562p6176r3926r1737q0089o7686m9935
10040A39880l2206k4718j4960q261j2362j2825p960n271k184J90j511o87P910
10027B5035j0174q619K455J926k686p402q85M858j81p392J340j69N118m972R95
10012g53l89j1808j0628K511R332M549J01n060L503N51l777k429J853j798K092
9997a2150p244j238L210P23Q15R786O026j578K900r236m372L295P094O172j1246
$$ plain form
10094 7922 5753 3414 1802 3093 4827 4957 8721 9510 7407 3277 6263 9692 7875 6144 10406
10079 10406 7762 3995 1137 6330 11394 7674 7732 9683 11371 11823 14923 15761 18879 22997 26813
10064 26813 28528 23769 31788 37984 47964 55614 63883 85480 121056 168567 228008 298847 381054
10051 381054 484631 586358 645507 642991 599429 523253 429327 337590 257501 189815 139880
10040 139880 107674 82956 67996 59735 47373 34548 26588 21317 19133 19323 17812 17125 25035
10027 25035 14861 6242 8697 10623 7937 535 -350 4508 4327 -3065 -1725 -1894 3224 -1748 -753
10012 -753 -1142 -12950 -23578 -21067 -11735 -7186 -7085 -12145 -8642 -8091 -11868 -14297 -12444 -14242 -12150
9997 -12150 -19394 -20632 -17422 -16699 -15884 -6098 -72 -1650 1250 -7986 -12358 -9063 -1969 4203 -7043
9982g043k669K99M025J563n013Q817O297M72p387p579j800k405k93O45J511K1
9966a0539M569R681m175p888L26n666O665N140l867p248P490P915l331J313J397
9951A782K907J983l837m188j2309k191Q750L491k621K443O816L075o538o476r38
9936g851N87J314P49K617J967Q02j960J09N883L350J101n197j636k753K304k903
9920a517m811o386k827l122J0275J0943P358J623L175n695p613q657Q27J216P047
9905A836j117k982m433l91m173K861M196N568O403j39N96l244l925J720n101o414
9889h739K283J249R53l241m485J579k066K924O016K472j663q337j851M625L589
9874d692O501m0M70k816l958J197M755K625p52K672l73J318J268o758m755K304
$$ plain form
9982 -7043 -9712 -9413 -5388 -3825 -8838 -21 6276 6748 -639 -8218 -10018 -12423 -12716 -12071 -10560 -10539
9966 -10539 -5970 3711 -464 -8352 -8026 -13692 -7027 -1887 -5754 -13002 -5512 2403 -928 385 1782
9951 1782 4689 6672 2835 -1353 -13662 -15853 -7103 -3612 -6233 -3790 3026 6101 -437 -6913 -7851
9936 -7851 -7264 -5950 -5201 -2584 -617 185 -1775 -1666 4217 7567 8668 3471 1835 -918 1386 -1517
9920 -1517 -6328 -12714 -15541 -18663 -8388 2555 9913 11536 14711 9016 1403 -7254 -6427 -5211 1836
9905 1836 719 -2263 -6696 -7087 -11260 -8399 -4203 1365 7768 7629 8225 4981 1056 2776 -2325 -8739
9889 -8739 -6456 -5207 -4254 -7495 -11980 -10401 -12467 -9543 -3527 -1055 -2718 -11055 -12906 -8281 -4692
9874 -4692 1809 1769 2239 -577 -4535 -3338 1417 4042 3290 5962 5589 6907 8175 1417 -3338 -1034
9858a034L793j801l733l575K787P948K169k222O527m08p714o134q306k563J985
9843a2281N219M864n183o48O075j11k279k161J089k757q304q59L678m991J696
9828a6953J728K236Q01J53l859j630M744N215N469K404K161o913q03P166P599
9813I518l237r479m564R5j683n18L014m637j999N994j441j4274J7J2999M822l496
9797h869L90K771L986p83k051Q532J192j427M732J970k463j519K453k79o254m285
9781a904J16l104j156K46l526j89N076K623K716o905n03J3846K872r479j0725
9766i996K518J23K739M213J727K133P332R029p937n547j649j419K526k174N742
9751I360n615k066J782M239Q702J780l438j0280l741m58N54m604n80M390K695
$$ plain form
9858 -1034 2759 958 -2775 -6350 -3563 4385 6554 4332 10859 10451 2737 -3397 -11703 -14266 -12281
9843 -12281 -7062 -2198 -7381 -8029 -1954 -2065 -4344 -6505 -5416 -8173 -16477 -17336 -13658 -18649 -16953
9828 -16953 -15225 -12989 -12188 -12035 -15894 -17524 -12780 -7565 -2096 308 2469 -4444 -5247 1919 9518
9813 9518 6281 -3198 -7762 -7667 -9350 -9868 -6854 -11491 -13490 -7496 -8937 -23211 -23194 -10195 -5373 -8869
9797 -8869 -8479 -5708 -1722 -2505 -4556 3976 5168 3741 8473 10443 7980 6461 8914 8635 2381 -1904
9781 -1904 -1788 -4892 -6048 -5802 -9328 -9517 -4441 -1818 898 -6007 -6510 7336 10208 729 -9996
9766 -9996 -7478 -7355 -4616 -403 1324 3457 10789 19818 11881 6334 4685 3266 5792 3618 9360
9751 9360 3745 1679 3461 7700 16402 18182 14744 4464 723 265 819 -3785 -4365 25 2720
9736B720j400l226j77N582k229L17L68n037K128R287k169j843K015k646m557K82
9720e85P57j594r417n162N230R154M32R762m666J815L432k433Q99n05o175j689
9704g45k548J99M631l651j201J0032J796K964n429p380J033K86k15q23J479N02
9688I30p37m089L438L78J132K129J242L051j192m023k417p550K579K17k280Q274
9672A082K427M850r60q08L053l831q494k272P582K456m047o087k342k965J983
9657h373O470L635J02o80L404r29L99n451l639M168M107l845m463L186j612n249
9641h770J626N097R282P87n731j184l166o529p0R868L708l00j745m775k733R773
9625E138l453o92K726J522R18O20R105p363p788P247L314o952o602j703Q848K154
$$ plain form
9736 2720 1320 -1906 -2083 3499 1270 1587 1955 -3082 -954 8333 6164 4321 6336 3690 -867 -585
9720 -585 172 -1422 -10839 -16001 -10771 -1617 -1185 8577 3911 5726 9158 6725 7624 7119 944 -745
9704 -745 -3293 -3094 1537 -2114 -3315 6717 8513 11477 6048 -1332 -299 -13 -228 -1051 428 930
9688 930 193 -3896 -458 -80 1052 3181 4423 7474 6282 2259 -158 -7708 -5129 -4912 -7192 1082
9672 1082 3509 8359 7399 6591 9644 5813 -2681 -4953 2629 5085 1038 -5049 -7391 -10356 -8373
9657 -8373 -1903 1732 1834 1154 4558 3629 4028 -1423 -5062 -894 3213 -632 -5095 -1909 -3521 -8770
9641 -8770 -7144 -2047 7235 8022 2291 1107 -2059 -8588 -8658 1210 4918 4618 2873 -1902 -4635 5138
9625 5138 1685 993 3719 5241 6159 6779 15884 8521 733 7980 11294 4342 -2260 -3963 4885 7039
9609G039q640J977P337K627l05l158q652m033j329p3P025Q810m611p420k853M659
9593a600J916K47K112N456l475j665k829q743m672Q210R676M740m786k246J69
9578B510n679q976k714N21K815q01N922M828K57K75o106R386L919m367l562K377
9562F05m065j197j28l7L410k380j722p446j322J3152Q073j092j252K875l993q306
9546d825q079O935K254l652J827J4780l180n582P14k152k385R18K32j084q056
9531a1335M231K418K447K814k698l768m776M496J1415L265J299l417j0255m12
9517d276j422N354J958K782l003n47L097L043K062n337j776K698l787r281N886
9502b549O640J149k824l894Q368L364j905n961l495m127L309J602k157J691j118
$$ plain form
9609 7039 -1601 376 7713 10340 10035 6877 -1775 -5808 -7137 -7210 -185 8625 4014 -3406 -6259 -1600
9593 -1600 316 563 2675 8131 4656 2991 162 -8581 -13253 -5043 4633 9373 4587 2341 2510
9578 2510 -3169 -12145 -14859 -14338 -11523 -12324 -6402 -1574 -1317 -1042 -7148 2238 6157 1790 -1772 605
9562 605 -3460 -4657 -4785 -4822 -1412 -3792 -5514 -12960 -14282 -1130 6943 5851 4599 7474 3481 -4825
9546 -4825 -12904 -5969 -3715 -7367 -5540 9240 6060 478 1192 -960 -3345 -2427 -2195 -3279 -11335
9531 -11335 -7104 -4686 -2239 575 -2123 -5891 -10667 -6171 5244 8509 9808 6391 -3864 -4276
9517 -4276 -5698 -344 1614 4396 1393 846 3943 6986 9048 3711 1935 4633 846 -8435 -2549
9502 -2549 4091 5240 2416 -1478 6890 10254 8349 2388 -1107 -5234 -1925 -323 -2480 -789 -1907
9487a907m496L473L260Q674K682o614q573r894m510O419q50l398n23O050O354
9472c853M872L955m08L081J397J79k958l046p301l055m116R76R312Q635K649o737
9456C582p267M955L297J488n722j355J70J631n363k794J786Q90K725j142l873
9441f992K91o385N445O068N037q434J425o15n215l341M3m87Q316N765r3j380N431
9424D879o045p407l180L29J318J835k54K914K096j583K101m293l886j694M02J609
9408a0859O17R67K473O89J513K819O562K948M59k171q085o822j327Q032K153n121
9392e153p283L84R80k268L076O825L770l248o138M172N967N385M56r282l904l092
9376i353l245L315K329k25q20K80N767L493J107M197j901n671n474J189L013N556
$$ plain form
9487 -1907 -6403 -2930 330 9004 11686 5072 -3501 -13395 -17905 -11486 -12336 -15734 -16257 -10207 -3853
9472 -3853 1019 4974 4566 7647 9044 9223 6265 3219 -4082 -7137 -11253 -10277 -965 7670 10319 3582
9456 3582 -3685 1270 4567 6055 333 -1022 -852 779 -4584 -7378 -5592 -4702 -1977 -3119 -6992
9441 -6992 -6701 -13086 -7641 -1573 3464 -4970 -3545 -4160 -9375 -12716 -12673 -13160 -4844 921 828 -552 4879
9424 4879 -1166 -8573 -11753 -11424 -10106 -8271 -8525 -5611 -3515 -5098 -2997 -7290 -11176 -12870 -12468 -10859
9408 -10859 -10242 -9275 -6802 -6113 -4600 -1781 4781 7729 8188 6017 -2068 -8890 -10217 -2185 -32 -5153
9392 -5153 -12436 -12052 -11072 -13340 -10264 -3439 331 -2917 -9055 -4883 1084 6469 6925 -2357 -6261 -9353
9376 -9353 -12598 -9283 -6954 -7179 -7999 -7719 -1952 1541 2648 6845 4944 -727 -6201 -5012 -1999 3557
9360C557K140j142J130O80l418k207k820k640n716J838k075N562L050n118l830
9345a1009P446M686k074o130O600L249K051K845K100N01k93o737n745Q30N410
9330C730O214m09k693j28p809K056n284j823k239M38k720K988j178O77P623m754
$$ plain form
9360 3557 5697 4555 5685 6365 2947 740 -2080 -4720 -10436 -8598 -10673 -5111 -2061 -7179 -11009
9345 -11009 -3563 1123 -951 -7081 -481 2768 4819 7664 9764 10265 9972 3235 -2510 -1680 3730
9330 3730 9944 9535 6842 6714 -1095 961 -4323 -6146 -8385 -7947 -10667 -7679 -8857 -8180 -557 -5311
$$ [...]
##END NTUPLES=NMR SPECTRUM
##END=
