##TITLE=Analysis number 318081
Compound Code cc 50809
Book Reference 481/4
Project Code adrs
Chemist Name bruced
##JCAMPDX= 6.0         $$ Bruker NMR JCAMP-DX V2.0
##DATA TYPE= NMR SPECTRUM
##DATA CLASS= NTUPLES
##ORIGIN= Bruker BioSpin GmbH
##OWNER= nmr
$$ XWIN-NMR		Version 3.5
$$ Wed Mar 15 09:46:09 2006 GMT Standard Time (UT+0h)  MAYBRIDGE\nmr@NMR_250MHZ
##.OBSERVE FREQUENCY= 250.131544655141
##.OBSERVE NUCLEUS= ^1H
##.ACQUISITION MODE= SIMULTANEOUS (DQD)
##.ACQUISITION SCHEME= undefined
##.AVERAGES= 16
##.DIGITISER RES= 18
##SPECTROMETER/DATA SYSTEM= dpx250
##.PULSE SEQUENCE= zg30
##.SOLVENT NAME= CDCl3
##.SHIFT REFERENCE= (INTERNAL, CDCl3, 0, 16.522)
##AUDIT TRAIL= $$ (NUMBER, WHEN, WHO, WHERE, WHAT)
$$ ##TITLE= Audit trail, XWIN-NMR		Version 3.5
$$ ##JCAMPDX= 5.01
$$ ##ORIGIN= Bruker BioSpin GmbH
$$ ##OWNER= nmr
$$ C:\u/data/dgb/nmr/ADRS/690/pdata/1/auditp.txt
$$ ##AUDIT TRAIL=  $$ (NUMBER, WHEN, WHO, WHERE, WHAT)
(   1,<2006-03-15 09:45:21.78 +000>,<MAYBRIDGE\nmr>,<NMR_250MHZ>,
      <created by zg, POWCHK disabled, PULCHK disabled
       configuration hash MD5:
       84 BC 41 DB A1 6E 1D 46 DA 25 12 A5 C1 ED C5 3A
       data hash MD5: 64K
       00 39 20 18 64 24 1E 62 91 85 6E 77 EB 2D 59 EB>)
(   2,<2006-03-15 09:45:45.66 +000>,<MAYBRIDGE\nmr>,<NMR_250MHZ>,
      <Start of raw data processing
       ef LB = 0.3 FT_mod = 6 PKNL = 1 SI = 32K 
       data hash MD5: 32K
       0E 17 55 9E B4 AC 4A 94 C1 7A 39 E4 94 52 D2 86>)
(   3,<2006-03-15 09:45:48.81 +000>,<MAYBRIDGE\nmr>,<NMR_250MHZ>,
      <apk 
       data hash MD5: 32K
       BA 4D 7E 26 A3 A7 6A 6C 83 6A D0 A0 D0 DC 4E ED>)
(   4,<2006-03-15 09:45:49.80 +000>,<MAYBRIDGE\nmr>,<NMR_250MHZ>,
      <abs ABSG = 5 
       data hash MD5: 32K
       BF 6D 0D A3 01 C3 0B F1 18 25 ED 66 9A E5 44 9B>)
$$ ##END=
$$ 
$$ hash MD5
$$ 92 E3 64 36 56 AB E1 35 0F 52 28 44 1A 25 97 51
##$RELAX= 
##$RELAX= 
##$RELAX= 
##$RELAX= 
##$RELAX= 
##$RELAX= 
##$RELAX= 
$$ Bruker specific parameters
$$ --------------------------
##$DU= <C:\u>
##$EXPNO= 690
##$NAME= <ADRS>
##$PROCNO= 1
##$TYPE= <nmr>
##$USER= <dgb>
##$AMP= (0..31)
100 100 100 100 100 100 100 100 100 100 100 100 100 100 100 100 100 100 
100 100 100 100 100 100 100 100 100 100 100 100 100 100 
##$AQSEQ= 0
##$AQ_mod= 3
##$AUNM= <au_zg>
##$AUTOPOS= <5 >
##$BF1= 250.13
##$BF2= 250.13
##$BF3= 250.13
##$BF4= 250.13
##$BF5= 500.13
##$BF6= 500.13
##$BF7= 500.13
##$BF8= 500.13
##$BYTORDA= 1
##$CFDGTYP= 0
##$CFRGTYP= 5
##$CHEMSTR= <none>
##$CNST= (0..31)
1 1 145 1 1 1 1 1 1 1 1 1 1 1 1 1 1 1 1 1 1 1 1 1 1 1 1 1 1 1 1 1 
##$CPDPRG= <>
##$CPDPRG1= <>
##$CPDPRG2= <>
##$CPDPRG3= <>
##$CPDPRG4= <mlev>
##$CPDPRG5= <mlev>
##$CPDPRG6= <mlev>
##$CPDPRG7= <mlev>
##$CPDPRG8= <mlev>
##$CPDPRGB= <>
##$CPDPRGT= <>
##$D= (0..31)
0 1 0 0 0 0 0 0 0 0.06 0 0 0 0 0 0 0.0002 0 0 0 0 0 0 0 0 0 0 0 0 0 0 
0 
##$DATE= 1142415919
##$DBL= (0..7)
120 120 120 120 120 120 120 120 
##$DBP= (0..7)
150 150 150 150 150 150 150 150 
##$DBP07= 0
##$DBPNAM0= <>
##$DBPNAM1= <>
$$ [...]
##$SUBNAM7= <"">
##$SUBNAM8= <"">
##$SUBNAM9= <"">
##$SW= 20.6930455092707
##$SWIBOX= (0..15)
0 0 3 0 0 0 0 0 0 0 0 0 0 0 0 0 
##$SW_h= 5175.983436853
##$TD= 65536
##$TD0= 1
##$TE= 293.16
##$TE2= 300
##$TE3= 300
##$TEG= 300
##$TL= (0..7)
0 120 120 120 120 120 120 120 
##$TP= (0..7)
150 150 150 150 150 150 150 150 
##$TP07= 0
##$TPNAME0= <>
##$TPNAME1= <>
##$TPNAME2= <>
##$TPNAME3= <>
##$TPNAME4= <>
##$TPNAME5= <>
##$TPNAME6= <>
##$TPNAME7= <>
##$TPOAL= (0..7)
0.5 0.5 0.5 0.5 0.5 0.5 0.5 0.5 
##$TPOFFS= (0..7)
0 0 0 0 0 0 0 0 
##$TUNHIN= 0
##$TUNHOUT= 0
##$TUNXOUT= 0
##$USERA1= <user>
##$USERA2= <user>
##$USERA3= <user>
##$USERA4= <user>
##$USERA5= <user>
##$V9= 5
##$VALIST= <valist>
##$VCLIST= <CCCCCCCCCCCCCCC>
##$VD= 0
##$VDLIST= <DDDDDDDDDDDDDDD>
##$VPLIST= <PPPPPPPPPPPPPPP>
##$VTLIST= <TTTTTTTTTTTTTTT>
##$WBST= 1024
##$WBSW= 4
##$XGAIN= (0..3)
0 0 0 0 
##$XL= 0
##$YL= 0
##$YMAX_a= 523486
##$YMIN_a= -656689
##$ZGOPTNS= <>
##$ZL1= 120
##$ZL2= 120
##$ZL3= 120
##$ZL4= 120
##$ABSF1= 16.522
##$ABSF2= -4.171173
##$ABSG= 5
##$ABSL= 3
##$ALPHA= 0
##$AQORDER= 0
##$ASSFAC= 0
##$ASSFACI= 0
##$ASSFACX= 0
##$ASSWID= 0
##$AUNMP= <proc_1d>
##$AZFE= 0.1
##$AZFW= 0.1
##$BCFW= 0
##$BC_mod= 0
##$BYTORDP= 0
##$COROFFS= 0
##$CY= 12.5
##$DATMOD= 1
##$DC= 0
##$DFILT= <>
##$DTYPP= 0
##$F1P= 14.0000005364418
##$F2P= -0.99999901652339
##$FCOR= 0.5
##$FTSIZE= 32768
##$FT_mod= 6
##$GAMMA= 0
##$GB= 0
##$INTBC= 1
##$INTSCL= 1
##$ISEN= 128
##$LB= 0.3
##$LEV0= 0
##$LPBIN= 0
##$MAXI= 10000
##$MC2= 0
##$MEAN= 0
##$ME_mod= 0
##$MI= 0
##$NCOEF= 0
##$NC_proc= -2
##$NLEV= 6
##$NOISF1= 0
##$NOISF2= 0
##$NSP= 0
##$NTH_PI= 0
##$NZP= 0
##$OFFSET= 16.522
##$PC= 1
##$PHC0= 170.0495
##$PHC1= 8.547509
##$PH_mod= 1
##$PKNL= yes
##$PPARMOD= 0
##$PSCAL= 4
##$PSIGN= 0
##$REVERSE= no
##$SF= 250.13
##$SI= 32768
##$SIGF1= 0
##$SIGF2= 0
##$SINO= 400
##$SIOLD= 32768
##$SREGLST= <1H.CDCl3>
##$SSB= 0
##$STSI= 32768
##$STSR= 0
##$SW_p= 5175.98343685301
##$SYMM= 0
##$S_DEV= 0
##$TDeff= 65536
##$TDoff= 0
##$TI= <Analysis number 999999
Compound Code 99
Book Reference 9
Project Code 9>
##$TILT= no
##$TM1= 0
##$TM2= 0
##$TOPLEV= 0
##$USERP1= <user>
##$USERP2= <user>
##$USERP3= <user>
##$USERP4= <user>
##$USERP5= <user>
##$WDW= 1
##$XDIM= 32768
##$YMAX_p= 309426860
##$YMIN_p= -572281
$$ End of Bruker specific parameters
$$ ---------------------------------
##NTUPLES= NMR SPECTRUM
##VAR_NAME=  FREQUENCY,     SPECTRUM/REAL,   SPECTRUM/IMAG
##SYMBOL=    X,             R,               I
##VAR_TYPE=  INDEPENDENT,   DEPENDENT,       DEPENDENT
##VAR_FORM=  AFFN,          ASDF,            ASDF
##VAR_DIM=   32768,         32768,           32768
##UNITS=     HZ,            ARBITRARY UNITS, ARBITRARY UNITS
##FACTOR=    0.157963299565203, 1,           1
##FIRST=     4132.6476996994, 0,             0
##LAST=      -1043.33573715361, 0,           0
##MIN=       -1043.33573715361, -572281,     0
##MAX=       4132.6476996994, 309426860,     0
$$ Real data points
##PAGE= N=1
##DATA TABLE= (X++(R..R)), XYDATA
$$ [...]
27737 -4143 -2732 306 -1727 603 4626 1140 313 7308 306 1054 -4517 -11181 -17302 -11734 -7552
27722 -7552 -4184 -3412 1777 4813 -2088 -8480 -3400 1169 -3551 -3147 4337 9922 9620 7037 370
27707 370 -272 7799 13171 8641 2267 -3006 -2376 1820 14758 16106 8532 -5508 -5897 -4562 -2696
27692 -2696 -7036 -9053 -2935 5287 1673 -2901 -141 -2989 -10113 -13647 -3759 4452 1399 -5020 -6639
27677 -6639 -4983 3256 13001 12064 1075 -1804 -4716 -5925 -2077 1276 6892 5901 2695 -6558 47
27662 47 4858 7349 8283 -4184 -5685 -4781 -266 1292 1658 4412 -3193 -13627 -17405 -12849 -4780
27647 -4780 -8175 -10980 -8865 -7972 -1878 -2152 -9398 -16762 -10729 -468 -1474 -7431 -6863 -1385 -344
27632 -344 2308 -834 1064 904 730 3884 5454 3720 2387 -682 587 3977 2890 7660 -1746
27617 -1746 -8131 -8005 -2662 4934 9607 14130 14170 15806 12300 8113 -3328 -6222 -5797 -3189 -2367 2539
27601 2539 -2153 -7079 -5733 -6986 -6397 -4620 254 3201 -1695 -4190 -1926 5583 3058 -3514 -3319
27586 -3319 1944 -1885 -3415 -820 -4476 -535 4213 12410 15578 8589 6678 11068 9704 2393 -3204
27571 -3204 -2040 -1967 -2094 3804 7565 587 -11070 -8466 22 2951 9234 10771 11068 16279 11099
27556 11099 11611 8851 -194 -1346 1614 -3999 -10691 -19508 -16778 -9501 -6206 -2755 -1335 -3832 -2022
27541 -2022 -2410 -3519 -9863 -15628 -16002 -8130 1926 9384 16718 6223 1077 2838 -3042 -2976 -110
27526 -110 175 5670 4891 4575 8560 5788 8413 2524 -4881 5017 13987 10610 1607 1472 1460 1687 -531
27509 -531 -3880 1545 7122 8309 10987 11156 13832 8018 4381 618 -3567 -5422 201 5392 7146
27494 7146 -633 -6395 -7333 -5565 -2276 -112 -1429 877 -1391 5231 14458 13715 3967 -1017 2710
27479 2710 -129 -4966 302 317 4134 6890 7663 3739 5667 1210 -3460 -3036 -1435 409 2667 3769
27463 3769 9271 5432 350 -62 8664 9710 4384 9986 9329 1821 -5190 -4592 3848 1969 4590
27448 4590 7143 -1121 -9958 -5555 -4613 -870 5736 402 -5287 -1881 -10353 -14182 -7363 -2318 2157
27433 2157 2947 3313 1662 701 3812 -311 -7128 -5942 1447 7322 10157 14858 15317 15910 10990 -3934
27417 -3934 -14366 -11756 -8280 985 820 1254 3046 -167 355 2997 372 5890 1054 -2839 904
27402 904 8470 1274 -4835 -4839 1422 -2696 -6041 -3307 -3521 1359 -2928 -4622 -3061 -5 -7179 -3568
27386 -3568 1509 976 6106 11231 4232 -1621 -2876 -934 850 -3178 -12165 -9694 -3643 -1822 -1436
27371 -1436 3428 9471 7533 8147 1872 -5701 -1994 3692 651 -2051 2090 -4075 -7154 -6316 -1457
27356 -1457 -405 -3517 -5950 1315 4303 110 3048 3597 5378 5738 12608 9169 6902 7655 4698
27341 4698 1227 4717 6425 -1223 -7139 -4107 -3675 2719 4746 2144 2554 4472 1476 2166 -617
27326 -617 -7409 -8020 -8444 -9791 -3000 6040 10085 14665 13994 10676 13400 14220 13744 4322 400 551
27310 551 -316 -205 326 2732 12197 10132 4810 3533 -1318 5439 6691 2844 4685 3137 523 9901
27294 9901 5552 -4158 -683 -2276 -4290 834 1289 -4199 -8488 -4547 788 4834 9674 8135 2001
27279 2001 8538 10767 7003 5451 7958 5622 3289 1104 7167 3693 2932 9386 13867 12754 10085
27264 10085 4918 410 1131 -938 3177 10270 8566 6659 3257 -2386 -4412 -6419 -3955 -1487 2165
27249 2165 996 3864 13471 15861 17614 7592 -51 3864 3712 3368 -1052 -1038 -617 3868 6105 4878
27233 4878 8383 5613 8883 10477 8691 8821 -527 -1081 1086 3881 3393 3515 1036 2831 2701 -4789
27217 -4789 -2800 -200 -8639 -8777 666 1253 -1389 -150 509 -2462 808 5637 12285 13053 4936 1696
27201 1696 6144 13233 9067 4915 6258 7389 5856 6560 5507 6532 7886 2929 2556 7179 15581
27186 15581 18902 16076 11776 9009 11660 9292 12079 13314 8749 821 -1095 -9265 -17461 -14571
27172 -14571 -8971 -4758 -3380 2091 9415 16316 23053 20379 13443 13832 12347 2163 1520 2990 6754
27157 6754 3446 2749 4608 1081 -268 5997 9396 11112 6903 1269 2580 3897 351 1539 7513
27142 7513 9221 9205 14805 13727 6614 8665 8617 10749 9420 2318 -5427 -3791 -8107 -10764 -10715 -4119
27126 -4119 -2068 3596 2125 1875 4561 -369 -1755 3895 11989 15885 10783 8815 6790 2491 2339
27111 2339 -2369 -10588 -3337 830 1007 178 432 3742 6887 9225 12066 8018 -3531 -1298 3365
27096 3365 9207 12648 12200 4207 -4001 -9969 -4147 -3598 -3402 -1698 357 1399 7518 9937 8859
27081 8859 4094 1899 4863 11718 14218 112 -3242 2490 -3248 -5593 -4472 444 3262 6058
27067 6058 8415 6561 3821 1081 7848 9740 14332 12733 6710 4129 6420 6658 1859 -7645 -6999
27052 -6999 -3975 -772 1631 3910 4531 3355 -1988 -4100 -3789 -5652 -2773 4711 7524 10378 12567
27037 12567 14967 18936 17355 13486 14861 13813 7695 335 -5974 -7169 -3096 801 -1076 -8377
27023 -8377 -15672 -12287 -5783 2262 2845 4053 10759 9697 6500 -4043 -1487 3863 -49 6267 11280
27008 11280 9919 4406 -547 783 5604 11429 4030 -6516 -9781 -1449 2591 2506 6399 8149 3815
26993 3815 1683 3654 5426 5391 3233 -68 123 84 -8890 -8353 -4572 -2340 -430 1752 2300 -4200
26977 -4200 -5153 -3062 -4567 -548 4152 1038 4523 8294 6587 2810 -1065 -6508 4718 12233 16419
26962 16419 15304 13185 11209 5303 2649 -246 921 -69 -2885 -3224 -3697 -9904 -13383 -18329 -12853
26947 -12853 -6179 -3495 1716 5956 5702 -1682 -5543 -656 788 -5303 -14426 -18298 -13416 -7536 -9747
26932 -9747 -10635 -9548 -3673 3896 5538 7152 2924 1440 -4271 -4345 -3089 -2135 513 890 -2162 -8509
26916 -8509 -16634 -16533 -16112 -4765 1066 2764 10947 15612 14118 16974 10040 7913 7697 13766 13681 4832
26900 4832 4295 9345 13317 10051 6422 3250 297 3977 9650 16967 15016 7426 5742 2431 -2530
26885 -2530 3726 1028 -2935 -3892 -2278 5516 8880 9706 2195 1564 2868 4815 8615 9876 6220
26870 6220 832 -2449 -727 -804 -3876 -549 2364 5817 3701 347 8329 10423 6387 7232 5081
26855 5081 -1293 501 -3190 -1883 -4010 -5183 -12930 -12184 1567 6816 7801 3039 -6152 -7337 -2487
26840 -2487 -2620 -674 1074 6788 11405 14545 2443 -5250 1124 9006 12694 12137 3377 3173 2367
26825 2367 -6191 -4775 -7789 -1858 2503 4062 9556 9725 3410 4145 4408 -1699 -3857 -2427 -4738
26810 -4738 623 603 -1114 4650 8917 5718 -2900 -806 7056 6123 3989 2708 -9462 -4570 -932
26795 -932 2974 9590 1572 -3877 -2968 -1949 -28 2955 4679 1050 -773 -265 1157 7621 5342
26780 5342 2355 -3144 -8591 -2676 6090 10322 5739 2265 3712 4392 3757 4778 1668 509 -6505
26765 -6505 -10433 -2176 10083 15702 12066 9536 7931 5451 2276 2277 9118 11830 8827 2204 2956
26750 2956 5861 8152 8838 2028 -4197 1250 2731 95 2394 -8322 -5184 6773 11730 8044
26736 8044 7272 5929 3215 -2258 -3956 -4763 -2923 -24 -2971 585 2629 4427 9676 8224 14248
26721 14248 9278 5700 5785 819 3980 1862 1742 1938 9870 3987 1089 -2362 -3442 351 2807
26706 2807 1989 3753 2415 1765 1140 1957 2978 -816 -7094 -1563 3635 6997 4963 1752 -683 -1486
26690 -1486 1892 5319 -2973 -6562 -1393 -5453 -5595 -3052 -3416 -2517 -2435 -13943 -18266 -5209 5557
26675 5557 5532 -3297 -14881 -17194 -16315 -16141 -15199 -20667 -11728 -2862 9688 15200 10969 8376 7772 5406
26659 5406 7288 8399 8522 -141 -7004 -4655 -6761 -7525 -4761 -6230 -5263 -9849 -14949 -8902 -5252
26644 -5252 -7392 -6444 -3386 1435 5443 3841 -1532 1353 8037 4579 39 -3183 -4444 754 -4844
26629 -4844 -8686 -1164 2145 6070 7705 1807 470 -412 -474 -3808 -11115 -9079 -4967 -7451 -6937 -8457
26613 -8457 -6065 3941 8912 8128 8127 6627 -1559 -1001 4021 9205 8716 6146 1915 3816 -1888 -1871
26597 -1871 -2247 5370 8837 4962 1936 -5352 -11298 -6356 1046 2666 519 -6082 -6395 -2736 -837
26582 -837 -11831 -12914 -6245 -4007 -4060 -6870 -4435 4694 11386 8406 8930 9897 3958 -1397 966 7875
26566 7875 11965 10342 2826 1307 4621 7455 7287 4790 8499 13425 17809 12922 14391 11780 1275
26551 1275 -2888 -6687 -3308 4570 4814 8253 5492 3070 1896 -6368 -7707 -8054 -4792 2211 1729
26536 1729 2279 9353 9172 8169 5722 4327 6355 9909 7685 2462 3318 7395 7532 6458 6992 11576
26520 11576 6944 1126 3340 8923 4534 2925 3142 7013 9856 6400 5434 3352 -6069 -12167 -9288
26505 -9288 -1844 7089 10425 6969 -3848 -1912 -2232 -8404 -9128 -2239 2752 9497 6434 458 -2228
26490 -2228 -4415 -8324 -4266 6585 13631 11998 10606 7339 11508 19910 18678 8753 5083 954
26476 954 -4618 -885 -2568 1592 7746 11859 4813 -3003 4380 4942 -283 3753 4206 952 -804
26461 -804 -8652 -14741 -13409 -8204 -2738 -6192 -6806 -6267 -7348 -937 6626 6846 4964 5747 3012 -3643
26445 -3643 -10224 -4671 -2583 -1303 -3313 -6656 -14216 -21371 -18872 -10090 130 2501 2756 811 1429
26430 1429 6755 9662 7277 3437 6784 -3053 -4363 -958 2096 3392 10355 9019 2143 -7788 -8801
26415 -8801 -7669 -7374 -14309 -10469 -6338 -1816 844 -1964 -181 -677 3331 9108 6599 927 -109
26400 -109 -2386 -4698 -6161 -1123 -3816 -8149 -5708 -6610 196 1430 566 -194 -1558 -4264 -8528 -14124
26384 -14124 -11968 -5655 -3569 -1196 810 1740 5231 2649 6896 12468 17152 11406 5565 6233 11487
26369 11487 6944 -6039 -8095 1946 3612 -3025 -7421 -3414 -1967 -6950 -2468 4735 8370 6146
26355 6146 2736 614 -2171 -9371 -12648 -8149 -3010 186 2359 3058 -1954 -4743 814 6963 6875
26340 6875 -896 -6522 -5400 -6155 -5083 -9524 -2763 -1521 968 5239 4827 6000 4956 8711 2238
26325 2238 -27 -884 -843 2098 7628 6673 3200 2694 -3643 -7717 -10548 -13370 -7060 -2090 -3788 2076
26309 2076 -2869 5221 2436 1351 4690 7376 8820 7517 11229 10864 5414 7540 3480 -608 2627
26294 2627 2369 4918 3333 7265 9844 7033 10106 9210 7224 10578 5053 959 -9806 -10127 -3182
26279 -3182 -4751 -9497 -9307 -380 -4529 -3971 6391 13556 9787 -5178 -7285 -3927 -2241 -2814 1009
26264 1009 2721 6981 7168 8246 10590 5365 648 5970 5502 4260 3416 -1194 2444 2381 -2040 -778
26248 -778 146 -1744 2269 2970 2772 -618 -67 983 1332 -2819 -3499 -1004 5667 3716 -2470 1970
26232 1970 8533 12090 5162 2871 11001 11167 10280 15637 14123 15136 10458 11760 3524 -4531 -5608
26217 -5608 -5126 -8601 -2192 3030 2084 -9621 -23185 -20213 -11649 -13596 -8854 -8035 -7294 -11680 -8689
26202 -8689 -180 415 -4875 -3446 3225 4985 4091 6907 1980 4646 7980 6431 5247 3326 3358 4197
26186 4197 13016 16053 6852 5578 8098 11480 11209 8248 5964 8265 13263 16169 11320 1155 -2106
26171 -2106 -160 2085 853 -32 1149 -2030 -2245 2727 3624 7790 15718 10694 6437 8387 3580
26156 3580 864 4023 7363 5572 8275 1965 -10598 -13927 -5122 165 -3077 305 4517 7306
26142 7306 4088 2760 1390 5843 9369 3150 1495 1492 2929 2728 175 -2875 -133 1123 -8656 -9062
26126 -9062 -9258 -11987 -9934 -11518 -11070 -10803 -7882 -3835 19 2538 -2544 3891 7839 3367 -4245
26111 -4245 -8006 -2635 306 698 475 2156 4793 -1382 -2227 5317 1777 4928 6095 6077 11669 11512
26095 11512 10318 2052 -3925 -10264 -10215 -6316 -12741 -12771 -7545 -7343 -9660 -16449 -10949 -7325 -10674 -15498
26079 -15498 -15496 -11612 -11149 -2546 3239 3253 -2275 -1959 -465 1861 3946 362 -2858 -6710 -10775 -8208
26063 -8208 1290 2835 -6398 -11069 -6473 -2754 -2254 -923 -2255 244 2031 1282 1243 -1433 6804 14944
26047 14944 10414 3986 4119 5208 12854 19827 18707 18034 7878 490 -2594 -8117 -15605 -19221 -10730
26032 -10730 -7569 -2004 645 -5908 -11289 -8985 -3970 2473 8210 1584 4232 7923 9540 5736
26018 5736 1287 -1969 -3526 1152 4896 -1490 -2013 -4900 -7926 -10783 -13749 -2901 417 -8682 -10955
26003 -10955 -9330 -7180 1526 2708 6009 3116 4411 6728 6968 7222 2875 -2817 1991 3416 -2243
25988 -2243 -2814 -4752 -6 5533 637 -4139 -2235 4952 7000 1126 691 1952 -5273 -1312 2152
25973 2152 2487 -2356 -4437 3062 8905 10709 5074 -405 -3701 -8690 -10950 -10523 -8713 -4351 -6929
25958 -6929 -4462 5250 8139 3544 6875 10602 13326 12484 15552 16627 15986 6035 -4507 -2340 -49
25943 -49 8012 8473 11580 9415 5507 1337 -3303 -2164 -765 -2443 -4909 -2864 10540 10004 7112
25928 7112 -2909 -13225 -14150 -6409 -314 1712 1364 43 363 11789 20226 15094 9602 3052 -3425
25913 -3425 -1422 -4397 -5621 -5920 -8641 -11082 -5416 5117 5013 2276 825 1351 8196 12225 9377
25898 9377 6960 4776 -291 -798 5070 1789 -5319 -3907 6517 10243 3274 256 460 1469 4435
25883 4435 5455 1566 4731 4613 1251 -857 -951 -745 4015 3999 -2605 -5541 -1600 317 -948 -2402
25867 -2402 2416 12268 10363 2653 -6603 -5026 -319 2741 2705 -5886 -4429 -1596 -124 6448 6624
25852 6624 3972 2943 2904 1331 -4832 -8586 -7352 -9440 -5340 65 -1636 -194 3329 -650 -637 -2052
25836 -2052 380 -804 -4425 -7039 -5693 -6151 930 -3670 -9039 -8660 -2968 -1968 -2023 -5941 -8008 -2951
25820 -2951 1385 7076 2201 -5278 69 8878 9140 3753 -1961 517 3299 3137 3849 -5402 -8482
25805 -8482 -7009 -7293 -7421 -9002 151 3053 5301 1721 -4333 -5029 -1105 -2014 1896 3605 -2547 -1605
25789 -1605 -3360 -980 2831 -2734 -1612 -2984 -4536 -1545 -3660 -9315 -10485 -11203 -10828 -12496 -8120
25774 -8120 -11564 -8386 -11522 -10585 -9586 -1225 6378 1493 -2486 -8971 -12293 -9205 -1800 1725 3768
25759 3768 5647 2091 -1264 -2874 -1500 4099 -2217 -7891 -5260 -4449 -5169 -5480 -7581 -6987 -2714 -2784
25743 -2784 -7231 -58 6909 8558 6025 5326 5637 2044 3808 5906 9789 10406 12347 17265 11254
25728 11254 -773 -9726 -4012 -4960 -3393 -2031 1685 7351 10556 453 -2022 3051 -99 -3707
25714 -3707 -1212 2782 837 2519 1084 -3020 -1570 2119 -1940 -5213 -4588 2002 -300 -7744 -5693
25699 -5693 -5660 -15982 -17159 -9179 -5189 -6663 -4345 -7446 2132 7863 10055 11577 7761 5662 5585
25684 5585 4902 -1023 -10486 -15967 -7713 -6514 -3781 -4643 -5831 -1352 5492 4542 3480 15415 9468
25669 9468 928 -3986 -5010 -10063 -3926 -8992 -9418 -5917 -4034 3112 7282 7845 5598 986 -562
25654 -562 620 5024 2905 -1810 -575 1761 5135 5001 5521 10813 15444 13087 7162 6060 5197 2609
25638 2609 2553 -2859 -6711 -8599 -6404 -6227 -594 -1087 207 -2411 -3475 -2797 -4838 -14376 -13758 -8026
25622 -8026 -2064 -3713 -3317 -963 -3136 445 -1110 -963 782 1660 -1702 -1112 -4280 -3347 -5327 1161
25606 1161 6795 3846 -7364 -7067 -5251 -854 9598 10269 3792 -2433 -1905 -175 4459 6254 2404
25591 2404 2750 3459 3985 2846 1963 2984 -3033 -3777 2066 5669 2933 3927 6041 -1678 -10201 -7554
25575 -7554 -5425 758 685 -625 985 -15 1864 1960 7768 7426 -2080 -7194 1716 7000 4793 2668
25559 2668 -868 5593 2502 2657 73 -6694 -5127 2856 5948 5169 1815 -1459 -2029 1559 9416
25544 9416 15725 13620 4184 5484 4490 -5091 -9581 -3397 -2141 -1760 5406 10799 3785 4127 7823
25529 7823 5771 677 -2743 -8559 -6499 -6433 -7422 -7880 -6648 2733 1052 -4676 -4768 -2391 -3845 -2057
25513 -2057 -951 -2684 -7248 -9569 -6010 895 8000 10844 13228 12500 19675 17833 8223 5698 4541
25498 4541 4531 5294 6024 3507 3183 3255 2580 5318 6466 9232 14194 11892 15500 12839 10440 3721 -519
25481 -519 -3381 -2012 -891 1176 -342 2375 225 -5806 771 7641 3266 -3521 -7257 -4939 2825
25466 2825 2998 1528 2882 11165 12978 11628 5782 -121 4371 7285 2830 2650 2786 -3652 -6122
25451 -6122 -5359 899 -3795 -7859 -7464 -12579 -9801 -6580 -4985 782 1677 5604 2122 2301 1844 -6328
25435 -6328 -4918 1731 5134 5389 1711 -590 3203 11031 12922 12595 16868 4641 -2784 3671 5638
25420 5638 3881 -104 -1054 5140 8348 2814 -2101 -7871 -9533 -12426 -11787 -9715 -9077 -8437 -11941 -11222
25404 -11222 -10370 -10617 -7345 -3358 -479 3969 5242 4021 -19 2017 2263 4417 -1026 -5060 -1779
25389 -1779 -1622 -2537 -532 821 -2637 -301 -675 5837 8986 13975 14462 9119 -7763 -15887 -10763
25374 -10763 10159 13529 -1134 -8563 -12842 -4941 2351 4508 4247 4006 -981 4768 14263 9852
25360 9852 2898 -3371 -3074 3961 7084 9730 9442 11959 8287 1247 3119 7496 5639 8234 10267
25345 10267 4618 2143 7115 10797 9178 7409 12340 8262 8803 1894 1071 185 2582 8260 8775
25330 8775 1577 7032 9767 11606 5102 5818 5325 3439 -4371 -233 1708 362 3259 3797 8467
25315 8467 12590 9570 2039 5282 -734 -8675 -3000 -2223 998 4595 5477 5197 -1675 274 10666
25300 10666 11533 6343 7620 12112 14017 11983 13752 16184 4779 -1278 2819 11 4806 8660
25286 8660 14181 18458 11558 12572 11362 12890 16804 10675 4906 1584 7182 10435 11249 6922 4262
25271 4262 3879 1891 -4484 -9882 -7166 868 6462 3666 2417 355 2437 4100 8980 2019 2624
25256 2624 3387 535 685 1755 -2412 -5733 -379 -1183 1249 4472 9092 8740 1950 2147 -5040 -13845
25240 -13845 -8717 -8973 -8910 -3915 4826 11934 10620 6586 1053 2405 3764 9896 10156 6683 1761
25225 1761 -1750 -1785 -3345 -4707 -3954 -4159 -5518 -7209 -9430 -5117 -1160 -2 -1586 6096 3979 -1085
25209 -1085 1797 965 -4654 -6227 -7149 -6375 -2980 -3752 -839 7073 5504 4552 2422 -1923 2146 4980
25193 4980 4377 402 -3063 -3184 -2279 -1569 5672 2558 5256 11160 8767 1344 -649 -3454 -3299 -2530
25177 -2530 1953 6143 7475 3897 2585 8123 13660 14866 7606 3369 2766 7277 3538 -1243 -3004
25162 -3004 -11870 -13185 -13868 -12650 -6212 -2626 -3067 -950 3670 7331 5583 1126 466 -3858 -6765
25147 -6765 -5938 2047 8091 1561 1528 9056 10720 217 1745 7450 8271 12003 8566 2477 -1101
25132 -1101 1375 3292 -172 -1959 -800 671 1968 842 3194 9843 9343 1808 -5337 -11124 -14616
25117 -14616 -8735 -7436 -10952 -14663 -17783 -13478 -9356 -7294 -4777 -6652 -3390 1553 5219 11021
25103 11021 7407 2628 4303 7922 7385 4475 1673 -2042 -5544 -4734 -10739 -13862 -6480 -4605 -2719
25088 -2719 -4692 -6085 -5399 806 3815 6112 12808 19659 12714 5845 3868 4283 9366 9446 6626 3972
25072 3972 4288 3314 2868 2386 4651 8790 12518 16481 12175 9800 11289 21138 19986 15949 6259 -301
25056 -301 -2639 -7598 -4608 -5515 -17960 -16038 -11861 -4313 -4952 -9905 -10064 -10223 -7365 -2942 -2592 678
25040 678 2204 -4098 -8963 -9396 -3307 5385 -3986 -5265 -686 -1741 46 -6645 -9048 -11132 -8273
25025 -8273 -14746 -6546 5117 8081 7281 4610 8439 15053 14709 14459 9877 6862 1596 2569 -698
25010 -698 -3599 -4180 -7486 -11476 -6796 -1571 -4527 -4747 -3481 -2087 -531 -59 -4256 -5409 -3480 2822
24994 2822 3007 -3599 -2576 -9274 -8091 -6233 3436 9323 7646 6979 2410 -4482 -4121 3072 8127
24979 8127 8489 2433 -1911 59 -230 -3493 -5409 3625 -2436 -8368 -10703 -4745 3238 1068 -3041
24964 -3041 -2367 -5843 -9081 -13536 -7751 -950 -1040 -2000 6788 6927 7930 3552 -2287 -6822 -3605 -1141
24948 -1141 -1213 3189 5976 11350 8263 12495 9055 6863 6221 6840 6534 4904 183 2251 -8126 -13404
24932 -13404 -12179 -12203 -3314 2875 4348 -837 -9428 -10568 -8349 -24 2558 -3316 -1209 10261 5171
24917 5171 -2604 -991 1379 6135 10094 8820 12532 13204 616 -14263 -12874 -2369 5398 5664
24903 5664 -372 -1945 3540 9918 12210 8580 4171 2710 2243 5132 1854 -3535 -3618 -5809 -6827
24888 -6827 -4136 -1512 -4084 -7555 -8027 -231 2373 -6733 -5439 -8149 -8677 -3762 -5786 -1703 -1838
24873 -1838 -10069 -16379 -11496 -5376 -7359 -10998 -3298 7517 4101 5260 5235 -8014 -13698 -9307 -4452
24858 -4452 -1394 414 5237 7043 7526 -425 -2718 2781 7467 11745 9260 473 955 4025 4078 -527
24842 -527 968 5024 11417 9774 5379 3507 -2657 2580 3114 847 1806 -3857 -7924 -3426 -889
24827 -889 9464 10700 5042 3494 9086 13471 101 -1335 -2734 -3784 -6659 -3326 3344 8085
24813 8085 8677 1505 6704 10604 4110 -1081 -1826 4491 9116 9621 3930 -403 -1762 2657 1669 -4105
24797 -4105 -2659 2907 649 -5272 -8720 -5031 2779 3750 8608 7949 4507 9547 12395 8036 4964
24782 4964 1828 -1486 -2284 -9683 -15537 -10822 -2802 435 -2072 -5436 -5184 -5699 -3622 -1311 1261
24767 1261 -6086 -8466 -8884 -6310 931 8792 364 -1570 -2973 -11472 -11763 -3599 4734 -3591 -7402
24752 -7402 -7321 -9248 -8681 -3447 -77 963 1087 -6040 -7250 -6019 -7907 -1567 -5563 -9607 -6846 111
24736 111 -6515 -7575 -4499 -5606 -10102 -855 -1100 4701 13669 14014 8409 4384 9345 9171 3868 699
24720 699 -702 -3486 -5279 -4057 -7451 -12216 -8469 -9614 -7296 -2740 -3657 -4004 -3918 -2771 -531 1014
24704 1014 -6055 -7239 4376 1564 -1455 -2636 -4523 -6610 -4668 -7854 -9151 -3992 -4600 -4816 -10353
24689 -10353 -4546 2600 6339 6292 11286 12897 12505 7782 2099 -47 6524 2348 -7380 -8852 -2777
24674 -2777 4737 10012 8295 4381 4184 6308 4339 -5319 -7971 -8168 -1578 -4480 -8307 -10256 -7387
24659 -7387 -9110 -10755 -9635 -12564 -10000 -10688 -3614 2518 1127 585 -6438 -9778 -8468 -3832 393
24644 393 -2071 -7614 -2673 1981 3916 2501 -2686 2518 8595 921 -2395 -7603 -3223 4490 6284
24629 6284 1985 11 3241 5082 2517 -2551 1058 4339 5967 670 -2960 -963 2844 2508 -5280
24614 -5280 -1533 3530 7096 1722 -2478 -1281 10861 9584 3407 8608 3562 2883 12149 15900 11558
24599 11558 1871 857 3390 6124 4724 -4675 -11154 -11011 -4434 -1295 -5462 -5048 -3315 -2564 1457
24584 1457 5157 6538 4609 6055 -5007 -10625 219 8258 8322 9013 7226 3726 4520 130 277
24569 277 2578 -32 3796 4779 1945 -2466 -7658 -5103 4053 1029 -2110 -4253 -130 3367 1950
24554 1950 -3895 -7182 -2825 -3998 886 5441 -1033 -2843 -2571 3234 8488 15717 14116 5852 3812
24539 3812 -459 -4547 -3188 -3692 -4753 -2318 -1509 -2133 3493 7269 8942 -1179 -6744 -4723 429
24524 429 -7143 -14336 -8194 -1302 4305 507 -2878 -9137 -9311 -5171 2050 6561 7673 10036 12025
24509 12025 3943 48 1669 3465 2517 4234 -1840 -7873 -7528 -7423 -1736 188 -2523 3488 2979
24494 2979 -4171 -8422 -8106 -5801 -1208 975 -2947 -10538 -12495 -13128 -9398 3017 4328 6070 1672
24479 1672 1380 3973 3960 6236 9073 912 -9522 -10275 -1707 -1398 -6869 -5383 -5756 -3139 1559 4546
24463 4546 6427 2672 3265 10241 6508 2471 -1920 -1816 -2741 -7565 -5861 -501 -801 1443 4543 4839
24447 4839 8010 534 4541 5229 6945 8500 6529 11795 16138 16244 10504 5621 2250 -896 5159
24432 5159 8595 4024 -4496 -3968 3761 2112 -4211 -4657 910 6250 4233 5330 7859 2513 -1171
24417 -1171 5668 6850 2276 5651 6358 -323 -1823 6822 8543 5143 3255 5271 1972 1379 4702
24402 4702 5703 6660 9044 10981 11803 130 -6457 -6089 -4123 -4388 -10356 -4989 5954 5372 3735
24387 3735 2859 -139 146 -701 -700 5185 1148 -5455 -1709 -7094 -4150 6414 10510 6190 5114 1847
24371 1847 3789 6568 10076 5419 2414 9451 10585 3515 268 -2078 -7230 -6630 -4656 -2384 -2895
24356 -2895 -6345 -8485 -13361 -12360 -8692 -15720 -18494 -16053 -14013 -14562 -11794 -9497 -10013 -11923 -13630
24341 -13630 -10934 -8467 -3079 -1720 2134 5720 891 -5335 -2553 -1760 -2278 -630 3356 6698 13301
24326 13301 15728 8470 2917 -1180 1235 -2476 -10842 -10421 -9746 -5405 -1035 1862 -1877 -4605 -2528
24311 -2528 -1624 5105 4570 3284 -1023 -4954 -2416 1985 4147 -6253 -12238 -3381 8116 14837 4098
24296 4098 -1054 -4573 -5145 -2241 -2154 2069 -2610 -4058 2738 6090 9618 9599 5418 39 950 2968
24280 2968 5064 9477 9608 7577 3090 3528 5898 -749 -6231 -755 -8280 -10860 -62 7159 1784
24265 1784 -5856 -6091 -841 1698 5381 3111 -2644 4252 10793 5127 -2620 -6359 -11796 -1408 5510
24250 5510 3126 4375 1440 -6436 -1087 226 -1067 -2277 6945 8313 7364 6331 -1770 -10670 -6421
24235 -6421 2785 7387 11640 3596 -4554 -9249 -7245 -5723 -2871 -4190 -237 -1410 -1187 4594 1968
24220 1968 -2602 -238 -1613 2234 1878 3796 -851 658 2925 -461 -7215 -9824 -4411 3179 7607
24205 7607 6037 2331 -1882 -932 3047 7861 8555 9598 13400 13339 6407 2544 5352 9896 3792 -2297
24189 -2297 -4379 -9475 -4323 -3658 -324 4187 -1624 -4587 -5643 -8116 -3575 -6698 -1604 1629 3735
24174 3735 420 -3374 -2381 -1642 -1729 -2163 -2716 -8172 -13806 -9856 -4784 -4690 -11969 -10126 -1852 1306 297
24157 297 -4487 -7007 -2277 3460 7471 10245 6160 5178 -3467 -14547 -10948 -3104 -4339 -7018 -6892
24142 -6892 -2756 -4379 -1611 5111 6497 1908 -487 -203 -623 3741 1041 -892 62 -5793 -13427
24127 -13427 -10145 -6298 -484 -1295 3243 4413 5194 7214 -1032 -9511 -4158 1984 2685 938 3624
24112 3624 6721 5947 8700 10053 -6730 -9529 2596 513 -5667 -6091 -5165 -4623 2325 -90 -1240
24097 -1240 1275 -2356 -1200 -941 3642 7782 18473 20300 12726 6431 4581 4501 6633 11346 11514
24082 11514 12340 2414 -867 -3128 -6832 -4769 2397 1060 -1312 2849 11139 9048 4558 -1451 -6573
24067 -6573 -7961 307 6339 3843 4002 -1703 -1341 -5842 1120 5427 4815 629 -703 -9314 -8398 -7735
24051 -7735 -9411 -5039 -10583 -13339 -14947 -11994 -12442 -19862 -14050 -7211 -8066 -8397 -9786 -9262 -11240 -16400
24035 -16400 -19834 -20993 -15190 -8965 -1886 517 -3147 -8333 -1691 1185 -382 985 6074 434
24021 434 -5287 -1156 7385 4221 810 -3092 -3985 2689 6543 7727 819 -5424 -710 2324 2329 -4824
24005 -4824 -16429 -18880 -14021 -531 3095 -1588 483 3303 3189 5278 9091 8819 5481 -46 -942
23990 -942 4580 -262 2369 4453 -1413 -1763 598 3443 5074 9068 2230 -5575 -7958 -6247 -3680
23975 -3680 -4334 -3735 -482 -2914 -4917 -240 -2391 -9115 -13975 -11603 -11824 -8969 116 5309 4763 10575
23959 10575 19036 19759 9778 1872 -7008 -5537 -4319 -3372 -1663 -1070 2043 659 -3301 -10631 -5337
23944 -5337 893 1068 -2648 -4015 -7847 -8057 -2192 762 801 -3845 -6844 -2620 -2614 -3911 -4817 -6687 -5901
23927 -5901 3378 4591 3951 -1520 -2543 -1415 1564 7924 8258 6414 113 2673 7938 2389 1987
23912 1987 397 3822 -7199 -11073 -10421 -6182 -556 5306 7129 6856 5617 1700 -509 -3306 -2655
23897 -2655 -3660 1615 -66 833 10342 11448 10435 8730 4959 100 -1396 -1055 -5154 -4787 -620
23882 -620 -2579 -4860 -1981 -3850 486 9186 5534 3846 2286 -1133 -555 -1453 -1437 -2421 -5874 -9875
23866 -9875 -14084 -16785 -10342 1519 -3760 -8077 -3590 -2675 2743 5562 2045 3504 1392 624 -2367
23851 -2367 -1468 3842 5116 4813 3762 -1291 -1031 -8551 -14456 -14676 -12328 -12877 -15748 -5951 -2830 -298
23835 -298 -1777 -2715 -5136 -5919 -4304 558 5224 5545 2860 -3682 -15304 -13737 -9884 -10283 -11881 -11629
23819 -11629 -18175 -14440 -3697 -203 -1677 -244 870 769 2019 4723 -226 -499 242 6509 8345
23804 8345 8256 4821 54 -8137 -14167 -16399 -16314 -18329 -8423 4363 724 -5227 -10513 -12761 -9247
23789 -9247 -5678 -5804 -6643 -3093 -3104 574 5513 10061 6119 8221 5879 12245 16408 14217 10884 6511
23773 6511 2826 -1362 -1303 6404 7315 11200 10563 4336 3636 5940 4462 5723 5846 4235 539 -3761
23757 -3761 -2462 5764 5688 2819 1342 5338 8703 2986 1362 -3694 -4770 -3265 -1507 -124 -103 3209
23741 3209 9190 7329 2858 -1370 -3212 -3818 -8631 -10853 -4687 4960 886 -7651 -10981 -9131 -2354
23726 -2354 4522 11862 13103 15326 11882 11895 8946 9594 3620 -2346 -1951 -186 -1874 426 1165 4002
23710 4002 4670 -2824 -10475 -6544 -10079 -13237 -17983 -18147 -10075 -5656 -10479 -4128 10084 9300 11388
23695 11388 3550 3189 8540 9300 6982 5074 5140 5477 -1295 -58 -2321 -4830 -3492 318 2797 2096
23679 2096 -1322 -5243 -10430 -6083 3845 4532 -2548 -8971 -8842 -4615 -12873 -17264 -18322 -16234 -11929
23664 -11929 -4379 -776 -3152 -1490 -51 2720 938 -4410 1160 -801 -3881 -3042 -2406 -2040 -3238
23649 -3238 -9854 -7503 -4572 -1813 2625 6907 1684 5155 1540 1176 -4315 -7265 -2575 -9231 -7706
23634 -7706 566 4074 8349 7192 5370 -2649 -8355 -8366 -3356 -6790 -13254 -5413 3235 -728 -5613
23619 -5613 -6603 768 3831 1782 -5751 -7615 -10622 -6000 -5941 -4843 310 -1990 2098 -2498 -5113
23604 -5113 -4285 -1668 -5652 -7087 755 -2886 -7743 -4196 -4983 -7851 -9494 -7346 1651 2395 -4043
23589 -4043 -8282 -5213 1418 4541 829 276 3473 -2912 -5903 130 7180 4695 -3790 -9370 -2663
23574 -2663 -1151 -170 -6612 -9953 -3886 -2113 1066 -2103 -10474 -11440 -7399 519 5686 -7139 -15523
23559 -15523 -8868 -5929 -1288 -1770 -2276 -1777 -2152 -5844 -3409 2133 3465 3329 5367 6354 8441 5526
23543 5526 -119 -3883 -1451 -551 -1990 -2550 -5242 -13338 -15190 -7941 -6450 -7808 -9509 -12609 -8878
23528 -8878 -6662 -4219 272 4165 4082 2433 -740 -664 -7093 -6244 -862 4044 3049 3122 5426 9208 873
23511 873 -156 2354 1886 -1451 -230 -1882 4324 8297 9202 10068 6704 174 -5671 -10563 -11188 -7433
23495 -7433 -6930 -15989 -13379 -4379 4158 3681 93 970 1603 -5800 -5227 -9999 -12037 -2312 6323 10794
23479 10794 8411 4595 2957 5223 2830 -6261 -15517 -8437 744 2519 -1556 -12574 -13809 -10026
23465 -10026 -11101 -8916 -2432 -869 -1116 -7013 -4914 -436 -2681 -6489 -808 10170 20479 19983
23451 19983 22378 23701 15391 12068 14648 16021 14778 10349 417 -3916 -682 2616 3703 7656
23437 7656 9409 10433 4892 1061 6208 2974 -2537 2809 8032 13054 8914 -349 -6404 -7186 -6939
23422 -6939 -3601 4297 4330 5216 5737 2382 5750 10471 15249 11235 6130 1959 1320 5838 11452 11357
23406 11357 7468 2026 11141 24160 21721 14244 10460 2923 1894 10458 5696 4052 6447 4652
23392 4652 3674 -2415 -7020 -4402 -4138 -10367 -6586 -1824 -746 -3220 -1926 -255 7830 9559 2393
23377 2393 -3268 -6614 174 9092 13495 -74 -11304 -1924 9555 11324 11685 5027 8078 5373
23363 5373 1163 5409 7853 3904 -182 -2625 -4650 1045 -1207 -1588 -4219 -3002 -1746 -53 1215
23348 1215 -1040 -108 3591 -1238 -4983 -7123 -4498 4610 7235 763 -3768 -7740 -2760 -1676 -1244
23333 -1244 -1494 -512 -2893 -9019 -6013 -1972 3581 -838 -666 5673 3009 4587 14493 18185 12768
23318 12768 10364 5559 -776 -3078 -610 4500 10343 5912 90 -2388 -5927 -7448 -10543 -11262 -13750
23303 -13750 -12419 -10492 -5534 -336 4936 5256 -1375 -6454 -2757 -2290 -1001 -7700 -8763 -1660 2575
23288 2575 10176 14255 13960 7609 9401 6263 1982 4817 7037 1315 -11022 -9744 -12058 -15601 -9082
23273 -9082 -9189 -2497 -1991 -7003 -2758 -3983 -3056 421 5948 1079 -3488 -8179 -14290 -12672 -6446
23258 -6446 -3790 -1508 5157 7566 8741 13373 11579 9601 10480 5559 2693 -4251 -6827 -6219 -3214
23243 -3214 -8257 -8805 -6441 1336 4421 1469 275 38 -4297 -2415 -1197 4104 9122 13752 5201
23228 5201 -4004 -4831 -5436 -9460 -13631 -7203 -2702 3002 2373 925 3669 6352 477 -4491 -10241
23213 -10241 -6884 -5252 -6218 -4096 -2248 256 -5614 -9256 -12929 -13636 -10012 -10893 -12107 -10076 -1197
23198 -1197 -1128 4018 7524 6607 3707 891 -1308 -5278 -3536 -3690 -1524 -1755 -3174 -1328 -1648 -4863
23182 -4863 -6375 2124 614 -6323 19 5208 6306 6899 9162 12460 9315 6234 1095 -4877 -6987
23167 -6987 -7429 -11380 -4020 -4644 -5531 -1822 -2884 -2831 -1718 -3579 -610 -2586 -1034 646 -761 5134
23151 5134 6402 -3271 -6826 -5007 -4769 -2642 1921 2752 -2180 -6883 -11942 -6757 -1181 -2674 -6260
23136 -6260 -3858 -9079 -12371 -8728 -8528 -5634 -4263 -9683 -17569 -20293 -17360 -12334 -10359 -7658 -7379
23121 -7379 -3138 3210 8834 6134 4029 2910 1471 -2197 -8433 -9222 -7858 -7471 -3249 -713 2250
23106 2250 11486 10527 9101 253 -302 2935 2156 4030 4348 11016 11387 8637 5272 3955 7276 11426
23090 11426 12543 10257 5262 1104 9786 3554 -2386 -5669 -4197 -4936 -3662 4028 4625 6584 9426
23075 9426 6738 -2953 -5343 -6158 -5542 -3557 -3724 -761 -2364 -1375 -4722 697 10526 11041 4664 1816
23059 1816 -728 452 4837 10255 3211 5377 6670 1136 1741 1787 -133 -1924 1997 3645 2794 1904
23043 1904 3221 480 -6981 -8401 -5661 32 4239 6026 2836 -2405 -5750 -6164 -5193 -8680 -3389
23028 -3389 474 -98 -3362 -2761 1822 2703 -6354 -10575 -12115 -7455 5459 13659 7595 350 -2310
23013 -2310 -4430 1235 7181 5298 1893 -3744 -2594 3689 8040 7151 7730 8759 3485 -2368 -6576
22998 -6576 -5013 -2460 2538 5109 4766 -64 -2743 -4065 -2434 -16229 -16250 -9219 -3996 -6318 259
22983 259 2301 1294 -3947 -8011 -5880 -1268 -4205 -10729 -11071 -8572 -4172 1088 9630 9829 4993
22968 4993 5388 -3275 -2243 -2314 -3990 -1090 -1691 -2695 -41 -3070 -5943 -625 -1458 -3324 3147 6792
22952 6792 7864 9141 -1522 -4571 -4610 -2955 939 7822 2435 -3986 -1790 -95 -3114 -4874 3274
22937 3274 1358 542 -4346 -10253 -3629 -1113 -1000 4361 472 -959 -345 -1785 -4344 -5079 1167 7269
22921 7269 5599 2798 951 3917 5013 6407 4609 9771 5090 4548 5289 -4521 -10950 -8380 -9722
22906 -9722 -4587 -2300 -8062 -9325 -4983 240 340 -653 -891 823 1608 809 -2679 2554 3430 585
22890 585 4725 1964 -2509 5327 7096 5606 1088 -2912 -681 -984 -8167 -5698 -4074 -993 -597
22875 -597 1310 2651 6105 2742 -888 18 7559 12075 12371 11858 13891 10247 14914 11322 6194 2473
22859 2473 -3739 -1867 3819 6884 7415 8085 9136 8774 5258 -4106 -13453 -16402 -4947 6914 10762
22844 10762 4703 1711 2347 2378 23 -10544 -14200 -9323 -3486 2050 6312 6904 15898 16410 11296
22829 11296 8609 11535 8192 4422 5089 10574 6478 2918 -3374 -2111 -3428 -2640 -3644 -2159 -7571
22814 -7571 -13365 -6804 3036 5291 11521 12412 15164 11348 3717 519 1876 328 2751 2726 2927 2452
22798 2452 4768 6062 -2213 -3162 -2612 -9101 -8105 -9123 5440 14832 3621 4191 7449 7133 2548
22783 2548 1550 -2274 -2814 -4621 -10214 -3751 -3412 -328 6623 6587 5954 2707 4555 -904 -7039 -8589
22767 -8589 -9749 -5706 -6032 -9950 -17040 -15398 -12259 -14618 -14957 -12581 -12729 -12074 -7716 3238 -4053
22752 -4053 -16193 -16206 -13434 -10541 -4200 -7829 -10934 2648 1676 -6768 -6710 1224 6683 6960 3914 6011
22736 6011 11616 9746 3076 5040 11728 5292 7989 7381 6959 14045 15442 20690 14635 4866 1187
22721 1187 -3279 422 -7650 -11125 -5459 -5907 -4970 -4328 -798 3353 1825 3261 3546 3876 2670 9288
22705 9288 17310 14163 7385 6472 11655 15949 11144 269 6092 10861 12153 9033 976 -3573 -744
22690 -744 2286 2339 3683 3464 -3036 -4466 -4372 -3362 6325 10755 15736 6339 1842 7086 8345 5022
22674 5022 -4021 -13749 -8506 -3286 -3542 -3747 -3537 -1158 4664 11274 1178 -636 1372 -4755 -6746
22659 -6746 -547 -644 -3157 -4545 -6038 -11411 -15599 -17172 -11452 -5995 1909 4222 -163 1140 52
22644 52 1622 3557 -2518 -2110 2152 4283 5375 7584 1227 -461 1406 10288 8959 8968 4841 3559
22628 3559 2102 -441 -1222 -2888 1202 -1376 1982 -4948 -6560 -2140 -88 -888 -4032 779 971
22613 971 3708 -4213 -11978 -15495 -14594 -12029 -18587 -20191 -11992 -8226 -5548 -7503 -8971 -5160 -2366
22598 -2366 -1403 -2789 -2265 -3842 -2810 5122 4173 2325 1349 6997 6821 4815 -927 -4910 2358 4677
22582 4677 1684 -1753 -10585 -13386 -6853 -2713 -1459 -1990 -2467 -2871 4119 8065 10094 7935 2066
22567 2066 -807 4849 9713 12530 13084 10391 5558 4532 762 4433 4927 5223 5018 -186 4396 -2542
22551 -2542 -10658 -11210 -8178 -3862 -4326 -8759 -4581 -1691 -6822 -14207 -13895 -9663 -7244 -8805 -12755
22536 -12755 -9240 758 -2401 -4194 2846 6152 6053 4617 -2641 623 3816 6836 5519 7174 6535
22521 6535 4945 1826 3618 257 -598 3501 3587 4446 3306 1189 2193 -2032 -2448 -7205 -6809 -5721
22505 -5721 -4978 -1882 -229 1987 1567 -5566 -10658 -10515 -16799 -7082 5104 -1452 -6508 -1868 2463
22490 2463 8841 13292 13275 2587 -9420 -8127 1859 1175 1333 1894 -684 -6940 -7544 -12758 -14279 -12412
22474 -12412 -8385 -5134 1044 -567 -1372 -4204 650 -299 -6476 -4832 -1369 1753 -2541 -5635 -697
22459 -697 405 -4886 -851 2071 -1467 -1626 -1976 -2372 -6858 -9608 -8845 -2334 -1048 3110 8841 7109
22443 7109 -3805 -9277 -12426 -6765 -814 657 -2190 -5811 -1550 1113 3064 8158 8178 4065 1751
22428 1751 353 -613 -5156 -2756 4790 8663 7406 949 1691 2057 -4706 -6148 4087 6059 486
22413 486 1309 1075 748 516 2619 6792 12559 6049 2580 8906 16295 15103 10466 7478 9892 4519
22397 4519 4785 8892 5248 2946 -2983 883 5632 1237 5343 9429 12928 13475 10098 10296 6081
22382 6081 3870 -1923 1283 -1350 -6266 -3582 -1704 -846 1215 1844 5571 8683 5292 6657 6749 -1314
22366 -1314 -175 8291 12761 14158 18004 10144 -550 -915 -3171 -4125 -5941 -4753 -5575 -5587 3010 3016
22350 3016 8 2524 5644 8573 10105 8417 1368 2227 6681 9363 8485 7656 1417 -4090 -3635 -4522
22334 -4522 -4571 -6349 -9482 -12541 -7022 -10057 -8408 -12466 -11156 -2854 2436 -5554 -9450 -6975 -3288
22319 -3288 -3404 -4850 -6769 -10955 -19777 -19494 -17824 -13811 -8392 -1625 -2940 -9293 -3433 6125 8861
22304 8861 1762 -8139 -6306 -6490 -6688 -7754 -4548 -3741 -3143 -7497 -6716 -9783 -20689 -14427 -1751
22289 -1751 6385 4697 2993 1620 5085 11000 8376 9925 771 2795 7633 9508 7021 5286 858
22274 858 5986 4737 1868 3132 4825 10844 11340 10369 9877 4805 5366 10828 12821 11156 10892 5869
22258 5869 -7172 -4397 5420 13071 9628 8970 8676 8691 14220 11927 5250 998 -7365 -3501 4907
22243 4907 -1113 -847 1310 3226 2831 1035 350 -235 -922 1369 -2366 -3171 1591 6325 8706 2683
22227 2683 -5223 -1102 -414 -5917 -3251 7101 8407 2464 1621 2403 -1012 -3018 2784 1630 1813
22212 1813 -1699 -1906 -5038 1549 2715 1390 3579 6898 8941 8245 -133 -5156 -10583 -15250 -7166
22197 -7166 -4156 -1289 -2284 -2061 -1875 -3014 -772 -5242 -3983 4733 10148 8441 -304 310 1729 6425
22181 6425 3519 -3512 -8022 -5585 4685 2872 4549 5469 -3891 -8293 -9120 -887 2168 2671 -1234
22166 -1234 -4259 -4094 -2795 -3355 -2806 -5727 -12710 -9347 -6807 -7170 -6732 -3873 -3307 -1366 -4893 -10953
22150 -10953 -3803 3044 -4935 -13947 -11443 -11163 -14862 -10106 -729 2615 5593 -1484 -4399 -3806 -5902
22135 -5902 -5988 -1783 4836 9854 6367 -3473 2856 9021 14761 27896 40927 46350 50956 51785 42467
22120 42467 26897 20488 8965 727 545 1790 2151 3764 -4635 -1548 8324 9715 2395 -726
22106 -726 754 -953 -47 1606 3337 6428 8467 12039 9327 5310 2003 3064 10184 11098 10573 12020
22090 12020 16540 12876 4904 -130 -2422 -3684 -9083 -11697 -10815 -5847 -7340 -16408 -19172 -12385 -12462
22075 -12462 -6116 -2312 -6680 -8712 -9491 -13942 -13485 -9800 -9781 -10853 -8366 -4454 -7615 -11240 -13718
22060 -13718 -16318 -10828 -6452 979 -1535 1830 -2114 -7831 -6769 -2615 -2525 -4329 -8046 -9191 -5058
22045 -5058 -3660 -3789 -2645 4134 7963 3274 1003 1678 -6046 -7563 -1839 -6025 -5848 -4950 -8645 -11294
22029 -11294 -5264 -4961 -4637 2400 2782 2436 -1398 -2428 -7663 -14557 -14236 -16265 -16836 -16477 -13668 -14234
22013 -14234 -6184 6178 9581 2387 -3543 -4006 -2863 -1662 201 2531 1128 -1433 -1139 3532 2569
21998 2569 -3235 -2514 -7112 -9924 -5448 -1598 -2662 -7472 2830 10636 6127 4686 6937 9745 8970
21983 8970 8432 2515 -187 -5696 -3021 1811 2992 2787 -387 -6812 -1756 -2958 -8860 -10651 -1763
21968 -1763 2089 1613 365 3828 7102 10016 11602 12709 6722 -253 -7683 -3278 -957 -1580 -2350
21953 -2350 1145 3309 143 -2632 -6904 -6646 -4195 -95 -1663 4385 6949 3574 8214 9739 5238
21938 5238 2689 4734 9416 10706 5550 6231 7017 1427 -4409 -10072 -8495 -5530 -4662 -7638 -13750
21923 -13750 -9243 -4837 -5513 -4040 -5830 -11529 -14463 -15497 -11525 -7103 -5848 -7468 -10215 -7395 -5667
21908 -5667 -6484 -6069 -402 -3409 -5022 -3148 -6178 -5883 -2174 2994 2114 -3105 2995 1850 846 1550
21892 1550 -1447 -4398 -3344 -1464 1959 559 3558 3713 -1031 -2448 6109 10753 4982 -24 2212
21877 2212 4544 11154 12692 5268 5122 8689 6779 8164 7603 5726 1950 -7616 -3905 -196 4869
21862 4869 -125 -8741 -8786 -8752 -6119 1728 -1595 -1731 -557 -7796 -14538 -11098 -5674 -4369 -4664 -1491
21846 -1491 -344 -4732 -12159 -12338 -8860 -6244 -6778 -9764 -12819 -17915 -10196 -9049 -5452 -2504 -671
21831 -671 -489 1238 -2603 -1843 -1634 -4327 -9156 -11878 -12395 -14528 -14476 -13193 -7916 -10149 -10417 -9454 -6159
21814 -6159 -1172 -4492 -8585 -18661 -16095 -3952 6092 3304 -3480 -2093 -2570 -7312 -3054 -1908
21800 -1908 -7485 -13825 -8567 -4071 1496 631 650 3371 127 -2838 -10957 -11940 -9324 -11454 -18576 -14319
21784 -14319 -8980 -2087 -6138 -10209 -5379 -2724 1966 8150 2937 -7011 -2978 -683 -6049 -14046
21770 -14046 -14284 -6910 -813 -2405 2500 10290 14649 12923 4868 5860 2159 -3749 -2961 2333 2036
21755 2036 1990 4819 -2773 -330 12438 10740 7340 3198 -1400 2634 -67 -933 -3943 -5979 -2876
21740 -2876 482 -2118 -3000 -7072 -7760 -6694 556 225 -4876 -2271 -1989 -1757 -337 -2769 -3847 -1346
21724 -1346 611 349 3589 5362 1387 765 7751 4804 453 -8565 -10586 -4215 -3481 -5708 -5882 -3205
21708 -3205 -4960 -11490 -6773 -4376 -9736 -14473 -11321 -694 1830 2930 5592 -4543 -8438 -3172
21694 -3172 -4414 -4616 -916 -984 -3996 430 1072 -3963 -5800 -101 2927 6510 10659 9585 12201 10196
21678 10196 -226 -11453 -17447 -13096 -8208 -5187 -3210 -7312 -14227 -3955 1122 -4746 -6323 -188
21664 -188 393 -2349 -5867 -3152 -1607 4651 4713 -1901 -1069 1221 7139 7821 3374 2964 6292 11420
21648 11420 5435 3299 -1014 -1234 -2177 7280 1736 -4181 -2655 94 1045 2056 3711 2595 -4917
21633 -4917 -6174 2036 7580 10719 11486 4152 2001 -1092 -4000 -3863 -4965 -6072 -2499 -2391 -4130
21618 -4130 -4941 -2307 3351 2958 -3473 -8693 -11011 -8501 -6112 -1745 -517 474 -6732 -2014 4872
21603 4872 9638 3758 -434 -1636 -253 2358 7539 9217 6629 -292 -34 4359 3156 6006 6034
21588 6034 339 -6637 -3721 -6971 -11709 -11738 -11725 -11489 -4576 -2425 -8580 -11059 -8839 -477 -4918 -266
21572 -266 645 -2067 -8354 -3939 -1718 -1435 -10401 -14923 -7945 -4794 162 -2422 -1652 -2904 -6541 -10403
21556 -10403 -10688 -3021 4595 3522 10728 8545 2927 1461 1456 -316 632 -1537 -3505 -3591 -4434 -195
21540 -195 -101 3049 -5937 -3992 -1822 1519 3632 3745 9217 12903 12003 8463 3645 5075 1404 4598
21524 4598 -65 -10032 -9970 -5822 -272 1077 1681 -2630 -591 1794 -1804 -4167 -6792 -6493 2098 -511
21508 -511 -683 -1178 -1666 2753 846 -3866 -3117 -5295 -3827 -7344 10 3351 -196 -1212 453 -2918
21492 -2918 3783 9976 11174 8582 -1145 -8381 -11568 -11798 -3914 -2739 -6746 1724 2000 2047 -3807 -8338
21476 -8338 -7087 -5262 -1451 544 1772 -642 -4499 -2899 -3941 -2024 -3763 -6619 -4925 -6465 -607
21461 -607 205 1314 268 -2763 -7628 -7061 -1638 -3408 -6507 -6789 -3512 -954 -2402 -6391 -5139 5494
21445 5494 12934 10782 9448 6222 2098 2675 6503 7326 1626 -7196 -10832 -8536 -4350 -3170 591
21430 591 1392 1555 4436 1569 -7447 -8473 -9325 -3771 6088 7193 4594 869 2565 2295 -4457 -6471
21414 -6471 -675 8727 12519 10926 5011 3853 9622 10255 10299 2141 -6194 -6815 -963 4774 351 -2918
21398 -2918 1852 7575 2872 -3546 -8817 -5244 -5709 -6719 -537 -3241 -545 2631 11432 13016 4233
21383 4233 -3150 -8 6489 14448 16054 11865 6348 7122 15187 19536 11897 10516 8477 8287 6666
21368 6666 1167 1722 2442 -5115 -8614 -9567 -10119 -134 -1489 -7623 -12262 -7136 -7910 -4700 -3271 -6369
21352 -6369 -7816 -11836 -11566 -6066 -879 -267 1687 736 -3439 1982 -3012 -5981 -3743 -4086 -3982 -7819
21336 -7819 -5406 701 -2043 -4731 -1438 -705 -3429 1962 542 378 3471 5741 4383 -2094 1273
21321 1273 2801 -18 5958 9447 3119 -4044 -3109 -7496 -11688 -7501 -2393 -2658 -4312 -1297 1729
21306 1729 4209 7346 4903 -1192 -7060 -12009 -13587 -14810 -17375 -13843 -6892 -7775 -3097 -6351 -11153
21291 -11153 -13901 -8212 -3653 -3883 -4569 -7235 -8098 291 5673 6054 9056 8090 232 557 -1819 -8628
21275 -8628 -13059 -17819 -20962 -20925 -16053 -9440 -8889 -3379 -3611 -7160 -8598 -8488 -1917 -4177 -7390 -3013
21259 -3013 934 -709 2887 860 -2955 -5349 923 -3881 -3374 261 -1565 -3540 -529 -504 -3050
21244 -3050 -7018 -4752 -8560 -11863 -1788 2315 2996 774 2094 5533 2980 -2481 -2852 -5582 -5810
21229 -5810 -3168 1970 -2013 2460 4356 -748 -2237 -7533 -4315 -266 3687 5083 10428 11961 4443
21214 4443 5836 5320 2539 5917 5930 3931 -3779 -4068 -3509 -4446 -7263 -12103 -7253 -7128 -4942 -6223
21198 -6223 -5471 -10468 -7251 4227 3302 -2260 465 -3362 -1227 6267 10802 12001 9597 4459 1014
21183 1014 -11272 -15198 -9396 -6394 -3992 -10038 -14731 -15864 -22123 -19003 -12515 -1574 2975 -3671
21169 -3671 -6534 -1195 -8978 -10672 -14483 -17418 -9613 -100 6079 3201 3655 -715 6183 9393 6191
21154 6191 7767 10567 3611 -5265 -5044 -2988 -5130 -7817 -5906 -2143 -3928 -8452 -10579 -19316 -11435
21139 -11435 -8333 -9003 -5186 1067 2619 7279 6033 -2846 -7807 -5904 2308 10024 6020 -954 -4610
21124 -4610 -743 -1247 2355 3701 -850 -10873 -11482 -7772 -2006 3074 457 -4359 -7308 -3848 -5146
21109 -5146 -7441 -538 8707 3501 -8399 -4421 592 1788 3352 6565 8340 6591 795 1046 4110
21094 4110 11383 7341 1338 -2893 2488 1975 9828 12573 12308 8486 7652 9825 4880 -3616 -401
21079 -401 2174 9218 5672 4316 -282 -1914 5689 5796 8921 15191 6085 1048 64 -1646 437
21064 437 -2775 -2074 31 -1491 -5377 -1658 2695 -754 -3965 -7811 -8179 -2807 -343 -4788 -8482
21049 -8482 -5409 1768 3321 7879 7709 11450 8767 6365 2979 3924 3629 3167 2749 3165 -17 -10483
21033 -10483 -14901 -8361 -6815 -12654 -7383 -2006 84 -5488 -6832 -5849 -3250 -1858 56 1200 5758
21018 5758 6407 5661 68 -9314 -5836 -7344 -1080 3274 9238 9354 3329 -1404 -3825 36 977 -1917
21002 -1917 -1587 2974 3084 1866 6727 9812 5324 -857 -1458 3913 6563 3925 -1664 -2893 -1263
20987 -1263 -5248 -11759 -13378 -14913 -7119 1494 2990 14987 23628 17487 9869 10903 13281 9282
20973 9282 4332 -3324 -4645 1062 9818 10146 4263 1361 -1719 -6866 -7549 -13524 -10250 -6308 -6064
20958 -6064 -8947 -10456 -8323 -8045 564 5508 6071 6949 2841 -931 -7590 -40 -426 -6008 -3096 -217
20942 -217 -860 -2970 -6802 -4451 4732 14297 12338 3899 -641 5268 -480 -13273 -17763 -17512 -11610
20927 -11610 -7745 -8337 -4314 3838 8939 -1815 -3650 -7045 -10283 -1273 2606 -2622 -5312 -1757
20913 -1757 1584 -1624 -1627 2055 7997 3498 1585 3734 6143 12623 6192 5308 4040 1134 -1999 -3130
20897 -3130 -6231 -8115 -4548 -9351 -7383 -3092 -3897 -2273 2626 1106 478 -1377 -209 3284 4255
20882 4255 2915 4889 2 -5883 -8104 -7464 -7096 -7782 -4498 904 -142 -5113 -5806 -5026 -8096 -11936
20866 -11936 -10184 -9695 -6646 -3141 -1757 -3530 -1410 -3787 -4179 -6294 -6420 -5691 -8765 -2585 -2442 -3238
20850 -3238 -6735 -9707 -920 4828 9092 4171 1715 4378 2859 2566 -1779 -10088 -19207 -15870 -13307
20835 -13307 -17913 -9056 9 -487 -5809 -3697 3669 5477 5301 1167 -4463 -1929 1618 6051 1460
20820 1460 -12477 -17931 -13086 -5134 -5936 -11395 -16619 -16885 -11055 -3872 -975 -4433 -7226 -8525 -5101
20805 -5101 -1809 -5177 -3684 -3317 -8342 -11710 -14621 -10190 -14292 -14168 -14526 -7116 -3014 1764 -737
20790 -737 -381 353 1514 1082 4034 5247 2432 551 2517 3956 -365 -4270 -7373 -11550 -5963 -247
20774 -247 -166 1878 1622 -1136 -6878 -11740 -16932 -12883 -13220 -8259 -3062 -3143 -5863 -8824 -1099 7780
20758 7780 8059 5366 1665 -1157 -1532 1736 3780 426 -584 3209 2643 -899 -444 -3991 -5834 -5152
20742 -5152 -9853 -7224 -5046 -3931 -6412 -2156 -1004 -6158 -5942 -933 -3235 -10335 -9394 -5605 313
20727 313 5177 2028 -2724 3944 4669 1636 -66 -3519 -15894 -18807 -7596 2604 6182 13311
20713 13311 14341 3256 -3343 -8588 -15361 -15468 -16879 -16763 -13697 -7671 -2275 413 -4541 -5159 1029
20698 1029 3778 201 -8103 -8850 -1351 385 -1270 2548 1655 -5725 -4728 1091 1874 -273 -681 1197
20682 1197 3043 1901 -971 -5243 -5341 -3659 -7858 -10656 -12491 -9078 -10288 -11711 -7237 2738 908
20667 908 -6272 -10594 -7647 -15842 -13393 -7131 -2645 61 -1773 -3612 1020 3179 -2387 -8229 -6337
20652 -6337 178 1681 -1238 -2138 -7477 -10600 -4742 -325 1855 1297 -5642 -13583 -18555 -19495 -18633 -14156
20636 -14156 -9679 -4023 -1299 -721 3034 5132 5391 4053 3267 -6 -4067 -4045 -1403 733 -2461 -2647
20620 -2647 -747 -697 -5906 -12074 -7986 -3357 -1426 2329 11992 10186 228 -1445 -2607 -406 3766
20605 3766 -1219 -4219 -5539 -7391 -6782 -1063 424 3 3200 6318 3500 -2080 -2447 -3608 2830
20590 2830 1081 1258 4054 267 -7252 -14087 -15256 -11240 -12432 -21421 -23074 -17661 -7610 1129 13055
20575 13055 5136 -3665 -9224 -8819 -2216 -1346 179 6201 6451 -2768 158 892 -2152 -7774 -5772
20560 -5772 -7400 -13206 -10758 -6054 -3068 1232 3300 3495 1418 2710 1236 -3238 -3455 -5778 -46
20545 -46 -892 -6556 -7298 -8276 -6027 -4303 -3198 -1873 -1489 844 4318 10017 9570 5515 1828 -3359
20529 -3359 -8448 -9599 -11118 -9031 -4880 -4539 -3329 225 4778 7403 2839 1628 5994 -562 -9669
20514 -9669 -14980 -10629 -7558 -10424 -4984 -1539 -4844 -4327 -2627 -8061 -9951 -2025 62 -2730 -2483
20499 -2483 -6512 -2319 -1670 -9398 -8812 -2050 -711 -3247 -4786 -11534 -10076 -10217 -10064 -7513 -7855 -2139
20483 -2139 -207 2600 1730 3997 7204 -6285 -7358 -6206 -4074 -5337 -6466 -7456 -9851 -11437 -9747
20468 -9747 -3350 -808 328 -6311 -5281 -6267 -6580 3608 10153 4304 614 1016 -1578 347 4053
20453 4053 1262 1294 6856 9801 10228 10600 2312 3286 3897 357 1603 2320 6146 10737 17781 17898 2987
20436 2987 -9391 -7244 -4629 -1378 1677 3642 2312 5700 3524 -2078 -3344 -8092 -5829 -4625
20422 -4625 -1017 2480 5750 -2138 -12361 -8442 -2169 1617 -277 2106 -1097 -9 3110 6349
20408 6349 1347 4356 4258 4281 2194 2813 6922 5504 -2525 -3955 -1319 -2527 -2576 -483 571 3265
20392 3265 4483 3347 -1709 -999 5901 2419 -5887 -2775 -10065 -12958 -13511 -14037 -8965 -3043 -3053 -3445
20376 -3445 344 -4676 -8118 -14005 -16726 -11558 -11775 -12709 -14119 -13897 -16474 -13954 -7783 -4524 -946
20361 -946 -794 -1096 -4573 -4894 -3550 -9535 -15019 -10266 -4584 2374 1711 -3777 -4715 -5036 -5946 1514 7673
20344 7673 1031 -3128 -2750 -4087 -2991 -4176 -9394 -3009 -1533 -748 -2589 -10068 -4360 2584 4742
20329 4742 75 -2587 300 -2001 -7641 -5810 -1336 583 -10631 -10106 -4776 -2767 -12198 -9054 -6152
20314 -6152 -6694 -9163 -10448 -5416 -5383 -15482 -18820 -12848 -8466 -4391 -5840 -2816 -10508 -18522 -16653
20299 -16653 -17951 -16572 -9272 -1283 171 1220 1329 1031 813 993 11833 13505 3095 -758 3005
20284 3005 1914 -3525 -3971 1058 7734 3297 -4184 -10574 -15329 -13663 -7442 3028 6121 5610 4889
20269 4889 6709 -2652 -6225 -4020 -1206 5459 4791 -3434 -2672 802 -3715 -15549 -19703 -15825 -6941
20254 -6941 -2916 -2622 -852 -1957 -1666 1767 1331 -9443 -4685 -5509 295 2671 -110 -4104 -5098 -578
20238 -578 7844 5069 -1780 -5642 -4617 -5074 -587 1442 5232 4648 4099 57 -7681 -14528 -15856 -16927
20222 -16927 -11574 -5594 -606 1507 2586 -3192 -189 681 -5115 -4323 -1604 -2665 -3727 -5829 -8583
20207 -8583 -7370 -4126 -7049 -6740 -9103 -9557 -7020 -2777 2136 -3075 -12812 -10663 -2622 1598 5309
20192 5309 2160 -2702 -3770 -2074 -1620 -3703 -1405 5073 3023 -1865 -189 -3694 -108 5376 2736
20177 2736 -595 939 5084 4090 -1947 -537 4712 4998 6179 3776 3036 3210 -967 513 -640 -2395
20161 -2395 -4780 -8335 -7460 -828 2478 -1379 -1094 -10146 -12192 -10542 -13950 -10896 -4627 -3320 -4313
20146 -4313 -7789 -4882 -1366 -8115 -10930 -3998 -274 -2506 426 -7353 -10331 -7246 761 3620 12643
20131 12643 10792 4407 -8837 -10103 -7557 -7256 2132 -4472 -7506 -4417 -5353 -8934 -4574 1063 3096
20116 3096 691 -1870 -2098 -11245 -17343 -20389 -22450 -18735 -16233 -11936 -5003 -7585 -11179 -10561 -8160
20101 -8160 -2312 -1602 -5880 -7546 -6044 -11886 -12117 -12797 -3532 -4577 -6306 -3804 1350 5402 8312
20086 8312 6840 3274 3617 2759 4879 -2271 1435 1877 -5263 -5320 -6024 -6329 -3061 4296 7395 2486
20070 2486 8956 5792 -5406 -3770 -8978 -11791 -13066 -9758 -5902 -3396 1886 3678 7016 6844 5338
20055 5338 608 -2017 -4666 -468 -2077 -2893 -6405 -3750 5957 8209 767 -4289 -4709 -5752 -8348
20040 -8348 -5596 -2447 -198 1577 759 -505 1255 4350 -1910 -5024 -7449 -10542 -19423 -20021 -15296
20025 -15296 -5799 749 -648 -4971 -6002 -5197 -5124 -2351 4297 -1658 -579 9845 15603 9199 4728
20010 4728 -1640 1333 -986 -1880 -4300 -12176 -13892 -6701 -553 4686 5828 4820 2209 551 1457
19995 1457 4279 1527 -4904 -6247 -1948 1240 -2952 -7424 2736 2175 3641 2721 -1049 -3500 330
19980 330 -4752 -12442 -16998 -8272 2029 2014 -1949 -6099 -2886 -3582 -5898 -839 2282 1564 -4510 -4825
19964 -4825 1755 10003 16934 10106 3279 -1737 1686 2892 -2943 -5567 -6839 -6327 -463 6991 15750
19949 15750 13576 8241 1478 -1226 -1898 2046 2246 2886 -2352 -8183 -10418 -13178 -13615 -12079 -6791
19934 -6791 -6211 -9298 -6821 -6204 -8432 -5859 253 -4499 -13563 -6551 -1243 1313 1515 2166 6544 3474
19918 3474 -4090 177 -5594 -6939 -9208 -3432 335 1408 4154 9829 6623 -4870 -10345 -3887
19904 -3887 -1135 -2970 -6616 -6133 -510 1841 -4742 -9414 -10157 -3430 3897 7795 4610 -3463 -1373
19889 -1373 -1741 -5474 -1512 1812 5832 8757 4031 1409 5361 260 -766 1667 5560 3995 3153
19874 3153 3962 1346 232 3386 5990 4546 2132 4677 8825 11812 8007 9166 12653 7297 3689
19859 3689 -957 -11811 -3747 2811 6911 -485 -9972 -9396 -2048 -250 -3803 -8061 -5357 -4512 -8763
19844 -8763 -5047 372 -2176 2780 2412 -207 -3468 -1970 972 -5821 -6607 -1964 -2103 -10682 -9416
19829 -9416 -3028 2156 -914 -6767 -9531 -3149 2499 2231 -4969 -1885 1182 6927 1656 -2124 -8757
19814 -8757 -7613 -4819 8931 6427 -281 -2641 -2137 -4493 561 3796 6258 9834 7133 11354 6255
19799 6255 3146 3744 2585 -984 -2388 -5803 -12113 -10701 -9672 -9717 -3667 -1187 -4103 -4805 -3414 3016
19783 3016 -378 -3487 -8706 -6728 -6341 -7446 -7834 -5058 -9749 -8729 -4465 -7189 -15107 -14470 -10188
19768 -10188 -3437 -1918 -6143 -5836 -4268 -695 -2721 226 -2227 -9386 -6907 -4891 -5423 -3748 -164
19753 -164 2199 3663 3274 1631 -350 4841 3603 2349 6780 8060 6568 3550 4577 815 -8311
19738 -8311 -6873 -79 8731 6425 4303 6390 713 -589 -1397 -3661 -5210 -8614 -5323 -1796 -3701
19723 -3701 -5809 436 4588 2365 258 -4674 -693 2782 -166 1044 6464 2667 -2388 -7347 -11002
19708 -11002 -7966 -4349 639 8527 10893 7528 1270 -3647 -2567 -961 -5248 -5362 -596 2820 2000
19693 2000 -2409 621 -355 -3533 -6647 -7040 -7981 -9996 -13526 -9838 -13786 -12155 -6022 -9490 -11281
19678 -11281 -4691 2588 -2795 -12466 -4054 7194 10069 6541 -23 -916 4371 7534 16232 15457 11184
19663 11184 6163 14 -4895 1007 6166 1311 6392 14837 13570 2716 -9496 -13697 -6031 -6126
19649 -6126 -7784 -5324 -4178 -4404 -891 4870 8121 11790 13730 11590 2959 -1482 -4273 -5580 -4947
19634 -4947 3880 7481 163 -2341 -382 7054 8597 4588 4170 3989 -220 -4147 -4491 1099 3598
19619 3598 4934 1996 2495 -802 -5516 -6586 -7743 -10932 -11680 -12553 -10228 -4619 1052 7177 1806
19604 1806 -2458 -1276 -6768 -4035 -9539 -14360 -12149 -8600 -7368 -4213 -4850 -3490 654 1278 -504
19589 -504 -3119 -5276 -5170 -11161 -21156 -21170 -12375 -4172 2777 3144 -343 737 4681 3130 4240 2953
19573 2953 -1023 -3053 2967 9978 11296 1948 -2596 -3550 926 5457 2841 -3024 -961 -2382 -131
19558 -131 2958 791 -2155 -2893 -64 -3809 -5669 -3081 402 2362 4427 389 -5583 -7670 -7432
19543 -7432 -9058 -11606 -10770 -7474 -10810 -11027 -8632 -2298 4390 4170 3262 5074 6025 6026 -2152 -5584 -6123
19526 -6123 -6649 2228 9909 6683 -2602 -3662 -3229 -1436 4084 8951 10886 13936 13674 9810 6313
19511 6313 2421 -6996 -10126 -12184 -8198 -1605 -3918 -7271 -1115 2898 5309 6668 2162 1342 -1308
19496 -1308 2894 6527 6338 8840 5638 -7055 -8062 1458 5516 5258 3039 -1304 1958 3692 5431
19481 5431 10217 12537 10841 14570 18665 15338 9811 9528 6505 -724 -630 3638 3878 6164 8733 10254
19465 10254 4973 -640 -8245 -15082 -14831 -4153 3751 1207 -1045 -750 1220 1293 -2974 -1068 -3715
19450 -3715 -2202 -7985 -14437 -13414 -6659 -958 -2299 -8546 -12205 -8977 -4954 -6989 -8470 774 977
19435 977 112 -2347 -2051 -3415 -3298 -8805 -6341 -6601 -3963 -2008 -5534 -8076 -3397 2855 1215 -4916
19419 -4916 -10757 -10359 -9514 -8493 -10103 -13451 -11258 -12078 -12391 -7001 -8208 -6542 -6226 -7566 -14380 -14382 -15634
19402 -15634 -17855 -13391 -5128 -8059 -8887 -6939 -6426 -1062 232 4527 -876 -5278 -4062 -3399 1923
19387 1923 -2231 -6293 -9231 -4205 -940 -1187 4678 5229 6689 5842 5549 9316 4750 -3641 -8734 -8320
19371 -8320 -1334 283 -112 -1869 -2782 4422 4124 -1017 -4629 -2568 -707 -2696 -1078 1370 966 1759
19355 1759 -2492 -6324 -6962 -4311 -3923 -1831 1365 4309 4334 1889 2595 920 -2140 11280 12396 8015
19339 8015 4594 1602 -499 272 -1279 1642 2685 5293 7198 9580 9935 6986 9999 9957 9250 4749
19323 4749 6615 3953 -6947 -13100 -7899 -8056 -10859 -12721 -7265 -3594 -8555 -12582 -10953 -4781 -5285
19308 -5285 -13289 -15227 -15420 -13662 -9684 -2684 2132 6581 -94 -5201 -11279 -1454 1546 -1619 1769
19293 1769 5388 6372 4507 911 -1804 5011 5281 2065 2850 -1440 -4356 -11270 -17916 -13518 -16479
19278 -16479 -16637 -14521 -9278 -5507 -85 -221 -6915 -7794 -4849 -811 -1433 -3672 -839 -3856 -5565
19263 -5565 -3208 5173 5163 4872 4391 -1228 -7074 -11251 -7057 -4824 -4508 -4541 -9983 -12001 -16835 -20260
19247 -20260 -12767 -5161 1984 992 2261 2624 1152 5368 3224 -2167 85 9612 11774 7481 5494
19232 5494 2510 -3696 4654 -2819 -11900 -10475 -9888 -9963 -3413 -5727 -324 5914 3705 -1572 -4133
19217 -4133 -6875 -1798 7181 6205 5038 9297 12376 14170 13956 7794 2910 6753 3789 325 -1098
19202 -1098 -7272 -12930 -3975 6218 11545 2845 -8556 -13640 -13674 -8859 -8184 -11004 -7696 686 -3018
19187 -3018 -9053 -6154 -1930 3397 4491 -643 -982 3114 -2283 -3369 -5450 -5148 216 3541 -1118
19172 -1118 2574 2802 -2069 -8671 -11713 -16008 -13065 -5314 -1754 -2241 -4836 -5074 -4845 -6278 -8833 -3246
19156 -3246 2070 2167 2122 -2632 -1718 -6327 -11139 -12054 -15281 -8388 -2454 -2196 -3905 -1891 -2934 -8782
19140 -8782 -11645 -9752 -3079 4256 5674 2517 4398 4747 858 1608 5932 2189 -1161 141 -2726
19125 -2726 -4292 -1318 -5701 -9821 -12894 -5704 -102 3099 1466 31 -4431 -7750 342 9128 430
19110 430 -6952 -5072 -4850 2917 5076 705 -6052 -8517 -4684 -1715 -5782 -5428 -10450 -15289 -8575
19095 -8575 -8580 -11518 -15406 -8659 -9702 -12894 -11215 -1317 4434 454 -7160 -9443 -9367 568 4808 15563
19079 15563 11681 3707 416 1504 5038 3194 937 -846 -2128 -4182 -638 1318 -3771 -7880
19065 -7880 -8038 -8558 3696 9779 7992 1570 -697 -338 2100 4080 -654 -7864 -15541 -16345 -13074
19050 -13074 -1854 -4725 -3980 -5596 -4844 -1401 -1347 -3660 -3558 3051 5676 6026 4036 1009 -4126 -757
19034 -757 -1151 -2565 -3965 -3023 -6014 -12961 -12995 -6590 1412 4524 8919 3624 -3547 897 749 -5988
19018 -5988 -10702 -8347 -11859 -16194 -8638 -3411 -2328 -4372 -205 7730 3976 4535 6011 7175 6205
19003 6205 351 -6929 -7087 -7787 -15353 -15590 -10570 -5696 -611 1997 9113 10126 13328 8414 5201
18988 5201 -1165 -6697 -3610 -3106 -4288 -3629 -1777 3360 1154 -3001 629 1020 -6481 -4098 2590
18973 2590 -469 -6358 -3117 -1575 -2102 1114 2571 -3336 -1364 3177 3202 -703 -4145 -3647 -6090 -1506
18957 -1506 -860 2089 -3840 -10718 -12337 -15544 -15996 -14302 -9206 -9140 -5669 -4446 -3844 -11711 -17521 -14423
18941 -14423 -7612 -1580 -824 -5791 -7880 -9059 -11007 -6638 -3856 -7281 -12727 -5801 -8921 -10739 -7367
18926 -7367 -11074 -8285 -9298 -14521 -13256 -7759 -707 -2921 -3695 -1436 2658 4968 -803 -1624 5947
18911 5947 8405 -2152 -6955 -4684 -616 1094 1061 1996 3951 511 -9453 -12557 -8254 1120 254
18896 254 -211 563 -5662 -7670 -8885 -6866 -1336 2789 6433 2210 -4197 -10002 -11508 -8582 -1889
18881 -1889 -4730 -7042 -9990 -9661 3385 1240 -1138 -1679 -4700 -1035 5189 4509 876 1511 -722
18866 -722 5136 6509 4391 2909 5206 9185 2856 2184 3598 4748 1890 4719 10159 512 -10436
18851 -10436 -10388 -4488 -10099 -7069 -6404 -3141 2935 -349 -351 3388 2007 1133 -1190 920 11021 8912
18835 8912 6192 2168 3639 3659 -2539 -2966 -2288 5102 6061 552 2333 5283 2174 -2946 -5882 4039
18819 4039 3736 577 4983 4797 6572 7785 4934 3858 4987 1588 2990 7341 7909 3535 629
18804 629 1294 7465 7535 1429 -5709 -10579 -14533 -11853 -10239 -1085 3698 3270 5103 6429 -1663 -5533
18788 -5533 -10409 -9827 -5570 -2240 -83 -556 2054 3916 -2734 -4751 -1479 2455 3664 1884 -761
18773 -761 4847 7684 3823 10943 25486 48501 67379 61162 44230 30969 23769 20330 15194 9100
18759 9100 6465 -3321 -4606 -4222 -3644 -3932 -3209 -437 -3463 -8308 -15624 -9653 -7269 -15707 -13384 -11149
18743 -11149 -8091 -7905 -7292 -11050 -8017 -4651 -259 -2888 -1888 184 -678 708 431 -368 5723 3856
18727 3856 -2856 -313 8807 1338 4353 7746 4280 1981 -1529 -3347 -5399 -3137 600 336 4866
18712 4866 4385 -3091 -9619 -8937 -6775 -2782 -2940 4090 2994 -4193 -3616 -1266 -8370 -2498 -2546 -3340
18696 -3340 -7045 -9309 -3892 -2919 -4633 -3550 -8074 -12977 -16087 -14103 -7184 4706 6279 885 746
18681 746 -696 -6804 -10160 -5897 3260 9762 9833 8040 5788 8628 8721 11614 12509 4269 -2070 -5038
18665 -5038 1495 5697 4716 2759 480 -4873 -8875 -6945 2775 4003 -2895 704 3911 2712 -2149
18650 -2149 -3205 -5390 -3377 -2944 640 5075 4209 5277 2353 243 1215 -2112 2151 3614 4673
18635 4673 9729 3381 6623 6749 3061 -2165 -7269 -10299 -8592 -9853 -13587 -8146 -3615 2881 611
18620 611 4262 7993 3263 -5121 -2697 1300 8029 11865 13050 7244 -512 -8111 -6070 -2963 -355
18605 -355 177 -938 1300 4883 9212 4678 3507 6650 5115 12736 17318 10722 2854 6123 18332
18590 18332 13994 3726 5126 4515 1630 -2607 -8692 -5298 -1896 -5938 -6088 2303 11047 17465 7476
18575 7476 -5156 -3511 -8188 -9810 -11430 -10095 -6029 -7073 -8441 -7630 -7206 669 -1545 -713 7484
18560 7484 11066 8968 10836 9300 1921 -279 -2623 -3054 -2378 -794 7586 13460 16260 8594 756
18545 756 -1975 272 -959 -909 -6681 -4059 5337 6967 5583 13337 10956 8183 6731 5777 2032 -6802
18529 -6802 -10015 -5133 -2016 -4142 -8671 -8919 -6597 -10869 -4676 -2734 -3355 250 544 204 599 -3493
18513 -3493 -9162 -6462 -6356 -5707 -203 775 2213 4753 1733 1310 692 1506 -223 -2783 -5037 456
18497 456 10401 8690 17 -1186 6142 5832 1446 -8875 -11806 -7288 6005 8164 4803 5687 1951
18482 1951 2652 13261 15210 12270 3407 -2777 -1692 3792 5716 4411 10429 13566 9177 6742 5400
18467 5400 1900 1235 -2482 -4826 -11737 -5520 -3174 3816 9524 4000 5366 12746 7847 -799 -5281
18452 -5281 -5688 -7847 -1627 3758 7365 8330 3591 -1187 4021 3688 -1378 117 9796 3831 -1902
18437 -1902 -1710 -2912 -3324 -2116 6448 6685 6631 10023 12629 10159 1055 1448 3010 -594 -5375 365
18421 365 99 5345 9552 9610 7727 9642 13679 12726 12702 4848 8903 13479 5566 -806 4035 2717
18405 2717 3597 6111 9544 17743 11041 8037 9144 5903 973 -5849 -5519 -3339 -2329 -2632 1838
18390 1838 5933 6257 1958 5419 10256 2901 -4115 -726 2612 4188 7967 6777 6533 5903 3520
18375 3520 6085 10079 4814 -3280 109 11346 18773 16660 7958 4001 5234 13717 15159 14495 2438
18360 2438 1069 8284 14496 10973 4589 1662 -3184 -8001 -5768 -1355 2968 -913 -3584 -3839 3772
18345 3772 9264 6112 -2658 -2861 -164 1244 1419 2561 -1856 -5271 -6346 873 4208 5709 2098
18330 2098 5022 8269 8098 16491 23430 23588 21508 16465 13800 15626 20433 23464 22768 23748 23082 22001
18314 22001 18429 12829 9227 9887 11563 9899 7596 5295 2914 3483 -7196 -14436 -10025 -9955 -5843
18299 -5843 -2358 5501 3126 -2483 -4568 1286 7203 5485 -192 516 -2464 -15551 -14774 -7138 -4673
18284 -4673 -5628 -3545 -2741 -75 2747 -186 5380 11956 8371 -826 -5651 -7900 -2953 -2121 -7616
18269 -7616 -5885 -4869 -2276 -7186 2332 14321 24171 27013 24175 24928 22912 22215 21318 19736 20141
18254 20141 17518 12798 7820 10699 17795 18911 21509 18842 13727 6606 7530 5968 2891 5078 7619
18239 7619 9590 9772 7852 6990 8083 12859 16256 23655 34207 38543 40148 30447 20362 14129 17967
18224 17967 22161 26063 27462 21817 18338 16485 12549 14347 13828 10846 4648 4605 7242 9335 10882
18209 10882 16666 17594 11728 7565 14615 11824 3412 -4439 -7643 -5865 -5537 1201 7927 11309 8388
18194 8388 8910 13265 15423 8666 7804 5482 4307 6802 16386 16824 10352 5878 2852 4670 9600
18179 9600 13027 14682 14922 9173 2453 -566 4858 11014 12049 8811 12892 10926 10506 20671 20049
18164 20049 21248 23026 15674 13481 22218 32640 33122 33741 30431 23329 18410 14064 15737 21690 20229
18149 20229 15611 13475 11107 15745 23106 26812 28707 33383 46558 47313 41499 37163 37561 42791 52174
18134 52174 60523 63097 64671 61053 59474 75271 85245 95574 108561 122152 130663 144614 170256
18121 170256 200253 236539 279650 338688 416477 519056 681401 938777 1346639 2068944
18111 2068944 3491851 6338367 10797887 13027655 11147095 8012518 4971255 2997444
18103 2997444 1921571 1340286 994053 770739 622512 511882 431213 368573 329009 282239
18093 282239 241996 211678 186841 167434 151345 144398 134986 124727 116689 103468 92007 86502
18081 86502 78158 75784 80499 79419 63813 52741 48845 47322 45890 40317 36810 34376 36533 30840
18067 30840 28383 31399 26934 22309 23391 21025 14665 16947 16065 11305 8687 8733 5774 8242 9500
18052 9500 8247 6377 8021 11512 12583 9761 2760 7039 21038 25485 18228 17424 15654 16084 18452
18037 18452 14480 6360 4937 3745 3778 6138 12726 15703 14442 9221 2918 4087 10901 15132 12158
18022 12158 13512 17953 21862 17045 11453 13467 12888 13267 18086 20489 17984 5250 -4191 -2718 2488
18007 2488 9017 19587 21818 19758 20590 22523 20587 13977 10337 7859 8036 17359 25443 19017 15148
17992 15148 11613 7360 1424 1548 -2039 -4002 -2569 -417 6454 6512 8057 4921 9101 11877 12476
17977 12476 12745 9347 9265 9935 14560 17990 7902 4955 9955 7145 3148 -5620 -4703 -370 2862
17962 2862 2589 4429 4374 -1637 -7076 -768 -1991 -10460 -18329 -14285 -1012 13851 26181 21308 17697
17947 17697 17519 17919 14345 13013 25804 25864 23371 21614 24795 22354 16900 14823 8182 4160 1052
17932 1052 -2209 -8016 -5315 2074 10602 10513 1928 1332 3576 6656 16077 21145 10537 3424 -374
17917 -374 2664 3092 6047 8125 15930 19450 20796 15992 7538 5981 10000 13126 13757 14460 13287 8322
17901 8322 7071 4239 5903 7928 10759 6721 5853 5138 4446 2303 7643 12123 18980 20688 22419
17886 22419 18757 15422 15556 16925 11763 14350 18140 19219 19070 19597 20604 20724 12258 8615 5997
17871 5997 6905 8586 17227 17906 14650 17443 18586 16955 16826 15333 15393 14058 14825 15435 19756 24477
17855 24477 29597 31391 35073 37695 46855 63304 95082 138254 193830 240124 278107 295967 285740
17842 285740 242194 190488 138477 96767 74419 61055 50456 42022 37063 36360 26675 20236 26729
17829 26729 23264 27100 30857 28964 28192 30460 30874 31819 30885 29259 26205 24048 28320 30801 32061
17814 32061 30164 33444 39900 40355 41101 42188 41508 36059 36286 41779 44152 46295 53893 68309 87327
17799 87327 130799 186481 242798 291048 320203 323760 300129 247554 185919 134657 105598 82507
17787 82507 66232 51413 45024 42814 39936 36324 36523 34421 35365 38802 41712 33876 28935 33394
17773 33394 34676 36431 31619 29395 35899 48617 63250 93461 125070 154896 192357 234114 261364
17760 261364 277377 293355 282185 255442 238813 225508 227882 242018 260702 282692 293297 289146
17748 289146 275140 244833 216245 170357 130770 103124 77690 62407 52571 49392 44975 48092
17736 48092 45809 41715 37837 35546 32870 26643 22630 24859 28795 30845 27514 26200 30877 33572
17722 33572 24418 14780 19572 19079 21695 24038 27858 28975 35040 42929 51263 67225 86980 101171
17708 101171 116453 128425 126375 124890 118163 115860 112012 102343 101667 99758 114409 127159 136648
17695 136648 135830 130957 121349 103357 93154 78231 59035 50307 47043 37231 30952 32360 25456
17682 25456 29547 28177 21606 24466 23779 24626 28353 37668 49839 50886 54490 74459 95541 106934
17668 106934 116828 126519 133764 136083 139150 147627 161295 172632 180476 175879 174179 189039 188436 173774
17654 173774 161306 149704 133752 131160 148829 149684 150650 162378 180553 184029 175615 159001 141876
17641 141876 113098 87087 72229 60947 61055 54912 48472 44358 41390 40410 35559 33345 33517 34138
17627 34138 29739 30965 37477 35636 31894 29209 23230 27026 32945 32129 30412 35876 45465 55392 59131
17612 59131 60326 57817 57607 48913 48034 49130 38464 32623 29628 30040 26246 29901 28333 31403 34164
17597 34164 38644 48072 56862 59017 56872 48693 44317 45753 49588 56779 55278 54345 53205 45954 41751
17582 41751 45105 45001 40741 40495 43451 36271 34663 32471 30617 32727 31665 36871 33950 33931 29994
17567 29994 32210 37131 44111 49878 53231 57571 60301 60911 51937 40189 32792 28090 28278 27272 26974
17552 26974 33739 41088 46411 48137 47408 43858 37375 34211 43795 48979 47684 53117 53415 50447 55749
17537 55749 67357 77143 76978 72861 71871 71853 67964 55306 50794 52770 48438 48337 41502 41129 40353 32923
17521 32923 30200 29974 36519 36140 33482 41351 42833 43550 44982 48496 56039 60671 63100 67779 66283
17506 66283 63510 73068 76421 74913 72385 76677 94856 109809 122618 140429 150666 161903 189955
17493 189955 210022 223589 234409 261568 286705 307431 321460 331194 340879 342711 325389 306525
17481 306525 293692 282824 254866 225853 193460 160247 133415 111595 98520 88001 79503 65282
17469 65282 56963 53864 54773 59791 58132 62140 69409 68941 74754 79133 80258 81244 87300 83037 82516
17454 82516 75434 67510 63330 68195 61551 56348 59070 61647 58507 54580 61076 86070 129863 159007
17440 159007 173096 187540 213181 227952 229171 218558 207226 198278 192780 183265 173236 167152
17428 167152 163312 159108 151028 131424 117566 105466 95713 95810 99885 96806 91899 86725 81273 73911
17414 73911 76563 87812 99614 113800 131004 150081 166659 180409 189973 184395 178889 179428 182716
17401 182716 190188 210825 230312 247060 267347 282681 291813 285250 280756 267088 259929 260103 269354
17388 269354 278885 283898 280650 270450 271582 284497 307801 339892 371089 397537 432076 445330
17376 445330 441200 425700 406147 403623 412961 429452 460356 489707 512923 526072 544663 571933
17364 571933 623882 697407 739975 754945 800211 900026 1000056 1035353 1036156 1027376 1011059 984882
17352 984882 955744 933987 928263 954481 1007226 1092063 1219928 1411918 1677143 2029020 2493968
17341 2493968 3143807 4112427 5695778 8464876 13225656 20058099 27151780 31985387
17333 31985387 34513785 34938916 32018439 26063087 19183267 13292428 9170004 6613313
17325 6613313 5054059 4042747 3327281 2798554 2401879 2102094 1871180 1704376 1593792
17316 1593792 1526585 1496850 1511372 1557368 1617355 1696629 1799550 1915890 2018251 2077990 2103290
17305 2103290 2090827 2046248 1973359 1911944 1881759 1903317 1985805 2138515 2371309 2698419 3149970
17294 3149970 3758857 4572406 5706247 7348767 9909609 14210834 21672731 33468921
17286 33468921 47918212 60239519 68264651 72729942 71389190 62070887 48082000 34168741
17278 34168741 23442127 16417847 12180934 9626680 8004010 6875016 5990591 5278468
17270 5278468 4751932 4408545 4237846 4243060 4391231 4681047 5074707 5561771 6216717 7134607
17260 7134607 8533886 10893996 14547590 19075319 24543139 31658125 37736708 41116867
17252 41116867 44052722 44779693 42078497 39385788 38004517 38601577 40951563 45500934
17244 45500934 52425800 56582403 57162810 56620773 52293251 44459557 36286526 28253408
17236 28253408 21142562 15656433 11785878 9330278 7859354 6965917 6344925 5763827
17228 5763827 5145172 4547197 4035852 3656127 3398422 3237537 3122463 3013505 2918112 2801859
17218 2801859 2666729 2559035 2480917 2446949 2467942 2534952 2651419 2820650 3046300 3374637
17208 3374637 3888661 4698003 6007211 8208815 11910797 17391325 23048108 27558945
17200 27558945 32868064 38804850 40366918 37782342 34590138 31407489 27830944 25144609
17192 25144609 24273986 24409277 25087326 27335215 29954261 29305096 26467763 23397270 20026947
17183 20026947 16023407 12124577 8866912 6559901 5078838 4145685 3526654 3106881
17175 3106881 2833354 2622336 2421520 2245099 2100408 1984028 1897736 1836625 1803451 1804749
17165 1804749 1811933 1823260 1846445 1871330 1912675 1989442 2127758 2370995 2790561 3525993 4801953
17154 4801953 6870856 9468213 11617354 13729684 16605041 18661311 18138691 16757950
17146 16757950 15480063 14025471 12609107 11985237 12094808 12375837 13264998 14992959 15725635
17137 15725635 14572714 12992920 11400639 9407681 7190740 5201531 3689150 2702546
17129 2702546 2097368 1719901 1472934 1319844 1225393 1136763 1043834 963081 890938 834369
17119 834369 784466 736892 709461 695662 668050 631125 592879 546959 504605 464705 429564
17108 429564 399519 369844 337021 311270 276520 239435 207421 183232 156087 120946 99519
17097 99519 83619 74019 80173 77615 65998 53668 44667 39103 25771 25289 39979 51432 73449
17084 73449 98043 114761 120989 122630 129230 132775 124123 122787 119190 113137 112008 106232 105539 102224
17070 102224 87454 79304 78304 85018 85382 81189 69872 70249 59125 55450 60044 57893 58575 54503
17056 54503 50497 42062 34370 32423 19010 8705 2638 -3763 -17130 -28967 -30497 -30245 -30383 -18742
17042 -18742 -6759 6121 12206 17684 24728 24072 17799 17060 16994 20682 28606 35131 37206 45567 52871
17027 52871 58507 60390 56464 60048 54764 45326 40556 37061 33749 39394 48824 47938 45245 43238 38021
17012 38021 31082 32481 28820 28999 30247 25907 18174 19044 17890 19513 23350 21418 17503 11718 4891
16997 4891 2934 5060 4932 -6091 -3353 4988 1731 1751 4043 7541 8229 8078 7054 9709 12510 16771
16981 16771 18405 26349 30253 27467 23118 22927 20805 17809 17290 10521 9716 13976 19304 23384 27782
16966 27782 30863 31728 31507 31177 30592 34865 29863 27813 31010 36436 31915 28893 27509 22557 23120 25103
16950 25103 22831 18865 20285 23202 13428 14038 14176 11086 13595 12636 7619 7036 12382 18507 12041
16935 12041 5311 8676 7189 9651 19329 25632 23234 24156 26968 23802 17197 13904 17716 20152 17126
16920 17126 17066 21372 23880 22199 20803 22603 23879 27230 23547 16467 15092 16380 17061 16320 17118 14537
16904 14537 13692 11363 11213 15303 13367 10983 7348 3032 3595 3940 442 -4810 -3521 -2706 -5600 -7377
16888 -7377 -4471 -5205 -6869 -3390 3575 9689 12400 11141 9891 10369 7875 1365 -2778 4367 9069
16873 9069 9673 12468 9180 5614 4524 5525 3219 1826 4998 6063 -1747 -107 2482 11171 7799
16858 7799 1495 6751 8513 10481 11119 11442 13895 16230 16781 13592 17528 17993 9355 326 -1132 2468
16842 2468 -5651 -15129 -17045 -15737 -6869 978 4661 14269 13875 13502 18951 19956 17912 9077 -1945
16827 -1945 -3137 853 4073 3977 7785 12005 11650 14083 14932 20820 21886 20548 20991 27856 39142 49231
16811 49231 66905 114479 176733 248385 303612 337907 338230 299765 243232 180311 123344 89158
16799 89158 68854 51105 43884 39699 39860 37720 34960 26781 21259 21038 16929 12448 8505 8998 4630
16784 4630 -817 -2376 5127 14171 13147 10293 9838 11014 4723 -4575 -1276 -7102 -5920 -5491 -4344
16769 -4344 4245 12145 16493 13936 16362 32136 49775 70810 87476 111874 151138 206408 251297
16756 251297 270698 269025 238390 184936 131203 90122 73111 64141 60140 58104 66905 82944
16744 82944 104396 134696 175504 224828 258260 277793 291963 284853 265997 246607 220948 205616
16732 205616 207922 219011 244174 255459 261770 263185 244753 210089 167879 129855 100886 80639
16720 80639 62959 46119 32030 21773 19637 20578 15019 18819 19429 17261 13166 16872 14544 13714
16706 13714 20836 25202 27390 37550 44088 60259 79791 94835 109461 124078 143885 147967 135011
16693 135011 126485 118757 117477 119953 125180 132252 132914 141582 155090 145450 123982 104518 92928
16680 92928 81933 66568 44792 33168 27036 25962 22894 18271 12184 17638 20589 16108 10537
16667 10537 9359 16971 14245 8866 7216 7062 9265 10718 20003 23852 19944 18616 18318 23253 24887
16652 24887 41762 61329 71594 80002 88710 110178 127200 114068 102241 100178 97630 97521 94898
16639 94898 90343 97872 109851 112291 117465 125459 116386 106717 91931 75007 54617 42625 35018
16626 35018 29903 21434 19564 16206 20751 22420 18443 12178 5475 11678 11126 13899 12818 10447 9980
16611 9980 3677 -229 -7936 -8584 -9335 -9548 -5245 -5529 -3684 1997 4076 1659 4234 10641 9074 5719
16595 5719 4545 3518 -1561 -7461 -7140 -462 6309 4339 -2907 -5136 -2510 1340 979 3836 10870
16580 10870 11559 11417 5568 2300 5974 8807 14358 13235 6399 -1611 2396 3116 -3556 5529 10896
16565 10896 26892 24404 13108 12128 8923 8816 17391 25948 28551 22751 14029 7743 12814 21900
16551 21900 21122 22741 31132 39474 41972 45751 50516 64899 84490 111952 149769 201956 282282
16538 282282 421589 688145 1134480 1575813 1598203 1292814 911562 589995 383338 268217
16528 268217 207576 162366 128325 101047 74765 69212 61917 50778 46490 42178 37851 31041 22190
16515 22190 16428 22490 27914 27472 23343 24426 18536 12248 14471 19275 14352 15529 11385 14175 17515
16500 17515 18655 18792 15688 10313 7953 3970 4395 10019 10354 16391 21218 10739 1769 2216 3718
16485 3718 2851 15481 14710 6200 4707 1566 -11 -215 2678 1255 4642 12649 12528 11239 16902
16470 16902 23124 18325 12293 11429 14009 15508 22894 24917 20186 21542 33080 36012 17484 -1336
16456 -1336 -11872 -10463 -726 7246 12086 12061 12786 12781 11757 4732 1851 -2220 2977 3574 -1582 -5069
16440 -5069 -4154 -3868 -1266 1462 9170 12162 17319 25782 27633 15468 -3521 -18017 -30199 -33335
16426 -33335 -24122 -20084 -18519 -16531 -15163 -8164 -4023 -6857 -5155 844 -2727 -6090 -6461 -2469 2722
16411 2722 4837 5834 6453 5677 -334 -3114 -2696 934 -2117 5633 8803 6072 3307 -116 -778 -5485
16395 -5485 -498 6555 1085 -6970 -8263 -2400 1846 2919 -1080 -3224 -406 4176 10728 7741 -238
16380 -238 -1651 3203 13115 20258 18380 22757 20821 8884 -54 -4303 1183 2696 6789 17932
16366 17932 23076 19617 18109 13572 11101 14434 18956 18511 16585 15670 15638 23454 31450 33832 27530
16351 27530 19417 23225 17632 17954 20572 14777 9642 6537 4670 3956 7333 12358 11220 12527 13115
16336 13115 5902 -2273 -3406 -680 1751 -1820 -1968 7245 14832 16980 19742 15493 11352 11129 18687
16321 18687 20601 16041 12984 14719 16262 20725 24651 21317 21742 22366 17046 15456 17030 16168 15145
16306 15145 12009 17083 38502 63962 79287 87991 77655 59437 46160 29411 15185 13642
16294 13642 20226 27748 26610 24149 20703 26199 28641 24488 23453 19214 15370 9517 2165 -3067
16280 -3067 2285 9420 9257 12943 13092 14908 14147 9861 7715 11030 14883 15068 13757 10713 5447 4479
16264 4479 8252 7576 2525 1838 2034 -3324 5460 12838 15336 4036 -945 7096 10978 19474 40096
16249 40096 65549 69712 94159 121872 139089 130670 125995 153919 157879 137329 115719 78503
16237 78503 58687 45367 29913 27217 31146 34805 45299 65213 89562 101999 92413 74012
16225 74012 58206 41024 28671 20016 22547 21267 24274 29165 29076 27502 23943 20976 21506 19725
16211 19725 19849 13701 10145 15639 27766 34355 30492 21468 12042 15922 23047 23840 27053 22346 14421
16196 14421 14809 13915 14124 17076 22362 27622 34885 36883 30725 23302 9467 5410 9415 28920 37397
16181 37397 24757 22158 11952 -11062 -20977 -21972 -14133 -1786 533 3961 12725 17822 20264 10135
16167 10135 -4708 -9282 -9186 -14405 -27006 -41024 -52609 -54343 -53368 -63713 -79312 -95706 -107750
16154 -107750 -117602 -121192 -127728 -145677 -155920 -109779 48538 329685 539663 609016 574423
16143 574423 491494 414138 355097 331790 317722 302713 277054 235681 200593 179790 168511
16132 168511 160452 151387 134849 119998 118226 127885 133115 131971 127393 143410 157491 162863 164119
16119 164119 185863 210615 257617 243102 188469 156087 154492 143587 137141 143236 138098 131243
16107 131243 126649 125165 116314 118767 127305 131911 127866 118717 115805 116148 121700 127088 130545 142618
16093 142618 159452 165436 173901 172084 165637 164424 159195 150474 145289 143431 136037 136386 133562 137163
16079 137163 146581 151063 155998 158541 153057 149562 155708 175923 185005 185107 182356 178549 177821 184343
16065 184343 189031 187634 197502 224173 246374 260611 272556 282151 286323 290540 279984 257691 249618
16052 249618 256967 279233 301972 319985 324044 324088 335105 357469 383695 390933 388421 404717 418815
16039 418815 441949 467646 496443 544743 602413 662620 738761 878773 1166061 1630074 1975502
16028 1975502 1912008 1685498 1446740 1289410 1200627 1140858 1108412 1120448 1178129 1261795 1354728
16017 1354728 1463258 1560709 1662156 1764746 1907794 2133931 2419721 2745344 3060554 3420507
16007 3420507 3878416 4447391 5191723 6129553 7289708 8812041 10932412 14029268 18561618
15998 18561618 24486322 31876344 43452029 64621837 105878013 181534053 278932772
15991 278932772 309426860 263535052 192361716 124127146 79144179 53965970 39954969
15984 39954969 30748642 24110576 19162713 15495565 12799889 10783462 9241967 8030999
15976 8030999 7073273 6284016 5625042 5065033 4607477 4270014 4001201 3709417 3408729
15967 3408729 3116638 2854151 2636292 2470419 2353829 2237170 2095279 1925703 1755560
15958 1755560 1607742 1489193 1374298 1283708 1221179 1148509 1052583 973582 888603 797173 724742
15947 724742 685526 637382 591306 556709 527189 509090 485516 457389 430022 412776 399493
15936 399493 377546 357038 332946 312849 309904 311265 315190 304893 276941 249575 225719 206081
15924 206081 192120 176517 165950 171487 188678 201061 196293 186706 176349 168542 157743 143281
15912 143281 144029 145428 152494 160781 165376 160823 146696 138064 132322 127966 120904 120144 116904 114406
15898 114406 112720 106092 93772 78590 73176 62321 53819 55293 58437 58644 60170 64787 78417
15885 78417 84710 88817 92394 85849 75091 66532 69446 73688 66450 60097 53000 46000 45627 45940 38545
15870 38545 33427 34460 29613 5370 -27338 -37209 -49660 -48698 -28668 -6749 13731 30526 28002
15857 28002 25143 24074 19434 18400 8460 -8068 -14656 -21101 -36219 -45082 -65937 -102029 -144340
15844 -144340 -176739 -192889 -201565 -227706 -284597 -368711 -480455 -572281 -487563 -222028 10492
15833 10492 153798 204478 212837 202212 191559 181499 175262 181374 177371 166361 155516 143017
15821 143017 133399 126454 115711 106764 95832 85680 78504 69434 67812 63805 67226 72098 65613
15808 65613 69680 82180 86392 90774 92217 52930 16351 30803 36975 34903 48971 70546 71071
15795 71071 50570 35748 27426 23855 31051 33281 34139 37185 29602 27110 31154 34270 39845 41204
15781 41204 33584 34140 39304 31633 24793 28376 35271 38098 41402 44975 37851 29572 19645 17596 23739
15766 23739 29942 26572 22629 27153 26627 28526 31804 32251 32592 31640 27984 26846 32279 33103 32477 34161
15750 34161 35846 33850 31543 25427 18848 14702 7027 9586 5983 13009 26153 18246 10747 6828
15736 6828 18836 27845 33676 28530 26680 30728 37303 38467 30472 21666 23870 24030 24250 29601 24949
15721 24949 21291 21035 20566 18608 18181 21883 19478 23782 23529 22616 23990 25970 16047 19001 24655 20415
15705 20415 20632 20260 19439 14883 18378 23033 23139 30670 26728 16974 19206 18316 17275 14986 10169 11787
15689 11787 4953 2168 -3993 -653 -2968 -19876 -33943 -46541 -55195 -49091 -34543 -15137 3099
15676 3099 9015 15874 19195 20757 11000 1876 -3429 -4383 4226 5093 7263 11000 15152 6665 1237
15661 1237 9182 4507 2402 1092 -3544 -1120 3128 154 -4845 -7491 -140 6323 8348 13307 6847
15646 6847 3782 4923 4007 3406 1602 8093 21439 19837 11090 865 630 -2083 2231 -6322 -6376
15631 -6376 1629 -6115 -15530 -18357 -15804 -13794 -10798 -11143 -9963 4946 12198 12696 2769 -299 10951
15616 10951 19699 19388 20387 20725 21942 18663 17747 15334 8901 2320 -2174 -3562 -15 7632 10830
15601 10830 3554 -3700 -6395 -1366 5085 6001 3524 14620 23651 15201 9069 7071 1765 1909 3194
15586 3194 12388 16962 12536 5146 -12 2549 81 -1856 3324 7440 10118 13438 11815 8391 5606
15571 5606 6226 9180 4764 4763 6937 8142 6800 7949 13657 19725 23409 20679 30218 35533 32163 28716
15555 28716 24908 23748 21626 10758 2335 -8387 -15574 -16714 -12853 -4205 2998 11958 10632 2708
15541 2708 6427 14395 8852 3406 8118 8053 334 -13268 -12588 -10221 -13152 -11284 -13271 -9083 6842
15526 6842 6280 991 -15849 -29556 -35190 -36630 -30790 -21198 -11429 -6562 -7135 -15180 -18892 -16276 -14883
15511 -14883 -11203 -6705 -3081 -3328 -2202 1475 -1380 -3884 -4846 -2176 -894 9559 15304 12391 11557
15496 11557 5547 9041 8156 1542 3138 -3286 -5636 -6721 -6142 -864 6709 10779 5239 3501 9042
15481 9042 9346 11074 12819 9842 5882 673 302 -1662 2942 5456 1482 -998 -55 -2978 -3087 4679
15465 4679 10414 15122 18953 20010 25017 28671 25193 22172 27454 31657 33816 31582 31495 38469 41939
15450 41939 49607 58048 69585 93380 131824 177998 247387 352267 554301 931308 1433779
15439 1433779 1639739 1425236 1056490 697124 448950 306936 227397 176642 145033 118497
15429 118497 86670 67689 58645 50884 46716 43975 34830 21433 15274 17273 20432 15789 17352
15416 17352 20711 24474 23115 20183 19506 8297 8740 4439 -6080 -22 10648 10043 2471 4920
15402 4920 1523 -1951 5038 2993 -5257 -2968 3835 3269 8132 7235 4545 9672 14233 10358 9025
15387 9025 8015 7375 2773 1830 -5797 -9240 -7415 -1044 -231 4635 4847 1543 5214 4402 6495 2474
15371 2474 -1492 -651 -7584 -9543 -5992 -1256 -1923 -4743 -5454 -1504 2280 15603 20774 14839 11277
15356 11277 10863 5035 -2236 -673 -2246 -2822 -6630 -18066 -15416 -3951 566 -369 1398 1030 -3834
15341 -3834 -8008 -6452 -5231 -2016 -3743 -3007 -4124 -6304 -8051 85 3303 -802 -9831 -10476 -849
15326 -849 1955 6826 6671 2888 9646 13960 12615 2325 -149 3878 5580 7741 183 -3600 -1241
15311 -1241 -10951 -11436 42 8002 15208 16393 16790 12721 5840 3396 787 -2058 -9225 -11176 -16186
15296 -16186 -14639 -19655 -13036 -11847 -12877 -14793 -14807 -15968 -17549 -17235 -19369 -15130 -11509 -6282 -3785
15281 -3785 803 5369 7722 6774 9501 3454 54 1503 4751 406 3501 2002 420 -205 -7560
15266 -7560 -4773 2468 4932 2732 6943 12130 11683 9347 9229 1182 -2886 -6255 -5965 -1863 6173
15251 6173 5062 -269 -484 -3225 -10260 -10329 -16655 -13495 -8909 -7602 -8347 -723 -76 -1409 -5237 -3595
15235 -3595 -2890 405 -2699 -3199 -5256 -4088 -7807 -13664 -11615 -14780 -12622 -11551 -5123 -3511 -123
15220 -123 8171 9137 3239 7248 7536 3060 6683 4074 3571 5769 -5351 -17819 -19884 -15136 -6828
15205 -6828 -2431 -3206 -1919 2878 3198 2811 6179 3210 -2559 -1312 -20 -5225 -9557 -8376 -10816
15190 -10816 -9020 -3653 -5209 -6864 -7330 -7179 -5411 134 8142 5757 5400 9413 2305 -3086 -3121 1211
15174 1211 6950 926 -4464 -2505 -1752 2252 5617 3131 -2490 -7233 -7691 -337 -817 -2190 3317
15159 3317 6878 8378 8177 9349 17482 20094 19327 17214 11948 5438 1228 -628 4591 3880 2806
15144 2806 1924 -2975 -4742 -5985 -6577 -11473 -7230 -9 -5919 -8067 -10924 -8884 -10595 -7929 -11333
15129 -11333 -16567 -19593 -19893 -12992 -9691 -7289 -6680 -2003 3707 4891 6278 644 317 -2709 -4116
15114 -4116 -777 -3007 -6393 -6178 -3641 -1328 -3914 -6540 10 -4031 -6436 -7581 -7198 -5957 -549
15099 -549 -1211 -1626 -6024 -8823 -8510 -7962 -8009 -3685 -324 25 2566 -6875 -4493 -1597 -8114 -11793 -6083
15082 -6083 -1972 -1287 -465 -639 -13385 -25023 -16940 -16891 -18846 -11162 -6903 -3149 -2079 -755 -188 -2978
15066 -2978 -2199 -839 -5707 -6353 -6451 -7576 -9323 -8701 -2823 -10044 -12836 -11661 -9205 408 -3156 -3632
15050 -3632 -2800 -4521 -2390 -903 -1393 -8131 -13883 -11288 -7058 1816 387 -4559 -889 959 -7965
15035 -7965 -7549 402 2330 -867 -3362 963 -451 -2601 3140 -3819 -4623 -3291 -3384 -8025 -6891 -1414
15019 -1414 2689 31 -3403 -5242 -5184 185 -3698 -6213 -5940 -5544 4701 7704 2192 -2652 -5618
15004 -5618 -9704 -3891 -8682 -7735 -4865 -3748 -337 3026 8984 15849 9389 4344 -5943 -8507 -12910
14989 -12910 -13292 -12005 -5803 -8692 -8607 -8494 -9186 -11365 -7681 -13349 -17085 -7096 -3240 -7418 -11444 -10709
14973 -10709 -8248 -4330 5972 7903 8852 13422 10426 6785 3100 6164 8591 6869 5961 8026 7801
14958 7801 -1117 -475 1783 -2652 -4892 -11439 -15099 -8047 -10854 -8100 20 -421 791 -2818 -5877
14943 -5877 -7510 -2446 -4740 -10499 -5892 -9657 -10849 -4825 -3908 -2454 -564 -6394 -8032 -6747 -4243
14928 -4243 -4069 -6836 -11417 -12301 -11143 560 2922 -4124 -8169 -12581 -10728 -4369 -4158 -9275 -8575
14913 -8575 -4475 -169 4832 3330 -1293 -4893 -3919 -5262 -6602 -4740 -6594 -12368 -13401 -11573 -6555
14898 -6555 -2649 -362 -4664 -8671 -8325 -6966 -5396 4518 4625 -4870 -7895 -1661 -284 4595 13069
14883 13069 20592 21277 20570 13615 4253 -4826 -9531 -6828 -4339 -1245 910 2001 2586 3170 -366
14868 -366 -4042 -4007 -1126 -4290 -8071 -2009 2626 4572 -6885 -11862 -3000 -2825 -7415 -10575 -6074
14853 -6074 -5493 -14425 -12364 -8583 -6682 -8882 -11987 -11101 -4712 -955 -4730 -7094 -11446 -9764 -10345
14838 -10345 -7216 -3935 -5750 -1676 -2618 746 11561 13841 7124 -5937 -15250 -14508 -11058 -10788 -11143
14823 -11143 -4668 -4527 1377 1633 856 1749 -6898 -14407 -10593 -8783 -6127 -4423 -8554 -9794 -8787
14808 -8787 -3630 -3211 1559 973 -2109 -4183 -3450 -8253 -5696 1115 -1250 -3097 -8632 -11089 -11920 -11025
14792 -11025 -7488 -11348 -16725 -11465 1423 6375 5931 8786 3936 -5334 -12590 -10658 -4829 -10010
14778 -10010 -17163 -14236 -13301 -10142 -13104 -19257 -15135 -19253 -22526 -16009 -15449 -12777 -9708 -9438 -7147
14763 -7147 -4232 -3525 2463 3402 198 -2131 3216 2439 -5289 -9205 -7503 -8069 -5761 -484 5125 2197
14747 2197 -6509 -17337 -19431 -8216 459 4989 12 116 8613 4818 -6433 -13768 -12553 -12341
14733 -12341 -10727 -5607 -242 4402 3504 3537 1361 -903 3055 2632 2882 -695 -1271 1570 -5048 -4259
14717 -4259 -344 -2009 -3146 -3029 251 -3105 -6463 -8218 -9695 -10689 -4897 -7704 -11689 -8199 -10742
14702 -10742 -6357 -5155 1718 10523 14164 10857 4273 -7914 -9124 -10318 -14538 -18701 -18947 -16211
14688 -16211 -5768 -5653 -5793 -3121 -10449 -9862 -6729 -4101 -7606 -9275 -11944 -4937 -2311 -3718 326
14673 326 -307 3658 6102 2978 4273 6345 7038 7398 6157 4035 4518 2524 250 -4368 -10240 -9674
14657 -9674 -8040 -5491 -7531 -6534 -862 5351 2176 3930 2544 1055 -4658 -8968 -13635 -16078 -9303
14642 -9303 -4038 -5483 -2956 1110 -1505 830 1155 -4301 -9351 285 6075 171 -3330 -6206 -9131
14627 -9131 -9151 -12436 -14412 -5153 2156 -1563 -5349 -4652 -3555 724 1054 -5623 -6370 1357 2537 -3479
14611 -3479 -7805 -12671 -14791 -18998 -19604 -15135 -3538 -1198 -14037 -17909 -19039 -20657 -10618 2383
14597 2383 6825 6282 3045 919 -3511 -400 3515 7960 1743 -4516 -1533 -451 27 502 -2174
14582 -2174 864 4936 14507 26184 41528 58797 69811 65573 62473 47510 39303 26779 17217
14569 17217 9403 1218 1727 -4040 -2700 -26 -1451 -5808 -11272 -11381 -8092 -4741 -48 2535 4423
14554 4423 -1229 -1485 -4166 -1484 -1842 -5548 -7175 -5628 -1314 -1407 -298 1470 5002 -595 -9060 -14457
14538 -14457 -20887 -15994 -4376 -5336 -6151 -4646 -4268 -5360 -11467 -11205 -8869 -13360 -15490 -11139 691
14523 691 5660 2190 -7635 -11687 -7584 -5526 -1577 3473 2647 -376 -2747 -2441 -2288 -2861 -7276 -8281
14507 -8281 -5597 -3964 -2861 313 -26 -856 -799 -6048 -10559 -11387 -11468 -9505 -11107 -13166 -14212 -12092
14491 -12092 -7979 -7119 -5543 -2033 -4090 -1036 -4683 -11981 -9420 -5173 -6301 -6330 -9476 -7195 -1892
14476 -1892 -3213 -3439 -5198 -5272 -3923 285 -1577 -4950 -9039 -14557 -22476 -17140 -13788 -15080 -17087
14461 -17087 -12781 -10556 -6766 -3163 -4622 -6254 -8655 -12303 -9739 -10138 -9950 -9594 -702 1248 -4409
14446 -4409 -4597 -2643 -9202 -9221 -11922 -11775 -11203 -6292 -8525 -12405 -8244 -5560 -9053 -5309 -9197 -11601
14430 -11601 -13857 -12616 -5593 -2197 3466 1557 -2900 -3269 -5094 -7438 -21891 -24040 -19411 -17892
14416 -17892 -16685 -9503 489 -1189 -8019 -7209 -17386 -16043 -8267 -5598 -7483 -8381 -1960 45 -5303
14401 -5303 -6705 -5298 -6576 -9410 -5276 -185 -1683 -233 -3294 -3631 -3749 -6057 -5824 -4432 2480
14386 2480 -3608 -10515 -6165 -1537 960 -3470 -790 1806 2220 6188 4912 -484 122 2585 6313
14371 6313 4345 -1380 -505 -4896 -4618 -3915 -3820 -9151 -13838 -8046 -4293 -1663 -1147 -735 2360 399
14355 399 -388 6838 5375 5069 3326 443 3192 10255 9245 6589 9694 10836 1911 -5778 817
14340 817 6699 5816 -6142 -4584 6128 7996 1398 -2683 -1381 2933 2652 -5521 -6708 920 -3656
14325 -3656 -8926 -11068 -3117 -625 100 -2010 489 2913 -6337 -7672 -4846 -4272 -5746 -11762 -13782
14310 -13782 -17286 -14789 -14053 -13983 -15829 -12051 -11314 -13874 -14087 -6325 -6701 -14278 -19619 -23431 -19687 -11772
14294 -11772 -10269 -11250 -11030 -10228 -11266 -12947 -8291 -4774 -5154 -4629 -3180 -8563 -19467 -17591 -9291
14279 -9291 -7764 -8253 -11094 -9565 -4902 -3586 -5403 -6298 -9262 -3976 -332 -4574 -7020 -3152 -5254
14264 -5254 -12244 -11061 -8379 -8862 -10991 -4772 -2065 631 1601 -1866 -212 -722 -8126 -5924 -7973
14249 -7973 -8063 -5239 -7423 -5652 -3159 -393 -694 -6259 -9157 -9584 -681 5171 -807 -4200 -3360 -2744
14233 -2744 -4962 -6501 -7183 -4378 445 2932 1139 3836 3929 833 -3461 -7290 -15745 -13554 -10575
14218 -10575 -14029 -1049 10041 13611 14041 7989 14075 9757 6823 10581 11933 9503 10463 8362
14204 8362 5253 3092 -1634 -13411 -16874 -18232 -18271 -14607 -8491 -6472 -9835 -14033 -12893 -10934 -11902
14189 -11902 -11783 -12916 -16707 -9809 -6985 -10587 -7562 -6611 -4114 -1347 1680 597 3597 5870 7378
14174 7378 2672 -4627 -4738 -6074 -11105 -8096 -3159 -5702 -5690 -215 -5263 -9809 -15932 -13921 -7565
14159 -7565 -10883 -2388 6528 1614 -2847 -48 265 2138 5440 -1624 -8613 -5199 3611 394 -2928
14144 -2928 -12205 -12761 -1326 5889 2995 -198 4065 3469 2734 -2673 -8023 -3186 -1656 -6102 -5538
14129 -5538 -2990 -5973 -3848 568 -2909 -13053 -12871 -12618 -20708 -22163 -12673 -4329 3036 1656 -1900
14114 -1900 -5074 -9939 -7396 -3195 -1859 795 486 -3938 -1820 3577 9087 9298 4292 4168 4222 8601
14098 8601 7902 9892 2187 -1702 3933 2958 7302 4927 -270 4927 10543 9114 2520 3452 8071
14083 8071 9084 8734 2790 2102 6309 929 -1022 -3893 -4648 -7232 -6675 -3203 1143 -3014 -8857 -3309
14067 -3309 1670 2478 -5451 -6570 -3926 -8440 -4906 -5477 -7263 -5984 -7401 -8148 -4983 -8492 -8318 -5579
14051 -5579 -9448 -15498 -16612 -18935 -13520 -9627 -5135 -9316 -15254 -10016 4455 1304 -8203 -8885 -8182
14036 -8182 -5329 2518 -2722 -14079 -21376 -14419 -10091 -6092 -4399 1241 -1515 -3812 -4323 -1957 3355
14021 3355 2867 -265 -2479 1714 4515 2301 -2627 -6034 -8886 -7585 -4001 -1271 -2192 -5777 -4763
14006 -4763 -4836 -5952 818 4099 1075 -2804 -407 -3770 -8287 -7147 -933 -5562 -4915 -7514 -13549
13991 -13549 -7279 -3716 403 -3812 -8608 -5605 -933 -6651 -7471 -9348 -10073 -4146 -221 976 6172
13976 6172 5635 -444 -3490 -2185 -385 -3648 -5828 -8329 -13794 -10577 -9720 -9596 -7417 -2523 -3642
13961 -3642 -1146 5344 6533 3111 7102 7393 -138 -8785 -12075 -9951 -6526 -8039 -3252 -4145 -13497
13946 -13497 -20070 -15760 -11069 -14346 -11770 -4624 -2846 -3371 381 -2309 -5033 -6559 -5300 -10945 -14398
13931 -14398 -9970 -7298 332 -10110 -10004 -2242 -2101 -1371 -6540 -5922 -4887 -8009 -9809 -13105 -17128
13916 -17128 -19615 -21586 -15565 -8078 -5380 -10029 -16562 -15117 -9809 -5532 -9149 -7145 -2289 894
13902 894 1483 92 3203 9955 1395 -350 -2202 -8734 -11778 -6036 -10733 -8199 -5232 -3644 1166
13887 1166 -1617 1590 342 -4379 -8532 -6749 -5688 -4275 -167 5918 3680 3990 14760 14485 3108
13872 3108 -145 10206 21864 29926 36580 58655 77445 100866 130204 158195 186778 217687
13860 217687 245305 261165 256808 244818 226549 207299 181866 151164 130867 114095 99459 81494
13848 81494 65624 54195 52090 60926 64763 63519 55247 53287 47718 47644 52158 53308 57713 53822
13834 53822 55698 60733 70350 85443 98446 117534 139357 166787 192063 218919 238507 256353
13822 256353 259239 251384 230696 206483 180034 159746 128069 98044 76666 65289 50960 36557
13810 36557 32221 20300 17145 20181 18263 17387 16452 7980 3791 9538 10006 11465 13774 5919 -3543
13795 -3543 -5529 -7328 -2171 6485 6642 -5451 -12922 -10827 -11417 -7724 1680 2172 -798 -2051 -892
13780 -892 4156 3352 4602 2755 718 -750 -4615 -9419 -11197 -8644 -11257 -10169 -4437 -1579 -2299
13765 -2299 -8872 -11855 -8761 -10167 -12129 -8208 243 -1542 -5910 -2777 192 3453 2429 1083 672
13750 672 -6323 -6637 -509 2703 4234 -5345 -5302 -4733 -3896 -7918 -10535 -3079 4792 5138 -435 108 3225
13733 3225 71 -2034 2025 1457 -1051 -1448 -5602 -2932 -7031 -6890 -6344 -8628 -7277 -7380 -9949 -13401
13717 -13401 -9319 -5042 -7378 -4935 -3523 -9033 -11082 -9522 919 484 -7132 -5909 -3264 -4827
13703 -4827 -4101 -6896 -10827 -7061 166 -2892 -3244 -1903 -2546 -2054 -3457 -6412 -3601 -1157 -8229 -14223
13687 -14223 -21266 -24695 -21638 -18292 -17106 -21709 -26882 -22776 -26184 -22364 -23661 -22714 -23278 -19415 -10609
13672 -10609 -4856 -1453 -8289 -13378 -9850 -13992 -9471 -3242 -375 3191 -605 -7414 -16391 -15850 -12450
13657 -12450 -12576 -10923 -11323 -12853 -8994 -3150 -5033 -5668 -5950 -858 -979 2527 2333 -8322 -13102 -5085
13641 -5085 1912 -2638 -7644 -10904 -4559 -2831 -460 1851 -4911 -8164 -6675 3221 10818 8339 -2147
13626 -2147 -8520 -5906 -6750 -3346 248 -783 -1715 -1669 127 -839 134 -270 -2443 -9296 -14221 -7334
13610 -7334 2032 3688 2356 4385 6824 11813 18819 14840 12403 18323 24108 23479 15638 10045 6710
13595 6710 968 -4155 -6498 -677 -981 -3890 -1442 -2979 -4803 -349 6575 -895 -6561 -489 10461
13580 10461 5239 3027 -1453 -10696 -4747 5099 5988 6862 7956 11140 14005 12905 11737 6700 2349
13565 2349 3343 1529 1550 -571 -5921 -5186 -4592 -2137 -4798 -10501 -9957 -7392 -9509 -11237 -6947 -7842
13549 -7842 -9943 -9396 -6417 -13775 -15622 -12068 -4829 -2651 1394 11265 16954 16430 4407 -794 -1088
13534 -1088 -3403 1996 4631 5574 2957 -7029 -13811 -16117 -10419 -6213 -7076 -10743 -8015 -9477 -15141
13519 -15141 -12435 -3910 -860 119 -904 -10417 -10846 -7273 -9226 -7556 5303 4851 -3418 -7869 -717
13504 -717 -8842 -10583 -7738 -6935 -6167 -3700 1645 6383 7010 -1469 -3317 2414 1950 147 -1840 -7591
13488 -7591 -13596 -12429 -7356 1940 -2641 -3677 -1401 -9229 -13886 -15427 -11068 -6843 -7709 -12043 -7811
13473 -7811 -9857 -10008 -5376 -4492 -3362 -1530 -215 4307 12480 11215 8116 11188 17583 13848 12189
13458 12189 10531 10937 4103 1818 -1657 -3598 -9332 -11007 -14645 -10598 -12205 -15525 -13213 -8770 -854
13443 -854 -4350 -4949 -51 1695 -6470 -15647 -16671 -17988 -14141 -17533 -11559 -9912 -7105 -9640 -4000
13428 -4000 -4010 -10201 -12238 -9817 -6305 490 3103 -3117 -9775 -7315 -136 -579 -2758 875 5608
13413 5608 3448 -1446 -3111 -5379 -3262 3814 -4048 -9536 -11322 -2732 -3823 -1194 3152 5463 1043
13398 1043 -2350 -7267 -7079 -7351 -4185 -5278 -4513 217 5123 4633 3560 -2605 -586 3226 -829 -1696
13382 -1696 -7821 -3973 -8285 -8326 -8346 -10849 -9588 -6723 -9111 -8336 -6919 -10075 -2195 -400 -1698 -3664
13366 -3664 1083 1340 -10746 -16985 -14453 -10546 -3465 4489 -770 -2565 1453 1841 273 -1927 -645
13351 -645 -3048 -9440 -6020 -4921 -3210 2416 -50 -8017 -10472 -4346 -1065 1543 -2381 -7698 -7339
13336 -7339 -4254 1467 -2524 -5694 -8169 -5704 -6252 -8131 -5288 -129 2610 -1097 -3182 -10385 -13135
13321 -13135 -8956 -7362 -9690 -12410 -11354 -7665 -3196 -4670 -9195 -7637 -14575 -16020 -10137 -3766
13307 -3766 -4746 -4216 -359 -440 -1536 2508 3792 -7773 -9977 -4098 727 306 2202 2660 1204 1896
13291 1896 -1172 -3981 -1032 -7039 -4328 -1068 -2739 -4681 -4921 -5171 -6910 -2243 1463 351 4715
13276 4715 1266 790 5596 4212 1841 848 2137 -1212 -5917 -5055 -4645 -1594 -6128 -6741 -8004 -10290
13260 -10290 -9217 -7543 -4788 -6963 -7058 2414 5179 -4167 -8844 -745 3576 -3116 -16790 -10968 -7524
13245 -7524 -7224 452 -4585 -11406 -10469 -9976 -7537 -13955 -12806 -15680 -14562 -17791 -21723 -11945 47
13230 47 -2583 -4966 -6710 -2557 3740 -1427 -6049 -4775 -4610 -11750 -10072 -11040 -10705 -7163 -13480 -16861
13214 -16861 -7876 -3082 -9802 -16222 -15036 -13609 -10770 -2765 -1185 -1680 -8375 -8673 -4590 -1212 -844
13199 -844 -3141 -5341 -5428 -6427 -13523 -12709 -2613 -1946 -4143 -2597 -1177 -933 5265 14002 14104 8857
13183 8857 9657 8558 7705 4869 8501 6000 2313 -1436 -573 3633 4889 4322 5431 2764 -5373 -12198
13167 -12198 -9644 -3119 1585 1747 3746 4099 8542 10530 6038 8607 14250 16799 14792 9931 8192
13152 8192 14805 21310 17285 5544 2524 5705 15339 11875 4808 3444 1182 5265 10274 18691
13138 18691 25857 31892 44110 57050 67356 86164 91527 89904 89059 79036 64962 60447 57459
13125 57459 50248 45340 40088 38154 31356 26651 26876 25119 27202 35199 29360 22244 27496 32873 32632
13110 32632 35547 40643 44587 44725 43320 48213 52638 56531 59376 80464 92911 104466 122012 141567
13096 141567 156659 177927 198436 221859 238897 237684 220795 200924 180673 169884 151473 137484
13084 137484 120939 107741 97516 85434 74738 70024 67788 61981 51112 43471 32157 31731 42629
13071 42629 44333 48148 44562 51676 59077 63379 69122 75679 77059 79362 89420 107311 123456 148665
13057 148665 171998 196245 224015 243306 245578 235743 225002 209356 189839 165476 150119 128503
13045 128503 107933 94054 89645 74264 61871 61550 56414 47255 40238 31330 20757 20468 26634
13032 26634 36982 44121 41770 38880 35732 29602 27488 24427 30471 40646 44416 45142 48913 48972 58977
13017 58977 71805 83206 86605 91511 93336 86269 85991 87147 74307 54225 40629 33966 27474
13004 27474 20373 23429 20010 13944 15126 10820 16564 18547 16487 18434 14626 14384 11193 6670 13024
12989 13024 14779 14284 15626 15077 11172 1487 3953 6354 11139 8043 1895 3504 4911 12214 9783
12974 9783 2870 10727 15180 17517 14327 11983 11585 10046 15940 15500 10381 8886 14781 12315 10717
12959 10717 16051 18457 12736 10367 10292 11070 8568 11113 14043 18304 26851 26341 18129 14002 7011
12944 7011 9325 15328 13062 12617 21689 22223 16719 17008 20690 24037 26572 17279 12656 17933 15163
12929 15163 14484 15336 17260 19909 18801 21637 21001 24584 22364 13820 10547 9336 11770 19811 14842
12914 14842 13256 15419 17716 13869 11582 16295 20884 15899 7176 11497 20638 27865 27719 25137 25376
12899 25376 29069 25719 21450 23675 23871 20988 19607 15597 15222 15854 13940 13806 16567 18130 18388 19066
12883 19066 13202 7394 6328 -5416 -538 2812 -1004 3177 3513 4653 3154 2813 1305 3753 165
12868 165 8697 13872 15651 15624 16976 20524 28576 32371 23796 19947 22769 18580 18312 16527 16876 19805
12852 19805 19765 9905 3814 2235 7334 10737 10647 6290 4730 3919 1432 10456 17803 19710 19379 22020
12836 22020 26754 24457 25530 26350 32312 28660 31355 34367 34302 23112 26185 21210 21639 31516 31194
12821 31194 31417 29444 21852 22889 18998 14230 12453 15142 13155 9738 11315 9131 10170 14238 17425
12806 17425 17175 15645 10745 14586 28893 43917 47481 63002 72724 86313 97395 106234 112695
12793 112695 111665 109466 109643 104787 99303 95011 86363 78476 71331 77160 72863 58917 59576 65252
12779 65252 73272 73998 73343 73255 74058 75886 79112 84141 79933 68880 59653 54643 59511 72142 79396
12764 79396 82586 88012 95966 110328 126957 144275 149780 167954 184123 184895 193355 196539 192156
12751 192156 185420 178945 169717 158495 148722 145887 143845 142964 142102 139200 139968 145084 145524 142735 142812
12736 142812 149533 154162 160562 174726 183389 191894 193065 194340 196904 196548 197958 201507 208469 222177
12722 222177 234996 247610 260981 270022 278873 301407 316026 336151 355335 364093 377280 395554
12710 395554 421546 449909 474297 505497 542444 584878 632057 697037 773678 859866 960615
12699 960615 1077361 1213611 1381486 1575642 1805730 2091789 2441039 2884658 3450839 4197562
12689 4197562 5169297 6421873 8016233 9948959 12101571 14168422 15731582 16419380
12681 16419380 16117633 15033841 13501700 11870090 10352912 9058178 7992352 7134079
12673 7134079 6460304 5937634 5526105 5211035 4972434 4806204 4699465 4639342 4632171 4678785
12663 4678785 4791780 4954355 5179667 5476272 5850554 6320444 6899295 7608045 8487249
12654 8487249 9579793 10941195 12658279 14817174 17503615 20752834 24486771 28490647
12646 28490647 32468265 36172511 39484997 42200571 43846593 43821020 41856311 38298905
12638 38298905 33889883 29378669 25272817 21801926 18981816 16712412 14897294 13444892
12630 13444892 12291244 11381084 10654525 10081125 9632730 9311712 9101662 8982807 8964905
12621 8964905 9045923 9235421 9533682 9941707 10478844 11180848 12096044 13261818 14749883
12612 14749883 16652730 19065483 22094481 25823420 30241814 35091723 39777843 43467560
12604 43467560 45454277 45548739 44082526 41539592 38254713 34431753 30326981 26258088
12596 26258088 22496834 19234869 16515446 14300208 12520380 11070962 9888888 8927620
12588 8927620 8145781 7500081 6968670 6535963 6185630 5907044 5695363 5552533 5474425 5447183
12578 5447183 5477802 5560096 5719156 5966850 6301873 6751299 7348332 8131403 9140802 10417903
12568 10417903 11986011 13821684 15768998 17517979 18623994 18718206 17707953 15854474
12560 15854474 13592643 11320116 9292437 7610538 6268614 5215994 4398832 3741192
12552 3741192 3215922 2787364 2435382 2147609 1905536 1699281 1517154 1373474 1247731
12543 1247731 1133688 1031960 936478 868716 806850 746771 697611 648916 601509 558850 516432
12532 516432 487624 461672 432660 400156 373447 359812 358049 338066 318981 299794 280155 260363
12520 260363 250259 243457 228748 214244 204574 202297 197263 187391 178404 174313 170440 158149 144846
12507 144846 131319 128378 132893 136854 131114 127010 120589 112678 100224 88608 73941 64082 59895
12494 59895 51394 49832 44407 42989 46541 47811 46635 46068 45942 58852 72519 77730 89750 93348
12480 93348 93139 92235 86111 93117 97344 102513 106103 103926 95592 98895 91692 85512 87237 85966 77922
12465 77922 75245 76532 70835 66364 62866 62509 58446 49981 47195 44255 25260 14454 13235 13650
12451 13650 12256 12049 18216 32032 46336 55292 64174 81733 98006 108303 117057 122303 120728
12438 120728 117287 107926 98619 101480 112342 121543 127551 127432 127579 131066 127091 127394 129937 131846 134574
12423 134574 139400 137518 126774 116493 105810 97342 96468 95799 89117 83778 82467 74637 69472 67074
12409 67074 65600 68337 73740 79545 84323 90467 89876 79829 75425 75803 85467 86094 82877 89523 89107
12394 89107 82303 83329 84360 78162 68067 65590 71368 69489 75292 72952 72346 70520 68038 68969 74551
12379 74551 75254 73132 69514 61681 56663 52846 57234 60600 61671 61467 53295 53332 54213 47955 48231 47853
12363 47853 44315 41280 34086 33792 39526 44493 48978 53748 57835 56018 47986 43346 36120 33613 34604
12348 34604 35849 42632 49529 44260 42273 41156 35143 31810 32687 32194 32207 31084 28236 28872 29765 27672
12332 27672 24572 17572 17006 19261 21139 21248 29381 29235 29739 29107 14529 14242 24035 33861 30058 27450
12316 27450 29313 29606 33815 35656 35913 32129 29329 30883 34661 29724 23691 20762 20502 22322 24062
12301 24062 24463 22857 26062 25466 25948 22148 28019 31229 25605 22704 19164 19352 16270 10434 11912
12286 11912 18794 19557 20245 23267 27659 25572 22986 15080 13954 19425 21611 22408 17793 16154 17688
12271 17688 19609 21850 22382 26393 23028 22027 23446 29998 30031 39340 45002 43645 48207 44344 39982
12256 39982 32916 35190 31833 24451 28019 27033 29250 28141 27608 27236 26525 31539 22834 21557 25392
12241 25392 24723 21519 26032 33401 39310 42937 46606 49246 50910 56897 62812 73701 81226 92132
12227 92132 103272 102908 97684 96859 91829 82233 82109 82605 70039 61690 56692 49880 48406 48307 52733
12212 52733 57930 51844 42700 35056 38547 36524 34576 38479 44586 43423 46281 49995 48481 52898
12198 52898 63429 70123 76695 88122 104868 115133 130223 154739 175293 200108 218749 235833
12186 235833 242936 244972 235303 224187 212648 194800 165458 139549 122954 116414 110212 99251
12174 99251 83808 77952 76406 69764 71567 69590 67202 66632 67915 64980 64010 68995 74371 75879 74642
12159 74642 74391 83602 88300 91575 106994 122907 136932 152871 177547 202462 223007 239054 252767
12146 252767 247547 235275 217389 205300 187122 167750 144701 121711 105241 88220 74158 67316
12134 67316 57828 48344 43705 40049 37592 37841 42217 41037 39501 36551 30488 29827 29389 30592 25924
12119 25924 21229 21571 33143 35499 37529 47148 60846 64262 71293 83075 82553 84194 89755 90842
12105 90842 84554 81461 70493 66973 61809 49845 37418 33265 34574 38894 35858 32268 29509 30282
12091 30282 30368 24707 19294 17212 7844 1487 3947 2584 709 6029 3996 5372 5914 971 1662
12076 1662 9934 14867 14093 9083 6355 9414 12959 11574 10194 2064 -1311 6239 4333 5383 9540
12061 9540 16393 14685 4949 947 4993 13097 15885 12107 6288 8759 88 -3866 1085 9074 12050
12046 12050 7751 3417 6829 5517 5195 8440 12248 15168 15258 8219 7409 12629 9845 -2674 -10381
12031 -10381 -10163 -1825 10067 11390 7981 5280 11007 13237 11300 6944 427 4393 97 3588
12017 3588 10122 7952 4881 7639 9927 16118 14521 12403 756 -10949 -15505 -11471 -8679 -9002
12003 -9002 -5661 -5162 -4745 -59 4650 11243 13371 6478 5062 9196 13509 6430 2517 4946 8127
11988 8127 10282 7677 1574 -783 -429 -2498 -8750 -5176 -87 5749 5662 -307 1503 479 4888
11973 4888 6091 5822 11522 15281 11305 4127 333 6191 13738 10945 3121 -2495 -3012 -2058 91
11958 91 -1634 -9270 -7779 -3187 -6034 -9354 -11001 -5724 -2217 -1447 3045 9035 4970 -4868 -4243 -3067
11942 -3067 420 5976 14756 12880 9023 9538 11989 13212 8708 3226 9457 11186 10016 7964 3755
11927 3755 -3519 -6060 -1631 1211 2905 2081 -3043 -8861 146 4147 7931 -888 -8978 -8203 -6905
11912 -6905 -4243 1446 6013 3041 1602 2043 -1614 -1089 1770 -281 4269 7445 6359 3422 1363
11897 1363 -1930 -3420 -697 1718 16047 19075 6569 4914 1354 1681 -565 -3261 -7623 -8558 -7522
11882 -7522 -4091 -2637 -4778 -1965 1756 5129 6860 5086 2661 -4108 -4372 1097 -823 -2360 -8657
11867 -8657 -14138 -13162 -15942 -15911 -12597 -8758 -5378 -1490 -2874 -3244 -2827 -6642 -7511 -3074 -4316 -5792
11851 -5792 -2945 7019 13531 15664 13783 7026 7394 7304 11173 11124 11571 1744 -8077 -4944 -503 -2645
11835 -2645 -9460 -7586 -3108 -66 -3669 -8125 -7017 -2992 1783 1318 -3635 -3304 2252 5606 8145
11820 8145 2323 -5496 -10991 -4859 443 1833 4281 3864 5097 3453 166 -2423 -6309 -6647 -3234
11805 -3234 -1203 -5134 -5357 -3388 -4030 -908 2188 -612 -5979 -10869 -9747 -7597 -9503 -14176 -12802
11790 -12802 -8829 -4622 -6591 -11748 -9017 -10189 -6953 -4875 -1479 -191 -2966 -5191 -7066 -3014
11776 -3014 1487 1319 -2968 -5587 -4021 -7494 -3971 -1243 3212 5098 1766 -2279 -6605 -5974 -2678
11761 -2678 2220 355 -1320 1504 -45 5307 5343 30 -3695 -6823 -6044 -1912 7191 5681 4017
11746 4017 -4775 -17435 -15230 -9963 -10433 -8126 -1295 -3123 686 1024 2217 -2939 -16229 -16197 -7927
11731 -7927 -8320 -9803 -6883 -529 3298 2600 -2457 -9845 -6681 -3713 -1538 -977 -663 -5228 -9542 -9226
11715 -9226 -7328 -7492 -9514 -8255 2783 2513 2360 8000 1672 688 2526 -1594 -3021 -5337 1325
11700 1325 6456 6339 2389 4779 12476 5348 -410 -6420 -2940 -723 -904 -2358 -1573 2600 -3122
11685 -3122 -8794 -11876 -7990 -1797 2462 -5737 -7337 -2441 -5132 -4311 -4447 -9127 -9005 -4253 3806
11670 3806 6428 6756 3813 4711 2944 1697 5650 5188 1736 -6245 -1594 -3001 -11081 -21381 -16822
11655 -16822 -7760 -4457 -2724 2407 5509 2154 1211 4577 4845 4035 5136 7013 5344 1508 224
11640 224 656 -2801 -2635 -5075 -9404 -13718 -13205 -8604 -2372 -4824 -4706 -3965 -5940 -104 -591 -8376
11624 -8376 -10738 -5564 -11865 -12898 -17880 -18930 -12940 -8212 -9840 -10307 -9694 -6077 -1298 2060 1060
11609 1060 1203 -11218 -10469 -912 -2311 1416 -562 3178 3486 2624 -5249 -3455 -9320 -7610 -1065
11594 -1065 6146 3468 -7247 -12383 -15127 -12028 -9791 -10262 -5536 1966 3032 2839 -7973 -4204 5600
11579 5600 -1529 -5441 -1250 -5255 -5058 1173 -2813 -8260 -9046 -1966 401 455 1804 1291 -859 -4878
11563 -4878 -7686 -8491 -9087 -2574 4818 6947 3950 4783 8158 6383 3343 3421 3975 -1806 -9619 -10578
11547 -10578 -6786 1237 138 1082 -1836 -5708 -9964 -8216 -8508 -7222 -3733 1732 -708 -1324 -4463
11532 -4463 -3846 -3322 -3943 -139 2915 3645 6975 11100 6848 1527 3282 1746 5910 1004 -1277 4262
11516 4262 6329 8946 11716 13368 13862 14188 16029 19643 17033 13202 3836 2992 4112 12860 16061
11501 16061 14257 14200 8353 -128 -902 -4505 -4888 4071 11144 11450 13297 12436 9897 14167 15281 6454
11485 6454 7358 7987 6536 7791 6313 582 -4700 -8922 -4311 2539 7184 2042 4975 4811 9834
11470 9834 14526 16135 17087 15925 11957 11613 9193 5298 3714 4114 12914 22744 18453 11446 15289
11455 15289 23393 31398 44785 60949 86115 120960 149464 181538 216051 233575 240870 230143
11443 230143 205889 170834 137498 98570 67150 53524 39230 28884 24736 17456 7209 11507
11431 11507 16182 15283 13872 13009 13141 14889 16622 24205 30933 28299 23382 29647 30077 28608 30474
11416 30474 31785 36159 48786 63086 82464 122700 179906 247808 315022 370954 422268 460471
11404 460471 468168 438415 386019 324744 257056 195257 144745 105804 77148 63971 47034 33062
11392 33062 32501 31924 33829 40051 38313 36732 32302 30791 31103 30929 33489 26505 21427 19004 24446
11377 24446 24250 20515 30002 38347 46094 51748 48606 56053 83674 117989 146266 175933 194249
11364 194249 213437 215363 207375 194636 171842 141026 112449 91286 73863 64524 59217 51431
11352 51431 35327 27752 29197 30429 26173 27620 29848 17554 11614 17558 23892 19986 13181 13871
11338 13871 8919 10029 17326 16957 7972 11239 15109 13278 10115 15205 13161 7064 477 2965 7631
11323 7631 12212 8172 498 3104 9354 18920 21711 20107 24844 27005 24228 11519 3192 4390
11309 4390 14205 10924 7130 5695 16121 18397 24855 25404 24879 29671 34393 36119 39398 35658 27898
11294 27898 24256 22734 16290 14714 15750 11750 12396 6535 -9042 -9436 -2549 -3207 -4824 -4402 475
11279 475 2346 3072 1232 100 1734 2459 2718 6150 11258 8925 1542 2409 6403 18244 29768
11264 29768 33142 35588 42248 46692 55351 55307 60793 67301 73799 68003 56564 48152 37465 19239
11250 19239 12824 1168 -1866 -2885 2715 10783 9776 728 -1635 509 3071 2253 -5161 -10293
11236 -10293 -5789 -1410 -3039 -3769 -6703 -10716 -21040 -9161 -5864 -6463 -8008 -1654 11858 5260
11222 5260 522 3416 4097 4983 9822 8047 2550 -3775 -3243 -4622 -8678 -17341 -18331 -23684 -28273 -27232
11206 -27232 -17255 -2424 17781 38588 54924 69398 83531 86694 93273 89709 80890 78371 66237
11193 66237 55243 47157 45168 42415 33043 31911 31366 27258 18632 19654 23017 22680 23463 25079 21637
11178 21637 20151 25801 25613 15386 7873 7296 6925 8628 1720 -12994 -20786 -19970 -14892 -6735 18126
11163 18126 49243 88675 126994 160426 186218 197272 210740 218020 205553 184424 159749 140304
11151 140304 129482 118845 105418 89098 84976 86795 82679 74698 77275 80443 84035 83828 75680
11138 75680 74398 81813 87346 98160 105492 105061 104765 99999 98565 94640 88313 80556 82703 83001 80791
11123 80791 86378 96435 114918 132326 150306 170589 179853 191073 196173 186696 175641 170862 167584
11110 167584 172297 175042 170490 167457 164664 160072 155341 146928 143357 146075 147382 155808 164617 171116
11096 171116 181951 195099 205068 210941 222750 227702 228678 224585 225259 234892 253799 271476 279467
11083 279467 302074 320201 337122 350983 365974 387808 411470 441144 468347 499987 551186
11072 551186 615478 683803 774726 902910 1067821 1269877 1495199 1726880 1954252 2154523
11062 2154523 2329503 2489401 2648205 2848514 3156561 3640014 4372108 5509008 7317432
11053 7317432 10195219 14608680 20605585 27445261 34195051 40336131 44940971 46670152
11045 46670152 45199556 41328814 35815099 29252379 22619093 16900316 12564651 9563117
11037 9563117 7587877 6289879 5435267 4880913 4539195 4343261 4249103 4230717 4263904 4334245
11027 4334245 4452689 4609472 4781450 4971137 5165944 5335597 5479851 5610104 5771631
11018 5771631 6021914 6442052 7160922 8340558 10238555 13307039 18351466 26447679 37877005
11009 37877005 51039218 64074372 76248839 85733838 89609163 87184657 80079622 69620181
11001 69620181 56841771 43749738 32353646 23674605 17657234 13672251 11044531 9307511
10993 9307511 8160130 7412210 6930090 6618961 6406338 6221628 6006078 5767105 5512524
10984 5512524 5238179 4968561 4723965 4525476 4381764 4284079 4234564 4254518 4370087 4637833
10974 4637833 5123210 5933858 7261175 9415098 12820185 17721238 23682241 29799455
10966 29799455 35472859 40099979 42487175 41896849 38839801 34110586 28254125 22046171
10958 22046171 16453252 12064501 8960280 6880942 5510690 4588045 3973755 3561411
10950 3561411 3275849 3062874 2898717 2750272 2589874 2403823 2191143 1973236 1750800
10941 1750800 1536430 1348020 1195519 1078362 981012 908669 850669 797324 750020 698149
10931 698149 654061 612029 568694 532869 501182 476470 455021 425853 392971 363439 345131
10920 345131 320900 305495 295770 287684 272863 266763 261124 251576 234051 217645 209819 198402 193821
10907 193821 185760 183127 181670 170087 153884 137629 126786 121403 116800 105434 83813 69095
10895 69095 58052 49383 48583 54044 64194 81180 103782 120890 133555 150876 154843 149760 145618
10882 145618 142547 137172 127618 122819 114466 101050 96339 102664 103755 105374 99933 94591 85608 79180
10868 79180 71502 69345 72090 66444 61351 58171 48774 37963 24758 16219 5142 -13965 -36935
10855 -36935 -58314 -72766 -73733 -68297 -66368 -51129 -25244 11018 55284 87435 112673 128696
10843 128696 129059 122609 126349 128273 121562 119828 106750 102168 104772 98147 87564 78800 71130 64852
10829 64852 64183 66781 59826 56349 64158 68428 59746 61094 59672 53509 55912 49744 41646 27149
10815 27149 21110 18684 9237 2475 -4060 -6715 1046 11964 25531 41019 60441 83689 98781
10802 98781 98747 98546 99736 96126 93947 91397 83988 75408 79292 83908 80117 69951 72246 68364 68604
10787 68604 70172 74709 75159 70591 65472 66439 66219 65324 68184 76694 78847 80447 71658 66682 66860 66780
10771 66780 70932 69016 66518 59217 52015 55677 55052 57474 51273 45319 43431 48254 49487 50936 49949
10756 49949 46171 46682 52535 54852 51706 46225 44324 48809 45862 44688 44266 39992 39365 40312 43902
10741 43902 40850 28525 26112 28382 25415 29103 33703 35458 42054 50815 48731 42370 42165 38687
10727 38687 43673 40543 42864 43165 40191 36245 39062 42993 41743 37814 35309 32767 31727 34607 40398
10712 40398 35418 33590 32945 29382 28169 37179 39336 36617 37486 33214 42195 39282 33712 24040 26952
10697 26952 24236 18748 22234 16429 17084 26200 38145 37080 28943 30912 37839 44079 45119 45924 43659
10682 43659 37642 36552 36946 43507 49721 45162 40990 38958 38757 43373 36558 29263 23825 19056 20755
10667 20755 19938 26300 32449 25289 30883 30281 30566 27443 28362 29067 26229 26928 26587 27297 24726 31051
10651 31051 40171 42597 54797 76968 97186 126773 152812 179141 208207 239210 260928 261325
10639 261325 243342 218331 181689 145842 117167 95816 77543 63201 50427 45045 47256 48541
10627 48541 51272 47006 39151 38556 42405 36952 38419 40738 41763 47405 54134 55317 57252 57827 61819
10612 61819 63404 68020 77631 90640 97049 116688 153528 206387 271695 337398 396492 451039
10600 451039 482935 484372 462246 410691 349060 278437 220419 170474 124532 93633 73879 68088
10588 68088 65810 63451 56018 43754 41542 48292 54440 52814 46633 43421 41869 45260 43226 42856
10574 42856 43005 41130 40683 43602 37024 43368 53558 63990 75010 95506 115043 135910 168845
10561 168845 200305 225401 240059 247719 235795 212463 178102 146950 119331 91542 76716 64143
10549 64143 50597 37747 29001 18908 21843 20175 13237 17645 23918 22137 17161 10587 9659 11403
10535 11403 6116 10880 9413 10586 12065 8524 8140 8068 11061 5474 4794 309 1287 3046 5169 10716
10519 10716 19798 25999 19593 10486 9543 11848 15827 18436 16905 6234 3903 2941 5032 13552 16987
10504 16987 8017 3461 6423 11311 15526 16366 15802 19643 17473 10364 8025 9742 10754 9590 9505
10489 9505 7300 4759 6042 7448 8527 5390 -747 -3318 86 2808 8414 11360 9788 9549 7556
10474 7556 5681 5034 7129 10558 5102 7458 4998 2977 7824 14715 14155 16916 14464 12451 14759
10459 14759 19308 18636 13587 13006 12154 8073 3540 9190 11413 11206 8886 7900 5179 5834 7226 14205
10443 14205 17743 22682 17821 7773 6694 9114 14110 14005 14824 21637 17975 15485 14053 16772 15928
10428 15928 11524 6173 8727 8953 6685 2607 5005 8782 14886 22104 17190 11137 8753 2013 2309
10413 2309 8105 8561 2561 -2220 767 4366 12157 15554 12957 13083 11266 9660 14906 14668 17302
10398 17302 14138 13872 12365 12002 3502 -2639 2280 9100 9106 5105 2343 4959 6777 10023 4552 2851
10382 2851 -3081 -3815 13155 14558 14878 14662 13707 12187 7245 2500 1919 6363 15953 15929 17508 11997
10366 11997 4469 7857 8477 9312 2387 4656 4842 4057 7550 6539 5757 3480 5420 11740 8637 -3122
10350 -3122 -8255 1494 8887 12088 11363 7575 4301 9381 11428 8704 8426 5066 7973 3340 2519
10335 2519 2068 6157 13731 14321 7750 6275 12320 11837 17042 17411 18099 19436 13562 16376 8703 6925
10319 6925 8376 4675 -737 165 3918 2609 5668 -433 -3606 -3716 597 5375 6798 10091 10713
10304 10713 13599 12935 12066 8472 2468 5714 6206 11542 13157 12130 9819 15489 15477 20396 23237 21848
10288 21848 21150 17065 16278 16439 21169 20374 25321 26523 33224 32078 23846 15276 13181 13352 21018 19803
10272 19803 17198 15641 21304 22141 22611 24268 23958 22703 20449 19601 25914 25731 25360 21187 23173 27127
10256 27127 27376 22036 18874 18567 17524 22740 23683 27358 31607 22203 22420 18370 10556 6469 7393 4979
10240 4979 12971 23634 25317 20258 17175 17570 19579 22075 27187 29939 32287 30309 27891 18735 17171
10225 17171 22643 24678 26165 24944 26065 27530 25453 31294 35086 42924 59351 89685 114638 131539
10211 131539 138495 155093 180247 180467 161061 147166 131162 117295 99207 77240 61253 51400
10199 51400 46705 38280 35507 27628 21989 24318 20441 13005 13346 16791 16438 18407 16778 20437 22125
10184 22125 17506 17541 16796 18118 26399 23016 9486 918 -2338 -1842 5440 4229 5328 9944 14268
10169 14268 11453 12395 18133 11853 2841 -240 5047 6671 9945 3412 4648 5546 11788 10246 8775
10154 8775 6118 7002 6763 11365 16165 7841 2520 1124 3413 7149 6136 7910 11912 9060 9067 4904
10138 4904 1119 3861 6362 9280 12134 14276 16498 12988 8844 7323 14779 12070 9502 3915 66
10123 66 1267 8495 19487 13281 6378 7807 11734 8896 9337 16928 21168 14308 1776 -2198 2598
10108 2598 5417 7237 7153 4075 5532 9443 10507 15873 15541 12692 4752 1177 1164 3526 8193 15713
10092 15713 13840 18348 22122 11973 6783 12217 20233 14234 8301 16276 26903 40125 36992 23169
10078 23169 20439 23083 20014 25089 23359 18462 13502 11751 14700 14808 12563 11851 12658 9846 13973
10063 13973 20485 22155 22309 22566 14498 13427 17572 22468 36162 47796 63690 86069 108557 145664
10049 145664 207347 337130 615148 1145159 1764428 1772179 1387615 924188 562063 357538
10039 357538 242558 174294 134519 107547 79014 63310 55601 47499 42651 43630 43821 35738 36339
10026 36339 40306 43548 34714 26444 26167 26762 12886 -743 4929 9282 11886 16319 11753 15539
10012 15539 16291 15002 9502 7412 4164 7971 9304 1984 -3719 -761 3177 3169 2181 9491 13909 9422
9996 9422 11197 4635 -1712 1832 4634 1760 9229 7282 -8470 -13903 -11113 -788 -643 -4216 -110
9981 -110 4455 782 -1493 2810 9047 9457 5955 5632 3803 3433 305 559 4287 2848 123 2357
9965 2357 11114 9312 7603 555 1485 7280 9276 12601 17566 13253 9093 3768 -5839 1295 6079
9950 6079 2092 1253 8170 7724 3868 4089 8366 3607 539 2323 4582 9087 5929 2698 -2702 -9889
9934 -9889 -8306 -8079 -6033 -7999 -7350 -4511 -6083 307 2770 2110 1574 1038 -6416 -3415 -652 4578
9918 4578 7333 6867 1016 -8791 -16841 -20157 -10560 5575 10615 8775 3151 -1223 -6093 -8982 -8318
9903 -8318 -2966 -1836 -1963 823 4840 7643 -942 -5934 -4830 -8169 -5358 -1716 -4299 -9180 -5099
9888 -5099 -301 -2580 -750 7903 11382 9592 8210 9476 12032 7576 1632 7933 6347 2996 -2296
9873 -2296 2242 798 1155 2457 -1989 489 3749 2370 4006 -613 -4491 -5350 -4278 2952 6338
9858 6338 883 5520 12354 7657 4563 4341 5175 3250 5532 3340 -535 -5607 -8608 -7175 62
9843 62 6645 10712 8612 7212 7648 2192 4264 9754 11665 15619 13639 10971 12645 12626 4093 -1227
9827 -1227 863 610 -3720 4670 8954 10333 9816 10310 6426 3615 1177 -3093 -2324 3993 6382 5335
9811 5335 2928 -1643 -307 -1029 351 3071 3680 4337 4763 -1543 -9637 -10130 -7350 -139 5027 6757
9795 6757 14983 8348 -3312 -4812 -5552 -5089 -2584 3553 13093 7225 5573 12263 17136 15846 10183
9780 10183 6790 6494 4522 4020 10456 8126 4496 6681 18942 23285 22647 21711 17984 7562 -573
9765 -573 -2713 87 3214 3906 3684 2033 7867 6119 4316 8285 11847 2212 -603 8238 12824 9049
9749 9049 7278 5636 3021 8089 12175 11434 9453 8169 3803 3822 3068 2473 -642 -8574 -6126 -7767
9733 -7767 -4920 -5500 -3011 -768 -256 -13754 -15443 -9910 -8049 -7513 -6414 110 7010 4419 3996 3501
9717 3501 1923 6645 10595 13624 14284 14017 20803 24439 14630 6429 11188 18247 13413 13463 19387 22480
9701 22480 20335 17009 12763 6703 8903 16341 22593 18375 11099 8664 2010 4774 14016 16425 13413
9686 13413 16463 15731 16393 29186 33230 43285 51310 53893 53721 61157 62429 56291 54338 49509 40728
9671 40728 44392 46864 47367 51137 51402 39536 33564 31921 25289 24630 31833 40183 44086 41869 32290
9656 32290 18682 19298 26502 27347 27691 34222 35765 40288 52076 63089 66262 69724 77762 92598
9642 92598 103371 112489 117734 119402 113414 103482 97111 86867 74212 74616 57495 47046 41254 29121
9628 29121 21112 26928 34903 38890 30643 20806 6371 7217 13070 18659 18769 23637 27067 28364 23915
9613 23915 23271 27890 33094 39359 42548 46946 47608 48762 58631 71333 78503 75970 70339 63751 55828
9598 55828 52493 41168 29516 26955 32759 28866 27028 27813 20977 14467 11456 2138 -1106 -850 2044
9583 2044 -86 784 9456 11128 11455 10975 12424 14881 18449 19567 11532 7469 7304 6802 6208 7689
9567 7689 6172 9546 9938 708 -6357 -12852 -11826 -124 8536 9336 10904 10728 10030 10255 12202 568
9551 568 -5720 -5708 -12544 -15268 -3165 -880 3745 4008 -1225 -5326 -2531 2784 8149 9785 14513 14979
9535 14979 8034 8755 16082 21134 14275 7404 10220 14445 15793 15754 12448 12182 13383 11418 17677 22786
9519 22786 19088 22152 22848 28421 17745 6763 11685 19055 20768 21254 20184 22071 23488 19019 23288
9504 23288 18092 11516 8377 11511 11823 11906 14298 18868 21476 19333 14653 7299 8905 7336 4011
9489 4011 4744 4204 3552 8459 11248 4829 5542 6762 6537 -1989 3410 4661 2182 2299 10325 12266
9473 12266 4503 6406 13236 23431 24207 17353 10629 6814 7420 3642 10202 17414 15641 9469 13787
9458 13787 9138 9903 15120 15360 9099 10555 5987 2714 6802 6494 10010 7838 7782 11433 8829 7573
9442 7573 10516 11246 10444 4603 1561 6292 8091 6469 4649 1832 6034 10326 11563 7457 6594 8608
9426 8608 13173 14369 11974 16634 9595 4184 5922 16834 21643 23353 25628 20986 28231 40891
9412 40891 38804 33252 35220 46480 54339 55647 53931 52702 53758 60516 71462 75138 74091 70496
9398 70496 78784 81379 93990 109511 119019 136519 153039 175805 199291 232908 281522 334046
9386 334046 402601 499303 613946 776953 1022444 1368284 1855114 2476289 3119915 3541760
9376 3541760 3536939 3152560 2585340 2025896 1567896 1216314 958286 776417 634952 523465
9366 523465 433033 366664 320026 274033 237511 208618 189783 167772 150872 141357 126164 116617
9354 116617 113663 112016 110803 103521 94984 97887 95641 91120 87425 90157 79079 71631 68909 71150
9340 71150 66526 69018 64914 60416 62697 56135 51755 47771 45524 43135 39009 30246 28404 28628 33622
9325 33622 39057 41324 38787 35159 29365 26361 24817 25357 23288 25091 33009 45294 59206 74043
9311 74043 84402 90055 97039 99418 105541 103106 101089 98784 92246 82537 80701 82319 82965 82352 83920
9296 83920 87681 90981 101280 108227 110077 112770 104777 91512 78181 74616 75637 75770 75369 72959
9282 72959 72944 74095 78289 89088 103151 105318 112804 118580 119638 121566 127777 125580 124775 120884 115103
9267 115103 109957 110466 105248 102996 107229 104706 108702 123128 143947 166629 196487 223695 231876
9254 231876 220284 193939 170354 156382 145520 131946 129251 127918 133808 133598 128306 132360 141599
9241 141599 151337 157615 169295 179405 188116 195798 203957 205604 208944 208598 217968 235018 244736 251054
9227 251054 258318 270277 287314 302769 322774 354547 392209 436982 484215 522977 554947 595302
9215 595302 641992 695872 763507 839493 933364 1045959 1174306 1333811 1525536 1755708 2039668
9204 2039668 2393718 2819750 3340388 3993585 4804928 5799340 7003162 8420100 10001645
9195 10001645 11619049 13073511 14130754 14609624 14454476 13768364 12734253 11546084 10381607
9186 10381607 9319008 8384413 7587834 6918061 6363897 5924045 5567189 5290564 5073036
9177 5073036 4914699 4811677 4761225 4761192 4824736 4952915 5142453 5407411 5764383 6225710 6821950
9166 6821950 7597308 8593443 9873862 11527089 13666841 16419085 19905903 24123689 28780029
9157 28780029 33127922 36062398 36663553 34825168 31236544 26900632 22645448 18922302
9149 18922302 15868906 13450364 11549600 10050384 8866776 7924253 7167164 6554899 6081166
9140 6081166 5704781 5403240 5181381 5023762 4921958 4875705 4888243 4947797 5066296 5245944
9130 5245944 5494263 5819516 6239232 6764287 7419441 8211836 9135309 10191757 11336640
9121 11336640 12457530 13396652 13940131 13938207 13342841 12261769 10894323 9431562 8033457
9112 8033457 6796787 5751036 4869975 4152141 3565345 3085163 2683493 2350889 2072963
9103 2072963 1841834 1639069 1466313 1331557 1209940 1101241 1009561 924191 844011 774462
9093 774462 715668 660695 618260 579086 534911 493618 462334 438345 418177 396897 374060 350791
9081 350791 326466 307312 294647 286969 273236 254349 239959 230580 227927 217195 206613 199251
9069 199251 182212 168912 158938 158903 155850 147526 146073 145756 135755 130085 122407 116916 115492 109637
9055 109637 103749 104670 106780 102059 97194 97408 89747 86310 73492 67026 62844 62574 58240 56800 57432
9040 57432 55788 60620 63005 58478 57951 52913 56588 63377 65240 72401 68899 60970 52610 52259 52933
9025 52933 53982 50499 46097 42107 46256 57056 58854 54666 49073 49807 49811 44965 39911 39712 28314
9010 28314 19224 8885 2929 -5969 -10121 -11669 -11357 -7404 -4678 -3177 1691 9348 28153 43941
8996 43941 54936 62189 65864 67208 70668 67746 67596 68371 61943 66554 63109 53317 42985 41641 40240
8981 40240 37153 35508 29687 27170 24228 23924 24251 30068 37463 36585 29750 30118 30099 23879 16911 16111
8965 16111 27914 34771 39010 50408 59432 61856 63489 58980 50181 47923 44090 45106 46828 43468
8951 43468 43194 49352 49723 45660 42433 37954 33984 37316 43668 34291 27935 35142 40093 39693 35723
8936 35723 30989 32342 39439 41557 38193 45603 45711 39993 36438 32018 41521 45835 43719 42981 45087
8921 45087 42375 45217 46544 42076 39630 40654 40610 38834 39950 42619 30834 24974 26152 19381 24727
8906 24727 31656 41582 37189 37356 39058 42487 44998 50526 54443 63755 67572 65599 65756 66697 65758 69063
8890 69063 73479 83505 95530 105892 114660 123923 133818 167465 213034 278453 396019 596569
8878 596569 911852 1288674 1491764 1384631 1099125 791002 540116 379829 281103 223589
8868 223589 186075 163965 144146 124952 114353 107846 98856 93055 91429 90960 81489 78430 74069
8855 74069 67522 60074 57821 52909 47172 46324 42206 33319 23614 18246 16333 24129 33431 36922 33731
8840 33731 27719 30803 30820 27529 23331 20928 20676 20472 21934 20265 18389 19765 20847 19431 15274 16361
8824 16361 18287 21366 21441 15238 17818 20723 16228 15194 20568 25954 26813 24868 23487 24129 19154 13562
8808 13562 18681 23529 21680 18463 14803 14738 16694 10614 12733 11258 12363 18078 14142 13173 14864
8793 14864 19649 25451 26717 28366 30134 28434 22921 21400 24008 23838 27202 24381 15191 14980 14409
8778 14409 18127 21839 20599 30004 33873 25998 19870 20545 22853 14595 14190 16619 20716 22045 18092
8763 18092 21760 17293 16637 11425 12982 19021 17727 15745 19991 17533 15001 17890 19644 21702 18412
8748 18412 19026 14199 10944 11982 22343 23318 20305 19969 20558 23406 23604 22792 20432 17361 14999 12702
8732 12702 11196 10669 14752 18075 14848 17784 17941 14990 7215 7729 8217 6488 10453 17235 19511 23193
8716 23193 22922 22855 27146 24658 19678 14901 17467 17302 12366 19325 13654 9878 10536 18444 26246 22511
8700 22511 14135 16863 16617 18357 20793 15386 14028 15685 14082 15184 14659 10823 6139 10967 8831
8685 8831 5473 3245 13658 15838 10952 4842 9894 15742 16248 17476 11946 3443 3433 2596 2242 -551
8669 -551 2051 5773 8921 10573 7834 8273 10145 15556 14967 4735 7959 14547 18669 22424 16938
8654 16938 12267 13523 13375 11161 11064 11604 20332 17893 15091 14080 15279 12802 17700 22104 23112 12966
8638 12966 6640 12964 15044 7110 5871 8614 15933 17687 20574 26972 23194 18294 18787 15584 20442
8623 20442 20756 23963 27034 23415 24458 26886 22437 28781 29205 27982 27452 30451 39106 49497 51373
8608 51373 35813 37475 46320 47318 46273 43474 47189 57376 63528 63177 55143 55937 60983 63074 65754
8593 65754 60689 50743 43770 40783 40132 38060 35243 38935 31466 23577 20995 21776 20608 15968 11123
8578 11123 15131 13860 11049 12445 14657 9423 13470 20828 20284 17768 13449 3409 -2966 3412 13110
8563 13110 21849 24611 22604 17665 15700 11291 14454 27443 31290 31465 23571 23704 22955 21731 26201
8548 26201 26022 26050 14431 7791 12951 22070 25893 26966 23521 19510 25995 24014 16929 10174 12093
8533 12093 14362 16707 20940 17112 11235 20214 26130 26776 25558 19158 11710 7107 6184 7939 10291
8518 10291 9087 9743 2724 5807 8593 6114 7403 8184 7927 12217 10735 6402 11117 18350 20634
8503 20634 30594 47657 64900 71842 64577 59440 56251 46113 39372 34186 25269 23099 21475 24257
8489 24257 24571 25002 26268 30838 34911 34231 32920 33153 33025 31764 23095 16952 12139 6559 4151 3876
8473 3876 4646 14062 14656 9606 4184 3288 6216 3259 881 2987 -1466 -333 1791 3465 9380 10948
8457 10948 15708 10174 11983 15998 16819 23547 22406 14300 9592 13988 14760 19716 18925 14729 12768
8442 12768 12744 7594 6640 14794 13093 13906 7882 1844 7800 10430 17827 12980 10622 9291 9560 5732
8426 5732 -1821 -6836 -8099 -6723 3804 7483 4692 13745 11928 8435 9942 8488 11016 9733 10870
8411 10870 14060 6179 1857 4569 -1462 -5746 6225 14171 13175 7120 5643 9755 9578 11210 12284
8396 12284 6635 10296 25613 28300 22942 19251 11351 7655 6600 198 -3297 4324 8381 11054
8382 11054 16396 12773 508 -5220 -482 -424 6627 6781 3287 1048 1225 667 21 1476 7028 5360
8366 5360 -175 3987 1708 -7237 -11957 -6504 2107 304 -1177 -3436 -2688 -5162 -1962 4186 5034
8351 5034 5482 5683 1343 -5691 -6539 8810 16973 9159 8985 4849 5748 8029 10181 10682 14323 11029
8335 11029 9481 13771 16268 14552 5639 -2206 -7401 -1768 -6012 -5551 -1234 3261 4058 7729 5965
8320 5965 -135 -1829 -2638 -2337 -852 -1751 -8547 -17535 -17413 -9066 -6355 -3530 -1421 -2042 -794 6975
8304 6975 7805 6503 3869 3712 53 7006 18664 17999 8114 435 -1972 -788 4288 3086 -1590
8289 -1590 -3649 -861 1901 -7447 -4084 4563 6169 4263 7546 7844 8005 5134 287 -2514 8563
8274 8563 12175 10918 5120 -9903 -5973 -2366 3725 7909 4641 3338 5212 10667 16030 18720 18909
8259 18909 18308 17006 8752 2498 6378 9350 3205 -1008 8424 12561 11605 11769 7632 -1770 -311
8244 -311 236 -3246 -9094 -8067 -4972 2537 7574 2763 -292 -5739 -7266 725 7677 4259 2830
8229 2830 3213 4260 5534 5254 6424 11477 19395 19825 9146 7721 10304 7686 4205 3685 821 2545
8213 2545 12922 16085 12815 12052 9861 13218 9497 -1528 -1100 2496 -6715 -4222 6378 10369 11714
8198 11714 16399 18546 21761 23533 17776 15282 17338 14677 12851 7369 2877 3244 6884 15206 25226
8183 25226 31507 27702 16019 16494 18115 23803 21735 15381 14516 10848 10259 7377 696 3960 8979
8168 8979 8443 4400 523 -3347 -4338 4205 9103 15618 14364 15706 14427 13578 8785 3551 -4885 -9420
8152 -9420 -7180 -10314 -6332 -1583 6665 1727 2016 3237 3569 5592 8349 6074 -174 184 2488 9224
8136 9224 3843 -1945 -834 8609 14695 10607 9527 7242 4402 870 -763 4201 5770 3479 2601
8121 2601 4266 6594 7201 5790 4332 4587 -3516 -1041 -4448 -4401 -281 753 2292 3363 -1818 -3838
8105 -3838 -710 2980 12836 10386 6430 3061 6026 7848 7976 10854 7800 465 -973 -7980 -7278
8090 -7278 -2928 982 4541 4514 8223 12572 11612 13246 16511 13598 9913 8482 10897 12763 10791 9174
8074 9174 10530 4080 3739 8385 9597 13861 17789 19898 21913 13147 10026 11128 13042 14308 13675
8059 13675 13785 10285 15771 12373 12246 17297 11600 9788 9855 11817 13991 10221 11467 17200 17112 15327
8043 15327 12474 4533 3956 1007 6231 5224 2357 5189 12873 17931 20163 20212 16256 12570 12890 14453
8027 14453 15804 15122 7831 7751 5952 12681 16926 19447 20268 14528 13779 13169 19286 17244 18803 28581
8011 28581 35274 28987 18029 11091 11936 12264 11458 11380 5509 470 1121 10654 16779 15579 15681 20142
7995 20142 16909 11578 18732 22404 20941 18719 11203 4980 12645 19600 17254 12084 10039 6136 2701
7980 2701 906 7853 12904 14384 11124 7949 10413 14315 16488 18869 21358 18136 16334 11857 3796
7965 3796 -257 3764 5350 4526 9956 15529 11325 10369 10351 1217 1368 7823 10101 9488 7546 8027 13679
7948 13679 14455 9611 7790 10895 13383 10537 8149 11107 11075 6960 -1030 -1577 -595 5013 4892 3797
7932 3797 953 1239 -149 1446 -1684 -5339 -5394 843 -5261 -1517 11162 14727 9431 4517 1197
7917 1197 4164 10868 14328 10961 14153 12131 10394 7670 2343 -641 5540 3066 -2299 3658 9088
7902 9088 6689 6765 9925 15546 17147 11571 3160 1368 9162 11687 5448 7323 6322 3313 522
7887 522 1379 -1717 -839 933 -2731 -7246 -2311 173 1012 -1017 -8699 -14217 -10025 -126 -1750 1427
7871 1427 6641 12630 16273 15742 7613 3075 1471 -3163 -1086 -1632 6117 9553 3269 4934 6417
7856 6417 -449 -12506 -10493 -6212 -3630 -4561 -6762 -1589 -2919 -2360 3891 11106 9161 5286 12786
7841 12786 8819 -2910 -5041 2513 6377 6421 380 -1069 -3699 -7579 -14022 -14996 -8956 -137 4751
7826 4751 7659 2923 2336 7312 -1054 -5245 -5894 -1542 5403 6994 9116 11880 6823 1480 -6022
7811 -6022 -6515 -2000 -2463 -9778 -17381 -16730 -12404 -9924 -8652 -5744 -4421 -567 -3798 -9178 -8249 -2850
7795 -2850 -2646 -9679 -10025 -8280 130 10964 12047 2902 2003 4271 934 2411 4646 1616 -642
7780 -642 -810 -1170 -1640 6352 14980 11851 8101 3391 -5746 -6204 -3774 4195 2094 -3751 -3932 -326
7764 -326 1970 -2765 363 8909 5636 -4715 -5370 2392 7602 -2229 -6358 -3666 22 394 3918
7749 3918 3826 6422 3779 -1824 500 -2288 -4177 25 2882 2 -45 -1178 2335 4400 3405 3151
7733 3151 127 -6992 -4225 -1075 -1299 -851 -391 8941 11339 14058 12965 3928 -3904 -3221 -2107 3589
7717 3589 4107 5026 7463 -2113 -5918 -1156 -3298 -9585 -11704 -10041 -13461 -15417 -5919 3233 10849
7702 10849 9553 11912 12258 7180 729 -2318 -4797 -7040 -4856 -10958 -3740 4070 6211 6096 4074
7687 4074 570 -1015 5098 8769 5448 5183 4902 6165 12268 12195 8120 4834 9232 11565 -443 -9336
7671 -9336 -13189 -3914 -1832 -1451 -419 -244 3289 2941 2082 4851 2093 2831 13162 15439 10640 6459
7655 6459 1362 171 1739 5017 4916 151 626 290 -8718 -10109 -7827 -4342 -1472 -3218 -2276 -8018
7639 -8018 -13130 -6962 -2411 -5520 -2358 720 3152 3657 3250 4516 6123 4310 -4359 -7404 -5179
7624 -5179 -8734 -9868 -6060 440 932 3701 7214 7680 11227 10949 5970 3822 2763 5177 6780 5276
7608 5276 -4016 -8934 -5397 1510 2010 -4868 1361 6903 5907 -707 -3660 -215 1168 -936 -1382 2482
7592 2482 4786 -76 734 8620 13754 4161 -9675 -5693 -315 -2952 -3563 6197 5242 1045 2274
7577 2274 1592 1050 5993 3990 4621 1640 534 -2028 -2710 -1278 -2023 -6404 -6695 -3881 3557 9737
7561 9737 3330 -6064 -8532 -2062 -256 2460 5428 3525 2049 6420 7903 7140 2259 -2642 -3075
7546 -3075 -3899 -4614 -4364 -2091 6565 9729 9970 6331 2221 840 2528 1007 -4122 -3201 3314 1624
7530 1624 -8552 -16816 -18102 -14995 -15794 -13603 -14516 -13593 -1577 4655 437 7034 13735 14339 11576
7515 11576 6979 5253 7962 6507 6148 853 -2575 -4755 -3082 -1211 -1573 -377 -3784 -6831 -1941
7500 -1941 4006 6388 1323 -3435 -8656 -1451 872 1469 -49 613 426 2034 6209 2046 11 -2251
7484 -2251 1275 7637 2191 -3473 -8564 -10947 -4023 3717 73 3124 10851 8811 1622 -195 4244
7469 4244 5110 2053 2509 208 -4650 -9114 -7043 -10206 -8501 -4246 -4323 -9187 -8419 -7787 -1959 2960
7453 2960 4537 1762 4179 -3272 -9002 -3360 -6730 -11655 -12028 -3359 -207 -7300 -8350 -3171 5930
7438 5930 6397 7850 1024 -12622 -12227 -4757 1717 4641 7805 6443 3518 4106 536 -2047 2536
7423 2536 2104 1050 5129 2096 -6193 -17406 -16906 -12861 -8965 -6256 -2789 -847 237 -1798 -8614
7408 -8614 -10746 -4134 -3375 -9267 -9969 -3906 -2537 -10154 -8110 -3337 1828 7998 15375 16476 10953
7393 10953 10888 1181 31 5932 2344 -3331 4112 10537 9857 7853 3686 13374 15092 9802 3931
7378 3931 -1018 -5277 -643 6705 -1697 -2467 -243 958 -2853 -3889 -10278 -7968 -5905 -8783 -9591
7363 -9591 -11349 -13813 -7445 -3940 6560 13162 13135 14794 9806 3463 4474 6012 1494 1556 3503 6599
7347 6599 8422 5725 5110 5909 5328 2830 2966 -617 -1573 -10441 -8082 -4430 -9662 -10084 -8370 -8074 -3907
7330 -3907 3880 2400 -2445 1081 1683 2401 3641 -1469 1210 2054 2105 1475 2952 2717 5008 4825 5773
7313 5773 11160 7762 1403 -5868 -5908 -3835 -6681 -2131 4232 1754 2480 6611 8484 11589 9205 9687
7297 9687 7067 2222 -690 403 1792 3133 -4232 -5815 -5261 -2086 -3050 -1539 -3590 -12136 -13180
7282 -13180 -12565 -6240 2788 2314 -348 -3491 -9608 -4374 -6826 -3155 -4341 -10690 -18223 -16622 -11085
7267 -11085 -6809 -7098 -9406 -4991 -5725 -435 3781 3895 339 -4940 -1604 5819 3522 6074 5099 6169
7251 6169 -2394 -2080 -2503 -2730 -7875 -6868 2781 5096 -8756 -2437 1851 -2932 -11733 -9591 -7343
7236 -7343 -2838 -568 -2461 -515 -278 -7811 -11473 -10565 -8620 -10834 -14887 -7420 2024 1603 -769 1721
7220 1721 6717 887 -8029 -3915 4974 2158 7331 7352 4566 4403 -2657 -1129 -2695 -6056 -1089 -3984
7204 -3984 -643 5493 1071 -5361 -1449 1441 6051 2015 -7076 -7850 -5379 -5015 -3527 -5310 -5560 -3706
7188 -3706 -10007 -12691 -13228 -7714 -9154 -13879 -17107 -15351 -16634 -15805 -10477 -5472 -3197 -2234 756 3733
7172 3733 -1872 2708 7545 8352 7104 6665 1528 4617 8529 6809 3133 -4727 -3279 -1898 -4118
7157 -4118 -4191 -1714 -104 164 2954 6413 6804 6113 2952 142 4640 8347 7312 -1580 -8513 -6796
7141 -6796 -2520 -2826 -3190 1833 8954 3707 -4694 -4277 -153 912 -4486 -5799 -9189 -3153 804 -2981
7125 -2981 -4715 -1234 -5365 -7836 -7306 -6197 -4028 -4527 -6199 -7221 -10559 -11242 -2736 4894 7361 8453
7109 8453 -1143 -3459 1876 3015 -584 -8366 -12107 -11696 -12659 -11694 -3120 2815 3834 7861 3617 2492
7093 2492 -3992 -8540 -6417 -3193 -2214 -5642 -428 1744 -691 275 -3437 -8268 -4186 -4674 -4731 -7320
7077 -7320 -7620 -5716 -4108 2122 7894 5306 7030 7284 10215 13884 11108 528 498 124 2173 3262
7061 3262 7206 4647 5306 3751 832 -1277 -834 -2180 272 8618 8272 1326 -5616 -1131 2419 1436
7045 1436 2325 -719 4692 2709 -2777 -6116 -3876 -193 5191 3349 -3021 -5534 4170 6696 2661
7030 2661 -166 -3838 -4240 -457 6419 8651 4733 -3981 -8216 -4671 5150 4960 2180 4342 2686
7015 2686 4010 9460 8842 2373 -1540 -6603 -11998 -5200 1606 -4494 -9839 -12055 -7435 -950 4507
7000 4507 2188 3512 -1449 943 -2277 -6003 -5479 -3390 -3218 -720 213 -1264 -13295 -11532 1398
6985 1398 11040 5421 4136 5519 2685 665 2597 1820 3876 863 -9811 -12658 -11816 -4586 -2690
6970 -2690 7219 10144 -3769 -6375 1814 7112 -727 -6308 -1964 1559 -1295 -6502 -4926 -3866 -6572
6955 -6572 -8482 -4049 2575 4958 -6325 -4480 1925 6268 4373 7604 14473 14844 12862 13141 8760
6940 8760 8142 8405 7837 7818 11998 7278 1602 308 -6264 -12631 -13021 -7749 -1599 816 -4107 -8073
6924 -8073 -6157 -6576 -9016 6660 12096 7807 -1646 -8711 -3168 -1667 -8826 -8199 -6772 -12819 -18237
6909 -18237 -20566 -16271 -10362 -9292 -9560 -9810 -10402 -11313 -8773 -12129 -2699 -5596 -9236 -4845 244 5086
6893 5086 4903 1990 -9761 -15070 -11204 -9421 -7472 -6922 -1071 -4562 -9817 -11533 -7714 3876 8092
6878 8092 4742 1421 -6810 -11639 -6874 -6632 -2395 2061 4657 2063 5911 -916 -8563 -5798 -1138
6863 -1138 1844 3538 4894 -893 -3638 -4384 -5993 -220 3479 -5582 -12374 -16864 -11192 -2670 -10165
6848 -10165 -2446 -2599 2134 -1544 -4310 -2906 988 -72 -1095 -1005 -20 -693 1048 4652 -1180 -4659
6832 -4659 -6518 -12826 -11897 -5733 -5048 -403 7802 13087 11869 16034 17716 16554 10843 2846 1510
6817 1510 -978 -3341 -5936 -9646 -7111 1461 4421 10655 12578 6938 514 -5199 -5873 -4587 -3030
6802 -3030 -1216 1432 -2426 -16674 -17105 -16834 -15245 -16033 -10591 -4127 61 -1489 3571 5721 239
6787 239 -102 1350 3952 2428 -301 319 3330 5383 2077 642 1716 4580 8715 8503 -1252 704
6771 704 4570 6725 2884 3408 -417 -517 -3820 1784 4646 722 -707 -395 -4178 50 5585 7496
6755 7496 10788 9588 1569 -9551 -13514 -12347 -2275 3234 3481 2724 -8166 -11416 -5760 552 2992
6740 2992 8625 13375 23994 22048 14462 16937 17788 17480 9613 2994 4317 4674 2187 2439 7308 3104
6724 3104 -131 -1249 -3162 -1080 -2018 481 3352 539 -512 -4415 -2562 -2565 -7524 -5522 -3874 1394
6708 1394 3220 2131 5019 5795 6435 -1794 945 154 -6410 -8731 -8046 -4147 1630 -1095 -2027 160
6692 160 10912 11759 7070 -967 -10390 -8185 -7089 -8598 -12091 -12079 -10681 -16098 -14466 -7401 -1453 -3484
6676 -3484 -3698 -12109 -11330 -7594 -8863 -8096 -3945 -925 -3933 -8209 -9902 -9621 -10106 -11268 -12804 -10613
6660 -10613 -4414 14 -3285 -5243 -3981 3508 2005 174 -8820 -2829 181 534 -3910 -11659 -12117
6645 -12117 -14164 -13810 -7291 -7580 -7437 -3085 -2930 -4648 2942 4774 -5380 -12425 -4287 -2237 -1143
6630 -1143 2788 -20 5624 15447 10265 6313 4888 6071 -1536 -8702 -7380 -5800 -3971 5523 12634
6615 12634 8711 -3894 -7345 -2697 1883 -4491 -12487 -11689 -3586 -1815 -5109 -4295 -1008 4349 1204
6600 1204 -5171 -10194 -10512 -14534 -11268 -7531 -4859 -2987 1555 2668 2239 -6541 -3258 2163 1563 -2607
6584 -2607 -3308 -1462 -4665 -1751 -1923 -5236 -121 1166 -7639 -12265 -10117 -11962 -7023 -3352 3503
6569 3503 6532 10179 2560 -928 -1046 4570 6037 3929 -2416 -3062 -6976 -7572 -1735 2257 2352 640
6553 640 -1288 4635 5470 12612 8869 480 -1404 -3050 1633 5257 1010 1066 398 -6293 -6742 -819
6537 -819 1409 -92 -1881 147 -2542 -4182 -824 -134 8293 8346 -935 -2322 -3372 -2334 -383 8620
6521 8620 11328 5379 -4724 162 7592 8252 9056 12833 7227 1472 -3411 -7807 -6961 -650 -989 -9066
6505 -9066 -14348 -9863 -5968 -5700 -3903 -1115 -101 4600 10315 8004 -897 -4723 680 -2779 -5268
6490 -5268 -6810 -10370 -10054 -14130 -14056 -11474 -8748 -5623 -3313 -1369 -6995 -9917 -7236 -6440 -9151 -14336
6474 -14336 -13471 -6337 -608 -1074 -5122 -4970 -5189 -8288 -8728 -8122 809 8724 9491 -255 -3275 -478
6458 -478 -506 -303 9308 14125 16119 13514 6750 -2645 -5030 -4154 -387 -11 4015 5466 6717 11344
6442 11344 6219 -132 2814 1801 3453 4889 5383 2818 2652 -2207 -7069 -5888 -3812 -10396 -7716
6427 -7716 3765 2245 -2890 -8288 -5411 -2084 -2362 -3354 -6646 1233 1966 -3963 -356 3665 -5610
6412 -5610 -11767 -17035 -9517 -2831 3890 4875 -3819 -8052 -777 3357 -1087 -6639 -9806 -5975 -5534
6397 -5534 -11020 -12394 -13220 -13009 -5099 -1339 -3109 -3906 2366 5762 5129 4513 4146 2078 -3416 -7870
6381 -7870 -12143 -15045 -11675 -5417 -6286 -7469 -7328 -475 715 3714 3450 1269 -1684 -388 -2836 6340
6365 6340 5762 -2189 -2511 3953 1245 3403 -125 -1296 -2064 -3669 -3788 -2474 -152 80 92 -2387 -3906
6348 -3906 -1545 446 -1300 -4489 -4747 2134 2443 -3441 -12722 -14751 -13172 -5192 -7201 1864 6970
6333 6970 972 12 4430 6071 -863 2242 7951 2611 300 542 -1101 -1018 3693 5584 -3265 -8514
6317 -8514 -7128 -10644 -9571 -580 -4234 -11447 -12958 -6370 -2091 -1411 -6401 -4646 -4442 -7351 -1486
6302 -1486 -2034 -2582 -7395 -3545 -142 -8412 -5727 -3444 -1425 3866 8931 1755 5015 9144 6168
6287 6168 -978 -1952 5251 416 482 492 -8421 -8876 -4429 660 -2620 -670 -1337 -3063 -2216 -1951 -3147
6270 -3147 -1209 6229 6407 7630 4828 -2304 -4788 -3130 -7444 -11006 -9250 -5995 -3913 -6690 4426
6255 4426 9487 2706 3926 6072 6172 5167 2380 4920 3201 -1575 -788 981 1670 3343 1087 -575
6239 -575 -529 344 -4171 -6585 -5299 -940 2557 4533 1659 -6468 -7655 -502 3537 3040 -497 -2560
6223 -2560 -4639 -1409 1707 -2997 793 4311 177 -2306 -7167 -1387 829 10119 14284 8344 -2659
6208 -2659 -4956 68 11230 10182 -1003 -2668 1296 1808 5698 2535 -3691 -2888 -4013 -11568 -9658
6193 -9658 -2013 5811 11390 10628 -1706 -7580 -10498 -12916 -11137 -13214 -10857 -9398 -19512 -12292 -4586
6178 -4586 -1243 -3371 -2375 1129 3646 4456 4185 4521 1624 3787 5905 11184 5810 3514 4982 5326
6162 5326 -62 -2097 -96 144 -104 2147 5887 9723 7031 1518 3005 5606 9615 7452 -875
6147 -875 -5841 -886 5603 -5503 -10948 -5928 2036 3294 2813 6277 11845 4578 5608 2417 2219
6132 2219 -6526 -10452 -10277 -15335 -12487 -3451 -1100 -4647 -4459 -2154 150 -2792 -3013 424 -1134 -3102
6116 -3102 -4998 -8983 -3350 -4499 -1404 490 515 2198 5076 120 -7818 -1657 -7558 -11739 -13180
6101 -13180 -8962 -5960 -11056 -12500 -3862 -396 -10992 -13939 -14553 -15259 -18715 -23092 -21065 -13481 -14914
6086 -14914 -14676 -5558 -2273 -808 4906 7171 6418 3016 -1543 -1971 -5744 -6318 542 -924 -5064 -2807
6070 -2807 -4877 -8327 -965 -761 -4001 -4811 -8493 -6602 -6477 -3145 -6807 -5955 1645 4870 570 -402
6054 -402 -1442 -3519 -2375 3228 3218 6012 5799 3459 1274 5090 8841 9558 6038 1277 -5227 -17127
6038 -17127 -14972 -7522 -4023 606 7173 4720 699 -1738 -1850 -3605 -472 2296 7349 12925 7078
6023 7078 -1803 -11014 -7678 -3294 -2678 -8298 -11938 -10643 225 -2782 -7638 -11789 -7177 -3307 -2001
6008 -2001 -1112 1778 6796 6722 5101 7596 10719 10347 7643 3821 2449 -1835 -1198 6140 4239 4181 -2450
5991 -2450 -3658 4608 328 -3179 -719 524 286 2033 -981 -424 892 -7861 -8318 -1753 5091 1506
5975 1506 214 6235 8108 -1229 -4610 -3680 -3413 167 3324 4246 1039 -1355 -7200 -6700 -7298 -3362
5959 -3362 -329 2974 3865 2978 -2576 -9867 -16845 -16665 -16797 -18149 -9845 -270 -1110 -6752 -3616 -428
5943 -428 -10268 -12165 -10674 -9410 -11881 -8993 -2673 6754 6222 2508 8008 2142 -2864 -6988 -5291
5928 -5291 -495 1427 2200 3717 1902 2857 -3308 -9597 -9313 -5838 -3315 -3986 -4475 -7138 -10019 -5188
5912 -5188 -4886 -4084 -2510 -9515 -15466 -9922 -7425 -6748 -1249 -954 -5808 -3767 -1806 6406 9837 8027
5896 8027 7139 114 -5751 -5110 -7066 -10303 -9407 -10337 -9219 -14531 -6633 1531 2551 -7775 -6725 -5330
5880 -5330 -2258 -5813 -4816 280 1733 6121 5207 8818 9149 9904 13590 18653 16475 3542 -77 3660
5864 3660 8325 3923 -2309 -1553 -8183 -14899 -11548 -8097 -10198 -12444 -9774 -13102 -21124 -20804 -11607
5849 -11607 -5864 487 7349 7070 5161 3244 6378 -1072 364 -1920 -1018 -2211 -10121 -14202 520
5834 520 11904 5479 -8257 -10371 -1480 71 3000 7412 9046 4058 1385 3391 -5239 -6708 -3203
5819 -3203 1023 -2793 -7825 -7364 -6396 -6278 -5916 -6932 -8816 -4244 3637 8333 432 -7883 -6351 -5813
5803 -5813 -5977 -6464 -8491 -10844 -12890 -10829 -6361 1092 -4594 -12332 -7844 -1944 -1212 -6245 -6137 1171
5787 1171 -1251 -5126 -10902 -10285 -8911 -9040 -8387 -1752 -3940 -11290 -9863 -9215 -9959 -6304 -12216 -23398
5771 -23398 -23312 -23796 -18081 -11978 -10274 -9149 1320 6110 -3549 -6926 -9811 -2770 3727 3073 -2863
5756 -2863 -6507 -10866 -4225 584 2400 1152 -2367 -9350 -13311 -12939 -8784 -2430 -2219 -11285 -5806
5741 -5806 -4715 -6861 -3843 -7442 -7691 -7592 -4953 -11289 -15373 -9910 -10089 -15905 -7090 -275 -1283 -7391
5725 -7391 -10664 -7275 -5635 776 5895 9295 6895 -2564 -7459 1135 2845 -379 2754 11539 14167
5710 14167 12256 7674 1623 -1078 -3381 -6327 -13513 -16771 -15086 -9525 -4851 -4522 -5369 -14125 -20805
5695 -20805 -18110 -11585 -12682 -15214 -9944 -7684 -11267 -16670 -14352 -9546 -3616 -6555 -8031 -2586 -1824
5680 -1824 698 1040 -2168 -504 5298 212 426 -3376 -10241 -8353 -6407 -4204 -4632 -9188 -11171 -10694
5664 -10694 -3479 1449 2149 5398 6776 5767 12327 6660 2307 -5068 -7831 -8963 -1868 954 3033
5649 3033 4770 1325 -1471 -4115 -6057 -3945 -8869 -671 5555 5244 9174 14423 8807 3814 -546
5634 -546 3691 10987 4791 -4351 -3124 -4048 -2198 1713 -368 -3596 -12174 -13228 -14285 -11127 -1968
5619 -1968 5004 5995 1996 167 -3506 -11007 -9824 -8501 -5232 3000 2157 -6502 -7224 -5459 -5090 -3605
5603 -3605 -3095 -5914 -6514 -2322 -7608 -7681 -9421 -14815 -13922 -8913 -7126 -6987 -7203 -5231 1744 5851 559
5586 559 -1560 -2632 -1973 -2903 -3238 -488 -4339 -4692 -6183 -9953 -6679 -841 -6611 -5650 -5114 -8805 -11816
5569 -11816 -5509 -7882 -9534 -12098 -16364 -13833 -6125 -3865 -4195 -3657 1405 1916 1623 -603 -3037 -3561
5553 -3561 -3597 -4970 -7579 -4853 -5240 -6985 -8695 -5170 333 347 -2739 -7428 -5699 -2851 1132 10142
5537 10142 11812 8105 9242 10479 9570 3771 190 -456 3186 -174 -6504 -2205 2585 3659 1410
5522 1410 4438 257 -1781 -1731 -2004 866 -214 -13865 -16550 -7354 -4505 -10201 -6158 -1705 -1877 31
5506 31 -592 4837 9239 3303 1135 4093 -3651 -6614 -1879 478 -917 -7004 -9456 -8524 -9227 -17067
5490 -17067 -14569 -8801 -3165 -2152 6107 11102 6162 4996 1144 -2800 -5946 -5309 -1351 1118 -5707
5475 -5707 -4502 -2359 -6152 -6226 -3688 -12028 -10658 -7909 -5032 -2561 -6469 -10314 -10752 -3386 1623 4523
5459 4523 6810 -5430 -10804 -7890 -2915 -5355 -11338 -11183 -5747 1173 -2370 -5261 -2153 1963 1337
5444 1337 899 -4483 -9921 -3665 3646 4419 5713 -341 1061 8397 4681 14 1069 -3467 -7351
5429 -7351 -2458 8569 12290 7549 1468 843 2685 4934 5647 -253 -7002 -6065 -5471 -5207 -4868 -17360
5413 -17360 -11315 -8987 -7758 -5764 -12474 -8682 -8543 -11162 -16494 -13872 -7941 4288 7864 -101 -2682
5398 -2682 -1142 2863 7141 8280 3037 -4681 -10065 -10437 -1413 -3564 -8098 -11729 -10439 -13509 -10595
5383 -10595 -8579 -1456 7275 12480 9755 5431 1530 3411 2967 2178 -7946 -10724 -10431 -9416 -4575
5368 -4575 -7995 -15401 -3869 5934 3648 -430 -963 -3488 -2276 -442 -3051 -1264 1862 -5225 549
5353 549 -5122 -2002 -236 1914 2241 3606 -1240 -2013 -9292 -7073 532 2820 983 3788 6085 4413
5337 4413 -5745 -8427 -4702 -2622 -9631 -17919 -15908 -13519 -10120 -6738 -3436 207 690 -8625 -7800
5322 -7800 -4823 -1823 -5046 1041 4590 4725 12497 11100 3274 -5720 -1747 -1550 -4678 -10860 -15896
5307 -15896 -13542 -6678 39 4879 4727 7626 15786 15962 9290 2611 -636 4544 3354 8703 9944
5292 9944 7808 -2878 -12472 -12519 -12817 -12838 -13546 -11118 -7894 1653 6915 6754 7847 8005 3579 2925 396
5275 396 313 8277 11822 4448 -7520 -11043 -4605 -4236 2495 4212 -3218 -9990 -12049 -15201 -13228 -8720
5259 -8720 -11166 -6290 -784 1291 4144 -552 -6561 -4891 1353 -5689 -5252 -3285 -4344 -8489 361
5244 361 7968 5101 -1892 -5763 -827 -1108 -9504 -11468 -9362 -5389 -1410 2128 3310 5328 8064
5229 8064 4771 1838 -588 -615 -7013 -17246 -15276 -8616 -5103 -7131 -10662 -11794 -10484 -4958 298
5214 298 2222 2641 -2550 -631 6287 13150 14979 10578 4681 3439 93 755 2543 3735 2645 3077
5198 3077 8849 5444 616 1350 -5856 -12645 -9566 4301 4331 -2649 -8062 -925 4100 2642 -5449
5183 -5449 -9977 -8914 -4977 3113 -1344 -8185 -6492 -7666 -2985 -4325 -9227 -1161 -1421 -6150 -7548
5168 -7548 -10254 -6550 -3915 328 6518 12425 12231 7213 10624 4184 -688 4535 3581 5737 2275
5153 2275 -43 308 1173 -641 1501 7345 7522 4135 5385 5421 6934 11099 17583 10515 4323 510
5137 510 -978 -875 -789 -4011 -9408 -9645 -8533 -10795 -11451 -6706 -2138 -5748 -5428 -8490 -14795 -10527 -9464
5120 -9464 -5514 -122 5214 3574 1733 -1201 -3796 -2189 -7269 -5068 -4370 -7927 -5329 -8407 -7387
5105 -7387 -563 -507 -6435 -11633 -12014 -3789 6213 5142 -3471 -8527 -9744 -6825 -298 1496 3617
5090 3617 2468 781 -2565 -7814 -6411 -3512 -618 -559 92 -7540 -3816 1987 4154 2675 2747 9081
5074 9081 7617 4592 4142 -3821 -8917 -9839 -7865 -494 -4145 -3663 -3103 -4006 -7612 -10004 919 10430
5058 10430 6246 -1760 -1136 -1977 -6173 -7380 -3454 1404 1626 2158 -462 -2742 408 131 667 -1054
5042 -1054 1473 2546 -3273 -3210 -5202 -8328 -4326 -2286 -10778 -15566 -13868 -8215 -4177 2290 1632 257
5026 257 -2342 -3587 -1184 2567 -123 1138 5318 1350 3973 4819 4281 -5679 -10539 -9862 -13273 -15408
5010 -15408 -12820 -7209 -2143 -8872 -12478 -9361 -7437 -11552 -22015 -21968 -16801 -9724 -5340 -11218 -9034
4995 -9034 -992 -1541 -4405 -5097 -4625 1822 2946 -4251 -10201 -10190 -7918 -8746 -2644 2014 -1172 -902 1023
4978 1023 1981 6963 7108 3845 1655 -5491 -12910 -9395 -16188 -20695 -23415 -22103 -17165 -15726 -10966
4963 -10966 -4820 -6654 -2409 4775 1755 1160 -5330 -9333 -14634 -10310 582 -3496 -5414 -913 -4276
4948 -4276 -3677 -1077 -8987 -3539 22 -7122 -2777 -378 43 -8051 -13079 -10764 -6494 -6773 -2858 128
4932 128 1983 372 1046 705 6304 6227 4799 4917 7363 13191 9257 2701 2394 4594 5079 59 500
4915 500 -8225 -19738 -11007 -4599 -7171 -3492 1310 -4290 -13068 -8016 2941 3183 -3622 -5055 -5028
4900 -5028 -1835 -3733 -2572 -5654 -11105 -15006 -16135 -6582 -985 4361 917 -762 -3477 -4936 -4419
4885 -4419 446 -2120 736 985 2472 6389 2201 -1299 2683 2301 -3813 -6978 -4968 -352 -2094
4870 -2094 -2822 -829 -1444 5546 12429 6786 1015 4817 3701 -2859 -699 6290 1672 -441 -642 -3937
4854 -3937 -3931 2182 4472 2155 -8975 -11751 -11634 -10235 -12977 -10660 -4497 -8306 -493 5694 4826 1862
4838 1862 -4294 -6571 -9922 -13116 -10940 -10879 -10598 -1946 -2882 -1285 -1031 -2593 1824 81 4166 6726
4822 6726 2930 2486 3140 1339 4137 3699 -5369 -9602 -7127 -7547 -2898 -103 -1458 -3721 -2875 -2262
4806 -2262 2205 2197 -4251 -6870 -301 -642 -4795 -9328 -4826 1704 3206 -6728 -6987 -5040 -3784 5095
4790 5095 9420 3758 -89 12285 13829 8059 9120 7917 2682 -1921 -3829 -3145 3496 3686 3445
4775 3445 6130 5802 624 -7226 -9739 -7848 -7856 -4958 1371 -1865 -4196 -3316 -2709 -56 2289 -1107
4759 -1107 -6791 -7619 -3448 -5790 -7096 -4560 -2488 -5103 -9318 -12437 -16217 -15952 -18025 -17145 -11063 -4133
4743 -4133 856 -1918 4196 3882 6147 6531 7755 124 -2187 1928 5311 7663 2129 2710 -3128 -7993
4727 -7993 -7154 -6648 -8048 -8573 -5323 94 -245 -3967 -4482 -4536 -6894 -8702 -7630 -8078 -7795 -6596 1941
4710 1941 5184 5145 -3442 -6085 -9980 -10387 -12933 -20550 -13953 -12727 -9389 -332 13883 8852 3521
4695 3521 11425 7936 6904 7408 2791 2420 6717 7582 6201 1451 750 746 -828 -2872 -4835 -1601 -2028
4678 -2028 -7784 -5292 -1475 2223 -4685 -9374 -8913 -9162 -10975 -5083 -1222 -3837 -7349 -10054 -12374
4663 -12374 -11465 -13575 -780 1645 -2325 -1749 1967 6731 11085 6034 1066 379 -4272 -14437 -11236
4648 -11236 -8058 -3671 -2742 -2311 -7547 -8023 -10895 -6366 -4593 -7841 -11846 -14185 -5991 3910 9843
4633 9843 10588 2988 -1484 -806 -5569 -10398 -7152 -10271 -12843 -1634 4242 3298 -1078 891 4037
4618 4037 8327 7940 1015 -791 4517 1171 4624 3671 2559 -3706 -9100 -2793 -534 5946 10216
4603 10216 5327 -1269 414 2443 -3906 2152 3830 1672 1299 4220 5617 8004 5781 4206 -7323
4588 -7323 -8559 -5469 -3225 -6299 57 375 -3791 -3020 1290 3344 4239 810 -6871 -11678 -10014 -8316
4572 -8316 -4036 952 -4253 -6105 -7207 -9337 -10391 -12954 -12344 -5153 6185 6219 2139 -9609 -8801
4557 -8801 -383 2572 -3475 -7666 -136 606 -3960 2551 7573 7556 12605 16386 11648 3893 -597 -8036
4541 -8036 -6751 -1460 4036 -367 1560 -1928 -2324 -2782 -692 1710 2263 4690 3437 2359 2682 -2326
4525 -2326 -2603 -6263 -8501 -8449 -3877 2958 3406 839 1760 -1603 3337 6863 8283 4259 608 -1221
4509 -1221 -4530 -4706 -6895 -7465 -13303 -15466 -11300 -8379 -1958 -3151 -8556 -3583 434 -9993 -14166
4494 -14166 -9288 -3020 -4254 -4322 -7057 -8886 -8057 -8812 -2622 -2506 -9709 -4212 -1772 -4294 -2751 86
4478 86 -7673 -14168 -9573 -5176 -2885 422 449 1410 -6807 -10736 -8798 -1653 -3104 -9387 -13224 -16811
4462 -16811 -22800 -16266 -5342 649 2490 2320 5670 7513 7417 4940 2930 -3087 -6888 -10702 -8534
4447 -8534 -1855 -817 -13385 -11252 -10554 -11295 -6376 -2128 4259 4340 -1011 -8450 -10743 -6351 -7502 -9557
4431 -9557 -1749 -801 1144 2213 1010 -1706 -8785 -5920 -3726 -5259 -2903 -5008 -9198 -4819 -2856
4416 -2856 -1174 -782 -4018 -4592 -6630 -7148 -8974 -6442 -5705 -2182 1264 -480 -9261 -16983 -13381 -9394
$$ [...]
##END NTUPLES=NMR SPECTRUM
##END=
