##TITLE=Analysis number 319768
Compound Code cc 51509
Book Reference 438/130
Project Code adrs
Chemist Name antons
##JCAMPDX= 6.0         $$ Bruker NMR JCAMP-DX V2.0
##DATA TYPE= NMR SPECTRUM
##DATA CLASS= NTUPLES
##ORIGIN= Bruker BioSpin GmbH
##OWNER= nmr
$$ XWIN-NMR		Version 3.5
$$ Fri May 26 10:54:06 2006 GMT Daylight Time (UT+1h)  MAYBRIDGE\nmr@NMR_250MHZ
##.OBSERVE FREQUENCY= 250.131544655141
##.OBSERVE NUCLEUS= ^1H
##.ACQUISITION MODE= SIMULTANEOUS (DQD)
##.ACQUISITION SCHEME= undefined
##.AVERAGES= 16
##.DIGITISER RES= 18
##SPECTROMETER/DATA SYSTEM= dpx250
##.PULSE SEQUENCE= zg30
##.SOLVENT NAME= CDCl3
##.SHIFT REFERENCE= (INTERNAL, CDCl3, 0, 16.522)
##AUDIT TRAIL= $$ (NUMBER, WHEN, WHO, WHERE, WHAT)
$$ ##TITLE= Audit trail, XWIN-NMR		Version 3.5
$$ ##JCAMPDX= 5.01
$$ ##ORIGIN= Bruker BioSpin GmbH
$$ ##OWNER= nmr
$$ C:\u/data/dgb/nmr/ADRS/5250/pdata/1/auditp.txt
$$ ##AUDIT TRAIL=  $$ (NUMBER, WHEN, WHO, WHERE, WHAT)
(   1,<2006-05-26 10:53:28.26 +100>,<MAYBRIDGE\nmr>,<NMR_250MHZ>,
      <created by zg, POWCHK disabled, PULCHK disabled
       configuration hash MD5:
       84 BC 41 DB A1 6E 1D 46 DA 25 12 A5 C1 ED C5 3A
       data hash MD5: 64K
       3F A8 F3 F2 DA C6 B7 87 DE 15 97 DB 9C 51 51 E8>)
(   2,<2006-05-26 10:53:47.25 +100>,<MAYBRIDGE\nmr>,<NMR_250MHZ>,
      <Start of raw data processing
       ef LB = 0.3 FT_mod = 6 PKNL = 1 SI = 32K 
       data hash MD5: 32K
       EC F0 B2 4D 64 9A D3 B5 79 97 0C 36 B7 D0 90 19>)
(   3,<2006-05-26 10:53:51.75 +100>,<MAYBRIDGE\nmr>,<NMR_250MHZ>,
      <apk 
       data hash MD5: 32K
       5A 2B 16 8A BF 1C C5 72 79 10 A4 1F 5D 86 0E A5>)
(   4,<2006-05-26 10:53:53.45 +100>,<MAYBRIDGE\nmr>,<NMR_250MHZ>,
      <abs ABSG = 5 
       data hash MD5: 32K
       22 DC A7 E4 BB 86 18 13 F9 65 28 50 46 E9 99 AE>)
$$ ##END=
$$ 
$$ hash MD5
$$ 8F 23 D4 CB 1B 35 23 FA 43 CB 9F CD A9 61 5C CB
##$RELAX= 
##$RELAX= 
##$RELAX= 
##$RELAX= 
##$RELAX= 
##$RELAX= 
##$RELAX= 
$$ Bruker specific parameters
$$ --------------------------
##$DU= <C:\u>
##$EXPNO= 5250
##$NAME= <ADRS>
##$PROCNO= 1
##$TYPE= <nmr>
##$USER= <dgb>
##$AMP= (0..31)
100 100 100 100 100 100 100 100 100 100 100 100 100 100 100 100 100 100 
100 100 100 100 100 100 100 100 100 100 100 100 100 100 
##$AQSEQ= 0
##$AQ_mod= 3
##$AUNM= <au_zg>
##$AUTOPOS= <13 >
##$BF1= 250.13
##$BF2= 250.13
##$BF3= 250.13
##$BF4= 250.13
##$BF5= 500.13
##$BF6= 500.13
##$BF7= 500.13
##$BF8= 500.13
##$BYTORDA= 1
##$CFDGTYP= 0
##$CFRGTYP= 5
##$CHEMSTR= <none>
##$CNST= (0..31)
1 1 145 1 1 1 1 1 1 1 1 1 1 1 1 1 1 1 1 1 1 1 1 1 1 1 1 1 1 1 1 1 
##$CPDPRG= <>
##$CPDPRG1= <>
##$CPDPRG2= <>
##$CPDPRG3= <>
##$CPDPRG4= <mlev>
##$CPDPRG5= <mlev>
##$CPDPRG6= <mlev>
##$CPDPRG7= <mlev>
##$CPDPRG8= <mlev>
##$CPDPRGB= <>
##$CPDPRGT= <>
##$D= (0..31)
0 1 0 0 0 0 0 0 0 0.06 0 0 0 0 0 0 0.0002 0 0 0 0 0 0 0 0 0 0 0 0 0 0 
0 
##$DATE= 1148637206
##$DBL= (0..7)
120 120 120 120 120 120 120 120 
##$DBP= (0..7)
150 150 150 150 150 150 150 150 
##$DBP07= 0
##$DBPNAM0= <>
##$DBPNAM1= <>
$$ [...]
##$SUBNAM7= <"">
##$SUBNAM8= <"">
##$SUBNAM9= <"">
##$SW= 20.6930455092707
##$SWIBOX= (0..15)
0 0 3 0 0 0 0 0 0 0 0 0 0 0 0 0 
##$SW_h= 5175.983436853
##$TD= 65536
##$TD0= 1
##$TE= 294.16
##$TE2= 300
##$TE3= 300
##$TEG= 300
##$TL= (0..7)
0 120 120 120 120 120 120 120 
##$TP= (0..7)
150 150 150 150 150 150 150 150 
##$TP07= 0
##$TPNAME0= <>
##$TPNAME1= <>
##$TPNAME2= <>
##$TPNAME3= <>
##$TPNAME4= <>
##$TPNAME5= <>
##$TPNAME6= <>
##$TPNAME7= <>
##$TPOAL= (0..7)
0.5 0.5 0.5 0.5 0.5 0.5 0.5 0.5 
##$TPOFFS= (0..7)
0 0 0 0 0 0 0 0 
##$TUNHIN= 0
##$TUNHOUT= 0
##$TUNXOUT= 0
##$USERA1= <user>
##$USERA2= <user>
##$USERA3= <user>
##$USERA4= <user>
##$USERA5= <user>
##$V9= 5
##$VALIST= <valist>
##$VCLIST= <CCCCCCCCCCCCCCC>
##$VD= 0
##$VDLIST= <DDDDDDDDDDDDDDD>
##$VPLIST= <PPPPPPPPPPPPPPP>
##$VTLIST= <TTTTTTTTTTTTTTT>
##$WBST= 1024
##$WBSW= 4
##$XGAIN= (0..3)
0 0 0 0 
##$XL= 0
##$YL= 0
##$YMAX_a= 415625
##$YMIN_a= -566540
##$ZGOPTNS= <>
##$ZL1= 120
##$ZL2= 120
##$ZL3= 120
##$ZL4= 120
##$ABSF1= 16.522
##$ABSF2= -4.171173
##$ABSG= 5
##$ABSL= 3
##$ALPHA= 0
##$AQORDER= 0
##$ASSFAC= 0
##$ASSFACI= 0
##$ASSFACX= 0
##$ASSWID= 0
##$AUNMP= <proc_1d>
##$AZFE= 0.1
##$AZFW= 0.1
##$BCFW= 0
##$BC_mod= 0
##$BYTORDP= 0
##$COROFFS= 0
##$CY= 12.5
##$DATMOD= 1
##$DC= 0
##$DFILT= <>
##$DTYPP= 0
##$F1P= 14.0000005364418
##$F2P= -0.99999901652339
##$FCOR= 0.5
##$FTSIZE= 32768
##$FT_mod= 6
##$GAMMA= 0
##$GB= 0
##$INTBC= 1
##$INTSCL= 1
##$ISEN= 128
##$LB= 0.3
##$LEV0= 0
##$LPBIN= 0
##$MAXI= 10000
##$MC2= 0
##$MEAN= 0
##$ME_mod= 0
##$MI= 0
##$NCOEF= 0
##$NC_proc= -3
##$NLEV= 6
##$NOISF1= 0
##$NOISF2= 0
##$NSP= 0
##$NTH_PI= 0
##$NZP= 0
##$OFFSET= 16.522
##$PC= 1
##$PHC0= 164.6252
##$PHC1= 14.68113
##$PH_mod= 1
##$PKNL= yes
##$PPARMOD= 0
##$PSCAL= 4
##$PSIGN= 0
##$REVERSE= no
##$SF= 250.13
##$SI= 32768
##$SIGF1= 0
##$SIGF2= 0
##$SINO= 400
##$SIOLD= 32768
##$SREGLST= <1H.CDCl3>
##$SSB= 0
##$STSI= 32768
##$STSR= 0
##$SW_p= 5175.98343685301
##$SYMM= 0
##$S_DEV= 0
##$TDeff= 65536
##$TDoff= 0
##$TI= <Analysis number 999999
Compound Code 99
Book Reference 9
Project Code 9>
##$TILT= no
##$TM1= 0
##$TM2= 0
##$TOPLEV= 0
##$USERP1= <user>
##$USERP2= <user>
##$USERP3= <user>
##$USERP4= <user>
##$USERP5= <user>
##$WDW= 1
##$XDIM= 32768
##$YMAX_p= 473455006
##$YMIN_p= -74040
$$ End of Bruker specific parameters
$$ ---------------------------------
##NTUPLES= NMR SPECTRUM
##VAR_NAME=  FREQUENCY,     SPECTRUM/REAL,   SPECTRUM/IMAG
##SYMBOL=    X,             R,               I
##VAR_TYPE=  INDEPENDENT,   DEPENDENT,       DEPENDENT
##VAR_FORM=  AFFN,          ASDF,            ASDF
##VAR_DIM=   32768,         32768,           32768
##UNITS=     HZ,            ARBITRARY UNITS, ARBITRARY UNITS
##FACTOR=    0.157963299565203, 1,           1
##FIRST=     4132.6476996994, 0,             0
##LAST=      -1043.33573715361, 0,           0
##MIN=       -1043.33573715361, -74040,      0
##MAX=       4132.6476996994, 473455006,     0
$$ Real data points
##PAGE= N=1
##DATA TABLE= (X++(R..R)), XYDATA
$$ [...]
20485 10673 13553 32285 36351 16044 1159 -10174 -3239 -8965 30 7061 832 12448 19682
20472 19682 16851 9240 16180 25451 33721 32636 22376 21754 20829 -11120 -35616 -29743 -6391 -4730
20458 -4730 -626 5404 4406 -7102 2237 15372 6284 -10122 -11720 1209 8243 30404 18850
20445 18850 7445 11148 6282 4774 -3034 -13721 4809 14535 10639 4327 12488 20849 23287 19473
20431 19473 12158 1541 2535 -2768 5208 4118 4037 -12043 -25025 -1381 7164 7965 22168 34212
20417 34212 18185 3149 -10791 -2896 3686 8632 -2536 9057 11873 15583 31162 38539 25242
20404 25242 25118 7163 13172 30972 37295 31630 18875 5235 2194 5688 -5621 -66 -9955
20391 -9955 -15541 -16406 -21552 -17037 -21373 -15273 1438 -5432 -4859 -7766 -16053 -9918 5472 -793 1060
20376 1060 9307 8443 -5792 -23399 -40841 -45468 -28520 -30910 -21469 -9806 -23052 -24706 -4029
20363 -4029 11893 1294 -19426 -14445 -2938 2370 -2595 -7173 -5756 -5423 2139 6382 19211 30882
20349 30882 16242 7124 -4802 2535 15830 18548 4796 4341 7708 15042 7013 -3308 -9073
20336 -9073 2684 11788 21557 16357 20097 41618 34052 20737 7000 -204 2397 10388 -10062
20323 -10062 -34967 -31470 -23279 -17496 -17755 -12700 -27895 -29003 -11155 -8560 -8785 4225 7996 7936
20309 7936 5285 13345 -1542 -25081 -13559 4456 -2622 -10153 -14774 -10062 -26294 -31820 -26278
20296 -26278 -4476 6409 12409 14198 9086 3823 2935 925 -3322 2152 -10515 -25945 -32884 -31262
20282 -31262 -19832 -13373 -15622 -2604 2520 20203 14102 6237 30800 24155 18263 23236 12755
20269 12755 1612 -17844 -29029 -23057 -19882 -2790 3458 1526 -21281 -14779 -13856 -22206 -31395
20256 -31395 -17512 1201 16414 27333 29962 27874 38619 39611 50170 50195 36097 27965 4338
20243 4338 -8460 -29260 -35365 -21713 -6609 770 7171 24705 33878 21482 13271 21407 21969
20230 21969 7629 -5793 -17490 -1210 19580 24939 9327 2337 3608 6633 11703 17864 24113
20217 24113 16661 13776 18186 16883 -12202 -29533 -12594 -9332 -13140 -24665 -5898 8140 10218
20204 10218 1647 6300 6741 3250 -18805 -21304 -25837 -21109 -10912 974 -12062 -18248 -11519 -15380
20190 -15380 -29498 -20366 -19507 -15947 -18137 -22643 -22163 -13506 -11877 -8022 -1498 -4248 -5021 19675 19353
20175 19353 9750 5262 11459 23023 23677 25767 22614 18790 12632 3374 5985 12669 28866 36321
20161 36321 24657 21037 25364 33483 27521 15954 28074 25625 26436 33607 31582 25539 22218 24205
20147 24205 6542 7556 30340 44297 32417 19645 8684 16042 15449 18381 16346 7081 -1804
20134 -1804 -13097 -19032 -11705 23506 22995 17117 2385 12969 6977 10808 12944 13727 24505 23578
20120 23578 19786 9885 4355 13393 23595 15305 13739 6224 14763 31327 34247 25406 21490 23790
20106 23790 18807 -7593 -19116 -5260 4299 5484 25878 22082 32084 16286 -17143 -28640
20094 -28640 -15334 -4546 1318 -21558 -10636 15404 13659 -10039 487 20786 13813 1036
20082 1036 -8055 4855 10964 12033 10331 523 18320 11743 14076 17393 2431 2325 2709 2703 17253
20067 17253 15998 17651 22622 38163 42224 17103 24923 17408 6149 13465 18399 11682 8758 12445
20053 12445 1481 -9332 -3423 -10329 -4591 2636 -5153 -608 15278 30609 27608 27859 19172 28428
20039 28428 37339 16488 10312 15000 32717 21638 24593 32906 22330 14851 17359 15617 12780
20026 12780 28150 3571 -30641 -25815 -25974 -23304 -15473 -23477 -16296 -3182 2959 -2732 -3526 1379
20012 1379 10084 1860 -18591 -21985 -14860 -20412 -13607 -11802 -17662 -19697 -17123 -7847 -926 -15659
19998 -15659 -27199 -34536 -40339 -36678 -24306 -7328 -297 -6638 -11521 -17210 -17050 -6955 7652
19985 7652 808 3614 1975 12285 19875 10483 13229 9342 7822 -1530 -16283 -28286 -25134 -6643
19971 -6643 3092 -7921 -2900 -20186 -17943 -7323 -6776 -4265 4146 -5416 -17486 -9031 -18440 -22569
19957 -22569 -1812 162 -4629 -7050 -6031 -10938 -5578 1292 15230 19749 21992 23269 27568 12107
19943 12107 4079 24585 27150 7186 -6921 -9919 -9687 -6392 -17657 -17199 10609 24581 27839
19930 27839 28233 35796 22557 13142 -3912 -10937 -2193 -68 -11648 -27400 -18007 -12398 -8351 -6103
19916 -6103 577 17089 28430 20203 20262 6825 997 -3604 10143 1823 -1189 16421 19671 10530
19902 10530 -539 9885 21289 21272 15398 -6713 -19173 -31358 -45795 -50446 -29072 -21155 -2900
19889 -2900 23280 22457 4813 -15506 -18685 -15308 -33664 -40767 -47846 -38834 -33961 -25593 -15703 -27883
19875 -27883 -27134 -27099 -23643 -6879 -1184 6992 4743 2198 5642 -8694 533 36161 33156 16865
19861 16865 15388 -7369 -21067 -4280 1685 1877 2812 -2342 224 8651 16816 13922 9990 3286
19847 3286 13171 682 6494 21175 23061 21269 6505 -9355 -9140 6079 -3089 -21628 -35726
19834 -35726 -30109 -22167 -15288 -3625 14385 -2418 -17094 -6377 9062 2438 11129 9072 -4767
19821 -4767 -17913 -30150 -14274 -6536 -2081 -3876 -9128 -20031 -12213 2540 10980 28714 29195
19808 29195 35448 21585 25591 31214 31591 23847 -6680 -26514 -5676 -5813 -13754 -16116 -3613 14543
19794 14543 28857 8697 -25132 -12231 -432 3132 18975 23039 32073 42805 30298 17227
19782 17227 20478 27714 41827 62589 51285 33032 24503 24380 21596 12760 25809 32516 25919
19769 25919 30638 19605 3350 11924 19297 16766 -152 1326 4490 -9932 -4279 -2847 -2588 1186
19755 1186 3059 5404 -2595 -15723 -35877 -41739 -35356 -8549 -8315 -14817 -20808 -16491 -11627 -4841
19741 -4841 2559 14767 19607 28001 43465 36145 28214 25600 17986 15098 14877 10313 17139 17754 17796
19726 17796 2133 160 7499 3659 -8618 3025 8690 7188 8107 22310 34413 26989 26407 8411
19712 8411 2794 -23696 -32401 -36251 -26660 -15228 6670 14610 16866 16022 17070 18086 23524 12619
19698 12619 3468 13271 16587 9024 21563 12967 -6378 -14059 251 14145 22462 10776 -1966
19685 -1966 -6442 -7317 -5242 3809 9898 6956 26910 14676 11902 13868 -7150 -6802 -477 23566
19671 23566 23182 15132 13160 4441 23222 17338 2763 7196 39828 48075 41085 33835 37910 33533
19657 33533 14607 -6509 1200 -14070 -7873 -7844 -7591 -11251 -6660 -8187 1655 14066 4878 9714
19643 9714 9283 1957 -14898 -2626 23203 31781 26746 3647 -1849 27992 40768 37150 8705
19630 8705 1889 24501 50179 39374 40183 20268 -1985 9766 18926 22627 21109 14873 1488
19617 1488 9637 6986 -11903 1594 3909 12749 18974 9956 -3631 10586 10014 14083 6723 4327
19603 4327 20833 4084 -2737 25419 43913 16269 -275 1828 15786 18816 9736 6366 20364
19590 20364 40162 21759 3593 -1960 -3 -8623 -11254 4073 24988 43887 28194 -1639
19578 -1639 -23994 -36474 -33316 -7507 -11000 -23571 -18897 -8576 -18262 -2163 5730 24270 33896
19565 33896 10381 18240 4115 -9556 -21020 -22786 -8390 -5508 11589 19108 12243 21090 11685
19552 11685 -2374 1095 -2949 -9024 -2920 -9863 -5935 2716 1593 5728 -17083 -13222 -10717 1493
19538 1493 8820 -2655 124 -2026 -4706 -3420 10509 13840 13823 6000 7645 -4561 -2795 2722
19524 2722 16017 22542 15172 9282 460 -6151 -22075 -11462 10536 4132 11899 34932 39805
19511 39805 30807 21551 9800 9912 2733 16593 39045 33883 26844 9918 10506 32411 13232
19498 13232 -4745 -11733 -1868 -7575 -11614 1193 4539 17171 34003 23258 10732 -1442 11897
19485 11897 16409 15958 33072 38319 15723 10403 11570 18725 16450 10735 21615 24861 36468 32472
19471 32472 1860 -9549 -5722 -1942 20884 19715 10650 -2992 3326 10681 16560 14522 11024
19458 11024 14528 28649 24058 6181 10155 -2599 763 332 -314 -176 -1565 -10614 -8736 -22525
19444 -22525 -33944 -26377 -5776 20371 14438 -24298 -32195 -9366 3531 1211 1036 11674 18164
19431 18164 15447 22394 24823 29655 31020 20165 16612 12714 9590 8169 28126 39818 53015
19418 53015 64235 79464 74570 52080 16269 19358 21257 34196 20252 2273 -4096 -10036 -10568
19405 -10568 -2929 -3162 -14994 -19880 -18436 2569 17330 19269 29599 21374 20312 8942 -7526
19392 -7526 -3106 4058 9878 12045 4530 -1779 3208 7113 5444 15601 22459 29049 20566 13146
19378 13146 21258 35380 29861 10649 12817 20402 9788 13099 11066 -2036 -8677 -10666 -10402 -1195
19364 -1195 14315 16435 33502 42491 21645 10691 18415 1343 -4661 20542 16884 14550 18308
19351 18308 24181 3928 1322 1709 5930 5764 -2421 534 29431 24615 34857 29428 8817 356
19337 356 5330 814 7630 16146 19009 5357 6912 12036 21156 34291 16625 11648 2428 10645
19323 10645 15675 3267 3441 -7727 -29745 -21650 -25522 -19479 52 24795 37655 35127 41271
19310 41271 43858 19779 29637 16190 3944 9946 18785 16621 13925 6318 3012 24301 27332
19297 27332 20851 1456 -19442 -19120 -9512 -11447 -16430 -11324 1811 16702 26682 20967 13204 14870
19283 14870 13783 -6937 -13776 708 9151 32456 38538 28872 16429 24617 36728 23251 3654
19270 3654 -6546 5273 16805 22412 20302 11474 7661 4424 3018 1894 19371 28346 15659
19257 15659 15757 14986 8869 10092 5683 3325 26266 27608 18400 7751 8430 17529 -7690 -25210
19243 -25210 -11469 -13709 -2091 8082 1089 -13364 -9970 25152 31283 22925 13081 11686 13222
19230 13222 16198 21238 33545 33070 37040 32391 24858 25200 26347 27062 -52 -1481 -4423 -17604
19216 -17604 -25661 -6901 12443 34832 42214 32554 16995 14753 8993 -1288 2010 18958 16776
19203 16776 15186 28153 33400 40611 43071 24000 19448 18351 18340 9001 12534 19786 11814 -25101
19189 -25101 -37236 -20932 -16889 -221 23990 28142 27490 29398 32647 40263 43909 49355 54562 40079
19175 40079 27376 17894 8963 14394 17612 14320 1357 22040 22831 -703 -7380 513 -32887
19162 -32887 -13961 4027 8747 -560 18489 39799 40289 42923 31189 16128 3266 -4199 12762
19149 12762 30253 38650 38406 41081 33897 34863 61789 68026 63693 50418 28224 29721 32494 38744
19135 38744 46392 46903 38915 44700 46443 44765 66723 78716 73565 41575 24688 46351 47023 43096
19121 43096 35347 30898 36643 29468 30165 20305 7569 21259 23077 23153 17759 26858 25172 15499 27705
19106 27705 38016 47234 66379 67240 50224 2944 -8359 -15656 -15067 5522 -5785 -1279 3754
19093 3754 -14891 -10297 13169 34210 30587 24181 26896 32843 22067 10767 -3403 -12157 5366
19080 5366 27311 26919 9770 7849 4439 22722 41316 48060 18317 16032 22576 20406 21710 30637
19066 30637 35181 38085 24027 17501 18193 23937 19513 15284 -6802 -7104 -9146 -20603 -20084 -5898
19052 -5898 11001 7897 -11726 -9684 -11640 8683 47884 71668 61591 29464 24587 13745 -9734
19039 -9734 -21768 -26419 -7833 4662 11248 11392 14829 23187 47186 18637 16248 40193 46622
19026 46622 45249 34272 42812 43566 24735 11838 349 -16586 -4278 1963 -6687 5865 5113
19013 5113 10232 25048 43640 51876 33306 24515 15359 -2362 -2740 -2614 -7908 10506 25963 33768
18999 33768 24073 19989 17542 19827 9807 20741 13112 -4841 -10435 11163 22378 29198 21987
18986 21987 27030 16029 -14011 -17983 3059 17014 28836 32315 19949 35949 65091 53698
18974 53698 56015 54219 74111 74491 61039 59393 54248 34686 27513 41915 31945 33967 35843 25890
18960 25890 25072 19905 20902 11278 36751 47351 52474 47046 30997 26169 24494 32526 28236 24944
18946 24944 29544 12243 18657 26132 21812 23709 30181 31514 28134 34727 26273 7262 -5563 -10887
18932 -10887 -14596 -1552 20638 32464 37623 27283 15858 31039 40105 37032 36679 26273 23441
18919 23441 29738 37956 46632 51681 45265 34245 8425 17421 35210 51273 56165 58852 28039
18906 28039 13441 10682 7747 18592 23194 20308 9166 5077 14162 29070 44805 42552 32019
18893 32019 17867 19985 920 -15857 -6211 8799 15567 15059 10900 17950 2288 2604 13034
18880 13034 13669 7240 6726 23279 37451 41331 46136 42458 34291 31824 29802 19715 17259 10479
18866 10479 27221 19791 7548 13957 31832 33312 18448 33369 65624 42407 42224 44643 23234
18853 23234 -1322 13445 27290 39361 55998 36064 44731 46585 61840 65806 32967 41264
18841 41264 57231 38436 31593 43076 47843 34619 32542 31496 33574 38364 32578 36660 39692
18828 39692 19147 33775 64951 72364 67683 79601 62541 48970 61507 59901 48459 48563 45382
18815 45382 38824 39074 40094 51691 46930 37367 21627 34233 49211 49724 54213 75031 61544
18802 61544 43440 38475 49246 55578 42851 33103 32006 26096 33143 27765 22313 30143 35787 46254
18788 46254 47450 39890 42701 51776 63721 71986 59867 52561 52737 54338 52074 53514 58242 55109
18774 55109 49783 46076 43954 73230 80524 70701 71421 90576 106804 116647 141281 160434 139432
18761 139432 102025 89776 74433 66374 65840 75938 62544 52706 41316 47616 41216 44921 36488
18748 36488 29958 45141 45828 45226 51081 51844 34741 37149 35063 30354 21624 43435 36835 37889
18734 37889 51199 57424 66762 47040 40134 54153 48530 60545 73283 70535 79777 91330 99471
18721 99471 101464 72445 58976 63683 72212 69563 64340 48733 36895 40703 38270 35360 34705 35091
18707 35091 52926 65778 58748 51733 47993 43564 33492 32807 39917 24801 20593 22950 15841 19642
18693 19642 39576 42079 54407 75778 76619 47728 31920 38944 50409 63510 63135 52045 37798
18680 37798 32264 50764 63068 65880 55163 34256 27004 23633 33167 40327 43249 52324 52388 47081
18666 47081 33218 36177 36098 47165 60171 73452 54566 31619 27384 48514 68088 86664 86369
18653 86369 80847 99365 109537 110675 122147 139478 147675 157709 168714 181119 172443 150376
18641 150376 145532 167075 186233 185277 171727 170505 159863 160892 180495 184200 199432 204408 180146
18628 180146 192629 187611 161371 162890 171509 168093 158729 150684 132695 148023 142283 145997 153496
18615 153496 149764 150345 139336 136469 154752 162827 174483 153388 143170 143423 134881 130647 133249
18602 133249 138013 143529 135521 138983 152668 156375 161942 142359 132977 133877 164382 186753 198181
18589 198181 204918 211785 226930 225896 234937 228726 233267 211950 184432 186522 193783 203591 197924
18576 197924 183567 181665 199282 225137 213884 194417 187888 180954 167810 170443 173910 149100
18564 149100 121427 120224 107187 103721 109405 110862 118382 113943 104977 96961 102130 86085 77785
18551 77785 83678 80166 85762 76483 71804 74747 64662 70621 97340 107984 103940 104081 93268 81217
18537 81217 80932 84864 82430 69750 61849 83382 104376 94493 73642 66589 84295 84564 94520 106904
18523 106904 124895 129536 128397 127273 97377 94528 107329 111039 99335 92523 107519 124824 147180
18510 147180 141483 142810 170461 151143 129169 130693 134875 129754 123110 100876 100321 110720 113138
18497 113138 113514 109010 109384 107473 103579 95710 98858 133746 146153 130165 118211 106704 91659
18484 91659 81461 79073 80831 75890 70011 61271 56766 79095 91365 89907 113117 112196 94185
18471 94185 91754 102156 111678 111220 109779 103584 94081 97605 134591 166811 150991 147482 158364
18458 158364 145147 143727 146784 157186 185067 176869 160498 157524 151285 140662 156967 152926 151174
18445 151174 145723 150936 133123 99379 83570 90973 109153 106105 94349 97527 106672 100893 92211
18432 92211 92887 90036 92040 99178 97647 84176 84531 89453 73329 78140 85073 76575 87926 89127
18418 89127 94522 104525 99986 90275 105102 114493 125606 116351 105397 126493 134939 134964 130062 121138
18404 121138 112536 120477 146652 148685 135843 131465 137086 150885 129933 127762 132617 124460 118089
18391 118089 121210 130106 131010 128409 142179 143920 132924 126628 116478 127123 120930 127218 136511
18378 136511 132956 131214 121376 129198 128762 121591 141442 146333 141759 162652 157577 146249 144815 159325
18364 159325 157469 139301 128856 135333 153533 160458 156291 136585 145834 172155 187802 172882
18352 172882 171862 170395 158443 143447 143025 149671 150683 148487 169919 171554 179204 197965 207129
18339 207129 203757 213600 224614 219747 192069 177403 184584 179656 171618 176342 185123 179394 168288
18326 168288 159448 161043 154838 166331 177406 187086 173962 170565 177580 188230 192262 183591 168940
18313 168940 161796 139349 138614 160582 167577 156274 159088 173907 192289 214231 221748 216905 215661
18300 215661 200801 196256 197000 197733 189074 173041 165553 178181 184374 183001 183750 200172 213729 216036
18286 216036 222313 237853 247295 219647 207822 222044 231967 226953 216911 224964 251387 256814 255368
18273 255368 262044 251698 239789 236970 242529 243311 247492 244039 252788 256805 263398 256146 260822 274167
18259 274167 265673 251253 268612 263041 276822 302390 311800 312268 301488 288704 289165 290095 294458
18246 294458 295779 295741 290346 278976 304794 326446 352013 353201 356712 342341 324899 298343 303462
18233 303462 333776 354101 372947 376459 380128 378199 363414 392453 389710 364539 379795 405288
18221 405288 416075 441611 443634 458300 462745 462120 467522 487902 494877 505979 498131 513113 534252
18208 534252 550677 558783 562886 553855 538039 539030 565341 589537 586084 579974 603293 620616 629406
18195 629406 661680 688863 749680 812468 882329 930999 956355 956614 937976 929555 936718 947056
18183 947056 956506 965524 1006965 1057463 1087781 1148452 1242791 1311014 1394041 1492632 1576283 1646126
18171 1646126 1739409 1843077 1966450 2132905 2371544 2710719 3124786 3622649 4148269 4632355
18161 4632355 5107632 5510578 5698417 5656324 5575373 5530246 5502572 5584695 5864582 6428093
18151 6428093 7404444 8953542 11285230 14573652 18860896 23964183 29245085 34012874
18143 34012874 38297205 41658573 42349663 40247683 37321014 34215231 30336347 26170554
18135 26170554 22893217 20840121 19673775 19093228 18909994 18892559 18884563 18633955 17740227
18126 17740227 16326980 14844589 13430792 11990691 10710076 9766503 9141667 8739143
18118 8739143 8497305 8382955 8334407 8366062 8528325 8810981 9254647 9983686 11248846 13456304
18108 13456304 17102341 22271637 28285689 34164537 36418459 32444950 27771263 25265149
18100 25265149 24133278 23213400 22293122 21783103 21912447 22766397 24620808 27694424 31928208
18091 31928208 37163270 42851397 47670146 50804575 52853585 53264441 50147452 44287142
18083 44287142 38369695 32901512 27350045 22345079 18585058 16062317 14443172 13385407
18075 13385407 12712226 12322865 12170361 12136335 12121104 12064014 11964709 11723004 11138651 10363467
18065 10363467 9619152 8900920 8207873 7602393 7122246 6716094 6410417 6161546 5928061
18056 5928061 5689238 5441876 5198455 4962826 4756622 4564380 4365707 4197591 4049374
18047 4049374 3899383 3792024 3691042 3579766 3463151 3369529 3295409 3222206 3144224 3067462
18037 3067462 2956826 2851368 2758376 2678926 2613012 2542859 2457122 2396013 2372159 2346275 2332948
18026 2332948 2306365 2263784 2191501 2108843 2021228 1932241 1839679 1770104 1719010 1658593 1627634
18015 1627634 1606719 1584147 1556295 1523726 1498270 1476946 1465768 1451271 1417282 1374866 1326492
18004 1326492 1275465 1225702 1159843 1123323 1098116 1051425 1012562 1000605 984684 958434 927416
17993 927416 900909 867476 827882 806568 788969 759480 747675 744585 742988 732043 708241 708103
17981 708103 725683 727283 713444 693865 680114 665420 666353 680682 687176 689102 685618 668607 643748
17968 643748 607869 593898 582264 567848 566668 554359 526708 511817 511584 505702 492560 466886
17956 466886 474880 461139 452788 436934 415213 390933 368926 357276 329921 289801 284159 296940
17944 296940 294337 285487 286091 287995 282256 254861 265382 296171 310071 324541 303168 289201 277180
17931 277180 280278 287297 298673 330967 327523 321324 333805 355004 366329 355644 356986 372273
17919 372273 358998 332079 306136 309523 286112 272064 277403 283539 284267 267744 269901 283797 269742
17906 269742 266383 283719 290869 268306 246195 231540 234654 250613 272900 271918 272555 273641 269593
17893 269593 262130 259977 267627 265475 275557 264640 264900 263958 259523 266910 266778 259496 260967 247097
17879 247097 230496 235974 260138 250816 242310 246456 255979 259931 243142 238885 228373 222017 207695
17866 207695 213928 216595 207202 213169 193561 177458 182417 170811 182346 210505 220761 219166 225206
17853 225206 238044 214379 227189 245618 247198 249031 247018 231619 226508 223372 246012 245039 240501
17840 240501 224991 222697 238505 230794 196909 197479 193286 202439 203384 191014 195841 206835 217864
17827 217864 208010 178232 165392 159262 156827 164376 173278 189542 175871 154156 136202 147648
17815 147648 163669 164696 154294 129057 123462 118919 108844 120724 139784 142568 121406 130268
17803 130268 112621 133118 146933 170995 175057 154364 140720 147048 147613 145101 166264 171576 152044
17790 152044 143650 162454 191870 205931 210298 206455 187738 167648 165603 166939 191753 192912 177279
17777 177279 161061 144611 128164 136809 149789 170804 160099 155152 151324 150846 161457 141260
17765 141260 138653 123653 140904 162630 160831 168683 180032 169839 152046 127897 124388 141347
17753 141347 152059 141102 119675 128556 135942 140162 141445 130455 126510 123120 109742 109252 136965
17740 136965 153254 155757 157374 154971 146909 141311 148536 171923 179199 159991 141766 149298 141090
17727 141090 161645 177656 180733 192611 181717 161931 156874 179043 191243 184135 172764 179411
17715 179411 189953 184196 178082 195420 201523 194295 169366 164245 171274 179990 199942 195996 185739
17702 185739 187078 175342 157238 159866 148174 150906 156270 155774 147403 154585 186791 198769 198462
17689 198462 201124 210296 221883 225586 240178 228816 230995 256244 255424 268853 251227 246031 252201
17676 252201 243828 224846 229932 230188 233395 226163 220014 226131 233409 254638 272945 268442 274695 282194
17662 282194 289508 286206 303147 322988 316054 306051 299924 313417 324708 326528 332293 326481 337287
17649 337287 343297 358457 377943 420267 418639 405952 390162 385525 387487 393091 378361 347963
17637 347963 332399 349471 367747 370121 361621 357999 358643 348662 362437 360556 371180 387148 407157
17624 407157 401605 388343 375619 380389 368988 378584 381160 374373 384425 400887 406880 408419 403223
17611 403223 404217 397913 399078 442867 473858 498146 521484 536189 526691 536868 540856 559926 583923
17598 583923 603844 621496 633842 619209 604918 602672 590336 581061 581697 583272 582450 578817 606169
17585 606169 641785 686532 723322 711784 705699 717020 703771 686295 686534 688839 691302 704121
17573 704121 697430 700958 701657 695913 691800 706518 726751 732009 747259 766093 809371 870943 929295
17560 929295 992381 1090236 1199909 1297981 1385394 1446791 1486609 1501607 1501117 1522925 1580385 1664790
17548 1664790 1762114 1905821 2129125 2421359 2774891 3214229 3803957 4538713 5410102 6282648
17538 6282648 6971553 7284260 7123275 6648669 6127610 5781889 5722990 5964555 6512570 7352865
17528 7352865 8557718 10300991 12839846 16630686 22178444 29735700 38906137 48298656
17520 48298656 55605535 58542790 56296898 50258424 42786794 35669103 29665098 25040559
17512 25040559 21864069 20075302 19501063 19893154 20905078 21993889 22532350 22001964 20318034
17503 20318034 17901362 15423286 13341118 11804519 10698866 9892360 9275197 8771340
17495 8771340 8375337 8062662 7829992 7658939 7559755 7523923 7543637 7598362 7687501 7870741
17485 7870741 8189964 8724214 9597232 10910883 12678056 14764633 16860863 18464959 19162289
17476 19162289 18814772 17856220 17006107 16849809 17705992 19706777 22941856 27396651 32890285
17467 32890285 38950605 44847214 49406570 51079941 48743977 42668512 34780437 27343420
17459 27343420 21572956 17588907 14980188 13233363 12010167 11118668 10449443 9946688
17451 9946688 9629819 9534761 9643277 9877777 10105810 10139580 9846291 9254639 8483349 7717013
17441 7717013 7064832 6534920 6114870 5789163 5519752 5272374 5057701 4859673 4671988
17432 4671988 4492428 4305930 4119216 3941738 3790860 3646226 3526647 3413614 3309879
17423 3309879 3217867 3131859 3058477 2980367 2892546 2810200 2732036 2671422 2605107 2524232 2443300
17412 2443300 2359310 2274123 2186957 2116362 2054024 1998032 1958112 1913375 1878205 1822993 1758914
17401 1758914 1697516 1650060 1605033 1562744 1523315 1504593 1469638 1421544 1388655 1358183 1320758
17390 1320758 1280895 1229987 1178818 1138982 1121196 1087409 1068005 1039500 1001442 964438 920451
17379 920451 911515 883512 865696 855204 828498 814614 795678 761062 738467 735555 726398 709168
17367 709168 692410 671295 679821 686002 673623 667357 670720 684919 684727 694032 697939 685467 664217
17354 664217 633220 607232 594081 563608 545723 515033 487213 465229 459703 477635 482839 463969
17342 463969 469478 476431 480581 455397 461642 468810 473642 465201 451981 414031 396084 381420 357681
17329 357681 328286 312088 292814 296224 286085 302039 298180 288436 294329 297632 298942 301515 302775
17316 302775 300387 293988 281352 273805 265585 251124 267692 283629 281198 272798 259255 275052 297939
17303 297939 317158 321087 315940 314780 301677 285761 267810 279462 278961 264611 277708 271328 253141
17290 253141 252590 252292 249924 246571 246861 249559 252059 271254 288915 303855 286313 275293 285758
17277 285758 265051 241423 222667 206016 202074 204248 190849 176620 177558 165541 165994 177976 182956
17264 182956 191236 188652 190817 200169 182108 187127 192612 184882 194933 200852 176380 162011 137905
17251 137905 134501 124826 115814 114615 129568 120627 131430 138854 144815 135310 135990 143676 130074 102587
17237 102587 88441 95956 90659 104842 109431 95178 89283 88579 83781 79518 77132 68321 62781 59641
17223 59641 55474 75897 93021 114115 111056 89380 75675 62637 58181 58549 71063 75670 79585
17210 79585 67193 72030 101741 94061 95886 105421 116368 112115 92008 80742 72225 50773 31864
17197 31864 42096 51809 68763 64784 56266 29623 17136 27852 20700 25937 21777 20453 12079
17184 12079 25561 42389 38356 32637 29475 19131 21924 13647 10430 7190 11975 4919 491 3927
17170 3927 2793 23221 44541 23788 3555 -4705 -1668 -2879 -12869 -10664 5325 8946 11436
17157 11436 21194 20072 30654 17869 18203 23235 22033 26471 20296 -2396 2036 5333 3141 14370
17143 14370 9813 11387 17755 12890 6299 7850 -2623 -24197 -3154 16483 22450 11890 8306
17130 8306 15956 16408 24643 46333 41446 24861 13261 -4148 -15333 -21029 -8625 3808 10863
17117 10863 -504 13969 26148 16811 9617 4442 -13821 -24036 -8851 25476 28335 34927 37851
17104 37851 28114 19230 18687 30501 29030 11820 1839 14060 14749 28834 31030 19094 -3837
17091 -3837 -19224 -21053 -12398 541 19918 12347 -9943 -12655 -9306 -11325 -1841 622 8060 8934
17077 8934 -4562 -11658 -15272 -13341 -8546 -26315 -34038 -14961 -20692 -5540 -1705 -4625 6349
17064 6349 -6456 -9597 11715 35471 40080 12231 -2360 -8126 -6249 553 9803 22019 15289
17051 15289 5218 5883 23168 32647 29261 31861 35116 23143 27268 27742 27664 33272 38415 30496 31095
17036 31095 26536 19985 2381 16616 41937 50111 34881 30354 26919 35598 50737 72139 102260
17023 102260 126717 139201 134347 134580 157210 174370 164346 169510 175271 178977 158580 142816 137432
17010 137432 150531 178955 199692 221034 228408 248911 227221 200243 170677 140563 125782 97540
16998 97540 118506 121156 106399 94726 80881 87715 93202 93875 100979 115049 92385 75939 77110
16985 77110 75314 68839 65703 52128 57622 70887 42277 30885 42022 62693 68903 77610 90909
16972 90909 102398 114043 117663 129998 135787 161910 174400 161590 145834 127184 102679 90258
16960 90258 92656 88298 76382 58192 41861 63159 83966 107750 127079 141951 145510 157853
16948 157853 159738 149815 135281 97959 74199 76698 61321 49200 48028 21753 -3512 623
16936 623 25131 23695 19541 14244 28936 23793 10212 15096 41610 66128 64990 32941 11389
16923 11389 14062 37128 44206 53200 64047 82636 84821 89321 72076 63490 80198 65842 65986
16910 65986 76469 57855 60281 72264 78475 95670 112019 98142 100015 111071 115356 111999 94742
16897 94742 78683 54998 48966 39970 10629 15852 42925 37474 22410 19128 11756 -2981 -6824
16884 -6824 16476 18252 13504 23452 32384 22647 4607 -7877 -2177 -15333 -35404 -38223 -22883
16871 -22883 -17239 -32615 -47339 -50091 -33775 -34648 -27837 -26455 -36383 -38775 -36334 -32453 -19764 -5481
16857 -5481 10921 20214 12937 4216 -7864 -17359 -15643 18561 29751 18341 -3390 389 -11636
16844 -11636 -28609 -36395 -32689 -15570 -2557 -6631 -8084 -3128 -24602 -31363 -28871 -37695 -28075
16831 -28075 2554 11368 10559 8046 13831 12691 11417 1730 -21291 -20117 -11033 -9998 -35006 -43416
16817 -43416 -26620 -12568 -2363 -23807 -22310 -2801 -12824 -35172 -27827 -9497 2529 949
16805 949 4967 16051 16931 10270 7492 4368 -14758 -17202 -11594 -27988 -43183 -40421 -35554 -30421
16791 -30421 -18313 -15964 -17469 -13037 -11335 -12914 -22237 -43066 -33268 -13625 -20543 -11461 -3213 8586
16777 8586 -10038 -21754 -33527 -47621 -30249 -20790 -9770 -1776 -10822 -21249 -26828 -17967 -16506
16764 -16506 7436 6768 12595 32648 30477 -146 -7110 2549 16242 -3490 -20158 -17121 -24631
16751 -24631 -7220 -5073 -2982 -16462 -7269 -3997 -4342 -10371 -20334 -26347 -11706 18134 27888 25619
16737 25619 21131 12481 11194 -4239 -10952 -30287 -16076 -11827 -1988 16241 8659 -15936 -15932 17642
16723 17642 18045 -2774 -7527 -9811 -13786 -33121 -24434 -14723 -8945 -6958 6865 9124 7209 14461
16709 14461 19886 12826 -5484 -9274 -11653 -14825 -26953 -37964 -37758 -39324 -46526 -58430 -60238 -40560
16695 -40560 -20574 -6811 -13038 -5888 -22962 -39744 -23936 -15645 -8855 447 -9590 -23409 -27123
16682 -27123 -14471 -8128 -9637 7093 48 -12744 -26282 -30346 -28552 -32998 -40111 -46020 -30848
16669 -30848 -22788 -27314 -23489 -28033 -21929 -15849 -21522 -22778 -17103 895 1810 -15093 -6580 -4842
16655 -4842 -18095 -26467 -41637 -39775 -29919 -32152 -27672 -17562 -21783 -18808 -15581 9458 9923 -10880
16641 -10880 -22360 7051 12665 820 -22440 -20594 -100 16072 1787 -16304 -15512 -5445
16629 -5445 -674 3466 4848 -346 187 -21864 -23764 -13286 -9461 -16862 -26181 -22795 -11788 -5091
16615 -5091 -3183 -9749 -8816 -7715 -20070 -25008 -15800 -1716 1401 9806 8738 -10653 -25603 -31604
16601 -31604 -45988 -32150 -10430 -11151 -19096 -25844 -22744 -24509 -39256 -25670 -22932 -1326 14652
16588 14652 1523 -6816 -7535 -6304 5796 -5107 5004 10111 1953 -9917 -29723 -34573 -31004
16575 -31004 -27173 -24696 -15415 -742 -7763 -20008 -16676 -10995 2845 33781 58684 59932 55847
16562 55847 47552 43467 26489 14331 2175 15075 13569 5427 -9695 -17030 -4309 1208 10412
16549 10412 15083 25518 36000 46691 61938 56701 26547 1660 -3574 -20891 -30753 -12492
16537 -12492 -14148 -12195 -2041 6462 17930 23060 13764 2781 15078 18808 -399 -14948 -16091
16524 -16091 -23919 -11866 -9636 -5537 -13596 -9291 12652 -1314 -2853 11276 15301 23023 31197
16511 31197 70269 102460 101831 101627 104372 89980 69137 43597 22798 11571 11003 20762 34462
16498 34462 42677 39635 36555 1898 -23052 -28226 -4981 26069 28264 11187 2847 -3693 -2340
16485 -2340 7993 30205 29826 13656 -6648 1266 14806 29836 29621 27983 24507 25760 23129 32103
16471 32103 34245 39067 39148 40147 31421 20095 4795 -2511 -3669 -4172 1031 2360 -1270 4637 12125
16456 12125 23556 36438 25227 9825 17040 31968 -491 -2824 4592 8980 10050 -11626 -39767
16443 -39767 -54355 -34591 -22549 -39886 -29837 -18771 -16432 -11918 -10495 -1870 -14609 -25858
16431 -25858 -47699 -49284 -24334 -19788 -25775 -21389 1996 8383 14739 27663 31719 24642 12533
16418 12533 -2246 -9378 7794 -9293 -19734 6243 24052 35810 59087 74967 70576 43811
16406 43811 31558 9012 -1261 7382 28579 43923 35611 13530 -4477 1876 8470 15239 7397
16393 7397 -12364 -19141 -11431 -21102 -31212 -28795 -25377 -9867 -11753 -13635 15662 8836 -11825
16380 -11825 -6459 -7323 7234 4169 5730 17821 23656 11009 -4801 -5519 8134 5274 -631 -8164
16366 -8164 -12624 4913 5487 4493 5423 17001 42348 29089 3060 -2305 984 6234 -356 -12483
16352 -12483 -20992 -26209 -24267 -22274 -30165 -33899 -29281 -23406 -25233 -42517 -43552 -23593 -17209 -20661
16338 -20661 -26226 -14486 -14967 -15452 -14629 -19077 -28233 -20169 -4061 -6015 -3440 19477 22879 15872
16324 15872 4264 12817 640 -18833 -11006 -446 -1423 -3017 -1668 -4142 -14414 -3795 -6177
16311 -6177 -34351 -50426 -68666 -57911 -26140 -9916 -1883 -15695 -22397 -28758 -28510 -27464 -40337
16298 -40337 -58766 -50520 -36836 -28179 -38945 -33557 -32548 -45363 -31524 -4910 5046 -9996 -32448
16285 -32448 -40603 -24772 4394 9796 -1181 -3926 -2733 -795 -18096 -15907 -9517 -8336 -2755
16272 -2755 -1181 -6498 -26635 -36137 -41304 -37452 -32603 -33247 -29295 -33477 -35420 -34337 -21603 -26625
16258 -26625 -38493 -35903 -23356 -18794 -33750 -30736 -26164 -22564 -28566 -13148 -7947 -11760 -9445
16245 -9445 -36480 -26928 -16853 -8624 -7837 -22273 -13322 -4408 -13967 -23768 -12009 -7784 -8168 -4499
16231 -4499 -25156 -31314 -31033 -29815 -22186 -16846 -7999 -2890 -7067 -13530 -12650 -11518 -10505 -16065 -14815
16216 -14815 -17923 -30388 -16532 -6853 -19080 -30999 -19835 -16692 -29842 -26622 -16775 -24767 -45883
16203 -45883 -53404 -43885 -25716 -15443 -14241 -14658 6618 7470 -12303 -27856 -11450 8478 26796
16190 26796 41848 21109 2831 -11691 -21049 -25275 -27677 -22016 -15105 -20934 -41570 -52403 -52010
16177 -52010 -28396 -17413 -34063 -37821 -25697 -28746 -30666 -38740 -49219 -48812 -34248 -8559 -6072
16164 -6072 -5672 7828 13363 13486 2864 6805 22992 31028 16339 5559 -2953 -5442 7732 9257
16150 9257 -2619 -3305 -9624 4275 14346 6189 -24532 -34329 -30231 -30467 -21980 -19160 -25385 -21567
16136 -21567 -16162 -9000 -5099 -4599 386 -8667 -29881 -40052 -39214 -24690 -29903 -43993 -47696 -37448
16122 -37448 -20793 -15637 -7705 -3757 -5745 -19448 -13196 -13098 -24739 -33263 -23702 -11568 -28351 -46919
16108 -46919 -39226 -34561 -18670 -18886 -10599 -24576 -40524 -30788 -19042 -12019 -5434 2567 -1985 -17396
16094 -17396 -24107 -13510 -20440 -17619 -9370 -5828 2994 11555 19222 19195 5346 -20150 -28773 -21502
16080 -21502 -1195 3349 -4999 -7065 -6492 -14492 -17374 -8014 -14467 -11794 -1656 3050 -14672 -21691
16066 -21691 -14296 -25496 -20742 -14512 -20155 -29732 -27998 -31621 -34417 -30870 -24672 -32866 -39270 -38879
16052 -38879 -37377 -35563 -32722 -23204 -15901 -7852 16249 32009 34024 16460 6442 5527 2723 -9781
16038 -9781 -15048 -22578 -33809 -35874 -24468 -8638 -6697 -13695 7060 8166 467 -27781 -43621
16025 -43621 -30539 -31080 -52782 -58300 -56495 -46216 -36768 -19404 -11768 -24166 -34488 -32610 -41087
16012 -41087 -31395 -30982 -24218 -5668 -13359 -10374 3247 5968 5140 4009 4911 20254 12307 1076
15998 1076 -13444 -23534 -22454 -5654 -3530 -29075 -27312 -36262 -20661 -32143 -19412 -20133 -39750
15985 -39750 -46836 -30467 -23993 -5252 1032 4963 8157 11248 1855 11089 -15004 -4135 -75
15972 -75 1316 2884 16755 19434 9657 -11108 -27283 -25042 -25163 -30421 -32851 -29003 -21234 -25467 -33999
15957 -33999 -39873 -43708 -31251 -6177 -4144 -10842 -20550 -13300 -4084 -507 445 -5174 -17652 -8818
15943 -8818 5264 6328 6690 10037 -5264 -11180 -7728 -6771 -18136 -13845 15385 8128 -17110 -30856
15929 -30856 -38332 -34257 -31305 -46314 -53089 -29735 -1782 8841 27 -9026 -13663 -12756 -29613
15916 -29613 -36508 -35496 -41943 -40129 -45280 -38288 -19227 10000 14309 11734 -915 -2797 8044
15903 8044 22418 17544 17534 9810 -12035 -43954 -63501 -34488 -8929 -11380 -32128 -32322 -11532
15890 -11532 -20616 -9529 -22513 -30407 -40132 -46764 -46921 -45161 -20494 -10992 2973 9940 27993
15877 27993 23046 4988 9464 1346 -16677 -17428 4732 886 -428 4099 -3029 -2182 -10990 -19463
15863 -19463 -21528 -31338 -12066 -9947 -18080 -23300 -20230 -17149 -14827 -16640 -15811 -5432 11228 10357
15849 10357 11373 18756 17950 1302 1301 -9135 -577 2846 -7537 -17416 -19348 -32798 -27854 -29920
15835 -29920 -38852 -47058 -49196 -45162 -34141 -20626 -13071 -36533 -54078 -36577 -23705 -30179 -26190
15822 -26190 -32294 -25372 -31437 -36568 -18014 14454 28742 18148 11535 10671 1735 1761 1048 -9905
15808 -9905 1344 -4943 -4314 8918 11504 1887 -17475 -34048 -6679 19750 12907 4966 -7161
15795 -7161 18734 45584 37394 9605 7476 6393 -7299 -627 11944 4242 3826 -6801 11374
15782 11374 17484 -13390 -32459 -28693 -2963 -3236 -18155 -25083 -6949 -11044 -27250 -15900 3033
15769 3033 -5406 -12932 -26961 -73011 -74040 -49924 -31767 -29543 -15384 -13643 -25676 -27865 -19105
15756 -19105 -15155 -4912 -3202 -15216 -17078 -21220 -13514 20271 7873 -8031 -5892 -13930 -4472
15743 -4472 11453 2221 -15297 -24148 -34672 -49082 -53112 -54672 -45901 -33694 -26485 -21945 -35457
15730 -35457 -34896 -25667 -35232 -39257 -39147 -15188 -5442 -610 8867 3458 7643 27754 21193 12176
15716 12176 -5656 -14640 -21455 -24713 -29293 -28194 -29590 -27673 -25635 -18789 -9619 -8098 -10379 -27986
15702 -27986 -24529 -15628 -6231 -5047 -22457 -19731 -8403 -11173 -31602 -31597 -25340 -29167 -43111 -43303
15688 -43303 -54095 -34379 -11771 -27008 -32127 -20705 -15194 3813 12611 14938 20985 8384 -21621
15675 -21621 -14016 16096 18383 1170 -9771 -16158 -8496 5353 -585 -10860 -7056 12203 28864
15662 28864 30026 28824 20391 11764 13411 -19195 -11367 6284 -8979 -6917 22469 11432 1239
15649 1239 -8465 -2755 21728 25831 13385 -8518 -1832 -5537 -10282 -17955 -15589 -4790 -9735 1233
15635 1233 -9753 -22294 -41455 -48189 -39118 -30928 -32539 -30319 -16439 4301 4979 -9381 -7605
15622 -7605 -4115 -23010 -28003 -27975 -15395 771 -10405 -27066 -37083 -25643 -20449 -33253 -39193
15609 -39193 -23554 -21894 -17028 -20087 -13539 -10775 -19404 -16936 3328 6649 -1746 4581 7306 6585
15595 6585 8035 -7148 -32690 -50250 -51822 -52561 -58358 -51078 -36237 -28730 -14645 -14760 -39772 -42571
15581 -42571 -32985 -23281 -38891 -39963 -18748 -15079 -14262 14651 13881 14362 -7846 -26215 -43513 -51733
15567 -51733 -41370 -36418 -29348 -27778 -34818 -29778 -20162 -14924 -12629 -9364 -15180 -18021 -35357 -36116
15553 -36116 -21343 -20011 -24527 -26970 -21851 -6251 -1060 -2559 3710 2968 -10423 -1919 -1578 -25561
15539 -25561 -30359 -36242 -36991 -20870 -6523 -848 6049 -2914 -30000 -39624 -51421 -51613 -30811 -21026
15525 -21026 -20395 -24813 -34696 -32489 -30230 -35253 -17778 -4366 8777 -4103 -1512 25794 32558
15512 32558 39002 32505 -6249 -14262 4059 7958 5772 -2606 -8779 -20895 -11635 6119 -10561
15499 -10561 -17267 -8967 -20332 -12086 -15885 -28344 -28494 -16737 -2168 -7536 -23222 -25921 -23798
15486 -23798 -24455 -45042 -68049 -48375 -33302 -29321 -16128 -6381 -3804 -24109 -22313 -8210 -21788
15473 -21788 -22782 -20549 -32793 -23071 -10198 -14068 -12392 1014 7885 1548 -2397 -9063 -29346 -13927
15459 -13927 16157 20780 11291 18759 28860 45364 27779 -1219 -9009 -7255 -1867 13093 10396
15446 10396 6188 -11327 -4051 -2595 -27527 -37545 -18517 -11542 -23919 -29246 -21322 3602 -4496
15433 -4496 -14515 -18001 -25463 -21791 -7182 3602 31177 19930 4927 -2621 -17295 -19946 -20800
15420 -20800 -21559 -22292 -40915 -38709 -37703 -26456 1547 11543 9682 7009 6282 -13603 -37928 -28346
15406 -28346 -31243 -24832 -28007 -38351 -40379 -23251 -1455 3120 2021 4324 4417 -10642 5923 257
15392 257 -4008 1427 20789 21774 6399 677 -19332 -37267 -38398 -25254 -26818 -24033 -11485 5859
15378 5859 -630 -25572 -19310 285 11805 2966 -4070 -7034 1934 -567 -284 9803 1977 -845
15364 -845 3009 -9299 -12736 -20544 -36998 -28729 -7511 -1543 -16726 -11026 6791 -16151 -17622
15351 -17622 -9246 -3325 -6766 7346 2325 -398 -8490 -22382 -23526 -27409 -37436 -34563 -28503 -31753
15337 -31753 -32773 -28974 -39318 -54586 -46702 -38121 -24470 -20065 -22001 -30790 -27311 -30504 -18156
15324 -18156 10853 18519 7642 16064 10918 7569 4809 22302 31612 1073 -29996 -51933 -41289
15311 -41289 -33570 -25091 -24870 -46226 -42138 -23476 -24379 -34462 -28703 -50469 -69287 -63898 -57174 -33699
15297 -33699 -369 -10729 -39446 -36440 -35762 -42640 -31459 -25528 -16583 -16749 -9907 6383 14579 3581
15283 3581 4269 7606 21941 14525 502 1052 12036 4748 11679 11991 4819 1151 -6766 -22011
15269 -22011 -20689 -25884 -33906 -43585 -40571 -48632 -51974 -38223 -20786 -14835 -29875 -34370 2937
15256 2937 21697 15661 16837 20190 14323 78 -13384 -2099 -4869 -5372 8396 6592 -1564 13964
15242 13964 5442 -10296 -21786 -30437 -13341 -27377 -41803 -61811 -51629 -26523 -27267 -46364
15230 -46364 -50352 -24594 13311 16288 -5601 -16555 -18138 -19222 -17672 -35740 -34634 -22843 -18680
15217 -18680 -20980 -29230 -23292 -12883 -6961 -6303 -40465 -57478 -53524 -51253 -60321 -38974 -15405
15204 -15405 -19768 -32130 -24286 -5719 -35499 -53367 -38735 -36101 -20075 -10742 -17225 -33365 -21800
15191 -21800 -41788 -54660 -39815 -32723 -38457 -33233 -16122 -27131 -27812 -8013 -16782 -28983 -40502
15178 -40502 -26194 -24216 -18634 -19059 -18534 -8288 -14362 -14491 -11559 -22833 -40105 -47008 -39719 -38721
15164 -38721 -55374 -58760 -55854 -36759 -24865 -37236 -36463 -23609 -28787 -40213 -22358 -16216 -33514
15151 -33514 -43211 -37153 -25439 -21258 -14907 -38784 -54845 -42777 -39650 -28933 -27723 -30136 -32822
15138 -32822 -9356 -10047 -30976 -18074 -7386 2002 -16620 -31175 -26960 -8776 -11728 -21077 -35403
15125 -35403 -17131 0 -2490 -6588 720 -17527 1025 3344 -49 -5610 -10385 -518 12796
15112 12796 71 -5056 -3888 2082 17236 3434 473 -8465 -12289 -10963 -12107 -6225 -13673 -22607
15098 -22607 -36977 -42383 -7442 3508 -4432 -7486 -14317 -23679 -17925 22134 35821 19556 22722
15085 22722 24530 19212 31367 27222 24948 14939 5277 13480 31978 29491 10718 -9318 -17476
15072 -17476 -34819 -64769 -58589 -49010 -50086 -34859 -37666 -34510 -14788 -13217 -27758 -34732 -36801
15059 -36801 -18561 2871 -8286 -14323 -26586 -35956 -44177 -42645 -20610 -8388 -426 -17216 -36456
15046 -36456 -42920 -34916 -15575 -28948 -29413 -13196 -5125 -6680 12928 7653 15972 14198 -11028
15033 -11028 -32249 -56656 -41704 -15166 -7045 -5053 -14152 -19411 -15396 -15730 -30555 -32564 -29978
15020 -29978 -61751 -73739 -65590 -51820 -33724 -18265 -4823 -15741 -5150 -14538 -28164 -32406
15008 -32406 -34803 -47431 -54940 -40294 -10423 556 -36952 -53478 -51847 -30457 -13127 -4408
14996 -4408 4834 -7480 -28247 -13913 -1780 14935 -1390 -9658 -2590 -497 -15383 -27971 -9636
14983 -9636 -11856 -22273 -18263 -4960 -1472 -19526 -27120 -25321 -33722 -17715 -12199 -29427 -32254
14970 -32254 -14069 -24466 -38139 -46201 -35264 -26464 -10499 -15055 -39646 -20521 -3396 -10195
14958 -10195 -21529 -18193 -14748 -5524 11949 17633 -11437 -15983 -5519 -6675 -20309 -7427 17065
14945 17065 16097 4064 1215 13839 278 -5022 15469 28157 20648 -3501 -20639 -12575 -16655
14932 -16655 -42353 -51178 -42264 -20072 -19552 -2168 -12429 -17279 -16609 -19078 7560 5440 13304 6184
14918 6184 -26650 -32576 -48846 -40662 6182 11500 -1511 -7769 -8940 -19645 -18819 -14408 -6165 2258
14904 2258 5354 -4659 -7935 691 -13690 -34229 -14789 -7395 -2924 15990 9357 -87 -13007
14891 -13007 -34918 -37139 -36519 -28567 -36974 -51848 -41677 -42551 -68126 -70857 -58609 -35621 -28032
14878 -28032 -29601 -41976 -31682 -18437 8562 3185 395 648 -32 -7823 7661 -12033 -29583
14865 -29583 -32057 -29381 -21082 -34000 -32081 -13726 -10729 10983 -4313 -2793 -6296 3153 15803
14852 15803 10225 -13653 -35219 -42742 -26602 -17721 -36623 -36966 -30960 -39605 -39934 -42268 -35190 -39895
14838 -39895 -39694 -28945 -23116 -18008 -30971 -32963 -33312 -21741 -14026 -24334 -32665 -28246 -16590 -11628
14824 -11628 -14916 -30181 -43513 -43089 -40877 -30551 -13338 1743 8161 7853 2060 -17824 -23852
14811 -23852 -25434 -32096 -34372 -9589 1705 -12230 -12665 206 4505 -4977 5269 -1596 -1245 -238
14797 -238 -2894 -14412 -8737 -29539 -46918 -23836 -11898 -11035 -13716 -5945 -5348 -13306 -23090 -29152
14783 -29152 -34509 -31112 -17554 -18016 -13020 -13064 -22499 -10273 6835 5265 -12511 -22042 -10174 7888
14769 7888 3118 3451 6674 739 -416 3971 4195 -4814 -22664 -21982 -29473 -17982 -6680 -7894 -1440
14754 -1440 -28825 -50046 -37309 -9210 1798 11237 14332 4766 2359 -468 -12936 -14457 -30959
14741 -30959 -28893 -24486 -25124 -12644 -10919 -23246 -40008 -26878 -31235 -45290 -28293 -12357 -17814
14728 -17814 -25063 -15454 3656 9189 13731 15420 2629 6082 5554 8557 5020 4888 12803 9347
14714 9347 -4934 -11956 -31962 -31010 -31249 -27940 -28147 -40017 -36354 -22330 -18652 -8662 -360 9240
14700 9240 19618 4975 15830 -7431 -33644 -28598 -26845 -24226 -4645 14001 16051 7146 -17730
14687 -17730 -22235 -15432 5005 22714 10538 15829 22330 19138 16784 2439 -10549 -20794 -11225
14674 -11225 -2255 -7713 -41000 -43616 -19863 1468 3835 2748 -9279 -1915 6923 -16410 -9524
14661 -9524 -18205 -26756 -22981 -10450 9525 12669 -5610 -14317 -8420 -1709 -4668 -10548 4607 16096
14647 16096 17983 3926 -15096 -28084 -39956 -28415 -9931 1746 4221 7977 18889 19118 4176
14634 4176 -4930 -15491 -14681 -15583 -26113 -13250 -6344 -2667 -5233 3228 7604 16080 19522 24584
14620 24584 9677 1401 11060 10635 -5808 -26513 -18141 -30547 -20131 -18315 -34320 -30463 -20014
14607 -20014 -10126 -23842 -19659 -14258 -22123 -28913 -29753 -22239 -6187 -11246 -23273 -18740 -6773 6313
14593 6313 24723 33784 40746 37237 38309 34406 42840 48088 47908 55799 68891 65178 58957 62717
14579 62717 70990 69833 82258 100422 121349 163410 226993 258531 317575 422952 570058 723988
14567 723988 867788 998104 1072044 1084859 1036371 953048 822539 692259 557093 447798
14557 447798 344863 266838 212081 189921 189136 193906 191933 171230 163786 150158 139980 142175
14545 142175 128637 102962 82226 95596 89451 80128 85366 65394 75075 93131 69866 46464
14533 46464 55994 88709 92063 72773 63058 63405 71896 57379 56688 48535 51162 58694 55647 25506
14519 25506 16300 24604 19968 1501 -1899 15824 13555 9596 22799 25859 4135 -2018 3746
14506 3746 17440 27137 27221 33182 45445 46314 39149 29908 34664 18495 32302 27033 16860 17540
14492 17540 11518 14457 17930 22853 14065 37184 37203 28029 19371 3843 9405 27297 32724 32478
14478 32478 43508 33084 23214 11394 5292 8484 1885 10882 25947 13453 5240 11346 2171
14465 2171 2623 14325 6593 10429 24421 20716 23194 -12909 -32242 -30861 -11065 1616 8837
14452 8837 23042 13247 4731 -16485 -13794 2887 3649 11236 16933 22465 23379 19610 19121 18621 17087
14437 17087 19227 14227 255 1941 4200 10390 10277 12879 14091 15757 19956 12765 5735 22233
14423 22233 40429 35093 21221 15578 21358 1304 -10048 -18934 -15957 -11140 7399 25116 18350
14410 18350 -1665 3181 16008 26055 18019 19233 674 -3027 -7569 -6541 117 1499 335
14397 335 -1422 -5942 -22356 -28745 -11159 12300 15063 15128 2484 12934 21210 25636 34443 32518
14383 32518 10351 5113 -17975 -9107 4451 21523 24497 27349 17355 13206 21353 38464 57903
14370 57903 44153 25385 22788 10744 22020 40192 33464 26731 14334 5357 25404 48132
14358 48132 44391 22279 16123 33901 43481 45267 51322 46801 56716 51846 47799 32392 8179
14345 8179 8793 10032 11604 18494 31136 35031 49451 76389 98432 152610 208949 264329 317285
14332 317285 393763 479571 559010 599128 613450 627450 618719 561738 476557 381073 313286 238529
14320 238529 190374 186381 179138 162080 141440 135613 130600 117655 103693 107558 97419 81590
14308 81590 61467 55797 60733 77625 75274 65165 57128 61970 71246 78816 74778 87743 87357 81209
14294 81209 84348 74705 52725 53473 48944 58384 59305 45095 31326 24488 33371 31426 37181 40860
14280 40860 35783 22246 23780 35495 26735 17601 34041 52102 48074 41251 35840 27053 35115
14267 35115 50954 39127 26861 32318 53783 60359 44589 46038 48008 36191 11921 12172 14809
14254 14809 5945 3211 780 8818 3949 2419 24099 32793 29630 23245 40928 53688 55612 45326
14240 45326 52986 60491 54565 55547 46003 37015 39169 52086 58929 52876 76916 100092 93647 80621
14226 80621 98935 90341 81108 63227 60992 83154 90473 114326 117940 108377 119550 111769 108413
14213 108413 85936 82496 75717 77505 80124 83138 78556 65682 78097 70746 56961 42553 40801
14200 40801 40793 51571 51660 44340 27296 15839 -1607 -4985 12828 31744 39931 31678 40204 25599
14186 25599 13370 21030 24856 32571 32868 39698 33559 15926 9473 26142 36624 22963 -232
14173 -232 4056 23234 20013 -338 15567 21001 9819 26342 31067 13490 5793 6772 16489 13154
14159 13154 17046 34740 32863 22348 31688 39949 64095 71360 55467 50737 40055 63501 68742
14146 68742 58814 54900 73331 73439 49309 38233 50705 66670 71594 77263 99341 109691 110513
14133 110513 117058 121437 130517 101977 84280 75708 71377 50893 36531 36958 56158 69418 54128
14120 54128 51000 53241 52660 30262 17841 44635 52539 36101 26634 33181 21562 18383 19743
14107 19743 28301 25933 26313 36067 34758 57596 57822 71473 55395 51801 53602 56161 58771 65394
14093 65394 66382 72304 60530 56214 57357 59103 57569 76493 79719 52891 62815 73241 78757 62638
14079 62638 83680 96048 71911 70132 71682 95443 99570 95601 81495 64470 51924 56870 59780
14066 59780 41577 29790 9023 15922 35735 31706 19484 27733 32046 12854 -3323 5069 15922
14053 15922 16143 3109 10126 26505 53079 36034 31669 33632 23303 10931 4114 14844 11623
14040 11623 10002 29133 43060 64884 81393 93564 100630 88423 97782 92970 102133 118942 126827
14027 126827 105915 94929 99765 105486 130178 130698 134563 131513 96866 93743 106647 126080 137564
14014 137564 152668 173834 181945 185768 187903 186671 195065 191503 177859 180477 192316 177946 185616
14001 185616 204401 201213 189791 187048 181133 188350 190149 199717 197331 194052 195108 215069 210172
13988 210172 199892 183528 181546 206014 199530 191885 217895 232836 225061 226413 233943 225841 243466
13975 243466 221074 207532 210477 203019 202921 223950 249909 263758 263257 256074 239402 229589 230786
13962 230786 243068 262020 260891 257828 247232 242799 260117 262899 261658 271329 261814 257752 265651
13949 265651 284324 299874 313850 318521 337321 356353 343969 350861 355834 362211 376979 389062
13937 389062 410446 419527 430382 457270 483602 501757 523127 534315 547039 569415 584614 594105
13925 594105 623664 661107 695243 731184 756867 763292 809219 845188 889049 955811 1016281 1075955
13913 1075955 1183976 1296676 1394030 1509741 1620670 1738468 1888118 2075897 2313158 2571719
13903 2571719 2858613 3245598 3704617 4240546 4906106 5667261 6501890 7447384 8546187
13894 8546187 9867905 11563282 13864652 17151018 21933676 28841520 38350701 50527074
13886 50527074 64684621 79459656 93347781 104912446 112669887 115257427 112034889
13879 112034889 103832573 92378831 79342000 66010017 53605774 43229365 35464623
13872 35464623 30090456 26368626 23686129 21639942 19976401 18552474 17304514 16152461
13864 16152461 15108977 14149636 13269872 12478355 11768015 11148941 10592473 10090933 9635710
13855 9635710 9223147 8821292 8442709 8109083 7793194 7476893 7209563 6957608 6703301
13846 6703301 6472605 6244993 6048482 5863271 5677584 5515186 5358713 5221937 5086741
13837 5086741 4958871 4842418 4715726 4568711 4415493 4263416 4096592 3963275 3827146
13828 3827146 3695111 3575067 3469096 3368477 3261548 3173644 3093609 2997780 2916775 2824003
13818 2824003 2732590 2649373 2564092 2474561 2408860 2353145 2317307 2294510 2241869 2183021 2119373
13807 2119373 2080336 2028570 1971359 1925359 1868119 1809371 1755929 1716837 1683873 1630739 1580959
13796 1580959 1539038 1505023 1474698 1423114 1359246 1313325 1281300 1252081 1212884 1174095 1142704
13785 1142704 1120657 1080330 1066921 1022131 970021 944279 920888 894068 868432 851918 850508
13774 850508 855226 855306 859606 852507 832973 806994 786688 772341 742880 711502 679905 652264 620094
13761 620094 593417 572106 545141 524609 511277 510087 487490 451280 425552 387875 356708 322364
13749 322364 274356 251506 247703 237675 215200 207061 204553 212375 206242 189258 174139 166016 165716
13736 165716 146721 157164 151778 123360 116827 115587 102792 118996 146655 167995 176652 158182
13724 158182 139992 126567 135478 147196 141945 118875 117905 137263 167464 179768 177072 166673
13712 166673 157404 175738 179293 179913 179029 181218 160067 170781 177327 179749 168729 145827 155268
13699 155268 159689 154911 152741 154629 148004 154837 164736 146380 124688 133888 117670 104864 118639
13686 118639 107439 113410 128450 119685 110500 103649 118119 113559 102529 79416 61032 77906
13674 77906 101919 111352 117804 129460 138038 115077 73851 78404 87481 106817 120858 133589 132724
13661 132724 131264 111217 107472 130744 133741 109741 90959 104383 116458 117626 118456 114400 131976
13648 131976 133649 144719 150765 173375 197747 204488 206055 186641 174686 173564 165129 153677 142824
13635 142824 146722 186841 223782 252800 284998 290199 302704 315266 322789 332074 310954 278409
13623 278409 268803 260706 246173 219525 200075 182841 173684 162001 154940 134290 121478 98121
13611 98121 116410 120916 99016 91405 110606 117159 123870 123273 128358 152417 181006 207735 227574
13598 227574 260892 283545 308185 316885 312417 296933 292295 284658 274776 249684 217511 181102
13586 181102 167949 164279 140267 107965 114985 127895 133197 129873 109789 100847 102559 77907 78224
13573 78224 81427 81099 84882 73395 82772 93870 104404 115682 101092 80497 95908 91530 69226
13560 69226 76516 85351 94741 96183 100813 93214 82898 79676 72457 77302 91293 96971 95222 90344
13546 90344 97922 104855 109995 98018 82772 87149 60363 68789 81093 72593 88943 100055 86412
13533 86412 72466 68950 79652 74980 58937 74311 83407 115472 153213 131069 91213 110176
13521 110176 131917 120342 92941 73634 72227 60709 58972 57184 53158 53621 65534 66829 47909
13508 47909 45286 50798 53725 65345 69734 81076 106083 106646 93898 92511 92359 96583 105126 96282
13494 96282 94775 94906 86494 76418 65084 47362 30583 28221 34014 34519 66943 98651 88907
13481 88907 71919 71025 63905 55096 36690 35045 51882 42182 42539 64753 70729 45393 17829
13468 17829 28137 44169 47060 41708 66329 60787 61278 70979 84494 71368 101735 154143 175380
13455 175380 197553 203508 206794 214360 198823 175723 160095 131230 113246 120945 141189 154554
13443 154554 134769 129429 130449 135683 147067 145290 155642 197636 255201 323391 393941 462756
13431 462756 531378 611891 668211 700872 707536 699065 642374 598499 539246 497147 485081 482335
13419 482335 504543 531809 559549 564542 528149 446388 371889 324933 296719 266015 228586 178381
13407 178381 171951 185072 188421 191594 193896 202178 196070 213931 247326 288964 321432 333827 333478
13394 333478 316116 320015 288407 273094 277972 285934 319273 350807 369600 362622 331805 316844
13382 316844 328414 333592 337976 329425 313674 275083 247992 203029 185226 184601 171141 155107
13370 155107 158182 155049 164385 159157 139166 130032 119847 147557 178399 207107 240702 267188
13358 267188 287068 288738 272107 260997 246932 219981 224501 255346 288334 299210 296183 267075
13346 267075 224929 206879 190680 171000 177645 170271 140025 129355 126045 108206 94107 95364
13334 95364 113978 146388 104001 71566 59312 58397 62334 67887 70240 75157 89374 86641 80528
13321 80528 68980 70004 52001 62431 85903 109914 108033 97277 94478 85449 77991 74324 79903
13308 79903 85893 73683 75526 94271 82647 75302 75195 67382 40596 46777 62883 59066 58884 93469
13294 93469 123585 94155 80437 78494 81279 78479 71122 77290 89954 76997 62167 60131 55752
13281 55752 72937 71571 61285 56061 66575 83329 67548 57557 79397 86516 75835 70788 82528
13268 82528 75158 49830 42901 51644 78193 88628 84181 79022 84071 95514 108276 113691 113135
13255 113135 109027 113598 93335 97424 102615 75010 56093 64000 88565 96634 85962 93587 70345
13242 70345 69567 70754 70851 79409 71014 61544 65266 91021 73535 54532 42576 51510 55767 79697
13228 79697 89821 84093 88634 91537 100670 104349 99606 125130 122917 118270 107728 97736 83961
13215 83961 76411 94486 107141 105027 90146 97805 77597 65632 78929 97141 109467 89347
13203 89347 87918 93676 96341 104276 114687 96304 91432 107454 110611 112067 150037 207568 269090
13190 269090 328513 398838 426668 436620 393760 304983 233221 201748 191711 183526 174026 161974
13178 161974 134913 124732 129719 128198 112568 108982 98169 101741 115910 119792 112425 121244 119946
13165 119946 146266 153867 131200 116189 114887 126824 136873 148098 143584 161618 184293 186719
13153 186719 186925 204394 235386 262980 306947 404741 527420 693297 898443 1114157 1243979
13142 1243979 1213934 1040006 819068 617489 502005 433310 403064 375158 336165 324518
13132 324518 308225 282976 288148 278321 244330 232778 228948 234740 229340 226199 223920 215089 220926
13119 220926 221640 235750 239641 233324 226676 235094 241728 244545 236548 252600 275070 275020 283712 307529
13105 307529 368689 430109 496420 601202 765796 1012591 1262864 1416323 1429084 1286787
13095 1286787 1023374 785652 641812 566532 535464 507309 476610 469512 474049 466044 437157
13084 437157 413756 403095 387663 391815 382893 365709 373962 391701 400276 379779 345917 355848
13072 355848 370323 390499 403797 418451 441226 436347 455203 476125 471932 474317 488266 501457
13060 501457 534866 601964 666686 762347 870594 1003702 1152215 1268694 1338095 1322853 1254272
13049 1254272 1171388 1093214 1055365 1012852 971314 952977 902017 885192 873312 838565 849845
13038 849845 862708 876844 889724 900245 936044 976946 990346 1019719 1056083 1101635 1160202
13027 1160202 1227398 1311107 1405448 1527948 1666359 1829225 2021505 2269502 2603457 2984657
13017 2984657 3433531 3950415 4532371 5215130 6086569 7252673 8901120 11266058 14622839
13008 14622839 19198177 24781249 30518358 34788542 35734380 32707348 27224423 21631286
13000 21631286 17208869 14095006 11970193 10504182 9432427 8636021 8025231 7523909
12992 7523909 7149406 6888458 6738156 6669746 6647824 6614363 6567588 6560855 6646197 6855868 7162385
12981 7162385 7604030 8202820 9001882 10022031 11382934 13237510 15764792 19373429 24669020
12972 24669020 32282154 42532640 54733164 66644100 74470374 74409993 66011469 53310352
12964 53310352 41272258 32286936 26241638 22203154 19357288 17255554 15629663 14302864
12956 14302864 13189632 12274052 11532494 10923194 10441021 10062448 9787992 9608279 9493153
12947 9493153 9374451 9242233 9142566 9095071 9148003 9358419 9764941 10379189 11288413 12650258
12937 12650258 14655905 17595507 21759464 27175713 33252388 38629968 41293744 39711036
12929 39711036 34458803 27928569 22240529 18084691 15235295 13263937 11825037 10699030
12921 10699030 9800402 9047905 8395871 7834853 7349292 6908741 6548373 6255335 5980332
12912 5980332 5730315 5494603 5261568 5063331 4881064 4710855 4545382 4378896 4225894
12903 4225894 4087335 3945954 3811781 3679232 3570540 3464487 3354047 3253024 3140699
12894 3140699 3043281 2968119 2883877 2829895 2753967 2662759 2576614 2492412 2426877 2363194 2288728
12883 2288728 2252832 2214421 2150010 2078658 2001006 1937470 1899661 1847536 1771023 1691481 1645803
12872 1645803 1615065 1571512 1530539 1485873 1432896 1384727 1369726 1358423 1342805 1299705 1234278
12861 1234278 1196169 1181154 1156512 1130578 1123686 1097987 1074467 1047926 1019694 974449 939489
12850 939489 908437 885474 857267 821608 791144 782910 781678 776731 766150 732381 703161 645405
12838 645405 621531 623895 584610 577161 553806 543051 526267 514398 518841 505381 480768 473319
12826 473319 464613 457965 452581 451083 436677 439587 440926 422030 404123 404609 380792 371989 369486
12813 369486 342451 311317 313083 319721 321712 330052 324936 335710 323951 313709 307849 304187 283226
12800 283226 266396 283031 286252 285288 284416 287295 294702 288223 280185 246033 243205 248446 248567 249077
12786 249077 254719 250199 246955 251713 266348 280266 271036 249604 237857 223032 219783 219026 217652
12773 217652 211367 208937 188992 158418 146914 175078 189531 193955 201107 198134 201855 179774 175075
12760 175075 179289 178197 190190 194097 205201 210378 207735 197028 196672 192137 179101 198440 196655
12747 196655 184664 187811 178907 175227 176947 183557 175913 171140 165668 164827 169429 184893 180491 172497
12733 172497 162777 138738 123527 114420 123262 119175 105346 111326 130116 134393 143460 135095 137564
12720 137564 124062 102963 105631 109834 106073 104573 89060 102366 118167 139088 152576 153387 143533
12707 143533 131431 125266 126653 127935 116655 112676 130976 125085 112324 110315 106060 103422 109191
12694 109191 109998 81999 70885 90509 99034 101366 103684 96371 92505 97673 102913 116037 124278
12681 124278 115981 103181 83901 76357 65703 70741 62622 66335 96902 89769 68747 65581 65339
12668 65339 81318 101425 100559 88460 79921 76599 87119 96345 99898 99643 89842 87612 78895 80193
12654 80193 70149 63810 53744 66185 76812 75451 88488 85165 74155 70197 85506 75005
12642 75005 51776 34485 51249 68069 66904 54158 59045 81408 66284 73787 84905 95536
12630 95536 103406 100694 102448 94255 106555 112878 99043 69396 64995 87611 100415 110026 102881
12617 102881 86270 82617 60077 42482 53730 78459 85606 78885 61937 66159 71653 66486 65338
12604 65338 67394 62597 59929 61316 54172 53308 52044 55676 62455 44155 37512 41094 37863 40348
12590 40348 61730 44847 54492 53468 73539 68089 66023 49384 55562 47717 59185 66184 59450
12577 59450 47243 46751 43208 51072 64757 61931 73568 67721 57314 69937 65005 72917 93126
12564 93126 89419 75919 78558 79961 65682 50728 46314 55238 60872 65101 86018 97167 118116
12551 118116 152829 182482 189726 197567 200188 185356 170710 153380 147707 112449 108926 121475
12539 121475 123779 115684 133341 160567 165575 127385 101482 95534 87930 65034 48339 63192
12527 63192 83443 94034 92330 90841 89994 87036 90720 90201 97453 119733 132553 168125 211609
12514 211609 262993 323857 380963 412797 397913 349345 298435 252056 236944 215086 179362
12503 179362 160540 142185 107257 103157 97127 103453 122283 122357 143042 154114 175535 216724 263141
12490 263141 295874 281461 218266 187525 170803 141597 144484 154043 166517 160649 160381 164674 177772
12477 177772 195559 215940 231504 230184 223185 188336 162438 160736 159576 142376 120294 107357
12465 107357 104302 82120 95438 83076 76022 86602 89580 95873 95862 93849 92473 87362 78879 96606
12451 96606 114597 119720 137427 172484 216312 240964 233750 185129 151552 130121 131345 141958
12439 141958 136146 113518 112914 105226 77141 67703 64683 43526 52233 71638 64042 51753 39621
12426 39621 44068 56795 56185 34421 37434 58303 61706 63484 79479 69647 60854 60515 56850 62879
12412 62879 56533 48156 44997 50173 63412 66701 78844 83917 94430 101930 124187 106309 75732
12399 75732 68017 83845 64079 63720 74996 66132 40023 43988 54303 41641 29965 31762 35090
12386 35090 30053 26529 33144 26812 39731 57198 50523 29132 35059 31483 23941 36992 54922
12373 54922 41381 24707 46694 59006 59118 59656 63211 72281 84654 83121 84389 85990 84916 65995
12359 65995 47667 51162 63775 66819 63496 69368 59295 47982 39606 33838 40881 51952 56910
12346 56910 45815 40132 42109 25579 16287 22186 34827 20931 2467 14255 40416 41608 32961
12333 32961 22337 5724 11634 4755 23581 23254 15698 24451 43623 52056 30044 23344 50155
12320 50155 63973 44448 32883 31770 43379 50166 36437 19530 22916 40905 45537 39191 49001
12307 49001 42517 38148 31526 31734 43369 30252 33650 40002 32624 32511 37371 41505 53255 46098
12293 46098 55338 49885 26253 10515 33593 33110 19872 19551 21802 22029 19010 26568 34705 41273
12279 41273 51390 50225 36341 28763 15807 17091 31508 41055 56836 52436 23840 20453 31384
12266 31384 26000 30052 30372 18309 -13242 -9477 1502 13110 19084 29323 23106 18276 18958 6156
12252 6156 27821 51513 64047 46662 27489 30038 27299 20143 29336 21006 20145 18321 9721 617
12238 617 5178 -11556 -18823 -10959 3765 -2541 1544 12129 40649 49506 40759 36074 39191 33677
12224 33677 31061 37772 20031 28604 23379 32391 44179 52166 39239 34785 33756 16127 4510
12211 4510 2373 552 29172 29624 26085 28472 45490 50946 34262 37182 35207 23336 29607 56791
12197 56791 76816 64708 65471 77922 64899 59168 41397 10250 12526 7615 1652 -3637 6855
12184 6855 12394 13802 31331 41764 48981 40145 52236 73750 62901 39940 36440 41419 45938
12171 45938 50034 45324 48298 63527 69513 71919 71091 62973 62711 59057 69998 63902 44404 35725
12157 35725 53970 48944 57678 62008 43368 50494 63464 70691 59707 58665 70920 86011 96785
12144 96785 84418 70878 68750 63261 61293 56246 56306 57309 52640 53049 44874 37193 53117 61356
12130 61356 48115 55627 75440 75350 72750 78536 93674 93400 76800 55896 75170 65833 54273
12117 54273 66544 64196 49016 38328 43007 48496 46315 52660 51492 49089 43350 51599 65248
12104 65248 97837 79546 50607 40800 50815 68082 69215 74386 79996 83410 90383 98903 113006
12091 113006 108256 112521 110091 92064 100883 98544 85749 81874 94374 94556 105031 106328 109107
12078 109107 118565 118121 111905 111760 117321 138151 131124 124353 124735 135426 130069 131944 143719 135174
12064 135174 144926 159701 142739 154362 175392 151602 151899 177262 173227 190708 202401 194095
12052 194095 178060 178846 180473 164486 172572 194543 203900 213891 203496 177675 172051 192671 187613
12039 187613 168970 190074 198712 184567 160315 143442 136567 140122 139443 132256 145398 137761 141813
12026 141813 139526 137818 150273 147039 123705 133965 159311 159978 148646 122135 130205 160809 152659
12013 152659 155825 150895 131723 103661 104725 118578 122559 128993 127289 108826 110696 125735 122454
12000 122454 101726 70652 81048 86846 91303 91284 115403 118952 117349 119254 131580 139377 114454
11987 114454 87778 83602 83534 88223 89615 80168 86521 83971 78828 68997 55956 61921 79619 102313
11973 102313 114048 107041 103336 75117 65979 81016 85255 90281 87155 101735 106050 99015 110782
11960 110782 106580 87807 92504 102142 78571 79424 92708 81024 86731 115958 126065 118935 93177
11947 93177 70318 65965 59764 64675 51519 63739 69316 48489 44759 61642 57455 33300 29745
11934 29745 52409 65078 61313 50284 45401 46657 38701 56273 77991 62873 53779 53696 29184
11921 29184 20873 32389 23953 19829 35732 35086 19405 13869 21745 21497 41239 71451 78117 70340
11907 70340 67880 65575 58899 60231 65548 64560 66499 67077 55398 57425 70802 86244 67166 42326
11893 42326 25635 38585 33256 33912 16709 39625 50909 41733 42517 46381 36462 29122 48633
11880 48633 67926 65206 54895 51074 37077 32647 41227 58053 79174 61224 47413 49736 44796
11867 44796 40725 39418 25693 21165 36228 39482 30957 20700 1084 6037 17776 3981 592
11854 592 16196 37844 24931 10548 44634 58326 51955 36322 9950 12237 27770 24501 4787
11841 4787 3600 8624 19529 12941 13417 20430 24844 27653 29806 33828 19676 1012 6122 17307
11827 17307 10350 11532 12953 13112 25084 6872 9364 10063 16234 23225 10621 7102 3106 -1062
11813 -1062 18226 31874 23460 15650 30905 23504 16257 21132 32803 35851 40992 32323 35903 17542
11799 17542 5640 13078 36317 23540 10537 30221 41205 37327 36348 18135 -963 -9883 -7779
11786 -7779 4213 12655 8905 1121 14830 11426 8545 17867 20948 28625 20842 19882 29821 16107
11772 16107 9818 22110 30932 43771 44218 44611 45242 67982 83215 66846 47927 38632 34304 40721
11758 40721 23941 16884 31931 49439 56280 38593 40556 36516 44235 38894 32979 33032 27735 31403
11744 31403 30118 33965 39320 25280 46111 56841 65202 69997 73467 57243 51211 43526 52842
11731 52842 68230 55166 53746 66195 59444 41067 45996 59279 63159 67227 58483 56636 60887
11718 60887 49323 58578 61185 70090 72835 78051 87792 116037 111629 100336 114056 127452 149022
11705 149022 139949 126836 128815 145304 164449 190418 206948 191912 187819 229522 249776 252032
11693 252032 257074 246057 238412 221254 216123 211323 190096 176449 167520 160720 164722 169314 154238
11680 154238 145617 141170 122529 108769 105475 97642 80367 85531 77836 77326 85773 93741 91110 89317
11666 89317 70865 60528 64174 80551 69715 47250 53905 37638 29723 23376 21614 30087 39617
11653 39617 26115 27799 34028 44835 30687 22461 14118 17066 9575 -7066 -8831 -7198 8178
11640 8178 26488 31427 46243 49806 43797 46898 55219 48164 54976 40436 -587 -18581 -26408
11627 -26408 -9177 17925 10536 1053 -4550 16402 34813 14924 12089 6340 10817 15029 23506
11614 23506 22538 10766 3627 92 -3321 -4834 13600 42853 48127 37053 24598 4307 13126
11601 13126 31164 45450 48639 58636 58341 65551 56649 38080 29014 37853 29853 7158 -302 19598
11587 19598 38613 31919 30521 25292 26424 3506 6947 25677 14245 -3595 9120 15157 15939
11574 15939 915 9140 15134 26230 35682 51765 38441 16911 2457 -340 11767 12605 4163
11561 4163 2691 15679 17402 4674 -10523 -9557 458 17623 28264 39148 42286 41450 29048
11548 29048 33915 46348 37221 32400 18014 11066 6356 -16562 -12462 4956 27297 55765 67148
11535 67148 57499 40356 9073 -5293 6277 19175 10675 2333 10427 17597 -2452 -22633 -11745
11522 -11745 -793 8404 -5475 -5613 11895 3604 -516 31388 21602 16726 4710 -14875 -17074
11509 -17074 -6380 25648 37874 12560 5038 10960 3211 23242 20336 8824 17216 13064 15833
11496 15833 14415 7999 11409 13173 9945 -13048 -24355 -17986 -15032 -11088 -17496 -5468 -11432 1229
11482 1229 3867 -1084 -14101 -16123 -13169 -7220 -9976 2553 9577 -1066 -19571 -11470 -19395 -7562
11468 -7562 -5976 -14000 -5994 7823 444 -1594 -9844 -2255 4329 12417 920 -27337 -28411 -10123
11454 -10123 19751 32442 51532 48569 22612 9189 7035 947 1413 -2939 -15844 3210 30913
11441 30913 19380 20993 26334 912 5228 12979 6824 20383 39830 43688 33333 37362 28425
11428 28425 8598 27879 30765 21105 7372 2091 13507 30608 37356 29362 22415 11892 18650
11415 18650 16304 16082 38683 39070 47781 54667 29579 25303 20268 18281 29814 20127 20553 28275
11401 28275 31496 -721 -22290 -19980 -11070 8020 14968 -3882 -17490 -9031 12334 20217 21873
11388 21873 11198 18201 9342 3001 10850 11408 -6334 3149 9680 2560 8288 43210 44435 24390
11374 24390 2926 -7290 5233 21274 -1705 -12237 5910 14797 -1577 -5770 13927 38793
11362 38793 51625 30713 13130 19398 15893 24896 24450 17667 20272 19066 27304 31746 40422 54262
11348 54262 70789 88853 109675 151163 181728 206598 210636 199148 200048 190842 146178 96237
11336 96237 76417 59977 72251 81617 64982 58007 59341 42115 31959 45072 66712 66192 51193
11323 51193 42943 44524 53611 66054 68877 89461 90376 68736 58846 61089 89658 123627 138033
11310 138033 178429 226148 266561 312817 341316 343871 327278 304294 276374 256782 236972 199187
11298 199187 179592 141969 108615 102896 97143 91868 75549 79305 103254 103361 102020 105095 98493
11285 98493 93497 86920 79753 86967 89562 83944 84503 90216 120212 131435 136948 134418 137686 167651
11271 167651 221500 234157 239426 238260 224589 194940 161008 140439 130664 127822 120746 117293 87990
11258 87990 64853 70078 65641 56498 42646 40420 39443 35691 33663 47714 60626 72640 73562 74603
11244 74603 53713 38906 46192 64758 77008 90818 92120 61605 54275 59330 62873 44100 32083
11231 32083 33147 13960 32012 43699 32054 33307 41823 31650 39777 49183 47814 48749 49512 60908
11217 60908 63742 73306 57822 44572 53386 64335 62999 61470 72577 77634 64772 37939 21727
11204 21727 20482 31079 30707 28377 36917 40900 43574 53308 66626 62341 35985 35843 28250 15854
11190 15854 -6621 14312 21980 18193 19844 26388 44183 44987 50722 40022 28826 35327 39109
11177 39109 34377 42104 59409 71651 71207 67560 69935 77509 67574 48220 55235 44078 38376 27001
11163 27001 27858 35709 41390 39599 52685 58281 51224 50284 40730 28114 29098 41651 62828 45796
11149 45796 16672 25159 40766 36745 22808 32759 61230 74105 73313 81655 89390 81705 81430 70518
11135 70518 53096 50557 59476 78960 83076 56922 40544 26516 15964 39909 48225 29223
11123 29223 26010 37276 43513 30770 30335 56245 73059 60698 54176 67575 62650 67065 64016
11110 64016 63534 49569 39103 50729 74673 71091 79865 111506 112080 75559 74676 94600 103107
11097 103107 102142 100620 103032 104466 112945 126682 128761 99156 103420 119699 132965 112514 104006
11084 104006 87042 74164 78759 87181 75951 70748 68149 71597 74041 76996 56355 60218 72986
11071 72986 66957 53333 53275 48702 35671 27357 30189 38871 58279 55694 49714 70705 88908 78739
11057 78739 85109 80955 71841 75918 84323 76587 95022 127438 134991 109705 93507 90506 102090
11044 102090 110689 115547 101646 89545 98694 119439 106823 84511 103735 123125 137086 161141
11032 161141 158293 165807 161322 151878 166144 177329 175943 180729 179247 182091 207037 200090 207875
11019 207875 199620 204443 208745 202769 197800 183577 182986 205755 196247 206924 221589 227199 221922
11006 221922 222369 241386 231261 231906 229626 232167 231342 205229 211131 230309 241009 257810 263183
10993 263183 271851 297479 316858 319695 325722 340835 341688 341111 349013 349957 349121 347506 364909 375445
10979 375445 355868 379423 408735 411980 404193 412486 431279 442711 455036 468717 485506 490972
10967 490972 491313 504535 515989 518731 514312 501794 513383 560603 595911 633194 638304 673585
10955 673585 717685 761701 797044 834817 900896 964754 1033291 1094360 1191885 1303798 1432147
10944 1432147 1613530 1818681 2047739 2325689 2648410 3020190 3426693 3900889 4443318
10935 4443318 5146437 6119801 7482369 9412002 12138113 15854324 20561309 25818733
10927 25818733 30727644 34075921 34746989 32494846 28193797 23301738 18912695 15485610
10919 15485610 12999630 11276819 10079624 9216435 8603019 8180923 7873467 7676140 7547053
10910 7547053 7439998 7355324 7311169 7303221 7387515 7603683 7922633 8329814 8828623 9420758
10900 9420758 10147758 11101293 12403937 14285735 17030305 21058406 26848488 34706168
10892 34706168 44404523 54806443 63810371 68790109 67979711 61656907 52157488 42309558
10884 42309558 33995778 27731029 23278855 20144552 17903264 16254363 15018012 14058127
10876 14058127 13267634 12592185 12027888 11528554 11120896 10803183 10564579 10386556 10242653
10867 10242653 10099558 10009920 9995813 10028486 10193521 10522631 11083359 11947301 13274169 15249845
10857 15249845 18063852 21786409 26245767 30831769 34463321 36038775 34908576 31407522
10849 31407522 26702517 22051195 18206806 15323673 13252053 11764428 10643222 9802191
10841 9802191 9150699 8593368 8115323 7694133 7293508 6933254 6605809 6270941 5962554
10832 5962554 5685552 5433662 5216874 5028584 4841552 4661599 4479598 4327304 4187573
10823 4187573 4065388 3934356 3810864 3698185 3573248 3459588 3374171 3276989 3183970 3101219
10813 3101219 3018777 2951958 2895070 2833666 2773638 2693471 2623479 2568042 2482162 2416730 2359864
10802 2359864 2303421 2245943 2193040 2126657 2061547 1995658 1948623 1900454 1838455 1767667 1703903
10791 1703903 1665146 1634805 1595439 1539050 1495425 1461638 1436160 1417069 1390871 1382676 1396050
10780 1396050 1409720 1397201 1383017 1362406 1327644 1287075 1230961 1190315 1163415 1121726 1100361
10769 1100361 1083311 1049681 1030611 1019602 994795 965414 952352 943641 922370 896049 874022
10758 874022 839449 811167 768110 745444 714402 698104 700709 697878 648023 635782 645081 630923
10746 630923 623989 619603 615445 618655 593795 585661 604331 601228 584229 567046 561276 534365 517104
10733 517104 493079 470226 481293 465663 472233 468180 444800 443841 448532 457995 465103 472958 466860
10720 466860 481328 485089 478212 483061 481271 493311 492085 491731 490762 483459 495084 485545 475833 495436
10706 495436 511732 499172 493347 514551 547691 564086 567186 583010 591551 580370 595295 636271
10694 636271 716557 820186 946238 1123844 1347120 1613683 1889763 2141388 2332508 2405032
10684 2405032 2341347 2170399 1952586 1726042 1522819 1326716 1180889 1059808 950938 868594
10674 868594 832289 808695 776275 773818 779089 758176 741123 730230 697688 672129 676270 683894
10662 683894 673010 639235 612779 603928 599895 592931 599599 600420 586855 567338 569394 552349 537391
10649 537391 529787 545096 555691 536638 538876 542488 547498 547133 570933 574167 573733 582351 596464
10636 596464 592417 566226 549709 538662 535503 537972 535889 535980 541109 566089 577073 570996 561952
10623 561952 558602 577911 588731 581302 565706 570428 582730 565082 553862 551972 556809 574053
10611 574053 583728 577652 572080 572548 579673 588059 586602 573187 566228 559549 564813 581412 592518 605620
10597 605620 598833 596003 601751 611487 628756 634560 650835 654774 637540 639873 646024 677358 663314
10584 663314 648545 631526 623996 631450 645494 656152 678479 690016 697671 704680 681142 665671
10572 665671 651387 655726 662920 701661 716784 734104 758530 762476 762241 741774 732661 720240 736249
10559 736249 766804 784544 772823 774698 768994 769294 777724 795891 801445 822628 839984 863992 851537
10546 851537 847765 868756 876071 867828 882199 913228 924719 934148 967686 1003874 1011629 1038600
10534 1038600 1077478 1094311 1108514 1129741 1159879 1187029 1199609 1211311 1251927 1296567 1356583
10523 1356583 1429185 1508954 1599952 1638418 1642034 1640210 1610878 1574711 1568223 1542114 1520418 1518554
10511 1518554 1498416 1527002 1555178 1578637 1617190 1653660 1685519 1719596 1757651 1787184 1804887
10500 1804887 1801046 1787937 1808473 1808337 1787452 1773068 1776650 1810698 1848516 1881538 1915908 1924688
10488 1924688 1952944 1990695 2025119 2073886 2114603 2154785 2205694 2252085 2277361 2307327 2355199
10477 2355199 2382949 2430336 2483051 2548434 2616072 2679931 2760249 2848925 2942873 3050401 3120829
10466 3120829 3182199 3214165 3232694 3241866 3245286 3239245 3237539 3255627 3282256 3330824 3389614 3408140
10454 3408140 3433220 3457601 3491373 3546262 3615279 3693887 3745688 3797898 3818699 3847650 3926498
10443 3926498 3993578 4058466 4118889 4203116 4291863 4382535 4490011 4598803 4702358 4824386
10433 4824386 4957962 5073908 5171838 5252470 5317788 5386289 5456633 5517678 5583043 5669436 5748091
10422 5748091 5818880 5892291 5972402 6047090 6125198 6212278 6316527 6415850 6466529 6510460 6564325
10411 6564325 6632945 6716903 6786406 6857424 6929714 6996177 7050577 7106464 7157276 7206014 7253153
10400 7253153 7294384 7351871 7427162 7491719 7518734 7519169 7557399 7627113 7654059 7654916 7623655 7538382
10388 7538382 7449790 7407019 7357558 7323265 7303841 7266659 7229280 7194499 7134406 7085292 7048563
10377 7048563 6994093 6942192 6918885 6873234 6821748 6779124 6742008 6665097 6576126 6482653 6409087
10366 6409087 6350614 6273581 6195752 6112958 6057739 5976925 5891459 5817881 5731208 5638803 5560597
10355 5560597 5517950 5490312 5476958 5441180 5405914 5359705 5274483 5202631 5127220 5081636 5033164
10344 5033164 4968455 4868851 4809486 4766795 4713118 4659664 4589093 4540387 4520601 4509638 4463483
10333 4463483 4445794 4457564 4439777 4416240 4399527 4378701 4353430 4333377 4282024 4224197 4191220
10322 4191220 4200137 4221917 4255975 4272504 4272557 4256859 4252061 4235103 4223592 4263625 4300434 4326508
10310 4326508 4406469 4516299 4630783 4753310 4863869 4943892 5030075 5095193 5211500 5424438
10300 5424438 5676165 5977811 6308087 6669666 7055808 7477119 7955383 8426669 8924545
10291 8924545 9506816 10219870 11104508 12181272 13395044 14769650 16362400 18098250 19910052
10282 19910052 21738618 23541862 25519196 28064831 31641051 36748794 43976113 54207665
10274 54207665 68911056 90582915 123069171 171176350 237928673 319818668 403310445
10267 403310445 464275663 473455006 420525116 333978196 252173586 192124804 152070851
10260 152070851 125378248 106907334 93563950 83539910 75784414 69657679 64821584
10253 64821584 61045297 58012774 55415773 53001109 50508208 47890398 45304770 42849063
10245 42849063 40602418 38552765 36675049 34942783 33331269 31881115 30549229 29360745
10237 29360745 28283940 27273020 26323961 25434185 24615442 23816639 23023213 22264728 21550055
10228 21550055 20892278 20290472 19769991 19334178 18924444 18502815 18060178 17592205 17129741
10219 17129741 16633275 16108516 15583151 15070331 14591894 14141768 13732011 13348564 13000682
10210 13000682 12654805 12329093 11996685 11669067 11348948 11039769 10739092 10445807 10188696
10201 10188696 9951199 9703011 9459866 9222629 8975526 8716152 8486653 8274398 8064931
10192 8064931 7873670 7707535 7551915 7378328 7198255 7045021 6901134 6766314 6608954
10183 6608954 6444681 6291205 6157330 6040980 5940282 5852547 5747082 5605454 5441392 5290627
10173 5290627 5133345 4979456 4818269 4682319 4562900 4451245 4338087 4221072 4127666 4046590
10163 4046590 3959023 3915563 3882476 3840764 3814805 3775305 3732755 3692587 3657932 3601174 3553189
10152 3553189 3479055 3367195 3266767 3167463 3082102 2972419 2872856 2770121 2663782 2587013
10142 2587013 2527688 2480421 2443676 2344653 2205569 2072491 1954988 1890563 1863741 1813016 1773833
10131 1773833 1721343 1655963 1608487 1593558 1578163 1537240 1485047 1454857 1420233 1421199 1410701 1386910
10119 1386910 1358540 1369204 1375564 1372731 1400277 1401205 1371627 1326204 1309552 1282422 1275403 1249478
10107 1249478 1240736 1225304 1219448 1208680 1197516 1178864 1161291 1163013 1171271 1209251 1246577 1252161
10095 1252161 1237111 1225918 1232843 1250593 1267360 1278225 1277837 1249953 1228817 1211384 1195983 1176882
10083 1176882 1153229 1151066 1171021 1180444 1185739 1160346 1118638 1071015 1005768 982016 976235 985069
10071 985069 964292 946297 933624 913051 926346 932578 956722 970347 976712 990202 980809 947159
10059 947159 918896 922914 915861 898959 879444 875993 871593 868812 868358 865584 879314 882727 883204 896512
10045 896512 900645 911832 957274 1010499 1050063 1165136 1361403 1667779 2042601 2416234 2706189
10034 2706189 2512532 1954475 1544392 1303256 1180363 1105917 1031459 971776 940582 933835
10024 933835 918674 913098 907928 878448 856632 834729 849361 838066 805864 788432 779607 751255
10012 751255 734541 734158 719398 707370 692236 687863 685678 688744 678449 667951 657615 637905
10000 637905 630341 601713 567328 555981 570766 590771 615583 636292 621753 579989 551668 532768
9988 532768 512941 509530 517898 522142 534960 521621 539020 533763 525163 511251 496217 506854 506871
9975 506871 491674 494399 483751 476620 497060 492567 468726 456535 471389 472351 481713 480082 476297
9962 476297 458402 433596 404075 376199 352121 381596 384058 388057 401242 390247 396477 408282
9950 408282 411015 398673 385407 355172 356084 371892 382476 377311 378819 396791 386963 361249 339110
9937 339110 335239 357239 374358 373331 371579 364343 351213 354012 382153 377318 358143 343743 356849
9924 356849 345518 325111 319355 341358 333878 300287 293914 308279 302262 317276 326255 321326 329551
9911 329551 350039 363509 382157 370967 358666 362659 357594 372349 400982 424041 429435 438403
9899 438403 439053 430678 423284 428319 433523 416907 434443 466019 501914 559447 612113 697985 835293
9886 835293 1057382 1429684 1891735 2403108 2764263 2717625 2259898 1742446 1340652 1079927
9876 1079927 911905 812828 730317 677785 660233 626283 596869 582247 572437 557941 543658
9865 543658 534365 535398 528063 515493 531179 545099 543785 550244 562582 574768 579302 615576 647466
9852 647466 674827 733749 828692 921842 1046489 1248407 1505099 1800315 2109786 2416825
9842 2416825 2683020 2890327 3100040 3406793 3937930 4695363 5585507 6272745 6211422 5251064
9832 5251064 3953261 2903142 2243178 1843444 1595043 1446986 1338242 1238942 1145228 1067529
9822 1067529 997404 942405 911725 885991 873419 843150 825030 813642 792018 771793 765676 731713
9810 731713 709355 707155 702322 664270 630039 625668 610160 587122 575912 566055 566459 557367 542346
9797 542346 531883 518623 500185 483323 481888 481319 464098 464944 492545 494897 466209 465528 454755
9784 454755 435138 437299 424816 403657 400196 378778 367831 374920 363183 372160 372745 373400 354673
9771 354673 343359 364458 388200 391672 384609 395779 400634 373787 347879 356168 359914 339862 316587
9758 316587 311629 326551 328699 329709 329003 348344 365134 370904 394736 435891 480473 510831 562904
9745 562904 626650 646015 618669 582587 520065 462505 432721 405401 389995 383041 357443 354177
9733 354177 344196 327190 317453 314442 304051 304012 302337 304960 296530 280581 261412 259604 269061 270842
9719 270842 260897 263856 262517 263553 282109 264344 241804 235013 243997 244632 242878 232996 237045 255780
9705 255780 253321 258609 244485 219168 214977 218753 210893 198478 197784 198279 198179 211591 208598 190225
9691 190225 193631 198161 188237 170951 163286 164306 184212 199623 188035 167069 166752 178140 198823
9678 198823 214523 183682 169448 170416 171450 177571 167850 161641 159767 162894 163726 159722 182879 194980
9664 194980 212373 227376 195763 181127 178649 174963 167868 195170 189288 166736 142430 141843 157806
9651 157806 178007 174083 161856 167780 170910 193253 200422 202127 196209 173696 153528 157129 150159
9638 150159 142193 142022 143756 150911 165641 180798 195297 195921 189540 192659 188986 164227 146926 131855
9624 131855 114642 124691 140855 173227 167808 161077 167569 150958 132258 151315 155673 159968 162239
9611 162239 159516 162570 179695 166163 155864 146772 155693 153064 150153 153396 151634 148602 169083
9598 169083 169820 169827 156572 133032 142172 160512 172454 166192 170405 153826 143934 138255 143246 127112
9584 127112 110183 116272 124722 139226 140768 151873 167157 159653 134762 132126 123037 120857 125337
9571 125337 115516 116200 129193 129371 123913 129800 136400 151982 149721 151663 166644 165633 146650 143196
9557 143196 123090 101119 107861 113096 118684 122986 126589 127576 143074 127968 121708 130888 131827 132176
9543 132176 132367 142164 152772 154362 151828 141219 136573 123319 120092 136327 129911 129342 135218 136139
9529 136139 125272 128156 135805 135167 138114 125494 126955 156915 163729 123001 111627 118454 118149 114965
9515 114965 125725 140858 154393 154660 129642 120806 123298 105037 108103 131732 152913 143768 135178
9502 135178 140573 138970 146182 147801 144425 141765 159625 156313 150862 150153 170705 161635 118335 102322
9488 102322 94338 94261 123360 145166 152204 123159 89312 94671 101411 98242 85860 82219 75264 75399
9474 75399 83799 92403 95230 105840 109213 115209 113420 98592 115196 117725 121911 120351 94973 99472
9460 99472 92528 66617 70320 73687 68520 78222 77057 85564 97278 100577 97175 111019 107627 117385
9446 117385 118080 78197 60788 86198 82753 87922 75758 92853 98126 114785 118588 117148 124940
9433 124940 112682 105549 107066 125178 141688 154495 152836 134302 104660 126994 125780 121675 138360
9420 138360 145974 131075 108730 112047 135128 129658 105962 101300 99614 87220 103239 101703 95824
9407 95824 98940 98132 118712 114367 105165 118160 113089 100968 89871 70658 62153 63945 93008
9394 93008 96460 93174 82983 81739 95833 113214 121738 109472 108376 115620 125429 124615 102915 85756
9380 85756 91189 79352 77593 80072 96858 103960 92919 80225 78842 75301 97479 96497 101704 108046
9366 108046 107471 117883 126176 129866 129048 104977 103019 106239 98450 105065 103743 93389 82868 86136
9352 86136 100896 105032 71182 61106 66559 77817 81486 82831 86699 86492 83945 86116 76702 79619
9338 79619 94348 117153 121894 114775 107237 112188 114894 110695 85414 63644 69465 82127 85944
9325 85944 91879 74953 75249 84688 80793 93145 106948 123728 106875 105566 127832 133168 120124
9312 120124 111737 110848 85923 85568 104195 105221 112815 111887 125214 110935 90790 83139 92512 94532
9298 94532 103451 107815 108816 107062 120498 115984 101229 89441 99213 109456 84535 84555 94121 91383
9284 91383 71359 45448 40085 58241 63021 51801 64633 54136 72787 62981 68994 76519 58741
9271 58741 41919 44639 57590 58851 50888 53224 75778 74672 74934 76163 61850 58819 64166 79062
9257 79062 94824 93191 80026 80578 89498 79418 58933 68592 77165 83372 93964 77683 59882
9244 59882 62051 53013 41228 47205 56738 48207 47759 42057 32540 23520 51996 63147 45774 37281
9230 37281 28863 53776 75367 84513 77525 74035 55093 60723 62566 64920 62745 60047 54610 47895
9216 47895 62609 86678 96554 95733 69282 43340 41145 48154 58751 71475 64513 59830 63683
9203 63683 79451 81574 97335 83093 72566 77233 86416 83530 91741 91629 85858 60730 54679 60873
9189 60873 43772 31689 46299 52500 60189 58606 46076 43613 54879 69048 66781 65763 80677
9176 80677 77202 59079 61704 73786 61572 72618 54964 43909 65579 83978 77351 70381 87811
9163 87811 80079 58117 34713 33697 56973 65438 76492 72549 56698 52106 58888 63809 78282
9150 78282 70738 41430 45002 76249 99839 87019 64512 56561 60353 68278 60841 38888 31617
9137 31617 42917 56290 68620 74290 69942 69774 48073 42831 46962 50436 55905 81511 92335
9124 92335 69683 51478 54009 67216 88127 92401 89558 79117 74583 66596 54615 49199 52750
9111 52750 54644 71199 72608 61665 57135 48739 30178 50887 45656 37841 51075 59102 51315
9098 51315 57750 43606 46304 47664 55067 47428 52856 67910 58232 38834 46043 53894 68386 62901
9084 62901 58972 72478 58518 32827 41761 58182 69413 80632 59443 27400 35462 43838 48490
9071 48490 55662 55285 46272 46393 52225 52735 56954 51331 50350 50739 37511 40399 48986 51935 47802 31866
9055 31866 24187 39925 31024 27354 40444 59115 63975 49948 51976 74109 71232 66764 73843
9042 73843 66078 70531 88203 80237 70761 63227 58874 57949 60496 39617 31401 55414 71582 58940
9028 58940 48884 40996 27816 27748 46599 67682 73369 75241 64375 31501 26759 30689 37671 45880
9014 45880 53875 43691 34468 34784 50580 45159 40021 33123 22860 22814 17495 12074 21992 21277 33882
8999 33882 39429 43196 37545 37594 65763 61824 58508 72162 82502 90293 88578 68029 69249 67475
8985 67475 45620 45906 39066 47905 57925 75660 79114 71291 68301 65992 70510 79320 79195 75151
8971 75151 59740 55273 54564 62602 65692 62801 25634 14619 21490 29340 22989 31911 41144 30185
8957 30185 40504 61535 61672 71489 76154 62059 44309 37309 46301 58934 59258 43985 48721 31344
8943 31344 24946 45257 48637 39641 52819 74523 83677 76788 64728 66528 70607 53639 41622
8930 41622 33935 36928 28824 35573 49532 53906 49787 33466 15287 24382 44836 35422 31741 35646
8916 35646 38650 22888 28515 37030 35147 27536 34273 25732 22529 18992 19988 13990 17048 29531
8902 29531 28388 29714 36218 27495 35169 54127 47638 29660 24458 17420 17058 20594 27981 21601
8888 21601 33732 51008 62955 68467 65981 58702 58099 53267 54993 73862 76222 72616 65495 57352
8874 57352 59014 54743 43085 56780 57862 43483 45720 50688 41964 57236 51596 37872 20895
8861 20895 24961 30050 16862 20914 28840 58127 75689 67000 52738 38352 37572 45399 42862 48505
8847 48505 58068 45570 58169 58088 66323 60929 68533 73011 66386 59899 70727 77218 61391 72270
8833 72270 86401 76853 56999 38456 27982 31932 37768 39992 37520 31693 35676 29144 10547
8820 10547 -220 4929 24778 35220 53499 61072 59662 39036 37296 39134 36380 41731 49844
8807 49844 44841 34487 33198 44798 27817 13089 24623 47496 44599 34614 30696 21194 36053
8794 36053 58705 60646 70003 67444 68274 59602 45721 38488 13321 16647 35264 32313 23666 31003
8780 31003 20251 27940 34500 23252 6145 6105 23864 14392 10040 29710 25330 9390 7235 12006
8766 12006 24674 26374 27080 38631 48078 37274 41485 65414 59982 46478 46414 38327 31546 32528
8752 32528 57721 53549 56853 55708 58392 49464 44520 32070 23446 10453 22048 49120 59433
8739 59433 58542 61302 53218 36447 34158 36839 40645 44676 42260 43165 59239 74908 69574 70922
8725 70922 73351 71784 48170 42211 56425 40505 30519 35470 39333 36796 38488 42045 52353 52900
8711 52900 48426 73178 80068 74844 56539 45160 46854 44867 42523 28143 29012 35907 39465 32219
8697 32219 36131 52491 73274 59035 58783 72604 64560 57579 40844 28593 36636 57132 79379
8684 79379 81474 57972 46837 52107 67560 61571 59643 66520 59031 40429 33373 60455 71479
8671 71479 62259 51364 51285 48774 59950 58979 54810 47748 42949 25764 23242 38926 47298 52689
8657 52689 49337 37795 32106 31320 47713 68235 80852 94859 103130 112187 118145 112873 116533 144392
8643 144392 180932 236778 303972 447452 687219 966441 1252281 1457957 1389037 1067618
8633 1067618 753330 558927 428972 346790 317548 321129 275431 240625 218307 198275 195683
8622 195683 225642 243744 246074 229872 235272 232202 217554 224129 240650 235982 244773 253108 260762
8609 260762 257889 267654 280249 289485 308714 327037 356480 399529 438391 507847 613022 747452
8597 747452 917729 1108496 1359911 1746067 2262198 2876533 3434458 3548950 3083806 2570764
8587 2570764 2291816 2224278 2260042 2283898 2225432 2075633 1832607 1554371 1325705 1145172
8577 1145172 1014026 896613 810498 755173 690835 635070 587715 558592 543757 525196 503828
8566 503828 462216 432672 433362 434742 435057 455758 447913 445178 445831 468730 542272 611510 699911
8553 699911 799614 905811 927712 907565 987744 1167319 1394222 1610254 1671767 1443472 1100183
8542 1100183 829815 680651 581189 518991 478487 454151 423885 403622 373636 354336 345199
8531 345199 336791 326533 294682 292522 286229 269240 272385 271789 263429 252992 258718 253425 252376 246531
8517 246531 249905 255541 251434 247314 250549 277508 297571 305066 351142 402280 417917 382917 329821
8504 329821 286658 261389 252784 242982 218519 206760 205973 185328 175203 171196 162281 138756 127491
8491 127491 131164 141996 144578 134254 110537 116368 130933 131262 121588 126933 146708 163855 175668
8478 175668 169728 148328 144002 131673 118675 117743 104707 98947 109912 98356 91502 89144 81659
8465 81659 67283 77122 82983 81930 79419 81533 79923 76382 81692 83821 87397 95530 83658 64485
8451 64485 54045 59168 63821 87300 90692 87566 82051 74509 85034 71960 64227 68128 79940
8438 79940 77359 59761 46753 60736 68903 70295 63610 63033 65518 49163 45183 25164 24348 23674
8424 23674 16683 48859 49128 46650 45654 35931 24973 37052 57169 54163 45219 44360 45583 54479
8410 54479 45376 39358 26551 41776 62692 65081 68626 45814 35716 36471 35677 38079 49649 37859
8396 37859 36980 38066 39417 41983 52173 47730 47630 51475 63420 57514 44590 37301 34892 30444
8382 30444 47075 46786 54415 45245 41694 47723 61298 55278 59346 58049 54895 58475 55775 60407
8368 60407 62697 68999 51295 46066 49344 79338 90375 78345 59581 45621 47270 39343 46877
8355 46877 51164 52397 48347 58175 45947 33805 43094 46419 56660 50489 56202 73867 58051
8342 58051 45107 40526 58520 66330 59007 42879 41780 51789 44838 41344 40272 41666 39053 40481
8328 40481 50348 53553 55599 60361 65287 56402 36650 19828 7215 30145 48248 41262 45778
8315 45778 46363 41144 42431 55178 65608 76548 76056 62369 60671 72542 59132 48728 54510
8302 54510 48292 45899 49809 61723 60709 66324 75839 63974 75777 80350 99734 93782 79421
8289 79421 61487 57498 65198 65538 58078 34981 26805 37225 65622 75561 53833 34915 17401
8276 17401 14983 -4137 1126 13468 19885 24104 34287 30707 25887 26226 28089 40288 32560 34091
8262 34091 42218 45691 44881 40138 36681 40257 46416 37090 33959 53359 30821 7545 13120 23514
8248 23514 21807 16403 25852 35839 48755 59506 48031 27019 23499 22362 24259 38612 30283
8235 30283 21930 24737 37895 46082 41150 36622 25459 30898 43722 42859 32863 34262 42682 46722
8221 46722 32150 42043 65233 72629 63426 52814 39909 21330 33815 34466 27602 21820 16400
8208 16400 18709 9527 17077 46231 65538 68732 58735 35814 29556 29222 23734 42843 60619 48134
8194 48134 39504 32460 43096 56407 48836 45479 52495 42091 39673 51516 64070 61096 56228
8181 56228 63938 65115 61978 55895 52302 59331 52136 36296 35021 15951 10935 18660 26532 29695
8167 29695 20094 4004 8383 10225 2092 4459 31030 40038 38562 31120 40700 42964 53633 68418
8153 68418 62251 45952 24519 7306 9147 13727 16492 13707 45101 59082 39750 13610 25318
8140 25318 56012 94394 97108 68516 65124 77613 69529 70894 58310 46284 43516 28618 40262
8127 40262 39953 35765 41973 50326 34707 34016 59100 62826 40799 28058 44716 45300 45824 50178
8113 50178 38514 24653 21788 50129 68228 48598 18209 -1301 -18 -7076 -5338 6291 14686
8100 14686 19257 21198 35317 45147 45918 23503 20349 17026 11764 10413 34260 49496 38685 33591
8086 33591 31752 38982 30784 6415 9274 18144 41031 44609 33494 19247 27659 45839 63543
8073 63543 97670 128707 118835 89392 74743 64014 52129 53772 22469 16175 38529 40997 61091
8060 61091 55789 42930 48445 42861 34147 33716 48002 31076 32170 41638 35251 39150 36167 44236
8046 44236 66698 61896 42972 43977 50320 55736 60601 63419 54321 58756 62229 59203 70249 76574
8032 76574 92328 96524 87423 104051 112015 90378 97700 108731 112880 92653 87919 74456 56147
8019 56147 51413 70547 58948 46090 28353 26924 44840 52343 54311 54786 58814 49146 56741 50488
8005 50488 48318 74322 89934 76776 57827 69201 82867 89066 100244 113219 136065 153556
7993 153556 164270 154487 145984 149054 142689 131868 130828 120938 131100 117039 107828 86544 68884
7980 68884 67986 83752 80828 65974 68821 54059 42906 47767 54932 36685 42519 50742 62676
7967 62676 65055 61570 71517 65535 58022 33018 27185 26597 42705 56001 57236 62221 63074 58818
7953 58818 55371 45363 50339 84270 104885 74767 70266 69786 69177 62158 64066 62578 60162 44542
7939 44542 47148 68246 61703 46809 37335 45569 51422 45289 47265 51929 48624 42609 67442 77797
7925 77797 68631 69397 67117 75697 84783 94958 74689 58518 55378 51955 39819 34773 25234 16651
7911 16651 24227 28665 40744 46305 65573 71837 53730 34861 35353 35316 44941 57755 65500 67379
7897 67379 70784 61309 51649 50939 49643 44842 40521 41770 37859 24509 -140 -6666 11766 20296
7883 20296 21305 13119 17501 8191 -2159 13041 27574 34022 42903 34833 49579 43891 38998 48049
7869 48049 47858 26039 15996 9885 2362 -5568 -2347 18733 30915 22279 30301 25344 26559 29084
7855 29084 49096 61993 46467 54937 63736 66195 62329 54206 57039 50434 47038 59379 21020
7842 21020 5355 12398 14669 27103 26519 43745 48057 37899 42767 22714 11975 10468 11472
7829 11472 20082 28093 19435 8612 16721 36278 31902 25595 7524 20689 22364 -2393 -9834
7816 -9834 -6057 9121 26851 26797 2546 -26412 -13258 -14016 -9255 -6489 -8338 -14043 -19086 9381
7802 9381 28552 6581 898 -5926 -6777 -3794 -5419 4284 24692 26436 5937 1402 7222 8464
7788 8464 13056 5439 7243 7343 25329 21201 -1857 -12814 -2089 6969 -384 -8745 -6273 -2110
7774 -2110 3099 -1403 5675 20894 26272 25849 19034 8682 12550 13881 2468 -12502 -1373 8105
7760 8105 20826 32385 11508 -21693 -23401 -11601 -9446 -6430 724 17397 22536 40502 40946
7747 40946 32645 28698 49014 41594 22619 18318 18457 37036 52480 56617 53166 40262 20361
7734 20361 -9804 -17039 -16206 -8471 7881 9795 -12818 -20430 -6669 -11597 8305 27952 28809 38962
7720 38962 34459 36713 29555 16581 9699 4373 7916 3154 1271 -1896 -23102 -20214 -11151 -8653
7706 -8653 -2270 -10493 -8759 1432 4789 1963 -601 16716 25988 38906 48938 35965 23255
7693 23255 15260 2055 -3465 1988 16058 21643 13896 26596 41109 47824 47676 32654 30143 14168
7679 14168 7462 -823 8108 15918 1914 -17447 -2892 9203 8237 -2515 -8974 1551 22244
7666 22244 39328 43099 46845 37798 22847 -2321 8825 8794 6704 25243 20433 11866 14100 30642
7652 30642 30247 15933 4746 23621 40515 32363 27327 26814 30846 30853 25658 28036 5876 -12287
7638 -12287 -2154 -11841 -3007 16714 19471 14494 6453 9657 6787 -1793 -1746 381 -6324 -2430 -2111
7623 -2111 -3829 1130 28503 14679 -10960 -21570 -41289 -35779 -27542 -14836 2484 17385 15991
7610 15991 5960 13188 14119 4469 -15257 -19828 -3668 20298 24562 20317 8789 -8640 -17087
7597 -17087 2830 23546 28468 10757 -3271 -14315 -7140 8179 27729 19840 34838 35930 914
7584 914 -6412 -2210 20431 32018 20270 8965 -1760 -13086 -13479 10216 13853 5273 18662
7571 18662 31546 48191 35147 31375 35833 56563 41727 34009 16023 2295 -4156 -4578 8596
7558 8596 -790 -19266 -4720 9103 26370 51673 53130 34377 3839 -18699 -8359 5268
7546 5268 13368 5093 7281 -892 2094 5411 -4297 5794 15876 16670 4539 -18088 -23712 -17343
7532 -17343 -1996 -238 10793 5015 6099 19516 28658 16827 16042 15430 20001 34607 51298 66292
7518 66292 59014 33084 27217 51886 63791 51260 25365 -3102 5953 14196 7552 21027 13226
7505 13226 11066 20070 23730 10321 -2797 -17765 -16713 -27612 -36298 -22359 -24714 -40269 -43069
7492 -43069 -23907 5245 11891 -4759 -9532 -9764 -13168 -15092 -16534 -17466 -11402 -9244 6707 11514
7478 11514 -4027 2759 6457 -4998 -8177 -17723 -22446 -18213 -8736 -16676 -21506 -7615 -4787 2059
7464 2059 5239 13059 -3026 -7037 -12340 -26362 -33220 -30350 -15183 -13764 -33024 -31217 -12769 -7136
7450 -7136 -16319 -14294 -16760 -26852 -30359 -8059 -14405 -30485 -27830 -20821 -26105 -15731 -26044 -12222
7436 -12222 -418 -969 -8388 -3192 -8394 -10417 2446 7236 17015 20004 26216 28509 9916 4855
7422 4855 -9972 11422 8793 -4788 -11269 9248 15783 29238 46822 33696 12061 16621 35491
7409 35491 41308 40285 32207 42945 41578 44491 29890 29020 27853 23311 6566 -5503 10236 7970
7395 7970 11770 15142 9530 8663 -4022 -22268 -11311 3678 12269 -10869 -24817 -16820 -8335 5306
7381 5306 16634 17797 14370 18870 11199 -337 8864 18114 27941 29366 45835 28001 3400 -1399
7367 -1399 -4989 6241 6976 25572 13486 -19448 -28445 -28550 -15153 -13551 3279 30120 34337 25791
7353 25791 21548 8038 8639 -22873 -21478 9033 18395 20650 26574 27611 9347 11465 8106 -5029
7339 -5029 -25459 -37448 -25699 6678 31715 34648 19169 14917 27339 18210 1106 -5236 14109
7326 14109 23016 28547 36061 37630 16130 -4617 -12560 -5449 -662 -2788 -2303 5956 9836 -1338
7312 -1338 -1268 9624 6889 741 10473 -3342 -21650 -32260 -39180 -25980 -7185 685 -10134 -20824
7298 -20824 -18917 -20786 -10957 -6298 -15756 571 10677 10143 6820 -18433 -11445 -7238 -19175 -19693
7284 -19693 1824 11371 -11845 -27159 -36060 -20418 -16015 -11004 602 1268 -6458 2042 10301 12204
7270 12204 9179 -6745 -40 12419 3566 -23990 -31841 -12152 -9312 -16863 -7467 -16091 -9325 1968
7256 1968 30967 26342 1798 -18090 -10195 15036 34734 24278 -8758 -17069 -532 26244 24396
7243 24396 -5965 -16055 1179 25694 22056 25401 7899 -1305 18104 17425 9264 8766 15093 -6685
7229 -6685 -13522 -11702 -7392 4765 10661 11110 13010 18011 20314 509 14076 22369 10114 -4079
7215 -4079 -3 -15548 -7802 -5119 -12921 -15287 -16696 -21401 -31802 -46885 -6479 12477 2627 -14082
7201 -14082 640 15852 7824 -36 15643 8408 -5369 -14620 8950 18810 12970 15247 15217 19910
7187 19910 18873 6466 -5136 14869 10990 4000 11499 32645 44952 27386 17468 26095 25661
7174 25661 29609 31499 43320 35209 40006 37139 23724 11747 12488 15489 20403 15852 10757 16651
7160 16651 19079 38883 28907 27890 34698 10607 -18813 5077 1391 453 7865 2573 -6362 -3478
7146 -3478 -1577 -11499 -17801 -18368 -10676 -4468 -1122 7459 10376 13710 28007 26718 27189 19062 27870
7131 27870 36309 18026 9709 613 -6311 -9147 -1532 5490 3300 5497 5313 18499 20952 20482 32944
7116 32944 43838 36476 30053 13513 -7667 -13551 -15619 -32262 -40856 -35323 -17631 6443 20098
7103 20098 727 -4705 16310 22777 17436 -1455 3353 19782 18302 5815 -17361 -6547 -10435
7090 -10435 -22368 -9778 7911 12452 10297 13196 19615 9336 5292 -15457 -41109 -31978 -1998
7077 -1998 11434 6312 3433 28118 42614 24845 -1078 -16594 -887 13811 -1193 -2615 -5237
7064 -5237 -24450 -42466 -22970 2660 5976 19988 12441 -14781 -10900 12221 20413 7085 28396
7051 28396 44440 19390 6321 31340 32572 28828 33200 24290 4684 6985 21218 45520 36653
7038 36653 31526 36884 29701 19610 34528 30104 21307 31279 35525 34276 22129 21801 8808 -488
7024 -488 5401 6244 11830 20645 23564 1769 -17941 -26114 -9790 9649 18616 7357 7095 -8461
7010 -8461 -8555 2483 10589 -17094 -28355 -24792 -16319 -22359 -19408 -11964 -2349 -3740 -2637 -4251 6354
6995 6354 16092 11476 1551 9967 32494 46019 57581 34902 24481 34081 41216 31278 23757 5437
6981 5437 7665 7738 -3763 11109 15256 1531 3218 6842 14894 7456 12618 20933 33575 -3820
6967 -3820 -8586 -14594 -7455 -4206 5349 812 -14025 -18747 -4738 2796 15886 30110 16157 22435
6953 22435 35909 22715 8396 416 -19722 -29517 -27841 -3521 2290 -5891 -14138 -17655 -63
6940 -63 1503 -6462 3047 12948 14137 18207 8297 5301 4738 11387 12394 23880 25459 -471 4042
6925 4042 12298 21778 15452 8760 -5079 -20410 -10897 4822 -15022 -18804 -11883 -6512 -9263 -10360
6911 -10360 2472 -11662 -19838 -26211 -26157 -11904 -18836 -31337 -38986 -37629 -21696 -15621 1215 -1493
6897 -1493 -10304 -5024 12316 11346 8663 2387 2846 -9983 -16865 -10272 -16443 -11578 -1970 11869 7705
6882 7705 9727 6431 -1333 2841 10115 -9501 -24239 -20597 -23533 -42238 -34900 -9317 14244 7579
6868 7579 11060 22591 29754 25391 29685 8219 24354 25532 10336 -11866 -7538 14152 27600
6855 27600 -2038 -21841 -2065 -11039 -16773 -28489 -9808 -4587 -10657 -4241 -10521 -24662 -23966
6842 -23966 -7660 11112 11664 26135 36358 32851 12703 4990 7622 -1439 -26451 -30555 -11073
6829 -11073 -6712 -11091 -15441 -2123 -9652 -29231 -29312 -24117 -10939 -5762 7086 7242 3763 -2454
6815 -2454 5061 20276 14581 -10219 -18805 -17640 -29596 -27422 -23601 -20530 -31396 -52140 -46580 -23527
6801 -23527 -16456 -19553 -32771 -13713 -9031 -1077 7510 17689 16585 11791 3575 -7148 -17430
6788 -17430 -14080 -11427 -12572 -19376 -5002 7666 16492 21868 19725 -2817 467 17501 5563
6775 5563 -6051 -8631 -6758 5775 7762 19268 10403 19584 14913 20175 40568 27078 10821
6762 10821 -9859 -866 -5459 -13985 -19180 -43196 -27752 2558 14715 13867 9640 -3435 -27735
6749 -27735 -22933 -382 -6711 -9880 -2934 5217 16790 14232 10567 4358 782 3581 6659 16553
6735 16553 21091 1682 -11271 4281 26876 32912 21677 3908 3260 -18467 -31947 -17855 -25456
6722 -25456 -13180 7469 10404 4007 16599 40392 59540 72201 96563 107477 87645 63843
6710 63843 31725 17708 29234 48134 40073 43360 35174 21863 30623 38701 12683 -13894 -21146
6697 -21146 -12215 -9768 2129 8850 4607 -15627 -20268 -11121 -4083 -7653 -6990 -5249 3620 -7891
6683 -7891 -3270 -10049 -26938 -24193 -20051 -42501 -26760 -23298 -32051 -46556 -38872 -34412 -45024 -38428
6669 -38428 -26843 -6322 3788 -8763 -21385 -20104 -10253 760 -7461 -15128 -25693 -16446 -2874
6656 -2874 4168 15454 23343 26869 29412 25793 26933 25425 3795 -1320 12870 20239 -3588 -37364
6642 -37364 -43178 -34113 -27267 -23359 -29071 -13021 8287 19743 6255 19440 25119 26521 29401
6629 29401 22581 6917 -3489 -6824 6331 7051 762 -8516 11762 11795 3008 -2420 -18267 -37698
6615 -37698 -25747 -8936 -30418 -35784 -19590 -5783 3939 -4621 4385 9709 7000 -532 -21914
6602 -21914 -23967 -13398 -13504 -23230 -10737 6891 10487 9760 4405 13037 18789 14055 13688 -6696
6588 -6696 -29312 -37739 -35535 -8090 -551 -6118 -9610 -10999 -6364 1668 -10541 -9482 -5189 -8716
6574 -8716 4159 -1240 -24658 -43388 -31741 -9611 10503 7452 10675 11655 4694 -6292 -22674
6561 -22674 -18571 -13248 -12622 6302 6204 -1080 -18633 -18842 -15661 3053 14674 21260 28500 26637 13844
6546 13844 16609 11953 998 -5650 6036 -12939 -29382 -25839 -18684 -15344 -22838 -40010 -24296
6533 -24296 -2689 -5644 -10837 -7058 -15678 -18792 -13923 -19404 -20062 -25047 -37098 -41656 -32437 -36893
6519 -36893 -37251 -29137 -13468 -5947 6807 10897 9161 10246 20177 17204 17087 24460 10630 16589
6505 16589 29823 19060 -1600 -34044 -30676 -3037 28525 38945 30341 18676 13321 -4891
6493 -4891 -2778 2392 4853 3442 143 7585 6563 -6471 5418 7026 20877 30006 12434 -20003
6479 -20003 -36748 -9823 2280 -11470 -4106 5984 -3736 -1759 -9143 -16733 -18514 -3703 2240
6466 2240 -6497 -20028 -19224 -23626 -27680 -32911 -38130 -34977 -28859 -23274 -20329 -10853 -27959 -26610 -21280
6451 -21280 -14868 -9366 8892 24259 34660 27059 12231 16379 20837 24585 31484 50289 45459
6438 45459 21677 15077 4907 4660 9065 4490 -10211 3122 20371 21273 8941 18472 16898 12319
6424 12319 -5695 -21519 -28762 -15503 -10868 128 -1366 -7723 -8918 1855 13639 31047 15664
6411 15664 4630 5450 15569 2113 2825 9454 6206 9613 21924 6193 -9344 -5492 7861
6398 7861 -5068 -12408 -9116 82 -10424 -12525 -14832 -15805 -13226 -11210 -25641 -30580 -33023 -35425
6384 -35425 -40979 -34540 -6751 7721 1663 26 -1509 9332 7431 -6842 -7123 -17218 -8843 -16911
6370 -16911 -12148 1622 7781 -1278 -16851 -9352 -23436 -30651 -19586 -34662 -40261 -17091 -6382
6357 -6382 -406 -3469 311 -1328 -16469 -16484 -11662 -18759 -6815 4367 8431 9411 16222 5193 -8134
6342 -8134 8612 18916 21036 3387 2042 15934 27374 33306 42504 38988 32257 8021 -8355
6329 -8355 -8631 -20053 -5928 24606 45047 21802 -574 15087 10116 -167 -11650 -27869 -47889
6316 -47889 -43309 -16710 18120 43161 33644 32847 26490 12443 13932 4812 -9959 -10002 -14822 -4027
6302 -4027 13787 4540 -11643 -14901 -13341 -16192 -2809 -10016 -16656 -12194 -7865 -17460 -25515 -30519
6288 -30519 -20324 -18348 -21891 -23031 -32048 -32656 -30476 -17074 13633 28094 37751 6459 -19594
6275 -19594 -14641 -11803 -11465 -12717 -6249 -11433 -28285 -24735 -5133 7137 2191 -7793 8140 10596
6261 10596 5761 19290 8973 6251 10314 1196 -252 -4477 -11824 -4450 -6983 1120 29038 29204
6247 29204 20704 6118 4639 -743 -7750 797 7773 11891 9401 33151 12448 2631 4390 13275
6233 13275 16357 13565 15120 13027 17402 12922 -18321 -30940 -10571 -6647 -19432 -22204 -24646 -29600
6219 -29600 -16466 -3074 -4223 -4801 -12744 -15516 -28488 -27324 -28255 -31151 -38320 -13829 -7467 -12929
6205 -12929 -22656 -11949 -9337 -158 8666 17716 36859 33530 22681 9849 7036 3683 1886 123
6191 123 -6658 -15529 -14329 -13811 -10367 -348 1983 4670 11482 17296 25708 20348 2748 -23409 -36645
6176 -36645 -21672 901 16309 17797 2694 -20313 -18761 -6369 -63 -1169 -3713 -2403 3349
6163 3349 4605 -2725 -9425 -847 698 11102 14999 15033 26312 30832 25107 10044 -3339 -17276
6149 -17276 -12950 -21885 -6802 -16069 -21093 -11563 -9203 -15071 9447 23252 26331 13972 11469 12962
6135 12962 9080 15039 10937 32959 34099 16796 21809 22669 12992 2143 -504 -10386 -699 462
6121 462 17352 7645 -5222 2066 -10935 -31345 -40719 -18833 -17180 -9433 -13493 -2414 -800 10950
6107 10950 7842 -991 2611 1124 5130 1462 -7886 -14447 -1148 20161 6474 -10152 -9377 7354
6093 7354 11517 -2549 -4290 2478 11926 19621 18655 13475 11996 23397 36970 35033 23603 2763
6079 2763 -4176 1725 8982 24096 8086 -7181 -3934 -19353 -15164 -11596 -7560 -13290 -12565 -9677
6065 -9677 -20100 -27350 -36142 -26352 -22522 -8560 -2423 15873 7820 -13759 -24838 -30676 -22788 -24268
6051 -24268 -28270 -21573 -10779 -767 11701 32058 23357 21667 18992 25916 33079 5585 -2455
6038 -2455 -7006 -19838 -30119 -17242 -12183 -15292 -23755 -19391 -2419 155 -6276 2893 15851 25072
6024 25072 1554 -18488 -18696 -9723 16929 16815 -5596 -21594 -15667 -24229 -24516 -18352 1810 14812
6010 14812 14240 24476 29800 -1027 -8680 10000 6724 -6525 -18395 -18926 -20954 -6730 9878
5997 9878 12092 13273 20970 15926 16696 3440 -1329 -8674 -28216 -32556 -17361 -1777 5561 -14618
5983 -14618 -10619 30502 42887 18968 3800 8791 656 6503 -6992 16989 10827 -5244 -16167
5970 -16167 -22492 -18257 -31868 -34185 -41188 -37543 -32301 -31838 -28630 4718 21524 24439 29634 33386
5956 33386 17509 5963 14643 7742 6250 1188 -23522 -18151 -11336 -27078 -17504 -671 -6701
5943 -6701 -7380 -6663 538 6141 -2075 -11380 -17491 -6056 2592 -4011 2888 3796 -12567 -30541 -20115
5928 -20115 -37058 -38530 -32961 -38203 -31303 569 4217 1799 2405 15923 7443 19559 18336 6238
5914 6238 6623 5478 6748 26713 41388 41563 30083 4480 -5055 -1988 6310 22496 20502 -1225
5900 -1225 8225 10463 -13862 -28432 -22529 -14523 -4746 -4510 -9965 -19386 -5188 10241 -6070 -9958
5886 -9958 -10039 -7557 149 -9129 -9237 -13200 -18366 -16152 -24979 -21018 -12445 -13277 -14264 -26258 -32735 -19960
5870 -19960 -7387 -7586 -21061 -16952 -5436 -2778 -17019 -14474 -17068 -29879 -34704 -22440 -3835
5857 -3835 -17443 -21688 640 12185 4371 -8068 -10265 -1494 -1997 -6323 12955 18938 21299 8995
5843 8995 12767 44941 26864 5802 3464 7967 4676 -8421 -1214 -4022 -10846 -9388 10645 20988
5829 20988 19752 6609 -888 2347 21665 24617 36089 23669 29397 27705 29766 40874 26441
5816 26441 21204 -4290 -18621 -12557 -15184 -22307 -20193 -24782 -12028 -18032 -11042 -4371 21797 33363
5802 33363 7326 -9060 -12448 -5859 -813 -8089 -11714 390 3448 5100 3715 11682 27824 19070
5788 19070 33422 31159 24379 17397 18788 15110 9363 6203 6029 -10690 -16250 -16426 -12639 -1862
5774 -1862 -3066 1020 1176 5713 2714 -1096 -5738 -11711 -6026 3791 7137 -4983 407 -4640 -18261
5759 -18261 -28669 -13629 -10212 -2397 -15106 -21234 -8671 -2432 20937 23598 11265 7325 18972
5746 18972 171 -16081 316 2803 4247 8360 -5734 -19310 -40643 -53969 -36386 -20560
5734 -20560 -26393 -40754 -41543 -31755 -23546 -17314 -14518 -9143 -24180 -14281 -8208 -9111 -19865 -28163
5720 -28163 -17249 -30134 -23359 -5310 -13424 -19892 -32964 -16781 -1044 -13366 -30224 -29172 -26656
5707 -26656 -18083 -30615 -27570 -23167 8415 -10166 -21557 -10329 -1469 -6746 -847 10601 2493
5694 2493 -780 3480 7145 13683 32722 37506 15906 -9712 -1704 12633 5956 7456 14024 29628
5680 29628 29517 7470 -8843 -16801 -30737 -19404 -27760 -30168 -6686 7925 9146 -14722 -30150
5667 -30150 -25272 -19012 -17655 4264 10685 -6811 -6767 16435 26146 28958 11505 -6322 -1705 -13819
5653 -13819 -10438 -2606 4037 10771 5423 11699 8883 9682 9713 11311 6314 9571 13422 2835 -3920
5638 -3920 9794 22743 26648 23144 -1288 -3605 -23196 -31519 -33628 -32649 -18603 -11709 -21350 -25128
5624 -25128 -15393 -23978 -37331 -37692 -40799 -9729 20585 25379 7988 5018 16057 19910 -6477
5611 -6477 -23424 -15392 -5147 -8960 -8825 -5558 -15291 -41351 -48121 -36210 -16052 -14050 -21260 -42311
5597 -42311 -34876 -9013 9113 16050 28623 12177 -8437 11724 7845 10486 -2564 -15723 -14383
5584 -14383 3336 267 -9766 -10448 -16554 -17162 -14768 -5770 3164 11131 4742 4838 -763 -3615 -15094
5569 -15094 -15581 -20194 9214 6877 -8575 -12321 -22855 -18071 3845 10328 12816 21299 27566 44126
5555 44126 51550 60534 39668 8072 -527 4767 15720 11032 -4991 -13125 -29382 -45496 -38067
5542 -38067 -8982 -17051 -6894 -2576 1164 -6196 -2526 -5034 8070 4057 -12610 -25236 -24575 -13669
5528 -13669 -9825 -15502 -29048 -48074 -51375 -45999 -25813 -20170 -12936 -8009 -26190 -26585 -9144 -1682
5514 -1682 -8006 -38921 -44907 -34910 -19264 -5498 -2581 -24689 -22420 -12294 -1057 963 9536
5501 9536 36169 33069 4999 -18077 -41694 -31509 -22041 -32452 -39669 -24968 -27904 -36428 -34101
5488 -34101 -13385 -5803 -24654 -21763 -9667 495 1453 -4877 -13689 -25497 -9212 -4742 -4992 -8470
5474 -8470 487 -9876 -17864 -19479 -20456 -11081 -9605 -19720 -16703 -10651 -502 12699 11449 6554
5460 6554 564 -13502 -9161 -6332 -8372 4196 9581 27063 14381 -4861 -13031 -7636 2591
5447 2591 -5017 -6561 10858 11796 2304 -4928 -7685 -1662 -2363 -3943 -1894 -7044 9014 14575 28262
5432 28262 15508 1178 -6855 -17886 -8177 -6644 -11690 -21883 -18521 -13235 -11906 -902 1286
5419 1286 5473 -6633 -12332 -8681 -8212 -13059 -17531 -4976 2919 3743 13811 18681 30424 22451
5405 22451 28771 29509 31211 8864 -18212 -8468 -29319 -27638 -13207 11014 10219 -20451 -9597
5392 -9597 5465 -5332 -25363 -34051 -10265 1870 433 6989 -7876 -338 10709 -2383 -8481
5379 -8481 -7676 -1452 9937 11782 7300 -6244 -12059 -17448 4812 25856 5507 17175 25428 36538
5365 36538 14521 7553 4414 -4231 17229 21134 18415 2914 -3403 2404 28922 35899 21427
5352 21427 18288 16317 10000 -9397 -23634 -28885 -12310 -20293 -23633 -6410 5064 -1453 -16830
5339 -16830 -11765 -15640 -21560 -5670 -10923 4584 16913 -3626 -12626 20098 24422 24122 12708
5326 12708 27512 21606 21374 15880 -4110 -2859 -232 -1883 3752 6931 9549 3867 6311 29033
5312 29033 32653 28365 10617 6907 -18841 -40363 -36487 -35202 -37464 -40330 -35082 -25192 -36538 -8869
5298 -8869 -5334 -16923 5974 3602 2268 -8492 -16310 -19945 -5278 -5708 -11840 -18744 -21948 -21967 -25100
5283 -25100 -40873 -33207 -33204 -38113 -23394 -20147 -23082 -30324 -16528 -19198 1156 18231 13431 2645
5269 2645 -16398 -33412 -21262 -4096 -11291 -8642 -4742 -6041 -2254 13978 6410 9748 17140 7308
5255 7308 -2020 -10830 -30949 -34390 -16965 3813 -25 4518 19555 19136 17162 24042 16505 -4259
5241 -4259 -14747 317 1495 -18378 -5646 -18505 -20427 -22151 -33592 -28659 -6376 3695 -5073
5228 -5073 -734 -13360 -16858 -8395 -4764 14082 7633 -19081 -33182 -18528 -11561 -20645 -36999
5215 -36999 -37683 -26340 -6158 -1548 3421 -7220 -17105 -20381 -19131 -15668 2069 1670 -6239 -2178
5201 -2178 -831 -7403 -14588 -6255 -8144 3334 5522 1615 -5423 -7172 -9501 3814 4541 -12376
5187 -12376 -13586 -12162 -14958 -9756 -3056 -12677 -18953 -5961 1275 -7117 -14586 -2752 1039 3454
5173 3454 -15303 -41069 -46160 -50096 -43936 -30278 -19304 -22583 -25561 -13288 -3170 3477 -2857
5160 -2857 7000 3978 570 3552 210 -1868 -16199 -33337 -42028 -21887 -7959 -2992 -6105 -21333
5146 -21333 -27102 -30199 -18535 -5424 2541 6843 -10757 -23631 -35917 -39792 -18447 -8474 -11321
5133 -11321 -8487 -12621 -32193 -26550 -27409 -41162 -31635 -2742 -5314 -24487 -29931 -28144 -22900 -19266
5119 -19266 -34149 -43818 -55756 -35437 -28296 -34726 -21742 -3065 12575 16297 -14284 -20912 -9854
5106 -9854 -5603 -9729 -35923 -40624 -28405 -22403 -20174 -19247 -3659 -6710 -9508 -10299 -35986 -39729
5092 -39729 -30921 -24137 -10142 -22904 -26982 -8896 18294 355 -16885 -12029 -12550 -7226 -17225
5079 -17225 -34351 -21859 -33349 -36161 -19617 -16205 -12452 -27655 -35185 -30221 -9460 8328 8677
5066 8677 -8382 -19214 -2467 -3486 12311 26539 21408 20122 36018 35319 5901 -21597 -27745
5053 -27745 -16648 -22388 -47651 -41306 -28737 -18375 -13643 -12245 -614 1081 -4853 -13297 -12902 -17810
5039 -17810 -25813 -1442 -111 -21998 -38206 -51083 -47111 -18014 -12786 3802 18519 17010 7299
5026 7299 -762 -7021 -27 487 -7324 -18533 7141 17921 11926 -3103 -8646 -4810 7006 -7352
5012 -7352 -1780 9699 -519 -12371 -31153 -53650 -54534 -43577 -51845 -46939 -13364 -5507 3783
4999 3783 -2122 5113 9701 -3249 11330 8481 5805 9591 18029 20736 14411 4821 27460 23656
4985 23656 20219 12878 -6999 -7931 -11192 -8408 -10405 -6145 -2939 10472 14694 27165 19152 25462
4971 25462 30845 45288 48422 29856 -13987 -41122 -29510 -13814 5568 17600 5773 1134
4959 1134 -8183 -35607 -31512 -15384 5169 7688 11046 -363 -13031 -23352 -16085 -9120 4159
4946 4159 9893 15871 520 -20165 -32312 -34202 -23994 -8237 4034 -11321 -19171 -16613 -12741
4933 -12741 -23315 -25622 -1759 7570 -10074 -8081 -29164 -23383 -4869 5096 9504 9579 18338 1146
4919 1146 -5046 4734 5054 11710 -5387 -23429 -19745 -6719 3788 2018 -631 -8678 -13702 -14203
4905 -14203 -28645 -34701 -20381 -1783 -7528 -21613 -28961 -31639 -25849 -32698 -41026 -38412 -34277 -23642
4891 -23642 -12110 -2965 5279 -5316 -15363 -5940 -20451 -27021 -48464 -46385 -21399 -20379 -27264
4878 -27264 -13888 2443 16715 34922 24809 4708 -15090 -33797 -35201 -28321 3773 -18640
4866 -18640 -29589 -32371 -17137 -11867 3390 2557 10722 5399 -3389 4170 27977 32529 17023 2613
4852 2613 -10325 -5275 15913 11806 16146 -4542 -22423 -18178 -19611 -2594 24129 24878 12462
4839 12462 2497 15730 16013 -1248 -12892 -233 8455 2937 -8736 -7919 -4509 568 17776 20215
4825 20215 22869 18323 4475 -818 -3325 -9658 -39140 -49744 -46363 -22119 -16341 -22348 -23649 -5159
4811 -5159 -7576 -1517 13442 10599 -6834 -15709 2006 10686 -4400 -15543 -10501 -2078 4569 -8883
4797 -8883 -14235 120 31243 40356 37101 14483 16043 -252 -10089 -20886 1995 -1098 -289 -6253
4783 -6253 -3392 -12507 -23269 -28703 -31230 -10754 -14959 -9382 861 -10704 -27242 -27902 -38069 -46557
4769 -46557 -45420 -22739 -21018 -20042 -19749 -3041 13509 23280 15635 19998 13537 15321 3465 -2365
4755 -2365 11011 37672 44467 16452 5309 22590 11955 11931 21678 21235 24828 16422 32066 26476
4741 26476 11229 -2492 -15804 -12166 -22682 -26531 -12808 -7047 -7406 3132 1228 -3762 14344
4728 14344 24881 13875 3628 -10623 -13648 -10371 -20193 -38080 -36796 -28665 -22652 -10146 -22221
4715 -22221 -19143 -38105 -32088 -16606 -8137 11449 15494 5640 -34121 -43777 -13111 -9441 -1173
4702 -1173 5910 20439 18078 22174 6957 -9678 -27587 -52490 -29395 -16777 -15750 -13943 -8919
4689 -8919 -11811 -10881 -6543 -8191 -12414 -4889 -15018 -7831 -6664 -8472 -9584 -18457 -27183 -30387 -26507
4674 -26507 -8115 2027 5332 12992 16238 13469 8638 4091 5707 4117 -8329 -9896 -2537 -14353
4660 -14353 -22297 -9625 2399 267 10474 18538 19717 16470 4912 4224 -2579 8377 -7790
4647 -7790 -34166 -46967 -38723 -17348 -9620 -915 4587 -2552 -16425 -15985 -6300 -12729 -23212 -20300
4633 -20300 -12245 -7978 2985 7960 11640 16395 -1804 -5366 13314 8798 7412 8895 4637 1210
4619 1210 3763 7455 3245 -9090 -20467 -11569 10399 25323 6326 -10514 -11416 -5776 -1028 4643
4605 4643 351 -1006 10796 -2531 -14264 -8703 4043 1751 -408 8532 3135 -8994 -20632
4592 -20632 -36363 -15331 -11911 -2298 4888 4274 14006 1067 1883 6238 9605 24337 13781 -12568
4578 -12568 -5375 -8634 -2502 12510 -6100 -13734 -16437 6152 10051 3803 -5254 -15356 -14028 -440
4564 -440 -2775 -4040 -4250 -14413 -10767 -19408 -22237 -10380 10277 -9630 -21788 -23652 -38562 -29639
4550 -29639 -14174 -2410 -1236 -20737 -29757 -19231 -4631 197 -16641 -17976 -5125 6897 19593
4537 19593 18456 17390 18512 15111 439 -3357 9345 33506 30261 6568 -8247 -7955 1450 -3323
4523 -3323 -6559 11514 21405 38720 29559 13176 7 -4763 -9544 -17256 -24433 -15598 -2425 -17469
4509 -17469 -37149 -44842 -31630 -27600 -16207 -14773 -18629 -34315 -49470 -33492 -22885 -18221 -6658
4496 -6658 -423 -9595 -10311 -1423 10727 12830 3689 -10267 -19544 -8197 -24383 -33719 -31284 -112
4482 -112 -5629 -28934 -22869 -21249 -17745 -24870 -7290 -2406 -2766 -9942 7628 -1053 -19325 -36953
4468 -36953 -33171 -16410 -35332 -28376 -19778 -10337 -6526 -9628 -11112 -21032 -27807 -18105 -995 12215
4454 12215 -179 -19437 -10439 -5637 -7127 13760 21551 -3575 -13502 -5122 -7382 -8531 -18019 -3388
4440 -3388 6825 8926 12710 -3352 -9221 -4974 -1292 -7722 -6366 113 53 -2801 2519 14367 9170
4425 9170 -4674 -24359 -27304 -30981 -19882 -9263 -3675 4950 572 -7591 -14649 -5495 -5207 -8130
4411 -8130 -10537 -20342 -15267 21925 51536 36605 6866 9299 -1179 -22073 -14167 4818 7815
4398 7815 537 9044 105 124 -12668 -27560 -30018 -43533 -48287 -34704 -4427 5050 2648 6117
4384 6117 3251 14180 25419 10384 -4429 207 -15772 -15309 400 -393 -39909 -40685 -32999 -50767
4370 -50767 -46299 -28840 -12545 -701 1065 -24855 -39468 -40579 -54926 -33431 -12145 -2898 12548
4357 12548 20219 16000 -3961 -23175 -18814 -7433 1731 -3353 -6063 -7052 -3867 -14648 -10830 -24720
4343 -24720 -31575 -16361 -6920 -6508 -10454 -19800 -15967 -17237 -4725 11937 18703 15805 8371 -9828
4329 -9828 -25764 -23991 -6859 8954 12418 -7703 -1398 9496 8052 5837 -4755 -7900 -12661
4316 -12661 -15706 458 14034 22884 8241 -15795 -10005 -7866 -5799 -2323 12589 17431 14753
4303 14753 834 10258 16105 22507 5275 6 7314 -1816 4709 23896 38293 39749 23090
4290 23090 18883 30818 44179 36425 18472 2983 3490 13694 22997 14950 9024 17822 29129
4277 29129 9105 -5758 5781 -1728 1512 -6043 -18917 -22932 -11404 -9696 -16374 -6383 11986
4264 11986 14612 15279 13887 -2942 -15084 -18260 -17567 -16517 -24077 -34744 -26515 -30123 -33239 -20041
4250 -20041 -3303 -27605 -25021 1212 9407 -2136 -14957 -9282 8358 4906 8800 25087 18564
4237 18564 6442 5290 -19436 -30733 -14568 255 -5954 -8055 -9388 9217 24859 21871 2686
4224 2686 -838 -12769 -2881 -18778 -41880 -37334 -18652 12660 16805 19183 22028 -1288 -36932
4211 -36932 -47125 -15661 -4598 5598 2488 -150 -10655 -19742 -13407 1074 -2516 -43596 -45782
4198 -45782 -33223 -28614 -33224 -31277 -35897 -32070 -18783 -26768 -41413 -38063 -25881 -8436 -946
4185 -946 -6837 -7787 -5540 -91 1835 14146 9971 11787 17418 28289 7072 -5936 -3718 -9459
4171 -9459 -26981 -21790 -8334 -29585 -44820 -26513 -10298 -14580 -15671 -9001 -15243 -12278 -9589
4158 -9589 -11959 -5392 -10636 -1004 1332 3323 16834 20491 21175 6181 8077 -7496 -14805 -11057
4144 -11057 -10850 -5822 5203 12684 -14 -13204 -20005 -26105 -24257 -24247 -21585 -16711 -2155 -11995
4130 -11995 -23812 -22398 -10416 -4968 -6305 11680 -11705 -16047 -9184 -26568 -10290 -10722 -20007
4117 -20007 -44473 -32046 -22100 -11292 2648 4643 -4379 -10969 -6611 -20182 -37506 -22817 -12256
4104 -12256 -33600 -16866 -2862 15677 34251 39221 44613 27590 15696 -2412 -17895 -28759
4092 -28759 -30968 -31152 -20371 -8895 -6760 -10732 2903 11821 -584 -1649 -7042 -22935 -21437 5205
4078 5205 7918 2491 -9512 -748 -5893 -5428 13634 25655 34771 29449 24715 39255 25135 5617
4064 5617 17202 33960 27811 27216 12519 10444 16357 15194 -12526 -5569 -11231 -5478 2298 4026
4050 4026 -9390 -3365 16528 16872 8850 -17582 -36358 -29569 -13935 -146 -4069 8291 4365
4037 4365 18671 9725 3508 16614 9255 -5903 3545 10896 25641 24923 11143 4480 14046 14800
4023 14800 979 -10309 -1266 6766 5134 -6609 3479 32210 30761 28495 34801 21261 8429
4010 8429 -15746 -29286 -32918 -31276 -22938 -21466 -19395 -11081 -8471 -16801 -11445 -14804 -13059 -18785
3996 -18785 -12714 -6581 -24965 -31545 -23768 -18055 -17849 -23978 -23456 -7345 -2734 -10164 -1164 -4888 -9951
3981 -9951 -9967 4406 8939 4445 16318 21966 20406 13745 12578 3641 -11573 -3912 -18132 -20273
3967 -20273 -13636 -4962 -7312 3837 8682 7884 -11524 -27676 -25257 -27181 -21963 -29511 -36840 -21451
3953 -21451 -19833 -20958 -26015 -18129 -10165 -9274 -13897 -20124 -26035 -29175 -27230 -38863 -35842 -29436 -12691
3938 -12691 12382 -3488 -8909 -6628 -8920 -25806 -32050 -42277 -24030 -10016 -7978 9003 8030
3925 8030 -5275 -23121 -40256 -33312 -19915 -27548 -15340 -28177 -30756 -26207 -28200 -4067 17139
3912 17139 15547 15800 27938 11382 -7912 -5029 -2123 -23329 -22714 -15240 -42673 -38959 -27646 -10658
3898 -10658 -16617 -14228 -10121 -13037 -20795 -12364 -7323 -11403 -9943 -10624 -17034 -25215 -19455 1121 -1992
3883 -1992 -3886 -11554 -5665 852 1921 -3380 -8042 -730 4323 -2012 -3929 4684 2854 8652 -3405
3868 -3405 -14282 -22827 -29000 -12210 -2924 -13027 -3039 19102 23741 20667 6130 -3856 -11613 -26493
3854 -26493 -32026 -23759 9017 35316 19737 10902 7866 13393 13183 10862 -10990 -25965 -15254
3841 -15254 -12835 -24138 -19483 -20711 -19691 9838 11137 -12118 -70 3016 -3424 -9534 -11410 -24258
3827 -24258 -24183 -1753 -24794 -27841 -30369 -47552 -26442 -10365 -25477 -22836 -16994 -10154 -19292 -37746
3813 -37746 -34850 -22935 -11566 -13049 3648 14879 12820 -20818 -42012 -24698 -9092 -14229 -8547
3800 -8547 -1428 -3166 -7160 -9507 -6375 -13396 -19563 -14246 2194 17160 16467 21122 4904 -7921
3786 -7921 603 18889 7529 -3124 5774 24116 33630 37715 33870 32366 14778 6739 3091 15938
3772 15938 9494 1101 -5465 16234 18170 8159 9111 9030 -3997 -16253 -29649 -20735 -34864 -21974
3758 -21974 -3802 -3194 -1398 -2170 6884 15736 18799 20648 -316 -8703 -21362 -30969 -25372 -12444
3744 -12444 5853 3562 -4998 -16188 5561 9371 2901 -12152 -15279 -28363 -25030 -8576 4066
3731 4066 -5972 5701 -1594 -11761 -13321 -14086 -16865 -37984 -46118 -25656 6552 -96 -10300
3718 -10300 -1398 6196 -6038 3830 4292 -3253 -13674 -11872 -1321 5182 2181 -5329 13413 15522
3704 15522 23457 31771 26648 20225 17560 24837 9701 -2855 16522 23924 16078 12545 -3360 -10330
3690 -10330 -6326 2477 14481 30578 30703 1472 10432 16293 7917 14080 1172 -10449 -3745 3812
3676 3812 9092 -1654 -16361 -12152 -23662 -36899 -48719 -37315 -34852 -38273 -11972 -6403 -9697
3663 -9697 -10846 -7552 -18897 -9151 -17306 -15881 -16466 -5763 10524 22753 28238 23015 23400 29502
3649 29502 2847 -16036 -5146 17975 -4284 -24295 -26592 -31441 -35566 -26370 -17105 -18049 -15106
3636 -15106 -15303 2253 2239 -12010 -20158 -37311 -48065 -17107 -4998 -8793 -10883 -15524 -12062 5780
3622 5780 11759 31104 21840 337 -3308 -5619 -24686 -22031 -6509 16483 22001 -5199 -20418
3609 -20418 -19387 -36443 -30534 -17934 -22294 -26384 -23226 -10439 -23358 -7712 15170 5285 -13053
3596 -13053 -13325 1762 8949 163 -8621 -23399 -42614 -48398 -31271 -28706 -23509 -18900 -13102 14164
3582 14164 41639 26558 6073 10574 15246 7704 -6478 -14704 -14215 -18731 -10333 -12333 -30714 -39339
3568 -39339 -28655 -19252 -23500 -28293 -25820 -23922 -19488 -3027 169 -2833 6336 5987 -6338 5582
3554 5582 11598 1292 -4862 6084 30228 40008 42965 25438 25371 13325 16309 10633 -15483 -19865
3540 -19865 -7009 4614 7183 2019 -6377 11802 22469 9141 -9941 -10440 -5654 -7130 -13150
3527 -13150 -1807 -9004 -18906 -13012 -15838 -20102 -11750 -18610 -10713 5084 2356 600 -15068 -22364
3513 -22364 -24308 -31968 -30685 -11222 1202 -3029 -1327 4724 8998 5389 -9953 -29657 -24551 -2017
3499 -2017 -11698 -19038 -16463 -10115 -17458 -26167 -11330 -12731 -18287 -31408 -18291 1636 6424 30723
3485 30723 35558 3007 -15519 -12309 -24457 -35833 -22736 -12580 -30107 -30336 -26639 -15762 -7354
3472 -7354 -11211 -7167 2742 5626 -3037 -8936 -997 16690 17188 27889 27981 14169 -6884 -4008 7350
3457 7350 16176 19381 17043 9785 -12683 -1416 18639 6999 -13234 -23938 -19067 -3032 -13392
3444 -13392 -24853 -34912 -23551 -5192 15547 3934 -10005 -2679 7673 11587 13096 25573
3432 25573 20225 3562 -4518 -8394 -12135 -15012 -10823 -1996 7638 -11175 -35922 -23995 -26439 -20580
3418 -20580 -10917 -15686 -10244 -7454 -5530 -7447 -6162 -6530 -492 7137 -8571 -12991 934 -3683
3404 -3683 -7817 641 6146 -10030 -26822 -26493 -3530 2307 13466 30679 9205 -20321 -28117
3391 -28117 -14487 18829 20227 24231 15388 2805 7064 5296 6753 -3982 -4397 2525 4783 -4476
3377 -4476 2835 27665 32262 18635 11831 13230 9042 678 -11740 -6860 1817 4203 6692 -4141
3363 -4141 -338 1217 -8199 -15572 -14991 12100 1720 -8961 -6248 11842 9991 2418 92 -14945
3349 -14945 -27797 -15217 -14895 -19211 -7574 -937 1560 -4506 -8782 -17116 -19006 -11625 -9552 -13054
3335 -13054 -9923 -11979 -3519 -52 -1066 -1644 5001 15186 11243 13747 204 -13757 -17551 -25139
3321 -25139 -35705 -26359 -27184 -32962 -41518 -22070 -9412 -12561 -14111 -7644 -2758 -6914 -5517 9472
3307 9472 -10668 -23889 -22241 -7555 -30567 -44724 -21135 -6593 10853 3878 1530 4319 1119
3294 1119 -18360 -3909 1808 -8748 -15895 -6153 -7153 -13953 -23554 -17151 -12316 -14874 1282 -3359
3280 -3359 -14995 -2201 -9607 2073 5295 -14947 -25901 -14115 -28468 -22825 -7326 9080 20811
3267 20811 12710 -6024 -2661 507 -13563 -20459 -19479 -3603 -11556 -13720 -16722 -12748 5655 4423
3253 4423 -7784 -10490 -26724 -41909 -43523 -38521 -7936 9127 12157 4522 2276 17639 24406
3240 24406 24621 14222 6369 -9455 -10267 -9837 -5808 13926 15709 5534 -7510 -23595 -27818 -15328
3226 -15328 -24019 -31288 -38088 -16076 -8157 -8288 9310 4903 -3130 -12956 -16361 -13672 -9214 -13615
3212 -13615 -680 16385 5789 -3093 1477 2212 1770 -26506 -14002 -6896 -13321 912 -2190 -7743
3198 -7743 -14665 -9678 11782 8264 -1881 -12798 -28352 -39881 -44664 -35716 -38323 -5172 18886
3185 18886 7729 8203 18082 25477 27749 23430 6325 3413 -4793 -13633 -4680 6075 3666 -10508
3171 -10508 -15887 -760 2985 6675 -9200 -4067 4616 -1919 5366 -995 8531 14098 28256 3930
3157 3930 -14513 -11774 -3307 420 -7388 -23455 -29117 -31715 -39944 -31634 -30051 -34718 -24621 -21263
3143 -21263 -2130 -6860 -10996 -11825 -9679 -16993 -6288 -9586 -2571 8200 23808 7035 1727 -11632
3129 -11632 -2615 -3115 -10858 -17776 -22102 -16694 -4543 -10472 -12883 -13279 -20489 -8975 6013 -4464
3115 -4464 191 -1794 7879 27643 8102 -17775 -17635 -18771 -21418 -19613 -7905 -13228 -21075 -28329
3101 -28329 -16403 -4828 9773 3001 6552 542 -15856 -14788 8722 15815 1518 -7908 -6084
3088 -6084 -7610 -16546 -7711 6690 -4030 2681 23708 23493 271 -7599 -8319 -10031 1292 -6780
3074 -6780 -16161 -10962 -18045 -441 29078 36523 12999 -6818 15773 22769 14871 4262 -14840
3061 -14840 -11255 -19604 -34067 -28130 -15389 1805 -10258 -13624 -21505 -24383 -20928 -3260 1605
3048 1605 3878 9955 8515 13881 21504 15792 14216 -5871 1184 17182 8232 13470 37 -15985
3034 -15985 -31934 -32178 -24552 -20390 -18398 -10681 7898 15936 -3985 -5304 18356 29084 25787 26527
3020 26527 14572 1728 4510 6344 24474 31268 8840 -1231 -4178 -24995 -760 3154 6422
3007 6422 26388 15575 3132 2128 3792 7232 11291 5026 -3269 11748 11005 12105 30533 34065
2993 34065 8794 -3370 2376 14021 3616 -6392 5618 17995 11720 8398 3847 11370 2656
2980 2656 -6612 3779 -10823 -35702 -18588 -12355 5256 3097 8934 2628 -793 -10695 -6130 5350
2966 5350 17893 17018 8647 10341 5099 -4003 -13812 -18963 -34665 -38770 -47347 -54120 -37550 -35133
2952 -35133 -19971 -27185 -26544 -3749 -508 -11587 -13536 2699 3949 -19052 -32076 -34943 -16375
2939 -16375 7085 7143 -8509 -7583 -13153 -15694 -10941 -21539 -35687 -36373 -26096 -2777 6100 20293
2925 20293 21959 15796 8841 12046 17274 5835 -20063 -25520 -603 8587 3326 10851 19378 3875
2911 3875 -24521 -18096 18579 9655 -6945 -41933 -48612 -50470 -45340 -40995 -31517 -18599 -14589 -20526
2897 -20526 -14283 -5625 10690 19194 9958 22524 11048 -369 -10497 -31471 -24099 -8102 10331
2884 10331 2712 7959 -9060 -12640 -3420 -2350 -19024 -24117 -22922 -19710 786 12338 -4217
2871 -4217 -4844 11576 -3090 -3064 3173 19957 -366 -17991 -8679 -9636 -16130 -17075 -7093 -13723 -3102
2856 -3102 -16383 -29069 -22800 -20938 -23230 -34594 -23125 -5705 -1524 -24246 -8518 10684 10178
2843 10178 -10787 -22440 -25598 -30661 -10477 10973 1859 -5818 -1585 -22064 -39876 -60130 -55847
2830 -55847 -44302 -42214 -37816 -24726 -14046 194 4102 -4301 2769 22322 23667 40408 26867
2817 26867 5576 -1493 12513 4933 -4933 -8808 -13225 -30626 -24135 -3101 -5124 -21608 -12992
2804 -12992 -6531 -16146 -12373 -13964 -30833 -19556 11120 -1858 -18086 -18214 -14395 -9614 -12098 -20980
2790 -20980 -25213 -16456 -7291 -10585 -22638 -20386 11610 21948 5284 -9192 -20560 -8949 995
2777 995 15746 -2573 -3917 -742 -6381 -5552 -6465 -5434 -19996 -23933 -19651 -5119 17885 26946
2763 26946 24678 14641 15533 30847 35245 22611 -850 -20594 -7173 19246 18759 8152 -10315
2750 -10315 -31081 -25830 -16616 -730 329 -13165 -8129 13647 39381 44416 39080 18171 8567
2737 8567 17714 -2721 -4379 -6666 -19318 -16520 -22872 -17506 -6435 -1852 13395 19892 16913 -7856
2723 -7856 -1262 -2037 -14100 4527 6854 4647 10773 -1148 -10454 -60 12257 2392 -4477 -14737
2709 -14737 -7781 -6318 -2219 7837 13750 15456 -2581 -23776 -30722 -21974 -18093 -28655 -29863 -9459
2695 -9459 -372 3100 4071 -4410 -10946 -6369 8559 2102 -12900 6120 2892 -1995 -4246 7458
2681 7458 2015 -7281 -306 4939 -26797 -44792 -31923 -474 15190 18751 -2077 -8762 14979
2668 14979 22543 27190 15393 8756 14928 10310 4495 -5416 1416 -1056 11365 12175 14398 19426
2654 19426 2441 -7837 -17032 -22264 -8231 138 -7399 -27598 -30164 -24353 -14219 -23329 -28896
2641 -28896 -26747 -10711 3714 1610 3471 -6623 -17182 -31486 -39555 -21143 2520 5866 8992
2628 8992 2203 9000 5352 -16341 -5598 -4391 -12050 -15630 -4198 27092 21910 -9309 -7885 2264
2614 2264 8783 5718 11164 20448 15637 17623 -1153 -8132 -10998 -9315 -4052 -16236 -30870 -20323
2600 -20323 -7146 -11747 -13099 9791 3472 -7491 -27786 -15145 -13387 -31562 -12704 4940 -1087
2587 -1087 3925 -375 2835 9831 12259 8553 2199 17261 22817 19419 30202 22780 8647 -13212
2573 -13212 -26662 -12219 428 9183 22687 17688 4897 14663 7494 18763 24389 8278 -14755
2560 -14755 -26579 -16736 -31238 -14817 -4596 4043 -13902 -35297 -21014 15488 28663 8491
2548 8491 -6159 8542 10629 -8770 -4414 2551 -12235 -10146 -19282 -17629 -20568 -13981 -11104 -7571
2534 -7571 -28031 -29019 -7338 9985 -1876 -15853 -10198 13549 7896 -6265 -23794 -21027 -4827
2521 -4827 -16054 -5509 -5977 1731 9136 13811 35938 23677 8595 7032 22510 15805 15098 1984
2507 1984 1054 14219 17337 11154 31329 43965 29824 -1443 -15342 -7512 -5864 -6901 -10998 -11973
2493 -11973 -15639 -17616 -14867 -635 -10892 3012 24972 27964 9679 11922 2054 9372 30187
2480 30187 42938 52360 50615 27878 22866 12142 -5952 -12143 -22170 -22858 -22785 -9757 -14616 -13202
2466 -13202 -11929 -17835 4424 25529 15484 -8769 -886 3093 5332 10788 10183 9250 6919 -9227
2452 -9227 -15902 -2403 36871 44099 20854 23054 32051 29788 33411 45668 45634 43728 49803 34753
2438 34753 41898 27075 13738 7111 6456 9736 32226 45954 45283 24668 3959 5417 13643 11989
2424 11989 1371 12993 20377 6207 8141 10042 24072 30144 25452 11299 10883 6111 13276 10305
2410 10305 4161 1082 6289 9834 18382 14748 22602 15342 20612 5421 -6391 -12821 2092 9619
2396 9619 6948 -7064 12864 12518 6033 1539 15101 8308 2151 5604 -8840 -4961 16313 16868
2382 16868 10857 8261 -7489 -24487 -30083 -32810 -26192 -25620 -21399 -16909 254 -3732 -19508 -3090
2368 -3090 26184 38809 32251 1812 7135 9402 238 9745 16526 -10273 -15570 -3772 -17545
2355 -17545 -21138 -24846 -38252 -23661 -17326 -13134 -388 2383 -7252 -27391 -13622 -8136 4673
2342 4673 13497 16098 -2826 -8784 -13058 -23435 -44773 -20793 18619 15400 317 3334 5662
2329 5662 14639 5288 -3649 -14058 -16457 -8426 -14812 -19029 -7544 10197 10033 12262 21387 6212
2315 6212 -4983 -6177 4132 11575 12986 5247 2036 -1938 1592 -3902 -14254 -26885 -11712 7120
2301 7120 11749 24936 19050 2551 5606 25983 31170 32747 16113 15727 15246 -3106 -3055 -11806 -5033
2286 -5033 21178 30957 36820 22216 13659 26875 12052 -11260 -16612 -8517 3353 21315 10024
2273 10024 -10828 -6434 -23112 -13013 -1259 -1662 -17746 -17972 -12221 -8916 2792 26871 16690
2260 16690 -15504 -22859 -13751 -5746 -23461 -29202 -20195 -10672 -4295 1577 -6755 -18332 -4674 10054
2246 10054 9210 -12024 -12548 10100 10408 11031 15997 4069 16685 26836 28423 9364 -110 13419
2232 13419 16073 14735 17610 3537 -8344 -14179 -31580 -42811 -32686 -23422 -27235 -25818 -1300
2219 -1300 8718 4593 14548 7530 4736 17884 6702 -10122 -10174 -16050 -32160 -22985 -13942 -26336
2205 -26336 -48222 -34686 -18909 -5475 -15074 -13695 -14263 -12742 -24560 -24488 -22434 -7913 -18968 -17659
2191 -17659 -3272 569 10293 2923 4890 11590 17221 12681 26246 43767 46866 46385 25481 -1451
2177 -1451 -2776 -14121 -11652 -9483 -20739 -6232 11316 -6050 -21566 -12278 9219 12457 15735
2164 15735 14308 4770 717 -293 -9271 -5532 -17209 -23765 -21194 -8611 -2741 -2996 2890 12611
2150 12611 15560 -2038 -2071 -689 10406 -3050 -22066 -23175 -22257 -27247 -16945 -2057 1410 -1266
2136 -1266 -25889 -704 -9444 16767 18511 -16646 -36418 -31768 -24868 -29503 -37426 -22630 -9837
2123 -9837 -18485 -21717 -13722 -501 -1513 -5340 3048 11256 -11523 -29344 -32106 -9342 5271 106
2109 106 -14330 -11403 -1888 7227 1197 -7192 -2421 14744 8536 4173 5357 3730 -3735 -21296
2095 -21296 -23743 -19872 -11927 17911 27867 6652 4135 6874 -5807 -19619 -13953 -20692 -23526 -8256
2081 -8256 7040 -15267 -17223 -18535 -12312 -11077 -5728 -1249 11032 -273 -15503 -22862 -27771 -6318
2067 -6318 13568 13885 9062 4265 6828 5845 12749 24462 25219 26314 19957 18639 22181 10024 -2415
2052 -2415 1067 -4079 -381 -3366 12195 29379 25795 22200 22566 23979 14399 6733 2161 -2949 11819
2037 11819 17854 -3498 -7053 3205 13350 10977 -972 6521 14095 9056 19086 33253 31309
2024 31309 8193 -3376 -10424 -21387 -22562 3290 15708 9947 -6016 -8274 -5377 -4246 1366
2011 1366 -2614 19451 40527 40380 31079 15803 11072 -2557 -1533 -1923 -18400 -15731 -13734 -20143
1997 -20143 -14812 -14831 -3992 157 11633 3539 1816 20509 27799 27813 21631 12534 6148 1572 -14092
1982 -14092 -23281 -27407 -3708 -1169 -9029 -10224 -14881 -12769 -2458 9232 -1076 1905 12545
1969 12545 18945 530 8940 4428 -8681 -9758 -8374 -12668 -5710 -1995 13773 18289 12884 -6283
1955 -6283 -6831 14787 25763 9694 -1469 6047 -12556 -9776 3380 -6285 -11330 -17075 -7840 -8803
1941 -8803 -15640 3175 14496 8677 6205 16742 16575 18764 15597 5920 12761 10531 -1632 -11953
1927 -11953 8726 22122 17759 19766 26996 40921 42751 44037 34914 3008 -8695 16912 36667
1914 36667 31431 13658 3136 -4484 -12127 -8603 -10804 -14096 -18643 -19458 -19513 -14422 -5500 15470 9457
1899 9457 -3636 -15798 -16588 -13804 -19956 -14997 -11605 -32261 -33599 -23996 -16765 -9835 2815 27644
1885 27644 33863 -5838 -8877 -13055 -23191 -28127 471 -19893 -30577 -32486 -34187 -33061 -16270
1872 -16270 -8694 -994 1010 -13682 692 6843 9099 13623 10380 26536 21804 21387 1903 5290
1858 5290 8825 6202 1270 2061 19947 26730 7571 -16406 -25630 -31190 -26013 -9768 -7856 -6323
1844 -6323 -7663 -18753 -14952 -9547 -29467 -21565 -20584 -11099 -18629 -28277 -38538 -41060 -32235 -29535
1830 -29535 -27198 -14478 -10171 -185 -9435 2490 -2067 1866 516 7001 -13403 -31891 -17940
1817 -17940 -6569 11297 16829 27218 25514 -2771 -10820 -8311 4145 19234 18796 16233 -6915
1804 -6915 2633 24089 16202 16222 -396 -193 11084 23834 23689 13444 9221 8153 11697 25773
1790 25773 14956 -2474 -6329 -12037 2199 604 -12999 -11244 1407 -4164 -1634 -3266 -4219 13492
1776 13492 14964 9940 14607 -3568 -12148 -9458 14546 16422 9884 -1984 -4925 -4318 -15911 -22735
1762 -22735 -20000 -4983 9833 13836 11134 6146 -8490 -13521 2324 13049 21835 20031 17607
1749 17607 31302 23857 35512 39910 20300 7555 449 34691 26699 22100 43050 20930 23625
1736 23625 6091 5117 19067 6320 -16229 -10869 -4296 -9529 -6680 -14855 -12070 -15200 -15948 -16555
1722 -16555 4256 6944 -3733 -10480 5039 8380 2826 14478 23460 23915 25574 13813 3174
1709 3174 13569 21493 27894 26025 15059 18472 33741 33105 24904 21146 -16480 -14774 -12378 -4552
1695 -4552 8373 14665 11974 8029 23940 10586 -970 1882 32788 24544 1740 -695 12203
1682 12203 -4833 -23226 -17596 -14727 -19084 -30747 -28495 -17612 -17650 -13306 -11170 -11751 -8757 -12334
1668 -12334 -10134 -6626 -22111 -25551 -19468 -6847 -242 2856 -8730 -10476 3589 8414 7827 13496
1654 13496 9690 24587 29994 9219 16602 41093 42966 31227 12082 10898 36450 42787 21398
1641 21398 7671 8987 8722 658 4675 11347 18448 12042 -6790 -17430 -6888 7242 27839
1628 27839 24927 5329 19727 18961 3982 1419 -1644 6731 2823 -9495 11294 13429 18179 41290
1614 41290 38441 18953 16025 29229 37243 47272 28790 15044 18606 19592 10844 2961 4548 5883
1600 5883 -34 -16386 -839 19832 11665 -12426 -33023 -29596 -21932 -15981 -16353 -16095 -5418 -4787
1586 -4787 -22696 -26513 -7759 -434 2642 3044 13106 21263 26532 15218 11872 7424 3854 -11019
1572 -11019 -12831 -18101 -13511 -5412 -388 -2563 -12746 6126 6289 16517 7713 3316 -4846 8789
1558 8789 4978 5131 16195 29495 49027 42132 28530 17945 5993 21138 6821 19842 18042
1545 18042 6925 -6234 -21569 -14104 -10231 -2973 4542 24709 19758 -9906 -9322 -7203 -773 -527
1531 -527 23227 11934 15098 4294 5170 21011 18543 -1008 -1609 -2463 2024 2652 -4630 -12873 1195
1516 1195 14601 9346 14915 13766 -936 -1919 -2800 -10171 -4037 10637 9385 8418 9770 6976 1374
1501 1374 -7247 -25473 -28315 4347 35215 13673 -6053 -11886 -10872 -14005 -22295 -38678 -29055
1488 -29055 1355 -3298 10555 19400 20183 25298 22381 15450 18898 18796 19094 -4464 -21543 -12222
1474 -12222 8596 6058 6586 11808 -639 5896 10762 22963 17053 5575 18924 34279 34896 27115
1460 27115 19094 -2825 -10367 2266 25302 35928 35406 19013 23550 19412 16965 23667 26332 23875
1446 23875 31975 18869 17124 25548 7128 22505 33590 4895 -21053 6730 -2059 -23978 -32677
1433 -32677 -22696 3141 15580 20634 8846 22108 25049 27349 46739 37797 5979 -18757 -8937
1420 -8937 -5626 6023 10441 17357 2166 2796 18665 22313 18059 7104 -6427 1251 29982 31796
1406 31796 20135 142 1273 3037 10921 25159 25713 10704 19512 25531 11608 -557 16570
1393 16570 23524 32293 34049 29040 6003 14449 10386 5977 25744 2419 -1239 4688 8896 -3133
1379 -3133 -8398 2617 -3322 -11026 -9789 -15626 -28950 -19271 -22492 -18712 -6295 7607 16311 16211
1365 16211 16398 25824 32530 20205 9800 655 -6237 -15236 -31759 -25785 -18460 -9647 -10253 -9842 -18131
1350 -18131 -10317 3879 -10996 -24678 -31343 -17316 -2713 9444 -4741 -10126 -23527 -12875
1338 -12875 -3960 -745 6558 6787 -12254 -36061 -45076 -18415 -2341 -6879 3316 -133 10403
1325 10403 1364 17188 11741 -9576 -21046 -8290 10439 8773 -12086 -5796 -1670 -19737 -20332
1312 -20332 -16144 -1160 351 4952 -6460 -8020 6650 14624 1553 -12457 -33538 -43509 -24723
1299 -24723 -10391 -2327 -5217 -9284 -13542 -10215 546 1237 2620 19241 32332 26748 1756 10377
1285 10377 13921 25593 19413 -2621 -4970 12094 33530 47057 20610 12555 20429 7872 -14889
1272 -14889 -15192 -5008 -3299 -3276 10445 8238 11560 4507 -9521 1550 -4667 2226 16479 10080
1258 10080 30869 54740 37640 26297 32929 49762 56513 39367 25871 23547 15101 1982 10512
1245 10512 10150 8838 19113 33404 20617 13457 19144 895 25299 29071 13001 9376 22917
1232 22917 22127 26473 33008 8408 -9675 -1114 21630 24714 23091 19308 3331 5151 13411 -2836
1218 -2836 -4893 -2470 -12907 8482 3778 -104 1830 14022 21602 37906 17902 14393 -6090
1205 -6090 -15642 -2301 27929 36685 12992 -5865 -422 8942 10940 17768 16847 12980 11484 17403
1191 17403 12233 7819 23541 20824 2521 12950 204 10524 23890 30025 16280 18214 33511
1178 33511 34229 27992 10911 13986 296 -8821 3584 -4814 9 7694 -1097 -11593 21720 20723
1164 20723 -10163 -9360 14278 12854 12471 29672 42183 50259 68547 65120 41436 37167 39639 31151
1150 31151 27027 25557 13410 -4268 -14280 -17603 -3791 -5347 7414 8406 6032 11182 24924
1137 24924 23860 19484 10928 8527 644 -9789 -33545 -34866 -11002 -8851 4757 2619 1080 8555
1123 8555 30134 46360 33415 23500 30983 28464 29684 39059 34334 34404 26292 17732 16297 -5211
1109 -5211 1151 13019 10657 1632 -856 26343 31679 28731 30215 14882 11822 26755 20425 17067
1095 17067 23596 31968 13750 -11494 -13287 -4789 -6112 -9140 -11729 -9466 -6036 -1669 6288 23620
1081 23620 36946 22170 8235 19892 30689 17853 2012 -388 4539 -3387 25 6460 -3466
1068 -3466 -24757 -22512 -4625 -9580 -6179 1823 -2362 13871 21804 6304 -9784 -2276 16722
1055 16722 37765 31583 16550 -12177 -17707 -10794 5237 6435 9035 19345 11456 12941 25689
1042 25689 37219 33293 26928 11844 2335 8002 7552 3367 -5404 -21120 -23509 -24690 -26085 -25557
1028 -25557 -12482 -25145 -22298 -8256 9433 8227 -3745 13232 17976 -327 -1640 28222 47134
1015 47134 45816 25559 12544 2124 -17996 -29848 -11508 818 13784 26689 32086 38843
1003 38843 40855 28149 14550 19306 24789 29259 14737 -1282 -13602 -4745 3619 6698 -4555
990 -4555 9046 6279 -4497 -10000 -5068 2405 -3407 -3000 -5858 -18076 -17880 -496 9512 -3016
976 -3016 -1961 14092 8212 -3593 -14202 -22224 -30507 -20923 -14505 -2139 -957 -23611 -7503 2377
962 2377 5283 16997 14463 21887 32797 42001 8477 5400 19395 9120 1554 11047 18990 16540
948 16540 20944 14257 20614 19401 19540 28296 37398 24059 -2456 -8765 6025 25546 16860 -1104
934 -1104 7890 11554 1812 -14308 -9670 -9772 -8495 -10365 -3405 17759 37037 49179 58113 49095
920 49095 33556 24348 6253 1262 7355 12585 10204 9244 -12 1550 9249 -5119 -20719 -27917
906 -27917 -14941 -4884 -93 27910 34261 11867 1860 20866 28322 19844 11848 24205 13051
893 13051 -1145 5016 17393 25358 28233 31608 23289 10389 6098 -1535 -9754 -10271 10580 7233
879 7233 -10171 -24385 -26539 -31219 -22297 -21588 6513 8163 -5743 -12578 -7600 2203 6939 13702
865 13702 33775 34087 6165 -10205 -15282 -2609 8560 14789 31272 33333 16399 14602 20779
852 20779 24691 23124 913 -15735 -738 8001 -1951 4055 5316 -6474 4564 21647 31289
839 31289 13202 8812 8177 29010 35274 15715 -3910 -11253 -11219 -10042 10718 21309 25396 41675
825 41675 39870 43433 23392 -14 -7643 5353 19 6361 6445 3323 -861 -1020 10741 9773 -2502
810 -2502 -11161 -21357 -16777 -12947 -15281 -8128 -5335 28251 18923 7594 20070 -324 6102 11008
796 11008 16033 10901 -415 -7435 -5517 -18506 -6898 16485 15789 16022 7066 20842 31360 35464
782 35464 36747 23262 -798 11709 22940 21833 10773 11487 5984 3089 8334 7771 5234 -9706
768 -9706 -11065 905 7648 -8728 -6096 -533 13762 20850 10475 -9887 -44504 -39388 -13066
755 -13066 -4799 -7679 -5073 -6320 1892 20536 36059 32656 31664 30296 33097 30542 13273 14675
741 14675 13241 -8408 -13318 -19385 -16209 5654 2486 197 9383 20975 28280 28233 22776 17922 12012
726 12012 5382 4097 -6335 -11034 -4061 18149 29596 30413 22107 16076 2784 -16951 -27834 -28112
712 -28112 -26868 -15677 15446 20735 -966 9837 16952 18030 15147 5192 17897 22715 12267
699 12267 2090 -8819 -11626 13679 25487 1782 17593 19571 10982 -246 5393 -3712 431
686 431 755 6298 29318 21920 22797 16692 4257 7844 20169 15340 2380 5738 19754 26617 24356
671 24356 27666 19976 3352 -5883 -4384 -1680 -3891 -582 -1103 -13266 -12761 4044 -359 -11153
657 -11153 -5781 -8864 -6549 4938 5981 -9032 -25768 -18066 3108 12038 20714 37649 45729 34835
643 34835 27580 19003 2538 -9521 -3406 4046 345 7888 22657 5401 -505 5497 -529 -2666
629 -2666 -7293 -8383 8643 11108 7296 -7961 -4218 15381 19509 9944 6043 2210 -4200 -6315
615 -6315 -2242 6974 -5612 -13102 -16199 -23283 -11853 -12816 -5384 -2917 9053 18272 6036 20742
601 20742 23652 17293 9919 6421 -10860 -5346 18999 10152 -11846 -27222 -29904 -13802 7766
588 7766 -1216 861 14341 7685 28459 34191 37214 7385 -24523 -25888 -23416 -26665 -5313 8875
574 8875 7555 14580 15396 19103 3880 4988 9467 -10361 -43160 -50199 -36328 -10550 1783 19438
560 19438 12790 1257 17610 -7114 -27804 -30925 -26226 -25211 -20186 -6474 9108 15566 13480
547 13480 21968 25602 18797 19341 14147 8045 9269 21879 17331 21162 33834 26108 23804 8139
533 8139 -2006 -12061 -31442 -31908 -19747 3335 7505 8093 38170 37915 17002 -1321 -13200 -17823
519 -17823 -5373 -89 -138 25156 53419 56599 49487 45389 29632 4853 -7874 18970 35106
506 35106 22958 -11274 -17928 -25488 -19855 -14913 -1084 3102 6209 -2245 11527 18476 7982 2249
492 2249 24347 31234 12200 33720 36455 5346 -20648 -4668 3231 3545 7387 1337 10830 12988
478 12988 25242 22580 28664 44871 39978 31654 35033 42806 33284 -4678 -10255 -4024 -9463 4304
464 4304 22644 31055 21532 16444 29121 21089 10557 3054 -20921 -16522 7614 11403 28861 27975
450 27975 2069 7232 15150 10480 7085 12845 11621 6277 -9324 -6349 14304 19212 13553 7761
436 7761 109 10229 7688 2859 1295 -11967 -27322 -20803 -20408 -13770 -17693 -5757 -5014 2153 15623
421 15623 23879 15693 23779 31234 9603 15703 10051 -2558 -15513 9429 39535 32994 26152 38959
407 38959 24764 16622 39824 48421 48930 39246 36412 51926 24749 5230 16773 14309 19022 20603
393 20603 12608 4845 11512 8662 1616 -12252 -15801 -10032 -3319 831 9430 22116 19457 7484
379 7484 -13964 -21874 -20747 -22073 -14030 -113 20597 32923 27642 14400 -932 -19855 -16927
366 -16927 -15887 -13561 -6202 5441 15608 12911 12856 12196 1244 -10215 -21960 -25248 -14097 -14522
352 -14522 -17268 -6393 4442 2632 3384 8379 16150 11595 7691 -4251 -11760 7969 1898 -12744
338 -12744 -5913 4863 9892 11319 1738 1335 -12007 -3704 5046 2856 2122 27229 31730 25675 11543
323 11543 5163 -2747 -5062 626 -2541 -2110 -2352 -11325 -21932 -24721 -29419 -43708 -36278 -16944 -8141
308 -8141 -14274 10056 17109 -7049 -5099 15667 40359 29190 12085 -3991 -597 -3556 -14192
295 -14192 -15980 2149 2552 10686 3793 -3120 -1989 -12589 -5116 11551 14793 11715 26663 18230
281 18230 6627 6676 -1434 -860 27814 35355 46074 48335 29490 21307 32825 24401 12048 -1344
267 -1344 8753 9758 9903 15124 5452 25746 19568 14639 22225 26355 10775 -4706 7820 9025
253 9025 20088 16892 5469 -6185 -6467 -2330 1490 4633 -2724 303 11412 13911 -6541 -19578
239 -19578 -10074 9771 17774 37844 31155 19064 8237 -12801 -20859 -24376 -16274 3337 9662
226 9662 19313 17116 4030 1740 -3934 -5302 16648 25480 26867 18142 4958 20353 31185 21033
212 21033 20842 24976 -4011 16340 6097 -9031 -19829 -24780 10226 21595 21111 14818 8173 2797
198 2797 -8372 -10138 -6408 -6977 2733 6888 19177 41593 41682 12965 -2374 2103 9105 15008 13225
183 13225 5732 9324 -170 -9063 -9983 -6700 -10824 -116 12517 11542 17709 18272 25104 6395 -10704
168 -10704 -15071 -8455 8842 21101 19346 17611 17338 9915 7606 1641 10272 10491 12923 15174 15060
153 15060 17593 13427 9021 12008 8258 -4258 2078 7246 17559 14826 -2407 1901 18484 18602
139 18602 8007 -7860 -5893 -3392 1491 9272 1388 -2944 1210 11965 5533 6880 5982 11270
125 11270 11330 9106 14557 9376 -2263 6417 1456 7893 3466 -7435 -12486 -1642 -5830 -9000 701
110 701 9648 11849 15765 15140 21991 22227 2921 -2688 -3451 13875 34340 15345 -8115 -15629 1877
95 1877 20773 17061 18790 9615 -3030 -216 12190 12937 23024 30210 31958 17341 19250 11874
81 11874 1945 12379 8377 13068 19739 22522 9509 -4204 -2878 -7023 -10374 -5214 -1420 -3093
67 -3093 1108 -6492 -8245 -3928 -320 1973 -4125 -3344 12433 26074 26480 22483 34894 30233 11671
52 11671 -820 4889 10317 16124 24154 20819 8730 8242 3694 -7727 4767 7129 17067 11257
38 11257 -7647 4712 14315 6629 467 -5789 3461 -1439 -8085 -10812 -6025 -38 779 -9217 3601
23 3601 3250 5877 11511 9462 17768 16265 9226 8065 13903 12898 8431 6819 16706 9718 -4721
8 -4721 -11157 -9018 3979 17342 11305 17546 25765 14058
0 14058
$$ Imaginary data points
##PAGE= N=2
##DATA TABLE= (X++(I..I)), XYDATA
32767 76452 72721 80922 89918 96325 102429 105265 94839 90858 96327 90607 93011 100291 106143 109694
32753 109694 116686 115051 119012 111528 99699 116313 128820 122236 126482 120782 132039 135986 126213
32740 126213 127543 119403 116003 106929 105847 115700 109659 117211 119939 124967 125777 133453 141158 135974
32726 135974 134086 124201 114579 109083 113270 133571 142425 139662 139053 133781 138837 144834 141190 133168
32712 133168 140718 142155 148755 150261 152140 146532 145366 159358 163146 156914 146750 147583 143384 140649
32698 140649 148728 153416 150090 151236 151265 145432 134291 140878 149543 164625 161981 145449 152366 158436
32684 158436 158533 165525 174880 184591 190702 188756 194805 195059 175651 168746 175077 176764 160273 152100
32670 152100 169510 176426 183983 187975 193101 203299 194233 181361 162267 152010 149390 150521 152681
32657 152681 172402 180025 179257 172629 181283 189809 182665 182373 183233 170289 167679 164464 178670 188753
32643 188753 186638 192233 190922 201054 193167 205003 193761 188042 200026 223821 209553 200043 207846
32630 207846 209994 216028 196579 175889 171309 172384 181839 176164 179640 174928 179313 190541 208743
32617 208743 216027 213114 207958 205905 199563 204161 191740 171029 186592 202898 216990 220355 215153
32604 215153 214618 222611 221951 229206 246448 240492 229161 224971 227279 222869 221048 229249 234990 238757
32590 238757 239209 229346 227735 236268 236729 234704 241542 250542 245878 236095 232375 228600 241934 256947
32576 256947 240905 211401 207156 215712 227036 236618 260804 254712 242788 235468 229160 241802 249310
32563 249310 249045 236162 236226 235657 224872 224048 242135 247643 237686 241186 249008 247176 240963 237908 256152
32548 256152 261527 253296 247564 241277 247061 268216 279031 273711 266701 253836 248557 261234 262464
32535 262464 276011 280544 265043 254209 251314 261720 264626 268567 270152 268937 261202 251000 241512
32522 241512 243329 233704 238421 248230 246430 261726 267985 272634 277980 280334 275903 267868 260197 258932
32508 258932 267200 268553 276429 290736 279111 268422 274346 271682 274846 277342 278709 272863 273131 269983
32494 269983 255912 261399 273621 278157 290354 280492 278428 284922 272940 278233 287986 282484 281870
32481 281870 285614 283757 267476 268109 266972 279053 289554 301548 301572 291242 292226 300752 296945 297724
32467 297724 308582 302820 292716 281994 274556 266338 257643 269547 273451 259317 255676 269422 269494
32454 269494 273320 284027 294092 289547 283215 277255 288036 292279 293921 298620 299385 294431 284236
32441 284236 278195 272497 287144 315815 328701 327516 310516 311567 316588 308461 300482 313178 315837
32428 315837 313246 325381 331777 327732 328050 322966 330046 319083 298440 311545 309217 306859 309007
32415 309007 305565 306125 310809 318047 315441 315563 309771 308397 317668 316299 312317 322311 326030 342231
32401 342231 342720 337593 325805 346054 345743 332635 299271 295446 306761 311699 321289 335361 349512
32388 349512 344002 324537 308186 293101 315095 346971 340242 319826 299574 286013 302315 326047
32376 326047 347289 353082 341463 342015 342511 337840 339624 335933 347364 364595 353589 342910 328897
32363 328897 310992 319400 325795 328907 327434 334271 323626 329174 348598 356622 333884 322027 314455
32350 314455 315414 340080 346278 333293 318380 299798 274997 274119 288982 312145 300904 307639 312333
32337 312333 310876 319739 340583 341480 321246 320066 302787 300622 319158 333604 336195 336714 347629
32324 347629 364934 366169 376500 353512 332798 320181 336930 346034 339390 340251 339208 331409 338320
32311 338320 343310 347599 355200 352675 323936 305649 320806 339866 345500 343624 345334 345466 356235
32298 356235 342504 340142 321721 320057 315750 283718 277675 294354 317519 322513 336483 337093 326097
32285 326097 320332 342508 345078 326484 335053 325204 315482 320776 352278 358259 337801 352393 363865
32272 363865 366007 350958 325431 326584 337422 347417 364621 367584 357081 362312 356246 335012 361612
32259 361612 373199 366013 357452 352106 347598 347842 328842 321516 332607 342792 357250 361412 341022
32246 341022 312710 317768 334263 335995 326737 330537 325171 354370 369781 359303 347818 354160 362828
32233 362828 355953 354968 346802 345234 375176 381721 364032 359345 374138 377272 363806 343284 331290
32220 331290 341261 363777 368205 356830 332878 318554 320533 340808 330886 322382 324442 325871 349416
32207 349416 358121 353698 348588 343863 338666 350066 354226 356723 358860 370065 386795 382160 361775
32194 361775 343941 337849 355878 352347 349061 345281 347337 365474 369074 364881 341675 334888 334776
$$ [...]
##END NTUPLES=NMR SPECTRUM
##END=
