##TITLE=Analysis number 318204
Compound Code cc 51510
Book Reference 438/108
Project Code adrs
Chemist Name antons
##JCAMPDX= 6.0         $$ Bruker NMR JCAMP-DX V2.0
##DATA TYPE= NMR SPECTRUM
##DATA CLASS= NTUPLES
##ORIGIN= Bruker BioSpin GmbH
##OWNER= nmr
$$ XWIN-NMR		Version 3.5
$$ Mon Mar 20 13:52:19 2006 GMT Standard Time (UT+0h)  MAYBRIDGE\nmr@NMR_250MHZ
##.OBSERVE FREQUENCY= 250.131544655141
##.OBSERVE NUCLEUS= ^1H
##.ACQUISITION MODE= SIMULTANEOUS (DQD)
##.ACQUISITION SCHEME= undefined
##.AVERAGES= 16
##.DIGITISER RES= 18
##SPECTROMETER/DATA SYSTEM= dpx250
##.PULSE SEQUENCE= zg30
##.SOLVENT NAME= CDCl3
##.SHIFT REFERENCE= (INTERNAL, CDCl3, 0, 16.522)
##AUDIT TRAIL= $$ (NUMBER, WHEN, WHO, WHERE, WHAT)
$$ ##TITLE= Audit trail, XWIN-NMR		Version 3.5
$$ ##JCAMPDX= 5.01
$$ ##ORIGIN= Bruker BioSpin GmbH
$$ ##OWNER= nmr
$$ C:\u/data/dgb/nmr/ADRS/1080/pdata/1/auditp.txt
$$ ##AUDIT TRAIL=  $$ (NUMBER, WHEN, WHO, WHERE, WHAT)
(   1,<2006-03-20 13:51:32.38 +000>,<MAYBRIDGE\nmr>,<NMR_250MHZ>,
      <created by zg, POWCHK disabled, PULCHK disabled
       configuration hash MD5:
       84 BC 41 DB A1 6E 1D 46 DA 25 12 A5 C1 ED C5 3A
       data hash MD5: 64K
       6C CC DE 25 4B 35 6E 52 0C BB 61 F2 3E 87 03 0C>)
(   2,<2006-03-20 13:51:53.79 +000>,<MAYBRIDGE\nmr>,<NMR_250MHZ>,
      <Start of raw data processing
       ef LB = 0.3 FT_mod = 6 PKNL = 1 SI = 32K 
       data hash MD5: 32K
       EA 00 7A 8D E7 A3 DA D9 39 8B 72 F5 09 40 A4 AB>)
(   3,<2006-03-20 13:51:58.15 +000>,<MAYBRIDGE\nmr>,<NMR_250MHZ>,
      <apk 
       data hash MD5: 32K
       3F 39 F6 66 1E B8 79 CC B1 C0 DF 40 6C BD 23 AD>)
(   4,<2006-03-20 13:51:59.73 +000>,<MAYBRIDGE\nmr>,<NMR_250MHZ>,
      <abs ABSG = 5 
       data hash MD5: 32K
       4F 13 59 45 01 BF 9E 12 3C 6F 05 48 A4 83 96 55>)
$$ ##END=
$$ 
$$ hash MD5
$$ F0 21 9B 9B 09 DA B0 15 1B 2F 3C 9C 14 E4 52 4D
##$RELAX= 
##$RELAX= 
##$RELAX= 
##$RELAX= 
##$RELAX= 
##$RELAX= 
##$RELAX= 
$$ Bruker specific parameters
$$ --------------------------
##$DU= <C:\u>
##$EXPNO= 1080
##$NAME= <ADRS>
##$PROCNO= 1
##$TYPE= <nmr>
##$USER= <dgb>
##$AMP= (0..31)
100 100 100 100 100 100 100 100 100 100 100 100 100 100 100 100 100 100 
100 100 100 100 100 100 100 100 100 100 100 100 100 100 
##$AQSEQ= 0
##$AQ_mod= 3
##$AUNM= <au_zg>
##$AUTOPOS= <40 >
##$BF1= 250.13
##$BF2= 250.13
##$BF3= 250.13
##$BF4= 250.13
##$BF5= 500.13
##$BF6= 500.13
##$BF7= 500.13
##$BF8= 500.13
##$BYTORDA= 1
##$CFDGTYP= 0
##$CFRGTYP= 5
##$CHEMSTR= <none>
##$CNST= (0..31)
1 1 145 1 1 1 1 1 1 1 1 1 1 1 1 1 1 1 1 1 1 1 1 1 1 1 1 1 1 1 1 1 
##$CPDPRG= <>
##$CPDPRG1= <>
##$CPDPRG2= <>
##$CPDPRG3= <>
##$CPDPRG4= <mlev>
##$CPDPRG5= <mlev>
##$CPDPRG6= <mlev>
##$CPDPRG7= <mlev>
##$CPDPRG8= <mlev>
##$CPDPRGB= <>
##$CPDPRGT= <>
##$D= (0..31)
0 1 0 0 0 0 0 0 0 0.06 0 0 0 0 0 0 0.0002 0 0 0 0 0 0 0 0 0 0 0 0 0 0 
0 
##$DATE= 1142862689
##$DBL= (0..7)
120 120 120 120 120 120 120 120 
##$DBP= (0..7)
150 150 150 150 150 150 150 150 
##$DBP07= 0
##$DBPNAM0= <>
##$DBPNAM1= <>
$$ [...]
##$SUBNAM7= <"">
##$SUBNAM8= <"">
##$SUBNAM9= <"">
##$SW= 20.6930455092707
##$SWIBOX= (0..15)
0 0 3 0 0 0 0 0 0 0 0 0 0 0 0 0 
##$SW_h= 5175.983436853
##$TD= 65536
##$TD0= 1
##$TE= 293.16
##$TE2= 300
##$TE3= 300
##$TEG= 300
##$TL= (0..7)
0 120 120 120 120 120 120 120 
##$TP= (0..7)
150 150 150 150 150 150 150 150 
##$TP07= 0
##$TPNAME0= <>
##$TPNAME1= <>
##$TPNAME2= <>
##$TPNAME3= <>
##$TPNAME4= <>
##$TPNAME5= <>
##$TPNAME6= <>
##$TPNAME7= <>
##$TPOAL= (0..7)
0.5 0.5 0.5 0.5 0.5 0.5 0.5 0.5 
##$TPOFFS= (0..7)
0 0 0 0 0 0 0 0 
##$TUNHIN= 0
##$TUNHOUT= 0
##$TUNXOUT= 0
##$USERA1= <user>
##$USERA2= <user>
##$USERA3= <user>
##$USERA4= <user>
##$USERA5= <user>
##$V9= 5
##$VALIST= <valist>
##$VCLIST= <CCCCCCCCCCCCCCC>
##$VD= 0
##$VDLIST= <DDDDDDDDDDDDDDD>
##$VPLIST= <PPPPPPPPPPPPPPP>
##$VTLIST= <TTTTTTTTTTTTTTT>
##$WBST= 1024
##$WBSW= 4
##$XGAIN= (0..3)
0 0 0 0 
##$XL= 0
##$YL= 0
##$YMAX_a= 404460
##$YMIN_a= -368487
##$ZGOPTNS= <>
##$ZL1= 120
##$ZL2= 120
##$ZL3= 120
##$ZL4= 120
##$ABSF1= 16.522
##$ABSF2= -4.171173
##$ABSG= 5
##$ABSL= 3
##$ALPHA= 0
##$AQORDER= 0
##$ASSFAC= 0
##$ASSFACI= 0
##$ASSFACX= 0
##$ASSWID= 0
##$AUNMP= <proc_1d>
##$AZFE= 0.1
##$AZFW= 0.1
##$BCFW= 0
##$BC_mod= 0
##$BYTORDP= 0
##$COROFFS= 0
##$CY= 12.5
##$DATMOD= 1
##$DC= 0
##$DFILT= <>
##$DTYPP= 0
##$F1P= 14.0000005364418
##$F2P= -0.99999901652339
##$FCOR= 0.5
##$FTSIZE= 32768
##$FT_mod= 6
##$GAMMA= 0
##$GB= 0
##$INTBC= 1
##$INTSCL= 1
##$ISEN= 128
##$LB= 0.3
##$LEV0= 0
##$LPBIN= 0
##$MAXI= 10000
##$MC2= 0
##$MEAN= 0
##$ME_mod= 0
##$MI= 0
##$NCOEF= 0
##$NC_proc= -2
##$NLEV= 6
##$NOISF1= 0
##$NOISF2= 0
##$NSP= 0
##$NTH_PI= 0
##$NZP= 0
##$OFFSET= 16.522
##$PC= 1
##$PHC0= 19.82751
##$PHC1= 6.797476
##$PH_mod= 1
##$PKNL= yes
##$PPARMOD= 0
##$PSCAL= 4
##$PSIGN= 0
##$REVERSE= no
##$SF= 250.13
##$SI= 32768
##$SIGF1= 0
##$SIGF2= 0
##$SINO= 400
##$SIOLD= 32768
##$SREGLST= <1H.CDCl3>
##$SSB= 0
##$STSI= 32768
##$STSR= 0
##$SW_p= 5175.98343685301
##$SYMM= 0
##$S_DEV= 0
##$TDeff= 65536
##$TDoff= 0
##$TI= <Analysis number 999999
Compound Code 99
Book Reference 9
Project Code 9>
##$TILT= no
##$TM1= 0
##$TM2= 0
##$TOPLEV= 0
##$USERP1= <user>
##$USERP2= <user>
##$USERP3= <user>
##$USERP4= <user>
##$USERP5= <user>
##$WDW= 1
##$XDIM= 32768
##$YMAX_p= 309935939
##$YMIN_p= -19930
$$ End of Bruker specific parameters
$$ ---------------------------------
##NTUPLES= NMR SPECTRUM
##VAR_NAME=  FREQUENCY,     SPECTRUM/REAL,   SPECTRUM/IMAG
##SYMBOL=    X,             R,               I
##VAR_TYPE=  INDEPENDENT,   DEPENDENT,       DEPENDENT
##VAR_FORM=  AFFN,          ASDF,            ASDF
##VAR_DIM=   32768,         32768,           32768
##UNITS=     HZ,            ARBITRARY UNITS, ARBITRARY UNITS
##FACTOR=    0.157963299565203, 1,           1
##FIRST=     4132.6476996994, 0,             0
##LAST=      -1043.33573715361, 0,           0
##MIN=       -1043.33573715361, -19930,      0
##MAX=       4132.6476996994, 309935939,     0
$$ Real data points
##PAGE= N=1
##DATA TABLE= (X++(R..R)), XYDATA
$$ [...]
17197B6691J150J32k998l456l243k747L58J749O67j924j51J634j676k192r27n813
$$ 26691 27841 27973 24975 21519 18276 15529 15887 17636 18303 16379 16228 17862 16186 13994 13067 7254
17181G254o110k462k502K02n9L313M138K806J155k51p31j274o20l516m061l483
$$ 7254 1144 -1318 -3820 -3618 -3677 -364 3774 6580 7735 7484 6753 5479 4859 1343 -2718 -6201
17165f201l873k879j094l25o12j069Q29J897M428K464L270O636J0809J5067J1054
$$ -6201 -10074 -12953 -14047 -14372 -14984 -16053 -15224 -13327 -8899 -6435 -3165 3471 14280 29347 40401
17150D0401N449o395j0840j4088r773m639N18n46n48j622p25L196K023L00q15
$$ 40401 45850 39455 28615 14527 4754 115 633 87 -461 -2083 -2808 388 2411 2711 1896
17135A896m505l542J551N66Q34M69k92j860l041J15l11k712j815k31L056o19K039
$$ 1896 -2609 -6151 -4600 -4034 -3200 -2731 -3023 -4883 -7924 -7809 -8120 -10832 -12647 -12878 -9822 -10441 -8402
17118h402M817J448k200l386J54K408K729Q60j306j968n76l85n58O3R21k470j150
$$ -8402 -3585 -2137 -4337 -7723 -7569 -5161 -2432 -1572 -2878 -4846 -5422 -5807 -6365 -6302 -5381 -7851 -9001
17101i001J059J59O8R73K143L10l405n861j977L108K881l82M52n02j851k135p29
$$ -9001 -7942 -7783 -7715 -6742 -4599 -4289 -7694 -13555 -15532 -12424 -9543 -9925 -9473 -9975 -11826 -13961 -14690
17084a4690j266m73j25J493M133O825M831J922k2k354j124j602k588k991l434
$$ -14690 -15956 -16429 -16554 -15061 -10928 -4103 728 2650 2628 274 -850 -2452 -5040 -8031 -11465
17069a1465n075j065r02K661K875M21K073J832j63q94l295L1K674J40M29k25j068
$$ -11465 -16540 -17605 -18507 -15846 -12971 -12550 -10477 -8645 -8808 -9702 -12997 -12966 -10292 -10152 -9723 -9948 -11016
17052a1016r34J506l32n79J027j339K75K967j117p56R60K120J439Q9K885J128
$$ -11016 -11950 -10444 -10776 -11355 -10328 -11667 -11392 -8425 -9542 -10298 -9338 -7218 -5779 -5690 -2805 -1677
17036a677l90l016l367m044j585K037K506J80m74O55k888K955N373K617L182p
$$ -1677 -2067 -5083 -8450 -12494 -14079 -12042 -9536 -9356 -9830 -9175 -12063 -9108 -3735 -1118 2064 2057
17020B057j247l799O2j730Q2j178m69j580r63l962j390j029R93J143j222N03J595
$$ 2057 810 -2989 -2927 -4657 -4575 -5753 -6222 -7802 -8765 -12727 -14117 -15146 -14153 -13010 -14232 -13729 -12134
17003a2134j785n5J446n37J1j42k382Q84J786J276J216j494n05J880L19j057M227
$$ -12134 -13919 -13974 -12528 -13065 -13054 -13196 -15578 -14694 -12908 -11632 -10416 -11910 -12415 -10535 -10216 -11273 -7046
16986g046R52J687K602K406l8l85q33j461k584l948k136j355j160k082j232q0
$$ -7046 -6094 -4407 -1805 601 563 178 -655 -2116 -4700 -8648 -10784 -12139 -13299 -15381 -16613 -16693
16970a6693K860J724J972l50k580K90L497K075N3n35j140j065j032k211j080J10
$$ -16693 -13833 -12109 -10137 -10487 -13067 -12777 -9280 -7205 -7152 -7687 -8827 -9892 -10924 -13135 -14215 -14105
16954a4105m7q81j83j900j80R51K103K078J068j275j099k940k349J796M525J459
$$ -14105 -14152 -15033 -15216 -17116 -17296 -16345 -14242 -12164 -11096 -12371 -13470 -16410 -18759 -16963 -12438 -10979
16938a0979K82o41l11k747L719K946Q92j22k82q91l1K726Q33j95J493k657o78
$$ -10979 -10697 -11338 -11649 -14396 -10677 -7731 -6839 -6961 -7243 -8134 -8165 -5439 -4606 -4801 -3308 -5965 -6643
16921f643l50J64Q99m02J0P99l615n579l467J328o08j116j350O26K546J80n80
$$ -6643 -6993 -6829 -5930 -6332 -6322 -5523 -9138 -14717 -18184 -16856 -17464 -18580 -19930 -19304 -16758 -16578 -17158
16904a7158M599L419m49l614Q77K293P23O75j159J5m25K059K505L083N161L829
$$ -17158 -12559 -9140 -9589 -13203 -12326 -10033 -9310 -8635 -9794 -9779 -10204 -8145 -5640 -2557 2604 6433
16888F433Q36j267p2j85k636J863M277P403J3719J4444K0232J7408Q425q53p731
$$ 6433 7269 6002 5930 5745 3109 4972 9249 16652 30371 44815 65047 82455 90880 90027 82296
16873H2296o800n02L520J554j0118j6042j3520o163j353L992R796J1076P930P237
$$ 82296 75496 74994 78514 80068 69950 53908 40388 34225 32872 36864 46660 57736 65666 72903
16859G2903O345O932p97r099j6499j7237j1854r786p908m044j332J278P92N401
$$ 72903 79248 86180 85383 76284 59785 42548 30694 20908 13000 8956 7624 8902 9694 15095
16845A5095L729K007l38l995n900m800k765l35q49j679j019p6j039k77L132O313
$$ 15095 18824 20831 20493 16498 10598 5798 3033 2698 1849 170 -849 -925 -1964 -2241 891 7204
16829G204Q131R708J1731J4675J1989M906K302l474K184Q680O237j967j2718j7709
$$ 7204 15335 25043 36774 51449 63438 68344 70646 67172 69356 78036 84273 82306 69588 51879
16815E1879q871l298p02J123l718o688j537j180j419m02o93J235N227J0457J3712
$$ 51879 43008 39710 39008 40131 36413 29725 28188 27008 25589 25187 24494 25729 30956 41413 55125
16800E5125J5271J0387K753n531j1129j0206o823j1552j5947j0148r308p501k687
$$ 55125 70396 80783 83536 78005 66876 56670 49847 38295 22348 12200 2892 -4609 -7296
16787g296k169J676p25r65N78l61j787j286j98o24k3j304j417J054K741j009j387
$$ -7296 -9465 -7789 -8514 -9479 -8901 -9262 -11049 -12335 -12533 -13157 -13180 -14484 -15901 -14847 -12106 -13115 -14502
16770a4502J253Q74J495J924j340K65k36Q96J043j436K76k753k171m39J406J689
$$ -14502 -13249 -12375 -10880 -8956 -10296 -10031 -10267 -9371 -8328 -9764 -9488 -12241 -14412 -14851 -13445 -11756
16754a1756r1J148j768k834m70R02J174K956J429j389k223m74l25L330J825J855
$$ -11756 -11847 -10699 -12467 -15301 -15771 -14869 -13695 -10739 -9310 -10699 -12922 -13396 -13721 -10391 -8566 -6711
16738f711n39k118q6j028j731J535m76k374k136J258K078L35J017P18q07k591
$$ -6711 -7250 -9368 -9454 -10482 -12213 -10678 -11154 -13528 -15664 -14406 -12328 -11993 -10976 -10258 -11065 -13656
16722a3656r1j84J677M96K537l24l18O36N66r93l011l222N80K699k828J61J011
$$ -13656 -13747 -13931 -12254 -11758 -9221 -9545 -9863 -9227 -8661 -9654 -12665 -15887 -15307 -12608 -15436 -15275 -14264
16705a4264J071L189O76k049K17Q21P59n08O41K3m36j559l277l77O97m84k34j36
$$ -14264 -13193 -10004 -9328 -11377 -11160 -10339 -9580 -10088 -9447 -9424 -9860 -11419 -14696 -15073 -14376 -14860 -15094 -15230
16687a5230O07L896K639j503J989P09o14j455k103j413L52L12j47J504K751j1
$$ -15230 -14623 -10727 -8088 -9591 -7602 -6893 -7507 -8962 -11065 -12478 -12126 -11814 -11961 -10457 -7706 -7717
16671g717k887K98j829L32J503k529j560J747M031J510q42j717j760j973J512
$$ -7717 -10604 -10306 -12135 -11803 -10300 -12829 -14389 -12642 -8611 -7101 -7943 -9660 -11420 -13393 -11881
16656a1881J521K750J36j340q00q12Q93L048p31k03o83O90n18j188m05J563j556
$$ -11881 -10360 -7610 -7474 -8814 -9614 -10426 -9533 -6485 -7216 -7419 -8102 -7412 -7930 -9118 -9523 -7960 -9516
16639i516n0j392q90k64k503J117J417n11j190q98L832J72k220p26K976K698j81
$$ -9516 -9566 -10958 -11848 -12112 -14615 -13498 -12081 -12592 -13782 -14680 -10848 -10676 -12896 -13622 -10646 -7948 -8129
16622h129l492K55q5j992k38L905K322J54k017n98M52K029q80k542l16J25k04
$$ -8129 -11621 -11366 -11451 -13443 -13681 -9776 -7454 -7300 -9317 -9915 -9463 -7434 -8314 -10856 -11172 -11047 -11251
16605a1251K341j697j495J008J926K285J63O99R98k67J06N84q04Q5m22j175J066
$$ -11251 -8910 -10607 -12102 -11094 -9168 -6883 -6720 -6021 -5023 -5290 -5184 -4600 -5404 -5319 -5741 -6916 -5850
16588e850J61j916j778P88J533j41J105j786m89J453k52J592N43p19j57Q80j481
$$ -5850 -5689 -7605 -9383 -8595 -7062 -7203 -6098 -7884 -8373 -6920 -7172 -5580 -5037 -5756 -5913 -5033 -6514
16571f514P0j254l63K44m5k99n16L175O47j285J256J039n90l465j331P92j112
$$ -6514 -6444 -7698 -8061 -7817 -7862 -8161 -8677 -5502 -4855 -6140 -4884 -3845 -4435 -7900 -9231 -8439 -9551
16554i551q81n84K169N23N74j072Q18J320K141M5l645q11Q16k023j395K910J631
$$ -9551 -10432 -11016 -8847 -8324 -7750 -8822 -8004 -6684 -4543 -4498 -8143 -8954 -8138 -10161 -11556 -8646 -7015
16537g015J29j271o18K621j496r18J88p37j076j205R88l89o06M58J23N96l67J739
$$ -7015 -6886 -8157 -8775 -6154 -7650 -8568 -8380 -9117 -10193 -11398 -10410 -10799 -11405 -10947 -10824 -10228 -10595 -8856
16519h856k728k665L434J556N92q17j915J096K611J782n60l06k89k471K498P67
$$ -8856 -11584 -14249 -10815 -9259 -8667 -9484 -11399 -10303 -7692 -5910 -6470 -6776 -7065 -9536 -7038 -6271
16503f271j193J66J246M41k427r65J306K987M19j027k890k118k36k0J547J357
$$ -6271 -7464 -7298 -6052 -5611 -8038 -9003 -7697 -4710 -4291 -5318 -8208 -10326 -10562 -10582 -9035 -7678
16487g678M31l06P55J913J287n51k197j252j89j574n95o79J812J092r78r23k929
$$ -7678 -7247 -7553 -6798 -4885 -3598 -4149 -6346 -7598 -7787 -9361 -9956 -10635 -8823 -7731 -8709 -9632 -12561
16470a2561J544K037J259l55J065Q50O40m7O76J756n89o55L8o30r39l51M67J042
$$ -12561 -11017 -8980 -7721 -8076 -7011 -6161 -5521 -5568 -4892 -3136 -3725 -4380 -4342 -4972 -5911 -6262 -5795 -4753
16452d753K29p06K632N40J340m52l269j818J6Q58J353K272O13j636j103q11j643
$$ -4753 -4524 -5230 -2598 -2058 -718 -1170 -4439 -6257 -6241 -5383 -4030 -1758 -1145 -2781 -3884 -4695 -6338
16435f338L9K882j04k32L464j753l517j275J244M67q62m99q31J071R81K601j945
$$ -6338 -6299 -3417 -3521 -3753 -289 -2042 -5559 -6834 -5590 -5123 -5985 -6484 -7315 -6244 -5263 -2662 -4607
16418d607k335J637m10K143J069p69J018k873j586o82M00J106P01J28J484N48
$$ -4607 -6942 -5305 -5715 -3572 -2503 -3272 -2254 -5127 -6713 -7395 -6995 -5889 -5188 -5060 -3576 -3028
16402c028J294J368p50k088j122l7J47J755M79j644j949k333m79q50K874R88K134
$$ -3028 -1734 -366 -1116 -3204 -4326 -4363 -4216 -2461 -1982 -3626 -5575 -7908 -8387 -9237 -6363 -5375 -3241
16385c241K469M43n39K163j759k25L65l202k947q6RJ379L355o48j667P52J5r28
$$ -3241 -772 -329 -868 1295 -464 -689 -324 -3526 -6473 -6559 -6550 -5171 -1816 -2464 -4131 -3379 -3364 -4292
16367d292P67m53J351J17j812k261r87Q01J302j292p43K421j350j128O02R85J543
$$ -4292 -3525 -3978 -2627 -2510 -4322 -6583 -7570 -6769 -5467 -6759 -7502 -5081 -6431 -7559 -6957 -5972 -4429
16350d429J637j311j19Q14J540j179j096p06J703P99k54J814J927j366k279j149
$$ -4429 -2792 -4103 -4222 -3408 -1868 -3047 -4143 -4849 -3146 -2347 -2601 -787 1140 -226 -2505 -3654
16334c654N30j023p05n06j01J32J470J578l65j727n02j486N23N61q09Q33Q52n4
$$ -3654 -3124 -4147 -4852 -5358 -5459 -5327 -3857 -2279 -2644 -4371 -4873 -6359 -5836 -5275 -6084 -5251 -4399 -4453
16316d453j380j066J471J370j761p43L15L13J452J817k10j719k065k398n57N57
$$ -4453 -5833 -6899 -5428 -4058 -5819 -6562 -6247 -5934 -4482 -2665 -2875 -4594 -6659 -9057 -9614 -9057
16300i057K264J584K180J027J96l14K528j67O14j062n34L067O7k085m287k439
$$ -9057 -6793 -5209 -3029 -2002 -1806 -2120 408 241 855 -207 -741 2326 2393 308 -3979 -6418
16284f418J820Q56o8K2q83J176J507o44n11J055n03k951j307K31J222k862p98
$$ -6418 -4598 -3742 -3810 -3788 -4671 -3495 -1988 -2632 -3143 -2088 -2591 -5542 -6849 -6618 -5396 -8258 -9056
16267i056n19J758M097O38L19q6j301Q72N45q11o57N07J317J014o43j042J081
$$ -9056 -9575 -7817 -3720 -3082 -2763 -2849 -4150 -3278 -2733 -3544 -4201 -3694 -2377 -1363 -2006 -3048 -1967
16250a967Mj062k770j599K219o03q91r59J216J064j894M31M99R5K089K07r8K701
$$ -1967 -1963 -3025 -5795 -7394 -5175 -5778 -6669 -7628 -6412 -5348 -7242 -6811 -6312 -6217 -4128 -3921 -4019 -1318
16232a318J322o89j629m00K1j68P76M67r98J63J862m48k344n30J223k67k87R00
$$ -1318 4 -685 -2314 -2714 -2693 -2861 -2085 -1618 -2616 -2453 -591 -1039 -3383 -3913 -2690 -2957 -3244 -2344
16214b344Q87j994j361l27J085k293k083J920M86K57J342K828J360k88j126l82
$$ -2344 -1457 -3451 -4812 -5139 -4054 -6347 -8430 -6510 -6024 -5767 -4425 -1597 -237 -525 -1651 -2033
16198b033j42m85K09Q46L85Q47j478R20M99j71m75k021n8j182M35L839N65K37
$$ -2033 -2175 -2660 -2451 -1605 -1220 -373 -1851 -931 -432 -603 -1078 -3099 -3157 -4339 -3904 -65 500 737
16180G37k04l747l32J291j109J85o51N76j579l00L34k169j59J584NQ77R24L904
$$ 737 533 -3214 -3546 -2255 -3364 -3179 -3830 -3254 -4833 -5133 -4799 -6968 -7127 -5543 -5538 -4661 -3737 167
16162A67l118l045K903K736q29j429O4k356k012r67J656J090K69K19Q85j765M4
$$ 167 -2951 -5996 -3093 -357 -1186 -2615 -2551 -4907 -6919 -7886 -6230 -5140 -4871 -4652 -3767 -5532 -5488
16145e488m61j383p39J188n20J094K643Q85J73J057k353l443P44K574O83j062
$$ -5488 -5949 -7332 -8071 -6883 -7403 -6309 -3666 -2781 -2608 -1551 -3904 -7347 -6603 -4029 -3346 -4408
16129d408m1Q41K192L54k018k066o94JL067L83L13J95l32j528j324k610R04K954
$$ -4408 -4449 -3608 -1416 -1062 -3080 -5146 -5840 -5839 -2772 -2389 -2076 -1881 -2213 -3741 -5065 -7675 -6771 -3817
16111c817L48j288k81K146L411N58j367m66j879j909j121j283N54l00J652J416
$$ -3817 -3469 -4757 -5038 -2892 519 1077 -290 -756 -2635 -4544 -5665 -6948 -6394 -6694 -5042 -3626
16095c626L34j559j781j261Q93K784K521J586o37k844j447J214m5J727K245R11
$$ -3626 -3292 -4851 -6632 -7893 -7000 -4216 -1695 -109 -746 -3590 -5037 -3823 -3868 -2141 104 1015
16079A015p54l328j267j432q40J943J200J623K221k226q81M28J501L402j126j047
$$ 1015 261 -3067 -4334 -5766 -6606 -4663 -3463 -1840 381 -1845 -2726 -2298 -797 2605 1479 432
16063D32J389J376o44N81j547k353J06L5Q34K011j55k442j043j07L61k19q27J430
$$ 432 1821 3197 2553 3134 1587 -766 -660 -625 209 2220 2065 -377 -1420 -1527 -1166 -1385 -2212 -782
16045g82J491J636m02j716k028l270j613Q46J670k25j235M50J020J352N96J077
$$ -782 709 2345 1943 227 -1801 -5071 -6684 -5838 -4168 -4393 -5628 -5178 -4158 -2806 -2210 -1133
16029a133k06L1j40j57O3l87j109J364Q88J308k985m058k117J723L952L257j295
$$ -1133 -1339 -1308 -1448 -1605 -1542 -1929 -3038 -1674 -786 522 -2463 -6521 -8638 -6915 -2963 294 -1001
16012a001o81l39K050N64k00o17j958n59l64K031q94K37R34O79j6m18J972L76
$$ -1001 -1682 -2021 29 593 393 -224 -2182 -2741 -3105 -1074 -1968 -1731 -797 -118 -134 -552 1420 1796
15994A796l08K198M90R44J693j181Q30p17N80p05j918l519N52r58n92j354j019
$$ 1796 1488 3686 4176 5120 6813 5632 6462 5745 6325 5620 3702 183 735 -223 -815 -2169 -3188
15977c188o10J75j330j03K963J695j268j258q55k279P91J13L154N63k139K54k488
$$ -3188 -3798 -3623 -4953 -5056 -2093 -398 -1666 -2924 -3779 -6058 -5267 -5154 -2000 -1437 -3576 -3322 -5810
15960e810o26M55L76p32n72J585Q41q6p07r81J80K95q7R0q55j096j827K281K879
$$ -5810 -6436 -5981 -5605 -6337 -6909 -5324 -4483 -4569 -5276 -6257 -6077 -5782 -5869 -5779 -6634 -7730 -9557 -7276 -4397
15941d397O67J420K43j143j72j806k162r08M5K349J982J081K282k385j106j77
$$ -4397 -3730 -2310 -2067 -3210 -3382 -5188 -7350 -8258 -8213 -5864 -3882 -2801 -519 -2904 -4010 -4187
15925d187J711R25N39Q06j533m119o44K744L69J23P12J043n86k015j033j010m47
$$ -4187 -2476 -1551 -1012 -206 -1739 -5858 -6502 -3758 -3389 -3266 -2554 -1511 -2097 -4112 -5145 -6155 -6602
15908f602J141K228j015k697k397J508J493J491J314J081Q87R22J50k972J366
$$ -6602 -5461 -3233 -4248 -6945 -9342 -7834 -6341 -4850 -3536 -2455 -1568 -646 -496 -3468 -2102
15893b102J43j218P95l073j080p76o46K680K23p12p34o9o04K574K158O47J49K683
$$ -2102 -1959 -3177 -2382 -5455 -6535 -7311 -7957 -5277 -5054 -5766 -6500 -6569 -7173 -4599 -2441 -1794 -1645 1038
15875A038k295q42p41j155j57J090l38n88p57j24M6N28J487J179l43p35j481K17
$$ 1038 -1257 -2099 -2840 -3995 -4152 -3062 -3400 -3988 -4745 -4869 -4823 -4295 -2808 -1629 -1972 -2707 -4188 -3971
15857c971J872j11P93j013l060q43j261K052K696O46q28L58R89j170j341L48J020
$$ -3971 -2099 -2210 -1417 -2430 -5490 -6333 -7594 -5542 -2846 -2200 -3028 -2670 -1681 -2851 -4192 -3844 -2824
15840b824k5M16l48k033k056k246O23n4m94j022n22K773L010K073O10k023O43
$$ -2824 -2849 -2433 -2781 -4814 -6870 -9116 -8493 -8547 -9041 -10063 -10585 -7812 -4802 -2729 -2119 -4142 -3499
15823c499P75K410k196k37k677k179K111K084n53J057L21j62J867L11j777J99
$$ -3499 -2724 -314 -2510 -2747 -5424 -7603 -5492 -3408 -3961 -2904 -2583 -2745 -878 -567 -2344 -2145
15807b145J396j709j411l24k630J974K490n39l711o33N3r21J068j121l85P9N11
$$ -2145 -749 -2458 -3869 -4193 -6823 -4849 -2359 -2898 -6609 -7242 -7189 -8110 -7042 -8163 -8548 -8469 -7958
15790g958J65K41K142R40R06j182J189j778l75R18J396O23J684o45j290p17K09
$$ -7958 -7793 -7552 -5410 -4470 -3564 -4746 -3557 -5335 -5710 -4792 -3396 -2773 -1089 -1734 -3024 -3741 -3532
15773c532K606o99q61J11J015l82N83J372K731L82k369m517j749J800P47o25M102
$$ -3532 -926 -1625 -2486 -2375 -1360 -1742 -1159 213 2944 3326 957 -3560 -5309 -3509 -2762 -3387 715
15756G15K326k75j674k231j978J241K22l486R39J741j201j59l74O89L82l34j999
$$ 715 3041 2766 1092 -1139 -3117 -1876 -1654 -5140 -4201 -2460 -3661 -3820 -4194 -3505 -3123 -3457 -5456
15739e456K02J499O98j630m26j91K034L114M56r33k162j274j77j14K212J533R32
$$ -5456 -5254 -3755 -3057 -4687 -5113 -5304 -3270 -156 300 -633 -2795 -4069 -4246 -4360 -2148 -615 317
15722C17l081k092k597K11k26M64K185K194J213N46j871n25J373m52m06J749j223
$$ 317 -2764 -4856 -7453 -7242 -7468 -7004 -4819 -2625 -1412 -866 -2737 -3262 -1889 -2341 -2747 -998 -2221
15705b221o60j337J740O43j668k486O20K231J152k62J243J145K385J727J059J195
$$ -2221 -2881 -4218 -2478 -1835 -3503 -5989 -5369 -3138 -1986 -2248 -1005 140 2525 4252 5311 6506
15689F506k203m874j973k133q7R30o49M09l41N04K434K362J75k243k748J508J201
$$ 6506 4303 -571 -2544 -4677 -4764 -3834 -4483 -4074 -4415 -3911 -1477 885 1060 -1183 -3931 -2423 -1222
15672a222K35j352n70K76j20J55J242O01P74k76r2k447l243O19j24J64K35J668
$$ -1222 -987 -2339 -2909 -2633 -2753 -2598 -1356 -755 19 -257 -349 -2796 -6039 -5420 -5544 -5380 -5145 -3477
15654c477O36R15R70J955J41j33n56m75R6k535j471R62J556L729J240k049m76
$$ -3477 -2841 -1926 -956 999 1140 1007 451 -24 72 -2463 -3934 -2972 -1416 2313 3553 1504 1028
15637A028J977p18j360k443j749J265M13R36J867k39k725q87K203J33j112j167
$$ 1028 3005 2287 927 -1516 -3265 -2000 -1587 -651 1216 977 -1748 -2635 -432 -299 -1411 -2578
15621b578R01J200M96o34r01m6J307J17L64J269J353M51J158J775j22M16j192
$$ -2578 -1677 -477 19 -615 -1516 -1562 -255 -138 226 1495 2848 3299 4457 6232 6110 6526 5334
15604E334k316m84j53j377J777J915J463j085J161k292m20L724P37j131J04J218
$$ 5334 3018 2534 2381 1004 2781 4696 6159 5074 6235 3943 3523 7247 7984 6853 6957 8175
15588H175j657l799m4K180r58m080n079q88J805M429K664L71j901o07j40M7L584
$$ 8175 6518 2719 2675 4855 3897 -183 -5262 -6150 -4345 84 2748 3119 1218 611 471 518 4102
15571D102J985p59n24k238k136k098J778J565M75r89O51J036N42L533L57k283
$$ 4102 6087 5328 4804 2566 430 -1668 110 1675 2150 1161 1812 2848 3390 6923 7280 4997
15555D997k704l718O13nJ154J436K393Q42J084K20k440l640k976M57Q54J648Q32
$$ 4997 2293 -1425 -812 -817 337 1773 4166 5008 6092 6312 3872 232 -2744 -2287 -1433 215 1047
15538A047J852o53L52J780P24r5j315k056p84r78j25q2K053J155K95J871J147
$$ 1047 2899 2246 2598 4378 5102 5007 3692 1636 852 -126 -251 -333 1720 2875 3170 5041 6188
15521F188J328j029k389j085k96J425N78M70j292J38L3m176j1K98k607p72R07
$$ 6188 7516 6487 4098 3013 2717 4142 4720 5190 3898 4036 4069 -107 -118 180 -2427 -3199 -2292
15504b292K493J918L59j115K20n1K041J456o5k374j570K357J848l48n67q09j199
$$ -2292 201 2119 2478 1363 1583 1532 3573 5029 4964 2590 1020 3377 5225 4877 4310 3501 2302
15487B302j489j432m42J656K260J474P80l193j119j082K066J712j231j633n64
$$ 2302 813 -619 -1061 595 2855 4329 5109 1916 797 -285 1781 3493 2262 629 65
15472F5k47J820j376l531J791J544n02j685l14k52M795L197k201k193j400N24
$$ 65 -182 1638 262 -3269 -1478 66 -436 -2121 -2435 -2687 2108 5305 3104 911 -489 35
15456C5Q57k56k570p86K999K3p29k637j462J778K552J715J153K141P18j765j727
$$ 35 892 636 -1934 -2720 279 302 -427 -3064 -4526 -2748 -196 1519 2672 4813 5531 3766 2039
15439B039k193k78J667k522J504P46j798M26r4j564M34K65K24k76m581k227L305
$$ 2039 -154 -432 1235 -1287 217 963 -835 -409 -503 -2067 -1633 -1368 -1144 -1420 -6001 -8228 -4923
15422d923L719R60M8L504N96m57j20P24k141j030l85K544m8J713o38r73k257J332
$$ -4923 -1204 -244 -196 3308 3904 3447 3327 4051 1910 880 495 3039 2991 4704 4066 3093 836 2168
15404B168P63K244M06j057k751J861J376r50j555j266k239O43J110K66L465L160
$$ 2168 2931 5175 5581 4524 1773 3634 5010 4060 2505 1239 -1000 -357 753 1019 4484 7644
15388G644J220j807p89l60J331M74R35p51j000p64m40n1j197M042J050j528n5
$$ 7644 8864 7057 6268 5908 7239 7713 8648 7897 6897 6133 5693 5642 4445 8487 9537 8009 7954
15371G954j955J61n69M41P04p77r7j801p34O80J345L04k14j63k817k291J012K741
$$ 7954 5999 6160 5591 6032 6736 5959 5862 4061 3327 4007 5352 5656 5442 5279 2462 171 1183 3924
15353C924L231m6j147J085R57Q07L78O35J26m932k702J250j901j727K48K163J434
$$ 3924 7155 7109 5962 7047 8004 8811 9189 9824 9950 5018 2316 3566 1665 -62 186 2349 3783
15336C783l73j445j57J514k88j564m2j28m084J27J541p02q96M279N53L22l3j867
$$ 3783 3410 1965 1808 3322 3034 1470 1428 1300 -2784 -2657 -1116 -1818 -2714 1565 2118 2440 2407 540
15318E40J0O04j174o3K469j51j293l3J332J03r80o13j729M42K586P07j265J454
$$ 540 550 1154 -20 -83 2386 2235 942 909 2241 2344 1364 751 -978 -536 2050 2757 1492 2946
15300B946j605j479q34j13k440J22J989L36n25k862q23J793j964J388K426J392
$$ 2946 1341 -138 -972 -1085 -3525 -3403 -1414 -1078 -1603 -4465 -5288 -3495 -5459 -4071 -1645 -253
15284b53J903R54k82j661j199n25k234J114M30j971P50J583L111l5k105N11N23
$$ -253 1650 2604 2322 661 -538 -1063 -3297 -2183 -1753 -3724 -2974 -1391 1720 1685 -420 91 614
15267F14j57N41J050O73J107j555l436N28Q86j47j907J324K41j468j141M74K483
$$ 614 457 998 2048 2721 3828 2273 -1163 -635 251 104 -1803 -479 -238 -1706 -2847 -2373 110
15250A10M22k148L97N02R15J76q4K456Q15K76m78j511j272r5K2P90R95r73q76
$$ 110 532 -1616 -1219 -717 198 374 290 2746 3561 3837 3359 1848 576 481 503 1293 2288 1315 439
15231D39j82j227j730K00J980K65n0K531O59o11N21j444k800J215N02j815J66
$$ 439 257 -970 -2700 -2500 -520 -255 -305 2226 2885 2274 2795 1351 -1449 -234 268 -1547 -1381
15214a381J929P12k67J668J764l32j87L42k319J053J441j819j741J023j275l59
$$ -1381 548 1260 993 2661 4425 4093 3906 4248 1929 2982 4423 2604 863 1886 611 252
15198B52k36O67M17j631r6R0O59J256j113k661l39J761O62N70J053p47j988K06
$$ 252 16 683 1100 -531 -627 -537 122 1378 265 -2396 -2735 -974 -312 258 1311 564 -1424 -1218
15180a218Q73M03p59j553K202K117k150J726L289N79n33r53l09n46k278J098N57
$$ -1218 -345 58 -701 -2254 -52 2065 -85 1641 4930 5509 4976 4023 3714 3168 890 1988 2545
15163B545j20K641N47L06j621l421j425o62r41N25j220K233J641P99J358M66j009
$$ 2545 2425 5066 5613 5919 4298 877 -548 -1210 -2151 -1626 -2846 -613 1028 1827 3185 3651 2642
15146B642Q8r25r56k074J958R15k2m17K673J404q45j261R31K569k50j864j346
$$ 2642 2730 1805 849 -1225 733 1648 1626 1209 3882 5286 4441 3180 4111 6680 6430 4566 3220
15129C220j565j627J253M004j888m452j240K480Q02R20L96p76l75J788K276L481
$$ 3220 1655 28 1281 5285 3397 -1055 -2295 185 987 1907 2303 1527 1152 2940 5216 8697
15113H697q30j730N2r46l883j491K180L177J773j990j600j888q48n21p02j255
$$ 8697 7867 6137 6189 5243 1360 -131 2049 5226 6999 5009 3409 1521 673 152 -550 -1805
15097a805j257J452N04j785p02J533K884r31j779k066Q54K423J653q3N83j506
$$ -1805 -3062 -1610 -1106 -2891 -3593 -2060 824 -107 -1886 -3952 -3098 -675 978 895 1478 -28
15081b8J659J650J975o63K39N53j5j542j836j516P88L339o22l802j339J419K622
$$ -28 1631 3281 5256 4593 4832 5385 5370 3828 1992 476 1264 4603 3981 179 -1160 259 2881
15064B881J918p76k400j65Q14j764K49Q75j273J697m89j352j473J539K22M52j813
$$ 2881 4799 4023 1623 1458 2272 508 757 1632 359 2056 1567 215 -1258 281 503 955 -858
15047h58o4L22J813K567j060m213J400J475k14L30r86l174J579K286r37p89J46
$$ -858 -922 -600 1213 3780 2720 -1493 -93 1382 1168 1498 512 -2662 -1083 1203 266 -523 -377
15030c77q09j669j521K216J437j054P03n08q67k77j654q00J098K512J854m82R81
$$ -377 -1186 -2855 -4376 -2160 -723 -1777 -1074 -1582 -2449 -2726 -4380 -5180 -4082 -1570 284 -198 783
15013G83k84p05J422J00o58l545q05R64l335O57J151J241J962J06j840N87M18
$$ 783 499 -206 1216 1316 658 -2887 -3692 -2728 -6063 -5406 -4255 -3014 -1052 -946 -2786 -2199 -1781
14996a781R01k267j983j00J727p50r35K3J356J300J84R51K501k03j065l38Kj006
$$ -1781 -880 -3147 -5130 -5230 -3503 -4253 -5188 -5165 -3809 -2509 -2325 -1374 1127 924 -141 -479 -477 -1483
14978a483m59o92j092K317K021k165j002J475m7j049o70r64j723K213J068L7n58
$$ -1483 -1942 -2634 -3726 -1409 612 -1553 -2555 -1080 -1127 -2176 -2846 -3810 -5533 -3320 -2252 -2215 -2773
14961b773p8J868K146J133o37k802r79p29n83K224Q12K1N96p97r23R1J998j030
$$ -2773 -2851 -983 1163 2296 1659 -1143 -2122 -2851 -3434 -1210 -398 -377 219 -578 -1501 -1410 588 -442
14943d42q76n72q03l64J084L8L158Q96k63j498O29N0j382O96p01p95Q22k477j103
$$ -442 -1318 -1890 -2693 -3057 -1973 -1935 1223 2119 1856 358 987 1037 -345 351 -350 -1145 -323 -2800 -3903
14924c903p76J408J38j800N74J996J126J23j872j938J540j260j785J188M752J064
$$ -3903 -4679 -3271 -3133 -4933 -4359 -2363 -1237 -1114 -2986 -4924 -3384 -4644 -6429 -5241 -489 575
14908E75j338j120j610j195k779j779L046J904K204J03j641j46L51L731J004j543
$$ 575 -763 -1883 -3493 -4688 -7467 -9246 -6200 -4296 -2092 -1989 -3630 -3776 -3425 306 1310 -233
14892b33m38n27J859K21l563l00K08j454p76J663L036O84k090j750j171Q98K138
$$ -233 -671 -1198 661 882 -2681 -2981 -2773 -4227 -5003 -3340 -304 380 -1710 -3460 -4631 -3733 -1595
14875a595K433J909J467J241K126K027J473J471J254k313j950k438Q79l519l925
$$ -1595 838 2747 4214 5455 7581 9608 11081 12552 13806 11493 9543 7105 7984 4465 540
14860E40j406j016j154j876L874L093K278k582m424N91q6K233l55m11R77j05k131
$$ 540 -866 -1882 -3036 -4912 -1038 2055 4333 1751 -2673 -2082 -2168 65 -290 -701 276 171 -1960
14843a960N56J585n4J870j358m62J294k22j208j666k186j975J071R20M51O46R32
$$ -1960 -1404 181 127 1997 639 177 1471 1249 41 -1625 -3811 -5786 -4715 -3795 -3344 -2698 -1766
14826a766k24k258k59R32j41j751K144J077j29kJ59J630O55J090k177P11k376
$$ -1766 -1990 -4248 -4507 -3575 -3716 -5467 -3323 -2246 -2375 -2377 -2218 -588 67 1157 -1020 -309 -2685
14809b685k50Q51o69J231J036O64j653k4k091q61K943L055K256J224K724L126
$$ -2685 -2935 -2084 -2753 -1522 -486 178 -1475 -1499 -3590 -4451 -1508 1547 3803 5027 7751 10877
14793A0877o61M63J053m14J449j474j002j871j874l90q42k131k267n75o60p00
$$ 10877 10216 10679 11732 11318 12767 11293 10291 8420 6546 6156 5314 3183 916 341 -319 -1019
14777a019j545J365m95K056P50j102o25R72K677m63j777O4J806j637l059o80k76
$$ -1019 -2564 -1199 -1694 362 1112 10 -615 357 3034 2571 794 858 2664 1027 -2032 -2712 -2988
14760b988k484K380K554M11j37J056M77k74o39l16j840l62K501j833l44j3J65
$$ -2988 -5472 -3092 -538 -127 -264 792 1269 995 356 40 -1800 -2162 339 -1494 -1838 -1851 -1686
14743a686R40O92p90j966n59J066K436L045n11m149k252R87J065l99J337q66k33
$$ -1686 -746 -54 -844 -2810 -3369 -2303 133 3178 2667 -1482 -3734 -2747 -1682 -2081 -744 -1610 -1843
14726a843p0J161k9k353Q61j163J378L532Q56m004l373J281J132K450r52j593
$$ -1843 -1913 -752 -781 -3134 -2273 -3436 -2058 1474 2330 -1674 -5047 -3766 -2634 -184 -1136 -2729
14710b729m57j684P67K678o29j437r75P50m23j978j545J493K060M73p57J863J045
$$ -2729 -3186 -4870 -4103 -1425 -2054 -3491 -4466 -3716 -4139 -6117 -7662 -6169 -4109 -3636 -4393 -2530 -1485
14693a485O34K22J368n2m263k058K077K808J71q49j902j253p7J603P40j296l517
$$ -1485 -851 -629 739 687 -3576 -5634 -3557 -749 -578 -1427 -3329 -4582 -4659 -3056 -2316 -3612 -7129
14676g129N95R40j27L72J046J505Q74m72l101J309Q10J457l76M37o80r87K200
$$ -7129 -6534 -5594 -5721 -5349 -4303 -2798 -1924 -2396 -5497 -4188 -3378 -1921 -2297 -1860 -2540 -3527 -1327
14659a327J457j733k333q72J163L412K96N3j264q02J41l65L83k524q78l73L449
$$ -1327 130 -1603 -3936 -4808 -3645 -233 63 116 -1148 -1950 -1809 -2174 -1791 -4315 -5193 -5566 -2117
14642b117K448l680o78J678k069j403L86k80l70L17n32K205J704K741K606l97
$$ -2117 331 -3349 -4027 -2349 -4418 -5821 -5435 -5715 -6085 -5768 -6300 -4095 -2391 350 2956 2559
14626B559M9o24O34K46k399m064k025L14K91P60j009K807J624J38J297q8n851
$$ 2559 2608 1984 2618 2864 465 -3599 -5624 -5310 -5019 -4259 -5268 -2461 -837 -699 598 510 -5341
14609e341k855J882K712K460J212N17Q08J312j013j608o4K147m77l007k770L08
$$ -5341 -8196 -6314 -3602 -1142 70 587 1395 2707 1694 86 22 2169 1692 -1315 -4085 -3777
14593c777n12M062J145j636R17K955J143k414j543m106k219p31J090K401j077
$$ -3777 -4289 -227 918 -718 199 3154 4297 1883 340 -3766 -5985 -6716 -5626 -3225 -4302
14578d302J753L6J753r98K21K62k20K169J044N16o87K88k473j713k61K08J914
$$ -4302 -2549 -2513 -760 -1758 -1537 -1275 -1495 674 1718 2234 1547 1835 -638 -2351 -2612 -2404 -490
14561d90N63kM08p71K8j484m238M73M855L78r23J011J830J27K025j138j673J023
$$ -490 73 71 479 -292 -264 -1748 -5986 -5513 -658 -280 -1203 -192 1638 1765 3790 2652 979 2002
14543B002j326k700Q07L617l18l233j096j166O60J197J19O94J30j033N10J042
$$ 2002 676 -2024 -1217 2400 2082 -1151 -2247 -3413 -2753 -1556 -1437 -743 -613 -1646 -1136 -94
14527i4r88J294K592k163k465l12L72Q72O36J132k474p97L136O59l19k8Q73J878
$$ -94 -1082 212 2804 641 -1824 -2136 -1764 -892 -256 876 -1598 -2395 741 1400 1081 1053 1926 3804
14509C804j211k840p75k225j921k19K674J610j534J403L051j17j301j780n92K268
$$ 3804 2593 -247 -1022 -3247 -5168 -5387 -2713 -1103 -2637 -1234 1817 1700 399 -1381 -1973 295
14493B95P10p65K290J9r19j753J159M02k4j853k542Q10N23k975R49J508J434k021
$$ 295 1005 240 2530 2549 1630 -123 1036 1438 1414 -439 -2981 -2171 -1648 -4623 -3674 -2166 -732 -2753
14475b753j831N85l80K999L449k497j651O10K325P42q41n92k408J238J884k78
$$ -2753 -4584 -3999 -4379 -1380 2069 -428 -2079 -1469 856 1598 757 165 -2243 -1005 879 601
14459F01r68n98K98m86j017O72J02o7k268J304K249r48l62L48J734K152l677k384
$$ 601 -367 -965 -667 -1153 -2170 -1498 -1396 -1463 -3731 -2427 -178 -1126 -1488 -1140 594 2746 -931 -3315
14441c315J48N75K680N39j231M47P42J693L317J979J347r42O01j434k373p51M09
$$ -3315 -3167 -2592 88 627 -604 -157 585 2278 5595 7574 8921 7979 8580 7146 4773 4022 4431
14424D431m28m513k601j53n16Q69O80J004L248J918N71J037J480R31k68j475j100
$$ 4431 4003 -510 -3111 -3264 -3780 -2911 -2231 -1227 2021 3939 4510 5547 7027 7958 7690 6215 5115
14407E115j270j939j533j22j734q34M16Q10q91k070K154M008J88m181m53l84K38
$$ 5115 3845 1906 373 251 -1483 -2317 -1901 -1091 -1982 -4052 -1898 2110 2298 -1883 -2336 -2720 -2482
14390b482J900q81J761J89j423R48K148R57k039j010k336K7J155N86l48L17k348
$$ -2482 -582 -1463 298 487 -936 12 2160 3117 1078 68 -2268 -2241 -1086 -500 -848 -531 -2879
14373b879k044j541r86J285o84J815L230J933j19j288K87M48p57j215k616j569
$$ -2879 -4923 -6464 -7450 -6165 -6849 -5034 -1804 129 10 -1278 -991 -543 -1300 -2515 -5131 -6700
14357f700L308J513n18n29J348K435o27j246j571j92L25O1j47M42N75j003o87
$$ -6700 -3392 -1879 -2397 -2926 -1578 857 230 -1016 -2587 -2779 -2454 -2393 -2540 -2098 -1523 -2526 -3213
14340c213q93J051J407j05j263P07L92K81J10K63J56j584k42m13J29J642J069
$$ -3213 -4106 -3055 -1648 -1753 -3016 -2309 -1917 -1636 -1526 -1263 -1107 -2691 -2933 -3346 -3217 -1575 -506
14323e06L3j728J942K38M68Q97j747M70M57k674k616j493r59R20L47R61J699J972
$$ -506 -473 -2201 -259 -21 447 1344 -403 67 524 -2150 -4766 -6259 -7218 -6298 -5951 -4990 -3291 -1319
14305a319k59N32m68n11O45J792n85r32l356P91K099L243Q89r17k290J414l84
$$ -1319 -1578 -1046 -1514 -2025 -1380 412 -173 -1105 -4461 -3670 -1571 1672 2561 1644 -646 768 384
14288C84k609L24N36J00j452K602M41k308K682J971n74n57J933M10j012l065o26
$$ 384 -2225 -1901 -1365 -1265 -2717 -115 326 -1982 700 2671 2097 1540 3473 3883 2871 -194 -820
14271h20j330j132q79k67K126J896n08P48K264r96m032q0O18r0R92j34J32r95
$$ -820 -2150 -3282 -4161 -4428 -2302 -406 -914 -166 2098 1102 -2930 -3010 -2392 -2482 -1490 -1624 -1492 -2487
14253b487j82L207J080j6j330j92m7j705P21N39J51o75j382n84j398j792J823
$$ -2487 -2669 538 1618 1602 272 80 33 -1672 -951 -412 -261 -936 -2318 -2902 -4300 -6092 -4269
14236d269P50j048r79j160J056L177R45J015R58L55j515p66K12J259l99L15O80
$$ -4269 -3519 -4567 -5546 -6706 -5650 -2473 -1528 -513 445 800 -715 -1481 -1269 -10 -409 -94 586
14219E86J70k306k24K475L031J392j408k029l516m05M083j679j15j374n95k254
$$ 586 756 -1550 -1774 701 3732 5124 3716 1687 -1829 -2234 1849 170 55 -1319 -1914 -4168
14203d168O88k03K38P10j705k011L932J972L77k565R70k040o20K44J124R22l83
$$ -4168 -3480 -3683 -3445 -2735 -4440 -6451 -2519 -547 -170 -2735 -1765 -3805 -4425 -4181 -3057 -2135 -2518
14186b518J185J719j059qK584J940L72j498j203k153j630j60R27K646j923j277
$$ -2518 -1333 386 -673 -681 1903 3843 4215 2717 1514 -639 -2269 -2429 -1502 1144 -779 -2056
14170b056J378R23R83l055J226J993q07N02K895j429J190M22r61q83k40k321q86
$$ -2056 -678 245 1228 -1827 -601 1392 585 1087 3982 2553 3743 4165 3204 2321 2081 -240 -1126
14153a126j57J33K773k24k355q86K601N8l497R48K456J40l34K639r18K49m88p62
$$ -1126 -1283 -1150 1623 1399 -956 -1842 759 817 -2680 -1732 724 864 530 3169 2251 2500 2012 1250
14135A250q55O26p69m50l017J29J130o7k364K511J648k731O5k74Q22J732K56J045
$$ 1250 395 1021 252 -198 -3215 -3086 -1956 -2023 -4387 -1876 -228 -2959 -2894 -3168 -2346 -614 -358 687
14117F87j873n36J280j824j38J400K150N62n96K56j465j652L62P16j801q77K960
$$ 687 -1186 -1722 -442 -2266 -2404 -1004 1146 1708 1112 1368 -97 -1749 -1387 -671 -2472 -3349 -389
14100c89k91Q62J015k50j691L44O70m06k305O67J804k139n28K577J171k732j551
$$ -389 -680 182 1197 947 -744 -400 270 -136 -2441 -1774 30 -2109 -2637 -60 1111 -1621 -3172
14083c172P76P67N59J822K18M36J737o0j732j223K236K035o7n07l90k125j489
$$ -3172 -2396 -1629 -1070 752 970 1406 3143 3083 1351 128 2364 4399 4332 3825 3435 1310 -179
14066a79K579K232n63l34l46j008n48k882j808P25J272P23L00N07L74j555Q3M4
$$ -179 2400 4632 4069 3735 3389 2381 1833 -1049 -2857 -2132 -860 -137 163 670 1044 -511 -428 -384
14048c84l00P92j36J097N12k629r65j648p71M54m87K55L96q00J547J790J167J445
$$ -384 -684 108 -28 1069 1581 -1048 -2013 -3661 -4432 -3978 -4465 -4210 -3814 -4614 -3067 -1277 -110 1335
14030A335J20n67K27k68k243r68k853o26J537K73K862K737J423R7j537j478j389
$$ 1335 1455 888 1115 847 -1396 -2364 -5217 -5843 -4306 -4033 -1171 1566 2989 3086 1549 71 -1318
14013a318q11K768P40q08K629L26k397l017N77p5j39K80L17J160R46M30Q31J337
$$ -1318 -2129 639 1379 571 3200 3526 1129 -1888 -1311 -1386 -1525 -1245 -928 232 1178 1608 2439 3776
13995C776k21l361L805J781J79l120j316k008q77J842K651J218j841R47N04J355
$$ 3776 3555 194 3999 5780 5959 2839 1523 -485 -1362 480 3131 4349 2508 3455 3959 5314
13979E314k97j94Q75k287p87J28O42k072j591J388L604q68j075J109K78J028j182
$$ 5314 5017 4823 5698 3411 2624 2752 3394 1322 -269 1119 4723 3855 2780 3889 4167 5195 4013
13962D013N75q5m15k15r72j64L21j044j692j292J519J647Q40M66p28J799k00J99
$$ 4013 4588 4503 4088 3873 2901 2737 3058 2014 322 -970 549 2196 3036 3502 2774 4573 4373 4572
13944D572j14p21M04k275k549R40n20J735J535L56R62r7m48N02k740j981L87j312
$$ 4572 4458 3737 4141 1866 -683 257 -263 1472 3007 3363 4325 4228 3780 4282 1542 -439 -52 -1364
13926a364K902O22J12O94K083J756K28j02j523R03j80l138N4p89M55j064P22o7
$$ -1364 1538 2160 2272 2966 5049 6805 7033 6931 5408 6311 6131 2993 3047 2258 2713 1649 2371 2304
13908B304K59J83k567j599K764j93J59k627q96J697J260P67p09R94K680q93q81
$$ 2304 2563 2746 179 -1420 1344 1151 1310 -1317 -2213 -516 744 1511 802 1796 4476 3583 2702
13891B702j004j704O79O48J881J081N88J296k76o26q35j286j940J080k28J088
$$ 2702 1698 -6 673 1321 3202 4283 4871 6167 5891 5265 4430 3144 1204 2284 2056 3144
13875C144L38J961K166n28J97L40k041j902m27Q42L70j654K79P57K251j122J37
$$ 3144 3482 5443 7609 7081 7278 7618 5577 3675 3248 4090 4460 2806 3085 3842 6093 4971 5108
13858E108o73k756j061L0O34R14j682O36N14k404j085K436K403M964M79J808k195
$$ 5108 4435 1679 618 648 1282 2196 514 1150 1664 -740 -1825 611 3014 7978 8457 10265 8070
13841H070j36R60j589k076J828L11j153r09l185j664J836j421j201J917J984J388
$$ 8070 7934 8894 7305 5229 7057 7368 6215 5306 2121 457 2293 872 -329 1588 3572 4960
13825D960J2r05J017J042o1o92q24N307r09m961m064J266L53J635J928m86j416
$$ 4960 4972 4067 5084 6126 6065 5373 4549 9856 8947 3986 -78 1188 1541 3176 5104 4618 3202
13808C202R20J136R52k12k214p0L00M89P98j340k474M31J29L62J809j922j359
$$ 3202 4122 5258 6210 5998 3784 3714 4014 4503 5301 3961 1487 1918 2047 2409 4218 2296 937
13791I37n18k064l01L553J590m94k102k106J586J039J653R55n80k55J413J74q48
$$ 937 419 -1645 -1946 1607 3197 2703 601 -1505 81 1120 2773 3728 3148 2893 4306 4480 3632
13774C632l61j215K329K23k784P77j599q49R47J720J059q66L88J64j332L043L387
$$ 3632 3271 2056 4385 4608 1824 2601 1002 153 1100 2820 3879 3013 3401 3565 2233 5276 8663
13757H663M53j650m056m272o93Q28K447J740M51R42k719j526R07J860P28J526
$$ 8663 9116 7466 3410 -862 -1555 -727 1720 3460 3911 4853 2134 608 1515 3375 4103 5629
13741E629k93L57l0L52p89O06m579k012L56o01j528M86J387K196j947j752L778
$$ 5629 5336 5693 5663 6015 5226 5832 1253 -759 -403 -1004 -2532 -2046 -659 1537 -410 -2162 1616
13724A616L446j692j411j552o46J63K537J834J073j628N08J619N0O79j439J227
$$ 1616 5062 3370 1959 407 -239 -76 2461 4295 5368 3740 4248 5867 5917 6596 5157 6384
13708F384J56l0j216j430j046M53qj164K35m66k28J987L062L151r44j710k183
$$ 6384 6540 6510 5294 3864 2818 3271 3263 2099 2334 1868 1640 3627 6689 9840 8896 7186 5003
13691E003K19K02j04j835O27J819N41k789j556J2L04L402j903m111J275J69M79
$$ 5003 5222 5424 5320 3485 4112 5931 6472 3683 2127 2139 2443 5845 3942 -169 1106 1275 1754
13674A754Q44L215q72j283J542J205N44k012j119O52J334r8o76o32o63K120k82
$$ 1754 2598 5813 4941 3658 5200 6405 6949 4937 3818 4470 5804 5706 5030 4398 3735 5855 5573
13657E573Q2o63k72K043P83N84k950k95P12L99K345R29p31k375J152K461M437
$$ 5573 5655 4992 4720 6763 7546 8130 5180 4885 5597 5996 8341 9270 8539 6164 7316 9777 14214
13640A4214O1k026J066N2l637l14R23m71J281n48j102l18l12p31k34p95l286j747
$$ 14214 14275 12249 13315 13367 9730 9416 10339 9868 11149 10601 9499 9181 8869 8138 7904 7109 3823 2076
13622B076M129L093p24l59K775j791k606l75L88J128l9l95K519l10J230j474J190
$$ 2076 6205 9298 8574 8215 10990 9199 6593 6218 6606 7734 7695 7300 9819 9509 10739 9265 10455
13605A0455P54l136J1M00K55j544k188J427L415N51o27l33k85J571K215Q35J821
$$ 10455 11209 8073 8084 8484 8739 7195 5007 6434 9849 10400 9773 9440 9155 10726 12941 13776 15597
13588A5597k005k747j235M7Q05K017J285j528l388J898J553J463k143l97j257
$$ 15597 13592 10845 9610 9657 10462 12479 13764 12236 8848 10746 12299 13762 11619 11222 9965
13573I965O59J171n91Q33K233J491n33k213r26M84L071j523j027k590O83J275
$$ 9965 10624 11795 11204 12037 14270 15761 15228 13015 12089 12573 15644 14121 13094 10504 11187 12462
13557A2462k318k239j527j260N57L090K735J082O79q77L548J572K04P08P19k261
$$ 12462 10144 7905 6378 5118 5675 8765 11500 12582 13261 12384 15932 17504 17708 18416 19135 16874
13541A6874j783l73Q4J742k207m887j580J669K09K562M967j94l194J577K97k084
$$ 16874 15091 14718 14802 16544 14337 9450 7870 9539 9748 12310 17277 17083 13889 15466 15763 13679
13525A3679J260M54N32Q12k405J598J235j594m328j032L60K274K59j08Q64q36
$$ 13679 14939 15393 15925 16737 14332 15930 17165 15571 11243 10211 10571 12845 13104 12996 13860 13024
13509A3024j74R56M33L70l46L043l66k291J866K140J240L6k937j433j446j20J064
$$ 13024 12850 13806 14239 14609 14263 17306 16940 14649 16515 18655 19895 19931 16994 15561 14115 13995 15059
13492A5059J440o41o42L41N49o2n63k840n59R80K199J548O44o31J28m80R79M01
$$ 15059 16499 15858 15216 15557 16106 16044 15481 12641 12082 13062 15261 16809 17453 16822 16950 16470 17449 17850
13474A7850l53J216n59J46J449m89L80K036j328j481j725j105k758p63K135L366
$$ 17850 17497 18713 18154 18300 19749 19260 19640 21676 20348 18867 17142 16037 13279 12516 14651 18017
13458A8017J877J712p61m45J23K472J852P88j881r47m18J964K08O07J897K708
$$ 18017 19894 21606 20845 20400 20523 22995 24847 25635 23754 22807 22389 24353 24561 25168 27065 29773
13442B9773J422j429R87q21k599J078K583K742J570K543N547P067J0465J8339
$$ 29773 31195 29766 30753 29932 27333 28411 30994 33736 35306 37849 43396 50463 60928 79267
13428G9267K3188K3012J7147K204j1143k1654k4206j6586r140o833m438l072k076
$$ 79267 102455 125467 142614 144818 133675 112021 87815 71229 62089 55256 50818 47746 45670
13415D5670m282j983R56q77K38k384J606J888j503k294k911l516j678J017K500
$$ 45670 41388 39405 40361 39484 39722 37338 38944 40832 39329 37035 34124 30608 28930 29947 32447
13400C2447M890M357Q613J2887J3225J6353K2591L4955M5686M8582L3079K276
$$ 32447 37337 41694 50307 63194 76419 92772 115363 150318 196004 244586 277665 279941
13388B79941k7276m5511m6405l8881k6619j5870j1325n537k746m962m519n798
$$ 279941 252665 207154 160749 121868 95249 79379 68054 62517 59771 54809 50290 44492
13376D4492n635j934k360m63L40J64J63j1J128R22k404L22J962K53L403N133N101
$$ 44492 38857 36923 34563 34100 34440 34604 34767 34756 35884 36806 34402 34724 36686 36939 40342 45475 50576
13359E0576Q472J1291J5632K2983K4989J7009K829j3865k3707k4476k0797j2503
$$ 50576 59048 70339 85971 108954 133943 150952 153781 139916 116209 91733 70936 58433
13347E8433o632l509m021m337k212j795K53M55k726l178p37k247j254Q18L97k947
$$ 58433 51801 48292 44271 39934 37722 35927 36180 36635 33909 30731 29994 27747 26493 27311 27708 24761
13331B4761NL33O84n87J716J938j636k242j844o86j086N24J378J156l70K060L155
$$ 24761 24766 25099 25783 25196 26912 28850 27214 24972 23128 22442 21356 21880 23258 24414 24044 26104 29259
13314B9259J486l764j064P53J575p29k236k376M71K356J566P00m59j429j252n35
$$ 29259 30745 26981 25917 26670 28245 27516 25280 22904 23375 25731 27297 27997 27538 26109 24857 24322
13298B4322K026K513P45o94k593j111J037N83N67m70o6M44om69k210J36L161K083
$$ 24322 26348 28861 29606 28912 26319 25208 26245 26828 27395 26925 26859 27303 27297 26828 24618 24754 27915 29998
13280B9998j070K096j679q22R55k40q28L476J175Q15k096k752q1q49r66L576J639
$$ 29998 28928 31024 29345 28523 29478 29238 28410 31886 33061 33876 31780 29028 28947 28098 27132 30708 32347
13263C2347J529M60j773j80O19m31n59K160J282l633j282p30j164o59k030k200
$$ 32347 33876 34336 32563 32383 33002 32571 32012 34172 35454 31821 30539 29809 28645 27986 25956 23756
13247B3756j066K040J589L495K735L021L35q93L077Q95M02q32J529K447M153M076
$$ 23756 22690 24730 26319 29814 32549 35570 35905 35012 38089 38984 39386 38554 40083 42530 46683 50759
13231E0759K792j051k424K8l243j164j104N27N29k474j282q04o01J256j079l863
$$ 50759 53551 52500 50076 50104 46861 45697 44593 45120 45649 43175 41893 41089 40488 41744 40665 36802
13215C6802k557j705m99K622j871p26J330J849L897K397M41j503J768K012J62
$$ 36802 34245 32540 32041 34663 32792 32066 33396 35245 39142 41539 41980 40477 42245 44257 44419
13200D4419L686M957K610K967K389Q61L8l0J596M247K061j377j448M83j273K69
$$ 44419 48105 53062 55672 58639 61028 61889 61927 61897 63493 67740 69801 68424 66976 67459 66186 66455
13184F6455J206K012J798L900J1450J4626K2491L9437N0404M9185K7336p432l8676
$$ 66455 67661 69673 71471 75371 86821 101447 123938 163375 213779 262964 290300 282868 244192
13171B44192n3810m6484l3006j7464r887p179p34j930O19K412M331L051n076l966
$$ 244192 190382 143898 110892 93428 83541 76362 75628 73698 74317 76729 81060 84111 79035 75069
13157G5069o45j038K120q57l01J741K7n59k690K67J544r1J643K871M823M428O436
$$ 75069 74424 73386 75506 74649 74348 76089 76116 75557 72867 73134 74678 74587 76230 79101 83924 88352 94788
13140I4788M938K540P923R949J7504K6124L9455O3928J06774J50744J63993J19260
$$ 94788 99726 102266 110189 120138 137642 163766 203221 267149 373923 524667 688660 807920
13128H07920J6786j00871j65979j61097j14785p1163m2296j9840j1427r364p073
$$ 807920 824706 723835 557856 396759 281974 210811 168515 148675 137248 127884 120811
13117A20811p562q441q669n414n850m253J220J570K198K891R49J007O15m12m309
$$ 120811 113249 104808 96139 90725 84875 80622 81842 83412 85610 88501 89450 90457 91072 90660 86351
13102H6351m613P87O409O539P152N057M296M830O206P038J0495J7708K6895L9892
$$ 86351 81738 82525 88934 95473 102625 107682 111978 116808 123014 130052 140547 158255 185150 225042
13088B25042O6418J02034J43655J71343J39537M0508q1450j64853j76993j34055
$$ 225042 291460 393494 537149 708492 848029 888537 807087 642234 465241 331186
13078C31186p9925m4116k6068j4495o740l454p059r364p241q451p295m390J068
$$ 331186 251261 207145 181077 166582 159842 156388 149329 139965 132724 124273 116978 112588 113656
13065A13656J794p11M187O766J0751O746J023m62k486J676L461L784M754M88n89
$$ 113656 115450 114739 118926 125692 136443 143189 144212 143750 141264 142940 146401 150185 154939 155427 154838
13050A54838J280K655q73J610O528R518J1281K0493L5108M9361N7842N0357K3571
$$ 154838 156118 158773 157900 159510 166038 175556 186837 207330 242438 291799 349641 399998 423569
13037D23569j6449m8911n8429m8920k9277j6019o915k733K816K456M143P735J1203
$$ 423569 407120 358209 299780 250860 221583 205564 198649 195916 198732 201188 205331 213066 224269
13024B24269P401P295N102M697P569J1095J1781R455R087L173K637k78k02N744
$$ 224269 231670 238965 244067 248764 256333 267428 279209 288664 297751 300924 303561 303283 303081 308825
13010C08825J3270J5490J1812J3349J8513K1262K1030K1399K1927K3534K8794
$$ 308825 322095 337585 349397 362746 381259 402521 423551 444950 466877 490411 519205
12999E19205L4928L7951M5840N0834N7068P1156Q8261J07722J30891J60487J97101
$$ 519205 554133 592084 637924 688758 745826 816982 905243 1012965 1143856 1304343 1501444
12988A501444K52011L22479M17596N45538P34959J029805J542472K382613L579962
$$ 1501444 1753455 2075934 2493530 3039068 3774027 4803832 6346304 8728917 12308879
12979A2308879M774704N054795L553743M50197k934798m966452m969855l752306
$$ 12308879 17083583 22138378 25692121 26142318 23207520 18241068 13271213 9518907
12971I518907k451439j544247r99849o77551m68058l18853j99559r8895l3065
$$ 9518907 7067468 5523221 4523372 3845821 3377763 3058910 2859351 2760456 2727391
12962B727391j9026n5456j03341j10519o1001J7408R6845J71431K47307L32787
$$ 2727391 2708365 2652909 2549568 2439049 2378048 2395456 2492301 2663732 2911039 3243826
12952C243826M46792N90301P84680J048754J429038K038658L068131M760766P143064
$$ 3243826 3690618 4280919 5065599 6114353 7543391 9582049 12650180 17410946 24554010
12943B4554010R463665R984713P201694J377380n206777r579888j0266253q261000
$$ 24554010 34017675 44002388 51204082 52581462 47374685 37794797 27528544 19267544
12935A9267544n571046l481624k207349j488301j070706q07955o30696n01391
$$ 19267544 13696498 10214874 8007525 6519224 5448518 4640563 4009867 3508476
12927C508476l90647k92829k09965j36455o5223J082P3976J23556J20724Q0802
$$ 3508476 3117829 2825000 2615035 2478580 2413357 2414439 2488415 2611971 2732695 2813497
12917B813497M3897O0832J46718K86701M52370O69362R83513J493158K321987
$$ 2813497 2857394 2918226 3064944 3351645 3804015 4473377 5456890 6950048 9272035
12908I272035L539136M856685N375059M089545R54748k773989n283459n598391
$$ 9272035 12811171 17667856 23042915 27132460 28087208 25313219 20029760 14431369
12900A4431369m370771k884219j814955j178170q09423n88268m52355l65040k97647
$$ 14431369 10060598 7176379 5361424 4183254 3373831 2785563 2333208 1968168 1670521
12891A670521k43489j93388j51765j19777j01824q6388p2373o0977n4512m8332
$$ 1670521 1427032 1233644 1081879 962102 860278 773890 701517 640540 586028 537696
12881E37696m3050m0340l6372l3861l2135k8666k5207k4935k0785j7655j4871
$$ 537696 494646 454306 417934 384073 351938 323272 298065 273130 252345 234690 219819
12870B19819j2079j4082j6140j4733j4122j3976j1604r748p733n709m940m276
$$ 219819 207740 193658 177518 162785 148663 134687 123083 113335 105602 99893 94953 90677
12858I0677k613j350j423l368p85J200j609k392j696j598k509m551o016n214j858
$$ 90677 88064 86714 85291 81923 81138 82338 80729 78337 76641 75043 72534 67983 61967 56753 54895
12843E4895l219j423l251m394k321q34o55Q02J631J339q79j596L30k358l173k36
$$ 54895 51676 50253 47002 42608 40287 39453 38798 39600 41231 42570 41691 40095 40425 38067 34894 34658
12827C4658n73r31k535n065l093J39J645K551M492N507J838M027J364j332l598
$$ 34658 34085 33154 30619 25554 22461 22600 24245 26796 31288 36795 38633 42660 44024 42692 39094
12812C9094n965k024k900l898j905M81J818l75j004j193k357m42M225L044m58
$$ 39094 33129 31105 28205 24307 22402 22883 24701 24326 23322 22129 19772 19330 23555 26599 26141
12797B6141N02L692M23j955l597j899R7Q28L87q99k89k064j754j905l395k63L300
$$ 26141 26643 30335 30758 28803 25206 23307 23404 24232 24619 23720 23431 21367 19613 17708 14313 14050 17350
12780A7350L638J539m552l322l213m756k778J276O44K613L284J596p73j951j816
$$ 17350 20988 22527 17975 14653 11440 6684 3906 5182 5826 8439 11723 13319 12546 10595 8779
12765H779j039j057J115j600J103K352O59n68r84k212L89K820K031o98L18J525
$$ 8779 7740 6683 7798 6198 7301 9653 10312 9744 8760 6548 6937 9757 11788 11090 11408 12933
12749A2933P2m94M8j879k574L56L0k381l159k944k175J981K597J16K913J344n98
$$ 12933 13005 12511 12559 10680 8106 8462 8492 6111 2952 8 -2167 -186 2411 2527 5440 6784 6186
12732F186L218L134K252j244j074k485j504Q78r68n184m341M65L71O20K632L009
$$ 6186 9404 12538 14790 13546 12472 9987 8483 9361 8393 3209 -1132 -667 -296 324 2956 5965
12716E965J721K780O98l98P15j58n93j095q55k48j787j770l457k121q38k67K042
$$ 5965 7686 10466 11164 10766 11481 11323 10730 9635 8780 8532 6745 4975 1518 -603 -1441 -1708 334
12699C34K285J655j240k852J954J564J123k925k155P06P16N18j298k192n17k77
$$ 334 2619 4274 3034 182 2136 3700 4823 1898 -257 449 1165 1683 385 -1807 -2324 -2601
12683b601J061K740l29j765N27M37J319M709K375J283N5j008j414O11p77n4p9
$$ -2601 -1540 1200 871 -894 -367 70 1389 6098 8473 9756 9811 8803 7389 8000 7223 7169 7090
12666G090j066k484p85K85K849K850J567o1k215j759Q15M12o61j768J14n23k102
$$ 7090 6024 3540 2755 3040 5889 8739 10306 10245 8030 6271 7086 7498 6837 5069 5183 4660 2558
12649B558k003j885r14q55L252j995r39K993O44l41K392K746k713J656N379K007
$$ 2558 555 -1330 -2244 -3099 153 -1842 -2781 212 856 515 2907 5653 2940 4596 9975 11982
12633A1982k003m22p1j874l646j110r25R31L296k22k820l672j907j80o03l75J274
$$ 11982 9979 9557 9486 7612 3966 2856 1931 2862 6158 5936 3116 -556 -2463 -2643 -3246 -3621 -2347
12616b347L72l06O00N6p90L496K95K005J361j434O23p21J543J590Q89m35J96L221
$$ -2347 -1975 -2281 -1681 -1625 -2415 1081 1376 3381 4742 3308 3931 3210 4753 6343 7232 6797 6993 10214
12598A0214N54o45L95L08j423j86O42p80L06j150J002M257L016N342M155J332
$$ 10214 10768 10123 10518 10826 9403 9217 9859 9079 9385 8235 9237 13494 16510 21852 26007 27339
12582B7339J219j001m425n923m199m432o175j006J258M07j939n37J717R13N82
$$ 27339 28558 27557 23132 17209 13010 8578 2403 1397 2655 3062 1123 586 2303 3216 3798
12567C798L459Q88q74o22K315j766k190N00j529k932O40J329j31O13K41l42n18
$$ 3798 7257 8145 7271 6649 8964 7198 5008 5508 3979 1047 1687 3016 2885 3498 3739 3397 2879
12550B879K174J620J529r83j470j922k1j041l16J371J629K521J419k188j168J704
$$ 2879 5053 6673 8202 7219 5749 3827 3806 2765 2449 3820 5449 7970 9389 7201 6033 7737
12534G737J635K019R71K013J605R62L04L526N433R212J0409J7297K3181K4862
$$ 7737 9372 11391 12362 14375 15980 16942 17246 20772 26205 35417 45826 63123 86304 111166
12520A11166J5337J10j2144j9817j9334j4508j2392j2009q669o167k552k872M91
$$ 111166 126503 126613 114469 94652 75318 60810 48418 36409 27740 21573 19021 16149 16640
12507A6640l016k53R5J182L806R19j396q41Q20J868J187J46K307N657P415Q251
$$ 16640 13624 13371 13466 14648 18454 19373 17977 17136 17956 19824 21011 21157 23464 29121 36536 44787
12491D4787Q462J0767J4258K0262L2541M0969M6199L4221P862k1734m3136m6933
$$ 44787 53249 64016 78274 98536 131077 172046 218245 252466 260328 238594 195458 148525
12479A48525m0112k6893k1883j2442p067r356o530o657k331q86n02l644J289J477
$$ 148525 108413 81520 59637 47195 40128 30772 24242 17585 15254 14368 13866 10222 11511 12988
12465A2988M50J372L452J909L109K058N85K016J79K413L697M958O717Q030J5995
$$ 12988 13438 14810 18262 20171 23280 25338 25923 27939 28118 30531 34228 39186 45903 53933 69928
12450F9928K1516K6267J8939N465j1602k5198k4551j9520j2282j0462j0326o084
$$ 69928 91444 117711 136650 142115 130513 105315 80764 61244 48962 38500 28174 22090
12438B2090l855l157j222l631l466J209K638j66N60J429j033j885N17K008J281
$$ 22090 18235 15078 13856 10225 6759 7968 10606 10440 11000 12429 11396 9511 10028 12036 13317
12423A3317k183l031j331K482J618j066j160j13r94k394l661l723N06L165J534
$$ 13317 11134 8103 6772 9254 10872 9806 8646 8533 7539 5145 1484 -2239 -1733 1432 2966
12408B966k08q41O16K266J508j19J621q35J882J061j410P90M27r55K467L193p76
$$ 2966 2758 1917 2533 4799 6307 6188 7809 6974 8856 9917 8507 9297 9724 8769 11236 14429 13653
12391A3653q61q93j71L44o94M79R09j825j650J936J145q64j561k057J792K25k082
$$ 13653 12792 11899 11728 12072 11378 11857 12766 10941 9291 11227 12372 11508 9947 7890 9682 9907 7825
12374G825l9J836j445l862k112K600J621k161J079K659O87P68M479J711j152k37
$$ 7825 7786 9622 8177 4315 2203 4803 6424 4263 5342 8001 8688 9456 13935 15646 14494 14257
12358A4257J837K26o50km36k212k618j972j418j956J439M100K777p57q88Q87k156
$$ 14257 16094 16320 15670 15668 15232 13020 10402 8430 7012 5056 6495 10595 13372 12615 11727 12614 10458
12341A0458r7P18n2j574J318K787L01j699j508j533p60J054K128L55R3l62j483
$$ 10458 10361 11079 11027 9453 10771 13558 13859 12160 10652 9119 8359 9413 11541 11896 11989 11627 10144
12324A0144M4k52R58J272o47j13K26J737p0R09l58k111r87J088J313J389J416
$$ 10144 10188 9936 10894 12166 11519 11406 11632 13369 13299 14208 13850 11739 10752 11840 13153 14542 15958
12307A5958j723j63m60L50L197K167j722m50K564l117j878m49j834j483n45n53
$$ 15958 14235 14072 13612 13962 17159 19326 17604 17154 19718 16601 14723 14274 12440 10957 10412 9859
12291I859J006k537j106L278K286J461m90M36m44M70l33L97J085J036N03n87j143
$$ 9859 10865 8328 7222 10500 12786 14247 13757 14193 13749 14219 13886 14283 15368 16404 16907 16320 15177
12274A5177J823K203N74J968O26M04j619k785J423K715L19m117k769J005N85L46
$$ 15177 17000 19203 19777 21745 22371 22775 21156 18371 19794 22509 22828 18711 15942 16947 17532 17878
12258A7878m70m94k95J203M03j541j191j370N31K495L9J905L187K139M33k207
$$ 17878 17408 16914 16619 17822 18225 16684 15493 14123 14654 17149 17188 19093 22280 24419 24852 22645
12242B2645j430M29N571M365M471L743K324l575j810j271N52j075j004L26k365
$$ 22645 21215 21644 27215 31580 36051 39794 42118 38543 36733 35462 36014 34939 33935 34261 31896
12227C1896m491m868q83L496J569j866m931m753k162M34P45L468J700J915N94
$$ 31896 27405 22537 21654 25150 26719 24853 19922 15169 13007 13441 14186 17654 19354 21269 21863
12212B1863o52K331J923M29o70P29j97l133J335J047K059J950n17K111L377M290
$$ 21863 21211 23542 25465 25894 25224 25953 25756 22623 23958 25005 27064 29014 28497 30608 33985 38275
12196C8275Q061J0571N293L5K16k697m310m294j120k864k764l647p718o354m233
$$ 38275 46336 56907 62200 62235 62451 59754 55444 51150 50030 47166 44402 40755 33037 26683 22450
12181B2450k9J591k659j38K353J307k066j384k014q38k523J389L581L145K084
$$ 22450 22421 24012 21353 21215 23568 24875 22809 21425 19411 18573 16050 17439 21020 24165 26249
12166B6249J556n98m64k259j089l612O97K781K66K671L637P16p72K169M834M966
$$ 26249 27805 27207 26743 24484 23395 19783 20480 23261 23527 26198 29835 30551 29779 31948 36782 41748
12150D1748L835J356j218l42j738l435m565j726O57q9l788j746R49k210k794j391
$$ 41748 45583 46939 45721 45379 43641 40206 35641 33915 34572 34483 30695 28949 29898 27688 24894 23503
12134B3503J808o97j460M8O35m123j918k78k186J432L963L253J210M91l854j865
$$ 23503 25311 24614 23154 23202 23837 19714 17796 17518 15332 16764 20727 23980 25190 25681 21827 19962
12118A9962J183J275j597k305o44j279l17O27N70J53J545M927M405J874J02j38
$$ 19962 21145 22420 20823 18518 17874 16595 16278 16905 17475 17628 19173 24100 28505 30379 30481 30343
12102C0343l426j369K93n86k01q3L14p4j820j201q41P18j402K30r59O02j131j929
$$ 30343 26917 25548 25841 25255 25054 24971 25285 25211 23391 22190 21349 22067 20665 20895 19936 20538 19407 17478
12084A7478l64l773L33J901J214J385k009L15K897K332j82n93j133K47r68j329
$$ 17478 17114 13341 13674 15575 16789 18174 16165 16480 19377 21709 21527 20934 19801 20048 19080 17751
12068A7751p78J735L273Q23l023k525m14J551R03J171m46j856K84J5J60J159K044
$$ 17751 16973 18708 21981 22804 19781 17256 16842 18393 19296 20467 20021 18165 18449 18464 18624 19783 21827
12051B1827L6Q01P98j158p41m8J389M85K833K285K96N38j477j196m65p94k520
$$ 21827 21863 22664 23462 22304 21563 21515 22904 23389 26222 28507 28803 29341 27864 26668 26203 25409 22889
12034B2889r0P08J48k31J88J830P14l077j257J104n35J829k356j544O97j135j589
$$ 22889 22799 23507 23655 23424 23612 25442 26156 23079 21822 22926 22391 24220 21864 20320 21017 19882 18293
12017A8293J500O59L841J459K047n19j016j18l254j545N091J405k425j492J836
$$ 18293 19793 20452 24293 25752 27799 27280 26264 26146 22892 21347 26438 27843 25418 23926 25762
12002B5762l88R31j51K769J493J521K67j479Q42j230k96j621k05M8r3r90j504
$$ 25762 25374 26305 26154 28923 30416 31937 32204 30725 31567 30337 30041 28420 28215 28263 28170 27180 25676
11985B5676J125O74Q3j556M81J524j396j861L54Q01l70j458j560J91m01j69J686
$$ 25676 26801 27475 27558 26002 26483 28007 26611 24750 25104 25905 25535 24077 22517 22708 22307 22138 23824
11968B3824p65Q32K167K647m57J862J749j630j174l87j483rj343j122J908K927
$$ 23824 23059 23891 26058 28705 28248 30110 31859 30229 29055 28668 27185 27176 25833 24711 26619 29546
11952B9546j194J711J439K116Q70j144j595j856k27r22j27J394r97L88J564L362
$$ 29546 28352 30063 31502 33618 34488 33344 31749 29893 29666 28744 28617 30011 29014 29402 30966 34328
11936C4328L719n41k776m569m698M25K516J599j086j16J123K13p19O20m41j774
$$ 34328 38047 37506 34730 30161 25463 25888 28404 30003 28917 28801 29924 30137 29418 30038 29597 27823
11920B7823Q19q23K366L386J670K25l154l928j41n81J807O34K84K724j007N43
$$ 27823 28642 27819 30185 33571 35241 35466 32312 28384 28243 27662 29469 30103 30387 33111 32104 32647
11904C2647j829L60L84j117o02J378K497K044J609j340J90Q9j73K294K650K618
$$ 32647 30818 31178 31562 30445 29843 31221 33718 35762 37371 36031 36221 36310 36137 38431 41081 43699
11888D3699L18k096l111k740L52j87j327j402k310K22L349k03R57K25j690k622
$$ 43699 44017 41921 38810 36070 36422 36235 34908 33506 31196 31418 34767 34564 35521 35746 34056 31434
11872C1434k244M10O22L54M29P22K641K301P62j382p72l28J551p22k057l9L352
$$ 31434 29190 29600 30222 30576 31005 31727 34368 36669 37431 36049 35277 34949 36500 35778 33721 33682 37034
11855C7034R72k132l570k530o99o18R41Q19M98Q60n01k39J317L90l085m95K236
$$ 37034 38006 35874 32304 29774 29075 28457 29398 30217 30715 31575 31074 30835 32152 32542 29457 28962 31198
11838C1198j081j324r29j009J718j134m72K174j506k751j983J388N40q20R29J14
$$ 31198 30117 28793 27864 26855 28573 27439 26967 29141 27635 24884 22901 24289 24829 24009 24938 25052
11822B5052J216J499r51j095J191M77J218Q93j406j553q14j661j457j48M36M939
$$ 25052 26268 27767 26816 25721 26912 27389 28607 29500 28094 26541 25727 24066 22609 22461 22897 27836
11806B7836J213p67K99O06r6j357J837N89q56K8n21k10k80k292J146l27Q25L70
$$ 27836 29049 28282 28581 29187 29091 27734 29571 30160 29304 29332 28811 28601 28321 26029 27175 26848 27673 28043
11788B8043k960j327L82k877K439j193k24j402J252J988J75J018n06l286N79q1
$$ 28043 25083 23756 24138 21261 23700 22507 22283 20881 22133 24121 24296 25314 24808 21522 22101 22020
11772B2020R99J00o95M91J85K63o53M893M57j384K2l025k419J930N3M16R30k70
$$ 22020 23019 23119 22424 22915 23100 23363 22710 27603 28060 26676 26698 23673 21254 23184 23237 23653 24583 24313
11754B4313J303j314q44J683r9J080k523m245N42r40L49J415R15p20j89m32j90
$$ 24313 25616 24302 23458 25141 25042 26122 23599 19354 19896 18956 19305 20720 21635 20915 20726 20294 20104
11737B0104r76J836L553O91m158l412m25Q78k70k46J965K763J112j55L66l95o87
$$ 20104 19128 20964 24517 25208 21050 17638 17213 18091 17821 17575 19540 22303 23415 23260 23626 23231 22544
11720B2544p0l36p71q68j313j82L80M98q59k165j189K273l90j056M149r21o72
$$ 22544 22474 22138 21367 20499 19186 19004 19384 19882 19023 16858 15669 17942 17552 16496 20645 19724 19052
11703A9052j99k728o97N85L078K291K14k076l062J178l38j052m18K237J320k69
$$ 19052 18853 16125 15428 16013 19091 21382 21596 19520 16458 17636 17298 16246 15828 18065 19385 19116
11687A9116n39K99%M09K55j305m78K88J897q44P52o1J796K793M61k346j884j039
$$ 19116 18577 18876 18876 19285 19540 18235 17757 18045 19942 19098 19850 19789 21585 24378 24839 22493 20609 19570
11669A9570J26Q49K79j932J514j36j433j362j12J083J145J420J419L45r35R77
$$ 19570 19696 20545 20824 18892 20406 20270 18837 17475 17363 18446 19591 21011 22430 22775 21840 22817
11653B2817J925k039k328M51K556R65M71P49k158o1m01r4R50n05L60J109J866
$$ 22817 24742 22703 20375 20826 23382 24347 24818 25567 23409 23348 22947 22853 23803 23298 23658 24767 26633
11636B6633L396r92l92k034j765r57J322j292J122P32j616J969P217M812L456
$$ 26633 30029 29037 28645 26611 24846 23889 25211 23919 25041 25773 24157 26126 33343 38155 41611
11621D1611L946K37l028l702j207j652j145j746l186j681L9j14j704l73N30K36
$$ 41611 45557 45794 42766 39064 37857 36205 35060 33314 30128 28447 28486 28372 26668 26295 26825 27061
11605B7061j99j18J45k216j515M57K126j15k31j700k995J074N859P53j772O29
$$ 27061 26862 26744 26889 24673 23158 23615 25741 25626 25395 23695 20700 21774 27633 28386 26614 27243
11589B7243r19j189j166P67k04K952K244l26j555j345j629L16P20Q8J325j039
$$ 27243 26324 25135 23969 24736 24532 27484 29728 29402 27847 26502 24873 25189 25909 25997 27322 26283
11573B6283J362J691K95o58N33j133j119n25J199l66p34m74J496p70q81J452j342
$$ 26283 27645 29336 29631 28973 29506 28373 27254 26729 27928 27562 26828 26354 27850 27080 26199 27651 26309
11556B6309j396J449M05r37J179L760J321k040p07Q57q67j100L535K352J767j842
$$ 26309 24913 26362 26767 25830 27009 30769 32090 30050 29343 30200 29333 28233 31768 34120 35887 34045
11540C4045o67q28L98J179M00O54r44p81O52K673J50j420l562j954N75K4J90q65
$$ 34045 33378 32550 32948 34127 34527 35181 34237 33456 34108 36781 36931 35511 31949 29995 30570 30594 30784 29919
11522B9919j272j284M187K833l84j154J521J711J422L48K87k921o18n64k240R03
$$ 29919 28647 27363 31550 34383 33999 32845 34366 36077 37499 37847 38134 35213 34595 34031 31791 32694
11506C2694K316r96J271J38q79o97J727K796K42q05k93M91J878L423K30Q73M261
$$ 32694 35010 34014 35285 35423 34544 33847 35574 38370 38612 37807 37514 38005 39883 43306 43536 44409 48670
11489D8670K853J08j566j694k147l543m021l395j096K258J678j910q64P80k408
$$ 48670 51523 51631 50065 48371 46224 42681 38660 35265 34169 36427 38105 36195 35331 36111 33703
11474C3703j480J22j777K81L396J386M81j723R93j087n11K250R49K23j615R5L88
$$ 33703 32223 32345 30568 30849 34245 35631 36112 34389 35382 34295 33784 36034 36983 37206 35591 35686 36074
11457C6074J80qJ771K519M05j583N3Q76j64j658L90j727k452M37J904K100J858
$$ 36074 36254 36246 38017 40536 40941 39358 39411 40287 40123 38465 38855 37128 34676 35113 37017 39117 40975
11440D0975L300K265j084R1j529o37j118l278j857K07p47J326J183j020K256K635
$$ 40975 44275 46540 45456 45547 44018 43381 42263 38985 37128 37335 36588 37914 39097 38077 40333 42968
11424D2968N73j506k383j422P60J669K76j825j07J1P33J696L263M243n57j616
$$ 42968 43541 42035 39652 38230 38990 40659 40935 39110 39003 39014 39747 41443 44706 48949 48392 46776
11408D6776k93N38o35j581k753j007M32K061j168j183Q59J710J63J050L56l410
$$ 46776 46483 47021 46386 44805 42052 41045 41477 43538 42370 41187 42046 43756 43919 44969 45325 41915
11392D1915L068L695N08k674n11J309K269Q81J296j08M84k75k59K76L537M505
$$ 41915 44983 48678 49186 46512 46001 47310 49579 50460 51756 51648 52132 51857 51598 51874 55411 59916
11376E9916M823N641P995Q854J7910K9556L6470L2094J7427n181k6583l2896l1960
$$ 59916 64739 70380 78375 87229 105139 134695 171165 203259 220686 215505 188922 156026 124066
11363A24066k2929j5044j3175o790n395l351k393P46L407L98k390K95m18M32r69
$$ 124066 101137 86093 72918 66128 60733 57382 54989 55735 59142 59540 57150 57445 57027 57459 56490
11348E6490p07q27O88O3j111j15j230q08J335l164o08J557J401J085O21L986O824
$$ 56490 55783 54956 55644 55707 54596 54481 53251 52443 53778 50614 50006 51563 52964 54049 54670 58656 65480
11331F5480L448O167J3107J7859J9316K0242J8039P055o407j5769j7797j9847
$$ 65480 68928 75095 88202 106061 125377 145619 163658 170713 164306 148537 130740 110893
11319A10893j7433j2797q303n844o95K47J29L014n19M81L16K644O270P833J1228
$$ 110893 93460 80663 72360 66516 65821 66068 66197 69211 68692 69173 69489 72133 78403 86236 97464
11304I7464J0959R921L987n965j1155r003n479j288N030J2312J7485K3992L0804
$$ 97464 108423 118344 122331 116366 105211 96208 90729 89441 94471 106783 124268 148260 179064
11291A79064L3561L7970L2955J5995j0076l0608l9043m0397l6614k6495j8220
$$ 179064 212625 250595 283550 299545 289469 258861 219818 179421 142807 116312 98092
11280I8092j1830n748m053k332l231j358j744J015k18k919k127K549K841J285
$$ 98092 86262 80514 76461 74129 70898 69540 67796 68811 68593 65674 63547 66096 68937 70222
11266G0222J20j383l87J387J256L028L706P227P888J1838J5613K0762K1252J8896
$$ 70222 70342 68959 68572 69959 71215 74243 77949 85176 93064 104902 120515 141277 162529 181425
11252A81425J0612q48j2001j8602k1343k2802j8402j1125p422m648o978k902j268
$$ 181425 192037 191189 179188 160586 139243 116441 98039 86914 79492 74844 67866 64964 63696
11239F3696l311k379l89j722l45O60J002J552k390j529j339k218K458K472P57
$$ 63696 60385 58006 57617 55895 55550 56210 57212 58764 56374 54845 53506 51288 53746 56218 56975
11224E6975j241j811k17J370k974l353o37K501K337N51q61kJ09Q26K939K078k445
$$ 56975 55734 53923 53706 55076 52102 48749 48112 50613 52950 53501 52640 52638 52747 53573 56512 58590 56145
11207E6145q48j113q94P27K371K175j525k23K155J482k154k05j46j754o72L32
$$ 56145 55297 54184 53290 54017 56388 58563 57038 56815 58970 60452 58298 58093 57947 56193 55521 55853
11191E5853j82p6L60M25P10J293J65r55m758j156K972J499l83j801J458k048O86
$$ 55853 55671 55595 55955 56380 57090 58383 58548 57593 52835 51679 54651 56150 55767 53966 55424 53376 54062
11174E4062M064L819J925J75m44j37K134O697L163J930N11o0R18L268M340P228
$$ 54062 58126 61945 63870 64045 63601 63464 65598 72295 75458 77388 77899 77839 78757 82025 86365 93593
11158I3593R673J1879O189l097j1529j3634p962m556n406m693J007R08j655Q17
$$ 93593 103266 115145 121334 118237 106708 93074 85112 80556 75150 70457 71464 72372 70717 71534
11144G1534p12j672j215j905j209q70K701M863K406j825j15M761N011L192K920
$$ 71534 70822 69150 67935 66030 64821 63951 66652 71515 73921 72096 71981 76742 81753 84945 87865
11129H7865K58j589J51L074J07p50o91l13l319m64j282j523p78j71l474k969k402
$$ 87865 88123 86534 86685 89759 89866 89116 88425 88112 84793 84329 83047 81524 80746 80575 77101 74132 71730
11112G1730k03K833K343N23K47m153m201j633k986k47P37Q8J125J611L445M93
$$ 71730 71527 74360 76703 77226 77473 73320 69119 67486 64500 64253 64990 65078 66203 67814 71259 71752
11096G1752K648M272J734J386J329j663J11O06J352J113R20j020p29P1p40M35
$$ 71752 74400 78672 80406 81792 83121 81458 81569 82175 83527 84640 85560 84540 83811 83882 83142 83577
11080H3577L88k282k410n57M324M197J98O77j29m31l360l284k801r92J254l9O8
$$ 83577 83965 81683 79273 78716 83040 87237 87435 88112 87983 87552 84192 80908 78107 77115 78369 78330 78398
11063G8398J349k398k046K242L549L629r68J102Q84J794n25j55k143l06P19N43
$$ 78398 79747 77349 75303 77545 81094 84723 83755 84857 85741 87535 87010 86855 84712 84406 85125 85668
11047H5668j566J945J909J535J555L104M806L074M92J779O46k332j268j125J011
$$ 85668 84102 86047 87956 89491 91046 94150 98956 102030 102522 104301 104947 102615 101347 100222 101233
11032A01233K517J439J424L282M9l263o42K70q05N04K198K854M733K741K765L058
$$ 101233 103750 105189 106613 109895 109944 106681 106039 106309 105504 106008 108206 111060 115793 118534 121299 124357
11016A24357j381j859j983r50O78p68k407j00K733K377N898N782r14P13j695J846
$$ 124357 122976 121117 119134 118184 118862 118094 115687 115587 118320 120697 126595 132377 131463 132176 130481 132327
11000A32327o89j095K013J878j16K239N571M872N099J293p33j112j558J271J669
$$ 132327 131638 130543 132556 134434 134318 136557 142128 147000 152099 153392 152659 151547 149989 151260 152929
10985A52929N97J405M68J321K506K718J581N094L276J141K19M014N819L577L232
$$ 152929 153526 154931 155399 156720 159226 161944 163525 168619 171895 173036 173255 177269 183088 186665 189897
10970A89897L218L328K109J414J021O24Q49J129M313N726O739P677Q633Q614P796
$$ 189897 193115 196443 198552 199966 200987 201611 202460 203589 207902 213628 220367 228044 236677 245291 253087
10955B53087N364Q005O756O110O095Q111O050M908O050R211R854J2424J2127J4129
$$ 253087 258451 266456 273212 279322 285417 293528 299578 304486 310536 319747 329601 342025 354152 368281
10941C68281J7788J9966K0446J8865J8915J7958K1690K6779K8665L3901L9970
$$ 368281 386069 406035 426481 445346 464261 482219 503909 530688 559353 593254 633224
10930F33224N0622O0620P3349Q8612J09679J30324J50765J65006J72640J89659
$$ 633224 683846 744466 817815 906427 1016106 1146430 1297195 1462201 1634841 1824500
10920A824500K26886K92771L97763N58688Q11882J199856J783570K585693L498191
$$ 1824500 2051386 2344157 2741920 3300608 4112490 5312346 7095916 9681609 13179800
10911A3179800M179888M118239K921962P24458j755500l598555m261411l872297
$$ 13179800 17359688 21477927 24399889 25124347 23368847 19770292 15508881 11636584
10903A1636584k973097k062979j363098q78153n57501l39670j86922q8664m2231
$$ 11636584 8663487 6600508 5237410 4359257 3801756 3462086 3275164 3186500 3144269
10894C144269m6245p4120r2317p7942k3331N5603J31938J90006K32386K79610
$$ 3144269 3098024 3023904 2931587 2853645 2830314 2885917 3017855 3207861 3440247 3719857
10884C719857L51594M80008O83195R98095J485143K245734L388015M927856O612531
$$ 3719857 4071451 4551459 5234654 6232749 7717892 9963626 13351641 18279497 24892028
10875B4892028P787316P573356N371926J431913l052998o556530q054806p564619
$$ 24892028 32679344 40252700 45624626 47056539 44003541 37447011 29392205 21827586
10867B1827586n966743m203996k793198j832213j218661q32545n83824m21982
$$ 21827586 15860843 11656847 8863649 7031436 5812775 4980230 4396406 3974424
10859C974424l14296k42300j95318j60097j15113n7003J741L4964L7133J6521
$$ 3974424 3660128 3417828 3222510 3062413 2947300 2890297 2892038 2927002 2964135 2980656
10849B980656N842L1301J02842K23300L94625O34198R89065J507317K218321L046723
$$ 2980656 2986498 3017799 3120641 3343941 3738566 4372764 5361829 6869146 9087467 12134190
10839A2134190L719601L783969K837152R13499j402822l259310m060522l814065
$$ 12134190 15853791 19637760 22474912 23388411 21985589 18726279 14665757 10851692
10831A0851692k999698k111451j405746r28826o21990m31411l15383k35042j87219
$$ 10851692 7851994 5740543 4334797 3405971 2783981 2352570 2037187 1802145 1614926
10822A614926j57888j41220j32386j25651j19935j08005r0103p2853o1174n0736
$$ 1614926 1457038 1315818 1183432 1057781 937846 829841 739738 666885 605711 554975
10812E54975l9000l8136l8267l4720k9883k4760k2125k0316j7929j2920j1840
$$ 554975 515975 477839 439572 404852 374969 350209 328084 307768 289839 276919 265079
10801B65079j1486j0988j1525j3347j1797o720q796j2776p660n758o976m033k513
$$ 265079 253593 242605 231080 217733 205936 199216 190420 177644 169984 164226 157250 153217 150704
10788A50704j397j40j34K396M173O834K000k179j916j076n635p336k638l993l752
$$ 150704 149307 149167 149033 151429 155602 162436 164436 162257 160341 159265 153630 146294 143656 139663 135911
10773A35911l792m177m871k791p12K61n83j50m25L635J966J09J260o01l237k726
$$ 135911 132119 127942 123071 120280 119568 119829 119246 119096 118671 122306 124272 124381 125641 125040 121803 119077
10757A19077j20J447K079J068J44J762N135O859O070N565L426K213K640L975P55
$$ 119077 118957 120404 122483 123551 123695 125457 130592 137451 143521 149086 152512 154725 157365 161340 162095
10742A62095J987k836l255j973K594K655j604j475p636j4290j7086j6053q798
$$ 162095 164082 161246 157991 156018 158612 161267 159663 158188 150552 136262 119176 103123 94325
10729I4325n910L236N616L616M209N448L086k23m051j779j281r24N8J362M904
$$ 94325 88415 91651 97267 100883 105092 110540 113626 113403 109352 107573 106292 105368 105426 106788 111692
10714A11692P157P006N924L237p7k986k098K035K431M029M907M757M830O595Q746
$$ 111692 118849 125855 131779 135016 134939 131953 129855 131890 134321 138350 143257 148014 152844 159439 168185
10699A68185J0814J0619J4177K5537L5792M7461O4513R1263J29420J65017J93474
$$ 168185 178999 189618 203795 229332 265124 312585 377098 468361 597781 762798 956272
10688I56272K03748J77067J19237L0532o6644j41867j82626j91478j76217j50350
$$ 956272 1160020 1337087 1456324 1486856 1420212 1278345 1095719 904241 728024 577674
10678E77674j17685q9378o3590m3529l0318k2970j5765j4402j0248n566j017k583
$$ 577674 459989 370611 307021 263492 233174 210204 194439 180037 169789 164223 163206 160623
10666A60623k545j070n571k986l881o483m086k167l296j199j477N54n931J546
$$ 160623 158078 157008 151437 148451 144570 138087 134001 131834 128538 127339 125862 126416 120485 122031
10652A22031N156j422p67k345J129L333K268J54l65k843k170Q83m11k222n31l55
$$ 122031 127187 125765 124998 122653 123782 127115 129383 129537 129172 126329 124159 125042 124631 122409 121878 121523
10636A21523k37p43j700J339J360O75J617J932K765J977N858N670O112P169J4057
$$ 121523 121286 120543 118843 120182 121542 122217 123834 125766 128531 130508 136366 142036 148148 155317 169374
10621A69374K1224K8560L3364K7889J5193j507j5718k0905k5487k3168j8670j6410
$$ 169374 190598 219158 252522 280411 295604 294097 278379 257474 231987 208819 190149 173739
10609A73739j1843p932m505l107n371o393k296J013j248j732r80L246K742N121
$$ 173739 161896 153964 149459 146352 140981 134588 132292 133305 132057 130325 129345 132591 135333 140454
10595A40454N451K967P06j610n62j802k712l044k470j365m647o608j519K042q92
$$ 140454 145905 148872 149578 147968 147406 145604 142892 139848 137378 136013 131366 124758 123239 125281 124389
10580A24389k552l731m686n867m753o032n273J308M964Q648O788P328O592N043
$$ 124389 121837 118106 113420 107553 102800 96768 91495 92803 97767 106415 113203 120531 127123 132166
10566A32166J370P17J401N446L433K76o35j674k442J58K72j323L106L08k971k100
$$ 132166 133536 134253 135654 141100 144533 144809 144174 142500 140058 140216 140488 139165 142271 142579 139608 137508
10550A37508k869j944J285n85R01R56k74m773l600l350k465L399P317J958L997
$$ 137508 134639 132695 133980 133395 134296 135252 134978 130205 126605 123255 120790 124189 131506 133464 137461
10535A37461N515K884M74L148M976R622J0027J1519J4017J5721J8095J5407O968
$$ 137461 142976 145860 146334 149482 154458 164080 174107 185626 199643 215364 233459 248866 255834
10522B55834j978o583k356N132J1715J4387P360j584q010j1889j5885j5572j2000
$$ 255834 253856 247273 244917 250049 261764 276151 283511 281927 273917 262028 246143 230571 218571
10509B18571p566o077n332n975r823r283q544o916o377n669q05L91n68K8N089
$$ 218571 211005 204928 199596 193621 183798 174515 165971 159055 152678 147009 146204 146595 146027 146055 151144
10494A51144L637O654J0929J8667K7770L1950K8377K0548P244q274k4469k7315
$$ 151144 154781 161435 172364 191031 218801 250751 279128 299676 306920 298646 274177 246862
10482B46862k7830k7167k2079j1738o331L681N343L633q00O05P250J4628J6600
$$ 246862 219032 191865 169786 158048 151717 155398 160741 164374 163574 164179 171429 186057 202657
10469B02657J1897L446k995p379m509r564m708m245m226J857J0249J4800J8023
$$ 202657 214554 218000 215005 207626 203117 193553 188845 184600 180374 182231 192480 207280 225303
10456B25303K5055L5141M3791M4773L9009K2900K802j6125k9314l3732l0472k0278
$$ 225303 250358 285499 329290 374063 413072 435972 438774 422649 393335 359603 329131 308853
10444C08853j4485j5562j4793j3147j4063q419j179O414J0212J4288J0764N654
$$ 308853 294368 278806 264013 250866 236803 228384 227205 233619 243831 258119 268883 274537
10432B74537j370j978o42P84N513P939O128K251q372j5024j4804j3068r091L461
$$ 274537 273167 271189 270547 271331 276844 284783 290911 293162 284790 269766 254962 241894 232803 236264
10418B36264J8920K9358L6902L2728J6292j267j1905j8624j9113j7449j2423j0619
$$ 236264 255184 284542 321444 354172 370464 369197 357292 338668 319555 302106 289683 279064
10406B79064p761l319o80L079J1138J3685P889r161k4529k0241m364k84j5214
$$ 279064 271303 267984 267304 270383 281521 295206 303095 293934 269405 249164 244800 244516 229302
10393B29302j5801M32K0436M1867N0759M9939L5550K1845J0360J1141K1176K3360
$$ 229302 213501 213933 234369 276236 326995 376934 412484 434329 444689 455830 477006 500366
10381E00366J3371k394j9784k6742k0228j0455p779k957K623P671R623R046O174
$$ 500366 513737 511343 491559 464817 444589 434134 426355 423398 426021 433692 443315 452361 458535
10368D58535L873L049L239L297J656l015m097RK830Q394J1546J6467J9533J8275
$$ 458535 462408 465457 468696 471993 473649 470634 466537 466546 469376 477770 489316 505783 525316 543591
10354E43591J7979J8662J5991J0937M001n49k742j579J460M366N548L647P013
$$ 543591 561570 580232 596223 607160 611161 610612 607870 606291 607751 612117 617665 621312 628325
10341F28325J3114J7575J8480J8126K2181K9710K7043K8518L1619K8749K0264
$$ 628325 641439 659014 677494 695620 717801 747511 774554 803072 834691 863440 883704
10330H83704R625L180M702J0591J4921J7762J8854K3934K4937L1966L4886L9569
$$ 883704 893329 896509 901211 911802 926723 944485 963339 987273 1012210 1044176 1079062 1118631
10318A118631L9415L9911M4448M4303N2120O1335O8915P9503P5327O4557N9277
$$ 1118631 1158046 1197957 1242405 1286708 1338828 1400163 1469078 1548581 1623908 1688465 1747742
10307A747742N7488O5662P4676Q2240R3999J07817J37081J67287J87816J95025
$$ 1747742 1805230 1870892 1945568 2027808 2121807 2229624 2366705 2533992 2721808 2916833
10297B916833J94450K01632K27245K69720L31203M00671M84564N84872P10460
$$ 2916833 3111283 3312915 3540160 3809880 4141083 4541754 5026318 5611190 6321650
10288F321650Q54373J010219J173597J309954J341722J236126J094004J079940
$$ 6321650 7176023 8186242 9359839 10669793 12011515 13247641 14341645 15421585
10280A5421585J357593J959843K840027M031288N718754Q228201J2124827J8340275
$$ 15421585 16779178 18739021 21579048 25610336 31329090 39557291 51682118 70022393
10272G0022393K8219849M2197915N5984216N8873252M2791802J1846512k3771315
$$ 70022393 98242242 140440157 196424373 255297625 298089427 309935939 286164624
10265B86164624n2970673o2311255n1900609l5337011k2504560j4590187r864177
$$ 286164624 233193951 170882696 118982087 83645076 61140516 46550329 36686152
10258C6686152o925024m996625l667782k685614j914489j314749r42096q44442
$$ 36686152 29761128 24764503 21096721 18411107 16496618 15181869 14239773 13395331
10250A3395331r65964j153205j242113j169454j015448q59920p36195o31388n40157
$$ 13395331 12429367 11276162 10034049 8864595 7849147 6989227 6253032 5621644 5081487
10241E081487m67617m11198l63383l18020k51876j75367j08900q9432j37535k14565
$$ 5081487 4613870 4202672 3839289 3521269 3269393 3094026 2985126 2895694 2758159 2543594
10231B543594k72861k61152k10948j69237j42911j25104j01600p8288n7997m5032
$$ 2543594 2270733 2009581 1798633 1629396 1486485 1361381 1259781 1181493 1123496 1078464
10221A078464m4158m6322m2617l9293l9491l9289l8574l3696l0894l0136k6815
$$ 1078464 1034306 987984 945367 906074 866583 827294 788720 755024 724130 693994 667179
10210F67179k9404k9311k7202k7543k4671j8844j2950j6520j6659j8689j5560
$$ 667179 637775 608464 581262 553719 529048 510204 497254 480734 464075 445386 429826
10199D29826j2761p953p458m658n279r422j0050j2668j4878j3962j1683o888r566
$$ 429826 417065 409112 401654 396996 391717 382295 372245 359577 344699 330737 319054 312166 302600
10186C02600j0126r303p239q016n233k09O889J1485J7057K1479K2344J4776Q064
$$ 302600 292474 283171 275932 267916 262683 262474 269363 280848 297905 319384 341728 356504 364568
10173C64568k416j9458l2230l1857k4310j6362j2689j2472o254o95Q85J762N36
$$ 364568 362152 342694 310464 278607 254297 237935 225246 212774 206520 205825 206710 208472 209008
10160B09008j868m371o395k658m897p629m255k541l636n055l166r97J0369K6455
$$ 209008 207140 202769 196374 193716 188819 181190 176935 174394 170758 165703 162537 161540 171909 198364
10146A98364L6040L7398K9993J7115Q152j056j4656k1449k1135j9763j7811j3828
$$ 198364 234404 271802 301795 318910 327062 326006 311350 289901 268766 249003 231192 217364
10134B17364l251K361N375N680M903L918k422o624j0227q136k362J624j298j420
$$ 217364 214113 216474 221849 227529 232432 236350 233928 227304 217077 208941 206579 208203 206905 205485
10120B05485K189P325J1415J3789O427p274k0452k8261k7909k1134j5696q189
$$ 205485 207674 214999 226414 240203 246630 239356 218904 190643 162734 141600 125904 117715
10108A17715j636J941K586j744r700j0628n896j404Q99P615J0900P993J418m508
$$ 117715 116079 118020 120606 118862 109162 98534 92638 91234 92133 99748 110648 118641 120059 115551
10094A15551q141q729o332k329L301Q670R864Q407q58m980p048p313q189l006
$$ 115551 107410 98681 92349 90020 93321 101991 111855 120262 119404 114424 107376 100063 91874 88868
10080H8868N311J2662J3230J3489Q920Q346M510m09l126p328j0864j3252r213
$$ 88868 94179 106841 120071 133560 142480 150826 155336 154927 151801 144473 133609 120357 111144
10067A11144m268K552Q732R643O963p19k666l147J350O262L752O7n558j2110j1257
$$ 111144 106876 109428 118160 127803 134766 134047 131381 128234 129584 135846 139598 139665 134107 121997 110740
10052A10740j2508j2412r526p744k085M545R682J5636K0593J8390J2822O188r38
$$ 110740 98232 85820 76294 68550 66465 71010 80692 96328 116921 135311 148133 154321 153383
10039A53383n275q075p635n361n336r007l826o15j668o128j0128j2905q682J010
$$ 153383 148108 140033 132398 127037 121701 112694 108868 108253 106585 100457 90329 77424 68742 69752
10025F9752J116K469P644J2256J5068J8865K2013J4914R775M954P268R692J531
$$ 69752 70868 73337 80981 93237 108305 127170 149183 164097 173872 178826 186094 195786 197317
10012A97317j6437l5493l6976j7286p960k581n70o0K584O38m405k356O98O46j780
$$ 197317 180880 145387 108411 91125 83165 80584 80014 79954 82538 83176 78771 76415 77113 77759 75979
9997G5979j943o19J182o93k639l576l831m864m382m236l270l025k518j703k047
$$ 75979 74036 73417 74599 73906 71267 67691 63860 58996 54614 50378 47108 44083 41565 39862 37815
9982C7815j544l859n001k709l888k565k568k119P67L467L321K67Q17K689J318
$$ 37815 36271 32412 27411 24702 20814 18249 15681 13562 14329 17796 21117 21384 22201 24890 26208
9967B6208O15M154P186N835M353M392N371K19n178o180r201p753m413k447Q37
$$ 26208 26823 30977 38163 43998 48351 52743 58114 58333 53155 46975 37774 30021 25608 23161 23998
9952B3998k242n114n379l098q57j142J328o97M29N74l37L150N10q43L419M095
$$ 23998 21756 16642 11263 8165 7308 6166 7494 6797 7226 7800 7463 10613 11123 10280 13699 17794
9936A7794K627M824R43j567n25K043p19o55k695j27j583J477K249m08o1J3K165
$$ 17794 20421 25245 26188 24621 24096 26139 25420 24765 22070 21943 20360 21837 24086 23678 23617 23630 25795
9919B5795Q07M18l29l155r51K199j374k873l43J588J285n97Q36J270Q45m547m548
$$ 25795 26602 27020 26691 23536 22585 24784 23410 20537 20194 21782 23067 22470 23306 24576 25421 20874 16326
9902A6326m20P7L48k83j84L2J621K709K463K269l285l677K92j125j378m95o59
$$ 16326 15906 15983 16331 16048 15864 15896 17517 20226 22689 24958 21673 17996 18288 17163 15785 15290 14631
9885A4631k508J252K541J274j193K34K681J381J326J837J202J31L431L808m00
$$ 14631 12123 13375 15916 17190 15997 16231 18912 20293 21619 23456 24658 24789 28220 32028 31628
9870C1628k041J748K775M191M215P532O358N544L443N392N871P818P003R020J0425
$$ 31628 29587 31335 34110 38301 42516 50048 56406 61950 65393 70785 76656 84474 91477 100497 110922
9855A10922J2583J6131K3196L5327N2813P6724J03819J38543J74013K01178K02524
$$ 110922 123505 139636 162832 198159 250972 327696 431515 570058 744071 945249 1147773
9844A147773J66197R2573K207r3755j67886k01415j97271j68953j27536r1250
$$ 1147773 1313970 1406543 1408750 1314995 1147109 945694 748423 579470 451934 360684
9834C60684n8257l4711j9498o932Q531K0816L7102O7580J11828J93535L53450
$$ 360684 302427 267716 248218 241286 249817 270633 307735 375315 487143 680678 1034128
9823A034128O04292Q37119Q07956L76107k85736q20113r07694o45629l55709j86868
$$ 1034128 1638420 2475539 3283495 3659602 3373866 2553753 1646059 1000430 644721 457853
9813D57853j10888p0915n0351l2778k3440j7784r479q118j3321j8706j9165k0315
$$ 457853 346965 276050 225699 192921 169481 151697 142218 134100 120779 102073 82908 62593
9801F2593j9199j2488m801N75k822m211p051p599n324j517P02L520L960o46k878
$$ 62593 43394 30906 26105 26680 23858 19647 12596 4997 -327 -1844 -1142 2378 6338 5692 2814
9786B814K968K203K331K441m30L77j895l302j640N96r7j761l57j026O8J25j646
$$ 2814 5782 7985 10316 12757 12327 12704 10809 7507 5867 6463 6366 4605 4248 3222 3290 3415 1769
9769A769K819K780J945o73k005k66o18j305P25R1N87L42k889r10j496j324j074
$$ 1769 4588 7368 9313 8640 6635 6369 5751 4446 5171 5262 5849 6191 3302 2392 896 -428 -1502
9752a502o11K281L281P33j077K429K5j231P79j91J308K977L278J314l166l157
$$ -1502 -2113 168 3449 4182 3105 5534 5559 4328 5107 4916 6224 9201 12479 13793 10627 7470
9736G470N77K41L0q5k145l553J1j999P5R1j47k077Q19M51P95j002r28Q98J487
$$ 7470 8047 8288 8318 8233 6088 2535 2546 547 622 713 566 -1511 -692 -241 554 -448 -1376 -478 1009
9717A009K188j682Q31O90L16J467J502J121N56M47n21j790m190k548K4J28K538
$$ 1009 3197 1515 2346 3036 3352 4819 6321 7442 7998 8445 7924 6134 1944 -604 -580 -452 2086
9700B086N104L797j741j207po40k61l55k51k799r26K034n15k139q00L81j680j448
$$ 2086 7190 10987 9246 8039 8032 7392 7131 6776 6525 3726 2800 4834 4319 2180 1380 1761 81 -1367
9682a367L93P70n99o19K329J191j427m12j288l1p8Q04J730L62r82J125J105K487
$$ -1367 -974 -204 -803 -1422 907 2098 671 259 -1029 -1060 -1138 -334 1396 1758 776 1901 3006 5493
9664E493M719N856J239j114j948l264l34k717k209J969J133k290o43k739j384
$$ 5493 10212 16068 17307 16193 14245 10981 10647 7930 5721 7690 8823 6533 5890 3151 1767
9649A767j314Q20K241o16l78j093j684J419n16r00J36K120J846q07k253o55L428
$$ 1767 453 1273 3514 2898 2520 1427 -257 1162 646 -254 -118 2002 3848 3041 788 133 3561
9632C561P69J517J085K600j17o46K170R54k977l875j000Q21o00K644p1j398p52
$$ 3561 4330 5847 6932 9532 9415 8769 10939 11893 8916 5041 4041 4862 4262 6906 6835 5437 4685
9615D685J319L160Q9Q04J185R56J273r91m942j369J487j031j679k457j66L333
$$ 4685 6004 9164 9253 10057 11242 12198 13471 12480 7538 6169 7656 6625 4946 2489 2323 5656
9599E656J199K603N23r33q12j185K43j834k057m22J659j20j282q72l479n884L44
$$ 5656 6855 9458 9981 9048 8236 7051 7294 5460 3403 2981 4640 4520 3238 2366 -1113 -6997 -6653
9582f653K241J821m25k548p71K539M084N91L72J79O8L48J772P77K09K749k53J433
$$ -6653 -4412 -2591 -3016 -5564 -6335 -3796 288 879 1251 1430 1498 1846 3618 4395 4604 7353 7100 8533
9564H533k68q12j454L40J113J976o49j178P14J16J562Q09M6l213m024l74k433
$$ 8533 8265 7453 5999 6339 7452 9428 8779 7601 8315 8431 9993 10802 10848 7635 3611 3237 804
9547H04k409J054M21J059M755j344j535J771j313m426L48J375P16l12k987k875
$$ 804 -1605 -551 -130 929 5684 4340 2805 4576 3263 -1163 -815 560 1276 964 -2023 -4898
9531d898l74K128L586J364j923o14J023O75J290j93q24L624M790j906l342k20
$$ -4898 -5272 -3144 442 1806 -117 -731 292 967 2257 2064 1240 4864 9654 7748 4406 4186
9515D186p60M81J861K00k20j632l830Q17J322k095k725J071L08O09L439J041j751
$$ 4186 3426 3907 5768 5968 5748 4116 286 1103 2425 330 -2395 -1324 -1016 -407 3032 4073 2322
9498B322k985q03k57J684J340P53J294m12k305J141J771P23j143p08p42k999N21
$$ 2322 -663 -1466 -1723 -39 1301 2054 3348 2936 631 1772 3543 4266 3123 2415 1673 -1326 -805
9481h05K077j976j768m36K419L340K045J35k969m058n45r84r9K900J944J345r47
$$ -805 1272 -704 -2472 -2908 -489 2851 4896 5031 2062 -1996 -2541 -3525 -3624 -724 1220 2565 1618
9464A618j448j380J156K75K248k92J279K141K230k37l833k662j180J528J223J611
$$ 1618 170 -1210 -54 221 2469 2177 3456 5597 7827 7590 3757 1095 -85 1443 2666 4277
9448D277j619r23Q90J19Q74R18Q73Q32l025r76l66M49k375J079J004j189K773
$$ 4277 2658 1735 2625 2744 3618 4536 5409 6241 3216 2240 1874 2323 -52 1027 2031 842 3615
9431C615J550j637R80p39M10P75j663j787K017J709L81o64p73J980m31m1K330
$$ 3615 5165 3528 4508 3769 4179 4954 3291 1504 3521 5230 5611 4947 4174 6154 5723 5682 8012
9414H012K354J999J614J981K925J622j533j253l871m471k958j707k663j139k319
$$ 8012 10366 12365 13979 15960 18885 20507 18974 17721 13850 9379 6421 4714 2051 912 -1407
9399a407j166N345M369N74R87J038q86J1n13k59k006o43K971K763q4k20P39p93
$$ -1407 -2573 2772 7141 7715 8702 9740 8854 8865 8352 8093 6087 5444 8415 11178 11094 10874 11613 10820
9381A0820k108k279k19L08J94J994r92j672j118k29j32j273m34J710K393k162
$$ 10820 8712 6433 6214 6522 6716 8710 7718 6046 4928 4699 4567 3294 2860 4570 6963 4801
9365D801j172J665J272j189K120J791L67J8j340j140K802k634o14K109L325K693
$$ 4801 3629 5294 6566 5377 7497 9288 9655 9673 8333 7193 9995 7361 6747 8856 12181 14874
9349A4874j032J40j603r46o46J892j384l167J892q34k00o94j597J684l58m77L422
$$ 14874 13842 13982 12379 11433 10787 12679 11295 8128 10020 9186 8986 8292 6695 8379 8021 7544 10966
9332A0966J683K72K059m74J304O57l115p03j104N16j070j589j849o95L135K365
$$ 10966 12649 12921 14980 14506 15810 16467 13352 12649 11545 12061 10991 9402 7553 6858 9993 12358
9316A2358L404o12l46j391k16n33P00J635j085k041J037j66j632J990N94O20j272
$$ 12358 15762 15150 14804 13413 13197 12664 13364 14999 13914 11873 12910 12744 11112 13102 13696 14316 13044
9299A3044J73m75n93N3j480k497J328L250Q51j42O26O24q06J849K331p26j392
$$ 13044 13217 12742 12149 12202 10722 8225 9553 12803 13654 13512 14138 14762 13956 15805 18136 17410 16018
9282A6018j171o61Q39o82j615q04O6Q82l10j98j432r47p49K308R91K516n14l257
$$ 16018 14847 14186 15025 14343 12728 11924 11990 12872 12562 12364 10932 9985 9236 11544 12535 15051 14537 11280
9264A1280j253J84J351K242K628m48k415q26o68L79j090r18J145P95j723K170
$$ 11280 10027 10211 11562 13804 16432 15984 13569 12743 12075 12454 11364 10446 11591 12386 10663 12833
9248A2833J420o5r30K039j945k618p91K880J302K282J507K7l099l021l77m5K927
$$ 12833 14253 14188 13258 15297 13352 10734 9943 12823 14125 16407 17914 17941 14842 11821 11444 11399 14326
9231A4326O75M88M31J694J887j922p41K308J605R37n64k445J511P9j94k2j801
$$ 14326 15001 15489 15920 17614 19501 17579 16838 19146 20751 21688 21124 18679 20190 20269 20075 20053 18252
9214A8252j581j06j047J420L785j073J94j219j07L665j83j891Q5n14j435l210
$$ 18252 16671 16565 15518 16938 20723 19650 19844 18625 18518 22183 22000 20109 20194 19680 18245 15035
9198A5035l997K250K277o81J983K346k417k906K205K533J013j142J725J02j483
$$ 15035 11038 13288 15565 14884 16867 19213 16796 13890 16095 18628 19641 18499 20224 20326 18843
9183A8843j460J244N43J908J502j068J56j93j958k688K527L008J209J708J937
$$ 18843 17383 18627 19170 21078 22580 21512 21668 21475 19517 16829 19356 22364 23573 25281 27218
9168B7218k11O30K352L391L167N560L532J429L041R39o46K366K587l204l104k309
$$ 27218 27007 27637 29989 33380 36547 42107 45639 47068 50109 51048 50402 52768 55355 52151 49047 46738
9152D6738q72j498l678j797j78j567l65r75K60j522k025m202k447J566J720q68
$$ 46738 45866 44368 40690 38893 38715 37148 36783 35808 36068 34546 32521 28319 25872 27438 29158 28290
9136B8290j627O00j988k149k852k233j043l016n92K967M118K366o91J571J097
$$ 28290 26663 27263 25275 23126 20274 18041 16998 13982 13390 16357 20475 22841 22150 23721 24818
9121B4818k238n951j788K216N15j721j137l545j387k72k490j007L605L034j146
$$ 24818 22580 16629 14841 17057 17572 15851 14714 11169 9782 9510 7020 6013 9618 12652 11506
9106A1506q27j14k022k244l3q42j65K477M69J39J857M95l368k758j766j455l95
$$ 11506 10679 10565 8543 6299 6266 5424 5259 7736 8205 8344 10201 10696 7328 4570 2804 1349 954
9089I54n07n42J818L038M15j732J443m11j589n42J52J371K583p05L36j68L76q
$$ 954 447 -95 1723 4761 5176 3444 4887 4476 2887 2345 2497 3868 6451 5746 6082 5914 6290 6282
9071F282O48l636k320L605J988m98o41k07j178O33J64P32k84k883J474k8p96j203
$$ 6282 6930 3294 974 4579 6567 6069 5428 5221 4043 4676 4840 5572 5288 2405 3879 3851 3055 1852
9053A852J144L51K489N69r45j331m35P83q65K262K239k483k168q23j91k60O55
$$ 1852 2996 3347 5836 6405 5460 4129 3694 4477 3612 5874 8113 5630 3462 2639 2448 2188 2843
9036B843J439K861K467m37k475K15j151r96K80J435P3k365k167k794K419M801
$$ 2843 4282 7143 9610 9173 6698 6913 5762 4766 5046 6481 6554 4189 2022 -772 1647 6448
9020F448J429K132M79r94j317o4p15n68j186j989M38K040j06j457k495j747k667
$$ 6448 7877 10009 10488 9494 8177 8113 7398 6830 5644 3655 4093 6133 6027 4570 2075 328 -2339
9003b339J537J29j09J807j167J31Q36j159k213M12M485L973J407j156J011L63
$$ -2339 -802 -673 -782 1025 -142 -11 825 -334 -2547 -2135 2350 6323 7730 6574 7585 7948
8987G948q13j604j838o83K415O26M11K443O84R31p63j989J522K039k20j894k329
$$ 7948 7135 5531 3693 3010 5425 6051 6462 8905 9589 10520 9757 7768 9290 11329 11109 9215 6886
8970F886j837n41R94Q61L45m79L16q5k141j114J670K049n21k555J614J20k658
$$ 6886 5049 4508 5502 6363 6708 6229 6545 6460 4319 3205 4875 6924 6403 3848 5462 5582 2924
8953B924m264J97N279K707j499l45K371K715K77n1j496j361k04j703m012k558
$$ 2924 -1340 -1143 4136 6843 5344 4999 7370 10085 10362 10311 8815 7454 7250 5547 1535 -1023
8937a023J43K225J120K786J73N12r3j37J841R70r93l420k39M85j426J09k27j978
$$ -1023 -880 1345 2465 5251 5424 5936 5843 5706 7547 8517 7524 4104 3865 4350 2924 3033 2806 828
8919H28j517L127J802q64J114J826l05q19J028P60k81o37K57K028O23j894M55
$$ 828 -689 2438 4240 3376 4490 6316 6011 5192 6220 6980 6699 6062 6319 8347 8970 7076 7531
8902G531o21R76K6q47l388J000K468L15j552j381j478L452L839J114J51m70m43
$$ 7531 6910 7886 7912 7065 3677 4677 7145 7460 5908 4527 3049 6501 10340 11454 11605 11135 10692
8885A0692q14J279j184J9J101O70J557k64k41p51k642J20k935r66j681R36M94
$$ 10692 9878 11157 9973 9992 11093 11763 13320 13056 12815 12064 9422 9542 6607 5641 3960 4896 5390
8868E390Q36K560Q72n53K224o56k563J96p62L002J956j831j016J862q85K305J275
$$ 5390 6226 8786 9658 9105 11329 10673 8110 8306 7544 10546 12502 10671 9655 11517 10632 12937 14212
8851A4212N05j52n33l835q21L2P14J256m26R95j20p66K455J760L874K563j621
$$ 14212 14717 14565 14032 10197 9376 9408 10122 11378 10952 11947 11827 11061 13516 15276 19150 21713 20092
8834B0092j458j158J970K382K472O34M39j817M42J335J418k024j063R25j7j601
$$ 20092 18634 17476 19446 21828 24300 24934 25373 23556 23998 25333 26751 24727 23664 24589 24572 22971
8818B2971j4r09o36k240O00l56o50J385r92j153l155j920l9l2M42R97J489J036
$$ 22971 22957 22048 21412 19172 19772 19416 18766 20151 19159 18006 14851 12931 12892 12860 13302 14299 15788 16824
8800A6824R23k423j025n22J557q37J26K262j879j018L665J843j528n85K243K17
$$ 16824 17747 15324 14299 13777 15334 14497 14623 16885 15006 13988 17653 19496 17968 17383 19626 19843
8784A9843q22K337L43l80K148L665M79J219N333P231P314R602J5126K1760K2995
$$ 19843 19021 21358 21701 21321 23469 27134 27613 28832 34165 41396 48710 58312 73438 95198 118193
8769A18193K2306N790j2026k7985k6597j8265j0861p824l678m999k250m434j966
$$ 118193 140499 146289 134263 106278 79681 61416 50555 42731 39053 34054 31804 27370 25404
8756B5404l880j373J237J59J117M21l83J084J255J529J932j257k648Q6K757L487
$$ 25404 21524 20151 21388 21547 22664 23085 22702 23786 25041 26570 28502 27245 24597 24683 27440 30927
8740C0927q75k45r41j047K395N266N192O856L686O062J2755J6891K0765K8453
$$ 30927 30052 29807 28866 27819 30214 35480 40672 47528 51214 57276 70031 86922 107687 136140
8726A36140K4726P183j5225k7063k6448k2893j4560r028p184k575l70j586j167
$$ 136140 160866 168049 152824 125761 99313 76420 61860 52832 45648 43073 42703 41117 39950
8713C9950n73j695n07l542j872L66J065J95J361N68m87R11p31P60Q68o60j362
$$ 39950 39377 37682 37175 33633 31761 32127 33192 33387 34748 35316 34829 35740 35009 35769 36637 35977 34615
8696C4615n36L99M34J967K172L097K249K949M968O604O455L273L639J294j496
$$ 34615 34079 34478 34912 36879 39051 42148 44397 47346 52314 58918 65373 68646 72285 73579 72083
8681G2083m755p850o421k548k496k357j638L68m35J372J080J683N78j785l09r56
$$ 72083 67328 59478 53057 50509 48013 45656 44018 44386 43951 45323 46403 48086 48664 46879 46570 45614
8665D5614k721J036Q75J077j672J562K729K439J711j410j00L92J807p3J009o28
$$ 45614 42893 43929 44804 45881 44209 45771 48500 50939 52650 51240 51140 51532 53339 53266 54275 53647
8649E3647P94L275L254N236M098O504M250M236N089M381M388M16l251l286j600
$$ 53647 54441 57716 60970 66206 70304 76808 81058 85294 90383 94764 99152 99568 96317 93031 91431
8634I1431J667M132L339M749N471N652R598J4612K3456L5874O3005J09087J83447
$$ 91431 93098 97230 100569 105318 110789 116441 126039 140651 164107 199981 262986 372073 555520
8621E55520K38023J72296J3988j68625k58336j90138j03544n1748k8579j7828
$$ 555520 793543 965839 979827 811202 552866 362728 259184 207436 178857 161029
8611A61029j2199r675r471n509k059j483l602l130K48j070J120L557K26J070K424
$$ 161029 148830 139155 129684 124175 122116 120633 117031 113901 114149 113079 114199 117756 117982 119052 121476
8596A21476L618K614K969O183J0514R089J1574J1740J2626J3296J4292J7437J9081
$$ 121476 125094 127708 130677 136860 147374 156463 168037 179777 192403 205699 219991 237428 256509
8583B56509K5283L1639M5241O9260J13472J99101L43296M86035M13154J17809
$$ 256509 281792 313431 358672 427932 541404 740505 1083801 1569836 1982990 2100799
8573B100799k60244n20934m24336k38625j32775q1745n6623l8992l1030l0301
$$ 2100799 1840555 1319621 895285 656660 523885 442140 385517 346525 315495 285194
8563B85194k5719k4873k0680j5499j3799j3532j2681j2690j1128n654k300J6J785
$$ 285194 259475 234602 213922 198423 184624 171092 158411 145721 134593 128939 126639 126655 128440
8550A28440P42J805N255J1440J2954P454J615m693q927n785J303O617J2831J7201
$$ 128440 129182 130987 136242 147682 160636 168090 169705 165012 156085 150300 151603 158220 171051 188252
8536A88252K1392K9107N0336Q5840J43884K10885K08390Q7835q0664k30468k29948
$$ 188252 209644 238751 289087 374927 518811 729696 938086 1025921 945257 714789 484841
8525D84841j37099p3573l9429k1579j5439j1113j2132j0247j1662j0530q417n261
$$ 484841 347742 274169 234740 213161 197722 186609 174477 164230 152568 142038 133621 128360
8513A28360m444n328n250n974o74P30J725M64o31J14m105J513N42m61K679J346
$$ 128360 123916 118588 113338 107364 106690 107420 109145 109609 108978 109092 104987 106500 107042 106581 109260 110606
8497A10606K977O085J2848J1800R752Q03o776r802l895k113J837N256K317R81
$$ 110606 113583 119668 132516 144316 154068 154871 148095 138293 134398 132285 134122 139378 141695 142676
8483A42676j502k365n820l569n35K413K639j218l359m450o014o984m031k245K318
$$ 142676 141174 138809 132989 129420 128885 131298 133937 132719 129360 124910 118896 111912 107881 105636 107954
8468A07954M412j291m124k597K852K994J915J463J184k498k108l29j30l064k419
$$ 107954 112366 111075 106951 104354 107206 110200 112115 113578 114762 112264 110156 109827 109697 106633 104214
8453A04214J062K672K913O290P946P931M089J294j567n161n792l900k244l095
$$ 104214 105276 107948 110861 117151 125097 133028 137117 138411 136844 131683 125891 121991 119747 116652
8439A16652j176K043q89j085J792J304k696m637k839l680n674l282n14J223L199
$$ 116652 115476 117519 116630 115545 117337 118641 115945 111308 108469 104789 99115 95833 95319 96542 99741
8424I9741N33L476L709K729q28n66k713l646K8j548n856l731L81K19k233j910
$$ 99741 100274 103750 107459 110188 109360 108794 106081 102435 102463 100915 95059 91328 91709 91928 89695 87785
8408H7785p85K911O714O783R502N325j482n739j1145j0343p427l177j767k919
$$ 87785 87000 89911 96625 103408 112910 118235 116753 111014 99869 89526 82099 78922 77155 74236
8394G4236k936K757J92q38J129K15k884l312P07p56P40n44j090k311J53q53l038
$$ 74236 71300 74057 74249 73411 74540 74755 71871 68559 69266 68510 69250 68706 67616 65305 65458 64605 61567
8377F1567k65l74j15J238N76J489J266J895J793J264J233K046L858M926P167K611
$$ 61567 61302 60928 60813 62051 62627 64116 65382 67277 69070 70334 71567 73613 77471 82397 89564 92175
8361I2175P56J008N23K543j310l609l931j921k709K537M07J360M586M144K079
$$ 92175 92931 93939 94462 97005 95695 92086 88155 86234 83525 86062 86469 87829 92415 96559 98638
8346I8638j315K026p04j215o024l707p98n876n446n872o8r75m335k310j304l296
$$ 98638 97323 99349 98645 97430 91406 87699 86901 81025 75579 69707 69639 68664 64329 62019 60715 57419
8330E7419l846J875O038J222q17L711L521J912L545P440P391N047J203j116m849
$$ 57419 53573 55448 61486 62708 61891 65602 69123 71035 74580 82020 89411 94458 95661 94545 89696
8315H9696q255q359m312l769m299n609l458j738l75q02k372r00k089l852o35L491
$$ 89696 81441 73082 68770 65001 60702 55093 51635 49897 49522 48720 46348 45448 43359 39507 38872 42363
8299D2363o52j843j001P93l78l260k747k303j170M72j525J588R06jj08K749L158
$$ 42363 41711 39868 38867 39660 39282 36022 33275 30972 29802 30274 28749 30337 31243 31242 31134 33883 37041
8282C7041J18L914M392L317P098N596J313P46j064p23j878n093l922o041l248
$$ 37041 37159 41073 45465 48782 55880 61476 62789 63535 62471 61748 59870 54777 50855 44814 41566
8267D1566j201j988l671j575j305l12j753O14J215k425p74j071k73L26J99K893
$$ 41566 40365 38377 34706 33131 31826 31514 29761 30375 31590 29165 28391 27320 27047 27373 27572 30465
8251C0465J266N01K946J353l01j443j056J76J45O60j339N78p9J426K648p65j150
$$ 30465 31731 32232 35178 36531 36230 34787 33731 33907 34052 34712 33373 33951 33872 35298 37946 37181 36031
8234C6031K72N014K791r00m017m961l669J22O78M71l219m872n00N84N74J687J353
$$ 36031 36303 41317 44108 43208 39191 34230 30561 30683 31361 31832 28613 23741 23241 23825 24399 26086 27439
8217B7439J38r30J267Q15j901o9J754j380l018m81R16K492L96j335j085rK245
$$ 27439 27577 26647 27914 28729 26828 26759 28513 27133 24115 23634 24550 27042 27438 26103 25018 25009 27254
8200B7254n98p35p75j550J474K058j719j400k124J199L129K318o51k998j033J783
$$ 27254 26656 25921 25146 23596 25070 27128 25409 24009 21885 23084 26213 28531 27880 24882 23849 25632
8184B5632J128j082J235P05J077L666L229M027K857L396J11l818k085j571k177
$$ 25632 26760 25678 26913 27618 28695 32361 35590 39617 42474 45870 45981 42163 40078 38507 36330
8169C6330J192R6m092k234K588N234K033L762N030q16o303m048k586k781N95k195
$$ 36330 37522 37618 33526 31292 33880 39114 41147 44909 49939 49123 42820 38772 36186 33405 34000 31805
8153C1805j954j798N61P34j186k05k848j451p98R76o6M09K107l08k903q31J332
$$ 31805 29851 28053 28614 29348 28162 27957 25109 23658 22860 23836 23770 24179 26286 25978 23075 22244 23576
8136B3576J328L627K953K484M665Q233J1029Q178O799Q66m735r620o874j277J315
$$ 23576 24904 28531 31484 33968 38633 46866 57895 66073 72872 73738 69003 59383 52509 51232 52547
8121E2547m507j539k850k222k939k207k022k494K207K457j61k452j447m073j407
$$ 52547 48040 46501 43651 41429 38490 36283 34261 31767 33974 36431 36270 33818 32371 28298 26891
8106B6891k064j585J336l22k753j736j057J452q65K56j190K942k13J28o40M28
$$ 26891 24827 23242 24578 24256 21503 19767 18710 20162 19297 19553 18363 21305 21092 21220 20580 21008
8090B1008r40J84K063J800K994K664m8J671K549L236J808l49l988m706l096l324
$$ 21008 20068 20252 22315 24115 27109 29773 29725 31396 33945 37181 38989 38640 34652 29946 26850 23526
8074B3526j165r54J739N00p89J592j215K680J500K674L164J820j074m45k229k909
$$ 23526 22361 21407 23146 23646 22857 24449 23234 25914 27414 30088 33252 35072 33998 33553 31324 28415
8058B8415P84J802l042l800M62m06j939k144m03j62j020j583j888O09K230M2Q60
$$ 28415 29199 31001 27959 24159 24621 24215 22276 20132 19729 19567 18547 16964 15076 15685 17915 17957 18817
8041A8817J80P38k99J743o53j264J577k77j37M72j26L413m31K6J53J623m43J16
$$ 18817 18997 19735 19436 21179 20526 19262 20839 20562 20425 20897 20771 24184 23753 23779 23932 25555 25112 25228
8023B5228J179J365J27j575r38J049P56L416l3n06k510n09L35j008k21R40l484
$$ 25228 26407 27772 27899 26324 25386 26435 27191 30607 30574 30068 27558 27049 27384 26376 26155 27095 23611
8006B3611j536L267n67k283J129J679o46j168r75M21K390J275j14O94J169p41
$$ 23611 22075 25342 24775 22492 23621 25300 24654 23486 22511 22932 25322 26597 26483 27177 28346 27605
7990B7605j133j82j036O78J248L279J867L450N993P351L323j228k684n933n248
$$ 27605 26472 26290 25254 25932 27180 30459 32326 35776 41769 49120 52443 51215 48531 42598 37350
7975C7350l167j445k084k568j584P5J992o46l855j802k781k126K610p26j848J739
$$ 37350 34183 32738 30654 28086 26502 26577 28569 27923 24068 22266 19485 17359 19969 19243 17395 19134
7959A9134J434Q50J407o36k953r1K560p55J121K265K665j164k055M14R43J438
$$ 19134 20568 21418 22825 22189 19236 19145 21705 20950 22071 24336 27001 25837 23782 24196 25139 26577
7943B6577K829J279K683L64j384q75J092j294j453j777j186j847l06k4N55J883
$$ 26577 29406 30685 33368 33732 32348 31473 32565 31271 29818 28041 26855 25008 24702 24678 25233 27116
7927B7116o46l582j487K25k128k911n29mo87k122N4N53P20n11j588J664L001K127
$$ 27116 26470 22888 21401 21626 19498 16587 16058 16054 15367 13245 13299 13852 14572 14061 12473 14137 17138 19265
7909A9265J166K424R92K201j073q83q40k170J051j678l765k090N58J544P02O94
$$ 19265 20431 22855 23847 26048 24975 24092 23252 21082 22133 20455 16690 14600 15158 16702 17404 18098
7893A8098j493M27P13J164k093m418k039M9R53J789K209J01j534k95j441J290
$$ 18098 16605 17032 17745 18909 16816 12398 10359 10408 11361 13150 15359 15460 13926 13631 12190 13480
7877A3480J075R88k809j964k069L50L55m44n52J148n20j664J47q61J049K070J161
$$ 13480 14555 15543 12734 10770 8701 9051 9406 8962 8410 9558 9038 7374 7521 6660 7709 9779 10940
7860A0940n60n31l38j262O06K826l031j399l08K179L00J529q86j468p52j007L88
$$ 10940 10380 9849 9511 8249 8855 11681 8650 7251 6943 9122 9422 10951 10065 8597 7845 6838 7226
7843G226J996Q45l25J725j074j872q97k67J169L27j407j339j10J081L03N0J35
$$ 7226 9222 10067 9742 11467 10393 8521 7624 7357 8526 8853 7446 6107 5997 7078 7381 7431 7566
7826G566k217J374j254M05O72n42j503J969O17p23M61L93o84l60j1P96m38k394
$$ 7566 5349 6723 5469 5874 6546 6004 4501 6470 7087 6364 6825 7218 6534 6174 6163 6959 6521 4127
7808D127N70K827j108j465J62m24q03j558m183j427R25R25j884j267p96J727L511
$$ 4127 4697 7524 6416 4951 5113 4689 3886 2328 -1855 -3282 -2357 -1432 -3316 -4583 -5379 -3652 -141
7791a41J852K56J366J423j690J663k33j004J968j809k339P51m88k110l641q93
$$ -141 1711 1967 3333 4756 3066 4729 4496 3492 5460 3651 1312 2063 1575 -535 -4176 -5069
7775e069L995l92J480P65q05l75K570P42J521P06j540N76R47J67l35k135l128
$$ -5069 -1074 -1466 14 779 -26 -401 2169 2911 4432 5138 3598 4174 5121 5288 4953 2818 -310
7758c10k115J781K545J055R49K29K363K479Q68j790o35j260k840r18j815O19J221
$$ -310 -2425 -644 1901 2956 3905 4134 6497 8976 9844 8054 7419 6159 3319 2401 586 1205 2426
7741B426l94J16K11j66K750L85j389j961k460j797L531j535m77j387R97Q45r44
$$ 2426 2032 2148 2359 2193 4943 5328 3939 1978 -482 -2279 1252 -283 -760 -2147 -1150 -305 -1249
7724a249J58J7J404K199J682R22j588M96j008j116P32k44m060j182L305p04j600
$$ -1249 -1091 -1074 330 2529 4211 5133 3545 4041 3033 1917 2649 2405 -1655 -2837 468 -236 -1836
7707a836j871l29J119Q67n8J155J514o30m01J075K98R74K681j946j005j89J218
$$ -1836 -3707 -4036 -2917 -2050 -2108 -953 561 -69 -470 605 903 1877 4558 2612 1607 1418 2636
7690B636J99p37r98q63l996j098j300J034J360l34L2q09J240J441j42p19k880
$$ 2636 2835 2098 1100 237 -3759 -4857 -6157 -5123 -3763 -4097 -4065 -4874 -3634 -2193 -2335 -3054 -5934
7673e934J494K21M40K876j11l605j687O24J317L002J696K80k13m4R1j797N11K2
$$ -5934 -4440 -4219 -3779 -903 -1014 -4619 -6306 -5682 -4365 -1363 333 613 400 356 447 -1350 -839 -817
7655h17J026P41r92r66j087o88P1J72p65M04P0q49m65K362R20j917q44j08j558
$$ -817 209 950 -42 -1008 -2095 -2783 -2712 -2540 -3305 -2901 -2831 -3680 -4145 -1783 -863 -2780 -3624 -3732 -5290
7636e290L29J736J748L288J663p70m94p66m333n405o72M344M081O6j390R94J307
$$ -5290 -4961 -3225 -1477 1811 3474 2704 2210 1444 -2889 -8294 -8966 -4622 -541 -475 -1865 -871 436
7619D36k558O84R03j083k154k239O82j73J102k244P40L56J125j452j377K990J824
$$ 436 -2122 -1438 -535 -1618 -3772 -6011 -5329 -5502 -4400 -6644 -5904 -5548 -4423 -5875 -7252 -4262 -2438
7602b438j473k575q53q99K033O052N121N242K115k8o586p851l912j217l45R35
$$ -2438 -3911 -6486 -7339 -8238 -6205 -153 4968 10210 12325 12297 5711 -2140 -6052 -7269 -7614 -6679
7586f679M20J690J14L39q08k602M84j015P73J052p99J85J750q56k073k211J072
$$ -6679 -6259 -4569 -4455 -4116 -4924 -7526 -7042 -8057 -7284 -6232 -7031 -6846 -5096 -5952 -8025 -10236 -9164
7569i164K198J217p86j427p71n68o77M171J991J383M206K367j772m249m234l197
$$ -9164 -6966 -5749 -6535 -7962 -8733 -9301 -9978 -5807 -3816 -2433 1773 4140 2368 -1881 -6115 -9312
7553i312k532J409L282J578J552J037o39r74j845j446O00J836P74K23j546j184
$$ -9312 -11844 -10435 -7153 -5575 -4023 -2986 -3625 -4599 -6444 -7890 -7290 -5454 -4680 -4457 -6003 -7187
7537g187M99K811k167m70J761P07j532l29n45q25P28N88N99k3j177P39K491j527
$$ -7187 -6688 -3877 -6044 -6514 -4753 -4046 -5578 -5907 -6452 -7277 -6549 -5961 -5362 -5385 -6562 -5823 -3332 -4859
7519d859m89K14J571k067Q36P76r46j024o02j766L12o00k83P56J812j498n30L73
$$ -4859 -5348 -5134 -3563 -5630 -4794 -4018 -4964 -5988 -6590 -8356 -8044 -8644 -8927 -8171 -6359 -7857 -8387 -8014
7501h014o7Q28j159K756O16r35l85j379P23r17j002P14K34Q15K50j07O92m40k346
$$ -8014 -8081 -7253 -8412 -5656 -5040 -5975 -6360 -7739 -7016 -7933 -8935 -8221 -7987 -7172 -6922 -7029 -6337 -6777 -9123
7482i123j040K271J609Q93J432p89r24j174O4O61Q65n07j659k724J632L53M38
$$ -9123 -10163 -7892 -6283 -5390 -3958 -4747 -5671 -6845 -6781 -6120 -5255 -5762 -7421 -10145 -8513 -8160 -7722
7465g722j291J278Q14N82M21O57J247K04k394j0j555L198M756j14m049q14P77
$$ -7722 -9013 -7735 -6921 -6339 -5918 -5261 -4014 -3810 -6204 -6214 -7769 -4571 185 71 -3978 -4792 -4015
7448d015k275l212o72J81l027R29L972K610j349j892j098J934L598K566P3J27
$$ -4015 -6290 -9502 -10174 -9993 -13020 -12091 -8119 -5509 -6858 -8750 -9848 -7914 -4316 -1750 -1677 -1550
7432a550j742k213L39k291k087J803J542J381j474l77l29j605K96J559J805K962
$$ -1550 -3292 -5505 -5166 -7457 -9544 -7741 -6199 -4818 -6292 -6669 -6998 -8603 -8307 -6748 -4943 -1981
7416a981J028l84j848j283j559L70M5L94K698n0j932k702J426P1m91J107r4k091
$$ -1981 -953 -1337 -3185 -4468 -6027 -5657 -5612 -5218 -2520 -2570 -4502 -7204 -5778 -5707 -6198 -5091 -5185 -7276
7398g276k38J104k6j73j8Q58K977J144k510j908L71L14O20j311j118r6j88R99
$$ -7276 -7514 -6410 -6436 -6609 -6627 -5769 -2792 -1648 -4158 -6066 -5695 -5381 -4761 -6072 -7190 -7286 -7474 -6475
7380f475J422o38j657J914J075q49l97K250j577J41k797k747j015j885O85J798
$$ -6475 -5053 -5691 -7348 -5434 -4359 -5208 -5605 -3355 -4932 -4791 -7588 -10335 -11350 -13235 -12550 -10752
7364a0752J215K005O71K194q18l42j627n57j26J100K261L08m572k529J546J421
$$ -10752 -9537 -7532 -6861 -4667 -5485 -5827 -7454 -8011 -8137 -7037 -4776 -4468 -9040 -11569 -10023 -8602
7348h602J838J646m40j018o82J097L48m00m94j419r64J007r47J458J497J90J649
$$ -8602 -6764 -5118 -5558 -6576 -7258 -6161 -5813 -6213 -6707 -8126 -9090 -8083 -9030 -7572 -6075 -5885 -4236
7331d236Q98J541j814j345j43J347P71K66j44k497M50k078J058J800K155j515
$$ -4236 -3338 -1797 -3611 -4956 -5099 -3752 -2981 -2715 -2859 -5356 -4906 -6984 -5926 -4126 -1971 -3486
7315c486k267N94m04m18J08J5p44k105J90k05N47j884J340K081j111N52K231P13
$$ -3486 -5753 -5159 -5563 -5981 -5873 -5858 -6602 -8707 -8517 -8722 -8175 -10059 -8719 -6638 -7749 -7197 -4966 -4253
7297d253J60K88Q67k535n30l54L301K026j129K45J121j227k746k212K487M024
$$ -4253 -4093 -3805 -2938 -5473 -6003 -6357 -3056 -1030 -2159 -1914 -793 -2020 -4766 -6978 -4491 -467
7281d67j56k926j893o06k240Q46J326j009n77K06o8L91m67p39j17Q64Q14k868
$$ -467 -623 -3549 -5442 -6048 -8288 -7442 -6116 -7125 -7702 -7496 -7564 -7173 -7640 -8379 -8496 -7632 -6818 -9686
7263i686l4J433j885Q35J963J479k077K76N85k082j027K251n22J452J453o05n03
$$ -9686 -9720 -8287 -10172 -9337 -7374 -5895 -7972 -7696 -7111 -9193 -10220 -7969 -8491 -7039 -5586 -6191 -6694
7246f694l056j832J041J893J40K99R45o33J094M97j00J964j343L40J511j587j24
$$ -6694 -9750 -11582 -10541 -8648 -8508 -8209 -7264 -7897 -6803 -6306 -6406 -4442 -5785 -5445 -3934 -5521 -5645
7229e645R92K761K121O13J441j579m086j043o04J322K71M27j269K62L55n63k526
$$ -5645 -4653 -1892 229 842 2283 704 -3382 -4425 -5029 -3707 -3436 -3009 -4278 -4016 -3661 -4224 -6750
7212f750p71K950J579O69J378j837m023j50J823J729n06k270j140O49j010p82
$$ -6750 -7521 -4571 -2992 -2323 -945 -2782 -6805 -6955 -5132 -3403 -3909 -6179 -7319 -6670 -7680 -8462
7196h462m84k340N61R31K481K876m50k317J353k11k048j587L098L686k177l17
$$ -8462 -8946 -11286 -10725 -9794 -7313 -4437 -4887 -7204 -5851 -6062 -8110 -9697 -6599 -2913 -5090 -5407
7180e407J564R49k457p39K171R86k417k687J025J94j29j1j663l081P31N28M58
$$ -5407 -3843 -2894 -5351 -6090 -3919 -2933 -5350 -8037 -7012 -6818 -6947 -6958 -8621 -11702 -10971 -10443 -9985
7163i985K86J164m98q4K435K595r22k191r62o28J155N16j318J548j73J132K012
$$ -9985 -9699 -8535 -9033 -9117 -6682 -4087 -5009 -7200 -8162 -8790 -7635 -7119 -8437 -6889 -7062 -5930 -3918
7146c918J807j21k687j667p4n70k06P1J213j251J89n41Q49K636k399K44Q74m9
$$ -3918 -2111 -2232 -4919 -6586 -6660 -7230 -7436 -7365 -6152 -7403 -7214 -7755 -6906 -4270 -6669 -6425 -5551 -5600
7128e600k449J97K578J434j095k683J051K313K728J286K28o80j696n30k567j163
$$ -5600 -8049 -7852 -5274 -3840 -4935 -7618 -6567 -4254 -1526 -240 -12 -692 -2388 -2918 -5485 -6648
7112f648J006r86K49k69r22J488j43P62R99J317j78j098N12j384k382j077j294
$$ -6648 -5642 -6628 -6379 -6648 -7570 -6082 -6225 -5463 -4464 -3147 -3325 -4423 -3911 -5295 -7677 -8754 -10048
7095a0048J020O98J890K185O72j717J957J652k491K3rK889j189j541m4q4K95K29
$$ -10048 -9028 -8330 -6440 -4255 -3583 -5300 -3343 -1691 -4182 -4159 -4168 -1279 -2468 -4009 -4053 -4137 -3842 -3613
7077c613P51M26k518l784j204J149K032R84l63l49K666k932j053p38k45J494l93
$$ -3613 -2862 -2436 -4954 -8738 -9942 -8793 -6761 -5777 -6140 -6489 -3823 -6755 -7808 -8546 -8791 -7297 -7690
7060g690j078P8L307N19J849j379R89K103N53j846l059n75k685j35K422J932K59
$$ -7690 -8768 -8690 -5383 -4864 -3015 -4394 -3405 -1302 -749 -2595 -5654 -6229 -8914 -9049 -6627 -4695 -4436
7043d436l399p04P76m77J924J192j204l29n14k523J518M513K639n23r43M15k929
$$ -4436 -7835 -8539 -7763 -8240 -6316 -5124 -6328 -6657 -7171 -9694 -8176 -3663 -1024 -1547 -2490 -2075 -5004
7026e004k710J270M33K781j83j844J170R49j107k175p10m53J686k02k8o76Q91
$$ -5004 -7714 -6444 -6011 -3230 -3413 -5257 -4087 -3138 -4245 -6420 -7130 -7583 -5897 -6099 -6127 -6803 -5912
7009e912m83k19K423P93j398O23k37p67l409l54l69J189J989J342N66J287j391
$$ -5912 -6395 -6614 -4191 -3398 -4796 -4173 -4410 -5177 -8586 -8940 -9309 -8120 -6131 -4789 -4223 -2936 -4327
6992d327j823m00l252j352J071J208J393Q99K01j86Q14J785L86N44l442r58J509
$$ -4327 -6150 -6550 -9802 -11154 -10083 -8875 -7482 -6583 -6382 -6568 -5754 -3969 -3583 -3039 -6481 -7439 -5930
6975e930J705k40l447n87R91K416Q05L93l985K51J674k48J212J664J090K257r64
$$ -5930 -4225 -4465 -7912 -8499 -7508 -5092 -4287 -3894 -7879 -7628 -5954 -6202 -4990 -3326 -2236 21 -943
6958i43k58j566n99k628j727j199K446K303J065J941n99j874L47J159K89J210
$$ -943 -1201 -2767 -3366 -5994 -7721 -8920 -6474 -4171 -3106 -1165 -1764 -3638 -3291 -2132 -1843 -633
6942f33k323l129q89K311j08M163J767j703j786j883j50n51p89j286k049J128
$$ -633 -2956 -6085 -6974 -4663 -4771 -608 1159 -544 -2330 -4213 -4363 -4914 -5703 -6989 -9038 -7910
6926g910L798K035P30j144l608k112q39J428J018P40q88j97o32J218J192k67N37
$$ -7910 -4112 -2077 -1347 -2491 -6099 -8211 -9050 -7622 -6604 -5864 -6752 -6949 -7581 -6363 -5171 -5438 -4901
6909d901p13k06K290O64l602K701K631o69j991j790p6m78O66K070j9P47k060J296
$$ -4901 -5614 -5820 -3530 -2866 -6468 -3767 -1136 -1805 -3796 -5586 -5662 -6140 -5474 -3404 -3423 -2676 -4736 -3440
6891c440Q23l20L05j324j371M15j014Q76J497J011j087j674N60K219J19n1j170
$$ -3440 -2617 -2937 -2632 -3956 -5327 -4912 -5926 -5050 -3553 -2542 -3629 -5303 -4743 -2524 -2405 -2456 -3626
6874c626q50J111Q44j83j709M93k29K17K31L24j997r59l86J495L108j797k179
$$ -3626 -4476 -3365 -2521 -2704 -4413 -3920 -4149 -3932 -3701 -3377 -5374 -6333 -6719 -5224 -2116 -3913 -6092
6857f092m62j243N21L354o4k423q22k927K16K541J702J055L78P4n99O75K638q43
$$ -6092 -6554 -7797 -7276 -3922 -3986 -6409 -7231 -10158 -9942 -7401 -5699 -4644 -4266 -4192 -4791 -4116 -1478 -2321
6839b321j264O92k215m9Q86J054L74j387k269j250q25J649L77o74O97o5P80M58
$$ -2321 -3585 -2893 -5108 -5157 -4271 -3217 -2843 -4230 -6499 -7749 -8574 -6925 -6548 -7222 -6525 -6590 -5810 -5352
6821e352K86o13J642N87J103J34j604j078L57J768l378k063J842O32r03J983J201
$$ -5352 -5066 -5679 -4037 -3450 -2347 -2213 -3817 -4895 -4538 -2770 -6148 -8211 -6369 -5737 -6640 -4657 -3456
6804c456o65j067Q64k24L85K504K625Q4O87J462k098n03j714r70l750m098j848
$$ -3456 -4121 -5188 -4324 -4548 -4163 -1659 966 1050 1737 3199 1101 598 -1116 -2086 -5836 -9934 -11782
6787a1782j458L583L027k142j487J267M04K973K259k45k230k063P7K238K278j022
$$ -11782 -13240 -9657 -6630 -8772 -10259 -8992 -8588 -5615 -3356 -3601 -5831 -7894 -7817 -5579 -3301 -4323
6771d323j375k62n32K793J724k581p3M73j522L125Q60m95l332q46J930m32p62
$$ -4323 -5698 -5960 -6492 -3699 -1975 -4556 -4629 -4156 -5678 -2553 -1693 -2188 -5520 -6366 -4436 -4868 -5630
6754e630q56K247N9q28n78K69O25M73l06K374P8j634J162k94j586j868j289m07
$$ -5630 -6486 -4239 -4180 -5008 -5586 -5317 -4692 -4219 -4525 -2151 -2073 -3707 -2545 -2839 -4425 -6293 -7582 -7989
6736g989M777K895K168k326k115q06l13l664j836J613J204J96L144K340P73k429
$$ -7989 -3212 -317 1851 -475 -2590 -3396 -3709 -7373 -9209 -7596 -6392 -6196 -3052 -712 61 -2368
6720b368j30J239K33j910j420p56J79K15J237K074J817K48j84p52j455M72L51
$$ -2368 -2498 -1259 -1026 -2936 -4356 -5112 -4933 -4718 -3481 -1407 410 658 474 -278 -1733 -1261 -910
6703i10k578r44k99J61J194K023K89m31k471n89k267o45N32K280o84j210o12J500
$$ -910 -3488 -4432 -4731 -4570 -3376 -1353 -1064 -1495 -3966 -4555 -6822 -7467 -6935 -4655 -5339 -6549 -7161 -5661
6685e661L402J062l005k47k20J741o58j513j110n95n89r79J721K811K724J317
$$ -5661 -2259 -1197 -4202 -4449 -4669 -2928 -3586 -5099 -6209 -6804 -7393 -8372 -6651 -3840 -1116 201
6669B01K036p79j448j791l933k242J559K256p63J545R62K397J038k600l003k054
$$ 201 2237 1458 10 -1781 -5714 -7956 -6397 -4141 -4904 -3359 -2397 0 1038 -1562 -4565 -6619
6653f619J268o19j832j226K500K231K185j350j054j675L027J293j58R6k347q64
$$ -6619 -5351 -5970 -7802 -9028 -6528 -4297 -2112 -3462 -4516 -6191 -3164 -1871 -2029 -1933 -4280 -5144
6637e144K232j591k176k523J304J087M94J933O8l18m35J670P68k253j223J388
$$ -5144 -2912 -4503 -6679 -9202 -7898 -6811 -6317 -4384 -4316 -4634 -5069 -3399 -2631 -4884 -6107 -4719
6621d719m10k198L445r34l164J348K483K211K17l73J532O20l35k171j442j0r96
$$ -4719 -5129 -7327 -3882 -4816 -7980 -6632 -4149 -1938 -1721 -2094 -562 58 -277 -2448 -3890 -3900 -4896
6604d896j754j284q20J302J257N6J106o15n5j76K263L044J90k128j143J388R5
$$ -4896 -6650 -7934 -8754 -7452 -6195 -6139 -5033 -5648 -5703 -5879 -3616 -572 -382 -2510 -3653 -2265 -2170
6587b170k332J76k85Q85K048J993m501l262J32k064P5L56J328J386l77o05J527
$$ -2170 -4502 -4326 -4611 -3726 -1678 315 -4186 -7448 -7316 -9380 -9305 -8949 -7621 -6235 -6612 -7217 -5690
6570e690L194j59O82j744m78J501O58P93k992j719J430J349Q86k436p20J441M26
$$ -5690 -2496 -2655 -1973 -3717 -4195 -2694 -2036 -1243 -4235 -5954 -4524 -3175 -2289 -4725 -5445 -4004 -3578
6553c578n44k879M48k02Q56J727L181J70M27j082K46m37K09R58J720o93o99k170
$$ -3578 -4122 -7001 -6553 -6755 -5899 -4172 -991 -821 -394 -1476 -1230 -1667 -1458 -500 1220 527 -172 -2342
6535b342j916j903J348J311J314J528l377q29O45J287r37j186J878J936Q67j977
$$ -2342 -4258 -6161 -4813 -3502 -2188 -660 -4037 -4866 -4221 -2934 -3871 -5057 -3179 -1243 -376 -2353
6519b353L9m46m03J84k579r37j92j341J335q68j662l3l76J808J714J194L36J937
$$ -2353 -2314 -2760 -3163 -2979 -5558 -6495 -6687 -8028 -6693 -7561 -9223 -9256 -9632 -7824 -6110 -4916 -4580 -2643
6501b643J630L96L9K02N37n52q39k740l172r97J163K470l73j269J942J464k072
$$ -2643 -1013 -617 -578 -376 161 -391 -1230 -3970 -7142 -8139 -6976 -4506 -4879 -6148 -4206 -2742 -4814
6484d814n49O88J74n18r9k791n29L055K563J135Q6j270j764j707j414j031J103
$$ -4814 -5363 -4675 -4501 -5019 -5118 -7909 -8438 -5383 -2820 -1685 -1599 -2869 -4633 -6340 -7754 -8785 -7682
6467g682J424J610R58j542k53k4J283L283j124j88k271j357r33R45J693n60r1
$$ -7682 -6258 -4648 -3690 -5232 -5485 -5509 -4226 -943 -2067 -2255 -4526 -5883 -6816 -5871 -4178 -4738 -4829
6450d829p11n27J838r74j459K787J481j123J481k416l985J704Q03K66k191j111
$$ -4829 -5540 -6067 -4229 -5203 -6662 -3875 -2394 -3517 -2036 -4452 -8437 -6733 -5930 -5664 -7855 -8966
6434h966J092J441J421l66j487j05K029K418O18M14j087k205J293K951j198k167
$$ -8966 -7874 -6433 -5012 -5378 -6865 -6970 -4941 -2523 -1905 -1491 -2578 -4783 -3490 -539 -1737 -3904
6418c904J329J364r99Qn56j483L27O62q26J519j93m01K577K662r72j062J354J123
$$ -3904 -2575 -1211 -2210 -2202 -2758 -4241 -3914 -3252 -4078 -2559 -2752 -3153 -576 2086 1114 52 1406 2529
6400B529k370j864K92P32l40k702N63m61m95k158l62J794J690L27j681j250L63
$$ 2529 159 -1705 -1413 -681 -1021 -3723 -3160 -3621 -4116 -6274 -6636 -4842 -3152 -2825 -4506 -5756 -5393
6383e393J224R63m58J10M14K0J530j211q94N81j798kL87J946L243j136k772R63
$$ -5393 -4169 -3206 -3664 -3554 -3140 -3120 -1590 -2801 -3695 -3114 -4912 -4914 -4527 -2581 662 -474 -3246 -2283
6365b283j091j213J20k00K246L297J061k702j460k18j59q37j85J26j671M98O99
$$ -2283 -3374 -4587 -4467 -4667 -2421 876 1937 -765 -2225 -2443 -2602 -3439 -3624 -3498 -5169 -4671 -3972
6348c972j247j772j996R39L147J021J795P23k43L76j216k299J375J948J77J291
$$ -3972 -5219 -6991 -8987 -8048 -4901 -3880 -2085 -1362 -1605 -1229 -2445 -4744 -3369 -1421 -1244 47
6332D7J775k18k177k350n77p44k22J416J344j01j20l748j531K85j514L512J452
$$ 47 1822 1604 -573 -2923 -3500 -4244 -4466 -3050 -1706 -1807 -1927 -5675 -7206 -6921 -8435 -4923 -3471
6315c471K611O29p32j9P42M94J096r63M40r97k852l166N24J416K059m73j609K23
$$ -3471 -860 -231 -963 -982 -240 254 1350 387 827 -170 -3022 -6188 -5664 -4248 -2189 -2662 -4271 -4048
6297d048Q09j114o16K93J864J985m07j826L41J724N59k936J777J944j461k358
$$ -4048 -3239 -4353 -4969 -4676 -2812 -827 -1234 -3060 -2719 -995 -436 -3372 -1595 349 -1112 -3470
6281c470j870p67K134P05M68j298q32o23J009K100q82k91J142J759P85j061j604
$$ -3470 -5340 -6107 -3973 -3268 -2800 -4098 -4930 -5553 -4544 -2444 -3326 -3617 -2475 -716 69 -992 -2596
6264b596j685j569m55K932J623K082k010O05O02l100j379J119M010R6j49p36O44
$$ -2596 -4281 -5850 -6305 -3373 -1750 332 -1678 -1073 -471 -3571 -4950 -3831 179 275 126 -610 34
6247C4j302k116l16J241j466K92L331J598j512j747k026Q3K067M04P11m243l661
$$ 34 -1268 -3384 -3700 -2459 -3925 -3633 -302 1296 -216 -1963 -3989 -3906 -1839 -1435 -724 -4967 -8628
6230h628J07K726J22J234K798P69J23r06o24R26Q41k794k286k95J96N93J136K269
$$ -8628 -8521 -5795 -5673 -4439 -1641 -872 -749 -1655 -2279 -1353 -512 -3306 -5592 -5887 -5691 -5098 -3962 -1693
6212a693j208n42J775k03M6n82K889K670j009l74j971j736j794N59k809O01K11
$$ -1693 -2901 -3443 -1668 -1871 -1825 -2407 482 3152 2143 1769 -202 -1938 -3732 -3173 -5982 -5381 -5170
6195e170J146J123K57J014j557j396K316R15k297m8J959j029K337K407J361j26
$$ -5170 -4024 -2901 -2644 -1630 -3187 -4583 -2267 -1352 -3649 -3697 -1738 -2767 -430 1977 3338 3212
6179C212j771N55j918j674j121o51j089j022J891J056Q3n56k252P34j126J410
$$ 3212 1441 1996 78 -1596 -2717 -3368 -4457 -5479 -3588 -2532 -2449 -3005 -5257 -4523 -5649 -4239
6163d239j010p7K23K73j06J244K06l89J644N20J502J429p72k687l31k458O25K917
$$ -4239 -5249 -5326 -5103 -4830 -4936 -3692 -3486 -3875 -2231 -1711 -209 1220 448 -2239 -2570 -5028 -4403 -1486
6145a486o98J751Rj93Q4j118P72Q72Q36j442o22j338k363j456k020o13R59l41
$$ -1486 -2184 -433 -424 -617 -533 -1651 -879 -7 829 -613 -1235 -2573 -4936 -6392 -8412 -9025 -8066 -8407
6127h407J333K964O24K618n75k033q51M08J039l09m35p63j19j464r37J272J190
$$ -8407 -7074 -4110 -3486 -868 -1443 -3476 -4327 -3919 -2880 -3189 -3624 -4387 -4506 -5970 -6907 -5635 -4445
6110d445L383r45j884j199r34L56J127l40P13n09k116J001L890l469k626J165
$$ -4445 -1062 -2007 -3891 -5090 -6024 -5668 -4541 -4881 -4168 -4677 -6793 -5792 -1902 -5371 -7997 -6832
6094f832J946J704J142j45J055L66l487m22R89L40M07q55K721k000l727J786J436
$$ -6832 -4886 -3182 -2040 -2185 -1130 -764 -4251 -4673 -3684 -3344 -2937 -3792 -1071 -3071 -6798 -5012 -3576
6077c576K304J541k454j234J04k099j48J854J49l75N70J777K359k96J284J071
$$ -3576 -1272 269 -2185 -3419 -3315 -5414 -5562 -3708 -3559 -3934 -3364 -1587 772 476 1760 2831
6061B831Q11o14j397N04O99j684k798j28J637N59L3j128m18k705j473J052R47
$$ 2831 3642 3028 1631 2135 2834 1150 -1648 -1776 -139 420 453 -675 -1093 -3798 -5271 -4219 -3272
6044c272o27j76L421j133k325J2j861q31J298J181L139J114o54k86K59k409j354
$$ -3272 -3899 -4075 -654 -1787 -4112 -4100 -5961 -6792 -5494 -4313 -1174 -60 -714 -1000 -741 -3150 -4504
6027d504K844J577k881j22Q68J472K818J325j751K133p65k185j641o13j500M89
$$ -4504 -1660 -83 -2964 -3086 -2218 -746 2072 3397 1646 3779 3014 829 -812 -1425 -2925 -2436
6011b436L180J784l442l453k651J163L335m49j094j550p9K966q4J460l40k84K019
$$ -2436 744 2528 -914 -4367 -7018 -5855 -2520 -2969 -4063 -5613 -5692 -2726 -2810 -1350 -1690 -1974 45
5994D5j45N06M69j698j229j248O08J293K51m87j912o92J289K210L233N49j622
$$ 45 -100 406 875 -823 -2052 -3300 -2692 -1399 -1148 -1635 -3547 -4239 -2950 -740 2493 3042 1420
5977A420p55j620j992j469M14J918o93j174o91Q35J683K048L558o23l157p25R25
$$ 1420 665 -955 -2947 -4416 -4002 -2084 -2777 -3951 -4642 -3807 -2124 -76 3482 2859 -298 -1023 -98
5960i8k318k124K356l01l97K330L28j075J56J825M04j773r11k037J871r17K26
$$ -98 -2416 -4540 -2184 -2485 -2882 -552 -224 -1299 -1143 682 1086 -687 -1598 -3635 -1764 -2681 -2455
5943b455N43o28K29K63j581r92J471L013j62p51o28j967K361J116l75J4j044m16
$$ -2455 -1912 -2540 -2311 -2048 -3629 -4621 -3150 -137 -299 -1050 -1678 -3645 -1284 -168 -543 -529 -1573 -1989
5925a989j601j249j283J556O11K101J158J793M997J28l557m205l017L26L721N84
$$ -1989 -3590 -4839 -6122 -4566 -3955 -1854 -696 1097 6094 6222 2665 -1540 -4557 -4231 -510 74
5909G4k254r01J140l76k318j796M15K228Q12j386J98K530l00n19Q37Q3J486RJ012
$$ 74 -2180 -3081 -1941 -2317 -4635 -6431 -6016 -3788 -2976 -4362 -4164 -1634 -1934 -2453 -1616 -1533 -47 -38 974
5890I74j608k959p90L429K436n84k629j889j580K60J919N98l93P03K048K80l167
$$ 974 -634 -3593 -4383 -954 1482 898 -1731 -3620 -5200 -4940 -3021 -2423 -2816 -2113 -65 215 -2952
5873b952K632K755m18n346k108l02q23j74K18M528J113k192R9K224q81j755K461
$$ -2952 -320 2435 2017 -3329 -5437 -5739 -6562 -6736 -6518 -1990 -877 -3069 -2970 -746 -1627 -3382 -921
5856i21J108J47k26o33J191k521j929o43o96J868J308N30k40k65r95J629l93p69
$$ -921 187 334 108 -525 666 -1855 -3784 -4427 -5123 -3255 -1947 -1417 -1657 -1922 -2917 -1288 -1681 -2450
5838b450J185M65l02R24r93j520k794n88P54J054L663K37j362j156m89J931J799
$$ -2450 -1265 -800 -1102 -178 -1171 -2691 -5485 -6073 -5319 -4265 -602 -365 -1727 -2883 -3372 -1441 358
5821C58K266Q79J49j53k319k404J983J534M40j909j963j616N46L325o58j454K261
$$ 358 2624 3503 3652 3499 1180 -1224 759 2293 2733 824 -1139 -2755 -2209 1116 458 -996 1265
5804A265L094k287o29J14m98o96k899l14J200q37m99Q53j666k565J278L937L8
$$ 1265 4359 2072 1443 1557 1059 363 -2536 -2850 -1650 -2487 -2986 -2133 -3799 -6364 -5086 -1149 -1111
5787a111j309m16L001L269j827l077j270k571R96m58L009j78P25k016j531R17
$$ -1111 -2420 -2836 165 3434 1607 -1470 -2740 -5311 -4315 -4773 -1764 -1942 -1217 -3233 -4764 -3847
5771c847m04J788P81j079j087n64Q18r19k32l21q5R69J52K484j352O55K256L21
$$ -3847 -4251 -2463 -1682 -2761 -3848 -4412 -3594 -4513 -4745 -5066 -5151 -4182 -4030 -1546 -2898 -2243 13 334
5753C34j80k397J063J335J88J324o96m231j266L44K52K247Q16k32J427j490o75
$$ 334 154 -2243 -1180 155 343 1667 971 -3260 -4526 -4182 -3930 -1683 -867 -1099 328 -1162 -1837
5736a837Q87J711J764k199o05J760J539k87n52O58J92l547k031K419J631M57o72
$$ -1837 -950 761 2525 326 -279 1481 3020 2733 2181 2839 3031 -516 -2547 -128 1503 1960 1288
5719A288J256K031p30k463j645J1m22j265R4K394R16M72j349k310j16k281j184
$$ 1288 2544 4575 3845 1382 -263 -252 -674 -1939 -1845 549 1465 1937 588 -1722 -1838 -4119 -5303
5702e303N75l30R91J288r58L495L381p2k323M18k104l80J312r85j656J994j034
$$ -5303 -4728 -5058 -4067 -2779 -3737 -242 3139 3067 744 1162 -942 -1322 -10 -995 -2651 -657 -1691
5685a691k853J392J177J70r98J168K973R48r83o72L32J06M79P69l00J668j064
$$ -1691 -4544 -3152 -1975 -1805 -2803 -1635 1338 2286 1303 631 963 1069 1548 2317 2017 3685 2621
5668B621j593k394j683J410L136p30Q9o96J021N03j87j366q15L09J46k50j716
$$ 2621 1028 -1366 -3049 -1639 1497 767 856 160 1181 1684 1497 131 -684 -375 -229 -479 -2195
5651b195n57J909K06k745L064R24j220j821K195J401N08j135J17J984K56k997
$$ -2195 -2752 -843 -637 -3382 -318 606 -614 -2435 -240 1161 1669 534 651 2635 2891 -106
5635a06M25J018q44n90q98J95k510q24J283J51Q57Q95j749m084L70M68n83R58
$$ -106 319 1337 493 -97 -995 -800 -3310 -4134 -2851 -2700 -1843 -948 -2697 -6781 -6411 -5943 -6526 -5568
5617e568R22L61O31P41k9j79J184J699N40Q88o67j354J095n19j028J52M091M23
$$ -5568 -4646 -4285 -3654 -2913 -2942 -3121 -1937 -238 302 1190 523 -831 264 -255 -1283 -1131 2960 3383
5599C383l240q84k022J283P30p58j455j641M22J181L07O69J875O41k85p62j737
$$ 3383 143 -741 -2763 -1480 -750 -1508 -2963 -4604 -4182 -3001 -2694 -2025 -150 491 206 -556 -2293
5582b293j959l23M27J444J660R78k486l25K72k079n39K798K53J13J223J231o18
$$ -2293 -4252 -4575 -4148 -2704 -1044 -66 -2552 -2877 -2605 -4684 -5223 -2425 -2172 -2059 -836 395 -223
5565b23N4j130J348r1P78O00l257q59J482J159L59j601l06M40L53j818j169J044
$$ -223 -169 -1299 49 -42 736 1336 -1921 -2780 -1298 -139 220 -1381 -1687 -1247 -894 -2712 -3881 -2837
5547b837j359j702K71N68L285J348J002r12j858n27K288j237j279q17J322j28
$$ -2837 -4196 -5898 -5627 -5059 -1774 -426 576 -336 -2194 -2721 -433 -1670 -2949 -3766 -2444 -2572
5531b572J09P11p66l007M1L452M53j342q46M76j433q99J178K59k484m333O6L399
$$ -2572 -2463 -1752 -2518 -5525 -5484 -2032 -1579 -2921 -3767 -3291 -4724 -5623 -4445 -4186 -6670 -11003 -10937 -7538
5513g538O29m10k435O61K408N85Q63q57J091J123j001j157N59Q57K232J189j28
$$ -7538 -6909 -7319 -9754 -9093 -6685 -6100 -5237 -6094 -5003 -3880 -4881 -6038 -5479 -4622 -2390 -1201 -1329
5496a329J267j87l63j447q81J497L684j73n95J262k347j286j449q91n80j048P87
$$ -1329 -62 -249 -612 -2059 -2940 -1443 2241 2068 1473 2735 388 -898 -2347 -3238 -3818 -4866 -4079
5479d079K168J136j440j000q57O55J907K727j030m345k103P25K33N79O49o8K3
$$ -4079 -1911 -775 -2215 -3215 -4072 -3417 -1510 1217 187 -4158 -6261 -5536 -5303 -4724 -4075 -4143 -4120
5462d120J512N13n28J10J334l18L4k891q57K3J742j286J600J483q66M24J036K239
$$ -4120 -2608 -2095 -2623 -2513 -1179 -1497 -1463 -4354 -5211 -5188 -3446 -4732 -3132 -1649 -2515 -2091 -1055 1184
5444A184o23j224J30J973K062k5n95L033lk501k970q78q8p4l97j557R53J498r94
$$ 1184 561 -663 -533 1440 3502 3477 2882 5915 5912 3411 441 -437 -525 -599 -996 -2553 -1600 -102 -1096
5425a096M05K440q67r59J151q49p78p13n17J010J325j925n48J241m88N44l5J128
$$ -1096 -691 1749 882 -77 1074 225 -553 -1266 -1783 -773 552 -1373 -1921 -680 -1168 -624 -659 469
5407D69Q2N32Q39K91j173k427M75L20m3q82q61P1k348j392j116J633J809p60k33
$$ 469 551 1083 1922 2213 1040 -1387 -912 -592 -635 -1517 -2378 -2307 -4655 -6047 -7163 -5530 -3721 -4481 -4714
5388d714K55L253n09R3L83j625P41K961j871M8J104j858k238J213J417j682j533
$$ -4714 -4459 -1206 -1715 -1622 -1239 -2864 -2123 838 -1033 -985 119 -1739 -3977 -2764 -1347 -3029 -4562
5371d562j218R37QJ038J004m21m8n86J91J12K55J882K669o1j098q42j023j27j984
$$ -4562 -5780 -4843 -4835 -3797 -2793 -3214 -3262 -3848 -3657 -3545 -3290 -1408 1261 1200 102 -740 -1763 -1890 -3874
5352c874J154K213j322J53K217J345M56k738k714R57K005j144n61M57J078O5l017
$$ -3874 -2720 -507 -1829 -1676 541 1886 2342 -396 -3110 -2153 -148 -1292 -1853 -1396 -318 -253 -3270
5335c270J500m47j798J582k45M11K863N54j804J349M47l89J63J448j316j342K26
$$ -3270 -1770 -2217 -4015 -2433 -2678 -2267 596 1150 -654 695 1142 753 916 2364 1048 -294 -68
5318f8K043j661L48j030J28o03j980J32J313K39J773j502k401n14J97J00J078
$$ -68 1975 314 662 -368 -240 -843 -2823 -2691 -1378 -1139 634 -868 -3269 -3783 -3586 -3486 -2408
5301b408K375K82n9J574o2j012Q03l147j75l43j939K559L020M95k580j994o46
$$ -2408 -33 249 190 1764 1702 690 1493 -1654 -1829 -2172 -4111 -1552 1468 1963 -617 -2611 -3257
5284c257R62L92j451p28J636J907J362j394k716J48K021K358n69k73K52m4k024
$$ -3257 -2295 -1903 -3354 -4082 -2446 -539 823 -571 -3287 -3139 -1118 1240 671 398 650 606 -1418
5267a418l795j121Q74J055J576R63K942J819l583j889k35q63M67p8J495M180Q00
$$ -1418 -5213 -6334 -5460 -4405 -2829 -1866 1076 2895 -688 -2577 -2812 -3675 -3208 -3286 -1791 2389 3189
5250C189l380M30J361J263j132j436j79R11p46l10k68J335oq25n34j150J559n59
$$ 3189 -191 239 1600 2863 1731 295 116 1027 281 -29 -297 1038 1032 207 -327 -1477 82 -477
5232d77J386J586l49k590j162m13N9R99q40r80J479p34N57J365J083J951j54j12
$$ -477 909 2495 2146 -444 -1606 -2019 -1960 -961 -1801 -2781 -1302 -2036 -1479 -114 969 2920 2766 2654
5214B654P5j982k643n55K415J394M76m24j911J72J287j679k440O54R84K411K76
$$ 2654 2729 747 -1896 -2451 -36 1358 1834 1410 -501 -329 958 -721 -3161 -2507 -1523 888 1164
5197A164J205O65k621j971n71J813K234j009n28j87k208l02K217J766o31j017
$$ 1164 2369 3034 413 -1558 -2129 -316 1918 909 381 194 -2014 -2316 -99 1667 1036 19
5181A9Q87k295o4J920j508k042J252J965j336j711L18j398N45J837M38l22L770
$$ 19 906 -1389 -1453 467 -1041 -3083 -1831 134 -1202 -2913 -2595 -3993 -3448 -1611 -1173 -1495 2275
5164B275r5k899q68J398j52Q59n39j037N42m08k272j837R96P22k37L22O01J245
$$ 2275 2180 -719 -1587 -189 -341 518 -21 -1058 -516 -924 -3196 -5033 -4037 -3315 -3552 -3230 -2629 -1384
5146a384p07q51j59l224o45L717K168N1J586J156k402j044J463P71K27J256Q08
$$ -1384 -2091 -2942 -3101 -6325 -6970 -3253 -1085 -1034 552 1708 -694 -1738 -275 496 723 1979 2787
5129B787m53p03j405L37j129R18l03k03K36r9O21k053m55j463j6Q87J569q71J592
$$ 2787 2334 1631 226 563 -566 352 49 -154 82 -17 604 -1449 -1904 -3367 -3383 -2496 -927 -1798 -206
5110b06J116N78O95p26K050q91k748k48R21J837J119r73j531j829J358n10J169
$$ -206 910 1488 2183 1457 3507 2616 -132 -380 541 2378 3497 2524 993 -836 522 12 1181
5093A181J35j527l279o48q7k58K197K328j449K09q2L29k471Q55J675M60j662p64
$$ 1181 1316 -211 -3490 -4138 -4225 -4483 -2286 42 -1407 -1198 -1280 -951 -3422 -2567 -892 -432 -2094 -2858
5075b858j04j067R31J265r55K655J941J70k791K91J569j775L01O27l7j474n71
$$ -2858 -2962 -4029 -3098 -1833 -2788 -133 1808 1978 -813 -522 1047 -728 -427 200 163 -1311 -1882
5058a882r49K42o5k92L10k90j836j189J653Q13j479M07J130N19l72j865J89J533
$$ -1882 -2831 -2589 -2654 -2946 -2636 -2926 -4762 -5951 -4298 -3485 -4964 -4557 -3427 -2908 -3280 -5145 -4956 -3423
5040c423J140O60o1M71P1K86J135k215j171R01K087r42j62P72o25M46r86K432
$$ -3423 -2283 -1623 -1684 -1213 -1142 -856 279 -1936 -3107 -2206 -119 -1061 -1223 -451 -1076 -630 -1616 816
5022H16j174j68K222n95K516p53L96J145k059k908K35m54r6O78J930J868J0l197
$$ 816 -358 -526 1696 1101 3617 2864 3260 4405 2346 -562 -327 -781 -877 -199 1731 3599 3609 412
5004D12j936K276K059R6j737L66m4M06j864J534J494k480k588j44R78n9j18P55
$$ 412 -1524 752 2811 2907 1170 1536 1492 1898 34 1568 3062 582 -2006 -2150 -1172 -1231 -1349 -594
4986e94o87j050J137J199N1J529j061p32n06l48J397L81J90j266j786O20L6O72
$$ -594 -1281 -2331 -1194 5 56 1585 524 -208 -714 -1062 335 716 906 -360 -2146 -1526 -1490 -818
4968h18L21J501L507j315N83j035r45k681n92J629J328j485j461K147K201l25
$$ -818 -497 1004 4511 3196 3779 2744 1799 -882 -1474 155 1483 -2 -1463 684 2885 2560
4952B560K826k624n761m233J1M124P95K018J382J66j345K95q73J014K202p40k053
$$ 2560 5386 2762 -2999 -7232 -7221 -3097 -2302 -284 1098 1264 -81 214 -659 355 2557 1817 -236
4935b36M73j48l090N57K758J621k595l169n7K097n00M41j338j392J889L37k761
$$ -236 237 89 -3001 -2444 314 1935 -660 -3829 -3886 -1789 -2289 -1848 -3186 -4578 -2689 -2352 -5113
4918e113K527J201J3q9M36k310r73J639K730K218L56K72j635q18k3k01K224K054
$$ -5113 -2586 -1385 -1372 -1461 -1025 -3335 -4308 -2669 61 2279 2635 2907 1272 454 431 230 2454 4508
4900D508K10j540k454K77Q41Q80J58J172k440l088l34L497J375j411j918k230
$$ 4508 4718 3178 724 1001 1842 2722 2880 4052 1612 -1476 -1810 1687 3062 1651 -267 -2497
4884b497k519J516j831j362J433K415o62o4m77K157K657J020J184k517k035Q06
$$ -2497 -5016 -3500 -5331 -6693 -5260 -2845 -3507 -3571 -4048 -1891 766 1786 2970 453 -1582 -776
4868g76r60k521Q79m35K217L36j510j020K937K208n46R54Q84j982j643K160L69
$$ -776 -1736 -4257 -3378 -3813 -1596 -1260 -2770 -3790 -853 1355 809 1763 2647 665 -978 1182 1551
4851A551k580l701J742K094J640M77j522j96k770L18J034J544p88k665R59L053
$$ 1551 -1029 -4730 -2988 -894 746 1223 -299 -495 -3265 -2947 -1913 -369 -1157 -3822 -2863 190
4835A90J684j127K732L59j420j229o62m94k765N85M042J125l159l576K37J503
$$ 190 1874 747 3479 3838 2418 1189 527 33 -2732 -2147 1895 3020 -139 -3715 -3478 -1975
4819a975O99M19K88N53p10O64O18m31J606j036j810o39n90q41k76N79L09J15J756
$$ -1975 -1276 -857 -569 -16 -726 -62 556 125 1731 695 -1115 -1754 -2344 -3185 -3461 -2882 -2573 -2458 -702
4800g02Q62K268J26R67k18k228o81l40j045Q35L442J732K045R07k760k349k636
$$ -702 160 2428 2554 3521 3303 1075 394 54 -991 -156 3286 5018 7063 7970 5210 2861 225
4783B25M38j281K688L188j690l033l72P92j354k159O69K349Q09N47P16k75k621
$$ 225 663 -618 2070 5258 3568 535 163 955 -399 -2558 -1889 460 1269 1816 2532 2257 -364
4766c64j331j0l43j190M54K007Q04Q59K91k582j230j76L571O62k502J147M77J604
$$ -364 -1695 -1705 -2048 -3238 -2784 -777 27 886 1177 -1405 -2635 -2811 760 1422 -1080 67 544 2148
4748B148j710j213j035J155J846Lr06j41J514L00o47l494n4J167j8K070J012j43
$$ 2148 438 -775 -1810 -655 1191 1194 288 147 1661 1961 1314 -2180 -2234 -1067 -1085 985 1997 1854
4730A854k207R69n78K52l92r15P44M36j380J454N91k601o40J604J847Q48j597
$$ 1854 -353 616 38 290 -102 -1017 -273 163 -1217 237 828 -1773 -2413 -809 1038 1886 289
4713B89K408l26k073n43R97Q74j22K304q93j158J346Q8J73J85P17k993j693m74
$$ 289 2697 2371 298 -245 752 1626 1504 3808 2915 1757 3103 3191 3364 3549 4266 1273 -420 -894
4695h94j332j649J597J939K716k07j409O38r44l70J12k20P69O12m99J35l71j269
$$ -894 -2226 -3875 -2278 -339 2377 2170 761 1399 455 85 197 -23 746 1358 859 994 623 -646
4677f46k54n96R4J299J434m06l033J49K408Q06J083j69p62J636J560k279j607
$$ -646 -900 -1496 -1402 -103 1331 925 -2108 -1959 449 1255 2338 2169 1407 3043 4603 2324 717
4660G17q56k825J34J38Q56R69j027r33L8m26m49J314J504J503j664q99J868M84
$$ 717 -139 -2964 -2830 -2692 -1836 -867 -1894 -2827 -2789 -3215 -3664 -2350 -846 657 -1007 -1906 -38 446
4642D46j474o79j35L970J520j25M81r45k855k173p88M0L75J743K022K711m26l686
$$ 446 -1028 -1707 -1842 2128 3648 3523 4004 3059 204 -1969 -2757 -2717 -2342 -599 1423 4134 3708 22
4624B2M90L34J184J92j540j295J162k139k030m76L05K154J435J741O60j833l64
$$ 22 512 846 2030 2222 682 -613 549 -1590 -3620 -4096 -3791 -1637 -202 1539 2199 366 2
4607Bk28J172K621o75k445k029jK771J291j077j498J835J129m195J030O83j047
$$ 2 -226 946 3567 2892 447 -1582 -1583 1188 2479 1402 -96 1739 2868 -1327 -297 386 -661
4590f61j803R93N57j71k200m50L86L088K448K020k785j64R3O13j979j430L914
$$ -661 -2464 -1471 -914 -1085 -3285 -3735 -3349 -261 2187 4207 1422 1258 1351 1964 -15 -1445 2469
4573B469j454n63M39J751l70j361k427j797J818O84J505Q95o8J950l80j676m34
$$ 2469 1015 452 891 2642 2272 911 -1516 -3313 -1495 -811 694 1589 1521 3471 3091 1415 981
4556I81k072J108N86q01J226R97J16j155K048J56N45m06n09Q96J807k136k108
$$ 981 -1091 17 603 -198 1028 2025 2141 986 3034 3190 3735 3329 2820 3716 5523 3387 1279
4539A279j360k078n60M74Q95j366O54j179J550K657k299K68O30O02L17o71q06
$$ 1279 -81 -2159 -2719 -2245 -1350 -2716 -2062 -3241 -1691 966 -1333 -1065 -435 167 484 -187 -993
4522i93j392L93P84L363J409J473j063N67R92r95k627L65R94N56m1M21q22p33
$$ -993 -2385 -1992 -1208 2155 3564 5037 3974 4541 5533 4538 1911 2276 3270 3826 3785 4206 3384 2651
4504B651J367j539l163J08K131M71J283P34k167n127l22J436J346J722K229O30
$$ 2651 4018 2479 -684 -576 1555 2026 3309 4043 1876 -3251 -3573 -2137 -791 931 3160 3790
4488C790p00p07J229J027j419k299q1k45J805J642R60K07j301j352k264k164N51
$$ 3790 3090 2383 3612 4639 3220 921 840 595 2400 4042 5002 5209 3908 2556 292 -1872 -1321
4471a321O86J987L59j576J586J789j607j478J009j459K76N74n88J053kO47J84
$$ -1321 -635 1352 1711 135 1721 3510 1903 425 1434 -25 251 825 237 1290 1288 1935 2119
4454B119p81m30j79P0J325K606K311k171n025k885R35J184J667J261J628n81k909
$$ 2119 1338 908 729 799 2124 4730 7041 4870 -155 -3040 -2105 -921 746 2007 3635 3054 145
4437A45J667K197r82j464k400N72J132Q00j013j274Q29m63l74j254M34N22K548
$$ 145 1812 4009 3027 1563 -837 -265 867 1667 654 -620 209 -254 -628 -1882 -1448 -926 1622
4420A622J174j431j810j536j617K055K341k680j262o03O67J114R48m93R85K00
$$ 1622 2796 1365 -445 -1981 -3598 -1543 798 -1882 -3144 -3747 -3080 -1966 -1018 -1511 -526 -326
4404c26K414K94o74JJ163L48j902J550K288j657l117J673r42k095j460K3M81K106
$$ -326 2088 2382 1708 1709 2872 3220 1318 2868 5156 3499 382 2055 1113 -982 -2442 -2419 -1938 168
4386A68j157J630N74K094n90m23k068M57r40j996j355L84J959Q63J846M19k968
$$ 168 -989 641 1215 3309 2719 2296 228 685 -255 -2251 -3606 -3222 -1263 -400 1446 1865 -1103
4369a103j620q94M21J022K9J662J978J340P73q40K5n19P85O6k828R37J640K690
$$ -1103 -2723 -3617 -3196 -2174 -2145 -483 1495 2835 3608 2768 2793 2274 3059 3125 297 1234 2874 5564
4351E564J199q05k651l890j771m52r4J963l38M03J146j366r82k708j91L229K138
$$ 5564 6763 5958 3307 -583 -2354 -2806 -2900 -937 -1275 -872 274 -1092 -2074 -4782 -4973 -1744 394
4334C94j177l41J227P4J295J56k898j5j728j029l10P3K555K29q87J673L199L947
$$ 394 -783 -1124 103 177 1472 1628 -1270 -1285 -3013 -4042 -4352 -4279 -1724 -1495 -2382 -709 2490 6437
4316F437m45m93k449k672j576P22j871M82j026J18K650J333j421N65J292j0k327
$$ 6437 5992 5499 3050 378 -1198 -476 -2347 -1865 -2891 -2773 -123 1210 -211 354 1646 1636 -691
4299f91o7J425P40K529j495n87J179J450m80k562p3L041j841l638p34M35P72N217
$$ -691 -758 667 1407 3936 2441 1854 3033 4483 4003 1441 1368 4409 2568 -1070 -1804 -1369 -597 4620
4281D620J110k851k07R96m251j987J937K043N52j957j647m25J269J057K20j68
$$ 4620 5730 2879 2672 3668 -583 -2570 -633 1410 1962 5 -1642 -2067 -798 259 479 311
4265C11j140o51J202j009m40J618o9L388L292k05j197m47k242j722j314J324K586
$$ 311 -829 -1480 -278 -1287 -1727 -109 -178 3210 6502 6297 5100 4653 2411 689 -625 699 3285
4248C285J618p85j779M29K594k38k844j204l010r08J684K698K950k65m838j073
$$ 3285 4903 4118 2339 2768 5362 5124 2280 1076 -1934 -2842 -1158 1540 4490 4225 -613 -1686
4232a686K666L92r8O92j131N57M0j80k153R92j25q75k190j412o68K693L586K378
$$ -1686 980 1372 1274 1966 835 1392 1432 1252 -901 91 -34 -909 -3099 -4511 -5179 -2486 1100 3478
4214C478L10j931j675J065l50o08J033J077J830j240m74k74m5K926k608k488K521
$$ 3478 3788 1857 182 1247 897 289 1322 2399 4229 2989 2515 2241 2196 5122 2514 26 2547
4197B547J056k91q96j756j018j896R51K052l83l804J294J8j120q1L255J300n27
$$ 2547 3603 3312 2416 660 -358 -2254 -1303 749 366 -3438 -2144 -2126 -3246 -3327 -72 1228 701
4180G01K989J999j201n77j240o89j764L72K009J028M33l854k722L306J554m50
$$ 701 3690 5689 4488 3911 2671 1982 218 590 2599 3627 4060 206 -2516 790 2344 1894
4164A894J94K23p75J655k559j050O67m75L84J107J451Q05l38q64n11L24J65J68
$$ 1894 2088 2311 1536 3191 632 -418 249 -226 158 1265 2716 3521 3183 2319 1808 2132 2297 2465
4146B465j520J20N05Q76q07j215p60l00k764J157j200O05J747R75J158j609l07
$$ 2465 945 1065 1570 2446 1639 424 -336 -636 -3400 -2243 -3443 -2838 -1091 -116 1042 -567 -874
4129h74J971O6P88o04J543R6k74j378n33M28k009J667J333M04P69n47j516K61
$$ -874 1097 1163 1951 1347 2890 2986 2712 1334 801 1229 -780 887 2220 2624 3393 2846 1330 1591
4111A591j200K282L792j342l033l406m18r7L075K440l76n53Q34j656l948j486
$$ 1591 391 2673 6465 5123 2090 -1316 -1734 -1831 1244 3684 3308 2755 3589 1933 -2015 -3501
4095c501j304J177L190K671K672l42o11o15k192m7J145j910k409N31K368n50j277
$$ -3501 -4805 -3628 -438 2233 4905 4563 3952 3337 1145 1098 2243 333 -2076 -1545 823 273 -1004
4078a004m95L734J233p5J48o07j712L3j819N59J544l16J861K333q27k402k799
$$ -1004 -1499 2235 3468 3393 3541 2934 1222 1255 -564 -5 1539 1223 3084 5417 4590 2188 -611
4061f11k43N28J384K264K573j46k904p9L91J619n60q78o06j096j627N60j694N63
$$ -611 -854 -326 1058 3322 5895 5749 2845 2766 3157 4776 4216 3338 2732 1636 9 569 -1125 -562
4043e62J458J910j320j072K76j52K58J586K2j16J292p96p47l23l713j51j368j030
$$ -562 896 2806 1486 414 690 538 796 2382 2404 2288 3580 2784 2037 1714 -1999 -2150 -3518 -4548
4025d548K422J364O92n68J089L593j153j452j229K297J546l70j972j287K922K707
$$ -4548 -2126 -762 -70 -638 451 4044 2891 1439 210 2507 4053 3683 1711 424 3346 6053
4009F053J31j876k257r96K33J070J120J721K57j538j91j149K625m21m5J973p25
$$ 6053 6184 4308 2051 1055 1288 2358 3478 5199 5456 3918 3727 2578 5203 4782 4737 6710 5985
3992E985k556J457N08q91q91n45r07j559l58l93L48K363O06k445k836j517k7J615
$$ 5985 3429 4886 5394 4503 3612 3067 2160 601 243 -150 198 2561 3167 722 -2114 -3631 -3658 -2043
3974b043n24K42K105o44j844J615J779O8j503O3N45l061P50K569L4N33k8q35j247
$$ -2043 -2567 -2325 -220 -864 -2708 -1093 686 754 -749 -686 -141 -3202 -2452 117 151 684 656 -179 -1426
3955a426j392j114J33J644L267P12k80n45J321J17j64r71k455O76J322L01K573
$$ -1426 -2818 -3932 -3799 -2155 1112 1824 1544 999 2320 2437 2273 1302 -1153 -477 845 1146 3719
3938C719J778K45n38k359l092N03R59j960L77q06N67O01m02p29j152j345L916
$$ 3719 5497 5742 5204 2845 -247 256 1215 -745 -368 -1174 -607 -6 -408 -1137 -2289 -3634 282
3921B82K502P21j63n47j37L59o54k733r51J826K289m5j040k99J3l00l76j58R76
$$ 282 2784 3505 3342 2795 2658 3017 2363 -370 -1321 505 2794 2749 1709 1410 1423 1123 747 589 1565
3902A565M40r21k902j671J040J610J678J915k711k410rj049K49l86J6J491K129
$$ 1565 2005 1084 -1818 -3489 -2449 -839 839 2754 43 -2367 -2376 -3425 -3176 -3562 -3546 -2055 74
3885G4J536J243m36j558q14K046m51j27J855n80j512L817j752l138k282Q59K845
$$ 74 1610 2853 2417 859 45 2091 1640 1513 3368 2788 1276 5093 3341 203 -2079 -1220 1625
3868A625j937j326L285l30j25M09n2j097k647j36O30K062K142J449J373j115l90
$$ 1625 -312 -1638 1647 1317 1192 1601 1549 452 -2195 -2331 -1701 361 2503 3952 5325 4210 3820
3851C820K29r89j285m15j116n18r45N91k204P56K758P73J321p59j941j328J440
$$ 3820 4049 3060 1775 1360 244 -274 -1219 -628 -2832 -2076 682 1455 2776 2017 76 -1252 188
3834A88J062j610k552L242K586K173k065j469J345M63j692j035k0j727P94O52
$$ 188 1250 -360 -2912 330 2916 5089 3024 1555 2900 3363 1671 636 616 -1111 -317 335
3818C35q41j639L859K303q97k159j412k01J04J144J161Q42J501M44j870r22M02
$$ 335 -506 -2145 1714 4017 3120 961 -451 -652 -548 596 1757 2599 4100 4544 2674 1752 2154
3801B154K137J37j827n10p36J86K34j31J08J356L41K085j250m678l86J517N59
$$ 2154 4291 4428 2601 2091 1355 1541 1775 1644 1752 3108 3449 5534 4284 -394 -780 737 1296
3784A296J272k79N53j2J495L24k213k074k655J754K984L96J401j328l90J766j027
$$ 1296 2568 2289 2842 2830 4325 4649 2436 362 -2293 -539 2445 2841 4242 2914 2524 4290 3263
3767C263j944J958J519m295J053K529K229m68j870J419L113j070j620j107k9n69
$$ 3263 1319 3277 4796 501 1554 4083 6312 5844 3974 5393 8506 7436 5816 4709 4680 4111
3751D111m13k558k19r89k18J69J53P32N43m19J837o39J197k03q76J036J09k32
$$ 4111 3698 1140 921 -68 -286 -117 36 768 1311 892 2729 2090 3287 3084 2208 3244 3353 3121
3733C121o1k235n56J036L617m05j827o82K48J356R6n65j469m37K376L87p47j889
$$ 3121 3060 825 269 1305 4922 4517 2690 2008 2256 3612 3708 3143 1674 1237 3613 4000 3253 1364
3715A364J035j104p74M72K024O69p11l712j488p18L553L561k210j38j464p93J728
$$ 1364 2399 1295 521 993 3017 3686 2975 -737 -2225 -2943 610 4171 1961 1823 359 -434 1294
3698A294J69j728j774j09M86Q68K680P06k64q8J580m0m18J748k015k294q91k96
$$ 1294 1463 -265 -2039 -2148 -1662 -794 1886 2592 2328 2240 3820 3780 3362 5110 3095 801 -90 -386
3680c86j65o8J574J905L22j361o74L25j9L512L162n60l358k180l83l20j22o36
$$ -386 -551 -619 955 2860 3182 1821 1147 1472 1453 4965 8127 7567 4209 2029 1646 1326 1204 568
3662E68k791O22J302n84j174j037m82o13K958L249K386O65m77R51M32l490O5j284
$$ 568 -2223 -1601 -299 -883 -2057 -3094 -3576 -4189 -1231 2018 4404 5069 4592 5543 5975 2485 2550 1266
3644A266m89j598N93K433k190o01k08K947K853j036J677n34j683O45k210k211
$$ 1266 777 -821 -228 2205 15 -586 -794 2153 5006 3970 5647 5113 3430 4075 1865 -346
3628c46J562L555O51q78J003O8k107L16J114l348k831Q42q0J817J710j178j468
$$ -346 1216 4771 5422 4544 5547 5615 3508 3824 4938 1590 -1241 -399 -479 1338 3048 1870 402
3611D02j072R4O84K311k201m01n30j737J623K039p83N32O83l53K00J76n01J947
$$ 402 -670 -576 108 2419 218 -183 -713 -2450 -827 1212 429 961 1644 1291 1491 1667 1166 3113
3593C113k4k338m07Q22O32J316P41l526k376J882J492P85q03p25j490J573R11
$$ 3113 3089 751 344 1166 1798 3114 3855 329 -2047 -165 1327 2112 1309 584 -906 667 1578
3576A578k384o34K025K226R61m808p87J158L109J89n86M26N72J357l00k865j1
$$ 1578 -806 -1440 585 2811 3772 -1036 -1823 -665 2444 2633 2047 2473 3045 4402 4102 1237 1226
3559A226J538O19j787j602K468j79j374J453j441j420q6J730J32l07o23j17q74
$$ 1226 2764 3383 1596 -6 2462 2283 909 2362 921 -499 -585 1145 1277 970 347 230 -644
3542f44q16l14n6K43J646j812K218K798J324j238k048q80J757j334q74J546J216
$$ -644 -1460 -1774 -1830 -1587 59 -1753 465 3263 4587 3349 1301 421 2178 844 -30 1516 2732
3525B732m70J492P73P94j462j590N96J087K237n01R71j097k826k104J697L65r46
$$ 2732 2262 3754 4527 5321 3859 2269 2865 3952 6189 5688 6659 5562 2736 632 2329 2694 1748
3508A748J576L05J131j823k417j420q48P10j418k52J994k068J449K113k637k377
$$ 1748 3324 3629 4760 2937 520 -900 -1748 -1038 -2456 -2708 -714 -2782 -1333 780 -1857 -4234
3492d234J680R15q99K359K096l08L49J093l4l617J141j165M30p27K37J657K268
$$ -4234 -2554 -1639 -2538 -179 1917 1609 1958 3051 3017 -600 541 -624 -194 -921 -684 973 3241
3475C241k702j192J729j318R81j595k004R80L237M00p16j503j015J677K084j433
$$ 3241 539 -653 1076 -242 739 -856 -2860 -1880 1357 1757 1041 -462 -1477 200 2284 851
3459H51n25K22m98J035K559m36p23k66j54M57M40j338L73M46J7J632K92j510p44
$$ 851 326 548 50 1085 3644 3208 2485 2219 2065 2522 2962 1624 1997 2443 2460 4092 4384 2874 2130
3440B130k871J36n5L97M72L74n20K647K300P7l242m86l44O87j404j543J889n21
$$ 2130 -741 -605 -660 -263 209 583 63 2710 5010 5087 1845 1359 1015 1702 298 -1245 644 123
3422A23j175q36O32J870L53o63L79J770r36J8N37l74O86Q48j631N08J296J18j76
$$ 123 -1052 -1888 -1256 614 967 304 683 2453 1517 1535 2072 1698 2384 3232 1601 2109 3405 3523 3347
3403C347k180j255R3j079n90K084j11j37r42J045J680n75k80J280R32p33J59K240
$$ 3347 1167 -88 5 -1074 -1664 420 309 172 -770 275 1955 1380 1100 2380 3312 2579 2738 4978
3385D978j152j180k90L10K51p88J256n20k333k52q81n21j031O36Q67K686J100
$$ 4978 3826 2646 2356 2666 2917 2129 3385 2865 532 280 -601 -1122 -2153 -1517 -650 2036 3136
3368C136L96o19J176P63j311O19l98J045J764l74j299l231j438J477k305J18K225
$$ 3136 3532 2913 4089 4852 3541 4160 3762 4807 6571 6197 4898 1667 229 1706 -599 -481 1744
3351A744L927j697j132k807J219L306J674J198p73n081l642p2L449L001j615q66
$$ 1744 5671 3974 2842 35 1254 4560 6234 7432 6659 1578 -2064 -2136 1313 4314 2699 1833
3335A833j51J397J939o88k130k029RJ947K86n17k133j857j588j327Q40J077j065
$$ 1833 1682 3079 5018 4330 2200 171 180 2127 2413 1896 -237 -2094 -3682 -5009 -4169 -3092 -4157
3318d157j78J682J527J687J257q03J684k481j808j701M49O91j373R94J639K239
$$ -4157 -4335 -2653 -1126 561 1818 1015 2699 218 -1590 -3291 -2842 -2151 -3524 -2530 -891 1348
3302A348j031r73L94J503N17Q79j588k58J802q52j681K84K33N55k394q49M30K300
$$ 1348 317 -656 -262 1241 1758 2637 1049 791 2593 1741 60 344 577 1132 -1262 -2111 -1681 619
3284F19L578J614j739M85j53j881q43O38n06O03n03j758k551K083J225k373j057
$$ 619 4197 5811 4072 4557 4404 2523 1680 2318 1812 2415 1912 154 -2397 -314 911 -1462 -2519
3267b519j243K109J22k122K735L464j9k259k112n14j002J257m50K448L729O33
$$ -2519 -3762 -1653 -1531 -3653 -918 2546 2527 268 -1844 -2358 -3360 -2103 -2553 -105 3624 4257
3251D257J641k314k483m3K2j790k440K65J061K434K26R62J731K189R0k43j034
$$ 4257 5898 3584 1101 1058 1080 -710 -3150 -2885 -1824 610 836 1798 3529 5718 5808 5565 4531
3234D531l397K028J840j894m041J493J019k93q7j373m81O21K826N99l998k347
$$ 4531 1134 3162 5002 3108 -933 560 1579 1286 1199 -174 -655 -34 2792 3391 -607 -2954
3218b954j551J721M803M674N423N639j136o602o242l697k151O65K088P97j349
$$ -2954 -4505 -2784 2019 6693 12116 17755 16619 10017 3775 78 -2073 -1408 680 1477 128
3203A28k491L582P23l64L674p72j536j908l135P16o47j211K489m01r32Q41o75
$$ 128 -2363 1219 1942 1578 5252 4480 2944 1036 -2099 -1383 -2030 -3241 -752 -1153 -2085 -1244 -1919
3186a919N90P09R66p83J798L027j421j76j365l104k366M96k67K018K628M867K286
$$ -1919 -1329 -620 346 -437 1361 4388 2967 2791 1426 -1678 -4044 -3548 -3815 -1797 831 5698 7984
3169G984q87l260j906j429o25Q27L6n70k284M24N410N506N557N639j617p610p910
$$ 7984 7097 3837 1931 502 -123 704 740 170 -2114 -1690 3720 9226 14783 20422 18805 11195 3285
3152C285k967j606jK257K094M25j403o9j144P1j224R95J8R28K81P95J215J11P09
$$ 3285 318 -1288 -1289 968 3062 3487 2084 2015 871 942 -282 713 731 1659 1940 2735 3950 4061 4770
3133D770J054J101k35k868p30n66m144k454j25K848L978j403j949j111K030J884
$$ 4770 5824 6925 6690 3822 3092 2526 -1618 -4072 -4197 -1349 2629 1226 -723 -1834 196 2080
3117B080n27j55O80K499p86J546k296j363J090p30j581R99l50Q46q92j054j14
$$ 2080 1553 1398 2078 4577 3791 5337 3041 1678 2768 2038 457 1456 1106 1952 1060 6 -108
3100a08j320J016J013n38j359j004Q68L71N68j20n37J139K651L915P69m307m392
$$ -108 -1428 -412 601 63 -1296 -2300 -1432 -1061 -493 -613 -1150 -11 2640 6555 7324 3017 -1375
3083a375J445K176j659j294O22r77k141n73K232K293R58O58K22m15r90J262P15
$$ -1375 70 2246 587 -707 -85 -1062 -3203 -3776 -1544 749 1707 2365 2587 2172 1182 2444 3159
3066C159j375n76O76R44L44k404k548K261p28k468p54K642K46j278L1J938N58
$$ 3159 1784 1208 1884 2828 3172 768 -1780 481 -247 -2715 -3469 -827 -581 -1859 -1828 110 668
3049F68M131J195j407l164j375k856Q16J849l26J624J729K86l319k813K55L218
$$ 668 4799 5994 4587 1423 48 -2808 -1992 -143 -469 1155 2884 3170 -149 -2962 -2707 511
3033E11L218k76k641L92k79r55M29L76j611K061L142j037j570j929j499J186J928
$$ 511 3729 3453 812 1204 925 -30 399 775 -836 1225 4367 3330 1760 -169 -1668 -482 1446
3016A446K30Q00k388q83L364O90p89j272q78N71L78N66J008O24J346r90o85O90
$$ 1446 1676 2476 88 -795 2569 3259 2470 1198 320 891 1269 1835 2843 3467 4813 3823 3138 3828
2998C828L088k071p94O19k749j790j76P47J866j24j56N43K31q8J252o79j568k258
$$ 3828 6916 4845 4051 4670 1921 131 -45 702 2568 2444 2288 2831 3062 2974 4226 3547 1979 -279
2980b79k113J624P79N88k70jQ46j008r79N18K938P65j206p50K523K079j111m59
$$ -279 -2392 -768 11 599 329 328 1174 166 -813 -295 2643 3408 2202 1452 3975 6054 4943 4484
2962D484r0J807n76k066n18j98k852q81J557P32j223j468J630J406R22R0m93n7
$$ 4484 4394 6201 5625 3559 3041 2843 -9 -890 667 1399 176 -1292 338 1744 2666 2756 2263 2206
2944B206k29J5M13q57j292O8j569N00J050l99n14J403j649p21R71J464J866L475
$$ 2206 1977 1992 2405 1548 256 324 -1245 -745 305 -94 -608 795 -854 -1575 -604 860 2726 6201
2926F201j605l877q05K469K867J358j048k492K3o89k072j038K922J197r90M64
$$ 6201 4596 719 -86 2383 5250 6608 5560 3068 3091 2402 330 -708 2214 3411 2421 2885
2910B885J05M13J500l209l85p6r76J176n85j064j935R88J443P57J442o99q50Q17
$$ 2885 2990 3403 4903 1694 1309 1233 257 1433 848 -216 -2151 -1163 280 1037 2479 1780 930 1747
2892A747J276n11k26K363P44j110l848j219L333K465k450k852k114O41K672K417
$$ 1747 3023 2512 2286 4649 5393 4283 435 -784 2549 5014 2564 -288 -2402 -1761 911 3328
2876C328j651m154k406R17K393L063J971p13k810j399j118J425K525L378P75j653
$$ 3328 1677 -2477 -4883 -3966 -1573 1490 3461 2748 -62 -1461 -2579 -1154 1371 4749 5524 3871
$$ [...]
##END NTUPLES=NMR SPECTRUM
##END=
