##TITLE=Analysis number 319569
Compound Code cc 51513
Book Reference 486/8
Project Code adrs
Chemist Name simons
##JCAMPDX= 6.0         $$ Bruker NMR JCAMP-DX V2.0
##DATA TYPE= NMR SPECTRUM
##DATA CLASS= NTUPLES
##ORIGIN= Bruker BioSpin GmbH
##OWNER= nmr
$$ XWIN-NMR		Version 3.5
$$ Fri May 19 09:08:35 2006 GMT Daylight Time (UT+1h)  MAYBRIDGE\nmr@NMR_250MHZ
##.OBSERVE FREQUENCY= 250.131544655141
##.OBSERVE NUCLEUS= ^1H
##.ACQUISITION MODE= SIMULTANEOUS (DQD)
##.ACQUISITION SCHEME= undefined
##.AVERAGES= 16
##.DIGITISER RES= 18
##SPECTROMETER/DATA SYSTEM= dpx250
##.PULSE SEQUENCE= zg30
##.SOLVENT NAME= CDCl3
##.SHIFT REFERENCE= (INTERNAL, CDCl3, 0, 16.522)
##AUDIT TRAIL= $$ (NUMBER, WHEN, WHO, WHERE, WHAT)
$$ ##TITLE= Audit trail, XWIN-NMR		Version 3.5
$$ ##JCAMPDX= 5.01
$$ ##ORIGIN= Bruker BioSpin GmbH
$$ ##OWNER= nmr
$$ C:\u/data/dgb/nmr/ADRS/4710/pdata/1/auditp.txt
$$ ##AUDIT TRAIL=  $$ (NUMBER, WHEN, WHO, WHERE, WHAT)
(   1,<2006-05-19 09:08:12.17 +100>,<MAYBRIDGE\nmr>,<NMR_250MHZ>,
      <created by zg, POWCHK disabled, PULCHK disabled
       configuration hash MD5:
       84 BC 41 DB A1 6E 1D 46 DA 25 12 A5 C1 ED C5 3A
       data hash MD5: 64K
       B5 74 9D E9 44 1F 06 F1 59 9A 44 22 08 CC 88 E0>)
(   2,<2006-05-19 09:08:26.05 +100>,<MAYBRIDGE\nmr>,<NMR_250MHZ>,
      <Start of raw data processing
       ef LB = 0.3 FT_mod = 6 PKNL = 1 SI = 32K 
       data hash MD5: 32K
       4F A8 CE F4 E4 91 1E 9F 14 7B 5C 0E 57 D5 E1 0E>)
(   3,<2006-05-19 09:08:27.94 +100>,<MAYBRIDGE\nmr>,<NMR_250MHZ>,
      <apk 
       data hash MD5: 32K
       A8 29 F7 A4 DA D0 57 BB 5D 06 AB 14 20 A9 CF 60>)
(   4,<2006-05-19 09:08:28.75 +100>,<MAYBRIDGE\nmr>,<NMR_250MHZ>,
      <abs ABSG = 5 
       data hash MD5: 32K
       B5 F1 A6 D5 85 71 2A E0 11 F1 62 53 28 53 27 74>)
$$ ##END=
$$ 
$$ hash MD5
$$ E5 0E 9A D0 AA A1 CC 4B 3C FA EB B0 F1 2A 0F DA
##$RELAX= 
##$RELAX= 
##$RELAX= 
##$RELAX= 
##$RELAX= 
##$RELAX= 
##$RELAX= 
$$ Bruker specific parameters
$$ --------------------------
##$DU= <C:\u>
##$EXPNO= 4710
##$NAME= <ADRS>
##$PROCNO= 1
##$TYPE= <nmr>
##$USER= <dgb>
##$AMP= (0..31)
100 100 100 100 100 100 100 100 100 100 100 100 100 100 100 100 100 100 
100 100 100 100 100 100 100 100 100 100 100 100 100 100 
##$AQSEQ= 0
##$AQ_mod= 3
##$AUNM= <au_zg>
##$AUTOPOS= <3 >
##$BF1= 250.13
##$BF2= 250.13
##$BF3= 250.13
##$BF4= 250.13
##$BF5= 500.13
##$BF6= 500.13
##$BF7= 500.13
##$BF8= 500.13
##$BYTORDA= 1
##$CFDGTYP= 0
##$CFRGTYP= 5
##$CHEMSTR= <none>
##$CNST= (0..31)
1 1 145 1 1 1 1 1 1 1 1 1 1 1 1 1 1 1 1 1 1 1 1 1 1 1 1 1 1 1 1 1 
##$CPDPRG= <>
##$CPDPRG1= <>
##$CPDPRG2= <>
##$CPDPRG3= <>
##$CPDPRG4= <mlev>
##$CPDPRG5= <mlev>
##$CPDPRG6= <mlev>
##$CPDPRG7= <mlev>
##$CPDPRG8= <mlev>
##$CPDPRGB= <>
##$CPDPRGT= <>
##$D= (0..31)
0 1 0 0 0 0 0 0 0 0.06 0 0 0 0 0 0 0.0002 0 0 0 0 0 0 0 0 0 0 0 0 0 0 
0 
##$DATE= 1148026090
##$DBL= (0..7)
120 120 120 120 120 120 120 120 
##$DBP= (0..7)
150 150 150 150 150 150 150 150 
##$DBP07= 0
##$DBPNAM0= <>
##$DBPNAM1= <>
$$ [...]
##$SUBNAM7= <"">
##$SUBNAM8= <"">
##$SUBNAM9= <"">
##$SW= 20.6930455092707
##$SWIBOX= (0..15)
0 0 3 0 0 0 0 0 0 0 0 0 0 0 0 0 
##$SW_h= 5175.983436853
##$TD= 65536
##$TD0= 1
##$TE= 295.16
##$TE2= 300
##$TE3= 300
##$TEG= 300
##$TL= (0..7)
0 120 120 120 120 120 120 120 
##$TP= (0..7)
150 150 150 150 150 150 150 150 
##$TP07= 0
##$TPNAME0= <>
##$TPNAME1= <>
##$TPNAME2= <>
##$TPNAME3= <>
##$TPNAME4= <>
##$TPNAME5= <>
##$TPNAME6= <>
##$TPNAME7= <>
##$TPOAL= (0..7)
0.5 0.5 0.5 0.5 0.5 0.5 0.5 0.5 
##$TPOFFS= (0..7)
0 0 0 0 0 0 0 0 
##$TUNHIN= 0
##$TUNHOUT= 0
##$TUNXOUT= 0
##$USERA1= <user>
##$USERA2= <user>
##$USERA3= <user>
##$USERA4= <user>
##$USERA5= <user>
##$V9= 5
##$VALIST= <valist>
##$VCLIST= <CCCCCCCCCCCCCCC>
##$VD= 0
##$VDLIST= <DDDDDDDDDDDDDDD>
##$VPLIST= <PPPPPPPPPPPPPPP>
##$VTLIST= <TTTTTTTTTTTTTTT>
##$WBST= 1024
##$WBSW= 4
##$XGAIN= (0..3)
0 0 0 0 
##$XL= 0
##$YL= 0
##$YMAX_a= 490395
##$YMIN_a= -327135
##$ZGOPTNS= <>
##$ZL1= 120
##$ZL2= 120
##$ZL3= 120
##$ZL4= 120
##$ABSF1= 16.522
##$ABSF2= -4.171173
##$ABSG= 5
##$ABSL= 3
##$ALPHA= 0
##$AQORDER= 0
##$ASSFAC= 0
##$ASSFACI= 0
##$ASSFACX= 0
##$ASSWID= 0
##$AUNMP= <proc_1d>
##$AZFE= 0.1
##$AZFW= 0.1
##$BCFW= 0
##$BC_mod= 0
##$BYTORDP= 0
##$COROFFS= 0
##$CY= 12.5
##$DATMOD= 1
##$DC= 0
##$DFILT= <>
##$DTYPP= 0
##$F1P= 14.0000005364418
##$F2P= -0.99999901652339
##$FCOR= 0.5
##$FTSIZE= 32768
##$FT_mod= 6
##$GAMMA= 0
##$GB= 0
##$INTBC= 1
##$INTSCL= 1
##$ISEN= 128
##$LB= 0.3
##$LEV0= 0
##$LPBIN= 0
##$MAXI= 10000
##$MC2= 0
##$MEAN= 0
##$ME_mod= 0
##$MI= 0
##$NCOEF= 0
##$NC_proc= -3
##$NLEV= 6
##$NOISF1= 0
##$NOISF2= 0
##$NSP= 0
##$NTH_PI= 0
##$NZP= 0
##$OFFSET= 16.522
##$PC= 1
##$PHC0= 15.21098
##$PHC1= 6.891874
##$PH_mod= 1
##$PKNL= yes
##$PPARMOD= 0
##$PSCAL= 4
##$PSIGN= 0
##$REVERSE= no
##$SF= 250.13
##$SI= 32768
##$SIGF1= 0
##$SIGF2= 0
##$SINO= 400
##$SIOLD= 32768
##$SREGLST= <1H.CDCl3>
##$SSB= 0
##$STSI= 32768
##$STSR= 0
##$SW_p= 5175.98343685301
##$SYMM= 0
##$S_DEV= 0
##$TDeff= 65536
##$TDoff= 0
##$TI= <Analysis number 999999
Compound Code 99
Book Reference 9
Project Code 9>
##$TILT= no
##$TM1= 0
##$TM2= 0
##$TOPLEV= 0
##$USERP1= <user>
##$USERP2= <user>
##$USERP3= <user>
##$USERP4= <user>
##$USERP5= <user>
##$WDW= 1
##$XDIM= 32768
##$YMAX_p= 381341273
##$YMIN_p= -28267
$$ End of Bruker specific parameters
$$ ---------------------------------
##NTUPLES= NMR SPECTRUM
##VAR_NAME=  FREQUENCY,     SPECTRUM/REAL,   SPECTRUM/IMAG
##SYMBOL=    X,             R,               I
##VAR_TYPE=  INDEPENDENT,   DEPENDENT,       DEPENDENT
##VAR_FORM=  AFFN,          ASDF,            ASDF
##VAR_DIM=   32768,         32768,           32768
##UNITS=     HZ,            ARBITRARY UNITS, ARBITRARY UNITS
##FACTOR=    0.157963299565203, 1,           1
##FIRST=     4132.6476996994, 0,             0
##LAST=      -1043.33573715361, 0,           0
##MIN=       -1043.33573715361, -28267,      0
##MAX=       4132.6476996994, 381341273,     0
$$ Real data points
##PAGE= N=1
##DATA TABLE= (X++(R..R)), XYDATA
$$ [...]
##PAGE= N=2
##DATA TABLE= (X++(I..I)), XYDATA
15191F76843K963j1837l066L088m633l55J505J579P791R473O74k482j45K316k856
15176F80858J655M214J421N274J991n655n354J427M670L877L063k021j670j710
15162F92040l03p127o49M13m39r54K821K478Q042L971j934M492L001j653N330
15147G09529l397m475m746O28M991k229K784o91q17l04k58J944K143K888K276
15132G10266o737K4j622l152J8K709N014K111R988P583K344l648k473M549k439
15117G24535q494r79m432j751R715J1623M621J617Kk061n716l920l59n24K57Q031
15101G32165P46j286j064o442J747L384R51J035j85j658O36p283K712M174L914
15086G33546K879J750o22M11L329L63J941L776K953q52m110M182Q79m857m49Q077
$$ plain form
15191 676843 679806 667969 664903 667991 663358 663003 664508 666087 673878 683351 684025 681543 681398 683714 680858
15176 680858 682513 686727 688148 693422 695413 689758 684404 685831 690501 694378 697441 695420 693750 692040
15162 692040 691737 684610 683961 684374 683935 682981 685802 688280 696322 700293 698359 702851 705852 704199 709529
15147 709529 706132 701657 696911 697539 702530 700301 703085 702394 701577 701273 701015 702959 705102 707990 710266
15132 710266 703529 703553 701931 698779 698797 701506 706520 708631 718619 726202 728546 724898 722425 726974 724535
15117 724535 716041 715062 710630 708879 718594 730217 734838 736455 736457 734396 728680 724760 724401 723877 724134 732165
15101 732165 732911 731625 730561 724119 725866 729250 730201 731236 731051 729393 730029 722746 725458 729632 733546
15086 733546 736425 738175 737553 737964 741293 741656 743597 747373 750326 749474 745364 749546 750425 745568 745119 753196
15070G53196k046j245J619p23M091Q224N267k773n141o347m626M782j990n016
15056G47272n957K755M938R56j992K21n319l071J2358N170M136L298p196R140
15042G66709P770o269p027M269M880L325J108k415l837j05P883K446l603j938
15028G73196O020p85o431k546m20L175J020J919k031J943L606k700J435Q18Q475
15013G86694K999M36l883m149p743L8O397M913k074m839K350J704Q743P518R19
14998H00023m920j085k324j1251L173M28N393j441J108O630L375l087O83Q90K344
14983G99939m104j1029L34N316L40J178N948j909k329l013K039m67M175K488Q335
14968H07241L694l558J544J459N213K252P52J0735k818m202j105j821l130Q17
$$ plain form
15070 753196 751150 749905 751524 750801 754892 763116 768383 765610 760469 754122 749496 754278 752288 747272
15056 747272 741315 744070 749008 749964 747972 748193 742874 739803 752161 757331 761467 764765 757569 766709
15042 766709 774479 768210 761183 765452 770332 773657 774765 772350 768513 768408 776291 778737 775134 773196
15028 773196 779216 778431 772000 769454 769034 772209 773229 775148 773117 775060 778666 775966 777401 778219 786694
15013 786694 789693 790129 786246 782097 774354 774392 780789 785702 783628 778789 781139 782843 791586 799104 800023
14998 800023 795103 794018 791694 780443 783616 784044 789437 787996 789104 795734 799109 796022 796705 797595 799939
14983 799939 795835 784806 785140 790456 790796 791974 797922 796013 793684 790671 792710 792243 796418 798906 807241
14968 807241 810935 807377 808921 810380 815593 817845 818597 829332 826514 822312 821207 819386 816256 817073
14954H17073j422l789M763M922N79P071N937n080r816l65J038j616M972N916K628
14939H32811J24j001L892l792k233J238jj947k230L658N939n951o897J0955K625
14924H37190K452k970j027Q255Q178K899m51K81l083l58m444l438j897N540K318
14909H49445L546P575Q653j885j3594j1253N868Q714K580l274p005Q18J0313M927
14895H65428j979o754M300J902L086K118J048p71q604j233M007M019N855j132
14881H71290m626j91M467N072L412k330m849m104L43O30o29n420l404K572O014
14866H68247j282R779R800l137K126r8j378n022j818J259Q118Q757k718k56P82
14851H93159n868L931r78m460M043K286j960j181J535j23k926K21J0421M894n538
$$ plain form
14954 817073 815651 811862 816625 821547 822126 829197 835134 830054 820238 819873 820911 819295 824267 830183 832811
14939 832811 832935 831934 835826 832034 829801 831039 831038 829091 826861 830519 836458 830507 823610 834565 837190
14924 837190 839642 836672 835645 843900 852078 854977 854526 854807 851724 851366 846922 843484 841587 847127 849445
14909 849445 852991 860566 869219 867334 853740 842487 848355 857069 859649 856375 849370 850188 860501 865428
14895 865428 863449 856695 860995 862897 865983 868101 869149 868378 859774 858541 862548 866567 872422 871290
14881 871290 866664 866473 870940 876012 879424 877094 872245 868141 868484 869114 868485 863065 859661 862233 868247
14866 868247 866965 876744 886544 883407 885533 885435 884057 879035 877217 878476 886594 895351 892633 892377 893159
14851 893159 887291 891222 890244 885784 889827 892113 890153 888972 890507 890384 887458 887679 898100 902994 897456
14836H97456j090M491M434L821j892j1442j867O004J213M586L074q29n416j560
14822I00983N168J0961N507j819O399M096j092k872k307k993j108K962L98P852
14808I32135O187l981o709k780K421m47K867K19J238R332Q064k218N08M50n081
14793I42205K889O636L532N150M948l488n267j652K753N342J773N702Q908R726
14779I89157q36l204j588p043M994M711m470r30R431Q956K205j25N028N921R162
14764A021369L693K421L471K189O171J0754N895q0K767R843J0249P995J4634R995
14750A111366R130Q385j041k329j3872k4445k1735l1182m4433l2350l1599l1341
14738H94554k8236k5077k1021j7137m270m87j745j232M529J1666J1234J155j598
$$ plain form
14836 897456 896366 900857 905291 909112 907220 895778 893911 899915 901128 905714 908788 907959 902543 900983
14822 900983 906151 917112 922619 920800 927199 931295 930203 927331 925024 922031 920923 923885 924283 932135
14808 932135 938322 934341 927632 924852 927273 926826 929693 929912 931150 940482 948546 946328 946836 947286 942205
14793 942205 945094 951730 955262 960412 965360 961872 956605 954953 957706 963048 964821 970523 979431 989157
14779 989157 988321 985117 983529 976486 981480 986191 981721 980791 990222 999178 1001383 1001258 1006286 1012207 1021369
14764 1021369 1025062 1027483 1030954 1033143 1039314 1050068 1055963 1055883 1058650 1068493 1078742 1086737 1101371 1111366
14750 1111366 1120496 1128881 1127840 1125511 1111639 1087194 1065459 1034277 989844 957494 925895 894554
14738 894554 866318 841241 820220 803083 798813 798326 796581 795349 799878 811544 822778 823933 822335
14725H22335M435P338M517K210J964P584R508j527k630L116J1410N381J235J0118
14711H86994L971j828p68N548J0233R079R60k403j771j767J072Q530L033K761
14697I23644k04l706p693m445M300K353l620l531L884k063k103O323N648Q637
14683I27424o64k051l446k884o51O974n02q03k409R28Q685N079l391K50N250p4
14667I37715l98L383M87p50m799N6Q251M299M117N214K85n380M568Q204K335n918
14651I61669n741N439J1877K370o724L845j613p757K150P748K249r849j920O926
14637I70669k378J957R312P227o009N58M17q95J446O827k079J288L419q25k960
14622I87974o829K680O603j837m103N194j091l850M93M687K007O789K602K943
$$ plain form
14725 822335 826770 834108 838625 840835 842799 850383 859891 858364 855734 858850 870260 875641 876876 886994
14711 886994 890965 889137 888369 893917 904150 913229 914189 911786 910015 908248 909320 917850 920883 923644
14697 923644 923440 919734 912041 907596 911896 914249 910629 907098 910982 908919 906816 913139 918787 927424
14683 927424 926760 924709 921263 918379 917728 924702 924200 923397 920988 921916 930601 935680 932289 932539 937789 937715
14667 937715 937317 940700 941187 940437 935638 935694 943945 948244 952361 957575 957860 952480 957048 965252 967587 961669
14651 961669 955928 961367 973244 975614 968890 972735 971122 963365 965515 973263 975512 965663 963743 970669
14637 970669 968291 970248 979560 986787 980778 981336 981753 980858 982304 989131 987052 988340 991759 990934 987974
14622 987974 981145 983825 990428 988591 984488 989682 988591 984741 985234 989921 991928 998717 1001319 1004262
14608A004262p855k416N629K658K397j736j2057J892Q461J222m139R64N515O994
14594A011791O167j361q125N561J743J855k360o569p73N860n61M430M265m014
14580A017909M459l424j742L672L030J075O430j974l637J0647O45Q18K391n121
14566A035178J961R973k116p417l876K874J572L16M674K79j719L676N117l737
14552A046755o284r1j570L76O846R745k488M907k404m416j772J0293M446j0464
14538A053879k538K358Q758R861k746n960l540j0286N77O898N214L009K557P559
14524A075600M387l032l610l945M000M260o101M048L746j429L03L202m68o868
14510A074093n18P63K805O457l31n984j48K147k185K212L086K573J368j269J968
$$ plain form
14608 1004262 996407 993991 999620 1002278 1004675 1002939 990882 992774 1001235 1002457 998318 999282 1004797 1011791
14594 1011791 1017958 1016597 1008472 1014033 1015776 1017631 1015271 1008702 1007929 1013789 1013228 1017658 1021923 1017909
14580 1017909 1022368 1018944 1017202 1020874 1023904 1024979 1031409 1029435 1025798 1036445 1037090 1037908 1040299 1035178
14566 1035178 1037139 1047112 1044996 1037579 1033703 1036577 1038149 1038465 1043139 1043418 1041699 1045375 1050492 1046755
14552 1046755 1040471 1040380 1038810 1039186 1046032 1055777 1053289 1058196 1055792 1051376 1049604 1059897 1064343 1053879
14538 1053879 1051341 1053699 1062457 1072318 1069572 1063612 1060072 1049786 1050363 1057261 1062475 1065484 1068041 1075600
14524 1075600 1079987 1076955 1073345 1069400 1073400 1077660 1071559 1075607 1079353 1077924 1078227 1081429 1080961 1074093
14510 1074093 1073575 1074338 1077143 1083600 1083269 1077285 1077137 1079284 1077099 1079311 1082397 1084970 1086338 1085069 1087037
14495A087037l81M997K142N847P124k396p803n685O415P630m476M850K511k629
14481A105183K258j5j473R80K704O806l738m811j765R764K503J833P452J85l694
14466A124172L39J793q310j792k525j514O221J95L041K352k672n650L849J1856
14452A131355N920k342k377p745q385K539K490j65M009L930Q79R368O872l548
14438A142800j522l176o129M989L01K079K160j236K815J520L451L312M258N767
14424A161389j588q887n43J0467L006l416j597k929m01J137J232L007L763m143
14410A160497J132J376J684j415m98M841k361o625j78L445Q585O033m618K142
14396A174040L359k853j759n604J950K546N115O39M902J430n308k046K088O519
$$ plain form
14495 1087037 1086656 1091653 1093795 1099642 1106766 1104370 1096567 1090882 1097297 1104927 1100451 1105301 1107812 1105183
14481 1105183 1107441 1107426 1105953 1106933 1109637 1116443 1112705 1107894 1106129 1115893 1118396 1120229 1127681 1127866 1124172
14466 1124172 1124511 1126304 1117994 1116202 1113677 1112163 1118384 1118579 1121620 1123972 1121300 1115650 1119499 1131355
14452 1131355 1137275 1134933 1132556 1124811 1116426 1118965 1121455 1121290 1125299 1129229 1130108 1139476 1146348 1142800
14438 1142800 1141278 1138102 1131973 1136962 1137263 1139342 1141502 1140266 1143081 1144601 1148052 1151364 1155622 1161389
14424 1161389 1159801 1150914 1150371 1160838 1163844 1160428 1158831 1155902 1155501 1156638 1157870 1160877 1164640 1160497
14410 1160497 1161629 1163005 1164689 1163274 1162776 1167617 1165256 1158631 1158453 1161898 1170483 1176516 1171898 1174040
14396 1174040 1177399 1174546 1172787 1167183 1169133 1171679 1176794 1177433 1182335 1183765 1178457 1176411 1178499 1185018
14382A185018m89M702m936k951r78k709J0978Q142O47l88l790J212j640l098L219
14367A192939Q452J834J058Q01r183n193Q093M077j148J108N794M780j873m41
14353A211098J03k18J153N568j034o913n326P435P225j968n30L598k53k101n573
14338A212264K151L387L159p57K188M498l393O12J886k105m761K744P850K12m165
14323A225770O155M805j354L832j061k335R209L343k289M68N385m847j134N202
14309A251149N575l487k60k242n020P798Q794K895j044R75l14j647l178k650L126
14294A260470M878L135J817J421J289m61l355k100j875J194O935N836m168j473
14280A273543O744M927n055n348l837P578M896M458J44K06m550K551K163M716
$$ plain form
14382 1185018 1184529 1189231 1184295 1181344 1180366 1177657 1188635 1196777 1197424 1197036 1193246 1194458 1192818 1189720 1192939
14367 1192939 1201391 1203225 1204283 1205084 1195901 1190708 1198801 1202878 1201730 1202838 1208632 1213412 1211539 1211098
14353 1211098 1211201 1210983 1212136 1217704 1216670 1209757 1204431 1211866 1219091 1217123 1216593 1220191 1219938 1217837 1212264
14338 1212264 1214415 1217802 1220961 1220204 1222392 1226890 1223497 1224109 1225995 1223890 1219129 1221873 1229723 1229935 1225770
14323 1225770 1231925 1236730 1235376 1239208 1238147 1235812 1245021 1248364 1246075 1246543 1251928 1247081 1245947 1251149
14309 1251149 1256724 1253237 1252977 1250735 1245715 1253513 1262307 1265202 1264158 1265133 1264819 1263172 1259994 1257344 1260470
14294 1260470 1265348 1268483 1270300 1271721 1273010 1272549 1269194 1267094 1265219 1266413 1273348 1279184 1275016 1273543
14280 1273543 1280287 1285214 1280159 1274811 1270974 1278552 1283448 1287906 1288050 1288256 1283706 1286257 1288420 1293136
14266A293136N794m57k397K622K643L065M12K418M289J725n700p333l547k36m468
14251A291966L427N944J645M23N165l489k974O624J507R54O77o730L523L564Q274
14236A320500O029j704k22m155j490L860M981M04K133m002j524P265M580o097
14222A330558k755N380O198K553n877r669J331J3027N747n596l263K757M434k135
14208A342690Q19j89L382K963N848J67k061k752j099J471l163L133N362O141Q069
14193A370781l277l21L205l991j066P470j866n546j177r78J337M437P150O422
14179A382580L078K601J0727R1o662m268JK132N774L385j171L007n25m874L610
14164A399486L091P14m875N048O401P611K426l284l490N343P315L727K533Q583
$$ plain form
14266 1293136 1298930 1298473 1296076 1298698 1301341 1304406 1304818 1307236 1311525 1313250 1307550 1300217 1296670 1296434 1291966
14251 1291966 1295393 1301337 1302982 1303405 1308570 1305081 1302107 1308731 1310238 1311192 1311869 1305139 1308662 1312226 1320500
14236 1320500 1326529 1324825 1324603 1320448 1318958 1322818 1327799 1328203 1330336 1326334 1324810 1332075 1336655 1330558
14222 1330558 1327803 1333183 1339381 1341934 1336057 1326388 1327719 1340746 1346493 1340897 1337634 1340391 1344825 1342690
14208 1342690 1343509 1343320 1346702 1349665 1355513 1355680 1353619 1350867 1349768 1351239 1348076 1351209 1356571 1362712 1370781
14193 1370781 1367504 1367183 1370388 1366397 1365331 1372801 1370935 1365389 1364212 1363234 1364571 1369008 1376158 1382580
14179 1382580 1385658 1388259 1398986 1399077 1392415 1388147 1388148 1390280 1396054 1399439 1398268 1401275 1400750 1395876 1399486
14164 1399486 1402577 1403291 1398416 1403464 1409865 1417476 1419902 1416618 1413128 1418471 1425786 1429513 1432046 1440629
14150A440629o145j4650q029Q186N658m864N059R971j00m353L219L577l438L88
14136A435108K093N319L550l969m001k53L511K924O505J482P033P141O83j1640
14122A455486m451M897M829J846l486n554M338Q124J792K919M6L524L908J318
14108A479536N671J056J27K607M73l264P52L507J0995N340j679M521k248J281
14094A508675P78m457k302J658M966J2613P526J075Q770L591L847K776L251n093
14080A547674M961p23P163O488l036K339J0201J11k675m047N046N052O032l34
14066A584252p069k127O774K083J51J513p87R666J4985J0978L153k851M565L877
14052A629163J515j138l360k180o102l386o736j1701j9808j3525j5694j9855j9637
$$ plain form
14150 1440629 1434484 1419834 1411805 1419991 1425649 1420785 1425844 1435815 1435715 1431362 1434581 1438158 1434720 1435108
14136 1435108 1437201 1442520 1446070 1442101 1438100 1437847 1441358 1444282 1450787 1452269 1459302 1466443 1467126 1455486
14122 1455486 1451035 1455932 1460761 1462607 1459121 1453567 1457905 1466029 1467821 1470740 1470786 1474310 1478218 1479536
14108 1479536 1485207 1486263 1486390 1488997 1489470 1486206 1486958 1490465 1501460 1506800 1505121 1509642 1507394 1508675
14094 1508675 1509453 1504996 1502694 1504352 1509318 1521931 1529457 1530532 1539302 1542893 1546740 1549516 1552767 1547674
14080 1547674 1552635 1551912 1559075 1565563 1562527 1564866 1575067 1575178 1572503 1568456 1573502 1578554 1584586 1584252
14066 1584252 1577183 1575056 1581830 1583913 1584064 1585577 1584790 1594456 1609441 1620419 1623572 1620721 1625286 1629163
14052 1629163 1630678 1629540 1626180 1624000 1617898 1614512 1607776 1596075 1576267 1562742 1547048 1527193 1507556
14039A507556j4463j1676k2412j2214j2643l406p430q114n071N922O852L782L609
14026A430292M609P109N853M65K757L878l373J060K9l652N749n51J821J863k335
14011A455574Q58n909K25J1148J0115O93j957k78O48L856J0634J0585K253L282
13997A501727o055p33j089K447O946Q858N442j062j1276l302Q462K367L442L302
13983A519476L883k03O719N151Q410J732n399R45J0330k8o479P838K375r105l101
13968A542544J0756R718l564l379O206O405K729q44L167L382N330Q231j978L661
13954A592364J569j4013n696P053N618K957K196K242j68k066O936m525k650K957
13940A594774P503P282j57q04K123L833M752M111L392M455L964m951M104j415
$$ plain form
14039 1507556 1493093 1481417 1459005 1446791 1434148 1430742 1423312 1415198 1410127 1416049 1422901 1426683 1430292
14026 1430292 1434901 1442010 1447863 1448328 1451085 1454963 1451590 1452650 1452679 1449027 1454776 1454225 1456046 1457909 1455574
14011 1455574 1456432 1450523 1450748 1461896 1472011 1472704 1470747 1470469 1471117 1474973 1485607 1496192 1498445 1501727
13997 1501727 1495672 1494939 1493850 1496297 1503243 1512101 1517543 1516481 1505205 1501903 1510365 1512732 1516174 1519476
13983 1519476 1523359 1523156 1529875 1535026 1543436 1545168 1539769 1540714 1551044 1551016 1544537 1552375 1554750 1545645 1542544
13968 1542544 1553300 1563018 1559454 1556075 1562281 1568686 1571415 1570571 1573738 1577120 1582450 1590681 1588703 1592364
13954 1592364 1593933 1579920 1574224 1581277 1586895 1589852 1592048 1594290 1594122 1592056 1598992 1594467 1591817 1594774
13940 1594774 1602277 1609559 1609402 1608598 1610721 1614554 1619306 1623417 1626809 1631264 1635228 1630277 1634381 1632966
13926A632966P595M272n786K625p04Q07K793K415L770J645p688j0048p275J2719
13912A640106k179m124N157K900L738P79o30K781L711N868J586K252M029J811
13898A667785m545n138l337k243J661l53M728Q335J851J461N98M999j769q20k998
13883A670215K736P821P705j494l95k315j680J104J224j134n4J243J2319J0384
13869A707679k594j149N180K653j223J115K861P034Q156L673J053q510m733P930
13855A729125R306m33j619J674M347R38M293J449k852k326j873L501N00M001K258
13840A752289L915j470L96P04M495K642N777L710L35j106l531J250R317K029p739
13825A773013m592J715K281m464O099K434j35M534o33l976M783O612n1K288L297
$$ plain form
13926 1632966 1640561 1644833 1639047 1641672 1640968 1641775 1644568 1646983 1650753 1652398 1644710 1634662 1627387 1640106
13912 1640106 1637927 1633803 1638960 1641860 1645598 1646377 1645747 1648528 1652239 1658107 1659693 1661945 1665974 1667785
13898 1667785 1663240 1658102 1654765 1652522 1654183 1653830 1658558 1666893 1668744 1670205 1670803 1675802 1674033 1673213 1670215
13883 1670215 1672951 1680772 1688477 1686983 1686588 1684273 1682593 1683697 1684921 1683787 1683733 1684976 1697295 1707679
13869 1707679 1705085 1703936 1709116 1711769 1710546 1711661 1714522 1721556 1729712 1733385 1734438 1725928 1721195 1729125
13855 1729125 1738431 1737998 1736379 1738053 1742400 1743338 1747631 1749080 1746228 1743902 1742029 1745530 1746030 1750031 1752289
13840 1752289 1756204 1754734 1755130 1755834 1760329 1762971 1768748 1772458 1772793 1771687 1768156 1769406 1778723 1780752 1773013
13825 1773013 1768421 1770136 1772417 1767953 1774052 1776486 1776351 1780885 1780252 1776276 1781059 1787671 1787620 1789908 1793205
13810A793205M58k793J4387O903L770J345j006m48M43M56L044M236N070j598n69
13795A826903j20J262K796L456M280L479m63L045K316J2281J816l229m699l503
13781A849620P323j383l837K047Q414K341L105Q224N813J194J733p307j298K524
13767A878513j342n10K924k451L02J4347Q793j488r69L890J1420J848n678o778
13753A902821k613L690l691L471J4972J863n28J844j062R016K961r213k424j035
13739A920072P10O889Q078N979M269L694N106P115j116J599O105P323k038l124
13725A970661J159J992l968l562L159J0796O993M892L518p532L986J0762N31O23
13711B004010K188M351P035k533M99O536M200L186K741N487l961q125o62M698
$$ plain form
13810 1793205 1793663 1790870 1805257 1812160 1815930 1817275 1816269 1815821 1816264 1816720 1819764 1824000 1829070 1827472 1826903
13795 1826903 1826783 1828045 1830841 1834297 1838577 1842056 1841593 1844638 1846954 1859235 1861051 1857822 1853123 1849620
13781 1849620 1856943 1855560 1851723 1853770 1862184 1864525 1867630 1875854 1881667 1882861 1884594 1877287 1875989 1878513
13767 1878513 1877171 1876661 1879585 1877134 1877436 1891783 1900576 1899088 1898119 1902009 1913429 1915277 1909599 1902821
13753 1902821 1900208 1903898 1900207 1903678 1918650 1920513 1919985 1921829 1920767 1929783 1932744 1923531 1921107 1920072
13739 1920072 1920782 1927671 1935749 1941728 1945997 1949691 1954797 1961912 1960796 1962395 1968500 1975823 1973785 1970661
13725 1970661 1971820 1973812 1969844 1966282 1969441 1980237 1987230 1992122 1995640 1988108 1992094 2002856 2003387 2004010
13711 2004010 2006198 2010549 2017584 2015051 2015550 2022086 2026286 2029472 2032213 2037700 2033739 2025614 2024952 2029650
13697B029650J406K503P445j795J102L494K956O772Q610N128q94j024l102L845
13683B066096P541n42K47m211p46O666M652K709j869k347L67P800N302l932l191
13668B084542L72K207N926K731K638M417L040L11J063N823J664L141O709M935
13654B129519K510j268K19l866o678k922l562o71L925J222Q775J1129R87K702
13640B142021R019O847L208M160l708o320O154J215k620M251M026Q686P151O17
13626B184707p493J245R586K327l243k601J828O011J0283N203K092J940P931J2201
13612B232017k238n549k634j019Q267L689K787K73K849P590P0K014M158m694k19
13597B247361M784R346J0630L932j008O34N442O320M459K131L359P2M420N29L608
$$ plain form
13697 2029650 2031056 2033559 2041004 2039209 2040311 2043805 2046761 2053533 2062143 2067271 2066377 2065353 2062251 2066096
13683 2066096 2073637 2073095 2073342 2069131 2068385 2075051 2079703 2082412 2080543 2078196 2078563 2086363 2091665 2087733 2084542
13668 2084542 2084914 2087121 2093047 2095778 2098416 2102833 2105873 2106184 2107247 2113070 2114734 2117875 2124584 2129519
13654 2129519 2132029 2130761 2130980 2127114 2120436 2117514 2113952 2113281 2117206 2118428 2127203 2138332 2139319 2142021
13640 2142021 2151040 2157887 2161095 2165255 2161547 2155227 2161381 2162596 2159976 2164227 2168253 2176939 2184090 2184707
13626 2184707 2177214 2178459 2188045 2190372 2187129 2184528 2186356 2192367 2202650 2207853 2209945 2211885 2219816 2232017
13612 2232017 2229779 2224230 2221596 2220577 2228844 2232533 2235320 2235593 2238442 2246032 2246102 2248116 2252274 2247580 2247361
13597 2247361 2252145 2261491 2272121 2276053 2275045 2275679 2281121 2287441 2291900 2294031 2297390 2297462 2301882 2302411 2306019
13582B306019K277L308M854p069J154O842M157L170K849R40P038N12L167M857
13568B344075R894M112o93n333R173P529L658Q797j510n727M778O634L77J453
13554B387217R370Q100J609L116N844N022J133q922M448P215K022K882K430j374
13540B430112K031J6480J2318r98J909N431q967k177R952J0003J545k111J0288
13527B485816J2689K763M62N570N326j722R357P499R140j004J312J214Q382M974
13513B551778J577m49O920K320M099N672P495J450K625K238J20j153L779P328
13499B595799J4353J0781R636J4025N864J171Q516J1035J3090J6173Q788J4722
13487B723953J6620J5026J5920J962r174j3748l0356m1263m0203k4740j6300r660
$$ plain form
13582 2306019 2308296 2311604 2316458 2309389 2310543 2317385 2321542 2324712 2327561 2328501 2335539 2336051 2339218 2344075
13568 2344075 2353969 2358081 2357388 2352055 2361228 2368757 2372415 2381212 2379702 2373975 2378753 2385387 2385764 2387217
13554 2387217 2396587 2404687 2406296 2409412 2415256 2420278 2421411 2412489 2416937 2424152 2426174 2429056 2431486 2430112
13540 2430112 2432143 2448623 2460941 2459943 2461852 2467283 2458316 2456139 2466091 2476094 2477639 2475528 2485816
13527 2485816 2498505 2501268 2501730 2507300 2512626 2510904 2520261 2527760 2536900 2535896 2537208 2538422 2546804 2551778
13513 2551778 2553355 2552906 2559826 2562146 2566245 2571917 2579412 2580862 2583487 2585725 2585845 2584692 2588471 2595799
13499 2595799 2610152 2620933 2630569 2644594 2650458 2651629 2660145 2671180 2684270 2700443 2709231 2723953
13487 2723953 2740573 2755599 2771519 2773481 2764307 2750559 2720203 2678940 2638737 2613997 2597697 2588037
13475B588037k544N035J2170J1431R594J1309J0435J0050J0531J0965J0437Q755
13463B696205RR787J8355J2498J1062J3211P861R001K3103J2830J5362J8501K2185
13450B869970K4120K1944N787l571j8510m5849n6391o9517p1161n7952k2669N558
13438B581759J3501J7569J4694K0411J3845Q738L838L900J1984J5794J1181Q538
13426B725752J1255P403J1778J4478Q636M861N336J1806J2061J2173K0538J2722
13414B858799N146R192K1984J3885j073p823k2032l1890k9570k9144j3031k891
13402B771552O985R006J3736J6747J1831Q286R494N370J1837J3933P668P163J0774
13389B904382L609M146J937R535O812L002O603J900K265J0529J2229P975O864
$$ plain form
13475 2588037 2585493 2590528 2602698 2614129 2623723 2635032 2645467 2655517 2666048 2677013 2687450 2696205
13463 2696205 2696214 2706001 2724356 2736854 2747916 2761127 2768988 2777989 2801092 2813922 2829284 2847785 2869970
13450 2869970 2894090 2916034 2921821 2918250 2899740 2853891 2797500 2727983 2656822 2598870 2576201 2581759
13438 2581759 2595260 2612829 2627523 2647934 2661779 2670517 2674355 2678255 2690239 2706033 2717214 2725752
13426 2725752 2737007 2744410 2756188 2770666 2779302 2784163 2789499 2801305 2813366 2825539 2846077 2858799
13414 2858799 2863945 2873137 2895121 2909006 2907933 2900110 2878078 2846188 2816618 2787474 2774443 2771552
13402 2771552 2778537 2787543 2801279 2818026 2829857 2838143 2847637 2853007 2864844 2878777 2886445 2893608 2904382
13389 2904382 2907991 2912137 2914074 2923609 2930421 2933423 2940026 2941926 2944191 2954720 2966949 2974924 2981788
13376B981788Q921O581P645J027J848N016q08L281M211O667Q093J2615J3816P749
13362C068450N646J1076J1718N102K513J1323M911P371O399M329L449Q786Q405
13349C159478P101P472M827M468Q729J3820K919k265J6094J0809M966K25Q814
13336C247457P357P051J6978M757j43k411Q312R153J2868R237R384L204Q504J0991
13322C352699Q089Q488Q991R087O865M822P921J1052Q899Q570M865M93J318J1535
13308C453694J0287J5173K1468Q469N371M804j540k069K616Q170R382J4965P289
13295C558079J0136J0398J9064J3679J2412J0403R420O397M848J193R275J2956
13283C678260R275J3628J0595K337J1345J3355P052R854J4096J3876J1778K182
$$ plain form
13376 2981788 2990709 2997290 3004935 3005962 3007810 3012826 3012018 3015299 3019510 3026177 3034270 3046885 3060701 3068450
13362 3068450 3074096 3085172 3096890 3101992 3104505 3115828 3120739 3128110 3134509 3138838 3142287 3151073 3159478
13349 3159478 3166579 3174051 3178878 3183346 3192075 3205895 3208814 3206549 3222643 3233452 3238418 3238643 3247457
13336 3247457 3254814 3261865 3278843 3283600 3283457 3281046 3289358 3298511 3311379 3320616 3330000 3333204 3341708 3352699
13322 3352699 3360788 3369276 3378267 3387354 3394219 3399041 3406962 3418014 3426913 3435483 3440348 3440841 3442159 3453694
13308 3453694 3463981 3479154 3500622 3509091 3514462 3519266 3517726 3515657 3518273 3526443 3535825 3550790 3558079
13295 3558079 3568215 3578613 3597677 3611356 3623768 3634171 3643591 3649988 3654836 3656029 3665304 3678260
13283 3678260 3687535 3701163 3711758 3714095 3725440 3738795 3745847 3755701 3769797 3783673 3795451 3797633
13271C797633N982M719K157K962J2675N097R041P883J5822R740J1564J5070J5820
13258C916165J9347J4804J2733J4143O614R951J5760J0288O358K923J0496J3448
13246D053030N730J3029J4079J1320O472J7871J6629J3965J2525M22J718R363
13234D176153M027J5227J6718J8131J7978J3353J1507J1355J4407J4133R887J8437
13222D341313K2901K3263J2135J2522J9567J6542J4535J5983O321M572J1545K1570
13210D522769J4026J1375J3871K2594K3940K2129J8708J5357K4811J3981Q145
13199D711706R481O273N084J7309K3033J7859J5759K4387K5090K7197K1246J8160
13187D922584K2709K0823K5298K1696K6432K6429J9555K1314K2550K3665K7087
$$ plain form
13271 3797633 3803615 3808334 3810491 3813453 3826128 3831225 3840266 3848149 3863971 3873711 3885275 3900345 3916165
13258 3916165 3935512 3950316 3963049 3977192 3983806 3993757 4009517 4019805 4026163 4029086 4039582 4053030
13246 4053030 4058760 4071789 4085868 4097188 4103660 4121531 4138160 4152125 4164650 4165072 4166790 4176153
13234 4176153 4180180 4195407 4212125 4230256 4248234 4261587 4273094 4284449 4298856 4312989 4322876 4341313
13222 4341313 4364214 4387477 4399612 4412134 4431701 4448243 4462778 4478761 4485082 4489654 4501199 4522769
13210 4522769 4536795 4548170 4562041 4584635 4608575 4630704 4649412 4664769 4689580 4703561 4711706
13199 4711706 4721187 4727460 4732544 4749853 4772886 4790745 4806504 4830891 4855981 4883178 4904424 4922584
13187 4922584 4945293 4966116 4991414 5013110 5039542 5065971 5085526 5106840 5129390 5153055 5180142
13176E180142K8110K7859L3393L4194L1444L6733L0075M0158K7546K302j6187
13165E455769k2680k9490j8916p164Q439K6847K2917K3945K4630L4664L8260M1207
13153E598428L7571M0585L2641L4099L9376L3476K8944L0659M0323L6803K9912
13142E982817L9782L9488L3979L5951L5372L8943M6266M4879M3181M3518N8788
13131F442964N5386O0229N7621O3299O7767Q0086P8822P3015L8013k2002q4969
13120F910231j18668j27627j09958n2196K0490O4028P7044Q1065Q2018P1649O8128
13109F966204O4555O4349P0322O6084P3315P4060O7635P4242Q0783P2907P2709
13098G747165P3686P7534P7843P6995P7586Q0954P0529P4969P8157O7069O9137
$$ plain form
13176 5180142 5208252 5236111 5269504 5303698 5335142 5371875 5401950 5442108 5469654 5471956 5455769
13165 5455769 5433089 5403599 5384683 5377519 5385958 5412805 5435722 5459667 5484297 5518961 5557221 5598428
13153 5598428 5635999 5676584 5709225 5743324 5782700 5816176 5845120 5875779 5916102 5952905 5982817
13142 5982817 6022599 6062087 6096066 6132017 6167389 6206332 6252598 6297477 6340658 6384176 6442964
13131 6442964 6498350 6558579 6616200 6679499 6747266 6827352 6906174 6979189 7017202 6995200 6910231
13120 6910231 6791563 6663936 6553978 6501782 6522272 6586300 6663344 6744409 6826427 6898076 6966204
13109 6966204 7030759 7095108 7165430 7231514 7304829 7378889 7446524 7520766 7601549 7674456 7747165
13098 7747165 7820851 7898385 7976228 8053223 8130809 8211763 8282292 8357261 8435418 8502487 8571624
13087H571624P9880R0106R6175J12294J29283J32687J39807J57772J53187J20799
13077I783614P1090J6415k5547m4794m4291N157P6861J57994J87530K02196K08029
13066A0594254J95046J96249J96493K10953K15410K24053K27679K34418K44823
13057A2539378K65888K79114K74949K86832L18558L35486L54456L92334M38069
13048A5485064N03405N62182O28232O96734P74094Q70212R77530J110720J298082
13039B2906255J516017J717765J728203J207240k31050k419170m488571n760996
13031A6175693o283480n846673l975057j427747L97210J167525J330321J262083
13023B799875J157262J064190R94429R53731R23666Q77583Q39992Q01296P78338
$$ plain form
13087 8571624 8651504 8741610 8837785 8950079 9079362 9212049 9351856 9509628 9662815 9783614
13077 9783614 9854704 9871119 9845572 9800778 9756487 9761644 9838505 9996499 10184029 10386225 10594254
13066 10594254 10789300 10985549 11182042 11392995 11608405 11832458 12060137 12294555 12539378
13057 12539378 12805266 13084380 13359329 13646161 13964719 14300205 14654661 15046995 15485064
13048 15485064 15988469 16550651 17178883 17875617 18649711 19519923 20497453 21608173 22906255
13039 22906255 24422272 26140037 27868240 29075480 28844430 26425260 21936689 16175693
13031 16175693 9892213 4045540 70483 -1357264 -960054 207471 1537792 2799875
13023 2799875 3957137 5021327 6015756 6969487 7893153 8770736 9610728 10412024 11190362
13014A1190362P77915Q08376Q78795R68825J062487J175180J309563J466720J672868
13005B1311091J941773K295265K730240L202589L525814L185168J400485k335169
12997C7257256p069928j0890303j2970997j3347445j1270235o576163j528198
12990b6396013J548024K530714K466376K140605J813061J576236J413372J282998
12982a1624627J195847J136508J077495J010802R19287Q21885P36749O91447O86936
12973c347671P30572Q20257R42140J068719J187937J324761J494639J697003J893345
12964G811702J922483J472048J19683k142439m514204o094810o797246o554390
12956a4777173m857148k141581P5039J089320J300119J197287J026475Q68587
$$ plain form
13014 11190362 11968277 12776653 13655448 14624273 15686760 16861940 18171503 19638223 21311091
13005 21311091 23252864 25548129 28278369 31480958 35006772 38191940 39592425 37257256
12997 37257256 30187328 19297025 6326028 -7021417 -18291652 -24867815 -26396013
12990 -26396013 -24847989 -22317275 -19850899 -17710294 -15897233 -14320997 -12907625 -11624627
12982 -11624627 -10428780 -9292272 -8214777 -7203975 -6284688 -5462803 -4726054 -4034607 -3347671
12973 -3347671 -2617099 -1796842 -854702 214017 1401954 2726715 4221354 5918357 7811702
12964 7811702 9734185 11206233 11325916 9183477 4669273 -1425537 -8222783 -14777173
12956 -14777173 -19634321 -21775902 -21700863 -20611543 -19311424 -18114137 -17087662 -16219075
12948a6219075P57494O80653O23973N70360N29429M92006M40809M00521L64173
12939a1359657L32602L01675K94676K80096K62096K54243K46169K40221K36308
12930h911571K32455K21210K10424K13658K11427J94954J79659J66256J44753
12921g136775J18768R4037R5982Q9563J05288J11961J20736J13962J06125J12219
12911f068134J14037J06734J07302J15029J09232J14181J05509J11065R9315Q5952
12901d999778P2512N4186N3163N1680N3553O3658Q1651Q6399Q8692R1730Q7910
12890d214644P9236P5954P9914P2911P2466Q6377P8832P2894O8023O1467O3321
12879c403249N6997O0111O6729O3207N5062N8740O9487O2866N0737M8322O4673
$$ plain form
12948 -16219075 -15461581 -14780928 -14156955 -13586595 -13057166 -12565160 -12124351 -11723830 -11359657
12939 -11359657 -11027055 -10725380 -10430704 -10150608 -9888512 -9634269 -9388100 -9147879 -8911571
12930 -8911571 -8679116 -8457906 -8247482 -8033824 -7822397 -7627443 -7447784 -7281528 -7136775
12921 -7136775 -7018007 -6923970 -6827988 -6738425 -6633137 -6521176 -6400440 -6286478 -6180353 -6068134
12911 -6068134 -5954097 -5847363 -5740061 -5625032 -5515800 -5401619 -5296110 -5185045 -5085730 -4999778
12901 -4999778 -4927266 -4873080 -4819917 -4768237 -4714684 -4651026 -4569375 -4482976 -4394284 -4302554 -4214644
12890 -4214644 -4135408 -4059454 -3979540 -3906629 -3834163 -3747786 -3668954 -3596060 -3528037 -3466570 -3403249
12879 -3403249 -3346252 -3286141 -3219412 -3156205 -3101143 -3042403 -2972916 -2910050 -2859313 -2810991 -2746318
12868b746318O9814O6293N5439N9663O1898O1422N5882N9340N5900N9966N5481
12857b085220N3162N2724N4384O2269N6481M4414M6516M7963N1035N4320M7658
12846a514294M8071M7306M8060M2449L8370L1188M1994M5887L7509L0210M0379
12835a062871L9070L5440L6383L6664L9241L7982L8279M2671M4093N2026M1308
12824f19714L3440M2456M0578K7770K9106L3729M2628L4680L6833M2568L8690
12813b17236L4908L4695L3375M5471M4447L3293L2822M0024L3815K9158L9193
12802A83965L3227L6641L8685L1715L7861L2819L3940L5414L2254L0954L3608
12791E61083L6484K7287L0067L6056L4028K7412K1127J1069J1665K0456J3295
$$ plain form
12868 -2746318 -2676504 -2610211 -2554772 -2495109 -2433211 -2371789 -2315907 -2256567 -2200667 -2140701 -2085220
12857 -2085220 -2032058 -1979334 -1924950 -1862681 -1806200 -1761786 -1715270 -1667307 -1616272 -1561952 -1514294
12846 -1514294 -1466223 -1418917 -1370857 -1328408 -1290038 -1258850 -1216856 -1170969 -1133460 -1103250 -1062871
12835 -1062871 -1023801 -988361 -951978 -915314 -876073 -838091 -799812 -757141 -713048 -661022 -619714
12824 -619714 -586274 -543818 -503240 -475470 -446364 -412635 -370007 -335327 -298494 -255926 -217236
12813 -217236 -182328 -147633 -114258 -68787 -24340 8953 41775 81799 115614 144772 183965
12802 183965 217192 253833 292518 324233 362094 394913 428853 464267 496521 527475 561083
12791 561083 597567 624854 654921 690977 725005 752417 773544 784613 796278 816734 830029
12780H30029L297J0791J9072K0851L4453M0017M0416L6227K9674K6512L4221L5045
12768A160605L0299K7663K5177L2560L3909L5937L3593K9325K8640K8988L5527
12757A502223L8284L7924L6906L8281L5800L0664L5561L6095L1701L1144L6800
12746A891383K9369K6630K3329L4214L5064L4003L0706L3693L7007M6129L4811
12735B256338L3119L6485L9362L6231L1480M1748M0398L7020L9988L6625L7981
12724B666775L9438L8869M8007M9581M8065M0552M0500L6592L2750L0851L4244
12713C106224L2960L2931L3315K5680L0987M6776N0134M3842L2059M0839L1665
12702C507412L1661L8751M0763L9775M5068N6123O1374N0178N2743O4124N1649
$$ plain form
12780 830029 833326 844117 863189 884040 918493 958510 998926 1035153 1064827 1091339 1125560 1160605
12768 1160605 1190904 1218567 1243744 1276304 1310213 1346150 1379743 1409068 1437708 1466696 1502223
12757 1502223 1540507 1578431 1615337 1653618 1689418 1720082 1755643 1791738 1823439 1854583 1891383
12746 1891383 1920752 1947382 1970711 2004925 2039989 2073992 2104698 2138391 2175398 2221527 2256338
12735 2256338 2289457 2325942 2365304 2401535 2433015 2474763 2515161 2552181 2592169 2628794 2666775
12724 2666775 2706213 2745082 2793089 2842670 2890735 2931287 2971787 3008379 3041129 3071980 3106224
12713 3106224 3139184 3172115 3205430 3231110 3262097 3308873 3359007 3402849 3434908 3475747 3507412
12702 3507412 3539073 3577824 3618587 3658362 3703430 3759553 3820927 3871105 3923848 3987972 4039621
12691D039621M9328N3012N6659N3514N6832N9883N4531O0338O4966O2814O0433
12680D671931O5151P0351O9599P4812Q0031P9116P7300Q0293Q4823Q9659Q5440
12669E528506Q4655Q3289Q7668Q2802R3624R8549R1802R7905J00667J04434J04037
12658F557938J08750J15774J16948J20500J27204J30855J41887J41523J40816
12649G702195J51854J67762J67536J72597J76528J77616J56443J41416J28696
12640I142643J03306R3311P8896O1728P6595R6801J20996J43447J72351K05478
12630A0295552K26378K55082K78808K88669L02321L21959L35999L51865L69051
12621A3025684L85908M04828M26840M53397M67060M96938N38408N67642O11106
$$ plain form
12691 4039621 4088949 4141961 4198620 4252134 4308966 4368849 4423380 4483718 4548684 4611498 4671931
12680 4671931 4737082 4807433 4877032 4951844 5031875 5110991 5188291 5268584 5353407 5443066 5528506
12669 5528506 5613161 5696450 5784118 5866920 5960544 6059093 6150895 6248800 6349467 6453901 6557938
12658 6557938 6666688 6782462 6899410 7019910 7147114 7277969 7419856 7561379 7702195
12649 7702195 7854049 8021811 8189347 8361944 8538472 8716088 8872531 9013947 9142643
12640 9142643 9245949 9339260 9418156 9479884 9556479 9653280 9774276 9917723 10090074 10295552
12630 10295552 10521930 10777012 11055820 11344489 11646810 11968769 12304768 12656633 13025684
12621 13025684 13411592 13816420 14243260 14696657 15163717 15660655 16199063 16766705 17377811
12612A7377811O64543P23351P84675Q57108R27363R98763J082300J151990J232063
12603B5799967J321287J414870J542800J730308J998470K340740K800754L361342
12595D2310538L967084M414758M348068L554325K026131k15806l245174o780270
12587E0379654j0211165j2875516j4479331j5044769j4384945j2343619r244730
12580c8204421n910695k899230m27193J531068K778789L215640K991606K533986
12572c4390450K082804J695401J412102J208447J053340R51552Q94554Q69084
12564b4223166Q29654P81960P28614O75983O38010N98969N64691N33798N10713
12555a8360774M91477M79985M48785M27054M05558L85987L68115L37886L13515
$$ plain form
12612 17377811 18042354 18765705 19550380 20407488 21334851 22333614 23415914 24567904 25799967
12603 25799967 27121254 28536124 30078924 31809232 33807702 36148442 38949196 42310538
12595 42310538 46277622 50692380 55040448 58594773 60620904 60405098 57159924 50379654
12587 50379654 40168489 27292973 12813642 -2231127 -16616072 -28959691 -38204421
12580 -38204421 -44115116 -47014346 -47441539 -45910471 -43131682 -39916042 -36924436 -34390450
12572 -34390450 -32307646 -30612245 -29200143 -27991696 -26938356 -25986804 -25092250 -24223166
12564 -24223166 -23393512 -22611552 -21882938 -21206955 -20568945 -19969976 -19405285 -18871487 -18360774
12555 -18360774 -17869297 -17389312 -16940527 -16513473 -16107915 -15721928 -15353813 -15015927 -14702412
12546a4702412L01654K88488K84576K69326K47192K19532K04086J79833J63887
12537a2543838J67187J83906J98440K00430J96378J82224J70976J60037J53617
12528a0930643J37677J29311J39167J31173J28864J40462J35299J33419J26898
12519i728373J29825J24369J18181J18281J24961J21980J20604J18246J24393
12510h627533J21189J26791J23348J09208Q7134O5221N3785M0243L5665L2065
12500g832884N0262O3469Q1002Q1995P6536P4865P9901Q5905Q9617Q3803P8481
12489f987048P6426P1498P4774P0838P6978P6134P5144Q0662P5014O3632N6324
12478f189624O0018O2181O2358O3889M7304M9990N2857N1937N4723N4454N3670
$$ plain form
12546 -14702412 -14400758 -14112270 -13827694 -13558368 -13311176 -13091644 -12887558 -12707725 -12543838
12537 -12543838 -12376651 -12192745 -11994305 -11793875 -11597497 -11415273 -11244297 -11084260 -10930643
12528 -10930643 -10792966 -10663655 -10524488 -10393315 -10264451 -10123989 -9988690 -9855271 -9728373
12519 -9728373 -9598548 -9474179 -9355998 -9237717 -9112756 -8990776 -8870172 -8751926 -8627533
12510 -8627533 -8506344 -8379553 -8256205 -8146997 -8059863 -7994642 -7940857 -7900614 -7864949 -7832884
12500 -7832884 -7782622 -7719153 -7638151 -7556156 -7479620 -7404755 -7324854 -7238949 -7149332 -7065529 -6987048
12489 -6987048 -6910622 -6839124 -6764350 -6693512 -6616534 -6540400 -6465256 -6384594 -6309580 -6245948 -6189624
12478 -6189624 -6129606 -6067425 -6005067 -5941178 -5893874 -5843884 -5791027 -5739090 -5684367 -5629913 -5576243
12467e576243L3260K9568L8371K9499J7381K0555K6653K5588L0100M7572M7827
12456e229869N1294N3375N5718O2072N8657N0080N1240N7948N5706N6178N7805
12445d619796M7004L9730M5852M7046M9093M6758M8100M2936L7481L8018M4913
12434d132865M6808N0949M2445L9750L1242L4389K8831K5907K6647L8296M3185
12423c724416M6819M2826L2326J5940J654J084P56j0116Q715K7436K3653L8657
12411c494666L6229K5680K9678K7020K9890K6938K4364L2435L4156L1517K2791
12400c173968K7234K6055K2293K5607K3235J9817K6459K6784J5403J5890J1365
12389b933826K4060J8646K3646K8381K7105K2684J6385K1829L3469L2705L4073
$$ plain form
12467 -5576243 -5542983 -5513415 -5475044 -5445545 -5428164 -5407609 -5380956 -5355368 -5325268 -5277696 -5229869
12456 -5229869 -5178575 -5125200 -5069482 -5007410 -4948753 -4898673 -4847433 -4789485 -4733779 -4677601 -4619796
12445 -4619796 -4572792 -4533062 -4487210 -4440164 -4391071 -4344313 -4296213 -4253277 -4215796 -4177778 -4132865
12434 -4132865 -4086057 -4035108 -3992663 -3952913 -3921671 -3887282 -3858451 -3832544 -3805897 -3767601 -3724416
12423 -3724416 -3677597 -3634771 -3602445 -3586505 -3584851 -3583767 -3583011 -3593127 -3584412 -3556976 -3533323 -3494666
12411 -3494666 -3458437 -3432757 -3403079 -3376059 -3346169 -3319231 -3294867 -3262432 -3228276 -3196759 -3173968
12400 -3173968 -3146734 -3120679 -3098386 -3072779 -3049544 -3029727 -3003268 -2976484 -2961081 -2945191 -2933826
12389 -2933826 -2909766 -2891120 -2867474 -2839093 -2811988 -2789304 -2772919 -2751090 -2717621 -2684916 -2650843
12378b650843L2101K5429J3416o921j5202j3805k1749q200K4395K7345K8527K1006
12366b544501J1707K4198K2143J8563J8060J6086J6743K2365K1193J7349J6908
12355b339186J7662K0061K3200K8504J6844J6607K0266J6422J2450M046K655o39
12343b161108J427J5519J7040J6125K1964K1804Q794K1417K8237J9997J5246L021
12331a970517J11J0774P817O484N515J0399O144J1276J5374J6800J2403M949O565
12318a855906R444J9256K0849K4959L1983K2580N883l14j1062j4581q345m492
12306a759746K303J8567J6006N151j2126j1945j5663k3020j2347J0876J4824J2524
12294a754596J0958J5670J7496J5145J2597J1059J1746J9059K6529J1461P720
$$ plain form
12378 -2650843 -2618742 -2593313 -2579897 -2586818 -2602020 -2615825 -2637574 -2645774 -2621379 -2594034 -2565507 -2544501
12366 -2544501 -2532794 -2508596 -2486453 -2467890 -2449830 -2433744 -2417001 -2394636 -2373443 -2356094 -2339186
12355 -2339186 -2321524 -2301463 -2278263 -2249759 -2232915 -2216308 -2196042 -2179620 -2167170 -2163124 -2160469 -2161108
12343 -2161108 -2159681 -2144162 -2127122 -2110997 -2089033 -2067229 -2058435 -2037018 -2008781 -1988784 -1973538 -1970517
12331 -1970517 -1970406 -1959632 -1951815 -1945331 -1939816 -1929417 -1923273 -1911997 -1896623 -1879823 -1867420 -1862471 -1855906
12318 -1855906 -1846462 -1827206 -1806357 -1781398 -1749415 -1726835 -1720952 -1721266 -1732328 -1746909 -1755254 -1759746
12306 -1759746 -1757443 -1738876 -1722870 -1717719 -1729845 -1741790 -1757453 -1780473 -1792820 -1781944 -1767120 -1754596
12294 -1754596 -1743638 -1727968 -1710472 -1695327 -1682730 -1671671 -1659925 -1640866 -1614337 -1602876 -1595156
12283a595156J4330J6351J4150K0368J5624J2369J5945J8384K0768J9333J7877
12272a409657J7965P962l142o709l1319l7876j8727j9289j9967j0907L457O812
12260a521397L423J3964N666J4685J7158J9231J6311J2061M399N605Q107J3735
12248a387052J8572J5281J2425J1222J3717J5835J6150J6603J3162J5614K1089
12237a217382K2861K7704K4986Q378j1678k6444k8307l0614l4102r026J7784K0638
12225a235202J3585J0438J0408J8893K0052J2999R666J4295P887O670J6261J2870
12213a081178j19Q456L940L458J1980J3079P331O788R853J0419J0941L839L441
12200i87772J0873J5610J1648M468M233R00J1063J3482R924Q239P840J4148N866
$$ plain form
12283 -1595156 -1580826 -1564475 -1550325 -1529957 -1514333 -1501964 -1486019 -1467635 -1446867 -1427534 -1409657
12272 -1409657 -1391692 -1383730 -1386872 -1393581 -1424900 -1462776 -1481503 -1500792 -1520759 -1531666 -1528209 -1521397
12260 -1521397 -1517974 -1504010 -1498344 -1483659 -1466501 -1447270 -1430959 -1418898 -1414499 -1408894 -1400787 -1387052
12248 -1387052 -1368480 -1353199 -1340774 -1329552 -1315835 -1300000 -1283850 -1267247 -1254085 -1238471 -1217382
12237 -1217382 -1194521 -1166817 -1141831 -1133453 -1145131 -1171575 -1199882 -1230496 -1264598 -1273624 -1255840 -1235202
12225 -1235202 -1221617 -1211179 -1200771 -1181878 -1161826 -1148827 -1139161 -1124866 -1116979 -1110309 -1094048 -1081178
12213 -1081178 -1081297 -1072841 -1068901 -1065443 -1053463 -1040384 -1033053 -1026265 -1016412 -1005993 -995052 -991213 -987772
12200 -987772 -976899 -961289 -949641 -945173 -940940 -940040 -928977 -915495 -905571 -897332 -889492 -875344 -869478
12187h69478l731L175J4985J5488J1763O246J0154J1839Q567J2516J8078J4086
12175g46312J4087O775J4157J1213J2973J2578J4184J5612K2271K8044L1760L9818
12163e22840K7484J9360Q336m841j5194l6833n1925o9000p7237p6062n9579m5844
12151i04175l2265j5361n810m10R879K7961K4538J5636K3622K3344J2230J1372
12139h09439J8214Q289n19P392J2372Q594J0272O297R773J829Q642J7596J3702
12126f86986R873O760J862O547N92M509Q645P739M084N813N017R636J3632J1206
12112e91071N097J566J2666Q005N557L315J704R670Q591N046K235J549O182R726
12098e10162J1757N288O09K142J300O365J2331N896K46M288L753Q907R912L173
$$ plain form
12187 -869478 -873209 -870034 -855049 -839561 -827798 -821552 -811398 -799559 -790992 -778476 -760398 -746312
12175 -746312 -732225 -725450 -711293 -700080 -687107 -674529 -660345 -644733 -622462 -594418 -562658 -522840
12163 -522840 -495356 -475996 -467660 -472501 -487695 -524528 -576453 -645453 -722690 -798752 -858331 -904175
12151 -904175 -936440 -951801 -957611 -958021 -948142 -920181 -895643 -880007 -856385 -833041 -820811 -809439
12139 -809439 -791225 -782936 -783455 -776063 -763691 -755097 -744825 -738528 -728755 -726926 -718284 -700688 -686986
12126 -686986 -677113 -670353 -668491 -661944 -661352 -656843 -648198 -640459 -636375 -630562 -625545 -615909 -602277 -591071
12112 -591071 -585974 -584408 -571742 -563737 -558180 -554865 -553161 -543491 -534900 -529854 -527619 -526070 -519888 -510162
12098 -510162 -498405 -493117 -492508 -490366 -489066 -482701 -470370 -464474 -464228 -459940 -456187 -447280 -437368 -434195
12084d34195J872N495R761N738P005O286J349L048K801O959J5470N969O746L379
12070c52317j434N363L341Q222N779N300M185L103J679N647k229p398O00J6849
12056c03310R538L378L170L257P894P740J449k062K762Q189Q313O19O516O366
12042b36181P040l165n112O971R291N47J2007M092N749J0518J979l948L340R366
12028a77506L794L712K589K203P420R679K556R434O025k427O09o537O005O161
12014a26283Q877O120M182O731M570N759j559j980N685J0439j333K298Q643O533
12000f1318Q922R189O958j922L481N33n477O88L560L473K894J0462J569q12R302
11985h498L431L397J50l326J667Q490Q063J0625N814O025L614K139M109J807M74
$$ plain form
12084 -434195 -432323 -426828 -417067 -411329 -404324 -398038 -396689 -393641 -390840 -383881 -368411 -362442 -355696 -352317
12070 -352317 -353751 -348388 -345047 -336825 -331046 -325746 -321561 -318458 -316779 -311132 -313361 -320759 -320159 -303310
12056 -303310 -293772 -290394 -287224 -283967 -276073 -268333 -266884 -268946 -266184 -257995 -249682 -249063 -242547 -236181
12042 -236181 -229141 -232306 -237418 -230447 -221156 -220609 -208602 -204510 -198761 -188243 -186264 -190212 -186872 -177506
12028 -177506 -173712 -170000 -167411 -165208 -157788 -148109 -145553 -136119 -130094 -132521 -131912 -138449 -132444 -126283
12014 -126283 -117406 -111286 -107104 -100373 -95803 -90044 -91603 -93583 -87898 -77459 -78792 -76494 -67851 -61318
12000 -61318 -52396 -43207 -36249 -38171 -34690 -34157 -39634 -38946 -35386 -31913 -29019 -18557 -16988 -17800 -8498
11985 -8498 -5067 -1670 -1520 -4846 -3179 5311 13374 23999 29813 35838 39452 41591 45700 47507 47981
11970D7981k171N339R246J2921O0l465p6N001R157O112L749O595K264l892j267
11955I7554P956J655N14Q572P886k387l45L853P874O252l677M29m49P993Q600
11940A52280Q648M825P693R658O591j046n84L150J997k10L487k631M056k639N895
11925B01170Q455J0419P955K142J949J525J400J181l223J593P532Q251K933J562
11911B54844K769K815P969N678P609k885m027K966N000J906r19J1107J1140O484
11897C12456l125p554q32L810J0745J2009M985k282j1122r19Q293R055R246P104
11883C51869k751J705LK050l842P443M997P558L866j968J844P358P391O731M909
11868C99163M82m801k920O943J3841R500M18K685l22K64k544m568L943N459j224
$$ plain form
11970 47981 45810 51149 60395 73316 73376 69911 69835 74836 83993 90105 93854 100449 102713 98821 97554
11955 97554 105510 107165 107679 116251 124137 121750 121405 125258 133132 139384 135707 136136 135687 143680 152280
11940 152280 160928 165753 173446 183104 189695 188649 188065 191215 193212 193002 196489 193858 197914 195275 201170
11925 201170 209625 220044 227999 230141 232090 233615 235015 236196 232973 234566 242098 250349 253282 254844
11911 254844 257613 260428 268397 274075 281684 278799 274772 277738 282738 284644 283725 294832 305972 312456
11897 312456 309331 301777 300945 304755 315500 327509 332494 330212 319090 318171 326464 335519 344765 351869
11883 351869 349118 350823 350826 352876 349034 356477 361474 369032 372898 370930 372774 380132 387523 394254 399163
11868 399163 399645 394844 391924 398867 412708 422208 422626 425311 424989 425253 422709 418141 422084 427543 426319
11853D26319L00O506N938M295J5350M452k895L896l275M459Q822N663M28M834
11839D85092M96L679J031J1118O690L953J579N089K894l968N56j170R831J9183
11825E46053K219m053m730M362M382M957k074J279O939M197M230k685Q50K625
11811E68551P578L413L276k122m586J252M737O347R040N589L185J3765K776m410
11797F18391Q166l302k627L581K911J3307J2220J982J428J160l605j463J1326
11784F63475Q53O47P620O178j559J657K227L92L330J974o76M386M260N063P974
11769G07801O524k596o41N888L06j958M985O019K062M818J992M770O005N344J2180
11754G63499k503l748P73P563j893K163R802O070l408J519J4102J4831L757R20
$$ plain form
11853 426319 426619 433125 439063 443358 458708 463160 460265 464161 460886 465345 474167 479830 480258 485092
11839 485092 485588 489267 490298 501416 508106 512059 513638 518727 521621 517653 518209 517039 526870 546053
11825 546053 548272 544219 539489 543851 548233 553190 551116 552395 559334 563531 567761 565076 565926 568551
11811 568551 576129 579542 582818 580696 576110 577362 582099 588446 597486 603075 606260 620025 622801 618391
11797 618391 626557 623255 620628 624209 627120 640427 652647 654629 656057 657217 653612 652149 663475
11784 663475 664328 664975 672595 678773 677214 678871 681098 681490 684820 686794 686118 690504 694764 699827 707801
11769 707801 714325 711729 711088 716976 717282 715324 720309 726328 728390 733208 735200 739970 745975 751319 763499
11754 763499 760996 757248 758021 765584 763691 765854 775656 781726 778318 779837 793939 808770 812527 813447
11740H13447k039l323l750J443M236O622J2389J765j286L066L590j854K041N012
11726H41359O909M827P692R675L356K71L551l141n929L18q17L578K591M032j165
11711H77107O533L297N162M646L448M498L046L549N050J227L295K304K199M491
11697I29852M165O391M108m3N603O889K130l45P556L581L037J150J235Q009M774
11682I88092k21j767O070Q375P61j825n005M858R955J1977k012M771L668m500
11668A023197M980L504J867N451P536L032N811Q810k889p582k002K407L365J62
11654A057649J2066P518N305P005p95l971J738R619J1008K70q61j251l010L228
11640A105518O883M644P328L122j293L348L069N874Q781j92O972q48N783L618
$$ plain form
11740 813447 811408 808085 804335 805778 810014 816636 829025 830790 829504 832570 836160 834306 836347 841359
11726 841359 848268 853095 860787 870462 873818 874089 877640 874499 868570 868888 868071 871649 874240 878272 877107
11711 877107 883640 886937 892099 896745 900193 904691 907737 911286 916336 917563 920858 923162 925361 929852
11697 929852 934017 940408 944516 944473 950076 956965 959095 958750 966306 969887 972924 974074 975309 983318 988092
11682 988092 987871 986104 992174 1000549 1001310 999485 994480 999338 1009293 1021270 1019258 1024029 1027697 1023197
11668 1023197 1028177 1031681 1033548 1038999 1046535 1049567 1055378 1064188 1061299 1053717 1051715 1054122 1057487 1057649
11654 1057649 1069715 1077233 1082538 1089543 1088748 1084777 1086515 1096134 1107142 1107412 1106551 1105300 1102290 1105518
11640 1105518 1112401 1117045 1124373 1127495 1126202 1129550 1132619 1138493 1147274 1147082 1154054 1153206 1158989 1162607
11626A162607L066l97K438K818N066K292k544l26N620P146Q636J893J38N202M086
11611A207741J329N976N990L320O746P112r7L368J408L99J557K762L606N251J1492
11596A267960N598k418p500M081L682P180M027K048O431O701Q038J046J3084N848
11582A325806p01j799K399k643r24K014P322L008N830J3872L775J968J53N811
11568A365891J448j628n021J998K512P735J1738K860K861l765L450N321K088R19
11554A398407J946N377N787k8M233J0872P963J165K840M15L829k73R09J428J0061
11539A454931J088N358R882j398K724Q461J619K421O302j765M498R561p957l190
11525A492535N745O323R71L956k82O110J0678N014J0667L190l743O884J0226M877
$$ plain form
11626 1162607 1165673 1165276 1167714 1170532 1175598 1177890 1175346 1175020 1180640 1187786 1196422 1198315 1198453 1203655 1207741
11611 1207741 1209070 1215046 1221036 1224356 1231102 1238214 1238117 1241485 1242893 1243292 1244849 1247611 1251217 1256468 1267960
11596 1267960 1273558 1271140 1263640 1267721 1271403 1278583 1282610 1284658 1291089 1297790 1305828 1306874 1319958 1325806
11582 1325806 1325105 1323306 1325705 1323062 1322138 1324152 1331474 1334482 1340312 1354184 1357959 1359927 1360080 1365891
11568 1365891 1367339 1365711 1360690 1362688 1365200 1372935 1384673 1387533 1390394 1386629 1390079 1395400 1397488 1398407
11554 1398407 1400353 1405730 1411517 1411489 1415722 1426594 1434557 1435722 1438562 1438977 1442806 1442533 1443442 1444870 1454931
11539 1454931 1456019 1461377 1471259 1469861 1472585 1481046 1482665 1485086 1491388 1489623 1494121 1503682 1495725 1492535
11525 1492535 1498280 1504603 1505574 1509530 1509248 1515358 1526036 1531050 1541717 1544907 1541164 1548048 1558274 1563151
11511A563151q3P212N614j356o94J1454J5518r37m116K264K950N44J998P828M850
11496A616197R004O229m000M6P173M152N980N19k299M677P251N466N987P670P93
11481A674845M691O663J832P655N101Q571L369Q826K119K158R5J909j757j254
11467A724823P263O729L196O501O24K640J301J3421Q003O686L16Q97J348J98R08
11452A784854q61K906M234P619M483N463Q545O558M290M839N510R303M564j208
11438A851099J034M924Q046M795J068L984J25O895L782K669L269N137J2982O439
11424A916248M013L185L979j667L093O221R97N534L851Q010M467J4032Q627O835
11410A987425N733n92j071M902N0L146N584R176L964j087J2929J3065J2365J773
$$ plain form
11511 1563151 1563068 1570280 1575894 1574538 1573844 1585298 1600816 1599879 1595763 1598027 1600977 1601521 1603519 1611347 1616197
11496 1616197 1625201 1631430 1627430 1627476 1634649 1638801 1644781 1645300 1643001 1647678 1654929 1660395 1666382 1674052 1674845
11481 1674845 1679536 1686199 1688031 1695686 1700787 1709358 1712727 1721553 1723672 1725830 1725925 1727834 1726077 1724823
11467 1724823 1732086 1738815 1742011 1748512 1749136 1751776 1753077 1766498 1774501 1781187 1781503 1782400 1783748 1783946 1784854
11452 1784854 1783993 1786899 1791133 1798752 1803235 1808698 1817243 1823801 1828091 1832930 1838440 1847743 1852307 1851099
11438 1851099 1852133 1857057 1865103 1869898 1870966 1874950 1875075 1881970 1885752 1888421 1891690 1896827 1909809 1916248
11424 1916248 1920261 1923446 1927425 1925758 1928851 1935072 1936069 1941603 1945454 1953464 1957931 1971963 1980590 1987425
11410 1987425 1993158 1992566 1991495 1996397 1996447 1999593 2005177 2014353 2018317 2017230 2030159 2043224 2055589 2057362
11396B057362p413n514N739P469N389R380M861O49L738O326R873J4046J1177P053
11382B130135Q015L449J855O623P803Q574K158j94L970K936J3825J0624L187j313
11368B201647K200J2105J4668N983O05J3177L339L598N731J596Q720Q024P387
11355B288780N455N296O565P905O752R240P960R312J2624J5668J4990O074J5299
11342B411920J7152J4875O244Q411m95q214j2130k5830k3751k1814j0116j1202
11330B345050n774R451J6492J5915R606J1115J1092J0041Q514J2096J0953J6836
11318B471387J1778J0770J1945J0778J9781J6891R892J2248K2839J8215K6833
11307B643357K6826K6577K4428J0045J40r299l2932m2285o5351o2508n1907m2758
$$ plain form
11396 2057362 2049949 2044435 2050174 2057643 2063032 2072412 2077273 2077922 2081660 2087986 2097859 2111905 2123082 2130135
11382 2130135 2138150 2141599 2143454 2150077 2157880 2166454 2168612 2168418 2172388 2175324 2189149 2199773 2202960 2201647
11368 2201647 2203847 2215952 2230620 2236603 2237208 2250385 2253724 2257322 2263053 2264649 2273369 2281393 2288780
11355 2288780 2294235 2299531 2306096 2314001 2320753 2329993 2337953 2347265 2359889 2375557 2390547 2396621 2411920
11342 2411920 2429072 2443947 2450191 2458602 2458107 2449893 2437763 2411933 2388182 2366368 2356252 2345050
11330 2345050 2339276 2348727 2365219 2381134 2390740 2401855 2412947 2422988 2431502 2443598 2454551 2471387
11318 2471387 2483165 2493935 2505880 2516658 2536439 2553330 2563222 2575470 2598309 2616524 2643357
11307 2643357 2670183 2696760 2721188 2731233 2731373 2722074 2689142 2646857 2581506 2518998 2467091 2424333
11295B424333k8221K294J3227J7839J3995J8812J6851J8939J8842J1059J7131
11284B545101K1220J5816J1759J3583K0006K0199J7981K4766K3797J2802Q822
11273B735852J1366P59j844j2265j935j0984j4035j5780j2693j3600k3268k0318
11261B621255j6235j4775j2341o070N554J5873J5903J1142J8393K2501J6253J4531
11249B691984J6927R835J4221K0441J3571J2165N198N08J8596J7930R694L06r014
11236B822362m722j0746j6285r975k161J994J1166Q699J8025J5565J7874J2630
11224B864426J2619J3607J793J1594K0193Q136k306k302J0068J0812R629Q786
11212B967055J4993J8620K0419R502J2848J3205Q913Q794R103J0823Q938R048
$$ plain form
11295 2424333 2396112 2398406 2411633 2429472 2443467 2462279 2479130 2498069 2516911 2527970 2545101
11284 2545101 2566321 2582137 2593896 2607479 2627485 2647684 2665665 2690431 2714228 2727030 2735852
11273 2735852 2747218 2747977 2746133 2733868 2731933 2720949 2706914 2691134 2678441 2664841 2641573 2621255
11261 2621255 2605020 2590245 2577904 2571834 2577388 2593261 2609164 2620306 2638699 2661200 2677453 2691984
11249 2691984 2708911 2718746 2732967 2753408 2766979 2779144 2784342 2784850 2803446 2821376 2831070 2831376 2822362
11236 2822362 2817640 2806894 2790609 2780634 2778473 2780467 2791633 2800332 2818357 2833922 2851796 2864426
11224 2864426 2877045 2890652 2892445 2904039 2924232 2932368 2930062 2927760 2937828 2948640 2958269 2967055
11212 2967055 2982048 3000668 3021087 3030589 3043437 3056642 3065555 3074349 3083452 3094275 3103213 3112261
11200C112261J2804P374O832J2311O512J3857M559J748P153J1710J2119O986J2548
11187C228774R259O312R148L638J2433J9168J4381J2873J6819R740J1843J3916
11175C368304R425Q63j16J0565J9687K0455L261N764J7230J9885J2205J4120Q956
11162C510604R15J5335J7336J4187J867P607J1687J0441R097J7866R443j901J1058
11149C635542J7046P448J3458J9661K1068J8601J7313J4186J0232M721O510J0543
11137C796329J3322J0910J0408P938J0145J4368Q296J2453J2936J1613J7043J8021
11125C943782J0166J0032J8489J8354J6728J2960Q640J170J2440J7841J4332J9456
11113D104390J8229Q768J2777J2246K2844K2866J4395J8251J7642J4192J1184
$$ plain form
11200 3112261 3125065 3132439 3139271 3151582 3158094 3171951 3176510 3178258 3185411 3197121 3209240 3216226 3228774
11187 3228774 3238033 3244345 3253493 3257131 3269564 3288732 3303113 3315986 3332805 3342545 3354388 3368304
11175 3368304 3377729 3378592 3378476 3389041 3408728 3429183 3432444 3438208 3455438 3475323 3487528 3501648 3510604
11162 3510604 3511519 3526854 3544190 3558377 3560244 3567851 3579538 3589979 3599076 3616942 3626385 3624484 3635542
11149 3635542 3652588 3660036 3673494 3693155 3714223 3732824 3750137 3764323 3774555 3779276 3785786 3796329
11137 3796329 3809651 3820561 3830969 3838907 3849052 3863420 3871716 3884169 3897105 3908718 3925761 3943782
11125 3943782 3953948 3963980 3982469 4000823 4017551 4030511 4039151 4040321 4052761 4070602 4084934 4104390
11113 4104390 4122619 4131387 4144164 4156410 4179254 4202120 4216515 4234766 4252408 4266600 4277784
11102D277784J5658J2533J3062J2116J8966J0340J7550K2609J8066J1250P149
11091D437083J3334J7631K0700J7553K2069J6808J3075J4109K0208J1992K3968
11080D628530L1096K0793J4917J4103K4923K7945J8531J8260J7340K4009K3205
11069D863652L2149K4167K2014K2903J5453K4414K4861K1670K3020J9671K5103
11058E119077L0955K5920K1520K3866K6290K4065J9191L1442K6046K4962K5813
11047E399147J5553J9529K0504K5953L6624K9112K5469L3100L4176K6070L5091
11036E700328L8857K8368K3244K8626L6652M1568L3355L0423L0864L5173L8385
11025F065843L1735L0290L5109L8701L6552K9615L1073M2447L9244M9643M6693
$$ plain form
11102 4277784 4293442 4305975 4319037 4331153 4350119 4360459 4378009 4400618 4418684 4429934 4437083
11091 4437083 4450417 4468048 4488748 4506301 4528370 4545178 4558253 4572362 4592570 4604562 4628530
11080 4628530 4659626 4680419 4695336 4709439 4734362 4762307 4780838 4799098 4816438 4840447 4863652
11069 4863652 4895801 4919968 4941982 4964885 4980338 5004752 5029613 5051283 5074303 5093974 5119077
11058 5119077 5150032 5175952 5197472 5221338 5247628 5271693 5290884 5322326 5348372 5373334 5399147
11047 5399147 5414700 5434229 5454733 5480686 5517310 5546422 5571891 5604991 5639167 5665237 5700328
11036 5700328 5739185 5767553 5790797 5819423 5856075 5897643 5930998 5961421 5992285 6027458 6065843
11025 6065843 6097578 6127868 6162977 6201678 6238230 6267845 6298918 6341365 6380609 6430252 6476945
11014F476945M8216M4891L8167M0330K8241L2225L6810M0151M9549N3265O3014
11003F951804O8320P3461P1878O1509N9683N8542M1866K0122K2197M997r646L888
10991G428621K2805L2463M5556O7833P1962P5356P4573Q0154Q1693Q1008P5453
10980H137477P1897Q2584Q0449R2389R5865R2167Q9628R8594J11147J18000J19146
10969I189343J18491J19545J16563Q9689P4093O7271O1277N5798P6458R2770J00843
10958A0162141J36290J49404J66332J83281J83749J92172K01966K00230K03348
10949A1778913K15056K29966K40973K48115K67461K85063L08852L31909L46850
10940A4253158L67624L90756M12254M39441M69437N01128N41395N98085O76219
$$ plain form
11014 6476945 6525161 6570052 6608219 6648549 6676790 6709015 6745825 6785976 6835525 6888790 6951804
11003 6951804 7020124 7093585 7165463 7226972 7286655 7345197 7387063 7407185 7429382 7434379 7424733 7428621
10991 7428621 7451426 7483889 7529445 7597278 7669240 7744596 7819169 7899323 7981016 8062024 8137477
10980 8137477 8209374 8291958 8372407 8464796 8560661 8652828 8742456 8841050 8952197 9070197 9189343
10969 9189343 9307834 9427379 9543942 9633631 9707724 9774995 9836272 9892070 9968528 10061298 10162141
10958 10162141 10298431 10447835 10614167 10797448 10981197 11173369 11375335 11575565 11778913
10949 11778913 11993969 12223935 12464908 12713023 12980484 13265547 13574399 13906308 14253158
10940 14253158 14620782 15011538 15423792 15863233 16332670 16833798 17375193 17973278 18649497
10931A8649497P73376R24373J092230J291923J489064J628556J591501J180781
10923B8621301K00327j348428l153116m715022n633385n675307m754317l087577
10915D54476j255539J69467R67818J267921J302100J228778J118599J012435R20541
10906G186596Q46872P82271P42778P23739P33802P87407Q41106R00731R76904
10897A4522206J066613J183913J345415J569630J860728K204085K593195K954330
10889B9300115L099316K721126J418282j056924m430973p870364j0436011j1497729
10881A246838j0734961q200709m662819j327888R13758J974396K217386K089709
10873a6484290J839020J584308J356514J164936J031459R27496Q52415Q03056
$$ plain form
10931 18649497 19422873 20347246 21439476 22731399 24220463 25849019 27440520 28621301
10923 28621301 28821628 27473200 24320084 19605062 13971677 8296370 3542053 454476
10915 454476 -801063 -631596 336222 1604143 2906243 4135021 5253620 6266055 7186596
10906 7186596 8033468 8815739 9558517 10282256 11016058 11803465 12644571 13545302 14522206
10897 14522206 15588819 16772732 18118147 19687777 21548505 23752590 26345785 29300115
10889 29300115 32399431 35120557 36538839 35481915 31050942 23180578 12744567 1246838
10881 1246838 -9488123 -17688832 -22351651 -23679539 -22765781 -20791385 -18573999 -16484290
10873 -16484290 -14645270 -13060962 -11704448 -10539512 -9508053 -8580557 -7728142 -6925086
10865f925086P51736P04294O76466O57280O58521P03589P81894Q90078J024213
10856g7015J173085J309233J443325J540136J494768J147563L29074j014311k664859
10847D680999m178402n154544n355397m669945l225845j512334q1666P64076J091381
10838a7641677J109267J010348Q84651P48718O31882N32419M66654M10730L67996
10829a1479012L41019L33661L21867L04401K84262K58358K53843K36429K27583
10820h917589K27884K23622K17034J99911J77396J63129J57738J47954J45660
10811g257261J49500J48717J54284J47618J48678J43160J37792J30383J30438
10802e966691J34648J29317J19850J15852J15525J07876J08979J02237J10112
$$ plain form
10865 -6925086 -6173350 -5469056 -4792590 -4135310 -3476789 -2773200 -1991306 -1101228 -77015
10856 -77015 1096070 2405303 3848628 5388764 6883532 8031095 8360169 7345858 4680999
10847 4680999 502597 -4651947 -10007344 -14677289 -17903134 -19415468 -19497134 -18733058 -17641677
10838 -17641677 -16532410 -15522062 -14637411 -13888693 -13256811 -12724392 -12257738 -11847008 -11479012
10829 -11479012 -11137993 -10804332 -10482465 -10178064 -9893802 -9635444 -9381601 -9145172 -8917589
10820 -8917589 -8689705 -8466083 -8249049 -8049138 -7871742 -7708613 -7550875 -7402921 -7257261
10811 -7257261 -7107761 -6959044 -6804760 -6657142 -6508464 -6365304 -6227512 -6097129 -5966691
10802 -5966691 -5832043 -5702726 -5582876 -5467024 -5351499 -5243623 -5134644 -5032407 -4922295
10793d922295J09543J00227R9181Q8627R4953R4490Q7872R0490R9298Q9879Q1059
10782c886676R7953Q5802Q4402Q2876Q1750Q4292P9454P5182P1073P2828P0659
10771c000405N8577O5388O9950O5268O7521N6110N6758N4486N7508N7816O2021
10760b329002N1329M7677M8718N2276N9258O6262O7990O7132O2374N9926O1396
10749a684664O9929N7945N7829M9054N0235M2395M6105N3791N9503N8115N2312
10738a087451M3732M7843N3438M1057M4327N0484M9449M5140M6068M1013L8680
10727e86220N3947M5541L9374N0063M3060M0176M5900M6565N3502N0993M9264
10716f7835M5234M6912M8755M7250M5364M9398M8746N1539N3238N2116N4972N6666
$$ plain form
10793 -4922295 -4812752 -4712525 -4613344 -4524717 -4429764 -4335274 -4247402 -4156912 -4057614 -3967735 -3886676
10782 -3886676 -3788723 -3702921 -3618519 -3535643 -3453893 -3369601 -3290147 -3214965 -3143892 -3071064 -3000405
10771 -3000405 -2941828 -2876440 -2806490 -2741222 -2673701 -2617591 -2560833 -2506347 -2448839 -2391023 -2329002
10760 -2329002 -2277673 -2229996 -2181278 -2129002 -2069744 -2003482 -1935492 -1868360 -1805986 -1746060 -1684664
10749 -1684664 -1614735 -1556790 -1498961 -1449907 -1399672 -1357277 -1311172 -1257381 -1197878 -1139763 -1087451
10738 -1087451 -1043719 -995876 -942438 -901381 -857054 -806570 -757121 -711981 -665913 -624900 -586220
10727 -586220 -532273 -486732 -447358 -397295 -354235 -314059 -268159 -221594 -168092 -117099 -67835
10716 -67835 -22601 24311 73066 120316 165680 215078 263824 315363 368601 420717 475689 532355
10704E32355N6149O0022O3069P4018P6940P6012Q8906J01568J02241J11402J02912
10693A445594P2599L0252m2277j18886j99550k56393k77240k47953k10511j45885
10683D9750n8998O006M9702O6328P6501P7388O6073P0859P0150N7308M9547M8164
10671F28778M8363M4670M2531M8411M4394L4800K7038L5555M0303M8660L6108
10660A079611K4441L0937L1725L5325K9040K4910K7678L4158L3467L0427L1489
10649A413208L2065L2979K6028K2679K3872K7342L1071L5691L5951L6273K6723
10638A743882L0954L7722L6070L1331L7587L1166L0646L5334K8274J6416K6888
10627B086270K7342K4503K1211K3007J9805K2456J7201J3808K8300K8886K9105
$$ plain form
10704 532355 588504 648526 711595 785613 862553 938565 1027471 1129039 1231280 1342682 1445594
10693 1445594 1518193 1548445 1506168 1387282 1187732 931339 654099 406146 195635 49750
10683 49750 -9248 -3242 46460 112788 189289 266677 332750 403609 473759 531067 580614 628778
10671 628778 677141 721811 764342 812753 857147 891947 918985 954540 994843 1043503 1079611
10660 1079611 1104052 1134989 1166714 1202039 1231079 1255989 1283667 1317825 1351292 1381719 1413208
10649 1413208 1445273 1478252 1504280 1526959 1550831 1578173 1609244 1644935 1680886 1717159 1743882
10638 1743882 1774836 1812558 1848628 1879959 1917546 1948712 1979358 2014692 2042966 2059382 2086270
10627 2086270 2113612 2138115 2159326 2182333 2202138 2224594 2241795 2255603 2283903 2312789 2341894
10616B341894J9645K2012K9919K8749K9743K5285K6072L0132K7531K0999J8061
10605B620042J3188J7941L0572L2259L2583L0398M9695M2387L5062L2093L7275
10594B973495L2766L2883L6616L0303K7964K4655K2771J4000J3155J6124J8349
10583C243081K1251K7432L0798L2398K8951K6330K8415K6387J6266K5785K1997
10572C529091K3066K1168K9941L6950M3881M3780M2849L9386M2880M0172L8218
10561C931382M0077M5829M1108L7739M1980M3347M5492M0825M1853N4807O0227
10550D424666N5241N5150O6000P9790Q7907P4709L0480o0393j34266j58624j73046
10539D347614j73174p5739K5154O9814P6872P3786P1570Q2337P8020P2674N9409
$$ plain form
10616 2341894 2361539 2383551 2413470 2442219 2471962 2497247 2523319 2553451 2580982 2601981 2620042
10605 2620042 2633230 2651171 2681743 2714002 2746585 2776983 2826678 2869065 2904127 2936220 2973495
10594 2973495 3006261 3039144 3075760 3106063 3134027 3158682 3181453 3195453 3208608 3224732 3243081
10583 3243081 3264332 3291764 3322562 3354960 3383911 3410241 3438656 3465043 3481309 3507094 3529091
10572 3529091 3552157 3573325 3603266 3640216 3684097 3727877 3770726 3810112 3852992 3893164 3931382
10561 3931382 3971459 4017288 4058396 4096135 4138115 4181462 4226954 4267779 4309632 4364439 4424666
10550 4424666 4479907 4535057 4601057 4680847 4768754 4843463 4873943 4813550 4679284 4520660 4347614
10539 4347614 4174440 4098701 4123855 4193669 4270541 4344327 4415897 4498234 4576254 4648928 4708337
10528D708337M7465M1154L5852L0883J2324J358Q672K0705L3290L6994L5171K7156
10516E039361K9633K6638L7340M0781M1932M0381M3720M4810M7762N0769N1186
10505E494313M5827M6433N2063N2970M6616M4287L3360K2778J4197J2510M955
10494E870309l446O518J6921J5203K6923L3612M0888M8097N2519M6867N0771N9588
10482F264770O4034O3615N7266N1604N0043M7826N2220N4848M2851L7959M0196
10471F827232N2409O4145O7508P4608Q0020P9833O7142N1678L7460J1466k776
10460G410725j5982m829O803J2095Q310J6368L3195L5341M6533O2992P5665P4503
10448G761719O9774O8325N9047N5751O2070O9622Q2624R0119R4929R5084Q0160
$$ plain form
10528 4708337 4755802 4796956 4832808 4863691 4876015 4877373 4886045 4906750 4940040 4977034 5012205 5039361
10516 5039361 5068994 5095632 5132972 5173753 5215685 5256066 5299786 5344596 5392358 5443127 5494313
10505 5494313 5540140 5586573 5638636 5691606 5738222 5782509 5815869 5838647 5852844 5865354 5870309
10494 5870309 5866863 5873381 5890302 5905505 5932428 5966040 6006928 6055025 6107544 6154411 6205182 6264770
10482 6264770 6328804 6392419 6449685 6501289 6551332 6599158 6651378 6706226 6749077 6787036 6827232
10471 6827232 6879641 6943786 7011294 7085902 7165922 7245755 7312897 7364575 7402035 7413501 7410725
10460 7410725 7394743 7389914 7396717 7408812 7417122 7433490 7466685 7502026 7548559 7611551 7687216 7761719
10448 7761719 7831493 7899818 7958865 8014616 8076686 8146308 8228932 8319051 8413980 8509064 8589224
10437H589224P6400P6510O7316O3137O4816O9994P8104R2316R9691Q6004P4479
10426I437991N8398M1128K7160J9745K4013L3447M3950O7782Q4118R1382Q8426
10415A0017540R3463J02598R9500R9527R9631R4671J06016J10346J09244J01839
10405A1034375J04103R8202R9430R4946R6987R6510Q3411O3399M3306K6788J8983
10394A1860440J8274N1182J12963J54546J55808J45746J25923J28488J35966J20832
10384A3010168J24095J26432J18683J28950J43765J45452J57549J51819J46807
10375A4253720J38295J26293J19859J25468J36347J45972J50917J49975J56863
10366A5503709J63629J66081J71582J83801J87971K01469K07383K15772K23548
$$ plain form
10437 8589224 8665624 8742134 8809450 8872587 8937403 9007397 9085501 9177817 9277508 9363512 9437991
10426 9437991 9496389 9537517 9564677 9584422 9608435 9641882 9685832 9753614 9837732 9929114 10017540
10415 10017540 10111003 10213601 10313101 10412628 10512259 10606930 10712946 10823292 10932536 11034375
10405 11034375 11138478 11236680 11336110 11431056 11528043 11624553 11707964 11771363 11814669 11841457 11860440
10394 11860440 11878714 11929896 12042859 12197405 12353213 12498959 12624882 12753370 12889336 13010168
10384 13010168 13134263 13260695 13379378 13508328 13652093 13797545 13955094 14106913 14253720
10375 14253720 14392015 14518308 14638167 14763635 14899982 15045954 15196871 15346846 15503709
10366 15503709 15667338 15833419 16005001 16188802 16376773 16578242 16785625 17001397 17224945
10357A7224945K29041K39883K53970K49729K43387K38291K42608K50877K58529
10348A9431260K49601K49885K56007K62731K62230K69203K93499L16965L27328
10339B1918709L39588L50209L60198L69950L58673L48311L55668L65558L84738
10330B5151602M14179M43605M55327M67409M77106M90712N14837N50481N90212
10321B9555470O17181O33706O42865O60070O68885O64331O62923O80671P22422
10312C5508524P76944Q35439R01566R80597J042086J096574J147828J182146J216616
10303D4688320J262252J330775J421593J527431J650129J768002J904729K045851
10295E7599082K223137K433271K653724K882879L105111L301677L433983L522394
$$ plain form
10357 17224945 17453986 17693869 17947839 18197568 18440955 18679246 18921854 19172731 19431260
10348 19431260 19680861 19930746 20186753 20449484 20711714 20980917 21274416 21591381 21918709
10339 21918709 22258297 22608506 22968704 23338654 23697327 24045638 24401306 24766864 25151602
10330 25151602 25565781 26009386 26464713 26932122 27409228 27899940 28414777 28965258 29555470
10321 29555470 30172651 30806357 31449222 32109292 32778177 33442508 34105431 34786102 35508524
10312 35508524 36285468 37120907 38022473 39003070 40045156 41141730 42289558 43471704 44688320
10303 44688320 45950572 47281347 48702940 50230371 51880500 53648502 55553231 57599082
10295 57599082 59822219 62255490 64909214 67792093 70897204 74198881 77632864 81155258
10287H1155258L648531L917573M368774M984797N857820P075857Q588475J0376102
10279A29973187J2600137J5315504J8356217K1247686K2227057J6736042j300443
10272B35155387l1083733n9445216p4835013q1280840q0974093o2647747k6912485
10265a82023740K131430J4142797J5645713J3913770J1670714R648452Q072748
10258a06798116O842220N791287M926175M227249L629965L103336K697833K434590
10250g3145461K293992K198654K047229J800193J468292J182236J012368R20267
10242f0222230R52930J175301J404585J493936J475686J422056J345235J243417
10234d9709084J122549J031675R43671Q77021Q30202Q25464Q17596P98499Q02040
$$ plain form
10287 81155258 84803789 88721362 93090136 98074933 103932753 111008610 119597085 129973187
10279 129973187 142573324 157888828 176245045 197492731 219719788 236455830 235155387
10272 235155387 204071654 144626438 69791425 -11489415 -92463508 -155111255 -182023740
10265 -182023740 -179892310 -165749513 -150103800 -136190030 -124519316 -114870864 -106798116
10258 -106798116 -99955896 -94164609 -89238434 -85011185 -81381220 -78277884 -75580051 -73145461
10250 -73145461 -70851469 -68652815 -66605586 -64805393 -63337101 -62154865 -61142497 -60222230
10242 -60222230 -59269300 -58093999 -56689414 -55195478 -53719792 -52297736 -50952501 -49709084
10234 -49709084 -48586535 -47554860 -46611189 -45734168 -44903966 -44078502 -43260906 -42462407 -41660367
10225d1660367P97785P69570P36303P01831O66360O36836O08056N78793N53967
10216c5610866N30559N00532M76887M60529M39609M26243M28096M26119M03565
10207c1518727L78975L79182L72663L61789L45094L47563L52477L33926L28733
10198b8318325L25940L41015L53942L43281L34113L32934L15938K96932K74054
10189b5400176K49015K32508K27418K34647K31905K31831K29502K25669K21415
10180b3316266K33930K44938K49527K46259K53137K55586K48053K51275K56824
10171b1076737K42303K35366K36568K43404K41054K35453K27443K35134K33586
10162a8946426K42065K59395K76354K83881K10197K9394j62040k86909l45495
$$ plain form
10225 -41660367 -40862582 -40093012 -39356709 -38654878 -37988518 -37351682 -36743626 -36164833 -35610866
10216 -35610866 -35080307 -34579775 -34102888 -33642359 -33202750 -32776507 -32348411 -31922292 -31518727
10207 -31518727 -31139752 -30760570 -30387907 -30026118 -29681024 -29333461 -28980984 -28647058 -28318325
10198 -28318325 -27992385 -27651370 -27297428 -26954147 -26620034 -26287100 -25971162 -25674230 -25400176
10189 -25400176 -25151161 -24918653 -24691235 -24456588 -24224683 -23992852 -23763350 -23537681 -23316266
10180 -23316266 -23082336 -22837398 -22587871 -22341612 -22088475 -21832889 -21584836 -21333561 -21076737
10171 -21076737 -20834434 -20599068 -20362500 -20119096 -19878042 -19642589 -19415146 -19180012 -18946426
10162 -18946426 -18704361 -18444966 -18168612 -17884731 -17674534 -17645140 -17807180 -18094089 -18439584
10153a8439584l53578k54898j8035J71351K41197K35121K08802J99817J82652
10144a7827155J78596J88773J85889J79252J67857J56990J69246J77306J74046
10135a6249200J84597J71278J63995J63605J54854J45687J44910J55948J57602
10126a4806724J53879J56960J52598J53431J56574J44318J05154O0989J5223j5964
10116a3723562l3083j7902K7902P0115Q7395J03788J11351J15157J12491J10948
10106a3035400J17570J17642J17041J04752R3139R0612P1090N5002N8412O7790
10096a2142350O3293O3902O9762P5791P8616P9404P2030P9582P8592P4527Q6486
10085a1320365R3604Q2422P0256O7562O4934O0205M9650M4493N1805N6048N3058
$$ plain form
10153 -18439584 -18793162 -19048060 -19066095 -18894744 -18653547 -18418426 -18209624 -18009807 -17827155
10144 -17827155 -17648559 -17459786 -17273897 -17094645 -16926788 -16769798 -16600552 -16423246 -16249200
10135 -16249200 -16064603 -15893325 -15729330 -15565725 -15410871 -15265184 -15120274 -14964326 -14806724
10126 -14806724 -14652845 -14495885 -14343287 -14189856 -14033282 -13888964 -13783810 -13722821 -13707598 -13723562
10116 -13723562 -13756645 -13774547 -13746645 -13676530 -13589135 -13485347 -13373996 -13258839 -13146348 -13035400
10106 -13035400 -12917830 -12800188 -12683147 -12578395 -12485256 -12394644 -12323554 -12268552 -12210140 -12142350
10096 -12142350 -12079057 -12015155 -11945393 -11869602 -11790986 -11711582 -11639552 -11559970 -11481378 -11406851 -11320365
10085 -11320365 -11226761 -11144339 -11074083 -11006521 -10941587 -10881382 -10831732 -10787239 -10735434 -10679386 -10626328
10074a0626328N2577N6055N1165N0691N0676N5238O6626O9515O9716P6330Q2160
10063i945579Q1070N6729K5346l631k9291m1835m0059j1438J3999M2854N8917
10052i792918N4726N8815N8649N3156M4294M9633M4973M2614M5957M5508M4223
10041i250370M8583M8390M5884M4688N1045M2729M4075M2963L7669L7649L7308
10030h769387L6187M0377L6590L6375L2422K8485K7846L2672K9386L2010L7381
10019h399656M1046L8552L0624K0592K9418L1030L3944K9827K9191K8360L3266
10008h053806J6435R019J6922J3391J8000L0236L9326M0219L8744L5186L6753
9997g759575K6614K9431M0722L9119M4129L9266L5661M3381L6140L3865L6476
$$ plain form
10074 -10626328 -10573751 -10517696 -10466531 -10415840 -10365164 -10309926 -10243300 -10173785 -10104069 -10027739 -9945579
10063 -9945579 -9864509 -9807780 -9782434 -9786065 -9815356 -9857191 -9897250 -9908688 -9894689 -9851835 -9792918
10052 -9792918 -9738192 -9679377 -9620728 -9567572 -9523278 -9473645 -9428672 -9386058 -9340101 -9294593 -9250370
10041 -9250370 -9201787 -9153397 -9107513 -9062825 -9011780 -8969051 -8924976 -8882013 -8844344 -8806695 -8769387
10030 -8769387 -8733200 -8692823 -8656233 -8619858 -8587436 -8558951 -8531105 -8498433 -8469047 -8437037 -8399656
10019 -8399656 -8358610 -8320058 -8289434 -8268842 -8239424 -8208394 -8174450 -8144623 -8115432 -8087072 -8053806
10008 -8053806 -8037371 -8028352 -8011430 -7998039 -7980039 -7949803 -7910477 -7870258 -7831514 -7796328 -7759575
9997 -7759575 -7732961 -7703530 -7662808 -7623689 -7579560 -7540294 -7504633 -7461252 -7425112 -7391247 -7354771
9986g354771K8309L3184K9594K2489K5756L0797L2151K4236J9360K0404K5132
9975g063359K5319L1101L1178J7874K5126L1470K4581K9274L2645L1384L1470
9964f751937K5315R991P755P188k282J1593K2303K3327L2834L2709L7095L1421
9952f512688K9186K5171K7987L4555K3366J9368L0622L2154K4073J0920R617J1017
9940f234652J3718J2393J0371J5525J9801L0373L2906K9867L3156K8287K5679
9929e982576K3236J6040J8428K0584J8502K4010K7736L0221K3655J5224K4343
9918e740597K4595L0446K6271J5900J9854L0574K7604K1370K4414K1855J3427
9907e484287J1284K7074J8066J2000J7630K2710J8270J9313J4403R223J4295K2480
$$ plain form
9986 -7354771 -7326462 -7293278 -7263684 -7241195 -7215439 -7184642 -7152491 -7128255 -7108895 -7088491 -7063359
9975 -7063359 -7038040 -7006939 -6975761 -6957887 -6932761 -6901291 -6876710 -6847436 -6814791 -6783407 -6751937
9964 -6751937 -6726622 -6716631 -6708876 -6701688 -6703970 -6692377 -6670074 -6646747 -6613913 -6581204 -6544109 -6512688
9952 -6512688 -6483502 -6458331 -6430344 -6395789 -6372423 -6353055 -6322433 -6290279 -6266206 -6255286 -6245669 -6234652
9940 -6234652 -6220934 -6208541 -6198170 -6182645 -6162844 -6132471 -6099565 -6069698 -6036542 -6008255 -5982576
9929 -5982576 -5959340 -5943300 -5924872 -5904288 -5885786 -5861776 -5834040 -5803819 -5780164 -5764940 -5740597
9918 -5740597 -5716002 -5685556 -5659285 -5643385 -5623531 -5592957 -5565353 -5543983 -5519569 -5497714 -5484287
9907 -5484287 -5473003 -5445929 -5427863 -5415863 -5398233 -5375523 -5357253 -5337940 -5323537 -5314314 -5300019 -5277539
9895e277539K4491K4048K1581K5141K2097K7048K4275J5713K4082K5856K4549
9884e018658K3440K8552K7080K9226K8167K0286J5968J4142K8240L1895L4441
9873d737221K7926K9428M0923L2487J5840R097J5779J6613J6018K4953L6024M2911
9861d429222M2223N3408O1026N6128O1770N9895P3233Q8808R6964J00645P7923
9850c657199M2845j8729r4284j80178k44410k73361k77398k35573j73491r1445
9840e203223k5455K4134O3634P7016P9530Q0525O9025O8601O0158N0763M9982
9829d605310N4735N9051N3339O0235O1812O6210P4364Q5815R2672J05187J37087
9818c754803J58789J90561K38756K62245K02095j6604l59311o21557p30081p85184
$$ plain form
9895 -5277539 -5253048 -5229000 -5207419 -5182278 -5160181 -5133133 -5108858 -5093145 -5069063 -5043207 -5018658
9884 -5018658 -4995218 -4966666 -4939586 -4910360 -4882193 -4861907 -4845939 -4831797 -4803557 -4771662 -4737221
9873 -4737221 -4709295 -4679867 -4638944 -4606457 -4590617 -4581520 -4565741 -4549128 -4533110 -4508157 -4472133 -4429222
9861 -4429222 -4386999 -4333591 -4272565 -4216437 -4154667 -4094772 -4021539 -3932731 -3835767 -3735122 -3657199
9850 -3657199 -3614354 -3633083 -3727367 -3907545 -4151955 -4425316 -4702714 -4938287 -5111778 -5203223
9840 -5203223 -5228678 -5204544 -5140910 -5063894 -4984364 -4903839 -4834814 -4766213 -4706055 -4655292 -4605310
9829 -4605310 -4550575 -4491524 -4438185 -4377950 -4316138 -4249928 -4175564 -4089749 -3997077 -3891890 -3754803
9818 -3754803 -3596014 -3405453 -3166697 -2904452 -2702357 -2718961 -3078272 -3699829 -4429910 -5215094
9808e215094p14499l51701L0416K04276J94868J59148J30718J11851R9064P7534
9798e273419O6381O1910N5162N5931M5936N0112M5125L9683L1188K0286J7118
9787d784587J7240K3138K5349K2185K0914K7068K7424L0337K3539K5268J4927
9776d527198J6475J6101J4864K3567J6470J7256J5158J3871Q139J5212K5467J5907
9764d328711J9014K7520K4102J8156J9221J9201J7516J5436J5623J5839J9077
9753d118006J8916J6876R128M963P393K308Q294L666J0069J6165L2566K6612K6115
9740c934935L4357L3938L0304K5639J6643q391l2371m3557n6727n5787l6643j6576
9728d044106M989K1136K0270K3020J9653J3672J1813L066J2583K1347K1564J0595
$$ plain form
9808 -5215094 -5929593 -6281294 -6250878 -6046602 -5851734 -5692586 -5561868 -5450017 -5350953 -5273419
9798 -5273419 -5207038 -5145128 -5089966 -5034035 -4988099 -4937987 -4892862 -4853179 -4821991 -4801705 -4784587
9787 -4784587 -4767347 -4744209 -4718860 -4696675 -4675761 -4648693 -4621269 -4590932 -4567393 -4542125 -4527198
9776 -4527198 -4510723 -4494622 -4479758 -4456191 -4439721 -4422465 -4407307 -4393436 -4385297 -4370085 -4344618 -4328711
9764 -4328711 -4309697 -4282177 -4258075 -4239919 -4220698 -4201497 -4183981 -4168545 -4152922 -4137083 -4118006
9753 -4118006 -4099090 -4082214 -4073086 -4068123 -4060730 -4058422 -4050128 -4046462 -4036393 -4020228 -3987662 -3961050 -3934935
9740 -3934935 -3900578 -3866640 -3836336 -3810697 -3794054 -3802445 -3834816 -3878373 -3935100 -3990887 -4027530 -4044106
9728 -4044106 -4039117 -4017981 -3997711 -3974691 -3955038 -3941366 -3929553 -3926487 -3913904 -3892557 -3870993 -3860398
9716c860398J1187J8103K1477J5341J3530K0912J6088J9505J3434Q743J3262J4236
9704c674580K2722K0735J8022K0558J5467J4462J7563J5734J0165J2057J3552
9693c493543J1806J6316J8020K4611K1313L5541M5380M6979M7264N3681L5336
9682c137296L669j4207m2177p5948j06237j15191j05583q9363n2877j8786N216
9671c748780K3547K7599L7510M0174K4918J7008K8792K3522K2429J8872J7978
9660c466431K1704J6838P725N952P704Q081P076Q554R203Q361J1445J0277J0977
9647c332534R597P671J3336J8439J0988J7396J1589O826J2150J6673P214J8023
9635c182632P239J1916J0624Q171J1500J0853J0147J660K361M361N909j62n008
$$ plain form
9716 -3860398 -3849211 -3831108 -3809631 -3794290 -3780760 -3759848 -3743760 -3724255 -3710821 -3702078 -3688816 -3674580
9704 -3674580 -3651858 -3631123 -3613101 -3592543 -3577076 -3562614 -3545051 -3529317 -3519152 -3507095 -3493543
9693 -3493543 -3481737 -3465421 -3447401 -3422790 -3401477 -3365936 -3320556 -3273577 -3226313 -3172632 -3137296
9682 -3137296 -3133627 -3147834 -3190011 -3265959 -3372196 -3487387 -3592970 -3682333 -3735210 -3753996 -3748780
9671 -3748780 -3725233 -3697634 -3660124 -3619950 -3595032 -3578024 -3549232 -3525710 -3503281 -3484409 -3466431
9660 -3466431 -3444727 -3427889 -3420164 -3414212 -3406508 -3398427 -3391351 -3382797 -3373594 -3365233 -3353788 -3343511 -3332534
9647 -3332534 -3322937 -3315266 -3301930 -3283491 -3272503 -3255107 -3243518 -3236692 -3224542 -3207869 -3200655 -3182632
9635 -3182632 -3175393 -3163477 -3152853 -3144682 -3133182 -3122329 -3112182 -3110522 -3108161 -3103800 -3097891 -3098053 -3103061
9622c103061l353J0098J0751O195L756O581J0188P198J5139J1440J0123N905j12
9609c009152R070J1218R663O477L468M695J4624J1064R570P162N878L676J1292
9596b901295Q634P394Q191J0490J2392J3678O479m635k126M204N705N783O834
9583b818272J3183K1459J923N318Q677K438Q486J0974N241Q291N636Q938K460
9570b715248L365R294N277N273P156P614J3322P190J1249J5457N230j810L485
9557b623146R844P231J1626J3793R876J0933K1830P643M872m1l036k153J0732
9544b519996m9n900Q5j949P45O192J6154K0121J3041J9176J1014O671R873J2332
9530b412490N151L12L379N201j812K236K343j731N475J3877L663J559J1039O865
$$ plain form
9622 -3103061 -3106414 -3096316 -3085565 -3079370 -3075614 -3069033 -3058845 -3051647 -3036508 -3025068 -3014945 -3009040 -3009152
9609 -3009152 -3000082 -2988864 -2979201 -2972724 -2969256 -2964561 -2949937 -2938873 -2929303 -2922141 -2916263 -2912587 -2901295
9596 -2901295 -2892661 -2885267 -2877076 -2866586 -2854194 -2840516 -2834037 -2838672 -2840798 -2836594 -2830889 -2825106 -2818272
9583 -2818272 -2805089 -2783630 -2781707 -2776389 -2767712 -2765274 -2756788 -2745814 -2740573 -2732282 -2726646 -2717708 -2715248
9570 -2715248 -2711883 -2702589 -2697312 -2692039 -2684883 -2677269 -2663947 -2656757 -2645508 -2630051 -2624821 -2626631 -2623146
9557 -2623146 -2613302 -2606071 -2594445 -2580652 -2570776 -2559843 -2538013 -2530370 -2525498 -2525539 -2528575 -2530728 -2519996
9544 -2519996 -2520045 -2525945 -2525860 -2527809 -2527064 -2520872 -2504718 -2484597 -2471556 -2452380 -2441366 -2434695 -2424822 -2412490
9530 -2412490 -2407339 -2407027 -2403648 -2398447 -2400259 -2398023 -2395680 -2397411 -2391936 -2378059 -2374396 -2372837 -2361798 -2354933
9516b354933J523L493J1097J4992J3396J1079R016J4091J3223j629q527n701j6948
9503b295828k3386j8872j2966M632N858K971K0508J4701R123J0703Q280Q446j18
9490b265948N831J8373O503k496M210P846R885P404n698r32N475J1344l651l04
9476b202158R512Q463O343Q988J3338Q296N354J1381J5752J1514P878k881j2940
9463b111160n249Q833M770N80P927j298J172O521J0763M956J969Q679J1897J1096
9449b038544N913P994R080M073K909J1099O698J1228J3458K927L062J2602K666
9436a944835J919L705O831J270n66m973k388R032J7985J0897Q444Q338N723K839
9422a875779K817J3161J3975P120L206J0682J0997k06l845Q340M876K600N914
$$ plain form
9516 -2354933 -2353410 -2349917 -2338820 -2323828 -2310432 -2299353 -2290337 -2276246 -2263023 -2264652 -2273179 -2278880 -2295828
9503 -2295828 -2319214 -2338086 -2351052 -2346420 -2340562 -2337591 -2317083 -2302382 -2293259 -2282556 -2274276 -2265830 -2265948
9490 -2265948 -2260117 -2241744 -2235241 -2237737 -2233527 -2225681 -2215796 -2208392 -2214090 -2215022 -2209547 -2198203 -2201854 -2202158
9476 -2202158 -2192646 -2184183 -2177840 -2168852 -2155514 -2147218 -2141864 -2130483 -2114731 -2103217 -2095339 -2098220 -2111160
9463 -2111160 -2116409 -2107576 -2102806 -2102226 -2094299 -2095597 -2094425 -2087904 -2077141 -2072185 -2070216 -2061537 -2049640 -2038544
9449 -2038544 -2032631 -2024637 -2015557 -2011484 -2008575 -1997476 -1990778 -1979550 -1966092 -1963165 -1960103 -1947501 -1944835
9436 -1944835 -1942916 -1939211 -1932380 -1931110 -1931676 -1936649 -1939037 -1930005 -1912020 -1901123 -1892679 -1884341 -1878618 -1875779
9422 -1875779 -1872962 -1859801 -1845826 -1838706 -1835500 -1824818 -1813821 -1814027 -1817872 -1809532 -1804656 -1802056 -1796142
9409a796142J2154R229J3138R679L847N404J0765M882Q621L647L712Q393J21j010
9395a703560M684O281L546K230N212M071L175Q151P967L531J521L979N057M399
9381a639756K561K422P836J1056Q269R184J0688O271J2390N406M601R097R090
9368a540885J3774N930o70M805N242J3913K821O350N001j367o95J5472N301K704
9354a462304K666K011J2026J0401Q711P021P205Q900J0492M178O611O364J0068
9341a365650R521K004K987K761K615L772J6947R824N89L223N358O944J2771P035
9327a279299j542R651J1822O104O736P257Q524Q109L714K859Q798J0373M926O694
9313a185274K866Q787Q103P015N586J2709J0503q91P593J1143O774O367J1289
$$ plain form
9409 -1796142 -1783988 -1774759 -1761621 -1751942 -1748095 -1742691 -1731926 -1727044 -1718423 -1714776 -1711064 -1702671 -1702550 -1703560
9395 -1703560 -1698876 -1692595 -1689049 -1686819 -1681607 -1677536 -1674361 -1666210 -1658243 -1654712 -1653191 -1649212 -1644155 -1639756
9381 -1639756 -1637195 -1634773 -1626937 -1615881 -1607612 -1598428 -1587740 -1581469 -1569079 -1563673 -1559072 -1549975 -1540885
9368 -1540885 -1527111 -1521181 -1521851 -1517046 -1511804 -1497891 -1495070 -1488720 -1483719 -1485086 -1485781 -1470309 -1465008 -1462304
9354 -1462304 -1459638 -1457627 -1445601 -1435200 -1426489 -1419468 -1412263 -1403363 -1392871 -1388693 -1382082 -1375718 -1365650
9341 -1365650 -1356129 -1354125 -1351138 -1348377 -1345762 -1341990 -1325043 -1315219 -1314630 -1311407 -1306049 -1299105 -1286334 -1279299
9327 -1279299 -1280841 -1271190 -1259368 -1253264 -1246528 -1239271 -1230747 -1222638 -1218924 -1216065 -1207267 -1196894 -1191968 -1185274
9313 -1185274 -1182408 -1173621 -1165518 -1158503 -1152917 -1140208 -1129705 -1130596 -1123003 -1111860 -1105086 -1098719 -1087430
9300a087430L029J2175J1440J3314M15q547K701P504R184P873J1440J4210Q259
9287i94433O382J1883P803M145N034q99Q199J2086J4276P167J5599R444O678J0004
9273h76632J151L811J4510J0699N839M590N399Q300P793J7804J0217P247M348
9260g74924J0197K336J4071J0496O229P787J0719R042P659P282Q191M752R744
9247f66419J4941J4561J0406Q941J564N037R683R026J6012Q577J4431J1230J2576
9234e29434J0457J4589N497J0274J3275J3575J462J8215K2427K0638J8748Q232
9222c72045m359q559j895M799J997l489k473J2869J6243J7234K6914K3736J6224
9209b72804R443J3069L762P719N866P265Q575M781Q20O152P467J0391J7714J4647
$$ plain form
9300 -1087430 -1084401 -1072226 -1060786 -1047472 -1047057 -1055604 -1052903 -1045399 -1036215 -1028342 -1016902 -1002692 -994433
9287 -994433 -988051 -976168 -968365 -964220 -959186 -960085 -951886 -939800 -925524 -918357 -902758 -893314 -886636 -876632
9273 -876632 -875481 -871670 -857160 -846461 -840622 -836032 -830633 -822333 -814540 -796736 -786519 -779272 -774924
9260 -774924 -764727 -762391 -748320 -737824 -731595 -723808 -713089 -704047 -696388 -689106 -680915 -676163 -666419
9247 -666419 -651478 -636917 -626511 -617570 -616006 -610969 -601286 -592260 -576248 -567671 -553240 -542010 -529434
9234 -529434 -518977 -504388 -498891 -488617 -475342 -461767 -460305 -442090 -419663 -399025 -380277 -372045
9222 -372045 -376404 -384963 -386858 -382059 -380062 -383551 -386024 -373155 -356912 -339678 -312764 -289028 -272804
9209 -272804 -263361 -250292 -246530 -238811 -232945 -225680 -217105 -212324 -211504 -205352 -197885 -187494 -169780 -155133
9195a55133J3516P103J8324K4419J5248J5306J6941K2249J2645M131j3545k6553
9183d5349k7324k1224j0009j091J651J8675K5115K3247J4099Q666J0928K1937
9171A9321J9508J8615J3150J2684J4870Q666O140K077O336J626L469J0875J4997
9158A52334J4601J3923J8151K4299K4678J9368J4176J1998Q300P439P015J746
9146C18028L184J148Q435J6084J7281K6835J3818J3758J0978J8688K6373K6794
9134E01404J3858J5920J4645J5100R825J6940K5840K4809J0957J3159J8199J8000
9122F98656K4195J9710J8529J7136J8129K0354J7993K3942K4854K4164K1199K0257
9110I49118K1109J2321J8248J7718J3332K2237K1657K4550K5194J7807J8326K1228
$$ plain form
9195 -155133 -141617 -134514 -116190 -91771 -76523 -61217 -44276 -22027 -9382 -5251 -18796 -45349
9183 -45349 -72673 -93897 -103906 -104997 -103346 -84671 -59556 -36309 -22210 -13544 -2616 19321
9171 19321 38829 57444 70594 83278 98148 106814 112954 115031 121367 122993 126462 137337 152334
9158 152334 166935 180858 199009 223308 247986 267354 281530 293528 301828 309267 316282 318028
9146 318028 321212 322360 330795 346879 364160 390995 404813 418571 429549 448237 474610 501404
9134 501404 515262 531182 545827 560927 570752 587692 613532 638341 649298 662457 680656 698656
9122 698656 722851 742561 761090 778226 796355 816709 834702 858644 883498 907662 928861 949118
9110 949118 970227 982548 1000796 1018514 1031846 1054083 1075740 1100290 1125484 1143291 1161617 1182845
9098A182845K2278K3138K0834K0545J6395K1598K0066J6191K3916K2073K5731
9087A415610K8025K9399L5010K3991K2085K3566K0941K7761K8809L0148K7094
9076A712439K2628K5644K6293L1459K6016J9509L0460K3106K1581K7591L5057
9065B001783K8334K8222L1596L1480L6777K8692K3972K8752L0037L7785L5539
9054B342969L1530K9378L5174M3971L5577L1888K8724L6710L4885L7718M4421
9043B732945L8552L8638L7779L3732M1069M6599M5514L3699L6299L0408M0212
9032C155446M7224M6602L7438M2390N3685M8350M3183M8240M1913M6345M6119
9021C656935M5339M2278M5795N4516N6717N5950N5738M8852M6369N0230N3489
$$ plain form
9098 1182845 1205123 1228261 1249095 1269640 1286035 1307633 1327699 1343890 1367806 1389879 1415610
9087 1415610 1443635 1473034 1508044 1532035 1554120 1577686 1598627 1626388 1655197 1685345 1712439
9076 1712439 1735067 1760711 1787004 1818463 1844479 1863988 1894448 1917554 1939135 1966726 2001783
9065 2001783 2030117 2058339 2089935 2121415 2158192 2186884 2210856 2239608 2269645 2307430 2342969
9054 2342969 2374499 2403877 2439051 2483022 2518599 2550487 2579211 2615921 2650806 2688524 2732945
9043 2732945 2771497 2810135 2847914 2881646 2922715 2969314 3014828 3048527 3084826 3115234 3155446
9032 3155446 3202670 3249272 3286710 3329100 3382785 3431135 3474318 3522558 3564471 3610816 3656935
9021 3656935 3702274 3744552 3790347 3844863 3901580 3957530 4013268 4062120 4108489 4158719 4212208
9010D212208N1021N4133N8206N2428N4702N5013O5307O0692N3146N4596N3240
8999D824692N1991N6842N9607O4505O1759N2065N8773N7534N3489N6932N2639
8988E450828N6935N2701M8746N4995N8948M4960M5082N0155M0615L6983L6821
8977E977769L9525L8043L7617K5274K4627J7643P232M829M557l261j2198j7515
8965F144142l0991l6983m3342n7322o4742o7078p7860r4471j00536j17048j39422
8954E314347j45341j67196j80698j90147k08658k16440k31889k43575k64370k83494
8944C182539k95145l13434l19437l31199l47538l45795l59778l75748l82550l86734
8934b74819l84320l89209l90632l85075l75190l77298l89565l76800l54857l54514
$$ plain form
9010 4212208 4263229 4317362 4375568 4427996 4482698 4537711 4603018 4663710 4716856 4771452 4824692
8999 4824692 4876683 4933525 4993132 5057637 5119396 5171461 5230234 5287768 5341257 5398189 5450828
8988 5450828 5507763 5560464 5609210 5664205 5723153 5768113 5813195 5863350 5903965 5940948 5977769
8977 5977769 6017294 6055337 6092954 6118228 6142855 6160498 6167730 6172559 6177116 6173855 6161657 6144142
8965 6144142 6113151 6076168 6032826 5975504 5910762 5843684 5765824 5671353 5570817 5453769 5314347
8954 5314347 5169006 5001810 4821112 4630965 4422307 4205867 3973978 3730403 3466033 3182539
8944 3182539 2887394 2573960 2254523 1923324 1575786 1229991 870213 494465 111915 -274819
8934 -274819 -659139 -1048348 -1438980 -1824055 -2199245 -2576543 -2966108 -3342908 -3697765 -4052279
8924d052279l46350l27344l22155l11276k95358k80955k70228k59331k51578k35583
8914f952437k21101k05858j91633j85549j77454j59243j46268j40214j18234j11852
8904h609843j06837r9041r1982q2177p2571o2171n9923n3366m7541l8704l2486
8893i356642l3256k9260j8261q838j0996j1302p108n113K480K852Q269J4046M363
8880i448766M660J6593K4122K7225K8353K2698K0324K5398L0236L3539K2265K5824
8868i167529L5691L5757L5235M2282L1174K3936L0702L2449M1665M0287M2740
8857h775611L8525M0511L7193M1311L5327L2258L7793M5718L7586L9717L3727
8846h355945L4752L6992L9027M2060L2084L1690L6132M1577L8630L4072L6432
$$ plain form
8924 -4052279 -4398629 -4725973 -5048128 -5359404 -5654762 -5935717 -6205945 -6465276 -6716854 -6952437
8914 -6952437 -7173538 -7379396 -7571029 -7756578 -7934032 -8093275 -8239543 -8379757 -8497991 -8609843
8904 -8609843 -8716680 -8815721 -8907703 -8989880 -9062451 -9124622 -9184545 -9237911 -9285452 -9324156 -9356642
8893 -9356642 -9389898 -9419158 -9437419 -9446257 -9457253 -9468555 -9475663 -9480776 -9478296 -9475444 -9467175 -9453129 -9448766
8880 -9448766 -9444106 -9427513 -9403391 -9376166 -9347813 -9325115 -9304791 -9279393 -9249157 -9215618 -9193353 -9167529
8868 -9167529 -9131838 -9096081 -9060846 -9018564 -8987390 -8963454 -8932752 -8900303 -8858638 -8818351 -8775611
8857 -8775611 -8737086 -8696575 -8659382 -8618071 -8582744 -8550486 -8512693 -8466975 -8429389 -8389672 -8355945
8846 -8355945 -8321193 -8284201 -8245174 -8203114 -8171030 -8139340 -8103208 -8061631 -8023001 -7988929 -7952497
8835g952497L3365L2702L4373L7634L8398L6013L5857M0196L4638L2037K9472
8824g567812M3355L6837L4233L3403L0291L2075L8127L4736L8978K7974K3717
8813g194086L3186L2185L7654M4246L5619K8764L2972L0435L0735L6653L4803
8802f816834K5427L1850K8103K7109K9434K5575K8317K9478L1673L2397K7916
8791f499555K5314J6299K6304L6905K4409L0603L7206K5314K2859K5284K4545
8780f204513K9664L2501K8872L3019K4005J8001K3732K4514K5718K6870J9205
8769e918412K5305K3009K2364K5993K3565L1022K3650K2515J9241J8036J7940
8758e665772K2063J9571J1243J9836K9972K7293J9643J6099K2059J9111K3680
$$ plain form
8835 -7952497 -7919132 -7886430 -7852057 -7814423 -7776025 -7740012 -7704155 -7663959 -7629321 -7597284 -7567812
8824 -7567812 -7524457 -7487620 -7453387 -7419984 -7389693 -7357618 -7319491 -7284755 -7245777 -7217803 -7194086
8813 -7194086 -7160900 -7128715 -7091061 -7046815 -7011196 -6982432 -6949460 -6919025 -6888290 -6851637 -6816834
8802 -6816834 -6791407 -6759557 -6731454 -6704345 -6674911 -6649336 -6621019 -6591541 -6559868 -6527471 -6499555
8791 -6499555 -6474241 -6457942 -6431638 -6394733 -6370324 -6339721 -6302515 -6277201 -6254342 -6229058 -6204513
8780 -6204513 -6174849 -6142348 -6113476 -6080457 -6056452 -6038451 -6014719 -5990205 -5964487 -5937617 -5918412
8769 -5918412 -5893107 -5870098 -5847734 -5821741 -5798176 -5767154 -5743504 -5720989 -5701748 -5683712 -5665772
8758 -5665772 -5643709 -5624138 -5612895 -5593059 -5563087 -5535794 -5516151 -5500052 -5477993 -5458882 -5435202
8747e435202J7837J7473K1408K0724J8063J9786J5158K0528K6009K3612J6578
8736e218026R337P872J4856J5281J9112J6882J7827J3813J3018J9345J5275J8481
8724e036927J9099J8603J8202J6957J3394J7757Q624O168J5641K1372J5376K0880
8712d844854J2638J6170K2635K0824J5036J1137M084J0180J7367J4713J8776J1298
8700d669996J1787J6456J3195J0586J4488J2687Q905J1794J5059J3414J2483J0364
8688d518778J2629Q265L221J0142J2101Q646J7894J9334J4437J1121J6660J7516
8676d366812J2702Q287R358J1287J3012O655Q397J6886J7143J9561M342N097J7444
8663d216641J7915J0022R194J5002J2277J0459J3489J2966J3601J1849J6667J4748
$$ plain form
8747 -5435202 -5417365 -5399892 -5378484 -5357760 -5339697 -5319911 -5304753 -5284225 -5258216 -5234604 -5218026
8736 -5218026 -5208689 -5200817 -5185961 -5170680 -5151568 -5134686 -5116859 -5103046 -5090028 -5070683 -5055408 -5036927
8724 -5036927 -5017828 -4999225 -4981023 -4964066 -4950672 -4932915 -4924291 -4918123 -4902482 -4881110 -4865734 -4844854
8712 -4844854 -4832216 -4816046 -4793411 -4772587 -4757551 -4746414 -4742330 -4732150 -4714783 -4700070 -4681294 -4669996
8700 -4669996 -4658209 -4641753 -4628558 -4617972 -4603484 -4590797 -4581892 -4570098 -4555039 -4541625 -4529142 -4518778
8688 -4518778 -4506149 -4497884 -4494663 -4484521 -4472420 -4463774 -4445880 -4426546 -4412109 -4400988 -4384328 -4366812
8676 -4366812 -4354110 -4345823 -4336465 -4325178 -4312166 -4305511 -4297114 -4280228 -4263085 -4243524 -4239182 -4234085 -4216641
8663 -4216641 -4198726 -4188704 -4179510 -4164508 -4152231 -4141772 -4128283 -4115317 -4101716 -4089867 -4073200 -4058452
8651d058452M557M004P888J5622J4772J6308J5430J1762N662J1201J6073J7134
8639c918039Q239J1019J8047J4899J4802J4491K3168J6484J0435J5034J8273J9225
8627c733923J8040K3425K3290K0509K0263K8318L3937L8423M9269N8634O4251
8616c355564O9200L2297o2765j55075j67205j70624j97515j02564K3860N9148
8606d026807N7672M3158L0536L5906K3460K8640L3309K2088K3215K5817K0517
8595c682489K2690J8287J4661J5538J8055J6797K3213L0979K1961J8931J6143
8584c465234K8607L1212K5762K5580L1926L1265L2967M8049N4757O8451R0259
8573b996399R5323J19442J35438P8192r7340k88899l36896l43814m29602k99786
$$ plain form
8651 -4058452 -4053895 -4049891 -4042003 -4026381 -4011609 -3995301 -3979871 -3968109 -3962447 -3951246 -3935173 -3918039
8639 -3918039 -3909800 -3898781 -3880734 -3865835 -3851033 -3836542 -3813374 -3796890 -3786455 -3771421 -3753148 -3733923
8627 -3733923 -3715883 -3692458 -3669168 -3648659 -3628396 -3600078 -3566141 -3527718 -3478449 -3419815 -3355564
8616 -3355564 -3286364 -3254067 -3316832 -3471907 -3639112 -3809736 -4007251 -4109815 -4085955 -4026807
8606 -4026807 -3969135 -3925977 -3895441 -3859535 -3836075 -3807435 -3774126 -3752038 -3728823 -3703006 -3682489
8595 -3682489 -3659799 -3641512 -3626851 -3611313 -3593258 -3576461 -3553248 -3522269 -3500308 -3481377 -3465234
8584 -3465234 -3436627 -3405415 -3379653 -3354073 -3322147 -3290882 -3257915 -3209866 -3155109 -3086658 -2996399
8573 -2996399 -2901076 -2781634 -2646196 -2568004 -2665344 -2954243 -3291139 -3634953 -4064555 -4364341
8563d364341J840J06426J02319P9976P2521O2648N4128M7683L8513M0100L6372
8552c721815K5708J9482M906j7704j0757j0323k3266j165K5778K5393K4820K0496
8540c638447K4226K9695K3267J7866J6517K5461K6940K8598L7328L2349L4252
8529c341948M5250N8296O2988O4282N0256j5842j19951j61595j49154j72754j59537
8518c839709j7174M3973N1286L9929L8190L7181L8347L9772M2061L3811M2664
8507c449669K8804L330l6779n3600n0831o8194n6123O490K6781K2245K3167K0633
8495c583746J6001J6249J4644J1124J1469J3949J2148J0588P073M859J1942K6448
8483c427252P327O09O768Q284R524P784O558O223J3807J6666Q738O817J3381K879
$$ plain form
8563 -4364341 -4362501 -4256075 -4153756 -4073780 -4001259 -3938611 -3884483 -3836800 -3798287 -3758187 -3721815
8552 -3721815 -3696107 -3676625 -3671719 -3689423 -3700180 -3710503 -3733769 -3734934 -3709156 -3683763 -3658943 -3638447
8540 -3638447 -3614221 -3584526 -3561259 -3543393 -3526876 -3501415 -3474475 -3445877 -3408549 -3376200 -3341948
8529 -3341948 -3296698 -3238402 -3175414 -3111132 -3060876 -3076718 -3196669 -3358264 -3507418 -3680172 -3839709
8518 -3839709 -3856883 -3812910 -3761624 -3721695 -3683505 -3646324 -3607977 -3568205 -3526144 -3492333 -3449669
8507 -3449669 -3420865 -3417535 -3454314 -3507914 -3558745 -3626939 -3683062 -3676572 -3649791 -3627546 -3604379 -3583746
8495 -3583746 -3567745 -3551496 -3536852 -3525728 -3514259 -3500310 -3488162 -3477574 -3470501 -3465642 -3453700 -3427252
8483 -3427252 -3419925 -3419316 -3412548 -3404264 -3394740 -3386956 -3380398 -3374175 -3360368 -3343702 -3334964 -3328147 -3314766 -3311887
8469c311887P602J1966J3034R505P250J7498J7162N119j6541k3348k3426k1569
8457c307635l0925j5907R401J9751K2334P392L706N919R853N628N284O682Q158
8444c250359R946K965O322K091K063R707K655J399J1349R444M849J2637R385O991
8430c158556L534J690k481Q91R075Q135N287K340j266O870N925Q601m38M218L323
8415c102852K057K331j577J3984J6350O008K721K312K281J479L115J0951L258
8402c037582J985N844m553K499M865N815J371J120J0763Q764J621Q109j187J26
8388b990440J352L378K725L005L940o340O002J7733M362k026K4R47L473P963N043
8373b938859K161P562O594J0601N428j208k243O288M004J788M958O616K474N221
$$ plain form
8469 -3311887 -3304285 -3292319 -3279285 -3269780 -3262530 -3245032 -3227870 -3222751 -3239292 -3262640 -3286066 -3307635
8457 -3307635 -3338560 -3354467 -3345066 -3325315 -3302981 -3295589 -3291883 -3285964 -3276111 -3270483 -3265199 -3258517 -3250359
8444 -3250359 -3240413 -3237448 -3231126 -3229035 -3226972 -3217265 -3214610 -3213211 -3201862 -3192418 -3187569 -3174932 -3165547 -3158556
8430 -3158556 -3155022 -3153332 -3155813 -3154922 -3145847 -3137712 -3132425 -3130085 -3131351 -3124481 -3118556 -3109955 -3110393 -3106175 -3102852
8415 -3102852 -3100795 -3098464 -3100041 -3086057 -3069707 -3063699 -3060978 -3058666 -3056385 -3054906 -3051791 -3040840 -3037582
8402 -3037582 -3035597 -3029753 -3034306 -3031807 -3026942 -3021127 -3019756 -3018636 -3007873 -2999109 -2997488 -2989379 -2990566 -2990440
8388 -2990440 -2989088 -2985710 -2982985 -2979980 -2976040 -2982380 -2976378 -2958645 -2954283 -2956309 -2956285 -2955338 -2951865 -2943902 -2938859
8373 -2938859 -2936698 -2929136 -2922542 -2911941 -2906513 -2907721 -2909964 -2903676 -2899672 -2897884 -2892926 -2886310 -2883836 -2878615
8359b878615L511k191L672N913K880m216l26K983O805L545J245q40K426L362l206
8344b853052N254M962M955L261N262Q086J399L166J0559N716K027m553K452K686
8330b797820k668M025K863k496P107R591K751p267j298J1422L340P77N288P076
8316b757309N437N741L105P67L928L533n98J695J077R079L099o328m080M330m271
8301b730795l365O141Q186K126K452k190K09N165M390Q178P037k914N376J1817
8287b678187O958k59L44M498J594K360Q427J962l195k034L396P210P849Q274k420
8272b633223k293p34K660O949L970M066n929n792R5P228m065l137O528P805P742
8257b608130m350o379k486R73J0372M045N035k805k814L466j012M030M761M261
$$ plain form
8359 -2878615 -2875104 -2877295 -2873623 -2867710 -2864830 -2869046 -2869372 -2866389 -2859584 -2856039 -2854794 -2855634 -2853208 -2849846 -2853052
8344 -2853052 -2847798 -2842836 -2837881 -2834620 -2829358 -2821272 -2819873 -2816707 -2806148 -2800432 -2798405 -2802958 -2800506 -2797820
8330 -2797820 -2800488 -2796463 -2793600 -2796096 -2788989 -2779398 -2776647 -2783914 -2785212 -2773790 -2770450 -2769673 -2764385 -2757309
8316 -2757309 -2751872 -2746131 -2743026 -2742259 -2738331 -2734798 -2735396 -2733701 -2732624 -2723545 -2720446 -2726774 -2730854 -2726524 -2730795
8301 -2730795 -2734160 -2728019 -2719833 -2717707 -2715255 -2717445 -2717236 -2712071 -2707681 -2699503 -2692466 -2695380 -2690004 -2678187
8287 -2678187 -2671229 -2671488 -2671144 -2666646 -2665052 -2662692 -2654265 -2652303 -2655498 -2657532 -2654136 -2646926 -2639077 -2630803 -2633223
8272 -2633223 -2635516 -2636250 -2633590 -2626641 -2622671 -2618605 -2624534 -2630326 -2630231 -2623003 -2627068 -2630205 -2623677 -2615872 -2608130
8257 -2608130 -2612480 -2618859 -2621345 -2620372 -2610000 -2605955 -2600920 -2603725 -2606539 -2603073 -2604085 -2600055 -2595294 -2591033
8243b591033Q766M181p942l259Q930Q859J2883r29k258L931M932k890N377m802
8229b555254K218j456J707O954j200M019M014O014o238M202O476Q29J090M419
8215b522206P734K461j350J345J0709r12n246o114J992M450m057p961N592Q759
8201b504804O592M665p79K060K899N552M734Q495j205K34k858j627L549M048P86
8186b467659m714J1930K680l963J716N770O228M440J587L504N235O748N015Q468
8172b413015j406q714J815r54o627k62K271K856j106l675J599N829M746m561M454
8157b416750L659O19r88Q65O174L706Q494M635K803L240J108L868q535p789O865
8142b388026R80j82L88L680m601P797M026N332P575M584P810K592q964p256l561
$$ plain form
8243 -2591033 -2582267 -2578086 -2586028 -2589287 -2580357 -2571498 -2558615 -2559544 -2561802 -2557871 -2552939 -2555829 -2550452 -2555254
8229 -2555254 -2553036 -2554492 -2552785 -2545831 -2547031 -2543012 -2538998 -2532984 -2539222 -2535020 -2528544 -2527715 -2526625 -2522206
8215 -2522206 -2514472 -2512011 -2513361 -2512016 -2501307 -2502219 -2507465 -2513579 -2511587 -2507137 -2511194 -2519155 -2513563 -2504804
8201 -2504804 -2498212 -2493547 -2494326 -2492266 -2489367 -2483815 -2479081 -2470586 -2471791 -2471557 -2474415 -2476042 -2472493 -2468445 -2467659
8186 -2467659 -2472373 -2460443 -2457763 -2461726 -2460010 -2454240 -2448012 -2443572 -2441985 -2438481 -2433246 -2426498 -2421483 -2413015
8172 -2413015 -2414421 -2423135 -2421320 -2422274 -2428901 -2429163 -2426892 -2424036 -2425142 -2428817 -2427218 -2421389 -2416643 -2421204 -2416750
8157 -2416750 -2413091 -2412472 -2413460 -2412595 -2406421 -2402715 -2394221 -2389586 -2386783 -2383543 -2382435 -2378567 -2387102 -2394891 -2388026
8142 -2388026 -2387046 -2387228 -2386840 -2383160 -2387761 -2379964 -2375938 -2370606 -2363031 -2358447 -2350637 -2348045 -2357009 -2364265 -2367826
8127b367826N606J1849K171k943k914n47M832N586L039j047k695j047K625Q394
8113b334917N108K786k039m454O05k38j122O781M82N344M75p001L794Q186J1860
8098b304350M81k116o003K765Q554M801J307J721K250K136k500P36Q83N335l900
8083b287900K505K598N763L604j176J289m40l906N715J4195O700l527K582k305
8069b254303n841K09O68K962Q864o120p90M142K44N679P417r5k246q65N595k56
8053b234736n840L342J490N910r76l083M246O275J592M775N964j258j076K386
8039b210989R092O75q007n343J949J277K800q37K34O384N714k878l465k379r1
8024b205864O662M87J641Q84N880P088n42q008l179O43j248m31j014M970L351
$$ plain form
8127 -2367826 -2362220 -2350371 -2348200 -2351143 -2354057 -2354604 -2349772 -2344186 -2341147 -2342194 -2344889 -2345936 -2343311 -2334917
8113 -2334917 -2329809 -2327023 -2329062 -2333516 -2332911 -2333149 -2334271 -2327490 -2327008 -2321664 -2321189 -2328190 -2324396 -2316210 -2304350
8098 -2304350 -2303869 -2305985 -2311988 -2309223 -2300669 -2295868 -2294561 -2292840 -2290590 -2288454 -2290954 -2290218 -2289335 -2284000 -2287900
8083 -2287900 -2285395 -2282797 -2277034 -2273430 -2274606 -2273317 -2273757 -2277663 -2271948 -2257753 -2251053 -2254580 -2251998 -2254303
8069 -2254303 -2260144 -2259935 -2259267 -2256305 -2247441 -2253561 -2254351 -2250209 -2249965 -2244286 -2236869 -2236964 -2239210 -2240075 -2234480 -2234736
8053 -2234736 -2240576 -2237234 -2235744 -2229834 -2230810 -2233893 -2229647 -2223372 -2221780 -2217005 -2211041 -2212299 -2213375 -2210989
8039 -2210989 -2201897 -2201222 -2209229 -2214572 -2212623 -2211346 -2208546 -2209383 -2209149 -2202765 -2197051 -2199929 -2203394 -2205773 -2205864
8024 -2205864 -2199202 -2198715 -2197074 -2196190 -2190310 -2183222 -2183764 -2191772 -2194951 -2194308 -2195556 -2195987 -2197001 -2192031 -2188680
8009b188680l159O401J147J084N550L440J572L745N524Q865l431m712j954m660
7995b169268j573m533o059j395J3086J7097K577M02l954m514p38m353m0M672J0076
7980b148517K290q508K324O149j232K111K653K956M180j803J913L502K594J94
7966b129194n660K482N406Q586J012O903M866L433M046l868n836q279r466l836
7952b129405n064q8j550N79M558N765L971k597l890K786J2354J597N75P53k530
7937b112186J64M138n184j674K175L304R614O7l365k10L499m303N743J883j797
7922b098132J331J681k779l849J851Q293M427R755J0313O25n631k425Q103l02
7908b066739K276O137m207q477l280Q24k396J051M527J63J588j616m56O884J035
$$ plain form
8009 -2188680 -2191839 -2185438 -2184291 -2183207 -2177657 -2174217 -2172645 -2168900 -2163376 -2154511 -2157942 -2162654 -2164608 -2169268
7995 -2169268 -2170841 -2175374 -2181433 -2182828 -2169742 -2152645 -2150068 -2149666 -2153620 -2158134 -2158872 -2163225 -2163265 -2158593 -2148517
7980 -2148517 -2146227 -2154735 -2152411 -2146262 -2147494 -2145383 -2142730 -2139774 -2135594 -2137397 -2135484 -2131982 -2129388 -2129194
7966 -2129194 -2134854 -2132372 -2126966 -2118380 -2117368 -2110465 -2105599 -2102166 -2098120 -2101988 -2107824 -2116103 -2125569 -2129405
7952 -2129405 -2134469 -2134557 -2136107 -2135528 -2130970 -2125205 -2121234 -2123831 -2127721 -2124935 -2112581 -2110984 -2110409 -2109656 -2112186
7937 -2112186 -2112022 -2107884 -2113068 -2114742 -2112567 -2109263 -2099649 -2099582 -2102947 -2103157 -2099658 -2103961 -2098218 -2096335 -2098132
7922 -2098132 -2096801 -2095120 -2097899 -2101748 -2099897 -2091604 -2087177 -2077422 -2067109 -2066484 -2072115 -2074540 -2066437 -2066739
7908 -2066739 -2064463 -2058326 -2062533 -2071010 -2074290 -2073466 -2075862 -2074811 -2070284 -2070121 -2068533 -2070149 -2070605 -2063721 -2062686
7893b062686l07K520J087R5Q42J172l94M473P700L521p80M1N837J685Q67l24k72
7876b034923p78K232K236n544l056r95O60L229M042P363N464o090P76N536p739
7861b027587j94P596M704J031J896M114L937Q439N892l037K124n100o224n437
7847b007846l384M189Q004Q695n170j978j114L536l557L082O146n539n231n031
7833b005198K268L936K496O864J1054J0465n385p904k36J612k095Q11Q18r46K570
7818a978870N958j4j973j72J615j640q31L800R858N632k98K288J347j601k422
7803a957323n230j721K728M052R898L530j176J373J186l930j335R06p672k051
7789a956765J5105J2933k179p264J52P338j903Q01n19P042N62o954p505R547k89
$$ plain form
7893 -2062686 -2062993 -2060473 -2059386 -2059291 -2058449 -2057277 -2057671 -2053198 -2045498 -2041977 -2042757 -2042716 -2036879 -2035194 -2034327 -2034651 -2034923
7876 -2034923 -2035701 -2033469 -2031233 -2036777 -2039833 -2040828 -2040168 -2036939 -2032897 -2025534 -2020070 -2026160 -2025384 -2019848 -2027587
7861 -2027587 -2027781 -2020185 -2015481 -2014450 -2012554 -2008440 -2004503 -1996064 -1990172 -1993209 -1991085 -1996185 -2002409 -2007846
7847 -2007846 -2011230 -2007041 -1999037 -1990342 -1995512 -1997490 -1998604 -1995068 -1998625 -1995543 -1989397 -1994936 -2000167 -2005198
7833 -2005198 -2002930 -1998994 -1996498 -1989634 -1978580 -1968115 -1973500 -1981404 -1981640 -1980028 -1982123 -1981312 -1980494 -1981440 -1978870
7818 -1978870 -1972912 -1972926 -1974899 -1975071 -1973456 -1975096 -1975927 -1972127 -1962269 -1956637 -1956935 -1954647 -1953300 -1954901 -1957323
7803 -1957323 -1962553 -1964274 -1961546 -1957494 -1947596 -1944066 -1945242 -1943869 -1942683 -1946613 -1947948 -1947042 -1954714 -1956765
7789 -1956765 -1941660 -1928727 -1930906 -1938170 -1938018 -1930680 -1932583 -1931782 -1932301 -1925259 -1924697 -1931651 -1939156 -1929609 -1929898
7774a929898m08L671M290L652j232O25j001j186n651R81r65l694K191J0257j847
7759a920215Q692O039Q243M291O25l590l595p513k468m85N649P725N404L278k208
7744a890128m171k176M732m163J289O825j448o1m642l95Q710K253o86O903N310
7729a871848k33M06k508l231Q4J386N15l965l626L465L489r94K574R763N587r40
7713a860076o687L240M581J599m107r019l016P802Q279K505L110L843m096o454
7699a858496R78M459o584L341J1591L39p894M78K294K213m639N216O687J151l363
7684a842229L750j961l300J0291O739j502j0644j1678M728Q379O310R0o913J433
7670a836507J1166J777k678l466L974J336p391k579J1705M183j309p412r62J215
$$ plain form
7774 -1929898 -1930306 -1926635 -1922345 -1918693 -1919925 -1919300 -1920301 -1921487 -1927138 -1926157 -1927122 -1930816 -1928625 -1918368 -1920215
7759 -1920215 -1911523 -1905484 -1897241 -1892950 -1892325 -1895915 -1899510 -1907023 -1909491 -1909976 -1904327 -1896602 -1891198 -1887920 -1890128
7744 -1890128 -1894299 -1896475 -1891743 -1895906 -1894617 -1887792 -1889240 -1889301 -1893943 -1894338 -1885628 -1883375 -1884061 -1877158 -1871848
7729 -1871848 -1872081 -1871675 -1874183 -1877414 -1877330 -1875944 -1875429 -1879394 -1883020 -1879555 -1876066 -1877060 -1874486 -1864723 -1859136 -1860076
7713 -1860076 -1866763 -1863523 -1858942 -1857343 -1861450 -1870469 -1873485 -1865683 -1857404 -1854899 -1851789 -1847946 -1852042 -1858496
7699 -1858496 -1857518 -1853059 -1859643 -1856302 -1844711 -1844372 -1852266 -1851788 -1849494 -1847281 -1851920 -1846704 -1840017 -1838866 -1842229
7684 -1842229 -1838479 -1840440 -1843740 -1833449 -1826710 -1828212 -1838856 -1850534 -1845806 -1837427 -1831117 -1831027 -1837940 -1836507
7670 -1836507 -1825341 -1823564 -1826242 -1829708 -1825734 -1824398 -1831789 -1834368 -1822663 -1818480 -1819789 -1827201 -1828163 -1826948
7656a826948P607L818n43O85J36k665M500k94K32J665P648k44l00l749J477M419
7640a802556M466L774m327q274J327O861K110R08L772P36J357m726j660l618J697
7625a798153J637L35L97M948L664j723r162L325N213P289O674l558p838j535k357
7610a790844K912M116K932O447J963K355R53n135j341p448K131J0472K635l230
7596a771082r09N881M10P84m562j628N404Q226K621r29O541R281R537M360j4311
7581a740376j5816o293J421J286M829n38k065N888k449l045J660P15o932j224
7567a762939J166K819M881Q050J705M064l135k772O888J2028M381N19r362n891
7553a737598p2P833P577N406J2108l100j845n188o716p037m882l679j126o317
$$ plain form
7656 -1826948 -1819341 -1815523 -1816066 -1815381 -1815245 -1817910 -1813410 -1813704 -1813472 -1811807 -1804159 -1804403 -1804703 -1808452 -1806975 -1802556
7640 -1802556 -1798090 -1794316 -1798643 -1806917 -1805590 -1798729 -1796619 -1795711 -1791939 -1791203 -1789846 -1794572 -1796232 -1799850 -1798153
7625 -1798153 -1796516 -1796181 -1795784 -1790836 -1787172 -1788895 -1798057 -1794732 -1789519 -1782230 -1775556 -1779114 -1786952 -1788487 -1790844
7610 -1790844 -1787932 -1783816 -1780884 -1774437 -1772474 -1770119 -1769166 -1774301 -1775642 -1783090 -1780959 -1770487 -1767852 -1771082
7596 -1771082 -1771991 -1766110 -1765700 -1764916 -1769478 -1771106 -1765702 -1757476 -1754855 -1755784 -1749243 -1739962 -1730425 -1726065 -1740376
7581 -1740376 -1756192 -1762485 -1761064 -1759778 -1754949 -1755487 -1757552 -1751664 -1754113 -1757158 -1755498 -1754783 -1761715 -1762939
7567 -1762939 -1761773 -1758954 -1754073 -1746023 -1744318 -1740254 -1743389 -1746161 -1739273 -1727245 -1722864 -1722345 -1731707 -1737598
7553 -1737598 -1737670 -1729837 -1722260 -1716854 -1704746 -1707846 -1709691 -1714879 -1721595 -1728632 -1733514 -1737193 -1738319 -1744636
7539a744636M560k22M317J704j006O719O525P7j785P147P541Q602j092j3823m818
7524a720190m859k87P436R091l805m201m819p061O265J3196J0735Q960M630o499
7510a691408J676k331k847Q42m032p727m730j920R505O941J297n134o182J176
7496a704874L61N947N001K501j352j314L786P349n4j0490L224L920O607P768J375
7481a670245N90k68j865l059o759n143J908N084q7l956k185O828O78P809K438
7466a668232p41P198j287m438K273L775l370J64M469J43j64J125l006r83L39l59
7450a663094M193K885k695j402N08L924O015j120p288m36l975n272l430K296P403
7435a661488Q559j169m405L48L500P856L14K781J914L666j388J328K442L293K505
$$ plain form
7539 -1744636 -1740076 -1740298 -1735981 -1734277 -1735283 -1728564 -1722039 -1721962 -1723747 -1716600 -1709059 -1700457 -1701549 -1715372 -1720190
7524 -1720190 -1725049 -1725336 -1717900 -1708809 -1712614 -1716815 -1721634 -1728695 -1722430 -1709234 -1698499 -1689539 -1684909 -1691408
7510 -1691408 -1689732 -1692063 -1694910 -1694068 -1698100 -1705827 -1710557 -1712477 -1702972 -1696031 -1694734 -1699868 -1706050 -1704874
7496 -1704874 -1704513 -1698566 -1693565 -1691064 -1692416 -1693730 -1689944 -1682595 -1682649 -1693139 -1689915 -1685995 -1679388 -1671620 -1670245
7481 -1670245 -1669655 -1669923 -1671788 -1674847 -1681606 -1686749 -1684841 -1679757 -1679844 -1683800 -1685985 -1679157 -1678479 -1670670 -1668232
7466 -1668232 -1668973 -1661775 -1663062 -1667500 -1665227 -1661452 -1664822 -1664658 -1660189 -1660046 -1660210 -1659085 -1662091 -1663074 -1662735 -1663094
7450 -1663094 -1658901 -1656016 -1658711 -1660113 -1659605 -1655681 -1649666 -1650786 -1658074 -1658510 -1662485 -1667757 -1671187 -1668891 -1661488
7435 -1661488 -1652929 -1654098 -1658503 -1658155 -1654655 -1646799 -1646485 -1643704 -1641790 -1638124 -1639512 -1638184 -1635742 -1632449 -1629944
7420a629944J809k389l222j489o364n236L142M335O104L853k414j1535n062O116
7406a642296M084j615N613K912j58k737k43P908k500K914K901l832L944k141n2
7391a625298O24J264k016m911M460L517m556L973n96N785N831M245M230l527j243
7376a608218J018J27j118j040j24Lj725l666J684P555O855O029m672q802n24M455
7360a602163l109K238N267J95m593K990j429K047k178l358j547n136j716l119
7346a615611L676Q885P179l014p524R150P244J82L065N885n15n573N776L630R99
7331a576566l494k074K698L10m78m113n845m713L1R341K728K059L389J39k283
7316a578871m800J928N432P61m476r37m464M340O669K742J102R85L788O460K637
$$ plain form
7420 -1629944 -1628135 -1630524 -1633746 -1635235 -1641599 -1646835 -1643693 -1639358 -1633254 -1629401 -1631815 -1643350 -1648412 -1642296
7406 -1642296 -1638212 -1639827 -1634214 -1631302 -1631460 -1634197 -1634440 -1626532 -1629032 -1626118 -1623217 -1627049 -1623105 -1625246 -1625298
7391 -1625298 -1624674 -1623410 -1625426 -1630337 -1625877 -1622360 -1626916 -1622943 -1623539 -1617754 -1611923 -1607678 -1603448 -1606975 -1608218
7376 -1608218 -1607200 -1607073 -1608191 -1609231 -1609355 -1609352 -1611077 -1614743 -1613059 -1605504 -1598649 -1592620 -1597292 -1606094 -1606618 -1602163
7360 -1602163 -1605272 -1603034 -1597767 -1597572 -1602165 -1599175 -1600604 -1598557 -1600735 -1604093 -1605640 -1610776 -1612492 -1615611
7346 -1615611 -1611935 -1603050 -1595871 -1598885 -1606409 -1597259 -1590015 -1589833 -1586768 -1580883 -1581398 -1586971 -1581195 -1577565 -1576566
7331 -1576566 -1580060 -1582134 -1579436 -1579126 -1579604 -1583717 -1589562 -1594275 -1594244 -1584903 -1582175 -1580116 -1576727 -1576588 -1578871
7316 -1578871 -1583671 -1581743 -1576311 -1575550 -1580026 -1580963 -1585427 -1581087 -1574418 -1571676 -1570574 -1569589 -1565801 -1559341 -1556704
7301a556704l813O3p263J606L709m706q96L534N30j628o44N132P19l299J119n442
7285a567983K948N420M56k827K319L013n58o43j1249R53P757m141l61M656O175
7270a554065L742N052l611o64J822k30J6P35K829J065K605j051K25J1919N645
7255a523966j563n173n919L20m513J73j768r612n896K646R643J0068R199J868
7241a524493n352m852N161n72K324j929j899P729q46q429l372O174M184O85n34
7226a526021l379l918M143L369K682M425r1J767L229m910k952J00M006N023P064
7211a505463m237r16N903j28k946m84k505L47K828K676M980n997j183K151o524
7196a511498Q80l792j872j65m03k211l142N53P344O885J643M197M598J491l767
$$ plain form
7301 -1556704 -1560517 -1560454 -1567717 -1566111 -1562402 -1567108 -1568004 -1564470 -1563940 -1565568 -1566212 -1561080 -1560361 -1563660 -1562541 -1567983
7285 -1567983 -1565035 -1559615 -1559159 -1561986 -1559667 -1556654 -1557212 -1557855 -1569104 -1568151 -1560394 -1564535 -1564896 -1560240 -1554065
7270 -1554065 -1550323 -1545271 -1548882 -1549546 -1547724 -1547954 -1547938 -1547203 -1544374 -1543309 -1540704 -1541755 -1541530 -1529611 -1523966
7255 -1523966 -1525529 -1530702 -1536621 -1536301 -1540814 -1540641 -1542409 -1552021 -1557917 -1555271 -1545628 -1535560 -1526361 -1524493
7241 -1524493 -1529845 -1534697 -1529536 -1530108 -1527784 -1529713 -1531612 -1523883 -1524729 -1533158 -1536530 -1530356 -1526172 -1525487 -1526021
7226 -1526021 -1529400 -1533318 -1529175 -1525806 -1523124 -1518699 -1518790 -1517023 -1513794 -1518704 -1521656 -1521556 -1517550 -1512527 -1505463
7211 -1505463 -1509700 -1510616 -1504713 -1504841 -1507787 -1508271 -1510776 -1510429 -1507601 -1504925 -1499945 -1505942 -1507125 -1504974 -1511498
7196 -1511498 -1510618 -1514410 -1516282 -1516447 -1516850 -1519061 -1522203 -1521650 -1514306 -1507421 -1505778 -1501581 -1496983 -1495492 -1499259
7181a499259L726K546Q068j524l787p68J722l978K659L741l771o092n170J942
7167a499945l072K090Q713P280jp808n391M573J0124j858j6437p24K943M561P2
7152a494880k199p51R778K760L721o60N642J084J719k608p73j146j03N915l102
7137a475603j576J696K073l689k628r23L130O205Q702r517q40M58j280O86n584
7122a478690L815O139j239k496n660O39L972l72j443K159p80O86j092K183M309
7107a467870k910l435m956j82J426Q369N897N79n032p528O580P189l384j636N569
7092a461324K563m39K809K932k757o608o651P551J0017M803k179o027P258m25
7078a448477q541K665n436O44M823k646Q814M874R86k285p997L681O116L604P714
$$ plain form
7181 -1499259 -1495533 -1492987 -1484919 -1486443 -1490230 -1490998 -1489276 -1493254 -1490595 -1486854 -1490625 -1496717 -1501887 -1499945
7167 -1499945 -1503017 -1500927 -1492214 -1484934 -1484935 -1492743 -1498134 -1493561 -1483437 -1485295 -1501732 -1502456 -1499513 -1494952 -1494880
7152 -1494880 -1497079 -1497830 -1488052 -1485292 -1481571 -1482231 -1476589 -1475505 -1473786 -1476394 -1477167 -1478313 -1478416 -1472501 -1475603
7137 -1475603 -1477179 -1475483 -1473410 -1477099 -1479727 -1480650 -1477520 -1471315 -1462613 -1472130 -1472970 -1472512 -1473792 -1473106 -1478690
7122 -1478690 -1474875 -1468736 -1469975 -1472471 -1478131 -1477492 -1473520 -1473892 -1475335 -1473176 -1473956 -1473270 -1474362 -1472179 -1467870
7107 -1467870 -1470780 -1474215 -1479171 -1479353 -1477927 -1469558 -1463661 -1463082 -1468114 -1475642 -1469062 -1461873 -1465257 -1466893 -1461324
7092 -1461324 -1458761 -1459200 -1456391 -1453459 -1456216 -1462824 -1469475 -1461924 -1451907 -1447104 -1449283 -1455310 -1448052 -1448477
7078 -1448477 -1457018 -1454353 -1459789 -1459145 -1454322 -1456968 -1448154 -1443280 -1442294 -1444579 -1452576 -1448895 -1442779 -1439175 -1431461
7063a431461j020l085l252j0933M50q29J1731P126j632O509l750k484M08j921
7049a434143q98M005l575k250Q37M176M813J704r085m120N965J040r15J339l677
7034a434784q127J915M643N06N754j744O287N708j921n910J229P59l700O83N382
7019a423320O049Q64m535L98M481K17J110o039p84Q025J0j150m236L915l8j504
7003a416537k599L375R599J799n956o318M760q97J77P740N754j987M888N592k560
6988a393170q423l203J370J506J018r56l861L87O140j611Q98K466m078l432J679
6973a403270J598j163N81l356J651O851K377P776P633n041q29k70k723l762l3
6958a391980L38j956J283O061L300l848m411l744M98J572L93J243J470J289j665
$$ plain form
7063 -1431461 -1432481 -1435566 -1438818 -1449751 -1449301 -1450130 -1438399 -1431273 -1432905 -1426396 -1430146 -1432630 -1432222 -1434143
7049 -1434143 -1435041 -1431036 -1434611 -1436861 -1436024 -1431848 -1427035 -1425331 -1434416 -1438536 -1432571 -1431531 -1432446 -1431107 -1434784
7034 -1434784 -1442911 -1440996 -1436353 -1435847 -1430093 -1431837 -1425550 -1419842 -1421763 -1427673 -1426444 -1425685 -1429385 -1428702 -1423320
7019 -1423320 -1417271 -1416407 -1420942 -1420544 -1416063 -1415846 -1414736 -1420775 -1421559 -1413534 -1413524 -1414674 -1418910 -1414995 -1415033 -1416537
7003 -1416537 -1419136 -1415761 -1406162 -1404363 -1410319 -1416637 -1411877 -1412774 -1412597 -1404857 -1399103 -1401090 -1396202 -1390610 -1393170
6988 -1393170 -1401593 -1404796 -1403426 -1401920 -1400902 -1401858 -1405719 -1405332 -1399192 -1400803 -1399905 -1397439 -1401517 -1404949 -1403270
6973 -1403270 -1401672 -1402835 -1402254 -1405610 -1403959 -1397108 -1394731 -1386955 -1379322 -1384363 -1385192 -1385462 -1388185 -1391947 -1391980
6958 -1391980 -1391642 -1393598 -1392315 -1386254 -1382954 -1386802 -1391213 -1394957 -1394459 -1392887 -1392494 -1391251 -1389781 -1388492 -1390157
6943a390157l723L284M92K3O5n259k81K595K243J045L967Q561P361q019Q544L79
6927a368880K18J2514K008r103r382K206J987L001j611k62L63j948n473R29J140
6912a372293k897l08N659K435O81J766J098R813K244k48q820r522l795M040O510
6897a363637L329J814n029l498L934k305N78K217M189n989Q23M122j417l710l772
6882a368351M094M603j761L34Q84q77L937o69n382l028N290P44m312O796O580
6867a351118P46L814M364o357n451N283J3041N99j3857p94O553N66l468m778N923
6852a344934Q258J096n999l136j909q269l678M834Q182Q103J233q17J6m02l387
6837a340809J986P347Q17R30M682R43K198J821j928j199r64k208J859K896k13
$$ plain form
6943 -1390157 -1393880 -1390596 -1390104 -1390081 -1390016 -1395275 -1395556 -1392961 -1390718 -1389673 -1385706 -1377145 -1369784 -1377803 -1369259 -1368880
6927 -1368880 -1368662 -1356148 -1354140 -1363243 -1372625 -1370419 -1368432 -1365431 -1367042 -1367304 -1366941 -1368889 -1374362 -1373433 -1372293
6912 -1372293 -1375190 -1375498 -1369839 -1367404 -1366723 -1364957 -1363859 -1354046 -1351802 -1352050 -1360870 -1370392 -1374187 -1370147 -1363637
6897 -1363637 -1360308 -1358494 -1363523 -1367021 -1363087 -1365392 -1364814 -1362597 -1358408 -1364397 -1363574 -1359452 -1360869 -1364579 -1368351
6882 -1368351 -1364257 -1359654 -1361415 -1361081 -1360197 -1361074 -1357137 -1357806 -1363188 -1366216 -1360926 -1360182 -1364494 -1357698 -1351118
6867 -1351118 -1350372 -1346558 -1342194 -1348551 -1354002 -1348719 -1335678 -1335079 -1348936 -1349730 -1343177 -1342611 -1346079 -1350857 -1344934
6852 -1344934 -1336676 -1335580 -1341579 -1344715 -1346624 -1354893 -1358571 -1353737 -1345555 -1337452 -1336219 -1337036 -1337020 -1337422 -1340809
6837 -1340809 -1338823 -1331476 -1330659 -1329729 -1325047 -1324104 -1321906 -1320085 -1322013 -1323212 -1324176 -1326384 -1324525 -1321629 -1321842
6822a321842L360m771l704n260k493P83J551P867N96J971N252L047p278n317Q56
6807a325382J0362L768K801j191L694M286j0148k760k186k426o574N595J1199
6794a308962m920Q01L465l213l882K42j93O108M220N361O133J1014M90j0038j5000
6779a308374r539j0856j6075j6955m854O231J4395Q268k982j15R627P370L402
6766a320457J41n912j591l3J925k68M380k986m598p31J244J1279n69R79O168l450
6750a314479J11l081j648m29p229r703M300M078L773J4999P281n645n942K435
6736a311179m631k112L667l157N52j653N885J421q79M516P430M201l797J618N482
6721a292636J049j963k450j0625p69O774M31K306N830K157J216n563n412R90j674
$$ plain form
6822 -1321842 -1318482 -1323253 -1326957 -1332217 -1334710 -1333927 -1332376 -1324509 -1323913 -1321942 -1316690 -1313643 -1320921 -1326238 -1325382
6807 -1325382 -1315020 -1311252 -1308451 -1309642 -1305948 -1301662 -1311810 -1314570 -1316756 -1319182 -1325756 -1320161 -1308962
6794 -1308962 -1313882 -1313081 -1309616 -1312829 -1316711 -1316469 -1316662 -1310554 -1306334 -1300973 -1294840 -1283826 -1283336 -1293374 -1308374
6779 -1308374 -1317913 -1328769 -1344844 -1361799 -1366653 -1360422 -1346027 -1337759 -1340741 -1340856 -1331229 -1323859 -1320457
6766 -1320457 -1320316 -1326228 -1327819 -1327852 -1325927 -1326195 -1321815 -1324801 -1329399 -1330130 -1328886 -1317607 -1318176 -1317197 -1311029 -1314479
6750 -1314479 -1314368 -1317449 -1319097 -1319526 -1326755 -1336458 -1332158 -1328080 -1324307 -1309308 -1302027 -1307672 -1313614 -1311179
6736 -1311179 -1315810 -1317922 -1314255 -1317412 -1316860 -1318513 -1312628 -1311207 -1312086 -1307570 -1300140 -1295939 -1299736 -1298118 -1292636
6721 -1292636 -1291587 -1293550 -1296000 -1306625 -1307394 -1300620 -1300189 -1297883 -1292053 -1289896 -1288680 -1294243 -1299655 -1298665 -1300339
6706a300339N074L625r708o47R291P588m879m306R10l112J312l456q327N37O286
6691a300151M124p724m615p248N005P627N071j474j106j643j542J652N664L152
6677a293208q099J548Q223L122P36L536N81P74K296j690l518M731L903k511r6
6662a279672J067k820k876M46R148Q952K85o216l137k361j214K630k16N264K821
6647a267899o640O87J138L562K595k475p89j798n781j307M445L563K885J618j0222
6632a276418K499L975p352N00M092R825M231L28j825j0036J838L832m09J797l7
6617a263160n748Q496K544o900r073O7l23M867N709q80K613K671m501j697J392
6602a263923j18o60J847l679j829N223M456j45L068l389k082J855L398m764Q57
$$ plain form
6706 -1300339 -1295265 -1291640 -1301348 -1301995 -1292704 -1285116 -1289995 -1294301 -1293391 -1296503 -1295191 -1298647 -1306974 -1306437 -1300151
6691 -1300151 -1296027 -1303751 -1308366 -1315614 -1310609 -1302982 -1297911 -1299385 -1300491 -1302134 -1303676 -1302024 -1296360 -1293208
6677 -1293208 -1301307 -1299759 -1291536 -1288414 -1287678 -1284142 -1283561 -1282787 -1280491 -1282181 -1285699 -1280968 -1277065 -1279576 -1279672
6662 -1279672 -1278605 -1281425 -1284301 -1283855 -1274707 -1265755 -1265470 -1271686 -1274823 -1277184 -1278398 -1275768 -1275984 -1270720 -1267899
6647 -1267899 -1274539 -1273852 -1272714 -1269152 -1266557 -1269032 -1269821 -1271619 -1277400 -1278707 -1274262 -1270699 -1267814 -1266196 -1276418
6632 -1276418 -1273919 -1269944 -1277296 -1276796 -1272704 -1262879 -1258648 -1258320 -1260145 -1270181 -1268343 -1264511 -1264920 -1263123 -1263160
6617 -1263160 -1268908 -1260412 -1257868 -1264768 -1273841 -1273774 -1274097 -1269230 -1263521 -1264401 -1261788 -1259117 -1263618 -1265315 -1263923
6602 -1263923 -1264041 -1264701 -1262854 -1266533 -1268362 -1263139 -1258683 -1258828 -1255760 -1259149 -1261231 -1259376 -1255978 -1260742 -1259885
6587a259885J620q407O080J2787O231j816k637l126n286l363o58R820K658L125
6573a242857l585k221L115j736N19k25L46J572k517m29k160Q19M841K021Q15n681
6557a247363l054k957L050j030o28K039J2234M553K546r61q063L148J350M9m267
6542a239354J675Q0N26K058K436k81k531k247p017P910K281M023j028N48m501
6527a235422R0K510M413P62j472J867K226N297k994m216K672r07j664K924j127
6512a225041j600j336N006L022o83r076n495l908l58K816J1458N636m743n758
6498a230060m997q799Q204O785K164K832K2L362m243k083O84p407o88P105Q868
6483a218251M802m403K879M94k014j491J31k471m276p14P058L899j510q542L592
$$ plain form
6587 -1259885 -1258265 -1266672 -1260592 -1247805 -1241574 -1243390 -1246027 -1249153 -1254439 -1257802 -1258460 -1248640 -1245982 -1242857
6573 -1242857 -1246442 -1248663 -1245548 -1247284 -1246765 -1246990 -1246644 -1245072 -1247589 -1248018 -1250178 -1249359 -1244518 -1242497 -1241682 -1247363
6557 -1247363 -1250417 -1253374 -1250324 -1251354 -1251982 -1249943 -1237709 -1233156 -1230610 -1231571 -1239634 -1236486 -1235136 -1235087 -1239354
6542 -1239354 -1237679 -1237599 -1237073 -1235015 -1232579 -1232860 -1235391 -1237638 -1244655 -1236745 -1234464 -1230441 -1231469 -1230921 -1235422
6527 -1235422 -1235332 -1232822 -1228409 -1227647 -1229119 -1227252 -1225026 -1219729 -1222723 -1226939 -1224267 -1225174 -1226838 -1223914 -1225041
6512 -1225041 -1226641 -1227977 -1222971 -1219949 -1220632 -1229708 -1235203 -1239111 -1239469 -1236653 -1225195 -1219559 -1224302 -1230060
6498 -1230060 -1235057 -1243856 -1235652 -1228867 -1226703 -1223871 -1223849 -1220487 -1224730 -1226813 -1226129 -1233536 -1234224 -1227119 -1218251
6483 -1218251 -1213449 -1217852 -1214973 -1214479 -1216493 -1217984 -1217853 -1220324 -1224600 -1225314 -1218256 -1214357 -1215867 -1224409 -1220817
6468a220817P422j492Q37m465r14J1597L094l517p270K421j064j940O861j539
6454a210786J307L48p564n170L756O126M115L074p23q84j180J670L928K964m875
6439a203894k360K421J122L763Q35L139l345j0310n300J091Q340Q866k737o342
6425a204711N493N525m463K678K627m762j541M533L505m919k069J100M061r38
6411a193881m353p81K011J087K630Q1J989K992j421n037J872L102l284p763Q719
6396a192037J2079p30q928k896J054K063p19j539n03O96M644Q012J429l455p817
6381a188647n830P546J0550j308p698j976O3L703P562K799p489R28m81J267O33
6366a178378j16q62k373k199p272n912M708L93N821K034RL210O691l59l537k471
$$ plain form
6468 -1220817 -1213395 -1214887 -1214050 -1218515 -1219429 -1207832 -1204738 -1208255 -1215525 -1213104 -1214168 -1216108 -1209247 -1210786
6454 -1210786 -1209479 -1209131 -1216695 -1221865 -1218109 -1211983 -1207868 -1204794 -1205517 -1206401 -1207581 -1205911 -1201983 -1199019 -1203894
6439 -1203894 -1206254 -1203833 -1202711 -1198948 -1198113 -1194974 -1198319 -1208629 -1213929 -1212838 -1204498 -1195632 -1198369 -1204711
6425 -1204711 -1199218 -1193693 -1198156 -1195478 -1192851 -1197613 -1199154 -1194621 -1191116 -1196035 -1198104 -1197004 -1192943 -1193881
6411 -1193881 -1198234 -1199015 -1197004 -1195917 -1193287 -1193206 -1191217 -1188225 -1189646 -1194683 -1192811 -1189709 -1192993 -1200756 -1192037
6396 -1192037 -1179958 -1180688 -1189616 -1192512 -1191458 -1189395 -1190114 -1191653 -1192156 -1191460 -1186816 -1178804 -1177375 -1180830 -1188647
6381 -1188647 -1194477 -1186931 -1176381 -1177689 -1185387 -1187363 -1187300 -1183597 -1176035 -1173236 -1180725 -1179797 -1180278 -1179011 -1178378
6366 -1178378 -1178494 -1179356 -1181729 -1183928 -1191200 -1197112 -1192404 -1192011 -1186190 -1184156 -1184147 -1180937 -1174246 -1174605 -1178142 -1180613
6350a180613l67O728K734j739o925N96M050q68l007P46L381M79l62o079L543M903
6334a172800J324J657K114m04k673K179J813N111o741p498R055J774o521J385
6320a170225N176L133M380k685q659k843N34N743n023j163n358M921Q443O145
6306a157481K746o851j2743k159R852J3446O400q239j1202Q02P62O979L132K471
6292a152085l77m298j584n52r97L832O494n179r792k366Q549M434m245m595k930
6277a165691P01M933L838n039o134P454Q982L512R30m8o751k153p504n807R2L850
6261a164835N096O461k529l582o2M101R67K622J708Q961N930l123j408m478l217
6246a147388O24J360k692l71Q76L376K673j850o659j034Q233M649l788l202l178
$$ plain form
6350 -1180613 -1180980 -1174252 -1171518 -1173257 -1180182 -1179586 -1175536 -1176404 -1179411 -1178665 -1175284 -1174805 -1175167 -1181246 -1177703 -1172800
6334 -1172800 -1171476 -1169819 -1167705 -1168109 -1170782 -1168603 -1166790 -1161679 -1168420 -1175918 -1166863 -1165089 -1171610 -1170225
6320 -1170225 -1165049 -1161916 -1157536 -1160221 -1168880 -1171723 -1171189 -1165446 -1170469 -1171632 -1176990 -1172069 -1163626 -1157481
6306 -1157481 -1154735 -1161586 -1174329 -1176488 -1166636 -1153190 -1146790 -1155029 -1166231 -1165429 -1164667 -1157688 -1154556 -1152085
6292 -1152085 -1152462 -1156760 -1158344 -1158896 -1159893 -1156061 -1149567 -1154746 -1164538 -1166904 -1158355 -1153921 -1158166 -1162761 -1165691
6277 -1165691 -1164990 -1160057 -1156219 -1161258 -1167392 -1159938 -1150956 -1147444 -1146514 -1146562 -1153313 -1155466 -1162970 -1168777 -1168685 -1164835
6261 -1164835 -1159739 -1153278 -1155807 -1159389 -1159451 -1155350 -1154383 -1151761 -1150053 -1141092 -1135162 -1138285 -1139693 -1144171 -1147388
6246 -1147388 -1146764 -1145404 -1148096 -1148467 -1147591 -1144215 -1141542 -1143392 -1150051 -1151085 -1142852 -1138203 -1141991 -1145193 -1148371
6231a148371O69L527O213K221k95q051o105J032P908P085M707j832j730K253r1
6216a130860J591J760k967l074J61m501L077L749n90q136L675k553k675N921O605
6201a128817O46J595k43j821j477j421K966K348j1474p721P054K817R72M466L21
6186a129789K958L521O087k697l539O71m627k67j902k661N376k75k285O36n424
6171a134217K795J480P04J07k008q44K253Q902N91K78l910j881M199k526L640
6156a120437Q36M359k436p680O552K581mL172j324p297o82N610J168l35l830J680
6140a118067K173K832K800o023o772k759Q851L588j300L009m153o963n21M552
6126a118753K291P59l123k717j889Q18P04n430j2087K487J4406P215K756L130
$$ plain form
6231 -1148371 -1147702 -1144175 -1137962 -1135741 -1136036 -1144087 -1150192 -1149160 -1141252 -1134167 -1129460 -1131292 -1133022 -1130769 -1130860
6216 -1130860 -1129269 -1127509 -1130476 -1133550 -1133389 -1137890 -1134813 -1131064 -1131654 -1139790 -1136115 -1138668 -1141343 -1135422 -1128817
6201 -1128817 -1128171 -1126576 -1126819 -1128640 -1130117 -1131538 -1128572 -1126224 -1137698 -1145419 -1138365 -1135548 -1134576 -1130110 -1129789
6186 -1129789 -1126831 -1123310 -1117223 -1119920 -1123459 -1122788 -1127415 -1127682 -1129584 -1132245 -1126869 -1127144 -1129429 -1128793 -1134217
6171 -1134217 -1131422 -1129942 -1129238 -1129131 -1131139 -1131983 -1129730 -1120828 -1120237 -1119959 -1123869 -1125750 -1121551 -1124077 -1120437
6156 -1120437 -1119601 -1115242 -1117678 -1125358 -1118806 -1116225 -1116229 -1113057 -1114381 -1121678 -1122360 -1116750 -1115582 -1115917 -1119747 -1118067
6140 -1118067 -1115894 -1113062 -1110262 -1116285 -1123057 -1125816 -1116965 -1113377 -1114677 -1111668 -1115821 -1122784 -1123305 -1118753
6126 -1118753 -1116462 -1115703 -1118826 -1121543 -1123432 -1122614 -1121910 -1127340 -1139427 -1136940 -1122534 -1115319 -1112563 -1109433
6112a109433M993K364l816m075j060K653R194k421n810o020J763R542J842m618
6098a104902N49L67M838J582m956J01K623O74J090n861K420P278L628q813k182
6083a101564j820k148M205N42o136j263O034M472K702R45m833n163K519m828n303
6068a111639L931k151M35L389L078L108N091j26L270R407k134k218o634j097M907
6053a089383O413N828R73p006K418K567p041P71J015L581n03m041m915j559J062
6038a089820k21M008j409m323o384P08J608J35l377N2O300M567q952K832J218
6023a093058K536k772K514k64K239O1K943M905k623l163J332k195L644j347l702
6008a088950n29j819k245L792K811K044j788o31M037p48J718P82R53j367K12P243
$$ plain form
6112 -1109433 -1104440 -1102076 -1105892 -1109967 -1111027 -1108374 -1099180 -1101601 -1107411 -1113431 -1111668 -1102126 -1100284 -1104902
6098 -1104902 -1104353 -1103986 -1099148 -1097566 -1102522 -1102421 -1099798 -1099124 -1098034 -1103895 -1101475 -1094197 -1090569 -1099382 -1101564
6083 -1101564 -1103384 -1105532 -1101327 -1100785 -1106921 -1108184 -1102150 -1097678 -1094976 -1094031 -1098864 -1104027 -1101508 -1106336 -1111639
6068 -1111639 -1107708 -1109859 -1109424 -1106035 -1102957 -1099849 -1094758 -1094884 -1091614 -1082207 -1084341 -1086559 -1093193 -1094290 -1089383
6053 -1089383 -1082970 -1077142 -1076169 -1083175 -1080757 -1078190 -1085231 -1084460 -1083445 -1079864 -1080367 -1084408 -1089323 -1090882 -1089820
6038 -1089820 -1090041 -1086033 -1087442 -1091765 -1098149 -1097441 -1095833 -1095698 -1099075 -1099023 -1092723 -1088156 -1097108 -1094276 -1093058
6023 -1093058 -1090522 -1093294 -1090780 -1091044 -1088805 -1088744 -1085801 -1080896 -1083519 -1086682 -1085350 -1087545 -1083901 -1085248 -1088950
6008 -1088950 -1089479 -1091298 -1093543 -1089751 -1086940 -1084896 -1086684 -1087315 -1083278 -1084026 -1082308 -1081526 -1080573 -1081940 -1081728 -1074485
5992a074485M895l485k755j4109L33L821K210L696Q865l29o511p787K910O145
5978a076586l00m608r85L766L157N62j078N69m623o040J059M720M435O510K235
5963a067207l897l900n445l907N586R770Q337j977l296J142K977l038q868k493
5949a076216l300m820N549P703K715L515k273Mo165q737K637O955r47N56k012
5934a074836j17P66K124J389L34J830P02O185L871l178L225J580n84j797k705
5919a061211k278j921m776m630MR085Q81J527K49K586n141K671k090m178Q750
5904a060472N895j619l163P24O124O21k728p26n248R69M524K42j1161K661P406
5889a055951q24l939m990K106L34J754Q688N402m191l720k338p54p06m341q04
$$ plain form
5992 -1074485 -1069590 -1073075 -1075830 -1089939 -1089606 -1085785 -1083575 -1079879 -1071014 -1071343 -1077854 -1085641 -1082731 -1076586
5978 -1076586 -1076886 -1081494 -1082479 -1078713 -1075556 -1074994 -1076072 -1075503 -1080126 -1086166 -1085107 -1080387 -1075952 -1069442 -1067207
5963 -1067207 -1071104 -1075004 -1080449 -1084356 -1078770 -1069000 -1060663 -1062640 -1065936 -1064794 -1061817 -1064855 -1073723 -1076216
5949 -1076216 -1079516 -1084336 -1078787 -1071084 -1068369 -1064854 -1067127 -1067123 -1073288 -1082025 -1079388 -1072433 -1073380 -1072824 -1074836
5934 -1074836 -1074953 -1074187 -1072063 -1070674 -1070340 -1068510 -1067808 -1061623 -1057752 -1060930 -1057705 -1056125 -1056709 -1058506 -1061211
5919 -1061211 -1063489 -1065410 -1070186 -1074816 -1074812 -1065727 -1064846 -1063319 -1063070 -1060484 -1065625 -1062954 -1065044 -1069222 -1060472
5904 -1060472 -1054577 -1056196 -1059359 -1058635 -1052511 -1051890 -1054618 -1055344 -1060592 -1059623 -1055099 -1054857 -1066018 -1063357 -1055951
5889 -1055951 -1056775 -1060714 -1065704 -1063598 -1063264 -1061510 -1052822 -1047420 -1051611 -1055331 -1057669 -1058423 -1059129 -1063470 -1064274
5874a064274P425O285J365k362M151n355q031L585j58k291N015O084O305O854
5860a035402p185j0905K037M833j17n042J085m288M05P052j580Q37J959j860J439
5845a046732R50j735l538M105m273J523O855k176O192K431o061n846n2J68P8R62
5829a047149R80J462L116J430L363j082l179k564o43L840k362m427N03J776K931
5814a042005M060q789N95M749M017N04M132m784k500j55M044j459n079J942j372
5799a042100l340Q253k428j2365K095Q031m933L767R833p51k586N78M241o78l821
5784a036204K502n281J85M595k255J666J953K949K365K636L262j509q408j664
5770a033208N570K397l199n094J698L451Q09j892J2j1j007L070p21k818K996k20
$$ plain form
5874 -1064274 -1056849 -1050564 -1049199 -1051561 -1047410 -1052765 -1060796 -1057211 -1057369 -1059660 -1054645 -1048561 -1042256 -1035402
5860 -1035402 -1042587 -1053492 -1051455 -1046622 -1046739 -1051781 -1050696 -1054984 -1054579 -1047527 -1049107 -1048270 -1046311 -1048171 -1046732
5845 -1046732 -1045782 -1047517 -1051055 -1046950 -1051223 -1049700 -1042845 -1045021 -1038829 -1036398 -1042459 -1048305 -1048357 -1048189 -1048111 -1047149
5829 -1047149 -1046169 -1044707 -1041591 -1040161 -1036798 -1037880 -1041059 -1043623 -1044266 -1040426 -1042788 -1047215 -1046712 -1044936 -1042005
5814 -1042005 -1037945 -1046734 -1046139 -1041390 -1037373 -1036869 -1032737 -1037521 -1040021 -1040176 -1036132 -1037591 -1042670 -1040728 -1042100
5799 -1042100 -1045440 -1037187 -1039615 -1051980 -1049885 -1041854 -1046787 -1043020 -1033187 -1033938 -1036524 -1035946 -1031705 -1032383 -1036204
5784 -1036204 -1033702 -1038983 -1038798 -1034203 -1036458 -1034792 -1032839 -1029890 -1027525 -1024889 -1021627 -1023136 -1031544 -1033208
5770 -1033208 -1027638 -1025241 -1028440 -1033534 -1031836 -1028385 -1027576 -1029468 -1029456 -1029467 -1030474 -1027404 -1028125 -1030943 -1027947 -1028167
5754a028167r76K708R99J005K864P89l208j070L26o64P153K346l3p354n978J506
5738a027754J982L551N570J952j95l715K108J517J58o213q79J001j499J105m562
5723a025873q14M14j620O881J2031o837m168j731k948P48M278K031l342n461O422
5708a019989j870l769r53J549O116M243j063p118M530R699P312o443q431J314
5694a014873J865j880j392K197l397L750K36j151O040K388r51J43m569l146N316
5679a009424j765M364P222n385p934k358K681P420N166p625l657L340N381k760
5665a005334o57O441L827l086J668L60l676n665O3J158k30k015L122K282j458
5650a003200j139r032P30K222j057N603K910K708L61m486k986L38p4J0496L236
$$ plain form
5754 -1028167 -1029143 -1026435 -1025436 -1024431 -1021567 -1020778 -1023986 -1025056 -1024730 -1025394 -1018241 -1015895 -1015928 -1023282 -1029260 -1027754
5738 -1027754 -1025772 -1022221 -1016651 -1014699 -1014894 -1018609 -1016501 -1014984 -1014826 -1021039 -1021918 -1020917 -1022416 -1021311 -1025873
5723 -1025873 -1026687 -1026273 -1027893 -1021012 -1008981 -1015818 -1019986 -1021717 -1024665 -1023917 -1019639 -1017608 -1020950 -1026411 -1019989
5708 -1019989 -1021859 -1025628 -1026581 -1025032 -1018916 -1014673 -1015736 -1022854 -1018324 -1008625 -1001313 -1007756 -1016187 -1014873
5694 -1014873 -1013008 -1014888 -1016280 -1014083 -1017480 -1013730 -1013494 -1014645 -1008605 -1006217 -1007168 -1007025 -1011594 -1014740 -1009424
5679 -1009424 -1011189 -1006825 -999603 -1004988 -1012922 -1015280 -1012599 -1005179 -1000013 -1007638 -1011295 -1007955 -1002574 -1005334
5665 -1005334 -1005991 -999550 -995723 -998809 -997141 -996781 -1000457 -1006122 -1006059 -1004901 -1005131 -1007146 -1004024 -1001742 -1003200
5650 -1003200 -1004339 -1013371 -1012641 -1010419 -1011476 -1005873 -1002963 -1000255 -999894 -1004380 -1007366 -1007028 -1007102 -996606 -993370
5635i93370o535p316p73J468M061M301Q028j459m401k261j977K109L082m639l699
5620a003381O868j855M617q9o385p57J768k687M492K433k971L211N607k402k969
5605i94500K392M01k555J451J502M764J410l258O748p87p284K61J493R70K858
5590i84134l685q654m152N214J266n521J250J2207p23p555j980Q53O718N113j774
5575i85557q859k561J711K252M746K639M879N237J334k44l753o704N414J295M01
5560i77770j122J735j207K432j415n797r939p54L322p50m217N021K483n6j028
5545i89062l005N163J279j674J05K920M142l16k805L375K083K412K067Q48k359
5530i74827L967k451l61m703l925L09j132n564M59K408Q585j185m243M852j777
$$ plain form
5635 -993370 -999905 -1007221 -1007994 -1006526 -1002465 -998164 -990136 -991595 -995996 -998257 -1000234 -998125 -995043 -999682 -1003381
5620 -1003381 -996513 -998368 -993751 -993840 -1000225 -1000982 -999214 -1001901 -997409 -994976 -997947 -994736 -989129 -991531 -994500
5605 -994500 -992108 -991707 -994262 -992811 -991309 -986545 -985135 -988393 -981645 -982432 -989716 -989455 -987962 -986992 -984134
5590 -984134 -987819 -996473 -1000625 -995411 -994145 -999666 -998416 -986209 -986932 -994487 -996467 -995614 -988896 -983783 -985557
5575 -985557 -994416 -996977 -995266 -993014 -988268 -985629 -980750 -975513 -974179 -974423 -978176 -984880 -979466 -978171 -977770
5560 -977770 -978892 -977157 -978364 -975932 -977347 -983144 -993083 -993837 -990515 -991265 -995482 -990461 -987978 -988034 -989062
5545 -989062 -992067 -986904 -985625 -987299 -987194 -984274 -980132 -980448 -983253 -979878 -977795 -975383 -973316 -972468 -974827
5530 -974827 -970860 -973311 -973672 -978375 -982300 -981991 -983123 -988687 -988228 -985820 -977235 -978420 -982663 -977811 -979588
5515i79588m310M303o16o91J894L704L914N710p17o836k06r81J325J659o09J021
5499i71024L607n691l679l677J35K488K720n423J916L505L254O261K920j927q006
5484i72621r19J824k988k869k693r65K719M137J681K792J610P322l372n731j2
5469i70085L5L96J974O744N128p443p197m39o301M111N889K192r48K155L645J93
5453i59951j151R97j63M236k278J561r02J793k128o939J888L394P517L41n05N07
5437i51783o35j967o73Q04J697K055O083j493n636M39l889p79J59k151O63L462
5421i53644M217l49o261p090J547N002P025L240n346l084J568o70q6P97K250K358
5405i48526Q64k241o699L049M351j711m476J302O288J4j827j5501k195R114J58
$$ plain form
5515 -979588 -983898 -979595 -980211 -980902 -979008 -975304 -971390 -965680 -966397 -973233 -973439 -974420 -973095 -971436 -972045 -971024
5499 -971024 -967417 -973108 -976787 -980464 -980329 -977841 -975121 -980544 -978628 -975123 -971869 -965608 -962688 -964615 -972621
5484 -972621 -973540 -971716 -974704 -977573 -980266 -981231 -978512 -974375 -972694 -969902 -968292 -960970 -964342 -970073 -970085
5469 -970085 -970050 -969654 -967680 -960936 -955808 -963251 -970448 -970887 -977188 -973077 -967188 -964996 -965944 -963789 -960144 -959951
5453 -959951 -961102 -960105 -960268 -956032 -958310 -956749 -957651 -955858 -957986 -964925 -963037 -959643 -952126 -951785 -952290 -951783
5437 -951783 -952418 -954385 -955058 -954254 -952557 -950502 -944419 -945912 -951548 -951109 -954998 -955777 -955618 -957769 -957106 -953644
5421 -953644 -949427 -949776 -956037 -963127 -961580 -956578 -949553 -946313 -951659 -954743 -953175 -953845 -953931 -953134 -950884 -948526
5405 -948526 -947662 -949903 -956602 -953553 -949202 -950913 -955389 -954087 -947799 -947785 -949612 -965113 -967308 -958194 -958036
5390i58036L271J717k247l015L676L761N467L760o142o51k359K143M531L985o52
5375i40791j947l899l864m869l043J647N145O965o86Q41k888M87l071M52L585
5360i45936M378k017K231K528q67L56K136P60k535j483o025q023l193N383R962
5345i42345n98l663n993j194L16m624P821J0903j110l84K073j821q85J815K257
5330i37432K823n290j938P643L928o500J047K123m654p90j226P00J197k441p027
5315i47837l169N547P197N991n83j0274o378n63K954m456K024R117L751j281m001
5300i41961L51K300L19l58o985k505R548K630k341o696l543M056O272O614J124
5285i31175P491K029k367k833m526N66j617n849o48K942M982J783L694J372m126
$$ plain form
5390 -958036 -954765 -953048 -955295 -958310 -954634 -950873 -945406 -941646 -947788 -948439 -950798 -948655 -944124 -940139 -940791
5375 -940791 -942738 -946637 -950501 -955370 -958413 -956766 -951621 -944656 -945342 -944501 -947389 -946902 -949973 -949521 -945936
5360 -945936 -941558 -943575 -941344 -938816 -939683 -939327 -937191 -936431 -938966 -940449 -946474 -954497 -957690 -952307 -942345
5345 -942345 -942943 -946606 -952599 -953793 -953477 -958101 -950280 -939377 -940487 -940871 -938798 -940619 -941504 -939689 -937432
5330 -937432 -934609 -939899 -941837 -934194 -930266 -936766 -935719 -933596 -938250 -939040 -940266 -939566 -938369 -940810 -947837
5315 -947837 -951006 -945459 -938262 -932271 -932854 -943128 -949506 -950069 -947115 -951571 -949547 -940430 -936679 -937960 -941961
5300 -941961 -941610 -939310 -938991 -939349 -946334 -948839 -939291 -936661 -939002 -945698 -949241 -945185 -938913 -932299 -931175
5285 -931175 -923684 -921655 -924022 -926855 -931381 -930815 -932432 -938281 -938929 -935987 -931005 -929222 -925528 -924156 -928282
5270i28282o983m450j784J660P128K294k674N544o199l327o136K131R600K918
5256i28560J589j284k24R68k662k826J711J1364K818L593K77n835k533K644j673
5241i20633r706o698l391K571L324K120k144K294r51J465J668k457O705N638J457
5226i18738K227m934L572j095K191N93j424J538j28Q3r54q796n603O069k339K753
5210i24985M381q60J379J699Q84M171k757r945n707l555k697J115J940N545Q329
5195i21063l419k418k464O160O334j378k559L520N082L727p693p377j272k363
5181i27183j555J1618M908P622j016j0279m787R46n54p68N512O829J770L131L934
5166h99872J04l628m593k145m414K91L69M638K363J329n93J78r307j554Q338R57
$$ plain form
5270 -928282 -935265 -939715 -941499 -939839 -932711 -930417 -933091 -927547 -933746 -937073 -943209 -941078 -931478 -928560
5256 -928560 -926971 -928255 -928479 -927511 -930173 -932999 -931288 -919924 -917106 -913513 -913236 -919071 -921604 -918960 -920633
5241 -920633 -930339 -937037 -940428 -937857 -934533 -932413 -934557 -932263 -933214 -931749 -930081 -932538 -925833 -920195 -918738
5226 -918738 -916511 -921445 -917873 -918968 -916777 -916184 -917608 -916070 -916198 -916115 -917069 -925865 -931468 -925399 -927738 -924985
5210 -924985 -920604 -921464 -920085 -918386 -917502 -913331 -916088 -926033 -931740 -935295 -937992 -936877 -934937 -929392 -921063
5195 -921063 -924482 -926900 -929364 -923204 -916870 -918248 -920807 -917287 -912205 -908478 -916171 -923548 -924820 -927183
5181 -927183 -928738 -917120 -912212 -904590 -905606 -915885 -920672 -919726 -920280 -921048 -915536 -908707 -906937 -903806 -899872
5166 -899872 -899768 -903396 -907989 -910134 -914548 -914257 -913888 -909250 -906887 -905558 -906151 -905973 -915280 -916834 -908496 -907539
5150i07539m66L557k658p77l628m887P951R987k104n490r13j172J739M7j183K131
5134i05405k256N08Q55p61P47j522K84K118j000l845L247m229M831j109q270j007
5118i16814M877J145N506K216l710O321K842k378l28L999J736l87j581j363k943
5103i00862K574L937P031o18j269J1552j749q516m486j674n277K782L270K49q396
5088i01452j778k26l792L250J564l170r88N96P405K849q810N40J1399Q217N079
5073h79317L09m900j435L6n892l168m335L032K858L763O676k910r876m762K23
5058h99698P902m2p000j829N313P282K572m555r321J32P63P34M005l301k815J17
5042h99741O46j308j422N77O127m67J315K477K740R32l772m750j573M412p118
$$ plain form
5150 -907539 -908005 -904448 -907106 -907883 -911511 -916398 -908447 -898460 -900564 -906054 -906967 -908139 -906400 -906353 -907536 -905405
5134 -905405 -907661 -907153 -906298 -907059 -906312 -907834 -907550 -905432 -906432 -910277 -907030 -911259 -906428 -907537 -915807 -916814
5118 -916814 -911937 -910792 -905286 -903070 -906780 -900459 -897617 -899995 -900323 -896324 -894588 -894975 -896556 -897919 -900862
5103 -900862 -898288 -894351 -887320 -887938 -889207 -877655 -879404 -887920 -892406 -894080 -899357 -896575 -893305 -893056 -901452
5088 -901452 -903230 -903456 -907248 -903998 -902434 -905604 -906592 -905996 -898591 -895742 -904552 -904012 -892613 -884396 -879317
5073 -879317 -879008 -883908 -885343 -885307 -891199 -894367 -898702 -895670 -892812 -889049 -882373 -885283 -895159 -899921 -899698
5058 -899698 -891796 -891838 -898838 -900667 -895354 -888072 -885500 -890055 -899376 -899244 -898481 -897747 -893742 -897043 -899858 -899741
5042 -899741 -899095 -900403 -901825 -901248 -895121 -895588 -894273 -891796 -889056 -888124 -891896 -896646 -898219 -893807 -900925
5027i00925N87P085Q213M259o870r64J63p05k60m58j158L334N651l87q228q781
5011h99444J073L045K422R27M654P74L126M880N783J775M06k445k057m296n590
4996h84967l570J173j60R52P870N764l835o758p046m467K294N453P139m984j200
4981h86342L962Q962j810j845m987k031M336J54k522m196L842K42j088L595j473
4966h81201M190K120m2k55j468N116K945o574l480m68J029j316L45p220M912J0761
4950h70606l714k962j899p94j413K552K650J334P569q25o126m456N208k23l86
4935h74091k456o895k914L755M163J694j618l94J511J157n997O866R269l152n367
4920h74469l618k915l48Q47l073N236P971J495N076j408j877M236j943r6M973
$$ plain form
5027 -900925 -900338 -893253 -885040 -880781 -887651 -888615 -888452 -889157 -889417 -889875 -891033 -887699 -882048 -882435 -890663 -899444
5011 -899444 -898371 -895326 -892904 -891977 -887323 -886549 -883423 -878543 -872760 -870985 -870579 -873024 -875081 -879377 -884967
4996 -884967 -888537 -887364 -887524 -886572 -878702 -872938 -876773 -883531 -890577 -895044 -892750 -887297 -880158 -885142 -886342
4981 -886342 -882380 -873418 -875228 -877073 -882060 -884091 -879755 -879601 -882123 -886319 -882477 -882235 -883323 -879728 -881201
4966 -881201 -877011 -874891 -874933 -875188 -876656 -871540 -868595 -875169 -878649 -879117 -878088 -879404 -879059 -886279 -881367 -870606
4950 -870606 -874320 -877282 -879181 -879975 -881388 -878836 -876186 -874852 -867283 -868108 -874234 -878690 -873482 -873705 -874091
4935 -874091 -876547 -883442 -886356 -882601 -878438 -876744 -878362 -878756 -877245 -876088 -882085 -875219 -865950 -869102 -874469
4920 -874469 -878087 -881002 -881350 -880503 -883576 -878340 -870369 -868874 -863798 -865206 -867083 -862847 -864790 -864886 -859913
4905h59913l546o483J990K023L188K694p76k625o090L938j252m349m237k412k403
4890h80253K720Q00r71J1439Q780o415r200J319L141j166M910J104k123m19p213
4875h73547m821M983P964L66j336k34j805k094m352k792R910K119L34J835K211
4860h61259K034m634K676l147p200j075L285K274K299P207m696M9N141N648k1
4845h51419n881J269M009O653j040q229m687j551M68l612J610J735J3n494l606
4830h69762J223j570n88J778O822l048J809L254K185M157j269k367J996L627J054
$$ plain form
4905 -859913 -863459 -869942 -867952 -865929 -862741 -860047 -860823 -863448 -869538 -865600 -866852 -871201 -875438 -877850 -880253
4890 -880253 -877533 -876733 -877704 -866265 -857485 -863900 -873100 -871781 -868640 -869806 -864896 -863792 -865915 -866334 -873547
4875 -873547 -878368 -873385 -865421 -865055 -866391 -866625 -868430 -870524 -874876 -877668 -867758 -865639 -865305 -863470 -861259
4860 -861259 -859225 -863859 -861183 -864330 -871530 -872605 -869320 -867046 -864747 -857540 -862236 -862187 -857046 -851398 -851419
4845 -851419 -857300 -856031 -852022 -845369 -846409 -854638 -859325 -860876 -860408 -864020 -862410 -860675 -860662 -866156 -869762
4830 -869762 -868539 -870109 -870697 -868919 -862097 -865145 -863336 -860082 -857897 -853740 -855009 -857376 -855380 -851753 -850699
$$ [...]
##END NTUPLES=NMR SPECTRUM
##END=
