##TITLE=Analysis number 318900
Compound Code cc 51516
Book Reference 382/194
Project Code adrs
Chemist Name simons
##JCAMPDX= 6.0         $$ Bruker NMR JCAMP-DX V2.0
##DATA TYPE= NMR SPECTRUM
##DATA CLASS= NTUPLES
##ORIGIN= Bruker BioSpin GmbH
##OWNER= nmr
$$ XWIN-NMR		Version 3.5
$$ Mon Apr 24 14:16:09 2006 GMT Daylight Time (UT+1h)  MAYBRIDGE\nmr@NMR_250MHZ
##.OBSERVE FREQUENCY= 250.131544655141
##.OBSERVE NUCLEUS= ^1H
##.ACQUISITION MODE= SIMULTANEOUS (DQD)
##.ACQUISITION SCHEME= undefined
##.AVERAGES= 16
##.DIGITISER RES= 18
##SPECTROMETER/DATA SYSTEM= dpx250
##.PULSE SEQUENCE= zg30
##.SOLVENT NAME= CDCl3
##.SHIFT REFERENCE= (INTERNAL, CDCl3, 0, 16.522)
##AUDIT TRAIL= $$ (NUMBER, WHEN, WHO, WHERE, WHAT)
$$ ##TITLE= Audit trail, XWIN-NMR		Version 3.5
$$ ##JCAMPDX= 5.01
$$ ##ORIGIN= Bruker BioSpin GmbH
$$ ##OWNER= nmr
$$ C:\u/data/dgb/nmr/ADRS/2860/pdata/1/auditp.txt
$$ ##AUDIT TRAIL=  $$ (NUMBER, WHEN, WHO, WHERE, WHAT)
(   1,<2006-04-24 14:15:43.44 +100>,<MAYBRIDGE\nmr>,<NMR_250MHZ>,
      <created by zg, POWCHK disabled, PULCHK disabled
       configuration hash MD5:
       84 BC 41 DB A1 6E 1D 46 DA 25 12 A5 C1 ED C5 3A
       data hash MD5: 64K
       B9 34 3A 9E EC CC 0F FC 67 85 04 90 F1 58 8B BD>)
(   2,<2006-04-24 14:15:59.69 +100>,<MAYBRIDGE\nmr>,<NMR_250MHZ>,
      <Start of raw data processing
       ef LB = 0.3 FT_mod = 6 PKNL = 1 SI = 32K 
       data hash MD5: 32K
       00 4F 7E EC C5 AE 5C 0C DA 9E AF 7F 59 E0 E2 4F>)
(   3,<2006-04-24 14:16:01.25 +100>,<MAYBRIDGE\nmr>,<NMR_250MHZ>,
      <apk 
       data hash MD5: 32K
       7D 39 DF 1A 97 CF 01 5E 81 32 13 FC 8F 5B D2 79>)
(   4,<2006-04-24 14:16:02.01 +100>,<MAYBRIDGE\nmr>,<NMR_250MHZ>,
      <abs ABSG = 5 
       data hash MD5: 32K
       AA 64 6E D1 09 13 5F E2 DA 81 18 57 87 CD F1 CE>)
$$ ##END=
$$ 
$$ hash MD5
$$ 3D 5F 18 03 63 26 BE A2 5D 58 DE 8F 0C 3A F3 49
##$RELAX= 
##$RELAX= 
##$RELAX= 
##$RELAX= 
##$RELAX= 
##$RELAX= 
##$RELAX= 
$$ Bruker specific parameters
$$ --------------------------
##$DU= <C:\u>
##$EXPNO= 2860
##$NAME= <ADRS>
##$PROCNO= 1
##$TYPE= <nmr>
##$USER= <dgb>
##$AMP= (0..31)
100 100 100 100 100 100 100 100 100 100 100 100 100 100 100 100 100 100 
100 100 100 100 100 100 100 100 100 100 100 100 100 100 
##$AQSEQ= 0
##$AQ_mod= 3
##$AUNM= <au_zg>
##$AUTOPOS= <37 >
##$BF1= 250.13
##$BF2= 250.13
##$BF3= 250.13
##$BF4= 250.13
##$BF5= 500.13
##$BF6= 500.13
##$BF7= 500.13
##$BF8= 500.13
##$BYTORDA= 1
##$CFDGTYP= 0
##$CFRGTYP= 5
##$CHEMSTR= <none>
##$CNST= (0..31)
1 1 145 1 1 1 1 1 1 1 1 1 1 1 1 1 1 1 1 1 1 1 1 1 1 1 1 1 1 1 1 1 
##$CPDPRG= <>
##$CPDPRG1= <>
##$CPDPRG2= <>
##$CPDPRG3= <>
##$CPDPRG4= <mlev>
##$CPDPRG5= <mlev>
##$CPDPRG6= <mlev>
##$CPDPRG7= <mlev>
##$CPDPRG8= <mlev>
##$CPDPRGB= <>
##$CPDPRGT= <>
##$D= (0..31)
0 1 0 0 0 0 0 0 0 0.06 0 0 0 0 0 0 0.0002 0 0 0 0 0 0 0 0 0 0 0 0 0 0 
0 
##$DATE= 1145884542
##$DBL= (0..7)
120 120 120 120 120 120 120 120 
##$DBP= (0..7)
150 150 150 150 150 150 150 150 
##$DBP07= 0
##$DBPNAM0= <>
##$DBPNAM1= <>
$$ [...]
##$SUBNAM7= <"">
##$SUBNAM8= <"">
##$SUBNAM9= <"">
##$SW= 20.6930455092707
##$SWIBOX= (0..15)
0 0 3 0 0 0 0 0 0 0 0 0 0 0 0 0 
##$SW_h= 5175.983436853
##$TD= 65536
##$TD0= 1
##$TE= 295.16
##$TE2= 300
##$TE3= 300
##$TEG= 300
##$TL= (0..7)
0 120 120 120 120 120 120 120 
##$TP= (0..7)
150 150 150 150 150 150 150 150 
##$TP07= 0
##$TPNAME0= <>
##$TPNAME1= <>
##$TPNAME2= <>
##$TPNAME3= <>
##$TPNAME4= <>
##$TPNAME5= <>
##$TPNAME6= <>
##$TPNAME7= <>
##$TPOAL= (0..7)
0.5 0.5 0.5 0.5 0.5 0.5 0.5 0.5 
##$TPOFFS= (0..7)
0 0 0 0 0 0 0 0 
##$TUNHIN= 0
##$TUNHOUT= 0
##$TUNXOUT= 0
##$USERA1= <user>
##$USERA2= <user>
##$USERA3= <user>
##$USERA4= <user>
##$USERA5= <user>
##$V9= 5
##$VALIST= <valist>
##$VCLIST= <CCCCCCCCCCCCCCC>
##$VD= 0
##$VDLIST= <DDDDDDDDDDDDDDD>
##$VPLIST= <PPPPPPPPPPPPPPP>
##$VTLIST= <TTTTTTTTTTTTTTT>
##$WBST= 1024
##$WBSW= 4
##$XGAIN= (0..3)
0 0 0 0 
##$XL= 0
##$YL= 0
##$YMAX_a= 453404
##$YMIN_a= -665676
##$ZGOPTNS= <>
##$ZL1= 120
##$ZL2= 120
##$ZL3= 120
##$ZL4= 120
##$ABSF1= 16.522
##$ABSF2= -4.171173
##$ABSG= 5
##$ABSL= 3
##$ALPHA= 0
##$AQORDER= 0
##$ASSFAC= 0
##$ASSFACI= 0
##$ASSFACX= 0
##$ASSWID= 0
##$AUNMP= <proc_1d>
##$AZFE= 0.1
##$AZFW= 0.1
##$BCFW= 0
##$BC_mod= 0
##$BYTORDP= 0
##$COROFFS= 0
##$CY= 12.5
##$DATMOD= 1
##$DC= 0
##$DFILT= <>
##$DTYPP= 0
##$F1P= 14.0000005364418
##$F2P= -0.99999901652339
##$FCOR= 0.5
##$FTSIZE= 32768
##$FT_mod= 6
##$GAMMA= 0
##$GB= 0
##$INTBC= 1
##$INTSCL= 1
##$ISEN= 128
##$LB= 0.3
##$LEV0= 0
##$LPBIN= 0
##$MAXI= 10000
##$MC2= 0
##$MEAN= 0
##$ME_mod= 0
##$MI= 0
##$NCOEF= 0
##$NC_proc= -2
##$NLEV= 6
##$NOISF1= 0
##$NOISF2= 0
##$NSP= 0
##$NTH_PI= 0
##$NZP= 0
##$OFFSET= 16.522
##$PC= 1
##$PHC0= 166.3061
##$PHC1= 2.464212
##$PH_mod= 1
##$PKNL= yes
##$PPARMOD= 0
##$PSCAL= 4
##$PSIGN= 0
##$REVERSE= no
##$SF= 250.13
##$SI= 32768
##$SIGF1= 0
##$SIGF2= 0
##$SINO= 400
##$SIOLD= 32768
##$SREGLST= <1H.CDCl3>
##$SSB= 0
##$STSI= 32768
##$STSR= 0
##$SW_p= 5175.98343685301
##$SYMM= 0
##$S_DEV= 0
##$TDeff= 65536
##$TDoff= 0
##$TI= <Analysis number 999999
Compound Code 99
Book Reference 9
Project Code 9>
##$TILT= no
##$TM1= 0
##$TM2= 0
##$TOPLEV= 0
##$USERP1= <user>
##$USERP2= <user>
##$USERP3= <user>
##$USERP4= <user>
##$USERP5= <user>
##$WDW= 1
##$XDIM= 32768
##$YMAX_p= 331563011
##$YMIN_p= -33096
$$ End of Bruker specific parameters
$$ ---------------------------------
##NTUPLES= NMR SPECTRUM
##VAR_NAME=  FREQUENCY,     SPECTRUM/REAL,   SPECTRUM/IMAG
##SYMBOL=    X,             R,               I
##VAR_TYPE=  INDEPENDENT,   DEPENDENT,       DEPENDENT
##VAR_FORM=  AFFN,          ASDF,            ASDF
##VAR_DIM=   32768,         32768,           32768
##UNITS=     HZ,            ARBITRARY UNITS, ARBITRARY UNITS
##FACTOR=    0.157963299565203, 1,           1
##FIRST=     4132.6476996994, 0,             0
##LAST=      -1043.33573715361, 0,           0
##MIN=       -1043.33573715361, -33096,      0
##MAX=       4132.6476996994, 331563011,     0
$$ Real data points
##PAGE= N=1
##DATA TABLE= (X++(R..R)), XYDATA
$$ [...]
16550I454j347m183l339L217O493k478k730J069n980k047L660m329k855j823O218
16535a000K207k270j580r34K217N439k831k906n24L177N547m180j1192M585R558
16520E313K898j782p713O420M429M29K671O95K845L898J789o695j3338m583J023
16505a701M467K577L690P009q3M542K165K103l703k622q051l782Q797p57l017
16490A1634O843k102k949r88J971K428l00k717p848q392M419M94j497p70j292
16475a066K256L218Q112Q732L155n636n143k396M20l879N566J1541k060r683l99
16460A2738K20M668L008o195L09L643o228J362O95j952p06J263n995n872J687
16445B645R694J811L443l096j404j021L899P8j233k992L430P48j319K400k436
$$ plain form
16550 9454 8107 3924 585 3802 10295 7817 5087 6156 176 -1871 1789 -2540 -5395 -7218 -1000
16535 -1000 1207 -1063 -2643 -3577 -1360 4079 1248 -1658 -2182 995 6542 2362 -8830 -4245 5313
16520 5313 8211 6429 -1284 5136 9565 9994 12665 13360 16205 20103 21892 15197 1859 -2724 -1701
16505 -1701 2766 5343 9033 16042 15959 20501 22666 24769 21066 18444 10393 6611 15408 14651 11634
16490 11634 18477 16375 13426 12438 14409 16837 16537 13820 5972 -2420 1999 2493 996 226 -1066
16475 -1066 1190 4408 12520 21252 24407 18771 13628 11232 11652 7773 13339 24880 22820 13137 12738
16460 12738 12958 17626 20634 14439 14748 18391 12163 13525 14220 12268 11562 12825 6830 958 2645
16445 2645 12339 14150 17593 14497 13093 12072 15971 16049 14816 11824 15254 16002 14683 17083 14647
16430A4647r427p758N753J2095Q106J135J917n395l289Q04n951m826P662m014
16416A1459r95j120J741M100P434j177l710k4M42L243l605m212L593j871m128
16401A1170M90J368Q257P655m595n03Q137j618m873m883j204j134m586k624K320
16386A3377J327n010J013O625O060o562q362n981K484M625N726L828q025m039
16372G086M807O760K030M088k672r78k095J506m384j870j100j02k126j523K970
16357A2397J595Q59j210J974l992n307J420L549L723M529o507j493M482j821k990
16342A1208k995K245J374K521J228l832j272M827l538j436O411R783l253l243
16328B0028o156J608O834Q873J783k679n626p080k309l504K660O693j640l569
$$ plain form
16430 14647 5220 -2538 3215 15310 23416 24551 26468 21073 17784 18588 12637 7811 15473 11459
16416 11459 10464 9344 11085 15185 22619 21442 17732 17708 18150 21393 17788 13576 17169 15298 11170
16401 11170 11660 13028 21285 28940 24345 23842 31979 30361 25488 20605 19401 18267 13681 11057 13377
16386 13377 14704 9694 10707 17332 23392 16830 8468 2487 4971 9596 15322 19150 11125 7086
16372 7086 11893 18653 20683 24771 22099 21121 19026 20532 16148 14278 13178 13076 10950 9427 12397
16357 12397 13992 14851 13641 15615 11623 6316 7736 11285 15008 19537 13030 11537 16019 14198 11208
16342 11208 8213 10458 11832 14353 15581 11749 10477 15304 11766 10330 16741 26524 23271 20028
16328 20028 13872 15480 22314 31187 32970 30291 24665 17585 15276 11772 14432 21125 19485 15916
16314A5916l531K744L368M799J781m993n383k253q27k386L530O389L230m281J558
16299A9661J246k386l024Q07J896l116K756K379m966m644L988o98j212j782k798
16284H107l451k162p317J411J5989M609k516L278J532J091K068J199J913j919
16270B3832r164n242O967J768m420k982p08q728m242L350P220Q88o247L713K004
16255H009J727M606Q231R816M98o214m925R22n97n294l68m737k358R43n261j388
16239C610O313O190K050o230l231j988O987Q875j198q360j286j257o26P51j948
16224H652K072K806J581J350P297O268r207l23k821j037p268J01O529K274m193
16209A4081M657j192J018M29O068O652m810r577j675J316J073L398l796r10l408
$$ plain form
16314 15916 12385 15129 18497 23296 25077 20084 14701 12448 11621 9235 12765 19154 22384 18103 19661
16299 19661 20907 18521 15497 16304 18200 15084 17840 20219 15253 10609 14597 13899 12687 10905 8107
16284 8107 4656 2494 -4823 -3412 12577 17186 14670 17948 19480 20571 22639 23838 25751 23832
16270 23832 14668 9426 16393 18161 13741 10759 10051 1323 -2919 431 7651 8539 2292 6005 8009
16255 8009 9736 14342 22573 32389 32887 26673 21748 22670 22073 16779 16411 11674 9316 10259 4998 3610
16239 3610 9923 16113 18163 11933 8702 6714 13701 22576 21378 13018 11732 10475 9849 10600 8652
16224 8652 10724 13530 15111 16461 23758 30026 20819 20496 17675 16638 9370 9471 16000 18274 14081
16209 14081 18738 17546 18564 18993 25061 31713 26903 17326 15651 16967 18040 21438 17642 16732 13324
16194A3324q339j495J0452M00K611k889j178J217L183k763j356K992M48n648l483
16179G476J445K755k29j143J061p403p073J356L419P037k3j293r60r03N860K533
16163A3915l610M612q05n120m730O057J903j124m681L582J606p10L907K277n780
16148A1299j052n954P033K748k969l397L161L961P611o080m306J040K455M973
16134B0523K963o552j0183q927o317Q59N312j507k168M801P895l453N577j984
16120F839J282N356N08j677k958K276N908N98K887J099J312J64m90n117l792l699
16104A0496J421M922k447J33k256m674j57J1974N914k612q068J022L40l177m077
16089H754K824o70j184J464L931j82o346k833L667J186o594m126k627J745P469
$$ plain form
16194 13324 4985 3490 13942 14342 16953 14064 12886 14103 17286 14523 13167 16159 16607 10959 7476
16179 7476 8921 11676 11447 10304 11365 3962 -3111 -1755 1664 8701 8678 7385 6425 5522 11382 13915
16163 13915 10305 14917 14112 8992 4262 10319 12222 11098 6417 9999 11605 10895 14802 17079 11299
16148 11299 10247 4293 11326 14074 11105 7708 10869 14830 22441 16361 12055 13095 15550 20523
16134 20523 23486 16934 6751 -2176 -8493 -7634 -2322 -3829 -5997 -1196 6699 3246 8823 6839
16120 6839 8121 13477 13985 12308 9350 11626 17534 18132 21019 22118 23430 23594 23104 17987 14195 10496
16104 10496 11917 16839 14392 14525 12269 7595 7438 19412 25326 22714 14646 15668 16008 12831 8754
16089 8754 11578 10908 9724 11188 15119 14937 8591 5758 9425 10611 4017 -109 -2736 -991 6478
16074F478O340O006l532o278m086o131l575l970M70L011J1298O183L805k61J205
16059A6963r758j059N977j783k183J529L484K462j0771k68k149O969P249l600
16045A3062q34m21n162j498K235L746L027q008Q51P506k272J595k440p172J608
16030E823l974k776o02P672N20P276L602q877N179J1696k425q409J839K019o316
16015A2247k098n36O11k69O048N700n304K125J191o43n12O709k47p732o003J96
15999A1483k260K160J648j241p552K56P980N813n175r911r95N323K388k901k010
15984E006O18k731m058R662O652j493n003m689L319P307O263K258k801r001M384
15969A5693P114k432m020L076m91M275j387k920J0101M331Q9m496n136M17K22
$$ plain form
16074 6478 12818 18824 15292 9014 4928 -1203 -4778 -8748 -8278 -5267 6031 12214 16019 15758 16963
16059 16963 7205 6146 12123 10340 8157 9686 13170 15632 4861 4593 2444 9413 16662 13062
16045 13062 12228 11807 6645 5147 7382 11128 14155 6147 6998 14504 12232 13827 11387 4215 5823
16030 5823 1849 -927 -1529 6143 6663 13939 17541 8664 13843 25539 23114 14705 16544 18563 12247
16015 12247 10149 9613 10224 9955 16003 21703 16399 18524 19715 19072 18560 25269 25022 17290 11287 11483
15999 11483 9223 11383 13031 11790 4238 4494 12474 18287 13112 3201 2206 7529 9917 7016 5006
15984 5006 5624 2893 -1165 8497 15149 13656 8653 3964 7283 14590 20853 23111 20310 11309 15693
15969 15693 22807 20375 16355 19431 18940 23215 21828 18908 29009 33340 33429 28933 23797 24214 24436
15954B4436l136O112l940j435j221j83K806j10l951k667J822M377j988m499j657
15939A4766l785K753K840o124o537J892O859M340N142L641M82n600p58J397K045
15924B3353Q176N666l024m22l130j462o930J286j027L786P877P65M317L957Q493
15909E1681P848K514R063M770n758k142Q079J1248J8800O066M936Q561Q897Q376
15895A42939J1375P277J5124L83j2078q781o629m851J936N75j1206r344j3300
15882A13420j6791j008Lq42o229r866l827L550m904m433j0288l340k278p572j0760
15867C4835n171N864N403L593k161k175j063Q87J4q50p728k974j691K372J498
15852C0653k685L56J941l554j246N8l674m431k647m48N855Q973Q339q241p559
$$ plain form
15954 24436 21300 27412 23472 22037 20816 20633 23439 23329 19378 16711 18533 22910 20922 16423 14766
15939 14766 10981 13734 16574 10450 3913 5805 12664 17004 22146 25787 26269 20669 19911 21308 23353
15924 23353 31529 37195 34171 33749 30619 29157 22227 23513 22486 26272 34149 34914 39231 43188 51681
15909 51681 59529 62043 71106 75876 70118 67976 76055 87303 106103 112169 117105 125666 134563 142939
15895 142939 154314 161591 176715 177098 165020 156239 149610 144759 146695 147270 136064 126720 113420
15882 113420 96629 95621 95624 94782 88553 78687 74860 78410 73506 69073 58785 55445 53167 45595 34835
15867 34835 29664 35528 40931 44524 42363 40188 39125 40012 40026 39176 31448 28474 26783 29155 30653
15852 30653 27968 28324 30265 26711 25465 25523 21849 17418 14771 14323 20178 29151 37490 29249 21690
15837B1690K825K067J193n93l863j005J601L781o543n3j393k404P068J54l949
15822B0576j806M44j224K497K003J919p74r72O721q52N39M741L79l42N287M370
15806D3506o495K434l662j1208o901k561R20k46j447J439m56j075J54j602N230
15791A8030O463q681o015K783J265j670o403l269Q218J454o18K19K111K504k290
15776A4101P79l926K009k07K97j525j389r62l467K844P240j8p208m332o350j293
15760c407K498P47j244M145N64K660k382k195O223K718J024L156J585m508L64
15745A1948j733m113j684J653L191L89k225K245M278J922N808o131k878J849R39
15730A5458j398m405L198l031q849L615P886l025j896N145K562o459l128m475
$$ plain form
15837 21690 24515 26582 27775 27182 23319 22314 23915 27696 21153 21100 19707 17303 24371 24525 20576
15822 20576 18770 19214 17990 20487 22490 24409 23635 22663 29384 28532 29071 33812 34191 33849 39136 43506
15806 43506 37011 39445 35783 24575 17674 15113 16033 15787 14340 15779 15323 14248 14402 12800 18030
15791 18030 24493 15812 9797 12580 13845 12175 5772 2503 10721 12175 11557 11776 13887 16391 14101
15776 14101 14880 10954 12963 12756 13053 11528 10139 9177 5710 8554 15794 15776 8568 4236 -2114 -3407
15760 -3407 -909 -162 -1406 2739 3303 5963 3581 1386 7609 10327 11351 14507 16092 11584 11948
15745 11948 10215 6102 4418 6071 9262 9651 7426 9671 13949 15871 21679 15548 12670 14519 15458
15730 15458 14060 9655 12853 9822 973 4588 12474 9449 7553 12698 15260 8801 5673 1198
15716A198J27L472m273m450k808K804R558N838J056j810n523m798K890M646K79
15701H206j140K421j958m077J055P474l697m881J252M611k515Q95K106N532l23
15686A4961N97M029J892l652n46J741j775k218m874n318j129j581P143N620L678
15671A8568q89n186m259j50O111M76n030rL3K604j646o093N074M806q63M501J
15654A8049m906K485J202m401l516m7J590j170L503L495j134P59m083m218N364
15639A2972K00O171K062j8m864m436l056J690O118N439O63L5m250n735o19q69
15623A1503j748J909O004K767l655j266M388Q28m776l383J845k702O155O813j985
15608B2697k143l644k375j855p128N99J0182m441l22Q70k240L571L560k398k244
$$ plain form
15716 1198 1325 4797 524 -3926 -6734 -3930 5628 11466 12522 10712 5189 391 3281 7927 8206
15701 8206 7066 9487 7529 3452 4507 11981 8284 3403 4655 9266 6751 7646 9752 15284 14961
15686 14961 15558 19587 21479 17827 17281 19022 17247 15029 10155 4837 3708 2127 9270 14890 18568
15671 18568 17679 12493 8234 8084 14195 14671 9641 9632 9665 12269 10623 4530 9604 14410 13547 18048 18049
15654 18049 13143 15628 16830 12429 8913 8866 10456 9286 12789 16284 15150 15909 11826 7608 12972
15639 12972 13172 19343 21405 21387 16523 12087 9031 10721 16839 22278 22941 22976 18726 12991 12372 11503
15623 11503 9755 11664 17668 20435 16780 15514 19902 20730 15954 12571 14416 11714 17869 24682 22697
15608 22697 20554 16910 14535 12680 5552 6151 16333 11892 11570 12440 10200 13771 17331 14933 12689
15593A2689j347m514j2417K59N066M975M480L350J373M179j370k050l066L833
15579A5440L635n00r6j156n342k557N41r847r72O172N482j321l636k132J2511
15564A6222M738r67K852m80o934o206N882m860o695L536n32k673K158J404M023
15549A1468O231q960j227K835J546j195J490k929M776N483j792n76J081q8O454
15534B4597Q485Q965J5689L5481M0681K6932J4618j8678n7934l8642j9768r476
15522C0950m021K322O109r342o544l450r94K412J20K44n898k580l063O602j394
15507A1473K620L742j619o743q47N210N137M211k563m051j076p66qk677r31j29
15491A0983N768k158k091L284M184j454r660n247M320N936K902L000j071k878
$$ plain form
15593 12689 11342 6828 -5589 -5330 -264 4711 9191 12541 13914 18093 16723 14673 11607 15440
15579 15440 19075 18575 18479 17323 11981 9424 9965 118 -854 5318 10800 9479 5843 3711 16222
15564 16222 20960 19993 22845 22365 15431 9225 15107 10247 3552 7088 6556 3883 6041 7445 11468
15549 11468 17699 8739 7512 10347 11893 10698 12188 9259 14035 19518 17726 17150 18231 18143 24597
15534 24597 33082 42047 57736 93217 133898 160830 175448 156770 98836 60194 40426 30950
15522 30950 26929 29251 35360 26018 19474 16024 15030 17442 17562 17806 11908 9328 6265 12867 11473
15507 11473 14093 17835 16216 9473 8626 13836 18973 23184 20621 16570 15494 14728 14720 12043 11112 10983
15491 10983 16751 14593 12502 15786 19970 18516 8856 3609 7929 13865 16767 19767 18696 15818
15477A5818n917p96K29q976j636J1173P417n838m604k007J277O474k871m096J925
15462G572n315M462k852K425P767o419l265K469N629m662j139K288M097N638N512
15447B4207j325q679L282N61j869Q18J633j87p08J165j3137o557L0m06N615R151
15431A3594J683n017K986o048P070J3245J667n952l626J779n193o711J742J214
15417A2433n666R57Q610j880j401n043k525L808L354N302l137j5524p422O881
15403a253O634N73K816m06K807K675p106k943O437R50q235m453j307M377N31M977
15387G074N213Q122j130j499N329j50m821k244Qk019j696L298L305M348Q91l661
15371B0368j1492o09k77l593O080Q083L141l796n054P10r95j900k784k359N348
$$ plain form
15477 15818 9901 9105 9334 358 -1278 9895 17312 11474 6870 4863 6140 12614 9743 5647 7572
15462 7572 2257 6719 3867 6292 14059 7640 4375 6844 12473 7811 6672 8960 13057 18695 24207
15447 24207 22882 14203 17485 18046 16177 16995 18628 18441 17733 18898 5761 -796 -766 -1172 4443 13594
15431 13594 15277 10260 13246 7198 14268 27513 29180 23228 19602 21381 16188 9477 11219 12433
15417 12433 6767 7724 16334 14454 13053 8010 5485 9293 12647 17949 14812 -712 -8134 -1253
15403 -1253 5381 5954 8770 8364 11171 13846 6740 3797 10234 11184 2949 -1504 -2811 1566 2097 7074
15387 7074 12287 20409 19279 17780 23109 22959 18138 15894 15902 13883 12187 15485 18790 23138 24029 20368
15371 20368 8876 8267 7990 4397 10477 18560 21701 17905 12851 13561 12566 10666 7882 5523 10871
15356A0871P709m982q299l306M140k32l736l130J116K14N193k163l943L366R022
15341A1840O076K60j1640m517p46O778l145n13j479O69k245R49o72K131O295k764
15325G277l538K399N022k51l377m45K115J443J582M541m04o514K50K809J916K737
15309A7562k589k918j612n00o191M413J260J607J202m817m009m973K484L443l096
15294A266K271N051m829L605K795J803k495k349J440M191K977m150l114L020O017
15279A7499J639l656n814K320K019R68J619o069l7P25J561M146k6j335K022k766
15263A4815l207m631L059O766L360n634n76j13O053K002j1007J173M649n075K344
15248A3978q8O89k068k713k830n78l069K198j262O61M360P222L373l690m947P77
$$ plain form
15356 10871 18580 13598 5299 1993 6133 5901 2165 -965 151 365 5558 3395 -548 2818 11840
15341 11840 17916 18176 6536 2019 1273 8051 4906 4393 2914 3583 1338 2287 1615 3746 10041 7277
15325 7277 3739 6138 11160 10909 7532 7087 9202 10645 12227 16768 16364 9850 10100 12909 14825 17562
15309 17562 14973 12055 10443 9943 3752 8165 9425 11032 12234 7417 3408 -1565 919 4362 1266
15294 1266 3537 8588 3759 7364 10159 11962 9467 7118 8558 12749 15726 11576 8462 11482 17499
15279 17499 19138 15482 9668 11988 14007 14975 16594 10525 10488 11213 12774 16920 16894 15559 17581 14815
15263 14815 11608 6977 10036 16802 20162 14528 13952 13839 19892 21894 10887 12060 16709 11634 13978
15248 13978 13890 14579 12511 9798 6968 6390 3321 5519 4257 4918 9278 16500 19873 16183 11236 12013
15232A2013J81r26l713L850M67M482Q11k722K327K348j88k811J947m7J110L786
15216B2915j686j070l910L814j952l273M787j0527n811M645o20M223K898K794
15202A7227L783K780k908m195l713r982q49L319K333J933J927k725jJ452j967
15187H414j610k370l037j377J626P373L287L367j666r048k555N583L611K286n458
15172H426o085N823Q684m839n058o00O024L978O200Q339j396l943r149k874k602
15157A0928r345k634O604j650k292j823J089Q200l352q829N029N072L707L357
15143A4061j578m378k588o054m974M273P762J191k805l546j484r193k2M077J0395
15128E137P10m234L656P641N346J056o066r639N196M651o80o94l203k582p379
$$ plain form
15232 12013 12194 11268 7555 11405 11872 16354 17165 14443 16770 19118 18930 16119 18066 18019 19129 22915
15216 22915 21229 20159 16249 20063 18111 14838 19625 9098 3287 7932 7312 11535 14433 17227
15202 17227 21010 23790 20882 16687 12974 2992 2143 5462 7795 9728 11655 8930 8929 10381 8414
15187 8414 6804 4434 1397 20 1646 9019 12306 15673 14007 4959 2404 7987 11598 13884 8426
15172 8426 2341 8164 16848 12009 6951 6351 12375 16353 22553 30892 29496 25553 16404 13530 10928
15157 10928 1583 -1051 5553 3903 1611 -212 877 9077 5725 -3104 1925 6997 10704 14061
15143 14061 12483 8105 5517 -537 -5511 -1238 6524 7715 4910 1364 -120 -9313 -9335 -5258 5137
15128 5137 5847 1613 5269 12910 18256 19312 13246 3607 8803 13454 12774 12080 8877 6295 -1084
15113a084O199L358j803m99K166l800L159Q908N253N557J0190J4423J0447K0263
15099H2737J6810J1241j381j9888j8071m534m858L491j384l959o058l69K385n513
15085E0649p20M450K004J886J407k709N069Q206n17m173K344o93j0659o084O29
15070E1089o568j415J813O533k838M383m209l628m002k217J706k626j00K501N591
15055D6013N652L828Q033l210l602k938n84q47K176J712n697k569M220N766K373
15040F0326j487j458q089p642l418l39O359j694n65Q37K93l023q9k209K955K961
15024D3718K165Q655Q381K159K398M857L764J964M379J80k333k911Q4n84L021
15009G9897L948J3291J0935n50j1411m504O472J4781K0771R372N4Q631J7577K5273
$$ plain form
15113 -1084 5115 8473 6670 6171 8337 4537 7696 16604 21857 27414 37604 52027 62474 82737
15099 82737 99547 110788 109407 89519 71448 66914 62056 65547 64163 60204 54146 53777 56162 50649
15085 50649 49929 54379 56383 58269 59676 56967 62036 70242 69725 65552 67896 67203 56544 50460 51089
15070 51089 44521 43106 44919 51452 48614 52997 48788 45160 41158 38941 40647 38021 37921 40422 46013
15055 46013 51665 55493 63526 60316 56714 53776 53192 52345 54521 56233 50536 47967 52187 57953 60326
15040 60326 58839 57381 49292 41650 38232 37893 44252 42558 41993 42830 43123 40100 40011 37802 40757 43718
15024 43718 45883 54538 62919 65078 67476 72333 76097 78061 82440 82620 80287 77376 77460 76876 79897
15009 79897 83845 97136 108071 107521 96110 91606 98078 112859 133630 143002 143056 151687 169264 194537
14995A94537K3727K3942K2808J5150K3448L6116L7832N1400O1115O2888O9245
14984F22208R2903J18384J54348K06344K71639L74186N40182Q73630J519693K856982
14974G630499N459226Q436777P243933L177190j084826q926159q402485m337982
14966I196173k271365j381810r55643o81840m93283l78089k78157k23049j78502
14957B354435j57227j36706j13799r1094p6524o3999o7549q1836p0354n7049n5656
14946A382642m7221m6160m6149m4084m4506l4349k4934k4731k8289l2393l9553
14935I70273m3528l8251k8544k3184k3860k7119k5516j8077j9687k2195k6228
14924F74084j7799j3703j9314k7334j2827j3906j3108r822j7488j5014j4811j4816
$$ plain form
14995 194537 218264 242206 265014 280164 303612 339728 377560 428960 490075 552963 622208
14984 622208 715111 833495 987843 1194187 1465826 1840012 2380194 3253824 4773517 7630499
14974 7630499 13089725 21526502 28770435 31947625 30862799 21936640 13534155 9196173
14966 9196173 6924808 5542998 4587355 3905515 3412232 3034143 2755986 2532937 2354435
14957 2354435 2197208 2060502 1946703 1855609 1779085 1715086 1647537 1565701 1495347 1438298 1382642
14946 1382642 1335421 1289261 1243112 1199028 1154522 1120173 1095239 1070508 1042219 1009826 970273
14935 970273 926745 888494 859950 836766 812906 785787 760271 742194 722507 700312 674084
14924 674084 656285 642582 623268 595934 583107 569201 556093 546271 528783 513769 498958 484142
14912D84142j5584n432l652o518j5738q909r034j1213p459q140j2790j4936j2413
14899C52324l604n146r380J797p13j2763j5201q866q626p811q488j0363p283k753
14885B53124J743j0373m216j014m861j2994o303N730o516n888m396m907m392k892
14871A91845l988p541n806O89j833j391l426k694l232n215l560q400l920r73P445
14856A48000N606O974J196o889K998J0207L569P966K056O812K3096K0924K2728
14843B55243P876j3089r853N918j2467l0710j9593j8131j58n448l521n992o056
14830A44019r60m333j2519r455m566R11m510M633j474l315k990j219n423m541
14816I4258K838N366o587m196M568m863l157k895l592K290k000l287K198j397
$$ plain form
14912 484142 468558 463126 459474 452956 437218 428309 419275 408062 400603 392463 379673 364737 352324
14899 352324 348720 343574 334194 335991 335278 322515 307314 298448 289822 282011 273523 263160 255877 253124
14885 253124 254867 244494 240278 239264 234403 221409 215106 220836 214320 208432 204036 199129 194737 191845
14871 191845 187857 180316 174510 175199 173366 171975 168549 165855 162623 157408 153848 145448 141528 140555 148000
14856 148000 153606 160580 161776 154887 157885 168092 171661 179627 181683 188495 211591 232515 255243
14843 255243 263119 250030 240177 246095 233628 202918 183325 165194 165036 159588 156067 150075 144019
14830 144019 143059 138726 126207 116752 112186 113097 108587 113220 111746 108431 105441 104222 98799 94258
14816 94258 97096 102462 95875 91679 96247 91384 88227 85332 81740 84030 82030 78743 80941 79544
14802G9544o548J889m062K378J89N266K615j736m674r797L904O294q77k476l179
14787F8730j893k237k658K579m257p774K905k463p589K458N21o712n748J591M823
14772D2276J101L235m613q173l353J452N403o756m325l290m607q729N307J0258
14758B5186R235M583n651r765p126q686K505k567O980J1382m622p951P306l91
14744B0418p554k151R843Q90o814m72k542j24l1K498M030J504O853k465o231K945
14728B0597j101m993J119n72J823M627l796r211m993N86K821l905L611N705R97
14713A3315k184K789J416k078j287J729n682L49N184n001m26M375p438l685Q202
14698I578K006K61k370m375J0001K177o272j1389J714O401j885m206M228N298
$$ plain form
14802 79544 72996 74885 70823 73201 73390 78656 81271 79535 74861 65064 68968 75262 74385 71909 68730
14787 68730 66837 64600 61942 64521 60264 52490 55395 52932 45343 47801 48322 41610 35862 37453 42276
14772 42276 43377 46612 41999 33826 30473 31925 37328 30572 26247 22957 18350 9621 14928 25186
14758 25186 34421 39004 33353 23588 16462 7776 10281 7714 14694 26076 21454 13503 20809 20418
14744 20418 12864 10713 20556 21446 14632 14160 11618 11494 11463 13961 17991 19495 26348 23883 17652 20597
14728 20597 19496 14503 15622 15050 16873 21500 17704 8493 3500 4086 6907 3002 6613 12318 13315
14713 13315 11131 13920 15336 13258 11971 13700 8018 8367 13551 8550 8124 12499 5061 1376 9578
14698 9578 11584 11845 9475 5100 15101 17278 11006 -383 1331 7732 5847 1641 5869 11167
14684A1167K44N722L694q445o18K225k775j464k422m305N3K391j155j882p422
14669d992N993k771o626r19N344M307r42J19j133l334M392L193j779j173L118
14654B797m374o273NM166M046K766j713k596k641K337R915L832N5J35m814n324
14638B319j114k542m74Q241l781k551k07j938J588k191p99K452M138O19O21o54
14622C727k514n049p09K236k758o88O668L736L657o114o722m584Q86P917L259
14607B948j132l205l005K909K774o762m466J0l81O753M747J0814P119r719q555
14592H49m19Q42P3N19q10o233O418J225K062m161j1465m04N945O028l675o204
14576i410p76j707Q81j775L814M44K68j1M30N794p59m023J895m47p700n000N935
$$ plain form
14684 11167 11411 17133 20827 12382 11764 13989 11214 9750 7328 3023 3076 5467 4312 2430 -4992
14669 -4992 1001 -1770 -8396 -9315 -3971 336 -606 -487 -1620 -4954 -562 2631 852 -321 2797
14654 2797 -1577 -7850 -7845 -3679 367 3133 1420 -1176 -3817 -1480 8435 12267 12322 12457 7643 2319
14638 2319 1205 -1337 -1811 6430 2649 98 -109 -2047 -459 -2650 -3449 -997 3141 3760 4381 3727
14622 3727 1213 -3836 -4545 -2309 -5067 -5755 913 4649 8306 2192 -4530 -9114 -8228 -311 2948
14607 2948 1816 -1389 -4394 -1485 1289 -5473 -9939 -9929 -10310 -3557 1190 12004 19123 9404 849
14592 849 430 1272 1345 1864 1054 -5179 1239 2464 4526 365 -11100 -11504 -5559 469 -3206 -9410
14576 -9410 -10186 -11893 -11012 -12787 -8973 -8529 -8261 -8272 -7842 -2048 -2807 -6830 -4935 -5382 -13082 -18082 -12147
14559a2147L828P368L66L17n246J0069K129j372j1866n44N38N202j247j2367J096
14544a3876N05P585K349o371K122O166J865O181kL619l84m023p475m466j221O06
14528f820M52L448K545o42P71K04K551m546L64L311j490k87K415N000l151j2594
14512h469j20k132N081O46m403J427J030L538p5j489j627L065l515N27P0j725
14496h171J533O47j000k97K660n719n39n641l620O576N243L003J460o073l889
14481a3827j641M29M837R14M993O075K322J624N371j0299n251R92O8m202K408
14466e187N17m33k817L380L759o528J642k261k372k732J076L970l434n062j449
14451a7931M630L257N272K937k788N40N31M790J81Q91j713k162J273k957j245
$$ plain form
14559 -12147 -8319 -951 -585 -268 -5514 4555 6684 5312 -6554 -7098 -6560 -1358 -2605 -14972 -13876
14544 -13876 -13371 -5786 -3437 -9808 -7686 -1520 345 6526 6524 10143 9759 5736 -1739 -6205 -7426 -6820
14528 -6820 -6368 -2920 -375 -1017 -246 -42 2509 -2037 -1673 1638 148 -139 2276 7276 4125 -8469
14512 -8469 -8589 -10721 -5640 -4994 -9397 -7970 -6940 -3402 -3477 -4966 -6593 -3528 -7043 -6516 -6446 -8171
14496 -8171 -6638 -5991 -6991 -7288 -4628 -10347 -10886 -16527 -20147 -13571 -8328 -5325 -3865 -9938 -13827
14481 -13827 -15468 -15039 -10202 -9288 -4295 1780 4102 5726 11097 798 -4453 -3461 -3393 -7595 -5187
14466 -5187 -4670 -5103 -7920 -4540 -781 -7309 -5667 -7928 -10300 -13032 -11956 -7986 -11420 -16482 -17931
14451 -17931 -13301 -10044 -4772 -1835 -4623 -4083 -3552 1238 1419 2310 597 -1565 -292 -3249 -4494
14436d494j595j318K46p54m8k326k810M034M595n04n38k643o765m803K295K002
14420a5426K563K055O698N18p86M9J1441P66J143R806R536P182J9136M4524M3018
14405A42223K7836L996l7522n8208l6948j4883j211l248n622k548p870q259j244
14392c508P495P315N291k598q536o939n95N199P357P55J876k351l813l24P070
14377A3694k358n546J896k282n214P055M356p321k620M183K885p525m751R47N944
14362C343k717J965N559l894k751k222j822j999N096P266L755o13J227l386j0477
14347a670n44l75n569r322m805L766O450K567J474m281n542m730O031N904L832
14332f814M332J236L423o25l160k077k72j7q52p590K132R380J330j385r05N730
$$ plain form
14436 -4494 -6089 -7407 -7161 -7915 -7963 -10289 -13099 -9065 -4470 -4974 -5512 -8155 -14920 -19723 -17428 -15426
14420 -15426 -12863 -10808 -4110 -3592 -4378 -4329 7112 7878 9021 18827 28363 35545 54681 99205 142223
14405 142223 170059 174055 136533 78325 41377 26494 25283 22035 16413 13865 5995 -2264 -3508
14392 -3508 3987 11302 16593 13995 5459 -1480 -2075 3124 10481 11236 13112 10761 6948 6624 13694
14377 13694 11336 5790 7686 5404 190 7245 11601 4280 1660 5843 8728 1203 -3548 -2601 3343
14362 3343 626 2591 8150 4256 1505 -717 -2539 -4538 558 7824 11579 10966 12193 8807 -1670
14347 -1670 -2214 -2589 -8158 -17480 -22285 -18519 -12069 -9502 -8028 -12309 -17851 -22581 -16550 -10646 -6814
14332 -6814 -2482 -1246 2177 1552 -1608 -3685 -3957 -3974 -4826 -12416 -10284 -904 426 -959 -1864 3866
14316C866j316J245O138k709p425j0766O04L576k322P697q65j308O381l215l553
14301c972m261L605K499j187p234J146L659l616J689m227l924N843J785j608m45
14286a0248J481L56K292k215m629Q772N581J728k26m052K009K80l548k7M988N720
14270H262j558j0001j963K341k103l032j25m26m622LP597K374n888N131M734k534
14254a810l596R72K929M738J376L823m39m132l549q532m299L846N028L354r28
14239a219N965j308m357o022K359P78m014N24K174L98o579J111J465R376K198
14224B849l581M553J105J604n387o96K767o19K809m566l928m878j14L265L562
14209a255L880j930j984j46M115n908j907J836N903M429O138n370m784k694l418
$$ plain form
14316 3866 2550 3795 9933 7224 -201 -10967 -10363 -6787 -9109 -1412 -2277 -3585 2796 -419 -3972
14301 -3972 -8233 -4628 -2129 -3316 -10550 -9404 -5745 -9361 -7672 -11899 -15823 -9980 -8195 -9803 -10248
14286 -10248 -8767 -8411 -6119 -8334 -12963 -4191 1390 3118 2892 -1160 849 1129 -2419 -2446 2542 8262
14270 8262 6704 -3297 -5260 -2919 -5022 -8054 -8179 -8605 -13227 -13224 -5627 -3253 -9141 -4010 724 -1810
14254 -1810 -5406 -4434 -1505 3233 4609 8432 7993 3861 312 -8220 -12519 -8673 -3645 -291 -1219
14239 -1219 4746 3438 -919 -6941 -4582 -3804 -7818 -7294 -5120 -4722 -11301 -10190 -8725 651 2849
14224 2849 -732 3821 4926 6530 1143 447 3214 2595 5404 838 -3090 -7968 -8082 -4817 -1255
14209 -1255 2625 695 -1289 -1435 2680 -3228 -5135 -3299 2604 7033 13171 7801 3017 323 -3095
14194c095j834K018N361K054M23L588O519K032k788l123M326n003k157p885j008
14179e72k814K103O850N109n820r718m922M346L435L44j253K414K043k725l09
14164a489Q395l111k404m042j765O39J820o242M45L316j013L8k702L893N527O097
14148G402k80l665J42l95m160n020j720O769P016M021m670o686l335j113n565
14133a1259J246m029J040M041J2702k678K843K418o005l020L320O06r69j087K984
14118B153j699L117K449n258l036L705m097l2O70O982N37o49q09l045M60N81P67
14101B796M469M43m426K936K935j252k110Q70N274k609p161l037n029j306L6J492
14085e679M438o444N72Q553O380L864k600o267l567o728M29m795J333L535N973
$$ plain form
14194 -3095 -4929 -2911 2450 4504 4927 8515 15034 17066 14278 11155 15481 10478 8321 436 -572
14179 -572 -3386 -1283 5567 10676 4856 -4862 -9784 -5438 -2003 -1659 -2912 -498 1545 -1180 -1489
14164 -1489 6906 3795 1391 -2651 -4416 -3777 -1957 -8199 -7754 -4438 -5451 -5413 -8115 -4222 1305 7402
14148 7402 7122 3457 3599 3204 -956 -5976 -7696 -927 6089 10110 5440 -1246 -4581 -5694 -11259
14133 -11259 -10013 -14042 -13002 -8961 3741 1063 3906 6324 319 -2701 619 1225 256 -831 2153
14118 2153 454 3571 6020 762 -2274 1431 -2666 -2698 -2028 4954 5491 4842 4033 988 1448 2029 2796
14101 2796 7265 7708 3282 6218 9153 7901 5791 6661 11935 9326 2165 -872 -5901 -7207 -7171 -5679
14085 -5679 -1241 -7685 -7113 1440 7820 11684 9084 2817 -750 -7478 -7049 -11844 -10511 -6976 -1003
14070a003L796P720k728J696l287M090p90J394k094K284n793j030L280j152l660
14055B723l949J805j144M070K474o330l261K296o91R35J657m96m242K576K297
14040G20R512R14j1312j0855M371r25k763L709l490N40M041l121O689N122M862
14025H014M328J006l346N55j601O0m848Q13J097L077k128p833Q838J238q069j508
14009c07Q475J0398J099n116o441K613M250o006j182O494L557K759k50J338k004
13994A9677r43m110J884Q27J137K616p4O134P835k368J784R43Q145J965K520q024
13978C9948l047K441L252L51k208L338P242J367K81M174j484J537j1643k320J0710
13963E3939M868l0J790k12O979N854J815L713L295j763N335M308k665j0630r112
$$ plain form
14070 -1003 2793 10513 7785 9481 6194 10284 9494 10888 8794 11078 5285 4255 7535 6383 2723
14055 2723 -1226 579 -565 3505 5979 -351 -3612 -1316 -2007 -1072 585 89 -4153 -1577 720
14040 720 10232 11146 -166 -11021 -6650 -7575 -10338 -6629 -10119 -9579 -5538 -8659 -1970 3152 8014
14025 8014 12342 13348 10002 10557 8956 9016 4168 4981 6078 9155 7027 -806 8032 9270 1201 -307
14009 -307 8168 18566 19665 14549 8108 10721 14971 8965 7783 14277 17834 20593 20343 21681 19677
13994 19677 18734 14624 16508 17335 18472 21088 21014 27148 34983 32615 34399 35342 43487 45452 47972 39948
13978 39948 36901 39342 42594 42945 40737 44075 51317 52684 52965 57139 55655 57192 45549 43229 53939
13963 53939 58807 58777 60567 60355 67334 73188 75003 78716 82011 80248 85583 89891 87226 76596 67484
13948F7484K249M066j235k220J1144P769k171l683l774r13L149l022N394M19o755
13933G7901L194l21K562Q827J284j217L260m486j24j167n013M669K786o515M83
13918H6123m280k415M231l255K820O139l302q75j262k500m990j320J403l052J270
13903G4735j109L811R2j414K081J228l227j4257P03M127P77j43n734k361Q531
13888F7840k764M436j950n643l142n192O079R83N63m05k205n377j905L545p08
13873E4155P775O568J691m013r617j0811J128q86L689j530l727l436l537q52J224
13858C7821M3M176N831r49o568m042N202L02m805k587m603m285O780M46j809m971
13842B5982j636k729J000j484j335J73J891j95m938j0468K569J574O15P224j23
$$ plain form
13948 67484 69733 73799 72564 70344 81488 89257 87086 83403 79629 78716 81865 78843 84237 84656 77901
13933 77901 81095 80774 83336 92163 93447 92230 95490 91004 90880 89713 84700 89369 92155 85640 86123
13918 86123 81843 79428 83659 80404 83224 89363 86061 85186 83924 81424 76434 75114 76517 73465 74735
13903 74735 73626 77437 77529 76115 78196 79424 76197 61940 62643 66770 67547 67404 61670 59309 67840
13888 67840 65076 69512 67562 61919 58777 53585 59664 60647 61210 60805 58600 53223 51318 54863 54155
13873 54155 61930 68498 70189 66176 56559 45748 46876 45990 49679 48149 44422 40986 37449 36597 37821
13858 37821 37864 42040 47871 46922 40354 36312 41514 41816 37011 34424 29821 25536 32316 32762 30953 25982
13842 25982 24346 21617 22617 21133 19798 19971 21862 21667 16729 6261 8830 10404 11019 18243 18120
13827A8120m687n91O474M730j683J556k84j740J695L897m765r02K662k11L530
13812B7801J703q489o858O840R968l78j0542o833N246N317L963K518m995o877
13798A8384J527K327Q52o50P152L727j267l960K590L092J117j275L484L467K222
13783D2789j790j757K734Q586K927l093k1J729L476n585o855OJ228O488R217J225
13767F1304K155k271k715L682O934k079L654j012l147P01k62K430K623J385j261
13752G2121J195O902M041J156j145j764J695J557r825j638j646Q60J951M299N762
13737H5521N003q50n112p496l809L467Q275N162k979j891l380m31j012k974o129
13722G1365M16j483p800M116j612L649J171m198q53j221l603k39O266r112k063
$$ plain form
13827 18120 13433 12842 19316 24046 22363 23919 23635 21895 23590 27487 22722 21820 24482 24271 27801
13812 27801 29504 21015 14157 20997 30965 30587 20045 13212 18458 23775 27738 30256 25261 18384
13798 18384 19911 22238 23090 22440 29592 33319 32052 28092 30682 33774 34891 33616 37100 40567 42789
13783 42789 40999 39242 41976 50562 53489 50396 50375 52104 55580 49995 43140 43146 44374 50862 60079 61304
13767 61304 63459 61188 58473 62155 69089 67010 70664 69652 66505 67206 66944 69374 71997 73382 72121
13752 72121 73316 80218 84259 85415 84270 82506 84201 85758 75933 74295 72649 73509 75460 79759 85521
13737 85521 90524 89674 84562 77066 73257 76724 84999 90161 87182 85291 81911 81480 80468 77494 71365
13722 71365 71781 70298 62498 66614 65002 68651 69822 65624 64771 63550 59947 59708 65974 56862 54799
13707E4799L567j074n510K653J880L23r895n371K256o020m656j542o31j403k401
13692B6975K658O247m043n986j066R10M844O332p338o656N198J93p280j551M704
13677B4141M255L413L38j652m709L82o671k421L624N25l579j798Q335M399j282
13662B7300j535l107P093P728r74j853j253J97k11P795M557l696o505j1439R89
13647B5086L860N166L474J565j776M550N588M84J53O467O584K288j91J695J409
13632F6402p898m988K817L554K303K736l026o476l229J812l683J151L606N295
13618F0376L99L570L509L288k838k357m617O187K066j658J270K64R70K947n429
13603F7947m023J253J310J760k564k335M578M332J609j24m485k678l738p666K749
$$ plain form
13707 54799 58366 57292 51782 54435 56315 56638 46743 41372 43628 37608 32952 31410 30779 29376 26975
13692 26975 29633 35880 31837 25851 24785 25695 30539 36871 29533 22877 28075 28268 20988 19437 24141
13677 24141 28396 31809 32147 30495 25786 26168 19497 17076 20700 21225 17646 15848 24183 28582 27300
13662 27300 25765 22658 29751 37479 36505 34652 33399 33596 33385 41180 45737 42041 35536 24097 25086
13647 25086 28946 34112 37586 39151 37375 41925 47513 47997 48150 54617 61201 63489 63298 64993 66402
13632 66402 58504 53516 56333 59887 62190 64926 61900 55424 52195 54007 50324 51475 55081 60376
13618 60376 60775 64345 67854 71142 68304 65947 61330 67517 69583 67925 69195 69459 70429 73376 67947
13603 67947 63924 65177 66487 68247 65683 63348 67926 72258 73867 73743 69258 66580 62842 55176 57925
13588E7925N921n369j1259k45N08j108j427P441m125L696M76j461j936n56j148
13573D7333m87L622k801L971R5J655M959P290J0178l06J257R875K1280K9792K0327
13558A58040R067j91j6859k5442k4850j3921n868k073J208M01l69j812L533J5674
13544I6538M828K626L137k628k938o195o009j2459o705K902R911K99M113K953
13530I0373K461J0429J0039J3610L1840M0135L6562L2933J5412r269k8371m0817
13518B05337l5683k5993j5362j2636p421m214O86n30P04K463k273k358j215j145
13504A00360j265K334k338j1864o014n228l336o615P212L632j472J0423Q788L970
13490I8587J5432K2018K1215J0805K66j1141j9800k3911j4791m300j3181q540
$$ plain form
13588 57925 63846 58477 47218 46973 47481 46373 44946 52387 48262 51958 52434 50973 49037 48481 47333
13573 47333 46846 50468 47667 51638 51733 53388 58347 65637 75815 75509 76766 86641 107921 137713 158040
13558 158040 167107 166916 150057 124615 99765 85844 79976 77903 79111 79512 79143 77331 80864 96538
13544 96538 101366 103992 107129 104501 101563 95368 89359 76900 70195 73097 83008 83307 87420 90373
13530 90373 92834 103263 113302 126912 158752 198887 235449 268382 283794 274525 246154 205337
13518 205337 169654 143661 128299 115663 108242 104028 104714 104184 104888 107351 105078 102720 101505 100360
13504 100360 99095 101429 99091 87227 81213 75985 72649 66034 73246 76878 75406 85829 94617 98587
13490 98587 114019 136037 157252 168057 168323 157182 137382 113471 98680 94380 81199 72659
13478G2659r344j689o170p030k669K122n524K644R280N408p893o544M827l819
13464D6258K987l881k656L73L775r50k423K111p9n475k421J303l092j161N287
13449C9956j6o724J568O557M938p299o233l314k837J912N957J586N94j394j599
13434C3652k449J627J781k212l493j394J53l61N186N273j91J088N99L67L695K189
13418D5510j592M692M235k996k702k518l610m217R82l58j601m11M167J519p552
13403C3548L0M758m717l795M539j360j919k157k420k962l232N165m765N665J0126
13388C6504P433O901P196J282r140l012l131J506l547L099N477k736K772n66m888
13373D5150K333O116k950N915N743l968j546P768L892M46J327Q445J3642J909
$$ plain form
13478 72659 63315 61626 55456 48426 45757 47879 42355 44999 54279 59687 51794 45250 50077 46258
13464 46258 49245 45364 42708 43081 46856 45906 43483 45594 45515 40040 37619 38922 35830 34669 39956
13449 39956 39940 33216 34784 41341 46279 38980 32747 29433 26596 28508 34465 36051 36645 35251 33652
13434 33652 31203 32830 34611 32399 28906 27512 27665 27304 32490 37763 37572 38660 39259 39626 43321 45510
13418 45510 43918 48610 52845 49849 47147 44629 41019 36802 37784 37426 35825 35414 39581 41100 33548
13403 33548 33578 38336 33619 29824 34363 33003 31084 28927 26507 23545 20313 25478 20713 26378 36504
13388 36504 43937 50838 58034 59316 50176 47164 44033 45539 41992 45091 50568 47832 50604 50038 45150
13373 45150 47483 53599 50649 56564 62307 58339 56793 64561 68453 68899 70226 78671 92313 94222
13359I4222l036R990P084K933m747l694L972N080J57p483r445j3197r972l422
13345F8442M882j979k482m073m149j813K323O933P7J343M921K910o789p359J890
13330F5077p82L476R291J233N51m170r295k787p12n28k258k445k239j431J055
13315E4036J392m44p09k097o34K51j05l040o150q509k600N465J3302J4522M519
13300F9199l642j265L19p16L790L023r0n947k148O61n446l030q83q425j094K306
13284D6612k414J068N28r10l43N804J0336l002k882J67l317K834N398k70L728
13269F3337M998L907K685m385m671O05O749M855j209o628o036j0617j1158M93
13255D2925o560o848N054j256K688N867J457J059N848P525P143K25M47K919O536
$$ plain form
13359 94222 91186 101176 108260 111193 106446 102752 106724 111804 111961 104478 95033 81836 71864 68442
13345 68442 73324 71345 68863 64790 60641 58828 61151 68084 68161 69504 74425 77335 70546 63187 65077
13330 65077 64295 67771 77062 78295 78846 74676 65381 62594 61882 61354 59096 56651 54412 52981 54036
13315 54036 55428 54984 54275 52178 51544 51795 51690 48650 42500 33991 31391 36856 50158 64680 69199
13300 69199 65557 64292 64611 63895 67685 70708 70618 64671 62523 63184 57738 54708 53825 45400 44306 46612
13284 46612 44198 45266 45794 44884 44541 50345 60681 57679 54797 54964 51647 54481 59879 59609 63337
13269 63337 68335 72242 74927 70542 65871 66476 73225 78080 76871 70243 64207 53590 42432 42925
13255 42925 36365 29517 34571 33315 36003 41870 43327 44386 50234 57759 64902 65127 65574 68493 75029
13240G5029J0377J2452J1453J4401J6242K4235J1506J132p2o934p372q415o785
13227A47249k494p572l603p409n75M200O519M131R768Q147k68j2166j3239j3087
13213A19601j533N289J406n882M804Q384J5744J2863K0107J9964J9904K9881L0906
13200B81438L1634K7185J7262M545m038j2691k3647j9650j0401j0483m446L180
13188B79888M127l023p674p186j360L143K117n43K647J048L555n643j265k769
13174B67062l900K421P982R991J382J915N781J0444J7335J7239J9608R998J6201
13161C83459L595K477p57n873q449k889P035M812K802P35Q3J472K471Q502J5376
13146D14851J5379J7844K9496K9961K1160Q817K885m431R66J2321L913O483K3116
$$ plain form
13240 75029 85406 97858 109311 123712 139954 164189 175695 176827 176755 169821 162449 154034 147249
13227 147249 144755 137183 133580 126171 125596 129796 136315 140446 150214 158361 158093 145927 132688 119601
13213 119601 118068 123357 124763 118881 123685 132069 147813 160676 180783 200747 220651 250532 281438
13200 281438 313072 340257 357519 362064 358026 345335 321688 302038 291637 281154 276708 279888
13188 279888 284015 280992 273318 266132 264772 267915 270032 269489 272136 273184 276739 271096 269831 267062
13174 267062 263162 265583 273565 283556 284938 286853 292634 303078 320413 337652 357260 367258 383459
13161 383459 387054 389531 388774 382901 374452 371563 378598 383410 386212 386947 387030 388502 390973 399475 414851
13146 414851 430230 448074 477570 507531 528691 537508 540393 535962 536928 549249 553162 559645 582761
13133E82761J5878K5988K8455L1442L6880L7656M3536N5519O3529P7137R9791
13122A098572J23233J45163J76945K18895K60177L22275M16192N43461P25817
13113D030730J033683J556572K420073L565144M583425M665577L301954P31211
13105B5888369k216285m162052m332339l368547k291004j534790j048554p35732
13097F199066n21616l43154j93694j25586j22282j45937j76973j77261j20065
13088D272498m0265L1159J11885J87231K66034L64249M80740O32752Q36790J137697
13078H280770J610615K422351L755394N735378P962750R211892Q241452M649432
13070E1870034p59677n829234q431192q258612o475413m459971k980721k077250
$$ plain form
13133 582761 598639 624627 653082 684524 721404 759060 802596 858115 921644 998781 1098572
13122 1098572 1221805 1366968 1543913 1762808 2022985 2345260 2761452 3304913 4030730
13113 4030730 5064413 6620985 9041058 12606202 17189627 21855204 25157158 25888369
13105 25888369 23672084 19510032 15177693 11809146 9518142 7983352 6934798 6199066
13097 6199066 5677450 5334296 5140602 5015016 4892734 4746797 4569824 4392563 4272498
13088 4272498 4232233 4263392 4375277 4562508 4828542 5192791 5673531 6306283 7143073 8280770
13078 8280770 9891385 12313736 16069130 21804508 29767258 38979150 47220602 51870034
13070 51870034 51110357 45281123 36849931 28591319 22115906 17655935 14675214 12597964
13062A2597964j515813j143583q97768p15103n80414m77318l80134k83841k11732
13053F392258j38223n7073J7675P8889J03872P0715M0843O1643J39181K90300
13043G000080N13057Q25134J310655K097374L232775M427729M911696L972033
13035B8290533J562397j589175m179384m978170m166191k923901j974131j372683
13027H669295j002924p80760o20505n01602m24603l54496l00544k55281k16537
13018D212043j84717j70087j55647j32797j26913j33606j21346j09071r9672r6908
13008B881279r2881q8085q2553o9553o6643o6575o9035o4022o6036o8156o1786
12997B085954n8077m8969m6140m8500n9351n3816m7146m5097m1708l4975l2057
$$ plain form
13062 12597964 11082151 9938568 9040800 8325697 7745283 7267965 6887831 6603990 6392258
13053 6392258 6254035 6196962 6214637 6293526 6397398 6468113 6508956 6570599 6709780 7000080
13043 7000080 7513137 8338271 9648926 11746300 14979075 19406804 24318500 28290533
13035 28290533 29852930 28263755 24084371 19106201 14940010 12016109 10041978 8669295
13027 8669295 7666371 6885611 6265106 5763504 5338901 4984405 4683861 4428580 4212043
13018 4212043 4027326 3857239 3701592 3568795 3441882 3308276 3186930 3077859 2978187 2881279
13008 2881279 2788398 2700313 2617760 2548207 2481564 2414989 2345954 2281932 2215896 2147740 2085954
12997 2085954 2027877 1978908 1932768 1884268 1824917 1771101 1723955 1678858 1637150 1602175 1570118
12986A570118k2024j9320k4521j5625j9006j4902j3034k0988k2012k1078l2364
12975A345244l7552l2656k8792l5742l3393k4653k2998l2912l4107l2096k7208
12964A003135j9771j8923k2558j9206j6363j9520j8586j7505j1702j3125j310
12953H24566M300l1j421Q416K854Q58J1600K0289K3061J8526J0076n623j6558
12940I00913k1824k4835j9535l1631l1166k5600j8474j1094k0052k5097k1698
12929F49907j9711j4729r479r38j0325j8594r882j1177j2820m009j2201n522j400
12916E19120o57o400L105Q218j113o744J2976J9646J8118j231j1249j4851j3042
12903E25896j0735j6812j1528j1556j1446p681j1587j7043j4965j1340k827o485
$$ plain form
12986 1570118 1548094 1528774 1504253 1488628 1469622 1454720 1441686 1420698 1398686 1377608 1345244
12975 1345244 1307692 1275036 1246244 1210502 1177109 1152456 1129458 1096546 1062439 1030343 1003135
12964 1003135 983364 964441 941883 922677 906314 886794 868208 850703 839001 825876 824566
12953 824566 828866 828835 827414 835830 838684 839542 851142 871431 894492 913018 923094 917471 900913
12940 900913 879089 854254 834719 803088 771922 746322 727848 716754 696702 671605 649907
12929 649907 630196 615467 605988 605050 594725 576131 566249 555072 542252 538243 526042 520520 519120
12916 519120 518463 512063 515168 523386 522273 515529 528505 548151 566269 565038 553789 538938 525896
12903 525896 515161 498349 486821 475265 463819 456138 444551 427508 412543 401203 398376 391891
12891C91891o076j0516o712K235q413k1599j0179r359j2767j0601r655l055p828
12878B77366n562o326p989p195p404m016O266l230l097j418j48K290p009k707
12864B29821n189j544r7q399j0832L601N560n7o095l722l744j3963o763j498m02
12849A76677m81k033l584L69j3002j3972n438l607L444K657m444l299J778n073
12835A29992L000K708k642k531J339K993m920m435k309J445L046m654l519K412
12821A21925M76q295l268q123l050M553K953k76l809m188m069J524L763k062o243
12806I1811K090p50n219R178K960o154j1232n462R705o30q528l911k389J982N410
12791G8861M630K91n488n14M217J957O39m795j724j371j277j225k390k522O600
$$ plain form
12891 391891 385815 375299 368587 370822 362409 340810 330631 321272 308505 297904 288249 285194 277366
12878 277366 271804 265478 257489 250294 242890 238874 245140 241910 238813 237395 237247 239537 232528 229821
12864 229821 224632 223088 222991 214592 203760 207361 212921 212864 206769 203047 199303 185340 178577 177079 176677
12849 176677 176196 174163 170579 170948 157946 143974 138536 134929 138373 141030 136586 133287 135065 129992
12835 129992 132992 135700 133058 130527 131866 134859 129939 125504 123195 124640 127686 123032 119513 121925
12821 121925 122401 114106 110838 102715 99665 104218 107171 106895 103086 98898 94829 96353 100116 98054 91811
12806 91811 93901 93151 87932 97110 100070 93916 82684 77222 86927 86297 77769 73858 71469 73451 78861
12791 78861 83491 83782 78294 77780 81997 83954 84593 79798 78074 76703 75426 74201 71811 69289 75889
12776G5889k769k360K949k374l070J429n89o175M762R63q425J773M598n985m901
12761E5715n744o445m134n234L775M893Q91J415O981R642J541k929j576r843l244
12746D5704K907n928j753P073N723K604m351M522l319q392p453m732j083N371
12732C6893N431J580M188k216O427P567l13m050q506m476m341j02m604l691Q992
12717C8779o243K8L814N597N219l930l694l637L217P87p799J975L808J992l500
12702C6413j887J965L51O149K978L938P480J958R56O150M765P944p16n623r197
12687F3624j1554r967k5R150K194K59J67K87r748j147Q950P411p950o051K683
12672D8283j023q222p63n86L455j373L457j397M225L530n60J23N111M501j118
$$ plain form
12776 75889 73120 70760 73709 71335 68265 69694 69105 62930 67692 68655 60230 62003 66601 60616 55715
12761 55715 49971 43526 39392 34158 37933 42826 43717 45132 52113 61755 63296 60367 58791 48948 45704
12746 45704 48611 42683 40930 48003 53726 56330 51979 56501 53182 44790 37337 32605 31522 36893
12732 36893 42324 43904 48092 45876 52303 59870 59557 55507 47001 42525 38184 38082 33478 29787 38779
12717 38779 32536 32564 36378 41975 47194 43264 39570 35933 39150 39937 32138 34113 37921 39913 36413
12702 36413 34526 36491 36842 42991 45969 49907 57387 59345 60301 66451 71216 79160 78444 72821 63624
12687 63624 52070 42103 42078 51228 53422 53681 53848 54135 44387 43240 52190 59601 51651 45600 48283
12672 48283 47260 39038 38275 37689 41144 39771 43228 41831 46056 49586 49026 49149 54260 58761 57643
12657E7643m10N107k94n279n853J2087K7244K2057K1030J7334n11j0443j5633
12644A24079k1956j7887j1497k585m63k750r247q480o019M70l237l617L302J0301
12630E0414P338N326n314K353l497m202K099R35j049j523O861P410M560K0821
12616I2532L1995L3271L8649L9761L4290Q141j3974l6724l9512k4952k7596k3526
12604A12355j6705r973m306k422m157o794n323o89M946j550q298K828k352n467
12590E2093M432Q759n060k601P201N951l894K737M638Q761J2381J0343J1303J5103
12576A32147J4885O192j0575j9873k2037j8004j2044j1054m682p532l541J0290
12564E4172K239l497j560O03j980p856p529l678J633N912J861n757l76k398k412
$$ plain form
12657 57643 57233 62340 62046 56767 50914 63001 90245 112302 133332 150666 150155 139712 124079
12644 124079 102123 84236 72739 70154 69691 66941 57694 49214 43195 43665 40428 36811 40113 50414
12630 50414 57752 63078 57764 60117 56620 52418 54517 55452 54403 52880 59741 67151 71711 92532
12616 92532 124527 157798 196447 236208 270498 278639 264665 227941 188429 163477 135881 112355
12604 112355 95650 85677 81371 78949 74792 67998 62675 61986 66932 65382 57084 59912 57560 52093
12590 52093 56525 65284 60224 57623 64824 70775 66881 69618 74256 83017 95398 105741 117044 132147
12576 132147 147032 153224 142649 122776 100739 82735 70691 59637 54955 47423 43882 54172
12564 54172 56411 52914 51354 51957 49977 42121 34592 30914 32547 38459 40320 34563 34187 31789 29377
12549B9377K700q32m625Q195K864p41k028K463Q206m222p909Q00N66N64L202L888
12533D2468n702m109K291l388n558M043O082j055J435l378m951J650k55m36J122
12518C0259O334q70K415l376J701K532P351k973l285O652O00r086m008j561p17
12503C1968P226J803R17m479j101N42J454p304k141N224K397p73l650l170J494
12488C0407J666p184M443M810R72N421P045L543P351j667r49J939J092n030j2870
12473D0989N83Q629Q34j856N226M531J53J338K130m780k829N67L019M15l437N570
12457F1082r97k251j019P033K549m366n704K087P377J345K639N570o199n957L292
12442F6481L401j040J641M92j103j005o22J069j681o11j242J54Q154K874q28N251
$$ plain form
12549 29377 32077 31245 26620 34815 37679 36938 34910 37373 45579 41357 33448 34248 34814 35378 38580 42468
12533 42468 36766 32657 34948 31560 26002 30045 36127 35072 36507 33129 28178 29828 29573 29137 30259
12518 30259 36593 35723 38138 34762 36463 38995 46346 43373 40088 46740 47340 38254 34246 32685 31968
12503 31968 39194 40997 41914 37435 36334 36876 38330 31026 28885 34109 36506 35733 32083 28913 30407
12488 30407 32073 24889 29332 34142 35114 40535 47580 51123 58474 56807 55858 57797 58889 53859 40989
12473 40989 41572 50201 51035 49179 54405 58936 59089 60427 62557 57777 54948 55515 58534 58949 55512 61082
12457 61082 60085 57834 56815 63848 66397 62031 56327 58414 65791 67136 69775 75345 69146 63189 66481
12442 66481 69882 68842 70483 70975 69872 68867 68245 69314 67633 67022 65780 65934 74088 76962 76134 81385
12426H1385m67o942M480o84N017R070M899l027l46p312p209k937P091l97l66j252
12410H1003k463q98K248P920Q214L436M510l46M02O927L621k3Q733J192J0710
12395A35186P300R958P125L940L226L860O107J5804J6817J9673K1573K1916J6362
12382B88847K0498L3994K7776K2010L3174L5910K5172L4332L2968K1210J8971
12371E94862P163q037k2953k3001k5023k9815k5188k1635k0406j2646j8228k0611
12359C74482k1620j4788j3300r343O20j119K037M954k846O635J0674j6508l1529
12346B88349l1366k7503j5426j4499q440n790o138o349r702j0009p138j057m942
12333A39990k607m775j266k300m382r84j386o99K783j066K274k553n334l29J262
$$ plain form
12426 81385 80918 73976 78456 77772 82789 91859 96758 93731 93385 86073 78864 75927 83018 82621 82255 81003
12410 81003 78540 77642 79890 87810 96024 99460 103970 103624 104026 110953 114574 114551 123284 124476 135186
12395 135186 142486 152444 159569 163509 166735 170595 176702 192506 209323 228996 250569 272485 288847
12382 288847 309345 343339 371115 393125 426299 462209 487381 521713 554681 575891 594862
12371 594862 602025 593988 571035 548034 523011 493196 468008 446373 425967 413321 395093 374482
12359 374482 352862 338074 324774 315431 316051 314932 316969 321923 319077 325712 336386 319878 288349
12346 288349 256983 229480 214054 199555 191115 185325 179187 172838 163136 153127 145989 144932 139990
12333 139990 137383 132608 131342 129042 124660 123676 122290 121591 124374 123308 125582 123029 117695 117366 118628
12318A18628r29l640j61N88L324k615k973j731K557L458J316j739j1032k291P655
12303A10415J398L002L299P770L579K744J1672R322K136M456J3905M395l093m982
12289A70018k543p393k847q402m970j55p848l12k238o399n382o272k535n76K050
12274A14196m680k129K319N294l342N201N585l92k343p200m21M880k069m842M273
12259A14330N907k682O107J475r329k298P865M346p232N187n571k807J1168Q181
12245A34647Q367Q45O817N840J1556J3407J5927J3422R678J1173J2912M933O739
12232B56263K802n748P405K3057K2403J6859K0361L4547L1406L2677L6159N3510
12220E31701N8319O1634O0379M6069K7336J0854M287o026j9163k5606l1040m0546
$$ plain form
12318 118628 117699 114059 113898 114486 117810 115195 112222 110491 113048 116506 117822 116083 105051 102760 110415
12303 110415 111813 114815 118114 125884 129463 132207 143879 153201 155337 159793 173698 178093 175000 170018
12289 170018 167475 160082 157235 148833 143863 143708 135860 135548 133310 126911 121529 115257 112722 112146 114196
12274 114196 109516 107387 109706 115000 111658 116859 122444 122052 119709 112509 112088 116968 114899 110057 114330
12259 114330 120237 117555 123662 125137 115808 113510 121375 125721 118489 123676 118105 115298 126466 134647
12245 134647 143014 143859 150676 156516 168072 181479 197406 210828 220506 231679 244591 249524 256263
12232 256263 259065 253317 260722 283779 306182 323041 343402 377949 409355 442032 478191 531701
12220 531701 590020 651654 712033 758102 785438 796292 800579 794553 775390 749784 718744 678198
12208F78198n0011n2422m9340m1079l3113l6441k9191j8905k3658k1743k0685
12197C01610j5616r062j0877j1706n278p556j4578k037N08p646p635p583q455
12184A94089n971N67N355l640k007L156j0129j0717K27k688n483o105j0205o557
12170A39892m471l109j229o815m584q7j104n722p63p36l978K471O491J573l443
12155A14386ON171O534L718Q395Q38k768j3526q644O709O109l114K074j189o746
12140A17953n614j431P18m608j917L141K235J963J903P21k310K401R615Q375l359
12125A29786k33R045J3387J4720J2540J3810J7681J1880k77j0166j4891j1163
12113A86119m095r591o444K800L863p02n57l336m938n311j852O179P301m356k021
$$ plain form
12208 678198 628187 575765 526425 485346 452233 415792 386601 367696 344038 322295 301610
12197 301610 285994 276932 266055 254349 249071 241515 226937 224900 225408 217762 210127 202544 194089
12184 194089 188118 188685 194040 190400 188393 191549 181420 170703 170930 168242 162759 156654 146449 139892
12170 139892 135421 132312 131083 124268 119684 119597 118493 112771 112008 111272 107294 109765 116256 117829 114386
12155 114386 114392 119563 126097 129815 138210 139048 136280 122754 114110 120819 126928 123814 125888 124699 117953
12140 117953 112339 110908 111626 107018 105101 108242 110477 112440 114343 115064 112754 115155 124770 133145 129786
12125 129786 129553 138598 151985 166705 179245 193055 210736 222616 222339 212173 197282 186119
12113 186119 182024 172433 165989 168789 172652 171950 171393 168057 163119 157808 155956 162135 169436 165080 163059
12098A63059j3601l393l315j028n834l530j924K461K523j122K086l962k946R41
12084A30415m196p664q147p474K147J705N81j312l474L131K11p16j00m16j1091
12069I3600j195J000M790m938L712J2393r80J9n691o746l26l989j3625M3K637
12054H0704P046K762J661M973m746K029K09K434K551N319k86m004K826m692k742
12039I6044l537L687o2j885j247k572k843K734L977q257l119j65k23K135p14N286
12023H9239N412O386O58n342n850k477j528L341M298k445l303L755k568K570M27
12008I2573p790k079O9L21O14J664j035L506K138j83l349j145Q50M625m45o040
11992H4294N28m950K678K734N020N857j163J314O47m342j265n280J409N896K480
$$ plain form
12098 163059 149458 146065 142750 141722 135888 132358 130434 132895 135418 134296 136382 132420 129474 130415
12084 130415 126219 118555 110408 102934 105081 106786 107367 106055 102581 105712 105923 105207 105107 104691 93600
12069 93600 92405 93405 98195 93257 96969 109362 108382 108401 102710 95964 95638 91649 78024 78067 80704
12054 80704 87750 90512 92173 97146 92400 94429 94638 97072 99623 104942 104656 100652 103478 98786 96044
12039 96044 92507 96194 96132 94247 93000 90428 87585 90319 94296 86039 82920 82755 82532 84667 83953 89239
12023 89239 94651 101037 101695 96353 90503 88026 86498 89839 94137 91692 88389 92144 89576 92146 92573
12008 92573 84783 82704 82773 83094 83708 85372 84337 87843 89981 89798 86449 85304 86154 90779 90334 84294
11992 84294 84822 79872 82550 85284 90304 96161 94998 96312 96959 92617 91352 86072 87481 93377 95857
11977I5857l670r15J452l986l042J962J746O30L153N779l238q096m086K335J729
11962H7610M293k397L558q23N963n90n793q078n232K439m773K470P585O320o92
11947I1860J538l91p354k252j41J484m12L84J351M08O333L225j843l187m593L825
11931I0235K252Q84n31J658l961J509R469k080j6403n730K835O234N566J852L638
11916I7427N718K676J350k013r045k074r19Q73L486O769l205l950N867q32O640
11901A08768L440o643M611j195q893k642j105M238o306j737P094L319o404k980
11887I3565N082J067k468l467L507n560o261J592L156J1284N469l080J827n092
11873A00621o784N127L645R534J0287J468l324l261P127K538l492M80n492M093
$$ plain form
11977 95857 92187 91272 92724 88738 85696 87658 89404 90034 93187 98966 95728 87632 83546 85881 87610
11962 87610 91903 89506 93064 92241 98204 97614 91821 83743 78511 80950 76177 78647 86232 92552 91860
11947 91860 93398 93007 85653 83401 83260 84744 84332 84716 86067 86475 92808 96033 94190 91003 86410 90235
11931 90235 92487 93371 92840 94498 90537 92046 101515 99435 83032 77302 80137 86371 91937 93789 97427
11916 97427 103145 105821 107171 105158 96113 94039 93120 93993 97479 104248 101043 97093 102960 102128 108768
11901 108768 112208 105565 110176 108981 100088 97446 96341 100579 94273 92536 99630 102949 96545 93565
11887 93565 98647 99714 97246 93779 97286 91726 85465 87057 90213 101497 106966 103886 105713 100621
11873 100621 93837 98964 102609 112143 122430 123898 120574 117313 124440 126978 123486 123966 118474 122567
11859A22567j069o270l573j363L80n359n50j648j613j066J497j816L871L944k853
11844A05079l431l687j042k499L747m092p49O020O788M320J513K521J90l579j876
11829A09223n265O928O297k643q79l779j082J0071R23O793O586J296q847n451
11815A20171p306o016J75P97m346o877l688J398K963l243M541M068L762J35N208
11800A11742J850o067o073l852K113M850L777p173Q56K917M182n285o712M520
11786A01645L2M736Q7j870j73J793N098R840Q997o546o514k519k448r116l396
11771I9646R629J0378j243m631m882L854j997l39j734M952J656M282l77m576o692
11756A07926l14K961m326m45M678N675J0235n134m733j794K605k47l215m843K651
$$ plain form
11859 122567 121498 115228 111655 110292 110672 105313 104763 103115 101502 100436 101933 100117 103988 107932 105079
11844 105079 101648 97961 96919 94420 98167 94075 93326 99346 106134 110454 111967 114488 114678 111099 109223
11829 109223 103958 110886 117183 114540 113661 109882 108800 118871 119794 126587 133173 134469 125622 120171
11815 120171 112865 106849 107024 107821 103475 96598 92910 94308 97271 94028 98569 102637 106399 106534 111742
11800 111742 113592 107525 101452 97600 99713 104563 108340 101167 102023 104940 109122 103837 97125 101645
11786 101645 101677 106413 106500 104630 104457 106250 111348 121188 130185 123639 117125 114606 112158 103042 99646
11771 99646 109275 119653 118410 113779 108897 112751 110754 110415 108681 113633 115289 119571 119194 114618 107926
11756 107926 107612 110573 106247 105802 110480 116155 126390 121256 116523 114729 117334 117087 113872 109029 111680
11741A11680j081K282k601M115m79o72N081l685j606l514p536J400N09p374M596
11726A01115N755M236K090J127L843M575J267l816p466K677M928n392r095M67
11712A06311P808l832N44M959L2o351O426n8m50r09j941J298K032j266k527j311
11696A10765j526P656O111M157l817j04J831L799o189J534M546j075o987p123
11682A13578n868M039L60Q16N478J703k319j268M424L599q9j384j440J741j765
11667A21605q225m449K200K161K387L31K161O397o803k999J0666R024j572n499
11653A27385j955k849k399M704n136J014J471L461J2012N935K712j0106l236Q498
11639A41511o976n123N844k061M16J023n245J48M314L038J16k574k83L811L935
$$ plain form
11741 111680 110599 112881 110280 114395 113916 113244 118325 114640 113034 109520 101984 103384 103893 96519 101115
11726 101115 106870 111106 113196 114323 118166 122741 124008 120192 112726 115403 120331 114939 105844 106311
11712 106311 114119 110287 110831 115790 115822 109471 115897 115839 115389 114480 112539 113837 115869 114603 112076 110765
11696 110765 109239 116895 123006 127163 123346 123242 125073 128872 122683 124217 128763 127688 120701 113578
11682 113578 107710 111749 112109 112925 118403 120106 117787 116519 120943 124542 124453 123069 121629 123370 121605
11667 121605 113380 108931 111131 113292 115679 116010 118171 124568 117765 114766 125432 134456 132884 127385
11653 127385 125430 122581 120182 124886 119750 120764 122235 125696 137708 143643 146355 136249 133013 141511
11639 141511 134535 129412 135256 133195 133611 134634 129389 129537 133851 136889 137005 134431 134148 137959 141894
11624A41894L101J263K046j418m722k872J688k526k04m916n272K101l99n506N216
11609A29474O524K261j280N844n063J423k46J227O550K72L935n649q124M841R369
11594A51358L650Q45R7N02N99n988k337Q366P029K795K853P4K316p87l692p484
11578A60196o719k514J042l879M738j1k076k882k681K46j201N050M300L493K117
11563A59219L85q36o109m533J582l301l31k84K141k332n603M815J2573O179P20
11548A64285n561q268j3k904l322p12M442P51r35r3K690m397o979k431Q17j995
11532A35375K816j155K012J1917K214k326n988n221M079K334j05M373J259m271
11518A47313L950N387J305M606o057l440q11k592L448L769L683k850m267l824
$$ plain form
11624 141894 144995 146258 148304 146886 142164 139292 140980 138454 138250 133334 128062 130163 129764 124258 129474
11609 129474 135998 138259 136979 142823 137760 139183 138937 140164 146714 146986 150921 145272 137148 141989 151358
11594 151358 155008 155853 155950 156452 157051 151063 148726 157092 164121 166916 169769 169843 172159 171372 167680 160196
11578 160196 153477 150963 152005 148126 152864 152853 150777 147895 145214 145460 144259 149309 153609 157102 159219
11563 159219 159604 158768 152659 148126 149708 146407 146076 145792 147933 145601 139998 144813 157386 163565 164285
11548 164285 158724 150456 150443 147539 144217 143505 147947 148698 147763 147670 150360 145963 138984 136553 137370 135375
11532 135375 138191 137036 139048 150965 153179 150853 144865 139644 143723 146057 145952 150325 151584 147313
11518 147313 151263 156650 157955 162561 156504 153064 152253 149661 153109 156878 160561 157711 153444 149620
11504A49620r19M380o86L435j053P609M185K361J333k318j577j201j636J124N295
11489A69952O990J2126J8367R013j957r450m870q633j0354j3819o326k370K750
11476A61419K011K780J204l222n856k591o825j0369L067R41M638J0205P758J132
11462A66292j666J889l465K560k289J320L672m349m918K258j179m869n474Q394
11448A58176P917N14o036J028O402m07j765k533M490j048p99p89k75n305J973
11433A61543j95o08L756L24m707L187l115N28l396J960l256l207M752L070k522
11418A58114j872L200O648M761k847m611n030k931K053j765J825n550L424O972
11404A62391k372O643J189l303j111o927p323L219j0K775N975Q344M330m40K222
$$ plain form
11504 149620 148701 153081 152395 155830 154777 162386 166571 168932 170265 167947 166370 165169 163533 164657 169952
11489 169952 176942 189068 207435 216448 214491 205041 200171 191538 181184 167365 161039 158669 161419
11476 161419 163430 166210 167414 164192 158336 155745 148920 138551 141618 142559 147197 157402 165160 166292
11462 166292 164626 166515 163050 165610 163321 164641 168313 163964 159046 161304 160125 155256 149782 158176
11448 158176 166093 166607 160571 161599 168001 167594 165829 163296 167786 166738 165939 165150 164875 159570 161543
11433 161543 161348 160740 164496 164820 160113 163300 160185 160713 157317 159277 156021 152814 157566 160636 158114
11418 158114 156242 159442 166090 170851 168004 163393 158363 155432 157485 155720 157545 151995 155419 162391
11404 162391 160019 166662 167851 164548 163437 156510 149187 152406 152396 155171 161146 169490 173820 173380 175602
11389A75602M499J173P902J1400J5076J6763J3937K2413K3568K7955L3602K7071
11377C80961J0898j3178k5415l2628k4627j2054j4009r763j4267r885o101n002
11365B24930j1677n569m379J574j066L001J829p20K201l622k349J1715R105J3979
11351B38952J3209K3991L2423L0151M5077M7525M5080L6390K6853J162k5596m7570
11339D67647n1487m2957m1845l1219j9234j1448q730p381n932m822l494L159n599
11326B36658j2601p989M478K035m556K558L909O682M372L904K623J1828K3118
11313B77019J9596J8284K3703J1375P46K375n571j2656j4129j1497k4401k4956
11301B59888j8533j3856l842p835n483M607j133L077R100J3274Q672M729L566
$$ plain form
11389 175602 180101 181274 189176 200576 215652 232415 246352 268765 292333 320288 353890 380961
11377 380961 391859 378681 353266 320638 296011 283957 269948 260185 245918 236033 229932 224930
11365 224930 213253 207684 203305 204879 203813 206814 208643 207923 210124 206502 204153 215868 224973 238952
11351 238952 252161 276152 308575 338726 383803 431328 476408 512798 539651 540813 515217 467647
11339 467647 416160 373203 331358 300139 280905 269457 260727 253346 247414 242592 239098 242257 236658
11326 236658 224057 216068 220546 222581 218025 220583 224492 231174 235546 239450 242073 253901 277019
11313 277019 296615 314899 338602 349977 350723 353098 347527 334871 320742 309245 284844 259888
11301 259888 241355 227499 223657 215822 210339 214946 213813 216890 225990 239264 247936 252665 256231
11288B56231k128j0408q697q974j5487p429k925Q500J440n430K486m288m283M206
11274B02814L714k026l975L544l248k675k360L719K1p40l743n059M607R429L235
11259B07257M698L731n254l526p648r237l238J805o530m191K031J873P08J658
11245A84137O633J325K809j535r31M78M014k338p164k193K317j094O948K633O468
11230B02507J897P087J841j66l756J2200N988P039K0815J0395J1103J1838p406
11217B81382J663k507q031M11o04p979k562m824r967o787L809M386m916l433o094
11202B33947o819r8Q91l574n394n199l43j480l197J4149M662N094P502J2312J0358
11187B62811M784J5400L1085M6035M7033L3604J2407o036k2054k6795k0561j3919
$$ plain form
11288 256231 254103 243695 234998 226024 210537 203108 200183 208683 210123 204693 207179 202891 198608 202814
11274 202814 206528 204502 200527 204071 200823 198148 195788 199507 199528 198788 195045 189986 194593 204022 207257
11259 207257 211955 215686 210432 206906 199258 190021 186783 188588 182058 177867 179898 181771 182479 184137
11245 184137 190770 192095 194904 193369 192438 192916 196930 194592 187428 185235 187552 186458 193406 196039 202507
11230 202507 204404 211491 213332 213166 209410 221610 227598 234637 255452 265847 276950 288788 281382
11217 281382 283045 280538 272507 272918 272314 264335 261773 256949 246982 240195 244004 248390 243474 240041 233947
11202 233947 227128 227030 227921 224347 218953 213754 213411 211931 208734 222883 227545 232639 240141 252453 262811
11187 262811 267595 282995 314080 360115 407148 440752 453159 447123 425069 398274 377713 363794
11175C63794j0899r461j6828j5814k1805j2184p424j2973j2017j5356o377J292
11163B23948K028R993O471O293L682J0607J2370R667O260j965q982p21m481j1751
11149B63419j6454r404n343o998L115j462N906N372M646P931O894K885j883p650
11135B50974k1216j9308p517j740j991n375r150o357K541J399N741O959Q741J065
11121B04766J98L774K567r944j1016m394r874n567k665k537N973K482N338O440
11107A85541L069M387Q96M320Q217l084J823O504O296n78m234L280P947J3825
11093B38209J2540R919J4562R778J2827O671o56l473l790m272o772J594k322o375
11079B78440J0276Q667P712L049O243K232m639m72P257N887L066O23j4805j0332
$$ plain form
11175 363794 352895 343434 326606 310792 288987 276803 269379 256406 244389 229033 222656 223948
11163 223948 225976 235969 242440 248733 252415 263022 275392 285059 291319 289354 280372 279651 275170 263419
11149 263419 246965 237561 232218 225220 228335 226873 232779 238151 242797 250728 257622 260507 258624 250974
11135 250974 229758 210450 202933 201193 199202 193827 184677 178320 180861 182260 188001 194960 203701 204766
11121 204766 204964 208738 211305 201361 190345 185951 176077 170510 167845 165308 171281 173763 179101 185541
11107 185541 188610 192997 193893 198213 206430 203346 205169 211673 217969 217391 213157 216437 224384 238209
11093 238209 250749 260668 275230 285008 297835 304506 303850 300377 296587 292315 285543 287137 284815 278440
11079 278440 288716 297383 305095 308144 314387 316619 311980 311508 318765 324652 327718 328341 313536 303204
11065C03204m006O50L35M950J0370J4424J1108K0001K8625K3325K2810K6757J1733
11052D74286m832o432m374q247j35M454l841m116q963n085O064K415N473K786
11038D49453O990Q866o583p297M030l758o679k074J670J281J393j661k97K306
11024D47640L310M535J0266J1694J1024J0828R615N783R785O131J271K803P438
11011E42123J1617J5671M600P753M372n166k863j769K434N092M685L027Q417O025
10997F06018L985L012N887K392O738J6444K3613J6536K0743K4896K8038M1697
10985G99999M3086M9760M7123O4549Q3339R9781J24667J42935J64629J86150K01789
10974B007807K16343K47524L31666M46676O15091Q91559J325539J956907K766551
$$ plain form
11065 303204 299198 299848 300183 305133 315503 329927 341035 361036 389661 412986 435796 462553 474286
11052 474286 469454 463022 458648 450401 450266 454720 450879 446763 437800 432715 438779 441194 446667 449453
11038 449453 456443 465309 458726 451429 455459 451701 445022 442948 444618 445899 447292 445631 445334 447640
11024 447640 450950 455485 465751 477445 488469 499297 508912 514695 524480 530611 531882 534685 542123
11011 542123 553740 569411 574011 581764 586136 580970 578107 576338 578772 583864 588549 591576 599993 606018
10997 606018 610003 613015 618902 621294 628032 644476 668089 684625 705368 730264 758302 799999
10985 799999 843085 892845 939968 1004517 1087856 1187637 1312304 1455239 1619868 1806018 2007807
10974 2007807 2224150 2471674 2803340 3250016 3865107 4756666 6082205 8039112 10805663
10965A0805663L586529M039660L699090K393711L61280j748207l196064l640663
10957A6300999l257075k514633j793507j223039q20348n38937l36002k05510j48399
10948E463549j41541j64469j59841j27105p1517N19P4194J35115J89656K40854
10938E439414L11244M26925O07186Q87347J321647J985341K993798M349566N867672
10929B4190140P051780P228946N852177K911176q72894m325833o425003o830697
10921B8779792n936232m533350l238697k259892j590300j141655q47632o39422
10913H592612m92014l93587l20518k70708k21381j58486q2355k8325l066j20j2585
10902F609467r040M2403J56543L30235N78619R54922J500277K199210K959968
$$ plain form
10965 10805663 14392192 18431852 22130942 24524653 24885933 23137726 19941662 16300999
10957 16300999 13043924 10529291 8735784 7512745 6692397 6153460 5817458 5611948 5463549
10948 5463549 5322008 5157539 4997698 4870593 4799076 4799595 4873789 5008904 5198560 5439414
10938 5439414 5750658 6177583 6784769 7672116 8993763 10979104 13972902 18322468 24190140
10929 24190140 31241920 38470866 44323043 47234219 46361325 42035492 35610489 28779792
10921 28779792 22843560 18310210 15071513 12811621 11221321 10079666 9232034 8592612
10913 8592612 8100598 7707011 7386493 7115785 6894404 6735918 6653563 6625238 6622172 6622052 6609467
10902 6609467 6600427 6642830 6799373 7129608 7708227 8663149 10163426 12362636 15322604
10893A5322604L512123L444230K505792P80868j227987k832987l537605l385390
10885A4581648k738534k020029j437787j030535p44861n60000m30376l42327k84091
10876D993108k55644k26371k12748k09554j92247j78894j58065j35604j33500
10867C290481j24468j08474j12351r6159q3784q3719p9875o9413o5455n9135o5783
10856B341865o9833o8455n6555n0167n2242m6728m9178n0484m1125m2347n1608
10845A763143l7509l1321l5536k4926k1489j8109j7792k3910k2797j7646j6584
10834A495524k1646k0748j8544k6995k8140l0127l3402k9805k7253l0820k5489
10823A202555k2651k6411l2184k0437j3375k0761k1892j4408j5533j1168q261
$$ plain form
10893 15322604 18834727 22278957 24784749 25565617 24337630 21504643 17967038 14581648
10885 14581648 11843114 9823085 8385298 7354763 6609902 6049902 5619526 5277199 4993108
10876 4993108 4737464 4511093 4298345 4088791 3896544 3717650 3559585 3423981 3290481
10867 3290481 3166013 3057539 2945188 2849029 2765245 2681526 2601651 2532238 2466783 2407648 2341865
10856 2341865 2272032 2203577 2147022 2096855 2044613 1997885 1948707 1898223 1857098 1814751 1763143
10845 1763143 1725634 1694313 1658777 1633851 1612362 1594253 1576461 1552551 1529754 1512108 1495524
10834 1495524 1473878 1453130 1434586 1407591 1379451 1349324 1315922 1286117 1258864 1228044 1202555
10823 1202555 1179904 1153493 1121309 1100872 1087497 1066736 1044844 1030436 1014903 1003735 995474
10812I95474k977m053j4148j2151j0645j0381p845K094J7900J7338K1839J7795
10800A010240J1891J1083O595l724j2587k2276k0768l1028l3715k7277k7608k6837
10788H33989k3238j7460j5512j6550j7054j1000j0548j3712m011j1600j309l508
10776F88487n299j2843r367q575J28K412J888o05k835N724O156J699M669P838
10762F79477M386m823j1601j0700j3445r956j3969j6783j5894p410j2432j2740
10750E54110l540o001j4298j1570k235l830q077k815n089q13M143R15o122j075
10736D93703k010j2312k497k4o912p550j0161m873N081L861n903l734j962n139
10722D39568O763J529k047o82m207P864K0791J0852O194J2747M457J0475K4989
$$ plain form
10812 995474 992497 988444 974296 962145 951500 941119 933274 935368 953268 970606 992445 1010240
10800 1010240 1022131 1033214 1039809 1036085 1023498 1001222 980454 949426 915711 888434 860826 833989
10788 833989 810751 793291 777779 761229 744175 733175 722627 708915 704904 693304 691995 688487
10776 688487 683188 670345 660978 652403 652531 654943 656831 656226 653391 659115 665271 666970 671639 679477
10762 679477 683863 679040 667439 656739 643294 633338 619369 602586 586692 579282 566850 554110
10750 554110 550570 544569 530271 518701 516466 512636 504559 501744 496655 495842 499985 500900 494778 493703
10736 493703 491693 479381 476884 476860 469948 462398 452237 447364 452445 456306 450403 446669 444707 439568
10722 439568 446331 447860 445813 445131 440924 448788 469579 480431 486625 499372 503829 514304 539293
10709E39293L2471L7811O3826Q4379J19717J53293J85088K00711K02648J68172
10699A787409R4205K946r7193j64312j99071j97824j65330j20132r9764o7873
10689G73061n0238k9809j9924j2431m870l679P259M770n999m652n60K230L024
10676F58182Q402R858P640O185p611j4584j2414j9475j8921j3370j9545k5238
10664E59109k2112j0814p431j3764j807K691o541L480J830j29M470J9783M1040
10651E69805K9837K8091L2496K6242R027N501l137j2727j9510j7594r099q461
10639F30471l656Q335J2436J7830O082K080n480j4653k0478k4481k1952j3643
10627E72891j3103j2725n452K350J1394K871J1770J6174K8040L5321L7634N2713
$$ plain form
10709 539293 571764 609575 673401 757780 877497 1030790 1215878 1416589 1619237 1787409
10699 1787409 1881614 1884560 1787367 1623055 1423984 1226160 1060830 940698 840934 773061
10689 773061 722823 693014 673090 660659 655789 652110 659369 664139 658140 653488 652928 655158 658182
10676 658182 666584 676442 684082 690267 682656 668072 655658 636183 617262 603892 584347 559109
10664 559109 536997 526183 518752 504988 503181 505872 499331 502811 504641 504512 508982 528765 569805
10651 569805 599642 627733 660229 686471 695498 700999 697862 685135 665625 648031 638932 630471
10639 630471 626815 635150 647586 665416 671498 673578 668098 653445 632967 608486 586534 572891
10627 572891 559788 547063 541611 543961 555355 558226 569996 586170 614210 649531 687165 739878
10615G39878O2766O2279N7159N9440N1161M7128M0379L1654K607l8406o4548p3135
10603I78362p1953p1659n1264m7270l4869k5868k7903j8771p572k978j517j3263
10591F03475j8389k235J2576R494j604l360R370J0010J6152J4711J2809L4931
10579F97940M6868N5035O7788Q2900R3180J21575J44264J51408J13161L8349n4285
10568A558183j36114j49293j25161r5157p7046o9731n9608m2738l0270k4433j9947
10557G28685k1884r021m209k311j536J104j264P774J7174K4966L2456L7183K3293
10544H32410Q869P60O067K1452K2204K3106O444n962r248j3079j2426j5462k0662
10531H44473k3401k8732l5490k8750k5595k6494j7210k0060k0758j4810p662j2123
$$ plain form
10615 739878 802644 864923 922082 981522 1032683 1079811 1120190 1151844 1154451 1116045 1051497 978362
10603 978362 906409 834750 783486 736216 701347 675479 647576 628805 621233 618255 616738 603475
10591 603475 585086 582851 595427 604921 603317 599957 609327 619337 635489 650200 663009 697940
10579 697940 744808 799843 867631 950531 1043711 1165286 1309550 1460958 1574119 1612468 1558183
10568 1558183 1422069 1272776 1147615 1052458 975412 905681 846073 803335 773065 748632 728685
10557 728685 706801 697780 693571 691260 689724 690828 689564 697338 714512 739478 771934 809117 832410
10544 832410 841279 842039 848106 869558 891762 914868 921312 915350 906102 893023 880597 865135 844473
10531 844473 821072 792340 756850 728100 702505 676011 658801 638741 617983 603173 595511 583388
10519E83388j2248j863J014j45L415N049J3387K1167K5040K0109J9923K7716L3616
10506G39568M0631K9948K7999J1256q220l2308m1205m3022l8181m1576l2056k8293
10494E84541k0226o230n646j7904j0688n230n951j0333j545L181o549l21M955
10481E02054K0195K9274K7250L2150L0383J0033K997K515J062N606m20j6407m3787
10468F02905n6433m4054j7468o927j1721l207K41M743j357J1311K2059L3924N1492
10455E85508Q3678J19068J56884J68445J40454N8506m1891j30404j53215j30761
10445H56272r6600o4985m7245k9691k6590k5293l0626k0385j562J4867J3836J5996
10433E57994J9900J6586L53j2658p193j01J570j0492j7791q740O88l085n977l331
$$ plain form
10519 583388 571140 569277 570291 570146 573561 578610 591997 613164 638204 658313 678236 705952 739568
10506 739568 780199 810147 838146 849402 841182 808874 767669 724647 686466 644890 612834 584541
10494 584541 564315 558085 552439 534535 523847 518617 512666 502333 500788 503969 497420 497099 502054
10481 502054 522249 551523 578773 610923 641306 651339 654336 656851 657913 663519 663099 646692 602905
10468 602905 546472 502418 484950 478023 466302 463095 463336 468079 466722 478033 500092 534016 585508
10455 585508 669186 788254 945138 1113583 1254037 1312543 1270652 1140248 987033 856272
10445 856272 759672 694687 647442 617751 591161 565868 535242 514857 513295 528162 541998 557994
10433 557994 577894 594480 594833 582175 574982 574881 576451 565959 548168 539428 540116 537031 531054 527723
10419E27723Q221J1521L4995N6031Q2247Q8842J10283J38418J78957J71598J75351
10408A584187J47215P5583k5767q9046r5845p7362o4443n9471n5731n8488l3939
10397A246893k0308j6981q154N509J6374J7051J2978O36N344k901P40L132J7470
10384A277783J9500J6760M934K614J082L159J2144K2319K4172R604j0406l2425
10372A351240m7097m6220l0295j8346l527J1418J4581J7595K0218K0875J7771
10361A308213M479n538j4215n594J0095J1842K6690M1477L7534K6772J1734o353
10349A447136j9191k7410l4597k7696j7126p111L107J5787J6222K6609K9351L4688
10337A439769M1930M2541M0734M6469O0531P4080R8912J11973J15125R6922N8293
$$ plain form
10419 527723 535944 547465 582460 638491 720738 809580 919863 1058281 1237238 1408836 1584187
10408 1584187 1731402 1806985 1781218 1692172 1596327 1518965 1454522 1395051 1339320 1280832 1246893
10397 1246893 1226585 1209604 1201450 1206959 1223333 1240384 1253362 1253998 1259342 1256441 1257181 1260313 1277783
10384 1277783 1297283 1314043 1318977 1321591 1322673 1325832 1337976 1360295 1384467 1394071 1383665 1351240
10372 1351240 1304143 1257923 1227628 1209282 1205755 1217173 1231754 1249349 1269567 1290442 1308213
10361 1308213 1312692 1307154 1292939 1287345 1297440 1309282 1335972 1377449 1414983 1441755 1453489 1447136
10349 1447136 1427945 1400535 1365938 1338242 1321116 1314005 1317112 1332899 1349121 1375730 1405081 1439769
10337 1439769 1481699 1524240 1564974 1611443 1671974 1746054 1844966 1956939 2072064 2168986 2227279
10326B227279K6339j0771l6920l0877n348K7035O1964R4025J04388J03865Q9915
10315B650894O7598O4286J10182J62869K11374K35697K54170K67384L08401M02299
10305D735154M90096N58029O21810O91225Q05609R63928J136453J262332J276157
10296A2540793J195808J109680J125570J427060K035296K898102L996661N438233
10288C1767203P538206J0945463J6889681K7098039M2531561N9105368O5232465
10281B61107986N0991521J9463504k0214884n4518959o3903665n1358393l4228898
10274A07338212k2129613j4969242j0589373p703834n722182m303295l233370
10267C8687303k419590j812692j425929j276045j289317j392194j491298j476037
$$ plain form
10326 2227279 2253618 2242847 2205927 2175050 2169702 2196737 2258701 2352726 2457114 2560979 2650894
10315 2650894 2718492 2782778 2892960 3055829 3267203 3502900 3757070 4024454 4332855 4735154
10305 4735154 5225250 5783279 6405089 7096314 7901923 8865851 10002304 11264636 12540793
10296 12540793 13736601 14846281 15971851 17398911 19434207 22332309 26328970 31767203
10288 31767203 39305409 50250872 67140553 94238592 136770153 195875521 261107986
10281 261107986 312099507 331563011 311348127 256829168 192925503 141567110 107338212
10274 107338212 85208599 70239357 59649984 51946150 46223968 41920673 38687303
10267 38687303 36267713 34455021 33029092 31753047 30463730 29071536 27580238 26104201
10259B6104201j401659j292295j154041j008844q79207p76936o83099n83351m63435
10250A7861334l23932j95029q5858J6507J00839J83355K14497J10146j39263m81573
10240A7261023p90673r69504r67612q76590p77043o92299n99556n05395m37038
10231A0645313l81966l33060l10755k81077k54013k35843k21102k14287k09285
10222H203925k07445j85943j76575j77844j53595j25402j17644j01520r9958j00450
10212F757549q7188o3776l7667j6827K6486R0958J59125J75780J10308m1793k13108
10201F859847l37350l69986l38210k77988k19963j77286j40344j06282q6598p5432
10191D730408m8929j3766L7772J31621K91410M90890O20844M96879J67484k70275
$$ plain form
10259 26104201 24702542 23410247 22256206 21247362 20368155 19591219 18908120 18324769 17861334
10250 17861334 17537402 17342373 17256515 17273022 17373861 17557216 17771713 17881859 17742596 17261023
10240 17261023 16470350 15500846 14533234 13656644 12879601 12187302 11587746 11082351 10645313
10231 10645313 10263347 9930287 9619532 9338455 9084442 8848599 8627497 8413210 8203925
10222 8203925 7996480 7810537 7633962 7456118 7302523 7177121 7059477 6957957 6857999 6757549
10212 6757549 6670361 6606585 6568918 6552091 6578577 6669535 6828660 7004440 7114748 7072955 6859847
10201 6859847 6522497 6152511 5814301 5536313 5316350 5139064 4998720 4892438 4805840 4730408
10191 4730408 4681479 4667713 4705485 4837106 5128516 5619406 6240250 6737129 6904613 6634338
10181F634338o66496o68123m58615k86132k04264j72722j55363j38255j18242
10172C766126r0518o2628l5123o902N643J0514O425n455l698K0834M5975N3439
10160C704632M0774K4189J6551N6028J30180K05800K17786J70263M2926r3911
10150D515218j55343j65433j74152j89592j93960j68040j38360r8695p5642p2319
10140C083682p6560p4921q7107r3432q4348n9052l8552k0585K579J5546J349k0109
10128B548490m5465n8766k2876J1327K8163J5512k4645p1991j10733j13800r6887
10117B058329q3906p3496n8918m8534m1145l0578l1847l0101j5912p230j4950
10106A621712k1826j0916j0364j3284q577j7255l3921k8243j6890k2885j3719
$$ plain form
10181 6634338 5967842 5299719 4841104 4554972 4350708 4177986 4022623 3884368 3766126
10172 3766126 3675608 3612980 3577857 3570955 3576598 3587112 3593537 3588082 3584384 3605218 3651193 3704632
10160 3704632 3745406 3769595 3786146 3842174 3972354 4178154 4395940 4566203 4609129 4515218
10150 4515218 4359875 4194442 4020290 3830698 3636738 3468698 3330338 3231643 3156001 3083682
10140 3083682 3007122 2932201 2845094 2751662 2667314 2608262 2569710 2549125 2551704 2567250 2568599 2548490
10128 2548490 2503025 2444259 2421383 2432710 2460873 2476385 2451740 2379749 2269016 2155216 2058329
10117 2058329 1974423 1900927 1842009 1793475 1752330 1721752 1689905 1659804 1643892 1636662 1621712
10106 1621712 1599886 1588970 1578606 1565322 1556745 1539490 1505569 1477326 1460436 1437551 1423832
10095A423832j4265l1312m6621o1624o9847n5510m1647m1801m9781m0011k3699
10084I47714j4465o021N047J3431O528J903p3L37m602M520o359j7862j3735j5215
10070I01148j4303j3784j1167j9138k3475k8282k7939j9210k7062j9919j5662
10059F81207j4545j5824j5646l923J373n281n473L677j543j2422j0062r536j4613
10046E77389j6225l223l077K03p780j1891r125p43J67o99j91O126J367q36p745
10031E23717l753K66J6965L2871M6234N5946N5478M1905M2526K7761J1613J6317
10019H67846L3140N9471J61577L34990M10778K05861M5726l23473n27869k99140
10009I68907j51127r4745p0207n5889m1448k7509l0298l0825j5564j8078j7531
$$ plain form
10095 1423832 1409567 1378255 1331634 1270010 1200163 1144653 1103006 1061205 1011424 971413 947714
10084 947714 933249 927228 932275 945706 952234 954137 954064 954401 949799 954319 947960 930098 916363 901148
10070 901148 886845 873061 861894 842756 819281 790999 763060 743850 716788 696869 681207
10059 681207 666662 650838 635192 631269 632642 627361 621888 625565 624022 611600 601538 592002 577389
10046 577389 561164 557941 554864 555067 547287 535396 526271 525528 525695 524996 524805 530931 532298 531462 523717
10031 523717 519964 520230 537195 570066 616300 672246 727724 769629 812155 839916 851529 867846
10019 867846 900986 960457 1122034 1457024 1867802 2073663 2119389 1795916 1268047 968907
10009 968907 817780 723035 652828 596939 555491 527982 497684 466859 451295 433217 415686
9998D15686q526o160o956j1974j8264j3831j7053j1148j449o294l115j0277j0364
9985B90275n027k422K268K76k850j0153m107l312J218l244q410j016q984k3380
9971B21132j2800p278l983r924j0201k124K606j1849m273m72J153m977q88L574
9957A59696K895l719k375L362q734j3169K640m32l044o157q858M5K851k340Q64
9942A23525n288l86j218p395k456L316J624o011q497J19J623P429J4744l898j0613
9927A06618l401L967P564l641j0739n348N905K039j3510j4474j990N726M806P080
9913I0602L215n517j0058m901L664Q052L560O94k823p678K562m322q590m80R917
9898G7897j622m978O30Q71l344l242P526L823o964K125J416M133o194M487M659
$$ plain form
9998 415686 407160 401000 394044 382070 363806 349975 332922 321774 320325 314031 310916 300639 290275
9985 290275 285248 282826 285094 285370 282520 272367 268260 264948 266166 262922 254512 253496 244512 221132
9971 221132 208332 201054 197071 187147 176946 174822 177428 165579 161306 160834 161987 157010 156122 159696
9957 159696 162591 158872 156497 159859 151125 137956 140596 140164 137120 130963 122105 122150 125001 122661 123525
9942 123525 118237 117851 116633 109238 106782 110098 111722 105711 97214 97333 98956 106385 121129 117231 106618
9927 106618 103217 107184 114748 111107 100368 95020 100925 102964 89454 74980 72990 78716 83522 90602
9913 90602 93817 88300 78242 73341 77005 85057 88617 89311 86488 78810 81372 77050 68460 67980 77897
9898 77897 76275 71297 71927 72798 69454 66212 73738 77561 70597 72722 74138 78271 72077 76564 81223
9883H1223M19n089L624J128j250K859N547O020N85M407M639R006J1720J2677L841
9868A41356J1331J3409P985K4733M3511N6368R3091J18375J55570J90641K02876
9857A059246J84252J27420L9055m5036j28473j73117j81161j69245j34961j05302
9847D72678p8791o5811m0847k0739k4545k7100o938l278j1584j4444o906l873
9835A67822j3208q283k293o086o289k741k216q095l960p392l261k730j060m09
9821I9799Q608J0129J996O572O177O248K03j3328j2882r486J122k141l41k959
9807I9717o257j0270j5034q868J457O550K781m135p655o737m665O70J714l701
9793D5567k09K459l711R65L992k797K497L80K115k689l914m288O897L748Q2M996
$$ plain form
9883 81223 81642 76553 80177 81305 80055 82914 88461 94481 95066 99473 104112 113118 124838 137515 141356
9868 141356 152687 166096 174081 198814 242325 298693 391784 510159 665729 856370 1059246
9857 1059246 1243498 1370918 1409973 1364937 1236464 1063347 882186 712941 577980 472678
9847 472678 393887 328076 287229 266490 241945 214845 207907 204629 193045 178601 171695 167822
9835 167822 154614 146331 144038 137952 131663 128922 126706 118611 114651 107259 103998 101268 100208 99799
9821 99799 108407 118536 120532 127104 133281 139529 139732 126404 113522 104036 105158 103017 102676 99717
9807 99717 93460 83190 68156 59288 60745 67295 70076 65941 58286 51549 46884 47554 49268 45567
9793 45567 45358 47817 44106 45071 49063 46266 48763 49143 51258 48569 44655 40367 47264 51012 51094 56090
9777E6090l144J145k704r221p543L447L401q844j0514j36j295j809o01J576j402
9762A8446J930L671M423J0340O413k570r762j1413k105N176K924j356m16m587
9748B1114m854l256P598P470j563o10k227l5K284k669K074l655P90j360M450n02
9732B5049j573L706O4O64o77K055K054j45j785K540r311q036K625J969Q324K893
9716C0416N67J370n792o893m806N58j515L584R61l095K245J629k035N573k647
9701B0120j212n228J3383J1491J083k325o115p526M880N017N701K897L011K436
9687D7613p165r600n009J61k886j17k07j077m753j488K626p378k668N272J364
9672A4688O287K097J254j270O713j673m463j0956l659j066O45J828O86N297P801
$$ plain form
9777 56090 52946 54091 51387 42166 34623 38070 41471 32627 22113 21977 20682 18873 18272 19848 18446
9762 18446 20376 24047 28470 38810 45223 42653 32891 21478 19373 24549 27473 26117 25701 21114
9748 21114 16260 13004 20602 28072 26509 25899 23672 23637 25921 23252 25326 21671 22461 21101 25551 25049
9732 25049 23476 27182 27246 27910 27233 29288 31342 31197 29412 31952 22641 14605 17230 19199 27523 30416
9716 30416 30983 32353 26561 19668 14862 15420 13905 17489 18450 15355 17600 19229 17194 22767 20120
9701 20120 18908 13680 27063 38554 39637 37312 31197 23671 28551 33568 39269 42166 45177 47613
9687 47613 40448 30848 25839 26000 23114 22997 22790 21713 16960 15472 18098 10720 8052 13324 14688
9672 14688 20975 23072 24326 23056 29769 28096 23633 12677 9018 7952 8597 10425 11111 16408 24209
9657B4209O625O01O099Q494l095j800p909l499O541J087m753k969m852j608O05
9642B3776L078m594o336L859N783J754l016M292r64n52q451p192N03p01J008L608
9626A5855Q943p14O241P759K054o24n838l941p83J252J015J716O635J216K209
9611D2995k850j544J487n054R10J569p39j479J903q34l045p043l977J547k443
9596B1403k067k88n248K197P500J711k45r681o888NJ212P249J1301n53k984j713
9580B2911J032l906j481J504R47j424o979N500O934L527m325Q49r07M799j919
9565B7062k47j850K83n684m791M241K522L923k225p116M035L303n107J072k120
9550A7301l010O102K436n548r90K37M828n1l777m419L70K696N233R03n500k698
$$ plain form
9657 24209 30834 31435 37534 46028 42933 41133 33224 29725 36266 37353 32600 29631 24779 23171 23776
9642 23776 26854 22260 15924 19783 25566 27320 24304 28596 27632 27080 18629 11437 11940 11239 12247 15855
9626 15855 24798 24084 30325 38084 40138 39514 33676 29735 28952 30204 31219 32935 39570 40786 42995
9611 42995 40145 38601 40088 35034 35944 37513 36774 35295 37198 36364 33319 26276 22299 23846 21403
9596 21403 19336 19048 13800 15997 23497 25208 24963 15282 8394 8399 9611 16860 28161 27608 24624 22911
9580 22911 23943 20037 18556 20060 21007 19583 12604 18104 25038 28565 24240 25089 24182 28981 27062
9565 27062 26815 24965 25248 19564 14773 19014 21536 25459 23234 16118 20153 23456 18349 19421 17301
9550 17301 14291 20393 22829 17281 16291 16528 21356 21305 17528 13109 13479 16175 21408 22311 16811 14113
9534A4113M164k172M190N155L588m51l287J63P27k560j489j27J896j35P13J256
9518B5744L169J689P717L70k466o258n094L548M80K166J050l865J045O60l003
9503B6952l994k958l585n217L012P898R23o470j629M442O076j01j346K867O84
9488B7554j347j418k30M39J504J895M72k202J86R16K342k424p739m435m531M331
9472A5313O035Q277J763m032q160j174k35L208N973J718k065P80N1O242n417J167
9456B9444K738m248o282n976k178O176j745p478q670N917M270n13O658Q410n221
9441B1302k850q402n494j824P053O747Q13O11M218j338m551l547l367l310l158
9426B903Q975P241l785K047J87k239j296O50P911P001K929m987k218q394NP94
$$ plain form
9534 14113 18277 16105 20295 25450 29038 28587 25300 25463 26190 23630 22141 22014 23910 23775 24488 25744
9518 25744 28913 30602 38319 38689 36223 29965 24871 28419 28899 31065 32115 28250 29295 29955 26952
9503 26952 22958 20000 16415 11198 14210 22108 23031 16561 14932 19374 25450 25349 24003 26870 27554
9488 27554 26207 24789 24559 24998 26502 28397 28869 26667 26853 27769 30111 27687 19948 15513 10982 15313
9472 15313 21348 29625 31388 27356 19196 18022 17787 20995 26968 28686 26621 27401 27452 33694 28277 29444
9456 29444 32182 27934 21652 15676 13498 19674 17929 10451 1781 7698 11968 11455 18113 26523 21302
9441 21302 18452 10050 4556 2732 9785 16532 17345 17956 22174 20836 16285 12738 9371 6061 2903
9426 2903 11878 19119 15334 17381 17568 15329 14033 14683 22594 29595 32524 27537 25319 16925 16930 17724
9410A7724j990O675K869q92p21K183k303J843o208o734M890J823l110J240j848
9395A5441k394J605j479p33J510L73K613O913J787o426l373j278k16l176J95j40
9379A1222P608M087n533M763m359J13L215r47r94M471R47j143l572k299l884m216
9363I479R37K464N594L602n984J65l503K942M693N260M32k485l241j179m355N766
9347B0587L371l736k469K926k374N69q509m389J765M460L310j043j736k027J93
9332A0898L270L411q68m85J923M787L939j122j522p894j1880P78j436J869k986
9317B682O419O046R14j65k616k114K416M939j243l791m112Q6K953k379K477R841
9301B2353Q70j102K325L267q800n723J537j02K971P270J804n304k667M402o004
$$ plain form
9410 17724 15734 22409 25278 24386 23665 25848 23545 25388 19180 12446 17336 19159 16049 17289 15441
9395 15441 13047 14652 13173 12440 13950 14323 16936 23849 25636 19210 15837 14559 14343 11167 11362 11222
9379 11222 18830 22917 17384 22147 17788 17901 21116 20169 19175 23646 24593 23450 19878 17579 13695 9479
9363 9479 10416 12880 18474 22076 16092 16257 12754 15696 20389 25649 26081 23596 20355 19176 14821 20587
9347 20587 23958 20222 17753 20679 18305 18874 10365 5976 7741 12201 15511 14468 12732 10705 10898
9332 10898 14168 17579 16711 16226 18149 22936 26875 25753 24231 16337 4457 5235 3799 5668 2682
9317 2682 9101 15147 16061 15896 13280 11166 13582 18521 17278 13487 9375 9461 12414 10035 12512 22353
9301 22353 23223 22121 24446 27713 18913 13190 14727 14625 17596 24866 26670 21366 18699 23101 17097
9286A7097j076L28P45j244J136K209L63J96k40N984l51l505k278k500J486Q556
9270B6906K815l467o550K85L410k935j682k772m506l533M31N822O066m980J590
9255A6900R95k021N32M936M351p003n8K024M35j257M034M203j052o655M130K856
9239B7350J706n196M530m798q823K997j840k055K105J589Q86L055O013J755j574
9224B7700L298m731j359L329o177o875o55L557q267K038M556k230j47L512M598
9209B2147k583n245o500K216l498j755j176K489P250M623O448r39r19J069m911
9194A8716J134L028k178L38L691n956j601k099L345M437k653j861j110K14R86
9179A8431p13l174O37J511J236L990R77Q075j386K27k089l464l658Q69k183j1518
$$ plain form
9286 17097 16021 16349 17094 15850 16986 19195 19558 19754 19514 25498 25147 21642 19364 16864 18350 26906
9270 26906 29721 26254 19704 19989 23399 20464 18782 16010 11504 7971 8402 14224 20290 15310 16900
9255 16900 17895 15874 16406 21342 25693 18690 18632 20656 21091 19834 23868 28071 27019 20364 24494 27350
9239 27350 29056 23860 28390 23592 14769 17766 15926 13871 15976 17565 18451 21506 27519 29274 27700
9224 27700 30998 26267 24908 28237 22060 15185 14530 18087 9820 11858 16414 14184 14037 17549 22147
9209 22147 19564 14319 7819 10035 6537 4782 3606 6095 13345 17968 24416 23477 22558 23627 18716
9194 18716 19850 22878 20700 21038 24729 18773 17172 15073 18418 22855 20202 18341 17231 17445 18431
9179 18431 17718 14544 15181 16692 17928 21918 22895 30970 29584 29811 27722 24258 20600 21469 19286 7768
9163G768j2088P26K53j475N634R248K606q448m593o931K707M155L180M615L313
9148A0670k208J544L455N637n504k070J670n648k625k205k37R10J852N646m604
9133F283m877L92j337n644l150N563K289K062M965P472K87j1214r540Q027O772
9118H350L377J383j5L130M839p137O23j477l517O5l982p87L64M116P053k855p978
9101E552Q614P05p640q16m634o788K235j007J1392P553J772J731q562l276M586
9086A1417M906l330j207P22l191N7M289K059n458j985q78l142M122k932q566k04
9070c321O863j60k867l138m679j809m873m187N984M465P590M171J327m492k012
9055a138Q238j302r533r88L961L920O37m291l873N998o42m342M741j13O18m99
$$ plain form
9163 7768 -4320 -3594 -3341 -4816 818 10066 12672 4224 -369 -7300 -4593 -438 2742 7357 10670
9148 10670 8462 10006 13461 19098 13594 11524 13194 7546 4921 2716 2479 3389 5241 10887 6283
9133 6283 1406 1798 461 -5183 -8333 -2770 -481 1581 6546 14018 14305 3091 -6449 1578 8350
9118 8350 11727 13110 13095 16225 21064 13927 14550 13073 9556 9621 5639 4852 5216 9332 16385 13530 5552
9101 5552 14166 14871 7231 6415 1781 -5007 -2772 -3779 7613 15166 16938 18669 10107 6831 11417
9086 11417 16323 12993 11786 12508 9317 9374 13663 15722 10264 8279 7401 4259 8381 5449 -3117 -3321
9070 -3321 3542 3382 515 -2623 -7302 -9111 -13984 -18171 -12187 -7722 -132 4039 5366 874 -1138
9055 -1138 7100 5798 -3735 -4723 -762 3158 3795 -496 -4369 1629 987 -3355 1386 1273 1891 1392
9039A392L261j0871J461l90N241K574K484k392j308l681J161K554L31M20J252
9024C489n245p319r030l655M976R164R658J049k364k725j261L272N73p7Q282M112
9008A2899n311k552j401J876k196o41M851O956j130Q8j0l708J804p200j1883l036
8992a0594N205P275L262o66k264p6M57l763J277l445l104n140j82M458L28N119
8976a853L305m377m087L922M081K076j295L848J901n356o681L078O435N26j963
8961C560l885J422K726k817j854j003p44M21K921m63N804M738l103p355m064N905
8945B209L500J014k018L193L614m960L926j655m957O528J598n632m916j660J750
8930A534J449p611j425J341N538k33j434q600m794r76J0605K114n471q67J0905
$$ plain form
9039 1392 4653 -6218 -4757 -5147 94 2668 5152 2760 1452 -2229 -1068 1486 1817 2237 3489
9024 3489 -1756 -9075 -18105 -21760 -16784 -7620 2038 3087 723 -2002 -3263 9 582 505 8787 12899
9008 12899 7588 5036 3635 5511 3315 2674 7525 14481 13351 13439 13429 9721 11525 4325 -7558 -10594
8992 -10594 -5389 1886 5148 4482 2218 2142 2599 -1164 113 -3332 -6436 -11576 -11758 -7300 -6972 -1853
8976 -1853 1452 -2925 -7012 -3090 991 3067 1772 5620 7521 2165 -4516 -1438 4997 5523 3560
8961 3560 -325 1097 3823 1006 -848 -1851 -2595 -2174 747 284 6088 10826 7723 368 -3696 2209
8945 2209 5709 6723 4705 7898 11512 6552 10478 8823 3866 10394 11992 6360 1444 -216 1534
8930 1534 2983 -4628 -6053 -4712 826 593 -841 -9441 -14235 -15211 -4606 -2492 -7963 -8830 2075
8915B075m01l350m90R97m36p70N252k095M619J590N288r04m339L574o465K66N043
8898I454j709r920k551N003P590j903o02k9l130P30j051q76L615O50n456J16o79
8881g48N33M521l376J714N998J598j094q71o531K641L20N91k171M485L830k842
8865H598m572n162K812j45M232j19k245N166j328m866K224m135p573J383k167
8850g897L506O536k886J756p6J166O760O595l50j212l338l230L74n705J86R834
8834A2019M968l30M521L012L05L147J564L931n877q5m334n219L167P373l353o560
8818A8249k547m053j0995q14O079O636L883k053l380K845j215k68l745l173J67
8803E616N221O829m065k437M19m523k838j75l632M894P413J060o179L876L015
$$ plain form
8915 2075 1674 -1676 -2166 -1169 -1605 -2375 2877 782 5401 6991 12279 11375 7036 10610 4145 4411 9454
8898 9454 7745 -2175 -4726 277 7867 5964 5362 5333 2203 2933 1882 1006 4621 5271 -185 -69 -748
8881 -748 -215 4306 930 2644 8642 10240 9146 8275 1744 4385 4705 5296 3125 7610 11440 8598
8865 8598 4026 -1136 1676 1531 5763 5644 3399 8565 7237 2371 4595 460 -7113 -5730 -7897
8850 -7897 -4391 2145 -741 1015 939 2105 8865 15460 15110 13898 10560 7330 7704 1999 2185 12019
8834 12019 16987 16657 21178 24190 24495 27642 29206 33137 27260 27175 22841 17622 20789 28162 24809 18249
8818 18249 15702 11649 654 -160 5919 12555 16438 14385 11005 13850 12635 12367 8622 5449 5616
8803 5616 10837 17666 13601 11164 11583 7060 4222 4047 415 5309 12722 13782 7603 11479 14494
8788A4494q78M291M35J733k578m464n805o306J924Q149O212K732L05L046M789
8773B8079j440j2468o261M37N476Q799L860r022j2630M588P013L432r19l755l618
8758A1571k99P861L268p398M09k561l236L829J572O34m595n400l07L637N064o713
8742G336J274M378J476q64N474N530m019Q79n103m722l942J122J044k239R24Q699
8726A7247P115l141n1K64l148l700l410M132L295M775n790m19L094R76M469J20
8710B5828j104n633K757J410q223J5925L343j1861j0151M36P085N45r703N071
8696A5725P453K031J189n527l685N407M013j42m474j486l14j570m914J838O223
8681B1767l088r64N844L966J106j519n914l364K191j147l611p11O289K00l669
$$ plain form
8788 14494 13616 17907 18342 20075 17497 13033 7228 922 2846 10995 17207 19939 20244 23290 28079
8773 28079 26639 14171 7910 8347 13823 22622 26482 17460 4830 9418 16431 19863 18944 15189 11571
8758 11571 11272 19133 22401 15003 15412 12851 9615 13444 15016 15650 11055 5655 5348 8985 14049 7336
8742 7336 8610 12988 14464 13600 19074 24604 20585 21464 16361 11639 7697 8819 9863 7624 8548 17247
8726 17247 24362 21221 21170 21434 18286 14586 11176 15308 18603 23378 17588 17169 20263 21239 25708 25828
8710 25828 24724 19091 21848 23258 15035 30960 34303 22442 12291 12727 19812 20357 10654 15725
8696 15725 23178 25209 26398 20871 17186 22593 26606 26464 21990 20504 20190 18620 13706 15544 21767
8681 21767 18679 17715 23559 27525 28631 27112 21198 17834 20025 18878 15267 14556 20845 21045 17376
8666A7376M277O665K165Q589L777L49K57q383j3772Q5j278M19N414O98j565j866
8650B3207J48J78N375J4170J2992o648j2697J093k351J086N716L897O194p130
8636D5230n049J02O85l629j641O626L594Q25j706M51L316J051J873r717l967J835
8620C9879L447R39J090m210J969M570K062m313j087L182N345j627l9J218J324
8605E3749Q682p94n488M865J0783j277o121k573j127K595M391M703p35N52q24
8590G1381M094O670M296R650j818j2777l805K674M619R680N690M718L119J181
8576A09372l215J150R25P81N5Q974O766J787P375P691R651K0724J7549J3806P51
8561B04142n801m562q215j7252j3869p376k418p612j626m647q980q675n973o608
$$ plain form
8666 17376 21653 28318 30483 39072 42849 43198 43455 35072 21300 21385 20107 20526 25940 26638 25073 23207
8650 23207 23355 23533 28908 43078 56070 49422 36725 37818 35467 36553 42269 46166 52360 45230
8636 45230 40181 40283 40968 37339 35698 42324 45918 46743 45037 45488 48804 49855 51728 42011 38044 39879
8620 39879 43326 44265 45355 41145 43114 47684 49746 45433 44346 47528 52873 51246 51207 52425 53749
8605 53749 62431 61637 56149 61014 71797 70520 64399 61826 60699 63294 67685 72388 71653 72205 71381
8590 71381 75475 82145 86441 96091 94273 81496 77691 80365 84984 94664 100354 105072 108191 109372
8576 109372 106157 107307 108232 109013 109068 118042 124808 126595 133970 141661 151312 172036 189585 203391 204142
8561 204142 198341 193779 185564 168312 154443 147067 144649 137037 135411 130764 121784 113109 107136 100528
8547A00528j276l026j2336l566K073L141M654J235O83J2972J7055M998J645K552
8533A31332m098o691n672J677J009P381M032p089j2422l324o620m64P33R02j260
8518I9426k29j620j0151l569L695J642n251K108N550J92O073N148j31m411k082
8503I6390k177j735N410N181n686k284M000K376N115R958Q964Q490J2400K731
8489A49133r056n718K661N2n955k725J1772J2576j584j2711q199l604k132o420
8475A18090N998K623K871K963j0015q161N52n342l431L180K192l857k206k204
8461A03253K906k135l100K347M071k274j561j937J453L558Q718M779q37M876N312
8446A29429o56L007L87l541Q73N672J190L9o870k083k677l908K36L936m482l606
$$ plain form
8547 100528 99252 96226 83890 80324 82397 85538 90192 91427 92110 105082 122137 127135 128780 131332
8533 131332 127234 120543 114871 116548 117557 124938 128970 121881 109459 106135 99515 99051 99784 100686 99426
8518 99426 99197 97577 87426 83857 87552 89194 83943 86051 91601 91793 97866 103014 102883 98472 96390
8503 96390 94213 92478 97888 103069 97383 95099 99099 101475 106590 116548 125512 134002 146402 149133
8489 149133 140077 134359 137020 137072 131117 128392 140164 152740 151156 138445 130246 126642 124510 118090
8475 118090 124088 126711 129582 132545 122530 114369 114921 109579 106148 109328 111520 107663 105457 103253
8461 103253 106159 104024 100924 103271 107342 105068 103507 101570 103023 106581 115299 120078 119241 124117 129429
8446 129429 128773 131780 132167 128626 129499 135171 136361 136400 129530 127447 124770 120862 121098 125034 120552 116946
8430A16946k64M591O238l545n252P23r788n605l976n415m510o436l217j39K094
8415H2445P484K850k374l148q3j584k141J361J13k08L535k16K552K16l689q265
8399G8848j595Q88N57J671o798n543M210M602r967M429J1235o68p14P08L826J837
8383H7526k400n234N016k448j632Q02p773l759K480k676N519k642l555M558L802
8368G7584l841j856k609k709k271k197l121J519N773R252k088o046r792N49M384
8353F2531R91J805K589j308m200m307P829L032l571J920J2759L02j80m544p556
8338F8092l338n876M497L840m806L43k035O959M467k929o030p333k602L169l142
8323E3276m155J56J75N287M394L807l500j636N985n990j433N569M38m763k051
$$ plain form
8430 116946 116682 121273 127511 123966 118714 119437 109649 104044 100068 94653 90143 83707 80490 80351 82445
8415 82445 89929 92779 90405 87257 87174 85590 83449 84810 84923 84715 88250 88034 90586 90802 87113 78848
8399 78848 77253 78141 78698 80369 73571 68028 72238 76840 66873 71302 82537 81869 81155 81863 85689 87526
8383 87526 85126 79892 84908 82460 80828 81630 73857 70098 72578 69902 75421 72779 69224 73782 77584
8368 77584 73743 71887 69278 66569 64298 62101 58980 60499 66272 75524 73436 67390 57598 58147 62531
8353 62531 63522 65327 67916 66608 62408 58101 65930 68962 65391 67311 80070 80372 80192 75648 68092
8338 68092 64754 58878 63375 67215 62409 62752 60717 67676 72143 69214 63184 55851 53249 56418 53276
8323 53276 49121 49277 49452 54739 59133 62940 59440 57804 63789 57799 56366 61935 62373 57610 55559
8308E5559R037N174l767r508K310n103l483L64K688N612m028K913q82R67Q093
8293F5946j0598p260K725p34M293N162L822K944l021J992Q79m994n587r64l415
8278E1190O61J514L110k535k783k958J0586L914k47J067p190k718m769p415O384
8263D7811O655J488j476K309o744p269n788j771n081K224M460M04L282j625j256
8248C7623k33l434M43J408P9K540K471Q579K281m841N79k50O3n302n308P507M235
8231D8440J069O30k883J172M430l259M76o0K23M5n527m58K947J001p195k482J2028
8214E0597K131k050K11m792o819j049J690J483k36l503R54R94N75k701q186N637
8198C4936J7686O229o372n726j0992j178P569K055O587K321k944k479J099K353
$$ plain form
8308 55559 64596 69770 66003 56495 58805 53702 50219 50583 53271 58883 54855 57768 56886 57853 65946
8293 65946 55348 48088 50813 50079 54372 59534 63356 66300 63279 65271 66150 61156 55569 54605 51190
8278 51190 51851 53365 56475 53940 51157 48199 58785 62699 62452 63519 56329 53611 48842 41427 47811
8263 47811 54466 55954 54478 56787 50043 42774 36986 35215 30134 32358 36818 37222 40504 38879 37623
8248 37623 37390 33956 34399 35807 35886 38426 40897 49476 51757 46916 47495 47245 47308 42006 36698 44205 48440
8231 48440 49509 50139 47256 48428 52858 49599 50075 50015 50238 50283 44756 44298 47245 48246 41051 38569 50597
8214 50597 52728 50678 50889 46097 39278 38229 39919 41402 41166 37663 38617 39611 40186 37485 29299 34936
8198 34936 52622 58851 52479 46753 35761 34583 42152 44207 50794 53115 50171 47692 48791 51144
8184E1144l580m61j639n227m98k796k128j237O610R473J522k319o725L359l252
8169D2246m580N591M248k389m742q22K72M810K704l207m865Q53o230L305O717
8154D3911K232N620o0K111J744n67n337k815n761L39L401j260l646K91J430N92
8138D2225O844K552m31l963j634K314q662M485O955j623n02M003q49j3246r68
8123C7500j356j712j669o050L340Q096M471K862O676m033M755O581O897P292k375
8108G1275j0349l272J995p67q078k292m577Q9q513j408M748n85j222k07m39m264
8092C2134J1554J146p826l285P900M937o095l67P57l542m177k134j205O248M04
8077C6449k205r13j654J448J425J121l337N41P306J38l741N606q42k366q82K203
$$ plain form
8184 51144 47564 47103 45464 40237 39739 36943 34815 33578 40188 49661 51183 48864 42139 45498 42246
8169 42246 37666 43257 47505 45116 40374 39552 39824 44634 47338 44131 39266 40119 33889 37194 43911
8154 43911 46143 51763 51703 53814 55558 54991 49654 46839 41078 41417 44818 43558 39912 40203 41633 42225
8138 42225 49069 51621 51190 47227 45593 47907 39245 43730 50685 49062 48560 52563 51714 38468 37500
8123 37500 36144 34432 32763 26713 30053 38149 42620 45482 52158 48125 52880 59461 66358 73650 71275
8108 71275 60926 57654 59649 58882 50804 48512 43935 44024 35511 34103 38851 38266 37044 36837 36398 32134
8092 32134 43688 44834 37008 33723 41623 46560 40465 40098 40855 37313 33136 31002 29797 36045 36449
8077 36449 34244 33331 31677 33125 34550 35671 32334 32875 40181 40319 36578 42184 41342 38976 38094 40297
8061D0297L752m702J305M935L341r862n059k171P152Q981J690o161o497n872J069
8046C2198l066l158j824m728j88M265J99m660J053R825K912m584p480R818o897
8031B3685O86J2697J238o579m716J033j16q64k003Q981K694r769r61L215J656
8016C0877N405O717q223m772M050K655q763p637K084L739m299k290j679m729P27
8001A3862J714J3482L780J110J975j0167l275L728O233n222L235N165K104k695
7987C5029k574M175N370m463n481o607l84l508M152j65n074K436J795L369K491
7972C0561k560l738L422L299O228O621K215o12M36k921o642p425J66J214K080
7957C2344k85O142n089j641l199k916L680J761k656M95l582j79o6J009R68q384
$$ plain form
8061 40297 44049 39347 40652 45587 48928 39066 34007 31836 38988 47969 49659 43498 37001 31129 32198
8046 32198 29132 25974 24150 19422 19234 23499 23698 19038 20091 29916 32828 28244 20764 30582 23685
8031 23685 24371 37068 38306 31727 27011 28044 27928 27064 25061 34042 36736 26967 26006 29221 30877
8016 30877 36282 42999 34776 30004 34054 36709 27946 20309 22393 26132 21833 19543 17864 13135 13862
8001 13862 15576 29058 32838 33948 35923 25756 22481 26209 32442 27220 30455 35620 37724 35029
7987 35029 32455 36630 42000 37537 32056 25449 25065 21557 25709 25544 20470 22906 24701 28070 30561
7972 30561 28001 24263 27685 30984 37212 43833 46048 45436 45872 42951 36309 28884 29050 30264 32344
7957 32344 32059 38201 33112 31471 28272 25356 29036 30797 28141 28636 25054 24875 24809 25818 26786 18402
7941A8402J181L633L590n326K75N441N140L450n436k569k105p546M057P481K172
7926C1840M693M415p581L968K989j2071o873J30J525q394K106J0565M494N60m941
7911B7425j725n684m65k594J942j835q749m74J0415P753K635j722N86M13o540
7896B1381r340j1099J1244J943M651J232M420J1120K342l456o408o064L18O74
7882B2958k771r30l70k512k036J171M937q92n132Q4K439m128J263O566r1l817
7866A6739P0J735q17J56Q78l493m200l330M000J324n221r7M575J060l00N38k119
7849A1498k282n053k54O009R682N484K047m995o19k931o733l202k277m38L705
7834I641L316N240L054j4303m039J262K334J167O27l540m101O962K597n188n044
$$ plain form
7941 18402 19583 23216 26806 21480 21755 27196 32336 35786 30350 27781 25676 18130 22187 29668 31840
7926 31840 36533 40948 33367 37335 40324 28253 21380 21510 23035 14641 16747 27312 31806 32366 27425
7911 27425 25700 20016 19551 16957 18899 17064 8315 7841 18256 26009 28644 26922 27508 27921 21381
7896 21381 12041 942 12186 14129 18780 20012 24432 35552 37894 34438 28030 21966 22284 22958
7882 22958 20187 19257 18887 16375 14339 15510 20447 19555 14423 14507 16946 12818 14081 20647 20556 16739
7866 16739 16809 18544 17727 17883 18761 15268 11068 7738 11738 13062 7841 7744 12319 13379 13079 13617 11498
7849 11498 9216 4163 3909 9918 19600 25084 27131 22136 21517 18586 11853 8651 6374 5936 9641
7834 9641 12957 18197 21251 6948 2909 4171 6505 7672 8299 4759 658 7620 10217 5029 -15
7819a5K307N884n79q9P672j000m364k482j897J867p35k286m955l571K175N960
7803C892k575j1895L27L683P698M20j83r40m759M366k920o602K801N487r757K009
7787h948K31J051M823P232k958L109J199J185l253m532Q85O099k567o75q827p257
7771a3203K878p858K549R220N508M571M344M083j022m859q088K877q189m663j530
7756a3382M639n458k684L220K127J2091K712l254k642m43N6n458l943K105k769
7741a3083Q99l674j536N843L384K193m005m21M73j037K098k086n966J009Q333
7726g576O453M222K110m57k775M673O431l335n083L628p389j5455j260L134N388
7711g291N870o788j613K132o22M316P637m452j560k119J124j160J672J562K072
$$ plain form
7819 -15 2292 8176 7597 7508 15180 14180 9816 7334 5437 7304 6569 4283 -672 -4243 -2068 3892
7803 3892 1317 -10578 -10251 -6568 1130 1550 1367 427 -4332 34 -2886 -9488 -6687 -1200 -10957 -8948
7787 -8948 -8717 -7666 -2843 4389 1431 4540 5739 6924 3671 -861 24 6123 3556 2881 -5946 -13203
7771 -13203 -10325 -18183 -15634 -6414 -906 3665 8009 12092 11070 6211 -1877 1000 -7189 -11852 -13382
7756 -13382 -8743 -14201 -16885 -13665 -11538 553 3265 11 -2631 -3074 -3018 -8476 -12419 -10314 -13083
7741 -13083 -12184 -15858 -17394 -11551 -8167 -5974 -9979 -10400 -9927 -10964 -8866 -10952 -16918 -15909 -7576
7726 -7576 -1123 3099 5209 4752 1977 6650 13081 9746 4663 8291 902 -14553 -15813 -12679 -7291
7711 -7291 -1421 -8209 -9822 -7690 -8312 -3996 3641 -811 -2371 -4490 -3366 -4526 -2854 -1292 780
7696G80q316l163O843p73j186M573M383j060k035n530k27K680J896q156q46n074
7680a5211K917Q496J3k499N261k023r155r495j981J431K235J315K129K011m095
7665a8651J149M930K857J9o31j713R82J062P113J442M833j2337l113J512k69o95
7649a1510O060L825k091j025J150k403J697J932o23j038k449l563O437l914o683
7634a4198n462N945J1419N18m931l460L943R78K008L579K146k137n530k244q095
7619a5521j1229M480J4621J878O342M709j863p323J490N412Q129l830q143l640
7605d488j587j551p089L038K456k313j372k75L952L185M194N469k796l83m082
7590c642m213m618l861J299P427j020r04l029K355L964n97K021L85m30N087l392
$$ plain form
7696 780 -7536 -10699 -3856 -4629 -5815 -1242 3141 2081 46 -5484 -5711 -3031 -1135 -9291 -10137 -15211
7680 -15211 -12294 -3798 -3785 -6284 -1023 -3046 -12201 -21696 -23677 -22246 -20011 -18696 -16567 -14556 -18651
7665 -18651 -17502 -12572 -9715 -9696 -10327 -12040 -11058 -9996 -2883 -1441 3392 -8945 -12058 -10546 -10815 -11510
7649 -11510 -5450 -1625 -3716 -4741 -3591 -5994 -4297 -2365 -2988 -4026 -6475 -10038 -3601 -7515 -14198
7634 -14198 -19660 -13715 -2296 -1778 -6709 -10169 -6226 -5248 -3240 339 2485 348 -5182 -7426 -15521
7619 -15521 -26750 -22270 -7649 -5771 571 5280 3417 -3906 -2416 2996 11125 7295 -848 -4488
7605 -4488 -6075 -7626 -14715 -11677 -9221 -11534 -12906 -13181 -9229 -6044 -1850 3619 823 440 -3642
7590 -3642 -7855 -12473 -16334 -15035 -7608 -8628 -9532 -12561 -10206 -6242 -6839 -4818 -4433 -4863 224 -3168
7574c168J067m89n503n513J70L349J631l431k065K068M808L542J355j0148m264
7559a6591M408K661O043J714l940q170p328L297J958P54m693Q56N02K027j48M957
7543a1693j406L041J704m149n217J060o70O102L132J474Q22j860n566o567N15
7528a9278J1221J4238M552q953r675n213J446j591o79J841Q65k763o19K417j441
7513a3632j7j446k274m193l953O356P604P48n603R55O462n352l319j609k499M189
7497a7583p4k386M115j573M661J1590M499N934j040n742j672j744n773k580j362
7482a0730L532L510P759j338l510j0604n921j804n572J814J171j129Q34L145M682
7467a4161O787j718n057j059k477j8O78o639j227M954J388O318M017J761m72l737
$$ plain form
7574 -3168 -2101 -2590 -8093 -13606 -13436 -10087 -8456 -11887 -13952 -11884 -7076 -3534 -2179 -12327 -16591
7559 -16591 -12183 -9522 -3479 -1765 -5705 -13875 -21203 -17906 -15948 -15194 -19887 -19031 -18529 -16502 -16650 -11693
7543 -11693 -13099 -10058 -8354 -12503 -17720 -16660 -17330 -11228 -8096 -6622 -5800 -7660 -13226 -19793 -19278
7528 -19278 -8057 6181 10733 1780 -7895 -13108 -11662 -13253 -13932 -12091 -11226 -13989 -14608 -12191 -13632
7513 -13632 -13649 -15095 -17369 -21562 -25515 -19159 -11555 -10807 -16410 -15455 -8993 -14345 -17664 -19273 -21772 -17583
7497 -17583 -17657 -20043 -15928 -17501 -12840 -1250 3249 9183 8143 2401 729 -1015 -6788 -9368 -10730
7482 -10730 -7198 -3688 4071 2733 -777 -11381 -17302 -19106 -24678 -22864 -21693 -22822 -21988 -18843 -14161
7467 -14161 -7374 -9092 -14149 -15208 -17685 -17703 -17025 -23664 -24891 -19937 -18549 -12231 -8214 -6453 -6925 -10662
7451a0662k681l369j206K675k014k656j369J554j644l447O939M587k148j147J125
7436a5463L45L858l136m447J418l608J026L751J0007Q813j146q492n050m497l887
7421b0508N866L682l32k039J985K194M019k156r074o55O259l815J985l897K892
7406a3594o40j998J601K504M851l601P84l466n516K612L878o282n508L076k242
7391b3541j450P89O141L750j6k21n830l396N591M471M923p44k750P0k401l018
7375a7632M593O872L729m237l124q0l858o435o352Q828K893J679L112M20J251
7360h341r15n099L923K195P07o298m548R226N736o007n886k036l173j509P344
7345a4681j332M45j023J911M17n22L024j52M392M211p16p185l591j561j306j090
$$ plain form
7451 -10662 -13343 -16712 -17918 -15243 -17257 -19913 -21282 -19728 -21372 -24819 -17880 -13293 -15441 -16588 -15463
7436 -15463 -15118 -11260 -14396 -18843 -17425 -21033 -20007 -16256 -6249 2564 1418 -7074 -12124 -16621 -20508
7421 -20508 -14642 -10960 -11292 -13331 -11346 -9152 -5133 -7289 -16363 -17018 -10759 -14574 -12589 -16486 -13594
7406 -13594 -14234 -16232 -14631 -12127 -7276 -10877 -10093 -13559 -19075 -16463 -12585 -18867 -24375 -21299 -23541
7391 -23541 -24991 -24202 -18061 -14311 -14327 -14548 -20378 -23774 -18183 -13712 -8789 -9533 -12283 -12213 -14614 -17632
7375 -17632 -13039 -6167 -2438 -6675 -9799 -9879 -13737 -20172 -26524 -17696 -14803 -13124 -10012 -9592 -8341
7360 -8341 -9256 -14355 -10432 -8237 -7530 -13828 -18376 -9150 -3414 -9421 -15307 -17343 -20516 -22025 -14681
7345 -14681 -16013 -15568 -16591 -14680 -14263 -14785 -11761 -11913 -7521 -3310 -4026 -11211 -14802 -16363 -17669 -18759
7329a8759M599J70J120N683M271K739k87n425o053q532p752N023Q803M017l214
7314a3597l492N65l186q35L344O304l445j775n30M06O20M30N987l535l654N5K904
7297a3434n11j716j809K026o079M009J2448R19n019M06N417n287P4k092Q56q01
7281a0593J542q18m003l112m331l713M72Q70N485P459L90l407R28L721L621j236
7265f725j719k74L31J952j271K913K754M7o311L726N599j847o757K317L971N63
7249g31L088l743r47p665l779k04M654N615K47m556l542j554K461J2839O495l088
7233E590n988p896m121O69n703m89M016N263q43o61K843n720n130K097l370j296
7217b0739M290M229p03l814N612L28M515J524q417m517M598N540M289l428n631
$$ plain form
7329 -18759 -14160 -13990 -12870 -7187 -2916 -177 -464 -5889 -11942 -20474 -28226 -23203 -14400 -10383 -13597
7314 -13597 -17089 -16524 -19710 -20545 -17201 -10897 -14342 -16117 -16647 -16241 -15621 -15191 -9204 -12739 -16393 -16338 -13434
7297 -13434 -13945 -15661 -17470 -15444 -21523 -17514 -5066 -4147 -9166 -8760 -3343 -8630 -8556 -10648 -9792 -10593
7281 -10593 -9051 -9869 -13872 -16984 -21315 -25028 -24556 -23686 -18201 -10742 -10352 -13759 -12831 -9110 -5489 -6725
7265 -6725 -8444 -8718 -8387 -6435 -7706 -4793 -2039 -1992 -8303 -4577 1022 -825 -7582 -5265 -1294 -731
7249 -731 2357 -1386 -2333 -9998 -13777 -13981 -9327 -3712 -3465 -8021 -11563 -13117 -10656 2183 8678 5590
7233 5590 -398 -8294 -12415 -11746 -17449 -17938 -13922 -8659 -9502 -10163 -7320 -13040 -18170 -16073 -19443 -20739
7217 -20739 -16449 -12220 -12923 -16737 -11125 -10797 -6282 -4758 -13175 -17692 -13094 -7554 -3265 -6693 -12324
7202a2324L8o06Q38Q097J551j1497p590q228N841Q932L730l056Q34L695o338m707
7186b0790j75N915K179l2j111M252l422m391q08M113M024M642m292K729O381m33
7170a219O693k417j1264l522l18j785k071k804k109K051j755k262L719n84m851
7155b4498j316N490N691K824K641m109q379k960j321k025L850J612p28R69K607
7140a9652K347L113J31l448k064j300R176R485J668k998k527Q40J955k228K354
7125c148N414r40j0741n98j571J429l975J047Q830k720m10N100M434l229j0564
7110a1642M72k742m146k41P336M210r402J019M350L236P5M195P54j0363K419N53
7094i917j0974l539N5M67L457Q376P922J492l696k735j2320J975N414K914k418
$$ plain form
7202 -12324 -12286 -12892 -12054 -3957 -2406 -13903 -21493 -29721 -23880 -14948 -11218 -14274 -13440 -9745 -16083 -20790
7186 -20790 -20965 -15050 -12871 -12903 -14014 -9762 -13184 -17575 -18383 -14270 -10246 -5604 -9896 -7167 -786 -1219
7170 -1219 5474 3057 -8207 -11729 -12047 -13832 -15903 -18707 -20816 -18765 -20520 -22782 -19063 -19647 -24498
7155 -24498 -25814 -20324 -14633 -11809 -9168 -13277 -21656 -24616 -25937 -27962 -24112 -22500 -23228 -22259 -19652
7140 -19652 -17305 -14192 -14061 -17509 -19573 -20873 -11697 -2212 -544 -3542 -6069 -5229 -3274 -5502 -3148
7125 -3148 2266 1326 -9415 -10013 -11584 -10155 -14130 -13083 -4253 -6973 -7383 -2283 2151 -1078 -11642
7110 -11642 -11170 -13912 -18058 -18299 -10963 -6753 -16155 -15136 -10786 -7550 -7475 -3280 -2526 -12889 -10470 -9917
7094 -9917 -20891 -24430 -24375 -23908 -20451 -12075 -4153 -2661 -6357 -9092 -21412 -19437 -14023 -11109 -13527
7079a3527o913m449L39L708O793m552K833J16j338L111P89p88K46J0o820L760
7063a6682N632M725l028m10L031O739k351O87M367J372l661K147n427l601N100
7048a360K331n533K678L932q450Q49J469j775K119J978l357o604k484M326K129
7033g752j882J435M191l299M735J0423k408p245n867m393o01j339n991O396J2127
7018a470O068j922n729l720k253o037L091N863j849m25p879J312J702L297R54
7003h997K343l38p002l865L285L349p037N92j594j508K86K511o00N144N612o015
6987a3834n143K734N883P034O107n346n586j738k531m043k56R418P006Q54r92
6972d33q523n44l752j526k133M445M962j136J992m645p652N664Q577Q03q787k451
$$ plain form
7079 -13527 -20440 -24889 -24550 -20842 -14049 -18601 -15768 -15652 -16990 -13879 -13090 -13878 -13632 -13622 -20442 -16682
7063 -16682 -11050 -6325 -9353 -9763 -6732 7 -2344 -1657 2710 4082 421 2568 -2859 -6460 -1360
7048 -1360 971 -4562 -1884 2048 -6402 -5553 -4084 -5859 -3740 -1762 -5119 -11723 -14207 -9881 -7752
7033 -7752 -9634 -8199 -4008 -7307 -2572 7851 5443 -1802 -7669 -12062 -12663 -14002 -19993 -13597 -1470
7018 -1470 4598 2676 -3053 -6773 -9026 -15063 -11972 -6109 -7958 -8383 -16262 -14950 -13248 -9951 -8997
7003 -8997 -6654 -6992 -13994 -17859 -14574 -11225 -18262 -17670 -19264 -20772 -20486 -17975 -18575 -13431 -7819 -13834
6987 -13834 -18977 -16243 -10360 -3326 2781 -2565 -8151 -9889 -12420 -16463 -16719 -7301 -295 559 -433
6972 -433 -8956 -9500 -13252 -14778 -16911 -12466 -7504 -8640 -6648 -11293 -18945 -13281 -4704 -3901 -12688 -15139
6956a5139K659q151J854Q452Q933r11j561l638p172J335K84j21m20m380l836m900
6940b6712J2996P12o07m608K151O403k103n457O274k434p147k524L073J132J232
6925a7619k959j398K917M133q580O37J205J336Q724J471L075l27j623J52m117
6910a2973J840l786K378R039K362j426k850p268n429K533N558m319j39Q18k336
6895a5998L727J234J175j113l813m903l5k48K350N759L959j004j428Q6J746j507
6879a0013Q165L625k836n778N29N379o02k596K145K911j128m152o269k220j929
6864a4769L714O438J372j1104n835K758l26J15K966P259K409k432r57n658J191
6849a2859J251j531m761o19R120k975o908j916N609J902L128J331k965l247J466
$$ plain form
6956 -15139 -12480 -20631 -18777 -10325 -1392 -2303 -3864 -7502 -14674 -13339 -13055 -13176 -13596 -17976 -21812 -26712
6940 -26712 -13716 -13004 -13611 -18219 -16068 -9665 -11768 -17225 -10951 -13385 -20532 -23056 -19983 -18851 -17619
6925 -17619 -20578 -21976 -19059 -14926 -23506 -22869 -21664 -20328 -11604 -10133 -7058 -7385 -9008 -8856 -12973
6910 -12973 -11133 -14919 -12541 -3502 -1140 -2566 -5416 -12684 -18113 -15580 -10022 -14341 -14480 -13662 -15998
6895 -15998 -12271 -11037 -9862 -10975 -14788 -19691 -19726 -19974 -17624 -11865 -7906 -8910 -10338 -10252 -8506 -10013
6879 -10013 -1848 1777 -1059 -6837 -6308 -929 -1531 -4127 -1982 929 -199 -4351 -10620 -12840 -14769
6864 -14769 -11055 -4617 -3245 -14349 -20184 -17426 -17752 -17637 -14671 -7412 -5003 -7435 -8392 -14050 -12859
6849 -12859 -11608 -13139 -17900 -18519 -9399 -12374 -19282 -21198 -15589 -13687 -10559 -9228 -12193 -15440 -13974
6834a3974j202K91N712J447K822M118k269J316l989j70j792L738J903J027o956
6819g978k506l70J13K93M403j151J224K328p483l298O072N01j222r98N091K95
6803d686j021j380k288r90p318K243Q133J0004m405m786O77N74N24J083j515n001
6787a0152l056K486n16n393j49P804L24J360J953o005j436P864J38J57L074K725
6771A178q03k816n26j374m294O541m922o079m1L932J51q614J926O469J460j307
6755i119J557r78m06O15P228K956j758j0141k160L210j049N09l52O47K358k893
6739i776l176l26M206l939Q73M883k64r440J260R565P16m469J248J442k423n684
6723a5304m569L453O165K537K192P653M328q78q778k246o024J641J57Q4M025N635
$$ plain form
6834 -13974 -15176 -14885 -9173 -7726 -4904 -786 -3055 -1739 -5728 -5898 -7690 -3952 -2049 -1022 -7978
6819 -7978 -10484 -10854 -10741 -10448 -6045 -7196 -5972 -3644 -11127 -14425 -8353 -7852 -9074 -10072 -4981 -4686
6803 -4686 -5707 -7087 -9375 -10365 -17683 -15440 -7307 2697 -1708 -6494 -5817 -5243 -4719 -3636 -5151 -10152
6787 -10152 -13208 -10722 -11238 -16631 -16780 -8976 -8652 -7292 -5339 -11344 -12780 -4916 -4778 -4621 -1547 1178
6771 1178 375 -2441 -2967 -4341 -8635 -2094 -7016 -13095 -13136 -9204 -9053 -17667 -15741 -9272 -7812 -9119
6755 -9119 -7562 -8540 -8946 -8331 -1103 1853 95 -10046 -12206 -8996 -10045 -9536 -9888 -9241 -6883 -9776
6739 -9776 -12952 -13278 -9072 -13011 -12138 -7255 -7519 -16959 -15699 -6134 -5418 -9887 -8639 -7197 -9620 -15304
6723 -15304 -19873 -16420 -10255 -7718 -5526 2127 6455 5577 -3201 -5447 -11471 -9830 -9673 -9589 -5564 71
6707G1j047n099K141r44J191K36J825K746j019J112J78l77j406p060J653R549
6691C750L359l130q054k146N015J01l195o752J522r59N37k691L4L574J991N213
6675a831j541j184k793K441n464q016K44L277K167M736M24k997L791K890p574
6660a1430k870J813p309k056L090O556K516j323K176l2M73k67k675n54M757o088
6644a3223M494R066m454l213r85m731l184l007M876Q610n146o572K042L013L870
6629h544P75O917O52p923L907N433l038p109j926N312j921q62O740j550j900L635
6613a402M64l788l224M167m841k088K35J718P72R821l234l087L094l216k609K510
6597d708L624m803M225J610n579k967o111j972O543M908J476p31p227O34N918
$$ plain form
6707 71 -976 -6075 -3934 -4878 -3687 -3451 -1626 1120 101 1213 1391 1014 -392 -7452 -5799 3750
6691 3750 7109 3979 -4075 -6221 -1206 -1105 -4300 -11052 -9530 -10489 -9952 -12643 -12609 -9035 -7044 -1831
6675 -1831 -3372 -4556 -7349 -4908 -10372 -18388 -18144 -14867 -12700 -7964 -7540 -10537 -6746 -3856 -11430
6660 -11430 -14300 -12487 -19796 -21852 -18762 -12206 -9690 -11013 -8837 -8869 -8396 -8663 -11338 -11892 -7135 -13223
6644 -13223 -8729 337 -4117 -7330 -8315 -13046 -16230 -19237 -14361 -5751 -10897 -17469 -15427 -12414 -8544
6629 -8544 -7769 -852 -200 -8123 -4216 1217 -1821 -8930 -10856 -5544 -7465 -8327 -1587 -3137 -5037 -1402
6613 -1402 -938 -4726 -7950 -3783 -8624 -10712 -10477 -8759 -7987 1834 -1400 -4487 -1393 -4609 -7218 -4708
6597 -4708 -1084 -5887 -1662 -52 -5631 -8598 -14709 -16681 -10138 -5230 -3754 -4485 -11712 -11078 -5160
6582e160L444m323j0434K638N345N093l147j801N450J360j696m648M268J421k142
6567d332n299M306O30J815N004K644l428m785l207K99q144p719l03M934L318K14
6551a4053o91J447j665N141r2l002J194N120l048K858k86J9q1n4K245L478J486
6534A6J259p792l946N332Q093l188m696j140J625j732j60n34n82M203L973l048
6518b317k275l148J918M548q16o426O05k007o515j382l175J493K479L716M436
6503h866n953n936N23j066O719J969l609m148J1106Q511q49l581K440J970j084
6488a854m476l297n16K493L561O124O15N94J867K500o536r264l853K75P224M572
6472B9Q01j475l012M800k025m783J615L081O71o680O85m48j355L600M179J435
$$ plain form
6582 -5160 -1716 -6039 -16473 -13835 -8490 -3397 -6544 -8345 -2895 -1535 -3231 -7879 -3611 -2190 -4332
6567 -4332 -9631 -5325 -4695 -2880 2124 4768 1340 -3445 -6652 -6353 -14497 -22216 -22519 -17585 -14267 -14053
6551 -14053 -14744 -13297 -14962 -9821 -9913 -12915 -11721 -6601 -9649 -6791 -7077 -7058 -7139 -7193 -4948 -1470 16
6534 16 1275 -6517 -10463 -5131 2962 -226 -4922 -6062 -4437 -6169 -6329 -6863 -7445 -3242 731 -2317
6518 -2317 -4592 -7740 -5822 -1274 -2090 -8516 -7911 -9918 -16433 -17815 -20990 -19497 -17018 -13302 -8866
6503 -8866 -14819 -20755 -20232 -21298 -14579 -12610 -16219 -20367 -9261 -750 -1599 -5180 -2740 -770 -1854
6488 -1854 -6330 -9627 -10143 -7650 -4089 2035 2650 3244 5111 7611 1075 -8189 -12042 -11767 -4543 29
6472 29 830 -645 -3657 1143 -882 -5665 -4050 -969 -298 -6978 -6293 -6741 -8096 -4496 -317 1118
6456A118k756m827o29p02N27k985K943J090l270j72l577O48J0717R267L363o381
6440D374j1820o848O216Q627K097J44j341j115n258k587N373l390k29J08k663
6425h312N686N01l486l66k585p78n90L434L461n93k02K048j969o912m309K595
6409a2377m66J161Q389P058r058N712J0613l647k71Q138l117n417j590j55n314
6394c41o173K919L236J598J489M08n613R84P38p027l019k186J148R607l62N47
6378b047j180R42j877m607o987j761L633J170R521J702j78l662o470j0560L537
6363a8824Q062m250k364J070P541J836m263m77j012k083n730j790N571P003L165
6348f545m538p764L94O72K327L51L602Q544j881J541p14K941N245n042j493K060
$$ plain form
6456 1118 -1638 -6465 -7094 -7796 -7269 -10254 -7311 -6221 -9491 -9663 -13240 -12592 -1875 7392 10755 4374
6440 4374 -7446 -14294 -8078 549 2646 2790 1449 334 -4924 -7511 -2138 -5528 -5757 -5649 -8312
6425 -8312 -2626 -2125 -5611 -5977 -8562 -9340 -9930 -6496 -3035 -3628 -3830 -1782 -3751 -10663 -14972 -12377
6409 -12377 -12843 -11682 -3293 3765 -5293 419 11032 7385 7114 15252 12135 6718 5128 4973 -341
6394 -341 -6514 -3595 -359 1239 2728 3136 -2477 -1493 -755 -7782 -10801 -12987 -11839 -2232 -2594 -2047
6378 -2047 -3227 -2285 -4162 -8769 -15756 -17517 -13884 -12714 -3193 -1491 -1669 -5331 -11801 -22361 -18824
6363 -18824 -10762 -15012 -17376 -16306 -8765 -6929 -11192 -11669 -12681 -14764 -20494 -22284 -16713 -9710 -6545
6348 -6545 -11083 -18847 -18453 -17781 -15454 -15103 -11501 -2957 -4838 -3297 -4011 -1070 4175 -867 -2360 -300
6332c00R42r611m785L185J604Q77K094k465p060N875n992o712N392N218k381L080
6316a1039O380l395L11n56R5O995j633p890k017M280O590m550l607l477K028J0075
6300a410L358k267k971m006m372K576n276m403K362P098N332M387k586p148k023
6285a1349j380R552O992Q59j907m915k468M794j271k766l296J131j230L404K816
6270a034N548m63o20o326n43K846L06O139k630K06K116j550m194q986q795N636
6254a2344Q314K951p32l072K266r64L596M911J179l051q114k972P001j37j476
6239b644L123O17q716J820N545L105n154l556N368j375j099k462n996M668Q503
6224A747l563j033j2714m574M068M196r33j309j423k466j817J626L965j676K869
$$ plain form
6332 -300 642 -8969 -13754 -10569 -8965 -8088 -5994 -8459 -15519 -9644 -15636 -22348 -16956 -11738 -14119 -11039
6316 -11039 -4659 -8054 -7743 -8299 -8204 -1209 -2842 -10732 -12749 -8469 -1879 -6429 -10036 -13513 -11485 -1410
6300 -1410 1948 -319 -3290 -7296 -11668 -9092 -14368 -18771 -16409 -9311 -3979 408 -2178 -9326 -11349
6285 -11349 -12729 -3177 3815 4674 2767 -2148 -4616 178 -1093 -3859 -7155 -6024 -7254 -3850 -1034
6270 -1034 4514 4051 3431 -2895 -3438 -592 -286 5853 3223 3429 5545 3995 -199 -9185 -17980 -12344
6254 -12344 -4030 -1079 -1811 -4883 -2617 -3581 15 4926 6105 3054 -5060 -8032 -1031 -1168 -2644
6239 -2644 479 1096 -7620 -5800 -255 2850 -2304 -5860 -492 -1867 -2966 -5428 -11424 -6756 1747
6224 1747 -1816 -2849 -15563 -20137 -16069 -11873 -12806 -14115 -15538 -18004 -19821 -18195 -14230 -15906 -13037
6209a3037M560R41m073k678k343L47K48L744k535j431L714m45k831J904L42j908
6193a5481N387O261o645j408J89m62k11j464O174k059r376M571P080L57o761n71
6177a4419J0551M826k111k153q77L219O83m478m476j592J464l630m094m237M595
6162a6729M103l983J029K979O068L071n426k290k700j635L690J379j640M201K515
6147e368l600k308O50n015P165N953r46l701j459j878L765j723N58m051j466P11
6131a2713L072r042K447J523L147J1418m567o760L081p34q40J3356O396j1400
6117a616p787N524J693n866L3J200Q005L303J385o92m392j940n180k274K223K433
6101c948k575j996K654k843K256j213J0517K240j2228l596J5746L934r901m456
$$ plain form
6209 -13037 -8477 -7536 -11609 -14287 -16630 -16283 -16035 -12291 -14826 -16257 -12543 -12988 -15819 -13915 -13573 -15481
6193 -15481 -10094 -3833 -10478 -11886 -11697 -12159 -12370 -13834 -7660 -9719 -19095 -14524 -7444 -7087 -13848 -14419
6177 -14419 -3868 958 -1153 -3306 -4183 -964 -281 -4759 -9235 -10827 -9363 -12993 -17087 -21324 -16729
6162 -16729 -12626 -16609 -15580 -12601 -6533 -3462 -8888 -11178 -13878 -15513 -11823 -10444 -12084 -7883 -5368
6147 -5368 -8968 -11276 -10626 -15641 -8476 -2523 -3469 -7170 -8629 -10507 -6742 -8465 -7907 -11958 -13424 -12713
6131 -12713 -9641 -18683 -16236 -14713 -11566 -148 -4715 -11475 -8394 -9128 -9968 3388 9784 -1616
6117 -1616 -9403 -3879 -2186 -8052 -8019 -6819 1186 4489 5874 5182 790 -1150 -6330 -8604 -6381 -3948
6101 -3948 -6523 -8519 -5865 -8708 -6452 -7665 2852 5092 -7136 -10732 5014 8948 -953 -5409
6087e409l489J489p71m574k791Q72p121L820L859N37J794N141J953J543j619L501
6071a265L402k0K958P89n739j331Q75m644j338J105j848n137J735N694Q085M120
6055G441r18j0692R37K571K781l109J305J927j747j487J368k326j386o978O1k87
6039a0539J874m671J229Q448K391o277J446L280k628j506K712J506m90K044n208
6024f389n3L805J88l699l20J473j578L39j563L568M843j284L414R902k891q917
6008H38q10r641P147P566j0186m976M742L02j140n672p53l745n965J035j525K666
5992b0117Q260R351P631m534p202L836K27J640r985l27r97l309J993Q018N621
5977A06m082k140k292k197R7K734J287O837K784l995o058j507l715n298J917M428
$$ plain form
6087 -5409 -8898 -7409 -8180 -12754 -15545 -14673 -21794 -17974 -14115 -13578 -11784 -6643 -4690 -3147 -4766 -1265
6071 -1265 2137 2117 5075 5864 125 -1206 -331 -4975 -6313 -5208 -7056 -12193 -10458 -4764 3321 7441
6055 7441 6523 -4169 -3232 -661 2120 -989 316 2243 496 -991 377 -1949 -3335 -10313 -10252 -10539
6039 -10539 -8665 -13336 -12107 -3659 -1268 -7545 -6099 -2819 -5447 -6953 -4241 -2735 -3225 -1181 -6389
6024 -6389 -6442 -2637 -2449 -6148 -6468 -4995 -6573 -6234 -7797 -4229 614 -670 2744 12646 9755 838
6008 838 28 -9613 -2466 5100 -5086 -10062 -5320 -5018 -6158 -11830 -12583 -16328 -22293 -21258 -22783 -20117
5992 -20117 -11857 -2506 5125 591 -6611 -2775 -2548 -908 -10893 -11220 -12217 -15526 -13533 -5515 106
5977 106 -3976 -6116 -8408 -10605 -10508 -7774 -6487 350 3134 -861 -6919 -8426 -12141 -17439 -15522 -11094
5961a1094J2407P42q855J695Q70Q050M37r021q198m756N972J154o41O330R169
5946D261M940p904o433l360M75R058j367J243j577m896m864p755l904Q70N694
5931a5519K143j364k909j90N973O43k126M537L376L234J956K254m898m57O63n549
5915h233n276j482M438J1023K64P32J722j993m08k444j034n147p07N689p234n190
5899a5280K266M072%k940J798K624J448J579r772j620Q747J027j196j316M809
5884c754l195M881l226L214O488L666m398q52l909J196o80l469l112L122l54j702
5868f084j478q929k982J2407L04J212m40m829m421K761j388L209N504n384j428
5853a1966j411j537l01Q268R648N953m644k573n503n492m170K465k560j025K309
$$ plain form
5961 -11094 1313 2055 -6800 -5105 -4235 3815 4252 -4769 -12967 -17723 -11751 -10597 -11238 -4908 4261
5946 4261 9201 1297 -5136 -8496 -8021 1037 -330 913 -664 -5560 -10424 -18179 -22083 -21213 -15519
5931 -15519 -13376 -14740 -17649 -17839 -11866 -11223 -13349 -8812 -5436 -2202 -246 2008 -2890 -3347 -2684 -8233
5915 -8233 -13509 -14991 -10553 470 734 1466 3188 1195 787 -1657 -2691 -7838 -8545 -2856 -10090 -15280
5899 -15280 -13014 -8942 -8942 -11882 -10084 -7460 -6012 -4433 -14205 -15825 -7078 -6051 -7247 -8563 -3754
5884 -3754 -6949 -2068 -5294 -2080 4408 8074 3676 2824 -1085 111 -569 -4038 -7150 -4028 -4382 -6084
5868 -6084 -7562 -16491 -19473 -7066 -6762 -5550 -5990 -10819 -15240 -12479 -13867 -10658 -5154 -10538 -11966
5853 -11966 -13377 -14914 -15215 -6947 2701 8654 4010 1437 -4066 -9558 -13728 -11263 -13823 -14848 -12539
5838a2539r65O73O631n161m813L430J0672J2681K559j901o192m693j775l219N438
5823H26L17K055L033j592q012k854J120l092j353k741J512K877k695m47L015l085
5807a1116j306K433k07j738l556j52K163O319J539l155J875k376K655L563L660
5792F01M97k234K486M577O94q289n707P95K354k988M55L973K752L555n239m402
5776f120J43k148o68K513Q75M275P172J051k320j0066l894k409M031R71l002J74
5760i422P010L495L07m032o645l196L403L317O460J365N363r81l276J153k015
5745B306j976o175j276l279l478l596N053M730O21M371n176m392Q67J2588N128
5730F316m02j662p27n718l74l091j662Q200J850n458p501O95K672J798J452L321
$$ plain form
5838 -12539 -13504 -12831 -6200 -11361 -16174 -12744 -2072 10609 13168 11267 5075 382 -1393 -4612 826
5823 826 1143 3198 6231 4639 -3373 -6227 -5107 -8199 -9552 -12293 -10781 -7904 -10599 -11046 -8031 -11116
5807 -11116 -12422 -9989 -10196 -11934 -15490 -15642 -13479 -7160 -5621 -8776 -6901 -9277 -6622 -3059 601
5792 601 1098 -1136 1350 5927 6621 -1668 -7375 -6580 -4226 -7214 -6759 -2786 -34 3521 -1718 -6120
5776 -6120 -5977 -8125 -8793 -6280 -5405 -1130 6042 7093 4773 -5293 -9187 -11596 -7565 -6594 -9596 -9422
5760 -9422 -2412 1083 1390 -2642 -9287 -12483 -9080 -5763 697 2062 7425 6444 3168 4321 2306
5745 2306 330 -5845 -7121 -10400 -13878 -17474 -12421 -7691 -7070 -2699 -7875 -12267 -11400 1188 6316
5730 6316 5914 4252 3525 -2193 -2567 -5658 -7320 880 2730 -2728 -10229 -9534 -6862 -5064 -3612 -291
5714b91J320p393k089n95l169R45k702p3L771R359K678q50K352o529m948M705
5698c509L75r09j416M996m126L211k810J610L944m790P96J708m160o21N258R691
5682I248j731n754n192J966O502M670o580r160N411N84j160J5k691m251m383O79
5666a1827N256K736P561L882J702m663n703j0011L822O826K354k89J013k256M335
5651D738k574o361L022q3o457L95N933k798L553N865r530p997n92N95J5796N418
5635H923r913n247R027K3l778J160P777l903q251m358l846K572K674N07r23m263
5619a1819m118m956M299J5318L752o683q211j999M289M525J613l870k181j270
5605a1311P0P676N300m515p559M974M518N270M360p32j2345p812L708O204M784
$$ plain form
5714 -291 1029 -6364 -8453 -9048 -12217 -11272 -13974 -14047 -10276 -917 1761 911 3263 -3266 -8214 -3509
5698 -3509 -3134 -4043 -5459 -463 -4589 -1378 -4188 -2578 1366 -3424 -2628 -920 -5080 -5701 -443 9248
5682 9248 7517 1763 -3429 -1463 5039 9709 3129 -6031 -620 -36 -1196 -1181 -3872 -8123 -12506 -11827
5666 -11827 -6571 -3835 3726 7608 9310 4647 -1056 -11067 -7245 -419 1935 1646 2659 403 4738
5651 4738 2164 -4197 -1175 -1258 -7715 -7320 -1387 -4185 -632 5233 -4297 -12294 -12886 -12291 3505 8923
5635 8923 -990 -6237 2790 2813 -965 195 7972 4069 -4182 -8540 -12386 -9814 -7140 -6633 -7556 -11819
5619 -11819 -15937 -20893 -16594 -1276 2476 -4207 -12418 -14417 -10128 -5603 -3990 -7860 -10041 -11311
5605 -11311 -11241 -3565 1735 -2780 -10339 -5365 -847 4423 8783 8051 -4294 -12106 -8398 -2194 2590
5590B590J0617l969q541p020l952K042M704R897M339o937L631k064p31p229K152
5575d71n20n305N689L979p409k975O788K910L680m18p74R80m625q35j746m591
5559e643p6n17j438k426J834K706M364J951j353K561J047k018l998q671K393N142
5543d142O060L9n901n292J875L791J770k446l303j611m516N354K473Q86M069N308
5527D414m101k523k858O833l807n38N579O201p168r221k792J757l043K829L038
5512e400j292m662l772J0548R826J49p632n926K263O806K616K532l111J433m98
5497C880M475O494n782n315m329l988j280k788o504K109Q609J684o151J130N10
5482g246k243j46J030J4124N543k629j789j853J476n250m222m09j046o075o159
$$ plain form
5590 2590 13207 9238 697 -6323 -10275 -8233 -3529 6368 10707 3770 7401 5337 4606 -2623 -471
5575 -471 -991 -6296 -607 3372 -4037 -7012 -224 2686 6366 5948 5174 6154 1529 694 -1052 -5643
5559 -5643 -5719 -6236 -7674 -10100 -8266 -5560 -1196 755 -598 1963 3010 992 -3006 -11677 -9284 -4142
5543 -4142 1918 1957 -3944 -9236 -7361 -3570 -1800 -4246 -7549 -9160 -13676 -8322 -5849 -4963 -894 4414
5527 4414 313 -2210 -5068 1765 -2042 -2580 2999 9200 2032 -7189 -9981 -8224 -11267 -8438 -5400
5512 -5400 -6692 -11354 -15126 -4578 5248 5397 -2235 -8161 -5898 908 3524 6056 2945 4378 3880
5497 3880 8355 14849 9067 3752 -577 -4565 -5845 -8633 -15137 -13028 -4419 -2735 -8886 -7756 -7246
5482 -7246 -9489 -9635 -8605 5519 11062 8433 6644 4791 6267 1017 -3205 -3614 -4660 -10735 -16894
5467a6894L688L775Q092O798o36m248q21p762K457j704P432k642j329Q780P457
5452A2443l430l257m040l606J245J881l00l146o135n13J345Q313m945n177k556
5437a1878O070K284J0776N252k170J297L691n808p542o357p24M513M911P583Q317
5422B0215k784k793n739n261m372p7Q026j46l461m105j672P68k161j735J184j638
5406e751J965r94J418J038O6J744k692M766J230k537j477N10q507L157Q977l327
5390d14k58O020J917o867m274j864O035K235j942O008Q49j0207j837N00K552k390
5374c937j424J098N995L030k019j907l257j796r27K356L152Q410J046j233l831
5359D756M58l292J907k433k327o33J332m274M149N617K697L239L422m260n928
$$ plain form
5467 -16894 -13206 -9431 -1339 5459 4823 575 -246 -8008 -5551 -7255 177 -2465 -3794 4986 12443
5452 12443 9013 5756 1716 -1890 -645 1236 936 -2210 -8345 -8858 -7513 800 -4145 -9322 -11878
5437 -11878 -5808 -3524 7252 12504 10334 11631 15322 9514 1972 -4385 -5109 -596 4315 11898 20215
5422 20215 17431 14638 8899 3638 -734 -811 7215 7069 3608 -497 -2169 -1401 -3562 -5297 -4113 -5751
5406 -5751 -3786 -4780 -3362 -2324 -2258 -514 -3206 1560 2790 253 -1224 -714 -9221 -6064 2913 -414
5390 -414 -672 5348 7265 398 -3876 -5740 295 2530 588 6596 7445 -2762 -4599 -4099 -1547 -3937
5374 -3937 -5361 -4263 1732 4762 2743 836 -2421 -4217 -5144 -2788 364 8774 9820 8587 4756
5359 4756 5214 1922 3829 1396 -931 -1564 -232 -4506 -357 5260 7957 11196 14618 10358 4430
5344D430m557l123R55k795JL992K990k618o208n056j506J564l850K221N012K918
5328e630N159R550m026q360O750L00m943m713M032J462p96n236o046o75R206P55
5312c211q130n887J1525R279J945k150j101P96l658J676k904o066j028k702K735
5297h881N048n271J99P250Q46m151m552P932L042m584j619K70K565K860k91M47
5281A110L54Q11n00O778L976j0099j2062K916K581j68K327k676L539k658J948
5266a823K417l838K060K479J403l329M098K612l749j802n435l244M469N616N932
5251G866k001J796P095Q32m029k262l140n935j333J242M12J516O872K407K209
5236A3547j119m581k484n660J788l627k358k738K259J401M807L238o795k493l424
$$ plain form
5344 4430 -127 -3250 -2295 -5090 -5089 -1097 1893 -725 -6933 -11989 -13495 -11931 -15781 -13560 -8548 -5630
5328 -5630 -471 9079 5053 -3307 3443 3743 -1200 -5913 -1881 -419 -1215 -6451 -12497 -13172 -3966 -3211
5312 -3211 -11341 -17228 -5703 3576 5521 3371 2270 3066 -592 1084 -1820 -7886 -8914 -11616 -8881
5297 -8881 -3833 -9104 -8905 -1655 -809 -4960 -9512 -1580 1462 -3122 -4741 -4471 -1906 954 663 1110
5281 1110 1464 2275 1775 8553 12529 2430 -9632 -6716 -4135 -4303 -1976 -4652 -1113 -3771 -1823
5266 -1823 594 -3244 -1184 1295 2698 -631 3467 6079 2330 528 -4907 -8151 -3682 1934 7866
5251 7866 5865 7661 14756 15588 11559 9297 6157 222 -1111 131 543 2059 8931 11338 13547
5236 13547 12428 7847 5363 -297 1491 -2136 -4494 -7232 -4973 -3572 1235 4473 -2322 -4815 -8239
5221h239J014K299m823n350R978J0509p788l976l47J278n9J045M25O133J954m298
5205b45n561j772J944m094r160P610L155K358n704K267O203L257r09m24P480Q451
5189A4856N383l229j237j697o941o684l027M413l678l53M525j953K54M809P924
5174A3365K746p081q913p217j001M44K746N335J939K961K580l516l82n439j338
5159b771J037o294q958l9k718J2692J4213q48M076p449m567M044m270P660N948
5144A1756l543j018l02j068n160k610Q286j507k871j43m41R7m15L466P42l93l120
5127A756P7J09o0j689m453n897K430L678j650O873N907l156K153q65k464n69J425
5110C605q138k503J196L087K986M6J556k224p635q86L618l116K436P488k531p16
$$ plain form
5221 -8239 -7225 -4926 -9749 -15099 -5121 5388 -2400 -6376 -6723 -5445 -5504 -4459 -4034 2099 4053 -245
5205 -245 -5806 -7578 -5634 -9728 -18888 -11278 -8123 -5765 -11469 -9202 -2999 258 -651 -1075 6405 14856
5189 14856 20239 17010 15773 14076 7135 451 -2576 1837 -1841 -2194 2331 378 632 5441 13365
5174 13365 16111 9030 117 -7100 -8101 -7657 -4911 424 2363 5324 7904 4388 4006 -1433 -2771
5159 -2771 -1734 -8028 -16986 -17025 -19743 -7051 7162 6314 10390 2941 -1626 2418 -1852 5808 11756
5144 11756 8213 7195 6893 5825 665 -1945 6341 4834 1963 1820 1379 1476 1061 4527 5269 4876 1756
5127 1756 1833 1942 1882 193 -4260 -10157 -7727 -4049 -5699 1174 7081 3925 6078 5213 2749 2180 3605
5110 3605 -4533 -7036 -5840 -2753 233 279 1835 -389 -8024 -8910 -5292 -8408 -5972 1516 -1015 -1731
5094a731J497K587L57m274l80N35P92J62q05n149m530j346N138N246R860p361
5078E98n348K512O510k048m767M009L255k624K715J883k250J202m446k791L501
5063A911m353L792K882m13N893r39l625M342m131p013K630M492l538K088p15J136
5047D439J855k857P39O21k024p302J772M537j664K760M384m837n052K105L861
5032C337M222j195j2028l27L901M318l917J919N004m227m652l469N132O431L10
5017D759j083l345p76K703l22q27j609M49j690J505N242J428L595L390n954m143
5001C322P05l062l009L79N804Q026K44O86L73o903p731k362N21L496k672J83J926
4984g4R81j345m011J506K593L998j689j667N40O454l46l031l654k573k604J52
$$ plain form
5094 -1731 -234 2353 2710 -1564 -1944 -1409 -617 -455 -1260 -6409 -10939 -12285 -7147 -1901 7959 598
5078 598 -4750 -2238 4272 2224 -2543 1466 4721 2097 4812 6695 4445 5647 1201 -1590 1911
5063 1911 -2442 1350 4232 3819 9712 8773 5148 9490 5359 -1654 976 5468 1930 4018 3303 4439
5047 4439 6294 3437 4176 4797 2773 -4529 -2757 1780 116 2876 7260 2423 -2629 -524 3337
5032 3337 7559 6364 -5664 -5991 -2090 2228 -1689 230 5234 1007 -3645 -7114 -1982 4449 4759
5017 4759 3676 331 -445 2258 1936 1109 -500 -51 -1741 -236 5006 6434 10029 13419 7465 3322
5001 3322 4027 965 -2044 -1665 4139 12165 12409 13095 13468 6565 -1166 -3528 -3007 489 -2183 -2000 -74
4984 -74 907 -438 -4449 -2943 -350 3648 1959 292 832 7286 6940 3909 255 -2318 -4922 -4770
4968d770O16L725q4l467l776L281L703k953J756J473o058J128n59J841K599l14
4952a859M226P694k115n73j064l225m198n146K711L170l445o314O771P233j342
4937B524q056j224R087L864j94k775n679n351m74K809R99K563L42j768k66J196
4921b403N004n70K861n228k364m089K44k709K503Q822M68o432N284n9l477j401
4905c546N872Q614N413j515o749k665O586n852l749k810O414M289q222k877P44
4890e3R02J59R97k377l195k721n607M374p916o56K08j901O179J924j757k552o40
4873a4632N72K918n93N099K144Q87j304O789j534j704M436L946n198n003m474
4858g651N385M114M640m622r101j809O502M568P25N764K062j300l028j019k899
$$ plain form
4968 -4770 -4154 -429 -513 -3980 -7756 -4475 -772 -3725 -1969 -496 -6554 -5426 -5985 -4144 -1545 -1859
4952 -1859 2367 10061 7946 7373 6309 3084 -1114 -6260 -3549 -379 -3824 -10138 -3367 3866 2524
4937 2524 -5532 -6756 2331 6195 6001 3226 -2453 -7804 -8278 -5469 -4470 -1907 -1565 -3333 -3599 -2403
4921 -2403 2601 2031 4892 -336 -2700 -6789 -6545 -9254 -6751 2071 2539 -3893 1391 1332 -2145 -3546
4905 -3546 2326 10940 16353 14838 8089 5424 12010 6158 2409 -401 6013 10302 2080 -797 -53
4890 -53 849 1008 2005 -372 -3567 -6288 -11895 -7521 -15437 -16093 -15885 -17786 -11607 -9683 -11440 -13992 -14632
4873 -14632 -14060 -11142 -11735 -6636 -4492 -3605 -4909 1880 346 -1358 3078 7024 1826 -3177 -7651
4858 -7651 -2266 1848 6488 1866 -7235 -9044 -2542 2026 2751 8515 10577 9277 6249 5230 2331
4843B331j922j227m106k092K436L999M655q22M400K461k930n571o562L216j275
4828c009j365L078Q53j251o02L780P716m626j595J325l644q378k064j205j146
4813a2133j674P760P820j017n252J310M740M318k658k834m707m236l919M119N767
4798b596m96K609R097j246m674J4k957R246q34o692l769l1J234O091l756K775
4782D015R199n379o27j548q891l478N796P170n977r06J053j382j011K661J296
4767A991J749n63o18j651n17J577l299K946J245l897N098L20r17l332L803L318
4751G253L23n428j913j145J437n157N155K833l561m711L736O203l948o688l938
4736i549M615P776K223m379N727P686o087k756j285j874j043R153j794n698N160
$$ plain form
4843 2331 409 -818 -4924 -7016 -4580 -581 4074 3252 7652 10113 7183 1612 -4950 -1734 -3009
4828 -3009 -4374 -1296 -443 -1694 -2296 1484 9200 4574 2979 4304 660 -7718 -9782 -10987 -12133
4813 -12133 -13807 -6047 1773 756 -4496 -3186 1554 5872 3214 380 -4327 -8563 -12482 -8363 -2596
4798 -2596 -3092 -483 8614 7368 2694 2708 -249 8997 8163 1471 -2298 -2329 -1095 4996 1240 4015
4782 4015 13214 7835 7208 5660 -3231 -6709 -913 6257 280 -626 427 -955 -1966 695 1991
4767 1991 3740 3177 2559 908 391 1968 -1331 1615 2860 -1037 4061 4381 3464 132 3935 7253
4751 7253 7576 2148 235 -910 527 -4630 525 3358 -203 -4914 -1178 5025 1077 -5611 -9549
4736 -9549 -4934 2842 5065 686 6413 14099 8012 5256 3971 2097 1054 10207 8413 2715 7875
4721G875j443q965l449N88j760J749M323l652j099M298J835j347K63K014K805
4706D035K107p586q937J806J903L464J657L53o092j035O752N190K172n41M344
4691I592M768m365m270J224J195k587J386m363l037k052k657k949J419L833J568
4676a295J961m755k537P644O148K86L079J443n68o019m071r140l880K00j774K149
4660a1129k675L178P726M712M317j035l59k321P50L340k014n042k026L998L361
4645D781N814j239k866L170P049K797k375m652o67n206k005m977k006M021L929
4630E568P16K490M060o360J084J151p093p50m437o291L842J535K15L871O653M648
4614A0902k657J340l951J581K156l438K027k567j664k480l622k26l57P604L32
$$ plain form
4721 7875 6432 -2533 -5982 -5394 -7154 -5405 -1082 -4734 -5833 -1535 300 -1047 -784 1230 4035
4706 4035 6142 -1444 -10381 -8575 -6672 -3208 -1551 -1198 -7290 -8325 -1573 3617 5789 5248 9592
4691 9592 14360 9995 5725 6949 8144 5557 6943 2580 -457 -2509 -5166 -8115 -6696 -2863 -1295
4676 -1295 666 -4089 -6626 1018 7166 7452 10531 11974 11406 5387 1316 -7824 -11704 -11504 -13278 -11129
4660 -11129 -13804 -10626 -2900 1812 6129 5094 4735 2414 3164 6504 4490 -552 -2578 1420 4781
4645 4781 10595 9356 6490 9660 16709 19506 17131 12479 11812 6606 4601 -376 -2382 1639 5568
4630 5568 6284 8774 12834 6474 7558 8709 1616 866 -3571 -9862 -6020 -4485 -4270 -399 6254 10902
4614 10902 8245 9585 5634 7215 9371 5933 7960 5393 3729 1249 -2373 -2599 -2956 4648 4980
4599D980j412n611l613j208J98Q092M179m472N402P008l369j0439j30P949K936
4584A0490N523p43q998o354m045j827M562M449k433O97M231J565j194k033N627
4569I517j791M74m864j286j393j658j070O47p83j087k644M199K583M524L8k531
4553B875N58J47j142k908j015J410p669j133M058R082M317j87n267l701M75n444
4537e544J563L048O684M540l185m040o095K93N109l010k044K224k36M101j855
4522A553o043K015N168M062L76K902p128m016L759L025l142k327N32k538K253
4507D51l375m823O173l390j273J0489k055k623Q974M008m287q409M352N128P67
4492A0107j93o383l487K673l34n264l777J523M156L351J484j943j2401l595m56
$$ plain form
4599 4980 3568 -2043 -5656 -6864 -6666 1426 5605 1133 6535 13543 10174 -265 -395 7554 10490
4584 10490 16013 15270 6272 -82 -4127 -5954 -1392 3057 624 1321 5552 7117 5923 3890 9517
4569 9517 7726 8200 3336 2050 657 -1001 -2071 -1424 -2207 -3294 -5938 -1739 844 5368 5406 2875
4553 2875 3433 3580 2438 -470 -1485 -75 -7744 -8877 -4819 4263 8580 8393 3126 -575 -100 -5544
4537 -5544 -3981 -933 5751 10291 7106 3066 -3029 -2736 2373 -637 -2681 -457 -693 3408 1553
4522 1553 -4490 -2475 2693 6755 7131 10033 2905 -1111 2648 5673 2531 204 736 -1802 451
4507 451 -2924 -7747 -1574 -4964 -6237 4252 2197 -426 8548 12556 8269 -140 4212 9340 10107
4492 10107 9914 3531 44 2717 2383 -2881 -6658 -5135 -979 2372 3856 1913 -10488 -14083 -14539
4477a4539N074O656l40r04l104R47M11j573P854J19l515j876K00k143J196R073
4461C536M733p910o205J039l376l46K863K803j91l606K043L782j074j442k625
4446e976Q54j012K672m905L470L415J107J857J568K550k119j879K025M224l814
4431D037q90P721J262m008o183K785k094J293K939l193k056o464o204K035J3498
4416D478q0N514O823r020j2410J005J013k698q31N491J161J865k156j083J24r21
4400a725O728j310l823n90j739J544M921N24K751M019o123j962J039j274k25N280
4384H035K607K475K083M053q046o666k910J655r90k531l61K922n52J458M89p926
4368d205m667N270J3785O541o017o463l210m358l608p434L21K675J515K126j559
$$ plain form
4477 -14539 -9465 -2809 -3149 -4053 -7157 -6210 -5799 -7372 482 601 -2914 -4790 -4590 -6733 -5537 3536
4461 3536 8269 359 -5846 -4807 -8183 -8529 -5666 -2863 -3054 -6660 -4617 -835 -1909 -3351 -5976
4446 -5976 -5122 -6134 -3462 -8367 -4897 -1482 -375 1482 3050 5600 3481 1602 3627 7851 4037
4431 4037 3147 10868 12130 8122 1939 4724 2630 3923 6862 3669 1613 -4851 -11055 -9020 4478
4416 4478 4398 9912 16735 7715 -4695 -3690 -2677 -5375 -6206 -715 446 2311 155 -928 -804 -1725
4400 -1725 5003 3693 -130 -720 -2459 -915 4006 4530 7281 11300 5177 3215 4254 2980 2755 8035
4384 8035 10642 13117 15200 19253 11207 4541 1631 3286 2296 -235 -596 2326 1774 3232 3721 -4205
4368 -4205 -8872 -3602 10183 16724 10707 4244 1034 -3324 -6932 -14366 -14045 -11370 -9855 -7729 -9288
4353i288K822Q955J521j0489o374L310O506q60K057K333L712J193p621n121N501
4338a843M539o13M189k943m025j337K715l5J496l015j81m898K52J253O744M87
4322B785M70l739K711K063k781j766m541k573j59k688J678N275R37k551L793Q451
4306G365j903j097o258q80k996j416k374k500J64N192J598K31N544O007P459j10
4290A4026j4795r572l40O106Q341M314M56Q702R760p504l107m124O90q469K303
4275F787L028p798J793K334j474p339l374m33L883R424R02M8M699J878m446j099
4259H813n2M52m81K284J68L415j041k248l269l17M139n359n101K562o76K542J864
4242G695J682l399q313P142R965p26m180n195N352l845k203L56p6L409J445m185
$$ plain form
4353 -9288 -6466 2489 4010 -6479 -12853 -9543 -3037 -3897 -1840 493 4205 5398 -2223 -7344 -1843
4338 -1843 2696 2083 6272 3329 -696 -2033 682 647 2143 -872 -1053 -5951 -5699 -4446 2298 2785
4322 2785 3255 -484 2227 4290 1509 -257 -4798 -7371 -7530 -10218 -8540 -3265 -2328 -4879 -1086 7365
4306 7365 5462 4365 -1893 -2773 -5769 -7185 -9559 -12059 -11895 -6703 -5105 -4874 670 6677 14136 14026
4290 14026 -769 -10341 -10681 -4575 3766 8080 8536 17238 26998 19494 16387 12263 12953 4484 6787
4275 6787 9815 2017 3810 6144 4670 -2669 -6043 -6476 -2593 6831 7733 7781 12480 14358 9912 8813
4259 8813 8761 9213 8732 11016 11184 14599 13558 11310 8041 7724 11863 6504 1403 3965 3289 5831 7695
4242 7695 9377 5978 -2335 4807 14772 14046 9866 4671 10023 6178 3975 4331 4255 7664 9109 4924
4226D924k297M390M485J811n226j664k455o227l755J3081J3737n224l512r098
4212B970k999N85P549J112n316k419K043j839K722N393J090j788k451j230J464
4197F886j90n892n620K726O248n52j164m731o631J395L748J669L082Q75P77j759
4181H67j00J381M067K440k82Q428j333q636p760k413l257J256J2934O61k995p417
4165b159J146R743N126j209p538l254n412O316M097J2181M395j2767p472M433
4151G626P167K833m783p539l180n81M614n8l747l835k316q67M41M886J792J903
4135D356N27j178m218R53Q24O631N784k466k006m650m336o892o15N628O748K271
4119G361K107r183k660k696n571r75P616P799k849n507k443M333L228Q033M22
$$ plain form
4226 4924 2627 7017 11502 13313 8087 6423 3968 -2259 -6014 7067 20804 15580 12068 2970
4212 2970 -29 556 8105 9217 3901 1482 3525 1686 4408 9801 10891 9103 6652 5422 6886
4197 6886 6696 804 -4816 -2090 4158 3606 2442 -2289 -8920 -7525 -3777 -2108 974 1849 2626 867
4181 867 767 2148 6215 8655 8373 16801 15468 6832 -928 -3341 -6598 -5342 7592 8253 5258 -2159
4165 -2159 -1013 8730 13856 12647 5109 1855 -3557 2759 6856 19037 23432 10665 3193 7626
4151 7626 14793 17626 12843 5304 2124 1543 6157 6099 2352 -1483 -3799 -4666 -4225 661 2453 4356
4135 4356 4883 3705 -513 440 1264 7895 13679 11213 9207 4557 221 -6671 -7286 -1658 5090 7361
4119 7361 9468 285 -2375 -5071 -10642 -11617 -4001 3798 949 -4558 -7001 -2668 560 8593 9015
4104I015o049L275O359j429j043l550M90K243j770J25m21K448m863l824k622J540
4088g6L425Q794m425p997l892j21L245M915J951m616J380L50q637J057J677J407
4072a563k10J761P098J0738m709p964Q54j0153N80r88j291j507J618l42K641Q900
4056E463j692n367M27m89O710j937m065k502P80m144J929Q829l851j742L281N718
4040G348O17n335o275l329J185J733K010J089R262M562J957k109r72n229j825
4025D689j018m68n96m742m366L332r079q292J139J0676Q765P174n40p479o314
4010g119J626l147K718N023O866j572M681O474J622j723n999q803K438K297k56
3995E126J8p565k440l94L456M378o877L653K253M268K046p44k188J233J518l157
$$ plain form
4104 9015 2966 6241 12600 11171 10128 6578 7068 9311 7541 7666 7245 9693 4830 1006 -1616 -76
4088 -76 3349 12143 7718 -279 -4171 -4292 -1047 3868 5819 1203 2583 2933 -5704 -4647 -2970 -1563
4072 -1563 -1773 -12 7086 17824 13115 5151 6005 -4148 -3568 -4556 -5847 -7354 -5736 -6078 -3437 5463
4056 5463 3771 -1596 -1169 -1658 5052 3115 -950 -3452 -2672 -6816 -4887 3942 91 -1651 1630 7348
4040 7348 7965 2630 -3645 -6974 -5789 -4056 -2046 -957 8305 12867 14824 12715 11743 6514 4689
4025 4689 3671 3203 2607 -2135 -6501 -3169 -12248 -20540 -19401 -8725 40 7214 6674 -805 -7119
4010 -7119 -5493 -8640 -5922 -899 5967 4395 9076 15550 17172 15449 9450 647 3085 5382 5126
3995 5126 5144 -2421 -4861 -5255 -1799 2579 -4298 -645 1608 5876 7922 7178 4990 6223 7741 4584
3979D584j119K714n33J493M58l961l757o468m249n746j024l6M130O892M880j406
3963c148o615J663J130j376L81N822r03r72k961P76N795R619O225p218n178J53
3947C193L848k1j292R79l698m205M051L195M441j40L33l440j974q149J192J070
3931f17p34Q944n777l032M795M232K099L166P79j217r58M08j759r292m276Q471
3915E232L797j321m085O90K664l517j2232N700R092n2j279k631O421l844n429
3900g94j342L582K564n712J109P663l743P337l162k047q10J095J982j111Q12O43
3884H066L328j705n148n385K506J608m20j938j487p11l991k230L27M649L565m379
3868c345j946M427J82N368J95l004R88J642l46l515N821J170r86k865M76p23n187
$$ plain form
3979 4584 3465 6179 5646 7139 7597 3636 -121 -6589 -10838 -16584 -17608 -17644 -13514 -6622 -1742 -3148
3963 -3148 -9763 -8100 -6970 -8346 -7965 -2143 -3046 -4018 -6979 -6203 -408 9211 15436 8218 3040 3193
3947 3193 7041 7020 5728 6707 3009 -1196 2855 6050 10491 10351 10684 7244 5270 -2879 -1687 -617
3931 -617 -1351 7593 1816 -1216 3579 7811 9910 13076 13855 12638 11680 12088 10329 1037 -3239 5232
3915 5232 9029 7708 3623 4313 6977 3460 -8772 -3072 6020 5968 4689 2058 8479 4635 -794
3900 -794 -2136 1446 4010 -1702 -593 7070 3327 10664 7502 5455 4645 5740 7722 6611 7423 8066
3884 8066 11394 9689 4541 -844 1662 3270 2850 912 -575 -1286 -5277 -7507 -7180 -2531 1034 -3345
3868 -3345 -5291 -864 -682 4686 4881 1877 2865 4507 4161 646 6467 7637 6651 3786 4262 3539 -1648
3851a648L038O676K661J566k23n917m490L755R49M92l74j2478n950M725j861J538
3835g541N233J633l836M026P36l43K117J597j683L36K127m301n334j061N042l028
3819d280j179K425M448N11J285p97r57m103Q28J852l832l323M203J683M493K826
3803F083n41m400K258L866L096j153j550j399q98L267L036P12j1294n378Q822
3788D527L330j850l356l460N689l827n268O14O584O608o09m416p90J318l06j839
3772B949j902J037k741p697R638Q374n359J986N247l586Q82K471n689M177o817
3757B970j807L776N779O916n842j3528n28m30J177N119P792K109l578m101Q710
3742A4534J914q083m063o331K22O596k716o404O249J237M430K197n986J805M799
$$ plain form
3851 -1648 1390 8066 10727 12293 12070 6153 1663 5418 6367 6859 6485 -5993 -11943 -7218 -9079 -7541
3835 -7541 -2308 -675 -4511 -485 251 -92 2025 3622 1939 2275 4402 101 -5233 -6294 -1252 -4280
3819 -4280 -5459 -3034 1414 1925 3210 2413 1456 -2647 -1819 33 -3799 -7122 -2919 -1236 3257 6083
3803 6083 5542 1142 3400 7266 10362 9209 7659 6260 5362 8629 11665 12377 1083 -4295 4527
3788 4527 7857 6007 2651 -809 4880 1053 -4215 -3601 2983 9591 8982 4566 3776 5094 4788 2949
3772 2949 1047 2084 -657 -8354 1284 9658 4299 6285 11532 7946 8828 11299 5610 9787 2970
3757 2970 1163 4939 10718 17634 11792 -1736 -2264 -2694 -1517 3602 11394 13503 9925 5824 14534
3742 14534 16448 8365 4302 -2029 -1807 4789 2073 -4331 1918 3155 7585 9782 3796 5601 10400
3727A0400M819o927o903K536K076j2616L10N506N639J58p699l174k904K650P293
3712A164k608p0P401m657m10M751K150M34k28o348n734r776p578L196J0806R513
3696B006J1647J293k37k360m586Q383O123k911o940n123j740J823L503l214Q0
3681G747l033j171p3p4K499K783m047l923n636l372m72k251j092L723o00L619
3665e373J276L105J375p76K834p052k45J1014J0197l64o896n033r75J169J310
3650E566p201q627N13J326q58N491k906k001kO752R230L645q024o021K290m078
3634d905n385L965L344m445j445p86n56l963O250P103P387k769m871R11M697o559
3618b027p121Q424M561L75J538K58j711K407k982j853L484J694j256m289n810
$$ plain form
3727 10400 15219 8292 1389 3925 6001 -6615 -6305 -799 4840 4998 -2701 -5875 -8779 -6129 1164
3712 1164 -1444 -1514 5887 1230 820 5571 7721 8155 7927 1579 -4155 -13931 -21509 -18313 -7507 2006
3696 2006 13653 14946 14709 12349 7763 16146 22269 19358 12418 7295 5555 7378 10881 7667 7747
3681 7747 4714 3543 3470 3396 5895 8678 4631 708 -4928 -8300 -8772 -11023 -12115 -8392 -8992 -5373
3665 -5373 -4097 -992 383 -393 2441 -4611 -4856 6158 16355 15991 9095 4062 3087 4256 5566
3650 5566 -1635 -10262 -9749 -8423 -9281 -3790 -6696 -8697 -8699 -1947 7283 10928 2904 -3117 -827 -4905
3634 -4905 -10290 -6325 -2981 -7426 -8871 -9657 -10213 -14176 -7926 -823 6564 3795 -1076 -165 4532 -2027
3618 -2027 -9148 -724 3837 4212 5750 6008 4297 6704 3722 1869 5353 7047 5791 1502 -4308
3603d308n426Q830P380j893M85M64l475o061l956Q49M764N02j14k520P554j439
3587A636M44J217m608k988Q24L304k65m289N198P9l712n317l007m44J909K204
3571g815L375J40o269m664R453l294M980J70L756O102n08M39N762Q40r963o130
3555c626K523J2384K334n315M54J07l590K190o322o373J945J780j918M088J917
3540B578p859k814J236m343L18N328J0786l342o018J1101K431p019N89K918j199
3525D691n960p428m171O951P506J006K290L326K490o633l775O465N875M381M656
3510B1670n299j1176n961k915J973M632N374K75k641m257k766O033K082J257l154
3495E127o090K595p50J706o84k065o814M59J0671N910J353l590p620m819l126
$$ plain form
3603 -4308 -9734 -904 6476 4583 5068 5532 2057 -4004 -7960 -7111 -2347 -1845 -1959 -4479 3075 1636
3587 1636 2080 3297 -1311 -4299 -3475 -171 -436 -4725 473 552 -3160 -8477 -11484 -11928 -10019 -7815
3571 -7815 -4440 -4300 -10569 -15233 -5780 -9074 -4094 -3924 -168 5934 5426 5865 11627 12467 2504 -3626
3555 -3626 -1103 11281 13615 8300 8754 8861 5271 7461 1139 -5234 -3289 -1509 -3427 661 2578
3540 2578 -5281 -8095 -6859 -11202 -10884 -5556 5230 1888 -4130 6971 9402 2383 2972 5890 4691
3525 4691 -1269 -8697 -12868 -5917 1589 2595 4885 8211 10701 4068 293 6758 12633 17014 21670
3510 21670 16371 5195 -766 -3681 -1708 2924 8298 8573 5932 1675 -1091 4942 7024 8281 5127
3495 5127 -963 1632 882 2588 1904 -161 -6975 -6516 4155 10065 11418 7828 208 -4611 -7737
3480g737L258J112J529k37O795Q445m389m213J280m137J235K984p04R90L615O039
3464A5865J176n703l534j13L852k838l410N926j94l539n703j078K862O272q10
3449I031j282l165J679P126l614o833o269l80M885J145J919o10L993K883K041
$$ plain form
3480 -7737 -4479 -3367 -1838 -2075 4720 13165 8776 4563 5843 1706 2941 5925 5221 6211 9826 15865
3464 15865 17041 11338 7804 7691 11543 8705 5295 11221 11027 7488 1785 707 3569 9841 9031
3449 9031 7749 4584 6263 13389 9775 2942 -3327 -3707 1178 2323 4242 3632 7625 10508 12549
$$ [...]
##END NTUPLES=NMR SPECTRUM
##END=
