##TITLE=Analysis number 318856
Compound Code cc 53604
Book Reference 467/22/1
Project Code adrs
Chemist Name benw
##JCAMPDX= 6.0         $$ Bruker NMR JCAMP-DX V2.0
##DATA TYPE= NMR SPECTRUM
##DATA CLASS= NTUPLES
##ORIGIN= Bruker BioSpin GmbH
##OWNER= nmr
$$ XWIN-NMR		Version 3.5
$$ Thu Apr 20 11:52:37 2006 GMT Daylight Time (UT+1h)  MAYBRIDGE\nmr@NMR_250MHZ
##.OBSERVE FREQUENCY= 250.131544655141
##.OBSERVE NUCLEUS= ^1H
##.ACQUISITION MODE= SIMULTANEOUS (DQD)
##.ACQUISITION SCHEME= undefined
##.AVERAGES= 16
##.DIGITISER RES= 18
##SPECTROMETER/DATA SYSTEM= dpx250
##.PULSE SEQUENCE= zg30
##.SOLVENT NAME= CDCl3
##.SHIFT REFERENCE= (INTERNAL, CDCl3, 0, 16.522)
##AUDIT TRAIL= $$ (NUMBER, WHEN, WHO, WHERE, WHAT)
$$ ##TITLE= Audit trail, XWIN-NMR		Version 3.5
$$ ##JCAMPDX= 5.01
$$ ##ORIGIN= Bruker BioSpin GmbH
$$ ##OWNER= nmr
$$ C:\u/data/dgb/nmr/ADRS/2800/pdata/1/auditp.txt
$$ ##AUDIT TRAIL=  $$ (NUMBER, WHEN, WHO, WHERE, WHAT)
(   1,<2006-04-20 11:52:16.90 +100>,<MAYBRIDGE\nmr>,<NMR_250MHZ>,
      <created by zg, POWCHK disabled, PULCHK disabled
       configuration hash MD5:
       84 BC 41 DB A1 6E 1D 46 DA 25 12 A5 C1 ED C5 3A
       data hash MD5: 64K
       01 53 E1 36 A2 3F 24 16 0D BD F1 22 5D 62 48 D1>)
(   2,<2006-04-20 11:52:28.26 +100>,<MAYBRIDGE\nmr>,<NMR_250MHZ>,
      <Start of raw data processing
       ef LB = 0.3 FT_mod = 6 PKNL = 1 SI = 32K 
       data hash MD5: 32K
       EB 77 2C 7E 7B 78 6C 16 CE C3 24 31 67 92 33 AA>)
(   3,<2006-04-20 11:52:29.87 +100>,<MAYBRIDGE\nmr>,<NMR_250MHZ>,
      <apk 
       data hash MD5: 32K
       97 00 3F 73 A4 5C 1B 46 E3 FB 4F 8C 37 31 13 C9>)
(   4,<2006-04-20 11:52:30.69 +100>,<MAYBRIDGE\nmr>,<NMR_250MHZ>,
      <abs ABSG = 5 
       data hash MD5: 32K
       EA 71 39 2C 46 82 99 83 B2 72 C7 DD 1C DD 37 CD>)
$$ ##END=
$$ 
$$ hash MD5
$$ E4 42 92 07 F8 AF D3 D4 0A E2 95 50 B7 A2 66 7B
##$RELAX= 
##$RELAX= 
##$RELAX= 
##$RELAX= 
##$RELAX= 
##$RELAX= 
##$RELAX= 
$$ Bruker specific parameters
$$ --------------------------
##$DU= <C:\u>
##$EXPNO= 2800
##$NAME= <ADRS>
##$PROCNO= 1
##$TYPE= <nmr>
##$USER= <dgb>
##$AMP= (0..31)
100 100 100 100 100 100 100 100 100 100 100 100 100 100 100 100 100 100 
100 100 100 100 100 100 100 100 100 100 100 100 100 100 
##$AQSEQ= 0
##$AQ_mod= 3
##$AUNM= <au_zg>
##$AUTOPOS= <22 >
##$BF1= 250.13
##$BF2= 250.13
##$BF3= 250.13
##$BF4= 250.13
##$BF5= 500.13
##$BF6= 500.13
##$BF7= 500.13
##$BF8= 500.13
##$BYTORDA= 1
##$CFDGTYP= 0
##$CFRGTYP= 5
##$CHEMSTR= <none>
##$CNST= (0..31)
1 1 145 1 1 1 1 1 1 1 1 1 1 1 1 1 1 1 1 1 1 1 1 1 1 1 1 1 1 1 1 1 
##$CPDPRG= <>
##$CPDPRG1= <>
##$CPDPRG2= <>
##$CPDPRG3= <>
##$CPDPRG4= <mlev>
##$CPDPRG5= <mlev>
##$CPDPRG6= <mlev>
##$CPDPRG7= <mlev>
##$CPDPRG8= <mlev>
##$CPDPRGB= <>
##$CPDPRGT= <>
##$D= (0..31)
0 1 0 0 0 0 0 0 0 0.06 0 0 0 0 0 0 0.0002 0 0 0 0 0 0 0 0 0 0 0 0 0 0 
0 
##$DATE= 1145530335
##$DBL= (0..7)
120 120 120 120 120 120 120 120 
##$DBP= (0..7)
150 150 150 150 150 150 150 150 
##$DBP07= 0
##$DBPNAM0= <>
##$DBPNAM1= <>
$$ [...]
##$SUBNAM7= <"">
##$SUBNAM8= <"">
##$SUBNAM9= <"">
##$SW= 20.6930455092707
##$SWIBOX= (0..15)
0 0 3 0 0 0 0 0 0 0 0 0 0 0 0 0 
##$SW_h= 5175.983436853
##$TD= 65536
##$TD0= 1
##$TE= 295.16
##$TE2= 300
##$TE3= 300
##$TEG= 300
##$TL= (0..7)
0 120 120 120 120 120 120 120 
##$TP= (0..7)
150 150 150 150 150 150 150 150 
##$TP07= 0
##$TPNAME0= <>
##$TPNAME1= <>
##$TPNAME2= <>
##$TPNAME3= <>
##$TPNAME4= <>
##$TPNAME5= <>
##$TPNAME6= <>
##$TPNAME7= <>
##$TPOAL= (0..7)
0.5 0.5 0.5 0.5 0.5 0.5 0.5 0.5 
##$TPOFFS= (0..7)
0 0 0 0 0 0 0 0 
##$TUNHIN= 0
##$TUNHOUT= 0
##$TUNXOUT= 0
##$USERA1= <user>
##$USERA2= <user>
##$USERA3= <user>
##$USERA4= <user>
##$USERA5= <user>
##$V9= 5
##$VALIST= <valist>
##$VCLIST= <CCCCCCCCCCCCCCC>
##$VD= 0
##$VDLIST= <DDDDDDDDDDDDDDD>
##$VPLIST= <PPPPPPPPPPPPPPP>
##$VTLIST= <TTTTTTTTTTTTTTT>
##$WBST= 1024
##$WBSW= 4
##$XGAIN= (0..3)
0 0 0 0 
##$XL= 0
##$YL= 0
##$YMAX_a= 314186
##$YMIN_a= -376605
##$ZGOPTNS= <>
##$ZL1= 120
##$ZL2= 120
##$ZL3= 120
##$ZL4= 120
##$ABSF1= 16.522
##$ABSF2= -4.171173
##$ABSG= 5
##$ABSL= 3
##$ALPHA= 0
##$AQORDER= 0
##$ASSFAC= 0
##$ASSFACI= 0
##$ASSFACX= 0
##$ASSWID= 0
##$AUNMP= <proc_1d>
##$AZFE= 0.1
##$AZFW= 0.1
##$BCFW= 0
##$BC_mod= 0
##$BYTORDP= 0
##$COROFFS= 0
##$CY= 12.5
##$DATMOD= 1
##$DC= 0
##$DFILT= <>
##$DTYPP= 0
##$F1P= 14.0000005364418
##$F2P= -0.99999901652339
##$FCOR= 0.5
##$FTSIZE= 32768
##$FT_mod= 6
##$GAMMA= 0
##$GB= 0
##$INTBC= 1
##$INTSCL= 1
##$ISEN= 128
##$LB= 0.3
##$LEV0= 0
##$LPBIN= 0
##$MAXI= 10000
##$MC2= 0
##$MEAN= 0
##$ME_mod= 0
##$MI= 0
##$NCOEF= 0
##$NC_proc= -4
##$NLEV= 6
##$NOISF1= 0
##$NOISF2= 0
##$NSP= 0
##$NTH_PI= 0
##$NZP= 0
##$OFFSET= 16.522
##$PC= 1
##$PHC0= 165.8306
##$PHC1= 10.43503
##$PH_mod= 1
##$PKNL= yes
##$PPARMOD= 0
##$PSCAL= 4
##$PSIGN= 0
##$REVERSE= no
##$SF= 250.13
##$SI= 32768
##$SIGF1= 0
##$SIGF2= 0
##$SINO= 400
##$SIOLD= 32768
##$SREGLST= <1H.CDCl3>
##$SSB= 0
##$STSI= 32768
##$STSR= 0
##$SW_p= 5175.98343685301
##$SYMM= 0
##$S_DEV= 0
##$TDeff= 65536
##$TDoff= 0
##$TI= <Analysis number 999999
Compound Code 99
Book Reference 9
Project Code 9>
##$TILT= no
##$TM1= 0
##$TM2= 0
##$TOPLEV= 0
##$USERP1= <user>
##$USERP2= <user>
##$USERP3= <user>
##$USERP4= <user>
##$USERP5= <user>
##$WDW= 1
##$XDIM= 32768
##$YMAX_p= 533909063
##$YMIN_p= -491047
$$ End of Bruker specific parameters
$$ ---------------------------------
##NTUPLES= NMR SPECTRUM
##VAR_NAME=  FREQUENCY,     SPECTRUM/REAL,   SPECTRUM/IMAG
##SYMBOL=    X,             R,               I
##VAR_TYPE=  INDEPENDENT,   DEPENDENT,       DEPENDENT
##VAR_FORM=  AFFN,          ASDF,            ASDF
##VAR_DIM=   32768,         32768,           32768
##UNITS=     HZ,            ARBITRARY UNITS, ARBITRARY UNITS
##FACTOR=    0.157963299565203, 1,           1
##FIRST=     4132.6476996994, 0,             0
##LAST=      -1043.33573715361, 0,           0
##MIN=       -1043.33573715361, -491047,     0
##MAX=       4132.6476996994, 533909063,     0
$$ Real data points
##PAGE= N=1
##DATA TABLE= (X++(R..R)), XYDATA
$$ [...]
$$ plain form
28195 17244 90953 149820 183574 93945 15258 10966 -2286 -1274 58466 101616 92891 69420
28183 69420 54933 43766 31141 -25944 -25400 22409 38224 72111 40829 18977 -41207 -27424
28171 -27424 30829 -10301 13265 104115 93635 71438 57376 80412 51566 -54648 -5430
28160 -5430 5212 43798 19821 -47673 -36700 16461 10324 10332 -40885 -55976 -35924 -62037 -8151
28147 -8151 439 -37913 8772 45370 115662 112209 71138 9339 1584 -3384 -3332 -43634 -76766
28134 -76766 -27774 -16252 -13502 36395 10705 31241 88291 18926 -2423 84659 43590 -2
28122 -2 -42837 -1183 -62776 -77371 -67653 -43487 -57949 -126755 -77611 -50783 -31395 -19859 -37425
28109 -37425 -54688 -48093 -86238 -139619 -137501 -136061 -105132 -127924 -143328 -137089 -45918 58187
$$ packed form
28195A7244P3709N8867L3754q9629p8687m292j3252J012N9740M3150q725k3471
28183F9420j4487j1167j2625n7085N44M7809J5815L3887l1282k1852o0184J3783
28171b7424N8253m1130K3566R0850j0480k2197j4062K3036k8846j06214M9218
28160e430J0642L8586k3977o7494J0973N3161o137Qn1217j5091K0052k6113N3886
28147h151Q590l8352M6685L6598P0292l453m1071o1799p755m968N2m0302l3132
28134g6766M8992J1522K750M9897k5690K0536N7050o9365k1349Q7082m1069m3592
28122bm2835M1654o1593j4595R718K4166j4462o8806M9144K6828J9388J1536j7566
28109c7425j7263O595l8145n3381K118J440L0929k2792j5404O239R1171J04105
$$ plain form
28097 58187 90071 25883 -11552 -45984 -55115 10971 46398 93003 99765 146748 179258 134407
28085 134407 95784 141318 204047 172157 103953 132087 124871 114145 26912 -19149 -22621 33305
28073 33305 41230 27136 20191 25611 35257 7545 -5799 -40124 -31509 32049 29733 37950 90515
28060 90515 57599 53154 5524 38780 33866 56123 61176 113525 132941 108864 102412 98648 86046
28047 86046 22960 19262 46972 74792 42260 -13041 -25142 23753 10187 4019 72414 29088
28035 29088 33625 57555 24955 41546 59178 34063 43063 41232 -10599 -15225 -22119 -14104 -45312
28022 -45312 -45283 -1896 -19907 -1628 -44542 -84158 -48470 29019 39852 118742 137934 166805
28010 166805 108106 103473 62998 83486 29552 -3930 -13384 -31963 8457 -61443 -132667 -170938
$$ packed form
28097E8187L1884o4188l7435l4432r131O6086L5427M6605O762M6983L2510m4851
28085A34407l8623M5534O2729l1890o8204K8134p216j0726q7233m6061l472N5926
28073C3305P925j4094o945N420R646k7712j3344l4325Q615O3558k316Q217N2565
28060I0515l2916m445m7630L3256m914K2257N053N2349J9416k4077o452l764j2602
28047H6046o3086l698K7710K7820l2532n5301j2101M8895j3566o168O8395m3326
28035B9088M537K3930l2600J6591J7632k5115R000j831n1831m626o894Q015l1208
28022d5312K9M3387j8011J8279m2914l9616L5688P7489J0833P8890J9192K8871
28010A66805n8699m633m0475K0488n3934l3482r454j8579M0420o9900p1224l8271
$$ plain form
27998 -170938 -148511 16431 50169 49231 61647 -11923 -84605 -61662 45887 63756 -26626
27987 -26626 -54560 -55558 -97530 -137838 -62429 -128356 -173254 -147302 -92709 -17304 57613 82529
27975 82529 59018 18861 -1953 -1236 31365 42192 36124 40028 40246 22554 45771 104841 72384
27962 72384 1564 23139 23245 20813 -892 4164 -22359 -39595 -806 -36960 -47770 -1112
27950 -1112 -19573 -46849 -73792 -63235 -48631 -27774 53950 48097 43053 65424 93537 78688
27938 78688 75199 21692 26811 79413 99357 33370 45126 769 36088 91537 136057 207686
27926 207686 173193 144893 112758 41163 80989 116509 34828 -21050 9509 13490 31152 45361
27914 45361 45791 49648 111658 63001 -72563 -128802 -58590 -13219 -19755 47128 66953 106859
$$ packed form
27998a70938K2427J64942L3738r38J2416p3570p2682K2943J07549J7869r0382
27987b6626k7934r98m1972m0308P5409o5927m4898K5952N4593P5405P4917K4916
27975H2529k3511m0157k0814P17L2601J0827o068L904K18j7692K3217N9070l2457
27962G2384p0820K1575J06k432k1705N056k6523j7236L8789l6154j0810M6658
27950a112j8461k7276k6943J0557J4604K0857Q1724n853n044K2371K8113j4849
27938G8688l489n3507N119N2602J9944o5987J1756m4357L5319N5449M4520P1629
27926B07686l4493k8300l2135p1595L9826L5520q1681n5878L0559L981J7662J4209
27914D5361M30L857O2010m8657j35564n6239P0212M5371o536O6883J9825L9906
$$ plain form
27902 106859 143729 123039 45859 -32060 1984 71473 15912 -81577 -70535 -50283 38171
27891 38171 33969 -9259 -31994 4850 -21592 -42889 -60280 -81477 7462 -9294 -57658 -17282
27879 -17282 17971 11974 51812 15049 -4605 80008 125854 134708 114910 123598 127796 95865
27867 95865 106671 117110 137406 101610 23124 -45115 -26083 -77388 -72616 -36823 -32346 17905
27855 17905 44736 -17174 -44961 -92557 -42591 -10427 16833 -2230 -8541 917 29335 45104
27843 45104 84825 26934 -7794 35278 61291 18138 -60074 -6914 65569 49754 21762 24256
27831 24256 36661 5248 -2935 -9670 21431 -10017 -8688 48011 91061 91101 83674 71312 40844
27818 40844 -18548 5572 53318 2940 -982 50517 49879 52367 57333 61553 110081 134766 89960
$$ packed form
27902A06859L6870k0690p7180p7919L4044O9489n5561r7489J1042K0252Q8454
27891C8171m202m3228k2735L6844k6442k1297j7391k1197Q8939j6756m8364M0376
27879a7282L5253n997L9838l6763j9654Q4613M5846Q854j9798Q688M198l1931
27867I5865J0806J0439K0296l5796p8486o8239J9032n1305M772L5793M477N0251
27855A7905K6831o1910k7787m7596M9966L2164K7260j9063o311R458K8418J5769
27843D5104L9721n7891l4728M3072K6013m3153p8212N3160P2483j5815k7992K494
27831B4256J2405l1413q183o735L1101l1448J329N6699M3050M0p427j2362l0468
27818D0844n9392K4120M7746n0378l922N1499o38K488M966M220M8528K4685m4806
$$ plain form
27805 89960 56000 64322 -46327 -77138 -49578 -39345 -26175 4366 18281 15290 -7660 -55041
27793 -55041 -75664 -16381 72086 80260 16676 -49592 -77100 -99821 -98392 -77114 -61755 -48120
27781 -48120 -102795 -75101 25303 35991 47851 69487 44382 6974 -17641 -96341 -80348
27770 -80348 -15692 83879 112797 50445 -68008 -60833 -10836 -47950 -66951 -9390 44586 133714
27758 133714 104893 107726 67768 44090 118946 140266 45046 37957 43755 71103 89546 88492
27746 88492 137797 147006 149315 57609 -10823 -1707 -19884 -45913 -95530 -103742 -51873 9262
27734 9262 89294 89282 32669 52495 55627 53443 83922 155137 158575 163261 145335 120106 119510 125364
27720 125364 31003 -15039 7527 30708 8105 -966 64314 131090 101134 97423 111377 134367
$$ packed form
27805H9960l3960Q322j10649l0811K7560J0233J3170L0541J3915k991k2950m7381
27793e5041k0623N9283Q8467Q174o3584o6268k7508k2721J429K1278J5359J3635
27781d8120n4675K7694J00404J0688J1860K1636k5105l7408k4615p8700J5993
27770h0348O4656R9571K8918o2352j18453P175M9997l7114j9001N7561N3976Q9128
27758A33714k8821K833l9958k3678P4856K1320r5220p089N798K7348J8443j054
27746H8492M9305R209K309r1706o8432R116j8177k6029m9617q212N1869O1135
27734I262Q0032j2n6613J9826L132k184L0479P1215L438M686j7926k5229n96N854
27720A25364r4361m6042K2566K3181k2603r071O5280O6776k9956l711J3954K2990
$$ plain form
27708 134367 137529 78148 57649 90662 56684 39183 37823 38267 -5931 -48524 -1867 90020
27696 90020 121133 94335 87540 74889 135326 162435 91707 -27833 -18550 71032 107068 -260
27684 -260 -71123 -54945 -3162 -53298 3707 -16930 -47533 -60055 -51182 -52335 24789 105901
27672 105901 191881 212801 188664 97013 70513 50209 7922 -34427 22320 9444 -52566
27661 -52566 -97630 -76215 -89237 -69824 -63917 -15864 17504 53112 92465 30963 17952 -36423
27649 -36423 -64911 -57211 -94575 -50269 -75738 -62510 9984 34257 41062 78886 90906 50565
27637 50565 132306 113905 9408 34620 54242 41133 64963 77271 85330 84069 50252 45251
27625 45251 67224 65909 18173 -57241 -44378 -18186 -10807 43543 -27828 -99644 -51143 31250
$$ packed form
27708A34367L162n9381k0499L3013l3978j7501j360M44m4198m2593M6657R1887
27696I0020L1113k6798o795j2651O0437K7109p0728j19540R283Q9582L6036j07328
27684b60p0863J6178N1783n0136N7005k0637l0603j2522Q873j153P7124Q1112
27672A05901Q5980K0920k4137r1651k6500k0304m2287m2349N6747j2876o2010
27661e2566m5064K1415j3022J9413N907M8053L3368L5608L9353o1502j3011n4375
27649c6423k8488P700l7364M4306k5469J3228P2494K4273O805L7824J2020m0341
27637E0565Q1741j8401j04497K5212J9622j3109K3830J2308Q059j261l3817n001
27625D5251K1973j315m7736p5414J2863K6192P379N4350p1371p1816M8501Q2393
$$ plain form
27613 31250 49399 51215 10646 24437 23679 11932 27020 22951 34540 140931 169601 171664
27601 171664 156368 68566 18586 58295 36803 30721 -11765 38574 -17817 -103949 -45712 945
27589 945 8927 40316 125682 83730 43043 29069 80202 115068 93078 67885 37716 -33702
27577 -33702 -5550 65175 48324 96209 165223 166225 93426 66473 95758 107308 29009 -44068
27565 -44068 -58626 -22914 16711 7895 29230 3078 -47989 -33301 -60990 -122878 -143669 -106799
27553 -106799 -38946 -50474 -66783 -21453 -28761 5413 129920 100493 70824 49718 70434
27542 70434 36410 66372 148486 118877 117177 86050 56088 15156 23218 72648 135328 106658
27530 106658 41534 -6604 -57058 -80788 -1957 8714 -59254 -31419 -39416 -55511 -46284 -75141
$$ packed form
27613C1250J8149J816m0569J3791p58j1747J5088m069J1589J06391K8670K063
27601A71664j5296q7802m9980L9709k1492o082m2486N0339n6391q6132N8237M6657
27589I45P982L1389Q5366m1952m0687j3974N1133L4866k1990k5193l0169p1418
27577c3702K8152P0725j6851M7885O9014J002p2799k6953K9285J1550p8299p3077
27565d4068j4558L5712L9625q816K1335k6152n1067J4688k7689o1888k0791L6870
27553a06799O7853j1528j6309M5330p308L4174J24507k9427k9669k1106K0716
27542G0434l4024K9962Q2114k9609j700l1127k9962m0932Q062M9430O2680k8670
27530A06658o5124m8138n0454k3730P8831J0671o7968K7835p997j6095R227k8857
$$ plain form
27518 -75141 -88523 -61460 -21064 -5334 14333 22877 -20893 -13791 13698 -8801 64692 95173
27506 95173 27551 -81144 -129146 -22085 50331 23429 41113 2627 -11842 -1406 10224
27495 10224 -42969 4802 3818 13664 65998 49386 -8046 11371 32298 -57576 -120002 -37855
27483 -37855 -37012 -25773 87169 58731 -16901 -56798 -41084 -15205 -4295 -34819 -67272 -68198
27471 -68198 -112713 -153954 -164392 -160503 -116985 -63912 25010 38712 48138 85981 85004 84545 29307
27458 29307 -11294 5290 -34371 18374 39151 36856 -29761 -72595 -50745 -25796 -40483 -54738
27446 -54738 -60250 -61168 -78551 -108045 -78155 -47380 -62781 -95487 -148881 -121644 -98114 -97384 -22513
27433 -22513 93319 94025 68738 99010 93784 51512 114630 75310 80236 44391 35766 39004 -35283
$$ packed form
27518g5141j3382K7063M0396J5730J9667Q544m3770P102K7489k2499P3493L0481
27506I5173o7622j08695m8002J07061P2416k6902J7684l8486j4469J0436J1630
27495A0224n3193M7771r84R846N2334j6612n7432J9417K0927q9874o2426Q2147
27483c7855Q43J1239J12942k8438p5632l9897J5714K5879J0910l0524l2453r26
27471f8198m4515m1241j0438L889M3518N3073Q8922J3702R426L7843r77m59n5238
27458B9307m0601J6584l9661N2745K0777k295o6617m2834K1850K4949j4687j4255
27446e4738n512r18j7383k9494K9890L0775j5401l2706n3394K7237K3530P30P4871
27433b2513J15832P06k5287L0272n226m2272O3118l9320M926l5845q625L238p4287
$$ plain form
27420 -35283 -84156 -62123 -73165 -12328 -46753 -78442 -126065 -43393 12773 -921 -21177 16026
27408 16026 6059 -14541 40550 92461 31053 -26195 -20143 26018 60493 79032 127704 120645
27396 120645 90732 70850 134544 101801 35365 -12458 -79416 -93311 -42533 -51136 -31084 -71599
27384 -71599 -50693 -26282 -68842 -115452 -59935 -8635 -11980 -13173 16356 140986 149180 122506
27372 122506 77211 43970 32119 42780 46609 -6824 -41404 45362 95892 189500 142588 42461
27360 42461 70536 74740 10542 -27265 -18772 -59126 -72666 -89970 -18460 13458 -30110 -11981
27348 -11981 -23136 25006 17226 6881 14830 29809 102256 77448 85792 51732 -32876 -37469
27336 -37469 -597 -30662 -68107 -19361 62211 -3817 -37127 -5797 -23168 -67559 -64557 -73370
$$ packed form
27420c5283m8873K2033j1042O0837l4425l1689m7623Q2672N6166j3694k0256L7203
27408A6026r967k0600N5091N1911o1408n7248O052M6161L4475J8539M8672p059
27396A20645k9913j9882O3694l2743o6436m7823o6958j3895N0778q603K0052m0515
27384g1599K0906K4411m2560m6610N5517N1300l345j193K9529J24630Q194k6674
27372A22506m5295l3241j1851J0661L829n3433l4580Q6766N0530R3608m6912j00127
27360D2461K8075M204o4198l7807Q493m0354j3540j7304P1510L1918m3568J8129
27348a1981j1155M8142p780j0345P949J4979P2447k4808Q344l4060q4608m593
27336c7469L6872l0065l7445M8746Q1572o6028l3310L1330j7371m4391L002q813
$$ plain form
27324 -73370 -61705 -5420 -10008 -49457 -100003 -118679 -117242 -57180 10148 49862 66038 48143
27312 48143 64310 99934 93456 12950 50116 71740 54245 16375 -14834 -20965 -10515 37583
27300 37583 34443 10302 -48565 -40791 -39389 -69509 -31022 -26655 -17982 41568 19869 -69129 31800
27287 31800 76580 66810 60540 64187 55568 56780 37861 68482 85148 34501 4030 -14070 -32234
27274 -32234 2895 3143 -10732 -50925 -66124 32846 53282 132651 96416 -6873 -25360 -27146
27262 -27146 -36685 -28843 -52665 -48124 -19866 39412 139213 190150 142779 156681 160626 133705
27250 133705 102629 96229 127289 127944 76229 74212 27390 9886 63944 51975 -45175 -14106
27238 -14106 -45675 -45026 -34902 -79276 -76853 -53270 -44821 -5937 -8980 29782 11658 19445 2849
$$ packed form
27324g3370J1665N6285m588l9449n0546j8676J437O0062O7328L9714J6176j7895
27312D8143J6167L5624o478q0506L7166K1624j7495l7870l1209o131J0450M8098
27300C7583l140k4141n8867P774J402l0120L8487M367Q673N9550k1699q8998J00929
27287C1800M4780r770o270L647q619J212j8919L0621J6666n0647l0471j8100j8164
27274c2234L5129K48j3875m0193j5199R8970K0436P9369l6235j03289j8487j786
27262b7146r539P842k3822M541K8258N9278R9801N0937m7371J3902L945k6921
27250A33705l1076o400L1060O55n1715k017m6822j7504N4058j1969r7150L1069
27238a4106l1569O49J0124m4374K423K3583Q449L8884l043L8762j8124P787j6596
$$ plain form
27225 2849 -8874 25780 37498 1831 -6411 1318 -40161 -67131 -7391 64048 51533 29830
27213 29830 33791 -27616 -58927 -77776 -127184 -97672 -68620 -28104 33287 -9457 -6653 3863
27201 3863 39713 69746 96288 74858 3995 30251 50039 59163 37227 62345 123613 60598
27189 60598 29260 60195 69943 -13751 -70192 -61016 -5152 13516 -59970 -66046 -38472 -16060
27177 -16060 42863 72276 46224 48746 -10881 -27180 13171 45580 79502 22524 -80913 -122309
27165 -122309 -179942 -161467 -90167 -77171 -11707 23431 -21283 -41851 -14680 6230 -25236
27154 -25236 -51746 -60779 -18812 -93416 -140447 -139230 -38777 -37797 -33064 25318 23394 7270 -5707
27141 -5707 31454 36196 17531 -45072 -106048 -56731 -28076 -77712 -70345 -140669 -136220 -131488 -118047
$$ packed form
27225B849j1723L4654J1718l5667q242P729m1479k6970N9740P1439j2515k1703
27213B9830L961o1407l1311j8849m9408K9512K9052M0516O1391m2744K804J0516
27201C863L5850L0033K6542k1430p0863K6256J9788R124k1936K5118O1268o3015
27189F0598l1338L0935R748q3694n6441R176N5864J8668p3486o076K7574K2412
27177a6060N8923K9413k6052K522n9627j6299M0351L2409L3922n6978j03437m1396
27165a22309n7633J8475P1300J2996O5464L5138m4714k0568K7171K0910l1466
27154b5236k6510r033M1967p4604m7031J217J00453R80M733N8382j924j6124j2977
27141e707L7161M742j8665o2603o0976M9317K8655m9636P367p0324M449M732J3441
$$ plain form
27128 -118047 -96489 -94672 -81055 -64105 -8125 -9376 -101595 -149747 -93081 -80365 -32152 4941
27116 4941 -53680 -81655 -31339 13439 12533 4353 -45355 -41626 -70234 -63676 -18282 45525 46531
27103 46531 15651 -39155 -105617 -113484 -41603 -39435 -38094 -54763 -80137 -18745 41532 79409
27091 79409 68505 40798 87814 100312 122647 70584 -47866 -70237 -78675 -65854 -13610 -67276
27079 -67276 -73356 24464 43445 83598 59386 42094 18475 30780 28495 -2258 20628 51317
27067 51317 88089 -12388 -50556 52004 36555 -8853 -37722 -3905 -17822 -13594 -34810
27056 -34810 14740 20808 22467 1878 -21982 -36823 -29246 -18852 47187 -5665 -75324 -92
27044 -92 82025 104165 70546 56698 106974 146787 147135 76395 137708 146645 27854 8547 43728
$$ packed form
27128a18047K1558J817J3617J6950N5980j251r2219m8152N6666J2716M8213L7093
27116D941n8621k7975N0316M4778r06q180m9708L729k8608O558M5394O3807J006
27103D6531l0880n4806o6462p867P1881K168J341j6669k5374O1392O0277L7877
27091G9409j0904k7707M7016J2498K2335n2063j18450k2371q438J2821N2244n3666
27079f7276o080R7820J8981M0153k4212j7292k3619J2305k285l0753K2886L0689
27067E1317L6772j00477l8168J02560j5449m5408k8869L3817j3917M228k1216
27056c4810M9550O068J659k0589k3860j4841P577J0394O6039n2852o9659P5232
27044i2Q2117K2140l3619j3848N0276L9813L48p0740O1313Q937j18791j9307L5181
$$ plain form
27031 43728 103541 66383 59423 21047 14244 38187 -19472 2840 99740 122898 65629 14510
27019 14510 23523 26466 56442 66841 50677 59063 6915 -55943 -65122 -104712 -81259 -51579
27007 -51579 -83064 -30903 -31668 -114354 -170452 -154321 -167358 -159805 3245 113660 184380 160159
26995 160159 77384 -16081 -123114 -115296 -99290 -42927 11811 -19831 845 -2201 -44877 -33566
26983 -33566 -38581 18702 85926 100632 68200 28945 15295 33335 29497 21671 -14770 -13376
26971 -13376 457 -7438 3614 -4089 -70448 -147619 -204411 -123358 -39470 -26308 -44828 -97414
26959 -97414 -26391 45028 -21312 -31123 -46865 13961 51594 31919 36910 53698 46070 -16242
26947 -16242 -59638 -38302 -35764 -3131 -31996 -82470 -71293 -78305 -92630 -30730 -53201 -66492
$$ packed form
27031D3728N9813l7158o960l8376o803K3943n7659K2312R6900K3158n7269n1119
27019A4510R013K943K9976J0399j6164Q386n2148o2858r179l9590K3453K9680
27007e1579l1485N2161p65q2686n6098J6131j3037P553J63050J10415P0720k4221
26995A60159q2775r3465j07033P818J6006N6363N4738l1642K0676l046m2676J1311
26983c3566n015N7283O7224J4706l2432l9255j3650J8040l838p826l6441J394
26971a3376J3833p895J1052p703o6359p7171n6792Q1053Q3888J3162j8520n2586
26959i7414P1023P1419o6340r811j5742O0826L7633j9675M991J6788p628o2312
26947a6242m3396K1336K538L2633k8865n0474J1177p012j4325O1900k2471j3291
$$ plain form
26935 -66492 -98152 -79277 -28057 49497 63838 91549 63000 -43075 -134090 -65433 -14514
26924 -14514 -75860 -118890 -42595 -15010 -9304 -12709 44140 8447 -22709 -69707 23302 41472
26912 41472 -21194 -67246 -33001 27968 15204 -23625 -36874 -5544 -51038 -93580 -82832 -39003
26900 -39003 -54069 -43536 -61686 15672 -7673 -23708 35413 10434 -6098 58568 39386 15233
26888 15233 41882 37568 20951 96870 102628 133123 176858 134268 150449 115717 70766 29926
26876 29926 -35934 -59750 -8947 -15124 -20904 -103575 -86741 -23417 -33590 32861 -27551 -58990
26864 -58990 28061 23205 -7456 85822 123459 99079 -2692 -61551 -60701 -82163 -72735 -71853 -8146
26851 -8146 28480 85553 50611 -1023 47865 128 142 -30209 -39046 -24451 -55605 -93133 -49295
$$ packed form
26935f6492l1660J8875N1220P7554J4341K7711k8549j06075r1015O8657N0919
26924a4514o1346m3030P6295K7585N706l405N6849l5693l1156m6998R3009J8170
26912D1472o2666m6052L4245O0969j2764l8829j3249L1330m5494m2542J0748M3829
26900c9003j5066J0533j8150P7358k3345j6035N9121k4979j6532O4666j9182k4153
26888A5233K6649m314j6617P5919N758L0495M3735m2590J6181l4732m4951m0840
26876B9926o5860k3816N0803o177n780q2671J6834O3324j0173O6451o0412l1439
26864e8990Q7051m856l0661R3278L7637k4380j01771n8859Q50k1462R428Q82O3707
26851h146L6626N7073l4942n1634M8888m7737J4l0351q837J4595l1154l7528M3838
$$ plain form
26838 -49295 -22543 -8726 14923 55240 91648 121448 68542 2150 -16279 -69716 -110469 -67545
26826 -67545 -66931 -54306 -52918 -95567 -26863 -78485 -40289 207 72448 102790 121453 79820
26814 79820 49956 -32316 -56317 -73499 -28666 -8953 29603 59670 97894 41476 13048 2049
26802 2049 42470 10690 -7772 -2742 28232 7438 -1183 14354 27768 81724 108769 72121
26790 72121 36443 -23434 -49453 -50591 20585 32394 -37761 15598 62878 38381 -29589 -60079
26778 -60079 -66864 -46981 -68326 -38652 -48411 -57808 47902 73637 21562 -27699 -50781 -19728
26766 -19728 -17207 -4111 -14250 2558 47757 102600 41018 -38054 -32772 24417 -34567 -32674
26754 -32674 26405 45361 14216 -43158 -39476 -18233 44332 9843 -14513 -89013 -84446 -33038
$$ packed form
26838d9295K6752J3817K3649M0317L6408K9800n2906o6392j8429n3437m0753M2924
26826f7545O14J2625J388m2649O8704n1622L8196M0496P2241L0342J8663m1633
26814G9820k9864q2272k4001j7182M4833J9713L8556L0067L8224n6418k8428j0999
26802B049M0421l1780j8462N030L0974k0794q621J5537J3414N3956K7045l6648
26790G2121l5678n9877k6019j138P1176J1809p0155N3359M7280k4497o7970l0490
26778f0079o785J9883k1345K9674r759r397J05710K5735n2075m9261k3082L1053
26766a9728K521J3096j0139J6808M5199N4843o1582p9072N282N7189n8984J893
26754c2674N9079J8956l1145n7374L682K1243O2565l4489k4356p4500M567N1408
$$ plain form
26742 -33038 5890 -23140 -81042 -93198 -48491 14615 66892 120233 69985 46140 49840 58197
26730 58197 49856 39099 65514 74847 46702 35545 56065 44768 -16165 -30006 11092 43250
26718 43250 -68362 -105094 -82909 -63146 -50435 -24661 -58483 -127851 -136194 -70842 -18730 -111131
26706 -111131 -141116 -127553 -63083 4779 -18512 -59048 -78743 -75122 -4145 8508 27920 33082
26694 33082 -13178 -20196 69974 41553 -10562 35887 55254 22155 -6405 -57441 -78872 -67943
26682 -67943 -40172 -10481 -23677 -56539 -28007 18649 46142 842 -67738 -93936 -55637 8954
26670 8954 51890 -29247 -65477 -62825 -77814 -71545 -33657 38568 13149 40485 25383 -71044
26658 -71044 -66303 -60201 -42487 -58421 -124754 -94594 -85593 -57301 9215 60466 16528 -26910
$$ packed form
26742c3038L8928k9030n7902j2156M4707O3106N2277N3341n0248k3845L700Q357
26730E8197q341j0757K6415R333k8145j1157K0520j1297o0933j3841M1098L2158
26718D3250j11612l6732K2185J9763J2711K5774l3822o9368q343O5352N2112r2401
26706a11131k9985J3563O4470O7862k3291m0536j9695L621P0977J2653J9412N162
26694C3082m6260p018R0170k8421n2115M6449J9367l3099k8560n1036k1431J0929
26682f7943K7771K9691j3196l2862K8532M6656K7493m5300o8580k6198L8299O4591
26670H954M2936q1137l6230K652j4989O269L7888P2225k5419K7336j5102r6427
26658g1044M741O102J7714j5934o6333L0160R001K8292O6516N1251m3938m3438
$$ plain form
26646 -26910 -55493 -4439 34128 -1547 22648 16039 3067 -22021 4381 44069 15919 -98233
26634 -98233 -83645 -63873 -63104 -77397 -65955 -20211 16353 -11225 -12337 80431 115150 1006
26622 1006 -116532 -101687 -103447 -81072 -36124 -38594 -50650 -88764 -88783 21727 14846 28468 30189
26609 30189 51354 230 45203 64960 23591 -29965 -33546 -53910 -61849 -79091 -90361 -88181
26597 -88181 -3130 -20265 31195 66965 36951 28952 52138 105622 145848 138988 113342 117058
26585 117058 87230 97879 122715 80279 63312 33890 93275 84558 40720 18942 45488 91834
26573 91834 132052 129354 102440 38172 42249 -1075 -36597 -93901 -74714 -14830 67815 32347
26561 32347 18302 80593 89934 80836 86151 18095 -22008 33335 23261 -351 -5179 6907
$$ packed form
26646b6910k8583N1054L8567l5675K4195o609j2972k5088K6402L9688k8150j14152
26634i8233J4588J9772P69j4293J1442M5744L6564k7578j112R2768L4719j14144
26622A006j17538J4845j760K2375M4948k470j2056l8114j9J10510o881J3622J721
26609C0189K1165n1124M4973J9757m1369n3556l581k0364p939j7242j1270K180
26597h8181Q5051j7135N1460L5770l0014p999K3186N3484M0226o860k5646L716
26585A17058k9828J0649K4836m2436j6967k9422N9385q717m3838k1778K6546M6346
26573I1834M0218k698k6914o4268M077m3324l5522n7304J9187N9884Q2645l5468
26561C2347j4045O2291R341r098N315o8056m0103N5343j0074k3612m828J2086
$$ plain form
26549 6907 23844 -21597 -32327 -41602 -39792 50880 75702 55569 25655 66204 83347 95661
26537 95661 59761 18215 -88826 -99254 15260 46984 12454 -55629 -32356 -30497 -61219
26526 -61219 -44306 -51210 -56831 -80329 -67333 -14595 -41052 -94527 5257 57885 91670 75496
26514 75496 60838 10861 47942 96636 87943 103967 119252 76177 2320 -24407 14728 -18971
26502 -18971 22393 20648 31773 74365 111608 68185 33535 2646 46308 63807 17730 -67524
26490 -67524 -79346 -89200 -48380 63064 120872 86959 43865 63091 108226 56531 -1626 -26580
26478 -26580 -19809 23942 50635 70643 87106 68625 81085 82705 17522 -24148 -92317 -66839
26466 -66839 -41714 -20579 -10452 55179 123253 114978 90874 95797 48762 17034 21799 -24131
$$ packed form
26549F907J6937m5441j0730r275J810R0672K4822k0133k9914M0549J7143J2314
26537I5661l5900m1546j07041j0428J14514L1724l4530o8083K3273J859l0722
26526f1219J6913o904n621k3498J2996N2738k6457n3475R9784N2628L3785j6174
26514G5496j4658m9977L7081M8694q693J6024J5285m3075p3857k6727L9135l3699
26502a8971M1364j745J1125M2592L7243m3423l4650l0889M3662J7499m6077q5254
26490f7524j1822r854M0820J11444N7808l3913m3094J9226M5135n1695n8157k4954
26478b6580O771M3751K6693K0008J6463j8481J2460J620o5183m1670o8169K5478
26466f6839K5125K1135J0127O5631O8074q275k4104M923m7035l1728M765m5930
$$ plain form
26454 -24131 -40269 -93607 -62308 13874 54150 125097 102754 41621 56948 106607 76381 31264
26442 31264 905 -4298 31298 19339 53506 36460 23017 12822 54773 32016 59694 115994
26430 115994 79537 -4252 -34864 -55449 -21176 -13959 -45380 -68631 -37960 -74436 -66855 -24065
26418 -24065 -19187 -98584 -55150 -64493 -57252 -38050 51202 128337 120306 47289 7608 -33185
26406 -33185 34696 57268 68084 66500 52080 69471 121438 130252 125696 150481 96142 71856
26394 71856 84836 131506 118549 15272 10522 40480 12974 12637 -33349 -96889 -85761 -22185
26382 -22185 63759 17238 -66469 -28246 75581 107707 96728 4351 6864 -10970 22885 -3658
26370 -3658 -69829 -95468 -83352 -83002 -36965 10880 40077 19781 -78811 -64067 -13598 -52321
$$ packed form
26454b4131j6138n3338L1299P6182M0276P0947k2343o1133J5327M9659l0226m5117
26442C1264l0359n203L5596j1959L4167j7046j3443j0195M1951k2757K7678N6300
26430A15994l6457q3789l0612k0585L4273P217l1421k3251L0671l6476P581M2790
26418b4065M878p9397M3434r343P241J9202Q9252P7135q031p3017l9681m0793
26406c3185O7881K2572J0816j584j4420J7391N1967Q814m556K4785n4339k4286
26394G1856J2980M6670j2957j03277m750K9958k7506l37m5986o3540J1128O3576
26382b2185Q5944m6521q3707L8223J03827L2126j0979r2377K513j7834L3855k6543
26370c658o6171k5639J2116L50M6037M7845K9197k0296r8592J4744N0469l8723
$$ plain form
26358 -52321 -83818 1741 37609 18685 42790 84488 85725 94800 83572 5493 -12256 -57827
26346 -57827 -4941 11946 56862 84301 33651 -26842 -14089 -21406 8312 49884 102679 88837
26334 88837 65711 84858 105775 128901 135267 108057 43625 17113 36710 33119 47590 77934
26322 77934 187907 170146 136652 122032 134390 134670 90015 48004 20781 15457 29259 33230
26310 33230 21950 21434 -52532 -55443 2622 -8135 1959 47573 56559 62783 -19816 -22286 6174
26297 6174 -17764 -58172 -78955 -75577 -47273 -24235 10549 4047 -39744 -21194 51391 82320
26285 82320 58323 5886 73309 65634 41406 -23248 -54101 -83739 -111590 -109397 -83904 -63383
26273 -63383 -26501 -24193 64015 129616 108728 102504 76280 94566 78514 62381 103643 150585
$$ packed form
26358e2321l1497Q5559L5868j8924K4105M1698J237R075j1228p8079j7749m5571
26346e7827N2886J6887M4916K7439n0650o0493J2753p317K9718M1572N2795j3842
26334H8837k3126J9147K0917K3126O366k7210o4432k6512J9597l591J4471L0344
26322G7934J09973j7761l3494j4620J2358K80m4655m2011k7223n324J3802L971
26310C3230j1280n16p3966k911N8065j0757J0094M5614Q986O224q2599k470K8460
26297F174k3938m0408k0783L378K8304K3038L4784o502m3791J8550P2585L0929
26285H2320k3997n2437O7423p675k4228o4654l0853k9638k7851K193K5493K0521
26273f3383L6882K308Q8208O5601k0888o224k6224J8286j6052j6133M1262M6942
$$ plain form
26261 150585 59438 -17379 -10163 -61978 -42079 35485 100657 96337 46746 -38345 -91307 -14480
26249 -14480 -27279 -23037 72867 140076 139747 76293 63240 90351 89060 119449 131914 171183
26237 171183 138019 97323 93119 66818 70429 55713 22899 -39590 -79584 -40206 -21593 -19415
26225 -19415 -70907 -71817 -22312 24668 -576 -26664 -41018 3357 -23399 -33957 -38058 -4353
26213 -4353 32099 23610 -14453 -27166 -50204 -6298 -73907 -91780 -122358 -122828 -100474 -53427
26201 -53427 -26866 -65835 -11014 80793 110254 97110 75851 44361 105799 2622 -73077
26190 -73077 -87769 -9706 -6466 -20684 -47231 -58011 -13298 32831 29126 17618 -52371 -69303
26178 -69303 -75253 -76258 -75185 -53188 -5306 18871 109377 104310 50609 74975 65497 33870 -4977
$$ packed form
26261A50585r1147p6817P216n1815J9899P7564O5172m320m9591q5091n2962P6827
26249a4480j2799M242R5904O7209l29o3454j3053K7111j291L0389J2465L9269
26237A71183l3164m0696m204k6301L611j4716l2814o2489l9994L9378J8613K178
26225a9415n1492r10M9505M6980k5244k6088j4354M4375k6756j0558m101L3705
26213d353L6452q489l8063j2713k3038M3906o7609j7873l0578m70K2354M7047
26201e3427K6561l8969N4821R1807K9461j3144k1259l1490O1438j03177p5699
26190g3077j4692P8063L240j4218k6547j0780M4713M6129l705j1508o9989j6932
26178f9303n950j005J073K1997M7882K4177R0506n067n3701K4366r478l1627l8847
$$ plain form
26165 -4977 -36796 11535 34291 20386 35375 37261 48603 84827 60615 65621 90336 41665
26153 41665 1638 49743 84895 69234 49124 50880 91143 112726 74428 31786 75682 98437
26141 98437 59088 111751 19018 31329 98651 83732 36757 7477 -7327 38220 53545 28175
26129 28175 58893 77766 11007 -120641 -141251 -111314 -141357 -163429 -154301 -61297 -15114 -101030
26117 -101030 -138354 -9363 52800 39139 20710 12788 -33764 -4728 32541 10952 -24561
26106 -24561 19141 69091 48178 49219 23943 44520 57897 64504 10471 -47678 -109233 -107234
26094 -107234 -100276 -60867 -55799 -52447 -20789 -57585 -47261 -22027 21085 6899 -52008 25866
26082 25866 64780 16361 1547 28923 18406 -55913 -78423 -108499 -99988 -58862 -23066 76
$$ packed form
26165d977l1819M8331K2756j3905J4989J886J1342L6224k4212N006K4715m8671
26153D1665m0027M8105L5152j5661k0110J756M0263K1583l8298m2642M3896K2755
26141I8437l9349N2663r2733J2311O7322j4919m6975k9280j4804M5547J5325k5370
26129B8175L0718J8873o6759j31648k0610K9937l0043k2072R128R3004M6183q5916
26117a01030l7324J28991O2163j3661j8429p922m6552K9036L7269k1589l5513
26106b4561M3702M9950k0913J041k5276K0577J3377O607n4033n8149o1555J999
26094a07234O958L9409N068L352L1658l6796J0324K5234M3112j4186n8907P7874
26082B5866L8914m8419j4814K7376j0517p4319k2510l0076Q511M1126L5796K3142
$$ plain form
26070 76 -52648 -1290 -2822 -53786 -76830 -33016 -33932 -7473 -46877 -84208 -24052 43621 -1435
26057 -1435 -58821 -73590 -135966 -194764 -153298 -110967 -15602 60624 76637 79389 102944 82496
26045 82496 -39041 -65459 49000 72124 26068 -3371 -56488 -27248 -31510 -14197 54527
26034 54527 -14232 -47714 -20572 36701 74031 91401 65374 50051 63721 127048 162830 184923
26022 184923 154038 71106 56978 102741 45989 -800 -49427 -83609 -78165 -71858 -5156 80726
26010 80726 86106 113621 89045 134050 126754 103650 91424 72796 -19034 -53543 -34105 40105
25998 40105 68154 110007 80864 24579 -53985 -46733 26241 -19069 -59156 -26090 -12911 -57337
25986 -57337 -23130 86292 81413 -17374 -130566 -142532 -57556 39722 -17296 -73402 -116516
$$ packed form
26070G6n2724N1358j532n0964k3044M3814r16K6459l9404l7331O0156O7673m5056
26057a435n7386j4769o2376n8798M1466M2331R5365P6226J6013K752K3555k0448
26045H2496j21537k6418J14459K3124m6056k9439n3117K9240m262J7313O8724
26034E4527o8759l3482K7142N7273L7330J7370k6027j5323J3670O3327L5782K2093
26022A84923l0885q2932j4128M5763n6752m6789m8627l4182N444O307O6702Q5882
26010H0726N380K7515k4576M5005p296k3104j2226j8628r1830l4509J9438P4210
25998D0105K8049M1853k9143n6285p8564P252P2974m5310m0087L3066J3179m4426
25986e7337L4207J09422m879r8787j13192j1966Q4976R7278n7018n6106m3114
$$ plain form
25975 -116516 -150401 -191206 -125933 -46733 -17978 -3381 -13464 -44184 -32827 -11222 -74833
25964 -74833 -113658 -59211 -9902 -67616 -64697 -50582 -58952 -57906 -77521 -2958 -1658 -26371
25952 -26371 46472 141608 131682 77719 18170 -40253 -54741 -69805 7627 -1013 -48158 -76675
25940 -76675 -29794 80887 156979 181295 132122 85872 56754 -4219 -33090 19485 40734
25929 40734 36440 -38332 -56761 9946 48098 57542 -15321 -103339 -94341 -14636 48956 40083
25917 40083 1897 14108 59619 135948 144712 108791 119139 95910 -9319 -49381 -67630 -28077
25905 -28077 45657 111412 -13692 -120102 -148953 -115018 -113832 -82264 -27628 -28381 7763 40565
25893 40565 78983 40560 34898 33760 36267 62703 52546 880 43018 86723 87756 73394
$$ packed form
25975a16516l3885m0805O5273P9200K8755J4597j0083l0720J1357K1605o3611
25964g4833l8825N4447M9309n7714K919J4115q370J046j9615P4563J300k4713
25952b6371P2843R5136r926n3963n9549n8423j4488j5064P7432q640m7145k8517
25940g6675M6881J10681P6092K4316m9173m6250k9118o0973k8871N2575K1249
25929D0734m294p4772j8429O6707L8152R444p2863q8018Q998P9705O3592q873
25917D0083l8186J2211M5511P6329Q764l5921J0348k3229j05229m0062j8249L9553
25905b8077P3734O5755j25104j06410k8851L3935J186L1568N4636p53L6144L2802
25893D0565L8418l8423n662j138K507K6436j0157n1666M2138M3705J033j4362
$$ plain form
25881 73394 53696 61631 34366 32768 59867 109612 122859 104272 62779 62908 98336 52214
25869 52214 45541 104453 92296 27407 -1785 -51637 -112701 -108848 -82085 -55131 26561 75679
25857 75679 95097 82355 24119 -58671 -27276 7759 12936 -20981 -70085 -30702 -26068 -30988
25845 -30988 -39038 -85161 -161488 -108797 -24578 -10618 -6067 -45298 -114275 -144227 -170394 -60627
25833 -60627 23703 -10536 -59112 -85203 -25241 39881 93925 107576 107371 98051 36053 75042
25821 75042 28898 -19428 -29235 54606 10971 -63358 -69108 37014 63888 26017 -109906 -160456
25809 -160456 -122018 -95437 -81305 -13038 44613 41131 11583 14347 -24817 -64581 -56530 -76967
25797 -76967 -71202 11295 -3829 -9150 -7236 -14194 -15140 -47189 -61339 -61979 -45107 -114029 -59348
$$ packed form
25881G3394j9698P935k7265j598K7099M9745J3247j8587m1493J29L5428m6122
25869E2214o673N8912j2157o4889k9192m9852o1064L853K6763K6954Q1692M9118
25857G5679J9418j2742n8236q2790L1395L5035N177l3917m9104L9383M634m920
25845c0988q050m6123p6327N2691Q4219J3960M551l9231o8977k9952k6167J09767
25833f0627Q4330l4239m8576k6091N9962O5122N4044J3651k05r320o1998L8989
25821G5042m6144m8326r807Q3841m3635p4329n750J06122K6874l7871j35923n0550
25809a60456L8438K6581J4132O8267N7651l482k9548K764l9164l9764Q051k0437
25797g6967N765Q2497j5124n321J914o958r46l2049j4150o40J6872o8922N4681
$$ plain form
25784 -59348 3107 42285 52545 97108 163365 101010 -6368 -15925 83740 104514 100152 119257
25772 119257 42196 37222 56483 14719 -4104 -13453 -50579 -50690 -32417 -97597 -77163 -15041
25760 -15041 10332 -29526 -18960 32506 54182 37218 61894 -6141 26516 87398 7830 584
25748 584 -6837 -19625 56876 64077 87992 85961 52861 3339 75831 111947 59628 41572 589
25735 589 -45489 -55284 403 -14602 -60838 -73598 -41564 32355 105582 111961 83838 10416
25723 10416 21348 53899 931 44839 -47546 -111985 -109115 -8740 60798 70409 83914 70207
25711 70207 41241 -35109 -33995 -33869 -6499 9076 2057 -10678 41801 72612 70074 46704 2241
25698 2241 5379 18703 -17566 -73101 -23517 70102 61618 11671 -125852 -70130 44096 114137
$$ packed form
25784e9348O2455L9178J0260M4563O6257o2355j07378r557R9665K0774m362J9105
25772A19257p7061m974J9261m1764j8823r349l7126j11J8273o5180K0434O2122
25760a5041K5373l9858J0566N1466K1676j6964K4676o8035L2657O0882p9568p246
25748E84p421j2788P6501P201K3915k031l3100m9522P2492L6116n2319j8056m0983
25735E89m6078r795N5687j5005m6236j2760L2034P3919P3227O379k8123p3422
25723A0416J0932L2551n2968M3908r2385o4439K870J00375O9538R611J3505j3707
25711G0207k8966p6350J114J26K7370J5575p019j2735N2479L0811k538k3370m4463
25698B241L138J3324l6269n5535M9584R3619q484m9947j37523N5722J14226P0041
$$ plain form
25686 114137 134827 85439 24059 23938 82278 50826 -13065 2935 49614 49169 39727 38474 33702
25673 33702 -27701 -20977 -13836 -729 4316 4401 -7889 29349 33919 -25853 -8117 42625 29334
25660 29334 5116 -19576 -26739 -6592 14346 -23148 -138276 -119456 -38525 -29886 -71666 -94937
25648 -94937 -18854 65278 88512 16164 48847 48298 -36072 -102762 -112148 -109371 -152574 -146483 -107307
25635 -107307 -154393 -144211 -143925 -134167 -76551 -73025 -76829 -91128 -32576 14823 28657 60036
25623 60036 59343 90337 84756 67727 -12544 -38966 -39005 -39059 -107207 -52942 23482 77823 69301 49072
25609 49072 35140 30485 30806 19162 72812 102125 37791 -31483 -50643 -60612 -118724 -107576
25597 -107576 -118167 -115809 -102028 -137747 -86970 -62248 3393 32426 -71241 -131979 -57143
$$ packed form
25686A14137K0690m9388o1380j21N8340l1452o3891J6000M6679m45r442j253m772
25673C3702o1403O724P141J3107N045Q5j2290L7238M570n9772J7736N0742j3291
25660B9334k4218k4692p163K0147K0938l7494j15128J8820Q0931Q639m1780k3271
25648i4937P6083Q4132K3234p2348L2683n49q4370o6690r386K777m3203O091L9176
25635a07307m7086J0182K86R758N7616L526l804j4299N8552M7399J3834L1379
25623F0036o93L0994n581j7029q0271k6422l9n4o8148N4265P6424N4341q522k0229
25609D9072j3932m655L21j1644N3650K9313o4334o9274j9160r969n8112J1148
25597a07576j0591K358J3781l5719N0777K4722O5641K9033j03667o0738P4836
$$ plain form
25586 -57143 -23889 -72626 -76221 -76446 -84921 -93401 2221 71912 162092 159396 119519 117573 29774
25573 29774 -10974 35723 31280 -6364 32908 19803 1540 7443 59933 127720 135122 124225
25561 124225 46344 37315 -4651 -61505 -27871 27634 18988 -38264 -78517 -90746 -73196 -97120
25549 -97120 -64012 -5211 -49333 -77431 -52603 -63745 -49705 -21493 -71258 -76505 -5061 32549
25537 32549 21376 -217 -65851 -102817 -64234 -3939 -15847 -2815 79999 160435 133559 25741
25525 25741 45940 35388 36886 77982 82653 30733 20905 756 3436 33980 94224 43522
25513 43522 -37131 5588 -4276 -11567 -7505 47406 34504 58441 91699 118004 87711 32873
25501 32873 24966 -18396 5476 -83061 -81479 22657 50116 113855 179511 152108 61491 74326
$$ packed form
25586e7143L3254m8737l595k25q475q480R5622O9691R0180k696l9877j946q7799
25573B9774m0748M6697m443l7644L9272j3105j8263N903N2490O7787P402j0897
25561A24225p7881r029m1966n6854L3634N5505q646n7252m0253j2229J7550k3924
25549i7120L3108N8801m4122k8098K4828j1142J4040K8212m9765n247P1444L7610
25537C2549j1173k1593o5634l6966L8583O0295j1908J3032Q2814Q0436k6876j07818
25525B5741K0199j0552J498M1096M671n1920r828k0149K680L0544O0244n0702
25513D3522q0653M2719r864p291M062N4911j2902K3937L3258K6305l0293n4838
25501C2873p907m3362K3872q8537J582J04136K7459O3739O5656k7403r0617J2835
$$ plain form
25489 74326 92721 17559 -50448 6945 36462 59323 48762 -40660 -62432 -145492 -95633 -11307
25477 -11307 4914 12265 -25753 28499 38344 3013 15094 83417 150564 127379 48984 52136
25465 52136 38064 30714 1310 39571 92542 101581 147049 101177 46506 -33627 -32297 -29939
25453 -29939 -5430 20294 -13963 -21567 -13665 -32049 -32144 29984 51301 14046 -70366 -98083 -61042
25440 -61042 35612 137704 215324 175411 92906 23156 -6702 59951 104236 121057 14730
25429 14730 -45430 -71038 -125225 -107143 -50967 -9280 49077 16385 -16050 -17190 26803 75374
25417 75374 69826 25787 -31890 -40673 -56700 -55927 -78468 -104333 -62707 -87215 -78526 -40827 -21606
25404 -21606 -52162 -40908 -45912 -35234 -72022 -70509 -47324 -31580 -15768 -7240 6877 40684
$$ packed form
25489G4326J8395p5162o8007N7393K9517K2861j0561q9422k1772q3060M9859Q4326
25477a1307J6221P351l8018N4252R845l5331J2081O8323O7147k3185p8395L152
25465E2136j4072p350k9404L8261N2971R039M5468m5872n4671q0133J330K358
25453b9939K4509K5724l4257p604P902j8384r5O2128K1317l7255q4412k7717L7041
25440f1042R6654J02092P7620l9913q2505o9750k9858O6653M4285J6821j06327
25429A4730o0160k5608n4187J8082N6176M1687N8357l2692l2435j140M3993M8571
25417G5374n548m4039n7677q783j6027P73k2541k5865M1626k4508Q689L7699J9221
25404b1606l0556J1254n004J0678l6788J513K3185J5744J5812Q528J4117L3807
$$ plain form
25392 40684 16592 9407 28085 23501 26456 56612 77833 58142 30889 -24512 -152120 -180564
25380 -180564 -58929 30012 11590 -26658 -5683 13539 44834 -34160 -72550 -44972 -34834
25369 -34834 -69077 -32166 -20763 21210 57951 96028 73448 14787 -2168 24398 28521 1038
25357 1038 84764 201138 178875 95490 30023 -61466 -17433 25609 11043 -5556 46749 19750
25345 19750 9129 -6306 -47375 -72977 -88138 -33469 -30530 -48988 -107120 -153357 -110072 -48231
25333 -48231 -15738 -28750 9189 8034 -27755 -58529 -64419 -86907 -112354 -115301 -15167 59940
25321 59940 84210 36319 -21073 -50800 1935 32503 73573 163015 107443 39976 42658 58518
25309 58518 59496 -20058 216 209 -9587 -9018 30706 53715 59296 62114 27877 -82 -48084 -113224
$$ packed form
25392D0684k4092p185J8678m584K955L0156K1221j9691k7253n5401j27608k8444
25380a80564J21635Q8941j8422l8248K0975J9222L1295p8994l8390K7578J0138
25369c4834l4243L6911J1403M1973L6741L8077k2580n8661j6955K6566M123k7483
25357A038Q3726J16374k2263q3385o5467r1489M4033M3042j4566j6599N2305k6999
25345A9750j0621j5435m1069k5602j5161N4669K939j8458n8132m6237M3285O1841
25333d8231L2493j3012L7939j155l5789l0774n890k2488k5447k947J00134P5107
25321E9940K4270m7891n7392k9727N2735L0568M1070Q9442n5572o7467K682J5860
25309E8518R78p9554K0274pr796N69L9724K3009N581K818l4237k7959m8002o5140
$$ plain form
25295 -113224 -101320 -85768 -12412 26972 79963 70707 36921 50237 -21442 -81630 -67982 29927
25283 29927 22333 51109 72084 -781 -82499 -59764 -15852 30989 34745 23672 37187 -5494
25271 -5494 13647 82835 37335 43758 15924 -12406 -33849 -25901 7912 19399 44011 43021 75323
25258 75323 83707 46730 42891 -3800 12315 28393 38315 67853 -7276 -75603 -94288 -109503
25246 -109503 -87234 -14200 9242 -13464 -54520 15392 -32478 -25988 -13362 43070 54469 50393
25234 50393 79478 71710 20610 -11611 -34710 17430 28089 43776 -24733 -41055 -63932 -61477
25222 -61477 -3919 42060 17800 -28611 -52217 -9829 -55056 -65165 -44762 -46702 -71310 -35694
25210 -35694 -61913 -43662 -56558 -75428 -78095 -46127 -25400 -61220 -124387 -116062 -43332 28097
$$ packed form
25295a13224J1904J5552P3356L9384N2991r256l3786J3316p1679o0188J3648R7909
25283B9927p594K8776K0975p2865q1718K2735M3912M6841L756j1073J3515m2681
25271e494J9141O9188m5500O423k7834k8330k1443P948L3813J1487K4612r90L2302
25258G5323Q384l6977l839m6691J6115J6078R922K9538p5129o8327j8685j5215
25246a09503K2269P3034K3442k2706m1056O9912m7870O490J2626N6432J1399m076
25234E0393K9085p768n1100l2221k3099N2140J0659J5687o8509j6322k2877K455
25222f1477N7558M5979k4260m6411k3606M2388m5227j0109K0403j940k4608L5616
25210c5694k6219J8251j2896j8870k667L1968K0727l5820o3167Q325P2730P1429
$$ plain form
25198 28097 -28326 -51608 -7458 -6166 -9707 35782 31559 -60616 -58270 2689 3727 -18514 -25948
25185 -25948 -39193 -40406 -57849 -20101 -102010 -141793 -97134 -64474 -35158 -14887 -43634 -7547
25173 -7547 6515 34606 -22898 -32494 -17008 6399 -35453 -21162 31008 -27133 -42882 14111
25161 14111 90252 116429 122613 104187 94922 106812 73240 76110 41983 -959 54217 51061
25149 51061 -14861 -47226 -55765 -22550 14614 14643 -16873 3810 -36274 -124761 -153082 -134409
25137 -134409 -74793 -70323 -132894 -94729 8157 48413 -795 57693 56528 28102 7338 -58918
25125 -58918 -9343 6511 -46001 -48387 5935 13923 82752 79577 95444 76578 17674 -56860
25113 -56860 -73584 -11926 14877 8830 62448 92449 92302 56273 68692 30621 -23509 -19364
$$ packed form
25198B8097n6423k3282M4150J292l541M5489m223r2175K346O0959J038k2241p434
25185b5948j3245j213j7443L7748q1909l9783M4659L2660K9316K0271k8747L6087
25173g547J4062K8091n7504r596J5486K3407m1852J4291N2170n8141j5749N6993
25161A4111P6141K6177O184j8426r265J1890l3572K870l4127m2942N5176l156
25149E1061o5922l2365q539L3215L7164K9l1516K0683m0084q8487k8321J8673
25137a34409N9616M470o2571L8165J02886M0256m9208N8488j165k8426k0764o6256
25125e8918M9575J5854n2512k386N4322P988O8829l175J5867j8866n8904p4534
25113e6860j6724O1658K6803o047N3618L0001j47l6029J2419l8071n4130M145
$$ plain form
25101 -19364 -49432 -9417 47341 -32508 -93730 -95861 -104786 -104125 -157501 -188521 -101219 4736
25089 4736 124271 165439 155053 142517 107120 48954 57693 29083 -27260 -27341 41785 13177
25077 13177 -44571 -63992 -21122 -23940 -9556 17930 11666 35500 37783 36975 67695 79292 52964
25064 52964 32258 -8485 -80771 -85003 -75066 -56419 -22877 25598 1619 -3134 -32051 -31855 -42818
25051 -42818 -35629 -30530 -38234 -21244 -8387 -15073 -1621 -26660 1899 47120 30092 49943
25039 49943 25180 -19496 697 22499 36270 88338 -2362 -48119 -3180 69512 105555 118146
25027 118146 101183 -33679 -96331 -55594 16127 30002 52991 10377 -32011 -42710 -34542
25016 -34542 -28380 -6083 -620 -71275 -64415 39794 62441 46459 96491 120985 46289 1800
$$ packed form
25101a9364l0068M0015N6758p9849o1222k131q925O61n3376l1020Q7302J05955
25089D736J19535M1168j0386j2536l5397n8166Q739k8610n6343q1O9126k8608
25077A3177n7748j9421M2870k818J4384K7486o264K3834K283q08L0720J1597k6328
25064E2964k0706m0743p2286m232R937J8647L3542M8475k3979m753k8917J96j0963
25051d2818P189N099p704J6990J2857o686J3452k5039K8559M5221j7028J9851
25039D9943k4763m4676K0193K1802J3771N2068r0700m5757M4939P2692L6043J2591
25027A18146j6963j34862o2652M0737P1721J3875K2989m2614m2388j0699Q168
25016c4542O162K2297N463p0655O860J04209K2647j5982N0032K4494p4696m4489
$$ plain form
25004 1800 19106 15387 -40710 -42034 -14137 32752 48770 89223 81121 87113 72794 -19255 -88277
24991 -88277 -50722 -65617 -38587 -42086 -70159 -63319 -10497 4158 -37444 -24507 -57710 -43981
24979 -43981 24323 48842 55611 38913 46340 26322 -5646 26927 21119 -57345 -22940 18283
24967 18283 5932 -36219 -68097 -80370 -39264 59672 56648 71631 125075 84858 15841 37323
24955 37323 96451 47748 -6217 25183 9882 -48952 -99914 -138821 -108687 -15465 25578 8363
24943 8363 -12436 16481 -13212 -34397 -18825 -16353 -9923 -36521 -24018 -86409 -140495 -103892
24931 -103892 -108309 -77182 -24548 -57790 -49087 -6558 -8620 -22039 -78073 -104213 -39647 48391
24919 48391 50102 -88759 -106210 -53148 -58852 -35896 26768 11046 -34195 -116546 -121302 -66966
$$ packed form
25004A800J7306l719n6097j324K7897M6889J6018M0453q102N992j4319r2049o9022
24991h8277L7555j4895K7030l499k8073O840N2822J4655m1602J2937l3203J3729
24979d3981O8304K4519O769j6698P427k0018l1968L2573n808p8464L4405M1223
24967A8283j2351m2151l1878j2273M1106R8936l024J4983N3444m0217o9017K1482
24955C7323N9128m8703n3965L1400j5301n8834n0962l8907L0134R3222M1043j7215
24943H363k0799K8917k9693k1185J5572K472O430k6598J2503o2391n4086L6603
24931a03892m417L1127N2634l3242Q703M2529k062j3419n6034k6140O4566Q8038
24919D8391J711j38861j7451N3062n704K2956O2664j5722m5241q2351m756N4336
$$ plain form
24907 -66966 -69651 -76697 -4158 54478 71495 18409 9857 13358 -33331 20927 29592 56828 44783
24894 44783 10006 -45701 -62931 -45707 -20983 -3988 30576 103083 82314 21899 -7738 70349
24882 70349 84239 -17833 -34830 -47833 -31230 -16659 -962 -22401 -81167 -53328 -16438
24871 -16438 2989 10285 -13394 70744 87092 45314 55868 57652 40870 55275 78895 106546
24859 106546 65901 92319 54793 21570 -1230 -11238 -13396 49285 73658 56664 18477 -27731
24847 -27731 -34575 14016 98732 151863 61487 45885 94289 53920 -32720 -69923 -57342 -98617
24835 -98617 -39452 55962 119828 129352 118993 67872 9989 33263 38256 72 -11083 -2049
24823 -2049 -23365 -70319 -48872 -39002 22281 48801 44338 18744 110056 121025 106934 48432
$$ packed form
24907f6966k685p046P2539N8636J7017n3086q552L501m6689N4258Q665K7236j2045
24894D4783l4777n5707j7230J7224K4724J6995L4564P2507k0769o0415k9637P8087
24882G0349J3890j02072j6997j3003J6603J4571J5697k1439n8766K7839L6890
24871a6438J9427P296k3679Q4138J6348m1778J0554J784j6782J4405K3620K7651
24859A06546m0645K6418l7526l3223k2800j0008k158O2681K4373j6994l8187m6208
24847b7731o844M8591Q4716N3131r0376j5602M8404m0369q6640l7203J2581m1275
24835i8617N9165R5414O3866R524j0359n1121n7883K3274M993l8184j1155R034
24823b049k1316m6954K1447R870O1283K6520m463k5594R1312J0969j4091n8502
$$ plain form
24811 48432 41356 57765 33844 -59253 -59573 9398 -1138 -47773 -36853 -68213 -105185 -46797
24799 -46797 44675 35743 39827 26413 42873 82632 49848 -8616 -18547 26910 19581 1665
24787 1665 -29829 -24943 8725 39672 19876 45727 94783 63842 -4562 -20615 37879 76432
24775 76432 42177 78003 97663 74396 19161 19814 33803 34929 3938 -22640 14855 29008
24763 29008 68624 110956 70356 17129 85519 132899 23080 -35432 -46027 -28119 -6444
24752 -6444 -382 -60476 20428 38813 2260 -10519 21466 62798 32595 -15080 -12755 -44419
24740 -44419 -56299 -138199 -205027 -140473 -39854 -9749 -35349 -30765 -15112 22894 69412 59828
24728 59828 43923 -12403 -26088 -21069 -20621 -59382 -25300 46937 22329 -71101 -20205 62294
$$ packed form
24811D8432p076J6409k3921r3097l20O8971j0536m6635J0920l1360l6972N8388
24799d6797R1472q932M084j3414J6460L9759l2784n8464r931M5457p329j7916
24787A665l1494M886L3668L0947j9796K5851M9056l0941o8404j6053N8494L8553
24775G6432l4255L5826J9660k3267n5235O53J3989J126l0991k6578L7495J4153
24763B9008L9616M2332m0600n3227O8390M7380j09819n8512j0595J7908K1675
24752f444O062o0094Q0904J8385l6553j2779L1985M1332l0203m7675K325l1664
24740d4419j1880q1900o6828O4554J00619L0105k5600M584J5653L8006M6518r584
24728E9828j5905n6326j3685N019M48l8761L4082P2237k4608r3430N0896Q2499
$$ plain form
24716 62294 56444 23329 -50153 -101122 -65763 -14756 -75970 -69497 -33415 -34705 -82761 -78094
24704 -78094 -72298 -93914 -66882 -23247 6431 82350 41064 5020 -29421 -93891 -73444 -43379
24692 -43379 -73484 -86446 -40864 17644 49807 17316 16371 49497 128440 140232 61599 27376
24680 27376 -11014 -14386 -38232 -8956 29071 46968 41631 -11974 -49367 -11627 -7738 -32130
24668 -32130 -79279 9613 58711 67356 113637 129077 117431 70557 43650 41554 56564 64972
24656 64972 12396 -14226 880 -44133 -72505 -81886 -113532 -137030 -127246 -120913 -128308 -57983
24644 -57983 -395 -44 -22873 -50398 -89743 -87368 -79364 -88062 -57112 -105119 -161229 -108731 -46427
24631 -46427 -72201 -43907 65241 62110 6383 -42628 -15876 -31999 -54140 -72585 -84712 -47473
$$ packed form
24716F2294n850l3115p3482n0969L5359N1007o1214O473L6082j290m8056M667
24704g8094N796k1616K7032M3635K9678P5919m1286l6044l4441o4470K0447L0065
24692d3379l0105j2962M5582N8508L2163l2491r45L3126P8943J1792p8633l4223
24680B7376l8390l372k3846K9276L8027J7897n337n3605l7393L7740L889k4392
24668c2130m7149Q8892M9098Q645M6281J5440j1646m6874k6907k096J5010Q408
24656F4972n2576k6622J5106m5013k8372r381l1646k3498R784O333p395P0325
24644e7983N7588L51k2829k7525l9345K375Q004q698L0950m8007n6110N2498O2304
24631d6427k5774K8294J09148l131n5727m9011K6752j6123k2141j8445j2127L7239
$$ plain form
24619 -47473 -2066 -26005 -3094 36663 -5479 25825 5326 -31868 14745 4346 -65075 -93273
24607 -93273 -93408 -94870 -71070 -41016 -78896 -132676 -100125 -12364 21629 21602 23339 -6441 2308
24594 2308 -4838 -81230 -75043 -53154 -72847 -128680 -74916 -16085 -12167 -70937 -20709 -27821 -27527
24581 -27527 15055 58425 47689 26123 998 -38964 -22871 -2890 33951 86146 104516 31157
24569 31157 21926 43759 13367 -19263 -89456 -131198 -107678 -63367 -812 8360 -99322 -150831
24557 -150831 -115990 -106552 -96759 -71128 1290 55556 65061 106405 44435 8664 -50062 -52890
24545 -52890 -60083 -64055 -49784 -26287 -29068 -70753 -87089 -52978 -40876 25791 70763 76179
24533 76179 32558 -17527 -78118 -104532 -42063 -3698 28504 -36857 -31302 15397 -27844 -103564
$$ packed form
24619d7473M5407k3939K2911L9757m2142L1304k0499l7194M6613j0399o9421k8198
24607i3273j35j462K3800L0054l7880n3780L2551Q7761L3993k7J737k9780Q749
24594B308p146p6392O187K1889j9693n5833N3764N8831L918n8770N0228p112K94
24581b7527M2582M3370j0736k1566k5125l9962J6093J9981L6841N2195J8370p3359
24569C1157r231K1833l0392l2630p0193m1742K3520M4311O2555R172j07682n1509
24557a50831L4841R438R793K5631P2418N4266R505M1344o1970l5771n8726k828
24545e2890p193l972J4271K3497k781m1685j6336L4111J2102O6667M4972N416
24533G6179m3621n0085o0591k6414O2469L8365L2202o5361N555M6699m3241p5720
$$ plain form
24521 -103564 -173968 -140840 -72121 -79691 -36015 -6279 16690 35277 10427 -27013 -75473 -39327
24509 -39327 9962 35719 51133 41356 2026 -27702 -25766 2884 42305 71044 17256 17107
24497 17107 -67246 -120899 -132937 -146355 -138091 -162325 -96157 -41988 57684 52577 4445 -26256
24485 -26256 64463 94950 100840 15228 -109341 -170501 -61580 58060 21599 -30613 -81372
24474 -81372 -40794 6008 -15286 5688 -65237 -80941 -81685 -53050 -45324 -69938 -63481 -57972 -46717
24461 -46717 -7149 2789 -36125 -86752 -86091 -51302 -1552 74081 88525 44670 -21712 -43562
24449 -43562 -25928 21728 -4923 -61234 -78892 -79123 -1916 22646 31264 50884 29398 -6070
24437 -6070 -22642 41642 46052 20827 -5772 -29154 -31769 50390 81154 65585 89429 82114
$$ packed form
24521a03564p0404L3128O8719p570M3676K9736K2969J8587k4850l7440m8460L6146
24509c9327M9289K5757J5414r777l9330k9728J936K8650L9421K8739n3788j49
24497A7107q4353n3653j2038j3418Q264k4234O6168N4169R9672n107m8132l0701
24485b6256R0719L0487N890q5612j24569o1160J08921J19640l6461n2212n0759
24474h1372M0578M6802k1294K0974p0925j5704p44K8635P726k4614O457N509J1255
24461d6717L9568R938l8914n0627O61L4789M9750P5633J4444m3855o6382k1850
24449d3562J7634M7656k6651n6311j7658k31P7207K4562Q618J9620k1486l5468
24437f070j6572O4284M410k5225k6599k3382k615Q2159L0764j5569K3844p315
$$ plain form
24425 82114 -22788 -22473 -15843 -30651 -45957 -48749 -26824 6526 -40936 -122270 -129307 -53912
24413 -53912 18139 -12499 -40866 -27905 -39169 -22727 -68627 -40183 2669 77175 101738 107216
24401 107216 46421 11468 -10003 45871 121610 81611 41897 -4419 77481 76904 12289 37204
24389 37204 6055 -87538 -131911 -102033 -70109 -95985 -139887 -175993 -234893 -147364 -62414 -44520
24377 -44520 -2001 -2043 17360 58626 26830 -25308 -123226 -98184 -28643 -57774 -71994 23881
24365 23881 81862 69783 51788 3886 -34233 -78496 -112501 -103771 -42215 4539 19341 -18553
24353 -18553 -26427 53314 20779 -73721 -66744 -54877 -35140 -20373 -12789 -14325 -95896 -113487
24341 -113487 -79076 -86400 -114369 -68463 -11416 2536 -14466 -63446 -68798 8875 15527 -9499
$$ packed form
24425H2114j04902L15O630j4808j5306k792K1925L3350m7462q1334p037P5395
24413e3912P2051l0638k8367J2961j1264J6442m5900K8444M2852P4506K4563N478
24401A07216o0795l4953k1471N5874P5739l9999l9714m6316Q1900n77o4615K4915
24389C7204l1149r3593m4373K9878L1924k5876m3902l6106n8900Q7529Q4950J7894
24377d4520M2519m2J9403M1266l1796n2138r7918K5042O9541k9131j4220R5875
24365B3881N7981j2079j7995m7902l8119m4263l4005Q730O1556M6754J4802l7894
24353a8553p874P9741l2535r4500O977J1867J9737J4767P584j536q1571j7591
24341a13487L4411p324k7969M5906N7047J3952j7002m8980n352P7673O652k5026
$$ plain form
24329 -9499 11305 -1300 -50535 -84322 -110553 -68405 -59846 -89551 -123485 -111641 -37184 -15127
24317 -15127 1938 15364 4708 8580 77319 71882 78351 46907 -3333 -44286 7172 97819
24305 97819 53460 -47690 -95158 -34172 -10694 -15957 -13720 32205 -37152 -44501 -31718 -13474
24293 -13474 -4437 -56963 -66147 -5950 39279 15696 -22460 -29346 -60022 -16503 35362 -15343
24281 -15343 -17483 -11778 -87804 -94654 -84131 -120991 -106001 -39556 4292 27977 -31686 -61026
24269 -61026 -11961 9038 16382 42290 18237 50171 51173 19392 -4968 32507 23960 -154
24257 -154 45838 55241 6229 -28252 -49235 -26732 -78700 -71990 -30039 -48584 -57962 -4239 17556
24244 17556 35299 112535 87423 38463 103906 73428 -20366 -66295 -105958 -111066 -27671 -12309
$$ packed form
24329i499K0804j2605m9235l3787k6231M2148Q559k9705l3934J1844P4457K2057
24317a5127J7065J3426j0656L872O8739n437O469l1444n0240m0953N1458R0647
24305I7819m4359j01150m7468O0986K3478n263K237M5925o9357p349J2783J8244
24293a3474R037n2526r184O0197M5229k3583l8156o886l0676M3519N1865n0705
24281a5343k140N705p6026o850J0523l6860J4990O6445M3848K3685n9663k9340
24269f1026M9065K0999P344K5908k4053L1934J002l1781k4360L7475q547k4114
24257a54M5992R403m9012l4481k0983K2503n1968O710M1951j8545r378N3723K1795
24244A7556J7743P7236k5112m8960O5443l0478r3794m5929l9663n108Q3395J5362
$$ plain form
24232 -12309 14284 5439 -25093 -49474 -57497 -76890 -57575 -60349 -18990 29530 16904 26007
24220 26007 -52836 -115213 -111628 -67860 -90343 -94226 -47803 -40456 -24473 26570 60846 13560
24208 13560 -17459 -27478 26531 4841 -5322 32710 81399 91419 71166 8150 -63184 -65655
24196 -65655 -99508 -50441 -2949 50344 66223 27590 14716 -67535 -72210 -19755 15859 -20916
24184 -20916 -52226 -42421 -10977 27033 73192 94891 88110 98506 -8618 -91224 -48292 -28092
24172 -28092 -19516 25446 65140 74083 79799 80840 79409 37451 53377 5991 42047 54609 73670
24159 73670 97633 14067 39010 84463 136386 99981 49431 94548 155979 185016 128264 59822
24147 59822 -36523 -83381 -95035 -56906 -20273 -15147 -14847 -5928 -126564 -116125 -66843 -22298
$$ packed form
24232a2309K6593q845l0532k4381q023j9393J9315k774M1359M8520j2626R103
24220B6007p8843o2377L585M3768k2483l883M6423P347J5983N1043L4276m7286
24208A3560l1019j0019N4009k1690j0163L8032M8689J0020k0253o3016p1334k471
24196f5655l3853M9067M7492N3293J5879l8633j2874q2251m675N2455L5614l6775
24184b0916l1310R805L1444L8010M6159K1699o781J0396j07124q2606M2932K0200
24172b8092Q576M4962L9694Q943N716J041j431m1958J5926m7386L6056J2562J9061
24159G3670K3963q3566K4943M5453N1923l6405n0550M5117O1431K9037n6752o8442
24147E9822r6345m6858j1654L8129L6633N126L00Q919j20636J0439M9282M4545
$$ plain form
24135 -22298 -23312 -35157 -49187 -30629 20402 27643 -84308 -6568 28090 1958 -36452 -62622
24123 -62622 -82343 -53001 30647 51969 13060 58689 -22776 -20627 -16223 -37491 -39734 -41772
24111 -41772 -87519 -27094 38649 -28843 -51371 -41073 -59730 -30854 95811 170728 150598
24100 150598 114015 50171 17580 42308 35136 91129 106596 33198 7916 -6267 -105210 -134802
24088 -134802 -120545 -47139 -62318 -124758 -149123 -85802 -37157 1578 20751 -48494 7180
24077 7180 38063 47915 62802 22082 -85014 -114988 -34419 -21046 32091 39743 66556 86494
24065 86494 49894 -75583 -69460 58353 69018 58381 74267 59003 86613 62477 -70545
24054 -70545 -149739 -115501 -82765 -58012 -93723 -104826 -138703 -168756 -113853 4025 -25968
$$ packed form
24135b2298j014j1845j4030J8558N1031P241j11951P7740L4658k6132l8410k6170
24123f2622j9721K9342Q3648K1322l8909M5629q1465K149M404k1268k243k038
24111d1772m5747O0425O5743o7492k2528J0298j8657K8876J26665P4917k0130
24100A50598l6583o3844l2591K4728p172N5993J5467p3398k5282j4183r8943k9592
24088a34802J4257P3406j5179o2440k4365O3321M8645L8735J9173o9245N5674
24077G180L0883R852J4887m0720j07096k9974Q0569J3373N3137P652K6813J9938
24065H6494l6600j25477O123J27813J0665j0637J5886j5264K7610k4136j33022
24054g0545p9194L4238L2736K4753l5711j1103l3877l0053N4903J17878k9993
$$ plain form
24043 -25968 -79528 -27551 6401 12532 -4373 17047 74598 140585 96148 24947 -24706 2884
24031 2884 27973 35724 34717 20411 24540 34008 31079 -2919 -28214 -8005 12241 38240 -40037
24018 -40037 37641 140561 968 -71007 -71997 -35265 -25252 49616 113041 31870 -28436 36520
24006 36520 129694 129726 73854 44947 16857 42398 22277 -9830 -36494 -17612 -50764 -56139
23994 -56139 -27949 -67940 -681 35246 -1445 14104 64970 24479 -38117 -42654 48099 135567
23982 135567 124802 45957 -11142 -46030 -74540 -43016 -18035 -71303 -104253 -97096 -95418 -23310
23970 -23310 19849 22080 -48352 -105684 -102465 -25902 -39886 -74191 -75296 -73136 -58315 -76984
23958 -76984 -49323 -17522 -23895 -9598 -9157 -50545 -40039 -1892 -19276 29071 125486 127486
$$ packed form
24043b5968n3560N1977L3952O131j6905K1420N7551O5987m4437p1201m9653K7590
24031B884K5089P751j007j4306M129R468k929l3998k5295K0209K0246K5999p8277
24018d0037P7678J02920j39593p1975r90L6732J0013P4868O3425q1171o0306O4956
24006C6520R3174L2n5872k8907k8090K5541k0121l2107k6664J8882l3152n375
23994e6139K8190l9991O7259L5927l6691J5549N0866m0491o2596m537R0753Q7468
23982A35567j0765p8845n7099l4888k8510L1524K4981n3268l2950P157J678P2108
23970b3310M3159K231p0432n7332L219P6563j3984l4305j105K160J4821j8669
23958g6984K7661L1801o373J4297M41m1388J0506L8147j7384M8347R6415K000
$$ plain form
23946 127486 58492 27313 -13645 14787 88713 18471 53804 124743 65391 20989 32287
23935 32287 -11138 -45105 1331 82203 113070 68677 22236 98827 171021 169697 105895 84393
23923 84393 -2883 -32834 -15464 -32716 -4224 -47308 -189552 -220890 -130574 -76646 -66754 -22406
23911 -22406 -14641 -55462 -84432 -82193 -95784 -75643 -99693 -38347 -19002 -42342 -38999 -56128
23899 -56128 -65683 -144150 -160374 -60086 -17919 27112 -9849 -65993 -101007 -63282 -3078 23289
23887 23289 84758 120608 80555 108632 66177 19404 -12358 -24540 -25950 -50944 7961 51604
23875 51604 25850 39254 -14882 -40312 -74405 -78490 -77020 -62776 -121859 -140247 -107754 -60403
23863 -60403 -26125 -36326 12678 17222 53891 60878 66179 65545 56926 17914 35986 -6281 -76079
$$ packed form
23946A27486o8994l1179m0958K8432P3926p0242L5333P0939n9352m4402J1298
23935C2287m3425l3967M6436Q0872L0867m4393m6441P6591P2194j324o3802k1502
23923H4393q7276k9951J7370j7252K8492m3084j42244l1338R0316N3928R892M4348
23911b2406P765m0821k8970K239j3591K0141k4050O1346J9345k3340L343j7129
23899e6128r555p8467j6224J00288M2167M5031l6961n6144l5014L7725O0204K6367
23887B3289O1469L5850m0053K8077m2455m6773l1762j2182j410k4994N8905M3643
23875E1604k5754J3404n4136k5430l4093m085J470J4244n9083j8388L2493M7351
23863f0403L4278j0201M9004M544L6669O987N301o34q619l9012J8072m2267o9798
$$ plain form
23850 -76079 -91641 -37354 -31009 -35907 5054 76013 24172 -6600 4181 17516 -13747 -10026
23838 -10026 -27853 -38730 -97534 -128194 -53905 -46962 -66623 -108653 -83168 -101449 -111802 -73844
23826 -73844 -51680 -93064 -57561 -68007 -97214 -97228 -15288 -12118 -43363 -35823 -43703 -61834 -103390
23813 -103390 -147723 -117927 -43519 -7955 72441 74195 10562 -14115 5016 19160 59183 47270
23801 47270 7909 -90224 -42571 19038 -2760 -49044 -37186 -77829 -74791 -11415 8249 27605
23789 27605 47322 -6608 -60933 -40874 -2920 -50848 -22346 -32576 -13952 -57814 -48936 -48288
23777 -48288 -13586 -42077 6007 81117 16676 -28192 -48576 -33799 25856 26003 -2200 40157
23765 40157 18792 -22283 -18832 10540 3537 22287 42931 55936 68733 -8770 -73372 -112776
$$ packed form
23850g6079j5562N4287O345m898M0961P0959n1841l0772J0781J3335l1263L721
23838a0026j7827j0877n8804l0660P4289O943j9661m2030K5485j8281j0353L7958
23826g3844K2164m1384L5503j0446k9207j4Q1940L170l1245P540p880j8131m1556
23813a03390m4333K9796P4408L5564Q0396J754o3633k4677J9131J4144M0023j1913
23801D7270l9361r8133M7653O1609k1798m6284J1858m0643L038O3376J9664J9356
23789B7605J9717n3930n4325K0059L7954m7928K8502j0230J8624m3862Q878O48
23777d8288L4702k8491M8084P5110o4441m4868k0384J4777N9655J47k8203M2357
23765D0157k1365m1075L451K9372p003J8750K0644J3005J2797p7503o4602l9404
$$ plain form
23753 -112776 -75040 -33934 -11455 -22396 -334 51772 34570 46477 73009 92969 76019
23742 76019 12891 17695 17521 18856 -18733 -32703 41499 72526 95550 51207 -15166 -43848
23730 -43848 -25199 -72976 -93754 -56548 16864 -13721 -61115 -35492 -47594 -17502 -29933 -39363
23718 -39363 -39831 27488 47509 5529 -8286 -39647 1022 -15434 -98474 -69976 -26298 -12171
23706 -12171 -6731 -23758 -12274 47950 68479 34484 24135 9595 -25463 1111 86480 54664
23694 54664 88100 32374 -51530 -33309 16141 27492 71170 68230 -10286 -50281 10799 48413
23682 48413 25372 262 23056 27276 647 34540 25593 51745 39603 75509 73399 102158
23670 102158 86980 73846 101295 100223 23991 35461 18795 2585 930 3991 5583 14438
$$ packed form
23753a12776L7736M1106K2479j0941K2062N2106j7202J1907K6532J9960j6950
23742G6019o3128M804j74J335l7589j3970P4202L1027K3024m4343o6373k8682
23730d3848J8649m7777k0778L7206P3412l0585m7394K5623j2102L0092j2431r430
23718c9363m68O7319K0021m1980j3815l1361M0669j6456q3040K8498M3678J4127
23706a2171N440j7027J1484O0224K0529l3995j0349j4540l5058K6574Q5369l1816
23694E4664L3436n5726q3904J8221M9450J1351M3678k940p8516l9995O1080L7614
23682D8413k3041k5110K2794M220k6629L3893q947K6152j2142L5906k110K8759
23670A02158j5178j3134K7449j072p6232J1470j6666j6210j655L061J592Q855
$$ plain form
23658 14438 41286 74763 60182 -23426 -57949 -33158 -17499 -84808 -107931 -102386 -58821 -100564
23646 -100564 -118223 -67393 38813 52769 7072 46358 23417 10866 -49725 -58419 -61450 -80229
23634 -80229 -68241 38874 53433 -84705 -129273 -142056 -149282 -115993 -110582 -102497 -71789 -38100
23622 -38100 22038 -31005 -151623 -160418 -81747 -17358 18681 14823 -23823 -67329 -58445 -9360
23610 -9360 40860 38010 23084 37368 71962 23024 20050 22753 37776 43866 43245 -5217 51809
23597 51809 46104 48033 99214 44822 -66406 -162546 -59228 1097 -13217 22326 31645 15431
23585 15431 -51585 -89558 -100492 -28554 -845 -26038 -65296 -52617 -32218 -17357 -27442 -12167
23573 -12167 14466 24326 24953 -21024 -41585 -57677 -22575 -41292 -10359 7656 -37236 -50267
$$ packed form
23658A4438K6848L3477j4581q3608l4523K4791J5659o7309k3123N545M3565m1743
23646a00564j7659N0830J06206J3956m5697L9286k2941j2551o0591q694l031j8779
23634h0229J1988J07115J4559j38138m4568j2783p226L3289N411Q085L0708L3689
23622c8100O0138n3043j20618q795P8671O4389L6039l858l8646m3506Q884M9085
23610i360N0220k850j4926J4284L4594m8938k974K703J5023O090o21m8462N7026
23597E1809n705J929N1181n4392j11228r6140J03318O0325j4314L5543R319j6214
23585A5431o7016l7973j0934P1938K7709k5193l9258J2679K0399J4861j0085J5275
23573a2167K6633R860O27m5977k0561j6092L5102j8717L0933J8015m4892j3031
$$ plain form
23561 -50267 -65740 -91604 -34659 -10627 2961 -31162 -13180 41394 -32280 -20286 -17866 -42439
23549 -42439 4546 36027 51803 3103 87468 157593 102080 32452 -33267 -113337 -196034 -196132
23537 -196132 -149377 -140873 -111771 -57533 -61129 -24399 -41546 7213 44853 16255 -1467 -2879
23525 -2879 -57703 -96748 -37382 -87205 -55048 4649 62915 92023 105230 41144 5412 -35162
23513 -35162 -117272 -133832 -84750 -77253 -34539 -94288 -109361 -107180 -51284 -43351 -62485 -78583
23501 -78583 -25984 -4117 -55246 -129258 -154036 -230252 -149078 -50302 -14994 -46699 -34722 30048
23489 30048 45766 -16915 -18956 -42292 -85071 -111354 -92896 -82845 -70191 -51748 -108033 -118005
23477 -118005 -73458 -39387 -25881 -23577 -57927 -31665 14968 -46854 -75179 -91540 -73925 -36558
$$ packed form
23561e0267j5473k5864N6945K4032J3588l4123J7982N4574p3674J1994K420k4573
23549d2439M6985L1481J5776m8700Q4365P0125n5513o9628o5719q0070q2697r8
23537a96132M6755Q504K9102N4238l596L6730j7147M8759L7640k8598j7722j412
23525b879n4824l9045N9366m9823L2157N9697N8266K9108J3207o4086l5732m0574
23513c5162q2110j6560M9082P497M2714n9749j5073K181N5896P933j9134j6098
23501g8583N2599K1867n1129p4012k4778p6216Q1174R8776L5308l1705J1977O4770
23489C0048J5718o2681k041k3336m2779k6283J8458J0051J2654J8443n6285r972
23477a18005M4547L4071J3506K304l4350K6262M6633o1822k8325j6361J7615L7367
$$ plain form
23465 -36558 -30253 -83434 -61624 -76659 -102646 -134555 -110871 -143967 -160103 -89229 -63772 -84859
23453 -84859 -33152 17468 -12939 -55314 -127205 -135383 -43453 42073 62681 56770 46628 55976
23441 55976 78 20792 26042 -11209 68839 81610 132267 138404 123353 125821 53372 -18302
23429 -18302 -93602 -82791 -25357 -28778 -6174 -48752 -38964 -35167 -42769 -68128 -83571 -34047
23417 -34047 -24729 16408 48027 73163 55906 -34490 -92438 -35247 -5727 -26247 -31088 -5198
23405 -5198 15834 56039 75558 86273 4687 -55461 -63321 -70720 -71308 -115019 -111135 -87933 -126869
23392 -126869 -159383 -125772 -91831 2223 25456 -48541 -54595 -2163 -7046 -39454 -67975 -78240
23380 -78240 -34804 34546 36165 58035 -8289 -119997 -61405 15154 8466 9326 12597 3549 -76141
$$ packed form
23465c6558O305n3181K1810j5035k5987l1909K3684l3096j6136P0874K5457k1087
23453h4859N1707N0620l0407m2375p1891q178R1930Q5526K0608n911j0142R348
23441E5976n5898K0714N250l7251Q0048J2771N0657O137j5051K468p2449p1674
23429a8302p5300J0811N7434l421K2604m2578R788L797p602k5359j5443M9524
23417c4047R318M1137L1619K5136j7257r0396n7948N7191K9520k0520m841K5890
23405e198K1032M0205J9519J0715q1586o0148p860p399n88m3711L884K3202l8936
23392a26869l2514L3611L3941R4054K3233p3997o054N2432m883l2408k8521j0265
23380g8240M3436O9350J619K1870o6324j11708N8592P6559o688Q60L271r048p9690
$$ plain form
23367 -76141 -123535 -19208 87006 59230 -24468 8865 32037 49495 28306 40129 -21074
23356 -21074 18673 55524 36977 21887 4180 -82523 -134426 -146033 -96207 -60039 -19504 31627
23344 31627 7695 -63652 -83930 -45240 -1976 -36367 -62866 -54735 -26448 -2670 16097 -38889
23332 -38889 -52457 -45377 -36247 -8101 -20617 -34336 -47164 -50683 29101 93849 79795 76806
23320 76806 49997 49786 39904 19328 -10571 -37165 -19520 21800 5093 -56763 -79468 -4999
23308 -4999 -54154 -57655 -16089 -35285 14560 40829 91718 55110 -52317 -65432 -79854 -84678
23296 -84678 -69874 55902 91515 63319 -3970 -67593 -64975 -81474 -92625 -93009 -116675 -45369
23284 -45369 3923 -32976 -43236 -15956 -4716 99356 83244 29741 -69384 -76358 -126260 -174585
$$ packed form
23367g6141m7394J04327J06214k7776q3698L3333K3172J7458k1189J1823o1203
23356b1074L9747L6851j8547j5090j7707q6703n1903j1607M9826L6168M0535N1131
23344C1627k3932p1347k0278L8690M3264l4391k6499Q131K8287K3778J8767n4986
23332c8889j3568P080R130K8146j2516j3719j2828l519P9784O4748j4054k989
23320G6806k6809k11r882k0576k9899k6594J7645M1320j6707o1856k2705P4469
23308d999m9155l501M1566j9196M9845K6269N0889l6608j07427j3115j4422m824
23296h4678J4804J25776L5613k8196o7289o3623K618j6499j1151l84k3666P1306
23284d5369M9292l6899j0260K7280J1240J04072j6112n3503r9125o974m9902m8325
$$ plain form
23272 -174585 -167354 -92871 -54811 -48955 -6765 24600 26578 68558 87402 166261 139156 73036
23260 73036 39897 -38085 -23757 -15850 49448 74204 46093 3326 41370 111441 73641 42154
23248 42154 22538 -42473 -81470 1277 20500 36714 -12291 -68598 -3680 -20924 -26210 -23298
23236 -23298 2635 -24069 -24842 18021 -62784 -126636 -133459 -147967 -102328 -16544 87798 49866
23224 49866 -20636 8867 40809 22349 79802 135261 113399 34698 -30333 -97466 -77827 -26326
23212 -26326 29202 48127 89478 54991 -51752 -37668 -9724 23546 7607 -14260 -26192
23201 -26192 -55051 -43737 -16657 46000 12438 -44322 -21019 -9190 30505 63308 53185 38656
23189 38656 21606 -6073 -31589 -61894 -26050 51560 133031 124567 56379 61347 100230 75546
$$ packed form
23272a74585P231P4483L8060N856M2190L1365J978M1980J8844P8859k7105o6120
23260G3036l3139p7982J4328P907O5298K4756k8111m2767L8044P0071l7800l1487
23248D2154j9616o5011l8997Q2747J9223J6214m9005n6307O4918j7244n286K912
23236b3298K5933k6704p73M2863q0805o3852o823j4508M5639Q5784J04342l7932
23224D9866p0502K9503L1942j8460N7453N5459k1862p8701o5031o7133J9639N1501
23212b6326N5528J8925M1351l4487j06743J4084K7944L3270j5939k1867j1932
23201b6192k8859J1314K7080O2657l3562n6760K3303J1829L9695L2803j0123j4529
23189C8656j7050k7679k5516l0305L5844P7610Q1471q464o8188M968L8883k4684
$$ plain form
23177 75546 67224 64633 72087 31706 -103277 -151759 -82250 -25294 -68004 -57156 -37793 670
23165 670 20906 -1949 42342 29968 -8213 -12511 4211 80919 126625 98351 21649 -26069
23153 -26069 -56038 -58503 -34336 8160 43333 65953 -40168 -60295 -31600 -87432 -54327 -2591
23141 -2591 5522 -26607 32206 51442 20048 -5299 30819 86116 57558 83105 9575 -45807
23129 -45807 -26890 -1138 8606 -26110 -16123 20689 92708 122308 131279 115257 46342 -6749
23117 -6749 2169 -26761 -28497 -56628 -46971 17822 38889 33840 50672 2234 22242 83907 83943
23104 83943 35175 -20007 -2339 29149 86962 124239 128189 48152 45816 65503 102189 136000
23092 136000 127480 84425 111554 122237 164894 199191 281751 343197 468697 611285 804711
$$ packed form
23177G5546q322k591P454m0381j34983m8482O9509N6956m2710J0848J9363L8463
23165F70K0236k2855M4291j2374l8181m298J6722P6708M5706k8274p6702m7718
23153b6069k9969k465K4167M2496L5173K2620j06121k0127K8695n5832L3105N1736
23141b591Q113l2129N8813J9236l1394k5347L6118N5297k8558K5547p3530n5382
23129d5807J8917K5752R744l4716R987L6812P2019K9600Q971j6022o8915n3091
23117f749Q918k8930j736k8131R657O4793K1067n049J6832m8438K0008O1665L6
23104H3943m8768n5182J7668L1488N7813L7277L950q0037k336J9687L6686L3811
23092A36000q520m3055K7129J0683M2657L4297Q2560O1446J25500J42588J93426
$$ plain form
23081 804711 1125556 1606412 2140633 2637816 3006636 3017461 2710885 2241812 1778783 1315120
23071 1315120 978730 788421 673360 506930 376693 359790 394025 445263 341800 243594
23061 243594 203770 248495 245720 268696 342244 382132 357911 325910 278423 256901 323263 306143
23049 306143 267123 255377 267392 277379 258689 170869 123702 167085 163007 175952 187063 204111
23037 204111 174948 225717 204784 93629 58820 108738 180016 166098 84820 86191 107906
23026 107906 99778 87492 38872 37266 83263 134988 153406 144827 158955 175503 164702 126761
23014 126761 114283 160512 105041 132940 200665 147771 43731 -18151 -22908 -20496 -45572 -33011
23002 -33011 -13332 11263 32705 -2501 1280 26830 24324 59126 136982 163911 159588 139871
$$ packed form
23081H04711L20845M80856N34221M97183L68820J0825l06576m69073m63029m63663
23071A315120l36390j90309j15061j66430j30237j6903L4235N1238j03463r8206
23061B43594l9824M4725k775K2976P3548L9888k4221l2001m7487k1522O6362j7120
23049C06143l9020j1746J2015R987j8690q7820m7167M3383m078J2945J1111J7048
23037B04111k9163N0769k0933j11155l4809M9918P1278j3918q1278J371K1715
23026A07906q128j2286m8620j606M5997N1725J8418q579J4128J6548j0801l7941
23014A26761j2478M6229n5471K7899O7725n2894j04040o1882m757K412k5076J2561
23002c3011J9679K4595K1442l5206L781K5550k506L4802P7856K6929m323j9717
$$ plain form
22990 139871 162366 130812 74917 34670 45865 99664 119744 85126 127778 228871 214218
22979 214218 165751 135836 95034 48892 40720 15104 -62108 -156024 -129658 -76178 -116583 -49022
22967 -49022 -28673 -90817 -123603 -39220 14454 -11499 35233 101631 143725 50018 50679 11374
22955 11374 17996 38425 -16850 -42570 24630 43785 31982 2594 -36190 -19998 -49237 -50444
22943 -50444 46323 17371 -38840 -43007 5659 -8158 -39961 -41138 -48585 -74834 -88924 -112122
22931 -112122 -99190 -42119 -19297 -4895 -38698 -64701 -97437 -139169 -95914 -30318 -19690
22920 -19690 -19091 11736 36527 100556 106460 38614 -28041 1967 102155 122578 43570 48529
22908 48529 57057 -1075 -35076 -87270 -61701 -29831 -57121 -69488 -72921 -83601 -75011 -66005
$$ packed form
22990A39871K2495l1554n5895m0247J1195N3799K0080l4618M2652J01093j4653
22979B14218m8467k9915m0802m6142q172k5616p7212r3916K6366N3480m0405O7561
22967d9022K0349o2144l2786Q4383N3674k5953M6732O6398M2094r3707O61l9305
22955A1374O622K0429n5275k5720O7200J9155j1803k9388l8784J6192k9239j207
22943e0444R6767k8952n6211m167M8666j3817l1803j177p447k6249j4090k3198
22931a12122J2932N7071K2822J4402l3803k6003l2736m1732M3255O5596J0628
22920a9690N99L0827K4791O4029N904o7846o6655L0008J00188K0423p9008M959
22908D8529Q528n8132l4001n2194K5569L1870k7290j2367l433j0680Q590R006
$$ plain form
22896 -66005 -45657 -32035 68020 126376 125368 108906 31415 66066 97920 111567 163738 147656
22884 147656 74896 40072 22319 14180 60387 75126 78872 91224 125075 85647 87497 23604
22872 23604 -13501 12071 8731 10941 -18168 -67137 -64095 -42151 -24753 28338 101352 49417
22860 49417 -38899 -65024 -68996 -35500 18596 46134 27604 34661 36040 20689 15235 -15836
22848 -15836 -11874 30298 7402 -35634 -74704 -41123 -58023 -35324 -79984 35689 118660 70972
22836 70972 -21396 -72788 -88846 -95651 -102838 -115032 -74443 -63185 -50964 -41361 37275 86297
22824 86297 109926 114377 113946 103221 112375 104720 82722 79232 112716 108574 178588 258445 198777
22811 198777 107477 68426 61796 69864 82517 111388 103676 124772 169372 140549 78562 76357
$$ packed form
22896f6005K0348J3622J00055N8356j008j6462p7491L4651L1854J3647N2171j6082
22884A47656p2760l4824j7753q139M6207J4739L746J2352L3851l9428J850o3893
22872B3604l7105K5572l340K210k9109m8969L042K1944J7398N3091P3014n1935
22860D9417q8316k6125l972L3496N4096K7538j8530P057J379j5351n454l1071
22848a5836L962M2172k2896m3036l9070L3581j6900K2699m4660J15673Q2971m7688
22836G0972r2368n1392j6058o805p187j2194M0589J1258J2221R603P8636M9022
22824H6297K3629M451m31j0725R154p655k1998l490L3484m142P0014P9857n9668
22811A98777r1300l9051o630Q068J2653K8871p712K1096M4600k8823o1987k205
$$ plain form
22799 76357 79833 88600 89186 112885 42245 32912 48411 -9345 -15920 -8986 50677 44962 -50804
22786 -50804 -32023 3682 46943 74370 41319 17574 42424 65096 119541 119849 126026 110493
22774 110493 63756 115307 165701 182377 174673 123241 164632 218041 177290 158907 233156 322569
22762 322569 304012 242705 217864 226858 229955 162935 140106 201262 195723 183353 219211 239749
22750 239749 220276 274799 319425 279882 212840 229992 279320 186919 75534 -17474 8006
22739 8006 32125 38100 38972 39939 40248 1881 -10324 -1495 16641 82672 97642 16511 -40622
22726 -40622 32348 90760 77518 89116 82746 122589 201398 201626 145037 113778 137857 207468
22714 207468 202159 172570 165517 173741 171298 167392 134312 113849 99651 98243 38901 35769 24169
$$ packed form
22799G6357L476Q767N86K3699p0640r333J5499n7756o575O934N9663n715r5766
22786e0804J8781L5705M3261K7427l3051k3745K4850K2672N4445L08O177j5533
22774A10493m6737N1551N0394J6676p704n1432M1391N3409m0751j8383P4249Q9413
22762C22569j8557o1307k4841Q994L097o7020k2829O1156n539j2370L5858K0538
22750B39749j9473N4523M4626l9543o7042J7152M9328r2401j11385r3008K5480
22739H006K4119N975Q72R67L09l8367j2205Q829J8136O6031J4970q1131n7133
22726d0622P2970N8412j3242J1598o370L9843P8809K28n6589l1259K4079O9611
22714B07468n309k9589p053Q224k443l906l3080k0463j4198j408n9342l132j1600
$$ plain form
22701 24169 62910 130107 132153 187261 216090 233524 203734 235860 316142 385289 396121 346579
22689 346579 287116 364044 281702 221407 132681 154360 163229 145790 55617 164520 293023
22678 293023 262484 251636 344145 304863 272740 263797 269398 246177 253737 268974 250543 259245
22666 259245 226742 188870 211927 207570 182983 236313 346828 380523 481156 541331 546263
22655 546263 524237 502430 484846 504601 441110 416746 446464 465685 531905 561794 544863
22644 544863 590170 614957 701280 885539 1128436 1387166 1556569 1686741 1857115 1834827
22634 1834827 1915595 2129868 2154856 2153410 2184700 2132459 1898954 1767684 1708906 1681223 1627029
22623 1627029 1501539 1459228 1474105 1416861 1355492 1259342 1163814 1209358 1192843 1157299 1160298
$$ packed form
22701B4169L8741O7197K046N5108K8829J7434k9790L2126Q0282O9147J0832m9542
22689C46579n9463P6928q2342o0295q8726K1679Q869j7439r0173J08903J28503
22678B93023l0539j0848R2509l9282l2123q943N601k3221P560J5237j8431Q702
22666B59245l2503l7872K3057m357k4587N3330J10515L3695J00633O0175M932
22655E46263k2026k1807j7584J9755o3491k4364K9718J9221O6220K9889j6931
22644E44863M5307K4787Q6323J84259K42897K58730J69403J30172J70374k2288
22634A834827Q0768K14273K4988j446L1290n2241k33505j31270n8778k7683n4194
22623A627029j25490m2311J4877n7244o1369r6150r5528M5544j6515l5544K999
$$ plain form
22612 1160298 1155049 1135540 1133544 1116028 1128374 1140751 1079923 1092369 1112475 1097974 1090143 1087367
22600 1087367 1139469 1196627 1246629 1287253 1321806 1422640 1530305 1805969 2298034 2800067
22590 2800067 3193240 3593889 3662073 3441770 3101520 2708709 2289161 1943542 1781184 1685696
22580 1685696 1539375 1443424 1386131 1334464 1339368 1255017 1264686 1200539 1173473 1223168 1229400 1212158
22568 1212158 1213101 1268235 1351460 1421792 1483382 1529263 1509437 1507223 1505598 1561774 1573411 1555271
22556 1555271 1598548 1627710 1652647 1745200 1811541 1875329 1803611 1736817 1722856 1799541 1889639
22545 1889639 1962498 2075287 2187394 2281630 2437481 2602892 2744207 2851445 3025078 3115865
22535 3115865 3314284 3611936 4015699 4430997 4812897 5146960 5567764 6058359 6603634
$$ packed form
22612A160298n249j9509j996j7516J2346J2377o0828J2446K0106j4501p831k776
22600A087367N2102N7158N0002M0624L4553J00834J07665K75664M92065N02033
22590B800067L93173M00649O8184k20303l40250l92811m19548l45619j62358r5488
22580A685696j46321r5951n7293n1667M904q4351R669o4147k7066M9695O232j7242
22568A212158R43N5134Q3225P0332O1590M5881j9826k214j625N6176J1637j8140
22556A555271M3277K9162K4937R2553O6341O3788p1718o6794j3961P6685R0098
22545A889639P2859J12789J12107R4236J55851J65411J41315J07238J73633R0787
22535C115865J98419K97652M03763M15298L81900L34063M20804M90595N45275
$$ plain form
22526 6603634 7197176 7906405 8778910 9749492 10875288 12368024 14231923 16630264 19721400
22517 19721400 23943128 30018700 38241251 49585141 66379317 93073777 138467548
22510 138467548 214894023 315707310 411379532 496022641 533909063 501803331 436026403
22503 436026403 346213979 250574496 180869733 139531505 114315296 97463520 85252708
22496 85252708 75697038 67842130 61374642 56037805 51525357 47753873 44791856 42406045
22488 42406045 40410933 38702990 37129855 35666165 34336615 33084297 31843178 30626987
22480 30626987 29587218 28685490 27739963 26862398 26037282 25214695 24497147 23845591 23140726
22471 23140726 22421929 21676853 20952563 20246948 19513039 18889193 18201809 17463724 16804430
$$ packed form
22526F603634N93542P09229Q72505R70582J125796J492736J863899K398341L091136
22517A9721400M221728O075572Q222551J1343890J6794176K6694460M5393771
22510A38467548P6426475J00813287R5672222Q4643109L7886422l2105732o5776928
22503D36026403q9812424r5639483o9704763m1338228k5216209j6851776j2210812
22496H5252708r555670p854908o467488n336837m512448l771484k962017k385811
22488D2406045j995112j707943j573135j463690j329550j252318j241119j216191
22480C0626987j039769r01728r45527q77565q25116q22587p17548o51556p04865
22471B3140726p18797p45076p24290p05615p33909o23846o87384p38085o59294
$$ plain form
22462 16804430 16226922 15563077 15045942 14580312 14159241 13696856 13285149 12998210 12592867
22453 12592867 12166150 11876284 11572916 11231219 10931880 10702938 10571844 10394240 10309212
22444 10309212 10396000 10377226 10299246 10209400 10166355 10095537 9888427 9681638 9482462 9231930
22434 9231930 8955477 8710244 8511713 8404802 8413760 8413970 8451248 8623172 8920426 9365985
22424 9365985 9740033 10027630 10050322 9670190 9039107 8333745 7645117 7112924 6687715 6366795
22414 6366795 6237086 6112081 6037298 5890048 5775915 5632815 5567723 5433074 5284625 5136496
22404 5136496 5019907 4925989 4883617 4746034 4661240 4635148 4555650 4469063 4414939 4357570 4297355
22393 4297355 4308965 4347607 4289609 4223560 4234513 4359038 4435338 4468022 4522696 4596583 4782241
$$ packed form
22462A6804430n77508o63845n17135m65630m21071m62385m11707k86939m05343
22453A2592867m26717k89866l03368l41697k99339k28942j31094j77604q5028
22444A0309212Q6788j8774p7980q9846m3045p0818k07110k06789j99176k50532
22434I231930k76453k45233j98531j06911Q958K10L7278J71924K97254M45559
22424I365985L74048K87597K2692l80132o31083p05362o88628n32193m25209l20920
22414F366795j29709j25005p4783j47250j14133j43100o5092j34649j48449j48129
22404E136496j16589r3918m2372j37583q4794k6092p9498q6587n4124n7369o0215
22393D297355J1610L8642n7998o6049J0953J24525P6300L2684N4674P3887J85658
$$ plain form
22382 4782241 4973361 5144788 5225662 5279303 5185790 5023874 4874742 4582580 4259326 3998118
22372 3998118 3851408 3753447 3597281 3409841 3313770 3265056 3191816 3037931 2966073 2866004
22362 2866004 2669928 2582941 2562765 2533863 2431060 2327453 2301927 2276944 2221414 2174341 2200765
22351 2200765 2237023 2204906 2184243 2110902 2061083 2090064 2159915 2162103 2104647 2087462 2062162
22340 2062162 2039917 1982291 1879425 1851136 1812974 1726303 1604037 1566994 1529199 1552792 1470453
22329 1470453 1449934 1333552 1298005 1332357 1287694 1175289 1111143 1067295 1004493 921221 900302
22318 900302 996532 1021615 1095873 1094306 1130691 1154708 1159227 1171075 1242703 1184405 1095845 1115348
22306 1115348 1130422 1115371 1062468 1024718 935264 895341 896511 806553 775461 814642 806092 770626
$$ packed form
22382D782241J91120J71427Q0874N3641r3513j61916j49132k92162l23254k61208
22372C998118j46710r7961j56166j87440r6071m8714p3240j53885p1858j00069
22362B866004j96076q6987k0176k8902j02803j03607k5526k4983n5530m7073K6424
22351B200765L6258l2117k0663p3341m9819K8981O9851K188n7456j7185k5300
22340B062162k2245n7626j02866k8289l8162q6671j22266l7043l7795K3593q2339
22329A470453k0519j16382l5547L4352m4663j12405o4146m3848o2802q3272k0919
22318I00302R6230K5083P4258j567L6385K4017M519J1848P1628n8298q8560J9503
22306A115348J5074j5051n2903l7750q9454l9923J170q9958l1092L9181q550l5466
$$ plain form
22294 770626 808731 798827 818617 850858 762783 742734 828164 872633 803207 752573 715025 713994
22282 713994 730253 694330 768887 776548 761668 702425 710961 795605 766483 712304 701764 643956
22270 643956 565519 525689 553002 548131 585703 633998 612512 575686 661826 672134 650660 623911
22258 623911 683212 633407 576744 498812 466972 447755 504826 487006 470129 572651 621846
22247 621846 658087 604192 475350 378119 364982 333412 343035 366450 379950 418258 348398
22236 348398 290251 240067 209800 201399 216893 205003 196594 223010 240738 307819 290028 277434
22224 277434 174470 162502 217343 210736 247433 202690 216123 242085 219107 164163 134255
22213 134255 84152 91881 127472 115882 157278 227461 207857 188332 194916 147645 182223 248813
$$ packed form
22294G70626L8105r904J9790L2241q8075k0049Q5430M4469o9426n0634l7548j031
22282G13994J6259l5923P4557P661j4880n9243Q536Q4644k9122n4179j0540n7808
22270F43956p8437l9830K7313m871L7572M8295k1486l6826Q6140J0308k1474k6749
22258F23911N9301m9805n6663p7932l1840j9217N7071j7820j6877J02522M9195
22247F21846L6241n3895j28842r7231j3137l1570R623K3415J3500L8308o9860
22236C48398n8147n0184l0267q401J5494j1890q409K6416J7728O7081j7791j2594
22224B77434j02964j1968N4841o607L6697m4743J3433K5962k2978n4944k9908
22213A34255n0103P729L5591j1590M1396P0183j9604j9525O584m7271L4578O6590
$$ plain form
22201 248813 254068 122836 96842 118887 93635 152119 193942 206464 180604 175051 200157 103499
22189 103499 53372 -48050 -21072 15611 14963 -37514 3904 68901 61136 85153 71524 43145
22177 43145 109024 94416 29794 -49595 -53787 -6979 41462 104667 110298 91540 78609 127907
22165 127907 124980 66179 23630 46044 46867 37815 28996 14955 -23880 -39243 -16817 98541
22153 98541 104152 112474 161602 189098 213898 151856 119926 60470 47939 33623 49281 55
22141 55 1721 -15854 -77062 -62340 -29574 4717 70665 105345 75190 19651 38038 6432
22129 6432 9801 16072 26340 67802 81783 85006 59831 41117 1360 -15653 1076 -22267
22117 -22267 -51166 22446 8754 31573 81896 4880 6206 59414 40819 80456 165476 116347
$$ packed form
22201B48813N255j31232k5994K2045k5252N8484M1823J2522k5860n553K5106r6658
22189A03499n0127j01422K6978L6683o48n2477M1418O4997p765K4017j3629k8379
22177D3145O5879j4608o4622p9389m192M6808M8441O3205N631j8758j2931M9298
22165A27907k927n8801m2549K2414Q23r052q819j4041l8835j5363K2426J15358
22153I8541N611Q322M9128K7496K4800o2042l1930n9456j2531j4316J5658m9226
22141E5J666j7575o1208J4722L2766L4291O5948L4680l0155n5539J8387l1606
22129F432L369O271J0268M1462J3981L223k5175j8714l9757j7013J6729k3343
22117b2267k8899P3612j3692K2819N0323p7016J326N3208j8595L9637Q5020m9129
$$ plain form
22105 116347 71489 3153 -33358 -26838 -239 -8433 -15596 1456 16511 -32997 -85070 -161506
22093 -161506 -146241 -55796 31149 81881 57846 -8128 -32658 -47850 -25626 6775 -10187
22082 -10187 11725 -13402 -53785 -50899 -10822 -40234 -22595 5544 -38987 -13400 9805 -90215
22070 -90215 -165179 -101699 -71991 -38434 12849 31998 27999 21058 -18730 -2993 -5360 -8980
22058 -8980 -88494 -137212 -190604 -132853 -35771 25680 54267 44942 13848 51890 79884 36831
22046 36831 20212 20790 114767 210482 238504 167501 83247 65674 73760 83269 120504 81713
22034 81713 39902 48441 16800 -52091 -36672 -111672 -119730 -53840 -29466 -105270 -126047 -131366
22022 -131366 -146556 -129147 -88248 -146229 -136307 -80010 -4440 14031 9538 -58134 -92647 -102130
$$ packed form
22105A16347m4858o8336l6511O520K6599q194p163J7052J5055m9508n2073p6436
22093a61506J5265R0445Q6945N0732k4035o5974k4530j5192K2224L2401j6962
22082a0187K1912k5127m0383K886M0077k9412J7639K8139m4531K5587K3205j00020
22070i0215p4964O3480K9708L3557N1283J9149l999o941l9788J5737k367l620
22058h980p9514m8718n3392N7751R7082O1451K8587r325l1094L8042K7994m3053
22046C6831j6619N78R3977R5715K8022p1003q4254j7573Q086R509L7235l8791
22034H1713m1811Q539l1641o8891J5419p5000q058O5890K4374p5804k0777n319
22022a31366j5190J7409M0899n7981R922N6297P5570J8471m493o7672l4513r483
$$ plain form
22010 -102130 -121830 -88518 -9028 577 -25045 33425 25577 15875 -11745 -80159 -95500 -83617
21998 -83617 -34645 -18717 -58935 -30879 23591 43813 -15845 -34650 -30928 -14715 71264 95395
21986 95395 5189 -14141 -43903 -14925 -1071 46047 27736 -4548 -57958 -112645 -78136 -57408
21974 -57408 -103070 -138538 -112172 -88631 -36641 -45868 -13849 36781 -35348 -76233 -63534 -36216
21962 -36216 -22875 -46512 -21292 25608 55079 8227 -38715 -20118 -9190 -73734 -93822 -112778
21950 -112778 -24267 45924 45423 8830 -47363 -111519 -84973 -55955 -70164 -79290 -52023 -5045
21938 -5045 35241 73891 102113 155366 231454 277752 466174 719522 1121505 1744566 2353875
21927 2353875 2790762 2987223 2815927 2389872 1850387 1333172 920984 709439 592689
$$ packed form
22010a02130j9700L3312P9490R605k5622N8470p848r702k7620o8414j5341J1883
21998h3617M8972J5928m0218K8056N4470K0222n9658j8805L722J6213Q5979K4131
21986I5395r0206j9330k9762K8978J3854M7118j8311l2284n3410n4687L4509K0728
21974e7408m5662l5468K6366K3541N1990r227L2019N0630p2129m0885J2699K7318
21962c6216J3341k3637K5220M6900K9471m6852m6942J8597J0928o4544k0088j8956
21950a12778Q8511P0191n01l6593n6193o4156K6546K9018j4209r126K7267M6978
21938e045M0286L8650K8222N3253P6088M6298J88422K53348M01983O23061O09309
21927B353875M36887J96461j71296m26055n39485n17215m12188k11545j16750
$$ plain form
21918 592689 520542 428435 366641 267106 289165 246449 233598 253103 254210 244433 220037 193381
21906 193381 212372 180363 135131 95173 76323 2530 -44322 -40867 -52964 -2131 -16526 -24652
21894 -24652 71867 83752 66891 64374 77977 46698 9685 -7913 8515 35275 -15877 -87008
21882 -87008 -93667 -52579 -80706 -120417 -144860 -174241 -95257 -966 -11360 44729 81828 48797
21870 48797 59254 -24729 17616 51999 906 -90462 -62631 -61161 -12933 -26982 -19948 27228
21858 27228 28486 6442 -12373 -32487 -12575 41625 12743 -49249 -75742 -58464 -29308 -6433
21846 -6433 -33416 -48544 -35355 -4099 44452 -60823 -116875 -110228 -20454 -65082 -116198 -113142
21834 -113142 -94551 -83108 -55426 -43327 -56833 -100524 -110301 -103758 -104055 -128493 -150165 -118322
$$ packed form
21918E92689p2147r2107o1794r9535K2059m2716j2851J9505J107r777k4396k6656
21906A93381J8991l2009m5232l9958j8850p3793m6852L455j2097N0833j4395q126
21894b4652R6519J1885j6861k517J3603l1279l7013j7598J6428K6760n1152p1131
21882h7008o659M1088k8127l9711k4443k9381P8984R4291j0394N6089L7099l3031
21870D8797J0457q3983M2345L4383n1093r1368K7831J470M8228j4049P034M7176
21858B7228J258k2044j8815k0114J9912N4200k8882o1992k6493J7278K9156K2875
21846f433k6983j5128J3189L1256M8551j05275n6052O647Q9774m4628n1116L056
21834a13142J8591J1443K7682J2099j3506m3691r777O543k97k4438k1672L1843
$$ plain form
21822 -118322 -111609 -53737 9715 -1092 -17436 -17101 -4777 -12863 -17568 -66991 -80710 -79123 -7253
21809 -7253 3332 37207 88726 96504 40461 35763 65925 13349 -12669 -29201 -57548 -50521
21797 -50521 -15497 -33891 -57646 -79425 -151490 -108824 -48971 -109292 -142583 -106987 -47696 -37928
21785 -37928 -68259 -52872 -57668 -28415 -58286 -59559 6326 2835 -17266 -3251 -70831 -116513
21773 -116513 -103142 -89979 -87509 -91119 -101112 -100191 -82698 -45713 -59991 -129325 -170615 -143043
21761 -143043 -104217 -63258 -95850 -146521 -109304 -118471 -126682 -162507 -142879 -83143 -85957 -102887
21749 -102887 -130860 -145492 -91912 -45202 2755 30602 36207 40017 68105 38445 32752 -31325
21737 -31325 -65084 -34480 -56598 -68304 -56585 -4808 -9149 41283 55087 54731 70583 -24232
$$ packed form
21822a18322O713N7872O3452j0807j6344L35J2324q086m705m9423j3719J587P1870
21809g253J0585L3875N1519P778n6043m698L0162n2576k6018j6532k8347P027
21797e0521L5024j8394k3755k1779p2065M2666N9853o0321l3291L5596N9291R768
21785c7928l0331J5387m796K9253k9871j273O5885l491k0101J4015o7580m5682
21773a16513J3371J3163K470l610r993R21J7493L6985j4278o9334m1290K7572
21761a43043L8826M0959l2592n0671L7217r167q211l5825J9628N9736k814j6930
21749a02887k7973j4632N3580M6710M7957K7847N605L810K8088k9660n693o4077
21737c1325l3759L0604k2118j1706J1719N1777m341N0432J3804l56J5852r4815
$$ plain form
21725 -24232 -80528 -114115 -96675 -63646 3756 -19472 -54745 -90934 -124081 -57380 -51486 -82788
21713 -82788 -86353 -54600 -27358 -44518 -51387 -112200 -76745 -56940 -60353 594 -4787 -39990
21701 -39990 -63253 -72237 -71522 -27775 -36476 -24196 3982 47779 10125 -85236 -94355 -65128 -10189
21688 -10189 42163 30059 -72934 -47248 -27088 -66660 -61676 -38690 -74879 -35683 -17822 -837
21676 -837 -41840 -40269 -73940 -144277 -182528 -190958 -153324 -131910 -76346 -66655 -120829 -143572 -133503
21663 -133503 -70379 -34530 -80951 -101313 -51748 9180 12491 -39923 -106955 -148466 -60240 4622
21651 4622 -10738 -112014 -149233 -102411 -131949 -125289 -141030 -67541 -39514 -49029 -52279 -45940
21639 -45940 -49879 -71519 -92190 -103982 -175074 -198665 -137786 -90761 -37447 -14904 -39973 -65857
$$ packed form
21725b4232n6296l3587J7440L3029O7402k3228l5273l6189l3147O6701N894l1302
21713h2788l565L1753K7242j7160o869o0813L5455J9805l413O0947n381l5203
21701c9990k3263q984P15M3747q701J2280K8178M3797l7654r5361r119K9227N4939
21688a0189N2352j2104j02993K5686K0160l9572M984K2986l6189L9196J7861J6985
21676h37m1003J571l3671p0337l8251q430L7634K1414N5564R691n4174k2743J0069
21663a33503O3124L5849m6421k0362M9565O0928L311n2414o7032m1511Q8226O4862
21651D622j5360j01276l7219M6822k9538O660j5741P3489K8027r515l250O339
21639d5940l939k1640k0671j1792p1092k3591O0879M7025N3314K2543k5069k5884
$$ plain form
21627 -65857 -80040 -87461 -87787 -55237 -13968 14516 35604 74370 109893 72629 24923 44972
21615 44972 -9715 10066 -2752 -25971 -84860 -98077 -126731 -90040 -23778 -22147 -1142 36579
21603 36579 38237 5976 9871 32284 -46390 -80431 -107909 -137815 -151725 -99341 -47711 -47832
21591 -47832 -123520 -128485 -200774 -241763 -155894 -27360 13162 13228 -25342 -30826 -5275 -12816 -29626
21578 -29626 -112867 -138729 -149477 -86915 -110080 -111329 -62330 221 17298 4325 -12622 -63373
21566 -63373 -71938 -70119 -78681 -123532 -181559 -172705 -73720 -49520 -69807 -41570 -80023 -81971 -11985
21553 -11985 -36037 -78817 -98774 -148981 -234018 -237748 -216484 -168782 -105540 -36827 -45109 -23213
21541 -23213 7953 28135 70082 20885 -60860 -39009 -16978 -17773 -26072 -68541 -26511 -80441
$$ packed form
21627f5857j4183p421l26L2550M1269K8484K1088L8766L5523l7264m7706K0049
21615D4972n4687J9781j2818k3219n8889j3217k8654L6691O6262J631K1005L7721
21603C6579J658l2261L895K2413p8674l4041k7478k9906j3910N2384N1630j21
21591d7832p5688m965p2289m0989Q5869J28534M0522O6l8570n484K5551p541j6810
21578b9626q3241k5862j0748O2562k3165j249M8999O2551J7077j2973j6947n0751
21566f3373q565J819q562m4851n8027Q854R8985K4200k0287K8237l8453j948O9986
21553a1985k4052m2780j9957n0207q5037l730K1264M7702O3242O8713q282K1896
21541b3213L1166K0182M1947m9197q1745K1851K2031p95q299m2469M2030n3930
$$ plain form
21529 -80441 -136847 -139038 -120391 -44458 -57994 -85879 -91800 -71586 -43343 5799 -21509 -52900
21517 -52900 -39444 13798 76328 99539 53042 33204 6214 -21392 -50974 -50467 -56408 -59380
21505 -59380 -56453 -57619 -58562 -55176 -12929 78103 47730 7160 -76996 -50253 -84068 -114375 -122367
21492 -122367 -59501 28587 30475 9718 38087 61347 71640 94515 91741 68041 50324 18347
21480 18347 -6416 -23024 -74214 -105904 -64844 -3720 -1754 -28296 -15487 -30979 -47088 -28519
21468 -28519 41344 27800 -5784 -17013 -34494 -74270 -20689 -26300 -49889 -20664 2882 -24411
21456 -24411 -16186 -65127 -65098 -83524 -48138 -20166 -23132 12328 58189 15870 -15319 -20390 -12588
21443 -12588 -20692 -45979 -55773 -47824 -26677 -18725 -9934 36713 68505 2934 -18048 11567 9132
$$ packed form
21529h0441n6406k191J8647P5933j3536k7885n921K0214K8243M9142k7308l1391
21517e2900J3456N3242O2530K3211m6497j9838k6990k7606k9582N07n941k972
21505e9380K927j166r43L386M2247R1032l0373m0570q4156K6743l3815l0307p992
21492a22367O2866Q8088J888k0757K8369K3260J0293K2875k774k3700j7717l1977
21480A8347k4763j6608n1190l1690M1060O1124J966k6542J2809j5492j6109J8569
21468b8519O9863j3544l3584j1229j7481l9776N3581n611k3589K9225K3546k7293
21456b4411Q225m8941K9j8426L5386K7972k966L5460M5861m2319l1189n071P802
21443a2588q104k5287r794P949K1147P952Q791M6647L1792o5571k0982K9615k435
$$ plain form
21430 9132 -33248 -69531 -37168 -33797 582 -13696 -19007 -4404 38378 6075 -9473 -77578
21418 -77578 -112702 -121714 -80891 -81591 -158228 -127377 -111116 -85445 -97924 4270 84166 27241
21406 27241 -22893 -56827 -103182 -101072 -98167 -168067 -223828 -207016 -145658 -110379 -91217 -123560
21394 -123560 -132397 -49960 -460 -19765 -96707 -150171 -186760 -167271 -114020 -46843 -76612 -31111
21382 -31111 -54185 -76844 -42876 -134112 -156233 -127361 -125883 -92362 -52246 -68341 -41282 -54074
21370 -54074 -55229 -46708 -11500 10187 12891 797 -115496 -153820 -113934 -122146 -112773 -116598 -41953
21357 -41953 -35097 -18184 -34481 -66047 -66304 -77447 -123125 -136794 -91184 -35148 -49941 -72542
21345 -72542 -67848 -50064 -35753 9227 35184 55126 -48876 -125407 -163011 -108496 -62511 -38373
$$ packed form
21430I132m2380l6283L2363L371L4379j4278n311J4603M2782l2303j5548o8105
21418g7578l5124r012M0823p00p6637L0851J6261K5671j2479J02194P9896n6925
21406B7241n0134l3934m6355K110K905o9900n5761J6812O1358L5279J9162l2343
21394a23560q837Q2437M9500j9305p6942n3464l6589J9489N3251O7177k9769M5501
21382c1111k3074k2659L3968r1236k2121K8872J478L3521M0116j6095K7059j2792
21370e4074j155Q521L5208K1687K704j2094j16293l8324L9886q212R373l825P4645
21357d1953O856J6913j6297l1566k57j1143m5678j3669M5610N6036j4793k2601
21345g2542M694J7784J4311M4980K5957J9942j04002p6531l7604N4515M5985K4138
$$ plain form
21333 -38373 -87372 -92834 -81507 -91870 -50167 42999 -14897 -50552 -58480 -111182 -78548 -105119
21321 -105119 -105522 -121489 -143378 -58814 -55088 -75977 -100628 -18929 -13733 1861 20463 -75220
21309 -75220 -146216 -173847 -151789 -111416 -100120 -51880 -62526 -37040 32747 10199 9318 -99554
21297 -99554 -126958 -117116 -57852 11414 -46861 -38920 -81932 -30596 44108 96069 83819 21834
21285 21834 6744 45359 -11820 -89081 -54898 29455 65786 -8053 -77680 -101394 -82683 -33954
21273 -33954 -36315 -115964 -133191 -136363 -140576 -139340 -145856 -109993 -20009 34592 -32958 -76422 651
21260 651 40276 90378 53365 82727 66916 96450 62593 28604 40960 -26755 -78063 -81901
21248 -81901 -64944 -4246 12484 -18596 -26469 -73771 -39999 7355 3626 -47198 -41662 -44247
$$ packed form
21333c8373m8999n462J1327j0363M1703R3166n7896l5655p928n2702L2634k6571
21321a05119m03j5967k1889Q4564L726k0889k4651Q1699N196J5594J8602r5683
21309g5220p0996k7631K2058M0373J1296M8240j0646K5486O9787k2548q81j08872
21297i9554k7404R842N9264O9266n8275P941m3012N1336P4704N1961j2250o1985
21285B1834j5090L8615n7179p7261L4183Q4353L6331p3839o9627k3714J8711M8729
21273c3954k361p9649j7227l172m213J236o516L5863Q9984N4601o7550m3464P7073
21260F51L9625N0102l7013K9362j5811K9534l3857l3989J2356o7715n1308l838
21248h1901J6957O0698J6730l1080p873m7302L3772M7354l729n0824N536k585
$$ plain form
21236 -44247 -81068 -110860 -116657 -58232 -33509 -59203 -76810 -88057 -109997 -112766 -60768 -66058
21224 -66058 -121948 -132875 -143186 -140002 -109487 -97750 -95792 -56866 -48212 -31450 -17716 -56967
21212 -56967 -98737 -56939 52026 101349 92607 50675 2883 -71761 -57296 -44593 -42763 -91493
21200 -91493 -143748 -118789 -98681 -132959 -149698 -172065 -143904 -50278 1645 22178 3111 -67623
21188 -67623 -45885 40977 30325 -66792 -109647 -127033 -80106 -27122 -84616 -116018 -111006 -34584
21176 -34584 86054 33789 -40595 -30132 -89639 -77273 -90273 -84503 -30540 -4827 -1765 -38493
21164 -38493 -22821 31500 43544 104168 128507 59310 5298 -39566 -88626 -98098 -79955 -6415
21152 -6415 7545 -42601 -59825 -105581 -58816 19664 -2927 -2243 -5856 -13772 -45147 -61979 -141289
$$ packed form
21236d4247l6821k9792n797N8425K4723k5694j7607j1247k1940k769N1998n290
21224f6058n5890j0927j0311L184L0515J1737J958L8926Q654J6762J3734l9251
21212e6967m1770M1798J08965M9323q742m1932m7792p4644J4465J2703J830m8730
21200i1493n2255K4959K0108l4278j6739k2367K8161R3626N1923K0533j9067p0734
21188f7623K1738Q6862j0652r7117m2855j7386M6927N2984n7494l1402N012P6422
21176c4584J20638n2265p4384J0463n9507J2366j3000N770N3963K5713L062l6728
21164c8493J5672N4321J2044O0624K4339o9197n4012m4864m9060r472J8143P3540
21152f415J3960n0146j7224m5756M6765P8480k2591O84l613p916l1375j6832p9310
$$ plain form
21139 -141289 -108930 1259 -12816 17708 39187 3122 -15431 -95663 -155496 -82861 -24644
21128 -24644 -18430 -50981 -18177 16164 50891 52152 37406 16076 30172 -27423 -128131 -104143
21116 -104143 -68162 -55317 -132261 -95070 -46699 -120153 -169469 -133486 -63717 -94824 -77271
21105 -77271 -82550 -44513 -104894 -122834 -69732 -98514 -96075 -22519 -69979 -69437 -80241 -53779
21093 -53779 -34343 -63008 -62704 -125731 -135945 -53711 37176 56779 3838 -6647 -29850 54468
21081 54468 121499 102104 843 -44928 -29193 -50216 -43435 -38060 -34210 -114791 -164650 -159584
21069 -159584 -110578 -45954 -36378 28022 38046 -18059 -48507 -51896 -6880 -66079 -85344 -94437
21057 -94437 -137864 -165258 -116376 -87508 -45494 -61352 -61642 -51011 -18676 -65516 -117160 -176269
$$ packed form
21139a41289L2359J10189j4075L0524K1479l6065j8553q0232n9833P2635N8217
21128b4644O214l2551L2804L4341L4727J261j4746k1330J4096n7595j00708K3988
21116a04143L5981J2845p6944L7191M8371p3454m9316L5983O9769l1107J7553
21105g7271n279L8037o0381j7940N3102k8782K439P3556m7460N42j0804K6462
21093e3779J9436k8665L04o3027j0214Q2234R0887J9603n2941j0485k3203Q4318
21081E4468O7031j9395j01261m5771J5735k1023O781N375L850q0581m9859N066
21069a59584M9006O4624R576O4400J0024n6105l0448l389M5016n9199j9265r093
21057i4437m3427k7394M8882K8868M2014j5858k90J0631L2335m6840n1644n9109
$$ plain form
21045 -176269 -159239 -121136 -37472 -21890 -75943 -103558 -157611 -115567 -62687 -107063 -62261
21034 -62261 -41545 -29199 -27795 -49920 -97917 -138150 -176186 -101738 -11794 -54296 -141210 -186763
21022 -186763 -170286 -153924 -199302 -202581 -211820 -207352 -183487 -163317 -106003 -33190 -101841 -155099
21010 -155099 -101067 -117708 -90937 -87028 -108019 -41369 -42693 -46821 -23390 -84475 -94665 -75005
20998 -75005 -76199 -93738 -97950 -19762 8234 2594 -18719 -51573 -88266 -128633 -151063 -125766
20986 -125766 -118893 -53413 -20252 31155 -30126 -153720 -146881 -126885 -113472 -68601 -82022 -64609
20974 -64609 -52773 -94965 -86474 -127473 -128792 -104756 -92601 -108327 -65446 -85237 -119170 -139918
20962 -139918 -50084 -80313 -128940 -129399 -93617 -19689 1399 -27249 -3015 -185 -62098 -117012
$$ packed form
21045a76269J7030L8103Q3664J5582n4053k7615n4053M2044N2880m4376M4802
21034f2261K0716J2346J404k2125m7997m0233l8036P4448Q9944m2502q6914m5553
21022a86763J6477J6362m5378l279r239M468K3865K0170N7314P2813o8651n3258
21010a55099N4032j6641K6771L909k0991O6650j324m128K3431o1085j0190J9660
20998g5005j194j7539m212P8188K7996n640k1313l2854l6693m0367k2430K5297
20986a25766O873O5480L3161N1407o1281j23594O839J9996J3413M4871j3421J7413
20974f4609J1836m2192Q491m0999j319K4036J2155j5726M2881j9791l3933k0748
20962a39918Q9834l0229m8627m59L5782P3928K1088k8648K4234K830o1913n4914
$$ plain form
20950 -117012 -143954 -123839 -84816 -83033 -60304 -52831 -10434 21371 66674 101244 74595 -7461
20938 -7461 -69595 -77344 -26076 30261 61283 4811 22787 42441 61 23462 87939 131145
20926 131145 173446 169565 110423 12426 58280 77976 91879 109313 112631 99080 93040 108921
20914 108921 46190 -5262 14776 -7641 11454 7913 10780 19583 39334 128276 123482 202660
20902 202660 315368 505438 684911 766231 821799 900783 937736 970587 961200 908249 841546
20891 841546 720774 593210 520650 345095 209897 176248 111761 15153 38257 95896 82643
20880 82643 63351 102511 129466 99427 107027 189251 313588 311015 303514 411167 602453 780747
20868 780747 845323 922941 1086512 1128054 1063266 1029658 910940 756298 630066 553232 502598
$$ packed form
20950a17012k6942K0115L9023J783K2729P473M2397L1805M5303L4570k6649q2056
20938g461o2134p749N1268N6337L1022n6472J7976J9654m2380K3401O4477M3206
20926A31145M2301l881n9142r7997M5854J9696J3903J7434L318j3551o040J5881
20914A08921o2731n1452K0038k2417J9095l541K867Q803J9751Q8942m794P9178
20902B02660J12708J90070J79473Q1320N5568P8984L6953L2851r387n2951o6703
20891H41546j20772j27564p2560j75555j35198l3649o4487r6608K3104N7639j3253
20880H2643j9292L9160K6955l0039P600Q2224J24337k573p501J07653J91286J78294
20868G80747O4576P7618J63571M1542o4788l3608j18718j54642j26232p6834n0634
$$ plain form
20857 502598 410330 361461 306320 203620 201355 245267 201061 177398 188482 191726 241971 232978
20845 232978 235974 300298 255803 172414 131737 168582 128586 74045 -5714 -77159 -36518 18248
20833 18248 68958 90437 164550 118067 81562 129065 184957 91070 68535 105149 83524 110311
20821 110311 102453 75833 90809 98532 64728 -2835 6088 -23887 -38716 -29312 45304 50258
20809 50258 103615 108447 68252 116576 148028 99820 -3810 -27009 -69887 -112662 -90583 -92999
20797 -92999 -17428 22454 -15764 40498 67224 89707 71151 62257 39631 -58087 -90764 -40106
20785 -40106 -59539 -58686 -14993 -35207 1341 69116 73612 37760 77116 16003 -26576 -67244
20773 -67244 -97411 -142183 -38959 25993 10474 -15805 -27728 -80512 -118329 -50282 -59399 -99391
$$ packed form
20857E02598r2268m8869n5141j02700k265M3912m4206k3663J1084L244N0245q993
20845B32978K996O4324m4495q3389m0677L6845l9996n4541p9759p1445M0641N4766
20833A8248N0710K1479P4113m6483l6505M7503N5892r3887k2535L6614k1625K6787
20821A10311p858k6620J4976P723l3804o7563Q923k9975j4829R404P4616M954
20809E0258N3357M832m0195M8324L1452m8208j03630k3199m2878m2775K2079k416
20797i2999P5571L9882l8218N6262K6726K2483j8556q894k2626r7718l2677N0658
20785d0106j9433Q53M3693k0214L6548O7775M496l5852L9356o1113m2579m0668
20773f7244l0167m4772J03224O4952j5519k6279j1923n2784l7817O8047r117l9992
$$ plain form
20761 -99391 -137580 -121085 -119298 -101068 -88523 -112999 -87549 303 -10217 -9924 19743 18288
20749 18288 570 -15160 -23798 -4916 -63157 -118057 -135240 -175021 -175581 -124005 -71063 -73117
20737 -73117 -44890 -102786 -130227 -115284 -89972 -80752 -21712 -30353 -12801 -65665 -68056 -22405
20725 -22405 -44111 48095 66786 16098 -14549 -18836 -58917 -60064 -38346 7335 95638 42796
20713 42796 -17069 -7337 36669 -20232 -59153 -35335 -38631 6564 43046 45161 84494 88014
20701 88014 55319 61234 18494 -21967 -60258 -130492 -125111 -138707 -126573 -107612 -73985 -35874
20689 -35874 -64762 -99430 -90113 -94299 -78138 2153 76483 82547 72957 -17833 -35160 -117832
20677 -117832 -76440 14598 26873 8434 41869 12875 78391 50805 -20851 -41553 -77277
$$ packed form
20761i9391l8189J6495J787J8230J2545k4476K5450Q7852j0520K93K9667j455
20749A8288j7718j5730q638J8882n8241n4900j7183l9781n60N1576N2942k054
20737g3117K8227n7896k7441J4943K5312R220N9040q641J7552n2864k391M5651
20725b2405k1706R2206J8691n0688l0647m287m0081j147K1718M5681Q8303n2842
20713D2796n9865R732M4006n6901l8921K3818l296M5195L6482K115L9333L520
20701H8014l2695N915m2740m0461l8291p0234N381j3596J2134J8961L3627L8111
20689c5874k8888l4668R317m186J6161Q0291P4330O064r590r0790j7327q2672
20677a17832M1392R1038J2275j8439L3435k8994O5516k7586p1656k0702l5724
$$ plain form
20666 -77277 -58572 -8391 6182 5519 -24650 35904 25410 12189 24659 84444 129168 57429
20654 57429 -542 -48904 -47028 -16901 58041 138985 105024 7300 4244 -30246 -15532 -15897
20642 -15897 16640 2827 39275 67 -75270 -131627 -138725 -142875 -144265 -119988 -50413 -54320
20630 -54320 -68396 -58052 -23009 -9806 -13293 36942 69002 78821 84659 49719 15028 14159 -1263
20617 -1263 -55433 -69986 33568 89791 88823 45099 38912 69660 36532 25758 13963 -15873
20605 -15873 21834 37001 69793 73427 75564 41755 -4427 -38758 5275 -13092 -41539 -16121
20593 -16121 8206 12446 -2474 -66247 -26737 2406 5485 -16055 -14136 42240 92829 84675
20581 84675 40000 30577 48602 105372 118673 157015 130579 51206 96188 156758 143081 145465
$$ packed form
20666g7277J8705N0181J4573o63l0169O0554j0494j3221J2470N9785M4724p1739
20654E7429n7971m8362J876L0127P4942Q0944l3961r7724l056l4490J4714l65
20642a5897L2537j3813L6448l9208p5337n6357p098m150j390K4277O9575l907
20630e4320j4076J0344L5043J3203l487N0235L2060R819N838l4940l4691q69j5422
20617a263n4170j4553J03554N6223r68m3724o187L0748l3128j0774j1795k9836
20605a5873L7707J5167L2792L634K137l3809m6182l4331M4033j8367k8447K5418
20593a6121K4327M240j4920o3773L9510K9143L079k1540J919N6376N0589q154
20581H4675m4675r423J8025N6770J3301L8342k6436p9373M4982O0570j3677K384
$$ plain form
20569 145465 110782 100704 121902 62904 33327 -27421 -56508 -4937 98906 89623 75309
20558 75309 78412 78444 94301 88177 34015 75214 122631 124421 114128 63436 7721 34137 102533
20545 102533 125146 86838 49431 80178 72921 53028 54266 47985 11171 8866 25521 20808
20533 20808 65831 69338 59413 54458 48528 31062 -27651 -33699 12703 11310 35701 25351 -21993
20520 -21993 32075 44797 20942 -30257 -32539 -44974 -49445 -39804 -22719 12221 508 52195
20508 52195 24390 -32873 -23422 28952 96043 42542 105123 164959 166011 174267 181229 62575
20496 62575 17687 73686 102772 47483 93079 93181 95733 48088 -11032 -3753 101337 82772
20484 82772 67125 37559 51096 58641 49596 63597 118978 119877 187712 175620 172354 199816 198992
$$ packed form
20569A45465l4683j0078K1198n8998k9577o0748k9087N1571J03843r283j4314
20558G5309L103L2J5857o124n4162M1199M7417J790j0293n0692n5715K6416O8396
20545A02533K2613l8308l7407L0747p257j9893J238o281l6814k305J6655m713
20533B0808M5023L507r925m955n930j7466n8713o048M6402j393K4391j0350m7344
20520b1993N4068J2722k3855n1199k282j2435m471R641J7085L4940j1713N1687
20508E2195k7805n7263R451N2374O7091n3501O2581N9836J052Q256O962j18654
20496F2575m4888N5999K9086n5289M5596J02K552m7645n9120P279J05090j8565
20484H2772j5647k9566J3537P545r045J4001N5381Q99O7835j2092l266K7462q24
$$ plain form
20471 198992 184347 186920 206248 256925 300075 352778 308687 265830 277598 340928 341909 356805
20459 356805 473948 465962 353040 277944 181441 224428 323703 402729 489062 506496 571764
20448 571764 552831 565987 602877 730529 827936 865380 873191 934630 964763 1017221 1053367
20437 1053367 1072916 1037643 993849 963962 993540 1041673 1050803 976686 931233 936629 966114 982174
20425 982174 967927 872217 820335 832269 857905 918588 988925 1080592 1156273 1170295 1233976
20414 1233976 1263065 1256065 1322972 1383577 1376707 1376143 1423240 1430473 1381252 1377616 1379445 1325435 1279730
20401 1279730 1231221 1238233 1287060 1307018 1287404 1235505 1181156 1214749 1261559 1245802 1227653
20390 1227653 1181701 1154500 1134761 1156621 1134674 1084831 1044031 1068630 1119577 1167351 1127406
$$ packed form
20471A98992j4645K573J9328N0677M3150N2703m4091m2857J1768O3330R81J4896
20459C56805J17143p986j12922p5096r6503M2987R9275P9026Q6333J7434O5268
20448E71764j8933J3156L6890J27652R7407L7444P811O1439L0133N2458L6146
20437A053367J9549l5273m3794k9887K9578M8133R130p4117m5453N396K9485J6060
20425I82174j4247r5710n1882J1934K5636O0683P0337R1667P5681J4022O3681
20414A233976K9089p000O6907O0605o870n64M7097P233m9221l636J829n4010m5705
20401A279730m8509P012M8827J9958j9614n1899n4349L3593M6810j5757j8149
20390A227653m5952k7201j9739K1860k1947m9843m0800K4599N0947M7774l9945
$$ plain form
20379 1127406 1137342 1162173 1157369 1133479 1202127 1247823 1266914 1253469 1197706 1155303 1194703 1258238
20367 1258238 1360809 1351147 1380934 1483663 1596363 1796200 1912879 2092437 2270375 2365585
20357 2365585 2437132 2552754 2657657 2686565 2673854 2665162 2668231 2692282 2757374 2814326 2934243
20346 2934243 3093615 3272555 3465689 3732279 4015425 4345804 4724787 5089404 5458644
20337 5458644 5798597 6128955 6456505 6787372 7151228 7742893 8347949 9079010 10008608
20328 10008608 11240191 12817783 14838518 17487472 21161142 26434606 34106705 45606590
20320 45606590 62440004 83807918 106480445 128396129 146005157 157517224 165327794
20313 165327794 168567810 167334932 162043950 150036294 133024614 113114375 92437238
$$ packed form
20379A127406R936K4831m804k3890O8648M5696J9091j3445n5763m2403L9400O3535
20367A258238J02571r662K9787J02729J12700J99837J16679J79558J77938R5210
20357B365585P1547J15622J04903K8908j2711q692L069K4051O5092N6952J19917
20346B934243J59372J78940J93134K66590K83146L30379L78983L64617L69240
20337E458644L39953L30358L27550L30867L63856N91665O05056P31061R29598
20328A0008608J231583J577592K020735K648954L673670N273464P672099J1499885
20320D5606590J6833414K1367914K2672527K1915684J7609028J1512067P810570
20313A65327794L240016j232878n290982j2007656j7011680j9910239k0677137
$$ plain form
20306 92437238 74934604 62353185 53754855 47739819 43426629 40235232 37834061 36101080
20298 36101080 34952171 34364298 34362073 35002179 36429199 38905773 42871863 49001938 58579385
20289 58579385 73204985 93346522 116137235 138794896 158745019 172291875 180961211
20282 180961211 185572476 185006700 180500094 169941057 153152950 132699050 110373266
20275 110373266 89838717 74311335 63407085 55603375 49902538 45364922 41627277
20268 41627277 38658258 36280170 34269187 32380697 30784034 29389916 28096222 27089945
20260 27089945 26257154 25456992 24655863 23899477 23154992 22478565 21786616 21122550 20552773
20251 20552773 19893082 19365863 18874681 18434491 17973333 17501881 17107466 16769589 16353163
$$ packed form
20306I2437238j7502634j2581419q598330o015036m313190l191397k401171j732981
20298C6101080j148909n87873k225O40106J427020K476574L966090O130075R577447
20289E8579385J4625600K0141537K2790713K2657661J9950123J3546856Q669336
20282A80961211M611265n65776m506606j0559037j6788107k0453900k2325784
20275A10373266k0534549j5527382j0904250p803710n700837m537616l737645
20268D1627277k969019k378088k010983j888490j596663j394118j293694j006277
20260B7089945q32791q00162q01129p56386p44485o76427o91949o64066n69777
20251B0552773o59691n27219m91182m40190m61158m71452l94415l37877m16426
$$ plain form
20242 16353163 15964097 15532742 15058759 14559232 14087299 13642356 13264284 12803191 12357423
20233 12357423 11934135 11545581 11224431 10896435 10561297 10253309 10048347 9847070 9580413
20224 9580413 9313917 9141361 9082163 8916196 8713777 8566107 8442738 8339431 8178320 8098514
20214 8098514 8008640 7798681 7589052 7466331 7409521 7249927 7076876 6950458 6858031 6786468
20204 6786468 6747077 6593352 6530334 6448327 6298889 6179547 6027699 5859919 5750319 5706273
20194 5706273 5749199 5729157 5685165 5630982 5624232 5589252 5527006 5465671 5342919 5319835 5234735
20183 5234735 5117850 4939075 4820801 4658250 4489625 4378432 4304798 4256502 4156712 4060149
20173 4060149 3984461 3920186 3901483 3897789 3839951 3823733 3823234 3755340 3605951 3546832 3606338 3723097
$$ packed form
20242A6353163l89066m31355m73983m99527m71933m44943l78072m61093m45768
20233A2357423m23288l88554l21150l27996l35138l07988k04962k01277k66657
20224I580413k66496j72556n9198j65967k02419j47670j23369j03307j61111p9806
20214H098514q9874k09959k09629j22721n6810j59594j73051j26418r2427p1563
20204F786468l9391j53725o3018q2007j49438j19342j51848j67780j09600m4046
20194E706273M2926k0042m3992n4183o750l4980o2246o1335j22752k3084q5100
20183E234735j16885j78775j18274j62551j68625j11193p3634m8296r9790r6563
20173D060149p5688o4275j8703l694n7838j6218m99o7894j49389n9119N9506J16759
$$ plain form
20161 3723097 3856910 3887768 3904174 3859591 3783037 3809054 3865242 3832733 3770777 3625039 3527916
20150 3527916 3467783 3383443 3297904 3214754 3134701 3065809 2911304 2748061 2640025 2632252 2617406
20139 2617406 2587620 2589534 2504032 2437877 2306036 2162584 2162481 2118247 2090400 2103052 2106876 2134158
20127 2134158 2246453 2353494 2278636 2176961 2115753 2083848 2099927 2024945 1883115 1830375
20117 1830375 1825083 1724872 1669654 1696656 1692813 1700923 1681018 1553715 1489299 1432161 1418320
20106 1418320 1455780 1437638 1403606 1339176 1273261 1304098 1279140 1260256 1278184 1226610 1231736
20095 1231736 1246166 1281123 1205984 1190119 1261502 1377814 1459330 1486711 1469225 1445910 1392789
20084 1392789 1394552 1426893 1381690 1313009 1193460 1124366 1037108 971060 882332 843580 903036
$$ packed form
20161C723097J33813L0858J6406m4583p6554K6017N6188l2509o1956j45738r7123
20150C527916o0133q4340q5539q3150q0053o8892j54505j63243j08036p773j4846
20139B617406k9786J914q5502o6155j31841j43452j03m4234k7847J2652L824K7282
20127B134158J12295J07041p4858j01675o1208l1905J6079p4982j41830n2740
20117A830375n292j00211n5218K7002l843Q110j9905j27303o4416n7138j3841
20106A418320L7460j8142l4032o4430o5915L0837k4958j8884J7928n1574N126
20095A231736J4430L4957p5139j5865P1383J16312Q1516K7381j7486k3315n3121
20084A392789J763L2341m5203o8681j19549o9094q7258o6048q8728l8752N9456
$$ plain form
20073 903036 953065 949313 880744 904675 900856 896187 851282 808271 803980 869753 894595 912430
20061 912430 921629 909430 886620 966342 1105594 1111580 1110078 1166990 1238162 1242266 1092294 1008454
20049 1008454 883813 758513 779043 761526 785613 752897 647529 590514 581229 585310 564256
20038 564256 582777 622379 675095 687864 662026 675214 682954 697202 695418 703257 715973 632663
20026 632663 574238 546328 515614 533113 562211 538496 516360 441528 425668 483676 446912
20015 446912 478124 486830 494246 431353 450192 509871 531735 535571 531609 527100 502821 454408
20003 454408 457912 468179 467438 504996 571342 572663 597428 515363 452311 519052 610975 653402
19991 653402 680890 657268 631291 625230 539480 504222 536973 496595 456874 399827 383545 422495
$$ packed form
20073I03036N0029l752o8569K3931l819m669m4905m3011m291O5773K4842J7835
20061I12430R199j2199k2810P9722J39252N986j502N6912P1172M104j49972q3840
20049A008454j24641j25300K0530j7517K4087l2716j05368n7015r285M081k1054
20038E64256J8521L9602N2716J2769k5838J3188P740J4248j784P839J2716q3310
20026F32663n8425k7910l0714J7499K9098k3715k2136p4832j5860N8008l6764
20015D46912L1212Q706P416o2893J8839N9679K1864L836l962m509k4279m8413
20003D54408L504J0267p41L7558O6346J321K4765q2065o3052O6741R1923M2427
19991F53402K7488k3622k5977o061q5750l5258L2751m0378l9721n7047j6282L8950
$$ plain form
19979 422495 421413 417876 425053 481584 401630 350368 413701 415704 395816 448424 502813 540975
19967 540975 604252 675089 710281 837637 847727 797623 785408 806675 755552 718234 737778
19956 737778 662750 482832 405194 394624 310200 262081 265958 338880 365150 424025 420090 356443
19944 356443 348499 406204 336546 354150 435001 476232 447236 456882 451187 432071 481751 510260
19932 510260 505095 510623 493799 529476 579188 606585 552486 514808 420658 378999 399784 426433
19920 426433 422615 458518 401498 367915 381651 409302 399966 306321 245976 319836 346974 351442
19908 351442 376745 409617 371921 354754 347045 349737 391874 404024 405271 385335 371983 376279
19896 376279 352910 278896 238564 233866 256722 273089 300409 291782 309882 366825 368184 379084
$$ packed form
19979D22495j082l537P177N6531p9954n1262O3333K003j9888N2608N4389L8162
19967E40975O3277P0837L5192J27356J0090n0104j2215K1267n1123l7318J9544
19956G37778p5028j79918p7638j0570q4424m8119L877P2922K6270N8875l935o3647
19944C56443p944N7705o9658J7604Q0851M1231k8996R646n695j9116M9680K8509
19932E10260n165N528j6824L5677M9712K7397n4099l7678r4150m1659K0785K6649
19920D26433l818L5903n7020l3583J3736K7651r336r3645o0345P3860K7138M468
19908C51442K5303L2872l7696j7167p709K692M2137J2150J247j9936j3352M296
19896C76279k3369p4014m0332m698K2856J6367K7320q627J8100N6943J359J0900
$$ plain form
19884 379084 411660 385860 295928 169607 187356 261004 345363 403878 360244 350985 331371
19873 331371 320698 275485 316389 402458 466650 415172 444084 517128 573065 554991 535908
19862 535908 490926 406537 363682 448952 526876 558526 505801 520007 514955 531685 577069 631312
19850 631312 619606 569878 571837 613934 652112 665293 595776 556807 575136 634833 682326 744000
19838 744000 777551 729745 684913 627017 603274 646478 693428 689276 709810 694902 705741 790972
19826 790972 835843 881079 999743 1223772 1477111 1756610 2087366 2332644 2550262 2652084
19816 2652084 2733507 2768236 2734126 2515233 2189098 1930605 1739715 1494944 1327779 1221337
19806 1221337 1166520 1176749 1094157 1071596 1045594 1013380 983754 982439 1007740 948414 930342
$$ packed form
19884C79084L2576k5800q9932j26321J7749P3648Q4359N8515m3634r259j9614
19873C31371j0673m5213M0904Q6069O4192n1478K8912P3044N5937j8074j9083
19862E35908m4982q4389m2855Q5270P7924L1650n2725J4206n052J6730M5384N4243
19850F31312j1706m9728J959M2097L8178J3181o9517l8969J8329N9697M7493O1674
19838G44000L3551m7806m4832n7896k3743M3204M6950m152K0534j4908J0839Q5231
19826G90972M4871M5236J18664K24029K53339K79499L30756K45278K17618J01822
19816B652084Q1423L4729l4110k18893l26135k58493j90890k44771j67165j06442
19806A221337n4817J0229q2592k2561k6002l2214k9626j315K5301n9326j8072
$$ plain form
19795 930342 884193 881981 940248 1057254 1132629 1298688 1611906 1917804 2231856 2503806
19785 2503806 2673113 2765942 2755973 2625620 2518448 2320889 1982842 1685724 1436562 1307528
19775 1307528 1180697 1054075 1020267 1017936 956870 888733 807182 787074 771970 752442 782050
19764 782050 746077 683883 722596 713866 661097 624963 552794 517518 462666 419888 491946 555608
19752 555608 539522 495429 467753 478727 488315 423579 351047 317212 401018 449046 439790 395048
19740 395048 349779 391790 429048 381261 355864 420705 516950 561535 555822 618565 723081
19729 723081 789189 897902 1002839 1120122 1165713 1148524 1184159 1183198 1160327 1066926 951628
19718 951628 864300 772669 688360 693813 618075 507786 503735 521770 540102 597048 604446 585129
$$ packed form
19795I30342m6149k212N8267J17006P5375J66059L13218L05898L14052K71950
19785B503806J69307R2829r969j30353j07172j97559l38047k97118k49162j29034
19775A307528j26831j26622l3808k331o1066o8137q1551k0108j5104j9528K9608
19764G82050l5973o2194L8713q730n2769l6134p2169l5276n4852m2778P2058O3662
19752E55608j6086m4093k7676J0974R588o4736p2532l3835Q3806M8028r256m4742
19740C95048m5269M2011L7258m7787k5397O4841R6245M4585n713O2743J04516
19729G23081O6108J08713J04937J17283M5591j7189L5635r61k2871r3401j15298
19718I51628q7328r1631q4309N453p5738j10289m051J8035J8332N6946P398j9317
$$ plain form
19706 585129 474499 438094 459940 512389 556911 581372 569847 636594 804786 909078 957133
19695 957133 1045138 1162798 1252150 1259579 1268189 1207988 1111315 1084356 974259 861789 730108
19684 730108 659348 620647 446128 358157 273302 312811 351763 367307 364778 365601 338643 334238
19672 334238 318319 291843 264120 260080 278375 297917 254674 253109 251681 279933 255133 156038
19660 156038 122228 105938 123100 83360 143717 171643 167285 175561 203273 284672 271336 228226
19648 228226 203452 192792 144884 59691 105669 128698 93346 -4035 -30324 37351 54629
19637 54629 107120 129869 85291 141703 217795 189180 150917 149621 77687 74846 79506 83213
19625 83213 153829 168141 168328 138970 164070 160594 88566 24924 58079 82021 163190 169466
$$ packed form
19706E85129j10630l6405K1846N2449M4522K4461j1525O6747J68192J04292M8055
19695I57133Q8005J17660Q9352P429Q610o0201r6673k6959j10097j12470j31681
19684G30108p0760l8701j74519q7971q4855L9509L8952J5544k529Q23k6958m405
19672C34238j5919k6476k7723m040J8295J9542m3243j565j428K8252k4800r9095
19660A56038l3810j6290J7162l9740O0357K7926m358Q276K7712Q1399j3336m3110
19648B28226k4774j0660m7908q5193M5978K3029l5352r7381k6289O7675J7278
19637E4629N2491K2749m4578N6412P6092k8615l8263j296p1934k841M660L707
19625H3213P0616J4312J87k9358K5100l476p2028o3642L3155K3942Q1169O276
$$ plain form
19613 169466 86128 99104 114870 69454 57888 -35110 -12181 9167 84127 131694 76992
19602 76992 8071 39941 91995 172119 178045 124141 137038 158335 177068 181677 148913 175291
19590 175291 121778 155885 200524 196108 194291 202488 160864 143482 107854 86421 90995 95805
19578 95805 42059 93831 99093 69930 9754 40466 161870 173432 131116 59878 53511 83467
19566 83467 118295 144990 112747 96656 53361 42008 68364 141720 201309 139314 51024 24265
19554 24265 976 -16626 43438 88491 162462 161647 170129 205612 258741 150780 100918 151627
19542 151627 175462 172558 187738 223104 201748 149806 93972 108888 179299 175016 150171 146247
19530 146247 114711 57418 45010 102621 149038 137733 208777 254713 272796 317561 285520
$$ packed form
19613A69466q3338J2976J5766m5416j1566r2998K2929K1348P4960M7567n4702
19602G6992o8921L1870N2054Q0124N926n3904J2897K1297J8733M609l2764K6378
19590A75291n3513L4107M4639m416j817Q197m1624j7382l5628k1433M574M810
19578I5805n3746N1772N262k9163o0176L0712J21404J1562m2316p1238o367K9956
19566H3467L4828K6695l2243j6091m3295j1353K6356P3356N9589o1995q8290k6759
19554B4265k3289j7602O0064M5053P3971q15Q482L5483N3129j07961m9862N0709
19542A51627K3835k904J5180L5366k1356n1942n5834J4916P0411m283k4845l924
19530A46247l1536n7293j2408N7611M6417j1305P1044M5936J8083M4765l2041
$$ plain form
19519 285520 174624 125311 105918 143051 178816 159268 136657 120498 67881 52350 49051
19508 49051 127184 150280 88107 56449 127932 155089 132993 109679 90498 79847 64344 126047
19496 126047 215526 177758 127937 126625 154266 135496 129986 130175 39084 -38 7675 44772
19484 44772 63228 87953 109866 144118 112810 53583 -16930 8487 36782 23278 -24088 -10524
19472 -10524 42971 67741 31660 -16018 -51450 -43077 -9462 -5642 52633 58882 -12008 -40602
19460 -40602 -1240 3006 33440 68353 108682 102430 -28343 -36680 -4738 6075 17847 45439
19448 45439 -1995 -30952 -35646 -13277 -27983 -32082 -42763 -41953 -6463 23859 28588 -3230 -56268
19435 -56268 -58220 -52966 7604 -37006 -45348 50322 101247 99990 97731 147843 120449 125369 120130
$$ packed form
19519B85520j10896m9313j9393L7133L5765j9548k2611j6159n2617j5531l299
19508D9051P8133K3096o2173l1658P1483K7157k2096k3314j9181j0651j5503O1703
19496A26047Q9479l7768m9821j312K7641j8770n510J89r1091l9122P713L7097
19484D4772J8456K4725K1913L4252l1308n9227p0513K5417K8295j3504m7366J3564
19472a0524N3495K4770l6081m7678l5432Q373L3615L820N8275O249p0890k8594
19460d0602L9362M246L0434L4913M0329o252j30773q337L1942J0813J1772K7592
19448D5439m7434k8957m694K2369j4706m099j0681Q10L5490L0322M729l1818n3038
19435e6268j952N254O0570m4610q342R5670N0925j257k259N0112k7394M920n239
$$ plain form
19422 120130 117252 177545 194056 159609 214714 255113 231885 235609 236720 278913 385790 568795
19410 568795 735000 912018 1077607 1150706 1177457 1265305 1395133 1521044 1606420 1569149
19400 1569149 1513333 1423680 1331543 1307912 1280522 1192943 1085766 937707 707298 596789
19390 596789 529510 398226 353852 311003 312235 337411 337327 257511 201752 217870 139013 168199
19378 168199 219113 245953 141095 61137 57943 156767 143157 27244 89693 169628 193345
19367 193345 200126 210420 208602 177178 181430 161145 149902 115577 108320 78331 73479 149388
19355 149388 115709 91722 120252 129711 132884 117400 89387 38814 25284 16537 -30287 63013
19343 63013 85528 52818 37190 62552 83787 99398 60610 72154 30783 57247 97379 12172
$$ packed form
19422A20130k878O0293J6511l4447N5105M0399k3228L724J111M2193J06877J83005
19410E68795J66205J77018J65589P3099K6751Q7848J29828J25911Q5376l7271
19400A569149n5816q9653r2137k3631k7390q7579j07177j48059k30409j10509
19390E96789o7279j31284m4374m2849J232K5176q4p9816n5759J6118p8857K9186
19378A68199N0914K6840j04858p9958l194R8824j3610j15913O2449P9935K3717
19367A93345O781J0294j818l1424M252k0285j1243l4325p257k9989m852P5909
19355A49388l3679k3987K8530R459L173j5484k8013n0573j3530q747m6824R3300
19343F3013K2515l2710j5628K5362K1235J5611l8788J1544m1371K6464M0132q5207
$$ plain form
19331 12172 -66896 -52735 -8033 22584 9928 -46856 -76650 -97796 -86791 -48875 -96089 -70586
19319 -70586 -7744 33784 99238 102722 37612 -16965 -4029 16439 4641 -54997 -84800 -35693
19307 -35693 41932 55972 52727 21585 -30849 -22464 35398 25787 43272 49556 27902 -2335
19295 -2335 -15815 -64791 -107381 -150969 -82854 12670 102690 151721 119335 -10182 29422 93046
19283 93046 89905 97080 53790 33709 928 -26845 -2379 31600 63520 80919 82115 58173
19271 58173 127042 216145 174191 112849 140001 168228 214145 212812 184367 145972 187148 232820
19259 232820 368973 595783 691350 811712 808479 653373 534153 486697 525215 668513
19249 668513 867246 998600 948437 829824 662924 532220 453669 478347 427144 271730
$$ packed form
19331A2172p9068J4161M4702L0617j2656n6784k9794k1146J1005L7916m7214K5503
19319g0586O2842M1528O5454L484o5110n4577J2936K0468j1798n9638k9803M9107
19307c5693P7625J4040l245l1142n2434Q385N7862r611J7485O284k1654l0237
19295b335j3480m8976m2590m3588O8115R5524R0020M9031l2386j29517L9604O3624
19283I3046l141P175m3290k0081l2781k7773K4466L3979L1920J7399J196k3942
19271E8173O8869Q9103m1954o1342K7152K8227M5917j333k8445l8395M1176M5672
19259B32820J36153K26810R5567J20362l233j55106j19220m7456L8518J43298
19249F68513J98733J31354n0163j18613j66900j30704p8551K4678n1203j55414
$$ plain form
19239 271730 237469 223874 249296 260913 298643 264331 273422 271717 296490 310573 404183 485992
19227 485992 623414 795396 897963 902715 759391 675879 678337 779196 862904 936100 1020627
19216 1020627 1079341 1028401 783071 592430 488977 397427 393402 331824 307674 424536 400820
19205 400820 307235 338169 387498 410158 437053 442336 486540 513807 516685 499174 486368 511366
19193 511366 596469 583797 598866 615185 594809 492937 463406 476028 447514 457481 428061
19182 428061 367784 296668 231121 215240 191919 173879 178201 180344 272702 190734 137054 98599
19170 98599 100159 135666 120892 104924 97013 71163 200726 252400 171981 158145 157764 180811
19158 180811 142485 119347 172452 161689 163845 109733 74535 98132 101482 142130 131535 118238
$$ packed form
19239B71730l4261j3595K5422J1617L7730l4312R091j705K4773J4083R3610Q1809
19227D85992J37422J71982J02567M752j43324q3512K458J00859Q3708P3196Q4527
19216A020627N8714n0940k45330j90641j03453r1550m025o1578k4150J16862k3716
19205D00820r3585L0934M9329K2660K6895N283M4204K7267K878j7511j2806K4998
19193E11366Q5103j2672J5069J6319k0376j01872k9531J2622k8514R967k9420
19182D28061o0277p1116o5547j5881k3321j8040M322K143R2358q1968n3680l8455
19170I8599J560L5507j4774j5968p911k5850J29563N1674q0419j3836l81K3047
19158A80811l8326k3138N3105j0763K156n4112l5198K3597L350M0648j0595j3297
$$ plain form
19146 118238 149818 195998 122593 99811 128502 75043 75202 86712 77931 133864 133658 105354
19134 105354 134977 115461 29446 21726 95383 132621 153359 233043 292703 267956 229813 167886
19122 167886 194294 169927 132907 132773 172446 132999 103273 172929 188259 130667 134400 137620
19110 137620 185996 163524 158040 196380 202866 155897 102762 113102 138831 147746 152433 218620
19098 218620 201189 156372 108446 82677 57168 67238 98980 69157 118125 90800 3050
19087 3050 1695 14016 -5856 24919 -30039 -23183 -2121 9815 -8959 -38576 -24369 -5077
19075 -5077 47341 62086 24127 60167 73402 22931 74045 165655 182909 148543 117193 112053
19063 112053 146526 139406 100970 23606 101603 169257 189047 147640 69050 51927 105649 156016
$$ packed form
19146A18238L1580M6180p3405k2782K8691n3459J59J1510q781N5933k06k8304
19134A05354K9623j9516q6015p720P3657L7238K0738P9684N9660k4747l8143o1927
19122A67886K6408k4367l7020j34L9673l9447k9726O9656J5330n7592L733L220
19110A37620M8376k2472n484L8340O486m6969n3135J0340K5729Q915M687O6187
19098B18620j7431m4817m7926k5769k5509J0070L1742k9823M8968k7325q7750
19087C050j355J2321j9872L0775n4958O856K1062J1936j8774k9617J4207J9292
19075e077N2418J4745l7959L6040J3235n0471N1114R1610J7254l4366l1350n140
19063A12053L4473p120l8436p7364P7997O7654J9790m1407p8590j7123N3722N0367
$$ plain form
19051 156016 133393 130982 126556 118216 138075 185452 184002 100426 101149 176944 169874 132033 138693
19038 138693 99676 154934 174259 171077 153008 165936 156613 168970 202805 294471 345340 318949
19026 318949 372909 354500 312497 244025 233092 305400 424662 461257 442644 447052 456922 372353
19014 372353 258523 281316 293143 287937 350643 466125 548997 496736 388598 299439 309658
19003 309658 392225 443898 583035 731899 784411 805866 919188 1073391 1189367 1400392
18993 1400392 1533535 1512373 1561725 1734754 1882048 1993943 2004089 2020486 2025636 2013173 1929678
18982 1929678 1809889 1726454 1754539 1770014 1621374 1433372 1425296 1458472 1439548 1408890 1396997
18971 1396997 1459434 1430841 1366101 1302255 1222120 1164338 1179671 1215106 1219250 1189608 1172275
$$ packed form
19051A56016k2623k411m426q340J9859M7377j450q3576P23P5795p070l7841O660
19038A38693l9017N5258J9325l182j8069J2928r323J2357L3835R1666N0869k6391
19026C18949N3960j8409m2003o8472j0933P2308J19262L6595j8613M408R870q4569
19014C72353j13830K2793J1827n206O2706J15482Q2872n2261j08138q9159J0219
19003C09658Q2567N1673J39137J48864N2512K1455J13322J54203J15976K11025
18993A400392J33143k1162M9352J73029J47294J11895J0146J6397N150j2463q3495
18982A929678j19789q3435K8085J5475j48640j88002q076L3176j8924l0658j1893
18971A396997O2437k8593o4740o3846q0135n7782J5333L5435M144k9642j7333
$$ plain form
18960 1172275 1120873 1081531 1054079 1007199 988971 972689 1012008 1066996 1042048 955996 974205
18949 974205 990902 1082789 1024531 932602 932749 897436 840030 800533 800051 788796 849843 904095
18937 904095 942162 886831 780913 767777 781732 777110 798284 796384 803860 784478 779159 791301
18925 791301 787290 818202 941827 892432 762179 727844 813212 856484 905551 938660 950024
18914 950024 1050443 1094735 1134908 1135980 1163886 1244207 1290167 1319627 1318158 1425792 1542597
18903 1542597 1556724 1598839 1689107 1769062 1814162 1885517 1937561 2079065 2235563 2399530 2548992
18892 2548992 2818184 3110430 3374388 3698620 4061883 4657280 5415731 6216080 6949618
18883 6949618 7638609 8408816 9273077 10385158 11779288 13476156 15399023 17709040 20774578
$$ packed form
18960A172275n1402l9342k7452m6880j8228j6282L9319N4988k4948q6052J8209
18949I74205J6697R1887n8258r1929J47l5313n7406l9497m82j1255O1047N4252
18937I04095L8067n5331j05918j3136J3955m622K1174j900P476j9382n319J2142
18925G91301m011L0912J23625m9395j30253l4335Q5368M3272M9067L3109J1364
18914I50024J00419M4292M0173J072K7906Q0321M5960K9460j469J07634J16805
18903A542597J4127M2115R0268P9955M5100P1355N2044J41504J56498J63967J49462
18892B548992K69192K92246K63958L24232L63263N95397P58451Q00349P33538
18883F949618O88991P70207Q64261J112081J394130J696868J922867K310017L065538
$$ plain form
18874 20774578 25140862 31763359 42838708 62014017 93833419 133873109 165018849
18867 165018849 184915004 191422139 193189492 209076134 233214457 260897434 285521407
18860 285521407 288894302 278059718 264093326 244351761 235152779 237820503 235137070
18853 235137070 220098154 184410571 141203222 109097096 89382833 76986636 68754284
18846 68754284 62757964 57947177 53844911 50396743 47372156 44688309 42347633 40327799
18838 40327799 38573277 36928996 35356230 33792324 32280273 30926954 29806125 28906809
18830 28906809 28041920 27284076 26477214 25688253 24932314 24177506 23460971 22853520 22155928
18821 22155928 21447635 20746776 20107236 19524540 18889958 18291229 17764517 17181456 16559352
$$ packed form
18874B0774578M366284O622497J1075349J9175309L1819402M0039690L1145740
18867A65018849J9896155O507135J767353J5886642K4138323K7682977K4623973
18860B85521407L372895j0834584j3966392j9741565r198982K667724k683433
18853B35137070j5038916l5687583m3207349l2106126j9714263j2396197q232352
18846F8754284n996320m810787m102266l448168l024587k683847k340676k019834
18838D0327799j754522j644281j572766j563906j512051j353319j120829q99316
18830B8906809q64889p57844q06862p88961p55939p54808p16535o07451o97592
18821B2155928p08293p00859o39540n82696o34582n98729n26712n83061o22104
$$ plain form
18812 16559352 16029760 15541758 15085581 14692519 14242464 13938831 13713405 13480538 13228365
18803 13228365 12938698 12631675 12386216 12107039 11943567 11741136 11594802 11407146 11212370
18794 11212370 11043911 10948934 10897527 10748838 10547699 10407368 10294802 10143924 9953058 9711565
18784 9711565 9484594 9322363 9118053 8930746 8700763 8580880 8539216 8496667 8410897 8225237
18774 8225237 8043425 7870663 7690418 7539365 7437756 7372877 7321422 7306955 7355455 7386674
18764 7386674 7360544 7318439 7216422 7064459 6898743 6850792 6896513 6913943 7036997 7185262
18754 7185262 7279471 7342280 7539388 7846387 8226152 8644946 9066941 9548033 10006858 10525546
18744 10525546 11126829 11810449 12542208 13586973 14995442 16664033 18972279 22059940
$$ packed form
18812A6559352n29592m88002m56177l93062m50055l03633k25426k32867k52173
18803A3228365k89667l07023k45459k79177j63472k02431j46334j87656j94776
18794A1212370j68459r4977n1407j48689k01139j40331j12566j50878j90866k41493
18784I711565k26971j62231k04310j87307k29983j19883m1664m2549q5770j85660
18774H225237j81812j72762j80245j51053j01609o4879n1455j4467M8500L1219
18764G386674k6130m2105j02017j51963j65716m7951M5721J7430J23054J48265
18754G185262R4209O2809J97108L06999L79765M18794M21995M81092M58825N18688
18744A0525546O01283O83620P31759J044765J408469J668591K308246L087661
$$ plain form
18736 22059940 26156757 32115428 42053384 59757316 90094867 130252748 161516514
18729 161516514 175554960 167652976 139289703 111704352 100741425 108624655 132863136
18722 132863136 158638817 171048471 166609454 141233105 107121628 81123706 65596824
18715 65596824 56209477 50121583 46054915 43232006 41243533 39991054 39353873 39068669
18707 39068669 39304285 40466195 42694738 46494064 53184461 65646147 88502995 123781734
18699 123781734 158211531 177378412 178247697 156579764 126744460 108994161 109373058
18692 109373058 127089043 153604233 170872511 173166966 155478366 122340174 91998694
18685 91998694 72634169 60920376 53212260 47940274 44117493 41105645 38580894 36456755
$$ packed form
18736B2059940M096817N958671R937956J7703932L0337551M0157881L1263766
18729A61516514J4038446p901984k8363273k7585351j0962927P883230K4238481
18722A32863136K5775681J2409654m439017k5376349l4111477k5997922j5526882
18715F5596824r387347o087894m066668k822909j988473j252479o37181k85204
18707C9068669K35616J161910K228543L799326O690397J2461686K2856848L5278739
18699A23781734L4429797J9166881Q69285k1667933k9835304j7750299L78897
18692A09373058J7715985K6515190J7268278K294455j7688600l3138192l0341480
18685I1998694j9364525j1713793p708116n271986l822781l011848k524751k124139
$$ plain form
18677 36456755 34527679 32707413 30987868 29483899 28301937 27192431 26256928 25307658
18669 25307658 24340304 23455231 22658096 21934176 21344789 20774242 20211375 19663804 19142309
18660 19142309 18593321 18102808 17651458 17210824 16736652 16283172 15852821 15421286 15015616
18651 15015616 14548757 14114644 13718111 13352503 13014107 12690924 12338776 11945120 11633705
18642 11633705 11396073 11161594 10981495 10787277 10566429 10343028 10103239 9933428 9768890
18633 9768890 9607763 9447822 9272099 9127577 9002198 8903635 8772767 8695264 8553665 8372328
18623 8372328 8203500 8079171 7934856 7793443 7657632 7543417 7447298 7401915 7353959 7299682
18613 7299682 7182740 7090546 7042020 7007922 6942050 6873556 6833708 6800715 6797055 6791419 6822511
$$ packed form
18677C6456755j929076j820266j719545j503969j181962j109506r35503r49270
18669B5307658r67354q85073p97135p23920n89387n70547n62867n47571n21495
18660A9142309n48988m90513m51350m40634m74172m53480m30351m31535m05670
18651A5015616m66859m34113l96533l65608l38396l23183l52148l93656l11415
18642A1633705k37632k34479j80099j94218k20848k23401k39789j69811j64538
18633I768890j61127j59941j75723j44522j25379r8563j30868p7503j41599j81337
18623H372328j68828j24329j44315j41413j35811j14215r6119m5383m7956n4277
18613G299682j16942r2194m8526l4098o5872o8494l9848l2993l660n636L1092
$$ plain form
18602 6822511 6818788 6732794 6576560 6347388 6149443 6004267 5875318 5789476 5715222 5599077
18592 5599077 5412564 5253042 5198716 5175989 5063360 4936292 4699906 4566587 4523348 4466530
18582 4466530 4385514 4269752 4157005 4256007 4216754 4130347 4121347 4094769 4092408 4116236 4149685
18571 4149685 4122722 4184547 4115244 4023882 3947642 3881035 3845542 3788258 3805543 3686517 3613962
18560 3613962 3573649 3526496 3393189 3237483 3191385 3113070 3026985 3023290 2955985 2858881 2752133
18549 2752133 2617530 2601473 2521994 2502546 2473565 2435491 2325020 2258181 2289838 2236961 2179237
18538 2179237 2150418 2187522 2208690 2187806 2164119 2154755 2170225 2166602 2247886 2245832 2274546 2246130
18526 2246130 2245826 2319752 2304898 2260828 2190076 2088538 2033748 2004406 1975089 1933642 1907900
$$ packed form
18602F822511l723q5994j56234k29172j97945j45176j28949q5842p4254j16145
18592E599077j86513j59522n4326k2727j12629j27068k36386j33319m3239n6818
18582D466530q1016j15762j12747R9002l9253q6407r000k6578k361K3828L3449
18571D149685k6963O1825o9303r1362p6240o6607l5493n7284J7285j19026p2555
18560C613962m0313m7153j33307j55706m6098p8315q6085l695o7305r7104j06748
18549B752133j34603j6057p9479j9448k8981l8074j10471o6839L1657n2877n7724
18538B179237k8819L7104K1168k0884k3687r364J5470l623Q1284k054K8714k8416
18526B246130l04P3926j4854m4070p0752j01538n4790k9342k9317m1447k5742
$$ plain form
18515 1907900 1810728 1665170 1590239 1541462 1511023 1526209 1537634 1531503 1484962 1420767 1470544
18504 1470544 1433965 1455233 1404140 1394931 1457031 1435480 1406740 1396640 1424969 1423276 1368238 1343532
18492 1343532 1319496 1314772 1252741 1218492 1095583 1029276 1012815 1054795 984686 962084 998180
18481 998180 1014392 1021922 1024507 1010193 1031689 1100507 1067655 1049986 1003534 956576 975881 958205
18469 958205 1010509 1083654 987504 940702 982057 979173 964475 940270 966608 895592 843612 854945
18457 854945 835286 809214 808248 851997 854889 837104 854170 853086 888562 886591 912315 1003898
18445 1003898 1056061 1007776 1061135 1063401 1048871 1087284 1130904 1042390 926646 936989 954169
18434 954169 941731 945119 972419 932357 904253 857654 794790 757845 697907 649903 601067 660008
$$ packed form
18515A907900r7172j45558p4931m8777l0439J5186J1425o131m6541o4195M9777
18504A470544l6579K1268n1093r209O2100k1551k8740j0100K8329j693n5038k4706
18492A343532k4036m724o2031l4249j22909o6307j6461M1980p0109k2602L6096
18481I98180J6212P530K585j4314K1496O8818l2852j7669m6452m6958J9305j7676
18469I58205N2304P3145r6150m6802M1355k884j4698k4205K6338p1016n1980J1333
18457H54945j9659k6072r66M3749K892j7785J7066j084L5476j971K5724R1583
18445A003898N2163m8285N3359K266j4530L8413M3620q8514j15744J0343J7180
18434I54169j2438L388K7300m0062k8104m6599o2864l6945n9938m8004m8836N8941
$$ plain form
18422 660008 676239 661571 710393 710404 720063 732914 797213 844540 831208 861692 828254 744529
18410 744529 804549 855084 791244 779185 828025 864232 879352 830757 780098 744374 753761 786611
18398 786611 802702 857965 798784 711872 629095 621477 608690 643403 666602 642624 593118 457389
18386 457389 486330 556596 474538 476089 577212 623098 519694 470761 509618 533261 486587
18375 486587 438126 466744 496747 536509 595085 654917 622023 628293 646188 608579 562106 539427
18363 539427 493157 524000 526488 504648 531678 502398 494471 511784 562092 501505 516433 586597
18351 586597 616826 626675 653786 666236 660501 652412 608433 555231 544712 584975 556087 606470
18339 606470 654667 679602 698632 603987 473718 479623 471985 477322 555022 557607 525266 540514
$$ packed form
18422F60008J6231j4668M8822J1R659J2851O4299M7327j3332L0484l3438q3725
18410G44529O0020N0535o3840j2059M8840L6207J5120m8595n0659l5724R387L2850
18398G86611J6091N5263n9181q6912q2777p618j2787L4713K3199k3978m9506j35729
18386D57389K8941P0266q2058J551J01123M5886j03404m8933L8857K3643m6674
18375D86587m8461K8618L0003L9762N8576N9832l2894O270J7895l7609m6473k2679
18363E39427m6270L0843K488k1840K7030k9280p927J7313N0308o0587J4928P0164
18351E86597L0229R849K7111J2450n735q089m3979n3202j0519M0263k8888N0383
18339F06470M8197K4935J9030r4645j30269N905p638N337P7700K585l2341J5248
$$ plain form
18327 540514 559674 638997 681202 784098 932007 1124028 1315862 1515883 1616578 1645573
18317 1645573 1678524 1888902 1996294 2111402 2098296 1961957 1915981 1851750 1806771 1790897
18307 1790897 1780882 1728061 1587630 1281704 1048268 907928 884885 807783 796830 757043
18297 757043 707099 712960 710266 699918 664648 636961 653822 626717 601088 609739 609267 606534 611211
18284 611211 606494 610076 597190 644450 718858 734244 651186 711198 771103 906859 905879 924679
18272 924679 1070465 1262317 1384000 1488096 1631989 1774321 2019269 2305967 2497288 2671592
18262 2671592 2893772 3062531 3196293 3370464 3454514 3555021 3600336 3656256 3707146 3658220
18252 3658220 3520789 3434913 3369682 3242296 3030896 2823832 2614819 2485564 2360390 2189341
$$ packed form
18327E40514J9160P9323M2205J02896J47909J92021J91834K00021J00695K8995
18317A645573L2951K10378J07392J15108j3106j36339m5976o4231m4979j5874
18307A790897j0015n2821j40431l05926k33436j40340k3043p7102j0953l9787
18297G57043m9944N861k694j0348l5270k7687J6861k7105k5629Q651m72k733M677
18284F11211m717L582j2886M7260P4408J5386q3058O0012N9905J35756r80J8800
18272I24679J45786J91852J21683J04096J43893J42332K44948K86698J91321J74304
18262B671592K22180J68759J33762J74171Q4050J00507M5315N5920N0890m8926
18252C658220j37431q5876o5231j27386k11400k07064k09013j29255j25174j71049
$$ plain form
18242 2189341 2087325 1955082 1784622 1763090 1813584 1822923 1761461 1638499 1511363 1439763
18232 1439763 1439067 1423949 1454361 1475039 1393752 1350961 1305156 1265872 1260932 1257099 1159369 1131332
18220 1131332 1172511 1222643 1201254 1103433 1036137 981378 913458 831404 893183 910591 1002958
18209 1002958 988480 925271 849836 838981 869475 921901 888908 906693 883782 1008249 1229089
18198 1229089 1411669 1548246 1639167 1601685 1455684 1385731 1333775 1298134 1362276 1458612 1532198
18187 1532198 1543542 1416391 1232210 1049685 948750 914557 871686 888925 877324 876401 905131
18176 905131 905886 904442 799573 690763 639838 723809 805013 928921 1109614 1268683 1403425
18165 1403425 1486402 1488279 1419292 1280682 1156167 1084005 1211699 1380486 1496559 1583887
$$ packed form
18242B189341j02016j32243j70460k1532N0494R339o1462j22962j27136p1600
18232A439763o96j5118L0412K0678q1287m2791m5805l9284m940l833r7730k8037
18220A131332M1179N0132k1389r7821o7296n4759o7920q2054O1779J7408R2367
18209A002958j4478o3209p5435j0855L0494N2426l2993J7785k2911J24467K20840
18198A229089J82580J36577R0921l7482j46001o9953n1956l5641O4142R6336P3586
18187A532198J1344j27151j84181j82525j00935l4193m2871J7239j1601r23K8730
18176I05131P55j444j04869j08810n0925Q3971Q1204J23908J80693J59069J34742
18165A403425Q2977J877o8987j38610j24515p2162J27694J68787J16073Q7328
$$ plain form
18155 1583887 1511284 1297534 1149591 1089597 1046730 1027561 950254 955337 966919 915782 820745
18144 820745 791638 794789 810531 753927 740050 779771 855640 893213 888990 904323 874812 841984
18132 841984 804781 890191 1018356 1084974 1102369 1121424 1227596 1300718 1396400 1476799 1587346
18121 1587346 1753212 1863369 2014321 2264741 2467104 2742168 3148109 3739812 4596897
18112 4596897 5811118 7556752 10463766 15419914 24823475 41302238 61079657 72886561
18104 72886561 75900281 66097971 47054654 31233175 22210387 17153577 14123130 12247842
18096 12247842 10989936 9876778 8925922 8193860 7553152 6901955 6458551 6058826 5685618
18087 5685618 5471100 5254718 5120639 4979541 4878769 4816120 4708984 4613452 4507386 4370052
$$ packed form
18155A583887p2603k13750j47943n9994m2867j9169p7307N083J1582n1137r5037
18144H20745k9107L151J5742n6604j3877L9721P5869L7573m223J5333k9511l2828
18132H41984l7203Q5410J28165O6618J7395J9055J06172P3122R5682Q0399J10547
18121A587346J65866J10157J50952K50420K02363K75064M05941N91703Q57085
18112D596897J214221J745634K907014M956148R403561J6478763J9777419J1806904
18104G2886561L013720r802310j9043317j5821479r022788n056810l030447j875288
18096A2247842j257906j113158r50856p32062o40708o51197m43404l99725l73208
18087E685618k14518k16382j34079j41098j00772o2649j07136r5532j06066j37334
$$ plain form
18077 4370052 4207636 4094165 3963872 3873110 3846375 3767300 3635565 3556052 3431231 3331359
18067 3331359 3194625 3084315 2994471 2905878 2769518 2612697 2526079 2476957 2375459 2324503
18057 2324503 2242135 2164353 2112774 2067059 2041566 2004765 1903322 1860890 1822248 1794975 1771717
18046 1771717 1778263 1792970 1801481 1871223 1932502 2023366 2106665 2092052 2200650 2327525 2402442
18035 2402442 2488882 2566330 2663469 2810009 2913194 2951603 2932039 2839968 2872085 2994481 3021586
18024 3021586 2992423 2903619 2874289 2873640 2767745 2602403 2428305 2290053 2239077 2110292 1956516
18013 1956516 1861100 1819812 1830797 1729133 1718889 1775038 1757913 1803714 1856815 1983768 2067566
18002 2067566 2128284 2183674 2337591 2524174 2654374 2656909 2573088 2606836 2631786 2627195 2606032
$$ packed form
18077D370052j62416j13471j30293r0762k6735p9075j31735p9513j24821r9872
18067C331359j36734j10310q9844q8593j36360j56821q6618m9122j01498n0956
18057B324503q2368p7782n1579m5715k5493l6801j01443m2432l8642k7273k3258
18046A771717O546J4707Q511O9742O1279R0864Q3299j4613J08598J26875P4917
18035B402442Q6440P7448R7139J46540J03185L8409j9564r2071L2117J22396K7105
18024C021586k9163q8804k9330o49j05895j65342j74098j38252n0976j28785j53776
18013A956516r5416m1288J0985j01664j0244N6149j7125M5801N3101J26953Q3798
18002B067566O0718N5390J53917J86583J30200K535q3821L3748K4950m591k1163
$$ plain form
17991 2606032 2657339 2622564 2586860 2466375 2300177 2116603 2127267 2121462 2046685 2001679 1861657
17980 1861657 1764685 1730542 1716065 1676839 1593610 1480233 1356129 1243368 1233057 1184460 1153494
17969 1153494 1140915 1123311 1139024 1159782 1098793 1043191 1045806 1028532 1011782 1086552 1088281 1077587
17957 1077587 1069816 1056571 1050708 1037857 977142 955843 960196 929377 938788 925367 895079 884812
17945 884812 931810 890969 830019 835468 882979 783538 683424 712014 734318 714382 669946
17934 669946 617935 565642 712049 774073 745389 767659 786161 804153 826730 795170 688157
17923 688157 644392 649235 601031 583061 647634 616912 644293 655931 715559 748635 776235 691551
17911 691551 576502 641255 617754 614987 609162 606248 607171 564837 532407 586065 579164 582587 582150
$$ packed form
17991B606032N1307l4775l5704j20485j66198j83574J0664n805p4777m5006j40022
17980A861657r6972l4143j4477l9226q3229j13377j24104j12761j0311m8597l0966
17969A153494j2579j7604J5713K0758o0989n5602K615j7274j6750P4770J729j0694
17957A077587p771j3245n863j2851o0715k1299M353l0819R411j3421l0288j0267
17945H84812M6998m0841o0950N449M7511r9441j00114K8590K2304j9936m4436
17934F69946n2011n2293J46407O2024k8684K2270J8502J7992K2577l1560j07013
17923F88157m3765M843m8204j7970O4573l0722K7381J1638N9628L3076K7600q4684
17911F91551j15049O4753k3501k767n825k914R23m2334l2430N3658o901L423m37
$$ plain form
17898 582150 555713 536450 493644 477148 470473 543013 554739 487970 476775 400018 429679 355851
17886 355851 263366 285793 299189 333260 283603 325515 390093 437084 478822 472216 426206 340560
17874 340560 289103 324279 343324 313431 305196 388597 422145 418200 355537 350331 361405 383250
17862 383250 357432 427240 481209 444765 405353 359022 368634 384399 348693 335993 279353 274946
17850 274946 398276 406325 375900 431135 430762 361039 340810 307724 256693 215940 159994 211864
17838 211864 233564 261648 337217 391529 328288 342261 297539 230244 201193 253972 224034
17827 224034 244542 277996 176566 152658 137781 117619 136021 182035 223340 169878 180547
17816 180547 203362 247917 243155 194078 166895 165758 149595 190185 248220 279899 297632 272508
$$ packed form
17898E82150k6437j9263m2806j6496o675P2540J1726o6769j1195p6757K9661p3828
17886C55851r2485K2427J3396L4071m9657M1912O4578M6991M1738o606m6010q5646
17874C40560n1457L5176J9045k9893q235Q3401L3548l945o2663n206J1074K1845
17862C83250k5818O9808N3969l6444l9412m6331R612J5765l5706j2700n6640m407
17850B74946J23330Q049l0425N5235l73o9723k0229l3086n1031m0753n5946N1870
17838B11864K1700K8084P5569N4312o3241J3973m4722o7295k9051N2779k9938
17827B24034K0508L3454j01430k3908j4877k0162J8402M6014M1305n3462J0669
17816A80547K2815M4555m762m9077k7183j137j6163M0590N8035L1679J7733k5124
$$ plain form
17804 272508 279368 309348 221155 133831 136509 148197 139306 169810 177066 225822 216120 207893 199540
17791 199540 178119 166913 156867 99534 142534 151465 178757 173478 174468 189374 135208 183780
17779 183780 243619 257914 268334 233618 115326 153449 173023 151378 138085 93906 108686
17768 108686 163879 186444 111506 89788 135050 133004 58783 68898 64485 98780 107262 78090
17756 78090 113911 145813 97710 49037 154431 199773 192789 160119 51051 -36666 -10689
17745 -10689 86375 179508 186760 220522 277508 265928 139838 90134 69562 87252 111881 137812
17733 137812 171535 144055 113198 161339 161923 187738 163639 145801 149279 164753 161529 166094
17721 166094 274600 258667 263516 262148 203091 209524 197445 170254 243381 215040 154341 154223
$$ packed form
17804B72508O860K9980q8193q7324K678J1688q891L0504P256M8756r702q227q353
17791A99540k1421j1206j0046n7333M3000Q931K7292n279R90J4906n4166M8572
17779A83780N9839J4295J0420l4716j18292L8123J9574k1645j3293m4179J4780
17768A08686N5193K2565p4938k1718M5262k046p4221J0115m413L4295Q482k9172
17756G8090L5821L1902m8103m8673J05394M5342o984l2670j09068q7717K5977
17745a0689R7064R3133P252L3762N6986j1580j26090m9704k0572J7690K4629K5931
17733A37812L3723k7480l0857M8141N84K5815k4099j7838L478J5474l224M565
17721A66094J08506j5933M849j368n9057O433j2079k7191P3127k8341o0699j18
$$ plain form
17709 154223 164712 221387 208246 164853 123513 120541 144369 181712 188438 134306 203125 206982
17697 206982 211939 278455 217019 230862 224283 223319 191858 140283 158769 226134 206148 234611
17685 234611 286110 262930 225170 176409 110558 110321 115605 83033 96845 167908 201377 137673
17673 137673 170079 227530 235008 181791 191825 219788 207619 170293 160277 182890 224044 270529
17661 270529 265550 152723 130905 151521 222265 225568 213804 182953 169377 149179 170730 235682
17649 235682 274212 221227 267217 316717 249049 232677 230923 235088 244412 188309 175749 167581
17637 167581 120779 79502 87989 115256 62595 77882 88900 68946 16651 87686 146007 135287
17625 135287 119744 109880 110855 87435 97771 147209 126402 139846 167674 180200 189547 209850
$$ packed form
17709A54223J0489N6675j3141m3393m1340k972K3828L7343O726n4132O8819L857
17697B06982M957O6516o1436J3843o579r64l1461n1575J8486O7365j9986K8463
17685B34611N1499k3180l7760m8761o5851k37N284l2572J3812P1063L3469o3704
17673A37673L2406N7451P478n3217J0034K7963j2169l7326j0016K2613M1154M6485
17661B70529m979j12827k1818K0616P0744L303j1764l0851j3576k0198K1551O4952
17649B35682L8530n2985M5990M9500o7668j6372j754M165R324n6103j2560q168
17637A67581m6802m1277Q487K7267n2661J5287J1018j9954n2295P1035N8321j0720
17625A35287j5543r864R75k3420J0336M9438k0807J3444K7828J2526R347K0303
$$ plain form
17613 209850 209116 209123 142960 116673 125110 92162 72493 127666 148541 105201 80416 100046 54040
17600 54040 89553 113752 167185 260448 362912 326242 202805 135832 131932 84684 58214
17589 58214 87648 85661 124484 138776 104662 101548 67043 93008 87511 -54494 -44389 33805
17577 33805 14025 -7739 -37496 18901 96845 80918 15534 -42633 -40424 20109 106096 98241
17565 98241 104908 102642 107824 141605 89293 37641 14798 48810 116283 49552 9107 83486
17553 83486 79452 37314 -14964 1984 -11211 -27418 19287 69863 175119 175366 72325 14787
17541 14787 35548 136247 175537 188610 131556 95961 71364 66621 37299 -43809 -68672 57615
17529 57615 149958 160689 172249 182289 217757 250899 261712 289708 326004 339095 343225 300148
$$ packed form
17613B09850p34Po6163k6287Q437l2948j9669N5173K0875m3340k4785J9630m6006
17600E4040L5513K4199N3433R3263J02464l6670j23437o6973l900m7248k6470
17589E8214K9434j987L8823J4292l4114l114l4505K5965n497j42005J0105P8194
17577C3805j9780k1764k9757N6397P7944j5927o5384n8167K209O0533Q5987p855
17565I8241O667k266N182L3781n2312n1652k2843L4012O7473o6731m0445P4379
17553H3486m034m2138n2278J6948j3195j6207M6705N0576J05256K47j03041n7538
17541A4787K0761J00699L9290J3073n7054l5595k4597m743k9322q1108k4863J26287
17529E7615R2343J0731J1560J0040L5468L3142J0813K7996L6296J3091M130m3077
$$ plain form
17517 300148 284165 265511 229734 269969 269588 359318 336133 296311 250854 204900 231908 174828
17505 174828 183991 160182 79974 2242 5303 105990 141532 147710 114098 54781 88097 130565
17493 130565 200496 244416 168279 211522 229210 198656 239715 246282 262975 235169 199829 188646
17481 188646 260277 223162 205016 220030 228573 151102 127348 94848 101157 112661 156211 73493
17469 73493 97572 161834 198669 156916 145199 168091 64781 30930 71503 77126 118094 67575
17457 67575 20037 77461 67039 131754 187925 112553 10884 85475 103028 83338 100079
17446 100079 138495 109777 138449 175787 235334 289356 396995 467666 458467 419399 326692
17435 326692 225550 192229 173950 172129 108042 147275 216007 155183 140493 185472 176275 207607
$$ packed form
17517C00148j5983j8654l5777M0235l81Q9730k3185l9822m5457m5954K7008n7080
17505A74828R163k3809q0208p7732L061J00687L5542O178l3612n9317L3316M2468
17493A30565O9931M3920p6137M3243J7688l0554M1059O567J6693k7806l5340j1183
17481A88646P1631l7115j8146J5014Q543p7471k3754l2500O309J1504M3550q2718
17469G3493K4079O4262L6835m1753j1717K2892j03310l3851M0573N623M0968n0519
17457F7575m7538N7424j0422O4715N6171p5372j01669P4591J7553j9690J6741
17446A00079L8416k8718K8672L7338N9547N4022J07639P0671r199l9068r2707
17435C26692j01142l3321j8279j821o4087L9233O8732o0824j4690M4979r197L1332
$$ plain form
17423 207607 190988 151003 163588 93295 99354 57276 56726 68848 78132 59233 31659 29109
17411 29109 41039 50124 62801 81456 113084 129711 51194 41988 91252 94228 82270 31372
17399 31372 50465 112994 164580 116596 164751 127663 57789 -6026 24670 3296 46673 118372
17387 118372 166974 160260 108071 110032 147116 152495 239451 278863 225313 149758 113288 65120
17375 65120 -12180 -65375 10998 52286 33404 52356 38731 71520 59972 16592 28172 40757
17363 40757 42344 82492 104692 101809 139722 94395 23511 25698 20996 37494 24652 17818 20780
17350 20780 26054 22684 57510 51420 44434 10125 434 -20986 11149 75226 77019 58602 30071
17337 30071 34678 72364 80877 131294 201462 194796 79760 32050 64439 44637 82851 75103
$$ packed form
17423B07607j6619l9985J2585p0293O059m2078n50J2122R284j8899k7574k550
17411B9109J1930R085J2677J8655L1628J6627p8517r206M9264K976j1958n0898
17399C1372J9093O2529N1586m7984M8155l7088o9874o3815L0696k1374M3377P1699
17387A18372M8602o714n2189J961L7084N379Q6956L9412n3550p5555l6470m8168
17375F5120p7300n3195P6373M1288j8882J8952j3625L2789j1548m3380J1580J2585
17363D0757J587M0148K2200k883L7913m5327p0884K187m702J6498j2842o834K962
17350B0780N274l370L4826o090o986l4309r691k1420L2135O4077J793j8417k8531
17337C0071M607L7686Q513N0417P0168o666j15036m7710L2389j9802L8214p748
$$ plain form
17325 75103 31910 40608 -10344 -52649 -63105 -206 -25703 -18574 19188 -28582 17742 108970
17313 108970 82847 82688 75471 48603 -60925 -102042 -75042 -48495 -42020 -5936 -46701 -58422
17301 -58422 -61678 -35517 62541 39280 -11986 20295 34287 33676 69337 50748 32491 12992
17289 12992 39256 31034 25934 26886 32796 122889 144163 53465 37202 80995 63680 -18741 8339
17276 8339 18249 51864 116328 108872 44150 46831 76297 100555 51842 31749 89101 116398
17264 116398 92246 121146 59694 5748 71763 55346 23719 16028 53704 148092 139363 126580
17252 126580 57711 65810 60838 51751 47714 21763 -1794 -26423 -61315 -48209 -7297 -56031
17240 -56031 -75955 -59695 -73304 -22844 27341 34038 44260 116859 164415 148117 141444 115316
$$ packed form
17325G5103m3193Q698n0952m2305j0456O2899k5497P129L7762m7770M6324R1228
17313A08970k6123j59p217k6868j09528m1117K7000K6547O475L6084m0765j1721
17301e8422l256K6161R8058k3261n1266L2281J3992o11L5661j8589j8257j9499
17289A2992K6264q222n100R52N910R0093K1274r0698j6263M3793j7315q2421K7080
17276H339R910L3615O4464p456o4722K681K9466K4258m8713k0093N7352K7297
17264A16398k4152K8900o1452n3946O6015j6417l1627p691L7676R4388q729j2783
17252A26580o8869Q099m972r087m037k5951k3557k4629l4892J3106M0912m8734
17240e6031j9924J6260j3609N0460N0185O697J0222P2599M7556j6298o673k6128
$$ plain form
17228 115316 53598 26360 64448 59493 16963 -10937 -44081 -89753 -70061 -90484 -128341 -86780
17216 -86780 -67602 -36328 -34412 -77713 -102209 -132201 -79386 -91445 -111215 -53095 -5417 17700
17204 17700 -7816 10138 -29278 -90979 -88784 -34008 -54359 -143165 -65217 -20876 -48630 -133364
17192 -133364 -151800 -108172 -8411 84814 80614 19765 -16788 -901 -365 38107 51716 10311
17180 10311 21400 40413 -13631 -25811 -63055 -27396 -10625 -71188 -94830 -54977 -37588 -54630
17168 -54630 -22666 7116 77564 88421 68700 37988 80072 63141 10038 -12921 -54842 -27648
17156 -27648 26290 -22442 -39352 -22156 -25938 6709 -57379 -39096 -34139 -69524 -45613 28757
17144 28757 100996 130590 109586 58124 -9323 -33418 -55475 -38587 -26586 23035 55308 20978
$$ packed form
17228A15316o1718k7238L8088m955m2530k7900l3144m5672J9692k0423l7857M1561
17216h6780J9178L1274J916m3301k4496k9992N2815j2059j9770N8120M7678K3117
17204A7700k5516J7954l9416o1701K195N4776k0351q8806P7948M4341k7754q4734
17192a33364j8436M3628R9761R3225m200o0849l6553J5887N36L8472J3609m1405
17180A0311J1089J9013n4044j2180l7244L5659J6771o0563k3642L9853J7389j7042
17168e4630L1964K9782P0448J0857j9721l0712M2084j6931n3103k2959m1921K7194
17156b7648N3938m8732j6910J7196l782L2647o4088J8283M957l5385K3911P4370
17144B8757P2239K9594k1004n1462o7447k4095k2057J6888J2001M9621L2273l4330
$$ [...]
##END NTUPLES=NMR SPECTRUM
##END=
