##TITLE=Analysis number 317521
Compound Code cc 53702
Book Reference 442/174
Project Code qc-cat
Chemist Name miguelg
##JCAMPDX= 6.0         $$ Bruker NMR JCAMP-DX V2.0
##DATA TYPE= NMR SPECTRUM
##DATA CLASS= NTUPLES
##ORIGIN= Bruker BioSpin GmbH
##OWNER= nmr
$$ XWIN-NMR		Version 3.5
$$ Wed Feb 22 11:11:17 2006 GMT Standard Time (UT+0h)  MAYBRIDGE\nmr@NMR_250MHZ
##.OBSERVE FREQUENCY= 250.131544655141
##.OBSERVE NUCLEUS= ^1H
##.ACQUISITION MODE= SIMULTANEOUS (DQD)
##.ACQUISITION SCHEME= undefined
##.AVERAGES= 16
##.DIGITISER RES= 18
##SPECTROMETER/DATA SYSTEM= dpx250
##.PULSE SEQUENCE= zg30
##.SOLVENT NAME= CDCl3
##.SHIFT REFERENCE= (INTERNAL, CDCl3, 0, 16.522)
##AUDIT TRAIL= $$ (NUMBER, WHEN, WHO, WHERE, WHAT)
$$ ##TITLE= Audit trail, XWIN-NMR		Version 3.5
$$ ##JCAMPDX= 5.01
$$ ##ORIGIN= Bruker BioSpin GmbH
$$ ##OWNER= nmr
$$ C:\u/data/dgb/nmr/ADRS/16650/pdata/1/auditp.txt
$$ ##AUDIT TRAIL=  $$ (NUMBER, WHEN, WHO, WHERE, WHAT)
(   1,<2006-02-22 11:10:33.27 +000>,<MAYBRIDGE\nmr>,<NMR_250MHZ>,
      <created by zg, POWCHK disabled, PULCHK disabled
       configuration hash MD5:
       84 BC 41 DB A1 6E 1D 46 DA 25 12 A5 C1 ED C5 3A
       data hash MD5: 64K
       2F 83 FB D6 22 43 55 35 6B 9F BE 0C 7C 1E EB AC>)
(   2,<2006-02-22 11:10:53.23 +000>,<MAYBRIDGE\nmr>,<NMR_250MHZ>,
      <Start of raw data processing
       ef LB = 0.3 FT_mod = 6 PKNL = 1 SI = 32K 
       data hash MD5: 32K
       35 95 03 F2 BE AA 5D A0 D4 33 1F 76 57 16 A2 68>)
(   3,<2006-02-22 11:10:58.15 +000>,<MAYBRIDGE\nmr>,<NMR_250MHZ>,
      <apk 
       data hash MD5: 32K
       D9 BE 6D EA 08 3E 9A 5B 4B 11 52 F6 F6 59 E2 8B>)
(   4,<2006-02-22 11:10:59.42 +000>,<MAYBRIDGE\nmr>,<NMR_250MHZ>,
      <abs ABSG = 5 
       data hash MD5: 32K
       2F A3 33 8F B2 7C 5B 11 A8 59 FF 54 CB C3 6C DD>)
$$ ##END=
$$ 
$$ hash MD5
$$ 71 D3 69 B6 01 59 8E D1 5D 7B 97 AB 70 C9 0F 19
##$RELAX= 
##$RELAX= 
##$RELAX= 
##$RELAX= 
##$RELAX= 
##$RELAX= 
##$RELAX= 
$$ Bruker specific parameters
$$ --------------------------
##$DU= <C:\u>
##$EXPNO= 16650
##$NAME= <ADRS>
##$PROCNO= 1
##$TYPE= <nmr>
##$USER= <dgb>
##$AMP= (0..31)
100 100 100 100 100 100 100 100 100 100 100 100 100 100 100 100 100 100 
100 100 100 100 100 100 100 100 100 100 100 100 100 100 
##$AQSEQ= 0
##$AQ_mod= 3
##$AUNM= <au_zg>
##$AUTOPOS= <17 >
##$BF1= 250.13
##$BF2= 250.13
##$BF3= 250.13
##$BF4= 250.13
##$BF5= 500.13
##$BF6= 500.13
##$BF7= 500.13
##$BF8= 500.13
##$BYTORDA= 1
##$CFDGTYP= 0
##$CFRGTYP= 5
##$CHEMSTR= <none>
##$CNST= (0..31)
1 1 145 1 1 1 1 1 1 1 1 1 1 1 1 1 1 1 1 1 1 1 1 1 1 1 1 1 1 1 1 1 
##$CPDPRG= <>
##$CPDPRG1= <>
##$CPDPRG2= <>
##$CPDPRG3= <>
##$CPDPRG4= <mlev>
##$CPDPRG5= <mlev>
##$CPDPRG6= <mlev>
##$CPDPRG7= <mlev>
##$CPDPRG8= <mlev>
##$CPDPRGB= <>
##$CPDPRGT= <>
##$D= (0..31)
0 1 0 0 0 0 0 0 0 0.06 0 0 0 0 0 0 0.0002 0 0 0 0 0 0 0 0 0 0 0 0 0 0 
0 
##$DATE= 1140606631
##$DBL= (0..7)
120 120 120 120 120 120 120 120 
##$DBP= (0..7)
150 150 150 150 150 150 150 150 
##$DBP07= 0
##$DBPNAM0= <>
##$DBPNAM1= <>
$$ [...]
##$SUBNAM7= <"">
##$SUBNAM8= <"">
##$SUBNAM9= <"">
##$SW= 20.6930455092707
##$SWIBOX= (0..15)
0 0 3 0 0 0 0 0 0 0 0 0 0 0 0 0 
##$SW_h= 5175.983436853
##$TD= 65536
##$TD0= 1
##$TE= 293.16
##$TE2= 300
##$TE3= 300
##$TEG= 300
##$TL= (0..7)
0 120 120 120 120 120 120 120 
##$TP= (0..7)
150 150 150 150 150 150 150 150 
##$TP07= 0
##$TPNAME0= <>
##$TPNAME1= <>
##$TPNAME2= <>
##$TPNAME3= <>
##$TPNAME4= <>
##$TPNAME5= <>
##$TPNAME6= <>
##$TPNAME7= <>
##$TPOAL= (0..7)
0.5 0.5 0.5 0.5 0.5 0.5 0.5 0.5 
##$TPOFFS= (0..7)
0 0 0 0 0 0 0 0 
##$TUNHIN= 0
##$TUNHOUT= 0
##$TUNXOUT= 0
##$USERA1= <user>
##$USERA2= <user>
##$USERA3= <user>
##$USERA4= <user>
##$USERA5= <user>
##$V9= 5
##$VALIST= <valist>
##$VCLIST= <CCCCCCCCCCCCCCC>
##$VD= 0
##$VDLIST= <DDDDDDDDDDDDDDD>
##$VPLIST= <PPPPPPPPPPPPPPP>
##$VTLIST= <TTTTTTTTTTTTTTT>
##$WBST= 1024
##$WBSW= 4
##$XGAIN= (0..3)
0 0 0 0 
##$XL= 0
##$YL= 0
##$YMAX_a= 569114
##$YMIN_a= -629936
##$ZGOPTNS= <>
##$ZL1= 120
##$ZL2= 120
##$ZL3= 120
##$ZL4= 120
##$ABSF1= 16.522
##$ABSF2= -4.171173
##$ABSG= 5
##$ABSL= 3
##$ALPHA= 0
##$AQORDER= 0
##$ASSFAC= 0
##$ASSFACI= 0
##$ASSFACX= 0
##$ASSWID= 0
##$AUNMP= <proc_1d>
##$AZFE= 0.1
##$AZFW= 0.1
##$BCFW= 0
##$BC_mod= 0
##$BYTORDP= 0
##$COROFFS= 0
##$CY= 12.5
##$DATMOD= 1
##$DC= 0
##$DFILT= <>
##$DTYPP= 0
##$F1P= 14.0000005364418
##$F2P= -0.99999901652339
##$FCOR= 0.5
##$FTSIZE= 32768
##$FT_mod= 6
##$GAMMA= 0
##$GB= 0
##$INTBC= 1
##$INTSCL= 1
##$ISEN= 128
##$LB= 0.3
##$LEV0= 0
##$LPBIN= 0
##$MAXI= 10000
##$MC2= 0
##$MEAN= 0
##$ME_mod= 0
##$MI= 0
##$NCOEF= 0
##$NC_proc= -4
##$NLEV= 6
##$NOISF1= 0
##$NOISF2= 0
##$NSP= 0
##$NTH_PI= 0
##$NZP= 0
##$OFFSET= 16.522
##$PC= 1
##$PHC0= 243.2012
##$PHC1= 8.319701
##$PH_mod= 1
##$PKNL= yes
##$PPARMOD= 0
##$PSCAL= 4
##$PSIGN= 0
##$REVERSE= no
##$SF= 250.13
##$SI= 32768
##$SIGF1= 0
##$SIGF2= 0
##$SINO= 400
##$SIOLD= 32768
##$SREGLST= <1H.CDCl3>
##$SSB= 0
##$STSI= 32768
##$STSR= 0
##$SW_p= 5175.98343685301
##$SYMM= 0
##$S_DEV= 0
##$TDeff= 65536
##$TDoff= 0
##$TI= <Analysis number 999999
Compound Code 99
Book Reference 9
Project Code 9>
##$TILT= no
##$TM1= 0
##$TM2= 0
##$TOPLEV= 0
##$USERP1= <user>
##$USERP2= <user>
##$USERP3= <user>
##$USERP4= <user>
##$USERP5= <user>
##$WDW= 1
##$XDIM= 32768
##$YMAX_p= 404191600
##$YMIN_p= -272557
$$ End of Bruker specific parameters
$$ ---------------------------------
##NTUPLES= NMR SPECTRUM
##VAR_NAME=  FREQUENCY,     SPECTRUM/REAL,   SPECTRUM/IMAG
##SYMBOL=    X,             R,               I
##VAR_TYPE=  INDEPENDENT,   DEPENDENT,       DEPENDENT
##VAR_FORM=  AFFN,          ASDF,            ASDF
##VAR_DIM=   32768,         32768,           32768
##UNITS=     HZ,            ARBITRARY UNITS, ARBITRARY UNITS
##FACTOR=    0.157963299565203, 1,           1
##FIRST=     4132.6476996994, 0,             0
##LAST=      -1043.33573715361, 0,           0
##MIN=       -1043.33573715361, -272557,     0
##MAX=       4132.6476996994, 404191600,     0
$$ Real data points
##PAGE= N=1
##DATA TABLE= (X++(R..R)), XYDATA
$$ [...]
29568 37547 14302 -28213 -28296 -36089 -78001 -102368 -41667 11179 41617 13965 -7045 7067
29556 7067 8584 10523 36910 13409 -63850 -43324 -16699 35713 129869 107277 80189 32718
29544 32718 -12820 17464 31213 32215 32931 27287 84645 77707 74280 93793 28367 -32708 -12108
29531 -12108 79499 103951 67564 52584 17625 23370 54892 36262 -19208 -82024 -64419 -31684
29519 -31684 4453 20615 44232 64537 -18371 -79949 -57174 -41947 -36066 -9173 57251 68231
29507 68231 28169 30208 60927 59337 72837 -7600 -17610 38586 74588 54149 3173 22389
29495 22389 41498 58929 -1912 -34946 -12297 17074 22637 21597 -17460 4398 82529 24226
29483 24226 -46745 -44422 10651 26577 121152 92302 35573 58945 62333 135902 151368 58792
29471 58792 273 -11101 17182 45615 42201 25571 13329 -33474 32526 57294 35057 6609
29459 6609 54821 22419 -13581 -60823 -135208 -114643 -24039 11679 40211 49131 26088 47479
29447 47479 47873 -52778 -81162 -65840 -65155 -17630 -272 -37567 -68300 -10016 8126 -15936
29435 -15936 -54552 -56837 -14726 24032 16289 32924 -19114 -92962 -77306 -32156 -20727 -35149
29423 -35149 -65162 -112963 -53469 -12162 15227 95644 141487 99852 97258 102050 1913 -60132
29411 -60132 -93193 -105080 -84046 -77103 -11779 12094 -19623 -74045 -74505 -57501 -17433 22492
29399 22492 42366 23926 -34665 -39154 -40617 -67428 -32096 -15329 -22574 -103834 -119567 -16070
29387 -16070 65255 88902 43505 47175 -11646 -4885 -21441 -93318 -105308 -78351 -68943 -33803
29375 -33803 172 7430 -43827 -30402 28766 41700 95019 112709 95166 63904 59951 76722
29363 76722 62655 1114 34654 55333 35808 -6429 -29562 -29753 -11100 15563 49665 39032
29351 39032 37973 82149 135039 102160 37337 -10266 -42439 -19088 29483 67126 1259 -82970
29339 -82970 -36276 15435 25335 46180 59311 14755 -27817 59572 134756 144787 77869 20989
29327 20989 -1466 -22915 -8738 56658 26382 17615 8671 16046 19711 32092 7073 -76644
29315 -76644 -101650 -109337 -45836 10971 -42539 -79257 -43409 -49919 -66002 -40046 -32719 -46813
29303 -46813 -48979 -54146 -10204 -25295 -56714 -22612 19767 19308 -53709 -152749 -149605 -110296 -47444
29290 -47444 -6509 7373 20674 2518 -28930 -34853 -42746 -12683 35508 21725 7564 -3551
29278 -3551 8258 -2176 -3125 27594 32397 50818 35338 49775 41944 -3575 -89874 -97265 -70805
29265 -70805 -56122 -52205 -17659 3836 12480 57742 85311 50049 10139 28037 -22058 -72544
29253 -72544 -93665 -47142 22677 45646 -6494 -88308 -90795 -30468 -67370 -88846 -128514 -129968
29241 -129968 -102028 -81017 -52945 -43961 -86392 -87335 -50546 -47790 -26771 26987 29023 -6120
29229 -6120 -63864 -46679 27424 71032 110602 101550 97203 70976 114900 107952 88894 94728 65306
29216 65306 63113 89910 82650 80912 85327 70405 61682 26977 -83285 -104066 -163 73197
29204 73197 73240 73706 50931 -5226 -57823 -90171 -94878 -49156 -15697 -29541 -44830 -47283 -72573
29191 -72573 -42814 -27967 -20327 -9357 33573 42132 15702 23827 -2379 -78641 -49599 36086
29179 36086 120243 145033 135729 92942 67308 75464 21603 26123 68782 52235 77016 50736
29167 50736 60748 93732 74013 44626 21063 -9774 3180 101540 138584 117336 96096 89012
29155 89012 27157 -43958 -33406 -10368 -11809 24043 -19704 -51455 -44233 -3951 -91320 -116577
29143 -116577 -70116 -85783 -5762 10799 -6783 -75063 -148807 -131654 -90468 -96320 -97861 -37993
29131 -37993 -28516 -57365 -6459 -14501 -2560 17445 83836 3045 -14371 -31470 20787 76810
29119 76810 61232 -4470 -2345 29083 35191 -15228 -67293 -43655 -34032 -28857 -39361 -56418
29107 -56418 -31229 59394 26379 -37634 -2736 -12428 10835 6307 -12573 13825 -11738 -29688
29095 -29688 10669 87488 109560 61848 11077 34959 22426 -1183 22936 -15076 55797 53946
29083 53946 8383 24583 50050 21415 -58366 -76494 -101365 -56627 17060 43869 15710 1430
29071 1430 16013 -10836 -17342 14513 8612 -25896 -17190 -70899 -81867 -129763 -108864 -81530
29059 -81530 -35345 4415 -6114 -39443 56874 118868 121908 90937 13078 -76294 -58873 -66383
29047 -66383 -25925 11982 -833 47639 22712 17713 27379 41620 16723 -10519 -32399 -69776
29035 -69776 -38014 -15770 23362 73468 106915 40029 -37911 -34174 -61280 -138702 -103836 -32274
29023 -32274 28541 31819 3945 -2069 -58843 -24045 12887 -3695 -14596 -20022 -25228 7923
29011 7923 -6507 -4114 -59218 -105809 -70768 -68772 -103745 -134756 -119750 -87323 -5270 -19320
28999 -19320 -92 -37135 -41835 14164 37121 -13137 -26624 -53601 33503 62433 3479 -11482
28987 -11482 57951 33968 11929 -12930 -15057 -14481 -19750 4932 33320 8495 9465 63 21176
28974 21176 -34156 -34943 20262 -23207 -28175 4124 16083 8643 558 40209 -2133 -4336 -26784
28961 -26784 -29215 -13244 -19765 -74649 -122324 -115556 -36646 29655 19235 -54057 -28313 -26458
28949 -26458 -74527 -62448 -45415 -72043 -107381 -93384 -107459 -70790 -21403 8891 49682 47241
28937 47241 45744 14825 29232 28670 64963 27387 -4161 8178 24586 -9638 -43923 -71192
28925 -71192 -40431 17537 72282 33859 36253 30919 103858 68079 -18350 24985 79426 22895
28913 22895 -7835 -1329 -29002 -19198 -23506 -24104 40724 111076 90626 75990 44075 -36266 -67321
28900 -67321 -51038 -24398 -1928 -29050 -66453 -23105 -1242 39183 8751 -75809 -77434 -47750
28888 -47750 -43379 -79450 -98845 -149250 -143993 -184380 -128119 -75002 -59394 -24174 -4604 26778
28876 26778 50014 64980 23582 11303 -24103 -57300 -82348 -10081 12593 -43562 -26827 37299
28864 37299 25514 8637 -5656 -70120 -50892 -23557 48679 33741 -41507 -98318 -105172 -82519
28852 -82519 -91659 -74188 1093 106674 123805 92055 91880 86751 67001 45960 12394 32516
28840 32516 25569 -20428 -9015 -16950 -11479 -9036 1061 23329 13267 8786 2747 -1894 43948
28827 43948 67056 10398 6301 18009 -38154 -99374 -90578 -107021 -71857 -35662 -4787 -11171
28815 -11171 -24616 -27906 -61496 -41675 -11946 49330 102662 101422 88863 91675 75861 22026
28803 22026 -32664 -27085 69552 82624 70935 41269 -33756 -68664 -100161 -61461 -19113 29156
28791 29156 33620 31795 45125 65177 65493 110982 138863 93341 33070 -19881 3373 45267
28779 45267 63345 40434 13445 -4649 383 -18641 -16296 -12763 -13299 -56483 -110044 -66253 77343
28766 77343 57974 8306 -47306 -33972 25463 -20326 -32261 -78742 -89596 -90544 -108837 -88661
28754 -88661 -53487 2626 4907 2870 -69245 -69033 -68007 -61739 1 37268 73622 59249 34075
28741 34075 -13187 -52049 -47807 -14305 84525 85477 31504 58258 41701 88131 107497 74917
28729 74917 1861 -63170 -46405 -25373 13253 -23163 -44849 -17095 -11209 22847 34917 -18057
28717 -18057 -41290 -89443 -79037 1867 -16575 -35684 -13298 43185 51132 36143 -36473 -48391
28705 -48391 4586 15637 22737 100895 77631 5534 -63343 -89014 -9618 9606 -4192 -23958
28693 -23958 -22490 -41364 -73542 -39622 -20653 -38627 -61737 -63458 -53865 -132893 -194514 -115396
28681 -115396 -27219 16418 -9031 -49223 -75837 -34044 -106568 -156501 -75856 -43666 -36064 -71574
28669 -71574 -65273 -69657 -91949 -111357 -135433 -92526 -40636 -38978 -42932 -56003 -74540 -124813
28657 -124813 -138896 -167533 -112079 -117427 -110322 -87474 -52452 5982 -3866 23747 69657 55421
28645 55421 33963 -19480 -28178 9679 8339 -31617 -45893 -67447 -67827 -83052 -15519 17979
28633 17979 22212 60985 79698 55659 11206 55007 54416 44205 13235 -54665 -53211 -47992 -43043
28620 -43043 -65614 -91592 -115380 -71575 -51632 -64294 -17905 -20152 -8998 -25417 -34050 49955
28608 49955 61559 14093 -58991 -89964 -99601 -75330 -68377 -31386 -44373 -62715 1801 -2747
28596 -2747 14147 61641 63288 19306 57700 91999 44834 -7328 -21645 4344 -25108 23507
28584 23507 29921 56975 69099 98861 62340 9170 4015 -10203 13801 29301 18191 -20868
28572 -20868 10508 84954 111739 87968 -6742 -19003 -5258 9338 11581 25504 30632 46703
28560 46703 -14137 19604 53520 27779 -12346 17893 91092 49264 -23147 -60150 -61260 -45592
28548 -45592 -45414 -42721 -52478 -58669 -92495 -93335 -39456 6627 -67461 -73480 -84948 -45004 -63955
28535 -63955 -57314 -56553 -54230 -33074 -36365 18901 -7251 -49758 -5959 5554 -41057 -12435 24893
28522 24893 10495 -27894 -56252 -28441 10090 43343 30431 60223 42543 65299 86427 69090
28510 69090 69827 55250 70613 39184 21058 21574 13146 -67004 -105767 -83388 -78829 -64495 12358
28497 12358 59498 -22245 -76636 -31744 38116 46675 32947 -142 -72077 -118383 -94984 -74535
28485 -74535 -96635 -119127 -86766 -81171 -107325 -83019 -16234 -15054 -59184 -85158 -75198 -64535
28473 -64535 -9442 -67746 -50737 3137 13082 56302 60076 55673 -10129 -55168 -14568 6052
28461 6052 -23411 -14255 -20977 25559 48335 -18081 -57638 -28289 -39717 -21783 -5959 54966
28449 54966 82034 66138 40457 27658 46224 -837 -13045 48804 48866 -37081 -63458 -46746
28437 -46746 -65960 -66533 -50025 -35188 -34728 12570 30980 -2316 24970 11449 11296 31068 107172
28424 107172 131654 122001 65505 12738 60553 73023 42547 7313 -13494 1238 32561 24775
28412 24775 2780 16118 26112 -34851 -35154 -33921 -91975 -28982 5027 10196 3665 -31962 -6139
28399 -6139 -6545 -14782 63182 68903 2635 -37812 -44719 -41276 -25939 -8007 12129 -55022 -82279
28386 -82279 -115924 -145157 -82791 19711 49870 38722 41165 18335 -17025 8645 14407 46424
28374 46424 -40573 -104936 -99777 -49503 -18351 7905 7691 46587 30164 18331 48001 27646
28362 27646 -12416 15964 57849 147923 102429 20029 12384 32306 -15981 -16498 -298 66552
28350 66552 80378 7255 7529 85231 74079 77549 53247 -10999 -25585 -15899 -32834 -67601
28338 -67601 -72344 12977 -39805 -64428 8078 66703 107910 72109 -28281 -78427 -5500 11331
28326 11331 12461 12655 17409 45881 66887 90275 43124 -13291 -29454 23438 13514 60385 36536
28313 36536 26268 125184 119862 93243 106118 111426 90224 47753 48845 12010 -36135 -112065
28301 -112065 -91262 -28234 7121 -47512 -54088 -93993 -101514 -70054 -92435 -56280 -34093 -44495
28289 -44495 -43885 -37218 38233 59862 25634 12696 -17541 -31166 -7598 -15158 11169 92127
28277 92127 116942 43590 -48406 -99801 -92528 -29684 43876 89143 105047 111039 36362 33572
28265 33572 44007 10174 -12925 -19361 4896 -25181 -65899 -63627 -76166 -99321 -118663 -51323
28253 -51323 -16813 -4793 -15859 10945 40749 56788 46616 31276 37128 9454 48701 73045
28241 73045 42890 32921 18101 15776 38924 65288 91449 98262 70920 7772 20394 73765
28229 73765 80292 50355 47552 69774 73271 76656 17382 -750 19629 -32126 -48126 9772
28217 9772 64208 129182 164816 56704 27668 12424 -12145 -22492 -93506 -110953 -80766 -16366
28205 -16366 1495 18145 23593 11077 -18761 48027 82981 40339 -46742 -32721 21699 77211
28193 77211 57593 11150 -39497 -12566 -14697 4101 64452 75461 35815 46370 20893 33779
28181 33779 61063 -28543 -39579 -35024 -49841 34939 -3928 15934 26869 -56999 -101110 -83892
28169 -83892 -72655 -68402 -76324 -54984 39841 69001 -28507 -37671 295 -2027 22933 8027
28157 8027 -42371 -42130 -31854 8719 21019 -10692 6931 -50977 -60414 -40470 11252 66491
28145 66491 7965 -104485 -146901 -122442 -66863 -70509 -31384 11835 48167 46885 102975 125607
28133 125607 62546 21968 14052 40609 87608 51795 28727 -3535 17092 19624 -34700 -40631
28121 -40631 -19326 -51020 -166535 -129985 -17156 60422 74335 19220 -35335 -23609 5106
28110 5106 6987 41981 68096 63798 43635 38838 29656 9871 -4258 35495 33500 -20883 -43909
28097 -43909 -790 29688 22662 -12307 -78085 -65352 -60942 -73206 -33560 -28488 -57696 -25202
28085 -25202 -45561 -26137 6205 48269 61292 52909 38338 12900 -8925 -7809 -17071 -24236
28073 -24236 -43202 -20960 -40083 -4219 71991 112878 154965 112104 41157 -17163 4308 15147
28061 15147 33518 121360 95718 75381 49307 41012 75730 74779 -16608 -32829 -43315 -57996
28049 -57996 -30482 -38063 -58129 -15484 -2553 45661 119365 147765 97757 49090 68450 92592
28037 92592 32308 -16106 -59452 -91658 -53179 -54183 -43761 -18766 -28434 -61878 -75984 -46575
28025 -46575 -19094 41900 33819 -26227 -61320 -93039 -63937 -11276 7224 -25662 -31577 -27085
28013 -27085 -53974 2886 91757 90781 91654 42193 31140 35524 -3949 -31478 -10071 21202 -22076
28000 -22076 -39416 -70037 -126222 -78349 17834 61955 13552 -14286 -7874 44037 104475 114132
27988 114132 107392 77592 78736 67977 16394 5568 -2605 -43377 -13808 -29677 -38695 -21575
27976 -21575 -23869 -49986 -45740 -49567 -36015 -62150 -48559 7407 46463 5865 -27893 -71249
27964 -71249 -87065 -96684 -83993 -11169 13701 -17185 66675 68314 30080 33457 98358 132265
27952 132265 124246 94077 39079 1569 8783 11746 58156 83185 48438 6096 6527 69239
27940 69239 80534 -11995 -32905 20974 42096 -67757 -65231 28267 56962 40518 40444 -1677
27928 -1677 -12077 29253 22004 5731 7382 -47971 -73305 -12348 -22497 264 -22094 -50687
27916 -50687 -58013 -51170 -28342 -61189 -48173 -28055 -15880 -4895 -33290 -23373 -42291 -60414
27904 -60414 2705 32794 69951 80885 90683 68270 79025 52024 6485 7852 -41931 -60913
27892 -60913 -14130 35371 8228 -1382 -65989 -96335 -17337 80232 72947 33013 26489 34818
27880 34818 70547 36976 29396 6457 8198 2053 -31841 -59848 -57922 -34651 -8090 6541
27868 6541 50681 39609 35689 23193 31789 47548 115038 133219 56968 11709 16692 -16802
27856 -16802 -87641 -60645 -25049 -31908 -21280 -12397 6368 -5804 -4001 -29250 -51477 -43846
27844 -43846 5777 8031 32347 28071 63590 29973 5349 -30246 -7260 38158 21481 -2737
27832 -2737 -7923 -40592 -126808 -151917 -105002 -51023 -43028 -36189 -41633 -24166 29540 39881 54756
27819 54756 67733 55747 36787 -33038 -63530 -22897 -2195 -299 -23911 14226 -16074 -46289
27807 -46289 -61336 -75571 -53808 -19159 843 -3391 8302 33004 28947 -22913 23084 -7818
27795 -7818 13627 73829 74144 85501 82677 -10290 -83829 -68634 -38666 -23183 -11811 26182
27783 26182 -27066 -38578 -12716 -20041 -35787 -20349 50595 23322 -40353 -36245 -4976 52161
27771 52161 71621 85005 104896 49298 -55087 -63315 9950 49853 90689 142186 91700 94562
27759 94562 47790 6025 3005 -7481 -31013 -28744 -53963 595 -15152 -12263 44910 141402
27747 141402 81398 -37696 -42840 61933 64556 39257 -4176 -53607 -66148 4752 11040 -11298
27735 -11298 24450 60948 86833 103126 132806 75030 -5872 -13615 71239 68674 -1681 -41699
27723 -41699 -57154 -19387 16575 21813 -9456 7659 24335 -2683 17907 20066 37830 12246
27711 12246 -29109 -22083 8037 -46866 -39745 -23508 -10372 -2386 -46030 -72997 -58471 -47157
27699 -47157 -59434 -67529 -130468 -178621 -172489 -199168 -181114 -89362 -49077 -72446 -33994 -34137
27687 -34137 -28971 -24076 -22759 -43471 -17248 28652 14894 7275 7443 -48476 -42142 -36067 5771
27674 5771 2174 42454 50843 20265 -35704 -50625 -102721 -138617 -135170 -98191 -71757 -51027
27662 -51027 -58032 -10875 -2451 -69599 -59211 -61359 -83673 -59131 -11840 -41687 -46116 -57814
27650 -57814 -33481 -34205 -52825 -76130 -71039 -32486 12556 17719 10298 -23919 23528 -1131 -19013
27637 -19013 -25276 -29303 -6095 -8389 34426 35390 -18624 -45962 -68698 -49584 -58895 -82616 -72396
27624 -72396 -78834 -29559 -24982 -14302 -50441 -40139 -32965 -42330 30246 100995 42948 -12756
27612 -12756 26876 18002 17769 6005 26438 17963 -45264 -88921 -8540 46567 49530 16613 -29649
27599 -29649 -67771 -118844 -107229 -120390 -104277 -98969 -103063 -57732 12141 -3154 -32980 12942
27587 12942 71165 26564 31197 52161 76342 67004 17066 3131 36586 -1018 -41516 -66021
27575 -66021 -39040 -5114 45 -2732 -71057 -60299 10132 17788 11850 60335 55575 8768 30677
27562 30677 17956 -30713 -62489 -8943 -13909 -64108 -81708 -40392 22323 39078 -17814 -54858
27550 -54858 -71476 -87086 -32631 -6941 -3440 23215 -2594 -56788 -60254 -26832 14176 -5787
27538 -5787 -7068 -57511 -54995 -35517 -6566 43890 8135 -23004 -12143 -12237 22162 46386 53949
27525 53949 49378 24356 51265 96043 30682 -25098 2484 20847 -25562 -17933 -13280 -33379
27513 -33379 -61065 -68910 -83385 -60835 -18298 11617 -12345 -14687 -17633 -27941 -86212 -189929
27501 -189929 -145343 -57858 -79593 -131655 -124044 -53441 -21198 -11779 21222 72978 19884 -6170
27489 -6170 -28659 -8358 -31681 -24446 -11780 -66170 45391 134879 92027 83094 45071 -12300
27477 -12300 -7878 -8884 -7649 -44886 -45335 -15019 -20431 -58138 -56835 -25430 -51331 -60483 -71778
27464 -71778 -79171 -67970 -67855 -59015 -87940 -115465 -88625 -53837 -69333 -89317 -129869 -68875
27452 -68875 -34971 -76629 -30055 -1315 -20066 16067 78249 72429 34525 -2024 -5714 14163
27440 14163 16518 -23359 -34139 23423 43137 -10336 -93889 -139447 -74920 -1128 67893 118007
27428 118007 136743 85817 26366 -30487 -16858 13774 32883 35554 -65668 -82744 -46954
27417 -46954 -5807 20637 60769 50477 26828 24977 52847 31956 -40222 -61346 -38531 24905
27405 24905 37535 15713 -84108 -114458 -141349 -156165 -146292 -86751 -88819 -61600 -61813 -52088 -64942
27392 -64942 -73223 -41728 22682 -48380 -47348 -30490 -23924 -6750 -26437 -14924 -23262 3333
27380 3333 21483 29434 40975 55278 15630 -15342 -25631 -45096 -26322 -56880 -28160 20159
27368 20159 18289 -284 -31374 -70799 -99476 -90614 -100004 -15076 5737 -40272 43210 81856
27356 81856 15119 9791 41741 38535 17941 2048 7923 54383 19521 7211 -20273 -14369
27344 -14369 -21843 49 45385 51773 -179 -39826 -72260 -74900 -112656 -94524 -61675 -30897
27332 -30897 9869 -20367 -84751 -79782 -41139 -42633 -95283 -106199 -155888 -132695 -103122 -56303
27320 -56303 -3379 24935 57912 95691 95757 43406 24616 48496 76293 32800 3227 7463
27308 7463 5971 -13042 -39461 -50809 -42351 16793 68416 60520 58174 3949 -61103 -27319 43584
27295 43584 70232 119517 70593 -11267 23591 -2803 -24909 -34994 -20997 -19314 -45508 -56832
27283 -56832 -38913 -6663 20860 48206 106606 113498 39264 -2072 43166 80849 1855 -37378
27271 -37378 -6035 -4710 -59652 -50802 -65932 -62305 4341 -3188 -49373 -63153 -62632 -66594 -33059
27258 -33059 5081 -21122 -25045 -26048 27953 25902 -16949 -25928 -48243 -68936 -60342 -32790 39907
27245 39907 61561 -9286 -28044 -8253 -8923 31177 -23763 -47390 -29577 14558 54545 19983
27233 19983 -68223 -47929 -52063 -96108 -80109 10201 -22373 -17642 18241 17025 23145 -34786
27221 -34786 -59801 -14580 2220 -5690 78380 82320 25699 65431 62022 74401 95275 47712
27209 47712 52325 33216 23227 51254 122800 95848 49267 21507 -41595 -58806 -81581 -52308
27197 -52308 6038 22762 51543 34552 328 35945 31175 -10465 -8906 6587 -21105 3441
27185 3441 36993 62628 96286 101682 94262 31829 -4965 22557 68761 47791 37015 74336
27173 74336 121316 129444 15691 -18546 -14991 -34658 -29110 -14844 22157 30540 -2381 -29412
27161 -29412 -442 52299 13503 6005 19750 -16214 -20872 -8007 7850 22201 10741 1023
27149 1023 -19990 -20695 -8615 6152 9300 50645 91068 73831 70824 50358 -9355 -31921 -53696
27136 -53696 -76878 -56493 -32274 36855 88793 83811 69495 4191 -10612 13575 48361 67905
27124 67905 76945 61712 82775 149299 106088 79082 121505 132046 136274 105816 121252 127048
27112 127048 81212 -5711 -13329 30121 75062 111292 34143 -16603 -35145 -51530 -7366 73467
27100 73467 92584 63148 48266 30553 88565 93232 -1465 -74046 -84519 -58101 -12858 10492
27088 10492 -19770 24574 44841 -1142 -50405 853 19903 24871 -35779 -48661 -55476 -25930
27076 -25930 3871 2083 34861 38566 -15842 -53420 -15464 54254 92643 -1033 -12946 21292
27064 21292 31954 36682 40960 21992 57958 89120 41227 -6624 -65716 -109731 -87986 -42704
27052 -42704 -11933 -19882 -69532 -29572 -53442 -61496 -111142 -140229 -115845 -54491 -24969 19551
27040 19551 83888 87461 58644 32271 35050 41089 39266 41940 46217 -3348 -93291 -111233 -96476
27027 -96476 -17942 2550 -29720 -78279 -106684 -86765 275 43210 -25449 -44879 -19943 12760
27015 12760 93153 115810 90617 107417 85137 70192 38490 32902 26143 -13204 -90494 -76531
27003 -76531 -72424 -20825 -21642 2856 20154 54740 80892 104434 96536 80851 54781 88048
26991 88048 126667 96550 100451 41470 -8216 53456 61027 23725 -10180 -6750 26999 15611
26979 15611 17555 20067 31440 61340 14620 8955 29643 -6699 -40780 9403 82899 99083
26967 99083 15892 56472 95370 112578 79500 63086 68425 84993 94860 125730 108871 86149
26955 86149 101535 84016 -2955 -43765 6163 42504 60699 -2925 -85118 -90506 -27119 3098
26943 3098 -7425 -45674 -36789 -55487 -21506 -36822 -24975 -16521 -85520 -106180 -52783 -82669
26931 -82669 -76844 -88142 -100082 -24946 33 87959 51770 11892 -2977 -54084 -33169 -23079
26919 -23079 -36879 -112955 -169651 -117169 -54328 -85527 -96897 -49683 6493 44279 93897 93558
26907 93558 13123 -56748 -23600 13778 -13918 -33398 -1110 21027 -3961 -965 -13385 -38240
26895 -38240 -30141 -18140 -84634 -112853 -93771 -15646 -16097 -28682 -19318 19580 52981 51510 -38234
26882 -38234 -62848 -43965 -30468 -46939 -36253 -22084 -59471 -91651 -123693 -117138 -97181 -34221
26870 -34221 -27480 -19135 -876 -595 2761 645 -35405 -75608 -58426 -37036 -65581 -71941 -47365
26857 -47365 -8197 78803 75988 22426 -40439 -87824 -130176 -103229 -76558 -62128 -23797 -8306
26845 -8306 -49151 -34501 -7875 -40218 -67819 -60615 -105319 -161986 -56856 14444 -60288 -93556
26833 -93556 -78603 -37469 4791 -13703 -12613 22190 -53243 -130927 -77535 -37043 -56397 -52650
26821 -52650 11846 14496 621 -40063 -1192 48139 52283 -309 -52164 -77704 -78483 -114309
26809 -114309 -78195 -17510 72148 93305 60718 29980 -12888 -38732 -88103 -70593 3945
26798 3945 40900 57293 43094 1224 3448 12845 44980 81630 83403 43797 19830 -45796
26786 -45796 -67044 -51988 -67258 -21666 19491 11729 10545 24176 15477 -4747 -12650 -28241
26774 -28241 6360 25605 25345 -12056 -9122 8522 8156 34178 59267 53730 63591 57219 -15833
26761 -15833 -87515 -77082 6825 -7425 -73518 -103211 -68448 -31561 -41459 -72765 -48261 2133
26749 2133 -13557 -36280 -58463 -28247 41978 12720 -31367 -78226 -109304 -118057 -104193 -39573
26737 -39573 -47677 -108935 -109042 -30549 75502 105385 64998 -8864 -51419 -67349 -59704 -96083
26725 -96083 -60472 -28383 -8094 16472 20889 24809 36140 62709 61679 54037 43154 -5684
26713 -5684 -46898 -37546 -97235 -101496 -107634 -96658 -64557 -54818 -14472 74333 60711 22798 -57613
26700 -57613 -57360 9544 81210 57007 53536 7995 -65380 -54491 -19532 4906 23199 -65079
26688 -65079 -46677 12624 48036 -6579 -28428 -10975 27379 66787 69618 67304 75075 41025
26676 41025 69469 48632 11538 -11551 14528 51372 39780 1391 -33835 35640 88614 118783
26664 118783 68684 47636 -4985 -32865 8938 54870 68094 20642 5446 67881 89681
26653 89681 48781 13476 -26122 -42439 3681 -10081 8931 52208 90406 61232 102961 132933
26641 132933 55847 -33491 -81636 -63177 -7504 17122 34370 -38490 -123311 -64120 -25545
26630 -25545 -68830 -81944 -99058 -103419 -77797 -178596 -197530 -146347 -141748 -87979 -53585 -49303
26618 -49303 -74830 -76018 -56746 -72824 -90338 -86241 -70221 -44933 -24905 -49638 -78245 -76091
26606 -76091 -83694 -109318 -133906 -127594 -114462 -127473 -108560 -12648 64421 87852 99921 120206
26594 120206 73992 48070 -19667 -2574 18540 46598 18447 -44957 28817 35421 396 132826
26582 132826 180358 71778 65429 121395 109778 43672 -12131 31055 38933 33988 38706 63042
26570 63042 98004 80528 45384 77797 84407 38424 39981 15328 7538 10613 32677 26004 41695
26557 41695 27907 -60759 -62021 -79449 -57508 -40694 -37941 -59630 22792 76436 37571 25850
26545 25850 14498 17304 47233 31278 -5908 19154 14889 -11192 9746 30055 7879 58576
26533 58576 57049 82962 94820 99988 63264 79435 120668 144055 152698 70374 15438 -55009
26521 -55009 -77091 -41114 -11827 -6001 -56568 -65185 -8453 -25860 -85677 -98165 -29739 -46365
26509 -46365 -13065 63855 91019 45944 43450 -18857 -83158 -27442 -32360 -29891 27475 82946
26497 82946 111600 62533 -32387 -60124 -16912 -55586 -73215 4274 65115 58693 -2921 -43411
26485 -43411 -61887 -115238 -160567 -102155 -22079 31580 2452 -4787 11551 40032 52367 -20416
26473 -20416 -40464 -3195 80378 104554 63108 -19909 -29566 -61922 -20811 39053 7001 58638
26461 58638 103699 96226 68106 53484 43424 28406 12249 22351 69550 95031 68192 61038
26449 61038 73540 -19515 -89000 -55726 1697 31965 -48506 -61268 -38620 13741 -6932 4739
26437 4739 104899 176140 157865 128538 135267 70221 -58589 -62795 -55913 -67290 -81102 -21974
26425 -21974 42748 40170 52803 136820 177607 94668 13071 16328 38589 30142 30817 25454 41056
26412 41056 56052 25344 57902 98226 53766 3488 26955 55945 12995 -38969 -32703 -68410
26400 -68410 -63543 -17605 -30713 -14930 46329 65294 13795 -35821 -5842 19146 -7789 -99987
26388 -99987 -52228 -43600 -3607 17527 62243 68194 100967 132466 101716 -37469 -67559 -36066
26376 -36066 -50534 -6891 29635 16179 56864 84411 71977 71104 47393 47074 53062 17146 66877
26363 66877 150569 149131 74477 17438 10437 63731 139353 140623 98946 96710 60548 -12153
26351 -12153 -77509 -38364 24034 30241 -31657 -38896 12103 17929 7943 6296 60057 8283 10905
26338 10905 34190 78240 136416 82029 51028 82542 89730 68691 39310 -26304 -26913 12587
26326 12587 66935 44694 518 35929 22026 -29606 5121 27583 31225 55689 62344 27841
26314 27841 13541 33858 80848 35705 -11054 -18642 37934 55811 78093 119494 101843 65506
26302 65506 37504 19909 -3686 -44786 1509 -42999 -26945 22941 34624 -79294 -125018
26291 -125018 -129972 -111746 -104229 -161456 -133241 -75491 -33334 12964 35483 32841 21952 -1657
26279 -1657 -48006 -20696 -22519 -5379 -92148 -110884 -91108 -64470 -49206 15535 5974 -12730
26267 -12730 19061 -27223 -20680 -33433 -37962 -80058 -41586 -36683 13441 91995 138593 95397
26255 95397 -5665 -44504 -86883 -42097 -29664 -33431 -31150 -34835 11055 27027 21183 60067
26243 60067 44881 -20378 -6946 24738 42875 22430 35419 41745 74971 79849 97070 64159
26231 64159 -64700 -121405 -114943 -86972 -59227 -38534 -26806 -186 -39761 -100923 -53143 7619
26219 7619 -26196 -5924 47065 78399 105568 44679 28539 26796 19267 -42583 -119867 -114611
26207 -114611 -26596 26009 40872 48011 95035 152431 90849 48294 53932 95227 23320 -10908
26195 -10908 46926 93301 109081 92222 78072 102090 147178 118918 97876 117511 35113 -34931
26183 -34931 43541 65984 53402 80525 36272 1101 -253 -18361 -43253 -16184 57336 128362
26171 128362 117077 75352 92389 38778 2294 -2323 -27635 -25195 -76113 -43004 35880 38980
26159 38980 39970 55899 37767 2563 38589 94561 141457 147179 101632 106583 115937 78784 5146
26146 5146 -9846 39210 44144 -36678 -10378 11033 10822 86132 134894 140646 149073 99033 77979
26133 77979 107715 112146 44153 -43967 -50533 -87816 -107514 -77831 -74552 -123019 -78833 9193
26121 9193 9409 -76091 -92844 -24120 -27767 -82279 -94071 -49638 -4135 67174 77568 29914
26109 29914 9774 34597 -8756 -18913 -19229 2557 -16486 -6611 12259 34361 60140 92794
26097 92794 87594 13216 2334 50079 20006 -13891 -38235 -18248 34 -6745 -19788 -8495
26085 -8495 84853 135488 103397 99403 93201 59678 -5906 -16633 8065 31327 16738 59945
26073 59945 28675 -9008 51976 92536 62087 43298 -11788 -71553 -79881 -65309 -58283 -20120
26061 -20120 51365 42496 36589 47468 42634 55461 91575 76130 35248 -29522 5528 12670
26049 12670 -43065 -31734 -84465 -96418 -89016 -21622 -9074 -37560 -33730 -36521 -58225 -93429
26037 -93429 -90819 -30806 -22439 47704 53197 -3333 -30462 35742 60064 30224 -19062 -12790
26025 -12790 31074 -2350 -32137 -45960 -29519 -7339 -54736 -72245 -31853 20638 36307 26557
26013 26557 -12539 12750 5029 26793 40998 -24162 -16389 18558 -4392 -40324 -58973 14672
26001 14672 37791 93843 117586 61609 -5257 -39924 -42155 -37362 -48651 -3285 60116 61486
25989 61486 2090 -84638 -97637 -46997 -47225 -71323 -36924 48430 -11961 -19251 -55091 -90293
25977 -90293 -50485 -16228 -31297 -31261 -14644 4851 63623 120467 54471 28873 8502 45002
25965 45002 30798 -75595 -55624 30341 58332 61729 44723 59680 -35089 -40695 13337 12359
25953 12359 2983 12885 41489 10004 -58420 -14576 21807 12881 12482 -13955 -27571 -46109 -70728
25940 -70728 -38091 -53330 -12745 -20324 -40621 -33157 -16937 50235 65744 73641 52973 49730
25928 49730 20355 10533 41771 -6269 -3839 10171 17032 -31661 -108592 -76772 -76270 -65296 -19387
25915 -19387 60376 77033 76278 116882 73659 11550 7709 7859 -54641 -73194 -34923 -37956 -24300
25902 -24300 3819 -56255 -115791 -83295 -53691 -64723 -129873 -105942 -52411 -43939 -16924 13781
25890 13781 -20647 -56956 -57320 -58034 -48388 -25928 51925 66850 15362 -43521 -26626 -6568 -4885
25877 -4885 -33365 -27690 -4880 -20390 4114 19925 -60488 -108149 -53469 -26212 -31641 -9178
25865 -9178 -22867 -75173 -14325 30183 -21812 -39526 -47806 -48421 -77588 -128929 -203837 -160155
25853 -160155 -74642 17854 30380 -26353 -45165 -25877 -11345 -27718 -28099 12427 40675 -8945
25841 -8945 -50728 -31025 11891 49165 117951 136111 99985 67887 81443 76917 68657 63983
25829 63983 79217 69907 -7840 -34970 -83455 -70497 -70439 -39697 6941 4233 474 24415 44827
25816 44827 -46680 -84861 -106402 -92269 -82393 -63643 -16835 -9256 -27765 -84935 -97069 -79042
25804 -79042 -12797 65652 70002 10989 -27543 -12034 18657 -27445 -51104 -16269 -10928 -3040
25792 -3040 61941 96959 78033 43652 50933 -5193 -39422 -27750 -25906 45650 56805 45466
25780 45466 11707 10870 3933 70712 77474 49492 23841 70834 33137 -3001 54103 65459
25768 65459 22869 -5125 -31487 21262 45177 54587 71260 38840 -4879 -25926 -5763 14775
25756 14775 61370 44357 -11403 -83141 -87518 -78111 -61390 -32343 -26713 -10011 25784 25087 283
25743 283 -71915 -74387 -53485 5454 45842 27288 38299 12414 -11314 -66192 -49501 -1080
25731 -1080 -10744 25765 33487 22609 44028 46971 26827 -9854 -44395 -138658 -136105 -134427 -130854
25718 -130854 -132537 -62735 -31328 -7718 7463 -53019 -148107 -176678 -172489 -65040 34055 55641
25706 55641 40994 62497 60159 25346 -4000 9741 -15401 -17389 47832 133660 85704 88951
25694 88951 64882 10332 -76836 -138375 -141681 -148857 -144381 -154584 -137655 -95225 -63970 -62690
25682 -62690 -23266 16826 29101 60025 17576 -16687 29468 33587 29889 37881 31921 30723 4536
25669 4536 2222 -29686 -77368 -75420 -115746 -103018 -83701 -59927 -104026 -115313 -97517 -60244
25657 -60244 -50885 -31514 -53545 -62847 25172 68773 68126 39665 75213 78203 88739 65457 18048
25644 18048 -39363 7112 42204 45516 -16935 -63596 -70898 18689 14938 -10900 -31836 -52741
25632 -52741 9728 15692 46551 24357 -62008 -76354 -68146 -75010 -37901 24296 59224 22824
25620 22824 11769 -37590 -90852 -87310 -62520 -40068 376 28794 66367 7446 -22771 -33374
25608 -33374 -51933 -34621 17206 57291 124982 99190 34431 -60402 -86389 -76911 -95190 -6560
25596 -6560 36106 27582 54592 56426 45276 -26971 -104700 -134277 -131378 -151267 -176237 -139244
25584 -139244 -126663 -95767 -22260 24715 -13420 42921 93630 107204 76604 36305 15012
25573 15012 17488 99958 127844 96398 65397 72768 96612 89755 64226 6112 -43266 -21971
25561 -21971 -17330 16282 52088 15461 11365 26883 16724 6953 -14970 -25674 -29413 -11790
25549 -11790 -42509 -39412 4341 19417 -16154 -20735 9898 9355 -47554 -23819 14073 24206
25537 24206 4358 -72618 -124524 -108256 -151516 -163842 -61939 14191 24970 31429 -4631 -37323
25525 -37323 -10639 -121149 -113917 -53914 -22577 -11870 40347 13047 14800 21728 -649 38282
25513 38282 46314 -4156 -8341 -43601 -980 56250 55032 38574 -10666 22569 89299 79347
25501 79347 84569 51703 -12333 -4209 30638 -18140 -51549 -6249 -2197 -8310 13663 10968 -30734
25488 -30734 -46615 -32802 -25529 51236 62539 17837 -64342 -93254 -59968 -1906 35679 30745
25476 30745 5603 -27475 -16338 -41666 -90917 -65109 15196 14240 -19019 -57881 -86484 -35892
25464 -35892 -60571 -95380 -168620 -132781 -59362 16867 -12466 -52768 -14253 -37139 -63143 -86039
25452 -86039 -26331 -33190 -53759 -18256 -53770 -98990 -95905 -14998 -56960 -75593 -1638 7292
25440 7292 -45882 -64212 -45549 -19805 -51638 -70454 -70870 -20902 -29939 10290 5890 5570 -65559
25427 -65559 -54627 -66554 -45313 -10997 38562 43495 -28425 -81838 -90234 -44797 2155 44711
25415 44711 -7048 -43404 -31943 -45283 -12269 -3880 -11710 -11717 10877 10960 -4633 -12595 12049 -15963
25401 -15963 -62181 -36407 -35448 -3405 -5533 -16948 21642 -2374 -30552 -13203 24133 38665
25389 38665 72491 25610 -42997 -71374 -4096 41541 13591 -9431 39047 14667 -24087 -27171
25377 -27171 -42074 -36157 -4778 -27465 -20137 2914 39003 61168 33749 40122 17562 22174
25365 22174 53968 23971 -18430 -8222 35161 36661 9505 51101 6446 -12804 12431 38795
25353 38795 21945 28953 20771 -10087 -795 459 -22372 -47768 -35540 31351 12866 -5140
25341 -5140 -2662 -67811 -78281 -43216 11040 -35966 -99489 -86070 -29345 -18078 -14040 -11060
25329 -11060 46553 88895 87416 58905 -20091 -22921 12049 -10271 -57019 -84653 -62522 -86097
25317 -86097 -126909 -136819 -141811 -159808 -119226 -101440 -142851 -142344 -176005 -155090 -102609 -83842
25305 -83842 -74578 -73465 -32427 -6854 -6387 -21031 12331 5127 28832 37126 4831 33066 32771
25292 32771 3688 -10893 10985 87896 149476 132015 90136 122935 141033 139720 104668 82761
25280 82761 42157 -40086 -58152 -94531 -42241 1526 44731 21622 29628 -14419 -13194 1756
25268 1756 19024 39376 57128 85300 68819 89289 92425 95880 68066 -4073 14631 31670
25256 31670 69367 27846 6384 55253 74675 7226 41854 44560 -27178 -72017 -72961 -54278
25244 -54278 -37893 -35353 -7496 39640 92451 130083 100091 61355 21384 -211 -26201 -60269
25232 -60269 -120583 -137960 -147153 -147176 -121359 -85904 -22446 -30561 -49185 -46838 23 32981 40521
25219 40521 19432 1254 -62825 -95866 -110947 -115803 -128092 -148770 -164373 -124291 -60272 -4112
25207 -4112 13825 -14942 55107 89153 38107 75320 92310 30003 -12044 -10516 -20621 -16494
25195 -16494 -51162 -105259 -65870 10114 2606 44825 103412 67143 13999 -6608 -41536 -59390
25183 -59390 -65576 -55313 -29248 -26488 -15035 16686 17815 14583 16248 -9308 3917 65033 111090
25170 111090 79034 34527 -21018 -29446 -19826 -47759 -69995 -18410 74922 85470 62227 28283
25158 28283 37075 34656 -37360 -89604 -82775 -58640 -42451 -36894 -34487 37445 101235 65071 23244
25145 23244 30215 56118 63370 3333 -14754 -28619 -80278 -143029 -121969 -55906 -52873 -9780
25133 -9780 72581 92799 106733 63866 76671 95668 511 -45683 -30694 21329 36474 6803
25121 6803 14785 61158 52046 36160 13169 -26909 -30067 14638 21580 10354 48073 69467 80753
25108 80753 50403 4541 -7712 -46372 -17174 13103 16015 80429 65582 13442 -587 -47398
25096 -47398 -33612 13257 26864 -52872 -97666 -61301 11063 62977 25925 21207 -40615 -34964
25084 -34964 -33889 -49266 -53323 -35879 -36224 17855 17575 -71901 -93660 -86387 -80836 -51489 -67421
25071 -67421 -89105 -44611 -22449 -31151 -37049 15063 -916 -36221 -10949 -22603 -74208 -120102
25059 -120102 -76851 -60631 45962 50594 24516 10984 33888 -14990 -53679 -35321 25355
25048 25355 21423 -2177 -36795 -43174 -49088 -83444 -106101 -76707 -66249 -95119 -71360 15040
25036 15040 104134 124517 49822 7192 18875 61984 5462 -1735 11948 20533 25195 48829
25024 48829 39136 -3526 7307 -1974 1718 -32697 -33104 -19172 10915 17862 -28124 38328 34183
25011 34183 19717 80234 93362 48516 18681 -25338 -68902 -44921 28095 13543 -21515 -29406
24999 -29406 -79494 -57761 -37052 -32883 -78996 -88578 -62236 -109491 -129797 -88888 -43389 -20543
24987 -20543 25756 29808 -1491 -100029 -115453 -166747 -131400 -116612 -56098 22287 19897 4193
24975 4193 -32996 -95715 -121350 -122324 -54393 -45079 -97233 -98728 -80829 -49895 -48954 -22514 32203
24962 32203 -35191 -20321 49564 7198 22873 71540 88237 86406 60144 24722 -19324 -50572
24950 -50572 -33427 -47174 22512 93037 53461 21048 14646 35596 72105 49020 -27823 34239
24938 34239 99207 102113 41905 27808 7450 -61367 -20143 -6478 51899 83319 30741 -1477
24926 -1477 18937 20540 83568 139417 165836 151760 123407 92070 34607 -3000 47631 87361
24914 87361 75808 105746 133039 118509 72092 16628 6403 24068 -30234 -106728 -104226 -141495
24902 -141495 -114526 -79542 -18054 -12279 -11110 -17245 6331 49866 50596 25597 -14939 -47528
24890 -47528 -85484 -39497 -10276 10846 10011 -18388 5160 56648 21771 -37494 -32757 -275
24878 -275 15717 21905 39078 26745 -6122 -20506 -53129 -70820 -114139 -45212 26145 22150
24866 22150 -30336 -1505 22743 54215 57222 23954 49005 14489 2256 13654 630 14209
24854 14209 51871 79667 76661 75861 64351 81049 -10025 -63467 -55151 -37282 33126 45983
24842 45983 26138 -35870 -80301 -70903 -44336 -81083 -59189 -53014 -66234 -37013 8068 28870
24830 28870 11053 -50656 -64416 -80829 -61420 9743 60563 28763 64814 51016 8899 -28109
24818 -28109 1563 -21250 -36772 -50679 -20198 -26217 -28085 6691 -30389 -58810 -81099 -85725
24806 -85725 -64450 -22399 44751 44621 53099 36056 41887 79762 74933 342 -53691 -54532 -8600
24793 -8600 -71595 -68890 -91816 -136875 -123988 -113286 -121837 -97062 -23730 57327 73284 10643
24781 10643 36238 27673 50948 33669 10660 -13502 38344 72206 50799 46827 9358 8849
24769 8849 10111 -10289 -12574 2109 -11797 -9129 58541 66713 34581 14581 34281 50469 -27298
24756 -27298 -30862 23210 72208 35703 49194 16200 -26710 12009 81927 122790 87533 10396
24744 10396 -17853 8210 -24682 -33631 -31629 -33083 6231 -15146 -19333 -46773 -20769 8215
24732 8215 26203 82223 98539 76266 45377 46263 13167 9807 -10542 19341 50414 25389
24720 25389 11191 15474 -632 51625 82432 26396 -36429 -12622 34576 17913 22678 13470
24708 13470 -7034 -67244 -56168 -42513 -45309 -9265 7911 -29255 -89686 -83449 -91993 -108167
24696 -108167 -103395 -52927 58067 82579 55296 56514 73644 74303 51082 42420 5993 -46372
24684 -46372 20051 43330 32570 65273 29992 19649 42101 51218 11880 65879 121030 48142
24672 48142 40522 63141 37091 20736 49480 49586 34058 55326 98403 66292 49378 7882
24660 7882 -4671 -13016 14474 10231 44151 87130 88882 92649 96886 71545 82811 95587 72663
24647 72663 71568 29742 -7664 38473 32384 44355 73178 -12826 -46253 -45172 -8961 7943
24635 7943 27410 -28117 -88547 -31278 6857 67894 108091 24269 -47749 15282 108549 103320
24623 103320 81046 105939 72016 24085 18126 -47740 -59931 -84995 -77301 -23378 29248 48020
24611 48020 -3890 -71720 -87195 -51424 -17620 -31176 -40411 12790 20414 -45278 -98743 -69318
24599 -69318 -65651 -82851 -5522 5737 -30183 -73817 -72023 -64380 -69446 -76064 -64851 -35606 4161
24586 4161 60389 14807 -21907 -30039 -51617 -18688 -24139 -77597 -64356 -62522 -25579 -50647
24574 -50647 -31600 -26745 -30490 -47818 -6570 -36761 -32110 -25512 -41906 -53196 7478 6222 -31551
24561 -31551 -73427 -105095 -25244 52010 64029 -7484 -73775 -109341 -56832 6215 45617 71884
24549 71884 1489 -55155 -57854 -11584 -35591 -7632 38393 47508 5111 -74782 -87906 -25777
24537 -25777 40388 39846 31551 65192 29088 -1195 -115497 -62273 18866 51322 73124 31791
24525 31791 -41890 -79133 -72781 7311 8740 43383 89301 61892 45034 35561 38879 43109 53111
24512 53111 42967 689 -13553 25784 48431 38074 36475 46831 76848 50299 31887 13443
24500 13443 -45060 -87144 -12010 56678 62255 17539 -32776 -86 -18769 -71106 -92331 -93628
24488 -93628 -94407 -33818 -28324 -50407 -113309 -155715 -181550 -228296 -144975 -102922 -88636 -65903
24476 -65903 -87328 -48359 -38633 -42546 -59492 -84724 -66134 -17929 10962 -28224 -48068 -23872
24464 -23872 -46880 -107165 -81901 -81987 -89510 -3501 39010 14658 -5241 -1797 74072 90904 38998
24451 38998 14883 -83745 -107497 -77573 5969 -1591 40128 75686 86489 71000 35320 44738
24439 44738 14836 12520 30405 21080 11564 1793 -76393 -109002 -94675 -125412 -160419 -106250
24427 -106250 3754 57027 113899 89744 80004 19063 6259 -20456 -22673 -64493 -55742 35995
24415 35995 37585 -8720 -24178 -23642 -55620 -40677 -51691 -40565 -19906 -60075 -116329 -117980
24403 -117980 -74141 -27306 -16485 -18954 -24826 -33657 -62903 -62322 -87000 -104914 -31307 -3070
24391 -3070 -54377 -69564 -49707 -42426 20276 66889 69786 37106 27052 72553 76353 61735
24379 61735 45845 8947 16569 31556 19266 -25767 -121061 -147498 -101119 -49000 -15502 -5282
24367 -5282 -43136 -43671 -54406 -100196 -28463 -9120 31335 78448 34135 15446 -59732 -50706
24355 -50706 -55595 -15337 -17787 22575 62003 61492 47076 67503 81892 32241 37688 52283 35533
24342 35533 17107 47784 61946 -1808 -81506 -96318 -89924 -52539 -93457 -110031 -32783 31070
24330 31070 -14228 -80584 -51929 13591 64853 29537 3851 -1524 -31452 8185 29236 11701
24318 11701 77529 95411 71440 52814 110555 59478 -11236 -20057 -39102 -90706 -115959 -90858
24306 -90858 -52689 -67352 -73858 -39329 2409 38019 82125 83289 817 -45225 -66906 -95676
24294 -95676 -46665 -48877 -93173 -86741 -62061 -3914 -724 -45802 -66208 -65053 -39610 -63492
24282 -63492 -72318 -88028 -67522 -19560 39559 23211 11533 63355 24256 -17547 -45917 -106345
24270 -106345 -86959 -12671 41772 62764 64646 114555 123313 38863 46251 51832 -26961 -49415
24258 -49415 -46783 -57483 -33216 -49185 -59582 -40813 -1005 -1813 -25723 -461 -39543 -64078
24246 -64078 -63480 -93397 -85906 -50998 -42712 24871 38976 21931 -8303 18628 57033 71643
24234 71643 -3030 -74141 -54112 -31301 -22142 4619 3178 7778 -73645 -114787 -34731 8217
24222 8217 41165 27130 -459 11602 40477 87652 25891 11704 14387 -71540 -137604 -60301
24210 -60301 -4845 42955 2022 -49128 -30097 7643 19929 41644 -2589 -20425 -20051 -4697
24198 -4697 -7668 28019 42791 41127 33520 35822 31372 11809 1970 -1811 -47858 -68898 -142157
24185 -142157 -145402 -117137 -68335 17404 82517 123494 115005 89484 51431 -33491 -11549 26529
24173 26529 31587 -9044 4789 22647 -25213 -8663 -817 49389 106995 84439 71058 33465
24161 33465 26834 31230 16181 6289 52250 139025 97426 67115 29034 32614 -11442 -3662 37921
24148 37921 25216 -63525 -130290 -158740 -69875 -26438 35877 34228 29538 -20280 -32909 -67524
24136 -67524 -79682 -24650 5097 37271 10228 -27001 -10806 11012 -63934 -91665 -90055 -107660
24124 -107660 -110666 -60878 -14424 -13983 45 -10497 -18312 -40033 -31373 33502 82558 70430
24112 70430 9309 -33363 -9967 -23494 -85501 -41617 18540 -35704 -88192 -110728 -136281 -142252
24100 -142252 -98565 -119358 -117109 -57107 -26105 -26801 -81231 -91358 -27657 46908 119650 77298
24088 77298 31100 58614 52428 3531 19857 33350 16866 29017 69517 74046 79561 22014
24076 22014 -54380 -82445 -65756 -71740 -38113 29115 -38536 -88731 -108065 -62702 -12559 -4909
24064 -4909 -18133 -38429 -209 -21374 -30183 34683 32456 -525 18480 45327 65772 121382
24052 121382 113790 64273 64018 66867 84936 86375 28381 20351 31235 25171 -49977 -49713 -15042
24039 -15042 10780 -4732 -21371 -39732 -70793 -56939 -37502 -81025 -93147 -51925 -13184 -23797
24027 -23797 -37435 -66717 -68427 -65933 -6943 38825 57146 64936 68916 33201 53045 96530
24015 96530 104374 78470 108532 82921 40234 37905 44160 19138 -26878 -10993 45030 84731
24003 84731 107395 3674 -59871 -8111 18169 -11982 -17068 -28366 -34492 -59085 4489 39034
23991 39034 83691 59117 14935 -64878 -55245 -31613 -7213 6058 3875 -43879 -49758 -29899
23979 -29899 -423 -42033 -79108 -38113 -21097 -27226 -25126 -3422 -40049 -78910 -62409 26928
23967 26928 63406 34585 27702 94073 55498 49819 5994 -68484 -62431 -65138 -23515 -17505 -13450
23954 -13450 -51332 -65085 -41752 46766 61525 39861 57715 64864 24878 -32855 -61687 -112569
23942 -112569 -124484 -33019 33240 70842 25591 -12104 48088 11000 16969 -2553 -15409 1964
23930 1964 47493 90237 38640 34412 63588 66566 73332 82851 40600 2545 21059 32872 -22459
23917 -22459 -67165 -64141 -2961 39230 12477 29885 57976 4441 -27981 -24164 5037 -42000
23905 -42000 -87390 -46200 21756 -5124 -12280 12602 14636 7737 21836 46309 56620 45436
23893 45436 -46277 -99690 -82704 -59170 -51298 -63676 -3268 -42010 -31958 -45992 -72055 -56745
23881 -56745 -38073 -49368 -66691 -20254 1680 -35529 -37640 -45746 -46804 -41709 27926 59288
23869 59288 63095 76288 44118 -8981 -2760 7150 48430 44108 -2303 43860 125928 117179 140506
23856 140506 179694 145147 81931 48443 39857 91926 127237 109096 53192 -14878 -21455 -13706
23844 -13706 18551 9085 -3032 -14774 1029 -19907 -37754 -28342 -38209 -21164 -14220 -57795
23832 -57795 -4660 -35642 -14916 30625 73685 128655 151170 88999 96512 70192 77751 73309
23820 73309 81316 117216 43177 -5829 2435 2485 -28711 51550 62265 34903 -12959 41248 74842
23807 74842 92172 68584 37404 62667 105612 131064 128114 109402 46767 5342 21605 53260
23795 53260 43501 12884 48943 67031 -29146 -37583 7968 -15492 -50372 -74903 -41227 14406
23783 14406 30425 15109 5221 34757 5400 -10503 685 14249 66180 85267 52135 78720
23771 78720 26367 705 11598 1891 -26081 -27425 112 46294 17588 -46689 -39175 35508
23759 35508 33667 -8595 -19406 -43159 -42994 -8318 -13846 9460 20724 22541 55757 33957 37082
23746 37082 7999 34882 16865 -14256 -32014 -45559 -31154 -37308 16993 43020 27596 -3181
23734 -3181 -35704 -51657 -93201 -128562 -159672 -176709 -185371 -166064 -121169 -76379 -85773 -106374
23722 -106374 -46644 -38827 -31183 -41706 -51049 -46456 -41528 -3307 -18880 -53041 -41632 -49763 -64734
23709 -64734 -86307 -18066 -28615 -41172 -39984 -27532 -19889 -34194 -16579 14445 39139 25442
23697 25442 19985 4048 -27721 -51949 -103463 -153187 -151939 -132769 -73366 -55662 -48275 -20130
23685 -20130 -15845 -65513 -95276 -55060 -69628 -67765 -40093 -16884 38502 10602 54116 88584
23673 88584 46293 38208 27046 46977 -8216 -72842 -82129 -107318 -102765 -55926 17611 63880
23661 63880 83451 -12086 -765 12377 -53995 -113660 -95981 -46258 3566 -8054 -49473 2290
23649 2290 53732 52766 47768 84873 109859 114289 25212 -11905 -48191 -35526 -27014 -27400 23662
23636 23662 50915 47872 21185 55698 87919 98759 69069 40340 39060 44046 46085 56024 30884
23623 30884 -30174 -30770 -31429 6888 18988 16754 41677 10685 7449 30164 72123 25629 -73913
23610 -73913 -148023 -213340 -127424 -33171 -18039 -66488 -115035 -126137 -85251 -77552 -96341 -105398
23598 -105398 -63378 47074 39401 -13368 -15843 27449 51068 113122 131235 65945 37493 29904
23586 29904 30756 74352 74296 73442 12942 -20573 -3890 -6608 -15455 -12172 -32326 -36781 9204 61385
23572 61385 106767 142541 126109 153758 104000 61181 61252 71403 27532 2647 -28898 19520
23560 19520 40196 46998 87681 56045 42113 12386 4941 39655 25302 -6126 -24573 -21902
23548 -21902 -52095 -77304 -38834 -45246 7885 -5217 36952 51414 46301 10995 -17122 -147
23536 -147 -4899 8934 19585 -15883 -66122 -65386 9613 65862 44598 45036 28990 -2893 35618
23523 35618 17116 15925 20551 29480 50312 26652 80218 81593 -16277 -28326 -62256 -50639
23511 -50639 10214 44257 -3885 -34308 -14847 -62429 -55758 -42273 -98461 -94399 -40032 -16692
23499 -16692 -55138 -92761 -48273 7536 47959 48609 74876 25242 -9715 -9793 -44680 -62446 13058
23486 13058 15131 -2004 3314 -31106 -123055 -153203 -101048 -78043 -80542 -55891 -16075 49318
23474 49318 46143 19750 -71611 -78103 -60659 -11216 -28368 -57901 -73653 -22808 14115 14365
23462 14365 19359 42668 33971 -15394 -23062 559 27463 41667 15765 16186 48473 91764 107953
23449 107953 96351 55644 1167 -29996 -22784 -23108 -20072 28688 24101 2359 -76670 -83908 -58967
23436 -58967 -66361 -83646 -16774 -5863 38507 43120 24074 96189 91222 114098 113755 48910 14245
23423 14245 6425 -53388 -6022 101438 113086 122252 85739 35945 -36341 -44983 -22196 -564
23411 -564 -38620 -33682 18412 42463 40105 51152 36305 11030 13472 7097 -31383 13120 58025
23398 58025 13572 29101 78320 80845 63169 55964 56943 62455 43485 106222 106057 46665 29912
23385 29912 26804 -8048 -43836 -67647 -71327 -27897 84355 100864 37582 -23033 -42595 10795
23373 10795 5590 -21669 -39278 21009 38127 111484 142721 160915 154617 123967 85030 85130
23361 85130 45940 4925 68309 98427 154158 213007 206719 186336 155571 78688 34538 -26661
23349 -26661 -68697 -26888 -7720 -12551 32087 1123 -12359 -78765 -78672 -24812 74624 85908
23337 85908 32444 -19415 30315 -79734 -135796 -107587 -85565 -12468 24461 65661 74498 77011
23325 77011 66214 91950 58103 69811 85892 49402 76092 96413 -19279 23646 79937
23314 79937 66574 -8480 12507 29408 1406 -3444 1474 -44504 -36376 -27809 -14531 54527
23302 54527 48078 42512 -43697 -103470 -103721 -81035 -100982 -64013 -25498 -9570 -12617 -33517 -33685
23289 -33685 -75905 -100343 -102854 -107780 -115380 -127480 -137180 -111909 -39542 6652 19515 19703 -32357
23276 -32357 -15639 17062 31587 -31643 -21704 22322 -38111 -87442 -166004 -144416 -51129 -48469
23264 -48469 40910 37112 -33599 13522 25953 -13326 -61684 -35697 -59465 -19133 -6962 -18867
23252 -18867 -20423 -8211 4234 -28158 -109262 -93052 -62767 -78110 -68270 2354 55776 113721
23240 113721 34094 -1953 -48948 -67935 -78629 -60823 -52373 -32699 37448 -9091 -64309 -143518
23228 -143518 -79084 -7906 4665 -41732 -65005 -87067 -113588 -164520 -118343 -100133 -80428
23217 -80428 -85238 -65879 -69454 1805 46956 65180 91582 54400 -20782 -59891 -52538 -16676
23205 -16676 -83809 -113935 -87953 -12539 53412 103066 79367 29017 -9094 6748 38646 68298
23193 68298 60177 49271 8792 21764 64708 32068 -71769 -86120 -93292 -97180 -50907 -3963
23181 -3963 -24984 150 24106 50422 27655 -41441 -56521 -69242 -106518 -80377 -31841 59798
23169 59798 40223 12617 42523 52164 105326 64533 17503 73391 80847 67481 25064 7073
23157 7073 -25778 -16575 3022 40226 6178 -53258 -19873 -14047 -21338 -1029 22591 54356
23145 54356 43713 27848 20996 -7397 -18173 34740 34535 -26058 -77971 -106579 -49824 16456
23133 16456 11390 41022 758 -54925 -55036 -39703 -48707 -22811 -21370 24312 -14686 -4558 -10128
23120 -10128 -3688 854 16579 37426 32524 55209 91904 116026 67458 22812 67145 70353
23108 70353 108124 84575 63469 75978 116748 80423 15237 -7707 5089 1618 -38797 9579
23096 9579 54822 72974 45075 42968 76636 39854 22102 13263 -16069 -29831 8104 14640
23084 14640 7750 11310 42042 67431 32943 -8051 15659 36739 59016 51489 1939 -29317
23072 -29317 -62695 -21665 -66967 -102915 -109920 -89638 -105988 -93927 -87477 -74456 -48359 -44442
23060 -44442 -12073 -11329 -23523 -78269 -67968 -90219 -41615 16391 41791 -21795 -37440 -11178
23048 -11178 -19944 -35205 -59765 -42678 -35866 9795 -27558 -32310 -85213 -81614 -21321 32300
23036 32300 67469 73387 11863 -10300 -21578 -6805 -32575 -8034 18326 -49368 -30384 18722
23024 18722 32301 93351 108973 41372 13391 3909 36126 26969 -31852 -83843 -114181 -84676
23012 -84676 -104085 -68648 -69043 -75882 -86937 -78128 -15996 48283 131085 138064 121275 62887 -14833
22999 -14833 -81323 -136457 -80455 -67802 -99332 -108812 -85898 -57672 -15802 67370 36385 -37177
22987 -37177 -54141 -37041 -18954 25246 21237 -5655 34792 42356 39209 16659 87178 63844
22975 63844 -21984 15597 48579 17033 31496 15116 523 -2199 34532 63454 44916 23519
22963 23519 -66795 -116183 -95016 -46713 -31872 -69827 -105438 -70514 -13129 -54263 -51154 -75161
22951 -75161 -85892 -60968 -3517 -20417 -19440 -15097 -5696 -46678 -106691 -109712 -103083 -58978 34081
22938 34081 37967 12772 9844 -37759 -84238 -64721 1207 64566 36215 94159 114437 57367
22926 57367 25810 6427 24802 57235 70086 60471 -13819 -31583 -47532 -49849 -70610 -80390
22914 -80390 -73804 -53819 15231 25769 -3854 -15890 -109898 -82372 -4043 3615 1299 4597
22902 4597 -6540 -29248 22665 76424 19053 -69 -769 -95665 -109665 -89899 -116163 -89684
22890 -89684 -57366 -43061 -40585 -65103 -21708 -37625 -49298 1079 3787 36121 31925 34259
22878 34259 74404 76411 9088 35840 32573 18748 49561 3799 -57513 -57268 -8552 -4108 -45685
22865 -45685 -50334 -20991 28278 41065 17331 -12365 41900 -22419 -43118 -35261 -12179 -18122
22853 -18122 -12761 -4713 -43192 -51165 -12617 -1138 11600 9542 -3737 25635 30208 -35423 -91441
22840 -91441 -71287 -49206 -84428 -47953 -43566 -34494 -74956 -96263 -64653 -38544 -55980 -77315
22828 -77315 -39964 48258 84587 31202 18004 94804 113491 10547 9370 62839 7273 -13693
22816 -13693 86080 123354 45279 71518 12666 33888 -2585 -33066 -4436 32768 116324 95833
22804 95833 94303 114394 121194 47399 13961 -44197 -48770 -101027 -118605 -57938 -11807 12948
22792 12948 36220 14473 -29485 -55461 -53072 -12754 9837 28096 36575 -20098 -17845 -9545
22780 -9545 1944 -38892 -69446 -41291 -33692 7089 30296 15222 -48974 -22165 -1009 13958
22768 13958 -21252 -752 -6377 -53787 -99028 -46242 36315 99188 97493 28392 35448 91115
22756 91115 64994 12261 -17365 -22725 19253 36818 6921 21702 37202 30955 16857 29332
22744 29332 -8787 -44370 1576 10626 -1499 10493 62188 92966 109710 84313 69264 24216
22732 24216 7780 -4429 -22343 -7707 -70831 -85269 19628 18115 -29553 -22282 -1108 -37618
22720 -37618 -67941 -63897 -28624 6257 5910 22098 58377 98288 72934 31876 -27150 -76770
22708 -76770 -103970 -60460 -31712 -61082 -21680 27907 75613 66160 80064 41994 82014 13631
22696 13631 34590 39762 19632 16741 37233 57627 100373 106906 82487 88392 -14823 -40009
22684 -40009 -20978 1999 83023 132045 134798 98552 77706 -6476 -69664 -126193 -121453 -59092
22672 -59092 -44068 -57615 -79885 -44392 -50308 -30643 -928 21226 45604 63548 76574 110448
22660 110448 144860 104500 89229 113929 122999 67610 28203 -9956 -3965 23802 10767 45368
22648 45368 -15429 -58009 -104506 -98692 -69817 -26303 -16147 33083 57867 52485 46344 46058 -5849
22635 -5849 -30142 -56955 -50225 -53588 -28175 -19326 -36204 -77974 -67522 -66114 -92510 -116031 -76117
22622 -76117 -8780 42614 46478 22377 32386 35248 50466 102504 106236 82688 81187 6925
22610 6925 -14332 -34234 -38758 -66251 -78340 -8691 -839 -15702 -55983 -27161 -56326 26339
22598 26339 70197 25162 -10810 28824 2009 -52271 -33269 62341 129314 126179 134727 110958
22586 110958 134286 103991 81820 72876 64776 17741 -32255 -27532 -8950 -18782 14374 39215
22574 39215 -8753 -102289 -102189 -79898 -37761 41843 56406 -9488 -15243 -38118 -32680 27431
22562 27431 5216 -22121 -17902 2577 25709 48465 13353 54599 67946 62965 35667 2176
22550 2176 -7921 34210 25046 -33503 -2353 -6758 -51633 -36235 -60086 -14299 30274 51772
22538 51772 66651 110612 77174 128578 89992 53024 50008 10205 -62471 -99221 -58538 -69476
22526 -69476 -109171 -70838 -62759 -92959 -92840 -73513 -84871 -68383 -32035 -2751 -13137 -16794
22514 -16794 -27683 -63237 -6608 -12533 -42040 218 61080 23865 -4894 3671 86513 73452
22502 73452 69963 35582 11706 11185 -13375 -38075 -63591 -41978 -73072 -124317 -48422 18875
22490 18875 65400 95167 34532 15183 -1451 -7129 -20265 -48622 -54381 -34337 -104905 -156099
22478 -156099 -117555 -80375 -38582 -7248 13906 55858 17222 -58555 -39182 25930 70423
22467 70423 54956 9684 -4889 -14177 -41473 -36737 -78333 -114923 -112221 -112878 -102647 -60481 -47795
22454 -47795 -140947 -227877 -203122 -162965 -54014 -68113 -77550 -70066 -54124 -70118 -67985 -66964
22442 -66964 -123671 -112053 -40072 -25886 38194 37446 28311 26131 -12563 -56717 -76198 -11966
22430 -11966 64314 67229 70970 -6028 -14732 7384 -27737 -71234 -92380 -68111 -43070 12038
22418 12038 25642 65876 119756 65834 41122 46298 52511 42533 -2462 -28971 547 -1609
22406 -1609 4167 47243 78685 59248 -6132 -42204 -96 25233 -37110 -155003 -90419 -13984
22394 -13984 24792 38188 54306 33939 -76870 -94265 -90899 -16723 -27808 -57342 1738 22178
22382 22178 27192 10076 -15215 38961 16052 -66519 -67901 -85895 -112929 -108497 -42981 -50143
22370 -50143 -33862 -46198 -65198 -58304 -43770 -97881 -50572 18631 -6126 -24988 -20508 44819
22358 44819 96151 107063 74702 34214 -14146 -27969 -62016 3424 33669 -3661 -83773 -114252
22346 -114252 -72339 -32929 4384 410 -25866 -36355 -6409 14789 44454 51341 70930 22683
22334 22683 8826 17535 44683 48780 35954 16837 -25015 -61131 -82136 -50715 -121309 -136880
22322 -136880 -106459 -24173 21905 47563 33907 44451 19277 41749 33973 16331 -13690 4980
22310 4980 95387 124788 51438 -10845 -20780 -17832 -15666 -20364 -37524 -24751 -34746 -14023 -29188
22297 -29188 7155 2508 -80290 -144747 -125038 -73475 -58096 -18343 3359 -919 -3285 12070
22285 12070 -3640 26933 48518 21489 -30572 -45842 -5716 -41117 -17604 35669 14736 -7720
22273 -7720 -7296 3637 62219 77996 85142 123767 85672 7280 -28636 5764 30225 72162
22261 72162 61589 14672 -4771 612 19009 23823 15033 10147 50635 37511 19498 -23035
22249 -23035 -63015 -45699 -34657 -40267 -61474 -40503 -57380 -76733 -31782 -2578 36340 42715
22237 42715 26863 4726 -23876 10288 12370 -31368 -54316 -50702 -103527 -94501 -46594 15032
22225 15032 28093 52186 96363 118681 94757 81382 54247 -20257 -84805 7137 20132 -1891
22213 -1891 -5834 -30129 -17003 15570 -33085 -57469 4353 -17246 8408 -12044 -18357 -52944
22201 -52944 -33616 -37009 -40630 -79194 -38660 30055 79044 99750 98559 106312 102504 100131 62798
22188 62798 61471 60095 69072 84719 75054 129173 142417 116244 76397 13636 1648 1601 10663
22175 10663 20134 92607 73932 13956 -37601 -40210 24663 -998 16161 27207 -15209 12695
22163 12695 9516 38783 -21853 -56791 -78068 -97090 -19323 39793 18202 -36610 -81869 -98762
22151 -98762 -109849 -55274 -7224 19929 37613 -5433 -16654 -19574 13750 3891 -8969 2610
22139 2610 -39763 -23206 -6510 -51652 -90357 -88919 -47888 35527 79779 104080 109785 35101
22127 35101 -25985 -24548 -19216 -4648 -20650 -50392 -21448 -58353 -44581 -25887 23597 36195
22115 36195 -22201 -63298 35127 60854 -42338 13278 17568 44720 23030 29077 -3883 -8855
22103 -8855 3666 8471 -15577 -73142 -132600 -155261 -87706 -32205 886 -3101 -48933 9457
22091 9457 59419 52531 66891 57338 105363 129024 137226 81038 -14192 -27143 -27110 -144 6055
22078 6055 88474 123375 77332 -1973 44158 30254 -39046 -59914 -29071 26608 33472 -12730
22066 -12730 -51663 -89570 -116401 -84845 -36655 -25293 -49925 -28921 -4502 -4529 -25037 -9522
22054 -9522 -29947 -25950 -7579 31854 -8134 -75835 -112788 -86712 -48087 -57350 -40522 -50197
22042 -50197 -38206 -33103 -70249 -35101 15297 -21164 -9919 2264 31388 22605 18571 -1246
22030 -1246 -12730 -6239 1718 28985 -8142 9113 64975 30853 -18881 -22049 -35989 -19326
22018 -19326 -38893 -106718 -75185 -19104 -26052 -40621 -57619 -65245 -45210 -54564 -36030 37764
22006 37764 44777 102681 115587 67000 34911 38650 83195 34137 -42135 -121426 -96848 386
21994 386 39633 114944 109563 72288 3793 -56434 -42826 5480 36368 -7629 -10183 -12271 -3756
21981 -3756 47467 69794 86349 72843 70021 31687 -33933 -43493 -83260 -60818 -76306 -35568
21969 -35568 -34410 -68157 -50963 5362 8803 14635 -9508 -24034 32425 43408 7049 -21677
21957 -21677 -14175 -33831 5977 -25144 -42542 -2848 55358 74786 -12157 -36547 -17439 -17939
21945 -17939 -25809 -12430 9432 14760 10166 -24875 -6896 17444 32453 95413 109880 69564
21933 69564 -43017 -77525 -86514 -63078 -21077 65113 31164 -21619 25741 55547 53045 21589
21921 21589 35548 51213 49391 -2777 -66006 -79042 -64517 -47926 22103 -51467 -79972 -17163
21909 -17163 -13977 -50750 -22128 52941 97022 57813 47154 26437 51165 94202 89313 51754
21897 51754 -41587 -42969 -23995 -83897 -150009 -119757 -39125 -57339 -35163 -28750 28016 70975
21885 70975 65041 69645 88199 102991 68354 -27881 -23660 12687 6731 -88262 -138161 -83485
21873 -83485 5061 63965 110719 130206 82335 12689 2550 65318 104739 82534 11220 -32465
21861 -32465 -17385 56227 64397 20135 6014 450 -13260 9639 -19383 -76742 -107615 -124624
21849 -124624 -67245 -30909 -85088 -109784 -61945 -63592 -58582 -33634 2695 -14966 -30888 -27120
21837 -27120 -46132 -63948 -63793 -58970 -57356 -45151 -45339 -71896 -113017 -51009 -48320 -37582 -8682
21824 -8682 -72167 -116607 -79470 -34803 1199 -16924 3917 -27599 -73804 -69048 -62745 -112254
21812 -112254 -104755 -56186 -48899 -43256 -44989 -64241 -50199 -47695 -68648 -88194 -69717 -32013
21800 -32013 -15048 38641 50340 -30894 -94510 -45594 -64666 -50312 -52507 -97872 -117650 -55859
21788 -55859 10407 82743 174651 183244 132380 84671 31233 -65197 -78856 -69588 -72588 -17136
21776 -17136 7733 -8824 9792 27980 23090 33770 31561 53096 57830 35085 -5461 -18460
21764 -18460 76928 78778 39196 -7683 -28608 24721 75377 69244 8854 -21137 22437 69224
21752 69224 112289 82967 46348 -16765 -1011 76157 83569 25024 17912 2648 -16906 66553
21740 66553 58876 19519 -27582 -30554 -1737 -9733 -42699 -6299 7807 -30297 -95735 -161739
21728 -161739 -86989 61350 71429 37587 -8790 -632 63316 45895 65978 42221 -6780
21717 -6780 6872 38888 26236 -12695 -6237 5130 4623 64060 73812 20981 10412 -4453 -35631
21704 -35631 -43472 -66995 -60638 -59588 -34137 -13203 2230 53629 58467 20508 20129 -2026 -38762
21691 -38762 -34266 14931 69464 98130 76061 102773 115925 101886 17692 -5147 59815 93167
21679 93167 103607 74327 69898 127376 97095 45224 21632 63745 30783 25461 21100 -31338
21667 -31338 -46875 -61276 -71299 -69727 -89320 -40516 207 9187 -2350 38795 30707 45765
21655 45765 57776 10079 -25981 -50542 -109239 -79598 -5931 48713 79005 62913 74934 16641
21643 16641 -36920 6054 63440 30781 33448 61268 81633 35729 59000 40614 5229 7744
21631 7744 6801 25628 16976 30812 64073 37613 38578 40954 18803 -16782 -35540 -11411 27161
21618 27161 33125 24596 -43910 -107407 -114315 -80905 -18190 -30341 -43102 -991 13692 -15357
21606 -15357 -74504 -86302 -88046 -128535 -121611 -124543 -74335 -55936 -109783 -73197 -46093 -13298
21594 -13298 41250 15320 -8126 -3580 39234 19960 55386 65248 67380 90560 25730 -58596
21582 -58596 -52087 -2871 15643 21159 36502 46309 21722 11908 -19105 -13155 45889 59437 112435
21569 112435 116899 154683 182274 101155 38815 60697 106279 91559 38004 4925 -146 35189
21557 35189 28221 56386 42489 75203 51132 45727 71991 49086 9107 -4643 -5225 -8951 -4170
21544 -4170 1575 -22075 -17098 8550 -8662 -14909 20760 -32418 -62808 -60354 -48182 -35057 -10851
21531 -10851 -8806 28606 27172 -17175 -28454 -11088 -8582 82451 109423 60968 -53164 -87849
21519 -87849 -90769 -89607 -107819 -60293 -54672 -71199 -75284 -21683 20323 78923 123456 62907
21507 62907 -8739 -26833 -21616 -4499 -37639 -74085 -19424 42185 58298 103473 85949 24396
21495 24396 3638 39427 43753 49827 28646 4211 -29285 -67653 -115460 -53366 -51144 -15467
21483 -15467 -5153 -30093 -20723 -16198 8440 54746 63208 45518 38798 21142 35703 69804
21471 69804 73733 27609 8584 -80339 -154062 -145131 -60422 32666 83474 79937 45336 -4779
21459 -4779 -11124 15267 -56616 -96051 -82905 -95655 -166543 -158842 -82226 -57581 29114 58795
21447 58795 6847 -14454 28219 52624 42054 9769 -31370 -24687 30577 2607 -29677 -22498
21435 -22498 -61134 -98487 -100782 -104339 -131583 -113911 -134920 -109855 -63322 -63242 -17638 12358 22291
21422 22291 -272 -14459 31717 35749 13047 -23446 13725 26891 62862 31015 20298 -17792
21410 -17792 -11304 -18636 -6160 40069 39593 18013 -1471 12072 14508 -5335 -61892 -75466 -46670
21397 -46670 -38167 -35624 -23848 1036 21304 6792 -23081 -31030 -75101 -54235 -49252 -42616 12883
21384 12883 74525 57410 24897 24212 -26770 -50295 -16742 13968 -33933 -15312 27763 57831
21372 57831 95111 62462 -22013 -23033 -8249 8544 -6513 47662 19137 -22266 -11636 46922
21360 46922 58403 -1138 -882 7541 -11527 -48223 -29000 -7388 -217 -9418 -31480 -24084 7733
21347 7733 31401 37979 13094 -39762 -85264 -57580 -12620 -39089 -5333 33757 39699 35779
21335 35779 -1376 -33892 -77727 -24360 -645 542 -13266 11173 49907 83046 46515 34964
21323 34964 54600 33871 -21480 -44018 2773 44343 105582 65470 72197 70500 110955 120887
21311 120887 52948 2179 -1622 -30247 1605 670 -24823 -6920 -1137 12779 29114 59133
21299 59133 73413 66938 50624 1662 27616 31922 5752 -22785 -13869 9986 56503 35301
21287 35301 -14625 -13426 -7653 39292 17754 43107 50716 66558 25586 -46437 -41755 -3356
21275 -3356 22570 24748 30301 3537 36513 69045 53414 -12804 -20257 16471 845 39485
21263 39485 49312 120037 120035 108420 65014 55665 65378 61221 85156 112567 72323 17198 -22099
21250 -22099 3499 42847 45062 4957 -23061 -25976 -69785 -110829 -26628 42826 18507 41935
21238 41935 52267 19411 -24051 -2250 73140 93761 73312 5484 -20738 -13639 -13067 21628
21226 21628 29062 25841 44338 34877 83694 94813 69913 78609 54225 -24064 33207 108195
21214 108195 117384 27866 -69064 -57057 -52318 -58418 -16095 103640 127629 87299 58938 67282
21202 67282 120965 119131 142160 98419 50836 16065 19057 28814 -32201 4447 -20594 -73720
21190 -73720 -143165 -132001 -30980 46012 53210 38724 10517 -9607 -30142 -25488 -34052 -62817
21178 -62817 -53298 -12298 -3947 14937 51380 78101 97402 35467 -35423 -55190 -56976 -99513
21166 -99513 -72369 -38220 -39014 -57048 -46844 -10292 36743 95930 60365 28724 -6127 14181
21154 14181 33440 108192 149323 153579 112954 92446 114517 80684 24299 -15037 5743 35931
21142 35931 37260 34875 28432 6948 47943 93674 92321 30621 11151 45652 99988 84315
21130 84315 65029 69796 52847 69209 41280 44838 11302 -9493 16522 12706 -37859 -17875
21118 -17875 63306 5186 7286 70696 130563 131339 84323 37356 -2948 8028 -27358 -66514
21106 -66514 -60801 -52691 -79521 -96150 -128685 -65148 39903 26643 19853 1786 10142 50893
21094 50893 108453 133886 112824 25281 17767 3276 -33588 -17707 40817 75706 92510 70673
21082 70673 99136 134389 99452 73425 108203 133208 89665 53961 16129 23389 13434 42453
21070 42453 38978 14761 4378 24287 27380 -18111 -37636 -30302 23851 25289 10615 14445 3688
21057 3688 -8040 36017 2321 754 4463 -53192 -25387 31151 58101 32778 35571 -20239
21045 -20239 -22735 -12266 33389 71 1852 -32858 -87354 -88172 -87210 -26658 42581 47477 77237
21032 77237 104011 43129 -4192 5342 23304 -41709 -69932 -52017 -47584 14941 11075 -46605
21020 -46605 -8811 71414 92294 76321 62655 11551 30891 27433 -13328 30319 114335 104729
21008 104729 67393 64096 39770 7491 -4698 9062 27853 37757 710 59724 146641 139815
20996 139815 119342 129467 88256 48863 34499 -14105 5292 61096 51213 42026 -18097 -40020
20984 -40020 -16328 809 26642 7109 -42489 -70555 -57863 -55672 50905 116338 109934 14933
20972 14933 -51410 15157 57513 87946 37215 26274 26194 31978 43668 40455 57018 30163 -40612
20959 -40612 -65962 8381 46470 59152 69702 22385 67516 56506 57530 33846 48713 18995
20947 18995 68973 122817 56039 -19182 -23984 20190 -8188 -33010 22663 16475 -25678 -31956
20935 -31956 14324 58616 85304 61106 8710 20014 -28386 -9776 38490 74434 83976 59254
20923 59254 61687 4906 12168 26189 31407 36393 44861 46404 -5513 -5409 28123 7370 7239 11947
20909 11947 60687 80746 24214 -68141 -35342 -45885 -65965 -51379 -19859 -3803 -21991 -49653
20897 -49653 -71530 -100899 -70364 -62871 -30630 -44464 -5757 -5274 7350 35054 82303 74999
20885 74999 102962 136704 119074 117361 93086 82851 110162 56129 68942 128402 209540 175428
20873 175428 112720 68567 75227 23230 -23478 8221 24073 -4275 -25775 -34688 -26167 -10965
20861 -10965 -9997 -7482 57256 58953 33062 -24209 -23179 10041 9326 -84543 -74286 -22183 -17476
20848 -17476 -20736 -19118 -47801 -9563 -15329 35976 89296 144315 119359 51041 -20612 -66681
20836 -66681 -18061 -9598 11936 -6685 -19994 45222 54739 -29367 -69885 -90485 -119133 -64137
20824 -64137 12248 56024 71289 104333 40478 -28018 -26837 -12531 -5642 -41226 -69305 -70764
20812 -70764 -22899 99982 177740 124884 55605 38472 70637 33828 27120 53863 90153 117575
20800 117575 110497 79501 70045 30969 53103 87283 97954 104070 111625 23271 15098 11170 34229
20787 34229 -7897 -51974 -97091 -112227 -98449 -115790 -63923 -35536 28773 30628 12616 18125
20775 18125 -15244 -14004 -41146 -20947 -62321 -64097 176 -27558 -52862 -13236 15549 -8524
20763 -8524 3869 -13180 -26842 1132 1403 45008 121067 115931 113469 87588 40649 -37948 -99110
20750 -99110 -40755 -3513 18131 16187 4036 67546 81154 101717 69284 14039 62610 121415
20738 121415 164143 133922 116863 128603 147321 185527 169850 117841 -25 -2102 40973
20727 40973 97377 103573 60289 40071 31433 48785 65137 67047 33920 28794 -336 -36211
20715 -36211 -36136 30306 74625 73778 90831 75607 63039 68634 106728 71957 47813 68122 91226
20702 91226 67284 22827 -19149 -34211 -2710 -31920 -37360 -29160 5657 78562 29196 2193
20690 2193 11834 36013 39042 32320 -16098 24726 48422 20540 34134 37991 11997 4899 40122
20677 40122 16847 -23355 -7330 13877 29966 -9644 -73052 -40415 -75466 -67150 -62265 -25326
20665 -25326 6930 27923 7056 -40443 -62946 -49264 24129 58587 84746 123418 71306 60408
20653 60408 38158 -11364 -13976 54793 43690 25440 125 -101645 -124396 -60103 -22453 9115
20641 9115 24405 18844 30773 37010 31701 76169 54806 -5931 -49911 -31874 85980 115200
20629 115200 69070 69656 88667 97875 114619 86013 59781 123251 103897 102692 54297 -233
20617 -233 38065 -13022 -66566 -21294 -4429 15568 17045 32057 42036 81597 105072 84754
20605 84754 109571 91977 68675 43082 -53516 -91465 -7809 68993 121955 91415 27587 -46708
20593 -46708 6464 72065 120210 119201 111460 129171 105498 137148 119647 45951 -9157 16632
20581 16632 82334 77458 70146 70669 65865 51147 51262 49192 -8765 -45620 -31668 -50358 -11774
20568 -11774 21251 765 -45669 -34239 -45697 -56214 -16088 32913 78899 42987 34161 55298
20556 55298 23639 -3624 -24293 29127 101036 155880 120048 112410 115178 110217 101087 39312
20544 39312 37805 43956 63947 68613 113637 77790 27030 38175 -59100 -101335 -62372 46182
20532 46182 24590 -76611 -58103 -11610 23024 22935 -5265 29413 25430 3709 -2631 -35069
20520 -35069 -38680 11183 49457 14544 4237 -11253 53877 101305 149631 144010 184703 191337
20508 191337 150946 110693 54825 29850 23626 51336 13101 19542 77082 128599 148677 166876
20496 166876 93370 26764 28168 -2714 28372 24817 -50890 -69437 10030 62978 32843 58137
20484 58137 62258 41781 45296 76421 94104 97654 106202 145820 116659 52685 34443 18857
20472 18857 -24538 -64019 -112273 -90304 -15378 50803 78268 77815 29220 -7507 -33214 -2958
20460 -2958 54334 54247 24378 -18558 35417 44009 2469 -25162 -53029 -13208 35055 58800 102122
20447 102122 79244 40389 -8045 -76641 -67469 -57947 -56985 -7080 33437 -9477 -27698 13534
20435 13534 31724 30024 53082 137646 123940 78148 56534 58360 48102 64729 131879 91522
20423 91522 64284 83241 115686 87196 80352 71960 44987 5155 13768 35938 57887 70454
20411 70454 74570 103197 109188 116537 60287 2311 -6871 7311 46013 50969 45440 90547 122770
20398 122770 42995 41479 85670 145750 161698 209648 200333 172423 129328 132182 64590 -28255
20386 -28255 -33772 7688 125572 166947 136290 113048 108741 45677 30344 19524 12717 46604
20374 46604 -6406 -29645 46621 59715 29529 13229 34320 83924 83330 77468 30157 -41532
20362 -41532 -30024 -23395 -8383 -8003 21047 61353 26749 67158 90778 82251 23162 -30363
20350 -30363 -26080 -14837 17217 23084 95334 110992 81994 64581 36006 10621 -2885 60866
20338 60866 51639 4486 -3344 -130 12879 16901 60823 69473 79022 126034 160619 124097 134510
20325 134510 104103 82329 62493 41973 29253 31009 5034 9835 -22470 4 -9383 23656
20313 23656 45544 78748 70799 36100 57010 88584 80019 60123 33792 36368 45786 46744 25190
20300 25190 12271 55892 22574 28967 54327 73746 98896 102855 116578 57448 37919 13562
20288 13562 -12578 18403 73904 162446 155453 53427 43765 17402 -14228 -54663 -62286 -59243
20276 -59243 -57948 -77240 -42118 36686 23410 -7019 81513 122893 156937 142703 36582 30586
20264 30586 81108 40711 10083 26920 18627 119139 130876 136344 171254 150089 128576 105627
20252 105627 117929 172697 216642 223699 160845 155631 100451 88364 94463 33387 14924 48990
20240 48990 39085 81449 93598 48127 58508 69272 31928 -9729 16979 55239 38375 26523
20228 26523 55215 96574 96928 95105 87339 40869 3261 20218 76735 79060 30303 52710 108082
20215 108082 123861 99174 100245 93308 126804 165631 123060 168525 179386 101064 27896 -33815
20203 -33815 4923 9515 46785 39479 22915 54543 37124 54435 118156 137370 85529 68215
20191 68215 70753 88257 36118 5138 -56067 6953 49298 -41689 -27591 88507 67062 12240
20179 12240 55969 102465 54519 35422 84857 135194 191158 164872 133551 140947 34081 -28721
20167 -28721 -49960 43688 85022 41679 41128 56991 33107 12076 21715 17544 13518 6965 -22273
20154 -22273 -52072 -35872 -19479 22522 70010 69305 76309 114014 127603 96038 101376 115545
20142 115545 104679 26692 -7870 13780 58802 72438 109722 125128 99325 82411 50198
20131 50198 23616 44521 28911 -25047 15065 79788 59065 32808 47677 13623 -20741 10309
20119 10309 71388 59288 65589 75049 65938 73857 55334 44851 60206 53345 52725 80224 26283
20106 26283 23091 24641 45396 58877 114642 94293 125918 94238 113184 109651 104174 146432
20094 146432 194843 200688 169305 183604 223248 226328 205402 193064 178965 138605 130871 177253
20082 177253 167451 109475 92618 78411 105912 152783 184892 126892 86054 93427 94518 100654
20070 100654 128118 95857 75447 83122 21333 -26007 -32773 63889 98936 4096 -4181 66272
20058 66272 100690 71369 63080 46117 94960 99138 91457 147962 138740 96584 72709 23649
20046 23649 -19902 19859 33254 34451 -9089 36774 73427 107454 154198 119757 107448 64754
20034 64754 72883 118050 156031 126696 127121 109609 103670 64839 61334 11573 26070 59447 105462
20021 105462 105469 123692 111906 5008 -43709 -19463 64975 132453 168921 131656 174110 196382
20009 196382 164937 92623 37489 49216 50715 135227 217154 246978 221362 211503 169705 83704
19997 83704 59994 100490 142608 169597 208432 164659 172126 169286 113200 156016 171162 130228
19985 130228 116898 107054 82534 93179 147447 130090 95791 140887 133392 111218 102728 155544
19973 155544 226838 365372 437689 425593 443534 467380 539493 652614 817194 875882 734150
19962 734150 607583 496003 431386 517434 562608 511257 608548 774877 866437 857299 796992
19951 796992 852117 990969 993313 931590 773911 652998 532387 511283 552991 619360 656406
19940 656406 675335 623233 459695 341842 332785 321874 272492 309939 291605 305507 284361
19929 284361 257370 181487 171650 197597 205370 232371 218734 161773 165345 235349 293891 368625
19917 368625 436940 441246 410150 391320 352036 361736 436069 514812 561770 658557 837928 1004542
19905 1004542 984635 840791 769929 834311 909590 1064839 1138383 1005943 805019 699205
19895 699205 685170 683569 682357 814019 942650 939727 769600 596210 548325 446165 374651
19884 374651 363968 423019 400064 431896 383110 306993 202819 178272 186118 215088 213769 202486
19872 202486 201018 167467 130359 106750 162103 132364 85210 86309 136337 217090 219160 200367
19860 200367 225381 218065 197411 112810 147286 114743 86748 106036 127039 98992 102953 82240
19848 82240 54501 50991 30748 10740 8994 113020 96342 37381 88388 171508 177069 151801
19836 151801 60053 29459 -22297 -46772 18230 12755 28425 87804 45748 120753 63446 54525
19824 54525 107356 148267 160044 144194 122375 153458 124071 133873 163973 166181 156239 145470
19812 145470 103681 118688 162960 199025 209031 174693 122119 81783 147492 226186 211374
19801 211374 204682 258162 255849 268620 298300 310247 223807 202359 134358 66647 104489 165311
19789 165311 157087 214332 218173 146981 201740 248777 223886 195177 168479 153294 148673 230299
19777 230299 302909 275429 223452 236039 208683 129664 84799 150474 145438 111606 132338 151003
19765 151003 152271 135387 100851 166199 191056 191841 167102 150767 171573 159024 135558 124203
19753 124203 190007 255719 255101 235055 258160 216951 188918 181885 128835 118663 94562 112128
19741 112128 106661 148641 147502 71918 60080 134435 202007 217061 202592 252190 262804 244821
19729 244821 251451 256286 175318 144821 204406 186726 181840 188867 212634 226061 185629 130190
19717 130190 100432 151377 165681 181151 185656 177729 206652 225661 266581 209248 203935 217334
19705 217334 213969 236687 219250 242491 239952 258624 318349 365677 307592 205401 151625 241805
19693 241805 390532 486790 530332 510969 406185 363697 309220 274977 299676 387763 357257
19682 357257 295583 224925 157418 192348 329901 437148 451975 463729 396350 361878 304877
19671 304877 304794 250631 232423 279028 219089 183158 199555 233260 254718 235641 187052 205934
19659 205934 232395 243553 265690 246044 213464 183463 108524 148605 191895 190988 213664 260481
19647 260481 249812 212984 245572 236952 245391 258493 188428 110823 93324 104957 118510 186508
19635 186508 229281 287965 272287 266788 245902 186697 61811 -12931 -75880 -48598 61296
19624 61296 262151 398635 405153 356104 328283 262025 210856 243171 322794 311837 313912 401054
19612 401054 381114 364506 397268 441557 325082 260370 289628 306107 352380 380043 405452
19601 405452 482624 513922 452695 400710 383052 357030 358224 406478 471899 434668 396779 339205
19589 339205 332357 320173 269645 287276 343699 384313 359856 286952 417911 508549 529067
19578 529067 449557 373570 355841 281177 160030 125389 113596 157456 257825 365370 520216
19567 520216 654159 730987 728764 707766 606156 534321 461913 462934 499676 473895 481673 507238
19555 507238 514433 549547 534515 498926 536344 593619 576511 636579 616584 598969 577074 564154
19543 564154 581592 600841 650219 623918 624657 580658 615149 639791 649408 635052 579494 550689
19531 550689 565980 615694 657782 647489 638511 690245 726682 735421 787293 809405 779828 778623
19519 778623 815142 883249 920575 913263 906702 881042 861357 912317 996964 994576 1025512 1055259
19507 1055259 1026035 958947 882338 816403 821652 879447 879898 926482 1011990 1081143 1093647 1120098
19495 1120098 1181696 1254044 1275036 1262061 1318139 1374402 1385388 1435977 1469942 1508016 1568014
19484 1568014 1683073 1760559 1841330 1945106 2007353 2052427 2069994 2213068 2348430 2536051
19474 2536051 2763589 3102246 3461098 4022751 4806938 5483098 6004752 6386312 6523677
19465 6523677 6512559 6541398 6728412 7339776 8466088 10474761 14185991 20719826 30444731
19456 30444731 38312913 38836869 34056383 27386560 22058531 18872674 17303038 17043291
19448 17043291 17788781 19561053 22567067 27222318 34201840 45191985 63686253 96907928
19440 96907928 157873734 254081204 338781505 363581498 341966203 283826974 214348604
19433 214348604 153830302 109207091 81620402 66648039 59851184 59656117 67027796
19426 67027796 83934078 106714081 118384898 109562097 88490904 65309848 47414482
19419 47414482 35724383 28385112 23733813 20719729 18845932 17681652 17124773 16982356
19411 16982356 16980229 16823531 16605156 16211647 15589227 14988384 14565691 14487300 14856940 15691849
19401 15691849 17088080 19468727 23141235 28989749 38843206 55768657 81408748 106432011
19393 106432011 112918141 101439293 82236401 65430208 55877559 53463522 57647371
19386 57647371 69425565 92989571 136250309 201598071 276485101 354261157 404191600
19379 404191600 374638119 295397410 205481355 134952880 91602086 66535485 51575926
19372 51575926 42128988 35943428 31690861 28715744 26785066 25780892 25954500 27894560
19364 27894560 32685753 40815989 46960403 44780705 37041541 27801060 20330967 15493448
19356 15493448 12423879 10430733 9171151 8458758 8103322 7920038 7729423 7339003 6685838
19347 6685838 5907767 5080981 4512523 4112524 3727484 3358674 3015270 2668298 2436918
19338 2436918 2250973 2033247 1858443 1767794 1691088 1636292 1614089 1583770 1545458 1485436 1315604
19327 1315604 1282108 1303745 1236879 1134795 1010596 901192 840219 859362 856604 885557 882603
19316 882603 891000 978745 1148652 1246079 1258402 1124316 913464 725051 558616 416801
19306 416801 372028 327916 309115 309557 285190 282921 320713 361506 334753 296777 227802 184266
19294 184266 219610 229687 250938 239386 216388 176564 210358 282515 358956 329891 258424
19283 258424 209066 174525 181141 131221 87531 132324 142569 149112 151920 162961 154142 119156
19271 119156 77156 156055 214800 179694 80485 18610 35518 64249 108268 90426 81592 91286
19259 91286 91633 60304 61141 114636 144728 58320 26462 17982 -8959 -19201 34969 142819
19247 142819 192687 217702 171936 154093 154951 160265 224921 203184 163219 154659 173378 201096
19235 201096 247205 274881 261211 225714 200683 171772 164713 207597 204839 224879 178411 175243
19223 175243 126916 98797 36868 -2616 -13469 -24771 11559 55189 77269 36669 57079
19212 57079 73301 70925 60647 101048 76037 8398 -8484 -21258 -57568 -32679 43445 67663
19200 67663 20252 -84493 -65621 -21207 -26028 -4103 27177 101074 199750 323689 428008
19189 428008 452884 411185 320546 228503 208567 266956 256824 201028 223074 250984 270384
19178 270384 232492 187210 179505 177731 141847 135173 110383 139080 173880 150079 181106 221282
19166 221282 258238 205278 162382 157302 66088 80871 170557 174476 141399 91047 81731 92487
19154 92487 111463 137531 141591 180209 189866 162101 153013 69205 163092 283408 275969 255630
19142 255630 198194 144689 128091 119455 129466 118854 113613 130272 124344 112326 114729 9120
19130 9120 -70188 -22036 4105 48651 74720 105358 135081 113713 176160 190696 206086 145870
19118 145870 95187 83163 114927 148571 140908 80495 16261 13212 38403 55954 112930 85076
19106 85076 73459 73377 86370 108395 71468 86283 96775 64498 51261 81408 83149 138681
19094 138681 132121 150633 192504 222452 222912 167954 141339 104431 81778 117610 46247 70731
19082 70731 144796 209805 143391 85579 111204 117085 58006 3750 31263 58690 104991 83845
19070 83845 64394 62356 29982 51489 103529 53831 44522 68187 48622 -29328 -20847 -2527
19058 -2527 36456 25733 -15717 -3079 -28992 -55242 -17068 30607 106219 152074 192953 163486
19046 163486 135951 81648 82507 104507 97536 120609 101575 90760 160687 155153 141621 86153
19034 86153 -11821 -1039 65262 128498 129049 131978 125715 79883 53964 -608 208 105258 165628
19021 165628 186655 239675 277005 255556 165589 100384 126354 77125 67187 54282 43655 57134
19009 57134 25520 55701 72638 111864 125674 89036 67146 81864 21451 34838 87043 120736
18997 120736 113610 117157 161086 152341 122457 131018 158855 155972 159748 158534 207143 141282 120330
18984 120330 112416 60655 41661 81977 137438 108879 46417 -2383 -26024 54252 143000 175659
18972 175659 90493 44224 93795 87468 101147 134744 122390 138006 95545 77964 57411 79392
18960 79392 111329 75838 69282 10303 35674 124110 163437 175890 175420 197914 229692 224098
18948 224098 311433 463685 501726 525191 535391 529232 493612 428053 421321 342439 322291 478135
18936 478135 658760 762767 763151 711188 594571 565859 510935 505716 548335 593686 586307 535054
18924 535054 495407 603130 783576 1007366 1045047 967746 823754 725785 811373 865593 1032539
18913 1032539 1129512 1090189 981715 919463 877219 842474 933436 1185271 1294162 1231382 1123361
18902 1123361 1028673 1010611 1046447 995588 899636 779752 803527 943774 1051970 1182567
18892 1182567 1340295 1399631 1364884 1371419 1358448 1198655 1063724 906543 827821 831903 871161
18881 871161 925190 967762 923354 811348 690959 645008 645224 667730 662788 702609 811717
18870 811717 950503 981997 908150 833896 742250 781436 946997 1082152 1206529 1214547 1127333
18859 1127333 1034015 905279 780094 821952 869075 792115 762967 758304 738636 743815 880196
18848 880196 1098071 1252521 1309178 1369196 1341250 1273682 1199544 1087725 903069 802784
18838 802784 703215 656042 633912 696404 751999 721698 565586 454495 442511 382009 367447
18827 367447 387569 369854 340089 255754 173978 182494 244613 340218 310308 255551 274375 266408
18815 266408 251600 148830 56471 114209 210799 206076 145772 190539 186580 174018 153641 179762
18803 179762 175717 173845 155717 193075 233164 202353 214372 214899 214959 245370 261197 222612 217315
18790 217315 188487 199650 201550 179581 167378 171358 175009 211560 227962 259084 235738 241331
18778 241331 204095 123156 76132 99371 99841 107275 128323 123990 125881 154810 222434 236545
18766 236545 261600 376819 600558 731052 689427 580144 451254 287281 264122 142574
18756 142574 116021 201126 200961 201170 274937 195664 163232 162304 231335 232178 248312 278992 255761
18743 255761 221362 219441 154766 174552 281810 280664 261857 283071 258532 244669 281665 246932
18731 246932 267361 302780 269866 218341 204082 174726 220075 267787 258842 227627 167120 138002
18719 138002 171902 196286 219632 287678 323291 336210 281970 250940 204854 203478 206256 182395
18707 182395 234827 256542 209314 207331 238924 221479 225856 238088 251271 232312 301881 365658
18695 365658 398909 308304 363804 313847 292708 296015 270871 288259 366649 366787 296013 316966
18683 316966 346102 312807 276053 280541 263554 276226 321486 300322 306476 318145 325648 322626
18671 322626 365884 386514 366432 337125 382584 372079 406713 492868 589694 628248 583842
18660 583842 505852 384963 377831 411539 409997 437457 458401 428984 437150 388426 321092 268503
18648 268503 269329 329238 330133 343851 361881 400956 386656 411327 417176 398350 449800 413386
18636 413386 357866 360700 429849 497576 516027 485775 435458 384961 408949 495286 470133 464419
18624 464419 481417 466442 416760 431061 537335 706641 835247 945283 1115669 1106244 1034971
18613 1034971 988591 938741 851198 725742 618938 576720 633210 609354 573942 609017 642945
18602 642945 619104 589466 545025 508602 479770 447827 437320 451002 451354 482191 492056 485222
18590 485222 463309 484760 469893 452465 426208 413930 403795 351719 282072 292376 294248 327466
18578 327466 380849 488380 549977 602228 605465 654673 703870 721365 870476 982953 946554
18567 946554 869395 805591 777641 737522 741158 758868 815249 769090 635478 581939 579612 567710
18555 567710 554118 561297 609693 597588 524119 451410 447182 493122 577795 633781 646056 645774
18543 645774 603341 537229 516759 443599 472525 469618 436645 474112 517949 550477 517615 484163
18531 484163 484732 501634 528158 523317 566416 567003 533291 520981 502850 562517 641375 684963
18519 684963 712373 767137 832209 871328 886229 832875 791904 793469 822509 857682 832225 745065
18507 745065 788118 824708 832597 817454 774372 772519 780972 772901 784754 830115 879100 940368
18495 940368 949189 964981 916811 956139 990836 1020007 1070395 1026247 1028735 1054073 1099388 1130181
18483 1130181 1160655 1266634 1257477 1240725 1305684 1328881 1354887 1364513 1432460 1555958 1660544
18472 1660544 1789354 1961489 2172052 2348045 2476007 2617225 2681486 2694116 2733269 2722147
18462 2722147 2750624 2854138 2932749 3045321 3258373 3527242 3897259 4479681 5361830 6765562
18452 6765562 9294969 13199506 16940000 17999722 16674026 14397136 12742211 12356963
18444 12356963 13257819 15614222 20101298 28280536 42380627 60748936 74171323 81472118
18436 81472118 87251471 94113928 100237934 98054008 91007994 80421181 66121672 51967646
18428 51967646 40149022 32381541 28890021 29229915 33602549 41814440 49027245 48676839
18420 48676839 41928188 32821169 24979566 19880822 16947237 15186061 14045269 13212598
18412 13212598 12686748 12370774 12407487 12937828 14229155 16772188 20928827 25429250 27443110
18403 27443110 26847281 25240535 24530247 26152745 30975851 39970678 52272165 61831507
18395 61831507 65468483 67419072 74461773 93762182 126207355 161177268 192295713
18388 192295713 211534620 214500998 209892424 207011776 202675264 188691702 171527511
18381 171527511 157233349 153244702 154021203 149906770 138515028 117408311 92903252
18374 92903252 71002260 54939194 45143985 40309502 39621944 41744514 42584926 39669924
18366 39669924 34576606 28994541 24310085 20891288 18733340 17496118 16909339 16607868
18358 16607868 16468135 16443060 16581503 16986148 17961963 19688308 22491884 27098470 35170143
18349 35170143 48387176 64841794 74715188 72866143 64118010 55157917 51713778 56574709
18341 56574709 70635650 89461449 106889830 128464823 156409982 178933272 188362640
18334 188362640 186931692 172520090 143328416 109253915 78471169 56034415 41670922
18327 41670922 32807059 27168324 23601157 21551121 20918004 22043814 25421963 29693749
18319 29693749 30506645 27049966 21597676 16467292 12878454 10533017 8894907 7757580
18311 7757580 6974618 6483065 6105756 5773589 5496499 5332710 5160088 4881142 4590545
18302 4590545 4418732 4141514 3673620 3279177 2837631 2458031 2293394 2195273 2078470 2027860
18292 2027860 2016216 2108926 2091675 2010178 1968290 1849962 1723220 1568484 1411999 1327938
18282 1327938 1241700 1222210 1203269 1133732 1054368 1063963 1089853 1083545 1068992 1117463 1155653 1233255
18270 1233255 1321649 1353606 1372722 1477858 1591892 1581293 1447852 1291635 1136916 1047024
18260 1047024 1020924 1034048 1096596 1112442 1139446 1215704 1182373 1130705 1111997 1209313 1321778
18249 1321778 1389007 1405026 1324984 1247068 1187249 1200387 1293237 1317224 1282452 1190508 1123204
18238 1123204 1057968 973850 875814 826476 791912 746272 821955 882344 868251 836324 866694
18227 866694 879500 808967 765078 779341 778493 820909 888345 948659 1047255 1082978 1007434 918129
18215 918129 910702 929065 937190 903745 963762 1124270 1276720 1439658 1469958 1369627 1272796
18204 1272796 1233545 1217888 1188463 1228405 1313391 1483615 1610217 1636042 1611069 1609541 1628178
18193 1628178 1724381 1885381 1968192 1915875 1780664 1657606 1576341 1571931 1616594 1692242 1733967
18182 1733967 1831824 1990454 2191015 2292863 2292611 2231405 2207795 2174447 2164252 2305929 2519298
18171 2519298 2635684 2718459 2773326 2850329 2954732 3159032 3443318 3931683 4503894 5244611
18161 5244611 6215698 7545960 9274225 11695576 15447583 21965781 32874855 45799711
18153 45799711 52272330 50818143 45909799 42963572 46748949 60380316 83315293 101417070
18145 101417070 100095678 85018351 66375190 53362068 49648321 54893392 63672849
18138 63672849 64630114 56090688 43329334 31584209 23646002 18877309 15767659 13518156
18130 13518156 11828240 10670950 9828252 9111766 8626684 8378683 8339694 8522294 8921365
18121 8921365 9461804 9957951 10357886 10846283 11646500 12891240 14912757 18204075 23700609
18112 23700609 32820795 45212248 55571143 61625791 69468419 89392970 129483145
18105 129483145 165411001 171544512 162116622 149711828 146070827 149614533 153557706 151038047
18097 151038047 141994315 125000205 101307302 77504916 58210496 45538976 38912469
18090 38912469 37240137 39939184 44783333 45823792 40960905 33114302 25367420 19722320
18082 19722320 16017404 13618209 12088012 11101535 10348140 9677722 9139641 8777741 8422457
18073 8422457 8048432 7602480 7195569 6982217 6903822 6999981 7432142 8331093 9737396 11592946
18063 11592946 14200976 18290167 24854418 31984993 34394053 32336051 28638707 26574957
18055 26574957 28744709 36735372 49237134 56464152 52814759 43045729 32751409 26522281
18047 26522281 25320086 28409438 31755455 30367474 25205600 18850421 13552253 10031546
18039 10031546 7822585 6391829 5421115 4728179 4344930 4011728 3674246 3387168 3116938
18030 3116938 2946469 2827441 2810204 2813531 2706815 2512714 2268642 2067835 1967629 1901333
18020 1901333 1907880 1844341 1776274 1746314 1675197 1562813 1486103 1486093 1588745 1701430 1824275
18009 1824275 1923789 2068789 2198666 2358419 2632845 2908460 3249986 3604723 3958722 4368860
17999 4368860 4753510 5156755 5575085 5856912 5996083 6048921 6174661 6190596 6097028 5905359
17989 5905359 5641701 5353298 4989100 4549112 4039472 3546520 3103348 2796852 2546065
17980 2546065 2336746 2131495 2027868 1909486 1832037 1820093 1743215 1686554 1593055 1527797
17970 1527797 1448200 1392751 1331258 1298697 1331949 1473465 1654787 1811964 1894575 1947958 2106165
17959 2106165 2252656 2428540 2600042 2805629 2965697 3105662 3245570 3294744 3277868 3369298
17949 3369298 3526854 3648257 3706668 3648123 3614128 3594279 3604015 3650443 3587823 3356440 3230344
17938 3230344 3205588 3098206 2884550 2605601 2349457 2114953 1931516 1715577 1574520 1590758
17928 1590758 1643270 1715179 1785375 1858136 1887982 1948306 1998234 2026303 2008253 2043539 2082456
17917 2082456 2134953 2184813 2284727 2481645 2645328 2797427 2949975 3088465 3310291 3498891
17907 3498891 3736177 3959110 4284786 4740823 5316453 5944410 6544667 7035185 7447105
17898 7447105 7864126 8514325 9399252 10665523 12278797 14614768 18527004 25269357 34953055
17889 34953055 44312813 49927483 50528500 47458567 44535104 45012735 51718789 67200268
17881 67200268 93195180 129321328 171231401 197779892 192626551 167370972 140750248
17874 140750248 129569438 143789301 185817887 238242988 266672155 262949714 239707279
17867 239707279 209543490 176175024 140861109 108042821 82159084 65066546 55625782
17860 55625782 52176082 54176511 61164763 69505441 71885753 65659792 54481035 43217863
17852 43217863 34894526 29528106 26058383 23746738 22126511 20916612 20074094 19444535
17844 19444535 19185152 19431003 20180837 21494067 23834310 28271609 36275122 49018445
17836 49018445 63038650 71935072 75557624 79674032 89872864 103352496 110409212 106782200
17828 106782200 97736623 92754394 101349220 129186387 166138044 186957839 187912944 178627080
17820 178627080 168092348 163595236 167747373 178918161 180404438 161358318 131402688
17813 131402688 101248012 76869264 58872858 45779560 36379760 29817263 25263539
17806 25263539 22145323 19998596 18545509 17759093 17882555 19243360 21495139 22837337
17798 22837337 21645632 18487356 14940667 12178619 10376863 9133069 8149461 7239629
17790 7239629 6426789 5777174 5415694 5213334 5051415 4938510 4890898 4883145 4799206 4633533
17780 4633533 4545174 4497629 4432208 4377081 4277660 4231363 4261678 4359110 4493495 4640124 4828576
17769 4828576 5088830 5519374 6128396 7013416 8129295 9263057 10352292 11709870 13924681
17760 13924681 18079190 25575232 35324893 41080268 39486602 33269103 26227420 21238774
17752 21238774 18734885 18238284 19173240 21336282 24539751 28942611 35085779 44035298
17744 44035298 58114229 82341519 127076077 205986441 307765675 376036634 385238683
17737 385238683 345040699 275205975 203698239 145942349 106302726 82631831 70204223
17730 70204223 65822083 68263230 78257262 96532221 115758443 120335486 106691185 83804231
17722 83804231 61563637 45439682 35199652 28696122 24448632 21728818 20040544 19009955
17714 19009955 18071147 17124775 16194336 15240118 14434043 13894712 13577771 13663762 13987849
17705 13987849 14378299 14929706 15764698 17138066 19516564 23320818 29586065 40405751
17697 40405751 58785797 83731848 102894030 104517641 92133431 75260905 62237159
17690 62237159 56082015 56349628 62753315 77331430 105641573 153232749 216546985 286068121
17682 286068121 350206304 369328926 323725652 245688698 168177065 112240023 78648448
17675 78648448 59317891 47862017 40617901 35792433 32109326 28858102 26111685 24236652
17667 24236652 23717385 25427108 30358207 37409826 40960686 37924919 30922595 23529689
17659 23529689 18166861 14861956 12807386 11273859 9771518 8312699 7060259 6109732
17651 6109732 5398038 4844609 4436573 4194887 3987931 3740527 3537154 3367572 3171081
17642 3171081 2953143 2712146 2483122 2280458 2173840 2113709 2051383 1990382 1963398 1887510
17632 1887510 1775780 1655231 1510640 1427206 1358749 1351121 1347843 1267402 1229708 1120418 970041
17621 970041 862672 815088 787660 729395 624388 651068 643866 658567 607676 552678 437796
17610 437796 367570 383364 342760 298562 281744 290444 370668 379064 354855 328924 329043 297328
17598 297328 312128 401688 541269 661019 722382 644861 617990 696504 774144 937245 1090946
17587 1090946 1145574 1035641 877358 716491 667268 609632 577509 566358 527368 418951
17577 418951 370799 332351 225841 192585 168361 111746 45530 68259 83353 117861 185573
17566 185573 188908 177697 130971 103122 134123 110908 38041 -12656 3723 50136 64551 28276
17554 28276 -849 -35038 -37637 49368 193630 326245 391335 406300 389120 351882 287256
17543 287256 289685 310001 361208 401688 439739 398083 361949 368886 356558 419214 434221 383588
17531 383588 303274 206952 152441 122099 145082 104854 84676 104411 163200 154303 92373 25252
17519 25252 8532 -39082 -36711 -46095 -23018 -44593 -48470 -7743 -2596 -51790 -47740 -57049 -51444
17506 -51444 -35677 15272 -3928 -24363 28556 63121 -25326 -28796 -44054 -57806 -63203 -9575
17494 -9575 62425 128752 263056 319981 386860 377371 243601 188922 188599 135446 101899 42429
17482 42429 2848 84056 120761 141840 97977 58071 39906 8169 28382 43273 -38659 -42757
17470 -42757 25170 57678 9989 33863 75151 41647 54147 54655 89728 103646 138852 104034
17458 104034 82503 102205 79378 111626 124848 75007 42285 62350 73669 64849 50166 16563
17446 16563 59879 101612 110830 173141 227560 228136 382871 551182 538673 402221 192638
17435 192638 61919 17775 18331 -18791 -24171 -11417 68245 114348 91585 62839 50785 32066
17423 32066 33554 25278 21011 13055 12506 -25455 -58416 14045 35640 14635 18498 60181 85986
17410 85986 77841 77448 76165 44010 -7150 -42583 -37407 -20987 -12066 -59272 -55271 -87891 -41323
17397 -41323 -64680 -79513 -3621 29208 20778 53241 37542 4626 71696 22561 47339 69727
17385 69727 60718 54155 47120 30959 55218 73469 105644 106973 104695 166832 237821 347375
17373 347375 457414 505008 543035 593025 637269 645946 672999 659082 546498 496140 463979
17362 463979 525403 620783 702064 730802 832466 882566 927408 910009 797420 732165 714089
17351 714089 721495 762509 695680 601674 481870 315424 204148 221026 218982 157896 129742
17340 129742 100968 70414 84066 32742 48729 68968 72534 42830 30815 80952 69550 75321
17328 75321 49681 39262 123134 199583 243493 350581 524832 574101 567699 626121 699642
17317 699642 781864 716822 616789 577078 572364 604301 655760 654934 622964 481974 336163
17306 336163 307289 353645 478926 516968 485484 494725 454283 369051 364274 364065 423769 496479
17294 496479 481365 498070 480803 412486 382426 310193 208304 145349 60750 71130 76787
17283 76787 40183 46940 45888 9025 7557 19898 -25064 -47273 14362 -9397 -28747 -32609
17271 -32609 -28238 -78457 -39505 12476 -4919 -66596 -44073 -21020 -14912 -64993 -34275 12272
17259 12272 18095 -16869 -11687 4821 -13227 -57541 -83624 -91805 -7428 57288 60707 101770
17247 101770 26514 -63251 -57990 8631 10370 -65504 -32640 -67157 -118060 -64283 -41826 37966
17235 37966 105279 58553 94101 86568 138143 170264 199659 270179 354875 457460 579958
17224 579958 685055 682923 637117 584196 601594 702704 783255 768888 632318 550470 480483
17213 480483 530331 638425 678458 700612 756178 805131 765269 630035 457007 298873 250018
17202 250018 191480 158367 147035 162138 170968 240153 317043 347126 308860 209635 174679 111559
17190 111559 66067 -8744 -31231 7072 65561 107498 143331 83634 18422 3228 -9911
17179 -9911 10114 2627 65529 181407 261107 359023 491435 574729 532829 499146 473820 565470
17167 565470 736034 864308 917957 861864 810204 647089 405350 275938 203850 207121 233186
17156 233186 340722 384152 368653 421161 462680 592404 735924 794570 778808 720123 642180
17145 642180 578389 475287 290806 157742 47623 -18895 -36447 -38236 -48726 2452 -25140
17134 -25140 46325 48909 24753 15487 -11326 3992 -8829 -90804 -96821 -67054 -42319 31461
17122 31461 80762 23813 -40254 -46976 -61985 -77372 -91658 -64955 -53642 -40078 -49577 -72546
17110 -72546 -48499 -50255 -43978 -11753 -14796 -24435 -6762 -23236 -28894 -59652 -51363 -34355 -33113
17097 -33113 -12560 -34678 -54561 -39547 5997 12631 12601 14479 53556 126965 83191 10166 -15744
17084 -15744 -85924 -106712 -156304 -89506 -38199 -60957 -87045 -130533 -169744 -175128 -182222 -148864
17072 -148864 -156803 -157822 -137366 -117968 -37779 -81134 -43985 10163 19507 34964 28189 26031
17060 26031 8066 -12549 -36771 -80169 -93070 -19026 -18326 -52793 -49217 -50807 -73173 -66909 -62485
17047 -62485 -79411 -120970 -70895 11310 -21551 -54910 -123925 -136742 -112973 -87179 -101225 -61756
17035 -61756 1028 -24394 -121566 -161682 -184093 -178901 -179551 -129644 -97430 -113338 -126302 -187178
17023 -187178 -128968 -52706 -38476 -53820 -70251 -82630 -72567 -50927 -33155 -28395 -76391 -94393
17011 -94393 -130290 -137010 -131414 -108935 -92390 -139554 -142948 -66147 -43449 -64810 -84627 -115365
16999 -115365 -140616 -109916 -98851 -54028 -38984 -36254 -81026 -108965 -130459 -65751 -38194 -77867
16987 -77867 -120999 -94287 -29130 56221 65302 13008 -40367 -25516 -1700 316 25527 29325
16975 29325 2935 22059 14881 -61377 -55777 -54359 -66573 -40320 -40276 -33723 -44935 -100178 -142401
16962 -142401 -100026 -21120 34742 -3799 -61297 -103339 -59700 -22377 -35777 -15172 16648
16951 16648 -69749 -102892 -110637 -12093 -32900 -57168 -139455 -179613 -143891 -104822 -66203 -42095
16939 -42095 -64149 -116694 -121150 -64686 -37578 -11112 -26330 1487 47782 44151 38793 16986
16927 16986 26078 -6024 -976 -45262 -127179 -134342 -93921 -94826 -90082 -103987 -154141 -156020 -197652
16914 -197652 -157920 -75633 6860 8536 -76180 -116294 -97357 -57271 -55105 -57181 -69819 -81598
16902 -81598 -108108 -123014 -97104 -74161 -125235 -166419 -219532 -186341 -90051 26001 56735
16891 56735 -15740 -71661 -74328 -102406 -114680 -125433 -149883 -131176 -168851 -128840 -120000 -111496
16879 -111496 -85290 -64460 -20089 -25691 -89944 -84206 -47278 1038 16518 -38185 22601 77905
16867 77905 70526 -12539 -33012 -70711 -91858 -48932 -8438 36177 48692 41173 47451 5215
16855 5215 1101 -17222 -84324 -105845 -98322 -115003 -48056 -22191 -34890 -15363 -11152 17563
16843 17563 -9542 -9579 -12452 -11973 -1758 -76620 -92338 -70769 8541 50198 43195 40090 63212
16830 63212 57689 51541 -16934 -56716 -61084 -76770 -95584 -133183 -131821 -108553 -125716 -108071
16818 -108071 -107224 -64560 40293 57027 -19930 27113 -37028 -120573 -140801 -110179 -93540 -75167
16806 -75167 -17581 -7650 -51363 -92799 -112681 -57679 -63226 -90867 -142600 -132098 -66026 -45127
16794 -45127 -59455 -133917 -151059 -117771 -23577 24531 7671 47503 39385 -23159 -45466 -77856
16782 -77856 -123380 -113056 -147450 -163304 -99213 -90801 -117412 -59641 -46983 -30172 -37022 -2160
16770 -2160 -5313 -52331 -95655 -121281 -95322 -66830 -72483 -57108 -36618 -38020 -43682 -89325 -103213
16757 -103213 -88037 -11573 -58152 -24645 -20289 -20979 -84777 -82576 -56788 -67153 -74735 -39290
16745 -39290 2144 5746 831 25929 35214 41543 24381 -27032 -54413 -57179 -26458 -35108 -49794
16732 -49794 -65501 -60737 -1649 20683 59259 28464 -35586 -19542 -20790 -18823 -43932 16247
16720 16247 -5112 -64783 -107228 -161832 -185731 -139838 -99390 -70834 -35042 20522 25094 6084
16708 6084 711 -21269 -1722 60810 59447 54075 6524 995 13981 -36231 -104174 -95276 -97551
16695 -97551 -104657 -99266 -81167 -11497 2985 22409 38910 58064 44742 -13982 -30240 7993
16683 7993 18228 -34395 -104412 -54731 -10425 1725 57990 7932 -48450 -32656 23988 91548
16671 91548 53993 -27208 -62950 15360 18984 -6737 -38422 -79803 -101442 -207803 -259549 -213459
16659 -213459 -123844 -31779 -13597 1673 -41631 -100256 -154024 -169495 -179025 -171683 -135893 -93801
16647 -93801 -82144 -61689 -110543 -88064 -85542 -110964 -184634 -182765 -133597 -108507 -27345 -4226
16635 -4226 -61086 -88938 -125957 -104996 -110253 -75020 -87944 -120096 -117843 -102941 -72414 -6725
16623 -6725 -8292 -31196 805 840 -37193 -32705 -49933 -32141 -16948 -3302 -66 -41885 -45203
16610 -45203 -47013 -58228 -65036 -66598 -87874 -43851 27109 67253 49105 52219 43920 28728 21513
16597 21513 40424 35969 36762 2405 -126 25975 15481 23461 21767 37949 27121 -37729 -41844
16584 -41844 -6811 66364 26308 -51615 -38121 -66990 -88921 -103120 -78888 -86935 -119390 -130412
16572 -130412 -85586 -34274 -5597 13836 -48820 -129804 -115779 -6684 54836 19488 -16196
16561 -16196 -36116 -52544 -104364 -53170 -80078 -116383 -121627 -72918 -61690 -29529 -30553 -17747
16549 -17747 -17553 -31492 -29128 39634 29227 -17427 -46047 44437 -21794 -80434 -76089 -33054
16537 -33054 -9772 -20999 4796 -41688 -65973 -50930 -59258 -58609 -64511 -19969 -23612 -29126 -12745
16524 -12745 1760 45913 10763 -23551 -15662 -28894 -92432 -102026 -63574 -39040 -51944 -6166
16512 -6166 36894 -15233 -118139 -137184 -174824 -170461 -130035 -86975 -58446 -115617 -155428 -173723
16500 -173723 -115141 -68868 -72346 -42428 -61230 -92086 -13485 31064 -10077 -61012 -35319 12302
16488 12302 16463 11368 50315 68155 110601 125266 94024 48801 15029 -31244 -31944 -64069
16476 -64069 -56687 -24044 -37187 -24258 -4072 32993 14523 -12456 -43722 -64763 -53883 -13789
16464 -13789 9799 33287 5976 -3779 -4382 -24921 -70337 -42547 18226 53257 -41437 -81013
16452 -81013 -33904 -18022 -46981 -32905 -9275 -2771 -32956 -48081 -108626 -144230 -110127 -50346
16440 -50346 12834 93060 81996 -31053 -103046 -96713 -80675 -91861 -83322 -60004 -103176 -180116
16428 -180116 -174668 -129411 -158897 -90303 -64271 -76524 -89753 -51973 -18298 3638 -49750 -88836
16416 -88836 -87675 -88171 -105245 -124703 -56653 7947 4160 12453 -28030 -21487 -30769 -37527 3343
16403 3343 -78182 -71763 -21766 21329 -11269 -26773 -36842 -76020 -170854 -173287 -157951 -119393
16391 -119393 -37637 -20024 -80128 -98331 -100533 -106003 -76978 -48948 -74753 -86810 -12538 25439
16379 25439 118 -32338 -57811 -49648 -44580 -96476 -61942 -11224 6213 -2947 -4935 -31879
16367 -31879 -26513 552 12291 -43714 -113622 -86188 -51914 -23796 -366 -34560 -28425 6244
16355 6244 3816 -27756 -6852 7244 -6086 -22076 -1961 -17914 -8898 -8331 -4644 15251 40603
16342 40603 30537 -1948 -11420 -23664 -9506 -46711 -48202 -44732 -19624 14363 52039 19760
16330 19760 -51461 -6580 32911 -40709 -68625 -87120 -124961 -122019 -100955 -134524 -118025 -49372
16318 -49372 -5098 1153 -52530 -47862 -20327 -38207 -17064 -8102 -44327 -35444 -45151 -67451 -10551
16305 -10551 -85345 -142800 -43925 14015 44313 -1036 -27216 -33450 -48604 -25462 -11269 -67066
16293 -67066 -64697 -50054 -79389 -75042 -33215 -9503 -52721 -95904 -104679 -75044 -14534 -1957
16281 -1957 -16488 11802 -21080 -65879 -55548 -63000 -1463 -1852 -87953 -96512 -54064 -450 51597
16268 51597 -11295 -89162 -114656 -151048 -142997 -128027 -141538 -96748 -65208 -19088 -39406 -59033
16256 -59033 -65057 -38499 21128 59122 -9318 -47231 -78958 -60345 1445 -22680 -43955 38298
16244 38298 49961 63092 60027 66461 74611 27101 38311 54295 -17431 -50945 -41017 22843
16232 22843 31427 -22235 -40138 20029 46272 -440 -9428 -20941 -29574 9200 26916 -12315
16220 -12315 -90407 -112440 -95571 -55981 -74259 -127234 -116925 -94666 -60585 -72978 -52255 -12706
16208 -12706 -8889 -36983 -33039 19507 -26011 -51779 8347 43646 16194 -46111 -46273 -14296
16196 -14296 7175 -28543 -78278 -104867 -79033 -90784 -113773 -84052 -102731 -51169 47883 40776
16184 40776 17596 -17787 -63016 -57480 -16113 -2417 5753 8903 777 -74029 -53602 -63266 14006
16171 14006 116485 103357 64139 17777 -77074 -51467 -25929 -4179 -5514 28122 63543 52614
16159 52614 -3677 -86516 -125949 -93982 -71029 -52979 -22612 -51891 -60604 -39325 -71190 -78667
16147 -78667 -90619 -78717 -24832 -55755 -43507 40878 14906 36784 23571 29040 18411 -74858
16135 -74858 -70049 -46323 -31904 -72387 -74895 -3592 -16796 -79663 -91810 -48392 30339 -4932
16123 -4932 -33962 -33342 -36844 2141 34545 2090 -44034 -35765 -35675 -3800 -57733 -56513 -32525
16110 -32525 34673 63167 371 -34244 -59481 -83707 -56859 860 1382 -4475 44279 44853 -915
16097 -915 47656 119973 75237 -29804 -44496 -11134 44310 62105 50223 63997 93674 46405
16085 46405 -16018 -20720 19857 -14846 -61195 -49274 -120693 -143999 -127043 -74601 -19314 -5117
16073 -5117 -7816 -51893 -52867 -58658 -24469 -86408 -109359 -51739 52352 132363 114674 21254
16061 21254 -75677 -78421 -36675 47616 59327 14153 -33160 -116174 -149997 -112205 -83903 -107897
16049 -107897 -94754 -24859 9459 -17826 -29232 -42365 -44166 -22897 -10318 -10362 53616 54345 20144
16036 20144 -19643 -14842 33356 19863 -45817 -88404 -17066 22467 95074 167045 213044 206299
16024 206299 225336 148132 81622 91968 58726 18991 -53409 -77678 -31300 -42193 -70918
16013 -70918 -4037 54906 30277 -12551 -6072 6677 83141 121878 55624 -26104 -84478 -59124
16001 -59124 38383 68006 -445 -38552 -12989 24360 36878 1223 -18512 43566 47853 45987
15989 45987 71056 64915 39791 43087 17363 75450 79371 14836 3417 20142 9702 -14560
15977 -14560 1082 -41709 -33978 -3556 29803 49650 46834 20369 -77940 -123959 -81416 -4470
15965 -4470 15768 -2671 -28754 -40 23461 -18544 -62396 -39750 -17065 -52282 -63271 -52576
15953 -52576 -56507 -101709 -38614 56728 17571 -37816 -42891 -23722 -41287 -17603 -71071 -44371
15941 -44371 -25728 -29456 -96365 -132163 -116835 -41599 -20952 -48453 -55502 -22256 -39649 -29021
15929 -29021 -23357 -21981 -87341 -101956 -83088 -65356 -99499 -124423 -87687 -32995 15597 25905
15917 25905 55947 39513 21923 -17048 -64777 -47073 -29593 7913 13909 13435 40394 60050
15905 60050 114067 120229 101245 75036 -4625 -80402 -99198 -117866 -74824 -50995 -49140 -44790
15893 -44790 34108 31999 -54004 -51043 -9171 22061 87718 66190 83123 100953 138243 109442
15881 109442 120090 100610 31308 23261 27499 64027 58685 41203 63724 60030 23718 67108
15869 67108 37163 -3116 -78451 -89885 -79949 -61016 36775 63813 76400 71532 34771 -43457
15857 -43457 -98180 -65023 -58577 -84081 -85451 -67233 -60640 -78265 -50982 -20731 -82902 -66150
15845 -66150 -57047 -53969 -75942 -117516 -100664 -127070 -178633 -161308 -120173 -59455 16812 65402
15833 65402 32515 -32111 -38457 2456 19527 -9321 -57509 -47839 -52275 -72576 1036 8015
15821 8015 -11020 20764 38332 54863 102189 144304 135442 8866 -76685 -119656 -109302 -101180
15809 -101180 -81647 3779 67155 76966 29617 26077 21242 53523 6168 -55604 -127420 -158661
15797 -158661 -139572 -112658 -101014 -71555 -57382 -21784 -8716 -55263 -57434 -71551 -74313 -20862
15785 -20862 -29566 -74154 -68057 -19094 37864 79707 29301 -308 -48959 1072 -39758 -46989
15773 -46989 -40876 -41782 -33774 38266 32837 -43928 -87579 -73479 -47465 -17803 -29309 -58308 -154867
15760 -154867 -188126 -173103 -95048 -81082 -22509 4951 -19856 -45189 -8277 -5479 -61383 -40370
15748 -40370 -19029 -14032 -41289 -78241 -102010 -17322 38603 70288 59905 19460 13941 -4105
15736 -4105 -45120 -60246 -38089 31808 44340 -20728 -2764 12899 60095 56631 56480 151334
15724 151334 114760 -23073 -75932 -33301 12670 -27744 5493 42919 60264 63615 -1492
15713 -1492 -18184 5870 -17733 -34250 -56872 -69919 17393 39741 43640 111548 36513 -20260
15701 -20260 -31675 -32469 -43157 -30767 -23201 25691 -5482 23483 56919 85733 87073 85712 52607
15688 52607 43164 68914 116828 109239 69754 39650 -12566 -40628 4804 37535 70716 103160
15676 103160 64319 29000 -14917 -83375 -96593 -49655 -6834 4096 11580 15780 -28444 -55183
15664 -55183 -35629 -5929 37168 43699 44458 33328 -62206 -58009 -57364 -41139 -16346 -3328 -17314
15651 -17314 -68816 -156482 -161972 -177869 -146859 -164681 -135008 -41240 19963 46598 48012 47735
15639 47735 -50097 -115987 -154671 -89100 -27991 -17646 -14509 32609 80100 56547 23188 -22329
15627 -22329 -6539 -21824 -54686 -52178 -65926 -32770 -36067 -38777 26094 28804 8450 -12669
15615 -12669 24805 77113 105952 60693 66739 36705 -73698 -55008 -30558 -18702 18943 91409
15603 91409 92283 6733 -91345 -164700 -83044 13900 69003 98380 45186 30775 83104 52468
15591 52468 34414 7718 -44774 -10910 -62491 -102764 -23945 -7757 4418 46699 2887 -61046
15579 -61046 -98098 -41805 -16493 27761 -40745 -32690 30009 61125 56895 -17109 -32983 -21682
15567 -21682 -92918 -121736 -92806 -85860 -91302 -104510 -73256 -64140 -75482 -47869 -18454 -27071
15555 -27071 -68352 -38629 -31449 -19165 -28192 -74785 -76058 -40182 -46191 -86969 -92395 -77021 -74647
15542 -74647 -11996 12968 14291 -3869 -14442 22045 51928 89691 69200 47259 63377 13525
15530 13525 40729 5573 -34265 5097 -47921 -67808 -64386 -105477 -64378 -94373 -83419 -71551
15518 -71551 -73780 -40828 -60974 -77129 -65871 -27614 -58638 -23644 -9720 -6110 -59204 -73157
15506 -73157 -59265 -71363 -113190 -98242 -10678 62373 19396 -3530 17162 14963 64835 101582
15494 101582 75494 -23713 -82596 -78814 -19762 13097 19211 23106 -8580 -66220 -52794 -14320
15482 -14320 32424 29654 10715 -16442 -43592 -47347 -82731 -75481 -94681 -6052 -51402 -59347
15470 -59347 12968 7969 -53906 -38416 13752 67265 41141 -7348 -52192 -54408 -11699 -23165
15458 -23165 -40286 -37091 17720 -239 25712 31927 28618 5713 -40247 -39969 -80206 -44879 -57524
15445 -57524 -89205 -90122 -81155 -21076 14016 43317 -21527 -122350 -138842 -93778 -86695 -69093
15433 -69093 -57668 -15861 13546 -5881 -75014 -8898 79520 110471 50944 23118 -6623 45770
15421 45770 32881 -26371 -47748 -28606 -49904 -38072 -3459 -37704 -53905 -24677 -25656 -14371
15409 -14371 76773 69611 16753 -15127 21137 56610 51004 22630 37335 59350 -2391 -72730
15397 -72730 -76219 -60334 -84648 -122498 -133675 -157862 -117533 -118938 -145216 -131733 -115307 -117597
15385 -117597 -81822 -68190 -73720 -49280 -19201 46485 80701 85544 26879 -8222 -9820 -10825
15373 -10825 -43232 -18283 -19010 -102913 -119448 -101361 -60059 13043 49661 33665 -19431 -89644
15361 -89644 -107047 -43295 -55834 -14826 2380 -37379 -15076 31836 36980 49600 102409 99850
15349 99850 32486 46158 58701 28698 -6754 28511 24473 -28749 -45989 -9306 -38342 -65298
15337 -65298 -46521 -19205 -45320 -70551 -38151 -14711 -23150 -7228 4104 -45203 -77499 -59605
15325 -59605 -39067 -1239 -2397 59 -36783 -59902 -73612 -84550 -56574 -61011 -62296 10103
15313 10103 59835 76764 93852 152348 135311 40410 -24519 -15729 -52468 -57323 -92037 -17321
15301 -17321 22826 18061 34615 -7748 -62315 -123697 -117838 -102160 -75506 -45853 -32278 -56249
15289 -56249 -38728 -30535 8117 -36193 -67641 -55821 32921 68440 53988 19918 -6048 -81698
15277 -81698 -142199 -162178 -110752 -118482 -99114 -101679 -84974 -76451 -54135 -40639 -55297 -41736
15265 -41736 -26989 -16907 -53834 -91079 -101257 -88748 -56904 -80370 -57039 1411 71826 96220
15253 96220 130492 138216 134538 120225 47841 -10558 -22904 -1655 -83 67094 88066 124748
15241 124748 109776 19859 -9908 1036 -23376 25385 22506 23014 -14447 -24202 10260 17103
15229 17103 33423 10822 -69405 -52084 -1763 35362 60495 45871 27979 -5599 -17673 38083
15217 38083 35419 46032 28333 -36909 -51655 -5122 -28015 -51213 -28829 37274 70616 48597
15205 48597 12142 34539 -6724 -17814 43100 36255 -14303 -41389 -7604 -27587 -83318 -20236
15193 -20236 46296 39598 -5656 -28004 31498 20280 55449 109332 97869 81541 65309 49565
15181 49565 422 -16809 12623 -8873 -10438 -19861 -50544 -71652 -30679 65696 90481 83539
15169 83539 71825 54880 27223 40097 12935 -36495 19655 58738 88659 60465 12884 -21481
15157 -21481 -92849 -78776 -47836 15875 13147 -1698 40039 4019 23537 51721 97307 58290
15145 58290 33182 66563 55474 60848 18793 25043 34632 35735 49997 36358 -13690 -63982
15133 -63982 -82410 -39225 -30302 -33780 -83610 -93718 -87376 -60325 -60076 -82918 -71465 -24402 76885
15120 76885 108453 117121 147112 155991 102038 57052 32898 12419 -19134 -57065 -98218 -102326
15108 -102326 -85714 -89175 -109163 -117758 -61924 -7980 47341 -1552 -22932 998 -63087 -176187
15096 -176187 -197169 -168999 -159784 -73717 -66306 -122180 -135830 -98615 -77956 -10609 11471 -6628
15084 -6628 -1782 37242 27373 26121 61061 48702 27784 50210 61353 55513 46576 32955 10320
15071 10320 78095 51129 76284 103712 20476 -86852 -112523 -95786 -76888 -18941 1712
15060 1712 15909 3874 14750 -15138 -26311 -23707 -26247 -8414 -16528 -45606 -321 42380
15048 42380 656 -36999 -116392 -131288 -91458 -63712 -66969 -119391 -55677 -38601 10849 75002
15036 75002 66381 22289 19851 -10828 -36293 196 53908 54072 91019 108470 41324 -16791
15024 -16791 -39387 -36626 -109960 -159097 -113965 -68630 -38568 21006 36606 -4528 19233 22199
15012 22199 16458 61720 56346 14072 35409 69046 125241 120245 99638 120374 173831 188668
15000 188668 178099 172895 162196 110010 48581 159 -13645 -43489 -43754 1575 19374 -23422
14988 -23422 20976 33469 -38951 -31671 35178 87967 50779 11626 -17263 -96631 -98682 -41805
14976 -41805 -20665 -28134 25626 58231 39293 69731 5160 -24495 -19807 -68515 -14693 -1155
14964 -1155 8891 12727 67533 56796 -18205 -46650 16214 75770 37393 3552 -2249 6342
14952 6342 -8708 -22162 -26920 -17939 -19121 -11420 24686 12850 -71945 -71650 -12194 -7693 -79699
14939 -79699 -172797 -111362 -74686 -26287 -42449 11553 18014 -57465 -10118 16123 -25524 -7741
14927 -7741 33969 56440 49268 -33161 -129850 -107936 -90472 -124200 -131321 -106839 -82120 -99228
14915 -99228 -116073 -84715 -65291 -51318 -36598 18566 34128 55318 11464 5770 8180 -16976
14903 -16976 -42814 30 94879 97813 68221 41506 22342 -30166 -156470 -145128 -80915 -69270
14891 -69270 -43103 5985 74460 19873 32202 40655 89950 59377 40955 2996 1830 73833
14879 73833 140847 144561 84879 27219 -15542 -22417 -21387 6815 -5 11171 26927 26871 5680
14866 5680 20202 -28175 -71214 -75105 -51022 -35061 -22016 -12947 25932 -1419 -1050 33732 30783
14853 30783 -25678 4361 36040 44977 44715 7177 -13391 -49955 -58803 -56372 -23416 -4690 11976
14840 11976 -327 -23610 -12845 20051 48307 61629 12833 8632 38496 58902 54077 94300
14828 94300 150694 173348 89576 2919 -50847 -8070 33038 88207 108977 128619 108227 110618
14816 110618 59733 -16189 -30349 -22430 -16472 -91905 -42068 12550 57852 83309 52036 -2121
14804 -2121 5086 17493 22846 22883 67367 79622 87391 110351 98737 74578 22724 -44032 -48191
14791 -48191 -42020 -69163 -37609 -16331 11556 805 -13840 2653 4381 -13739 -56580 -68666
14779 -68666 -78713 4804 2303 7909 19860 -11533 247 19350 -6365 -13556 -44721 -78801
14767 -78801 -38835 56656 91869 66232 52874 1245 -35699 -43706 -29910 24859 44839 40863
14755 40863 75816 93761 64431 43236 25468 48257 27966 -28873 11055 56208 70391 65540
14743 65540 63734 53298 -12474 4237 80112 101433 108207 74217 33195 -5097 -19914 -8737
14731 -8737 346 -10623 -46359 -61709 -42466 15670 24832 47535 61520 21910 6500 -22943
14719 -22943 -55314 -74612 -56941 -49637 -57370 -55903 9639 7032 -26195 41865 38364 -26616 -42553
14706 -42553 23826 68587 60496 65245 -17759 -152920 -173321 -93936 -4719 -61184 -86272 -59155
14694 -59155 -18011 -6323 48135 53928 23728 4656 -34850 -33637 -32135 33326 117504 77841
14682 77841 23491 -1202 59807 39532 64062 76812 91611 94101 66852 20543 -21469 -690
14670 -690 14771 81773 89185 73414 82848 50980 22033 -8821 -4828 49295 88127 114890 72991
14657 72991 37335 46637 17624 45050 -10141 -45252 -16287 19459 58454 86049 81116 47099
14645 47099 16307 -48972 -12664 26992 -36022 -27982 7714 32402 47737 91698 23115 7042
14633 7042 1501 27694 97675 86747 10695 23655 100423 182136 168138 165266 102512 12726
14621 12726 -8744 35458 23386 -15950 42221 71056 23091 40892 76298 110184 113233 113239 54960
14608 54960 -20566 -25848 41410 25013 -61024 -11041 44888 45505 64662 43199 -312 -28430
14596 -28430 -38784 -22973 -45814 -17393 28538 27697 2474 -63093 -16038 26650 21386 9421
14584 9421 61641 64832 59131 107 -25448 -17624 26430 -17536 -72059 -29358 -36521 -73565 -72603
14571 -72603 -70457 -24270 -6516 13168 -9960 -27080 -10624 5789 -19459 8515 48414 36082
14559 36082 23895 8698 66442 52470 -7383 14819 46778 229 24623 20526 -32809 -25919
14547 -25919 -50956 -39712 -93316 -89367 7594 28403 32889 -26177 35889 119221 145382 110914
14535 110914 97604 186896 181642 108450 68653 55365 -22488 -32808 -46691 -43952 -38875 -32557
14523 -32557 -64269 -50502 -33123 4140 30704 32093 38847 25890 -25235 -68834 -50407 25607
14511 25607 63989 53676 36812 33345 38816 35218 20453 8236 -7409 -34937 -19079 8510
14499 8510 53350 15887 -41379 -45627 -33862 27352 67844 -21722 -58841 -101737 -103361 -26700
14487 -26700 -5228 9634 20846 20840 -18720 -53829 -33342 26896 45345 37800 35769 21184 19043
14474 19043 26517 6083 25580 18589 -7830 -62158 -84441 -11123 92707 48423 -27750 -45206
14462 -45206 -24392 -61273 -30834 50853 16841 5787 27403 7764 28158 61275 25354 -19475
14450 -19475 12487 -26702 -53044 -60698 -101672 -47212 -28421 -21341 -21247 -50625 -15422 17431 60023
14437 60023 69062 73359 56814 36042 18314 25162 33560 79160 144894 119522 94792 52499
14425 52499 18949 42511 37035 -31280 -40463 -54733 -38872 -13534 -37600 -54842 -41452 -33944
14413 -33944 11827 30016 49623 38101 32753 47677 67327 51159 -7796 -43627 -54043 -87009
14401 -87009 -34455 -7385 -27586 -31899 -19665 -17504 24793 51 -5219 -23346 -77937 -95927
14389 -95927 -110880 -57593 -16298 -90379 -71173 -79933 -28131 36668 27315 -10356 -31295 -2367
14377 -2367 25424 30916 62969 25403 53105 113622 75996 50081 91706 126469 78381 17977
14365 17977 43154 86206 70916 -33698 -34039 -25855 34645 57744 5198 11347 -3019 -18327
14353 -18327 -38006 -34543 -61296 -59218 -39489 -31467 -56800 -48036 -49719 -94356 -89106 -41840 -61817
14340 -61817 -15669 4337 -29787 -28389 28516 -6646 -60734 -35264 -42993 -81108 -96926 -85161
14328 -85161 -84748 -141047 -113145 -45552 -55474 -71808 -43154 -60614 -64962 -10813 -47049 -42056 -39350
14315 -39350 -12452 -10492 -15910 -13496 10218 27986 24347 2504 -48849 -42059 -56573 -58865 14416
14302 14416 48052 -5330 -7869 76499 86885 83965 71286 55702 45994 61667 58711 -2472
14290 -2472 -23705 -46566 -20254 7128 -22660 -85304 -106180 -23550 52947 123487 113442 55106
14278 55106 5649 18184 -21623 -82535 -68857 -8212 12764 20213 -18139 -56340 -26395 -40590
14266 -40590 -18171 31008 1922 -55698 -37837 34380 36283 6870 35794 24057 26297 19720
14254 19720 33886 21031 4719 -29582 -2797 24179 39991 -24279 -63100 -83070 -57166 -16190
14242 -16190 25129 44308 67028 27149 57745 88037 79966 86255 101380 55194 22630 -11646
14230 -11646 36794 37733 58886 34022 30090 26984 -1577 -6600 -16444 -46979 -11862 20737 1955
14217 1955 -30372 -44826 -76857 -81905 -23628 71591 71468 66324 -19314 -53760 -19004 40902 10441
14204 10441 37408 58794 -6295 -11429 -39449 -84168 -94211 -40836 -33300 -68463 -73809 -68576
14192 -68576 -62691 -71900 -64196 -42863 37998 47601 7833 3600 61897 114755 70093 -3540 -43671
14179 -43671 -59772 -25640 -16630 -8778 26894 51364 -23452 -28699 -2882 -25349 -643 57796
14167 57796 68076 16990 -10870 -34469 -25427 7956 34956 50096 39976 -144 -33133 9146
14155 9146 -25617 10925 -9220 -52210 -80318 33834 87534 8685 -22706 -664 8354 51118
14143 51118 44401 52329 34521 18941 104059 59813 -3061 -47925 -16183 31923 32322 12168
14131 12168 11547 36 -7669 -47152 -25033 -46100 -29213 -45567 -14557 -41237 -106330 -54526
14119 -54526 -12775 -28860 5535 -21280 -80103 -97191 -61861 -27836 18278 50909 59148 -902
14107 -902 -42345 -45033 -5471 -6630 46852 15011 -59234 -5351 52445 4578 -7939 -12180 8542
14094 8542 35218 -2498 23119 32842 22086 50653 74372 61770 38891 2906 -13993 -33835
14082 -33835 -76250 -111102 -126498 -77718 -27429 20041 28024 25569 75289 81171 52866 -37696
14070 -37696 -30150 11952 -6276 -59607 -109560 -74469 13269 97297 108744 49317 30041 28154
14058 28154 71965 63771 -19268 -53115 -14972 11730 22196 -882 -12983 -21703 -20523 15487
14046 15487 -36314 -69047 -108920 -52130 -45079 9790 52256 113830 80577 62450 23183 25012
14034 25012 8255 27759 57322 100914 64165 57533 15119 26325 11038 -36098 -94413 -102299
14022 -102299 -63194 41034 69638 -46197 -82342 -35994 18535 -3232 -40883 -20855 -20865 -44521
14010 -44521 -39093 -88726 -144192 -122724 -58841 -52748 -30768 18616 46745 8983 -16567 5471
13998 5471 -16185 22720 51413 9529 -25754 14130 -21375 -48260 -11040 38945 -2866 -14874
13986 -14874 -5600 -21712 2308 -32564 -53017 10613 21840 67777 80393 42007 44354 60357
13974 60357 30538 17620 -5625 -27670 -80291 -40438 -27224 29301 34120 62701 84811 123256
13962 123256 156226 174399 141256 87783 127996 157608 116631 108181 43376 12836 47585 92535
13950 92535 91658 35763 -58907 -97398 -95059 -98054 -47269 -20807 -16651 53475 73878 60253 34959
13937 34959 24967 36769 36397 17531 -4001 42109 12980 20226 23854 91496 46810 -28758 2092
13924 2092 23912 15824 -15988 31006 55084 28481 18334 33579 37151 5740 7259 32378
13912 32378 12919 -12676 -1081 -12721 57336 68327 59315 65977 4867 -23961 -36389 -36657
13900 -36657 -39860 -44023 -25769 22695 66060 91634 58496 66571 105143 112228 159690 202182
13888 202182 191358 155703 60040 16932 30653 50234 20611 18202 3862 3710 -43508 -83965
13876 -83965 -89660 -88492 -123213 -81263 -17025 -27062 -49113 -24483 17286 16042 12248 24253
13864 24253 49840 68482 78369 58533 22116 889 -47493 -45906 -41771 -33565 -33088 13649 24946
13851 24946 -19054 20271 73205 134225 110275 6494 -45156 -58847 10519 22073 21205 -6532
13839 -6532 -56927 -73508 -34262 3756 41278 36165 49724 25371 -4878 33720 24454 7691
13827 7691 27192 50997 10138 1463 -43764 -74929 -68562 -95037 -35805 -19688 -57267 -105619
13815 -105619 -106470 -59112 -51134 -42072 -9791 12548 9329 52947 38168 27112 -1829 -84433
13803 -84433 -125994 -101436 -85150 -97655 -60918 -15847 -28659 -32093 -6735 -25391 -43386 -7704
13791 -7704 17484 -6995 4471 38253 47375 71801 64384 22413 -50994 -50179 -64026 -58031 -41162
13778 -41162 39302 83053 108871 99808 138734 90929 31292 14956 5782 13055 8265 4362 54040
13765 54040 135580 134884 105760 74101 95293 12078 -29395 -46120 -36218 -94 44386 73404
13753 73404 24023 -35401 -79109 8072 5528 34857 69942 28069 32952 73328 93239 81593
13741 81593 48822 -31246 -34096 -15747 2650 62686 95267 73540 24590 11327 42391 16804
13729 16804 871 15330 60794 62657 -12540 -59336 -34165 -8249 13451 7974 30192 28139
13717 28139 -7633 -28154 -12206 5663 57282 101235 68636 61946 44644 3241 20618 16947
13705 16947 -15590 -52974 -18871 -15548 -10931 -23305 7377 19101 19604 53224 27962 30941 -55497
13692 -55497 -60111 -7735 11204 -9687 12842 69948 33549 21378 60493 16961 1788 7021
13680 7021 21348 27896 40257 -662 26531 49531 11124 -57852 -113741 -91861 -24980 14608
13668 14608 24038 62538 96379 53834 -6713 26240 51719 36923 19621 -26451 -48793 -10065
13656 -10065 2843 10849 45811 44536 25787 20205 46302 -24509 -59809 -2271 85898 77343
13644 77343 81692 116065 108934 54997 11720 -68197 -80585 -39162 -882 -19563 5904 21513
13632 21513 17904 -20119 -52072 819 33534 -39461 -37799 -13800 88258 105983 88249 57788
13620 57788 -48045 -155586 -108724 -48665 -69841 -125272 -96697 -93879 -65596 -37962 21080
13609 21080 -47507 -83132 -52598 -47687 -29258 -1497 53380 6447 -58293 -40383 43055 8915
13597 8915 -8377 -5692 -46933 -54968 -101465 -61274 6560 55537 13930 -26183 66466 71791
13585 71791 62100 51870 25918 53598 55355 89077 62935 56200 120606 78825 -10638 -58467
13573 -58467 -87098 -150044 -150899 -124418 -75504 -74859 -109521 -81921 -50188 -43731 673 29841 57858
13560 57858 66673 35196 -11714 -56756 -29729 11358 40866 58681 81941 94139 128033 85942
13548 85942 112301 88601 34901 70540 46940 53380 78639 54656 83433 92571 106679 88093
13536 88093 57360 89614 69011 7715 -36439 -55437 -3108 -23036 -80817 -99182 -70736 -12914
13524 -12914 54767 79023 47269 -20478 -75486 -136041 -142059 -96121 18323 -9045 -65324 -34408
13512 -34408 41160 66108 8292 -27369 -76741 -49951 -7793 -4794 13166 -24292 11262 5564
13500 5564 8037 53731 116027 150422 157037 101473 75584 65663 53921 49331 25634 -15292 -72134
13487 -72134 -78769 -45156 -608 -83569 -94941 56735 110274 28725 16544 21202 -13986 -108616
13475 -108616 -56740 17443 38083 75046 68682 40508 -1352 -25046 -32327 -1776 48081 12576
13463 12576 49434 54678 47038 -7207 -48608 -40471 -71689 -33222 -11104 -13220 27833 31177 28200
13450 28200 43231 11809 -1730 7118 -2297 -7086 -51741 1293 49295 49164 91947 94078 57724
13437 57724 21603 -30176 -81494 -59477 -12946 4531 -30181 -62491 -87262 -40980 34944 10319
13425 10319 -13922 -14029 35591 69300 54060 -28882 -58855 -47573 16432 63278 88833 85330
13413 85330 65170 48428 59456 41566 36448 33353 27024 68873 69062 77842 37205 3535 27375
13400 27375 52871 -16004 -27844 -13914 -34553 -40349 603 50155 37137 32258 -23307 -128845
13388 -128845 -94416 -62102 -21026 11140 -16477 -33193 -20605 -19405 -7907 -6687 -22870 -34139
13376 -34139 -28587 34038 41866 44425 85348 97372 64214 36354 -31850 -50477 -54720 -73883
13364 -73883 -62821 -41825 47067 -20102 -93313 -104845 -81725 -56750 -71253 -16451 27539 37535
13352 37535 5657 12606 23209 -27562 -64426 -57263 -23603 -8145 58617 95574 67780 43435
13340 43435 51971 133564 166456 94107 83766 40956 33327 41673 29619 2093 -49601 900
13328 900 4181 24011 22149 -31378 -39872 -14765 5669 16762 15684 4766 29123 31595 73736
13315 73736 76495 29442 4602 25330 -2473 -55341 24309 105047 102102 43755 69839 29894
13303 29894 -100194 -115610 -33459 -17668 4826 33760 39923 40149 72728 92562 96674 67421
13291 67421 9642 -9609 -7065 -1383 88986 1021 -64819 -22306 -35373 -23532 -26708 -46537
13279 -46537 -26222 14517 23625 -8075 -68287 -74234 -90796 -92974 -96190 -48452 23530 17160 -15396
13266 -15396 -46837 -32929 -66467 -43701 35085 62336 119251 134207 116264 71379 59016 46246
13254 46246 14487 55779 52592 41251 18477 -508 -39447 17782 37557 42354 61411 68968
13242 68968 88835 85096 115787 83227 62136 89131 95106 96540 145415 168458 118338 83589
13230 83589 45385 13992 22507 30675 29727 45380 23314 57053 17588 35535 26926 26160 -25734
13217 -25734 -72825 -61497 32895 50344 16380 5963 7457 62278 36160 -789 36339 38953
13205 38953 -13521 -47169 -30321 -11554 -14966 -79925 -97079 -27662 -36189 -41712 -44738 -97516
13193 -97516 -86193 3177 22027 29974 55519 78539 85604 16633 -26802 -86622 -65520 15477
13181 15477 21096 20904 25102 -37995 -67014 -68822 -84417 -57874 -43910 -19481 -32037 -9287 1229
13168 1229 -34805 -95979 -23065 15500 45528 63220 35129 828 -5017 -7343 -8261 51142 52641
13155 52641 41902 67295 83268 78787 46892 36537 41949 50275 107640 125835 61740 51431
13143 51431 78143 55465 13826 -4510 -11155 -26513 -35063 -72357 28283 81155 76468 55003
13131 55003 29016 14475 19019 15368 69999 113179 36493 -56452 -39535 -26639 -28948 -13378
13119 -13378 21653 -45151 -68697 -36902 -36944 -13022 -18489 -31521 -46430 -87213 -38033 23556
13107 23556 -23735 -88096 -111122 -87332 -46066 -20959 -9736 -31955 -51599 -2411 22303 -3875
13095 -3875 -7108 -24814 -50469 9620 18505 -19952 -35211 -52085 -93358 -26060 19313 19563 18959
13082 18959 2362 -27145 -2845 7517 20592 39662 35963 32545 55825 36437 17885 -580
13070 -580 -4075 45443 43 -24775 -18397 -18415 -45019 -95090 -70147 -31205 -18642 -10531 -59126
13057 -59126 -93446 -41825 -48800 13023 72073 60979 33485 58871 36550 -7417 -26665 -2415
13045 -2415 -5854 25126 49496 50923 53047 21163 87935 147051 46696 -34515 -15369 -45140
13033 -45140 -51620 30336 55262 23035 -36095 -63648 -75148 -57997 -46891 -17000 692 -31797
13021 -31797 -95129 -84684 -59259 -137478 -123969 -40668 -43613 -72320 -23405 -26068 -20948 1587
13009 1587 46 9379 3027 39751 55848 29539 -29084 -16765 -25223 -14100 29671 -64645 -83640
12996 -83640 18963 14708 14768 59195 93190 70302 69920 17075 37786 102503 104203 38805 -10311
12983 -10311 -3179 -9907 -39169 -41626 -54297 -62213 -71148 -37873 15015 69429 44951 -7901 -56505
12970 -56505 -53858 -22009 33007 33269 -4606 -93765 -110770 -95296 -20114 24162 26203 -26202
12958 -26202 -26785 -49403 -51197 -34364 -67259 -18705 40578 68486 109442 76081 44343 42825
12946 42825 -61 -30989 -21578 54281 81693 30637 -30759 -16052 46592 101056 64500 79109
12934 79109 66594 22832 -26957 -31316 -62008 -41296 -20919 12979 68568 62610 -12112 -25485
12922 -25485 108 -39806 -8688 47748 9098 -26964 35813 24542 5020 26201 32734 -16599
12910 -16599 -115148 -73107 -76830 -40065 -62825 -10126 -6421 -39034 -35678 -83217 -66738 5304
12898 5304 29145 -34239 -83394 -119823 -74271 -18021 51165 101397 65408 50604 53828 15956
12886 15956 -26605 -54159 -41726 -15751 26898 -27596 -61937 -33850 -6635 -26229 -24661 -50879
12874 -50879 -17778 11535 20235 -6305 29409 29659 -4477 -24316 8375 44932 67102 77731
12862 77731 67949 28310 35412 60449 25783 21141 48551 59009 14785 4154 -32189 -60836
12850 -60836 -5082 95007 124368 57103 47673 58774 -2114 -55377 -37407 18946 109508 55037
12838 55037 -12400 -15058 7863 -20806 9545 -13690 -34243 -1731 52352 19291 6831 -33764
12826 -33764 -51983 -130 -104 -58190 -90631 -117041 -120408 -128754 -122330 -52345 -23265 -42761 -11696
12813 -11696 -21289 -8535 27702 -58284 -48099 -51987 -69397 -72921 -75405 -58611 20672 48158
12801 48158 19661 26593 97739 85124 97996 161214 213630 128930 75486 44949 70010 118370
12789 118370 106012 95129 71403 12163 -16462 51384 86755 96031 101644 122596 86106 42418
12777 42418 -8480 -41187 -73098 12377 40275 92047 104215 9561 -31851 -65188 -120537 -146968
12765 -146968 -92636 -78636 -97968 -120592 -96468 -67238 -68569 -80608 -48438 51907 63093
12754 63093 -15168 17751 70748 116291 74735 705 96960 90972 38061 -15462 -50724 -93169
12742 -93169 -45356 -29577 -20952 169 53353 41000 22159 36811 54677 38395 18129 27802
12730 27802 -8055 -25619 -25886 -40525 -32448 -30458 14574 1748 16356 15207 53568 63175 109961
12717 109961 125533 113280 44464 39563 75510 60160 -866 -5644 35907 110048 117613 162871
12705 162871 164806 121150 81924 63199 111825 92910 88261 39425 50618 57899 -3349 -59156
12693 -59156 -85083 -92829 -97127 -87986 -101971 -67265 45314 89443 63765 35613 -1106 -15060
12681 -15060 12048 37091 23491 -23979 -8493 24776 60366 90016 4341 -29032 -81152 -136559
12669 -136559 -75967 -102871 -127168 -62652 -45913 -93905 -82809 -86607 -94367 -72280 -11064 24734
12657 24734 -9220 -47948 -28214 12048 -11741 -37325 78298 129545 104658 47841 16256
12646 16256 32772 13214 372 13607 3597 16129 -35619 17137 26772 16242 -7344 24012
12634 24012 74095 102235 106881 174505 129203 80558 62779 85775 53147 33823 62191 46973
12622 46973 69381 80250 69817 75236 13740 -37123 14566 31509 -28696 -80928 -115215 -113443
12610 -113443 -130179 -20192 66783 35603 5018 -4338 -11806 7094 26000 35074 57065 6999
12598 6999 23667 10843 -40271 -20182 7435 16038 -43002 -37315 11935 4004 4837 3598 55236
12585 55236 36328 2417 -32505 -20136 -17900 -4939 -8339 70355 135028 150109 107335 30127
12573 30127 -26350 -69168 -51152 4135 -19539 -44681 -23301 -348 11128 42152 29219 19443
12561 19443 779 -43166 -123247 -131004 -90239 17452 18980 -9379 15035 6575 51008 13783
12549 13783 -39629 -50703 -15870 3565 11759 10596 17312 38674 39243 -3255 31245 48949 -4029
12536 -4029 -9825 20948 -8739 -43171 -20416 -18547 5145 -5143 -42179 -7111 -6807 -27019 -11764
12523 -11764 26538 77195 38871 -5376 -19672 -40201 -67895 -92107 -75579 -8578 55051 117241
12511 117241 122610 75837 33591 39197 87008 82130 96343 103187 112503 40666 -67640 -55734
12499 -55734 -891 -28791 -45194 -29130 -74913 -66969 -62183 -69703 -130180 -103061 -61091 -10940
12487 -10940 25743 -17398 -11649 -29265 -52982 -18945 -76456 -96051 -6210 65572 80072 52579
12475 52579 50407 118032 126029 56153 42152 57058 43657 57036 54455 87610 71474 -2628
12463 -2628 -12674 23160 21217 10633 12689 -34980 -57185 -27431 -7136 -14395 -4347 33590
12451 33590 40446 17713 7691 12215 9199 20818 18838 25595 -1538 47765 23213 -37665 -1128
12438 -1128 -10383 2419 22175 61408 45912 60428 83520 69865 83351 67695 28621 456
12426 456 7488 -26475 -36251 -49859 -11069 18403 58283 34847 -18454 -50463 -30156 14586
12414 14586 44175 14563 -22006 -74346 -96339 -51889 -10884 -29422 22946 57015 -29650 -18126
12402 -18126 34094 27271 18681 -10393 -49308 -46238 12717 -30331 -23289 -61413 -52403 46645 115147
12389 115147 128421 139357 167969 156532 165768 104880 59614 134988 112554 27961 -25140 -34190
12377 -34190 39654 -15060 -21484 48305 58561 3280 40311 61618 51323 -7168 -74330 -174262
12365 -174262 -246482 -199307 -152333 -122486 -96384 -140926 -171795 -108873 -16398 25904 -17531
12354 -17531 39467 74414 103080 55245 63652 -19859 -29808 43004 86223 87366 46989 35674
12342 35674 22907 -43499 -64064 -15239 33332 19369 54333 81753 48100 -2552 -15357 33192
12330 33192 6118 4118 26082 44282 16088 -52025 -22430 36233 145840 128418 56068 41641
12318 41641 21211 34952 -16088 -8359 68789 109099 73875 54264 78960 73954 68218 39840
12306 39840 -5973 -32764 -33278 -31867 -38302 -20712 -15662 53467 56899 15523 -4865 45121 94424
12293 94424 129261 8018 6367 -33754 -93487 -66299 -21777 39558 54134 59296 42133 13243
12281 13243 -91016 -144948 -92099 -28598 -51031 -61203 -14779 37605 34778 -873 43411 73586
12269 73586 34300 -10253 25893 -2405 -69458 -6391 -21226 -34621 -53990 -19959 41673 115411
12257 115411 104312 52385 20661 901 30849 45545 22627 48335 95738 -1887 -20473
12246 -20473 -15565 -12780 24017 -4222 -16304 42812 88483 1930 -44184 -55071 6899 49941
12234 49941 23776 19148 27598 9216 -1264 -4879 -16994 -15901 65955 58120 -15429 -78098 -98979
12221 -98979 -62868 -44136 -59252 -42865 -51432 -16771 5196 9062 -26131 -29228 -15953 -5247
12209 -5247 3835 -22774 -25218 -92905 -67460 -32649 -37256 -69026 -59441 -42755 -30991 -99037 -94670
12196 -94670 -67592 -93915 -74926 51336 114622 81424 39428 -29899 -39520 -12325 -60268 -52244
12184 -52244 -37431 -107575 -71687 1022 -11896 -45781 -19981 31193 13622 -4905 45492 19440
12172 19440 -38642 -19989 29013 52402 44170 -7781 21596 43981 31883 30115 25692 14531
12160 14531 26965 44496 8873 10876 35210 12543 16663 11367 -50991 -55138 -43930 -49218 -57857
12147 -57857 -100182 -122833 -66267 -28885 -36605 -8773 31371 19588 -673 40427 47719 35653
12135 35653 2450 -26928 -50261 -72450 -66088 -84885 -120971 -175069 -135004 -91487 -118241 -77676
12123 -77676 -81495 -74556 -62093 -131397 -121111 -60082 -15219 -28431 -85868 -61111 -70065 -85061
12111 -85061 -92376 -71959 -13925 25271 7429 21781 33294 68586 102197 84507 81064 72416
12099 72416 85786 56703 84599 105791 13364 -8376 28334 38007 29302 -19324 -10222 1858
12087 1858 -49150 -58534 -2157 -30477 -11519 46296 45588 66509 96681 99513 81446 69584 -15972
12074 -15972 -81529 -48646 -31521 -4756 13071 11447 -21163 -13481 62185 94941 75152 39471
12062 39471 -19073 -37146 -16735 -52404 -84845 -32839 -24853 -48685 -82180 -112644 -100226 -45918
12050 -45918 -8470 57336 11244 -68880 -62740 -56089 1582 52678 69429 66918 3173 37395
12038 37395 -7982 -7153 -43467 -47327 8544 -3238 -50295 -18208 4854 26144 8442 24449
12026 24449 70283 -11910 -34886 -31272 -49893 -8194 44734 82082 82612 -24803 -98325 -97619
12014 -97619 -85444 -90777 -106178 -74857 7299 33936 23486 12211 28702 -7820 -86152 -87245
12002 -87245 -77551 -88040 -71862 -59236 -31828 -15455 -69628 -77826 -53338 -37662 -8986 -2170
11990 -2170 7600 54361 42067 44325 27505 36206 -1827 -45937 -103370 -134289 -81438 -30843
11978 -30843 33116 76118 71866 112508 123036 98178 60406 34820 -17074 -16232 7859 36319
11966 36319 56074 60213 9572 8923 28241 46530 33581 71029 105561 136711 138754 56620
11954 56620 9827 20467 65348 14436 33624 71505 33701 31051 3083 14050 41218 52544
11942 52544 4127 -36225 -65123 -57127 -69078 -84936 -36262 -15555 19364 68239 84287 92731
11930 92731 101790 121190 95272 72136 112856 100594 79399 89579 19108 -16559 -41000 -17973
11918 -17973 17546 24307 -24938 -102255 -66876 19624 25847 50429 49152 -56674 -74210 -7867
11906 -7867 -81207 -54263 -50890 -51696 -56251 -28977 -23733 -54725 -80324 -91568 -72498 2931 16230
11893 16230 18111 11276 -47249 -143691 -143894 -107338 -30399 58438 32699 5169 -7738 -69758
11881 -69758 -55691 35434 77029 13814 -22165 404 50001 69575 2112 -47711 -64196 -66220
11869 -66220 -49494 19117 87812 62292 25432 43875 39526 14256 -34500 -38533 -42645 39575
11857 39575 37086 7010 -49624 -47931 -62789 -100304 -88226 -27845 14444 -1340 43513 32202
11845 32202 -30850 -123851 -95900 -47759 -27078 10729 40499 38594 44899 69792 65525 35817
11833 35817 -32109 -54298 -15914 5976 4354 -45078 -52759 -27718 9072 10916 14916 65058
11821 65058 16000 -46149 -81833 -116406 -68775 -61689 -80814 -64804 -110557 -78177 49988 43922
11809 43922 -8504 -29573 8004 52031 62390 24730 7997 9116 -20396 35541 49928 82078
11797 82078 44945 37152 99165 66719 16589 -7767 -30077 -19191 -43737 -70985 -72989 -25057
11785 -25057 29299 58625 41634 -16573 13095 53889 8296 34340 27304 51627 41324 32776
11773 32776 57443 73847 53344 72031 115233 157805 153153 83296 46864 42235 38494 32285
11761 32285 9 -22926 -4600 33473 66382 76201 118260 79009 51467 -9388 -7572 25145
11749 25145 -38302 -106738 -75679 26661 23383 876 -16727 -33165 -81503 -66539 -34311 26900
11737 26900 -30342 -59097 -85079 -74230 -8428 -31941 -7336 114128 124352 36607 -18665
11726 -18665 -6586 -5868 -37964 -53451 -97970 -21379 -13119 967 -20392 -38736 -40718 -112642
11714 -112642 -74410 -12347 14708 -22348 -77665 -65692 -93014 -65484 -63192 -82970 -75366 -102546
11702 -102546 -82899 -34025 -50356 -61587 -145916 -148060 -123941 -82139 -77232 -53515 -5360 -11420
11690 -11420 -64467 -50706 -39152 23533 23441 -55008 -39490 -25477 23007 10992 -37392 -12257
11678 -12257 -45999 -79615 -61600 -68536 -34171 7057 46438 -1237 -27795 -79077 -74700 -53868
11666 -53868 -45927 -95529 -98001 -125568 -114564 -132707 -124408 -60885 16602 -35720 -63400 -29725
11654 -29725 17073 19302 26796 -25409 -28369 -50565 -52445 -114620 -90729 -45699 -2585 -33762
11642 -33762 -127195 -100422 -33288 29908 69987 86471 98867 78277 39923 49251 -17838 -53359
11630 -53359 -45899 -77592 -19292 114966 121869 82875 39416 -7732 9042 50378 77401 24019
11618 24019 -70080 -60485 8943 11845 7444 67428 23314 24756 50655 30217 -6643 -64546
11606 -64546 -99437 -69791 12034 -5857 -19559 -41851 -77329 -63953 5525 6455 36562 47675
11594 47675 57604 93847 80321 51506 43565 121525 102474 2512 -34189 -10868 36453 43811
11582 43811 66181 47048 14783 34561 46133 1425 -75381 -62460 -30215 -14839 10378 82117
11570 82117 58240 8641 35019 9075 12012 -30309 -60545 -30029 -55215 -46232 -33550 28928
11558 28928 95620 27604 17373 43147 21543 51257 98083 82062 71951 99696 77122 54823
11546 54823 55874 -25423 -72833 -27963 13151 60141 120015 76283 -14793 -42799 1374 13448
11534 13448 4819 1863 -16928 -76074 -79734 -75421 -60179 -65313 -71700 -46396 -7528 -52046 -60825
11521 -60825 -12767 35822 38342 26995 -27276 -57494 -44396 -29328 -10087 -16718 -30585 -46698
11509 -46698 -66396 -52302 -19287 -5740 -8204 -26001 -44540 -21223 40989 45998 -38007 -124098
11497 -124098 -148588 -119919 -61683 -61954 -10342 -4613 -2337 -12874 -48107 -73822 -66421 -64969 -23637
11484 -23637 32387 36320 -34596 -14036 -29666 -83367 -108126 -56243 7625 21485 -53080 -55415
11472 -55415 -63387 -71385 -69866 -53799 -6999 -10978 -7047 8209 -39797 5552 42256 29928 22868
11459 22868 -31746 -104534 -82579 -33803 17422 40572 73250 60684 12253 -1273 -11819 -33623
11447 -33623 -96740 -108345 -111478 -114369 -75211 -80919 -50010 -23672 -17930 -15722 17215 153350
11435 153350 175290 158724 96991 39823 -13926 -514 57100 59493 -12832 -37325 -34895 36736
11423 36736 86164 79740 67190 81185 112984 106601 105612 42892 -4015 -38556 -58145 -17324
11411 -17324 -30225 -41870 -41424 -52101 -98317 -138936 -74741 1866 28554 4897 11851 47974
11399 47974 54084 47421 13169 41415 63403 23144 14190 7919 -60850 -80909 -115033 -144818
11387 -144818 -128071 -91821 -68638 -27167 32095 50659 -676 -28103 -30918 22911 -42836 -65517
11375 -65517 -43971 -13400 6450 18503 31542 17267 19690 62894 56074 97389 111590 99982
11363 99982 43892 -12585 -31751 -21212 -29470 -51486 -93688 -110517 -72801 -68431 -43955 -39653
11351 -39653 -92532 -95101 -58296 -62205 -49872 -19154 -9277 18465 62932 121577 143673 99786
11339 99786 59143 9 -35689 -37274 -120627 -97331 -51821 -33677 -8914 7042 9371 38528
11327 38528 34269 16892 -2128 -16850 -23232 -53205 -82744 -74524 -63784 -45881 -12165 2741
11315 2741 18175 2563 -111580 -138727 -68240 -30350 29449 97595 109774 82049 -6878 -385
11303 -385 27927 35904 77031 207294 418862 561262 526307 491348 513363 494105 399717 290799
11291 290799 196498 173494 154595 140867 141393 158153 168479 106587 76389 79442 100770 70697
11279 70697 20811 94452 83119 110152 84752 94436 124716 130432 99624 88067 89172 -5264
11267 -5264 -25942 10436 18202 -32464 -38202 -48394 -68286 -15575 61248 100702 112608 42553
11255 42553 14313 26638 53950 89350 94324 28865 -16974 5808 31251 -11507 -61294 -32798
11243 -32798 -12785 19080 -638 19815 -17092 -51243 -23053 -8610 -7345 4507 1449 8969
11231 8969 22668 6070 1574 -24761 -377 39224 71833 87263 86704 52517 -34852 -27008 39455
11218 39455 62948 92574 40655 -46578 -39698 50023 35089 39119 50472 80467 48750 1495
11206 1495 -71086 -70689 -63438 10499 57468 17237 -50516 -30115 16194 20018 -1856 -84309 -95111
11193 -95111 -96949 -97233 -115070 -54768 -5958 62394 172981 334088 387057 435277 515687 513529
11181 513529 538066 525372 511497 414173 330944 232981 149170 170531 171590 158280 163301 116169
11169 116169 75915 5559 34982 59391 19876 -6295 57686 35259 81730 70360 77217 56931
11157 56931 75835 87547 38456 -15689 -15246 -2620 -20434 -2261 -34351 -64754 1891 26114
11145 26114 -21681 -78813 -32245 25054 42252 31524 -22411 -28799 59170 68572 29847 12413
11133 12413 -44897 -131868 -91261 -10182 7713 4956 -37035 -56293 -38757 -24891 -43935 -10035
11121 -10035 13611 16899 29031 18365 35959 83253 125942 109577 14038 -16166 -44441 -93253
11109 -93253 -66229 -104777 -165516 -158327 -64742 -18232 1654 14791 40234 56440 34946 75881
11097 75881 47126 14013 -10255 19986 17751 -12872 -9799 24890 -15499 -34664 -50697 -62762
11085 -62762 -64564 -136156 -108835 -84029 -76958 3368 76139 61499 13098 1459 -30252 -61737
11073 -61737 -64705 -16354 18510 34037 -13657 -62608 -94111 -42736 -6445 35298 11960 -13510
11061 -13510 -15503 16544 40540 -14390 -18356 -8405 -26600 -51419 9961 42466 20923 19269
11049 19269 66712 61544 44412 -5134 -80932 -40270 -9689 44889 105673 86589 96390 129037
11037 129037 120082 81417 62845 106818 26515 -44827 -74250 -27681 9444 -12373 15291 65029
11025 65029 82007 40390 -26428 -71152 -58711 -24436 -42460 -49906 -76860 -21926 9793 -52441
11013 -52441 -116693 -101420 -80118 -7823 -20309 -50415 -29851 12092 -28673 -36657 -35729 6442
11001 6442 26664 53128 38140 27594 -31725 -26730 13214 -4903 8705 67246 75272 49925
10989 49925 39853 -11598 -41125 32333 77243 55672 59027 55484 62462 27883 11860 49739
10977 49739 52439 40000 4919 -7315 -23912 -42000 -65608 -36691 -14311 -29186 -53065 -83801
10965 -83801 -87170 -68411 13278 147 -53808 -53472 -44526 -8244 65159 73101 61068 57403 18342
10952 18342 25497 -23607 -31453 -3669 21705 10161 7287 -955 -14510 -69182 -54476 -64773
10940 -64773 -78726 -55611 13512 62420 95403 130809 78515 31552 -9508 33233 27436 -13261
10928 -13261 25607 41026 18167 -9487 -3008 30497 -695 -29153 -67587 -74881 -61275 -38730
10916 -38730 -23213 -17179 14861 -12046 -73565 -69306 -90723 -83801 -62982 -56963 -80059 -49773
10904 -49773 -11846 -5842 27776 61375 47420 -8333 -79904 -105289 -43722 -41406 20138 56502
10892 56502 -16439 3575 36742 13581 -73784 -110254 -42647 7652 -7911 15215 50420 79251
10880 79251 110539 48346 780 -56907 -54123 -53781 -49903 -17462 6423 10517 41460 33951 10454
10867 10454 13063 -18358 -59230 -97448 -104637 -55079 -87378 -78889 -60528 -46863 -45572 -21196
10855 -21196 -39253 -120611 -58243 -32550 -3775 40202 25626 -21824 1339 51631 83199 91485
10843 91485 86643 47452 41141 1612 -30803 -49569 -56473 -86303 -83925 -670 8989 -14555 15307
10830 15307 -23855 -73140 -77361 -43213 312 15287 -47570 -69543 -58443 -51188 -7605 37815
10818 37815 58249 73897 39946 -1993 -37206 -26125 -37050 -40556 -6694 -25546 -21809 -4385
10806 -4385 74122 85578 -29016 -128565 -130997 -97564 -71140 -21028 -41522 -31656 208 14713
10794 14713 349 -9741 -7488 -9145 -40184 -133680 -89658 -48127 -30030 11658 -10791 -26314
10782 -26314 -43848 -45845 -84815 -53248 -7890 -10769 -46755 -2918 14676 -5018 -4039 12704
10770 12704 -14187 -53792 -45913 -32570 44702 70510 63225 36658 -36053 -80573 -44150 50016
10758 50016 49214 58095 81093 52978 17777 31175 68690 71917 -16018 -37025 -26796 -35472 -10871
10745 -10871 -50296 -52364 -47440 -6441 35950 13627 29691 110382 143669 94122 44747 22297
10733 22297 28362 -39966 -10115 -5696 56740 9679 1606 42952 61779 42497 31804 -13154
10721 -13154 -41933 19415 60015 12738 -46978 -35162 -5960 3084 -14672 -59050 -84873 -39374
10709 -39374 -16829 -31615 4587 22928 -737 -66565 -17498 -14308 -23330 14922 12823 -11136
10697 -11136 -4424 9918 75322 53677 9153 -12454 20415 -46330 -65767 -44516 3109 25791
10685 25791 69557 75060 4131 -26697 -26643 19282 91565 104101 66715 55952 80885 64513
10673 64513 75567 91586 69356 -16118 -12629 31897 16043 6568 20290 28374 65610 64540
10661 64540 47505 -34152 -79640 -9407 10446 -25857 -44022 -32798 3529 11546 43781 44450
10649 44450 76815 95499 -1377 -22581 -9755 -14592 -90885 -91183 -6578 38535 21613 -1113
10637 -1113 41766 16885 -28790 14931 58620 43522 2171 -47483 -97055 -84895 -45316 -10922
10625 -10922 15876 29209 18611 -9625 46913 56367 30167 -22734 -66601 -37186 -767 17459
10613 17459 77802 91554 98939 90248 4222 -23849 -15921 -67680 -128675 -171691 -92371 -32364
10601 -32364 -79879 -110756 -110426 -45671 -26177 7135 36667 30651 36662 41930 16000 -11761 -35417
10588 -35417 -22331 8820 21994 25093 29009 -13933 -7697 -16511 -48589 -23123 57860 59444 22977
10575 22977 -38505 10638 34085 -3794 -56777 -65421 -64009 -12310 78833 68185 79897 108826
10563 108826 98580 85908 95361 122234 92217 68262 77771 89573 98087 85772 127716 110294
10551 110294 97729 78623 75609 87321 39609 80340 145815 168174 239422 207525 176631 143664
10539 143664 127789 114363 92939 59611 13760 1341 -4898 -10108 -10933 -19808 -56888 -75258
10527 -75258 -69556 -78649 -66159 -24578 -27297 -41536 -44705 -105022 -114464 -38549 -21022 -14546 -3098
10514 -3098 8996 19137 8441 47340 32677 -23236 -49747 -47121 -75324 -73784 -72142 -49366
10502 -49366 -22413 -21598 -39721 -32345 -4994 -29155 -44833 -64283 -82092 -74271 -94915 -75217
10490 -75217 -62597 -59897 -42859 -17393 1750 16196 -37790 -49829 -30513 -23693 -20641 41078
10478 41078 50706 -853 -68775 -115234 -89841 -77148 -58802 -41995 -11992 19250 25186 -29457
10466 -29457 -76136 -34418 9335 44446 76425 51650 16524 -5924 116252 205115 192272
10455 192272 141835 189447 192917 156240 103186 83992 72873 55594 107233 105443 25995 -33608
10443 -33608 44599 61033 21566 16473 -21835 -21122 82914 46608 -23103 -106827 -106244 -96673 -87174
10430 -87174 -79045 -66818 -73918 -75790 -38550 -21312 -26562 -14604 48464 119272 100847 38476
10418 38476 64476 78097 114201 37538 22871 48871 5724 -10488 33665 14072 -7380 -21156
10406 -21156 -1959 31813 852 3132 -30275 6888 115407 96452 25512 -18484 -29818 -46311
10394 -46311 -10087 2788 -9927 16082 91981 135079 83815 39612 48190 1626 -39886 16172
10382 16172 78687 142721 118412 129614 184674 157339 120571 166364 220492 233710 218949 238809
10370 238809 217148 108837 51728 85810 113799 104948 141545 227339 337228 346734 334398
10359 334398 419493 414418 493259 581861 608378 722539 930543 1233084 1700967 2459211 3548448
10348 3548448 4906719 6511125 8182699 9941006 11643413 12981289 13763637 13997593
10340 13997593 13781011 13063469 11842027 10224645 8646125 7088799 5734780 4528831
10332 4528831 3398449 2563265 2034697 1645920 1378387 1194234 1047712 940438 868656
10323 868656 808508 785624 707813 651402 553559 458123 369062 320194 309780 295949 221827
10312 221827 192557 104782 61451 110576 178601 246193 296196 258167 176282 164837 181754
10301 181754 179837 132042 26870 12427 62699 97108 83328 89638 76521 94175 109438 84316
10289 84316 77198 116148 99014 111792 157768 77583 16317 40560 115041 100777 91388 114432
10277 114432 103530 102264 175910 202372 85563 39509 14738 -14055 12455 19356 31620 74630
10265 74630 105016 66618 47529 114959 58691 5171 82701 93422 25870 -17939 -22481 -61454
10253 -61454 -67641 -35948 -30359 -17216 -37710 -35932 -33013 -73173 -93226 12226 26171 1301
10241 1301 49434 32571 21030 1427 59459 72065 97701 -1165 -69677 -92752 -81501 -60423
10229 -60423 -11231 21819 28376 25877 30125 45787 35152 62318 92363 72837 126218 173753
10217 173753 105322 43939 -6547 -40530 -53834 -10741 -43635 -37619 29173 36671 35749 -10125
10205 -10125 -73473 -62679 -21788 -52318 1984 62690 156353 174585 124712 138743 163408 155554
10193 155554 130121 19638 17887 26909 72108 83809 43362 114680 164435 169158 73009 58870
10181 58870 95648 112118 81443 50057 81132 81421 75098 70515 77978 114325 29705 -11635 10348
10168 10348 53307 5962 -62658 -34258 -13623 -27998 25039 35562 31056 -2508 8635 30490
10156 30490 41582 72837 49388 38023 29647 46871 69571 75940 158925 127999 31034 2809
10144 2809 -15207 -2690 33996 89556 103592 90757 135272 128990 111040 83716 66153 -7672
10132 -7672 -41177 -867 9458 15072 56729 40667 72689 101019 49806 86375 145685 145417
10120 145417 142594 87659 52678 50292 72810 85018 19786 -44057 -42116 -8451 -4327 -39094
10108 -39094 -55009 -52460 -11252 11275 -13699 -78537 -33872 37570 81050 72089 48985 99158
10096 99158 105474 115235 191093 184513 71038 70059 149311 182396 144727 111829 113434 121001 176746
10083 176746 254644 235140 243464 297905 296240 319681 325842 349605 445748 607336 823444 943060
10071 943060 938548 940155 926130 940437 1126018 1439637 1753672 2233131 2926426 3798065 5082089
10060 5082089 7200226 10806889 17921390 32692521 57883281 74987278 69426697 52573503
10052 52573503 33488840 20442041 13306759 9429242 7213244 5810614 4850885 4136028
10044 4136028 3499369 3026360 2724860 2429952 2078409 1803093 1628999 1559442 1520152 1444815
10034 1444815 1273286 1109060 930288 740744 707384 678327 622231 599403 477684 381843
10024 381843 446091 495642 465221 393773 378559 367570 328558 312096 326047 288655 289571 273773
10012 273773 305566 253427 227726 228076 183377 159377 109350 136576 165404 170384 185236 183234
10000 183234 196788 187703 166854 137465 136373 83485 53114 71937 49774 61465 96973 115306
9988 115306 153451 181359 119891 123706 113806 81440 65380 87425 80638 37043 26651 72828
9976 72828 76772 44269 93031 71953 38752 28286 9106 62246 93961 127784 130715 106537
9964 106537 80889 38624 8306 -18751 -39443 -49547 24202 119950 109067 111090 143833 148165
9952 148165 123685 106015 107920 31997 29168 -14640 19953 68328 46312 79395 52251 93763
9940 93763 194953 208347 144541 80309 103147 130220 152031 112229 122705 117725 107198 84553
9928 84553 88219 87339 89107 26200 -4816 -8580 -36200 -71032 -70268 -8453 18811 18742 18442 55028
9914 55028 19707 -37962 -22370 -24908 14589 67711 49045 74331 75768 44899 34941 48707
9902 48707 45723 -2824 -7393 80733 103019 54676 42267 64322 61576 36007 33812 43232 80838
9889 80838 38512 -13172 -7666 -21746 -12551 -14532 8022 71980 106979 104867 70567 1351 -51397
9876 -51397 -58048 -56285 -40570 -33772 -46008 -82167 -67693 -6620 26865 86989 84124 103304 78881
9863 78881 54960 48563 59898 96452 124821 96309 75829 68329 27948 40361 99726 81182
9851 81182 24923 -15703 9562 35722 80007 88035 91507 87065 45075 10863 -19054 -73727
9839 -73727 -8168 56956 20580 -57748 -83274 -69178 24484 53501 43237 28898 31133 60216
9827 60216 89141 71425 79371 62990 25124 11168 -1357 4675 -27018 -31673 -22499 9906 45729
9814 45729 106770 61182 20049 25782 -57957 -41792 -24056 -10264 -12436 26969 -26565 15663
9802 15663 56616 44811 54206 53384 153041 125184 66407 -9277 -81573 -94069 -65531 -35610
9790 -35610 -12428 -12803 -45305 5822 -10440 -52490 -64810 -6683 53797 32116 19122 11036
9778 11036 43564 38336 10165 41505 20143 43112 30569 -6583 14648 48758 40425 3057
9766 3057 7721 14233 -32837 -83853 -11012 39617 26695 -17094 668 38894 83894 70663
9754 70663 41017 40519 38603 72142 47892 -44181 -55219 -1499 33548 21676 26307 -18342 18828
9741 18828 20628 -26963 -45896 -42508 -87664 -77935 -75309 -35625 1567 55547 54046 11229 -33785
9728 -33785 -32471 -16092 -21568 -30525 -12526 -2049 -27708 -43652 -45966 -27364 -1580 35821 62695
9715 62695 93330 48203 36903 51194 -19522 -87336 -103156 -100327 -33138 2703 5002 22373
9703 22373 45443 42743 38225 -63121 -49996 -19055 -24129 -18865 -46230 -70338 -96996 -62965
9691 -62965 -80298 -42130 53855 98607 71810 35231 -67543 -72460 -55274 -24279 -22482 31010
9679 31010 100602 81231 70863 61200 70691 54403 48979 56132 92401 88505 73457 92919 110907
9666 110907 127151 115587 84403 30967 9123 -39185 -74215 -25141 37957 50265 11733 -58982
9654 -58982 21876 190362 226632 248630 201648 293936 341659 306387 228969 144351 116042 106484
9642 106484 89788 90938 90860 73902 -13878 -41776 -96139 -91974 -73689 -19219 -70625 -73494 -59152
9629 -59152 -28767 43974 100689 104164 82475 47268 28858 -2950 -40288 -27630 50642 54462
9617 54462 14232 -52277 -101394 -95179 -56771 -56666 -59306 -43620 -25640 27403 21950 16625 21735
9604 21735 43531 95363 85093 59750 -34852 -60537 -36657 13881 5645 -38376 -102685 -94398
9592 -94398 -79172 -14852 44437 44833 13319 18635 -36080 -109284 -103060 -24792 -18233 -42308 290
9579 290 9344 5318 -29096 -39084 -11730 -39300 -66833 -68442 33870 86334 78654 76570 104858
9566 104858 101832 14203 -52317 -70160 -89458 -72579 -55620 -1005 6728 15472 -28582 -73655
9554 -73655 -39663 -13950 -59209 -46380 44008 61044 16369 2104 -66011 -45291 -40589 -43634
$$ [...]
##END NTUPLES=NMR SPECTRUM
##END=
