##TITLE=Analysis number 328475
Compound Code cc 62603
Book Reference 494/172
Project Code adrs
Chemist Name craigr
##JCAMPDX= 6.0         $$ Bruker NMR JCAMP-DX V2.0
##DATA TYPE= NMR SPECTRUM
##DATA CLASS= NTUPLES
##ORIGIN= Bruker BioSpin GmbH
##OWNER= nmr
$$ XWIN-NMR		Version 3.5
$$ Thu Jun  7 11:41:08 2007 GMT Daylight Time (UT+1h)  MAYBRIDGE\nmr@NMR_250MHZ
##.OBSERVE FREQUENCY= 250.131544655141
##.OBSERVE NUCLEUS= ^1H
##.ACQUISITION MODE= SIMULTANEOUS (DQD)
##.ACQUISITION SCHEME= undefined
##.AVERAGES= 16
##.DIGITISER RES= 18
##SPECTROMETER/DATA SYSTEM= dpx250
##.PULSE SEQUENCE= zg30
##.SOLVENT NAME= CDCl3
##.SHIFT REFERENCE= (INTERNAL, CDCl3, 0, 16.522)
##AUDIT TRAIL= $$ (NUMBER, WHEN, WHO, WHERE, WHAT)
$$ ##TITLE= Audit trail, XWIN-NMR		Version 3.5
$$ ##JCAMPDX= 5.01
$$ ##ORIGIN= Bruker BioSpin GmbH
$$ ##OWNER= nmr
$$ C:\u/data/dgb/nmr/ADRS/500/pdata/1/auditp.txt
$$ ##AUDIT TRAIL=  $$ (NUMBER, WHEN, WHO, WHERE, WHAT)
(   1,<2007-06-07 11:40:24.89 +100>,<MAYBRIDGE\nmr>,<NMR_250MHZ>,
      <created by zg, POWCHK disabled, PULCHK disabled
       configuration hash MD5:
       76 6E 9A 78 1E 09 19 81 EC 84 63 8F B0 6A 59 2D
       data hash MD5: 64K
       9E E4 67 A4 B0 9A AF 17 2D CC F1 8D A5 13 88 21>)
(   2,<2007-06-07 11:40:39.70 +100>,<MAYBRIDGE\nmr>,<NMR_250MHZ>,
      <Start of raw data processing
       ef LB = 0.3 FT_mod = 6 PKNL = 1 SI = 32K 
       data hash MD5: 32K
       A4 89 4E EE 5F F7 6E 08 DF E5 EC 5C 7A 6E 27 CA>)
(   3,<2007-06-07 11:40:45.31 +100>,<MAYBRIDGE\nmr>,<NMR_250MHZ>,
      <apk 
       data hash MD5: 32K
       5E 0B 97 DC D9 51 AA 0A 94 10 34 27 D7 55 06 A9>)
(   4,<2007-06-07 11:40:46.94 +100>,<MAYBRIDGE\nmr>,<NMR_250MHZ>,
      <abs ABSG = 5 
       data hash MD5: 32K
       37 61 3E 58 F5 CE 7E 5B 3C 51 11 02 D6 D0 27 65>)
$$ ##END=
$$ 
$$ hash MD5
$$ E8 47 CE 42 6A F2 3F 37 F5 95 54 82 66 80 06 5F
##$RELAX= 
##$RELAX= 
##$RELAX= 
##$RELAX= 
##$RELAX= 
##$RELAX= 
##$RELAX= 
$$ Bruker specific parameters
$$ --------------------------
##$DU= <C:\u>
##$EXPNO= 500
##$NAME= <ADRS>
##$PROCNO= 1
##$TYPE= <nmr>
##$USER= <dgb>
##$AMP= (0..31)
100 100 100 100 100 100 100 100 100 100 100 100 100 100 100 100 100 100 
100 100 100 100 100 100 100 100 100 100 100 100 100 100 
##$AQSEQ= 0
##$AQ_mod= 3
##$AUNM= <au_zg>
##$AUTOPOS= <17 >
##$BF1= 250.13
##$BF2= 250.13
##$BF3= 250.13
##$BF4= 250.13
##$BF5= 500.13
##$BF6= 500.13
##$BF7= 500.13
##$BF8= 500.13
##$BYTORDA= 1
##$CFDGTYP= 0
##$CFRGTYP= 5
##$CHEMSTR= <none>
##$CNST= (0..31)
1 1 145 1 1 1 1 1 1 1 1 1 1 1 1 1 1 1 1 1 1 1 1 1 1 1 1 1 1 1 1 1 
##$CPDPRG= <>
##$CPDPRG1= <>
##$CPDPRG2= <>
##$CPDPRG3= <>
##$CPDPRG4= <mlev>
##$CPDPRG5= <mlev>
##$CPDPRG6= <mlev>
##$CPDPRG7= <mlev>
##$CPDPRG8= <mlev>
##$CPDPRGB= <>
##$CPDPRGT= <>
##$D= (0..31)
0 1 0 0 0 0 0 0 0 0.06 0 0 0 0 0 0 0.0002 0 0 0 0 0 0 0 0 0 0 0 0 0 0 
0 
##$DATE= 1181212823
##$DBL= (0..7)
120 120 120 120 120 120 120 120 
##$DBP= (0..7)
150 150 150 150 150 150 150 150 
##$DBP07= 0
##$DBPNAM0= <>
##$DBPNAM1= <>
$$ [...]
##$SUBNAM7= <"">
##$SUBNAM8= <"">
##$SUBNAM9= <"">
##$SW= 20.6930455092707
##$SWIBOX= (0..15)
0 0 3 0 0 0 0 0 0 0 0 0 0 0 0 0 
##$SW_h= 5175.983436853
##$TD= 65536
##$TD0= 1
##$TE= 297.16
##$TE2= 300
##$TE3= 300
##$TEG= 300
##$TL= (0..7)
0 120 120 120 120 120 120 120 
##$TP= (0..7)
150 150 150 150 150 150 150 150 
##$TP07= 0
##$TPNAME0= <>
##$TPNAME1= <>
##$TPNAME2= <>
##$TPNAME3= <>
##$TPNAME4= <>
##$TPNAME5= <>
##$TPNAME6= <>
##$TPNAME7= <>
##$TPOAL= (0..7)
0.5 0.5 0.5 0.5 0.5 0.5 0.5 0.5 
##$TPOFFS= (0..7)
0 0 0 0 0 0 0 0 
##$TUNHIN= 0
##$TUNHOUT= 0
##$TUNXOUT= 0
##$USERA1= <user>
##$USERA2= <user>
##$USERA3= <user>
##$USERA4= <user>
##$USERA5= <user>
##$V9= 5
##$VALIST= <valist>
##$VCLIST= <CCCCCCCCCCCCCCC>
##$VD= 0
##$VDLIST= <DDDDDDDDDDDDDDD>
##$VPLIST= <PPPPPPPPPPPPPPP>
##$VTLIST= <TTTTTTTTTTTTTTT>
##$WBST= 1024
##$WBSW= 4
##$XGAIN= (0..3)
0 0 0 0 
##$XL= 0
##$YL= 0
##$YMAX_a= 327414
##$YMIN_a= -253590
##$ZGOPTNS= <>
##$ZL1= 120
##$ZL2= 120
##$ZL3= 120
##$ZL4= 120
##$ABSF1= 16.522
##$ABSF2= -4.171173
##$ABSG= 5
##$ABSL= 3
##$ALPHA= 0
##$AQORDER= 0
##$ASSFAC= 0
##$ASSFACI= 0
##$ASSFACX= 0
##$ASSWID= 0
##$AUNMP= <proc_1d>
##$AZFE= 0.1
##$AZFW= 0.1
##$BCFW= 0
##$BC_mod= 0
##$BYTORDP= 0
##$COROFFS= 0
##$CY= 12.5
##$DATMOD= 1
##$DC= 0
##$DFILT= <>
##$DTYPP= 0
##$F1P= 14.0000005364418
##$F2P= -0.99999901652339
##$FCOR= 0.5
##$FTSIZE= 32768
##$FT_mod= 6
##$GAMMA= 0
##$GB= 0
##$INTBC= 1
##$INTSCL= 1
##$ISEN= 128
##$LB= 0.3
##$LEV0= 0
##$LPBIN= 0
##$MAXI= 10000
##$MC2= 0
##$MEAN= 0
##$ME_mod= 0
##$MI= 0
##$NCOEF= 0
##$NC_proc= -4
##$NLEV= 6
##$NOISF1= 0
##$NOISF2= 0
##$NSP= 0
##$NTH_PI= 0
##$NZP= 0
##$OFFSET= 16.522
##$PC= 1
##$PHC0= -54.32842
##$PHC1= 6.990502
##$PH_mod= 1
##$PKNL= yes
##$PPARMOD= 0
##$PSCAL= 4
##$PSIGN= 0
##$REVERSE= no
##$SF= 250.13
##$SI= 32768
##$SIGF1= 0
##$SIGF2= 0
##$SINO= 400
##$SIOLD= 32768
##$SREGLST= <1H.CDCl3>
##$SSB= 0
##$STSI= 32768
##$STSR= 0
##$SW_p= 5175.98343685301
##$SYMM= 0
##$S_DEV= 0
##$TDeff= 65536
##$TDoff= 0
##$TI= <Analysis number 999999
Compound Code 99
Book Reference 9
Project Code 9>
##$TILT= no
##$TM1= 0
##$TM2= 0
##$TOPLEV= 0
##$USERP1= <user>
##$USERP2= <user>
##$USERP3= <user>
##$USERP4= <user>
##$USERP5= <user>
##$WDW= 1
##$XDIM= 32768
##$YMAX_p= 561048256
##$YMIN_p= -223276
$$ End of Bruker specific parameters
$$ ---------------------------------
##NTUPLES= NMR SPECTRUM
##VAR_NAME=  FREQUENCY,     SPECTRUM/REAL,   SPECTRUM/IMAG
##SYMBOL=    X,             R,               I
##VAR_TYPE=  INDEPENDENT,   DEPENDENT,       DEPENDENT
##VAR_FORM=  AFFN,          ASDF,            ASDF
##VAR_DIM=   32768,         32768,           32768
##UNITS=     HZ,            ARBITRARY UNITS, ARBITRARY UNITS
##FACTOR=    0.157963299565203, 1,           1
##FIRST=     4132.6476996994, 0,             0
##LAST=      -1043.33573715361, 0,           0
##MIN=       -1043.33573715361, -223276,     0
##MAX=       4132.6476996994, 561048256,     0
$$ Real data points
##PAGE= N=1
##DATA TABLE= (X++(R..R)), XYDATA
$$ [...]
16243c6000L0748m3361m9343K884L3320j112Q024M6554J5947j3280n0652j6993
$$ -36000 -5252 -48613 -97956 -95072 -61752 -62864 -54840 -8286 7661 -5619 -56271 -73264
16231g3264K4462l8682m1625N2598L0295j6386K6633j2499J5909J36556k1795
$$ -73264 -48802 -87484 -129109 -76511 -46216 -62602 -35969 -48468 -32559 103997 82202
16220H2202o5619k1914N5078m9332j3957R113P353j8275L0036J2885k6041L222
$$ 82202 16583 -5331 49747 415 -13542 -4429 2924 -15351 14685 27570 1529 4751
16208D751n974j9333J1276K7341M1831j9474l3136o117l4299N8399k796j1842
$$ 4751 -1223 -20556 -9280 18061 59892 40418 7282 1165 -33134 25265 22469 10627
16196A0627l3782L1057j2605m4388r290K2540K333k8462K0711p0381k481J9665
$$ 10627 -23155 7902 -4703 -49091 -58381 -35841 -33508 -61970 -41259 -111640 -114121 -94456
16184i4456N5358M7760n7165q8143l6221L617P4256L1076J6940O460Q72J8835
$$ -94456 -39098 8662 -48503 -136646 -172867 -169250 -94994 -63918 -46978 -40518 -39646 -20811
16172b0811k857K1992l762k2297K7410Q0499k1668j0268K2961m4065J8598j7273
$$ -20811 -23668 -1676 -5438 -27735 -325 80174 58506 48238 71199 27134 45732 28459
16160B8459k402q297O3755l6036l1721O2330n845k2274k5425m5774j363k5416
$$ 28459 26057 17760 81515 45479 13758 76088 70243 47969 22544 -23230 -24593 -50009
16148e0009K1632k4885l8147j0869R5562K5825R84p4381k701K8437k4945k1065
$$ -50009 -28377 -53262 -91409 -102278 -6716 19109 20093 -54288 -56989 -28552 -53497 -74562
16136g4562o37K5854O9598L5314k5624j7795m3047j73K9650k9924n4382j9400
$$ -74562 -75199 -49345 20253 55567 29943 12148 -30899 -31072 -1422 -31346 -85728 -105128
16124a05128L1284M005M3800j7381m8022j125j754m9860J1146L0709Q5047L7990
$$ -105128 -73844 -69839 -26039 -43420 -91442 -92567 -94321 -144181 -133035 -102326 -17279 20711
16112B0711M6210j5236n3633j5374l1095L1920K8608O882J8841k7069j7631p8405
$$ 20711 66921 51685 -1948 -17322 -48417 -16497 12111 18993 37834 10765 -6866 -85271
16100h5271k6839K0364o2216O6050J9783J0234K0991j8598N1416r140J344j395
$$ -85271 -112110 -91746 -153962 -87912 -68129 -57895 -36904 -55502 -4086 -13226 -11882 -13277
16088a3277L3671k7603j7840l957J861Q193k740M7187L5702L4326J7954j3965
$$ -13277 20394 -7209 -25049 -29006 -27145 -18952 -21692 25495 61197 95523 113477 99512
16076I9512l8788O739k8838l9782n2544l5719k5012K1849O3936N268K1147j406
$$ 99512 60724 67463 38625 -1157 -53701 -89420 -114432 -92583 -28647 -23379 -2232 -3638
16064c638p498J5558J2187L0789L4995O038M6686k9171j7660q066J1135p729l8973
$$ -3638 -11136 4422 16609 47398 82393 88431 135117 105946 88286 80220 91355 83626 44653
16051D4653n6554K896M7776n5819j9073l0193n706N4600L1250j3715k0484L160
$$ 44653 -11901 -9005 38771 -17048 -36121 -66314 -72020 -17420 13830 115 -20369 -17209
16039a7209M5978J491J4471k5431m2967r0418j3517M6909N6419L7239O441N3431
$$ -17209 28769 30260 44731 19300 -23667 -114085 -127602 -80693 -24274 12965 19406 72837
16027G2837J3826k2449l1803j9853J3944Q083n9312k0539J5461k6396L1084N240
$$ 72837 86663 64214 32411 12558 26502 34585 -24727 -45266 -29805 -56201 -25117 -19877
16015a9877R019K9720K4654k076m3926j4722N301L0952m1806K145Q934l4218K8521
$$ -19877 -10858 18862 43516 41440 -2486 -17208 -11907 19045 -22761 -20616 -11682 -45900 -17379
16002a7379L3616m2198k8720k3789O2340L9457j3287k0504J8372J6704N844n7415
$$ -17379 16237 -25961 -54681 -78470 -16130 23327 10040 -10464 7908 24612 30456 -26959
15990b6959J4357N1940J3250m7005p4470p8798o2015l379O6869J04210O9770l2523
$$ -26959 -12602 39338 52588 5583 -68887 -147685 -209700 -213079 -146210 -42000 27770 -4753
15978d753n6832j1154o3280K5032N915j8714M4015k0605J5329n036K1196j3973
$$ -4753 -61585 -72739 -136019 -110987 -105072 -123786 -79771 -100376 -85047 -90083 -68887 -82860
15966h2860K325K5094J9756M415j4167L0557p889K7700m3598J1064n334j357K0026
$$ -82860 -80535 -55441 -35685 -31270 -45437 -14880 -22769 4931 -38667 -27603 -32937 -34294 -14268
15953a4268K8580K1602J4983J563J2442l3681l3456L5012Q956q760M4684m133
$$ -14268 14312 35914 50897 52460 64902 31221 -2235 32777 41733 32973 77657 73524
15941G3524J2432j7551n3556k6111O140M9791o4335n1301k7560k4081l886L6128
$$ 73524 85956 68405 14849 -11262 -5122 44669 -19666 -70967 -98527 -122608 -126494 -90366
15929i0366M9057M8894Q29k2896k2595Q8886J1642n0901L543q125k1461L3757
$$ -90366 -41309 7585 8414 -14482 -37077 51809 63451 12550 16093 7968 -13493 20264
15917B0264M9393j5887n7795j4435m1604l8800Q826M9982N6338K3576k6132l1844
$$ 20264 69657 53770 -4025 -18460 -60064 -98864 -90038 -40056 16282 39858 13726 -18118
15905a8118K2219k0348m5254m2782L4688L6932r26j19891k950P1520M6904l0572
$$ -18118 4101 -16247 -61501 -104283 -69595 -32663 -33589 -153480 -156430 -84910 -38006 -68578
15893f8578p6196O3559K5032P374N1343L9468J0778k6159J4930o745j0269J4795
$$ -68578 -144774 -81215 -56183 -48809 2534 42002 52780 26621 41551 34806 24537 39332
15881C9332M1394k263k2562n95l8844l1223p107l0681L7246L8642k4330o2343
$$ 39332 80726 78463 55901 55306 16462 -14761 -21868 -52549 -15303 23339 -991 -63334
15869f3334k5798L4287O5508K0928K424L48m5972j5088J988o7251l1045K2818
$$ -63334 -89132 -54845 10663 31591 34015 34363 -11609 -26697 -24709 -91960 -123005 -100187
15857a00187P1603M8175K7242k3663J2379j7822n2959q6k3282k3173K8826K0181
$$ -100187 -28584 19591 46833 23170 35549 17727 -35232 -35318 -58600 -81773 -52947 -32766
15845c2766K5247l690m7869l7696L1353k1412O0928R8599J7344K7088m8538p1936
$$ -32766 -7519 -11209 -59078 -96774 -65421 -86833 -25905 72694 90038 117126 68588 -3348
15833c348N5565Q377j6235R350M7384N5978o1755j09219o5106N8371R1704k4898
$$ -3348 52217 60594 44359 53709 101093 157071 95316 -13903 -79009 -20638 71066 46168
15821D6168q4609n0336J3529J8866K4214O8777O281j1221J7777j7025J2071j9764
$$ 46168 -38441 -88777 -75248 -56382 -32168 36609 42890 31669 49446 32421 44492 24728
15809B4728M8259L1497m0334m5799K1724k2131q56j2462j0521k1956m0669J672
$$ 24728 72987 104484 64150 18351 40075 17944 17088 4626 -5895 -27851 -68520 -66848
15797f6848O7627k2836j4154k1167J4352k4027k5633L3016M1051j8265P210J4695
$$ -66848 779 -22057 -36211 -57378 -43026 -67053 -92686 -59670 -18619 -36884 -29674 -14979
15785a4979L1515L7222k9313K0884J9530M583j2185o104j2533O339l1308m931
$$ -14979 16536 53758 24445 45329 64859 69442 57257 51153 38620 44959 13651 8720
15773H720J7864N209m3832n2941m1449N4451R4816R554l0156l3505p456j4572
$$ 8720 26584 31793 -12039 -64980 -106429 -51978 42838 52392 22236 -11269 -18725 -33297
15761c3297j1274M1404k7074m2484J8651r066M6912K3022l0383m2721o7510j6749
$$ -33297 -44571 -3167 -30241 -72725 -54074 -63140 -16228 6794 -23589 -66310 -133820 -150569
15749a50569K9373K9392j47k9239K1340N4836j1184N3787J291k0494l2806k8010
$$ -150569 -121196 -91804 -91951 -121190 -99850 -45014 -56198 -2411 -1120 -21614 -54420 -82430
15737h2430m427L509L4310K2306n256l3456L6021N1550Q761l252r8692k1032K5566
$$ -82430 -86857 -83348 -49038 -26732 -31988 -65444 -29423 22127 30888 27636 -71056 -92088 -66522
15724f6522O0273L2395n9527l3135p791L0358J4431L9496p019n9306M3357N1935
$$ -66522 -6249 26146 -33381 -66516 -74307 -43949 -29518 9978 2959 -56347 -12990 38945
15712C8945k3223m8195K8967N5699r03n0156n2244r615k5893l1033k6641N5664
$$ 38945 15722 -32473 -3506 52193 51290 1134 -51110 -60725 -86618 -117651 -144292 -88628
15700h8628M6220P142L4823k3314j2153k1457L9790Q1853J7774n3984k6724m4069
$$ -88628 -42408 -35266 -443 -23757 -35910 -57367 -17577 64276 82050 28066 1342 -42727
15688d2727l5569J9941P6665J5419j86N3550O083p5434j6365J1669O50o66k3187
$$ -42727 -78296 -58355 18310 33729 33543 87093 93176 17742 1377 13046 13696 13030 -10157
15675a0157j6875J0936l0521p6419K4764J0171j3090K0672J3266K4314j0371O1022
$$ -10157 -27032 -16096 -46617 -123036 -98272 -88101 -101191 -80519 -67253 -42939 -53310 7712
15663G712N9414j4568m5875q2035J4448M663L5817O8154l4502K8681K4809k1438
$$ 7712 67126 52558 6683 -75352 -60904 -56241 -20424 47730 13228 41909 66718 45280
15651D5280n3800m2826j8585K181N5816N9022l7553J126K2634R90n4429j7453
$$ 45280 -8520 -51346 -69931 -67750 -11934 47088 9535 10661 33295 34285 -20144 -37597
15639c7597L2059j3461j4858J8093m951k1676L6939O7371J8910j6222m15m1725
$$ -37597 -5538 -18999 -33857 -15764 -20715 -42391 -5452 61919 80829 64607 64192 22467
15627B2467j1854J6463n804O443k0561j7565N7241j9476n6630j1621J0687l4791
$$ 22467 10613 27076 21272 27715 7154 -10411 46830 27354 -29276 -40897 -30210 -65001
15615f5001K7011J1228m8316K1376N615M4345K7630k8907m1659j2451m232P175
$$ -65001 -37990 -26762 -75078 -53702 -48087 -3742 23888 -5019 -46678 -59129 -63361 -56186
15603e6186j8754l991M7400J1428K4920O2565M6853k9151j07738o4016N6611P2731
$$ -56186 -74940 -78931 -31531 -20103 4817 67382 114235 85084 -22654 -86670 -30059 42672
15591D2672j6313k7637j0818L7731Q013n2646L4580j0234k0286L3681R019l1420
$$ 42672 26359 -1278 -12096 25635 33648 -18998 15582 5348 -14938 18743 27762 -3658
15579c658K0534K6277J1325K9513M593n1271k0796J5464J9994m5758j7583j7146
$$ -3658 16876 43153 54478 83991 88584 37313 16517 31981 51975 6217 -11366 -28512
15567b8512N9197m365p2488n5578P1040M8193p8378m6833j1026J2102n817P1335
$$ -28512 30685 26320 -46168 -101746 -30706 17487 -60891 -107724 -118750 -106648 -112465 -41130
15555d1130K3033K67j242p0505j1340K4209P9892P187j4902O9324N1572j7512
$$ -41130 -18097 -17830 -19072 -89577 -100917 -76708 3184 10371 -4531 64793 116365 98853
15543I8853q6936p0772k9907l7072R639N4669L4330J6345R153l8720M4345k0540
$$ 98853 11917 -58855 -88762 -125834 -116195 -61526 -27196 -10851 -1698 -40418 3927 -16613
15531a6613q114J1203k5009n329L7733j5318j2833K3663l5887l7471J7566K9793
$$ -16613 -24727 -13524 -38533 -43862 -6129 -21447 -34280 -10617 -46504 -83975 -66409 -36616
15519c6616J1272K6664K4502k2521l6024l3957K6308j7806M110M9370M5806L8321
$$ -36616 -25344 1320 25822 3301 -32723 -66680 -40372 -58178 -54068 -4698 41108 79429
15507G9429J870j3571k9997o3547l2991m8876J9877Q734O3422k242o3349J0945
$$ 79429 81299 67728 37731 -25816 -58807 -107683 -87806 -79072 -15650 -17892 -81241 -70296
15495g0296L1785m0250k9248K9004J7091J8146n9736K9267N5847K7560l1974m3481
$$ -70296 -38511 -78761 -108009 -79005 -61914 -43768 -103504 -74237 -18390 9170 -22804 -66285
15483f6285r63J1935k762L3286j348P0617K9933l8097k09L135M3378k1146q3444
$$ -66285 -67248 -55313 -58075 -24789 -26137 44480 74413 36316 36107 39242 82620 61474 -21970
15470b1970m872P904k0890N5103k8964p1287K1852M2268M8780j6851l8080j0711
$$ -21970 -26842 -18938 -39828 15275 -13689 -84976 -63124 -20856 27924 11073 -27007 -37718
15458c7718j3621o080J7058L0583j6802j5130O7740K1426m8571J5881o235K6758
$$ -37718 -51339 -57419 -40361 -9778 -26580 -41710 26030 47456 -1115 14766 8531 35289
15446C5289o834n4211k3423K2119l4996n5303N3126L9653Q931K528J5934J7939
$$ 35289 28455 -25756 -49179 -27060 -62056 -117359 -64233 -24580 -15649 -13121 2813 20752
15434B0752Q438O309J3744o951n0529k0499P285L713l9247K3988p360j7284M7448
$$ 20752 29190 35499 49243 42292 -8237 -28736 -21451 -17738 -56985 -32997 -40357 -57641 -10193
15421a0193K3339L4476j1238K911k6440K2248J4333k7793P841m6843K0548j9170
$$ -10193 13146 47622 36384 39295 12855 35103 49436 21643 29484 -17359 3189 -15981
15409a5981l8333M963M0578P6510J6907l8681l1558k7154M0226J8571n3172m7100
$$ -15981 -54314 -49351 -8773 67737 84644 45963 14405 -12749 27477 46048 -7124 -54224
15397e4224k0186L0161j6214L2326j2692K9050K7411m7745k4626m0019k6558J3007
$$ -54224 -74410 -44249 -60463 -28137 -40829 -11779 15632 -32113 -56739 -96758 -123316 -110309
15385a10309J5355L7231P3793P006l1759M5721L6283L4383M9598l6241o0686l8331
$$ -110309 -94954 -57723 16070 23076 -8683 37038 73321 107704 157302 121061 60375 22044
15373B2044m4346L3014J0519r92p59K2493j817n4639o291J6863k6858l14J9995
$$ 22044 -22302 10712 21231 20239 19480 41973 40156 -14483 -20774 -3911 -30769 -31083 -11088
15360a1088K3263m478n980l5697j7291O2130N8482O1127K172L297L0205M894l1318
$$ -11088 12175 7697 1717 -33980 -51271 10859 69341 130468 132640 135937 166142 171036 139718
15347A39718o4915r946L7306k4566m9935M0743k9518o9264k4154K0361l2645k910
$$ 139718 74803 64857 102163 77597 27662 68405 38887 -30377 -54531 -34170 -66815 -69725
15335f9725J4709L1296J9213P166L2415K8160k6406j1820J1888m2725j050p206
$$ -69725 -55016 -23720 -4507 2659 35074 63234 36828 25008 36896 -5829 -6879 -14085
15323a4085q42m6470n6213M6406L0703J2656k9838j352l5867J6861L7871L8329
$$ -14085 -14927 -61397 -117610 -71204 -40501 -27845 -57683 -59035 -94902 -78041 -40170 -1841
15311a841K7888j1628M6045N215M2973k9223o1804n7988l9768L6626M67J9099
$$ -1841 26047 14419 60464 65679 108652 79429 17625 -40363 -80131 -43505 -43038 -23939
15299b3939O7560J2049j5452Q053j4169j7202m7692r139q628l8834O146R1643
$$ -23939 43621 55670 40218 48271 34102 16900 -30792 -39931 -48559 -87393 -81247 10396
15287A0396R9702j3492j9752P479K6171n1885k1146o6091p850J6568J878o682
$$ 10396 110098 96606 76854 84333 110504 58619 37473 -28618 -36468 -19900 -18022 -24704
15275b4704L1919L3579j6133q6314m8216O251P8898o3862O629N8708N2072J9492
$$ -24704 7215 40794 24661 -61653 -109869 -103618 -24720 -88582 -81953 -23245 28827 48319
15263D8319j3379n057K5050J8840m0431q2350j5193m6507k5688N4187Q0657K834
$$ 48319 34940 29883 54933 73773 33342 -49008 -64201 -110708 -136396 -82209 -1552 1282
15251A282l687J2895J7316j2090j8450M5224J3192j0514l6861J0721J7393k4113
$$ 1282 -2405 10490 27806 15716 -2734 42490 55682 45168 8307 19028 36421 12308
15239A2308J8706j3828l9509P751l6945n0156L7046M480L0278l5670J2477L4126
$$ 12308 31014 17186 -22323 -14572 -51517 -101673 -64627 -60147 -29869 -65539 -53062 -18936
15227a8936l1496J3434K3261n949l559j6623M0530P0231l0419o0670m9768j0527
$$ -18936 -50432 -36998 -13737 -19686 -23245 -39868 662 70893 40474 -20196 -69964 -80491
15215h0491R5412O7516m3505J9539k7526l0731K4407K4481J8728K5353j0012o2860
$$ -80491 14921 82437 38932 58471 30945 214 24621 49102 67830 93183 83171 20311
15203B0311k4016J0206l8884J5527l7833j6303L3506P6834O309j7482l3894L4398
$$ 20311 -3705 6501 -32383 -16856 -54689 -70992 -37486 39348 45657 28175 -5719 28679
15191B8679m0885k1939j6010J0694k4906J842l0049l280j2904K2759N3280o9400
$$ 28679 -12206 -34145 -50155 -39461 -64367 -62525 -92574 -95854 -108758 -85999 -32719 -102119
15179a02119j7992L0347l35J6482j3876k0529L5356Q5103O9620m8463o6014j9244
$$ -102119 -120111 -89764 -90099 -73617 -87493 -108022 -72666 12437 82057 33594 -32420 -51664
15167e1664m6614j1136M8891P3536j0053n6989m7574K1599L3323J1810k7594Q3407
$$ -51664 -98278 -109414 -60523 13013 2960 -54029 -101603 -80004 -46681 -34871 -62465 20942
15155B0942N0716m9140L163K9231j7001j7647n7677n5293p939J00031O4489j4332
$$ 20942 71658 22518 25681 54912 37911 20264 -37413 -92706 -100645 -614 63875 49543
15143D9543k55o8286p6440k4637j2939J501N7561N6200M3259K2460M4942l8577
$$ 49543 49288 -18998 -95438 -120075 -133014 -131513 -73952 -17752 25507 47967 92909 54332
15131E4332k0025m064k5939K5790L9588n5711j28171K6593M0492j4688K3269L181
$$ 54332 34307 30243 4304 30094 69682 13971 -114200 -87607 -47115 -61803 -38534 -35353
15119c5353m0823N0239K8958k7170l0136j8252J8719l2371J2903l749L3175N5176
$$ -35353 -76176 -25937 3021 -24149 -54285 -72537 -53818 -86189 -73286 -77035 -43860 11316
15107A1316K5411P318n4178J9276k8864j3584j2727j067l0496m4144J1508Q891
$$ 11316 36727 44045 -10133 9143 -19721 -33305 -46032 -47099 -77595 -121739 -110231 -101340
15095a01340K4564L2919q999M333L2114J9412O2156L4828k4083N822m3036j3459
$$ -101340 -76776 -43857 -52856 -48523 -16409 3003 65159 99987 75904 81726 38690 25231
15083B5231l3218l358K9928M4305j9320m8599l8283l7634j4011M9708K6304L3408
$$ 25231 -7987 -11345 18583 62888 43568 -5031 -43314 -80948 -94959 -45251 -18947 14461
15071A4461j6597L6320m6329o321J7798k2604o3933N870Q578L6946P73m1644L0783
$$ 14461 -2136 34184 -12145 -18466 -668 -23272 -87205 -81335 -72757 -35811 -35038 -76682 -45899
15058d5899P7956j389m0748l0439M116L6044J3898k4419o5666M863N6586l528
$$ -45899 32057 30668 -10080 -40519 -36403 -359 13539 -10880 -76546 -71683 -15097 -18625
15046a8625m4947M1388L5072k6393l2078L5242j8754k8327K1558N2821L1568n2795
$$ -18625 -63572 -22184 12888 -13505 -45583 -10341 -29095 -57422 -35864 16957 48525 -4270
15034d270j3827K2812J8271K2281m0220p3932O326R9940L2999J4683j4885R303
$$ -4270 -18097 4715 22986 45267 5047 -68885 -62559 37381 70380 85063 70178 79481
15022G9481K3801l225O0165k7982j9532k4632l2145O782L3361J4629O517k7010
$$ 79481 103282 100057 160222 132240 112708 88076 55931 62713 96074 110703 117220 90210
15010I0210n5987k4406l3498O280P3576M97M2996M4223P275j1643K389Q350m1273
$$ 90210 34223 9817 -23681 -17401 56175 56672 99668 143891 151166 139523 141912 150262 108989
14997A08989j3773j21599K6289N8010k242R4L5104k8031n2982l4528n886j0604
$$ 108989 95216 -26383 -94 57916 55674 55768 90872 62841 9859 -24669 -30555 -41159
14985d1159O606Q2404k3395m8765k6341o2725J9946N2455n7295M2226N4837O347
$$ -41159 -34553 47851 24456 -24309 -50650 -113375 -93429 -40974 -98269 -56043 -1206 5141
14973E141o0708r857o3003k208Q2613N209K2490P5517M4473l0535q865l9572L1420
$$ 5141 -55567 -65424 -128427 -130635 -48022 -42813 -20323 55194 99667 69132 60267 20695 52115
14960E2115O1989q191n6838p177L1842k9959m0237n3427j8495L2355K3858k2908
$$ 52115 114104 105913 49075 41898 73740 43781 3544 -49883 -68378 -36023 -12165 -35073
14948c5073M2747j2708L1785K3467M0673K2431j4756o4071Q554n0175n6817O068
$$ -35073 7674 -5034 26751 50218 90891 113322 98566 34495 43049 -7126 -63943 -57875
14936e7875K1227J3031P7633r101l0691j6878K5976K5170j228j0077o6822m0860
$$ -57875 -36648 -23617 54016 44915 14224 -2654 23322 48492 47264 37187 -29635 -70495
14924g0495L1879L473n666J9516M3135r975l0835q51K9517M5282m9709j195m2513
$$ -70495 -38616 -35143 -40809 -21293 21842 11867 -18968 -19819 9698 54980 5271 4076 -38437
14911c8437J9127L609N290M393K2496L9831R236l8585M709l975k2135k7181m133
$$ -38437 -19310 -15701 -10411 -6018 16478 56309 65545 26960 31669 27694 5559 -21622 -25755
14898b5755m0326j470k2993R545O9372n4294p2298L944L0161Q195k5698M3221
$$ -25755 -66081 -67551 -90544 -80999 -11627 -65921 -138219 -134275 -104114 -95919 -121617 -78396
14886g8396R6171J9277k603O733n3055k1750n1886O4514M8602M117k0899L0987
$$ -78396 17775 37052 34449 41182 -11873 -33623 -85509 -20995 27607 31724 10825 41812
14874D1812K4786N8050n5386l2060q568l0560J3486L4936k8965l6052N3711J9063
$$ 41812 66598 124648 69262 37202 28634 -1926 11560 46496 17531 -18521 35190 54253
14862E4253O09m84O9093L2689l4522q0096p9262l1340M9152Q207k6918P871O090
$$ 54253 54862 54378 123471 156160 121638 41542 -37720 -69060 -19908 -11701 -38619 -30748 -24658
14849b4658o675K3667K5508K5998k9886j5829l8316l8475P4069O603j4979m4533
$$ -24658 -31333 -7666 17842 43840 13954 -1875 -40191 -78666 -4597 2006 -12973 -57506
14837e7506L1171O0816k8689n410M3853M785o717m2490j347L352O312K1817O0987
$$ -57506 -26335 34481 5792 382 44235 49020 42303 -187 -1534 1818 8130 29947 90934
14824I0934M095n7879p0471M7334k6941L1055j1479j9587L3904Q845j2266J1506
$$ 90934 95029 37150 -33321 14013 -12928 18127 6648 -12939 20965 29810 17544 29050
14812B9050L6219j8111k2452J2641l3566o675Q119k1386l0313J6313R514J611
$$ 29050 65269 47158 24706 37347 3781 -2894 5225 -16161 -46474 -30161 -20647 -19036
14800a9036R067K8209j3495P717k9432l2511j2729N4731J00796p548r9737Q882
$$ -19036 -9969 18240 4745 12462 -16970 -49481 -62210 -7479 93317 85769 -13968 -5086
14788e086M8385J8307j3260p7690l1551M5393N7576M0016m5263n7306j816M6242
$$ -5086 43299 61606 48346 -29344 -60895 -15502 42074 82090 36827 -20479 -22295 23947
14776B3947M3910m3259P31j1563P9152L351l7604l9117l1236p548J1491J13999
$$ 23947 67857 24598 25329 13766 92918 96269 58665 19548 -11688 -19236 -7745 106254
14764A06254k5790o1948j7467J0585L3612K2758K0574p5297m5107Q251R049j8130
$$ 106254 80464 18516 1049 11634 45246 68004 88578 13281 -31826 -23575 -14526 -32656
14752c2656P590k2652J7149K6359N735J6339Q391k920l7042M7291M7065J5516
$$ -32656 -25066 -47718 -30569 -4210 1525 17864 26255 23335 -13707 33584 80649 96165
14740I6165m9623m6825P507k2201m9826m8728l4050Q6433M8089J2493l0277K430
$$ 96165 46542 -283 7224 -14977 -64803 -113531 -147581 -61148 -13059 -566 -30843 -28413
14728b8413N9328M2847M6301m1947l3311o0826P737O201k6678k6709J8795J9517
$$ -28413 30915 73762 120063 78116 44805 -16021 -8284 -2083 -28761 -55470 -36675 -17158
14716a7158M0033K9051l8159j296Q93l2421M3708O443o218L1809k2150r864N7968
$$ -17158 22875 51926 13767 12471 13364 -19057 24651 31094 24876 56685 34535 24671 82639
14703H2639l6983l4310j1262J9142n7717L1615q949n7235J6108J7758K975q401
$$ 82639 45656 11346 84 19226 -38491 -6876 -15825 -73060 -56952 -39194 -36219 -44620
14691d4620K1907J9986q65M2636N2744l1173l8806k7043l0290j7048j2270N600
$$ -44620 -22713 -2727 -3592 39044 91788 60615 21809 -5234 -35524 -52572 -64842 -59242
14679e9242J3486K9912O413j1150L8754k8424K430q024k9999L4347N5117L489
$$ -59242 -45756 -15844 -9431 -20581 18173 -10251 -7821 -15845 -45844 -11497 43620 47109
14667D7109N5874M9673Q704k8446l6183m6921p5763K6383Q9420j6248q7744k5684
$$ 47109 102983 152656 161360 132914 96731 49810 -25953 430 89850 73602 -14142 -39826
14655c9826j5637K4760N9889j7369O556n0736n0180M6031M2929L8538o893m1391
$$ -39826 -55463 -30703 29186 11817 18373 -32363 -82543 -36512 6417 44955 38062 -3329
14643c329j4008r500l8672k7919J1800r272K3887M1915J2162k526l5656N2331
$$ -3329 -17337 -26837 -65509 -93428 -81628 -90900 -67013 -25098 -12936 -15462 -51118 1213
14631A213O0914n5149m2423J3906m8944o1700l1047O9100M0867N2379L660l6060
$$ 1213 62127 6978 -35445 -21539 -70483 -132183 -163230 -94130 -53263 -884 2776 -33284
14619c3284R971m0414Q102L262O5449J6984l5878k2521q509q089O5255L110M0218
$$ -33284 -23313 -63727 -55625 -52363 13086 30070 -5808 -28329 -36838 -44927 20328 23438 63656
14606F3656m9489j7855N2432L4377k7129k3458R446L144J0121J6818m0721k3961
$$ 63656 14167 -3688 48744 83121 55992 32534 41980 45124 55245 72063 31342 7381
14594G381l1618k3120K9710M9179L0102k41P4489R692p2634k7756J3681m1533
$$ 7381 -24237 -47357 -17647 31532 61634 61393 135882 145574 72940 45184 58865 17332
14582A7332q1N3586K5052p6169o1825k8263L7634M5459p908k4712l3156k5808
$$ 17332 17251 70837 95889 19720 -42105 -70368 -32734 12725 4817 -19895 -53051 -78859
14570g8859k5633N8105M1427N5090M7330l8758o0294q1546j0708M6648o016j74
$$ -78859 -104492 -46387 -4960 50130 97460 58702 -1592 -83138 -93846 -47198 -53214 -53388
14558e3388L0743k7870j8061L7075O518q840j7409j3057R421M3048O1833L512
$$ -53388 -22645 -50515 -68576 -31501 -24983 -33823 -51232 -64289 -54868 -11820 50013 53525
14546E3525O233n9118j4914M9294M9018m8178n1920K4460O3900K1753k1195q6514
$$ 53525 59758 640 -14274 35020 84038 35860 -16060 8400 72300 94053 72858 -13656
14534a3656k7062Q782J249L1277K7439J9362p2850K3830K5045N2509k3195m0376
$$ -13656 -40718 -31936 -30687 590 28029 47391 -25459 -1629 23416 75925 52730 12354
14522A2354l6717p132r816J6474l2285K9266k5245l3830P0859Q6960j7845K9215
$$ 12354 -24363 -31495 -41311 -24837 -57122 -27856 -53101 -86931 -16072 70888 53043 82258
14510H2258L3751m3680q6124k990P4328j1018k5019k5357N7569Q473k2139n6061
$$ 82258 116009 72329 -13795 -16785 57543 46525 21506 -3851 53718 62191 40052 -16009
14498a6009m2466j8174n716M0132M1115L0882K1880j0393K7997M3312l9014p8207
$$ -16009 -58475 -76649 -82365 -42233 -1118 29764 51644 41251 69248 112560 73546 -4661
14486d661r7141j2752Q3516N3752L3843l035l0925n4822J5531M5536J2927J7440
$$ -4661 -101802 -114554 -31038 22714 56557 53522 22597 -32225 -16694 28842 41769 59209
14474E9209n8726j8113o0283Q048M707q933M8157Q2108l560n258K6345l4062j7257
$$ 59209 483 -17630 -77913 -69865 -65158 -74091 -25934 56174 52614 47356 73701 39639 22382
14461B2382K603L0108N7145n3448n0045K4439o158k8073q742R078j6200k1467
$$ 22382 24985 55093 112238 58790 8745 33184 27026 -1047 -9789 -711 -16911 -38378
14449c8378R339N0560J9673j6212K206m5722J4896L1693j8359k0895M43J3858
$$ -38378 -29039 21521 41194 24982 27188 -18534 -3638 28055 9696 -11199 -10756 3102
14437C102J3152n4284J0778P5014m9006j9592L9413M0392k5900j6807J990j05
$$ 3102 16254 -38030 -27252 47762 -1244 -20836 18577 58969 33069 16262 18252 18147
14425A8147M5426l2138r6773l4736J8059L4461K4373m1406k6014J4971N4014O7964
$$ 18147 63573 31435 -65338 -100074 -82015 -47554 -23181 -64587 -90601 -75630 -21616 46348
14413D6348k4528j5801M2748L001p4999k1372L9461J4197l3533l173K8292M5687
$$ 46348 21820 6019 48767 51768 -23231 -44603 -5142 9055 -24478 -27651 641 46328
14401D6328M1187p1545q0837j5867J4379j8563P616L3971O5590j858k3564J6046
$$ 46328 87515 15970 -64867 -80734 -66355 -84918 -77302 -43331 22259 20401 -3163 12883
14389A2883M9140m6838k1461L3686J6462L4419j9967l4047K3225M1517J1511m4976
$$ 12883 62023 15185 -6276 27410 43872 78291 58324 24277 47502 89019 100530 55554
14377E5554m4766o3039O617J4575k396K1803O796J2081j2986o8600m037Q2609
$$ 55554 10788 -52251 -45634 -31059 -33455 -11652 -4856 7225 -5761 -74361 -78398 4211
14365D211O4599J4038n7410m9093K6934j81k8082k4170R127k6201M499j5868k1060
$$ 4211 68810 82848 25438 -23655 3279 3098 -24984 -49154 -40027 -66228 -61729 -77597 -98657
14352i8657J6072K3664j4622L8513N3845M7746J4073q80l1720l5997j5274k4295
$$ -98657 -82585 -58921 -73543 -35030 18815 66561 80634 79754 48034 12037 -3237 -27532
14340b7532N6217j2253r204O3587j1293j00878j314O3575m001J046J8645K0101
$$ -27532 28685 16432 7228 70815 59522 -41356 -42670 20905 16904 17950 36595 56696
14328E6696j0570o8271j9322O945J8058J7093J5856m1394j6663K2070L6768m2839
$$ 56696 46126 -22145 -41467 -34522 -16464 629 16485 -24909 -41572 -19502 17266 -25573
14316b5573p497J5533j4312k9657p6472j3397O1913n1953j1987M3689M7903N5345
$$ -25573 -33070 -17537 -31849 -61506 -137978 -151375 -89462 -141415 -153402 -109713 -61810 -6465
14304f465K5121k6263k9844K7771j9266p395K2628j8942K3148M1193M2543N3882
$$ -6465 18656 -7607 -37451 -9680 -28946 -36341 -13713 -32655 -9507 31686 74229 128111
14292A28111o5573o4559k8182M9653O107q2179j2784M7069L4229j7795l4062N2278
$$ 128111 62538 -2021 -30203 19450 25557 -56622 -69406 -22337 11892 -5903 -39965 12313
14280A2313J6757l5143m377J472k2039j3270J8637P0983m3987p182p012o936k6841
$$ 12313 29070 -6073 -10450 -8978 -31017 -44287 -25650 45333 1346 -5836 -12848 -19784 -46625
14267d6625k1479L8163O2216J7782j996n2278K9460j5711l0805K6251m6634l2983
$$ -46625 -68104 -29941 32275 50057 48061 -4217 25243 9532 -21273 4978 -41656 -74639
14255g4639q098n8517N948Q6319j449j6292K391K3112M8609Q466j9472J5942R626
$$ -74639 -82737 -141254 -135306 -48987 -50436 -66728 -64337 -41225 7384 15850 -3622 12320 21946
14242B1946n970k9198K2539J4254p226R20n9878j5112K9747N232j2259j8211O6933
$$ 21946 15976 -13222 9317 23571 16345 17265 -42613 -57725 -27978 -22746 -35005 -53216 13717
14229A3717M5385j637k72J868L837p4112k7163n380K5240J3233q745l152l3104
$$ 13717 59102 57465 57193 59061 62898 -11214 -38377 -43757 -18517 -5284 -14029 -17181 -50285
14216e0285m233M4934M0984j3043L869n889j3484L1585J4778l6997k8423p729
$$ -50285 -54518 -9584 31400 18357 22226 16337 2853 34438 49216 12219 -16204 -23933
14204b3933k75K978R741j7566j797M244j1339j1970l1615p49K3573m419L7041
$$ -23933 -24208 -21230 -11489 -29055 -30852 -26608 -37947 -49917 -81532 -82281 -58708 -63127 -26086
14191b6086P917L734n7988l4262O7N8603q695N6648M4628n570K881k9791n5306
$$ -26086 -18169 -14435 -72423 -106685 -106618 -48015 -56710 -62 44566 38996 41877 12086 -43220
14178d3220o0260R511l7601K1347O8455M2493L9166l1063q289Q6948n2045p7428
$$ -43220 -103480 -93969 -131570 -110223 -41768 725 39891 8828 539 87487 35442 -41986
14166d1986k8388j9131p662k547Q3645L6686K7909j9512L5588m487k9815N759
$$ -41986 -70374 -89505 -97167 -99714 -16069 20617 48526 29014 64602 60115 30300 36059
14154C6059m0524j0921m5507O340L2142N8973L6047k6178l9442p791k3014K7874
$$ 36059 -4465 -15386 -60893 -54553 -22411 36562 72609 46431 6989 -802 -23816 4058
14142D058O4956M9048l4030J1480o2293j6079l5302n9497M7120O1737L4026m9607
$$ 4058 69014 118062 84032 95512 33219 17140 -18162 -77659 -30539 31198 65224 15617
14130A5617o0194M3933r9J482L1031j0328p120j3740k8733J584J2855M7848K1447
$$ 15617 -44577 -644 -743 739 31770 21442 14322 582 -28151 -26567 -13712 34136 55583
14117E5583k2500n0721m444p826J1462K5286k6365p524R935K5530k535l9620l5998
$$ 55583 33083 -17638 -22082 -29908 -18446 6840 -19525 -27049 -17114 8416 5881 -33739 -69737
14104f9737k5278M5954M8892K1444m0146j8153M4656L8533m0662J1836m2534r598
$$ -69737 -95015 -49061 -169 21275 -18871 -37024 7632 46165 5503 17339 -25195 -34793
14092c4793K9588k886L3909r43k7632L1078J9175j1088k3324k0602r503o2977
$$ -34793 -5205 -8091 25818 24875 -2757 28321 47496 36408 13084 -7518 -17021 -79998
14080g9998J4430J9522j2420K266K8387o091O8474q070l386o6323O843j9998K228
$$ -79998 -65568 -46046 -58466 -56200 -27813 -33904 34570 26500 23114 -43209 -36366 -56364 -54136
14067e4136j1107L2138M7889L2338l9956m1360n310J3569J5294l2927J6964J7342
$$ -54136 -65243 -33105 14784 47122 7166 -34194 -39504 -25935 -10641 -43568 -26604 -9262
14055i262J026J5117m550m9243N5400P0962j178m4805l007J8869j6584l039p945
$$ -9262 -8236 6881 2331 -46912 8488 79450 78272 33467 30460 49329 32745 29706 21761
14042B1761l0673P956m8905J2504P8181L6487r7678p6700k331K7311J1963O839
$$ 21761 -8912 -956 -49861 -37357 40824 77311 -20367 -97067 -99398 -72087 -60124 -53285
14030e3285M3689Q14j428n8639M4570k855l332k3366M8594N197K0190J0380J6494
$$ -53285 -9596 -8782 -10210 -68849 -24279 -27134 -30466 -53832 -5238 -41 20149 30529 47023
14017D7023L2527j5640j0982l0392j964M4847M706p7470K8307k2633j5202O8228
$$ 47023 79550 63910 52928 22536 20572 65419 70125 -7345 20962 -1671 -16873 51355
14005E1355l506m8341j6316J9571J0746n8981q624N3446L0939k7810r209j9991
$$ 51355 47849 -492 -16808 2763 13509 -45472 -54096 -650 30289 2479 -6730 -26721
13993b6721N7249M9226m6264m4656n3653j78J5547J8380l8542L9326K8335K2163
$$ -26721 30528 79754 33490 -11166 -64819 -64997 -49450 -31070 -69612 -30286 -1951 20212
13981B0212m292j6112L9758k2481m9714L0923N0452j8144p0568J448j250N8301
$$ 20212 15920 -192 39566 17085 -32629 -1706 48746 30602 -39966 -38518 -39768 18533
13969A8533j628k6916p3853p370K4195P015J0919k476J5817J0852l4293l6031
$$ 18533 16905 -10011 -83864 -91234 -67039 -60024 -49105 -51581 -35764 -24912 -59205 -95236
13957i5236Q175L5893K6008L9270k0342q55P9467l3719j3395m2861l9271M6958
$$ -95236 -87061 -51168 -25160 14110 -6232 -7087 72380 38661 25266 -17595 -56866 -9908
13945i908m1793J2774M0737L0712k6818o5341k8038J529M8772Q491n66J8724M012
$$ -9908 -51701 -38927 1810 32522 5704 -59637 -87675 -86146 -37374 -28883 -29449 -10725 -6713
13932f713k7180M6260k3644J5373J4939o896l258R913k4012m2480l0447j5603
$$ -6713 -33893 12367 -11277 4096 19035 12139 8881 18794 -5218 -47698 -78145 -93748
13920i3748M1520j887N6779M6159M0112j6365k1432M3134p975j8273m7003k4676
$$ -93748 -52228 -54115 2664 48823 88935 72570 51138 94272 86297 68024 21021 -3655
13908c655J6154J62p1112k9908K2495L150K5873N823M8829L5653m3802n4578p582
$$ -3655 12499 12661 -58451 -88359 -65864 -62714 -36841 -31018 17811 53464 9662 -44916 -52498
13895e2498j3885L5563M6705q762K7554k7980n229m5074N4518r057k7318m837
$$ -52498 -66383 -30820 15885 7123 34677 6697 1468 -43606 10912 1855 -25463 -30300
13883c0300N9419P645n7604m1011M2255K3406m9328j8321j1550l1896N2061K0926
$$ -30300 29119 36764 -20840 -61851 -19596 3810 -45518 -63839 -75389 -107285 -55224 -34298
13871c4298j4724J550P725j2870J1708L549Q202k7933k5636L4419L8631P06N6408
$$ -34298 -49022 -47472 -39747 -52617 -40909 -37360 -29158 -57091 -82727 -48308 -9677 -8971 47437
13858D7437q5879l5806L3556N2678K5706k3526n4706J1225K3545N669j8352M063
$$ 47437 -38442 -74248 -40692 11986 37692 14166 -40540 -29315 -5770 -101 -18453 -14390
13846a4390q127l4442J2090J0800K6190O2985M4167J0593m5589k5144L6644Q1824
$$ -14390 -22517 -56959 -44869 -34069 -7879 55106 99273 109866 64277 39133 75777 157601
13834A57601m5413o7624j8702L4755l594r2280k6761L4708J3971N2242M2091j2518
$$ 157601 112188 44564 25862 60617 57023 -35257 -62018 -27310 -13339 38903 80994 68476
13822F8476n3912m0803l9705j5960j3442O0587M4792P637J879k4790l7452k1575
$$ 68476 14564 -26239 -65944 -81904 -95346 -34759 10033 17670 19549 -5241 -42693 -64268
13810f4268j0277k6250L0226R5210J1880L90L3803r35n8003M650k1385k8468O4711
$$ -64268 -74545 -100795 -70569 24641 36521 36911 70714 69779 11776 16426 -4959 -33427 31284
13797C1284j0251N364j5161k5128o3314l1945K232O680M2853K0404J9464K4132
$$ 31284 21033 26397 11236 -13892 -77206 -109151 -106919 -100239 -57386 -36982 -17518 6614
13785F614n4364n491l1813j0757L7786K1914L4978M9114L5405k5481q191L8008
$$ 6614 -47750 -53241 -85054 -95811 -58025 -36111 -1133 47981 83386 57905 49714 87722
13773H7722n3370M8285J0344q101o0370n725l6045m4340n6541P8444N0210K415
$$ 87722 34352 82637 92981 84880 24510 18785 -17260 -61600 -118141 -39697 10513 12928
13761A2928J1743P56L5428l414l4106l7345O1080L6443j8588M9383L4530m2456
$$ 12928 24671 25427 60855 57441 23335 -14010 47070 83513 64925 114308 148838 106382
13749A06382o043L526j1607l7814R971M2488k6909j9417l4020j0880K5568m3565
$$ 106382 100339 103865 92258 54444 64415 106903 79994 60577 26557 15677 41245 -2320
13737b320Q905J5873k9394j4743k8881M2033M3242m9684J6850N2862L3402p219
$$ -2320 6585 22458 -6936 -21679 -50560 -8527 34715 -14969 1881 54743 88145 80926
13725H0926l0694O0890l402j6413r23k2463K921j0197l888m1705O4559K3256k4050
$$ 80926 50232 111122 107720 91307 90384 67921 70842 60645 56757 15052 79611 102867 78817
13712G8817L8399L3196j03969k5047p9849j9055O5699l062K9338L9524l5329q3288
$$ 78817 117216 150412 46443 21396 -58453 -77508 -11809 -14871 14467 53991 18662 -64626
13700f4626K8708M9781k4743J3033l3957k7674P6555L1200k964L2490l0265k2868
$$ -64626 -35918 13863 -10880 2153 -31804 -59478 17077 48277 45313 77803 47538 24670
13688B4670J2285L5445J259k9773J2573j5824k5465L52L4981L4919j9725m4346
$$ 24670 36955 72400 73659 43886 56459 40635 15170 15522 50503 85422 65697 21351
13676B1351m9150L714J3587j017k3719o527M4541O232o3679l9407L2726L436o8864
$$ 21351 -27799 -24085 -10498 -11515 -35234 -41761 2780 9012 -54667 -94074 -61348 -57912 -126776
13663a26776L392J17246N7280l5728j0819K925J6841M178n7191J2660N0914J934
$$ -126776 -123384 -6138 51142 15414 4595 7520 24361 28539 -28652 -15992 34922 36856
13651C6856J9663j5382n3982n5928J5043R968L9188P255l7683J0875k6770o706
$$ 36856 56519 41137 -12845 -68773 -53730 -43762 -4574 2681 -35002 -24127 -50897 -57603
13639e7603P5312j6257l2496l7241n4779O386J4179L1516J4159k2834R804J2979
$$ -57603 17709 1452 -31044 -68285 -123064 -116678 -102499 -70983 -56824 -79658 -69854 -56875
13627e6875K9979l2458o4280K5953k4756l8658J05951J10312K9838J4118m1718
$$ -56875 -26896 -59354 -123634 -97681 -122437 -161095 -55144 55168 85006 99124 57406
13616E7406l0402l1901j0530O1776j7427o3669j6488l9689K2819N1365J8708m6027
$$ 57406 27004 -4897 -15427 46349 28922 -34747 -51235 -90924 -68105 -16740 1968 -44059
13604d4059j3468M1481m166l4400J4398L9893l1305j1127j0914J2125o4405p818
$$ -44059 -57527 -16046 -20212 -54612 -40214 -321 -31626 -42753 -53667 -41542 -105947 -113765
13592a13765J7389J2009O0858k4168l8723k405O4631m207l2166J22m9608K2730
$$ -113765 -96376 -84367 -23509 -47677 -86400 -88805 -24174 -28381 -60547 -60425 -110033 -87303
13580h7303O0641j8846R823J6213o2466L0764R8833K740J2781j6371j0004l7264
$$ -87303 -26662 -45508 -35685 -19472 -81938 -51174 47659 50399 63180 46809 36805 -459
13568d59n4153l4964n616j5510L3089k6722m883k456P4218M3776j8022M7928L9385
$$ -459 -54612 -89576 -95192 -110702 -77613 -104335 -109218 -111674 -37456 6320 -11702 36226 75611
13555G5611J5746k109L4855l1396r6527m3873j2769K1983K8067K07M265k9028
$$ 75611 91357 89248 124103 92707 -3820 -47693 -60462 -38479 -10412 -10205 -5940 -34968
13543c4968n7045L4944M8324j7259M145K8459k6721j2246J394j7882K5205K9492
$$ -34968 -92013 -57069 -8745 -26004 -21859 6600 -20121 -32367 -30973 -48855 -23650 5842
13531E842l0563L5098J4703o9123j7663J3795Q04O7743k095n0411J4698K7982
$$ 5842 -24721 10377 25080 -44043 -61706 -47911 -47107 20636 18541 -31870 -17172 10810
13519A0810O972k1744j3847N2191M2364q9254k1994Q6467R580J2479l2138l7973
$$ 10810 17782 -3962 -17809 34382 76746 -12508 -34502 51965 61545 74024 41886 3913
13507C913j5990N1530K7071j9032q602k9099q416l98P131J5933M740K2858k3198
$$ 3913 -12077 39453 66524 47492 38890 9791 1375 977 8108 24041 28781 51639 28441
13494B8441j5844Q76K4747m1746j2943O82O042L3959j4899k5655k0304K401N5502
$$ 28441 12597 13473 38220 -3526 -16469 -15787 -9745 24214 9315 -16340 -36644 -34243 21259
13481B1259q9527n1439O0548P2140K5763k9613l5421o252k321l5087j7287m0754
$$ 21259 -68268 -119707 -59159 12981 38744 9131 -26290 -32542 -34863 -69950 -87237 -127991
13469a27991J07056N7147k0509l7796j6429J5525K45j4006J1880p903k1180l6360
$$ -127991 -20935 36212 15703 -22093 -38522 -22997 -22752 -36758 -24878 -32781 -53961 -90321
13457i0321K1323L8760K2540k5187L6087K7794m0203k5758j1632K3466L9780O162
$$ -90321 -68998 -30238 -7698 -32885 3202 30996 -9207 -34965 -46597 -23131 16649 22811
13445B2811k6399o9751p0867L8974P8473L3739L9665K8355r822o241L2302O1330
$$ 22811 -3588 -73339 -144206 -105232 -26759 6980 46645 75000 65178 58937 91239 152569
13433A52569K5212r9268m5477J3256l9572n51M4504L4920q158n1175L6538j6936
$$ 152569 177781 78513 33036 46292 6720 6169 50673 85593 77435 26260 62798 45862
13421D5862k9858m9054J4353m0314m1486K1461M9031j2254r879K3641M5553R827
$$ 45862 16004 -33050 -18697 -59011 -100497 -79036 -30005 -42259 -52138 -28497 17056 26883
13409B6883k9451L0280m1036p786J9167P5154J209n3820j623l3831N238M1536
$$ 26883 -2568 27712 -13324 -21110 -1943 73211 74420 20600 18977 -14854 -9616 31920
13397C1920j7963M6555K2318n4339p7068M0888Q2206K0527n4903q694k6094q956
$$ 31920 13957 60512 82830 28491 -48577 -7689 74517 95044 40141 31447 5353 -3603
13385c603p318n9059O7999K4187j2679k0338K5478J037N775j6350j0789m895K6114
$$ -3603 -10921 -69980 -1981 22206 9527 -10811 14667 15704 21479 5129 -5660 -10555 15559
13372A5559J029m9427M2473k2068o0205n750L8900K3981K0664l367M9431L4429
$$ 15559 16588 -32839 9634 -12434 -72639 -78389 -39489 -15508 5156 1789 51220 85649
13360H5649j8631l5294m3515l4879l6601J8463P376r79n878L6188k9431m3328
$$ 85649 67018 31724 -11791 -46670 -83271 -64808 -57432 -58411 -64289 -28101 -57532 -100860
13348a00860Q19m6151K3308L1183L2077k363m0463J1562P5277J2646M7053m2923
$$ -100860 -100041 -146192 -122884 -91701 -59624 -61987 -102450 -90888 -15611 -2965 44088 1165
13336A165k1874J7424P900K9061j6272n859m3880J00189L8924l7081m6163j9028
$$ 1165 -20709 -3285 4615 33676 17404 11545 -32335 67854 106778 69697 23534 4506
13324D506J8081M7015n5619m4416J048O136N1645P4156K7014Q542k7133m3365
$$ 4506 22587 69602 13983 -30433 -29385 -23249 28396 102552 129566 138108 110975 67610
13312F7610l2081l3119o95j3605K2277N5619K0363j352p015q270J8474k3801j2807
$$ 67610 35529 2410 1715 -11890 10387 66006 86369 85017 78002 69732 88206 64405 51598
13299E1598j4969m0566O057n175k0903K2599P2902L9245J3429k7867j3103k3807
$$ 51598 36629 -3937 2120 -3055 -23958 -1359 71543 110788 124217 96350 83247 59440
13287E9440q557m2680k1239L7692k875l4263m1304J8864K7937J6517l9997q14
$$ 59440 50883 8203 -13036 24656 21781 -12482 -53786 -34922 -6985 9532 -30465 -31279
13275c1279N65k0813m5161m7209L1007L9392K3215K3737Q2247M8376p810m5315
$$ -31279 -30714 -51527 -96688 -143897 -112890 -73498 -50283 -26546 55701 104077 96267 50952
13263E0952m3497k179n0187K0393M5634L108j7555J3562L601r54N3643M1648L3672
$$ 50952 7455 5276 -44911 -24518 21116 24224 6669 20231 23832 22878 76521 118169 151841
13250A51841l3375o5742j8058p367o3980J0930L5513J5892M5606M610l3131j8149
$$ 151841 118466 52724 34666 27299 -36681 -25751 9762 25654 71260 75870 42739 24590
13238B4590K1767L8737n3240l0726K4862m2545K3396K5367j9065J2807K0164k5947
$$ 24590 46357 85094 31854 1128 25990 -16555 6841 32208 13143 25950 46114 20167
13226B0167m7533l0019p471M0713L072K3116M1973n2367k8532L5852O536n053
$$ 20167 -27366 -57385 -64856 -24143 -21071 2045 44018 -8349 -36881 -1029 5507 454
13214D54n302l2242J5734l809N352N5125N897M7469L4739L4120O3663J09967J58127
$$ 454 -4848 -37090 -21356 -25165 -19813 35312 41209 88678 123417 157537 221200 331167 489294
13201D89294J38973J71969O2381j79877k25402j65124j80765p4368l9944l066
$$ 489294 628267 800236 862617 682740 457338 292214 111449 37081 -2863 -5929
13191e929K1713L748m7805M938l9679N382K6019o785k5339j9339N0084M4713Q092
$$ -5929 15784 19532 -28273 -23335 -63014 -57632 -31613 -38398 -63737 -83076 -32992 11721 19813
13178A9813j1560k2034m92m640J6544L4635Q940J1099j2274l5806P503J40707
$$ 19813 8253 -13781 -14273 -18913 -2369 32266 41206 52305 40031 4225 11728 152435
13166A52435L3783j5429j5772m815O9395J05461R4413J67734K78111M54890N62831
$$ 152435 186218 170789 155017 150202 219597 325058 419471 587205 865316 1320206 1883037
13155A883037M03388K4434l61165n11895m66420l13966j40727j31834p1307r0721
$$ 1883037 2286425 2310859 1949694 1437799 971379 657413 516686 384852 313545 222824
13145B22824n8536q2155m0476l16O078K3698m4061j6902M3202n451J3385J5382
$$ 222824 164288 82133 41657 41341 47419 71117 27056 10154 53356 47905 61290 76672
13133G6672k0081L8121o8477j6609r629l0797M5571N7902N2913N094q331j0831
$$ 76672 56591 94712 26235 9626 -3 -30800 14771 72673 125586 130680 122349 111518
13121A11518j719J1414k4528M1841O859N5887J11421J61463K82204M31560O14938
$$ 111518 109799 121213 96685 138526 145385 201272 312693 474156 756360 1187920 1802858
13110A802858N09836Q6567k15662n19308n53054m14911j59475j29341j57295o3199
$$ 1802858 2312694 2399261 2183599 1664291 1111237 696326 536851 407510 250215 187016
13100A87016n2477k3166J9474l0229o1146k1282j0324k3420N219K9825m38l2268
$$ 187016 134539 111373 130847 100618 39472 18190 7866 -15554 -10335 19490 19052 -13216
13088a3216K3557N1124k658J0640l9121j0687R595r970K0183M350L735J6392L631
$$ -13216 10341 61465 58807 69447 30326 19639 29234 19264 39447 43797 47532 63924 67555
13075F7555m3705k8288j4066K7990N0527N8238M6823P1689R7339J83498J50392
$$ 67555 23850 -4438 -18504 9486 60013 118251 165074 236763 334102 517600 667992
13064F67992J18348p1270j48967j58443j11427j27600q3460q5411M4311O0525
$$ 667992 786340 715070 566103 407660 296233 168633 85173 -238 44073 104598
13054A04598l1183n8245k8211N9480O3414K6372k5749k2188J1910l85r4052k5626
$$ 104598 73415 15170 -13041 46439 109853 136225 110476 88288 100198 99813 5761 -19865
13042a9865O7565J0328n9826J0494O2132l8231l2990l0533M0666J36k1221R65
$$ -19865 47700 58028 -1798 8696 70828 32597 -393 -30926 9740 9876 -11345 -10380
13030a0380l1213L5553k7023J4783l1507q250L2777L3973m639k3391j8313j6993
$$ -10380 -41593 -6040 -33063 -18280 -49787 -58037 -25260 8713 4074 -19317 -37630 -54623
13018e4623L7622N3103Q761M754k7761m102N3551o0058m0337M3448J2937J2047
$$ -54623 -17001 36102 44863 49617 21856 17754 71305 11247 -29090 14358 27295 39342
13006C9342j5234k5036k1774l0611M392L3578N3140J6681K9227n8825j1975l9929
$$ 39342 24108 -928 -22702 -53313 -48921 -15343 37797 54478 83705 24880 12905 -27024
12994b7024n6854Q1888N1837j5790P361N89p0365j586k5820K0040O5339Q647n4842
$$ -27024 -83878 -1990 49847 34057 41418 42007 -28358 -29944 -55764 -35724 29615 38262 -16580
12981a6580K5752L0767m855l0761k8164P4197P961l6939M88k5388K0k5572l4608
$$ -16580 9172 39939 35084 4323 -23841 50356 58317 21378 21866 -3522 -3502 -29074 -63682
12968f3682P636j518m4229K9973K0583J0049L3691J2528N969Q1924J5964m2426
$$ -63682 -56046 -57564 -101793 -71820 -51237 -41188 -7497 5031 11000 92924 108888 66462
12956F6462m3515m1669k7540N1191O0754p369m1551L982j8291M2567l7926j4634
$$ 66462 22947 -18722 -46262 4929 65683 58314 16763 20745 2454 45021 7095 -7539
12944g539k2755M3085M5402O403n2409q483j5789K8173N0718L5289n3818p7802
$$ -7539 -30294 12791 58193 64596 12187 3704 -12085 16088 66806 102095 48277 -29525
12932b9525j4314j6250N9598N4461L8196J7274j6538o4244k8783j3360k9141K2752
$$ -29525 -43839 -60089 -491 53970 92166 109440 92902 28658 -125 -13485 -42626 -19874
12920a9874k8783k8976K7946L6087N8248L7030p336k2803J9029j4284N6282J7596
$$ -19874 -48657 -77633 -49687 -13600 44648 81678 74342 51539 70568 56284 112566 130162
12908A30162r11k1865l2905J5670J3533l1091m8364l7430M2287p85l7272K1146
$$ 130162 129251 107386 74481 90151 103684 72593 24229 -13201 29086 28301 -8971 12175
12896A2175p8522l5611N6617L1360L7546l405J8358j066r288k892l397M327j567
$$ 12175 -66347 -101958 -45341 -13981 23565 20160 38518 37452 28164 25272 21875 26202 24635
12883B4635l6375K0726q155m3910M546J1744J3990j7134M050L1926M5051k8980
$$ 24635 -11740 8986 831 -43079 -38533 -26789 -12799 -29933 -25883 6043 51094 22114
12871B2114J6732M1748j7250k2449n1445J6943m1358q1828K0483N6372L9895J5375
$$ 22114 38846 80594 63344 40895 -10550 6393 -34965 -116793 -96310 -39938 -43 15332
12859A5332l2815l2990j0564R726N5747k0180n7331o4305k0698M0963J05577N853
$$ 15332 -17483 -50473 -61037 -51311 4436 -15744 -73075 -137380 -158078 -117115 -11538 -5685
12847e685P999O7691Q141j9801q234O398J4831m5315L766l592k2859p1719o263
$$ -5685 2314 70005 78146 58345 50111 56509 71340 26025 29791 26199 3340 -68379 -74642
12834g4642M1522j8135L3346J5827l862l7277P260q381l4693j3651L2736L8353
$$ -74642 -33120 -51255 -17909 -2082 -5944 -43221 -35961 -44342 -79035 -92686 -59950 -21597
12822b1597M6894l7680Q8548J7824p8619m510K9671K6518K8785q940k4216n67
$$ -21597 25297 -12383 76165 93989 15370 10860 40531 67049 95834 86894 62678 62111
12810F2111o398l6704M397j2111L765k485J0978k4096j5240j7916j7577j4143
$$ 62111 55713 19009 23406 11295 15060 12575 23553 -543 -15783 -33699 -51276 -65419
12798f5419J1882J1370K8327k0311K0815M6882j9653n0341p524q211J777J758
$$ -65419 -53537 -42167 -13840 -34151 -13336 33546 13893 -36448 -43972 -52183 -50406 -48648
12786d8648O369J8289p1556k1355J6131L9188N8740N0895j6779p201j8052j0463
$$ -48648 -42279 -23990 -95546 -116901 -100770 -61582 -2842 48053 31274 24073 6021 -4442
12774d442k7047k8434K0023N4636J1559K0103k1074o4040m8421K8570Q1593k13
$$ -4442 -31489 -59923 -39900 14736 26295 46398 25324 -38716 -87137 -58567 23026 22813
12762B2813J0016l4691k5652p083j1526k7967k7010l3649j848O1330L8864M6716
$$ 22813 32829 -1862 -27514 -34597 -46123 -74090 -101100 -134749 -136597 -75267 -36403 10313
12750A0313o931L906L4039M114j1682l6983M5627j2061l8548M6309J4801q054
$$ 10313 3382 7288 41327 45441 33759 -3224 42403 30342 -8206 38103 52904 44850
12738D4850l5777k5231l9870L0545l3023n4834j683k1221N2020N4952L206k3012
$$ 44850 9073 -16158 -56028 -25483 -58506 -113340 -115023 -136244 -84224 -29272 -26066 -49078
12726d9078n0185J9001Q746J730J9882j0429r209j8917J0819N751J3523j2270
$$ -49078 -99263 -80262 -71516 -69786 -49904 -60333 -69542 -88459 -77640 -71889 -58366 -70636
12714g0636K1217N1902L4010J3249N7273O312j5221r411L316l7385k5939k0880
$$ -70636 -49419 2483 36493 49742 107015 113327 98106 88695 92011 54626 28687 7807
12702G807N290j9107N8002L9781j6521O814k2093j2053r1360j7575k1097j1286
$$ 7807 13097 -6010 51992 91773 75252 82066 59973 47920 -43440 -61015 -82112 -93398
12690i3398l7462J21N0538L9029M9439N4410N864o4121j8067q756J9936l4222
$$ -93398 -130860 -130739 -80201 -41172 8267 62677 68541 4420 -13647 -22403 -2467 -36689
12678c6689k0520N6238O3668L1616q997r157l4112o2353l8121K8548K6490l1999
$$ -36689 -57209 -971 62697 94313 85316 76159 42047 -20306 -58427 -29879 -3389 -35388
12666c5388j6101J415n3566K5061j6526j7889P7078L9291j4009J6134K0789l780
$$ -35388 -51489 -50074 -103640 -78579 -95105 -112994 -35916 3375 -10634 5500 26289 22509
12654B2509n1430Q415L7241J1094m9258j5738L7267L0886K7517k674N5229K767
$$ 22509 -28921 -20506 16735 27829 -21429 -37167 100 30986 58503 55829 111058 113825
12642A13825k5971p1188n567K2528L1350l3197P663p385k5758j3907K6640l814
$$ 113825 87854 16666 11099 33627 64977 31780 39443 32058 6300 -7607 19033 15219
12630A5219n9557o085M235J36J903J1009j5605n4927K6957q576P921L5456J9900
$$ 15219 -44338 -50423 -46188 -46052 -44149 -33140 -48745 -103672 -76715 -85291 -77370 -41914 -22014
12617b2014J292k9330l1041m3206m9402k029k0650R951N8174J8549J187J9279
$$ -22014 -20722 -50052 -81093 -124299 -173701 -175730 -196380 -186429 -128255 -109706 -108519 -89240
12605h9240O8870Q2470o0060l7734L4650K0423k2627j4734J608J2014o2239o451
$$ -89240 -20370 62100 2040 -35694 -1044 19379 -3248 -17982 -16374 -4360 -66599 -73050
12593g3050P64n588j847J3461k3611j5443P6682J7801m5011m8231K7370M1820
$$ -73050 -72286 -77874 -79721 -66260 -89871 -105314 -28632 -10831 -55842 -104073 -76703 -34883
12581c4883k6743P895L3885L8516R6095K0302p3735J8720L4127p269m5696N454
$$ -34883 -61626 -53731 -19846 18670 114765 135067 61332 80052 114179 106910 61214 66668
12569F6668L5997P67n6773M259J1397n6495j6273Q197j3549M5973L8233J266l2745
$$ 66668 102665 103432 46659 50918 62315 5820 -10453 -2256 -15805 30168 68401 69667 36922
12556C6922m1912k2058m2617K0705M5100J7035J8247n1572l1631O4467J9521P817
$$ 36922 -4990 -27048 -69665 -48960 -3860 13175 31422 -20150 -51781 12686 32207 40024
12544D0024L4090K9028j0167j6992J3292J7709o874p9026J5873R631m9756m1387
$$ 40024 74114 103142 92975 75983 89275 106984 100110 21084 36957 46588 -3168 -44555
12532d4555k1756M0216J6692J7048J8772l1551k0508R286K8834J4493Q525k8524
$$ -44555 -66311 -26095 -9403 7645 26417 -5134 -25642 -16356 12478 26971 35496 6972
12520F972j7402j7301J1973N4665Q0701p597n0176r3906k8744j5683P2576K7564
$$ 6972 -10430 -27731 -15758 38907 119608 112011 61835 -32071 -60815 -76498 -3922 23642
12508B3642j3184m650j3888J0426k3573P0143P1326m898m9862j583P049k8187
$$ 23642 10458 5808 -8080 2346 -21227 48916 120242 115344 65482 63899 70948 42761
12496D2761k2414M4791J2481m3703k0416M401O2030L8481m2952N47j6236K9371
$$ 42761 20347 65138 77619 33916 13500 17901 79931 118412 75460 76007 59771 89142
12484H9142k6397l2570N405n1685o0360m6221K1711K9808L3073M7614L4609N058
$$ 89142 62745 30175 35580 -16105 -76465 -122686 -100975 -71167 -38094 9520 44129 49187
12472D9187o1215k3186K772Q4144J3540q7022J2571J062L1094O001n8046j4219
$$ 49187 -12028 -35214 -32442 51702 65242 -21780 -9209 -8147 22947 28948 -29098 -43317
12460d3317M7993M8521N1090l0395o247J573j1953N619J7615L0982k8065j9672
$$ -43317 4676 53197 104287 73892 67645 69218 57265 62884 80499 111481 83416 63744
12448F3744l0115l3343j3301n1383J7229L6158k7866j9823j6411j9617M5725K6642
$$ 63744 33629 286 -13015 -64398 -47169 -11011 -38877 -58700 -75111 -94728 -49003 -22361
12436b2361M0146O47p9699q1019l0056N5348Q3862J0280o1846K5870K656l828
$$ -22361 17785 18432 -61267 -142286 -172342 -116994 -33132 -22852 -84698 -58828 -56172 -60000
12424f0000l575n4244M0354M4084K1313J3042O4996k5066m0922m9659m1268l3913
$$ -60000 -63575 -117819 -77465 -33381 -12068 974 65970 40904 -18 -49677 -90945 -124858
12412a24858K3680k116k46N7234J6600L697o805N987m161K9807O2810pj1773p5108
$$ -124858 -101178 -103294 -103540 -46306 -29706 -26009 -32814 -26827 -30988 -1181 61629 61622 49849 -25259
12398b5259R564r300j5016m056L3750L6467K6932k4735n404l2501m6456L4971
$$ -25259 -15695 -24995 -40011 -44067 -10317 26150 53082 28347 22943 -9558 -56014 -21043
12386b1043j5500P9842L3920r5057o5108R6781N8467K3907m794n7438n0958q552
$$ -21043 -36543 43299 77219 -17838 -82946 13835 72302 96209 91415 33977 -16981 -25533
12374b5533K5765M1953N1429j0975n4313J0k5708J9180L2368m0820N568O130j5770
$$ -25533 232 42185 93614 82639 28326 28336 2628 21808 54176 13356 18924 25054 9284
12361I284k07M456J0387m5386k8255N4084n0169p476j815O086L6330O0445R641
$$ 9284 9077 13533 23920 -21466 -49721 4363 -45806 -53282 -55097 -49011 -12681 47764 57405
12348E7405j1860n8206j0366L7287j0840n465Q769P628J3654L043m8655m833J7329
$$ 57405 45545 -12661 -23027 14260 3420 -2045 6724 14352 28006 31049 -17606 -22439 -5110
12335e110L5669N3596j2464r1508p9803k5783R5323r54m1593N1852P1926L143
$$ -5110 30559 84155 71691 -19817 -99620 -125403 -30080 -31034 -72627 -20775 51151 54294
12323E4294p5414P518k343l819K9559n0316M1820L7095n4481J4709M0056J0511
$$ 54294 -21120 -13602 -15945 -19764 9795 -40521 1299 38394 -16087 -1378 38678 49189
12311D9189J0486n3907m8368L6372M506q2119m1711O7751L4715l3686j9175K579
$$ 49189 59675 5768 -42600 -6228 -1722 -83841 -125552 -57801 -23086 -56772 -75947 -73368
12299g3368k0937l933P6039M5906J0423j0537n2901k1926K3461J248q641K0374
$$ -73368 -94305 -98238 -22199 23707 34130 23593 -29308 -51234 -27773 -26525 -35166 -14792
12287a4792k0974o004L1821Q873n7126l1141K845K7900l1591k844N5272N1638
$$ -14792 -35766 -41770 -9949 -1076 -58202 -89343 -86498 -58598 -90189 -93033 -37761 13877
12275A3877l6024p9K5784l3742J410j5508J4738k3480L9691P0739K161N0650M365
$$ 13877 -22147 -22226 3558 -30184 -28774 -44282 -29544 -53024 -13333 57406 59567 110217 114582
12262A14582m4178m3744Q882m4085J8032n838J3864k6250l9422j1301j2433L9212
$$ 114582 70404 26660 35542 -8543 9489 3651 17515 -8735 -48157 -59458 -71891 -32679
12250c2679J9298n4271J8028L0390j4561N6722J7066m1144P612M3689k8572M946
$$ -32679 -13381 -67652 -49624 -19234 -33795 22927 39993 -1151 6461 50150 21578 26524
12238B6524k9032j6480k2755O1652K8881n015n584m2935j0205L8786R854J0610
$$ 26524 -2508 -18988 -41743 19909 48790 43775 38191 -4744 -14949 23837 33691 44301
12226D4301m1926l199M6242K0541N288q0013p6059l63R1125J9638k766p3955m9771
$$ 44301 2375 -824 45418 65959 71247 -8766 -84825 -85188 5937 25575 22809 -51146 -100917
12213a00917J0206M7720J4325j3498j7528J2026N6820M1621j2274j7584N1727
$$ -100917 -90711 -42991 -28666 -42164 -59692 -47666 9154 50775 38501 20917 72644
12202G2644K2810p0271m0026k7846R372L4819K2553j3363l8175J6866O942M56
$$ 72644 95454 25183 -14843 -42689 -33317 1502 24055 10692 -27483 -10617 -3675 -3219
12190c219l616n3071K0181j1366L7327l6745m1856L5390J5941m8974L0320l1860
$$ -3219 -6835 -59906 -39725 -51091 -13764 -50509 -92365 -56975 -41034 -90008 -59688 -91548
12178i1548n7402L220Q651N0276O7680L1260p305n6639j7919M8461O3787l5001
$$ -91548 -148950 -145730 -137079 -86803 -19123 12137 4832 -51807 -69726 -21265 42522 7521
12166G521K063o1908J3709L9814r4261N0513Q3920L737l1834M4K124j4599l4319
$$ 7521 9584 -52324 -38615 1199 -93062 -42549 41371 45108 13274 13318 15442 843 -33476
12153c3476O146Q0689k5014k5813j1748J4033J2539j8255l2566K7457k8875k5992
$$ -33476 -27330 53359 28345 2532 -9216 4817 17356 -899 -33465 -6008 -34883 -60875
12141f0875M6033k5248j9644M9620J8608O3206k9816l7306J9280K9166L6857r115
$$ -60875 -14842 -40090 -59734 -10114 8494 71700 41884 4578 23858 53024 89881 80766
12129H0766p9046m727K5871k157j0391k0125P409n247k3123m6197k4999M4891
$$ 80766 1720 -3007 22864 20707 10316 -9809 -2400 -7647 -30770 -76967 -101966 -57075
12117e7075N2287M554j4567j8977M7657M1012m81l7783k7108N6422K986j3608
$$ -57075 -4788 -234 -14801 -33778 13879 54891 54410 16627 -10481 45941 48927 35319
12105C5319k2160K2409j2578q6425l645p697L8573M9612k610L6990j1196Q398
$$ 35319 13159 35568 22990 -63435 -67080 -74777 -36204 13408 10798 47788 36592 44990
12093D4990J3031k593k7147n7651L2163O5321r287m6556j4297m4405j374N9476
$$ 44990 58021 55428 28281 -29370 2793 68114 58827 12271 -2026 -46431 -47805 11671
12081A1671K5293P897K7876p9022p9347K2123J7344K1853k6222K651l2024j1841
$$ 11671 36964 44861 72737 -6285 -85632 -63509 -46165 -24312 -50534 -47883 -79907 -91748
12069i1748P7501j80l1919j2706L3644o687k3817K2656J3575j1806J2631N4521
$$ -91748 -14247 -14427 -46346 -59052 -25408 -32095 -55912 -33256 -19681 -31487 -18856 35665
12057C5665k631J0313N54J3634l9678k3805j0743j2448M5056J7212P475j3436
$$ 35665 33034 43347 43901 57535 17857 -5948 -16691 -29139 15917 33129 40604 27168
12045B7168l3018j7849K7272O2530q5594l0429n335O202O9413J1379l0743L5694
$$ 27168 -5850 -23699 3573 66103 -19491 -49920 -55255 -49053 20360 31739 996 36690
12033C6690R514k5616l4271m6376J4045l0988L1849m782R520J2742j4039k9065
$$ 36690 46204 20588 -13683 -60059 -46014 -77002 -45153 -49935 -40415 -27673 -41712 -70777
12021g0777P0904P6004J7901J1460K374j7611n7024l7503l5059J9656J7530j013
$$ -70777 127 76131 94032 105492 107866 90255 33231 -4272 -39331 -19675 -2145 -3158
12009c158K2546J1816L823k4615k9909J3407K8944k5598P1557J8046k4075l509
$$ -3158 19388 31204 35027 10412 -19497 -6090 22854 -2744 68813 86859 62784 59275
11997E9275m847l942o566m7921N9372K4512j9497j0952l8467O198m9995L3804
$$ 59275 54428 50486 43920 -4001 55371 79883 60386 49434 10967 17165 -32830 974
11985I74K2822M0026J2143n5661q8913M004P1343L7318J9766k8125M6131K7879
$$ 974 23796 63822 75965 20304 -68609 -64605 6738 44056 63822 35697 81828 109707
11973A09707m1117l3372K7837N594P820L1780j02820j14062K4302P9234R7558
$$ 109707 68590 35218 63055 68649 76469 108249 5429 -108633 -84331 -5097 92461
11962I2461K3925r4491k5392M0632r165l6063j2084L0322L540r133j1388j1784
$$ 92461 116386 21895 -3497 37135 27970 -8093 -20177 10145 13685 4552 -6836 -18620
11950a8620o556l253o090K1886Q972K7602L223J0777j2856m0496L6175J2038k6757
$$ -18620 -25176 -28429 -34519 -12633 -3661 23941 27164 37941 25085 -15411 20764 32802 6045
11937F045l1319j3699L0794K8273N8081L5716j22783p0573N9901O1294O174R972
$$ 6045 -25274 -38973 -8179 20094 78175 113891 -8892 -79465 -19564 41730 47904 57876
11925E7876m4662l8556J2076k7254j4897K2303k0896J5247q089J7917N8051L3336
$$ 57876 13214 -25342 -13266 -40520 -55417 -33114 -54010 -38763 -46852 -28935 29116 62452
11913F2452j1007o6624n7141J2777P6236N872j6862m2090M9150j8022O893M9465
$$ 62452 51445 -15179 -72320 -59543 16693 22565 5703 -36387 12763 -5259 1634 51099
11901E1099n658k2454N0254k7306L4281l6p4841j06598k535M3516K1895J5269
$$ 51099 45441 22987 73241 45935 80216 80180 5339 -101259 -103794 -60278 -38383 -23114
11889b3114O5588J8903m1883j8405R773j4354L6739J742J4894M1912j2509l6438
$$ -23114 42474 61377 19494 1089 10862 -3492 33247 34989 49883 91795 79286 42848
11877D2848o8616K7546m857k999J8095o3484j7775L7751p48M8218K4212m3409
$$ 42848 -25768 1778 -3079 -6078 12017 -51467 -69242 -31491 -32239 15979 40191 -3218
11865c218K3206N0678k4851n4269O0305O274J495L8353L0633J2471m658J7270
$$ -3218 19988 70666 45815 -8454 51851 58125 59620 97973 128606 141077 136419 153689
11853A53689o8604m1008K1014J7088o159k5190J2213M6557o958l4398l9979K763
$$ 153689 85085 44077 65091 82179 76020 50830 63043 109600 102642 68244 28265 31028
11841C1028N596J3996q455J9744o1300k0675j8265O897L7138j7441l1220O2188
$$ 31028 36624 50620 42165 61909 609 -20066 -38331 -31434 5704 -11737 -42957 19231
11829A9231M9104j3594l5947K8850R653n7880k1649l93q993O6719o428q72L5711
$$ 19231 68335 54741 18794 47644 57297 -583 -22232 -22625 -31618 35101 28673 27801 63512
11816F3512l9251l9465k4699j9077J1117K25K0629O7416M0507n6605n2112j4854
$$ 63512 24261 -15204 -39903 -58980 -47863 -47638 -27009 40407 80914 24309 -27803 -42657
11804d2657M630j5585M2538J2595j6797l7857O999p786M8535K1414J8690L7493
$$ -42657 -38027 -53612 -11074 1521 -15276 -53133 -46134 -53920 -5385 16029 34719 72212
11792G2212N004m9347J9451m1368q171k0968k1052k587j1090M6302K2662M9798
$$ 72212 77216 27869 47320 5952 -2219 -23187 -44239 -46826 -57916 -11614 11048 60846
11780F0846m5764l4692k0433L4838N4855M717j1544j7886o6636N8652m4505m5967
$$ 60846 15082 -19610 -40043 -5205 49650 54367 42823 24937 -41699 16953 -27552 -73519
11768g3519K9927L1016K3900J3084Q548j4848j5394o4361M52M3336N0772K7393
$$ -73519 -43592 -12576 11324 24408 32956 18108 2714 -61647 -61195 -17859 32913 60306
11756F0306k6684l1508J7651J6187j8588p5425m3670R73O3914j3175j4428M742
$$ 60306 33622 2114 19765 35952 17364 -58061 -101731 -100758 -36844 -50019 -64447 -59705
11744e9705M3504N3000N9709k5829q6191p5249l5336M6417o246J3000M4560J3445
$$ -59705 -16201 36799 96508 70679 -15512 -90761 -126097 -79680 -85926 -72926 -28366 -14921
11732a4921k1778J7659O9346K7935j9888O239k8591q9185j9595J6105m4435M6796
$$ -14921 -36699 -19040 50306 78241 58353 64592 36001 -53184 -72779 -56674 -101109 -54313
11720e4313N4910K0735j8782L95L2665R232n2194j9747P592M047k8238J4059J1109
$$ -54313 597 21332 2550 2945 35610 44842 -7352 -27099 -19507 -15460 -43698 -29639 -18530
11707a8530L554K8336K1816j0419P392J2562M6931j0660q2968l306J2101J4815
$$ -18530 -14976 13360 35176 24757 32149 44711 91642 80982 -1986 -5292 6809 21624
11695B1624K9513N6162k1661n7070j2650P4799K1467j7550j5605k6846o483l7634
$$ 21624 51137 107299 85638 28568 15918 90717 112184 94634 79029 52183 45700 8066
11683H066P3J3314m5089J7803J1162J4703k5454m4850j0214N7327N1584p005n8067
$$ 8066 8139 21453 -23636 -5833 5329 20032 -5422 -50272 -60486 -3159 48425 41420 -16647
11670a6647o8200n8090j0031j9051L6930L5870L9286M2131N9258j9529k9685k882
$$ -16647 -84847 -142937 -152968 -172019 -135089 -99219 -59933 -17802 41456 21927 -7758 -10640
11658a0640m0328m500N7648p56N5511L0656j8455n5447m223k672P061k6034J8287
$$ -10640 -50968 -55468 2180 1424 56935 87591 69136 13689 9466 6794 13855 -12179 6108
11645F108O1059o120l4090L0679Q50J1340N807m1856r3924k2090L6839Q3268R502
$$ 6108 67167 61047 26957 57636 58486 69826 75633 33777 -60147 -82237 -45398 37870 47372
11632D7372L3488J3532q155P919l0741m725l8394k479l684l1929l5644n4643Q418
$$ 47372 80860 94392 86237 94156 63415 58690 20296 17817 14133 -17796 -53440 -108083 -99665
11619i9665J0141N127K9724J8865M5560J7840P376p522r663l4331M661k3773K4984
$$ -99665 -89524 -84397 -54673 -35808 9752 27592 34968 27446 17783 -16548 -11887 -35660 -10676
11606a0676k391L7585j2735J1441M0236K7697m9331k7580m3436R026J9951J2180
$$ -10676 -13067 24518 11783 23224 63460 91157 41826 14246 -29190 -20164 -213 11967
11594A1967N1822N122q2000m1050j9252L2614K7605L5731k8440J1729k0784M0333
$$ 11967 63789 68911 -13089 -54139 -73391 -40777 -13172 22559 -5881 5848 -14936 25397
11582B5397N2834q152n1215P805K0828J7005j0942J8585j6263M3162K610m1414
$$ 25397 78231 70079 18864 26669 47497 64502 53560 72145 55882 99044 101654 60240
11570F0240m5322L8924N650k3347L682p1644m4968J4228P1217P0824K172n6322
$$ 60240 14918 53842 59492 36145 39827 -31817 -76785 -62557 8660 79484 81656 25334
11558B5334j4073n097N2547p692J3733O904M4436q021m9794L7289j1654k3633
$$ 25334 11261 6164 58711 51019 64752 71656 116092 108071 58277 95566 83912 60279
11546F0279k8357k8809l2297m851r252k7287j6557K261L6908P7429K3726m6618
$$ 60279 31922 3113 -29184 -34035 -43287 -70574 -87131 -84870 -47962 29467 53193 6575
11534F575m694K0475j8650k6400M299j9196J1375l7695J771L8552K1402j7641
$$ 6575 1881 22356 3706 -22694 -18395 -37591 -26216 -63911 -62140 -23588 -2186 -19827
11522a9827j949j466K4728L9593Q994j9879m7589k093j2883L6291M8079n3837
$$ -19827 -21776 -23242 1486 41079 50073 30194 -17395 -19488 -32371 3920 51999 -1838
11510a838p2896l065M4482N9712N0892j8567L1665m067P257J0247N1304L8285
$$ -1838 -74734 -77799 -33317 26395 77287 58720 90385 86318 93575 103822 155126 193411
11498A93411p5901m1540k9095n3836P13N2419K5902J2014j8399l9007k3218K1914
$$ 193411 117510 75970 46875 -6961 -6248 46171 72073 84087 65688 26681 3463 25377
11486B5377k1970k9993j9201M0787L8884j0315m8298j7702M8200Q8594n280n4976
$$ 25377 3407 -26586 -45787 -5000 33884 23569 -24729 -42431 5769 94363 89083 34107
11474C4107K82K7072O59o5685o9014J111P813Q477K8982M546M0357M608j4549
$$ 34107 34389 61461 62120 -3565 -72579 -71468 -63655 -55178 -26196 -21650 18707 23315 8766
11461H766m5658M31M2101M3889n6570j6653J9586N1627l846o821M3372k2298m6989
$$ 8766 -36892 -36461 5640 49529 -7041 -23694 -4108 47519 43673 36852 80224 57926 10937
11448A0937J618k122o930k6719n227Q619j0467l1934M5715O2561j6144J3411J729
$$ 10937 12555 10433 3503 -23216 -28443 -19824 -30291 -62225 -16510 46051 29907 43318 45047
11435D5047K5638L4624l1287m6617K941q05q0343l4271M5377O152m9597K7013
$$ 45047 70685 105309 74022 27405 30346 29541 -50802 -85073 -39696 -33544 -83141 -56128
11423e6128M4612n4085J8461K8776O3355O205l3604M1521k9239p1994L6814O3346
$$ -56128 -11516 -65601 -47140 -18364 44991 51196 17592 59113 29874 -42120 -5306 58040
11411E8040n094l1843j8867p669N2181K2426l7088l8142j0178k0568L6386j9053
$$ 58040 52946 21103 2236 -5433 46748 69174 32086 -6056 -16234 -36802 -416 -19469
11399a9469r136K3254Q626k8354j7884P088Q851J2126K3061M8608j4557k4496
$$ -19469 -28605 -5351 3275 -25079 -42963 -35875 -27024 -14898 8163 56771 42214 17718
11387A7718k4176P012N8868m6539k4704L9278j1394k0340L6007J9407l4369J8982
$$ 17718 -6458 554 59422 12883 -11821 27457 16063 -4277 31730 51137 16768 35750
11375C5750m9894l2677M6756k1142K2089N9443K092M0353j6037m8137J3707k5913
$$ 35750 -14144 -46821 -65 -21207 882 60325 62417 102770 86733 38596 52303 26390
11363B6390j09958j9075L7618J7987K5084j7755M1641P2278q628j1864l3689j7479
$$ 26390 -83568 -102643 -65025 -47038 -21954 -39709 1932 74210 65582 53718 20029 2550
11351B550L8997j537m1692Q166N2988J8854k4660m7343l646k5848M7124Q5765
$$ 2550 41547 40010 -1682 6484 59472 78326 53666 6323 2677 -23171 23953 109718
11339A09718q313p3142k3053P245J7325j1386L3375L501k7021j6153m198J751
$$ 109718 101405 28263 5210 12455 29780 18394 51769 55270 28249 12096 7898 9649
11327I649m1748K3387J6284J9633k8645o9172M7442K2896q747r501o1284K3579
$$ 9649 -32099 -8712 7572 27205 -1440 -70612 -23170 -274 -9021 -18522 -79806 -56227
11315e6227L1434N022L8123K2302l914m3944o8498M0079K9740N460j1396q424
$$ -56227 -24793 -19771 18352 40654 36740 -7204 -75702 -35623 -5883 -423 -11819 -20243
11303b0243M63q066k4560O5437Q7109n2944k8557L5072q279J0513n0533o2540
$$ -20243 -19780 -27846 -52406 13031 100140 47196 18639 53711 45432 55945 5412 -57128
11291e7128o9291J8425M1171K5521o5200K5234O4542r462N0163j8116J3634M0566
$$ -57128 -126419 -107994 -66823 -41302 -106502 -81268 -16726 -26188 23975 5859 19493 60059
11279F0059k7725o6508j2623J7213k7327l493J2444N0274k499K846p0891m9098
$$ 60059 32334 -34174 -46797 -29584 -56911 -60404 -47960 2314 -185 2661 -68230 -117328
11267a17328Q885K8160J0789m348J1106p79m680N8896M3560p704k9398l8264l2193
$$ -117328 -108443 -80283 -69494 -73842 -62736 -63515 -68195 -9299 34261 26557 -2841 -41105 -73298
11254g3298M3648L3942j17l3772O338K0179J1169l3541l1480J9123j6140M6467
$$ -73298 -29650 4292 4175 -29597 -23259 -3080 8089 -25452 -56932 -37809 -53949 -7482
11242g482K1911n0620k3547O4413O9634M7199J2660o213n3197m2165j4584k8520
$$ -7482 14429 -36191 -59738 4675 74309 121508 134168 127955 74758 32593 18009 -10511
11230a0511l6183j9181k975M874O7954P0937P90L4672n881l3494M2501l9666j3361
$$ -10511 -46694 -65875 -68850 -63976 3978 74915 75705 110377 104496 71002 113503 73837 60476
11217F0476p842q3123L0669N2057O861j4225l8771j0874M807l0262j426J3812
$$ 60476 52634 -30489 180 52237 59098 44873 6102 -4772 35 -30227 -31653 -17841
11205a7841j2723J6270N2393l9777l5268R036k2100K4998L0939o394j8173M0544
$$ -17841 -30564 -14294 38099 -1678 -36946 -27910 -50010 -25012 5927 -467 -18640 21904
11193B1904j1386j7723k9833o296L0151K5687m967m0242j7009O5815K5483p2039
$$ 21904 10518 -7205 -37038 -43334 -13183 12504 7537 -32705 -49714 16101 41584 -30455
11181c0455l386K202k0162M4835m2924m9371n8499L7945R5013J5233P684j1136
$$ -30455 -33841 -31639 -51801 -6966 -49890 -99261 -157760 -119815 -24802 -9569 -1885 -13021
11169a3021O5778k3353o0686j1242J4795Q992j6386r675L5512K3045J1383L4303
$$ -13021 52757 29404 -31282 -42524 -27729 -18737 -35123 -44798 -9286 13759 25142 59445
11157E9445O0863m1384n2723j2855l3006n755M9984J0732J7067q4715R797L300
$$ 59445 120308 78924 26201 13346 -19660 -25415 24569 35301 52368 -32347 -22550 -19250
11145a9250K4708O2082M8775J5907j8258m3866o0060j9842j9055l2405n8476m0293
$$ -19250 5458 67540 116315 132222 113964 70098 10038 -9804 -28859 -61264 -119740 -160033
11133a60033O5056N0973J525P238M0810k4108J3777O2930J7197n5820o345L5998
$$ -160033 -94977 -44004 -42479 -35241 5569 -18539 -4762 58168 75365 19545 13200 49198
11121D9198M3238k8864q7257p8237k51J655R780R0437R1820q215n9070J7588m8659
$$ 49198 92436 63572 -23685 -101922 -102173 -100518 -90738 -301 91519 83304 24234 41822 -6837
11108f837p136K7167P3013R119r6241o2267k425K7463Q4834L3326j3709m9179
$$ -6837 -13973 13194 86207 95326 -915 -63182 -65607 -38144 46690 80016 66307 17128
11096A7128k0795J0300q3631K7422o434N6932M8588m6246k4190M4927p905O601
$$ 17128 -3667 6633 -76998 -49576 -56010 922 49510 3264 -20926 24001 16096 22697
11084B2697o3487L1510J9409K5116n3052N4975J9628j1179l4322l6232L6477M7803
$$ 22697 -40790 -9280 10129 35245 -17807 37168 56796 45617 11295 -24937 11540 59343
11072E9343k3348o5870J1940j580J2777L6696n708J3439L8085q9792j2609M6991
$$ 59343 35995 -29875 -17935 -19515 -6738 29958 24250 37689 75774 -14018 -26627 20364
11060B0364K1528m761j097J1050Q89k3523J201K0382n2849l7582k0245L8434L4194
$$ 20364 41892 37131 36034 47084 47973 24450 25651 46033 -6816 -44398 -64643 -26209 7985
11047G985N744M1003l421K1604L7398o2230L393m3563j0799O15M6213L7239l1864
$$ 7985 13729 54732 51311 72915 110313 48083 51476 7913 -2886 -2271 43942 81181 49317
11034D9317Q004N29l6985l4455m2374J6231L9212j4327J6077j4373M6606J1627
$$ 49317 57321 57850 20865 -13590 -55964 -39733 -521 -14848 1229 -13144 33462 45089
11022D5089m0013j9865M545L8977K7051n763j4438l5164K9714r586J5314j8004
$$ 45089 5076 -14789 -10244 28733 55784 50021 35583 419 30133 20547 35861 17857
11010A7857k0697J7387p945J5311j3226n1730L4618L1452k1J0481J7754j9102
$$ 17857 -2840 14547 6602 21913 8687 -43043 -8425 23027 23006 33487 51241 32139
10998C2139k1914j3513n1772L6801K7111K4935j0451L9765K9169j1398k1459J5550
$$ 32139 10225 -3288 -55060 -18259 8852 33787 23336 63101 92270 80872 59413 74963
10986G4963J7881p0531j4591L6406p644m0709m0705P249m936n7062P0271Q0774
$$ 74963 92844 22313 7722 44128 36484 -4225 -44930 -37681 -42617 -99679 -29408 51366
10974E1366K8759K9573l187k7111J5439j254K8706j5266N289R886p6966k7738
$$ 51366 80125 109698 106511 79400 94839 93585 122291 107025 112314 122200 45234 17496
10962A7496J5117M2073K3464J4498L020m4710K1709K8970M0657j7049m4350o7194
$$ 17496 32613 74686 98150 112648 115668 70958 92667 121637 162294 145245 100895 33701
10950C3701J863l4520L5300L2262Q8518P0515j9052k8735M6704j7586N77m4246
$$ 33701 35564 1044 36344 68606 157124 227639 208587 179852 226556 208970 209547 165301
10938A65301m1238K0475J907j0796l8521n1314k0145k1167K2550l965L8383P8333
$$ 165301 124063 144538 146445 135649 97128 45814 25669 4502 27052 23087 61470 139803
10926A39803R982l6419K7272k7643m1062m9876l1945J4978J7868k0482n3541l0490
$$ 139803 149785 113366 140638 112995 71933 22057 -9888 5090 22958 2476 -51065 -81555
10914h1555l2876L839L4424j930N111K7154L3176J4490j2255k8336Q998J4042
$$ -81555 -114431 -110592 -76168 -78098 -72987 -45833 -12657 1833 -10422 -38758 -29760 -15718
10902a5718J6409n3093M2212N2802J0482j4798m1982k6990L4617Q5271M2282J5364
$$ -15718 691 -52402 -10190 42612 53094 38296 -3686 -30676 3941 89212 131494 146858
10890A46858J8904N054l8988o3271l0599K4932n549p625J6575j0314K5091K9747
$$ 146858 165762 170816 131828 68557 37958 62890 57341 49716 66291 55977 81068 110815
10878A10815n2192j8256J3143j9881L544J7310O7618K9478K0765J00198J0823
$$ 110815 58623 40367 53510 33629 37173 54483 122101 151579 172344 272542 283365
10867B83365L8473J14054J91637L39496M81729L81702J65234J97857M34132L86837
$$ 283365 321838 435892 627529 967025 1448754 1830456 1995690 2193547 2627679 3014516
10857C014516j5141l01498k79625j79861k49070l73069m53464l74190k19002j17479
$$ 3014516 2999375 2697877 2418252 2238391 1989321 1616252 1162788 788598 569596 452117
10847D52117l0173p3907k0456k4016j9250r8263j03839m9631L13J3585N3408P5261
$$ 452117 421944 348037 327581 303565 284315 186052 82213 32582 32895 46480 99888 175149
10835A75149k0381l0638j0093q8342J8661L8759J9669J5894o4463m2244Q4060
$$ 175149 154768 124130 114037 25695 44356 83115 102784 118678 54215 11971 96031
10824I6031K7795j0402l5455j9560L0558L7632p1525n6540O518M0986l432k0555
$$ 96031 123826 113424 77969 58409 88967 126599 55074 -1466 5052 46038 42606 22051
10812B2051J8746L6239N7736l1034o4133l6057j1503j9486K6862q329L0509L4272
$$ 22051 40797 77036 134772 103738 39605 3548 -7955 -27441 -579 -8908 21601 55873
10800E5873L085K944p738J4788L3999m2173p4787q940M5127R160l236J1050O4320
$$ 55873 58958 61902 54164 68952 102951 60778 -14009 -22949 22178 31338 28102 39152 103472
10787A03472J0335j9740L7801m5948l8084P4634M001m6881l491K0233L0063Q873
$$ 103472 113807 94067 131868 85920 47836 122470 126471 79590 76099 96332 126395 135268
10775A35268k4886j1689k2335k8041J4789l1300j8924K9021L08J4206L2585M1269
$$ 135268 110382 98693 76358 48317 63106 31806 12882 41903 42211 56417 89002 130271
10763A30271M7291M8271j172p090O146k5100j5492J0039M4936p2943n6940k0440
$$ 130271 177562 225833 224661 217571 223717 198617 183125 193164 238100 165157 108217 87777
10751H7777N9919j7758m3124k1047L8285M5385J7344m4876l7874l0320l340M6601
$$ 87777 147696 129938 86814 65767 104052 149437 166781 121905 84031 53711 50371 96972
10739I6972j6142j8305J2165Q185l5551j184l19K1685L3664j9122k1084l3006
$$ 96972 80830 62525 74690 82875 47324 46140 45821 67506 101170 82048 60964 27958
10727B7958r310j1097Q866L310M3567J7395L0064L6276N1432o400l5548r213r96
$$ 27958 18648 7551 16417 19727 63294 80689 110753 147029 198461 192061 156513 147300 146304
10714A46304L3735N7723J9438N5764R7895Q3272N9137L3740K068m813k5069o9829
$$ 146304 180039 237762 257200 312964 410859 494131 553268 587008 589076 584263 559194 489365
10702D89365p2876n3578q2692n1695p8234l9133l4190l6897K6590l340l4683L8697
$$ 489365 416489 362911 280219 228524 150290 111157 76967 40070 66660 63320 28637 67334
10690F7334o7378o150L7953L3573l9489K8519M5629R615n191l5039o466l7142
$$ 67334 -44 -6194 31759 65332 25843 54362 99991 109606 104415 69376 62910 25768
10678B5768k0243L8971L5132L7918o1287n7485L0634r315M3484L5569M5900M1689
$$ 25768 5525 44496 79628 117546 56259 -1226 29408 20093 63577 99146 145046 186735
10666A86735K9737o391J0048N5652P6026N3907J22966P8571M0542j9824m649L683
$$ 186735 216472 210081 220129 275781 351807 405714 528680 607251 647793 627969 623320 627003
10654F27003m9442q0938r0870m434j3584o4004l9490K4158m0364q0361m3288k2363
$$ 627003 577561 496623 405753 401319 387735 323731 284241 308399 268035 187674 144386 122023
10642A22023K8081J6177P44k6052n6544J6095Q952J7291K8879l3554o012K9976
$$ 122023 150104 166281 167025 140973 84429 100524 109476 126767 155646 122092 116080 146056
10630A46056M4948l930L9473L1293j0130n6663l2823m6006L8245L1954l2521q806
$$ 146056 191004 187074 226547 257840 247710 191047 158224 112218 150463 182417 149896 141090
10618A41090n100l1321m3651K183J9016L713L4305N9614M3239M4726M6707M2184
$$ 141090 135990 104669 61018 63201 82217 85930 120235 179849 223088 267814 314521 356705
10606C56705P0023K4063J0008l0121J1774N9203l5821l6740n7411k6103j8447
$$ 356705 426728 450791 460799 430678 442452 501655 465834 429094 371683 345580 327133
10595C27133j8178n980m1879j2715M3739K3202k1000R126O6133O0205q346O188
$$ 327133 308955 302975 261096 248381 292120 315322 294322 303448 369581 429786 421440 427628
10583D27628O2821N2025L9333P9906j2022J1692j2029k9515o3127j21394P767
$$ 427628 490449 542474 581807 661713 649691 661383 649354 619839 556712 435318 443085
10572D43085k6005m6870j8000l5956J7421M0962Q1439K9229j1976P218p2310o4415
$$ 443085 417080 370210 352210 316254 333675 374637 456076 485305 473329 480547 408237 343822
10560C43822J5162N7781L6688o2651m182M7643J1263j441J1216K6659N6304k3570
$$ 343822 358984 416765 453453 390802 386620 434263 445526 444085 455301 481960 538264 514694
10548E14694Q350M5555k6472o3917n4377m2525J7768N9719O1908K080q75M6375
$$ 514694 523044 568599 542127 478210 423833 381308 399076 458795 520703 522783 521908 568283
10536E68283L1712l1221l3105O9871O4665K89M6992K1539M9949N0489P7338j5287
$$ 568283 599995 568774 535669 605540 670205 670494 717486 739025 788974 839463 916801 901514
10524I01514k7265J2903N3565M9352O054l9356j7370k2033M1331j5721J7977M5749
$$ 901514 874249 887152 940717 990069 996123 956767 939397 917364 958695 942974 960951 1006700
10512A006700N9785R1004L6701k245J008Q8196R6936N1031O7806M9634K3622J13296
$$ 1006700 1066485 1157489 1194190 1191945 1192953 1281149 1378085 1429116 1496922 1546556 1570178 1683474
10500A683474J02109Q0225N9319O0294J25577J83272J75720J58663K04907J35745
$$ 1683474 1785583 1865808 1925127 1985421 2110998 2294270 2469990 2628653 2833560 2969305
10490B969305J31627J19577J10748K36620K82078L61412M17983N14534O26698
$$ 2969305 3100932 3220509 3331257 3567877 3849955 4211367 4629350 5143884 5770582
10481E770582P31402R07093R63242R75645J053482J522018J941657J990185K220612
$$ 5770582 6501984 7409077 8372319 9347964 10401446 11923464 13865121 15855306 18075918
10472A8075918K536498K539070K753193L577254M350336M402877M985200P411697
$$ 18075918 20612416 23151486 25904679 29481933 33832269 38235146 43220346 50632043
10464E0632043J2214839J9834374L3527059N8454471Q4299178P3707089M0267784
$$ 50632043 62846882 82681256 116208315 174662786 258961964 332669053 372936837
10457C72936837L5454267P0434146P5227508O995498o0948225o7837419l4523741
$$ 372936837 408391104 478825250 554052758 561048256 500100031 432262612 397738871
10450C97738871l8979889o8746536q2841149o6271939m1748598k5751763j6581626
$$ 397738871 358758982 290012446 207171297 140899358 99150760 73398997 56817371
10443E6817371j1051021p694984n721270m499966l560751k877847k360686k097143
$$ 56817371 45766350 38071366 32350096 27850130 24289379 21411532 19050846 16953703
10435A6953703j731065j324242j268636j396595j305558r70899p60789p69207
$$ 16953703 15222638 13898396 12629760 11233165 9927607 8956708 8195919 7426712
10427G426712q20388q06650n55431k75591k34094k15746j39382j17642k9614k7679
$$ 7426712 6606324 5799674 5244243 4968652 4734558 4518812 4379430 4261788 4232174 4204495
10417D204495n7768j60129l33607l05236k25162k53173k22374k80611k04417j11087
$$ 4204495 4146727 3986598 3652991 3347755 3122593 2869420 2647046 2366435 2162018 2050931
10407B050931j22601j39082j37711q6154m936n383n8488j46164j05418j3349k8706
$$ 2050931 1928330 1789248 1651537 1565383 1560447 1555064 1496576 1350412 1244994 1231645 1202939
10396A202939p3838o0612o0152J886o7864p969N6133m7721k3486M852n6577q1572
$$ 1202939 1129101 1068489 1008337 1010223 942359 934390 990523 942802 919316 924168 867591 786019
10384G86019m1970l2331K2652P7095N1629L062r176R1226K21531K01687J46873
$$ 786019 744049 711718 734370 811465 863094 866156 856980 948206 1169737 1371424 1518297
10373A518297N8059o434l3159L0337J3253j39158k29411k03587j53412j58620
$$ 1518297 1576356 1569922 1536763 1567100 1580353 1441195 1211784 1008197 854785 696165
10363F96165q8527l3394K0968j5806n5124K154J0952l799q738k2058k6936p132
$$ 696165 607638 574244 595212 579406 524282 526436 537388 533589 524851 502793 475857 468725
10351D68725m3371m4536r603L1358j9452p4559R132M5784K9454l273N717p046
$$ 468725 425354 380818 371215 402573 383121 308562 317694 363478 392932 389659 395376 388330
10339C88330o6148J163J3208N6881O9827L6262K3737K5718Q4735P3820M8635K7341
$$ 388330 322182 323345 336553 393434 463261 499523 523260 548978 633713 707533 756168 783509
10327G83509J078p7097j5977k8332j8087j2545o7704j09817n4649j0600j4846
$$ 783509 784587 707490 691513 663181 645094 632549 564845 455028 400379 389779 374933
10316C74933n0339l9552n802l3409l5064l1851k6791J3420k2133j1127p306r9551
$$ 374933 324594 285042 279240 245831 210767 178916 152125 165545 143412 132285 124979 25428
10304B5428K6537P5672M0220j4325L2058O4721R1434P7670K730k0925L4457j856
$$ 25428 51965 127637 167857 153532 185590 250311 341745 419415 422145 401220 435677 433821
10292D33821q743l8718l1260q7492l3134n3698o8463j0149J2169L4760K2145k1668
$$ 433821 425078 386360 355100 267608 234474 180776 112313 102164 114333 149093 171238 149570
10280A49570j421L2622Q030l8942n543N3954M8194K930j4140Q334k2780o8765
$$ 149570 148149 180771 188801 149859 144316 198270 246464 249394 235254 243588 220808 152043
10268A52043j11633m7117K8703L8995m9339j6961n849L3905K5450P6781m100L0243
$$ 152043 40410 -6707 21996 60991 11652 -5309 -11158 22747 48197 124978 120878 151121
10256A51121N485l1436K7598Q952M0602M23j6212m575q3044k3740J9475M6474
$$ 151121 156606 125170 152768 161720 202322 202745 186533 181958 98914 75174 94649 141123
10244A41123j9435q710J5066l2442L086l5003J0175L4368m285K2809o4387k8595
$$ 141123 121688 112978 128044 95602 98688 63685 73860 108228 103943 126752 62365 33770
10232C3770J3789K2780K5266q714L5374N3763J0794n8095m2525l6275l6899O4848
$$ 33770 47559 70339 95605 86891 122265 176028 186822 128727 86202 49927 13028 77876
10220G7876J883l7229K7221k854K7915L6583Q677j5768k7549k5151o149l0506
$$ 77876 79759 42530 69751 66897 94812 131395 140072 124304 96755 71604 65455 34949
10208C4949P821L5203R4955K9352o22n6332N099k0145q7907j115P9452L0106l3059
$$ 34949 42770 77973 172928 202280 201658 145326 150425 130280 42373 41258 120710 150816 117757
10195A17757J3220j4901K4995K7712n043m5148j07325m3676N933K2147J8274L0059
$$ 117757 130977 116076 141071 168783 163740 118592 11267 -32409 -26476 -4329 13945 44004
10183D4004M3778k0186r231o043r198N0639M0104k5943l4185l6459N767K0141
$$ 44004 87782 67596 58365 52322 43124 93763 133867 107924 73739 37280 43047 63188
10171F3188N3494j1225n6629j2305n202l8356j5475J7941k1202N5486K3000k5304
$$ 63188 116682 105457 48828 36523 31321 -7035 -22510 -4569 -25771 29715 52715 27411
10159B7411k4110N4173K3813K8531j9190M826k3852p6848o9563n4781k5035o8651
$$ 27411 3301 57474 81287 109818 90628 95454 71602 -5246 -74809 -129590 -154625 -223276
10147b23276M8436L7733R503K016P867Q6298M1810N0920K5918j991p083m7525
$$ -223276 -174840 -137107 -127604 -125588 -117721 -31423 10387 61307 87225 85234 78151 30626
10135C0626k8902L4765l4098l7524O7980J2448r696J2321J8583N03L4960k4331
$$ 30626 1724 36489 2391 -35133 32847 45295 35599 47920 66503 67006 101966 77635
10123G7635k3286n473J8361j1339l67r594K4243l6267r7584l1311J8613K5182
$$ 77635 54349 48876 67237 55898 55531 45937 70180 33913 -63671 -94982 -76369 -51187
10111e1187K5171M2913J0299Q132J8165j6557j3118N369j5020k0295k3707J8923
$$ -51187 -26016 16897 27196 35328 53493 36936 23818 29187 14167 -6128 -29835 -10912
10099a0912n536Q498J9140J2182k6910n6750n1667M8184M7577J2272j8741k07
$$ -10912 -16448 -7950 11190 23372 -3538 -60288 -111955 -63771 -16194 -3922 -22663 -22870
10087b2870K298N1946J1878k6897o7535R920k0972J8302K1909R246J4765K8776
$$ -22870 -20572 31374 43252 16355 -51180 -41260 -62232 -43930 -22021 -12775 1990 30766
10075C0766m0220m500J19211J7938k7678o1178m1478O8929M9065K623k6690o913
$$ 30766 -9454 -13954 105257 123195 95517 34339 -7139 61790 110855 113478 86788 79875
10063G9875R207k3925J375K4957N4565O1638L7107O4918N1954J13199K35072L82617
$$ 79875 89082 65157 66532 91489 146054 207692 244799 309717 361671 474870 709942 1092559
10051A092559M87596L41875J44517K55524M36266L30683q7614l55741l20320k08066
$$ 1092559 1580155 1922030 2066547 2322071 2758337 3089020 3001406 2645665 2325345 2117279
10041B117279k71751l83458l82168l16051k40322j45659p0752n0978q368o2299
$$ 2117279 1845528 1462070 1079902 763851 523529 377870 307118 256140 247772 185473
10031A85473m5292N860K3897j6466L3493j1666o3940n4609m9299K1293J9408K083
$$ 185473 140181 146041 169938 153472 186965 175299 111359 56750 7451 28744 48152 50235
10019E0235l1567N7663J3856K1925m5179k4636K0585L2167O9811k1167k5165K4505
$$ 50235 18668 76331 90187 112112 66933 42297 62882 95049 164860 143693 118528 143033
10007A43033o031l4145j8905J5262N4745L9521L6711p2339o6616J00169j2228
$$ 143033 137002 102857 83952 99214 153959 193480 230191 157852 91236 191405 179177
9996A79177m9726k7618l8798M4726k2889j8060o365n212l7656O218O7422P088
$$ 179177 129451 101833 63035 107761 84872 66812 60447 55235 17579 23797 91219 98307
9984I8307j5962l8857J8322K4058k6731m3227m1349p071L51L303L3965Q2694M1147
$$ 98307 82345 43488 61810 85868 59137 15910 -25439 -32510 -32159 -28856 5109 87803 128950
9971A28950j6542q441O366n5607q6017j2280m003j6840L5439L0674J7739k2110
$$ 128950 112408 103967 110333 54726 -31291 -43571 -47574 -64414 -28975 1699 19438 -2672
9959b672k3017K6517O9243K6872j3786k7392k2691P981R307j5938m9186R614L3847
$$ -2672 -25689 828 70071 96943 83157 55765 33074 41055 50362 34424 -14762 -5148 28699
9946B8699L7877j9698k8033j8872K034p71K7255j7518J0045p469k474J6499L0607
$$ 28699 66576 46878 18845 -27 2007 1236 28491 10973 21018 13549 11075 27574 58181
9933E8181l8504M0806R290r620n1386r558K6843L5960O377N3431R889k875M3952
$$ 58181 19677 60483 69773 60153 8767 -791 26052 62012 68389 121820 131709 128834 172786
9920A72786j9581r834O2630K6952q1015r6452J1736p4015l6620P6922R2175m3995
$$ 172786 153205 143371 206001 232953 151938 55486 67222 -6793 -43413 33509 125684 81689
9908H1689l7653k5337n9206j0918M2531N8735M631K7409K1456m1631J1957M5685
$$ 81689 44036 18699 -40507 -51425 -8894 49841 54472 81881 103337 61706 73663 119348
9896A19348k5289K4523M5143M7456n731o0581l1858j3279j9938l0178l1017L1882
$$ 119348 94059 118582 163725 211181 205450 144869 113011 99732 79794 49616 18599 50481
9884E0481l4795N412N3297J1065K7964J2616k3843K5297J9130o568N5333k7981
$$ 50481 15686 21098 74395 85460 113424 126040 102197 127494 146624 140056 195389 167408
9872A67408p5715m5800r355J1337J6845M6507k0282J499K9006M6547M7568m2232
$$ 167408 91693 45893 36538 47875 64720 111227 90945 92444 121450 167997 215565 173333
9860A73333m2792N3583P8380M8168L80O7584Q0202J37035J83392K20595L23570
$$ 173333 130541 184124 262504 310672 311052 378636 458838 595873 779265 999860 1323430
9849A323430O47862J170514K240809L087435K465705J66840k130968k900712k323957
$$ 1323430 1971292 3141806 5382615 8470050 10935755 11102595 8971627 6070915 3746958
9840C746958j410058p32257m45344k82158j67365j76645j66557q3103p7624m2687
$$ 3746958 2336900 1604643 1159299 877141 709776 533131 366574 283471 205847 163160
9830A63160j0218K1417O6332L6374o0452r907m1879m2263l2274L8989K6508j8852
$$ 163160 152942 174359 240691 277065 216613 206706 164827 122564 90290 129279 155787 136935
9818A36935P247m9682J4564r26p8949r1175J8386J4499K7515N9002K5049j3622
$$ 136935 144182 94500 109064 108138 29189 -61986 -43600 -29101 -1586 57416 82465 68843
9806F8843o8121j3228p055K4925k9293L9581O1732k7565L5163M9938K0727l5391
$$ 68843 722 -12506 -19561 5364 -23929 15652 77384 49819 84982 134920 155647 120256
9794A20256p9456o0705O5826R0277m7915k2821O58j1373m512o3058N7165N0941
$$ 120256 40800 -19905 45921 136198 88283 65462 66120 54747 50235 -12823 44342 95283
9782I5283j03079m0157M3014O4666O700l6246N0530k0036k4064L1848m8507K1912
$$ 95283 -7796 -47953 -4939 59727 66427 30181 80711 60675 36611 68459 19952 41864
9770D1864K8321p307n6730K6889N3141N7659o2588l1500J7843k7646p6090j53
$$ 41864 70185 62878 6148 33037 86178 143837 81249 49749 67592 39946 -36144 -36297
9758c6297n589K281L0879O3714k578M013N2819o511q1239q511J3720N1075L5596
$$ -36297 -41886 -39605 -8726 54988 52410 56423 109242 102731 21492 12981 26701 77776 113372
9745A13372j1812m495j8810l0320K1335O1873M5668r854r9998p2086O5844P3782
$$ 113372 101560 97065 78255 47935 69270 131143 176811 166957 66959 -5127 60717 134499
9733A34499k9543j4284m9566P424j4951K395M9208P0753m0294j6892m6028J3121
$$ 134499 104956 90672 41106 48530 33579 35974 85182 155935 115641 98749 52721 65842
9721F5842K6171l327m4129M3886N2157J6039n1795l9965q703Q246L2516L5351
$$ 65842 92013 88686 44557 88443 140600 156639 104844 64879 56176 64422 96938 132289
9709A32289l7679j4447n4916P499N6795N730o5877J3739L0404j2902k1984O8795
$$ 132289 94610 80163 25247 32746 89541 95271 29394 43133 73537 60635 38651 107446
9697A07446P5711Q092j6810l43k4801m3651l3291N191l0744K0829O9947P4154
$$ 107446 183157 191249 174439 174096 149295 105644 72353 77544 46800 67629 137576 211730
9685B11730N506j1033l7332k0802j6520J209k3193k8408M1968L0860k2816J4786
$$ 211730 217236 206203 168871 148069 131549 132758 109565 81157 123125 153985 131169 145955
9673A45955l3084k5941N0646N0897K4533k7449L752L5464k6814m1658K6502j477
$$ 145955 112871 86930 137576 188473 213006 185557 189309 224773 197959 156301 182803 181326
9661A81326R03O5981r15j1964K6167n421R424Q778n0887r7825n1355J5982J2545
$$ 181326 182229 248210 247295 235331 261498 256077 265501 274279 223392 125567 74212 90194 102739
9648A02739K0352n982p026J7303L1060M8019o497j3744k6580k1716L9929O5767
$$ 102739 123091 117109 110083 127386 158446 206465 199968 186224 159644 137928 177857 243624
9636B43624J6365l0634l5350k3179N4753Q8616O5190J5155p6052l8306o480k7533
$$ 243624 259989 229355 194005 170826 225579 314195 379385 394540 318488 280182 273702 246169
9624B46169j5332K6395K9496N1171j8859j12372j3497K3544P53J1068M2579L3415
$$ 246169 230837 257232 286728 337899 319040 206668 193171 216715 217468 228536 271115 304530
9612C04530k3545m6237k2262j7563N5976L1178P2312L1100n740k7936l5646o6499
$$ 304530 280985 234748 212486 194923 250899 282077 354389 385489 379749 351813 316167 249668
9600B49668j0498m50M5036O8495J8584l9932K5084J2413K5095j0186j2220M1487
$$ 249668 239170 238720 283756 352251 370835 330903 355987 368400 393495 383309 371089 412576
9588D12576M7990K595l3992k7937k5141J3735M8644j267l1936J1636R6865L9091
$$ 412576 460566 463161 429169 401232 376091 389826 438470 437203 405267 416903 513768 552859
9576E52859R754j478o7089k8795J6444J6734n596m2888j3165L9378M0994l6791
$$ 552859 562613 561135 494046 465251 481695 498429 492833 449945 436780 476158 517152 480361
9564D80361k8588L7897L7542P4525M3764N4765k9857j7671m1528k0280L088o226
$$ 480361 451773 489670 527212 601737 645501 700266 670409 652738 611210 590930 594018 587792
9552E87792j1016j4442L5126Q7K7369J184L1306K1704k5499M9341N5456m0329
$$ 587792 576776 562334 597460 597547 624916 626100 657406 679110 653611 702952 758408 718079
9540G18079K2274J6294m0283J9899M4105j1049j9348j7414n064l7001j1886N2819
$$ 718079 740353 756647 716364 736263 780368 769319 749971 732557 727493 690492 678606 731425
9528G31425J03713K4113K1201k1117O1213N6379K2162l7514R587L6924j3911k8243
$$ 731425 835138 859251 880452 859335 920548 976927 999089 961575 971162 1008086 994175 965932
9516I65932K7097Q6809M4048O896k4346J1306O049K1883r033k0315m4543M0469
$$ 965932 993029 1079838 1123886 1130782 1106436 1117742 1123791 1145674 1136641 1116326 1071783 1112252
9504A112252R4108M090m7265M9783N1182J0581R592L1552k2933L4675j1734K1161
$$ 1112252 1206360 1210450 1163185 1212968 1264150 1274731 1284323 1315875 1292942 1327617 1315883 1337044
9492A337044Q6108J04753r612j6735o400Q280k0147J155L2110M2803q683o5916
$$ 1337044 1423152 1527905 1518293 1501558 1495158 1503438 1483291 1484446 1516556 1559359 1550676 1484760
9480A484760J4226J1737k1320K4258O0092L6725K1215N2895O7802k8852l4505
$$ 1484760 1498986 1510723 1489403 1513661 1573753 1610478 1631693 1684588 1752390 1723538 1689033
9469A689033j1568K65L2399J8371K2370K4043L2161K2633n0410o8800K084M89
$$ 1689033 1677465 1677730 1710129 1728500 1750870 1774913 1807074 1829707 1779297 1710497 1712581 1713070
9457A713070o1355m0555L0377N6121j3727j5988J10824p015l1125L8114N0698
$$ 1713070 1651715 1611160 1641537 1697658 1683931 1667943 1778767 1771752 1740627 1778741 1829439
9446A829439m9056j8000j01466n4107O774R903m5169m7737m14k6704Q421J9764
$$ 1829439 1780383 1762383 1660917 1606810 1613584 1623487 1578318 1530581 1530167 1503463 1511884 1531648
9434A531648k4851m273K1238j7934p5500l45J0861Q107j0050q9963o0643k6214
$$ 1531648 1506797 1502524 1523762 1505828 1430328 1429983 1440844 1448951 1438901 1348938 1288295 1262081
9422A262081o410k1213j0798j0437k2935q418k3412r575Q438P9089k163m6040
$$ 1262081 1255671 1234458 1223660 1213223 1190288 1181870 1158458 1148883 1157321 1236410 1234247 1188207
9410A188207o0007o4695J2555k0486J390l2956K2186k0963j09932m0912K0139
$$ 1188207 1128200 1063505 1076060 1055574 1056964 1024008 1046194 1025231 915299 874387 894526
9399H94526N9504P085j0986J6900m0807o4243l6889l2839k267P039K3753K4354
$$ 894526 954030 961115 950129 967029 926222 861979 825090 792251 789984 797023 820776 845130
9387H45130m4591l744k3056J2174k8230n26n220l8660j0944K0045R591O277j1772
$$ 845130 800539 796795 773739 785913 757683 757157 751937 713277 702333 722378 731969 738246 726474
9374G26474k7721j4754l624k899m0212K1682k6926j8361k848q515k3359n5830
$$ 726474 698753 683999 680375 677476 637264 658946 632020 613659 610811 602296 578937 523107
9362E23107l5733L2766N0827m2939r0672J4904j0781L766M6736K4088L756K5210
$$ 523107 487374 520140 570967 528028 437356 452260 441479 445245 491981 516069 519825 545035
9350E45035L0206j4765p943k4274q3816k9252K4171k5372m2782M377n8769L6764
$$ 545035 575241 560476 552533 528259 444443 415191 439362 413990 371208 375585 316816 353580
9338C53580l965p822O1478P675J0837j0921l2998k0439l9180k2096L3781P3122
$$ 353580 349615 341793 403271 410946 421783 410862 377864 357425 318245 296149 329930 403052
9326D03052O067k8778n459l2712l5683M553k8177m8347M5728p588p764M0313m9002
$$ 403052 409119 380341 374882 342170 306487 311040 282863 234516 280244 272656 264892 305205 256203
9313B56203L5150Q2369j5298k9680r4675n1809K9274K1073k679l07j8612l1354
$$ 256203 291353 373722 358424 328744 234069 182260 211534 232607 229928 229621 211009 179655
9301A79655n833k32M1130M9571j2619k599o1273P72M36J06903L4133j9151k4289
$$ 179655 173822 173590 214720 264291 251672 249073 187800 188572 189008 295911 330044 310893 286604
9288B86604k6038N9189o9185l6572K5644r221L750J4900j6855N6495K048j10612
$$ 286604 260566 319755 250570 213998 239642 230421 234171 249071 232216 288711 290759 180147
9276A80147m5771k7499k9646j7530M0538J5303j6189Q424K4741K572k5238J8509
$$ 180147 134376 106877 77231 59701 100239 115542 99353 107777 132518 135090 109852 128361
9264A28361L5002J3461n7572l3452M5216P4704m5690j23528q157K7469J07985
$$ 128361 163363 176824 119252 85800 131016 205720 160030 36502 28345 55814 163799
9253A63799M3219j4530p586R574J2534p967j6416l3710m3865J5281j6936m877
$$ 163799 207018 192488 184902 194476 207010 199043 182627 148917 105052 120333 103397 98520
9241I8520N2868M7021k5847k9846J9271m246J5672k4052N729L310L6888K6117
$$ 98520 151388 198409 172562 142716 161987 157741 173413 149361 155090 158400 195288 221405
9229B21405j2712l2918n1637Q736N0498N4011r138O368J743q4499n7378L6212
$$ 221405 208693 175775 124138 132874 183372 237383 228245 234613 236356 151857 94479 130691
9217A30691O793N135K3028k136l3053p4729o2413L8334O4590O051K706K8476m3802
$$ 130691 137484 142619 165647 163511 130458 55729 -6684 31650 96240 102291 104997 133473 89671
9204H9671q847M3382N182J3992j854q4951q0397k922J0621K3387M7991K3250K8680
$$ 89671 80824 124206 129388 143380 141526 56575 -23822 -26744 -16123 7264 55255 78505 107185
9191A07185j846n1637J0893N083L4578J3943l6928K964P9658n596j6025o278J9729
$$ 107185 105339 53702 64595 69678 104256 118199 81271 84235 163893 158297 142272 135994 155723
9178A55723L6276l0217o3905l407P135k4638P274k6280O436l0514J2761K194l6337
$$ 155723 191999 161782 97877 94470 101605 76967 84241 57961 64397 33883 46644 48838 12501
9165A2501K2760J1276J08529k2660r2402Q440K0554m7332L9193l0193O989L2348
$$ 12501 35261 46537 155066 132406 40004 48444 68998 21666 60859 30666 37655 70003
9153G0003L030k7088k4516L644o300j6006n7532J8204N0600J2142M0774K5107
$$ 70003 73033 45945 21429 25073 18773 2767 -54765 -36561 14039 26181 66955 92062
9141I2062p021p415M3808j4149q803O2585l0882j5659p8524L5836M0890j3360
$$ 92062 85041 77626 121434 107285 98482 161067 130185 114526 36002 71838 112728 99368
9129I9368K6197L6674O9592p9414j02122j5620J7654L377l6397J3482J7034M238
$$ 99368 125565 162239 231831 152417 50295 34675 52329 55706 19309 32791 49825 54063
9117E4063k0670J0559m908K509M5320Q0002k9059m9334n4919m1659K5194J9547
$$ 54063 33393 43952 39044 41553 86873 166875 137816 88482 33563 -8096 17098 36645
9105C6645o718O6829O9462n2376n4990Q302L7383M4694j6839p3431m4608J3843
$$ 36645 29927 96756 166218 113842 58852 67154 104537 149231 132392 58961 14353 28196
9093B8196K8816m0530j1697K2615L6568L9976m7697m2917J9390l7147M5351Q3110
$$ 28196 57012 16482 4785 27400 63968 103944 56247 13330 32720 -4427 40924 124034
9081A24034N0921l6789p0596q083N0054N0573m1707j42839l6583j1852Q4708N2475
$$ 124034 174955 138166 67570 59487 109541 160114 118407 -24432 -61015 -72867 11841 64316
9069F4316M4979k0906q1955k4210R0501N1002n0890K0854N5135M759O978j8574
$$ 64316 109295 88389 6434 -17776 72725 123727 72837 93691 148826 153585 160563 141989
9057A41989r0342l181M4397l1158o4859N6519J1426k3117j3973K7441R006l5988
$$ 141989 51647 48466 92863 61705 -3154 53365 64791 41674 27701 55142 64148 28160
9045B8160J6641M2563k0183N353k50k5007L5691K7970L7304k9700m9220p4210
$$ 28160 44801 87364 67181 72534 72284 47277 82968 110938 148242 118542 69322 -4888
9033d888j8885K2387l3044k7982L8666N2317P5868N505J7445K2176o3601o3267
$$ -4888 -23773 -1386 -34430 -62412 -23746 28571 104439 109944 127389 149565 85964 22697
9021B2697N5624L5498j0159j631j9096k5330k3676n510L873M1347N0660l4064
$$ 22697 78321 113819 103660 102029 82933 57603 33927 28417 32290 73637 124297 90233
9009I0233K4732J8033k3521Q160M7844J1509j3258n3913m3715L654L7757J3164
$$ 90233 114965 132998 109477 117637 165481 176990 163732 109819 66104 69758 107515 120679
8997A20679n24J3458n4632k1560k9329J6350M5178J0372o4404m8888l5606j6864
$$ 120679 120155 133613 78981 57421 28092 44442 89620 99992 35588 -13300 -48906 -65770
8985f5770M3095R211M8520K8663k8558j2431K0809j6423k584M3847O987J2153
$$ -65770 -22675 -13464 35056 63719 35161 22730 43539 27116 24532 68379 75366 87519
8973H7519j9487p0193k9686m5872P6333Q1251K5084m1544r439N261m3331j4808
$$ 87519 68032 -2161 -31847 -77719 -1386 79865 104949 63405 53966 59227 15896 1088
8961A088J1661j06l3663J1889N9510N1199L596k4278Q525j8932k6324j8844R661
$$ 1088 12749 12643 -21020 -9131 50379 101578 105174 80896 89421 70489 44165 25321 34982
8948C4982n5260l0334Q2071O6616m1376m8912j9644j7296M2659K5406O565m51
$$ 34982 -20278 -50612 31459 98075 56699 7787 -11857 -29153 13506 38912 45477 45026
8936D5026O897j7591k7658o8083n3613m4384J2251M8180O3041O627l7284m2577
$$ 45026 51923 34332 6674 -61409 -115022 -159406 -147155 -98975 -35934 -29307 -66591 -109168
8924a09168M8877N5217Q729k1692p058M7242j84l8737n534P674j2876l3889L26
$$ -109168 -60291 -5074 3655 -18037 -25095 22147 21963 -16774 -22308 -14634 -27510 -61399 -61073
8911f1073n813K1981M4830J686j5534L5716P826J1036R661l02n366k5693P2000
$$ -61073 -66886 -44905 -75 1611 -13923 21793 29619 40655 50316 50014 44648 18955 90955
8898I0955J8468n9531n8707l16O773m884K7875k6456o685p589l7569k3556M615
$$ 90955 109423 49892 -8815 -9131 -2358 -7242 20633 -5823 -12508 -20097 -57666 -81222 -76607
8885g6607l878N6105M6438R130o339n1493j1287Q948k1285j7842K6077M0770L6481
$$ -76607 -80485 -24380 22058 31188 24849 -26644 -37931 -28983 -50268 -68110 -42033 -1263 35218
8872C5218K0226j2938r605N10K2826j050J2362J4211l1111r4785J4364M9080K3369
$$ 35218 55444 42506 32901 33411 56237 55187 67549 81760 50649 -44136 -29772 19308 42677
8859D2677L0108k1865L0466n9308N703K9744q337q414M4252K903q1527j7835R667
$$ 42677 72785 50920 81386 22078 27781 57525 49188 40774 85026 87929 6402 -11433 -1766
8846a766l4757k8416P816J125O33m2268M897K3024O2008l2809K9867K4034L8162
$$ -1766 -36523 -64939 -57123 -55998 -55365 -97633 -92736 -69712 -7704 -40513 -10646 13388 51550
8833E1550Q591j9480k9901n895J5351l2269j5490J6696l188K3390L5722m7720
$$ 51550 60141 40661 10760 4865 20216 -12053 -27543 -10847 -14035 9355 45077 -2643
8821b643K4573M9529N6588P500j9647p2663j4307l3909l4966K3146J3936k9570
$$ -2643 21930 71459 128047 135547 115900 43237 28930 -4979 -39945 -16799 -2863 -32433
8809c2433l1252J5019j2566O2759K7374k2772L4717J6838q0432m0751n5855K7826
$$ -32433 -63685 -48666 -61232 1527 28901 6129 40846 57684 -22748 -63499 -119354 -91528
8797i1528J33283M2128k5038j9095j031m3696J230o256N3386P9740o3064p3973
$$ -91528 41755 83883 58845 39750 38719 -4977 -3747 -10003 43383 123123 60059 -13914
8785a3914j3113m582M503J9855K5077m1584k2353J9559K5409L4795M0133Q376
$$ -13914 -27027 -31609 -27106 -7251 17826 -23758 -46111 -26552 -1143 33652 73785 82161
8773H2161m0459m2486M9991J9266n393N150m6615k5999j3309M8004k7548N6348
$$ 82161 41702 -784 49207 68473 63080 68230 21615 -4384 -17693 30311 2763 59111
8761E9111N6327o268n1147m0496j6921M6581J8276k3523j9644K849j0472N372
$$ 59111 115438 109170 58023 17527 606 47187 65463 41940 22296 25145 14673 20045
8749B0045K9527j6945K3841j7121j7476l5737P560l7810L0734M8052J0607K2060
$$ 20045 49572 32627 56468 39347 21871 -13866 -6306 -44116 -13382 34670 45277 67337
8737F7337n057J3981k8746l1922P405j2054k2857j9617L8462K6690m2327p776
$$ 67337 62280 76261 47515 15593 22998 10944 -11913 -31530 6932 33622 -8705 -16481
8725a6481k5823l2192P5197R428m3578k43N379j8599r125R88J6080Q46M3383m1215
$$ -16481 -42304 -74496 701 10129 -33449 -33692 -28313 -46912 -56037 -55049 -38969 -38123 5260 -35955
8711c5955J32Q2246L3024l8681l5902M7779K6522j2121J7447N151j138j5086j0324
$$ -35955 -35823 46423 79447 40766 4864 52643 79165 67044 84491 89642 88504 73418 63094
8698F3094n5035n070M923J679J472P1281m3964l3900J3554L0895k1083l4001k9984
$$ 63094 8059 2989 7912 9591 11063 82344 38380 4480 18034 48929 27846 -6155 -36139
8685c6139L7975k0831k7272j3800M2899O2435m871J3218K8372J1188j9903l2528
$$ -36139 1836 -18995 -46267 -60067 -17168 45267 40396 53614 81986 93174 73271 40743
8673D0743O156J880l5616L818P8229m8255q519M499J54l2711n19K7441P6870j570
$$ 40743 46899 48779 13163 16981 95210 46955 38436 42935 43089 10378 9859 37300 114170 112600
8659A12600n8179J7184J1893O7358K4342k4804J3056P1537O9196P1794J17248
$$ 112600 54421 71605 83498 150856 175198 150394 163450 234987 304183 375977 493225
8648D93225L16792O23135Q50536O49337l785p20155q40238n17949l23833j72034
$$ 493225 810017 1433152 2283688 2933025 2929240 2209085 1368847 850898 527065 355031
8638C55031k5353m4259Q396N912k0164n4299k6401l6754j7061K3213l1113K9437
$$ 355031 329678 285419 293815 299727 279563 225264 198863 162109 145048 168261 137148 166585
8626A66585k7529m5606M1617J2203J6661J1975l0647l9509L7759O206M8099L973
$$ 166585 139056 93450 135067 147270 163931 175906 145259 105750 143509 149715 197814 201787
8614B01787l7943N8764R3224L3020O96j8693N407L6565J38589K50217K98497M31665
$$ 201787 163844 222608 315832 348852 349548 330855 336262 372827 511416 761633 1060130 1491795
8602A491795R26306J635657J575203J77819j150123j648668j100171o48109l55577
$$ 1491795 2418101 4053758 5628961 5806780 4656657 3007989 1907818 1259709 904132
8593I04132k57509j81271p9586l2124m8222p0897O2050K2326p1207o9170j2060
$$ 904132 646623 465352 385766 353642 305420 234523 296573 318899 247692 178522 166462
8582A66462k0718l4764O10m5450k7639L9405j7858j5685n7748M8465O7989k0332
$$ 166462 145744 110980 111590 66140 38501 77906 60048 44363 -13385 35080 103069 82737
8570H2737l0305K6788M2534J7199P719M4455P1602R2707R5226O030m4700L1426
$$ 82737 52432 79220 121754 138953 146672 191127 262729 355436 450662 456692 411992 443418
8558D43418K04594M58181P27264P42888K42567m60257p12948n71750l70408k26026
$$ 443418 648012 1106193 1833457 2576345 2818912 2358655 1645707 1073957 703549 477523
8548D77523j50172k3516k2178n1203l7222p6481o2762q4931K8981N8062R0510
$$ 477523 327351 303835 281657 230454 193232 116751 53989 -30942 -1961 56101 146611
8537A46611J9129j6766k5713l4285k4125P081l4128r698O0153j5379j3674J7588
$$ 146611 165740 148974 123261 88976 64851 71932 37804 28106 88259 72880 59206 76794
8525G6794m7587n289n577o1772J0968J8988k0438L8737Q4369m6493J5785L4111
$$ 76794 29207 23918 18341 -43431 -32463 -13475 -33913 4824 89193 42700 58485 92596
8513I2596o57Q117J7658j8814j21985l2811J6877M747j0864L1277O2546j7260
$$ 92596 91939 100056 117714 98900 -23085 -55896 -39019 -34272 -45136 -13859 48687 31427
8501C1427K1588Q103J6772k8815Q272R80k2988J1553n4879k1435J8340q883n8241
$$ 31427 53015 61118 77890 49075 57347 58327 35339 46892 -7987 -29422 -11082 -19965 -78206
8488g8206j5107L2144r605K5185m1172j0467L2390O1896K5390q233j0712M9134
$$ -78206 -93313 -61169 -70774 -45589 -86761 -97228 -64838 -2942 22448 14215 3503 52637
8476E2637p263l3477N04N8475J8511K1934l4427m4371N2869Q547k3909K6255k5780
$$ 52637 45374 11897 12401 70876 89387 111321 76894 32523 85392 93939 70030 96285 70505
8463G0505j8984l1433q337k6930M2588j9707n1514J3494M1680l28m6290q4927
$$ 70505 51521 20088 11751 -15179 27409 7702 -43812 -30318 11362 11034 -35256 -120183
8451a20183M5633J175N0213J4988Q339p6624l7509M8031P3802M148k1389j3255
$$ -120183 -74550 -73375 -23162 -8174 165 -76459 -113968 -65937 7865 12013 -9376 -22631
8439b2631N3494r583l3257N340K3369o643l964m6884o4297j9555M5737L5289L5540
$$ -22631 30863 21280 -11977 -6637 16732 10089 6125 -40759 -105056 -124611 -78874 -43585 -8045
8426h045O1749l2458n9491M257n672O4214j8111l1276P056J7247P446N619n3728
$$ -8045 53704 21246 -38245 -33988 -39660 24554 6443 -24833 -17777 -530 6916 12535 -41193
8413d1193o4204M6555K4845J1440l6475n9662n231M8359J27579O0921m8354n0428
$$ -41193 -105397 -58842 -33997 -22557 -59032 -118694 -123925 -75566 52013 112934 64580 14152
8401A4152n1197K6521M3290k6477n2954K7091L1680K199J4519J3758j08618K9818
$$ 14152 -37045 -10524 32766 6289 -46665 -19574 12106 14305 28824 42582 -66036 -36218
8389c6218L5845j3139J9119K8464M673K6293J0327o952O747L3375l3857n4538
$$ -36218 -373 -13512 5607 34071 38744 65037 75364 68412 75159 108534 74677 20139
8377B0139n3969M3277P8329n0462k7205k0387l2062q57o708m672k3670M5879O5576
$$ 20139 -33830 9447 87776 37314 10109 -10278 -42340 -43197 -49905 -54577 -78247 -32368 33208
8364C3208K4406l2257l0139K2503Q151l9371L1909J6001N8663J9338r301J8602
$$ 33208 57614 25357 -4782 17721 25872 -13499 18410 34411 93074 112412 103111 121713
8352A21713q5328o5093P1378n2585m1820P7821K0855k8882p9J4961L1468m2382
$$ 121713 36385 -28708 42670 -9915 -51735 26086 46941 18059 17980 32941 64409 22027
8340B2027k5565l4095M1896L7049M5913m0276j9572M5234q2579o9430l2951K8912
$$ 22027 -3538 -37633 4263 41312 87225 46949 27377 72611 -9968 -79398 -112349 -83437
8328h3437L4718j3307M7676K6952n8890J3718j3940l7218N1807O527j9521m2166
$$ -83437 -48719 -62026 -14350 12602 -46288 -32570 -46510 -83728 -31921 -25394 -44915 -87081
8316h7081l1179j1927O2492K0251L7608K1147N6217J2013j0086k9846j5729k56
$$ -87081 -118260 -130187 -67695 -47444 -9836 11311 67528 79541 69455 39609 23880 23624
8304B3624J0040k7824o8653L8996m4024k3867P9417N3642o338n1846l2124L2007
$$ 23624 33664 5840 -62813 -23817 -67841 -91708 -12291 41351 35013 -16833 -48957 -16950
8292a6950L8379j753l6577L0189Q5521M5763p1165j9624K5588p573m4112Q326
$$ -16950 21429 19676 -16901 13288 98809 144572 73407 53783 79371 71798 27686 36012
8280C6012k1029m3689n288P737q86j5282j945j1627n158o972J8799N6927K6995
$$ 36012 14983 -28706 -33994 -26257 -27143 -42425 -44370 -55997 -61155 -68127 -49328 7599 34594
8267C4594l6524l5168L3739k7180l0527M4611P164j8985n7474K0179L554k7523
$$ 34594 -1930 -37098 -3359 -30539 -61066 -16455 -9291 -28276 -85750 -65571 -62017 -89540
8255h9540l6665J4054J4529K0635M8709N080n3185j4018o6n4509J7885L4472K3088
$$ -89540 -126205 -112151 -97622 -76987 -28278 -23198 -76383 -90401 -90467 -144976 -127091 -92619 -69531
8242f9531K5971M2468K837R88j390p691L9814L6300l6203k5666J8523o0620j8042
$$ -69531 -43560 -1092 1745 2733 1343 -6348 33466 69766 33563 7897 26420 -34200 -52242
8229e2242j134M8441L349L033j2711Q297k4416J8854k901j04304j0858J9885J2686
$$ -52242 -53376 -4935 -1586 1447 -11264 -2967 -27383 -8529 -11430 -115734 -126592 -106707 -94021
8216i4021K4228M4040k6636m5000N0174R7347m0203n1446k8320N0228J9924K6545
$$ -94021 -69793 -25753 -52389 -97389 -47215 50132 9929 -41517 -69837 -19609 315 26860
8204B6860L4531j6375k9860k255j7744M43n1610L4299N7253m5185J1939O531k1892
$$ 26860 61391 45016 15156 12901 -4843 -4400 -56010 -21711 35542 -9643 2296 8827 -13065
8191a3065r082J9264l0090o781k0213N8294r160M3629k2549o0024P754j8894k8292
$$ -13065 -22147 -2883 -32973 -39754 -59967 -1673 -10833 32796 10247 -49777 -42023 -60917 -89209
8178h9209J7897k6956k2552k385L9109O0882O2259L905n8067m4180k934R8422
$$ -89209 -71312 -98268 -120820 -123205 -84096 -23214 39045 42950 -15117 -59297 -62231 36191
8166C6191O6243p786n4907k3530j6560J1055m419n2375j9194P705j4397Q359O1124
$$ 36191 102434 94648 39741 16211 -349 10706 6287 -46088 -65282 -57577 -71974 -63615 -2491
8153b491L1496n4377K1207k3194j5229J8345L360L0580j2593l1239L1625M203
$$ -2491 29005 -25372 -4165 -27359 -42588 -24243 -20883 9697 -2896 -34135 -2510 1693
8141A693L7487J9864r3577k9753K2982M0730O9511j0108m3780R196N5550k1465
$$ 1693 39180 59044 -34533 -64286 -41304 -574 68937 58829 15049 24245 79795 58330
8129E8330j9112n5187p96J4042n4676J1761J1816M6018L6140p6940K0612O87K6284
$$ 58330 39218 -15969 -16765 -2723 -57399 -45638 -33822 12196 48336 -28604 -7992 -7305 18979
8116A8979O2602n6876o26q261j3162P353o4316j6676K3154m208M8491k295K0238
$$ 18979 81581 24705 24079 15818 2656 10009 -54307 -70983 -47829 -52037 -3546 -5841 14397
8103A4397m7163n947q293M4058M0196p5896k5157j0703k5119J8787K4231K5578
$$ 14397 -32766 -38713 -47006 -2948 37248 -38648 -63805 -74508 -99627 -80840 -56609 -31031
8091c1031l374Q641L6165j2917j3452J385m2837n688L6811j0914j9459J8529N4481
$$ -31031 -34405 -25764 10401 -2516 -15968 -14583 -57420 -63108 -26297 -37211 -56670 -38141 16340
8078A6340k0850m7104L394M7879O6361O0879O601p0421p5784n1918P756L8081
$$ 16340 -4510 -51614 -48220 -341 66020 126899 133500 63079 -12705 -64623 -56867 -18786
8066a8786l5210j7434O8133L4285m787q177j566m4336j4296L1750J7430l6254
$$ -18786 -53996 -71430 -3297 30988 26201 18024 16458 -27878 -42174 -10424 7006 -29248
8054b9248l9812K4992K23P266p051M4819N5185l3978j1649L2893l6155J4841j1415
$$ -29248 -69060 -44068 -43845 -36579 -43630 1189 56374 22396 10747 43640 7485 22326 10911
8041A0911l4286l5193K6608j2162l0162J9421K9972M3718J4770J9849J6430m6729
$$ 10911 -23375 -58568 -31960 -44122 -74284 -54863 -24891 18827 33597 53446 69876 23147
8029B3147O9685L445m3731K434J0448K8372o3191r8804n6863L4873P1088R87j1116
$$ 23147 92832 96277 52546 54980 65428 93800 30609 -68195 -125058 -90185 -19097 -18110 -29226
8016b9226Q9525K3387n6010o3388L629M3983k2263K3545L1056O59k3151J2841
$$ -29226 60299 83686 27676 -35712 -32083 11900 -10363 13182 44238 44897 21746 34587
8004C4587J3096L7129l9534m221k9863k7803J3045O2688J417l7559O6604k7495
$$ 34587 47683 84812 45278 41057 11194 -16609 -3564 59124 60541 22982 89586 62091
7992F2091p8369L3305k7102L7885N092l6719l1127p6072k2035M9695M1210K7001
$$ 62091 -16278 17027 -10075 27810 32902 -3817 -34944 -111016 -133051 -83356 -42146 -15145
7980a5145N210J3080O732o609k1408m5592m5238j4096K3811j1606k283O2717P6243
$$ -15145 -9935 3145 9877 3268 -18140 -63732 -108970 -123066 -99255 -110861 -113144 -50427 25816
7967B5816K018J2451m1351K6505O190K237J3864J550L5455J3181n6897l2971J2266
$$ 25816 27834 40285 -1066 25439 31629 33866 47730 49280 84735 97916 41019 8048 20314
7954B0314k8383N748N5503L925q358k4829k307k4509J6526J9875l1183k2210N5732
$$ 20314 -8069 -2321 53182 57107 48749 23920 21613 -2896 13630 33505 2322 -19888 35844
7941C5844k408k3721l3308O286M2122K1650p5152K182l7475L4911L9301L589p2591
$$ 35844 33436 9715 -23593 -17307 24815 46465 -28687 -26505 -63980 -29069 10232 13821 -58770
7928e8770n2102l2549L5807K1690P065N4056M4994m180K0741J8142j12720P007
$$ -58770 -110872 -143421 -107614 -85924 -78859 -24803 20191 16011 36752 54894 -57826 -50819
7916e0819R5997L0420j6985k2244l8870l877O4096K6680K5302k8058m791m0881
$$ -50819 45178 75598 58613 36369 -2501 -6378 57718 84398 109700 81642 76851 35970
7904C5970o6557Q34J3257k7079l2657K5494J4946o781l917N490j872N3152J3949
$$ 35970 -30587 -29753 -16496 -43575 -76232 -50738 -35792 -42573 -46490 -41000 -42872 10280 24229
7891B4229n3266m0463m9081K6766J1982L419Q5385L4764l2194l0134K3965k9020
$$ 24229 -29037 -69500 -118581 -91815 -79833 -76414 8971 43735 11541 -18593 5372 -23648
7879b3648p055M498K4226k1963k9735J1143M3619K9527l9907L964K1033o425o5038
$$ -23648 -30703 -26205 -1979 -23942 -53677 -42534 1085 30612 -9295 -5331 15702 9277 -55761
7866e5761K8217L394P0219Q273q088m2600q171l4426K2864J26555L003p4048m2226
$$ -55761 -27544 -24150 46069 54342 46254 3654 -4517 -38943 -16079 110476 113479 39431 -2795
7853b795K2293L4220j2525K396j3968p5738R137K5978O8032j9310o2956K9110
$$ -2795 19498 53718 41193 43589 29621 -46117 -36980 -11002 57030 37720 -25236 3874
7841C874P144K3756M9853J1977q504p9221n4553L3104M474K3554O6229M8579k9480
$$ 3874 11018 34774 84627 96604 88100 8879 -45674 -12570 -8096 15458 81687 130266 100786
7828A00786o6044k272J46k1594l4387m8417j3469j403L8815L9870n017J2949J6722
$$ 100786 34742 32470 32616 11022 -23365 -71782 -85251 -86654 -47839 -7969 -12986 -37 16685
7815A6685k1365J1988Q492n4310J2412k1247J2616J7671J0121K2721o105K3111
$$ 16685 -4680 7308 15800 -38510 -26098 -47345 -34729 -17058 -6937 15784 9679 32790
7803C2790M881l9347l7445N3510P457j8462k4125o631J3638l2426J5429N3731
$$ 32790 37671 -1676 -39121 14389 21846 3384 -20741 -27372 -13734 -46160 -30731 23000
7791B3000m91K3211J3586l3468k8492K0591l1442m9201r116J5212N0769O7615
$$ 23000 22509 45720 59306 25838 -2654 17937 -13505 -62706 -71822 -56610 -5841 61774
7779F1774N349n4966m2601M0345L3253K423j1484l1292J627j3088p677J4714n8520
$$ 61774 67123 12157 -30444 9901 43154 45577 34093 2801 4428 -8660 -16337 -1623 -60143
7766f0143l0224J6798J9853K814J9033J80o9335L9517M2859l0717n669J996k5187
$$ -60143 -90367 -73569 -53716 -50902 -31869 -31689 -101024 -61507 -18648 -49365 -55034 -53038 -78225
7753g8225O251L0258O892l5383Q2599R258m6063M091J329L4614L6897l4582P612
$$ -78225 -71974 -41716 -34824 -70207 12392 21650 -24413 -20322 -18993 15621 52518 17936 25548
7740B5548l3627m3262K2025M0151j755l6209m6230J7175j8101j0608K8472J0674
$$ 25548 -8079 -51341 -29316 10835 9080 -27129 -73359 -56184 -74285 -84893 -56421 -45747
7728d5747m7591j7371k105P8559O7124k1745p4714n0356Q7782M0796o4220p481
$$ -45747 -93338 -110709 -112814 -34255 32869 11124 -63590 -113946 -26164 14632 -49588 -57069
7716e7069R8300O8709m6809r6486m135O476m812m4541L5173P6261J6122p719l1150
$$ -57069 41231 109940 63131 -33355 -37490 -31014 -35826 -80367 -45194 31067 47189 39470 8320
7703H320O1918n1235l3172j3866k610o183P528l1338L0964L4669N5701k591K2656
$$ 8320 70238 19003 -14169 -28035 -30645 -36828 -29300 -60638 -29674 4995 60696 58105 80761
7690H0761j1190k0912n3490l9235l037M6481l0369n8226k667J8906N6555o240
$$ 80761 69571 48659 -4831 -44066 -47103 -622 -30991 -89217 -91884 -72978 -16423 -22663
7678b2663j2211m7653J2931p569L6713L0032L2359K1913j5483l3772J7309m583
$$ -22663 -34874 -82527 -69596 -77165 -40452 -10420 21939 43852 28369 -5403 11906 7323
7666G323N344n144k5001j9482l873L4174J0446n942l4479J3231P479m4874L9866
$$ 7323 12667 7523 -17478 -36960 -40833 -6659 3787 -2155 -36634 -23403 -15924 -60798 -20932
7653b0932J0280J2699K4586K2462j9757k6433N6977j1512l0912K2637K4850P684
$$ -20932 -10652 2047 26633 49095 29338 2905 59882 48370 17458 40095 64945 72629
7641G2629J6417r888l0818n5920J7397j6103o3918R085O2737M2101K7226m7368
$$ 72629 89046 79158 48340 -7580 9817 -6286 -70204 -61119 1618 43719 70945 23577
7629B3577k9970L8150j6056N37L2367m9326m4867K0884M0131J8940K733l790j6420
$$ 23577 -6393 31757 15701 16238 48605 -721 -45588 -24704 15427 34367 37100 33310 16890
7616A6890j5280r311k8043j9700J705O0020Q6713m8021q4244k594j0050k003R133
$$ 16890 1610 -7701 -35744 -55444 -53739 6281 92994 44973 -39271 -41865 -51915 -53918 -44785
7603d4785Q742J6636L6698j8434m2611J4362l2760P127l308Q674J6674L5684K2924
$$ -44785 -36043 -19407 17291 -1143 -43754 -29392 -62152 -55025 -58333 -49659 -32985 2699 25623
7590B5623m2194Q274L6319J3425K2483j0770J2568m676o3499Q249L488k4884J0455
$$ 25623 -16571 -8297 28022 41447 63930 53160 65728 61052 -2447 5802 9290 -15594 -5139
7577e139N9422J4622q9826j6689K5527q1856J7977J6996q3843O4312M1842j4816
$$ -5139 54283 68905 -20921 -37610 -12083 -93939 -75962 -58966 -142809 -78497 -36655 -51471
7565e1471K1273M1245l4652j4848K8066K1002k2289l0561p2595j4574M7984K0958
$$ -51471 -30198 11047 -23605 -38453 -10387 10615 -11674 -42235 -114830 -129404 -81420 -60462
7553f0462J571M5118N7268K3412l5564n419p5047r17j155l0160R908O8680l4523
$$ -60462 -58891 -13773 43495 66907 31343 25924 -49123 -50040 -51195 -81355 -71447 -2767 -37290
7540c7290j2837L7767L2634O184o290j1715k9049n0509M5112N3421J6821j2860
$$ -37290 -50127 -12360 20274 26458 20168 8453 -20596 -71105 -25993 27428 44249 31389
7528C1389M600m8664L0625J0186J6142M993m2419j1315r8351l7134K9767N7725
$$ 31389 35989 -12675 17950 28136 44278 49271 6852 -4463 -102814 -139948 -110181 -52456
7516e2456k0848L9334P1525k3194k5404K7796J5104l1915l264K4567l4895L3375
$$ -52456 -73304 -33970 37555 14361 -11043 16753 31857 -58 -3322 21245 -13650 19725
7504A9725J6811o4703j6379J0827J9258N8954L1418m7702p6558J6113l7950j7637
$$ 19725 36536 -28167 -44546 -33719 -14461 44493 75911 28209 -48349 -32236 -70186 -87823
7492h7823K9438J3499J4043L4537l3188j1112l027l8833k6763K3746j1962J5401
$$ -87823 -58385 -44886 -30843 3694 -29494 -40606 -43633 -82466 -109229 -85483 -97445 -82044
7480h2044k2247k6267M3126O9320O5975k4j4846J347p400l6668n9842l935j4083
$$ -82044 -104291 -130558 -87432 -18112 47863 47839 32993 34340 26940 -9728 -69570 -73505 -87588
7467h7588j5574R837L9072L8069n0894R854M8528L2116k7608j4415r281o89K524
$$ -87588 -103162 -93325 -54253 -16184 -67078 -57224 -8696 23420 -4188 -18603 -27884 -28573 -26049
7454b6049j3656K6144J103n996k251J5844K1099k4843K03o475n0221k1427J139
$$ -26049 -39705 -13561 -12458 -18454 -20705 -4861 16238 -8605 -8402 -14877 -65098 -86525 -85386
7441h5386m2022M5535J0654J260j5013M1356M6103l3319K3751J7952j2164j2240
$$ -85386 -127408 -81873 -71219 -69959 -84972 -43616 2487 -30832 -7081 10871 -1293 -13533
7429a3533K2838j8856o1657j9594K6875P4466k2628n2689K510n7276r509L7228
$$ -13533 9305 -9551 -71208 -90802 -63927 10539 -12089 -64778 -62268 -119544 -129053 -91825
7417i1825L7510k3625J1226M2600J1636J0849Q3307K3616j10423p1079J2047m0222
$$ -91825 -54315 -77940 -66714 -24114 -12478 -1629 81678 105294 -5129 -76208 -64161 -104383
7405a04383o83N3782j6710j4442k6312N0388K8703K2120j5682K8016m824k2704
$$ -104383 -105066 -51284 -67994 -82436 -108748 -58360 -29657 -7537 -23219 4797 -27 -22731
7393b2731m3887J1990K1797l8512L216J2996M8937K154K1460O723l0958p0976
$$ -22731 -66618 -54628 -32831 -71343 -68127 -55131 -6194 -4040 17420 24143 -6815 -77791
7381g7791M653L2003J9028N5333q6731o4239O984P085m529J4904N2952O9079K0931
$$ -77791 -73138 -41135 -22107 33226 -53505 -117744 -110760 -103675 -108204 -93300 -40348 28731 49662
7368D9662l5625o3809l0375p504n0787N3346L4526j7237p402m2699m9993O9141
$$ 49662 14037 -49772 -80147 -87651 -138438 -85092 -50566 -67803 -75205 -117904 -167897 -98756
7356i8756N7855K4654n419O324L5022k5337j8931K9766m0814m4967M5665J10806
$$ -98756 -40901 -16247 -21666 -15342 19680 -5657 -24588 5178 -35636 -80603 -34938 75868
7344G5868l6867K1652K5575l8316N935l4780j8626P1563K2548l1498m308J0066
$$ 75868 39001 60653 86228 47912 53847 19067 441 72004 94552 63054 58746 68812
7332F8812L3546J2828k9517q8813J2972N1180P635p5673L0866K816k5954j4879
$$ 68812 102358 115186 85669 -3144 9828 61008 68643 -7030 23836 26652 698 -14181
7320a4181O022j2595L3957m991k9018k2473j2418P9603L3446J1569L1481j9031
$$ -14181 -8159 -20754 13203 8212 -20806 -43279 -55697 23906 57352 68921 100402 81371
7308H1371k5210K4123L3002o7340n4487j7291M1103k040L6713j4615k2275k437
$$ 81371 56161 80284 113286 45946 -8541 -25832 15271 13231 49944 35329 13054 10617
7296A0617K8365p455l1506L857M0406K4538p921r3328r6986K6632N3831l3221
$$ 10617 38982 31527 21 3878 44284 68822 60901 -32427 -129413 -102781 -48950 -82171
7284h2171J5355R303J0461P2346Q214l8792l0553j1836O4312l9115o9980L3682
$$ -82171 -66816 -57513 -47052 25294 33508 -5284 -35837 -47673 16639 -22476 -92456 -58774
7272e8774N1693J6800J1013L010l345J1693r935m8140o7834M9148J46488J5649
$$ -58774 -7081 9719 20732 23742 20397 32090 22155 -25985 -93819 -44671 101817 117466
7260A17466q1050o1537J445J0448K2088L5242P26r582k1373l5356L8742K4494
$$ 117466 36416 -25121 -23676 -13228 8860 44102 44828 35246 13873 -21483 17259 41753
7248D1753j6012p906r365k0532j5248P5755O2068R31k4480o0210m3885Q457L6529
$$ 41753 25741 17835 8470 -12062 -27310 48445 110513 111444 86964 26754 -17131 -8674 27855
7235B7855j039N035j7512o6689m8191j5470J7265J933N7584K1098j5123K238L9850
$$ 27855 26816 31851 14339 -52350 -100541 -116011 -98746 -96813 -39229 -18131 -33254 -31016 8834
7222H834o873j4730n4235l6358N8092M5281l7438n5386J1935M4226L5817j0644
$$ 8834 1961 -12769 -67004 -103362 -45270 11 -37427 -92813 -80878 -36652 -835 -11479
7210a1479j9876j6712k4072M9353l2466o1414L6797M0105L0428J4010k4814n4288
$$ -11479 -31355 -48067 -72139 -22786 -55252 -116666 -79869 -39764 -9336 4674 -20140 -74428
7198g4428L0552K2462K0679L4903j3453k6679L0213J0087J3144j3406K4282K5294
$$ -74428 -43876 -21414 -735 34168 20715 -5964 24249 34336 47480 34074 58356 83650
7186H3650n237M328L8313k439l1469p496J7772l8247m2554l7151j5843l8751N7472
$$ 83650 78413 82741 121054 118615 87146 79650 97422 59175 16621 -20530 -36373 -75124 -17652
7173a7652O7361J7863K5111k1762o0449m5638o4332j5492R2267P8216l6774n7379
$$ -17652 49709 67572 92683 70921 10472 -35166 -99498 -114990 -22723 55493 18719 -38660
7161c8660m9487n0429K4226p052l2373K8407N9417j3873L1571K5962N926k7930
$$ -38660 -88147 -138576 -114350 -121402 -153775 -125368 -65951 -79824 -48253 -22291 -16365 -44295
7149d4295J139k9985l5631K1237R3087L8761k0097j266k9639O191M1254L8071
$$ -44295 -43156 -73141 -108772 -87535 5552 44313 24216 22950 -6689 -498 40756 78827
7137G8827K9674l5685k9334L4573j7435J7250L547m511p78n8716L298J6818o5847
$$ 78827 108501 72816 43482 78055 60620 77870 81417 76906 76128 17412 20710 37528 -28319
7124b8319m7917Q0205P398k1480L988K847N262M534r948j7008P8153n2568p9137
$$ -28319 -76236 3969 11367 -10113 -6125 -3278 1984 6518 -3430 -20438 57715 5147 -73990
7111g3990l3081N4204J1451K9089J2482j0014k0351N5074K2192j1101k171m61
$$ -73990 -107071 -52867 -41416 -12327 155 -9859 -30210 24864 47056 35955 33784 33323
7099C3323M0566j2357l5046M4925n109l0282J5579K4608m0556l0903J4603m0338
$$ 33323 73889 61532 26486 71411 66302 36020 51599 76207 35651 4748 19351 -20987
7087b0987j0723K9079o9272J5655L0742N6232n8456j235K8297j1775L4906N113
$$ -20987 -31710 -2631 -71903 -56248 -25506 30726 -27730 -28965 -668 -12443 22463 27576
7075B7576k3115J6403o2497K1939N1742J3738n713m7448o6796m4735k6035J01050
$$ 27576 4461 20864 -41633 -19694 32048 45786 40073 -7375 -74171 -118906 -144941 -43891
7063d3891R6176k6199R779n2464m3283K5133K2340J2621L6894k2974J5917k0726
$$ -43891 52285 26086 35865 -16599 -59882 -34749 -12409 212 37106 14132 30049 9323
7051I323J6920j7458j5314j7907p587M9024L3529n882q011k0344o04K9379n835
$$ 9323 26243 8785 -6529 -24436 -32023 17001 50530 44648 36637 16293 15689 45068 39233
7038C9233o5839M973J5249J1102R838n3659m8209N6847M4672L0218q300l3210
$$ 39233 -26606 -21633 -6384 4718 14556 -39103 -87312 -30465 14207 44425 36125 2915
7026B915p1591p13N2706o2789q687K7171p567j0952N9225O1132k6171r644n0177
$$ 2915 -68676 -69389 -16683 -79472 -88159 -60988 -68555 -79507 -20282 40850 14679 5035 -45142
7013d5142O779l814L6575o8306Q948N3576K5353k525K0693l0757m1245l9786K2533
$$ -45142 -38363 -42177 -5602 -73908 -64960 -11384 13969 11444 32137 1380 -39865 -79651 -57118
7000e7118M7246J9354K9280m643K7828j4859l0363m9942K2797j7422m0360J7035
$$ -57118 -9872 9482 38762 34119 61947 47088 16725 -33217 -10420 -27842 -68202 -51167
6988e1167R6242K7026p6979J7758L3897J9165l6496l6254M567O3190O1161o664
$$ -51167 45075 72101 -4878 12880 46777 65942 29446 -6808 -2241 60949 122110 115446
6976A15446J7633L3610L2848n9570j19039Q568P8562N251l1263M465n1078j00232
$$ 115446 133079 166689 199537 139967 20928 29496 108058 113309 82046 86511 35433 -64799
6964f4799j598M113M3075l2538l829J7208J840J7601O6142P755l9281p1160l9116
$$ -64799 -66397 -62284 -19209 -51747 -55576 -38368 -36528 -18927 47215 54970 15689 -55471 -94587
6951i4587N4924j163j4875j9037l3402j291O211Q0420P4094o26L0485K8368p2144
$$ -94587 -39663 -40826 -55701 -74738 -108140 -109431 -103220 -22800 51294 50668 81153 109521 37377
6938C7377o6139k867N013n9637m1409l895P258L8486K9219M0151K2853P6384l2784
$$ 37377 -28762 -31629 -26616 -86253 -127662 -131557 -124299 -85813 -56594 -16443 6410 82794 50010
6925E0010p1080k1810l8953j0360m812Q1903Q1709l6786r1046j1369N5916K3150
$$ 50010 -21070 -42880 -81833 -92193 -97005 -15102 66607 29821 -61225 -72594 -16678 6472
6913F472K272j7282J0407J7989l3531m234L3078k4868o3983o9484J4656L6960
$$ 6472 8744 -8538 1869 19858 -13673 -17907 15171 -9697 -73680 -143164 -128508 -91548
6901i1548K8747J6016k0604J3770M177M6194J3653J1804n350k2075m924J0102
$$ -91548 -62801 -46785 -67389 -53619 -49442 -3248 10405 22209 16859 -5216 -10140 -38
6889c8n786q6068J7211J3166O34j6523J0264o7053k300N0473Q351k8331M1014
$$ -38 -5824 -91892 -74681 -61515 -60881 -77404 -67140 -134193 -136493 -86020 -77669 -106000 -64986
6876f4986Q8294m0165n4658K2579K7148O2426L5783k5511l0884l7215k5745N4618
$$ -64986 23308 -16857 -71515 -48936 -21788 40638 76421 50910 20026 -17189 -42934 11684
6864A1684m232J398n4776q922M6840K4489K0678L787l5045n2552m8517K4283L6731
$$ 11684 7452 8850 -45926 -54848 -8008 16481 37159 40946 5901 -46651 -95168 -70885 -34154
6851c4154N0589L523m0256j7470k41J1960K9302k1687p0472l4620L2033m586j6785
$$ -34154 16435 19958 -20298 -37768 -38009 -26049 3253 -18434 -88906 -123526 -91493 -96079 -112864
6838a12864L4978L117N6558P5992k1604r148j8484j5377j4609l4692k6553l3317
$$ -112864 -77886 -74769 -18211 57781 36177 27029 8545 -6832 -21441 -56133 -82686 -116003
6826a16003P6235K9423m013n5590Q519j3582J3126O3721N464m856m8513N146J289
$$ -116003 -39768 -10345 -14358 -69948 -61429 -75011 -61885 1836 7300 2444 -46069 -40923 -39634
6813c9634R701O801N0458k76o5969j13815k2331L6924K6943M1742N4817K8600
$$ -39634 -29933 -23132 27326 27050 -38919 -152734 -175065 -138141 -111198 -69456 -14639 13961
6801A3961k8540K3706j2614N1136J3487m952P104o743j0926k36j3942k0462l2376
$$ 13961 -14579 9127 -3487 47649 61136 56184 63288 56545 45619 45383 31441 10979 -21397
6788b1397r659j534L3971o15L8704r400N069K2810R08o3067k797K8485J2773k7258
$$ -21397 -31056 -32590 1381 766 39470 30070 35139 57949 58857 -4210 -7007 21478 34251 6993
6774F993l5416k6680J9940l2988L1718J5654j7742k1788L9797J5639J2489l5283
$$ 6993 -28423 -55103 -35163 -68151 -36433 -20779 -38521 -60309 -20512 -4873 7616 -27667
6762b7667k3544L7148K4345n880L5019n7838j4880p213j8565l6892M5067J7739
$$ -27667 -51211 -14063 10282 4402 39421 -18417 -33297 -40510 -59075 -95967 -50900 -33161
6750c3161k861L3917M0798k7506n49n7422O031j3545J0162J4835r877r687N7723
$$ -33161 -36022 -2105 38693 11187 10638 -46784 -40753 -54298 -44136 -29301 -39178 -48865 8858
6737H858J4359J6474J3149k4031j1213r101K1170j6948M246J4109o449k1357k770
$$ 8858 23217 39691 52840 28809 17596 8495 29665 12717 16963 31072 24623 3266 496
6724D96j6920K1752K1851P6674J12424M3616n2786o9911q7035p4397J8107R297
$$ 496 -16424 5328 27179 103853 216277 259893 207107 137196 50161 -24236 -6129 3168
6712C168p518J0314J5714R227p87q6424J1263Q7087J7875J3933L8399o5264r5334
$$ 3168 -4350 5964 21678 30905 30118 -56306 -45043 42044 59919 73852 112251 46987 -48347
6699d8347k0597J7984J3722J9054J7640k0786q763j220R109j8068L1165J1339
$$ -48347 -68944 -50960 -37238 -18184 -544 -21330 -30093 -31313 -22204 -40272 -9107 2232
6687B232m9961l6797o740M4364N3156L327m3195L2114n3190k737O4725J7902K7681
$$ 2232 -47729 -84526 -91266 -46902 6254 9581 -33614 -1500 -54690 -57427 7298 25200 52881
6674E2881k6842O942L4286n0879l5217k3343k772M0000N554m046k4046k4774j3218
$$ 52881 26039 32981 67267 16388 -18829 -42172 -44944 -4944 610 -3436 -27482 -52256 -65474
6661f5474N7O831M5455P3237j7j4330J8451l546m1872j9719n072p8578m2681L336
$$ -65474 -65417 -58586 -13131 60106 60089 45759 64210 60664 18792 -927 -5999 -84577 -127258 -123922
6647a23922J8138J4670N7557J6418p1197M7081Q1838L394J4606j8362l0070j5769
$$ -123922 -105784 -91114 -33557 -17139 -88336 -41255 40583 43977 58583 40221 10151 -5618
6635e618j5907K6396K9533M3328j8490o45j9895n8775L431Q004m1363j152Q1171
$$ -5618 -21525 4871 34404 77732 59242 58597 38702 -20073 -16642 -8638 -50001 -51153 30018
6622C0018N962m435P920j8937n6431k7602O2985K9310K1409k3145M3891j7397
$$ 30018 35980 31545 39465 20528 -35903 -63505 -520 28790 50199 27054 70945 53548
6610E3548J3735J1857J9347j7371p5776J9269K4269K1594q280m2023n6012J018
$$ 53548 67283 79140 98487 81116 5340 24609 48878 70472 62192 20169 -35843 -34825
6598c4825K9922j2844o7297M2306P0021N0965j7547k1785j6130n609o9340L5890
$$ -34825 -4903 -17747 -85044 -42738 27283 78248 60701 38916 22786 17177 -52163 -16273
6586a6273M725P6373k1224l8171k1917p7725k7157m12L0567k4237j5946l2823
$$ -16273 -11548 64825 43601 5430 -16487 -94212 -121369 -121781 -91214 -115451 -131397 -164220
6574a64220Q075J0261K8267Q2009M7718k2337R678j4745n999J7101L2434m6253
$$ -164220 -156145 -145884 -117617 -35608 12110 -10227 -549 -15294 -21293 -4192 28242 -18011
6562a8011L6238L8487j0645m0510l5042L9478O2890O262l4352q9148n7693J1876
$$ -18011 18227 56714 46069 5559 -29483 9995 72885 79147 44795 -44353 -102046 -90170
6550i0170M057L9009J3231k3028P3248k7513k5458J8381J0243K4407K5798k3391
$$ -90170 -86113 -47104 -33873 -56901 16347 -11166 -36624 -18243 -8000 16407 42205 18814
6538A8814n2553p7614k4611K9896L9832Q3834q624j2242r620k657O1655k0955
$$ 18814 -33739 -111353 -135964 -106068 -66236 17598 8974 -3268 -12888 -15545 46110 25155
6526B5155l4487K2875j8227j6243J5944J2598K7645n651n4259j3645k9555L3190
$$ 25155 -9332 13543 -4684 -20927 -4983 7615 35260 29609 -24650 -38295 -67850 -34660
6514c4660j7527J3122O8088r920j727k0093j0739m770M1709J5707R580R415l6475
$$ -34660 -52187 -39065 29023 19103 17376 -2717 -13456 -18226 23483 39190 48770 58185 21710
6501B1710l9368n1439J2306J7184L205o436j8011L0176N5333o5666m7276P72M6852
$$ 21710 -17658 -69097 -56791 -39607 -36402 -42838 -60849 -30673 24660 -41006 -88282 -87510 -40658
6488d0658M1728o324J6762j4342l2734o9483L8955j0113L9347M240o5879l163
$$ -40658 1070 -5254 11508 -2834 -35568 -105051 -66096 -76209 -36862 -32622 -98501 -101664
6476a01664M9236j9725K938O2419M9649J8739n5359l9787L2580N095K0287j5747
$$ -101664 -52428 -72153 -69215 -6796 42853 61592 6233 -33554 -974 4121 24408 8661
6464H661J3548j2268l0152j2026K681k0994k1135p458j7521N737K5841M7801K9843
$$ 8661 22209 9941 -20211 -32237 -29556 -50550 -71685 -79143 -96664 -90927 -65086 -17285 12558
6451A2558n7053o0730k0278P7157Q8066M8507J7082o0530j7884k2729q8383o9183
$$ 12558 -44495 -105225 -125503 -48346 39720 88227 105309 44779 26895 4166 -84217 -153400
6439a53400M7027R3146r649q43j6053j8498M201L9566L170m3887n6987l698j1986
$$ -153400 -106373 -13227 -22876 -23719 -39772 -58270 -54069 -14503 -11333 -55220 -112207 -115905 -127891
6426a27891N0399N5703L4608N040m4083r191J188k1689K6726L8738q919l7563
$$ -127891 -77492 -21789 12819 17859 -26224 -35415 -34227 -55916 -29190 9548 629 -36934
6414c6934o6347K5533O0517J2677n4462J9692l8988L224J2576L934m3915K6285
$$ -36934 -103281 -77748 -17231 -4554 -59016 -39324 -78312 -75088 -62512 -58578 -102493 -76208
6402g6208L154k5977L2472K8035l8519k0937K8056L6243L5461J7594j7294j5043
$$ -76208 -73054 -99031 -66559 -38524 -77043 -97980 -69924 -33681 1780 19374 2080 -12963
6390a2963J8435k4260n158J2773L653J974j6931P619J6910k6163m4616k0236p444
$$ -12963 5472 -18788 -23946 -11173 -7520 -5546 -22477 -14858 2052 -24111 -68727 -88963 -96407
6377i6407M8073K8928l0946j9268L7301k7842j1920L1817K6793n658L4261M5935
$$ -96407 -48334 -19406 -50352 -69620 -32319 -60161 -72081 -40264 -13471 -19129 15132 61067
6365F1067P459J6161J785l4288o9073o4989J367N3810P526k3292j6408L9057j2267
$$ 61067 68526 84687 86472 52184 -16889 -81878 -80511 -26701 -19175 -42467 -58875 -19818 -32085
6352c2085q499K876n636j5081j6241L1850K1029m5258n2502M187O9129N5710j797
$$ -32085 -40584 -37708 -43344 -58425 -74666 -42816 -21787 -67045 -119547 -115360 -46231 9479 7682
6339G682K8687K606k251K259q753l5912K481k5055p323j2507J2470l8392p0280
$$ 7682 36369 38975 36724 38983 30230 -5682 -3201 -28256 -35579 -48086 -35616 -74008 -144288
6326a44288L6649N6115Q2354L5176m303o9530l8560j8042j6588J6579k386M0376
$$ -144288 -107639 -51524 30830 66006 61703 -7827 -46387 -64429 -81017 -64438 -66824 -26448
6314b6448J599j5715m2588l3022L7938K6037l2109k4194k823Q7690q632l0890
$$ -26448 -24849 -40564 -83152 -116174 -78236 -52199 -84308 -108502 -111325 -23635 -32267 -63157
6302f3157j0927O051l8594l6819k8620K5763R7490P1732L5080P139j17m0021l8583
$$ -63157 -74084 -68033 -106627 -143446 -172066 -146303 -48813 22919 57999 65138 65021 25000 -13583
6289a3583o1001O6200Q3221l3287l1366n1951J5834K3767j848K8839p564K4253
$$ -13583 -74584 -8384 74837 41550 10184 -41767 -25933 -2166 -4014 24825 17261 41514
6277D1514R031l4065J7926j8539n6356k8474J554J9141J0473q242L0910j8432
$$ 41514 50545 16480 34406 15867 -40489 -68963 -67409 -48268 -37795 -46037 -15127 -33559
6265c3559k5600L8680J2017j6313M5500l1472p4241m4279L38L4234M9314J5109
$$ -33559 -59159 -20479 -8462 -24775 20725 -10747 -84988 -129267 -128929 -94695 -45381 -30272
6253c0272r941O1677L8208k9183k7481k6238J340n4364j8521k0187N1188N9541
$$ -30272 -40213 21464 59672 30489 3008 -23230 -21890 -76254 -94775 -114962 -63774 -4233
6241d233o289m9139k7280P2549K7824r21P574O9192L021m2237o4158j6505j9362
$$ -4233 -10522 -59661 -86941 -14392 13432 12511 20085 89277 92298 50061 -14097 -30602 -49964
6228d9964k6094l213j7369J5938K9084O5672M581J8580j6321Q3697L9591p4525
$$ -49964 -76058 -79271 -96640 -80702 -51618 14054 18635 37215 20894 104591 144182 69657
6216F9657m1332J7675N6914j124j3267k6390m0571j2195L912o1276K1885O5336
$$ 69657 28325 46000 102914 101790 88523 62133 21562 9367 13279 -47997 -26112 39224
6204C9224j6003l2404M396N4901m546j08450l2167M9608L1052N743K5035J6024
$$ 39224 23221 -9183 -4787 50114 45568 -62882 -95049 -45441 -14389 -8646 16389 32413
6192C2413K9068j4228K2299m752J3265k6041k4812j8571L0493L2002k1665l1140
$$ 32413 61481 47253 69552 64800 78065 52024 27212 8641 39134 71136 49471 18331
6180A8331m5576J0398K220J2038K3362K6563o0623J1830J4863l4722J4789L8311
$$ 18331 -27245 -16847 -14627 -2589 20773 47336 -13287 -1457 13406 -21316 -6527 31784
6168C1784l700j6407p4940m6127K6739P2344p820k3521p398J4027n6245K3932
$$ 31784 28084 11677 -63263 -109390 -82651 -10307 -18127 -41648 -49046 -35019 -91264 -67332
6156f7332k4653K4341L2852N79K1810n3555j9195k1973m0112O8666j725P400j0421
$$ -67332 -91985 -67644 -34792 -34213 -12403 -65958 -85153 -107126 -147238 -78572 -80297 -72897 -83318
6143h3318K7094J5859N3062J4893m762j0958O6032O580p7592j5072M64Q415l5286
$$ -83318 -56224 -40365 12697 27590 22828 11870 77902 84482 6890 -8182 -7718 697 -34589
6130c4589k8790J7471K7993J7589r194M576L6933N91p417q495k517j0464n8704
$$ -34589 -63379 -45908 -17915 -326 -9520 -4944 31989 32580 25163 16668 14151 3687 -55017
6117e5017m1139L9999P2590L8260n6155q278J7901j9546r6316j1802L1604R067
$$ -55017 -96156 -56157 16433 54693 -1462 -9740 8161 -11385 -107701 -119503 -87899 -78832
6105g8832O5248m6815J9982M1388K8007L0794N082N0469m6979m7706k6107K598
$$ -78832 -13584 -60399 -40417 971 28978 59772 64854 115323 68344 20638 -5469 -2871
6093b871K3528L0522n7124j6480j4655L9303J9300l5054J2862M8396k2138n1512
$$ -2871 20657 51179 -5945 -22425 -37080 2223 21523 -13531 -669 47727 25589 -25923
6081b5923K3242K1545J5902p841m1920j2035P830O441p1971r317K0789J8296J4386
$$ -25923 -2681 18864 34766 26925 -14995 -27030 -19200 -12759 -84730 -94047 -73258 -54962 -40576
6068d0576Q070L34k338j9335J2741P0813K5378O654l8219k7180j5333K7837K0541
$$ -40576 -32506 -32172 -34510 -53845 -41104 29709 55087 61741 23522 -3658 -18991 8846 29387
6055B9387l4041l9535L4413k7681k829L9329M5436j8907l6728p631k959K6703
$$ 29387 -4654 -44189 -9776 -37457 -40286 -957 44479 25572 -11156 -18787 -21746 4957
6043D957O3915l8333m1864j1422o7l5933o12J1183L4929k3155k7496K5381Q5038
$$ 4957 68872 30539 -11325 -22747 -22814 -58747 -59359 -48176 -13247 -36402 -63898 -38517 46521
6030D6521K5224j71q568J7841l7653n0567n939L7359J2747k5777K408K5062L115
$$ 46521 71745 71574 63006 80847 43194 -7373 -13312 24047 36794 11017 13425 38487 41602
6017D1602k1610N7738l104q5722k8792M4654M5986K6458n2727K2016K366k2260
$$ 41602 19992 77730 74626 -11096 -39888 4766 50752 77210 24483 46499 48865 26605
6005B6605k113M6372r79m4644l3613Q172J920N8060M9169n8897n5334j8053l3503
$$ 26605 24492 70864 69885 25241 -8372 -200 1720 59780 108949 50052 -5282 -23335 -56838
5992e6838o509L9445N2160j7622J9312j7933r071q739r409l3043P034J9992M9962
$$ -56838 -63347 -23902 28258 10636 29948 12015 2944 -5795 -15204 -48247 -41213 -21221 28741
5979B8741K1397o6513k8008N9592p017j392j5839k0851j0134l6405J4284l0872
$$ 28741 50138 -16375 -44383 15209 8192 6800 -9039 -29890 -40024 -76429 -62145 -93017
5967i3017j4121L8655j0806J3212N4089l2551n0917P3828O0700j5604p5k1023
$$ -93017 -107138 -68483 -79289 -66077 -11988 -44539 -95456 -21628 39072 23468 23393 2370
5955B370m9276N2380J1097n0850m4559m9246J9787N1114J2045K1397L3815l3390
$$ 2370 -46906 5474 16571 -34279 -78838 -128084 -108297 -57183 -45138 -23741 10074 -23316
5943b3316k5674L2864N9151l662j1869J8392m5198L0876p346p4888k4641P9387
$$ -23316 -48990 -16126 43025 39363 27494 45886 688 31564 24218 -50670 -75311 4076
5931D076J3187J4102M0028r139n1573o506L1163l8892o351k066o7409Q490j1374
$$ 4076 17263 31365 71393 62254 10681 4175 35338 -3554 -9905 -11971 -79380 -70890 -82264
5918h2264O0730O1569O991J0916n864L3700k713J0752J4053l2735n5879k1437
$$ -82264 -21534 40035 47026 57942 52078 85778 83065 93817 107870 75135 19256 -2181
5906b181k5759k1215j1074J8446j0615M4302L3471N0507j7689N6664m2028o1546
$$ -2181 -27940 -49155 -60229 -41783 -52398 -8096 25375 75882 58193 114857 72829 11283
5894A1283J9329J1457l0551J1070l0614k7281J925J6018J1689M9047N2655J6915
$$ 11283 30612 42069 11518 22588 -8026 -35307 -33382 -17364 -5675 43372 96027 112942
5882A12942j04235k7977O6764N110j4452j1963M6998q6523L0442P3757M6464o821
$$ 112942 8707 -19270 47494 52604 38152 26189 73187 -13336 17106 90863 137327 130506
5870A30506o9545q030K715q04p74L9844l0700k7678K8041m7379l0320k04R816
$$ 130506 60961 52931 55646 54842 54068 93912 63212 35534 63575 16196 -14124 -14328 -4512
5857d512K7427l940j4286j5313n676j4951j5345R843O77J8267J5463K8171K9258
$$ -4512 22915 18975 4689 -10624 -16300 -31251 -46596 -36753 -36076 -17809 -2346 25825 55083
5844E5083q911l9391L8430L4164k5464j6438k0533M2731j8115m3223O2296k2081
$$ 55083 46172 6781 45211 79375 53911 37473 16940 59671 41556 -1667 60629 38548
5832C8548l8375K1355M6662n4235M840K7209m8576q0643L3465M9167l775L3294
$$ 38548 173 21528 68190 13955 18795 46004 -2572 -83215 -49750 -583 -4358 28936
5820B8936J246j7787o034j3797n0299K5238L5733k0406N202K635k9917k4649L6761
$$ 28936 30182 12395 6361 -7436 -57735 -32497 3236 -17170 -11968 -9333 -39250 -63899 -27138
5807b7138r692l6970M7532N5299O993q3021n6294L8100K5215k891k394j5496O649
$$ -27138 -36830 -73800 -26268 29031 36024 -46997 -103291 -65191 -39976 -42867 -45261 -60757 -54108
5794e4108J386r447K3138n914K0285Q775m3366o5924Q3419O8465j4597p0675l9714
$$ -54108 -52722 -62169 -39031 -44945 -24660 -15885 -59251 -125175 -41756 26709 12112 -58563 -98277
5781i8277J7434M8403K2257J0230K4282j6614J7125K837r995j7380J1953k3339
$$ -98277 -80843 -32440 -10183 47 24329 7715 24840 27677 17682 302 12255 -11084
5769a1084j8514l0821l4942K6509n278Q035J9398M3743L4852l5392l3503M40K2421
$$ -11084 -29598 -60419 -95361 -68852 -74130 -66095 -46697 -2954 31898 -3494 -36997 -36557 -14136
5756a4136L3870P614l9708j3246J4528K4082K8018l677k5169m2440l7418j2373
$$ -14136 19734 27348 -12360 -25606 -11078 13004 41022 37345 12176 -30264 -67682 -80055
5744h0055M3953k3688K6703N2335n7614N804M5333n2420p274O2291l7660N925
$$ -80055 -36102 -59790 -33087 19248 -38366 -32562 12771 -39649 -46923 15368 -22292 -16367
5732a6367l2424j2677L1733J1407J2061l0771m6317N0442N2243L526N742P9178
$$ -16367 -48791 -61468 -29735 -18328 -6267 -37038 -83355 -32913 19330 22856 28598 107776
5720A07776j8574p7495k0297p851M9917J5235J0468k123m3656n1289J1413R542
$$ 107776 89202 11707 -8590 -16441 33476 48711 59179 57056 13400 -37889 -26476 -16934
5708a6934L978l4939o1119J5693P2534L9070J6582J9248l4189K0006M1189L758
$$ -16934 -12956 -47895 -109014 -93321 -20787 18283 34865 54113 19924 39930 81119 84877
5696H4877o7214j5203M2657L0652j743n1835j7061j342j6990k4081l1788K106
$$ 84877 17663 2460 45117 75769 74026 22191 5130 3788 -13202 -37283 -69071 -66965
5684f6965L9547J2851k9453n3870K3894N2453l840m339n648k0703P165k1644Q378
$$ -66965 -27418 -14567 -44020 -97890 -73996 -21543 -25383 -29722 -35370 -56073 -48908 -70552 -62174
5671f2174K6375K473n5777m6397L143Q3355N0697j2561k2067o159m3936r397N4054
$$ -62174 -35799 -33326 -89103 -135500 -132357 -49002 1695 -10866 -32933 -39092 -83028 -92425 -38371
5658c8371L7517J3457k1772l7726n2181j1038J3354P304L6154l1040l1306K5057
$$ -38371 -854 12603 -9169 -46895 -99076 -110114 -96760 -89456 -53302 -84342 -115648 -90591
5646i0591Q2851P6583J3266j5769k5425j1n919o1449K5134N0882P632O296n9685
$$ -90591 -7740 68843 82109 66340 40915 40904 34985 -26464 -1330 49552 57184 63480 3795
5633C795k3136N9309j3383m1124O752l1276J6583M1346j4508K8818j3692k4093
$$ 3795 -19341 39968 26585 -14539 -7787 -39063 -22480 18866 4358 33176 19484 -4609
5621d609k8540K3905L0514k0121o3372M0112l8472o1235K192l4633O3440N9915
$$ -4609 -33149 -9244 21270 1149 -62223 -22111 -60583 -121818 -119626 -154259 -90819 -30904
5609c0904L158M3821P8055j9532q3252L0054J3793J8849k086j5500K9089m5342
$$ -30904 -27746 16075 94130 74598 -8654 21400 35193 54042 51956 36456 65545 20203
5597B0203k2902J097K8062r917o4030r179j3794K9043K4853M965K8537k8621k7275
$$ 20203 -2699 -1602 26460 16543 -47487 -56666 -70460 -41417 -16564 -11599 16938 -11683 -38958
5584c8958o418R6842j6687n2297k5840p3249j4004L3537k2952J8634K0485O3272
$$ -38958 -45376 51466 34779 -17518 -43358 -116607 -130611 -97074 -120026 -101392 -80907 -17635
5572a7635M5612o0503l1173m579M1202J34822N0041n7160r7938j4653J1278o7534
$$ -17635 27977 -32526 -63699 -68278 -27076 107746 157787 100627 2689 -11964 -686 -68220
5560f8220K734J6438o48M7513q647q479P324j8794L3996p0340k4211j4822K8537
$$ -68220 -65486 -49048 -49696 -2183 -10830 -19309 -11985 -30779 3217 -67123 -91334 -106156 -77619
5547g7619N4560L6662o002o0614l5580N9236L7520l3318L2914K3513K8392n2799
$$ -77619 -23059 13603 7601 -53013 -88593 -29357 8163 -25155 7759 31272 59664 6865
5535F865m1149o0865K104O9523J7730J2240M9504M0384m7203p8218K6420l0652
$$ 6865 -34284 -95149 -93045 -23522 -5792 6448 55952 96336 49133 -29085 -2665 -33317
5523c3317j5136J8847M5834o850J7155N1178k4928p2305l0866p3266K2151M198
$$ -33317 -48453 -29606 16228 9378 26533 77711 52783 -19522 -50388 -123654 -101503 -97305
5511i7305K1304k5472l0316J7414M3143L9739j9031l0783l4576L7239K0250J5494
$$ -97305 -76001 -101473 -131789 -114375 -71232 -31493 -50524 -81307 -115883 -78644 -58394 -42900
5499d2900Q588R609n4138m2623k2125K6141M5113M7785l6982l2707J7737J1809
$$ -42900 -34312 -24703 -78841 -121464 -143589 -117448 -72335 -24550 -61532 -94239 -76502 -64693
5487f4693L2518j5952N211l5040k8025M5423Q2743L3046K9947o5297k6872J5717
$$ -64693 -32175 -48127 -42916 -77956 -105981 -60558 22185 55231 85178 19881 -6991 8726
5475H726m480o2083m6171O7752J0146l4481K8651r192k803L6063n0294j0700Q956
$$ 8726 4246 -57837 -104008 -36256 -26110 -60591 -31940 -41132 -43935 -7872 -58166 -68866 -59910
5462e9910R2275P5439o0264n7881K2014j7584o3683R374P0986j5218p4847m0747
$$ -59910 32365 107804 47540 -10341 11673 -5911 -69594 -60220 10766 -4452 -79299 -120046
5450a20046M5660j363j8683M5608J02538L2728k8779r1372k5920L3657L1687J6553
$$ -120046 -74386 -75749 -94432 -48824 53714 86442 57663 -33709 -59629 -25972 5715 22268
5438B2268o7081L516K6010P999L8488K4399J674l5937n5494K8875L6455k1379
$$ 22268 -44813 -41297 -15287 -7288 31200 55599 57273 21336 -34158 -5283 31172 9793
5426I793k3739m690J4031J382K5021J9326M0187l5093n0967j8507J5529J0784
$$ 9793 -13946 -18636 -4605 -3223 21798 41124 81311 46218 -4749 -23256 -7727 3057
5414C057M418M1556K0354k5227N957K477J376m1545m4086j0690J975l1312R721
$$ 3057 7475 49031 69385 44158 50115 52592 53968 12423 -31663 -42353 -40378 -71690 -61969
5401f1969Q6481Q046o9994o95K4566l3754J7505j1713k2213k1520M8504K5585
$$ -61969 24512 32558 -37436 -38131 -13565 -47319 -29814 -41527 -63740 -85260 -36756 -11171
5389a1171o7406M0937M5158j4815j6844L6248R58J4644J6823l0319J8474M4771
$$ -11171 -78577 -37640 7518 -7297 -24141 12107 13065 27709 44532 14213 32687 77458
5377G7458j6860J8591R058k8167l7764k5604l659o8486j4996M185n0057j8507
$$ 77458 60598 79189 88247 60080 22316 -3288 -6947 -75433 -90429 -86244 -136301 -154808
5365a54808P1513N8093j4431m0831k4277N708j8037L2772L5126L1070K8627l8256
$$ -154808 -83295 -25202 -39633 -80464 -104741 -99033 -117070 -84298 -49172 -18102 10525 -27731
5353b7731n5746J1680M9382j7291K6545o61p367L6671j278j9750j5254l2328j1029
$$ -27731 -83477 -71797 -22415 -39706 -13161 -13822 -21189 15482 14204 -5546 -20800 -53128 -64157
5340f4157L1488Q781k5899J7944K7298l5203p940K1499K7628K3523Q481j3601
$$ -64157 -32669 -23888 -49787 -31843 -4545 -39748 -47688 -26189 1439 24962 33443 19842
5328A9842N593m4358K1331K2949j3694j7443r07k7200j9973m728L8950J0476J5852
$$ 19842 25435 -18923 2408 25357 11663 -5780 -6687 -33887 -53860 -58588 -19638 -9162 6690
5315F690l7143N1190L4352l3630m1242l3552O7160K8988M177K9701o3894q022
$$ 6690 -30453 20737 55089 21459 -19783 -53335 13825 42813 46990 76691 12797 4775
5303D775L3582L8223p742k2646n0903j5165m0905M7674R7788P98o428M1284j3739
$$ 4775 38357 76580 68838 46192 -4711 -19876 -60781 -13107 84681 85479 79051 120335 106596
5290A06596n3036j5702m9132m325m0597J282l6709l0006K7484K3902j279j434
$$ 106596 53560 37858 -11274 -15599 -56196 -54914 -91623 -121629 -94145 -70243 -71522 -72956
5278g2956K9897Q3924N0008L054m4255l8201j6888k8740J6727j3245l1712M1290
$$ -72956 -43059 40865 90873 93927 49672 11471 -5417 -34157 -17430 -30675 -62387 -21097
5266b1097N1376k9660m1440M9031O4483J9150j9449j13259o6172L258M1622N933
$$ -21097 30279 619 -40821 8210 72693 91843 72394 -40865 -107037 -103779 -62157 -56224
5254e6224K7125K0781J146l3796p888L1983m637J8940L2245k19k858N3146j5213
$$ -56224 -29099 -8318 -7172 -40968 -48856 -16873 -21510 -2570 29675 29456 26598 79744 64531
5241F4531m7876l2400k7432p287l615P2803J2598q1166j6205N608K620o0480K6731
$$ 64531 16655 -15745 -43177 -50464 -54079 18724 31322 -49844 -66049 -60441 -57821 -118301 -91570
5228i1570P8101l084m6205J0979p314O9267R4245J065k8258k6381k1978K0081
$$ -91570 -13469 -16553 -62758 -51779 -59093 10174 104419 105484 77226 50845 28867 48948
5216D8948p457p001q216K1338k2502p0497j3531M8121k6318k5447M5773R114K1139
$$ 48948 41491 34490 26274 47612 25110 -45387 -58918 -10797 -37115 -62562 -16789 -7675 13464
5203A3464L9489k4342K685n711l0836J684K2654k4526K4955K9261J5170j1224
$$ 13464 52953 28611 31296 25585 -5251 -3567 19087 -5439 19516 48777 63947 52723
5191E2723l0551k8845K6555P296M7903j707k502k1891L8609l0511J4673j3752
$$ 52723 22172 -6673 19882 27178 75081 73374 70872 48981 87590 57079 71752 58000
5179E8000N5973l07r3341J0193n4272o3539M83K5320K8354L6250O3081J6717m8732
$$ 58000 113973 113666 20325 30518 -23754 -87293 -86810 -61490 -33136 3114 66195 82912 34180
5166C4180k8214l4684p623L4396R78L774m3837o1764l9394L9651O7071J6267l44
$$ 34180 5966 -28718 -36341 -1945 -967 2807 -41030 -102794 -142188 -102537 -35466 -19199 -19543
5153a9543j2749J242N2828R567k9629n631l950j3013o7289K9115L6639j6801o583
$$ -19543 -32292 -31050 21778 31345 1716 -3915 -7865 -20878 -88167 -59052 -22413 -39214 -45797
5140d5797J1273o6753J3855j6522n5049K5483N9057O6624K5516k4528l8227L5695
$$ -45797 -34524 -101277 -87422 -103944 -158993 -133510 -74453 -7829 17687 -6841 -45068 -9373
5128i373k0403N619M7960J1386K8040n5558m1644L1642J6534N3446L4557n4511
$$ -9373 -29776 -24157 23803 35189 63229 7671 -33973 -2331 14203 67649 102206 47695
5116D7695m2463l2329J0184n665L2508L7502j0724j8478K1469o2519j7950l7426
$$ 47695 5232 -27097 -16913 -22578 9930 47432 36708 18230 39699 -22820 -40770 -78196
5104g8196k134M3853N2523o015k0387r537K2464N675k9002l2736p816K5734k5335
$$ -78196 -80330 -36477 16046 10031 -10356 -19893 2571 8246 -20756 -53492 -61308 -35574 -60909
5091f0909q148R41K4507J9504L0524k5941k6173Q86l0311j0292J3104K8639Q6739
$$ -60909 -69057 -68116 -43609 -24105 6419 -19522 -45695 -44809 -75120 -85412 -72308 -43669 43070
5078D3070J4235M5651O9142o3316n6908Q804k7894J2865k7244j2333m6334K7886
$$ 43070 57305 102956 172098 108782 51874 60678 32784 45649 18405 6072 -40262 -12376
5066a2376P7681k8217q7567m3607M5133N1186K9293O0327L4215n5635q8560J3544
$$ -12376 65305 37088 -50479 -94086 -48953 2233 31526 91853 126068 70433 -18127 -4583
5054d583L6530K4630m3245l0361j8629m1187K603k2440M034M696j8055K226M419
$$ -4583 31947 56577 13332 -17029 -35658 -76845 -74242 -96682 -92648 -87952 -106007 -103781 -99362
5041i9362j2544M9283R7816J7255j9163M6308J7256m5461k4699o4153k8383k7256
$$ -99362 -111906 -62623 35193 52448 33285 79593 96849 51388 26689 -37464 -65847 -93103
5029i3103K5876K1215L9322N4055o997n1830l229J2865m8994q9782P6580N2530
$$ -93103 -67227 -46012 -6690 47365 40368 -11462 -14691 -1826 -50820 -140602 -64022 -11492
5017a1492J5667M1320K0675M499M5538Q479m0602L981m199k807k5737n369l7753
$$ -11492 4175 45495 66170 70669 116207 124686 84084 88065 83866 81059 55322 49953 12200
5004A2200o5408L114j3647n5418Q9969P6790l2582J39K1507L4281o0533k1147
$$ 12200 -53208 -50094 -63741 -119159 -29190 47600 15018 15157 36664 70945 10412 -10735
4992a0735l9001m7057O7923Q7277k5899q2439N8082J2857l7824k3261o1268p38
$$ -10735 -49736 -96793 -28870 58407 32508 -49931 8151 21008 -16816 -40077 -101345 -102083
4980a02083K9376J8021l1126K5236J3848K5686l3745j2164L4203o702j3251N3491
$$ -102083 -72707 -54686 -85812 -60576 -46728 -21042 -54787 -66951 -32748 -39450 -52701 790
4968G90j7100m1430P105R2992k0103n1168L612J1747m7747M2477L3439N354j2940
$$ 790 -16310 -57740 -50635 42357 22254 -28914 -25302 -13555 -61302 -18825 14614 19968 7028
4955G028L6159O6081N630m1468k2867J7337J2380p9603l6094M2545M0403L6860
$$ 7028 43187 109268 114898 73430 50563 67900 80280 677 -35417 7128 47531 84391
4943H4391j3084m4921m1189q2255J2410O9984J10k0134K6293L4850n0431m1764
$$ 84391 71307 26386 -14803 -97058 -84648 -14664 -14554 -34688 -8395 26455 -23976 -65740
4931f5740N1517K0805j3189Q71k4602m798l25j5614L3787N691l3390L4993j6875
$$ -65740 -14223 6582 -6607 -5736 -30338 -35136 -35461 -51075 -17288 -11597 -44987 -9994 -26869
4918b6869k5433P2052J9608m2193K1186k6767r064r858r146Q578L0729O498k9520
$$ -26869 -52302 19750 39358 -2835 18351 -8416 -17480 -27338 -36484 -27906 2823 9321 -20199
4905b0199j6282J4565L0949J4328J0673K4081m382l8684l9212m5899q938M9035
$$ -20199 -36481 -21916 9033 23361 34034 58115 53733 15049 -24163 -70062 -79000 -29965
4893b9965N1898L9792k724l5109J6962M7503l8737l3371L997M349k9034J1406
$$ -29965 21933 61725 59001 23892 40854 88357 49620 16249 20246 24595 -4439 6967
4881F967M5957n2905n1669k2919K5595L3112j0502L8465J013L525j0939l5571
$$ 6967 52924 19 -51650 -74569 -48974 -15862 -26364 12101 13114 16639 5700 -29871
4869b9871l8722j3210M2425L9841L3549k9909J7218O243J5005j4222K0202R334
$$ -29871 -68593 -81803 -39378 463 34012 4103 21321 27564 42569 28347 48549 57883
4857E7883m8237k7545L7278N2170j0056k6589p197N0256k0997m4910Q50n4481
$$ 57883 9646 -17899 19379 71549 61493 34904 27707 77963 56966 12056 12906 -41575
4845d1575N4885L6193m9511R788l6807o8120Q946L0361R19r393K9492L6256J4750
$$ -41575 13310 49503 -8 9780 -27027 -95147 -86201 -55840 -54921 -64314 -34822 1434 16184
4832A6184p3377k2782L8113N5587N5248p3853j15757q058M9048K5901N3814l1017
$$ 16184 -57193 -79975 -41862 13725 68973 -4880 -120637 -128695 -79647 -53746 68 -30949
4820c0949q965l1985J4447N336l9148k5354J144O4025R3939K0525j9468N306N0203
$$ -30949 -39914 -71899 -57452 -52116 -91264 -116618 -115474 -51449 42490 63015 43547 48853 99056
4807I9056k8578q8403j6927J7845m782N642L210p3K3335K9299J8960K7331j2915
$$ 99056 70478 -17925 -34852 -17007 -21789 -16147 -12937 -13010 10325 39624 58584 85915 73000
4794G3000m3043O209J7076p2703K0856l901k0191l864j1472j8317j4908J7600
$$ 73000 29957 36166 53242 -19461 1395 -2506 -22697 -26561 -38033 -56350 -71258 -53658
4782e3658k656j1477N7451K2399j8352o0043K022K1993P8216L8922q2352k101
$$ -53658 -56314 -67791 -10340 12059 -6293 -66336 -64314 -42321 35895 74817 -7535 -9636
4770i636N051M985K55k2368j6418P5209j8175k0813m7131J2568j8996K637r214
$$ -9636 -4585 400 655 -21713 -38131 37078 18903 -1910 -49041 -36473 -55469 -52832 -62046
4757f2046k6244M120L6537p533r713L5395j4297N9606M9786J3138o7330l7116
$$ -62046 -88290 -84170 -47633 -55166 -64879 -29484 -43781 15825 65611 78749 11419 -25697
4745b5697L6229k7043m8040J5793O7416n5909k375N1020k8183L765L8459n9163
$$ -25697 10532 -16511 -64551 -48758 18658 -37251 -39626 11394 -16789 -13024 25435 -33728
4733c3728m4833k4226O765O1213Q5738k780m6874J0199k7509m9278J7830l1594
$$ -33728 -78561 -102787 -96022 -34809 50929 48149 1275 11474 -16035 -65313 -47483 -79077
4721g9077m0262K6010N2627M0272j030j9799J2433r893M621j0010L1843N8864
$$ -79077 -119339 -93329 -40702 -430 -1460 -21259 -8826 -18719 -14098 -24108 7735 66599
4709F6599M4558q7152r0554L0005N8749J5964p0467j0074K0675k9885P2244O0202
$$ 66599 111157 24005 -66549 -36544 22205 38169 -32298 -42372 -21697 -51582 20662 80864
4697H0864N3987m2734n9149L8805k0743k8052J0299J4763l2362m5227k8637J0993
$$ 80864 134851 92117 32968 71773 51030 22978 33277 48040 15678 -29549 -58186 -47193
4685d7193M4684J0662j2707N8601l4676n5595l7700k5496P178M3110K0033K0331
$$ -47193 -2509 8153 -4554 54047 19371 -36224 -73924 -99420 -92242 -49132 -29099 -8768
4673h768M1495K4607J1745M6747l6829q7634m0499J8255j8835p506M8355J1742
$$ -8768 32727 57334 69079 115826 78997 -8637 -49136 -30881 -49716 -57222 -8867 2875
4661B875r522K2423L5104J1173j2272m1187l9393m922M491m544M9524L0473l8782
$$ 2875 -6647 15776 50880 62053 49781 8594 -30799 -35721 -31230 -35774 13750 44223 5441
4648E441r589K3648L6307J7192r754m798J0693K325L1793l3891p8026j3937m6332
$$ 5441 -4148 19500 55807 72999 63245 58447 69140 71465 103258 69367 -8659 -22596 -68928
4635f8928m4938j0588M9240O2020l22K3932J1215m7379j8893P706K1427K6959
$$ -68928 -113866 -124454 -75214 -13194 -13516 10416 21631 -25748 -44641 -36935 -15508 11451
4623A1451j4713j3256j4219M729J8361r805K6385j6813q842K5382J2628L968J1668
$$ 11451 -3262 -16518 -30737 -26008 -7647 -17452 8933 -7880 -16722 8660 21288 25256 36924
4610C6924j5274K8104O395o4800j4454K7473l877K6946j2353R762J4655l794l5044
$$ 36924 21650 49754 56149 -8651 -23105 4368 491 27437 15084 24846 39501 35707 663
4597F63l2422m94J3484M7473K9949j8343N0691m240l8533l7921m0682K2066J7980
$$ 663 -31759 -32253 -18769 28704 58653 40310 91001 86761 48228 10307 -30375 -8309 9671
4584I671N7545N3116n6436p7397o6031j5165O527K59j6369N9302m9388J1768K0999
$$ 9671 67216 120332 63896 -13501 -79532 -94697 -88170 -87911 -104280 -44978 -94366 -82598 -61599
$$ [...]
##END NTUPLES=NMR SPECTRUM
##END=
