##TITLE=Analysis number 328275
Compound Code cc 62623
Book Reference 494/162
Project Code adrs
Chemist Name craigr
##JCAMPDX= 6.0         $$ Bruker NMR JCAMP-DX V2.0
##DATA TYPE= NMR SPECTRUM
##DATA CLASS= NTUPLES
##ORIGIN= Bruker BioSpin GmbH
##OWNER= nmr
$$ XWIN-NMR		Version 3.5
$$ Mon May 21 09:16:01 2007 GMT Daylight Time (UT+1h)  MAYBRIDGE\nmr@NMR_250MHZ
##.OBSERVE FREQUENCY= 250.131544655141
##.OBSERVE NUCLEUS= ^1H
##.ACQUISITION MODE= SIMULTANEOUS (DQD)
##.ACQUISITION SCHEME= undefined
##.AVERAGES= 16
##.DIGITISER RES= 18
##SPECTROMETER/DATA SYSTEM= dpx250
##.PULSE SEQUENCE= zg30
##.SOLVENT NAME= CDCl3
##.SHIFT REFERENCE= (INTERNAL, CDCl3, 0, 16.522)
##AUDIT TRAIL= $$ (NUMBER, WHEN, WHO, WHERE, WHAT)
$$ ##TITLE= Audit trail, XWIN-NMR		Version 3.5
$$ ##JCAMPDX= 5.01
$$ ##ORIGIN= Bruker BioSpin GmbH
$$ ##OWNER= nmr
$$ C:\u/data/dgb/nmr/ADRS/1260/pdata/1/auditp.txt
$$ ##AUDIT TRAIL=  $$ (NUMBER, WHEN, WHO, WHERE, WHAT)
(   1,<2007-05-21 09:15:26.00 +100>,<MAYBRIDGE\nmr>,<NMR_250MHZ>,
      <created by zg, POWCHK disabled, PULCHK disabled
       configuration hash MD5:
       76 6E 9A 78 1E 09 19 81 EC 84 63 8F B0 6A 59 2D
       data hash MD5: 64K
       D9 4A A1 BD 3C 89 F0 22 BA 9D 6C 28 5B 92 B9 20>)
(   2,<2007-05-21 09:15:51.76 +100>,<MAYBRIDGE\nmr>,<NMR_250MHZ>,
      <Start of raw data processing
       ef LB = 0.3 FT_mod = 6 PKNL = 1 SI = 32K 
       data hash MD5: 32K
       C4 24 69 E6 7C 79 CE 4C FD 8B 74 B0 B2 79 44 EF>)
(   3,<2007-05-21 09:15:53.73 +100>,<MAYBRIDGE\nmr>,<NMR_250MHZ>,
      <apk 
       data hash MD5: 32K
       4E 02 FE 14 29 84 B6 D1 B0 43 93 B1 D0 8A 1B 18>)
(   4,<2007-05-21 09:15:54.40 +100>,<MAYBRIDGE\nmr>,<NMR_250MHZ>,
      <abs ABSG = 5 
       data hash MD5: 32K
       15 29 BE B4 9B 62 79 22 A1 E1 34 CA DE E9 59 82>)
$$ ##END=
$$ 
$$ hash MD5
$$ CA 1B 87 FA 14 32 8F 73 5C 17 41 0B 3D 3C C5 18
##$RELAX= 
##$RELAX= 
##$RELAX= 
##$RELAX= 
##$RELAX= 
##$RELAX= 
##$RELAX= 
$$ Bruker specific parameters
$$ --------------------------
##$DU= <C:\u>
##$EXPNO= 1260
##$NAME= <ADRS>
##$PROCNO= 1
##$TYPE= <nmr>
##$USER= <dgb>
##$AMP= (0..31)
100 100 100 100 100 100 100 100 100 100 100 100 100 100 100 100 100 100 
100 100 100 100 100 100 100 100 100 100 100 100 100 100 
##$AQSEQ= 0
##$AQ_mod= 3
##$AUNM= <au_zg>
##$AUTOPOS= <3 >
##$BF1= 250.13
##$BF2= 250.13
##$BF3= 250.13
##$BF4= 250.13
##$BF5= 500.13
##$BF6= 500.13
##$BF7= 500.13
##$BF8= 500.13
##$BYTORDA= 1
##$CFDGTYP= 0
##$CFRGTYP= 5
##$CHEMSTR= <none>
##$CNST= (0..31)
1 1 145 1 1 1 1 1 1 1 1 1 1 1 1 1 1 1 1 1 1 1 1 1 1 1 1 1 1 1 1 1 
##$CPDPRG= <>
##$CPDPRG1= <>
##$CPDPRG2= <>
##$CPDPRG3= <>
##$CPDPRG4= <mlev>
##$CPDPRG5= <mlev>
##$CPDPRG6= <mlev>
##$CPDPRG7= <mlev>
##$CPDPRG8= <mlev>
##$CPDPRGB= <>
##$CPDPRGT= <>
##$D= (0..31)
0 1 0 0 0 0 0 0 0 0.06 0 0 0 0 0 0 0.0002 0 0 0 0 0 0 0 0 0 0 0 0 0 0 
0 
##$DATE= 1179735325
##$DBL= (0..7)
120 120 120 120 120 120 120 120 
##$DBP= (0..7)
150 150 150 150 150 150 150 150 
##$DBP07= 0
##$DBPNAM0= <>
##$DBPNAM1= <>
$$ [...]
##$SUBNAM7= <"">
##$SUBNAM8= <"">
##$SUBNAM9= <"">
##$SW= 20.6930455092707
##$SWIBOX= (0..15)
0 0 3 0 0 0 0 0 0 0 0 0 0 0 0 0 
##$SW_h= 5175.983436853
##$TD= 65536
##$TD0= 1
##$TE= 683.16
##$TE2= 300
##$TE3= 300
##$TEG= 300
##$TL= (0..7)
0 120 120 120 120 120 120 120 
##$TP= (0..7)
150 150 150 150 150 150 150 150 
##$TP07= 0
##$TPNAME0= <>
##$TPNAME1= <>
##$TPNAME2= <>
##$TPNAME3= <>
##$TPNAME4= <>
##$TPNAME5= <>
##$TPNAME6= <>
##$TPNAME7= <>
##$TPOAL= (0..7)
0.5 0.5 0.5 0.5 0.5 0.5 0.5 0.5 
##$TPOFFS= (0..7)
0 0 0 0 0 0 0 0 
##$TUNHIN= 0
##$TUNHOUT= 0
##$TUNXOUT= 0
##$USERA1= <user>
##$USERA2= <user>
##$USERA3= <user>
##$USERA4= <user>
##$USERA5= <user>
##$V9= 5
##$VALIST= <valist>
##$VCLIST= <CCCCCCCCCCCCCCC>
##$VD= 0
##$VDLIST= <DDDDDDDDDDDDDDD>
##$VPLIST= <PPPPPPPPPPPPPPP>
##$VTLIST= <TTTTTTTTTTTTTTT>
##$WBST= 1024
##$WBSW= 4
##$XGAIN= (0..3)
0 0 0 0 
##$XL= 0
##$YL= 0
##$YMAX_a= 246562
##$YMIN_a= -211932
##$ZGOPTNS= <>
##$ZL1= 120
##$ZL2= 120
##$ZL3= 120
##$ZL4= 120
##$ABSF1= 16.522
##$ABSF2= -4.171173
##$ABSG= 5
##$ABSL= 3
##$ALPHA= 0
##$AQORDER= 0
##$ASSFAC= 0
##$ASSFACI= 0
##$ASSFACX= 0
##$ASSWID= 0
##$AUNMP= <proc_1d>
##$AZFE= 0.1
##$AZFW= 0.1
##$BCFW= 0
##$BC_mod= 0
##$BYTORDP= 0
##$COROFFS= 0
##$CY= 12.5
##$DATMOD= 1
##$DC= 0
##$DFILT= <>
##$DTYPP= 0
##$F1P= 14.0000005364418
##$F2P= -0.99999901652339
##$FCOR= 0.5
##$FTSIZE= 32768
##$FT_mod= 6
##$GAMMA= 0
##$GB= 0
##$INTBC= 1
##$INTSCL= 1
##$ISEN= 128
##$LB= 0.3
##$LEV0= 0
##$LPBIN= 0
##$MAXI= 10000
##$MC2= 0
##$MEAN= 0
##$ME_mod= 0
##$MI= 0
##$NCOEF= 0
##$NC_proc= -4
##$NLEV= 6
##$NOISF1= 0
##$NOISF2= 0
##$NSP= 0
##$NTH_PI= 0
##$NZP= 0
##$OFFSET= 16.522
##$PC= 1
##$PHC0= -55.24876
##$PHC1= 8.342608
##$PH_mod= 1
##$PKNL= yes
##$PPARMOD= 0
##$PSCAL= 4
##$PSIGN= 0
##$REVERSE= no
##$SF= 250.13
##$SI= 32768
##$SIGF1= 0
##$SIGF2= 0
##$SINO= 400
##$SIOLD= 32768
##$SREGLST= <1H.CDCl3>
##$SSB= 0
##$STSI= 32768
##$STSR= 0
##$SW_p= 5175.98343685301
##$SYMM= 0
##$S_DEV= 0
##$TDeff= 65536
##$TDoff= 0
##$TI= <Analysis number 999999
Compound Code 99
Book Reference 9
Project Code 9>
##$TILT= no
##$TM1= 0
##$TM2= 0
##$TOPLEV= 0
##$USERP1= <user>
##$USERP2= <user>
##$USERP3= <user>
##$USERP4= <user>
##$USERP5= <user>
##$WDW= 1
##$XDIM= 32768
##$YMAX_p= 323391396
##$YMIN_p= -223662
$$ End of Bruker specific parameters
$$ ---------------------------------
##NTUPLES= NMR SPECTRUM
##VAR_NAME=  FREQUENCY,     SPECTRUM/REAL,   SPECTRUM/IMAG
##SYMBOL=    X,             R,               I
##VAR_TYPE=  INDEPENDENT,   DEPENDENT,       DEPENDENT
##VAR_FORM=  AFFN,          ASDF,            ASDF
##VAR_DIM=   32768,         32768,           32768
##UNITS=     HZ,            ARBITRARY UNITS, ARBITRARY UNITS
##FACTOR=    0.157963299565203, 1,           1
##FIRST=     4132.6476996994, 0,             0
##LAST=      -1043.33573715361, 0,           0
##MIN=       -1043.33573715361, -223662,     0
##MAX=       4132.6476996994, 323391396,     0
$$ Real data points
##PAGE= N=1
##DATA TABLE= (X++(R..R)), XYDATA
$$ [...]
16172b1563N309O330o4054K7144J9094l1123k0037P15r263k4035o924o735p344
$$ -21563 -16254 -9924 -73978 -46834 -27740 -58863 -78900 -78185 -87448 -111483 -118407 -125142 -132486
16159a32486J1098J0552O3654Q9092J4441m9436o8123Q7846Q2799m9038m8010
$$ -132486 -121388 -110836 -47182 41910 56351 6915 -61208 26638 109437 60399 12389
16148A2389n8652j4474J8086Q8285L0849q594K2142J2472k8893j0296J8152k2080
$$ 12389 -46263 -60737 -42651 45634 76483 67889 90031 102503 73610 63314 81466 59386
16136E9386m2891K637o188J518J9203j428p5863r5275M0900M7305P4416j2761
$$ 59386 16495 19132 12944 14462 33665 32237 -43626 -138901 -98001 -50696 23720 10959
16124A0959L1204n701l4958L4611k8456J4908K4176N9566k7153l6296l3662j5719
$$ 10959 42163 36462 1504 36115 7659 22567 46743 106309 79156 42860 9198 -6521
16112f521n1590o074J2670k8493l2762K6607L0443j7443k2644P0193L6246o011
$$ -6521 -58111 -64185 -51515 -80008 -112770 -86163 -55720 -73163 -95807 -25614 10632 4621
16100D621L9134L1141M1273O322m1375r271l9122P73l5935Q59L2402L762L1128
$$ 4621 43755 74896 116169 122491 81116 71845 32723 33496 -2439 -1580 30822 34584 65712
16087F5712k4482q6098J9921l95q899n008k3716j6729N7439J4927J6420k6731
$$ 65712 41230 -44868 -24947 -25342 -34241 -39249 -62965 -79694 -22255 -7328 9092 -17639
16075a7639R044M9790J7120j1994K760J1467j0630O101L2112N9592n4856n1866
$$ -17639 -8595 41195 58315 46321 49081 60548 49918 56019 88131 147723 92867 41001
16063D1001r1953l4467K2405k5249p0571P1448N7284j1423o616J8189J2662m2622
$$ 41001 -50952 -85419 -63014 -88263 -158834 -87386 -30102 -41525 -48141 -29952 -17290 -59912
16051e9912j10027K6447J48476N6638m1771k1418o7123Q5k7844k302k0316l2803
$$ -59912 -169939 -143492 4984 61622 19851 -1567 -68690 -68605 -96449 -98751 -119067 -151870
16039a51870N4078K2414j476n236k2457N3093K3799j5765j1421l1138M4732M0413
$$ -151870 -97792 -75378 -76854 -82090 -104547 -51454 -27655 -43420 -54841 -85979 -41247 -834
16027h34l3896l6621K707J8459K6528L7223Q857p3666l0229k8000n014J8467M1632
$$ -834 -34730 -71351 -68644 -50185 -23657 13566 22423 -51243 -81472 -109472 -114486 -96019 -54387
16014e4387L4519r379N0082K544q530L3776l7493q3818k3931J1099J4902N3134
$$ -54387 -19868 -29247 20835 23379 14849 48625 11132 -72686 -96617 -85518 -70616 -17482
16002a7482m8249r182m4681M543N2061l399O494K4248P5683o7208j2682l9778
$$ -17482 -65731 -74913 -119594 -115051 -62990 -66389 -59895 -35647 40036 -27172 -39854 -79632
15990g9632j3572K8252M6472N3475k7210k6222j6105l3436J1575J9759L2062q531
$$ -79632 -93204 -64952 -18480 34995 7785 -18437 -34542 -67978 -56403 -36644 -4582 -13113
15978a3113J128m6753J7767K7588q455o5243o1064L4298L8764R7021l883m3569
$$ -13113 -11985 -58738 -40971 -13383 -21838 -87081 -148145 -113847 -75083 21938 18055 -25514
15966b5514L0873q814m0305m5242N147R4136K7532j9732l4680K1475k6759j9582
$$ -25514 5359 -3455 -43760 -89002 -83855 10281 37813 18081 -16599 4876 -21883 -41465
15954d1465p783l589n0018j8095Q8332M7011j5044r74r1228O838R1254k2032o9298
$$ -41465 -49248 -52837 -102855 -120950 -32618 14393 -651 -1625 -92853 -86015 5239 -16793 -86091
15941h6091k980O8047L8388q781o5471p1662J0080L6914R1261K9548M2271K155
$$ -86091 -89071 -21024 17364 8583 -56888 -128550 -118470 -81556 9705 39253 81524 83679
15929H3679n1893o5295Q245O2324k4337k7905K050K2559N7012j0875M054m1032
$$ 83679 31786 -33509 -25264 37060 12723 -15182 -13132 9427 66439 55564 59618 18586
15917A8586K5217K8534n11J381k4284m174m8459J2514M2091J5702o8699l5011
$$ 18586 43803 72337 71826 73207 48923 44749 -3710 8804 50895 66597 -2102 -37113
15905c7113M7631J9565n7794j7193J112k6744L4097J8808N757J7056j9742l1923
$$ -37113 10518 30083 -27711 -44904 -43792 -70536 -36439 -17631 -11874 5182 -14560 -46483
15893d6483p600M4551k353K3784L9022o1413n2780M4355K2717P598K7840J730
$$ -46483 -54083 -9532 -11885 11899 50921 -10492 -63272 -18917 3800 11398 39238 40968
15881D0968R809m3848J0672j0516k2426j7439l2206j6649K2678Q503K137j587
$$ 40968 50777 6929 17601 7085 -15341 -32780 -64986 -81635 -58957 -50454 -48317 -49904
15869d9904K7045M6602J5985N7466m8005M0250q972m5410n9506n1475l1315k3327
$$ -49904 -22859 23743 39728 97194 49189 89439 80467 35057 -24449 -75924 -107239 -130566
15857a30566M4402K9615J6300J3246L2965P835l3849l8515k6414k8080J2414j6687
$$ -130566 -86164 -56549 -40249 -27003 5962 13797 -20052 -58567 -84981 -113061 -100647 -117334
15845a17334J8779l5746M1526L5092L5314N3608L2679J6149k5797n7017j4886
$$ -117334 -98555 -134301 -92775 -57683 -22369 31239 63918 80067 54270 -2747 -17633
15834a7633l3339m583K3477J3878K5362O243K4992p6107l3663l5131r353K4086
$$ -17633 -50972 -55555 -32078 -18200 7162 13405 38397 -37710 -71373 -106504 -115857 -91771
15822i1771J6520M6003K6174L6316R067p019m821N36m0611n0928q994K198R253
$$ -91771 -75251 -29248 -3074 33242 42309 35290 30469 31005 -9606 -60534 -69528 -67330 -58077
15809e8077J5416l2033k3642L5487K0676j5120m3394M207j3599j5556L7003R7624
$$ -58077 -42661 -74694 -98336 -62849 -42173 -57293 -100687 -96480 -110079 -125635 -88632 8992
15797H992J4324l7158k4374j9320K5785L3904k024l4578l5935J5744L7985K5543
$$ 8992 23316 -13842 -38216 -57536 -31751 2153 129 -34449 -70384 -54640 -16655 8888
15785H888K2889J8377K5985J3178k2487L1961k4744n7623k6171k2757J5457J8017
$$ 8888 31777 50154 76139 89317 66830 98791 74047 16424 -9747 -32504 -17047 970
15773I70m4190k889K0926P0550k2921m6790n1962l0384J8772J17776R342j05766
$$ 970 -43220 -46109 -25183 45367 22446 -24344 -76306 -106690 -87918 29858 39200 -66566
15761f6566k4087M4045J2603k7400R148N4635K9582p3588P264M4313L6344L3351
$$ -66566 -90653 -46608 -34005 -61405 -52257 2378 31960 -41628 -34364 9949 46293 79644
15749G9644M03l8319o8535o096n1482k0621J0188O130k7203N4993L6239m8558
$$ 79644 80047 41728 -26807 -32903 -84385 -105006 -94818 -88688 -115891 -60898 -24659 -73217
15737g3217Q363m64j4858O4364K944L0294j5191k9615n285L204Q641L7323j1180
$$ -73217 -64854 -65318 -80176 -15812 -12868 17426 2235 -27380 -32665 -29461 -20820 16503 5323
15724E323l0729p476r065l5106M7820M3909n3518L500O533N596j1932L4041M3913
$$ 5323 -25406 -32882 -41947 -77053 -29233 14676 -38842 -35342 -28809 -23213 -35145 -1104 42809
15711D2809r049J1359j3662n129l2668K694j9682m3300l3560J5750M3113K6486
$$ 42809 33760 45119 31457 26328 -6340 -3646 -23328 -66628 -100188 -84438 -41325 -14839
15699a4839k6854k6673J9203J0160n2850p841Q520O9919J1174n912M4997m3358
$$ -14839 -41693 -68366 -49163 -39003 -91853 -99694 -91174 -21255 -10081 -15993 29004 -14354
15687a4354p7546N0936L0049q853K4284J7643M0290M4520K3338k9371p6660l8671
$$ -14354 -91900 -40964 -10915 -19768 4516 22159 62449 106969 130307 100936 24276 -14395
15675a4395m3556j6307J0562P6165L4944k3370l9228L2820k330l5682M0847M7808
$$ -14395 -57951 -74258 -63696 12469 47413 24043 -15185 17635 15305 -20377 20470 68278
15663F8278K8183j1369j7122j7432N0639M994m6226J6576k06p5110L5994O8447
$$ 68278 96461 85092 67970 50538 101177 106171 59945 76521 76315 1205 37199 105646
15651A05646n10l4175n1542l4915K2735L7470j2450j077K736L0067k0799K1310
$$ 105646 105136 70961 19419 -15496 7239 44709 32259 31182 33918 63985 43186 64496
15639F4496p6800p2978q794M1846K9460J5688M6315K3624N644m368J1646m9986
$$ 64496 -12304 -85282 -94076 -52230 -22770 -7082 39233 62857 68501 64133 75779 25793
15627B5793q2589m7339L6150L8892Q142K2711K0063M1297L3130j0541J5439m4419
$$ 25793 -56796 -104135 -67985 -29093 -20951 1760 21823 63120 96250 85709 101148 56729
15615E6729j09274n905L8542n8295Q570M0520J9021N3092j4780l6549l8356j9418
$$ 56729 -52545 -58450 -19908 -78203 -69633 -29113 -10092 43000 28220 -8329 -46685 -66103
15603f6103j0781j6393m8401L0632L9148k0353L0883K494O6989j4565l0584j9295
$$ -66103 -76884 -93277 -141678 -111046 -71898 -92251 -61368 -58874 8115 -6450 -37034 -56329
15591e6329J3892L7159J5187n723l8503j3321l2436r379M569J5188k0796j2130
$$ -56329 -42437 -5278 9909 4186 -34317 -47638 -80074 -89453 -84884 -69696 -90492 -102622
15579a02622j0357Q350L0814O3154M3751j1731O884O8838N4128o8837p784Q82
$$ -102622 -112979 -104629 -73815 -10661 33090 21359 28243 97081 151209 82372 74588 75470
15567G5470m2854o0418K8111O1799m6015n2629K8263N6984k7704n587l4009m3084
$$ 75470 32616 -27802 309 62108 16093 -36536 -8273 48711 21007 15420 -18589 -61673
15555f1673o7045J8945N7130j9756J3801m1335l2822k7810M4437P5413L5912m43
$$ -61673 -128718 -109773 -52643 -72399 -58598 -99933 -132755 -160565 -116128 -40715 -4803 -5246
15543e246q507O8493M6432k48n8256l6401k3106m2677K0453M4230L81K4015r010
$$ -5246 -13753 54740 101172 100924 42668 6267 -16839 -59516 -39063 5167 5548 29563 20553
15530B0553l5037M259L2235M3799K5695m2477K7754N3923M470k6188L7985k7002
$$ 20553 -14484 -10225 22010 65809 91504 49027 76781 130704 135174 108986 146971 119969
15518A19969m3456k0236k3149J6840j4179j0071n4108J0461N1730j8132J4755
$$ 119969 76513 56277 33128 49968 35789 25718 -28390 -17929 33801 15669 30424
15507C0424o3461m8618J9756L5851l0794l5881n971M2250l4224m2676N783M3208
$$ 30424 -33037 -81655 -61899 -26048 -56842 -92723 -98694 -56444 -90668 -133344 -127561 -84353
15495h4353K1184j076K6979J6628q872L5455N1843N1280l71o1461o1145l9694
$$ -84353 -63169 -64245 -37266 -20638 -29510 5945 57788 109068 108697 47236 -13909 -53603
15483e3603j7028N5067O0864J004j481K3431p1094p5435O2389L5051O042l4915
$$ -53603 -70631 -15564 45300 46304 44823 68254 -2840 -78275 -15886 19165 25207 -9708
15471i708k5680M3293K2188K6126K2322j0963m9045l3820K8234K2087K2217K1509
$$ -9708 -35388 7905 30093 56219 78541 67578 18533 -15287 12947 35034 57251 78760
15459G8760j201J3588j8112p080m2545N2504j6017k4829j6561o4797j5262L728
$$ 78760 77559 91147 73035 65955 23410 75914 59897 35068 18507 -46290 -61552 -57824
15447e7824j1172L0483J616k8229p972N1088L4037p6377k6616k3344J4999J4359
$$ -57824 -68996 -38513 -36897 -65126 -73098 -22010 12027 -64350 -90966 -114310 -99311 -84952
15435h4952O8135R1456l2064n4628L5715K4669J1420k1049m6870Q329M6143j2776
$$ -84952 -16817 74639 42575 -12053 23662 48331 59751 38702 -8168 161 46304 33528
15423C3528O0155j919o9937r323k2179J249p286J7200J1187p0076k2493N6872
$$ 33528 93683 91764 21827 12504 -9675 -8426 -15712 1488 12675 -57401 -79894 -23022
15411b3022j3515j6142M74o835l5081L0720K8994K1552k8518K4539j945p960R584
$$ -23022 -36537 -52679 -52205 -59040 -94121 -63401 -34407 -12855 -41373 -16834 -18779 -26739 -17155
15398a7155K5918L1419k1312q485k7411o42J2053L5352K7540k4036l7970o8771
$$ -17155 8763 40182 18870 10385 -17026 -17668 -5615 29737 57277 33241 -4729 -73500
15386g3500O825k2863k1258J5611P5O103K6771N3231L3001L1506L801o7446m5516
$$ -73500 -66675 -89538 -110796 -95185 -95110 -89007 -62236 -9005 23996 55502 59303 -8143 -53659
15373e3659O2172L0492j888j4494j5287J9710j6242l270k3450j4532m5956M230
$$ -53659 8513 39005 37117 22623 7336 27046 10804 7534 -15916 -30448 -76404 -72174
15361g2174L4096P2028K8937L1427k9622N904k0837r1686n4557M0433P2756K4674
$$ -72174 -38078 33950 62887 94314 64692 70596 49759 -41927 -96484 -56051 16705 41379
15349D1379j1751J850l7515m3866r699O9625L5132O272m4564o0703L6160N8540
$$ 41379 29628 31478 -6037 -49903 -59602 10023 45155 51427 6863 -53840 -17680 40860
15337D0860j1746j09796l2335n0938K7075O7625l5916j8604M5453n2506N8785
$$ 40860 29114 -80682 -113017 -163955 -136880 -69255 -105171 -123775 -78322 -130828 -72043
15326g2043P1866J5334j7839K2710k6651k3645J0960L701M992l505n891K2891
$$ -72043 -177 15157 -2682 20028 -6623 -30268 -19308 -15607 -10615 -14120 -20011 2880
15314B880J7537N776j5040l2025L0951q787k8334j2166L0414O0930J813m0086
$$ 2880 20417 26193 11153 -20872 10079 1292 -27042 -39208 -8794 52136 53949 13863
15302A3863n3404K1396R2256K1340l9787k790k5805m7979n4966m9999k6134J384
$$ 13863 -39541 -18145 74111 95451 55664 52874 27069 -20910 -75876 -125875 -152009 -150625
15290a50625K6369P7768K6389J7239k0823J0564k9731k7255L039K2793L5404J6926
$$ -150625 -124256 -46488 -20099 -2860 -23683 -13119 -42850 -70105 -67066 -44273 -8869 8057
15278H057n681j645L2647L7455J4239m8064o461M5841j7948m2031J0440Q251l9513
$$ 8057 2376 731 33378 70833 85072 37008 30547 76388 58440 16409 26849 35100 -4413
15265d413j4691j4505j8979R199N2445q573L1139L021J4405n942l4975J784J1866
$$ -4413 -19104 -33609 -52588 -43389 9056 483 31622 34643 49048 43106 8131 9915 21781
15252B1781J9732j4889l7439M067L7721k0792R974J8516k4322K3467K5715K0848
$$ 21781 41513 26624 -10815 -6748 30973 10181 20155 38671 14349 37816 63531 84379
15240H4379P451m3119r1405L66j7530J5831M1823p4402J1663N7268N6937N2663
$$ 84379 91830 48711 -42694 -42328 -59858 -44027 -2204 -76606 -64943 -7675 49262 101925
15228A01925k3054n9344j3289J4642M024l0247l5383k5680l1501M0019K9749j8776
$$ 101925 78871 19527 6238 20880 24904 -5343 -40726 -66406 -97907 -57888 -28139 -46915
15216d6915K7429K367o8149k7550R195N4022O3036p1816m0719l5592P737M7578
$$ -46915 -19486 -17119 -85268 -112818 -103623 -49601 13435 -58381 -99100 -134692 -126955 -79377
15204g9377L567N3458L2138K0147J3296O5390m0675k5702M346N869K5835L8072
$$ -79377 -75810 -22352 9786 29933 43229 108619 67944 42242 46588 52457 78292 116364
15192A16364n1691o9431n7359j461J4276j455k0023J1249J9876o0564M0971R9016
$$ 116364 64673 -4758 -62117 -63578 -49302 -50757 -70780 -59531 -39655 -100219 -59248 39768
15180C9768J3364k3755L4288k4847n3105n1364m3267q898O4141L2548l6541l2862
$$ 39768 53132 29377 63665 38818 -14287 -65651 -108918 -117816 -53675 -21127 -57668 -90530
15168i0530K4774K2172M8820M171J8359N0542o756o0819k4600M8163K3931q0441
$$ -90530 -65756 -43584 5236 9407 27766 78308 71552 10733 -13867 34296 58227 -22214
15156b2214J3321J8025l0722O5203j5971l6436J0919K3763m3389P79J5886m1402
$$ -22214 -8893 9132 -21590 43613 27642 -8794 2125 25888 -17501 -16722 -836 -42238
15144d2238J1852K297K5719K005m8269j2130M280O8650K7382O063O480l6092k8450
$$ -42238 -30386 -28089 -2370 -365 -48634 -60764 -56484 12166 39548 45611 52091 15999 -12451
15131a2451L4662O6188n7062p1158L455l4512O1860L7943l1708j0794j2853K7197
$$ -12451 22211 88399 31337 -39821 -36366 -70878 -9018 28925 -2783 -13577 -26430 767
15119G67K419j4089k4834o279J658l7707k2485M7522k0078M7779K6457n5966N8477
$$ 767 3186 -10903 -35737 -42016 -40358 -78065 -100550 -53028 -73106 -25327 1130 -54836 3641
15106C641Q7180K0246j4184n3536q286M9664P787K2412k1831n8231Q063o456q5269
$$ 3641 90821 111067 96883 43347 35061 84725 92512 114924 93093 34862 42925 36469 -48800
15093d8800J91K3296O2964j980p395k8301k5385l3340l4317P8492J01180M5712
$$ -48800 -48609 -25313 37651 35671 28276 -25 -25410 -58750 -93067 -14575 86605 132317
15081A32317l3274l0073M8760N4137l6170l5737k6394n8900j3002M1173J7110
$$ 132317 99043 68970 117730 171867 135697 99960 73566 14666 1664 42837 59947
15070E9947k5981j2540O675k2866j7784k978L3241k0710L0412K4418Q330P430
$$ 59947 33966 21426 28101 5235 -12549 -15527 17714 -2996 27416 51834 60164 67594
15058F7594L841L4307l840p951J303K9621j2530j7027m3027j3190j9602J2336
$$ 67594 71435 105742 101902 93951 95254 124875 112345 95318 52291 39101 19499 31835
15046C1835K1509j3721k9346J751O4486k216j0018o6831k577j7877j3665J7228
$$ 31835 53344 39623 10277 12028 76514 74298 64280 -2551 -5128 -23005 -36670 -19442
15034a9442l5230M4416K9937n1878J164J2764J5666M7771J6133r234o8943k4071
$$ -19442 -54672 -10256 19681 -32197 -31033 -18269 -2603 45168 61301 52067 -16876 -40947
15022d0947J8856N3413J5523j751l2660L635L1770l4736j3621J5769R343M608
$$ -40947 -22091 31322 46845 45094 12434 16069 47839 13103 -518 15251 24594 29202
15010B9202J7625L1257k5504n2664K7448M4121J7742l1584N2701O9044Q7729J34517
$$ 29202 46827 78084 52580 -84 27364 71485 89227 57643 110344 179388 267117 401634
14998D01634J03965k4984k37555j14960j1108n2587P683J0504k4166k8541K5671
$$ 401634 505599 480615 243060 128100 116992 64405 72088 82592 58426 29885 55556
14987E5556P589k6407o3360J4723q535j08309L459R0975N9078q223k8433m584
$$ 55556 63145 36738 -26622 -11899 -20434 -128743 -125284 -34309 24769 16546 -11887 -16471
14975a6471j652M1558P2222l3871k5803o375L3444P0096o2600q7226l1747j3551
$$ -16471 -18123 23435 95657 61786 35983 29608 63052 133148 70548 -16678 -48425 -61976
14963f1976k7024p185O9075l6872j8100N8655N1524m1642o4625n1678k4552N6941
$$ -61976 -89000 -96185 -27110 -63982 -82082 -23427 28097 -13545 -78170 -129848 -154400 -97459
14951i7459P0203n266J8350l7144K236N2241p892K438J3217J3247N700M8199q831
$$ -97459 -27256 -32522 -14172 -51316 -49080 3161 -4731 -2293 10924 24171 29871 78070 69239
14938F9239m3822p2155n0822K4162Q1091J6718l206q427n0835j2104k5833M8923
$$ 69239 25417 -46738 -97560 -73398 7693 24411 21205 12778 -38057 -50161 -75994 -27071
14926b7071M7000m6954m5326L6278M6762K503K6223k9077L4411Q817P349k7137
$$ -27071 19929 -27025 -72351 -36073 10689 13192 39415 10338 44749 53566 60915 33778
14914C3778j6709m616K2770j9119k0808j519o30k3840n9851L8284k498J5227m9011
$$ 33778 17069 12453 35223 16104 -4704 -6223 -6853 -30693 -90544 -52260 -54758 -39531 -88542
14901h8542n1712L3272L6441j3292J1714L2713J0160K7761L4175m040l2847l1603
$$ -88542 -140254 -106982 -70541 -83833 -72119 -39406 -29246 -1485 32690 28650 -4197 -35800
14889c5800n1376J5668M6699J0991J1222K4193n17m8440o1261k2452J0944J584
$$ -35800 -87176 -71508 -24809 -13818 -2596 21597 21080 -27360 -88621 -111073 -100129 -98545
14877i8545p161K9686K8592k7814J0965J25897J4183l2069m6089j6359J3926k3437
$$ -98545 -105706 -76020 -47428 -75242 -64277 61620 75803 43734 -2355 -18714 -4788 -28225
14865b8225j3657R88M8944j6674J5068K1363n38M1322K0960n2294p2442K1105
$$ -28225 -41882 -40894 8050 -8624 6444 27807 27269 68591 89551 37257 -35185 -14080
14853a4080J1192P605P275K5620r8261J1944L5356L5488k8606o66J5540j855j847
$$ -14080 -2888 4717 11992 37612 -60649 -48705 -13349 22139 -6467 -7133 8407 6552 4705
14840D705L3247Q9518k5874j367j3750K7475m3801m4957K593P193L0377J6652
$$ 4705 37952 127470 101596 100229 86479 113954 70153 25196 27789 34982 65359 82011
14828H2011n2348l8088o0228j3683L1528J5583L9523k549N8396K7137O403o5675
$$ 82011 29663 -8425 -68653 -82336 -50808 -35225 4298 1749 60145 87282 93685 28010
14816B8010k0763k8557n2110k9241K5678L0142J6866L2337l2155M778N1019Q69
$$ 28010 7247 -21310 -73420 -102661 -76983 -46841 -29975 2362 -29793 -25015 26004 26873
14804B6873l8314K7290J2501J4668m4691l1553m8733L2078K8254M8758M0092L9682
$$ 26873 -11441 15849 28350 43018 -1673 -33226 -81959 -49881 -21627 27131 67223 106905
14792A06905K5250m8720m7084l4168j4030M4814P241J8924p17k9693k3261l4079
$$ 106905 132155 83435 36351 2183 -11847 32967 40208 59132 58415 28722 5461 -28618
14780b8618k4573J2442l7663k3186K5137K5687K3483j274K2697k8439P334m6582
$$ -28618 -53191 -40749 -78412 -101598 -76461 -50774 -27291 -28565 -5868 -34307 -26973 -73555
14768g3555n4667K7345O2233L3694N6792m8240n2504J1710M0499M1275o5810o5796
$$ -73555 -128222 -100877 -38644 -4950 51842 3602 -48902 -37192 3307 44582 -21228 -87024
14756h7024J0652r886q601L7539J1458J4565O367R2404L4044o054l6568q567l6266
$$ -87024 -76372 -86258 -94859 -57320 -45862 -31297 -24930 67474 101518 95464 58896 50329 14063
14743A4063q6062l1181N0009M4548q8015n0299L8085M8028J7537M014p726j8690
$$ 14063 -71999 -103180 -53171 -8623 -96638 -146937 -108852 -60824 -43287 -39273 -46999 -65689
14731f5689j2854L3948q308k5135j469n046K8152L2330K0183k8365L4792N3694
$$ -65689 -78543 -44595 -52903 -78038 -79507 -84553 -56401 -24071 -3888 -32253 2539 56233
14719E6233K5316k795n1718m9948j4597J711J0515J6643m2048n5813j9427M1670
$$ 56233 81549 78754 27036 -22912 -37509 -35798 -25283 -8640 -50688 -106501 -125928 -84258
14707h4258L7898o279j2403J8680J01717m237o9851J0770J0563j0023r834l7545
$$ -84258 -46360 -52639 -65042 -46362 55355 51118 -18733 -7963 2600 -7423 -17257 -54802
14695e4802L1943K8383M1431N0560J7484n1435k7173J3377J1811n5664k9621K9402
$$ -54802 -22859 5524 46955 97515 114999 63564 36391 49768 61579 5915 -23706 5696
14683E696O0876k7062r0306k8369o698L2638R692n2644J1717M7288L0100L1100
$$ 5696 66572 39510 -50796 -79165 -85863 -53225 -43533 -96177 -84460 -37172 -7072 24028
14671B4028j1652j0238L5405L4194K370k5109k0855L5903P63p9978j1990j5573
$$ 24028 12376 2138 37543 71737 74107 48998 28143 64046 64809 -15169 -27159 -42732
14659d2732K495K7919j5143m1061R80R2125n828K8777N919L5804k1331m1862o7199
$$ -42732 -40237 -12318 -27461 -68522 -67542 24583 18755 47532 53451 89255 67924 26062 -41137
14646d1137J8475j205m408L1016l631k1315M8424M6882l7878j3156k4275J0734
$$ -41137 -22662 -23867 -28275 2741 -890 -22205 26219 73101 35223 22067 -2208 8526
14634H526O0852m5617j3789O6081L2330j9405l2950j6800j640j4770j3942j1954
$$ 8526 69378 23761 9972 76053 108383 88978 56028 39228 37588 22818 8876 -3078
14622c078L7801R204p3393o8121J0790N2935K8737O0478K7937J2833m5279j5723
$$ -3078 34723 43927 -29466 -97587 -86797 -33862 -5125 55353 83290 96123 50844 35121
14610C5121k4501M5711P6891j2826l4765L222m7486o2950J5297N1193P6978m2513
$$ 35121 10620 56331 133222 120396 85631 88853 41367 -21583 -6286 44907 121885 79372
14598G9372p8277K1343j826l9435q306J7676M5068j2588K5326J9755m4973o6487
$$ 79372 1095 22438 20612 -18823 -27129 -9453 35615 23027 48353 68108 23135 -43352
14586d3352L92K5843L5047K9064j9509o7473R804M1267m1513j0981k3825m1621
$$ -43352 -42960 -17117 17930 46994 27485 -39988 -30184 11083 -30430 -41411 -65236 -106857
14574a06857M7210J0868k3906l9093N3796J945O2520Q1609n5534l2406O2943M2618
$$ -106857 -59647 -48779 -72685 -111778 -57982 -56037 6483 88092 32558 152 63095 105713
14562A05713j2594q38p3286m3343l2820K9189K2514j7192J420J1466j2260L1074
$$ 105713 93119 92281 18995 -24348 -57168 -27979 -5465 -22657 -21237 -9771 -22031 9043
14550I043m1600k6710k007L32J2836K4625O5150N273p3631j8506Q6272M3628o3053
$$ 9043 -32557 -59267 -61274 -60942 -48106 -23481 41669 46942 -26689 -45195 41077 84705 21652
14537B1652q0138L5298N3614M955o73L5080O961m4871m1208J6666J1214r151J3584
$$ 21652 -58486 -23188 30426 35381 34708 69788 76749 31878 -9330 7336 18550 9399 22983
14524B2983M2469R4450K0430k6769r1832l8712J3753J1411N2173n413K5995q380
$$ 22983 65452 159902 180332 153563 61731 23019 36772 48183 100356 94943 120938 112558
14512A12558o0625j8803r159M1566l3168n8022k8390L0343P1348j0429R884o3964
$$ 112558 51933 33130 23971 65537 32369 -25653 -54043 -23700 47648 37219 47103 -16861
14500a6861r531N528n4851p2240J2061O981J00972Q0048l7534k4588k2733N6660
$$ -16861 -26392 -20864 -75715 -147955 -135894 -128913 -27941 52107 14573 -10015 -32748 23912
14488B3912m328o3644j6755M4622K6840K3790k2332j8083l6439j1881J5301J9731
$$ 23912 19584 -44060 -60815 -16193 10647 34437 12105 -5978 -42417 -54298 -38997 -19266
14476a9266N3305K7901J5600m9610n4692k2447P1302k1151M7022K9177k9414j0676
$$ -19266 34039 61940 77540 27930 -26762 -49209 22093 942 47964 77141 47727 37051
14464C7051L31K5822k1792r1180j7332O3731K0077N7764k1842n5820K2882m5101
$$ 37051 37382 63204 41412 -49768 -67100 -3369 16708 74472 52630 -3190 19692 -25409
14452b5409k2349K873K8471K0747M8307J8805o522k7131l6048O218k3312k031
$$ -25409 -47758 -44885 -16414 4333 52640 71445 64923 37792 1744 7962 -15350 -17381
14440a7381n303j9703l2066m8374k1679K2823O2259L7136L2751k8649j1839J7353
$$ -17381 -22684 -42387 -74453 -122827 -144506 -121683 -59424 -22288 10463 -18186 -30025 -12672
14428a2672j6029L1502N0635J3211l0123n9889k1594J2324k3063k8217J4655K8694
$$ -12672 -28701 2801 53436 66647 36524 -23365 -44959 -32635 -55698 -83915 -69260 -40566
14416d0566n750J5901j0355J8262L6910l7871q664K8352j3730L6720J2905l2360
$$ -40566 -46316 -30415 -40770 -22508 14402 -23469 -32133 -3781 -17511 19209 32114 -246
14404b46r4124O939Q7681Q8598P487k5091n8658l3696Q067o643K9395M7813K0373
$$ -246 -94370 -87431 250 88848 96335 71244 12586 -21110 -13043 -19686 9709 57522 77895
14391G7895k1839o4115J6257L599n6633n6708j7523Q2340J09958j9490L093J0638
$$ 77895 56056 -8059 8198 11797 -44836 -101544 -119067 -36727 73231 53741 56834 67472
14379F7472j976m2184k0389k8062N86K0621N182K2166K5782p756r4943n2884P7511
$$ 67472 65496 23312 2923 -25139 -24553 -3932 1250 23416 49198 41442 -53501 -106385 -28874
14366b8874K4864J994q695j4241j816O389j3863P0245k5422L0342P549k8880j9437
$$ -28874 -4010 -2016 -10711 -24952 -26768 -20379 -34242 36003 10581 40923 48472 19592 155
14353A55r940M6855O3019m2114n2492j0268k7076j0310J02K3225o2573o939O4319
$$ 155 -9785 37070 100089 57975 5483 -4785 -31861 -42171 -42069 -18844 -81417 -88356 -24037
14340b4037O5070K9361m2355n230Q630k8747K7204L3902l0312j4193M1981n215
$$ -24037 41033 70394 28039 22809 31439 2692 29896 63798 33486 19293 61274 56059
14328E6059n6812J6030j2483m974M4685K9318L5463n5160o7045k5610J3467K5414
$$ 56059 -753 15277 2794 -2180 42505 71823 107286 52126 -14919 -40529 -27062 -1648
14316a648J7845K196j9724k0944j0990l1861J1950j4404m9501L4860L6331j7354
$$ -1648 16197 18393 -1331 -22275 -33265 -65126 -53176 -67580 -117081 -82221 -45890 -63244
14304f3244M9007O5182Q676J3189O5524o1909m6118j9339j161J8512M9809M3814
$$ -63244 -14237 50945 59621 72810 138334 76425 30307 10968 9807 28319 78128 121942
14292A21942n407J0927m3746o6767q461M6769l5001j2065k739k023L0707J9630
$$ 121942 116535 127462 83716 16949 8488 55257 20256 8191 5452 3429 34136 53766
14280E3766J924k6581n5629L5350L0228m1287k4924L3416k0402k9704N6895P3906
$$ 53766 55690 29109 -26520 8830 39058 -2229 -27153 6263 -14139 -43843 13052 86958
14268H6958q215l1824m4102J4096J4160l8451o9138K8747O3456O1740k8140m4496
$$ 86958 78743 46919 2817 16913 31073 -7378 -76516 -47769 15687 77427 49287 4791
14256D791l7808j9911J6112M313j6581L3147J5567o2282R087N5910K4489L8318
$$ 4791 -33017 -52928 -36816 -32503 -49084 -15937 -370 -62652 -53565 2345 26834 65152
14244F5152Q864K7302q6537j03832L705M1926M7686j1395l0583L4552L9723L7878
$$ 65152 74016 101318 14781 -89051 -85346 -43420 4266 -7129 -37712 -3160 36563 74441
14232G4441l4095n4382J6580k1077j6375j6688N5112l1548K6237L831j0940L4842
$$ 74441 40346 -14036 2544 -18533 -34908 -51596 3516 -28032 -1795 2036 -8904 25938
14220B5938P2038j5927k0364K2529M3424L2705o0627l1024m2663K5785L254o6097
$$ 25938 97976 82049 61685 84214 127638 160343 99716 68692 26029 51814 55068 -11029
14208a1029k3014K5165R39j7912p473L3960O937L5021L6362o5668m3525L7730
$$ -11029 -34043 -8878 -7939 -25851 -33324 636 7573 42594 78956 13288 -30237 7493
14196G493n154p2404M9976N8915n1864N551K264m1752p104K4201M0181K9091q923
$$ 7493 2339 -70065 -20089 38826 -13038 -7487 -5223 -46975 -54079 -29878 10303 39394 30471
14183C0471j7590K8692N76M008p1407p5577K5953Q4202k2241l6205O9277M5187
$$ 30471 12881 41573 42149 46157 -25250 -100827 -74874 9328 -12913 -49118 20159 65346
14171F5346K2885L1252k7485k7042k9303K8202m1199m3840L1491R212l0942r8223
$$ 65346 88231 119483 91998 64956 35653 63855 22656 -21184 10307 19519 -11423 -109646
14159a09646k4962K5866M0154K1758l8775o5253K5111O7186l524k9446O8742Q7077
$$ -109646 -134608 -108742 -68588 -46830 -85605 -150858 -125747 -58561 -62085 -91531 -22789 64288
14147F4288j7753k486l1491l3444l1408l6436m0454L622R2976Q2804o2899p7135
$$ 64288 46535 44049 12558 -20886 -52294 -88730 -129184 -125562 -32586 50218 -12681 -89816
14135h9816O316M592M897K8611K5729O5467O8661n631j6937m6843o2478j6044
$$ -89816 -83500 -78908 -74011 -45400 -19671 45796 114457 108826 91889 45046 -17432 -33476
14123c3476j1413L1572L5249R987J1333K3597N2585k1358o5139r977J0187j5379
$$ -33476 -44889 -13317 21932 31919 43252 66849 119434 98076 32937 22960 33147 17768
14111A7768r873m1227n2663k4010J3098J1477J364L1167p704l508r283K271N6162
$$ 17768 7895 -33332 -85995 -110005 -96907 -85430 -84066 -52899 -60603 -64111 -73394 -71123 -14961
14098a4961M069k987j4951p0849N1620K5030j8785L8476j0792k7466m2189m6860
$$ -14961 -10892 -13879 -28830 -99679 -48059 -23029 -41814 -3338 -14130 -41596 -83785 -130645
14086a30645M0788P2281K0417p8794J2483K5359M1165O5407Q1557J1534K1395
$$ -130645 -89857 -17576 2841 -75953 -63470 -38111 3054 68461 150018 161552 182947
14075A82947j8663J9621J2443q2168j8428j8117j7676k6352j789l5120m8757M685
$$ 182947 164284 183905 196348 114180 95752 77635 59959 33607 31818 -3302 -52059 -47374
14063d7374M4256k1248J7553J7568N4225k0493m9428N032J3414M1891K7522P490
$$ -47374 -3118 -24366 -6813 10755 64980 44487 -4941 91 13505 55396 82918 90408
14051I0408k5161q614k2310J3252L6727n7801o6571k8882R1619P0059n067L9940
$$ 90408 65247 56633 34323 47575 84302 26501 -40070 -68952 22667 92726 87659 127599
14039A27599q959Q825L1729O8018L3657J28716J34304R7316J4226p1020q4541
$$ 127599 118640 127465 159194 227212 260869 389585 523889 621205 635431 564411 479870
14028D79870j81827j10854n7267J0801O978k0052l1844l0086J4464L3004K5021
$$ 479870 298043 187189 129922 140723 147701 127649 95805 65719 80183 113187 138208
14017A38208k0387o297n9220n3192k7391J5879O2822N3793J6429j698M3388L7364
$$ 138208 117821 111524 52304 -888 -28279 -12400 50422 104215 120644 118946 162334 199698
14005A99698k5414j09752L1119j8763l8714J457k0472K871k4921L7577Q8532O7856
$$ 199698 174284 64532 95651 76888 38174 39631 19159 22030 -2891 34686 123218 191074
13993A91074J8437k4100L1351O340J12514J06507Q1299O4078j5863j07647r3990
$$ 191074 209511 185411 216762 223102 335616 442123 523422 587500 571637 463990 370000
13982C70000j59061j05671K627o794j9151J9102M5094l3118o460K738p494n6775
$$ 370000 210939 105268 107895 101101 81950 101052 146146 113028 106568 109306 101812 45037
13970D5037l1172Q074L1642o898L3373k1359m9389q44J3405L5137J06226K8397
$$ 45037 13865 21939 53581 46683 80056 58697 9308 8464 21869 57006 163232 191629
13958A91629n0863n8662j5392n5873K6802P1617j161n4321m0823K0215j6673L3388
$$ 191629 140766 82104 66712 10839 37641 109258 108097 53776 12953 33168 16495 49883
13946D9883M7626J8938J6480j2547K67K4612O1965K2206p7108o7714O291O258
$$ 49883 97509 116447 132927 120380 120647 145259 207224 229430 152322 84608 90899 97157
13934I7157O767m724l9317k0447m5574L837J3284j4371j7724Q062J6773K777J2641
$$ 97157 103924 99200 59883 39436 -6138 -2301 10983 -3388 -21112 -13050 3723 6500 19141
13921A9141l6368o39N7908j8911n7579L702L4163l0454j6559m986O474N3605L8440
$$ 19141 -17227 -17866 40042 21131 -36448 -32746 1417 -29037 -45596 -50582 -44108 9497 47937
13908D7937m5227n3788k9333R4097k2836K2751M6500k5403J413m1963k9264M8365
$$ 47937 2710 -51078 -80411 13686 -9150 13601 60101 34698 36111 -5852 -35116 13249
13896A3249Q0950k3049n9894J5886j4565k5244M7197j0080l1645p4715n651O9151
$$ 13249 94199 71150 11256 27142 12577 -12667 34530 24450 -7195 -81910 -87561 -18410
13884a8410M9332k4723N0928L586J3737J3849l1573k8296k4650l8464k4375K3306
$$ -18410 30922 6199 57127 60713 74450 88299 56726 28430 3780 -34684 -59059 -35753
13872c5753K6249J6560L6449j186k3392K6232Q848N289j939k8938Q47K736j5875
$$ -35753 -9504 7056 43505 42319 18927 45159 54007 59296 57357 28419 29266 32002 16127
13859A6127P836O1137L7291l1120j9603m8565k2948P328O9244m1451l4694m031
$$ 16127 23963 85100 122391 91271 71668 23103 155 7483 76727 35276 582 -3449
13847c449o7100K0477l226O553L8693K1746p63k8662K1492L5216j4238m78K1978
$$ -3449 -70549 -50072 -53298 -46745 -8052 13694 12931 -15731 5761 40977 26739 26261 48239
13834D8239L5228l8132m591j2076J3474M8144m1831J000J1519l5210K1847R073
$$ 48239 83467 45335 40744 28668 42142 90286 48455 49455 60974 25764 47611 56684
13822E6684M1615j7680l3385J6955J651j5667n226P9127k7377m8048k0640J929
$$ 56684 98299 80619 47234 64189 65840 50173 44947 124074 96697 48649 28009 29938
13810B9938K8219r260l4457M0633m492m7636p800O897K2873J8444K2659K6633
$$ 29938 58157 48897 14440 55073 50581 2945 -4855 2042 24915 43359 66018 92651
13798I2651n5563n695J2200N690N662k0579k1019k4185J5743K8857J7694K0794
$$ 92651 37088 31393 43593 49283 54945 34366 13347 -10838 4905 33762 51456 72250
13786G2250m0611m0022K0674M1997n0260O622L8849L3129M9647J0949o7366l1129
$$ 72250 31639 -8383 12291 54288 4028 10650 49499 82628 132275 143224 75858 44729
13774D4729N0954N1113K8287J57j3530m9438m9167m2415J1423K0233M697k7869
$$ 44729 95683 146796 175083 175240 161710 112272 63105 20690 32113 52346 57043 29174
13762B9174l7003N538L9425R032j2282n7738l1621K8925J3258q808J8711K6913
$$ 29174 -7829 -2291 37134 46166 33884 -23854 -55475 -26550 -13292 -22100 -3389 23524
13750B3524R602M1741k1706n3511r257K4869j3874K358M5259J5135J6119K5565
$$ 23524 33126 74867 53161 -350 -9607 15262 1388 3746 49005 64140 80259 105824
13738A05824K8403J9916M2411L0318p8034j5402p985o8135j7312M8509N9659M2171
$$ 105824 134227 154143 196554 226872 148838 133436 125451 57316 40004 88513 148172 190343
13726A90343N0733L5844m2441j08840k7480j8684K855L639K3708Q4861M4299q9899
$$ 190343 241076 276920 234479 125639 98159 79475 82330 85969 109677 194538 238837 148938
13714A48938j08236M397J7005o407J3459K4110J1642N3502m6709l7716K5816M8940
$$ 148938 40702 45099 62104 55697 69156 93266 104908 158410 111701 73985 99801 148741
13702A48741J9356k2021K1227M6889O7218n8589l6983j4820M3964N1198q403l0233
$$ 148741 168097 146076 167303 214192 281410 222821 185838 171018 214982 266180 257777 227544
13690B27544J019M0298J5522j8329k4990j9284L5771k7073o7567J6782Q7676j5208
$$ 227544 228563 268861 284383 266054 241064 221780 257551 230478 162911 179693 267369 252161
13678B52161r519l7052O555o635O260K9504P4234L8339q4380l7871J0599J6630
$$ 252161 242642 205590 212145 205510 211770 241274 315508 353847 269467 231596 242195 258825
13666B58825m878L3621M4206k507l9175q6840M8241Q5779J6011l6144l205L2729
$$ 258825 253947 287568 331774 329267 290092 203252 251493 337272 353283 317139 313934 346663
13654C46663N8639K7787P7276k4565k5854n934O8233J03074M7718K6472L7451
$$ 346663 405302 433089 510365 485800 459946 454012 522245 625319 673037 699509 736960
13643G36960N057J005K4876M2611p288M5569Q7687P5583J8430M2029Q1024J14230
$$ 736960 742017 743022 767898 810509 803221 848790 936477 1012060 1030490 1072519 1153543 1267773
13631A267773J06673J65360J55334K18915K61965L35648M64243N66975O68906
$$ 1267773 1374446 1539806 1695140 1914055 2176020 2511668 2975911 3542886 4211792
13622D211792P87493R12546J078870J455935K260128L444601N140345O928837
$$ 4211792 4999285 5911831 6990701 8446636 10706764 14151365 19291710 26220547
13614B6220547P638647M287870k992693q395206q028504n218020l167722j934910
$$ 26220547 33859194 38147064 35154371 26759165 18730661 13512641 10344919 8410009
13606H410009j244124q35854n94046m03506l26961k81724k76946k50565j94157
$$ 8410009 7165885 6330031 5735985 5332479 5005518 4723794 4446848 4196283 4002126
13597D002126j89459j74657j44011m8415l2490m2530J9567M8217J23143J73066
$$ 4002126 3812667 3638010 3493999 3445584 3413094 3370564 3390131 3438348 3561491 3734557
13587C734557K02590K87091L72651M51602N57818P79488R40808J223116J524453
$$ 3734557 3937147 4224238 4596889 5048491 5606309 6385797 7326605 8549721 10074174
13578A0074174J893372K395591K682271L111441M090919O204308R721383J4828842
$$ 10074174 11967546 14363137 17045408 20156849 24247768 30452076 40173459 55002301
13570E5002301K0788330K5121947J8535332m656477k7366335k8696764j8090477
$$ 55002301 75790631 100912578 119447910 114791433 87425098 58728334 40637857
13563D0637857j0442024o296518m032495k628958j719867j243951j156244j151000
$$ 40637857 30195833 23899315 19866820 17237862 15517995 14274044 13117800 11966800
13555A1966800r94300r04247q68340p77199o01250n38916m92961l08093k83033
$$ 11966800 10972500 10068253 9199913 8422714 7821464 7282548 6789587 6481494 6198461
13546F198461k38252j39654o7820k3733P613J43150K22558L32154M90083O88092
$$ 6198461 5960209 5820555 5752735 5729002 5736615 5879765 6102323 6434477 6924560 7612652
13536G612652Q70565J112770J422393J841041K337821K653047L005665L843393
$$ 7612652 8483217 9595987 11018380 12859421 15197242 17850289 20855954 24699347
13528B4699347N853086R201628J4098306K0118185K5240996K1038575n32515k5519298
$$ 24699347 30552433 39754061 53852367 73970552 99211548 120250123 119717608 94198310
13520I4198310l0816418k0280750j1628098o938056m404771k793274j866098j368784
$$ 94198310 63381892 43101142 31473044 24534988 20130217 17336943 15470845 14102061
13512A4102061j194470j171787j087899j054431r25726q14756p26896n87871n13492
$$ 14102061 12907591 11735804 10647905 9593474 8667748 7852992 7126096 6538225 6024733
13503F024733m94074m58291l01718k15955k36198k04971j80633r9351n4356j866
$$ 6024733 5530659 5072368 4770650 4554695 4318497 4113526 3932893 3833542 3779186 3777320
13493C777320Q7506J52537K75783K68497L77827N62347P14385Q81291R75820J200715
$$ 3777320 3864826 4017363 4293146 4561643 4939470 5501817 6216202 7097493 8073313 9274028
13483I274028J856490K910762M433172O345412P927285O680581M58522p158294
$$ 9274028 11130518 14041280 18474452 24819864 32747149 39427730 39886252 32727958
13475C2727958r590345p068963m306574k636283j605501j052913p61315n76020
$$ 32727958 23137613 16068650 11762076 9125793 7520292 6467379 5706064 5130044
13467E130044m68394m70761m54863l74137l53190k96113k25715k22968j77682
$$ 5130044 4661650 4190889 3736026 3361889 3008699 2712586 2486871 2263903 2086221
13458B086221j61781j50644j03204l4775r5363j18058j53219j26888o4969j16734
$$ 2086221 1924440 1773796 1670592 1635817 1540454 1422396 1269177 1142289 1077320 960586
13448I60586j00453l22K3657k6764p9552q3502j13496J1734J25097j9589j00927
$$ 960586 860133 859811 883468 856704 777152 693650 580154 591888 716985 697396 596469
13437E96469l8882k4283k2675K824K6233n5473k2277q619j3654O462L7786l956
$$ 596469 557587 533304 510629 513453 539686 484213 461936 453317 439663 446125 483911 479955
13425D79955n5350l2273o7488m4938k9182J7791O3664Q2691K2378n3142r6423
$$ 479955 424605 392332 324844 279906 250724 268515 332179 414870 437248 384106 287683
13414B87683m7016J9892J2635R537m481k3980M555j3166L7701j7976l5528k87
$$ 287683 240667 260559 273194 282731 278250 254270 258825 245659 283360 265384 229856 229569
13402B29569l4779k1138j2111J0365J4351N0675j5293m3679n315N8305l584O791
$$ 229569 194790 173652 161541 171906 186257 236932 221639 177960 172645 230950 227366 234157
13390B34157k5268l6472K0486j7807j6976m862L4796J06991k8972n1764l7713
$$ 234157 208889 172417 192903 175096 158120 153258 188054 295045 266073 214309 176596
13379A76596r9K6012R820k5312n7801j586o964O0059L0556J1245o2911j8559n060
$$ 176596 176497 202509 212329 187017 129216 127630 120666 180725 211281 222526 159615 141056 135996
13366A35996j6616j7962M844L8248N0226l4903l9616J8485N3242q503k1458n6177
$$ 135996 119380 101418 106262 144510 194736 159833 120217 138702 191944 183441 161983 105806
13354A05806k3822K5148K1906r480m1688q483M4169M1192K7918j4780k4693j8741
$$ 105806 81984 107132 129038 119558 77870 69387 113556 154748 182666 167886 143193 124452
13342A24452L942J8064P73J7525j8761l7569L7636L0548m0084m7868K4495L2494
$$ 124452 128394 146458 147231 164756 145995 108426 146062 176610 136526 88658 113153 145647
13330A45647L1971j1177p077k0130N49j8505r9611o705l5291N4984Q5346n936
$$ 145647 177618 166441 159364 139234 139783 121278 21667 14962 -20329 34655 120001 114065
13318A14065j8209n131j5546l9988j1478k2431L4287j5419j882l4173N0434N7266
$$ 114065 95856 90725 75179 35191 23713 1282 35569 20150 18268 -15905 34529 91795
13306I1795o67j8447J9001L1782m1305k7104l2768k4928L0871J4889L650N005
$$ 91795 91128 72681 91682 123464 82159 55055 22287 -2641 28230 43119 46769 51774
13294E1774R115j5435l3123m6278Q731k909N0178L1608K7168K5546j4172j8287
$$ 51774 60889 45454 12331 -33947 -25216 -28125 22053 53661 80829 106375 92203 73916
13282G3916m6314k5067J1737Q192Q7190o8649J5407Q5227l0995m477j1139l0531
$$ 73916 27602 2535 14272 22464 109654 41005 56412 141639 110644 106167 95028 64497
13270F4497l9689K0900M0370o624j9000n175n9998M1979P8876j6262n5160K7114
$$ 64497 24808 45708 86078 79454 60454 55279 -4719 37260 116136 99874 44714 71828
13258G1828O022j1778k6991n6002p195j0448J7435K445K7169o7992n5648J4206
$$ 71828 77850 66072 39081 -16921 -24116 -34564 -17129 -14684 12485 -55507 -111155 -96949
13246i6949m324O4565K7459q157O1040j9661M8294K6227O410L2240K2028j0504
$$ -96949 -101273 -36708 -9249 -17406 43634 23973 72267 98494 104904 137144 159172 148668
13234A48668L6160m0105q0125n7577J8390j950R403L996N660l437M3198r64m2692
$$ 148668 184828 144723 64598 7021 25411 23461 32864 36860 42520 39083 82281 81317 38625
13221C8625l3299O5750K3794m1387m3404J8010l927J3637k14m1355n8571j6125
$$ 38625 5326 71076 94870 53483 10079 28089 24162 37799 37585 -3770 -62341 -78466
13209g8466K0745K9942J5456m4889J4378K8786j2811k4970M6983J13247m4399
$$ -78466 -57721 -27779 -12323 -57212 -42834 -14048 -26859 -51829 -4846 108401 64002
13198F4002k1509K395m1701K1324j0974L1731l284j9922k4591k1799J4741K856
$$ 64002 42493 44888 3187 24511 13537 45268 41984 22062 -2529 -24328 -9587 -6731
13186f731o580J0510l3898n393K0137o4373k5367M6684P7544P3444K5491j7862
$$ -6731 -13311 -2801 -36699 -42092 -21955 -86328 -111695 -65011 12533 85977 111468 93606
13174I3606j20214p8264M1833M5069L160K8560K1433K9j6464l0086k62K3505K5604
$$ 93606 -26608 -104872 -63039 -17970 -14810 13750 35183 35212 18748 -11338 -11600 11905 37509
13161C7509j1012J9503k6670l5813K3033j7776k4099j1724O4091L5278L3489j3554
$$ 37509 26497 46000 19330 -16483 6550 -11226 -35325 -47049 17042 52320 85809 72255
13149G2255k0778q551j0967k8999K2402O1585J03361M6278l2911n7742p4687m4485
$$ 72255 51477 42926 31959 2960 25362 86947 190308 236586 203675 145933 71246 26761
13137B6761k3099l985M2113P190k3648l3441M0383J0969N137L1472P791K8018
$$ 26761 3662 -323 41790 48980 25332 -8109 32274 43243 48380 79852 87643 115661
13125A15661r421n5520r393r976M5230Q0598q022o629O0222M8798r3595n7622
$$ 115661 106240 50720 41327 31351 76581 157179 149157 142528 202750 251548 157953 100331
13113A00331J2689l7837P689j9616K7739k1483j3753N2079J7880M7195J1945J0175
$$ 100331 113020 75183 82872 63256 90995 69512 55759 107838 125718 172913 184858 195033
13101A95033n0705L1714J27772J21813J56243P0055k7460j22749j41620j34707
$$ 195033 144328 176042 303814 425627 581870 651925 624465 501716 360096 225389
13091B25389q6970K8462M9100l9465o2561l496J2200M1592l8996m5777k2533J5425
$$ 225389 138419 166881 215981 176516 113955 110459 122659 164251 125255 79478 56945 72370
13079G2370J4491J3128k6079j000j592k1362k6289j3281j9846R450L8081J7176
$$ 72370 86861 99989 73910 72910 71318 49956 23667 10386 -9460 -10 38071 55247
13067E5247m023k5831k3520l3513n0331l1386P0178J24128K1623j0259N8347N1860
$$ 55247 51224 25393 1873 -31640 -81971 -113357 -43179 80949 102572 92313 150660 202520
13055B02520p39Q1098N2762O8814J37256O7824j61376j96156q8082J0333p9105
$$ 202520 201781 282879 335641 404455 541711 609535 448159 252003 163921 174254 95149
13044I5149m1433j1045J2759R586J7854M911m5069o1799o2217N5427P6759q512
$$ 95149 53716 42671 55430 65016 82870 87781 42712 -19087 -81304 -25877 50882 42370
13032D2370n4862K5071L616L5158K283l5769r963J5561l9236N8380q732l6869
$$ 42370 -12492 12579 16195 51353 53636 17867 7904 23465 -15771 42609 33877 -2992
13020b992k0722J043J1791o621p969k019K0038l764k2190P1895M9446o230J9944
$$ -2992 -23714 -22671 -10880 -17501 -25470 -27489 -7451 -11215 -33405 38490 87936 81706 101650
13007A01650P1170P7646J7385o2067p0684q310m1992l1379j9755l1676n769K2254
$$ 101650 172820 250466 267851 205784 135100 126790 84798 53419 33664 1988 -3781 18473
12995A8473N3606M4619q885o3239k4207j245q710O0472k779L2336M214m6483j5496
$$ 18473 72079 116698 107813 44574 20367 19122 10412 70884 68105 100441 104655 58172 42676
12982D2676p317j4482l1293N1860M0029q858J7600k3086q3143p3131j362J5125
$$ 42676 35359 20877 -10416 41444 81473 72615 90215 67129 -16014 -89145 -90507 -75382
12970g5382Q2256K1796l811J8290K2713j920j7639k2498q921j15404P6285P3815
$$ -75382 6874 28670 24859 43149 65862 63942 46303 23805 14884 -100520 -24235 49580
12958D9580J6848J7066k0598m7211K2251J4434J380N0233M3684p6607o4488K3594
$$ 49580 66428 83494 62896 15685 37936 52370 53750 103983 147667 71060 6572 30166
12946C0166r879m2848K9379J9654j4250j3917k4648K811m7094J7204J9946k9260
$$ 30166 20287 -22561 6818 26472 12222 -1695 -26343 -23532 -70626 -53422 -33476 -62736
12934f2736R170M6656Q3788M9815M5368k3491o1396K1732L232k2666n2101j3543
$$ -62736 -53566 -6910 76878 126693 172061 148570 87174 108906 112138 89472 37371 23828
12922B3828k0662j0237l1279k8224K1204K6149J6261N0304K891k3128k0933O581
$$ 23828 3166 -7071 -38350 -66574 -45370 -19221 -2960 47344 50235 27107 6174 12755
12910A2755L4351P811L32J2054o1984k3541P3491l7319o5404R668M1462k0636
$$ 12755 47106 54917 55249 67303 5319 -18222 55269 17950 -47454 -37786 3676 -16960
12898a6960m1418l0843P8524L3797L8507K4080l3027l7894L4078j1905K8154K796
$$ -16960 -58378 -89221 -10697 23100 61607 85687 52660 14766 48844 36939 65093 67889
12886F7889p697n3826n0009J7143k2850j9652N0248K3421k7906K8538N4003k0477
$$ 67889 60192 6366 -43643 -26500 -49350 -69002 -18754 4667 -23239 5299 59302 38825
12874C8825k9378n2431k8965m474R3167M09m6663o8866J3837l5753j7051K3486
$$ 38825 9447 -42984 -71949 -76423 16744 17153 -29510 -98376 -84539 -120292 -137343 -113857
12862a13857J03815K9634m2914K3690j9702m349n4927P2214R2215K5502n389n2382
$$ -113857 -10042 19592 -23322 368 -19334 -23683 -78610 -6396 85819 111321 105932 53550
12850E3550o3273P4L0738m1997j1228J2743N6734l2334r04L5573L290n9734m0147
$$ 53550 -9723 -9649 21089 -20908 -32136 -19393 37341 5007 4103 39676 42966 -16768 -56915
12837e6915J2342J4238l9883m1571J8980L3426L187m5173q37N927M290O2925R1404
$$ -56915 -44573 -30335 -70218 -111789 -92809 -59383 -56196 -101369 -102206 -96279 -91989 -29064 62340
12824F2340L1603l2761P327m7791o1399l3646m6137L3317P1536J9044q532k9901
$$ 62340 93943 61182 68509 20718 -40681 -74327 -120464 -87147 -15611 3433 -5099 -35000
12812c5000M4870Q5847m0443L8101J168r8772K8034J9963p0122l1185l8908J6206
$$ -35000 9870 95717 55274 93375 94543 -4229 23805 43768 -26354 -57539 -96447 -80241
12800h0241J02510N2116j5504l5259k1457l8723L9918L2021n0041J6371j4493
$$ -80241 22269 74385 58881 23622 2165 -36558 3360 35381 -14660 1711 -12782
12789a2782k508O5007p198n9521j3452k2173K6654k6784n0371O9539l901l1582
$$ -12782 -15290 49717 42519 -17002 -30454 -52627 -25973 -52757 -103128 -33589 -37490 -69072
12777f9072l5260O6746N1154l970r197J1619m5054n139J2006O178L2187l030j5882
$$ -69072 -104332 -37586 13568 9598 401 12020 -33034 -38173 -26167 -19989 12198 9168 -6714
12764f714l9980j2759K4651N019r235K0905p0043P4L2617R327m0010j87J8997
$$ -6714 -46694 -59453 -34802 -29783 -39018 -18113 -88156 -88082 -55465 -46138 -86148 -86335 -67338
12751f7338K2210J1492J28L8801R506p5770P1527R7579k5821m9040J8635J8924
$$ -67338 -45128 -33636 -33508 5293 14799 -60971 10556 108135 82314 33274 51909 70833
12739G0833M2638m0697j38922l3071N0433O341J0086L9692K8920m9759J3212N095
$$ 70833 113471 72774 -66148 -99219 -48786 -42445 -32359 7333 36253 -13506 -294 4801
12727D801N145m1311k3234L513P3820K6431L1022k6961m8571K0752K7768O8250
$$ 4801 9946 -31365 -54599 -51086 22734 49165 80187 53226 4655 25407 53175 121425
12715A21425K6844L663K864l4947r3347m9491P1174O000j5567j3872K266J8175
$$ 121425 148269 151932 154796 119849 26502 -22989 48185 54185 38618 24746 27012 45187
12703D5187L1570m840k6721j2444m1764l0937K4212O714J4492R85l2106k88M2371
$$ 45187 76757 71917 45196 32752 -9012 -39949 -15737 -9023 5469 6454 -25652 -25940 16431
12690A6431P0033j4274p291o1399m4599k2754L3930L4539l8326q85q614N06K8235
$$ 16431 86464 72190 64899 3500 -41099 -63853 -29923 4616 -33710 -34595 -43209 -42703 -14468
12677a4468L5107N4817o9904r354k2440K1097l746L8795L3895k4462m1821L2543
$$ -14468 20639 75456 5552 -3802 -26242 -5145 -8891 29904 63799 39337 -2484 30059
12665C0059L2446J6013k8614l5009l188k581K8691L5134k4224l3746O80Q720J0616
$$ 30059 62505 78518 49904 14895 11707 9126 37817 72951 48727 14981 15661 24381 34997
12652C4997K0274Q248p598k0335K4283N811m4815m2746m0046N5991K1694J207
$$ 34997 55271 63519 55921 35586 59869 65680 20865 -21881 -61927 -5936 15758 16965
12640A6965J1276J2288N7324p177o4553l6737K0825n6567o0370M502J5594o741
$$ 16965 28241 40529 97853 90676 26123 -10614 10211 -46356 -106726 -102224 -86630 -93371
12628i3371J8273r581l6827L607J7667J0427o0173k0768N9077J08066K278R278
$$ -93371 -75098 -84679 -121506 -117899 -100232 -89805 -149978 -170746 -111669 -3603 -1325 7953
12616G953N847l6156k7220J8391M2487p303J768j1312L278O548M388m5705p718
$$ 7953 13800 -22356 -49576 -31185 11302 3999 5767 -5545 -2267 4281 8669 -37036 -44754
12603d4754Q734K60J5797M3193j1099K6173M0958L8208K1932p5651m5027l5191
$$ -44754 -36020 -35760 -19963 23230 12131 38304 79262 117470 139402 63751 18724 -16467
12591a6467j0348L2862J8742k620J4681N8462n8376o8835n1221K788L4558o216
$$ -16467 -26815 6047 24789 22169 36850 95312 36936 -31899 -83120 -80332 -45774 -51990
12579e1990N5936Q214M036m91k956K2976L7332m2925m8305k3070N5438M4590k1623
$$ -51990 3946 12160 16196 15705 12749 35725 73057 30132 -18173 -41243 14195 58785 37162
12566C7162k7641O837M2159K179q6591n860k567M5201L612K2215J6429k5515p6928
$$ 37162 9521 16358 58517 60696 -25895 -31755 -34322 10879 14491 36706 53135 27620 -49308
12553d9308k2150M5072J7217R385l326p7202L1316l2812k3092j1191L0593M783
$$ -49308 -71458 -26386 -9169 216 -3110 -80312 -48996 -81808 -104900 -116091 -85498 -80715
12541h0715J2111r719M9824K249j0818k263o1268k9245N7876K8230K0746J8945
$$ -80715 -68604 -78323 -28499 -26250 -37068 -39331 -100599 -129844 -71968 -43738 -22992 -4047
12529d047N57j1346K0392k9371o221j1566P231L5702j7225R559J6332j406L212
$$ -4047 -3490 -14836 5556 -23815 -30036 -41602 -34371 1331 -15894 -6335 9997 8591 11803
12516A1803L5690J149M035j8454j9273m7186K2536k9298Q146m2384l737k7137
$$ 11803 47493 48642 52677 34223 14950 -32236 -9700 -38998 -30852 -73236 -76973 -104110
12504a04110r616o2179O6188N7857o534j2997M7397J3554o110M0771L3047j6051
$$ -104110 -113726 -175905 -109717 -51860 -58394 -71391 -23994 -10440 -16550 24221 57268 41217
12492D1217q240l3825M1010K1204o0802q7632m8720M0414O4323J7226m5256j9066
$$ 41217 32977 -848 40162 61366 564 -87068 -135788 -95374 -31051 -13825 -59081 -78147
12480g8147L1869K7082m6506k2092L04J6573k0389O91N7802M5281K8983l0797
$$ -78147 -46278 -19196 -65702 -87794 -87490 -70917 -91306 -90615 -32813 12468 41451 10654
12468A0654n514o0748k1243N5214K841M8022J2804m1952j2422m5429P16m636N067
$$ 10654 5140 -55608 -76851 -21637 -18796 29226 42030 78 -12344 -57773 -57057 -61693 -56626
12455e6626L4473l162L604L860P056j8880o2113N3827O5519Q6560J4478q2702
$$ -56626 -22153 -25315 -21711 -17851 -10795 -29675 -91788 -37961 27558 114118 128596 45894
12443D5894l3959l066k5419L4991M6566k1377j1846k4815R603L4703m0997l1623
$$ 45894 11935 8869 -16550 18441 65007 43630 31784 6969 16572 51275 10278 -21345
12431b1345l9010M6381K5758n5621j0602k0122K1921j5847K8114j4917k2093K1846
$$ -21345 -60355 -13974 11784 -43837 -54439 -74561 -52640 -68487 -40373 -55290 -77383 -55537
12419e5537K7724j7283J0965m5798J1375N8160j3830J2350M3153q834n2137p226
$$ -55537 -27813 -45096 -34131 -79929 -68554 -10394 -24224 -11874 31279 22445 -29692 -36918
12407c6918M2455m548q280L6824R847k7744k7127M4833k5678K3345l3386m8255
$$ -36918 5537 989 -7291 29533 39380 11636 -15491 29342 3664 27009 -6377 -54632
12395e4632L2958K6423J6167L856k5062l4788k6134J6871M0434n583l1827P209
$$ -54632 -21674 4749 20916 24772 -290 -35078 -61212 -44341 -3907 -9490 -41317 -34108
12383c4108k602m0515o1878J174M6099j750L4019J7442N806j5594M1255L8436
$$ -34108 -36710 -77225 -139103 -137929 -91830 -93580 -59561 -42119 -36313 -51907 -10652 27784
12371B7784n0336P870M0824O477k0252j3558k828m815K7128J5611L3231Q631m0922
$$ 27784 -22552 -14682 26142 32619 12367 -1191 -4019 -8834 18294 33905 67136 75767 34845
12358C4845m9722n1612R773J9977n1832K2350M2789P455M63j2354K9996K5040
$$ 34845 -14877 -66489 -56716 -36739 -88571 -66221 -23432 -15977 -15514 -27868 2128 27168
12346B7168l9583Q729J1156l0512J221l3731l0916J6963Q1220Q098j1147J1373
$$ 27168 -12415 -3686 7470 -23042 -21821 -55552 -86468 -69505 11715 19813 8666 20039
12334B0039L0397l3874m1131l5458k8787M9503k483P371J5694k4753l7998K0778
$$ 20039 50436 16562 -24569 -60027 -88814 -39311 -41794 -34423 -18729 -43482 -81480 -60702
12322f0702K1711j6398O8980L5791L0133m5590K4701M9547n5008o6022O3558m0513
$$ -60702 -38991 -55389 13591 49382 79515 33925 58626 108173 53165 -12857 50701 10188
12310A0188L7229O0901K3849O646n7206l4125l9472k488l8716k0181l3260J5542
$$ 10188 47417 108318 132167 138813 81607 47482 8010 5522 -33194 -53375 -86635 -71093
12298g1093J0906Q925Q538J6537j2751r893L720O836j3439k6597J618M6879J4188
$$ -71093 -60187 -51262 -42724 -26187 -38938 -48831 -45111 -38275 -51714 -78311 -76693 -29814 -15626
12285a5626P9227M6119J6478l5365P368l6973k432j2654L5180p720l6759J5619
$$ -15626 63601 109720 126198 90833 98201 61228 58796 46142 81322 73602 36843 52462
12273E2462l0190k4273o3339J090K5529L9747j6947p0908L9385O2386j8641P919
$$ 52462 22272 -2001 -65340 -64250 -38721 1026 -15921 -86829 -47444 14942 -3699 4220
12261D220n636r241J0619K3056m07K345P5725k914n9293n2385R0137K01j0127
$$ 4220 -1416 -10657 -38 23018 22611 24956 100681 97767 38474 -13911 76226 76427 66300
12248F6300n5263j8735K9625J6427j7343o6952o7209J2729M3862O583L8962Q5588
$$ 66300 11037 -7698 21927 38354 21011 -45941 -113150 -100421 -56559 -49976 -11014 74574
12236G4574m0630l0886k579l8497k1560L442Q7701J3275l5618k5674p681l2025
$$ 74574 33944 3058 479 -38018 -59578 -56136 31565 44840 9222 -16452 -24133 -56158
12224e6158J637k4450J8754J000l2238n2519M5545O0663K2578j0034m2436J5724
$$ -56158 -54521 -78971 -60217 -59217 -91455 -143974 -98429 -37766 -15188 -25222 -67658 -51934
12212e1934n999n7598l1505j9792O0664L1693K8962J10510J6569k7181l8080m9981
$$ -51934 -57933 -115531 -147036 -166828 -106164 -74471 -45509 65001 81570 54389 16309 -33672
12200c3672j6624N6225J9713o854L780k5131j383l3214j0598J5922J8193m175
$$ -33672 -50296 5929 25642 18788 22568 -2563 -3946 -37160 -47758 -31836 -13643 -17818
12188a7818O7890L1840j10888j4104J7977k6631l7544j5604q519m5474L2601J8606
$$ -17818 50072 81912 -28976 -43080 -25103 -51734 -89278 -104882 -113401 -158875 -126274 -107668
12176a07668l1482O2937O9425J6391j0496j7780Q145L4691m972k7707K9056j5928
$$ -107668 -139150 -76213 -6788 9603 -893 -18673 -10528 24163 19191 -8516 20540 4612
12164D612m5199j2538J5438J1338k2617l9610M6687K1253Q112o1895n5208K0041
$$ 4612 -40587 -53125 -37687 -26349 -48966 -88576 -41889 -20636 -12524 -74419 -129627 -109586
12152a09586Q5234M6779r0275k8985M1357R503l5656j0649N5294R0683J7051n1731
$$ -109586 -24352 22427 -67848 -96833 -55476 -45973 -81629 -92278 -36984 53699 70750 19019
12140A9019j1854l0392k4241M5183M4554k5360q8754K0607M7150j7889l2213K1455
$$ 19019 7165 -23227 -47468 -2285 42269 16909 -71845 -51238 -4088 -21977 -54190 -32735
12128c2735M1890K3668p5644p7610N2283L7028q4538n048P0102M2922j1182k2103
$$ -32735 9155 32823 -42821 -120431 -68148 -31120 -115658 -120706 -50604 -7682 -18864 -40967
12116d0967K2980K6438J4632m0784P612l0169Q096M6769L2651L5711n0562o1346
$$ -40967 -17987 8451 23083 -17701 -10089 -40258 -32162 14607 47258 82969 32407 -28939
12104b8939K3781m7531q7520k3640K3203O7375L0005K9179O784l6137K6806j612
$$ -28939 -5158 -52689 -140209 -163849 -140646 -73271 -43266 -14087 -7303 -43440 -16634 -18246
12092a8246k5221J4393J0996Q122p061k9834M147j5411N1532K1240N907J7142
$$ -18246 -43467 -29074 -18078 -9956 -17017 -46851 -42704 -58115 -6583 14657 20564 37706
12080C7706l3619j7923r085j2653K4402K8344m7490K6771o4652k5114K1921K7733
$$ 37706 4087 -13836 -22921 -35574 -11172 17172 -30318 -3547 -68199 -93313 -71392 -43659
12068d3659k352k7845j7585M9194N7580Q892l1010K9548L0667r640J8774L9183
$$ -43659 -46011 -73856 -91441 -42247 15333 24225 -6785 22763 53430 43790 62564 101747
12056A01747n303k9087L9776m5468n6067n726L0038l7511k5911q661n4528O683
$$ 101747 96444 67357 107133 61665 5598 -128 29910 -7601 -33512 -42173 -96701 -90018
12044i0018L7071L0401j975o6053l4169N1301M5291j5555n9577Q5764J02762J2453
$$ -90018 -52947 -22546 -24521 -90574 -124743 -73442 -28151 -43706 -103283 -17519 85243 97696
12032I7696p7906m2941r588j9900Q251K9043L4597k0269Q2801N2697l0959o8123
$$ 97696 19790 -23151 -32739 -52639 -44388 -15345 19252 -1017 81784 134481 103522 35399
12020C5399l3425j5864J6298K9966J9409j4037m7307k6345O825J8245N8516N998
$$ 35399 1974 -13890 2408 32374 51783 37746 -9561 -35906 -29081 -10836 47680 53678
12008E3678L8244o2025n639K5584l8268n5955n0985r558j1947r722J9076j7740
$$ 53678 91922 29897 24258 49842 11574 -44381 -95366 -104924 -116871 -126593 -107517 -125257
11996a25257k5120M2665P3032O7370N0m304O960m2646p7704Q248M9108M2977j4954
$$ -125257 -150377 -107712 -34680 32690 32740 28436 35396 -7250 -84954 -76706 -27598 15379 425
11983D25l5175K9182M2723q30n6055j9259L2711n6681N2717L6252o0311l0960
$$ 425 -34750 -5568 37155 36325 -19730 -38989 -6278 -62959 -10242 26010 -34301 -65261
11971f5261p809K9949p331o1464M3990K4480n8013J1101M3309r395n5459K4861
$$ -65261 -73070 -43121 -50452 -111916 -67926 -43446 -101459 -90358 -47049 -56444 -111903 -87042
11959h7042O9138j1340Q410M4834k1698J3180P9525o3574o7796M7823N5761J0624
$$ -87042 -17904 -29244 -20834 24000 2302 15482 95007 31433 -36363 11460 67221 77845
11947G7845k0480K061R183n3892k1734L4426K8843l4019l4243j38J3382M5896
$$ 77845 57365 59426 68609 14717 -7017 27409 56252 22233 -12010 -12148 1234 47130
11935D7130L0292o4489n6137j4654J8200R518M653p736K9336j977n2622N6823
$$ 47130 77422 12933 -43204 -57858 -39658 -30140 -25487 -33223 -3887 -5864 -58486 -1663
11923a663R11k3754l8649J6207K5742k8524m7328Q872P7031Q1592J7096k040l6326
$$ -1663 -752 -24506 -63155 -46948 -21206 -49730 -97058 -88186 -11155 70437 87533 85493 49167
11910D9167l0010k1734o267L2959j5704K0460k6462n0799K7837M3605J8460k1519
$$ 49167 19157 -2577 -8844 24115 8411 28871 2409 -48390 -20553 23052 41512 19993
11898A9993m2109L5181K8779m246j00348j2607N0178M1155l1990j811j2025j2586
$$ 19993 -22116 13065 41844 37598 -62750 -75357 -25179 15976 -16014 -17825 -29850 -42436
11886d2436k0105j678N8814L7688k6157j9590L3240k5746q305P841j5136K23J1172
$$ -42436 -62541 -64219 -5405 32283 6126 -13464 19776 -5970 -14275 -6434 -21570 -21347 -10175
11873a0175L9856J2537m3873j4620N0373J8806O4402l3931p1448q1750K4169J3251
$$ -10175 29681 42218 -1655 -16275 34098 52904 117306 83375 11927 -69823 -45654 -32403
11861c2403P705J1947m4825j2183k6542Q259N5315Q300j8760l755n6224o7475
$$ -32403 -24698 -12751 -57576 -69759 -96301 -88042 -32727 -24427 -43187 -46942 -103166 -170641
11849a70641L9925L8248J5621j8593j8683P6830J3330o332J3859K6201l4879j9484
$$ -170641 -130716 -92468 -76847 -95440 -114123 -37293 -23963 -30295 -16436 9765 -25114 -44598
11837d4598M0251J7842l000L1197L9892j2471r6379k7253J4026N8350o730k8698
$$ -44598 -4347 13495 10495 41692 81584 69113 -27266 -54519 -40493 17857 11127 -17571
11825a7571m7695p029M7022M2684l4869n1935N162j1894j3207Q959N389J4101
$$ -17571 -65266 -72295 -25273 17411 -17458 -69393 -64231 -76125 -89332 -80373 -74984 -60883
11813f0883p730m0193l407J7558K6714O7425K0662L0892n5168m542j3227j2526
$$ -60883 -68613 -108806 -112213 -94655 -67941 -516 20146 51038 -4130 -8672 -21899 -34425
11801c4425n3228N1197P1560n459q3861q6758J3356J18606L0645L8602l9454l807
$$ -34425 -87653 -36456 35104 29645 -54216 -140974 -127618 -9012 21633 60235 20781 16974
11789A6974k0974j4357j1899m4321l3124K0607Q559o423J226M4316j789o901N9675
$$ 16974 -4000 -18357 -30256 -74577 -107701 -87094 -78535 -84958 -83732 -39416 -41205 -48106 11569
11776A1569L108k6464o727P979p136j6210J6790j1058m9624j8580j4645J3391
$$ 11569 14677 -11787 -18514 -10535 -17671 -33881 -17091 -28149 -77773 -96353 -110998 -97607
11764i7607N9610k3549J7098J1406M3559k6955M396M5709l6587n6298n6504K407
$$ -97607 -37997 -61546 -44448 -33042 10517 -16438 -12042 33667 -2920 -59218 -115722 -113315
11752a13315j9237n3M6425N3605J1372o4483p767O3270Q6432j1220m736q789Q3761
$$ -113315 -132552 -132605 -86180 -32575 -21203 -85686 -93453 -30183 56249 45029 40293 31504 115265
11739A15265L4303j9314o916p0651k1250K5856K2783m0174m3012l0112l7476l6768
$$ 115265 149568 130254 123338 52687 31437 57293 80076 39902 -3110 -33222 -70698 -107466
11727a07466L3032J5053r425N0441K1600p2636n8260m9223Q4552L2795j7288l2305
$$ -107466 -74434 -59381 -68806 -18365 3235 -69401 -127661 -176884 -92332 -59537 -76825 -109130
11715a09130Q841P4402R5113n7286o4598L180j7345l065M1061n3556J315O1465
$$ -109130 -100289 -25887 69226 11940 -52658 -49478 -66823 -69888 -28827 -82383 -81068 -19603
11703a9603M824K3637k7986L7355j4933k622j5933L8653o50k6760j9466j2889
$$ -19603 -14779 8858 -19128 18227 3294 672 -15261 23392 22742 -4018 -23484 -36373
11691c6373J4478m3779n9257M3345M8288J1923j8903J438l0825J2775M9544k8921
$$ -36373 -21895 -65674 -124931 -81586 -33298 -21375 -40278 -38840 -69665 -56890 -7346 -36267
11679c6267K94K6510j9646K8536L3387L6622K7912l9810o0910j7255L9010J1712
$$ -36267 -35973 -9463 -29109 -573 32814 69436 97348 57538 -3372 -20627 18383 30095
11667C0095l6490k6333L9967J2807m1155o360l0938p548M1932k8017n3793m0978
$$ 30095 -6395 -32728 7239 20046 -21109 -27469 -58407 -65955 -24023 -52040 -105833 -146811
11655a46811N320J0443K4517J8155j5152p420r086K3780j2203L3947K084l7112
$$ -146811 -141491 -131048 -106531 -88376 -103528 -110948 -120034 -96254 -108457 -74510 -72426 -109538
11643a09538M6042M0273j674J3995j3398j0441k84m8914k1195K2800o428O786
$$ -109538 -63496 -23223 -24897 -10902 -24300 -34741 -35025 -83939 -105134 -82334 -88762 -81976
11631h1976J4192L4063N5395p17l7776m4089k7515P443k798j3690M4130L188N0465
$$ -81976 -67784 -33721 21674 20957 -16819 -60908 -88423 -80980 -83778 -97468 -53338 -50150 315
11618C15K1295j1597k6019k918k3059j7877P7718M7394m956O217l3215k5439o714
$$ 315 21610 10013 -16006 -18924 -41983 -59860 17858 65252 60296 66513 33298 7859 1145
11605A145k6335j5137M7973k9211Q184J7326k5526j0861j6470l5612K533l4986
$$ 1145 -25190 -40327 7646 -21565 -13381 3945 -21581 -32442 -48912 -84524 -81991 -116977
11593a16977L021j9723L5843J22218J8595l3161k9910L3281O578l619P389k2993
$$ -116977 -113956 -133679 -97836 24382 42977 9816 -20094 13187 19765 16146 23535 542
11581E42q8290o3904P3194O4785j6422k9614k866K2626N6395J8752l4393k3118
$$ 542 -87748 -151652 -78458 -13673 -30095 -59709 -62575 -39949 16446 35198 805 -22313
11569b2313M4842j6948J6759m016j2919p934N889l9200m0479K9719N3315q603
$$ -22313 22529 5581 22340 18324 5405 -2529 3360 -35840 -76319 -46600 6715 -1888
11557a888k2255J3498q934n1466m3312K0816O2134k6250m251K7331j1759k5565
$$ -1888 -24143 -10645 -19579 -71045 -114357 -93541 -31407 -57657 -61908 -34577 -46336 -71901
11545g1901J6281K9320K5261j2032L9670N2857K976M570n3262M164j6488k7762
$$ -71901 -55620 -26300 -1039 -13071 26599 79456 82432 87002 33740 37904 21416 -6346
11533f346O742O558L1271K5552k1959o4349R262K4306R100L907k7499L2628K3080
$$ -6346 396 6954 38225 63777 41818 -22531 -13269 11037 20137 24044 -3455 29173 52253
11520E2253p0643k7898j773M0895L3762k3407j5093K9793N0333q237p492k9706
$$ 52253 -18390 -46288 -48061 -7166 26596 3189 -11904 17889 68222 59985 52493 22787
11508B2787l4836K3750J0978K5114K1249j1407O358m3620j05094O6634J976k4919
$$ 22787 -12049 11701 22679 47793 69042 57635 63993 20373 -84721 -18087 -16111 -41030
11496d1030P170l496N6036K3778O1076p5215o0087J8331J5621j8350M2291k3147
$$ -41030 -33860 -37356 18680 42458 103534 28319 -31768 -13437 2184 -16166 26125 2978
11484B978r0650l6303P4099M0873M899j1629p112M739J4740N6802J4341o5656
$$ 2978 -87672 -123975 -49876 -9003 -4104 -15733 -22845 -18106 -3366 53436 67777 2121
11472B121k6844j7786k135j5085K83o6658J5585O0733R2002J2315k2296m084l7493
$$ 2121 -24723 -42509 -44644 -59729 -59446 -126104 -110519 -49786 42216 54531 32235 28151 -9342
11459i342l7470N871L8154j736P434J3721K9336j4478k1492j02942n8699q782
$$ -9342 -46812 -40941 -2787 -4523 2911 16632 45968 31490 9998 -92944 -151643 -160425
11447a60425M7126L7548j2399N2813J6855L0811L137K9023l0730K0228m333r6987
$$ -160425 -113299 -75751 -88150 -35337 -18482 12329 15466 44489 13759 33987 29654 -67333
11435f7333q3952l3929O8186M0962k7341N542J2658R329k5582q4561Q618K3404
$$ -67333 -151285 -185214 -117028 -76066 -103407 -97865 -85207 -75878 -101460 -186021 -177403 -153999
11423a53999K1110Q3858j1836M7657K7967O7k0147M0553K5125j7868n6373K5234
$$ -153999 -132889 -49031 -60867 -13210 14757 14824 -5323 35230 60355 42487 -13886 11348
11411A1348R4471k602J4592k7409o1851m0270j5479m2827j2528n9258j0619l9877
$$ 11348 105819 103217 117809 90400 28549 -11721 -27200 -70027 -82555 -141813 -152432 -192309
11399a92309K8615L9164J2816N7836r440J349k6642n5205o428N257J3483M9159
$$ -192309 -163694 -124530 -111714 -53878 -63318 -61969 -88611 -143816 -150244 -144987 -131504 -82345
11387h2345K4240P848R936q529j8118j1761j1216K7866L4763j7283k9321n364
$$ -82345 -58105 -50257 -40321 -48850 -66968 -78729 -89945 -62079 -27316 -44599 -73920 -79284
11375g9284J7369N3353N501m3790L5337L0577J4826K484J3576m6620Q625M1898
$$ -79284 -61915 -8562 -3061 -46851 -11514 19063 33889 36373 49949 3329 11954 53852
11363E3852l0641k3614K6718j1583l1447n437L6215J6607j2264j0104j3911p187
$$ 53852 23211 -403 26315 14732 -16715 -22152 14063 30670 18406 8302 -5609 -12796
11351a2796k1812L286J2720J3209J0686N5262n8342j489j3433k935k5430l5711
$$ -12796 -34608 -31322 -18602 -5393 5293 60555 2213 724 -12709 -15644 -41074 -76785
11339g6785k1883J3708M9713N9913K7592m1845J9652L7727N676M171k7917j7837
$$ -76785 -98668 -84960 -35247 24666 52258 10413 30065 67792 73468 77639 49722 31885
11327C1885p0617n1007J9345L6438J4654p829j7956J4230J106k2106j4102J1227
$$ 31885 -38732 -89739 -70394 -33956 -19302 -27131 -45087 -30857 -29751 -51857 -65959 -54732
11315e4732K6540J979l3821K1509l648n6425k9306j1366Q4799L5172q5269n0522
$$ -54732 -28192 -26213 -60034 -38525 -42173 -98598 -127904 -139270 -54471 -19299 -104568 -155090
11303a55090Q856K5635P4690M9364k3494K4756j5593j0373J8403R227P079p703
$$ -155090 -146234 -120599 -45909 3455 -20039 4717 -10876 -21249 -2846 6381 13460 5757
11291E757K7256M800o419k1848n7328n5408L2073L136L9092Q4230J5764k1640
$$ 5757 33013 37813 31394 9546 -47782 -103190 -71117 -67981 -28889 55341 71105 49465
11279D9465J0135k5339m7184o5437k3093l611L1982J0762J1882Q461J8468j3789
$$ 49465 59600 34261 -12923 -78360 -101453 -105064 -73082 -62320 -50438 -41977 -23509 -37298
11267c7298l5897J3871K4043m6581J0307J4675L8733j170L1418l352L2587M5137
$$ -37298 -73195 -59324 -35281 -81862 -71555 -56880 -18147 -19317 12101 8749 41336 86473
11255H6473l2570J918k9203p426q37O222J5919M0125k2371r2890O71j5288k2159
$$ 86473 53903 55821 26618 19192 18355 24577 40496 80621 58250 -34640 -33969 -49257 -71416
11242g1416M861R2821K454L9820L6558j2351l5570q0426M3888L6916j7013p576
$$ -71416 -66555 26266 28720 68540 105098 92747 57177 -23249 20639 57555 40542 32966
11230C2966P774K7242M6352n233J9817m4450q2188j8567K0534M9848k8254n078
$$ 32966 40740 67982 114334 109101 128918 84468 2280 -16287 4247 54095 25841 20763
11218B0763k1784o5263M2722R2358n9313p5022p822N3688j8718j9556k638K0881
$$ 20763 -1021 -66284 -23562 68796 9483 -65539 -73361 -19673 -38391 -57947 -60585 -39704
11206c9704q696j015l240r383K5627k9997j9396K421k1321M1518K2196n823m177
$$ -39704 -48400 -49415 -52655 -62038 -36411 -66408 -85804 -83383 -104704 -63186 -40990 -46813 -50990
11193e0990J3978l7270K6982M5551m5701K2158M061K950K8576M5219J8682m1186
$$ -50990 -37012 -74282 -47300 -1749 -47450 -25292 -21231 -18281 10295 55514 74196 33010
11181C3010q3682J7119M1146Q888L1250J1l9886K7530k2420O158M2147r418K0752
$$ 33010 -50672 -33553 7593 16481 47731 47742 7856 35386 12966 19124 61271 51853 72605
11168G2605P549o2539K5303l7463n2183l1444j0535L5362R382j7702J2927N1625
$$ 72605 80154 17615 42918 5455 -46728 -78172 -88707 -53345 -43963 -61665 -48738 2887
11156B887O9863j0434j6317M5190k0910k7402m5384N292p999k9882L994J4598
$$ 2887 72750 62316 45999 91189 70279 42877 -2507 2785 -5214 -35096 -31102 -16504
11144a6504m6504J8715R313j1393m5335J11R360P9652M5660J5955n9644K282J3811
$$ -16504 -63008 -44293 -34980 -46373 -91708 -91597 -82237 -2585 43075 59030 -614 1668 15479
11131A5479P312R523P405j9222q492k271p6316k492j408M6536N0396j1548n108
$$ 15479 22791 32314 39719 20497 12005 9734 -66582 -69074 -70482 -23946 26450 14902 9794
11118I794J738N5659N6669j7388m0288m8508J4656j0487r9293M309M7311N0725
$$ 9794 11532 67191 123860 106472 66184 17676 32332 21845 -77448 -73139 -25828 24897
11106B4897k0606J7512K6530j3513m2388k8462p5666N616M8681L3480k5504K8493
$$ 24897 4291 21803 48333 34820 -7568 -36030 -111696 -106080 -57399 -23919 -49423 -20930
11094b0930Q1302p6895r3975m1131l0907K9532J15078R9859J8551j8257p2684
$$ -20930 60372 -16523 -110498 -151629 -182536 -153004 -37926 61933 80484 62227 -10457
11083a0457k1799M1838n0935J238M2940k3102k1791J9088L4018J1769J323j4570
$$ -10457 -32256 9582 -41353 -40115 2825 -20277 -42068 -22980 11038 22807 24130 9560
11071I560m847l0261K8k034j6813p331N0867Q2675K2385j7802j9610J0362J6551
$$ 9560 4713 -25548 -25520 -27554 -44367 -51698 -831 81844 104229 86427 66817 77179 93730
11058I3730m0310j6759n5888o2199M1598M5491o4470K4237P844k5237K9397J9209
$$ 93730 53420 36661 -19227 -81426 -39828 5663 -58807 -34570 -26726 -51963 -22566 -3357
11046c357q758m1575j0763l389Q052j6786k4781K759O166N0605N9959J1946j9071
$$ -3357 -12115 -53690 -64453 -67842 -59790 -76576 -101357 -98598 -92432 -41827 18132 30078 11007
11033A1007K6937k196k8120J386m7547p665l0143L4075Q051J3117R338L6697l0962
$$ 11007 37944 35748 7628 9014 -38533 -46198 -76341 -42266 -34215 -21098 -11760 24937 -6025
11020f025o2363j5043q116P046K6205P4814J9124j6118p6099J4318L8665k7313
$$ -6025 -68388 -83431 -91547 -84501 -58296 16518 35642 19524 -56575 -42257 -3592 -30905
11008c0905j8374P149N672q031j6685J2295L5605N9606L7094J0512K4505j3336
$$ -30905 -49279 -42130 -36458 -44489 -61174 -48879 -13274 46332 83426 93938 118443 105107
10996A05107j1491L4982L3606k8733q5900Q836l3157l2462j1498j0401K4975k2391
$$ 105107 93616 128598 162204 133471 47571 56407 23250 -9212 -20710 -31111 -6136 -28527
10984b8527r8982j6627J08760M2013m5477n3770M414P4471K0574m6238k3613j2558
$$ -28527 -127509 -144136 -35376 6637 -38840 -92610 -88196 -13725 6849 -39389 -63002 -75560
10972g5560P134K111N2519K7942n245n5250R037o793K1226k2820l0319K1304L6429
$$ -75560 -68426 -66315 -13796 14146 8901 -46349 -37312 -44105 -22879 -45699 -76018 -54714 -18285
10959a8285R7874K2400p8231m4515N2445O3365j5868k3195L5561J7827J5094k1280
$$ -18285 79589 101989 23758 -20757 31688 95053 79185 55990 91551 109378 124472 103192
10947A03192j02150j413j0325k0484k3899L2552J7587L437K0263K6921l0744J4647
$$ 103192 1042 -371 -10696 -31180 -55079 -22527 -4940 -1503 18760 45681 14937 29584
10935B9584J1111q119q123K403P0886P0139j4721q0591k5475L9742j8669p5381
$$ 29584 40695 32576 24453 26856 97742 167881 153160 72569 47094 86836 68167 -7214
10923g214J590N9637n6067o8425K7127L9984J5639K7121o849K5901j4601k4828
$$ -7214 -5624 54013 -2054 -70479 -43352 -3368 12271 39392 32543 58444 43843 19015
10911A9015J2660N8702p634m0659k5085K414j7115j7632n2387p6203J048M0049
$$ 19015 31675 90377 82743 42084 16999 19413 2298 -15334 -67721 -143924 -142876 -102827
10899a02827N9825L3241k0084M687N7999K7247n1880L3209K0485J6550L9584j8788
$$ -102827 -43002 -9761 -29845 -25158 32841 60088 8208 41417 61902 78452 118036 99248
10887I9248p1160p6174n4855O044N5649j2455m5975K5105M5037j5356j1687M8346
$$ 99248 28088 -48086 -102941 -96897 -41248 -53703 -99678 -74573 -29536 -44892 -56579 -8233
10875h233J674L0691J2756K4029j778l5658J4651m2534j3682J313l2304K5673
$$ -8233 -6559 24132 36888 60917 59139 23481 38132 -4402 -18084 -16771 -49075 -23402
10863b3402N8806J9369l4622M2530J7998j8670l4782k7180J5773L1999L386k9703
$$ -23402 35404 54773 20151 62681 80679 62009 27227 47 15820 47819 51205 21502
10851B1502o51O9961J5N2483O4869N2845K3206N8376J16901P3435J77126K80492
$$ 21502 20851 90812 90827 143310 208179 261024 284230 342606 459507 532942 710068 990560
10839I90560J98748R1349J18893J48653J06680r2188k26196j72801n1829j61467
$$ 990560 1189308 1280657 1399550 1548203 1654883 1562695 1336499 1163698 1111869 950402
10829I50402k75688k08970r7297n5417r1472l4431k97j9594l0752J7419K0984
$$ 950402 674714 465744 368447 313030 221558 187127 186830 167236 136484 153903 174887
10818A74887j863l561N083n8634j6112q6035r0974j1974J1809P999N8888L8942
$$ 174887 173024 169463 174546 115912 99800 13765 -77209 -89183 -77374 -69375 -10487 28455
10806B8455J0004M0080J8984o6360m4301q236K2136m7218m4598L0563Q4076L008
$$ 28455 38459 78539 97523 31163 -13138 -21374 762 -46456 -91054 -60491 23585 26593
10794B6593L1532R676l6762r959k4736P4943j2799p3816j5199J1918J0751L785
$$ 26593 58125 67801 31039 21080 -3656 71287 58488 -15328 -30527 -18609 -7858 -4073
10782d073O346q831N97j5835p0720L6663K3276J5181j2566J1510P0530l895Q04
$$ -4073 2273 -6558 -5961 -21796 -92516 -55853 -32577 -17396 -29962 -18452 52078 48183 48987
10769D8987l8837j261M7542J2330L9796P537q253O073J3145k1545o6669l2277
$$ 48987 10150 8889 56431 68761 108557 116094 107841 113914 127059 105514 38845 6568
10757F568N2818l9846m8384M1879J6798l8739m7312N192K0109J248k9662k7027
$$ 6568 59386 19540 -28844 13035 29833 -8906 -56218 -51026 -30917 -29669 -59331 -86358
10745h6358N0786L771q819K1911L0583K3024m3165k9461J6801j5292j2182O2976
$$ -86358 -35572 -31801 -40620 -18709 11874 34898 -8267 -37728 -20927 -36219 -48401 14575
10733A4575l0521m4142l7424q568K140Q707o04M6707O6187M4192j9206l4944k2119
$$ 14575 -15946 -60088 -97512 -106080 -103940 -95233 -95837 -49130 17057 61249 42043 7099 -15020
10720a5020m1768k1466k6595K6062L5629L2038L0909L5761j2404j1624L366K8467
$$ -15020 -56788 -78254 -104849 -78787 -43158 -11120 19789 55550 43146 31522 34888 63355
10708F3355j4534O303j8988j740M2809M620K8806P702k7287K4371j0230j6354
$$ 63355 48821 55124 36136 34396 77205 81825 110631 118333 91046 115417 105187 88833
10696H8833O0135J7815L5253L9848n0428l3957K7087N2274m5129J7123Q066k7668
$$ 88833 148968 166783 202036 241884 191456 157499 184586 236860 191731 208854 216920 189252
10684A89252l9346p075k5346j7769L4074K6042o552l8549m2770n0106m6987Q196
$$ 189252 149906 142831 117485 99716 133790 159832 153280 114731 71961 21855 -25132 -16936
10672a6936R5773L3826l3805O426n8745k2863L0188j3299j5357j0403j0178O997
$$ -16936 78837 112663 78858 85284 26539 3676 33864 20565 5208 -5195 -15373 -8376
10660h376J29k4225K7804J10632O5071j1611l2890n9282K4393P7265M3330j5738
$$ -8376 -8247 -32472 -4668 105964 171035 159424 126534 67252 91645 168910 212240 196502
10648A96502p5658j5272o0450j2561P686p54j4320N7522R580J9480J6727N426
$$ 196502 120844 105572 45122 32561 40247 39493 25173 82695 92275 111755 128482 133908
10636A33908Q906m5798p6882Q717L2429k9092o6522n5033K6934N5413L2278k4963
$$ 133908 142814 97016 20134 28851 61280 32188 -34334 -89367 -62433 -7020 25258 295
10624B95m0864l5043J286M8962N5657j7131n034J2574Q97R797o4390j0714L6014
$$ 295 -40569 -75612 -74326 -25364 30293 13162 8128 20702 21599 31396 -32994 -43708 -7694
10611g694j4594R931P1162k7973j8053R955N790J0805P432l3900N1062L4551O4434
$$ -7694 -22288 -12357 58805 30832 12779 22734 28524 39329 46761 12861 63923 98474 162908
10598A62908k5890p5695K906P634n3204M346N7196R0978m0465k3305o4590J0237
$$ 162908 137018 61323 64229 71863 18659 23005 80201 171179 130714 107409 42819 53056
10586E3056L25P341r631M6083J4254p9187l1940M095m4685j1748K3789K371P20
$$ 53056 53381 60722 51091 97174 111428 32241 301 4396 -40289 -52037 -28248 -25877 -25157
10573b5157J3529q803m3486K2985P8181J21494M7075m6792l053L3098l042J108
$$ -25157 -11628 -20431 -63917 -40932 37249 158743 205818 159026 155973 189071 186029 187137
10561A87137Q4620L4940J6015l1576l5164K7382K7483J0096L3458K8261M0189
$$ 187137 271757 306697 322712 291136 255972 283354 310837 320933 354391 382652 422841
10550D22841L8333K7752o0757n9741L2050K769k9141K3688j7097J4614P1429P2920
$$ 422841 461174 488926 428169 368428 400478 403247 374106 397794 380697 395311 466740 539660
10538E39660j6904l1679j152J2936k669M2718K3371k3194j6027M2525p125K2682
$$ 539660 522756 491077 489925 502861 500192 542910 566281 543087 527060 569585 562460 585142
10526E85142j742o9378n1232P9733O5855O9548O2946l825j24068j7964l990m6125
$$ 585142 583400 514022 462790 542523 608378 677926 740872 737047 612979 595015 591025 544900
10514E44900N6343O7952N4020k915j6705k1513m2747o1861l3300P1630N9994N8710
$$ 544900 601243 669195 723215 720300 703595 682082 639335 577474 544174 615804 675798 734508
10502G34508M7259L9198p642j1685k4314n6068K9909K1084M4558N4859N8668K5951
$$ 734508 781767 820965 813323 801638 777324 721256 751165 772249 816807 871666 930334 956285
10490I56285Q3112L8020l1032k0513P1789L7238L2791K4748Q4427J19056R9278
$$ 956285 1039397 1077417 1046385 1025872 1097661 1134899 1167690 1192438 1276865 1395921 1495199
10479A495199R1975J2880J586J27360P0689O9352O9019R2844J21025J03325J55585
$$ 1495199 1587174 1600054 1601640 1729000 1799689 1869041 1938060 2030904 2151929 2255254 2410839
10468B410839J54924K42447K67319L07927K12451K93472L56084L73459M27278
$$ 2410839 2565763 2808210 3075529 3383456 3595907 3889379 4245463 4618922 5046200
10459E046200M75315O14480P47370P21272P13334R40608J163728J261608J340065
$$ 5046200 5521515 6135995 6883365 7604637 8317971 9258579 10422307 11683915 13023980
10450A3023980J517299K022670K488313L005235L775969M546463N611774P487975
$$ 13023980 14541279 16563949 19052262 22057497 25833466 30379929 35991703 43479678
10442D3479678J0487781J4725749K1161395L0163201M1153059M3782871K8748462
$$ 43479678 53967459 68693208 89854603 120017804 161170863 204953734 233702196
10435B33702196J3798613K4948032L7754326J3188229l1823657m5539773k3221887
$$ 233702196 247500809 272448841 310203167 323391396 291567739 246027966 222806079
10428B22806079j5574741l2919251m6216746l5101375k0775195j2696912q473492
$$ 222806079 207231338 174312087 128095341 92993966 72218771 59521859 51048367
10421E1048367o050357m635463l683751l196030k995769k587023k342989k312372
$$ 51048367 44998010 40362547 36678796 33482766 30486997 27899974 25556985 23244613
10413B3244613k146229j836793j645083j627708j531834j317468j163089j112900
$$ 23244613 21098384 19261591 17616508 15988800 14456966 13139498 11976409 10863509
10405A0863509j086985r73851p62203n50432m85260n05631m95596l75053k91032
$$ 10863509 9776524 8802673 8040470 7490038 7004778 6499147 6003551 5628498 5337466
10396E337466l40594l36304k68913k44329k03848j87256k14442j85340j23508
$$ 5337466 4996872 4660568 4391655 4147326 3943478 3756222 3541780 3356440 3232932
10387C232932j37030k62065k32755j51987j44554j38552j63387j54535j33933
$$ 3232932 3095902 2833837 2601082 2449095 2304541 2165989 2002602 1848067 1714134
10378A714134n6222J3893n0246q9267k2238k9610r4326o9830p8437p6276o7153
$$ 1714134 1657912 1671805 1621559 1532292 1510054 1480444 1386118 1316288 1237851 1161575 1094422
10367A094422q9145o1665l6583o4442l884j0689k6115l3483k9985k5197O7135
$$ 1094422 1005277 943612 907029 842587 838703 828014 801899 768416 738431 713234 780369
10356G80369l8721p76J1946o1910m0792k057m2698K2544m9378r6399p3852L7103
$$ 780369 741648 740872 752818 690908 650116 648059 605361 627905 578527 482128 408276 445379
10344D45379J7922j1175J9654o963K3432m1846j8714o118n7316o8547M6159q701
$$ 445379 463301 452126 471780 464817 488249 446403 427689 421571 364255 295708 341867 333166
10332C33166N4341k0545Q907l178k9002o3808J1313R6433J0186O2196L8333k9903
$$ 333166 387507 366962 375869 372691 343689 279881 291194 387627 397813 460009 498342 468439
10320D68439k8726j9976J7157p9939n7439J354l158K0293j9591l1142l3691l0388
$$ 468439 439713 419737 436894 356955 299516 300870 297712 318005 298414 267272 233581 203193
10308B03193K6367O1683L7559J4198L4275R224o333J02035O9338k89M211j1810
$$ 203193 229560 291243 328802 343000 377275 386499 380166 482201 551539 551250 555461 543651
10296E43651k9004L8678P8144K7870k7849k5652j20206m9761P6413N5967k4760
$$ 543651 514647 553325 631469 659339 631490 605838 485632 435871 512284 568251 543491
10285E43491L3702k3961l0661M5280K3090l2937l8699L8823J34512J65808J58647
$$ 543491 577193 553232 522571 567851 590941 558004 519305 558128 692640 858448 1017095
10274A017095J99456J00509m4370r9785m6621j6804l2811q6669j74482j90938
$$ 1017095 1216551 1317060 1272690 1172905 1126284 1109480 1076669 990000 815518 624580
10264F24580p2999O222l0986n1663j7936l6830o7242n9J2771j6608k5289J882
$$ 624580 551581 557803 526817 475154 457218 420388 353146 353087 365858 349250 323961 325843
10252C25843l5742m4586L6795O4939J5726l0335K443l7308q275K7409K901o1597
$$ 325843 290101 245515 282310 347249 362975 332640 335083 297775 289500 316909 319810 258213
10240B58213l1447l5271l0078P05j0613J6788k838k0567K7693M4958l9130m9315
$$ 258213 226766 191495 161417 162122 151509 168297 165459 144892 172585 217543 178413 129098
10228A29098L2117j2865m8867l5309J4551N7788k6824j8930Q614j1249m6793k5981
$$ 129098 161215 148350 99483 64174 78725 136513 109689 90759 99373 88124 41331 15350
10216A5350j8294o3197K9196K2341O7189r350m9203N6107L7955O827k6737l2829
$$ 15350 -2944 -66141 -36945 -14604 52585 43235 -5968 50139 88094 94921 68184 35355
10204C5355K1427k7924n873p838K9147P8764j8352l5376j4334Q5847P1836J4947
$$ 35355 56782 28858 22985 15147 44294 123058 104706 69330 54996 140843 212679 227626
10192B27626k7408k4572j0205p7429m3980l889L3540J0316K9408K7433k9383j1867
$$ 227626 200218 175646 165441 88012 44032 40143 73683 83999 113407 140840 111457 99590
10180I9590k327K9189L1983j02694n1927K3776L7216K5424K7827L5975j7222r9268
$$ 99590 97263 126452 158435 55741 3814 27590 64806 90230 118057 154032 136810 37542
10168C7542M2355M5447m587k6690l8818l9426m752O0651J0069L2510O1090Q071
$$ 37542 79897 125344 120757 94067 55249 15823 11071 71722 81791 114301 175391 183462
10156A83462J7287l4935k6667K7224k641k0784q5410p8725j8991R9952P3433l1931
$$ 183462 200749 165814 139147 166371 163730 142946 57536 -21189 -40180 59772 133205 101274
10144A01274q622l7648j5779l388l0433N1239M0111m06K4047k2163o834l2790
$$ 101274 92652 55004 39225 35837 5404 56643 96754 96348 120395 98232 91398 58608
10132E8608l8598j0399K8928K9770J6726L3687J1463J4652n2844j239M571j6822
$$ 58608 20010 9611 38539 68309 85035 118722 130185 144837 91993 90754 95325 78503
10120G8503R493J7225l8479l5016q4690K1304K8171L286J5917j2360p569L1046
$$ 78503 87996 105221 66742 31726 -52964 -31660 -3489 -203 15714 3354 -4215 26831
10108B6831O891L2228m392o0333l8983J1782P1776J9968J3859m1349P871k3882
$$ 26831 33722 65950 61558 1225 -37758 -25976 45800 65768 79627 38278 46149 22267
10096B2267k9369L281O4558N4948N1491j2048L321o3903k3704J6951j4168P701
$$ 22267 -7102 -3821 60737 115685 167176 155128 158449 94546 70842 87793 73625 81326
10084H1326O4010j3007n3179j6442R971k742r082o6567n5110j1394J6128L6136
$$ 81326 145336 132329 79150 62708 72679 69937 60855 -5712 -60822 -72216 -56088 -19952
10072a9952J8588L8585m1676L4123k0742o3310O5385L1579J1868J4201m3592m6067
$$ -19952 -1364 37221 -4455 29668 8926 -54384 11001 42580 54448 68649 25057 -21010
10060b1010L2939K3724M3442J6787j3705o0829K3310N2500J7064L3251m5966l2665
$$ -21010 11929 35653 79095 95882 82177 21348 44658 97158 114222 147473 101507 68842
10048F8842J5362J2972l146m2120N124j0357o3479N0791O2874J02381n2572k9412
$$ 68842 84204 97176 94030 51910 57034 46677 -16802 33989 96863 199244 146672 117260
10036A17260O7502J03120O7671J23651P4167J15108J97624K50635J96263Q9940
$$ 117260 184762 287882 355553 479204 553371 668479 866103 1116738 1313001 1402941
10026A402941J40367J45033J25892j64144k53823j07567r9213k11101k35428k23564
$$ 1402941 1543308 1688341 1814233 1650089 1396266 1288699 1189486 978385 742957 519393
10016E19393j12392o5124o0033m5682l4176L1369N089J2473p256l0096L8184Q001
$$ 519393 407001 341877 281844 236162 201986 233355 238444 250917 243661 213565 251749 259750
10004B59750k5047m9493p3756p4260K2871M2475l5866o6150j6499K4150O1358
$$ 259750 234703 185210 111454 37194 60065 102540 66674 524 -15975 8175 69533
9993F9533K5541m1727p1269J1335J0152k0932Q7201M107k4150j4989j3018M9281
$$ 69533 95074 53347 -17922 -6587 3565 -17367 69834 73941 49791 34802 21784 71065
9981G1065K293J755k6731n8738r978k8816N2287K1807J5722J3883l5904J9060
$$ 71065 73358 75113 48382 -10356 -20334 -49150 3137 24944 40666 54549 18645 37705
9969C7705K6622q4338k0422L6909k5152j2515R804q942L8085P6049l8205o7860
$$ 37705 64327 -20011 -40433 -3524 -28676 -41191 -31387 -40329 -2244 73805 35600 -32260
9957c2260P990j3681r148k7763P01n858L7018J182k1058J1492N885N2480O389
$$ -32260 -24270 -37951 -47099 -74862 -74161 -80019 -43001 -41819 -62877 -51385 -45500 6980 13369
9944A3369k4257l8829n5594L1363l7398M1786k8931k557O3748R801M617M4038
$$ 13369 -10888 -49717 -105311 -73948 -111346 -69560 -98491 -101048 -37300 -27499 -22882 21156
9932B1156K968r799j2737O510m9854Q266L6944l279k0727L7136l3685q678j3721
$$ 21156 24124 14325 1588 8098 -41756 -33490 3454 175 -20552 16584 -17101 -25779 -39500
9919c9500k9947m6264N7862J11953L6834l2510r2334j4710P596M0650Q4811j829
$$ -39500 -69447 -115711 -57849 54104 90938 58428 -33906 -48616 -41020 -370 84441 82612
9907H2612j7603k4008j2017K2383K707n9059l8442m1241J2317J1554k2535J3611
$$ 82612 65009 41001 28984 51367 54074 -4985 -43427 -84668 -72351 -60797 -83332 -69721
9895f9721Q3819P6301m0100O237L2603R712j9302K5013p889j1575k9438J4229
$$ -69721 14098 90399 50299 56536 89139 98851 79549 104562 96673 85098 55660 69889
9883F9889L2938m4606q5224j4015K9052J7886J3477m352q15N5162J8036K050n5676
$$ 69889 102827 58221 -27003 -41018 -11966 5920 19397 15045 14230 69392 87428 89478 33802
9870C3802m9664j0874K6854L8967j9778l9405m6412L8488M6011R913N8493k0563
$$ 33802 -15862 -26736 118 39085 19307 -20098 -66510 -28022 17989 27902 86395 65832
9858F5832J1571K842K6843M5901M8005Q910J8585n7500p6741m7550o590k3835
$$ 65832 77403 80245 107088 152989 200994 209904 228489 170989 94248 46698 40108 16273
9846A6273M6857K7180n7934m2695M9267J391k2004l7975l2377J5368L7389K6705
$$ 16273 63130 90310 32376 -10319 38948 40339 18335 -19640 -52017 -36649 740 27445
9834B7445J9859J1211l1451m995M5011J3156n1377m2801n848K4722K6730m5512
$$ 27445 47304 58515 27064 22069 67080 80236 28859 -13942 -19790 4932 31662 -13850
9822a3850P861j9489m7966K072L9577J0228l722N447m3975K981k7737j1188N9609
$$ -13850 -5989 -25478 -73444 -71372 -31795 -21567 -25289 -19842 -63817 -60836 -88573 -99761 -40152
9809d0152j3467J0369K4904K6915o3688k5737j3351k8361M1373o4951l5181O7962
$$ -40152 -53619 -43250 -18346 8569 -55119 -80856 -94207 -122568 -81195 -146146 -181327 -113365
9797a13365M0628n0694j7939Q4991J3415K3223J4149N9605O1234K6407j6265m1181
$$ -113365 -72737 -123431 -141370 -56379 -42964 -19741 -5592 54013 115247 141654 125389 84208
9785H4208k4338k9370k5842J0836J5524M0702q117l8054j4877m2068j4305J1540
$$ 84208 59870 30500 4658 15494 31018 71720 63603 25549 10672 -31396 -45701 -34161
9773c4161M4961M3711k2550p1851l1384K4521K6927j7668o6131O7784j3521m3670
$$ -34161 10800 54511 31961 -39890 -71274 -46753 -19826 -37494 -103625 -35841 -49362 -93032
9761i3032L7811L3031M5241J6305p855k0929p7005n2762l2739K1007N4360L3008
$$ -93032 -55221 -22190 23051 39356 31501 10572 -66433 -119195 -151934 -130927 -76567 -43559
9749d3559L0903J6798j7717j3604l372L7346J4309l2217l3873j2904L7856J8599
$$ -43559 -12656 4142 -13575 -27179 -30551 6795 21104 -11113 -44986 -57890 -20034 -1435
9737a435k709O1552j346m1171k0710j2063J2075J3453K9403p427l6510j8172j3546
$$ -1435 -4144 57408 56062 14891 -5819 -17882 -5807 7646 37049 29622 -6888 -25060 -38606
9724c8606N8175K8872o7667m6004m6067M176N8283N1041L3925k3222m8736K7499
$$ -38606 19569 48441 -19226 -65230 -111297 -107121 -48838 2203 36128 12906 -35830 -8331
9712h331N2753j2072j3007r852k9l6515m2327K6699R617P440K1995k0687J4335
$$ -8331 44422 32350 19343 9491 9462 -27053 -69380 -42681 -33064 -25624 -3629 -24316 -9981
9699i981J7708J8994L8598j7228j1150j672K2700n2293o0037M3988n025k8049
$$ -9981 7727 26721 65319 48091 36941 35269 57969 5676 -54361 -10373 -15398 -43447
9687d3447J5434J8695j6744L774K3288n7156l2927Q074m666k518O0607M5049J8856
$$ -43447 -28013 -9318 -26062 -22288 1000 -56156 -89083 -81009 -85675 -88193 -27586 17463 36319
9674C6319j1093l343R437K6122N3771p3010n4821k2639Q6987J2054m9062n5316
$$ 36319 25226 21883 31320 57442 111213 38203 -16618 -39257 47730 59784 10722 -44594
9662d4594j4259J7061M8854M3698Q140k9300k3605J8353L7971J7751Q243m3611
$$ -44594 -58853 -41792 7062 50760 58900 29600 5995 24348 62319 80070 88313 44702
9650D4702K6783M861j7955l2845p5526l4627P264l683N55m2142j5943M7596M2775
$$ 44702 71485 76346 58391 25546 -49980 -84607 -77343 -81026 -80471 -122613 -138556 -90960 -48185
9637d8185L7887P6172J4780K2924j2378k4917K8485j3258K5685l3873q2031k8678
$$ -48185 -10298 65874 80654 103578 91200 66283 94768 81510 107195 73322 -8709 -37387
9625c7387j8404M360l8582k3138M2086l593J727J6356J3090j0123n1963k656J3799
$$ -37387 -55791 -51431 -90013 -113151 -71065 -74658 -72931 -56575 -43485 -53608 -105571 -108227 -94428
9612i4428Q0287O2888J1450j2490m7345P52m299R559J3214k4323k0968k61j2228
$$ -94428 -14141 48747 60197 47707 362 1114 -3185 6374 19588 -4735 -25703 -25964 -38192
9599c8192o248K4081N6576k5276o1370J66n0477R963O9330N4971l7630l0100M0285
$$ -38192 -44440 -20359 36217 10941 -50429 -50263 -100740 -90777 -21447 33524 -4106 -34206 6079
9586F079M3191J6257j889m0097j00704l6733J06579L919q0481J228K7054L8271
$$ 6079 49270 65527 63638 23541 -77163 -113896 -7317 -3398 -83879 -82651 -55597 -17326
9574a7326m8622j0519K0167l2489J1488P9242M9024n1044j235J2712N3614K0695
$$ -17326 -65948 -76467 -56300 -88789 -77301 1941 50965 -79 -1314 11398 65012 85707
9562H5707j8069K3725K1893m685o3612R080j3463m7802K8963J9384o984J3098
$$ 85707 67638 91363 113256 108571 44959 54039 40576 -7226 21737 41121 34137 47235
9550D7235N4665l9135m0961m1230k3711Q747j5552J833N5548N8676m660K3048
$$ 47235 101900 62765 21804 -19426 -43137 -34390 -49942 -48109 7439 66115 61455 84503
9538H4503l7436j00103k5545J648k1023Q0320q246k0189j0500r534P595N7381
$$ 84503 47067 -53036 -78581 -76933 -97956 -17636 -25882 -46071 -56571 -66105 -58510 -1129
9526a129J0079k7666l0775Q875J3235M4641k6016q1616j5269K7437r706j5796
$$ -1129 8950 -18716 -49491 -40616 -27381 17260 -8756 -90372 -105641 -78204 -87910 -103706
9514a03706L9020O5869J2142K3078j8661j4124K1954q782k3455j0264L0628n877
$$ -103706 -64686 1183 13325 36403 17742 3618 25572 16790 -6665 -16929 13699 7822
9502G822n6338K5145J4555O1819M206k0147P750j3279j1428j8888K3520J0854
$$ 7822 -48516 -23371 -8816 53003 57209 37062 44812 31533 20105 1217 24737 35591
9490C5591N0914r510n0026r545k2636r9022k4749L4548M8028j9301M461O0945
$$ 35591 86505 76995 26969 17424 -5212 -104234 -128983 -94435 -46407 -65708 -61247 -302
9478c02L4166L6584m5790j26970o17L4797O3169J8226M2213J7936m8692J8483
$$ -302 33864 70448 24658 -102312 -102929 -68132 -4963 13263 55476 73412 24720 43203
9466D3203J6253n1253J6318K4708n5817k5225O7382L1592j2541Q659l9967j2571
$$ 43203 59456 8203 24521 49229 -6588 -31813 35569 67161 54620 63279 23312 10741
9454A0741r311K96L846l5992M9312L9875J157j6738N548O547j5230j8585K415
$$ 10741 1430 1726 5572 -30420 18892 58767 59924 43186 48734 55281 40051 21466 23881
9441B3881m4172r883L1179J9148M841K2190J1467n8188o2596L8736Q8639L1341
$$ 23881 -20291 -30174 1005 20153 24994 47184 58651 463 -62133 -23397 65242 96583
9429I6583j0337m3429J076n948j0221m1400l0972K2863O5641K0307J0628n2923
$$ 96583 86246 42817 43893 37945 27724 -13676 -44648 -21785 43856 64163 74791 21868
9417B1868k6880L2736P2021K6097p3456q1372K8247K5376j1336J2765m8794l6592
$$ 21868 -5012 27724 99745 125842 52386 -28986 -739 24637 13301 26066 -22728 -59320
9405e9320J7975J883j6184O094J7162L169j6888Q793O7468O530m7265q172K0788
$$ -59320 -41345 -39462 -55646 -49552 -32390 -29221 -46109 -37316 30152 36682 -10583 -18755 2033
9392B033K7072k5217k3889o3861l0599L0292j8292M2493M8309M1415N2235p1930
$$ 2033 29105 3888 -20001 -83862 -114461 -84169 -102461 -59968 -11659 29756 81991 10061
9380A0061m3899P957j0084l2088l2596M0267L3939K0616P1823Q033k5069k3217
$$ 10061 -33838 -25881 -35965 -68053 -100649 -60382 -26443 -5827 65996 74029 48960 25743
9368B5743J6323P037j1590M634o7782M244j1862o9828j4209J2600Q584J5642J3895
$$ 25743 42066 49103 37513 42147 -25635 -21391 -33253 -103081 -117290 -104690 -96106 -80464 -66569
9355f6569J0674J4495M6851o7913J5962K6140n1127m9543J1672N4540N1572J7080
$$ -66569 -55895 -41400 5451 -62462 -46500 -20360 -71487 -121030 -109358 -54818 -3246 13834
9343A3834Q931O4964L2928m7691j02522n6279L9868K8829K7565J2027L4254R874
$$ 13834 22765 87729 120657 72966 -29556 -85835 -45967 -17138 10427 22454 56708 66582
9331F6582R420M3564p6220n4048J6920K0369l846J939m4405k3769J682k127K8445
$$ 66582 76002 119566 43346 -10702 6218 26587 22741 24680 -19725 -43494 -41812 -43939 -15494
9318a5494j0976K1056M2259R380J476k3197m568l154l2202l472l8963k0493N3927
$$ -15494 -26470 -5414 36845 46225 47701 24504 19936 16782 -15420 -18892 -57855 -78348 -24421
9305b4421L4784J9818j3297l9293J8206j2569L2641L5678p778m9573L0983o314
$$ -24421 10363 30181 16884 -22409 -4203 -16772 15869 51547 43769 -5804 25179 18865
9293A8865M5006M0446o83m9003k3957Q076Q387q850k8938k0770l928n2389L7903
$$ 18865 63871 104317 103634 54631 30674 38750 47137 38287 9349 -11421 -15349 -67738 -29835
9280b9835N2766p8006l0838L8151O9201N1567k970K9521n935o3881l2492L8479
$$ -29835 22931 -55075 -85913 -47762 21439 73006 70036 99557 93622 29741 -2751 35728
9268C5728m675j6623K0554N5683O8970P1123k3821o6944j579L9038K2173K4588
$$ 35728 31053 14430 34984 90667 159637 230760 206939 139995 138416 177454 199627 224215
9256B24215O6476J35320J13159Q1928P0749J0412r4911j61551j40984q4444k1263
$$ 224215 290691 426011 539170 621098 691847 702259 607348 445797 304813 220369 199106
9245A99106n334L5640m6800M480K0268n4818q9125l955N0157N8353j250j6783
$$ 199106 193772 229412 182612 187092 207360 152542 63417 59462 109619 167972 166722 149939
9233A49939m2605m800n60O1139j8935j8108j2326J7003k1298M0795L3793p300
$$ 149939 107334 102534 101974 163113 144178 126070 113744 130747 109449 150244 184037 176737
9221A76737K5087n611K6127K7253P486j0114N7901M4213K6135N0677R6528J22034
$$ 176737 201824 196213 222340 249593 257079 246965 304866 349079 375214 425891 522419 644453
9209F44453K38505L46956K74198O5212k51834l30891k34620j98276j16212o8671
$$ 644453 882958 1229914 1504112 1569324 1317490 986599 751979 553703 437491 368820
9199C68820k7830L2845J364q335k4888K1539L1393K7909p377j5447J7244N2789
$$ 368820 340990 373835 375199 366864 341976 363515 394908 422817 415440 399993 417237 470026
9187D70026J07556R424l1553n5612L7435M1457J5166O8647M3467M6915L9803R5801
$$ 470026 577582 587006 555453 499841 537276 578733 593899 662546 706013 752928 792731 888532
9175H88532O1762R8495J26609R7284J52919K21783K70302K71152K77615L66911
$$ 888532 950294 1048789 1175398 1272682 1425601 1647384 1917686 2188838 2466453 2833364
9165B833364M25241N38357O92841Q62892R13414R49287J106761J353732J530933
$$ 2833364 3258605 3796962 4489803 5352695 6266109 7215396 8322157 9675889 11206822
9156A1206822J448518J166467O36783k48550j052738j459868j577717j530111
$$ 11206822 12655340 13821807 14458590 14210040 13157302 11697434 10119717 8589606
9148H589606j289806j064699r23781o36261m91479m89584l81511l21100k84102
$$ 8589606 7299800 6235101 5311320 4675059 4183580 3693996 3312485 2991385 2707283
9139B707283k67265k45515k04119j61099j14153j79587j17072m9433j25999j24010
$$ 2707283 2440018 2194503 1990384 1829285 1715132 1535545 1418473 1369040 1243041 1119031
9129A119031r0306o9251o4923k0835j10928j42625l0246N0349J2964l4403p6130
$$ 1119031 1028725 959474 894551 873716 762788 620163 589917 640266 653230 618827 542697
9118E42697k5694k8303l5455p3095j3854M2158N4545Q168j5414l9350m5178m4022
$$ 542697 517003 488700 453245 380150 366296 408454 462999 471167 455753 416403 371225 327203
9106C27203L9780l4108l1858k3571p525M2523N8424m99k1059k0498m3197r337
$$ 327203 366983 332875 301017 277446 269921 312444 370868 370369 349310 328812 285615 276278
9094B76278p4585l7623L568K0976j7497j7880l0955J9867l592m2127l5621k5557
$$ 276278 201693 164070 167638 188614 171117 153237 122282 142149 138557 96430 60809 35252
9082C5252R1887m212J0680M1877o873j7854q56P011m5288k5283M6376K1501j5992
$$ 35252 127139 122927 133607 175484 168611 150757 149901 156912 111624 86341 132717 154218 138226
9069A38226m7113j3891L030o970j9259n215L2099J15424M2908k6451n4144j6689
$$ 138226 91113 77222 80252 73282 54023 48808 80907 196331 239239 212788 158644 141955
9057A41955K7545L0066J5414k8337n4531n5678o5290J2094k2339m008M777j386
$$ 141955 169500 199566 214980 186643 132112 76434 11144 23238 899 -3109 1668 282
9045B82J6176k0878k6740P952K5532P916M478J6440J1274M5674J2022l9732m7528
$$ 282 16458 -4420 -31160 -23208 2324 10240 14718 31158 42432 88106 100128 60396 12868
9032A2868M4455J0737K6903p063r792k4330l5031N5763K6721J3255n879J0186
$$ 12868 57323 68060 94963 87900 78108 53778 18747 74510 101231 114486 108607 118793
9020A18793k6855K1908R104L2257m1263k7405K110K6913M7494Q255j2726q860
$$ 118793 91938 113846 122950 155207 113944 86539 88649 115562 163056 171311 158585 149725
9008A49725m4891o3879K2944M8030J5178j013o8950j5715K2548P898l8978l1731
$$ 149725 104834 40955 63899 111929 127107 126094 57144 41429 63977 71875 32897 1166
8996A166n34p376J3997J5557l2028l9394N9080J03195m2262o4526j9568L2401
$$ 1166 632 -6744 7253 22810 -9218 -48612 10468 113663 71401 6875 -12693 19708
8984A9708N1723N2917k1817M0704j9253r0159J4773K3897M8146Q4528L8324k1230
$$ 19708 71431 124348 102531 143235 123982 33823 48596 72493 120639 205167 243491 222261
8972B22261j932n4135k4204M48m989M6686L4892n7149r598k7061q339j788M4157
$$ 222261 220329 166194 141990 142438 137449 184135 219027 161878 152280 125219 116880 115092 159249
8959A59249K0431m3875l738M2246O8136J5731R275K493J7321N0924r3134j03024
$$ 159249 179680 135805 132067 174313 242449 258180 267455 269948 287269 338193 245059 142035
8947A42035n0363J595N0396K0498J2114J6307l614K6118L4783J4267k3431R959
$$ 142035 91672 93267 143663 164161 176275 192582 188968 215086 249869 264136 240705 250664
8935B50664L8923K5269K4436j3218m1908P4912J25132L9033n673K475l4091j05046
$$ 250664 289587 314856 339292 326074 284166 359078 484210 523243 517570 520045 485954 380908
8923C80908k5264L6650L3742K7321L9857K7177o8511m7605k4193K5964J1145M5763
$$ 380908 355644 392294 426036 453357 493214 520391 451880 404275 380082 406046 417191 462954
8911D62954Q0507N3625j7285m1710K0044M5912J2789J336j9665R627m8315J5823
$$ 462954 543461 597086 579801 538091 558135 604047 616836 618172 598507 608134 559819 575642
8899E75642L8240O3953O1111n2723n1332N6156J25498P3799R6356J2521q31K2884
$$ 575642 613882 677835 738946 686223 634891 691047 816545 890344 986700 999221 998390 1021274
8887A021274K5273J1505J08967R3770Q2905J26022J52403Q9787L20L8792J19570
$$ 1021274 1046547 1058052 1167019 1260789 1343694 1469716 1622119 1711906 1712226 1751018 1870588
8876A870588Q3909K15661K02308J36252K12084K79483L94263N21057N99913P59766
$$ 1870588 1954497 2170158 2372466 2508718 2720802 3000285 3394548 3915605 4515518 5275284
8866E275284R68563J052163J043801J314014J799480K234279K704890L315745
$$ 5275284 6243847 7296010 8339811 9653825 11453305 13687584 16392474 19708219
8858A9708219M668931P043506J0964056J6689583K3486581K7312584J6536224
$$ 19708219 24377150 31420656 42384712 59074295 82560876 109873460 126409684
8851A26409684r897687l0426638k7854882j7326063j0167117o286338m141613
$$ 126409684 116511997 86085359 58230477 40904414 30737297 24450959 20309346
8844B0309346k821403j906437j268065r53450p48796o55215o58933o04563o09114
$$ 20309346 17487943 15581506 14313441 13359991 12611195 11955980 11297047 10692484 10083370
8835A0083370n93736n67793n55540l66977k09159j04907R097O4030J75975L06177
$$ 10083370 9489634 8921841 8366301 7999324 7790165 7685258 7694355 7758385 7934360 8240537
8825H240537M87567O95832R20816J245582J612014J780286J886737K197773L096320
$$ 8240537 8728104 9423936 10344752 11590334 13202348 14982634 16869371 19067144 22163464
8816B2163464M158769N050882O125221Q358958J2730516K0212574L1453264M5893373
$$ 22163464 26322233 31373115 37498336 45857294 58587810 78800384 110253648 156147021
8808A56147021N8356791M1823841j3931008o4293262o0419052l6885177k1301358
$$ 156147021 214503812 256327653 242396645 178103383 117684331 80799154 59497796
8801E9497796j2998966q487888n717486l934536k696913j868246j514463j441637
$$ 59497796 46498830 38010942 32293456 28358920 25662007 23793761 22279298 20837661
8793B0837661j497457j534115j508330j536525j370326j068747j036865q68287
$$ 20837661 19340204 17806089 16297759 14761234 13390908 12322161 11285296 10417009
8785A0417009o63579n38454l26843l16367k93897j52132L0350K68027L94115O42200
$$ 10417009 9753430 9214976 8888133 8571766 8277869 8125737 8156087 8424114 8818229 9460429
8775I460429P34927P96439J011148J377918J873709K373634K865813L867917N811538
$$ 9460429 10195356 10991795 12002943 13380861 15254570 17628204 20494017 24361934 30173472
8766C0173472R088816J3985145K0199685K5649820K0901023j193288k5703446
$$ 30173472 39262288 53247433 73447118 99096938 119997961 118804673 93101227
8759I3101227k9997289k0015607j1650202p038873m561338l149938k201569j530205
$$ 93101227 63103938 43088331 31438129 24399256 19837918 16687980 14486411 12956206
8751A2956206j042555q43171p70759p49602p29134p54230p89082p30880o44138
$$ 12956206 11913651 11070480 10299721 9550119 8820985 8066755 7277673 6546793 5902655
8742E902655n74854m68892l63677m15782l15925k70089l18239k48952k44497j63493
$$ 5902655 5327801 4858909 4495232 4079450 3763525 3493436 3175197 2926245 2681748 2518255
8732B518255j49297j26948n2266j11396j33841j27323j56063j08812k9344l405
$$ 2518255 2368958 2242010 2189744 2078348 1944507 1817184 1661121 1552309 1522965 1519560
8722A519560r874q4992p1240k0031n6323n3794m955n3843l5335j26885r0829p0996
$$ 1519560 1509686 1424694 1353454 1333423 1277100 1223306 1218351 1164508 1129173 1002288 911459 840463
8710H40463m2477K5214o849K781m3830j5786j6239m692l5999j2382k1989j3100
$$ 840463 797986 823200 816351 819132 775302 759516 743277 738585 702586 690204 668215 655115
8698F55115Q1797J0415j7217r569k8429n3322k9168m4496k5756j09670r3337J8136
$$ 655115 736912 747327 730110 720541 692112 638790 609622 565126 539370 429700 336363 354499
8686C54499q685K2908N0519j9124J2600L1402K727L2913L8545Q9561K4108j0062
$$ 354499 345814 368722 419241 400117 412717 444119 446846 479759 518304 607865 631973 621911
8674F21911q370o4758o9452j0576K6539M9223n562j4541l5092n6980m1052M8380
$$ 621911 613541 548783 479331 468755 495294 544517 538955 524414 489322 432342 391290 439670
8662D39670K5524j0686m712k8080l5663L2893J9976j6977n900O387L7291M1021
$$ 439670 465194 454508 449796 421716 386053 418946 438922 421945 416045 422432 459723 500744
8650E00744m5359l7787l127m0487K621m3703o006L8902K2614l6714Q283j860l5491
$$ 500744 455385 417598 414471 373984 376605 332902 326896 365798 388412 351698 359981 358121 322630
8637C22630J5304j3153l3374O278L866J8349n812R367L9558k7371J4506M4575
$$ 322630 337934 324781 291407 297685 301551 319900 314088 323455 363013 335642 350148 394723
8625C94723n363k2108R1818J3854l0433K8624L932l9631r3760L938Q8866L5955
$$ 394723 389360 367252 459070 472924 442491 471115 475047 435416 341656 345594 434460 470415
8613D70415l2368l3209l1877j634q260m9198k5391j8617K7730j5825N6940K3596
$$ 470415 438047 404838 372961 371327 363067 313869 288478 269861 297591 281766 338706 362302
8601C62302m2086K4149M5173j5314j9737M2039J4074j5250m5157j8198o0332l0772
$$ 362302 320216 344365 389538 374224 354487 396526 410600 395350 350193 331995 271663 240891
8589B40891K3206l1863p776L2075M0087N9957j5197n2724k5627K8485m7358n3282
$$ 240891 264097 232234 224458 256533 296620 356577 341380 288656 263029 291514 244156 190874
8577A90874l2164J3306L5691j828O265M6215m9454p1900q5594R49Q7590N7612
$$ 190874 158710 172016 207707 205879 212144 258359 208905 137005 51411 52360 139950 197562
8565A97562j2338J2383M9276J2361K4500O4896n2244l7806j4221m153k1777M625
$$ 197562 185224 197607 246883 259244 283744 348640 296396 258590 244369 240216 218439 223064
8553B23064m2244N918n874N8742J8539O404j5974q4263p9246j8680N8455M8529
$$ 223064 180820 186738 180864 239606 258145 264549 248575 164312 85066 66386 124841 173370
8541A73370K3890p2410m4881k0110L3945K2840J2910Q1432O27j9158k4414L365
$$ 173370 197260 124850 79969 59859 93804 116644 129554 210986 211613 192455 168041 171406
8529A71406j1668K3190O565k0321j03137l0767K9530L4102L5382o424J6045j9509
$$ 171406 159738 182928 189493 169172 66035 35268 64798 98900 134282 127858 143903 124394
8517A24394J2847K7106L6370l5952J7019J8321l4534l5427r405M4964j8023k4195
$$ 124394 137241 164347 200717 164765 181784 200105 165571 130144 120739 165703 147680 123485
8505A23485j2799n2574j9507N1020L6866j5498K1790M4053j809o984q6679O465
$$ 123485 110686 58112 38605 89625 126491 110993 132783 176836 175027 168043 81364 87829
8493H7829K4600n500L7911K5121j9798J7588p2413k3373M2342R49k4600L2232
$$ 87829 112429 106929 144840 169961 150163 167751 95338 71965 114307 115256 90656 122888
8481A22888O1324l1247m5968L0587l1511m4005J9434K4820J4867M0318j915l4352
$$ 122888 184212 152965 106997 137584 106073 62068 81502 106322 121189 161507 159592 125240
8469A25240k0578M3377K8038k5970M719k3602k8210r811l5796k3621K5267M096
$$ 125240 104662 148039 176077 150107 154826 131224 103014 93203 57407 33786 59053 63149
8457F3149J4165J4322P6106J9467N370l6300Q2697K06534J55008J10810m069m8632
$$ 63149 77314 91636 167742 187209 192579 156279 238976 445510 600518 711328 707259 658627
8445F58627j48186j05071r7214o2262m1306k8749j8511l3690N393J8692n0433
$$ 658627 510441 405370 308156 245894 204588 175839 157328 123638 129031 147723 97290
8434I7290l7902j6823L4465R6300o5001r9737l2445P4726J6783R746L6052l8303
$$ 97290 59388 42565 77030 173330 108329 8592 -23853 50873 67656 77402 113454 75151
8422G5151J852N9783l7599p2838j1320J2419K9374O759N0058L4930J2287J1582
$$ 75151 77003 136786 99187 26349 15029 27448 56822 63581 113639 148569 160856 172438
8410A72438k3685M4445Q3234Q5048O1381J42054K18116K95525K37182q973k72070
$$ 172438 148753 193198 276432 361480 422861 564915 783031 1078556 1315738 1306765 1034695
8399A034695k63584k39020j94491q2818m97m5617m1767J0579K4619l6273k0555
$$ 1034695 771111 532091 337600 254782 254285 208668 166901 177480 202099 165826 145271
8388A45271J5438J0341J7595p4909m694L7566J9089n6132j9346M4421m1860M924
$$ 145271 160709 171050 188645 113736 109042 146608 165697 109565 90219 134640 92780 97704
8376I7704N2226K319l2241o3732m6662K3419K6039m2662j2290N8714J4407N7100
$$ 97704 149930 152249 120008 56276 9614 33033 59072 16410 4120 62834 77241 134341
8364A34341O4300L4312M6573O012L0365R3753J98945J15624j0714j65484j69319
$$ 134341 198641 232953 279526 285538 315903 409656 608601 724225 713511 548027 378708
8353C78708q0121k7140j6229N341n6686q0168j01142m0591o753l2644N7126M0111
$$ 378708 298587 271447 255218 260559 203873 123705 22563 -18028 -24781 -57425 -299 39812
8341C9812j7307K8778n4394o013Q3661N5123L1843J8654j9834n6479k5376r5207
$$ 39812 22505 51283 -3111 -9124 74537 129660 161503 180157 160323 103844 78468 -16739
8329a6739J5564Q8144J1357n4841n2148M6432j2668j4268m833O5366K4674m0863
$$ -16739 -1175 86969 98326 43485 -8663 37769 25101 10833 6000 71366 96040 55177
8317E5177J7530r313M0666P4282J5322l8286o0924q5811o6667N970N1944M3130
$$ 55177 72707 63394 104060 178342 193664 155378 94454 8643 -58024 -52054 -110 43020
8305D3020m0547n7428M1108J19643P5539n7308m2830m1133M189P471k2056j2455
$$ 43020 2473 -54955 -13847 105796 181335 124027 81197 40064 44253 51724 29668 17213
8293A7213M1723j3265p1472m8923M2125k277L8114J8125j9655K1356j6374J0470
$$ 17213 58936 45671 -25801 -74724 -32599 -34876 3238 21363 1708 23064 6690 17160
8281A7160K997M6864Q4127j1874l1945m1722p5508k2534M9977L9338K7091K1581
$$ 17160 20157 67021 151148 139274 107329 65607 -9901 -32435 17542 56880 83971 105552
8269A05552o6033L045O2702K319p6030n0028M2192J1985L6484J1316Q838l6127
$$ 105552 39519 42564 105266 107585 31555 -18473 23719 35704 72188 83504 92342 56215
8257E6215j3212K2708l4927l5302J2679K9709P5103j986J7178J2496J6408m8997
$$ 56215 43003 65711 30784 -4518 8161 37870 112973 110987 128165 140661 157069 108072
8245A08072j11862p1743J4193J08724M6624n3154o2116J7578J8669K0006j466
$$ 108072 -3790 -75533 -61340 47384 94008 40854 -21262 -3684 14985 34991 33525
8234C3525l6632m702L3098J917J7950N6423n0018m4529Q166J0511k8310M6022
$$ 33525 -3107 -7809 25289 27206 45156 101579 51561 7032 15198 25709 -2601 43421
8222D3421l4465K7557J4238p8194N723J10608Q5729o6996J0642m1735l8483j1676
$$ 43421 8956 36513 50751 -27443 -21720 88888 174617 107621 118263 76528 38045 26369
8210B6369l921m220J2149m0710l0781N7835K7089J9957R03K5210m0792j4638j6442
$$ 26369 22448 18228 30377 -10333 -41114 16721 43810 63767 64670 89880 49088 34450 18008
8197A8008N0299N0326P255M648m2407p5238m9318k6696M3582O9728K4647l8415
$$ 18008 68307 118633 125888 130536 88129 12891 -36427 -63123 -19541 50187 74834 36419
8185C6419o147M6130K230N8321M7712l7258m6108o8905k27k5009r152l4084J6042
$$ 36419 30272 76402 78632 136953 184665 147407 101299 32394 32167 7158 -1994 -36078 -20036
8172b0036n118R316L4286K5830P599k0992k570L1569j8599M5373J7476l148k6885
$$ -20036 -25154 -15838 18448 44278 51877 30885 28315 59884 41285 86658 104134 100986 74101
8159G4101k8824j7655L1834O559R776J6588J1774M393M4344r173m3412n5935j9101
$$ 74101 45277 27622 59456 66015 75791 92379 104153 108546 152890 143717 100305 44370 25269
8146B5269q7721J303J04885l2967l2609j2580N2546R697n482m454K4168o6288
$$ 25269 -62452 -61149 43736 10769 -21840 -34420 18126 27823 22341 17887 42055 -24233
8134b4233k2230K8987j775P717L8998M2989k4905n4772K1847L6393J2992K528
$$ -24233 -46463 -17476 -19251 -11534 27464 70453 45548 -9224 12623 49016 62008 64536
8122F4536j3233l014O9775J7022p101k8994l9832J9073O2716K3584m351r16k6558
$$ 64536 51303 48289 118064 135086 127985 98991 59159 78232 140948 164532 160181 159265 132707
8109A32707k5813J365l2869j1036l0823o3120m0262O0198M8336K501k089k1188
$$ 132707 106894 108259 75390 64354 33531 -29589 -69851 -9653 38683 41184 39095 17907
8097A7907K9925M5780J3874m6827n9478J6521l8203Q6266L290k9244J7942K4384
$$ 17907 47832 93612 107486 60659 1181 17702 -20501 65765 69055 39811 57753 82137
8085H2137l8388j0258p2565k5095N68R793l5655K8606M3232n814k2527K0047l1448
$$ 82137 43749 33491 -39074 -64169 -63601 -53808 -89463 -60857 -17625 -23439 -45966 -25919 -57367
8072e7367j790J0274M5645j6956j9798k5767R9604J4018J3942n2010k7297M2096
$$ -57367 -59157 -48883 -3238 -20194 -39992 -65759 33845 47863 61805 9795 -17502 24594
8060B4594N2688K8865P093m7072n6776J0244O6055j7128j8905J0293j616k0880
$$ 24594 77282 106147 113240 66168 9392 19636 85691 68563 49658 59951 58335 37455
8048C7455r19M0684K2704m6558r69j3245M3715L3956o3588n6847O8835L5193j4504
$$ 37455 36536 77220 99924 53366 52397 39152 82867 116823 53235 -3612 65223 100416 85912
8035H5912j927j346k5816M2257M3110m1210r0636o5377J4606K7293l7234j0894
$$ 85912 83985 82639 56823 99080 142190 100980 10344 -55033 -40427 -13134 -50368 -61262
8023f1262K6157P2679M0329m4594J5863K9633L9125k5320J0945L2804J6565l779
$$ -61262 -35105 37574 77903 33309 49172 78805 117930 92610 103555 136359 152924 149145
8011A49145m0787l9891n474K5926o543Q0131j6285j4642K3835J5808k4938j1086
$$ 149145 108358 68467 62993 88919 82376 162507 146222 131580 155415 171223 146285 135199
7999A35199M1567p425N594k3051k2957K1049j9710k9028M8196L9609L3633l4337
$$ 135199 176766 169341 174935 151884 128927 149976 130266 101238 149434 189043 222676 188339
7987A88339J8318K6905k3117m3155l2351Q40p677n8954q927K5447q461N3869J9529
$$ 188339 206657 233562 210445 167290 134939 135779 128102 69148 60221 85668 77207 131076 150605
7974A50605j5050l2617l6678n1447M5062M6719J2610M468k2451n874j5518K0344
$$ 150605 135555 102938 66260 14813 59875 106594 119204 123672 101221 95347 79829 100173
7962A00173K9078k9540k3904M9557K5239J9774r8588K5516p8214k3858Q2707P2585
$$ 100173 129251 99711 75807 125364 150603 170377 71789 97305 19091 -4767 77940 150525
7950A50525L529j1072j4428m9327m3596j2291J5862k4596k6898j3429k9588L042
$$ 150525 154054 142982 128554 79227 35631 23340 39202 14606 -12292 -25721 -55309 -52267
7938e2267p143K6445J8720j070k6992j9690k8666k9486M0276N2817P255N983J1873
$$ -52267 -59410 -32965 -14245 -15315 -42307 -61997 -90663 -120149 -79873 -27056 -19801 -13818 -1945
7925a945P0772j5990l8260r153N8204J7566j7762K1762l4559j1857j4535m667
$$ -1945 68827 52837 14577 5424 63628 81194 63432 85194 50635 38778 24243 19576
7913A9576l9130k3404N0818M6034j8683K2468J5890M470k0344k5024j7629l023
$$ 19576 -19554 -42958 7860 53894 35211 57679 73569 78039 57695 32671 15042 12019
7901A2019J2998J1005O511l8326k3062K2784K7807j207m124j5316m1345L100r941
$$ 12019 25017 36022 42533 4207 -18855 3929 31736 30529 26405 11089 -30256 -27156 -37097
7888c7097l8715J4430N4928j9550M795J0824J1140J6579K7611K4201M621J0944
$$ -37097 -75812 -61382 -6454 -26004 -21209 -10385 755 17334 44945 69146 73767 84711
7876H4711Q80k6727r782j6049j6904n539M1178o060l9154k0705K024l4627J4020
$$ 84711 85591 58864 49082 33033 16129 10590 51768 45708 6554 -14151 -12127 -46754 -32734
7863c2734k1954j7765O690L9573L425P564M9434r076k7485P063R530O2652j2835
$$ -32734 -54688 -72453 -65763 -26190 -22765 -15201 34233 25157 -2328 4735 14265 76917 64082
7850F4082j6550j0662q8265k9560N1673N2242L8611j0393Q085n9110l1162M7846
$$ 64082 47532 36870 -51395 -80955 -29282 22960 61571 51178 59263 153 -31009 16837
7838A6837M8832J7790o6149l2061K9093N221l3479j6983J4213n036K9959J5174
$$ 16837 65669 83459 17310 -14751 14342 19563 -13916 -30899 -16686 -21722 8237 23411
7826B3411o7156J9011P3849K2128K0416J7689J9640m5070m2812p4622k2993M718
$$ 23411 -43745 -24734 49115 71243 91659 109348 128988 83918 41106 -33516 -56509 -51791
7814e1791K2118N3717J6949q052p679Q833m1513J03283N3046o0048n5704l5329
$$ -51791 -29673 24044 40993 32941 25262 34095 -7418 95865 148911 88863 33159 -2170
7802b170o548m6299J0807l8131j1952O1881j1475n2652M0420J9675j6444m9245
$$ -2170 -8718 -55017 -44210 -82341 -94293 -32412 -43887 -96539 -56119 -36444 -52888 -102133
7790a02133q78L4219j1684K0206R0092o6206J6030N1526l7021J3794P0383l5857
$$ -102133 -103011 -68792 -80476 -60270 29822 -36384 -20354 31172 -5849 7945 78328 42471
7778D2471N112o9653k2381k7016J383L3491P2324K0775J7030J68k0632j7020k9922
$$ 42471 47583 -22070 -44451 -71467 -70084 -36593 35731 56506 73536 73704 53072 36052 6130
7765F130J3823J4221M684m0396l2552l3632O1180K9797O066j7578K1251M4920
$$ 6130 19953 34174 38858 -1538 -34090 -67722 -6542 23255 29321 11743 32994 77914
7753G7914J9231l4010N1990l6299n8950j9520m7635K899p439k7562K388N7828
$$ 77914 97145 63135 115125 78826 19876 356 -47279 -44380 -51819 -79381 -76993 -19165
7741a9165J5965K1382L6613J1577k148m1050k2263j1044J1496l1713J4543M3091
$$ -19165 -3200 18182 54795 66372 64224 23174 911 -10133 1363 -30350 -15807 27284
7729B7284M523p1625O057N7278j8862o1127N377p191L3513K2535k6983m8105Q3717
$$ 27284 31807 -39818 -33761 23517 4655 -56472 -51095 -58286 -24773 -2238 -29221 -77326 6391
7716F391O5752J2523l5617n1852m0451j1000K2927k7542k9595L5566K439j8484
$$ 6391 72143 84666 49049 -2803 -43254 -54254 -31327 -58869 -88464 -52898 -50459 -68943
7704f8943o577J2589L4605P6794L3942j5445l3165k3638l2508n966k4979K6490
$$ -68943 -75520 -62931 -28326 48468 82410 66965 33800 10162 -22346 -28312 -53291 -26801
7692b6801P5691J9943p3015k8875M6270M6230K5681n93n5921j8985j6945K0404
$$ -26801 48890 68833 -4182 -33057 13213 59443 85124 84531 28610 9625 -7320 13084
7680A3084K0391J1K2938K6886j4629J5524o6821j19201j8179M462P1716O2135
$$ 13084 33475 33486 56424 83310 68681 84205 17384 -101817 -119996 -115534 -43818 18317
7668A8317J7830j6251O690J8333q7114m636K0653n577m480M0430M2504k956n3566
$$ 18317 36147 19896 26586 44919 -42195 -46831 -26178 -31755 -36235 4195 46699 43743 -9823
7655i823l2043l63L0749M449K1679K3062o0436m8165J1985M1864O4449O5169j2317
$$ -9823 -41866 -42229 -11480 -7031 14648 37710 -22726 -70891 -58906 -17042 47407 112576 100259
7642A00259l8764J6150j2280j7519j8702m4025l4281K0732P021O9909K9908o1310
$$ 100259 61495 77645 65365 47846 29144 -14881 -49162 -28430 -21409 48500 78408 17098
7630A7098L8614K807k6181k6936O3756j501k4146l4862Q233J3230p3150J2572
$$ 17098 55712 58519 32338 5402 69158 67657 43511 8649 16882 30112 -43038 -30466
7618c0466L226k8490j1176M060M6225O9223J474M0706k5309m1584l8926M4641
$$ -30466 -27240 -55730 -66906 -62846 -16621 52602 54076 94782 69473 27889 -11037 33604
7606C3604P2163m2509o4214n1405j271P2571N0568J1455m6228L025k9503p444
$$ 33604 105767 63258 -956 -52361 -53632 18939 69507 80962 34734 37759 8256 812
7594H12J0824J7326J2982M7305j394m4605j3655N0110L0456L2201k2444p4487
$$ 812 11636 28962 41944 89249 87855 43250 29595 79705 110161 142362 119918 45431
7582D5431K1879M5829Q319l9948l6850n9772k3571m876m086L0278J0131m7908
$$ 45431 67310 113139 121458 81510 44660 -15112 -38683 -43559 -47645 -17367 -7236 -55144
7570e5144Q37O3916K7244l1888l8367K4197m330q871m6263K1078J3269R323J7817
$$ -55144 -54307 9609 36853 4965 -33402 -9205 -13535 -22406 -68669 -47591 -34322 -24999 -7182
7557g182J1085L4223L4171m6456n352k3601q0897n2757L9196l165J5436L7614
$$ -7182 3903 38126 72297 25841 20489 -3112 -84009 -136766 -97570 -100735 -85299 -47685
7545d7685J0712j5734N7098J3134o1912j8191o8613r560P5421O4337k1328o8493
$$ -47685 -36973 -52707 4391 17525 -44387 -62578 -131191 -140751 -65330 -993 -22321 -90814
7533i0814k3501j1546j4741q88M6339O2964O7825k2836K3863n367j14351J3743
$$ -90814 -114315 -125861 -140602 -141490 -95151 -32187 35638 12802 36665 31298 -83053 -69310
7521f9310P7534M3852l6087m9036l5438k9444J4455l4007L3736N8383K2736K6063
$$ -69310 8224 52076 15989 -33047 -68485 -97929 -83474 -117481 -83745 -25362 -2626 23437
7509B3437k2929o4600j8931R2748J2457P860j6554l2949k9111j328o720P5550
$$ 23437 508 -64092 -83023 9725 22182 30042 13488 -19461 -48572 -49900 -56620 18930
7497A8930K1614o0712j2475O02K8704j9729j8923m5669J3171k2542k4349L5554
$$ 18930 40544 -20168 -32643 -32041 -3337 -23066 -41989 -87658 -74487 -97029 -121378 -85824
7485h5824K8964M5343R717N3187l7487L2364k5979J4021R682o837L0478r479J1084
$$ -85824 -56860 -11517 -1800 51387 13900 46264 20285 34306 43988 37151 67629 58150 69234
7472F9234K6351o1369m6402n7336N2937K4451k0187L332n691L2589N315m7951
$$ 69234 95585 34216 -12186 -69522 -16585 7866 -12321 -8989 -14680 17909 23224 -24727
7460b4727m06M0330m7855K180N3766p670l2045J4787K9062N663m03j8752K0037
$$ -24727 -25133 15197 -32658 -30478 23288 15618 -16427 -1640 27422 33085 32682 13930 33967
7447C3967N3253j1317j6716j9372k4013k2149j2599q229K6422J3982j8402K872
$$ 33967 87220 75903 59187 39815 15802 -6347 -18946 -27175 -753 13229 -5173 -2301
7435b301J6754L1544j017p7715m0893J7554N4578M4870p637J1712k709m4400r0005
$$ -2301 14453 45997 44980 -32735 -73628 -56074 -1496 43374 35737 47449 44740 340 -89665
7422h9665K58N0525O505L9902l194L2297l0524o4662l0721k6948l938K0130O8720
$$ -89665 -89407 -38882 -32377 7525 4331 36628 6104 -58558 -89279 -116227 -120165 -100035 -31315
7409c1315L0014k2735n1840j5948J9600N9999K639o1982j4629M1230L47L874k0784
$$ -31315 -1301 -24036 -75876 -91824 -72224 -12225 -9586 -71568 -86197 -44967 -44620 -40746 -61530
7396f1530j5032J3268L4979L6720l984k2785k7588r548K477R860Q009R147j5571
$$ -61530 -76562 -63294 -28315 8405 4421 -18364 -45952 -55500 -53023 -43163 -35154 -26007 -41578
7383d1578K0912k8543j772j2319j4009J2653P6517K5109k0294K6342N24L881Q6996
$$ -41578 -20666 -49209 -50981 -63300 -77309 -64656 11861 36970 16676 43018 43542 47423 134419
7370A34419j3147l6453M430k376o7583K6619N5238l2576J4428k2389j5603m0335
$$ 134419 121272 84819 89249 86873 19290 45909 101147 68571 82999 60610 45007 4672
7358D672j4143N0562J0306m7353m1734j9779m514M8856q789l3671k336M0683J0083
$$ 4672 -9471 41091 51397 4044 -37690 -57469 -61983 -13127 -21916 -55587 -57923 -17240 -7157
7345g157k4040l731J1466M876J0058P2332Q5471k7152p1103n8998m1989j7937
$$ -7157 -31197 -34928 -23462 -18586 -8528 63804 149275 122123 51020 -7978 -49967 -67904
7333f7904J6040N0j5663L0584K0713j8308r239l2429J0959J8932Q1662J3600m8211
$$ -67904 -51864 -51814 -67477 -36893 -16180 -34488 -43727 -76156 -65197 -46265 35397 48997 786
7320G86p4724n591Q3747k5133J858r675R206O2579Q287m126m0804L9625R998k8381
$$ 786 -73938 -79529 4218 -20915 -19057 -28732 -19526 43053 51340 47214 6410 46035 56033 27652
7306B7652n694k9056l1418L5035J103L2184J1662q648J6247L8965M3588k4199
$$ 27652 21958 -7098 -38516 -3481 -2378 29806 41468 32820 49067 88032 131620 107421
7294A07421q14L3807k7154o6224p263j539M527o4584K5523J5285m3103k4669j8233
$$ 107421 106607 140414 113260 47036 39773 38234 42761 -21823 3700 18985 -24118 -48787 -67020
7281f7020m3416k1070K2338N5199O6158K0885L2803J4701K078m3089n6374l080
$$ -67020 -110436 -131506 -109168 -53969 12189 33074 65877 80578 82656 39567 -16807 -19887
7269a9887J3655l8744k2453J9120l5098l8818L7331L5349J005L8986M6182J0400
$$ -19887 -6232 -44976 -67429 -48309 -83407 -122225 -84894 -49545 -48540 -9554 36628 47028
7257D7028n579q556o5461K521Q094J2025k2305o4957k844K0591O6430K9950L5045
$$ 47028 41449 32893 -32568 -30047 -21953 -9928 -32233 -97190 -100034 -79443 -13013 16937 51982
7244E1982J0685k8784n5155n767J1828L5276J4036m73K040n298j8552M421k9294
$$ 51982 62667 33883 -21272 -27039 -15211 20065 34101 33628 35668 30370 11818 16239 -13055
7231a3055L6138J0108P6821O0184m5464n0875m9000k6178J052L9515l5843n6846
$$ -13055 23083 33191 110012 170196 124732 73857 24857 -1321 -269 39246 3403 -53443
7219e3443L2588j861o7034L5014M3606J4325r865m769J6106R101o565m8685k3529
$$ -53443 -20855 -22716 -89750 -54736 -11130 3195 -6670 -11439 4667 13768 7203 -41482 -65011
7206f5011N0485j2517l0104j3064L579Q223K6621R404M8254K7985L2002j4658
$$ -65011 -14526 -27043 -57147 -70211 -66632 -58409 -31788 -22384 25870 53855 85857 71199
7194G1199J9467l1176k5885N817L1832j2055j8032o4143R896N7935K1933l3381
$$ 71199 90666 59490 33605 39422 71254 59199 41167 -22976 -13080 44855 66788 33407
7182C3407J3784j9521l7559k584J1718J7256j7330k1239j6824j147o5904j0028
$$ 33407 47191 27670 -9889 -12473 -755 16501 -829 -22068 -38892 -40039 -105943 -115971
7170a15971K7031k1129l9952K8075K0478j796l2614l8087O1561M1875Q2466j6163
$$ -115971 -88940 -110069 -150021 -121946 -101468 -103264 -135878 -173965 -112404 -70529 11937 -4226
7158d226l0099j8654l5881P915J5720K0395k709N4182L5525K9281j5845j2163
$$ -4226 -34325 -52979 -88860 -80945 -65225 -44830 -47539 6643 42168 71449 55604 43441
7146D3441K760K7038k2203o1407m2996P1768O5628P721m0322k3704k5487M28R401
$$ 43441 46201 73239 51036 -10371 -53367 18401 84029 91750 51428 27724 2237 2665 12066
7133A2066K173j3086m0187l5218R4748j002r819J4736J4601l548j7869J0966k1762
$$ 12066 14239 1153 -39034 -74252 20496 19494 9675 24411 39012 35464 17595 28561 6799
7120F799O815M5938L5675q76j0486K6774o6709m6260P039N580L6398j4741P584
$$ 6799 13614 59552 95227 94351 83865 110639 43930 -2330 4709 10289 46687 31946 39530
7107C9530J7903Q335m7943j5563K8645J8383l2552k5836O1499k003O024N3687
$$ 39530 57433 65768 17825 2262 30907 49290 16738 -9098 52401 50398 56422 110109
7095A10109n5322q5884k4847L2731P646P141L3014r590o7863N52K0717M5785l6866
$$ 110109 54787 -31097 -55944 -23213 -15567 -8426 24588 14998 -52865 -52313 -31596 14189 -22677
7082b2677J4281n3732m4688M1936L1521j3815R933k281O7917J9843P933R172p1533
$$ -22677 -8396 -62128 -106816 -64880 -33359 -47174 -37241 -39522 28395 48238 56171 65343 -6190
7069f190n5641l0509l0995M2695N3707l4172l363M2659K6962j7162n2024L1985
$$ -6190 -61831 -92340 -123335 -80640 -26933 -61105 -64468 -21809 5153 -12009 -64033 -32048
7057c2048j1884K8716j9279l6030J3810K2661K0029j880J3756M1723N9816k2496
$$ -32048 -43932 -15216 -34495 -70525 -56715 -34054 -14025 -15905 -2149 39574 99390 76894
7045G6894K223q062k8844L6232K4177j676k3816q0830k7753P802m9531j7655O659
$$ 76894 79117 71055 42211 78443 102620 100944 77128 -3702 -31455 -23653 -73184 -90839 -84180
7032h4180K2725O3563J8271j4943r2329R658M9744L9267K5943Q296k9446p2407
$$ -84180 -61455 2108 20379 5436 -86893 -77235 -27491 11776 37719 46015 16569 -55838
7020e5838M7093M0923L3822k8785j5135j2599N0573K2667r2759j10933n0398j0804
$$ -55838 -8745 32178 66000 37215 22080 9481 60054 82721 -10038 -120971 -171369 -182173
7008a82173M8355Q8946L6305l4529l9679L2037k344j7501Q760J6120L8446K0051
$$ -182173 -133818 -44872 -8567 -43096 -82775 -50738 -53082 -70583 -61823 -45703 -7257 12794
6996A2794M0524o2811k7589r768J7251J9358R983L055M0296M6115R847j5114j4815
$$ 12794 53318 -9493 -37082 -46850 -29599 -10241 -258 2797 43093 89208 99055 83941 69126
6983F9126q458m1830k2989j5792Q54K9263L0625J9018k0925k7004K5657o0496
$$ 69126 60668 18838 -4151 -19943 -19089 10174 40799 59817 38892 11888 37545 -22951
6971b2951r5138j3219N3726K2118J9181L3552J1697m3953K596J6593j5206M2555
$$ -22951 -118089 -131308 -77582 -55464 -36283 -2731 8966 -34987 -32391 -15798 -31004 11551
6959A1551R140l4705n4551P921O1547j7076J236N4175L306q346J3288l9859M0410
$$ 11551 20691 -14014 -68565 -60644 903 -16173 -14937 39238 42544 34198 47486 7627 48037
6946D8037K2011q3226p6408J0891N5806O6150k2628k2386l2661l8376M5917L7087
$$ 48037 70048 -13178 -89586 -78695 -22889 43261 20633 -1753 -34414 -72790 -26873 10214
6934A0214k173m8720K0901J6076N5505o936m0839L3522L6404J3481k8273p6879
$$ 10214 8041 -40679 -19778 -3702 51803 44867 4028 37550 73954 87435 59162 -17717
6922a7717j5973l7522j7389J7197L1422L2149n4438L2140o2056j3031Q4210K673
$$ -17717 -33690 -71212 -88601 -71404 -39982 -7833 -62271 -30131 -92187 -105218 -21008 -18335
6910a8335J6869P8673J058m455l6242k7789J815K3014J4834K3631o712p2576j3989
$$ -18335 -1466 77207 78265 73810 37568 9779 11594 34608 49442 73073 66361 -6215 -20204
6897b0204l321j1598r083L5780j7422m7266r374K480k1235M159J6626M0117P3707
$$ -20204 -23525 -35123 -44206 -8426 -25848 -73114 -82488 -80008 -101243 -97084 -80458 -40341 33366
6884C3366O2949Q244m2686o1170p7429J6695L0363N6339N316L7664k0378K842
$$ 33366 96315 104559 61873 703 -76726 -60031 -29668 26671 31987 69651 49273 52115
6872E2115l1526k8303K2303J1427l4946p3688n1450J7338j3214r391M4106N4670
$$ 52115 20589 -7714 14589 26016 -8930 -82618 -134068 -116730 -129944 -139335 -95229 -40559
6860d0559P3038k2161j0620M6032N973k3645l1612o6284k891J5331M7663N5695
$$ -40559 32479 10318 -302 45730 51703 28058 -3554 -69838 -72729 -57398 -9735 45960
6848D5960j3935L765K5933n6013n2722R5983L0637q3282j0282K1619j5084l1927
$$ 45960 32025 35790 61723 5710 -47012 48971 79608 -3674 -13956 7663 -7421 -39348
6836c9348l631J3407M4870M2862J2946o9621K5197l1609m7102k4722l9438M1446
$$ -39348 -42979 -29572 15298 58160 71106 1485 26682 -4927 -52029 -76751 -116189 -74743
6824g4743O2646K6228K681r351l6356J0785K9488o3500Q301k6103n9700N0583
$$ -74743 -12097 14131 16812 7461 -28895 -18110 11378 -52122 -43821 -69924 -129624 -79041
6812g9041L7103L8918N8931M519k2074P500k2566o991K1827K3336l9209q4337
$$ -79041 -41938 -3020 55911 60430 38356 45856 23290 16299 38126 61462 22253 -62084
6800f2084l7864L8476P4647k0582L2054M2672k9268n613K5826k4335k6617m8145
$$ -62084 -99948 -61472 13175 -7407 24647 67319 38051 32438 58264 33929 7312 -40833
6788d0833l8387K8749K5748R990N465Q7135l5344m0719J8970K2097J4780K5311
$$ -40833 -79220 -50471 -24723 -14733 -9268 77867 42523 1804 20774 42871 57651 82962
6776H2962l0742l3048J5736L9593j585n6831K5214j2922L411q867J7144k1451
$$ 82962 52220 19172 34908 74501 72916 16085 41299 28377 31788 22921 40065 18614
6764A8614m881K0513n543k4248k9407L6208M0201k3527q1871M495O783n9632P881
$$ 18614 13733 34246 28703 4455 -24952 11256 51457 27930 -53941 -49446 -42663 -102295 -94414
6751i4414O1874m4383L6863p694Q563Q4038n531k2785M3100M0797L9388J0710
$$ -94414 -32540 -76923 -40060 -47754 -39191 44847 39316 16531 59631 100428 139816 150526
6739A50526k8443l2243k3478k134j8077o0942J6447o948j4540L8436j4350J8487
$$ 150526 122083 89840 66362 64228 46151 -14791 1656 -5292 -19832 18604 4254 22741
6727B2741k550n805K9075l2j6024l114L6002K7299o0049k2475L9632p476M1901
$$ 22741 20191 14386 43461 43429 27405 24291 60293 87592 27543 5068 44700 37224 79125
6714G9125L1532J8217M2511l8020j04010j9925O2275L5996j1335j2872j6331n8009
$$ 79125 110657 128874 171385 133365 29355 9430 71705 107701 96366 83494 67163 9154
6702I154p5208L6892m2481j3685K7659J4586O1645O341J5281j3111M196n0054
$$ 9154 -66054 -29162 -71643 -85328 -57669 -43083 18562 24903 40184 27073 31269 -18785
6690a8785l2000j37089l5788R2813R1338K5463m5817k0218m9976m507M128L8804
$$ -18785 -50785 -187874 -223662 -130849 -39511 -14048 -59865 -80083 -130059 -134566 -130438 -91634
6678i1634L3582j0026n5926M0024L8771N4721M0169J4438l7531n4344m4133j0002
$$ -91634 -58052 -68078 -124004 -83980 -45209 9512 49681 64119 26588 -27756 -71889 -81891
6666h1891P802L3415N0571M2693K2103O154j3683K887o471k2553j9451m0953j3815
$$ -81891 -74089 -40674 9897 52590 74693 80847 67164 70051 63580 41027 21576 -19377 -33192
6653c3192K1252M243j5606j0145J432k6787l4014L1275M3074n1357k3903L9210
$$ -33192 -11940 -7697 -23303 -33448 -32016 -58803 -92817 -61542 -18468 -69825 -93728 -54518
6641e4518j923J5123K0418K7524M649m5745o1657P539M0177L7035J8741j2732
$$ -54518 -56441 -41318 -20900 6624 11273 -34472 -96129 -88590 -48413 -11378 7363 -5369
6629e369L3651j5952o0298L9152p5569j8492K2788l5401l064O3812N7310L8304
$$ -5369 28282 12330 -47968 -8816 -84385 -102877 -80089 -115490 -118554 -54742 2568 40872
6617D0872O2341l4014k2421K923r511K2708l881l4060l8980n6660r569K6644J2992
$$ 40872 103213 69199 46778 49701 40190 62898 59017 24957 -14023 -70683 -80252 -53608 -40616
6604d0616j2850K2803L4296J1451q0455j7547L4532j7320K3800L6439N9290L481
$$ -40616 -53466 -30663 3633 15084 -65371 -82918 -48386 -65706 -41906 -5467 53823 57304
6592E7304l2287j4858o355Q918n4007m7657J4913L3241K5006K8808j2264K725
$$ 57304 25017 10159 3804 12722 -41285 -88942 -74029 -40788 -15782 13026 762 3487
6580C487K9471k7039j4943l5522K2409j9491M1639m159l1624K0980j8289N3860
$$ 3487 32958 5919 -9024 -44546 -22137 -41628 11 -4148 -35772 -14792 -33081 20779
6568B0779k4367l0350j1334N7042J4278J241l4878j5573j5110k4567J5465J7125
$$ 20779 -3588 -33938 -45272 11770 26048 27289 -7589 -23162 -38272 -62839 -47374 -30249
6556c0249L5577K4301j3146n8467q997N394O8954j840l2293J4315K9723k3782
$$ -30249 5328 29629 16483 -41984 -50981 -45587 23367 21527 -10766 3549 33272 9490
6544I490K196L4717Q529j2278q897k9257L6187k2877K6713P2784M932p6276j02807
$$ 9490 11686 46403 54932 42654 33757 4500 40687 17810 44523 117307 122239 45963 -56844
6531e6844n7662J3808J1623K5503N0561p755m3068K3472N834n760M7251J4053
$$ -56844 -114506 -100698 -89075 -63572 -13011 -20766 -63834 -40362 -34528 -40288 6963 21016
6519B1016j5663k2239o589j6566K3797J4012j551k9217J5856P460K5515j288k2174
$$ 21016 5353 -16886 -23475 -40041 -16244 -2232 -3783 -33000 -17144 -9684 15831 14543 -7631
6506g631r5M7m4838K6894L6789k3081j6722r192O2160J164l0221L7877J2513m3179
$$ -7631 -7726 -7679 -52517 -25623 11166 -11915 -28637 -37829 24331 25495 -4726 33151 45664 2485
6492B485r1564J2364M9381n164j0818m6473j1462K3680L029J3396r692J9975k6477
$$ 2485 -89079 -76715 -27334 -32498 -43316 -89789 -101251 -77571 -74542 -61146 -70838 -50863 -77340
6479g7340k4013J5731j0939j0655k630P3047N1023m4974n0094m8616K8066M4760
$$ -77340 -101353 -85622 -96561 -107216 -109846 -36799 14224 -30750 -80844 -129460 -101394 -56634
6467e6634O202n7862J9389P9989L7095K4618O663o0690l3882J0543K3577J0411
$$ -56634 -50432 -108294 -88905 -8916 28179 52797 59460 -1230 -35112 -24569 -992 9419
6455I419J164K230P560J3802k7006p626M459M6231m2394m2841p0814p454K9974
$$ 9419 10583 12813 20373 34175 7169 -457 4002 50233 7839 -35002 -105816 -113270 -83296
6442h3296l2538k5877O6185M0859J2882j8779L3601j9473n3494l1530K9565J14973
$$ -83296 -115834 -141711 -75526 -34667 -21785 -40564 -6963 -26436 -79930 -111460 -81895 33078
6430C3078N7356J090j9371j253q9270Q516L5432K2357k4429l871N1190q0410m6410
$$ 33078 90434 91524 72153 70900 -18370 -9854 25578 47935 23506 19635 70825 -9585 -55995
6417e5995p851j0875j3594O3883L4992m6979q564l2546q058N5549M7272O6248
$$ -55995 -63846 -74721 -88315 -24432 10560 -36419 -44983 -77529 -85587 -30038 17234 83482
6405H3482k1361l3257Q366q826J617K6152k7571J5052J0448j3374k2538m8740
$$ 83482 62121 28864 37230 28404 30021 56173 28602 43654 54102 40728 18190 -30550
6393c0550N151N6992K7465o0001J3626k2426K4398K0626l1631k983K2278l993
$$ -30550 -25399 31593 59058 -943 12683 -9743 14655 35281 3650 667 22945 18952
6381A8952L0748k2482M291p5636l2645R3369J5883j6202m5678k9335N9284J8379
$$ 18952 49700 27218 31509 -44127 -76772 16597 32480 16278 -29400 -58735 549 18928
6369A8928o577n1246m1337L3818M8243Q5205M677P149K4468q9376j2953K6566
$$ 18928 12351 -38895 -80232 -46414 1829 87034 91711 98860 123328 33952 20999 47565
6357D7565N950j3621k6800J7023K0280n0128m5963r450K9423Q278j7319j1131
$$ 47565 53515 39894 13094 30117 50397 269 -45694 -55144 -25721 -17443 -34762 -45893
6345d5893P2387K7288M499m6178k5351r376p76K5564M6217K6091k4125n7584k3643
$$ -45893 26494 53782 58281 12103 -13248 -22624 -23400 2164 48381 74472 50347 -7237 -30880
6332c0880J8023P083m3296N5664N7355J0771l1247k2922r0603l4840L5088N3986
$$ -30880 -12857 -5774 -49070 6594 63949 74720 43473 20551 -70052 -104892 -69804 -15818
6320a5818n0984J4133J8336L5973j697k1694j3042r627n881l1345j2168J3931
$$ -15818 -66802 -52669 -34333 1640 -57 -21751 -34793 -44420 -50301 -81646 -93814 -79883
6308g9883q193k5477N8272K8605K1020o417L9608m3257Q139O4179k365m9197l6090
$$ -79883 -88076 -113553 -55281 -26676 -5656 -12073 27535 -15722 -7583 56596 54231 5034 -31056
6295c1056M9828N8928k3826p5394n1903K7396R945l8988M7447P530K7724k351
$$ -31056 18772 77700 53874 -21520 -73423 -46027 -36082 -75070 -27623 -20093 7631 5280
6283E280J0728M2665N0481k1197m3850l4012k8954m9701l1171M4183M2697J9858
$$ 5280 16008 58673 109154 87957 44107 10095 -18859 -68560 -99731 -55548 -12851 7007
6271G007j0422L6093q753Q444k3480l970N2802n4008J6925K3037M4267K0281K6311
$$ 7007 -3415 32678 23925 32369 8889 4919 57721 3713 20638 43675 87942 108223 134534
6258A34534m0775n6283L4474M0082k6491l0617k3297p216L661p6873k7965J0801
$$ 134534 93759 37476 71950 112032 85541 54924 31627 24411 28072 -48801 -76766 -65965
6246f5965M3803L2773k0461K0280o229O853O1565k8520m8998l7426j2137k8969
$$ -65965 -22162 10611 -9850 10430 4201 11054 72619 44099 -4899 -42325 -54462 -83431
6234h3431J3839L0209L1500k8497j5759l220J3577K6550J4551k2024j3310K3316
$$ -83431 -69592 -39383 -7883 -36380 -52139 -55359 -41782 -15232 -681 -22705 -36015 -12699
6222a2699M6183P7839l1043o8966n3414l065o591N2769l787l8793K8041m9368
$$ -12699 33484 111323 80280 11314 -42100 -45165 -51756 1013 -2774 -41567 -13526 -62894
6210f2894m9532J1101K7645L1127N9191N094J4841K6675k338Q014n7732l8670
$$ -62894 -112426 -101325 -73680 -42553 16638 21732 36573 63248 60910 68924 11192 -27478
6198b7478m141R0121J8671l6603J9572j1636l4289p4325O165K1600k1092k1086
$$ -27478 -31619 58502 77173 40570 60142 48506 14217 -60108 -53943 -32343 -53435 -74521
6186g4521J8996o196R1128N7348R017m8535o6449k2902j4833n7553K4458N6843
$$ -74521 -55525 -61721 29407 86755 95772 47237 -19212 -42114 -56947 -114500 -90042 -33199
6174c3199M4116N979k8673q844J7125l0142J542O1284J1613o2766m3492L0495
$$ -33199 10917 16896 -11777 -20621 -3496 -33638 -32096 29188 40801 -21965 -65457 -34962
6162c4962J0391k4241j9112K5139K2773k8898J0310M3741L2264N0908k7822r0112
$$ -34962 -24571 -48812 -67924 -42785 -20012 -48910 -38600 5141 37405 88313 60491 -29621
6150b9621o2576K8242L6054k10m2873L7661M3404J2503L0873k7301K397k417l1196
$$ -29621 -92197 -63955 -27901 -28111 -70984 -33323 10081 22584 53457 26156 28553 26136 -5060
6137e060J8187L7393J4211k2035j8884K5013J0040J1838j5882k9584K124n903
$$ -5060 13127 50520 64731 42696 23812 48825 58865 70703 54821 25237 27361 21458
6125B1458J9695K9607j738o6825o2812M2984N2075K1507k5164M8799q181l4425
$$ 21458 41153 70760 69022 2197 -60615 -17631 34444 55951 30787 79586 71405 36980
6113C6980j6498m0699m0438L4154J1903M780r5634J4577Q4649K6232M4255j3300
$$ 36980 20482 -20217 -60655 -26501 -14598 -9818 -105452 -90875 -6226 20006 64261 50961
6101E0961l9852O024M0087o6279k0622K1765j1033l3658K2314k397L4225o536
$$ 50961 11109 17133 57220 -9059 -29681 -7916 -18949 -52607 -30293 -32690 1535 -5001
6089e001L6133K4452q3192m8587L0042J5664j4424L5467J3941j7669M6010r68
$$ -5001 31132 55584 -27608 -76195 -46153 -30489 -44913 -9446 4495 -13174 32836 31868
6077C1868J4238j9532k7230k7480J9211M774O875j8255j5244O7234L7993j3946
$$ 31868 46106 26574 -656 -28136 -8925 -4151 2724 -15531 -30775 36459 74452 60506
6065F0506l9896k1319p70r936J5010q000l9656J0977j4111j3084m688o5638m588
$$ 60506 20610 -709 -1479 -11415 3595 -4405 -44061 -33084 -47195 -60279 -64967 -130605 -135193
6052a35193O5007J1253L1345k0897Q863J2315N9400N2880K5554q602n2557j3828
$$ -135193 -70186 -58933 -27588 -48485 -39622 -27307 32093 84973 110527 101925 49368 35540
6040C5540m0203l6122L6732k6700P0135l128m7982N569L2532q914J2351o06j2459
$$ 35540 -4663 -40785 -4053 -30753 39382 36254 -11728 -6159 26373 17459 29810 29204 16745
6027A6745j0116J7009l062J1981m8512l339L366J5193P4393R296q6554l5920K708
$$ 16745 6629 23638 20576 32557 -15955 -19294 -15928 -735 73658 82954 -3600 -39520 -36812
6014c6812L7374K3082L5040p0231l6251j5186J0159L4030K8234j0878j0788L339
$$ -36812 562 23644 58684 -11547 -47798 -62984 -52825 -18795 9439 -1439 -12227 -8888
6002h888J3579L948k8419n0202K4671n36k2257m329Q554M7115M3274m2188o6813
$$ -8888 4691 8639 -19780 -69982 -45311 -45847 -68104 -72433 -63879 -16764 26510 -15678 -82491
5989h2491k0483J1147N6950n0057p296L8455O4537k7332p824m8843m8487L9789
$$ -82491 -102974 -91827 -34877 -84934 -92230 -53775 10762 -16570 -24394 -73237 -121724 -81935
5977h1935j3253J5485r852J3786j548N2084J7929m9942K9365P2343k3950n118
$$ -81935 -95188 -79703 -89555 -75769 -77317 -25233 -7304 -57246 -27881 44462 20512 15394
5965A5394p081k2316J3532L2036K2593J8669k9669l4390k7592m476j6340N8702
$$ 15394 8313 -14003 -471 31565 54158 72827 43158 8768 -18824 -23300 -39640 19062
5953A9062P585m5752L5550l5667l7259k185k6860j5440k4517K6272N0525L1908
$$ 19062 26647 -19105 16445 -19222 -56481 -58666 -85526 -100966 -125483 -99211 -48686 -16778
5941a6778K1960l1613k8360L546n9267k8249L2059J8384L6505K1928m1170M1367
$$ -16778 5182 -26431 -54791 -51245 -110512 -138761 -106702 -88318 -51813 -29885 -71055 -29688
5929b9688P1167j4525r882m3103n675j9596k2892M387M5565L4194J4989J547K5848
$$ -29688 41479 26954 17072 -26031 -31706 -51302 -74194 -69807 -24242 9952 24941 26488 52336
5916E2336j9108l9441M449L4873J0714j5112p425n1561p3358L1689K0055N244
$$ 52336 33228 -6213 -1764 33109 43823 28711 21286 -30275 -103633 -71944 -51889 -46645
5904d6645j6603n7787o354L9657K0318j3491M5628M280P0542J340N461j1837k9158
$$ -46645 -63248 -121035 -127389 -87732 -67414 -80905 -35277 -30997 39545 40885 46346 34509 5351
5891E351k9789R376O1861Q5931l8229m1638J5783n774m2501L2462j0962j9188
$$ 5351 -24438 -15062 46799 132730 94501 52863 68646 62872 20371 52833 41871 22683
5879B2683l7808K8352O1811k7984o9436l668j568J7965j2660n4353m2809J1765
$$ 22683 -15125 13227 75038 47054 -22382 -26050 -27618 -9653 -22313 -76666 -119475 -107710
5867a07710O4790K6170l2522L1780L5408L7515J0210k8848L180L9492O6152r522
$$ -107710 -42920 -16750 -49272 -17492 17916 55431 65641 36793 39973 79465 145617 136095
5855A36095o1028p6376L0500K5790n1050j1937L4921j3361K802M4141q8710l3850
$$ 136095 75067 -1309 29191 54981 3931 -8006 26915 13554 16356 60497 -28213 -62063
5843f2063j5592Q669K8129L6678N3853o4785m5238M6514K4488N8252L0221o1355
$$ -62063 -77655 -68986 -40857 -4179 49674 -15111 -60349 -13835 10653 68905 99126 37771
5831C7771k9896L9578K57J3325p451K7944r375j6414l453J2436K4654q180k5765
$$ 37771 7875 47453 47710 61035 53584 81528 72153 55739 52286 64722 89376 81196 55431
5818E5431O696k5050m8567N301R4417L2875o4389l8897j4745l435j8739M11n227
$$ 55431 62127 37077 -11490 -6189 88228 121103 56714 17817 3072 -363 -19102 -18691 -23918
5805b3918j4295J9619N0996P5543o33p3472l8638k800J0129J3766J6913K3825
$$ -23918 -38213 -18594 32402 107945 107312 33840 -4798 -7598 2531 16297 33210 57035
5793E7035m2656l4013N6335L1733n9522p7518n4636M1321M8870J0261K8246M5419
$$ 57035 14379 -19634 36701 68434 8912 -68606 -123242 -81921 -33051 -22790 5456 50875
5781E0875o3407l6144K4335J0721m0147l784L2795K0416m903Q140l585J9242M7419
$$ 50875 -12532 -48676 -24341 -13620 -53767 -57551 -24756 -4340 -9243 -1103 -4688 14554 61973
5768F1973j7769l5104K914o777m6689K7178Q2052J541p3501n1637l4844J2676
$$ 61973 44204 9100 12014 5237 -41452 -14274 67778 69319 -4182 -55819 -90663 -77987
5756g7987p240Q3457M0705j1799l5839o3433o739M6765j6309j3386M9021L510
$$ -77987 -85227 -1770 38935 27136 -8703 -72136 -78875 -32110 -48419 -61805 -12784 -9274
5744i274l0610L88J7100j7046m0038L1684N4506m1768p8587m5038K1783N9778
$$ -9274 -39884 -39496 -22396 -39442 -79480 -47796 6710 -35058 -113645 -158683 -136900 -77122
5732g7122k1548k0975L2316M1224j5636k7279J795k9616N3846N4847l7195k8467
$$ -77122 -98670 -119645 -87329 -46105 -61741 -89020 -87225 -116841 -62995 -8148 -45343 -73810
5720g3810j1095r074J3906R997P8333Q013m0075o2204M2015N5307o746k5511J8249
$$ -73810 -84905 -93979 -80073 -70076 8257 16270 -23805 -86009 -43994 11313 4567 -20944 -2695
5707b695J9312m0937J9351p228N2747N983n4351p115J7734O0425J6458p5430n6163
$$ -2695 16617 -24320 -4969 -12197 40550 46533 -7818 -14933 2801 63226 79684 4254 -51909
5694e1909J6172N4885M7467j56l6914k5503J5561N5361K6689k4334N234J3250
$$ -51909 -35737 19148 66615 66459 29545 4042 19603 74964 101653 77319 82553 95803
5682I5803m7015r7725J62L5146Q652L0676J4020m7597n96J6128l0369n7415L238
$$ 95803 48788 -48937 -48775 -13629 -4977 25699 39719 -7878 -8474 7654 -22715 -80130 -76892
5669g6892M4170N4826J8211L2952m5863l7223j0021Q131j2023k1645j3175M9673
$$ -76892 -32722 22104 40315 73267 27404 -9819 -19840 -11709 -23732 -45377 -58552 -8879
5657h879R157O503j8594N963P577k4945L2731L8435K3101J2232J2156o5983p9534
$$ -8879 278 6781 -11813 -5850 1727 -23218 9513 47948 71049 83281 95437 29454 -50080
5644e0080k8768M8430r154J8529R108J4311L2826o3090k5214O83m438k3071K467
$$ -50080 -78848 -30418 -39572 -21043 -11935 2376 35202 -27888 -53102 -52419 -56857 -79928 -77461
5631g7461P4957L4686m3960l8964n3876j9271L4117L7529L1875O4540j9382K442
$$ -77461 -2504 32182 -11778 -50742 -104618 -123889 -89772 -52243 -20368 44172 24790 27232
5619B7232p24K9214p699r9066m3347M6257L7645R6916R562l5574R09j2875j5976
$$ 27232 26508 55722 48023 -51043 -94390 -48133 -10488 86428 95990 60416 61325 48450 32474
5606C2474m0385j729r231J1859L4394j5753k9479k4570L1378M0821l6692m3248
$$ 32474 -7911 -9640 -18871 -7012 27382 11629 -17850 -42420 -11042 29779 -6913 -50161
5594e0161N7808N4891J5125j8688M2099K6475q7911j03226k5828M3726J2518Q043
$$ -50161 7647 62538 77663 58975 101074 127549 39638 -63588 -89416 -45690 -33172 -25129
5582b5129k982j224J8787M5699K3880o2514J6652M2001j2306l8847n910M3416
$$ -25129 -28111 -29335 -10548 35151 59031 -3483 13169 55170 42864 4017 -1893 41523
5570D1523j573l2163l1904n2918m5904M0561l3905k7008L362J5217N148J06521
$$ 41523 39950 7787 -24117 -77035 -122939 -82378 -116283 -143291 -139929 -124712 -119564 -13043
5558a3043L4188l1216K909N3899Q4918m0795J3415j0112o4021O084J1457k5431
$$ -13043 21145 -10071 -7162 46737 131655 90860 104275 94163 30142 36226 47683 22252
5546B2252j4718K7174q31K0559l0702j0752N1763J6723m9759n0556o8859J1694
$$ 22252 7534 34708 33877 54436 23734 12982 64745 81468 31709 -18847 -87706 -76012
5534g6012P7617O59l538l2991J8433K0050r460j3204K0331N1042n2778J3348O4707
$$ -76012 1605 2264 -1274 -34265 -15832 4218 -5242 -18446 1885 52927 149 13497 78204
5521G8204J2907o0699q7759M4524M9844k5770K0175j1876L4497L3648p5933m5390
$$ 78204 91111 30412 -57347 -12823 37021 11251 31426 19550 54047 87695 11762 -33628
5509c3628N3622l7112l7661J4309L5619J4605j1836l679m7381j739L4479L5535
$$ -33628 19994 -17118 -54779 -40470 -4851 9754 -2082 -5761 -53142 -54881 -20402 15133
5497A5133K8281Q505m4666K9007j2718K0705J096l4757j03371l5298O3307O2732
$$ 15133 43414 51919 7253 36260 23542 44247 45343 10586 -92785 -128083 -64776 -2044
5485b044L1256M1781n0748l0859M6183j0342j2923K9370J4731n7008m6148j3473
$$ -2044 29212 70993 20245 -10614 35569 25227 12304 41674 56405 -603 -46751 -60224
5473f0224K7131M099l0080j3114J1990J0564l724n1728m0608o726N0466N0515
$$ -60224 -33093 -28994 -59074 -72188 -60198 -49634 -53358 -105086 -145694 -152420 -101954 -51439
5461e1439L7945L8725j752l3018J201J2268P7572M253j00103J6435Q6002J4701
$$ -51439 -13494 25231 23479 -9539 -8338 3930 81502 85755 -14348 2087 88089 102790
5449A02790j03467l0120J0662k804n273k6419L7271P0404j0420p254o7539n7409
$$ 102790 -677 -30797 -20135 -22939 -28212 -54631 -17360 53044 42624 35370 -32169 -89578
5437h9578M4339k6264P889k8818P6547r638o5542k231N5314l7175l450K8736l3132
$$ -89578 -45239 -71503 -63614 -92432 -15885 -25523 -91065 -93296 -37982 -75157 -78607 -49871 -83003
5424h3003k0517O1295K6131L4937J4618o7097Q891J5898j8451n7758p1551L7014
$$ -83003 -103520 -42225 -16094 18843 33461 -33636 -24745 -8847 -27298 -85056 -156607 -119593
5412a19593M6185R349M6464l096j3211o6117j9120L7543Q4098L3562k6901k3774
$$ -119593 -73408 -64059 -17595 -20691 -33902 -100019 -119139 -81596 2502 36064 9163 -14611
5400a4611j9514o938j6368J0354J5887K2845J1444k7863j6169j3982M4023K3611
$$ -14611 -34125 -41063 -57431 -47077 -31190 -8345 3099 -24764 -40933 -54915 -10892 12719
5388A2719m8529o2554J1453L0993k311M2526M0363l0048j0864L3572k6330m561
$$ 12719 -35810 -98364 -86911 -55918 -58229 -15703 24660 -5388 -16252 17320 -9010 -13571
5376a3571K5471L2793k1022l2833m1692m95r458L7646L4294l2095K166Q5756L684
$$ -13571 11900 44693 23671 -9162 -50854 -51349 -60807 -23161 11133 -20962 -18796 66960 70644
5363G0644n0381k6580k9731m1230k4697O6805p319l5667J7967M5482K5329P4253
$$ 70644 20263 -6317 -36048 -77278 -101975 -35170 -42489 -78156 -60189 -14707 10622 84875
5351H4875m4450l7666n4737l6085K363K0126L7694J9908j4160l931J5897K0021
$$ 84875 40425 2759 -51978 -88063 -85700 -65574 -27880 -7972 -22132 -26063 -10166 9855
5339I855l7198k3038M8598J0229l2714k5714M8260K9487m8224k9711l5043O770
$$ 9855 -27343 -50381 -1783 8446 -24268 -49982 -1722 27765 -20459 -50170 -85213 -78443
5327g8443O0065j0027N5935k5723p0678r861K9227P635k8342N9592M0241N0499
$$ -78443 -18378 -28405 27530 1807 -68871 -78732 -49505 -41870 -70212 -10620 29621 80120
5315H0120l5862j01260J0608M2735L8156k2829j9549m2471m853j1068M319L0644
$$ 80120 44258 -57002 -46394 -3659 34497 11668 -7881 -50352 -55205 -66273 -61954 -31310
5303c1310N1494K1304j0659j977n5611J9547J4682N5413l3526o7798p73l1832
$$ -31310 20184 41488 30829 28852 -26759 -7212 7470 62883 29357 -38441 -39214 -71046
5291g1046j490K3126p281m0718n2029k393O5888O2069M5185k9402K0505k6831
$$ -71046 -72536 -49410 -56691 -97409 -149438 -151831 -85943 -23874 21311 -8091 12414 -14417
5279a4417n3425L308r592k452J3653J1487J07637M2952k6449J1377K1107k6228
$$ -14417 -67842 -64534 -74126 -76578 -62925 -51438 56199 99151 72702 84079 105186 78958
5267G8958l8198K4417m6820k9739O2793J6214J8339j0251j7314k0614R362J0834
$$ 78958 40760 65177 18357 -11382 51411 67625 85964 75713 58399 37785 47147 57981
5255E7981k1054m7934l0206K7467m107q7617p9219M27N0616N4041J1856K6739
$$ 57981 36927 -11007 -41213 -13746 -17853 -105470 -184689 -184262 -133646 -79605 -67749 -41010
5243d1010o5406L2074O8367l1427n0796M5931Q7274R230k6935K7286k9857j1233
$$ -41010 -106416 -74342 -5975 -37402 -88198 -42267 45007 54237 27302 54588 24731 13498
5231A3498l4917O3445L275l7110j2190K2326P9306m5617k5122q212j7520n8533
$$ 13498 -21419 42026 45301 8191 -3999 18327 97633 52016 26894 18682 1162 -57371
5219e7371n850L1893J7448n02N2389k68L1951p473l5572L6552Q20l9399o5623
$$ -57371 -63221 -31328 -13880 -14382 38007 37739 69690 62217 26645 63197 64017 24618 -41005
5206d1005k0490L1560M2284l786O193J9300k0841l6878k8629N6841N4274j0223
$$ -41005 -61495 -29935 12349 8563 14756 34056 13215 -23663 -52292 4549 58823 48600
5194D8600j6675r005j9454o32n764j9248o687P7934r3p6007n7663Q7621M6532
$$ 48600 31925 22920 3466 2834 -2930 -22178 -28865 49069 48976 -27031 -84694 2927 49459
5181D9459L6827J4649o9155q8045M2850K7077K2071j6577m540j7561J8560K2432
$$ 49459 86286 100935 31780 -56265 -13415 13662 35733 19156 14616 -2945 15615 38047
5169C8047j5611L0129L7125m3027p5797k8226k4794O4130J2275k6525m0669K5568
$$ 38047 22436 52565 89690 46663 -29134 -57360 -82154 -18024 -5749 -32274 -72943 -47375
5157d7375L7643J5368k945J3161J8419L2895o364n796L3997k3971o8859j3445
$$ -47375 -9732 5636 2691 15852 34271 67166 60802 55006 89003 65032 -3827 -17272
5145a7272L1721N2072J402L6568K382n196L012l4206m1916o966K2744r4324n9456
$$ -17272 14449 66521 67923 104491 106873 101677 104689 70483 28567 21601 44345 -49979 -109435
5132a09435k0464M513J2110k1045J930L3299K2823N4243L4394L6023o5158m0606
$$ -109435 -129899 -125386 -113276 -134321 -132391 -99092 -76269 -22026 12368 48391 -16767 -57373
5120e7373N2630J12454M1514k9670j4568n4422k0379k2950l9842m5369M4493P1855
$$ -57373 -4743 107711 149225 119555 104987 50565 30186 7236 -32606 -77975 -33482 38373
5108C8373Q628o862m1241N991J3426k0216M7724P588L2772K9161J4779p339m9854
$$ 38373 47001 40139 -1102 4889 18315 -1901 45823 53411 86183 115344 130123 122784 72930
5095G2930k4877J1004P3613n566m2386n9978l9737N0496l7131l2609Q909J1675
$$ 72930 48053 59057 132670 127104 84718 24740 -14997 35499 -1632 -34241 -25332 -13657
5083a3657j4372l5347K2837j8522L6359K3306q278j601k0989k4851P4452N6971
$$ -13657 -28029 -63376 -40539 -59061 -22702 604 -7674 -9275 -30264 -55115 19337 76308
5071G6308K7921m6002l9238M2757j0119K4651k9892q6332j0081Q117j2834L2860
$$ 76308 104229 58227 18989 61746 51627 76278 46386 -39946 -50027 -41910 -54744 -21884
5059b1884K5476l4900k175L6145m4944K1098K1864j4195N1678J2737m2256j8412
$$ -21884 3592 -31308 -33483 2662 -42282 -21184 680 -13515 38163 50900 8644 -9768
5047i768r47o2426K525J4373K811K8384j6039j7269l9928M4098J1905K6107n3881
$$ -9768 -10715 -73141 -70616 -56243 -53432 -25048 -41087 -58356 -98284 -54186 -42281 -16174 -70055
5034g0055m4221O3048M0748L5654K2774j9682n6596P353L4719j6550p8008L68
$$ -70055 -114276 -51228 -10480 25174 47948 28266 -28330 -20977 13742 -2808 -80816 -80448
5022h0448J3040Q9854L9014k0007j7141n160j4807J5573l3675K7979m5653j5617
$$ -80448 -67408 22446 61460 41453 24312 19152 4345 19918 -13757 14222 -31431 -47048
5010d7048M9107N5052J9897l6832k3044j1580j9987K4961N6075n361j9165J8078
$$ -47048 2059 57111 77008 40176 17132 5552 -14435 10526 66601 61240 42075 60153
4998F0153j9305J0571m9775k3165L6136J5069j5175m8113k4259n235J781J4198
$$ 60153 40848 51419 1644 -21521 14615 29684 14509 -33604 -57863 -63098 -61317 -47119
4986d7119N8107p9121l9798O2234L9572J3016l989l485N431J6030K9145q0354
$$ -47119 10988 -68133 -107931 -45697 -6125 6891 2902 -583 4848 20878 50023 -30331
4974c0331l7213L592L5373m5797r618J2241O864K9684N8549N2347L8913o8970
$$ -30331 -67544 -63952 -28579 -74376 -83994 -71753 -64889 -35205 23344 75691 114604 45634
4962D5634k0559Q106n2133J6749l5989j5069N8845L2418m7403m5952N9141l0390
$$ 45634 25075 33181 -18952 -2203 -38192 -53261 5584 38002 -9401 -55353 3788 -26602
4950b6602L2657K4898j1023l2579K6599P283R227K2594k8043Q923P7966L7257
$$ -26602 6055 30953 19930 -12649 13950 21233 30460 53054 25011 33934 111900 149157
4938A49157j5694o0956q0484p0888L0236J3713k9414O2589L6180k6323O397m1801
$$ 149157 133463 72507 -7977 -78865 -48629 -34916 -64330 -1741 34439 8116 14513 -27288
4926b7288K0430N5613o6080l53N2002M6626P819K5402q6533k4723N9849o045P717
$$ -27288 -6858 48755 -17325 -17678 34324 80950 88769 114171 27638 2915 62764 56719 64436
4913F4436n04M7069m59m5406m8178p775j0069P394j9010m189N4941j0840J0876
$$ 64436 63932 111001 110542 65136 16958 9183 -886 6508 -12502 -16691 38250 27410 38286
4900C8286L5102K8316N185L349l4569o6451L549n2917K0668M5833K5364k2024
$$ 38286 73388 101704 106889 110238 75669 9218 12767 -40150 -19482 26351 51715 29691
4888B9691l9066Q254M5080O635L621m4225J4012J6318O53n697m1007j08847k4589
$$ 29691 -9375 -1121 43959 50594 54215 9990 24002 40320 40973 35276 -5731 -114578 -139167
4875a39167P107P114M7027J6320J7672J00210K62q6696m6355O5367l4094q831
$$ -139167 -132060 -124946 -77919 -61599 -43927 56283 56545 -30151 -76506 -11139 -45233 -54064
4863e4064K8771L5118M2475m0650n5546K9070L8818j7028m3330n0197l8992p926
$$ -54064 -25293 9825 52300 11650 -43896 -14826 23992 6964 -36366 -86563 -125555 -133481
4851a33481O8241L1217N3395M7988K9068K899j02420k5292p524o467l2681M4466
$$ -133481 -65240 -34023 19372 67360 96428 99327 -3093 -28385 -35909 -42376 -75057 -30591
4839c0591P2907J653J0878l5636k8009N6606J14180l5549q5444l0762J4365o3015
$$ -30591 42316 43969 54847 19211 -8798 47808 161988 126439 40995 10233 24598 -38417
4827c8417l2989O845J5247M2636K3789k9679K7138O16p158K3845L0189N7917r059
$$ -38417 -71406 -64561 -49314 -6678 17111 -12568 14570 15186 8028 31873 62062 119979 110920
4814A10920m6975P65k3406J1099l3724m6530K0257k2294l223J5234J9285M2636
$$ 110920 63945 64710 41304 52403 18679 -27851 -7594 -29888 -33111 -17877 1408 44044
4802D4044r294j855o3283m0112M3548J7187m4545n467O2504M0227o9896l1947
$$ 44044 34750 32895 -30388 -70500 -26952 -9765 -54310 -59777 2727 42954 -26942 -58889
4790e8889J6843k7514l5005M304K5797N8677k5911N02K7402J3580R449M1685K5408
$$ -58889 -42046 -69560 -104565 -100261 -74464 -15787 -41698 -41196 -13794 -214 9235 50920 76328
4777G6328m6224k9454J3582J7105J6682k2885o8782K3898m4260m9478P769L7366
$$ 76328 30104 650 14232 31337 48019 25134 -43648 -19750 -64010 -113488 -105719 -68353
4765f8353m926M1903N5756q424o7221K9775M8618O702l2018k4280J3859O7439
$$ -68353 -73279 -31376 24380 15956 -51265 -21490 27128 33830 1812 -22468 -8609 58830
4753E8830J4840l3863l7950P2160M6066o7600r3928q8459O4937O1778k1734j2278
$$ 58830 73670 39807 1857 74017 120083 52483 -41445 -129904 -64967 -3189 -24923 -37201
4741c7201n4241j82l213n0317K0971L0450N9345N1347J7370l8354J1247p937K0132
$$ -37201 -91442 -91624 -94837 -145154 -124183 -93733 -34388 16959 34329 -4025 7222 -715 19417
4728A9417o1148o4596n653K5155j8481l174J6824j4737l6917N0433K7176M8765
$$ 19417 -41731 -106327 -111980 -86825 -105306 -108480 -91656 -106393 -143310 -92877 -65701 -16936
4716a6936j6590M359K7726K0308l4467j1616N072Q012j9707J419r242m5672k9164
$$ -16936 -33526 -29167 -1441 18867 -15600 -27216 -22144 -14132 -33839 -32420 -41662 -87334 -116498
4703a16498K2096L6695O2582M1911j0638r212m0615k2097k3861L8539N5075j1361
$$ -116498 -94402 -57707 4875 46786 36148 26936 -13679 -35776 -59637 -21098 33977 22616
4691B2616R889Q496k3814j6498k3414R480L29J4489J1257L7356K6837m5635j5909
$$ 22616 32505 41001 17187 689 -22725 -13245 -12916 1573 12830 50186 77023 31388 15479
4678A5479m4687K5933K3932n914n1151M1263K0753P528j7975j5659j2305j7784
$$ 15479 -29208 -3275 20657 14743 -36408 4855 25608 33136 15161 -498 -12803 -30587
$$ [...]
##END NTUPLES=NMR SPECTRUM
##END=
